##TITLE=	27162421.11.fid
##JCAMPDX=	6.0	$$ NMR Plug-in 1.13 of MestReNova 11.0.4-18998
##DATATYPE=	NMRSPECTRUM
##DATACLASS=	NTUPLES
##NUMDIM=	1
##ORIGIN=	Bruker BioSpin GmbH
##OWNER=	nmr
##.OBSERVEFREQUENCY=	128.37760499999998842
##.OBSERVENUCLEUS=	^11B
##.SOLVENTNAME=	CDCl3
##.PULSESEQUENCE=	zgbs
##LONGDATE=	2013/11/27 16:46:00.000
##.ACQUISITIONMODE=	SIMULTANEOUS (DQD)
##$ORIGINALFORMAT=	Bruker XWIN-NMR
##$PARAMETERFILE=	(acqus, ASCII, /var/folders/bp/m_4195y96sx1d256lqvkcvym0000gq/T/lQdOLHMzSaKcUyB5jcdOtg/11/acqus, 0)
$$ ##TITLE= Parameter file, TOPSPIN		Version 3.2
$$ ##JCAMPDX= 5.0
$$ ##DATATYPE= Parameter Values
$$ ##NPOINTS= 11	$$ modification sequence number
$$ ##ORIGIN= Bruker BioSpin GmbH
$$ ##OWNER= nmr
$$ $$ 2013-11-27 16:46:12.506 +0000  nmr@mcwatt
$$ $$ /home/nmr/localdata/27162421/11/acqus
$$ $$ process /opt/topspin3.2_pl3/prog/mod/shimcntl
$$ ##$ACQT0= 1000000
$$ ##$AMP= (0..31)
$$ 100 100 100 100 100 100 100 100 100 100 100 100 100 100 100 100 100 100
$$ 100 100 100 100 100 100 100 100 100 100 100 100 100 100
$$ ##$AMPCOIL= (0..19)
$$ -1 0 0 0 0 0 0 0 0 0 0 0 0 0 0 0 0 0 0 0
$$ ##$ANAVPT= -1
$$ ##$AQSEQ= 0
$$ ##$AQ_mod= 3
$$ ##$AUNM= <au_zg>
$$ ##$AUTOPOS= <15 >
$$ ##$BF1= 128.377605
$$ ##$BF2= 400.13
$$ ##$BF3= 400.13
$$ ##$BF4= 400.13
$$ ##$BF5= 400.13
$$ ##$BF6= 400.13
$$ ##$BF7= 400.13
$$ ##$BF8= 400.13
$$ ##$BYTORDA= 0
$$ ##$CAGPARS= (0..11)
$$ 0 0 0 0 0 0 0 0 0 0 0 0
$$ ##$CFDGTYP= 0
$$ ##$CFRGTYP= 9
$$ ##$CHEMSTR= <none>
$$ ##$CNST= (0..63)
$$ 1 1 1 1 1 1 1 1 1 1 1 1 1 1 1 1 1 1 1 1 1 1 1 1 1 1 1 1 1 1 1 1 1 1 1 1
$$ 1 1 1 1 1 1 1 1 1 1 1 1 1 1 1 1 1 1 1 1 1 1 1 1 1 1 1 1
$$ ##$CPDPRG= (0..8)
$$ <> <> <> <> <> <> <> <> <>
$$ ##$D= (0..63)
$$ 0 0.1 0 0 0 0 0 0 0 0 0 0 0 0 0 0 0.0002 0 0 0 0 0 0 0 0 0 0 0 0 0 0 0
$$ 0 0 0 0 0 0 0 0 0 0 0 0 0 0 0 0 0 0 0 0 0 0 0 0 0 0 0 0 0 0 0 0
$$ ##$DATE= 1385570771
$$ ##$DE= 6.5
$$ ##$DECBNUC= <off>
$$ ##$DECIM= 864
$$ ##$DECNUC= <off>
$$ ##$DECSTAT= 4
$$ ##$DIGMOD= 1
$$ ##$DIGTYP= 12
$$ ##$DQDMODE= 0
$$ ##$DR= 22
$$ ##$DS= 4
$$ ##$DSPFIRM= 0
$$ ##$DSPFVS= 20
$$ ##$DTYPA= 0
$$ ##$EXP= <B11.dur>
$$ ##$F1LIST= <>
$$ ##$F2LIST= <>
$$ ##$F3LIST= <>
$$ ##$FCUCHAN= (0..9)
$$ 0 1 0 0 0 0 0 0 0 0
$$ ##$FL1= 90
$$ ##$FL2= 90
$$ ##$FL3= 90
$$ ##$FL4= 90
$$ ##$FOV= 20
$$ ##$FQ1LIST= <>
$$ ##$FQ2LIST= <>
$$ ##$FQ3LIST= <>
$$ ##$FQ4LIST= <>
$$ ##$FQ5LIST= <>
$$ ##$FQ6LIST= <>
$$ ##$FQ7LIST= <>
$$ ##$FQ8LIST= <>
$$ ##$FRQLO3= 59895.0000000149
$$ ##$FRQLO3N= 2
$$ ##$FS= (0..7)
$$ 83 83 83 83 83 83 83 83
$$ ##$FTLPGN= 0
$$ ##$FW= 125000
$$ ##$FnMODE= 0
$$ ##$FnTYPE= 0
$$ ##$GPNAM= (0..31)
$$ <> <> <> <> <> <> <> <> <> <> <> <> <> <> <> <> <> <> <> <> <> <> <> <>
$$ <> <> <> <> <> <> <> <>
$$ ##$GPX= (0..31)
$$ 0 0 0 0 0 0 0 0 0 0 0 0 0 0 0 0 0 0 0 0 0 0 0 0 0 0 0 0 0 0 0 0
$$ ##$GPY= (0..31)
$$ 0 0 0 0 0 0 0 0 0 0 0 0 0 0 0 0 0 0 0 0 0 0 0 0 0 0 0 0 0 0 0 0
$$ ##$GPZ= (0..31)
$$ 0 0 0 0 0 0 0 0 0 0 0 0 0 0 0 0 0 0 0 0 0 0 0 0 0 0 0 0 0 0 0 0
$$ ##$GRDPROG= <>
$$ ##$GRPDLY= 67.9839477539062
$$ [...]
$$ ##$Sgu1PowerLevels= (0..7)
$$ 90 74 58 42 26 10 0 0
$$ ##$Sgu2PowerLevels= (0..7)
$$ 90 74 58 42 26 10 0 0
$$ ##$Sgu3PowerLevels= (0..7)
$$ 0 0 0 0 0 0 0 0
$$ ##$Sgu4PowerLevels= (0..7)
$$ 0 0 0 0 0 0 0 0
$$ ##$Sgu5PowerLevels= (0..7)
$$ 0 0 0 0 0 0 0 0
$$ ##$Sgu6PowerLevels= (0..7)
$$ 0 0 0 0 0 0 0 0
$$ ##$Sgu7PowerLevels= (0..7)
$$ 0 0 0 0 0 0 0 0
$$ ##$Sgu8PowerLevels= (0..7)
$$ 0 0 0 0 0 0 0 0
$$ ##$SguType= 3
$$ ##$ShimPowMaxUA= (0..63)
$$ 130000 130000 130000 130000 130000 130000 130000 130000 130000 130000 130000
$$ 130000 130000 130000 130000 130000 130000 130000 130000 130000 0 0 0 0
$$ 0 0 0 0 0 0 0 0 0 0 0 0 0 0 0 0 0 0 0 0 0 0 0 0 0 0 0 0 0 0 0 0 0 0 0 0
$$ 0 0 0 0
$$ ##$ShimPowMaxUC= (0..63)
$$ 130000 130000 130000 130000 130000 130000 130000 130000 130000 130000 130000
$$ 130000 130000 130000 130000 130000 130000 130000 130000 130000 0 0 0 0
$$ 0 0 0 0 0 0 0 0 0 0 0 0 0 0 0 0 0 0 0 0 0 0 0 0 0 0 0 0 0 0 0 0 0 0 0 0
$$ 0 0 0 0
$$ ##$ShimPowMaxUG= (0..63)
$$ 524287 524287 524287 524287 524287 524287 524287 524287 524287 524287 524287
$$ 524287 524287 524287 524287 524287 524287 524287 524287 524287 0 0 0 0
$$ 0 0 0 0 0 0 0 0 0 0 0 0 0 0 0 0 0 0 0 0 0 0 0 0 0 0 0 0 0 0 0 0 0 0 0 0
$$ 0 0 0 0
$$ ##$ShimPowRcbType= 3
$$ ##$ShimPowRes= (0..63)
$$ 1e-20 1e-20 1e-20 1e-20 1e-20 1e-20 1e-20 1e-20 1e-20 1e-20 1e-20 1e-20
$$ 1e-20 1e-20 1e-20 1e-20 1e-20 1e-20 1e-20 1e-20 0 0 0 0 0 0 0 0 0 0 0 0
$$ 0 0 0 0 0 0 0 0 0 0 0 0 0 0 0 0 0 0 0 0 0 0 0 0 0 0 0 0 0 0 0 0
$$ ##$ShimPowRng0= (0..63)
$$ 1 1 1 1 1 1 1 1 1 1 1 1 1 1 1 1 1 1 1 1 0 0 0 0 0 0 0 0 0 0 0 0 0 0 0 0
$$ 0 0 0 0 0 0 0 0 0 0 0 0 0 0 0 0 0 0 0 0 0 0 0 0 0 0 0 0
$$ ##$ShimPowRng1= (0..63)
$$ 1 1 1 1 1 1 1 1 1 1 1 1 1 1 1 1 1 1 1 1 0 0 0 0 0 0 0 0 0 0 0 0 0 0 0 0
$$ 0 0 0 0 0 0 0 0 0 0 0 0 0 0 0 0 0 0 0 0 0 0 0 0 0 0 0 0
$$ ##$ShimPowRng2= (0..63)
$$ 1 1 1 1 1 1 1 1 1 1 1 1 1 1 1 1 1 1 1 1 0 0 0 0 0 0 0 0 0 0 0 0 0 0 0 0
$$ 0 0 0 0 0 0 0 0 0 0 0 0 0 0 0 0 0 0 0 0 0 0 0 0 0 0 0 0
$$ ##$ShimPowRng3= (0..63)
$$ 1 1 1 1 1 1 1 1 1 1 1 1 1 1 1 1 1 1 1 1 0 0 0 0 0 0 0 0 0 0 0 0 0 0 0 0
$$ 0 0 0 0 0 0 0 0 0 0 0 0 0 0 0 0 0 0 0 0 0 0 0 0 0 0 0 0
$$ ##$ShimSysFunc= (0..63)
$$ 1 2 3 4 5 7 9 11 15 16 8 10 12 14 6 17 13 18 19 20 0 0 0 0 0 0 0 0 0 0
$$ 0 0 0 0 0 0 0 0 0 0 0 0 0 0 0 0 0 0 0 0 0 0 0 0 0 0 0 0 0 0 0 0 0 0
$$ ##$ShimSysMatrix= 0
$$ ##$ShimSysType= 1
$$ ##$TFXNUM= 0
$$ ##$TRIPLO2= 0
$$ ##$VTU= 2
$$ ##$VTUETH= <149.236.99.20>
$$ ##$VTUTY= <no>
$$ ##$WBREFAM= (0..15)
$$ 129 103.5 100 100 100 100 100 100 100 100 100 100 100 100 100 100
$$ ##$WBREFLM= (0..15)
$$ 0 0 0 0 0 0 0 0 0 0 0 0 0 0 0 0
$$ ##$WBREFPH= (0..15)
$$ 73.26 -75.24 0 0 0 0 0 0 0 0 0 0 0 0 0 0
$$ ##$WBSGU= (0..15)
$$ 0 0 0 0 0 0 0 0 0 0 0 0 0 0 0 0
$$ ##$XFAC= 2
$$ ##END=
$$ 
##$DECIM=	864
##$DSPFVS=	20
##XUNITS=	HZ
##YUNITS=	ARBITRARY UNITS
##FIRSTX=	11574.074261406398364
##LASTX=	-11568.422483385218584
##XFACTOR=	-5.6514033564814694088
##YFACTOR=	4.7583761718750000515e-05
##NPOINTS=	4096
##XYDATA=	(X++(Y..Y))
-2048G554594r23963n46032R99260k242910J743004j000340J506020j029352P35174p90173
-2038F005282J119602J989483r67146l73033O25984o01979J86204J054948k651037L64593
-2028F752901L26298J688212l56988J73170J099547k365921L404329K84760m028507K894080
-2018I871881n63570k32179L0652J810096O48665o61015M31851k453987M305911j401378j806612
-2007I980315J532410l54814r82587m2076J067531N14041J736716k562339M396717k716428
-1997A2569486k667971N30038J660705J972810q21101k020614j597277K11357p76444N153616
-1987A4214605j482461k24641R44479J098526l532885J123567o15129K63132R82941O44106
-1977A3416240O87516k983744l6748j03049J182600r83388L200551j087726o86584L92607
$$ plain form
-2048 7554594 6630631 6084599 7083859 4840949 6583953 5583613 7089633 6060281 6795455 6005282
-2038 6005282 7124884 9114367 8147221 7774188 8400172 7798193 7984397 9039345 6388308 6752901
-2028 6752901 7079199 8767411 8410423 8583593 9683140 7317219 10721548 11006308 6977801 9871881
-2018 9871881 9308311 9076132 9106784 10916880 11565545 10904530 11336381 8882394 13188305 11786927 9980315
-2007 9980315 11512725 11157911 10175324 10133248 11200779 11714820 13451536 10889197 15285914 12569486
-1997 12569486 9901515 10431553 12092258 14065068 13243967 11223353 9626076 9837433 9060989 14214605
-1987 14214605 12732144 12507503 13451982 14550508 11017623 12141190 11526061 11789193 12772134 13416240
-1977 13416240 14103756 11120012 11083264 10980215 12162815 11179427 14379978 13292252 12605668 12998275
-1967A2998275j66932p03616J52473n5174r10106J232707j251099J524563k3970j231579j947049
-1956I618493J357033M273392m778592J031068K13151J968828J327982l336748J036907K37722
-1946A2949236n78069K14602j95328R76963j568955L65584k63511n1789j612410J01069L105086
-1935A3442478j336965K035673l994645L414665m422729K192485J145214j714350K563632
-1926A3325458j531638J065386P82573o26002o75829P9162j446292K385972P30935j503777
-1916A2585948j828571J771688k408792J146675J720074o14557n13268p5j545653L317588
-1906A3631057k666976M13399N68663k08280K025146j149230l84302J90018n21263k460466
-1896I437766L077837J653637j306924O13038m69747j943771L688824l568985K70301J343222
$$ plain form
-1967 12998275 12831343 12127727 12280200 12225026 11314920 12547627 11296528 12821091 12797121 11565542 9618493
-1956 9618493 10975526 15248918 10470326 11501394 11714545 13683373 15011355 11674607 12711514 12949236
-1946 12949236 12371167 12585769 12390441 13367404 11798449 12164033 11900522 11848733 10236323 10337392 13442478
-1935 13442478 12105513 14141186 10146541 13561206 9138477 11330962 12476176 10761826 13325458
-1926 13325458 11793820 12859206 13641779 13015777 12339948 12419110 10972818 13358790 14089725 12585948
-1916 12585948 10757377 12529065 10120273 11266948 12987022 12372465 11859197 11859122 10313469 13631057
-1906 13631057 10964081 11377480 11946143 11737863 13763009 12613779 12229477 12419495 11898232 9437766
-1896 9437766 12515603 14169240 12862316 13475354 13005607 11061836 14750660 11181675 11451976 12795198
-1886A2795198J95472k989632J658861L87338J33369O99397J383392j565416m040104M255004
-1876A2912879p39386j20117m00543J113287L55077p44659J477976j757948O926J341029j209220
-1865A2235301J953150l036708J629328J22470R91680k335824Q94456N68361m9131J354227
-1855A4327310l433537N029556k430557j40139R02779j243074o36310J5808o41529k123054
-1845I627253L941040L436921l915614p91728K355548k499304l81536k173412L941625J233544
-1835A4774337k855755q87283k68470M853053k786254q62150k22766R06340l86611q37613
-1825A1426828k54032K27931J769223L7747l328456M472052J628129n384545J731337J672130
-1815A3998344j009798r73156K76585R2869J180098m401567M537830p14773k093689O33947
$$ plain form
-1886 12795198 12990670 10001038 11659899 12047237 12180606 12880003 14263395 12697979 8657875 12912879
-1876 12912879 12173493 12053376 11652833 12766120 13121197 12376538 13854514 12096566 12103492 13444521 12235301
-1865 12235301 14188451 11151743 12781071 12903541 13895221 11559397 12453853 13022214 12973083 14327310
-1855 14327310 10893773 15923329 13492772 13352633 14255412 13012338 12376028 12391836 11750307 9627253
-1845 9627253 13568293 17005214 13089600 12297872 14653420 12154116 11772580 9599168 13540793 14774337
-1835 14774337 11918582 11031299 10762829 15615882 12829628 11967478 11744712 12651052 12264441 11426828
-1825 11426828 11172796 11400727 13169950 13207697 9879241 14351293 15979422 10594877 12326214 13998344
-1815 13998344 12988546 12015390 12291975 12384844 13564942 9163375 13701205 12986432 10892743 11526690
-1805A1526690J351185k67188j030280J850314k133371J204349j698019L35593J836214N80972
-1795A3556459P17220k332751K496j098734J691563J45613j341236o89238J777732K508684
-1785A4937808m108119M136455m555775K526879o24791j051669L004100p72982Q10308n823233
-1775H478981J126642J573113J749232Q30205n14050J414008k428155p8005P15489n34974
-1765A2332486J015815q11100M437978l015505l260477M95833m96428p35130J436461M15254
-1755A1815187k756472K979880J926880k233758j226316J490016m71179j015422J533975o95243
-1745A1347548M300617k249097k361564L070139j626515O92785l231804K188101R5341j266946
-1735A0958605J097114N88193j702026k8940J354680K32794L65907k37290R36606o94744k163880
$$ plain form
-1805 11526690 12877875 12610687 11580407 13430721 11297350 12501699 10803680 11139273 12975487 13556459
-1795 13556459 14273679 11940928 11943424 10844690 12536253 12681866 11340630 10651392 12429124 14937808
-1785 14937808 10829689 14966144 10410369 12937248 12312457 11260788 14264888 13491906 14302214 8478981
-1775 8478981 9605623 11178736 12927968 13758173 13244123 14658131 12229976 12151971 12867460 12332486
-1765 12332486 13348301 12537201 16975179 13959674 10699197 11195030 10698602 9963472 11399933 11815187
-1755 11815187 9058715 12038595 13965475 11731717 10505401 11995417 11524238 10508816 12042791 11347548
-1745 11347548 15648165 13399068 11037504 14107643 12481128 13173913 9942109 12130210 12225551 10958605
-1735 10958605 12055719 12643912 10941886 10912946 12267626 12500420 12866327 12629037 13565643 12870899 10707019
-1724A0707019K374100J191408l236377K550135j283529L68323n2161j520382J550772j265661
-1714A1383647P33133j52245J176262m48447k639582L155647m26966j063672J374849j584248
-1704A1508378l28640J038720K34044p21670j094489J455849R0870o44782O76116J16596J86402
-1693A2517394J140672P6641k644049r39303Q82148J490543J870475K57979j628184k221634
-1683A0802682k07160L04346J950651M13628P8666j580704n78623J889127j094591M839604
-1673A6817626k000001k928314K256791r2051j965708J964229j660234k385445L061759j642267
-1663A1426385J273422j7234Q96288O47746k153559j07474K848996m43076k601501m64940
-1653A1305053k09535J246011l278693J030745M273295l458767K151517Q99878j302563R90317
$$ plain form
-1724 10707019 13081119 14272527 11036150 13586285 12302756 12671079 12618918 11098536 12649308 11383647
-1714 11383647 12116780 11964535 13140797 12692350 10052768 13208415 12781449 11717777 13092626 11508378
-1704 11508378 11179738 12218458 12452502 11730832 10636343 12092192 12183062 11538280 12214396 12330992 12517394
-1693 12517394 13658066 13734707 11090658 10151355 11033503 12524046 14394521 14652500 13024316 10802682
-1683 10802682 10595522 10899868 12850519 13264147 13342813 11762109 11183486 13072613 11978022 16817626
-1673 16817626 14817625 11889311 14146102 14054051 12088343 14052572 12392338 10006893 13068652 11426385
-1663 11426385 12699807 12682573 13578861 14226607 12073048 11965574 14814570 14371494 11769993 11305053
-1653 11305053 11095518 12341529 9062836 10093581 14366876 10908109 13059626 13959504 12656941 13647258
-1643A3647258l508605L355700k82090j555357N06523Q67041L71947m0468l001728o56218
-1633I704003M861583j531755n0425n19662K600804k805966N3946P31471R70155P49916j022567
-1622A3741503P82357q31494k430027K309949K69938m93636J550972k332735n1456k041068
-1612A0474303L704432k846327J323140j492145K145302K253829j976807P61430K35899N78865
-1602A5161921p87548j571953J820909q95579j858226j644644K819211K792425l610855L794876
-1592A6020537m168477P57332J12743P05419J167889j084864R26859K39398l061968J044228
-1582A2659096j316946J215192J875779j197556l26577K807200k039754j061833P96793q2159
-1572A3329235L17710j515052K970834j338188n61311j981755N445700n333786j38861J165415
$$ plain form
-1643 13647258 10138653 13494353 13212263 11656906 12163429 13030470 13402417 13361949 10360221 9704003
-1633 9704003 14565586 13033831 12983406 12463744 15064548 12258582 12312528 13043999 14014154 14764070 13741503
-1622 13741503 14523860 13692366 11262339 13572288 13842226 13348590 14899562 12566827 12515371 10474303
-1612 10474303 14178735 11332408 12655548 11163403 13308705 15562534 13585727 14347157 14583056 15161921
-1602 15161921 14374373 12802420 14623329 13727750 11869524 10224880 13044091 15836516 12225661 16020537
-1592 16020537 11852060 12609392 12722135 13427554 14595443 13510579 14437438 14676836 11614868 12659096
-1582 12659096 11342150 12557342 14433121 13235565 12908988 15716188 13676434 12614601 13411394 13329235
-1572 13329235 13646945 12131893 15102727 13764539 13203228 11221473 16667173 11333387 11194526 12359941
-1562A2359941k92724K065416M46519k596487q74868L289277l148170J857536K778217l734944
-1552A2149713J24285p7540L794432j380306p93069P30584l468464K751760l508614N324589
-1542A5647370j614128m97623M43555k409616j255989K268714o10008J132333k53204J640026
-1532A4491430J226502j274454j81746M22785L35330l819889M727983k580095j545853K277263
-1522A4079256l36305k861905O56181L901957k117944k414603L873109m77882j257677N16094
-1512A3560281p79546l11176Q70913q74508J564807K17052k393413k73286J905628k225694
-1502A1261058M179191L0796k583915J622037l870218L574688J155585J927965k810348j621364
-1492A2865475J674771j646119j647208l13788L984113J254518k081460J349954l332670q61023
$$ plain form
-1562 12359941 12067217 14132633 14579152 11982665 11107797 14397074 11248904 13106440 15884657 12149713
-1552 12149713 12273998 12196458 15990890 14610584 13817515 14548099 11079635 13831395 10322781 15647370
-1542 15647370 14033242 13535619 13979174 11569558 10313569 12582283 11972275 13104608 12851404 14491430
-1532 14491430 15717932 14443478 14261732 14684517 15019847 11199958 15927941 13347846 11801993 14079256
-1522 14079256 13742951 10881046 11537227 15439184 13321240 10906637 14779746 14301864 13044187 13560281
-1512 13560281 12780735 12469559 13340472 12465964 14030771 14247823 11854410 11581124 13486752 11261058
-1502 11261058 15440249 15471045 12887130 14509167 10638949 14213637 15369222 17297187 14486839 12865475
-1492 12865475 14540246 12894127 11246919 10933131 14917244 16171762 14090302 15440256 12107586 11246563
-1482A1246563M650728p68364k246691O17772L96322o55111J942339o16001J145831j769173
-1472A3944215R11915J213003m938826L609500j633731N73090m76019R95659K1651j0011L026088
-1461A7236534o96502k892424j156751m37463k78695L278927J112961p31069k932044K679470
-1451A5182944k838820L782223k159350K945002j064509m65928J787437k081129r62173J013747
-1441A5139444K135038k377267L57426J183064L60345k032018j708024k295066L743280j454777
-1431A3051445K373760m880125O241513j603110k040507J617731l51487O89468j085420M372695
-1421A8385963k577368L001395k097297j691347p30490q37378J863113j06448N32453k327281
-1411A3415315J590915k56404J057492j833445k385722M641562Q77023l26157k318002K686999
$$ plain form
-1482 11246563 15897291 15128927 12882236 13500008 13896330 13241219 15183558 14567557 15713388 13944215
-1472 13944215 14856130 16069133 11130307 14739807 13106076 13679166 13203147 14198806 14220457 14210446 17236534
-1461 17236534 16540032 13647608 12490857 12053394 11774699 15053626 16166587 15435518 12503474 15182944
-1451 15182944 12344124 16126347 13966997 16911999 15847490 15381562 17168999 15087870 14125697 15139444
-1441 15139444 17274482 14897215 15254641 16437705 16798050 14766032 13058008 10762942 14506222 13051445
-1431 13051445 15425205 10545080 16786593 15183483 13142976 14760707 14409220 15098688 14013268 18385963
-1421 18385963 15808595 18809990 16712693 15021346 14290856 13453478 15316591 15210143 15742596 13415315
-1411 13415315 15006230 14749826 15807318 13973873 11588151 16229713 17106736 16780579 14462577 17149576
-1401A7149576m164412L829197J260991r42268K07054p57726k739222J938900N91698o09034
-1391A5764754o74702m04573K479369k058950J606760J400052K01425k814617J697383j399473
-1381A5797428J056448k504233J116086P08741K6667j790851K523706k05692l770098M263723
-1371A7221925K403204k448207q70093Q85410j428090J406747L209785k840173j099135j064238
-1361A5377135J965446J551424l679570Q45903J897362N85373r52565J764639l245227L818703
-1351A9928623l318607M7062k20312K157785K09092k398766K188676l112843J562375J041611
-1341A8084696q99506J793583J088477k602740N46950J075849j530428p23069p75174P61044
-1331A6819682J422930k95158j691314M41140M397948k792540j088034J79502J887459r60504
$$ plain form
-1401 17149576 12985164 16814361 18075352 17133084 17340138 16582412 13843190 15782090 16373788 15764754
-1391 15764754 15090052 14685479 17164848 15105898 16712658 18112710 18314135 15499518 17196901 15797428
-1381 15797428 16853876 14349643 15465729 16174470 16201137 14410286 16933992 16728300 12958202 17221925
-1371 17221925 19625129 17176922 16306829 17192239 15764149 17170896 20380681 17540508 16441373 15377135
-1361 15377135 17342581 18894005 15214435 16060338 17957700 18543073 17590508 19355147 16109920 19928623
-1351 19928623 16610016 16657078 16436766 18594551 18803643 16404877 18593553 15480710 17043085 18084696
-1341 18084696 17185190 18978773 20067250 17464510 18011460 19087309 17556881 16833812 16058638 16819682
-1331 16819682 18242612 17947454 16256140 16697280 21095228 18302688 17214654 17394156 19281615 18321111
-1321A8321111N85467P27300j209526j686419J642985M36251J657107k837625M04667k36633
-1311A7804685j43719L660553l873965J364872j258242K163356O32283K9987L38831j310752
-1301A9407889j456287M55292p98398J065434M84928L87610j80732J781257r5854k41582J322503
-1290B2132060k842004K353854J92311k852493K760683j11742q84035K35969J884701j678865
-1280B1190439j735720o19961K280905K572255m573554K974239O48689k036991P38181p06969
-1270B0731513j221511J365440k189812M055318k978948J653295J554002O7703k052339l39800
-1260B0644861N141877l524015j56034m40016J563366M86404L97728r79489K291279j662013
-1250B3763948P46438j602448J470795j689768j764963K679454k066974N395448q46151j072687
$$ plain form
-1321 18321111 18906578 19633878 18424352 16737933 18380918 18817169 20474276 17636651 18041318 17804685
-1311 17804685 17660966 21321519 17447554 18812426 17554184 19717540 20349823 20379810 20718641 19407889
-1301 19407889 17951602 18406894 17608496 18673930 19158858 19546468 19365736 21146993 21051139 20809557 22132060
-1290 22132060 19290056 21643910 21836221 18983728 21744411 21632669 20748634 20984603 22869304 21190439
-1280 21190439 19454719 18834758 21115663 23687918 19114364 22088603 22737292 20700301 21438482 20731513
-1270 20731513 19510002 20875442 18685630 22740948 19762000 21415295 22969297 23037000 20984661 20644861
-1260 20644861 25786738 22262723 22106689 21666673 23230039 23716443 24114171 23134682 25425961 23763948
-1250 23763948 24510386 22907938 24378733 22688965 20924002 23603456 21536482 26931930 26085779 25013092
-1240B5013092k501299p51446K621134m60373K396161l397371K662336J502729l666017R09460
-1230B4328406J347808K365455k392463m12454K818642q04774p66733l36444K073082j528947
-1220B6691578j385887k86334J591260K884908k111588K103997k334581P30173m96269K516938
-1210B9904195n01262l074061P83571N48796J474243j547166L031365J539463k462447j464531
-1200B8232166R82912J349760m17056j388069M689692k619758J557407J352080o216523N084889
-1190C2607500M60459J026113k587771L1837L740856k823226L213546l524578J380951L377478
-1180C6903165m060928P8418J475911j06971r95964L915266J785202o826859L847923K797113
-1170C8812276j600657K085921P04188j14426j029057j508545j406922K354183L054823m66345
$$ plain form
-1240 25013092 22511793 21760347 24381481 23921108 26317269 22919898 25582234 27084963 23418946 24328406
-1230 24328406 25676214 28041669 25649206 25236752 28055394 27250620 26483887 26147443 28220525 26691578
-1220 26691578 25305691 25019357 26610617 29495525 27383937 29487934 27153353 27883526 27387257 29904195
-1210 29904195 29402933 26328872 27112443 27661239 29135482 27588316 30619681 32159144 29696697 28232166
-1200 28232166 29215078 30564838 30147782 28759713 33449405 30829647 32387054 33739134 27522611 32607500
-1190 32607500 33067959 34094072 31506301 31538138 35278994 32455768 35669314 32144736 33525687 36903165
-1180 36903165 32842237 32920655 34396566 34289595 33293631 37208897 38994099 32167240 36015163 38812276
-1170 38812276 37211619 39297540 40001728 39887302 38858245 37349700 35942778 38296961 41351784 40885439
-1160D0885439k108976J88091N35874J167198N98385J615397k223310K711897N49847L76942
-1150D4296784j819112o13261K310127K46974j020020K236763K861115j235784q39489M54447
-1140D6878544L371362l446420J213500Q21034J295900O86465N1133J207102L98152k38139
-1130E2238633J047069L38179O41441J168155n23609J321683R45403j722954M376057k68246
-1120E9561811l644827M148893k66220l56582J376987n33609L068166J497606m539246M903309
-1110F5216288K277660l566865J824512L045416j00101L261421j954140J420824M000967j218656
-1100G4207326p16793N49956L321733J35041J924228K95927K15312q24030J640687K871463
-1090H3620850J959553J679784r30452K883874J525271K64685K706976J515779k92955J234736
$$ plain form
-1160 40885439 38776463 38964554 39500428 40667626 41266011 42881408 40658098 43369995 43919842 44296784
-1150 44296784 42477672 41864411 44174538 44421512 43401492 45638255 48499370 47263586 46424097 46878544
-1140 46878544 50249906 46803486 48016986 48838020 50133920 50820385 50871518 52078620 52476772 52238633
-1130 52238633 53285702 53623881 54265322 55433477 54909868 56231551 57176954 55454000 59830057 59561811
-1120 59561811 55916984 60065877 59799657 59443075 60820062 60286453 63354619 64852225 60312979 65216288
-1110 65216288 67493948 63927083 65751595 68797011 68696910 71958331 70004191 71425015 75425982 74207326
-1100 74207326 73490533 74040489 77362222 77497263 79421491 79717418 79932730 79108700 80749387 83620850
-1090 83620850 85580403 87260187 86329735 89213609 90738880 91003565 93710541 95226320 94933365 96168101
-1080I6168101J851751L060475J051836J553428M9892j119706L196923J362923K976536K429299
-1070A12581458M161310O87213m64990N701079L69866q65630O926950j952139M529492J213434
-1060A32888043K375365M924047j546194N468574n78698M609481M933149K279010L11929N777969
-1050A61442675N56677J622878L362912Q004491R9599j322237J0232265K549349L007977K122429
-1040A91679015O120950M444342P010828K341143n75Q881481L011158M524812R202851O96264
-1030B37912269P145726N350761N147174Q790030M507060M476564P118389Q415013L640188
-1021B92503174J1035269P371520R180624J0104797K532540R476238R121292P472965P343178
-1012C66141597J2296368R688958R607401R938560J1144205J1832670P196890J6422561Q933876
$$ plain form
-1080 96168101 98019852 101080327 102132163 103685591 103735483 102615777 105812700 107175623 110152159 112581458
-1070 112581458 116742768 117429981 116964991 122666070 123035936 122170306 129097256 127145117 131674609 132888043
-1060 132888043 135263408 140187455 138641261 144109835 143531137 148140618 153073767 155352777 155664706 161442675
-1050 161442675 161999352 163622230 166985142 174989633 175089232 173766995 183999260 186548609 189556586 191679015
-1040 191679015 197799965 202244307 209255135 211596278 211595703 220477184 223488342 228013154 237216005 237912269
-1030 237912269 245057995 250408756 255555930 264345960 268853020 273329584 280447973 288862986 292503174
-1021 292503174 303538443 310909963 320090587 330195384 332727924 342204162 351325454 358798419 366141597
-1012 366141597 378437965 388126923 397734324 407672884 418817089 430649759 437846649 454269210 463203086
-1003D63203086Q629150J5529113J3625274J1418147J3905536J2304946J1823148J2425745
-995E62864145J2892807J8437881J3887518J1661016J3057648J4870857J4273884J7130606
-987F79076362J5245156J1779557J7346221J7172021J3064380J5762008J2012288J3690906
-979G95148899J7882939J2217436J4930661J3909601J0419619J6598526J5980127R239463
-971I06327271J1707480J4191176R537704P295523J1896949N641860N928690J1759609J724590
-962I86010852O51976P976394M846717N14061j791168j686499k43896p004753k830371n313163
-952I81130150p214334n165891r777413j0689949j0636835q679677j3521880j0632812j1857544
-943H92953815j6565197j2939764j3381666j5578779j3648383j5365667j4479319j5841391
$$ plain form
-1003 463203086 471832236 487361349 500986623 512404770 526310306 538615252 550438400 562864145
-995 562864145 575756952 594194833 608082351 619743367 632801015 647671872 661945756 679076362
-987 679076362 694321518 706101075 723447296 740619317 753683697 769445705 781457993 795148899
-979 795148899 813031838 825249274 840179935 854089536 864509155 881107681 897087808 906327271
-971 906327271 918034751 932225927 941763631 949059154 960956103 966597963 972526653 984286262 986010852
-962 986010852 986662828 994639222 999485939 1000000000 998208832 996522333 996278437 989273684 986443313 981130150
-952 981130150 973915816 968749925 958972512 948282563 937645728 928966051 915444171 904811359 892953815
-943 892953815 876388618 863448854 850067188 834488409 820840026 805474359 790995040 775153649
-935G75153649j7113900j3948512j5595771j4652451j7673604j4902135j1580688j7145793
-927F52540795j6455768j2484482j3627367j2202988j6616422j2139367j1403534j2735683
-919E44875184j1296035j5707334q551040j1664997q585477j2900196j3424887j0455863j0807012
-910D41482343q841810r050118r444078q413002r465586j2081820n942235q167547n369479
-901C64706668j0103975n801242p240563p549967o658920n920255n265058r329744m686781
-892C02150163o142806n603524n844114k253202q069508o212298m222529l949224l907214
-883B55945744o004235l145810o352244k680901l343180p659601k680758l195004n597325
-874B15286686k238631l067309n464356j793384l312107p935021J934007j305428p379319
$$ plain form
-935 775153649 758039749 744091237 728495466 713843015 696169411 681267276 669686588 652540795
-927 652540795 636085027 623600545 609973178 597770190 581153768 569014401 557610867 544875184
-919 544875184 533579149 517871815 509320775 497655778 489070301 476170105 462745218 452289355 441482343
-910 441482343 432640533 423590415 414146337 405733335 396267749 384185929 378243694 370076147 364706668
-901 364706668 354602693 348801451 341560888 334010921 327352001 321431746 316166688 306836944 302150163
-892 302150163 296007357 290403833 284559719 282306517 274237009 268024711 263802182 259852958 255945744
-883 255945744 249941509 246795699 240443455 237762554 234419374 226759773 224079015 220884011 215286686
-874 215286686 213048055 209980746 204516390 202723006 199410899 191475878 193409885 192104457 184725138
-865A84725138L72021m989228O16963l530432l858409l185543k188215Q88616n897075O02854
-855A63556690n858717j597122r26245P38860n598126k810125J061656n453767k194455k27538
-845A40691111j146468m390438q10115J02574k132886l170632O66444j928107J700301k420526
-835A27161258l922134j501002k019588o15516j56427k664370j538724p87838j906260l091311
-825A08958088p76621r51868j433503L18405k371702M66868l133680k33973J89581j620805
-815I9410790k317183j467231J459915m77622j572813k9522j878554k552469J067700j031589
-805I0611422k861761L439802l90471m478975j010851J037644j145144j857410j043939N25117
-795H2825434j343242j083738J396632l535311L470048k088053k888046J526528o6299r5848
$$ plain form
-865 184725138 185097159 180107931 180724894 177194462 173336053 170150510 167962295 168850911 162953836 163556690
-855 163556690 157697973 156100851 155174606 155913466 150315340 147505215 148566871 143113104 140918649 140691111
-845 140691111 139544643 135154205 134344090 134446664 132313778 129143146 129809590 127881483 129581784 127161258
-835 127161258 123239124 121738122 119718534 119103018 118946591 116282221 114743497 113955659 112049399 108958088
-825 108958088 108181467 107229599 105796096 106114501 103742799 104209667 101075987 100842014 101031595 99410790
-815 99410790 97093607 95626376 97086291 96608669 95035856 95006334 93127780 90575311 91643011 90611422
-805 90611422 87749661 91189463 90798992 86320017 85309166 86346810 85201666 83344256 82300317 82825434
-795 82825434 81482192 80398454 81795086 78259775 81729823 79641770 76753724 78280252 78213953 78118105
-785G8118105m356047J570160R69046k668511P21050j672872q08612Q17191K9753r58425o34675
-774G1126163l313190j444487L791089k463429q14774o54531m289N028371o051443j401045
-764F3798435K390085k409074J072697Q18427k424692K98841J528831l926741K649522j237949
-754F2558382J64682n18811m82599J227117j580934k253828K414590j767761j234793J466524
-744E9992569k314982K965151j470669l351122N3247L081685k088930N9542j437643j46616
-734E5342232R03726k01008p95164P42472j500910j247415j437422q00501O20170N21197P9620
-723E2226997K7865K017248p87519Q41k830642L98767n74388K229426j864281j126570K464405
-712E2182149j824333J675253M38849k768648K790274l91107l18712K60499r14286r54022
$$ plain form
-785 78118105 73762058 75332218 76301264 73632753 74353803 72680931 71872319 72689510 72719263 71760838 71126163
-774 71126163 67812973 66368486 70159575 67696146 66881372 66226841 66222552 71250923 65199480 63798435
-764 63798435 66188520 63779446 64852143 65670570 63245878 63544719 65073550 61146809 63796331 62558382
-754 62558382 62723064 62204253 61721654 62948771 61367837 59114009 61528599 59760838 58526045 59992569
-744 59992569 57677587 60642738 59172069 55820947 55874194 58955879 56866949 56926491 55488848 55342232
-734 55342232 56245958 56044950 55249786 55992258 54491348 53243933 51806511 51006010 51626180 52147377 52226997
-723 52226997 52254862 54272110 53484591 53485432 50654790 51053557 50479169 52708595 50844314 49717744 52182149
-712 52182149 50357816 52033069 52471918 49703270 52493544 52102437 51783725 52044224 51129938 50175916
-702E0175916j861536M74872L385170l085790N67636K677484n900137K720223k453701K412712
-692D9112849L09590k000995m9537K067827j524065k91288J730147k983606K634976k723225
-682D6282673J776873J205327k462542P69588O00504j612130j25103K93992K281180J237010
-672E0247372l405195J01348O66649j682241K683846k812264k296064M819138L58845k578917
-662D6102517k487590M769919j748038j881145K396863n80509Q71069R6217j66709q51110
-652D6521484J750691o1800q71546Q04728L70446J51413j102594K453009K75368l531243P002870
-641E3762826o88947r80421J317830l514044K221842J923859j623530R28051K507246q50915
-631E5003797L255521n43388J748946N29350J378844K440505P92210L589517J899713J594110
$$ plain form
-702 50175916 48314380 48789252 52174422 49088632 49656268 52333752 46433615 49153838 46700137 49112849
-692 49112849 49422439 47421444 47371907 49439734 47915669 47624381 49354528 46370922 49005898 46282673
-682 46282673 48059546 49264873 46802331 47571919 48172423 46560293 46435190 46729182 49010362 50247372
-672 50247372 46842177 46943525 47610174 45927933 48611779 45799515 43503451 48322589 48681434 46102517
-662 46102517 43614927 48384846 46636808 44755663 47152526 46572017 47443086 47539303 47372594 46521484
-652 46521484 48272175 48210375 47338829 48143557 48514003 48665416 47562822 50015831 50291199 46759956 53762826
-641 53762826 53073879 52093458 53411288 49897244 52119086 54042945 52419415 53347466 55854712 55003797
-631 55003797 58259318 57715930 59464876 59994226 61373070 63813575 64605785 68195302 70095015 71689125
-621G1689125K705083M617823q87569J048865N811114N695076K920703J172429J489273K157380
-611I8419302P363044j736299K251601N222001j795498P47992j165184N30592k831212l017007
-601A03989332L77459j956541q91623j502316o304015k590539r44572n10879n446348K971210
-591H7191168j49069n158620L81933m082644j710045j486215M39818j300892k698901O57553
-581G2084086k67754k644129Q26k591842J042169k095924j227066J637034k239313o10601
-571F3087486J162301k612406k545988m0621O48595L578024j847744k261601j634109q23107
-561E6710830n09663K36014K655217k210462l56070L2750l665617M96483l06024M42353k787703
-550E0738108o9568K497323k763019m38628K668721k253592J05735R72904l309933J824102
$$ plain form
-621 71689125 74394208 79012031 78124462 79173327 84984441 90679517 93600220 94772649 96261922 98419302
-611 98419302 105782346 104046047 106297648 111519649 109724151 110472143 109306959 109837551 107006339 103989332
-601 103989332 104366791 102410250 101518627 100016311 93712296 91121757 90177185 89666306 84219958 87191168
-591 87191168 87042099 81883479 82265412 78182768 76472723 74986508 75426326 74125434 71426533 72084086
-581 72084086 71816332 69172203 69173029 66581187 67623356 65527432 64300366 65937400 63698087 63087486
-571 63087486 64249787 61637381 59091393 59050772 59699367 63277391 61429647 59168046 57533937 56710830
-561 56710830 56201167 56437181 59092398 56881936 56525866 56558616 52892999 53389482 53083458 53525811 50738108
-550 50738108 50668540 53165863 50402844 49964216 52632937 50379345 50485080 51457984 48148051 49972153
-540D9972153j02579j880489k70729J138155j563089j24283J295223j140382k311954L35511
-530D5347537J168816j56483N0892j453784Q12707k476210J733164J06894j394073K304535
-520D6043995l554653m48285p3759Q61792N07878k241180P4914p65665j83161J596912J070532
-509D2889320M00548j144967k921985P71971p14217o44633J430721l127998K903571k75719
-499C9566612k084862J128387j273623j010610J662863n54232m40943N76731j729083L166423
-489C9007663k851169N10239J559721j887310r805r23169n28170N04936J51470p86481q84714
-478C3863211L347102J947873l198951j472432J5013P41104j7483m35196j406602J432995
-468C4816634p95026O29454j18175j959845J045830J09603J265770j74754j596955N88865
$$ plain form
-540 49972153 49869574 47989085 47718356 48856511 47293422 47169139 48464362 47323980 45012026 45347537
-530 45347537 46516353 46359870 46410762 44956978 45769685 43293475 45026639 45133533 43739460 46043995
-520 46043995 42489342 42041057 41967298 42829090 43336968 41095788 41170702 40405037 40221876 41818788 42889320
-509 42889320 43289868 42144901 39222916 39994887 39280670 38636037 40066758 36938760 39842331 39566612
-499 39566612 37481750 38610137 37336514 36325904 37988767 37434535 36993592 37570323 35841240 39007663
-489 39007663 36156494 36666733 38226454 36339144 36329339 35406170 34878000 35382936 35534406 34747925 33863211
-478 33863211 37210313 39158186 35959235 34486803 34501816 35242920 35225437 34790241 33383639 34816634
-468 34816634 34021608 34651062 34532887 32573042 33618872 33728475 34994245 34819491 33222536 33811401
-458C3811401j732410o87080J306193J306054j163742l407112K304276M001656j310975o82719
-448C3745542P68041m161768K358420Q19500k913743K484720j056348j192655K111355J83260
-438C3146324j680884L43294k867210j525684J522921J053301J598594j358306l9414o81206
-428B9511730J013060j845886k80540K092438M66331j794048m64654K987798l421626L700480
-418C1965083p49280k190501K175571j080094j715568L50695M478436k048882p5079j097578
-408C0012803l3771Q45548M00710j667839r76691J516839L30169l24487k884626J243174j325818
-397B7136011O31861k111958L348431j586324j149300K414431j626206K429362j610583M40758
-387B8316483J088264r41684J130311J683152m371863M184977k019234k354873J956865M05979
$$ plain form
-458 33811401 32078991 31391911 32698104 34004158 32840416 29433304 31737580 35739236 34428261 33745542
-448 33745542 34513583 30351815 32710235 33529735 30615992 33100712 32044364 30851709 32963064 33146324
-438 33146324 31465440 31808734 28941524 27415840 28938761 29992062 31590656 30232350 30192936 29511730
-428 29511730 30524790 28678904 28398364 30490802 30957133 29163085 28698431 31686229 28264603 31965083
-418 31965083 31215803 29025302 31200873 30120779 28405211 28755906 33234342 31185460 31110381 30012803
-408 30012803 29979032 30824580 31225290 29557451 28580760 30097599 30427768 30103281 27218655 28461829 27136011
-397 27136011 27767872 25655914 29004345 27418021 26268721 28683152 27056946 29486308 27875725 28316483
-387 28316483 29404747 28463063 29593374 31276526 26904663 31089640 29070406 26715533 28672398 29078377
-377B9078377j958361J679573K057805m956668K853484j773027K054131j044801L08640L749856
-367C2049009o030227K560075L392398n547611Q85687j096912o5666R52017P81970j000145
-357B6880595n88023J649047n66122J802319k887889J022115J279236J351356l569102j915080
-347B4458452J03413K249967K582766k102445q71531P05841K91760l87l66051j71208J457560
-336B8338137m185406K610921J961144j648183l34687o49941n6569N50381k175302J211910
-326B5622405m5068P67835o80610O99989j29493q28024Q89771m09422P28708j070411K355889
-315B7901569o181967K539577J730991K00310j218039M40873J252682k798437K430782j640351
-305B4657990l21983J315038R53571r7007j244528L24320p26315M02266L58427n49180R39551
$$ plain form
-377 29078377 27120016 28799589 30857394 25900726 28754210 26981183 29035314 27990513 28299153 32049009
-367 32049009 26018782 28578857 31971255 26423644 27309331 26212419 26146753 27098770 27880740 26880595
-357 26880595 26292572 27941619 27375497 29177816 26289927 27312042 28591278 29942634 26373532 24458452
-347 24458452 24561865 26811832 29394598 27292153 26420622 27126463 27418223 27417836 27051785 26880577 28338137
-336 28338137 24152731 26763652 28724796 27076613 26741926 26091985 26035416 26585797 24410495 25622405
-326 25622405 25577337 26345172 25664562 26364551 26235058 25407034 26296805 25887383 26616091 25545680 27901569
-315 27901569 21719602 24259179 25990170 26190480 24972441 25413314 26665996 23867559 26298341 24657990
-305 24657990 24336007 25651045 26604616 26507609 25263081 25587401 24861086 25263352 25621779 25072599 26012150
-294B6012150j884429K794112p03403j395024P08777K5005J235509n18858J329936j487832
-284B6115943M84874J344674j623664k164665j951683M948593l436065n63113Q65115R67937
-274B4987946K068752l020897K585342l692846O56570K093484k081658J684699o63937j70844
-264B4446611Q3236l1477n29702o5471K744584j297021k280313J152899Q51495j552877K347792
-253B5869756k875575l03048O91446K183511K369201l420952j171400O73242k12459J069649
-243B4873371l17475q24844n55129o68589J851497j801028k433034K976647J764662l750864
-233B1115214N118836p63315J932358m094433o86043L156523j457515m86228j451678J071083
-223B3454802j485825K852982J612963k366866K229726k958216j647537K606870m083593N919759
$$ plain form
-294 26012150 24127721 26921833 26218430 24823406 25532183 25557188 26792697 26273839 27603775 26115943
-284 26115943 26600817 27945491 26321827 24157162 22205479 27154072 23718007 23154894 24020009 24987946
-274 24987946 27056698 24035801 26621143 22928297 23584867 25678351 23596693 25281392 24617455 24446611
-264 24446611 24529847 24498370 23968668 23903197 26647781 25350760 23070447 24223346 25074841 23521964 25869756
-253 25869756 22994181 22691133 23382579 25566090 27935291 24514339 23342939 24016181 23803722 24873371
-243 24873371 24555896 23731052 23175923 22507334 24358831 22557803 20124769 23101416 24866078 21115214
-233 21115214 26234050 25470735 27403093 23308660 22622617 25779140 24321625 23835397 22383719 23454802
-223 23454802 21968977 24821959 26434922 24068056 26297782 23339566 21692029 24298899 20215306 26135065
-213B6135065k919238j318458K208177J994391k140628l586274K727584K149794o78512k291285
-203B2280616P4355N56295j35555Q62046J105406L18166m35042l33040o52193P72040l37201
-192B4075893R09357K209390m717506L011448j995817j863244J916475M53988j207324J767551
-182B4560211k29866n45268J186312n11243r27143J031889l145868N68657K620023j240504
-172B3367200K147975j757992J436922m44746q84735m16776p99647O96588J270041l521224
-162B1093606L473731j600205j535383M159035J14475k960343R86547k25369j438132J978796
-152B4046758l92562N91440j613773J315441r382K731132k041571k158773L295722m241633
-142B1522799k243308M831386R61406k0307p72248j482681R05045M70500r37101j290742n32639
$$ plain form
-213 26135065 23215827 21897369 24105546 26099937 23959309 20373035 23100619 25250413 24571901 22280616
-203 22280616 22354971 22911266 22775711 23637757 24743163 25061329 24626287 24293247 23641054 24413094 24075893
-192 24075893 24985250 27194640 22477134 25488582 23492765 21629521 23545996 23999984 22792660 24560211
-182 24560211 24330345 23785077 24971389 24460146 23533003 24564892 21419024 21987681 24607704 23367200
-172 23367200 25515175 23757183 25194105 24749359 23864624 23447848 22648201 23344789 24614830 21093606
-162 21093606 24567337 22967132 21431749 25590784 25705259 22744916 23731463 23506094 22067962 24046758
-152 24046758 23654196 24245636 22631863 23947304 23937922 26669054 24627483 22468710 25764432 21522799
-142 21522799 19279491 24110877 25072283 25051976 24279728 22797047 23702092 24172592 23235491 21944749 21412110
-131B1412110J992360r13262J319235k67148j888769J818696J424072k191579J018429J69092
-121B3893236o65624K217418l649791L350517N14512j43764k48157j984709K60073K773729
-111B6317440k226293j01040L261559k071899j802111K918525O45357m354895M254532k039847
-101B4801328j00853L148981k345481j580411J0456L12779N72161L172959k749084L84847
-91B5627682K643758l528800q39166K507428M74821m161466Q66018K943524j605054J224575
-81B6153320l15944j864560K366941p14302j957200K186248L88683j031405J237425j460911
-71B4988295n24076K74478O48394M01058K361171n52485m281943l88445J247023K36240l91110
-60B4018600L55285P15263P63862P9326K246378l091059L235613j453404j713644j52633q45104
$$ plain form
-131 21412110 23404470 22491208 23810443 23543295 21654526 23473222 24897294 22705715 23724144 23893236
-121 23893236 23227612 25445030 21795239 25145756 25660268 25516504 25268347 23283638 23543711 26317440
-111 26317440 24091147 23990107 27251666 25179767 23377656 26296181 26941538 22586643 26841175 24801328
-101 24801328 24700475 27849456 25503975 23923564 23934020 24246799 24818960 27991919 25242835 25627682
-91 25627682 28271440 24742640 23903474 26410902 26885723 22724257 23590275 26533799 24928745 26153320
-81 26153320 25837376 23972816 26339757 25625455 23668255 25854503 26243186 25211781 26449206 24988295
-71 24988295 24464219 24738697 25387091 25788149 28149320 27596835 23314892 22926447 24173470 24409710 24018600
-60 24018600 24373885 25089148 25853010 25932336 28178714 25087655 28323268 26869864 25156220 25003587 24158483
-49B4158483J784086J699368k707345k638106K625728j01333J396571m32615J344471l740980
-39B3388328L956741n29445j506813K481408N25825n508335K414146L139809k221694K053572
-29B8193542l990701J696840J458987Q3334l089533j443181K744294R04311Q06540k187911
-19B5176522R4224K448447l465027M530041k918319m95039K23691j93517K218795m422595
-9B3197223J012006L183689q09322j232944J736540m62866O30765J792701k61353j190812
0B7595627j288997p00918J940875j007442O6480m39052L030486l93868j619594l836782N040559
11B8387374N70851k837123J478991k66948j062797K113024P06128m493918L683987j291221
21B6988348J859381k444025K402512N13350M32094R46027p20053n62762J00991J263875l997069
$$ plain form
-49 24158483 25942569 27641937 24934592 22296486 24922214 24820881 26217452 25784837 27129308 23388328
-39 23388328 27345069 26815624 25308811 27790219 28316044 22807709 25221855 28361664 26139970 28193542
-29 28193542 24202841 25899681 27358668 27442002 24352469 22909288 25653582 26557893 27364433 25176522
-19 25176522 25270746 27719193 24254166 28784207 25865888 25370849 25594540 25401023 27619818 23197223
-9 23197223 24209229 27392918 26583596 25350652 27087192 26624326 27255091 29047792 28786439 27595627
0 27595627 26306630 25605712 27546587 26539145 26605625 26166573 29197059 28803191 27183597 23346815 28387374
11 28387374 28958225 26121102 27600093 27333145 26270348 28383372 29089500 24595582 28279569 26988348
21 26988348 28847729 26403704 28806216 29319566 29751660 30697687 29977634 29414872 29515863 30779738 26782669
32B6782669L849790j363234j297262M079442n146857R42750j179496K037746J925236j871717
42B8759067M38938m21353J296871k179248K749834j219445j292214P38503J763048j524034
52B9109967Q95676k206702o37168P29963L025003J86865k784910N61210O02607j499458k16934
63B7766119J537762q59984K11716j443477j025186J560411L3063o46455N452482l490971K174629
74C1270109o13730k401206J836553l109165K241198M747896l264479j358226J799019Q52486
84C2000455j729865j620690l85923J111506j257191K873471o38625k097429L841778k579520
94B9517967j56314j477724L479801k75580q40787j550009J053370J650951j029024j368586
104B9004065J234822K524855k857936J169242n86840j556994L170355k218331K072261l089941
$$ plain form
32 26782669 30632459 29269225 27971963 32051405 26904548 27847298 26667802 28705548 30630784 28759067
42 28759067 29198005 28776652 30073523 27894275 30644109 29424664 28132450 28870953 30634001 29109967
52 29109967 30005643 27798941 27161773 27891736 30916739 31103604 28318694 28879904 29482511 27983053 27766119
63 27766119 29303881 28443897 28655613 27212136 26186950 27747361 27780424 27133969 32586451 29095480 31270109
74 31270109 30656379 28255173 30091726 26982561 29223759 33971655 30707176 29348950 31147969 32000455
84 32000455 30270590 28649900 28263977 29375483 28118292 30991763 30353138 28255709 32097487 29517967
94 29517967 29361653 27883929 31363730 31088150 30247363 28697354 29750724 31401675 30372651 29004065
104 29004065 30238887 32763742 29905806 31075048 30488208 28931214 32101569 29883238 31955499 28865558
114B8865558P46376J792250k446744K345912j997619r28056N88493J087758j160651O62788
124B9556065j840173L163223L43704q99460J35111j273197o46893K912471j036954j482306
134B8931591J442943J817780m295932L590987m71265k023252J021295j249662K748589k812867
144B8700207L677219k825511j706297K835134O28287l097673R25578k114266J864799L15592
154B9203069M95642o2508k595634R42458j745024k376586n57931J976570J8551065R786967
164E3618088j2076089n009513l198215J115588N78146k76201j615595J45767J18402k100520
174C1299858k140351R23256l96253m83310j111842J782660J973830J980564L101069k249903
184C4679578j187857j82342j342077J777871j172432j806638L567686j401502r43136P42038
$$ plain form
114 28865558 29611934 31404184 28957440 31303352 29305733 28377677 28966170 30053928 28893277 29556065
124 29556065 27715892 30879115 31222819 30323359 30458470 29185273 28538380 31450851 30413897 28931591
134 28931591 30374534 32192314 27896382 31487369 31016104 28992852 30014147 28764485 31513074 28700207
144 28700207 32377426 29551915 27845618 30680752 31309039 28211366 29136944 27022678 28887477 29203069
154 29203069 29698711 29636203 27040569 27983027 26238003 23861417 23303486 25280056 43831121 53618088
164 53618088 41541999 36532486 33334271 34449859 35028005 34751804 33136209 33281976 33400378 31299858
174 31299858 29159507 30082763 29686510 29203200 28091358 29874018 31847848 33828412 36929481 34679578
184 34679578 33491721 33309379 31967302 33745173 32572741 30766103 34333789 32932287 31989151 32731189
194C2731189j808070K36341j880050L338487J57833k807647k92207P99202J676277l596595
204B8554760K221345L68504j37107j754651L03284m43262P10076J079406R54980r01156o28502
215C0327677j505587J359068J507919l520681k28721K106311J538593r34939n69904q03251
225B9276485K043021o05963N1036j917787J375379K216217j642388k85n90137k022103L361050
236C1544525j581550k203931J280116K318496n93603N63228j424646k413620J456978Q81861
246B9827854J95205j070755J284546k464417o84184L392648p93815J37707O03707l906959
256B6521537M227165q51665j73242l783411m36043L501105O05570L378197j485321k329883
266B9174009J366877K256636k722247j805426J401263n50042J032461j657936J195091K303483
$$ plain form
194 32731189 30923119 31159460 29279410 32617897 32775730 29968083 29675876 30475078 32151355 28554760
204 28554760 30776105 31144609 31007502 29252851 29556135 29112873 29822949 30902355 31857335 30956179 30327677
215 30327677 28822090 30181158 31689077 28168396 27939675 30045986 31584579 30649640 30079736 29276485
225 29276485 31319506 30713543 30764579 28846792 30222171 32438388 30796000 30795715 30205578 28183475 31544525
236 31544525 29962975 27759044 29039160 31357656 30764053 31327281 29902635 27489015 28945993 29827854
246 29827854 30023059 28952304 30236850 27772433 27088249 30480897 29687082 29824789 30428496 26521537
256 26521537 30748702 29897037 29723795 25940384 25504341 29005446 29611016 32989213 31503892 29174009
266 29174009 30540886 32797522 30075275 28269849 29671112 29121070 30153531 28495595 29690686 31994169
276C1994169N16385j323111k508873K555588l347230K611647k890506J132309P02285J7698
286B9460361j230368L15852J283790k461557K460856k579423L503500r92908M53674L4573
296C0248350j436565J353660j951957M54220K898823j130818k717946O94248K72048j25106
306B8558957K104412L39146m270097O68756P60781n74055M14355l26853J322935K98038r4781
317B9201594j275236J451883L41724k863523o51047L079530l81802r57125l03843J379009
327B9021164L344133m549248j292591K534537J303932M39024k251801k192629l8432K264151
337B8582240n48888L6218K650469l804027J116591J019309k365152L901729l195494n31954
347B6861041R83199j424064L941264L45018j490244k896680J024422J451585k238166J551461
$$ plain form
276 31994169 32510554 31187443 28678570 31234158 27886928 30498575 27608069 28740378 29442663 29460361
286 29460361 28229993 28545845 29829635 27368078 29828934 27249511 30753011 29760103 30213777 30248350
296 30248350 28811785 30165445 28213488 28667708 31566531 30435713 27717767 28412015 28684063 28558957
306 28558957 30663369 31002515 26732418 27401174 28161955 27587900 28002255 27675402 28998337 29296375 29201594
317 29201594 27926358 29378241 29719965 26856442 26205395 29284925 28903123 27945998 27642155 29021164
327 29021164 32365297 27816049 26523458 29057995 30361927 30800951 28549150 26356521 26318089 28582240
337 28582240 28033352 28069570 30720039 26916012 28032603 29051912 26686760 30588489 27392995 26861041
347 26861041 27844240 26420176 30361440 30706458 29216214 26319534 27343956 28795541 26557375 28108836
357B8108836P77455K07870j824417q36833K392448l27776j351036K08845L347200j41612l598142
368B6962838K361551J995420j714812k811943Q00672J686802l444417M373666j228603k127811
378B6853363M01536K070490j09462j093677J136342j317481K44825j920932N022635m007112
388B7280527j565481P64593Q52141J033907N46261j378870K432463j119749O10719j818553
398B7637958j476888M271736l004921J784014l259856N949739k009698j215471M98622k296634
408B6878601J306829q30856K0174k330697M248442J31794m505201K416040n62105K880000
418B9653021l770109K098997q23907M49323M0931l672161P222738l972846J256930j023242
428B7459675j06379j222636L204593k523151j221643K131305J74166m87440j942801P0545
$$ plain form
357 28108836 28886291 29094161 27269744 26432911 28825359 28497583 27146547 27355392 30702592 30560980 26962838
368 26962838 29324389 31319809 29604997 26793054 27593726 29280528 25836111 30209777 28981174 26853363
378 26853363 27254899 29325389 29215927 28122250 29258592 27941111 28185936 26265004 31287639 27280527
388 27280527 25715046 26479639 27331780 28365687 28911948 27533078 29965541 28845792 29456511 27637958
398 27637958 26161070 30432806 27427885 29211899 25952043 31901782 29892084 28676613 29175235 26878601
408 26878601 28185430 27354574 27374748 25044051 29292493 29424287 24919086 27335126 26773021 29653021
418 29653021 25882912 27981909 27158002 27607325 27648256 23976095 31198833 27225987 28482917 27459675
428 27459675 27353296 26130660 29335253 26812102 25590459 27721764 27895930 27408490 25465689 25536234
438B5536234J479156Q32803k56232M11815l101516M514998k711563J7899K474334k677795
448B6520133J550802Q21367l372958J478329O8678m23205K365137l426421J761971J841959
458B9185792k934202P17479L79533j134067J546310J495651k985540P24444J064414R8734
468B8158548J019563K97935n23555j805297L42839J350631j843614k59991r23879K54724K880598
479B8948502o15447j157406r43289J284653J038889k67074j115693O25167M80811J594195
489B9873308k559377l651390L2045L688212o7857j280685M22631J647695L20791j781134L540870
500C0185109l750185j878856L393014j796028k196482J434334J217977n13589K982847l757129
510B5321012k099351K320502J70826J562325m679077K443951L824926k508359L154814n54432
$$ plain form
438 25536234 27015390 27848193 27591961 28003776 24902260 29417258 26705695 26723594 29197928 26520133
448 26520133 28070935 28892302 25519344 26997673 27066351 26643146 29008283 25581862 27343833 29185792
458 29185792 26251590 26969069 27348602 26214535 27760845 29256496 26270956 26995400 28059814 28158548
468 28158548 29178111 29476046 28952491 27147194 27490033 28840664 26997050 26737059 25813180 26067904 28948502
479 28948502 28333055 27175649 26232360 27517013 28555902 28288828 27173135 27798302 28279113 29873308
489 29873308 27313931 23662541 23694586 27382798 27314941 26034256 26456887 28104582 28425373 26644239 30185109
500 30185109 26434924 24556068 27949082 26153054 23956572 25390906 26608883 26095294 29078141 25321012
510 25321012 23221661 25542163 25712989 27275314 22596237 25040188 28865114 26356755 29511569 28957137
520B8957137k275233O20731j165258j08772l05350J939744k285898l66990K581583O71557
530B8263251m039264L045208J918323k409120k36582j670561P56166j681069K090590N84034
540B6620976j76362J61077J185608K78287Q5547j937196J297614j33348l745823R84248Q6061
551B4706689R83673M24647J642686j381418k961656M246167k569057n75101J449256P94700
561B6760586k789594J408718L55005j009935K863530l931941J717189K531502j302196j732096
571B4870768L732244k636100k208600J921057L47235r44034J078526p1987p36612j224755
581B4127742K593674j634136j69522J067658j565716l22789J190889K722507k752557N19150
591B5776900L90022P11477j113177j15508N60919R4270p24952j541705n61774K301511J316364
$$ plain form
520 28957137 26681904 27302635 26137377 26028605 25723255 27662999 25377101 25010111 27591694 28263251
530 28263251 24223987 27269195 29187518 26778398 26541816 24871255 25627421 23946352 26036942 26620976
540 26620976 26444614 26605691 27791299 28069586 28155133 26217937 27515551 27382203 23636380 24620628 24706689
551 24706689 25690362 26115009 27757695 26376277 23414621 27660788 25091731 24516630 25965886 26760586
561 26760586 23970992 25379710 25734715 24724780 27588310 23656369 25373558 27905060 26602864 24870768
571 24870768 28603012 25966912 23758312 25679369 26026604 25082570 26161096 26089109 25352497 24127742
581 24127742 26721416 25087280 24917758 25985416 24419700 24096911 25287800 28010307 25257750 25776900
591 25776900 26166922 26878399 25765222 25649714 26210633 26304903 25579951 24038246 23476472 25777983 27094347
602B7094347J094385k647785o19526k747322L742047K381378l628870L62550j297779J937676
612B5671101J15604k502015L802135p711l784848J582381J284783K12372n24653k88875r49446
623B4610828K139340N5287r47848r79454L284522j519827Q69399j637155m86526k105470L503516
634B6786612j87514r50672J170546k738823M823708l210424J715029p07292l21140m009859
644B2370171J706284Q42380l19241k17344j531207L668875M65475o24618k423679K476159
654B6413255k003091j510925J533154M59087J975136m678905K019640M63679j417841Q15611
664B4068800J037141j517734L344083J587283o457242K129966k282162L653410j375530J411020
674B5599035J997682j126242q70507p91116N65199j419380J468317j589151n2808L94580M88828
$$ plain form
602 27094347 28188732 25540947 24921421 22174099 25916146 28297524 24668654 25031204 23733425 25671101
612 25671101 25786705 23284690 27086825 27079114 23294266 24876647 26161430 26373802 25849149 25560274 24610828
623 24610828 26750168 26805455 25857607 24878153 28162675 26642848 27512247 25875092 25388566 23283096 26786612
634 26786612 26599098 25648426 26818972 24080149 28903857 25693433 27408462 26701170 26380030 22370171
644 22370171 24076455 24918835 24599594 24382250 22851043 26519918 26985393 26360775 23937096 26413255
654 26413255 24410164 22899239 24432393 24891480 26866616 22187711 24207351 24671030 23253189 24068800
664 24068800 25105941 23588207 26932290 28519573 22062331 24192297 21910135 25563545 24188015 25599035
674 25599035 27596717 26470475 25599968 24808852 25374051 23954671 25422988 23833837 23781029 24175609 24664437
685B4664437q00816L41998L87303j025666J687284K219229j581196R043l861632K870937o63453
696B4247468j315136L91408k67933L917854l933406l72236l21880L442049r9109J046351j680786
707B5054644j766345o33458j642905K484313m67530O80843L85736j227449k19004L120426
717B5769271l023814J059955O79161j576368k745313P00358L557219j450426J754478j967745
727B2756776P24894J873495j198701N80127j810374R44605j350271N08317K626838l084638
737B2571068k929566L911965J795466k078381J904513p05576j037588P96504K556237m374605
747B2410037l60228J68225Q84932J349286k159968L11308J469725r52694j290082P31625M92355
758B3054521J933641k035240J659081K55522o61021j039796j999938J785365J263148K117419
$$ plain form
685 24664437 23863621 24205619 24592922 23567256 25254540 27473769 25892573 25901616 22039984 24910921 24247468
696 24247468 22932332 23323740 23055807 26973661 23040255 22668019 22346139 25788188 25689079 26735430 25054644
707 25054644 23288299 22654841 21011936 23496249 23028719 23709562 24095298 22867849 22648845 25769271
717 25769271 22745457 23805412 24484573 22908205 20162892 20863250 24420469 22970043 24724521 22756776
727 22756776 23481670 25355165 24156464 24736591 22926217 23870822 22520551 23028868 25655706 22571068
737 22571068 19641502 23553467 25348933 23270552 25175065 24469489 23431901 24228405 26784642 22410037
747 22410037 22049809 22218034 23102966 24452252 22292284 22603592 24073317 23120623 21830541 22562166 23054521
758 23054521 24988162 22952922 24612003 24867525 24206504 23166708 21166770 22952135 24215283 26332702
768B6332702l274094q06745M847061m726583L646879j793840j788681J685468j300605K651446
778B5473008k253071J173296Q15567k42934l344483J617040Q88398P43177O01224j682307
788B3788915r15512o69599J133011J061028l618812M56152M40463j009799K961154l380324
798B0246677L862902j89489l172891N77626J823756O50233l6767j370447M50013J496949j791798
809B2546764J248877k216538N45343J857187j429608j923045J871817j362624N67601j183933
819B0521841J417811J592242j149024N00564l867480M456408J494210k054083m44118Q930
829B2477301j309526O23352K923222j212554l26988j645456j393374K834336r51717J432135
839B3450731K89313o91251K018683k015451j058003K388098r89882j817213k77405j017153
$$ plain form
768 26332702 23058608 22251863 27098924 22372341 26019220 24225380 22436699 24122167 22821562 25473008
778 25473008 23219937 24393233 25208800 24965866 21621383 23238423 24126821 24869998 25471222 23788915
788 23788915 22873403 22203804 23336815 24397843 20779031 21235183 21675646 20665847 23627001 20246677
798 20246677 24109579 23920090 20747199 21324825 23148581 23798814 23762047 22391600 22841613 24338562 22546764
809 22546764 23795641 21579103 22124446 23981633 22552025 20628980 22500797 21138173 21705774 20521841
819 20521841 21939652 23531894 22382870 22883434 19015954 23472362 24966572 22912489 22468371 22477301
829 22477301 21167775 21791127 24714349 23501795 23174807 21529351 20135977 22970313 22018596 23450731
839 23450731 23740044 23048793 25067476 23052025 21994022 24382120 23392238 21575025 21297620 20280467
849B0280467K043058j681735j12885J262563J208737J33576j371481K511158o91118j215879
859B2366461j91307p56947R61017J83730N14651p9909K142700m820730l65805K952212o35231
870B2270842J373034m48033l178884m99874N557748l355768K162139k763332J187303K333913
880B4639088m733197j08143p66953J943723O78586J923823k84585j06037l43699k018960k029818
891A8793828J810373M67289K741542p9460j899339o70233j802635L125295o51629J475128
901B3310159j67237l331688K144156o81593p13881R35516Q87340M72122k058607K081141m410372
912A8467056K204834K911097m658668L839725K52559k242774J566158q00316k14247J34873
922B1460297J114296J838519k975983m70459K444965L24186l578655q57055J611013J81144
$$ plain form
849 20280467 22323525 20641790 20528905 21791468 23000205 23133781 21762300 24273458 23582340 22366461
859 22366461 22175154 21418207 22379224 22562954 23077605 22997696 25140396 20319666 19953861 22906073 22270842
870 22270842 23643876 23195843 20016959 19517085 25074833 21719065 23881204 21117872 22305175 24639088
880 24639088 19905891 19797748 19030795 20974518 21653104 23576927 23292342 23186305 22842606 20823646 18793828
891 18793828 20604201 21071490 23813032 23733572 21834233 21164000 19361365 22486660 21835031 23310159
901 23310159 23142922 19811234 21955390 21273797 20559916 21495432 22382772 22854894 20796287 22877428 18467056
912 18467056 20671890 23582987 18924319 22764044 23016603 20773829 22339987 21539671 21325424 21460297
922 21460297 22574593 24413112 21437129 20966670 23411635 23735821 20157166 19300111 20911124 21092268
932B1092268j257944j28995J276012J320783m49528N68382j706598j428343K431515q9386
942B1628166p837K598663k493526k23429o98547j035833J066531P45729J979399l270841K931867
953B3220342k432200N99601R82002K013644r92129k279907p9214r22420J973317r27571J899546
964B3055011l281405J261799K996715l419054l009624N87294K150052J751234J580491l455964
974B0216549j089222K724068l268620J899515O89473J62198j671668O84280J800043J57809
984B2304425l541487M48059J472917o46992L099319l118916K689542k031125J124269J216979
994B3016990j268846j588972k109070K959634N65312k053883L570960r6692j932466j334916
1004A9728051M76404K657522j931219L93416j714861J927644p98910j17771J837836j978454
$$ plain form
932 21092268 19834324 19705329 20981341 22302124 21852596 22420978 20714380 19286037 21717552 21628166
942 21628166 21620329 24218992 21725466 21502037 20803490 19767657 20834188 21579917 23559316 20288475 23220342
953 23220342 20788142 21387743 22369745 24383389 23391260 21111353 21032139 20109719 22083036 21155465 23055011
964 23055011 19773606 21035405 24032120 20613066 17603442 18190736 20340788 22092022 23672513 20216549
974 20216549 19127327 21851395 18582775 20482290 21171763 21333961 19662293 20346573 22146616 22304425
984 22304425 18762938 19210997 20683914 20036922 23136241 20017325 22706867 20675742 21800011 23016990
994 23016990 21748144 20159172 18050102 21009736 21575048 19521165 23092125 22995433 21062967 19728051
1004 19728051 20204455 22861977 20930758 21324174 19609313 21536957 20738047 20620276 22458112 20479658
1014B0479658j80143P95590j257421R20187L62440k235135J489782j027795M73674K674999
1024B2495836k63982O58645k180340p31056N28564k399374J253347J193562O63443L526917
1034B4745562k820887j608685J070978j090465R88928j553183K198925j932095j755416K020339
1044B0264001O19112J432456l133653Q41539K545076j624886l415266K507332N46155j989086
1054A8592780K910830j446241J592259r22612j535228J621473r89981L11667J293857j614348
1064A9814456k539590K672107L40512j161210J569318L29190P99460k556274k731043K419733
1074A8956659o7510J278588Q60493q22873N72692j977680Q8124J431165l08851J158656N06737
1085B1676200j146337k047779K171581N0679j891102J996604q08601L68098J580491j51019
$$ plain form
1014 20479658 20299515 21095105 19837684 20757871 21120311 18885176 20374958 19347163 19820837 22495836
1024 22495836 22231854 22890499 20710159 19979103 20507667 18108293 19361640 20555202 21218645 24745562
1034 24745562 21924675 20315990 21386968 20296503 21285431 19732248 21931173 19999078 18243662 20264001
1044 20264001 20883113 22315569 19181916 20023455 22568531 20943645 17528379 20035711 20581866 18592780
1054 18592780 21503610 20057369 21649628 20727016 19191788 20813261 19823280 20134947 21428804 19814456
1064 19814456 17274866 19946973 20287485 19126275 20695593 21024783 21824243 19267969 16536926 18956659
1074 18956659 18889149 20167737 21028230 20205357 20778049 18800369 18888493 20319658 20010807 21169463 21676200
1085 21676200 20529863 18482084 20653665 20704344 18813242 20809846 20001245 20369343 21949834 21798815
1095B1798815N32573L29725j848768J173502k233736j38491K120643j061238M92679j832751
1105A9332953J432209k620716j964108K248306J475392L66127k674193L061196P35925k372932
1115A9020159j36477M89382q9359K48230J512775K30628K60736k730122O07324N58010J5617
1126A9986903K189143k768490l72812j495360l53173L493584k164119o12058K164350p39021
1136A9328947k04658k505820J72257M086958M15234k002894j60907J306950r00419J177419
1146B0713067m92158j202109N22366j142877P46058J313669j677748J389117j086010q14859
1156A8268516K088592j414862o46827J708364k508278K616067q74218l036725M862310k571865
1166A8491074K550061l587483J74525K730837J416818l308675P91038J891348l901052K931334
$$ plain form
1095 21798815 22331388 22661113 20812345 21985847 19752111 19613620 21734263 20673025 21165704 19332953
1105 19332953 20765162 18144446 16180338 18428644 19904036 20270163 17595970 20657166 21393091 19020159
1115 19020159 18883682 19373064 19283705 19531935 21044710 21275338 21536074 18805952 19413276 19971286 19986903
1126 19986903 22176046 19407556 19034744 17539384 17186211 20679795 18515676 17903618 20067968 19328947
1136 19328947 19124289 16618469 16790726 20877684 21292918 19290024 19129117 20436067 19535648 20713067
1146 20713067 20220909 19018800 19541166 18398289 19144347 20458016 18780268 20169385 19083375 18268516
1156 18268516 20357108 18942246 18295419 20003783 17495505 20111572 19237354 16200629 21062939 18491074
1166 18491074 21041135 17453652 17628177 20359014 21775832 18467157 19258195 21149543 17248491 20179825
1176B0179825j560545J407571N07526P86320j274721p49889J086409J170343l752253K476996
1186B0277582j826903J225463j05902J12912N12464k876026N282553m518118J438639J3900
1196A9536564K118557r06927l225301K699663J07495J87621M1417r03972M97510Q99159j334651
1207A9717135k433225N88483P32396J589116K942000l412306j945310J714787J802066L10344
1217B1605486r17649l529051J303268J885766k838628J170428K796484n38555k540980j74289
1227A8222280O26340j97396Q20083J462858k408868M12477J165815j688317p79269K598115
1237B0234118O82211k160288Q97320k695318Q60630J144391J026024k360184k992484M488913
1247A9125333l29867M73171K606557k117512o92421J819019J214318l009503J286721n81039
$$ plain form
1176 20179825 18619280 20026851 20534377 21320697 20045976 19296087 20382496 21552839 17800586 20277582
1186 20277582 18450679 19676142 19570240 19683152 20195616 17319590 22602143 18084025 19522664 19536564
1196 19536564 21655121 20748194 17522893 20222556 20330051 20517672 20559089 19655117 20152627 21051786 19717135
1207 19717135 17283910 17872393 18604789 20193905 23135905 19723599 17778289 19493076 21295142 21605486
1217 21605486 20687837 17158786 18462054 20347820 17509192 18679620 21476104 20937549 18396569 18222280
1227 18222280 18848620 18651224 19471307 20934165 18525297 18937774 20103589 18415272 17636003 20234118
1237 20234118 20916329 18756041 19653361 16958043 17818673 18963064 19989088 17628904 14636420 19125333
1247 19125333 18795466 19268637 21875194 19757682 19065261 20884280 22098598 19089095 20375816 19794777
1257A9794777j809200L97178j190260n35253k49711J405424L93365r14112j654979J510509
1267A7147738j066272L964470P81305j036628j897722o82053M197236o48394j782949L00838
1277A9277569J83157J448841l699055M43768P58243k322000N166624K24453r02690k021678
1287A8557232k716832K291254J860928q20833L204705m126513m4826J208213O9216n38455
1297A8944089k063639K021931J749867k098202j490403O58441K49607J833591J931223k969471
1307A8767034J489802m60611O7772o89233l436603L333376k520611J822343j337394K811749
1317A9847624l555496K846782j991866K422653L432129n385424J630460j143755j36767K440880
1327B0407220Q46446j664435o2401m977134N192963j822887j956847L591316r1870k342418
$$ plain form
1257 19794777 17985577 18382755 17192495 16657242 16407531 17812955 18206320 17292208 15637229 17147738
1267 17147738 16081466 20045936 20827241 19790613 17892891 17210838 21408074 20759680 18976731 19277569
1277 19277569 19460726 20909567 17210512 17654280 18412523 16090523 21257147 21481600 20578910 18557232
1287 18557232 15840400 18131654 19992582 19171749 22376454 18249941 18205115 19413328 19482544 18944089
1297 18944089 16880450 18902381 20652248 18554046 17063643 17722084 17971691 19805282 21736505 18767034
1307 18767034 20256836 19796225 19863997 19174764 15738161 19071537 16550926 18373269 17035875 19847624
1317 19847624 16292128 19138910 17147044 19569697 23001826 17616402 19246862 18103107 17966340 20407220
1327 20407220 21253666 19589231 19526830 14549696 19742659 17919772 15962925 19554241 19462371 17119953
1337A7119953L292770j099520j245932J373126K111036k500541k772568K644858j170614q16287
1347A6936281J55514M413152l982421M08272j14025j09816m38627n42374M85041J113209L376838
1358B1701044m919778L559296Q8224j333135J699419l752769K92895p06310n06954K666175
1368A8788107k23826j635911J749553K635896p95270k127111P78040n33223q9555J107738
1378A9654438l07323j450534J236055j169164j96720J357011r67789k019121L505134l04324
1388A9337663j146052M87522p66237j219527P63906J972530k325525J981419k029486P64635
1398A7820848L04161K159134j334206k50374r64524J260012K150446l545447Q26786k47277
1408A8179559l476247K395147M89847J091840L51467k350060M290381l021826J013610k30907
$$ plain form
1337 17119953 20412723 19313203 18067271 19440397 21551433 19050892 16278324 18923182 17752568 16936281
1347 16936281 17091795 21504947 17522526 17930798 17816773 17706957 17268330 16725956 17210997 18324206 21701044
1358 21701044 16781266 20340562 20428786 19095651 20795070 17042301 17335196 16628886 16121932 18788107
1368 18788107 18564281 16928370 18677923 21313819 20518549 18391438 19169478 18636255 18546700 19654438
1378 19654438 19347115 17896581 19132636 17963472 17766752 19123763 18155974 16136853 19641987 19337663
1388 19337663 18191611 18679133 17912896 16693369 17457275 19429805 17104280 19085699 17056213 17820848
1398 17820848 18125009 20284143 18949937 18699563 17735039 18995051 21145497 17600050 18426836 18179559
1408 18179559 14703312 17098459 17588306 18680146 19031613 16681553 20971934 17950108 18963718 18732811
1418A8732811l250422L537332Q05849j658369l32783k728165K134403R10968j560612N82540
1428A7173552J620964O22836J45247n46659j775035j297247L252727k288157Q96799J116429
1438A8921456j103680N67692k541094J193299J43832Q06306n45306J067622j321994J412631
1448A8600764j455250l97456L224089N09346m627975K10958K716720k287267m92183J713783
1458A7715529J068229j422217R01724M72339k083887J109271J932253l076143k83458J970413
1468A8304053p41542K062266K97857L44635j342178j876971J106370N10268m61097l358641
1478A4845020J997241j361531K274037J876581j289062J71454n35881J457539j708154J749506
1488A9476750k104814l67897K107242k524955K205268k344355K504116k725207n80041K215643
$$ plain form
1418 18732811 15482389 19019721 19825570 18167201 17834418 15106253 17240656 18151624 16591012 17173552
1428 17173552 18794516 19417352 19562599 19015940 17240905 15943658 19196385 16908228 17805027 18921456
1438 18921456 17817776 18385468 15844374 17037673 17181505 17987811 17442505 18510127 17188133 18600764
1448 18600764 17145514 16748058 19972147 20481493 15853518 16064476 18781196 16493929 16001746 17715529
1458 17715529 18783758 17361541 18263265 18735604 16651717 17760988 19693241 16617098 16333640 18304053
1468 18304053 17562511 19624777 19922634 20267269 18925091 17048120 18154490 18664758 18203661 14845020
1478 14845020 16842261 15480730 17754767 19631348 18342286 18513740 17977859 19435398 17727244 19476750
1488 19476750 17371936 17004039 19111281 16586326 18791594 16447239 18951355 16226148 15646107 17861750
1498A7861750M10627j280299L597325j493659n435417M139352l68808J122153m447669L160942
1508A7266297k54098K067390k40493j475744q91966K159529q52473l179196N131826j508991
1518A8222081p30102L929754m666936J862173o34087K235551k069298l162821M990744l384091
1528A6592968m39088j356653N546760l774422k59950Q80272L86191k189530L950735l738001
1538A5599282J687896K214443j836564J415847k684284K18488J610662j649372N4986K270846
1548A8902230l936290J916065j197331q8254P38196K349024k348827J834443o072224P135409
1558A9232441j783770k290495M653089k726058M03426j145318R22149o42372K076296j471455
1568A7227933k93832q28892J491637l60905p62401M27764p83253K296590O80118l375464L980508
$$ plain form
1498 17861750 18272377 16992078 20589403 19095744 13660327 17799679 17430871 18553024 14105355 17266297
1508 17266297 17012199 19079589 18839096 17363352 16471386 18630915 17778442 14599246 19731072 18222081
1518 18222081 17491979 21421733 16754797 18616970 17982883 20218434 18149136 14986315 19977059 16592968
1528 16592968 16153880 14797227 20343987 16569565 16309615 17189887 17576078 15386548 19337283 15599282
1538 15599282 17287178 19501621 17665057 19080904 16396620 16615108 18225770 16576398 16631384 18902230
1548 18902230 14965940 16882005 15684674 15596420 16334616 18683640 16334813 18169256 12097032 19232441
1558 19232441 17448671 15158176 19811265 17085207 17488633 16343315 17265464 16623092 18699388 17227933
1568 17227933 16934101 16105209 17596846 17235941 16473540 16901304 16118051 18414641 19094759 15719295 19699803
1579A9699803k931779Q43229N99769j828133J494312j982761J970051L8639p54537k10129
1589A6938464l42415J052513r23835K52179j553913J539719o8298J604251j38247o93333K399179
1600B0066264j722311o12561j573448K670980j752474k212516K181377L478337k228932j996293
1610A6298423j330962K091314N81620N17792k86280L11603m048784o72808L078740l463860
1620A3076798L693925J430789j067198M67131k248032J07369q98495J790525M022707k691449
1630A7684070j168346q25183J614409n44732J888043m67452m06359k058713K532743Q36457
1640A9084937k522270O38491J479447j567422j930905J588411R02536J88974j130432L90668
1650A7122435o22957q55232j327123L884469L64441K99217j839925J158101j39980n27829
$$ plain form
1579 19699803 16768024 17611253 18211022 16382889 17877201 15894440 17864491 17903130 17148593 16938464
1589 16938464 16596049 17648562 16724727 16976906 15422993 16962712 16894414 18498665 18360418 17667085 20066264
1600 20066264 18343953 17731392 16157944 18828924 17076450 14863934 17045311 20523648 18294716 16298423
1610 16298423 14967461 17058775 17640395 18158187 17871907 18183510 14134726 13461918 16540658 13076798
1620 13076798 16770723 18201512 17134314 17601445 15353413 15460782 14562287 16352812 20375519 17684070
1630 17684070 16515724 15690541 17304950 16760218 18648261 18180809 17774450 15715737 18248480 19084937
1640 19084937 16562667 17201158 18680605 17113183 15182278 16770689 17673225 17862199 16731767 17122435
1650 17122435 16499478 15644246 14317123 18201592 18566033 18865250 17025325 18183426 18043446 17515617
1660A7515617P90669J965931k665543k433925K220515K047555l702445j872600K842015k430732
1670A4277057M322110j950448l29746J5614J548481J85232j713638J204364k16327j558277
1680A5784422J776549n89184O57565j023970l631158M837937o50966q366k756975K184710
1690A6580564R90678r84644J51243L27991j365925K094540j058294k419753N503751m180835
1700A5639316K627933j493259N52491J64174L84065k102429j275160L039734K006546p84299
1710A8759112l033575P46010q14343K915259j724556L10735k188708M21134q47170J047330
1720A5591228n09874K566618m65284l62147R63768j51404j138513q47895M468937m833514
1730A5281920N93645j080K1126j427486J271174L007467k447526l049884L223244j452792
$$ plain form
1660 17515617 18306286 20272217 17606674 15172749 17393264 19440819 15738374 13865774 16707789 14277057
1670 14277057 18599167 16648719 16318973 16334587 17883068 18068300 16354662 17559026 17342699 15784422
1680 15784422 17560971 16971787 17629352 16605382 12974224 17812161 17161195 17152829 14395854 16580564
1690 16580564 17571242 16586598 16737841 17065832 15699907 17794447 16736153 14316400 19820151 15639316
1700 15639316 18267249 16773990 17326481 17490655 17874720 15772291 14497131 17536865 19543411 18759112
1710 18759112 15725537 16471547 15657204 18572463 16847907 17158642 14969934 15391068 14543898 15591228
1720 15591228 15081354 17647972 17182688 16820541 17784309 17632905 16494392 15646497 20115434 15281920
1730 15281920 15875565 15874485 15895611 14468125 15739299 18746766 16299240 13249356 16472600 15019808
1740A5019808J457302n03535k574614J141447J034313K473816j62817M86792j824739o35617
1750A5912156k245566L510059m82877j861411L04672K134446L6004o02138j91286k769203
1760A3744856K455037J899608j166652J284270j5675k162303K60875o27814j463152K3610
1770A4232660L627218J443184l201959j069014L325086k472639M98997j284310J826400Q18385
1780A7744008O89580M87075o031531L653793k599631J333636J511095j163676m60685P50082
1790A5913746K630976l195787N31175J368540m187363K219155J68429j062148L9999L41327
1800A4768049N661339m572821K847114k667373j145616J800036j305580J227359l691047J564076
1810A4485536J697020J524798k912880K286775p17039k419251L211657j040939j41998j349564
$$ plain form
1740 15019808 16477110 15973575 13398961 14540408 15574721 18048537 17885720 18372512 16547773 15912156
1750 15912156 13666590 17176649 16693772 14832361 15137033 17271479 17307483 16705345 16514059 13744856
1760 13744856 16199893 18099501 16932849 18217119 18201444 16039141 16300016 15672202 14209050 14232660
1770 14232660 17859878 19303062 16101103 15032089 18357175 15884536 16383533 15099223 16925623 17744008
1780 17744008 18433588 18920663 12889132 16542925 13943294 15276930 16788025 15624349 15163664 15913746
1790 15913746 18544722 15348935 15880110 17248650 13061287 15280442 15448871 14386723 14426722 14768049
1800 14768049 20429388 15856567 18703681 16036308 14890692 16690728 15385148 16612507 12921460 14485536
1810 14485536 16182556 17707354 14794474 17081249 16364210 13944959 17156616 16115677 15973679 14624115
1820A4624115Q61644r94290K162575M82854k440722K648795p75689J024989k831982J725906
1830A6488195l89256r11493J972911k326918K309528k021463P64219m70001J062509J769324
1840A8247555l174466J983191k178204J222628m7297m63351Q7139J477902R81557k257254
1850A5879400K47712K71988J100221l816805L518866j220517p61112R51255L54177J195157
1860A7720342l66819j811797L06468j130312J535258K012276m650617M522738J540259j996398
1870A7681398j516095K49699j722919J573648K95135j49796j120982j10166J725692J08071
1880A7013685r51611P15429j826521K675080J518389k449794K77489r74391R14583l275433
1890A3636905K093297j370274L834430n64135l579786r3263M89744P01787Q50470m30991N69837
$$ plain form
1820 14624115 15485759 14491469 16654044 17136898 14696176 17344971 16569282 17594271 14762289 16488195
1830 16488195 16098939 15187446 17160357 14833439 17142967 15121504 15885723 15415722 16478231 18247555
1840 18247555 15073089 17056280 14878076 16100704 16053407 15590056 15677195 17155097 18136654 15879400
1850 15879400 16127112 16399100 17499321 13682516 17201382 15980865 15219753 16171008 16525185 17720342
1860 17720342 17353523 15541726 15848194 14717882 16253140 18265416 13614799 18137537 19677796 17681398
1870 17681398 16165303 16415002 14692083 16265731 16560866 16411070 15290088 15179922 16905614 17013685
1880 17013685 16062074 16777503 14950982 17626062 19144451 16694657 16972146 15997755 16912338 13636905
1890 13636905 15730202 14359928 18194358 17630223 14050437 13957174 14446918 15148705 15999175 15568184 16138021
1901A6138021N27052l536559M906018N39025j025752l476662j883669O228216j464688l544224
1911A3406778L398466j352810j034411K442834J98126j014131K061601P67276l790521j116091
1921A3967117K344821r27130J369310k26177j574782J02098j086171K123560l35138r20022
1931A4837486j635954J070880j492661K075572J751502k905473Q82086K457482J22981k657434
1941A4506467j246333K774422J704638m268667j454J027331K903407l213482N62726K008888
1951A6757943l804413R70387J050534K363744q42068j752489J10568Q23906o39642k50129
1961A4788341m50043Q64188K026352k07003j824244J782679j324173r37149J279992q85500
1971A5113440m52966k52392J954982j742042q13450K127391K577956k122522j455390k948917
$$ plain form
1901 16138021 16665073 13128514 18034532 18573557 17547805 14071143 12187474 18415690 16951002 13406778
1911 13406778 16805244 15452434 14418023 16860857 17058983 16044852 18106453 18873729 15083208 13967117
1921 13967117 16311938 15384808 16754118 16527941 14953159 15055257 13969086 16092646 15757508 14837486
1931 14837486 13201532 14272412 12779751 14855323 16606825 13701352 14583438 17040920 17163901 14506467
1941 14506467 13260134 16034556 17739194 13470527 13469073 14496404 17399811 14186329 14749055 16757943
1951 16757943 12953530 13923917 14974451 17338195 16496127 14743638 14854206 15678112 15038470 14788341
1961 14788341 14338298 15202486 17228838 17021835 15197591 16980270 15656097 14718948 15998940 15113440
1971 15113440 14660474 14408082 16363064 14621022 13807572 15934963 18512919 16390397 14935007 11986090
1981A1986090J945317L183969k565793Q36289j275384J302247p55652r86300R40156l339515
1991A1271424J07446K936559r80312J419624r68462j239640o62069N4463n79045L43189K669303
2002A4372480l182245K586490k564392j902442J675074k246112K24626J817888k090805r25008
2012G765554L92142j409834J158147j754894j017726J372149j189759J80093J509925k313337
2022D692460N96130j964234O93554j566593M50036j132344k933259K800239k733464N39849
2032e57626J338841r45159k265654m3115M44351k140009p58418O19899l8580j717769j137823
2043g201062j884850J52507j686131
2046a0619536
$$ plain form
1981 11986090 13931407 17115376 14549583 15385872 14110488 15412735 14657083 13670783 14610939 11271424
1991 11271424 11378870 14315429 13335117 14754741 13786279 12546639 11884570 11939033 11359988 11703177 14372480
2002 14372480 11190235 13776725 11212333 9309891 10984965 8738853 8963479 10781367 8690562 7765554
2012 7765554 8157696 6747862 7906009 6151115 5133389 6505538 5315779 5495872 7005797 4692460
2022 4692460 5288590 3324356 4017910 2451317 2901353 1769009 -1164250 1635989 -1097475 -557626
2032 -557626 781215 -163944 -2429598 -2472713 -2028362 -4168371 -4926789 -4306890 -4345470 -6063239 -7201062
2043 -7201062 -9085912 -8933405 -10619536
2046 -10619536
##END=	
