##TITLE=	29191402.10.fid
##JCAMPDX=	6.0	$$ NMR Plug-in 1.13 of MestReNova 11.0.4-18998
##DATATYPE=	NMRSPECTRUM
##DATACLASS=	NTUPLES
##NUMDIM=	1
##ORIGIN=	Bruker BioSpin GmbH
##OWNER=	nmr
##.OBSERVEFREQUENCY=	400.06547055279099823
##.OBSERVENUCLEUS=	^1H
##.SOLVENTNAME=	CDCl3
##.PULSESEQUENCE=	zg30
##LONGDATE=	2014/05/30 00:19:00.000
##.ACQUISITIONMODE=	SIMULTANEOUS (DQD)
##$ORIGINALFORMAT=	Bruker XWIN-NMR
##$PARAMETERFILE=	(acqus, ASCII, /var/folders/bp/m_4195y96sx1d256lqvkcvym0000gq/T/SZELDR3HRkWf4lh$ArEX3A/10/acqus, 0)
$$ ##TITLE= Parameter file, TOPSPIN		Version 3.2
$$ ##JCAMPDX= 5.0
$$ ##DATATYPE= Parameter Values
$$ ##NPOINTS= 11	$$ modification sequence number
$$ ##ORIGIN= Bruker BioSpin GmbH
$$ ##OWNER= nmr
$$ $$ 2014-05-30 00:19:26.667 +0100  nmr@clevinger
$$ $$ /home/nmr/localdata/29191402/10/acqus
$$ $$ process /opt/topspin3.2_pl3/prog/mod/shimcntl
$$ ##$ACQT0= -2.56302517001368
$$ ##$AMP= (0..31)
$$ 100 100 100 100 100 100 100 100 100 100 100 100 100 100 100 100 100 100
$$ 100 100 100 100 100 100 100 100 100 100 100 100 100 100
$$ ##$AMPCOIL= (0..19)
$$ 0 0 0 0 0 0 0 0 0 0 0 0 0 0 0 0 0 0 0 0
$$ ##$ANAVPT= -1
$$ ##$AQSEQ= 0
$$ ##$AQ_mod= 3
$$ ##$AUNM= <au_zg>
$$ ##$AUTOPOS= <24 >
$$ ##$BF1= 400.063
$$ ##$BF2= 400.063
$$ ##$BF3= 400.063
$$ ##$BF4= 400.063
$$ ##$BF5= 400.063
$$ ##$BF6= 400.063
$$ ##$BF7= 400.063
$$ ##$BF8= 400.063
$$ ##$BYTORDA= 0
$$ ##$CAGPARS= (0..11)
$$ 0 0 0 0 0 0 0 0 0 0 0 0
$$ ##$CFDGTYP= 0
$$ ##$CFRGTYP= 9
$$ ##$CHEMSTR= <none>
$$ ##$CNST= (0..63)
$$ 1 1 1 1 1 1 1 1 1 1 1 1 1 1 1 1 1 1 1 1 1 1 1 1 1 1 1 1 1 1 1 1 1 1 1 1
$$ 1 1 1 1 1 1 1 1 1 1 1 1 1 1 1 1 1 1 1 1 1 1 1 1 1 1 1 1
$$ ##$CPDPRG= (0..8)
$$ <> <> <> <> <> <> <> <> <>
$$ ##$D= (0..63)
$$ 0 1 0 0 0 0 0 0 0 0 0 0 0 0 0 0 0.0002 0 0 0 0 0 0 0 0 0 0 0 0 0 0 0 0
$$ 0 0 0 0 0 0 0 0 0 0 0 0 0 0 0 0 0 0 0 0 0 0 0 0 0 0 0 0 0 0 0
$$ ##$DATE= 1401405565
$$ ##$DE= 16.91198
$$ ##$DECBNUC= <off>
$$ ##$DECIM= 2496
$$ ##$DECNUC= <off>
$$ ##$DECSTAT= 4
$$ ##$DIGMOD= 3
$$ ##$DIGTYP= 12
$$ ##$DQDMODE= 0
$$ ##$DR= 22
$$ ##$DS= 0
$$ ##$DSPFIRM= 4
$$ ##$DSPFVS= 21
$$ ##$DTYPA= 0
$$ ##$EXP= <Proton.dur>
$$ ##$F1LIST= <>
$$ ##$F2LIST= <>
$$ ##$F3LIST= <>
$$ ##$FCUCHAN= (0..9)
$$ 0 2 0 0 0 0 0 0 0 0
$$ ##$FL1= 90
$$ ##$FL2= 90
$$ ##$FL3= 90
$$ ##$FL4= 90
$$ ##$FOV= 20
$$ ##$FQ1LIST= <>
$$ ##$FQ2LIST= <>
$$ ##$FQ3LIST= <>
$$ ##$FQ4LIST= <>
$$ ##$FQ5LIST= <>
$$ ##$FQ6LIST= <>
$$ ##$FQ7LIST= <>
$$ ##$FQ8LIST= <>
$$ ##$FRQLO3= 247029.447209001
$$ ##$FRQLO3N= 2
$$ ##$FS= (0..7)
$$ 83 83 83 83 83 83 83 83
$$ ##$FTLPGN= 0
$$ ##$FW= 125000
$$ ##$FnMODE= 0
$$ ##$FnTYPE= 0
$$ ##$GPNAM= (0..31)
$$ <> <> <> <> <> <> <> <> <> <> <> <> <> <> <> <> <> <> <> <> <> <> <> <>
$$ <> <> <> <> <> <> <> <>
$$ ##$GPX= (0..31)
$$ 0 0 0 0 0 0 0 0 0 0 0 0 0 0 0 0 0 0 0 0 0 0 0 0 0 0 0 0 0 0 0 0
$$ ##$GPY= (0..31)
$$ 0 0 0 0 0 0 0 0 0 0 0 0 0 0 0 0 0 0 0 0 0 0 0 0 0 0 0 0 0 0 0 0
$$ ##$GPZ= (0..31)
$$ 0 0 0 0 0 0 0 0 0 0 0 0 0 0 0 0 0 0 0 0 0 0 0 0 0 0 0 0 0 0 0 0
$$ ##$GRDPROG= <>
$$ ##$GRPDLY= 76
$$ [...]
$$ ##$Sgu1PowerLevels= (0..7)
$$ 90 74 58 42 26 10 0 0
$$ ##$Sgu2PowerLevels= (0..7)
$$ 90 74 58 42 26 10 0 0
$$ ##$Sgu3PowerLevels= (0..7)
$$ 0 0 0 0 0 0 0 0
$$ ##$Sgu4PowerLevels= (0..7)
$$ 0 0 0 0 0 0 0 0
$$ ##$Sgu5PowerLevels= (0..7)
$$ 0 0 0 0 0 0 0 0
$$ ##$Sgu6PowerLevels= (0..7)
$$ 0 0 0 0 0 0 0 0
$$ ##$Sgu7PowerLevels= (0..7)
$$ 0 0 0 0 0 0 0 0
$$ ##$Sgu8PowerLevels= (0..7)
$$ 0 0 0 0 0 0 0 0
$$ ##$SguType= 3
$$ ##$ShimPowMaxUA= (0..63)
$$ 130000 130000 130000 130000 130000 130000 130000 130000 130000 130000 130000
$$ 130000 130000 130000 130000 130000 130000 130000 130000 130000 0 0 0 0
$$ 0 0 0 0 0 0 0 0 0 0 0 0 0 0 0 0 0 0 0 0 0 0 0 0 0 0 0 0 0 0 0 0 0 0 0 0
$$ 0 0 0 0
$$ ##$ShimPowMaxUC= (0..63)
$$ 130000 130000 130000 130000 130000 130000 130000 130000 130000 130000 130000
$$ 130000 130000 130000 130000 130000 130000 130000 130000 130000 0 0 0 0
$$ 0 0 0 0 0 0 0 0 0 0 0 0 0 0 0 0 0 0 0 0 0 0 0 0 0 0 0 0 0 0 0 0 0 0 0 0
$$ 0 0 0 0
$$ ##$ShimPowMaxUG= (0..63)
$$ 524287 524287 524287 524287 524287 524287 524287 524287 524287 524287 524287
$$ 524287 524287 524287 524287 524287 524287 524287 524287 524287 0 0 0 0
$$ 0 0 0 0 0 0 0 0 0 0 0 0 0 0 0 0 0 0 0 0 0 0 0 0 0 0 0 0 0 0 0 0 0 0 0 0
$$ 0 0 0 0
$$ ##$ShimPowRcbType= 3
$$ ##$ShimPowRes= (0..63)
$$ 1e-20 1e-20 1e-20 1e-20 1e-20 1e-20 1e-20 1e-20 1e-20 1e-20 1e-20 1e-20
$$ 1e-20 1e-20 1e-20 1e-20 1e-20 1e-20 1e-20 1e-20 0 0 0 0 0 0 0 0 0 0 0 0
$$ 0 0 0 0 0 0 0 0 0 0 0 0 0 0 0 0 0 0 0 0 0 0 0 0 0 0 0 0 0 0 0 0
$$ ##$ShimPowRng0= (0..63)
$$ 1 1 1 1 1 1 1 1 1 1 1 1 1 1 1 1 1 1 1 1 0 0 0 0 0 0 0 0 0 0 0 0 0 0 0 0
$$ 0 0 0 0 0 0 0 0 0 0 0 0 0 0 0 0 0 0 0 0 0 0 0 0 0 0 0 0
$$ ##$ShimPowRng1= (0..63)
$$ 1 1 1 1 1 1 1 1 1 1 1 1 1 1 1 1 1 1 1 1 0 0 0 0 0 0 0 0 0 0 0 0 0 0 0 0
$$ 0 0 0 0 0 0 0 0 0 0 0 0 0 0 0 0 0 0 0 0 0 0 0 0 0 0 0 0
$$ ##$ShimPowRng2= (0..63)
$$ 1 1 1 1 1 1 1 1 1 1 1 1 1 1 1 1 1 1 1 1 0 0 0 0 0 0 0 0 0 0 0 0 0 0 0 0
$$ 0 0 0 0 0 0 0 0 0 0 0 0 0 0 0 0 0 0 0 0 0 0 0 0 0 0 0 0
$$ ##$ShimPowRng3= (0..63)
$$ 1 1 1 1 1 1 1 1 1 1 1 1 1 1 1 1 1 1 1 1 0 0 0 0 0 0 0 0 0 0 0 0 0 0 0 0
$$ 0 0 0 0 0 0 0 0 0 0 0 0 0 0 0 0 0 0 0 0 0 0 0 0 0 0 0 0
$$ ##$ShimSysFunc= (0..63)
$$ 1 2 3 4 5 7 9 11 15 16 8 10 12 14 6 17 13 18 19 20 0 0 0 0 0 0 0 0 0 0
$$ 0 0 0 0 0 0 0 0 0 0 0 0 0 0 0 0 0 0 0 0 0 0 0 0 0 0 0 0 0 0 0 0 0 0
$$ ##$ShimSysMatrix= 0
$$ ##$ShimSysType= 1
$$ ##$TFXNUM= 0
$$ ##$TRIPLO2= 0
$$ ##$VTU= 2
$$ ##$VTUETH= <149.236.99.20>
$$ ##$VTUTY= <no>
$$ ##$WBREFAM= (0..15)
$$ 130 97.1 100 100 100 100 100 100 100 100 100 100 100 100 100 100
$$ ##$WBREFLM= (0..15)
$$ 0 0 0 0 0 0 0 0 0 0 0 0 0 0 0 0
$$ ##$WBREFPH= (0..15)
$$ 73.31 -75.54 0 0 0 0 0 0 0 0 0 0 0 0 0 0
$$ ##$WBSGU= (0..15)
$$ 0 0 0 0 0 0 0 0 0 0 0 0 0 0 0 0
$$ ##$XFAC= 2
$$ ##END=
$$ 
##$DECIM=	2496
##$DSPFVS=	21
##XUNITS=	HZ
##YUNITS=	ARBITRARY UNITS
##FIRSTX=	6476.9630474203004269
##LASTX=	-1535.7351994621992617
##XFACTOR=	-0.12226593800080109986
##YFACTOR=	5.7998271484375007217e-06
##NPOINTS=	65536
##XYDATA=	(X++(Y..Y))
$$ [...]
-29191E85392q5316j32514k7213m7779M5078J29821K3348j4961R4336r034j37553n632J1390
$$ 585392 500076 367562 340349 292570 337648 467469 490817 475856 570192 561158 423605 417973 429363
-29178D29363N2479J486j28121j17392j26280k1706K5946J02330P4033M017Q2025J40078o435
$$ 429363 481842 483328 355207 237815 111535 89829 115775 218105 292138 296155 378180 518258 511823
-29165E11823l7474M3310J14867N2701L5337m7219r8411O0241L6579o4320M014k7297m6123
$$ 511823 474349 517659 632526 685227 720564 673345 574934 635175 671754 607434 611448 584151 538028
-29152E38028j5206J1980n5384l6607Q483J18454R6024Q8757J119j99678n8529J30301O5470
$$ 538028 522822 534802 479418 442811 451294 569748 665772 754529 755648 555970 497441 627742 693212
-29139F93212j64312q5149M020L0712k245J07044M2520n553q8737r0660q7276N7907J15207
$$ 693212 528900 443751 447771 478483 476238 583282 625802 620249 531512 440852 353576 411483 526690
-29126E26690N0268O3865k0437q2405j38421j14725K11333L41962J59249J01100j5690j62163
$$ 526690 576958 640823 620386 537981 399560 284835 496168 838130 997379 1098479 1082789 920626
-29114I20626j18903P4964J17057j7037o3259j05810j57680j26472l8864Q7931P9657j0160
$$ 920626 801723 876687 993744 976707 913448 807638 649958 523486 484622 572553 652210 642050
-29102F42050L0574L9843l198j9921j25169j03083L0857J20538N7691j7420K3705J44850n22
$$ 642050 672624 712467 709269 689348 564179 461096 491953 612491 670182 652762 676467 821317 820795
-29089H20795j60495j06146j8258m9318l647J18389J19099O1616j16093o6757J55791L2939
$$ 820795 660300 554154 535896 486578 482931 601320 720419 782035 665942 599185 754976 787915
-29077G87915j25116p5832j226m422p9479j10765m6531M6973J61570M4203o40p7204m5296
$$ 787915 662799 586967 585741 581319 501840 391075 344544 391517 553087 597290 596650 519446 474150
-29064D74150j6378N1439J38434J01411P7871o1379j13715j01641j10809q704j0158K086J2387
$$ 474150 457772 509211 647645 749056 826927 765548 651833 550192 439383 430679 420521 422607 434994
-29051D34994R1873J43748P0796o8013n4675O2612l1043J53056J28998j47543k8437Q2194
$$ 434994 526867 670615 741411 673398 618723 681335 650292 803348 932346 784803 756366 838560
-29039H38560j02292l2959L524Q5134J89868J12127j19617j88494j24442j5621k8039l0037
$$ 838560 736268 703309 706833 791967 981835 1093962 974345 785851 661409 645788 617749 587712
-29027E87712L6104q1398l3106M6347k6422k6339k4400O9470J38398P5365O0775j5172J04166
$$ 587712 623816 542418 509312 555659 529237 502898 478498 547968 686366 761731 822506 807334 911500
-29014I11500M1369O7797M1091k1498j00425j50824j98781j62305j7205J9458j8261J28772
$$ 911500 952869 1020666 1061757 1040259 939834 789010 590229 427924 410719 430177 411916 540688
-29002E40688J23304q1477r6257m85N9110R6465J00997M6699o7229n7746k0097R0075R8299
$$ 540688 663992 582515 486258 485773 544883 641348 742345 789044 721815 664069 643972 734047 832346
-28989H32346n7212j10595j32566K8777Q8904J1699k2602l2593o2380M6818J06348l885j21669
$$ 832346 775134 664539 531973 560750 649654 661353 638751 606158 543778 590596 696944 693059 571390
-28976E71390n1158l7960o6347J3100r82j2254J53005J52216j8768j00003j04938j7839p0170
$$ 571390 520232 482272 415925 429025 428043 415789 568794 721010 702242 602239 497301 479462 409292
-28963D09292l4879L8831N9542N3415J07683J50533J93564Q5205l4533m4832k7315q4699k21933
$$ 409292 374413 413244 472786 526201 633884 784417 977981 1063186 1028653 983821 956506 871807 649874
-28950F49874J4422l5428j41537n6779l8827K1363J10070J3461k5677K407P1367O0552p6293
$$ 649874 664296 628868 487331 430552 391725 413088 523158 536619 510942 513349 584716 645268 568975
-28937E68975j21370q1911o1330K26J16851J15589L6805J01488j1908j63801N0870J19651
$$ 568975 447605 365694 304364 304590 421441 537030 573835 675323 663415 499614 550484 670135
-28925F70135J23124M9180j08107p2886k389P2908J9948j06375j82707M5637J31857N3066
$$ 670135 793259 842439 734332 661446 659057 731965 751913 645538 462831 508468 640325 693391
-28913F93391Q0878J04080K4159j39102j17830l4956L3967J24825o1496r1579q9428j53814
$$ 693391 774269 878349 902508 763406 645576 610620 644587 769412 707916 616337 526909 373095
-28901C73095L9301J07022N133l2493R5950J5013m4306M5561M6483m7614o0126l6861P7106
$$ 373095 412396 519418 524551 492058 588008 603021 558715 604276 650759 603145 543019 506158 583264
-28888E83264m4900m5921Q7744o8241r4835N7071Q3165l6393M6149L3789q43O6018K7159J3889
$$ 583264 538364 492443 580187 511946 417111 474182 557347 520954 567103 600892 600049 666067 693226 707115
-28874G07115N1625K4414O5880l9744n4898n813J1367n6661j1154J2138j01014o8744l4419
$$ 707115 758740 783154 849034 809290 754392 748579 759946 703285 692131 704269 603255 534511 500092
-28861E00092J9488j5719J9336M0981J90161L7874q6294j30052j7362P6012P3789M9690K08099
$$ 500092 519580 503861 523197 564178 754339 792213 705919 575867 558505 634517 708306 757996 966095
-28848I66095J41739l3161k8529o0832q1749j15914o3765j09352j34963j4202N9867m588L3030
$$ 966095 1107834 1074673 1046144 985312 903563 787649 723884 614532 479569 465367 525234 520646 553676
-28835E53676m8361n5400K3787j1325j6169m5072l2154P8325R9465K9998O6213P7420n4881
$$ 553676 505315 449915 473702 462377 446208 401136 368982 447307 546772 576770 642983 720403 665522
-28822F65522j0686p6888m1759N4076K4772J59423J46541M6442M0228n0406j93885k20841
$$ 665522 654836 577948 536189 590265 615037 774460 921001 967443 1007671 957265 763380 542539
-28810E42539r1958K01919R7458J7421L7519J4728m2086l9200O0917J6161O504J7401j24096
$$ 542539 450581 652500 749958 767379 804898 819626 777540 738340 799257 815418 821922 839323 715227
-28797G15227k06978R23J08545Q4981l1748k7233M3154k7692j7694N947J09660P5560n3308
$$ 715227 508249 509172 617717 702698 670950 643717 686871 659179 641485 647432 757092 832652 779344
-28784G79344j47714l7109P9176O60J5909o9346j3469O218M0912R0651N075L583l5865k5070
$$ 779344 631630 594521 673697 674357 690266 620920 607451 613669 654581 745232 750307 753890 718025 692955
-28770F92955J09355O0759m4124l4276j19265j03911l1110l8860P4650r119K9912r413l4960
$$ 692955 802310 863069 818945 784669 665404 561493 530383 491523 566173 557054 586966 577553 542593
-28757E42593M6639O5148J02572Q1007o0318j88164m6838o882n2986M8557M6505j3491o3149
$$ 542593 589232 654380 756952 837959 777641 589477 542639 535757 482771 531328 577833 564342 501193
-28744E01193k708K4996k3924l6205j35971m6776J18112J17027J05513L4128r9372m4631O1463
$$ 501193 498485 523481 499557 463352 327381 280605 398717 515744 621257 655385 556013 511382 572845
-28731E72845Q251k7575k0439j3784o242L6924L4268j07730j70292J2620K06665R2261l9572
$$ 572845 581096 553521 533082 519298 513056 549980 584248 476518 306226 318846 525511 617772 578200
-28718E78200m4317J2210k9292o5570M6380q76o8570k0312O7083L4059o5165K8266K66437
$$ 578200 533883 546093 516801 451231 497611 496735 428165 407853 474936 508995 443830 472096 738533
-28705G38533J86909N7818o8390k8280J45169O9811n4547k22915j65518M4033L7878k1380
$$ 738533 925442 983260 914870 886590 1031759 1101570 1047023 824108 658590 702623 740501 719121
-28693G19121L1810Q3786j78324j72710L6940R9520m325k339J6389N0871M6068K4969o8887
$$ 719121 750931 834717 656393 483683 520623 620143 615818 613479 629868 680739 726807 751776 682889
-28680F82889l2325Q2485J14385L2687m0580q4319K4439M0186k8346l1996P2065J15486M0501
$$ 682889 650564 733049 847434 880121 839541 755222 779661 819847 791501 759505 831570 947056 987557
-28667I87557n5715j30043o184p7831J2236J04096J2576k086M4546K1262l6479l0561k3550
$$ 987557 931842 801799 795615 717784 730020 834116 846692 844606 889152 910414 873935 843374 819824
-28654H19824r6261l6566m171k7841r9397j17807j3939Q3442Q9145P2849O2657J408O6561
$$ 819824 723563 686997 682826 654985 555588 437781 423842 507284 596429 669278 731935 733343 799904
-28641G99904J12665R888K80K3554q0232r0783p0214M9362J11088Q025q6199O3470M7832j30527
$$ 799904 912569 922457 922737 946291 866059 775276 705062 754424 865512 873537 787338 850808 898640 768113
-28627G68113k16166N7040J12556J07831L5656j4145k3039q2144k8627M0220Q360L3681n0060
$$ 768113 551947 608987 721543 829374 865030 850885 827846 745702 717075 757295 765655 799336 749276
-28614G49276j36558K1398L3574M5861j21116l8308J25112P4056L6174j6458k847j28537o2726
$$ 749276 612718 634116 667690 713551 592435 554127 679239 753295 789469 773011 770164 641627 578901
-28601E78901J00503J01571N0683j9875j31906j25839r6713j8163O8622O9110m1560j83471
$$ 578901 679404 780975 831658 811783 679877 554038 457325 439162 507784 576894 535334 351863
-28589C51863o7512Q7078N7021P6080J29700N8907O1719N5458j864k3078l6456J7496P4189
$$ 351863 284351 371429 428450 504530 634230 693137 754856 810314 808450 785372 748916 766412 840601
-28576H40601j368j8382m1512N0899o2966j97061r537J47552K1739L3266J19433n3978j19011
$$ 840601 839233 820851 779339 830238 767272 570211 560674 708226 729965 763231 882664 828686 709675
-28563G09675J5930R6525l0500q6091k4653L1231J18554n2419m5868N4196r8149j49849m9966
$$ 709675 725605 822130 791630 705539 680886 712117 830671 778252 732384 786580 688431 538582 488616
-28550D88616L9121p7032p934Q0258J93986K74890J0188j05731j6658j31610j98164m4208
$$ 488616 527737 450705 442771 523029 717015 991905 1002093 896362 879704 748094 549930 505722
-28538E05722P3365N6361l7446O0093Q9134O6340J15310O1647j32270j16707p0967k9164L5837
$$ 505722 579087 635448 598002 658095 747229 813569 928879 990526 858256 741549 670582 641418 677255
-28525F77255J30167l4507n5230K5858O0932n3329l9718M9157K982M6969J04529l0891j23721
$$ 677255 807422 772915 717685 743543 804475 751146 711428 760585 763567 810536 915065 884174 760453
-28512G60453r5500q2288o6311j4392J35938J16311N0419O7366N2256m267p323m3329n5767
$$ 760453 664953 582665 516354 501962 637900 754211 804630 871996 924252 919985 912662 869333 813566
-28499H13566L5025m3704l6042r7383N824L2422N2519O7626L7772P5054P979J4176j6706k8163
$$ 813566 848591 804887 768845 671462 677286 709708 762227 829853 867625 942679 950658 964834 948128 919965
-28485I19965k9795j30738m1719r5109q0683Q6571p1446p8514J03973L38761Q0574k63799
$$ 919965 890170 759432 717713 622604 541921 628492 557046 478532 582505 921266 1001840 738041
-28473G38041r7600m1521K4560J5402M5854O6880L8116o5108m9535O4376P9542K5633m4870
$$ 738041 640441 598920 623480 638882 684736 751616 789732 724624 675089 739465 819007 844640 799770
-28460G99770N2900l4473r4470m1020j7466o5313J07429K35311Q8431m1318n185j21442j69265
$$ 799770 852670 818197 723727 682707 665241 599928 707357 942668 1031099 989781 984596 863154 693889
-28447F93889l5874N3060J35543R5117O0471n0484j38092q6172N9833O1497j05899j15372
$$ 693889 658015 711075 846618 941735 1002206 951722 813630 727458 787291 848788 742889 627517
-28435F27517k3355n244O1714L2273J37190N1621m7929j17127o1747M9301P2457P868j08124
$$ 627517 604162 598918 660632 692905 830095 881716 833787 716660 654913 704214 776671 784539 676415
-28422F76415j56941k7943Q6863J76771R0733L73l9575K5248n9931j87765m7859Q9335J24793
$$ 676415 519474 491531 578394 755165 845898 846271 806696 831944 772013 584248 536389 625724 750517
-28409G50517o560n2670l5419J5140r4473k79764r2226J23780J44606K8560K6771J51574R8627
$$ 750517 743957 691287 655868 671008 576535 296771 204545 328325 472931 501491 528262 679836 778463
-28396G78463m970q9339j0909R7440M7848k0156o1913j15421N3839l6063k14152p2086Q6803
$$ 778463 773493 684154 673245 770685 818533 798377 736464 621043 674882 638819 424667 352581 439384
-28383D39384j3306L3693O2452M3816j6125j2287N8475P2488J89369N2924o0079q651M2196
$$ 439384 426078 459771 522223 566039 549914 537627 596102 668590 857959 910883 850804 842153 884349
-28370H84349J59352M6541j73983j51188o039j1213n1693m3577l1413L1899J03280q1587j33578
$$ 884349 1043701 1090242 916259 765071 759032 747819 696126 652549 621136 653035 756315 674728 541150
-28357E41150M2050R2162p8478j30844N2078K7331O2241R213O985N9239J65599Q3729J71799
$$ 541150 583200 675362 596884 466040 518118 545449 607690 616903 623888 683127 848726 932455 1104254
-28344A104254j1933k90928l0667N0356J30385J1620J8512M5385j75323j42067Q568k4697
$$ 1104254 1092321 801393 770726 821082 951467 963087 981599 1026984 851661 709594 718162 693465
-28332F93465j0610m5909p1805p4395N913M683L1391J36526J50706k1655n2765n5507L9373
$$ 693465 682855 636946 565141 490746 496659 501342 532733 669259 819965 798310 745545 690038 729411
-28319G29411N7150m6006j16027N1683p0721q4086O0949n0953k2220P5004J2974M7040L4693
$$ 729411 786561 740555 624528 676211 605490 521404 582353 531400 509180 584184 597158 644198 678891
-28306F78891k8535m7328n0868R049p8220M1280K05830J77421j41j25270j9426k1494j08275
$$ 678891 650356 603028 552160 561209 482989 524269 730099 907520 907379 782109 762683 741189 632914
-28293F32914m7758J00978Q9185O176p0899j35637p2722Q6598R4882J19169J63286j3685k33842
$$ 632914 585156 686134 775319 781495 710596 574959 502237 588835 683717 802886 966172 952487 718645
-28280G18645k07727l4152O6276R4563J5767r8218k7988Q6210L5755j387M7688O4036P1200
$$ 718645 510918 476766 543042 637605 653372 555154 527166 613376 649131 647744 695432 759468 830668
-28267H30668J42369J5810j80202o5263o3164j65484r4912M5012K22134J10028n8560j09792
$$ 830668 973037 988847 808645 743382 680218 514734 419822 464834 686968 796996 738436 628644
-28255F28644j8081J06727J01487K293j29310o2368r595j22709P9181J33384J18506J15532
$$ 628644 610563 717290 818777 821070 691760 629392 619797 497088 576269 709653 828159 943691
-28243I43691N1297j20395k68978r4196n5880p8214m1120o9872M9189N8419J34311K03773
$$ 943691 994988 874593 605615 511419 455539 377325 336205 266333 315522 373941 508252 712025
-28231G12025J08112o0741k4352o2571k7585m8953j41926M8519J90238J20112p4341l3597
$$ 712025 820137 759396 735044 672473 644888 595935 454009 502528 692766 812878 738537 704940
-28219G04940j40886j38265m2098J42840J81707N1042r5031j5495Q0360M8848j1195n3238
$$ 704940 564054 425789 383691 526531 708238 759280 664249 648754 729114 777962 766767 713529
-28207G13529P4561O7596j7240k3988o147n520N7908o6647l2014Q0789N4330k705N407j3741
$$ 713529 788090 855686 838446 814458 808311 802791 860699 794052 762038 842827 897157 894452 899859 886118
-28193H86118k7938Q628Q5823N773p0119r8566M2024J37860M5664n4714j16366j69425j8688
$$ 886118 858180 866808 952631 958404 888285 789719 831743 969603 1015267 960553 844187 674762 656074
-28180F56074p8184o0911k4284M107J1905j1593J03420P7794L350k0381j1244P642q5462r4600
$$ 656074 577890 516979 492695 496802 508707 497114 600534 678328 681678 661297 650053 657695 572233 477633
-28166D77633L917J06983K21566K2511j22055j73676l5863J14575K3289o901J8367N2195Q3768
$$ 477633 481550 588533 810099 832610 710555 536879 501016 615591 638880 631979 650346 702541 786309
-28153G86309J911k2238q8128j11921L6323Q9900M5539K827n1105l9289J1439J15009J14817
$$ 786309 788220 765982 677854 565933 602256 692156 737695 740522 689417 650128 661567 776576 891393
-28140H91393j3076L6123L1445m9741q5409L6729j6217m6337K0617o2876p9458j56182q4777
$$ 891393 878317 914440 945885 896144 810735 847464 831247 784910 805527 742651 663193 507011 422234
-28127D22234O3312j0182R2848Q7038p2076J09078J72121P3141N507j16247j07899j9077j43356
$$ 422234 485546 475364 568212 655250 583174 692252 864373 937514 943021 826774 718875 699798 556442
-28114E56442j32377q5173m5377L7773l1212l0775P8107L30178K23242j37011p5388L5700
$$ 556442 424065 338892 293515 331288 300076 269301 347408 677586 900828 763817 688429 724129
-28102G24129L2723m1711j21105o3004p9695m6327o681j6683M6693J01627J18390J34113k5545
$$ 724129 756852 715141 594036 531032 451337 405010 398329 381646 428339 529966 648356 782469 756924
-28089G56924q2991M5859l6675j22603Q3725J96802P6186k7826p1695J9475J4207q2917k0786
$$ 756924 673933 719792 683117 560514 644239 841041 917227 889401 817706 837181 851388 768471 747685
-28076G47685J41398J27469O129j30902n2538l9204k4668P5347K9681j3145j0685m1706j03415
$$ 747685 889083 1016552 1022681 891779 839241 800037 775369 850716 880397 867252 856567 814861 711446
-28063G11446l5543P0652J9513j5037p307K9140R7880R7349o7050j03177p9777l6903M6676
$$ 711446 675903 746555 766068 751031 743724 772864 870744 968093 901043 797866 718089 681186 727862
-28050G27862J1823K0357J93718P0290j47478j44010o2279M5195R9689p7815k8689J07853
$$ 727862 739685 760042 953760 1024050 876572 732562 670283 715478 815167 737352 708663 816516
-28038H16516N7138Q8469o8123p1873j0734k0561k3931n9373J5240o2083M0202P7853L5560
$$ 816516 873654 962123 894000 822127 811393 790832 766901 707528 722768 660685 700887 778740 814300
-28025H14300Q334J4020L8541J34838J24317l2871j39453j86668o1526o4305j45762q7593
$$ 814300 822634 836654 875195 1010033 1134350 1101479 962026 775358 713832 649527 503765 416172
-28013D16172k5629M9736N8439L9796N4376m1165m4342J65962K17590J1876j46911j99604
$$ 416172 390543 440279 498718 538514 592890 551725 507383 673345 890935 902811 755900 556296
-28001E56296L8344J93384N3782Q33O2255J298j06846r1078o2277j29480j50119L2880J46508
$$ 556296 594640 788024 841806 842639 904894 906192 799346 708268 645991 516511 366392 399272 545780
-27988E45780o1648j12231N0862J61066p4651j54632o7014l0677O2163Q9130K9915p191N5065
$$ 545780 484132 371901 422763 583829 509178 354546 287532 256855 319018 408148 438063 430872 485937
-27975D85937R2806J40854P6488K5909M1278l8735n7018r8069n7447M4578j08290O2212J49179
$$ 485937 578743 719597 796085 821994 863272 824537 767519 669450 612003 656581 548291 610503 759682
-27962G59682M5800j11129j51242J8351L5615L5643O1824L2011j8185n3450J25742R0042p221
$$ 759682 805482 694353 543111 561462 597077 632720 694544 726555 708370 654920 780662 870704 863483
-27949H63483q8731N3238L7517k4680k5730j04734q1047R4904k5297m4694J17574O72p6510
$$ 863483 774752 827990 865507 840827 815097 710363 629316 724220 698923 654229 771803 772475 695965
-27936F95965j15552N695O2461L1225o9218L8784J32269k3947l6200j08998p324J17804L3563
$$ 695965 580413 586108 648569 679794 610576 649360 781629 757682 721482 612484 605160 722964 756527
-27923G56527O5520N9203q6599j25886n7871J5734L9517J60787M5447n9459k8887m1922M8132
$$ 756527 822047 881250 794651 668765 610894 626628 666145 826932 872379 812920 784033 742111 790243
-27910G90243N4684m1485j16085k33916j8520J87879L8947o356p5035r6288m1255o8966L4186
$$ 790243 844927 803442 687357 453441 434921 622800 661747 655391 580356 484068 442813 373847 408033
-27897D08033N7955Q5516M7720q0951M5825Q9114O5278j0755k2276o951k7512K7741K4391
$$ 408033 465988 551504 599224 518273 564098 653212 718490 707735 685459 678508 650996 678737 703128
-27884G03128M244p6110J3001k3320r5171O7998J2417r4587K0135J07604m6320L6052p652
$$ 703128 707372 631262 644263 620943 525772 593770 606187 511600 531735 639339 593019 629071 621419
-27871F21419q1319J9M9585R8679K8108k2928L6967l0383p2707k4814n9503P663O6813J21390
$$ 621419 540100 540119 589704 688383 716491 693563 730530 700147 627440 602626 543123 550786 617599 738989
-27857G38989k3517R75r7248j19235n3931J8263J6919J8191q7157p9779L4773M1643J17939
$$ 738989 715472 716447 619199 499964 446033 464296 481215 499406 412249 332470 367243 408886 526825
-27844E26825M617q8820j62419P3522K44302N2491j0600O4951m4727j47363n6423n5656l0820
$$ 526825 531442 442622 280203 353725 598027 650518 639918 704869 660142 512779 456356 400700 369880
-27831C69880J2555J16071K17282Q0463p6922o5698o2974N3875O1079K7917M9647j1520j038
$$ 369880 382435 498506 715788 796251 719329 653631 590657 644532 705611 733528 783175 771655 770617
-27818G70617n0698K5312P9623m3963j45629r8968N2846N885J7158P6350P0600J08843l6473
$$ 770617 719919 745231 824854 780891 635262 536294 589140 595025 612183 688533 759133 867976 831503
-27805H31503K2364K1996o3941j25140L6248J78801L2615k985N3040J1450O8108K843n8085
$$ 831503 853867 875863 811922 686782 723030 901831 934446 931461 984501 995951 1064059 1066902 1008817
-27792A008817n9864j38547q2533n4917k6679J68529J14894M4717l9207q4452q6440n8599
$$ 1008817 948953 810406 727873 672956 646277 814806 929700 974417 935210 850758 764318 705719
-27780G05719P340m1261j09676p9183o4187k0625J18514J13702M0383L7839N9292M3203l4756
$$ 705719 713059 671798 562122 482939 418752 398127 516641 630343 670726 708565 767857 811060 776304
-27767G76304n2829L5070L7792r396J62601J27787m3838q9291r610O1718l2470j72433j62547
$$ 776304 723475 758545 796337 786941 949542 1077329 1033491 944200 934590 996308 963838 791405 628858
-27754F28858O3938J54121O944j41601j20272P2113L7764j3887r8707p4248l1768M6298R4933
$$ 628858 692796 846917 853861 712260 591988 664101 701865 687978 589271 515023 483255 529553 624486
-27741F24486O8577r9433l3053K640l2608J06530Q4109R1883N4576k1749o2112M8256Q9563
$$ 624486 693063 593630 560577 563217 530609 637139 721248 813131 867707 845958 783846 832102 921665
-27728I21665n3550K040J0951k2169O4532N9858o5883p8666L4751N5578r2196r6762n6740
$$ 921665 868115 870155 881106 858937 923469 983327 917444 838778 873529 929107 836911 740149 683409
-27715F83409R6790P0599n0472L789P4809N3729Q2119q191p8165r9114r3048j67212k5942
$$ 683409 780199 850798 800326 804115 878924 932653 1014772 1006581 928416 829302 736254 569042 543100
-27702E43100l1825K027M645J2865J51740J30081j0372q6343q6065J4450J19528l4823J614
$$ 543100 511275 513302 517947 530812 682552 812633 802261 715918 629853 644303 763831 729008 730622
-27689G30622j6872l6215m617N6529Q7945K3523L2727k8027r1115m4604n7166n5750o4721
$$ 730622 713750 677535 672918 729447 817392 840915 873642 845615 754500 709896 652730 596980 532259
-27676E32259l2939n6860K3560J08573N2914J2060l0970P5491m1560n8080Q7050P8065N6886
$$ 532259 499320 442460 466020 574593 627507 639567 608597 684088 642528 584448 671498 749563 806449
-27663H06449P9271j76141j69193J36648O8861j59046q3718P7730K1169J6315N7245M0572
$$ 806449 885720 709579 540386 677034 745895 586849 503131 580861 602030 618345 675590 716162
-27651G16162J05746O170l4140J317J24619J15073K1063l2481j70383j09638n1746j2017N9504
$$ 716162 821908 828078 793938 795255 919874 1034947 1056010 1023529 853146 743508 691762 679745 739249
-27638G39249L6410l2385K604J2931M94M2861J28355N5089j10568r8557J8218K5441j9887
$$ 739249 775659 743274 745878 758809 759303 802164 930519 985608 875040 776483 794701 820142 800255
-27625H00255n2229m8736j03084o5974Q6717J28512R1935O8895k02036j38331J08239K14275
$$ 800255 748026 699290 596206 530232 616949 745461 837396 906291 704255 565924 674163 888438
-27613H88438J00125j03087o2145p0119r7073m0168P9399P5890l7205j44422k7741L6742Q1915
$$ 888438 988563 885476 823331 753212 656139 615971 695370 771260 734055 589633 561892 598634 680549
-27600F80549J58057L878p2786l8338K3037N3664j43213J3535R4967J8978j04578P204O1077
$$ 680549 838606 842484 769698 731360 754397 808061 664848 678383 773350 792328 687750 694954 756031
-27587G56031k1116o9113M3980K7471j8729J8693m4674N4605k9700j88227j19383M0778Q2435
$$ 756031 734915 665802 709782 737253 718524 737217 692543 747148 717448 529221 409838 450616 533051
-27574E33051N4801N8922P2958N0217j4510Q532Q6420P4047K8154l5466j9079j8546j00507
$$ 533051 587852 646774 719732 769949 755439 763971 850391 924438 952592 917126 898047 879501 778994
-27561G78994O235J24637K2593j43759j08244J25348O2r4473M8603K05554J21021l8862j50302
$$ 778994 785229 909866 932459 788700 680456 805804 805866 711393 759996 965550 1086571 1047709 897407
-27548H97407k37246j16453j0573j2724J17870J10023K4572J01089Q3536j0801k3780n8045
$$ 897407 660161 543708 533135 520411 638281 748304 772876 873965 957501 946700 922920 864875
-27536H64875l5545j268K7966L8419R6852p3692j88774K6761Q7837k9527k0863Q79M5256m7329
$$ 864875 829330 828062 856028 894447 991299 917607 728833 755594 843431 813904 793041 793920 839176 791847
-27522G91847k7134p005j20385j4618Q6451j15833n4419J00671J26112J59574J5688r5587
$$ 791847 764713 757708 637323 622705 709156 593323 538904 639575 765687 925261 940949 845362
-27510H45362j4454o2565k6406l8855q0764L6787M0859j39920q4040J18443N930j56685J24714
$$ 845362 830908 768343 741937 703082 622318 659105 699964 560044 476004 594447 600377 443692 568406
-27497E68406J78196N602l3045j0879P9169n0035r597J13608n699r2083m0442m8811q4677
$$ 568406 746602 752204 719159 708280 787449 737414 727817 841425 835726 743643 703201 654390 569713
-27484E69713j61841j74603J28210J37806K3546O0003m29l099J54620Q2172k7356k3028L7585
$$ 569713 407872 233269 361479 499285 522831 582834 582405 579306 733926 816098 788742 765714 803299
-27471H03299O4102j91459j9783O6059J9693L0347N3933M1783o0734j28042n5326n6516o7100
$$ 803299 867401 675942 656159 722218 741911 772258 826191 867974 807240 679198 623872 567356 500256
-27458E00256J18269J46934J8367j77355j30151j7347J6897j4268N3060J24497J12662O4108
$$ 500256 618525 765459 783826 606471 476320 458973 475870 461602 514662 639159 751821 815929
-27446H15929O2133J07879k3989r108Q95m4483M2555n6993j53315p0600k1025J8795K4798
$$ 815929 878062 985941 961952 952844 953739 909256 951811 894818 741503 670903 649878 668673 693471
-27433F93471J1426k5747K2720K2993l3988j17878n2434K7413J60310R0782j98018j84817
$$ 693471 704897 679150 701870 724863 690875 572997 520563 547976 708286 799068 601050 416233
-27421D16233L8276K2925n2482K9154L6719P929J06931J13797J1323N3619k1778m4162r9113
$$ 416233 454509 477434 424952 454106 490825 498754 605685 719482 730805 784424 762646 718484 619371
-27408F19371n3574K5987K74O0752R1967K6726r0813j30337P6652k041m7985L4451j5775j67943
$$ 619371 565797 591784 592058 652810 744777 771503 680690 550353 627005 624964 576979 611430 595655 427712
-27394D27712p0636M9911J34295N8529M0492K8175j51102k8630J06119K5439L7652J47355
$$ 427712 357076 406987 541282 599811 640303 668478 517376 488746 594865 620304 657956 805311
-27382H05311J83192p1970j80302o4661R163J31218J23723n9965j11748o751R4126j7686j41477
$$ 805311 988503 916533 736231 671570 680733 811951 935674 875709 763961 757210 851336 833650 692173
-27369F92173j56386k3996l7448l6820J59396j8823q2311r206j8969R5079J41351L5879q7964
$$ 692173 535787 511791 474343 437523 596919 578096 495785 486579 467610 562689 704040 739919 651955
-27356F51955k7160J8491O3323n683j70414j01954J06783Q2277N8889k1349o2627k2483Q4394
$$ 651955 624795 643286 706609 700926 530512 428558 535341 617618 676507 655158 592531 570048 654442
-27343F54442Q8904k3431L218j9810j75903M758J15625N6509l7954j2643J06621J5211o9702
$$ 654442 743346 719915 723133 703323 527420 532178 647803 704312 666358 653715 760336 775547 705845
-27330G05845J1643O8860p0983r387J9964J3891j9931n0033n5274r7413O7792J42026k1350
$$ 705845 717488 786348 715365 705978 725942 739833 719902 669869 614595 517182 584974 727000 705650
-27317G05650r5041N7498J00921M0434m0175N2134N2649n4181q6572K8834J5612o2351o2062
$$ 705650 610609 668107 769028 809462 769287 821421 874070 819889 733317 762151 777763 715412 653350
-27304F53350L464p2744r2309j0827J27587J36504J22576K8849l236j7528j04174O506J93565
$$ 653350 656814 584070 491761 480934 608521 745025 867601 896450 893214 875686 771512 778018 971583
-27291I71583J74403n6465r4008J21413k7141k14270k56448m8017K60262J40707k7509j45403
$$ 971583 1145986 1089521 995513 1116926 1089785 875515 619067 571050 831312 972019 944510 799107
-27279G99107j28921N1010J22127N9224r4711j74779j05892q6407J10142J08283L9654m1168
$$ 799107 670186 721196 843323 902547 807836 633057 527165 440758 550900 659183 698837 657669
-27267F57669j50824j26011q5490p5842j8242M3043J67922K29489K26965O6139j81187k47222
$$ 657669 506845 380834 295344 219502 201260 244303 412225 641714 868679 934818 753631 506409
-27255E06409r5312R1739J5821P0628J09337K3261r2612K6289J94851M4460l7693j37101j81828
$$ 506409 411097 502836 518657 589285 698622 721883 629271 655560 850411 894871 857178 720077 538249
-27242E38249m1718J09999P8184j2865R5486J75118J56823j4451j36661P5306M0588o3948
$$ 538249 496531 606530 684714 671849 767335 942453 1099276 1084825 948164 1023470 1064058 1000110
-27230A000110m2501r3642j0P1086j00779j07127J3007K6142j687K4105n2882n0713j17661
$$ 1000110 957609 863967 863957 935043 834264 727137 740144 766286 764599 788704 735822 685109 567448
-27217E67448Q9398J36140n684n5372m768J90220J19306p810l1221n4209j32447R740M2194
$$ 567448 656846 792986 787302 731930 727162 917382 1036688 1028878 997657 943448 811001 820741 862935
-27204H62935j05363m2857J0000N7003Q5670Q0743J6068l6184j17531j40164j56461r6414
$$ 862935 757572 714715 724715 781718 867388 948131 964199 928015 810484 670320 513859 417445
-27192D17445J61230J86015m2186q210k7064r6368J0825P5929M7497m782m0611R3550O1192
$$ 417445 578675 764690 722504 714294 687230 590862 601687 677616 725113 720331 679720 773270 834462
-27179H34462M2259P3867j3205k9035K6500j966j03316j77867l1872Q1902n2828k6637Q7348
$$ 834462 876721 950588 937383 908348 934848 932882 829566 651699 619827 701729 648901 622264 709612
-27166G09612K7064j35013j47212J02363J85384m5100p4538q864M7984M9708M6972R3315P4915
$$ 709612 736676 601663 454451 556814 742198 697098 622560 613696 661680 711388 758360 851675 926590
-27153I26590P4208J7051p4382j2749j4227j31099l634j030j06344L5598J45597n499o6563
$$ 926590 1000798 1017849 943467 930718 916491 785392 781758 780728 674384 709982 855579 850080 783517
-27140G83517O9935J49705L1789o3619j37575j49880r0086J05856k9040L7905J28065q6053
$$ 783517 853452 1003157 1034946 971327 833752 683872 593786 699642 670602 708507 836572 750519
-27128G50519j54327j4098M3492J43413N2696q4205k7588J75363R4696n2902p2204m7487r8047
$$ 750519 596192 582094 625586 768999 821695 737490 709902 885265 979961 927059 854855 807368 709321
-27115G09321p7945j3294o1967o328O6050M7670Q3234J05120l611j42267j40275n6154O6388
$$ 709321 631376 618082 556115 549787 615837 663507 746741 851861 848250 705983 565708 509554 575942
-27102E75942n3851n4616O3834L1321K1269M3263J4330j0493K6050L553J02833J02491K6021
$$ 575942 522091 467475 531309 562630 583899 627162 641492 630999 657049 660602 763435 865926 891947
-27089H91947L7636j33385j08374L9209M952r0426j01293j6132j5791R1458M8942Q6654L9100
$$ 891947 929583 796198 687824 727033 731985 641559 540266 524134 508343 599801 648743 735397 774497
-27076G74497q2884j00018j4498L1562J69315R8831j1373N2248J18989l1268n9226J7346O1921
$$ 774497 691613 591595 577097 608659 777974 876805 865432 917680 1036669 1005401 946175 963521 1025442
-27063A025442L3603p2205j16257j60866l6163L9024L3071l9693o3463O9400P4120O6534J03182
$$ 1025442 1059045 986840 870583 709717 673554 712578 745649 705956 642493 711893 786013 852547 955729
-27050I55729J84965Q343k09853k49314m3117J31810L8984J6757J16406L393p9951N2603J00103
$$ 955729 1140694 1149037 939184 689870 646753 778563 817547 834304 950710 954103 874152 926755 1026858
-27037A026858Q1353K8534n019L6271k6380l9002l1604j21863j15349j53377n8695J0934L5962
$$ 1026858 1108211 1136745 1131726 1167997 1141617 1102615 1071011 949148 833799 680422 621727 632661 668623
-27024F68623Q2879J81169J30346j22998J6074J58839j1711K1187j01678j29949j26386j9346
$$ 668623 751502 932671 1063017 940019 956093 1114932 1103221 1124408 1022730 892781 766395 747049
-27012G47049N1236O7841M2001L8012J79651J25343J11638M4036m0023q2135o2810j32011
$$ 747049 798285 866126 908127 946139 1125790 1251133 1362771 1406807 1366784 1284649 1221839 1089828
-27000A089828j12729k6502j3511o4226N7987J02674j9990j24794J1279o041j28146m3161
$$ 1089828 977099 950597 937086 872860 930847 1033521 1013531 888737 900016 893975 765829 722668
-26988G22668j4825O3440P2291j3284l6085l6683k280P2176P8769K9744n0081J11931J58468
$$ 722668 707843 771283 843574 830290 794205 757522 755242 827418 906187 935931 885850 997781 1156249
-26975A156249J01405j22871j49720p4258q6245L2410Q5849M1708P0473j1681n4681M1514
$$ 1156249 1257654 1134783 985063 910805 824560 856970 942819 984527 1055000 1043319 988638 1030152
-26963A030152Q9659O7240L3131M0000j05628p19N1645j46842q8246J1532J44037Q2964O7521
$$ 1030152 1119811 1187051 1220182 1260182 1154554 1153835 1205480 1058638 970392 981924 1125961 1208925 1276446
-26950A276446O7450r4614k58311j69992O8745L4665J09634J20641K03463J09838p1138j08027
$$ 1276446 1343896 1249282 990971 820979 889724 924389 1034023 1154664 1358127 1467965 1396827 1288800
-26938A288800k6299k7739j61335m7665L1638j17643j76575J6527J00441J98481J09986j5542
$$ 1288800 1262501 1234762 1073427 1025762 1057400 939757 763182 779709 880150 1078631 1188617 1173075
-26926A173075N3081P6818J62997K16910O3264j23272p1319j16107j18957O3672K71117J31709
$$ 1173075 1226156 1302974 1465971 1682881 1746145 1622873 1551554 1435447 1316490 1380162 1651279 1782988
-26914A782988r798n4643k6897J22514R2894p4493k52608q9078R6707n3072j48098n6844K1696
$$ 1782988 1773190 1718547 1691650 1814164 1907058 1832565 1579957 1490879 1587586 1534514 1386416 1329572 1351268
-26901A351268k4552j0926N519o2273j50779j63795K6358P8109P7692j9843j58830j04146
$$ 1351268 1326716 1315790 1321309 1259036 1108257 944462 970820 1048929 1126621 1106778 947948 843802
-26889H43802m5952n864n4511K7178J7212n8876M1634k0848o2801P3956Q2205j6523k4901
$$ 843802 797850 791986 737475 764653 781865 722989 764623 743775 680974 754930 837135 820612 795711
-26876G95711m309J1691q8861P250J36785R3318J07414j0524m8343l4130J53006J51087p6679
$$ 795711 791402 803093 714232 721482 858267 951585 1058999 1048475 1000132 966002 1119008 1270095 1193416
-26863A193416p49Q4859J27153K2434p4J44389M057o3296l0963j00856q4181p3492m2480q9338
$$ 1193416 1192667 1277526 1404679 1427113 1427039 1571428 1575485 1512189 1481226 1380370 1296189 1222697 1180217 1090879
-26849A090879N0376K17034J38143K1465k1972P002j11550j85312o6981k7391q4631J0982
$$ 1090879 1141255 1358289 1496432 1517897 1495925 1502927 1391377 1206065 1139084 1111693 1027062 1038044
-26837A038044M9768o6697j31250J247N7452M5220O34J5099J6886K8635K8260N3100M2277
$$ 1038044 1087812 1021115 889865 891112 948564 993784 994418 1009517 1026403 1055038 1083298 1136398 1178675
-26824A178675J4097r4766j75878o2099P2172M8480j0692N3237j383j72623l5727j10547k05055
$$ 1178675 1192772 1098006 922128 860029 932201 980681 969989 1023226 1021843 849220 813493 702946 497891
-26811D97891m7601J00396K3334m1341o8099P0976K17644K26093o1089l05952p5364K22574
$$ 497891 450290 550686 574020 532679 464580 535556 753200 979293 918204 612252 536888 759462
-26799G59462K24665k4051j59446j45477r5829k2652J67034R4822l9452o7444p6839N3806
$$ 759462 984127 960076 800630 655153 559324 536672 703706 798528 759076 691632 614793 668599
-26787F68599L8489j15629r4513q6965n8658J70044J17685J7740J23819J0718j45376q8538
$$ 668599 707088 591459 496946 409981 351323 521367 639052 656792 780611 791329 645953 557415
-26775E57415L5358M4912j09412o2985J23084J29059P2856J4367Q513J09171L6295M2691J8829
$$ 557415 592773 637685 528273 465288 588372 717431 790287 804654 813167 922338 958633 1001324 1020153
-26762A020153j77907p7744O3546P7035L0039N3759l5178q5342q8703j2648L9418K1202m2279
$$ 1020153 842246 764502 828048 905083 935122 988881 953703 868361 779658 767010 806428 827630 785351
-26749G85351j3412l0196O703N5438j3738m3284J1009N2L3882J10694r533m0534j8274K1181
$$ 785351 771939 741743 748446 803884 790146 746862 757871 757923 791805 902499 892966 852432 834158 855339
-26735H55339o6029L9034K422j30835J11176M6751j1528L2010o882m8504k1165j8199Q2669
$$ 855339 789310 828344 830766 699931 811107 857858 846330 878340 871458 822954 801789 783590 866259
-26722H66259J55905j04731r1228J9502K1494J02607K2890m3242o2492J7145P7433k5607l128
$$ 866259 1022164 917433 826205 845707 867201 969808 992698 949456 886964 904109 981542 955935 952807
-26709I52807M1058Q0775P351l747P1505m709r725o5807r4588j12001j31189j14813K0886
$$ 952807 993865 1074640 1081991 1078244 1149749 1145040 1135315 1069508 974920 862919 731730 616917 637803
-26696F37803L2351J47855J55242o493k02912j97437j7170O9617L4059Q3774R1047k2014k5932
$$ 637803 670154 818009 973251 966758 763846 566409 549239 618856 652915 736689 827736 805722 779790
-26683G79790K6004j32465k8922P8419r0590r4025n2816J61254J93359N2545j95225k32393
$$ 779790 805794 673329 644407 722826 632236 538211 485395 646649 840008 892553 697328 464935
-26671D64935M1935J64207J0989J067P2986N5155R7025J3950q7705j52946q379K1808n6603
$$ 464935 506870 671077 682066 683133 756119 811274 908299 922249 834544 681598 673219 695027 638424
-26658F38424m6786O7979O7099O7255O2546j7617N3676K9796j00120k6992K6630n5371M1585
$$ 638424 591638 659617 726716 793971 856517 838900 892576 922372 822252 795260 821890 766519 808104
-26645H08104J4202r658P5879J51346J41179o7278k0923N488j17319k81336j34472k9548J37844
$$ 808104 822306 812648 888527 1039873 1181052 1113774 1092851 1098339 981020 699684 565212 535664 673508
-26632F73508P5480K6780P3337j08535q9122R1045O5561q4452M688J10815J25869q7014k032
$$ 673508 748988 775768 849105 740570 651448 742493 808054 723602 728290 839105 964974 877960 875928
-26619H75928K04098Q324j60272q8750M1162j08552j74053O3506J2407l9209l5845J03454
$$ 875928 1080026 1088350 928078 839328 880490 771938 597885 661391 673798 634589 598744 702198
-26607G02198J92633J77904J2483p4241p1672j07518J5747K518l8888r3142j62224J6230J13596
$$ 702198 894831 1072735 1085218 1010977 939305 831787 847534 850052 811164 718022 555798 572028 685624
-26594F85624P9013m8729n0103l0379p8961l9820k4840J00349J51734Q8069m6208l1918P1443
$$ 685624 764637 715908 665805 635426 556465 516645 491805 592154 743888 831957 785749 753831 825274
-26581H25274J17739M3144p4148o1765m0490L3561J9116p7299j04398n0558j0514L2685M7043
$$ 825274 943013 986157 912009 850244 809754 843315 862431 785132 680734 630176 619662 652347 699390
-26568F99390j8418o1325P1470J34174R5293l7676j25662l5604L1224j1080M7292J5110M61
$$ 699390 680972 619647 691117 825291 920584 882908 757246 721642 752866 741786 789078 804188 804649
-26555H04649Q5500K11520J98975p2685j32135m789k0534j20272r2472q1294K4121P5246P269
$$ 804649 890149 1101669 1300644 1227959 1095824 1091035 1070501 950229 857757 776463 800584 875830 883099
-26542H83099L5294R1890M973j26844L7357K3047k5548L0803M6327l296m5149p3098j12042
$$ 883099 918393 1010283 1015256 888412 925769 948816 923268 954071 1000398 997102 951953 878855 766813
-26529G66813j09j3454j00707n2990J15691M2477n5710K4342K5496o4908j9006M3855K325
$$ 766813 766704 753250 652543 599553 715244 757721 702011 726353 751849 686941 667935 711790 714115
-26516G14115o1758j08833Q434J66045J86743M1647M316p2744O792l2857m1615r421L5037
$$ 714115 652357 543524 551958 718003 904746 946393 950709 877965 884757 851900 810285 800864 835901
-26503H35901m5717K1149R1269l4850L0391K6674j3313K2158Q1443Q6903p8192j96184j39698
$$ 835901 790184 811333 902602 867752 898143 924817 911504 933662 1015105 1102008 1023816 827632 687934
-26490F87934K5733R0983J3219j1073K6870L2687j713Q557k2353p1256q8787m3764k4814n952
$$ 687934 713667 804650 817869 806796 833666 866353 864640 873197 850844 779588 690801 647037 622223 616271
-26476F16271K03333J08427l5878R792m895j1091M6244K9436p2121k2519K1753q8386j960
$$ 616271 819604 928031 892153 901945 897050 885959 932203 961639 889518 866999 888752 800366 798406
-26463G98406M5917r9251m5470P2782M7577L5415l8293j79210o1706L6230O1832Q9450N6472
$$ 798406 844323 745072 699602 772384 819961 855376 817083 637873 576167 612397 674229 763679 820151
-26450H20151k0146n2024M7525J9292N5527R8877M3986J3172j34331l9696O3164J17732K055
$$ 820151 800005 747981 795506 814798 870325 969202 1013188 1026360 892029 852333 915497 1033229 1035284
-26437A035284j78777m8222q561J07425R2027k2044j02956k58335o1551J4989q5274K8210
$$ 1035284 856507 808285 799724 907149 999176 977132 874176 615841 554290 569279 484005 512215
-26425E12215J19237J12235J67918O3085q0492q3951j6596n6311p0089L7001P6599N2920J52
$$ 512215 631452 743687 911605 974690 894198 810247 793651 737340 667251 704252 780851 833771 833923
-26412H33923J72M2644n1257M4723m6600j13114p3981P0256J28110J54862m8311j50886L442
$$ 833923 834095 876739 825482 870205 823605 710491 636510 706766 834876 989738 941427 790541 793983
-26399G93983L2116R800P338J2573O5262J56262J2993k25980q2164N356m3705R466J0840Q3657
$$ 793983 826099 835899 843237 855810 921072 1077334 1090327 864347 782183 787539 743834 753300 764140 847797
-26385H47797j5059o2835q8590j05995M9552J21120O3855L4600r0648j8039J02261J06096
$$ 847797 832738 769903 681313 575318 624870 745990 809845 844445 753797 735758 838019 944115
-26373I44115M8846m2788J8307l6974j25743l2015r3441K979n8529N1171J78118L4167j00287
$$ 944115 992961 950173 968480 931506 805763 773748 680307 683286 624757 675928 854046 888213 787926
-26360G87926o522Q1966J4752j63107j58558n2846K01981K54338j08734j31923M9563Q9057
$$ 787926 781404 863370 878122 715015 556457 503611 705592 959930 851196 719273 768836 857893
-26348H57893N7292J38456m3425j79446k77688j61971J7756o9111j6042J01773J83453J34704
$$ 857893 915185 1053641 1010216 830770 553082 391111 408867 339756 323714 425487 608940 743644
-26336G43644k8308j70019j39834O1844K35034O5749M535m2170p451J00091L5144o5040p2111
$$ 743644 715336 545317 405483 467327 702361 768110 772645 730475 723024 823115 858259 793219 721108
-26323G21108J3114J32422J10828K9363q4291k36695k24101m8396Q0782J79862J81757P6765
$$ 721108 734222 866644 977472 1006835 922544 685849 461748 413352 494134 673996 855753 932518
-26311I32518L468n1608M2644N9205l3014m2320J0290J7037n0272r7107n7496p6818r1655
$$ 932518 935986 884378 927022 986227 953213 910893 921183 938220 887948 790841 733345 656527 564872
-26298E64872P6576K20175J19636r7541j35274m8207j86137m8934M0487j4882R0957N0983
$$ 564872 641448 861623 981259 883718 748444 700237 514100 465166 505653 490771 581728 632711
-26286F32711R8087R0149P3400P7538P7007L9258j27236j3874Q3718K2346j36205j55944P8788
$$ 632711 730798 820947 894347 971885 1048892 1088150 960914 947040 1030758 1053104 916899 760955 839743
-26273H39743Q6016l7237q2678O2576P0136L5018J05170j2698q5760p2919r3884j1745J04082
$$ 839743 925759 888522 805844 868420 938556 973574 1078744 1066046 980286 907367 813483 801738 905820
-26260I05820J58592M9859R872r3664k20328m2721N5509P4277J090j97264O028J58681J07179
$$ 905820 1064412 1114271 1124143 1030479 810151 767430 822939 897216 898306 701042 707070 865751 972930
-26247I72930M7639o9291n2849J4478Q0069L2743k9708l3633K6694N6272M7930o6298q7494
$$ 972930 1020569 951278 898429 912907 992976 1025719 996011 962378 989072 1045344 1093274 1026976 939482
-26234I39482N4850M2059O7487R3443r185q9790j60767j50360O1448P8190o7565j18452K1809
$$ 939482 994332 1036391 1103878 1197321 1188136 1098346 937579 787219 848667 926857 859292 740840 762649
-26221G62649K5330j8465K0044j05347r9503R1245J20433J2618q6167k3847k1868k7290J88888
$$ 762649 787979 769514 789558 684211 584708 675953 796386 809004 722837 698990 677122 649832 838720
-26208H38720R8629j13792m8134r575R0905N7727J4471K5996J6424N4704l6722p3575p7445
$$ 838720 937349 823557 775423 765848 856753 914480 928951 954947 971371 1026075 989353 915778 838333
-26195H38333k6512L5482q102n9406L9390J9851o9694L9978K20992L0961m431l8312k6228
$$ 838333 811821 847303 839201 779795 819185 839036 769342 809320 1030312 1061273 1056842 1018530 992302
-26182I92302l1308n8004M758m9755K4990M4762m7835j181k2919K3492N9041L6239P0003L1072
$$ 992302 960994 902990 907748 857993 882983 927745 879910 878729 855810 879302 938343 974582 1044585 1075657
-26168A075657N547K5311j33151j65368n7539J7116N9320L514l5013l4149O2839O9001k843
$$ 1075657 1081204 1106515 973364 807996 750457 767573 826893 830407 795394 761245 824084 893085 890242
-26155H90242N5083P8287n244l727P557q523j03108J3385k6989j15426p5504K3360K5443n7320
$$ 890242 945325 1023612 1018368 1014641 1022198 1013675 910567 923952 896963 781537 706033 729393 754836 697516
-26141F97516O1952J46919P5396K6856J6362L5221j01094j05550M1973Q857L3121j6681k3846
$$ 697516 759468 906387 981783 1008639 1025001 1060222 959128 853578 895551 904408 937529 920848 897002
-26128H97002R2250n2251k13938j36628J18799K25819J0148m9387q4204j37018R510P3890
$$ 897002 989252 937001 723063 586435 705234 931053 941201 891814 807610 670592 680102 753992
-26116G53992P2118M6808k8346q2847K3849M7279j35750j25899j2678J46837M8691l3919j65798
$$ 753992 826110 872918 844572 761725 785574 832853 697103 571204 558526 705363 754054 720135 554337
-26103E54337j25741J18350J24112l051L5490P4804N5896K5378j2907l4156p3915j28430r1938
$$ 554337 428596 546946 671058 668007 703497 778301 834197 859575 846668 812512 738597 610167 518229
-26090E18229r2688q7324J05726K32302M8657p3106J3305N7546R186n8236k0543K9726L9041
$$ 518229 425541 338217 443943 676245 724902 651796 665101 722647 731833 673597 653054 682780 721821
-26077G21821j421K049Q9463K9756J17256J99562L1454q6495l5684j20313K4456O0212p785
$$ 721821 720400 722449 811912 841668 958924 1158486 1189940 1103445 1067761 947448 971904 1032116 1024331
-26064A024331P5509q2661q9496j3236j45389n1645J24617l5221J435R474n8692O3864m7837
$$ 1024331 1099840 1017179 927683 914447 769058 717413 842030 806809 808244 817718 759026 822890 775053
-26051G75053p6621J7193K7749R1317J6303N1357J15334L9006l6234j41877m7966j9637K9920
$$ 775053 698432 715625 743374 834691 850994 902351 1017685 1056691 1020457 878580 830614 810977 840897
-26038H40897L9646J8924r4498j52959Q0031P5328J4472J5341q7064k7841M5747J36161J14161
$$ 840897 880543 899467 804969 652010 732041 807369 821841 837182 750118 722277 768024 904185 1018346
-26025A018346l506o7308J0385l92l856K0646q7812L413P2568m5921j06297p8405J981J42658
$$ 1018346 1014840 947532 957917 957525 953669 974315 886503 889916 962484 916563 810266 731861 733842 876500
-26011H76500J58937J13511k026m8045j07181K9601J00933N03j0797l702l2557r9225M8336
$$ 876500 1035437 1148948 1146922 1098877 991696 1021297 1122230 1122733 1111936 1108234 1075677 976452 1024788
-25998A024788K13113J04796j80449j89282j17141R2868L5132J35978l6485j74944j12995
$$ 1024788 1237901 1342697 1162248 972966 855825 948693 983825 1119803 1083318 908374 795379
-25987G95379m530N8008k6732j4419j5140J01915n3848m9076O175J50753J80808J35616j16497
$$ 795379 790849 848857 822125 807706 792566 894481 840633 791557 797732 948485 1129293 1264909 1148412
-25974A148412j32865m6172j72220q5328q866p8658o8741J33446J61342m882K8406m6837j1720
$$ 1148412 1015547 969375 797155 711827 702961 624303 555562 689008 850350 845468 873874 827037 815317
-25961H15317Q0996j59J27244O3681l4282j44067o9068J27536O4866r2653j85877j66025J6484
$$ 815317 896313 896154 1023398 1087079 1052797 908730 839662 967198 1032064 939411 753534 587509 603993
-25948F03993J30626N9286J749J04306J50997k0217o236N6461j2276p2154q7562m1636J0234
$$ 603993 734619 793905 795654 899960 1050957 1030740 1024504 1080965 1068689 996535 908973 867337 877571
-25935H77571P6047J30066R6420o5837j38362o521j44533p7456Q0007J64039O7776p4004m0134
$$ 877571 953618 1083684 1180104 1114267 975905 969384 824851 747395 827402 991441 1059217 985213 945079
-25922I45079j13429j01558N4645J0469J08440O1185p7669q0790r9417j259J24455N9584m2237
$$ 945079 831650 730092 784737 795206 903646 964831 887162 806372 706955 705696 830151 889735 847498
-25909H47498j06230q241K4360J00341L3438j93615j48881L6536K77834J50761j12969j55432
$$ 847498 741268 733027 757387 857728 891166 697551 548670 585206 863040 1013801 900832 745400
-25897G45400l0020K08226J05658K4812j09211j25940n0106N7230m203p0184m301J89403Q6028
$$ 745400 715380 923606 1029264 1054076 944865 818925 768819 826049 821846 751662 747361 936764 1022792
-25884A022792j08691p8936m5978N2577L9293o4326k6090K8341l7634J8002K1751L9782J18987
$$ 1022792 914101 835165 789187 841764 881057 816731 790641 818982 781348 799350 821101 860883 979870
-25871I79870J14887j5976Q7854j673j54040l1203m6763j0887K202M5635J39242Q5681n9041
$$ 979870 1094757 1078781 1166635 1164962 1010922 979719 932956 922069 924271 969906 1109148 1194829 1135788
-25858A135788M8671L4570j93186k19772l4329O46j87567j459J47302J26571N1637K6969O0552
$$ 1135788 1184459 1219029 1025843 806071 771742 772388 584821 583362 730664 857235 908872 935841 996393
-25845I96393N0178o7398p9678K3340M0877r7011n2803O1495j2683J5400k6245N9326J1725
$$ 996393 1046571 979173 899495 922835 963712 866701 813898 875393 862710 878110 851865 911191 922916
-25832I22916J26778J30702p583q4438j07756n0661j60401p5155J29975J45869P7876R2356
$$ 922916 1049694 1180396 1172813 1088375 980619 929958 769557 694402 824377 970246 1048122 1140478
-25820A140478R797L3011j76271L977J97148J8370r6093J01683J02935j3083j13747k51968
$$ 1140478 1150275 1183286 1007015 1010992 1208140 1226510 1130417 1232100 1335035 1321952 1208205 956237
-25808I56237j41532m610j2484P4963M935n366K8987O8265m2031l789P4528J34682K378j65809
$$ 956237 814705 810095 797611 872574 877509 872143 901130 969395 927364 923575 998103 1132785 1135163 969354
-25794I69354k34333l9387M0562J5842O1950j41j19400k83722j0589J81023R3838J01349J96086
$$ 969354 735021 695634 736196 752038 813988 813847 694447 410725 400136 581159 674997 776346 972432
-25781I72432J57269J1221p8138p1712Q0013J14586J1225j9666l8702m1558j41305p4470Q2336
$$ 972432 1129701 1140922 1062784 991072 1071085 1185671 1196896 1177230 1138528 1096970 955665 881195 963531
-25768I63531P8807R5739K7663j72237j73599m1196o820K4756O8682P6191k16763j73321M3556
$$ 963531 1042338 1138077 1165740 993503 819904 778708 771888 796644 865326 941517 724754 551433 594989
-25755E94989O5702O6753R892M1185M0347n3935K6737M7041l948o5622L4281O3053l7995m8168
$$ 594989 660691 727444 737336 778521 818868 764933 791670 838711 834763 769141 803422 866475 828480 780312
-25741G80312k367J13341J00512l714J8935J046l5211N1859R876P0318l2896j37136n5192
$$ 780312 777945 891286 991798 988084 1007019 1008065 972854 1024713 1034589 1104907 1072011 934875 879683
-25728H79683M1242l5020k1867R6411O3533L0506P6755p5487p2334l8450j2682l912N4357
$$ 879683 920925 885905 864038 960449 1023982 1054488 1131243 1055756 983422 944972 932290 928378 982735
-25715I82735M0751m5057k4868R5854N8168n8169n256P7636O0458q078k7488J2509j8072j02353
$$ 982735 1023486 978429 953561 1049415 1107583 1049414 1044158 1121794 1182252 1174174 1146686 1159195 1141123 1038770
-25701A038770j78812m1408N2496J11056O5224q0582O967N7825r6037n0930L4553J34446m663
$$ 1038770 859958 818550 871046 982102 1047326 966744 973711 1031536 935499 884569 919122 1053568 1048905
-25688A048905n4825k2451N6923J13951J04322J03028K7859j75459o8950O0015j0203n8456
$$ 1048905 994080 971629 1028552 1142503 1246825 1349853 1377712 1202253 1133303 1193318 1183115 1124659
-25676A124659J0537P7824J04279M3700P3313m9106q1328L272l9566k5075p0301j5486L0558
$$ 1124659 1135196 1213020 1317299 1360999 1434312 1385206 1303878 1307150 1267584 1242509 1172208 1156722 1187280
-25663A187280M9212o1734p3020J37315J11583M8770n7261k30745j64665k8685P2903N7494
$$ 1187280 1236492 1174758 1101738 1239053 1350636 1399406 1342145 1111400 946735 918050 990953 1048447
-25651A048447l9425M5144J69972J49911O6613k713m9307o1163P0099J54801R0193J42298
$$ 1048447 1009022 1054166 1224138 1374049 1440662 1437949 1388642 1327479 1397578 1552379 1642572 1784870
-25639A784870J34122M4131J14313J71615J90120J53375n8566j35391j54692j53352o2169
$$ 1784870 1918992 1963123 2077436 2249051 2439171 2592546 2533980 2398589 2243897 2090545 2028376
-25628B028376J4495m1894j18786j19259l2118K9565Q3910p6976j57874K608N2536N0925r356
$$ 2028376 2042871 2000977 1882191 1762932 1730814 1760379 1844289 1767313 1609439 1612047 1664583 1715508 1706152
-25615A706152q6085j87961k6567R2197P1406L6197r0741n4893J00823J2997O4944L1658j7748
$$ 1706152 1620067 1432106 1405539 1497736 1569142 1605339 1514598 1459705 1560528 1573525 1638469 1670127 1652379
-25602A652379p2980j12914j41483q8943J32808J88303J92886K5793J4079J36071J1392l8792
$$ 1652379 1579399 1466485 1325002 1236059 1368867 1557170 1750056 1775849 1789928 1925999 1937391 1898599
-25590A898599j47714m1945J12576L059k5445O719N5705K64173K82880J04794J97062K70675
$$ 1898599 1750885 1708940 1821516 1824575 1799130 1805849 1861554 2125727 2408607 2513401 2710463 2981138
-25578B981138K39629J07218L0349R9524K7626L2444j39046j34896j79970k29474k00206j40398
$$ 2981138 3220767 3327985 3358334 3457858 3485484 3517928 3378882 3243986 3064016 2834542 2634336 2493938
-25566B493938l0062j06457m313L8646N7020n5842o929J46792J65033J19792P0911J36104
$$ 2493938 2463876 2357419 2353106 2391752 2448772 2392930 2386001 2532793 2697826 2817618 2888529 3024633
-25554C024633J44606J61284K18626J44147j79389l08916j00571k5371j84036j24229p1818
$$ 3024633 3169239 3330523 3549149 3693296 3513907 3204991 3104420 3079049 2895013 2770784 2698966
-25543B698966j12317p9563p9817p9633j88178k14882q5151k4523q4850j17540j74223n8778
$$ 2698966 2586649 2507086 2427269 2347636 2159458 1944576 1859425 1834902 1750052 1632512 1458289 1399511
-25531A399511N5224J63296L02261M1611j77463p5563J39724R5964N3059O7967J22016Q2257
$$ 1399511 1454735 1618031 1920292 1961903 1784440 1708877 1848601 1944565 1997624 2065591 2187607 2269864
-25519B269864o0638N5418J72497O1999J7269M1042l1454r5518M941l0793j28557j76251l6597
$$ 2269864 2209226 2264644 2437141 2499140 2516409 2557451 2525997 2430479 2435420 2404627 2276070 2099819 2063222
-25506B063222J08114J03777J19595J43318J38759K56258K86322K84659M31091L67690K86269
$$ 2063222 2171336 2275113 2394708 2538026 2676785 2933043 3219365 3504024 3935115 4302805 4589074
-25495D589074K22491J05234k4148q5559k42989j75041k76607l46488l33844m23223l89627
$$ 4589074 4811565 4916799 4892651 4807092 4564103 4389062 4112455 3765967 3432123 3008900 2619273
-25484B619273l20996k11718j40951l279k9431L0024o7160p4019K9766j1460j0357J4244l4570
$$ 2619273 2298277 2086559 1945608 1942329 1912898 1942922 1875762 1801743 1831509 1820049 1809692 1823936 1789366
-25471A789366l4405M2809l5768k51072j42101P6603J09195k925o0318p2287q092p6080R046
$$ 1789366 1754961 1797770 1762002 1510930 1368829 1445432 1554627 1551702 1491384 1419097 1411005 1334925 1343971
-25458A343971R6870J247m9377J10234R7746O0700P0974n33K5896J12154Q0850L5195L7551
$$ 1343971 1440841 1442088 1392711 1502945 1600691 1661391 1732365 1731832 1757728 1869882 1950732 1985927 2023478
-25445B023478P1199J40306J26768K00441J31809R3042J01812J02616J53696P1555q3464p9207
$$ 2023478 2094677 2234983 2361751 2562192 2694001 2787043 2888855 2991471 3145167 3216722 3133258 3054051
-25433C054051j10635j15587j82372k69903j91274k03791k98360j10752J04421K0268m5648
$$ 3054051 2943416 2827829 2645457 2375554 2184280 1980489 1682129 1571377 1675798 1696066 1650418
-25422A650418k2529o7752k9013l7382o0016n5536N443J2397J39780J40216K2956n3471J10011
$$ 1650418 1627889 1560137 1531124 1493742 1433726 1378190 1383633 1396030 1535810 1676026 1698982 1645511 1755522
-25409A755522K5363j6101K8887P8069L8165k7083l3777j58534j36699J8836J63474P1818
$$ 1755522 1780885 1764784 1793671 1871740 1909905 1882822 1849045 1690511 1553812 1572648 1736122 1807940
-25397A807940j62706r4905N0729o3221O6481J48169J01080l7882o3089M8258m3723k63095
$$ 1807940 1645234 1550329 1601058 1537837 1604318 1752487 1853567 1815685 1752596 1800854 1757131 1494036
-25385A494036j92817o416O5915J16484K1958l6856o9622j27603M2272N732k7448k2178k544
$$ 1494036 1301219 1294803 1360718 1477202 1499160 1462304 1392682 1265079 1307351 1313083 1285635 1263457 1260913
-25372A260913J24534J88038J33784N3547L3448p489j19518j52876K4930O5891q9137P866
$$ 1260913 1385447 1573485 1707269 1760816 1794264 1786775 1667257 1514381 1539311 1605202 1516065 1523931
-25360A523931Q8490q0009j70904j07755R3947O6429J47782M8102j7871O643J42076O2189
$$ 1523931 1612421 1532412 1361508 1253753 1347700 1414129 1561911 1610013 1592142 1598785 1740861 1803050
-25348A803050J991l3048M0825L2656J4447O8959n0876l5578P5037l5223m9082K943R0883
$$ 1803050 1805041 1771993 1812818 1845474 1859921 1928880 1878004 1842426 1917463 1882240 1833158 1836101 1926984
-25335A926984N442m6500j198n5958R5589J33511l8054k51449k54798j61206j8125r27Q0156
$$ 1926984 1932426 1885926 1884728 1828770 1924359 2057870 2019816 1768367 1513569 1352363 1334238 1333311 1413467
-25322A413467Q1262K0379j06546j8358J0491r8887p1429L8939l9799K508n1219q9727N606
$$ 1413467 1494729 1515108 1408562 1390204 1400695 1301808 1230379 1269318 1229519 1232027 1180808 1091081 1096687
-25309A096687L6927J09291L5924q9024j43802N51Q0580J4095k3004n5051L859k4170j07883
$$ 1096687 1133614 1242905 1278829 1189805 1046003 1046554 1127134 1141229 1118225 1063174 1067033 1042863 934980
-25296I34980P7474J63857K8397n2575n106R0557K9066l0445q7658o0800j70257j76157L642
$$ 934980 1012454 1176311 1204708 1152133 1147027 1237584 1266650 1236205 1148547 1087747 917490 741333 744975
-25283G44975M1721O0109Q6166m1148j86444O5996Q0329J8721Q587P8993J48429J07725n2587
$$ 744975 786696 846805 932971 891823 705379 771375 851704 870425 879012 958005 1106434 1214159 1161572
-25270A161572j09838p8731M0423J67589j23486j74667Q1972J83162J35227N4940o7246j34450
$$ 1161572 1051734 973003 1013426 1181015 1057529 882862 964834 1147996 1283223 1338163 1270917 1136467
-25258A136467n6705K8927O206o4741L257k6986M2853J29800L4411q8593j38427O0996M8204
$$ 1136467 1079762 1108689 1114895 1050154 1053411 1026425 1069278 1199078 1233489 1144896 1006469 1067465 1115669
-25245A115669q1544N7378O5424k9722m8437j4177r7452N3884J38991k8931j200K1286r5799
$$ 1115669 1034125 1091503 1156927 1127205 1078768 1064591 967139 1021023 1160014 1131083 1129883 1151169 1055370
-25232A055370j3336K287n7253l9112J0032K40205J50395j8343N4340R0964n2817k26009j15124
$$ 1055370 1042034 1044321 987068 947956 957988 1198193 1348588 1330245 1384585 1475549 1422732 1196723 1081599
-25219A081599O3644K38668J93928o7498j30345l1278l4683j47781O697R8202n739k2805Q5671
$$ 1081599 1145243 1383911 1577839 1510341 1379996 1348718 1314035 1166254 1172951 1271153 1265414 1242609 1328280
-25206A328280M1330n7434j24514k03927J277K35842J11759j08176n7017L0353r465k4645
$$ 1328280 1369610 1312176 1187662 983735 985012 1220854 1332613 1224437 1167420 1197773 1188308 1163663
-25194A163663l3500j3143J13751R5874N2059J04086Q8227m0135m2242n2861r6392k0474O7733
$$ 1163663 1130163 1117020 1230771 1326645 1378704 1482790 1571017 1530882 1488640 1435779 1339387 1318913 1386646
-25181A386646k7684j06282j44785j25592P3997J25619N4484R115r5092q4919J9957P5052
$$ 1386646 1358962 1252680 1107895 982303 1056300 1181919 1236403 1245518 1150426 1065507 1085464 1160516
-25169A160516k7666j17126j5839N0733J38269Q3815k253K1681l3851J4962m7757q7088m398
$$ 1160516 1132850 1015724 999885 1050618 1188887 1272702 1270449 1292130 1258279 1273241 1225484 1138396 1133998
-25156A133998J21181j2635j15251M4545j219r1302O575j1330r0800N8601k3700N4666P3706
$$ 1133998 1255179 1242544 1127293 1171838 1170619 1079317 1085892 1074562 983762 1042363 1018663 1073329 1147035
-25143A147035j6372m8238J8230M3834J27316J09193j46751j51286k6845M3927J11159J9953
$$ 1147035 1130663 1082425 1100655 1144489 1271805 1380998 1234247 1082961 1056116 1100043 1211202 1231155
-25131A231155M8282j57838k81566k4436O9439Q3096R0206O7213J19689Q9669N6135m2616
$$ 1231155 1279437 1121599 840033 815597 885036 968132 1058338 1125551 1245240 1334909 1391044 1348428
-25119A348428k19494k16536q7327R8743J17381O8645J43896J45435n276J3K8518M8522P9410
$$ 1348428 1128934 912398 825071 923814 1041195 1109840 1253736 1399171 1393895 1393908 1422426 1470948 1550358
-25106A550358m8617j37715q7517j6827R4252J98836M9227k0849M9632M0554L9249J09333
$$ 1550358 1501741 1364026 1276509 1259682 1353934 1552770 1601997 1581148 1630780 1671334 1710583 1819916
-25094A819916J1411j44891l64522j99241J34255J28945m6067j43836j65852L5736J46393
$$ 1819916 1831327 1686436 1321914 1122673 1256928 1385873 1339806 1195970 1030118 1065854 1212247
-25083A212247J05196K6121k0533J29149N0680n4238P4194l7959j17235j46785l3779l6490
$$ 1212247 1317443 1343564 1323031 1452180 1502860 1448622 1522816 1484857 1367622 1220837 1187058 1150568
-25071A150568j47963m714K43823K60836k4371j78259j03315P9584R6979j1053j62254j88101
$$ 1150568 1002605 997891 1241714 1502550 1478179 1299920 1196605 1276189 1373168 1362115 1199861 1011760
-25059A011760j35240O3133K34930K23469J41225J3876M5749j9105l7990o8317m8583Q5314
$$ 1011760 876520 939653 1174583 1398052 1539277 1553153 1598902 1579797 1541807 1473490 1424907 1510221
-25047A510221Q9723L4409J2213M4290N238p8530N2830J89745R7122l993j875J0276K9652
$$ 1510221 1599944 1634353 1646566 1690856 1696094 1617564 1670394 1860139 1957261 1953268 1951393 1961669 1991321
-25034A991321M9385L4829j54739l30572k16711r351N8999m2723n056J31070J48716n7680
$$ 1991321 2040706 2075535 1920796 1590224 1373513 1364162 1423161 1380438 1375382 1506452 1655168 1597488
-25022A597488k66450j42220K9852R1896j05812k9750J37165P7741L8154l4795k5985M7280
$$ 1597488 1331038 1188818 1218670 1310566 1204754 1175004 1312169 1389910 1428064 1393269 1367284 1414564
-25010A414564O4417m0434o6928p6786j3594m0407p107J10859l380j15456o0322J5175N9365
$$ 1414564 1478981 1438547 1371619 1294833 1281239 1240832 1233725 1344584 1341204 1225748 1165426 1180601 1239966
-24997A239966n175k2953R2427J26558j0681j57107j94928K0575J31375J13639K11596J6113
$$ 1239966 1234791 1211838 1304265 1430823 1420142 1263035 1068107 1088682 1220057 1333696 1545292 1561405
-24985A561405n2069o3946j51960j12743J37558J76735J40125k0003j13945q3399J455l1782
$$ 1561405 1509336 1445390 1293430 1180687 1318245 1494980 1635105 1615102 1501157 1417758 1419213 1387431
-24973A387431n0965K7458P4787O2618Q6034N6908j6455p449q7038l2073Q9166L1272J8291
$$ 1387431 1336466 1363924 1438711 1501329 1587363 1644271 1627816 1620367 1533329 1501256 1590422 1621694 1639985
-24960A639985R2015p4770j19400j09635j13735j00928m8197O2419k5747q8657l9018M1279
$$ 1639985 1732000 1657230 1537830 1428195 1314460 1213532 1165335 1227754 1202007 1113350 1074332 1115611
-24948A115611l967M7865K7136j03823j40521R533P0504R8373J00067K9152L2643m3861j84186
$$ 1115611 1111644 1159509 1186645 1082822 942301 951834 1022338 1120711 1220778 1249930 1282573 1238712 1054526
-24935A054526p7464K06299J61337l6182q1184P9565K06189J0269j45187M1390P5477N7216
$$ 1054526 977062 1183361 1344698 1308516 1227332 1306897 1513086 1523355 1378168 1419558 1495035 1552251
-24923A552251j1282j40661o7698j8707n474O7540J07767j1889n8043n143J7514M9588j20005
$$ 1552251 1540969 1400308 1332610 1313903 1308429 1375969 1483736 1471847 1413804 1408661 1426175 1475763 1355758
-24910A355758q9206P6669M7489l2063o966q476p2487j55777k0931O7592P4796m8408j08626
$$ 1355758 1266552 1343221 1390710 1358647 1351681 1343205 1270718 1114941 1094010 1161602 1236398 1187990 1079364
-24897A079364k6222O6218O8281J6933J0809Q7577R6012M3772q6494p7694Q4014J07377N9786
$$ 1079364 1053142 1119360 1187641 1204574 1215383 1302960 1398972 1442744 1356250 1278556 1362570 1469947 1529733
-24884A529733P8104K1120K6822j07018j80176O8261O0104N3740J37368L4630l6972q2705
$$ 1529733 1607837 1628957 1655779 1548761 1368585 1436846 1496950 1550690 1688058 1722688 1685716 1603011
-24872A603011j43952m4534o7173j03798K2129Q5806k2234J31393M4328l1219Q4293M5172
$$ 1603011 1459059 1414525 1347352 1243554 1265683 1351489 1329255 1460648 1504976 1473757 1558050 1603222
-24860A603222J6402J57725K1847k03721j34827l177M3284k6689k3480p610M3497K2228j7936
$$ 1603222 1619624 1777349 1799196 1595475 1460648 1457471 1500755 1474066 1450586 1442976 1486473 1508701 1490765
-24847A490765p0537R0235J20717J85776Q6485q4168j22045p5628j11327J3598k1147J2282
$$ 1490765 1420228 1510463 1631180 1816956 1903441 1819273 1697228 1621600 1510273 1523871 1502724 1515006
-24835A515006J15311R8276J1462j06456j6706M3228O7818N2512p877K0702N1733J8806L7022
$$ 1515006 1630317 1728593 1740055 1633599 1616893 1660121 1727939 1780451 1772574 1793276 1845009 1863815 1900837
-24822A900837R8351O0812J00581L00724L26963L21631L42864K08644O6615p9373p0726m8980
$$ 1900837 1999188 2060000 2160581 2461305 2788268 3109899 3452763 3661407 3728022 3648649 3577923 3528943
-24810C528943j34675l03053k65936o8220o8884M2665K09024R1002l8415r427K5798O9289
$$ 3528943 3394268 3091215 2825279 2757059 2688175 2730840 2939864 3030866 2992451 2983024 3008822 3078111
-24798C078111J28979J65093J16262M6638m0526Q3959Q9209r174O4543J72138O2602m2090
$$ 3078111 3207090 3372183 3488445 3535083 3494557 3578516 3667725 3658551 3723094 3895232 3957834 3915744
-24786C915744j04866j71618j73922l16085k96964r9654N5369j01083j98341l69O4808n794
$$ 3915744 3810878 3639260 3465338 3149253 2852289 2752635 2808004 2706921 2508580 2508211 2573019 2567225
-24774B567225L9634m939m8148n1100J2501J37277P3777J24874O1764m1874K10969M57559
$$ 2567225 2606859 2601920 2553772 2502672 2515173 2652450 2726227 2851101 2912865 2870991 3081960 3539519
-24762C539519L70437K64175K90922K83040J79541J46488J80684J15879O2935J13772K29369
$$ 3539519 3909956 4174131 4465053 4748093 4927634 5074122 5254806 5370685 5433620 5547392 5776761
-24751E776761K05663K16102O2474j46127l27202l96584l12084k85921l44476k46256j59870
$$ 5776761 5982424 6198526 6261000 6114873 5787671 5391087 5079003 4793082 4448606 4202350 4042480
-24740D042480p8628J09014Q5082O5388Q6163n0412j48891r6894M3222l6321j21908m2673
$$ 4042480 3963852 4072866 4157948 4223336 4309499 4259087 4110196 4013302 4056524 4020203 3898295 3855622
-24728C855622J6154l5419j15710j94190j97727j70204k10818k98529k23159n0741n9611n9397
$$ 3855622 3871776 3836357 3720647 3526457 3328730 3158526 2947708 2649179 2426020 2375279 2315668 2256271
-24716B256271Q3112J8486o1898K2270J21715J38595J1583l2596j07939m1935N8823K03667
$$ 2256271 2339383 2357869 2295971 2318241 2439956 2578551 2590134 2557538 2449599 2407664 2466487 2670154
-24704B670154K65525J12491K30947K18991J55634K11579K15202K13099K75122K81674J46426
$$ 2670154 2935679 3048170 3279117 3498108 3653742 3865321 4080523 4293622 4568744 4850418 4996844
-24693D996844O319m9152j27734k79061k88042j41307o3136J05567M60825N81622K82788j73010
$$ 4996844 5003163 4954011 4826277 4547216 4259174 4117867 4054731 4160298 4621123 5202745 5485533 5312523
-24681E312523m49919n69385m29148l94966m00469l07770k48670j29803q0064O6307Q5845
$$ 5312523 4862604 4293219 3864071 3469105 3068636 2760866 2512196 2382393 2302329 2368636 2454481
-24670B454481O3244J71677J10308o6148j25752j4303K376r7583j7916K8384M4567j24261
$$ 2454481 2517725 2689402 2799710 2733562 2607810 2593507 2595883 2498300 2480384 2508768 2553335 2429074
-24658B429074j41969j6714R095L3850o9132o1440J12686J00186n5127k01525k43830n5240
$$ 2429074 2287105 2270391 2279486 2313336 2244204 2182764 2295450 2395636 2340509 2138984 1895154 1839914
-24646A839914O1337J71390O4140j11181m1149n0030J756M4028J16154R7133J42886K2942
$$ 1839914 1901251 2072641 2136781 2025600 1984451 1934421 1936177 1980205 2096359 2193492 2336378 2359320
-24634B359320K9972L9199l3201p7465j3623j14527j37799p840k207n3287l5735K6894r3119
$$ 2359320 2389292 2428491 2395290 2317825 2304202 2189675 2051876 2044036 2041829 1988542 1952807 1979701 1886582
-24621A886582j13524j02880l0347k6566O2633O4078k3752N7302Q8403R962J36368K17938
$$ 1886582 1773058 1670178 1639831 1613265 1675898 1739976 1716224 1773526 1861929 1871891 2008259 2226197
-24609B226197J08270J04250K793j37068r2236r5515K1658J49287Q9077J7783K64k3141J653
$$ 2226197 2334467 2438717 2441510 2304442 2212206 2116691 2138349 2287636 2376713 2394496 2394760 2371619 2373272
-24596B373272l1033l8158k9147p8832o7541n1829P11J03834L1500K5391m6028j60590m4249
$$ 2373272 2342239 2304081 2274934 2196102 2128561 2076732 2077443 2181277 2212777 2238168 2192140 2031550 1987301
-24583A987301P3190R438J482n0234m4996k2468l7905l8887m2606R8324R2942P1373m9719
$$ 1987301 2060491 2069929 2071411 2021177 1976181 1953713 1915808 1876921 1834315 1932639 2025581 2096954 2047235
-24570B047235k7515j7603k5958K2562l0126l5198J32038J46111J62432J92027R3546j20359
$$ 2047235 2019720 2002117 1976159 1998721 1968595 1933397 2065435 2211546 2373978 2566005 2659551 2539192
-24558B539192k06969j96906j42128J22427R8846R049j05654J04628J91688J52978Q7091R314
$$ 2539192 2332223 2135317 1993189 2115616 2214462 2223511 2117857 2222485 2414173 2567151 2654242 2663556
-24546B663556Q1651n3386j11120O72r5734k38896m846M5459k3177K0632J03940P9195J3811
$$ 2663556 2745207 2691821 2580701 2581373 2485639 2246743 2241897 2287356 2264179 2284811 2388751 2467946 2481757
-24533B481757P3743J8184O5647J09001p8963k14198k06263o0192n3038j28117L871m4928
$$ 2481757 2555500 2573684 2639331 2748332 2669369 2455171 2248908 2188716 2135678 2007561 2011432 1966504
-24521A966504m0970P3269K20489P5610r1318j10867l6932j22501m1409N3914j0633J243M5674
$$ 1966504 1925534 1998803 2219292 2294902 2203584 2092717 2055785 1933284 1891875 1945789 1935156 1936399 1982073
-24508A982073J50170K15655J45565K7299n6588n0474j1317K6056M5299j05301p3195j9456
$$ 1982073 2132243 2347898 2493463 2520762 2464174 2413700 2402383 2428439 2473738 2368437 2295242 2275786
-24496B275786j3127l782j3645l773J8358j1783k6970p8075j09327l2878O6162P8033L7227
$$ 2275786 2262659 2258877 2245232 2241459 2259817 2248034 2221064 2142989 2033662 2000784 2066946 2144979 2182206
-24483B182206M9662M5386J52757J28354n0364j77172j75279k8112k9231L3980Q8329N7803
$$ 2182206 2231868 2277254 2430011 2558365 2508001 2330829 2155550 2127438 2098207 2132187 2220516 2278319
-24471B278319K2945J43372Q9274j52299M7788J33337j8434J3163K2253n5167j06602M3755
$$ 2278319 2301264 2444636 2533910 2381611 2429399 2562736 2544302 2557465 2579718 2524551 2417949 2461704
-24459B461704r288j55267M0118N5295j72589N3170J91143k2205p3317L8657O530n1041K232
$$ 2461704 2452416 2297149 2337267 2392562 2219973 2273143 2464286 2442081 2368764 2407421 2413951 2362910 2365142
-24446B365142Q7377J75907K2796k12729j66712p5946P8740K1666m9479m1291J6980O6413
$$ 2365142 2452519 2628426 2651222 2438493 2271781 2195835 2274575 2296241 2246762 2205471 2222451 2288864
-24434B288864p737J1228P6065o4576r6768j417J71892J52618j05349l9954K42369K83003
$$ 2288864 2281127 2292355 2368420 2303844 2207076 2205659 2377551 2530169 2424820 2384866 2627235 2910238
-24422B910238n3830j65558q2595p7426j5334J43480J32566K2244o5699j628Q6429J69348
$$ 2910238 2856408 2690850 2608255 2530829 2515495 2658975 2791541 2813785 2748086 2746458 2832887 3002235
-24410C002235R094m4675p2715L5232J46709J30765J23066R9330K85307L03741J62396J08358
$$ 3002235 3011329 2966654 2893939 2929171 3075880 3206645 3329711 3429041 3714348 4018089 4180485 4288843
-24398D288843J12898R4845m6131j14125r2619j37990j87401k6893r7533j49091J2073J15211
$$ 4288843 4401741 4496586 4450455 4336330 4243711 4105721 3918320 3891427 3793894 3644803 3656876 3772087
-24386C772087J53871m0283j89451j32239j59058q2190p7743o3491j16881j70102r0366q8543
$$ 3772087 3925958 3885675 3696224 3563985 3404927 3322737 3244994 3181503 3064622 2894520 2804154 2715611
-24374B715611M4112Q6440r50l1522j21237j371R6893N944j06304j8229J24057Q5578M3674
$$ 2715611 2759723 2846163 2845213 2813691 2692454 2691083 2787976 2793920 2687616 2669387 2793444 2879022 2922696
-24361B922696J25856K14167K03559O0700j73011K86J64486K04027J84229n4681k9892Q3878
$$ 2922696 3048552 3262719 3466278 3526978 3353967 3354253 3518739 3722766 3906995 3852314 3822422 3906300
-24349C906300R3644J45149K01618M5205j00660j61193j77892l7908J92806K17164J28146
$$ 3906300 3999944 4145093 4346711 4391916 4291256 4130063 3952171 3914263 4107069 4324233 4452379
-24338D452379N9698J69471M13187M83700M27374K20367O8298j5386j02521k31393k58015
$$ 4452379 4512077 4681548 5094735 5578435 6005809 6226176 6294474 6279088 6176567 5945174 5687159
-24327E687159k39720n9180p3924k63527k83524l80303m20810k66175r2602m7901j80218k23311
$$ 5687159 5447439 5388259 5314335 5050808 4767284 4386981 3966171 3699996 3607394 3559493 3379275 3155964
-24315C155964j65044o0175P2619J3988M9385J44669J86510J93936J63391K16766J68187R5087
$$ 3155964 2990920 2930745 3003364 3017352 3066737 3211406 3397916 3591852 3755243 3972009 4140196 4235283
-24303D235283P6700J23578K10461P4036M7895K38604K86292J18238o0214o1396J33149Q8735
$$ 4235283 4311983 4435561 4646022 4720058 4767953 5006557 5292849 5411087 5350873 5289477 5422626 5511361
-24291E511361J9928j01923j61705k29713j27053j31994j59645r7680n259L4359l744J27145
$$ 5511361 5531289 5429366 5267661 5037948 4910895 4778901 4619256 4521576 4516317 4550676 4546932 4674077
-24279D674077J65494J39336J52339J50072J519m3647O3766J30566J74369K1328l05335l10659
$$ 4674077 4839571 4978907 5131246 5281318 5282837 5239190 5302956 5433522 5607891 5629219 5323884 5013225
-24267E013225l82877m38958k13594n2299m4418j44416j58373k5443J41271Q2495O8915J61177
$$ 5013225 4630348 4191390 3977796 3925497 3881079 3736663 3578290 3552847 3694118 3776613 3845528 4006705
-24255D006705M44859M62427L36240L81824L34369J56729J71350L25818K46580J58466K05269
$$ 4006705 4451564 4913991 5250231 5632055 5966424 6123153 6294503 6620321 6866901 7025367 7230636
-24244G230636L36065K07431p044Q4626J39131J65588Q1695K13319J91418N1819Q1405J40706
$$ 7230636 7566701 7774132 7767088 7851714 7990845 8156433 8238128 8451447 8642865 8694684 8776089 8916795
-24232H916795Q2121n2902m9537L5324P0038O2864l3465r2840k11267j67190k2921N5386K41997
$$ 8916795 8998916 8946014 8896477 8931801 9001839 9064703 9031238 8938398 8727131 8559941 8537020 8592406 8834403
-24219H834403J94682J60679M25810O30140P42563Q22068Q12618O34428O96270J022835J547570
$$ 8834403 9029085 9189764 9615574 10245714 10988277 11810345 12622963 13257391 13953661 14976496 16524066
-24208A6524066K057441K702386L330848M146039N224794O020422O161203M963133K203350
$$ 16524066 18581507 21283893 24614741 28760780 33985574 40005996 46167199 51130332 53333682
-24199E3333682j406449m023390m792223m350800l355776k379881j450763l95493L16369R70667
$$ 53333682 51927233 47903843 43111620 38760820 35405044 33025163 31574400 31178907 31495276 32465943
-24189C2465943J654133K734028L899037M946468O291775P556362Q429480P773685M885352
$$ 32465943 34120076 36854104 40753141 45699609 51991384 59547746 67977226 75750911 80636263
-24180H0636263K36708m257887o894189p190335o068659m543929k990270j855908j141797
$$ 80636263 80872971 76615084 69720895 62530560 56461901 51917972 48927702 47071794 45929997
-24171D5929997q06325p36868p02957p53996n69641j93750r4065K3875L53933P86606J194883
$$ 45929997 45123672 44386804 43683847 42929851 42360210 42166460 42072395 42096270 42450203 43236809 44431692
-24160D4431692J636059K167129K786401L394592L910818M647187N688451O689321P832502
$$ 44431692 46067751 48234880 51021281 54415873 58326691 62973878 68662329 75351650 83184152
-24151H3184152R195783J1006819J3757703J7095636K1060850K5568599L0395888L5746431
$$ 83184152 92379935 103386754 117144457 134240093 155300943 180869542 211265430 247011861
-24143B47011861M2924652N3376435O6210133P6787588P7006563N9598018K5083545j3609941
$$ 247011861 289936513 343312948 409523081 486310669 563317232 622915250 647998795 634388854
-24135F34388854m1255354n3484092n3471295m4781860l3238464k4716818k1850816k3556000
$$ 634388854 593133500 539649408 486178113 441396253 408157789 383440971 361590155 338034155
-24127C38034155k6390725k7725541k7665009k7268458k6470137k4212084k0574817j6541726
$$ 338034155 311643430 283917889 256252880 228984422 202514285 178302201 157727384 141185658
-24119A41185658j2950152r892957p593547n908873m491901l500965k863066j979029j142107
$$ 141185658 128235506 118342549 110749002 104840129 100348228 96847263 93984197 92005168 90863061
-24110I0863061m74205r4439K71804O70165O11938L21918L53330R68499J735134K650457L717867
$$ 90863061 90388856 90294417 90566221 91236386 91848324 92170242 92523572 93492071 95227205 97877662 101595529
-24099A01595529M963359O057446P415971Q860180J0518050J2828141J5819342J9727856K5016951
$$ 101595529 106558888 112616334 120032305 128892485 139410535 152238676 168058018 187785874 212802825
-24090B12802825L2009284M1049197N2850423O7689248Q5029094J02534668J15029316J14615737
$$ 212802825 244812109 285861306 338711729 406400977 491430071 593964739 708994055 823609792
-24082H23609792R4921336N8986302K2090081L92488m712980k817635l101352j2147621l4385875
$$ 823609792 918531128 977517430 999607511 999999999 995287019 992469384 989368032 977220411 942834536
-24073I42834536o8578367j01653925j17503544j12665248r5967889p6575221n9507894m6144522
$$ 942834536 874256169 772602244 655098700 542433452 446465563 369890342 310382448 264237926
-24065B64237926l5827294k8181803k2624491j8346557j5150914j2387002j0181567q405034
$$ 264237926 228410632 200228829 177604338 159257781 144106867 131719865 121538298 113133264
-24057A13133264o651714n110027l875679k886996k027901j327765r07736j131836j444924
$$ 113133264 106481550 101371523 97495844 94608848 92580947 91253182 90345446 89213610 87768686
-24048H7768686j436710j029257l33588J25610O75721J490970K426615L317991M065746N176062
$$ 87768686 86331976 85302719 84969131 85094741 85770462 87261432 89688047 93006038 97071784 102247846
-24038A02247846O662565R047079J2191589J5808682J9765319K3736448K6608186K7644635
$$ 102247846 108910411 117957490 130149079 145957761 165723080 189459528 216067714 243712349
-24030B43712349K7419809K7104311K6857974K5724706K3405786K1878220K4970058L3535566
$$ 243712349 271132158 298236469 325094443 350819149 374224935 396103155 421073213 454608779
-24022D54608779M3494360M8648363M4045376K7673828N92900l3254543o3654915p7992457
$$ 454608779 498103139 546751502 590796878 618470706 619063606 585809063 522154148 444161691
-24014D44161691p4381005o1620047m8401901l8640278l2194078k7418420k3149262j9165810
$$ 444161691 369780686 308160639 259758738 221118460 188924382 161505962 138356700 119190890
-24006A19190890j5610796j2505561j0028870q285990o892821n805248m937344m182964l591752
$$ 119190890 103580094 91074533 81045663 72759673 65866852 60061604 55124260 50941296 47349544
-23997D7349544l058547k653728k286184j761154j251403r52476o56166l16532o6791J48604
$$ 47349544 44290997 41637269 39351085 37589931 36338528 35386052 34729886 34413354 34346563 34495167
-23987C4495167R6533J55621K60273M02807N87646J132226K206507L356958M492795N812219
$$ 34495167 34591700 34747321 35007594 35410401 35998047 37130273 39336780 42693738 47186533 52998752
-23977E2998752O864955O417249M210457J22405m537531p591168q360987p487753n903054
$$ 52998752 59863707 66280956 70491413 70613818 66076287 58485119 50124132 42636379 36733325
-23968C6733325m365586l206838k256213j360401l95175M73123J215823K029242K755941L471307
$$ 36733325 32367739 29160901 26904688 25544287 25149112 25622235 26838058 28867300 31623241 35094548
-23958C5094548L953178M139951L396689J313500j572034m160567n458936n462704m683244
$$ 35094548 39047726 43187677 46584366 47897866 46325832 42165265 36706329 31243625 26560381
-23949B6560381l713418k847508k354075j799763j497028j432634j216329r46147p86389n46753
$$ 26560381 22846963 19999455 17645380 15845617 14348589 12915955 11699626 10753479 9967090 9420337
-23939I420337l39386k80058m52217n04794m02718l50177n72954o57569m33646l32841l00457
$$ 9420337 9080951 8800893 8348676 7843882 7441164 7090987 6518033 5860464 5426818 5093977 4793520
-23928D793520j97020k62947k71458j4513q4282k04654j29281o8076j22407j53767p3243j59785
$$ 4793520 4596500 4333553 4062095 4047582 3963300 3758646 3629365 3561289 3438882 3285115 3211872 3052087
-23916C052087j13993q737o2124j32462j21207j75624r4208K2968J13085K49877K43233J47548
$$ 3052087 2938094 2929357 2867233 2734771 2613564 2437940 2343732 2366700 2479785 2729662 2972895 3120443
-23904C120443J98453J30550K47828L26900J54236O6759J39565J71498P9732J15551j2743
$$ 3120443 3318896 3449446 3697274 4024174 4178410 4245169 4384734 4556232 4635964 4751515 4738772
-23893D738772k40791k94247j48805k43705l72182l35235k54089j4615J12053K5821j0785
$$ 4738772 4497981 4203734 4054929 3811224 3439042 3103807 2849718 2835103 2947156 2972977 2962192
-23882B962192O4919P0851O7912j9819L258J93500K45901J87720J70148Q5616O3713J20258
$$ 2962192 3027111 3097962 3165874 3146055 3149313 3342813 3588714 3776434 3946582 4032198 4095911 4216169
-23870D216169J36006J41265K28665K45003K90990J84370K63928J73606K57797L10885K76423
$$ 4216169 4352175 4493440 4722105 4967108 5258098 5442468 5706396 5880002 6137799 6448684 6725107
-23859F725107K92415L10862J92171L14591N09779N37250N72130R36517J006278J390308J766469
$$ 6725107 7017522 7328384 7520555 7835146 8344925 8882175 9454305 10390822 11397100 12787408 14553877
-23848A4553877K297500K928010L966848N271750P369526J0296135J5324001K3499235L7657925
$$ 14553877 16851377 19779387 23746235 29017985 36387511 46683646 62007647 85506882 123164807
-23839A23164807N7831313P7688704P8944445L8029109n1610109j04472802q2186214m8068554
$$ 123164807 180996120 258684824 337629269 375658378 324048269 219575467 137389253 89320699
-23831H9320699k7191020j6640542j0700166p415172n183968l992297l067187k464095j824875
$$ 89320699 62129679 45489137 34788971 27373799 22189831 18197534 15130347 12666252 10841377
-23822A0841377j416326r52290q26297m83489n22693m92062m55917k91070k27005k21573l15740
$$ 10841377 9425051 8472761 7646464 7162975 6640282 6148220 5692303 5401233 5174228 4952655 4636915
-23811D636915l77725l64249k56428p1214O378O4658Q1764N8376n5768l37200l28776k56424
$$ 4636915 4259190 3894941 3638513 3567299 3573677 3638335 3720099 3778475 3722707 3385507 3056731 2800307
-23799B800307j77004k59287j63887j80827L4190j24042k47447j81444o8214O3087J21854
$$ 2800307 2623303 2364016 2200129 2019302 2053492 1929450 1682003 1500559 1432345 1495432 1617286
-23788A617286Q4897n2833j68661j22265p0251j06090m0921J16493R491o3872j52453o5528
$$ 1617286 1702183 1649350 1480689 1358424 1288173 1182083 1141162 1257655 1267146 1203274 1050821 985293
-23776I85293n1858j57033k08428j10787p6728L2588K8146p4980j65688q8498m2363k5532
$$ 985293 933435 776402 567974 457187 380459 413047 441193 366213 200525 112027 69664 44132
-23764D4132n4566j50386o4866J33736J88530J42262N8657m2565P027M6249m1394K5994J29046
$$ 44132 -10434 -160820 -225686 -91950 96580 238842 297499 254934 261961 308210 266816 292810 421856
-23751D21856Q3428r954j078R123l3226l637j116q8406j14947n9411M4808R6559K8849K4478
$$ 421856 505284 495330 494252 503375 470149 466512 465396 376990 262043 202632 247440 343999 372848 397326
-23737C97326J31924k7212n7604j64456m2191J34511J29117J8312j5150n9985o0511K223J28137
$$ 397326 529250 502038 444434 279978 237787 372298 501415 519727 504577 444592 384081 386304 514441
-23724E14441P0301Q1336M6833J7556j32503k0797l3642j12818j4700O8772J36800J72927
$$ 514441 584742 666078 712911 730467 597964 577167 543525 430707 416007 484779 621579 794506
-23712G94506L3246k1452J33608K93878J50249k47726l73259j57724J17280R1904l3778p2407
$$ 794506 827752 806300 939908 1233786 1384035 1136309 763050 605326 722606 814510 780732 708325
-23700G08325o8182j04083J32475R2987k3431J7962j11454k00908j43269L429M3511J62596
$$ 708325 640143 536060 668535 761522 738091 756053 644599 443691 300422 303851 347362 509958
-23688E09958Q8266q4110r5703q5194l3739j20773j4130J97125K06785p2622l43980l1051
$$ 509958 598224 514114 418411 333217 299478 178705 164575 361700 568485 495863 151883 120832
-23676A20832K487q1508R9161J10675M7992m6101k4524J48903J84890o481m9488j0872l0697
$$ 120832 123319 41811 140972 251647 299639 253538 229014 377917 562807 556326 506838 495966 465269
-23663D65269J32260J69415N4570j3084N3753L0763J04148O6603K8059L930j0514Q4989K5968
$$ 465269 597529 766944 821514 808430 862183 892946 997094 1063697 1091756 1095686 1085172 1170161 1196129
-23650A196129j2914J03993O2119j58009k91010k85583l61567k95515j10644J1430K24562
$$ 1196129 1183215 1287208 1349327 1191318 900308 614725 253158 -42357 -153001 -141571 82991
-23639H2991M17664K86207J41849J29973R942J1905J01124j721m0176N7862j24547k56878
$$ 82991 500655 786862 928711 1058684 1068626 1080531 1181655 1179934 1139758 1197620 1073073 816195
-23627H16195k58108L7089O0874K38322K88930q3068k22649j33854j740n0935j73058j56311
$$ 816195 558087 595176 656050 894372 1183302 1100234 877585 743731 741991 691056 517998 361687
-23615C61687o6703n9958l409o1417J7087R057j5386R8015J53025P9387k0230N4254J67918
$$ 361687 294984 235026 231617 170200 187287 196344 180958 278973 431998 511385 491155 545409 713327
-23602G13327K44971J04307J48519J60099M6320k4327o5367j86947k61361k16320j2464L6357
$$ 713327 958298 1062605 1211124 1371223 1417543 1393216 1327849 1140902 879541 663221 650757 687114
-23590F87114o763o3570j11507k03843p9029J60572K9356o0380q6530M5086o806R5599P1078
$$ 687114 680351 616781 505274 301431 222402 382974 412330 351950 265420 310506 303700 399299 470377
-23577D70377O355n808k05075Q307J37050o0099j4425J17152k146m9777O2316J26194l5428
$$ 470377 476732 470924 265849 274156 411206 351107 336682 453834 451688 401911 464227 590421 554993
-23564E54993j9556J8397q818p8105j68491j39017l0127J96122J45145O2523M3535P749J50866
$$ 554993 535437 553834 545016 466911 298420 159403 129276 325398 470543 533066 576601 584350 735216
-23551G35216O202J6542M2852p8909o9811J6241K01128J11481k5602p7268j50923j06295J4340
$$ 735216 741418 757960 800812 721903 652092 668333 869461 980942 955340 878072 727149 620854 635194
-23538F35194P801j4656J2050j60285r3514J93471J93457J33823J36108J38370l9493k05134
$$ 635194 642995 628339 640389 480104 386590 580061 773518 907341 1043449 1181819 1142326 937192
-23526I37192j20595p9717n229J53968P3858l9930m2483n1238r1110l8710J17878P7309l9838
$$ 937192 816597 736880 731651 885619 959477 919547 877064 825826 734716 696006 813884 891193 851355
-23513H51355n0418j60600j65517J2857O8455j4694j39132j21053K3539J80120J83921J3268
$$ 851355 800937 640337 474820 487677 556132 541438 402306 281253 304792 484912 668833 682101
-23501F82101L969j1449n8706q309j7416K9059N3463o0208j8325J31082p123n7291L1096L3845
$$ 682101 686070 674621 615915 607606 590190 619249 672712 612504 594179 725261 718138 660847 691943 725788
-23487G25788l8462l4899J00847J27505L06421J64238O8019O0429P5380J46700K33028J62481
$$ 725788 687326 652427 753274 880779 1187200 1351438 1419457 1479886 1555266 1701966 1934994 2097475
-23475B097475m2164j85695p5749L1686O8954O6052j21807p83K678J43836K15226O0135O9471
$$ 2097475 2055311 1869616 1793867 1825553 1894507 1960559 1838752 1837969 1840647 1984483 2199709 2259844 2329315
-23462B329315r8904r3614o2791J3421J55070J91498J73029J60423J53076K08900R2000j80626
$$ 2329315 2230411 2136797 2074006 2087427 2242497 2433995 2607024 2767447 2920523 3129423 3221423 3040797
-23450C040797k71230l10359j86568k49091k43097k11261j21858p4830p4105k8247m045O04
$$ 3040797 2769567 2459208 2272640 2023549 1780452 1569191 1447333 1372503 1298398 1270151 1266106 1266710
-23438A266710J5745k1583n3215r5407j05763O6120N8651M6559M1555O3038M6027L3676J07402
$$ 1266710 1282455 1260872 1207657 1112250 1006487 1072607 1131258 1177817 1219372 1282410 1328437 1362113 1469515
-23425A469515M3865M5152J04083J29259J87667L177l0673J60183K1761j12749q4339r4951
$$ 1469515 1513380 1558532 1662615 1791874 1979541 1982718 1952045 2112228 2133989 2021240 1936901 1841950
-23413A841950p0956l3850K14560L84797K61437M3390P7644N3716J04890K27238N4512J67881
$$ 1841950 1770994 1737144 1951704 2336501 2597938 2641328 2718972 2772688 2877578 3104816 3159328 3327209
-23401C327209K66745K71825L03365J96926k6343k26286L780K3251j64393q7256N1815J96260
$$ 3327209 3593954 3865779 4169144 4366070 4339727 4113441 4117221 4140472 3976079 3888823 3940638 4136898
-23389D136898K66261J52420m7493l15513l76261l33868l58502l44783l41283k71249j84612
$$ 4136898 4403159 4555579 4508086 4192573 3816312 3482444 3123942 2779159 2437876 2166627 1982015
-23378A982015l09314k49421j09736n7900J4254N6375k3859q5896l6894M555q7066r5296M5483
$$ 1982015 1672701 1423280 1313544 1255644 1269898 1326273 1302414 1216518 1179624 1184179 1097113 1001817 1047300
-23365A047300K7687k6283p1329j7363K9673P2303j2547P2188M77j29676Q103J41149R0864
$$ 1047300 1074987 1048704 977375 960012 989685 1061988 1049441 1121629 1122106 992430 1000533 1141682 1232546
-23352A232546M3469k8630Q2121K69475L43877K06459J35625j4249J13774K32783O8230j53557
$$ 1232546 1276015 1247385 1329506 1598981 1942858 2149317 2284942 2270693 2384467 2617250 2685480 2531923
-23340B531923r0867j7151J07451K03985K93086L37616K47440K26605K04715O9845k19952
$$ 2531923 2441056 2423905 2531356 2735341 3028427 3366043 3613483 3840088 4044803 4114648 3894696
-23329C894696l34704l80524m36048k28330k35622l99420k18085j75964k61461r6119O1997
$$ 3894696 3559992 3179468 2743420 2515090 2279468 1880048 1661963 1485999 1224538 1128419 1190416
-23318A190416k7872O1931M2137q7091k10997O048J1223j54235k2669K9938K2870R6550r6880
$$ 1190416 1162544 1224475 1266612 1179521 968524 974572 985795 831560 808891 838829 861699 958249 861369
-23305H61369q2479R090n746o6534j77989j25795j17726J35899J78377j7547o4211j18200
$$ 861369 778890 787980 782234 715700 537711 411916 294190 430089 608466 590919 526708 408508
-23293D08508j06387P772J91533J26520N5289O8675J11195l2032J047P6715Q9087j1071j65868
$$ 408508 302121 309893 501426 627946 683235 751910 863105 831073 832120 908835 997922 986851 820983
-23280H20983j37919l9595n988j04079j17229k2691J58909J14691P9262k0509q4909J5129
$$ 820983 683064 643469 637481 533402 416173 393482 552391 667082 746344 725835 640926 656055
-23268F56055J10739K04759J98474N4100m4289k2223j0188j4074n3268p7991j8858R529k9582
$$ 656055 766794 971553 1170027 1224127 1179838 1157615 1147427 1133353 1080085 1002094 983236 992765 963183
-23255I63183n1080q2581j40021p2655j5173n27P7595O0354L7738L1837l6041p2918l1615
$$ 963183 912103 829522 689501 616846 601673 601146 678741 739095 776833 808670 772629 699711 668096
-23242F68096n9901j7516j6060q2366L418M5263O2275J9511p1799j23174l7250o2369L1502
$$ 668096 608195 590679 574619 492253 495671 540934 603209 622720 550921 427747 390497 328128 359630
-23229C59630n5571L0125M9948r2700r3876j8726L9183l9890n0600M4498J10676R0066O2891
$$ 359630 304059 334184 384132 291432 197556 178830 218013 178123 127523 172021 282697 372763 435654
-23216D35654j15388p3385J11892J03177K7987J6491O3755L6341j45632j22426L2408o0337
$$ 435654 320266 246881 358773 461950 489937 506428 570183 606524 460892 338466 370874 310537
-23204C10537J937j6476p8170k9432N9938R8888P1217K2587k2143o4247r7859R7331K52866
$$ 310537 312474 295998 217828 188396 248334 347222 418439 441026 418883 354636 256777 354108 606974
-23191F06974O0068j5218Q2649o8625p6091J4421O5329k6219j41454r4441k5386P9663J68905
$$ 606974 667042 651824 734473 665848 589757 604178 669507 643288 501834 407393 382007 461670 630575
-23178F30575M9634j42785j84338J3270P5573j63828j83440L0552J50949L9002j21520k2177
$$ 630575 680209 537424 353086 366356 441929 278101 94661 125213 276162 315164 193644 171467
-23166A71467O5958Q0525J48020M2567K5849K5580J6429R488j19943n0192n3835P4849K2694
$$ 171467 237425 317950 465970 508537 534386 559966 576395 585883 465940 415748 361913 436762 459456
-23153D59456K7537Q2632j6194k8793j17869J4150l1839R204o4684P0199J27378J1385o8924
$$ 459456 486993 569625 553431 524638 406769 420919 389080 398284 333600 403799 531177 542562 473638
-23140D73638O8288J1930j1475N3655N8120l8183j63256j74359o5740R2888J02036m7763J1716
$$ 473638 541926 553856 542381 596036 654156 615973 452717 278358 212618 305506 407542 359779 371495
-23127C71495M036p2324R8084J00777O4361M1348j2488k7021M7554K8338l3055j15647j19132
$$ 371495 375531 303207 401291 502068 566429 607777 595289 568268 615822 644160 611105 495458 376326
-23114C76326J504N3057J00793O3376K8359L0771o8096n8800j2617N5575M4993j35128j813
$$ 376326 377830 430887 531680 595056 623415 654186 586090 527290 514673 570248 615241 480113 478300
-23101D78300P5693J2596l9735N3471J2708k6698l8292q297Q598k4988j57816k5242J14915
$$ 478300 553993 566589 526854 580325 593033 566335 528043 519746 528344 503356 345540 320298 435213
-23088D35213J12152J15332q438N2239J4233l6660r1142P7379J39978j070j50941q2883N0495
$$ 435213 547365 662697 654259 706498 720731 684071 592929 670308 810286 809216 658275 575392 625887
-23075F25887j4028O396r4922j26980p1068M5761J30685p5480j21501K1937O6466P1583J56029
$$ 625887 611859 618255 523333 396353 325285 371046 501731 426251 304750 326687 393153 464736 620765
-23062F20765J50216o0144j27916q4912L9516P9193Q0638l2109j05055k9339J441Q2614R7387
$$ 620765 770981 710837 582921 498009 537525 616718 697356 665247 560192 530853 532294 614908 712295
-23049G12295l1055r1934J723k9132j58682p9063P1799M5631L320J01271K12222J30911l5112
$$ 712295 681240 589306 591029 561897 403215 324152 395951 441582 444902 546173 758395 889306 854194
-23036H54194j05068o1248m6586p3784q5919r376N9660J9827L1082p1064k8685P2828L3307
$$ 854194 749126 687878 641292 567508 481589 472213 531873 551700 582782 511718 483033 555861 589168
-23023E89168L5622O9058K4597k4946j52672j75674N296J0945o2391r1375l4944J7322R3503
$$ 589168 624790 693848 718445 693499 540827 365153 370449 381394 319003 227628 192684 210006 303509
-23010C03509Q6352q724J21176L8915k836Q9712n3870r8177p1389m7642J49304Q8828O32m8417
$$ 303509 389861 381137 502313 541228 538392 628104 574234 476057 404668 357026 506330 595158 595790 547373
-22996E47373m4002k0155j6285P4287R6455j0735L1303K8262N5747J2997p6713j31440n6929
$$ 547373 503371 483216 466931 541218 637673 626938 658241 686503 742250 755247 678534 547094 490165
-22983D90165M8592J53585J37673J15914P6622J41900J19624Q7111K50101M07825N36102J67858
$$ 490165 538757 692342 830015 945929 1022551 1164451 1284075 1371186 1621287 2029112 2565214 2733072
-22971B733072m94536n92352k70582o3903j43219l06209j73578p6406R4829P2403P744Q5754
$$ 2733072 2238536 1646184 1375602 1311699 1168480 862271 688693 612287 707116 779519 787263 873017
-22959H73017N7999O4079L8100k96363k22204j8183J36333J55189J58044L0374q576n1819
$$ 873017 931016 995095 1033195 736832 514628 496445 632778 787967 946011 976385 967809 915990
-22947I15990j84715r0632l858k0399K8875p491n9972o6494K534K5052M4155K8753K9869N2637
$$ 915990 731275 640643 636785 616386 645261 637770 577798 511304 513838 538890 583045 611798 641667 694304
-22933F94304M097p8937k0635Q6863P4909R9677J33663K661r3420j20412o9369O7619J9280
$$ 694304 698401 619464 598829 685692 760601 860278 993941 996602 903182 782770 713401 781020 800300
-22920H00300k6081p4899M8260J57647k7091J9431M9001n5913N8890J31842N8431J16338J42131
$$ 800300 774219 699320 747580 905227 878136 897567 946568 890655 949545 1081387 1139818 1256156 1398287
-22907A398287n9589r6306j36872j21996J7845Q5126P7928O6872j08056j18157k080r3017
$$ 1398287 1338698 1242392 1105520 983524 1001369 1086495 1164423 1231295 1123239 1005082 1003002 909985
-22895I09985j64474j21201J4315J0534o7225j45750o0173J21562J27740R2092O032J2349
$$ 909985 745511 624310 638625 649159 581934 436184 376011 497573 625313 717405 723437 735786
-22883G35786J6320P3015q9717p9401M2188r5718n8497j33366K7477J25920M0225j71500p0660
$$ 735786 752106 825121 735404 656003 698191 602473 543976 410610 438087 564007 604232 432732 362072
-22870C62072J17800K07271K29965J16478k8107m3096j04018p2397l1933J08394J03628N5788
$$ 362072 479872 687143 917108 1033586 1005479 962383 858365 785968 754035 862429 966057 1021845
-22858A021845p792K4847J0194K7911n3709l4162l4242L8521K1939K7849P5848K9551l4620
$$ 1021845 1014053 1038900 1049094 1077005 1023296 989134 954892 993413 1015352 1043201 1119049 1148600 1113980
-22845A113980q7038O4336J25788l1847n5121m3475n9408l5201n5395J3546L8047r5935k2282
$$ 1113980 1026942 1091278 1217066 1185219 1130098 1086623 1027215 992014 936619 950165 988212 892277 869995
-22832H69995o876O6049M691j15328p233M0657o2089j13013m4781q5203j31409k9867N999
$$ 869995 863119 929168 933859 818531 811298 851955 789866 676853 632072 546869 415460 385593 391592
-22819C91592L8597R5356m1252n2648n9433N3999N0801j04352q4951P5336J32467J00028K2494
$$ 391592 430189 525545 484293 431645 372212 426211 477012 372660 287709 363045 495512 595540 618034
-22806F18034n7785n8237j5763L0394O4820K16465J66324j7242j39180k60569j90145r643
$$ 618034 560249 502012 486249 516643 581463 797928 964252 947010 807830 547261 357116 347473
-22794C47473J16641J50711J8744o1094P346K6266M9551J47086N4106n4843j19709j27944
$$ 347473 464114 614825 633569 572475 579821 606087 655638 802724 856830 801987 682278 554334
-22782E54334J7791Q4230N556J8057p9461n7781Q2736J23829k7733j80974j22589o686L7962
$$ 554334 572125 656355 661911 679968 600507 542726 625462 749291 721558 540584 417995 411309 449271
-22769D49271l6913J409j5102P8408J54525N7973n1141m2992j4579M0684q063q7976m7766
$$ 449271 412358 413767 398665 477073 631598 689571 638430 595438 580859 621543 613480 525504 477738
-22756D77738m5242r6630J9824R9965M2545L6059j7585J06495J59633q3528j25166m0891j5825
$$ 477738 432496 335866 355690 455655 498200 534259 516674 623169 782802 699274 574108 533217 517392
-22743E17392J3182n6379q324N6329Q2945j2603j54161o2745Q0440o686n1741K6318l0261
$$ 517392 530574 474195 465871 522200 605145 592542 438381 375636 456076 449390 397649 423967 393706
-22730C93706K4469L8680J10139L5940l0265L8073l4421n1222J077M2064P1242L646R5982
$$ 393706 418175 456855 566994 602934 572669 610742 576321 525099 526176 568240 639482 643128 739110
-22717G39110J2088j05951j43310k8977p860J2772Q0725J15313J20548j439p0323p1495k3107
$$ 739110 751198 645247 501937 472960 465100 477872 558597 673910 794458 793019 722696 651201 628094
-22704F28094k5913n7317j39139r953K23466J48132R008K6757j48312j64944o8450l1025J006
$$ 628094 602181 544864 405725 395772 619238 767370 776378 803135 654823 489879 421429 390404 391410
-22691C91410Q4208N3796J14033R4942j6115k5143r3282K9937K1136m3085j8576m652J3691
$$ 391410 475618 529414 643447 738389 722274 697131 603849 633786 654922 611837 593261 588609 602300
-22678F02300L0121O8826Q2380j3642m2334k7617k7439n1689j21335j53517q3945j4763J15900
$$ 602300 632421 701247 783627 769985 727651 700034 672595 620906 499571 346054 262109 247346 363246
-22665C63246j9603K9240P3286k16326J0040J24023J07797M4100r4850K115k6385J36776Q7428
$$ 363246 343643 372883 446169 229843 239883 363906 471703 515803 420953 423068 396683 533459 620887
-22652F20887j21672j28427p4498L9280L7446Q7807K869K3794J14671M1789n0359j52608k5657
$$ 620887 499215 370788 296290 335570 373016 460823 463692 487486 602157 643946 593587 440979 415322
-22639D15322J78218J79236K0048n4855L379l6593k3533j48371j32870N1836O4506n6042q4250
$$ 415322 593540 772776 792824 737969 741348 704755 681222 532851 399981 451817 516323 460281 376031
-22626C76031O5680K8231j3140J9308N7907O8194O941m9622j26429J5622j5889n8611m2131
$$ 376031 441711 469942 456802 476110 534017 602211 609152 559530 433101 448723 432834 374223 332092
-22613C32092L095M8099J36075O2354r88O5200O4181n0290j045J458l4375m028j04229j44900
$$ 332092 335187 383286 519361 581715 580727 645927 710108 659818 658773 660231 625856 621828 517599 372699
-22599C72699m7540P8662M5974m8196k7727Q780J00360N1134Q5365J83922M3979o5528o3605
$$ 372699 325159 403821 449795 401599 373872 382652 483012 534146 619511 803433 847412 781884 718279
-22586G18279q0504q4115k4090n3192m2886j30297j4596J52580J26110k5701j14592L4826
$$ 718279 637775 553660 529570 476378 433492 303195 288599 441179 567289 541588 426996 461822
-22574D61822l570p3072j59487R8012K35376K3744L862r7625l7610R8321J41804J07359M6193
$$ 461822 458252 385180 225693 323705 559081 582825 586687 489062 451452 549773 691577 798936 845129
-22561H45129j4859j16445J03311O1561q1672p9621O7616m1727K6891R9144q0418j11772j8316
$$ 845129 830270 713825 817136 878697 797025 717404 785020 743293 770184 869328 788910 677138 658822
-22548F58822k186j11877j57307L632J38504Q4938o042k19840j92513P1475Q0246O3876N5368
$$ 658822 656636 544759 387452 391084 529588 614526 608484 388644 196131 267606 347852 411728 467096
-22535D67096L3199L8344j84894j18232O2697j1233q774k9651m1734J04569K30574Q5664r494
$$ 467096 500295 538639 353745 235513 298210 286977 278203 248552 206818 311387 541961 627625 618131
-22522F18131N6034p9691K9782O5217K7157P580n2665j08196j7289O4925r9508n8070J25148
$$ 618131 674165 594474 624256 689473 716630 724210 671545 563349 546060 610985 511477 453407 578555
-22509E78555R7905j4318n9716P2310J18352n4396j74937o9587L4538p303m0934k4583P2997
$$ 578555 676460 662142 602426 674736 793088 738692 563755 494168 528706 521403 480469 455886 528883
-22496E28883J5440r255q873j09868l6985K2824O1466r9071j60013L3414J14528J895k3301
$$ 528883 544323 535068 526195 416327 379342 402166 463632 364561 204548 237962 352490 354385 331084
-22483C31084r919P9850J09833M6425l1389M162K7651k2554j32463j50205Q3502J20753J2121
$$ 331084 321165 401015 510848 557273 525884 530046 557697 535143 402680 252475 335977 456730 468851
-22470D68851J20309K3910j62012j7869Q0994J09319M8283l4819j19121K2950O0186r9799
$$ 468851 589160 613070 451058 433189 514183 623502 671785 636966 517845 540795 600981 501182
-22458E01182j259N6214j08607k60698n3826J98155J74132P9340q1985j34110P3985N1869
$$ 501182 499923 556137 447530 186832 133006 331161 505293 584633 502648 368538 442523 494392
-22446D94392m0070p6950q8733n9775r26L0387J29299J53725M5327j7105N307J3932n2474
$$ 494392 454322 377372 288639 228864 227938 258325 387624 541349 586676 569571 574878 588810 536336
-22433E36336m851j8264p4698O609L8224P4557M1032K6491k8796J3203N4459O0206r5408j14808
$$ 536336 531485 513221 438523 445132 483356 557913 598945 625436 596640 609843 664302 724508 629100 514292
-22419E14292p7478l8689O1467J19752P6485j28383N838J12425q5197r9673j3777O0235q3070
$$ 514292 436814 398125 459592 579344 655829 527446 533284 645709 560512 460839 447062 507297 424227
-22406D24227J8995J83901J74667n4674j7424j6945r840K2353L9706r6721q4773k9415j29167
$$ 424227 443222 627123 801790 747116 729692 712747 702907 725260 764966 668245 583472 554057 424890
-22393D24890K8685J45976M0887K9588J18627M6062N1030j9325m2307p7869k79760j59550
$$ 424890 453575 599551 640438 670026 788653 834715 885745 866420 824113 746244 466484 306934
-22381C06934M1557j0550L5509J72597P2961j6689j03135L8368Q2544N2725N3922O865q0151
$$ 306934 348491 337941 373450 546047 619008 602319 499184 537552 620096 672821 726743 733608 653457
-22368F53457j67745n4836M7129L912K8268m0882j6343J7022K515J19198J05747P201K7950
$$ 653457 485712 430876 478005 481917 510185 469303 452960 469982 472497 591695 697442 704643 732593
-22355G32593M2543N7534N8195m8337k19345j68016L7889k6896j19118M9657K27029O8007
$$ 732593 775136 832670 890865 842528 623183 455167 493056 466160 347042 396699 623728 691735
-22343F91735j24900L9248J61435m6705p4889k6210q9266n2205k5658J09689Q1328K0285p9766
$$ 691735 566835 606083 767518 720813 645924 619714 530448 478243 452585 562274 643602 663887 584121
-22330E84121j43906n0507L4807L9214K6369O4245N4959O942l8028r1325k4205P0678O4147
$$ 584121 440215 389708 424515 463729 490098 554343 609302 616244 578216 486891 462686 533364 597511
-22317E97511M6405R7538J06330k0855n0188J19705J8982j41478k04955j26149J09836J25185
$$ 597511 643916 741454 847784 826929 776741 896446 915428 773950 568995 442846 552682 677867
-22305F77867K5707l7445m1278K1991R0954j8053n9795m8859j29966l6730L4813J34186K21745
$$ 677867 703574 666129 624851 646842 737796 719743 659948 611089 481123 444393 479206 613392 835137
-22292H35137J52612K2130k9525R089l5479k3506j08918j77620r5887K574N1305K6014L8201
$$ 835137 987749 1009879 980354 989443 953964 930458 821540 643920 548033 550607 601912 627926 666127
-22279F66127R110o8791j6172r0609J9153J81691P4637j22502q3491J97982J79268j00605
$$ 666127 675237 606446 590274 499665 518818 700509 775146 652644 569153 767135 946403 845798
-22267H45798k34346m1516O7296M3318N5808m2115j25721o9398J0580O3487O0893M8363k7099
$$ 845798 611452 569936 637232 680550 736358 694243 568522 499124 509704 573191 634084 682447 655348
-22254F55348k51901j40960P2168Q0726J09902J76458J41329M8293L5533j09760j65498j99706
$$ 655348 403447 262487 334655 415381 525283 701741 843070 891363 926896 817136 651638 451932
-22242D51932q9202n3383p2997O4550J42626J34862k6449j08168J2727P0934N6282K7329l6299
$$ 451932 362730 309347 236350 300900 443526 578388 551939 443771 456498 527432 583714 611043 574744
-22229E74744J32106O7984j38098j58047m6420k7885M7381J79780K04976m8698j84867n081
$$ 574744 706850 774834 636736 478689 432269 404384 451765 631545 836521 787823 602956 597875
-22217E97875J55070R38j04988p4680q5039N4788N6743J7812J6388Q6822M7663N539M2423
$$ 597875 752945 753883 648895 574215 489176 543964 600707 618519 634907 721729 769392 774931 817354
-22204H17354O147L4929k77N456q3876q8610j26723k1527p312J12155J59820L3631J6463Q9247
$$ 817354 823501 858430 858153 863609 779733 691123 564400 542873 535561 647716 807536 841167 857630 946877
-22190I46877k7713l7845q4839j16556L4925J90125J08420q2137j37365j16170o8950l6156
$$ 946877 919164 881319 796480 679924 714849 904974 1013394 931257 793892 677722 608772 572616
-22178E72616K2367J80779J07687P5188j15073j69905j1707j70510j27022o6720J25940J24521
$$ 572616 594983 775762 883449 958637 843564 673659 661952 491442 364420 297700 423640 548161
-22166E48161J74752j5528j50113j13589r8356J33823K76870Q3712r2539L427R6626Q2891
$$ 548161 722913 707385 557272 443683 345327 479150 756020 839732 747193 750620 847246 930137
-22154I30137j02593j75851q1936r5515J57284K15023P782j36409o1594n3841k1245O2081
$$ 930137 827544 651693 569757 474242 631526 846549 854331 717922 656328 602487 581242 643323
-22142F43323J07818q2659j32803N6796l0880p002J62080N1484o7747q280o1368r6968j81782
$$ 643323 751141 668482 535679 592475 561595 554593 716673 768157 700410 692130 630762 533794 352012
-22129C52012j41195m8655Q2425J55972K31932J07324j13614K1791J56882Q5427m4434j09836
$$ 352012 210817 162162 244587 400559 632491 739815 626201 647992 804874 890301 845867 736031
-22117G36031j19838m0489m0301p4541J2097J84817r78j5377n7521m6590J20877K44073K02614
$$ 736031 616193 575704 535403 460862 472959 657776 656798 641421 583900 537310 658187 902260 1104874
-22104A104874j21799l6252M0995L0471j03124j45741p57o6084k1860J08547J00205R6304
$$ 1104874 983075 946823 987818 1018289 915165 769424 768667 702583 680723 789270 889475 985779
-22092I85779m7078o7485L5910K01440L0791q3353j62317j905N6865J3718M1402K174j48887
$$ 985779 938701 871216 907126 1108566 1139357 1056004 893687 891782 948647 962365 1003767 1005941 857054
-22079H57054p2284j34080j42914N3180J16544j7676j49503N009N2400J9094J03142J82651
$$ 857054 784770 650690 507776 560956 677500 659824 510321 515330 567730 586824 689966 872617
-22067H72617K5322j06397l967o9858j10685K21Q5061J06261O169m4851j7682J07147J13823
$$ 872617 897939 791542 787575 717717 607032 607253 692314 798575 804744 759893 742211 849358 963181
-22054I63181Q4679p6841p5981J1015j11228p3935j25449K0385Q3815o1298j0857K2491O0542
$$ 963181 1047860 971019 895038 906053 794825 720890 595441 615826 699641 638343 627486 649977 710519
-22041G10519J15028M9604o2405m729M5442N3710l6202N4500j5782p0021j3537L3238m1094
$$ 710519 825547 875151 812746 808017 853459 907169 870967 925467 909685 839664 826127 859365 818271
-22028H18271j52063j41275L1527O7820k5229R199J6220m4547L6702Q6919O3398K1249P5885
$$ 818271 666208 524933 556460 624280 599051 608250 624470 579923 616625 703544 766942 788191 864076
-22015H64076J68438j9410k16526j51900j7858k2124K8660O9087M2452k0698k0805J0581K5806
$$ 864076 1032514 1013104 796578 644678 626820 604696 633356 702443 744895 724197 703392 713973 739779
-22002G39779j5148K7215n990l426m7347m4642m0525o8852J23749R6409J632p409l3868P6334
$$ 739779 724631 751846 745856 742430 695083 650441 609916 541064 664813 761222 762854 755445 721577 797911
-21988G97911j1748j00244p4830P285L1803Q1444m027q9315M2374O0410J0755O5016J30508
$$ 797911 786163 685919 611089 618374 650177 731621 727594 638279 680653 741063 751818 816834 947342
-21975I47342R1192j23935r1662o9888J2233p964q7463n4868l297K0346L9733J69105Q5799
$$ 947342 1038534 914599 822937 753049 765282 757318 669855 614987 611690 632036 671769 840874 926673
-21962I26673j29272j59529o4690m9737K6420J85476P9330N2329o0317j3119k1305o8066j7050
$$ 926673 797401 637872 573182 523445 549865 735341 814671 867000 806683 793564 772259 704193 687143
-21949F87143l6612O2354R8935Q224j56864j65488j21667k8264J25106J10757K3407J2733
$$ 687143 650531 712885 811820 820044 663180 497692 376025 347761 472867 583624 607031 619764
-21937F19764m3707q2229q8563R3035K53472J30090l1051k09096j18421k8089J19899J22787
$$ 619764 576057 493828 405265 498300 751772 881862 850811 641715 523294 495205 615104 737891
-21925G37891j1468k2578K1803K9735J30196K6199j42259j1357j5251q6387K1549O6352Q2768
$$ 737891 726423 703845 725648 755383 885579 911778 769519 758162 742911 656524 678073 744425 827193
-21912H27193k472j27979o6304n1879M0964O410l4009L0887j20253n8307k1935n7949Q1170
$$ 827193 824721 696742 630438 578559 619523 625933 591924 622811 502558 444251 422316 364367 445537
-21899D45537K7152j09572k2971R7834J38966J7014K4262l864j1767L0807Q0824m8455r68
$$ 445537 472689 363117 340146 437980 576946 593960 618222 614358 602591 633398 714222 665767 664799
-21886F64799k2467R170J75398R4805j69498j69534l5212O4262M1250q5923j37656l2313O8553
$$ 664799 642332 651502 826900 921705 752207 582673 547461 611723 652973 567050 429394 397081 465634
-21873D65634J46857J32682L2007O5134J625j68784q6215J77839J10711j46788j08189K0105
$$ 465634 612491 745173 777180 842314 843939 675155 588940 766779 877490 730702 622513 642618
-21861F42618r054n2336m0847P8118N8598k7093n8039O2610J41647O3678j09377l7667m2938
$$ 642618 633564 581228 540381 618499 677097 650004 591965 654575 796222 859900 750523 712856 669918
-21848F69918j49543l9741K09349J51493N1921K9826J23401R2637l6478j16139p7522o2183
$$ 669918 520375 480634 689983 841476 893397 923223 1046624 1139261 1102783 986644 909122 846939
-21836H46939j47050L9123J00317J30980o1967k26607M3999O1253O1376J22405n2347j63416
$$ 846939 699889 739012 839329 970309 908342 681735 725734 786987 848363 970768 918421 755005
-21824G55005j89550j07451K012J01376j6526o8383M6134P2852O7310k0317o8773o0356R3252
$$ 755005 565455 458004 460016 561392 544866 476483 522617 595469 662779 642462 573689 513333 606585
-21811F06585J56164P5404J04651n57K1991Q9324k3507o598r7494j39927p2161K9601Q6205
$$ 606585 762749 838153 942804 942247 964238 1053562 1030055 1023457 925963 786036 713875 743476 829681
-21798H29681k8148L3656M6086j31482j0622K4599J9848m2461o2676J2493J03514M3861m7929
$$ 829681 801533 835189 881275 749793 739171 763770 783618 741157 678481 690974 794488 838349 790420
-21785G90420j22500k5598K3987R3298L1998j1969K1710l8363j08141l998J85847R8747k0220
$$ 790420 667920 642322 666309 759607 791605 779636 801346 762983 654842 650844 836691 935438 915218
-21772I15218m2054j13154m5362k77512j18469R2770J33898K2622j6502O7621M9609J54339
$$ 915218 873164 760010 714648 437136 318667 411437 545335 567957 551455 619076 668685 823024
-21760H23024K5236j04453M0438J26195j3097m9479p5027j2110L1058p9878l2179o3408P7198
$$ 823024 848260 743807 784245 910440 897343 847864 772837 760727 791785 711907 679728 616320 693518
-21747F93518J38414Q8314n6537j51251p3844J02590J96493k6032k29357q1696J6346q3659
$$ 693518 831932 920246 863709 712458 638614 741204 937697 911665 682308 600612 616958 533299
-21735E33299L6342R5314K3185J5007Q4082L9321l4662m2349J22092J53362J4993q3551j5081
$$ 533299 569641 664955 688140 703147 787229 826550 791888 749539 871631 1024993 1039986 956435 941354
-21722I41354J278k0561J0772j05218j50524k32482j24167R5478K05451M3898q6474O1424
$$ 941354 942632 922071 932843 827625 677101 444619 320452 415930 621381 665279 578805 640229
-21710F40229J74756K7050j4814o2428m6583J2842J23626m3514m6927m2902R279j06388j08346
$$ 640229 814985 842035 827221 764793 718210 731052 854678 811164 764237 721335 730614 624226 515880
-21697E15880J43969P4088K0167J1732j540j421Q6440j12471k73993r5096P2930R4538O8814
$$ 515880 659849 733937 754104 765836 764296 762875 849315 736844 462851 367755 440685 535223 604037
-21684F04037J86486N2943j40671j5907M9255j66324q6320J32046Q1631J06953p6661r4779
$$ 604037 790523 843466 702795 686888 736143 569819 483499 615545 697176 804129 727468 632689
-21672F32689p170K8729J14037R9859n924k3565L1083q2204o7251q3001k8168k9040j01935
$$ 632689 625519 654248 768285 868144 862220 838655 869738 787534 720283 637282 609114 580074 478139
-21659D78139j1066N4834J01120J23329k854j07881r974Q1848J48078J48079Q1096l4996q8165
$$ 478139 467073 521907 623027 746356 743502 635621 625647 707495 855573 1003652 1084748 1049752 961587
-21646I61587o1061o6176M9427Q9244n4882o2094q3475J2700o919n4319P5740J49472Q5609
$$ 961587 900526 834350 883777 973021 918139 856045 772570 785270 778351 724032 799772 949244 1034853
-21633A034853m1483j74079r5608L9019J07277J13847j6276m1065m4938J3127M2201j7962
$$ 1034853 993370 819291 723683 762702 869979 983826 967550 926485 881547 894674 936875 918913
-21621I18913M2740o6860j86368r6004Q446j7866q7825k5347M5020K6854Q6200J49954m0856
$$ 918913 961653 894793 708425 612421 620867 603001 515176 489829 534849 561703 647903 797857 757001
-21608G57001j01262j6434N0082P7636L2984J41564O2296o2819k58025j60309J34028K12206
$$ 757001 655739 639305 689387 767023 800007 941571 1003867 941048 683023 522714 656742 868948
-21596H68948j2798L7921J31786L4533p0093m3657N9075q4480j37750q2211j00582m152J86644
$$ 868948 856150 894071 1025857 1060390 990297 946640 1005715 921235 783485 701274 600692 596540 783184
-21583G83184J04921L8981O7233M0253n2716j35880j33981j83690j7657J70602K42531J08965
$$ 783184 888105 927086 994319 1034572 981856 845976 711995 528305 510648 681250 923781 1032746
-21571A032746n7606j08580k2355n0520j06289L9943Q1639K9148L3157J1839j12547j14145
$$ 1032746 975140 866560 844205 793685 687396 727339 808978 838126 871283 883122 770575 656430
-21559F56430Q8913N9888o0265J25281Q8412l6605j24835j1928J00211L2437K9788l0083k324
$$ 656430 745343 805231 744966 870247 958659 922054 797219 785291 885502 917939 947727 917644 915320
-21546I15320J581p0865j5372Q6015L8201l8225j39588L5378J6799o3744J3901l0673o3202
$$ 915320 916901 846036 830664 916679 954880 916655 777067 812445 829244 765500 779401 748728 685526
-21533F85526K3903J05439J794j04677j84541N3069J11447k1648O1390L5274m6370J2458J27075
$$ 685526 709429 814868 816662 711985 527444 580513 691960 670312 731702 766976 720606 733064 860139
-21520H60139l9624j67223o3859p2534j14629o0850K3554Q0528Q5079J26180P1571k954j4087
$$ 860139 820515 653292 589433 516899 402270 341420 364974 445502 530581 656761 728332 725378 711291
-21507G11291N4092J33354R8841L4655q6693r7880k603M82o0428k0560n1504M1916K54576
$$ 711291 765383 898737 997578 1032233 945540 847660 845057 845539 785111 764551 713047 754963 1009539
-21494A009539o61j72525q0811j3146L5560j43522n570K14457J54077J10115q464j71247k12920
$$ 1009539 1008878 836353 755542 742396 777956 634434 628864 843321 997398 1107513 1099049 927802 714882
-21481G14882r2600R4678J14545l6758K6702K6201j52j207m1677M058k4031M8163J19586m6174
$$ 714882 622282 716960 831505 794747 821449 847650 847498 846291 804614 808672 784641 832804 952390 906216
-21467I06216j11466q7199o3458L038O1581J75367J9723l092K6133q5618p6867N4100P2557
$$ 906216 794750 707551 644093 647131 708712 884079 903802 900710 926843 841225 764358 818458 891015
-21454H91015K0548o9228k857J8366P610O737j46034j5734M3643N836K6412r1208o1355K8300
$$ 891015 911563 842335 839478 857844 865454 872191 726157 710423 754066 759902 786314 695106 633751 662051
-21440F62051M2264J39488J2282p1197o0622k9461n1047l4193l7099M4278J25527J15468K9792
$$ 662051 704315 843803 856085 784888 724266 694805 643758 609565 572466 616744 742271 857739 887531
-21427H87531J5171K3568j08798r7531J9614J09873P6153j6406n3575l1349n4428N3725M4605
$$ 887531 902702 926270 817472 719941 739555 849428 925581 909175 855600 824251 769823 823548 868153
-21414H68153M3207k5364n7458P4207J4997k02751K029R7547K9984j07205m7296K1842J01364
$$ 868153 911360 885996 828538 902745 917742 714991 717020 814567 844551 737346 690050 711892 813256
-21401H13256J02861j17791k98260M3330J37409L3978j5116q6331l4747Q3770n4890m3428
$$ 813256 916117 798326 500066 543396 680805 714783 699667 613336 578589 662359 607469 564041
-21389E64041J32893J13705L6017o144P7086M7814j28934o0627M1792l2821j25305m4016J33096
$$ 564041 696934 810639 846656 840512 917598 965412 836478 775851 817643 784822 659517 615501 748597
-21376G48597J45273l4586n40J15068k1933p3319m1038l6112J01816P9266o262J2050J4411
$$ 748597 893870 859284 858744 973812 951879 878560 837522 801410 903226 982492 976230 988280 1002691
-21363A002691n5773k5948L3110k0744j01607J6005N7318n7848j77241q8501R3402M7492k3170
$$ 1002691 946918 920970 954080 933336 831729 847734 905052 847204 669963 581462 674864 722356 699186
-21350F99186P506O397O3229J29181L7929l9196K0325R3087M1969p3609k222K7818j88514
$$ 699186 706692 713089 776318 905499 943428 904232 924557 1017644 1059613 986004 983782 1011600 823086
-21337H23086K933J2167m8339K8928J13565Q809q5465k8165R8464O3998k9684Q651N4790O0185
$$ 823086 826019 838186 789847 818775 932340 941149 855684 827519 925983 989981 960297 968948 1023738 1083923
-21323A083923L7357m9806k7859j7569r8924m4541j8415j72767k42867j00719J46201K42466
$$ 1083923 1121280 1071474 1043615 1026046 927122 882581 864166 691399 448532 347813 494014 736480
-21311G36480Q8271l00j8261K6049o1855j20901r780l9706R9355o3902j57062n4140Q6092
$$ 736480 824751 824451 806190 832239 770384 649483 639703 599997 699352 635450 478388 424248 510340
-21298E10340J10345Q9019J13355J27255M8271K1704q6856m6792J0927O0955J09466O5286
$$ 510340 620685 709704 823059 950314 998585 1020289 933433 886641 897568 958523 1067989 1133275
-21286A133275l5377q365R9260k7642o0993k0534o1566P3828J7643L809n7863j69840L1031
$$ 1133275 1097898 1089533 1188793 1161151 1100158 1079624 1018058 1091886 1109529 1113338 1055475 885635 916666
-21273I16666P0760J1125m391P6060j07673j42478m9963j65389r7687J541J03726N9884O4517
$$ 916666 987426 998551 994160 1070220 962547 820069 770106 604717 507030 508571 612297 672181 736698
-21260G36698R9013l8195j36486N717K8035q8324K1583O7089k868L4906O8477q2589m2541
$$ 736698 835711 797516 661030 666747 694782 606458 628041 695130 692262 727168 795645 713056 670515
-21247F70515M3975J14146J42304R45N9245Q1829M0351p2257j63799j07356k4775R3551J20832
$$ 670515 714490 828636 970940 971885 1031130 1112959 1153310 1081053 917254 809898 785123 878674 999506
-21234I99506Q6654N6906k5333N712L179o1866r7480j6006n1276j03475R0825L2104k4585
$$ 999506 1086160 1143066 1117733 1123445 1126624 1064758 967278 951272 899996 796521 887346 919450 894865
-21221H94865J08705O9191J2792m7926r7476Q8529J08367m4781n0168l0013J5602j9626J2493
$$ 894865 1003570 1072761 1085553 1037627 940151 1028680 1137047 1092266 1042098 1012085 1027687 1008061 1020554
-21208A020554j15599j35193j20544k8365J33740J14163r9912r1397J20375J91196K11250
$$ 1020554 904955 769762 649218 620853 754593 868756 768844 677447 797822 989018 1200268
-21197A200268J38526j17800k54165o8562L4669P4756M6105j84639m2212P7924n8575O012
$$ 1200268 1338794 1220994 966829 898267 932936 1007692 1053797 869158 826946 904870 846295 852307
-21185H52307J44041K5393j6469j4120N225J6438M9299Q0575q3622j89700k3034J04281O0683
$$ 852307 996348 1021741 1005272 991152 996377 1012815 1062114 1142689 1059067 869367 846333 950614 1011297
-21172A011297k2952q2284o6383N3477L5672J5525J26519P5736l1456j66530n1900J48800
$$ 1011297 988345 906061 839678 893155 928827 944352 1070871 1146607 1115151 948621 896721 1045521
-21160A045521o3872j62618j22216M6773M2666r086K0382l118O0060J68008J01086Q1549j33624
$$ 1045521 981649 819031 696815 743588 786254 777168 797550 794432 854492 1022500 1123586 1205135 1071511
-21147A071511j50629J58063K02073j25858k03263j7663J22549J6951j29109m7234q8970l2869
$$ 1071511 920882 1078945 1281018 1155160 951897 934234 1056783 1073734 944625 897391 808421 775552
-21135G75552P0657J00157l0131k6361m082K8158m7085M5133M0386L6388r7475j17683O7360
$$ 775552 846209 946366 916235 889874 885792 913950 866865 911998 952384 988772 891297 773614 840974
-21122H40974L8598R5149O611l3890m9571l5045Q8711J268Q139J69893J74929O2233m7084
$$ 840974 879572 974721 981332 947442 897871 862826 951537 952805 960944 1130837 1305766 1367999 1320915
-21109A320915r3014k4685p2889j89893j98280r1772n5020J1426P2016J59332Q1581J25077
$$ 1320915 1227901 1203216 1130327 940434 742154 650382 595362 606788 678804 838136 919717 1044794
-21097A044794M9677p4521q3759q9467r9355m3265J23097J89915R7680q52j18685o8009l9124
$$ 1044794 1094471 1019950 936191 846724 747369 704104 827201 1017116 1114796 1113944 995259 927250 888126
-21084H88126O3038M2954P5328p99n8303J384Q0490N0935n503J848j02977n9756N2281m339
$$ 888126 951164 994118 1069446 1068647 1010344 1011728 1092218 1143153 1137650 1139498 1036521 976765 1029046 1024707
-21070A024707m2256p3517j29040L0537J22661N3964O7637M3828m204R001j34577q929K8015
$$ 1024707 982451 908934 779894 810431 933092 987056 1054693 1098521 1094317 1103318 968741 959812 987827
-21057I87827k2547n0458k194L232P3482J62007K04454j4686j57629O1908j9691k5565L2820
$$ 987827 965280 914822 912628 915860 989342 1151349 1355803 1341117 1183488 1245396 1225705 1200140 1232960
-21044A232960L5744o9671q4893o5661L3694N824m9161n8377q0554K2049M5913n7826j967
$$ 1232960 1268704 1199033 1114140 1048479 1082173 1087997 1038836 980459 899905 921954 967867 910041 908074
-21031I08074Q4239N1399k1231m0825o272J19634P1650j04953l7801O6174J52211j2907n9637
$$ 908074 992313 1043712 1022481 981656 975384 1095018 1166668 1061715 1023914 1090088 1242299 1229392 1169755
-21018A169755p2919j21447n6950o9152r7961K3282P1546O7093K19161P0170m5050q9760j00753
$$ 1169755 1096836 975389 918439 849287 751326 774608 846154 913247 1132408 1202578 1157528 1067768 967015
-21005I67015n6604N9457P6525K3535N2540n6014N2127O7947m5299K3651j3791R302R1315
$$ 967015 910411 969868 1046393 1069928 1122468 1066454 1118581 1186528 1141229 1164880 1151089 1160391 1251706
-20992A251706j53036j28274k0841m8951n9900p0506M8222J69494K2978Q7059K5060j24767
$$ 1251706 1098670 970396 949555 900604 840704 770198 818420 987914 1010892 1097951 1123011 998244
-20980I98244q2524N2726J42122l152r5205N433J3737m5934j17587j293N4262K1568N9679
$$ 998244 915720 968446 1110568 1107416 1012211 1017644 1031381 985447 867860 866567 920829 942397 1002076
-20967A002076L0905M3714Q7784j3914L2485L9897r181j7643l2000l6129k5140n6648J9786
$$ 1002076 1032981 1076695 1164479 1150565 1183050 1222947 1213766 1196123 1164123 1127994 1102854 1046206 1065992
-20954A065992M7987j02695p9210J76934R0821J4333L6960j0332n3923j04490M8492M7778
$$ 1065992 1113979 1011284 932074 1109008 1199829 1214162 1251122 1240790 1186867 1082377 1130869 1178647
-20942A178647j2121j04022l1397K5358J5794o1690o5120m0137O6825O9032k4247L6984Q6341
$$ 1178647 1166526 1062504 1031107 1056465 1072259 1010569 945449 905312 972137 1041169 1016922 1053906 1140247
-20929A140247K2732M4841K5603L2804q09K6379p7212j38550k6399P9662O5534P9360j7779
$$ 1140247 1162979 1207820 1233423 1266227 1265418 1291797 1214585 1076035 1049636 1129298 1194832 1274192 1256413
-20916A256413P9211J34910p1648K5013j06569n0324L0195o8962k9171L2228J90715M2489
$$ 1256413 1335624 1470534 1398886 1423899 1317330 1267006 1297201 1228239 1199068 1231296 1422011 1464500
-20904A464500q7972j23732m9185J22939M8122l4450m8089j05181o9676k3853n635K1963N059
$$ 1464500 1376528 1252796 1203611 1326550 1374672 1340222 1292133 1186952 1117276 1093423 1087788 1109751 1114810
-20891A114810J2016J47289J02455k3164j10592r7839P8097N9217l0046n9878J6589R0691
$$ 1114810 1126826 1274115 1376570 1353406 1242814 1144975 1223072 1282289 1252243 1192365 1208954 1299645
-20879A299645J66648j20785l10314j37957o3429j65484R6807K31278O8813R013J89242J05374
$$ 1299645 1466293 1345508 1035194 897237 833808 668324 765131 996409 1065222 1074235 1263477 1368851
-20867A368851o3180k9065j28100q3404n6364J23871M0380L7957p011Q7922Q4108p4985j20824
$$ 1368851 1305671 1276606 1148506 1065102 1008738 1132609 1172989 1210946 1203935 1291857 1375965 1300980 1180156
-20854A180156j06089j9692J19681R9263L4777P2264p427L541m8615j7104P3791m2217m3980
$$ 1180156 1074067 1054375 1174056 1273319 1308096 1380360 1372933 1376474 1327859 1310755 1384546 1342329 1298349
-20841A298349J21852N6721R663j0774K6223n7634n0184J32051O7325k2808r0560q5245m2202
$$ 1298349 1420201 1476922 1486585 1475811 1502034 1444400 1394216 1526267 1593592 1570784 1480224 1394979 1352777
-20828A352777j2407j3537M7169o3259j32733m9281L812l4912M1423J27446N6982n8875m2712
$$ 1352777 1340370 1326833 1374002 1310743 1178010 1128729 1132541 1097629 1139052 1266498 1323480 1264605 1221893
-20815A221893L4219l0610M8572o2145m9199J18818O9842m0380n2091L3526K1345p4312j75852
$$ 1221893 1256112 1225502 1274074 1211929 1162730 1281548 1351390 1311010 1258919 1292445 1313790 1239478 1063626
-20802A063626R837J15791l6785L6506J26184J78906l54j00411O0818R6181o7177n5482O2389
$$ 1063626 1073463 1189254 1152469 1188975 1315159 1494065 1493711 1393300 1454118 1550299 1483122 1427640 1490029
-20789A490029L7174j8205j33366q4522L3520l5602q3181m6162k8282m6545j0751N8169Q8016
$$ 1490029 1527203 1508998 1375632 1291110 1324630 1289028 1205847 1159685 1131403 1084858 1074107 1132276 1220292
-20776A220292Q1469K2883l0918q4288M2170Q8685n8647j13093r332l615O240R1095J15473
$$ 1220292 1301761 1324644 1293726 1209438 1251608 1340293 1281646 1168553 1159221 1155606 1161846 1252941 1368414
-20763A368414J06779J5834p4508j1072R274n8725l5902N501k632R3979J19723K5311o4039
$$ 1368414 1475193 1491027 1416519 1405447 1414721 1355996 1320094 1325595 1322963 1416942 1536665 1561976 1497937
-20750A497937k5854m0906k8230P8259M4548K1805O5732R0984M3257L5300R6747p7922k8630
$$ 1497937 1472083 1431177 1402947 1481206 1525754 1547559 1613291 1704275 1747532 1782832 1879579 1801657 1773027
-20737A773027o0984j27814q6696o0964j457R0887k0764j56366m6941n559N1969J53965J54878
$$ 1773027 1712043 1584229 1497533 1436569 1435112 1525999 1505235 1348869 1301928 1296369 1348338 1502303 1657181
-20724A657181J6943o3113m7372j57405j90186L9149K26701R2474k0647R7738J9113j34729
$$ 1657181 1674124 1611011 1563639 1406234 1216048 1255197 1481898 1574372 1553725 1651463 1670576 1535847
-20712A535847p7145M549J8178R0567K4633o0761K0676O4954n4898r7559l6330P0347k356
$$ 1535847 1458702 1463251 1481429 1571996 1596629 1535868 1556544 1621498 1566600 1469041 1432711 1503058 1500702
-20699A500702n0627L075n4333O651K2629K8171O8875r4721j47473k1373R9028J04533J13487
$$ 1500702 1450075 1453150 1398817 1405468 1428097 1456268 1525143 1430422 1282949 1261576 1360604 1465137 1578624
-20686A578624L6460r1961n8673l1368j13346j30011j9713K53867K06403M1419j9313j0575
$$ 1578624 1615084 1523123 1464450 1433082 1319736 1189725 1170012 1423879 1630282 1671701 1652388 1641813
-20674A641813J7529O4885O4909p1541n1858J8350O556O8206m923o4528j06823m4197J16891
$$ 1641813 1659342 1724227 1789136 1717595 1665737 1684087 1690643 1758849 1753926 1689398 1582575 1538378 1655269
-20661A655269Q6495o1054j52744m2625k4612N2537J71840J32892J03639l5713j49211j71534
$$ 1655269 1741764 1680710 1527966 1485341 1460729 1513266 1685106 1817998 1921637 1885924 1736713 1565179
-20649A565179k8249j8924l3505J1257J15397J54391L984j1597q6292p6190m132P2142m6219
$$ 1565179 1536930 1518006 1484501 1495758 1611155 1765546 1769530 1757933 1671641 1595451 1591319 1663461 1617242
-20636A617242j47638O9938J09829L2779j02478l1795Q7933J00375L9970o3852j04016j34461
$$ 1617242 1469604 1539542 1649371 1682150 1579672 1547877 1635810 1736185 1776155 1712303 1608287 1473826
-20624A473826p3743M8265q186k2088p647O7862Q2974o4991M3975J05115P7550J01546j9839
$$ 1473826 1400083 1448348 1440162 1418074 1410427 1478289 1561263 1496272 1540247 1645362 1722912 1824458 1804619
-20611A804619j3938M2740N7950m6359m3374o4730N4124J25910P029o5301k22361j83441l8608
$$ 1804619 1790681 1833421 1891371 1845012 1801638 1736908 1791032 1916942 1923971 1858670 1636309 1452868 1414260
-20598A414260O9731J9801m4007k0264N9760K11343Q7085l7295Q423m3676n8858m3285q483
$$ 1414260 1483991 1503792 1459785 1439521 1499281 1710624 1797709 1760414 1768837 1725161 1666303 1623018 1614535
-20585A614535M2505J80889J32833J18169L9958p3423j17264R6300L7278j06407l3218L9060
$$ 1614535 1657040 1837929 1970762 2088931 2128889 2055466 1938202 2034502 2071780 1965373 1932155 1971215
-20573A971215j28269j79824l4389K2198J38059R8018K6814j37197n2289J33498P1557K2706
$$ 1971215 1842946 1663122 1628733 1650931 1788990 1887008 1913822 1776625 1724336 1857834 1929391 1952097
-20561A952097J19715K3713L2432J54466n733j25226r0281K7979L3507l8488k524m3975k75895
$$ 1952097 2071812 2095525 2127957 2282423 2276690 2151464 2061183 2089162 2122669 2084181 2081657 2037682 1761787
-20548A761787j14494J92040J04659j58720p8295J12999l6130p8037m2919M3664M5837L4888
$$ 1761787 1647293 1839333 1943992 1785272 1706977 1819976 1783846 1705809 1662890 1706554 1752391 1787279
-20536A787279O8755N8092l038M4462j4148o4948m5607K6234L664l6065m4032L2953M5239
$$ 1787279 1856034 1914126 1911088 1955550 1941402 1876454 1830847 1857081 1860745 1824680 1780648 1813601 1858840
-20523A858840P1222O4060Q6996P8905M1578m1467k4595k8238q7597J1498M0298l3467j09481
$$ 1858840 1930062 1994122 2081118 2160023 2201601 2160134 2135539 2107301 2019704 2031202 2071500 2038033 1928552
-20510A928552K6398O7145R4520k8860k8650k9607m8929m7213l6110K1496o1054K4059J91685
$$ 1928552 1954950 2022095 2116615 2087755 2059105 2029498 1980569 1933356 1897246 1918742 1857688 1881747 2073432
-20497B073432J94728N3658j62227j52102n4353P8714J17540J01771j3321j0614o8677m9555
$$ 2073432 2268160 2321818 2159591 2007489 1953136 2031850 2149390 2251161 2237840 2227226 2158549 2108994
-20485B108994j7189n2636J5767Q3895L2466J08966J1198p803q200l2581o9120j8401O0972
$$ 2108994 2091805 2039169 2054936 2138831 2171297 2280263 2291461 2283658 2275458 2242877 2173757 2155356 2216328
-20472B216328O9873K6600N1536L939K1738K06006K8983n9665K1447j27056j28140n798K0113
$$ 2216328 2286201 2312801 2364337 2368276 2390014 2596020 2625003 2565338 2586785 2459729 2331589 2325791 2345904
-20459B345904K5464R3924j1052k7007k4212j22143j06471m3638M7757J0951P3369J44995
$$ 2345904 2371368 2465292 2454240 2427233 2403021 2280878 2174407 2130769 2178526 2189477 2262846 2407841
-20447B407841N4851l9550n5882j7541l9241j56201K8815J10854M9134J20363J61392N2877
$$ 2407841 2462692 2423142 2367260 2349719 2310478 2154277 2183092 2293946 2343080 2463443 2624835 2677712
-20435B677712j51574j72912j43437J2707J81541K15720J31569R8141k9935j44165j18728
$$ 2677712 2526138 2353226 2209789 2222496 2404037 2619757 2751326 2849467 2819532 2675367 2556639
-20424B556639l3122R91L4507N1426K8280N5026r507J6621R1458q618p5419K0551L224l3779
$$ 2556639 2523517 2524508 2559015 2610441 2638721 2693747 2684240 2700861 2792319 2783701 2708282 2728833 2732057 2698278
-20410B698278o1903j00704k4785M0703N4256j0054m0867m1458O8982R8475l3740j12350r7942
$$ 2698278 2636375 2535671 2510886 2551589 2605845 2595791 2554924 2513466 2582448 2680923 2647183 2534833 2436891
-20397B436891M0330K6877o1429k4618Q7611K67105M7656M6597M3542j351J6538n4182m2719
$$ 2436891 2477221 2504098 2442669 2418051 2505662 2772767 2820423 2867020 2910562 2909211 2925749 2871567 2828848
-20384B828848p303K46328K27739r9302j43939L3754R5947R3564o3213k4925j3282j2063M2006
$$ 2828848 2821545 3067873 3295612 3196310 3052371 3086125 3182072 3275636 3212423 3187498 3174216 3162153 3204159
-20371C204159k6607P6456J03212Q3226o7233j03723j10048m5197r0407p1751O4734k9348
$$ 3204159 3177552 3254008 3357220 3440446 3373213 3269490 3159442 3114245 3023838 2952087 3016821 2987473
-20359B987473J4559J52168J08925M0278p3646r1289p7108o3437P7773k1672n0255j3487R0177
$$ 2987473 3002032 3154200 3263125 3303403 3229757 3138468 3061360 2997923 3075696 3054024 3003769 2990282 3080459
-20346C080459J38890O5423j71762j19566N6953J10177P7467j38520j41848k327k7673p0356
$$ 3080459 3219349 3284772 3113010 2993444 3050397 3160574 3238041 3099521 2957673 2955346 2927673 2857317
-20334B857317Q3978J80298k5886m2107J19945L7789m6673r985J4666R6740N6104M2149J28027
$$ 2857317 2941295 3121593 3095707 3053600 3173545 3211334 3164661 3154676 3169342 3266082 3322186 3364335 3492362
-20321C492362N6478l7230m7854R3543J5811j52460L0182M6727K9095J59777J37856l7916
$$ 3492362 3548840 3511610 3463756 3557299 3573110 3420650 3450832 3497559 3526654 3686431 3824287 3786371
-20309C786371k26270j59978N4925J41447l1323l9616L3628L4631O4664M325R5876N2768L3743
$$ 3786371 3560101 3400123 3455048 3596495 3565172 3525556 3559184 3593815 3658479 3662804 3758680 3811448 3845191
-20296C845191P7453Q8080J7422o3496k8828k3776P936O6447q3428j67755j71181P2971P4860
$$ 3845191 3922644 4010724 4028146 3964650 3935822 3912046 3919982 3986429 3903001 3735246 3564065 3637036 3711896
-20283C711896O9843R1870L2265J9110m906n3752n6896N4028K5751j02723l4058k5376L8892
$$ 3711896 3781739 3873609 3905874 3924984 3920078 3866326 3809430 3863458 3889209 3786486 3752428 3727052 3765944
-20270C765944J3526Q0332p082n9888J6085Q0668K2032Q1663J51115K5395J08129N7015j29040
$$ 3765944 3779470 3859802 3852720 3792832 3808917 3889585 3911617 3993280 4144395 4169790 4277919 4334934 4205894
-20257D205894K3558J23041R9000k8574k19577j44141k4054J4577J73827J28408j62358n4824
$$ 4205894 4229452 4352493 4451493 4422919 4203342 4059201 4035147 4049724 4223551 4351959 4189601 4134777
-20245D134777J57069J31484Q1848K7555J8370J36651Q018q1323n8957m9936n260M0767J35088
$$ 4134777 4291846 4423330 4505178 4532733 4551103 4687754 4695772 4614449 4555492 4505556 4500296 4541063 4676151
-20232D676151K5922o3805m2701J3130N2894J51446Q0322K8235p6164l6782K7063K3640P779
$$ 4676151 4702073 4638268 4595567 4608697 4661591 4813037 4893359 4921594 4845430 4808648 4835711 4859351 4867130
-20219D867130k5776j02592j40838O0207J65705J06888j5779J28191J44011J11834J38668
$$ 4867130 4841354 4738762 4597924 4658131 4823836 4930724 4914945 5043136 5187147 5298981 5437649
-20208E437649j40171k90007j34416M4737R9420R7046J3714q6850J27534J96032K0824N8096
$$ 5437649 5297478 5007471 4873055 4917792 5017212 5114258 5127972 5041122 5168656 5364688 5385512 5443608
-20196E443608j8309j00140j23149k7578N6556Q7668L4156k4128J70205J13913o5817l9539
$$ 5443608 5425299 5325159 5202010 5174432 5230988 5318656 5352812 5328684 5498889 5612802 5546985 5507446
-20184E507446J05935P8816O0974n0629j30059j5838J06643R2600o7582o9617P6731J17323
$$ 5507446 5613381 5692197 5753171 5702542 5572483 5556645 5663288 5755888 5688306 5618689 5695420 5812743
-20172E812743k0321M8208R5419K157J1228j8263n3974j12145m7280m6392q578J63791K07140
$$ 5812743 5792422 5840630 5936049 5938206 5949434 5931171 5877197 5765052 5717772 5671380 5662802 5826593 6033733
-20159F033733M7315q7127o4419m3548Q8175J63319J32910O214M3039M5926J1977J9599m3000
$$ 6033733 6081048 5993921 5929502 5885954 5974129 6137448 6270358 6276572 6319611 6365537 6377514 6397113 6354113
-20146F354113O4808J17266P2113q6692j19414K9927m2755l6201J62842J03306J8888O4816
$$ 6354113 6418921 6536187 6608300 6521608 6402194 6432121 6389366 6353165 6516007 6619313 6638201 6703017
-20134F703017O6078R8721L5861J7985K992M8465O9227L7041p1454k6926J07925N0582K0735
$$ 6703017 6769095 6867816 6903677 6921662 6924654 6973119 7042346 7079387 7007933 6981007 7088932 7139514 7160249
-20121G160249L6838K14029J57759r288n1327o7313K4756j04474j90980k6317K51812K61978
$$ 7160249 7197087 7411116 7568875 7559587 7508260 7440947 7465703 7361229 7170249 7143932 7395744 7657722
-20109G657722J30882K3023k8128K1573P1273N2135P0284J7475R118j3756j4209J75733J60672
$$ 7657722 7788604 7811627 7783499 7805072 7876345 7928480 7998764 8016239 8025357 8011601 7997392 8173125 8333797
-20096H333797m2355q0095j40274M3561K25459M2410J01132o8223j19041N5641M8900O9166
$$ 8333797 8291442 8211347 8071073 8114634 8340093 8382503 8483635 8415412 8296371 8352012 8400912 8470078
-20084H470078Q9559Q3O9871J81147J49135M2980J2712q0139L7827M3566k6791P2089K01113
$$ 8470078 8559637 8559720 8629591 8810738 8959873 9002853 9015565 8935426 8973253 9016819 8990028 9062117 9263230
-20071I263230Q7262j7807m1961j12560p5068P1765J49526N4722J3703k8001N2615J68382
$$ 9263230 9350492 9332685 9290724 9178164 9103096 9174861 9324387 9379109 9392812 9364811 9417426 9585808
-20059I585808J86429J19379O5391k904p6318J281l3566J0627J65991J4280k3533J11040J50205
$$ 9585808 9772237 9891616 9957007 9954103 9877785 9879066 9845500 9856127 10022118 10036398 10012865 10123905 10274110
-20046A0274110K11254R9950l9350m1384n8982L9340J13925J16714K711l4852J25432P9493
$$ 10274110 10485364 10585314 10545964 10504580 10445598 10484938 10598863 10715577 10718288 10683436 10808868 10888361
-20034A0888361M3111M8948K780J68464J75227J06113J28096Q2686j07009m2406K8428J03994
$$ 10888361 10931472 10980420 10983200 11151664 11326891 11433004 11561100 11643786 11536777 11494371 11522799 11626793
-20022A1626793L4179j47915o7689J48054O3060N9023J24234J71866J65291N0800N8894J2557
$$ 11626793 11660972 11513057 11445368 11593422 11656482 11715505 11839739 12011605 12176896 12227696 12286590 12299147
-20010A2299147O2212M3040K8044M403M1929J59643J63100K0842j29468j34548o18J03300
$$ 12299147 12361359 12404399 12432443 12436846 12478775 12638418 12801518 12822360 12692892 12558344 12557726 12661026
-19998A2661026K31907K05891K2493j0671M5945J01295J94255P1162k4179L1313O2035m4909
$$ 12661026 12892933 13098824 13121317 13110646 13156591 13257886 13452141 13523303 13499124 13530437 13592472 13547563
-19986A3547563q3158m8217J40726J89661J51353J5204n9456L1330J82972K09054O5520K2247
$$ 13547563 13464405 13416188 13556914 13746575 13897928 13913132 13853676 13885006 14067978 14277032 14342552 14364799
-19974A4364799J04909R1550Q1850J51009J47414L3000R6163M4630P4994O4849Q7823P1062
$$ 14364799 14469708 14561258 14643108 14794117 14941531 14974531 15070694 15115324 15190318 15255167 15342990 15414052
-19962A5414052r8153n648Q9780N981n0926P1414J19735J79506P3365O9106Q3099M5758J38806
$$ 15414052 15315899 15310251 15400031 15406012 15355086 15426500 15546235 15725741 15799106 15868212 15951311 15997069 16135875
-19949A6135875K05368L5644o6007P9193l348k4359J28222R3151J10759J35927L7331P6746
$$ 16135875 16341243 16376887 16310880 16390073 16386725 16362366 16490588 16583739 16694498 16830425 16867756 16944502
-19937A6944502L7765P5871J09141J69213P3688R0932J00529P0210J01184N4485m7023m7483
$$ 16944502 16982267 17058138 17167279 17336492 17410180 17501112 17601641 17671851 17773035 17827520 17780497 17733014
-19925A7733014J02007J71001J08677N726l5485l1033J03467K14317K14396J34463J7387o3234
$$ 17733014 17835021 18006022 18114699 18120425 18084940 18053907 18157374 18371691 18586087 18720550 18737937 18674703
-19913A8674703J4303n9659m3316J5614P5736m962k9444O8079O0307K9657K05267J25864N3877
$$ 18674703 18689006 18629347 18586031 18601645 18677381 18672419 18642975 18711054 18771361 18801018 19006285 19132149 19186026
-19900A9186026M6147J30593R6072N9010J8552k8665k9634P004R019O2751J23171j7681J4283
$$ 19186026 19232173 19362766 19458838 19517848 19536400 19507735 19478101 19485105 19494124 19556875 19680046 19662365 19676648
-19887A9676648O1319J06667J81022J71150R7718L9485j0141r194n6698l238L2971R7705J20201
$$ 19676648 19737967 19844634 20025656 20196806 20294524 20334009 20323868 20314674 20257976 20254738 20287709 20385414 20505615
-19874B0505615K6621o3759p9036M8112N829L2055R8488J8882M4586k9270p5335r124L023
$$ 20505615 20532236 20468477 20389441 20437553 20443382 20475437 20573925 20592807 20637393 20608123 20532788 20523664 20526687
-19861B0526687p8935J643J07783J85582J61748n3118j28582N342N5726m9986q1709k235M3959
$$ 20526687 20447752 20449395 20557178 20742760 20904508 20851390 20722808 20728150 20783876 20733890 20652181 20649946 20693905
-19848B0693905R6201P0707R4473J67035K6781n1556J8965O1752J23283K2208j38820j56884
$$ 20693905 20790106 20860813 20955286 21122321 21149102 21097546 21116511 21178263 21301546 21323754 21184934 21028050
-19836B1028050k9652O899L7673K2672K9888P0179M4920n5198j2739j2710j27901r4467j5204
$$ 21028050 20998398 21005297 21042970 21065642 21095530 21165709 21210629 21155431 21142692 21129982 21002081 20907614 20892410
-19823B0892410l8137p1087j41585L0337J44273J7368p3207j4697p7593o0388N4196N9198
$$ 20892410 20854273 20783186 20641601 20671938 20816211 20833579 20760372 20745675 20668082 20607694 20661890 20721088
-19811B0721088M5877P3126l3384r1315J8484N6372n611o9947q5504j9799l7981J3194k4418
$$ 20721088 20766965 20840091 20806707 20715392 20733876 20790248 20784637 20714690 20629186 20609387 20571406 20584600 20560182
-19798B0560182j1490P1301m353j29045j51067n0044J993K7427J9757r0231k02715o8426j67584
$$ 20560182 20548692 20619993 20615640 20486595 20335528 20285484 20287477 20314904 20334661 20244430 20041715 19973289 19805705
-19785A9805705k19361K2285N3663M0776J2969r128o3086k1073l9980j72832l1188J27784
$$ 19805705 19586344 19608629 19662292 19703068 19716037 19706909 19643823 19622750 19582770 19409938 19378750 19506534
-19773A9506534J58058n9799k97007k74098j73468N8550p955j62489Q3943M5511j36017r7287
$$ 19506534 19664592 19604793 19307786 19033688 18860220 18918770 18910815 18748326 18832269 18877780 18741763 18644476
-19761A8644476j37036o7046j1366q7108p4944m9982j01742j38024p0815M6204j4392j52144
$$ 18644476 18507440 18440394 18429028 18341920 18266976 18216994 18115252 17977228 17906413 17952617 17938225 17786081
-19749A7786081j63028q5343j7928M9286K6744N9742q5302j62026j27729n185l7335n1549
$$ 17786081 17623053 17537710 17519782 17569068 17595812 17655554 17570252 17408226 17280497 17275312 17237977 17186428
-19737A7186428j26048j21095r8462j42323L1613n7030j57928p7664j5746O8715L6294m3012
$$ 17186428 17060380 16939285 16840823 16698500 16730113 16673083 16515155 16437491 16421745 16490460 16526754 16483742
-19725A6483742j27256j67006o3125p4265p1341r9910n8489L5569n2809p1750j21159n5896
$$ 16483742 16356486 16189480 16126355 16052090 15980749 15880839 15822350 15857919 15805110 15733360 15612201 15556305
-19713A5556305o7010m1793k2330j39020k2797k0326j10470q5542j23582j8244n7149l7209
$$ 15556305 15489295 15447502 15425172 15286152 15263355 15243029 15132559 15047017 14923435 14905191 14848042 14810833
-19701A4810833q7093j25250r4375n4638q8335n3526q3414j00949j15194n2334P3275q2142
$$ 14810833 14723740 14598490 14504115 14449477 14361142 14307616 14224202 14123253 14008059 13955725 14029000 13946858
-19689A3946858k33275n3013J695j54012p3714k3040Q2108q5856k11897j09990k3480R1982
$$ 13946858 13713583 13660570 13662265 13508253 13434539 13411499 13493607 13407751 13195854 13085864 13062384 13154366
-19677A3154366O0850k7914j1868q401L434o2422j05166o1193m0363r8984j06814j46867n5434
$$ 13154366 13215216 13187302 13175434 13167033 13170467 13108045 13002879 12941686 12901323 12802339 12695525 12548658 12493224
-19664A2493224n6761j6232j8880r9735j08161j11002K2038P5734j4739j38549k62994j94057
$$ 12493224 12436463 12420231 12401351 12301616 12193455 12082453 12104491 12180225 12165486 12026937 11763943 11569886
-19652A1569886M4117Q4455K3768r9278n0727J6336j06982j14285l5643l8011Q9319J94723
$$ 11569886 11614003 11698458 11722226 11622948 11572221 11588557 11481575 11367290 11331647 11293636 11382955 11577678
-19640A1577678N5399j14136k66890k8458j6310k06908j87220j14202N0150M3636j01514m2100
$$ 11577678 11633077 11518941 11252051 11223593 11207283 11000375 10813155 10698953 10749103 10792739 10691225 10649125
-19628A0649125N4072l3461j57998j65944q747O0389o4148j13354j91973n2079L8844k5201
$$ 10649125 10703197 10669736 10511738 10345794 10337047 10397436 10333288 10219934 10027961 9975882 10014726 9989525
-19616I989525J11894L5615p7075m4390r5419q3941j7058q6940p2838J4237M6621q4954k13170
$$ 9989525 10101419 10137034 10059959 10015569 9920150 9836209 9819151 9732211 9659373 9673610 9720231 9635277 9422107
-19603I422107r6779M0805m4705K5803J28865L6229m3391o6600q7361j4843p1647p9953l812
$$ 9422107 9325328 9366133 9321428 9347231 9476096 9512325 9468934 9402334 9314973 9300130 9228483 9148530 9144718
-19590I144718j38729j86912K005P7291j23186k17805p5407Q5648n7621p3963J0888J23357
$$ 9144718 9005989 8819077 8821082 8898373 8775187 8557382 8481975 8567623 8510002 8436039 8446927 8570284
-19578H570284M3419p157r3708j72540j72623r7524M881P4484P8782n0915k7822n9110k2451
$$ 8570284 8613703 8606546 8512838 8340298 8167675 8070151 8075032 8149516 8228298 8177383 8149561 8090451 8068000
-19565H068000Q133k57088k52945q0677N2427O1971O0799p8885k7285Q2711P1548l3713r2939
$$ 8068000 8076133 7819045 7566100 7485423 7537850 7599821 7660620 7581735 7554450 7637161 7708709 7674996 7582057
-19552G582057j11130p3409j50648j62317p0680K3551M4233J52023R2415j32766j24335Q336
$$ 7582057 7470927 7397518 7246870 7084553 7013873 7037424 7081657 7233680 7326095 7193329 7068994 7077330
-19540G077330l1156M0011K5003K312j9947j34774j27095j3040J35895J48902j19539k06008
$$ 7077330 7046174 7086185 7111188 7113500 7093553 6958779 6831684 6818644 6954539 7103441 6983902 6777894
-19528F777894K5117L537j4402m3600o3430J08282L7092n9727r7145j07300q2592r7440l8014
$$ 6777894 6803011 6806548 6792146 6748546 6685116 6793398 6830490 6770763 6673618 6566318 6483726 6386286 6348272
-19515F348272l0150l0792j1089k9079L1409m7409q0395o5543O5060J00229N4426p2232j53751
$$ 6348272 6318122 6287330 6276241 6247162 6278571 6231162 6150767 6085224 6150284 6250513 6304939 6232707 6078956
-19502F078956n8686M0570k6463l7361K1972p7639r1176O0395o5069k62928j89184j95048
$$ 6078956 6020270 6060840 6034377 5997016 6018988 5941349 5850173 5910568 5845499 5582571 5393387 5198339
-19490E198339r4823J82652K38382J45913l2833j67036j33414K1241M3988R4229J33056P8510
$$ 5198339 5103516 5286168 5524550 5670463 5637630 5470594 5337180 5358421 5402409 5496638 5629694 5708204
-19478E708204j9749m9339Q73l4448q8661j10707m9079K2394L893k9945O948J15258K8895
$$ 5708204 5688455 5639116 5639989 5605541 5516880 5406173 5357094 5379488 5383381 5353436 5360384 5475642 5504537
-19465E504537K2968l9599m2690q0842j19706K4865p385k3706N2424J25863P0906l5038n7013
$$ 5504537 5527505 5487906 5445216 5364374 5244668 5269533 5262148 5238442 5290866 5416729 5487635 5452597 5395584
-19452E395584M7705k9041j29662j4045J5647p3938j4502M919q4969j30183j72358J7768J9638
$$ 5395584 5443289 5414248 5284586 5270541 5286188 5212250 5197748 5202667 5117698 4987515 4815157 4832925 4852563
-19439D852563j7440l069P7502Q7866n1542o1199j31964j43970q7647o0119K6750L3756p8065
$$ 4852563 4835123 4832054 4909556 4997422 4945880 4884681 4752717 4608747 4521100 4460981 4487731 4521487 4443422
-19426D443422o1995o851L5995L2642k9947j6742j24245O1148K11978k585J4961N0247p6846
$$ 4443422 4381427 4374576 4410571 4443213 4413266 4396524 4272279 4333427 4545405 4542820 4557781 4608028 4531182
-19413D531182j125q9715r849k6188r8189j08939r1868N280J23488J11044m2434j48176m777
$$ 4531182 4530057 4440342 4430493 4404305 4306116 4197177 4105309 4110589 4234077 4345121 4302687 4154511 4149734
-19400D149734P4439M973P5535K0144k3674r0984o026M6532j02522n0860K2044l924K6696
$$ 4149734 4224173 4229146 4304681 4324825 4301151 4210167 4204141 4250673 4148151 4097291 4119335 4115411 4142107
-19387D142107j7881k6321N7845N2631N0885J22933J16393J962j07609j15887r0143k3651
$$ 4142107 4124226 4097905 4155750 4208381 4259266 4382199 4498592 4500554 4392945 4277058 4186915 4163264
-19375D163264K6583J9115j06172q4065m5336n3318q8658q9664P4191l44j08857r682l6103
$$ 4163264 4189847 4208962 4102790 4018725 3973389 3920071 3831413 3741749 3815940 3815596 3706739 3697057 3660954
-19362C660954R2624K0210N2647K9078q0239o9028n9995j24745o475o7698n6246J8411P1248
$$ 3660954 3753578 3773788 3826435 3855513 3775274 3706246 3646251 3521506 3515031 3447333 3391087 3409498 3480746
-19349C480746P4182l8401j4793p130N4273J11688O2004j1357j43743j77410o6539o2331k9743
$$ 3480746 3554928 3516527 3501734 3494604 3548877 3660565 3722569 3711212 3567469 3390059 3323520 3261189 3231446
-19336C231446m7662m4767R3052J00304J195o1377k8620J12266J14226P7885j1696j51767
$$ 3231446 3183784 3139017 3232069 3332373 3333568 3272191 3243571 3355837 3470063 3547948 3536252 3384485
-19324C384485j2057R1408M3735o7985m3558N6223P0231q2355k5110j05669j30264K5073M6941
$$ 3384485 3372428 3463836 3507571 3439586 3396028 3452251 3522482 3440127 3415017 3309348 3179084 3204157 3251098
-19311C251098J26233R3667q2883k8532J7518J7446L38r1789m9822R901m8680n9626J00392
$$ 3251098 3377331 3470998 3388115 3359583 3377101 3394547 3394885 3303096 3253274 3263175 3214495 3154869 3255261
-19298C255261n42p4757l5982P1907L504k9046k231m4596m0821K1889P517l622J1601l4740
$$ 3255261 3254719 3179962 3143980 3215887 3219391 3190345 3188114 3143518 3102697 3124586 3132103 3128481 3140082 3105342
-19284C105342J2063Q1540J07299K6416o5076o8323K6273J9486m395m3645q5609Q5263K0888
$$ 3105342 3117405 3198945 3306244 3332660 3267584 3199261 3225534 3245020 3240625 3196980 3111371 3196634 3217522
-19271C217522j08924o4734j6984k9069l5341P6513J1739j58363j47973j8611O2759L826j00922
$$ 3217522 3108598 3043864 3026880 2997811 2962470 3038983 3050722 2892359 2744386 2725775 2788534 2792360 2691438
-19258B691438j4107J61537M2547l511J9635M4316J30811J19333m1319j02213n7367p0071
$$ 2691438 2677331 2838868 2881415 2877904 2897539 2941855 3072666 3191999 3150680 3048467 2991100 2921029
-19246B921029J33233l944j14095j02120p960J9697J8976M8040J46434P860r3700j03496q4024
$$ 2921029 3054262 3050318 2936223 2834103 2826143 2845840 2864816 2912856 3059290 3067150 2973450 2869954 2785930
-19233B785930l7066m5328j9515J00830J56183M8190j28592j45282j08666Q1703M1311n8797
$$ 2785930 2748864 2703536 2684021 2784851 2941034 2989224 2860632 2715350 2606684 2688387 2729698 2670901
-19221B670901j51962k16019n7574k0576R3662O8201J41342J8957k6703J54311J13682k4864
$$ 2670901 2518939 2302920 2245346 2224770 2318432 2386633 2527975 2546932 2520229 2674540 2788222 2763358
-19209B763358J4603m5974j53850j14737o0402R0320O6306M7354M811l7114n1230J179P1582
$$ 2763358 2777961 2731987 2578137 2463400 2402998 2493318 2559624 2606978 2611789 2574675 2523445 2524624 2596206
-19196B596206J71538K3534j15558n8316n4466M3916J18608k5775j68259l4836J05501K4705
$$ 2596206 2767744 2791278 2675720 2617404 2562938 2606854 2725462 2699687 2531428 2496592 2602093 2626798
-19184B626798K7460n0056j03874j11320q0376M6847Q4121R9132R6538Q2779l0167r5248n2294
$$ 2626798 2654258 2604202 2500328 2389008 2308632 2355479 2439600 2538732 2635270 2718049 2687882 2592634 2540340
-19171B540340j3257Q557j1641n293j13963q9991j08112j10949m4045O648J4203J05405J50843
$$ 2540340 2527083 2535640 2523999 2518706 2404743 2314752 2206640 2095691 2051646 2058294 2072497 2177902 2328745
-19158B328745Q5271Q2757J3579j26044p8670j33961j16417P161L7504J49495J71923K3006
$$ 2328745 2414016 2496773 2510352 2384308 2305638 2171677 2055260 2062421 2099925 2249420 2421343 2444349
-19146B444349j60254j60660j03783q4197o2406M4515P5134J21187J11243P1261j1933o3954
$$ 2444349 2284095 2123435 2019652 1935455 1873049 1917564 1992698 2113885 2225128 2296389 2284456 2220502
-19134B220502j3260o0288Q590J74669J04518k55637k10515p7783K3604J93543J81319K185
$$ 2220502 2207242 2146954 2155544 2330213 2434731 2179094 1968579 1890796 1914400 2107943 2289262 2291447
-19122B291447j29460j20537n1352J6811j2422M0151J4005O2389O8441K4422J3199j4174m3773
$$ 2291447 2161987 2041450 1990098 2006909 1994487 2034638 2048643 2111032 2179473 2203895 2217094 2202920 2159147
-19109B159147J0775l8466k24421j10943K07049J60841Q5863J4528O267Q0323M1990L7873
$$ 2159147 2169922 2131456 1907035 1796092 2003141 2163982 2249845 2264373 2270640 2350963 2392953 2430826
-19097B430826J37106J47461m2136j95795p3067p2284m3277n5013l7926L6525O027j0332J3167
$$ 2430826 2567932 2715393 2673257 2477462 2404395 2332111 2288834 2233821 2195895 2232420 2238447 2228115 2241282
-19084B241282j0415O5233L7514p3451j30490j38863P9870Q9404l2632j50024j79892m7831
$$ 2241282 2230867 2296100 2333614 2260163 2129673 1990810 2070680 2160084 2127452 1977428 1797536 1749705
-19072A749705P7751O6025J15988k3768j7941P2445P0867M25j31698j13335r391P6405J513
$$ 1749705 1827456 1893481 2009469 1985701 1967760 2040205 2111072 2111497 1979799 1866464 1857073 1933478 1934991
-19059A934991L7280R8566J83372Q8367J8736j0922q5691K8675q0753j48665J1570J3648j60488
$$ 1934991 1972271 2070837 2254209 2342576 2361312 2350390 2264699 2293374 2212621 2063956 2075526 2089174 1928686
-19046A928686l059J60543J00590j07407j13455j30752m9171Q3072j4735m8036J314M5095
$$ 1928686 1925627 2086170 2186760 2079353 1965898 1835146 1785975 1869047 1854312 1806276 1807590 1852685
-19034A852685k5333j51247p4961J5080n7195k3259M1744L2452j6941n0353K1670N9683K361
$$ 1852685 1827352 1676105 1601144 1616224 1559029 1535770 1577514 1609966 1593025 1542672 1564342 1624025 1626386
-19021A626386O8155J11740N1796N2144M8521n2161j27380j05327P7884R5813L2869K370o3596
$$ 1626386 1694541 1806281 1858077 1910221 1958742 1906581 1779201 1673874 1751758 1847571 1880440 1882810 1819214
-19008A819214q1572j94772r6269Q9317J18477o2855l2378L5753L3463j7323M3731Q8767K5899
$$ 1819214 1737642 1542870 1446601 1535918 1654395 1591540 1559162 1594915 1628378 1611055 1654786 1743553 1769452
-18995A769452J0560J5867o4151N2072J74572N055r7699p688N7848q0181Q5321J92628K1095
$$ 1769452 1780012 1795879 1731728 1783800 1958372 1963427 1865728 1858040 1915888 1835707 1921028 2113656 2134751
-18982B134751j38163j12925m1262q9397l6317M2657N5918L1716Q770Q7874N2613o2411j94809
$$ 2134751 1996588 1883663 1842401 1753004 1716687 1759344 1815262 1846978 1855748 1943622 1996235 1933824 1739015
-18969A739015k27055q5475J02588J99097R5529M1793L9986j35722o1823K3707m012J7261
$$ 1739015 1511960 1426485 1529073 1728170 1823699 1865492 1905478 1769756 1707933 1731640 1727628 1744889
$$ [...]
##END=	
