##TITLE=	29191402.11.fid
##JCAMPDX=	6.0	$$ NMR Plug-in 1.13 of MestReNova 11.0.4-18998
##DATATYPE=	NMRSPECTRUM
##DATACLASS=	NTUPLES
##NUMDIM=	1
##ORIGIN=	Bruker BioSpin GmbH
##OWNER=	nmr
##.OBSERVEFREQUENCY=	128.35610890361999736
##.OBSERVENUCLEUS=	^11B
##.SOLVENTNAME=	CDCl3
##.PULSESEQUENCE=	zgbs
##LONGDATE=	2014/05/30 00:20:00.000
##.ACQUISITIONMODE=	SIMULTANEOUS (DQD)
##$ORIGINALFORMAT=	Bruker XWIN-NMR
##$PARAMETERFILE=	(acqus, ASCII, /var/folders/bp/m_4195y96sx1d256lqvkcvym0000gq/T/kXhw9XmfTwGSeHQ5dyny+Q/11/acqus, 0)
$$ ##TITLE= Parameter file, TOPSPIN		Version 3.2
$$ ##JCAMPDX= 5.0
$$ ##DATATYPE= Parameter Values
$$ ##NPOINTS= 11	$$ modification sequence number
$$ ##ORIGIN= Bruker BioSpin GmbH
$$ ##OWNER= nmr
$$ $$ 2014-05-30 00:20:35.288 +0100  nmr@clevinger
$$ $$ /home/nmr/localdata/29191402/11/acqus
$$ $$ process /opt/topspin3.2_pl3/prog/mod/shimcntl
$$ ##$ACQT0= 1000000
$$ ##$AMP= (0..31)
$$ 100 100 100 100 100 100 100 100 100 100 100 100 100 100 100 100 100 100
$$ 100 100 100 100 100 100 100 100 100 100 100 100 100 100
$$ ##$AMPCOIL= (0..19)
$$ -1 0 0 0 0 0 0 0 0 0 0 0 0 0 0 0 0 0 0 0
$$ ##$ANAVPT= -1
$$ ##$AQSEQ= 0
$$ ##$AQ_mod= 3
$$ ##$AUNM= <au_zg>
$$ ##$AUTOPOS= <24 >
$$ ##$BF1= 128.356109
$$ ##$BF2= 128.356109
$$ ##$BF3= 128.356109
$$ ##$BF4= 128.356109
$$ ##$BF5= 128.356109
$$ ##$BF6= 128.356109
$$ ##$BF7= 128.356109
$$ ##$BF8= 128.356109
$$ ##$BYTORDA= 0
$$ ##$CAGPARS= (0..11)
$$ 0 0 0 0 0 0 0 0 0 0 0 0
$$ ##$CFDGTYP= 0
$$ ##$CFRGTYP= 9
$$ ##$CHEMSTR= <none>
$$ ##$CNST= (0..63)
$$ 1 1 1 1 1 1 1 1 1 1 1 1 1 1 1 1 1 1 1 1 1 1 1 1 1 1 1 1 1 1 1 1 1 1 1 1
$$ 1 1 1 1 1 1 1 1 1 1 1 1 1 1 1 1 1 1 1 1 1 1 1 1 1 1 1 1
$$ ##$CPDPRG= (0..8)
$$ <> <> <> <> <> <> <> <> <>
$$ ##$D= (0..63)
$$ 0 0.1 0 0 0 0 0 0 0 0 0 0 0 0 0 0 0.0002 0 0 0 0 0 0 0 0 0 0 0 0 0 0 0
$$ 0 0 0 0 0 0 0 0 0 0 0 0 0 0 0 0 0 0 0 0 0 0 0 0 0 0 0 0 0 0 0 0
$$ ##$DATE= 1401405634
$$ ##$DE= 6.5
$$ ##$DECBNUC= <off>
$$ ##$DECIM= 864
$$ ##$DECNUC= <off>
$$ ##$DECSTAT= 4
$$ ##$DIGMOD= 1
$$ ##$DIGTYP= 12
$$ ##$DQDMODE= 0
$$ ##$DR= 22
$$ ##$DS= 4
$$ ##$DSPFIRM= 0
$$ ##$DSPFVS= 20
$$ ##$DTYPA= 0
$$ ##$EXP= <B11.dur>
$$ ##$F1LIST= <>
$$ ##$F2LIST= <>
$$ ##$F3LIST= <>
$$ ##$FCUCHAN= (0..9)
$$ 0 1 0 0 0 0 0 0 0 0
$$ ##$FL1= 90
$$ ##$FL2= 90
$$ ##$FL3= 90
$$ ##$FL4= 90
$$ ##$FOV= 20
$$ ##$FQ1LIST= <>
$$ ##$FQ2LIST= <>
$$ ##$FQ3LIST= <>
$$ ##$FQ4LIST= <>
$$ ##$FQ5LIST= <>
$$ ##$FQ6LIST= <>
$$ ##$FQ7LIST= <>
$$ ##$FQ8LIST= <>
$$ ##$FRQLO3= 42328.5963799953
$$ ##$FRQLO3N= 2
$$ ##$FS= (0..7)
$$ 83 83 83 83 83 83 83 83
$$ ##$FTLPGN= 0
$$ ##$FW= 125000
$$ ##$FnMODE= 0
$$ ##$FnTYPE= 0
$$ ##$GPNAM= (0..31)
$$ <> <> <> <> <> <> <> <> <> <> <> <> <> <> <> <> <> <> <> <> <> <> <> <>
$$ <> <> <> <> <> <> <> <>
$$ ##$GPX= (0..31)
$$ 0 0 0 0 0 0 0 0 0 0 0 0 0 0 0 0 0 0 0 0 0 0 0 0 0 0 0 0 0 0 0 0
$$ ##$GPY= (0..31)
$$ 0 0 0 0 0 0 0 0 0 0 0 0 0 0 0 0 0 0 0 0 0 0 0 0 0 0 0 0 0 0 0 0
$$ ##$GPZ= (0..31)
$$ 0 0 0 0 0 0 0 0 0 0 0 0 0 0 0 0 0 0 0 0 0 0 0 0 0 0 0 0 0 0 0 0
$$ ##$GRDPROG= <>
$$ [...]
$$ ##$Sgu1PowerLevels= (0..7)
$$ 90 74 58 42 26 10 0 0
$$ ##$Sgu2PowerLevels= (0..7)
$$ 90 74 58 42 26 10 0 0
$$ ##$Sgu3PowerLevels= (0..7)
$$ 0 0 0 0 0 0 0 0
$$ ##$Sgu4PowerLevels= (0..7)
$$ 0 0 0 0 0 0 0 0
$$ ##$Sgu5PowerLevels= (0..7)
$$ 0 0 0 0 0 0 0 0
$$ ##$Sgu6PowerLevels= (0..7)
$$ 0 0 0 0 0 0 0 0
$$ ##$Sgu7PowerLevels= (0..7)
$$ 0 0 0 0 0 0 0 0
$$ ##$Sgu8PowerLevels= (0..7)
$$ 0 0 0 0 0 0 0 0
$$ ##$SguType= 3
$$ ##$ShimPowMaxUA= (0..63)
$$ 130000 130000 130000 130000 130000 130000 130000 130000 130000 130000 130000
$$ 130000 130000 130000 130000 130000 130000 130000 130000 130000 0 0 0 0
$$ 0 0 0 0 0 0 0 0 0 0 0 0 0 0 0 0 0 0 0 0 0 0 0 0 0 0 0 0 0 0 0 0 0 0 0 0
$$ 0 0 0 0
$$ ##$ShimPowMaxUC= (0..63)
$$ 130000 130000 130000 130000 130000 130000 130000 130000 130000 130000 130000
$$ 130000 130000 130000 130000 130000 130000 130000 130000 130000 0 0 0 0
$$ 0 0 0 0 0 0 0 0 0 0 0 0 0 0 0 0 0 0 0 0 0 0 0 0 0 0 0 0 0 0 0 0 0 0 0 0
$$ 0 0 0 0
$$ ##$ShimPowMaxUG= (0..63)
$$ 524287 524287 524287 524287 524287 524287 524287 524287 524287 524287 524287
$$ 524287 524287 524287 524287 524287 524287 524287 524287 524287 0 0 0 0
$$ 0 0 0 0 0 0 0 0 0 0 0 0 0 0 0 0 0 0 0 0 0 0 0 0 0 0 0 0 0 0 0 0 0 0 0 0
$$ 0 0 0 0
$$ ##$ShimPowRcbType= 3
$$ ##$ShimPowRes= (0..63)
$$ 1e-20 1e-20 1e-20 1e-20 1e-20 1e-20 1e-20 1e-20 1e-20 1e-20 1e-20 1e-20
$$ 1e-20 1e-20 1e-20 1e-20 1e-20 1e-20 1e-20 1e-20 0 0 0 0 0 0 0 0 0 0 0 0
$$ 0 0 0 0 0 0 0 0 0 0 0 0 0 0 0 0 0 0 0 0 0 0 0 0 0 0 0 0 0 0 0 0
$$ ##$ShimPowRng0= (0..63)
$$ 1 1 1 1 1 1 1 1 1 1 1 1 1 1 1 1 1 1 1 1 0 0 0 0 0 0 0 0 0 0 0 0 0 0 0 0
$$ 0 0 0 0 0 0 0 0 0 0 0 0 0 0 0 0 0 0 0 0 0 0 0 0 0 0 0 0
$$ ##$ShimPowRng1= (0..63)
$$ 1 1 1 1 1 1 1 1 1 1 1 1 1 1 1 1 1 1 1 1 0 0 0 0 0 0 0 0 0 0 0 0 0 0 0 0
$$ 0 0 0 0 0 0 0 0 0 0 0 0 0 0 0 0 0 0 0 0 0 0 0 0 0 0 0 0
$$ ##$ShimPowRng2= (0..63)
$$ 1 1 1 1 1 1 1 1 1 1 1 1 1 1 1 1 1 1 1 1 0 0 0 0 0 0 0 0 0 0 0 0 0 0 0 0
$$ 0 0 0 0 0 0 0 0 0 0 0 0 0 0 0 0 0 0 0 0 0 0 0 0 0 0 0 0
$$ ##$ShimPowRng3= (0..63)
$$ 1 1 1 1 1 1 1 1 1 1 1 1 1 1 1 1 1 1 1 1 0 0 0 0 0 0 0 0 0 0 0 0 0 0 0 0
$$ 0 0 0 0 0 0 0 0 0 0 0 0 0 0 0 0 0 0 0 0 0 0 0 0 0 0 0 0
$$ ##$ShimSysFunc= (0..63)
$$ 1 2 3 4 5 7 9 11 15 16 8 10 12 14 6 17 13 18 19 20 0 0 0 0 0 0 0 0 0 0
$$ 0 0 0 0 0 0 0 0 0 0 0 0 0 0 0 0 0 0 0 0 0 0 0 0 0 0 0 0 0 0 0 0 0 0
$$ ##$ShimSysMatrix= 0
$$ ##$ShimSysType= 1
$$ ##$TFXNUM= 0
$$ ##$TRIPLO2= 0
$$ ##$VTU= 2
$$ ##$VTUETH= <149.236.99.20>
$$ ##$VTUTY= <no>
$$ ##$WBREFAM= (0..15)
$$ 130 97.1 100 100 100 100 100 100 100 100 100 100 100 100 100 100
$$ ##$WBREFLM= (0..15)
$$ 0 0 0 0 0 0 0 0 0 0 0 0 0 0 0 0
$$ ##$WBREFPH= (0..15)
$$ 73.31 -75.54 0 0 0 0 0 0 0 0 0 0 0 0 0 0
$$ ##$WBSGU= (0..15)
$$ 0 0 0 0 0 0 0 0 0 0 0 0 0 0 0 0
$$ ##$XFAC= 2
$$ ##END=
$$ 
##$DECIM=	864
##$DSPFVS=	20
##XUNITS=	HZ
##YUNITS=	ARBITRARY UNITS
##FIRSTX=	11573.977694067798438
##LASTX=	-11568.519050723818509
##XFACTOR=	-5.6514033564814694088
##YFACTOR=	1.0094977539062500719e-05
##NPOINTS=	4096
##XYDATA=	(X++(Y..Y))
-2047 10758319 4468660 8980034 5878307 5893111 8433252 6300278 4353829 12695883 16603201 11296932
-2037 11296932 18847610 14769272 17159109 19768859 13509223 12608299 22930717 12616194 11203967
-2028 11203967 20946113 14512440 23646739 23491661 7520308 14280325 15487431 14815272 10037665 13722459
-2018 13722459 16803309 13193747 9573482 20772581 18379327 9684205 17627374 13258413 13852792
-2009 13852792 15727890 17917074 14727899 21156899 12582354 17652721 20156150 11909559 5502572
-2000 5502572 17458129 19723584 19632284 12249031 28828232 20802952 12271633 18266029 21509793 27529171
-1990 27529171 17565412 23237443 11967452 20041633 15118196 25584863 13846631 15942576 34163363
-1981 34163363 27917234 21932732 27608275 24331513 21305644 12798465 21521610 11842330 18982999
-1972 18982999 22180668 11438166 20593333 16916171 30188859 12698023 20010434 22196053 28992673
-1963 28992673 18214143 17611453 26750211 17531022 17198274 28937116 31181691 8714582 27663878
-1954 27663878 27570632 20573902 20730649 17719090 33079541 22383076 31190334 22031625 10197636
-1945 10197636 15830298 16137335 16817444 26929070 20800620 17951238 27688147 19959663 17668255 18141232
-1935 18141232 25633583 11950415 32551406 19824338 17398171 36138482 10286178 18646834 10916320
-1926 10916320 12854154 24613947 14459907 37596748 12881321 12854446 22824578 11380253 18517894
-1917 18517894 21141840 27680937 25653976 14069175 21561295 29106107 5883192 15674029 16185055
-1908 16185055 21206774 23666278 20731368 15589343 19098465 24772962 25060781 14087280 27293462
-1899 27293462 17924854 -2756401 27822857 28588404 23968335 5801664 21994401 34992600 6599768
-1890 6599768 18871024 26578702 17621513 28576920 25320577 18170602 31533715 23763696 20886249
-1881 20886249 19428116 19448084 14614208 10389935 25348711 17770602 24222951 18431441 12431798 19597278
-1871 19597278 9201894 10303540 21766675 22291786 19709710 22547183 23070434 15897397 21385235
-1862 21385235 11660412 14770070 8939217 21814776 25115421 21141529 25083071 8195566 32993417
-1853 32993417 23449255 14015323 14062767 32478716 17785699 19639491 19739561 12717675 33415038
-1844 33415038 19616293 19569782 21093722 18202651 10646156 21441249 17611837 22092710 24387157
-1835 24387157 12991727 22005884 10218362 12392795 23028600 17491375 22749280 23928345 17696626
-1826 17696626 20903408 24461849 30534487 31320866 28290852 29182635 19553781 22264868 20298633 15053428
-1816 15053428 31833994 20422496 12151144 18076186 6557176 19713936 13742603 9517050 5922907
-1807 5922907 18650845 30255922 25555098 15190456 10510597 33996712 25385300 23580870 5792819
-1798 5792819 18194602 23341135 11287930 18570988 21563284 33620506 34750061 21977944 22401787
-1789 22401787 26978155 7010350 24090650 31286173 18433621 13634997 17989045 9257340 19798037
-1780 19798037 15141466 12026205 9068511 4774914 20260142 2338544 29091714 27007850 21627301
-1771 21627301 23817887 17306366 19008226 19718085 9869799 16841301 9375070 43567 17864801
-1762 17864801 20636033 16821113 20455190 28949029 21279490 26614594 27941757 13870610 16674802
-1753 16674802 30354020 10568332 17129010 23123371 33223259 15202863 21377677 30126642 14188549
-1744 14188549 22574631 24476013 15426707 9304029 14995899 17559357 31982855 20603433 17635997
-1735 17635997 18318820 8365031 14991786 20319399 19885904 31856546 23255832 11363131 10908801 32865291
-1725 32865291 20441417 14331715 28032775 16441893 13167637 10365053 19238689 30084821 26766007
-1716 26766007 20850166 16217652 33906338 25189698 11676240 16471942 12524196 26698837 22695949
-1707 22695949 31947773 27123201 19195065 28520238 25826686 17513820 16262505 28371567 17102563
-1698 17102563 16252479 21701119 5581040 23760082 31156742 29649309 21582488 12366296 23354179
-1689 23354179 29149079 21361022 23253150 20793300 20147777 17104517 21078857 17185837 9094653 27586404
-1679 27586404 22644598 11819079 14077932 19104215 25015176 31045330 17946469 22520121 13449746
-1670 13449746 14225932 23179121 15681657 25946909 19672149 22034910 23691495 6219751 30036549
-1661 30036549 19356156 19998146 14649961 20149708 20769047 17921641 22585762 13000781 23678916
-1652 23678916 21105187 21234214 7893268 9529594 7839466 24710394 7952075 9512585 16932081
-1643 16932081 29184942 23379748 23000220 24831280 24254503 23560330 6991776 11617098 14701107 14028992
-1633 14028992 24560178 26875906 14175680 20172085 15156192 17145551 15644423 35438036 14598307
-1624 14598307 9380485 24043281 22374836 21376028 24670782 23020631 19737020 17644326 20045375
-1615 20045375 22020210 17321645 24427867 15558911 32352377 16939906 19774044 18493728 -1674539
-1606 -1674539 26080159 26182922 28254083 20592764 27483245 25490487 22078993 28362468 24815825 5664194
-1596 5664194 23494587 29242365 12640239 30775690 10981819 12140723 13052539 22000585 24829604
-1587 24829604 20863978 24711339 32790414 16181968 25923127 26801029 25309961 24189766 12569653
-1578 12569653 12168417 25508247 20525545 9859623 13611990 15061721 20371934 11756633 22345685
-1569 22345685 25024301 38969661 22049481 25556797 30562656 27341207 16215414 17501245 10798979
-1560 10798979 19098530 11388611 20008839 20084184 18572983 27572510 8676992 11105546 10220575 22332833
-1550 22332833 2003100 32246667 23800963 19704897 27273355 14656775 17393368 5368836 13067166
-1541 13067166 24513877 17613337 16630170 29336185 19334118 15788985 21089165 15159469 16362104
-1532 16362104 21319294 22171846 13857364 13065881 18450051 8899207 8107083 21781307 15541306 15734305
-1522 15734305 28492550 21359032 20606296 14509047 11309093 27951046 21928095 12838728 17144982
-1513 17144982 20197630 26578965 14632228 21446793 22711495 22340871 16154342 23484433 25247647
-1504 25247647 7607006 15963674 20726144 22266951 18152769 15035244 10693377 17125251 27919646
-1495 27919646 13157277 25430582 31336637 14728276 26071223 13330125 13910976 22149609 21405436
-1486 21405436 18355986 18217938 16729043 16659067 15985324 7852061 18543321 22905334 21972334 18579000
-1476 18579000 18311154 20312073 9811504 12271855 6797558 5998264 17130638 17957124 12693743 14652755
-1466 14652755 17649077 12985612 26221030 23352666 5853771 16406606 31881886 12192836 19500614
-1457 19500614 7972472 17546796 11625892 12884850 23378868 16662296 34857397 13705136 21640486
-1448 21640486 14080111 18126337 17876818 20045339 353845 14496046 23162435 21469974 21670400
-1439 21670400 5414624 21489918 10246326 20644466 17889704 13221557 12165372 20194134 17929987
-1430 17929987 18100798 22626334 17397989 16486188 16513733 14230207 28509560 21981781 25051049 28028046
-1420 28028046 19303679 21121640 3696107 10223044 31785003 17375902 9212464 16272324 10133515
-1411 10133515 26079703 23134547 10609038 6073332 15401463 13766691 19000612 27494361 17204911
-1402 17204911 19662860 31242400 24170078 23777823 22590201 19409993 10640165 12374503 7205684
-1393 7205684 17793081 24646777 30208835 21435071 7732885 25216888 12465103 14560909 17785192
-1384 17785192 27167138 29630131 29421628 6808069 14887538 19467992 18277093 17064716 16223670 8756658
-1374 8756658 12219826 28562476 17476893 14027271 17224720 19472177 16547577 22055024 12844141
-1365 12844141 26356354 13544103 267859 12114386 11700907 22214208 17671152 23273733 17241256
-1356 17241256 9240270 8395081 9953495 23265389 10062124 17485686 14499446 26605728 11505630
-1347 11505630 17024431 17657126 3231579 19949435 21122072 15367911 14744423 17081556 9957603
-1338 9957603 10524079 9637295 28350669 16645862 19976793 22182122 22129936 24019220 23232749 25300839
-1328 25300839 30223116 21687612 21123443 14633670 12941590 29716587 14239059 26748536 17412730
-1319 17412730 17221298 19544974 23707073 27831627 15915218 23340867 23913919 25759795 13569717
-1310 13569717 17840153 11175978 24010633 16472025 32858057 26853518 8982692 24238245 15831383
-1301 15831383 33431172 15813411 16054741 24144235 26714902 22953078 22491171 10288558 20368081
-1292 20368081 18739913 23701055 8707828 12589273 20584799 599865 21389902 28877311 20442723
-1283 20442723 20462086 15009832 30289058 30265248 14596204 28554298 9031720 25266961 13291743
-1274 13291743 23437967 23909990 10589753 17876472 14733280 13301205 39781796 28269077 14944134
-1265 14944134 25393489 23813083 19715626 9807197 25064543 18369287 22983950 24087998 26324763
-1256 26324763 20114023 14617361 15495894 27057117 27540085 33075487 26586262 24154604 18954661 15936233
-1246 15936233 28321726 23268574 17600498 24833064 29125279 13832300 27584690 28202658 17577104
-1237 17577104 22211471 26870480 29238108 13884703 13795091 28122556 29561882 16615670 17612673
-1228 17612673 30474752 42936553 37968743 20494151 33767441 33621189 23205194 24682170 20906206
-1219 20906206 24915011 29515337 20244325 27058770 25818920 26165228 29288862 21602746 20950584 29620998
-1209 29620998 17660292 29240865 30730562 20127279 22117962 13832992 18795128 25208227 26479452
-1200 26479452 22873016 27617263 22283094 27000468 20954924 31136832 23645755 34692254 39976036
-1191 39976036 39943354 29936275 10015201 39024566 40197160 34325268 16450138 20596691 28788466
-1182 28788466 26448266 20715701 30007216 35582916 27449124 37753883 33734544 35149006 39782863
-1173 39782863 29480070 24599171 26459585 27375734 30152767 29042085 34196502 33291674 42162372 30071577
-1163 30071577 12750038 24748142 22494147 33186000 36848393 36794159 41196978 42201493 53312915
-1154 53312915 40459911 24253425 31300007 41822180 30349183 34311329 27668700 33060768 47516866
-1145 47516866 25997833 38645624 44925375 46233550 44394671 43523241 44283559 37939277 33323567
-1136 33323567 37105778 40491761 44432386 46258351 40517690 49085008 48795173 45688951 47909261 33797088
-1126 33797088 41280640 44063674 43928928 48541627 37694474 46244681 44039819 51579767 52036325 49606701
-1116 49606701 47076928 55465269 47258665 47560743 46149086 50563860 57083772 59696614 72204436
-1107 72204436 55804407 47858721 50033449 67312398 63839366 55677892 56544872 60343425 76536623
-1098 76536623 58432739 60894061 79164019 72061869 68229602 64619529 76805880 67346099 76388730
-1089 76388730 75268202 78611104 64755282 79933215 78738979 81549952 98834070 74433527 90026221
-1080 90026221 86739922 88069301 92846517 89063042 83120212 99938842 98379573 98456975 107420034 103389745
-1070 103389745 90130159 89107052 101455166 97756330 101323179 103264845 106752146 115228923 117396423
-1061 117396423 127260307 112334805 138083475 132740109 125034849 138936579 131707098 147899341 154112074
-1052 154112074 152505555 159778943 170910571 149139164 164674886 165696797 175587102 183713895 193233103
-1043 193233103 204171812 199289630 202786774 200866257 206051808 219857671 221899605 238146323 237637170
-1034 237637170 244170963 270651803 263696476 275166637 281403616 296215330 299965938 314788221 325397129
-1025 325397129 339993554 355877990 360194367 377181828 381635307 412624403 409426456 427183584 462122785
-1016 462122785 469961954 491605558 494511406 519155129 544458699 563418661 593727378 616313012
-1008 616313012 633294016 665955388 671207313 684940115 707863120 742018361 769109929 795811403
-1000 795811403 819236573 834409747 856121599 868304231 900511808 915909897 939233492 953597071
-992 953597071 961861255 969327259 986105598 986593251 991823846 999999999 985515112 976224640 969288661
-983 969288661 965156423 959150575 930938255 918210120 906091528 879073046 854201554 849370679 834092835
-974 834092835 799577054 776634846 747618589 734703509 709511865 682797380 666345917 638220903
-966 638220903 611120435 605235508 582631398 558939668 536795012 512530983 492633103 489671292 461748750
-957 461748750 443676692 443738750 423240468 409308146 401120480 388547779 363039029 360902050 343632672
-948 343632672 334488588 331926278 325403175 307575089 286246245 288008608 268664138 265875101 271362823
-939 271362823 263689801 245329587 243596270 250916007 234982234 221323243 214976613 209638495 202435109
-930 202435109 206828973 198541112 190763770 174105954 175666378 173633440 160400227 157808449 165319992
-921 165319992 164455328 157993375 152058048 142430204 145143750 139471331 152557213 135119645 131946269
-912 131946269 140847518 129997638 127953382 123572239 114660990 119100635 118206285 101300470 108477628
-903 108477628 103397617 110138235 113947067 100930262 111312894 105969008 102895550 102572785 101963678
-894 101963678 96529324 89614905 93230764 90880915 91429573 86914455 91932868 97574276 78423403
-885 78423403 85556061 80569269 64849275 87881291 81455935 75612055 74874293 85476265 75428109
-876 75428109 77828135 79094749 78953572 78778127 59681711 87049797 67788794 58366232 46868801
-867 46868801 62614561 70248694 58607363 68613390 65863114 55772048 49122309 53758597 46779984
-858 46779984 61527365 43880958 49198562 51194722 55566638 39677912 51087361 54578677 49126895
-849 49126895 59516072 39029049 50278285 43225734 53960059 50049432 61002371 66660641 56421664
-840 56421664 53680935 43714168 46125594 54758808 51991149 50238720 53046579 48636312 48030004 48759002
-830 48759002 45267116 53978487 46829235 45902602 45143277 46905727 41673159 33380675 46041327 46904787
-820 46904787 47974093 32749070 47257991 40075736 36837462 36966125 34664052 37300284 30912733
-811 30912733 43777032 49039964 47023553 35279094 37667735 43209380 27046905 30999338 45181754
-802 45181754 40831942 34708273 36013110 29787489 40393198 34590175 31457985 33096666 22078428
-793 22078428 35887025 33745515 47017719 40381541 33550564 41146789 37055508 35868878 37311127
-784 37311127 32747529 36838517 22613678 36458208 41178764 31005145 37088631 24802965 32042724
-775 32042724 24486314 27137557 39171280 37325354 30096962 27774253 23015596 30692347 21825026
-766 21825026 17779601 35642467 27636580 30440543 36142621 18471176 26544904 27924689 22879222
-757 22879222 22172820 26312126 27409673 35783988 37319359 27734279 41470926 26653053 24158890
-748 24158890 35013087 38005007 33965725 27990077 28722017 37542451 37362713 27144930 13986527
-739 13986527 17864198 29380358 27862405 27713109 30899610 27665671 28403841 38974150 18550658
-730 18550658 26347626 44284399 41620286 32528391 27752160 22886089 29030135 28450339 13819714
-721 13819714 30175425 32442618 16882540 17673857 29934706 26234679 26843971 17362912 28129672
-712 28129672 23476543 26737342 23170621 27919713 31074131 20501505 21373466 15940349 30342412
-703 30342412 24132512 26621807 16367463 28823570 35545484 32473344 18961181 20378769 21099165
-694 21099165 32337047 32508369 21926963 22590884 29015500 29633843 28158273 27933616 32488106 36201038
-684 36201038 35734830 41408137 41121961 45923497 15279236 40099001 29251800 35782612 29662362
-675 29662362 30309077 26883243 11534599 33840565 32814238 26766496 31550037 34370647 26634172
-666 26634172 40006297 35957659 34280201 28002429 35768957 29037874 38822297 29916525 18700450
-657 18700450 35542129 31613288 32959347 32433691 30542888 32581576 26866344 35805475 32068226 47638381
-647 47638381 43500342 32200953 62233089 54739605 44068191 74820428 71415396 85594061 98252744
-638 98252744 72834003 86311793 90151321 95173440 90425795 78332796 80330896 88486475 66988436
-629 66988436 72874433 76173169 69011017 67613596 60310595 55859051 51072071 51123069 59531725 45955460
-619 45955460 34853890 39087409 53922966 47756950 40034880 51083703 34218370 30234552 37852017
-610 37852017 54234715 39987158 37229155 34363927 49495187 40728418 37038836 43400470 36903938
-601 36903938 40770012 32867398 33084598 36059801 37388499 26281164 30365792 38433421 37521571 33442095
-591 33442095 27468904 34743567 32523140 32308994 31852710 29125043 33559265 41435408 38547913 38394285
-581 38394285 50134443 32571485 34064207 30915300 33499865 22604875 41955185 30818430 23657537
-572 23657537 21558002 24424993 27349294 17357536 33559207 15839953 29404140 18907900 18209741
-563 18209741 32460282 29098870 16200971 31534238 13997123 25094181 33491506 29735650 26056325
-554 26056325 30486741 29783311 9078816 29074921 17328607 30815283 24288202 25049727 26541947
-545 26541947 36352934 18269995 18201623 29010536 25703013 25852720 22601738 38927305 29489535 22918111
-535 22918111 24334730 40029356 21552716 28064973 25812565 27264610 29036640 28284313 20453586
-526 20453586 22111895 27330113 19873555 22815825 22784522 24926716 18205124 28025383 26859035 36989267
-516 36989267 32427950 17267573 17478831 30194524 14696991 31172008 30723222 21586393 26399813
-507 26399813 27319813 17902394 19748908 23662515 31394235 32553981 13833187 20332129 30471846
-498 30471846 38795008 16769278 22003842 26047634 23686499 17752423 21810279 11509927 27051663
-489 27051663 20353041 30957205 29139182 19947866 29039805 29411474 21045459 29685298 19882441 4434502
-479 4434502 25425358 12836696 31574723 21831778 26333297 25711208 19938798 10756469 26915381
-470 26915381 19128901 15518141 24088611 22210192 13925428 27522330 35198717 22109142 21616413
-461 21616413 17226375 7118830 10251602 27527660 21068350 36417016 15502932 21963599 20273602
-452 20273602 16953318 29003471 18527072 12655946 20292221 17630665 17436035 19056023 10484117
-443 10484117 16722031 30014348 26441582 29998864 16337217 29575504 25761149 12462611 27085095
-434 27085095 21624584 23620020 13624159 32601896 12361907 22555058 16032349 9299103 25200568
-425 25200568 15845783 31660236 27142246 25258479 31938126 23905531 16054168 25076039 27372892
-416 27372892 19413619 22387935 28723852 23600903 20576647 19203509 15014521 13794184 27648914
-407 27648914 16847008 9602323 16546388 13332976 20037795 15027872 25106277 11840034 5858979
-398 5858979 27756166 10268856 20567143 15930096 18207238 30815757 2416282 17052497 17915727
-389 17915727 22689219 14568472 11934953 35455893 12282149 16966656 16503465 18777965 27056228
-380 27056228 10556404 17467174 19968629 20944437 30843013 18182348 17553462 13217438 19767470 22996934
-370 22996934 16732501 24751738 18199046 15079665 10774752 17929847 20231965 22287930 19092206 9449136
-360 9449136 11447827 15762069 28360826 20130692 17322878 19862312 13889584 14188277 15020900 10863919
-350 10863919 22907669 19847481 6474022 18989769 8384921 10089003 6864184 21074709 16948465
-341 16948465 16264723 19931499 24373802 22192016 16090057 19958566 23891704 19676302 9449445 21485512
-331 21485512 3584312 18256979 20632543 23451452 21698814 9875866 7252371 7904176 14801563
-322 14801563 22711776 5468753 18259566 15021900 8860574 32071802 18232774 5107278 22689044
-313 22689044 19889332 20819393 29965716 19864960 23351724 10286038 18160086 18128025 17422513 12298165
-303 12298165 13066321 19974612 19612832 8478806 16136221 15620621 14163351 4925302 27369053 10464833
-293 10464833 13107907 16771727 7270895 22232644 12608754 21484052 9770091 15407850 7771583
-284 7771583 11722104 5360347 13854379 10117062 15625816 376686 7782924 6763523 15875803 23685565
-274 23685565 6581367 20400789 8729592 4651777 1850774 9872531 17534145 14974649 10510002
-265 10510002 13979984 6068385 13049291 15883777 11345669 17833236 20404592 15969364 20313550 14113714
-255 14113714 14260518 7484448 16485058 10119862 12922892 28501183 3165535 23798320 17953301
-246 17953301 25744804 22404182 17572628 28704341 6289694 25658837 18216876 18409087 16185211
-237 16185211 6269701 11875160 8039167 5925211 25350830 11277032 6431411 8664045 59804
-228 59804 11349550 15450281 22111804 11055287 21896173 21089956 12031495 18087878 25456868 12719916
-218 12719916 16615739 8710058 12349582 27187504 8287125 4468246 19706971 25186610 22747445
-209 22747445 -1569021 15526729 9174052 16372571 14907120 21031292 14290641 9052046 27936642
-200 27936642 662017 12166093 -1973956 7720101 240607 18236296 7868139 19545507 16916414
-191 16916414 29000847 18683208 16397122 22886039 9032658 9601882 10742648 26731006 13253317
-182 13253317 27276463 2796839 11954411 12725208 17954948 22087732 9285278 8377278 11046446
-173 11046446 20690899 18574943 9104352 20275842 14666439 15763381 13235973 14469921 10313223
-164 10313223 15147778 1611437 16186754 13853263 3774567 17666733 2571340 8866501 13708665
-155 13708665 19512972 7353078 7220128 632990 11583371 14127067 11143755 4625336 13537437
-146 13537437 972595 149966 14998218 11770171 17153527 15747997 5278300 13044969 15095797
-137 15095797 12861523 5864755 19434500 19966547 21074910 12054464 11143654 19904189 13942965 13819759
-127 13819759 2145816 22010413 15995493 17016820 10114432 19070292 3085953 21952654 10141845
-118 10141845 1158595 17385652 9634796 29660567 13810947 10824546 18383293 13411368 25202900
-109 25202900 14729182 4334648 19445027 16960673 6155575 11327776 9399534 9072194 8912449
-100 8912449 13709224 20231273 10592128 15155759 21988837 28345965 400952 26681854 10888754
-91 10888754 5979901 13990070 13745506 17719205 14689438 5782429 -2103102 18894059 -7727583 11371381
-81 11371381 11342863 10568399 21958989 13350224 14796921 14144892 18952927 15850192 19841479 5382997
-71 5382997 16753047 15268100 -3578442 17571764 13976168 26294538 7650355 10371830 25845704
-62 25845704 22276379 16777072 4673822 30383138 21661481 11463498 25620106 12458133 15912094
-53 15912094 9915440 14295948 10893828 21506602 27464602 10217406 7768294 19418394 24465584
-44 24465584 -2475818 20206339 18331290 15243933 8967124 16679823 17475320 21313635 27107822 24021905
-34 24021905 2645053 10007612 28016368 17707006 22388798 14815531 29130687 17716024 20360977
-25 20360977 26094685 18668789 9868914 21511489 33310716 12484072 12224106 18850199 17586166
-16 17586166 15939579 22923044 30889045 23177275 29312170 12187810 14652179 20862023 13694047 17749552
-6 17749552 7293022 20187619 25209968 10751350 7488360 11853395 29243925 19192166 16830803
2 16830803 16827106 11144492 17358710 5923458 24397917 24699679 16713255 23094471 37169020 20710394
12 20710394 10728366 31115625 33100935 18796182 23261477 21259976 32419353 37187975 17985667
21 17985667 33280280 31354122 26584430 25694969 18927765 15682897 32400909 22407437 24129498 23755656
31 23755656 27544970 31717704 13869911 20264223 23367583 22194421 13499284 24714383 19878662 36345842
41 36345842 36722066 18088892 16160222 29066795 27859397 16064525 35807186 18331578 27665006
50 27665006 29066191 21985379 33719287 18702416 26024704 34332406 31657288 30989023 28415767 34640932
60 34640932 21633634 20008064 19673109 17726207 32745902 31496728 23547389 30655850 24687075 31886943
70 31886943 39499698 25716456 34853007 24531497 23472416 32013536 22249637 36803537 41306938
79 41306938 36273204 45362719 31145816 34449343 43341783 47094743 40752221 27313906 33780159 37108481
89 37108481 28679026 39537304 38045622 21547141 24887429 34142577 34814642 28219541 31290049 38250542
99 38250542 41070820 27634153 30652398 42009618 35318324 28495437 38916628 42344692 30530406
108 30530406 31479718 47095650 36775181 40550357 45995122 36938105 28451140 33774188 38621488 29802931
118 29802931 33523632 33449921 48962441 29665422 34541715 42370454 29472376 41789951 37002441
127 37002441 36624624 35097653 34666434 45397551 40264235 37292611 41121707 41648113 52082717 25035537
137 25035537 43071750 44930067 42184752 40459004 34848258 40199119 22491609 57496381 44968729
146 44968729 49233028 44130145 34962031 38349958 36314405 51102168 58753787 49761160 49097067 43887700
156 43887700 54612184 48612282 37612310 38168385 41652944 47320395 26244232 36186808 30180476
165 30180476 36706219 29062472 43003108 44893452 43521872 37503484 39058182 46901389 33826357
174 33826357 41654612 46105796 40265895 57927183 48285917 42022644 39988340 40296569 49185140 36461579
184 36461579 35551032 41910386 51932448 40980921 52248156 36972256 34774732 39789868 47059247
193 47059247 33995702 34667099 28340478 46538875 59621903 39808792 39349782 43319101 43111605 51209831
203 51209831 47481899 27615032 46791722 43331828 52462938 47848984 41788956 41207861 46062174 47656141
213 47656141 36298319 29998676 43952686 34496342 41616319 47135727 36970149 52204933 38498680
222 38498680 36653890 31401128 39771633 47234774 43208298 46885267 32157252 46608229 40515217
231 40515217 42071744 36285475 39790058 58147068 44640598 49997251 44001146 41974753 41314501 44128337
241 44128337 44222829 40190282 46735956 41844919 37306402 57573886 38779889 37932886 49207819 53688390
251 53688390 45539453 35562516 47050422 47168533 40661475 31516085 34496590 33612854 39102808 45784836
261 45784836 43394157 42982512 36667896 37677717 45124893 42748359 41091960 42508583 53017830 49662025
271 49662025 38300836 42150476 48762397 48865244 45353043 44702181 53118800 44812637 45854360 27369373
281 27369373 37975578 38352497 40707199 54249443 33490669 41435305 36166992 42232307 58661403
290 58661403 50668612 46478332 28321185 29239212 56470335 50871794 39749688 35294980 36893769
299 36893769 37946266 44319926 38723228 36150946 28038258 47526083 39655974 34975417 41160680 44587248
309 44587248 50885537 37960263 36868980 36761492 40038256 28773124 36526538 40322849 43799753 43560830
319 43560830 49778497 37830109 30364728 30769163 33651326 46411072 32620095 47994731 48084570 44662162
329 44662162 39702441 31966162 48545019 38195272 51574942 41549308 36648730 35639716 45792533
338 45792533 49472876 31109062 46792916 39108506 36928673 38719985 33792490 36215083 40422204
347 40422204 46683700 44538831 44650683 38634209 21132862 40450721 48602587 46248206 42903898 37889669
357 37889669 41765715 41411677 25464446 30303106 36183117 37613499 45714269 45031481 44639849 29033019
367 29033019 44003029 42661102 35536376 46102398 31364389 43879263 49537754 40275502 49978780
376 49978780 49874972 45328223 40610413 45454194 35776995 38237887 43477355 42330266 41867855 40874089
386 40874089 38471796 35134468 35033701 38716173 40167800 30186014 44251390 44051295 48233419 44577193
396 44577193 31414695 35574986 26224519 51285594 51219118 32357692 47563581 46551813 38377613
405 38377613 32098015 34748791 43722560 48973167 41021952 44441346 32175641 33699988 48252905
414 48252905 36136650 45400837 39893519 32748254 34629012 39630172 44423495 45103345 42677934 35523477
424 35523477 36658337 37204468 29007002 38236760 49733877 38923127 25448539 24382521 31810539
433 31810539 31001901 46468477 34762313 42359720 45068314 27553020 46524917 42261555 38364045
442 38364045 48692713 30961601 37257756 38896603 38888338 43396609 33004850 42138804 42321124 55733528
452 55733528 38589740 34567006 32372341 30544989 45717241 48100453 31921315 34389070 41154764
461 41154764 33432252 33791819 32680378 47009149 36479881 39761886 43302577 33428566 33865956 38152556
471 38152556 49949717 48970449 48875973 32239857 37026680 43776322 24259066 36039148 39580198 39212505
481 39212505 43328757 40447725 40473874 49027917 48533090 50029126 31891287 45669453 40738339 40367396
491 40367396 46945390 33913563 35543937 35689575 53099458 40558764 32796475 39362291 30037489
500 30037489 33660319 46071394 40027397 48223092 35394075 45301358 35528646 45112943 44281231 31691945
510 31691945 42618417 36633300 33248973 41087688 46093444 28068713 34351956 39775218 39103736 30161319
520 30161319 40669979 49412352 42392746 46101183 37543418 43755339 49127143 32558625 41954888
529 41954888 42894663 32391232 31968187 39436601 35766968 35472043 23212465 47793602 42668895 45707903
539 45707903 42219991 39084939 42919415 40560264 53591453 34760684 44594400 20377043 42693984
548 42693984 35937329 35097659 41143681 33809286 35961217 38831722 43798611 37373411 40490434 39940718
558 39940718 37483314 38469383 48272492 39641808 35564460 32831086 40122415 37873084 53050751 46352428
568 46352428 48117715 43569322 30822517 40925910 35764634 43127386 40211574 43780902 37484505
577 37484505 37488728 44228068 41724278 42785020 47646809 37382009 28351234 39788607 43522854 38598253
587 38598253 35203100 44805977 33045299 39754205 52861067 38584338 32508372 35410378 31332822
596 31332822 37281399 45516801 42465221 42871234 43219023 44374235 36392206 38272949 41531091 32238227
606 32238227 43516727 45180974 49184009 31819442 24676908 42124022 46786423 44170046 25660563
615 25660563 43967079 38094783 54528754 41067903 37399914 36629902 36267246 48899650 39247400
624 39247400 41912049 38642694 45713834 40414520 42112286 34553094 48311610 28336358 46494049
633 46494049 46975696 35803556 32939583 25041829 33784826 29636763 45288443 39176350 44134698 43523187
643 43523187 39587569 33665428 36497097 34147008 37480711 48879447 32110821 33661407 37807297
652 37807297 33307968 33726079 27538452 32296043 34931295 43980522 40695766 49502871 43895424 35263936
662 35263936 43339670 43076024 42623580 38667780 37236216 39260910 42220744 27150731 35476284 44765819
672 44765819 45250558 38399654 46270767 41700587 39893256 38156141 36287304 34086671 26635813 40174036
682 40174036 37965429 28723891 34378689 39396733 19758349 31689209 35234906 42451354 34000448
691 34000448 33952246 42850315 36639310 53232817 33436302 35045131 46473184 28716993 42038161
700 42038161 34409469 28865016 36352366 26468152 38864943 27614551 37099557 41931097 45365177
709 45365177 33833132 25829996 28892018 30431322 38646026 40835560 45211226 29133009 35763259
718 35763259 28196185 42455024 44707780 42260781 42773783 34215393 29807541 38455154 42130400 38001337
728 38001337 41408781 48860891 44469981 41148028 39273253 28119064 52732345 28394180 33191415
737 33191415 30783719 38217334 37281072 33712987 46232057 40261844 44793138 33255790 40372309 36785837
747 36785837 28024383 27768832 40426811 28834471 38064238 43624492 38422889 34389723 34551719 41056037
757 41056037 34922834 38516745 47917432 37005129 36731090 34394566 43133136 30960628 31647678 35787818
767 35787818 32530562 41196778 24102468 36333883 23100159 41561926 32650697 46202189 35676409
776 35676409 25086608 34370499 35285161 36973387 26036549 40922394 44437250 42781682 32192395
785 32192395 29959764 32183313 41296898 27189635 34032891 35095114 41778841 41872148 50616286 31637367
795 31637367 26735277 29769018 28860557 31141983 41900770 40560445 27899773 38276767 31215265
804 31215265 34183753 34565987 48806162 27005093 34156987 39024451 35104582 24522024 26334551
813 26334551 29830891 34145993 39148474 33078081 33996947 33204964 30917984 23897897 31111843 43936737
823 43936737 30144438 20983980 35657933 24356533 38419745 28480454 31723596 45060236 41007714
832 41007714 29244795 35293695 39894380 42618731 45583217 34135905 31814260 35720945 33633728
841 33633728 26350800 31664208 40423153 41926711 36819783 43554200 28780993 26239682 28177279 40459025
851 40459025 38210187 32353692 22075349 22724701 25040497 26234259 34852669 29392404 40385707 25112159
861 25112159 22039528 25697254 19010765 27007294 32108535 31811059 23886891 23285063 32514518 34071042
871 34071042 31382098 33067052 38970583 33085191 32931832 35085549 27056201 9068763 27061769 41913451
881 41913451 38417589 29377416 34320622 26567368 23693369 42538122 27413670 32129464 23091830
890 23091830 39120157 38381887 30540850 35981069 31769836 38102594 31734313 31672594 31226631 37495960
900 37495960 39817084 30137848 24943028 17388963 27138685 32539957 29389847 41278155 22528764
909 22528764 21038766 33227987 35249280 30963944 24641055 29148584 30941298 40552340 29246047
918 29246047 22763249 36000571 35496366 33899490 29034288 23816861 30686229 35123050 27389594 34378114
928 34378114 33223610 24083233 35698197 36995503 18267336 14378587 23747468 28291574 28296191 21829935
938 21829935 30144070 30892536 19773945 39031893 39468055 23333846 36539806 41155269 28796834
947 28796834 29646386 52068394 22697475 29004140 30492282 21091071 41096479 11658834 22732153
956 22732153 39881227 40828287 35929157 31496665 36128757 39983376 23855837 26863288 24768528 33636434
966 33636434 34119384 25792810 40129362 27234990 26604038 18870768 35931032 45628478 29750276
975 29750276 21323867 38972693 36305835 28885016 27618811 20271786 29574074 23528113 32683011 35283628
985 35283628 32425181 33571965 31034919 39782368 22324103 19471932 19771543 15175069 22885377 10136483
995 10136483 25339916 25364045 33092658 30833530 28528448 30836979 19212445 36693241 33174885 27554450
1005 27554450 29803920 30040878 23537968 20038551 23816642 19913492 23639041 20720689 15563349 32489494
1015 32489494 31618200 30672380 38731116 26202472 25253488 26329566 18515024 17634413 33101165 37883100
1025 37883100 20923534 26439587 24501380 29544467 22211250 14289321 27371471 30982638 28999481
1034 28999481 23913231 27607641 25607820 32266257 27801091 29258181 33705813 33631782 23577047 18668396
1044 18668396 29481155 30565975 28529657 34636382 26168520 17734130 35510514 22940936 28059465
1053 28059465 32336304 26695666 22779465 21834155 29202197 26855715 22276424 16931531 33420595 26476701
1063 26476701 30561262 32195938 32400501 35640868 30859564 29489024 31797754 42689751 35358582 29596025
1073 29596025 33816605 30293698 21694450 36379286 30435183 26434687 29135210 27590923 27419786 31586495
1083 31586495 23602199 23576633 36544217 16228150 18585985 13013136 4970638 22567986 26280542
1092 26280542 25822720 21120665 19654394 37028213 36717625 20759987 27920145 31130840 21547339 23063472
1102 23063472 24875740 30549829 24918932 28911876 34968182 24236345 22667420 26983306 28984324
1111 28984324 35216501 32875540 19804019 21716252 19916101 34929309 24635065 20048353 28247030
1120 28247030 20481553 18600419 20527130 25648136 16978184 27093647 17619412 24644850 35684850
1129 35684850 26722157 16973689 35880532 30296144 24339588 30591571 12028276 36711425 22230424
1138 22230424 20385155 27544988 32355585 13839221 14075134 30067254 20945995 34040044 22633157
1147 22633157 26197919 21996903 28384642 28592389 34454443 28159289 18560688 39158202 25116208
1156 25116208 13859633 22809249 37448646 32559519 25438596 16421865 27460394 26498382 16021776
1165 16021776 20130211 23122280 29585867 21300633 22834635 14753356 20785627 27232961 24044401 26295194
1175 26295194 16968690 21200067 16027934 12399934 17718447 17790894 21053185 19453304 30198551 27455083
1185 27455083 25187180 31745761 28213048 29434240 26993346 25585208 25274859 23597026 27272699 16745862
1195 16745862 24896762 30355752 33197657 23134597 19198182 32837576 29751040 23617693 25226244
1204 25226244 24798444 14380631 29754695 24073750 24826945 25897253 34938197 27055312 21687340 13969874
1214 13969874 21777844 21319180 18486663 12139444 12120075 28008566 20808821 24164410 22420610 29126766
1224 29126766 20599320 21782191 18845269 32623133 18691597 21580986 21330629 20327932 20292349 22629928
1234 22629928 33545359 25119054 20954699 23671356 18598697 33851636 23956007 15250470 31218696
1243 31218696 13913866 24893003 20861599 28007064 17226106 17349655 12261207 18957594 30233963
1252 30233963 29151552 24555881 21695505 22871421 19366152 30703511 14422092 14423708 17904065 14615955
1262 14615955 18628550 8936285 26973445 19125305 2944385 25931740 25707523 31551978 23268822
1271 23268822 19690961 19917726 20879985 36018603 24112991 25818811 17557773 30133447 35811198
1280 35811198 24408992 28333305 30039702 28559970 10952000 23227420 17396660 18579457 13838324
1289 13838324 23050556 27470276 17219023 13355743 29870330 29989078 29273859 31412948 27416629 16439733
1299 16439733 8764803 28277541 18468508 13259805 8646008 17842174 9596744 21207941 22694699
1308 22694699 21569643 15323729 18879059 21101585 22335890 19829373 9604223 25523254 25168111
1317 25168111 17510094 23990769 21302314 17821644 19185218 17902186 31191023 20425832 12993001
1326 12993001 29123622 28784654 19104099 19486295 23264576 23236525 13527063 8833640 17576336 22379262
1336 22379262 16745370 27624310 10331919 18004103 21862472 18183501 22053954 12317655 10932976
1345 10932976 21438233 21155187 21534141 15945389 22981661 35128933 9562807 6893254 20844044
1354 20844044 20150632 11857103 21568277 21741327 22267334 13285362 21259978 24195780 14094682 12491919
1364 12491919 12552950 9666254 21451185 22099475 19360137 24561018 8478741 4544737 5056938 8686878
1374 8686878 22078882 27431524 23108412 17449474 19028686 10310939 20501189 17891939 7140744
1383 7140744 20629629 19585037 16463095 25248852 25675008 13255870 15105959 25536504 22407636
1392 22407636 24968892 25559521 2723360 24195210 12311537 11360737 23947284 18560752 9588548
1401 9588548 4051570 17210230 26822042 20892211 26288665 21581802 16136106 21876723 20195928 16594342
1411 16594342 21804605 24078855 7604757 19693411 16239946 25221582 18458694 12911001 14967576
1420 14967576 12883782 6512087 7519671 15943499 18447081 9837715 22328662 23859457 23577537 16895412
1430 16895412 18263978 25626995 19435871 17923669 16970069 17867084 14143774 27118460 8819076 14628852
1440 14628852 28764929 18359245 13583816 17596772 15317506 8609464 17163604 17709217 -1282003
1449 -1282003 22905981 13873533 1063494 17558219 11901666 17518236 22608159 7129332 20924031
1458 20924031 17401424 19301886 15570429 1064115 7581326 17469089 22688619 16758752 21973734
1467 21973734 16256077 17921603 11536821 27329614 31010329 13520414 14545701 27728245 3980573
1476 3980573 11733805 10211158 2098902 18664814 21438802 11410152 21709272 21245355 14231564
1485 14231564 14393290 14608898 15658191 12109213 3491555 12920917 21821917 2088131 26431029 17501638
1495 17501638 6843895 21165340 21756203 19884876 25857282 13698234 24477413 9372467 14151118
1504 14151118 18219645 7801692 20267439 15600288 10063415 23455775 23262711 13504897 20252215
1513 20252215 26333947 14692413 7748031 29660180 22075686 18295269 17698109 11516250 15630072
1522 15630072 25353810 4373829 15387709 14200758 12491201 17088805 11740506 21874682 17704704
1531 17704704 18881634 16450793 13458661 14072859 14851206 21049658 13481095 16932338 17444689 8093068
1541 8093068 17728485 13182682 27377031 20835198 2858591 21431218 18107343 9363894 10880474
1550 10880474 11402261 14941693 14870166 12276922 21032510 19814970 2311814 4494499 25961269 19313670
1560 19313670 3735541 19566723 11332299 28481585 12934193 -805576 11726999 13556323 7159148
1569 7159148 2508077 15322836 18162724 22257530 26971616 13650419 13315946 21263794 15513591 8549039
1579 8549039 -479392 14679004 15297105 9234294 2842116 13571293 7655427 12367242 12054464 25929457
1589 25929457 30189107 22692200 13125063 22846303 19789860 6229092 20593685 15137799 19671131
1598 19671131 18334808 26448179 14531458 8016950 15130877 19890837 21897357 20707484 7648211
1607 7648211 16332642 13499653 16878170 25570737 28652925 22636856 11448248 25214716 21791449
1616 21791449 12342400 17225048 21005226 12866139 15375104 15731529 15871378 27066156 9006371 9856973
1626 9856973 23464294 18425715 22054493 12123824 12193441 14223268 20904156 13143003 8967555 7899339
1636 7899339 13996981 11267660 17327741 21997265 5304480 19232033 3071577 -5485 21631580
1645 21631580 8249926 13076586 12294654 8140099 15915099 7271866 7040207 11440519 5278577 848606
1655 848606 15631736 10621209 13023584 16932675 13380429 11895358 3299492 1618231 11340465 11944583
1665 11944583 18108749 13764180 2325823 16409516 7426083 14389774 3110633 10193264 19587602
1674 19587602 14151464 14131130 3134514 9507948 8500986 14676309 6425242 18106055 29142160
1683 29142160 12997125 14118091 21209878 463471 10984470 23163215 5773639 16786168 14824752
1692 14824752 2082466 15817128 15124182 3591202 5131713 12042106 8258276 10960783 1364745
1701 1364745 -7540295 8549933 9521399 14872674 9398723 12236997 5946795 6284820 7176070 3777233
1711 3777233 13416863 19595369 8691631 10797805 9987886 -257513 12265322 22105164 8511280
1720 8511280 13846425 17427849 4662246 12596263 -856296 3597084 17263817 1016010 -1169629
1729 -1169629 14641322 11296833 19400669 14955894 16869696 9525996 8132943 8391337 38196 11457006
1739 11457006 -20321 1754184 22731022 19265740 11409088 11772913 14115375 9802338 19014237
1748 19014237 18746593 12014745 12707673 148601 5064161 4242125 5043012 12765226 16723639 13303288
1758 13303288 11839542 6650760 12018717 20384871 15503942 5558448 14177626 1489632 11039164
1767 11039164 15489733 12248087 8466823 11380521 16264120 6528124 10672564 9967933 10121240 8756891
1777 8756891 13305362 7857487 15859142 -1540621 11362605 13340910 5201147 10096291 13758180
1786 13758180 11515959 19425288 6972485 7825066 8885242 12416545 20498149 12028809 8835642 453636
1796 453636 17717638 4400963 9850402 17717683 9367039 594999 27345280 14775415 7318916
1805 7318916 14227278 14965099 7797269 1674281 5693868 13316567 10414260 9001168 26674587 4139203
1815 4139203 17607508 7783403 8102762 6626352 5772623 11997191 3976400 18244299 2071853 6750488
1825 6750488 3567156 3566004 10070039 -2831570 15926381 17456085 10892611 -408204 4302256 5938732
1835 5938732 9433934 4624854 3683135 24975262 14380076 6538080 8243118 12638425 9282967 5606245
1845 5606245 81993 4233051 3515220 -3934395 7183284 13803429 7759249 13933157 -2245331 -11504513
1855 -11504513 1738618 -2342815 -245115 5836310 -1892599 17599384 19281837 11265686 14190270
1864 14190270 2092675 8976300 7097694 6368060 49722 13903315 6382173 897896 8143090
1873 8143090 610724 19294353 17444775 1787483 3203795 10004525 21429648 15376079 2259205
1882 2259205 -1298624 3532456 6457320 4051065 19136704 12876238 -4068067 4501030 4548348 4035466
1892 4035466 9510184 -4250682 5596990 14360892 18483177 -1093928 2942795 6786296 -1571894
1901 -1571894 11532710 4121586 5877279 4902418 12137984 14241161 11566157 4957688 -8439508 -4097278
1911 -4097278 10258305 -1012280 3274655 -398931 -11367701 617866 9483102 7622321 12718961
1920 12718961 7879711 14677578 1919649 -4104554 20761358 8410131 3534724 11314083 14230127
1929 14230127 10548251 13516873 3290722 16740896 5190166 5208583 6326758 353962 16148355
1938 16148355 19493682 5322584 -5864557 10227741 7391965 11123021 11561885 9848972 3024621
1947 3024621 -541336 -694103 3843795 3647701 340425 7709680 9194183 3430266 15765842 10769873
1957 10769873 -3364268 6575421 8165918 13676155 6724737 5061483 5763778 13503855 10520597 7089439
1967 7089439 15324076 8546267 11209715 -7231614 5430896 16044470 12014090 5173005 2099299
1976 2099299 10974200 5870698 13591025 6638262 5763382 5831557 3176425 -1445939 7740658 12810821
1986 12810821 16148065 6704095 -752070 9072813 4219331 11570171 8524040 8967895 9050377 3655788
1996 3655788 7587710 11410873 234008 -1099264 8085484 2298209 3247787 -6194276 -6611339 -6794634
2006 -6794634 14943850 8175792 -3578754 11307685 -7678774 2024465 3751106 -6400451 862254
2015 862254 13735551 2987822 -8736338 4333752 -507653 -8687621 7463595 -3553996 -4590020
2024 -4590020 2261898 3255236 -7798947 -2308037 -1753741 -5245202 9240134 -4788157 -6623431 -5913219
2034 -5913219 1758043 -8728364 259338 -9669233 -9846817 -6688592 -12849215 2264020 -2866782 -4496175
2044 -4496175 -13777541 -9553726 -6954094
2047 -6954094
##END=	
