##TITLE=	27162421.10.fid
##JCAMPDX=	6.0	$$ NMR Plug-in 1.13 of MestReNova 11.0.4-18998
##DATATYPE=	NMRSPECTRUM
##DATACLASS=	NTUPLES
##NUMDIM=	1
##ORIGIN=	Bruker BioSpin GmbH
##OWNER=	nmr
##.OBSERVEFREQUENCY=	400.13247096654299639
##.OBSERVENUCLEUS=	^1H
##.SOLVENTNAME=	CDCl3
##.PULSESEQUENCE=	zg30
##LONGDATE=	2013/11/27 16:45:00.000
##.ACQUISITIONMODE=	SIMULTANEOUS (DQD)
##$ORIGINALFORMAT=	Bruker XWIN-NMR
##$PARAMETERFILE=	(acqus, ASCII, /var/folders/bp/m_4195y96sx1d256lqvkcvym0000gq/T/f$CdCR9$TqSXxY9+iFprAA/10/acqus, 0)
$$ ##TITLE= Parameter file, TOPSPIN		Version 3.2
$$ ##JCAMPDX= 5.0
$$ ##DATATYPE= Parameter Values
$$ ##NPOINTS= 11	$$ modification sequence number
$$ ##ORIGIN= Bruker BioSpin GmbH
$$ ##OWNER= nmr
$$ $$ 2013-11-27 16:45:06.544 +0000  nmr@mcwatt
$$ $$ /home/nmr/localdata/27162421/10/acqus
$$ $$ process /opt/topspin3.2_pl3/prog/mod/shimcntl
$$ ##$ACQT0= -2.10084033613445
$$ ##$AMP= (0..31)
$$ 100 100 100 100 100 100 100 100 100 100 100 100 100 100 100 100 100 100
$$ 100 100 100 100 100 100 100 100 100 100 100 100 100 100
$$ ##$AMPCOIL= (0..19)
$$ 0 0 0 0 0 0 0 0 0 0 0 0 0 0 0 0 0 0 0 0
$$ ##$ANAVPT= -1
$$ ##$AQSEQ= 0
$$ ##$AQ_mod= 3
$$ ##$AUNM= <au_zg>
$$ ##$AUTOPOS= <15 >
$$ ##$BF1= 400.13
$$ ##$BF2= 400.13
$$ ##$BF3= 400.13
$$ ##$BF4= 400.13
$$ ##$BF5= 400.13
$$ ##$BF6= 400.13
$$ ##$BF7= 400.13
$$ ##$BF8= 400.13
$$ ##$BYTORDA= 0
$$ ##$CAGPARS= (0..11)
$$ 0 0 0 0 0 0 0 0 0 0 0 0
$$ ##$CFDGTYP= 0
$$ ##$CFRGTYP= 9
$$ ##$CHEMSTR= <none>
$$ ##$CNST= (0..63)
$$ 1 1 1 1 1 1 1 1 1 1 1 1 1 1 1 1 1 1 1 1 1 1 1 1 1 1 1 1 1 1 1 1 1 1 1 1
$$ 1 1 1 1 1 1 1 1 1 1 1 1 1 1 1 1 1 1 1 1 1 1 1 1 1 1 1 1
$$ ##$CPDPRG= (0..8)
$$ <> <> <> <> <> <> <> <> <>
$$ ##$D= (0..63)
$$ 0 1 0 0 0 0 0 0 0 0 0 0 0 0 0 0 0.0002 0 0 0 0 0 0 0 0 0 0 0 0 0 0 0 0
$$ 0 0 0 0 0 0 0 0 0 0 0 0 0 0 0 0 0 0 0 0 0 0 0 0 0 0 0 0 0 0 0
$$ ##$DATE= 1385570705
$$ ##$DE= 17.37417
$$ ##$DECBNUC= <off>
$$ ##$DECIM= 2496
$$ ##$DECNUC= <off>
$$ ##$DECSTAT= 4
$$ ##$DIGMOD= 3
$$ ##$DIGTYP= 12
$$ ##$DQDMODE= 0
$$ ##$DR= 22
$$ ##$DS= 0
$$ ##$DSPFIRM= 4
$$ ##$DSPFVS= 21
$$ ##$DTYPA= 0
$$ ##$EXP= <Proton.dur>
$$ ##$F1LIST= <>
$$ ##$F2LIST= <>
$$ ##$F3LIST= <>
$$ ##$FCUCHAN= (0..9)
$$ 0 2 0 0 0 0 0 0 0 0
$$ ##$FL1= 90
$$ ##$FL2= 90
$$ ##$FL3= 90
$$ ##$FL4= 90
$$ ##$FOV= 20
$$ ##$FQ1LIST= <>
$$ ##$FQ2LIST= <>
$$ ##$FQ3LIST= <>
$$ ##$FQ4LIST= <>
$$ ##$FQ5LIST= <>
$$ ##$FQ6LIST= <>
$$ ##$FQ7LIST= <>
$$ ##$FQ8LIST= <>
$$ ##$FRQLO3= 336279.033456981
$$ ##$FRQLO3N= 3
$$ ##$FS= (0..7)
$$ 83 83 83 83 83 83 83 83
$$ ##$FTLPGN= 0
$$ ##$FW= 125000
$$ ##$FnMODE= 0
$$ ##$FnTYPE= 0
$$ ##$GPNAM= (0..31)
$$ <> <> <> <> <> <> <> <> <> <> <> <> <> <> <> <> <> <> <> <> <> <> <> <>
$$ <> <> <> <> <> <> <> <>
$$ ##$GPX= (0..31)
$$ 0 0 0 0 0 0 0 0 0 0 0 0 0 0 0 0 0 0 0 0 0 0 0 0 0 0 0 0 0 0 0 0
$$ ##$GPY= (0..31)
$$ 0 0 0 0 0 0 0 0 0 0 0 0 0 0 0 0 0 0 0 0 0 0 0 0 0 0 0 0 0 0 0 0
$$ ##$GPZ= (0..31)
$$ 0 0 0 0 0 0 0 0 0 0 0 0 0 0 0 0 0 0 0 0 0 0 0 0 0 0 0 0 0 0 0 0
$$ ##$GRDPROG= <>
$$ ##$GRPDLY= 76
$$ ##$HDDUTY= 20
$$ [...]
$$ ##$Sgu1PowerLevels= (0..7)
$$ 90 74 58 42 26 10 0 0
$$ ##$Sgu2PowerLevels= (0..7)
$$ 90 74 58 42 26 10 0 0
$$ ##$Sgu3PowerLevels= (0..7)
$$ 0 0 0 0 0 0 0 0
$$ ##$Sgu4PowerLevels= (0..7)
$$ 0 0 0 0 0 0 0 0
$$ ##$Sgu5PowerLevels= (0..7)
$$ 0 0 0 0 0 0 0 0
$$ ##$Sgu6PowerLevels= (0..7)
$$ 0 0 0 0 0 0 0 0
$$ ##$Sgu7PowerLevels= (0..7)
$$ 0 0 0 0 0 0 0 0
$$ ##$Sgu8PowerLevels= (0..7)
$$ 0 0 0 0 0 0 0 0
$$ ##$SguType= 3
$$ ##$ShimPowMaxUA= (0..63)
$$ 130000 130000 130000 130000 130000 130000 130000 130000 130000 130000 130000
$$ 130000 130000 130000 130000 130000 130000 130000 130000 130000 0 0 0 0
$$ 0 0 0 0 0 0 0 0 0 0 0 0 0 0 0 0 0 0 0 0 0 0 0 0 0 0 0 0 0 0 0 0 0 0 0 0
$$ 0 0 0 0
$$ ##$ShimPowMaxUC= (0..63)
$$ 130000 130000 130000 130000 130000 130000 130000 130000 130000 130000 130000
$$ 130000 130000 130000 130000 130000 130000 130000 130000 130000 0 0 0 0
$$ 0 0 0 0 0 0 0 0 0 0 0 0 0 0 0 0 0 0 0 0 0 0 0 0 0 0 0 0 0 0 0 0 0 0 0 0
$$ 0 0 0 0
$$ ##$ShimPowMaxUG= (0..63)
$$ 524287 524287 524287 524287 524287 524287 524287 524287 524287 524287 524287
$$ 524287 524287 524287 524287 524287 524287 524287 524287 524287 0 0 0 0
$$ 0 0 0 0 0 0 0 0 0 0 0 0 0 0 0 0 0 0 0 0 0 0 0 0 0 0 0 0 0 0 0 0 0 0 0 0
$$ 0 0 0 0
$$ ##$ShimPowRcbType= 3
$$ ##$ShimPowRes= (0..63)
$$ 1e-20 1e-20 1e-20 1e-20 1e-20 1e-20 1e-20 1e-20 1e-20 1e-20 1e-20 1e-20
$$ 1e-20 1e-20 1e-20 1e-20 1e-20 1e-20 1e-20 1e-20 0 0 0 0 0 0 0 0 0 0 0 0
$$ 0 0 0 0 0 0 0 0 0 0 0 0 0 0 0 0 0 0 0 0 0 0 0 0 0 0 0 0 0 0 0 0
$$ ##$ShimPowRng0= (0..63)
$$ 1 1 1 1 1 1 1 1 1 1 1 1 1 1 1 1 1 1 1 1 0 0 0 0 0 0 0 0 0 0 0 0 0 0 0 0
$$ 0 0 0 0 0 0 0 0 0 0 0 0 0 0 0 0 0 0 0 0 0 0 0 0 0 0 0 0
$$ ##$ShimPowRng1= (0..63)
$$ 1 1 1 1 1 1 1 1 1 1 1 1 1 1 1 1 1 1 1 1 0 0 0 0 0 0 0 0 0 0 0 0 0 0 0 0
$$ 0 0 0 0 0 0 0 0 0 0 0 0 0 0 0 0 0 0 0 0 0 0 0 0 0 0 0 0
$$ ##$ShimPowRng2= (0..63)
$$ 1 1 1 1 1 1 1 1 1 1 1 1 1 1 1 1 1 1 1 1 0 0 0 0 0 0 0 0 0 0 0 0 0 0 0 0
$$ 0 0 0 0 0 0 0 0 0 0 0 0 0 0 0 0 0 0 0 0 0 0 0 0 0 0 0 0
$$ ##$ShimPowRng3= (0..63)
$$ 1 1 1 1 1 1 1 1 1 1 1 1 1 1 1 1 1 1 1 1 0 0 0 0 0 0 0 0 0 0 0 0 0 0 0 0
$$ 0 0 0 0 0 0 0 0 0 0 0 0 0 0 0 0 0 0 0 0 0 0 0 0 0 0 0 0
$$ ##$ShimSysFunc= (0..63)
$$ 1 2 3 4 5 7 9 11 15 16 8 10 12 14 6 17 13 18 19 20 0 0 0 0 0 0 0 0 0 0
$$ 0 0 0 0 0 0 0 0 0 0 0 0 0 0 0 0 0 0 0 0 0 0 0 0 0 0 0 0 0 0 0 0 0 0
$$ ##$ShimSysMatrix= 0
$$ ##$ShimSysType= 1
$$ ##$TFXNUM= 0
$$ ##$TRIPLO2= 0
$$ ##$VTU= 2
$$ ##$VTUETH= <149.236.99.20>
$$ ##$VTUTY= <no>
$$ ##$WBREFAM= (0..15)
$$ 129 103.5 100 100 100 100 100 100 100 100 100 100 100 100 100 100
$$ ##$WBREFLM= (0..15)
$$ 0 0 0 0 0 0 0 0 0 0 0 0 0 0 0 0
$$ ##$WBREFPH= (0..15)
$$ 73.26 -75.24 0 0 0 0 0 0 0 0 0 0 0 0 0 0
$$ ##$WBSGU= (0..15)
$$ 0 0 0 0 0 0 0 0 0 0 0 0 0 0 0 0
$$ ##$XFAC= 2
$$ ##END=
$$ 
##$DECIM=	2496
##$DSPFVS=	21
##XUNITS=	HZ
##YUNITS=	ARBITRARY UNITS
##FIRSTX=	6477.376799411189495
##LASTX=	-1535.3214474713092841
##XFACTOR=	-0.12226593800080108598
##YFACTOR=	1.5115317382812500782e-05
##NPOINTS=	65536
##XYDATA=	(X++(Y..Y))
$$ [...]
-10256A18542J914j0875j9909j6677M200J872j3793J153r235J2338J8368j5774j5910N907
$$ 118542 120456 109581 89672 72995 77195 79067 65274 66427 57192 69530 87898 72124 56214 62121
-10242F2121O391K356M567Q04Q080N192P834O076k205j4541j2571Q153K2357J6524r552k1253
$$ 62121 68512 70868 75435 76239 84319 89511 97345 103421 101216 86675 74104 82257 104614 121138 111586 90333
-10226I0333L370J1629P04o657J136J892q630k9194J1740J6215l830O008J4971J7724q410
$$ 90333 93703 105332 106036 99379 100515 102407 93777 64583 76323 92538 88708 94716 109687 127411 119001
-10211A19001k2227n20P060N787r219k0847m600J4679J4186P807P115J0824J0169J488p826
$$ 119001 96774 96254 103314 109101 99882 79035 74435 89114 103300 111107 118222 129046 139215 140703 132877
-10196A32877j0133q75L860j0757k944K644K631J1489J613j6712m439k466r181j3676M091
$$ 132877 122744 121869 125729 114972 112028 114672 117303 128792 130405 113693 109254 106788 97607 83931 88022
-10181H8022O999k822J3045J3158n705j8124q028L815m661q425P119J994P645J3696l33l687
$$ 88022 95021 92199 105244 118402 112697 94573 86545 90360 85699 77274 84393 86387 94032 107728 107395 103708
-10165A03708p014j0332k169j9225m69J9764N72k59J0829j0510J2566J5469o441n911R78J2689
$$ 103708 96694 86362 84193 64968 64499 84263 84835 84576 95405 84895 97461 112930 106489 100578 101556 114245
-10149A14245j4519k8933M199K1375L236n768n150O72J5050N460j7218k0633J304K2025K7498
$$ 114245 99726 70793 74992 96367 99603 93835 88685 89357 104407 109867 92649 72016 73320 95345 122843
-10134A22843l391r859j894j7463j9268l293N285J3291m370R258J6650m646r648k631m309
$$ 122843 119452 109593 107699 90236 70968 67675 72960 86251 81881 91139 107789 103143 93495 90864 86555
-10119H6555L278J9344R837K6592K911j5234r076q901O953j324r672p535o432Q63r686n871
$$ 86555 89833 109177 119014 145606 148517 133283 124207 115306 122259 120935 111263 103728 97296 98159 88473 82602
-10103H2602j074J0272J6760J4345J0228j7095l4975j3742P391J1203K756j508J0081j916
$$ 82602 81528 91800 108560 122905 133133 116038 81063 67321 74712 85915 88671 87163 97244 95328
-10089I5328L304p097j9036J6883P543q502L954L023o221o604L84k061j554J0702P498M601
$$ 95328 98632 91535 72499 89382 96925 88423 92377 95400 89179 82575 82959 80898 79344 90046 97544 102145
-10073A02145J5838m867j8676k114j234j1831L766N272r00K2510K2148P736l758M546P46k7465
$$ 102145 117983 113116 94440 92326 91092 79261 83027 88299 87399 109909 132057 139793 136035 140581 141327 113862
-10057A13862k3400n381J8912L969j2501R123Q22n757m876j9202k4115j0870k497J7220K4552
$$ 113862 90462 85081 103993 107962 95461 104584 105406 99649 94773 75571 51456 40586 38089 55309 79861
-10042G9861J3236J0965K574m774j742K3698Q520j0617r361P96r253o044J1627K36j0067j483
$$ 79861 93097 104062 106636 101862 100120 123818 132338 121721 112360 113156 103903 97859 109486 109722 99655 98172
-10026I8172K456N146j759L652M55J133K0039N615q743j4669o107J423J0607J4569j7617k4336
$$ 98172 100628 105774 104015 107667 108122 109255 129294 134909 126166 111497 105390 106813 117420 131989 114372 90036
-10010I0036J478L506k947j4415Q910K7518K3969K240k251p425j6049j0402O525J4898M892
$$ 90036 91514 95020 92073 77658 86568 114086 138055 140295 138044 130619 114570 104168 110693 125591 130483
-9995A30483Q833n674o078j5976k2722l921J6883J7184J0170L414l645j3490j4349j6477j0199
$$ 130483 139316 133642 127564 111588 88866 84945 101828 119012 129182 132596 128951 115461 101112 84635 74436
-9980G4436j482r546k03L380N241J4331J1038J3660J4843P584L431q764n424q933k327J2246
$$ 74436 72954 63408 63205 66585 71826 86157 97195 110855 125698 133282 136713 127949 122525 113592 111265 123511
-9964A23511l471k2885q334L874j753l440J021m11K898M098j6514o886L2571L1949R6o864
$$ 123511 120040 97155 88821 92695 90942 87502 88523 88112 91010 95108 78594 71708 104279 136228 136324 129460
-9948A29460L959J19j2749j0630n197O898j14k0293N421K1139L032j3254j7032n501Q828J4506
$$ 129460 133419 133538 120789 110159 104962 111860 111746 91453 96874 118013 121045 107791 90759 85258 94086 108592
-9932A08592N473o388n753j035j0791n979n457m790p945J3885K1606M038j1094k300J6499
$$ 108592 114065 107677 101924 100889 90098 84119 78662 73872 65927 79812 101418 105456 94362 92062 108561
-9917A08561n128l6632k4527L930R776O36K758J3976J4163K0470O445j51Q063q70j8287j5913
$$ 108561 103433 66801 42274 46204 55980 56616 59374 73350 87513 107983 114428 114277 122340 121470 103183 87270
-9901H7270j0636L752j865p797J2795K5668j788J368J0801j0647p787j381n699n068N872k2920
$$ 87270 76634 80386 78521 70724 83519 109187 107399 108767 119568 108921 101134 99753 94054 88986 94858 71938
-9885G1938j3164J3118K3153K0873K0814M01m733o747j8733j5725j3568j0510j1951K0900
$$ 71938 58774 71892 95045 115918 136732 137133 132400 125653 106920 91195 77627 67117 55166 76066
-9871G6066J9940L792p94O98L841j8233n439J3341J4939j428L747j2262k5786J2310K287R29
$$ 76066 96006 99798 99004 99702 103543 85310 79871 93212 108151 106723 110470 98208 72422 84732 87019 87948
-9855H7948N862l786N454J2293n488j2778k947Q226j1029j2901m446j338J062J3226J0454
$$ 87948 93810 90024 95478 107771 102283 89505 86558 94784 83755 70854 66408 65070 66132 79358 89812
-9840H9812j118n296l435p926m176k0N374J7248K9984N040j3852o562o49l232k4555j1789
$$ 89812 88694 83398 79963 72037 67861 67841 73215 90463 120447 125487 111635 105073 104424 101192 76637 64848
-9824F4848q451k39R027q25j5877J656K9579J5647l633J3568K2166r942j0095J1467m720j9735
$$ 64848 56397 56158 65185 64360 48483 50139 79718 95365 91732 105300 127466 117524 107429 118896 114176 94441
-9808I4441k2010j011K5196L371j7091j1049N970K6394J1454J134Q017Q291R450l778q84o348
$$ 94441 72431 71420 96616 99987 82896 71847 77817 104211 115665 116799 124816 133107 142557 138779 137895 131547
-9792A31547j2337o626N553k026j1667p492j1327k5344j629Q589p443Q410M247r380R00K0651
$$ 131547 119210 112584 118137 116111 104444 96952 85625 60281 58652 67241 59798 68208 72455 63075 63975 84626
-9776H4626K4876N002l031p532m868J2497J1568P809L860o403l977k6912j9893L045L444Q678
$$ 84626 109502 114504 111473 103941 99073 111570 123138 130947 134807 128404 124427 97515 77622 80667 84111 92789
-9760I2789M37n616j228P208N370N675L758j7221j8353j1669J465L0257K2604N989P662n002
$$ 92789 93226 87610 86382 93590 98960 104635 108393 91172 72819 61150 62615 92872 115476 121465 129127 124125
-9744A24125j3564k7141M63J284p856j0151J4290J7289K141J3206R696J3867J4247q883k2920
$$ 124125 110561 83420 83883 85167 77311 67160 81450 98739 100880 114086 123782 137649 151896 143013 120093
-9729A20093k8199r07J6249j455j3034j8126j2374M984J0214L255Q500M936m524L208O283
$$ 120093 91894 90987 107236 105781 92747 74621 62247 67231 77445 80700 89200 94136 89612 92820 99103
-9714I9103P738q790O495K524j0202j5905l304J2128J6432N522J170K103J4226L633L062P277
$$ 99103 106841 98051 104546 107070 96868 80963 77659 89787 106219 111741 112911 115014 129240 132873 135935 143212
-9698A43212l153l529q737j0501l777P238K375k234R445l321l724J2367O162J054j2398j1103
$$ 143212 140059 136530 127793 117292 113515 120753 123128 120894 130339 127018 123294 135661 141823 142877 130479 119376
-9682A19376l711M85p810J683j147j2151r805K251N392L939o696o358J584J5758N821j1781
$$ 119376 115665 116150 108340 110023 108876 96725 86920 89171 94563 98502 91806 85448 87032 102790 108611 96830
-9666I6830r759O600j538j1086k115j213j0291R64J1983o857j3709L26k930P890J0034K076
$$ 96830 87071 93671 92133 81047 78932 77719 67428 68392 80375 73518 59809 60135 57205 65095 75129 77205
-9650G7205P906m15m758j1875o204J1952K47q678K412j517N722l88J040j49L914l042P714
$$ 77205 85111 84696 79938 68063 61859 73811 74058 65380 67792 66275 71997 71609 72649 72500 76414 73372 81086
-9633H1086J0590R189Q780k307j289R796k3r469P822o81j5727j1339R125J0224J400k477L283
$$ 81086 91676 100865 109645 107338 106049 115845 115822 106353 114175 113494 97767 86428 95553 105777 107177 104700 107983
-9616A07983M353J6206R480O232p669k2827j2372j488K022P515p633j3681j4839L631J4104
$$ 107983 112336 128542 138022 144254 136585 113758 101386 99898 101920 109435 101802 88121 73282 76913 91017
-9601I1017J3755J3262q633j2937q59J3830r602j8732k6317l793J8014O025q370j1304K566
$$ 91017 104772 118034 109401 96464 95605 109435 99833 81101 54784 50991 69005 75030 66660 55356 57922
-9586E7922P489R145r235n205J7499K4875k001j8881K80Q464j0289n891o8j649p221k464J2193
$$ 57922 65411 74556 65321 60116 77615 102490 100489 81608 81888 90352 80063 74172 74104 72455 65234 62770 74963
-9569G4963J3478J3139m057j7441j380J035N93M098Q307J3498J872o722K264M746O552k2124
$$ 74963 88441 101580 97523 80082 78702 79737 80330 84428 92735 106233 108105 101383 103647 108393 114945 92821
-9553I2821j3033J9007J0891Oj0324q367J6063K201J1009K057p050j2690j9016J4552K2536
$$ 92821 79788 98795 109686 109692 99368 91001 107064 109265 120274 122331 115281 102591 83575 98127 120663
-9538A20663K265j1862k702K434l254r512J0806Q90j193j637r218P635R16k1159k666J0829
$$ 120663 122928 111066 108364 110798 107544 98032 108838 109728 108535 106898 97680 105315 106231 85072 82406 93235
-9522I3235j8381j852K2825J4971p535o154j3937j3135M249L966o435j4783L042j080j2847
$$ 93235 74854 73002 95827 110798 103263 97109 83172 70037 74286 78252 71817 57034 60076 58996 46149
-9507D6149J4521L0083J4303j3602j0425j6371q395J9068P165o621J9077J0682N650j1773
$$ 46149 60670 90753 105056 91454 81029 64658 56263 75331 82496 75875 94952 105634 111284 99511
-9493I9511r239q951L994J889J1936J5868J4710n984k0317j2074j8104K471Q248r496m831
$$ 99511 90272 81321 85315 87204 99140 115008 129718 123734 103417 91343 73239 75710 83958 74462 69631
-9478F9631L1164J4534n923o687j9986j4165J1493Q337O098j0262j7049M141J3807K3869R608
$$ 69631 100795 115329 109406 102719 82733 68568 80061 88398 94496 84234 67185 71326 85133 109002 118610
-9463A18610K295J406k629P326M776r052q482j4123p404O302P625O293j6336j6755L357J2996
$$ 118610 120905 122311 119682 127008 131784 122732 114250 100127 92723 99025 106650 112943 96607 79852 83209 96205
-9447I6205P345q3O713n156l172J3571K584j5613M557R683O818R045K357j3053j4673Q30j630
$$ 96205 103550 103467 110180 105024 101852 115423 118007 102394 106951 116634 123452 132497 134854 121801 107128 107958 106328
-9430A06328j0302N263J1536M229p962N113R50J935M74p747p618M814J152p898p465o456Q487
$$ 106328 96026 101289 112825 117054 109092 114205 115155 117090 117564 109817 102199 107013 108165 100267 92802 86346 94833
-9413I4833n40j575m798q530p8m568l660J0303O341K008k689K488j44q481J04J0517J3064
$$ 94833 94293 92718 87920 79390 79312 74744 71084 81387 87728 89736 87047 89535 89391 80910 81014 91531 104595
-9396A04595J2665L300J3852R55p734k746j0997k8795j5362K5268L4764K02q722J1203J2400
$$ 104595 117260 120560 134412 135367 127633 124887 113890 85095 69733 95001 129765 129967 121245 132448 144848
-9381A44848K7217K1141k5533l1555j585J6139r077k2280j4408j5070n912M503M505J7269
$$ 144848 172065 193206 167673 136118 134533 150672 141595 119315 104907 89837 83925 88428 92933 110202
-9367A10202J2229k738M587k041o935J5480K926j0303n294N711Q185K583j0585O826M770p644
$$ 110202 122431 119693 124280 122239 115304 130784 133710 123407 118113 123824 132009 134592 124007 130833 135603 127959
-9351A27959q292j984j1001n180n290k1993J3171J9362R20k773L420N404o513n485O584Q116
$$ 127959 119667 117683 106682 101502 96212 74219 87390 106752 107672 104899 108319 113723 107210 101725 108309 116425
-9335A16425N299J4026Q362j1414k2613r892O78n79j786J3874J0214J7215J1690j0851k2907
$$ 116425 121724 135750 144112 132698 110085 100193 100871 100292 98506 112380 122594 139809 151499 140648 117741
-9320A17741q881J4053J155J2326K1216J6531J105j6889j5885j0801j0014j7001l4054j8694
$$ 117741 108860 122913 124068 136394 157610 174141 175246 158357 142472 131671 121657 104656 70602 51908
-9306E1908K006Q783o737r147R372J6527R866N837M813M891r75K3388J3524l719N12n821r43
$$ 51908 53914 62697 55960 46813 56185 72712 82578 88415 93228 98119 97144 120532 134056 130337 130849 125028 124085
-9289A24085j8898k2781P751J9369J640j666q801k1133j4486L049R711J6254N581l423l034
$$ 124085 105187 82406 90157 109526 111166 109500 100699 79566 65080 68129 77840 94094 99675 96252 93218
-9274I3218j8026j2738J8381J3438J3024K6108K905j4284o776q483n364j292p232o828o708
$$ 93218 75192 62454 80835 94273 107297 133405 136310 122026 115250 106767 101403 100111 92879 86051 79343
-9259G9343k958N629P368K758Q077J6513J1117j0559k691K0395j102j2022R286m350k6197
$$ 79343 76385 82014 89382 92140 100217 116730 127847 117288 114597 134992 133890 121868 131154 126804 100607
-9244A00607j4368k960M92L340j558K105m899K975K3090L2340J9733N133k3673k7375o085
$$ 100607 86239 83279 83771 87111 85553 87658 82759 85734 108824 141164 160897 166030 142357 114982 108897
-9229A08897j242R394K1927J4769l742o208j0163j7061j3893j6350j1182Q508R989J4524J1781
$$ 108897 107655 117049 138976 153745 150003 143795 133632 116571 102678 86328 75146 83654 93643 108167 119948
-9214A19948j5139j7556N708K4282J103r117K088r360j7099j2998P174L202j5165j2372R714
$$ 119948 104809 87253 92961 117243 118346 109229 111317 101957 84858 71860 79034 82236 67071 54699 64413
-9199F4413J2916L187N161p081J0349J7168Q394J1523k13j1020m996j1773j0159j711Q810
$$ 64413 77329 80516 85677 78596 88945 106113 114507 126030 125817 114797 109801 98028 87869 86158 94968
-9184I4968J8026R929J3101Q827O90k967j6697k0755o495p754q009O902J4235O255J0327J6322
$$ 94968 112994 122923 136024 144851 145541 142574 125877 105122 98627 90873 82864 89766 104001 110256 120583 136905
-9168A36905J026k1273j0114Q189R498q859q098j37R726J6329Q662Q372q038j8815j2613m156
$$ 136905 137931 116658 106544 114733 124231 115372 107274 107137 116863 133192 141854 150226 142188 123373 110760 106604
-9152A06604M775J1421Q18j6401j2652Q174j4070j8706n98R48J0835P756M237R464J5370K8041
$$ 106604 111379 122800 123618 107217 94565 102739 88669 69963 69365 70313 81148 88904 93141 102605 117975 146016
-9136A46016N640j0182m090k1383k1018j0358q147l434J1470J6845J4904K507q92j2880l847
$$ 146016 151656 141474 137384 116001 94983 84625 76478 73044 84514 101359 116263 118770 117878 104998 101151
-9121A01151k759j9245J2738L7531J5786j4525j2883j5185j740Q358L359L320k776q851j890
$$ 101151 98392 79147 91885 129416 145202 130677 117794 102609 100869 109227 112586 115906 113130 104279 102389
-9106A02389O220M685m091j1088m176M545J1537L871J2956J2388L89j7103q570j3542j7934
$$ 102389 108609 113294 109203 98115 93939 98484 110021 113892 126848 139236 139625 122522 113952 100410 82476
-9091H2476J699J5798O971j0949k7927J1170R103j0876J5898J6023j8030R417K0283P067L500
$$ 82476 84175 99973 106944 95995 68068 79238 88341 77465 93363 109386 91356 100773 121056 128123 131623
-9076A31623R1r210j8803J4514K8424J379N563o034j1096j9101l1041j5094J0776K8435J2826
$$ 131623 131714 122504 103701 118215 146639 148018 153581 147547 136451 117350 86309 71215 81991 110426 123252
-9061A23252O339q939j6872j0282k134J585J0374N23n207K645O061m238l374l34M45j2394
$$ 123252 129591 120652 103780 93498 91364 92949 103323 103846 98639 101284 107345 103107 99733 99399 99844 87450
-9045H7450k3960K950J7834J1386j2822j1494j721J0668M624K622J3234j1268k3446q182J4703
$$ 87450 63490 66440 84274 95660 82838 71344 69623 80291 84915 87537 100771 89503 66057 57875 72578
-9030G2578J4392j142m928q682r620O252k924P51J9787K5836O535j2588j9546j4173L227P903
$$ 72578 86970 85828 80900 72218 62598 68850 65926 66677 86464 112300 118835 106247 86701 72528 75755 83658
-9014H3658J1709K5785R987j4572o119r548j1467n692K021p39j1475j9226n284J8767J230
$$ 83658 95367 121152 131139 116567 110448 100900 89433 83741 85762 85023 73548 54322 49038 67805 69035
-8999F9035j2771k719J0995J7460K924J2159Q499n23l516p17m300j5320o467O91m685J2528
$$ 69035 56264 53545 64540 82000 84924 97083 105582 105059 101543 100826 96526 81206 74739 75430 70745 83273
-8983H3273R716L353O351j0621R901J3349J180k1951j7755m534q793M590N470Q483q549k8667
$$ 83273 92989 96342 102693 92072 101973 115322 116502 94551 76796 72262 63469 68059 73529 82012 73463 44796
-8967D4796O327J3113k667J1267J1260O414K8256O54j7548j4725J390J6395J7315n238j4462
$$ 44796 51123 64236 61569 72836 84096 90510 118766 119420 101872 87147 88537 104932 122247 117009 102547
-8952A02547l755O909J2202K463O628L637J52j7017j0872P73J8626Q127m577n634P344K333
$$ 102547 98792 105701 117903 120366 126994 130631 130783 113766 102894 103667 122293 130420 125843 120209 127553 129886
-8936A29886k785o880k6698k1271r145n227R518K3469Q260L22qk622q027J3153J223j9433
$$ 129886 127101 120221 93523 72252 63107 57880 67398 90867 99127 99449 99441 96819 88792 101945 103168 83735
-8920H3735o780P270J1582J4717P125M92J4546M204j0685k2642q240Q706Q740l723k3182j7510
$$ 83735 76955 84225 95807 110524 117649 118141 132687 136891 126206 103564 95324 104030 112770 109047 85865 68355
-8904F8355r017j1224J5684J3481K7095J6070Q709J6138Q686J1083j7776j4870j1243M52J8913
$$ 68355 59338 48114 63798 77279 104374 120444 129153 145291 153977 165060 147284 132414 121171 121623 140536
-8889A40536O558k1911k3033j1181J2889j753j0848Q122J9352O691N714q548k2938k1376r640
$$ 140536 147094 125183 102150 90969 103858 102105 91257 99379 118731 125422 131136 122588 99650 78274 68634
-8874F8634j6493K125J3678L584l847J2694J3993J3940N795R986p47j5039j4564j0694K759
$$ 68634 52141 54266 67944 71528 67681 80375 94368 108308 114103 124089 123342 108303 93739 83045 85804
-8859H5804J7576K2755O694j7267k4150J4295J3226j2197j1749J979q299k4759j0028L088
$$ 85804 103380 126135 132829 115562 91412 105707 118933 106736 94987 96966 88667 63908 53880 56968
-8845E6968J186K85L688k624R470J4695J5822P123j6560k0119J3274Q924m41Q558Q010J5716
$$ 56968 58154 58439 62127 59503 68973 83668 99490 106613 90053 69934 83208 92132 91691 100249 108259 123975
-8829A23975p578k0505k0690n785J180J405m224m226m3j0489M283K2114J4786M903P466j644
$$ 123975 116397 95892 75202 69417 70597 72002 67778 63552 63509 53020 57303 79417 94203 99106 106572 104928
-8813A04928j8871m663J973r646q900k220j1194O330N098J009K8670J9752L633l11J1230n752
$$ 104928 86057 81394 83367 73721 64821 62601 51407 57737 62835 63844 92514 112266 115899 115588 126818 121066
-8797A21066j8054M668P0m40M413J1338K0645j2056j3353q342p824K522R062J6278k0120k9768
$$ 121066 103012 107680 107750 107310 111723 123061 143706 131650 118297 109955 102131 104653 113715 129993 109873 80105
-8781H0105n768J8019P004k629j0096J5610J4618m210o731k443r511j4530j7598o815K2563
$$ 80105 74337 92356 99360 96731 86635 102245 116863 112653 105922 103479 93968 79438 61840 55025 77588
-8766G7588J6331r479j923P757K3939K1226J864j6850j7107k5534p816Q487K968k3371k557
$$ 77588 93919 84440 82517 90274 114213 135439 137303 120453 103346 77812 69996 78483 81451 58080 55523
-8751E5523J3524J6833J1988N532N510J3283R33K028P631o116r554L97R281j4846j9502p94
$$ 55523 69047 85880 97868 103400 108910 122193 123126 125154 132785 126669 117115 117512 126793 111947 92445 91651
-8735I1651K1548K3865j956k577J109r880J119l221k0666p638J4389J4078m186J127n311k8167
$$ 91651 113199 137064 135108 132531 133640 123760 124879 121658 100992 93354 107743 121821 117635 118762 113451 85284
-8719H5284L200N323m827n661J650J707J965o511N603P926O686K9563J7206m197p96l25R963
$$ 85284 88484 93807 88980 83319 84969 86676 88641 82130 87733 95659 102345 131908 149114 144917 144121 143796 153759
-8702A53759j1618l1666j5164R490K4426R900o904k0216r041K41J406J164O200K825j360J775
$$ 153759 142141 110475 95311 104801 129227 139127 132223 112007 102966 103207 104613 105777 111977 114802 113442 115217
-8686A15217J3458J6532n266j6685n766j21K976K030j9618m541J8297J35j3982l355R549r796
$$ 115217 128675 145207 139941 123256 117490 117369 120345 122375 102757 98216 116513 116648 102666 99311 108860 99064
-8670I9064p934J1932K2376J0121j1992j4457k2098q940J6624J6670N343J6300R991l063j9028
$$ 99064 91130 103062 125438 135559 123567 109110 87012 78072 94696 111366 116709 133009 143000 139937 120909
-8655A20909n534R671R635j5650j2918N61R46m460M460L79q036J8535R802p873p589r126O184
$$ 120909 115375 125046 134681 119031 106113 106674 107620 103160 107620 107999 99963 118498 128300 120427 112838 103712 109896
-8638A09896J5598M381j4602j7156r188j0052k4405r625K509P86J8660K9897O862j2233l525
$$ 109896 125494 129875 115273 98117 88929 78877 54472 44847 47356 48142 66802 96699 103561 91328 87803
-8623H7803K606J7364J6178j0598k5260q929q579J4588J5284o64r996o381Q645K029l581O524
$$ 87803 90409 107773 123951 113353 88093 79164 70585 85173 100457 99793 89797 83416 92061 94090 90509 97033
-8607I7033J4271J5804Q294k494k3327l0319L1N204p41l67J3752J6263p885j5965j5050k63
$$ 97033 111304 127108 135402 132908 109581 79262 79293 84497 83756 83389 97141 113404 105519 89554 74504 74241
-8591G4241J5918O993J0925J8899Q490j8086j7778j648K2030J9935j752o704K376j5533j7160
$$ 74241 90159 97152 108077 126976 135466 117380 99602 97954 119984 139919 138167 131463 133839 118306 101146
-8576A01146j0711J1839j544l250J0637J1995M145o278p973j3837O122J8935J5196r880j8846
$$ 101146 90435 102274 100730 97480 108117 120112 124257 117979 110006 96169 102291 121226 136422 126542 107696
-8561A07696J0092M715j1330n581O654j659N615n450o959p981q422p444J1003J7393l39N773
$$ 107696 117788 122503 111173 105592 112246 110587 116202 110752 103793 95812 87390 79946 90949 108342 108003 113776
-8545A13776J0486J5630N469j3110j2864K305K555j028n752l279N024R067K10j1421j4318
$$ 113776 124262 139892 145361 132251 119387 121692 124247 123219 117467 114188 119212 128279 128489 117068 102750
-8530A02750j7522N527K1848J7077Q074m768j3216j4881k431l1780k1136J4697L1650J9184
$$ 102750 85228 90755 112603 129680 137754 132986 119770 104889 102458 70678 49542 64239 95889 115073
-8516A15073R645J57n012j0731k2561m850J4362n026j7148J4084O495k416j8272j7279n932
$$ 115073 124718 124875 119863 109132 86571 81721 96083 91057 73909 87993 94488 92072 73800 56521 50589
-8501E0589O476K2978K0558l225j6318j1352K717r137n166L0600K7894K953J0904J1628j1490
$$ 50589 57065 80043 100601 97376 81058 69706 72423 63286 58120 88720 116614 119567 130471 142099 130609
-8486A30609j4893N94J6402N462j4976n049o69p127K1776J9978l899l0218l1864J955J0855
$$ 130609 115716 116310 132712 138174 123198 118149 117480 110353 132129 152107 148208 117990 86126 88081 98936
-8471I8936J412J0013J6470J3549R83N72r915j3981L013o079j3346R078L9781J7610j1680
$$ 98936 100348 110361 126831 140380 141363 141935 132020 118039 121052 114973 101627 110705 150486 168096 156416
-8456A56416j1860j5456p111L771m233N78O967m79j575N798P930J1365m743j3277P370l660
$$ 156416 144556 129100 121989 125760 121527 122105 129072 128593 127018 132816 140746 152111 147368 134091 141461 137801
-8440A37801k5717k1374k490p43K970N346P310J0726J4812Q72j4156k2000k2688j2800Q852
$$ 137801 112084 90710 88220 87477 90447 95793 103103 113829 128641 129513 115357 93357 70669 57869 66721
-8425F6721K3055K0260K375L593J079r151k407J0502L624o716N023j672k1685j8206P101J2183
$$ 66721 89776 110036 112411 116004 117083 107932 105525 116027 119651 112935 117958 116286 94601 76395 83496 95679
-8409I5679J8433J4344O572K38p627m473o861k2311J872J233j2434j3451j2382J388J1467
$$ 95679 114112 128456 135028 135266 127639 123166 116305 93994 95866 97099 84665 71214 58832 60220 71687
-8394G1687R697J205J2204K829p343J3357J1039k5871j0185j3953N054J0843P800J1302L962
$$ 71687 81384 82589 94793 97622 90279 103636 114675 88804 78619 64666 69720 80563 88363 99665 103627
-8379A03627j4811k2089l313P156L247Q316j728l346J6769n432j037R559K0136J0493j196
$$ 103627 88816 66727 63414 70570 73817 82133 80405 77059 93828 88396 87359 96918 117054 127547 126351
-8364A26351J0194J683k8122j3202q75j806K0769N448m570J367P564n602o288n23j1048J247
$$ 126351 136545 138228 110106 96904 96029 94223 114992 120440 115870 117237 124801 119199 112911 112388 101340 102587
-8348A02587R091p205k1815j0578O867K4751K4299L409j6625j4764p145P535J6587J3044q280
$$ 102587 111678 104473 82658 72080 78947 103698 127997 131406 114781 100017 92872 100407 116994 130038 121758
-8333A21758j3945o482P488J3189J402o844m816N911L462J0541m60M320K4798K332j4862j409
$$ 121758 107813 101331 108819 122008 123410 116566 111750 117661 121123 131664 131204 135524 160322 162654 147792 146383
-8317A46383J3791L721r827M53l943M74O982j1020k0371j01J2095j229j2544j7063r203R29
$$ 146383 160174 163895 154068 154521 150578 151052 158034 147014 126643 126542 138637 137408 124864 107801 98598 99527
-8301I9527O096n122P899L3918Q732O173K819j8125j1230q5P160K846j091j094r474J211k1608
$$ 99527 105623 100501 108400 142318 151050 157223 160042 141917 130687 130602 137762 140608 139517 138423 128949 130160 108552
-8284A08552M034J6791o263k4182k7637p569J6249J9338J2484Q019k1747k9758l289L9465
$$ 108552 112586 129377 123114 98932 71295 63726 79975 99313 111797 119816 98069 68311 65022 104487
-8270A04487L1272q667k236J5783M434j0048m207q822j7117L471J5624L964J5251Q273j4337
$$ 104487 135759 127092 124856 140639 145073 135025 130818 121996 104879 108350 123974 127938 143189 151462 137125
-8255A37125j1457k4596j5934J7706N985Q388J3293J6627J6141Q821j2555k8707p704j4458
$$ 137125 125668 101072 85138 102844 108829 117217 130510 147137 163278 172099 159544 130837 123133 108675
-8241A08675j1682j2490o909m173J2004J6432j368j8879k5211J823K8477K1586J0058J0857
$$ 108675 96993 84503 77594 73421 85425 101857 100489 81610 56399 58222 86699 108285 118343 129200
-8227A29200l405j9876j653J2780j381q97m628O559K4554j2591l2879j7251k362j6008J0540
$$ 129200 125795 105919 104266 117046 115665 114768 110140 116699 141253 128662 95783 78532 76170 60162 70702
-8212G0702J3351J2378L5651J2165M343n052p690L323L548n827K020k550O00m805j5003l577
$$ 70702 84053 96431 132082 144247 148590 143538 135848 139171 142719 136892 138912 136362 136962 132157 117154 113577
-8196A13577q644o907p854Q425J1726l588j2930p732J0101L068k962n312k274J5464P89p267
$$ 113577 104933 98026 90172 98597 110323 106735 93805 86073 96174 99242 96280 90968 88694 104158 104947 97680
-8180I7680j4741j5196m798M254J0362M236k1652j0719P314J0909J1462J9170J4266j5215
$$ 97680 82939 67743 62945 67199 77561 81797 60145 49426 56740 67649 79111 98281 112547 97332
-8166I7332r447O914L926M929K0836O182M079N026j8953p375K638k633j6957j127J5388R083
$$ 97332 87885 94799 98725 103654 124490 130672 134751 139777 120824 113449 116087 113454 96497 95370 110758 119841
-8150A19841J4103q169o282m951Q78M564j1669p002J0381q587P756K864j3147k0842p904J3344
$$ 119841 133944 125775 119493 114542 115420 119984 108315 101313 111694 103107 110863 113727 100580 79738 71834 85178
-8134H5178J0969Q639j595M603J1202j0794j2451J489J8702J2124O508M20j3507k387O361
$$ 85178 96147 104786 103191 107794 118996 108202 95751 97240 115942 128066 134574 134994 121487 119100 125461
-8119A25461L335k309n087L947J2738K258p297j0540j5951k2658l006j3020J1278K0715r931
$$ 125461 128796 126487 121400 125347 138085 140343 133046 122506 106555 83897 80891 67871 79149 99864 89933
-8104H9933j7649k495J3046J6842L5444J3985j2418n148n763r11l678n933j6400j5339o949
$$ 89933 72284 69789 82835 99677 135121 149106 136688 131540 125777 124866 121188 115255 98855 83516 76567
-8089G6567N776Q977K606J810K810R354j0694k9174J928M1444J706m52K9502R725j8088k5247
$$ 76567 82343 91320 93926 95736 98546 107900 97206 68032 69960 111404 113110 112658 142160 151885 133797 108550
-8073A08550P083J7475J982j9639j7717P4R409O388j5349j3967J197J3312O873n530r385J271
$$ 108550 115633 133108 135090 115451 97734 97808 107217 113605 98256 84289 85486 98798 105671 100141 90756 92027
-8057I2027M108R766K59o38q373k3347o744K4225J4617r74q910j3148N03k762j3098j5850
$$ 92027 96135 105901 106160 105522 97149 73802 67058 91283 105900 104926 96016 82868 83371 80609 67511 51661
-8041E1661k432N226m719J0688J5901J0877K1779Q947j5726l839R880K628Q383j720M264J779
$$ 51661 49229 54455 49736 60424 76325 87202 108981 117928 102202 98363 108243 110871 119254 117534 121798 123577
-8025A23577j0004j2623m430o801o952l005L690L165O14L142k786k259J545p043j3635J262
$$ 123577 113573 100950 96520 89719 82767 79762 83452 86617 87231 90373 87587 85328 86873 79830 66195 67457
-8009F7457J1769R871N50J4489J0215J320O136K302L065p019k3056k6021k943K0800J5290
$$ 67457 79226 89097 89647 104136 114351 115671 121807 124109 127174 120155 97099 71078 68135 88935 104225
-7994A04225N964M611J158m651j2801J142M968l35p241j9670l853P828J4903R471L869j2481
$$ 104225 110189 114800 115958 111307 98506 99648 104616 104281 97040 77370 73517 81345 96248 105719 109588 97107
-7978I7107k4399l365L0202J1804j6785m191N577j0499l26l113l677J75k518j5784J1890K4298
$$ 97107 72708 69343 99545 111349 94564 90373 95950 85451 85125 82012 78335 78510 75992 60208 72098 96396
-7962I6396J1159o252k2939j6686j0714M821J0513K3938P188j6157M960J5795N867j1601m829
$$ 96396 107555 101303 78364 61678 50964 55785 66298 90236 97424 81267 86227 102022 107889 96288 91459
-7947I1459k78J3126J1610O331K962j2549j2439l979J203n43K581J1824j486j3851J305j8037
$$ 91459 91181 104307 115917 122248 125210 112661 100222 96243 97446 96903 99484 111308 109822 95971 97276 79239
-7931G9239j0871K2203K8112k409q262O129k767r312n445r946j0757R792K5837K1976p981
$$ 79239 68368 90571 118683 116274 108012 114141 111374 102062 96617 86671 75914 85706 111543 133519 125538
-7916A25538l433J5304J5426L375o538r353m161j1113j9469j5517r344L285J8958J1758o010
$$ 125538 122105 137409 152835 156210 149672 140319 136158 125045 105576 90059 80715 84000 102958 114716 108706
-7901A08706k72R224J1408M283j215q632o639J0742j1468k1414o974N789O386k367K870J2260
$$ 108706 108434 117658 129066 133349 132134 123502 116863 127605 116137 94723 87749 93538 99924 97557 100427 112687
-7885A12687r214J0968K0778J2461j3618l1955j426K180O029m99K173M579j7467k3022M292
$$ 112687 103473 114441 135219 147680 134062 102107 100681 102861 108890 108391 110564 115143 97676 74654 78946
-7870G8946J1812N108O610O37o074R020K4857R250j7157k0373n2J1510J6006J3788L521J0628
$$ 78946 90758 95866 102476 103113 97039 106059 130916 140166 123009 102636 102584 114094 130100 143888 147409 158037
-7854A58037K1114M039k6204q860o957j4983J0182j978J31J6178P018J4136K1109k976k9214
$$ 158037 179151 183190 156986 148126 141169 126186 136368 134390 134521 150699 157717 171853 192962 189986 160772
-7839A60772k3806K444Q342O114k438k876J028j3768k538l091m060r302J5502J3880O11l409
$$ 160772 136966 139410 147752 153866 151428 148552 149580 135812 133274 130183 126123 116821 132323 146203 146814 143405
-7823A43405n740j733n760j3697J0392J8740J5490n499j1228m686P174J4639J0547j2365m158
$$ 143405 137665 135932 130172 116475 126867 145607 161097 155598 144370 139684 146858 161497 172044 159679 155521
-7808A55521q12j3840j7605K151K7384J5870N850K0195J4219m421p933L664J9471L5931M7911
$$ 155521 154709 140869 123264 125415 152799 168669 174519 194714 208933 204512 196579 200243 219714 255645 303556
-7793C03556M6154N6838P7226P5104Q0732R9703R6511J02691J28584J28950J27353R9330O5923
$$ 303556 349710 406548 483774 558878 639610 739313 835824 938515 1067099 1196049 1323402 1422732 1488655
-7780A488655K1493k434k4591p1103r9465r9891j12893j34924j53244j30763j00103q2591
$$ 1488655 1510148 1507714 1483123 1412020 1312555 1212664 1099771 964847 811603 680840 580737 498146
-7768D98146p7920o8620n5102l6631k5329j4563n937p315p145k707r90P980K4217j823l8348
$$ 498146 420226 351606 296504 259873 234544 219981 214044 206729 199584 196877 195887 203867 228084 226261 187913
-7753A87913k1349K17J0777o826j2442j1167m790l746j3189N771J147P177K0390k283j2532
$$ 187913 166564 166781 177558 170732 158290 147123 142333 138587 125398 131169 132316 139493 159883 157600 145068
-7738A45068J1425j455o580j2464j3880o676n858L993J2964J6032J42m416J0219J0093o7M169
$$ 145068 156493 155038 148458 135994 122114 115438 109580 113573 126537 142569 142711 138295 148514 158607 158540 162709
-7722A62709K440l57q522p470J2465J7907O941q661l199O43K674J7438J8465j059j3771o644
$$ 162709 165149 164792 156270 148800 161265 179172 186113 177452 174253 174896 177570 195008 213473 212414 198643 191999
-7706A91999Q544J8999J7352J969L589L40j2003j5122Q816J5122P007L027R885J0546p775
$$ 191999 200543 219542 236894 238863 242452 242792 230789 215667 224483 239605 246612 249639 259524 270070 262295
-7691B62295k1686j1510Q876r882l102Q159j4686j4479p922N053j3390j4200j8914r910J0799
$$ 262295 240609 229099 237975 228093 224991 233150 218464 203985 196063 201116 187726 173526 154612 144702 155501
-7676A55501j38q270j361J9431P944k1844j2605M823J232M833L336J4290J904m434J4472L139
$$ 155501 155363 147093 145732 165163 173107 151263 138658 143481 144713 149546 152882 167172 169076 164642 179114 182253
-7660A82253j0954j2055j2261l551r730M067J6386J3817q66r404r04J8174J262o394j9352
$$ 182253 171299 159244 146983 143432 133702 137769 154155 167972 167106 157702 156798 174972 176234 169840 150488
-7645A50488j3314m296J2715R447l074R832j65k302p188p421N202L396n077o219n536O85J3466
$$ 150488 137174 132878 145593 155040 151966 161798 161633 159331 152143 144722 149924 153320 148243 142024 136488 137173 150639
-7628A50639M479p432q757j3297m925M291p447r172J6140J5575K1595Q304k6427k1302K362
$$ 150639 155118 147686 138929 125632 120707 124998 117551 108379 124519 140094 161689 169993 143566 122264 124626
-7613A24626O71M925j1734n199J6373J2514j6612r016J068L42J4703J7711J117J146J2307
$$ 124626 125297 130222 118488 113289 129662 142176 125564 116548 117616 117958 132661 150372 151489 152635 164942
-7598A64942O142O753R921l622k7608l4699j3131J0624L434l920L806J7067l963p114k191
$$ 164942 171084 177837 187758 184136 156528 121829 108698 119322 122756 118836 122642 139709 135746 128632 126441
-7583A26441j8164r952O994J3899J8806J2445j4635q422K808K73J6605J2932m291j4831k732
$$ 126441 108277 98325 105319 119218 138024 150469 135834 127412 130220 130493 147098 160030 155739 140908 138176
-7568A38176r120k6783M617J1359J4570O161q963j0332J857P372o602n891o274Q319J3307
$$ 138176 129056 102273 106890 118249 132819 138980 130017 119685 121542 128914 122312 116421 110147 118466 131773
-7553A31773R198n50j5549n71R954L522m200r341m996m976J91L162N369R825N739j7036P197
$$ 131773 140971 140421 124872 124301 134255 137777 133577 124236 119240 114264 114455 117617 122986 132811 138550 121514 128711
-7536A28711J0304L686J9301J8586L0775R451k582J2957J7585q780j8869r099M785R76l242
$$ 128711 139015 142701 162002 180588 211363 220814 218232 231189 248774 239994 221125 212026 216811 217787 214545
-7521B14545p763k2758k5365j5903n415o69J318Q465O792l568m75N360J177p758K991J3227
$$ 214545 206782 184024 158659 142756 137341 136672 137990 146455 153247 149679 149204 154564 155741 147983 150974 164201
-7505A64201n34j4735q476N74L84m414q90P373R79k650p646o112Q69k816p778J9311J3117
$$ 164201 163667 148932 140456 141030 141414 137000 136110 143483 144462 141812 134166 128054 128923 126107 118329 137640 150757
-7488A50757N92j2143k295r593r615j0607j0033R021N701q816m054R720J6460P564K002o373
$$ 150757 151349 139206 136911 127318 117703 107096 97063 106084 111785 102969 98915 108635 125095 132659 134661 128288
-7472A28288M201O301j1451j3813J714k893j1182J0958P781N834J327j0906N891L582o853
$$ 128288 132489 138790 127339 113526 115240 112347 101165 112123 119904 125738 127065 116159 122050 125632 118779
-7457A18779m838L953R493j2905q288j1269q004P509J8667K5240R190q967j0936j8950L255
$$ 118779 113941 117894 127387 114482 106194 94925 86921 94430 113097 138337 147527 138560 127624 108674 111929
-7442A11929K3303K058j9255j8893O603K3502j1202k0899M245J8276O823j9041K536K7534
$$ 111929 135232 137290 118035 99142 105745 129247 118045 97146 101391 119667 126490 107449 109985 137519
-7428A37519M863j2932j1608J3519P932J841O235p314l279n079j2260j948n038J0873R703
$$ 137519 142382 129450 117842 131361 139293 141134 147369 140055 136776 131697 119437 117489 112451 123324 133027
-7413A33027l508p105r122M345K474p479j1620P317K111j8316j5040L815J3741J8098K8431
$$ 133027 129519 122414 113292 117637 120111 112632 101012 108329 110440 92124 77084 80899 94640 112738 141169
-7398A41169R311r329j9634j0631K133j861K241N343J6366L447L041n635j8215M816K8901
$$ 141169 150480 141151 121517 110886 113019 111158 113399 118742 135108 138555 141596 135961 117746 122562 151463
-7383A51463M184k0338q876r915m277J4629P722m782J08O69m996Q436m041o234l355j3144
$$ 151463 155647 135309 126433 116518 112241 126870 134592 129810 129918 130587 125591 134027 129986 123752 120397 107253
-7367A07253M783K5152J7113j5322j0617J2029Q735k350j2100k3903l586N017l395j3272N204
$$ 107253 112036 137188 154301 138979 128362 140391 149126 146776 134676 110773 107187 112204 108809 95537 100741
-7352A00741K0763K2787J2691K346j8151k4009q451P021o061k328O983o922J2748J5411J7713
$$ 100741 121504 144291 156982 159328 141177 117168 108717 115738 109677 107349 114332 107410 120158 135569 153282
-7337A53282M103O591K986r730r058k809p246p689M795l553j5850r921m698P926R562o750
$$ 153282 157385 163976 166962 157232 148174 145365 138119 130430 135225 131672 115822 105901 101203 109129 118691 111941
-7321A11941O226J0971k63J620k349l692R395K2255J5673M966j5363q793j2171j4826J4386
$$ 111941 118167 129138 128875 130495 128146 124454 133849 156104 171777 176743 161380 152587 140416 125590 139976
-7306A39976K0638j614j2624j3393L625N923J918P925r04j7478j5688J1367J7503j1758k4588
$$ 139976 160614 159000 146376 132983 136608 142531 144449 152374 151470 133992 118304 129671 147174 135416 110828
-7291A10828n343J5960Q576m189r105Q310J0803Q145o719j2117k722K387k642N63n069J9725
$$ 110828 105485 121445 130021 125832 116727 125037 135840 143985 137266 125149 122427 124814 122172 122735 117666 137391
-7275A37391j596l1601j5915r609O685Q930n203k532J5692m129m057j3803M137K4219K3805
$$ 137391 135795 104194 88279 78670 85355 94285 89082 86550 102242 98113 94056 80253 84390 108609 132414
-7260A32414R191j9501k7590j2448J8384K2841J8950j3278j3144Q073L595M212j3247j1845
$$ 132414 141605 122104 94514 82066 100450 123291 142241 128963 115819 123892 127487 131699 118452 106607
-7246A06607j5590j0258k075R529J0816j1071j1417o918L384K4691J8955r093j8381k456J2994
$$ 106607 91017 80759 78684 88213 99029 87958 76541 69623 73007 97698 116653 107560 89179 86723 99717
-7231I9717Q054m585m62m227K972J7481O425p254R105J4641N171k161R642J7735J1994j4465
$$ 99717 107771 103186 102724 98497 101469 118950 125375 118121 127226 141867 147038 144877 154519 172254 184248 169783
-7215A69783k9218k3754j3275o631R351J6081K1271L511o40K377k850k936j9635l3582k5144
$$ 169783 140565 116811 103536 96905 106256 122337 143608 147119 146479 148856 146006 143070 123435 89853 64709
-7200F4709P91R325K2329M945r791k533P911J5740L733j2864J1688K7215P109r112j157J3801
$$ 64709 65500 74825 97154 102099 92308 89775 97686 113426 117159 104295 115983 143198 150307 141195 140038 153839
-7184A53839O000j9657k4077q830O662P095O455j9181j5721R36j938j238P873J4485J3714
$$ 153839 159839 140182 116105 107275 113937 121032 127487 108306 92585 93521 91583 90345 98218 112703 126417
-7169A26417j6025j2226K0328J4574k393n013r577j9358j1588J968K234L596J0259R572k336
$$ 126417 110392 98166 118494 133068 130675 125662 116085 96727 85139 87107 89341 92937 103196 112768 110432
-7154A10432o111m432J2470o298k6168j333K6357K4711K1810j135k2997j4034m086J2770L338
$$ 110432 104321 99889 112359 106061 79893 78560 104917 129628 151438 150303 127306 113272 109186 121956 125294
-7139A25294K420O385j3018O23K5686O719q879J2168L542k0728k0196M681Q160j0668l438
$$ 125294 127714 134099 121081 121704 147390 154109 145230 157398 160940 140212 120016 124697 132857 122189 118751
-7124A18751j7380L24Q721R830J2618j2798r894K384j230j4350m383p817J419J7485K2553
$$ 118751 101371 101695 110416 120246 132864 120066 110172 112556 111326 96976 92593 84776 86195 103680 126233
-7109A26233J2552Q414n847j2124k950k7111j5190J7859J3033L786M875O575j0625j913J3259
$$ 126233 138785 147199 141352 129228 126278 99167 83977 101836 114869 118655 123530 130105 119480 117567 130826
-7094A30826J2236J3102j383j3808k1845r432J2454o722j1447k65J3398J0336N148M892n183
$$ 130826 143062 156164 154781 140973 119128 109696 122150 115428 103981 103716 117114 127450 132598 137490 132307
-7079A32307r66J238r633j375L775P711J3663M550J225k0331k2173k4084J2276K0904J1703
$$ 132307 131341 132579 122946 121571 125346 133057 146720 151270 152495 132164 109991 85907 98183 119087 130790
-7064A30790K2249j32j9480j7352m931j513P598P776j5331q799j2286P641J0991N589J680
$$ 130790 153039 152907 133427 116075 111144 109631 117229 125005 109674 100875 88589 96230 107221 112810 114490
-7049A14490Q487o50j122r380K742J7697q967j1042M727R389J803j0054j1708M0J5950J666
$$ 114490 122977 122327 121205 111825 114567 132264 123297 112255 116982 126371 128174 118120 106412 106452 122402 124068
-7033A24068j2236P517J7505p272P10j2791j7904P382J8244J4680R011j0149j4250j1581n536
$$ 124068 111832 119349 136854 129582 130292 117501 99597 106979 125223 139903 148914 138765 124515 112934 107398
-7018A07398Q090K373j0948L077M641L579m981o853L836n55j561J899J3038r293J4786J7772
$$ 107398 115488 117861 106913 109990 114631 118210 113229 106376 110212 109657 108096 109995 123033 113740 128526 146298
-7002A46298l156l509p121m839J16J5392O848L28k524j8626j6280j7604j662K7218J9126Q913
$$ 146298 143142 139633 132512 127673 127789 143181 150029 150357 147833 129207 112927 95323 93661 120879 140005 148918
-6986A48918J0675L934q178O898O911j9176k7836n315j967k062K953j9986j2066J3616j093
$$ 148918 159593 163527 155349 162247 169158 149982 122146 116831 114864 112802 115755 95769 83703 97319 96226
-6971I6226J0042J8482J5260K7730J4032p716k1641r486J0284K88j6060k0972J3651J8214
$$ 96226 106268 124750 140010 167740 181772 174056 152415 142929 153213 153501 137441 116469 130120 148334
-6957A48334m071j2645q479j1841p336P742n096O207J3311k0637q476L3794L3897O082j3966
$$ 148334 144263 131618 123139 111298 103962 111704 106608 112815 126126 105489 97013 130807 164704 170786 156820
-6942A56820j7686j0867j2668j7690Q229M996k8156j6561J8732K1734k253l640J7660J3009
$$ 156820 139134 128267 115599 97909 106138 111134 82978 66417 85149 106883 104630 100990 118650 131659
-6928A31659j269k2278j6295K0376L4102K81k4864Q912K1015M612j1403j4113q243P914J4609
$$ 131659 130390 108112 91817 112193 146295 146576 121712 130624 151639 156251 144848 130735 122492 130406 145015
-6913A45015l281k3247k0798J0990J1733J60M858o17l623O040K2960Q482j4270j0204m559
$$ 145015 141734 118487 97689 108679 120412 120572 125430 124813 121190 127230 150190 158672 144402 134198 129639
-6898A29639J4388K0315J2420L794k1749j0525m345j7501j271k804Q604K698o717J719M81
$$ 129639 144027 164342 176762 180556 158807 148282 143937 126436 125165 122361 130965 133663 126946 128665 129146
-6883A29146J0763R549P333K808k0232r935J2454J6421R918j6132j6226m099q95O035p240
$$ 129146 139909 149458 156791 159599 139367 129432 141886 158307 168225 152093 135867 131768 130873 136908 129668
-6868A29668j918L616l504N156J4416J6246L0008K0973J200L990j1607k5586j9364r174Q779
$$ 129668 127750 131366 127862 133018 147434 163680 193688 214661 215861 219851 208244 182658 163294 154120 162899
-6853A62899K0464R46j2942n362J6452J8384K2028P336j4758p04K4176K6135R687J0960M0626
$$ 162899 183363 184309 171367 166005 182457 200841 222869 230205 215447 214743 238919 265054 274741 285701 326327
-6838C26327M2766N3164N3303M8134P2973J20876J54476J85882K17277K35389K11756J14847
$$ 326327 369093 422257 475560 523694 596667 717543 872019 1057901 1275178 1510567 1722323 1837170
-6826A837170L4247k1213k1449j0142p4907j65715k26707k44172k12479j66747j26013r4927
$$ 1837170 1871417 1850204 1828755 1818613 1743706 1577991 1351284 1107112 894633 727886 601873 506946
-6814E06946o6671m3965l1214k5547j2432j3001k5785n0104l6164j7487j4885L237J783k580
$$ 506946 440275 396310 365096 339549 327117 314116 288331 238227 202063 184576 169691 172928 174711 172131
-6800A72131j2719k0404q939Q43J775J6800J0624Q026J4733l272j2748o155J0565L356j1866
$$ 172131 159412 139008 130069 130912 132687 149487 160111 168137 182870 179598 166850 160695 171260 174616 162750
-6785A62750O099R283j1953l738O333o009j0210o985j6355p734P577K3360J5110R183N887
$$ 162750 168849 178132 166179 162441 168774 162765 152555 145570 129215 121481 129058 152418 167528 176711 182598
-6770A82598j2105j1892l172l747j090j597o746j8461q725o933p99K0905K0720K290m494J3126
$$ 182598 170493 158601 155429 151682 150592 148995 142249 123788 115063 108130 107331 128236 148956 151246 146752 159878
-6754A59878K8037R850o055j9415j7164K445l40P370o932r740K2285J6927j338M754M125o973
$$ 159878 187915 197765 191710 172295 155131 157576 157236 164606 157674 147934 170219 187146 185808 190562 194687 187714
-6738A87714q305k552m470j2067k836n122M754M477J0718r83p606K845l333P723K3147R158
$$ 187714 179409 176857 172387 160320 157484 152362 157116 161593 172311 171328 163722 166567 163234 170957 194104 203262
-6722B03262p642j4483j7328j1478j0933J0687K0717J3160o254k9949j9315J4874N106N191
$$ 203262 195620 181137 163809 152331 141398 152085 172802 185962 179708 149759 130444 145318 150424 155615
-6708A55615K7003K2432k172k367p138L550o186j5651j1391k851N834J3154p329j0852j2188
$$ 155615 182618 205050 202878 200511 193373 196923 190737 175086 163695 160844 166678 179832 172503 161651 149463
-6693A49463k53N223R713O431k4510l1787N797K5656J4262n015k614J6088J6814L154j8045
$$ 149463 149210 154433 164146 170577 146067 114280 120077 145733 159995 154980 152366 168454 185268 188422 170377
-6678A70377k793J1037p456j4221p117o464o843n544L683J2410J683p282Q144r276j4063j5042
$$ 170377 167584 178621 171165 156944 149827 143363 136520 130976 134659 147069 148752 141470 149614 140338 126275 111233
-6662A11233j104J6656J2149N166m734R82R481O065J413J2057Q896m122k1691j7499L150J4600
$$ 111233 110129 126785 138934 144100 139366 140348 149829 155894 157307 169364 178260 174138 152447 134948 138098 152698
-6646A52698m716j8126j4375L693J6758m754n254L781Q823P023K4694N082j238J0988k033
$$ 152698 147982 129856 115481 119174 135932 131178 125924 129705 138528 145551 170245 175327 174089 185077 183044
-6631A83044j6158j3589j6141Q402K1401j228O65R657m024k5324j8255J2789J9635k68k3785
$$ 183044 166886 153297 137156 145558 166959 165731 166396 176053 172029 146705 128450 141239 160874 160606 136821
-6616A36821j3131L983J7917O079k0788k0048J0668K4741K2508O965L457O61k436K381O773
$$ 136821 123690 127673 145590 151669 130881 110833 121501 146242 168750 175715 179172 179833 177397 179778 186551
-6601A86551l148j9982Q464K8633J258r120q612k8411k1477J851K3246R560O642O161o616
$$ 186551 183403 163421 171885 200518 201776 192656 184044 155633 134156 136007 159253 168813 175455 181616 175000
-6586A75000j8263L76J6506J825L516n019M942p683r180J2455R776j4022j2045O803K0528
$$ 175000 156737 157113 173619 175444 178960 173941 178883 171200 162020 174475 184251 170229 158184 164987 185515
-6571A85515J8356n243k6123j7871J913m601k933O815Q856K272j6793p437M496J945k178M020
$$ 185515 203871 198628 172505 154634 156547 151946 149013 155828 164684 166956 150163 142726 147222 149167 146989 151009
-6555A51009K609N337m008j3167m255J2692L311q607m369o30L988R138Q571l876J2206J9210
$$ 151009 153618 158955 154947 141780 137525 150217 153528 144921 140552 139922 143910 153048 161619 157743 169949 189159
-6539A89159R725m401j8631j775j2938j7431k3689j2587k015R376J1012K3141O369j9889m608
$$ 189159 198884 194483 175852 174077 161139 143708 120019 107432 105417 114793 125805 148946 155315 135426 130818
-6524A30818j9213o930K1140J8550L859K563K385L299l527k5635j4057K530K1609p14j5934
$$ 130818 111605 104675 125815 144365 148224 150787 153172 156471 152944 127309 113252 115782 137391 136677 120743
-6509A20743j0833j5376Q444K4400K8773K2490J3839J0354O233p97k0964j6145m037j2938
$$ 120743 109910 94534 102978 127378 156151 178641 192480 202834 209067 208270 187306 171161 167124 154186
-6495A54186R608J1142M499K5987N047o081n584j4120P634J5614r806l264O12l891m097n065
$$ 154186 163794 174936 179435 205422 210469 204388 198804 184684 192318 207932 198126 194862 195474 191583 187486 182421
-6479A82421k2821p230K0780R094K736j8077r629P981K915J3337l98j8621q637m88Q630j088
$$ 182421 159600 152370 173150 182244 184980 166903 157274 165255 168170 181507 181109 162488 153851 153363 161993 160905
-6463A60905l89O060k196L763r14k75N143J7092M613m150k899R89r729k4202P694K274k238
$$ 160905 160516 166576 164380 168143 167229 166954 172097 189189 193802 189652 186753 187742 178013 153811 161505 163779 161541
-6446A61541r900j2103P84L6350J6374j9416j0454K822k566Q01k752L05J0015L284q012j748
$$ 161541 151641 139538 140322 176672 193046 173630 163176 165998 163432 164233 161481 161786 171801 175085 167073 165325
-6430A65325J0848K5513J6514r963j1606p710j0709J663J5203M398j5513q690J2783J0010
$$ 165325 176173 201686 218200 208237 196631 188921 178212 179875 195078 199476 183963 175273 188056 198066
-6416A98066k0615k2454k529R450J8159J0763j547O640J5063l122j4415j0197j3363j4458
$$ 198066 177451 154997 152468 161918 180077 190840 189293 195933 210996 207874 193459 183262 169899 155441
-6402A55441M800J0303J3355K3929J1169p807K834J228L440O052j8744k3682m748P621J7893
$$ 155441 160241 170544 183899 207828 218997 211190 214024 215252 218692 224744 206000 182318 177570 185191 203084
-6387B03084K3138m823k4368r965K761J687P403L924O053l920l836J557J7776P434M635J8527
$$ 203084 226222 221399 197031 187066 189827 191514 198917 202841 208894 204974 201138 202695 220471 227905 232540 251067
-6371B51067N836m724j4127m831m384j4534j1772K793r439k1873j975K4229J6191M82J5363
$$ 251067 256903 252179 238052 233221 228837 214303 202531 205324 195885 174012 172037 196266 212457 212939 228302
-6356B28302L84p428O782J5498J9940Q658Q319q585j9493m179k2723j3714J6023K0093J0877
$$ 228302 228686 221258 228040 243538 263478 272136 280455 271870 252377 248198 225475 211761 227784 247877 258754
-6341B58754J8686R624p376j0309J052J4148o342k443P146O37m919p653m368l398R395K0618
$$ 258754 277440 287064 279688 269379 270431 284579 278237 275794 282940 283577 278658 271005 266637 263239 272634 293252
-6325B93252K2786J3625J1983J9189K1663J3829K2243J6186j610l013L420K916J0824K4109
$$ 293252 316038 329663 341646 360835 382498 396327 418570 434756 433146 430133 433553 436469 447293 471402
-6311D71402R629j0507q236k7186l0455k7363k1536l785J9038L2509N835r304j4109N317P055
$$ 471402 481031 470524 462288 435102 404647 377284 355748 351963 371001 403510 409345 400041 385932 391249 398304
-6296C98304j0422o160J1476L540j2577p211k103l022M256J4403n31j3517j3598J0988L6441
$$ 398304 387882 381722 393198 396738 384161 376950 374847 371825 376081 390484 389953 376436 362838 373826 410267
-6281D10267K3486K979J0247L114o371o618j5072Q21Q943l095J3066l222n479P053J6571J203
$$ 410267 433753 436732 446979 450093 443722 437104 422032 422853 431796 428701 441767 438545 433066 440119 456690 457893
-6265D57893Q900Q007L171j1191L097q939l3170j663Q031l168N548j062p516J2945K456J568
$$ 457893 466793 474800 477971 466780 469877 460938 427768 426105 434136 430968 436516 435454 427938 440883 443339 444907
-6249D44907K064M877p131r706l110o101k855q284r539j2913m923j3510q780l493n099l609
$$ 444907 446971 451848 444717 435011 431901 425800 422945 414661 405122 392209 387286 373776 364996 361503 356404 352795
-6233C52795k561J7381Q571K352l679K171J1626m829k3287k9175J44K4876J5022J8157O680
$$ 352795 350234 367615 376186 378538 374859 377030 388656 383827 360540 331365 331509 356385 371407 389564 396244
-6218C96244k3754j1938N159J0845o76j3214p776l732P054N044m743M411K1824P303r832j3468
$$ 396244 372490 360552 365711 376556 375880 362666 354890 351158 358212 363256 358513 362924 384748 392051 382219 368751
-6202C68751k2286j0804P650o350j6047k0910P126O661J0217j981j7741l6258l969K7973J7566
$$ 368751 346465 335661 343311 336961 320914 300004 307130 313791 324008 322027 304286 268028 264059 292032 309598
-6187C09598R560J4129P518j1967k104p803r208j5513k1383j3258K21q63K610J4300J4756
$$ 309598 319158 333287 340805 328838 326734 318931 309723 294210 272827 259569 259790 258927 261537 275837 290593
-6172B90593j1504p423J8307L793p056k2480j1566r371j907N553m27l172j0927Q129J6422
$$ 290593 279089 271666 289973 293766 286710 264230 252664 243293 241386 246939 246512 243340 232413 240542 256964
-6157B56964K988m283j5890J3846K5116J3426J4138o768l6385j8668M12L86K823K433p477
$$ 256964 259952 255669 239779 253625 278741 292167 306305 299537 263152 244484 244896 245282 248105 250538 243061
-6142B43061m346k422l647p54n25R968J3706o86r004k0795l2398p856K2971K0943M823q166
$$ 243061 238715 236293 232646 231892 231367 241335 255041 254355 245351 224556 192158 184302 207273 228216 233039 224873
-6126B24873K846M969Q157l498j1633j0314j1669K187q94J954J4057M994q78J200l95j3180
$$ 224873 227719 232688 240845 237347 225714 215400 203731 205918 205024 206978 221035 226029 225151 226351 225956 212776
-6110B12776q365k1074k2479j4730J4821L3573J0191k976j442j9870k3868n802K0776J3945
$$ 212776 204411 183337 160858 146128 160949 194522 204713 201737 200295 180425 156557 150755 171531 185476
-6096A85476j948M17P087j719k4107k0856L969K2830Q210Q129J6063N001L912q577j1297P424
$$ 185476 183528 183945 191032 189313 165206 144350 148319 171149 179359 187488 203551 208552 212464 203887 192590 200014
-6080B00014J5388p11K090J7714K7322J955j5650p529n472j0183k75K474j5302j407J238O638
$$ 200014 215402 214691 216781 234495 261817 263772 248122 240593 235121 224938 224663 227137 211835 210428 211666 218304
-6064B18304J0334R783J1063q627j6405J3205M172M142R972l083j3524l657r528K664J522
$$ 218304 228638 238421 249484 240857 224452 237657 241829 245971 255943 252860 239336 235679 226151 228815 230337
-6049B30337k933j0902n78J5109J2597l409O053J3081O998r245r543j4159j4117j286p331
$$ 230337 227404 216502 215924 231033 243630 240221 246274 259355 266353 257108 247565 233406 219289 218003 210672
-6034B10672M591J2386m354j2633J986R548J5305J9024p880p360J889O826J0167j4409k9399
$$ 210672 215263 227649 223295 210662 212648 222196 237501 256525 248645 241285 243174 250000 260167 245758 216359
-6019B16359j4829R392J3443K1543j62j6714j985L722K3924K9214o275j5882j2331r376n394
$$ 216359 201530 210922 224365 245908 245746 229032 227047 230769 254693 283907 277632 261750 249419 240043 234649
-6004B34649J4574J3341K082M962J0796j5141k1730N318J3895k746j1571k332K0661K8481
$$ 234649 249223 262564 264646 269608 280404 265263 243533 248851 262746 260000 248429 246097 266758 295239
-5990B95239J191k0899j5449n8j8221j0750j662J4415J1409N045K789j1907j4424o011J4821
$$ 295239 296430 275531 260082 260024 241803 231053 229391 243806 255215 260260 263049 251142 236718 230707 245528
-5975B45528P229l929j0234Q61Q79m3m675l362L795J0136J2803J0219O644M38O253J652r320
$$ 245528 252757 248828 238594 239455 240334 240291 235616 232254 236049 246185 258988 269207 275851 276289 282542 284194 274874
-5958B74874j4949O217J5779K692k1697r734n48K841n146O57p950N616M509m870k203k250
$$ 274874 259925 266142 281921 284613 262916 253182 252634 255475 250329 250986 243036 248652 253161 248291 246088 243838
-5942B43838o547k543Q589o159j3859O30j0473k5459o311K3J538J4880J453j8361j1708K4262
$$ 243838 237291 234748 243337 237178 223319 223949 213476 188017 181706 181729 183267 198147 199600 181239 169531 193793
-5926A93793K6108Q498K443J5778K870j4341q659J0640J0674J0526J425q643j783J730j5355
$$ 193793 219901 228399 230842 246620 249490 235149 226490 237130 247804 258330 259755 251112 249329 251059 235704
-5911B35704k4237j5406J1251O645k0361K977R820J6015R315J931P793o105j2838j5928j1241
$$ 235704 211467 196061 207312 213957 193596 196573 206393 222408 231723 233654 241447 235342 222504 206576 195335
-5896A95335j38j6705j8755K957J6727J6076N131m079J344K0850K1790o594k2701K3115J3092
$$ 195335 195197 178492 159737 162694 179421 195497 200628 196549 197893 218743 240533 233939 211238 234353 247445
-5881B47445k0484j381K635j2291j5169J4225J1681r471k51Q107m684N391J2791l431m415
$$ 247445 226961 225580 228215 215924 200755 214980 226661 217190 216939 225046 220362 225753 238544 235113 230698
-5866B30698L471P178p154J294J9160r157j9811K750J5172n849p720m830J089M122o576M248
$$ 230698 234169 241347 234193 235487 254647 245490 225679 228429 243601 237752 230032 225202 226291 230413 223837 228085
-5850B28085J3323P580o002m936K132P724p23O292n476n960L295J8955K3983K790l092l361
$$ 228085 241408 248988 242986 238050 240182 247906 247183 253475 247999 242039 245334 264289 288272 291062 287970 284609
-5834B84609o603P426N841j5690j1243N170r71M372l97j6209j4106J1794K2483l073l506N103
$$ 284609 278006 285432 291273 275583 264340 269510 268539 272911 272514 256305 242199 253993 276476 273403 269897 275000
-5818B75000r509j9743r134j2943N71j8947k5432K029J4814J829r057M006J7197J8010J9325
$$ 275000 265491 245748 236614 223671 224242 205295 179863 181892 196706 198535 189478 193484 210681 228691 248016
-5803B48016J5625Q649M522j2698k0795m557m366l326o178J1809J7593J3113K480p126O296
$$ 248016 263641 272290 276812 264114 243319 238762 234396 231070 224892 236701 254294 267407 269887 262761 269057
-5788B69057J0347j325Q386P598M342J0490j033k065q689n379q173j3036l334o775M088j466
$$ 269057 279404 278079 286465 294063 298405 308895 307862 305797 297108 291729 283556 270520 267186 260411 264499 263033
-5772B63033J368Q253j5635j1364m567j1512j4370j654k733l184K3877K3671R491O60l451
$$ 263033 264401 272654 257019 245655 241088 229576 215206 213552 210819 207635 231512 255183 264674 265334 261883
-5757B61883p589k1529r725J1924J5840M382J8618J6318k4675J543J4707j2129p70J1110K59
$$ 261883 254294 232765 223040 234964 250804 255186 273804 290122 265447 266990 281697 269568 268798 279908 280167
-5742B80167j1301J4140K8283J7094o048j3422P617J8224K315J3851Q59k3592k8275k2334
$$ 280167 268866 283006 311289 328383 322335 308913 316530 334754 337069 350920 351779 328187 299912 277578
-5728B77578N988K028j1549O841J2412O549J080j0226p625o043R038R512J0842O815M361j221
$$ 277578 283566 285594 274045 280886 293298 299847 300927 290701 283076 277033 286071 295583 306425 313240 317601 316380
-5712C16380k927j6720r975j0505l52p107p744Q862L848M448L705L91P978J4833N9n2L429
$$ 316380 313453 296733 286758 276253 275901 268794 261050 269912 273760 278208 281913 282304 290282 305115 305174 305122 308551
-5695C08551l502m619O81l866p893Q118J1490O708q577l079J0799J1992L761j3148k5533k9938
$$ 308551 305049 300430 301111 297245 289352 297470 308960 315668 307091 304012 314811 326803 330564 317416 291883 261945
-5679B61945M058L303n870J3956J8153J3400M492j2071q984j3470j1311Q463J9682q282k4552
$$ 261945 266003 269306 263436 277392 295545 308945 313437 301366 292382 278912 267601 276064 295746 287464 262912
-5664B62912r139K0369L3156K6342O349j1634r424n807N424J4383J1693J7539L5154K9523
$$ 262912 253773 274142 307298 333640 339989 328355 318931 313124 318548 332931 344624 362163 397317 426840
-5650D26840J7825r095k0951j0681N561O65M790l339j3746k2341l7749k2095j072N944j1920
$$ 426840 444665 435570 414619 403938 409499 410164 414954 411615 397869 375528 337779 315684 314612 320556 308636
-5635C08636j8501j061J5714K9141n74k7979k3542q827M492Q327m738m906p971o484m060n0
$$ 308636 290135 289074 304788 333929 333355 305376 281834 273007 277499 285826 281088 276182 268211 261727 257667 257617
-5619B57617L698j784j2478j557n35j1255q935N94O331K8291L7416N03q279n128j2454j0509
$$ 257617 261315 259531 247053 245496 244961 233706 224771 225365 231696 259987 297403 297906 289627 284499 272045 261536
-5603B61536o554m246o505k279L691j2719l968K1438K1853M17o104q768r43J4941o060k4226
$$ 261536 254982 250736 244231 241952 245643 232924 228956 250394 272247 272664 266560 257792 256849 271790 265730 241504
-5587B41504j2084k353j72J6900J3908J542L520N501N006J90L508j424p484o310J152J489
$$ 241504 229420 227067 226895 243795 257703 259245 262765 268266 273272 273462 276970 275546 268062 261752 262904 264393
-5571B64393o53o549j4032m85K4633L4593N193j6881q441Q952P221k246j0812j7071M211K5614
$$ 264393 263740 257191 243159 242674 267307 301900 307093 290212 281771 290723 297944 295698 284886 267815 272026 297640
-5555B97640K0157J5601k647j695k549J1227N950j4012j8668n341j5263k527j020K013N720
$$ 297640 317797 333398 330751 329056 326507 337734 343684 329672 311004 305663 290400 287873 286853 288866 294586
-5540B94586M143m585K4J2896J7271j0694k9996m536O407l926O675J4358O25r422k31J6429
$$ 294586 298729 294144 294168 307064 324335 313641 283645 279109 285516 281590 288265 302623 303248 293826 293595 310024
-5524C10024J9100n102j7686j2675m289J6900J8921j3129k5844j1920M896K0838J2370J7138
$$ 310024 329124 324022 306336 293661 289372 306272 325193 312064 286220 274300 279196 300034 312404 329542
-5510C29542J0931N504P536M478R928J4820m166j5185n425o31J117N279J4513J3076O914j0367
$$ 329542 340473 345977 353513 357991 367919 382739 378573 363388 357963 357332 358449 363728 378241 391317 398231 387864
-5494C87864p82J7557j2315j8874q717j025m430O901P230R262J6989K908p488j0436j9796
$$ 387864 387082 404639 392324 373450 364733 363708 359278 366179 373409 382671 399660 402568 395080 384644 364848
-5479C64848l470K1555J7920j1833n344J190P38R231n685K069j0822k5477k954k30J4194R816
$$ 364848 361378 382933 400853 389020 383676 384866 385604 394835 389150 391219 380397 354920 351966 351736 365930 375746
-5463C75746J941l385N768K200j2219O641K7272K8488J2746o272m232M27J2703J7223l565
$$ 375746 377687 374302 380070 382270 370051 376692 403964 432452 445198 438926 434694 435121 447824 465047 461482
-5448D61482j2320o625o508r278j8833j5920N30P292J1130M096M132K9904K0658M245p889
$$ 461482 449162 442537 436029 426751 407918 391998 392528 399820 410950 415046 419178 449082 469740 473985 466096
-5433D66096j1231r539j4708M348j2950p906k518r548k774n792l216J3005K1907R527J0243
$$ 466096 454865 445326 430618 434966 422016 414110 411592 402044 399270 393478 390262 403267 425174 434701 444944
-5418D44944K3294J3127o627k991p76l159j824O048K025J3226K3452L290o128J463R828J2846
$$ 444944 468238 481365 474738 471747 470971 467812 465988 472036 474061 487287 510739 514029 507901 509364 519192 532038
-5402E32038M156r194N266J2147J4810R846j3511r368L668k901M265P863K2985K3596J0409
$$ 532038 536194 527000 532266 544413 559223 569069 555558 546190 549858 546957 551222 559085 582070 605666 616075
-5387F16075p581r169k719J1469L1058L9213M3986K4828J4931q224j2469N412P476Q619n125
$$ 616075 608494 599325 596606 608075 639133 678346 722332 747160 762091 753867 741398 746810 754286 762905 757780
-5372G57780j3929K41J2648J8196K719M967j1847k5268n335K4067J9893K1588K4281O998J9735
$$ 757780 743851 744092 756740 774936 777655 782622 770775 745507 740172 764239 784132 805720 830001 836999 856734
-5357H56734K7386L5384K7046J4508L0960J2677J9509L6317M6144N6250M4138M3222P3100
$$ 856734 884120 919504 946550 961058 992018 1004695 1024204 1060521 1106665 1162915 1207053 1250275 1323375
-5344A323375O8906O1582Q2788J08202J33228J48150J45991J58753J71918J76135K09315K43579
$$ 1323375 1392281 1453863 1536651 1644853 1778081 1926231 2072222 2230975 2402893 2579028 2788343 3031922
-5332C031922K84521L18139L46146L80818M00831M13024M89035N42018N32032N10648M56765
$$ 3031922 3316443 3634582 3980728 4361546 4762377 5175401 5664436 6206454 6738486 7249134 7705899
-5321G705899M03230L27582K29646J62803Q7434L4172R734j9679n8061j41002k44500l49326
$$ 7705899 8109129 8436711 8666357 8829160 8916594 8950766 8960500 8940821 8882760 8741758 8497258 8147932
-5309H147932m40465m92553n32502n65467n33435m73267m12852l60299l16562k77321k26376
$$ 8147932 7707467 7214914 6682412 6116945 5583510 5110243 4697391 4337092 4020530 3743209 3516833
-5298C516833j82297j52608j24763j03069p6451m6535j7460j8043r450K1730J3457L4418Q3803
$$ 3516833 3334536 3181928 3057165 2954096 2877645 2831110 2813650 2795607 2786157 2807887 2821344 2855762 2939565
-5285B939565J14674J26836J31955J54110J79011J96269K36582K80558L06873L55752L93058
$$ 2939565 3054239 3181075 3313030 3467140 3646151 3842420 4079002 4359560 4666433 5022185 5415243
-5274E415243M00562M31089M56097M69992M65439M21146L39552K43301J54449R7750N8313
$$ 5415243 5815805 6246894 6702991 7172983 7638422 8059568 8399120 8642421 8796870 8894620 8952933
-5263H952933J2839k4930o0128j32420k11564l09607m20658n24909n80322n61372n52242n35256
$$ 8952933 8965772 8940842 8880714 8748294 8536730 8227123 7806465 7281556 6701234 6139862 5587620 5052364
-5251E052364m76868m22653l63480l20394k73077k24794j88786j67598j37521j25351j02400
$$ 5052364 4575496 4152843 3789363 3468969 3195892 2971098 2782312 2614714 2477193 2351842 2249442
-5240B249442p3982p7491p1996q5109r5743j05595q1472n4554n4282l4605k8295m2932l4190
$$ 2249442 2175460 2097969 2025973 1940864 1845121 1739526 1658054 1603500 1549218 1514613 1486318 1443386 1409196
-5227A409196l4082l9817l6680m8888m2207k5492k9397k9897j8672l438m134k3622o990J1989
$$ 1409196 1375114 1335297 1298617 1249729 1207522 1182030 1152633 1122736 1104064 1100626 1096492 1072870 1065880 1077869
-5213A077869l854p744K925J3094M572N827J6957K8038N6741N3771N3535O6672O2431M3035
$$ 1077869 1074015 1066271 1069196 1082290 1086862 1092689 1109646 1137684 1194425 1248196 1301731 1368403 1430834 1473869
-5199A473869J0827k1048n239M521k5562n1552o3460p0699q1390m9489l6215k4915j7827k0175
$$ 1473869 1484696 1463648 1458409 1462930 1437368 1385816 1322356 1251657 1170267 1120778 1084563 1059648 1041821 1021646
-5185A021646k6046k0101m695j128j0893j3535p537J0079k426k8985j2207M631o397J810Q424
$$ 1021646 995600 975499 970804 969676 958783 945248 937711 947790 945364 916379 904172 908803 902406 904216 912640
-5170I12640j459P916R932J6358K909q128J733J5864j364L856J2430J4567K9715K2718M517
$$ 912640 911181 919097 929029 945387 948296 940168 941901 957765 956401 960257 972687 987254 1016969 1039687 1044204
-5155A044204L8354L9994K5853N4485O2451Q5276R0630O1469J1646j7939k7383k583K4670
$$ 1044204 1082558 1122552 1148405 1202890 1265341 1350617 1441247 1502716 1514362 1496423 1469040 1466457 1491127
-5142A491127M573k9152o4047p8883p6038n7179m1609l0902j3937j7158k5963j5530j1962
$$ 1491127 1495700 1466548 1402501 1323618 1247580 1190401 1148792 1117890 1103953 1086795 1060832 1045302 1033340
-5129A033340q697J8450R859m731J78K616J0519k175K571K5128K644j9510j3241j1009J1481
$$ 1033340 1024643 1043093 1052952 1048221 1048399 1051015 1061534 1059359 1061930 1087058 1089702 1070192 1056951 1045942 1057423
-5114A057423L2539J1203l509L154j578N071Q614K2260L6645J4542R90k025o116J423p419
$$ 1057423 1089962 1101165 1097656 1100810 1099232 1104303 1112917 1135177 1171822 1186364 1187354 1185329 1179213 1180636 1173217
-5099A173217p265j1521R693K6826J8387M125R500J7979P550N604o968k2583r789O145J1667
$$ 1173217 1165952 1154431 1164124 1190950 1209337 1213462 1222962 1240941 1248491 1254095 1247127 1224544 1214755 1220900 1232567
-5084A232567J8285J015K998L838l296K3524J9812n555j6282J5394K7963K921m384N430J6519
$$ 1232567 1250852 1251867 1254865 1258703 1255407 1278931 1298743 1293188 1276906 1292300 1320263 1323184 1318800 1324230 1340749
-5069A340749J157J1682Q407J380J6304J5013J9343K1077J9278O639L342K7022J3536O420
$$ 1340749 1341906 1353588 1361995 1363375 1379679 1394692 1414035 1435112 1454390 1461029 1464371 1491393 1504929 1511349
-5055A511349j0400J862K632j1258K049J4901O308m386J2153K565r156R634l527q919Q048
$$ 1511349 1500949 1502811 1505443 1494185 1496234 1511135 1517443 1513057 1525210 1527775 1518619 1528253 1524726 1515807 1523855
-5040A523855L6146L3869R352k1159k7170L696J1000J3965N696N159J582p547L251M159L151
$$ 1523855 1560001 1593870 1603222 1582063 1554893 1558589 1569589 1583554 1589250 1594409 1595991 1588444 1591695 1595854 1599005
-5025A599005M800j131J1877J7480L0392M2579J9061J0125K4927K7364O016l526j1103Q174
$$ 1599005 1603805 1602674 1614551 1632031 1662423 1705002 1724063 1734188 1759115 1786479 1792495 1788969 1777866 1786040
-5011A786040L8182M7921K1579N036L6261N4187O1972P2783Q8401R0499O2453K514q322J9693
$$ 1786040 1824222 1872143 1893722 1898758 1935019 1989206 2051178 2123961 2212362 2302861 2365314 2367828 2359506 2379199
-4997B379199J5166J3822K5786J7395r117o4117p7498p2746q2321o1611k7694j2977j1676
$$ 2379199 2394365 2408187 2433973 2451368 2442251 2378134 2300636 2227890 2145569 2083958 2056264 2043287 2031611
-4984B031611j9177j4915L368J0745L848j3182J615O571n068r13J0519K3954J9665K1058l863
$$ 2031611 2012434 1997519 2000887 2011632 2015480 2002298 2003913 2010484 2005416 2004503 2015022 2038976 2058641 2079699 2075836
-4969B075836q521O472J7583N5878P1153N8166M4472L1063N1432O7364P6696Q4359P9649R7187
$$ 2075836 2067315 2073787 2091370 2147248 2218401 2276567 2321039 2352102 2403534 2470898 2547594 2631953 2711602 2808789
-4955B808789J29480J45574J66156J94225K36604K75203K56032K26971K05932K10403K25438
$$ 2808789 2938269 3083843 3249999 3444224 3680828 3956031 4212063 4439034 4644966 4855369 5080807
-4944E080807K70303L24027L40374K90830K39210K08332J53319J24125Q2390L0635k2527p1090
$$ 5080807 5351110 5675137 6015511 6306341 6545551 6753883 6907202 7031327 7113717 7144352 7121825 7050735
-4932G050735j10466j55230j97577k50904k95484l04422l04121l01795k64825k60141k39793
$$ 7050735 6940269 6785039 6587462 6336558 6041074 5736652 5432531 5130736 4865911 4605770 4365977
-4921D365977k12034j88504j57212j37272j12605j09805q8021n8369n1847n0088l3223j1957
$$ 4365977 4153943 3965439 3808227 3670955 3558350 3448545 3360524 3302155 3250308 3200220 3166997 3155040
-4909C155040r025l251j617J7143M2429O2382P3057P3498J04960J40028J74622J72464J67808
$$ 3155040 3146015 3142764 3141147 3158290 3200719 3263101 3336158 3409656 3514616 3654644 3829266 4001730 4169538
-4896D169538K05059K33742K41848K45870K64943K84970K56067K31138K14316J60493J08552
$$ 4169538 4374597 4608339 4850187 5096057 5361000 5645970 5902037 6133175 6347491 6507984 6616536
-4885F616536Q4632M2409m8454j05726j67300k15520k48748l04981l27777l11591l05081l27154
$$ 6616536 6701168 6743577 6695123 6589397 6422097 6206577 5957829 5652848 5325071 5013480 4708399 4381245
-4873D381245l08350k65677k30180k08953j71967j37332j16656j15416j10136p9387o8630
$$ 4381245 4072895 3807218 3577038 3368085 3196118 3058786 2942130 2826714 2716578 2637191 2568561
-4862B568561o4958p3300o6049n8950n4728o1382n5715o0208n7152l8653m0809n2017p5773
$$ 2568561 2503603 2430303 2364254 2305304 2250576 2189194 2133479 2073271 2016119 1977466 1936657 1884640 1808867
-4849A808867n5999j9414p948j5473k4748l6271m7487l9446l8913j1283j880J979k0830k4145
$$ 1808867 1752868 1733454 1725506 1710033 1685285 1649014 1601527 1562081 1523168 1511885 1510005 1511984 1491154 1467009
-4835A467009n434o815j0748m394m168p864r18J1669K332k5913l7335k6721m0497k8637j5600
$$ 1467009 1461575 1454760 1444012 1439618 1435450 1427586 1426668 1438337 1440669 1414756 1377421 1350700 1310203 1281566 1265966
-4820A265966n448K165L513p196k0393l2930k4016J6853Q907r225j4957k7571p21M259j000
$$ 1265966 1260518 1262683 1266196 1259000 1238607 1205677 1181661 1198514 1207421 1198196 1183239 1155668 1154947 1159206 1158206
-4805A158206K4600K7748J9015j98q958L872K1850M3320M5487J2603J069J025N541L6715P6023
$$ 1158206 1182806 1210554 1229569 1229371 1220413 1224285 1246135 1289455 1334942 1347545 1348614 1349639 1355180 1391895 1467918
-4790A467918P5151N9919J06286J62025J47534R8702N8039K2427k2195r6140j63541j70369
$$ 1467918 1543069 1602988 1709274 1871299 2018833 2117535 2175574 2198001 2175806 2079666 1916125 1745756
-4778A745756j22571p1482n9390j7173j4002l0794p050R771k92J545M566k209m665O262m608
$$ 1745756 1623185 1551703 1492313 1475140 1461138 1430344 1423294 1433065 1432773 1434318 1438884 1436675 1432010 1438272 1433664
-4763A433664q099J3495K6240J9996j638K967J0305J364J4760J9492J4903m263O115J3061
$$ 1433664 1425565 1439060 1465300 1485296 1483658 1486625 1496930 1498294 1513054 1532546 1547449 1543186 1549301 1562362
-4749A562362k921m547j2975m891r9p54J5525M3720K2696K0315J7861J3147N025p702j8428
$$ 1562362 1559441 1554894 1541919 1537028 1536929 1536175 1551700 1595420 1618116 1638431 1656292 1669439 1674464 1666762 1648334
-4734A648334o42J4762J8870P981j2131j3148k278r433k1028k3412O698J733k4944j0523n550
$$ 1648334 1647692 1662454 1681324 1689305 1677174 1664026 1661748 1652315 1631287 1607875 1614573 1616306 1591362 1580839 1575289
-4719A575289o303l86R552P200J5652K5753J1127K5461L7717K5417J5437Q063J2407J8762
$$ 1575289 1568986 1568600 1578152 1585352 1601004 1626757 1637884 1663345 1701062 1726479 1741916 1749979 1762386 1781148
-4705A781148J6445J7481L0554L2182J3531j684m618m043J2577P019r094J5525J5649n703
$$ 1781148 1797593 1815074 1845628 1877810 1891341 1889657 1885039 1880996 1893573 1900592 1891498 1907023 1922672 1916969
-4691A916969P016J3598J2963j480J3348J4646J5169Q118o816j1102k0370j2110k3372k3945
$$ 1916969 1923985 1937583 1950546 1949066 1962414 1977060 1992229 2000347 1993531 1982429 1962059 1949949 1926577 1902632
-4677A902632j6146k0769m454J8011J3272j1708o619J5007R532J1801K2800L644J8780K6973
$$ 1902632 1886486 1865717 1861263 1879274 1892546 1880838 1874219 1889226 1898758 1910559 1933359 1937003 1955783 1982756
-4663A982756M325O626l782l346K921lk077J5047J7039J6214J3880K2956J7771J7715J7106
$$ 1982756 1987081 1993707 1989925 1986579 1989500 1989497 1987420 2002467 2019506 2035720 2049600 2072556 2090327 2108042 2125148
-4648B125148m314j851L346K6136L3241K2599P701J3407J8830J4264K1787J2195j89m25K3339
$$ 2125148 2120834 2118983 2122329 2148465 2181706 2204305 2212006 2225413 2244243 2258507 2280294 2292489 2292300 2291875 2315214
-4633B315214J5791K8525K7479K4006L1632L5369L5323L0219L2804N0830N7332M5279M1386
$$ 2315214 2331005 2359530 2387009 2411015 2442647 2478016 2513339 2543558 2576362 2627192 2684524 2729803 2771189
-4620B771189K8719M0516N7820Q1805O5599M9018P5081P9087N8285N0716N4870M2837N1705
$$ 2771189 2799908 2840424 2898244 2980049 3045648 3094666 3169747 3248834 3307119 3357835 3412705 3455542 3507247
-4607C507247M9971O5539O4256N5003L6836J8374K8758N2139O7226L4119K7282L0946M8975
$$ 3507247 3557218 3622757 3687013 3742016 3778852 3797226 3825984 3878123 3945349 3979468 4006750 4037696 4086671
-4594D086671M9129N2330Q3225N6574L2483N802k0239j2285r102l522M328m04J699K320l647
$$ 4086671 4135800 4188130 4271355 4327929 4360412 4366214 4345975 4333690 4324588 4321066 4325394 4324990 4326689 4329009 4325362
-4579D325362J6239J3305P918L3992N8111O2410M7807O4035J05448Q8503O8551P9566Q1853
$$ 4325362 4341601 4354906 4362824 4396816 4454927 4517337 4565144 4629179 4734627 4823130 4891681 4971247 5053100
-4566E053100N5256L3730L1447N3573P5009O1834O3217P2740P6114R0681J05550J34453J62616
$$ 5053100 5108356 5142086 5173533 5227106 5302115 5363949 5427166 5499906 5576020 5666701 5772251 5906704 6069320
-4553F069320J70483J77285J66049J54764J80266J90172J71028J93679J96523J82971J67435
$$ 6069320 6239803 6417088 6583137 6737901 6918167 7108339 7279367 7473046 7669569 7852540 8019975
-4542H019975J48426J30946J31301J10477Q7348Q9674J02559J00478R5789J34945J56000J64697
$$ 8019975 8168401 8299347 8430648 8541125 8628473 8718147 8820706 8921184 9016973 9151918 9307918 9472615
-4530I472615K01138K28944K40288K43792K36870K44262K52319K82101K60658K34947K27215
$$ 9472615 9673753 9902697 10142985 10386777 10623647 10867909 11120228 11402329 11662987 11897934 12125149
-4519A2125149K25352J92789J47165J17685P7505M1458J2210o016P248R460K2498M4723Q3232
$$ 12125149 12350501 12543290 12690455 12808140 12885645 12927103 12939313 12933297 12940545 12950005 12972503 13017226 13100458
-4506A3100458J19219J46534J94363K34782K87449L23721L24501L55098L71910L98272M48548
$$ 13100458 13219677 13366211 13560574 13795356 14082805 14406526 14731027 15086125 15458035 15856307 16304855
-4495A6304855M51795M40325M75840N08554N20839N33858N44310N60116O06963O43519O68078
$$ 16304855 16756650 17196975 17672815 18181369 18702208 19236066 19780376 20340492 20947455 21590974 22259052
-4484B2259052P07496P46224P95987Q39406Q81254R58571J037439J107683J160267J202909
$$ 22259052 22966548 23712772 24508759 25348165 26229419 27187990 28225429 29333112 30493379 31696288
-4474C1696288J241230J277450J309638J364619J422830J476806J561914J670632J758761
$$ 31696288 32937518 34214968 35524606 36889225 38312055 39788861 41350775 43021407 44780168
-4465D4780168J829082J940215K094267K269859K462546K697616K956051L237884L610282
$$ 44780168 46609250 48549465 50643732 52913591 55376137 58073753 61029804 64267688 67877970
-4456F7877970M009645M469957M948432N510574O141191O885703P738554Q663757R723999
$$ 67877970 71887615 76357572 81306004 86816578 92957769 99843472 107582026 116245783 125969782
-4447A25969782J0939725J2310018J3876313J5683933J7761031K0130947K2775588K5766657
$$ 125969782 136909507 149219525 163095838 178779771 196540802 216671749 239447337 265213994
-4439B65213994K9146968L2920707L7114023M1719664M6749226N2176125N7730591O2824891
$$ 265213994 294360962 327281669 364395692 406115356 452864582 505040707 562771298 625596189
-4431F25596189O6586597O7701786O4726353N6977785M5303731L2017075J9671038R491872
$$ 625596189 692182786 759884572 824610925 881588710 926892441 958909516 978580554 988072426
-4423I88072426P25413q601000k0141639l4072174m8676887o1169001o9118305p1629081o9301144
$$ 988072426 988797839 980196839 960055200 925983026 877306139 816137138 747018833 675389752 606088608
-4414F06088608o3642111n6360363m8700437m1380055l4806147k9047424k4084471j9857366
$$ 606088608 542446497 486086134 437385697 396005642 361199495 332152071 308067600 288210234
-4406B88210234j6280051j3228816j0550094q180017o054981m114381k283762n29716J254015
$$ 288210234 271930183 258701367 248151273 239971256 233916275 229801894 227518132 226988416 228242431
-4397B28242431L083924N017336P131567R434695J1941642J4683308J7708909K1039392K4699858
$$ 228242431 231326355 236343691 243475258 252909953 264851595 279534903 297243812 318283204 342983062
-4388C42983062K8691986L3061196L7825998M3029547M8564374N4246988N9527972O3439501
$$ 342983062 371675048 404736244 442562242 485591789 534156163 588403151 647931123 711370624
-4380G11370624O4708651O2005798N4621227M3463969L0895424J9531615J0558024K844668
$$ 711370624 776079275 838085073 892706300 936170269 967065693 986597308 997155332 1000000000
-4372A000000000o582081j9678597l5131349n0257509o2489643p0862836p5459916p5269777
$$ 1000000000 993417919 973739322 938607973 888350464 825860821 754997985 679538069 604268292
-4364F04268292o9953098o1732152n3082794m5156782l8288069l2494783k7605934k3511193
$$ 604268292 534315194 472583042 419500248 374343466 336055397 303560614 275954680 252443487
-4356B52443487k0104183j7240214j4763390j2546158j0633405r333196r012242r225060r014891
$$ 252443487 232339304 215099090 200335700 187789542 177156137 167822941 158810699 149585639 140570748
-4347A40570748q243235p230457o254528n543508n234061n326442n623120n713417n431268
$$ 140570748 132327513 125097056 118842528 113299020 108064959 102738517 97115397 91401980 85970712
-4338H5970712m912356m326844l780862l290240k869364k523798k172511j848230j550664
$$ 85970712 81058356 76731512 72950650 69660410 66791046 64267248 62094737 60246507 58695843
-4329E8695843j223521q56925m08396J81071J011733K133310L279629L417538J819269j13022
$$ 58695843 57472322 56615397 56207001 56388072 57399805 59533115 62812744 66230282 68049551 67936529
-4319F7936529j040108r90142j269290l183231n493735n942814m753745l402189k407586j715130
$$ 67936529 66896421 65906279 64636989 61453758 55960023 50017209 45263464 41861275 39453689 37738559
-4309C7738559j218808q81864o53335m38495j66082J69017N90860J003907J166379O58694
$$ 37738559 36519751 35637887 34984552 34546057 34379975 34548992 35139852 36143759 37310138 37968832
-4299C7968832l86906j123480j139474p45114l09118m7228j44317o06196j315225j896679
$$ 37968832 37581926 36458446 35318972 34573858 34264740 34217512 34073195 33466999 32151774 30255095
-4289C0255095k059400j877626j569300j261749j007467q14664o67155n48610m60638m14321
$$ 30255095 28195695 26318069 24748769 23487020 22479553 21664889 20997734 20449124 19988486 19574165
-4279A9574165l43730k91297k70911k36425k12751j97390j68777j45819j47182j59944j51326
$$ 19574165 19230435 18939138 18668227 18431802 18219051 18021661 17852884 17707065 17559883 17399939 17248613
-4268A7248613j48929j51997j55265j44304j25297j25026j15413j10684j12163j14053j38009
$$ 17248613 17099684 16947687 16792422 16648118 16522821 16397795 16282382 16171698 16059535 15945482 15807473
-4257A5807473j49937j62485j27042j01723o8148j7756J1809q547r2477j61792j69940j45083
$$ 15807473 15657536 15495051 15368009 15266286 15198138 15180382 15192191 15183644 15091167 14929375 14759435 14614352
-4245A4614352j12903j18460j77950k42341k40911j86712j52203j24507r5918p9109m6693
$$ 14614352 14501449 14382989 14205039 13962698 13721787 13535075 13382872 13258365 13162447 13083338 13036645
-4234A3036645m8951l9308q920L296R079r756j0087J9113N9770R8887J04800R1422Q5060R3128
$$ 13036645 12987694 12948386 12939466 12942762 12951841 12942085 12931998 12951111 13010881 13109768 13214568 13305990 13391050 13484178
-4220A3484178J02842J38944J58751J40820J58422K05929K36336K37802K37672K36550K19459
$$ 13484178 13587020 13725964 13884715 14025535 14183957 14389886 14626222 14864024 15101696 15338246 15557705
-4209A5557705K43889K78980K80566L06188L34957L12871K19442P6010n5207j56705j92779
$$ 15557705 15801594 16080574 16361140 16667328 17002285 17315156 17534598 17610608 17555401 17398696 17205917
-4198A7205917j70097j33791j50004j46565j57287j51855q0342j6090O2802J82998L48441
$$ 17205917 17035820 16902029 16752025 16605460 16448173 16296318 16215976 16199886 16262688 16445686 16794127
-4187A6794127N63067Q21827J129849J555060K253878L304412M297611L827740J345863r51446
$$ 16794127 17357194 18179021 19308870 20863930 23117808 26422220 30719831 34547571 35893434 34941988
-4177C4941988j295124k13840P52842L60146j552790l707185m432373l707963k627160j775639
$$ 34941988 33646864 33433024 34185866 34546012 32993222 29286037 24853664 21145701 18518541 16742902
-4167A6742902j221391q58227o05867m06648k78767j96573j17180l6152K2739N7610J03111
$$ 16742902 15521511 14663284 14057417 13650769 13372002 13175429 13058249 13022097 13044836 13102446 13205557
-4156A3205557J44239J93808K14901J86594Q4455k8672p2849m5359K9647R2960J11483R5982
$$ 13205557 13349796 13543604 13758505 13945099 14029554 14000882 13928033 13882674 13912321 14005281 14116764 14212746
-4144A4212746K2644m9806m4720K1442J32539K65904M22117O02746Q35139J149421J588859
$$ 14212746 14235390 14185584 14140864 14162306 14294845 14560749 14982866 15585612 16420751 17570172 19159031
-4133A9159031K260796L244512M252026L915553J508190r05590j412136l55065O92877L93143
$$ 19159031 21419827 24664339 28916365 32831918 34340108 33434518 32022382 31667317 32360194 32753337
-4123C2753337j454040l637253m456475l807607k728242j877229j297072r03190o63803n20630
$$ 32753337 31299297 27662044 23205569 19397962 16669720 14792491 13495419 12592229 11928426 11407796
-4113A1407796l90679k68416k10777j84477j68779j43724j18649j10432j00104j09955j17744
$$ 11407796 11017117 10748701 10537924 10353447 10184668 10040944 9922295 9811863 9711759 9601804 9484060
-4102I484060j29985j17943j11470j07745r1506p9912p8627q0296n7766n6418p1649n6599
$$ 9484060 9354075 9236132 9124662 9016917 8925411 8845499 8766872 8686576 8628810 8572392 8500743 8444144
-4090H444144p0190p2060m8856n5228o2431n9896o3235n7890n4884n9619n8919n3672n7761
$$ 8444144 8373954 8301894 8253038 8197810 8135379 8075483 8012248 7954358 7899474 7839855 7780936 7727264 7669503
-4077G669503m5056m7395l9812n1442n1486n1629o3417n4362m3062k1798j6229k8789k3148
$$ 7669503 7624447 7577052 7537240 7485798 7434312 7382683 7319266 7264904 7221842 7200044 7183815 7155026 7131878
-4064G131878j8461o787K8705L0752O499j5539j3321k8444n1614l6967n1007n2276p1431j00461
$$ 7131878 7113417 7106630 7135335 7166087 7172586 7157047 7143726 7115282 7063668 7026701 6975694 6923418 6851987 6751526
-4050F751526j01533j15244j15834j23945j25013r6673p6140r1180r4010p0927o1951p9284
$$ 6751526 6649993 6534749 6418915 6294970 6169957 6073284 5997144 5905964 5811954 5741027 5679076 5599792
-4038E599792q0031o5234n2427n6358n2174n4411o7739o3161o5478o3438m7648n0881m8891
$$ 5599792 5519761 5454527 5402100 5345742 5293568 5239157 5171418 5108257 5042779 4979341 4931693 4880812 4831921
-4025D831921m7944k9651j7977l8101n5622o2604m1431l4143j2918J1748N581K5293L3861
$$ 4831921 4783977 4754326 4736349 4698248 4642626 4580022 4538591 4504448 4491530 4503278 4508859 4534152 4568013
-4012D568013M2666M3771K6992Q154n167l3651k7466l0600m8976o8194q2139r5661r6645j03374
$$ 4568013 4610679 4654450 4681442 4689596 4684429 4650778 4623312 4592712 4543736 4475542 4393403 4297742 4201097 4097723
-3998D097723j12371r7693r1344q9565q2839o8313p2004n9535m3359l4974l4782m6034k0931
$$ 4097723 3985352 3887659 3796315 3706750 3623911 3555598 3483594 3424059 3380700 3345726 3310944 3264910 3243979
-3985C243979j9566m8693o1194m9763k3651j3345k2951l3017k3527l528p84O744o924m0895
$$ 3243979 3224413 3175720 3114526 3064763 3041112 3027767 3004816 2971799 2948272 2944744 2943960 2950704 2943780 2902885
-3971B902885l0091k7879n4531m4249k8926k2302m325j4846l9909n0966k9721l1046l6341
$$ 2902885 2872794 2844915 2790384 2746135 2717209 2694907 2690582 2675736 2635827 2584861 2555140 2524094 2487753
-3958B487753l8432m2855l2270k5257j4785r864J6602K1866k392k8496l0761k8865m5025m2469
$$ 2487753 2449321 2406466 2374196 2348939 2334154 2324290 2340892 2362758 2360366 2331870 2301109 2272244 2227219 2184750
-3944B184750k7830k3345j6741j1931L214k162K3498M7213K1566J9513K3357j2001p531L6971
$$ 2184750 2156920 2133575 2116834 2104903 2108117 2105955 2129453 2176666 2198232 2217745 2241102 2229101 2221570 2258541
-3930B258541M4392L5700L2285M2870L7697M8823N9198P0275P2438R0121R0614Q7155J13670
$$ 2258541 2302933 2338633 2370918 2413788 2451485 2500308 2559506 2629781 2702219 2792340 2882954 2970109 3083779
-3917C083779J42919J57266J60511J74657K01315K29457K43206K38308K61151K74584K76214
$$ 3083779 3226698 3383964 3544475 3719132 3920447 4149904 4393110 4631418 4892569 5167153 5443367
-3906E443367K60952K16418J86290J38949Q5525L7137p467q0200j40536j89488k38186l08236
$$ 5443367 5704319 5920737 6107027 6245976 6331501 6368638 6361171 6280971 6140435 5950947 5712761 5404525
-3894E404525l09678l08173l26412l10427k71782k46361k14561j86620j54519j28636j16947
$$ 5404525 5094847 4786674 4460262 4149835 3878053 3631692 3417131 3230511 3075992 2947356 2830409
-3883B830409j12292r9797q3006m8567l3316j1975j2366l1357p629J8659L1761M1254O5289
$$ 2830409 2718117 2618320 2535314 2486747 2453431 2441456 2429090 2397733 2390104 2408763 2440524 2481778 2547067
-3870B547067P2368Q5544R1932J14328J50556J60459J80121J88190K04504K49673K85756K73988
$$ 2547067 2619435 2704979 2796911 2911239 3061795 3222254 3402375 3590565 3795069 4044742 4330498 4604486
-3858D604486K92990K95780K81395K24340J50993J10274Q9702N5870j7063r7399j62869k10748
$$ 4604486 4897476 5193256 5474651 5698991 5849984 5960258 6049960 6105830 6088767 5991368 5828499 5617751
-3846E617751k84299l36426l24697l28996l43171l27226k87902k51743k33314k05732j75804
$$ 5617751 5333452 4997026 4672329 4343333 4000162 3672936 3385034 3133291 2899977 2694245 2518441
-3835B518441j47606j31210j11978q6707q3336r0064p5443o1282n7275o2948o9378o3184m6648
$$ 2518441 2370835 2239625 2127647 2040940 1957604 1867540 1792097 1730815 1673540 1610592 1541214 1478030 1431382
-3822A431382l1459j2800k2595m1390k9033k3737l1314l7351k2583k8732k2194P260J996k9735
$$ 1431382 1399923 1387123 1364528 1323138 1294105 1270368 1239054 1201703 1179120 1150388 1128194 1135454 1137450 1107715
-3808A107715k2455M941L225r200R07R10P960q54p824j1896M584K643j3444l1600l6806j9659
$$ 1107715 1085260 1090201 1093426 1084226 1085133 1086043 1094003 1093149 1085325 1073429 1078013 1080656 1067212 1035612 998806 979147
-3792I79147j505k100k0787l3302k9360j3273N971L465m658R61n607p550j549N651m011p142
$$ 979147 977642 975542 954755 921453 892093 878820 884791 888256 883598 884559 878952 871402 869853 875504 871493 864351
-3776H64351l060M057J907J525n225n293P60k533k1519j5809j532K492j0098j4274j8019j1217
$$ 864351 861291 865348 867255 868780 863555 858262 859022 856489 834970 819161 817629 820121 810023 795749 777730 766513
-3760G66513k1188j5552j1737M911K4804M496j0054j6401j5798j1188k0086j2639m173J637
$$ 766513 745325 729773 718036 722947 747751 752247 742193 725792 709994 698806 678720 666081 661908 663545
-3746F63545J5842J8491r31m596q951o79j3607j6886p036l128Q587J0613P588P100j6501k3808
$$ 663545 679387 697878 696947 692351 683400 682721 669114 652228 645192 642064 650651 661264 668852 675952 659451 635643
-3730F35643m883j533k0408J053J2024J3222l399o007n806O95j2410k6165N16Q543L679N527
$$ 635643 630760 629227 608819 609872 621896 635118 631719 625712 619906 620601 608191 582026 582542 591085 594764 600291
-3714F00291R804O505Q823N278l787j6967j0697l704j1995j4653j0651j1624J176k88R59M413
$$ 600291 610095 616600 625423 630701 626914 609947 599250 595546 583551 568898 558247 546623 547799 547511 548470 552883
-3698E52883n454j3032k0408p727J0829J0061N915R041j484N388o26o201L790p147k6884K08
$$ 552883 547429 534397 513989 506262 517091 527152 533067 542108 540624 546012 545386 539185 542975 535828 508944 509152
-3682E09152J552N593Q417N172R59K347Q403q951r065j015R657m602r191J9156K2158R175
$$ 509152 510704 516297 524714 529886 530845 533192 541595 532644 523579 522564 532221 527619 518428 537584 559742 568917
-3666E68917l013j0230O286K2757J1263o735j2581k782R618N715r287j3052l270J7770J3070
$$ 568917 565904 555674 561960 584717 595980 589245 576664 573882 583500 589215 579928 566876 563606 581376 594446
-3651E94446j3726k3488j1169J1107J791j0059j8283j5008j8724r483m971r769J21k680Q798
$$ 594446 580720 557232 546063 557170 558961 548902 530619 515611 496887 487404 482433 472664 472785 470105 478903
-3636D78903p74j3257n142J060J5968J0439L239J965p17J1924p116k9245j4897Q6J6139K0580
$$ 478903 478129 464872 459730 460790 476758 487197 490436 492401 491684 503608 496492 467247 452350 452436 468575 489155
-3620D89155L79o051q635L201J1956Q847M803J1034J6541K1425K6579K9596J1039l169p910
$$ 489155 489534 483483 474848 478049 490005 498852 503655 514689 531230 552655 579234 608830 619869 616700 608790
-3605F08790o102K289J3646j2147k3697n267j1799l4731k1128J588N922k141k1374j8067r338
$$ 608790 602688 604977 618623 606476 582779 577512 565713 530982 509854 511442 517364 515223 493849 475782 466444
-3590D66444K66M328O55j5136j702Q195j659j2830j4409p22M392J4888J2529O988O228K2882
$$ 466444 466710 471038 471693 456557 454855 463050 461391 448561 434152 433430 437822 452710 465239 472227 478455 501337
-3574E01337l736j9914j5791j2027M258K8832J3922j0948j1522j6222j1383q387j0166L900
$$ 501337 497601 477687 461896 449869 454127 482959 496881 485933 474411 458189 446806 438419 428253 432153
-3560D32153J8851K5708P282j3692J2187J1581J656J1933k771k4607q856j2572j2016J0128
$$ 432153 451004 476712 483994 470302 482489 494070 495726 507659 504888 480281 471425 458853 446837 456965
-3546D56965J6695O348L500O28K383q660j9194m159r620M818N541M406l223p380k6804j6684
$$ 456965 473660 480008 483508 484136 486519 477859 458665 454506 444886 449704 455245 459651 456428 449048 422244 405560
-3530D05560m403q931L041N465M741N670K422N844j2331j3554m155O877K2528J6410J8238
$$ 405560 401157 392226 395267 400732 405473 411143 413565 419409 407078 393524 389369 396246 418774 435184 453422
-3515D53422J9668M103k0299N595J3389J7988J2568j2817j6951L166L625k1476k2117m765
$$ 453422 473090 477193 456894 462489 475878 493866 506434 493617 476666 479832 483457 461981 439864 435099
-3501D35099j503k3999m167M13P094J1240n204j0826Q819J1296j4374j2713J5658K9524M691
$$ 435099 433596 409597 405430 405843 412937 424177 418973 408147 416966 428262 413888 401175 416833 446357 451048
-3486D51048j0709j0817j9164q319r761j3944Q196J4580R600l191j2806n312n420j0924n300
$$ 451048 440339 429522 410358 402039 392278 378334 386530 401110 410710 407519 394713 389401 383981 373057 367757
-3471C67757J0701L30k351J4793q20K3n720j2732p370q54M216P988Q798J720o80Q68p957L768
$$ 367757 378458 378788 376437 391230 390410 390433 384713 371981 364611 363757 367973 375961 384759 386479 385799 386667 378710 382478
-3453C82478p133j7841l0705k7168j7443J8114J423j0098R02K190Q114L184R181J2321R86
$$ 382478 375345 357504 326799 299631 282188 300302 301725 291627 292529 294719 302833 306017 315198 327519 328505
-3438C28505J6482J2648n26J447o71j1251j2696j1534M481J2889J3755q167k4613k5659j7024
$$ 328505 344987 357635 357109 358556 357885 346634 333938 322404 326885 339774 353529 345362 320749 295090 278066
-3423B78066j7408L130R125J394J3191J9335O348Q785J0262o157j656Q054l14o830j7435k5923
$$ 278066 260658 263788 272913 274307 287498 306833 313181 321966 332228 326071 324415 332469 332155 325325 307890 281967
-3407B81967k821Pj0770j8564k143P16Q083Q596O796l165J0100J1155m065j2363K205R926
$$ 281967 279146 279153 268383 249819 247676 248392 256475 265071 271867 268702 278802 289957 285892 273529 275734 285660
-3391B85660Q648O050n054k4707j0466Q373N580j728r033P077k887n889L419j2862j0066N207
$$ 285660 294308 300358 295304 270597 260131 268504 274084 272356 263323 270400 267513 261624 265043 252181 242115 247322
-3375B47322J5827P737o177N345q227j1079n345p502L805L252j930O762m01k665J0298Q878
$$ 247322 263149 270886 264709 270054 261827 250748 245403 237901 241706 244958 243028 249790 249389 246724 257022 265900
-3359B65900o237k1086j3859L306M350J6085J1685K450M617j4538l2146k5247J849Q46J0653
$$ 265900 259663 238577 224718 228024 232374 248459 260144 262594 267211 252673 220527 195280 197129 197975 208628
-3344B08628J2581R746J1362J5353k014j552j8165j6013P156M3N059l919L866J8479J8358
$$ 208628 221209 230955 242317 257670 255656 254104 235939 219926 227082 227125 232184 228265 232131 250610 268968
-3329B68968l159q126n62J0253J8776J5297O038n292j2140j7325j1075j788o846k763J4049
$$ 268968 265809 257683 257121 267374 286150 301447 307485 302193 290053 272728 261653 259865 253019 250256 264305
-3314B64305L32j5743k0507j9433j3869J529K0962J7138j8791j433R097L332j2666j1638J011
$$ 264305 264637 248894 228387 208954 195085 196614 217576 234714 215923 214490 223587 226919 214253 202615 203626
-3299B03626L867J1866Q587K120P876J3830J0829n458j8095j72j8664n531o013k2767j927
$$ 203626 207493 219359 227946 230066 237942 251772 262601 257143 239048 238876 220212 214681 208668 185901 183974
-3284A83974N815O48L7229L8519J9456m101j5661j4551j8226p230M031J0045K8218J1304l32
$$ 183974 189789 190437 227666 266185 285641 281540 265879 251328 233102 225872 229903 239948 268166 279470 279138
-3269B79138l855O257j0480j3847j7423k824J2298O068l386l942n3r115r107k4512o445J0670
$$ 279138 275283 281540 271060 257213 239790 236966 249264 255332 251946 248004 247951 238836 229729 205217 198772 209442
-3253B09442N69P028m835l336M064K898n546j2690k776k155m442J8864K7697N909n275o172
$$ 209442 210011 217039 212204 208868 212932 215830 210284 197594 194818 192663 188221 207085 234782 240691 235416 229244
-3237B29244j1888N701K549J772q227j4684m360J1912K1630M223k467n42n017R591J6355J1457
$$ 229244 217356 223057 225606 227378 219151 204467 200107 212019 233649 237872 235405 234863 229846 239437 255792 267249
-3221B67249m673N835J4084r900k9788k3229k5766q015J3964K0358l813m913N671j1745M220
$$ 267249 262576 268411 282495 272595 242807 219578 193812 185797 199761 220119 216306 211393 217064 205319 209539
-3206B09539j0144Q18J0178M776J3474K4284m442j4103j1843j7288q340N174K951J8306K2082
$$ 209539 199395 200213 210391 215167 228641 252925 248483 234380 222537 205249 196909 202083 205034 223340 245422
-3191B45422O906k0305j1326P681o946O251j1210j8051M628K1539R269m308J262j1317J457
$$ 245422 252328 232023 220697 228378 221432 227683 216473 198422 203050 224589 233858 229550 230812 219495 220952
-3176B20952J2528Q930O51j2315j6801n489O481L442j752j2424j1139L281Q507J8849J9496
$$ 220952 233480 242410 243061 230746 213945 208456 214937 218379 216627 204203 193064 196345 204852 223701 243197
-3161B43197M108j1851j1474j1717q624L357J2893P273p740k7097j3267J9673L4207J4276
$$ 243197 247305 235454 223980 212263 203639 206996 219889 227162 219422 192325 179058 198731 232938 247214
-3147B47214L812o233j3711k1944p714L072L213J3455O279j0320j1662L48J62J8921J1143
$$ 247214 251026 244793 231082 209138 201424 204496 207709 221164 227443 217123 205461 205809 205971 224892 236035
-3132B36035K151P073J1829R45j2919j2271j2421n194l167L911R341Q328Q016R108K204O43
$$ 236035 238186 245259 257088 258033 245114 232843 220422 215228 212061 215972 225313 233641 241657 250765 252969 253612
-3116B53612j2026r361q042J482K383K133J6036o017n436l29j2044j2074J312p820j5139M254
$$ 253612 241586 232225 224183 225665 228048 230181 246217 240200 234764 234435 222391 210317 211629 203809 188670 192924
-3100A92924J5570O612J5002J020m749p035r45J7867J6372P001P275O267l595j8208r827q590
$$ 192924 208494 215106 230108 231128 226379 219344 218399 236266 252638 259639 266914 273181 269586 251378 241551 232961
-3084B32961j8980K834K6493J4743Q558r610l085O453j0544j8016Q743O107K28R990R157R584
$$ 232961 213981 216815 243308 258051 266609 256999 253914 260367 249823 231807 240550 246657 246885 256875 266032 275616
-3068B75616l567j4927m865J059L144m454o826r33J6304l913l848J2757j289k230K520n148
$$ 275616 272049 257122 252257 253316 256460 252006 245180 244247 260551 256638 252790 265547 264258 262028 264548 259400
-3052B59400m512K0270O677M16p384k0237o099P695n668j0536J3112K8189J3787r450k638
$$ 259400 254888 275158 281835 282251 274867 254630 248531 256226 250558 240022 253134 281323 295110 285660 283022
-3037B83022o471m135J0302j6406j42K6166J7236j4674J82Q040M173J1086J0209P324O725
$$ 283022 276551 272416 282718 266312 266170 292336 309572 294898 295080 303120 307293 318379 328588 335912 342637
-3022C42637q52J2620J8370j284j4499L21K0228J733m420K2626K7857m765k293K1825O346
$$ 342637 341785 354405 372775 371491 356992 357313 377541 379274 374854 397480 425337 420572 418279 440104 446450
-3007D46450k0957k8836j0567j9854r556J2825j954m749P920M424Q653J8191M180j3576K053
$$ 446450 425493 396657 386090 366236 356680 369505 367551 362802 370722 375146 383799 401990 406170 392594 394647
-2992C94647l682j0414j7699p250O970j1283r352K907l320Q620Q359J0681J7273K5174L1654
$$ 394647 390965 380551 362852 355602 362572 351289 341937 344844 341524 350144 358503 369184 386457 411631 443285
-2977D43285J0112j289J1077J0730J8656J6212m594p698r34m275J273M654L575L6130M2194
$$ 443285 453397 452108 463185 473915 492571 508783 504189 496491 495557 491282 492555 497209 500784 536914 579108
-2962E79108J2358P776K8417M2340J6288o384r083k1181k6217k6779l2763p926j390p619k2641
$$ 579108 591466 599242 627659 669999 686287 679903 670820 649639 623422 596643 563880 555954 554564 546945 524304
-2947E24304j3828J931L954r392J1026P792k0256j6726J4167J5283j5628l1321j0326N69n254
$$ 524304 510476 512407 516361 506969 517995 525787 505531 488805 502972 518255 502627 471306 460980 461549 456295
-2932D56295N8P620J9916Q432j778J0569O894k044k2307j9006l428M501J2607j261l269l809
$$ 456295 456353 463973 483889 492321 490543 501112 508006 505962 483655 464649 461221 465722 478329 477068 473799 469990
-2916D69990k069Q752K6168K2630q303j6832k3078P85K0427J7325J7607p46l762J7328L2896
$$ 469990 467921 476673 502841 525471 517168 500336 477258 478043 498470 515795 533402 532656 528894 546222 579118
-2901E79118L1841K9914J3662r755j5618r81p745L039J8355J588j1710j9686k5189k2658j6862
$$ 579118 610959 640873 654535 644780 629162 628181 620436 623475 641830 643418 631708 612022 586833 564175 547313
-2886E47313L671m925r92O273R436J6975J2362n890j1824O462o842k4740j1524J180p323K635
$$ 547313 550984 546059 545067 551340 560776 577751 590113 584223 572399 578861 572019 547279 535755 536935 529612 532247
-2870E32247J0743O753J2701k659j0460j6006k8204k3389j4506R620K2454K6197J0104j2508
$$ 532247 542990 549743 562444 559785 549325 533319 505115 481726 467220 476840 499294 525491 535595 523087
-2856E23087k444J285o002q351K972K687o056k7131l276J4282m111N320J8376k114K922m601
$$ 523087 520643 521928 515926 507575 510547 513234 507178 480047 476771 491053 486942 492262 510638 508524 511446 506845
-2840E06845j0900j1289M213M958l957K115O569O592r006o172l906O036r63k839m020j441
$$ 506845 495945 484656 488869 493827 489870 491985 498554 505146 496140 489968 486062 492098 491135 488296 484276 482835
-2824D82835n353j4143o562J0322K7560N856r812j3439p006q145j7196o684j037L722m25q450
$$ 482835 477482 463339 456777 467099 494659 500515 490703 477264 470258 462113 444917 438233 437196 440918 440493 432043
-2808D32043N546m543n726K56L904Q761l559j3461p210j0993q666R013J2630n042P034l624
$$ 432043 437589 433046 427320 427576 431480 440241 436682 423221 416011 405018 396352 405365 417995 412953 419987 416363
-2792D16363l2210j5739J1636l859p291p807j0369R164O162o490p152K962R052r49j4605j7742
$$ 416363 384153 368414 380050 376191 368900 361093 350724 359888 366050 359560 352408 355370 364422 363473 348868 331126
-2776C31126p526J662j3577j8200j0441J3914J8752j4922p826J5913J2763k3976j1247J5174
$$ 331126 323600 325262 311685 293485 283044 296958 315710 300788 292962 308875 321638 297662 286415 301589
-2762C01589J2949o047j0992K894M356O186N225Q687K45n680l254n351j3180l208J998Q286
$$ 301589 314538 308491 297499 300393 304749 310935 316160 324847 325092 319412 316158 310807 297627 294419 296417 304703
-2746C04703q960k022n877k6126p547k382P108L745O053M687K979m811k1368j5270O93j0753
$$ 304703 295743 293721 287844 261718 254171 251789 258897 262642 268695 273382 276361 271550 250182 234912 235605 224852
-2730B24852n918J1542k35k1034j1423j0842N92K017K876Q547J1265P294K282P521j649n090
$$ 224852 218934 230476 230241 209207 197784 186942 187534 189551 192427 200974 212239 219533 221815 229336 227687 222597
-2714B22597L862l446j5349m74J0146J730J4674K0789j0598k3721q902p896L65j15r580k8915
$$ 222597 226459 223013 207664 207190 217336 219066 233740 254529 243931 220210 211308 203412 203777 203662 194082 165167
-2698A65167p777O431L22J0498J2488l858K499J4472n023M43M731J2537q603j9622q50q720
$$ 165167 157390 163821 164143 174641 187129 183271 185770 200242 195219 195662 200393 212930 204327 184705 183855 175135
-2682A75135m330L100J748n865r951r658l637J436p065j3187M596L3431J7093R16Q031J1104
$$ 175135 170805 173905 175653 169788 159837 150179 146542 147978 140913 127726 132322 165753 182846 183762 191793 202897
-2666B02897j0172K442j4143j3499j3996j1553k567j1939o15J5183j5101j757J6244o49Q888
$$ 202897 192725 195167 181024 167525 153529 141976 139409 127470 126855 142038 126937 125180 141424 140775 149663
-2651A49663P883P807n396q965l065k2137j0453L360O687J6906J9169l919k0101j6923n061
$$ 149663 157546 165353 159957 150992 147927 125790 115337 118697 125384 142290 161459 157540 137439 120516 115455
-2636A15455j542L586J0302K979M585P764N277N723M034r770j0383j984m266k347K1709O900
$$ 115455 113913 117499 127801 130780 135365 143129 148406 154129 158163 148393 138010 136026 131760 129413 151122 158022
-2620A58022n544J2039l458j3357j4790k665P307p022n574j3779j469L220R337J1427O237
$$ 158022 152478 164517 161059 147702 132912 130247 137554 130532 124958 111179 109710 112930 122267 133694 139931
-2605A39931K263O834R414l585P901j1515k511R135n772m939q558P283M215j1895j8033p988
$$ 139931 142194 149028 158442 154857 162758 151243 148732 157867 152095 147156 138598 145881 150096 138201 120168 112180
-2589A12180O019k739M403P538K242J0075J3726j35l900j4767k9764o902Q287J5340J8218
$$ 112180 118199 115460 119863 127401 129643 139718 153444 153309 149409 134642 104878 97976 106263 121603 139821
-2574A39821N617P334J1125J27o461j427q42N101J1594l765q652r116p226L035K3046q465
$$ 139821 145438 152772 163897 164024 157563 156136 155294 160395 171989 168224 159572 150456 143230 146265 169311 160846
-2558A60846j4151r849o635M394O340K0375M953M796Q032p947k4610j6680m877o36L976N372
$$ 160846 146695 136846 130211 134605 140945 161320 166273 171069 179101 171154 146544 129864 124987 124351 128327 133699
-2542A33699q945k2047j1205o912K936J0529R354J3468L898k701j0889J764K182k587k0595
$$ 133699 124754 102707 91502 84590 87526 98055 107409 120877 124775 122074 111185 112949 115131 112544 91949
-2527I1949k6488j7339P147L4761L1767N12p002j0021M187O080Q892P321J135j6130K204Q41
$$ 91949 65461 48122 55269 90030 121797 122309 115307 105286 109473 115553 124445 131766 132901 116771 118975 119816
-2511A19816l838n056j6560J0621N274q917p633J3034J3923p12m841o483R496j975m688J454
$$ 119816 115978 110922 94362 104983 110257 101340 93707 106741 120664 119952 115111 108628 118124 116149 111461 112915
-2495A12915j636P292l323K178m737j3114m279K647J4595m78l245R227J3048l025Q996P119
$$ 112915 111279 118571 115248 117426 112689 99575 95296 97943 112538 112060 108815 118042 131090 128065 137061 144180
-2479A44180k3526m258K4908N743m635Q217M721j3732j1342l633l453o887Q924k915j2235
$$ 144180 120654 116396 141304 147047 142412 150629 155350 141618 130276 126643 123190 116303 125227 122312 110077
-2464A10077q491q344k643m283J1519J2979l703r042l583o415j3900j947j408J1226Q299K493
$$ 110077 101586 93242 90599 86316 97835 110814 107111 98069 94486 88071 74171 72224 70816 82042 90341 92834
-2448I2834M944J132K0099l38k1810l44j463M073J9298O286m111J1872L407l2049r623o796
$$ 92834 97778 98910 119009 118671 96861 96517 95054 99127 118425 124711 120600 132472 135879 103830 94207 87411
-2432H7411j1814l312n172J2944J8812K2394J3179P127J3619n878k1925j4382J101P666J2150
$$ 87411 75597 72285 67113 80057 98869 121263 134442 141569 155188 149310 127385 113003 114104 121770 133920
-2417A33920r967j9244j353l615m944P264N051l495N872J6920j6916j6944J9247J3742l668
$$ 133920 123953 104709 103356 99741 94797 102061 107112 103617 109489 126409 109493 92549 111796 125538 121870
-2402A21870m703O34N264J2634j0519k6276j8533L321R575M407n070j4713p734p99K584j3359
$$ 121870 117167 117801 123065 135699 125180 98904 80371 83692 93267 97674 92604 77891 70157 69358 71942 58583
-2386E8583m26O900L193j5401L790K2354J9170K1873J1084q250j5562j2795j4132j6653R1
$$ 58583 58157 65057 68250 52849 56639 78993 98163 120036 131120 122870 107308 94513 80381 63728 63819
-2371F3819J7946M755N502K103O174l285o228q575O728J8927Q637N705R117J436o141j1858
$$ 63819 81765 86520 92022 94125 100299 97014 90786 82211 88939 107866 116503 122208 131325 132761 126620 114762
-2355A14762k7393j4726j3866N362J8001J5780p308p492N541P06q694j70K0397J9587K386
$$ 114762 87369 72643 58777 64139 82140 97920 90612 83120 88661 89367 80673 80503 100900 120487 122873
-2340A22873p489l398j190l835k66k596q20N918J816P71q090p261O892K1229P778j4486j73
$$ 122873 115384 111986 110796 106961 106695 104099 103279 109197 111013 111784 103694 96433 103325 124554 132332 117846 117673
-2323A17673p082j1934o371J6405J0248j0129q217l344N856N669Q905K1097K061k7162j4098
$$ 117673 110591 98657 92286 108691 118939 108810 100593 97249 103105 108774 117679 138776 140837 113675 99577
-2308I9577K125J727j1725k1511k0800M41J2788J1714K1422K1862m196R516J4800n664m539
$$ 99577 101702 103429 91704 70193 49393 49834 62622 74336 95758 117620 113424 122940 137740 132076 127537
-2293A27537n895j391J093j6082r645j6341n848N32N42J2765M313o247r695L193J1589o373
$$ 127537 121642 120251 121344 105262 95617 79276 73428 73960 74502 87267 91580 85333 75638 78831 90420 84047
-2277H4047l0110J0077K0456R497O30j0773k1527Q088K7730k774K944l939q52O680q323O509
$$ 84047 53937 64014 84470 93967 94597 83824 62297 70385 98115 95341 98285 94346 93494 100174 91851 98360
-2261I8360J9704K2433N012j4244j8005l034k6466j2359J7863J4227n976L037J1938j5674
$$ 98360 118064 140497 145509 131265 113260 110226 83760 71401 89264 103491 97515 100552 112490 96816
-2247I6816k4810o407p167m575j331j2385K927J5132Q260j984K005Q064J2855L765j947J575
$$ 96816 72006 65599 58432 53857 52526 40141 43068 58200 66460 64476 66481 74545 87400 91165 89218 90793
-2231I0793r898K283Q617J697r633n824K5996J5893r726j9611j4594P562M366o926n56J216
$$ 90793 80895 83178 91795 93492 83859 78035 104031 119924 110198 90587 75993 83555 87921 80995 80439 81655
-2215H1655P850J4481J7517J8208K760j2645j5725j1797q034j8372k7707q85Q755J5276Q921
$$ 81655 89505 103986 121503 139711 142471 129826 114101 102304 94270 75898 48191 47306 56061 71337 80258
-2200H0258j5725j3782J5020N698k289J2447J1503K5461J6389o235j6053J1934K276k1944
$$ 80258 64533 50751 65771 71469 69180 81627 93130 118591 134980 128745 112692 124626 126902 104958
-2186A04958j5327r196J0562J7104k723M116M662j3188j863n475N488L245J4860J4353q211
$$ 104958 89631 80435 90997 108101 105378 109494 114156 100968 99105 93630 99118 102363 117223 131576 123365
-2171A23365l085m434k0245j3056J6876p807j9943J848J1539J9074J0747j0783l372Q486k0013
$$ 123365 120280 115846 95601 82545 99421 91614 71671 73519 85058 104132 114879 104096 100724 109210 89197
-2156H9197j0056K2076P760n950K962L837m705q47L538n258j525o685r692l498K201o381M717
$$ 89197 79141 101217 108977 103027 105989 109826 105121 104274 107812 102554 101029 94344 84652 81154 83355 76974 81691
-2139H1691J390L82j847q360k1303l726J5377J5824O953n569J0023J4831K552j3683p104K8082
$$ 81691 83081 83463 81616 73256 51953 48227 63604 79428 86381 80812 90835 105666 108218 94535 87431 115513
-2123A15513K4429j6580k5923L46k730M438P543M017r485j8071p519J0191K1923j98j9861
$$ 115513 139942 123362 97439 97785 95055 99493 107036 111053 101568 83497 75978 86169 108092 107894 88033
-2108H8033j4809r947L979K7548K4855L612K160j974j8448j1133n661l566N433J3149J2612
$$ 88033 73224 63277 67256 94804 119659 123271 125431 123457 105009 93876 88215 84649 90082 103231 115843
-2093A15843j0302j4344J604k649p169R621p737l421L282j6594m079J0158J638K827o59k228
$$ 115843 105541 91197 92801 90152 82983 92604 84867 81446 84728 68134 64055 74213 75851 78678 78019 75791
-2077G5791j4654j7285M217o21j9472k957R439L975K1503J0218R569j2781k0137K52L568M760
$$ 75791 61137 43852 48069 47448 27976 25019 34458 38433 59936 70154 79723 66942 46805 47057 50625 55385
-2061E5385j587r684K0425J9951N519L60q059k177O083J1434J319J570J775n819N973r607
$$ 55385 53798 44114 64539 84490 90009 90369 82310 80133 86216 97650 98969 100539 102314 96495 102468 92861
-2045I2861k64j141l128j510m915N982K4186J8304j742r897j2560r377o637j0814j0529P725
$$ 92861 92597 91456 88328 86818 81903 87885 112071 130375 128633 118736 106176 96799 90162 79348 68819 76544
-2029G6544J2880o790j3038N962L95o825J309o505q945L196J7871L98j6114r194J5275P352
$$ 76544 89424 82634 69596 75558 75953 69128 70437 63932 54987 58183 76054 76452 60338 51144 66419 73771
-2013G3771o826R005J4438K419o413j556j0288r075N696P758j6132o426R888l656k560j2971
$$ 73771 66945 75950 90388 92807 86394 84838 74550 65475 71171 78929 62797 56371 66259 62603 60043 47072
-1997D7072L022K4852Q537j8752N22J3987K2087O617j2861p918j8367j3691J6193R874Q46
$$ 47072 50094 74946 83483 64731 65253 79240 101327 107944 95083 87165 68798 55107 71300 81174 82020
-1982H2020O315J0728m138r312k652O280L688p156n752n655R734J1523J5598J0496O417J709
$$ 82020 88335 99063 94925 85613 82961 89241 92929 85773 80021 74366 84100 95623 111221 121717 128134 129843
-1966A29843k6422p106J0625k625j0409L69R812M952j500j0512q087j2026j1225r872q191
$$ 129843 103421 96315 106940 104315 93906 94275 104087 109039 107539 97027 88940 76914 65689 55817 47626
-1951D7626j989K4245J5198J070k720k776J0057R568K3073Q907k636K038m060r715m4O300
$$ 47626 45637 69882 85080 86150 83430 80654 90711 100279 123352 132259 129623 131661 127601 117886 117842 124142
-1935A24142l407q404o468J2717K3583k566k5685j8836r329o501j3379j4981J1552K5551Q547
$$ 124142 120735 112331 105863 118580 142163 139597 113912 95076 85747 79246 65867 50886 62438 87989 96536
-1920I6536j749j5985j2273m2J4138R245J7452K508p350q215n126P990R092M936k9332l2682
$$ 96536 94787 78802 66529 66487 80625 89870 107322 109830 102480 94265 89139 97129 106221 111157 81825 49143
-1904D9143r292P475J1884J2095q587K596N848K672O926J0963J465r757q64j771P88J1935
$$ 49143 39851 47326 59210 71305 62718 65314 71162 73834 80760 91723 93188 83431 82567 80796 81584 93519
-1888I3519J4489j4061k0965o67k99j0022r940l191r706n986Q056N080J1744O846k154K417
$$ 93519 108008 93947 72982 72315 72016 61994 52054 48863 39157 33171 41227 46307 58051 64897 62743 65160
-1872F5160k438j400r60j981L076k52N705K5916K6734O593j4583l27j838J0704Q312L478j0909
$$ 65160 62722 61322 60362 58381 61457 61205 66910 92826 119560 126153 111570 111243 109405 120109 128421 131899 120990
-1855A20990j9160k504n090j0728J184p90p265N387L761o349l752j0200j5287J104N131n208
$$ 120990 101830 99326 94236 83508 84692 83902 76637 82024 85785 79436 75684 65484 50197 51301 56432 51224
-1839E1224Q616m058k4041L098K511j110J280o94N321J2681J9394Q695J113j5983j6259N916
$$ 51224 59840 55782 31741 34839 37350 36240 37520 36826 42147 54828 74222 82917 84030 68047 51788 57704
-1823E7704K787n166Q905K0485P087m378p927J0783J0680N224M665R103L455m727j2857j0990
$$ 57704 60491 55325 64230 84715 91802 87424 79497 90280 100960 106184 110849 119952 123407 118680 105823 94833
-1807I4833J2606Q460N676R07p557j2698j4869n721J0272J72n298k3901r001K5471K4155J418
$$ 94833 107439 115899 121575 122482 114925 102227 87358 81637 91909 92081 86783 62882 53881 79352 103507 104925
-1791A04925k289r039k0564j3256j1557m552o45O612J7368p082j882J9914J969j2691p129
$$ 104925 102636 93597 73033 59777 48220 43668 43023 49635 67003 59921 58039 77953 79922 67231 60102
-1776F0102p76l960k448J431N141K5024K1043k353j5289J2387R895j630M678n411J597r340
$$ 60102 59326 55366 52918 54349 59490 84514 105557 103204 87915 100302 110197 108567 113245 107834 109431 100091
-1760A00091k1363k4281j4708r435J2388Q325J6021K005o276Q619K3896J3189p395p059J082
$$ 100091 78728 54447 39739 30304 42692 51017 67038 69043 62767 71386 95282 108471 101076 94017 95099
-1745I5099j361k2995o878J2954J1994n242k2984j6852O094q81J6027J0348k761n196j8914
$$ 95099 93738 70743 63865 76819 88813 83571 60587 43735 49829 48948 64975 75323 72562 67366 48452
-1730D8452j3077L0600L1979L219M26K522J860n868q146L277J564l961m830n325o960Q122
$$ 48452 35375 65975 97954 101173 101599 104121 105981 100113 91967 95244 96808 92847 88017 82692 75732 83854
-1714H3854K574n663j1223l726J5106R28n025J0294J4100p210K248J176L903j1836r260n549
$$ 83854 86428 80765 69542 65816 80922 81850 76825 87119 101219 94009 96257 97433 101336 89500 80240 74691
-1698G4691J774k215j5985K302J4099J0834Q052k998k2475l123N309m343L494J1406J6193
$$ 74691 76465 74250 58265 60567 74666 85500 93552 90554 68079 64956 70265 65922 69416 80822 97015
-1683I7015K3911K1849m280p599j0078n037j2556k1781j7609l737l59m954K1770J3055n258
$$ 97015 120926 142775 138495 130896 120818 115781 103225 81444 63835 60098 59739 54785 76555 89610 84352
-1668H4352O649m956j6511m018O812J9373j2901l7794j772J8236M093J258l758j499j2396
$$ 84352 91001 86045 69534 65516 72328 91701 78800 41006 39234 57470 61563 62821 59063 57564 45168
-1653D5168l647J74N204J5870K3641K927o744j9773k9441j2231J7253K6484k035N692K0658
$$ 45168 41521 41695 46899 62769 86410 89337 82593 62820 33379 21148 38401 64885 62850 68542 89200
-1638H9200J1368J618m080k6048j2991J1441K265k7887n227Q431K804J1299J3058k772j8262
$$ 89200 100568 102186 98106 72058 59067 70508 72773 44886 39659 48090 50894 62193 75251 72479 54217
-1623E4217M33J1612N515J8j7379J965Q37o240R750J1285Q992M006j3169L876Q163m367p186
$$ 54217 54650 66262 71777 71795 54416 56381 57218 50978 60728 72013 81005 85011 71842 75718 83881 79514 72328
-1606G2328J560j0322j7457Q52M056N641J4942j082L76J4159o62j3172K523R642J572j1805
$$ 72328 73888 63566 46109 46961 51017 56658 71600 70518 70894 85053 84391 71219 73742 83384 84956 73151
-1590G3151r701k1420j9679K746O730M367P261J6852K8868O045j1312J7152J0705j9064j1673
$$ 73151 63450 42030 22351 25097 31827 36194 43455 60307 89175 95220 83908 101060 111765 92701 81028
-1575H1028q14J4015J0742k580j9751j8248j7820j3583N237O89J588K919O134j5941k484J3230
$$ 81028 80214 94229 104971 102391 82640 64392 46572 32989 38226 38915 40503 43422 49556 33615 31131 44361
-1559D4361J8042M210l486l995j9895q897J0383J3315J925R898J4806Q09J3849M761k608K517
$$ 44361 62403 66613 63127 59132 39237 30340 40723 54038 55963 65861 80667 81476 95325 100086 97478 99995
-1543I9995n055j1321J602N618l89p070j6231q805K3457o336j5976n821J5158M157J3179K0105
$$ 99995 94940 83619 85221 90839 90450 83380 67149 58344 81801 75465 59489 53668 68826 72983 86162 106267
-1527A06267m50m411R314J1013L977J1901J7507k0269k3905k1044k1492m295J5355J3275O006
$$ 106267 105817 101406 110720 121733 125710 137611 155118 134849 110944 89900 68408 64113 79468 92743 98749
-1512I8749K1520L1775j0425k8326j6298j4707P895L410n143j495O448Q668j0803k3664j8418
$$ 98749 120269 152044 141619 113293 96995 82288 90183 93593 88450 86955 93403 102071 91268 67604 49186
-1497D9186j3606L037J5245L6586J5291j5976j3463j8432L731r697j6221j6658J6002K1962
$$ 49186 35580 38617 53862 90448 105739 89763 76300 57868 61599 51902 35681 19023 35025 56987
-1483E6987j207m89N224n271J0698J0123l030J7187q775j4200K399J3577J3985j9944l1514
$$ 56987 55780 55291 60515 55244 65942 76065 73035 90222 81447 67247 69646 83223 97208 77264 45750
-1468D5750j2602N814K1M438P925O542P347N033N832j5504J055L60j1277Q750K7117o183k6996
$$ 45750 33148 38962 38983 43421 51346 57888 65235 70268 76100 60596 61651 62011 50734 59484 86601 80418 53422
-1451E3422k7240j9605l524J4385J4701Q538M372K2060J5143k143N256R49J2001J6002n76
$$ 53422 26182 6577 3053 17438 32139 40677 45049 67109 82252 80109 85365 86314 98315 114317 113741
-1436A13741J69q584l881Q07k0007j2946R089k503M601J423r942j6772J6324K1898J8569Q241
$$ 113741 113910 105326 101445 102252 82245 69299 78388 75885 80486 81909 71967 55195 71519 93417 111986 120227
-1420A20227J1871k501l3367k2301j6065o106J7546P642N430M108O764J168k1526j2377m578
$$ 120227 132098 129597 96230 73929 57864 51758 69304 76946 82376 86484 93248 94416 72890 60513 55935
-1405E5935m232j9327K382K9001K3193J4176l728r497P321J7444j5790k2517j2614k911l209
$$ 55935 51703 32376 34758 63759 86952 101128 97400 87903 95224 112668 96878 74361 61747 58836 55627
-1390E5627k45N085n42j2015r194L05n48j6239j391J1558J8760p548j1838M961M263R905R796
$$ 55627 55382 60467 59925 47910 38716 39021 38473 22234 20843 32401 51161 43613 31775 36736 40999 50904 60700
-1373F0700j8844p491J8943N008j5685J0227J5100R686Q390M598J0532N37q563o64K856j7990
$$ 60700 41856 34365 53308 58316 42631 52858 67958 77644 86034 90632 101164 101701 93138 92474 95330 77340
-1357G7340K00J346j253N991l443k015J577L814k178j6095o899P240M919N887j2336n456J6247
$$ 77340 77540 78886 77633 83624 80181 78166 79743 83557 81379 65284 58385 65625 70544 76431 64095 58639 74886
-1340G4886J524R31J4233M537L9j4703j1696P696N689p616j5243j9960N046J4735K65k352
$$ 74886 76410 77341 91574 96111 96150 81447 69751 77447 83136 75520 60277 40317 45363 60098 60363 58011
-1324E8011K188J467o667J611O580j3j5921j0583J9476J5449J2451J8871J3421K078r861j1984
$$ 58011 60199 61666 54999 56610 63190 63177 47256 36673 56149 71598 84049 102920 116341 118419 108558 96574
-1308I6574j9514l2209j2269q82n810j103J3392J9951J4412j3100J2403K0887R625r146j5377
$$ 96574 77060 44851 32582 31700 25890 24787 38179 58130 72542 59442 71845 92732 102357 93211 77834
-1293G7834j2391l706K1884J2638k3717j1044j060Q138J1736j957j1668p961K33p41n374j1697
$$ 77834 65443 61737 83621 96259 72542 61498 60438 68576 80312 78355 66687 58726 58959 58218 52844 41147
-1277D1147j1164Q49R312K093L657P074j167n253O454J069O07K425n294j3395l329J0498K3152
$$ 41147 29983 30832 40144 42237 45894 52968 51801 46548 53002 54071 54678 57103 51809 38414 35085 45583 68735
-1260F8735K112q934j5868j2109k144p290o933j053J3438M661M968K631K957M993M431Q964
$$ 68735 70847 61913 46045 33936 31792 24502 17569 16516 29954 34615 39583 42214 45171 50164 54595 63559
-1244F3559J5891m149j7427j0801K09n989Q37J6754N313k075j041J9o038J2058K3818K605
$$ 63559 79450 75301 57874 47073 47282 41293 42130 58884 64197 62122 61081 61100 55062 67120 90938 93543
-1228I3543j7345j0785O601J0133K380j7573j4181l081j589M168L688J1708L557j4685j0926
$$ 93543 76198 65413 72014 82147 84527 66954 52773 49692 48103 52271 55959 67667 71224 56539 45613
-1213D5613L16k774M699L795l180J1608K3076N164N080O617j3715k1438j4175j364J1769R874
$$ 45613 45929 43155 47854 51649 48469 60077 83153 88317 93397 100014 86299 64861 50686 49322 61091 70965
-1197G0965l545j270m865L657J3010R007J6172J9651J544l2522k5493J9596K2793p186j7163
$$ 70965 67420 66150 61285 64942 77952 86959 103131 122782 124326 91804 66311 85907 108700 101514 84351
-1182H4351j1808j048J1240J1476j2519J0356R859j507p43j1151k979q112j0206N986J4450
$$ 84351 72543 71495 82735 94211 81692 92048 101907 100400 99657 88506 85527 77415 67209 73195 87645
-1167H7645o15j7622r189J2040O162j2661j395N592r752j9323J1764J1032k611L927N544m264
$$ 87645 87030 69408 60219 72259 78421 65760 64365 69957 60205 40882 52646 63678 61067 64994 70538 66274
-1151F6274j3738J528J1816L994o600k1591j2900M076q61k017P618O541n253J5939J4477m931
$$ 66274 52536 54064 65880 69874 63274 41683 28783 32859 31998 29981 37599 44140 38887 54826 69303 64372
-1135F4372P673K0620p44k5994N027J8034K584k5212k0697J3027K4605J0598J545L741R001
$$ 64372 72045 92665 91921 65927 70954 88988 91572 66360 45663 58690 83295 93893 95438 99179 108180
-1120A08180J816q352j0678L436J1801o495n096Q732L276j0827q86J763j6535l1466j7890
$$ 108180 109996 101644 90966 94402 106203 99708 94612 103344 106620 95793 94907 96670 80135 48669 30779
-1105C0779J0161K5326J8114O982j384p422L323Q161o482j5869j923M385r845j2815o243k1
$$ 30779 40940 66266 84380 91362 89978 82556 85879 94040 87558 71689 69766 74151 64306 51491 45248 45227
-1089D5227J7004J9355p511k5012j0946J2610L4050J3802j1552m438J2259J1937r494j0942
$$ 45227 62231 81586 74075 49063 38117 50727 84777 98579 87027 82589 94848 106785 97291 86349
-1075H6349K1935J6938Q021q812n829k648l737j0982k5215j8417Q848J8858K2440q29k1382
$$ 86349 108284 125222 133243 124431 118602 115954 112217 101235 76020 57603 66451 85309 107749 106920 85538
-1060H5538j2711P984j049j75J662j5877j5659O478l364K878J4962J4176N742J4321J5409
$$ 85538 72827 80811 79762 79587 81249 65372 49713 56191 52827 55705 70667 84843 90585 104906 120315
-1045A20315o259l0541j8715J0608r642j8820L599K5319J24r623J6439l16r863l924Q411J3306
$$ 120315 114056 83515 64800 75408 65766 46946 50545 75864 75988 66365 82804 82488 72625 68701 77112 90418
-1029I0418J0808n243r903r959r867j357R777M623L566O583l124k4511j7887M450J0352O239
$$ 90418 101226 95983 86080 76121 66254 64897 74674 79297 82863 89446 86322 61811 43924 48374 58726 64965
-1013F4965K1485J4641j08n751J1740r73k0849j7612q360j1029K3718K9105O154r346j2368
$$ 64965 86450 101091 100983 95232 106972 105999 85150 67538 59178 48149 71867 100972 107126 97780 85412
-998H5412M365l944N773K0445m188j6734J2026m42j7008q608j2499k0277m455J3037O845k556
$$ 85412 89777 85833 91606 112051 107863 91129 103155 102713 85705 77097 64598 44321 39866 52903 59748 57192
-982E7192L684m614q629M815J8929M350L983j5474j1390O36m415Q239N844j4687k3105m939
$$ 57192 60876 56262 47633 52448 71377 75727 79710 64236 52846 53482 49067 57306 63150 48463 25358 20419
-966B0419K5650K4480q171k849J6687J0883p909n006O352n618k586J2161K360q462l451N170
$$ 20419 46069 70549 62378 59529 76216 87099 79190 74184 80536 74918 72332 84493 86853 78391 74940 80110
-950H0110P690J9830K4342J7085J411n827k586N374J905j2972r546L2613N1735N7675M2034
$$ 80110 87800 107630 131972 149057 150468 144641 142055 147429 149334 136362 126816 159429 211164 268839 310873
-935C10873J5136Q212O890j6427l6372n0357m4876l7718m3756j2273j1072l664N400N199k641
$$ 310873 326009 334221 341111 324684 288312 237955 193079 155361 111605 99332 88260 84596 89996 95195 92554
-920I2554j0921j0410o334K0009O973j2345k1918j0688j1661R687L1836P229j5307O555J8609
$$ 92554 81633 71223 64889 84898 91871 79526 57608 46920 35259 44946 76782 84011 68704 75259 93868
-905I3868q917N214n640k1840N257R878l144k424m845P95J1027L385m455j5003j7102Q604
$$ 93868 84951 90165 84525 62685 67942 77820 74676 72252 67407 68202 79229 82614 78159 63156 46054 54658
-889E4658J2120O651j710J2153O707j433q927m840Q349j2167j618J9837J1830j738K26l502
$$ 54658 66778 73429 71719 83872 90579 89146 80219 75379 83728 71561 69943 89780 101610 99872 100098 96596
-873I6596j2963j0996K028j8197r671J0309K9350J7242J1154P216j8799j4449j3084j0626
$$ 96596 83633 72637 74665 56468 46797 57106 86456 103698 114852 122068 103269 88820 75736 65110
-859F5110m656m357N856J2721K7646J4887r04p614j2080j759M615l425O203k255j3578j6883
$$ 65110 60454 56097 61953 74674 102320 117207 116303 108689 96609 94850 99465 96040 102243 99988 86410 69527
-843F9527j3866Q845K2353m337l267j283k1357k0415q044J6193J2869R545L766J1105R029
$$ 69527 55661 64506 86859 82522 79255 77972 56615 36200 28156 44349 57218 66763 70529 81634 90663
-828I0663L449p050j9848k5651q11L0558K7404J643K192j0888k0818q197O97K076K48N292
$$ 90663 94112 87062 67214 41563 40752 71310 98714 100357 102549 91661 70843 62646 63343 65419 65667 70959
-812G0959R802J3764K154P596J0780J938j2392k1967k0863M285J1537J0673P302o488L387
$$ 70959 80761 94525 96679 104275 115055 116993 104601 82634 61771 66056 77593 88266 95568 89080 92467
-797I2467J4115O977p841r341n723K754N093n403q774q085J451O593r582l650j0314k172q613
$$ 92467 106582 113559 105718 96377 90654 93408 98501 93098 84324 76239 77690 84283 74701 71051 60737 58565 49952
-780D9952O096P574N325K298j2085r701L641Q275J4701j4511p209K6991J1612j4157j7304
$$ 49952 56048 63622 68947 71245 59160 49459 53100 61375 76076 61565 54356 81347 92959 78802 61498
-765F1498K027K6104L3217J3150j5751j0794r99p320P134M046j2182k8757j0262M710K4918
$$ 61498 63525 89629 122846 135996 120245 109451 108452 101132 108266 112312 100130 71373 61111 65821 90739
-750I0739K6601M961j6965j6982J190r20q471J310J863j1973o673p655k748O675O166j0710
$$ 90739 117340 122301 105336 88354 89544 88624 80153 81463 83326 71353 64680 57025 54277 60952 67118 56408
-734E6408q122k506j815p529J0500O088R49J828r215N110J0136Q200n712j1268n72J5675J5413
$$ 56408 48286 45780 43965 36436 46936 53024 53973 55801 46586 51696 61832 70032 64320 53052 52480 68155 83568
-717H3568q812j3127r24q731j4070O585J0596j0823n979J7525J9664J2280j439p972m379J0460
$$ 83568 74756 61629 60705 51974 37904 44489 55085 44262 38283 55808 75472 87752 86313 78341 73962 84422
-701H4422R243J0248J7023R808r657L045N252q993l988j932j4747j0959R385R066N083J3981
$$ 84422 93665 103913 120936 130744 121087 124132 129384 120391 116403 114471 99724 88765 98150 107216 112299 126280
-685A26280J0155n923j1898N978j3597k7533j9922J6035L0520j2919k2251j0016k099J5340
$$ 126280 136435 130512 118614 124592 110995 83462 63540 79575 110095 97176 74925 64909 62810 78150
-671G8150K6740N1605L3772j3800n546K0729K2997J370n270n345j0849j2773k951R217K590
$$ 78150 104890 156495 190267 176467 170921 191650 214647 216017 210747 205402 194553 181780 178829 188046 190636
-656A90636k7029l4166o210J2358j263K4438J4815r932l33l063j6668n085J1337l57q609k5316
$$ 190636 163607 129441 123231 135589 134326 158764 173579 163647 163314 160251 143583 138498 149835 149478 140869 115553
-640A15553k0810J09Q518M242Q77O502M694n868j5875j8960K402K596J9178j072o734l72K208
$$ 115553 94743 94852 103370 107612 108489 114991 119685 113817 97942 78982 81384 83980 103158 102086 95352 94980 97188
-623I7188J5700R329j4676j8362J013K2048m780j9508k176K768J8162m852r126L098Q798J426
$$ 97188 112888 122217 107541 89179 90192 112240 107460 87952 85776 88544 106706 101854 92728 95826 104624 106050
-607A06050L479n481j6011L742Q972j219P485J1890Q47o236l53o54O026R752p783m112R465
$$ 106050 109529 104048 88037 91779 100751 99532 107017 118907 119754 113518 113165 112511 118537 128289 120506 116394 125859
-590A25859R288J2014O611l245L174L5063K0173q953N596O014L1011K4679j2912j4179m094
$$ 125859 135147 147161 153772 150527 153701 188764 208937 199984 205580 211594 242605 267284 254372 240193 236099
-575B36099j5320q026J6926J4227j0298M27J0834R677K0768K5180M5272O8719Q0119Q0591
$$ 236099 220779 212753 229679 243906 233608 234035 244869 254546 275314 300494 345766 414485 494604 575195
-561E75195R5343J00010J11166Q3552m7101r9671r3818o8206m9546l2307k5829p0247q7359
$$ 575195 670538 770548 881714 965266 918165 818494 724676 656470 606924 574617 548788 478541 391182
-548C91182o2616m8293k7753r684j0231k8131k4395k2640l916K2360L0381L7578L5074M2911
$$ 391182 328566 280273 252520 242836 232605 204474 180079 157439 153523 175883 206264 243842 278916 321827
-534C21827L3538M99j0523k1822j088P942J4091N100j9449n1492m7574m6226l6991j3564P469
$$ 321827 355365 355864 345341 323519 322431 330373 344464 349564 330115 278623 231049 184823 147832 134268 141737
-519A41737J4028K978j7470k6736k0015k426M896J5112N285K800K4438J7716R624L376r705
$$ 141737 155765 158743 141273 114537 94522 92096 96992 112104 117389 120189 144627 162343 171967 175343 165638
-504A65638j377M176l35o72K3576J7682r26k1160k1781j127o59K1171L3144r545j1633J8607
$$ 165638 164261 168437 168102 167430 191006 208688 207762 186602 164821 163694 163035 184206 217350 207805 196172 214779
-488B14779J9804K0959L7137J7275p922l39R298K1634K0914K160k0213k0047R044n221J57
$$ 214779 234583 255542 292679 309954 302032 301693 310991 332625 353539 355699 335486 315439 324483 319262 319419
-473C19419K17j7968j8244j4068j3905j7988j9283k1947J4714K2573J7884J692L60K058k2920
$$ 319419 319636 301668 283424 269356 255451 237463 218180 196233 210947 233520 251404 253096 253456 255514 232594
-458B32594k4583k351n838l0057j6525N274q715k4575k1600J0018L6609L3406J4552O418N550
$$ 232594 208011 205660 199822 169765 153240 158514 149799 125224 103624 113642 150251 183657 198209 204627 210177
-443B10177M094N970r57o589j7348M172J767j862P480M120j1344p12J7117P562P91L2L803
$$ 210177 214271 220241 219284 212695 195347 199519 201286 199424 206904 211024 199680 198968 216085 223647 224438 224470 228273
-426B28273J6949M380j438m555R711L1411K6402q247R738K5539K4024K0053K1155K4958N728
$$ 228273 245222 249602 248164 243609 253320 284731 311133 302886 312624 338163 362187 382240 403395 428353 434081
-411D34081O412P548J8358K0643J260j1630n006l624l1627J578O2512O5296N0418N1660N8895
$$ 434081 440493 448041 466399 487042 488302 476672 471666 468042 436415 437993 500505 565801 616219 667879 726774
-396G26774J02250J18553J41918J49560J80356K55359L19373L96291M18636J56378k13894
$$ 726774 829024 947577 1089495 1239055 1419411 1674770 1994143 2390434 2809070 2965448 2751554
-385B751554l01913j83458o0990M0918J21555J15907M6861o3062k32478l75201l69770l04451
$$ 2751554 2449641 2266183 2205193 2246111 2367666 2483573 2530434 2467372 2234894 1859693 1489923 1185472
-373A185472k63040j94152j31677q1633n4126m4606l8952k3460j3286k5718k1754o084N356
$$ 1185472 922432 728280 596603 514970 460844 416238 377286 353826 340540 314822 293068 286984 292340
-360B92340o576J4131K946q972j4316j9793j9101J770L291j5454n602K222J2033O730j5657
$$ 292340 285764 299895 302841 293869 279553 259760 240659 242429 245720 230266 224664 226886 238919 245649 229992
-345B29992j0723o712k644j0484k5621k0173j0557L46P391J3756L494j5450k2998j1272j327
$$ 229992 219269 212557 209913 199429 173808 153635 143078 143424 150815 164571 168065 152615 129617 118345 117018
-330A17018J3854L832j1129k432j0066L183J2578J2052N546o929N12M758L639N926P242K35
$$ 117018 130872 134704 123575 121143 111077 114260 126838 138890 144436 137507 138019 142777 146416 152342 159584 159819
-314A59819M461N932j2027j6717p348N88m324j6766l936Q280J2645J6602J270n301o157n758
$$ 159819 164280 170212 158185 141468 134120 134708 130384 113618 109682 117962 130607 147209 148479 143178 137021 131263
-298A31263J6151K9299J6745r695j3397Q05n623m908k410P04p623j5606p993J3423P880o154
$$ 131263 147414 176713 193458 183763 170366 171171 165548 160640 158230 158934 151311 135705 127712 141135 149015 142861
-282A42861P159J0126j3723j0063p625K168l156J0290K789R496m706p930j115j1238n232M523
$$ 142861 150020 160146 146423 136360 128735 130903 127747 138037 140826 150322 145616 137686 136571 125333 120101 124624
-266A24624J0882J4184J9595O098k23O875j1134k0166j3997J1555K152J0615J9473K7230K8115
$$ 124624 135506 149690 169285 175383 175160 182035 170901 150735 136738 148293 150445 161060 180533 207763 235878
-251B35878l565j7836m497K647k6251n9300p264M0172J3560k4311N710P673k9664k9257r075
$$ 235878 232313 214477 209980 212627 186376 127076 119812 159984 173544 149233 154943 162616 132952 103695 94620
-236I4620j0558r635j8159L69J5984J7462m643j0838n899J0358K7810K5981k660k0701n894
$$ 94620 84062 74427 56268 56637 72621 90083 85440 74602 68703 79061 106871 132852 130192 109491 103597
-221A03597K715J0439K056j2962r601j5417J859n202J455J7996K1525l646m85P223l50N891
$$ 103597 106312 116751 118807 105845 96244 80827 82686 77484 78939 96935 118460 114814 114329 121552 121202 127093
-205A27093K9734K2611J2575J2315n129j4586m388o848J2504o34q534j3100q287j5174j7911
$$ 127093 156827 179438 192013 204328 199199 184613 180225 173377 185881 185247 176713 163613 155326 140152 122241
-190A22241j3724M921K0711J5769J7423J3213l319n876k3378j2795M219J5571M788Q340K545
$$ 122241 108517 113438 134149 149918 167341 180554 177235 171359 147981 135186 139405 154976 159764 168104 170649
-175A70649q152l642K7717J3864K6499J1275k6656j6550J1636J394j3737j9346R701R71J1897
$$ 170649 162497 158855 186572 200436 226935 238210 211554 195004 206640 208034 194297 174951 184652 185623 197520
-160A97520L153j0636j1041J0089Q848m526j5376L4l279J98J48J9207Q230O062J0012K5012
$$ 197520 200673 190037 178996 189085 197933 193407 178031 178065 174786 174984 175132 194339 202569 208631 218643 243655
-144B43655K6942J5599j7823l920J4386L2780R286K0884K4303L9366L0170J5320l280O927
$$ 243655 270597 286196 268373 264453 278839 311619 320905 341789 366092 405458 435628 450948 447668 454595
-130D54595L135Q325J3930K6725K1151M1423R680K697R154K8304L2152N6428O2236P0981P3574
$$ 454595 457730 466055 479985 506710 527861 569284 578964 581661 590815 619119 651271 707699 769935 840916 914490
-115I14490Q9452J16719J55010J87043L45155M96430N42841L88305L10693L08362m5755o33436
$$ 914490 1003942 1120661 1275671 1462714 1807869 2304299 2847140 3235445 3546138 3854500 3808745 3175309
-103C175309o06909l03221l9483J12263J99889K21628L11394L84481N05838O17418Q46673
$$ 3175309 2568400 2265179 2225696 2337959 2537848 2759476 3070870 3455351 3961189 4578607 5425280
-92E425280J077526J425751J789271K237122K744013L637476N190094Q288152J3542767J9793412
$$ 5425280 6502806 7928557 9717828 11954950 14698963 18336439 23526533 31814685 45357452 65150864
-82F5150864J9781533J2663712R061764P141306j2373301l2067516k6909171j5004374q046946
$$ 65150864 84932397 97596109 106657873 113799179 101425878 69358362 42449191 27444817 19397871
-73A9397871m699686k931637k028969j521799j306316j114454r68458p29686n54476l75014
$$ 19397871 14698185 11766548 9737579 8215780 6909464 5795010 4826552 4096866 3542390 3167376
-63C167376k89525k05466j68269q6499k8670P2536J67566L46608M05055K67391R9696J27820
$$ 3167376 2877851 2672385 2504116 2417617 2388947 2461483 2629049 2975657 3380712 3648103 3747799 3875619
-51C875619k06807p64680p83835m76732k98750k00275j32945p4538p8222o3088p7671n9394
$$ 3875619 3668812 2904132 2120297 1643565 1344815 1144540 1011595 937057 858835 795747 718076 658682
-39F58682n0628k6356m0797m2139l5623k3092k0934j8433j4957q946k9937j5357k0054j0313
$$ 658682 608054 581698 540901 498762 463139 440047 419113 400680 385723 376777 346840 331483 311429 301116
-25C01116p358L455O683Q249J7368K590j4511k1897m0255m595O371M478K404n867q465J060
$$ 301116 293758 297213 303896 312145 329513 332103 317592 295695 255440 250845 257216 261694 264098 258231 249766 250826
-9B50826o820l983J2446R360j6740j7874k4917p942m552q370J624M596r477j2689k6076j0771
$$ 250826 244006 240023 252469 261829 245089 227215 202298 194356 189804 181434 183058 187654 178177 165488 139412 128641
6A28641J2046P160j0901j4861n721N482p901R050J5889l177j1332k0459j0096K1220O842n108
$$ 128641 140687 147847 136946 122085 116364 121846 113945 122995 138884 135707 124375 103916 93820 115040 121882 116774
22A16774p092n669l717P942L194M124J2981K2728J0843j9822k5487j7754j4107m696j345j5095
$$ 116774 109682 104013 100296 108238 111432 115556 128537 151265 162108 142286 116799 99045 84938 80242 78897 63802
38F3802k2815k4043j167L2823K8621L528p039M482J5026K4047O665j433m244N81l286j4946
$$ 63802 40987 16944 15777 48600 77221 80749 73710 78192 93218 117265 123930 122497 118253 118834 115548 100602
54A00602j6038p66N760r01j6863K040l475P078n053j1979p430j3598Q226J8041j4315p873
$$ 100602 84564 83798 89558 88657 71794 73834 70359 77437 72384 60405 52975 39377 47603 65644 51329 43456
70D3456J3925L504Q791M752J9487L3129J6740K0717L7079J2790J5458N050k1758j2257J0731
$$ 43456 57381 60885 69676 74428 93915 127044 143784 164501 201580 214370 229828 234878 213120 200863 211594
85B11594j4973n276Q152J4450k5471m7734k8072k0411j3134j1413r323l10J5303J5958J4408
$$ 211594 196621 191345 199497 213947 188476 140742 112670 92259 79125 67712 58389 58079 73382 89340 103748
100A03748M476j6710k8453j2091J1709J2577l140p890M314n541R071J2446j7856j4453K1457
$$ 103748 108224 91514 63061 50970 62679 75256 72116 64226 68540 62999 72070 84516 66660 52207 73664
115G3664K2573J2029M357p049m388j1405j4614o023L753K0365K0114j14r333j028k034k0036
$$ 73664 96237 108266 112623 105574 101186 89781 75167 69144 72897 93262 113376 113262 103929 102901 100867 80831
131H0831m679q841k5236J459K1740R921m761j4112p746J9326R478k3057j9473k55R111n68
$$ 80831 76152 67311 42075 43534 65274 75195 70434 56322 48576 67902 77380 54323 34850 34595 43706 43138
147D3138l185n885L983m964j1268j533J3948O95l257r923m18J2230M542N335K134R60J049
$$ 43138 39953 34068 38051 33087 21819 20286 34234 34929 31672 21749 21331 33561 38103 43438 45572 46532 47581
164D7581j8468j1588J3750J1692J4318M552N913J831M367P977P439o145j4827j2458l933K939
$$ 47581 29113 17525 31275 42967 57285 61837 67750 69581 73948 81925 89364 83219 68392 55934 52001 54940
180E4940q070j0073J832J6884L627j2881K948J2902k059J492J2743q93k271j8558o447K443
$$ 54940 46870 36797 38629 55513 59140 46259 49207 62109 60050 61542 74285 73392 71121 52563 46116 48559
196D8559K1077J1288Q008m775O752Q740O369p772j6473j851J2115O379L493j172M658j711
$$ 48559 69636 80924 88932 84157 90909 99649 106018 98246 81773 79922 92037 98416 101909 100737 105395 103684
212A03684o146j850O133M401P220k3479m0748j1766K310P494J7036J1466j1790j5903k677
$$ 103684 97538 95688 101821 106222 113442 89963 49215 37449 39759 47253 64289 75755 63965 48062 45385
227D5385L136J2969J1382o079j6939N24N778K3435P786p376O920J4777m493k812R44N285L923
$$ 45385 48521 61490 72872 66793 49854 50378 56156 79591 87377 80001 86921 101698 97205 94393 95337 100622 104545
244A04545k922J046J0103P4l337j1400k5745k1820o53N115J6213J5968Q271J2737Q769k0422
$$ 104545 101623 102669 112772 112846 109509 98109 72364 50544 49891 55006 71219 87187 95458 108195 116964 96542
260I6542j0792k0285j0127k933o389k1644j0052O267L346J4342r82m050M858J4123J6905J9442
$$ 96542 85750 65465 55338 52405 46016 24372 14320 20587 23933 38275 37293 33243 38101 52224 69129 88571
276H8571m808k8210r106l806r440M716K55m549p878j5305J3510L3405J5078L563J8084K4173
$$ 88571 83763 55553 46447 42641 33201 37917 38172 33623 25745 10440 23950 57355 72433 75996 94080 118253
292A18253K079p770k3187j9856J1188J580q888l034j1852J673L1473R85k0433l8P469n023
$$ 118253 120332 112562 89375 69519 80707 82287 73399 70365 58513 60186 91659 92644 72211 72173 79642 74619
308G4619p171k0751k310n925k605Q516L946o573j678K3200J0785j9026j7106r758l473j402
$$ 74619 67448 46697 44387 38462 35857 44373 48319 41746 40068 63268 74053 55027 37921 28163 24690 23288
324B3288J0447K1611O059j4949N4p992j0818q892L060N168L890J51j4284Q748K7407P168L190
$$ 23288 33735 55346 61405 46456 46510 38518 27700 18808 21868 27036 30926 31077 16793 25541 52948 60116 63306
341F3306m630j8439r954P510K1479J2815j8086k0965P725N745j0675J0774j304K048k936k440
$$ 63306 58676 40237 30283 37793 59272 72087 54001 33036 40761 46506 35831 46605 45301 47349 44413 41973
357D1973o180m124J2717K7422L926j9000k295Q919R966J7773o623q373o226m297r986k5319
$$ 41973 35793 31669 44386 71808 75734 56734 54439 63358 73324 91097 84474 76101 69875 65578 55592 30273
373C0273L970J8711J75j5255P773K0415J9306Q078l984n788j041p999k1524j1058j814n07
$$ 30273 34243 52954 53129 37874 45647 66062 85368 93446 89462 83674 82633 74634 53110 42052 40238 39731
389C9731J3836K4621P475J765J3993O689k4064k1719j16J7828L2215L2894L0216N1383O3901
$$ 39731 53567 78188 85663 87428 101421 108110 84046 62327 62211 80039 112254 145148 175364 226747 290648
404B90648N6188N6879N4324L2377O617j8323m1664p3369p7160o1662l9909l5391j2779n735
$$ 290648 346836 403715 458039 490416 497033 478710 437046 363677 286517 224855 184946 149555 136776 131041
418A31041j4159r856K985j4393j1905j8910j6800M367R064O198J3334J3649j9838k7498p594
$$ 131041 116882 107026 110011 95618 83713 64803 48003 52370 61434 67632 80966 94615 74777 47279 39685
433C9685J2284K0946J1828q237j3351p404l967j234j116o775j1378j1964O860J4325J0610
$$ 39685 51969 72915 84743 76506 63155 55751 51784 50550 49434 42659 31281 19317 26177 40502 51112
448E1112J2969J2213P432o496j829J0048m748k186Q599o424j5748k3079k885J0815N851m723
$$ 51112 64081 76294 83726 77230 75401 85449 80701 78515 87114 80690 64942 41863 38978 49793 55644 50921
464E0921K777J250j0820J4045R464o355K134j717j7729l0334j3224J3474K8057R867j2134
$$ 50921 53698 54948 44128 58173 67637 61282 63416 61699 43970 13636 412 13886 41943 51810 39676
479C9676j6057j0723l191K76L259j395k622J1097L690r016L376M954J384q113j0958N847J7076
$$ 39676 23619 12896 9705 9981 13240 11845 9223 20320 24010 14994 18370 23324 24708 16595 5637 11484 28560
496B8560K1732Q272Kn872m235r674k4J5519J7466N355j2392r357n096M315r606q978q300p702
$$ 28560 50292 58564 58566 52694 48459 38785 38761 54280 71746 77101 64709 55352 50256 54571 44965 35987 27687 19985
514A9985J332l582J357M851J178j427k876J0389J7788J8202K543j467k695M566j84J909Q075
$$ 19985 21317 17735 19092 23943 25121 23694 20818 31207 48995 67197 69740 68273 65578 70144 69960 71869 79944
531G9944m694o386r355j2784L208J7339j1444k4562R485J1081j1545o620N258k3358j8336
$$ 79944 75250 68864 59509 46725 49933 67272 55828 31266 40751 51832 40287 33667 38925 15567 -2769
546b769K2178L4002J4216j0054q213K822R218O939m624O527m482q067j0252k6334L475J6263
$$ -2769 19409 53411 67627 57573 49360 52182 61400 68339 63715 70242 65760 57693 47441 21107 24582 40845
562D0845N548J1054O040J972r70Q604J3991l191l1228l3198q504M556m36J4870K3894L0350
$$ 40845 46393 57447 63487 65459 64489 73093 87084 83893 52665 19467 10963 15519 15083 29953 53847 84197
578H4197Q50j3972k2103j0986P613J9176P607q82J43n03R648L601j3135r649M742J3910L120
$$ 84197 85047 71075 48972 37986 45599 64775 72382 71500 71643 71140 80788 84389 71254 61605 66347 80257 83377
595H3377j309k261j3963m454K609m054p12M960P004N340R40j3427k896j1249J781J1896m278
$$ 83377 82068 79807 65844 61390 63999 59945 59233 64193 71197 76537 77477 64050 61154 49905 51686 63582 59304
612E9304r888o700K2697J3263n840k4263q036p135l802J3383J2391J0697l027o491O096M960
$$ 59304 49416 42716 65413 78676 72836 48573 40537 33402 29600 42983 55374 66071 63044 56553 62649 67609
628F7609j517P900j0785k4782L681K4420R643Q378r484k0144l754J6364J1015N078n931k2332
$$ 67609 66092 73992 63207 38425 42106 66526 76169 84547 75063 54919 51165 67529 78544 83622 77691 55359
644E5359l0127j0825M811P413L250O043N853R408J6344M431j299j1106j8142j6151k0034k0116
$$ 55359 25232 14407 19218 26631 29881 35924 41777 51185 67529 71960 70661 59555 41413 25262 5228 -14888
660a4888R869J9088K1791J6343l720j8982j8397m301J2105J4097O55j3359K890O243J589R065
$$ -14888 -5019 14069 35860 52203 48483 29501 11104 6803 18908 33005 33660 20301 23191 29434 31023 40088
676D0088p398j0441J0329J4112N585p038r500J0724Q955p392j2022o379O844J5602J591R617
$$ 40088 32690 22249 32578 46690 52275 45237 35737 46461 55416 48024 36002 29623 36467 52069 53660 63277
692F3277P450q965k5068k0057n520j263Q042L0988J4257R104n67j9209j2388P139p870j6074
$$ 63277 70727 61762 36694 16637 11117 9854 17896 48884 63141 72245 71678 52469 40081 47220 39350 23276
708B3276l399k432k098N351K3269J7719P637P663q074k8748l0128J1926K5959J2410N18j4144
$$ 23276 19877 17445 15347 20698 43967 61686 69323 76986 68912 40164 10036 21962 47921 60331 60849 46705
724D6705r354o514O695m52j0153Q190R118J1840J7387p92L106R093L498k400j6928Q215J0986
$$ 46705 37351 30837 37532 37080 26927 35117 44235 56075 73462 72670 75776 84869 88367 85967 69039 77254 88240
741H8240j0858j1116r368j3032q685j0712J2032J38j1557l831O226j513l691J3918J0899Q67
$$ 88240 77382 66266 56898 43866 35181 24469 36501 36639 25082 21251 27477 25964 22273 36191 47090 47957
757D7957q17O283n362o343K3346R761j0128l264j2921j7682M254K873j0794N21l66J3869P075
$$ 47957 47140 53423 48061 41718 65064 74825 64697 61433 48512 30830 35084 37957 27163 27684 27318 41187 48262
774D8262j0249O692J8405O839j5493m172K47k411K0487N474j0794J196p106J0160n003q870
$$ 48262 38013 44705 63110 69949 54456 50284 50531 48120 68607 74081 63287 64483 57377 67537 62534 53664
790E3664J419r20J6407K378j0066o706j9999r524M845L60Q672J4239L793o978o085j0685q042
$$ 53664 55083 54163 70570 72948 62882 56176 36177 26653 31498 31858 40530 54769 58562 51584 45499 34814 26772
807B6772J1559J9018J9805J1814q199l0722k2498o77N045J3016J581k185K6726K1430P82j024
$$ 26772 38331 57349 77154 88968 80769 50047 27549 26872 31917 44933 46514 44329 71055 92485 93267 92243
823I2243j5969j5722k096Q808L789n231r274p330q05M464m983p741P657J8114j0314j3413
$$ 92243 76274 60552 58456 67264 71053 65822 56548 49218 48413 52877 47894 40153 47810 65924 55610 42197
839D2197R714j294o745k439K88k480K940P148l02J737J4120Q153j338j1516k4169j3348J1488
$$ 42197 51911 50617 43872 41433 41721 39241 42181 49329 49027 50764 64884 73037 71699 60183 36014 22666 34154
856C4154Q422p200j0904j1373J5991K6757J8323K503l183o971o469m11J3816J128n823n440
$$ 34154 42576 35376 24472 13099 29090 55847 74170 76673 73490 66519 60050 59639 73455 74583 68760 63320
872F3320l575J7334K259j211k666o461O875J1406n01j5047j3112J8828J3889j099j2297j7623
$$ 63320 59745 77079 79338 78127 75461 69000 75875 87281 86780 71733 58621 77449 91338 90239 77942 60319
888F0319N728J7120j922k1057N854J6065J1495K0781L567j7373k7294k3439J3523J1295R84
$$ 60319 66047 83167 81245 60188 66042 82107 93602 114383 117950 100577 73283 49844 63367 74662 75646
903G5646n317j0676L593J9578J2517J640L26j5283n693K90L42p351j1263R833M813K496K679
$$ 75646 70329 59653 63246 82824 95341 96981 97307 82024 76331 76621 76963 69612 58349 68182 72995 75491 78170
920G8170L423J117n062r68K788L496j226Q732j081r667m830k814P452R713N943j391j4056
$$ 78170 81593 82710 77648 76680 79468 82964 81738 90470 89389 79722 74892 72078 79530 89243 95186 93795 79739
937G9739m453q0j4428m172P444l397k094k063J781k984l64J257Q168r213j5344P258J777j5282
$$ 79739 75286 75206 60778 56606 64050 60653 58559 56496 58277 55293 54929 56186 64354 55141 39797 47055 48832 33550
955C3550R813J1954p420J1152K6077j1288j6495K811P816Q392O780L94j6765j2411p61m205
$$ 33550 43363 55317 47897 59049 85126 73838 57343 60154 67970 76362 83142 83536 66771 54360 53599 49394
971D9394L171J6562O247n729j3418k269J784j156k473M993L578K1908K3969L821m088n306
$$ 49394 52565 69127 75374 69645 56227 53958 55742 54586 52113 57106 60684 82592 106561 110382 106294 100988
987A00988l734j1962j69K50o508k1987r130J1615M128N996J3397M690k6600j5885J416O482
$$ 100988 97254 85292 85123 85373 78865 56878 47748 59363 63491 69487 82884 87574 60974 45089 46505 52987
1003E2987q048j0447L900N587J5398J9408j0438j8560R938L346m2l318k6974l610k546k526
$$ 52987 44939 34492 38392 43979 59377 78785 68347 49787 59725 63071 63029 59711 32737 29127 26581 24055
1019B4055L019J3112K0523K608l823n856j7174J639o408l056Q854J2101J5255k287o029J8105
$$ 24055 27074 40186 60709 63317 59494 53638 36464 38103 31695 28639 37493 49594 64849 62562 56533 74638
1035G4638J2432o176j0092j5089K282r81N429K076L925J887r531p189j0604k751n537o490
$$ 74638 87070 80894 70802 55713 57995 57014 62443 64519 68444 70331 60800 53611 43007 40256 34719 28229
1051B8229K1586K1595M962o188l628L283R533J0321j6351j5312p972j0267o882q04N885R931
$$ 28229 49815 71410 76372 70184 66556 69839 79372 89693 73342 58030 50058 39791 32909 32105 37990 47921
1067D7921N430p598K99O954L229J705j35k740j6776p077j951r64J548q27P05m307j1476j435
$$ 47921 53351 45753 46052 53006 56235 57940 57805 55065 38289 31212 29261 28297 29845 29018 29723 25416 13940 12505
1085A2505J1285J0587q927o690O101J416r388J012O29q609k694J287q756j036K1082J4364
$$ 12505 23790 34377 25450 18760 24861 26277 16889 17901 18530 9921 7227 8514 -242 -1278 19804 34168
1101C4168J2738J1702J7926K6006o452l0606q516L63j4480p245J2580K213j2663O733J1333
$$ 34168 46906 58608 76534 102540 96088 65482 56966 57329 42849 35604 48184 50397 37734 44467 55800
1116E5800J3079j352P874j73q926l610m869m122n710j0743N940K5088K2812L797k985o519
$$ 55800 68879 67527 75401 75228 66302 62692 57823 53701 47991 37248 43188 68276 91088 94885 91900 85381
1132H5381j6106r039J0915K1725R395q81O017k685j0292j8343p511J9019M436m673j074M044
$$ 85381 69275 60236 71151 92876 102271 101390 107407 104722 94430 76087 68576 87595 92031 87358 86284 90328
1148I0328K635j0445O422l026k0088j0572m888J1032R196k1J873L020p433L519m413j3349
$$ 90328 92963 82518 88940 85914 65826 55254 50366 61398 70594 70573 72446 75466 68033 71552 67139 53790
1164E3790j3806L697J1896J1720M12j4612o802J9099P216n510j2185p271R083J8186K1427
$$ 53790 39984 43681 55577 67297 67709 53097 46295 65394 72610 67100 54915 47644 56727 74913 96340
1179I6340p817j2119K089J9337J1900k1680k7066r003O266J0132Q288L248p34J571p597j4043
$$ 96340 88523 76404 78493 97830 109730 88050 60984 51981 58247 68379 76667 79915 79181 80752 73155 59112
1195E9112m490J0738L964j4780j4615o248j009J314J0045J9439N269r39K44q765J0809J2402
$$ 59112 54622 65360 69324 54544 39929 33681 32672 33986 44031 63470 68739 67800 68044 59279 70088 82490
1211H2490j3313Q837o372j7791M73J1609J8635l566j5495k1571r218O952Q358J0190j2443
$$ 82490 69177 78014 71642 53851 54324 65933 84568 81002 65507 43936 34718 41670 50028 60218 47775
1226D7775q861Q11P393K2794K4281k961q826Q495R40r367j1744j6684J544R719J458j6374
$$ 47775 38914 39725 47118 69912 94193 91232 82406 90901 91841 82474 70730 54046 55590 65309 66767 50393
1242E0393k1677j9738m363P72P504P527R244P678J4396J7132O95k742O59j3010k4589j1589
$$ 50393 28716 8978 4615 5387 12891 20418 29662 37340 51736 68868 69563 66821 67480 54470 29881 18292
1258A8292j5405j4726J0641J9174N285L973J3778M553j0268Q605K6341P584o010j794p405
$$ 18292 2887 -11839 -1198 17976 23261 27234 41012 45565 35297 43902 70243 77827 71817 70023 62618
1273F2618q970k2249l708q730n962J8615Q233q05J3760J8294M033L5653K6444j3639k2223
$$ 62618 53648 31399 27691 18961 12999 31614 39847 39042 52802 71096 75129 110782 137226 123587 101364
1288A01364j1304j2664J2955K2901l889j7764n090j3859K086N204K979J1375k439j3482o32
$$ 101364 90060 77396 90351 113252 109363 91599 86509 72650 74736 79940 82919 94294 91855 78373 77741
1303G7741O708j3923j636J7429l347k4457n491o960p06J4194j0059j2484O968n318n150j467
$$ 77741 84449 70526 68890 86319 82972 58515 53024 46064 45358 59552 49493 37009 43977 38659 33509 32042
1319C2042j2396L23N474R504Q037o910p687j0697q370j572j4169o237L748M051K5269K9679
$$ 32042 19646 19969 25443 34947 42984 36074 28387 17690 9320 7748 -6421 -12658 -8910 -4859 20410 50089
1335E0089m230k1834m235l431k42J168K0747K2034O799j4433j4351K247L51j05j1839L126
$$ 50089 45859 24025 19790 16359 16117 17285 38032 60066 66865 52432 38081 40328 40679 40574 28735 31861
1351C1861M124J860j621K902P899J0842J2196J415q06l340j0932m165M945J3918K3692P424
$$ 31861 35985 37845 36224 39126 47025 57867 70063 71478 70672 67332 56400 52235 57180 71098 94790 102214
1367A02214o044q027n634l0358p637J1843J8399r526j8989M365R002P451L1183K6500r288
$$ 102214 96170 88143 82509 52151 44514 56357 74756 65230 46241 50606 59608 67059 98242 124742 115454
1382A15454k4613l6626j6327j4332O061K7871M79R345J8585O686L799o078j0888j8680q563
$$ 115454 90841 54215 37888 23556 29617 57488 57967 67312 85897 92583 96382 90304 79416 60736 52173
1397E2173M068n458L94K6634P705k8551j5817M841P60j0598j242J9076N108j3920N005p753
$$ 52173 56241 50783 51177 77811 85516 56965 41148 45989 46749 36151 34909 53985 59093 45173 50178 42425
1413D2425j7752L042K2029m54j1483n305J452q139J5398J6751J1871J4993J919r738l813K133
$$ 42425 24673 27715 49744 49290 37807 32502 33954 25815 41213 57964 69835 84828 86747 77009 73196 75329
1429G5329m117j0177j0200J9196J7815M375l448j8387m420p444j0142k650J7852J0040j4785
$$ 75329 71212 61035 50835 70031 87846 92221 88773 70386 65966 58522 48380 45730 63582 73622 58837
1444E8837q251r499N597J1518J0029P643l453j4187j2479J3546J4128M782j4927n098J3942
$$ 58837 50586 41087 46684 58202 68231 75874 72421 58234 45755 59301 73429 78211 63284 58186 72128
1459G2128o23j4279j4000n710J5053Q603k332k4p270m203n370j1008l231K51R780M797q997
$$ 72128 71505 57226 43226 37516 52569 61172 58840 58816 51546 47343 41973 30965 27734 27985 37765 42562 33565
1476C3565j3469p861r567P569J6366R801K445K616k798r211n713M471K768m397N313j870j499
$$ 33565 20096 12235 2668 10237 26603 36404 38849 41465 38667 29456 23743 28214 30982 26585 31898 30028 28529
1493B8529K425L373o802j3611k693L334N325J1431J3306j408m710P244K942j1034j3399P262
$$ 28529 30954 34327 27525 13914 11221 14555 19880 31311 44617 43209 38499 45743 48685 37651 24252 31514
1509C1514K1293J8463J1023M92j7810l757L447r04O73Q590q04j0644r252j3099K644N726p069
$$ 31514 52807 71270 82293 82785 64975 61218 64665 63761 64434 73024 72220 61576 52324 39225 41869 47595 40526
1526D0526k872Q619j1641q831J684o719M06j608j61m895K310j1060n287P05k304K4084K4852
$$ 40526 37654 46273 34632 25801 27485 20766 21172 19564 19403 14508 16818 5758 471 1176 -1128 22956 47808
1543D7808J3756n883q605J3384J7145o239m872o487j2199m31n745p539L913M76k539k336J755
$$ 47808 61564 55681 47076 60460 77605 71366 66494 60007 47808 47377 41632 34093 38006 38482 35943 33607 35362
1560C5362l339R201J8389J3052J1418Q245M753n361j5069j7724j1432p015p065j8623k459
$$ 35362 32023 41224 59613 72665 84083 92328 97081 91720 76651 58927 47495 40480 33415 14792 12333
1575A2333J2724P682r963n5N334O10j6148L377K0945P416j508J328j5173k4672L170K1098
$$ 12333 25057 32739 22776 22721 28055 28665 12517 15894 36839 44255 42747 44075 28902 4230 7400 28498
1591B8498K419R645K0200k64j5029j074J5898L245j939j4156L792P717N285J5716M769j8215
$$ 28498 30917 40562 60762 60498 45469 44395 60293 63538 61599 47443 51235 58952 64237 79953 84722 66507
1607F6507l3870J792Q052k631J7600K2310r971k0098r576j1122q211j108R007R118R951K406
$$ 66507 32637 34429 42481 39850 57450 79760 69789 49691 40115 28993 20782 19674 28681 37799 47750 50156
$$ [...]
##END=	
