##TITLE=	Feb27-2020.360.fid
##JCAMPDX=	6.0	$$ NMR Plug-in v.1.14 of MestReNova 12.0.4-22023
##DATATYPE=	LINK
##BLOCKS=	2
##ORIGIN=	Bruker BioSpin GmbH
##OWNER=	nmrsu
##TITLE=	Feb27-2020.360.fid
##JCAMPCS=	3.7	$$ Molecule Plug-in 1.10 of MestReNova 12.0.4-22023
##ORIGIN=	Bruker BioSpin GmbH
##OWNER=	nmrsu
##BLOCKID=	1
##NAMES=	
##ATOMLIST=	
$$ AN	AS	NH
	1	C	 
	2	C	 
	3	C	 
	4	C	 
	5	C	 
	6	C	 
	7	C	 
	8	C	 
	9	C	 
	10	O	 
	11	C	 
	12	C	 
	13	C	 
	14	O	 
	15	C	 
	16	C	 
	17	O	 
	18	C	 
	19	H	 
	20	H	 
	21	H	 
	22	H	 
	23	H	 
	24	H	 
	25	H	 
	26	H	 
	27	H	 
	28	H	 
	29	H	 
	30	H	 
	31	H	 
	32	H	 
	33	H	 
	34	H	 
	35	H	 
	36	H	 
##BONDLIST=	
$$ AN1	AN2	BT
	1	2	D
	2	3	S
	3	4	D
	4	5	S
	5	6	D
	6	1	S
	1	17	S
	3	7	S
	7	8	S
	8	9	D
	6	10	S
	10	11	S
	11	12	S
	12	13	S
	11	14	D
	13	15	S
	15	16	S
	16	13	S
	17	18	S
	2	19	S
	4	20	S
	5	21	S
	7	22	S
	7	23	S
	8	24	S
	9	25	S
	9	26	S
	12	27	S
	12	28	S
	13	29	S
	15	30	S
	15	31	S
	16	32	S
	16	33	S
	18	34	S
	18	35	S
	18	36	S
##MAXRASTER=	32768
##XYRASTER=	
$$ AN	X	Y	Z
	1	11582	15094	0
	2	8656	13405	0
	3	8656	10026	0
	4	11582	8336	0
	5	14508	10026	0
	6	14508	13405	0
	7	5729	8336	0
	8	5729	4957	0
	9	2803	3268	0
	10	17434	15094	0
	11	20361	13405	0
	12	23287	15094	0
	13	26214	13405	0
	14	20361	10026	0
	15	27903	10479	0
	16	29592	13405	0
	17	11582	18473	0
	18	8656	20163	0
	19	5730	15094	0
	20	11582	4958	0
	21	17435	8336	0
	22	4574	11512	0
	23	2401	7750	0
	24	8655	3268	0
	25	-122	4957	0
	26	2803	-110	0
	27	25459	17683	0
	28	21116	17683	0
	29	23824	11016	0
	30	25315	8307	0
	31	30491	8307	0
	32	32768	12249	0
	33	30179	16732	0
	34	10345	23089	0
	35	5730	21852	0
	36	6966	17237	0
##END=	

##TITLE=	Feb27-2020.360.fid
##JCAMPDX=	6.0	$$ NMR Plug-in 1.14 of MestReNova 12.0.4-22023
##BLOCKID=	2
##DATATYPE=	NMRSPECTRUM
##DATACLASS=	XYDATA
##NUMDIM=	1
##ORIGIN=	Bruker BioSpin GmbH
##OWNER=	nmrsu
##.OBSERVEFREQUENCY=	400.05240029999998796
##.OBSERVENUCLEUS=	^1H
##.SOLVENTNAME=	CDCl3
##.PULSESEQUENCE=	zg30
##LONGDATE=	2020/02/27 16:12:00.000
##.ACQUISITIONMODE=	SIMULTANEOUS (DQD)
##$ORIGINALFORMAT=	Bruker XWIN-NMR
##$PARAMETERFILE=	(acqus, ASCII, c:/Users/mukta/AppData/Local/Temp/JsragAxqQEeewOugkqe4cA/360/acqus, 0)
$$ ##TITLE= Parameter file, TOPSPIN		Version 3.2
$$ ##JCAMPDX= 5.0
$$ ##DATATYPE= Parameter Values
$$ ##NPOINTS= 11	$$ modification sequence number
$$ ##ORIGIN= Bruker BioSpin GmbH
$$ ##OWNER= nmrsu
$$ $$ 2020-02-27 16:12:43.857 +0000  nmrsu@nmrpc
$$ $$ /opt/topspin/data/ug1/nmr/Feb27-2020/360/acqus
$$ $$ process /opt/topspin3.2/prog/mod/shimcntl
$$ ##$ACQT0= -2.04831932773109
$$ ##$AMP= (0..31)
$$ 100 100 100 100 100 100 100 100 100 100 100 100 100 100 100 100 100 100
$$ 100 100 100 100 100 100 100 100 100 100 100 100 100 100
$$ ##$AMPCOIL= (0..19)
$$ -1 0 0 0 0 0 0 0 0 0 0 0 0 0 0 0 0 0 0 0
$$ ##$ANAVPT= -1
$$ ##$AQSEQ= 0
$$ ##$AQ_mod= 3
$$ ##$AUNM= <au_zg>
$$ ##$AUTOPOS= <36 >
$$ ##$BF1= 400.05
$$ ##$BF2= 400.05
$$ ##$BF3= 400.05
$$ ##$BF4= 400.05
$$ ##$BF5= 400.05
$$ ##$BF6= 400.05
$$ ##$BF7= 400.05
$$ ##$BF8= 400.05
$$ [...]
$$ ##$SguType= 3
$$ ##$ShimPowMaxUA= (0..63)
$$ 130000 130000 130000 130000 130000 130000 130000 130000 130000 130000 130000
$$ 130000 130000 130000 130000 130000 130000 130000 130000 130000 130000 130000
$$ 130000 130000 130000 130000 130000 130000 130000 130000 130000 130000 130000
$$ 130000 130000 130000 130000 130000 130000 130000 0 0 0 0 0 0 0 0 0 0 0
$$ 0 0 0 0 0 0 0 0 0 0 0 0 0
$$ ##$ShimPowMaxUC= (0..63)
$$ 130000 130000 130000 130000 130000 130000 130000 130000 130000 130000 130000
$$ 130000 130000 130000 130000 130000 130000 130000 130000 130000 130000 130000
$$ 130000 130000 130000 130000 130000 130000 130000 130000 130000 130000 130000
$$ 130000 130000 130000 130000 130000 130000 130000 0 0 0 0 0 0 0 0 0 0 0
$$ 0 0 0 0 0 0 0 0 0 0 0 0 0
$$ ##$ShimPowMaxUG= (0..63)
$$ 524287 524287 524287 524287 524287 524287 524287 524287 524287 524287 524287
$$ 524287 524287 524287 524287 524287 524287 524287 524287 524287 524287 524287
$$ 524287 524287 524287 524287 524287 524287 524287 524287 524287 524287 524287
$$ 524287 524287 524287 524287 524287 524287 0 0 0 0 0 0 0 0 0 0 0 0 0 0 0
$$ 0 0 0 0 0 0 0 0 0 0
$$ ##$ShimPowRcbType= 3
$$ ##$ShimPowRes= (0..63)
$$ 1e-20 1e-20 1e-20 1e-20 1e-20 1e-20 1e-20 1e-20 1e-20 1e-20 1e-20 1e-20
$$ 1e-20 1e-20 1e-20 1e-20 1e-20 1e-20 1e-20 1e-20 1e-20 1e-20 1e-20 1e-20
$$ 1e-20 1e-20 1e-20 1e-20 1e-20 1e-20 1e-20 1e-20 1e-20 1e-20 1e-20 1e-20
$$ 1e-20 1e-20 1e-20 1e-20 0 0 0 0 0 0 0 0 0 0 0 0 0 0 0 0 0 0 0 0 0 0 0 0
$$ ##$ShimPowRng0= (0..63)
$$ 1 1 1 1 1 1 1 1 1 1 1 1 1 1 1 1 1 1 1 1 1 1 1 1 1 1 1 1 1 1 1 1 1 1 1 1
$$ 1 1 1 1 0 0 0 0 0 0 0 0 0 0 0 0 0 0 0 0 0 0 0 0 0 0 0 0
$$ ##$ShimPowRng1= (0..63)
$$ 1 1 1 1 1 1 1 1 1 1 1 1 1 1 1 1 1 1 1 1 1 1 1 1 1 1 1 1 1 1 1 1 1 1 1 1
$$ 1 1 1 1 0 0 0 0 0 0 0 0 0 0 0 0 0 0 0 0 0 0 0 0 0 0 0 0
$$ ##$ShimPowRng2= (0..63)
$$ 1 1 1 1 1 1 1 1 1 1 1 1 1 1 1 1 1 1 1 1 1 1 1 1 1 1 1 1 1 1 1 1 1 1 1 1
$$ 1 1 1 1 0 0 0 0 0 0 0 0 0 0 0 0 0 0 0 0 0 0 0 0 0 0 0 0
$$ ##$ShimPowRng3= (0..63)
$$ 1 1 1 1 1 1 1 1 1 1 1 1 1 1 1 1 1 1 1 1 1 1 1 1 1 1 1 1 1 1 1 1 1 1 1 1
$$ 1 1 1 1 0 0 0 0 0 0 0 0 0 0 0 0 0 0 0 0 0 0 0 0 0 0 0 0
$$ ##$ShimSysFunc= (0..63)
$$ 1 2 3 4 5 6 7 8 9 10 0 37 38 35 16 15 14 13 12 11 28 27 26 25 24 23 36
$$ 22 30 29 20 21 34 33 32 31 17 18 19 0 0 0 0 0 0 0 0 0 0 0 0 0 0 0 0 0 0
$$ 0 0 0 0 0 0 0
$$ ##$ShimSysMatrix= 0
$$ ##$ShimSysType= 4
$$ ##$TFXNUM= 0
$$ ##$TRIPLO2= 0
$$ ##$VTU= 2
$$ ##$VTUETH= <149.236.99.20>
$$ ##$VTUTY= <no>
$$ ##$WBREFAM= (0..15)
$$ 136.7 118.7 100 100 100 100 100 100 100 100 100 100 100 100 100 100
$$ ##$WBREFLM= (0..15)
$$ 0 0 0 0 0 0 0 0 0 0 0 0 0 0 0 0
$$ ##$WBREFPH= (0..15)
$$ 77.55 -71.28 0 0 0 0 0 0 0 0 0 0 0 0 0 0
$$ ##$WBSGU= (0..15)
$$ 0 0 0 0 0 0 0 0 0 0 0 0 0 0 0 0
$$ ##$XFAC= 2
$$ ##END=
$$ 
##$DECIM=	2496
##$DSPFVS=	20
##XUNITS=	HZ
##YUNITS=	ARBITRARY UNITS
##FIRSTX=	6397.2291402197533898
##LASTX=	-1615.469106662745844
##XFACTOR=	-0.12226593800080108598
##YFACTOR=	3.3059593750000002335e-05
##NPOINTS=	65536
##XYDATA=	(X++(Y..Y))
$$ [...]
-18472b3785J3570J3569J1185N460k053p779p722j998K415l309p722p723m860m860q006k280
-18456c5898L086L086l355l354m92m92j946j945R17R17J513J513M375M376j364j364L406L407
-18438b3614m10m10l272l273k676k672M003M006N315N319O030L10m823R05P462P465O7n654
-18420e922n300n296q579q576J915J920L05L10L05L10n986n982l123l120l898l895Q72Q76
-18402e2864p27p27K136K136j860j860K911K911p87p86p87p86l172l171J598J599N93N96N93
-18383e2454N96P72P75N542N546j554j551J309J311m80m77M289M294K944K949Q2Q5m569m566
-18364c5157j707j703m55m51M316M320l914l909Q57Q61k087k087P15L578J730l996l816J908
-18346d0997J774J774K132K132k54k53k53k54M81M84M81M85k35k31k35k31J644J647J465J468
$$ plain form
-18472 -23785 -10215 3354 14539 19999 17946 10167 2445 447 2862 -447 -8169 -15892 -20752 -25612 -33618 -35898
-18456 -35898 -32812 -29726 -33081 -36435 -36927 -37419 -39365 -41310 -40393 -39476 -37963 -36450 -32075 -27699 -29063 -30427 -27021 -23614
-18438 -23614 -24024 -24434 -27706 -30979 -33655 -36327 -32324 -28318 -23003 -17684 -11654 -11344 -16167 -15262 -7800 -335 -268 -5922
-18420 -5922 -11222 -16518 -25097 -33673 -31758 -29838 -29533 -29223 -28918 -28608 -34594 -40576 -43699 -46819 -50717 -54612 -53740 -52864
-18402 -52864 -53591 -54318 -52182 -50046 -51906 -53766 -50855 -47944 -48731 -49517 -50304 -51090 -54262 -57433 -55835 -54236 -53643 -53047 -52454
-18383 -52454 -51858 -51086 -50311 -44769 -39223 -40777 -42328 -41019 -39708 -40188 -40665 -36376 -32082 -29138 -26189 -26107 -26022 -30591 -35157
-18364 -35157 -36864 -38567 -39022 -39473 -35157 -30837 -34751 -38660 -37803 -36942 -39029 -41116 -40401 -36823 -35093 -39089 -42905 -40997
-18346 -40997 -39223 -37449 -35317 -33185 -33439 -33692 -33945 -34199 -33718 -33234 -32753 -32268 -32503 -32734 -32969 -33200 -31556 -29909 -28444 -26976
-18326b6976K002q58k650L079L574P16q98M830M409j312J547P275J741l981P87O514N616j04
-18308E311j361J506m51o175n639L903P121J398J636P361P450J726J726P450M946p79o4R478
-18290D6543J1044N318Q181J7722J9392J3668J4144K7502K9351J9809K1062M2052N4695N7557
-18276C88040Q7672J62094K43606L16123M26917N98665P34446O92468M53932J29531j90703
-18265D042791m84572p13568p86077o56080m23269k48190j68038j31473q9487n1445m5716
-18254B44876m3096l1643j6977k2698k7562k1833j2057j2053j4085j4081m543m540m778m778
-18240A0152R47R47m540m540J186J185n582n583J41J42n762n762l8l7m264m263j402j401n278
-18221c3752n277M47M47K281K281J1823J1822J2537J2538K996K997o817o813j2541j2538r858
$$ plain form
-18326 -26976 -24974 -25832 -28482 -25403 -21829 -21113 -22011 -17181 -12772 -14084 -12537 -5262 -3521 -7502 -6715 -201 5415 5311
-18308 5311 3950 5456 5005 -1170 -6809 -2906 4215 5613 7249 14610 22060 23786 25512 32962 37908 37129 37065 46543
-18290 46543 57587 62905 71086 88808 108200 121868 136012 163514 192865 212674 233736 275788 330483 388040
-18276 388040 475712 637806 881412 1197535 1624452 2223117 2957563 3650031 4103963 4233494 4042791
-18265 4042791 3558219 2844651 2058574 1402494 979225 731035 562997 431524 342037 290592 244876
-18254 244876 201780 170137 153160 130462 102900 81067 69010 56957 42872 28791 24248 19708 14930 10152
-18240 10152 11099 12046 7506 2966 4152 5337 -245 -5828 -5687 -5545 -11307 -17069 -17107 -17144 -21408 -25671 -27073 -28474 -33752
-18221 -33752 -39029 -38582 -38135 -35854 -33573 -21750 -9928 2609 15147 18143 21140 14323 7510 -5031 -17569 -27427
-18205b7427r854l17l13k926k922o3o0l105l100l105l101j957j953L768L772p04p01p04p01
-18186e5473l91l88K471K475k896k892K828K833j252j249J610J614n248n244M77M81J49J53
-18168e9942J49J53J223J226J222J226j431j427j431j428%M%MJ177J182J178J181k53k50k54
-18147e6491k49M8N2M9N2K27K31j680J185J479l287k039Q28j085j081r05r02J315J316J137
-18127e9800J137J613j248k501K270K270n93m73K389R57j904j905R58J249j614j614J249J427
-18109e6133j435L54L54j270j271J353O123K546m134n624q53K64K69N62N67l32l28l31l28
-18090e9647J233J238J233J238j98j94j97j94j092j088j271j267J054j804l16M457N572Q05
-18072e0438l552o85Q01Q05R80R84q76q76q76q75j61j60j60j60J97J98J97J98j234j234j412
$$ plain form
-18205 -27427 -37281 -37598 -37911 -40837 -43759 -43822 -43882 -46987 -50087 -53192 -56293 -58250 -60203 -56435 -52663 -53367 -54068 -54772 -55473
-18186 -55473 -55864 -56252 -53781 -51306 -54202 -57094 -54266 -51433 -52685 -53934 -52324 -50710 -55958 -61202 -60725 -60244 -60095 -59942
-18168 -59942 -59793 -59640 -58417 -57191 -55969 -54743 -56174 -57601 -59032 -60460 -60460 -60456 -60456 -60452 -59275 -58093 -56915 -55734 -55987 -56237 -56491
-18147 -56491 -56740 -56692 -56640 -56591 -56539 -56312 -56081 -57761 -56576 -55097 -58384 -60423 -59595 -60680 -61761 -62666 -63568 -62253 -60937 -59800
-18127 -59800 -58663 -57050 -58298 -60799 -58529 -56259 -56852 -57325 -54936 -53979 -55883 -57788 -56830 -55581 -57195 -58809 -57560 -56133
-18109 -56133 -57568 -57214 -56860 -58130 -59401 -58048 -51925 -49379 -53513 -59137 -59990 -59726 -59457 -58895 -58328 -58660 -58988 -59319 -59647
-18090 -59647 -58414 -57176 -55943 -54705 -54903 -55097 -55294 -55488 -56580 -57668 -58939 -60206 -59152 -60956 -61272 -56815 -51243 -50438
-18072 -50438 -53990 -54675 -53874 -53069 -52089 -51105 -51981 -52857 -53733 -54608 -54769 -54929 -55089 -55249 -55052 -54854 -54657 -54459 -55693 -56927 -58339
-18051e8339j413J007j853l108J666K557l02k870mM376M379j349j346K61k598l853R20K210
-18033e9659o52n33K330M655J792k143k143O30O30O30O30o23o22o22o23N33N37k330k325M886
-18013e5022M890q39q35j300j297j301j297P27P30P27P30n85n81n85n82r43r39r43r39M394
-17993e5790M398j330j327K724K728l000k996j383j379j383j379J599J603J598J603J733J737
-17976e0244J733J737o52o49o52o49o00n96o00n96o4n9o4n9J204J207j658j655K993K996k732
-17955d9659k728n44n41l406l403J841J845j021j018o03o00o04o00O015O019l525l522p5p1
-17936e6200p4p1o71o67o71o67J401J405J402J405k09k05k09k05R95R96j868j867L679L678
-17916d8623k046k046j53j53j52j53K709K710l015l016P94P94P94P94M36M36M36M36j412j413
$$ plain form
-18051 -58339 -59752 -58745 -60598 -63706 -62040 -59483 -59785 -62655 -62659 -58283 -53904 -55253 -56599 -56338 -58936 -62789 -61869 -59659
-18033 -59659 -60311 -60844 -58514 -53859 -52067 -54210 -56353 -55723 -55093 -54463 -53833 -54456 -55078 -55700 -56323 -55790 -55253 -57583 -59908 -55022
-18013 -55022 -50132 -50971 -51806 -53106 -54403 -55704 -57001 -56274 -55544 -54817 -54087 -54672 -55253 -55838 -56420 -57363 -58302 -59245 -60184 -55790
-17993 -55790 -51392 -52722 -54049 -51325 -48597 -51597 -54593 -55976 -57355 -58738 -60117 -58518 -56915 -55317 -53714 -51981 -50244
-17976 -50244 -48511 -46774 -47426 -48075 -48727 -49376 -49976 -50572 -51172 -51768 -51832 -51891 -51955 -52014 -50810 -49603 -51261 -52916 -49923 -46927 -49659
-17955 -49659 -52387 -52931 -53472 -56878 -60281 -58440 -56595 -57616 -58634 -59237 -59837 -60441 -61041 -55026 -49007 -52532 -56054 -56129 -56200
-17936 -56200 -56274 -56345 -57016 -57683 -58354 -59021 -57620 -56215 -54813 -53408 -53617 -53822 -54031 -54236 -53241 -52245 -54113 -55980 -52301 -48623
-17916 -48623 -50669 -52715 -52868 -53021 -53173 -53326 -50617 -47907 -50922 -53938 -53144 -52350 -51556 -50762 -50326 -49890 -49454 -49018 -50430 -51843
-17896e1843j412j413R73R73R72R73j573j569j573j569Q13Q16Q12Q17N14N18N14N18K304K307
-17876d7128l422l417L421L425L422L425K944K948k780k777L81L83L81L83j408j405j409j405
-17858d4038m07m06m06m06J979J979J979J979k180k181k180k180r28r29r28r28Q65Q65j998
-17839e0449j998L191L190k534k535M130M129j595j595J446J446j416j416N89N88N89N89N062
-17821c8589N061o63o64M167M167M167M167O433O432l108l108L552L551k172k173O295O294
-17804C809O295O295q61q61o586o586k947k948q6q5Q232Q237K508K512k799k795q524q519
-17786e709n33n29n33n30q90q87q91q87j912j908j912j909j912j908j912j908o00n97o00n96
-17766b9063J606J610J607J610N449N453K586K591P714P718k780k777K61K65K61K64P715P719
$$ plain form
-17896 -51843 -53255 -54668 -53695 -52722 -51750 -50777 -52350 -53919 -55492 -57061 -56248 -55432 -54620 -53803 -53289 -52771 -52257 -51739 -49435 -47128
-17876 -47128 -50550 -53967 -50546 -47121 -43699 -40274 -37330 -34382 -37162 -39939 -39558 -39175 -38794 -38411 -39819 -41224 -42633 -44038
-17858 -44038 -44445 -44851 -45257 -45663 -43684 -41705 -39726 -37747 -39927 -42108 -44288 -46468 -47396 -48325 -49253 -50181 -49316 -48451 -50449
-17839 -50449 -52447 -49256 -46066 -48600 -51135 -47005 -42876 -44471 -46066 -44620 -43174 -44590 -46006 -45417 -44829 -44240 -43651 -38589
-17821 -38589 -33528 -34191 -34855 -30688 -26521 -22354 -18187 -11754 -5322 -8430 -11538 -7986 -4435 -6607 -8780 -2485 3809
-17804 3809 10104 16399 15538 14677 8091 1505 -1442 -4390 -4476 -4561 3671 11908 14416 16928 14129 11334 2810 -5709
-17786 -5709 -6242 -6771 -7304 -7834 -8724 -9611 -10502 -11389 -13301 -15209 -17121 -19030 -20942 -22850 -24762 -26670 -27270 -27867 -28467 -29063
-17766 -29063 -27457 -25847 -24240 -22630 -17181 -11728 -9142 -6551 1163 8881 6101 3324 3585 3850 4111 4375 12090 19809
-17748A9809J4394J4398J1934J1938J081q457n181n177k914k911M241M245M242M245m048m044
-17732E7795q818q814P53P56k109k106k229k225k229k225P372P376P730P734J1308J7036J4051
-17715A01156M514Q9n631j1599j1595l727l723M860M863J2210J2214Q990n48m726m722q185
-17699I4440q181m767m767j904j905P79P79n900n900n065n065n065n065p868p868p868p868
-17682A0942K255K255K255K255J658J659M521M521P607P607J2377J2378J0946J0947K359K359
-17666I8901K263K262J1446J1446K0271K9813L4107L4106K5400J2042k150j1692r187L54R060
-17651B68442R061J6760K2490J7118L764j4606l1777m2396m2391l6582k7036j8810j3082n095
-17637A05860M450Q382Q386J7014K2743J6417p52j5129k0849j8110j8106j1192j648L478L481
$$ plain form
-17748 19809 34203 48601 60535 72473 73554 65097 59916 54739 51825 48914 53155 57400 61642 65887 61839 57795
-17732 57795 48977 40163 40916 41672 39563 37457 35228 33003 30774 28549 35921 43297 51027 58761 70069 87105 101156
-17715 101156 105670 105759 100128 88529 76934 73207 69484 74344 79207 91417 103631 112621 112073 107347 102625 94440
-17699 94440 86259 81492 76725 74821 72916 73695 74474 68574 62674 57609 52544 47479 42414 34546 26678 18810 10942
-17682 10942 13197 15452 17707 19962 21620 23279 27800 32321 39928 47535 59912 72290 83236 94183 96542 98901
-17666 98901 101164 103426 114872 126318 146589 176402 210509 244615 270015 282057 279907 268215 259028 259382 268442
-17651 268442 277503 294263 316753 333871 337635 323029 291252 248856 206465 169883 142847 124037 110955 105860
-17637 105860 110310 118692 127078 144092 166835 183252 182500 167371 146522 128412 110306 99114 97466 100944 104425
-17622A04425Q665Q670K1426K1431L1095L6820L5746K6205J5710R985P838P838J696J695j6432
-17607C22813j6433j2914j2915r097j4823j2791l246p46j0283k0007k0003j5833j5829n217
-17593A52676n215L966L969J2315K1859L2947L8676M1184L5463J2441j9995l8248l8243l2642
-17579B21153k3097j4930n386j573j569L854L858L853L858L011L012L965j759l011O530J4282
-17563B16051J4282K892j0466k4419l3961k8595j5236m860m860K31N956L332o209j3306j3306
-17548H7526p223p223o04o03o04o04P68P68R355R355L417L418l261l261m216m215O280O280
-17530I5353P056P055J9r523j3160j3161p077p078M416M417M417M416J018J017J614p928r537
-17513F3334r538m767m767k739O802J3242P518j335j334m197m196n390L36P611P610J2024
$$ plain form
-17622 104425 113090 121760 143186 164617 195712 232532 268278 294483 310193 320178 328016 335854 337550 339245 322813
-17607 322813 306380 293466 280551 271454 256631 243840 240594 239848 229565 209558 189555 173722 157893 152676
-17593 152676 147461 151427 155396 167711 189570 222517 261193 302377 337840 350281 330286 292038 253795 221153
-17579 221153 198056 183126 177740 176167 174598 178452 182310 186163 190021 193032 196044 200009 198250 195239 201769 216051
-17563 216051 230333 233225 222759 198340 164379 135784 120548 115688 110828 111059 117015 120347 114138 100832 87526
-17548 87526 80303 73080 72476 71873 71269 70665 71433 72201 81556 90911 94328 97746 94485 91224 87008 82793 89073 95353
-17530 95353 102409 109464 109483 99960 86800 73639 66562 59484 63900 68317 72734 77150 78168 79185 80799 72871 63334
-17513 63334 53796 49029 44262 41523 48325 61567 69085 67750 66416 62219 58023 52633 52969 60580 68190 80214
-17497H0214J2023J0712J170o522o523o760o761p872k147k147k146p037j312K147K147J789
-17481F0975J789K146K147L996R720J1867K326q849q848r086r087p655j931N703N702P432
-17465F8347J3156J7928J7927J3395L854p000j6540j4760r034J49J49Q736J8278L0085L9626
-17450A84296N1553O1094N2984K4360l071k4062l5511m1237l7837k0659n397M148J7026L4203
-17436B61890N1851O5213P1649N4479M860n8109r2700p9338n0957l3778k5806j2445M32R978
-17422A67219J9872L3235L2992M372k8252m1605l2426l2421l1591k2046r288r284r481r482
-17408C1814K922K922j073j074j073j074q110q110j431j431m592m592L996L995J036J036M257
-17391A9418M256K348Q073K0119K5843K8766L4490L0197J3022j2381k1923j1904J454J1349
$$ plain form
-17497 80214 92237 102949 104119 97597 91074 84314 77553 69681 67534 65387 63241 56204 54892 57039 59186 60975
-17481 60975 62764 64910 67057 71053 80773 92640 94966 86117 77269 68183 59096 51441 49510 55213 60915 68347
-17465 68347 81503 99431 117358 130753 134607 127607 111067 96307 87273 87422 87571 96307 114585 144670 184296
-17450 184296 235849 296943 349927 374287 371216 347154 311643 270406 232569 211910 206513 210661 227687 261890
-17436 261890 313741 378954 450603 505082 509942 451833 359133 279795 228838 195060 169254 156809 157241 167219
-17422 167219 187091 220326 253318 257690 229438 187833 155407 122986 91395 69349 60061 50777 41296 31814
-17408 31814 34736 37658 36585 35511 34438 33364 25254 17144 15713 14282 9690 5098 9094 13089 14125 15161 19418
-17391 19418 23674 26022 34095 54214 80057 108823 143313 173510 186532 174151 152228 140324 141778 153127
-17377A53127K4710M7367O8362O6331L7711m275m0528m4766k3772n765n762j5188n643J2243
-17363B64152J2247K993o544K635J5996J5397j774l0879n1866n2943l5765j4301m756k493
-17349A12099P052J3488P767j1304k0846j8698j8699j4525j4524m029m029p130p130m51m51
-17334A8590j763j762M916M916n71n70M200M201N751N751J2429J2430n162n162J517J517j703
-17317E9525j703R388R389J1553K1096L7673M7215M1012L5288K8371J1196j0093j5818j267
-17303B82825J9724K9503L5228L1651K2109J8836M3644Q1333Q7057M2213j678q594M763p581
-17289F81033m7654p9857p4131m2407r966J4841K4383K3376J3839n129l3749n7247n7245m3532
-17275C06555k6354k7968l7505m4189l8459k7789j8244p037p033k117k113k117k113j2673
$$ plain form
-17377 153127 177837 225204 293566 359897 397608 393333 352805 308039 284267 278502 272740 257552 251909 264152
-17363 264152 276399 279392 272848 275483 291479 306876 305102 274223 222357 169414 133649 119348 114592 112099
-17349 112099 119151 132639 140406 129102 108256 89558 70859 56334 41810 37781 33752 26622 19492 19041 18590
-17334 18590 16827 15065 19981 24897 24326 23756 27956 32157 37908 43659 56088 68518 63356 58194 59711 61228 59525
-17317 59525 57822 67210 76599 88152 109248 146921 194136 235148 270436 298807 310003 299910 284092 282825
-17303 282825 302549 332052 367280 398931 421040 439876 483520 564853 651910 694123 692445 683851 688614 681033
-17289 681033 633379 553522 479391 436984 427018 441859 466242 489618 503457 498328 464579 407332 350087 306555
-17275 306555 280201 252233 214728 170539 132080 104291 86047 79010 71977 69860 67747 65630 63517 50844
-17261E0844j2668p901p898o157o153l295l291r138r135n52n48l555l552J215J219o478o474
-17244c3517K110K113q87q83q88q83n836n833Q42Q46n755n750M740M745N158N162K296K300
-17226b9920n039n036n039n035p722p719Q65Q68P767P771K1483K1487J0748J211k013k009
-17210B668q213q211j535j532l802l798P052J6596J7971J7976J6899P361m808j0529m450J278
-17194D0923m927m924K02K05j767j763Q729Q732n55n52n55n52o459o455K20K24n460n457L127
-17175B2936L131m029m025K650K653m707m704O4O7O3O7K926K930o333o328K255K258n617n613
-17156F44K971K974j856j852J006J010k572k567K198K203p610p607m748m744m749m744L839
-17139b6204J3384J0078M356L041L045p216j2935q409J137J029J032J7607K3334J1166k187
$$ plain form
-17261 50844 38176 30275 22377 16220 10067 6772 3481 -5657 -14792 -15344 -15892 -19447 -22999 -21784 -20565 -27043 -33517
-17244 -33517 -31407 -29294 -30181 -31064 -31952 -32835 -38671 -44504 -43662 -42816 -48571 -54321 -49581 -44836 -39678 -34516 -32220 -29920
-17226 -29920 -34959 -39995 -45034 -50069 -57791 -65510 -64645 -63777 -56010 -48239 -26756 -5269 5479 6690 4677 2668
-17210 2668 -5545 -13756 -15291 -16823 -20625 -24423 -17371 -775 17196 35172 52071 59432 54624 44095 39645 40923
-17194 40923 35996 31072 31274 31479 29712 27949 36678 45410 44855 44303 43748 43196 36737 30282 30502 30726 25266 19809 22936
-17175 22936 26067 22038 18013 20663 23316 18609 13905 13969 14036 14099 14166 17092 20022 13689 7361 9616 11874 6257 644
-17156 644 3615 6589 4733 2881 3887 4897 2325 -242 1956 4159 -3451 -11058 -15806 -20550 -25299 -30043 -26204
-17139 -26204 -12820 -2742 1614 4655 7700 484 -12451 -20860 -19723 -18694 -17662 -55 23279 34445 32258
-17124C2258k84R262M223n315n080M465L686k035j442M286k65k61J0350J6079O593o761j994
-17107F7765P551j777j1316m879Q483O034l503j122M607j122j0660n892L653J263m458P1R616
-17090F4314L369o168m025J703l966j3503p066K478j163j0700m47J2914J2076K538P544J3272
-17074G3170P491n863o582q53o582j6120p774N586J051m670Q207K9202K5620M633k050L678
-17058A08144K792k933J122J0663J241j2117r493P682R649J08K971K0145K5154J5612J0723
-17043A91463J0723O75j2684q509M849K762o779q17J6359J1587n587k963J0395J0991J450
-17028B23915J450J0991K918j0439p578N781K441p100P72J7946J6037j137J011J4367P153
-17013B78528j0022p637J3354J8520J345k471P070K479j0879o825J0350J1961n215n214J1960
$$ plain form
-17124 32258 31974 41236 45459 40144 35064 39529 43215 41180 39738 44024 43759 43498 53848 69927 76520 69759 67765
-17107 67765 75316 73539 62223 57344 65827 71861 68358 67236 71843 70721 60061 54169 57822 59085 54627 54698 64314
-17090 64314 67683 61515 57490 59193 55227 41724 34658 37136 35973 25273 24826 37740 49816 52354 59898 73170
-17074 73170 80661 74798 68216 67363 60781 44661 36887 42473 43524 38854 47061 76263 101883 106516 104466 108144
-17058 108144 110936 108003 109125 119788 121029 108912 99419 107101 116750 116858 119829 139974 165128 180740 191463
-17043 191463 202186 202861 190177 181668 186517 189279 182500 181683 198042 209629 204042 201079 211474 222465 223915
-17028 223915 225365 236356 239274 228835 221257 227038 229479 222379 223151 241097 257134 255997 257008 271375 278528
-17013 278528 268506 260869 274223 292743 294088 291617 298687 301166 290287 283462 293812 305773 300558 295344 307304
-16998C07304Q323q852j1118R873J4569m513m394J4688J3257n825n826J3258J0693q390q390
-16983C34657J0693J4629m454m454J4629J3101n982j1707P376J3936n147n148J3936J1908
-16969C97973p175j1468J5248J3458n624r918J6798K1062n654p085J1997J7722q993r471J7246
-16954D46116J7304r411j5135J1580K1360n356j1081J5635K5460j256j733K4983L2257k090
-16940E48633j8789P928K0510o206j1930J4785K1107n610j0380K3969M1363P015r683J7033
-16926F39745K8482n867j5884J8464K5858q490j3261K8721M5776L794j6243J8106L6227J879
-16912G87307j2434K9548M2668O86k3645J8338M7438J3089n039L6943N4356M740j2433K9548
-16898A011110M9768J56k8471K1148N2630J0652j8453L8799P0221K8244K956N2574P8570K1327
$$ plain form
-16998 307304 315627 306775 295657 305530 320099 315586 311192 325880 339137 333312 327486 340744 351437 343047 334657
-16983 334657 345350 359979 355525 351071 365700 378801 372819 361112 368488 382424 377277 372129 386065 397973
-16969 397973 390798 379330 394578 408036 402412 392494 409292 430354 424700 417615 429612 447334 438341 428870 446116
-16954 446116 463420 454009 438874 450454 471814 466458 455377 471012 496472 495216 493483 518466 550723 548633
-16940 548633 529844 537772 558282 552076 540146 554931 576038 570428 560048 584017 625380 632395 622712 639745
-16926 639745 668227 662360 646476 664940 690798 682308 669047 697768 743544 747338 731095 749201 785428 787307
-16912 787307 774873 804421 847089 847775 824130 842468 889906 902995 897956 934899 989255 993995 981562 1011110
-16898 1011110 1060878 1061034 1032563 1053711 1106341 1116993 1098540 1137339 1207560 1235804 1238760 1291334 1369904 1391231
-16884A391231j4935L4684O1255M010k9388L5497P0080J2836j3406O6744J18980N4102J8318
-16871A810008Q3204J18502M5992Q300R6084J56653Q4138N4561J49974J70964K9754m9440
-16859B758694P6506J84501J19620Q8135K44611L54575K74429K64886M74796N82091L72182
-16848E795026J84695L03007M50898M16549N69687J138349J786382K423743L572993M981288
-16838B1622617M879677K181393j430947l236162k747709j637093q29427K35387J719056L081560
-16828B3838352M821892Q153719J2099462J3133749R163133K205601m063035p875740r328410
-16819E2148723q614714o135608l139634o34567J727863M535629P462908J0052410J2086631
-16810F9489641J1922509O644267l621243j3296116j6286138j2648980p635024m806980l248685
$$ plain form
-16884 1391231 1376296 1410980 1472235 1476245 1446857 1482354 1552434 1565270 1551864 1618608 1737588 1791690 1810008
-16871 1810008 1893212 2011714 2057706 2066006 2162090 2318743 2402881 2457442 2607416 2778380 2808134 2758694
-16859 2758694 2835200 3019701 3139321 3227456 3472067 3826642 4101071 4365957 4840753 5422844 5795026
-16848 5795026 5979721 6282728 6733626 7150175 7719862 8858211 10644593 13068336 16641329 21622617
-16838 21622617 26502294 28683687 27252740 24016578 21268869 19631776 18802349 19037736 20756792 23838352
-16828 23838352 28660244 36813963 48913425 62047174 71210307 73415908 69352873 61477133 52148723
-16819 52148723 43534009 37398401 34258767 33624200 35352063 39887692 47350600 57403010 69489641
-16810 69489641 81412150 88056417 84435174 71139058 54852920 42203940 34568916 29761936 26513251
-16801B6513251j321340O01231K032429L653976N115702M162051o2841m839819o858760o041068
-16791B2954812m564074l537428k556583j553790j061460r80426p24718l01561j83249k95360
-16781G196163k07579n9689k69598o27397o08314l16351k28570l08956j75377O9357N7908
-16770D521597r6133k3619J56236R1354r1839l4591J50033J23318L0111J78956M23451M23452
-16758E852326L60002N39378P56205O68424N53116R08053J571652K147946K997360M772046
-16748B1126508O908819P439317M918087J97047l875182m741537k414886P18479K961759N522649
-16738C8761060J0151915J4653510J3486483M664591n954173j0226767o782127j757664o28212
-16729E6368616k255962k170567P85333L358385K585537l08340j359794J273786M569363L572288
$$ plain form
-16801 26513251 25191911 25793142 27825571 31479547 36595249 40757300 40694459 35854640 28995880 22954812
-16791 22954812 18390738 14853310 12296727 10742937 9681477 8701051 7976333 7674772 7491523 7196163
-16781 7196163 6988584 6928895 6659297 6031900 5423586 5107235 4878665 4569709 4394332 4463689 4521597
-16770 4521597 4425464 4401845 4558081 4649435 4557596 4523005 4673038 4796356 4826467 5005423 5428874 5852326
-16758 5852326 6212328 6751706 7507911 8176335 8729451 9637504 11209156 13357102 16354462 21126508
-16748 21126508 28035327 35474644 40392731 40589778 36714596 31973059 29558173 30276652 33238411 38761060
-16738 38761060 48912975 63566485 77052968 81717559 75763386 65536619 58754492 56996828 56368616
-16729 56368616 54112654 51942087 52727420 56085805 58671342 58363002 57003208 58276994 62846357 66418645
-16719F6418645k677272r365013j1130154p970071m128741k182194q48320J343320L150442
-16710C2610642K639030O0969k707206m281521m245509k804770r60437R1019M67421J312783
-16700B2182421K501865K270970O9606k103898k411373j531659r50837n21473N01589J644643
-16690B1651854K425250L946142P056840R898248R688573O255615J776684k274560n650153
-16681E4774493p522156o833991m309360j811449K24674K722105N678009Q313780J0895663
-16672F2131768J3443917J3014546O173186m877541j2404940j1288593m504431J237530K602182
-16663F5527624O34759k239320l454887r71760M125212P433841O542672M809268O307243Q591913
-16653I7306565N189492m617327j3263638j3904711q372649l617033k786930k973944p85162
$$ plain form
-16719 66418645 63741373 54376360 43246206 35276135 31147394 28965200 28116880 29460200 32610642
-16710 32610642 35249672 35310641 32603435 28321914 24076405 21271635 20311198 20402217 20869638 22182421
-16700 22182421 24684286 26955256 27024862 24920964 22509591 20977932 20027095 19505622 20007211 21651854
-16690 21651854 24077104 28023246 35080086 44978334 54666907 60922522 62699206 60424646 54774493
-16681 54774493 47252337 40418346 36108986 34297537 34522211 37244316 42922325 51236105 62131768
-16672 62131768 75575685 88590231 94763417 89885876 77480936 66192343 61687912 62925442 65527624
-16663 65527624 66162383 63923063 60468176 59496416 63621628 71055469 77598141 82407409 88714652 97306565
-16653 97306565 102496057 97878730 84615092 70710381 62337732 58720699 55933769 52959825 52174663
-16644E2174663K861757M229987J605426k441998l767522j399372J041059m68378n353768
-16635D8481854r034802q483438n329077k864557j870354q53251P93580J859582J208866p61871
-16625B3146532k756002l716813l321803k093360j072439q84475j157358j165824q28063n74741
-16615E575654n27034m33530k40795j54685j83308j63734j35111k45074l61477k30285K7331
-16604B927952N6193j59441k98863k28257j51688j68863j40715k0495M2477K404k6578k0853
-16592A813273p6431j73752j57055k9202K4468m2321p8578p972O4781N9055M4744N8101K8523
-16579A527634m9715r4131p6957q4590j24663j01048j5177L0145J2970K3645R4250J42434
-16567A284797J29076Q6140J5534j16851k37072k20382j03977l3134n4125n4840J1949N4169
$$ plain form
-16644 52174663 55036420 59266407 60871833 58429835 54662313 53262941 54304000 53835622 48481854
-16635 48481854 39447052 30963614 25634537 22769980 20899626 20046375 20839955 22699537 23908403 23146532
-16625 23146532 20390530 16673717 13351914 11258554 10186115 9301640 8144282 6978458 6150395 5575654
-16615 5575654 5048620 4615090 4374295 4219610 4036302 3872568 3737457 3492383 3130906 2900621 2927952
-16604 2927952 2984145 2824704 2525841 2297584 2145896 1977033 1836318 1815823 1858300 1860704 1834126 1813273
-16592 1813273 1736842 1563090 1406035 1376833 1401301 1358980 1280402 1272430 1337211 1396266 1441010 1499111 1527634
-16579 1527634 1477919 1383788 1306831 1222241 1097578 996530 981353 1011498 1024468 1048113 1142363 1284797
-16567 1284797 1413873 1500013 1515547 1398696 1161624 941242 837265 804131 750006 695166 707115 761284
-16555G61284M0812N1486R9192R0605Q550l8918j4111j4349r2588j40973q5633n725L817P394
-16541F70843Q5633J85102J98459J07698k0156j27019j67092j11514j8010J1569l2321m0901
-16529G42291L3522Q3016K7678n9268n9268L347L9604K1773k9749r1530j39236j23016n6226
-16516C92938n181j0905j4029K6045N7292J7219m0625n3983l8120l8121m3219k2228P90q751
-16502B19122k6641j3284M369q990k4606p432J4275Q550j0772n046R027m331k1058j1517K080
-16487A23746p462k0342l168J8777J3052p342j614Q639m714k4994j5449O970J248j6585p040
-16472F3722J0130N92j7301j1572R176L455j7182j1453N717mj3604p875R295L575j2948p220
-16456F503R952M230j1576n848R355O496j1733j1732L414N52j4416q692J2717J2716r824r824
$$ plain form
-16555 761284 802096 853582 952774 1043379 1051929 1013011 998900 984551 891963 750990 665357 659632 663449 670843
-16541 670843 756476 941578 1140037 1247735 1227579 1100560 933468 821954 803944 815513 783192 742291
-16529 742291 775813 858829 886507 827239 767971 771318 810922 832695 802946 711416 572180 449164 392938
-16516 392938 387757 376852 362823 388868 446160 463379 422754 368771 330651 292530 249311 227083 227873 219122
-16502 219122 192481 179197 183566 174576 149970 142538 156813 165363 154591 149545 158572 154241 133183 121666 123746
-16487 123746 116284 95942 92774 111551 124603 117261 115647 124286 119572 94578 79129 86099 87347 70762 63722
-16472 63722 73852 74444 57143 45571 54747 58202 41020 29567 35284 35280 21676 13801 23096 26671 13723 6503
-16456 6503 16455 20685 9109 3261 12616 19112 7379 -4353 -939 -387 -14803 -23495 -10778 1938 -7886 -17710
-16440a7710L533L533j3879j3880L295L294p506p506J3723J9448Q058K333J2887J0026p000
-16425A2649j2723j41j42j3261j3261J051O776r28M797K2685K8412P897n460K412K411j0261
-16409C2913j0260p19p20r008r008O257J5799M745r80N341N341o527j2250l068K658o288j2012
-16392B214o82K180q076j0939O30O355k512q237J304P030k512q237k333L391m092o955K587
-16375b8884N449o120j1845J335P059n293j1017j476M249n054j0779j237M487l160q886O56
-16359g0516O381l637r363j610P931K729K731J0421J3287j028j4383r556j1n576j1297L250
-16343h0247K0428J9888J0350O888O891p31o451P01L566l354o213N113J0843r40j0476M069
-16327a9675J7432J1941j413k609L120l988j3525p626J920j782m640L049Q777K125j1230o463
$$ plain form
-16440 -17710 -14177 -10644 -24523 -38403 -35108 -31814 -39320 -46826 -33103 -13655 -5597 -3264 9623 19649 12649
-16425 12649 -74 -215 -357 -13618 -26879 -25828 -19052 -19980 -15183 7502 35914 43811 38351 40763 43174 32913
-16409 32913 22653 21934 21214 12206 3198 9455 25254 29999 29019 34360 39701 33174 20924 17856 20514 14226 2214
-16392 2214 1532 3712 -4364 -15303 -14673 -8318 -10830 -19067 -17763 -10733 -13245 -21482 -23815 -20424 -24516 -31471 -28884
-16375 -28884 -23435 -29555 -41400 -40065 -33006 -38299 -49316 -50792 -46543 -51597 -62376 -63613 -59126 -62286 -71172 -70516
-16359 -70516 -64135 -67772 -77135 -78745 -70814 -68085 -65354 -54933 -41646 -42674 -57057 -66613 -66624 -72200 -83497 -80247
-16343 -80247 -59819 -39931 -29581 -22693 -15802 -16533 -22984 -22283 -18717 -22071 -28284 -23171 -12328 -13268 -23744 -19675
-16327 -19675 -2243 9698 8285 5676 8796 4808 -8717 -16343 -14423 -16205 -20845 -17796 -9019 -6894 -18124 -24587
-16311b4587L082J648p890m793M752L540k180n74K292k601j2139o836K710k602j2139o179
-16295f4496L365N509k13O940J6485J0153l206m636J088p01j0242q095k370m935j0659j595
-16279f7608J1762J7309J1583J2181J2180n44j0086p104O254M227n315n076M465L749n792
-16264a7815k512P029O433L571J2455K1997J3354p633j0738j192K858o679o444L101O064L43
-16248B4192N78O306N050o71J711P439O206p149q583k855j666p387m051N493P533k005k725
-16231B7416L004L537o001m096J633K773o765p007K538L966n572n576L970N277m260j878L850
-16214A6809N039o82r25M805N210m327m331N214Q729L008o93J2668K0954K0957K3100K3104
-16198A38639Q968j5837k3711j0350j413j409q16J2545K2560L2105N0230P1225O5555K1669
$$ plain form
-16311 -24587 -21505 -19857 -27747 -32540 -27788 -24248 -26428 -27002 -24710 -27311 -39450 -46286 -43576 -46178 -58317 -64496
-16295 -64496 -61131 -55622 -55835 -48895 -32410 -22257 -25463 -30099 -29011 -29712 -39954 -48049 -50419 -55354 -66013 -67608
-16279 -67608 -55846 -38537 -26954 -14773 -2593 -3137 -13223 -20327 -14073 -9846 -15161 -20237 -15772 -12023 -17815
-16264 -17815 -20327 -13298 -6865 -3294 9161 31158 44512 36879 26141 24949 27807 21128 14684 17785 23849 24192
-16248 24192 24770 31076 36126 35455 37166 44605 50811 43662 35079 32224 30558 23171 19120 24613 32146 30141 27416
-16231 27416 30420 33957 27956 23860 25493 28266 21501 14494 17032 20998 15426 9850 13820 19097 14837 12959 16809
-16214 16809 21848 21166 20241 25046 30256 25929 21598 26812 35541 38549 37856 50524 71478 92435 115535 138639
-16198 138639 147607 131770 108059 97709 96296 94887 94071 106616 129176 161281 211511 282736 348291 369960
-16184C69960k0316l7487m0830m6551m1546k0551q68M860J3085L4081N4232N4237N0774M1236
-16170D14316O407m8929p9465o9920m5116l5571k8061j0883O283O284N449J8807K5843Q670
-16156A74114j8405k7945k5024k5023k4308j4767p253p253j2739p014K855K855j916j916L511
-16141I772k214r488r489j409j409m987P38O165M40m570m569J509J510m931P94O519P93m573
-16123a9399m573L209k516p882J658J1200N475n020n021M268M267k411k411N340N341j338
-16107i813j338M804M805L3L4P427P428k05N520J7700K3424K3425L4874L9884K0800r254k0704
-16090A48844j4204k754O787J8236M6026O5108P1788N2704O407l5575m9648l0566l135l134
-16076B76884j6612n162J7022K2746P361m088L723J5173J3265J815k3362m2443m9600k2885
$$ plain form
-16184 369960 349644 312157 271327 224776 183230 162679 161811 166671 179756 213837 268069 322306 373080 414316
-16170 414316 420723 371794 292329 222409 177293 141722 113661 102778 109061 115345 120794 139601 165444 174114
-16156 174114 155709 127764 102740 77717 53409 38642 31389 24136 11397 4383 7238 10093 8177 6261 9772
-16141 9772 7558 -1930 -11419 -12828 -14237 -19224 -18486 -12321 -11881 -16451 -21020 -19511 -18001 -22932 -22138 -15619 -14826 -19399
-16123 -19399 -23972 -20763 -23279 -31161 -29503 -18303 -12828 -17848 -22869 -18601 -14334 -16745 -19156 -13816 -8475 -9813
-16107 -9813 -11151 -6347 -1542 -1509 -1475 5952 13380 13175 18695 36395 59819 83244 118118 158002 178802 169548 148844
-16090 148844 134640 131886 138673 156909 202935 268043 339831 392535 398942 363367 313719 283153 280018 276884
-16076 276884 260272 255110 272132 294878 302239 298151 301874 317047 330312 332127 308765 266322 216722 193837
-16062A93837N680J7130M726r99Q50m875j8114k3838k0380q930m755O693K8132M7215N0554
-16047B72926L9104J7398r317l6272m1997l3230k7506k2497j1047Q751K0201K7595M6678O2015
-16033C12802O2015L3152q829m5266o4348o6256m7174j9324p876p040j316J1625K3074K0570
-16019A95809K0570J2638o444k3976j8252N125J6574J5382R657j733k0816l2385k0934M826
-16005A56041J6276K2836M9551P6148P0427J7588l9656n3375m1922k4633j3179j0141m413
-15992B21548L574J5028J8005j073j4793r064J0358J0361k0294m7006m4505l3052k4945j3492
-15978G0650l358Q095M514M517K128r318k4229k4226j0734j189o023j1743l757q91n665q524
-15962a9753m17N311j074l932K982N848r54o675j562M167k397n255K493N360l351r071j413
$$ plain form
-16062 193837 199517 216647 221373 220374 221224 216349 198235 174397 154017 145087 140332 147025 175157 222372 272926
-16047 272926 312030 329428 320111 283839 241842 208612 181106 158609 147562 156313 176514 204109 250787 312802
-16033 312802 374817 407969 399140 353874 289526 223270 176096 156772 148896 141856 140540 152165 175239 195809
-16019 195809 216379 229017 222573 198597 180345 185470 202044 217426 227083 225350 204534 172149 151215 156041
-16005 156041 172317 195153 244704 320852 391279 408867 369211 315836 273914 249281 236102 225961 221548
-15992 221548 225122 240150 258155 257082 242289 233225 243583 253944 233650 186644 142139 109087 84142 70650
-15978 70650 67292 75387 79901 84418 86546 77228 52999 28773 18039 16850 10827 -916 -4673 -5564 -11229 -19753
-15962 -19753 -20170 -14859 -15933 -19865 -16883 -11035 -11989 -18664 -20226 -16059 -18456 -23711 -21218 -15858 -19209 -28280 -29693
-15945b9693M316m58o180K57N986k605q327K65N990o90o414q09M916J875l850K664N528l358
-15927c0587r083j868L858r13o638p53M972K01n523j827L899J036m689j826L899q72o597Q2
-15909e3229N806o33o359j401Q140L369o172j520M204J103m622j386M338J476m249j744L981
-15892d8898K191o71K072M935j625p350r69Q572L802n740k817K907K668l056l354K370K371
-15875d2592l355k191L533L533k191k192L534L533k192k877K847K848k877l295K430K430l295
-15858d2369n29N196R02q640l690N852N613l928l064K661K423l303m733R91R92m734j666M059
-15840d7967O206l336m528J196R58m767m528J196J196m528o52N072N073o52j31N595J300q240
-15822e1537l291O250O012l530l768J957J718m007k754K971K970k754j163M566J699m021j938
$$ plain form
-15945 -29693 -25377 -25835 -32015 -31758 -25772 -28377 -36704 -36439 -30449 -31139 -37553 -38362 -33446 -31571 -35421 -32757 -27229 -30587
-15927 -30587 -39670 -41538 -37680 -38593 -45231 -45984 -41012 -40811 -46334 -48161 -44262 -43226 -47915 -49741 -45842 -46714 -53311 -53229
-15909 -53229 -47423 -48056 -54415 -55816 -47676 -44307 -50479 -51999 -47795 -46692 -51314 -52700 -48362 -46886 -51135 -52879 -48898
-15892 -48898 -46707 -47378 -45306 -40371 -41996 -49346 -50315 -41743 -37941 -43681 -46498 -43591 -40923 -43979 -47333 -44963 -42592
-15875 -42592 -45947 -48138 -44605 -41072 -43263 -45455 -41921 -38388 -40580 -43457 -40610 -37762 -40639 -43934 -41504 -39074 -42369
-15858 -42369 -42898 -37702 -36800 -45440 -49130 -43278 -37665 -41593 -44657 -41996 -39573 -42876 -47609 -46618 -45626 -50360 -52026 -47967
-15840 -47967 -41761 -45097 -49625 -48429 -47471 -52238 -56766 -55570 -54374 -58902 -59554 -54482 -49409 -50061 -50192 -44597 -43297 -51537
-15822 -51537 -54828 -48578 -42566 -46096 -49864 -47907 -46189 -50196 -52950 -49979 -47009 -49763 -50926 -46360 -44661 -48682 -50620
-15805e0620L790n07j0044q051J495M114j606l518O026O023l514k613L116K873k847l090K639
-15788e6334N020m517m566M980K590l131k418L309N691l846n855L690J539m182l768N777N773
-15771e0248l764m350J379M238j483n244M301O921J200p201j472J685j174l444K285K460l262
-15754e7173m383J346O112L92n338L92L250k471k647L083L078k642j752L977L973j748l764
-15737e6315J964J960l760o269n41N956K35j122J744M89n233n893j64M603j118l656K072M931
-15719f0117p90m730R99L858j864o411o82N994K72l191K538N397l24n278M51N218n03l608
-15701f2771K121M979p41n803p5M693j029m133J595M454j268m461J267Q181j356q934l206
-15684f6487O989M129l690l689R02R02j782j781L048J87m704J021N971K46m525J200N971K46
$$ plain form
-15805 -50620 -46830 -47337 -57381 -65432 -63937 -59823 -61429 -64947 -58921 -52898 -56412 -59025 -55909 -53036 -55883 -58973 -56334
-15788 -56334 -51314 -55831 -60397 -55417 -52827 -55958 -58376 -55067 -49376 -53222 -59077 -55387 -53848 -58030 -61798 -56021 -50248
-15771 -50248 -54012 -58362 -56983 -52745 -54228 -59472 -55171 -48250 -47050 -54251 -55723 -54038 -55212 -58656 -56371 -53911 -57173
-15754 -57173 -61556 -60210 -54098 -53706 -59044 -58652 -55402 -57873 -60520 -57437 -54359 -57001 -58753 -54776 -50803 -52551 -56315
-15737 -56315 -54351 -52391 -56151 -62420 -62961 -57005 -56770 -57892 -56148 -55659 -60892 -66785 -66949 -62346 -63464 -67120 -65048 -60117
-15719 -60117 -60907 -65637 -64638 -60780 -62644 -69055 -69737 -63743 -63471 -66662 -64124 -58727 -59051 -64329 -63878 -58660 -59163 -62771
-15701 -62771 -60650 -55671 -56412 -62215 -62290 -57597 -58626 -62759 -61164 -56710 -57978 -62439 -61172 -52991 -54347 -63281 -66487
-15684 -66487 -59498 -55369 -59059 -62748 -61846 -60944 -62726 -64507 -61459 -61272 -65976 -64955 -58984 -58738 -63263 -62063 -56092 -55846
-15666e5846p223j498L570P09l288K438P387J662o716r91N687l7n404L20O642R17o787o784
-15648f5242j08j04l865J863N200K340l239l72O302L444l537o71L977j744o452p23P801M942
-15630e0188k158k154M342M346o68o63O191O194j90K676J0961N241l545l544Q68Q68n691n691
-15612c2805K896K896k620k620N967N967l932l932j070j070n646n647q76q76m394m394K344
-15595d9812n18n303M21N490K627o675l813M894M894l362l358L317L321l958l955M629M633
-15578d6528l228l224P268P272k035k032Q461Q464O15O19R202R206l39l36K523K527m334m331
-15560a0230M252M257p27p23N951N956k836k833j405j401p517p514q38q35o578o575J01J04
-15542b9391p055p052J532J535k728k724K042K046l563l559L116L119l250l246J521J524n158
$$ plain form
-15666 -55846 -63069 -64567 -60997 -60288 -63576 -61138 -53751 -52089 -58805 -59796 -54109 -54146 -59550 -59230 -52588 -51671 -58458 -65242
-15648 -65242 -65350 -65454 -69319 -67456 -62256 -59916 -63155 -63527 -57225 -53781 -57318 -57989 -54012 -55756 -62208 -62931 -55130 -50188
-15630 -50188 -52346 -54500 -50158 -45812 -46480 -47143 -40952 -34758 -34948 -32272 -21311 -16070 -19615 -23159 -22291 -21423 -27114 -32805
-15612 -32805 -29909 -27013 -29633 -32253 -26286 -20319 -24251 -28183 -29253 -30323 -35969 -41616 -42492 -43368 -47762 -52156 -49812
-15595 -49812 -50330 -55633 -55212 -49722 -47095 -53770 -57583 -52689 -47795 -51157 -54515 -51198 -47877 -51835 -55790 -51161 -46528
-15578 -46528 -49756 -52980 -45712 -38440 -40475 -42507 -34046 -25582 -24967 -24348 -15146 -5940 -6279 -6615 -4092 -1565 -5899 -10230
-15560 -10230 -5978 -1721 -2448 -3171 2780 8736 5900 3067 1662 261 -7256 -14770 -15608 -16443 -23021 -29596 -29495 -29391
-15542 -29391 -36446 -43498 -41966 -40431 -43159 -45883 -43841 -41795 -45358 -48917 -45801 -42682 -45932 -49178 -47657 -46133 -51291
-15525e1291n155L429L433Q61Q64P540P544k13k08M379M383n013p871n41M234j83l041J16
-15507c6733K981j00r7O459O463k665p432J9K2p182p179L32N106j278o045q6K780j945m804
-15488e1384J41L008l615l612J334M201k706p473p97L976l20l179J707M573l172o030J360
-15471f1988O135n48n315m29M346j889m749R73N747o97l555L060N926N21n199J297P026j089
-15453e0427o809j864L865l13l171J595M461j029o749k54N475Q17m905j38N590m95o217j450
-15435f2018M279p8n800j032M696J413m309m133J595j961m822K154P879J200m525K155P879
-15418e5428l21o045j275M450Q72m852j990L734K438l288L094N956k691q416k154P387J602
-15401e6927m122j021M704J71n553Q87O612K594o948k415P126L608n933n695L846J550m174
$$ plain form
-15525 -51291 -56446 -53017 -49584 -48723 -47859 -40319 -32775 -32988 -33196 -28817 -24434 -29447 -37318 -37859 -33625 -33808 -36849 -36733
-15507 -36733 -33752 -33852 -33949 -27490 -21027 -23692 -31124 -31105 -31083 -38265 -45444 -45112 -40006 -41284 -47329 -47415 -44635 -46580 -51384
-15488 -51384 -51243 -48235 -51850 -55462 -54128 -49927 -52633 -60106 -60903 -56927 -57247 -60426 -58719 -54146 -57318 -63348 -61988
-15471 -61988 -55853 -56401 -61716 -62145 -57799 -59688 -64437 -63464 -57717 -58414 -61969 -58909 -52983 -52462 -57661 -56364 -49338 -50427
-15453 -50427 -57236 -59100 -55235 -55548 -58719 -57124 -52663 -53692 -60441 -60695 -55220 -54403 -59308 -59446 -53856 -54351 -60568 -62018
-15435 -62018 -57739 -57817 -63617 -64649 -59953 -58540 -62849 -66982 -65387 -67348 -72170 -70016 -62137 -60937 -65462 -63307 -55428
-15418 -55428 -55749 -61794 -63069 -58619 -57747 -62599 -64589 -60855 -58417 -61705 -58611 -52655 -55346 -63762 -65916 -58529 -56927
-15401 -56927 -61049 -62070 -57366 -57195 -62748 -61861 -55249 -52655 -59603 -62018 -54892 -51284 -57217 -62912 -59066 -57516 -61690
-15384f1690j073M651N96n128k743O798M130n412l026K698K758k967k966K758L324k400k400
-15367f2092L324Q80m845k460P081N639l898j756L973K121p417p420K124L880j841l753N791
-15350f0669L642k080j845L884K776k944l187K542M685m852k710L019K941k781n169M375N326
-15333e3047m211m216N330M320n218k836K892J219m503m506J223L291k430m819M725M723m816
-15316f2879k434L295K859k863n251M294N661l876l880N665P838j699m089J640J517m204o355
-15299f4761L190O642R17n524K02J573m152m391J334M644m897n136M405R176l65o388o63R54
-15281f3240j909q94M830O262l280n904j79L429k296k296L429L847j879k117L608L746n796
-15264f0639o034L507P562j979o272n48N132n93l455K270M894q31l694K031L970j756m617
$$ plain form
-15384 -61690 -62763 -58112 -57516 -62644 -65387 -58589 -54459 -59871 -62897 -60199 -57441 -60408 -63374 -60616 -57292 -59692 -62092
-15367 -62092 -58768 -57888 -62733 -65193 -58112 -52473 -56371 -58127 -54154 -52033 -59450 -66870 -64746 -60866 -62707 -66460 -60669
-15350 -60669 -57027 -59107 -60952 -57068 -54292 -57236 -60423 -57881 -53196 -58048 -60758 -57739 -54798 -57579 -62748 -58373 -53047
-15333 -53047 -57258 -61474 -56144 -51824 -57042 -59878 -56986 -55767 -60270 -64776 -63553 -60262 -62692 -67511 -62786 -58063 -62879
-15316 -62879 -65313 -62018 -59159 -62022 -67273 -62979 -57318 -61194 -65074 -59409 -51571 -53270 -57359 -55719 -54202 -58406 -64761
-15299 -64761 -61571 -54929 -54012 -59536 -59334 -57761 -61913 -66304 -64970 -60326 -65223 -70359 -65954 -56778 -57143 -63531 -64194 -63240
-15281 -63240 -65149 -66043 -61213 -54951 -58231 -64135 -64314 -60885 -63181 -65477 -62048 -58201 -60080 -62197 -58589 -54843 -60639
-15264 -60639 -66673 -63166 -55604 -57583 -63855 -64403 -59271 -59864 -63319 -61049 -56155 -56986 -60680 -58649 -54679 -56435 -61052
-15247f1052J106J644m081o228L313O832J107n333L91M029j696m558J166M305j416o191m62
-15230f7124L947j774m640J088O780J058n624J04M156j565m432J297O288N66o116l87O645
-15213e9733R24n758l0N423k98l463n96M230j491o444p15N523k01m793R32N702K840l839r76
-15194f2763L943j782o731j006L884j841m704J021P864K140m540J185O195M69m301J424O135
-15177e3408M10p999k273L749Q87n493K31N736J1m760R69O214M88q099k371O288N63o057l190
-15158f8104O049O049k359k356J055J055l716l712K247K248k524k519K575K576k196k191M722
-15141f1101M722m044m040L068K08o354o26O883M026m506m503K561K564k270N97O317N96o384
-15123f2286l518M699J841o451p23P383M525m007m003M998N002n497n494L090L093l589l585
$$ plain form
-15247 -61052 -59946 -58302 -62383 -68611 -65298 -58466 -57359 -62692 -62301 -58272 -59968 -64526 -63360 -59055 -60471 -66662 -67124
-15230 -67124 -63177 -64951 -69591 -68503 -61723 -60665 -66289 -66185 -62029 -63594 -68026 -66729 -60441 -59875 -65991 -66378 -59733
-15213 -59733 -58809 -64567 -64597 -59174 -59472 -62935 -63531 -59301 -60792 -67236 -67951 -62428 -62629 -67422 -66490 -60788 -57948 -61787 -62763
-15194 -62763 -58820 -60602 -67333 -68339 -64455 -66296 -71000 -69979 -62115 -59975 -64515 -63330 -57135 -56666 -60967 -59543 -53408
-15177 -53408 -52998 -60997 -63270 -59521 -58634 -64127 -63896 -58160 -58149 -62909 -61940 -55726 -55238 -63337 -65708 -59420 -58857 -64914 -68104
-15158 -68104 -62055 -56006 -58365 -60721 -59666 -58611 -62327 -66039 -63792 -61544 -64068 -66587 -64012 -61436 -63632 -65823 -61101
-15141 -61101 -56379 -60423 -64463 -61395 -61187 -67541 -68167 -61284 -57258 -61764 -66267 -63706 -61142 -63412 -62815 -56498 -55902 -62286
-15123 -62286 -65804 -61105 -59264 -65715 -66438 -59055 -54530 -58537 -62540 -57542 -52540 -58037 -63531 -60441 -57348 -60937 -64522
-15106f4522L570L571l109l104M524M525m063m058L794L794m793m789L436L436l242l239O262
-15089e8007O261k326k322L877L876m711m708N188N189n308n303L041L041p454p450N184N184
-15072e6748l403l402K083K083k687k687O004O005m491m492J950J949m730m729M908M909m59
-15055e7937o183J838J837M8M9M402M401k277k277L298L299p197p197L965L966o172o172J461
-15037f6848P186k714k713M502M503q65o589K951K952l727l727J215O940O19n106K60N986
-15020e5175j051o776R77R76l794l794J692P417J096m629J002O728j622j621K911K911l768
-15003e6520l768K120K121r80o705j577M148k292k292M223M223p87o511K672Q397J361m365
-14986e6532P50P49m022m021L253Q979P49m976J044O772j819p540r83M744l0n751k08N519
$$ plain form
-15106 -64522 -60952 -57381 -60490 -63594 -59070 -54545 -58608 -62666 -58872 -55078 -59871 -64660 -61224 -57788 -61030 -64269 -58007
-15089 -58007 -51746 -54072 -56394 -52517 -48641 -53352 -58060 -52872 -47683 -52991 -58294 -55253 -52212 -59666 -67116 -61932 -56748
-15072 -56748 -60151 -63553 -61470 -59387 -62074 -64761 -58757 -52752 -57243 -61735 -59785 -57836 -62566 -67295 -62387 -57478 -57937
-15055 -57937 -64120 -62282 -60445 -60397 -60348 -55946 -51545 -53822 -56099 -52801 -49502 -56699 -63896 -59931 -55965 -62137 -68309 -66848
-15037 -66848 -59662 -62376 -65089 -60587 -56084 -56949 -63538 -60587 -57635 -61362 -65089 -63874 -56934 -56315 -61421 -61161 -55175
-15020 -55175 -56226 -63002 -62025 -61049 -64843 -68637 -66945 -59528 -58432 -63061 -62059 -55331 -56953 -58574 -55663 -52752 -56520
-15003 -56520 -60288 -58168 -56047 -57027 -63732 -65309 -61161 -63453 -65745 -61522 -57299 -58086 -64597 -61925 -53528 -52167 -56532
-14986 -56532 -55782 -55033 -59055 -63076 -59823 -50844 -50095 -55071 -54027 -47255 -49074 -56614 -57597 -52853 -52883 -58634 -58842 -53323
-14968e3323r24o645L87R933L250o288k042L686N82n140j565M163o12o332j789L940q35o556
-14950f6110J312P040M413n125j002M722k87o012j897L828L649k076Q01L664j405p130j048
-14933f2663M678J815l910n29N196M24n299J021O746j603p327k512P029L50n374j797P745
-14916e6010K736k989l39N385j055o779k903O637K106p435m588M953K568l157j487M238J852
-14899e6267p689m077N464N463m077k706O836O597k945k080L646N553l988n181N44j304m167
-14882f0378J472P197L083o459m134N408N408m133o027L515L514o026o027L515L514o026m182
-14865f6766N359K975k751p83M942M943p83M55O179J886p655l422O120O120l422n989L552
-14848d9040L552n990m319N221M983m558k128L597L358k367m275J450L835n706m838M704M703
$$ plain form
-14968 -53323 -54247 -60892 -60505 -50572 -47322 -53610 -55652 -51966 -51384 -56524 -58089 -53926 -54538 -60870 -62659 -58719 -59554 -66110
-14950 -66110 -64798 -57758 -53345 -58470 -59472 -54750 -55037 -61049 -62946 -59118 -55469 -57545 -56744 -53080 -54485 -61615 -62663
-14933 -62663 -57985 -56170 -60080 -60609 -55413 -54989 -60288 -59267 -52521 -54124 -61451 -63963 -56934 -56584 -61958 -63755 -56010
-14916 -56010 -53274 -56263 -56602 -51217 -52272 -59051 -61954 -55317 -53211 -60646 -65234 -60281 -57713 -60870 -62357 -58119 -56267
-14899 -56267 -63956 -68033 -62569 -57106 -61183 -63889 -57053 -50456 -53401 -55481 -51835 -46282 -50270 -55451 -54907 -56211 -60378
-14882 -60378 -58906 -51709 -48626 -55085 -59219 -53811 -48403 -52536 -58563 -55048 -51534 -57560 -63587 -60072 -56558 -62584 -66766
-14865 -66766 -61407 -58432 -61183 -61966 -57024 -52081 -52864 -52409 -46230 -44344 -51999 -55421 -49301 -43181 -46603 -52592 -49040
-14848 -49040 -45488 -51478 -55797 -50576 -45593 -50151 -52279 -48682 -45324 -47691 -51966 -50516 -46681 -52387 -57225 -52521 -47818
-14831d7818m837m421N121N121m420p268K274O567Q42k914K810M957m585k873K855K613l109
-14814d9085l351K378M760m778l381O165L775j945l858J871K106l615k948O597O593k945m140
-14797d5801J587J346m376m215J513J748l973m692M852N088m450l873N673P816n539q047J499
-14780e3844R608O7l261K467P235k304m811R16N926l615o697K847P137J417o101l73M398j327
-14762d0315o936j208J651m070m670J059M159j565o310L231O333l209p384K158Q360K635n684
-14745e1765M1L142k583m729M811P674j867o507p83L749j975l168K557P327J603m271J453
-14728d5291Q133K407o895j170J931l794p205K341M964p60n650P4N322m219p935J611Q050
-14711d8086j491q289k564N784O0n863j34O545Q20p887k161Q333K609o727r99N680m5p439
$$ plain form
-14831 -47818 -52655 -57076 -51955 -46834 -51254 -58522 -56248 -49681 -48839 -51753 -48943 -43986 -48571 -51444 -48589 -45976 -49085
-14814 -49085 -52436 -50058 -45298 -50076 -53457 -47292 -43517 -45462 -49320 -47449 -45343 -48958 -51906 -45309 -38716 -41661 -45801
-14797 -45801 -44214 -42868 -47244 -51459 -49946 -48198 -52171 -56863 -52011 -46923 -51373 -55246 -49573 -41757 -47296 -55343 -53844
-14780 -53844 -44236 -44169 -47430 -44963 -37728 -40032 -44843 -43927 -38001 -41616 -48313 -45466 -38329 -36912 -43013 -43386 -38988 -40315
-14762 -40315 -47251 -48459 -46808 -50878 -55548 -54489 -50330 -51895 -58205 -54974 -48641 -51850 -59234 -57076 -48716 -46081 -51765
-14745 -51765 -51724 -48582 -51165 -55894 -51083 -43409 -45276 -51783 -52566 -48817 -50792 -53960 -51403 -44076 -42473 -46744 -45291
-14728 -45291 -37158 -34751 -41646 -42816 -40885 -44679 -51884 -49543 -44579 -45339 -50989 -50915 -45593 -49812 -57747 -56136 -48086
-14711 -48086 -49577 -57866 -60430 -54646 -54586 -60449 -60583 -54038 -53218 -61105 -63266 -54933 -52324 -59051 -60050 -54370 -54415 -61854
-14693f1854j714Q781L056n747k3O657R32p536j812Q505K781o493l630M778J916n360k497
-14676e9260M361J498p189j465P242M379l313l314M857q69p324j598O988J263n713J1O809
-14659e2637L947m618j755O832L969p600m737L850R88p286m424N892L030n199n199N117N117
-14642e4713m185m186M402M402n259n259N236N237j934j935M745M744l842l843K836K837l355
-14625e4072l350L324L329o456o451K132K135m025m022M562M566l906l902M681M685k825k822
-14608f2417P671P674o880o877L615L619m539m536P864P868m659m655K020K024o608o608L887
-14591f1537L887l984l984K695K694l567l566O928O929j897j897M782M781l589l589L090L089
-14574d8735n616n617M879M879l977l977M610M611l500l500L001L000l828o690J08N833j144
$$ plain form
-14693 -61854 -63568 -54787 -51731 -57478 -57501 -50844 -49912 -57448 -59260 -50755 -47974 -54467 -58097 -53319 -51403 -56763 -59260
-14676 -59260 -54899 -53401 -60590 -62055 -54813 -50434 -53747 -57061 -52204 -53073 -60397 -61995 -55007 -53744 -59457 -59446 -52637
-14659 -52637 -48690 -53308 -55063 -48231 -44262 -51862 -56599 -52749 -51761 -59047 -63471 -57579 -54549 -59748 -64947 -59830 -54713
-14642 -54713 -58898 -63084 -58682 -54280 -59539 -64798 -59562 -54325 -56259 -58194 -53449 -48705 -52547 -56390 -53554 -50717 -54072
-14625 -54072 -57422 -54098 -50769 -57225 -63676 -61544 -59409 -63434 -67456 -62894 -58328 -62234 -66136 -61455 -56770 -59595 -62417
-14608 -62417 -54746 -47072 -53952 -60829 -57214 -53595 -58134 -62670 -54806 -46938 -51597 -56252 -54232 -52208 -58816 -65424 -61537
-14591 -61537 -57650 -61634 -65618 -62923 -60229 -63796 -67362 -60434 -53505 -55402 -57299 -52517 -47736 -51325 -54914 -51824 -48735
-14574 -48735 -54351 -59968 -55089 -50210 -54187 -58164 -53554 -48943 -52443 -55943 -52942 -49942 -53770 -60460 -60352 -54519 -55663
-14557e5663m007M581P443p27o452J719J718m901m901N534Q397k090p816N92O318j435p160
-14540e8850J428P152r58o683J76N900k270n132J844P570O82n042J516M380k240n103J577
-14523e4053M439l045n908M410P271l462r188j017Q524J390m335O75O399j353p077k20N505
-14506e1045k248n110L776R500m58o183M95O221r99o720j953L776j357p078J510P234J058
-14489d9581m662J04N833j685p405p27M998j12n833K751Q479q27o549J31N855k01n923K423
-14471e2931Q151J111q427l895N646J137q404l396O146O4n662P79J0320M059n482m74N252
-14454d6006Lr537j189Q352K538p003l902N639L015k709J53N877J152q390l619N922J152m573
-14436e3125M36O161J476m249j625M103Q80q658l175O369Q35q706k744O802K028l694K028
$$ plain form
-14557 -55663 -59670 -55089 -47646 -48373 -54825 -53106 -51388 -56289 -61190 -55656 -47259 -49349 -57165 -56573 -50255 -51690 -58850
-14540 -58850 -57422 -50270 -51228 -57911 -57735 -51835 -54105 -59237 -57393 -49823 -49141 -54183 -52667 -48287 -50527 -55630 -54053
-14523 -54053 -49614 -52659 -58567 -54157 -46886 -50348 -59536 -60553 -52029 -50639 -54974 -54299 -47900 -49253 -56330 -56550 -51045
-14506 -51045 -53293 -58403 -54627 -45127 -45585 -51768 -51273 -45052 -46051 -52771 -54724 -50948 -52305 -59383 -57873 -50639 -49581
-14489 -49581 -54243 -54139 -48306 -49991 -57396 -58123 -53125 -53237 -59070 -56319 -47840 -48667 -55216 -55085 -49230 -49431 -55354 -52931
-14471 -52931 -44780 -43669 -52096 -55991 -50345 -49208 -57612 -61008 -54862 -54798 -60460 -59681 -49361 -45302 -50784 -51258 -46006
-14454 -46006 -46003 -55540 -56729 -48377 -45839 -52842 -56744 -51105 -48090 -50799 -50646 -44769 -43617 -52007 -55626 -49704 -48552 -53125
-14436 -53125 -52689 -46528 -45052 -49301 -50926 -46823 -45943 -54601 -57776 -51407 -50572 -59278 -62022 -55220 -53192 -56886 -54858
-14419e4858P756J699p841k356P190L667n870j49R396K281p260m398N147N322m215m219N326
-14402d3382M830m711m711M830K862o678l817N725O71q871n292Q065N621l921l683N859J230
-14385d5373q311k587O955O836k706n59N165K721o820r206M152N344m196l959N584O082l455
-14368d4333l459O087M651m886m890M655L548n989n993L552N933l604l608N938N940l596l601
-14351d3655N945N941l597l600N945M331n207n210M334N941l597r325K20O057l485l962J763
-14334d1161J405m320l842N698M029n512n512M029N639l903l902N639N319m223m223N319N080
-14317c4441m462k314L410L828n714n952L589O810k732q457J085O552k989l228O314O552o806
-14300c8955p044O314P596n762j1249K110Q907o33o120L421J0913J372o023k98Q289j252o978
$$ plain form
-14419 -54858 -47102 -45403 -53244 -55600 -48410 -44743 -50613 -50762 -41366 -39085 -46345 -50743 -45596 -40274 -44489 -48708 -43382
-14402 -43382 -38552 -43263 -47974 -43144 -40282 -46960 -50777 -45052 -44381 -53252 -58544 -50479 -44858 -48779 -52462 -46603 -45373
-14385 -45373 -53684 -56271 -49316 -42480 -45186 -45745 -40580 -37859 -44679 -53885 -49733 -44389 -48585 -52544 -46960 -40878 -44333
-14368 -44333 -47792 -41705 -37054 -41940 -46830 -42175 -38627 -44616 -50609 -47057 -41124 -44728 -48336 -42398 -36458 -40054 -43655
-14351 -43655 -37710 -31769 -35366 -38966 -33021 -28690 -33897 -39107 -34773 -28832 -32429 -41754 -41534 -35477 -38962 -42924 -41161
-14334 -41161 -39756 -44076 -47918 -42220 -38191 -43703 -49215 -45186 -39547 -43450 -47352 -41713 -36394 -40617 -44840 -39521 -34441
-14317 -34441 -38903 -41217 -37807 -33979 -39693 -45645 -42056 -35246 -37978 -46435 -45350 -38798 -41787 -45015 -38701 -32149 -38955
-14300 -38955 -45999 -39685 -32089 -37851 -49100 -46990 -38083 -38716 -44836 -41415 -30502 -29130 -35153 -35451 -27162 -28414 -35392
-14283c5392K565Q229K505l221K505N427m115o977K564J3227P503O786K3961L4994K5452L984
-14267H9997n557j4815k8173k9127j5768m081r806j1476j934N311m14q285J256Q770p72p927
-14251c2801k203M864q61q971N70P011k531q255J285Q684q57o582K960J3275L735o880j156
-14234b8713P477P476M972J4512K4950J9224R325R325J2024O298Q565J8106J7272l720k3756
-14219A03337k3757p953p954q431J111Q803m554k1252k1252r813r809j2675l131N035o86j2139
-14203b5120k594O824J104q204k474M677j044j0588m860P361J640p905k177Q554K832o712
-14187c8686r84J1595N874l910l906J0402J0406M678J0405K7565L3290K5419J9694N978j8829
-14172I8991l8031l2307j3223j3224j5369n829M547M547p619p618N792O7j0428m704M600M599
$$ plain form
-14283 -35392 -32827 -24598 -22093 -25314 -22809 -17382 -21497 -28474 -25910 -12683 -5180 1606 25567 60561 86013 89997
-14267 89997 84440 69625 41452 12325 -3443 -7524 -17330 -28806 -30740 -25429 -25843 -34128 -32872 -24102 -24874 -32801
-14251 -32801 -35004 -30140 -31001 -39972 -39402 -32391 -34922 -43177 -41892 -33208 -34065 -40647 -37687 -24412 -20677 -27557 -28713
-14234 -28713 -21236 -13760 -8788 5724 30674 49898 59223 68548 80572 86870 95435 113541 130813 127093 103337
-14219 103337 79580 71627 63673 55242 56353 65156 60602 39350 18098 8285 -1524 -14199 -17330 -12295 -12981 -25120
-14203 -25120 -27714 -20890 -19786 -27990 -30464 -25787 -26831 -37419 -42279 -34918 -33278 -41183 -43360 -34806 -31974 -38686
-14187 -38686 -39670 -28075 -22201 -26111 -30017 -19615 -9209 -4531 5874 33439 66729 92148 111842 117820 98991
-14172 98991 60960 28653 15430 2206 -13163 -18992 -14445 -9898 -17517 -25135 -19343 -19276 -29704 -34408 -29808 -25209
-14156b5209p447p447M018M018o478o477N329N330n166n165M677M678n818n818O705O705n699
-14139c9264n699K874K873l805l805R314R314m998m998P517P518L104L105J6582K2305J3243
-14123C5180J3242R127q046k7368k1643k321k322j0552j0551J640J644q852q852R989R992
-14108a9693l008q732R84R87p957p957N516N519o883o884N180N185n311n312P328P331n073
-14091c8780n072P804P809l284r008N300N303n549n550P275P279k862k859P037J2765K266
-14075a0126l455N233N237p768j3488l73N356l593r314K006K008o939o937N107N109n389n386
-14058d2712N002N006l586l582R177R179j558p279N736J1461K516l205N020N020p979j3701
-14042b5485L321R045k881j2418r73Q569k166p886J841J1382K557l164L868R594o63j0201
$$ plain form
-14156 -25209 -32656 -40103 -36085 -32067 -38545 -45022 -39693 -34363 -39529 -44694 -40017 -35339 -41157 -46975 -40270 -33565 -39264
-14139 -39264 -44963 -42089 -39216 -43021 -46826 -37512 -28198 -33196 -38194 -30677 -23159 -20055 -16950 -368 21937 35180
-14123 35180 48422 57549 49503 22135 492 -1829 -4151 -14703 -25254 -23614 -21970 -30822 -39674 -29685 -19693
-14108 -19693 -22701 -31433 -30449 -29462 -37419 -45376 -39860 -34341 -41224 -48108 -42928 -37743 -43054 -48366 -41038 -33707 -38780
-14091 -38780 -43852 -36048 -28239 -31523 -40531 -35231 -29928 -35477 -41027 -33752 -26473 -29335 -32194 -25157 -12392 -10126
-14075 -10126 -13581 -8348 -3111 -10879 -24367 -24740 -19384 -22977 -32291 -30285 -28277 -35216 -42153 -37046 -31937 -37326 -42712
-14058 -42712 -37710 -32704 -36290 -39872 -30695 -21516 -23074 -30353 -24617 -13156 -10640 -13845 -8825 -3805 -11784 -25485
-14042 -25485 -22164 -13119 -16000 -28418 -29391 -20822 -22988 -30874 -29033 -17651 -15094 -18258 -14390 -4796 -5459 -15660
-14026a5660j230M494p908j3630k184P357j230o951L552J3097K598o940J047O776l485j3022
-14010c3319m59R087K404p134R73J0518J927p611K162J1706N025m514L951J3494J089q450
-13994H49m32R113M100n438j864L865o634j2354m059N483r58j0499r58Q583j673j1215l299
-13977b7390J0060N050m491M454J3994L738r618m186N356j323j0865l470R888K971o571n93
-13961a2996Q949K270p272k143P399K866o676K963J6324J1312k043j330M398l955j3492m461
-13945B113Q900O273p082j748J1614M931q423p443N918K099p440n624L921k523j2060p965
-13929a4539N397O23q916l790R571N155j2016p045M410O910m536j618R836R832j614J901J3353
-13912A2914Q222l224q386k657m212j5656o679M774O202n244p305M148J282j0163p76J0678
$$ plain form
-14026 -15660 -16890 -12396 -20304 -33934 -36118 -28761 -29991 -36942 -33390 -20293 -17695 -24635 -23588 -16812 -20297 -33319
-14010 -33319 -33778 -24691 -22287 -29421 -28448 -17930 -16003 -23614 -21452 -9746 -4721 -9235 -5284 8210 9299 849
-13994 849 417 9530 13630 8192 6328 10193 3559 -8795 -12854 -7371 -8329 -18828 -19786 -11203 -12876 -24091 -27390
-13977 -27390 -17330 -12280 -16771 -12317 1677 5415 -4203 -8389 -3033 -4356 -15221 -18691 -8803 -5832 -12403 -12996
-13961 -12996 -4047 -1777 -9049 -11192 -3793 -927 -7603 -4640 11684 22996 20953 19623 24021 20066 6574 2113
-13945 2113 11013 17286 10204 8456 20070 25001 16578 9135 15053 17152 9712 4088 8009 5486 -6574 -14539
-13929 -14539 -9142 -8519 -17435 -21225 -11654 -6499 -18515 -25560 -21150 -14240 -18776 -20394 -10558 -726 -2340 -439 12914
-13912 12914 21136 17912 9526 6869 2657 -12999 -19678 -14904 -8702 -13946 -21251 -17103 -15821 -25984 -26760 -16082
-13896a6082P812l634l816P637K862q583q811K642K639q807k907Q546L772p674q230L224O083
-13879b3327n363l698P756K982q464q431L023N881n564n867N587N583n862n807N646Q506k941
-13862c0360o165N289N285o161m152P298Q729j0350p939L511P804l641m674O776N822n624
-13846b8552r803R281J0711q367r250K202O974m477j1486P599R985j465r221K233P003m446
-13830c1079j0175J278P957l492p495L958Q725k721p614L839O698m749q017L437J0111j334
-13814c0673p779L675Q442l004j1468j9Q569k881o578M871R642j808p040M409P271m178r903
-13797c8452J547J0015j435q222J323Q121j420p744N616J0626k732j2605P57R344m014j3440
-13781d2715p9R941L98p245K300J1363j994j0704K658J1006k352j1107j561J0603J062r437
$$ plain form
-13896 -16082 -8270 -11904 -15720 -8083 -5221 -13804 -22615 -19973 -17334 -26141 -29048 -20502 -16730 -24404 -32634 -29410 -23327
-13879 -23327 -28690 -32388 -24632 -21650 -30114 -38545 -35522 -29641 -35205 -41072 -35485 -29902 -35764 -41571 -35925 -27419 -30360
-13862 -30360 -36525 -31236 -25951 -32112 -36264 -28966 -20237 -30587 -38526 -35015 -27211 -30852 -35526 -28750 -22928 -28552
-13846 -28552 -38355 -29074 -18363 -26730 -35980 -33778 -26804 -31281 -42767 -35168 -25183 -26648 -35869 -33636 -26633 -31079
-13830 -31079 -41254 -39976 -32019 -35511 -43006 -39048 -30323 -33044 -40658 -36819 -30121 -34870 -42887 -39450 -29339 -30673
-13814 -30673 -38452 -34777 -26335 -29339 -40807 -40826 -32257 -35138 -41716 -36845 -27203 -29011 -36051 -31642 -24371 -28549 -38452
-13797 -38452 -36905 -26890 -28325 -36547 -35224 -27103 -28523 -36267 -30651 -20025 -22757 -35362 -34605 -25261 -29275 -42715
-13781 -42715 -42794 -32853 -32455 -39700 -37400 -26037 -28031 -38735 -36077 -25071 -27423 -38530 -40091 -29488 -28426 -37863
-13765c7863J08Q696q46j0451r09J1494J953r378J64Q752p90q051J491J1986K445j1628k088
-13748c4915P932K206o537q13Q252j289r758k16J0279P38r728j86J0309P68j0682j140J1263
-13731b3517J722j1148j606J0797J256r955m14J0082N41j0999j457J0469M745q852l127R276
-13715b2187L552r001l276P697j845j1744k203R724L999q568k844R798M074j1669k129J1946
-13699b4676O220p156j431J2881P160q230k501P991K270j3134p410O903J181j0868n139J1076
-13683b4863N356j1934o209J0130P272q774n907Q400N543j0131p267Q952O094q580n714Q416
-13667b9216N557o176o175P957P957p070p070J1058J1058q307q308O004O005n565n564O839
-13651b1016O839m119m118J0194J0193j256j256J4963J4965p399p398L097L097j0976j0975
$$ plain form
-13765 -37863 -37755 -29059 -29905 -40356 -41265 -29771 -27818 -37196 -37032 -28280 -29070 -37121 -35630 -23644 -21199 -32827 -34915
-13748 -34915 -26983 -24777 -31314 -32127 -23875 -25164 -34922 -35138 -24859 -24121 -33849 -34035 -23726 -22958 -33640 -34780 -23517
-13731 -23517 -21795 -32943 -34549 -23752 -22496 -32451 -32865 -22783 -22242 -33241 -34698 -24229 -19484 -28336 -31463 -22187
-13715 -22187 -18635 -27636 -30912 -23215 -25060 -36804 -39007 -29283 -25284 -33852 -36696 -26898 -22824 -34493 -36622 -24676
-13699 -24676 -18456 -25612 -27043 -14162 -7002 -15232 -17733 -9742 -7472 -20606 -28016 -21113 -19932 -30800 -35939 -24863
-13683 -24863 -19507 -31441 -37650 -27520 -20248 -29022 -34929 -26529 -20986 -31117 -38384 -29432 -23338 -31918 -37632 -29216
-13667 -29216 -23659 -29835 -36010 -28053 -20096 -27166 -34236 -23178 -12120 -20427 -28735 -22731 -16726 -22291 -27855 -21016
-13651 -21016 -14177 -18296 -22414 -12220 -2027 -3283 -4539 10424 25389 17990 10592 13689 16786 5810 -5165
-13636e165L336L334j0818j0816R038R042j0104j2963L377R101o645r504N162Q028n214n211
-13620b6022P372P373r583r578O638O641n646n643J0577J0578l99l95J3912J3917o243o239
-13604G260P715P715r381j5101K843Q572m431p290P017R885o176j1896K411Q139o414r272
-13588h404N214Q080p017r877M551J0278o481j2202M193R921o347r206P309J3036k888q609
-13572h449P369J3096k229j1765K779Q509n688j1407O239J5783Q72q665L973R701o760j6298
-13556b940j990P554n948j1669O216J5761q20j0356K281Q008o573j6113J775J1319l235j2773
-13540a9503L205J2751k17j3570R77J0521n74j0111L80R925j737j1274M942J4486k451j1990
-13524a4240N657J9018M719q636P343K4520J6824L470P760J3488m048k1218j0726K635r355
$$ plain form
-13636 -5165 -1829 1505 -9313 -20129 -11091 -2049 -12153 -25116 -21739 -12638 -19283 -28787 -23625 -15597 -20811 -26022
-13620 -26022 -18650 -11277 -20860 -30438 -23800 -17159 -22805 -28448 -17871 -7293 -7692 -8087 5825 19742 13499 7260
-13604 7260 14975 22690 13309 -1792 1051 9623 5192 -2098 4919 14804 8628 -3268 -857 7282 868 -8404
-13588 -8404 -3190 4890 -2127 -12004 -7453 2825 -3656 -15858 -11665 -1744 -8091 -17297 -9988 3048 160 -8449
-13572 -8449 -1080 12016 9787 -1978 801 9310 3622 -7785 -1546 14237 15109 6444 10417 20118 13358 -2940
-13556 -2940 -4930 2624 -3324 -14993 -8777 6984 6164 -4192 -1911 6097 -476 -16589 -14814 -3495 -6730 -19503
-13540 -19503 -16298 -3547 -3764 -17334 -16357 -5836 -6410 -16521 -16141 -6216 -7953 -19227 -14285 201 -2250 -14240
-13524 -14240 -8583 10435 15154 6518 13861 38381 55205 58675 66435 79923 75875 54657 43931 46566 37211
-13509C7211j8893m823Q539l067j6425k05J3152L92j2967k947J4225K196j4979m245J2929
-13494A0093O846o511L984J7342M857j2318p309O049j584j4942k776J4397K337j1021k434
-13479G010J4741L768r590R06J8080R258m096M249J7610L832j7156j2866M96m696j8051q035
-13463E460R142L593j3577o902J0275J587j5582n091J2086O836j0335n329Q031K243j4926
-13448a2489o820J4174O059j1109m436J2743P629j3361j0499J0492Q105r067n729J1446O108
-13433C246p248k956J4218P659j3332q321Q851M014j3160o958J4031Q189j2802r701J1289
-13418b981P740r432o571J0604R887j1102r076Q099R339r741r385R698J4467L019j275J7808
-13402C1098J4827m257m256J4826M808j4274j4275M808M461j4621j4621M461R709r374r373
$$ plain form
-13509 37211 18318 13495 22034 18967 2542 2337 15489 15881 2914 -33 14192 16388 1409 -2836 10093
-13494 10093 16939 10428 14412 31754 36611 24293 16984 23033 21449 6507 3731 18128 20465 9444 7010
-13479 7010 21751 25519 15929 16835 34915 44173 40077 44326 61936 65768 48612 35746 36242 31546 13495 5460
-13463 5460 14602 18195 4618 -2284 7991 9578 -6004 -11095 991 7827 -2508 -7837 194 2437 -12489
-13448 -12489 -19309 -5135 924 -10185 -14621 -1878 5751 -7610 -18109 -7617 488 -8579 -14308 -2862 3246
-13433 3246 -4002 -6958 7260 14919 1587 -6734 2117 6131 -7029 -13987 44 8233 -4569 -14270 -2981
-13418 -2981 4759 -4673 -11244 -640 9247 -1855 -10931 -2832 6507 -3234 -12619 -2921 11546 14565 13290 31098
-13402 31098 45925 41668 37412 52238 57046 42772 28497 33305 37766 23145 8524 12985 22694 13320 3947
-13387C947R709R112r970r969R112J0365q717j3489N595Q363j0715j0718Q366J1763p316j0182
-13371d744Q903J2135o943j1717P367J1659p421j2194O890J1260p819j0685Q400J3585n494
-13356A3182n497J3589J9832P52n929J3156J1841p238j7737J349L045j6037j6038L045Q233
-13341A9548j0849j7528J554J3003o078j0849Q233J1333p749j4426M655J3830n250j3839N244
-13326i168J5381l701j2287O794J5619l462j2049P032J6932k150j0738Q345J6492k586j3086
-13311A7368O000J2318o760j9169q2J3511n568j7975J110J2437o642j9048L7J1174p905j4588
-13295b3782M499J4394m685j5184L902K1310K233j4945l492J0697p49j6019L067J6004l075
-13280e825j5005l552J3738n341j8225Q61J1472p607k3354m268J1949N04j3813N274K4818
$$ plain form
-13387 3947 13656 22768 12798 2829 11941 22306 13589 100 5695 14058 3343 -7375 991 12754 5438 -4744
-13371 -4744 4159 16294 9351 -2366 5001 16660 9239 -2955 3935 15195 7376 -3309 5091 18676 13182
-13356 13182 7685 21274 41106 41858 35929 49085 60926 53688 35951 37300 40345 24308 8270 11315 19548
-13341 19548 8699 -8829 -7275 5728 -350 -11199 -2966 8367 618 -13808 -9153 4677 -573 -14412 -9168
-13326 -9168 6213 2512 -9775 -2981 12638 9176 -2873 4159 21091 18941 8203 16548 33040 30454 17368
-13311 17368 23368 35686 28926 9757 9675 23186 17618 -357 753 13190 6548 -12500 -12463 -1289 -9194 -23782
-13295 -23782 -19283 -4889 -9574 -24758 -20856 454 2687 -12258 -15750 -5053 -5802 -21821 -18754 -2750 -5825
-13280 -5825 -20830 -24382 -10644 -15985 -34210 -33349 -21877 -29484 -52838 -57106 -45157 -44653 -58466 -53192 -28374
-13265b8374J3373r43J0511K7560Q483j1558j04J3846n233j9548m62J3846K400j5255l801
-13250D741J5966M518j6474K609J9306K24j6951n501J6429M979j5057l608J3209J759j4461
-13235A1688l012J8502P051j6801n353J6832N382j4655l205J5117L667k0186q736J4879L428
-13220B4598j6607n159J5184L739j6303m848K0431Q986j2962j510J6138M693j7257n803J8285
-13205C1605O839j7017n565J9359P912j6183j0454J5661R940j2009o280J6914J1192j3619
-13191C8295k165K7170K7174K840K844J7081k001k7882k2158K769K770j6910j6910R508R508
-13176E1933j6254j6254J3086J3086j0768j0767J1908J1908j3854j3853J4412J4413j1349
-13163C7647j1349J4472J4472j1289j1289J5009J5009j4570j4569J1461J1461j7163j7163
$$ plain form
-13265 -28374 -15001 -15944 -5433 22127 30610 19052 18948 32794 27561 8013 7551 21397 23797 8542 4741
-13250 4741 20707 25225 8751 11360 30666 30890 13939 8438 24867 29846 14789 11181 24390 26149 11688
-13235 11688 8676 27178 34229 17428 12075 28907 34289 19634 16429 31546 35213 15027 6291 21170 24598
-13220 24598 7991 2832 18016 21755 5452 604 21035 30021 17059 15549 31687 36380 19123 13320 31605
-13205 31605 38444 21427 15862 35221 43133 26950 16496 32157 42097 30088 23808 40722 51914 38295
-13191 38295 36130 63300 90474 93314 96158 113239 111238 83356 61198 63967 66737 49827 32917 42425 51933
-13176 51933 35679 19425 32511 45597 34829 24062 35970 47878 34024 20171 34583 48996 37647
-13163 37647 26298 40770 55242 43953 32664 47673 62682 48112 33543 45004 56465 39302 22139
-13150B2139J3309J3309j1498j1498J8856J8855j3585j3586J5755J5754j2870j2869J1386
-13137E3457J1386k0696k0697P332J3056j4614j4614J3771J9497q532q531J7230J7231j1633
-13123E3643j7356R925J5653r157j4879J3027J8754r873j5594J0119J5848q964j4685J3936
-13109F0397J9664j0395j9932R090J8635o414j5952J1953J7681q561j8098J3309K6671k87
-13095I7761r825J5695K5240l150j2687J4871K8233J513q024J9880L3242O761k777K9779M6958
-13080B83470K0476P123L8128N5306L1210K1673N8478R0922Q8771J05950J83469K69344L32791
-13067A587111M45381O67631R17617J033063R05213M94456j21909p31363j057673j015539
-13057C123988p73185n44436l82230k50325j64450j42985j33441r3788o1344o7907o7904l4393
$$ plain form
-13150 22139 35448 48757 37259 25761 44617 63472 49887 36301 52056 67810 54940 42071 53457
-13137 53457 64843 44147 23450 30782 43838 29224 14610 28381 47878 39346 30815 48045 65276 53643
-13123 53643 36287 46212 61865 52708 37829 50856 69610 59737 44143 54262 70110 61146 46461 60397
-13109 60397 80061 69666 49734 58824 77459 71045 55093 67046 84727 76166 58068 71377 98048 97761
-13095 97761 87936 103631 128871 125721 113034 127905 156138 157651 149627 169507 202749 209510 206733 236512 283470
-13080 283470 303946 311069 349197 404503 435713 457386 515864 606786 695557 801507 984976 1254320 1587111
-13067 1587111 2032492 2700123 3617740 4650803 5556016 6050472 5928563 5197200 4139527 3123988
-13057 3123988 2350803 1806367 1424137 1173812 1009362 866377 732936 639148 577804 509897 441993 407600
-13045D07600r582k9981m7151k5322q144l0808m4162j5303R508r340l0327j1487R507j5064
-13031A49944l6052p909J6902k423k3409j897J9093M89k4319m760K0048j182k5988p592J3398
-13016H4343p592k8583p115J7693P56k4050j525K3283Q61k7763q442K0183M438k0368k628
-13001B3491K2180N244j9563k42K8381P391k1233k889K1919L075k5549r090J9533M745k7696
-12986B9697j0283K2157Q800k3641p182K5259R515j9109l857K4766R977k2463r343K3096P592
-12971F4981k1032r701K2739R619k2821r224K3216J3674j8765r855K2590R228k3208j0332
-12957D1109K2113J2806j9630o605K9657J6295j9959q274K4170J2955k3298j4707K1554J2009
-12943A00195k4245j6854J9407J3678k2574j6124K0138J4408k1844j3261K3000J3455k2799
$$ plain form
-13045 407600 398018 368037 320886 295564 287420 256612 212450 197147 206655 197315 166988 155501 165008 149944
-13031 149944 113892 105983 122885 120462 97053 95156 114249 114738 90419 85659 105707 104525 78537 70945 84343
-13016 84343 76751 48168 41053 58746 59502 35452 33927 57210 58071 30308 21866 42049 46487 26119 23491
-13001 23491 45671 50915 31352 31110 59491 66882 45649 42760 64679 67754 42205 33115 52648 57393 29697
-12986 29697 19414 41571 50371 26730 19548 44807 54322 35213 31356 56122 66099 43636 34293 57389 64981
-12971 64981 43949 34248 56987 66606 43785 34561 57777 71451 52686 42831 65421 74649 51441 41109
-12957 41109 63222 76028 56398 49793 79450 95745 75786 67512 91682 104637 81339 66632 88186 100195
-12943 100195 75950 59096 78503 92181 69607 53483 73621 88029 66185 52924 75924 89379 66580
-12930F6580j8509J7753J2262k3992j9880K0197J5184k1069j8717J7543J3962k6108k1282
-12917A3924J4979J4737k1516j9135J7126J3782k6287k2413J7661J4797k5272k4756J5322
-12904a7051J5557k4513k1833K2061K1818k2068k6138J0123J2027k8043k6853J3223J3220
-12891e8470k6849k8703J1375J3518l0368m0986r10K665m5038n9339k6894k5706o9592p3770
-12877d59067j8426K6175N0986J24868K29827K68225K12890J55878J23441N9748k9935n3074
-12865F91536r180N367l8519m9496j785J1569l6134m9019n124J2046l1841m3055M655J8009
-12851D79029k9693m5590j696J7383k2686l6287J5240L4319j3384l2709J1185K8117j5769
-12838C87459l7003O892K8117j5769l1341J6369L7595j0108l3488J4223M0457l429l0386J3506
$$ plain form
-12930 66580 48071 65824 78086 54094 34214 54411 69595 48526 29809 47352 61314 35206 13924
-12917 13924 28903 43640 22124 2989 20115 33897 7610 -14803 2858 17655 -7617 -32373 -17051
-12904 -17051 -1494 -26007 -47840 -25779 -3961 -26029 -52167 -42044 -30017 -58060 -84913 -71690 -58470
-12891 -58470 -85319 -114022 -102647 -89129 -119497 -160483 -161393 -158728 -203766 -263105 -289999 -315705 -385297 -459067
-12877 -459067 -477493 -451318 -400332 -275464 -45637 222588 435478 591356 714797 774545 744610 691536
-12865 691536 682356 687723 649204 599708 597923 609492 573358 524339 519215 531261 499420 456365 461020 479029
-12851 479029 449336 403746 402050 419433 396747 360460 375700 410019 396635 363926 375111 403228 387459
-12838 387459 350456 357348 385465 369696 338355 354724 392319 382211 348723 362946 403403 399974 369588 383094
-12824C83094L8311n576l0386J3506L6641j1062l6685P208L5590q297l8117N777L8214J961
-12810D30179j9213L2313O9521K1819k5654q42J7521l0182o3424j9530J8394k1677n1497l787
-12796C53941L6045m025l6500P395M7703L816l6022P872M7702L817m0286k09L9861k08m3387
-12781C87515N07M5824N755l8766k504L9712l58m5683n605M2216K147m1352O30N5135K0785
-12766D65958k6443P905N6089J4107l4494j46M3745J763n3815j9467L9690N341m2858q76N7803
-12751E14302L1088j9243K2739Q8097N3748p853L597L5083k2165q8954n4606K1248K166m5672
-12737E33575j1319M8310J3966m4956j8237M4732J8021m0066n714O4412M5332j5974J8378
-12724F50460Q4329M9983k9578k3849K8027J316o2257k7905N2716L3637l7927j8840N2716
$$ plain form
-12824 383094 421405 415829 385443 398949 435590 424528 387843 395051 430641 422344 384227 390004 428218 430179
-12810 430179 410966 443279 512800 534619 508965 508123 525644 495462 432038 412508 430902 409225 357728 353941
-12796 353941 389986 385961 349461 356856 404559 408375 372353 380225 427927 431744 391458 391249 431110 430902 387515
-12781 387515 388022 433846 439601 400835 398331 438043 437685 392002 386397 428613 430760 389408 390038 445173 465958
-12766 465958 439515 447420 503509 517616 483122 482976 526721 528484 474669 455202 494892 500233 457375 456499 514302
-12751 514302 545390 526147 548886 636983 690731 682878 686475 721558 699393 610439 555833 577081 579247 533575
-12737 533575 522256 570566 584532 539576 521339 566071 584092 544026 538312 602724 648056 632082 650460
-12724 650460 734789 784772 755194 731345 759372 760688 698431 670526 723242 756879 718952 700112 752828
-12711G52828K6003m7706k0987N5816M4371k7662q576O6796M7718k2414M304Q8742P7296R02
-12697A037431J2355O5783K3805q1631p0177J9269J9273m8631k9545N3819M8098k6686p599
-12684A015564P4094N5016m2787m2783L7598K6153n3998m2544M8333M8336k9895j8441P6013
-12671A150659P0293k0354j4625P5298P5302j9936j9932O9752O9756k9955k9951O8560Q0013
-12658A524880j1841j1837R3471R3475o355j2075R3471J04925J4815J4819J35274J61993P4687
-12645B269702O3241J34439R2462n4882o4422Q8834J40358R881p9808l8303m7845j51904j57629
-12632B204124k0473L4867m9335n5060O7068R9509r798l8422Q3468J31174M0532K3357J45248
-12619B656259J81505O5995L3555J72142K42748J55445J45904L28143M94162N61457Q15257
$$ plain form
-12711 752828 778831 731125 710138 765954 810325 782663 774087 840883 888601 866187 870491 959233 1036529 1037431
-12697 1037431 1049786 1115569 1139374 1057743 987566 1006835 1026108 977477 947932 1001751 1049849 1023163 1015564
-12684 1015564 1089658 1144674 1101887 1059104 1096702 1122855 1068857 1026313 1074646 1122982 1093087 1074646 1150659
-12671 1150659 1220952 1200598 1185973 1261271 1336573 1316637 1296705 1366457 1436213 1406258 1376307 1444867 1524880
-12658 1524880 1513039 1501202 1594673 1688148 1681793 1669718 1763189 1868114 1882929 1897748 2033022 2195015 2269702
-12645 2269702 2332943 2467382 2559844 2504962 2440540 2529374 2669732 2679613 2599805 2561502 2513657 2361753 2204124
-12632 2204124 2183651 2218518 2169183 2114123 2181191 2280700 2270902 2232480 2315948 2447122 2487654 2511011 2656259
-12619 2656259 2837764 2903759 2937314 3109456 3352204 3507649 3653553 3981696 4475858 5037315 5852572
-12608E852572J486965K416288L191280L322950K308949J43071k194252l367831l042950k090729
-12598H026313j363919r07844n03055k68338k92646l06004j39746l0976j25435j69325j5232
-12587C903793O6823p3673j51912n692Q7814m6481j24718K9850J38621K1669m1300J28771
-12575C933565K29912O2697o5153N3632J28059n1083j67484K348J45472K0476n7758J38311
-12563D372994K89068J53384M4617K20650L44691J57916m65J48375K64782O9122r6892P4369
-12551F042611K36576P3417n4434J65966L66338K02749L6734K30896M16001K17776K8863K33282
-12539H196775M37469K26065j013J85515L89702J79552k4629K49204N44988L45235O4725K18097
-12527A1011685L72670K0591l28615q9849K51733O3171j56276K45171P50863O33741M06660
$$ plain form
-12608 5852572 7339537 9755825 12947105 16270055 18579004 18722075 16527823 13159992 10117042 8026313
-12598 8026313 6662394 5754550 5251495 4983157 4690511 4384507 4244761 4213785 4088350 3919025 3903793
-12587 3903793 3970616 3896943 3745031 3739339 3827153 3780672 3655954 3685804 3824425 3846094 3804794 3933565
-12575 3933565 4163477 4226174 4161021 4214653 4342712 4291629 4124145 4126493 4271965 4292441 4234683 4372994
-12563 4372994 4662062 4815446 4860063 5080713 5425404 5583320 5582855 5731230 5996012 6065134 5968242 6042611
-12551 6042611 6279187 6352604 6298170 6464136 6830474 7033223 7069957 7300853 7716854 7934630 7963493 8196775
-12539 8196775 8634244 8860309 8859296 9044811 9434513 9614065 9589436 9838640 10383628 10728863 10793588 11011685
-12527 11011685 11384355 11404946 11076331 10986482 11238215 11301386 11145110 11390281 12141144 12774885 13181545
-12516A3181545Q04769J295196J089407P44014J110878J635647J412860J048381J516620K194055
-12506B6033372K022190J638631K202045L055037K987772K756870L762766N214951N493387
-12497E5167021N254852O100699P255187P160726P242787R971599J4282365J7721467K2181076
-12488A52337779L1749350M5651017O0482721P9483357J09558455J44695287J61314392J38119419
-12480I23391777P6608222k842168p8569170j34529016j58036103j45206910j09486703p4101830
-12472B97228099n2223606m0199629l0474678k2641256j8967375j7236592j3965126j0066553
-12464I1453284q213860p780686o616654n271323n460488o359273n935105m429478l421209
-12455C7965208k843003j780579r54298j614561k975147l260688k510739k051325j992169
$$ plain form
-12516 13181545 13986314 15281510 16370917 17114931 18225809 19861456 21274316 22322697 23839317 26033372
-12506 26033372 28055562 29694193 31896238 34951275 37939047 40695917 44458683 49673634 55167021
-12497 55167021 60421873 66522572 73777759 80938485 88181272 98152871 112435236 130156703 152337779
-12488 152337779 184087129 229738146 290220867 369704224 479262679 623957966 785272358 923391777
-12480 923391777 999999999 997157831 918588661 784059645 626023542 480816632 371329929 297228099
-12472 297228099 245004493 204804864 174330186 151688930 132721555 115484963 101519837 91453284
-12464 91453284 83239424 75458738 68842084 63570761 58110273 51751000 45815895 41386417 37965208
-12455 37965208 35122205 33341626 32387328 30772767 27797620 24536932 22026193 19974868 17982699
-12446A7982699j450463o31816m92991q53653p77024l85830n33244j042750j045493o58115
-12436A0111320o86978j024740q90394l96155l07658n80541n10053j53209j75631n17210n04091
-12425D364660j77777j77301m57815l98898l4419J9250k38365k16323Q3274J09513j44286
-12414B731513j39039J26210J21201j70764k30993k2992l0148k80131k98020m0405J3026j79709
-12402A599749j71143Q2655J36087o4281q3841J31793J61610n7840j11332P3770R9055j05130
-12390A691152j57666J9802N1288j33813j75385N900N6707j13128j53022J6813N5932j13903
-12378A050677j60119R716O6011q4743j26247L2139Q5569o5182j14306K8814P5566p1369j23489
-12365F03037K3447Q3795m7874r7966L7520R3338l8333r2003L5851Q6181m9306j12472P753
$$ plain form
-12446 17982699 16532236 15900420 15407429 14553776 13776752 13390922 12857678 11814928 10769435 10111320
-12436 10111320 9424342 8399602 7509208 7113053 6805395 6224854 5714801 5561592 5385961 4868751 4364660
-12425 4364660 4186883 4009582 3551767 3152869 3118450 3137700 2899335 2683012 2766286 2875799 2731513
-12414 2731513 2592474 2718684 2839885 2669121 2438128 2415136 2384988 2104857 1806837 1766432 1779458 1599749
-12402 1599749 1428606 1511261 1647348 1583067 1499226 1631019 1792629 1734789 1623457 1697227 1796282 1691152
-12390 1691152 1533486 1553288 1604576 1470763 1295378 1301278 1357985 1244857 1091835 1108648 1164580 1050677
-12378 1050677 890558 900274 966285 881542 755295 787434 873003 807821 693515 722329 797895 726526 603037
-12365 603037 626484 710279 662405 564439 601959 695297 656964 564961 600812 686993 637687 525215 532968
-12352E32968N9748o4284j19151M890O6666m9734j01977K5881R6006j2762p1205M1385J04831
-12339E13262p752p5715K5426Q5294k3473r1340R803P8257j9060q5853P655O7523k9794r8615
-12325C55618q922O5734q684n7855M3286J21998M7580j3965M9011P5007n6659j61855r1247
-12312C59047r910o1430j05084j1577O5705m897p0431L995O9589m831p6513r720N9451p335
-12298A96059p5679q885N6708o262o7926j133O9946J0794n0819J2158P9420J6451n7617o090
-12284A67125N9742N89p1273j5930N9920J6034m7658N2O2783L630p3024k9131L6223p663o9088
-12269I2331j7562N5186J1301n6447j6369N1847P961n6208q497O3774K3704n0088j7644M4848
-12255A28137M778n7364j7286N5224J8971n2414k3786M2284J3663m7524p447O4587L9783k8628
$$ plain form
-12352 532968 592716 528432 409281 414171 480837 431103 329126 355007 451013 438251 367046 408431 513262
-12339 513262 505510 429795 455221 540515 517042 425702 435505 513762 494702 408849 416504 484027 454233 355618
-12325 355618 346696 412430 403746 345891 389177 511175 558755 544790 593801 668808 612149 450294 359047
-12312 359047 349137 287707 182623 171046 236751 231854 161423 165418 235007 230176 153663 143943 203394 196059
-12298 196059 120380 111495 168203 161941 94015 92882 162828 173622 122803 134961 214381 230832 173215 167125
-12284 167125 226867 227456 156183 140253 200173 216207 168549 168601 231384 235014 161990 132859 169082 161419 92331
-12269 92331 74769 129955 141256 84809 68440 120287 128248 72040 63543 127317 151021 100933 83289 128137
-12255 128137 132915 75551 58265 113489 132460 80046 56260 98544 112207 64683 57236 121823 161606 132978
-12241A32978p633N2950K0514n0692k9697L2317P514n5134k6507L8608J7622m6905k5911L6581
-12227I6605J1778m8746k3936M2851K5679l8251k1073M0942J9955m6928l3566K8688J1516
-12214F5514m6212k5216M3237L3700l0059k0514M1501K8147l6380l0651K9693J6340m2880
-12201B6220l3334L0587K4867l1550j4371N5634N5637Q040K1400P5187N4199k9410m6581o035
-12187A90490j9388p4970o1608P681P685m3483l7755K2948K2950l3457l3454K8561K8563k8209
-12173b3446k8207L0230L5958j9890k5613K9128L4854k0607k0602K9722K9727l1683m1225
-12160b1654J1252K0793l2160l2161K6160L9517q277j7819L0483L0484k9269m2625N676J5218
-12146d382l1543m1083J3063K2605k8561m1918J0082K7256k0928l4285J2467K9641j4308k7666
$$ plain form
-12241 132978 125345 178295 198809 148117 118420 150737 158251 103117 76610 115218 132840 85935 60024 96605
-12227 96605 108383 59637 35701 78552 104231 65980 44907 85849 105804 58876 25310 53998 65514
-12214 65514 19302 -5914 37323 71023 40964 20450 61951 90098 53718 23067 52760 69100 26220
-12201 26220 -7114 23473 48340 16790 2419 58053 113690 121730 143130 218317 272516 243106 196525 190490
-12187 190490 171102 96132 34524 42205 49890 6407 -31348 -8400 14550 -18907 -52361 -23800 4763 -23446
-12173 -23446 -51653 -21423 14535 -5355 -30968 -1840 33014 12407 -8195 21527 51254 19571 -21654
-12160 -21654 -10402 10391 -21769 -53930 -27770 11747 3470 -14349 16134 46618 17349 -25276 -19600 -4382
-12146 -4382 -35925 -77008 -63945 -41340 -69901 -111819 -101737 -74481 -95409 -129694 -117227 -87586 -101894 -129560
-12132a29560J9325L2683j5762k9116K0018L7196j1527k8699J8766L5944j3317l4304Q151
-12119i0202K5329j9995l3350J3398L4394j4018l8821k091J5087k6898m7885p816J3179k0786
-12105b00475l7956L783K4777j9116m0103M260L2887L247k475N2622Q1251K4952m5649n5433
-12091a73428m2071l2921L0055J55758K34000K09428J50276J18547O3211m2366j01518o6934
-12079E02037k6858n0714p1702l3301q57k6801n1606j5351J7092j5352m0155n811K2817m767
-12065A98671l3390m529K4096k859k7666M774L7215J0201j0790J8788M3596L284m0607j8423
-12051B02361J7834M790q569K7688N2496J450n3890l4330R560R73k7651j2862Q128j8348m6972
-12036A22658k3119J3138o236l4859j5538J6902k419l1043q143K4296K650k5974m983K3641
$$ plain form
-12132 -129560 -110235 -77552 -93314 -122430 -102412 -65216 -76743 -105442 -86676 -50732 -64049 -98353 -90202
-12119 -90202 -64873 -84868 -118218 -104820 -70426 -84444 -123265 -125356 -110269 -137167 -185052 -192868 -179689 -200475
-12105 -200475 -238431 -234648 -209871 -228987 -269090 -264830 -231943 -228696 -231171 -178549 -97298 -72346 -117995 -173428
-12091 -173428 -215499 -248420 -218365 -62607 171393 380821 531097 649644 712855 670489 568971 502037
-12079 502037 475179 424465 352763 319462 318605 291804 240198 224847 241939 226587 186432 180621 203438 198671
-12065 198671 165281 160752 184848 181989 154323 159097 196312 206513 195723 214511 258107 261391 220784 202361
-12051 202361 220195 224985 216416 244104 296600 298050 244160 209830 219390 220363 192712 179850 187978 169630 122658
-12036 122658 99539 112677 106441 71582 56044 72946 70527 39484 31341 55637 58287 32313 27330 50971
-12022E0971L604k8836q084K4356M909k7532j0358K2083O102k6340p495K8762J7312j5128
-12008C4326N624M5698L5918L477J1587M0212K8680p577j3302l761l1192n5999k9761J0313
-11994G4243P72l1669j6165K0093R359k3082j3302J9138P503k4938j1580K0861J0365k2076
-11980A9522q717K3722J3287j9153r612K2828J7223j5218j3071J5553N964k6477j7175J5266
-11966B3942J1092k1348j1808K0633J2642j9798j4073J8367J5087j7353j1629K0812J7458
-11953D4024j4983j2120K0320J5072j7368j4506J7935J4774j7667j7666J4774J3164j9276
-11940B6477j3552J8889J9992j2445j0301J8326J7249j5188j3045J5583J2419j6202j6444
-11927C1758J2184J1226k1211k1214J1229J4774j3846j5758J6686J9605r016q781J9847K4077
$$ plain form
-12022 50971 54575 25739 17655 42011 46920 19388 9030 31113 37215 10875 3380 32142 49454 34326
-12008 34326 39950 85648 121566 125043 136630 176842 205522 197945 184643 180882 149690 93691 63930 74243
-11994 74243 75015 43346 27181 47274 56633 33551 20249 39387 46890 21952 10372 31233 41598 19522
-11980 19522 10805 34527 47814 28661 19049 41877 59100 43882 30811 46364 52328 25851 8676 23942
-11966 23942 35034 13686 1878 22511 35153 15355 1282 19649 34736 17383 5754 26566 44024
-11953 44024 29041 16921 37241 52313 34945 20439 38374 53148 35481 17815 32589 45753 26477
-11940 26477 12925 31814 51806 39361 29060 47386 64635 49447 36402 51985 64404 48202 31758
-11927 31758 43942 55168 33957 12743 23972 38746 24900 9142 25828 45433 36417 27636 47483 71560
-11913G1560m544p409K1218K8072n48o276K2351K7271j349q986K3458L4010R206M908L3537
-11898B46479M3789K2802K2799N5242O4244M7073N8519J06229J49809J78438K48085L75943
-11886A619451N32416P17521R32674J049082Q56344L20126l36559q34611j038739r71947p33536
-11875B112222m68285l05653k40769j96286j23769q8768j00213r4016n2030k4930m4009n0215
-11863C23279k3496j0916l7629m7651k0931l410k2489k6787o7P026j9687l4002p283J0216
-11849H6173j6496k8426j707J3675n405k0197O523K0991n725k7193m77J3716n367k7312n97
-11834B176J7503j581j7323J759K0842J759k0186j103J3037o045k6081o999J5422l660j9880
-11819c0360p98J8733l51j4662M420J9806P23j9314k31J6586k497k5874o791J3604K155j9791
$$ plain form
-11913 71560 67016 59607 80825 108897 108349 102073 124424 151695 150346 141360 164818 198828 208034 212942 246479
-11898 246479 290268 313070 335869 391111 455355 502428 560947 667176 816985 995423 1243508 1619451
-11886 1619451 2151867 2869388 3802062 4851144 5707488 6027614 5691055 4856444 3817705 2845758 2112222
-11875 2112222 1643937 1338284 1097515 901229 777460 688692 588479 494463 442433 417503 373494 323279
-11863 323279 299783 288867 251238 203587 182656 179246 156757 129970 129903 136929 117242 83240 75957 86173
-11849 86173 69677 41251 39544 53219 47814 27617 34140 55131 49406 22213 21736 35452 30085 2773 2176
-11834 2176 19679 18098 775 2534 23376 25135 4949 3846 16883 10838 -15243 -22242 -6820 -10480 -30360
-11819 -30360 -31158 -12425 -12776 -27438 -23018 -3212 -2489 -21803 -22034 -5448 -7945 -33819 -40610 -27006 -24851 -44642
-11803d4642p08J5154L705j6809K273J9686O04j7524J557K1014J930j8106R77K1848K765j4409
-11787b0685k959J6601N150j3454k006J9820P38j8821p372J4014K564j9381p931J7473O023
-11772a0226j5922m473J6548N099j3030j580J7025N576j8278o828J4461L012j7026n575J7085
-11757a4132N635k0126q677J6489N039k0365q915J3984Q259j2970p246J0582J0581j1126n400
-11742c8388J7976O526j2199o474J4189Q464j3838q114J5620M170j4554q829J2310O586j8579
-11727c5134p130J6007J0283j3451j3451R926R925j0112j0111J0402J0402j1542j1543J1777
-11713c3752J1778j0168j0167J2851J2851j1002j1003J0168J0167j1777j1778J3030J3030
-11700a5772q915q916J6250J6251L845L846K0902K0901q677q676J1986J1986j7591j7592O261
$$ plain form
-11803 -44642 -45350 -30196 -26491 -43300 -41027 -21341 -20737 -38261 -36704 -15690 -13760 -31866 -30889 -9041 -6276 -20685
-11787 -20685 -23644 -7043 -1893 -15347 -17353 2467 3205 -15616 -22988 -8974 -6410 -25791 -33722 -16249 -10226
-11772 -10226 -26148 -30621 -14073 -8974 -22004 -23584 -6559 -983 -19261 -26089 -11628 -8616 -25642 -31217 -14132
-11757 -14132 -8497 -28623 -37300 -20811 -15772 -36137 -45052 -31068 -22809 -35779 -43025 -32443 -21862 -32988 -38388
-11742 -38388 -20412 -13886 -26085 -32559 -18370 -9906 -23744 -31858 -16238 -12068 -26622 -35451 -23141 -16555 -35134
-11727 -35134 -42264 -26257 -15974 -29425 -42876 -32950 -23025 -33137 -43248 -32846 -22444 -33986 -45529 -33752
-11713 -33752 -21974 -32142 -42309 -29458 -16607 -27609 -38612 -28444 -18277 -30054 -41832 -28802 -15772
-11700 -15772 -24687 -33603 -17353 -1102 2743 6589 27491 48392 39715 31039 43025 55011 37420 19828 26089
-11685B6089O262j1867j1867P700P704j0429j0424Q296Q300j5556j5552J3304J3310q640q634
-11670b004J3185J3190q759q754J5366J5371o579o574J3458J3463j0395j0391R194R199p026
-11655D1944p022J7186J7189k851k847J6004J6007K408K411K6977L8430K3398K3403M4091
-11641B56728M4095K5963K5966M5881M5884K0118J040K3410L4863K4125J8405L2354L8084
-11628F36916J7685J1964K5735K5739l008k2086r687r683k7934l9381k2966j7237l2985l2981
-11614E00091j0920j376k6305l9660k3563j4017l1911m5266k7260j3898k6783l2503j0682
-11601A95947K680j3306k2843j856J1505k333j5687K497J9675P029k508K0864L8042K7305
-11587B67011J7767L4461M7818L1598J8240K9213L8754J7764N88J8688L9678L0376J7018K3816
$$ plain form
-11685 26089 32351 20484 8617 16317 24021 13592 3168 11464 19764 4208 -11344 1960 15270 6630 -2004
-11670 -2004 11181 24371 15612 6858 22224 37595 31016 24442 37900 51363 40968 30577 39771 48970 41944
-11655 41944 34922 52108 69297 66446 63599 79603 95610 98018 100429 127406 165836 189234 212637 256728
-11641 256728 300823 326786 352752 398633 444517 464635 465675 489085 523948 548073 566478 598832 636916
-11628 636916 654601 666565 692300 718039 715031 692945 683258 673575 645641 606260 583294 566057 533072 500091
-11614 500091 489171 487795 461490 421830 398267 384250 352339 307073 279813 265915 239132 206629 195947
-11601 195947 198627 185321 162478 160622 172127 169794 154107 156604 176279 183308 180800 201664 239706 267011
-11587 267011 284778 319239 367057 398655 416895 446108 484862 502626 503214 521902 561580 591956 608974 632790
-11573F32790L7174K4173P000J1211J1211j8009l9000k7193j0019k4330m5321l5154j7979
-11560E06554k2273k7998j6667p127k7878m5053l4494j7320k9723m6898l8907k1732k3164
-11547A47320l2705j8155r80j1237k4595j4935K240m677j8035j0246L112l567j6923m998Q359
-11532b2J2j7164p055O302l76j7551q009N348j330j4689n922J1252K903j4271n326J1849O600
-11515d7449o757O67J4025L768r589k87J6887J0685o488L306K4295J9049J875N453J8810J2371
-11499F0621m805M14J7588R001q173k449J4726J1624n549m682Q677N576p782l489R869L906
-11483A05073j7085j3149M026J162j6011j2911Q081N933j1241j1263N911L526r832p208O149
-11468D1161J618j1740m107J3067Q535q640o254J0921J0920o254m119J3060J0909k445l02
$$ plain form
-11573 632790 669964 694137 701137 712348 723559 705550 666550 639357 629338 605008 559687 524533 506554
-11560 506554 484281 456283 439616 432489 404611 359558 325064 307744 278021 231123 192216 170484 147320
-11547 147320 114615 96460 95480 84243 59648 44713 46953 42276 24241 13995 17107 13540 -3383 -8381 -22
-11532 -22 -10 -17174 -24229 -17927 -18303 -35854 -43863 -38515 -39845 -54534 -60456 -49204 -46301 -60572 -65898 -54049 -47449
-11515 -47449 -54206 -53539 -39514 -35746 -45335 -45622 -28735 -18050 -24538 -21232 3063 22112 23987 29440 48250 60621
-11499 60621 55816 56230 73818 82819 74646 72197 86923 98547 92998 88316 96993 102569 94787 91298 101167 105073
-11483 105073 87988 74839 78865 80027 64016 51105 59186 65119 53878 42615 48526 52052 42220 35012 41161
-11468 41161 42779 31039 26932 39999 48534 39894 33640 44561 55481 49227 45108 58168 69077 66632 66330
-11453F6330J6877J7349J79J278K2273J9884K714J755J5117J7260R0m700J2478J2475m696
-11438A96663k315J4864J4621k549n476P887J0029p141q099R080Q359j2627j6306Q69L253
-11423B11112j0104j0641O534O772j0402j2221M953Q054r120j1804R188J1811n363j1916N259
-11408A82112J1938n237j1915N259R552l805p711N646J0417k940r024M335R344m014r635P540
-11392A91862J2311m864r516L843J0522k837r396P779J4219Q61r874L485Q256n103j0096L261
-11376B04713R940l418j1527J830Q747m610j2363M812J1252k106j0455K904J1490j867j0108
-11361A99234L250J3746L87r273M085J2672o86q378M979J1182J639l727N815J1300k057r340
-11345B34828P834J4275R17o240P119J6183r91j3932L242J8509Q967n821L719J0637J096j0439
$$ plain form
-11453 66330 83207 100556 100735 102013 124286 144170 146884 148639 163756 181016 181106 176406 188884 201359 196663
-11438 196663 194348 209212 223833 221284 215808 223695 233724 226583 218484 227564 235923 223296 206990 207859 211112
-11423 211112 201008 190367 196901 203673 193271 181050 186003 194057 184937 173133 182321 194132 188769 176853 182112
-11408 182112 194050 188813 176898 182157 191709 187904 180193 185839 196256 193316 184292 188627 197971 193957 184322 191862
-11392 191862 204173 199309 189793 193636 204158 201321 191925 199704 213923 214784 204910 208395 216651 211548 201452 204713
-11376 204713 214653 211235 199708 201538 210285 205675 193312 198124 209376 207270 196815 199719 211209 209342 199234
-11361 199234 202484 216230 216617 207344 211429 224101 223415 215037 220016 231198 232837 229110 234925 246225 244168 234828
-11345 234828 242662 256937 257854 251614 258733 274916 273925 259993 263235 281744 290711 284890 288609 299246 300342 289903
-11329B89903K918J3414L872o861O496J8900N542o355L187J3682M141p905N452J7618Q077
-11314C72081o392L149J7223P682l291K433J4838R113k904O638J9042R500p57M969J5463R739
-11298D78526l09R235K3544J4007J360P089J7342J1621J122O850J9728J0190l10R236J9727
-11283F28958J0190j986P558J9482J3760L99O127K0674J1137m939P90J6769J1046l149K579
-11268G39395J4979R258l745J979K0107J4383J31N855K0286J7424R96L857J6440J3578J114
-11253H76037O839K1450J8587M931P793K2105J9243P436J0297K2881K0018P167J2892K5296
-11239A082972J9571Q002J0864K4819K1956J4375J4379K8509K8512R426R429K7554K7558J2587
-11225A340513J2590K3081K3086Q054Q058K2366K2370N990N993K4118K4121O944O947K3164
$$ plain form
-11329 289903 292821 306235 310107 303246 309742 328642 334184 327829 331016 344698 348839 340934 346386 364004 372081
-11314 372081 365689 368838 386061 393743 390452 392885 407723 416836 413932 420570 439612 449112 448355 453324 468787 478526
-11298 478526 478217 487452 510996 525003 526363 533452 550794 562415 563537 570387 590115 600305 599995 609231 628958
-11283 628958 639148 637162 644720 664202 677962 678361 684488 705162 716299 711360 712150 728919 739965 736816 739395
-11268 739395 754374 763632 759887 761866 781973 796356 796487 802342 822628 840052 841048 844905 861345 874923 876037
-11253 876037 882876 904326 922913 927844 935637 957742 976985 984421 994718 1017599 1037617 1044784 1057676 1082972
-11239 1082972 1102543 1110545 1121409 1146228 1168184 1182559 1196938 1225447 1253959 1263385 1272814 1300368 1327926 1340513
-11225 1340513 1353103 1376184 1399270 1407324 1415382 1437748 1460118 1466108 1472101 1496219 1520340 1527284 1534231 1557395
-11211A557395K3167R955R959K9992K9995J5680J5684L5716L5720K1908K1908L8128L8128
-11198A883335K5605K5605M5642M5641L4073L4073N6018N6018M3376M3375N7688N7688M3919
-11185B452056M3920O3957O3956N3939N3938O9443Q0892O7117O7117Q4053Q4053P4154P4154
-11172C332749Q2741Q2741O7956O7960Q1552R3005Q4653Q4657J06837J25922J20851J32303
-11160D463927J59970J86689J97062K16148K55264K89615L04618L31337L80471M30089M70994
-11149G686184N20613N87397O29384O46495O73213P35229Q00113Q24559Q43646R08046J026361
-11138A5881240J174095J376375J654501K032339K538144L282372M350039N575149O534460
-11129D4398714O813073O449066O017808O040103O333983O091148M858413L349937K849960
$$ plain form
-11211 1557395 1580562 1590517 1600476 1630468 1660463 1676143 1691827 1727543 1763263 1785171 1807079 1845207 1883335
-11198 1883335 1908940 1934545 1980187 2025828 2059901 2093974 2149992 2206010 2249386 2292761 2350449 2408137 2452056
-11185 2452056 2495976 2559933 2623889 2677828 2731766 2801209 2882101 2949218 3016335 3100388 3184441 3258595 3332749
-11172 3332749 3415490 3498231 3566187 3634147 3715699 3808704 3893357 3978014 4084851 4210773 4331624 4463927
-11160 4463927 4623897 4810586 5007648 5223796 5479060 5768675 6073293 6404630 6785101 7215190 7686184
-11149 7686184 8206797 8794194 9423578 10070073 10743286 11478515 12278628 13103187 13946833 14854879 15881240
-11138 15881240 17055335 18431710 20086211 22118550 24656694 27939066 32289105 37864254 44398714
-11129 44398714 51211787 57660853 63678661 69718764 76052747 82143895 87002308 90352245 93202205
-11120I3202205L848955N417529O226039N901644N174102M849722M871766M493926L093756
-11111A37079644P69488j765219l662036m500720m535061m476631m846841n405478n363494
-11102A03293652m311033k887467k349820l277233m914457n964002n944927n513651n484074
-11093F2646988n877182o026024n449727m295484l047479k062338j432612j066943q26499
-11084C2562700n76998k75489Q1116M74219R45078J544278K359579L470188M733939N707149
-11074E1025759N977989N607792N218988N314385N622097N328232M061151K568877K154128
-11065I2879398L295281N049446N992123N649584M836673M546625M756525M532785L078706
-11056A34617146N45491k137535l986409m623752m493520m436273m944891n612770n543596
$$ plain form
-11120 93202205 97051160 102468689 108694728 114596372 119770474 124620196 129491962 133985888 137079644
-11111 137079644 137849132 136083913 132421877 127921157 123386096 118909465 114062624 108657146 103293652
-11102 103293652 98982619 96095152 93745332 90468099 85553642 79589640 73644713 68131062 62646988
-11093 62646988 56769806 50743782 45294055 40998571 37951092 35888754 34456142 33389199 32562700
-11084 32562700 31985702 31710213 31791329 32265548 33210626 34754904 37114483 40584671 45318610 51025759
-11074 51025759 57003748 62611540 67830528 73144913 78767010 84095242 88156393 90725270 92879398
-11065 92879398 96174679 101224125 107216248 112865832 117702505 122249130 127005655 131538440 134617146
-11056 134617146 135162637 133025102 129038693 124414941 119921421 115485148 110540257 104927487 99383891
-11047I9383891m394837k954093k492281l481248n133803o226925o284180n907293n880572
-11038E6628659o285129o479768n944026m810516l630973k787521k283265j966490j737263
-11029B0703708j550250j351795j157148j020265r85910r92118r65397q85016p81967p03015
-11019A0310827o68664o66937o66933o50480o23759o15891o04439n71524n06640m45531l88282
-11008C901747l30558k80943k45402k26319k00916j74199j58874j53150j40626j21543j14269
-10997A754948j14268r9002p9920p1079p1079o3327n1877m8657n4381m7703l6254l6134m1858
-10984I39409l8997k7546k4923l0648k8143j6694j3943k5389j9667q215r053k0499j4778l324
-10970F57590o370j7815j7819o366J90j1256j1259J93J31j1316j1319J34M067p380p383M070
$$ plain form
-11047 99383891 94989054 92034961 89542680 86061432 80927629 74700704 68416524 62509231 56628659
-11038 56628659 50343530 43863762 37919736 33109220 29478247 26690726 24407461 22440971 20703708
-11029 20703708 19153458 17801663 16644515 15624250 14638340 13646222 12680825 11795809 11013842 10310827
-11019 10310827 9642163 8975226 8308293 7657813 7034054 6418163 5813724 5242200 4735560 4290029 3901747
-11008 3901747 3571189 3290246 3044844 2818525 2617609 2443410 2284536 2131386 1990760 1869217 1754948
-10997 1754948 1640680 1541678 1461758 1390679 1319600 1256273 1204396 1155739 1101358 1053655 1017401 981267 939409
-10984 939409 900412 872866 847943 817295 789152 772458 758515 733126 713459 705244 696191 675692 660914 657590
-10970 657590 651220 633405 615586 609220 609410 598154 586895 587088 587219 575903 564584 564718 568785 561405 554022 558092
-10954E58092R075k370m879Q50n85j2031o310N143J1047N326Q423K7510M3905M9633O8116
-10939G60945Q7203Q8152O9074O5731Q4817Q7855O1142K6910K1188L7576O4296Q1228Q6956
-10926A623073P7531O6085O9539Q0993P0435K8456k2594m9305o9107q0554p3878o2424o7472
-10913A590778q6554p5104l3122j4577l3659o9201q0650q1664q1664q5599q5600q8760r4486
-10900F80138q1962m7613k5668k5669k4595j3145k889q613j1118L32R635R634J7029M3745
-10886E19241O5093P6543P7378Q3102Q2387P0938P2368P8094O2111K7763J1782L8497Q0150
-10873A345447Q5876P0729O5003P3711P9435P3949N4866K0436k9180o6032p1758o4124o4124
-10860A574234p3905p9628p4367o2916l5367j6283l1013p2995r5297q3848o9771p9309r9229
$$ plain form
-10954 558092 567167 564797 559918 560768 560183 548152 541842 546985 558032 563358 571781 599291 643196 692829 760945
-10939 760945 848148 936300 1005374 1071105 1155922 1243777 1304919 1331829 1353017 1390593 1454889 1536117 1623073
-10926 1623073 1700604 1766689 1836228 1917221 1987656 2016112 1993518 1944213 1875106 1794552 1720674 1658250 1590778
-10913 1590778 1504224 1429120 1395998 1381421 1347762 1278561 1197911 1116247 1034583 948984 863384 774624 680138
-10900 680138 598176 550563 524895 499226 474631 461486 458597 449984 438866 439198 448833 458467 475496 519241
-10886 519241 584334 660877 738255 821357 903744 974682 1047050 1125144 1187255 1215018 1226800 1265297 1345447
-10873 1345447 1431323 1502052 1567055 1640766 1720201 1794150 1849016 1869452 1840272 1774240 1702482 1638358 1574234
-10860 1574234 1500329 1420701 1346334 1283418 1248051 1231768 1200755 1127760 1032463 948615 878844 799535 700306
-10847G00306r3501p3647n6469m0372j9377l831l828q602k874L981L984j864P682J3246j08
-10832D24726j5855j0127J3425L4420N0636N6364N6123M6584L9425K6071m823m1076n0382
-10819F25511k9388j6340k9697k9340J4551O6908O6909K2183k1706l7957m7497n6682n6681
-10806D70774m6544l7002k5434m442N732p626k3130j7405PJ3365K4815M5806O2533M5358J5781
-10791E22588O239K3175L6533L4505K8780K1979K1982J8758J8763K0070K0074K1501K7230
-10778H22177J2318k0118m2784k9421r508j5229l0498k0954O213J1942j4063n4132q5741j02912
-10764D27290r3374o0931l0849k1303j7253p5J0895o277l1445l7166k3395k3395k9835k4111
-10750C8776q963q964j3377j3375l298l299r977r978k105k106j2601j2602l335l336q107q106
$$ plain form
-10847 700306 606805 533158 476689 436317 416940 413109 409281 400679 397805 401786 405770 403906 411588 424834 424726
-10832 424726 408871 398744 412169 446589 497225 553589 609712 656296 695721 721792 716969 675893 625511
-10819 625511 596123 579783 550086 520746 535297 602205 669114 691297 669591 631634 584137 527455 470774
-10806 470774 424230 387228 361794 357352 363084 355458 332328 314923 314930 328295 353110 398916 461449 506807 522588
-10791 522588 528827 552002 588535 623040 651820 673799 695781 714539 733302 753372 773446 794947 822177
-10778 822177 834495 814377 771593 742172 732664 717435 686937 665983 672196 684138 670075 615943 530202 427290
-10764 427290 333916 272985 242136 220833 203580 203505 214400 208123 176678 139512 116117 92722 62887 38776
-10750 38776 29813 20849 7472 -5903 -9201 -12500 -22477 -32455 -34560 -36666 -49267 -61869 -65204 -68540 -76647 -84753
-10734h4753M536M536m052m051P070P071l426l425O474O474k05k05J0194J0193L515L514J6634
-10717a9906J6634O138O138R120R121j376j375N781N780q98q98P950P950k546k546M611M610
-10700E4288p793p793j502j502j3906j3906p86p87j1280j1282J79J78j0316j0317k922k922
-10684d2369r601r601L88L88o292o291M801M800j878j879O113O112n07l369N814J1539N158
-10667c6674K296R467J2329P678P677J6563J6563L43L43R638R638l004q729J111O835K76k586
-10650D9764N419Q281k333q058j200M525m063r787r17M808k050p775o78K184m793j0518j86
-10633B2623N538j140o865P68O492k095p819L209Q938K254l466P64O493j800m659M282J0011
-10616D3528N416l06N714J1442M998p23R694J9239J5956J3097K4960L8321L4204K8482L1893
$$ plain form
-10734 -84753 -80217 -75681 -79733 -83784 -76714 -69643 -73069 -76494 -70020 -63546 -63751 -63956 -53762 -43569 -40054 -36540 -19906
-10717 -19906 -3272 2866 9004 18124 27245 25869 24494 30275 36055 35157 34259 42209 50159 47613 45067 49678 54288
-10700 54288 46495 38702 37200 35698 21792 7886 7100 6313 -4967 -16249 -16070 -15892 -26208 -36525 -39447 -42369
-10684 -42369 -51970 -61571 -61183 -60795 -67087 -73378 -68577 -63777 -65655 -67534 -61421 -55309 -55816 -59185 -53371 -41832 -36674
-10667 -36674 -34378 -24911 -12582 -4904 2773 19336 35899 36242 36585 46223 55861 52857 44128 45239 52074 52350 49764
-10650 49764 55183 63464 61131 53073 51873 56398 52335 42548 41631 46439 44389 36614 35936 38120 33327 22809 22623
-10633 22623 28161 27021 20156 20924 27416 25321 17502 20711 29649 31903 28437 29201 35694 33894 29235 33517 43528
-10616 43528 48944 48638 54352 65794 70792 70069 79763 99002 114958 128055 153015 191336 225540 254022 285915
-10601B85915L7621L2727K3190K5870K5873J7282J7287K7241L6786L0462K0923K6407L2134
-10588F39718K4976J1621N087o34j6380k5918k3298j7570k5683l5221k9082j5721j7752k3473
-10574D50670j9541j9537k8248l7785l1140k1594k6131l5668l0961j7599j6529j6526j0030
-10561A39381m88n498n497M06O131K195l529K851J6209J9191J9191K8612L4338L0402K0860
-10546C04755K8650L8191K9605J6246J5769K1494K0898K0898K6324L5866K9544K0003K0600
-10533F28843K6324J4279o713j3783j3782j7957k7499k7021k1296k6068l1792k4367j4827
-10520D44341j5541k8900l2299k6574k9675l9216l7353l1628l1389l7115k9421j6064j1531
-10507G7635j7257j3753m211l258q982p074K467l973j3514j0744j204J420q121p764k038k278
$$ plain form
-10601 285915 323536 356263 379453 405323 431196 448478 465765 493006 529792 560254 581177 607584 639718
-10588 639718 664694 676315 681402 680768 664388 638470 615172 597602 571919 536698 507616 491895 474143 450670
-10574 450670 431129 411592 383344 345559 314419 292825 266694 231026 200065 182466 165937 149411 139381
-10561 139381 138893 133395 127898 128304 134435 136630 133101 135952 152161 171352 190543 219155 253493 283895 304755
-10546 304755 333405 371596 401201 417447 433216 454710 475608 496506 522830 558696 588240 608243 628843
-10533 628843 655167 669446 662733 648950 635168 617211 589712 562691 541395 515327 483535 459168 444341
-10520 444341 428800 399900 367601 341027 311352 272136 234783 203155 171766 134651 105230 89166 77635
-10507 77635 60378 46625 42414 39156 30174 23100 25567 21594 8080 -2664 -3868 -2448 -10569 -18333 -20371 -22649
-10491b2649q002l962J763L910n632n393L32K479p063m961M581K433l291m722M819M819m722
-10474d5261n110O15O15n110o302L239L477o064l898N646N643l895n568L977L973n565n270
-10457f4858M275M033n505m733R95L138o400o760K784P312k225l481K247M152n385l377K352
-10440g1436K109l611m570J160L540n997l935N605N606l936l518O023O022l518q259J282N814
-10423g1619R0o411L131N754L0l906J819M681j043k594L130N517m026l444O098N859l682k967
-10405f3583K758K519l205m804R20J160m566p249K292M916q09m312J412J652m074p831J711
-10388h1093O243N18m148J576M439j286m029J696O705k836o608q84L888j838p920J622Q300
-10371g5655j241m749R77P417J696n584J46M912q09n344L80P059J338n106O22L481k240o641
$$ plain form
-10491 -22649 -30651 -34613 -32850 -28940 -34572 -39965 -39633 -37154 -44217 -49178 -44597 -42164 -45455 -50177 -45358 -40539 -45261
-10474 -45261 -50371 -49756 -49141 -54251 -60553 -57314 -53837 -59901 -63799 -58153 -52510 -56405 -61973 -57996 -54023 -59588 -64858
-10457 -64858 -60583 -56550 -62055 -66788 -65793 -62655 -69055 -75815 -73031 -65719 -67944 -71425 -69178 -65026 -70411 -73788 -71436
-10440 -71436 -69327 -72938 -77508 -76348 -72808 -78805 -82740 -77135 -71529 -75465 -78983 -72960 -66938 -70456 -78715 -77433 -71619
-10423 -71619 -71529 -77940 -74809 -69055 -69025 -72931 -71112 -66431 -67474 -70068 -66938 -61421 -65447 -68891 -62793 -56934 -60616 -63583
-10405 -63583 -60825 -58306 -61511 -66315 -65395 -64235 -68801 -76050 -73758 -68842 -69651 -73963 -72551 -70899 -74973 -82804 -81093
-10388 -81093 -74850 -74332 -78480 -76904 -72465 -73751 -77780 -76084 -69379 -72215 -78823 -79707 -75819 -77657 -85577 -83955 -75655
-10371 -75655 -76896 -81645 -80668 -73251 -71555 -77139 -76993 -72081 -72890 -78234 -77854 -70795 -69457 -74563 -73941 -70460 -72700 -79341
-10353g9341r17M092j629p715J830Q267K546l258K468R384j52n882j53Q014K292o254l388
-10336f9796L227k493q043J502P939K217o954j227N449k72n285M44P119J397p894k165M808
-10319g0027J949l004K724P671J949p268j539N136n85r236l507N195K337p379m518M070J208
-10302g4824o127l265N620N624k370M92N322m02o963j237N561K702o403l541O776L913m077
-10285g3199m077M330M335l034l034L645L645o731o731L765L768J528J528P789K065n806k945
-10268f9159N464K601o492l630O984O985k617k616M063M062n576n575J103J103r24r25N755
-10251e9394N755p350p350N054N054j029j028J833J834m737m737N758N758j45j45j46j45o377
-10233f1537o377K210K210n005n006J674J673n721n721M775M774o079o079M417M416l887l887
$$ plain form
-10353 -79341 -80258 -76166 -77795 -85510 -83680 -75413 -72867 -76125 -73657 -64273 -64425 -70307 -70460 -62446 -60154 -66408 -69796
-10336 -69796 -66569 -69062 -77105 -75603 -67664 -65447 -72401 -73628 -68179 -68451 -73736 -73292 -66173 -64776 -72670 -74835 -70027
-10319 -70027 -68078 -71082 -68358 -60687 -58738 -66006 -67545 -62409 -62994 -72230 -75737 -70542 -68205 -75584 -80102 -76032 -74824
-10302 -74824 -80951 -84216 -78596 -72972 -75342 -74850 -69528 -69930 -76893 -78130 -72569 -69867 -76270 -79811 -73035 -69122 -73199
-10285 -73199 -77276 -72946 -68611 -71645 -74679 -71034 -67389 -74120 -80851 -77086 -73318 -71790 -70262 -62473 -60408 -66214 -69159
-10268 -69159 -63695 -61094 -67586 -71216 -64232 -57247 -59864 -62480 -58417 -54355 -59931 -65506 -64403 -63300 -64224 -65149 -59394
-10251 -59394 -53639 -60989 -68339 -63285 -58231 -59260 -60288 -58455 -56621 -61358 -66095 -60337 -54579 -54724 -54869 -55015 -55160 -61537
-10233 -61537 -67914 -65704 -63494 -68499 -73505 -71831 -70158 -75879 -81600 -76825 -72051 -78130 -84209 -79792 -75376 -79263 -83150
-10216h3150M700M699m960m961j90j90k240k236O168O172k240n099l3N695n71n66M558M562
-10198f9882m267m264K411K415n989n986K598K602l843l839M745M748j383j379N117N121m006
-10181g5081o865p1N657j673m536K024K024l522o385K143P868K307l418J61J60m730m729L798
-10163h4868O660j536p260J148O873q80o604P4N799J312m412j372M353j014l876Q95L757J23
-10145h0828n602P79L641j547m409K270N132k307n169J509M372j890m752K047P771J319m405
-10128h2069L65O090j782p506k736K989P83m942j71N553o49o373j424M301J234j625L142O008
-10110g8812l17o038j449M278Q76m845J532M398Q75m845J651P380N03n218m51N278J457m264
-10092g8011N03O232m36o157N18O247K307l414j808J059j953p675j177M550N52n169J505P235
$$ plain form
-10216 -83150 -78450 -73751 -78711 -83672 -83862 -84052 -86292 -88528 -82360 -76188 -78428 -83527 -83560 -77865 -78436 -79002 -74444 -69882
-10198 -69882 -74149 -78413 -76002 -73587 -79576 -85562 -82964 -80362 -84205 -88044 -83299 -78551 -79934 -81313 -76196 -71075 -75081
-10181 -75081 -81946 -82017 -76360 -78033 -82569 -80545 -78521 -82043 -88428 -86285 -78417 -76110 -79528 -79367 -79207 -83937 -88666 -84868
-10163 -84868 -78208 -79744 -87004 -85856 -78983 -79863 -86467 -86393 -80594 -79282 -83694 -85066 -80713 -81727 -85603 -84708 -80951 -80828
-10145 -80828 -86430 -85651 -82010 -83557 -87966 -85696 -80564 -82871 -88040 -86531 -82159 -84049 -88801 -86754 -78983 -77664 -82069
-10128 -82069 -81704 -75614 -77396 -84902 -87638 -84649 -83866 -88808 -88979 -83426 -84075 -90448 -91872 -87571 -86337 -87962 -84820 -78812
-10110 -78812 -79129 -85167 -86616 -82338 -81462 -86307 -84775 -80377 -79502 -84347 -82696 -75316 -74813 -80031 -80482 -75204 -73747 -78011
-10092 -78011 -77508 -71276 -71712 -77869 -77351 -71104 -68797 -72211 -74019 -72960 -74913 -82588 -83765 -79215 -78663 -83832 -82327 -75092
-10074g5092M17n304k445L284J133m588J79N907p97o519l898N646L735j987j42K725j394p115
-10056h6255o19N110K184l537R92O720J725p815m954M588J964l760o60N065L396k330N6R597
-10038f8533L038o504o265L276L328k396k397L329M282n259n497M043N118m424k039L686L448
-10021f9766k278k277L448K568l157l157K568K568l157l157K568L194k530k531L194L433k293
-10004g0762m677M864L611n929l545K180L373k351k352L373K985k739k739K985j845p570m946
-9987h6084M596M782r43r43M782M126n416n415M126L082k643k404L321L321k404k642L082
-9970g3676N110m432m670M872Q330j212j927L798N677l865o310n86M365J502K754Q479R691
-9953d2100L969K177K180l28r866j0227o82K09n512n278M51J879l843l846J882K668l052l056
$$ plain form
-10074 -75092 -74675 -79979 -82424 -79140 -78007 -82595 -82416 -76509 -77306 -83825 -87723 -82077 -78342 -80329 -80471 -77746 -79140 -86255
-10056 -86255 -86874 -81764 -79580 -83117 -82125 -75405 -73680 -81495 -86449 -81861 -79897 -83657 -84317 -79252 -75856 -78186 -78130 -68533
-10038 -68533 -65495 -71999 -78264 -74988 -71660 -74056 -76453 -73124 -68842 -74101 -79598 -75555 -70437 -74861 -76900 -73214 -69766
-10021 -69766 -72044 -74321 -70873 -68305 -71462 -74619 -72051 -69483 -72640 -75797 -73229 -70035 -72565 -75096 -71902 -68469 -70762
-10004 -70762 -75439 -70575 -66964 -72893 -76438 -74258 -70885 -73236 -75588 -72215 -69230 -71969 -74708 -71723 -73568 -81138 -86084
-9987 -86084 -81488 -76706 -77649 -78592 -73810 -69684 -75100 -80515 -76389 -73307 -75950 -78354 -75033 -71712 -74116 -76758 -73676
-9970 -73676 -68566 -72998 -77668 -72796 -64466 -65678 -67605 -63807 -58130 -61995 -68305 -68891 -64526 -63024 -60270 -51791 -42100
-9953 -42100 -38131 -35954 -33774 -34102 -43968 -54195 -54877 -54668 -60180 -65458 -65007 -63128 -66971 -70817 -68935 -66267 -69319 -72375
-9935g2375K672J297m424o575K971N113o07l235K493N352l69n143N85N252m74k620O921J1752
-9917e1414O026K568K568K136p406j1938o213j263j264o630K911O198M73n967k42M111j614
-9900f6960m476J248L828j897o310n85O869O869L410R135J1461J919o667o668j420j420r411
-9883f1075l686m06m06l627K098L411k315k314L410L597k129p137K404R262L537k904K822
-9866e5458J0693M968k307k307j234o958j0179m454J528m193p059j330N941K20o463p34N523
-9849g3803j97m972P56P194J472l541l537J297J301l832l827O067L47n024n020K236K240k535
-9831h3378k530L190L194L0L4M617j49n937l071K888L0l909Q64N647K788j987j983K128K132
-9812g5402k642k639L835L839k844K3N206M40m454L21N594Q28p645k869O608L749m841m838
$$ plain form
-9935 -72375 -69703 -68406 -72830 -79405 -76434 -71321 -71928 -75163 -72670 -67318 -67687 -72830 -72245 -66993 -67467 -70087 -63166 -51414
-9917 -51414 -45388 -42820 -40252 -38116 -45522 -57460 -63673 -64936 -66200 -72830 -69919 -63721 -63248 -69215 -69457 -65346 -66960
-9900 -66960 -71436 -70188 -66360 -68257 -74567 -75152 -68283 -61414 -58004 -48869 -37408 -35489 -42156 -48824 -50244 -51664 -61075
-9883 -61075 -64761 -65167 -65573 -69200 -67102 -63691 -66006 -68320 -64910 -61313 -63442 -70579 -68175 -58913 -55376 -58280 -55458
-9866 -55458 -44765 -39797 -42104 -44411 -45645 -52603 -62782 -67236 -65708 -69901 -76960 -78290 -72349 -72129 -78592 -79326 -73803
-9849 -73803 -74000 -78972 -78216 -71022 -69550 -73091 -76628 -75331 -74030 -77862 -81689 -75622 -75275 -80299 -85319 -83083 -80843 -83378
-9831 -83378 -85908 -82718 -79524 -79494 -79460 -74843 -74992 -80929 -84000 -81112 -81082 -84991 -84127 -78480 -75692 -77679 -79662 -77534 -75402
-9812 -75402 -78044 -80683 -76848 -73009 -75853 -75830 -70624 -70184 -74638 -74317 -68723 -67895 -75540 -78409 -71801 -68052 -72893 -77731
-9794g7731M059M062p12p08K628K631k143k139N117N121n378n375L686L690m901m897P71P75
-9776g1444k090k088L276L280n311n307N348N352l239l235L40L42k523k519L626L630P64P68
-9758g1030K434K437m245m241M252M257k427k422K225K229m454m450J919J923k851k847K635
-9741g4656K638k27k24O363O365k225k221Q76Q79j986j983L671L675m916m912L075L078j695
-9723f4425j693M238M242m350m346P79P83l992l988K695K698l984l980K813K818n773n770
-9706h1235M141M145m51m48M320P186l32n098J367J372j23n844k329L399j83j79K367K370
-9688f5555k404k400M335M338k344k341K944K948l734l731J275J278l496l492L183L187j588
-9671f7597j584R17R20j945j942J226J226l544l545L373L373j397j398K568K568n33o258o52
$$ plain form
-9794 -77731 -73672 -69610 -70322 -71030 -68402 -65771 -67914 -70053 -64936 -59815 -65193 -70568 -66882 -63192 -68093 -72990 -72219 -71444
-9776 -71444 -73534 -75622 -72346 -69066 -74377 -79684 -74336 -68984 -72223 -75458 -75118 -74776 -77299 -79818 -76192 -72562 -71798 -71030
-9758 -71030 -68596 -66159 -70404 -74645 -70393 -66136 -68563 -70985 -68760 -66531 -70985 -75435 -73516 -71593 -74444 -77291 -74656
-9741 -74656 -72018 -72245 -72469 -66106 -59741 -61966 -64187 -63311 -62432 -64418 -66401 -62730 -59055 -63971 -68883 -65808 -62730 -64425
-9723 -64425 -66118 -61880 -57638 -61988 -66334 -65555 -64772 -68764 -72752 -70057 -67359 -71343 -75323 -72510 -69692 -75465 -81235
-9706 -81235 -77094 -72949 -73400 -73848 -69528 -62342 -62674 -67772 -66405 -65033 -65156 -71000 -73329 -69930 -70113 -70292 -67925 -65555
-9688 -65555 -67959 -70359 -66024 -61686 -64030 -66371 -63427 -60479 -64213 -67944 -66669 -65391 -68887 -72379 -69196 -66009 -67597
-9671 -67597 -69181 -68264 -67344 -69289 -71231 -70005 -68779 -72323 -75868 -72495 -69122 -70519 -71917 -69349 -66781 -67314 -73572 -74224
-9653g4224N073j368j368N14N15k348k349K185K184k587k587L899L898q72q72M137M137q72
-9635f2905o597j170M554j885j886L123L123l198l197j037M689J826l898K065K064J57n568
-9618f9740J878J879j581p305M47O173J401m324j997L727Q65m861Q65O590J818l906Q69O597
-9600f0605q6n807J286P014M387n151l887J841J599m122j919L809r66o686J01N829K963k758
-9582f3158l120K609K605l116p19N009M648j073J75J79N33n188l262K468K463l257j949L779
-9564f0374L418k304K255K259r66r61M06M10m007m002J092O820K404l317p57M972j472p193
-9546f1317m037N509L358k363J867P596L299o239m182N363N837J15P08O437Q938L216K452
-9529b3443K457k676q398o134L410L645n893n106M439K289l433k184P361P596j942j036Q509
$$ plain form
-9653 -74224 -69151 -70519 -71887 -71373 -70858 -73206 -75555 -73370 -71186 -73773 -76360 -72461 -68563 -69435 -70307 -66170 -62033 -62905
-9635 -62905 -69502 -70672 -66118 -68003 -69889 -66766 -63643 -66841 -70038 -71075 -66386 -64560 -68458 -66393 -64329 -64172 -69740
-9618 -69740 -67862 -65983 -67564 -74869 -74422 -68249 -66848 -71172 -73169 -69442 -68577 -73438 -72573 -65983 -64165 -68071 -67202 -60605
-9600 -60605 -60691 -66498 -65212 -58198 -53811 -58962 -62849 -61008 -59409 -63531 -65450 -61641 -62607 -69293 -69192 -63363 -60400 -63158
-9582 -63158 -66278 -63669 -61064 -64180 -64899 -59890 -55242 -56315 -56140 -55961 -55428 -60616 -63878 -61410 -58947 -62204 -64153 -60374
-9564 -60374 -56956 -59260 -57005 -54746 -55712 -56673 -56267 -55857 -59864 -63866 -62774 -55954 -53550 -56867 -57624 -52652 -54124 -61317
-9546 -61317 -65354 -59845 -56487 -58850 -56983 -49387 -46088 -52327 -56509 -51146 -45309 -45194 -44486 -38049 -29111 -25895 -23443
-9529 -23443 -20986 -23662 -32060 -38194 -34784 -31139 -37032 -42138 -37699 -35410 -38843 -41027 -33666 -26070 -28012 -29048 -20539
-9512b0539J0890N170Q12O540R996J0000J2359J8084J5221R497Q005Q006J0868N144L652L653
-9496A17358K102l623p01N025K400p141q505k781m092j3634j5124j5125j2500j2501j3067
-9481A8091p342r967r965o149L391J603m122j476M249L533L533O097O097L474o068p826J715
-9464a132M098j625J119O842Q990n51r62M763M763r61j081Q460J5140R414Q580J8121J9672
-9447A03650J9671J8300K7841L2731K7007K5094L0819L2609K3066J5732J5732J1916K374n870
-9433C80672n870j1237j1238j7260j7260k0122k0123k1069k1069k1069k1069k3395k3395j8624
-9419A27872j8624j9206j9206j0022j0022j3003l463K262K263J79R720J4849J4848R959R959
-9404I8365o0j3417j9441r899n605n606o560o559J19J19l563l563L116L116J088J088R676
$$ plain form
-9512 -20539 -9649 -4479 -3667 2873 12869 22869 35228 53312 68533 78030 86035 94041 104909 110053 113705 117358
-9496 117358 119460 115837 115136 120161 122561 115420 106915 104134 100042 86408 71284 56159 43659 31158 18091
-9481 18091 10749 782 -9183 -15332 -11941 -10338 -14460 -15936 -11687 -8154 -4621 1476 7573 11047 4979 -2847 -1132
-9464 -1132 2966 1341 2460 9302 18292 17741 16779 21542 26305 25344 24263 32723 47863 57277 65857 83978 103650
-9447 103650 123321 141621 169462 202193 229200 254294 285113 317722 340788 356520 372252 384168 386542 380672
-9433 380672 374802 363565 352327 335067 317807 297685 277562 256493 235424 214355 193286 169891 146496 127872
-9419 127872 109248 90042 70836 60814 50792 37789 34326 36588 38851 39030 48750 63599 78447 88406 98365
-9404 98365 98305 84888 65447 55548 49943 44337 37777 31218 31337 31456 27893 24330 27446 30562 31650 32738 42414
-9387D2414R675R646R646K0141K0141K3302K3301K8430K8430K1248K6977K9120J9582O041
-9373C18094O046M133n404j6619j6616k5802k5799k9142k9138k0555k6276k9746k0200j3526
-9359F9450j3522j4480j4475j68j64p354p349J233J238J710J715J1848J1852J3202P476l377
-9343E8835j6734k0551j4827q385q385q133q132K363K363n032n032J648J647m361m360K318
-9327c4758K318k333k333N29N29k184k184K587K587O78O78N449N449k829k829L612k113n930
-9309c3077k05M804M804k187k188J2482J2482J1288J7014K1427J1886n632j5173j2907j2907
-9294A1911j4098q375j099j100p286p287J301J301l112l112L566L567k277k274N86N89l649
-9277c0848l645L030L034L61L65L62L65j368j364L403L407n043n039L544L548o29o27P958
$$ plain form
-9387 42414 52089 61735 71381 91522 111663 134965 158266 186696 215126 236374 263351 292471 312053 318094
-9373 318094 324140 328273 322869 306250 289634 263832 238033 208891 179753 159198 132922 103176 82976 69450
-9359 69450 55928 41448 26973 26805 26641 19287 11938 13171 14409 16119 17834 29682 41534 54736 62212 58835
-9343 58835 42101 21550 6723 -1662 -10047 -18180 -26312 -23949 -21586 -26618 -31650 -30002 -28355 -32716 -37076 -34758
-9327 -34758 -32440 -34773 -37106 -36577 -36048 -38232 -40416 -37829 -35242 -34564 -33886 -28437 -22988 -25817 -28646 -25034 -27147 -33077
-9309 -33077 -33282 -28478 -23674 -25861 -28049 -15567 -3085 8203 25217 46644 58530 52898 37725 24818 11911
-9294 11911 -2187 -10562 -11661 -12761 -20047 -27334 -26033 -24732 -27844 -30956 -27390 -23823 -26100 -28374 -27788 -27199 -30848
-9277 -30848 -34493 -31463 -28429 -28068 -27703 -27341 -26976 -28344 -29708 -26305 -22898 -27941 -32980 -29436 -25888 -26517 -27144 -19186
-9259a9186P961M111M114J4844K0574J7707J1986Q524j014j5124j5121q445k717l914l909
-9244B0391L123L127R17R20R504R508N211N214Q073Q076J036J040N807N810k16k12J0279J0283
-9226A07891K348K352K348K352l556l552o93o90n303n304n33n33n780n781k918k919r358r359
-9208F1012m588m588q285q286K210K211o131o131N47N48l626l627N557J1282N438N438J0566
-9191E9547J0566R016R016J3786J3787Q576Q580J9071J9075J3287J3291J8296K4025K2292
-9177B62211J6570J9549J9552J3108L570J898J900n042j0764p905p902j2258j7979j7626j7621
-9162B41261k3947k3943j7029j1300j6075k1796j4763r034j3954j3954j0138m413p037p036
-9148D6842l221K505l638l637m18m17k445k445M234M234m85m84M882J0608L928L928R653J5378
$$ plain form
-9259 -19186 -11225 -7114 -3000 11844 32418 50125 62111 70635 69621 54497 39376 30931 28214 24300 20391
-9244 20391 23514 26641 27558 28478 37982 47490 52701 57915 65988 74064 75100 76140 81947 87757 87541 87329 97608 107891
-9226 107891 110239 112591 114939 117291 113735 110183 109490 108800 103497 98193 97660 97127 91347 85566 82648 79729 70371 61012
-9208 61012 56424 51836 43551 35265 37475 39686 33555 27424 27971 28519 24893 21266 26823 38105 43543 48981 59547
-9191 59547 70113 79129 88145 101931 115718 124294 132874 151945 171020 184307 197598 215894 239919 262211
-9177 262211 278781 298330 317882 330990 334560 336458 338358 333316 322552 314647 306745 294487 276508 258882 241261
-9162 241261 217314 193371 176342 165042 148967 127171 112408 103374 89420 75466 65328 60915 53878 46842
-9148 46842 43621 46126 42488 38851 38433 38016 35571 33126 37360 41594 41109 40625 45507 56115 60043 63971 73624 89002
-9130H9002J0548J0547J3410J3411O373O48N062J0786M036j684K843Q573J00r437j0156m428
-9114A49634q784j4506j1290n560r202r199l835J893R66m756m402J327j241j237M245J3790
-9098I7843J7484J7487K3447K9176K9410K9414L3942L3947K7140J7603J1636J1640p68j4122
-9084C65279j5795j5792k3071l2608l5235k9508l1419l1415k7842j8296j7815j7812j2448
-9071E6223k904k609q330p737k009m473m468k922K806J730l992l996J733L079k646j931j930
-9054A5624m615m614j513M212L093k631N89O313N956N956N718J5258J8255J8256K0402K6126
-9038A32385K8632K8631K8632K8631K2131J6407J9627J9626J9389J9388K1654K1654J3779
-9025D20566M238j487j487j4905k4446k5757k0033k1345l0887k8739k3015k2776k8501k1703
$$ plain form
-9130 89002 99550 110097 123507 136918 143291 143939 149001 159787 163823 162139 164982 173555 173655 164218 154062 149634
-9114 149634 140850 126344 115054 109494 100292 91093 87258 89151 90117 85361 80959 82286 81045 79808 84053 97843
-9098 97843 115327 132814 156261 185437 214847 244261 278203 312150 339290 356893 368529 380169 379401 365279
-9084 365279 349484 333692 310621 278013 242778 213270 181851 150436 122594 104298 86483 68671 56223
-9071 56223 53319 50710 42380 34643 32634 28161 23693 20771 23577 25307 21315 17319 19052 22131 19485 17554 15624
-9054 15624 11009 6395 4882 9094 12187 9556 10145 16458 22414 28370 34088 49346 67601 85857 106259 132385
-9038 132385 161017 189648 218280 246911 269042 285449 305076 324702 344091 363479 385133 406787 420566
-9025 420566 424804 423317 421830 406925 382479 356722 336689 315344 284457 255718 232703 209927 181426 159723
-9011A59723j2161n974n975n974n975j3667k3209k0584p227n259n259n140N86K016l708K254
-8995D4467J1797J0883k471j2494j2489j2612j2609j1062n332l265l262m4N684O096l439l086
-8979c238O458P752P756R303J8848K5225J9503J7950J7953J4327M790K877K881L295o243o605
-8963A42832K941M562j163n695L0j044o768j0227j0227q319j4044j6190o649Q05Q05P365J6906
-8946I5920J1621n554j9149j9150j2352j2351r131M10J0189J0190J1979J7704K4621J8896
-8932A23843L869r490k5452l1173k6168j2806o727j2449j4121m576J084m636m402J327K754
-8917a9123k967n833j04N870J49k717L012N870J49k717L011L470k251n117O11O154M32k672
-8899a4773k669J364J364J364J364L988L988J126J126N492N494N494N493J5751J5751J080
$$ plain form
-9011 159723 147562 141588 135613 129639 123664 109997 86788 66204 58977 53718 48459 43319 43905 45921 42213 44467
-8995 44467 56264 67147 64676 52182 39693 27081 14472 3410 -1922 -5187 -8449 -8493 -2809 3287 -152 -3238
-8979 -3238 3220 10972 18728 28031 46879 72104 91607 109557 127510 141837 146627 149504 152385 155680 149437 142832
-8963 142832 145773 150335 149172 143477 143507 142463 135695 125468 115241 106922 92878 76688 70039 70844 71649 79014 95920
-8946 95920 107541 101987 82838 63688 51336 38985 29854 30264 40453 50643 62622 80326 104947 123843
-8932 123843 127712 118222 92770 61597 35429 22623 15896 3447 -10674 -15250 -14166 -18802 -23204 -21877 -19123
-8917 -19123 -22090 -27923 -28027 -22157 -22008 -24725 -21713 -15843 -15694 -18411 -15400 -11930 -14181 -19298 -18687 -12533 -12101 -14773
-8899 -14773 -17442 -16078 -14714 -13350 -11986 -7998 -4010 -2884 -1758 3734 9228 14722 20215 35966 51717 52797
-8883E2797J081n598j1323j3469l929J320J319n89Q953J1397J1398J1158J1159J0682k676
-8868H3680j4603q878L32L36O89O93N162N166k113k110J584p953j3086j3082m499m495p360
-8851A9463p358m06m03n176n174J90J94k671k669J443J446j420j416N854N859q24q20L109
-8833I221L112j663j658O04O07m167m163O329O332J558J561o48o45o48o45O246O251J476J479
-8814C0539J2270J2273P499P503P081P085n322n319p469p465j0331j0328J714J715m965m964
-8798C1516j267j268p946p946P90P90l980l981o41o41l503l503M889M890l697l697K862K863
-8780F530l817l815M560M562k117k117K594K595m085m085j587j588j587j588L481L480j290
-8763A26j288N835N837k751k750N359N360j319j320O828O828L966L965J3150J3149P45P45
$$ plain form
-8883 52797 53878 48280 36957 23488 19559 20879 22198 21609 30562 41959 53357 64515 75674 86356 83680
-8868 83680 69077 60199 60531 60867 61556 62249 67411 72577 70464 68354 69938 61985 48899 35817 31318 26823 19463
-8851 19463 12105 11699 11296 6120 946 1136 1330 -1341 -4010 -2567 -1121 -2541 -3957 1897 7756 6932 6112 9221
-8833 9221 12333 10670 9012 9616 10223 6056 1893 8222 14554 16112 17673 17025 16380 15732 15087 21333 27584 29060 30539
-8814 30539 42809 55082 62581 70084 77165 84250 78928 73609 66140 58675 48344 38016 39730 41445 36480 31516
-8798 31516 30249 28981 21035 13089 13879 14669 10689 6708 6067 5426 1923 -1580 3309 8199 4502 805 3667 6530
-8780 6530 2713 -1102 3458 8020 5903 3786 6380 8975 4890 805 -782 -2370 -3957 -5545 -2064 1416 126
-8763 126 -1162 4673 10510 7759 5009 10368 15728 14409 13089 19917 26745 30711 34676 47826 60975 61720 62465
-8746F2465Q230Q229J551J550N367N367j312j312Q554Q554l4l4Q6Q6Q6Q5N095N095N095N095
-8726A27898J4219J4219J5053J5054K8232M1591N3875P8682J14760J51018J76778J93954J92760
-8713A218093J60320R6394K1971m8516j11488j65396j90204j84035j59225j27980r5536o4053
-8701C50345m6876l7934k8389j4319j4316j8494j8490j4260j4256j7122j7118q066q061q066
-8687H4578q061L086L089K24K27M100M104o71o67O842O847J64J68O787O791L924L928J4301
-8669A39761J4305J3466P745J3287K4740K6883L2612N2764P9484J10608J44961J87833K06920
-8656A055369J96898J62552J06733L4221m9268j21778j70801j97512k04195j77476j34305
-8645E00438r2320p1332n9880m1240k9790k5020k5020j5240j5240j5240j5240r277r276r277
$$ plain form
-8746 62465 70695 78924 80475 82025 87392 92759 91447 90135 98689 107243 107209 107175 107261 107347 107433 107518 112613 117708 122803 127898
-8726 127898 142117 156336 171389 186443 214675 256266 310141 388823 503583 654601 831379 1025333 1218093
-8713 1218093 1378413 1474807 1496778 1448262 1336774 1171378 981174 797139 637914 509934 414398 350345
-8701 350345 303469 265535 237146 222827 208511 190017 171527 157267 143011 125889 108771 100705 92644 84578
-8687 84578 76517 79603 82692 82916 83143 87243 91347 90676 90009 96851 103698 103862 104030 110817 117608 121532 125460 139761
-8669 139761 154066 167532 175277 188564 213304 240187 272799 325563 405047 515655 660616 848449 1055369
-8656 1055369 1252267 1414819 1521552 1555773 1506505 1384727 1213926 1016414 812219 634743 500438
-8645 500438 408118 336786 276906 235666 205876 180856 155836 140596 125356 110116 94876 85599 76323 67046
-8631F7046r277o116o116o116o116j055j055l917l917J629J628l141l142J897J897r66r65
-8614B2198J778J778j085j084J185J189j677j674m062m059q833q829l764l761q177q173p462
-8597c4512j733l287j4734j0808j0805j4267j9988j9277p823j744R709K5448M4535M8825M8827
-8582C8366N0972N0975M2861K3783J3141J692p610j3336j2560o835j0414j0413l317l317r639
-8567A44349r638p134j408k244j3693j0511R40k639q364k281L444r69o694m934O514L295k430
-8550H5603j357M369R09j0540p130j405j763p488o712r88J159q382r217l492j942j1483j1424
-8533H717j1422j3570j3571o041J4949K7471L7014M9119O6293O9872N6513M3991L4449J8349
-8519C82133k643p711p711q785j8326j7577q032p320j3041j2627l082M92n229m875Q53L593
$$ plain form
-8631 67046 57769 51653 45537 39421 33305 32250 31195 27278 23361 24990 26618 23477 20335 22232 24129 23163 22198
-8614 22198 23976 25754 24669 23585 24770 25959 24282 22608 18546 14487 5654 -3175 -6939 -10700 -18877 -27050 -34512
-8597 -34512 -36245 -39532 -54266 -65074 -75879 -90146 -110134 -129411 -137234 -138978 -129269 -103821 -59286 -10461 38366
-8582 38366 89338 140313 183174 206957 220098 221790 214180 200844 188284 181449 171035 160622 157305 153988 144349
-8567 144349 134711 127577 126169 123925 110232 99721 100661 98022 89658 87377 90821 89852 83158 78224 84738 88033 85603
-8550 85603 84246 88615 89524 78984 71854 70449 68686 61198 54486 53498 54657 46275 37058 33566 31624 20141 8717
-8533 8717 -2705 -16275 -29846 -35887 -20938 6533 43547 92666 158959 228831 285344 329335 363784 382133
-8519 382133 379490 371779 364068 355283 336957 319380 311348 304028 290987 278360 275278 275770 270541 265666 266519 270112
-8503B70112L597Q005J7551K1960J6239K0730L4091M3033M3037L5757L0037J0950j3854k8050
-8489E13195k8046l1508l7230l4133k4587k0179k0174j8908r366m834m834n132N93M051j674
-8474B77234j405Q136Q137j405j883L843R567L843K307J1848J2564O840L559R284N706l835
-8458C54340p801k076j67r709j3884q158k434q159o708K832P246P245Q557J8099K2273J6548
-8442C78044J5475K5016L3723L3722M0402N7576O8906O8906N9022N9022M3994J1554j9574
-8429H75788l2933m0327n3685o0602n1061m3070m3070l8657k5300j5519k1244j8371o921L216
-8415D28244k508p398j674M052j674r008l284K441l283n132N92O914O914N810J1536J2250
-8399D44792Q02j3093p369j644p368j0112J339Q016K293j048J0403J2906P182O4N792J2467
$$ plain form
-8503 270112 273709 281714 299265 321225 337464 358194 392285 435318 478355 514112 544149 555099 541245 513195
-8489 513195 485149 453641 416411 382278 357691 337512 317338 298430 289064 284230 279396 274264 274857 278908 277234
-8474 277234 275829 283965 292102 290697 288814 292657 302224 306067 308374 320222 332786 339626 343185 352469 358175 354340
-8458 354340 346539 344463 344296 334587 320703 312545 310111 301952 295244 298076 305322 312567 321124 339223 361496 378044
-8442 378044 393519 418535 452258 485980 526382 583958 652864 721770 780792 839814 883808 895362 875788
-8429 875788 842855 802528 748843 688241 637180 594110 551040 512383 487083 471564 450320 431949 425028 428244
-8415 428244 425736 418338 416664 420716 419042 410034 406750 409191 405908 400776 401368 408282 415196 421006 432542 444792
-8399 444792 445594 432501 425132 423488 416120 406008 407347 415363 417656 416608 427011 439917 447099 447163 452955 465422
-8383D65422J2471N907J7361K4990K4994K0636L2090M3536M3540M0912N2366N6893M5448K1770
-8369I08336K691m826k3906l1661k5933j6277j6272j6276m823J0082J0085L999R728J2944
-8355H17891J498m159m159J923r527j7278j1554n233n233j2746j297N381l42p499j774M189
-8339G50081M189j029j028J2329J2329O127O128J6384J6384N919J7368K7863K2139Q781J4506
-8324I18470K4286K4285J2214J2217J7939J7942O489O492J9847J9850J3317J3321K6674K6679
-8310A160022K3812K3816K9537K9541K0346K0350L3704L3707K5594K5598L8593L8598K1658
-8297A524876J5937J6052M607j1975j1971J025J028q259k530J1419J1424K832K837J5951J0231
-8282A583484m263J464J9471J9473J5296K4841M9287N5016N0710O0256Q3866Q3870P2060P2063
$$ plain form
-8383 465422 477893 483800 501161 526151 551145 571781 603871 647407 690947 731859 784225 841118 886566 908336
-8369 908336 911027 906201 882295 850634 824701 808424 792152 775876 771053 781135 791220 795219 804947 817891
-8355 817891 819389 815230 811071 812994 803467 786189 774635 769402 764169 751423 750126 755507 755165 747666 745892 750081
-8339 750081 754270 753241 752213 764542 776871 782998 789126 805510 821894 827813 845181 873044 895183 903964 918470
-8324 918470 942756 967041 979255 991472 1009411 1027353 1033842 1040334 1060181 1080031 1093348 1106669 1133343 1160022
-8310 1160022 1183834 1207650 1237187 1266728 1287074 1307424 1341128 1374835 1400429 1426027 1464620 1503218 1524876
-8297 1524876 1540813 1556865 1561472 1549497 1537526 1538551 1539579 1531320 1528790 1540209 1551633 1554465 1557302 1573253 1583484
-8282 1583484 1579221 1580685 1600156 1619629 1634925 1659766 1709053 1764069 1814779 1875035 1958901 2042771 2114831 2186894
-8268B186894P8738O5384L8307K4953K6141J2788n225N03K6261L9622L8713N5888Q2364R1906
-8254B763237Q2723R2263J11347J05621Q5704P9980Q8208P8668N6126N6126Q0933Q0934O9953
-8241C831823P9495R6073P8898L8587K1412K7136R963j4845j487M9081Q1523R8219J45927
-8228D541805K27504K79027L06317L65477M58978N29588N78006O56247P56428Q04139P96383
-8217A0299899Q05927Q33475P97221P28878P28881Q13438R03128J010049J221868J498564
-8207A9641328J698935J849207K110640K492290K917836L538436M727288O681582R496271
-8198E5153813J3724021K0053726K7937002L4934597L8124541L6061727K9088228J8304598
-8190B73382253N057983q782672k1063997l0179756l5282771l5849516l1942094k5062828
$$ plain form
-8268 2186894 2265632 2331016 2369323 2394276 2420417 2433205 2427980 2428483 2454744 2494366 2533079 2588967 2671331 2763237
-8254 2763237 2845960 2938223 3049570 3155191 3240895 3320875 3409083 3487751 3543877 3600003 3680936 3761870 3831823
-8241 3831823 3911318 4007391 4086289 4124876 4146288 4173424 4183387 4168542 4167055 4216136 4297659 4395878 4541805
-8228 4541805 4769309 5048336 5354653 5720130 6179108 6708696 7286702 7942949 8699377 9503516 10299899
-8217 10299899 11105826 11939301 12736522 13465400 14194281 15007719 15910847 16920896 18142764 19641328
-8207 19641328 21340263 23189470 25300110 27792400 30710236 34248672 38975960 45657542 55153813
-8198 55153813 68877834 88931560 116868562 151803159 189927700 225989427 255077655 273382253
-8190 273382253 278440236 269657564 248593567 218413811 183131040 147281524 115339430 90276602
-8182I0276602j7901835j2530073r165813o923603n267819m197284l592368l105758k642768
-8173B4949281k350804k190269j940290j564778j230833r67014o36886k60005R060J49319
-8163A3966781L00070M61233N05124M38331M05894M17939L70233K71361K71360L89674N17525
-8152A8315525O56472Q98821J199611J411428J558366J812162K179228K585688L191558M349877
-8142C8158736O229750Q960477J3125017J9462360K7542111L5066388L9010281L7516132L0645903
-8133B55717155J9766860O680290o870258j9367457k9475506l5801883l7135766l3433727
-8125A20079708k6508636j9188323j3511241r796031p366812n670132m527077l795982l271205
-8116B6444269k865462k592579k403836k180566j897192j601408j318035j026066p50328n57588
$$ plain form
-8182 90276602 72374767 59844694 50678881 43755278 38487459 34290175 30697807 27592049 24949281
-8173 24949281 22598477 20408208 18467918 16903140 15672307 14705293 14068407 13808402 13817462 13966781
-8163 13966781 14266851 14728084 15233208 15671539 16077433 16495372 16865605 17136966 17408326 17798000 18315525
-8152 18315525 18971997 19870818 21070429 22481857 24040223 25852385 28031613 30617301 33808859 38158736
-8142 38158736 44388486 53348963 66473980 85936340 113478451 148544839 187555120 225071252 255717155
-8133 255717155 275484015 282164305 275294047 255926590 226451084 190649201 153513435 120079708
-8125 120079708 93571072 74382749 60871508 51075477 43708665 38038533 33511456 29715474 26444269
-8116 26444269 23578807 20986228 18582392 16401826 14504634 12903226 11585191 10559125 9808797 9251209
-8106I251209m42203l60143l12679l22218l67063l99502m06423m12143m17011m03650l72644
-8095E035530l40200l15635k87006k66020k71742k95657l05195k86832k69654k54153k21709
-8084A921727j79492j43231j21581r6770p3755o4210p0893p0888o3976o3971o1173n1627k9806
-8071H30354j2627m044N502J4561K0290J1804K262p994k5169n1765o5124o3811o3811o3513
-8057E26915n3972l5963j8788o861K680J5799K1523K0801J5076J2333J2333M700m842r612
-8043E02122j5337k3148k3149k3507k3507k3924k3924j4383j4382q554q550L4L7o23o18l843
-8027B94744l839j1714j7435k0898k0894j9824j9821j0641m912l358l354j38j34m313m308
-8012A49161m312m309n147n143n147n144o995o992o996o992j204j204P384P383O250O250N893
$$ plain form
-8106 9251209 8809006 8448863 8136184 7813966 7446903 7047401 6640978 6228835 5811824 5408174 5035530
-8095 5035530 4695330 4379695 4092689 3826669 3554927 3259270 2954075 2667243 2397589 2143436 1921727
-8084 1921727 1742235 1599004 1477423 1380653 1306898 1242688 1171795 1100907 1036931 972960 911787 860160 830354
-8071 830354 817727 813683 819185 833746 854036 865840 868102 860108 834939 783174 718050 654239 590428 526915
-8057 526915 472943 436980 418192 411331 414011 429810 451333 472134 487210 499543 511876 516576 511734 502122
-8043 502122 486785 463637 440488 416981 393474 369550 345626 331243 316861 308307 299757 299791 299828 299205 298587 294744
-8027 294744 290905 279191 261756 240858 219964 200140 180319 169678 164766 161408 158054 157916 157782 153469 149161
-8012 149161 144849 140540 135393 130250 125103 119959 112964 105972 98976 91984 90780 89576 96960 104343 110593 116843 122736
-7995A22736J1617J1692J1692J0141M417k024p748r657r657j3407j3406j0544j0544j1199
-7981H4109j1200j1200j1200o563o564j196M528O854O854J1387J1386P130k408r448r444j3206
-7965D9819j3201j3205j3201q673q668q6q2j278j275J584J588J636J640J278J282P42m979
-7948e079m983P45R21R24J278J282Q434Q438Q434Q438J1394J1397J0798J0801N251m286p510
-7931F6677p506j1506j1502j1505j1502j2936j2932j1387n657j08j05j08j04J025m696j480
-7915c5332j476j271j267j271j267k822k817l179K549L936L939m77m73%M%LJ79J83J79J82
-7894d0498J79J83J79J82o93o89o94o89M197M200n74n70R02R05j960j957O64O67k199k195
-7874d0460p68p64n539n534o433o430j662j658L272L276L273L276M524M529k155k150m219
$$ plain form
-7995 122736 134353 146045 157737 167878 172295 170271 162523 152866 143209 129802 116396 105852 95308 84109
-7981 84109 72909 61709 50509 43946 37382 36186 40714 47568 54422 65809 77195 84325 81917 72469 63025 49819
-7965 49819 36618 23413 10212 1539 -7129 -7215 -7297 -8575 -9850 -8266 -6678 -5042 -3402 -2124 -842 -100 -5079
-7948 -5079 -10062 -9317 -8396 -7472 -6194 -4912 3522 11960 20394 28832 40226 51623 62421 73222 78473 74187 66677
-7931 66677 59171 47665 36163 24658 13156 220 -12712 -24099 -29756 -29864 -29969 -30077 -30181 -29156 -33852 -35332
-7915 -35332 -36808 -38079 -39346 -40617 -41884 -44706 -47523 -50702 -48153 -44217 -40278 -40755 -41228 -41228 -41224 -41224 -41221 -41042 -40859 -40680 -40498
-7894 -40498 -40319 -40136 -39957 -39775 -40468 -41157 -41851 -42540 -38343 -34143 -34717 -35287 -34385 -33480 -35440 -37397 -36733 -36066 -38265 -40460
-7874 -40460 -41228 -41992 -47531 -53065 -59498 -65928 -67590 -69248 -65976 -62700 -59427 -56151 -51627 -47098 -49253 -51403 -55622
-7857e5622m215j0898j0895m219m215m219m215J565J569J565J570O813O816O814O816J8215
-7841d6755J8214K0719J4993N452n997k1858k1859j5121j5121q441q442k598k598k598k597
-7826i4607j674j673j674j673l105l104l105l105o444o444o444o444m357m357m357m357j263
-7809a58187j264o034o034l649l649k933k933O429J7879K3126L4576M5251M5250M5011L3562
-7794F6401K3626J2177l329j4778j8057j8058j4003j4002p443p443p442p443j897j897j897
-7779a5485j897k240k237k240k236j405j401p130p126j271j267j271j268Q76Q80m849m845
-7762e6412o355o351o355o350j167j163m029m025R65R69m759m756l567l563o429o426j632
-7745a21405j629O001J7454L3372M4825M8280M8284M7327M1605K5739J4293J111j0335k1789
$$ plain form
-7857 -55622 -59837 -70735 -81630 -85849 -90064 -94283 -98498 -96933 -95364 -93799 -92229 -85416 -78600 -71786 -64970 -46755
-7841 -46755 -28541 -7822 7171 12623 6626 -15232 -37091 -52212 -67333 -75774 -84216 -86814 -89412 -92010 -94607
-7826 -94607 -96281 -97954 -99628 -101301 -104406 -107510 -110615 -113720 -120164 -126608 -133052 -139496 -143853 -148210 -152567 -156924 -158187
-7809 -158187 -159451 -165485 -171519 -175168 -178817 -181750 -184683 -178254 -160375 -137249 -102673 -57422 -12172 32839 66401
-7794 66401 90027 102204 98875 84097 66040 47982 33979 19977 12534 5091 -2351 -9794 -11691 -13588 -15485
-7779 -15485 -17382 -19622 -21859 -24099 -26335 -27740 -29141 -36271 -43397 -44668 -45935 -47206 -48474 -47598 -46718 -51567 -56412
-7762 -56412 -62767 -69118 -75473 -81823 -82990 -84153 -88182 -92207 -91242 -90273 -95032 -99788 -103355 -106918 -113347 -119773 -121405
-7745 -121405 -123034 -117033 -99579 -66207 -21382 26898 75182 122509 164114 189853 204146 205257 194922 173133
-7731A73133k1784j5266j5263j2403j2400o679o676l816l813m17m14m17m14M771M774r54r51
-7714H1011M451M450J0175J0174R341R340J6376K2102K9496M0946M7743O6827P5652N6570
-7700D84654J0055l1926n8016n8015m5374l3923j5557m108R728K1177M0081N9164O6319N4870
-7686D99129K8155j3828n7717o9167o2705m3617l2530k1077j1062n333k117k114P365P369
-7672B20751P722P726J5594K1323K2392L3846N0226O9312R7456J31808J76171K10524K13382
-7659A278233J94304J58758R3881K1841n0669r6830j15908j19252j00165o5723m6640n5586
-7647A096244o1310l2687J6929P4056J38938K08769K35484J72511K3667j19691j84572j60481
-7635A407857j10865r0397r0396p1076k9093L1017Q8264J51237K00852J78550O0237j18186
$$ plain form
-7731 173133 151349 136083 120820 108417 96017 89338 82662 78846 75033 74616 74202 73785 73371 78142 82916 81962 81011
-7714 81011 85462 89912 100087 110261 119602 128942 145318 167420 196916 237862 285605 352432 428084 484654
-7700 484654 494709 462783 404767 346752 301378 267455 251898 247790 257518 278695 318776 377940 444259 499129
-7686 499129 527284 513456 455739 386572 323867 280250 247720 226643 215581 210248 208131 206017 213382 220751
-7672 220751 228473 236199 251793 273116 295508 329354 379580 448892 546348 678156 854327 1064851 1278233
-7659 1278233 1472537 1631295 1725176 1747017 1696348 1599518 1483610 1364358 1264193 1198470 1151830 1096244
-7647 1096244 1034934 1002247 1019176 1093232 1232170 1440939 1676423 1848934 1872601 1752910 1568338 1407857
-7635 1407857 1296992 1206595 1116199 1045123 1016030 1047047 1135311 1286548 1487400 1665950 1726187 1608001
-7623A608001k44131k62021k04772j42755j00772p1691m4970l1259k5531j8259o806J182J185
-7610D57401J0723K2176M0062N9149Q9200J31186J70778K05131K18596K07151J66119J01243
-7598A878915L3495l1382q9588j16299j03363n3745J8170R8320J62124J56403N6334q4873
-7586A924511j75906j56824o6659L6388J28699K16480K51305J86424N5590m7457m5549M067
-7574B311069j2154j22834k36374k55457j80208o9529K3976J04124J59701J25353j4428j86171
-7562A647068k81703k70254k01079j36199r3501n1519j2877j428j8747n3096o7408n5958l8068
-7549C65231k6619k2087k2086j5170l719l720l719J289J2739J6198J6198K0454K6179L5840
-7535C97008M7289P1500J05849J39243J81226K38711K57794J86235K2124j41569k21717j92018
$$ plain form
-7623 1608001 1363870 1101849 897077 754322 653550 581859 536889 505630 480099 461840 455034 456216 457401
-7610 457401 468124 490300 530362 589511 678711 809897 980675 1185806 1404402 1611553 1777672 1878915
-7598 1878915 1912410 1881028 1791440 1675141 1571778 1518033 1536203 1634523 1796647 1953050 2009384 1924511
-7586 1924511 1748605 1591781 1525122 1561510 1690209 1906689 2157994 2344418 2400008 2352551 2307002 2311069
-7574 2311069 2298915 2176081 1939707 1684250 1504042 1434513 1458489 1562613 1722314 1847667 1833239 1647068
-7562 1647068 1365365 1095111 894032 757833 664332 612813 599936 598508 579761 526665 459257 403299 365231
-7549 365231 338612 316525 294439 279269 275550 271830 268111 269400 282139 298337 314535 334989 361168 397008
-7535 397008 444297 515797 621646 760889 942115 1180826 1438620 1624855 1646979 1505410 1283693 1091675
-7523A091675j11872l4856K4301P4273R9080R7113R1388J13571J53645J45714L6942j31461
-7511A649513k55498k65398j94791j12737n3580r087J5721L555m0334q2912r6271q5775p2417
-7498C99989n6912m3555l4729k9004k4114j4573j4453j4454j8684j2959r142r143q546k821
-7484A06900r13r14l119K605Q807Q807J5128K8486L6239M1963M5526N1251N6022O1746P1407
-7469E29941P7132N9719J2012m1955p8213q3460o6286m1598k0607p965k240P983K1342L8992
-7455D04797N2351N4139L6965q117n9641q7668q1944n7851m0678k6723r548L809L809Q57Q57
-7440A85414k601q327j7986j7987j3574j3574j1010j1010m331m331j587j588L541L540M372
-7425H8961J0101J6656K2385K9179L8724L9794L4073L1088L1091K5243J5706J629m092j2087
$$ plain form
-7523 1091675 979803 944947 969248 1043521 1142601 1239714 1331102 1444673 1598318 1744032 1780974 1649513
-7511 1649513 1394015 1128617 933826 821089 767509 758422 774143 777698 737364 654452 558181 472406 399989
-7498 399989 343077 299522 264793 235789 211675 197102 182649 168195 149511 136552 127410 118267 109721 106900
-7484 106900 105987 105073 101954 104559 113366 122173 137301 165787 202026 243989 289515 340766 396788 458534 529941
-7469 529941 607073 666792 678804 636849 558636 475176 408890 367292 346685 338720 336480 344463 365805 404797
-7455 404797 457148 511287 548252 540135 480494 392826 310882 253031 212353 185630 176082 179891 183700 184557 185414
-7440 185414 182813 174486 156500 138513 124939 111365 100355 89345 85014 80683 79096 77508 81049 84589 88961
-7425 88961 99062 115718 138103 167282 206006 245800 279873 310961 342052 367295 383001 384630 380538 368451
-7411C68451k5441l4696l4691k9567k3838j7402p857m66m62q039q036p681j3403k0920k0916
-7396A15036j8416j8411j3265j3261o586o582n63n59k05k01Q09O537J1901J1904L015L019
-7380G4172J465m256p473p469p94p90J472P201J5426K1155K4729L0458L5821L5824K8904K3182
-7364B79027K2344J6623M133n404r702j9239k9261l4983l4866l4863k9381k3652j5426r698
-7350G5652o183m55J450J453n974n971n974n971j0209j0204o989o984p182j454K002K005n03
-7333H509n00n03m99l604l604l604l604j874j875j875j875j144j144L626L627M66M66P502
-7315a509P502R523J5247K6339K6339K4670K4669K0853J1312l358j2899k1129k6854l0789
-7301F9916l0789k1606j5881j4766r038l317l314l35l32M435M439L004L008P775P777n74n69
$$ plain form
-7411 368451 343010 308314 273623 244056 220218 202816 194959 194493 194031 185992 177956 170275 156872 135952 115036
-7396 115036 96620 78209 64944 51683 45097 38515 37952 37393 37188 36987 37796 44333 56234 68138 71153 74172
-7380 74172 75637 71381 63908 56439 55645 54855 56327 63528 78954 100109 124838 155296 191117 226941 255845 279027
-7364 279027 301371 317994 322127 316723 307021 287782 258521 223538 188672 153809 124428 100776 85350 75652
-7350 75652 69469 69014 70464 71917 65943 59972 53998 48027 37818 27614 20625 13641 6459 5005 7007 9012 8509
-7333 8509 8009 7506 7007 3403 -201 -3805 -7409 -9283 -11158 -13033 -14908 -16052 -17196 -13570 -9943 -9477 -9011 -1509
-7315 -1509 5993 15516 30763 57102 83441 108111 132780 153633 164945 161587 148688 127559 100705 69916
-7301 69916 39127 17521 1640 -13126 -22164 -25481 -28795 -29130 -29462 -25027 -20588 -17584 -14576 -6801 976 402 -167
-7284a67l436l433n684n680K904K907j271j267L499L504m178m175j315j312m655m652m655
-7267c3066m651n371n371L54L54j971j972j971j972j092j092J770J771o996o996j271j271
-7250g0814o56o56N069N069J133J133J133J133j923j923L801L802l13l13K549K550M80M81
-7232d8265M81M81o139o138L403L402j651j651j651j651L76L77L76L77r51r50r51r50k143
-7213f3818k143L582L581m051m051K270P994L284L283L642L641k535k530L28L32j402j398
-7196d9991J104O831O948O951J3030J3033Q437Q442N218N222n941j1662q445q442j1248j1245
-7180c1758m927Q01m241m238J484J487O48n072k572L157J565m159l444l444k012k013Q50Q50
-7162e7038j864j864R99R99l473l474K251K251n36n37K326K325j968j968L757L757j043j044
$$ plain form
-7284 -167 -3603 -7036 -12720 -18400 -15496 -12589 -13860 -15127 -11628 -8124 -12302 -16477 -17792 -19104 -23759 -28411 -33066
-7267 -33066 -37717 -43088 -48459 -48105 -47751 -49722 -51694 -53665 -55637 -56729 -57821 -56051 -54280 -61276 -68272 -69543 -70814
-7250 -70814 -71470 -72126 -67057 -61988 -60855 -59722 -58589 -57456 -59379 -61302 -57501 -53699 -54012 -54325 -51776 -49226 -48746 -48265
-7232 -48265 -47784 -47303 -53442 -59580 -56177 -52775 -54426 -56077 -57728 -59379 -59003 -58626 -58250 -57873 -58824 -59774 -60725 -61675 -63818
-7213 -63818 -65961 -62379 -58798 -62849 -66900 -64630 -56636 -53352 -50069 -46427 -42786 -45321 -47851 -47523 -47191 -48593 -49991
-7196 -49991 -48887 -42056 -35108 -28157 -15127 -2094 6343 14785 20003 25225 19284 7622 -823 -9265 -20513 -31758
-7180 -31758 -36685 -35884 -40125 -44363 -42879 -41392 -40744 -45816 -48388 -45231 -43666 -47825 -51269 -54713 -56725 -58738 -57888 -57038
-7162 -57038 -58902 -60766 -59767 -58768 -62241 -65715 -63464 -61213 -61749 -62286 -59960 -57635 -59603 -61571 -57814 -54057 -55100 -56144
-7144e6144J819J819j938j938N66O291M380M383J0462J0465J1893J1896J1535J1539J76n546
-7128B1658k688k683j1155j6875j3302l757n867n862k766K963k646k642j42N587J468m252
-7112d2961j036j033j41n863l004K724k944k941q2N647K721K724K721K724L153k568k571L157
-7094c9573J364J368J721J726l421l418j275M454Q72m849j990L738n14o235l019K709K587
-7077d3755K590M853J0581M502n035q259k531N67N70R24R28J342J345k236L493Q64m856m503
-7059c8616J227J30J34K397Q125M603m935k076P469Q897L175L172Q899Q121j416j658P886
-7042A5534Q822p19m81R061Q046K322L038J2579R358j82N542J5083J3951M409J3712L0886
-7026A50961L1103K5377M1598P4038R8488J23296K02607L15195L81567L81566L74172L74172
$$ plain form
-7144 -56144 -54325 -52506 -54444 -56382 -55816 -49525 -45145 -40762 -30300 -19835 -7942 3954 15489 27028 27204 21658
-7128 21658 18970 16287 5132 -11743 -25045 -28802 -34669 -40531 -43297 -40334 -42980 -45622 -45764 -40177 -38709 -42961
-7112 -42961 -43997 -45030 -45171 -51034 -54038 -51314 -54258 -57199 -57281 -51634 -48913 -46189 -43468 -40744 -37591 -40159 -42730 -39573
-7094 -39573 -38209 -36841 -35120 -33394 -36815 -40233 -41508 -37054 -36182 -41031 -43021 -39283 -39797 -46032 -49051 -46342 -43755
-7077 -43755 -41165 -36312 -25731 -21229 -26264 -34523 -37054 -36487 -35917 -34993 -34065 -32723 -31378 -33614 -30121 -29257 -34113 -38616
-7059 -38616 -37389 -37259 -37125 -34728 -26603 -22000 -26935 -29011 -21542 -12645 -9470 -6298 2601 10722 9306 7648 15534
-7042 15534 24356 23637 23156 32217 40263 42585 45623 58202 67560 67378 72920 88003 101954 106363 120075 150961
-7026 150961 182064 207441 249039 323077 421565 544861 747468 1062663 1444230 1825796 2199968 2574140
-7014B574140K92475O1575k05343l56096l74910l55827l60718l26368k36919j41506r7139
-7003D73364q5689o6129m7047m2992m2992l6969k5519k1703k1703j8959p510j1088j1088m231
-6989B9745m230m230m230l500l500l499l500k784k783k784k785j062j062j062j062j063j062
-6972a4453j062j062k822k821k822k821k106k106k105k106q83q84q83q83K456K456K456K456
-6954b9995L24L25L24L24N870N871L007L008M051M055j673j670M230M233J368J372j53j49
-6936D722l015l011K6L0k836k833K43K46K42K46J494J499J494J497M089M092M089M092O295
-6917B2701O299O295O299O355O354L492L493O891O891J167J167L641L641L642L641O504O503
-6900A04976P79P79L597L597L596L597P532P533J807J808N594N595j31j30K732K732K732K732
$$ plain form
-7014 2574140 2866615 2928190 2722847 2366751 1991841 1636014 1275296 948928 712009 570503 473364
-7003 473364 387675 321546 274499 231507 188515 151546 126027 104324 82621 63662 56152 45064 33976 29745
-6989 29745 25515 21285 17055 13555 10055 6556 3056 272 -2511 -5295 -8080 -9142 -10204 -11266 -12328 -13391 -14453
-6972 -14453 -15515 -16577 -19399 -22220 -25042 -27863 -29969 -32075 -34180 -36286 -37169 -38053 -38936 -39819 -37363 -34907 -32451 -29995
-6954 -29995 -29671 -29346 -29022 -28698 -22828 -16957 -13950 -10942 -6891 -2836 -4509 -6179 -1949 2284 3652 5024 4871 4722
-6936 4722 1707 -1304 -1278 -1248 -4084 -6917 -6674 -6428 -6186 -5940 -4446 -2947 -1453 44 4133 8225 12314 16406 22701
-6917 22701 29000 35295 41594 47949 54303 57795 61288 68179 75070 76237 77404 81045 84686 88328 91969 98473 104976
-6900 104976 105755 106534 110131 113728 117324 120921 128453 135986 137793 139601 145195 150790 150659 150529 153261 155993 158725 161457
-6882A61457L65L69L65L69J618J621j245j241L138L142k587k582r77r73r76r73M912M916M913
-6863A75631M916Q132Q136K408K411M525M528M525M529M69M73M70M73M59M58n266n266j808
-6845B10203j808p532p533l76l76N348N348J1431J1431J1431J1431J4204J4204Q479Q479J0268
-6829C04632J0268M544M543Q211Q210K486K486k583k583q307q308n028n024p890p886q248
-6813B89523q245n385n382l746l742l746l742j181j178j181j178j025j021j025j021j085j081
-6796B44559j0626j0622o809o806r672r668o093o091o093o090k102k099P61P64O664O667R40
-6779A77584R43Q572Q576Q572Q576J4059J4062J4058J4063J2545J2549O821O824K348K352
-6764C12504p194p189j1487j1483j4349j4346j0950j0946j0950j0947j2870j2869j2870j2869
$$ plain form
-6882 161457 161822 162191 162556 162925 164543 166164 164919 163678 166816 169958 167371 164789 163812 162839 161863 160890 165802 170718 175631
-6863 175631 180547 188679 196815 199223 201634 206159 210687 215212 219741 220210 220683 221153 221626 222085 222543 217277 212011 210203
-6845 210203 208395 200863 193330 192954 192578 197926 203274 214705 226136 237567 248998 263202 277406 285885 294364 304632
-6829 304632 314900 319444 323987 332198 340408 342894 345380 342797 340214 331907 323599 318571 313547 305657 297771 289523
-6813 289523 281278 275893 270511 266765 263023 259277 255535 254354 253176 251995 250817 249792 248771 247746 246725 245640 244559
-6796 244559 233933 223311 216502 209696 200024 190356 184263 178172 172079 165989 163887 161788 162549 163313 169977 176644 177584
-6779 177584 178527 187099 195675 204247 212823 226882 240944 255002 269065 281610 294159 300980 307804 310152 312504
-6764 312504 305310 298121 286634 275151 260802 246456 235506 224560 213610 202663 189793 176924 164054 151185
-6750A51185q576q576q576q576n147n147n148n147n147n147n147n147n401n400n401n400K05
-6733E4307K05n520n520k269k270k270k270P12P12P12P12K769K773K769K773J1833J1838J2191
$$ plain form
-6750 151185 142609 134033 125457 116881 111734 106587 101439 96292 91145 85998 80851 75704 70303 64903 59502 54102 54307
-6733 54307 54512 48992 43472 41203 38933 36663 34393 35105 35817 36529 37241 40010 42783 45552 48325 60158 71996 84187
$$ [...]
##$OBSERVEDINTEGRALS=	(X Y Z)
(5.920509197461118589, 6.0286858393876778806, 1)
(6.9491268584772187822, 6.9862319041065958913, 0.99750943083805976297)
(6.7564256545246443864, 6.8178590083732864002, 2.1029922202960023014)
(3.8020584040224196798, 3.827712965302451753, 3.1837752550722973055)
(3.3590106374110537679, 3.410849504761187756, 2.1740317886355016164)
(2.465870152024355999, 2.5166290429713633614, 2.0079451704197688322)
(1.1432118960087858106, 1.2456962866172021087, 1.0402114690009636178)
(0.58000121841740515105, 0.66888148637868560797, 2.0015408230004712031)
(0.2530488041312639047, 0.33376659850426415588, 1.9821871714281009691)
(5.0792237882321060738, 5.1498220247061823329, 2.0764881463102038417)
##END=	
##END=	
