##TITLE=	wxl20

##JCAMP-DX=	6.0	$$ MestReNova 14.1.0-24037
##DATA TYPE=	LINK
##BLOCK_ID=	1
##BLOCKS=	2    
##ORIGIN=	Mestrelab Research S.L.
##OWNER=	User
##$MNOVA/LINK_BLOCK_TYPE=	ITEM	$$ NMR Spectrum
##$MNOVA/ITEM/POLYGON=	(XY..XY)
5321,5835
8722,5835
8722,8208
5321,8208
5321,5835
##$MNOVA/ITEM/Z=	0
##$MNOVA/ITEM/ANGLE=	0
##TITLE=	wxl20
##JCAMP-DX=	6.0	$$ MestReNova 14.1.0-24037
##BLOCK_ID=	2
##DATA TYPE=	NMR SPECTRUM
##DATA CLASS=	XYDATA
##NUMDIM=	1
##ORIGIN=	JEOL
##OWNER=	User
##.OBSERVE FREQUENCY=	399.79071365325000897
##.OBSERVE NUCLEUS=	^1H
##.SOLVENT NAME=	CHLOROFORM-D
##.PULSE SEQUENCE=	proton.jxp
##LONGDATE=	2021/03/16 19:50:31.000
##.ACQUISITIONMODE=	SIMULTANEOUS
##$ORIGINAL FORMAT=	JEOL Delta
##$MNOVA/SCALES_VERSION=	8
##$PARAMETER FILE=	(datafile, ASCII, c:/Users/User/Downloads/wxl20_PROTON-1-1.jdf, 0)
$$ 
##$PARAMETER FILE=	(footer, BASE64, c:/Users/User/Downloads/wxl20_PROTON-1-1.jdf, 540672)
AQAAANkdAABoZWFkZXIKICAgIGZpbGVuYW1lICAgICAgICA9PiAid3hsMjBfUFJPVE9OIjsKICAgIHNh
bXBsZV9pZCAgICAgICA9PiAid3hsMjAiOwogICAgY29tbWVudCAgICAgICAgID0+ICIiOwogICAgcHJv
Y2VzcyAgICAgICAgID0+ICJwcm90b25fYXV0b3BoYXNlLmxpc3QiOwogICAgYXV0b19kd2VsbCAgICAg
ID0gIFRSVUU7CiAgICBhdXRvX2ZpbHRlciAgICAgPSAgVFJVRTsKICAgIGF1dG9fZ2FpbiAgICAgICA9
PiBUUlVFOwogICAgZmlsdGVyX2xpbWl0ICAgID0+IDE2OwogICAgZm9yY2VfZHVhbF9tb2RlID0+IEZB
TFNFOwogICAgZGVjaW1hdGlvbl9yYXRlID0gIDA7CiAgICBmb3JjZV90dW5lICAgICAgPT4gRkFMU0U7
CiAgICBzYXZlX2Fib3J0ZWQgICAgPSAgVFJVRTsKICAgIHZlY3RvciAgICAgICAgICA9ICBUUlVFOwpl
bmQgaGVhZGVyOwoKaW5zdHJ1bWVudAogICAgcmVjdnJfZ2FpbiA9PiA0NjsKZW5kIGluc3RydW1lbnQ7
CgphY3F1aXNpdGlvbgogICAgeF9kb21haW4gICAgID0+ICJQcm90b24iOwogICAgeF9vZmZzZXQgICAg
ID0+IDVbcHBtXTsKICAgIHhfc3dlZXAgICAgICA9PiAxNVtwcG1dOwogICAgeF9wb2ludHMgICAgID0+
IDMyNzY4OwogICAgc2NhbnMgICAgICAgID0+IDg7CiAgICB4X3ByZXNjYW5zICAgPT4gMDsKICAgIG1v
ZF9yZXR1cm4gICA9PiAxOwogICAgeF9hY3FfdGltZSAgID0/IHhfcG9pbnRzIC8geF9zd2VlcDsKICAg
IHhfcmVzb2x1dGlvbiA9PyAxIC8geF9hY3FfdGltZTsKZW5kIGFjcXVpc2l0aW9uOwoKcHVsc2UKICAg
IGNvbGxlY3QgQ09NUExFWCxPQlM7CgogICAgbWFjcm8gb2JzX3ByZXNhdF90aW1lKCBkYW50ZV9wcmVz
YXQsIGRhbnRlX2xvb3AsIGRhbnRlX3B1bHNlLCBkYW50ZV9pbnRlcnZhbCwgcGhhc2VfZGFudGUsIHBo
c19zaGZ0LCBkYW50ZV9hdHRlbnVhdG9yLCBwcmVzYXRfdGltZSApIGlzCiAgICAgICAgd2hlbiBkYW50
ZV9wcmVzYXQgZG8KICAgICAgICAgICAgbG9vcCAxMDAgKiBkYW50ZV9sb29wIHRpbWVzCiAgICAgICAg
ICAgICAgICBkYW50ZV9wdWxzZSwgKE9CUy5HQVRFLCBPQlMuUEhTLnBoYXNlX2RhbnRlLmxzdGVwKHBo
c19zaGZ0KSwgT0JTLkFUTi5kYW50ZV9hdHRlbnVhdG9yKTsKICAgICAgICAgICAgICAgIGRhbnRlX2lu
dGVydmFsOwogICAgICAgICAgICBlbmQgbG9vcDsKICAgICAgICBlbmQgd2hlbjsKICAgICAgICB3aGVu
IG5vdCBkYW50ZV9wcmVzYXQgZG8KICAgICAgICAgICAgcHJlc2F0X3RpbWU7CiAgICAgICAgZW5kIHdo
ZW47CiAgICBlbmQgb2JzX3ByZXNhdF90aW1lOwoKICAgIG1hY3JvIGFjcSggZGVhZF90aW1lLCBkZWxh
eSwgcGhhc2UgKSBpcwogICAgICAgIGRlYWRfdGltZSwgT0JTLlBIUy4wOwogICAgICAgIGRlbGF5LCAo
T0JTLlBIUy4wLCBSQ1YuR0FURSk7CiAgICAgICAgYWNxdWlyZSAoT0JTLlBIUy4wLCBSQ1YuUEhTLnBo
YXNlKTsKICAgIGVuZCBhY3E7CgogICAgZXhwZXJpbWVudCAgICAgICAgICAgID0gICJwcm90b24uanhw
$$ [...]
AAAAAAAAAAAAAAAAAAAAAAAAAAAAAAAAAAAAAAAAAAAAAAAAAAAAAAAAAAAAAAAAAAAAAAAAAAAAAAAA
AAAAAAAAAAAAAAAAAAAAAAAAAAAAAAAAAAAAAAAAAAAAAAAAAAAAAAAAAAAAAAAAAAAAAAAAAAAAAAAA
AAAAAAAAAAAAAAAAAAAAAAAAAAAAAAAAAAAAAAAAAAAAAAAAAAAAAAAAAAAAAAAAAAAAAAAAAAAAAAAA
AAAAAAAAAAAAAAAAAAAAAAAAAAAAAAAAAAAAAAAAAAAAAAAAAAAAAAAAAAAAAAAAAAAAAAAAAAAAAAAA
AAAAAAAAAAAAAAAAAAAAAAAAAAAAAAAAAAAAAAAAAAAAAAAAAAAAAAAAAAAAAAAAAAAAAAAAAAAAAAAA
AAAAAAAAAAAAAAAAAAAAAAAAAAAAAAAAAAAAAAAAAAAAAAAAAAAAAAAAAAAAAAAAAAAAAAAAAAAAAAAA
AAAAAAAAAAAAAAAAAAAAAAAAAAAAAAAAAAAAAAAAAAAAAAAAAAAAAAAAAAAAAAAAAAAAAAAAAAAAAAAA
AAAAAAAAAAAAAAAAAAAAAAAAAAAAAAAAAAAAAAAAAAAAAAAAAAAAAAAAAAAAAAAAAAAAAAAAAAAAAAAA
AAAAAAAAAAAAAAAAAAAAAAAAAAAAAAAAAAAAAAAAAAAAAAAAAAAAAAAAAAAAAAAAAAAAAAAAAAAAAAAA
AAAAAAAAAAAAAAAAAAAAAAAAAAAAAAAAAAAAAAAAAAAAAAAAAAAAAAAAAAAAAAAAAAAAAAAAAAAAAAAA
AAAAAAAAAAAAAAAAAAAAAAAAAAAAAAAAAAAAAAAAAAAAAAAAAAAAAAAAAAAAAAAAAAAAAAAAAAAAAAAA
AAAAAAAAAAAAAAAAAAAAAAAAAAAAAAAAAAAAAAAAAAAAAAAAAAAAAAAAAAAAAAAAAAAAAAAAAAAAAAAA
AAAAAAAAAAAAAAAAAAAAAAAAAAAAAAAAAAAAAAAAAAAAAAAAAAAAAAAAAAAAAAAAAAAAAAAAAAAAAAAA
AAAAAAAAAAAAAAAAAAAAAAAAAAAAAAAAAAAAAAAAAAAAAAAAAAAAAAAAAAAAAAAAAAAAAAAAAAAAAAAA
AAAAAAAAAAAAAAAAAAAAAAAAAAAAAAAAAAAAAAAAAAAAAAAAAAAAAAAAAAAAAAAAAAAAAAAAAAAAAAAA
AAAAAAAAAAAAAAAAAAAAAAAAAAAAAAAAAAAAAAAAAAAAAAAAAAAAAAAAAAAAAAAAAAAAAAAAAAAAAAAA
AAAAAAAAAAAAAAAAAAAAAAAAAAAAAAAAAAAAAAAAAAAAAAAAAAAAAAAAAAAAAAAAAAAAAAAAAAAAAAAA
AAAAAAAAAAAAAAAAAAAAAAAAAAAAAAAAAAAAAAAAAAAAAAAAAAAAAAAAAAAAAAAAAAAAAAAAAAAAAAAA
AAAAAAAAAAAAAAAAAAAAAAAAAAAAAAAAAAAAAAAAAAAAAAAAAAAAAAAAAAAAAAAAAAAAAAAAAAAAAAAA
AAAAAAAAAAAAAAAAAAAAAAAAAAAAAAAAAAAAAAAAAAAAAAAAAAAAAAAAAAAAAAAAAAAAAAAAAAAAAAAA
AAAAAAAAAAAAAAAAAAAAAAAAAAAAAAAAAAAAAAAAAAAAAAAAAAAAAAAAAAAAAAAAAAAAAAAAAAAAAAAA
AAAAAAAAAAAAAAAAAAAAAAAAAAAAAAAAAAAAAAAAAAAAAAAAAAAAAAAAAAAAAAAAAAAAAAAAAAAAAAAA
AAAAAAAAAAAAAAAAAAAAAAAAAAAAAAAAAAAAAAAAAAAAAAAAAAAAAAAAAAAAAAAAAAAAAAAAAAAAAAAA
AAAAAAAAAAAAAAAAAAAAAAAAAAAAAAAAAAAAAAAAAAAAAAAAAAAAAAAAAAAAAAAAAAAAAAAAAAAAAAAA
AAAAAAAAAAAAAAAAAAAAAAAAAAAAAAAAAAAAAAAAAAAAAAAAAAAAAAAAAAAAAAAAAAAAAAAAAAAAAAAA
AAAAAAAAAAAAAAAAAAAAAAAAAAAAAAAAAAAAAAAAAAAAAAAAAAAAAAAAAAAAAAAAAAAAAAAAAAAAAAAA
AAAAAAAAAAAAAAAAAAAAAAAAAAAAAAAAAAAAAAAAAAAAAAAAAAAAAAAAAAAAAAAAAAAAAAAAAAAAAAAA
AAAAAAAAAAAAAAAAAAAAAAAAAAAAAAAAAAAAAAAAAAAAAAAAAAAAAAAAAAAAAAAAAAAAAAAAAAAAAAAA
AAAAAAAAAAAAAAAAAAAAAAAAAAAAAAAAAAAAAAAAAAAAAAAAAAAAAAAAAAAAAAAAAAAAAAAAAAAAAAAA
AAAAAAAAAAAAAAAAAAAAAAAAAAAAAAAAAAAAAAAAAAAAAAAAAAAAAAAAAAAAAAAAAAAAAAAAAAAAAAAA
AAAAAAAAAAAAAAAAAAAAAAAAAAAAAAAAAAAAAAAAAAAAAAAAAAAAAAAAAAAAAAAAAAAAAAAAAAAAAAAA
AAAAAAAAAAAAAAAAAAAAAAAAAAAAAAAAAAAAAAAAAAAAAAAAAAAAAAAAAAAAAAAAAAAAAAAAAAAAAAAA
AAAAAA==
##XUNITS=	HZ
##YUNITS=	ARBITRARY UNITS
##FIRSTX=	4996.5554867314731382
##LASTX=	-998.64835019898293922
##DELTAX=	-0.11434900221118954322
##XFACTOR=	1
##YFACTOR=	4.3653586707959145696e-08
##FIRSTY=	-0.00020928145386278629303
##MINY=	-0.0017246602801606059074
##MAXY=	0.35030323266983032227
##NPOINTS=	52430
##XYDATA=	(X++(Y..Y))
$$ [...]
$$ plain form
2870 -4725 -4738 -4750 -4762 -4763 -4764 -4764 -4765 -4812 -4859 -4798 -4737 -4729 -4721 -4667 -4612 -4589 -4566 -4542 -4519 -4569 -4620 -4670 -4721 -4736 -4751 -4766 -4781 -4857 -4934 -4871 -4809 -4722 -4635 -4778 -4921 -4926 -4930
2866 -4930 -4934 -4938 -4919 -4900 -4881 -4862 -4888 -4914 -4889 -4863 -4954 -4952 -4839 -4880 -4888 -4896 -4867 -4839 -4910 -4981 -4945 -4909 -4906 -4903 -4762 -4620 -4631 -4641 -4652 -4662 -4644 -4625 -4606 -4587 -4626 -4665
2862 -4665 -4704 -4743 -4717 -4692 -4666 -4641 -4601 -4561 -4598 -4727 -4789 -4696 -4645 -4685 -4655 -4624 -4676 -4728 -4814 -4899 -4831 -4762 -4785 -4808 -4831 -4854 -4844 -4835 -4825 -4816 -4771 -4727 -4683 -4639 -4667
2858 -4667 -4696 -4724 -4753 -4716 -4679 -4651 -4624 -4527 -4585 -4607 -4538 -4616 -4695 -4681 -4667 -4592 -4610 -4672 -4580 -4496 -4565 -4683 -4708 -4673 -4638 -4597 -4556 -4584 -4612 -4548 -4484 -4483 -4481 -4479 -4478 -4497
2854 -4497 -4517 -4537 -4556 -4559 -4561 -4564 -4566 -4563 -4560 -4557 -4553 -4574 -4594 -4522 -4450 -4480 -4509 -4539 -4569 -4544 -4519 -4494 -4468 -4511 -4553 -4595 -4637 -4636 -4636 -4605 -4481 -4290 -4253 -4391 -4437 -4395 -4352 -4304
2849 -4304 -4256 -4193 -4129 -4066 -4002 -4037 -4072 -3953 -3834 -3919 -4004 -4089 -4174 -4167 -4160 -4246 -4331 -4336 -4340 -4253 -4165 -4160 -4156 -4151 -4146 -4086 -4025 -3965 -3904 -3944 -3983 -4023 -4063 -4006 -3949 -3893 -3836
2845 -3836 -3840 -3843 -3846 -3850 -3818 -3787 -3848 -3909 -3948 -3988 -3873 -3758 -3782 -3806 -3737 -3669 -3725 -3781 -3745 -3709 -3727 -3745 -3609 -3473 -3474 -3475 -3384 -3293 -3269 -3245 -3222 -3198 -3067 -2936
2841 -2936 -2909 -2881 -2681 -2665 -2546 -2426 -2399 -2371 -2251 -2131 -2044 -1956 -1869 -1782 -1696 -1610 -1524 -1437 -1201 -965 -729 -493 -292 -90 122 335 727
$$ packed form
2870d725j3j2j2jj%jm7m7O1O1QQN4N5K3K3K4K3n0n1n0n1j5j5j5j5p6p7O3O2Q7Q7j43j43nm
2866d930mmJ9J9J9J9k6k6K5K6r1KJ13m1qqK9K8p1p1L6L6LLJ41J42j1j0j1j0J8J9J9J9l9l9
2862d665l9l9K6K5K6K5M0M0l7j29o2R3N1m0L0L1n2n2q6q5O8O9k3k3k3k3J0RJ0RM5M4M4M4k8
2858d667k9k8k9L7L7K8K7R7n8k2O9p8p9J4J4P5j8o2R2Q4o9j18k5L5L5M1M1k8k8O4O4JKKJj9
2854d497k0k0j9lklkLLLMk1k0P2P2l0k9l0l0K5K5K5K6m3m2m2m2J%L1J24J91L7j38m6M2M3M8
2849d304M8O3O4O3O4l5l5J19J19q5q5q5q5PPq6q5nmQ7Q8NMNNO0O1O0O1m0l9m0m0N7N7N6N7
2845c836mllmL2L1o1o1l9m0J15J15k4k4O9O8n6n6L6L6j8j8J36J36jjR1R1K4K4K3K4J31J31
2841b936K7K8K00J6J19J20K7K8J20J20Q7Q8Q7Q7Q6Q6Q6Q7K36K36K36K36K01K02K12K13L92
$$ plain form
2838 727 1303 1868 2433 2982 3531 4184 4653 5025 5398 5759 6120 6464 6809 7265 7721 8214 9014 9868 10722 11931 13325 14896
2835 14896 16897 19214 21531 24190 27279 30911 35096 40157 46388 54138 63918 76620 93445 116191 145889 183063
2834 183063 222759 252427 269728 276809 270908 253983 227276 196361 164525 128331 95521 72978 58495 49023
2832 49023 42443 37708 34266 31627 29542 27780 26202 24834 23651 22653 21654 20821 19988 19204 18606 18225 17844 17524 17389 17428
2830 17428 17466 17608 17750 17568 17386 17112 16531 15745 15144 14574 14004 13599 13194 13147 13284 13509 13735 14272 15117 16205 17477 18973
2827 18973 20776 22710 24951 27562 30480 33963 38245 43774 50594 59002 69933 84687 104669 130811 164029 200830
2825 200830 229571 246550 254115 249660 234808 211094 182643 153369 119972 88514 66592 52592 43329 36969
2824 36969 32518 29243 26644 24492 22770 21218 19850 18684 17702 16721 15739 14839 13938 13087 12421 11847 11273 10803 10332 9997
$$ packed form
2838G27N76N65N65N49N49O53M69L72L73L61L61L44L45M56M56M93Q00Q54Q54J209J394J571
2835A4896K001K317K317K659L089L632M185N061O231P750R780J2702J6825K2746K9698L7174
2834A83063L9696K9668J7301P081n901j6925k6707l0915l1836l6194l2810k2543j4483r472
2832D9023o580m735l442k639k085j762j578j368j183r98r99q33q33p84n98l81l81l20j35L9
2830A7428L8J42J42j82j82k74n81p86o01n70n70m05m05m7J37K25K26N37Q45J088J272J496
2827A8973J803J934K241K611K918L483M282N529O820Q408J0931J4754J9982K6142L3218L6801
2825B00830K8741J6979P565m455j4852k3714k8451k9274l3397l1458k1922j4000r263o360
2824C6969m451l275k599k152j722j552j368j166r82r81r82r00r01q51o66n74n74m70m71l35
$$ plain form
2822 9997 9661 9275 8705 8046 7386 6500 5614 4747 3880 3166 2453 1945 1437 917 582 288 -5 -241 -477 -679 -881 -1106 -1147
2819 -1147 -1178 -1395 -1646 -1712 -1850 -1988 -2161 -2333 -2414 -2494 -2574 -2655 -2717 -2778 -2944 -2925 -3010 -3095 -3169 -3242 -3288 -3334 -3380 -3426 -3511 -3595 -3680 -3764 -3768 -3773 -3777 -3781 -3812
2815 -3812 -3842 -3872 -3902 -3911 -3920 -3975 -4029 -4145 -4260 -4222 -4183 -4191 -4198 -4205 -4213 -4233 -4253 -4319 -4385 -4450 -4516 -4489 -4462 -4452 -4441 -4431 -4421 -4447 -4474 -4500 -4527 -4485 -4442 -4399 -4357 -4330
2811 -4330 -4302 -4275 -4248 -4316 -4384 -4313 -4397 -4360 -4231 -4198 -4257 -4356 -4362 -4426 -4490 -4470 -4450 -4430 -4410 -4390 -4370 -4350 -4330 -4348 -4365 -4392 -4419 -4318 -4370 -4428 -4332 -4290 -4341 -4422
2807 -4422 -4504 -4495 -4486 -4477 -4468 -4525 -4583 -4548 -4514 -4456 -4398 -4337 -4429 -4495 -4408 -4508 -4609 -4612 -4615 -4525 -4436 -4524 -4611 -4632 -4498 -4462 -4425 -4487 -4456 -4362 -4422 -4390 -4357 -4406 -4455 -4495
2803 -4495 -4535 -4581 -4473 -4360 -4401 -4466 -4439 -4484 -4528 -4524 -4674 -4830 -4831 -4779 -4818 -4848 -4785 -4720 -4655 -4693 -4730 -4729 -4729 -4682 -4636 -4538 -4440 -4480 -4520 -4590 -4660 -4730 -4800 -4791 -4781
2799 -4781 -4695 -4609 -4604 -4599 -4595 -4590 -4622 -4654 -4685 -4717 -4724 -4731 -4680 -4629 -4675 -4535 -4442 -4533 -4509 -4484 -4516 -4549 -4520 -4490 -4460 -4430 -4460 -4490 -4597 -4704 -4623 -4542 -4462 -4381 -4393 -4404
2795 -4404 -4416 -4428 -4407 -4387 -4413 -4439 -4529 -4619 -4602 -4584 -4498 -4412 -4433 -4455 -4455 -4456 -4349 -4241 -4095 -3949 -3819 -3598 -3396 -3378 -3422 -3374 -3265 -3340 -3352 -3364 -3718
$$ packed form
2822I997l36l86n70o59o60q86q86q67q67p14p13n08n08n20l35k94k93k36k36k02k02k25m1
2819a147l1k17k51o6j38j38j73j72q1q0q0q1o2o1j66J9q5q5p4p3m6m6m6m6q5q4q5q4mnmml1
2815c812l0l0l0rrn5n4j16j15L8L9qppqk0k0o6o6o5o6K7K7J0J1J0J0k6k7k6k7M2M3M3M2K7
2811d330K8K7K7o8o8P1q4L7J29L3n9r9oo4o4K0K0K0K0K0K0K0K0j8j7k7k7J01n2n8R6M2n1q1
2807d422q2RRRRn7n8L5L4N8N8O1r2o6Q7j00j01llR0Q9q8q7k1J34L6L7o2L1R4o0L2L3m9m9m0
2803d495m0m6J08J13m1o5K7m5m4Mj50j56jN2l9l0O3O5O5l8l7J%M7M6R8R8m0m0p0p0p0p0RJ0
2799d781Q6Q6NNMNl2l2l1l2ppN1N1m6J40R3r1K4K5l2l3K9L0L0L0l0l0j07j07Q1Q1Q0Q1j2j1
2795d404j2j2K1K0k6k6r0r0J7J8Q6Q6k1k2%jJ07J08J46J46J30K21K02J8m4M8J09p5j2j2l54
$$ plain form
2791 -3718 -4072 -4196 -4319 -4340 -4360 -4335 -4309 -4357 -4404 -4406 -4407 -4329 -4250 -4371 -4493 -4426 -4359 -4368 -4378 -4301 -4223 -4347 -4379 -4246 -4297 -4404 -4419 -4417 -4508 -4645 -4690 -4579
2788 -4579 -4560 -4653 -4746 -4619 -4493 -4475 -4456 -4493 -4529 -4565 -4601 -4562 -4522 -4560 -4597 -4646 -4695 -4667 -4639 -4653 -4666 -4673 -4680 -4717 -4661 -4553 -4629 -4647 -4666 -4588 -4510 -4576 -4642 -4601
2784 -4601 -4560 -4560 -4560 -4561 -4561 -4555 -4549 -4542 -4536 -4577 -4619 -4660 -4702 -4638 -4573 -4586 -4598 -4680 -4761 -4704 -4647 -4668 -4689 -4552 -4415 -4322 -4415 -4455 -4403 -4377 -4351 -4427 -4502 -4536 -4569 -4514 -4460
2780 -4460 -4538 -4432 -4430 -4428 -4366 -4303 -4287 -4270 -4305 -4340 -4328 -4316 -4342 -4368 -4348 -4328 -4282 -4237 -4269 -4300 -4358 -4416 -4409 -4402 -4255 -4293 -4411 -4437 -4455 -4380 -4300 -4312 -4302 -4291 -4391
2776 -4391 -4305 -4373 -4441 -4498 -4554 -4538 -4523 -4507 -4491 -4529 -4567 -4559 -4551 -4589 -4626 -4601 -4668 -4808 -4763 -4638 -4605 -4615 -4625 -4564 -4503 -4535 -4567 -4553 -4539 -4597 -4655 -4605 -4555 -4638
2772 -4638 -4721 -4650 -4580 -4582 -4584 -4540 -4496 -4593 -4690 -4634 -4577 -4535 -4493 -4531 -4570 -4673 -4591 -4533 -4475 -4532 -4773 -4819 -4864 -4870 -4875 -4973 -5071 -4985 -4898 -4903 -4909 -4840 -4772 -4857 -4942 -4915
2768 -4915 -4887 -4906 -4925 -4865 -4806 -4723 -4825 -4961 -4912 -4932 -4952 -4936 -4919 -4949 -4978 -4997 -5015 -5033 -5051 -5011 -4971 -5024 -5076 -5053 -5031 -5008 -4986 -4954 -4923 -4891 -4860 -4870 -4879 -4889
2764 -4889 -4899 -4853 -4807 -4807 -4807 -4882 -4956 -4938 -4920 -5005 -5090 -5083 -5076 -5067 -5058 -5049 -5040 -4958 -4876 -4886 -4897 -4899 -4902 -4904 -4907 -4857 -4808 -4746 -4870 -4912 -4955 -4916 -4878 -4829 -4781 -4732 -4683 -4765 -4847 -4837
$$ packed form
2791c718l54j24j23k1k0K5K6m8m7kjP8P9j21j22O7O7rj0P7P8j24l2J33n1j07j5Kr1j37m5J11
2788d579J9r3r3J27J26J8J9l7l6l6l6L9M0l8l7m9m9K8K8j4j3ppl7N6J08p6j8j9P8P8o6o6M1
2784d601M1%%j%OOPOm1m2m1m2O4O5j3j2q2q1N7N7k1k1J37J37R3r3m0N2K6K6p6p5l4l3N5N4
2780d460p8J06KKO2O3J6J7l5l5J2J2k6k6K0K0M6M5l2l1n8n8PPJ47l8j18k6j8P5Q0j2J0J1j00
2776d391Q6o8o8n7n6J6J5J6J6l8l8QQl8l7K5o7j40M5J25L3j0j0O1O1l2l2J4J4n8n8N0N0q3
2772d638q3P1P0kkM4M4r7r7N6N7M2M2l8l9j03Q2N8N8n7k41m6m5onr8r8Q6Q7noO9O8q5q5K7
2768d915K8j9j9O0N9Q3j02j36M9k0k0J6J7l0k9j9j8j8j8M0M0n3n2K3K2K3K2L2L1L2L1j0rj0
2764d889j0M6M6%%p5p4J8J8q5q5PPRRRRQ2Q2j0j1klklN0M9O2j24m2m3L9L8M9M8M9M9q2q2J0
$$ plain form
2759 -4837 -4826 -4831 -4835 -4839 -4844 -4785 -4725 -4820 -4915 -4855 -4796 -4828 -4861 -4825 -4790 -4800 -4811 -4795 -4779 -4762 -4746 -4716 -4685 -4655 -4624 -4591 -4557 -4616 -4675 -4768 -4862 -4801 -4741 -4763 -4785 -4807
2755 -4807 -4829 -4676 -4524 -4586 -4648 -4703 -4757 -4719 -4681 -4642 -4603 -4564 -4525 -4457 -4389 -4367 -4345 -4274 -4203 -4190 -4330 -4402 -4319 -4333 -4346 -4260 -4173 -4087 -4001 -3828 -3655 -3482
2751 -3482 -3309 -3313 -3316 -3234 -3305 -3387 -3469 -3652 -3836 -3920 -4003 -4087 -4171 -4179 -4187 -4194 -4356 -4403 -4357 -4372 -4388 -4452 -4516 -4487 -4459 -4497 -4535 -4527 -4519 -4512 -4506 -4499 -4493 -4553 -4612 -4607 -4694 -4792
2747 -4792 -4674 -4546 -4509 -4476 -4536 -4549 -4563 -4546 -4530 -4508 -4486 -4579 -4580 -4546 -4666 -4628 -4591 -4563 -4535 -4582 -4629 -4583 -4538 -4540 -4542 -4544 -4546 -4491 -4437 -4382 -4327 -4101 -3874 -3703
2743 -3703 -3532 -3481 -3584 -3693 -3802 -3870 -3939 -4007 -4076 -4216 -4356 -4495 -4481 -4452 -4515 -4454 -4486 -4690 -4739 -4669 -4692 -4683 -4582 -4570 -4649 -4777 -4751 -4673 -4688 -4738
2740 -4738 -4789 -4845 -4901 -4852 -4802 -4753 -4703 -4711 -4718 -4726 -4733 -4787 -4841 -4802 -4763 -4823 -4883 -4850 -4817 -4831 -4844 -4920 -4902 -4779 -4809 -4839 -4869 -4869 -4868 -4868 -4867 -4814 -4761 -4708 -4654 -4692 -4729 -4766
2735 -4766 -4803 -4712 -4621 -4623 -4624 -4606 -4588 -4484 -4533 -4547 -4561 -4584 -4608 -4660 -4712 -4672 -4632 -4643 -4654 -4666 -4677 -4644 -4611 -4578 -4545 -4569 -4593 -4617 -4641 -4665 -4690 -4714 -4738 -4752 -4766
2731 -4766 -4719 -4764 -4799 -4681 -4568 -4610 -4623 -4636 -4659 -4682 -4699 -4716 -4733 -4750 -4781 -4812 -4750 -4688 -4701 -4715 -4728 -4741 -4755 -4769 -4783 -4796 -4720 -4643 -4659 -4674 -4676 -4677 -4678 -4680 -4756
$$ packed form
2759d837J1nmmnN9O0r5r5O0N9l2l3L6L5j0j1J6J6J7J6L0L1L0L1L3L4n9n9r3r4O1O0k2k2k2
2755d807k2J53J52o2o2n5n4L8L8L9L9L9L9O8O8K2K2P1P1J3j40p2Q3j4j3Q6Q7Q6Q6J73J73J73
2751c482J73mlQ2p1q2q2j83j84q4q3q4q4qqpj62m7M6j5j6o4o4K9K8l8l8QQPOPOo0n9Nq7r8
2747d792J18J28L7L3o0j3j4J7J6K2K2r3jL4j20L8L7K8K8m7m7M6M5kkkkN5N4N5N5K26K27J71
2743c703J71N1j03j09j09o8o9o8o9j40j40j39J4K9o3O1l2k04m9P0k3RJ01J2p9j28K6P8j5n0
2740d738n1n6n6M9N0M9N0qpqpn4n4L9L9o0o0L3L3j4j3p6J8J23l0l0l0%J%JN3N3N3N4l8l7l7
2735d766l7R1R1kjJ8J8J04m9j4j4k3k4n2n2M0M0j1j1j2j1L3L3L3L3k4k4k4k4k4k5k4k4j4j4
2731d766M7m5l5J18J13m2j3j3k3k3j7j7j7j7l1l1O2O2j3j4j3j3j4j4j4j3P6P7j6j5kjjkp6
$$ plain form
2727 -4756 -4832 -4816 -4800 -4859 -4918 -4981 -4890 -4801 -4866 -4887 -4815 -4821 -4827 -4827 -4828 -4882 -4936 -4990 -5045 -5072 -5099 -5126 -5154 -5087 -5020 -5045 -4917 -4864 -4904 -4882 -4860 -4825 -4790 -4847 -4904 -4928
2723 -4928 -4952 -4884 -4816 -4866 -4915 -4964 -5014 -4922 -4829 -4829 -4829 -4785 -4741 -4789 -4837 -4834 -4830 -4918 -5007 -5097 -5188 -5124 -5061 -5011 -4961 -4911 -4861 -4885 -4910 -4935 -4960 -4943 -4925 -4908 -4890 -4896 -4902
2719 -4902 -4907 -4913 -4886 -4859 -4831 -4804 -4831 -4857 -4884 -4910 -4914 -4917 -4915 -4913 -4928 -4851 -4733 -4769 -4828 -4795 -4731 -4667 -4672 -4677 -4682 -4687 -4728 -4769 -4801 -4832 -4866 -4745 -4625 -4659 -4726 -4793 -4716 -4640
2715 -4640 -4643 -4647 -4651 -4655 -4696 -4737 -4686 -4634 -4664 -4693 -4630 -4567 -4612 -4658 -4703 -4748 -4764 -4781 -4797 -4813 -4793 -4773 -4753 -4732 -4766 -4800 -4833 -4867 -4813 -4759 -4714 -4670 -4645 -4773 -4902
2711 -4902 -4876 -4835 -4793 -4742 -4691 -4727 -4763 -4800 -4836 -4786 -4736 -4732 -4728 -4679 -4629 -4688 -4747 -4750 -4754 -4804 -4854 -4827 -4800 -4850 -4899 -4810 -4721 -4771 -4820 -4873 -4927 -4903 -4879 -4875 -4870 -4789 -4708
2706 -4708 -4744 -4781 -4772 -4763 -4760 -4758 -4755 -4753 -4776 -4798 -4821 -4843 -4811 -4779 -4823 -4868 -4953 -5038 -5015 -4993 -4935 -4878 -4821 -4764 -4877 -4990 -5026 -5062 -5032 -5002 -5018 -5034 -5030 -5027 -5024 -5021 -5002 -4984
2702 -4984 -4957 -4929 -5095 -5108 -4957 -4960 -5002 -5136 -5175 -5061 -5118 -5175 -5115 -5054 -4973 -4893 -4889 -4885 -4873 -4860 -4925 -4989 -5037 -5086 -5226 -5213 -5063 -5005 -4994 -4982 -4984 -4986 -4987 -4989 -4980
2698 -4980 -4972 -5040 -5108 -5047 -4987 -4972 -4958 -4893 -4828 -4841 -4853 -4947 -5041 -4996 -4952 -4939 -4926 -4913 -4900 -4989 -5078 -4968 -4857 -4873 -4889 -4905 -4921 -4943 -4965 -4849 -4733 -4779 -4825
$$ packed form
2727d756p6J6J6n9n9o3R1Q9o5k1P2oo%jn4n4n4n5k7k7k7k8O7O7k5J28N3m0K2K2L5L5n7n7k4
2723d928k4O8O8n0m9m9n0R2R3%%M4M4m8m8LMq8q9r0r1O4O3N0N0N0N0k4k5k5k5J7J8J7J8oo
2719d902noK7K7K8K7k7k6k7k6mlKKj5P7J18l6n9L3O4O4nnnnm1m1l2l1l4J21J20l4o7o7P7P6
2715d640lmmmm1m1N1N2l0k9O3O3m5m6m5m5j6j7j6j6K0K0K0K1l4l4l3l4N4N4M5M4K5j28j29
2711d902K6M1M2N1N1l6l6l7l6N0N0MMM9N0n9n9lmn0n0K7K7n0m9Q9Q9n0m9n3n4K4K4MNQ1Q1
2706d708l6l7RRLKLKk3k2k3k2L2L2m4m5q5q5K3K2N8N7N7N7j13j13l6l6L0L0j6j6MLLLJ9J8
2702d984K7K8j66j3J51lm2j34l9J14n7n7O0O1Q1Q0MMJ2J3o5o4m8m9j40J3J50N8J1J2kkjkR
2698d980Qo8o8O1O0J5J4O5O5j3j2r4r4M5M4J3J3J3J3q9q9J10J11j6j6j6j6k2k2J16J16m6m6
$$ plain form
2694 -4825 -4871 -4918 -4915 -4912 -4909 -4907 -4808 -4709 -4718 -4726 -4738 -4749 -4806 -4863 -4832 -4801 -4847 -4893 -4898 -4903 -4863 -4822 -4810 -4798 -4740 -4682 -4735 -4788 -4764 -4740 -4856 -4972 -4858 -4743 -4690 -4637
2690 -4637 -4723 -4808 -4840 -4872 -4903 -4935 -4887 -4839 -4791 -4743 -4753 -4763 -4727 -4690 -4779 -4868 -4848 -4829 -4804 -4778 -4752 -4726 -4730 -4733 -4814 -4894 -4854 -4814 -4851 -4888 -4845 -4802 -4836 -4869 -4797
2686 -4797 -4725 -4761 -4797 -4850 -4904 -4850 -4796 -4728 -4660 -4591 -4523 -4578 -4633 -4735 -4836 -4855 -4874 -4815 -4757 -4752 -4746 -4741 -4735 -4751 -4767 -4788 -4810 -4730 -4742 -4853 -4778 -4747 -4717 -4651 -4770
2682 -4770 -4855 -4756 -4772 -4788 -4767 -4745 -4816 -4887 -4880 -4872 -4819 -4765 -4737 -4710 -4720 -4916 -5014 -4928 -4899 -4963 -4956 -4856 -4826 -4795 -4767 -4923 -5027 -5039 -5045 -5051 -5051 -5051 -4994 -4937 -4879 -4822
2678 -4822 -4829 -4836 -4889 -4942 -5031 -5121 -5056 -4991 -5016 -5041 -5066 -5091 -5105 -5119 -5132 -5146 -5133 -5120 -5015 -4910 -5027 -5144 -5108 -5071 -5020 -4969 -4964 -4959 -4967 -4975 -4982 -4990 -4916 -4842 -4860 -4878
2674 -4878 -4872 -4865 -4887 -5001 -5179 -5172 -5121 -5071 -5057 -5044 -4939 -4833 -4829 -4826 -4822 -4819 -4886 -4954 -4983 -4827 -4767 -4891 -4854 -4817 -4795 -4773 -4844 -4914 -4953 -4992 -4877 -4762 -4757 -4751 -4838
2670 -4838 -4925 -4868 -4810 -4799 -4788 -4812 -4835 -4813 -4790 -4771 -4751 -4731 -4712 -4726 -4740 -4708 -4676 -4728 -4780 -4739 -4699 -4752 -4805 -4765 -4726 -4768 -4811 -4807 -4803 -4727 -4650 -4728 -4805 -4805 -4804 -4804 -4803
2666 -4803 -4770 -4736 -4703 -4669 -4668 -4667 -4667 -4666 -4704 -4742 -4688 -4635 -4702 -4769 -4744 -4719 -4670 -4622 -4665 -4709 -4632 -4555 -4570 -4585 -4614 -4644 -4674 -4704 -4725 -4746 -4675 -4604 -4570 -4535 -4547 -4559
$$ packed form
2694d825m6m7LLLKR9R9rqj2j1n7n7L1L1m6m6nnM0M1J2J2N8N8n3n3K4K4j16j16J14J15N3N3
2690d637q6q5l2l2l1l2M8M8M8M8j0j0L6L7q9q9K0J9K5K6K6K6mlq1q0M0M0l7l7M3M3l4l3P2
2686d797P2l6l6n3n4N4N4O8O8O9O8n5n5j02j01j9j9N9N8NONOj6j6k1k2Q0j2j11P5L1L0O6j19
2682d770q5R9j6j6K1K2p1p1PQN3N4K8K7j0j96r8Q6K9o4PJ00L0L1K8j56j04j2oo%%N7N7N8N7
2678d822ppn3n3q9r0O5O5k5k5k5k5j4j4j3j4J3J3J05J05j17j17L6L7N1N1NNqqpqP4P4j8j8
2674d878OPk2j14j78PN1N0J4J3J05J06MLMLo7o8k9J56O0j24L7L7K2K2p1p0l9l9J15J15NOq7
2670d838q7N7N8J1J1k4k3K2K3J9K0K0J9j4j4L2L2n2n2M1M0n3n3M0L9m2m3MMP6P7p8p7%J%J
2666d803L3L4L3L4JJ%Jl8l8N4N3o7o7K5K5M9M8m3m4P7P7j5j5k9l0l0l0k1k1P1P1L4L5j2j2
$$ plain form
2662 -4559 -4541 -4523 -4597 -4671 -4687 -4702 -4718 -4734 -4778 -4823 -4775 -4727 -4629 -4532 -4589 -4645 -4625 -4604 -4676 -4748 -4651 -4554 -4672 -4791 -4814 -4837 -4815 -4792 -4838 -4885 -4839 -4794 -4791 -4787
2658 -4787 -4738 -4688 -4637 -4585 -4625 -4666 -4622 -4579 -4628 -4677 -4684 -4690 -4696 -4703 -4735 -4767 -4800 -4832 -4861 -4890 -4874 -4857 -4796 -4736 -4830 -4923 -4948 -4973 -4906 -4838 -4769 -4700 -4723 -4746 -4790 -4834
2654 -4834 -4879 -4923 -4910 -4896 -4774 -4835 -4914 -4900 -4857 -4814 -4850 -4886 -4922 -4958 -4952 -4945 -4847 -4748 -4771 -4793 -4816 -4838 -4796 -4754 -4711 -4669 -4727 -4784 -4842 -4899 -4908 -4917 -4925 -4934 -4904 -4874 -4844
2649 -4844 -4814 -4824 -4835 -4845 -4855 -4827 -4798 -4770 -4742 -4771 -4800 -4828 -4857 -4834 -4811 -4881 -4950 -4919 -4889 -4858 -4828 -4842 -4855 -4869 -4883 -4819 -4756 -4692 -4628 -4686 -4743 -4709 -4674 -4672 -4671
2645 -4671 -4670 -4668 -4684 -4700 -4716 -4732 -4737 -4742 -4748 -4753 -4791 -4829 -4856 -4882 -4895 -4724 -4758 -4885 -4808 -4730 -4659 -4587 -4632 -4677 -4722 -4767 -4727 -4688 -4740 -4793 -4778 -4763 -4841 -4918 -4773 -4627
2641 -4627 -4642 -4656 -4656 -4748 -4805 -4679 -4682 -4778 -4811 -4844 -4817 -4790 -4866 -4759 -4712 -4666 -4701 -4735 -4711 -4686 -4700 -4899 -4963 -4842 -4837 -4832 -4800 -4768 -4737 -4705 -4696 -4687 -4678 -4670 -4714 -4759
2637 -4759 -4804 -4849 -4819 -4789 -4758 -4728 -4766 -4804 -4749 -4695 -4686 -4678 -4669 -4661 -4609 -4558 -4598 -4639 -4703 -4766 -4738 -4709 -4727 -4744 -4762 -4779 -4785 -4791 -4797 -4803 -4741 -4679 -4710 -4740 -4780 -4820 -4706 -4592
2633 -4592 -4482 -4372 -4478 -4583 -4612 -4640 -4669 -4698 -4639 -4581 -4522 -4464 -4511 -4559 -4514 -4469 -4499 -4530 -4560 -4590 -4615 -4640 -4664 -4689 -4716 -4743 -4770 -4797 -4786 -4774 -4763 -4751
$$ packed form
2662d559J8J8p4p4j6j5j6j6m4m5M8M8R8R7n7n6K0K1p2p2R7R7j18j19k3k3K2K3m6m7M6M5LM
2658d787M9N0N1N2m0m1M4M3m9m9poopl2l2l3l2k9k9J6J7O1O0r4r3k5k5O7O8O9O9k3k3m4m4
2654d834m5m4J3J4J22o1p9J4M3M3l6l6l6l6OPR8R9k3k2k3k2M2M2M3M2n8n7n8n7rrqrL0L0L0
2649d844L0j0j1j0j0K8K9K8K8k9k9k8k9K3K3p0o9L1L0L1L0j4j3j4j4O4O3O4O4n8n7L4L5KJ
2645d671JKj6j6j6j6nnonl8l8k7k6j3J71l4j27P7P8P1P2m5m5m5m5M0L9n2n3J5J5p8p7J45J46
2641d627j5j4%r2n7J26lr6l3l3K7K7p6J07M7M6l5l4K4K5j4j99o4J21NNL2L2L1L2RRRQm4m5
2637d759m5m5L0L0L1L0l8l8N5N4RQRQN2N1m0m1o4o3K8K9j8j7j8j7ooooO2O2l1l0m0m0J14J14
2633d592J10J10j06j05k9k8k9k9N9N8N9N8m7m8M5M5l0l1l0l0k5k5k4k5k7k7k7k7J1J2J1J2
$$ plain form
2629 -4751 -4779 -4806 -4833 -4860 -4849 -4838 -4827 -4815 -4815 -4815 -4815 -4815 -4762 -4710 -4751 -4791 -4841 -4890 -4940 -4990 -4924 -4859 -4793 -4728 -4774 -4820 -4774 -4728 -4789 -4849 -4818 -4786 -4817 -4848 -4740 -4633
2625 -4633 -4616 -4600 -4661 -4722 -4728 -4735 -4634 -4533 -4622 -4711 -4724 -4736 -4761 -4786 -4765 -4744 -4745 -4745 -4745 -4745 -4755 -4764 -4774 -4783 -4781 -4779 -4777 -4775 -4760 -4744 -4624 -4689 -4704 -4719 -4746 -4772 -4782 -4792 -4802
2620 -4802 -4812 -4799 -4785 -4772 -4759 -4757 -4755 -4754 -4752 -4773 -4794 -4816 -4837 -4810 -4783 -4768 -4753 -4672 -4776 -4776 -4776 -4792 -4807 -4822 -4837 -4834 -4831 -4828 -4825 -4792 -4759 -4803 -4847 -4825 -4803 -4734 -4666 -4675 -4685
2616 -4685 -4771 -4857 -4823 -4788 -4695 -4787 -4835 -4883 -4835 -4787 -4856 -4925 -4982 -5040 -5091 -4957 -4927 -4897 -4866 -4836 -4805 -4774 -4874 -4974 -4989 -4820 -4728 -4822 -4753 -4685 -4777 -4869
2612 -4869 -4854 -4839 -4920 -5002 -4945 -4888 -4839 -4790 -4741 -4692 -4723 -4753 -4853 -4769 -4671 -4757 -4857 -4865 -4803 -4741 -4751 -4760 -4747 -4734 -4644 -4554 -4596 -4639 -4681 -4723 -4700 -4676 -4653 -4629
2608 -4629 -4617 -4605 -4593 -4581 -4593 -4606 -4618 -4630 -4659 -4688 -4717 -4746 -4657 -4568 -4568 -4568 -4480 -4577 -4647 -4717 -4622 -4526 -4540 -4462 -4435 -4594 -4688 -4691 -4729 -4676 -4558 -4626 -4635 -4553 -4534
2604 -4534 -4514 -4542 -4570 -4598 -4626 -4605 -4584 -4563 -4542 -4511 -4480 -4526 -4572 -4596 -4620 -4598 -4576 -4609 -4642 -4604 -4566 -4591 -4709 -4777 -4660 -4604 -4641 -4661 -4680 -4696 -4711 -4727 -4742
2601 -4742 -4719 -4696 -4674 -4651 -4651 -4651 -4651 -4651 -4712 -4773 -4834 -4895 -4884 -4872 -4861 -4850 -4852 -4854 -4810 -4766 -4709 -4652 -4672 -4693 -4670 -4648 -4703 -4757 -4756 -4755 -4800 -4845 -4840 -4835 -4784 -4733 -4818 -4902 -4848
$$ packed form
2629d751k8k7k7k7J1J1J1J2%%%%N3N2m1m0n0m9n0n0O6O5O6O5m6m6M6M6o1o0L1L2l1l1J08J07
2625d633J7J6o1o1opJ01J01q9q9j3j2k5k5K1K1j%%%j0rj0rKKKKJ5J6J20o5j5j5k7k6j0j0j0
2620d802j0J3J4J3J3KKJKk1k1k2k1K7K7J5J5Q1j04%%j6j5j5j5LLLLL3L3m4m4K2K2O9O8rj0
2616d685q6q6L4L5R3r2m8m8M8M8o9o9n7n8n1J34L0L0L1L0L1L1j00j00j5J69R2r4O9O8r2r2
2612d869J5J5q1q2N7N7M9M9M9M9l1l0j00Q4R8q6j00qO2O2j0rJ3J3R0R0m2m3m2m2K3K4K3K4
2608d629J2J2J2J2j2j3j2j2k9k9k9k9Q9Q9%%Q8r7p0p0R5R6j4P8K7j59r4ll8N3J18o8rQ2J9
2604d534K0k8k8k8k8K1K1K1K1L1L1m6m6k4k4K2K2l3l3L8L8k5j18o8J17N6l7k0j9j6j5j6j5
2601d742K3K3K2K3%%%%o1o1o1o1J1J2J1J1kkM4M4N7N7k0k1K3K2n5n4JJm5m5NNN1N1q5q4N4
$$ plain form
2596 -4848 -4795 -4739 -4683 -4719 -4756 -4740 -4723 -4799 -4875 -4848 -4821 -4886 -4952 -4932 -4913 -4894 -4874 -4853 -4832 -4811 -4790 -4756 -4721 -4768 -4814 -4908 -4818 -4728 -4823 -4825 -4828 -4934 -5040 -5000
2592 -5000 -4960 -4920 -4880 -4913 -4945 -4885 -4825 -4803 -4781 -4806 -4830 -4820 -4809 -4845 -4881 -4890 -4900 -4909 -4919 -4929 -4939 -4857 -4775 -4786 -4797 -4808 -4819 -4829 -4840 -4851 -4862 -4824 -4787 -4842 -4896
2588 -4896 -4876 -4856 -4836 -4815 -4824 -4832 -4840 -4849 -4845 -4842 -4839 -4836 -4806 -4776 -4747 -4717 -4747 -4776 -4806 -4836 -4815 -4793 -4864 -4935 -4894 -4854 -4813 -4772 -4799 -4825 -4759 -4693 -4723 -4752 -4827 -4903 -4881 -4859
2584 -4859 -4837 -4815 -4718 -4621 -4678 -4735 -4720 -4705 -4644 -4583 -4575 -4567 -4559 -4551 -4631 -4710 -4697 -4685 -4701 -4717 -4733 -4749 -4710 -4671 -4632 -4593 -4583 -4572 -4562 -4552 -4653 -4755 -4702 -4650 -4580
2580 -4580 -4509 -4485 -4460 -4433 -4406 -4472 -4537 -4591 -4645 -4653 -4660 -4700 -4739 -4778 -4817 -4800 -4782 -4765 -4747 -4718 -4688 -4658 -4628 -4621 -4615 -4608 -4601 -4622 -4642 -4663 -4684 -4669 -4654 -4639 -4624 -4597 -4571
2576 -4571 -4591 -4610 -4552 -4494 -4528 -4562 -4587 -4612 -4636 -4661 -4683 -4705 -4774 -4842 -4879 -4916 -4860 -4805 -4776 -4747 -4810 -4872 -4830 -4788 -4746 -4703 -4778 -4853 -4836 -4819 -4761 -4703 -4738 -4772
2572 -4772 -4775 -4778 -4735 -4691 -4704 -4718 -4731 -4744 -4764 -4784 -4804 -4823 -4746 -4668 -4745 -4821 -4799 -4778 -4756 -4734 -4747 -4761 -4774 -4787 -4797 -4807 -4771 -4735 -4764 -4792 -4729 -4665 -4673 -4682 -4644 -4606
2568 -4606 -4692 -4778 -4818 -4858 -4843 -4827 -4811 -4796 -4771 -4746 -4814 -4882 -4923 -4965 -4961 -4956 -4942 -4927 -4912 -4898 -4882 -4867 -4848 -4982 -4977 -4817 -4789 -4852 -4951 -4957 -4980 -4911 -4970 -5030 -4929
$$ packed form
2596d848N3N6N6l6l7J6J7p6p6K7K7o5o6K0J9J9K0K1K1K1K1L4L5m7m6r4R0R0r5klj06j06M0
2592e000M0M0M0l3l2O0O0K2K2k5k4J0J1l6l6rj0rj0j0j0Q2Q2j1j1j1j1j0j1j1j1L8L7n5n4
2588d896K0K0K0K1rqqrMLLLL0L0K9L0l0k9l0l0K1K2p1p1M1M0M1M1k7k6O6O6l0k9p5p6K2K2
2584d859K2K2R7R7n7n7J5J5O1O1QQQQq0p9J3J2j6j6j6j6L9L9L9L9J0J1J0J0j01j02N3N2P0
2580d580P1K4K5K7K7o6o5n4n4qpm0l9l9l9J7J8J7J8K9L0L0L0POPPk1k0k1k1J5J5J5J5K7K6
2576d571k0j9N8N8l4l4k5k5k4k5k2k2o9o8l7l7N6N5K9K9o3o2M2M2M2M3p5p5J7J7N8N8l5l4
2572d772llM3M4j3j4j3j3k0k0k0j9P7P8p7p6K2K1K2K2j3j4j3j3j0j0L6L6k9k8O3O4qrL8L8
2568d606q6q6m0m0J5J6J6J5K5K5o8o8m1m2MNJ4J5J5J4J6J5J9j34NJ60K8o3r9ok3O9n9o0J01
$$ plain form
2564 -4929 -4829 -4862 -4894 -4834 -4774 -4828 -4882 -4936 -4990 -4975 -4960 -4944 -4929 -4875 -4820 -4858 -4896 -4839 -4781 -4770 -4759 -4818 -4877 -4843 -4810 -4831 -4853 -4874 -4896 -4935 -4975 -5015 -5055 -4995
2560 -4995 -4935 -4875 -4815 -4806 -4797 -4789 -4780 -4832 -4884 -4978 -4980 -5025 -4917 -4756 -4749 -4827 -4905 -4900 -4896 -4866 -4836 -4853 -4869 -4805 -4741 -4722 -4704 -4702 -4700 -4698 -4696 -4708 -4721 -4733 -4746 -4723 -4701 -4679 -4657
2555 -4657 -4673 -4690 -4706 -4723 -4715 -4708 -4700 -4693 -4665 -4637 -4764 -4890 -4896 -4903 -4863 -4824 -4751 -4678 -4697 -4716 -4700 -4684 -4760 -4836 -4829 -4822 -4768 -4715 -4675 -4636 -4689 -4742 -4734 -4727 -4708 -4688 -4840 -4807
2551 -4807 -4785 -4764 -4769 -4774 -4860 -4946 -4976 -4822 -4719 -4708 -4805 -4903 -4852 -4801 -4823 -4845 -4774 -4704 -4659 -4613 -4614 -4615 -4616 -4617 -4572 -4527 -4583 -4639 -4603 -4567 -4623 -4679 -4626 -4665 -4775 -4700
2547 -4700 -4586 -4655 -4659 -4663 -4678 -4693 -4732 -4770 -4716 -4662 -4678 -4694 -4664 -4635 -4635 -4636 -4545 -4453 -4513 -4572 -4689 -4622 -4610 -4599 -4529 -4460 -4478 -4496 -4613 -4729 -4719 -4802 -4782 -4578
2543 -4578 -4531 -4484 -4518 -4551 -4579 -4607 -4681 -4755 -4758 -4761 -4718 -4675 -4661 -4647 -4633 -4619 -4623 -4628 -4633 -4638 -4622 -4605 -4589 -4573 -4691 -4809 -4882 -4772 -4750 -4821 -4927 -4940 -4854 -4768 -4833
2539 -4833 -4804 -4672 -4723 -4758 -4792 -4791 -4790 -4696 -4603 -4677 -4751 -4836 -4737 -4703 -4669 -4629 -4589 -4640 -4783 -4851 -4734 -4618 -4687 -4646 -4513 -4584 -4655 -4643 -4631 -4673 -4716 -4681 -4646
2535 -4646 -4627 -4608 -4588 -4569 -4603 -4636 -4670 -4704 -4714 -4725 -4735 -4746 -4685 -4624 -4564 -4503 -4548 -4593 -4592 -4591 -4651 -4710 -4797 -4699 -4701 -4702 -4549 -4579 -4519 -4550 -4628 -4614 -4768 -4738 -4595
$$ packed form
2564d929J00l3l2O0O0n4n4n4n4J5J5J6J5N4N5l8l8N7N8J1J1n9n9L4L3k1k2k1k2l9m0m0m0O0
2560d995O0O0O0RRQRn2n2r4km5J08J61Pp8p8NML0L0j7j6O4O4J9J8KKKKj2j3j2j3K3K2K2K2
2555d657j6j7j6j7QPQPK8K8j27j26opM0L9P3P3j9j9J6J6p6p6PPN4N3M0L9n3n3QPJ9K0j52L3
2551d807K2K1nnq6q6l0J54J03J1r7r8N1N1k2k2P1P0M5M6jjjjM5M5n6n6L6L6n6n6N3l9j10P5
2547d700J14o9mmj5j5l9l8N4N4j6j6L0K9%jR1R2o0n9j17O7J2J1P0O9j8j8j17j16J0q3K0K04
2543d578M7M7l4l3k8k8p4p4llM3M3J4J4J4J4mnnnJ6J7J6J6j18j18p3J10K2p1j06j3Q6Q6o5
2539d833K9J32n1l5l4JJR4R3p4p4q5R9L4L4M0M0n1j43o8J17J16o9M1J33p1p1J2J2m2m3L5L5
2535d646J9J9K0J9l4l3l4l4j0j1j0j1O1O1O0O1m5m5JJo0n9q7R8kjJ53l0O0l1p8J4j54L0J43
$$ plain form
2531 -4595 -4636 -4624 -4612 -4658 -4704 -4719 -4735 -4751 -4767 -4704 -4641 -4625 -4608 -4644 -4680 -4640 -4599 -4666 -4734 -4755 -4777 -4817 -4858 -4821 -4785 -4663 -4540 -4556 -4572 -4612 -4652 -4693 -4733
2528 -4733 -4776 -4820 -4725 -4630 -4618 -4606 -4587 -4751 -4866 -4797 -4796 -4888 -4854 -4913 -4977 -4948 -4950 -4952 -4948 -4944 -4904 -4863 -4776 -4690 -4767 -4845 -4784 -4723 -4809 -4895 -4818 -4741 -4698 -4748 -4855
2524 -4855 -4778 -4771 -4856 -4878 -4899 -4860 -4821 -4782 -4742 -4788 -4833 -4878 -4923 -4868 -4812 -4757 -4701 -4725 -4749 -4773 -4797 -4814 -4831 -4771 -4711 -4811 -4911 -4872 -4833 -4859 -4884 -4910 -4935 -4914
2520 -4914 -4892 -4825 -4757 -4744 -4732 -4796 -4860 -4781 -4702 -4700 -4698 -4746 -4794 -4842 -4890 -4881 -4872 -4796 -4720 -4747 -4928 -4998 -4976 -4947 -4919 -4946 -4882 -4855 -4983 -5070 -5064 -5015 -4966 -4972 -4886 -4783
2516 -4783 -4834 -4886 -4783 -4763 -4835 -4846 -4857 -4862 -4867 -4872 -4877 -4891 -4905 -4780 -4655 -4719 -4783 -4846 -4910 -4896 -4882 -4867 -4853 -4863 -4872 -4881 -4891 -4907 -4923 -4939 -4955 -4895 -4835 -4883 -4931 -4916
2511 -4916 -4901 -4963 -5025 -4914 -4803 -4737 -4672 -4716 -4761 -4805 -4849 -4876 -4903 -4931 -4958 -4925 -4892 -4906 -4920 -4894 -4869 -4920 -4972 -5044 -5115 -5068 -5021 -5091 -4977 -4857 -4922 -4945
2508 -4945 -4877 -4808 -4831 -4867 -4717 -4574 -4615 -4758 -4902 -4902 -4903 -4891 -4879 -4855 -4832 -4882 -4748 -4717 -4687 -4669 -4651 -4679 -4708 -4750 -4793 -4743 -4694 -4712 -4730 -4748 -4766 -4709 -4652
2504 -4652 -4687 -4723 -4810 -4897 -4892 -4887 -4915 -4942 -4924 -4905 -4879 -4853 -4872 -4892 -4788 -4684 -4795 -4906 -4842 -4778 -4760 -4742 -4777 -4812 -4639 -4651 -4845 -4855 -4826 -4797 -4819 -4841
$$ packed form
2531d595m1J2J2m6m6j5j6j6j6O3O3J6J7l6l6M0M1o7o8k1k2m0m1L7L6J22J23j6j6m0m0m1m0
2528d733m3m4R5R5J2J2J9j64j15O9Jr2L4n9o4K9kkMMM0M1Q7Q6p7p8O1O1q6q6P7P7M3n0j07
2524d855P7Pq5k2k1L9L9L9M0m6m5m5m5N5N6N5N6k4k4k4k4j7j7O0O0j00j00L9L9k6k5k6k5K1
2520d914K2O7O8J3J2o4o4P9P9KKm8m8m8m8RRP6P6k7j81p0K2K9K8k7O4K7j28q7OM9M9oQ6J03
2516d783n1n2J03K0p2j1j1nnnnj4j4J25J25o4o4o3o4J4J4J5J4j0rrj0j6j6j6j6O0O0m8m8J5
2511d916J5o2o2J11J11O6O5m4m5m4m4k7k7k8k7L3L3j4j4K6K5n1n2p2p1M7M7p0J14J20o5k3
2508d945O8O9k3l6J50J43m1j43j44%jJ2J2K4K3n0J34L1L0J8J8k8k9m2m3N0M9j8j8j8j8N7N7
2504d652l5l6q7q7NNk8k7J8J9K6K6j9k0J04J04j11j11O4O4J8J8l5l5J73j2j94j0K9K9k2k2
$$ plain form
2500 -4841 -4817 -4793 -4841 -4890 -4846 -4802 -4774 -4746 -4718 -4691 -4666 -4641 -4708 -4776 -4789 -4803 -4724 -4646 -4682 -4719 -4750 -4781 -4800 -4727 -4591 -4639 -4770 -4716 -4726 -4828 -4798 -4768 -4698
2497 -4698 -4628 -4573 -4518 -4555 -4592 -4618 -4644 -4739 -4649 -4535 -4605 -4716 -4734 -4611 -4673 -4774 -4692 -4657 -4623 -4623 -4623 -4618 -4612 -4699 -4786 -4750 -4715 -4679 -4643 -4677 -4710 -4744 -4777 -4833
2493 -4833 -4888 -4851 -4814 -4786 -4758 -4822 -4886 -4882 -4878 -4828 -4778 -4854 -4929 -4994 -5058 -5026 -4810 -4748 -4870 -4903 -4936 -4980 -5024 -5010 -4995 -4934 -4873 -4771 -4669 -4782 -4895 -4902 -4909
2489 -4909 -4916 -4923 -4891 -4860 -4909 -4958 -5003 -4864 -4828 -4792 -4795 -4798 -4801 -4804 -4751 -4698 -4738 -4778 -4780 -4782 -4784 -4786 -4784 -4781 -4825 -4869 -4864 -4858 -4761 -4663 -4718 -4773 -4735 -4697 -4671 -4645 -4711 -4777 -4690 -4603 -4609
2484 -4609 -4614 -4553 -4492 -4477 -4462 -4575 -4688 -4708 -4728 -4735 -4742 -4702 -4663 -4615 -4567 -4612 -4657 -4652 -4648 -4643 -4639 -4579 -4519 -4552 -4585 -4539 -4494 -4541 -4588 -4559 -4530 -4547 -4564 -4533 -4501 -4469 -4437
2480 -4437 -4547 -4657 -4675 -4693 -4673 -4652 -4632 -4611 -4554 -4497 -4594 -4691 -4690 -4688 -4681 -4674 -4711 -4655 -4555 -4609 -4688 -4613 -4576 -4632 -4746 -4767 -4641 -4514 -4418 -4476 -4540 -4603 -4628
2476 -4628 -4653 -4678 -4703 -4711 -4719 -4726 -4734 -4749 -4764 -4780 -4795 -4741 -4687 -4725 -4763 -4791 -4818 -4814 -4718 -4646 -4727 -4715 -4704 -4733 -4763 -4792 -4821 -4838 -4856 -4868 -4880 -4911 -4851 -4750 -4803 -4808 -4720
2472 -4720 -4787 -4853 -4842 -4831 -4911 -4992 -4973 -4954 -4935 -4916 -4868 -4820 -4773 -4725 -4731 -4737 -4743 -4748 -4727 -4705 -4674 -4643 -4749 -4700 -4686 -4765 -4849 -4932 -4960 -4834 -4711 -4679 -4740 -4800 -4876
$$ packed form
2500d841K4K4m8m9M4M4K8K8K8K7K5K5o7o8j3j4P9P8l6l7l1l1j9P3J36m8j31N4j0j02L0L0P0
2497d698P0N5N5l7l7k6k6r5R0J14p0j11j8J23o2j01Q2L5L4%%NOq7q7L6L5L6L6l4l3l4l3n6
2493d833n5L7L7K8K8o4o4MMN0N0p6p5o5o4L2K16O2j22l3l3m4m4J4J5O1O1J02J02j13j13pp
2489d909ppL2L1m9m9m5J39L6L6llllN3N3m0m0kkkkKLm4m4NOR7R8n5n5L8L8K6K6o6o6Q7Q7o
2484d609nO1O1J5J5j13j13k0k0ppM0L9M8M8m5m5NMNMO0O0l3l3M6M5m7m7K9K9j7j7L1L2L2L2
2480d437j10j10j8j8K0K1K0K1N7N7r7r7JKPPl7N6J00n4p9P5L7n6j14k1J26J27R6n8o4o3k5
2476d628k5k5k5qqpqj5j5j6j5N4N4l8l8k8k7MR6P2q1J2J1k9l0k9k9j7j8j2j2l1O0J01n3nQ8
2472d720o7o6J1J1q0q1J9J9J9J9M8M8M7M8ooonK1K2L1L1j06M9J4p9q4q3k8J26J23L2o1o0p6
$$ plain form
2468 -4876 -4953 -4875 -4797 -4862 -4926 -4899 -4871 -4902 -4934 -4873 -4812 -4888 -4963 -4947 -4930 -4938 -4946 -4955 -4963 -4911 -4860 -4809 -4757 -4849 -4941 -5033 -5124 -5060 -4996 -4933 -4869 -4865 -4860 -4949 -5037 -5044 -5052 -5059 -5067
2463 -5067 -5031 -4996 -4868 -4741 -4827 -4912 -4906 -4899 -4945 -4991 -4945 -4898 -4892 -4886 -4880 -4874 -4917 -4959 -4910 -4860 -4897 -4934 -4878 -4822 -4786 -4750 -4806 -4862 -4822 -4782 -4741 -4701 -4758 -4815 -4872 -4929
2459 -4929 -4796 -4662 -4744 -4826 -4820 -4813 -4806 -4799 -4854 -4909 -4810 -4711 -4725 -4740 -4754 -4769 -4720 -4671 -4622 -4573 -4589 -4605 -4621 -4638 -4594 -4551 -4508 -4464 -4548 -4632 -4624 -4616 -4541 -4465 -4543 -4622
2455 -4622 -4575 -4528 -4573 -4619 -4616 -4614 -4611 -4609 -4655 -4701 -4654 -4608 -4590 -4573 -4555 -4538 -4554 -4569 -4585 -4601 -4578 -4555 -4532 -4510 -4505 -4500 -4495 -4491 -4436 -4381 -4419 -4456 -4540 -4624 -4555 -4485 -4490 -4495 -4500 -4506
2451 -4506 -4447 -4388 -4422 -4455 -4544 -4632 -4567 -4501 -4554 -4606 -4612 -4618 -4606 -4594 -4674 -4754 -4631 -4508 -4477 -4446 -4570 -4695 -4726 -4758 -4709 -4660 -4657 -4654 -4658 -4662 -4666 -4670 -4654 -4639 -4635 -4631 -4547
2446 -4547 -4647 -4643 -4639 -4659 -4679 -4700 -4720 -4682 -4643 -4651 -4659 -4626 -4594 -4654 -4713 -4675 -4637 -4645 -4652 -4651 -4650 -4649 -4647 -4620 -4593 -4658 -4723 -4702 -4682 -4661 -4640 -4700 -4760 -4728 -4696 -4702 -4709 -4722 -4735 -4672
2442 -4672 -4702 -4795 -4704 -4599 -4678 -4832 -4802 -4773 -4653 -4622 -4776 -4702 -4629 -4566 -4504 -4520 -4537 -4553 -4570 -4592 -4614 -4636 -4659 -4664 -4668 -4673 -4678 -4581 -4483 -4478 -4472 -4448 -4423 -4491 -4559
2438 -4559 -4544 -4529 -4514 -4499 -4517 -4536 -4509 -4481 -4548 -4615 -4528 -4442 -4424 -4406 -4435 -4463 -4515 -4567 -4618 -4670 -4572 -4475 -4476 -4476 -4498 -4612 -4761 -4756 -4659 -4561 -4546 -4624 -4661 -4545
$$ packed form
2468d876p7P8P8o5o4K7K8l1l2O1O1p6p5J6J7qqrqN2N1N1N2r2r2r2r1O4O4O3O4MNq9q8pqpq
2463e067L6L5J28J27q6q5OPm6m6M6M7OOOOm3m2M9N0l7l7N6N6L6L6n6n6M0M0M1M0n7n7n7n7
2459d929J33J34q2q2OPPPn5n5R9R9j4j5j4j5M9M9M9M9j6j6j6j7M4M3M3M4q4q4QQP5P6p8p9
2455d622M7M7m5m6LKLKm6m6M7M6J8J7J8J7j6j5j6j6K3K3K3K2NNNMN5N5l8l7q4q4O9P0nnno
2451d506N9N9l4l3q9q8O5O6n3n2ooJ2J2q0q0J23J23L1L1j24j25l1l2M9M9LLmmmmJ6J5MMQ4
2446d547j00MMk0k0k1k0L8L9qqL3L2o0n9L8L8qpJJJKK7K7o5o5K1K0K1K1o0o0L2L2opj3j3O3
2442d672l0r3R1J05p9j54L0K9J20L1j54P4P3O3O2j6j7j6j7k2k2k2k3nmnnR7R8NOK4K5o8o8
2438d559J5J5J5J5j8j9K7K8o7o7Q7Q6J8J8k9k8n2n2n1n2R8R7j%k2j14j49NR7R8J5p8l7J16
$$ plain form
2434 -4545 -4561 -4669 -4629 -4589 -4556 -4522 -4535 -4549 -4470 -4391 -4383 -4374 -4412 -4449 -4438 -4427 -4502 -4577 -4531 -4393 -4312 -4385 -4341 -4296 -4317 -4338 -4317 -4450 -4502 -4461 -4354 -4247 -4227
2430 -4227 -4207 -4330 -4453 -4483 -4514 -4473 -4433 -4392 -4351 -4368 -4386 -4403 -4420 -4450 -4481 -4419 -4357 -4402 -4447 -4409 -4372 -4283 -4348 -4459 -4416 -4418 -4419 -4458 -4496 -4487 -4479 -4553 -4627 -4605 -4429
2426 -4429 -4442 -4454 -4352 -4403 -4413 -4424 -4447 -4470 -4453 -4436 -4419 -4495 -4565 -4481 -4385 -4382 -4409 -4437 -4455 -4472 -4490 -4508 -4494 -4480 -4419 -4359 -4508 -4658 -4653 -4649 -4515 -4381 -4339
2422 -4339 -4297 -4338 -4379 -4421 -4462 -4476 -4489 -4457 -4424 -4448 -4472 -4398 -4324 -4378 -4340 -4267 -4348 -4316 -4285 -4355 -4426 -4456 -4486 -4424 -4362 -4415 -4469 -4430 -4392 -4441 -4491 -4541 -4591 -4576
2419 -4576 -4561 -4547 -4532 -4551 -4570 -4635 -4700 -4714 -4727 -4649 -4570 -4594 -4618 -4596 -4574 -4543 -4512 -4527 -4542 -4543 -4543 -4497 -4452 -4442 -4431 -4421 -4411 -4398 -4384 -4371 -4358 -4397 -4436 -4476 -4515
2415 -4515 -4535 -4554 -4574 -4594 -4631 -4668 -4705 -4742 -4675 -4608 -4634 -4659 -4587 -4514 -4534 -4554 -4516 -4478 -4486 -4494 -4452 -4410 -4414 -4418 -4469 -4521 -4573 -4625 -4589 -4552 -4608 -4664 -4673 -4682 -4644 -4607 -4556
2410 -4556 -4506 -4548 -4590 -4609 -4629 -4557 -4484 -4532 -4581 -4629 -4677 -4668 -4658 -4649 -4639 -4624 -4608 -4685 -4761 -4764 -4766 -4723 -4679 -4724 -4770 -4723 -4675 -4646 -4616 -4632 -4648 -4608 -4568 -4620 -4672 -4738
2406 -4738 -4804 -4778 -4752 -4769 -4786 -4803 -4820 -4806 -4792 -4779 -4765 -4834 -4903 -4879 -4856 -4833 -4811 -4834 -4858 -4892 -4927 -4869 -4811 -4819 -4826 -4880 -4934 -4977 -5020 -4970 -4921 -4933 -4944 -4955 -4967
$$ packed form
2434d545j6j08M0M0L3L4j3j4P9P9QRl8l7J1J1p5p5M6J38Q1p3M4M5k1k1K1j33n2M1J07J07K0
2430d227K0j23j23l0l1M1M0M1M1j7j8j7j7l0l1O2O2m5m5L8L7Q9o5j11M3kjl9l8RQp4p4K2J76
2426d429j3j2J02n1j0j1k3k3J7J7J7p6p0Q4R6Lk7k8j8j7j8j8J4J4O1O0j49j50NMJ34J34M2
2422d339M2m1m1m2m1j4j3L2L3k4k4P4P4n4L8P3q1L2L1p0p1l0l0O2O2n3n4L9L8m9n0n0n0J5
2419d576J5J4J5j9j9o5o5j4j3P8P9k4k4K2K2L1L1j5j5j%M6M5J0J1J0J0J3J4J3J3l9l9m0l9
2415d515k0j9k0k0l7l7l7l7O7O7k6k5P2P3k0k0L8L8qqM2M2mmn1n2n2n2L6L7n6n6rrL8L7N1
2410d556N0m2m2j9k0P2P3m8m9m8m8RJ0RJ0J5J6p7p6lkM3M4m5m6M7M8K9L0j6j6M0M0n2n2o6
2406d738o6K6K6j7j7j7j7J4J4J3J4o9o9K4K3K3K2k3k4l4l5N8N8qpn4n4m3m3N0M9j2j1j1j2
$$ plain form
2402 -4967 -4919 -4871 -4916 -4960 -4956 -4951 -4947 -4942 -4938 -4933 -4974 -5016 -4970 -4924 -5031 -5139 -5063 -4988 -5004 -5020 -5041 -5061 -4995 -4928 -4910 -4983 -5008 -4880 -4806 -4886 -4922 -4866 -4914 -4962 -4958 -4954 -4876
2398 -4876 -4798 -4874 -4950 -4908 -4867 -4917 -4968 -4903 -4838 -4774 -4709 -4721 -4732 -4744 -4756 -4721 -4687 -4745 -4803 -4760 -4717 -4767 -4816 -4850 -4884 -4764 -4645 -4579 -4514 -4602 -4691 -4606 -4522
2394 -4522 -4529 -4537 -4502 -4466 -4584 -4703 -4650 -4597 -4679 -4668 -4725 -4628 -4433 -4392 -4448 -4504 -4478 -4451 -4444 -4438 -4477 -4517 -4472 -4428 -4476 -4524 -4482 -4439 -4396 -4353 -4383 -4413 -4443 -4473 -4518
2390 -4518 -4562 -4514 -4467 -4386 -4306 -4317 -4329 -4386 -4442 -4406 -4370 -4397 -4424 -4452 -4479 -4415 -4350 -4378 -4405 -4329 -4253 -4331 -4408 -4402 -4395 -4389 -4382 -4362 -4342 -4414 -4486 -4544 -4601 -4566 -4530 -4599
2386 -4599 -4668 -4644 -4621 -4511 -4402 -4508 -4614 -4599 -4584 -4507 -4523 -4574 -4472 -4365 -4413 -4645 -4723 -4683 -4642 -4636 -4630 -4624 -4618 -4670 -4722 -4682 -4641 -4673 -4705 -4736 -4768 -4775 -4781 -4788
2382 -4788 -4795 -4802 -4810 -4812 -4814 -4850 -4794 -4704 -4767 -4793 -4818 -4940 -4907 -4860 -4812 -4857 -4901 -4811 -4874 -4902 -4838 -4878 -4918 -4952 -4986 -5026 -5065 -5073 -4990 -4904 -4972 -5000 -4935 -4866 -4796 -4813 -4830
2378 -4830 -4796 -4761 -4726 -4691 -4746 -4800 -4855 -4910 -4899 -4888 -4883 -4878 -4832 -4879 -5000 -4907 -4882 -4950 -5013 -4985 -4898 -4965 -4992 -4926 -4947 -4967 -4890 -4813 -4844 -4875 -4906 -4937 -4897 -4857 -4817
2374 -4817 -4777 -4765 -4753 -4731 -4710 -4869 -4874 -4821 -4861 -4806 -4751 -4856 -4960 -4853 -4746 -4732 -4717 -4816 -4915 -4860 -4805 -4800 -4795 -4790 -4785 -4773 -4761 -4749 -4737 -4639 -4540 -4534 -4528 -4548 -4568
$$ packed form
2402d967M8M8m5m4MNMNMNm1m2M6M6j07j08P6P5j6j6k1k0O6O7J8p3k5J28P4q0l6N6m8m8MMP8
2398d876P8p6p6M2M1n0n1O5O5O4O5j2j1j2j2L5L4n8n8M3M3n0m9l4l4J20J19O6O5q8q9Q5Q4
2394d522pqL5L6j18j19N3N3q2J1n7R7J95M1n6n6K6K7POl9m0M5M4m8m8M2M3M3M3l0l0l0l0m5
2390d518m4M8M7Q1Q0j1j2n7n6L6L6k7k7k8k7O4O5k8k7P6P6p8p7OPOPK0K0p2p2n8n7L5L6o9
2386d599o9K4K3J10J09j06j06J5J5P7j6n1J02J07m8k32p8M0M1OOOOn2n2M0M1l2l2l1l2pop
2382d788ppqkkl6N6R0o3k6k5j22L3M7M8m5m4R0o3k8O4m0m0l4l4m0l9qQ3Q6o8k8O5O9P0j7j7
2378d830L4L5L5L5n5n4n5n5J1J1NNM6m7j21R3K5o8o3K8Q7o7k7O6k1k0P7P7l1l1l1l1M0M0M0
2374d817M0J2J2K2K1j59nN3m0N5N5j05j04J07J07J4J5r9r9N5N5NNNNJ2J2J2J2R8R9OOk0k0
$$ plain form
2370 -4568 -4589 -4609 -4571 -4534 -4589 -4644 -4629 -4615 -4601 -4587 -4557 -4527 -4528 -4622 -4631 -4487 -4527 -4567 -4439 -4312 -4277 -4242 -4348 -4453 -4405 -4356 -4383 -4410 -4436 -4463 -4514 -4564 -4523
2366 -4523 -4482 -4440 -4399 -4450 -4500 -4482 -4465 -4385 -4398 -4478 -4404 -4365 -4418 -4507 -4504 -4466 -4428 -4479 -4529 -4580 -4630 -4588 -4547 -4505 -4463 -4479 -4495 -4511 -4527 -4516 -4505 -4495 -4484 -4573 -4662
2362 -4662 -4659 -4656 -4597 -4537 -4570 -4603 -4555 -4507 -4505 -4503 -4476 -4450 -4469 -4489 -4497 -4505 -4513 -4521 -4577 -4633 -4678 -4722 -4851 -4794 -4749 -4797 -4654 -4604 -4652 -4608 -4578 -4548 -4604 -4661 -4628 -4595 -4654
2358 -4654 -4713 -4725 -4737 -4640 -4635 -4835 -4850 -4656 -4646 -4608 -4570 -4589 -4608 -4502 -4396 -4505 -4614 -4708 -4802 -4742 -4682 -4712 -4743 -4727 -4712 -4586 -4459 -4543 -4626 -4732
2355 -4732 -4746 -4615 -4669 -4613 -4558 -4513 -4469 -4498 -4527 -4555 -4584 -4559 -4533 -4404 -4460 -4483 -4505 -4540 -4574 -4584 -4594 -4512 -4430 -4510 -4590 -4734 -4693 -4652 -4702 -4689 -4676 -4630 -4584
2351 -4584 -4538 -4491 -4518 -4545 -4572 -4598 -4593 -4588 -4582 -4577 -4586 -4595 -4650 -4705 -4655 -4604 -4646 -4687 -4751 -4815 -4787 -4758 -4788 -4817 -4847 -4877 -4812 -4748 -4683 -4619 -4662 -4705 -4748 -4791 -4778 -4766 -4753
2347 -4753 -4740 -4678 -4616 -4702 -4788 -4864 -4848 -4820 -4977 -4997 -4925 -4870 -4815 -4849 -4884 -4872 -4860 -4704 -4548 -4607 -4666 -4747 -4828 -4816 -4805 -4718 -4631 -4533 -4619 -4663 -4708 -4684 -4659
2343 -4659 -4582 -4690 -4792 -4802 -4815 -4828 -4754 -4680 -4574 -4652 -4685 -4624 -4605 -4677 -4710 -4557 -4583 -4702 -4653 -4604 -4766 -4743 -4624 -4598 -4577 -4649 -4738 -4642 -4581 -4612 -4626
$$ packed form
2370d568k1k0L8L7n5n5J5J4J4J4L0L0jr4rJ44m0m0J28J27L5L5j06j05M8M9k7k7k6k7n1n0M1
2366d523M1M2M1n1n0J8J7Q0j3q0P4L9n3q9LL8L8n1n0n1n0M2M1M2M2j6j6j6j6J1J1J0J1q9q9
2362d662LLN9O0l3l3M8M8KKK7K6j9k0qqqqn6n6m5m4j29N7M5m8J43N0m8M4L0L0n6n7L3L3n9
2358d654n9j2j2R7Nk00j5J94J0L8L8j9j9J06J06j09j09r4r4O0O0l0l1J6J5J26J27q4q3j06
2355d732j4J31n4N6N5M5M4k9k9k8k9K5K6J29n6k3k2l5l4j0j0Q2Q2q0q0j44M1M1n0J3J3M6M6
2351d584M6M7k7k7k7k6NNONrrn5n5N0N1m2m1o4o4K8K9l0k9l0l0O5O4O5O4m3m3m3m3J3J2J3
2347d753J3O2O2q6q6p6J6K8j57k0P2N5N5l4l5J2J2J56J56n9n9q1q1J2J1Q7Q7R8q6m4m5K4K5
2343d659P7j08j02j0j3j3P4P4J06p8l3O1J9p2l3J53k6j19M9M9j62K3J19K6K1p2q9R6O1l1j4
$$ plain form
2339 -4626 -4640 -4613 -4586 -4651 -4716 -4657 -4599 -4587 -4575 -4499 -4423 -4500 -4578 -4618 -4657 -4605 -4553 -4508 -4463 -4510 -4557 -4555 -4553 -4597 -4642 -4571 -4501 -4430 -4360 -4334 -4309 -4376 -4443 -4426 -4408
2335 -4408 -4483 -4559 -4544 -4530 -4608 -4686 -4600 -4513 -4381 -4248 -4328 -4408 -4396 -4383 -4434 -4484 -4443 -4401 -4425 -4448 -4472 -4496 -4461 -4426 -4391 -4356 -4373 -4389 -4405 -4421 -4510 -4598 -4579
2331 -4579 -4560 -4494 -4427 -4438 -4449 -4474 -4499 -4417 -4334 -4343 -4352 -4315 -4278 -4327 -4376 -4425 -4474 -4500 -4526 -4445 -4363 -4406 -4449 -4492 -4536 -4502 -4468 -4440 -4412 -4284 -4249 -4311 -4189 -4279
2328 -4279 -4368 -4314 -4259 -4213 -4260 -4370 -4295 -4209 -4307 -4291 -4274 -4331 -4388 -4307 -4226 -4315 -4404 -4355 -4305 -4225 -4144 -4109 -4075 -4244 -4413 -4363 -4313 -4163 -4197 -4256 -4223 -4178
2324 -4178 -4132 -4177 -4222 -4260 -4113 -4070 -4028 -4046 -4063 -4081 -4099 -4120 -4141 -4162 -4183 -4197 -4211 -4226 -4240 -4306 -4372 -4330 -4288 -4225 -4161 -4143 -4126 -4212 -4298 -4277 -4256 -4346 -4436 -4388
2320 -4388 -4340 -4293 -4245 -4339 -4339 -4242 -4330 -4359 -4297 -4316 -4335 -4349 -4362 -4376 -4390 -4397 -4405 -4473 -4448 -4382 -4471 -4401 -4240 -4278 -4317 -4318 -4319 -4367 -4414 -4425 -4436 -4446 -4457 -4465 -4473 -4480 -4488 -4458
2316 -4458 -4428 -4399 -4369 -4386 -4402 -4496 -4590 -4583 -4575 -4522 -4469 -4533 -4598 -4616 -4634 -4610 -4586 -4562 -4538 -4610 -4682 -4754 -4826 -4810 -4793 -4777 -4760 -4778 -4795 -4813 -4830 -4848 -4866 -4883 -4901
2312 -4901 -4868 -4835 -4802 -4769 -4770 -4771 -4762 -4753 -4896 -4884 -4769 -4746 -4782 -4819 -4784 -4749 -4740 -4731 -4721 -4712 -4746 -4780 -4752 -4817 -4857 -4743 -4670 -4689 -4681 -4673 -4670 -4668 -4660 -4651 -4643 -4634 -4659 -4685 -4602 -4520
$$ packed form
2339d626j4K7K7o5o5N9N8J2J2P6P6p7p8m0l9N2N2M5M5m7m7KKm4m5P1P0P1P0K6K5o7o7J7J8
2335d408p5p6J5J4p8p8Q6Q7J32J33q0q0J2J3n1n0M1M2k4k3k4k4L5L5L5L5j7j6j6j6q9q8J9
2331d579J9O6O7j1j1k5k5Q2Q3rrL7L7m9m9m9m9k6k6Q1Q2m3m3m3m4L4L4K8K8J28L5o2J22r0
2328d279q9N4N5M6m7j10P5Q6r8J6J7n7n7Q1Q1q9q9M9N0Q0Q1L5L4j69j69N0N0J50l4n9L3M5
2324d178M6m5m5l8J47M3M2j8j7j8j8k1k1k1k1j4j4j5j4o6o6M2M2O3O4J8J7q6q6K1K1r0r0M8
2320d388M8M7M8r4%R7q8k9O2j9j9j4j3j4j4pqo8K5O6q9P0J61l8l9jjm8m7j1j1j0j1qqpqL0
2316d458L0K9L0j7j6r4r4PQN3N3o4o5j8j8K4K4K4K4p2p2p2p2J6J7J6J7j8j7j8j7j8j8j7j8
2312d901L3L3L3L3jjRRj43J2J15K3l6l7L5L5RRJ0Rl4l4K8o5m0J14P3j9QQLKQRQRk5k6Q3Q2
$$ plain form
2307 -4520 -4502 -4484 -4467 -4449 -4413 -4377 -4341 -4305 -4357 -4409 -4461 -4513 -4501 -4489 -4476 -4464 -4508 -4553 -4582 -4457 -4350 -4336 -4368 -4400 -4364 -4329 -4339 -4350 -4336 -4323 -4417 -4511 -4429
2303 -4429 -4347 -4253 -4344 -4278 -4212 -4311 -4411 -4454 -4497 -4448 -4399 -4417 -4435 -4453 -4472 -4452 -4432 -4216 -4185 -4357 -4530 -4437 -4344 -4299 -4253 -4208 -4162 -4224 -4287 -4349 -4411 -4451
2300 -4451 -4492 -4440 -4388 -4359 -4330 -4394 -4457 -4439 -4421 -4402 -4384 -4395 -4405 -4416 -4426 -4359 -4291 -4223 -4156 -4197 -4239 -4281 -4323 -4369 -4415 -4369 -4323 -4329 -4335 -4341 -4347 -4371 -4396 -4409 -4423 -4476
2296 -4476 -4345 -4306 -4452 -4437 -4421 -4417 -4413 -4467 -4520 -4481 -4443 -4469 -4494 -4520 -4546 -4497 -4448 -4399 -4350 -4381 -4413 -4444 -4476 -4438 -4401 -4363 -4325 -4330 -4334 -4339 -4344 -4348 -4353 -4357 -4362 -4332 -4302 -4273
2291 -4273 -4243 -4258 -4272 -4287 -4301 -4248 -4194 -4232 -4271 -4332 -4394 -4363 -4332 -4351 -4370 -4388 -4407 -4472 -4537 -4510 -4482 -4486 -4489 -4493 -4497 -4481 -4465 -4450 -4434 -4359 -4284 -4362 -4441 -4433 -4425 -4417 -4409 -4450
2287 -4450 -4492 -4533 -4574 -4561 -4549 -4536 -4524 -4552 -4580 -4608 -4636 -4642 -4647 -4652 -4657 -4683 -4709 -4734 -4760 -4757 -4754 -4751 -4748 -4657 -4566 -4629 -4692 -4616 -4540 -4557 -4573 -4630 -4687 -4743 -4800 -4809 -4817 -4734 -4650
2282 -4650 -4696 -4741 -4694 -4648 -4649 -4651 -4744 -4838 -4800 -4762 -4724 -4686 -4627 -4568 -4662 -4757 -4698 -4639 -4673 -4706 -4738 -4769 -4708 -4648 -4655 -4662 -4670 -4677 -4702 -4727 -4752 -4776 -4799 -4822 -4844 -4867 -4872 -4877
2278 -4877 -4790 -4703 -4690 -4676 -4662 -4648 -4683 -4717 -4752 -4786 -4712 -4637 -4563 -4489 -4493 -4498 -4503 -4507 -4441 -4375 -4463 -4551 -4514 -4477 -4440 -4403 -4414 -4425 -4437 -4448 -4466 -4485 -4412 -4338 -4293 -4248
$$ packed form
2307d520J8J8J7J8L6L6L6L6n2n2n2n2J2J2J3J2m4m5k9J25J07J4l2l2L6L5j0j1J4J3r4r4Q2
2303d429Q2R4r1O6O6r9j00m3m3M9M9j8j8j8j9K0K0K16L1j72j73R3R3M5M6M5M6o2o3o2o2m0
2300d451m1N2N2K9K9o4o3J8J8J9J8j1j0j1j0O7O8O8O7m1m2m2m2m6m6M6M6ooook4k5j3j4n3
2296d476J31L9j46J5J6MMn4n3L9L8k6k5k6k6M9M9M9M9l1l2l1l2L8L7L8L8nmnnmnmnL0L0K9
2291d273L0j5j4j5j4N3N4l8l9o1o2L1L1j9j9j8j9o5o5K7K8mlmmJ6J6J5J6P5P5p8p9QQQQm1
2287d450m2m1m1J3J2J3J2k8k8k8k8onnnk6k6k5k6LLLLR1R1o3o3P6P6j7j6n7n7n6n7rqQ3Q4
2282d650m6m5M7M6jkr3r4L8L8L8L8N9N9r4r5N9N9l4l3l2l1O1O0ppqpk5k5k5k4k3k3k2k3nn
2278d877Q7Q7J3J4J4J4l5l4l5l4P4P5P4P4mnnmO6O6q8q8L7L7L7L7j1j1j2j1j8j9P3P4M5M5
$$ plain form
2274 -4248 -4363 -4478 -4493 -4600 -4598 -4441 -4328 -4368 -4450 -4440 -4424 -4316 -4295 -4366 -4389 -4412 -4441 -4470 -4455 -4440 -4333 -4379 -4480 -4489 -4468 -4446 -4470 -4495 -4519 -4544 -4540 -4536
2270 -4536 -4531 -4527 -4414 -4300 -4340 -4380 -4397 -4413 -4430 -4447 -4419 -4391 -4364 -4336 -4376 -4416 -4456 -4497 -4452 -4408 -4363 -4319 -4350 -4382 -4413 -4445 -4453 -4462 -4470 -4478 -4427 -4376 -4325 -4274 -4384 -4494
2266 -4494 -4537 -4426 -4426 -4426 -4416 -4406 -4450 -4494 -4538 -4582 -4657 -4732 -4714 -4697 -4677 -4658 -4638 -4619 -4641 -4662 -4684 -4706 -4674 -4642 -4610 -4578 -4563 -4547 -4531 -4516 -4548 -4581 -4613 -4646 -4690
2262 -4690 -4734 -4624 -4606 -4637 -4513 -4431 -4440 -4518 -4597 -4588 -4580 -4539 -4499 -4458 -4417 -4439 -4461 -4482 -4504 -4493 -4483 -4558 -4480 -4512 -4543 -4565 -4587 -4615 -4642 -4670 -4698 -4722 -4746 -4677 -4609
2258 -4609 -4645 -4680 -4623 -4567 -4609 -4651 -4693 -4735 -4696 -4657 -4710 -4764 -4761 -4758 -4756 -4753 -4681 -4609 -4623 -4638 -4722 -4713 -4642 -4754 -4871 -4803 -4706 -4702 -4719 -4736 -4759 -4782 -4799 -4816 -4770 -4816
2254 -4816 -4910 -4820 -4748 -4675 -4712 -4749 -4786 -4823 -4842 -4861 -4880 -4900 -4923 -4946 -4882 -4819 -4750 -4774 -4942 -4925 -4831 -4738 -4671 -4789 -4889 -4804 -4783 -4855 -4849 -4843 -4844 -4844 -4815 -4787 -4758
2250 -4758 -4730 -4701 -4673 -4644 -4616 -4617 -4617 -4618 -4619 -4643 -4667 -4691 -4715 -4746 -4776 -4807 -4838 -4799 -4761 -4723 -4684 -4652 -4621 -4589 -4557 -4564 -4571 -4577 -4584 -4569 -4555 -4540 -4525 -4534 -4542 -4614 -4594 -4493 -4577
2246 -4577 -4695 -4722 -4705 -4689 -4667 -4646 -4645 -4644 -4643 -4642 -4722 -4802 -4728 -4654 -4632 -4609 -4494 -4379 -4382 -4385 -4435 -4484 -4414 -4343 -4365 -4387 -4417 -4448 -4386 -4324 -4295 -4265 -4334 -4403 -4331 -4352
$$ packed form
2274d248j15j15j5j07KJ57J13m0q2J0J6J08K1p1k3k3k9k9J5J5J07m6j01rK1K2k4k5k4k5MM
2270d536NMJ13J14m0m0j7j6j7j7K8K8K7K8m0m0m0m1M5M4M5M4l1l2l1l2qrqqN1N1N1N1j10j10
2266d494m3J11%%J0J0m4m4m4m4p5p5J8J7K0J9K0J9k2k1k2k2L2L2L2L2J5J6J6J5l2l3l2l3m4
2262d690m4J10J8l1J24Q2rp8p9RQM1M0M1M1k2k2k1k2J1J0p5P8l2l1k2k2k8k7k8k8k4k4O9O8
2258d609l6l5N7N6m2m2m2m2L9L9n3n4LLKLP2P2j4j5q4RP1j12j17O8R7Mj7j7k3k3j7j7M6m6
2254d816r4R0P2P3l7l7l7l7j9j9j9k0k3k3O4O3O9k4j68J7R4R3O7j18j00Q5K1p2OOj%K9K8K9
2250d758K8K9K8K9K8j%jjk4k4k4k4l1l0l1l1L9L8L8L9L2L1L2L2ppopJ5J4J5J5rqp2K0J01q4
2246d577j18k7J7J6K2K1JJJJq0q0P4P4K2K3J15J15lln0m9P0P1k2k2l0l1O2O2K9L0o9o9P2k1
$$ plain form
2241 -4352 -4407 -4308 -4205 -4102 -4081 -4061 -4074 -4087 -4193 -4298 -4235 -4172 -4154 -4137 -4125 -4113 -4100 -4088 -4043 -3997 -4044 -4091 -4057 -4022 -4079 -4137 -4134 -4130 -4173 -4215 -4222 -4228 -4249 -4178
2238 -4178 -4001 -3977 -4076 -4175 -4156 -4137 -4103 -4161 -4274 -4233 -4186 -4232 -4128 -4025 -4081 -4137 -4166 -4195 -4178 -4161 -4144 -4127 -4146 -4165 -4279 -4239 -4138 -4036 -4066 -4187
2234 -4187 -4257 -4173 -4050 -4020 -3974 -3928 -3991 -4054 -4055 -3903 -3887 -3963 -3988 -4012 -4000 -4142 -4201 -4106 -4014 -4075 -4171 -4052 -3998 -4098 -4149 -4109 -4104 -4100 -4182 -4264 -4275 -4285 -4296
2230 -4296 -4307 -4280 -4253 -4225 -4198 -4221 -4245 -4223 -4200 -4121 -4042 -4056 -4070 -4105 -4141 -4084 -4027 -4019 -4011 -4095 -4180 -4179 -4179 -4178 -4178 -4164 -4149 -4135 -4120 -4145 -4169 -4100 -4032 -4010 -3988 -4058 -4128
2226 -4128 -4077 -4027 -4068 -4109 -4099 -4089 -4079 -4069 -4034 -3999 -4056 -4113 -4189 -4264 -4247 -4231 -4172 -4113 -4208 -4302 -4241 -4179 -4209 -4239 -4241 -4243 -4244 -4246 -4303 -4360 -4326 -4291 -4270 -4250 -4275 -4301
2222 -4301 -4325 -4348 -4372 -4396 -4302 -4209 -4208 -4206 -4208 -4210 -4166 -4121 -4182 -4242 -4303 -4363 -4309 -4255 -4201 -4147 -4105 -4062 -4020 -3977 -4012 -4047 -4081 -4116 -4085 -4054 -4023 -3992 -4042 -4092 -4142 -4192
2218 -4192 -4149 -4105 -4108 -4111 -4053 -3994 -3913 -4016 -4047 -3893 -3947 -4002 -4038 -4075 -4020 -3964 -3893 -3822 -3844 -3865 -3853 -3840 -3920 -4000 -3900 -3799 -3852 -3905 -3968 -4030 -4001 -3971 -3945
2214 -3945 -3919 -3894 -3868 -3875 -3882 -3889 -3896 -3842 -3788 -3887 -3987 -3952 -3918 -3976 -4033 -4055 -4076 -4097 -4119 -4042 -3965 -3981 -3996 -3987 -3978 -3968 -3959 -3952 -3945 -3938 -3932 -3946 -3960 -3975 -3989 -3948 -3907 -4010 -4113
$$ packed form
2241d352n5R9J03J03K1K0j3j3j06j05O3O3J8J7J2J2J3J2M5M6m7m7L4L5n7n8LMm3m2pok1P1
2238d178J77K4r9r9J9J9L4n8j13M1M7m6J04J03n6n6k9k9J7J7J7J7j9j9j14M0J01J02l0j21
2234d187p0Q4J23L0M6M6o3o3jJ52J6p6k5k4J2j42n9R5R2o1r6J19N4j00n1M0NMq2q2j1j0j1
2230d296j1K7K7K8K7k3k4K2K3P9P9j4j4l5l6N7N7QQq4q5J%J%J4J5J4J5k5k4O9O8K2K2p0p0
2226d128N1N0m1m1J0J0J0J0L5L5n7n7p6p5J7J6N9N9r5r4O1O2l0l0kkjkn7n7L4L5K1K0k5k6
2222d301k4k3k4k4R4R3JKkkM4M5o1o0o1o0N4N4N4N4M2M3M2M3l5l5l4l5L1L1L1L1n0n0n0n0
2218d192M3M4llN8N9Q1j03l1J54n4n5l6l7N5N6P1P1k2k1J2J3q0q0J00J01n3n3o3o2K9L0K6
2214c945K6K5K6ppppN4N4r9j00L5L4n8n7k2k1k1k2P7P7j6j5RRJ0RPPPOj4j4j5j4M1M1j03j03
$$ plain form
2210 -4113 -4127 -3988 -4028 -4067 -4013 -3958 -3995 -4033 -3972 -3911 -3943 -3975 -4011 -4047 -4084 -4120 -4114 -4108 -4103 -4097 -4021 -3945 -4023 -4101 -4035 -3969 -3995 -4021 -3969 -3918 -3958 -3999 -3944 -3888 -3925 -3962
2206 -3962 -4011 -4061 -3956 -3852 -3809 -3766 -3723 -3834 -3911 -3895 -3883 -3963 -4001 -3947 -3951 -3954 -3949 -3944 -3940 -3935 -3955 -3975 -3903 -3831 -3875 -3918 -3952 -3986 -4059 -3977 -3931 -3976 -3873 -3769 -3825
2202 -3825 -3881 -3887 -3893 -3899 -3905 -3937 -3969 -3908 -3848 -3814 -3781 -3839 -3898 -3935 -3973 -4010 -4047 -4048 -4049 -4050 -4051 -4052 -4054 -4056 -4058 -4181 -4304 -4212 -4119 -4124 -4128 -4133 -4137 -4207 -4277 -4255 -4232 -4238 -4243 -4249 -4254 -4248 -4242 -4236 -4230
2196 -4230 -4192 -4154 -4208 -4262 -4305 -4347 -4297 -4248 -4244 -4239 -4235 -4231 -4241 -4250 -4259 -4269 -4242 -4215 -4250 -4192 -4030 -4023 -4138 -4253 -4279 -4305 -4238 -4172 -4165 -4158 -4151 -4144 -4216 -4289 -4270 -4250 -4288 -4327
2192 -4327 -4365 -4403 -4346 -4289 -4324 -4359 -4352 -4345 -4338 -4178 -4096 -4106 -4148 -4281 -4344 -4252 -4196 -4231 -4269 -4214 -4125 -4036 -4058 -4081 -4103 -4126 -4129 -4132 -4231 -4176 -4058 -4094 -4092 -3997 -3941 -3977
2188 -3977 -4008 -3947 -3878 -3808 -3887 -3966 -3986 -4007 -4000 -3902 -3781 -3875 -3843 -3810 -3838 -3867 -3849 -3831 -3787 -3743 -3791 -3840 -3873 -3906 -3940 -3973 -3943 -3912 -3892 -3871 -3773 -3829 -3849 -3778
2184 -3778 -3791 -3805 -3812 -3820 -3797 -3774 -3752 -3729 -3718 -3707 -3696 -3685 -3690 -3695 -3695 -3694 -3698 -3610 -3478 -3499 -3632 -3612 -3647 -3682 -3597 -3604 -3748 -3738 -3645 -3706 -3732 -3666 -3656 -3799 -3764 -3728
2180 -3728 -3666 -3696 -3760 -3671 -3668 -3665 -3653 -3640 -3629 -3618 -3607 -3596 -3609 -3622 -3589 -3555 -3674 -3793 -3697 -3601 -3581 -3562 -3542 -3523 -3573 -3624 -3629 -3633 -3546 -3458 -3462 -3467 -3451 -3436 -3466 -3497
$$ packed form
2210d113j4J39m0l9N4N5l7l8O1O1l2l2l6l6l7l6OONOP6P6p8p8O6O6k6k6N2N1m0m1N5N6l7l7
2206c962m9n0J05J04M3M3M3j11p7J6J2q0l8N4mlNNMNk0k0P2P2m4m3l4l4p3Q2M6m5J03J04n6
2202c825n6ooool2l2O1O0L4L3n8n9l7l8l7l7jjjjjkkkj23j23R2R3nmnmp0p0K2K3ononOOOO
2196d230L8L8n4n4m3m2N0M9MNMMj0rrj0K7K7l5N8J62Pj15j15k6k6O7O6PPPPp2p3J9K0l8l9
2192d327l8l8N7N7l5l5PPPJ60Q2j0m2j33o3R2N6l5l8N5Q9Q9k2k3k2k3llr9N5J18l6KR5N6l6
2188c977l1O1O9P0p9p9k0k1PR8J21r4L2L3k8k9J8J8M4M4m8m9l3l3l4l3L0L1K0K1R8n6k0P1
2184c778j3j4pqK3K3K2K3J1J1J1J1nn%JmQ8J32k1j33K0l5l5Q5pj44J0R3o1k6O6J0j43L5L6
2180c728O2l0o4Q9LLJ2J3J1J1J1J1j3j3L3L4j19j19R6R6K0J9K0J9n0n1nmQ7Q8mnJ6J5l0l1
$$ plain form
2176 -3497 -3396 -3294 -3286 -3277 -3382 -3487 -3501 -3514 -3408 -3301 -3349 -3397 -3308 -3219 -3284 -3349 -3309 -3268 -3227 -3186 -3252 -3317 -3290 -3264 -3364 -3464 -3472 -3480 -3448 -3416 -3384 -3352
2172 -3352 -3326 -3300 -3274 -3248 -3320 -3392 -3455 -3518 -3521 -3370 -3306 -3242 -3283 -3325 -3367 -3409 -3392 -3375 -3404 -3433 -3401 -3369 -3429 -3489 -3415 -3342 -3268 -3194 -3223 -3251 -3341 -3338 -3269 -3353 -3431
2168 -3431 -3356 -3327 -3299 -3261 -3224 -3332 -3440 -3395 -3349 -3274 -3199 -3216 -3234 -3289 -3345 -3318 -3291 -3162 -3186 -3278 -3370 -3396 -3422 -3449 -3475 -3389 -3303 -3309 -3315 -3314 -3312 -3311 -3309 -3408 -3507 -3514
2164 -3514 -3428 -3345 -3416 -3539 -3569 -3562 -3554 -3494 -3434 -3470 -3507 -3589 -3672 -3601 -3531 -3552 -3574 -3610 -3646 -3590 -3534 -3546 -3558 -3569 -3581 -3651 -3720 -3636 -3552 -3571 -3590 -3609 -3628 -3676 -3724
2160 -3724 -3772 -3820 -3817 -3814 -3811 -3809 -3832 -3855 -3878 -3901 -3847 -3793 -3786 -3778 -3829 -3881 -3839 -3798 -3852 -3906 -3868 -3830 -3789 -3747 -3752 -3757 -3735 -3712 -3689 -3666 -3654 -3642 -3666 -3691 -3816 -3787 -3676
2156 -3676 -3719 -3744 -3677 -3625 -3574 -3650 -3726 -3694 -3662 -3690 -3718 -3669 -3620 -3615 -3610 -3559 -3507 -3558 -3609 -3583 -3464 -3427 -3543 -3521 -3499 -3475 -3452 -3429 -3406 -3410 -3414 -3341 -3268 -3264 -3259 -3301
2152 -3301 -3342 -3322 -3303 -3246 -3190 -3125 -3214 -3217 -3219 -3249 -3280 -3233 -3186 -3161 -3135 -3218 -3300 -3259 -3217 -3176 -3135 -3139 -3143 -3147 -3151 -3129 -3107 -3023 -3032 -3134 -3082 -3123 -3163 -3240 -3317 -3224 -3132
2147 -3132 -3196 -3260 -3247 -3234 -3223 -3211 -3123 -3034 -3066 -3098 -3053 -3008 -3017 -3026 -3035 -3044 -2987 -2930 -2915 -3054 -3176 -3144 -3132 -3120 -3064 -3007 -3027 -3048 -3130 -3212 -3217 -3222 -3128 -3034 -3078 -3123
$$ packed form
2176c497J01J02QRj05j05j4j3J06J07m8m8Q9Q9o5o5M0M1M1M1o6o5K7K6j00j00qqL2L2L2L2
2172c352K6K6K6K6p2p2o3o3lJ51O4O4m1m2m2m2J7J7k9k9L2L2o0o0P4P3P4P4k9k8r0LO9q4p8
2168c431P5K9K8L8L7j08j08M5M6P5P5j7j8n5n6K7K7J29k4r2r2k6k6k7k6Q6Q6ooJKJKr9r9p
2164c514Q6Q3p1j23l0PQO0O0l6l7q2q3P1P0k1k2l6l6N6N6j2j2j1j2p0o9Q4Q4j9j9j9j9m8m8
2160c724m8m8LLLKk3k3k3k3N4N4PQn1n2M2M1n4n4L8L8M1M2nnK2K3K3K3J2J2k4k5j25K9J11
2156c676m3k5O7N2N1p6p6L2L2k8k8M9M9NNN1N2n1n1K6J19L7j16K2K2K4K3K3K3mmP3P3MNm2
2152c301m1K0J9N7N6O5q9lkl0l1M7M7K5K6q3q2M1M2M1M1mmmmK2K2Q4rj02N2m1m0p7p7R3R2
2147c132o4o4J3J3J1J2Q8Q9l2l2M5M5rrrrN7N7J5j39j22L2J2J2N6N7k0k1q2q2nnR4R4m4m5
$$ plain form
2143 -3123 -3127 -3132 -3137 -3141 -3124 -3106 -3135 -3163 -3151 -3138 -3048 -2959 -2969 -2980 -2990 -3000 -3024 -3048 -3072 -3096 -3098 -3101 -3058 -3014 -2996 -2977 -3066 -3155 -3098 -3041 -3111 -3181 -3248 -3131 -2937 -2927
2139 -2927 -2941 -2954 -2945 -2935 -2813 -2876 -2942 -3008 -3004 -3000 -2997 -2993 -2928 -2864 -2876 -2889 -2952 -3015 -3002 -2988 -3043 -3098 -3107 -3115 -3063 -3011 -3036 -3061 -3043 -3024 -3005 -2986 -2977 -2968 -2959 -2950 -2897 -2844 -2868
2135 -2868 -2892 -2967 -3042 -3009 -2977 -2992 -3008 -2958 -2908 -2812 -2899 -2883 -2867 -2814 -2761 -2847 -2933 -2886 -2840 -2794 -2748 -2728 -2707 -2687 -2666 -2641 -2616 -2591 -2565 -2566 -2567 -2491 -2415 -2479 -2544
2131 -2544 -2531 -2519 -2534 -2548 -2563 -2578 -2556 -2535 -2513 -2491 -2400 -2309 -2315 -2320 -2422 -2340 -2362 -2383 -2369 -2355 -2341 -2327 -2272 -2216 -2161 -2106 -2154 -2203 -2217 -2231 -2190 -2332 -2264 -2195
2127 -2195 -2176 -2156 -2136 -2117 -2058 -1999 -2078 -2158 -2061 -1965 -1976 -1987 -2028 -2069 -2033 -1997 -1954 -1911 -1880 -1849 -1751 -1838 -1925 -1828 -1802 -1776 -1738 -1700 -1705 -1710 -1822 -1934 -1904 -1874
2123 -1874 -1890 -1907 -1903 -1900 -1897 -1894 -1890 -1886 -1882 -1878 -1782 -1686 -1759 -1832 -1794 -1756 -1753 -1750 -1846 -1759 -1774 -1790 -1796 -1802 -1911 -1836 -1791 -1746 -1701 -1655 -1643 -1815 -1911 -1821 -1791 -1760 -1718 -1676 -1715
2119 -1715 -1755 -1794 -1833 -1804 -1774 -1744 -1714 -1670 -1626 -1583 -1539 -1495 -1451 -1407 -1364 -1454 -1545 -1635 -1726 -1655 -1584 -1513 -1442 -1469 -1497 -1524 -1552 -1544 -1535 -1527 -1519 -1450 -1381 -1358 -1334 -1382
2114 -1382 -1430 -1401 -1372 -1345 -1318 -1290 -1263 -1208 -1153 -1144 -1135 -1190 -1245 -1162 -1079 -1045 -1011 -977 -943 -833 -723 -721 -719 -658 -597 -675 -752 -769 -786 -789 -700 -687 -859 -973 -995
$$ packed form
2143c123mnnmJ7J8k9k8J2J3R0Q9j0j1j0j0k4k4k4k4klM3M4J8J9q9q9N7N7p0p0o7J17J94J0
2139b927j4j3RJ0J22o3o6o6MMLMO5O4j2j3o3o3J3J4n5n5rqN2N2k5k5J8J9J9J9RRRRN3N3k4
2135b868k4p5p5L3L2j5j6N0N0R6q7J6J6N3N3q6q6M7M6M6M6K0K1K0K1K5K5K5K6jjP6P6o4o5
2131b544J3J2j5j4j5j5K2K1K2K2R1R1onj02Q2k2k1J4J4J4J4N5N6N5N5m8m9j4j4M1j42O8O9
2127b195J9K0K0J9N9N9p9q0R7R6j1j1m1m1L6L6M3M3L1L1R8q7q7R7K6K6L8L8nnj12j12L0L0
2123a874j6j7MLLLMMMMR6R6p3p3L8L8LLr6Q7j5j6ooj09P5M5M5M5M6J2j72r6R0L0L1M2M2l9
2119a715m0l9l9K9L0L0L0M4M4M3M4M4M4M4M3r0r1r0r1P1P1P1P1k7k8k7k8QRQQO9O9K3K4m8
2114a382m8K9K9K7K7K8K7N5N5RRn5n5Q3Q3L4L4L4L4J10J10KKO1O1p8p7j7j7lQ9J3j72j14k2
$$ plain form
2110 -995 -932 -870 -1002 -1134 -1115 -1096 -1083 -1069 -985 -992 -1057 -938 -864 -883 -839 -795 -777 -759 -740 -722 -693 -663 -634 -604 -545 -486 -427 -368 -255 -142 -29 83
2107 83 171 259 348 436 460 483 507 531 462 392 400 407 287 166 46 -74 -61 -49 -37 -25 -35 -46 -57 -68 -87 -105 -124 -143 -167 -192 -78 35 -26
2103 -26 -88 -104 -120 -137 -153 -170 -187 -111 -35 -67 -99 -120 -140 -114 -88 -111 -134 -156 -179 -208 -237 -220 -203 -229 -254 -203 -152 -159 -166 -173 -181 -222 -263 -350 -253 -124 -303
2099 -303 -349 -302 -316 -329 -424 -364 -322 -280 -228 -176 -156 -136 -116 -95 -95 -96 -49 -3 -79 -155 -133 -111 -130 -57 50 4 -5 -14 -33 -52 -49 -45 3 52 137 221 213 204
2094 204 260 315 324 334 427 520 520 521 465 409 446 482 526 571 615 660 616 572 528 483 575 667 605 543 587 632 677 721 763 804 799 795 738 681 779 876 910
2090 910 945 933 921 899 877 947 1017 967 918 962 1005 1022 1039 1010 981 1090 1198 1214 1230 1245 1260 1368 1475 1567 1660 1598 1537 1615 1694 1773 1852 1793 1733
2086 1733 1741 1903 1953 2003 2017 2031 2025 2020 2061 1948 1978 2101 2102 2104 2108 1897 1813 1883 1908 1934 1923 1912 1924 1937 1950 1963 1950 1937 1924 1911 1888 1865 1842 1820 1882
2082 1882 1943 2005 2067 2046 2025 2003 1982 1999 2017 2034 2051 2136 2222 2307 2393 2445 2498 2551 2604 2680 2756 2924 3093 3289 3485 3635 3785 3928 4070 4212
$$ packed form
2110i95O3O2j32j32J9J9J3J4Q4po5J19P4j9M4M4J8J8J9J8K9L0K9L0N9N9N9N9J13J13J13J12
2107H3Q8Q8Q9Q8K4K3K4K4o9p0QPj20j21j20j20J3J2J2J2j0j1j1j1j9j8j9j9k4k5J14J13o1
2103b6o2j6j6j7j6j7j7P6P6l2l2k1k0K6K6k3k3k2k3k9k9J7J7k6k5N1N1pppqm1m1q7R7J29j79
2099c03m6M7j4j3r5O0M2M2N2N2K0K0K0K1%jM7M6p6p6K2K2j9P3J07m6rrj9j9LMM8M9Q5Q4qr
2094B04N6N5RJ0R3R3%Jn6n6L7L6M4M5M4M5m4m4m4m5R2R2o2o2M4M5M5M4M2M1nmn7n7R8R7L4
2090I10L5j2j2k2k2P0P0n0m9M4M3J7J7k9k9J09J08J6J6J5J5J08J07R2R3o2o1P8P9P9P9n9o0
2086A733QJ62N0N0J4J4onM1j13L0J23JKMk11q4P0K5K6j1j1J2J3J3J3j3j3j3j3k3k3k3k2O2
2082A882O1O2O2k1k1k2k1J7J8J7J7Q5Q6Q5Q6N2N3N3N3P6P6J68J69J96J96J50J50J43J42J42
$$ plain form
2079 4212 4355 4374 4393 4459 4524 4346 4168 4082 3996 3927 3857 3695 3533 3484 3434 3231 3027 3004 2982 2959 2936 2913 2890 2867 2844 2803 2763 2722 2682 2742 2802
2075 2802 2770 2738 2784 2829 2829 2829 2854 2879 2904 2930 2880 2830 2873 2915 2908 2901 2940 2980 2960 2941 2921 2902 2993 3083 3174 3265 3256 3247 3238 3229 3256 3283 3311 3338 3377 3415 3454 3493
2071 3493 3555 3617 3679 3742 3803 3864 3771 3679 3672 3664 3611 3558 3556 3555 3507 3459 3420 3381 3495 3609 3669 3729 3696 3664 3573 3482 3493 3504 3446 3542 3516 3399 3438 3570
2067 3570 3543 3423 3367 3310 3334 3359 3399 3347 3260 3327 3406 3485 3419 3354 3383 3412 3348 3439 3506 3480 3470 3459 3435 3412 3480 3549 3531 3513 3541 3569 3629 3689 3656 3624
2063 3624 3696 3769 3780 3883 3930 3824 3815 3961 4013 4065 4035 4004 4027 4050 4120 4189 4203 4218 4232 4247 4304 4362 4420 4477 4529 4581 4637 4539 4471 4556 4638 4720 4777
2060 4777 4834 4845 4856 4914 4973 4986 4999 4954 4909 4946 4984 5134 5131 5069 5100 5182 5264 5254 5243 5275 5214 5159 5258 5274 5198 5275 5353 5248 5142 5083 5023 4932 4841
2056 4841 4873 5059 5134 5118 5162 5207 5193 5179 5248 5317 5443 5416 5349 5435 5512 5681 5848 5862 5764 5667 5652 5637 5660 5683 5659 5636 5631 5626 5570 5513 5489 5373 5268
2052 5268 5317 5337 5356 5339 5322 5351 5380 5409 5438 5442 5445 5357 5269 5239 5209 5139 5223 5220 5218 5225 5233 5223 5213 5243 5273 5283 5201 5176 5305 5310 5315 5422 5529 5579 5628 5678 5728
$$ packed form
2079D212J43J9J9O6O5j78j78q6q6o9p0j62j62m9n0k03k04k3k2k3k3k3k3k3k3m1m0m1m0O0O0
2075B802l2l2M6M5%%K5K5K5K6n0n0M3M2ppL9M0k0j9k0j9R1R0R1R1rrrrK7K7K8K7L9L8L9L9
2071C493O2O2O2O3O1O1r3r2pqn3n3kjm8m8l9l9J14J14O0O0l3l2r1r1J1J1n8R6k6j17L9J32
2067C570k7j20n6n7K4K5M0n2q7O7P9P9o6o5K9K9o4R1O7k6j0j1k4k3O8O9j8j8K8K8O0O0l3l2
2063C624P2P3J1J03M7j06rJ46N2N2l0l1K3K3P0O9J4J5J4J5N7N8N8N7N2N2N6r8o8Q5Q2Q2N7
2060D777N7J1J1N8N9J3J3m5m5L7L8J50lo2L1Q2Q2j0j1L2o1n5R9J6p6P7P8j05j06n9o0r1r1
2056D841L2J86P5j6M4M5j4j4O9O9J26k7o7Q6P7J69J67J4r8r7j5j5K3K3k4k3nnn6n7k4j16j05
2052E268M9K0J9j7j7K9K9K9K9MLq8q8l0l0p0Q4lkPQj0j0L0L0J0q2k5J29NNJ07J07N0M9N0N0
$$ plain form
2048 5728 5843 5958 6073 6188 6306 6425 6389 6353 6283 6212 6234 6256 6189 6121 6054 5986 6092 6197 6211 6224 6309 6393 6478 6563 6686 6809 6871 7025 7201
2044 7201 7223 7216 7425 7562 7698 7802 7906 8063 8219 8369 8366 8355 8344 8231 8118 8028 7937 7800 7663 7418 7174 6929 6684 6495 6306 6163
2041 6163 6020 5955 5890 5918 5945 6016 6088 6067 6046 6032 6018 6004 5989 5927 5864 5848 5831 5800 5770 5831 5892 6006 6119 6141 6162 6125 6087 6096 6105 6122 6138 6063 5987 5958
2038 5958 5928 5945 5962 5908 5854 5893 5931 5888 5845 5802 5759 5657 5555 5539 5523 5456 5296 5148 5154 5132 5111 5241 5218 5155 5245 5204 5071 4948 4918 4922 4926 4913
2034 4913 4901 4980 5060 5062 5064 5112 5161 5235 5309 5429 5549 5579 5609 5684 5760 5876 5993 6201 6410 6599 6788 6983 7178 7338 7589 7728 7712 7744 7868
2031 7868 8023 8086 8177 8176 8139 8101 8016 8083 8153 8131 8223 8161 8035 8002 7997 7991 7899 7807 7711 7616 7614 7611 7486 7362 7274 7186 7163 6985 6996 7100 7171 7242 7227 7212
2027 7212 7155 7098 7042 6985 6981 6978 6928 6878 6807 6735 6669 6757 6799 6841 6986 7130 7282 7434 7586 7738 7802 7867 7931 7995 8088 8181 8275 8368 8587 8806 8871
2023 8871 8936 8902 8867 8832 8797 8586 8375 8256 8138 7957 7777 7596 7416 7252 7089 6771 6454 6043 5633 5314 4996 4633 4270 3953 3636
$$ packed form
2048E728J15J15J15J15J18J19l6l6p0p1K2K2o7o8o7o8J06J05J4J3Q5Q4Q5Q5J23J23O2J54J76
2044G201K2pK09J37J36J04J04J57J56J50lj1j1j13j13r0r1j37j37k45k44k45k45j89j89j43
2041F163j43o5o5K8K7P1P2k1k1j4j4j4j5o2o3j6j7l1l0O1O1J14J13K2K1l7l8RRJ7J6p5p6k9
2038E958l0J7J7n4n4L9L8m3m3m3m3j02j02j6j6o7j60j48Ok2k1J30k3o3R0m1j33j23l0MMj3
2034D913j2P9Q0KKM8M9P4P4J20J20L0L0P5P6J16J17K08K09J89J89J95J95J60K51J39j6L2J24
2031G868J55O3R1jl7l8q5O7P0k2R2o2j26l3nor2r2r6r5klj25j24q8q8k3j78J1J04P1P1j5j5
2027G212n7n7n6n7mln0n0p1p2o6Q8M2M2J45J44J52J52J52J52O4O5O4O4R3R3R4R3K19K19O5
2023H871O5l4l5l5l5k11k11j19j18j81j80j81j80j64j63l18l17m11m10l19l18l63l63l17l17
$$ plain form
2020 3636 3437 3239 2994 2749 2595 2440 2240 2040 1698 1356 1107 857 805 753 747 740 743 745 748 750 800 850 746 643 595 548 409 270 235
2017 235 200 212 223 290 356 469 581 728 875 975 1076 1131 1185 1240 1294 1355 1415 1629 1843 1920 1997 2119 2242 2375 2508 2856 3204 3352
2014 3352 3501 3649 3797 3909 4021 4178 4336 4510 4685 4951 5218 5505 5792 6233 6674 7117 7561 8220 8880 9563 10247 10884 11521
2011 11521 12208 12896 13589 14282 15113 16036 16961 18070 19356 20457 21498 22540 23463 24294 24977 25475 25899 26138 26169 26016 25554
2009 25554 24784 23915 23045 21883 20722 19637 18552 17492 16432 15338 14243 13337 12616 11917 11404 11109 10814 10638 10462 10565
2006 10565 10667 10769 10871 10924 10978 10971 10781 10737 10785 10771 10756 10696 10637 10578 10518 10532 10546 10559 10573 10527 10480 10434 10387 10297 10206 10008 9810 9592 9374 9264
2003 9264 9154 8946 8738 8607 8475 8492 8508 8620 8917 9213 9510 9896 10281 10656 11032 11362 11691 12015 12338 12772 13113 13446 13964 14434
2000 14434 14996 15666 16428 17253 17987 18751 19700 20529 21174 21823 22379 22795 22904 23059 23214 23310 23405 23553 23792 24138 24668 25257 25846
$$ packed form
2020C636j99j98k45k45j54j55k00k00l42l42k49k50n2n2opLKLKN0N0j04j03m8m7j39j39l5
2017B35l5J2J1O7O6J13J12J47J47J00J01N5N4N5N4O1O0K14K14P7P7J22J23J33J33L48L48J48
2014C352J49J48J48J12J12J57J58J74J75K66K67K87K87M41M41M43M44O59O60O83O84O37O37
2011A1521O87O88O93O93Q31R23R25J109J286J101J041J042R23Q31O83M98M24K39L1j53m62
2009B5554p70q69q70j162j161j085j085j060j060j094j095r06p21o99n13k95k95j76j76J03
2006A0565J02J02J02N3N4pj90m4M8j4j5o0n9n9o0J4J4J3J4m6m7m6m7r0r1j98j98k18k18j10
2003I264j10k08k08j31j32J7J6J12K97K96K97L86L85L75L76L30L29L24L23M34L41L33N18M70
2000A4434N62O70P62Q25P34P64R49Q29O45O49N56M16J09J55J55R6R5J48K39L46N30N89N89
$$ plain form
1998 25846 26720 27594 28508 29606 30770 31934 33124 34314 35280 36062 36598 36580 35993 34975 33523 31764 29870 27976 26374
1995 26374 25449 24970 24799 24738 24678 24475 23964 23446 22743 21996 21341 20615 19889 19462 19034 18639 18244 17797 17534 17331 17219 17144 17069 17223
1993 17223 17377 17577 17777 18006 18236 18488 18925 19396 19683 19911 20138 20178 20126 20029 19748 19521 19295 18980 18665 18369 18072 17776 17479 17174
1990 17174 16869 16702 16535 16221 15907 15732 15556 15455 15354 15246 15139 15091 14951 14870 14605 14360 14301 14126 13951 13878 13805 13877 13948 14159 14463
1987 14463 14779 15281 15814 16348 17068 17788 18524 19352 20280 21392 22400 23315 24196 24984 25657 26146 26594 26858 26713 26383 25872 25054
1985 25054 24167 23280 22267 21163 20215 19451 18747 18227 17936 17830 17943 18240 18625 19010 19446 20067 20727 21480 22362 23243 24013 24783
1982 24783 25547 26312 26951 27498 27874 27942 27634 26648 24892 22459 19504 16457 13612 11443 10056 9470 9617 10196 10924 11652 12181
1980 12181 12709 13176 13459 13677 13802 13913 13933 13987 14225 14355 14486 14628 14770 15121 15473 15824 16176 16567 16959 17351 17743 18038 18334
$$ packed form
1998B5846Q74Q74R14J098J164J164J190J190R66P82N36j8n87j018j452j759j894j894j602
1995B6374r25m79j71o1o0k03n11n18p03p47o55p26p26m27m28l95l95m47k63k03j12p5p5J54
1993A7223J54K00K00K29K30K52M37M71K87K28K27M0n2r7k81k27k26l15l15k96k97k96k97l05
1990A7174l05j67j67l14l14j75j76j01j01j08j07m8j40q1k65k45n9j75j75p3p3P2P1K11L04
1987A4463L16N02N33N34P20P20P36Q28R28J112J008R15Q81P88O73M89M48K64j45l30n11q18
1985B5054q87q87j013j104r48p64p04n20k91j06J13K97L85L85M36O21O60P53Q82Q81P70P70
1982B4783P64P65O39N47L76O8l08r86j756k433k955l047k845k169j387n86J47N79P28P28N29
1980A2181N28M67K83K18J25J11K0N4K38J30J31J42J42L51L52L51L52L91L92L92L92K95K96
$$ plain form
1977 18334 18630 18925 18926 18927 18927 18928 18880 18833 18631 18430 18281 18133 17984 17836 17761 17685 17702 17719 17791 17863 17935 18008 18259 18510 18853 19196 19660 20123 20710
1974 20710 21481 22286 23277 24490 25888 27563 29545 31789 34340 37155 40154 43317 46388 49077 51459 53278 54419 55107
1972 55107 55241 55183 55125 55011 54897 54875 54853 54885 54917 55164 55411 55731 56050 56605 57159 57951 59052 60348 61952 63807 65970 68317 70664
1969 70664 72928 75193 77273 79168 80778 82204 83637 85255 87156 89364 92034 95257 99139 103698 108856 114445 120207
1967 120207 125785 130863 135264 138835 141484 143132 143981 143972 143164 141702 139809 138113 136847 136443 136839 137795 138937 139310 138513
1965 138513 136156 132015 126586 120234 113451 106668 100066 94017 88227 82867 77914 73269 69017 65072 61453 58020 54795
1963 54795 51570 48510 45450 42542 39634 36738 33842 31016 28375 25930 23793 21949 20291 18836 17689 16706 15724 14915
1961 14915 14105 13286 12468 11802 11137 10602 10067 9531 8996 8445 7895 7344 6793 6122 5450 4933 4415 3784 3153 2430 1707 761 -183
$$ packed form
1977A8334K96K95JJ%Jm8m7k02k01j49j48j49j48p5p6J7J7P2P2P2P3K51K51L43L43M64M63N87
1974B0710P71Q05R91J213J398J675J982K244K551K815K999L163L071K689K382J819J141O88
1972E5107J34n8n8j14j14k2k2L2L2K47K47L20L19N55N54P92J101J296J604J855K163K347K347
1969G0664K264K265K080J895J610J426J433J618J901K208K670L223L882M559N158N589N762
1967A20207N578N078M401L571K649J648Q49rq08j462j893j696j266m04L96R56J142L73p97
1965A38513k357m141n429o352o783o783o602o049n790n360m953m645m252l945l619l433l225
1963E4795l225l060l060k908k908k896k896k826k641k445k137j844j658j455j147r83r82q09
1961A4915q10q19q18o66o65n35n35n36n35n51n50n51n51o71o72n17n18o31o31p23p23r46r44
$$ plain form
1958 -183 -1232 -2281 -3425 -4753 -6161 -7755 -9523 -11476 -13325 -15174 -17014 -18669 -20016 -21364 -22643 -23737 -24781 -25825
1956 -25825 -26854 -27882 -28911 -29940 -30940 -31941 -32942 -33942 -34881 -35820 -36656 -37491 -38228 -38780 -39236 -39507 -39402 -38866 -37838 -36379
1954 -36379 -34630 -32697 -30760 -28823 -26829 -25019 -23339 -21845 -20628 -19412 -18392 -17557 -16694 -16016 -15523 -15030 -14673 -14316 -13822
1952 -13822 -13237 -12303 -10815 -8795 -5853 -1531 4328 11903 21139 31520 42579 53553 63850 73020 80651 86676 91408
1950 91408 94911 97615 99731 101415 103039 104662 106270 107878 109572 111451 113611 115955 118710 121896 125612 129759 134599
1948 134599 140238 146554 153669 161445 169898 178640 187381 195961 204110 211471 218278 224742 230898 237024 242842 248111 252333
1946 252333 255063 256256 255900 254499 252522 250454 248537 246928 245564 244506 243695 243068 242551 241941 241307 240488 239006 236970 234168
1944 234168 230444 225772 220300 214538 208684 202947 197640 192776 188219 184129 180132 175644 170479 164094 156540 148197 139547
$$ packed form
1958a83j049j049j144j328j408j594j768j953j849j849j840j655j347j348j279j094j044j044
1956b5825j029j028j029j029j000j001j001j000r39r39q36q35p37n52m56k71J05N36J028J459
1954c6379J749J933J937J937J994J810J680J494J217J216J020Q35Q63O78M93M93L57L57M94
1952a3822N85R34J488K020K942M322N859P575R236J0381J1059J0974J0297R170P631O025M732
1950I1408L503K704K116J684J624J623J608J608J694J879K160K344K755L186L716M147M840
1948A34599N639O316P115P776Q453Q742Q741Q580Q149P361O807O464O156O126N818N269M222
1946B52333K730J193l56j401j977k068j917j609j364j058q11o27n17o10o34q19j482k036k802
1944B34168l724m672n472n762n854n737n307m864m557m090l997m488n165o385p554q343q650
$$ plain form
1942 139547 131312 124000 117753 112552 108413 105073 102520 100645 99354 98739 98621 99056 100338 102296 104889 108283 112353 117223
1940 117223 122674 128555 134855 141156 147060 152410 157019 160704 163347 164945 165673 165848 165667 165178 164747 164316 164001 163869 163798
1938 163798 163819 163821 163824 163832 163840 163747 163653 163215 162777 162301 161732 161016 159992 158477 156409 153672 150011 145409 140252 135027 130232 126283 123502
1935 123502 122176 122141 123418 125864 129325 133708 138988 145067 151731 159195 167252 175985 185449 195590 206585 218502 231427
1933 231427 245644 261185 278140 296450 316051 336829 358529 380745 403146 424992 445546 463961 479485 491645
1931 491645 500174 505389 507835 507986 506229 503096 499040 494096 488228 481592 474279 466378 457801 448700 438923 428353 417107
1929 417107 405169 392430 379021 365058 350418 335348 320355 305669 291775 279050 267638 257517 248550 240752
1928 240752 233873 227548 221573 215597 209231 201941 193702 184663 175182 166008 157604 150245 143784 138492 134322 131076 128533
$$ packed form
1942A39547q235p312o247n201m139l340k553j875j291o15j18M35J282J958K593L394M070M870
1940A17223N451N881O300O301N904N350M609L685K643J598P28J75j81m89m31m31l15j32p1
1938A63798K1KLQQr3r4m38m38m76n69p16j024j515k068k737l661m602n157n225m795l949k781
1935A23502j326l5J277K446L461M383N280O079O664P464Q057Q733R464J0141J0995J1917J2925
1933B31427J4217J5541J6955J8310J9601K0778K1700K2216K2401K1846K0554J8415J5524J2160
1931D91645Q529N215K446J51j757l133m056m944n868o636p313p901q577r101r777j0570j1246
1929D17107j1938j2739j3409j3963j4640j5070j4993j4686j3894j2725j1412j0121q967p798
1928B40752o879o325n975n976o366p290q239r039r481r174q404p359o461n292m170l246k543
$$ plain form
1926 128533 126790 125824 125411 125520 126182 127313 128875 130818 133315 136219 139430 143321 147765 152916 158622 164861 171901 179810
1924 179810 188518 197904 207967 218707 229754 240875 251688 261731 270606 277818 283245 286950 289239 290568 291342 292001
1922 292001 292661 293318 293975 294909 295844 296855 297866 298623 299196 299650 299796 299666 299104 297916 296175 294095 291707 288807 285476 281976
1920 281976 278169 273954 269062 263378 257263 250872 244296 237958 232298 227598 224191 222107 221314 221666 222942 225063 227984
1918 227984 231582 235856 240623 245697 251247 257474 264201 271358 279031 287134 295645 304709 314436 324840 335951 347739
1916 347739 360254 373569 387837 403151 419455 436928 455662 475811 497387 520500 545368 572265 601197 632282
1914 632282 665951 702389 741915 784824 831417 882501 938520 1000015 1067839 1142738 1225420 1316531 1416393 1525054
1913 1525054 1641579 1764071 1889755 2014885 2135258 2246710 2345889 2431224 2503532 2565443 2620513 2671830
$$ packed form
1926A28533j743r66m13J09O62J131J562J943K497K904L211L891M444N151N706O239P040P909
1924A79810Q708R386J0063J0740J1047J1121J0813J0043Q875P212N427L705K289J329P74O59
1922B92001O60O57O57R34R35J011J011P57N73M54J46j30n62j188j741k080k388k900l331l500
1920B81976l807m215m892n684o115o391o576o338n660m700l407k084p93L52J276K121K921
1918B27984L598M274M767N074N550O227O727P157P673Q103Q511R064R727J0404J1111J1788
1916C47739J2515J3315J4268J5314J6304J7473J8734K0149K1576K3113K4868K6897K8932L1085
1914F32282L3669L6438L9526M2909M6593N1084N6019O1495O7824P4899Q2682R1111R9862J08661
1913A525054J16525J22492J25684J25130J20373J11452R9179Q5335P2308O1911N5070N1317
$$ plain form
1911 2671830 2721905 2771979 2822920 2875398 2929902 2986805 3046338 3108763 3174545 3244326 3318898 3398700 3483969
1910 3483969 3574959 3671302 3772014 3875805 3981012 4085988 4189057 4288936 4383708 4470912 4548335 4614518
1909 4614518 4669196 4713537 4749450 4779138 4805073 4829370 4853974 4880793 4911488 4947437 4990091 5040578 5100232
1907 5100232 5170338 5252686 5349567 5463489 5596608 5750583 5925542 6119757 6330223 6552809 6782471 7013425
1906 7013425 7238864 7450830 7640139 7798132 7917850 7994315 8024615 8010924 7961541 7888595 7802639 7710467
1904 7710467 7615543 7519205 7421882 7323513 7224020 7123113 7020420 6915941 6809462 6700708 6589424 6475494
1903 6475494 6358757 6238882 6115528 5988543 5857483 5721808 5581019 5434386 5281169 5120631 4952020
1902 4952020 4774366 4586529 4387064 4174702 3948989 3711625 3467063 3222161 2984210 2759372 2550838
$$ packed form
1911B671830N0075N0074N0941N2478N4504N6903N9533O2425O5782O9781P4572P9802Q5269
1910C483969R0990R6343J00712J03791J05207J04976J03069R9879R4772Q7204P7423O6183
1909D614518N4678M4341L5913K9688K5935K4297K4604K6819L0695L5949M2654N0487N9654
1907E100232P0106Q2348R6881J13922J33119J53975J74959J94215K10466K22586K29662K30954
1906G013425K25439K11966J89309J57993J19718P6465L0300j3691m9383p2946q5956r2172
1904G710467r4924r6338r7323r8369r9493j00907j02693j04479j06479j08754j11284j13930
1903F475494j16737j19875j23354j26985j31060j35675j40789j46633j53217j60538j68611
1902D952020j77654j87837j99465k12362k25713k37364k44562k44902k37951k24838k08534
$$ plain form
1900 2550838 2358797 2182075 2018965 1868345 1729248 1600424 1481091 1370433 1267681 1172127 1083256 1000600
1899 1000600 923900 853044 787911 728623 675217 627780 586010 549224 516774 488077 462455 439480 418800
1898 418800 400027 382785 366957 352491 339071 326504 314614 303490 293042 283232 273853 265000 256455 248433 240841
1896 240841 233503 226472 219727 213288 207197 201412 195782 190336 185140 180129 175348 170752 166188 162054 157978 153902 149961
1894 149961 146204 142687 139171 135780 132481 129327 126326 123428 120622 117973 115478 113048 110773 108434 106095 103915 101951
1892 101951 99958 97965 96086 94208 92431 90655 88824 87148 85452 83910 82342 80774 79370 77965 76651 75337 74023
1890 74023 72709 71456 70204 69044 67884 66823 65763 64703 63643 62662 61682 60794 59906 59064 58222 57333 56445 55565 54685 53841
1888 53841 52997 52271 51391 50545 49792 49049 48306 47570 46833 46149 45466 44783 44100 43388 42676 41964 41252 40603 39954 39306 38657 38157 37658
$$ packed form
1900B550838j92041j76722j63110j50620j39097j28824j19333j10658j02752r5554q8871q2656
1899A000600p6700p0856o5133n9288n3406m7437m1770l6786l2450k8697k5622k2975k0680
1898D18800j8773j7242j5828j4466j3420j2567j1890j1124j0448r810r379q853q545q022p592
1896B40841p338p031o745o439o091n785n630n446n196n011m781m596m564m134m076m076l941
1894A49961l757l517l516l391l299l154l001k898k806k649k495k430k275k339k339k180j964
1892A01951j993j993j879j878j777j776j831j676j696j542j568j568j404j405j314j314j314
1890G4023j314j253j252j160j160j061j060j060j060r81r80q88q88q42q42q89q88q80q80q44
1888E3841q44p26q80q46p53p43p43p36p37o84o83o83o83p12p12p12p12o49o49o48o49n00m99
$$ plain form
1885 37658 37066 36474 35963 35451 34940 34429 33907 33386 32956 32527 32068 31610 31152 30693 30284 29875 29466 29056 28692 28328 28020 27711 27559
1882 27559 27560 27659 27912 28144 28283 28478 28766 28950 29133 29323 29512 29626 29740 29853 29967 30157 30347 30479 30457 30376 30449 30504 30560 30637 30499 30329
1880 30329 30158 29961 29764 29412 29061 28693 28325 27956 27588 27264 26940 26616 26292 26053 25813 25574 25334 25069 24804 24538 24273 24193 24114
1877 24114 23989 23863 23700 23537 23282 23026 22802 22577 22352 22127 21843 21559 21367 21174 21086 20998 20695 20391 20196 20001 19760 19519 19369
1874 19369 19218 18975 18733 18516 18299 18082 17866 17697 17528 17360 17191 17061 16931 16647 16363 16162 15961 15852 15743 15561 15378 15155 14932
1872 14932 14693 14547 14436 14170 14006 13842 13668 13494 13328 13162 12997 12831 12741 12650 12406 12161 12053 11945 11836 11728 11599 11469 11340
1869 11340 11210 11129 11048 10966 10885 10750 10615 10474 10333 10217 10008 9756 9657 9541 9271 9046 8912 8669 8427 8282 8137 8063 7989 7962 7934 7943
1866 7943 7952 8007 8062 8081 8099 8210 8321 8438 8554 8671 8788 8964 9140 9316 9492 9667 9841 10015 10189 10238 10286 10334 10383 10264 10146 10116 10086
$$ packed form
1885C7658n92n92n11n12n11n11n22n21m30m29m59m58m58m59m09m09m09m10l64l64l08l09j52
1882B7559JR9K53K32J39J95K88J84J83J90J89J14J14J13J14J90J90J32k2q1P3N5N6P7j38j70
1880C0329j71j97j97l52l51l68l68l69l68l24l24l24l24k39k40k39k40k65k65k66k65q0p9
1877B4114j25j26j63j63k55k56k24k25k25k25k84k84j92j93q8q8l03l04j95j95k41k41j50
1874A9369j51k43k42k17k17k17k16j69j69j68j69j30j30k84k84k01k01j09j09j82j83k23k23
1872A4932k39j46j11k66j64j64j74j74j66j66j65j66r0r1k44k45j08j08j09j08j29j30j29
1869A1340j30q1q1q2q1j35j35j41j41j16k09k52r9j16k70k25j34k43k42j45j45p4p4k7k8R
1866G943RN5N5J9J8J11J11J17J16J17J17J76J76J76J76J75J74J74J74M9M8M8M9j19j18l0l0
$$ plain form
1863 10086 9963 10026 10011 9812 9754 9696 9626 9557 9483 9408 9334 9260 9249 9238 9227 9216 9214 9213 9165 9118 9037 8957 8903 8665 8416 8166 8055 7944 7738 7717 7700
1859 7700 7683 7573 7464 7401 7337 7253 7169 7039 6908 6835 6761 6734 6706 6570 6434 6298 6162 6103 6043 5984 5925 5808 5692 5652 5613 5501 5389 5170
1856 5170 4950 4704 4458 4380 4303 4184 4064 3899 3733 3635 3537 3363 3188 3103 3017 2932 2846 2824 2803 2704 2605 2549 2494 2361 2229 2255 2282 2232 2181
1853 2181 2105 2029 1952 1876 1840 1804 1845 1886 1824 1762 1766 1769 1798 1642 1594 1730 1683 1636 1554 1472 1518 1564 1506 1633 1591 1548 1518 1487 1500 1513 1388 1263 1280
1849 1280 1297 1315 1332 1332 1332 1255 1178 1149 1120 1014 908 908 908 908 908 936 964 910 855 785 624 598 757 843 743 625 598 569 448 384 320 284 248 212
1845 212 176 116 56 -3 -63 -120 -177 -234 -291 -347 -403 -413 -423 -362 -301 -316 -332 -400 -468 -537 -605 -555 -504 -531 -558 -573 -589 -681 -773 -786 -798 -734 -669 -667 -665 -663
1841 -663 -661 -727 -794 -814 -834 -764 -695 -764 -833 -799 -765 -839 -912 -858 -804 -750 -696 -697 -699 -637 -668 -852 -852 -682 -697 -744 -699 -671 -643 -739 -835 -886 -936 -983 -1031 -1078
1837 -1078 -1125 -1204 -1283 -1316 -1349 -1361 -1374 -1463 -1553 -1588 -1623 -1612 -1601 -1621 -1640 -1660 -1680 -1680 -1679 -1679 -1679 -1678 -1678 -1678 -1677 -1694 -1711 -1728 -1745 -1760 -1775 -1698 -1621 -1658 -1696 -1733 -1771 -1677
$$ packed form
1863A0086j23O3j5j99n8n8p0o9p4p5p4p4j1j1j1j1kjm8m7q1q0n4k38k49k50j11j11k06k1j7
1859G700j7j10j09o3o4q4q4j30j31p3p4k7k8j36j36j36j36n9o0n9n9j17j16m0l9j12j12k19
1856E170k20k46k46p8p7j19j20j65j66r8r8j74j75q5q6q5q6k2k1r9r9n6n5j33j32K6K7n0n1
1853B181p6p6p7p6l6l6M1M1o2o2MLK9j56m8J36m7m7q2q2M6M6n8J27m2m3l0l1J3J3j25j25J7
1849A280J7J8J7%%p7p7k9k9j06j06%%%%K8K8n4n5p0j61k6J59Q6j00j18k7k9j21o4o4l6l6l6
1845B12l6o0o0n9o0n7n7n7n7n6n6j0j0O1O1j5j6o8o8o9o8N0N1k7k7j5j6r2r2j3j2O4O5KKK
1841f63Ko6o7k0k0P0O9o9o9L4L4p4p3N4N4N4N4jkO2l1j84%J70j5m7M5K8K8r6r6n1n0m7m8m7
1837a078m7p9p9l3l3j2j3q9r0l5l5J1J1k0j9k0k0%J%%J%%Jj7j7j7j7j5j5P7P7l7l8l7l8R4
$$ plain form
1833 -1677 -1584 -1644 -1705 -1708 -1710 -1713 -1715 -1716 -1717 -1717 -1718 -1750 -1783 -1815 -1847 -1918 -1989 -2060 -2131 -2188 -2245 -2302 -2359 -2362 -2366 -2369 -2372 -2432 -2492 -2553 -2613 -2736 -2860 -2830 -2799 -2748 -2697 -2645 -2594
1828 -2594 -2639 -2683 -2738 -2792 -2781 -2924 -2878 -2740 -2848 -2956 -3002 -3049 -3078 -2953 -2869 -2939 -2979 -2926 -2889 -2852 -2893 -2935 -2885 -2834 -2779 -2723 -2668 -2612 -2555 -2498 -2440 -2383
1825 -2383 -2422 -2461 -2407 -2354 -2277 -2200 -2224 -2249 -2213 -2330 -2401 -2318 -2323 -2328 -2278 -2228 -2221 -2215 -2209 -2203 -2111 -2020 -2082 -2144 -2174 -2205 -2189 -2174 -2120 -2066 -2104 -2143 -2128 -2114 -2191 -2269 -2313
1820 -2313 -2358 -2402 -2446 -2473 -2500 -2526 -2553 -2568 -2582 -2597 -2612 -2695 -2779 -2709 -2639 -2721 -2803 -2793 -2783 -2823 -2862 -2748 -2634 -2603 -2573 -2634 -2696 -2667 -2638 -2702 -2765 -2758 -2750 -2743 -2735
1816 -2735 -2679 -2622 -2612 -2601 -2682 -2763 -2752 -2740 -2730 -2719 -2709 -2698 -2663 -2628 -2592 -2557 -2591 -2625 -2658 -2692 -2653 -2615 -2576 -2537 -2586 -2635 -2591 -2548 -2587 -2627 -2621 -2614 -2599 -2584 -2581 -2578
1812 -2578 -2488 -2583 -2586 -2404 -2361 -2317 -2355 -2392 -2429 -2467 -2504 -2541 -2584 -2627 -2669 -2712 -2766 -2820 -2874 -2928 -2897 -2865 -2880 -2894 -2947 -3000 -2961 -2922 -2957 -2992 -2935 -2877 -3025 -3172
1808 -3172 -3154 -3136 -3241 -3162 -3232 -3303 -3274 -3246 -3264 -3281 -3253 -3224 -3196 -3168 -3200 -3232 -3264 -3296 -3340 -3384 -3345 -3306 -3134 -3116 -3227 -3337 -3308 -3278 -3249 -3219 -3240 -3260
1805 -3260 -3275 -3290 -3337 -3292 -3213 -3287 -3322 -3357 -3395 -3280 -3291 -3303 -3213 -3122 -3113 -3103 -3176 -3250 -3289 -3175 -3153 -3284 -3305 -3325 -3401 -3477 -3500 -3523 -3454 -3385 -3373 -3362 -3350
$$ packed form
1833a677R3o0o1lklkjj%jl2l3l2l2p1p1p1p1n7n7n7n7lmllo0o0o1o0j23j24L0L1N1N1N2N1
1828b594m5m4n5n4J1j43M6J38j08j08m6m7k9J25Q4p0m0N3L7L7m1m2N0N1N5N6N5N6N7N7N8N7
1825b383l9l9N4N3P7P7k4k5L6j17p1Q3nnN0N0POOOR2R1o2o2l0l1J6J5N4N4l8l9J5J4p7p8m4
1820b313m5m4m4k7k7k6k7j5j4j5j5q3q4P0P0q2q2J0J0m0l9J14J14L1L0o1o2K9K9o4o3PQPQ
1816b735N6N7J0J1q1q1J1J2J0J1J0J1L5L5L6L5l4l4l3l4L9L8L9L9m9m9M4M3l9m0OPJ5J5LL
1812b578R0r5lJ82M3M4l8l7l7l8l7l7m3m3m2m3n4n4n4n4L1L2j5j4n3n3L9L9l5l5N7N8j48j47
1808c172J8J8j05P9p0p1K9K8j8j7K8K9K8K8l2l2l2l2m4m4L9L9J72J8j11j10K9L0K9L0k1k0
1805c260j5j5m7M5P9p4l5l5l8J15j1j2R0R1RJ0p3p4l9J14K2j31k1k0p6p6k3k3O9O9J2J1J2
$$ plain form
1801 -3350 -3338 -3297 -3256 -3308 -3359 -3402 -3444 -3395 -3253 -3216 -3334 -3353 -3219 -3164 -3108 -3136 -3163 -3157 -3151 -3141 -3284 -3362 -3285 -3259 -3232 -3168 -3104 -3036 -3122 -3252 -3228 -3208 -3188
1797 -3188 -3117 -3047 -3121 -3195 -3257 -3164 -3159 -3153 -3152 -3151 -3242 -3334 -3273 -3211 -3196 -3181 -3133 -3084 -3127 -3171 -3187 -3202 -3218 -3234 -3333 -3432 -3439 -3354 -3298 -3396 -3452 -3353 -3296 -3393 -3440 -3487 -3427
1793 -3427 -3367 -3353 -3339 -3310 -3281 -3344 -3407 -3361 -3315 -3362 -3408 -3478 -3547 -3524 -3502 -3416 -3330 -3336 -3342 -3360 -3378 -3396 -3414 -3435 -3456 -3477 -3498 -3448 -3399 -3396 -3393 -3386 -3380 -3281 -3182 -3207 -3233
1789 -3233 -3258 -3283 -3281 -3279 -3277 -3275 -3286 -3298 -3217 -3136 -3146 -3156 -3166 -3176 -3179 -3181 -3183 -3186 -3096 -3006 -3070 -3134 -3174 -3215 -3164 -3112 -3098 -3084 -3070 -3056 -3121 -3186 -3251 -3316 -3308 -3300 -3292 -3284 -3319 -3354
1784 -3354 -3343 -3332 -3378 -3424 -3377 -3331 -3381 -3432 -3482 -3533 -3484 -3436 -3541 -3647 -3642 -3638 -3680 -3722 -3704 -3685 -3713 -3741 -3769 -3797 -3779 -3761 -3806 -3851 -3850 -3849 -3900 -3951 -3910 -3869 -3908
1780 -3908 -3948 -3987 -4027 -4093 -4160 -4073 -3985 -3960 -3935 -3911 -3886 -3835 -3784 -3825 -3867 -3929 -3990 -4006 -4022 -3983 -3945 -3953 -3961 -4027 -4092 -4065 -4038 -4006 -3975 -3954 -3934 -3891 -4032 -4081 -3946
1776 -3946 -3966 -3986 -3995 -4004 -4012 -4020 -4028 -4036 -4077 -4117 -4158 -4199 -4202 -4206 -4233 -4075 -4017 -4144 -4155 -4166 -4230 -4293 -4265 -4236 -4251 -4267 -4190 -4113 -4157 -4201 -4152 -4104 -4199 -4295 -4237 -4179 -4221
1772 -4221 -4264 -4307 -4349 -4380 -4411 -4350 -4289 -4297 -4306 -4314 -4322 -4311 -4301 -4382 -4463 -4442 -4421 -4401 -4380 -4387 -4395 -4403 -4411 -4416 -4420 -4425 -4430 -4428 -4427 -4426 -4425 -4414 -4403 -4299 -4195 -4188 -4181 -4173 -4166 -4141 -4116 -4184 -4251
$$ packed form
1801c350J2M1M1n2n1m3m2M9J42L7j18j9J34N5N6k8k7OOJ0j43p8P7K6K7O4O4O8q6j30K4K0K0
1797c188P1P0p4p4o2R3NOJJr1r2O1O2J5J5M8M9m3m4j6j5j6j6r9r9pQ5N6r8n6R9N7r7m7m7O0
1793c427O0J4J4K9K9o3o3M6M6m7m6p0o9K3K2Q6Q6ooj8j8j8j8k1k1k1k1N0M9LLPOR9R9k5k6
1789c233k5k5KKKKj1j2Q1Q1j0j0j0j0lkklR0R0o4o4m0m1N1N2J4J4J4J4o5o5o5o5QQQQl5l5
1784c354J1J1m6m6M7M6n0n1n0n1M9M8j05j06NMm2m2J8J9k8k8k8k8J8J8m5m5JJn1n1M1M1l9
1780c908m0l9m0o6o7Q7Q8K5K5K4K5N1N1m1m2o2o1j6j6L9L8qqo6o5K7K7L2L1K1K0M3j41m9J35
1776c946k0k0rrqqqqm1m0m1m1lmk7J58N8j27j1j1o4o3K8K9j5j6P7P7m4m4M9M8r5r6N8N8m2
1772d221m3m3m2l1l1O1O1qrqqJ1J0q1q1K1K1K0K1pqqqnmnnKJJJJ1J1J04J04PPQPK5K5o8o7
$$ plain form
1767 -4251 -4290 -4328 -4356 -4383 -4424 -4280 -4137 -4178 -4213 -4248 -4295 -4342 -4379 -4415 -4360 -4304 -4300 -4297 -4293 -4289 -4295 -4300 -4305 -4310 -4327 -4344 -4361 -4377 -4339 -4301 -4263 -4225 -4256 -4287 -4341 -4211 -4092
1763 -4092 -4158 -4201 -4244 -4236 -4229 -4303 -4376 -4517 -4474 -4442 -4410 -4385 -4361 -4336 -4312 -4270 -4229 -4198 -4168 -4077 -4170 -4262 -4171 -4167 -4163 -4147 -4132 -4064 -3997 -4145 -4293 -4293 -4294 -4295 -4295 -4211 -4127
1758 -4127 -4197 -4267 -4248 -4229 -4210 -4191 -4182 -4172 -4163 -4153 -4154 -4154 -4155 -4155 -4200 -4245 -4289 -4334 -4255 -4176 -4085 -4179 -4201 -4224 -4350 -4477 -4433 -4390 -4439 -4488 -4479 -4470 -4577 -4499 -4414 -4513 -4497
1754 -4497 -4482 -4460 -4439 -4417 -4396 -4412 -4429 -4353 -4278 -4314 -4350 -4386 -4422 -4479 -4536 -4440 -4343 -4320 -4296 -4353 -4411 -4507 -4418 -4375 -4425 -4515 -4513 -4430 -4440 -4383 -4418 -4459 -4407 -4452 -4497
1750 -4497 -4536 -4575 -4506 -4437 -4460 -4484 -4478 -4473 -4467 -4462 -4441 -4421 -4400 -4380 -4324 -4269 -4306 -4343 -4349 -4354 -4267 -4180 -4205 -4229 -4254 -4278 -4338 -4397 -4457 -4516 -4506 -4496 -4441 -4385 -4363 -4341 -4396
1746 -4396 -4451 -4437 -4423 -4455 -4487 -4444 -4401 -4405 -4408 -4380 -4353 -4370 -4479 -4583 -4502 -4423 -4344 -4314 -4284 -4362 -4440 -4387 -4334 -4281 -4229 -4252 -4275 -4298 -4321 -4347 -4373 -4399 -4425 -4428 -4431
1742 -4431 -4440 -4449 -4365 -4374 -4441 -4323 -4263 -4295 -4366 -4437 -4381 -4234 -4142 -4234 -4304 -4374 -4347 -4321 -4348 -4376 -4441 -4323 -4189 -4239 -4365 -4398 -4340 -4282 -4356 -4431 -4398 -4365 -4332
1738 -4332 -4299 -4333 -4368 -4402 -4437 -4439 -4440 -4396 -4352 -4444 -4536 -4552 -4567 -4539 -4511 -4591 -4671 -4732 -4794 -4845 -4895 -4933 -4786 -4747 -4893 -4881 -4870 -4794 -4717 -4765 -4812 -4860 -4907 -4847
$$ packed form
1767d251l9l8k8k7m1J44J43m1l5l5m7m7l7l6N5N6MLMMonnnj7j7j7j6L8L8L8L8l1l1n4J30J19
1763d092o6m3m3QPp4p3j41M3L2L2K5K4K5K4M2M1L1L0R1r3r2R1MMJ6J5O8O7j48j48%jj%Q4Q4
1758d127p0p0J9J9J9J9RJ0RJ0j%j%m5m5m4m5P9P9R1r4k2k3j26j27M4M3m9m9RRj07P8Q5r9J6
1754d497J5K2K1K2K1j6j7P6P5l6l6l6l6n7n7R6R7K3K4n7n8r6Q9M3n0r0KQ3j0N7l5m1N2m5m5
1750d497l9l9O9O9k3k4ONONK1K0K1K0N6N5l7l7onQ7Q7k5k4k5k4o0n9o0n9J0J0N5N6K2K2n5
1746d396n5J4J4l2l2M3M3mlK8K7j7j09j04Q1P9P9L0L0p8p8N3N3N3N2k3k3k3k3k6k6k6k6ll
1742d431rrQ4ro7J18O0l2p1p1N6J47R2r2p0p0K7K6k7k8o5J18J34n0j26l3N8N8p4p5L3L3L3
1738d332L3l4l5l4l5kjM4M4r2r2j6j5K8K8q0q0o1o2n1n0l8J47L9j46J2J1P6P7m8m7m8m7O0
$$ plain form
1734 -4847 -4787 -4740 -4786 -4904 -4837 -4803 -4769 -4805 -4841 -4836 -4832 -4769 -4798 -4880 -4776 -4747 -4718 -4775 -4832 -4898 -4810 -4751 -4785 -4810 -4743 -4734 -4725 -4679 -4632 -4585 -4539 -4539 -4540 -4648 -4756
1730 -4756 -4674 -4592 -4618 -4643 -4639 -4634 -4630 -4625 -4608 -4591 -4707 -4669 -4600 -4530 -4529 -4527 -4540 -4554 -4614 -4673 -4625 -4576 -4481 -4387 -4455 -4524 -4577 -4538 -4502 -4620 -4641 -4571 -4593 -4462 -4431 -4492
1726 -4492 -4515 -4447 -4349 -4405 -4397 -4389 -4390 -4392 -4410 -4427 -4445 -4463 -4412 -4360 -4386 -4411 -4470 -4529 -4542 -4555 -4571 -4587 -4557 -4526 -4592 -4658 -4724 -4790 -4781 -4772 -4685 -4599 -4578 -4556 -4535 -4513 -4525
1722 -4525 -4537 -4549 -4561 -4552 -4543 -4534 -4525 -4539 -4553 -4568 -4582 -4571 -4561 -4550 -4540 -4550 -4560 -4493 -4425 -4415 -4404 -4394 -4383 -4411 -4439 -4390 -4341 -4321 -4300 -4280 -4259 -4257 -4254 -4252 -4250 -4297 -4345 -4393
1718 -4393 -4441 -4423 -4405 -4311 -4216 -4128 -4039 -4058 -4077 -4111 -4145 -4257 -4368 -4349 -4329 -4203 -4076 -4123 -4170 -4217 -4264 -4387 -4509 -4523 -4538 -4499 -4461 -4376 -4292 -4354 -4417
1714 -4417 -4340 -4264 -4265 -4266 -4344 -4422 -4383 -4344 -4414 -4483 -4435 -4388 -4341 -4294 -4235 -4177 -4257 -4337 -4410 -4484 -4626 -4584 -4477 -4554 -4608 -4570 -4563 -4464 -4385 -4490 -4486 -4481 -4489 -4496 -4395 -4293
1710 -4293 -4267 -4333 -4478 -4439 -4359 -4464 -4397 -4331 -4446 -4560 -4526 -4493 -4536 -4579 -4613 -4646 -4680 -4713 -4659 -4604 -4549 -4494 -4606 -4719 -4693 -4667 -4634 -4602 -4647 -4692 -4733
1706 -4733 -4775 -4824 -4689 -4589 -4673 -4642 -4610 -4575 -4540 -4505 -4470 -4556 -4642 -4590 -4538 -4522 -4506 -4491 -4475 -4502 -4529 -4504 -4480 -4462 -4353 -4259 -4350 -4414 -4324 -4332 -4340 -4367 -4393 -4426
$$ packed form
1734d847O0M7m6j18O7L4L4l6l6NMO3k9q2J04K9K9n7n7o6Q8N9l4k5O7RRM6M7M7M6%jj08j08
1730d756Q2Q2k6k5MNMNJ7J7j16L8O9P0JKj3j4o0n9M8M9R5R4o8o9n3L9L6j18k1P0k2J31L1o1
1726d492k3O8R8n6QQjkj8j7j8j8N1N2k6k5n9n9j3j3j6j6L0L1o6o6o6o6RRQ7Q6K1K2K1K2j2
1722d525j2j2j2RRRRj4j4j5j4J1J0J1J0j0j0O7O8J0J1J0J1k8k8M9M9K0K1K0K1KLKKm7m8m8
1718d393m8J8J8R4R5Q8Q9j9j9l4l4j12j11J9K0J26J27m7m7m7m7j23j22j4j5L9L8Q5Q4o2o3
1714d417P7P6jjp8p8L9L9p0o9M8M7M7M7N9N8q0q0p3p4j42M2J07p7n4L8PR9P9j05MNqpJ01J02
1710d293K6o6j45L9Q0j05O7O6j15j14L4L3m3m3l4l3l4l3N4N5N5N5j12j13K6K6L3L2m5m5m1
1706d733m2m9J35J00q4L1L2L5L5L5L5q6q6N2N2J6J6J5J6k7k7K5K4J8J09R4r1o4R0qqk7k6l3
$$ plain form
1703 -4426 -4458 -4394 -4422 -4484 -4393 -4339 -4284 -4297 -4309 -4214 -4119 -4187 -4255 -4295 -4242 -4149 -4209 -4221 -4141 -4180 -4126 -4093 -4152 -4163 -4175 -4072 -4123 -4260 -4182 -4175 -4260 -4202 -4144 -4231
1699 -4231 -4317 -4358 -4398 -4327 -4256 -4293 -4329 -4334 -4338 -4297 -4255 -4279 -4303 -4286 -4423 -4479 -4536 -4525 -4514 -4487 -4460 -4432 -4405 -4384 -4363 -4449 -4536 -4520 -4503 -4595 -4686 -4693 -4700 -4631 -4561 -4556
1694 -4556 -4550 -4536 -4521 -4707 -4739 -4673 -4699 -4624 -4641 -4771 -4809 -4767 -4725 -4678 -4630 -4680 -4729 -4733 -4736 -4770 -4804 -4761 -4717 -4738 -4758 -4732 -4707 -4724 -4741 -4774 -4714 -4626 -4691 -4716 -4648
1690 -4648 -4659 -4670 -4675 -4680 -4708 -4736 -4764 -4792 -4772 -4752 -4732 -4712 -4670 -4628 -4586 -4544 -4614 -4685 -4586 -4487 -4480 -4473 -4604 -4643 -4522 -4555 -4603 -4651 -4656 -4661 -4620 -4578 -4634 -4689 -4745 -4800
1686 -4800 -4737 -4675 -4612 -4549 -4575 -4601 -4627 -4654 -4663 -4673 -4668 -4570 -4467 -4517 -4533 -4457 -4380 -4395 -4414 -4341 -4283 -4378 -4512 -4431 -4340 -4403 -4366 -4329 -4325 -4321 -4317 -4313 -4321 -4328 -4336 -4343 -4359 -4375
1682 -4375 -4391 -4407 -4363 -4320 -4180 -4194 -4316 -4285 -4350 -4415 -4351 -4287 -4300 -4313 -4394 -4474 -4448 -4421 -4392 -4363 -4380 -4398 -4423 -4448 -4427 -4407 -4376 -4346 -4392 -4439 -4400 -4360 -4398
1678 -4398 -4436 -4430 -4424 -4419 -4413 -4377 -4341 -4413 -4485 -4506 -4527 -4440 -4353 -4387 -4420 -4499 -4578 -4540 -4502 -4541 -4580 -4559 -4538 -4471 -4404 -4440 -4477 -4437 -4397 -4470 -4543 -4539 -4443 -4376 -4463 -4534 -4605
1674 -4605 -4662 -4718 -4698 -4677 -4673 -4669 -4665 -4660 -4695 -4729 -4625 -4521 -4575 -4630 -4569 -4693 -4758 -4639 -4635 -4631 -4651 -4670 -4735 -4801 -4780 -4760 -4731 -4888 -5041 -5010 -4956 -4901 -4906 -4911 -4916 -4921
$$ packed form
1703d426l2O4k8o2R1N4N5j3j2R5R5o8o8m0N3R3o0j2Q0l9N4L3n9j1j2J03n1j37P8Pq5N8N8q7
1699d231q6m1m0P1P1l7l6nmM1M2k4k4J7j37n6n7J1J1K7K7K8K7K1K1q6q7J6J7r2r1ppO9P0N
1694d556OJ4J5j86l2O6k6P5j7j30l8M2M2M7M8n0m9mll4l4M3M4k1k0K6K5j7j7l3O0Q8o5k5O8
1690d648j1j1nnk8k8k8k8K0K0K0K0M2M2M2M2p0p1R9R9PPj31l9J21l3m8m8nnM1M2n6n5n6n5
1686d800O3O2O3O3k6k6k6k7rj0NR8J03n0j6P6P7j5j9P3N8r5j34Q1R1o3L7L7MMMMqpqpj6j6
1682d375j6j6M4M3J40j4j22L1o5o5O4O4j3j3q1q0K6K7K9K9j7j8k5k5K1K0L1L0m6m7L9M0l8
1678d398l8OONOL6L6p2p2k1k1Q7Q7l4l3p9p9L8L8l9l9K1K1O7O7l6l7M0M0p3p3MR6O7q7p1p1
1674d605n7n6K0K1MMMNl5l4J04J04n4n5O1j24o5J19MMk0j9o5o6K1K0K9j57j53L1N4N5nnnn
$$ plain form
1670 -4921 -4835 -4748 -4800 -4852 -4870 -4888 -4841 -4793 -4687 -4766 -4848 -4930 -4922 -4913 -4905 -4897 -4852 -4807 -4762 -4717 -4698 -4680 -4584 -4489 -4595 -4702 -4731 -4761 -4754 -4747 -4740 -4733 -4770 -4807 -4852 -4712
1666 -4712 -4640 -4753 -4750 -4748 -4723 -4698 -4812 -4925 -4934 -4942 -4904 -4866 -4809 -4752 -4741 -4730 -4668 -4606 -4713 -4820 -4775 -4729 -4684 -4638 -4589 -4539 -4629 -4718 -4799 -4879 -4790 -4702 -4761 -4819
1662 -4819 -4832 -4844 -4782 -4719 -4703 -4687 -4637 -4588 -4615 -4642 -4679 -4716 -4676 -4636 -4654 -4671 -4611 -4552 -4617 -4682 -4609 -4536 -4561 -4586 -4564 -4543 -4470 -4397 -4416 -4435 -4394 -4353 -4404 -4455
1658 -4455 -4521 -4588 -4608 -4628 -4609 -4590 -4525 -4460 -4456 -4453 -4449 -4446 -4451 -4456 -4462 -4467 -4461 -4454 -4448 -4442 -4409 -4377 -4344 -4312 -4318 -4324 -4330 -4336 -4321 -4307 -4292 -4278 -4292 -4306 -4321 -4335 -4333 -4330 -4420 -4510 -4417 -4324 -4324 -4323
1653 -4323 -4297 -4270 -4330 -4390 -4392 -4301 -4129 -4111 -4039 -3968 -3906 -3844 -3894 -3944 -3995 -4045 -4162 -4279 -4395 -4512 -4555 -4598 -4687 -4775 -4703 -4631 -4652 -4672 -4754 -4835 -4871 -4907
1649 -4907 -4892 -4878 -4864 -4849 -4809 -4769 -4728 -4688 -4686 -4683 -4681 -4679 -4731 -4782 -4834 -4885 -4890 -4895 -4900 -4904 -4862 -4820 -4824 -4827 -4820 -4813 -4652 -4491 -4456 -4421 -4405 -4605 -4651 -4482 -4356 -4229 -4116
1645 -4116 -4003 -3674 -3346 -3307 -3268 -3217 -3351 -3431 -3511 -3756 -4002 -4202 -4402 -4510 -4618 -4692 -4767 -4887 -5008 -4983 -4959 -4934 -4910 -4958 -5006 -5042 -5078 -5080 -4898
1642 -4898 -4715 -4717 -4861 -5006 -5008 -5010 -5015 -5021 -5037 -4870 -4871 -4873 -4863 -4853 -4821 -4789 -4757 -4725 -4766 -4807 -4756 -4705 -4653 -4601 -4703 -4804 -4780 -4756 -4674 -4592 -4574 -4372 -4181 -3989
$$ packed form
1670d921Q6Q7n2n2j8j8M7M8J06p9q2q2QRQQM5M5M5M5J9J8R6R5j06j07k9l0PPPPl7l7m5J40
1666d712P2j13LKK5K5j14j13rqL8L8N7N7J1J1O2O2j07j07M5M6M5M6M9N0r0q9q1q0Q9Q8n9n8
1662d819j3j2O2O3J6J6N0M9k7k7l7l7M0M0j8j7O0N9o5o5P3P3k5k5K2K1P3P3j9j9M1M1n1n1
1658d455o6o7k0k0J9J9O5O5MLMLnnonOPOOL3L2L3L2ooooJ5J4J5J4j4j4j5j4KLr0r0R3R3%J
1653d323K6K7o0o0kR1J72J8P2P1O2O2n0n0n1n0j17j17j16j17m3m3q9q8P2P2k1k0q2q1l6l6
1649d907J5J4J4J5M0M0M1M0KLKKn2n1n2n1nnnmM2M2mlPPJ61J61L5L5J6k00m6J69J26J27J13
1645d116J13L29L28L9L9N1j34q0q0k45k46k00k00j08j08p4p5j20j21K5K4K5K4m8m8l6l6kJ82
1642d898J83kj44j45kknoj6J67jkJ0J0L2L2L2L2m1m1N1N1N2N2j02j01K4K4Q2Q2J8K02J91J92
$$ plain form
1638 -3989 -3682 -3374 -3117 -3044 -3082 -3121 -3263 -3405 -3638 -3870 -4149 -4427 -4500 -4573 -4600 -4627 -4700 -4773 -4692 -4611 -4646 -4681 -4716 -4751 -4760 -4769 -4870 -4971 -4998 -5024
1634 -5024 -5004 -4984 -4903 -4822 -4833 -4844 -4812 -4781 -4704 -4627 -4709 -4791 -4720 -4648 -4641 -4634 -4673 -4712 -4718 -4724 -4684 -4645 -4640 -4635 -4630 -4626 -4531 -4435 -4340 -4245 -4173 -4101 -3983 -3865 -3798 -3732 -3758
1630 -3758 -3784 -3764 -3744 -3868 -3992 -4077 -4255 -4427 -4446 -4395 -4436 -4508 -4426 -4488 -4642 -4632 -4623 -4623 -4716 -4705 -4540 -4606 -4672 -4559 -4599 -4736 -4780 -4747 -4715 -4620 -4524
1627 -4524 -4537 -4549 -4537 -4525 -4513 -4500 -4495 -4489 -4483 -4478 -4432 -4386 -4340 -4294 -4363 -4433 -4456 -4479 -4459 -4439 -4496 -4553 -4595 -4636 -4631 -4627 -4546 -4465 -4461 -4456 -4398 -4340 -4359 -4378 -4420 -4461 -4456 -4452 -4398
1622 -4398 -4344 -4336 -4329 -4347 -4365 -4383 -4401 -4364 -4328 -4337 -4347 -4426 -4506 -4448 -4389 -4369 -4349 -4375 -4401 -4395 -4390 -4307 -4224 -4240 -4255 -4194 -4132 -4192 -4251 -4255 -4259 -4358 -4303 -4288 -4274 -4208 -4143 -4078
1618 -4078 -4013 -4036 -4059 -4082 -4105 -4068 -4030 -4101 -4171 -4079 -3988 -3856 -3878 -3970 -4061 -4076 -4244 -4275 -4305 -4294 -4128 -4074 -4020 -4095 -4170 -4135 -4101 -4066 -4031 -3978 -3925 -3872 -3819
1614 -3819 -3719 -3619 -3509 -3400 -3202 -2851 -2434 -2018 -1502 -771 34 932 1999 2851 3338 3548 3312 2799 2127 1300 319 -662 -1549
1611 -1549 -2344 -2844 -3067 -3224 -3290 -3462 -3541 -3621 -3793 -3795 -3889 -3989 -3997 -4063 -4129 -4190 -4250 -4288 -4325 -4363 -4400 -4388 -4377 -4371 -4365 -4367 -4461 -4590 -4565 -4563 -4560 -4548 -4536 -4546
$$ packed form
1638c989L07L08K57P3l8l9j42j42k33k32k79k78p3p3k7k7p3p3Q1Q1l5l5l5l5rrj01j01k7k6
1634e024K0K0Q1Q1j1j1L2L1P7P7q2q2P1P2PPl9l9ooM0L9NNNMR5R6R5R5P2P2J18J18O7O6k6
1630c758k6K0K0j24j24q5j78j72j9N1m1p2Q2o2j54J0R%r3J1J65o6o6J13m0j37m4L3L2R5R6
1627d524j3j2J2J2J2J3NOONM6M6M6M6o9p0k3k3K0K0n7n7m2m1NMQ1Q1MNN8N8j9j9m2m1NMN4
1622d398N4QPj8j8j8j8L7L6rj0p9q0N8N9K0K0k6k6ONQ3Q3j6j5O1O2o0n9mmr9N5J5J4O6O5O5
1618d078O5k3k3k3k3L7L8p1p0R2R1J32k2r2r1j5j68l1l0J1J66N4N4p5p5L5L4L5L5N3N3N3N3
1614c819J00J00J10J09J98L51M17M16N16P31Q05Q98J067Q52M87K10k36n13o72q27r81r81q87
1611a549p95n00k23j57o6j72p9q0j72kr4j00qo6o6o1o0l8l7l8l7J2J1OOkr4j29K5KLJ2J2j0
$$ plain form
1608 -4546 -4555 -4610 -4666 -4764 -4863 -4854 -4845 -4890 -4935 -4810 -4686 -4764 -4843 -4906 -4877 -4775 -4828 -4881 -4841 -4884 -4835 -4832 -4830 -4770 -4711 -4651 -4592 -4588 -4584 -4580 -4576 -4567 -4559 -4550 -4541 -4583 -4625 -4580 -4535
1603 -4535 -4585 -4480 -4376 -4425 -4391 -4357 -4225 -4093 -4008 -3923 -3787 -3496 -3243 -2991 -2539 -2086 -1608 -1283 -1232 -1334 -1540 -1746 -2055 -2363 -2662
1600 -2662 -2962 -3342 -3722 -4026 -4144 -4152 -4159 -4230 -4300 -4279 -4257 -4333 -4409 -4485 -4561 -4682 -4804 -4834 -4864 -4835 -4806 -4772 -4737 -4803 -4776 -4697 -4803 -4846 -4888 -4943 -4997
1597 -4997 -4970 -4943 -4917 -4890 -4920 -4949 -4978 -5008 -4948 -4888 -4920 -4952 -4960 -4969 -4931 -4893 -4916 -4938 -4915 -4891 -4834 -4777 -4767 -4756 -4733 -4709 -4732 -4755 -4710 -4665 -4511 -4541 -4672 -4712
1593 -4712 -4659 -4699 -4818 -4753 -4699 -4738 -4728 -4717 -4713 -4708 -4650 -4592 -4626 -4661 -4626 -4591 -4602 -4613 -4639 -4665 -4644 -4624 -4599 -4575 -4551 -4526 -4598 -4670 -4649 -4629 -4570 -4512 -4518 -4431 -4392
1589 -4392 -4539 -4633 -4542 -4530 -4518 -4586 -4654 -4603 -4552 -4501 -4450 -4393 -4336 -4279 -4222 -4268 -4313 -4353 -4393 -4369 -4253 -4177 -4286 -4386 -4486 -4678 -4870 -4986 -4917 -4906
1585 -4906 -4896 -4828 -4760 -4785 -4809 -4692 -4575 -4612 -4649 -4619 -4589 -4559 -4528 -4604 -4679 -4662 -4646 -4621 -4597 -4727 -4856 -4838 -4819 -4801 -4782 -4840 -4897 -4862 -4828 -4849 -4870 -4799
1582 -4799 -4727 -4769 -4810 -4862 -4731 -4735 -4740 -4687 -4634 -4551 -4468 -4430 -4393 -4422 -4452 -4573 -4695 -4694 -4692 -4749 -4621 -4620 -4619 -4652 -4686 -4613 -4541 -4560 -4580 -4593 -4605 -4618 -4631 -4600 -4568
$$ packed form
1608d546rn5n6r8r9RRm5m5J25J24p8p9o3K9J02n3n3M0m3M9LKO0N9O0N9MMMMRQRRm2m2M5M5
1603d535n0J05J04m9L4L4J32J32Q5Q5J36K91K53K52M52M53M78L25N1j02k06k06l09l08k99
1600b662l00l80l80l04j18qpp1p0K1K2p6p6p6p6j21j22l0l0K9K9L4L5o6K7P9j06m3m2n5n4
1597d997K7K7K6K7l0k9k9l0O0O0l2l2qrL8L8k3k2K3K4N7N7J0J1K3K4k3k3M5M5J54l0j31m0
1593d712N3m0j19O5N4l9J0J1MNN8N8l4l5L5L5j1j1k6k6K1K0K5K4K4K5p2p2K1K0N9N8oQ7L9
1589d392j47r4R1J2J2o8o8N1N1N1N1N7N7N7N7m6m5m0m0K4J16P6j09j00j00j92j92j16O9J1
1585d906J0O8O8k5k4J17J17l7l7L0L0L0L1p6p5J7J6K5K4j30j29J8J9J8J9n8n7L5L4k1k1P1
1582d799P2m2m1n2J31mnN3N3Q3Q3L8L7k9l0j21j22JKn7J28JJl3l4P3P2j9k0j3j2j3j3L1L2
$$ plain form
1578 -4568 -4537 -4506 -4524 -4543 -4562 -4580 -4579 -4578 -4576 -4575 -4613 -4651 -4643 -4635 -4631 -4627 -4634 -4457 -4467 -4477 -4476 -4474 -4403 -4331 -4259 -4187 -4204 -4221 -4145 -4069 -3948 -3828 -3984 -4140 -4163 -4186 -4302
1574 -4302 -4418 -4405 -4393 -4380 -4368 -4464 -4560 -4503 -4445 -4435 -4426 -4370 -4314 -4314 -4315 -4218 -4121 -4065 -3918 -3735 -3707 -3534 -3361 -3290 -3219 -3230 -3241 -3344 -3447 -3576 -3706
1570 -3706 -3836 -3966 -3942 -3918 -3893 -3869 -3931 -3994 -3964 -3934 -3963 -3993 -4023 -4052 -4059 -4065 -4072 -4078 -4126 -4173 -4128 -4083 -4137 -4192 -4247 -4302 -4256 -4211 -4257 -4304 -4372 -4440 -4415 -4391 -4373
1566 -4373 -4355 -4245 -4135 -3934 -3734 -3687 -3641 -3568 -3496 -3424 -3352 -3451 -3550 -3433 -3317 -3306 -3294 -3375 -3456 -3453 -3449 -3445 -3442 -3475 -3508 -3542 -3575 -3574 -3572 -3571 -3570 -3567 -3565 -3557 -3548 -3583 -3524
1562 -3524 -3432 -3492 -3504 -3515 -3527 -3538 -3559 -3427 -3329 -3323 -3269 -3214 -3258 -3302 -3269 -3235 -3294 -3354 -3387 -3421 -3455 -3488 -3453 -3417 -3381 -3346 -3334 -3322 -3157 -2991 -3037 -3083 -3037
1558 -3037 -2990 -2900 -2809 -2718 -2628 -2631 -2635 -2535 -2435 -2444 -2269 -2044 -1819 -1567 -1315 -1156 -996 -837 -678 -611 -544 -504 -464 -701 -938 -1163 -1388 -1398
1555 -1398 -1408 -1391 -1374 -1499 -1625 -1678 -1547 -1428 -1309 -1078 -847 -770 -693 -592 -492 -484 -477 -515 -553 -591 -630 -590 -550 -511 -471 -343 -215 -87 40
1551 40 169 297 426 555 797 1039 1281 1524 1723 1921 2028 2135 2374 2613 2853 3092 3357 3622 3887 4152 4442 4731 4929 5127
$$ packed form
1578d568L1L1j8j9j9j8JJKJl8l8QQMMpJ77j0j0JKP1P2P2P2j7j7P6P6J21J20j56j56k3k3j16
1574d302j16J3J2J3J2r6r6N7N8J0RN6N6%jR7R7N6J47J83K8J73J73P1P1j1j1j03j03j29j30
1570c706j30j30K4K4K5K4o2o3L0L0k9l0l0k9popom8m7M5M5n4n5n5n5M6M5m6m7o8o8K5K4J8
1566d373J8J10J10K01K00M7M6P3P2P2P2r9r9J17J16J1J2q1q1LMMLl3l3l4l3JKJJLKQRl5N9
1562c524R2o0j2j1j2j1k1J32R8ON4N5m4m4L3L4n9o0l3l4l4l3L5L6L6L5J2J2J65J66m6m6M6
1558c037M7R0R1R1R0lmJ00J00rJ75K25K25K52K52J59J60J59J59O7O7M0M0k37k37k25k25j0
1555a398j0J7J7j25j26n3J31J19J19K31K31P7P7J01J00QPl8l8l8l9M0M0L9M0J28J28J28J27
1551D0J29J28J29J29K42K42K42K43J99J98J07J07K39K39K40K39K65K65K65K65K90K89J98J98
$$ plain form
1549 5127 5512 5898 6283 6669 7162 7655 8149 8642 9084 9526 10122 10718 11253 11788 12476 13164 14035 14906 15789 16671 17583 18679 19836
1546 19836 20994 22127 23445 24886 26327 27991 29840 31758 33860 36045 38230 40804 43562 46543 49831 53389 57255
1544 57255 61586 66225 71403 77257 83722 91111 99538 109010 119510 130687 142894 156516 171788 189338 209909
1542 209909 234603 264542 301064 346092 401887 473079 565867 687740 843390 1033001 1238669 1410092 1518330
1541 1518330 1566155 1546981 1466206 1334303 1169630 987422 789010 607394 474023 384027 323193 280632
1540 280632 249822 226703 208552 193908 181323 170030 159775 150443 141932 133729 126002 118830 112070 105741 100120
1538 100120 95176 90692 86516 82720 79355 76140 72925 69591 65949 61871 57362 52853 48529 44607 40992 37847 35009
1536 35009 32402 30102 28095 26272 24609 23130 21748 20550 19391 18233 17164 16094 15191 14287 13384 12481 11747 11012 10324
$$ packed form
1549E127L85L86L85L86M93M93M94M93M42M42N96N96N35N35O88O88Q71Q71Q83Q82R12J096J157
1546A9836J158J133J318J441J441J664J849J918K102K185K185K574K758K981L288L558L866
1544E7255M331M639N178N854O465P389Q427R472J0500J1177J2207J3622J5272J7550K0571
1542B09909K4694K9939L6522M5028N5795P1192R2788J21873J55650J89611K05668J71423J08238
1541A518330M7825j9174q0775j31903j64673j82208j98412j81616j33371q9996o0834m2561
1540B80632l0810k3119j8151j4644j2585j1293j0255r332q511q203p727p172o760o329n621
1538A00120m944m484m176l796l365l215l215l334l642m078m509m509m324l922l615l145k838
1536C5009k607k300k007j823j663j479j382j198j159j158j069j070r03r04r03r03p34p35o88
$$ plain form
1534 10324 9636 9014 8391 7845 7300 6771 6241 5539 5145 4760 4375 4009 3643 3167 2690 2290 1890 1501 1112 726 525 248 -28
1531 -28 -185 -343 -529 -714 -1004 -1108 -1234 -1360 -1551 -1742 -1916 -2090 -2217 -2345 -2495 -2644 -2794 -2943 -2982 -3021 -3280 -3538 -3688 -3654 -3646
1528 -3646 -3639 -3680 -3722 -3656 -3590 -3525 -3460 -3394 -3329 -3392 -3455 -3517 -3580 -3556 -3533 -3509 -3486 -3493 -3500 -3461 -3422 -3427 -3431 -3513 -3595 -3707 -3819 -3855 -3890 -3841 -3792 -3850 -3909 -3809 -3710
1524 -3710 -3749 -3788 -3826 -3864 -3856 -3847 -3851 -3856 -3860 -3864 -3964 -4064 -4118 -4172 -4264 -4355 -4370 -4384 -4347 -4311 -4407 -4349 -4347 -4345 -4333 -4322 -4351 -4380 -4409 -4438 -4451 -4464 -4477 -4490 -4435 -4379 -4432
1520 -4432 -4576 -4667 -4604 -4634 -4663 -4590 -4517 -4552 -4587 -4616 -4645 -4674 -4703 -4689 -4674 -4737 -4799 -4847 -4894 -4802 -4711 -4798 -4886 -4873 -5015 -5072 -4915 -4790 -4757 -4787 -4817 -4745
1516 -4745 -4673 -4497 -4322 -4223 -4124 -4028 -3932 -3975 -4017 -4018 -4019 -4067 -4114 -4113 -4112 -4111 -4110 -4089 -4067 -4185 -4302 -4280 -4257 -4312 -4366 -4412 -4458 -4457 -4457 -4425 -4393 -4370 -4348 -4271 -4347 -4423
1512 -4423 -4346 -4372 -4399 -4323 -4247 -4113 -3979 -3998 -4018 -3939 -3860 -3827 -3794 -3941 -4088 -4189 -4289 -4410 -4531 -4606 -4681 -4664 -4648 -4585 -4523 -4595 -4668 -4648 -4628 -4621 -4614
1509 -4614 -4606 -4599 -4561 -4523 -4577 -4631 -4676 -4721 -4765 -4810 -4748 -4687 -4625 -4563 -4651 -4740 -4736 -4732 -4738 -4745 -4659 -4573 -4643 -4713 -4691 -4669 -4675 -4681 -4686 -4692 -4704 -4716 -4727 -4739 -4762 -4786 -4809 -4832 -4813
$$ packed form
1534A0324o88o22o23n46n45n29n30p02l94l85l85l66l66m76m77m00m00l89l89l86k01k77k76
1531b8j57j58j86j85k90j04j26j26j91j91j74j74j27j28j50j49j50j49l9l9k59k58j50L4Q
1528c646Pm1m2O6O6O5O5O6O5o3o3o2o3K4K3K4K3ppL9L9nmq2q2j12j12l6l5M9M9n8n9J00R9
1524c710l9l9l8l8QRmnmmj00j00n4n4r2r1j5j4L7L6r6N8KKJ2J1k9k9k9k9j3j3j3j3N5N6n3
1520d432j44r1O3l0k9P3P3l5l5k9k9k9k9J4J5o3o2m8m7R2R1q7q8J3j42n7J57J25L3l0l0P2
1516d745P2J76J75R9R9R6R6m3m2jjm8m7JJJJK1K2j18j17K2K3n5n4m6m6J%L2L2K3K2P7p6p6
1512d423P7k6k7P6P6J34J34j9k0P9P9L3L3j47j47j01j00j21j21p5p5J7J6O3O2p2p3K0K0PP
1509d614QPL8L8n4n4m5m5m4m5O2O1O2O2q8q9MMopQ6Q6p0p0K2K2oonoj2j2j1j2k3k4k3k3J9
$$ plain form
1504 -4813 -4794 -4775 -4756 -4764 -4773 -4720 -4760 -4828 -4742 -4657 -4571 -4582 -4594 -4605 -4616 -4681 -4746 -4657 -4568 -4572 -4577 -4582 -4586 -4561 -4536 -4527 -4424 -4427 -4584 -4649 -4560 -4526 -4585 -4628 -4672 -4648 -4625
1500 -4625 -4602 -4579 -4613 -4648 -4590 -4532 -4550 -4567 -4640 -4713 -4574 -4589 -4661 -4641 -4588 -4534 -4568 -4601 -4602 -4604 -4559 -4515 -4475 -4436 -4397 -4357 -4363 -4369 -4375 -4381 -4232 -4083 -4037 -3992 -3918 -4029
1496 -4029 -4128 -4227 -4272 -4317 -4454 -4591 -4698 -4806 -4867 -4928 -5025 -5123 -5066 -5009 -5059 -5108 -5157 -5206 -5166 -5126 -5132 -5138 -5149 -5160 -5263 -5367 -5383 -5399 -5323 -5247 -5210 -5172
1492 -5172 -5227 -5282 -5168 -5054 -5156 -5257 -5232 -5206 -5227 -5247 -5257 -5266 -5322 -5378 -5314 -5251 -5187 -5124 -5144 -5164 -5069 -5158 -5262 -5181 -5123 -5066 -5121 -5176 -5184 -5193 -5228 -5263 -5144
1488 -5144 -5025 -5066 -5108 -5149 -5191 -5052 -4912 -4866 -4819 -4858 -4897 -5039 -4997 -5023 -5048 -5062 -5076 -5067 -5057 -5047 -5038 -4934 -4830 -4819 -4807 -4829 -4851 -4873 -4895 -4965 -5035 -4951
1485 -4951 -4868 -4977 -5086 -5042 -4997 -4992 -4987 -5049 -4926 -4794 -4815 -4831 -4846 -4881 -4915 -4904 -4893 -4875 -4858 -4840 -4823 -4806 -4788 -4817 -4846 -4814 -4782 -4842 -4902 -4823 -4744 -4757 -4771
1481 -4771 -4780 -4790 -4799 -4809 -4859 -4909 -4867 -4824 -4833 -4841 -4758 -4674 -4751 -4829 -4753 -4677 -4644 -4612 -4671 -4731 -4757 -4783 -4855 -4927 -4913 -4898 -4884 -4869 -4812 -4754 -4788 -4823 -4722 -4622 -4614 -4605
1477 -4605 -4615 -4624 -4633 -4642 -4668 -4694 -4628 -4562 -4614 -4666 -4718 -4771 -4785 -4800 -4768 -4737 -4715 -4693 -4764 -4834 -4818 -4802 -4740 -4678 -4681 -4683 -4685 -4688 -4730 -4772 -4722 -4672 -4613 -4554 -4587 -4621 -4594 -4567
$$ packed form
1504d813J9J9J9qrN3m0o8Q6Q5Q6j1j2j1j1o5o5Q9Q9mnnmK5K5RJ03lj57o5Q9L4n9m3m4K4K3
1500d625K3K3l4l5N8N8j8j7p3p3J39j5p2K0N3N4l4l3jkM5M4M0L9L9M0ooooJ49J49M6M5P4j11
1496d029r9r9m5m5j37j37j07j08o1o1r7r8N7N7n0m9m9m9M0M0ooj1j1j03j04j6j6P6P6L7L8
1492e172n5n5J14J14j02j01K5K6k1k0j0rn6n6O4O3O4O3k0k0R5q9j04Q1N8N7n5n5qrl5l5J19
1488e144J19m1m2m1m2J39J40M6M7l9l9j42M2k6k5j4j4RJ0J0RJ04J04J1J2k2k2k2k2p0p0Q4
1485d951Q3j09j09M4M5NNo2J23J32k1j6j5l5l4J1J1J8J7J8J7J7J8k9k9L2L2o0o0P9P9j3j4
1481d771rj0rj0n0n0M2M3rqQ3Q4p7p8P6P6L3L2n9o0k6k6p2p2J4J5J4J5N7N8l4l5J01J00QR
1477d605j0rrrk6k6O6O6n2n2n2n3j4j5L2L1K2K2p1p0J6J6O2O2lkklm2m2N0N0N9N9l3l4K7K7
$$ plain form
1473 -4567 -4587 -4607 -4591 -4575 -4574 -4481 -4368 -4408 -4403 -4397 -4457 -4517 -4484 -4451 -4497 -4542 -4495 -4448 -4445 -4442 -4347 -4251 -4145 -4038 -3931 -3825 -3812 -3800 -3695 -3590 -3362 -3134
1469 -3134 -3054 -2974 -2800 -2533 -2140 -1562 -921 -187 721 1814 2724 3327 3630 3503 3036 2263 1358 454 -505 -1465 -2254 -2736 -3023
1466 -3023 -3218 -3446 -3673 -3821 -3969 -3902 -3834 -3886 -3938 -4042 -4146 -4118 -4183 -4305 -4243 -4253 -4356 -4304 -4251 -4271 -4292 -4358 -4424 -4405 -4386 -4413 -4440 -4482 -4524 -4567
1463 -4567 -4609 -4613 -4616 -4620 -4623 -4625 -4627 -4629 -4630 -4563 -4495 -4581 -4667 -4661 -4655 -4649 -4643 -4660 -4678 -4603 -4528 -4542 -4556 -4617 -4677 -4737 -4797 -4764 -4731 -4705 -4678 -4703 -4728 -4713 -4791 -4921 -4866 -4856 -4845 -4777
1458 -4777 -4709 -4716 -4724 -4823 -4923 -4822 -4720 -4619 -4518 -4531 -4544 -4557 -4570 -4602 -4635 -4575 -4515 -4509 -4503 -4343 -4183 -3865 -3548 -3249 -2951 -2871 -3098 -3204 -3219 -3392
1455 -3392 -3566 -3826 -4086 -4256 -4426 -4504 -4582 -4571 -4560 -4550 -4539 -4582 -4625 -4668 -4711 -4674 -4636 -4691 -4746 -4813 -4880 -4856 -4831 -4819 -4808 -4796 -4785 -4801 -4818 -4742 -4666 -4680
1451 -4680 -4693 -4753 -4813 -4827 -4840 -4762 -4683 -4723 -4763 -4802 -4842 -4768 -4695 -4775 -4855 -4820 -4784 -4841 -4898 -4896 -4894 -4892 -4890 -4902 -4915 -4881 -4847 -4798 -4748 -4791 -4834 -4828 -4821 -4815 -4809 -4885 -4961 -4944
1447 -4944 -4928 -4999 -5070 -4987 -4904 -4867 -4829 -4838 -4847 -4976 -5105 -5080 -5055 -5026 -4997 -4968 -4939 -4930 -4920 -4910 -4900 -4976 -5052 -4973 -4895 -4855 -4816 -4776 -4736 -4711 -4687 -4755 -4822 -4795 -4767
$$ packed form
1473d567k0k0J6J6JR3J13m0NOo0o0L3L3m6m5M7M7LLR5R6J06J07J07J06J3J2J05J05K28K28
1469c134Q0Q0J74K67L93N78O41P34R08J093R10O03L03j27m67p73r05r04r59r60p89m82k87
1466c023j95k28k27j48j48O7O8n2n2j04j04K8o5j22O2j0j03N2N3k0k1o6o6J9J9k7k7m2m2m3
1463d567m2mlmlkkkjO7O8q6q6OOOOj7j8P5P5j4j4o1o0o0o0L3L3K6K7k5k5J5p8j30N5J0J1O8
1458d777O8pqr9j00J01J02J01J01j3j3j3j3l2l3O0O0OOJ60J60L18L17K99K98Q0k27j06j5j73
1455c392j74k60k60j70j70p8p8J1J1J0J1m3m3m3m3L7L8n5n5o7o7K4K5J2J1J2J1j6j7P6P6j4
1451d680j3o0o0j4j3P8P9m0m0l9m0P4P3q0q0L5L6n7n7KKKKj2j3L4L4M9N0m3m3OPOOp6p6J7
1447d944J6p1p1Q3Q3L7L8rrj29j29K5K5K9K9K9K9RJ0J0J0p6p6P9P8M0L9M0M0K5K4o8o7K7K8
$$ plain form
1443 -4767 -4786 -4805 -4822 -4839 -4763 -4688 -4685 -4682 -4679 -4675 -4717 -4758 -4707 -4656 -4683 -4710 -4737 -4763 -4721 -4679 -4682 -4686 -4681 -4676 -4764 -4851 -4822 -4793 -4765 -4736 -4684 -4632 -4672 -4712 -4709 -4706 -4703 -4700 -4700 -4700 -4654
1438 -4654 -4607 -4679 -4751 -4731 -4711 -4617 -4524 -4585 -4645 -4674 -4703 -4779 -4854 -4875 -4895 -4824 -4752 -4810 -4867 -4833 -4798 -4810 -4821 -4833 -4845 -4792 -4738 -4680 -4621 -4744 -4774 -4649 -4709
1434 -4709 -4816 -4738 -4730 -4721 -4788 -4855 -4829 -4803 -4706 -4609 -4558 -4507 -4581 -4654 -4698 -4650 -4535 -4605 -4771 -4845 -4814 -4784 -4841 -4897 -4858 -4818 -4779 -4740 -4802 -4865 -4774 -4682 -4717 -4752
1430 -4752 -4929 -5106 -5141 -4991 -4928 -5049 -5013 -4884 -4910 -4937 -4949 -4961 -5020 -5078 -5005 -4933 -5014 -5095 -5075 -5055 -5035 -5015 -4990 -4965 -5033 -5100 -5020 -4939 -4951 -4963 -5030 -5098
1427 -5098 -5074 -5049 -5074 -5100 -4977 -4854 -4817 -4872 -4852 -5016 -5105 -5009 -5126 -5151 -5100 -5049 -4992 -4935 -4910 -4884 -4859 -4834 -4881 -4928 -4822 -4715 -4802 -4890 -4937 -4984 -4959
1423 -4959 -5027 -5112 -5013 -4908 -4987 -5095 -5111 -5074 -5038 -4996 -4953 -4988 -5022 -5057 -5092 -5157 -5223 -5137 -4959 -4875 -4977 -4974 -4879 -4906 -4932 -5045 -5157 -5039 -4920 -4893 -4867
1420 -4867 -4926 -4985 -4891 -4796 -4851 -4907 -4870 -4833 -4810 -4787 -4856 -4926 -4920 -4915 -4909 -4903 -4858 -4812 -4859 -4906 -4760 -4615 -4623 -4632 -4640 -4648 -4657 -4665 -4654 -4643 -4632 -4622 -4567 -4512 -4611 -4710 -4771 -4833
1415 -4833 -4848 -4863 -4873 -4882 -4777 -4855 -4877 -4715 -4668 -4621 -4598 -4576 -4554 -4532 -4584 -4636 -4648 -4659 -4668 -4770 -4836 -4719 -4602 -4577 -4695 -4721 -4642 -4564 -4519 -4658 -4668 -4494
$$ packed form
1443d767j9j9j7j7P6P5LLLMm2m1N1N1k7k7k7k6M2M2lmNNq8q7K9K9K8K9N2N2m0m0LLLL%%M6
1438d654M7p2p2K0K0R4R3o1o0k9k9p6p5k1k0P1P2n8n7L4L5j2j1j2j2N3N4N8N9j23l0J25o0
1434d709j07P8QRo7o7K6K6R7R7N1N1p4p3m4M8J15p0j66p4L1L0n7n6L9M0L9L9o2o3R1R2l5l5
1430d752j77j77l5J50O3j21L6J29k6k7j2j2n9n8P3P2q1q1K0K0K0K0K5K5o8o7Q0Q1j2j2o7o8
1427e098K4K5k5k6J23J23L7n5K0j64q9R6j17k5N1N1N7N7K5K6K5K5m7m7J06J07q7q8m7m7K5
1423d959o8q5R9J05p9j08j6L7L6M2M3l5l4l5l5o5o6Q6J78Q4j02LR5k7k6j13j12J18J19K7K6
1420d867n9n9R4R5n5n6L7L7K3K3o9p0ONOOM5M6m7m7J46J45qrqqrqJ1J1J1J0N5N5r9r9o1o2
1415d833j5j5j0rJ05p8k2J62M7M7K3K2K2K2n2n2j2j1rj02o6J17J17K5j18k6P9P8M5j39j0J74
$$ plain form
1412 -4494 -4470 -4538 -4657 -4685 -4741 -4704 -4608 -4697 -4780 -4678 -4635 -4591 -4628 -4665 -4699 -4733 -4721 -4709 -4734 -4759 -4674 -4774 -4910 -4953 -4964 -4882 -4793 -4797 -4839 -4973 -5005 -4944
1408 -4944 -4947 -4857 -4927 -4997 -4803 -4795 -4799 -4804 -4866 -4928 -4901 -4873 -4932 -4991 -4976 -4867 -4855 -5028 -5081 -5042 -5020 -4999 -4961 -4923 -4977 -5031 -4990 -4949 -5001 -5052 -5077 -5103 -5128 -5154 -5181
1404 -5181 -5209 -5191 -5173 -5096 -5019 -5034 -5049 -5101 -5152 -5049 -4946 -5080 -5214 -5133 -5051 -5070 -5089 -5045 -5093 -5262 -5246 -5134 -5115 -5136 -5157 -5146 -4950 -4918 -5070 -4963
1401 -4963 -4947 -4943 -4939 -5033 -5127 -5118 -5109 -5008 -4907 -4911 -4915 -4849 -4968 -5119 -5086 -5013 -4941 -4983 -5026 -5068 -5110 -5125 -5141 -5156 -5171 -5132 -5093 -5146 -5199 -5283 -5367 -5404 -5442 -5398 -5353
1397 -5353 -5355 -5356 -5418 -5481 -5389 -5297 -5275 -5252 -5276 -5300 -5157 -5015 -5026 -5037 -5048 -5058 -4977 -4895 -4981 -5066 -5060 -5053 -5026 -4999 -4971 -4944 -4993 -5041 -5090 -5139 -5169 -5200 -5184 -5168 -5176 -5185
1393 -5185 -5101 -5017 -5039 -5061 -5083 -5105 -5058 -5010 -4963 -4916 -5005 -5095 -5030 -4966 -4927 -4889 -5004 -5119 -5136 -5153 -5217 -5280 -5227 -5174 -5121 -5068 -5057 -5045 -5033 -5022 -4959 -4897 -4988
1389 -4988 -5079 -5074 -5068 -5016 -4965 -5013 -5061 -5064 -5066 -5066 -5066 -5066 -5067 -5087 -5108 -5128 -5148 -5104 -5059 -5014 -4970 -4948 -4926 -4905 -4883 -4900 -4917 -4824 -4916 -5009 -5011 -5024 -5129 -5207 -5284 -5275 -5266 -5245 -5224
1384 -5224 -5156 -5089 -5082 -5075 -5221 -5368 -5270 -5171 -5227 -5282 -5278 -5273 -5269 -5264 -5292 -5320 -5348 -5376 -5287 -5197 -5113 -5029 -4992 -5046 -5164 -5097 -4943 -4973 -5042 -5111 -5047 -4983 -5011 -5039 -5091
$$ packed form
1412d494K4o8j19k8n6L7R6q9q3J02M3M4l7l7l4l4J2J2k5k5Q5j00j36m3j1Q2Q9mm2j34l2O1
1408d944lR0p0p0J94Qmno2o2K7K8n9n9J5J09J2j73n3L9K2K1L8L8n4n4M1M1n2n1k5k6k5k6k7
1404e181k8J8J8P7P7j5j5n2n1J03J03j34j34Q1Q2j9j9M4m8j69J6J12J9k1k1J1J96L2j52J07
1401d963J6MMr4r4RRJ01J01mmO6j19j51L3P3P2m2m3m2m2j5j6j5j5L9L9n3n3q4q4l7l8M4M5
1397e353kjo2o3R2R2K2K3k4k4J43J42j1j1j1j0Q1Q2q6q5OPK7K7K8K7m9m8m9m9l0l1J6J6qr
1393e185Q4Q4k2k2k2k2M7M8M7M7q9r0O5O4L9L8j15j15j7j7o4o3N3N3N3N3J1J2J2J1O3O2r1
1389d988r1NON2N1m8m8lk%%%jk0k1k0k0M4M5M5M4K2K2K1K2j7j7R3r2r3kj3j05p8p7RRK1K1
1384e224O8O7PPj46j47R8R9n6n5MNMNk8k8k8k8Q9R0Q4Q4L7n4j18O7J54l0o9o9O4O4k8k8n2
$$ plain form
1380 -5091 -5142 -5101 -5060 -5077 -5094 -5110 -5127 -5110 -5093 -5077 -5060 -5066 -5072 -5078 -5084 -5089 -5093 -5091 -5090 -5146 -5110 -5022 -5119 -5098 -5078 -4977 -4876 -4938 -4999 -5014 -5030 -5006 -4981 -4957 -4933 -4939 -4945 -4950 -4956
1376 -4956 -4993 -5030 -4975 -4920 -4885 -4850 -4862 -4873 -4922 -4971 -4928 -4885 -4843 -4801 -4759 -4717 -4754 -4791 -4828 -4865 -4879 -4893 -4907 -4921 -4933 -4944 -4956 -4967 -4979 -4991 -5002 -5014 -4975 -4936
1372 -4936 -4897 -4858 -4807 -4756 -4750 -4745 -4847 -4948 -4896 -4843 -4803 -4762 -4813 -4865 -4875 -4885 -4849 -4814 -4809 -4805 -4801 -4797 -4848 -4899 -4950 -5002 -4983 -4965 -4942 -4918 -4944 -4879 -4756 -4817 -4875 -4840
1368 -4840 -4869 -4897 -4894 -4890 -4887 -4884 -4822 -4761 -4792 -4823 -4855 -4887 -4826 -4765 -4746 -4727 -4800 -4872 -4920 -4967 -4974 -4982 -4913 -4936 -5017 -4914 -4787 -4752 -4808 -4864 -4927 -4989 -4959 -4930 -4951 -4972
1364 -4972 -5011 -4957 -4876 -4980 -4940 -4807 -4819 -4922 -4922 -4922 -4902 -4882 -4908 -4934 -4888 -4843 -4844 -4845 -4800 -4754 -4709 -4664 -4715 -4766 -4817 -4868 -4880 -4893 -4906 -4918 -4959 -5000 -5041 -5082 -5066
1360 -5066 -5050 -5034 -5019 -5033 -5047 -5016 -4984 -4923 -4862 -4900 -4937 -4890 -4934 -4985 -4851 -4861 -4871 -4921 -4971 -4960 -5040 -5100 -4852 -4761 -4855 -4780 -4705 -4709 -4713 -4809 -4906 -4882 -4858 -4933
1356 -4933 -5007 -5018 -5121 -5072 -4838 -4714 -4775 -4813 -4850 -4823 -4795 -4859 -4924 -4894 -4865 -4835 -4805 -4878 -4950 -4869 -4787 -4787 -4786 -4786 -4785 -4805 -4825 -4753 -4681 -4704 -4727 -4796 -4865 -4815 -4764
1352 -4764 -4714 -4664 -4631 -4598 -4657 -4717 -4729 -4741 -4713 -4685 -4570 -4548 -4635 -4538 -4413 -4472 -4570 -4667 -4654 -4642 -4629 -4616 -4619 -4621 -4624 -4627 -4578 -4529 -4572 -4615 -4621 -4628 -4634 -4641 -4584 -4527 -4562
$$ packed form
1380e091n1M1M1j7j7j6j7J7J7J6J7oooonmKJn6L6Q8r7K1K0J01J01o2o1j5j6K4K5K4K4oono
1376d956l7l7N5N5L5L5j2j1m9m9M3M3M2M2M2M2l7l7l7l7j4j4j4j4j2j1j2j1j2j2j1j2L9L9
1372d936L9L9N1N1ONj02j01N2N3M0M1n1n2j0j0L6L5NMMMn1n1n1n2J9J8K3K4k6O5J23o1n8L5
1368d840k9k8LMLLO2O1l1l1l2l2O1O1J9J9p3p2m8m7pqO9k3q1J03J27L5n6n6o3o2L0K9k1k1
1364d972l9N4Q1j04M0J33j2j03%%K0K0k6k6M6M5jjM5M6M5M5n1n1n1n1j2j3j3j2m1m1m1m1J6
1360e066J6J6J5j4j4L1L2O1O1l8l7M7m4n1J34j0j0n0n0J1q0o0K48R1r4P5P5mmr6r7K4K4p5
1356d933p4j1j03M9K34J24o1l8l7K7K8o4o5L0K9L0L0p3p2Q1Q2%J%Jk0k0P2P2k3k3o9o9N0N1
1352d764N0N0L3L3n9o0j2j2K8K8J15K2q7R7J25n9r8r7J3J2J3J3lkllM9M9m3m3opopN7N7l5
$$ plain form
1348 -4562 -4598 -4661 -4725 -4697 -4669 -4628 -4587 -4592 -4598 -4715 -4832 -4856 -4881 -4845 -4810 -4779 -4749 -4694 -4731 -4819 -4723 -4743 -4762 -4667 -4755 -4839 -4924 -4927 -4930 -4950 -4970 -4990 -5010 -4982 -4954
1344 -4954 -4973 -4992 -4921 -4850 -4871 -4893 -4899 -4906 -4913 -4919 -4893 -4867 -4841 -4815 -4815 -4816 -4816 -4817 -4871 -4926 -4980 -5034 -5003 -4971 -4940 -4908 -4946 -4984 -5021 -5059 -5004 -4950 -4959 -4875 -4809 -4927 -4936 -4945 -4907
1339 -4907 -4869 -4832 -4794 -4862 -4930 -4998 -5066 -5004 -4943 -4974 -5005 -4925 -4846 -4858 -4871 -4896 -4921 -4775 -4721 -4923 -4941 -4910 -4970 -4952 -4934 -4864 -4978 -4960 -4942 -4981 -5021 -4959 -4897
1335 -4897 -4880 -4955 -5018 -4897 -4833 -4862 -4888 -4914 -4946 -4978 -4966 -4955 -4944 -4932 -4953 -4974 -4919 -4863 -4954 -5046 -5030 -5013 -4988 -4962 -5013 -5064 -5073 -5082 -5045 -5008 -4969 -4929 -4967 -5005 -5012
1331 -5012 -5020 -5028 -5036 -5016 -4995 -5052 -5108 -5139 -5170 -5062 -4954 -5016 -5078 -5032 -4987 -4881 -4776 -4778 -4781 -4807 -4833 -4906 -4978 -4938 -4897 -4810 -4723 -4806 -4889 -4895 -4901 -4919 -4938 -4911 -4883 -4870
1327 -4870 -4858 -4851 -4844 -4676 -4600 -4751 -4717 -4658 -4692 -4662 -4632 -4675 -4718 -4761 -4805 -4790 -4775 -4807 -4838 -4811 -4784 -4791 -4798 -4846 -4709 -4649 -4773 -4722 -4670 -4707 -4744 -4712 -4679 -4647
1323 -4647 -4614 -4711 -4809 -4798 -4788 -4850 -4912 -4897 -4883 -4920 -4957 -4825 -4693 -4669 -4646 -4699 -4753 -4771 -4789 -4806 -4824 -4819 -4813 -4730 -4647 -4636 -4626 -4692 -4758 -4744 -4729 -4761 -4792 -4866
1319 -4866 -4940 -4906 -4872 -4835 -4798 -4807 -4816 -4858 -4900 -4834 -4768 -4763 -4758 -4830 -4902 -4851 -4801 -4858 -4916 -4878 -4840 -4802 -4764 -4753 -4742 -4731 -4720 -4829 -4937 -4999 -5062 -5060 -5059 -5012 -4965 -4958 -4951
$$ packed form
1348d562l6o3o4K8K8M1M1noj17j17k4k5L6L5L1L0N5l7q8R6k0j9R5q8q4q5llk0k0k0k0K8K8
1344d954j9j9P1P1k1k2oppoK6K6K6K6%j%jn4n5n4n4L1L2L1L2l8l8l7l8N5N4rQ4O6j18rrL8
1339d907L8L7L8o8o8o8o8O2O1l1l1Q0P9j2j3k5k5J46N4k02j8L1o0J8J8P0j14J8J8l9m0O2O2
1335d897J7p5o3J21O4k9k6k6l2l2J2J1J1J2k1k1N5N6r1r2J6J7K5K6n1n1rrL7L7L9M0l8l8p
1331e012qqqK0K1n7n6l1l1J08J08o2o2M6M5J06J05klk6k6p3p2M0M1Q7Q7q3q3ooj8j9K7K8J3
1327d870J2PPJ68P6j51L4N9l4L0L0m3m3m3m4J5J5l2l1K7K7ppm8J37O0j24N1N2l7l7L2L3L2
1323d647L3r7r8J1J0o2o2J5J4l7l7J32J32K4K3n3n4j8j8j7j8NOQ3Q3J1J0o6o6J4J5l2l1p4
1319d866p4L4L4L7L7rrm2m2O6O6NNp2p2N1N0n7n8L8L8L8L8J1J1J1J1j09j08o2o3KJM7M7PP
$$ plain form
1315 -4951 -4944 -4937 -4927 -4917 -4907 -4897 -4891 -4886 -4880 -4875 -4809 -4744 -4756 -4768 -4750 -4733 -4823 -4914 -4955 -4996 -4930 -4863 -4837 -4811 -4785 -4759 -4774 -4788 -4802 -4817 -4777 -4738 -4837 -4935 -4878 -4820 -4839
1311 -4839 -4858 -4799 -4741 -4728 -4715 -4713 -4711 -4709 -4707 -4711 -4714 -4610 -4506 -4501 -4496 -4491 -4486 -4529 -4572 -4615 -4658 -4638 -4617 -4603 -4588 -4516 -4537 -4685 -4679 -4675 -4671 -4657 -4643 -4639 -4635 -4631 -4627 -4689 -4751 -4813 -4875
1306 -4875 -4867 -4859 -4804 -4749 -4713 -4677 -4733 -4789 -4827 -4864 -4814 -4671 -4574 -4692 -4684 -4675 -4703 -4731 -4749 -4767 -4797 -4672 -4548 -4578 -4592 -4605 -4629 -4652 -4618 -4583 -4641 -4699 -4687 -4674
1302 -4674 -4569 -4464 -4463 -4462 -4425 -4387 -4382 -4530 -4546 -4561 -4633 -4704 -4684 -4663 -4737 -4811 -4793 -4774 -4732 -4690 -4688 -4686 -4634 -4490 -4455 -4574 -4669 -4609 -4542 -4567 -4701 -4742 -4749 -4756 -4783
1298 -4783 -4810 -4744 -4679 -4724 -4768 -4720 -4672 -4663 -4653 -4730 -4807 -4764 -4630 -4547 -4617 -4671 -4632 -4655 -4678 -4640 -4601 -4563 -4525 -4572 -4618 -4665 -4711 -4692 -4672 -4652 -4632 -4643 -4654 -4573
1295 -4573 -4492 -4621 -4751 -4728 -4704 -4709 -4714 -4765 -4816 -4829 -4842 -4808 -4775 -4761 -4747 -4733 -4719 -4782 -4845 -4755 -4664 -4672 -4681 -4735 -4790 -4800 -4811 -4821 -4831 -4833 -4835 -4837 -4838 -4817 -4796 -4775 -4754
1290 -4754 -4814 -4873 -4841 -4808 -4735 -4662 -4681 -4700 -4650 -4600 -4704 -4808 -4912 -5015 -4965 -4915 -4892 -4869 -4846 -4823 -4842 -4860 -4879 -4898 -4861 -4825 -4835 -4845 -4851 -4858 -4772 -4685 -4700
1287 -4700 -4715 -4770 -4825 -4834 -4751 -4650 -4734 -4908 -4898 -4849 -4800 -4874 -4948 -4930 -4912 -4913 -4914 -4916 -4917 -4936 -4954 -4973 -4992 -4973 -4953 -4945 -4937 -4855 -4957 -5013 -4977 -5001 -5118 -5188 -5167 -5062
$$ packed form
1315d951PPJ0J0J0J0ONONO6O5j2j2J8J7r0r1m1m1O6O7K6K6K6K6j5j4j4j5M0L9r9r8N7N8j9
1311d839j9N9N8J3J3KKKKmlJ04J04NNNNm3m3m3m3K0K1J4J5P2k1j48OMMJ4J4MMMMo2o2o2o2
1306d875QQN5N5L6L6n6n6l8l7N0J43R7j18QRk8k8j8j8l0J25J24l0j4j3k4k3L4L5n8n8J2J3
1302d674J05J05JJL7L8Nj48j6j5p2p1K0K1p4p4J8J9M2M2KKN2J44L5j19r5O0O7k5j34m1ppk7
1298d783k7O6O5m5m4M8M8RJ0p7p7M3J34Q3p0n4L9k3k3L8L9L8L8m7m6m7m6J9K0K0K0j1j1Q1
1295d573Q1j29j30K3K4nnn1n1j3j3L4L3J4J4J4J4o3o3R0R1qrn4n5j0j1j0j0kkkjK1K1K1K1
1290d754o0n9L2L3P3P3j9j9N0N0j04j04j04j03N0N0K3K3K3K3j9j8j9j9L7L6j0j0opQ6Q7j5
1287d700j5n5n5rQ3J01q4j74J0M9M9p4p4J8J8jjkjj9j8j9j9J9K0QQQ2j02n6L6k4j17p0K1J05
$$ plain form
1282 -5062 -5049 -5123 -5104 -5048 -4993 -4977 -4961 -5013 -5065 -5071 -5077 -5058 -5039 -5019 -5000 -5047 -5093 -5134 -5175 -5190 -5112 -5023 -5119 -5058 -4905 -4907 -4909 -5018 -5127 -5144 -5161 -5183 -5204 -5134 -5063
1278 -5063 -5052 -5041 -5019 -4996 -5128 -5075 -4868 -4845 -4776 -4708 -4805 -4901 -4905 -4908 -5015 -4937 -4929 -4921 -4901 -4881 -4924 -4966 -4917 -4867 -4898 -4929 -4961 -4992 -5108 -5225 -5188 -5151 -5039
1275 -5039 -4927 -4969 -5011 -5043 -5075 -5015 -4955 -4933 -4911 -4890 -4868 -4890 -4912 -4933 -4955 -4948 -4941 -4934 -4927 -4938 -4949 -4868 -4787 -4811 -4836 -4860 -4885 -4938 -4991 -5045 -5098 -5036 -4974 -5004 -5034 -4983
1270 -4983 -4931 -4972 -5013 -4997 -4980 -4963 -4946 -4912 -4878 -4844 -4810 -4825 -4839 -4853 -4867 -4903 -4940 -4884 -4828 -4910 -4993 -4879 -4950 -4952 -4954 -4967 -4981 -4936 -4892 -4940 -4988 -4957 -4926 -4792
1267 -4792 -4842 -4838 -4834 -4841 -4849 -4814 -4779 -4836 -4893 -4950 -5008 -4973 -4938 -4919 -4901 -4883 -4865 -4893 -4920 -5064 -5022 -4865 -4892 -4958 -5023 -4975 -4927 -4879 -4832 -4858 -4884 -4911 -4937 -4962 -4986
1263 -4986 -4918 -4850 -4864 -4878 -4892 -4906 -4926 -4945 -4965 -4984 -4940 -4896 -4852 -4807 -4765 -4723 -4680 -4638 -4772 -4906 -4887 -4867 -4880 -4893 -4814 -4735 -4803 -4871 -4847 -4823 -4826 -4828 -4924 -5019
1259 -5019 -4938 -4857 -4931 -5004 -4952 -4900 -4860 -4820 -4668 -4701 -4784 -4867 -4858 -4849 -4839 -4830 -4893 -4956 -4927 -4898 -4871 -4843 -4920 -4812 -4822 -4832 -4830 -4829 -4879 -4929 -4887 -4846 -4867 -4889 -4910 -4932
1255 -4932 -4936 -4940 -5048 -4971 -4930 -4888 -4834 -4781 -4721 -4662 -4818 -4974 -4919 -4864 -4808 -4753 -4770 -4788 -4806 -4823 -4895 -4966 -4883 -4801 -4822 -4843 -4865 -4886 -4804 -4722 -4733 -4743 -4740 -4737 -4734
$$ packed form
1282e062J3p4J9N6N5J6J6n2n2ooJ9J9K0J9m7m6m1m1j5P8Q9r6O1J53kkj09j09j7j7k2k1P0P1
1278e063J1J1K2K3j32N3K07K3O9O8r7r6mlj07P8QQK0K0m3m2M9N0l1l1l2l1j16j17L7L7J12
1275e039J12m2m2l2l2O0O0K2K2K1K2k2k2k1k2PPPPj1j1Q1Q1k4k5k4k5n3n3n4n3O2O2l0l0N1
1270d983N2m1m1J6J7J7J7L4L4L4L4j5j4j4j4l6l7N6N6q2q3J14p1kkj3j4M5M4m8m8L1L1J34
1267d792n0MMpqL5L5n7n7n7n8L5L5J9J8J8J8k8k7j44M2J57k7o6o5M8M8M8M7k6k6k7k6k5k4
1263d986O8O8j4j4j4j4k0j9k0j9M4M4M4M5M2M2M3M2j34j34J9K0j3j3P9P9o8o8K4K4lkr6r5
1259e019Q1Q1p4p3N2N2M0M0J52l3q3q3RRJ0Ro3o3K9K9K7K8p7J08j0j0KJn0n0M2M1k1k2k1k2
1255d932mmj08P7M1M2N4N3O0N9j56j56N5N5N6N5j7j8j8j7p2p1Q3Q2k1k1k2k1Q2Q2j1j0LLL
$$ plain form
1251 -4734 -4731 -4710 -4690 -4669 -4648 -4650 -4653 -4655 -4657 -4718 -4779 -4840 -4901 -4814 -4727 -4732 -4737 -4746 -4755 -4765 -4774 -4777 -4781 -4784 -4788 -4839 -4890 -4941 -4992 -4987 -4982 -4823 -4665 -4699 -4733 -4767 -4801 -4799 -4797 -4794 -4792 -4777 -4762
1246 -4762 -4748 -4733 -4845 -4958 -4916 -4874 -4866 -4859 -4943 -5027 -4940 -4854 -4859 -4865 -4885 -4906 -4927 -4947 -4953 -4958 -4871 -4784 -4865 -4946 -5026 -5107 -5013 -4919 -4917 -4915 -4971 -5027 -4991 -4954 -4924 -4893 -4863
1241 -4863 -4833 -4823 -4814 -4897 -4980 -4982 -4984 -4987 -4989 -4947 -4905 -4955 -5005 -5023 -5041 -5058 -5076 -5051 -5026 -5002 -4977 -5020 -5062 -4951 -4840 -4848 -4857 -4866 -4874 -4990 -5107 -5131 -5155 -5092 -5030 -4968 -4905
1237 -4905 -4970 -5035 -5099 -5164 -5117 -5069 -5115 -5160 -5159 -5158 -5157 -5156 -5062 -4968 -4966 -4965 -4990 -5016 -5041 -5067 -5007 -4947 -5040 -5042 -4951 -5014 -5043 -4979 -4983 -5080 -5171 -5170 -5146 -5122 -5092 -5062 -5041 -5020 -4999
1233 -4999 -4977 -5006 -5035 -5064 -5093 -5121 -5148 -5175 -5203 -5203 -5204 -5205 -5205 -5188 -5170 -5153 -5136 -5107 -5078 -5049 -5021 -4994 -4967 -4940 -4913 -4899 -4886 -4965 -5044 -5022 -5001 -4980 -4959 -4931 -4904 -4877
1229 -4877 -4850 -4822 -4794 -4757 -4719 -4901 -4928 -4831 -4826 -4784 -4650 -4676 -4701 -4628 -4709 -4796 -4729 -4711 -4785 -4849 -4821 -4739 -4657 -4668 -4678 -4629 -4673 -4852 -4878 -4748 -4772 -4793 -4813
1225 -4813 -4835 -4857 -4879 -4747 -4758 -4861 -4902 -4944 -4898 -4852 -4806 -4760 -4721 -4683 -4799 -4914 -4860 -4805 -4843 -4880 -4839 -4798 -4757 -4716 -4899 -5082 -4988 -4894 -4862 -4830 -4798
1221 -4798 -4765 -4836 -4906 -4885 -4863 -4920 -4977 -5035 -5092 -5054 -5017 -4979 -4942 -4853 -4763 -4828 -4892 -4885 -4878 -4871 -4864 -4826 -4788 -4750 -4712 -4755 -4798 -4812 -4734 -4622 -4694 -4790 -4887 -5096 -4998
$$ packed form
1251d734LK1K0K1K1klkko1o1o1o1Q7Q7nnrrj0rlmlmn1n1n1n1NNJ59J58l4l4l4l4KKLKJ5J5
1246d762J4J5j12j13M2M2QPq4q4Q7Q6nok0k1k1k0onQ7Q7q1q1q0q1R4R4KKn6n6L6L7L0L1L0
1241d863L0J0Rq3q3kklkM2M2n0n0j8j8j7j8K5K5K4K5m3m2J11J11qrrqj16j17k4k4O3O2O2O3
1237d905o5o5o4o5M7M8m6m5JJJJR4R4KJk5k6k5k6O0O0r3kR1o3k9O4mr7r1JK4K4L0L0K1K1K1
1233d999K2k9k9k9k9k8k7k7k8%jj%J7J8J7J7K9K9K9K8K7K7K7K7J4J3p9p9K2K1K1K1K8K7K7
1229d877K7K8K8L7L8j82k7R7NM2J34k6k5P3q1q7O7J8p4o4K8Q2Q2j1j0M9m4j79k6J30k4k1k0
1225d813k2k2k2J32j1j03m1m2M6M6M6M6L9L8j16j15N4N5l8l7M1M1M1M1j83j83R4R4L2L2L2
1221d798L3p1p0K1K2n7n7n8n7L8L7L8L7Q9R0o5o4PPPPL8L8L8L8m3m3j4P8J12p2r6r7k09R8
$$ plain form
1217 -4998 -4876 -4939 -4913 -4887 -4873 -4859 -4869 -4878 -4888 -4898 -4833 -4767 -4856 -4945 -4933 -4922 -4911 -4900 -4898 -4897 -4895 -4894 -4894 -4895 -4896 -4897 -4823 -4748 -4828 -4908 -4951 -4995 -4976 -5048 -5109 -4986 -4920 -4946
1213 -4946 -4895 -4844 -4941 -5038 -5144 -5066 -5034 -5094 -5077 -4968 -5015 -5062 -5067 -5163 -5231 -5115 -5035 -5139 -5244 -5164 -5063 -5146 -5166 -5094 -5067 -5040 -5099 -5159 -5109 -5058 -5008 -4958
1209 -4958 -4986 -5014 -5042 -5070 -5063 -5057 -5050 -5044 -5046 -5049 -5052 -5055 -5032 -5010 -5080 -5150 -5132 -5114 -5212 -5125 -4962 -4985 -4982 -5072 -5130 -5003 -4986 -4968 -4968 -4968 -5061 -5153 -5106 -5059 -5000 -5126 -5091 -5055
1205 -5055 -5031 -5007 -4987 -4967 -4946 -4926 -4895 -4863 -4831 -4799 -4799 -4798 -4798 -4797 -4751 -4704 -4811 -4919 -4839 -4759 -4771 -4783 -4753 -4723 -4693 -4663 -4686 -4710 -4733 -4756 -4722 -4688 -4653 -4619 -4646
1201 -4646 -4673 -4699 -4726 -4726 -4726 -4726 -4725 -4731 -4738 -4628 -4704 -4779 -4670 -4676 -4682 -4645 -4608 -4571 -4534 -4555 -4575 -4596 -4617 -4646 -4675 -4703 -4732 -4706 -4679 -4652 -4625 -4688 -4751 -4722 -4693 -4736 -4778
1197 -4778 -4820 -4862 -4846 -4830 -4814 -4799 -4783 -4767 -4751 -4735 -4713 -4690 -4667 -4644 -4693 -4741 -4697 -4653 -4719 -4785 -4851 -4917 -4902 -4888 -4873 -4858 -4770 -4681 -4685 -4689 -4759 -4828 -4805 -4782 -4762
1193 -4762 -4742 -4723 -4703 -4727 -4752 -4776 -4800 -4818 -4836 -4853 -4871 -4869 -4868 -4866 -4865 -4865 -4865 -4864 -4864 -4856 -4847 -4884 -4921 -4877 -4832 -4879 -4927 -4896 -4866 -4836 -4805 -4839 -4872 -4813 -4755 -4825 -4895 -4811 -4727
1188 -4727 -4851 -4974 -4944 -4913 -4890 -4866 -4888 -4911 -4944 -4977 -4912 -4847 -4927 -4914 -4903 -5046 -5050 -4900 -4846 -4793 -4802 -4810 -4819 -4828 -4859 -4890 -4921 -4951 -4921 -4892 -4954 -5017 -4961 -4905 -4896
$$ packed form
1217d998J22o3K6K6J4J4j0rj0j0O5O6q9q9J2J1J1J1KJKJ%jjjP4P5q0q0m3m4J9p2o1J23O6k6
1213d946N1N1r7r7j06P8L2o0J7J09m7m7nr6o8J16Q0j04j05Q0J01q3k0P2K7K7n9o0N0N1N0N0
1209d958k8k8k8k8POPOklllK3K2p0p0J8J8r8Q7J63k3Lr0n8J27J7J8%%r3r2M7M7N9j26L5L6
1205e055K4K4K0K0K1K0L1L2L2L2%J%JM6M7j07j08Q0Q0j2j2L0L0L0L0k3k4k3k3L4L4L5L4k7
1201d646k7k6k7%%%JopJ10p6p5J09ooL7L7L7L7k1k0k1k1k9k9k8k9K6K7K7K7o3o3K9K9m3m2
1197d778m2m2J6J6J6J5J6J6J6J6K2K3K3K3m9m8M4M4o6o6o6o6J5J4J5J5Q8Q9mmp0o9K3K3K0
1193d762K0J9K0k4k5k4k4j8j8j7j8KJKJ%%J%QRl7l7M4M5m7m8L1L0L0L1l4l3N9N8p0p0Q4Q4
1188d727j24j23L0L1K3K4k2k3l3l3O5O5q0J3J1j43mJ50N4N3rqrrl1l1l1l0L0K9o2o3N6N6R
$$ plain form
1184 -4896 -4886 -4895 -4903 -4912 -4921 -4908 -4895 -4882 -4869 -4934 -4998 -4909 -4821 -4760 -4699 -4685 -4671 -4696 -4721 -4746 -4771 -4845 -4919 -4840 -4760 -4778 -4797 -4816 -4834 -4812 -4790 -4768 -4746 -4762 -4778 -4795
1180 -4795 -4811 -4830 -4850 -4869 -4889 -4931 -4974 -5016 -5059 -5026 -4993 -4966 -4939 -4908 -4969 -4978 -4834 -4740 -4738 -4767 -4796 -4858 -4921 -4927 -4934 -5024 -4960 -4777 -4686 -4810 -4935 -4859 -4784 -4727
1176 -4727 -4824 -4932 -4949 -4881 -4814 -4833 -4852 -4863 -4875 -4886 -4897 -4910 -4922 -4842 -4762 -4754 -4745 -4691 -4636 -4681 -4727 -4726 -4725 -4733 -4740 -4748 -4755 -4721 -4687 -4654 -4620 -4632 -4644 -4656 -4668 -4681 -4693 -4705
1172 -4705 -4717 -4707 -4696 -4686 -4676 -4725 -4774 -4823 -4872 -4721 -4570 -4521 -4472 -4391 -4463 -4542 -4621 -4648 -4676 -4657 -4639 -4735 -4831 -4880 -4930 -4855 -4779 -4750 -4721 -4805 -4890 -4881 -4873 -4827
1168 -4827 -4781 -4827 -4873 -4913 -4953 -4901 -4849 -4843 -4837 -4831 -4825 -4822 -4818 -4769 -4720 -4741 -4763 -4692 -4621 -4684 -4747 -4810 -4872 -4837 -4801 -4765 -4730 -4769 -4808 -4755 -4702 -4715 -4727 -4739 -4752 -4735 -4719
1164 -4719 -4702 -4686 -4677 -4667 -4658 -4649 -4765 -4880 -4842 -4804 -4772 -4740 -4707 -4675 -4684 -4693 -4702 -4711 -4709 -4708 -4660 -4612 -4536 -4459 -4521 -4583 -4626 -4669 -4712 -4755 -4807 -4858 -4910 -4962 -4905 -4849 -4798 -4747
1159 -4747 -4706 -4758 -4862 -4782 -4745 -4708 -4633 -4742 -4719 -4696 -4794 -4707 -4676 -4736 -4780 -4823 -4855 -4887 -4919 -4951 -4942 -4932 -4876 -4821 -4812 -4803 -4841 -4878 -4934 -4989 -4937 -4885 -4830 -4775 -4797
1155 -4797 -4819 -4823 -4828 -4832 -4837 -4908 -4979 -4973 -4967 -4941 -4915 -4875 -4743 -4672 -4785 -4841 -4804 -4851 -4898 -4862 -4827 -4827 -4827 -4873 -4919 -4925 -4930 -4859 -4788 -4850 -4912 -4866 -4820 -4761 -4703 -4690 -4678 -4705
$$ packed form
1184d896J0rqrrJ3J3J3J3o5o4Q9Q8O1O1J4J4k5k5k5k5p4p4P9Q0j8j9j9j8K2K2K2K2j6j6j7
1180d795j6j9k0j9k0m2m3m2m3L3L3K7K7L1o1rJ44R4Kk9k9o2o3opr0O4J83R1j24j25P6P5N7
1176d727r7j08j7O8O7j9j9j1j2j1j1j3j2Q0Q0QRN4N5m5m6JJqpqpL4L4L3L4j2j2j2j2j3j2j2
1172d705j2J0J1J0J0m9m9m9m9J51J51M9M9Q1p2p9p9k7k8J9J8r6r6m9n0P5P6K9K9q4q5RQM6
1168d827M6m6m6m0m0N2N2OOOOLMM9M9k1k2P1P1o3o3o3o2L5L6L6L5l9l9N3N3j3j2j2j3J7J6
1164d719J7J6RJ0RRj16j15L8L8L2L2L3L2rrrrKJM8M8P6P7o2o2m3m3m3m3n2n1n2n2N7N6N1N1
1159d747M1n2j04Q0L7L7P5j09K3K3r8Q7L1o0m4m3l2l2l2l2RJ0N6N5RRl8l7n6n5N2N2N5N5k2
1155d797k2mnmnp1p1OOK6K6M0J32P1j13n6L7m7m7L6L5%%m6m6onP1P1o2o2M6M6N9N8J3J2k7
$$ plain form
1151 -4705 -4732 -4644 -4740 -4939 -4955 -4947 -4939 -4919 -4900 -4880 -4861 -4781 -4702 -4730 -4759 -4738 -4717 -4685 -4653 -4804 -4771 -4732 -4878 -4853 -4736 -4683 -4629 -4593 -4556 -4658 -4759 -4777
1147 -4777 -4795 -4717 -4639 -4545 -4636 -4668 -4701 -4720 -4738 -4649 -4560 -4599 -4638 -4678 -4717 -4680 -4643 -4653 -4662 -4605 -4547 -4659 -4771 -4712 -4654 -4734 -4814 -4778 -4741 -4693 -4646 -4733 -4636 -4643
1144 -4643 -4650 -4646 -4641 -4636 -4632 -4627 -4622 -4618 -4613 -4646 -4678 -4710 -4743 -4708 -4673 -4734 -4795 -4899 -4818 -4734 -4650 -4621 -4592 -4563 -4535 -4511 -4487 -4463 -4439 -4537 -4634 -4623 -4613 -4678 -4743 -4670 -4597 -4592 -4586
1139 -4586 -4628 -4669 -4691 -4712 -4734 -4756 -4720 -4685 -4649 -4613 -4554 -4496 -4575 -4655 -4601 -4548 -4540 -4532 -4626 -4721 -4707 -4694 -4680 -4667 -4607 -4548 -4611 -4674 -4660 -4647 -4543 -4440 -4445 -4449 -4433
1135 -4433 -4416 -4400 -4383 -4352 -4321 -4429 -4536 -4511 -4485 -4494 -4503 -4656 -4623 -4695 -4767 -4710 -4654 -4644 -4634 -4657 -4679 -4738 -4797 -4820 -4690 -4524 -4574 -4642 -4710 -4638 -4566 -4553 -4540
1131 -4540 -4620 -4700 -4697 -4693 -4787 -4726 -4646 -4721 -4751 -4689 -4686 -4684 -4583 -4636 -4724 -4720 -4725 -4822 -4910 -4998 -4938 -4877 -4873 -4869 -4864 -4860 -4833 -4806 -4809 -4905 -4864 -4669 -4726 -4783 -4736 -4782 -4862 -4788 -4836
1127 -4836 -4884 -4830 -4777 -4711 -4646 -4734 -4731 -4634 -4691 -4800 -4816 -4770 -4723 -4670 -4618 -4717 -4816 -4761 -4706 -4720 -4734 -4749 -4763 -4720 -4676 -4725 -4774 -4800 -4826 -4760 -4693 -4683 -4673 -4663
1123 -4663 -4653 -4615 -4576 -4629 -4683 -4685 -4688 -4783 -4878 -4878 -4879 -4787 -4696 -4744 -4792 -4840 -4889 -4739 -4589 -4532 -4474 -4526 -4577 -4475 -4373 -4265 -4157 -4203 -4249 -4306 -4364 -4422 -4480
$$ packed form
1151d705k7Q8r6j99j6QQK0J9K0J9Q0P9k8k9K1K1L2L2j51L3L9j46K5J17N3N4L6L7j02j01j8
1147d777j8P8P8R4r1l2l3j9j8Q9Q9l9l9m0l9L7L7j0rN7N8j12j12N9N8q0q0L6L7M8M7q7R7p
1144d643pMNNMNNMNl3l2l2l3L5L5o1o1j04Q1Q4Q4K9K9K9K8K4K4K4K4r8r7J1J0o5o5P3P3NO
1139d586m2m1k2k1k2k2L6L5L6L6N9N8p9q0N4N3QQr4r5J4J3J4J3O0N9o3o3J4J3J04J03nmJ6
1135d433J7J6J7L1L1j08j07K5K6rrj53L3p2p2N7N6J0J0k3k2n9n9k3J30J66n0o8o8P2P2J3J3
1131d540q0q0LMr4O1Q0p5l0O2LKJ01n3q8Mnr7q8q8O0O1MMNMK7K7lr6M1J95n7n7M7m6q0P4m8
1127d836m8N4N3O6O5q8LR7n7j09j6M6M7N3N2r9r9N5N5j4j4j5j4M3M4m9m9k6k6O6O7J0J0J0
1123d663J0L8L9n3n4klr5r5%jR2R1m8m8m8m9J50J50N7N8n2n1J02J02J08J08m6m6n7n8n8n8
$$ plain form
1119 -4480 -4472 -4465 -4611 -4758 -4688 -4619 -4549 -4480 -4520 -4560 -4600 -4640 -4606 -4572 -4538 -4504 -4555 -4605 -4656 -4707 -4625 -4543 -4461 -4380 -4382 -4385 -4388 -4391 -4399 -4406 -4414 -4422 -4441 -4460 -4489 -4518 -4443 -4521
1115 -4521 -4605 -4535 -4486 -4530 -4604 -4678 -4625 -4572 -4611 -4650 -4591 -4532 -4565 -4598 -4575 -4551 -4527 -4504 -4595 -4687 -4625 -4563 -4553 -4543 -4534 -4524 -4647 -4770 -4581 -4547 -4631 -4562 -4589
1111 -4589 -4615 -4608 -4600 -4592 -4584 -4615 -4646 -4739 -4739 -4651 -4717 -4690 -4664 -4620 -4577 -4595 -4521 -4420 -4473 -4526 -4424 -4450 -4569 -4533 -4498 -4508 -4519 -4529 -4540 -4513 -4486 -4545 -4450 -4391 -4331
1107 -4331 -4354 -4376 -4373 -4370 -4367 -4364 -4379 -4393 -4315 -4237 -4227 -4218 -4424 -4629 -4614 -4599 -4584 -4568 -4554 -4540 -4618 -4695 -4700 -4705 -4710 -4715 -4791 -4868 -4790 -4713 -4704 -4696 -4688 -4679 -4656 -4632 -4700 -4769 -4750 -4731
1103 -4731 -4631 -4532 -4525 -4703 -4783 -4771 -4634 -4497 -4569 -4642 -4662 -4683 -4657 -4631 -4645 -4659 -4627 -4594 -4632 -4670 -4662 -4654 -4568 -4482 -4550 -4618 -4582 -4547 -4465 -4383 -4371 -4358 -4392 -4425
1099 -4425 -4400 -4375 -4442 -4509 -4442 -4376 -4309 -4242 -4259 -4276 -4293 -4310 -4258 -4206 -4154 -4102 -4084 -4066 -4048 -4030 -4001 -3972 -3942 -3913 -3844 -3774 -3693 -3612 -3637 -3477 -3318 -3343 -3166
1095 -3166 -2989 -2768 -2362 -1949 -1443 -869 13 1085 2249 3496 4312 4384 3902 3524 3146 2157 737 -509 -1325 -1826 -2019 -2266
1092 -2266 -2513 -2657 -2800 -2852 -2903 -2850 -2797 -2751 -2519 -2394 -2177 -1895 -1428 -696 -56 318 139 -468 -983 -1187 -1299 -1632 -2150 -2621 -2908
$$ packed form
1119d480QPj46j47P0O9P0O9m0m0m0m0L4L4L4L4n1n0n1n1Q2Q2Q2Q1klllqpqqj9j9k9k9P5p8
1115d521q4P0M9m4p4p4N3N3l9l9N9N9l3l3K3K4K4K3r1r2O2O2J0J0RJ0j23j23J89L4q4O9k7
1111d589k6PQQQl1l1r3%Q8o6K7K6M4M3j8P4J01n3n3J02k6j19L6L5j0j1j0j1K7K7n9R5N9O0
1107d331k3k2LLLLj5j4P8P8J0Rk06k05J5J5J5J6J4J4p8p7nnnnp6p7P8P7RQQRK3K4o8o9J9J9
1103d731J00R9Pj78q0J2J37J37p2p3k0k1K6K6j4j4L2L3l8l8QQQ6Q6o8o8L6L5Q2Q2J2J3l4l3
1099d425K5K5o7o7O7O6O7O7j7j7j7j7N2N2N2N2J8J8J8J8K9K9L0K9O9P0Q1Q1k5J60J59k5J77
1095c166J77K21M06M13N06N74Q82J072J164J247Q16P2m82l78l78r89j420j246q16n01j93k47
1092b266k47j44j43n2n1N3N3M6K32J25K17K82M67P32O40L74j79o07n15k04j12l33n18m71k87
$$ plain form
1089 -2908 -3028 -3242 -3541 -3656 -3654 -3652 -3731 -3809 -3843 -3878 -3912 -3946 -3989 -4032 -4075 -4118 -4169 -4220 -4317 -4414 -4395 -4376 -4449 -4523 -4544 -4565 -4586 -4607 -4608 -4609 -4616 -4623 -4601 -4673 -4738
1085 -4738 -4649 -4596 -4634 -4703 -4772 -4775 -4778 -4735 -4692 -4698 -4704 -4802 -4900 -4885 -4870 -4855 -4839 -4797 -4755 -4713 -4671 -4606 -4542 -4570 -4598 -4655 -4712 -4676 -4641 -4580 -4519 -4550 -4582 -4596 -4610 -4578
1081 -4578 -4546 -4542 -4539 -4581 -4624 -4626 -4629 -4631 -4633 -4659 -4685 -4711 -4736 -4684 -4632 -4673 -4713 -4728 -4743 -4703 -4662 -4685 -4554 -4342 -4346 -4404 -4463 -4381 -4300 -4361 -4423 -4484 -4546 -4421 -4297 -4264
1077 -4264 -4232 -4315 -4399 -4205 -4011 -4038 -4065 -4093 -4120 -4055 -3989 -3934 -3878 -3880 -4035 -4334 -4479 -4622 -4611 -4461 -4311 -4257 -4204 -4196 -4189 -4196 -4203 -4210 -4217 -4162 -4108 -4054 -3999 -4029
1073 -4029 -4059 -4090 -4120 -4183 -4245 -4308 -4371 -4374 -4378 -4381 -4384 -4428 -4472 -4424 -4375 -4382 -4388 -4362 -4336 -4199 -4278 -4235 -4193 -4199 -4206 -4212 -4219 -4219 -4219 -4220 -4220 -4316 -4413 -4417 -4421 -4370 -4318 -4359 -4399 -4385 -4371 -4311
1069 -4311 -4250 -4289 -4328 -4366 -4405 -4344 -4284 -4315 -4347 -4381 -4415 -4356 -4297 -4273 -4249 -4225 -4201 -4162 -4123 -4083 -4044 -4089 -4134 -4179 -4224 -4252 -4280 -4308 -4335 -4273 -4210 -4240 -4270 -4224
1065 -4224 -4178 -4137 -4097 -4070 -4135 -4241 -4193 -4140 -4178 -4247 -4163 -3961 -3851 -3773 -3694 -3759 -3823 -3796 -3768 -3781 -3794 -3807 -3820 -3798 -3775 -3845 -3915 -3928 -3940 -3953 -3965 -3950 -3935
1061 -3935 -3828 -3720 -3500 -3279 -3212 -3145 -3143 -3141 -3166 -3283 -3485 -3471 -3454 -3652 -3651 -3496 -3482 -3560 -3537 -3514 -3543 -3572 -3611 -3651 -3690 -3730 -3801 -3872 -3851 -3830 -3854 -3877
$$ packed form
1089b908j20k14k99j15KKp9p8l4l5l4l4m3m3m3m3n1n1r7r7J9J9p3p4k1k1k1k1jjppK2p2o5
1085d738Q9N3l8o9o9llM3M3oor8r8J5J5J5J6M2M2M2M2O5O4k8k8n7n7L6L5O1O1l1l2j4j4L2
1081d578L2MLm2m3klkkk6k6k6k5N2N2m1m0j5j5M0M1k3J31K12mn8n9Q2Q1o1o2o1o2J25J24L3
1077d264L2q3q4J94J94k7k7k8k7O5O6N5N6kj55k99j45j43J1J50J50N4N3QPppppN5N4N4N5l0
1073d029l0l1l0o3o2o3o3lmllm4m4M8M9poK6K6J37p9M3M2opop%%j%r6r7mmN1N2m1m0J4J4O0
1069d311O1l9l9l8l9O1O0l1l2l4l4N9N9K4K4K4K4L9L9M0L9m5m5m5m5k8k8k8k7O2O3l0l0M6
1065d224M6M1M0K7o5j06M8N3l8o9Q4K02J10P8P9o5o4K7K8j3j3j3j3K2K3p0p0j3j2j3j2J5J5
1061c935J07J08K20K21O7O7KKk5j17k02J4J7j98JJ55J4p8K3K3k9k9l9m0l9m0p1p1K1K1k4k3
$$ plain form
1057 -3877 -3901 -3924 -3916 -3908 -3899 -3891 -3963 -4036 -4062 -4089 -4074 -4060 -4191 -4321 -4301 -4128 -3943 -3850 -3832 -3813 -3708 -3603 -3438 -3274 -3263 -3252 -3233 -3215 -3196 -3178 -3210 -3242
1054 -3242 -3275 -3307 -3353 -3399 -3352 -3306 -3367 -3428 -3489 -3550 -3453 -3357 -3266 -3329 -3396 -3463 -3386 -3309 -3287 -3265 -3299 -3332 -3209 -3240 -3236 -3139 -3015 -2891 -2915 -2938 -2998 -3057 -3024
1050 -3024 -2991 -3030 -3070 -3016 -2963 -3018 -3072 -3080 -3088 -3063 -3037 -3012 -2986 -2963 -2939 -2916 -2893 -2849 -2805 -2808 -2810 -2756 -2702 -2556 -2409 -2358 -2306 -2163 -2019 -1896 -1773 -1743 -1558
1046 -1558 -1328 -1189 -836 -482 -454 -426 -398 -370 -334 -299 -601 -904 -979 -1053 -1128 -1202 -1253 -1303 -1354 -1404 -1396 -1388 -1272 -1156 -1010 -865 -642 -420 -268
1043 -268 -116 -164 -212 -179 -147 -222 -297 -336 -375 -369 -362 -217 -72 90 160 204 433 629 825 1027 1229 1482 1736 1930 2217 2503 2605 2708
1040 2708 2718 2898 3170 3311 3637 3865 4093 4443 4792 5033 5275 5612 5950 6288 6625 7144 7664 8068 8656 9237 9634 10094 10646
1037 10646 11243 11839 12376 12913 13641 14554 15544 16533 17477 18605 19739 20780 21915 23235 24655 26167 27840 29513 31400
1035 31400 33472 35563 37962 40600 43422 46533 50074 53961 58279 63197 68667 74638 80424 85922 91728 98333 105615
$$ packed form
1057c877k4k3QQRQp2p3k6k7J5J4j31j30K0J73J85R3J8J9J05J05J65J64J1J1J9J8J9J8l2l2
1054c242l3l2m6m6M7M6o1o1o1o1R7R6R1o3o7o7P7P7K2K2l4l3J23l1MR7J24J24k4k3o0n9L3
1050c024L3l9m0N4N3n5n4qqK5K6K5K6K3K4K3K3M4M4lkN4N4J46J47N1N2J43J44J23J23L0J85
1046a558K30J39L53L54K8K8K8K8L6L5l02l03p5p4p5p4n1n0n1n0QQJ16J16J46J45K23K22J52
1043b68J52m8m8L3L2p5p5l9l9OPJ45J45J62P0M4K29J96J96K02K02K53K54J94K87K86J02J03
1040B708J0J80K72J41L26K28K28L50L49K41K42L37L38L38L37N19N20M04N88N81L97M60N52
1037A0646N97N96N37N37P28R13R90R89R44J128J134J041J135J320J420J512J673J673J887
1035C1400K072K091K399K638K822L111L541L887M318M918N470N971N786N498N806O605P282
$$ plain form
1033 105615 113268 121844 131981 144025 158240 174732 194153 217205 245005 278649 319684 370379 432984 512262
1031 512262 617019 758260 943613 1169879 1423808 1631409 1685831 1609637 1514786 1440053 1312022 1070601
1030 1070601 798464 593082 459717 373295 314229 272205 241660 218558 200610 185676 172491 160599 150060
1028 150060 141060 133074 126135 120356 115132 110501 106547 103228 99909 95882 91548 87640 84040 80123 75898 71671 67537
1026 67537 63108 58125 53082 48347 44169 40423 37160 34329 31874 29604 27480 25663 23935 22392 21006 19620 18475
1024 18475 17515 16497 15479 14623 13767 12876 11985 11150 10501 9934 9182 8509 7927 7332 6830 6383 5843 5362 4880 4456 4032 3608
1022 3608 3184 2756 2328 1946 1565 1184 803 530 257 47 -162 -326 -490 -680 -870 -952 -1034 -1177 -1320 -1463 -1606 -1723 -1839 -1849
1019 -1849 -1858 -1927 -1995 -2141 -2287 -2281 -2275 -2222 -2170 -2174 -2178 -2085 -1808 -1627 -1447 -1300 -1154 -907 -660 -305 49 317 586 900 1215 1684 2154 2813
$$ packed form
1033A05615P653Q576J0137J2044J4215J6492J9421K3052K7800L3644M1035N0695O2605P9278
1031E12262J04757J41241J85353K26266K53929K07601N4422p6194r4851p4733j28031k41421
1030A070601k72137k05382j33365q6422n9066m2024l0545k3102j7948j4934j3185j1892j0539
1028A50060r000p986o939n779n224m631l954l319l319m027m334l908l600l917m225m227m134
1026F7537m429m983n043m735m178l746l263k831k455k270k124j817j728j543j386j386j145
1024A8475r60j018j018q56q56q91q91q35o49n67p52o73n82n95n02m47n40m81m82m24m24m24
1022C608m24m28m28l82l81l81l81k73k73k10k09j64j64j90j90q2q2j43j43j43j43j17j16j0
1019a849ro9o8j46j46OON3N2mmR3K77J81J80J47J46K47K47L55L54K68K69L14L15M69M70O59
$$ plain form
1016 2813 3565 4542 5702 7026 8535 10161 11971 14019 16158 18112 19758 20898 21485 21704 21247 20240 18802 16988 15173
1014 15173 13516 12044 10905 9950 9387 9132 9108 9269 9585 10086 10744 11495 12520 13854 15566 17708 20351 23547 27251 31262
1011 31262 35601 39939 43697 46531 47993 48040 46694 44180 40621 36385 31901 27510 23532 19984 17067 14826 13323 12251
1009 12251 11408 10749 10504 10351 10336 10629 11121 11612 12289 13398 14810 16529 18519 20692 22843 24809 26362 27238 27330 26621 25246
1007 25246 23317 20880 18259 15568 13185 11041 9327 8112 7205 6644 6267 6010 5937 5926 5914 5952 5990 6237 6485 6707 6837 7013
1005 7013 7374 7835 8389 9142 10080 11042 12095 13493 15198 17151 19658 22734 26364 30394 34977 39730 44175 47931 50641
1002 50641 52151 52247 50877 48338 45000 41107 37173 33423 30142 27538 25703 24422 23786 23705 23951 24628 25721 27121 28787
1000 28787 30883 33640 37198 41749 47469 54197 62094 71175 80687 89991 98126 103911 106928 106815 103686 98155 90593
$$ packed form
1016B813P52R77J160J324J509J626J810K048K139J954J646J140N87K19m57j007j438j814j815
1014A5173j657j472j139r55n63k55k4J61L16N01O58P51J025J334J712K142K643L196L704M011
1011C1262M339M338L758K834J462M7j346k514l559m236m484m391l978l548k917k241j503j072
1009A2251q43o59k45j53j5K93M92M91O77J109J412J719J990K173K151J966J553Q76R2p09j375
1007B5246j929k437k621k691k383k144j714j215r07n61l77k57p3j1j2L8L8K47K48K22J30J76
1005G013L61M61N54P53R38R62J053J398J705J953K507L076L630M030M583M753M445L756K710
1002E0641J510R6j370k539l338l893l934l750l281k604j835j281o36q1K46O77J093J400J666
1000B8787K096K757L558M551N720O728P897R081R512R304Q135N785L017j13l129n531p562
$$ plain form
998 90593 81447 71501 61826 53073 45720 39782 34982 31597 29166 27288 26104 25473 25111 25180 25644 26417 27666 29346 31446
996 31446 34100 37523 41622 46003 50198 53948 56775 58500 58687 57136 54170 50120 45269 40088 34723 29566 24963 21190
994 21190 18217 15713 13764 12344 11232 10367 9686 9086 8486 7983 7663 7456 7248 7110 6973 6824 6859 6964 7068 7338 7608 8195
991 8195 8782 9438 10401 11507 13044 14953 17171 19725 22280 24769 26827 28228 28830 28516 27525 25952 23949 21623 19112
989 19112 16828 14852 13237 12052 11404 11063 10937 11119 11443 11951 12691 13615 14816 16325 18234 20697 23721 27422 31838
987 31838 36685 41867 46740 50922 53935 55456 55317 53485 50362 46335 41508 36296 31270 26726 22860 19554 16926 15102
985 15102 13832 12800 11953 11525 11282 11225 11476 11944 12505 13325 14453 15902 17659 19677 21880 23957 25727 27005 27606 27583
983 27583 26636 24959 22851 20305 17451 14735 12204 9952 8008 6463 5226 4251 3460 2655 2036 1535 1127 736 345 -72
$$ packed form
998I0593r146r946r675q753p353n938m800l385k431j878j184o31l62O9M64P73J249J680K100
996C1446K654L423M099M381M195L750K827J725J87j551k966m050m851n181n365n157m603l773
994B1190k973k504j949j420j112q65o81o00o00n03l20k07k08j38j37j49L5J05J04K70K70N87
991H195N87O56R63J106J537J909K218K554K555K489K058J401O02l14r91j573k003k326k511
989A9112k284j976j615j185o48l41j26J82L24N08P40R24J201J509J909K463L024L701M416
987C1838M847N182M873M182L013J521j39j832l123m027m827n212n026m544l866l306k628j824
985A5102j270j032q47m28k43n7K51M68N61Q20J128J449J757K018K203K077J770J278O01k3
983B7583r47j677k108k546k854k716k531k252j944j545j237r75p91q05o19n01m08l91l91m17
$$ plain form
981 -72 -305 -503 -701 -909 -1117 -1325 -1533 -1680 -1827 -1975 -2122 -2188 -2253 -2396 -2538 -2699 -2859 -3019 -3179 -3257 -3334 -3412 -3490 -3555 -3620 -3755 -3705
977 -3705 -3608 -3695 -3827 -3866 -3825 -3783 -3813 -3843 -3860 -3876 -3892 -3909 -3925 -3941 -3957 -3973 -4028 -4083 -4137 -4192 -4197 -4201 -4206 -4211 -4270 -4328 -4341 -4353 -4320 -4286 -4329 -4373 -4408 -4444 -4479 -4515
973 -4515 -4497 -4479 -4460 -4442 -4457 -4471 -4532 -4593 -4557 -4521 -4556 -4591 -4572 -4460 -4434 -4594 -4601 -4609 -4565 -4613 -4595 -4393 -4365 -4522 -4572 -4623 -4608 -4593 -4525 -4456 -4495 -4534 -4583 -4631
969 -4631 -4541 -4451 -4461 -4471 -4373 -4275 -4278 -4280 -4175 -4069 -4154 -4239 -4155 -4071 -3953 -3836 -3655 -3659 -3620 -3489 -3234 -2793 -2436 -2080 -1450 -635 539 1900
966 1900 3137 4067 4090 3559 3124 2690 1814 507 -787 -1651 -2304 -2772 -3114 -3363 -3401 -3532 -3605 -3679 -3796 -3913 -4030 -4148 -4196 -4244
963 -4244 -4215 -4186 -4181 -4176 -4217 -4258 -4315 -4371 -4381 -4392 -4370 -4348 -4464 -4580 -4541 -4501 -4539 -4576 -4508 -4439 -4478 -4517 -4486 -4456 -4503 -4549 -4611 -4672 -4705 -4553 -4469 -4477 -4561 -4644 -4611
959 -4611 -4578 -4545 -4512 -4563 -4615 -4666 -4718 -4776 -4835 -4755 -4675 -4578 -4482 -4524 -4566 -4528 -4490 -4559 -4629 -4621 -4612 -4537 -4646 -4724 -4648 -4671 -4693 -4696 -4698 -4700 -4703 -4654 -4606 -4649 -4693 -4658 -4623
955 -4623 -4680 -4737 -4658 -4578 -4687 -4642 -4573 -4657 -4697 -4644 -4635 -4626 -4611 -4596 -4687 -4777 -4714 -4651 -4640 -4628 -4617 -4605 -4600 -4594 -4681 -4767 -4792 -4816 -4748 -4680 -4670 -4659 -4649 -4639 -4650 -4661
$$ packed form
981g2k33j98j98k08k08k08k08j47j47j48j47o6o5j43j42j61j60j60j60p8p7p8p8o5o5j35N0
977c705R7q7j32l9M1M2l0l0j7j6j6j7j6j6j6j6n5n5n4n5nmnnn9n8j3j2L3L4m3m4l5l6l5l6
973d515J8J8J9J8j5j4o1o1L6L6l5l5J9J12K6j60pqM4m8J8K02K8j57n0n1J5J5O8O9l9l9m9m8
969d631R0R0j0j0R8R8lkJ05J06q5q5Q4Q4J18J17J81mL9J31K55M41L57L56O30Q15J174J361
966A900J237R30K3n31m35m34q76j307j294q64o53m68l42k49l8j31p3p4j17j17j17j18m8m8
963d244K9K9NNm1m1n7n6j0j1K2K2j16j16L9M0l8l7O8O9l9l9L1L0m7m6o2o1l3J52Q4qq4q3L3
959d611L3L3L3n1n2n1n2n8n9Q0Q0R7R6m2m2L8L8o9p0QRP5j09p8P6k3k2lkklM9M8m3m4L5L5
955d623n7n7P9Q0j09M5O9q4m0N3RRJ5J5r1r0O3O3J1J2J1J2NOq7q6k5k4O8O8J0J1J0J0j1j1
$$ plain form
951 -4661 -4672 -4683 -4666 -4648 -4538 -4428 -4441 -4453 -4528 -4510 -4382 -4409 -4441 -4473 -4492 -4604 -4658 -4559 -4575 -4590 -4597 -4603 -4602 -4600 -4599 -4598 -4622 -4645 -4669 -4693 -4627 -4562 -4588 -4615 -4596 -4576
947 -4576 -4557 -4537 -4451 -4365 -4370 -4376 -4372 -4369 -4365 -4361 -4345 -4328 -4312 -4295 -4296 -4297 -4298 -4298 -4466 -4634 -4647 -4661 -4613 -4566 -4426 -4439 -4483 -4435 -4447 -4460 -4441 -4421 -4340 -4351 -4513 -4522 -4478 -4527
943 -4527 -4517 -4506 -4501 -4497 -4507 -4518 -4529 -4540 -4551 -4562 -4688 -4630 -4539 -4633 -4612 -4591 -4562 -4533 -4504 -4474 -4513 -4552 -4591 -4630 -4596 -4562 -4528 -4494 -4504 -4514 -4524 -4534 -4534 -4534 -4535 -4535 -4590
$$ packed form
951d661j1j1J7J8J10J10j3j2p5J8J28k7l2l2j9j12n4R9j6j5poJKJJk4k3k4k4O6O5k6k7J9K0
947d576J9K0Q6Q6noMLMMJ6J7J6J7jjj%j68j68j3j4M8M7J40j3m4M8j2j3J9K0Q1j1j62rM4m9
943d527J0J1NMj0j1j1j1j1j1j26N8R1r4K1K1K9K9K9L0l9l9l9l9L4L4L4L4j0j0j0j0%%j%n5
$$ [...]
##$OBSERVED INTEGRALS=	(X Y Z)
(7.4714027554093123129, 7.6075820205650339645, 1)
(7.0282797497438700418, 7.1298738047013134889, 0.45928945660062653333)
(3.7859162936552706036, 3.9156108318988156469, 1.5806766446849958019)
(1.7216115599455279472, 2.2360665616449200144, 1.8534278485243251833)
(2.5532579498290561837, 2.6004292366996692998, 1.6310889842590372556)
(0.88087572287568827178, 0.93212878612359661989, 1.6183905039049497621)
(4.7109127039638512002, 4.955504447449279759, 40.663457567832850259)
(2.444664837777991373, 2.5481849951104376117, 0.46227378536701385636)
(1.3368510187532287592, 1.440402912010054548, 0.44268602235448178961)
##END=	
##TITLE=	wxl20
##JCAMP-DX=	6.0	$$ MestReNova 14.1.0-24037
##BLOCK_ID=	3
##DATA TYPE=	NMR PEAK TABLE
##DATA CLASS=	PEAK TABLE
##CROSS REFERENCE=	NMR SPECTRUM: BLOCK_ID=2                                     
##.OBSERVE FREQUENCY=	399.79071365325000897
##.OBSERVE NUCLEUS=	^1H
##NPOINTS=	195
##FIRSTX=	0.7429741037290271688
##LASTX=	7.7691790197934578188
##XFACTOR=	1
##YFACTOR=	1
##FIRSTY=	0.00014638120926863015499
##XUNITS=	PPM
##YUNITS=	ARBITRARY UNITS
##PEAK TABLE=	(XYW..XYW)
0.7429741037290271688,0.00014638120926863015499,0.0046896976319339240755
0.75929628781561320228,0.0001436049351834550649,0.0044941194579012850099
0.81924677744405582924,3.061472417730322262e-05,0.0068250158226543884352
0.82697613368707201253,2.973004309379839155e-05,0.0049546827180012185596
0.85834055216203875016,6.2189364772194949816e-05,0.0052637617247602063245
0.86291947383105360725,4.5891170256831648297e-05,0.0034812560402331751454
0.87482312697259534406,3.2537545442591636483e-05,0.0035359803975946015389
0.90034859159404956319,0.028395572297591435001,0.0042766193965030193866
0.91670963492422374852,0.029798753702851628333,0.0042903538046498261582
0.94264879074113461233,0.0013562508401517390112,0.0062925189134864101953
0.95139450155455251856,0.0014651312709999472512,0.0074305672473524257693
0.97136997014558690289,0.00076300496511158490305,0.0052935682010083516882
0.97595243866983416581,0.0040592322608981271786,0.008628623463599242524
0.98417841011222195746,0.0036064859142774232867,0.0070141283674328520556
1.0055625962025134257,0.0042684257020619495449,0.007177934192249622869
1.013785349233276456,0.0044566214651085827442,0.0069567008645187609558
1.0181743522710484662,0.0011852023551879235612,0.0053896645533949502638
1.0384034507098982569,0.0019952184531581299357,0.0070552323254421357365
1.0471828303792656278,0.0019586977286320987959,0.0065537931491038061566
1.070123917932235269,0.00016608522726667198656,0.0053802007992172669326
1.1058406218266849663,3.2822079981384700003e-05,0.0027275766374580271215
1.1244189968216782294,3.7384905416523554755e-05,0.003762110205455854086
1.1654143034498014586,2.5758914886849252154e-05,0.0045684170122952229634
1.2237985930657011568,0.0001080676193311197079,0.0024810380075031080241
1.2371420735769469434,0.0007696991280002201145,0.00784084224555421129
$$ [...]
Artifact,Artifact|Weak,,1,0.089832141513698560154,0,0
Compound,None,,1,-0.0090620925204245444951,0,0
Artifact,Artifact|Weak,,1,-0.60000000000000008882,0,0
Compound,None,,1,-0.40383805940338718399,0,0
Compound,None,,1,-0.25431088787097499981,0,0
Artifact,Artifact|Weak,,1,0.38135267158643232355,0,0
Artifact,Artifact|Weak,,1,1.999999999999999778,0,0
Compound,None,,1,0.089359113616129304258,0,0
Impurity,Artifact|Weak,,1,0.049708184447246776816,0,0
Compound,Artifact|Impurity|Weak|13C Sat.,,1,0.80992792646976230486,0,0
Impurity,Artifact|Weak,,1,0.6639453075560061146,0,0
Impurity,Artifact|Weak,,1,1.9033436589950127882,0,0
Impurity,Artifact|Weak,,1,-0.56888308038992096982,0,0
Impurity,Artifact|Weak,,1,-0.40000000000000007772,0,0
Impurity,Artifact|Weak,,1,-1,0,0
Artifact,Artifact|Weak,,1,-1,0,0
Impurity,Artifact|Weak,,1,1.1881674089908456082,0,0
Impurity,Artifact|Weak,,1,-0.22854176342242576991,0,0
Artifact,Artifact|Weak,,1,-0.17974814591076659909,0,0
Compound,Artifact|Impurity|Weak|13C Sat.,,1,-0.55264810284353726999,0,0
Compound,Artifact|Impurity|Weak|13C Sat.,,1,-1,0,0
Solvent,Artifact|Impurity|Weak|13C Sat.,,1,0.83242277583106061289,0,0
Impurity,Artifact|Weak,,1,1.1250098277828752824,0,0
Compound,None,,1,0.20000000000000006661,0,0
Compound,None,,1,0.48481464495010134774,0,0
Compound,None,,1,0.44962607433786050404,0,0
Artifact,Artifact|Weak,,1,0.67183361690123266641,0,0
Impurity,Artifact|Weak,,1,1.2215271231689472931,0,0
Solvent,None,,1,0.69377273774412828722,0,0
Compound,Artifact|Impurity|Weak|13C Sat.,,1,0.24238513660022409368,0,0
Compound,Artifact|Impurity|Weak|13C Sat.,,1,-0.35822172508044597405,0,0
Compound,Artifact|Impurity|Weak|13C Sat.,,1,-1,0,0
Compound,Artifact|Impurity|Weak|13C Sat.,,1,0.036673799462973735719,0,0
Artifact,Artifact|Weak,,1,-0.043124791371955850661,0,0
Compound,Artifact|Impurity|Weak|13C Sat.,,1,0.15241579714929048839,0,0
Compound,Artifact|Impurity|Weak|13C Sat.,,1,0.77736695807805511471,0,0
Compound,Artifact|Impurity|Weak|13C Sat.,,1,0.77813234093977268202,0,0
Impurity,Artifact|Weak,,1,1.4844960315332347278,0,0
Solvent,Artifact|Impurity|Weak|13C Sat.,,1,0.80000000000000004441,0,0
Compound,None,,1,0.27801991103944240225,0,0
Compound,None,,1,0.70091811310416973768,0,0
Compound,None,,1,-0.11812820148075769966,0,0
Compound,None,,1,0.2345302027684992574,0,0
Compound,None,,1,0.25189323402549518294,0,0
Artifact,Artifact|Weak,,1,-0.82420040365762881063,0,0
Compound,None,,1,0.02790290048982868587,0,0
Compound,None,,1,0.33825841612845070072,0,0
Artifact,Artifact|Weak,,1,-0.49739148795250692769,0,0
Compound,Artifact|Impurity|Weak|13C Sat.,,1,-0.21061450784394153413,0,0
Compound,Artifact|Impurity|Weak|13C Sat.,,1,0.20000000000000006661,0,0
Artifact,Artifact|Weak,,1,0.48913652474923541291,0,0
Compound,Artifact|Impurity|Weak|13C Sat.,,1,-1,0,0
Compound,Artifact|Impurity|Weak|13C Sat.,,1,-0.2855178204004791831,0,0
Compound,Artifact|Impurity|Weak|13C Sat.,,1,0.52597736694815810932,0,0
##END=	
##END=	
