##TITLE=	nh120

##JCAMP-DX=	6.0	$$ MestReNova 14.1.0-24037
##DATA TYPE=	LINK
##BLOCK_ID=	1
##BLOCKS=	2    
##ORIGIN=	Mestrelab Research S.L.
##OWNER=	nh120
##$MNOVA/LINK_BLOCK_TYPE=	ITEM	$$ NMR Spectrum
##$MNOVA/ITEM/POLYGON=	(XY..XY)
5321,5835
8722,5835
8722,8208
5321,8208
5321,5835
##$MNOVA/ITEM/Z=	0
##$MNOVA/ITEM/ANGLE=	0
##TITLE=	nh120
##JCAMP-DX=	6.0	$$ MestReNova 14.1.0-24037
##BLOCK_ID=	2
##DATA TYPE=	NMR SPECTRUM
##DATA CLASS=	XYDATA
##NUMDIM=	1
##ORIGIN=	JEOL
##OWNER=	nh120
##.OBSERVE FREQUENCY=	399.79071365325000897
##.OBSERVE NUCLEUS=	^1H
##.SOLVENT NAME=	CHLOROFORM-D
##.PULSE SEQUENCE=	proton.jxp
##LONGDATE=	2021/03/16 16:08:10.000
##.ACQUISITIONMODE=	SIMULTANEOUS
##$ORIGINAL FORMAT=	JEOL Delta
##$MNOVA/SCALES_VERSION=	8
##$PARAMETER FILE=	(datafile, ASCII, //icnas4.cc.ic.ac.uk/nh120/downloads/nh120_PROTON-1-1.jdf, 0)
$$ 
##$PARAMETER FILE=	(footer, BASE64, //icnas4.cc.ic.ac.uk/nh120/downloads/nh120_PROTON-1-1.jdf, 540672)
AQAAANkdAABoZWFkZXIKICAgIGZpbGVuYW1lICAgICAgICA9PiAibmgxMjBfUFJPVE9OIjsKICAgIHNh
bXBsZV9pZCAgICAgICA9PiAibmgxMjAiOwogICAgY29tbWVudCAgICAgICAgID0+ICIiOwogICAgcHJv
Y2VzcyAgICAgICAgID0+ICJwcm90b25fYXV0b3BoYXNlLmxpc3QiOwogICAgYXV0b19kd2VsbCAgICAg
ID0gIFRSVUU7CiAgICBhdXRvX2ZpbHRlciAgICAgPSAgVFJVRTsKICAgIGF1dG9fZ2FpbiAgICAgICA9
PiBUUlVFOwogICAgZmlsdGVyX2xpbWl0ICAgID0+IDE2OwogICAgZm9yY2VfZHVhbF9tb2RlID0+IEZB
TFNFOwogICAgZGVjaW1hdGlvbl9yYXRlID0gIDA7CiAgICBmb3JjZV90dW5lICAgICAgPT4gRkFMU0U7
CiAgICBzYXZlX2Fib3J0ZWQgICAgPSAgVFJVRTsKICAgIHZlY3RvciAgICAgICAgICA9ICBUUlVFOwpl
bmQgaGVhZGVyOwoKaW5zdHJ1bWVudAogICAgcmVjdnJfZ2FpbiA9PiA0NjsKZW5kIGluc3RydW1lbnQ7
CgphY3F1aXNpdGlvbgogICAgeF9kb21haW4gICAgID0+ICJQcm90b24iOwogICAgeF9vZmZzZXQgICAg
ID0+IDVbcHBtXTsKICAgIHhfc3dlZXAgICAgICA9PiAxNVtwcG1dOwogICAgeF9wb2ludHMgICAgID0+
IDMyNzY4OwogICAgc2NhbnMgICAgICAgID0+IDg7CiAgICB4X3ByZXNjYW5zICAgPT4gMDsKICAgIG1v
ZF9yZXR1cm4gICA9PiAxOwogICAgeF9hY3FfdGltZSAgID0/IHhfcG9pbnRzIC8geF9zd2VlcDsKICAg
IHhfcmVzb2x1dGlvbiA9PyAxIC8geF9hY3FfdGltZTsKZW5kIGFjcXVpc2l0aW9uOwoKcHVsc2UKICAg
IGNvbGxlY3QgQ09NUExFWCxPQlM7CgogICAgbWFjcm8gb2JzX3ByZXNhdF90aW1lKCBkYW50ZV9wcmVz
YXQsIGRhbnRlX2xvb3AsIGRhbnRlX3B1bHNlLCBkYW50ZV9pbnRlcnZhbCwgcGhhc2VfZGFudGUsIHBo
c19zaGZ0LCBkYW50ZV9hdHRlbnVhdG9yLCBwcmVzYXRfdGltZSApIGlzCiAgICAgICAgd2hlbiBkYW50
ZV9wcmVzYXQgZG8KICAgICAgICAgICAgbG9vcCAxMDAgKiBkYW50ZV9sb29wIHRpbWVzCiAgICAgICAg
ICAgICAgICBkYW50ZV9wdWxzZSwgKE9CUy5HQVRFLCBPQlMuUEhTLnBoYXNlX2RhbnRlLmxzdGVwKHBo
c19zaGZ0KSwgT0JTLkFUTi5kYW50ZV9hdHRlbnVhdG9yKTsKICAgICAgICAgICAgICAgIGRhbnRlX2lu
dGVydmFsOwogICAgICAgICAgICBlbmQgbG9vcDsKICAgICAgICBlbmQgd2hlbjsKICAgICAgICB3aGVu
IG5vdCBkYW50ZV9wcmVzYXQgZG8KICAgICAgICAgICAgcHJlc2F0X3RpbWU7CiAgICAgICAgZW5kIHdo
ZW47CiAgICBlbmQgb2JzX3ByZXNhdF90aW1lOwoKICAgIG1hY3JvIGFjcSggZGVhZF90aW1lLCBkZWxh
eSwgcGhhc2UgKSBpcwogICAgICAgIGRlYWRfdGltZSwgT0JTLlBIUy4wOwogICAgICAgIGRlbGF5LCAo
T0JTLlBIUy4wLCBSQ1YuR0FURSk7CiAgICAgICAgYWNxdWlyZSAoT0JTLlBIUy4wLCBSQ1YuUEhTLnBo
YXNlKTsKICAgIGVuZCBhY3E7CgogICAgZXhwZXJpbWVudCAgICAgICAgICAgID0gICJwcm90b24uanhw
$$ [...]
AAAAAAAAAAAAAAAAAAAAAAAAAAAAAAAAAAAAAAAAAAAAAAAAAAAAAAAAAAAAAAAAAAAAAAAAAAAAAAAA
AAAAAAAAAAAAAAAAAAAAAAAAAAAAAAAAAAAAAAAAAAAAAAAAAAAAAAAAAAAAAAAAAAAAAAAAAAAAAAAA
AAAAAAAAAAAAAAAAAAAAAAAAAAAAAAAAAAAAAAAAAAAAAAAAAAAAAAAAAAAAAAAAAAAAAAAAAAAAAAAA
AAAAAAAAAAAAAAAAAAAAAAAAAAAAAAAAAAAAAAAAAAAAAAAAAAAAAAAAAAAAAAAAAAAAAAAAAAAAAAAA
AAAAAAAAAAAAAAAAAAAAAAAAAAAAAAAAAAAAAAAAAAAAAAAAAAAAAAAAAAAAAAAAAAAAAAAAAAAAAAAA
AAAAAAAAAAAAAAAAAAAAAAAAAAAAAAAAAAAAAAAAAAAAAAAAAAAAAAAAAAAAAAAAAAAAAAAAAAAAAAAA
AAAAAAAAAAAAAAAAAAAAAAAAAAAAAAAAAAAAAAAAAAAAAAAAAAAAAAAAAAAAAAAAAAAAAAAAAAAAAAAA
AAAAAAAAAAAAAAAAAAAAAAAAAAAAAAAAAAAAAAAAAAAAAAAAAAAAAAAAAAAAAAAAAAAAAAAAAAAAAAAA
AAAAAAAAAAAAAAAAAAAAAAAAAAAAAAAAAAAAAAAAAAAAAAAAAAAAAAAAAAAAAAAAAAAAAAAAAAAAAAAA
AAAAAAAAAAAAAAAAAAAAAAAAAAAAAAAAAAAAAAAAAAAAAAAAAAAAAAAAAAAAAAAAAAAAAAAAAAAAAAAA
AAAAAAAAAAAAAAAAAAAAAAAAAAAAAAAAAAAAAAAAAAAAAAAAAAAAAAAAAAAAAAAAAAAAAAAAAAAAAAAA
AAAAAAAAAAAAAAAAAAAAAAAAAAAAAAAAAAAAAAAAAAAAAAAAAAAAAAAAAAAAAAAAAAAAAAAAAAAAAAAA
AAAAAAAAAAAAAAAAAAAAAAAAAAAAAAAAAAAAAAAAAAAAAAAAAAAAAAAAAAAAAAAAAAAAAAAAAAAAAAAA
AAAAAAAAAAAAAAAAAAAAAAAAAAAAAAAAAAAAAAAAAAAAAAAAAAAAAAAAAAAAAAAAAAAAAAAAAAAAAAAA
AAAAAAAAAAAAAAAAAAAAAAAAAAAAAAAAAAAAAAAAAAAAAAAAAAAAAAAAAAAAAAAAAAAAAAAAAAAAAAAA
AAAAAAAAAAAAAAAAAAAAAAAAAAAAAAAAAAAAAAAAAAAAAAAAAAAAAAAAAAAAAAAAAAAAAAAAAAAAAAAA
AAAAAAAAAAAAAAAAAAAAAAAAAAAAAAAAAAAAAAAAAAAAAAAAAAAAAAAAAAAAAAAAAAAAAAAAAAAAAAAA
AAAAAAAAAAAAAAAAAAAAAAAAAAAAAAAAAAAAAAAAAAAAAAAAAAAAAAAAAAAAAAAAAAAAAAAAAAAAAAAA
AAAAAAAAAAAAAAAAAAAAAAAAAAAAAAAAAAAAAAAAAAAAAAAAAAAAAAAAAAAAAAAAAAAAAAAAAAAAAAAA
AAAAAAAAAAAAAAAAAAAAAAAAAAAAAAAAAAAAAAAAAAAAAAAAAAAAAAAAAAAAAAAAAAAAAAAAAAAAAAAA
AAAAAAAAAAAAAAAAAAAAAAAAAAAAAAAAAAAAAAAAAAAAAAAAAAAAAAAAAAAAAAAAAAAAAAAAAAAAAAAA
AAAAAAAAAAAAAAAAAAAAAAAAAAAAAAAAAAAAAAAAAAAAAAAAAAAAAAAAAAAAAAAAAAAAAAAAAAAAAAAA
AAAAAAAAAAAAAAAAAAAAAAAAAAAAAAAAAAAAAAAAAAAAAAAAAAAAAAAAAAAAAAAAAAAAAAAAAAAAAAAA
AAAAAAAAAAAAAAAAAAAAAAAAAAAAAAAAAAAAAAAAAAAAAAAAAAAAAAAAAAAAAAAAAAAAAAAAAAAAAAAA
AAAAAAAAAAAAAAAAAAAAAAAAAAAAAAAAAAAAAAAAAAAAAAAAAAAAAAAAAAAAAAAAAAAAAAAAAAAAAAAA
AAAAAAAAAAAAAAAAAAAAAAAAAAAAAAAAAAAAAAAAAAAAAAAAAAAAAAAAAAAAAAAAAAAAAAAAAAAAAAAA
AAAAAAAAAAAAAAAAAAAAAAAAAAAAAAAAAAAAAAAAAAAAAAAAAAAAAAAAAAAAAAAAAAAAAAAAAAAAAAAA
AAAAAAAAAAAAAAAAAAAAAAAAAAAAAAAAAAAAAAAAAAAAAAAAAAAAAAAAAAAAAAAAAAAAAAAAAAAAAAAA
AAAAAAAAAAAAAAAAAAAAAAAAAAAAAAAAAAAAAAAAAAAAAAAAAAAAAAAAAAAAAAAAAAAAAAAAAAAAAAAA
AAAAAAAAAAAAAAAAAAAAAAAAAAAAAAAAAAAAAAAAAAAAAAAAAAAAAAAAAAAAAAAAAAAAAAAAAAAAAAAA
AAAAAAAAAAAAAAAAAAAAAAAAAAAAAAAAAAAAAAAAAAAAAAAAAAAAAAAAAAAAAAAAAAAAAAAAAAAAAAAA
AAAAAAAAAAAAAAAAAAAAAAAAAAAAAAAAAAAAAAAAAAAAAAAAAAAAAAAAAAAAAAAAAAAAAAAAAAAAAAAA
AAAAAA==
##XUNITS=	HZ
##YUNITS=	ARBITRARY UNITS
##FIRSTX=	4996.5554867314731382
##LASTX=	-998.64835019898293922
##DELTAX=	-0.11434900221118954322
##XFACTOR=	1
##YFACTOR=	1.1984129539895273551e-07
##FIRSTY=	-0.00055084994528442621231
##MINY=	-0.00064811389893293380737
##MAXY=	0.45478585362434387207
##NPOINTS=	52430
##XYDATA=	(X++(Y..Y))
$$ [...]
2619d966RRMMM6m1p4P1l7l8k8k8L8L8L8L8k1k1j6J30n5n4lkJ2J1l2l2N7N7J4J3m1m2J36rj13
2614d928L2j5j5N4N4r1r2O0O0J1J1pr3l9J06n3n3L9J26ok09PR4m8m8j3P3M1j04o6K1m5m5M7
2610e134M7j5j6j5j5J7J8k6k6M1M1J28J28mmm7m7J3J4J00J00j6j6j6j6j6j6j6j6L1L2n6n6
2607d879J5J5J5J5j0j0j0j0M1M2kkp2p3J4J5n3n2L4L4J7J6k7k8j%Q6Q6o7o6P9P8m5m6m5m6
2603d942l4l4J0J0L9M0m8m7K7K7n9o0J08J07l8l8k3k4O4O3ONONj5j6j5j6OPOO%J%%l0l0l1
2598d957l0rrP8P9PQPQJ3J3J3J3k9k8k9k8O2O3q2NM1j04p1J6N6l1o3Q2L9m9N8k8J9K0J4J4
2594d819J4J4J4J5p8p7p8p7K2K3K7K8P2J58M6r8l4l3m3m3l7l7N0N0J9J9o8o8Q7Q7n8n8K1K2
2590d918o0o0J2R9nj49l8J08O6k1K7K6K1K2l0l0k9l0M6M7J33j1j15k8N0l7p4p5J23J23n7n6
$$ y = [-4966, -4957, -4948, -4944, -4940, -4894, -4935, -5009, -4938, -4975, -5013, -5041, -5069, -5031, -4993, -4955, -4917, -4938, -4959, -4975, -4845, -4900, -4954, -4957, -4959, -4947, -4936, -4968, -5000, -4943, -4886, -4872, -4859, -4900, -4942, -4806, -4815, -4928, -4896, -4911, -4926, -4872, -4818, -4909, -5001, -4941, -4881, -4870, -4859, -4866, -4959, -4998, -4892, -4945, -4998, -4959, -4833, -4839, -5048, -5041, -4947, -4995, -5043, -5056, -4983, -4942, -5046, -5112, -5091, -5136, -5181, -5134, -5087, -5102, -5118, -5133, -5148, -5131, -5113, -5139, -5165, -5124, -5083, -4955, -4827, -4831, -4835, -4882, -4929, -4916, -4902, -4802, -4702, -4718, -4734, -4750, -4766, -4782, -4798, -4814, -4830, -4799, -4767, -4823, -4879, -4864, -4849, -4834, -4819, -4829, -4839, -4849, -4859, -4818, -4776, -4778, -4780, -4852, -4925, -4911, -4896, -4949, -5001, -4967, -4933, -4916, -4900, -4927, -4955, -4956, -4956, -4870, -4784, -4851, -4917, -4838, -4760, -4805, -4851, -4896, -4942, -4976, -5010, -5000, -4990, -4951, -4911, -4959, -5006, -4979, -4952, -5011, -5071, -4963, -4856, -4894, -4932, -4955, -4979, -4915, -4852, -4846, -4841, -4835, -4830, -4845, -4861, -4876, -4892, -4886, -4879, -4873, -4867, -4867, -4866, -4866, -4866, -4896, -4926, -4957, -4987, -4996, -5005, -4927, -4848, -4841, -4833, -4826, -4818, -4805, -4792, -4779, -4766, -4795, -4823, -4852, -4880, -4818, -4755, -4837, -4832, -4791, -4895, -4966, -4950, -4894, -4925, -4988, -4906, -4867, -4916, -4858, -4886, -4867, -4847, -4833, -4819, -4805, -4791, -4777, -4762, -4840, -4917, -4995, -5072, -5050, -5027, -5000, -4972, -4900, -4742, -4696, -4794, -4828, -4861, -4904, -4947, -4984, -5021, -4971, -4921, -4902, -4883, -4951, -5019, -4932, -4845, -4903, -4961, -4940, -4918, -4978, -5038, -5026, -4927, -4932, -5081, -5119, -5011, -4945, -4966, -4939, -4913, -4892, -4870, -4900, -4930, -4959, -4989, -4943, -4896, -4763, -4774, -4889, -4917, -4867, -4904, -4978, -5053, -4930, -4807, -4864, -4920]
2586d920L0L1m1m0m0m0p1p1P3P4O7O7k0k0l3l3N5N4j%jjj09j09L5J23J07l9l8l8r6r6J65J64
2582d812l7l7l7l8J6J5J5J5qqqqM1M1m6m7K9K9K8K9K1K2o6o6L3L3L3L3q2q1O4O3o9o9l3J40
2578d852P4j00q9Q5l7l6O1O1K9K9K9K8l4l4j21j21M6M6M6M5O0N9k7k7M3M3j02j01lkQ5Q4p3
2575d806p3J4J4j0j1j1j1j1j0j1j1m7m7M0M1k2k1O5O6j8j7j8j7J0J0RJ0nnnmk7k7k6k7J4J3
2570d992J4J4poooQ4Q5o0o0m8m7L9M0P7P6o8o8LKr5P9M2M2O4j09l4l4M3M2KLLKLKJ06o8pQ1
2566d767pr3r9P5K6o1o3K4M6M5O9j04j10O3J01J4j9j9k4j12p3J01qqL0J17P7r7m3M5LLQQO
2562d846Nl8l8J9J9o8o9RRRQK3K4o4o4J6J6J6J6l0l0J15J15JJJ7j57J4J01Lq3l5l5M6M7rr
2557d926rj0O2O2O1O2o3o2o2o2M4M4M4M4nnm8m9n2n3o9J04J36M9r4r5K3K3k1k1J4J4J4J5M1
$$ y = [-4920, -4890, -4859, -4900, -4940, -4980, -5020, -5091, -5162, -5089, -5015, -4948, -4881, -4901, -4921, -4954, -4987, -4932, -4878, -4879, -4879, -4880, -4881, -4990, -5099, -5064, -4941, -4834, -4873, -4911, -4949, -5045, -5141, -4976, -4812, -4849, -4886, -4923, -4961, -4945, -4930, -4915, -4900, -4908, -4916, -4924, -4932, -4891, -4850, -4896, -4943, -4914, -4885, -4857, -4828, -4807, -4785, -4851, -4917, -4884, -4851, -4818, -4785, -4867, -4948, -4884, -4821, -4890, -4959, -4992, -4852, -4778, -4878, -4967, -4882, -4919, -4955, -4894, -4833, -4804, -4775, -4746, -4718, -4752, -4786, -4907, -5028, -4982, -4936, -4890, -4845, -4785, -4726, -4753, -4780, -4737, -4694, -4796, -4897, -4900, -4902, -4817, -4733, -4806, -4879, -4865, -4851, -4861, -4872, -4883, -4894, -4905, -4915, -4926, -4937, -4984, -5031, -4991, -4950, -4972, -4993, -4928, -4862, -4880, -4897, -4915, -4932, -4922, -4912, -4903, -4893, -4898, -4903, -4908, -4912, -4939, -4966, -4992, -5019, -5005, -4992, -4978, -4964, -4971, -4977, -4983, -4989, -4905, -4820, -4880, -4940, -4988, -5035, -4996, -4956, -4879, -4803, -4871, -4939, -4936, -4934, -5029, -4950, -4908, -4866, -4802, -4911, -4945, -4979, -4936, -4894, -4892, -4889, -4886, -4884, -4881, -4879, -4773, -4841, -4848, -4767, -4774, -4867, -4966, -4891, -4865, -4926, -4989, -4965, -4919, -4874, -4805, -4909, -5019, -4956, -4855, -4841, -4860, -4879, -4903, -5015, -5088, -4987, -4995, -5003, -4973, -4856, -4779, -4876, -4919, -4874, -4871, -4868, -4860, -4852, -4846, -4841, -4879, -4917, -4898, -4879, -4947, -5016, -5007, -4998, -4989, -4981, -4958, -4934, -4998, -5062, -5046, -5030, -5014, -4998, -5028, -5058, -4943, -4828, -4827, -4826, -4809, -4966, -4952, -4851, -4848, -4931, -4966, -5001, -4955, -4908, -4917, -4926, -4935, -4945, -4883, -4821, -4760, -4698, -4761, -4823, -4885, -4947, -4903, -4859, -4815, -4771, -4776, -4781, -4829, -4878, -4930, -4983, -5052, -4948, -4812, -4763, -4857, -4952, -4929, -4906, -4927, -4948, -4934, -4920, -4906, -4891, -4850]
2553d850M1kkJ5J5p2p2J2J2p5p5K2K2K1K2NONOK7K7K7K7m3m2JJj4j3P3P4n8n8K9L0n0n0m9
2549e005n0j1j1P7P6nnL9L8L6L6j09j09NNNNM9N0M9N0n4n4j0j0P4P4j2j3mmr1r0rqqrk4k5
2545e062J9J8J09J08K2K1k9k9k9k9K5K5K5K5n7n8P7P6Q4r0j56J35K3K3m6m5n5n5j1j2L3L3
2541d882P7P6q2q3O2O2K7K7o0o0P4P5p1p1L2L1n6n5J%J%J6J5p2p1l1l1J3J2j0j0P7P6QQJ2
2537d863j34o9P5J16l0o1K6OR2J3J3J8J9n1n0n1n1m9m9L7L8nnK9K9J32j3j06L9Q2nl4l4LM
2533d889q3q4PON0N0k2k1O5O5k3k4k3J21K9n7r2oN6N6k6k6k8k8L1n7o7P7m2j29J4J01J5p3
2529e057j0P6J10J09pqn1n2n7n8L0K9M2M3j03j03L7L8L8L7qqL5L5r9j00j03M1J34j1ppM5M5
2525d925m2m1M1M1m6m6L3L3P7P6j6j7j7j62j2P5J6J7K8K7K8K8NOq1q1M7M7m1m0J6J6p2p1l
$$ y = [-4850, -4809, -4811, -4813, -4798, -4783, -4855, -4927, -4915, -4903, -4978, -5053, -5031, -5009, -4988, -4966, -4961, -4955, -4950, -4944, -4917, -4890, -4863, -4836, -4879, -4921, -4920, -4919, -4933, -4946, -4873, -4799, -4857, -4915, -4886, -4856, -4906, -4956, -5005, -5055, -5066, -5077, -5000, -4924, -4929, -4934, -4895, -4857, -4821, -4785, -4894, -5003, -4998, -4993, -4988, -4983, -4934, -4884, -4835, -4785, -4839, -4893, -4903, -4913, -4839, -4765, -4777, -4790, -4794, -4798, -4889, -4979, -4988, -4996, -5004, -5013, -5037, -5062, -5043, -5025, -4916, -4808, -4786, -4765, -4794, -4823, -4852, -4881, -4856, -4831, -4806, -4781, -4838, -4896, -4819, -4743, -4659, -4749, -4905, -4770, -4747, -4724, -4770, -4815, -4870, -4925, -4936, -4948, -4915, -4882, -4805, -4729, -4811, -4894, -4832, -4770, -4743, -4716, -4776, -4836, -4762, -4687, -4758, -4829, -4797, -4766, -4822, -4877, -4876, -4876, -4875, -4875, -4859, -4844, -4916, -4987, -5018, -5049, -5036, -5024, -5034, -5044, -4967, -4891, -4883, -4875, -4863, -4997, -5066, -4991, -4875, -4905, -4966, -4940, -4934, -4842, -4829, -4816, -4798, -4779, -4830, -4880, -4931, -4982, -5031, -5080, -5043, -5005, -5010, -5015, -4986, -4957, -4825, -4838, -4944, -4905, -4823, -4828, -4862, -4896, -4893, -4889, -4972, -5056, -5049, -5043, -4993, -4943, -4965, -4986, -4921, -4856, -4879, -4903, -4926, -4805, -4776, -4833, -4925, -4931, -4875, -4819, -4845, -4871, -4899, -4927, -4896, -4953, -5020, -4943, -4985, -5114, -5100, -4999, -4984, -5057, -5067, -4991, -4881, -4772, -4779, -4787, -4838, -4890, -4947, -5005, -4975, -4946, -4904, -4861, -4964, -5067, -5030, -4992, -4954, -4917, -4925, -4933, -4898, -4863, -4962, -5062, -5165, -5124, -4990, -5001, -5008, -5015, -4970, -4925, -4967, -5008, -4967, -4926, -4972, -5018, -4985, -4952, -4875, -4799, -4815, -4832, -4849, -5011, -5023, -4948, -4932, -4915, -4887, -4860, -4832, -4804, -4799, -4793, -4874, -4955, -4908, -4861, -4902, -4942, -4926, -4910, -4982, -5053, -5056]
2521e056lklP4P4P4P4o0o0j25M8J37l8p3p4K9K9n7n8L1L1j3j3jkL6L7K2o4q0R3J33m0O8O8
2517d764k0k0k0k0l9l9l9l8K3K4K3K4j0j0n3n3L6L6n0n1M3M2l8l9MR2Jj73m8L9p0J7N9N9O4
2513e008O5RJ0n0L8R3q1o4o5m8m8R7R7lkP3P4M5j28j28M6k2k1j0j1mmnmM5M4m2m2RRRJ0k7
2509e044k7j6j6j05O9N8N8K0K0K0K0qpqpJ4J4J4J4RRJ17n6r0Q4k4k5MMM7M7o2o2K4K5KLKL
2504d856m6m7M1M0J1J1p5p6jjM3M3L8L9m9m9OOk7k7l4J39M2M1p6p6J1J0j6j7K6K7kjjkK1K0
2500d864j24j24K3K2K3K2L5L4L5L5J0J0K1j53J5J4n0J23K1K1j13j13P9Q0pqNONNn6n6Q8Q9
2496d847m2m2M5M5j8j8j9j8o2o2K5K6QQj00P4J28m6k5k4K2K2J2J1M0j33j45K9J37l8j83qJ42
2492e056l1o4J10K8K7J2p6n4J20K2o5k5k6N6N7K6K6K6K6klklk4k4k4k4k7k6l2l1R3Oj35L9
$$ y = [-5056, -5059, -5061, -5064, -4990, -4916, -4842, -4768, -4828, -4888, -5013, -4965, -4828, -4866, -4939, -5013, -4984, -4955, -5012, -5070, -5039, -5008, -5021, -5034, -5035, -5037, -5001, -4964, -4942, -5006, -5086, -4993, -4860, -4900, -4832, -4764, -4784, -4804, -4824, -4844, -4883, -4922, -4961, -4999, -4976, -4952, -4929, -4905, -4915, -4925, -4978, -5031, -4995, -4959, -5009, -5060, -5017, -4975, -5013, -5052, -5048, -4956, -4955, -5128, -5176, -5137, -5207, -5190, -5131, -5072, -5008, -4943, -4934, -4924, -4974, -4936, -4843, -4924, -4988, -5053, -5101, -5149, -5052, -4955, -4958, -4960, -4887, -4813, -4768, -4896, -5024, -4978, -5000, -5021, -5031, -5042, -5046, -5050, -5055, -5059, -5014, -4970, -5012, -5054, -5045, -5036, -5027, -5017, -5044, -5071, -5087, -5103, -5208, -5139, -5081, -5023, -5003, -4983, -4963, -4943, -4951, -4958, -4966, -4973, -4959, -4945, -4931, -4917, -4908, -4899, -4782, -4838, -4928, -4844, -4868, -4893, -4889, -4885, -4838, -4791, -4853, -4915, -4891, -4866, -4864, -4861, -4859, -4856, -4902, -4949, -4908, -4868, -4857, -4846, -4921, -4997, -4998, -4999, -4956, -4913, -4875, -4836, -4885, -4934, -4928, -4922, -4949, -4976, -5010, -4871, -4829, -4788, -4864, -4940, -4929, -4919, -4935, -4952, -4926, -4899, -4901, -4902, -4903, -4905, -4884, -4864, -4988, -5112, -5089, -5067, -5044, -5022, -4987, -4953, -4918, -4883, -4873, -4863, -4842, -4995, -4980, -4966, -5016, -4893, -4872, -4851, -4964, -5077, -4998, -4918, -4925, -4933, -4928, -4922, -4917, -4912, -4968, -5024, -4936, -4847, -4889, -4931, -4886, -4841, -4859, -4877, -4896, -4914, -4976, -5038, -5013, -4987, -4979, -4971, -5071, -4997, -4869, -4915, -4940, -4964, -4942, -4920, -4908, -4897, -4857, -4990, -5135, -5106, -4969, -5007, -5190, -5198, -5056, -5087, -5151, -5041, -5013, -4986, -4974, -5050, -5104, -4984, -4962, -5027, -5052, -5078, -5022, -4965, -4939, -4913, -4887, -4861, -4863, -4866, -4868, -4871, -4895, -4919, -4943, -4967, -4994, -5020, -5052, -5083, -4990, -4984, -5119, -5080]
2488e080Oq2O5O6P3P3j3j4K1K0k3k2k3k3K0K1pqK0J06L5j39q4Kk2k3j7j7M9M9OOp0p0J7J7
2484e065M1M2m6m5R3R3n2n1l1l1J2J3l8l7M9N0J3J4p4p4O0O0J6J6noL8L8lmr0r1P5P6j2j2
2480d968qrrqOOOOm3m3J02J02J4J5l0k9p8p8RRL7L7n0n0M8M7m0m0OOl7l7O6O6O6O6l5l6RQ
2475d891m5m6M2M2m4m4J01J01p0p0r2Q2J29m4q1q1J7J6J14J15j29M4L4L4j9j8o2o2K5K4K4
2472d854K4n3n3L5L4j0rn3n3J4J3N8N7n0n0L8L7o8o9J9J9k0j9j9k0k9k9N7N8L3L3k1k1R5p8
2468d954J9K0m5m5m5m5M2M1M2M2jjq8q8k6k6J7J8N6N7O7j06n3n2Q2Q2O0O0p6p6j16K8P8j0
2464e042O2k6J8J7kllkqqrqN1N0l7l7OOl7l8J02J01m3m4k5k6J8J9m3m2l7l7N3J40J23p9q8
2460d958%K4K5qqpqN9O0k8k7K7K7O0j44o4K4j3P4Q1j21r5pM5M6PPKKKKJKJj43n1L6O5O5L5
$$ y = [-5080, -5074, -5156, -5091, -5025, -4952, -4879, -4892, -4906, -4885, -4865, -4888, -4910, -4933, -4956, -4936, -4915, -4922, -4930, -4910, -4804, -4769, -4908, -4992, -4990, -5012, -5035, -5052, -5069, -5020, -4971, -4965, -4959, -5029, -5099, -5082, -5065, -5024, -4982, -5028, -5073, -4980, -4887, -4939, -4990, -5021, -5052, -5040, -5027, -5065, -5102, -5053, -5003, -4990, -4976, -5050, -5124, -5064, -5004, -4988, -4972, -4977, -4983, -4945, -4907, -4910, -4914, -5004, -5095, -5020, -4944, -4956, -4968, -4976, -4985, -4994, -5002, -4996, -4990, -4984, -4978, -5021, -5064, -4962, -4860, -4846, -4831, -4861, -4890, -4968, -5046, -5037, -5028, -4991, -4954, -5004, -5054, -5006, -4959, -4999, -5039, -5033, -5027, -5064, -5101, -5035, -4969, -4903, -4837, -4872, -4908, -4899, -4891, -4936, -4982, -4940, -4898, -4942, -4986, -4885, -4784, -4854, -4924, -5016, -4934, -4805, -4849, -4930, -5011, -4994, -4978, -4864, -4749, -4878, -4834, -4800, -4766, -4785, -4803, -4865, -4927, -4902, -4878, -4854, -4830, -4883, -4936, -4901, -4867, -4877, -4886, -4939, -4992, -4978, -4965, -4907, -4850, -4900, -4950, -4912, -4875, -4943, -5012, -4993, -4974, -4994, -5013, -5032, -5052, -5081, -5110, -5053, -4995, -4962, -4929, -4950, -4971, -4876, -4954, -4935, -4915, -4960, -5005, -5050, -5095, -5053, -5012, -4970, -4928, -4929, -4930, -5018, -5106, -5132, -5158, -5141, -5123, -5067, -5010, -4943, -5049, -5102, -5154, -5072, -4990, -4930, -4870, -4946, -5022, -5138, -5110, -5032, -5042, -4980, -5006, -4988, -4971, -4973, -4976, -4979, -4981, -4989, -4997, -5006, -5014, -4963, -4913, -4950, -4987, -4981, -4975, -5012, -5050, -4948, -4847, -4890, -4934, -4959, -4985, -4967, -4948, -4991, -5033, -5070, -5107, -5054, -4914, -4791, -4870, -4958, -4958, -4934, -4909, -4917, -4925, -4932, -4940, -4881, -4821, -4849, -4876, -4849, -4822, -4762, -4906, -4970, -4946, -4959, -4885, -4804, -4925, -5020, -5027, -4982, -4936, -4929, -4922, -4920, -4918, -4916, -4914, -4913, -4911, -4910, -5053, -5104, -5068, -5003, -4938, -4903]
2455d903L5n2n2m4m4M3M3rrL5L4k5k5o9o9J4J4J3J4L3L3n5n4l9l9J07J06O8O8K4K5p4p4l1
2451d958l1P1P1j6j7J8J8J8J8J2J2J3J2n1n2n1n1M8M8M9M8j02j03nmq5Q8n2n3J06J06l9l9
2447d953j24j23J37J38o8o8J9J9qpL6L6o3o4Q1Q2k0j9j9j9L7L8L8L8J1J0J1J1j33j33J2J2
2444e055J0J0J0J0J8J8J8J8llm6m7k9k9N8N7k3k4J9K0M1M0m6m7ONNNj7j7poj11O2N2N1M8M8
2439d881r8r7J0J1N4N3K0J9L0j44o0n9P4P4L8L7n0n0M0L9L9L9j04j04n7J18Q1Q1NMnonoq1
2435d941q2NOJ9K0L0L0j16N7M7M6k8k8j15j15K3K4O7O7k1k0k1k0M2M2O4j10q1R3j5j6M2M2
2432d963m6m5m7m8mlL5L5J22J22j%q8q8M9M9l7l8M8M9NNkkm6m6K1K1p7R7N9N9p5p5qpL5L6
2427d899K7K6j6j7n5n5n5n5QQPQK3K4K3K3L3L2L3L2o9p0k2J52n0n0NNk4k3J9K0m6m5M1M2n5
$$ y = [-4903, -4868, -4920, -4972, -5016, -5060, -5017, -4974, -4983, -4992, -4957, -4923, -4948, -4973, -5042, -5111, -5097, -5083, -5070, -5056, -5023, -4990, -5045, -5099, -5138, -5177, -5070, -4964, -4896, -4828, -4804, -4779, -4853, -4927, -4958, -4989, -4918, -4847, -4863, -4880, -4862, -4844, -4826, -4808, -4796, -4784, -4771, -4759, -4810, -4862, -4913, -4964, -4916, -4868, -4819, -4771, -4873, -4976, -4981, -4985, -5070, -4982, -5034, -5087, -4981, -4875, -4914, -4953, -5077, -5200, -5063, -4925, -4993, -5061, -5042, -5023, -5031, -5038, -5002, -4966, -5029, -5093, -5012, -4930, -4950, -4969, -4988, -5007, -4970, -4932, -4894, -4856, -4845, -4835, -4824, -4813, -4946, -5079, -5067, -5055, -5045, -5035, -5025, -5015, -4997, -4979, -4961, -4943, -4946, -4949, -4995, -5042, -5071, -5100, -5042, -4985, -5008, -5032, -5013, -4993, -4952, -4912, -4958, -5005, -4999, -4994, -4989, -4984, -5001, -5018, -5025, -5031, -5142, -5080, -5028, -4977, -4929, -4881, -4979, -5076, -5066, -5055, -5001, -4948, -4928, -4909, -4879, -5023, -5083, -5142, -5068, -4994, -4956, -4919, -4969, -5019, -4979, -4940, -4901, -4862, -4966, -5070, -5127, -5009, -4928, -4847, -4842, -4838, -4843, -4849, -4854, -4860, -4941, -5023, -5018, -5012, -4993, -4973, -4943, -4913, -5029, -4972, -4925, -4879, -4907, -4935, -5050, -5165, -5142, -5118, -5051, -4984, -5005, -5025, -5046, -5066, -5024, -4982, -4918, -5028, -5109, -5016, -5031, -5047, -5005, -4963, -5009, -5054, -5101, -5149, -5153, -5156, -5121, -5086, -4964, -4842, -4843, -4843, -4931, -5019, -4970, -4921, -4958, -4996, -4948, -4899, -4894, -4889, -4891, -4893, -4939, -4985, -4964, -4943, -5020, -4923, -4864, -4805, -4880, -4955, -4963, -4970, -4935, -4899, -4872, -4846, -4862, -4879, -4934, -4989, -5044, -5099, -5091, -5083, -5076, -5068, -5045, -5021, -4998, -4975, -4942, -4910, -4877, -4845, -4914, -4984, -5006, -4854, -4904, -4954, -4949, -4944, -4968, -4991, -4972, -4952, -4998, -5043, -5002, -4960, -5015]
2423e015n4L2L2L8L8onj5j6K9K8O3O2k4k4K7K8j18j17l1l0J54k0k7k8M9M9j6j7j6j7NNMNJ6
2419d932J5J6J5k8k7k8k8k5k5k5k5L9L8Q2Q2p5p6l9J35M4j30q1R3O1k6n3n3M2M3m5m5k6k6
2415e113J8J8K9K9K8K9l4l3l4l4J7J6J6J6l3l3N5N4poopp1p2J6J5M9M8M8M9n4n4r7r8J12J11
2411e013l9l9P2j4o9J05l2j18L8J25M0M1N6j17j1j0p7R8ppj3P5K3j50j0P8QQJ3J4l0l0k9l0
2407e051M6M7r9r8R6R6RRJ9J8J8J9n2n3L5L5k3k3k3k3Q3Q4o2o2L1L0L1L1m1m1m1m1K5K4K4
2403d923K5k0k0j9k0N6N6l0l1j3j2P4P4p4p5J3J3n6n5L2L1oopoL7L8m9n0m1m1M6M6L4L4j0
2399d955rM2M2M2M3l6l7l6l6o3o3K3K4j2j1j2j2J5J4N9N8o5o5Q1Q0m9n0m9m9K5K5K5K5j1j1
2395e008j2j1RRQRL0L1L0L1MMMNl0k9k9l0k2k2K2K1Q2Q2nnm2m3m2m2j0j0j0j0J17J17q5q6
$$ y = [-5015, -5069, -5037, -5005, -4967, -4929, -4935, -4940, -4955, -4971, -4942, -4914, -4851, -4789, -4813, -4837, -4810, -4782, -4900, -5017, -5048, -5078, -4924, -4944, -4971, -4999, -4950, -4901, -4917, -4934, -4950, -4967, -4962, -4957, -4953, -4948, -4932, -4917, -4901, -4886, -4914, -4941, -4969, -4997, -5022, -5047, -5072, -5097, -5058, -5020, -4938, -4856, -4931, -5007, -5046, -4911, -4867, -4997, -5078, -4985, -4924, -4950, -5003, -5056, -5014, -4971, -5016, -5061, -5087, -5113, -5095, -5077, -5048, -5019, -4991, -4962, -4996, -5029, -5063, -5097, -5080, -5064, -5048, -5032, -5065, -5098, -5043, -4989, -4996, -5002, -5008, -5015, -5086, -5158, -5142, -5127, -5078, -5030, -4982, -4933, -4987, -5041, -5138, -5236, -5124, -5013, -5052, -5091, -5019, -5033, -5102, -4997, -5029, -5147, -5109, -4984, -4944, -4903, -4847, -4964, -4975, -4985, -5062, -4964, -4971, -4978, -4991, -4916, -4893, -5043, -5053, -4975, -4967, -4959, -4946, -4932, -4962, -4992, -5021, -5051, -5005, -4958, -5057, -5155, -5059, -4963, -4954, -4945, -4926, -4908, -4890, -4871, -4923, -4976, -4941, -4906, -4929, -4952, -4975, -4998, -4915, -4831, -4893, -4955, -4924, -4894, -4863, -4832, -4873, -4914, -4955, -4996, -4971, -4947, -4923, -4898, -4918, -4938, -4957, -4977, -4921, -4865, -4895, -4926, -4939, -4951, -4877, -4803, -4877, -4952, -4939, -4926, -4982, -5037, -5005, -4974, -4980, -4986, -4993, -4999, -4962, -4924, -4973, -5023, -5064, -5105, -5059, -5013, -4979, -4945, -4955, -4964, -4922, -4880, -4838, -4795, -4831, -4868, -4904, -4940, -5003, -5066, -5043, -5019, -5031, -5042, -5054, -5066, -5051, -5037, -4978, -4920, -4985, -5050, -4969, -4889, -4938, -4988, -5037, -5086, -5061, -5036, -5011, -4986, -4997, -5008, -5020, -5031, -5022, -5013, -5005, -4996, -4966, -4935, -4905, -4874, -4870, -4866, -4862, -4857, -4887, -4916, -4945, -4975, -4997, -5019, -4997, -4976, -4894, -4812, -4817, -4822, -4864, -4907, -4949, -4991, -5001, -5011, -5021, -5031, -4914, -4797, -4882, -4968]
2391d968q6q6J17J18l1l0l1l1k6k7k7k7J05J04m0m0j9j8j9j8l9l9M8M8N4N3J51k2k3k3l3l4
2387d939l2l2N5N5K0K0K0J9p4p5KKJ02p1p1J02K7K7n0n0KKJKm0m0m0m0K1K2K1K1o0o0Q5Q4
2383d962l3l4l3l3OOPOO0N9k8k7P2P2p3p3P5P5n9n9p9R5llk0k0l2J43k0k0Q8q6p1p1NMN1N0
2379d965L9L9Q2r3NNl2l3N4N4l8l9l9l8L7L7m9n0J6J5J6J5J0J0J0J0ooMNj04P0O9j04mlj5
2374e016j5P8P8j25j26K2K2K2K3M1M2l4l4q4R0P9P8NNMNq9q9jkK9K9L4L5k6O1J10o4j31j31
2370e075N5N6n6j43n8J16J02p2j37J52J79NL6n1p1J02J1j64mnj5j6K1K1K1K1O7O7p8p8Q5Q5
2367d821n9o0J1J0J1J1%%J03p0j22l4KQ9l3l2O0O0M8M9j44j43k8J47J5p1k2O4J19n6j69MR0
2363d971Lq4q4N6N6L2L2n5n5L1L0L0L1LLLML5L5L0L0%q8j26J9R6J0j27l9ooM3M3P0P0j7j6
$$ y = [-4968, -5054, -5140, -5023, -4905, -4936, -4966, -4997, -5028, -5054, -5081, -5108, -5135, -5030, -4926, -4966, -5006, -5025, -5043, -5062, -5080, -5119, -5158, -5110, -5062, -5008, -4955, -4804, -4826, -4849, -4872, -4905, -4939, -4971, -5003, -4948, -4893, -4873, -4853, -4833, -4814, -4888, -4963, -4961, -4959, -4857, -4928, -4999, -4897, -4870, -4843, -4893, -4943, -4941, -4939, -4938, -4936, -4976, -5016, -5056, -5096, -5075, -5053, -5032, -5011, -5071, -5131, -5046, -4962, -4995, -5029, -5062, -5095, -5089, -5083, -5076, -5070, -5010, -4951, -4979, -5006, -4934, -4862, -4935, -5008, -4933, -4858, -4917, -4976, -5055, -4960, -4963, -4966, -4986, -5006, -5038, -4895, -4915, -4935, -4847, -4933, -5004, -5075, -5070, -5066, -5015, -4965, -4926, -4887, -4805, -4898, -4893, -4888, -4920, -4953, -4899, -4845, -4883, -4922, -4961, -4999, -4962, -4925, -4974, -5024, -5008, -4993, -4977, -4962, -4952, -4942, -4932, -4922, -4928, -4934, -4930, -4925, -5029, -4959, -4890, -4994, -4998, -5001, -5016, -5031, -4953, -4875, -5000, -5126, -5104, -5082, -5060, -5037, -4996, -4954, -4988, -5022, -5106, -5016, -4937, -4859, -4854, -4849, -4845, -4840, -4929, -5018, -5019, -5021, -4992, -4963, -4929, -4894, -4920, -4859, -4749, -4813, -4944, -5075, -5020, -4964, -5020, -5163, -5221, -5105, -5003, -5075, -5212, -5060, -4881, -4876, -4840, -4891, -4962, -4860, -4849, -5013, -5017, -5022, -5037, -5053, -5032, -5011, -4990, -4969, -4902, -4835, -4913, -4991, -4906, -4821, -4880, -4940, -4929, -4919, -4908, -4897, -4897, -4897, -4794, -4864, -4986, -5020, -5018, -4929, -4962, -4994, -4934, -4874, -4826, -4777, -4921, -5064, -5092, -4945, -4930, -5001, -5023, -4959, -4840, -4896, -5065, -5061, -4971, -4968, -5052, -5136, -5080, -5024, -4992, -4960, -5015, -5070, -5039, -5009, -4979, -4948, -4945, -4942, -4939, -4935, -4900, -4865, -4835, -4805, -4805, -4893, -5019, -5000, -4904, -4894, -5021, -5060, -5066, -5072, -5029, -4986, -4916, -4846, -4863, -4879]
2359d879L3L3n4n4RRJ0Rklm5m6J4J5R7R6j3j01j76l1K5K5j0rM2M2m5m4KKM6M6m7m8mmpqn1
2354e126n1J8J8J05J92O5q0j28m2N7N7J8J9r4r4N1N0k4k4k5k4J13J13q9r0j2j1P5P5J4J3j31
2351d992j32N9N9N9N8p0o9P5P5J5J5J6J5l4l3l4l3M6M6m1m1M0L9m8m7n0m9n5R0J26m8p7J0
2347e010K9K9n3n2L0L1j4j3J8J8k6k6R7R7j06j06k7k8J5J6Q3Q4o2o1L5L6L5L6q5q6J18J18
2343d830N0M9K3o5j13O1R9p5j3j2k4k3P6P7j0j1p0p0P5P5J4J4p3p3j0rj6j5K5o1l0J45Lq3
2339d900J4J01n6n7L6L6l5l4N2N2j5j5k6k6J50k3j3j2l4l3J0J0j3j4K0J9K6j47qJ66N5l3n9
2336d806o0qqqqRQQRm0l9l9m0J4J4J4J4j0j0L4L3l4l4N2N3n0m9L8L7N8N7J4J4m4m4nok1j07
2331d990o9J04Q0Q1n4n4M4M4ONm3M4N5j19r2nK2K2j7j8j7j8N0N1N0N0K3K3L9m8n1J23p7p8
$$ y = [-4879, -4846, -4813, -4867, -4921, -4912, -4903, -4893, -4884, -4886, -4889, -4934, -4980, -4966, -4951, -4854, -4758, -4771, -4872, -5048, -5079, -5054, -5029, -5039, -5048, -5006, -4964, -5009, -5053, -5051, -5049, -5003, -4957, -5004, -5052, -5056, -5060, -5067, -5075, -5126, -5177, -5159, -5141, -5036, -4844, -4779, -4859, -4987, -5029, -4972, -4915, -4897, -4878, -4972, -5066, -5015, -4965, -4989, -5013, -5038, -5062, -4949, -4836, -4925, -5015, -5027, -5038, -4963, -4888, -4874, -4861, -4992, -5124, -5065, -5006, -4947, -4889, -4959, -5028, -4953, -4878, -4863, -4848, -4832, -4817, -4851, -4884, -4918, -4951, -4905, -4859, -4900, -4941, -4901, -4862, -4910, -4957, -5007, -5056, -5111, -5021, -4895, -4943, -5020, -5010, -4981, -4952, -5005, -5057, -5027, -4996, -5010, -5023, -5005, -4987, -5013, -5039, -4942, -4845, -4951, -5057, -5084, -5112, -5097, -5081, -4998, -4914, -4976, -5037, -5002, -4966, -4931, -4895, -4980, -5066, -4948, -4830, -4780, -4731, -4708, -4773, -4886, -4825, -4726, -4801, -4814, -4826, -4850, -4873, -4797, -4720, -4730, -4741, -4811, -4881, -4806, -4731, -4717, -4703, -4776, -4849, -4859, -4868, -4884, -4899, -4874, -4935, -4965, -4820, -4817, -4900, -4886, -4785, -4841, -4898, -4862, -4826, -4861, -4895, -4843, -4791, -4806, -4821, -4847, -4873, -4723, -4746, -4759, -4771, -4805, -4838, -4828, -4818, -4831, -4845, -4825, -4806, -4780, -4927, -4935, -4769, -4714, -4747, -4806, -4866, -4874, -4882, -4890, -4898, -4889, -4881, -4873, -4864, -4904, -4943, -4982, -5022, -5008, -4994, -4980, -4966, -4976, -4986, -4952, -4919, -4953, -4987, -4935, -4882, -4932, -4981, -4943, -4906, -4848, -4791, -4777, -4763, -4807, -4851, -4856, -4862, -4883, -4990, -5059, -4955, -4875, -4794, -4848, -4902, -4858, -4814, -4808, -4803, -4846, -4802, -4747, -4866, -4958, -4963, -4941, -4919, -4936, -4954, -4971, -4989, -4939, -4888, -4838, -4788, -4765, -4742, -4703, -4751, -4802, -4679, -4756, -4834]
2327d834J00p5o3o3PQPQR1R2j11j12m6m6M1M1J2J1J2J2m1m1M6M6R8R7m7m7p8p7J0J0P3P4L0
2323d755L0j5j5n9n9o2o2Q2Q3K3K2p5p5J11o3j07O7QQJ9J9m9n0R5R5KKm2m1MNNNQ7Q7%%q5
2319d755q5q5q5JJJJL5L4j0rp3p2J4J4M3M3%%j7j6o0o1R6R6RQNOl9l8R4R3n1n1M4M4M5M4M7
2314d689M8m0l9L9L9m7m8m7m7lmNNM8M8JJm3m3p0o9J7J7o3o2K4K5N2N2N1N2j4j3P3P3j5j6
2310d702j02j03N7N8q8q8J4J3J01J01r8r7M8M7j7j8j8j7j4j4j3j4lkllJ6J6J7J6K0K1J07J08
2306d654l4l4J0Rj7j6j04j04M3M3m3m4M8M9l9l8O3O2O3O3l7l7l7l8llllL8L9L8L9o7o7K0K0
2302d775k2k2L6n0j43LJ18J19m7m6m7m6Q1Q2o4o3K5K6o2o1N1N2N2r4l7N0P9o6k3O5PPq0q1
2298d976N6N6K2j23j23K3mlJ51J51ONllN6q9n6L1l1l2L1n5J5J60J22L6r5r5j00j00onooK0
$$ y = [-4834, -4734, -4809, -4872, -4935, -4928, -4920, -4913, -4905, -4814, -4722, -4833, -4945, -4991, -5037, -4996, -4955, -4943, -4932, -4920, -4908, -4949, -4990, -4944, -4898, -4800, -4703, -4750, -4797, -4875, -4952, -4942, -4932, -4859, -4785, -4755, -4725, -4740, -4755, -4814, -4873, -4935, -4997, -4915, -4832, -4809, -4787, -4862, -4937, -4826, -4889, -4996, -4929, -4921, -4913, -4894, -4875, -4924, -4974, -4879, -4784, -4782, -4780, -4822, -4863, -4859, -4854, -4849, -4844, -4757, -4670, -4670, -4670, -4755, -4840, -4925, -5010, -5009, -5008, -5007, -5006, -4971, -4937, -4947, -4956, -5029, -5101, -5087, -5073, -5030, -4987, -4987, -4987, -5004, -5020, -5080, -5141, -5045, -4949, -4940, -4932, -4927, -4921, -4960, -4998, -4904, -4811, -4862, -4913, -4869, -4825, -4780, -4736, -4689, -4641, -4681, -4720, -4681, -4642, -4689, -4737, -4784, -4831, -4834, -4838, -4833, -4828, -4780, -4732, -4731, -4730, -4773, -4816, -4886, -4955, -4938, -4921, -4984, -5046, -5022, -4997, -4945, -4893, -4842, -4790, -4804, -4817, -4744, -4671, -4686, -4702, -4804, -4907, -4850, -4792, -4880, -4968, -4954, -4941, -4840, -4739, -4837, -4934, -4886, -4839, -4856, -4874, -4892, -4909, -4923, -4937, -4950, -4964, -4967, -4969, -4972, -4975, -4959, -4943, -4926, -4910, -4890, -4869, -4762, -4654, -4688, -4722, -4712, -4703, -4720, -4736, -4840, -4944, -4901, -4858, -4901, -4945, -4897, -4848, -4887, -4925, -4862, -4800, -4737, -4674, -4711, -4748, -4785, -4823, -4826, -4829, -4832, -4835, -4797, -4758, -4720, -4681, -4748, -4815, -4795, -4775, -4797, -4819, -4783, -4833, -4976, -4973, -4855, -4736, -4783, -4829, -4876, -4922, -4841, -4759, -4823, -4886, -4861, -4835, -4897, -4958, -4907, -4855, -4803, -4897, -4934, -4884, -4805, -4871, -4894, -4829, -4822, -4815, -4895, -4976, -4920, -4864, -4842, -4965, -5088, -5065, -5069, -5072, -4921, -4770, -4764, -4759, -4762, -4765, -4709, -4798, -4854, -4823, -4854, -4886, -4855, -4910, -4895, -4735, -4613, -4577, -4672, -4767, -4867, -4967, -4973, -4978, -4984, -4990, -4970]
2294d970K0o1Q4P8P8n8n7l5l5N2N2L1L0L0L1o4o4o4o4mmnmL4L3n3n3N5N6k7k6l3N4R5m9j82
2290e099l6J7J8M0M1M1M1QQQQK7K7n9o0%%%%RQJ07o7k9l0m0m0N1N1q3q3o4J11J3J3K3K3K2
2286d975K3klj00P3m5m6l5l4PPPPjjQ6Q6P0P0j7j8n2n2L5L5M0M1m7m7j6j6j6j6RRJ0RL6L7
2281d842n1n1k9k9k9k8P9Q0ppNONOqpqp%%Q7Q6m8m8n8J15k1k1j0j0o0o0K7K7l8l8l9l8O3O3
2277d943k4k4j1j2j1j1j2j1j1j1l3l3J12J12K8K9n9n8J20J20q3q3m7m6N5N5j0j0j0j0Q3Q4
2273d765j9j8q1q1rrN3N4N4N3j01j01k9k9j7j7N5N5L0L0j4j3o3o3O8O8q4q5J7J7P4P3n7n7
2269e011M5M5M4M5o3o2o3o2O6O6ooo3o4O7O8N8N8j5j4o0o0M1M2J4J4k9k9J05J06q3q2l8l7
2265d963L5L5l5l5L8L7l5l5k4k4q9Q4L5n1n7n7J18n5j43L1N3N2N2N2n0n0rrrrL5L5o6o7P6
$$ y = [-4970, -4950, -5011, -4927, -4849, -4771, -4829, -4886, -4921, -4956, -4904, -4852, -4821, -4791, -4761, -4730, -4794, -4858, -4922, -4986, -4990, -4994, -4999, -5003, -4969, -4936, -4989, -5042, -4987, -4931, -4958, -4984, -5017, -4963, -4868, -4917, -5099, -5135, -5118, -5100, -5060, -5019, -4978, -4937, -4929, -4921, -4913, -4905, -4878, -4851, -4910, -4970, -4970, -4970, -4970, -4970, -4961, -4953, -4846, -4913, -4942, -4972, -5012, -5052, -5001, -4950, -5033, -5116, -5180, -5069, -5056, -5043, -5020, -4997, -4975, -4952, -4954, -4957, -5057, -4984, -5029, -5075, -5110, -5144, -5137, -5130, -5123, -5116, -5117, -5118, -5032, -4946, -4876, -4806, -4823, -4841, -4893, -4945, -4910, -4875, -4835, -4794, -4841, -4888, -4904, -4920, -4936, -4952, -4943, -4934, -4924, -4915, -4879, -4842, -4893, -4944, -4973, -5002, -5031, -5059, -4980, -4900, -4907, -4914, -4909, -4903, -4898, -4892, -4900, -4907, -4915, -4922, -4922, -4922, -4835, -4749, -4797, -4845, -4903, -4788, -4809, -4830, -4840, -4850, -4910, -4970, -4943, -4916, -4954, -4992, -5031, -5069, -5006, -4943, -4967, -4991, -5002, -5014, -5025, -5036, -5048, -5059, -5070, -5081, -5114, -5147, -5035, -4923, -4895, -4866, -4925, -4983, -4863, -4743, -4826, -4909, -4956, -5002, -4947, -4892, -4902, -4912, -4922, -4932, -4849, -4765, -4784, -4802, -4883, -4964, -4973, -4982, -4929, -4875, -4821, -4768, -4869, -4970, -4999, -5028, -5045, -5062, -5007, -4952, -4922, -4892, -4906, -4919, -4982, -5045, -4977, -4909, -4993, -5078, -5061, -5044, -4970, -4897, -4954, -5011, -4966, -4921, -4877, -4832, -4895, -4957, -5020, -5082, -5016, -4950, -4956, -4962, -5025, -5089, -5022, -4954, -4896, -4838, -4853, -4867, -4927, -4987, -4946, -4904, -4890, -4876, -4905, -4934, -4829, -4723, -4806, -4888, -4926, -4963, -4928, -4893, -4928, -4963, -4925, -4888, -4923, -4958, -4982, -5006, -5095, -5011, -4976, -5027, -5084, -5141, -5023, -5078, -5221, -5190, -5137, -5085, -5033, -4981, -5031, -5081, -5090, -5099, -5108, -5117, -5082, -5047, -5113, -5180, -5104]
2261e104P5k6k6ooR8J0j52K1J33M5j36m9jkONN0M9LLLLL8L9o3o3n5n5J7J8P3P3n7n7PQm8J27
2257e002K3K3L3L4K1K2n1n1QPM3j30j20N5M7M7Q2Q3J0J0m7m7m8m7k3k4M9M9QQQ0Q1j00j00
2253d967j6j7j17N7J19J18n3n4n4n4PPPPOOOOJ5J5Q8Q7j66j66M1M1J11o3r5r5J05J06J31m4
2249d875r9r9M9M9llm7m6n3n3J9K0L3L3L3L3p2p2N8N9jjjjN2N2k0k0k1k1N2N2j3j3L1L0n4
2245d933n4L2L3o2o3j9j9Q0P9L6L6lkkkm4m4m4m4k7k6J7J6j3j3P4P4o9o9J7J8j0j0L4L4K5
2241d967K6j20j19Q4Q4kln8n8j4j4P6P5j1j1L8L8onl5l5J11J10p4p3J3J3M0M0L9M0K6K6o1
2237d787o0K9L0j4j3r6r5N0M9j0j0L3L4l3l3l3l2K2K2K2K2K2K2K2K2kkkkl2l3l3l2m1m1M6
2233d989M6K2K2k2k2l0k9l0k9P0P0j7j6l0k9J4J4p6p6O9P0kkkjQ8Q9n6n6klr2N2Q8n6n3R2
$$ y = [-5104, -5029, -5055, -5081, -5087, -5093, -4995, -4985, -5137, -5116, -4983, -4938, -5074, -5123, -5124, -5126, -5120, -5115, -5065, -5016, -5013, -5010, -5007, -5004, -4966, -4927, -4990, -5053, -5108, -5163, -5146, -5128, -5055, -4982, -5039, -5096, -5089, -5081, -5129, -5002, -4979, -4956, -4923, -4889, -4868, -4846, -4897, -4948, -4940, -4933, -4890, -5020, -5140, -5085, -5038, -4991, -4909, -4826, -4816, -4806, -4853, -4900, -4948, -4995, -5018, -5042, -4993, -4944, -4936, -4928, -4848, -4767, -4867, -4967, -4983, -5000, -5117, -5060, -4941, -4823, -4876, -4930, -4984, -5038, -5031, -5024, -5017, -5010, -5004, -4998, -4992, -4986, -4971, -4956, -4868, -4781, -4947, -5113, -5072, -5031, -4920, -4983, -5078, -5173, -5068, -4962, -4831, -4875, -4974, -5073, -5024, -4975, -4978, -4981, -5028, -5074, -5127, -5180, -5161, -5141, -5108, -5075, -5042, -5009, -5081, -5153, -5095, -5036, -5037, -5038, -5039, -5040, -4988, -4936, -4956, -4976, -4997, -5018, -4966, -4914, -4927, -4940, -4909, -4879, -4933, -4987, -4955, -4922, -4984, -5047, -5066, -5085, -5005, -4926, -4890, -4854, -4857, -4859, -4861, -4863, -4907, -4951, -4995, -5039, -5066, -5092, -5075, -5059, -5072, -5085, -5011, -4937, -5006, -5075, -5058, -5040, -5050, -5060, -5026, -4992, -4967, -4941, -5061, -5180, -5096, -5012, -5014, -5017, -5075, -5133, -5147, -5161, -5085, -5010, -5021, -5032, -4994, -4956, -4962, -4967, -5002, -5037, -4926, -4816, -4890, -4963, -4950, -4937, -4897, -4857, -4818, -4778, -4752, -4726, -4787, -4847, -4818, -4788, -4802, -4815, -4911, -5006, -4956, -4907, -4917, -4927, -4894, -4860, -4893, -4926, -4959, -4991, -4969, -4947, -4925, -4903, -4881, -4859, -4837, -4815, -4817, -4819, -4821, -4823, -4855, -4888, -4921, -4953, -4994, -5035, -4989, -4943, -4921, -4899, -4921, -4943, -4973, -5002, -5032, -5061, -4991, -4921, -4938, -4954, -4984, -5013, -4999, -4985, -5061, -5137, -5068, -4998, -5000, -5002, -5004, -5005, -4917, -4828, -4884, -4940, -4942, -4945, -5037, -4985, -4897, -4953, -5006, -4914]
2228d914K0o6rqJ7J7J7J7N0N0l7l6l1l1J04m1j80l5P7P7n5n5j1j2J00R9J3J2k1k1k1k1N8N8
2225d819k9l0k1k1o4o5L1L0L1L0j0j1P7P7m2m1m1m2O4O4k3k3k2k1k6k7M8l9p2P3k7k6M0m7
2221e024r1N3J02J5n4n4K8K8J5J5J5J5L3L4n4n4J7J7J6J7m1m1m1m2R7R7m9m8J13J12l2l2k0
2217d838k0o4o4l6l6J08J09j2j1j2j2j2j2j2j2opopp3p3J3J4P1P1p9q0Q0qoJ40M9r5nnl3l4
2213e015l4l4K3K2K3K2Q6Q6n9n9J8J8o9o8L7L7poPPN1N1j3j4n6n7L4L4j0rJJM5M5k1k0o4o4
2208e031J5J5N8N8m2m2M5M4L2L1j3j2k0k1O6O7k4k5k4k4qrqqLLLLm1m1M7M6L2L1Lq5n7Q8%
2204d845JP9P9qqq3q2J4J3j37QO3k5l9l9m5J01M8l8J9K0L3L3j12j12O3O3J36l9k24O6Q3Q4
2200d830P7r7J%L9L9L8L9k4k4k4k4j4j3k4k4K2j51j52K2N7N7k0j9J9J9K0J9J4J3J4J4mlR4
$$ y = [-4914, -4894, -4960, -4969, -4977, -4960, -4943, -4926, -4909, -4859, -4809, -4846, -4882, -4913, -4944, -4840, -4881, -5061, -5096, -5019, -4942, -4997, -5052, -5063, -5075, -4975, -4876, -4863, -4851, -4872, -4893, -4914, -4935, -4877, -4819, -4848, -4878, -4899, -4920, -4984, -5049, -5018, -4988, -4957, -4927, -4937, -4948, -4871, -4794, -4836, -4877, -4918, -4960, -4896, -4832, -4855, -4878, -4900, -4921, -4947, -4974, -4926, -4965, -5037, -4964, -4991, -5017, -4977, -5024, -5115, -5062, -4960, -4945, -4999, -5053, -5025, -4997, -4982, -4967, -4952, -4937, -4904, -4870, -4924, -4978, -4961, -4944, -4928, -4911, -4952, -4993, -5034, -5076, -4979, -4882, -4931, -4979, -4866, -4754, -4786, -4818, -4838, -4858, -4922, -4986, -5022, -5058, -4950, -4841, -4853, -4864, -4876, -4888, -4900, -4912, -4924, -4936, -4942, -4949, -4955, -4962, -5035, -5108, -5095, -5081, -5010, -4939, -5018, -5098, -5018, -5026, -5032, -4892, -4843, -4938, -4943, -4948, -4981, -5015, -5049, -5083, -5060, -5038, -5015, -4993, -4907, -4821, -4880, -4939, -4921, -4903, -4972, -5040, -5003, -4966, -4973, -4979, -4972, -4965, -4914, -4863, -4876, -4890, -4946, -5003, -4969, -4935, -4945, -4954, -4953, -4952, -4907, -4862, -4883, -4903, -4967, -5031, -5016, -5001, -4943, -4885, -4927, -4969, -4924, -4880, -4848, -4817, -4830, -4842, -4862, -4883, -4817, -4750, -4774, -4799, -4823, -4847, -4855, -4864, -4872, -4880, -4877, -4874, -4871, -4868, -4909, -4950, -4903, -4857, -4825, -4794, -4791, -4876, -4933, -4845, -4845, -4844, -4765, -4686, -4694, -4702, -4785, -4867, -4853, -4840, -4977, -4969, -4906, -4931, -4970, -5009, -5054, -4953, -4905, -4943, -4924, -4904, -4871, -4838, -4950, -5062, -4999, -4936, -4800, -4839, -5063, -4997, -4914, -4830, -4753, -4850, -4849, -4849, -4810, -4771, -4733, -4694, -4718, -4742, -4766, -4790, -4804, -4817, -4841, -4865, -4843, -4994, -5146, -5124, -5067, -5010, -5030, -5049, -5030, -5011, -4991, -4972, -4958, -4945, -4931, -4917, -4921, -4924, -4830]
2196d830p9L1L1o7o7nmj5j6J56j8o5o5O2O2J9J8kkJ9j54j46K8J7J7j03P1O1O0m4m3M3M3oo
2192d999ooj7j8P0O9K1K0K1K1j4j3j3j4k4k4k4k5N4N4N4N4o0o1o0o0P3P2j4j4K4K4K4K4k9
2188d816l0k9l0J2J1l2l2O6O6k1k1opn0m9P3P4j4j3J7J6J7J6K4K4o3o3QPQQk1k1k2k1p5p6
2184e065J28J27K8K7n9o0N6N7l1l1k3k4O4O3m1m2m2m1L3L3L3L3j2j2j2j3n1n0L6L6L8L8K7
2180d752K7K3j51j02j5L9M0o4J10J20n4l3l2N5N4l2l2k1k1j19N5J2J1R9R9N3j21j21N3L4L5
2176d751M6M6O3O4q2q2q1q2O4O3k9l0k9k9M4M5M5M5n0n0n1n0qrqrl6l6N0N1QPj02P3J41l4
2172d783j1j2j1j2P6P5m6m7m7m7K2K2K1K2q5q5J00J00K12p8j17j18M1M1M0M1l7l7M9N0M5M4
2169d572m2m2j0j0j0j0K4K3K3K3m7m7m8m7O5O5k2k2j0rrj0L2L1L1L1J5J5J5J5o6o7K1K1p4
$$ y = [-4830, -4909, -4878, -4847, -4914, -4981, -4986, -4990, -5005, -5021, -4865, -4883, -4948, -5013, -4951, -4889, -4870, -4852, -4854, -4856, -4837, -4991, -5137, -5109, -5092, -5075, -5178, -5107, -5046, -4986, -5030, -5073, -5030, -4987, -4993, -4999, -5005, -5011, -5028, -5046, -4976, -4907, -4886, -4866, -4845, -4824, -4838, -4851, -4864, -4878, -4902, -4926, -4950, -4975, -4921, -4867, -4813, -4759, -4819, -4880, -4940, -5000, -4927, -4855, -4869, -4883, -4859, -4835, -4811, -4787, -4816, -4846, -4875, -4905, -4893, -4882, -4914, -4946, -4880, -4814, -4835, -4856, -4862, -4869, -4919, -4968, -4895, -4821, -4835, -4848, -4831, -4815, -4798, -4782, -4758, -4734, -4797, -4860, -4852, -4845, -4837, -4829, -4850, -4871, -4893, -4914, -4989, -5065, -4937, -4810, -4782, -4755, -4814, -4874, -4818, -4761, -4792, -4823, -4846, -4870, -4806, -4743, -4784, -4826, -4868, -4909, -4876, -4843, -4810, -4777, -4789, -4801, -4813, -4826, -4877, -4927, -4891, -4855, -4817, -4779, -4752, -4725, -4702, -4853, -4955, -4970, -4931, -4891, -4955, -4845, -4725, -4779, -4812, -4844, -4789, -4735, -4767, -4799, -4820, -4841, -4960, -4905, -4893, -4882, -4783, -4684, -4631, -4752, -4873, -4820, -4786, -4751, -4705, -4659, -4596, -4532, -4614, -4696, -4777, -4859, -4795, -4732, -4761, -4791, -4820, -4849, -4805, -4760, -4715, -4670, -4720, -4770, -4821, -4871, -4879, -4888, -4896, -4905, -4941, -4977, -4927, -4876, -4868, -4861, -4963, -4890, -4749, -4783, -4794, -4806, -4817, -4829, -4753, -4678, -4724, -4771, -4818, -4865, -4843, -4821, -4800, -4778, -4863, -4948, -4848, -4748, -4536, -4614, -4731, -4849, -4808, -4767, -4727, -4686, -4723, -4760, -4711, -4661, -4616, -4572, -4614, -4656, -4666, -4676, -4686, -4696, -4672, -4649, -4626, -4603, -4650, -4697, -4745, -4792, -4727, -4662, -4684, -4706, -4716, -4725, -4734, -4744, -4712, -4681, -4650, -4619, -4604, -4589, -4574, -4559, -4625, -4692, -4671, -4650, -4724]
2165d724p3P1P2ooooLLLLm0m0m0m0q5q5N9O0M0M0L9M0kkkkrrrrPPPPK1K0o7o6MMMMk0k1k0
2159d871k0j4j3P4P4n1n2L6L5k0k1k1k0p6p6O9O8jkkkj1j2j1j1K5K5K5K4K5K4K4K4M3M2m4
2155d714m5L9L9j06j06rrL4L5J6J6p0p1K7K7j6j6K4K4K4K4opr4r3K6K6O9P0O7O8p7p7j5j5
2151d891n8n9P5P5p0p0K3K2K3K3J6J6J6J7j2j1L2L2r0r0N4N5O8O7j9j9K2K3o5o5JJ%Jnnnm
2147d876NOOOnnnnk9k9l0k9K2K2K1K2j3j3j3j3j3j3j3j3L8L8L7L8L3L2L3L2K5K5o2o2nmmm
2142d817r3r2N2N3P0P1j7j6m7m7m6m7QQPQM6M6m1m1%%M3M4m4m4M3M3p1p1J6J6m2m1KKN6N6
2138d927J2J2N5N6J2J2j7j6j7j7J3J3J3J3rrqronono4o3K3K4J12J13l3l2l4l3N4N3k7k6p1
2134d844p0m2m2J02J03jjjjllllL4L5L4L4l0l1l1l1k0k0k1k0R8R7m7m8j4j3j4j4K2K2K3K2
$$ y = [-4724, -4797, -4726, -4654, -4660, -4666, -4672, -4678, -4675, -4672, -4669, -4666, -4706, -4746, -4786, -4826, -4911, -4996, -4937, -4877, -4837, -4797, -4758, -4718, -4720, -4722, -4724, -4726, -4735, -4744, -4753, -4762, -4755, -4748, -4741, -4734, -4713, -4693, -4760, -4826, -4822, -4818, -4814, -4810, -4830, -4851, -4871, -4891, -4905, -4918, -4844, -4770, -4821, -4873, -4837, -4802, -4822, -4843, -4864, -4884, -4960, -5036, -4967, -4899, -4900, -4902, -4904, -4906, -4917, -4929, -4940, -4951, -4926, -4901, -4876, -4852, -4827, -4803, -4779, -4755, -4712, -4670, -4714, -4759, -4720, -4681, -4787, -4893, -4902, -4911, -4877, -4842, -4826, -4810, -4880, -4951, -4924, -4897, -4913, -4929, -4905, -4881, -4857, -4833, -4839, -4846, -4940, -5033, -5007, -4981, -4912, -4842, -4775, -4707, -4784, -4861, -4876, -4891, -4949, -5008, -4933, -4858, -4928, -4998, -4975, -4953, -4930, -4907, -4891, -4875, -4859, -4842, -4854, -4865, -4833, -4801, -4891, -4981, -4927, -4872, -4804, -4737, -4756, -4775, -4753, -4730, -4795, -4860, -4859, -4858, -4858, -4857, -4862, -4867, -4872, -4876, -4871, -4865, -4859, -4853, -4858, -4863, -4868, -4873, -4902, -4931, -4961, -4990, -4968, -4946, -4925, -4903, -4916, -4929, -4942, -4955, -4968, -4981, -4994, -5007, -4969, -4931, -4894, -4856, -4823, -4791, -4758, -4726, -4701, -4676, -4738, -4800, -4805, -4809, -4813, -4817, -4910, -5002, -4950, -4897, -4827, -4756, -4773, -4789, -4836, -4883, -4929, -4976, -4968, -4960, -4953, -4945, -4899, -4853, -4894, -4935, -4935, -4935, -4892, -4848, -4892, -4936, -4893, -4850, -4921, -4992, -4976, -4960, -5002, -5043, -5041, -5039, -4983, -4927, -4915, -4903, -4848, -4792, -4780, -4768, -4785, -4801, -4818, -4835, -4822, -4809, -4796, -4783, -4792, -4801, -4809, -4818, -4824, -4829, -4835, -4840, -4904, -4967, -4944, -4920, -4808, -4695, -4728, -4760, -4794, -4827, -4773, -4720, -4747, -4773, -4844, -4914, -4956, -4998, -4896, -4793, -4794, -4795, -4796, -4797, -4800, -4803, -4806, -4809, -4775, -4740, -4706, -4672, -4702, -4733, -4764, -4795, -4815, -4835, -4856, -4876, -4778, -4681, -4728, -4776, -4790, -4803, -4817, -4831, -4809, -4787, -4764, -4742]
2130d742L8L8n0m9j6j6P2P1L6L6qqp2p2J5J5o3o3K4K4n3n2R5Pp4J01R5p9k7k6K2o4k4J50Q
2126d711p8K5K5J9K0j2j2r9r8n2n2R4R3MMMMO7O7p2p2j7P0L2j42J2J2J2J2r9P4K6o2MMjkM8
2121d849M9l9l9k6k6k6k6M9N0M9N0m0l9m0l9J02J02l2l3j01P3P9r6j44n7K9K8J08J08K3o4
2118d817m9J25P7j1j08k2L3j41j56J7mmM3M3M3M3r6r5rrK2K2J10J09l0l0N8N7LLq5q4qqP4
2114d884P3K9n9j08O7J6J6K7K7n2n3L5L4q3q3MMK6K6K5K6lmmlmmlmMLLMM1M2m6m5oonoK0K0
2109d893J9K0N7N8l0l0LKLLm7m7K9K9J32m2p9Pk0j9j4j4l6l6m6m7K46P2j90j5R9R9l5l5M1
2105d756M1m6m6k7k8k8k8k7k8P6r8j3P5J4J4k8k8l4l4O3k5p4J01kjRJ0O9O9O9O9j44j44JJ
2101d958M2M3m5m4n9n8Q6Q7%j%%j4j3j4j3k6k6O0O1j%jjK6K7K6K7o4o3j61J3R6R6K0K0K7K6
$$ y = [-4742, -4704, -4666, -4716, -4765, -4781, -4797, -4725, -4654, -4618, -4582, -4590, -4598, -4670, -4742, -4727, -4712, -4775, -4838, -4814, -4790, -4843, -4895, -4800, -4793, -4867, -4766, -4671, -4750, -4777, -4803, -4781, -4845, -4869, -4719, -4711, -4789, -4764, -4739, -4720, -4700, -4712, -4724, -4823, -4921, -4973, -5025, -4931, -4838, -4834, -4830, -4826, -4822, -4755, -4688, -4760, -4832, -4849, -4779, -4747, -4889, -4877, -4865, -4853, -4841, -4940, -4866, -4840, -4902, -4898, -4894, -4895, -4897, -4849, -4800, -4839, -4878, -4904, -4930, -4956, -4982, -4933, -4883, -4834, -4784, -4824, -4863, -4903, -4942, -4840, -4738, -4770, -4803, -4904, -4831, -4752, -4848, -4992, -5049, -5020, -4992, -4884, -4776, -4753, -4817, -4866, -4741, -4664, -4675, -4783, -4805, -4772, -4913, -5069, -5052, -5056, -5060, -5017, -4974, -4931, -4888, -4984, -5079, -5088, -5097, -5075, -5053, -4943, -4834, -4864, -4894, -4836, -4779, -4776, -4773, -4858, -4942, -4950, -4958, -4884, -4811, -4782, -4841, -4949, -4882, -4866, -4850, -4823, -4796, -4848, -4901, -4866, -4832, -4915, -4998, -4994, -4990, -4964, -4938, -4913, -4887, -4890, -4894, -4898, -4901, -4905, -4909, -4912, -4916, -4912, -4909, -4906, -4902, -4861, -4819, -4865, -4910, -4916, -4922, -4927, -4933, -4913, -4893, -4874, -4854, -4797, -4739, -4769, -4799, -4796, -4794, -4791, -4788, -4835, -4882, -4853, -4824, -4692, -4734, -4813, -4806, -4826, -4845, -4859, -4873, -4909, -4945, -4991, -5038, -4792, -4720, -4910, -4925, -4826, -4727, -4762, -4797, -4756, -4715, -4761, -4807, -4834, -4862, -4890, -4918, -4945, -4973, -4897, -4995, -5008, -4933, -4919, -4905, -4933, -4961, -4995, -5029, -4966, -4991, -5065, -4964, -4966, -4967, -4958, -4948, -4879, -4810, -4741, -4672, -4816, -4960, -4959, -4958, -4916, -4873, -4918, -4962, -5021, -5079, -4993, -4906, -4906, -4907, -4907, -4907, -4921, -4934, -4948, -4961, -4987, -5013, -4953, -4892, -4893, -4893, -4894, -4895, -4869, -4842, -4816, -4789, -4853, -4916, -5077, -5064, -4968, -4872, -4852, -4832, -4805, -4779]
2096d779o1o0opR2q2k5k4l5l5M4M5M4M5k6k5k5k5rrQ9q5j6j6l8J36N0M9J58j6o9o9PPl1l1
2092d838l1l1rrj0rP6P5j1j1J2J3J2J3o4o4L4L4l3J40M2M2k1k1k1k1m0m0l0k9q7Q7Q6q7j4
2088d865j4k5k4J7J7J7J6l4l5N3N2O4O3p1p0q3R2ooj06j06R7R7N6N6K0j54n5J19J1J1M7M7
2085d702N7j16K0K0QRopopm3m2m3m3MLMMm5m6M2M2qqkkJ6J03M8r6l6l5m5m4m8m8L9L9llll
2080e032O3O2q3q2M3M4M3M3pqj6j7Q0o5j13k7L3J19J9j27N1J38ppk7k6k7k7rrllM3J31Q2o3
2076d791r2nK5K4N7N7q8q8K1K1K1K1rj0j0rkjkjMMRJ0j09k1R8m6k5k5l4l4l7l7N0N1L7L8k4
2071d952O2J18q6j02j5k8k8k2k2L3L4L3L3J7J8J7J7o5o4K2K3n0n0n0R5J25L9J0J0M0L9k4j68
2067d941l9l9mmP6P7j1j0L0L0L0L0q9r0q9N6R3Oj30m3P5P5opK2K3K2K3k4k4K0K0r3r3noj1
$$ y = [-4779, -4840, -4900, -4906, -4913, -4821, -4903, -4928, -4952, -4987, -5022, -4978, -4933, -4889, -4844, -4870, -4895, -4920, -4945, -4954, -4963, -4874, -4959, -4975, -4991, -5029, -4893, -4843, -4794, -4636, -4652, -4721, -4790, -4783, -4776, -4807, -4838, -4869, -4900, -4909, -4918, -4928, -4937, -4861, -4786, -4797, -4808, -4796, -4783, -4771, -4758, -4822, -4886, -4852, -4818, -4851, -4711, -4669, -4627, -4648, -4669, -4690, -4711, -4751, -4791, -4821, -4850, -4937, -4850, -4764, -4851, -4865, -4879, -4904, -4928, -4911, -4894, -4877, -4861, -4895, -4930, -4877, -4825, -4761, -4698, -4769, -4839, -4922, -4830, -4836, -4842, -4948, -5054, -4957, -4860, -4804, -4748, -4728, -4882, -4937, -4818, -4807, -4796, -4749, -4702, -4645, -4761, -4741, -4721, -4713, -4704, -4710, -4717, -4723, -4730, -4773, -4815, -4858, -4901, -4897, -4894, -4890, -4886, -4931, -4977, -4935, -4893, -4901, -4909, -4911, -4913, -4897, -4794, -4746, -4842, -4878, -4913, -4958, -5002, -5050, -5098, -5059, -5020, -5023, -5026, -5029, -5032, -4969, -4907, -4990, -5072, -5029, -4985, -4942, -4899, -4906, -4914, -4930, -4947, -4867, -4932, -5045, -5072, -5039, -4920, -4901, -5028, -4977, -4839, -4846, -4853, -4880, -4906, -4933, -4960, -4969, -4978, -4981, -4984, -4941, -4810, -4728, -4791, -4883, -4888, -4863, -4839, -4782, -4725, -4813, -4901, -4880, -4859, -4838, -4817, -4826, -4836, -4846, -4855, -4857, -4858, -4860, -4861, -4857, -4853, -4844, -4834, -4943, -4964, -4866, -4912, -4937, -4962, -4996, -5030, -5067, -5104, -5054, -5003, -4966, -4928, -4952, -4890, -4772, -4858, -4960, -4975, -5003, -5031, -5053, -5075, -5042, -5008, -4975, -4942, -4925, -4907, -4890, -4873, -4938, -5002, -4980, -4957, -5007, -5057, -5107, -5012, -4887, -4848, -4838, -4828, -4788, -4749, -4773, -4941, -4980, -5019, -5023, -5027, -4951, -4874, -4885, -4895, -4865, -4835, -4805, -4775, -4864, -4954, -5043, -4987, -4894, -4888, -5018, -5061, -4986, -4911, -4917, -4924, -4902, -4879, -4857, -4834, -4858, -4882, -4862, -4842, -4935, -5028, -5033, -5039, -5050]
2063e050j1L2L3O3O3O3O3o2o3o3o3N6N5l2l2lmJ23L6N0r5j44Jp1p1K5K6J19J19k5j13l0J15
2059d890j1r7j1j0o3Q1J26j9j5J30K1o7qqj1j1j1j1mlj8O9M7r9r8r9O0N9O0O0L5L5n2n2J2
2055d873J3j19K7J07K0o7o6m4m4J59J59PPl7l6K1K2k2k2p3p4J4J3K6K5j9j8k1k1K3K2k6k7
2052d944J7J7JJj0j1J22n3r1mPPJ3J2j6j6j7j6O3O4O3O4m2m2m1m2N3N2N3N3LMn6L1M6j28o8
2047d851J9k7N9J6p1m6j33kkL3L3j1j0J1J1N5N5N5N5l1l2k9k9J4J5K2K2k1k1L3L3j0j1k5k5
2043d846J8J8l1l0N6N6rrj53j54P6P6P6P7o4o3K4K4l1l0l1l0M9M9l8l8%%%%K2K1K2K1j2j2
2039d896j2j2n4n4k1k1J31m2l1l1P4P5j3j3j6j6Q2r2K8K8J7J8q9q8N6N6L5L5rrK0K1o7o7K5
2035d952K4pqj11O2N2N2n3n4j0j0K2K1K2K1L0L0L0L0j16j15j0J64O6O7k1k1J5j60j8j8L5L5
$$ y = [-5050, -5061, -5029, -4996, -4933, -4870, -4807, -4744, -4806, -4869, -4932, -4995, -4939, -4884, -4916, -4948, -4951, -4955, -4832, -4796, -4746, -4841, -4985, -4984, -5055, -5126, -5101, -5075, -4956, -4837, -4862, -4975, -5005, -4890, -4901, -4998, -5009, -5019, -5082, -5001, -4875, -4894, -4909, -4779, -4758, -4825, -4833, -4841, -4852, -4863, -4874, -4885, -4889, -4892, -4910, -4841, -4794, -4893, -4991, -5090, -5030, -4971, -4911, -4851, -4816, -4781, -4833, -4885, -4873, -4860, -4979, -4952, -4845, -4825, -4892, -4958, -5002, -5046, -4887, -4728, -4721, -4714, -4751, -4787, -4766, -4744, -4766, -4788, -4861, -4935, -4921, -4908, -4882, -4857, -4876, -4894, -4915, -4936, -4913, -4891, -4917, -4944, -4927, -4910, -4909, -4908, -4918, -4929, -4807, -4860, -4951, -4955, -4948, -4941, -4928, -4916, -4932, -4948, -4965, -4981, -4918, -4854, -4791, -4727, -4769, -4811, -4852, -4894, -4841, -4789, -4736, -4683, -4680, -4676, -4732, -4701, -4655, -4783, -4851, -4832, -4859, -4800, -4784, -4855, -4901, -5034, -5036, -5038, -5005, -4972, -4983, -4993, -4982, -4971, -4916, -4861, -4806, -4751, -4782, -4814, -4843, -4872, -4858, -4843, -4821, -4799, -4820, -4841, -4808, -4775, -4785, -4796, -4821, -4846, -4828, -4810, -4841, -4871, -4815, -4759, -4768, -4777, -4930, -5084, -5008, -4932, -4856, -4779, -4843, -4906, -4882, -4858, -4889, -4919, -4950, -4980, -4931, -4882, -4920, -4958, -4958, -4958, -4958, -4958, -4936, -4915, -4893, -4872, -4884, -4896, -4908, -4920, -4974, -5028, -5049, -5070, -4939, -4981, -5012, -5043, -4969, -4894, -4907, -4920, -4936, -4952, -4870, -4962, -4934, -4906, -4889, -4871, -4960, -5048, -4992, -4936, -4901, -4866, -4875, -4884, -4864, -4843, -4910, -4977, -4952, -4928, -4935, -4943, -5054, -4992, -4940, -4888, -4941, -4995, -5005, -5015, -4993, -4972, -4950, -4929, -4899, -4869, -4839, -4809, -4925, -5040, -5050, -4886, -4820, -4753, -4774, -4795, -4780, -4940, -4958, -4976, -4941, -4906]
2031d906n2n2j5j6P1P1K5K4j9k0p3p4P1P2%jm3m4M8M8MMJ9J8k4k5rqrqN1N1l7l6J3J3l1l0
2027d929%Jm2m3Q8Q8n7n8k9l0n1J23J04o9m8m7N0N0r5r5J3J3N7N6m3m2L3L3J18n6kkJ4J5k9
2023d911k9RJ0RRn9n9K8K9K4K5K4K5KKq5q5R0R0LLK1K1P5r8LLP9P9POl7l7r2r2nollmlJ9J9
2018d894O3O3q0q0j01P3J26m8k7k6K3K4K3K3Q1Q1j11j11r7P6P6r7j10j11Q2Q2noP1P1J28m7
2015d785j91j7K7K8j14N9Q4r1J8J9K9K9j4j4O4O5k2k3m5m6M2M1RRRRn8n8n7n8K2K2K2K2RQ
2010d947RQk2k3k2k2o1o2K6K6J00J00m5m5l0l0N7N7J1J2p5p6L8L8L8L8J1J1J0J1l9m0m0m0
2007e018K6K6K5K6RRRRJ0J1J1J1j%j46j45P8P9L4L5M5M4m3m2m0m0M7M7m9m8L8L9j6j6j6j5
2002d967k0k0k0k0J3J4J4J3J4J4l0l0L9L8m9m8l3l4N4N4L1L0L0L1j8j8j04j05M8M8M7M8K8
$$ y = [-4906, -4958, -5010, -5025, -5041, -4970, -4899, -4874, -4850, -4869, -4889, -4962, -5036, -4965, -4893, -4893, -4894, -4937, -4981, -4933, -4885, -4881, -4877, -4858, -4840, -4864, -4889, -4898, -4906, -4915, -4923, -4872, -4821, -4858, -4894, -4881, -4868, -4899, -4929, -4929, -4928, -4970, -5013, -4925, -4837, -4894, -4952, -4981, -5011, -5062, -4939, -4835, -4904, -4952, -4999, -4949, -4899, -4994, -5089, -5076, -5063, -5006, -4950, -4993, -5035, -5002, -4969, -4851, -4907, -4909, -4911, -4897, -4882, -4911, -4940, -4931, -4921, -4912, -4903, -4962, -5021, -4993, -4964, -4940, -4915, -4891, -4866, -4864, -4862, -4947, -5032, -4942, -4852, -4849, -4846, -4825, -4804, -4729, -4827, -4824, -4821, -4742, -4663, -4656, -4650, -4687, -4724, -4816, -4908, -4913, -4919, -4922, -4925, -4929, -4932, -4913, -4894, -4831, -4768, -4848, -4928, -5029, -4956, -4830, -4878, -4905, -4931, -4908, -4884, -4861, -4838, -4757, -4676, -4787, -4898, -4995, -4919, -4843, -4940, -5050, -5161, -5079, -4997, -5002, -5008, -4937, -4866, -4738, -4785, -4976, -4993, -4966, -4938, -5052, -4993, -4909, -5000, -4982, -4963, -4934, -4905, -4919, -4933, -4869, -4804, -4826, -4849, -4894, -4940, -4898, -4857, -4848, -4839, -4830, -4821, -4879, -4937, -4994, -5052, -5030, -5008, -4986, -4964, -4955, -4947, -4938, -4930, -4952, -4975, -4997, -5019, -5080, -5142, -5116, -5090, -4990, -4890, -4935, -4980, -5010, -5040, -4983, -4926, -4915, -4903, -4978, -5054, -5016, -4978, -4940, -4902, -4891, -4880, -4870, -4859, -4898, -4938, -4978, -5018, -4992, -4966, -4941, -4915, -4906, -4897, -4888, -4879, -4869, -4858, -4847, -4836, -4837, -4837, -4983, -5128, -5050, -4971, -4937, -4902, -4857, -4813, -4856, -4898, -4938, -4978, -4931, -4884, -4933, -4981, -4943, -4904, -4920, -4936, -4952, -4967, -4987, -5007, -5027, -5047, -5034, -5020, -5006, -4993, -4979, -4965, -4995, -5025, -4986, -4948, -4997, -5045, -5078, -5112, -5058, -5004, -4973, -4943, -4913, -4882, -4900, -4918, -5022, -5127, -5079, -5031, -4984, -4936, -4908]
1999d908K9n8n9N6N6l1l2N8N8k9k9K7K7o0o0M7M7M7M7NNNOj2j1R8p6j24N1L9j34llj4j3J22
1995d826J22q1q1k4k4k5k4n2n3L5L5L3L3j0j0j0j0K2K2J21n3m2m2KKp4p4l9J34j09j09N3N4
1991e104J0J0M2M3M3M3n5n4m3m3j1J64O5O6l8l7l8l8M6M7m1m1J9J9J9J9K2K1q7Q7J2j61n3
1987e047n3J00J00m5m5m2m1KKJ8J9k5k6K3K3O7O6J4J5p3p2K1K0K1K1O3O3q2q2n0m9L7L8j4
1983e013j3j3j4K3K3K3K2M6M6m1m1KJKJL6L6o6o6N3N3m8m8nnO7O8ppL7L6J5J5k9k9kkjkll
1978d853llk1k2K3K2m8m7N3N4M1M1o0o1m8m8N4N3j2j3j2j3K8K8j5j6kkkjm0l9l9l9K3K3m9
1974e065m9N1N0N1N1j2j3j3j2j7j7Q4Q4k0k1k1k0n3n3rrrj0rrJ23J23o5o5qppqm3m3JJL4L4
1970e000rj0L4L5j0rJ0RN3N4rrrrp4p4Q5Q6mmmlm7m8m7m7M4M5JJJ4J4J5J4M9N0M9M9K0K0n8
$$ y = [-4908, -4879, -4937, -4996, -4940, -4884, -4915, -4947, -4889, -4831, -4860, -4889, -4862, -4835, -4895, -4955, -4908, -4861, -4814, -4767, -4762, -4757, -4752, -4746, -4758, -4769, -4671, -4747, -4871, -4820, -4781, -4915, -4918, -4921, -4935, -4948, -4826, -4704, -4785, -4866, -4890, -4914, -4939, -4963, -5015, -5068, -5033, -4998, -4965, -4932, -4942, -4952, -4962, -4972, -4950, -4928, -4807, -4860, -4902, -4944, -4942, -4940, -5014, -5088, -5127, -4993, -5102, -5211, -5158, -5104, -5094, -5084, -5042, -4999, -4956, -4913, -4968, -5022, -5065, -5108, -5119, -4955, -4890, -4824, -4862, -4899, -4937, -4975, -4929, -4882, -4923, -4964, -4945, -4926, -4907, -4888, -4866, -4845, -4932, -4845, -4833, -4994, -5047, -5100, -5000, -4900, -4945, -4990, -5032, -5073, -5071, -5069, -5051, -5032, -5057, -5083, -5060, -5037, -4970, -4904, -4890, -4875, -4948, -5020, -4999, -4979, -4958, -4937, -4874, -4811, -4893, -4975, -5025, -5074, -5037, -4999, -5013, -5026, -5039, -5053, -5030, -5007, -4984, -4962, -4916, -4870, -4911, -4952, -4950, -4949, -4947, -4946, -4910, -4874, -4940, -5006, -4953, -4900, -4948, -4996, -5001, -5006, -4939, -4871, -4878, -4885, -4848, -4812, -4797, -4782, -4811, -4840, -4842, -4844, -4845, -4847, -4850, -4853, -4856, -4859, -4880, -4902, -4879, -4857, -4905, -4952, -4899, -4845, -4804, -4763, -4823, -4884, -4932, -4980, -4926, -4873, -4885, -4898, -4910, -4923, -4895, -4867, -4882, -4898, -4900, -4902, -4904, -4905, -4945, -4984, -5023, -5062, -5039, -5016, -5065, -5114, -5063, -5013, -4962, -4911, -4923, -4936, -4949, -4961, -4978, -4995, -4911, -4827, -4847, -4868, -4889, -4909, -4962, -5015, -5024, -5033, -5042, -5052, -5061, -5070, -4947, -4824, -4889, -4954, -4962, -4969, -4976, -4984, -5027, -5070, -5069, -5068, -5034, -5000, -5009, -5019, -4985, -4950, -4960, -4969, -4959, -4950, -4897, -4843, -4852, -4861, -4870, -4879, -4953, -5027, -4942, -4856, -4860, -4864, -4868, -4871, -4918, -4966, -5013, -5060, -5016, -4971, -4970, -4969, -4955, -4941, -4926, -4912, -4863, -4813, -4764, -4715, -4695, -4675, -4733]
1965d733n8P5j2j34M0j4j4j04j05POJ09J08r4r4L7L7LMLMm9m9noJ9J9J17n7o7o7K4K3L5L5
1961d957rrJ4J4q7q8L1L1K1K0P6r7m9L9O3O4llO3O3l9l8qqO4O5n0m9Q1Q1L2L2K0o7j00P4Q0
1957d633r4p8R7j2j2j3j3n7n6K1K2K2K2k6k7M7M6k3k3r6r5Q7Q8p2p2K9L0j4j3m9m8mnJJm3
1953e065m2K6K6K7K6l1l0N6N6J6J5J5J6k0k0o4o4M4M3m4m3M3M3noK5o1n7Q9O1k5k2O5N0l8
1949d895j19l1p7p6J32J32J5J5k9k8kkn9K7N5r1lmN0M9OOo9o9J7J8lmlmN8N8N8N9q1q0POJ2
1944d949J1J1J1k2k2K1K1N6N7q9q8k4k5k4k5M3M2m4m4P9P9o6o6Q6Q6n8n9n2n3L5L5M7M7l9
1940d982m0J8J8J9J8OOl7l7m0m1L8L7O8p8m0l9N5N4J2J1K1K1k2k3j2j2j2j2POPPK5K5J11l3
1936d870k1O5l6l6n6n6K1K2J36qj15k8j16k9P2P3n3n2R2R3k9k9N8N9r5r5j39j38N1N1N1N1
$$ y = [-4733, -4791, -4716, -4728, -4862, -4822, -4836, -4850, -4954, -5059, -5052, -5046, -4937, -4829, -4923, -5017, -4980, -4943, -4940, -4936, -4933, -4929, -4978, -5027, -5032, -5038, -5019, -5000, -4883, -4940, -5007, -5074, -5050, -5027, -4992, -4957, -4966, -4975, -4961, -4947, -5034, -5122, -5091, -5060, -5039, -5019, -4943, -5040, -5089, -5050, -4987, -4923, -4926, -4929, -4866, -4803, -4842, -4880, -4888, -4896, -4832, -4767, -4817, -4866, -4785, -4704, -4672, -4640, -4620, -4687, -4787, -4713, -4633, -4727, -4805, -4708, -4720, -4732, -4745, -4758, -4815, -4871, -4850, -4828, -4806, -4784, -4810, -4837, -4790, -4744, -4767, -4790, -4886, -4981, -4894, -4806, -4878, -4950, -4921, -4891, -4905, -4918, -4967, -5015, -5019, -5024, -5023, -5022, -5065, -5107, -5081, -5055, -5028, -5002, -5033, -5063, -5007, -4951, -4935, -4920, -4905, -4889, -4909, -4929, -4993, -5057, -5013, -4970, -5014, -5057, -5014, -4971, -4976, -4982, -4957, -5018, -5075, -4986, -4925, -4950, -4972, -4907, -4857, -4895, -5014, -5045, -5122, -5198, -5066, -4934, -4919, -4904, -4933, -4961, -4963, -4965, -5024, -4997, -4942, -5033, -5036, -5040, -4990, -4941, -4935, -4929, -4998, -5067, -5050, -5032, -5035, -5039, -5042, -5046, -4988, -4930, -4872, -4813, -4894, -4974, -4967, -4961, -4949, -4938, -4927, -4916, -4938, -4960, -4939, -4918, -4862, -4805, -4894, -4982, -5006, -5031, -5055, -5080, -5037, -4995, -5039, -5083, -5004, -4925, -4991, -5057, -4971, -4885, -4943, -5002, -5054, -5107, -5072, -5037, -4990, -4943, -4982, -5022, -5004, -4986, -4967, -4949, -4943, -4937, -4974, -5011, -5051, -5092, -5054, -5017, -4949, -5027, -5067, -5106, -5051, -4997, -4985, -4974, -4953, -4932, -4954, -4977, -4989, -5001, -5013, -5025, -5018, -5012, -5005, -4998, -4973, -4948, -4837, -4870, -4891, -4826, -4862, -4898, -4954, -5010, -4989, -4967, -4831, -4839, -4954, -4982, -5098, -5127, -5055, -4982, -5035, -5087, -4995, -4902, -4931, -4960, -4902, -4843, -4938, -5033, -5172, -5310, -5259, -5208, -5157, -5106]
1932e106N5N6l2l1O2O3k5k4r9r9M7M6K0K0K0K0L6L6n1n0O5O5k2k2j0j0n4n3L7L7m1m1p8O7
1929e096J54Rq2q2mnLLR0R1L5L6j67q1O0q6L4J21k9j16R3J79p8p9l0k9N5N6l2l1k2k1k2k1
1925e094n0n0R5R6l3l2j8j05l9J06O8j9L5L4n8n8j6j6M5m1r5J08O9p5n0n1J3J2j2j3j3j2P5
1921e194P6k6k6R2R3o7o7N9N9m2m2M1M1M1M1j9j8j8j9LMLLk2k3k3k3RQJ5J4l4N2N5j48m8R7
1917e053LLJ2J3J2J3k4k4k4k4LKKKM7M7k5k5jjP1P1k7k7k8k7J9K0k4k4OOqr6r3N1J15K7K8
1912d982K8j03j03L2J19P9o6l5l5K8K8k9k8J4J5M1M2o1o0L2L2L2L2j1j0j1j0K4K3K4K4q9q9
1908e073m5m5J14J15j6j6p0p0KKp0p0KLL7L8L7L8k6k5P6P5K6K5p7p6KKKJk4k5J9J9k7k7M5
1904e102M6o1o1M1M1J5J5J5J6l0k9k9k9llllj0j0L3L3K4K5m9m8M2M1kkOONOKJj00j00k0k0
$$ y = [-5106, -5051, -4995, -5027, -5058, -4996, -4933, -4958, -4982, -5081, -5180, -5133, -5087, -5067, -5047, -5027, -5007, -4971, -4935, -4986, -5036, -4971, -4906, -4928, -4950, -4960, -4970, -5024, -5077, -5040, -5003, -5044, -5085, -5163, -5096, -4942, -4933, -5015, -5097, -5101, -5106, -5103, -5100, -5010, -4919, -4884, -4848, -5015, -5096, -5036, -5122, -5088, -4967, -4996, -5112, -5019, -4840, -4918, -4997, -5027, -5056, -5001, -4945, -4977, -5008, -5030, -5051, -5073, -5094, -5144, -5194, -5099, -5003, -5036, -5068, -5086, -5191, -5230, -5124, -5056, -5075, -5040, -5006, -5064, -5122, -5138, -5154, -5109, -5150, -5245, -5137, -5068, -5143, -5193, -5244, -5231, -5219, -5231, -5244, -5257, -5269, -5194, -5118, -5144, -5170, -5078, -4985, -5052, -5119, -5060, -5001, -5043, -5085, -5044, -5003, -4962, -4921, -4940, -4958, -4976, -4995, -4992, -4988, -4985, -4982, -5004, -5027, -5050, -5073, -5064, -5056, -5041, -5027, -5061, -5009, -4954, -5102, -5150, -5053, -5050, -5047, -5035, -5022, -5010, -4997, -5021, -5045, -5069, -5093, -5090, -5088, -5086, -5084, -5037, -4990, -5015, -5040, -5041, -5042, -4971, -4900, -4927, -4954, -4982, -5009, -4990, -4970, -4994, -5018, -5012, -5006, -5014, -5110, -5203, -5152, -5037, -5010, -4982, -4954, -5057, -5160, -5128, -5009, -4930, -4996, -5031, -5066, -5038, -5010, -5039, -5067, -5053, -5038, -4997, -4955, -5016, -5076, -5044, -5012, -4980, -4948, -4959, -4969, -4980, -4990, -4966, -4943, -4919, -4895, -4984, -5073, -5118, -5163, -5049, -4934, -4950, -4966, -5036, -5106, -5104, -5102, -5172, -5242, -5240, -5237, -5200, -5162, -5125, -5087, -5113, -5138, -5062, -4987, -4961, -4936, -5013, -5089, -5087, -5085, -5083, -5082, -5106, -5131, -5112, -5093, -5120, -5147, -5102, -5056, -5117, -5178, -5137, -5096, -5081, -5066, -5051, -5035, -5065, -5094, -5123, -5152, -5155, -5158, -5161, -5164, -5174, -5184, -5151, -5118, -5094, -5069, -5118, -5166, -5124, -5083, -5085, -5087, -5081, -5075, -5070, -5064, -5062, -5061, -5161, -5261, -5281, -5301]
1900e301Q2Q2QQN1N1n0n1ppK8K8m5m5j5j5N8N8j2j2L1L1K3K2K2K2o4o4O7O6K6K5m7m7J0Ro3
1896e037o4J7J7O1O0J%m3m2L4L5l7l8P4P3n6n7k2k3L8n0j29M5j5j5J13J14l1l2j2j2j8j8O0
1892e009k6q1R3Rp8K5K5onQ1Q2m2m2m1m2l6l5PQNOR2R2l8l7N0M9l5l4kkL4j40n8J15P5j2J6
1887d937p2p3J5m0m0J6J7J6J6O0O0q5q5J13J13J9j55q8Q5K0K0M0M1m7m7j0j0n3n4J33J32j2
1884d892j3P1P1p5p4ppppO8O8j9j9k6k6k6k6r7r7M8M8M6M7MLl8l8M9M9j4j4n8n8L8L8M9M9
1879d892q1R2Oj69M9M8opK1K1q2NJ04o9L3L4o8o8L1L0n0J24K6o1N8l0j21l5%%R2R2ppr5r4
1875e076L2L2L3L2l3l3l3l2qqQ0P9KJm2m2Q8Q8M4M4k3k3k3k3p6p7J1J1L1L1j2j2O5O5Q7q7
1871d807j91j6J9K0L8L8nnO1O0k6k6m8m8L9L9opopm1m2J03J03O6O5L8m9n2J23O9j9J4J4QR
$$ y = [-5301, -5219, -5137, -5129, -5121, -5070, -5019, -5069, -5120, -5127, -5134, -5106, -5078, -5123, -5168, -5183, -5198, -5140, -5082, -5094, -5106, -5075, -5044, -5021, -4999, -4977, -4955, -5019, -5083, -5016, -4950, -4924, -4899, -4946, -4993, -4983, -4974, -5037, -5101, -5084, -5067, -5006, -4946, -4945, -4945, -4988, -5030, -4996, -4961, -4998, -5036, -4962, -4889, -4945, -5002, -5024, -5047, -5009, -5059, -5188, -5143, -5158, -5173, -5060, -4946, -4977, -5009, -5021, -5033, -5051, -5069, -5009, -5035, -5116, -5023, -5014, -5092, -5067, -5042, -5048, -5053, -4972, -4890, -4932, -4974, -5015, -5057, -5093, -5128, -5121, -5113, -5108, -5102, -5010, -4918, -4956, -4993, -4943, -4894, -4929, -4963, -4965, -4967, -4933, -5073, -5131, -5016, -4941, -4953, -4937, -5009, -5082, -5067, -5107, -5147, -5131, -5114, -5098, -5082, -5022, -4962, -5047, -5132, -5019, -4906, -4887, -5042, -5130, -5045, -5025, -5005, -4965, -4924, -4971, -5018, -5028, -5038, -5091, -5145, -5012, -4880, -4892, -4905, -4834, -4763, -4838, -4912, -4919, -4926, -4933, -4940, -4872, -4804, -4823, -4842, -4868, -4894, -4920, -4946, -5043, -5140, -5092, -5044, -4998, -4951, -4947, -4944, -4982, -5020, -4971, -4922, -4936, -4950, -5008, -5066, -5028, -4990, -4941, -4892, -4973, -4881, -4875, -5044, -4995, -4947, -4953, -4960, -4939, -4918, -5000, -4995, -4891, -4960, -4927, -4893, -4961, -5029, -4998, -4968, -5018, -4894, -4868, -4929, -4871, -4901, -5022, -5057, -5057, -5057, -4965, -4873, -4880, -4887, -4982, -5076, -5044, -5012, -4979, -4947, -4980, -5013, -5046, -5078, -5086, -5094, -5014, -4935, -4933, -4932, -4974, -5016, -4928, -4840, -4796, -4752, -4775, -4798, -4821, -4844, -4920, -4997, -4986, -4975, -4944, -4913, -4925, -4937, -4872, -4807, -4720, -4807, -4998, -5014, -4995, -4975, -4937, -4899, -4904, -4909, -4848, -4788, -4814, -4840, -4888, -4936, -4897, -4858, -4864, -4871, -4877, -4884, -4925, -4967, -4864, -4761, -4695, -4630, -4592, -4641, -4693, -4570, -4501, -4520, -4506, -4492, -4484, -4475]
1867d475J0J1J0J0J1J0K1K2q4R0R5p8n1L5L1n7k8N9k8j15p6J0m5m4%%q8q7J2J3J2J2j8j8j8
1863d836j9j8j8j8j9J3J3J3J3M0M0m7m7j4j4j4j4J7J7J7J7KKLKk9k9k9k8q6q6JKNOONJ4J3
1859e104N7N7K9K8j16j16Q6Q7jjo9p0P6P5K9K9n7n8n4n5L3L3OOq1q1l9l9M7M8L6L7L6L6J1
1855e059J1p7p6P7P6P7P6l8l9NNL8L8m9m9m6m7M1M1J2J2J2J3j9j9j8j9K4K4K5K4j2j2j2j2
1851d972N4N4N4N4k6k5k6k6klqqJ4p3j00M4n5L1P8o6m0M8L8m8JKQ2Q3n0n0ppj07j08k1k0P6
1846e135P6j0j1jjjjl4l3l4l3L3L3n3n4M6M6N2N1n1L6O8p7o9o9QRJJQ8Q9n5n5L2L2l6l5l6
1842e183l5M6M6m1m1R5R5m9n0N9O0q5q6LKM6M6NNq2q2O7O8k0k0P0P0j7j7j3j3n6n6l1l0o9
1838e293P6QPJ7J7N6N6N5N6K4K3K4K3n6n6n7n6MLJ3J3n9Q6l4j20mlL5L5M8M7r7r8J3J4l1l0
$$ y = [-4475, -4465, -4454, -4444, -4434, -4423, -4413, -4392, -4370, -4454, -4364, -4269, -4347, -4398, -4363, -4332, -4389, -4417, -4358, -4386, -4501, -4577, -4567, -4612, -4656, -4656, -4656, -4744, -4831, -4819, -4806, -4794, -4782, -4800, -4818, -4836, -4855, -4873, -4891, -4909, -4928, -4915, -4902, -4889, -4876, -4836, -4796, -4843, -4890, -4904, -4918, -4932, -4946, -4929, -4912, -4895, -4878, -4876, -4874, -4871, -4869, -4898, -4927, -4956, -4984, -5070, -5156, -5155, -5153, -5148, -5142, -5136, -5131, -5117, -5104, -5047, -4990, -4961, -4933, -5049, -5165, -5079, -4992, -4993, -4994, -5063, -5133, -5057, -4982, -4953, -4924, -4981, -5039, -5093, -5148, -5115, -5082, -5076, -5070, -5151, -5232, -5271, -5310, -5263, -5215, -5179, -5142, -5106, -5070, -5059, -5048, -5125, -5201, -5124, -5048, -4971, -4895, -4933, -4972, -4967, -4962, -4924, -4886, -4935, -4984, -5030, -5077, -5036, -4995, -4983, -4971, -4959, -4946, -4965, -4984, -5002, -5021, -4997, -4973, -4948, -4924, -4936, -4948, -4960, -4972, -4918, -4864, -4810, -4756, -4782, -4807, -4833, -4859, -4861, -4864, -4872, -4880, -4866, -4939, -5039, -4995, -5050, -5019, -4941, -5007, -5047, -4999, -4961, -5009, -5008, -5006, -4924, -4841, -4891, -4941, -4948, -4955, -5062, -5170, -5191, -5211, -5135, -5059, -5069, -5080, -5081, -5082, -5083, -5084, -5118, -5151, -5185, -5218, -5185, -5152, -5205, -5259, -5213, -5167, -5115, -5064, -5115, -5079, -5011, -5088, -5157, -5226, -5218, -5209, -5208, -5207, -5119, -5030, -5085, -5140, -5108, -5076, -5112, -5147, -5183, -5218, -5172, -5126, -5167, -5208, -5113, -5018, -5067, -5117, -5058, -4998, -5083, -5169, -5166, -5164, -5118, -5072, -5067, -5062, -5144, -5226, -5159, -5091, -5111, -5131, -5061, -4991, -5008, -5025, -5038, -5051, -5107, -5163, -5194, -5224, -5293, -5217, -5209, -5202, -5185, -5168, -5112, -5056, -5001, -4945, -4921, -4898, -4874, -4851, -4907, -4963, -5020, -5076, -5072, -5069, -5056, -5043, -5102, -5016, -5050, -5170, -5174, -5177, -5142, -5107, -5059, -5012, -5109, -5207, -5194, -5180, -5211, -5241]
1834e241N5N5NOk0j08NJ50P9P9n7n7ooQp8m6J00J3J3l6l6l0l1mQ3P7o7r8j0O7O7M9r7j5j5
1830e147k2k2k2k3J4J4J4J4RRRRP9Q0o6o5k6k5k6k6L5L5qrJ5J5p2p3mmmmL1L1L2L1opppj04
1825e303j05R9R8Q0P9L6L6P0P0J2j33q7%n8n8qrqqrqN3l4j10R2N1N1J29j6k2k1m0m0M7M7q1
1821e108q0OOL0L0j3j4j9j9O8O9j8j7K6K6KKM5M5J4J4k9k9j29j29P4P4k0j9J25J26l8l7l7
1817d973l8mmnmj1j2r8r8M9M9l8l8j4j3L0L0n7n7L1L0nnnoM6M6M6M6kklkk9k9J5J4JJQ8Q8
1812d942j04j05M1M1k4k3K0K0m7m6m6m6N5N5J1J2M6M5m1m1j4j5j4j4rrL4L5j02j01J01J02
1809e125l5l4RRK7K7j6j6p1p1J6J7k5k4O2O2N1N1l7l6kkkkO0N9q5q5N8N9k8k9l6l6QPM3M3
1804e129M3M2l9l9l8l9K6K6K6K7lklkO8O8p7p7J3J2J2J2K0J9J9K0M3M3m3m4j4j4L0K9p6p7
$$ y = [-5241, -5186, -5131, -5126, -5120, -5140, -5248, -5243, -5093, -5014, -4935, -4992, -5049, -5055, -5061, -5053, -5131, -5177, -5077, -5064, -5051, -5087, -5123, -5153, -5184, -5188, -5105, -5028, -5095, -5193, -5203, -5136, -5069, -5020, -5117, -5132, -5147, -5169, -5191, -5213, -5236, -5222, -5208, -5194, -5180, -5171, -5162, -5153, -5144, -5065, -4985, -5051, -5116, -5142, -5167, -5193, -5219, -5184, -5149, -5157, -5166, -5151, -5136, -5208, -5281, -5285, -5289, -5293, -5297, -5266, -5235, -5203, -5172, -5178, -5185, -5192, -5199, -5303, -5408, -5309, -5211, -5131, -5052, -5016, -4980, -4910, -4840, -4828, -4961, -5048, -5048, -5106, -5164, -5172, -5181, -5189, -5197, -5206, -5214, -5161, -5195, -5305, -5213, -5162, -5111, -4982, -4998, -5020, -5041, -5081, -5121, -5074, -5027, -5108, -5188, -5182, -5176, -5146, -5116, -5129, -5143, -5162, -5181, -5113, -5044, -5062, -5079, -5053, -5027, -5025, -5023, -4978, -4933, -4919, -4905, -4934, -4963, -5092, -5221, -5147, -5073, -5093, -5112, -4987, -4861, -4899, -4936, -4973, -5011, -5015, -5019, -5024, -5028, -5039, -5051, -5149, -5247, -5198, -5149, -5187, -5225, -5239, -5252, -5222, -5192, -5249, -5306, -5275, -5245, -5250, -5255, -5260, -5266, -5220, -5174, -5128, -5082, -5084, -5086, -5089, -5091, -5120, -5149, -5134, -5120, -5119, -5118, -5030, -4942, -5046, -5151, -5110, -5069, -5093, -5116, -5096, -5076, -5123, -5169, -5215, -5261, -5206, -5151, -5140, -5128, -5082, -5037, -5078, -5119, -5133, -5148, -5162, -5176, -5185, -5194, -5160, -5125, -5227, -5328, -5227, -5125, -5160, -5194, -5185, -5176, -5149, -5122, -5138, -5154, -5225, -5296, -5280, -5263, -5288, -5312, -5250, -5188, -5137, -5086, -5123, -5159, -5161, -5163, -5165, -5167, -5107, -5048, -5133, -5218, -5160, -5101, -5129, -5158, -5194, -5230, -5222, -5215, -5172, -5129, -5086, -5044, -5083, -5122, -5160, -5199, -5173, -5147, -5121, -5094, -5097, -5099, -5102, -5104, -5036, -4968, -5045, -5122, -5109, -5097, -5085, -5073, -5053, -5034, -5015, -4995, -4952, -4909, -4952, -4996, -5010, -5024, -4994, -4965, -5041, -5118]
1800e118J0J1L2L2n5n5M8M9MNk1k0K8K8l0N7m6j91l3J13J57P1k6k7l2l2j02j03M2M3L7L8R
1796e077p8m2J03J6J6k7k8k7k7o4o4K4K3J14J14l1l2M0L9m7m7L2L2L2L3j5j5rj0j02j5J68
1793d971K3p6J0m7m8R8R9J1J1m0m0j28j27l1l2J2J2M2M2M2M2L0K9n8n8M7M6LLo5o5Q0Q0m6
1789e070m6m6m6m6m6R9R9K8K8j06j05j49K6P2P3L4L4j0j0N8N8k8k9r7r7rj0O5O5O6O5o1o0
1785e201K6K7L3L3j0j0Q0P9pql8l8l8l8P4P5p1p1K2K2J20n5N1N1j05j05M6M6M5M6n6n6j54
1781e185K0R5R5l9l9J4J3l0l0K3K3j0rj62J2N9O0m1m1M6M6j8j8j9j8KJm2m2R6R7RJ0j4j5j4
1777e065j4rrqrppppM5M4JKo2o2K5K5K4K4K4K4k6k5k6k6M3M2m5m5O1O0J7J7p3p2NNlj48o2
1772e329Q4K4K4L3L3p2p2P3P2K7K6k2k3L2n6r4N1J27M0J2J1l0k9J4J4j8j8o2o2M9N0l7l7L1
$$ y = [-5118, -5108, -5097, -5065, -5033, -5088, -5143, -5095, -5046, -5042, -5037, -5058, -5078, -5050, -5022, -5052, -4995, -5041, -5232, -5265, -5152, -4995, -4924, -4950, -4977, -5009, -5041, -5143, -5246, -5204, -5161, -5124, -5086, -5077, -5155, -5197, -5094, -5078, -5062, -5089, -5117, -5144, -5171, -5235, -5299, -5275, -5252, -5138, -5024, -5055, -5087, -5047, -5008, -5055, -5102, -5070, -5038, -5006, -4973, -4988, -5003, -5012, -5022, -5124, -5139, -4971, -4948, -5024, -5014, -5061, -5109, -5011, -4912, -4901, -4890, -4930, -4970, -5098, -5225, -5256, -5288, -5276, -5264, -5222, -5180, -5138, -5096, -5066, -5037, -5095, -5153, -5106, -5060, -5057, -5054, -5119, -5184, -5104, -5024, -5070, -5116, -5162, -5208, -5254, -5300, -5201, -5102, -5074, -5046, -5152, -5257, -5406, -5380, -5308, -5235, -5201, -5167, -5177, -5187, -5129, -5071, -5099, -5128, -5225, -5322, -5331, -5341, -5276, -5211, -5145, -5080, -5141, -5201, -5175, -5148, -5115, -5082, -5092, -5102, -5022, -4943, -4950, -4958, -4996, -5034, -5072, -5110, -5036, -4961, -5032, -5103, -5081, -5059, -4939, -4994, -4943, -4892, -4997, -5102, -5056, -5010, -4965, -4919, -4975, -5031, -5185, -5165, -5070, -4975, -5014, -5053, -5039, -5026, -5056, -5086, -5063, -5040, -5050, -5059, -5221, -5209, -5150, -5090, -5131, -5172, -5126, -5080, -5098, -5116, -5135, -5153, -5151, -5150, -5192, -5234, -5138, -5041, -5032, -5022, -5036, -5051, -5065, -5079, -5088, -5097, -5105, -5114, -5121, -5128, -5135, -5142, -5097, -5053, -5052, -5050, -5112, -5174, -5149, -5124, -5100, -5076, -5052, -5028, -5054, -5079, -5105, -5131, -5088, -5046, -5091, -5136, -5075, -5015, -4998, -4981, -5054, -5126, -5121, -5116, -5119, -5267, -5329, -5245, -5221, -5197, -5164, -5131, -5203, -5275, -5202, -5130, -5103, -5077, -5099, -5122, -5090, -5146, -5240, -5189, -5062, -5022, -5010, -4999, -5029, -5058, -5044, -5030, -5048, -5066, -5128, -5190, -5141, -5091, -5128, -5165, -5134]
1769e134L1L0L1l7l7l7l7N1N2N2N1K2K2o5o5nnQ1Q2k0k1j08j07JJM5j01m7L9o5P9R4n2M0L9
1765e100OOOOL0L0L1L0l9l9q3O3l1j18J39N3p1J6l8l8Q6Q6M2M3o9o8J8J9n8n8K9L0j2j1L2
1761e032L2L4L5j01j01j14L1M2M2J5J01M8r8q7q8M8M9m3m2M5M4K2K1o5o6N3N2RRm8m8mmJ9
1757e190J9J9K0%%%JonnnO5O6k2k1K2K2K1K2K9K9n8n8n2n2r6N0P8j0l8l9M0M1m7m7J01J01
1752e005J3J4o7o7k3k4K0K0K3j21l9J06O4k3J4J5p8O6N6l1K7K7j1j1j2j1l0l1J3J3O2O2k5
1749d994k5qrn2n3K1K0j24j24K4K4O7O8QRQQQ0Q0o5o5p7p7O8O8o9o9k5k5M3M3M3M3M9M9l8
1745e076l7l7l7N0N0k3k3k3k4k1k2K1K2l9l9J06J06K3K3o4o3j5j5j5j5O2O3q3q3MMNMO6O7
1741e078k1k0lkklP2P2p8p8J14K6j31P3O3k3j7P1K1o6M2m4r0mj4j5l2l1N5N5k1k2k2k1M9M9
$$ y = [-5134, -5103, -5073, -5042, -5079, -5116, -5153, -5190, -5139, -5087, -5035, -4984, -4962, -4940, -5005, -5070, -5075, -5080, -4999, -4917, -4937, -4958, -5066, -5173, -5172, -5171, -5126, -5227, -5274, -5235, -5300, -5221, -5127, -5179, -5139, -5100, -5094, -5088, -5082, -5076, -5046, -5016, -4985, -4955, -4994, -5033, -5116, -5053, -5084, -5202, -5063, -5010, -5081, -5065, -5103, -5141, -5055, -4969, -4927, -4884, -4953, -5021, -5003, -4984, -5042, -5100, -5071, -5041, -5053, -5064, -5032, -5000, -4966, -4931, -5032, -5133, -5247, -5216, -5174, -5132, -5117, -5016, -4968, -5066, -5153, -5241, -5193, -5144, -5187, -5229, -5184, -5140, -5118, -5097, -5162, -5228, -5175, -5123, -5114, -5105, -5153, -5201, -5205, -5209, -5190, -5171, -5152, -5132, -5132, -5132, -5132, -5131, -5137, -5142, -5147, -5152, -5087, -5021, -5043, -5064, -5042, -5020, -4999, -4977, -4948, -4919, -4977, -5035, -5087, -5139, -5235, -5185, -5107, -5117, -5155, -5194, -5154, -5113, -5160, -5207, -5106, -5005, -4992, -4978, -5045, -5112, -5135, -5159, -5139, -5119, -5096, -5217, -5256, -5150, -5086, -5109, -5095, -5080, -5158, -5092, -5036, -5067, -5040, -5013, -5024, -5035, -5047, -5058, -5088, -5119, -5106, -5093, -5031, -4969, -4994, -5019, -5027, -5036, -5088, -5141, -5120, -5100, -5224, -5348, -5324, -5300, -5233, -5165, -5157, -5148, -5140, -5132, -5052, -4972, -5037, -5102, -5179, -5256, -5188, -5120, -5189, -5258, -5283, -5308, -5265, -5222, -5179, -5136, -5087, -5038, -5076, -5113, -5150, -5187, -5137, -5087, -5110, -5133, -5156, -5180, -5201, -5223, -5202, -5180, -5219, -5258, -5152, -5046, -5023, -5000, -5064, -5127, -5142, -5157, -5172, -5187, -5125, -5062, -5145, -5228, -5224, -5220, -5215, -5211, -5145, -5078, -5099, -5119, -5122, -5124, -5126, -5129, -5057, -4985, -5063, -5141, -5027, -5001, -5132, -5059, -4996, -5019, -5036, -4965, -4944, -5010, -4968, -5012, -5102, -5106, -5120, -5135, -5167, -5198, -5143, -5088, -5109, -5131, -5153, -5174, -5125, -5076]
1736e076M9M9k2k1k1k2m3m3m8m9O7k1o3Q3P7o8K2K3K7K8K7K8m4m3m3m3o7o6P8P9P1P0j7j6
1733e058j5j6K8K9k3k3o6o6J9J9R6R5R0q3J5J4qqpqL2L2J30m5m1m1n3n2l0l1l0l1L9M0L9L9
1728d979n4n5n5n5J1J2q6Q7R0Q9J3J4j6j6j6j6K3K3k0k1p2p3P3P2J8J8k5k6K4K4o3o3M9M8
1725e023M9M8J9J9J9J8m6m6m7m6L8L8L7L8QPo9o9n0J24K6K6o2o1J23n1l8l7nnP4P4K7j48n
1721d996oP0P0j8j9j8j9l6l7N0N1o8o9k5k4J7J6J04J04k7k8k7k8O1O2k6k5l3l3l3l2M3M3m3
1717d979m4rrn3n3J08J08O4O5qqqqmlmlk3k2k3k2k4k3K0K0rrr6r6N1N1J8J8m2J31n3n4n8n9
1712e152K9K8K0K1O4O3N8N7q7q8j%M3M3k5k6O2O2qqo2o3O8j05L5L6l6l5N2N2L9M0m7m8p3p2
1708e064LLJ89J4l3l3J6J6J6J6j8j7j05j04j1j0j0j1Q8Q7J%lll6l5r4Q1K6K6QQo8o8k4J50
$$ y = [-5076, -5027, -4978, -5000, -5021, -5042, -5064, -5107, -5150, -5198, -5247, -5180, -5201, -5264, -5181, -5104, -5172, -5150, -5127, -5100, -5072, -5045, -5017, -5061, -5104, -5147, -5190, -5257, -5323, -5245, -5166, -5095, -5025, -5042, -5058, -5073, -5089, -5061, -5032, -5055, -5078, -5144, -5210, -5191, -5172, -5076, -4981, -4891, -4974, -4959, -4945, -4953, -4961, -4968, -4976, -4944, -4912, -4782, -4827, -4868, -4909, -4962, -5014, -5044, -5075, -5105, -5136, -5097, -5057, -5018, -4979, -5033, -5088, -5143, -5198, -5187, -5175, -5261, -5174, -5084, -4995, -4982, -4968, -4984, -5000, -5016, -5032, -5009, -4986, -5006, -5027, -5099, -5172, -5099, -5027, -5009, -4991, -5016, -5042, -5018, -4994, -5057, -5120, -5071, -5023, -4974, -4926, -4907, -4888, -4869, -4851, -4897, -4943, -4990, -5036, -4998, -4960, -4923, -4885, -4877, -4870, -4939, -5008, -5058, -4934, -4908, -4882, -4944, -5005, -4882, -4933, -4971, -5008, -5013, -5018, -4944, -4870, -4843, -4991, -4996, -5002, -4932, -4862, -4880, -4899, -4917, -4936, -4972, -5009, -4959, -4908, -4976, -5045, -5070, -5094, -5077, -5061, -4957, -4853, -4880, -4908, -4935, -4963, -4902, -4840, -4866, -4891, -4924, -4957, -4990, -5022, -4979, -4936, -4979, -5023, -5032, -5041, -5094, -5147, -5039, -4931, -4867, -4802, -4810, -4818, -4826, -4834, -4838, -4841, -4845, -4848, -4871, -4893, -4916, -4938, -4962, -4985, -4965, -4945, -4954, -4963, -5059, -5155, -5104, -5053, -5035, -5017, -5059, -4928, -4981, -5035, -5093, -5152, -5123, -5095, -5075, -5054, -4990, -4927, -4869, -4812, -4899, -4987, -4988, -4988, -4945, -4902, -4927, -4953, -4891, -4829, -4837, -4845, -4907, -4970, -4902, -5007, -4972, -4936, -4972, -5007, -4955, -4903, -4864, -4824, -4871, -4919, -4992, -5064, -5061, -5058, -4869, -4855, -4888, -4921, -4905, -4889, -4873, -4857, -4875, -4892, -4997, -5101, -5112, -5122, -5132, -5143, -5055, -4968, -4967, -4967, -4970, -4973, -5009, -5044, -5138, -5057, -5031, -5005, -4997, -4989, -5057, -5125, -5149, -4999]
1704d999N2N2o6o6o6o6K0K1K0K0K5K6l4N2Q1r4J0J0m1m2KJJ4J3p4p3P7P6L4L3K3K3o4o4P2
1700d992P1P1P1llr0r0K4K4K4K4l0k9j33M1M2m4J5J6onN4l3q2R2L8m9j0rP1P2m7m7llJ29J30
1696d699j5j5p6p6j20j19K6K6j7j7J2J3l1l1j2j1J5J02J38l6k0k0j9k0j9j9j7j7O9P0o2o2
1692e079K5K6o0n9j5j6N1N2l5l6j3j4P3P4KKm1m2J1J0R8R7o6o6K2K1J6J5J6J6j66j65R5R5
1688e056l0k9l0l0l6l5l6l6N0M9N0M9M6M7r9r9PPl6l6N2N3N2N3l0l0N7N7m3m3M4M4JJ%Jj2
1684e026j2j2j1onL8L8K2K2o5o5L4L4n3n4p6p6O9O8M7M7m0m0N2N2l5l5J9J9J9K0K7K7K8K7
1680d902r8r7J05J05m0m0m0m0M8M7M7M7L9L9m8m8k6k6J7J8k4k3o8o7lmmlj4j5j4j4K2K3K2
1676e079K2j5j5j5j4O7O8j9k0J8J7k6k6L0L0j3j4l8l9J64J64KKKKj02j03j5j6J16J15j45j45
$$ y = [-4999, -4947, -4895, -4961, -5027, -5093, -5159, -5139, -5118, -5098, -5078, -5053, -5027, -5061, -5009, -4928, -5022, -5012, -5002, -5043, -5085, -5083, -5082, -5068, -5055, -5129, -5202, -5125, -5049, -5015, -4982, -4959, -4936, -5000, -5064, -4992, -4921, -4850, -4779, -4782, -4785, -4875, -4965, -4941, -4917, -4893, -4869, -4899, -4928, -5061, -5020, -4978, -5022, -5007, -4991, -4997, -5002, -4948, -4981, -5063, -4971, -4933, -4982, -4992, -5001, -4930, -4858, -4905, -4952, -4955, -4958, -4829, -4699, -4714, -4729, -4805, -4881, -5001, -5120, -5094, -5068, -5085, -5102, -5090, -5077, -5108, -5139, -5151, -5162, -5147, -5045, -4907, -4943, -4963, -4983, -5002, -5022, -5041, -5060, -5077, -5094, -5025, -4955, -5017, -5079, -5054, -5028, -5088, -5147, -5162, -5178, -5127, -5075, -5110, -5146, -5159, -5173, -5100, -5026, -5024, -5022, -5063, -5105, -5094, -5084, -4986, -4889, -4955, -5021, -4999, -4978, -4962, -4947, -4931, -4915, -5081, -5246, -5151, -5056, -5086, -5115, -5145, -5175, -5211, -5246, -5282, -5318, -5268, -5219, -5169, -5120, -5074, -5027, -5126, -5225, -5218, -5211, -5247, -5283, -5231, -5178, -5126, -5073, -5103, -5133, -5076, -5019, -5062, -5105, -5061, -5017, -5016, -5015, -5015, -5014, -5026, -5038, -5050, -5061, -5067, -5072, -5034, -4996, -4974, -4952, -5017, -5082, -5048, -5014, -5067, -5121, -5197, -5273, -5204, -5136, -5089, -5042, -5082, -5122, -5070, -5018, -5053, -5088, -5069, -5050, -5031, -5011, -4984, -4957, -4929, -4902, -5000, -5097, -4992, -4887, -4927, -4967, -5007, -5047, -4999, -4952, -4905, -4858, -4819, -4780, -4828, -4876, -4902, -4928, -4911, -4893, -4917, -4940, -5008, -5075, -5078, -5082, -5086, -5089, -5103, -5118, -5132, -5146, -5124, -5101, -5079, -5057, -5072, -5087, -5102, -5116, -5049, -4981, -5000, -5020, -5002, -4985, -5011, -5037, -5007, -4977, -4990, -5004, -5042, -5081, -4917, -4753, -4751, -4749, -4747, -4745, -4847, -4950, -4965, -4981, -4865, -4750, -4895, -5040]
1672e040J8J9k6k5Q6Q5kjm4m4j%m6m6M1M1NOl9l8M6M6m1m1P2P2j5j5k4k3K1K0j01j01M5M4
1668e046r7r8M8M8N0N1PPNNl8l8rqP8P8K0J9o8o7O0O0k6k7l0k9J4J4k0j9j9k0ONNNQQQQK6
1663e016K7K7K7J1J1l3l2J4J3p3p4o3o4Q1Q1n1n1R4R4qqpqm2m2M5M5m4m3M3M4m6m6llRQn2
1659e135L6J12o3M1M1l4l5J12o1p6J2Q8Jr3r3j1j2qrL5L5N7N8q2q2n2L5R5p9P3K46j4j89j41
1655e192L2O6k2J5J03J0p7L4L5j5j4M3M4M4M4k4k4k4k4L2L3L2L2j9j8j9j8j8j7j8j7M3M4Q7
1651d787Q6J1J1R7R8J17J17K9L0K2K1o5o6j11j12o8o8m8m9m8m8J1J1J0J1j6j6P1P1por3r3
1648d877k9k9J4J4RRl5l4Q0Q0J89J5j5J59J37J37l1l2l2l1J0J0RJ0j0j0j0j0qqJ54L29K54
1644c582K53K65K64K34K34P7P8j60l35l23l24k04k04l02j28p5p6j63J1M2M2N3N3ooQ1Q1k0
$$ y = [-5040, -5022, -5003, -5029, -5054, -4968, -4883, -4885, -4886, -4930, -4974, -4975, -4975, -5021, -5067, -5026, -4985, -4980, -4974, -5013, -5051, -5005, -4959, -5000, -5041, -4969, -4897, -4912, -4927, -4951, -4974, -4953, -4933, -5034, -5135, -5090, -5046, -5143, -5241, -5193, -5145, -5095, -5044, -5037, -5030, -5025, -5020, -5058, -5096, -5105, -5113, -5035, -4957, -4937, -4918, -4986, -5053, -4993, -4933, -4959, -4986, -5016, -5045, -5031, -5017, -5037, -5056, -5075, -5095, -5089, -5084, -5079, -5074, -5066, -5058, -5050, -5042, -5016, -4989, -4962, -4935, -4924, -4913, -4946, -4978, -4964, -4951, -5024, -5098, -5161, -5225, -5144, -5063, -5114, -5165, -5071, -4977, -4985, -4993, -5000, -5008, -5050, -5092, -5047, -5002, -5046, -5089, -5046, -5002, -5048, -5094, -5097, -5100, -5091, -5083, -5135, -5099, -4987, -5050, -5009, -4968, -5002, -5037, -4925, -4986, -5062, -5050, -4962, -4961, -5054, -5147, -5158, -5170, -5178, -5187, -5152, -5117, -5060, -5002, -5084, -5166, -5218, -5183, -5088, -5167, -5094, -4848, -4862, -5051, -5192, -5160, -5094, -5116, -5101, -4998, -4988, -5065, -5031, -4996, -5011, -5025, -4982, -4938, -4894, -4850, -4874, -4898, -4922, -4946, -4914, -4881, -4849, -4817, -4836, -4854, -4873, -4891, -4909, -4926, -4944, -4961, -4918, -4874, -4787, -4701, -4690, -4679, -4582, -4484, -4367, -4250, -4221, -4191, -4169, -4148, -4213, -4279, -4390, -4502, -4570, -4638, -4686, -4735, -4783, -4831, -4820, -4809, -4799, -4788, -4804, -4820, -4749, -4678, -4685, -4691, -4784, -4877, -4906, -4935, -4921, -4907, -4898, -4889, -4924, -4958, -4878, -4798, -4609, -4594, -4609, -4450, -4313, -4176, -4207, -4239, -4271, -4302, -4292, -4282, -4273, -4263, -4273, -4283, -4293, -4303, -4311, -4319, -4165, -3836, -3582, -3329, -3064, -2800, -2566, -2332, -2255, -2177, -2337, -2672, -2995, -3319, -3523, -3727, -4029, -4157, -4232, -4308, -4471, -4460, -4418, -4376, -4323, -4270, -4276, -4282, -4201, -4120, -4140]
1641d140j9O7O7k5k6o9o9qrqqpqJ38J38K09K10J66J65R4R3M6j27k63k63k84j11p8p8P8P8O9
1637c982O9J16K90K44K45K44K45K73R8k38k38l36l35k92k92k16k17j29j30l4l3j21j20O7O7
1634d755K3K4k0j9k0j9l0k9O8O9j10O3N3N3J01J02N7N8J36J37K24K24K03K03R4K68M0j34k86
1631c222k87k46k47J5J4o8o8o8o9O7O7J10J10J14J14l1l1j00j00n6n7j27j27J8J8J7J7J14
1627d109n9m2m2R2R2l4l5J10J11k2k1k1k1N3N3N3N3J41J40J41J41J40J41J40J41J88J88J88
1624b100J88K80K79L45J71J96L70L83N58O95R85J290J579J880K054J945J771J226N88j87j172
1622A3324j972k378k400k110j684j395j083p93o14m40l17l17k24k24j47j48L4j39j83rn8n8
1619c335j34j34j15j15p1p2j2j3j2j3OOq0q1o6o5k2k2N2N3r2r2N3N3J0RkklkQ5Q6L9j36m7
$$ y = [-4140, -4159, -4092, -4025, -4050, -4076, -4145, -4214, -4222, -4231, -4239, -4247, -4254, -4262, -4124, -3986, -3777, -3567, -3401, -3236, -3142, -3049, -3003, -3130, -3393, -3656, -3940, -4051, -4129, -4207, -4129, -4051, -3982, -3913, -3797, -3507, -3263, -3018, -2774, -2529, -2256, -2158, -2396, -2634, -2970, -3305, -3597, -3889, -4105, -4322, -4451, -4581, -4615, -4648, -4769, -4889, -4822, -4755, -4732, -4708, -4728, -4747, -4767, -4786, -4816, -4845, -4777, -4708, -4818, -4755, -4702, -4649, -4548, -4446, -4389, -4331, -4195, -4058, -3834, -3610, -3407, -3204, -3110, -2842, -2802, -2936, -3222, -3509, -3755, -4002, -3987, -3973, -4041, -4109, -4177, -4246, -4179, -4112, -4002, -3892, -3778, -3664, -3695, -3726, -3826, -3926, -3982, -4039, -4166, -4293, -4275, -4257, -4240, -4223, -4109, -4168, -4210, -4252, -4160, -4068, -4102, -4137, -4027, -3916, -3938, -3959, -3980, -4001, -3948, -3895, -3842, -3789, -3648, -3508, -3367, -3226, -3086, -2945, -2805, -2664, -2476, -2288, -2100, -1912, -1632, -1353, -1008, -837, -641, -271, 112, 670, 1365, 2350, 3640, 5219, 7099, 9153, 11098, 12869, 14095, 14683, 14496, 13324, 11352, 8974, 6574, 4464, 2780, 1385, 302, -491, -1105, -1545, -1862, -2179, -2403, -2627, -2774, -2922, -2888, -3027, -3210, -3219, -3277, -3335, -3469, -3603, -3718, -3833, -3904, -3976, -3988, -4001, -4013, -4026, -4020, -4014, -4094, -4175, -4241, -4306, -4328, -4350, -4298, -4245, -4337, -4429, -4376, -4323, -4313, -4304, -4306, -4308, -4311, -4313, -4228, -4142, -4103, -4239, -4286]
1615d286m7Q7Q7J0J0l4l3N6N6N5N6J33J33M6M6P6P6j2j1P7P6L3L3M3M3J88J87K29K29K28K29
1612a901J97J98M59M59L77L76K90K90Q8Q8R9p5l66l67n22n22m64m64m63m64l08l08m6m7q5
1609c481q5q5q5l3l2l2l3pppqL3L3j13j12j2j2r8r9l7l8l7l7j1j1j0j1J3J4J3J4jjM2M2k5
1605d356k6O2O1j1j1r8r8OON0N0L0L0n8n7N8N7l0l0l1l1J2J2K3K4j0rq2R2Q2Q1K7K7P0P1J4
1601c993J3J4J4l8l8M9M9n8n8j45j45j36j36QRmmmmN8N8M8M7R5p9m7J28J8j57p6K13O8j06
1597d339l9M8J06J07O9O9Q5Q6J78J78k6O2J53k0j43j44j97j98j23j22l6l5m2m2KJM4M3Q7Q7
1594d101k1k1PR4K9j45r6P8M2M2J0Rk4k5o7o8L9L9m8m8n8n8n8n8M5M6m2m1k2k3K1K1O4O3k3
1590d398k3J7J7J8J7j8j9j9j8J7J8J7J8ppppM2M2m5m5K9K9K9K8K8K8J15J15J9J9P4P3r6P8
$$ y = [-4286, -4333, -4246, -4159, -4149, -4139, -4173, -4206, -4150, -4094, -4039, -3983, -3850, -3717, -3671, -3625, -3549, -3473, -3485, -3496, -3419, -3343, -3310, -3277, -3234, -3191, -3003, -2816, -2587, -2358, -2130, -1901, -1704, -1506, -1047, -588, -211, 165, 455, 745, 833, 921, 1020, 945, 579, 212, -310, -832, -1296, -1760, -2223, -2687, -2995, -3303, -3349, -3396, -3481, -3566, -3651, -3736, -3769, -3801, -3833, -3866, -3873, -3880, -3887, -3895, -3862, -3829, -3942, -4054, -4066, -4078, -4176, -4275, -4312, -4350, -4387, -4424, -4435, -4446, -4456, -4467, -4454, -4440, -4427, -4413, -4414, -4415, -4373, -4331, -4356, -4382, -4320, -4259, -4270, -4281, -4379, -4477, -4471, -4465, -4415, -4365, -4335, -4305, -4363, -4420, -4362, -4305, -4335, -4365, -4396, -4427, -4415, -4403, -4380, -4356, -4366, -4375, -4457, -4365, -4283, -4202, -4175, -4148, -4078, -4007, -3993, -3980, -3966, -3952, -3990, -4028, -3979, -3930, -3988, -4046, -4191, -4336, -4472, -4608, -4600, -4591, -4595, -4599, -4603, -4607, -4549, -4491, -4443, -4396, -4301, -4380, -4427, -4299, -4281, -4438, -4514, -4301, -4233, -4339, -4378, -4330, -4224, -4117, -4048, -3979, -3894, -3808, -3630, -3452, -3478, -3416, -3263, -3283, -3426, -3570, -3767, -3965, -4088, -4210, -4246, -4281, -4323, -4365, -4363, -4362, -4318, -4275, -4188, -4101, -4122, -4143, -4136, -4042, -4013, -4158, -4254, -4176, -4134, -4092, -4082, -4073, -4097, -4122, -4189, -4257, -4218, -4179, -4227, -4275, -4333, -4391, -4449, -4507, -4462, -4416, -4458, -4499, -4521, -4544, -4523, -4502, -4438, -4375, -4398, -4421, -4404, -4387, -4369, -4352, -4370, -4389, -4408, -4426, -4409, -4391, -4374, -4356, -4363, -4370, -4377, -4384, -4342, -4300, -4345, -4390, -4361, -4332, -4303, -4275, -4247, -4219, -4104, -3989, -3970, -3951, -3877, -3804, -3900, -3822]
1586c822P8r5l2l1R2R2J09o6L3L2K2K1K2K2P5P5P5P6J62J63K17K17J49L23L70L70P14P13R06
1582A082R05Q30O56J81k25m59p48q03q03n96m20k41o6j43j42q8q8j06j05j05j06k18k19j31
1579b158j32p5p6j73%k0k0rj0J3J2J3J2J3J3J3J3K4K4K4K4ooopO5O4O5O4J2J1R9R8j3j3O4
1575a984O3J4j61j05j06J2J2N6N5P8P8P8P8L0L0L0L0J5J5J6J5N1N2N1N2J6J6q2R2Q8Q9R9R9
1572a028N4N4N4N4M9M9M8M9M8M8J35J35K61K61K62K62R8R9J1J2M9N0m8J25R0R0J01J01J06
1568A679J06J06J06O8O7J54J54J60J60K46K47K49K49L94L94M83M84N16N17L84K10j0j1j29
1566F983j30k34m08m54m54m75l02j53j53LLjkQ6Q6K26K27K27K27J94J93J93J94K93K93K93
1563F955K93K51K50K40M14L54L54M08M09M65M66N08N09N04N03L59L58M03M03M02M03M45M44
$$ y = [-3822, -3744, -3839, -3871, -3902, -3810, -3718, -3609, -3675, -3642, -3610, -3588, -3567, -3545, -3523, -3448, -3373, -3298, -3222, -3060, -2897, -2680, -2463, -2314, -1991, -1621, -1251, -537, 176, 1082, 1987, 2817, 3473, 3654, 3429, 2970, 2222, 1419, 616, 20, -400, -641, -707, -850, -992, -1080, -1168, -1274, -1379, -1484, -1590, -1808, -2027, -2158, -2290, -2365, -2441, -2614, -2614, -2634, -2654, -2663, -2673, -2660, -2648, -2635, -2623, -2610, -2597, -2584, -2571, -2547, -2523, -2499, -2475, -2481, -2487, -2493, -2500, -2435, -2371, -2306, -2242, -2230, -2219, -2120, -2022, -2035, -2048, -1984, -1921, -1907, -2068, -2173, -2279, -2267, -2255, -2199, -2144, -2066, -1988, -1910, -1832, -1802, -1772, -1742, -1712, -1697, -1682, -1666, -1651, -1600, -1548, -1497, -1445, -1429, -1413, -1495, -1403, -1315, -1226, -1127, -1028, -974, -920, -866, -812, -763, -714, -666, -617, -569, -521, -386, -251, 10, 271, 533, 795, 893, 992, 1003, 1015, 1064, 1114, 1066, 1191, 1281, 1371, 1472, 1573, 1679, 1785, 1891, 1997, 2065, 2132, 2286, 2440, 2600, 2760, 3006, 3253, 3502, 3751, 4145, 4539, 5022, 5506, 6022, 6539, 6923, 7133, 7123, 7112, 6983, 6853, 6619, 6211, 5757, 5303, 4828, 4526, 4373, 4220, 4223, 4226, 4225, 4223, 4309, 4395, 4621, 4848, 5075, 5302, 5496, 5689, 5882, 6076, 6369, 6662, 6955, 7248, 7499, 7749, 7989, 8403, 8757, 9111, 9519, 9928, 10393, 10859, 11367, 11876, 12380, 12883, 13242, 13600, 14003, 14406, 14808, 15211, 15656, 16100]
1560A6100M44M45O04O05O16O15O20P95Q52Q52Q56J031R76R76R33R33R33R32J124J124R83J156
1557C4505J363J362J576J576J745J745J852J939K057K231K249K423K662K749K943L232L496
1555G1705L786L996M285M619N026N402N807O504P026P584P989Q511R149R830J0467J1117J2218
1554A95021J3871J5901J8514K1007K3371K5864K7774K9108L0651L2566L5243L9825M6863N6547
1552F12126O9427Q6303J08127J36831J74670K23439K83608L49076L98588M04444L71072L14418
1551C532129K10858N1914j20566k84613m28424m99806m76779l98669l10534k35672j78670
1549H61168j36977j06155q3019o5781n2735m3006l5759l0256k6488k3638k1610k0130j8333
1548A97281j6301j4388j2640j1307j0071q970q020p150o411n890n310n019m632m226l987l581
$$ y = [16100, 16544, 16989, 17593, 18198, 18814, 19429, 20049, 20844, 21696, 22548, 23404, 24435, 25411, 26387, 27320, 28253, 29186, 30118, 31242, 32366, 33349, 34505, 35868, 37230, 38806, 40382, 42127, 43872, 45724, 47663, 49720, 51951, 54200, 56623, 59285, 62034, 64977, 68209, 71705, 75491, 79487, 83772, 88391, 93417, 98819, 104626, 111130, 118156, 125740, 133729, 142240, 151389, 161219, 171686, 182803, 195021, 208892, 224793, 243307, 264314, 287685, 313549, 341323, 370431, 401082, 433648, 468891, 508716, 555579, 612126, 681553, 767856, 875983, 1012814, 1187484, 1410923, 1694531, 2043607, 2442195, 2846639, 3217711, 3532129, 3742987, 3794901, 3674335, 3389722, 2961298, 2461492, 1984713, 1586044, 1275510, 1039838, 861168, 724191, 618036, 535017, 469236, 416501, 373495, 337736, 307480, 280992, 257354, 235744, 215614, 197281, 180980, 166592, 153952, 142645, 132574, 123604, 115584, 108434, 102023, 96133, 90823, 85804, 81172, 76946, 72959, 69378]
1546F9378l332l158k882k709k512k339k257k083k000j913j734j646j627j539j478j304j183
1544C3682j182j085j085r57r57r57r57r20r21r64r65p78p79o91o92m32m33m32m32m58m58m58
1542A6689m58n01n02m14m14m18m18m18m18l64l63m51m51k45k46j59j59j08j08j95j94j03j02
1539I480j03k47l33k45j59j58j46j46j46j46j62j61j62j62r3r3j79j80j80j79l5l5j52j53
1536E725j52j53k75k76m21m21l83l83k96k95k09k08j21j21K2K2o5o5m7m7m7m7n7n8n8n8j02
1533A404j03j6j5n9n9o0n9n2n2j40j39m5m5m5m5o5o4Q0Q1R8R9J1J2o2o2n6n6r3nn1j96j17
1529B4K9j3r9o0o1j47kl3l3k4k4p5p4p5p5l5l5l5l6JJJJK6K7K6K6r6r7M8M8M4M3m3m3k7k7
1525i24j72j72l4l5r4qM4j31j25M9l1l0j9j9m7m6M0M1J9J9J9J9j1j2j1j2M7M6M7M6j3j3j3
$$ y = [69378, 66046, 62888, 60006, 57297, 54785, 52446, 50189, 48106, 46106, 44193, 42459, 40813, 39186, 37647, 36169, 34865, 33682, 32500, 31415, 30330, 29373, 28416, 27459, 26502, 25582, 24661, 23697, 22732, 21954, 21175, 20484, 19792, 19360, 18927, 18495, 18063, 17605, 17147, 16689, 16231, 15730, 15228, 14814, 14400, 13982, 13564, 13146, 12728, 12364, 12001, 11550, 11099, 10854, 10608, 10449, 10290, 10182, 10074, 9879, 9685, 9582, 9480, 9377, 9130, 8797, 8552, 8393, 8235, 8089, 7943, 7797, 7651, 7489, 7328, 7166, 7004, 6911, 6818, 6639, 6459, 6279, 6100, 6065, 6030, 5878, 5725, 5573, 5420, 5145, 4869, 4448, 4027, 3644, 3261, 2965, 2670, 2461, 2253, 2132, 2011, 2033, 2055, 1990, 1925, 1878, 1831, 1784, 1737, 1680, 1622, 1564, 1506, 1404, 1301, 1285, 1270, 1211, 1152, 1092, 1033, 981, 929, 789, 650, 605, 560, 515, 470, 405, 341, 421, 502, 600, 699, 710, 722, 660, 598, 542, 486, 393, 388, 337, 141, 24, 53, 40, -59, -119, -180, -327, -329, -362, -395, -419, -443, -518, -592, -667, -742, -777, -812, -847, -883, -882, -881, -880, -879, -853, -826, -800, -774, -870, -967, -919, -871, -827, -784, -827, -870, -897, -924, -1096, -1268, -1302, -1337, -1431, -1439, -1395, -1526, -1651, -1602, -1633, -1663, -1682, -1701, -1748, -1794, -1754, -1713, -1694, -1675, -1656, -1637, -1648, -1660, -1671, -1683, -1636, -1590, -1543, -1497, -1510, -1523, -1536]
1521a536j3J4J4J01J01J5J6J6J6j02j03j02j02j33j33j33j33r2r1mnR4R3n1n2l0l0l0l0K6
1518b399K6K6K6PQPPQPQPl2l1l2l1L0L0n7n7L6L6j09j09o0o0Q7jj26M7Q0pM2M1o6J07L3n3
1514b524OOJ04J04r8r9m1m0m0m1n3n3n3n3l4l4l4l4N1N2N1N1j03j03j13O0M5M4l1l1m2m1q
1510c129rN4j20j20N4j5j5r1r1N7N8l0l0j%r9P5QRL0K9o0J13J6J5J22J21P8P8rrP8P8O7O7
1506b621K4K3N1N0l7l6j57j58p0p0q5q4KKk0k0J21n3m9n0p1J03n7n7m7m6n5n5L3L2o3o2k0
1502c602j9OPPOq4q4j27j28j33j33m6m6m3m3M3M4N2N2l5l5J77J77R0R0l3l2l3l3lkM0M1K6
1498c836K6o0o1%%%%p0p0P4P5N4N4J0J1k2k2j13L3N7q9m6M0J7J7K2K2J2J1J1J2onon%%%%p9
1494c932p8RRj3j3j3j3OOR3R3p3p3J31J30K4K5j9j9j8j8j7j8j7j6j7j6q4q5LLJ2J3N6N6m2
$$ y = [-1536, -1549, -1535, -1521, -1420, -1319, -1304, -1288, -1272, -1256, -1358, -1461, -1563, -1665, -1798, -1931, -2064, -2197, -2289, -2380, -2384, -2389, -2295, -2202, -2253, -2305, -2335, -2365, -2395, -2425, -2399, -2373, -2347, -2321, -2314, -2306, -2299, -2292, -2284, -2277, -2269, -2262, -2294, -2325, -2357, -2388, -2358, -2328, -2385, -2442, -2406, -2370, -2479, -2588, -2648, -2708, -2621, -2622, -2748, -2701, -2621, -2628, -2586, -2545, -2611, -2504, -2471, -2524, -2518, -2512, -2408, -2304, -2402, -2501, -2542, -2582, -2622, -2663, -2716, -2769, -2822, -2875, -2909, -2943, -2977, -3011, -2960, -2908, -2857, -2806, -2909, -3012, -3125, -3065, -3020, -2976, -3007, -3038, -3080, -3121, -3129, -3138, -3084, -3204, -3324, -3270, -3285, -3300, -3391, -3482, -3425, -3367, -3397, -3427, -3428, -3428, -3527, -3452, -3444, -3435, -3405, -3376, -3436, -3323, -3307, -3292, -3170, -3049, -2971, -2893, -2902, -2911, -2833, -2755, -2688, -2621, -2597, -2574, -2523, -2473, -2510, -2546, -2703, -2861, -2931, -3001, -3086, -3170, -3168, -3166, -3186, -3206, -3085, -3138, -3187, -3237, -3308, -3205, -3262, -3319, -3366, -3412, -3467, -3522, -3489, -3457, -3520, -3582, -3602, -3621, -3615, -3608, -3601, -3595, -3679, -3763, -3890, -4018, -4151, -4284, -4330, -4376, -4419, -4462, -4419, -4375, -4323, -4271, -4306, -4341, -4164, -3987, -3897, -3807, -3840, -3872, -3905, -3938, -3941, -3943, -3903, -3862, -3836, -3810, -3870, -3931, -3931, -3931, -3931, -3931, -4001, -4071, -3997, -3922, -3868, -3814, -3804, -3793, -3815, -3837, -3950, -3917, -3860, -3949, -3995, -3955, -3938, -3921, -3899, -3877, -3865, -3854, -3843, -3831, -3837, -3842, -3848, -3853, -3853, -3853, -3853, -3853, -3932, -4010, -4001, -3992, -4005, -4018, -4031, -4044, -4038, -4032, -3939, -3846, -3919, -3992, -3861, -3731, -3707, -3682, -3701, -3720, -3738, -3756, -3773, -3791, -3808, -3824, -3841, -3857, -3941, -4026, -4023, -4020, -4008, -3995, -3939, -3883, -3925]
1490c925m3m3m2J2J3J3J2m7m7Q9Q8M0j06p3J4J1J2o2o1k7J18P5p1k2k3k6J19l1l1q0PJ42l
1486c998llk6k5o9o9J20J21k5k4n8n7Q7Q7J9J8J9J8nooonoool0l1l1l1J2J2R9R9k5k5rr6l0
1481d000J44M1M1N9N9J46J46k9k9N3N2J16K9J8J92P1j7J89J88J43J43J00R9K29K29K40K40
1478a108K78M52N21O97R25J011J264J553J894K183J937J763J324M55l72j242j855k260k428
1476F992k137j743j336j031q55o57n70l85k99l00j26q2j70j79j79r8r8j42j42n5n5J2J3l0
1473c652l1n2n1n2n1J0J1J0J0k5k6q6KJ19n4l8l8j7j6j6j7k9k9N3N3K9n7p3J01J30m4j28m2
1470d096P4P3qqk5k4O2O3QQQQk6k6k6k6KJJKk7k6O1O1m6m7kll7l7OPL3L4j0j0l9l8J6J5l5
1465d079J39N2j22N3N3M3M2l9m0J06J06K2K3o5o5j2j2j2j2J04J04J7J6n7n8L0K9Q3Q3o2o2
$$ y = [-3925, -3968, -4011, -4053, -4041, -4028, -4015, -4003, -4050, -4097, -4008, -3920, -3880, -3986, -4059, -4045, -4034, -4022, -4084, -4145, -4172, -4054, -3979, -4050, -4072, -4095, -4121, -4002, -4033, -4064, -4144, -4137, -3995, -3998, -4001, -4004, -4030, -4055, -4124, -4193, -4073, -3952, -3977, -4001, -4059, -4116, -4029, -3942, -3923, -3905, -3886, -3868, -3873, -3879, -3885, -3891, -3896, -3902, -3908, -3914, -3944, -3975, -4006, -4037, -4025, -4013, -3914, -3815, -3840, -3865, -3874, -3970, -4000, -3856, -3815, -3774, -3715, -3656, -3510, -3364, -3393, -3422, -3369, -3317, -3201, -3172, -3154, -2962, -2891, -2908, -2719, -2531, -2388, -2245, -2145, -2046, -1817, -1588, -1348, -1108, -830, -378, 143, 840, 1765, 2776, 4040, 5593, 7487, 9670, 11607, 13370, 14694, 15149, 14777, 13535, 11680, 9420, 6992, 4855, 3112, 1776, 745, -110, -767, -1337, -1722, -2021, -2321, -2447, -2529, -2699, -2878, -3057, -3155, -3253, -3395, -3537, -3592, -3647, -3635, -3622, -3652, -3683, -3735, -3786, -3838, -3889, -3879, -3868, -3858, -3848, -3873, -3899, -3985, -3983, -3864, -3918, -3956, -3994, -4011, -4027, -4043, -4060, -4089, -4118, -4065, -4012, -3983, -4040, -4113, -4012, -3882, -3926, -4054, -4096, -4022, -3949, -3957, -3965, -3990, -4014, -3952, -3889, -3881, -3873, -3865, -3857, -3883, -3909, -3935, -3961, -3959, -3958, -3957, -3955, -3982, -4008, -3947, -3886, -3932, -3979, -3981, -3984, -4021, -4058, -4052, -4045, -4012, -3978, -3988, -3998, -4037, -4075, -4059, -4044, -4079, -3940, -3888, -4010, -3957, -3904, -3861, -3819, -3858, -3898, -3792, -3686, -3664, -3641, -3706, -3771, -3783, -3795, -3807, -3819, -3715, -3611, -3594, -3578, -3635, -3693, -3663, -3634, -3551, -3468, -3530, -3592]
1461c592J4J4r4P9J57j6R2R2O4O4K0K0J24J23L7L6%jr8P5N5N5O6O6O6O6O6O6J20J20J19J20
1458a805J91J90J03J04K09K09K09K09K37K36L24L24M25M25M69M69O13O13P28R03R85J160J286
1455H816J286J485J659K062K468K959L945N127O693Q906J1865J6054K0519K2052J8398J2303
1453A46597P954J876j0244k2812k7510k4201j8344j2893r123o768m971l731k977k195j673
1452H985j405j115r67p92p85p86o33o34n47n47l52l53l52l53k80k79j85j1r0k63j54j55j35
1449b188j36j36j35r4r4N1N1r9r9r9r9M1M0o4k39n9n9J7J7r4r3poQRRRo6o5o6o5j5j4R5p9
1445c823q9Q6k3k4O2O1q4q4J9K0J9K0l1l0l1l0l1l0l1l0l3l3l4l3LLLLKKKKl6l6n8J16N2j21
1441d280j3j4L3L2L2L3k4k4k4k4J2J2J3J2l1l1l2l1NNNNk9k8k9k9K2K2K2K2J3J3J4J3o3o3
$$ y = [-3592, -3578, -3564, -3658, -3579, -3422, -3438, -3346, -3254, -3190, -3126, -3106, -3086, -2962, -2839, -2802, -2766, -2766, -2767, -2865, -2790, -2735, -2680, -2614, -2548, -2482, -2416, -2350, -2284, -2164, -2044, -1925, -1805, -1614, -1424, -1321, -1217, -1008, -799, -590, -381, -144, 92, 416, 740, 1165, 1590, 2059, 2528, 3141, 3754, 4482, 5385, 6370, 7530, 8816, 10102, 11587, 13246, 15308, 17776, 20735, 24680, 29807, 36500, 45406, 57271, 73325, 93844, 115896, 134294, 146597, 154551, 156427, 146183, 123371, 95861, 71660, 53316, 40423, 31300, 24532, 19561, 15830, 12853, 10658, 8985, 7580, 6465, 5498, 4706, 3921, 3135, 2502, 1868, 1321, 774, 422, 69, -283, -636, -916, -1195, -1380, -1391, -1481, -1744, -1898, -2053, -2188, -2324, -2460, -2595, -2689, -2783, -2732, -2681, -2780, -2879, -2978, -3077, -3036, -2996, -3060, -3299, -3358, -3417, -3400, -3383, -3477, -3570, -3577, -3583, -3575, -3566, -3557, -3548, -3614, -3679, -3745, -3810, -3825, -3839, -3744, -3823, -3912, -3826, -3849, -3873, -3811, -3750, -3834, -3918, -3899, -3879, -3860, -3840, -3871, -3901, -3932, -3962, -3993, -4023, -4054, -4084, -4117, -4150, -4184, -4217, -4214, -4211, -4208, -4205, -4203, -4201, -4199, -4197, -4233, -4269, -4327, -4211, -4159, -4280, -4293, -4307, -4274, -4242, -4210, -4177, -4201, -4225, -4249, -4273, -4261, -4249, -4236, -4224, -4255, -4286, -4318, -4349, -4344, -4339, -4334, -4329, -4358, -4386, -4415, -4444, -4422, -4400, -4378, -4356, -4343, -4330, -4316, -4303, -4366, -4429]
1436d429K4K5J1J2p6p5L3L3n4n3j7j7P0O9k4k4j22N2KLJ4J3k6k6J19J18n0n1L6L7j5j4j13
1433d515O2m0m0k9k9K2K1K2K2J2J3J2J3M0L9m7m7m1m2m1m2L3L3L3L3KLKKn8n7P6P7J09o5o5
1429d477J09o1o1L6L7J7J6J7J7n8n7m7m7l6J37M0L9J4J5J4J4rj0j07O7NNJ6J6m4m5m5m4K6
1425d491K6o1o1K8K8K8K8M9N0M9N0m4m4o6J09M3j31p1J5qrllL8L9M4M4r7j0J27m8M3M2L2L2
1421d203j1j2j1j2K5K4K5K5n0m9m9n0j3j3j3j3M6M7M7M6o7o8K0J9k6k7k7k6M9N0l8l8MLLL
1417d380M0L9M0L9n6n6L1L1LMMLk0k1k1k1o0o1Q4Q5j7j7P0P0k1k1k0k1j4j5j12O1m1m2O7j07
1412d473j2j3MR1N8j16K0J07K0o7o1K6Q2Q2j1j0J8j55K9L0nnQ2Q2LKLKlkQQj09O5O6j09m5
1408d308m5n6n6j6j7P1P0k7k7k7k8R2R1j4j88KKqrM6M6M6M6m9m8m9m8J4J5J4J4pqpponnnj1
$$ y = [-4429, -4405, -4380, -4369, -4357, -4433, -4508, -4475, -4442, -4496, -4549, -4566, -4583, -4513, -4444, -4468, -4492, -4614, -4562, -4560, -4557, -4543, -4530, -4556, -4582, -4463, -4345, -4395, -4446, -4410, -4373, -4388, -4402, -4515, -4453, -4493, -4533, -4562, -4591, -4569, -4548, -4526, -4504, -4492, -4479, -4467, -4454, -4414, -4375, -4422, -4469, -4510, -4552, -4593, -4635, -4602, -4569, -4536, -4503, -4501, -4498, -4496, -4494, -4552, -4609, -4533, -4456, -4347, -4412, -4477, -4368, -4429, -4490, -4454, -4417, -4400, -4384, -4367, -4350, -4408, -4465, -4512, -4559, -4595, -4458, -4418, -4379, -4365, -4350, -4336, -4322, -4331, -4341, -4448, -4381, -4376, -4371, -4355, -4339, -4383, -4428, -4473, -4517, -4491, -4465, -4526, -4587, -4559, -4531, -4503, -4475, -4426, -4376, -4327, -4277, -4321, -4365, -4431, -4322, -4279, -4410, -4481, -4466, -4474, -4483, -4486, -4489, -4451, -4412, -4368, -4324, -4421, -4431, -4304, -4352, -4309, -4267, -4235, -4203, -4214, -4226, -4237, -4249, -4224, -4200, -4175, -4150, -4200, -4249, -4298, -4348, -4361, -4374, -4387, -4400, -4354, -4307, -4260, -4214, -4281, -4349, -4329, -4310, -4336, -4363, -4390, -4416, -4367, -4317, -4355, -4393, -4389, -4386, -4383, -4380, -4340, -4301, -4261, -4222, -4278, -4334, -4303, -4272, -4269, -4265, -4261, -4258, -4278, -4299, -4320, -4341, -4401, -4462, -4378, -4293, -4310, -4327, -4257, -4187, -4208, -4229, -4249, -4270, -4284, -4299, -4411, -4350, -4391, -4433, -4366, -4473, -4485, -4498, -4494, -4403, -4345, -4461, -4441, -4334, -4314, -4381, -4442, -4416, -4334, -4252, -4263, -4273, -4255, -4410, -4381, -4351, -4356, -4361, -4279, -4197, -4194, -4192, -4189, -4187, -4190, -4192, -4184, -4176, -4285, -4220, -4154, -4263, -4308, -4353, -4409, -4465, -4481, -4498, -4427, -4357, -4384, -4411, -4438, -4466, -4374, -4283, -4297, -4485, -4483, -4481, -4489, -4498, -4452, -4406, -4360, -4314, -4363, -4411, -4460, -4508, -4494, -4479, -4465, -4451, -4458, -4466, -4473, -4480, -4486, -4491, -4496, -4501, -4512]
1404d512j0j1j0L5L6n1n1K0J9K0K0qpppm3m4m3m3N7N7N7N8l7l7l7l7klj11O3J89J6k1k0M1
1399d464M1j43L0%jJ1J0o6o7K1K0KLKKk9k8j05j05m5J28L1L1LKLKQQQQo2o1K5K6K0K0k3k3
1395d757kkm6m5P0P0j6j7m1m1J03J04l0l0p3p3L9L8m8m8m6m5M1M2p2p1J5J6N2N2N1N2JJJJ
1391d754RRl5l4N7N6l0l0p2p2J5J5K6K6j8j7j12j11L4L4J00J00J3J2M8M7MLj4j4K9L0r1r0
1387d827N5N5k2k1k2k1K9L0K9K9r1r1nmonnoK0K0k4k4P2P1j6j5k5k5k4k5q1q1O4O4n1n2R3
1383d938R3jjkjj4j5j5j5K2K1K2K1K8K7K8K7k3k3k3k4M0M1M0M0J01J01J17L0n8J17J98K4j8
1379d033j7p2p2l3l2l3l2nmj50j49qqqqj8j7j1j2o4K4P7r6j13k6KJJ2J1J2J1J0J0R7R6q1q1
1375d820nnM5j29J2J2p8p9O7O6RRJ5J5k4O3J17n7m1M6n8n7J08J07r5r5k5k5k5k6L5L4n2n3
$$ y = [-4512, -4522, -4533, -4543, -4508, -4472, -4523, -4574, -4554, -4535, -4515, -4495, -4503, -4510, -4517, -4524, -4567, -4611, -4654, -4697, -4640, -4583, -4526, -4468, -4505, -4542, -4579, -4616, -4618, -4621, -4732, -4669, -4480, -4464, -4485, -4505, -4464, -4423, -4566, -4536, -4536, -4537, -4526, -4516, -4582, -4649, -4628, -4608, -4606, -4603, -4601, -4599, -4628, -4656, -4761, -4866, -4911, -4783, -4752, -4721, -4718, -4716, -4713, -4711, -4703, -4695, -4687, -4679, -4741, -4802, -4777, -4751, -4731, -4711, -4734, -4757, -4759, -4761, -4807, -4852, -4782, -4712, -4728, -4745, -4786, -4827, -4724, -4620, -4650, -4680, -4753, -4826, -4787, -4749, -4797, -4845, -4891, -4936, -4895, -4853, -4925, -4996, -4981, -4965, -4913, -4861, -4810, -4758, -4757, -4756, -4755, -4754, -4745, -4736, -4771, -4805, -4748, -4692, -4722, -4752, -4824, -4896, -4881, -4866, -4840, -4814, -4832, -4849, -4961, -5072, -5038, -5004, -4904, -4804, -4791, -4779, -4731, -4684, -4680, -4677, -4691, -4705, -4676, -4646, -4737, -4827, -4772, -4717, -4739, -4760, -4782, -4803, -4774, -4744, -4715, -4686, -4777, -4868, -4873, -4877, -4883, -4888, -4893, -4899, -4879, -4859, -4883, -4907, -4835, -4764, -4780, -4795, -4820, -4845, -4869, -4894, -4975, -5056, -4992, -4928, -4979, -5031, -4938, -4845, -4846, -4847, -4849, -4850, -4864, -4879, -4894, -4909, -4887, -4866, -4844, -4823, -4795, -4768, -4740, -4713, -4736, -4759, -4782, -4806, -4766, -4725, -4685, -4645, -4544, -4443, -4326, -4296, -4354, -4237, -4039, -4015, -4033, -4050, -4122, -4194, -4227, -4259, -4292, -4324, -4329, -4333, -4483, -4632, -4640, -4648, -4656, -4664, -4682, -4699, -4710, -4722, -4786, -4762, -4685, -4781, -4894, -4920, -4918, -4917, -4905, -4894, -4882, -4871, -4861, -4851, -4754, -4658, -4739, -4820, -4825, -4830, -4785, -4914, -4902, -4890, -4968, -5047, -4980, -4914, -4905, -4896, -4881, -4866, -4890, -4827, -4710, -4767, -4808, -4762, -4820, -4877, -4769, -4662, -4757, -4852, -4877, -4902, -4927, -4953, -4918, -4884, -4936, -4989]
1371d989P9P9LLm2J32rj0n9n9K3K2J5p2m4J29J08o7m4m5K1K1K1K1L8L7n0m9N8N9k8k8ppop
1367d753llmlL5L5l8l8P4P3J9J9K3j50k0J54m1m1P9r5j31M4L6L6O6O7o4o4M0M0llJ9J9J9J9
1363d538q3q3J8J8M7M7n5n4QRj91j6O2O3L0L0J2J2J2J2RRRRK7K6K6K7MMo9o9J9J8k5k5J4J5
1358d612J5J5q6q6M5M4POl7l7p1p1M8M8K39O4p4p3j71LO4O4l0l1M2M2O0O0K8j47lln7n8O0
1354d693O1j3j2j02j02m1J33MMJ4J5L3L3j0j0k9k9J4J4M4M4J1j63J8J7POl1l1P0P0k3k3k3
1350d723k3K0K1K0K1k6k6J8J8l8l7j36L9L8L7M9M9k7k7k6k7N8N9m3m3m7m6M4M4Oj68o7J08
1347d881N1N1j1j0k1k0k1k0L7L8o4o4j5j5J04J05O6j07rj0OOP9P8K3K3p8p9r5r6O4O3mnnn
1342d841R0Q9r9r9J5J5MMJ14n9k37N3P9r4K1K1M1M0l2l2LLp0o9M0M0J81Pppj7j8J0J0o2o2
$$ y = [-4989, -4910, -4831, -4828, -4825, -4867, -4735, -4744, -4754, -4813, -4872, -4849, -4827, -4812, -4884, -4928, -4799, -4691, -4758, -4802, -4847, -4826, -4805, -4784, -4763, -4725, -4688, -4738, -4787, -4729, -4670, -4698, -4726, -4733, -4740, -4746, -4753, -4756, -4759, -4763, -4766, -4731, -4696, -4734, -4772, -4698, -4625, -4606, -4587, -4564, -4714, -4734, -4580, -4621, -4662, -4583, -4678, -4809, -4765, -4729, -4693, -4627, -4560, -4624, -4688, -4648, -4608, -4611, -4614, -4595, -4576, -4557, -4538, -4621, -4704, -4686, -4668, -4621, -4574, -4629, -4683, -4675, -4666, -4857, -4873, -4811, -4748, -4718, -4688, -4676, -4664, -4652, -4640, -4631, -4622, -4613, -4604, -4577, -4551, -4525, -4498, -4494, -4490, -4559, -4628, -4609, -4591, -4616, -4641, -4627, -4612, -4597, -4582, -4668, -4754, -4709, -4665, -4658, -4652, -4689, -4726, -4797, -4868, -4820, -4772, -4533, -4469, -4543, -4616, -4787, -4784, -4720, -4656, -4686, -4717, -4675, -4633, -4573, -4513, -4485, -4632, -4635, -4638, -4695, -4753, -4693, -4632, -4645, -4657, -4759, -4861, -4902, -4769, -4765, -4761, -4747, -4732, -4699, -4666, -4676, -4686, -4715, -4744, -4730, -4716, -4672, -4628, -4617, -4780, -4762, -4745, -4738, -4732, -4763, -4794, -4724, -4654, -4677, -4700, -4723, -4746, -4726, -4705, -4685, -4664, -4690, -4716, -4698, -4680, -4718, -4755, -4891, -4852, -4814, -4777, -4728, -4679, -4706, -4733, -4759, -4786, -4728, -4669, -4712, -4755, -4802, -4848, -4804, -4760, -4754, -4922, -4989, -4881, -4830, -4779, -4790, -4800, -4821, -4841, -4862, -4882, -4845, -4807, -4871, -4935, -4950, -4965, -4861, -4756, -4690, -4797, -4806, -4816, -4810, -4804, -4725, -4647, -4624, -4601, -4679, -4758, -4853, -4949, -4885, -4822, -4826, -4831, -4836, -4841, -4751, -4662, -4761, -4860, -4845, -4830, -4826, -4822, -4708, -4767, -5004, -4951, -4872, -4966, -4945, -4924, -4883, -4843, -4875, -4907, -4904, -4901, -4971, -5040, -5000, -4960, -4779, -4772, -4779, -4786, -4803, -4821, -4811, -4801, -4863, -4925]
1338d925l6l7O6O5LMLMqqqqM2M3M3M2l4l5l5l5mmmmL4L3n3n4K8K8n9n9k9k9N8N8K5K5L6L6
1334d792r9P4Q0r5n6L1l4l5L7m9r9P5O1O0P2P2o6o6P9P9p3p4p3p3O0N9k7k8P1P0j6j7L2L2
1330d728L2L2j39j38O4O5L5L5J44l0j27M8o1o1J5J6J5J6l6l5l6l5J9J9J9J9K1K0or3j01P3
1326d919N5J42N5j18j03j03MMMMK6K5o1o1K1K1K2K1R8R7m8m7m6m6K1o7j33J57J24J25J6j29
1323d839m8m7l1l1N6N6nonnM9M9l7l8l2l1l2l1ooP1P2K9j16q4Mj9j8M5m2k2J23Q0qR8J1q8
1318d884%M6m1p3p4m2m3M4M4J6J6J02J03k6k6O1O1ppopj2j2j3j2M2M2M2M1N8N8q7q7L1L1L0
1314d591L1k9k9k9l0o8o8o8o8k8k9N9N9P5P5j2j2o6o7o6o6N9N9N9N9k1k0k1k1l8l7l8l8O2
1310d963O1k5k5N7N7N6N7j9k0O8O8PPPQj00j00M5M6J01J02m3m3J40J40onppppj31j30m4m3
$$ y = [-4925, -4961, -4998, -4932, -4867, -4864, -4860, -4857, -4853, -4861, -4869, -4877, -4885, -4843, -4800, -4757, -4715, -4749, -4784, -4819, -4854, -4858, -4862, -4866, -4870, -4836, -4803, -4856, -4910, -4882, -4854, -4913, -4972, -5001, -5030, -4972, -4914, -4889, -4864, -4828, -4792, -4891, -4817, -4737, -4832, -4888, -4857, -4891, -4926, -4889, -4938, -5037, -4962, -4901, -4841, -4769, -4697, -4763, -4829, -4750, -4671, -4744, -4818, -4891, -4964, -4904, -4845, -4872, -4900, -4829, -4759, -4775, -4792, -4760, -4728, -4696, -4664, -4803, -4941, -4877, -4812, -4777, -4742, -4598, -4628, -4755, -4707, -4768, -4829, -4814, -4798, -4783, -4767, -4803, -4838, -4874, -4909, -4890, -4871, -4852, -4833, -4812, -4792, -4798, -4891, -4992, -4919, -4864, -4722, -4667, -4785, -4888, -4991, -4987, -4983, -4979, -4975, -4949, -4924, -4985, -5046, -5025, -5004, -4982, -4961, -4863, -4766, -4814, -4861, -4907, -4953, -4932, -4999, -5132, -4975, -4851, -4726, -4710, -4839, -4887, -4934, -4965, -4996, -4940, -4884, -4889, -4895, -4900, -4905, -4856, -4807, -4844, -4882, -4914, -4945, -4977, -5008, -5014, -5020, -4949, -4877, -4848, -4964, -5048, -5044, -5063, -5081, -5036, -5078, -5100, -4977, -4897, -4905, -4807, -4796, -4884, -4884, -4838, -4879, -4952, -5026, -5068, -5111, -5067, -5023, -5007, -4991, -4889, -4786, -4812, -4838, -4777, -4716, -4723, -4730, -4736, -4743, -4755, -4767, -4780, -4792, -4750, -4708, -4666, -4625, -4567, -4509, -4596, -4683, -4652, -4621, -4591, -4560, -4589, -4618, -4647, -4677, -4745, -4813, -4881, -4949, -4977, -5006, -4947, -4888, -4813, -4738, -4750, -4762, -4828, -4895, -4961, -5027, -4968, -4909, -4850, -4791, -4812, -4832, -4853, -4874, -4912, -4949, -4987, -5025, -4963, -4902, -4927, -4952, -4895, -4838, -4782, -4725, -4744, -4764, -4696, -4628, -4621, -4614, -4607, -4599, -4699, -4799, -4754, -4708, -4607, -4505, -4548, -4591, -4451, -4311, -4317, -4322, -4329, -4336, -4343, -4350, -4481, -4611, -4655, -4698]
1306d698n4n5n4n4L6L6L7L6q1q0OOk8k8J6J5k4k3K0J9L9L9nmK7K7o0o0N2N1N2N1J5J5J6J5
1302d682J33J33j3j2ppppk2k3o6o6J6J5J02J03mlQ3Q3l6l7j24j24j08j07k1k0%%%%L8L8m9
1298d801m9q4q4LLj9j9J27J26n8n8K9K9k7k7k7k7k4k3O4O3j2j2P4P5P4P4P4P3R1R0R0R0p2
1294d174p3p3p2j17j16k9k9o2o1K5K6k1k1K3K3o9o8o8o9K0J9K0J9j5j5P2P2mnmmo8o8P6P7
1290d833K8K8n9n9n7n6L0L1n4n4j0j1J09J09K2K1J4J4J3J4q2q2NNN8N8J4J4L3L3j1j1o5o5
1286d856Q0P9j37j37n0n0llM1M0l7l8NOJ5J5J4J5L4L4n3n2l4l4N3N3J8J8k6k5l3l3J1J0m3
1282e103m4J02J02j8j8K5K6n1n0L6L7l7l7N0N0k2k1k1k2J01J01J4J4m1m1KKj1j2j1j1k1k0
1279d950m9j37q0O5J14K7LKLKoQ0K7j19l9m0L9L9NNM9M8L0K9n8n7M6M5KLl6l5J38oj14k6L
$$ y = [-4698, -4752, -4807, -4861, -4915, -4879, -4843, -4806, -4770, -4851, -4931, -4925, -4919, -4947, -4975, -4959, -4944, -4968, -4991, -4971, -4952, -4913, -4874, -4879, -4883, -4856, -4829, -4889, -4949, -4897, -4846, -4794, -4743, -4728, -4713, -4697, -4682, -4549, -4416, -4429, -4441, -4448, -4455, -4462, -4469, -4491, -4514, -4580, -4646, -4630, -4615, -4513, -4410, -4414, -4417, -4334, -4251, -4287, -4324, -4448, -4572, -4680, -4787, -4808, -4828, -4828, -4828, -4828, -4828, -4790, -4752, -4801, -4850, -4934, -5018, -5015, -5012, -5031, -5050, -4923, -4797, -4855, -4913, -4884, -4855, -4882, -4909, -4936, -4963, -4987, -5010, -4946, -4883, -4895, -4907, -4833, -4758, -4684, -4610, -4536, -4463, -4372, -4282, -4192, -4102, -4174, -4247, -4320, -4392, -4509, -4625, -4654, -4683, -4745, -4806, -4781, -4755, -4776, -4797, -4774, -4751, -4820, -4888, -4956, -5025, -5005, -4986, -4966, -4947, -4962, -4977, -4905, -4833, -4837, -4842, -4846, -4850, -4918, -4986, -4910, -4833, -4805, -4777, -4836, -4895, -4952, -5008, -4978, -4947, -5001, -5055, -5065, -5076, -4967, -4858, -4836, -4815, -4801, -4787, -4774, -4760, -4842, -4924, -4919, -4914, -4856, -4798, -4784, -4770, -4737, -4704, -4715, -4726, -4791, -4856, -4776, -4697, -4834, -4971, -5021, -5071, -5074, -5077, -5036, -4996, -5033, -5071, -5066, -5060, -5045, -5030, -5016, -5001, -4967, -4933, -4986, -5038, -5072, -5106, -5053, -5000, -4982, -4964, -4990, -5015, -5048, -5081, -5070, -5060, -5103, -5147, -5045, -4943, -4961, -4979, -4954, -4928, -4979, -5029, -4993, -4956, -4993, -5030, -4980, -4930, -4952, -4973, -4994, -5016, -4915, -4814, -4800, -4786, -4827, -4868, -4866, -4864, -4875, -4887, -4898, -4909, -4930, -4950, -4999, -5136, -5216, -5151, -5037, -5010, -5007, -5005, -5002, -5000, -5006, -4926, -4899, -5018, -5057, -5097, -5058, -5019, -5014, -5009, -4960, -4912, -4882, -4853, -4911, -4968, -4922, -4877, -4875, -4872, -4908, -4943, -4805, -4811, -4925, -4951, -4948]
1274d948KMLm0m0J7J8o1o1k9J16J21k3n3L3j3j01%Q7j03j6qpM2M2k5k5j12j12P0P0L2L2jQ5
1270e004P9o5o9J8O2k6j20K5L0n7J2J2r5qP9o5J6J03j0rQ3Q3m1m1m1m2O4O4l2l2L7j07j07
1267e204L7K1K2n7n6P5P5j2j1N7N7q8q7l6l5N2J39Q8n7n7n7P2P3j4j5N7N6l1l1j3j4j4j3P8
1263d943P9o6o6k4k3O4O3o5o5K2K2k1k1k0k1J26J26L9L9j18j18P4P4L1j44kkj4j4K9K9K3K3
1259d884o4o4OOL9L8K7j47n0m9K6K5L6L7o2J12J5J5jjjjL6L5L5L6j9j8j9j8p9p8O7O6PPPP
1255d870l5l5l5l5opppJ5J5J5J5K5K5K5K4j1j2j1j2k2k3k2k3%jJ0J0n1J23J23n2MLj06O9k3
1250d905k4j2j2O6O5j37j37J1J2J1J2Q9Q9LKp5p4p8O6O3q2J8J8m5J01J00m5j9k0k8k9J4J3
1247d969J3J3llLKr2nJ14l0q9r0m0J04O6k2opK1K1k2k3j1j2n6n5J2J3l1l1L4L3L3L4L1L0L1
$$ y = [-4948, -4946, -4942, -4939, -4979, -5019, -5002, -4984, -5045, -5106, -5135, -5019, -4898, -4921, -4974, -4941, -4954, -5055, -5055, -4968, -5071, -5087, -5095, -5102, -5060, -5018, -5043, -5068, -5180, -5292, -5222, -5152, -5120, -5088, -5089, -5004, -4925, -4990, -5059, -5041, -4979, -5005, -5125, -5100, -5070, -5127, -5115, -5103, -5198, -5206, -5127, -5192, -5176, -5073, -5083, -5092, -5009, -4926, -4967, -5008, -5049, -5091, -5027, -4963, -4995, -5027, -4990, -5097, -5204, -5167, -5146, -5124, -5181, -5237, -5162, -5087, -5099, -5110, -5053, -4996, -5084, -5171, -5207, -5242, -5190, -5051, -4963, -5020, -5077, -5134, -5062, -4989, -5003, -5018, -4961, -4905, -4936, -4967, -4980, -4994, -5008, -5021, -4943, -4864, -4930, -4996, -5020, -5043, -4979, -4916, -4981, -5046, -5024, -5002, -5023, -5044, -5064, -5085, -4959, -4833, -4794, -4755, -4873, -4991, -4917, -4843, -4812, -4956, -4958, -4960, -4974, -4988, -4959, -4930, -4907, -4884, -4948, -5012, -5006, -5000, -4961, -4923, -4896, -5043, -5093, -5142, -5116, -5091, -5055, -5018, -5080, -4968, -4953, -4938, -4939, -4940, -4941, -4942, -4906, -4871, -4836, -4800, -4819, -4837, -4856, -4874, -4953, -5031, -4964, -4898, -4891, -4884, -4877, -4870, -4905, -4940, -4975, -5010, -5016, -5023, -5030, -5037, -5022, -5007, -4992, -4977, -4952, -4927, -4902, -4878, -4889, -4901, -4912, -4924, -4946, -4969, -4991, -5014, -5014, -5015, -5005, -4995, -5046, -4923, -4800, -4852, -4848, -4845, -4951, -4882, -4905, -4929, -4941, -4953, -4887, -4822, -4959, -5096, -5085, -5073, -5062, -5050, -4961, -4872, -4869, -4867, -4942, -5016, -5094, -5028, -4965, -5047, -5029, -5011, -5056, -4955, -4855, -4900, -4919, -4939, -4967, -4996, -4982, -4969, -4956, -4943, -4946, -4949, -4946, -4944, -5036, -5041, -4927, -4957, -5046, -5136, -5176, -5072, -5006, -5028, -5034, -5041, -5020, -4999, -5021, -5044, -5055, -5067, -5123, -5178, -5166, -5153, -5184, -5215, -5181, -5148, -5115, -5081, -5050, -5020, -4989]
1242d989L1LKLLJ%%%J2J3l2l1r9r9M6M5o3o3o3o3N3N2N2N2N3N2J0RJ7J8p0o9j2j3j2j2N0N1
1238e062l7l7L6L6m8M0n3R2K1o6J7J6J1J1l2l1N5N5p5p5P0O9M3M3m5m4J3J3m5M2P0p6l8N0
1234d961N6N7k5k5n0n0M0j05q0O4p6J2J9J8J06l9m5m4L3L3l2l2J2J2J6J6k7k7J1J1J1J1L4
1230e046L3L4L3m7m7lmL2L3n5n5j0j1P7P6n7n8L0K9J9J9J00m5q3q3nnN5N5l2l2M8M8l9l8p2
1226e106p1P3P4o6o6K1K1j7j8J27J27o3o3k0k0L0L0L0L0k5k5k5k5L8L7m9n0nnL8L8opm9n0
1222e117N4N3J0J0j4j5K9K9j9k0j9j9j7j7j6j7j4j3j3j4j1j2P6P5j3j3j4j3M1M1m6m6K6K6
1218e042K7K6k5k5k4k5j4j4P3P2K4K4K4K4k2k1k2k1K7K7n9o0J4J5J4J4RQRRRJ0RJ0K2K2o5
1214d917o5PPPOn8n9Q7Q6l1l1l1l2k7k8k8k7O0O0k6k7K2K2K2K3m3m3m2m3N7N7k9l0J9J9J9
$$ y = [-4989, -4958, -4955, -4953, -4950, -4947, -4946, -4946, -4946, -4946, -4934, -4921, -4953, -4984, -5083, -5182, -5136, -5091, -5154, -5217, -5280, -5343, -5290, -5238, -5186, -5134, -5081, -5029, -5019, -5010, -4993, -4975, -5045, -5114, -5126, -5139, -5151, -5163, -5113, -5062, -5099, -5136, -5100, -5064, -5112, -5072, -5125, -5033, -5012, -5078, -5061, -5045, -5034, -5023, -5055, -5086, -5031, -4976, -5051, -5126, -5056, -4987, -4944, -4901, -4946, -4990, -4977, -4964, -5009, -4967, -4897, -4973, -5011, -4961, -4905, -4848, -4873, -4898, -4948, -4998, -4958, -5063, -5143, -5079, -5155, -5143, -5124, -5106, -5000, -5039, -5084, -5128, -5095, -5062, -5094, -5126, -5114, -5102, -5086, -5070, -5097, -5124, -5113, -5102, -5091, -5080, -5046, -5013, -4979, -4946, -4993, -5040, -5043, -5047, -5015, -4982, -5037, -5092, -5102, -5113, -5036, -4960, -5017, -5075, -5045, -5016, -4997, -4978, -4878, -4923, -5006, -5089, -5094, -5099, -5044, -4989, -5021, -5053, -5005, -4957, -4996, -5034, -5106, -5177, -5104, -5030, -5096, -5162, -5141, -5120, -5137, -5155, -5028, -4901, -4964, -5027, -5047, -5067, -5037, -5007, -4977, -4947, -4972, -4997, -5022, -5047, -5009, -4972, -5021, -5071, -5076, -5081, -5043, -5005, -5011, -5018, -5067, -5117, -5063, -5010, -5000, -4990, -5004, -5019, -4990, -4961, -4980, -5000, -5019, -5038, -5055, -5072, -5088, -5105, -5119, -5132, -5145, -5159, -5170, -5182, -5106, -5031, -5044, -5057, -5071, -5084, -5043, -5002, -5048, -5094, -5068, -5042, -5015, -4989, -5014, -5039, -5063, -5088, -5102, -5116, -5043, -4971, -4947, -4923, -4899, -4875, -4897, -4918, -4940, -4961, -4934, -4907, -4966, -5026, -5012, -4997, -4983, -4969, -4960, -4952, -4943, -4934, -4925, -4915, -4906, -4896, -4874, -4852, -4917, -4982, -4975, -4968, -4961, -4955, -5013, -5072, -4985, -4899, -4930, -4961, -4992, -5024, -5051, -5079, -5107, -5134, -5074, -5014, -5040, -5067, -5045, -5023, -5001, -4978, -5021, -5064, -5106, -5149, -5092, -5035, -5064, -5094, -5075, -5056, -5037]
1210e037K0K4K5K5K4j3j4j3j4o4o5o4o4O7O7O8O7PQPQk0j9O7O8k1k1J05J06J22j67j5J59J4
1206d553J4K4K5qqqpJ3J4J4J4j6j6j5j6j25j24l8l7o8o8J9J9K6K6K7K6k0k0k1k0n8n8K9K8
1202d986K3K3K3K2o0o1o1o0m7m7M0M0J3J3J3J3K0J9K0K0L8L7m9m9j1j0P6P7m9m8L8L9j3j2
1198d956j3j3j8j8j8j8J6J5J6J6P5P6p0o9l7l8l7l7M2M3M3M2O8O8j9j9k1k1k1k1M9M8M8M9
1194d750oor3r3n9n9K7K8nnnnQQQQr2r1nnllklO2O2O3O2J5J5p3p2j9k0J25J26o4o3K3K4L0
1190d907L0M1j33M9M9j6j6J6j57j6j6Q2Q1o3o3M0M0lmM5M5m2m3j5j5K9K8k6k5j13j13K4K4
1186e163K5K4n3n3L4L4R8R7l6l7j56J7O5O4K1K0k3k3nnnnO3O4k4k4J9J9J9J9m6m7m6m6l3l3
1182e161N4N4L4L4P8P8l0l0J4J4j25j25P8P8llm7m6OPPPO2O2k5k5NNM8M9q6q5j0rP3j01PQ
$$ y = [-5037, -5017, -4993, -4968, -4943, -4919, -4932, -4946, -4959, -4973, -5037, -5102, -5166, -5230, -5163, -5096, -5028, -4961, -4954, -4946, -4939, -4931, -4951, -4970, -4903, -4835, -4856, -4877, -4772, -4666, -4544, -4711, -4726, -4567, -4553, -4539, -4515, -4490, -4498, -4506, -4514, -4521, -4508, -4494, -4480, -4466, -4482, -4498, -4513, -4529, -4654, -4778, -4816, -4853, -4921, -4989, -4970, -4951, -4925, -4899, -4872, -4846, -4866, -4886, -4907, -4927, -4985, -5043, -5014, -4986, -4963, -4940, -4917, -4895, -4955, -5016, -5077, -5137, -5184, -5231, -5191, -5151, -5138, -5125, -5112, -5099, -5079, -5060, -5040, -5020, -4982, -4945, -4994, -5043, -5054, -5064, -4988, -4911, -4960, -5008, -4970, -4931, -4944, -4956, -4969, -4982, -5000, -5018, -5036, -5054, -5038, -5023, -5007, -4991, -4916, -4840, -4910, -4979, -5016, -5054, -5091, -5128, -5086, -5043, -5000, -4958, -4890, -4822, -4841, -4860, -4881, -4902, -4923, -4944, -4895, -4847, -4799, -4750, -4756, -4762, -4855, -4948, -5007, -5066, -5039, -5011, -5016, -5021, -5026, -5031, -5023, -5015, -5007, -4999, -5091, -5182, -5187, -5192, -5195, -5198, -5200, -5203, -5141, -5079, -5016, -4954, -4939, -4924, -4997, -5069, -5088, -5108, -4983, -4857, -4921, -4984, -4961, -4937, -4907, -4877, -4836, -4969, -4920, -4871, -4887, -4903, -4887, -5044, -5060, -5076, -4994, -4913, -4976, -5039, -4999, -4959, -4962, -4966, -4921, -4876, -4918, -4961, -4976, -4991, -4962, -4934, -4960, -4985, -5098, -5211, -5187, -5163, -5138, -5114, -5167, -5220, -5186, -5152, -5054, -4957, -4993, -5030, -5186, -5169, -5104, -5040, -5019, -4999, -5022, -5045, -5050, -5055, -5060, -5065, -5002, -4938, -4962, -4986, -4967, -4948, -4929, -4910, -4956, -5003, -5049, -5095, -5128, -5161, -5107, -5053, -5019, -4985, -4907, -4829, -4859, -4889, -4875, -4861, -4986, -5111, -5033, -4955, -4958, -4961, -5008, -5054, -5048, -5041, -5034, -5027, -4965, -4903, -4928, -4953, -4948, -4943, -4895, -4846, -4932, -5017, -5027, -5036, -4963, -5064, -5057, -5049]
1177e049lJ71k5k5P3j01lmo3o4K4K4R4R4j09j08m9m8K7K8J11o3o3J11J1J0K2K2MNl9m0O5O4
1173d896k3k3M2M1m5m5m4m4M3M3N9O0k8k8J1J1J2J1lkM1M1o9o8J9J8m2m3M4M4L8L9nnm7m8
1169d891r1r1L9L8nnO0O0k7k7j1j1P6P6K5K5o1o2j7j8P0P0o1o0Q4Q4N3N3l5l4P8P8rrR9R9
1165d358J2J2jkJ84Ro7o6l4l4lkr0q9j61j60M2M2M2M3o7J08j0j84p4p5QRQRj8j7j8j7N9N8
1161d902k8k8n0m9R7J1l3J40M9j26j2j3Q5q9j05O9m0m0K9K8K8K9qqqqk4k5k4k5J2J2J2J2K9
1157e003K9K9K9l1l1l0l1l5l5M6M7k5j12p4J00J3J3O7O7M7M6m0m1PQPPJ3J3j33j32P2P1j5
1153e037j6k0k1k1k1n7n7L0L1M1M2MMo9J9O7j07k2k3J12J12k7k7k7k7L3L2L3L3J7J8J7J7k4
1149d941k4k4k5K9K8N1j24j36L9k2k1j9O8J17n7l9l8R6R6O6O6k1k1m9m8L8L9k3k4k3k4R6R7
$$ y = [-5049, -5052, -4881, -4906, -4931, -4858, -4959, -4962, -4966, -5029, -5093, -5069, -5045, -4951, -4857, -4966, -5074, -5123, -5171, -5144, -5116, -5005, -5068, -5131, -5020, -5009, -4999, -4977, -4955, -4951, -4946, -4985, -5025, -4960, -4896, -4919, -4942, -4900, -4859, -4904, -4949, -4993, -5037, -4994, -4951, -4892, -4832, -4860, -4888, -4877, -4866, -4854, -4843, -4846, -4848, -4807, -4766, -4835, -4903, -4884, -4866, -4908, -4951, -4907, -4863, -4825, -4786, -4791, -4796, -4843, -4891, -4982, -5073, -5034, -4996, -5001, -5006, -4946, -4886, -4913, -4940, -4951, -4962, -4886, -4810, -4785, -4760, -4821, -4883, -4900, -4918, -4848, -4778, -4839, -4899, -4815, -4731, -4678, -4625, -4660, -4694, -4616, -4538, -4547, -4556, -4457, -4358, -4346, -4334, -4335, -4337, -4153, -4144, -4211, -4277, -4311, -4345, -4348, -4350, -4440, -4529, -4690, -4850, -4808, -4766, -4724, -4681, -4748, -4640, -4650, -4834, -4908, -4983, -4975, -4966, -4958, -4949, -4967, -4984, -5002, -5019, -4960, -4902, -4930, -4958, -5008, -5057, -4960, -4949, -4982, -4842, -4793, -4919, -4931, -4944, -4859, -4948, -5053, -4984, -5024, -5064, -5035, -5007, -4979, -4950, -4958, -4966, -4974, -4982, -5006, -5031, -5055, -5080, -5068, -5056, -5044, -5032, -5003, -4974, -4945, -4916, -4947, -4978, -5008, -5039, -5074, -5109, -5063, -5016, -5041, -5153, -5227, -5127, -5114, -5101, -5034, -4967, -4920, -4874, -4914, -4955, -4948, -4940, -4933, -4926, -4913, -4900, -5033, -5165, -5093, -5022, -5037, -5053, -5073, -5094, -5115, -5136, -5193, -5250, -5220, -5189, -5148, -5106, -5102, -5098, -5167, -5148, -5081, -5188, -5210, -5233, -5121, -5009, -5036, -5063, -5090, -5117, -5084, -5052, -5019, -4986, -4969, -4951, -4934, -4917, -4941, -4965, -4989, -5014, -4985, -4957, -4906, -5030, -5166, -5127, -5149, -5170, -5189, -5121, -5004, -5061, -5100, -5138, -5042, -4946, -4880, -4814, -4835, -4856, -4905, -4953, -4915, -4876, -4899, -4923, -4946, -4970, -4874, -4777]
1146d777RRJ3J4J3J4p7p7RJ0L5L4L4L5n1n1L6L6L4L4n3n3kkQ4Q5M5M5m2m3j02j01J01J01N6
1142d545N6N6N6J7J8J04J04P6P5L3L2Q6Q7M3M3J9J9J9K0j6j7j61j61J1J0J1j34n3L4K0J9j7
1138d036j7o7o6M1m6p9O6N5N5O5O4poQ1Q0P7P6Q6Q5J7J62K48J04P0P0N2N3K6j18j24K1N6l2
1134b888j19k06j04M1j33j34j59j60L5L4O8p7q8jj00r9ppN0N0N0N0L7L7L7L7L1L2L1L2P7P6
1130c477j0j0J2J1J2J1l5l5j22j22n4n4n5n4o4o3j08j07j05j04j8j8P0P1p5p5J%m3m3M7M8
1127d568M7M7k0k1k1k0K7K8K7K8K4K5j9j9j09j10L6L6L6L7L6L6j15j16k9k9llmlL7L8m9n0
1123d763K9K8P2P2j3j3L1L0o2o2K5K5p5p5p5p4P4P4j3j4J5J5J5J5j2j2j2j2NONOk6k5k5k6
1119d847J7J6J04J03r4r4qpO1O1P2j02mmj02j02j4j5P3P3qqn1n1M1M1M2M1k9l0k9k9L1L2j3
$$ y = [-4777, -4768, -4759, -4746, -4732, -4719, -4705, -4782, -4859, -4850, -4840, -4805, -4771, -4737, -4702, -4753, -4804, -4768, -4732, -4698, -4664, -4717, -4770, -4772, -4774, -4690, -4605, -4560, -4515, -4557, -4600, -4702, -4803, -4702, -4601, -4545, -4489, -4433, -4377, -4360, -4342, -4238, -4134, -4058, -3983, -3950, -3918, -3832, -3745, -3702, -3659, -3640, -3621, -3602, -3582, -3598, -3615, -3776, -3937, -3926, -3916, -3905, -4039, -4092, -4058, -4038, -4019, -4036, -4053, -4120, -4186, -4145, -4191, -4270, -4204, -4149, -4094, -4029, -3965, -3972, -3978, -3897, -3817, -3740, -3664, -3578, -3493, -3476, -3314, -3066, -2962, -2892, -2822, -2770, -2717, -2691, -2809, -2933, -2912, -2856, -2888, -3007, -3213, -3317, -3276, -3409, -3543, -3702, -3862, -3827, -3793, -3725, -3802, -3890, -3891, -3991, -4090, -4097, -4104, -4054, -4004, -3954, -3904, -3867, -3830, -3793, -3756, -3725, -3693, -3662, -3630, -3553, -3477, -3487, -3497, -3485, -3474, -3462, -3451, -3486, -3521, -3643, -3765, -3819, -3873, -3928, -3982, -4046, -4109, -4217, -4324, -4429, -4533, -4551, -4569, -4499, -4428, -4503, -4578, -4577, -4577, -4620, -4663, -4616, -4568, -4521, -4474, -4494, -4515, -4536, -4556, -4529, -4501, -4474, -4446, -4422, -4397, -4416, -4435, -4544, -4654, -4618, -4582, -4546, -4509, -4473, -4437, -4552, -4668, -4697, -4726, -4729, -4732, -4736, -4739, -4702, -4664, -4713, -4763, -4734, -4706, -4634, -4562, -4575, -4588, -4557, -4527, -4589, -4651, -4626, -4601, -4676, -4751, -4826, -4900, -4826, -4752, -4765, -4779, -4764, -4749, -4734, -4719, -4731, -4743, -4755, -4767, -4762, -4756, -4751, -4745, -4771, -4796, -4821, -4847, -4830, -4814, -4710, -4607, -4701, -4795, -4803, -4810, -4749, -4688, -4616, -4718, -4722, -4726, -4828, -4930, -4944, -4959, -4886, -4813, -4821, -4829, -4880, -4931, -4890, -4849, -4807, -4766, -4795, -4825, -4854, -4883, -4852, -4820, -4833]
1115d833j2n5n6K1K0J11o4j9J54n4n3M5M4m7m7M0M0j09j10L5L6N2N2J9K0q7Q7j0j1J7J6p0
1111d828p0ppL7L6J5J4N8N8p8p8MLNq1j36L8J35M8K1K0m6m7lmMLLLk4k4k4k4lkkln2n2n2n3
1106e195J00J00J00J00k1k2k1k2J%%%MMLMj8j8j8j8l7l8l7l7L7L7L7L7Q0Q0opp7p7J25J26
1102d694r2r3noMMLMl4l3J11J12n5n6L2L2mlllJ0J1l3l3m0l9M7M7J%m3m4J64J64j55j55J9
1098d858J9k5k5O0O0k8k7j2j2j2j2R2R3n3n3r4r5ppM5M5r9j00K4K4K4K3L5L5L4L5J3J2J3J3
1094d820J7J7J6J7p7p8RJ0J05J06m0l9o9p0J8J7M8M7MMk3k2k3k2N8N8k9k9%jm4m5M5M4j01
1090d892j01M6M6m1m1M8M9NNopq3q2k5J50J55j9j03j5p5p5N7N7N7N7K4K4K3K4L0L1O8O9qr5
1086d643n6J17KLN6N7k4k4O3O3j2j2J32J33l2l1N6N5l6l6p9p9%%M4M4J0Rp7p7l7l7j23j24
$$ y = [-4833, -4845, -4900, -4956, -4935, -4915, -4804, -4868, -4887, -4733, -4787, -4840, -4795, -4751, -4798, -4845, -4805, -4765, -4874, -4984, -4949, -4913, -4861, -4809, -4790, -4770, -4857, -4770, -4780, -4791, -4774, -4758, -4828, -4898, -4905, -4912, -4875, -4839, -4824, -4810, -4752, -4694, -4772, -4850, -4846, -4843, -4838, -4919, -5055, -5017, -4882, -4834, -4813, -4793, -4839, -4886, -4889, -4893, -4889, -4886, -4883, -4880, -4904, -4928, -4952, -4976, -4979, -4981, -4983, -4986, -5038, -5090, -5142, -5195, -5095, -4995, -4895, -4795, -4816, -4838, -4859, -4881, -4880, -4880, -4880, -4880, -4876, -4872, -4869, -4865, -4883, -4901, -4919, -4937, -4974, -5012, -5049, -5086, -5049, -5012, -4975, -4938, -4858, -4778, -4784, -4791, -4868, -4945, -4820, -4694, -4786, -4879, -4884, -4890, -4886, -4882, -4879, -4875, -4909, -4942, -4831, -4719, -4774, -4830, -4798, -4766, -4770, -4773, -4776, -4779, -4769, -4758, -4791, -4824, -4864, -4903, -4856, -4809, -4808, -4808, -4851, -4895, -4731, -4567, -4722, -4877, -4858, -4839, -4864, -4889, -4829, -4769, -4797, -4824, -4836, -4848, -4860, -4872, -4780, -4687, -4740, -4793, -4887, -4982, -4989, -4996, -4951, -4906, -5005, -5105, -5081, -5057, -5033, -5010, -4975, -4940, -4906, -4871, -4858, -4846, -4833, -4820, -4803, -4786, -4770, -4753, -4830, -4908, -4899, -4889, -4784, -4678, -4718, -4757, -4826, -4896, -4878, -4861, -4813, -4766, -4762, -4758, -4781, -4803, -4826, -4848, -4790, -4732, -4761, -4790, -4790, -4791, -4835, -4880, -4835, -4791, -4892, -4993, -4947, -4901, -4942, -4983, -4935, -4886, -4881, -4876, -4882, -4889, -4972, -5054, -5079, -4929, -4774, -4793, -4896, -4911, -4986, -5061, -5004, -4947, -4890, -4833, -4809, -4785, -4762, -4738, -4708, -4677, -4609, -4540, -4548, -4643, -4699, -4582, -4580, -4577, -4521, -4464, -4488, -4512, -4449, -4386, -4398, -4410, -4278, -4145, -4177, -4208, -4152, -4097, -4133, -4169, -4248, -4327, -4327, -4327, -4283, -4239, -4229, -4220, -4297, -4374, -4411, -4448, -4571, -4695]
1082d695j0rP7P7K3K2J8J7P4j3o2J13N9O0P0P1JJJJk1k1k1k0JKJ2J3r8P6Q1r2j20l2N2N3K5
1078d214K6j8j9Q1Q0J35J34l3J41J03p1j01j4P0P1j6j6K8K7j44j45j66PM6j29o3o3LLq3q4
1074d424n2n2nJ69L4L4j00j00q1q2J21J21j8j7O9P0k8k9N9N8n9n9Q6Q6q9q8J15J15L9M0m7
1071d114m8j2j2n5n6O7O7O7O7ooopJ75J74Q7Q7N1N1N1N1N7N6l1l1K9K9L0K9o5o4o5o4j85j84
1067c786r7r7j0rr7r7n7n8K9L0P4P5L1L1mnmmJ14J15J14J15M9M9M9N0q7q6q7q6j03j03j03
1063d055j02%Jq7q6k1k2k1k1J7J6p0p0R3R2OOK8K9K8K9K1K1o6o5J6J6J6J7m1m1M6M6O0N9J6
1059d089J5MMMMQ4Q5llq6q7N9N9n1n1n1n2MLLLP0O9j7j8J06J07O3O3N5N4N5N4k7k8k8k8o6
1055c658o6o6o6j5j5j5j5P0P0P0P1j00j00M4M5J55J54J0J0Q9Q9KLN2N3r3r2p3p2p3p2l8l9
$$ y = [-4695, -4705, -4714, -4637, -4560, -4537, -4515, -4497, -4480, -4406, -4419, -4481, -4368, -4309, -4249, -4179, -4108, -4107, -4106, -4105, -4104, -4125, -4146, -4167, -4187, -4186, -4184, -4172, -4159, -4257, -4181, -4100, -4192, -4312, -4344, -4292, -4239, -4214, -4188, -4206, -4225, -4144, -4064, -3929, -3795, -3828, -3687, -3584, -3655, -3756, -3770, -3700, -3629, -3645, -3661, -3633, -3606, -3750, -3895, -4061, -4054, -4008, -4137, -4200, -4263, -4260, -4257, -4340, -4424, -4476, -4528, -4533, -4364, -4330, -4296, -4396, -4496, -4577, -4659, -4538, -4417, -4435, -4452, -4383, -4313, -4341, -4370, -4311, -4253, -4312, -4371, -4285, -4199, -4288, -4376, -4261, -4146, -4107, -4067, -4114, -4162, -4174, -4186, -4241, -4297, -4230, -4163, -4096, -4029, -4035, -4041, -4047, -4054, -3879, -3705, -3618, -3531, -3480, -3429, -3378, -3327, -3270, -3214, -3245, -3276, -3247, -3218, -3188, -3159, -3224, -3288, -3353, -3417, -3602, -3786, -3883, -3980, -3990, -3999, -4096, -4193, -4250, -4308, -4279, -4249, -4175, -4100, -4069, -4038, -4042, -4047, -4051, -4055, -3941, -3826, -3712, -3597, -3548, -3499, -3450, -3400, -3487, -3573, -3660, -3746, -3849, -3952, -4055, -4157, -4157, -4156, -4243, -4329, -4350, -4372, -4393, -4414, -4397, -4381, -4451, -4521, -4428, -4336, -4330, -4324, -4296, -4267, -4239, -4210, -4189, -4168, -4234, -4299, -4283, -4267, -4251, -4234, -4275, -4316, -4270, -4224, -4164, -4105, -4089, -4074, -4070, -4066, -4062, -4058, -3974, -3889, -3892, -3895, -3981, -4068, -4009, -3950, -4001, -4052, -4103, -4155, -4151, -4148, -4145, -4142, -4072, -4003, -4020, -4038, -3932, -3825, -3762, -3699, -3644, -3590, -3535, -3481, -3508, -3536, -3564, -3592, -3658, -3724, -3790, -3856, -3871, -3886, -3901, -3916, -3846, -3776, -3706, -3635, -3735, -3835, -3791, -3746, -3591, -3437, -3427, -3417, -3328, -3239, -3237, -3234, -3182, -3129, -3222, -3314, -3387, -3459, -3532, -3604, -3642, -3681]
1051c681j25j25m0m0M7M8j05j05j7j8RRN2N2klkkN7N8l0l0O1O0J7J7M3M3m4m4j25j25J9K0
1047d051jjm4m5j9j8O8O9l4l4l4l4j6j5j6j6%J%JKKq5q5K4K4K4K4l6l5J10J10K2K3K3K2l2
1043d102l3N4N4N4N5l3l3l1l0l1l1o3o4K4K4MMMNm1m1m1m1N3N3N3N4k7k6k7k6N5N5N5N6nm
1038d014nmn2n3L5L5o3o3K4K4j7j7j7j7K5K4K5K5L0L0L1L0m6m6R9J00m0m0M7M7K3K4K3K4j2
1034c781j1P5P5Q7Q6n9n9L0K9L0K9j0j1r7r7K3K3K3K3L4L4L4L4N5N5l1l2N3N4N3N4J07J08
1031b980J07J07N5N5N5N5j54j53M9N0p0p0p0p0O0O0k7k7n9o0Q5Q6M7M8M7M8J3J3J00J00oo
1027b512Q1Q1O4O5O5O4m0m1n1J22Q4Q5QQJ42J43N5N5J09J10J09J10J49J49N1K24K07K07K17
1024A20K17K83K82K82K82L91L91L91L91M86M86L88N62O31O31Q44Q45R07R07J270J444J581
$$ y = [-3681, -3806, -3931, -3971, -4011, -3964, -3916, -4021, -4126, -4143, -4161, -4152, -4143, -4091, -4039, -4041, -4044, -4046, -4048, -3991, -3933, -3963, -3993, -3932, -3872, -3855, -3838, -3795, -3752, -3796, -3840, -3965, -4090, -4071, -4051, -4052, -4053, -4097, -4142, -4161, -4179, -4111, -4042, -4076, -4110, -4144, -4178, -4194, -4209, -4225, -4241, -4241, -4240, -4240, -4239, -4237, -4235, -4320, -4405, -4381, -4357, -4333, -4309, -4345, -4380, -4270, -4160, -4138, -4115, -4092, -4070, -4102, -4135, -4081, -4027, -3973, -3918, -3951, -3984, -4015, -4045, -4076, -4107, -4170, -4234, -4210, -4186, -4182, -4178, -4174, -4169, -4210, -4251, -4292, -4333, -4280, -4227, -4174, -4120, -4147, -4173, -4200, -4226, -4171, -4116, -4061, -4005, -4010, -4014, -4019, -4023, -4075, -4128, -4093, -4058, -4121, -4184, -4160, -4136, -4153, -4170, -4187, -4204, -4179, -4155, -4130, -4105, -4075, -4045, -4014, -3984, -4030, -4076, -3977, -3877, -3917, -3957, -3910, -3863, -3840, -3816, -3793, -3769, -3781, -3792, -3717, -3642, -3555, -3469, -3528, -3587, -3557, -3528, -3498, -3469, -3479, -3490, -3587, -3684, -3661, -3638, -3615, -3592, -3558, -3524, -3490, -3456, -3401, -3346, -3377, -3409, -3356, -3302, -3249, -3195, -3088, -2980, -2873, -2766, -2711, -2656, -2601, -2546, -2700, -2853, -2804, -2754, -2824, -2894, -2964, -3034, -2974, -2914, -2941, -2968, -3027, -3087, -3002, -2916, -2869, -2821, -2774, -2726, -2713, -2700, -2600, -2500, -2506, -2512, -2431, -2350, -2286, -2221, -2156, -2092, -2132, -2173, -2224, -2102, -2018, -1933, -1925, -1917, -1775, -1632, -1577, -1522, -1413, -1303, -1194, -1084, -935, -786, -735, -511, -304, -97, 120, 337, 620, 902, 1184, 1466, 1857, 2248, 2639, 3030, 3516, 4002, 4390, 4952, 5583, 6214, 7058, 7903, 8810, 9717, 10987, 12431, 14012]
1021A4012J987K357K647L186L592L936M342M686M687M320L683K553J220k95j629k792l547
1019D8945l832l832l546k907k419j664r47n41l3M88Q59J265J765K403L015L653M560N661O684
1017E9577P903Q830R584R911R388P982N721K700o06m099p173r412j0514j0736r981q688p180
1015E3207n923m879l813k770k044j465r12l33J76N23R98J577K172K752L584M164M773N121
1013E6908M907M327L384J877J91k013l890n166o141o140n772n191m279l468k714k134j627
1011B3059j278j014o67l29j55JJ75K79M54N99P72J010J183J357J705J959K307K887L235L899
1009D1438M712N639O683P876Q919R949J0760J0796R984Q491N824K493j103m378p047q913r726
1007A02397r377q334p003n496m075k568j366l23Q52J664K631L675M922O429Q117R856J2089
$$ y = [14012, 15999, 18356, 21003, 24189, 27781, 31717, 36059, 40745, 45432, 49752, 53435, 55988, 57208, 56913, 55284, 52492, 48945, 45113, 41281, 37735, 34828, 32409, 30745, 29798, 29257, 29224, 29712, 30571, 31836, 33601, 36004, 39019, 42672, 47232, 52893, 59577, 67480, 76310, 85894, 95805, 105193, 113175, 118896, 121596, 120990, 116891, 109718, 100306, 89792, 79056, 69075, 60387, 53207, 47284, 42405, 38592, 35822, 33778, 32313, 31401, 31068, 31244, 31767, 32765, 34342, 36514, 39266, 42850, 47014, 51787, 56908, 61815, 66142, 69526, 71403, 71594, 69581, 65691, 60525, 54384, 48244, 42472, 37281, 33002, 29534, 26820, 24686, 23059, 21781, 20767, 20100, 19771, 19616, 19617, 19792, 20071, 20525, 21124, 21896, 22906, 24089, 25446, 27151, 29110, 31417, 34304, 37539, 41438, 46150, 51789, 58472, 66348, 75267, 85216, 95976, 106772, 116756, 125247, 131071, 133564, 132461, 128083, 121036, 112123, 102397, 93020, 84686, 77683, 72187, 68112, 65544, 64178, 63855, 64707, 66371, 69002, 72677, 77599, 84028, 92145, 102001, 114090]
1005A14090J4292J6963J9399K1168K1515K0439J7308J2263N652j889r661j6220k0975k3154
1003A91190k3154k1437j8768j5739j2840j0187p983o198m458l067k022q45J99J054K098L102
1002G0945M377N654O929Q219R263R669R495Q411O149K960o93m477p899j0472j2153j2568j2046
1000H1763j0902r335p821o602n364m261l508k871k414k008j493j203r93q19n62l88l12j38
998B0769K2K2L22O13Q85J176J386J792K219K741L452M205M983N621O048O223N679M693L105
995G5956J192r63k992m501n486n953n664m917l931l026k272j468r45l59K79J005J526J917
993C9398K556L338M324N241O343P778R228J0353J1223J1513J0759Q979O254K558j444n386
991A33015q807j1293j2395j2410j1423r917q350o732n398m268l282k517j763j082n60O6N89
$$ y = [114090, 128382, 145345, 164744, 185912, 207427, 227866, 245174, 257437, 263089, 261200, 251539, 235319, 214344, 191190, 168036, 146599, 127831, 112092, 99252, 89065, 81082, 74884, 70426, 67359, 65337, 64492, 64691, 65745, 67843, 70945, 75322, 80976, 87905, 96124, 105387, 115056, 124551, 132962, 139111, 142071, 141378, 136901, 129002, 118530, 106377, 93809, 81763, 70861, 61526, 53705, 47103, 41739, 37478, 33970, 31099, 28685, 26677, 25184, 23981, 22988, 22169, 21607, 21219, 20907, 20769, 20791, 20813, 21135, 21748, 22633, 23809, 25195, 26987, 29206, 31947, 35399, 39604, 44587, 50208, 56256, 62479, 68158, 72851, 75956, 77148, 76185, 73193, 68692, 63206, 57253, 51589, 46672, 42741, 39715, 37443, 35975, 35030, 34671, 34950, 35955, 37481, 39398, 41954, 45292, 49616, 54857, 61200, 68978, 78206, 88559, 99782, 111295, 122054, 131033, 137287, 139845, 138401, 133015, 124208, 112915, 100520, 88110, 76687, 66770, 58420, 51688, 46290, 42022, 38740, 36223, 34460, 33378, 32818, 32884, 33473]
990C3473J146J669K270K907L488M010M533M707M345L707K602R20q78k559m138n471o116o290
987D4325o029n507m775m022l415k777k335k045j672j382j197r07q42q42o68o67p15n41m25
985C562m25m95l21l32l31k04k04k69r5j14k87j79j78j50j50j50j51q2q2q2q2l7l7l6l7n5n5
982a058k40o6LKj90j90j00j01n6n7n1n0j26j27j3J61P4j00p3p4LKj3j4L1L0OPq1q0N1N0PP
978b426p8p8l4l5m5m6m5m5popoP4P4P5P4r2r3r2r3j7j7j7j8l8l9l9l9LLLLq4q5J3J3l4J39
974c181kjj5j4k6k5R7p7j31M3Kj72K4K4M5M5m2m2Q5Q5M1M2L1L2j2j2N1N1N2N1MMNJ49J55O9
970b565M0L9JJM4M5J5J5p1p2r4r5j37PM0m7l3l3p7p8RJ0l6l6PQP9P9qqj52j52ppM1M0m6m7
966c281q5q4q0O6L5L5M4j01o8J8M8M8M7M8l9l9opL7L7qqJ26j9r0N5N1N2K2K2K2K2P9Q0qqq5
$$ y = [33473, 34619, 36288, 38558, 41465, 44953, 48963, 53496, 58203, 62548, 66255, 68857, 69777, 68899, 66340, 62202, 56731, 50615, 44325, 38296, 32789, 28014, 23992, 20577, 17800, 15465, 13420, 11748, 10366, 9169, 8262, 7420, 6578, 5910, 5243, 4528, 3987, 3562, 3137, 2642, 2321, 1989, 1658, 1454, 1250, 981, 886, 772, 485, 306, 128, -22, -172, -322, -473, -555, -637, -719, -801, -838, -875, -911, -948, -1003, -1058, -1298, -1364, -1361, -1359, -1549, -1739, -1839, -1940, -1996, -2053, -2104, -2154, -2280, -2407, -2420, -2259, -2185, -2285, -2358, -2432, -2429, -2427, -2440, -2454, -2423, -2393, -2387, -2380, -2461, -2541, -2490, -2440, -2433, -2426, -2504, -2582, -2616, -2651, -2696, -2742, -2787, -2832, -2839, -2845, -2852, -2858, -2784, -2710, -2635, -2561, -2653, -2746, -2838, -2931, -2948, -2965, -2982, -3000, -3038, -3077, -3116, -3155, -3152, -3149, -3146, -3143, -3227, -3312, -3299, -3286, -3320, -3181, -3183, -3184, -3199, -3213, -3239, -3264, -3167, -3244, -3375, -3332, -3330, -3502, -3478, -3454, -3409, -3364, -3406, -3448, -3363, -3278, -3237, -3195, -3164, -3132, -3144, -3156, -3105, -3054, -3002, -2951, -2947, -2943, -2938, -2789, -2634, -2565, -2525, -2486, -2485, -2484, -2440, -2395, -2380, -2365, -2436, -2508, -2602, -2697, -2834, -2827, -2787, -2834, -2867, -2900, -2977, -3055, -3046, -3036, -3072, -3108, -3101, -3093, -3014, -2935, -2943, -2951, -3103, -3255, -3262, -3269, -3228, -3188, -3234, -3281, -3366, -3450, -3530, -3464, -3429, -3394, -3350, -3451, -3519, -3501, -3453, -3405, -3358, -3310, -3349, -3388, -3394, -3401, -3364, -3327, -3335, -3343, -3217, -3236, -3326, -3271, -3220, -3168, -3146, -3124, -3102, -3080, -3001, -2921, -2929, -2937, -3022]
961c022q6J7p1j63j9o1o2N4N4l4l3l2l2K5o1r5N0M5M5L6n2m0J04QPk8k7m4m3%%%%M4M4M4M4
957c384m4m3M4M4m3m4L2L1L1L1O4O3k3k3M0M0Q4Q3j6j6K8K7LLM7M6l9l9l9l9l0k9N8N8o2o2
953c118K0J9j0r7n9J15K8K8k6J48J16n8J38J38LKLLl8l7l7l7p6p6J%M7j28o2o2j58J5O3O2
949c130M1M1m6m6rqL6L5m3m4M4M3L9L9L4L4K8n9j19N6Q1r4j74jN1l6o3o3k6k7J7J7J7J7p0
945c388p0K2K1O4O5j6j6P1P1m1m1J04J04N5N5N5N5LLR5R5nQ2Q7q7n9n8J8J8l1l1l1l1k3k2
941b807K1K1ppQ0Q0J26J27L9M0J01J01J88J88J22J23J99J99J93K0k6j13j91j7J37N0n5L2R4
938i42q0l6K55Q1Q1K13K13K23K24L17M92M91M91M35O08O75Q48J179J180J352J642J770J858
935A3570J993J819J591J300P06O8n62j084j453j626j726j638j344j169q38n48n39k49J65K51
$$ y = [-3022, -3108, -3091, -3162, -3325, -3344, -3405, -3467, -3413, -3359, -3393, -3426, -3458, -3490, -3465, -3526, -3621, -3571, -3526, -3481, -3445, -3497, -3537, -3433, -3425, -3418, -3446, -3473, -3517, -3560, -3560, -3560, -3560, -3560, -3516, -3472, -3428, -3384, -3428, -3471, -3427, -3383, -3426, -3470, -3438, -3407, -3376, -3345, -3281, -3218, -3241, -3264, -3224, -3184, -3100, -3017, -3033, -3049, -3021, -2994, -2991, -2988, -2941, -2895, -2934, -2973, -3012, -3051, -3081, -3110, -3052, -2994, -3056, -3118, -3098, -3079, -3089, -3186, -3245, -3130, -3102, -3074, -3100, -2952, -2836, -2894, -2756, -2618, -2615, -2613, -2610, -2607, -2645, -2682, -2719, -2756, -2832, -2908, -2907, -2907, -2860, -2988, -3050, -3112, -3270, -3255, -3192, -3130, -3089, -3048, -3094, -3140, -3149, -3157, -3121, -3086, -3129, -3173, -3129, -3086, -3047, -3008, -2974, -2940, -2912, -2971, -3090, -3034, -2953, -3047, -3221, -3222, -3171, -3207, -3270, -3333, -3359, -3386, -3369, -3352, -3335, -3318, -3388, -3458, -3436, -3415, -3351, -3286, -3302, -3318, -3247, -3176, -3217, -3258, -3154, -3050, -2995, -2940, -2885, -2830, -2827, -2824, -2729, -2634, -2639, -2557, -2470, -2557, -2616, -2674, -2656, -2638, -2669, -2700, -2731, -2762, -2785, -2807, -2786, -2765, -2772, -2779, -2699, -2619, -2493, -2366, -2327, -2287, -2186, -2085, -1897, -1709, -1587, -1464, -1265, -1066, -873, -853, -879, -992, -1183, -1200, -1063, -1013, -1068, -1036, -942, -1022, -1058, -803, -722, -641, -428, -215, 8, 232, 549, 1041, 1532, 2023, 2458, 3066, 3741, 4589, 5768, 6948, 8300, 9942, 11712, 13570, 15563, 17382, 18973, 20273, 20979, 21047, 20485, 19401, 17948, 16322, 14596, 12958, 11614, 10445, 9607, 9059, 8520, 8271, 8436, 8687]
933H687L30O19R33J107J260J665K100K506L093L615L937M112M002L481K611J392j3j464k847
931D1126l834m294m294l957l436k925k403j863j456j088o81m84l09r9J91K85M58O70R59J250
928A3816J541J719K124K215K215K051J530Q71J18p53j391j979k385k431k344k002j712j464
926A1739j173j037p46n49l74l52k65j58j58J1J2J56J56L39L39L43M31N99P73Q54J028J169
924A3137J344J670K076K369K892L523M046M278M364M182L659K593J258k49j699k840l710m109
922C8784l818l489k967k272j633j035o30k45J61O71R62J237J759K442L080L811M682N736O839
920E4075P823Q578Q949Q542P252N107K338p36m070o796q767r637r391q637p626o176n002l900
917C1926k990k351j670j149o41l51k5M97R59J365J915K554L023L544M000M086L915L508K517
$$ y = [8687, 9017, 9636, 10569, 11676, 12936, 14601, 16701, 19207, 22300, 25915, 29852, 33964, 37966, 41447, 44058, 45450, 45437, 43973, 41126, 37292, 32998, 28704, 24747, 21311, 18386, 15983, 14120, 12664, 11576, 10895, 10411, 10102, 10003, 10194, 10479, 10937, 11607, 12566, 13816, 15357, 17076, 19200, 21415, 23630, 25681, 27211, 28082, 28200, 27447, 26056, 24077, 21692, 19261, 16917, 14915, 13203, 11739, 10566, 9529, 8783, 8234, 7860, 7508, 7243, 7085, 6927, 6938, 6950, 7106, 7262, 7601, 7940, 8283, 8714, 9313, 10086, 10940, 11968, 13137, 14481, 16151, 18227, 20596, 23488, 27011, 31057, 35335, 39699, 43881, 47540, 50133, 51391, 51142, 49443, 46603, 42893, 38784, 34966, 31477, 28510, 26238, 24605, 23570, 22940, 22695, 22856, 23527, 24489, 25726, 27485, 29927, 33007, 36818, 41500, 47236, 54075, 61898, 70476, 79425, 87967, 95219, 100326, 102664, 101928, 97858, 91062, 82295, 72658, 63267, 54630, 47004, 40828, 35826, 31926, 28936, 26585, 24915, 23766, 23125, 22774, 22749, 23246, 24205, 25570, 27485, 30039, 33062, 36606, 40606, 44692, 48607, 52115, 54632]
915E4632J068m51k017l542m529n103n103m809m288l646l008k349j942j629j224j020q46o16
913I578m43m33l46k08k07j05j04j30M4J49J49K71K71M44O19P31R04J058J347J564J970K202
911A9325K376K492K318K072J434M87k67j072j709k083k256k134j843j490j084p22l15o2K28
909A5695M38O12Q87J060J445J851K376K898L384M137M796N550O050N876N572M586K969J172
907G1354r72l001m611n828o264o089n459m589l873l120k243j489j039p49l44O2L88P94J300
904B4228J707K144K781L376L898M472M993M943M421L546K212P04j209l128m461n396n802n690
902C7739n168m450l813l078k556k013j491j150q60p01n27k60q6J09L99N48P22R79J153J372
900A6868J372J303J130O47J25n05j027j472j762j874j875j638j349j106r32o66m92k39j53
$$ y = [54632, 55700, 55249, 53232, 49690, 45161, 40058, 34955, 30146, 25858, 22212, 19204, 16855, 14913, 13284, 12060, 11040, 10194, 9578, 9135, 8702, 8356, 8148, 7941, 7836, 7732, 7602, 7646, 7795, 7944, 8215, 8486, 8930, 9549, 10280, 11184, 12242, 13589, 15153, 17123, 19325, 21701, 24193, 26511, 28583, 30017, 30504, 30237, 29165, 27456, 25373, 23117, 20983, 19140, 17650, 16566, 15844, 15529, 15467, 15695, 16133, 16745, 17632, 18692, 20137, 21988, 24364, 27262, 30646, 34783, 39579, 45129, 51179, 57055, 62627, 67213, 70182, 71354, 70382, 67381, 62770, 56942, 50678, 44589, 39130, 34541, 30668, 27548, 25305, 23816, 22777, 22028, 21684, 21746, 22134, 22928, 24228, 25935, 28079, 30860, 34236, 38134, 42606, 47599, 52542, 56963, 60509, 62721, 63425, 62216, 59088, 54627, 49231, 43429, 37739, 32571, 28121, 24308, 21230, 18674, 16661, 15170, 14020, 13160, 12459, 11932, 11672, 11586, 11695, 12094, 12642, 13364, 14343, 15496, 16868, 18240, 19543, 20673, 21320, 21445, 20940, 19913, 18441, 16679, 14805, 12930, 11292, 9943, 8837, 7905, 7239, 6747, 6508, 6355]
898F355j51K3Q4J72J35J34J41J40J67J68J29K17K26M01M71M71Q28J119J129J419J702J992
895A7472K407K813L030L117L138K963K345J476O42l44j118j755k241k415k335k044j704j414
893B4033j124r50o82l92j1K79N33J055J497J902K468L106L896M650N386O024O483O484N705
891G0342M602K780O34j577l723n360o347o759o470n904n033m251l497k775k370j942j304q99
889B0147p24k67J38M72P62J088J494J937K343K698K872K858K683K126J371K63r54k013k883
887C6411l463l636l514l339k918k396j933j526j193r03o28m53l83r4J5J6R6R7j06j06l12l12
884I420l11l12j76j76R1R0K48L36N76Q67J183J473J608J781J945J944J883J593J332Q10J20
882B6325k86n05n93p22q10p55p56r05r06r97r98q66o93n73j68J45M34P34J141J510J915K431
$$ y = [6355, 6204, 6227, 6311, 6483, 6618, 6752, 6893, 7033, 7200, 7368, 7497, 7714, 7940, 8341, 8812, 9283, 10111, 11230, 12359, 13778, 15480, 17472, 19879, 22692, 25722, 28839, 31977, 34940, 37285, 38761, 39403, 39059, 37941, 36186, 33945, 31530, 29195, 27151, 25447, 24033, 22909, 21959, 21277, 20885, 20874, 21153, 21686, 22741, 24238, 26140, 28608, 31714, 35610, 40260, 45646, 51670, 58153, 64637, 70342, 74944, 77724, 78358, 76781, 73058, 67698, 61351, 54592, 48122, 42218, 37185, 32934, 29437, 26662, 24292, 22350, 21046, 20147, 19423, 19156, 19294, 19766, 20528, 21616, 23110, 25047, 27390, 30088, 32960, 35818, 38501, 40627, 41998, 42261, 41307, 39294, 36411, 32948, 29312, 25798, 22459, 19541, 17145, 15212, 13686, 12493, 11590, 10962, 10509, 10126, 10032, 10047, 10063, 10159, 10256, 10150, 10044, 9732, 9420, 9109, 8797, 8621, 8445, 8536, 8626, 8874, 9210, 9786, 10653, 11836, 13309, 14917, 16698, 18643, 20587, 22470, 24063, 25395, 26205, 26325, 26039, 25534, 24941, 24219, 23409, 22654, 21898, 20993, 20087, 19090, 18092, 17226, 16533, 15960, 15792, 15937, 16371, 17105, 18246, 19756, 21671, 24102]
879B4102K836L308L481L389L215K621J635N55n47j627k496k994l167l139k732k345k171j964
877B1960j790j396j396j284q78o28m53j84j0L26M13P16J005J095J268J490J489J172Q81N74
875B4370N1m59j098j445j619j912j738j615j441j092r19o64m89m81l95k74j01R1NJ5J02J01
873H993J01J8J9k00k00n5n6o1o2rJ65J05J92K41K41K39K39M47M48M06M93N54P29Q31R19R82
870A5719J069J187J274J279J193J140J141R32R32R56R55J130J420J729K020K454K860L350
868D2740L755L930M219M398M224L934L644L223K934K691K401K237K237K342K516K749L040
866I7214L281L570L757L844L802L802L782L609L602L690L832M354N153O139P023P777Q372
864A76603Q661Q793Q619Q082P328O506N520M455L352K027Q08l18j189j583j584j065l12O16
$$ y = [24102, 26938, 30246, 33727, 37116, 40331, 42952, 44587, 45142, 44595, 42968, 40472, 37478, 34311, 31172, 28440, 26095, 23924, 21960, 20170, 18774, 17378, 16094, 15216, 14588, 14135, 13951, 13941, 14267, 14680, 15396, 16401, 17496, 18764, 20254, 21743, 22915, 23796, 24370, 24421, 23962, 22864, 21419, 19800, 17888, 16150, 14535, 13094, 12002, 11083, 10419, 9930, 9449, 9054, 8780, 8679, 8770, 8775, 8790, 8892, 8993, 9094, 9112, 9131, 8931, 8731, 8676, 8620, 8559, 8497, 8488, 8653, 8758, 8950, 9191, 9432, 9671, 9910, 10357, 10805, 11211, 11704, 12258, 12987, 13818, 14737, 15719, 16788, 17975, 19249, 20528, 21721, 22861, 24002, 24934, 25866, 26822, 27777, 28907, 30327, 32056, 34076, 36530, 39390, 42740, 46495, 50425, 54644, 59042, 63266, 67200, 70844, 74067, 77001, 79692, 82093, 84330, 86567, 88909, 91425, 94174, 97214, 100495, 104065, 107822, 111666, 115468, 119270, 123052, 126661, 130263, 133953, 137785, 142139, 147292, 153431, 160454, 168231, 176603, 185264, 194057, 202676, 210758, 218086, 224592, 230112, 234567, 237919, 239946, 240754, 240436, 239247, 237664, 236080, 235015, 234703, 235319]
862B35319J254J444J357R53L15l75p81p70k47M04J159J882K403K565K478K193J903J612J205
859B56273J053Q80L64j085k614l252m122n920o931o525n525m539l866l692l975m497n294o048
857A90685o541o715o467n945n335m698l995l589l557l382l201l202l125k951k604k313k053
855A21012j762j277q71n09J29P17J238J882K287K484K396K123J369M11l43r27j333j558j559
853A25909j178o55j74L48J000J638K260K666L108L629M025M431M534M447M298M125M151M326
851A72888M617N140N820O459O911P202P057O651O075N320M538M132M141M316M619M910N007
849B65803M717M116L478K429J328N44k09p56j046j163j452j799k090k103j930j705j299p95
847B66068k74n1n0l16o05r38j345j294p72j40O13J332J505J363P26j37j586l252m934o355
$$ y = [235319, 236573, 238017, 239374, 240327, 240642, 240267, 239486, 238716, 238469, 238873, 240032, 241914, 244317, 246882, 249360, 251553, 253456, 255068, 256273, 257326, 258206, 258570, 257485, 254871, 251619, 247497, 241577, 234646, 228121, 222596, 218057, 214191, 210499, 206524, 202027, 196733, 190685, 184144, 177429, 170962, 165017, 159682, 154984, 150989, 147400, 143843, 140461, 137260, 134058, 130933, 127982, 125378, 123065, 121012, 119250, 117973, 117102, 116593, 116722, 117439, 118677, 120559, 122846, 125330, 127726, 129849, 131218, 131629, 131286, 130359, 129026, 127468, 125909, 124731, 124076, 123902, 124250, 125250, 126888, 129148, 131814, 134922, 138551, 142576, 147007, 151541, 155988, 160286, 164411, 168562, 172888, 177505, 182645, 188465, 194924, 201835, 209037, 216094, 222745, 228820, 234140, 238678, 242810, 246951, 251267, 255886, 260796, 265803, 270520, 274636, 278114, 280543, 281871, 282415, 282206, 281450, 280404, 279241, 277789, 275990, 273900, 271797, 269867, 268162, 266863, 266068, 265794, 265743, 265693, 265377, 264772, 263834, 262489, 261195, 260423, 260283, 260896, 262228, 263733, 265096, 265822, 265685, 264099, 260847, 255913, 249558]
845B49558p572q437q959r290r377r241r066q532p894p256o619n849n328m968m677m480m392
843A27621m308m308m005l831l640l351k931k640k378k203k204k378k613k902l331l736m104
841G2758m510m692m865m756m581m401l994l647l241k871k465k225j935j678j503j214j214
839A8966j156r82r14r14p47p47o95n20o19o19n30n30m24k51m07m07l96l96j40j40k86k85k40
836F621k40k40k40k35k34k46k45q1k54k54q1k08k08j11j10j43j43m5k19j82j81j05j05o0o0
834B391o0o0j20j21j20j21r0q9llm4m3m4m4k7k8P1j04k4k4l5l5l0l0j27M6J7J7L8j35k5k5
830I69l6l6o7o7o7o7j6j6onp6R8%%L8L8m9m9J11J10J11J11l7l6J67J67K79K79J93J92J18J18
826B469J3j61k97k97m06k32j32j32j11j10p7R7jjjjjjllQQq5Q9qql9l9M8M7Q5Q4llO7O6N6
$$ y = [249558, 241986, 233549, 224590, 215300, 205923, 196682, 187616, 179084, 171190, 163934, 157315, 151466, 146138, 141170, 136493, 132013, 127621, 123313, 119005, 115000, 111169, 107529, 104178, 101247, 98607, 96229, 94026, 91822, 89444, 86831, 83929, 80598, 76862, 72758, 68248, 63556, 58691, 53935, 49354, 44953, 40959, 37312, 34071, 31200, 28735, 26510, 24575, 22897, 21394, 20180, 18966, 17810, 16828, 15914, 15000, 14253, 13506, 12811, 12291, 11672, 11053, 10523, 9993, 9569, 9318, 8911, 8504, 8108, 7712, 7572, 7432, 7146, 6861, 6621, 6381, 6141, 5901, 5666, 5432, 5186, 4941, 4860, 4606, 4352, 4271, 4063, 3855, 3744, 3634, 3491, 3348, 3303, 3084, 2902, 2721, 2616, 2511, 2451, 2391, 2331, 2271, 2151, 2030, 1910, 1789, 1699, 1610, 1607, 1604, 1560, 1517, 1473, 1429, 1402, 1374, 1445, 1341, 1317, 1293, 1258, 1223, 1193, 1163, 1036, 1082, 1099, 1116, 1154, 1019, 994, 969, 933, 897, 830, 763, 696, 629, 613, 597, 591, 586, 510, 608, 608, 608, 646, 684, 635, 586, 697, 807, 918, 1029, 992, 956, 1123, 1290, 1569, 1848, 2041, 2233, 2351, 2469, 2482, 2321, 2024, 1727, 1321, 1089, 957, 825, 714, 604, 527, 624, 623, 622, 621, 620, 619, 618, 615, 612, 620, 628, 543, 632, 624, 616, 577, 538, 586, 633, 718, 802, 799, 796, 863, 929, 985]
822I85N6J84J0l6l7K5K4J12J11N6N5J43J42P6P5P6P6J08J08K53K53J78J78J78J77K04K03K03
819D176K03K96K96L84L83M55M56M56M56M91M92O94O95Q30Q31J004J179J236J410J585J584
816A9592J651J652J640J641J347J173Q94Q94Q36Q36Q47Q47Q16R89J181J356J393J567J684
814D2836J683J682J681J537J537J562J562J634J809K285K691K984L159L220L220L231K941
812H1254K625K335K002J711J364Q42L19q6m20n95o81n07L6M42O67Q41R56P82L62J4j05j06
810I4052R0M38R36J515J950K298K223J874J294P14K07o06j454k033k179k178k128k127k255
808I2631k255j819j472j071p24r19r19j156j505j711k059k112j938j622j275r75o28m06k33
805F7832p6p7o6o6P1P1P0P1K01K01L35O83Q90J063J365J712J958K306K153K154J857J509J049
$$ y = [985, 1041, 1225, 1235, 1199, 1162, 1187, 1211, 1323, 1434, 1490, 1545, 1688, 1830, 1906, 1981, 2057, 2133, 2241, 2349, 2602, 2855, 3033, 3211, 3389, 3566, 3770, 3973, 4176, 4379, 4675, 4971, 5355, 5738, 6193, 6649, 7105, 7561, 8052, 8544, 9238, 9933, 10763, 11594, 12598, 13777, 15013, 16423, 18008, 19592, 21243, 22895, 24535, 26176, 27523, 28696, 29590, 30484, 31320, 32156, 33003, 33850, 34666, 35655, 36836, 38192, 39585, 41152, 42836, 44519, 46201, 47882, 49419, 50956, 52518, 54080, 55714, 57523, 59808, 62499, 65483, 68642, 71862, 75082, 78313, 81254, 83879, 86214, 88216, 89927, 91291, 92133, 92452, 92366, 91946, 91351, 90670, 90163, 90199, 90641, 91308, 92149, 93105, 93887, 94249, 94263, 94158, 94052, 94142, 94580, 95516, 97031, 98981, 101279, 103502, 105376, 106670, 107384, 107591, 106985, 105531, 103498, 101319, 99141, 97013, 94886, 92631, 90376, 88557, 87085, 86014, 85290, 84371, 83452, 82296, 80791, 79080, 77021, 74909, 72971, 71349, 70074, 69099, 68471, 68065, 67832, 67756, 67679, 67613, 67547, 67618, 67689, 67759, 67830, 68031, 68232, 68567, 69250, 70140, 71203, 72568, 74280, 76238, 78544, 80697, 82851, 84708, 86217, 87266]
803H7266P02N57L83N02Q51J216J795K322K669L038L213L597L945L921L748L624L451L225K878
801A32903K479J899J610J436J527J875K266K614K969K970K933K586K035J455J045J046J270
799A66918J618J949K296K478K478K188J840J210O29K51r6j22k96p49j097j558j905j964j964
797A74104j910j561j301j127r85j160j544j949k348k523k471k298j782j261r03o14o42j048
794A46677j573k212k784l306l753l926m007m006m061m061l764l474l033k628k272j751j351
793I4715j062q74q73r81r81j241j242j267j267p67l61M73J460K575K982J702O00J202K16l119
790I1890m800m460l590k477j956j506j100r21o32j90K17O18J025J372J373J491J490J433J258
788H0535J125R50R62R61J095J269J246J247J182J008P72L66J78Mj45l19m01m02o16o16n55
$$ y = [87266, 87968, 88525, 88908, 89410, 90261, 91477, 93272, 95594, 98263, 101301, 104514, 108111, 112056, 115977, 119725, 123349, 126800, 130025, 132903, 135382, 137281, 138891, 140327, 141854, 143729, 145995, 148609, 151578, 154548, 157481, 160067, 162102, 163557, 164602, 165648, 166918, 168536, 170485, 172781, 175259, 177737, 179925, 181765, 182975, 183604, 183855, 183759, 183637, 183341, 182592, 181495, 179937, 178032, 176068, 174104, 172194, 170633, 169332, 168205, 167220, 166060, 164516, 162567, 160219, 157696, 155225, 152927, 151145, 149884, 148981, 148367, 147725, 146677, 145104, 142892, 140108, 136802, 133049, 129123, 125116, 121110, 117049, 112988, 109224, 105750, 102717, 100089, 97817, 96066, 94715, 93653, 92779, 91906, 90925, 89944, 88703, 87461, 86194, 84927, 84160, 83799, 84272, 85732, 88307, 91289, 92991, 93591, 94793, 95009, 91890, 87090, 82630, 79040, 76563, 74607, 73101, 72001, 71080, 70448, 70258, 70475, 71093, 72118, 73490, 74863, 76354, 77844, 79277, 80535, 81660, 82610, 83572, 84533, 85628, 86897, 88143, 89390, 90572, 91580, 92352, 92718, 92896, 92900, 92755, 92436, 92035, 91633, 91017, 90401, 89846]
786H9846n55n15k26l6l7N7N8O4j09k73k72j83j83J07K81N37P11P17M28K3l83q61j268j836
783H6092k126k202k492k616k615k709k710k571k397k140j965j788j499j331j332j241j242
781E1116j268j356j334j160j103j017r32q44o28o27o14o15r91r91j021j020j177j466j547
779C1405j548j561j560j518j431j363j190r85q11p57q44q09p23o90o90o23o24n19l44l21l20
776A2174l54l53m25m25k21k22k66k65j78j79k69k69o6o6j03j02M2M2q9q9N6N6j22j22j66j65
773G854k36k35q5q4j12k4L6j38j17N8R3R4K11K11J24J24J70J70J38J38J47L22K23K24L81L80
770A0067K35K36K29K28K6K6J02J02L05L05K79K80J23J24J45l0K5K5o2o3o3o2p8p8RRk7k7j6
767A2374j7K3J97J91J04j63j62k3k3k9k9K31K32J48J49O1O1m1m1l02l02k55k55k99k98k64
$$ y = [89846, 89291, 88776, 88550, 88514, 88477, 88534, 88592, 88656, 88547, 88274, 88002, 87819, 87636, 87743, 88024, 88561, 89272, 89989, 90417, 90440, 90057, 89196, 87928, 86092, 83966, 81764, 79272, 76656, 74041, 71332, 68622, 66051, 63654, 61514, 59549, 57761, 56262, 54931, 53599, 52358, 51116, 49848, 48492, 47158, 45998, 44895, 43878, 42946, 42102, 41474, 40847, 40233, 39618, 38627, 37636, 36615, 35595, 34418, 32952, 31405, 29857, 28296, 26736, 25218, 23787, 22424, 21234, 20249, 19438, 18681, 17837, 17028, 16305, 15615, 14925, 14302, 13678, 13159, 12815, 12494, 12174, 11820, 11467, 11042, 10617, 10396, 10174, 9908, 9643, 9465, 9286, 9017, 8748, 8682, 8616, 8513, 8411, 8453, 8495, 8406, 8317, 8373, 8429, 8307, 8185, 8019, 7854, 7618, 7383, 7298, 7214, 7102, 7078, 7114, 6976, 6859, 6917, 7010, 7104, 7315, 7526, 7650, 7774, 7944, 8114, 8252, 8390, 8537, 8859, 9082, 9306, 9687, 10067, 10302, 10538, 10767, 10995, 11021, 11047, 11149, 11251, 11556, 11861, 12140, 12420, 12543, 12667, 12812, 12782, 12807, 12832, 12770, 12707, 12644, 12582, 12504, 12426, 12435, 12444, 12417, 12390, 12374, 12357, 12380, 12577, 12768, 12872, 12709, 12547, 12524, 12501, 12472, 12443, 12674, 12906, 13054, 13203, 13264, 13325, 13284, 13243, 12941, 12639, 12384, 12129, 11830, 11532, 11268]
764A1268k63k63k63j43j43n6n6l9l9m0l9MMMMJ19J18J18J19J57J56K44K44J98J97J98J98J97
761A2203J97K41K40J66J65L11L10M76M76O21O20P23P22Q67Q67R85R84J159J332J495J670J879
758B8709K054K171K460K779L070L203L609L892L892M044M044L877L588L379L205K830K742
756H3548K723K549K700K989L240L529L783M073M310M484M665M666M890M889M898N187N367
755A52490N774O201O491O819P109P263P176O883O709O222N584M953M316L786L033K391J985
753B45185J561J039P64P64P15Q88Q71P84P21N46L64P3n0J25L71P78J179J470J822J821J629
750B63420J339O35k35j200k301l290m160m759n164n395n396n123m949m678m388m337m163m136
748B01720m427m652m827n063n149m997m910m913m623m440m150l900l726l458l168l004k715
$$ y = [11268, 11005, 10742, 10479, 10336, 10193, 10137, 10081, 10042, 10003, 9963, 9924, 9928, 9932, 9936, 9940, 10059, 10177, 10295, 10414, 10571, 10727, 10971, 11215, 11413, 11610, 11808, 12006, 12203, 12400, 12641, 12881, 13047, 13212, 13523, 13833, 14309, 14785, 15406, 16026, 16749, 17471, 18338, 19205, 20190, 21174, 22333, 23665, 25160, 26830, 28709, 30763, 32934, 35394, 38173, 41243, 44446, 48055, 51947, 55839, 59883, 63927, 67804, 71392, 74771, 77976, 80806, 83548, 86271, 88820, 91520, 94509, 97749, 101278, 105061, 109134, 113444, 117928, 122593, 127259, 132149, 137038, 141936, 147123, 152490, 158264, 164465, 170956, 177775, 184884, 192147, 199323, 206206, 212915, 219137, 224721, 229674, 233990, 237776, 240809, 243200, 245185, 246746, 247785, 248549, 249313, 250028, 250916, 251787, 252571, 253292, 253838, 254202, 254275, 254225, 254350, 254721, 255499, 256678, 258148, 259970, 261791, 263420, 264759, 265394, 265159, 263959, 261658, 258368, 254208, 249449, 244285, 238890, 233494, 228371, 223422, 218744, 214356, 210019, 205856, 201720, 197293, 192641, 187814, 182751, 177602, 172605, 167695, 162782, 158159, 153719, 149569, 145669, 141943, 138485, 135317, 132313, 129598]
746A29598k505k330k085j794j656j367j087p98o45m72j56J34K21L95N90Q81J047J048J077
744A20096J077J034J033J035J035J092J267J479J654J856K146K702K992L195L484L742M032
742A54951M119M293M436M610M870N277N792O197O534P173P485P486P460P055O641O119N475
740B55973N068M816M643M287M113L758L237K714K192J723J317R91P01M51J60p1p1k04k04L4
738B95628L25M95R02J263J669J985K274K527K700K705K619K555K150J602J080J89o81j773
736C20214k641l454m208m756n046n133n306n481n191n215n214n040m952m763m472m177l771
734B41394l641l350l036k862k543k253k123j948j836j836j896k069k145k319k535k708k834
732A99460k921l037l036l158l333l473l647l833l832l844m018l906l731l457l050k753k347
$$ y = [129598, 127093, 124763, 122678, 120884, 119228, 117861, 116774, 115976, 115331, 114859, 114703, 114837, 115058, 115453, 116043, 116924, 117971, 119019, 120096, 121173, 122207, 123240, 124275, 125310, 126402, 127669, 129148, 130802, 132658, 134804, 137506, 140498, 143693, 147177, 150919, 154951, 159070, 163363, 167799, 172409, 177279, 182556, 188348, 194545, 201079, 208252, 215737, 223223, 230683, 237738, 244379, 250498, 255973, 261041, 265857, 270500, 274787, 278900, 282658, 285895, 288609, 290801, 292524, 293841, 294832, 295533, 295984, 296144, 296073, 296002, 295798, 295594, 295628, 295953, 296448, 297350, 298613, 300282, 302267, 304541, 307068, 309768, 312473, 315092, 317647, 319797, 321399, 322479, 322668, 321987, 320214, 317573, 314119, 309911, 305155, 300109, 294976, 289670, 284189, 278998, 273783, 268569, 263529, 258577, 253814, 249342, 245165, 241394, 237753, 234403, 231367, 228505, 225962, 223709, 221586, 219638, 217802, 215966, 214070, 212001, 209856, 207537, 205002, 202294, 199460, 196539, 193502, 190466, 187308, 183975, 180502, 176855, 173022, 169190, 165346, 161328, 157422, 153691, 150234, 147184, 144431, 142084]
730A42084k003j713j405j115q52q53j095j095r07r06q96q96p72n99m21l34k86j98q9jJ35J35
727A25918N3N3O6O5O6O6MMJ51O4J0J84L56M43N76O63O63O63Q01Q01Q88Q88P91P91J033Q60
724A36921O59O60N90M16J05o9o4o4o4K2P9K52M86M87N94N95Q04R77J257J257J309J309J298
722A49816J299J117R44P23P23N17N16N05N06M33K59n0l39o44r33j184j357j281j281j280j281
719A47728j184j011q11o38m89k00J02J01M49P39P98R71Q94Q94R12O23K63R0k30p51j157j563
717A46530j870k161k404k403k317k142j968j967j725j551j341j167r05o16l73q2J10K83M76
715A22407M75N74N74M92M92L28L29K68k3j64l38p26j131j429j719k110k284k350k349k157
712A09159k156j917j744j609j319j124r49p16n41j94j94L5L4J11J11k0j94m51p41j009j415
$$ y = [142084, 140081, 138368, 136963, 135848, 134996, 134143, 133048, 131953, 131046, 130140, 129244, 128348, 127576, 126977, 126556, 126222, 125936, 125738, 125649, 125648, 125783, 125918, 125971, 126024, 126090, 126155, 126221, 126287, 126291, 126295, 126446, 126510, 126520, 126704, 127060, 127503, 128079, 128742, 129405, 130068, 130869, 131670, 132558, 133446, 134237, 135028, 136061, 136921, 137580, 138240, 138830, 139246, 139351, 139282, 139218, 139154, 139090, 139112, 139191, 139443, 139929, 140416, 141010, 141605, 142409, 143386, 144643, 145900, 147209, 148518, 149816, 151115, 152232, 153176, 153899, 154622, 155139, 155655, 156160, 156666, 157099, 157358, 157308, 156969, 156325, 155392, 154208, 152851, 151570, 150289, 149009, 147728, 146544, 145533, 144722, 144084, 143595, 143395, 143497, 143598, 144047, 144786, 145584, 146555, 147449, 148343, 149255, 149878, 150141, 150231, 150001, 149250, 148093, 146530, 144660, 142499, 140095, 137692, 135375, 133233, 131265, 129298, 127573, 126022, 124681, 123514, 122609, 121993, 121620, 121538, 121648, 121931, 122407, 122882, 123456, 124030, 124522, 125014, 125342, 125671, 125939, 125916, 125752, 125414, 124688, 123557, 122128, 120409, 118299, 116015, 113665, 111316, 109159, 107003, 105086, 103342, 101733, 100414, 99290, 98341, 97625, 97084, 96890, 96696, 96731, 96765, 96876, 96987, 96967, 96773, 96322, 95581, 94572, 93157]
710I3157j785j959k176k351k456k455k460k285k238k239k080k081j859j686j769j769j613
708E7896j613j479j479j275j276j191j191j104j103j080j079j079j079j212j212j211j212
706C7021j264j264j265j264j368j367j223j223j125j124j125j125j062j061q58q59q59q59
704A6726n98n98o00o00n13n13n15n15n15n15l77l77l77l77l36l36j91j91k41k42k41k42k24
$$ y = [93157, 91372, 89413, 87237, 84886, 82430, 79975, 77515, 75230, 72992, 70753, 68673, 66592, 64733, 63047, 61278, 59509, 57896, 56283, 54804, 53325, 52050, 50774, 49583, 48392, 47288, 46185, 45105, 44026, 42947, 41868, 40656, 39444, 38233, 37021, 35757, 34493, 33228, 31964, 30596, 29229, 28006, 26783, 25658, 24534, 23409, 22284, 21222, 20161, 19303, 18444, 17585, 16726, 16128, 15530, 14930, 14330, 13817, 13304, 12789, 12274, 11759, 11244, 10867, 10490, 10113, 9736, 9400, 9064, 8873, 8682, 8441, 8199, 7958, 7716, 7492]
$$ [...]
##$OBSERVED MULTIPLETS=	
(1, 9.818548160642404099, 9.863572801557957348, 9.8410604811001807235, 1.0194892917966218437, 1, s, A)
(2, 7.6885818621955035468, 7.7597029110169772892, 7.724120829774223651, 0.99945436245771512862, 1, dd, B, 2.01721 8.41589)
(3, 7.5182558142823161518, 7.5683490702937357142, 7.5433024422880254889, 1.0237962259595658754, 1, d, C, 2.02637)
(4, 7.006080601909215666, 7.0721986483154086756, 7.0391396251123126149, 1.0270567328395681095, 1, d, D, 8.43286)
(5, 3.8554054625534699419, 3.900430103469024079, 3.8779177830112470104, 3.2584134003074805008, 3, s, E)
(6, 2.4491348799499412792, 2.5731663909339839158, 2.5111644680743556712, 1.0384851545237328008, 1, tt, F, 3.55225 3.55225 12.22 12.22)
(7, 2.104063192628622847, 2.3599472674131729555, 2.219410205444416917, 1.9374757915286415777, 2, m, G)
(8, 2.0909198845512122489, 2.1452312477468713503, 2.1180180170247218108, 1.0062407561451283122, 1, m, H)
(9, 1.9323625609202537134, 2.0529844082852917175, 1.9947605979076021843, 1.1824057195395638598, 1, m, I)
(10, 1.7460668870821274279, 1.9147578953416477532, 1.8355919219344947191, 3.8092101115595533578, 4, ddd, J, 4.10757 10.9374 19.6663)
(11, 1.549680169828206111, 1.6251377888977529551, 1.5818077311312614963, 1.1467401696817958179, 1, dd, K, 3.46725 13.1623)
(12, 1.5132314469163452575, 1.549680169828206111, 1.5339442541432899425, 0.87781538489099708578, 1, d, L, 3.50732)
(13, 1.3912872447947950416, 1.5132314469163452575, 1.4509400625558177556, 0.99077140463024071515, 1, m, M)
(14, 1.3308349596794475378, 1.4309321667477876705, 1.3859498669421987938, 0.80667835303409662906, 1, m, N)
(15, 1.2259170676932895638, 1.3151978325757254229, 1.2727137442131488676, 2.8585756447638810407, 3, dt, O, 5.48552 5.48552 9.78082)
(16, 1.2295027424311071318, 1.274527383346661713, 1.2520150628888844224, 5.7835966890963641518, 6, s, P)
(17, 1.126267528650970462, 1.2599107290652997726, 1.1936845430304581228, 2.2895944428595820241, 2, m, Q)
(18, 0.92956093309033394068, 1.0436884554268492931, 0.98675266269524952722, 1.8845016280553015253, 2, ddd, R, 3.31256 11.1845 14.3177)
(19, 0.81739719704827329405, 0.96770682278798425546, 0.87311386434270854551, 4.8734948975952638861, 5, q, S, 6.84288 6.84288 6.78476)
(20, 0.865177137590468881, 0.91020177850602346226, 0.88768945804824617163, 3.1862038387349178592, 3, s, T)
##$OBSERVED MULTIPLETS PEAKS=	
(1, 9.8410604811001807235, 0.16573189250732381361)
(2, 7.7371905905591997765, 0.041106575512366252956)
(2, 7.7321017554312145847, 0.039843000694037837561)
(2, 7.7160967904531991834, 0.042848659544096820428)
(2, 7.7110941826532810595, 0.041241339683312866482)
(3, 7.5458367498359582015, 0.089813818667363765069)
(3, 7.5407681347400936644, 0.077340231981968501906)
(4, 7.0496863278576311629, 0.072957989574260750931)
(4, 7.0285929223669931787, 0.06818794814408350724)
(5, 3.8779177830112470104, 0.44879114846914947012)
(6, 2.5506540704762068472, 0.0064907817363041696995)
(6, 2.5418225223295936033, 0.013876072192309010442)
$$ [...]
Solvent,Artifact|Impurity|Weak|13C Sat.,,1,0.4153236259066017122,0,0
Artifact,Artifact|Weak,,1,0.78164020748110729642,0,0
Compound,None,,1,0.61856215794926838747,0,0
Impurity,None,,1,1.2622556400758926376,0,0
Compound,None,,1,0.62038556242193343415,0,0
Artifact,Artifact|Weak,,1,0.46814134062712398077,0,0
Artifact,Artifact|Weak,,1,0.034382884494415351384,0,0
Artifact,Artifact|Weak,,1,0.20000000000000006661,0,0
Artifact,Artifact|Weak,,1,0.014710786987944257653,0,0
Impurity,Artifact|Weak,,1,1.152368961198452002,0,0
Impurity,Artifact|Weak,,1,-0.87186829766409457143,0,0
Compound,Artifact|Impurity|Weak|13C Sat.,,1,0.49812546803009372098,0,0
Solvent,None,,1,0.11044861920890997053,0,0
Impurity,Artifact|Weak,,1,-1,0,0
Impurity,Artifact|Weak,,1,0,0,0
Compound,Artifact|Impurity|Weak|13C Sat.,,1,0.067252035240941698824,0,0
Compound,Artifact|Impurity|Weak|13C Sat.,,1,-0.40000000000000007772,0,0
Impurity,Artifact|Weak,,1,0.076609202320136071673,0,0
Artifact,Artifact|Weak,,1,1.2792055598796436833,0,0
Impurity,Artifact|Weak,,1,1.999999999999999778,0,0
Impurity,Artifact|Weak,,1,-1,0,0
Artifact,Artifact|Weak,,1,-1,0,0
Solvent,Artifact|Impurity|Weak|13C Sat.,,1,0.94873790415122305486,0,0
Compound,Artifact|Impurity|Weak|13C Sat.,,1,0.76295768052224299804,0,0
Artifact,Artifact|Weak,,1,1.8155160610475169491,0,0
Compound,None,,1,0.93043260431910301822,0,0
Compound,None,,1,-0.096194866097644174396,0,0
Artifact,Artifact|Weak,,1,0.2000000000000000111,0,0
Artifact,Artifact|Weak,,1,-0.15240749435037026505,0,0
Artifact,Artifact|Weak,,1,0.65540637191058337407,0,0
Artifact,Artifact|Weak,,1,-0.60000000000000008882,0,0
Artifact,Artifact|Weak,,1,1.0047321189681186482,0,0
Compound,None,,1,0.70307702449679521095,0,0
Compound,None,,1,0.14336746454295684616,0,0
Compound,None,,1,0.74012844542387568048,0,0
Compound,None,,1,-0.2000000000000000111,0,0
Compound,Artifact|Impurity|Weak|13C Sat.,,1,0.85889800559224471765,0,0
Compound,Artifact|Impurity|Weak|13C Sat.,,1,0.63684446262771066127,0,0
Artifact,Artifact|Weak,,1,0.17922439380076571336,0,0
Compound,Artifact|Impurity|Weak|13C Sat.,,1,0.7365454863473285263,0,0
Compound,Artifact|Impurity|Weak|13C Sat.,,1,-0.35099777499112383428,0,0
Impurity,Artifact|Weak,,1,0.14371345130485616015,0,0
Impurity,Artifact|Weak,,1,0,0,0
Impurity,Artifact|Weak,,1,-0.18700899071034263188,0,0
Impurity,Artifact|Weak,,1,0.15678163006482145891,0,0
Impurity,Artifact|Weak,,1,0.2000000000000000111,0,0
Impurity,Artifact|Weak,,1,-0.092430879949480182489,0,0
Artifact,Artifact|Weak,,1,1,0,0
Compound,None,,1,0.64781028009161722991,0,0
Artifact,Artifact|Weak,,1,0.27919957002353079645,0,0
Artifact,Artifact|Weak,,1,-0.85193167701425909222,0,0
Artifact,Artifact|Weak,,1,0.32133084192447297633,0,0
Artifact,Artifact|Weak,,1,0.86681322289125040115,0,0
Artifact,Artifact|Weak,,1,-0.59748148351342522666,0,0
Artifact,Artifact|Weak,,1,-0.74599621898145507259,0,0
Impurity,Artifact|Weak,,1,0.45554506284849222153,0,0
Impurity,Artifact|Weak,,1,-0.073808937374957306332,0,0
##END=	
##END=	
