##TITLE=	sl119

##JCAMP-DX=	6.0	$$ MestReNova 14.1.0-24037
##DATA TYPE=	LINK
##BLOCK_ID=	1
##BLOCKS=	2    
##ORIGIN=	Mestrelab Research S.L.
##OWNER=	limst
##$MNOVA/LINK_BLOCK_TYPE=	ITEM	$$ NMR Spectrum
##$MNOVA/ITEM/POLYGON=	(XY..XY)
5321,5835
8722,5835
8722,8208
5321,8208
5321,5835
##$MNOVA/ITEM/Z=	0
##$MNOVA/ITEM/ANGLE=	0
##TITLE=	sl119
##JCAMP-DX=	6.0	$$ MestReNova 14.1.0-24037
##BLOCK_ID=	2
##DATA TYPE=	NMR SPECTRUM
##DATA CLASS=	XYDATA
##NUMDIM=	1
##ORIGIN=	JEOL
##OWNER=	limst
##.OBSERVE FREQUENCY=	399.79071365325000897
##.OBSERVE NUCLEUS=	^1H
##.SOLVENT NAME=	CHLOROFORM-D
##.PULSE SEQUENCE=	proton.jxp
##LONGDATE=	2021/03/16 19:34:17.000
##.ACQUISITIONMODE=	SIMULTANEOUS
##$ORIGINAL FORMAT=	JEOL Delta
##$MNOVA/SCALES_VERSION=	8
##$PARAMETER FILE=	(datafile, ASCII, c:/Users/limst/Desktop/Steph's%20Personal%20folders/Imperial%20College%20Related/ICL%20F103%20Chem%20Curriculum/Practical%20Chemistry%201/Synthesis%201.2/Week%202/sl119_PROTON_FT-1-1.jdf, 0)
$$ 
##$PARAMETER FILE=	(footer, BASE64, c:/Users/limst/Desktop/Steph's%20Personal%20folders/Imperial%20College%20Related/ICL%20F103%20Chem%20Curriculum/Practical%20Chemistry%201/Synthesis%201.2/Week%202/sl119_PROTON_FT-1-1.jdf, 540672)
AQAAANkdAABoZWFkZXIKICAgIGZpbGVuYW1lICAgICAgICA9PiAic2wxMTlfUFJPVE9OIjsKICAgIHNh
bXBsZV9pZCAgICAgICA9PiAic2wxMTkiOwogICAgY29tbWVudCAgICAgICAgID0+ICIiOwogICAgcHJv
Y2VzcyAgICAgICAgID0+ICJwcm90b25fYXV0b3BoYXNlLmxpc3QiOwogICAgYXV0b19kd2VsbCAgICAg
ID0gIFRSVUU7CiAgICBhdXRvX2ZpbHRlciAgICAgPSAgVFJVRTsKICAgIGF1dG9fZ2FpbiAgICAgICA9
PiBUUlVFOwogICAgZmlsdGVyX2xpbWl0ICAgID0+IDE2OwogICAgZm9yY2VfZHVhbF9tb2RlID0+IEZB
TFNFOwogICAgZGVjaW1hdGlvbl9yYXRlID0gIDA7CiAgICBmb3JjZV90dW5lICAgICAgPT4gRkFMU0U7
CiAgICBzYXZlX2Fib3J0ZWQgICAgPSAgVFJVRTsKICAgIHZlY3RvciAgICAgICAgICA9ICBUUlVFOwpl
bmQgaGVhZGVyOwoKaW5zdHJ1bWVudAogICAgcmVjdnJfZ2FpbiA9PiA0NjsKZW5kIGluc3RydW1lbnQ7
CgphY3F1aXNpdGlvbgogICAgeF9kb21haW4gICAgID0+ICJQcm90b24iOwogICAgeF9vZmZzZXQgICAg
ID0+IDVbcHBtXTsKICAgIHhfc3dlZXAgICAgICA9PiAxNVtwcG1dOwogICAgeF9wb2ludHMgICAgID0+
IDMyNzY4OwogICAgc2NhbnMgICAgICAgID0+IDg7CiAgICB4X3ByZXNjYW5zICAgPT4gMDsKICAgIG1v
ZF9yZXR1cm4gICA9PiAxOwogICAgeF9hY3FfdGltZSAgID0/IHhfcG9pbnRzIC8geF9zd2VlcDsKICAg
IHhfcmVzb2x1dGlvbiA9PyAxIC8geF9hY3FfdGltZTsKZW5kIGFjcXVpc2l0aW9uOwoKcHVsc2UKICAg
IGNvbGxlY3QgQ09NUExFWCxPQlM7CgogICAgbWFjcm8gb2JzX3ByZXNhdF90aW1lKCBkYW50ZV9wcmVz
YXQsIGRhbnRlX2xvb3AsIGRhbnRlX3B1bHNlLCBkYW50ZV9pbnRlcnZhbCwgcGhhc2VfZGFudGUsIHBo
c19zaGZ0LCBkYW50ZV9hdHRlbnVhdG9yLCBwcmVzYXRfdGltZSApIGlzCiAgICAgICAgd2hlbiBkYW50
ZV9wcmVzYXQgZG8KICAgICAgICAgICAgbG9vcCAxMDAgKiBkYW50ZV9sb29wIHRpbWVzCiAgICAgICAg
ICAgICAgICBkYW50ZV9wdWxzZSwgKE9CUy5HQVRFLCBPQlMuUEhTLnBoYXNlX2RhbnRlLmxzdGVwKHBo
c19zaGZ0KSwgT0JTLkFUTi5kYW50ZV9hdHRlbnVhdG9yKTsKICAgICAgICAgICAgICAgIGRhbnRlX2lu
dGVydmFsOwogICAgICAgICAgICBlbmQgbG9vcDsKICAgICAgICBlbmQgd2hlbjsKICAgICAgICB3aGVu
IG5vdCBkYW50ZV9wcmVzYXQgZG8KICAgICAgICAgICAgcHJlc2F0X3RpbWU7CiAgICAgICAgZW5kIHdo
ZW47CiAgICBlbmQgb2JzX3ByZXNhdF90aW1lOwoKICAgIG1hY3JvIGFjcSggZGVhZF90aW1lLCBkZWxh
$$ [...]
AAAAAAAAAAAAAAAAAAAAAAAAAAAAAAAAAAAAAAAAAAAAAAAAAAAAAAAAAAAAAAAAAAAAAAAAAAAAAAAA
AAAAAAAAAAAAAAAAAAAAAAAAAAAAAAAAAAAAAAAAAAAAAAAAAAAAAAAAAAAAAAAAAAAAAAAAAAAAAAAA
AAAAAAAAAAAAAAAAAAAAAAAAAAAAAAAAAAAAAAAAAAAAAAAAAAAAAAAAAAAAAAAAAAAAAAAAAAAAAAAA
AAAAAAAAAAAAAAAAAAAAAAAAAAAAAAAAAAAAAAAAAAAAAAAAAAAAAAAAAAAAAAAAAAAAAAAAAAAAAAAA
AAAAAAAAAAAAAAAAAAAAAAAAAAAAAAAAAAAAAAAAAAAAAAAAAAAAAAAAAAAAAAAAAAAAAAAAAAAAAAAA
AAAAAAAAAAAAAAAAAAAAAAAAAAAAAAAAAAAAAAAAAAAAAAAAAAAAAAAAAAAAAAAAAAAAAAAAAAAAAAAA
AAAAAAAAAAAAAAAAAAAAAAAAAAAAAAAAAAAAAAAAAAAAAAAAAAAAAAAAAAAAAAAAAAAAAAAAAAAAAAAA
AAAAAAAAAAAAAAAAAAAAAAAAAAAAAAAAAAAAAAAAAAAAAAAAAAAAAAAAAAAAAAAAAAAAAAAAAAAAAAAA
AAAAAAAAAAAAAAAAAAAAAAAAAAAAAAAAAAAAAAAAAAAAAAAAAAAAAAAAAAAAAAAAAAAAAAAAAAAAAAAA
AAAAAAAAAAAAAAAAAAAAAAAAAAAAAAAAAAAAAAAAAAAAAAAAAAAAAAAAAAAAAAAAAAAAAAAAAAAAAAAA
AAAAAAAAAAAAAAAAAAAAAAAAAAAAAAAAAAAAAAAAAAAAAAAAAAAAAAAAAAAAAAAAAAAAAAAAAAAAAAAA
AAAAAAAAAAAAAAAAAAAAAAAAAAAAAAAAAAAAAAAAAAAAAAAAAAAAAAAAAAAAAAAAAAAAAAAAAAAAAAAA
AAAAAAAAAAAAAAAAAAAAAAAAAAAAAAAAAAAAAAAAAAAAAAAAAAAAAAAAAAAAAAAAAAAAAAAAAAAAAAAA
AAAAAAAAAAAAAAAAAAAAAAAAAAAAAAAAAAAAAAAAAAAAAAAAAAAAAAAAAAAAAAAAAAAAAAAAAAAAAAAA
AAAAAAAAAAAAAAAAAAAAAAAAAAAAAAAAAAAAAAAAAAAAAAAAAAAAAAAAAAAAAAAAAAAAAAAAAAAAAAAA
AAAAAAAAAAAAAAAAAAAAAAAAAAAAAAAAAAAAAAAAAAAAAAAAAAAAAAAAAAAAAAAAAAAAAAAAAAAAAAAA
AAAAAAAAAAAAAAAAAAAAAAAAAAAAAAAAAAAAAAAAAAAAAAAAAAAAAAAAAAAAAAAAAAAAAAAAAAAAAAAA
AAAAAAAAAAAAAAAAAAAAAAAAAAAAAAAAAAAAAAAAAAAAAAAAAAAAAAAAAAAAAAAAAAAAAAAAAAAAAAAA
AAAAAAAAAAAAAAAAAAAAAAAAAAAAAAAAAAAAAAAAAAAAAAAAAAAAAAAAAAAAAAAAAAAAAAAAAAAAAAAA
AAAAAAAAAAAAAAAAAAAAAAAAAAAAAAAAAAAAAAAAAAAAAAAAAAAAAAAAAAAAAAAAAAAAAAAAAAAAAAAA
AAAAAAAAAAAAAAAAAAAAAAAAAAAAAAAAAAAAAAAAAAAAAAAAAAAAAAAAAAAAAAAAAAAAAAAAAAAAAAAA
AAAAAAAAAAAAAAAAAAAAAAAAAAAAAAAAAAAAAAAAAAAAAAAAAAAAAAAAAAAAAAAAAAAAAAAAAAAAAAAA
AAAAAAAAAAAAAAAAAAAAAAAAAAAAAAAAAAAAAAAAAAAAAAAAAAAAAAAAAAAAAAAAAAAAAAAAAAAAAAAA
AAAAAAAAAAAAAAAAAAAAAAAAAAAAAAAAAAAAAAAAAAAAAAAAAAAAAAAAAAAAAAAAAAAAAAAAAAAAAAAA
AAAAAAAAAAAAAAAAAAAAAAAAAAAAAAAAAAAAAAAAAAAAAAAAAAAAAAAAAAAAAAAAAAAAAAAAAAAAAAAA
AAAAAAAAAAAAAAAAAAAAAAAAAAAAAAAAAAAAAAAAAAAAAAAAAAAAAAAAAAAAAAAAAAAAAAAAAAAAAAAA
AAAAAAAAAAAAAAAAAAAAAAAAAAAAAAAAAAAAAAAAAAAAAAAAAAAAAAAAAAAAAAAAAAAAAAAAAAAAAAAA
AAAAAAAAAAAAAAAAAAAAAAAAAAAAAAAAAAAAAAAAAAAAAAAAAAAAAAAAAAAAAAAAAAAAAAAAAAAAAAAA
AAAAAAAAAAAAAAAAAAAAAAAAAAAAAAAAAAAAAAAAAAAAAAAAAAAAAAAAAAAAAAAAAAAAAAAAAAAAAAAA
AAAAAAAAAAAAAAAAAAAAAAAAAAAAAAAAAAAAAAAAAAAAAAAAAAAAAAAAAAAAAAAAAAAAAAAAAAAAAAAA
AAAAAAAAAAAAAAAAAAAAAAAAAAAAAAAAAAAAAAAAAAAAAAAAAAAAAAAAAAAAAAAAAAAAAAAAAAAAAAAA
AAAAAAAAAAAAAAAAAAAAAAAAAAAAAAAAAAAAAAAAAAAAAAAAAAAAAAAAAAAAAAAAAAAAAAAAAAAAAAAA
AAAAAA==
##XUNITS=	HZ
##YUNITS=	ARBITRARY UNITS
##FIRSTX=	5001.347111975246662
##LASTX=	-993.53654652763339072
##DELTAX=	-0.22869887683603098982
##XFACTOR=	1
##YFACTOR=	8.5865981469079480942e-07
##FIRSTY=	-0.00061346968868747353554
##MINY=	-0.00087676278781145811081
##MAXY=	2.2109622955322265625
##NPOINTS=	26214
##XYDATA=	(X++(Y..Y))
5001g14K2Rj34j07L9P2m7Q5l2q5n6P5J49K2p7nK2n9Q1pj2k0n7K9Qj3l8P3Q0j3l8n8J59j2j35
$$ -714 -692 -683 -817 -924 -885 -813 -860 -775 -807 -892 -948 -873 -724 -702 -779 -784 -762 -821 -740 -747 -759 -779 -836 -807 -799 -812 -850 -777 -697 -710 -748 -806 -647 -659 -794
4993g94O3k1O2m6J07l1j5n2j01J33L2lM8j51l6lNj9K3jJ9P7mp5r4J42N0Rl3O7nj17J0n1N3
$$ -794 -731 -752 -690 -736 -629 -660 -675 -727 -828 -695 -663 -666 -618 -769 -805 -808 -803 -822 -799 -800 -781 -704 -708 -783 -877 -735 -685 -676 -709 -642 -647 -764 -754 -805 -752
4985g52m4J2J07p1M7o4m1n6R9M6n9M3N2O7j10k9p1J4P1N3N4l8m7R5m1l0m8O2j14poJ0j4M6
$$ -752 -796 -784 -677 -748 -701 -765 -806 -862 -763 -717 -776 -733 -681 -614 -724 -753 -824 -810 -739 -686 -632 -670 -717 -622 -663 -693 -741 -679 -793 -800 -806 -796 -810 -764
4978g64n2J15O5p1m2m8Q7o8J01oL3o0N8p9N4j7j37P4L7o5j6q3J19k4J28M5J7j65QQ8%r9j69
$$ -764 -816 -701 -636 -707 -749 -797 -710 -778 -677 -683 -650 -710 -652 -731 -677 -694 -831 -757 -720 -785 -801 -884 -765 -789 -661 -616 -599 -764 -756 -668 -668 -767 -936
4970i36J20k3K4J1L0l9l7K4R3j55J22no2j1J5M3N8Kjj03n9J03PP7j7j42R3K7j20N3Q4O0l7
$$ -936 -816 -839 -815 -804 -774 -813 -850 -826 -733 -888 -766 -771 -833 -844 -829 -786 -728 -726 -727 -830 -889 -786 -779 -702 -719 -861 -768 -741 -861 -808 -724 -664 -701
4962g01r8J2p1J1O5M8j15MJ09JNm7M8r8j7N2J6N1p9j6L8kL5j7O7j40J57j44L6j20l1l3J39
$$ -701 -799 -787 -858 -847 -782 -734 -849 -845 -736 -735 -730 -777 -729 -827 -844 -792 -776 -725 -804 -820 -782 -784 -749 -766 -699 -839 -682 -826 -790 -910 -941 -974 -835
4955h35K6J65rj11Q2j7M0l5l7m9O2R7M4j83q4P3r5J14l6n9MP4M1j82J00J08L7j82J0L9N5N
$$ -835 -809 -644 -653 -764 -682 -699 -659 -694 -731 -780 -718 -621 -577 -760 -844 -771 -866 -752 -788 -847 -843 -769 -728 -910 -810 -702 -665 -847 -837 -798 -743 -738
4948g38q8K8J53q3o1r2J63k5j3j01J5j1J03n5O7j7o4P8L1p5mO0p4J09p6J3j63J25j34K6J29
$$ -738 -826 -798 -645 -728 -789 -881 -718 -743 -756 -857 -842 -853 -750 -805 -738 -755 -819 -741 -710 -785 -789 -729 -803 -694 -770 -757 -920 -795 -929 -903 -774
4941g74O0n8n8M5N3p9J5Q4p6J06j41L1j43k1J68o9N8K8k0O9q1K3L0p9K4K2j34R0P4j21m6k4
$$ -774 -714 -772 -830 -785 -732 -811 -796 -712 -788 -682 -823 -792 -935 -956 -788 -857 -799 -771 -791 -722 -803 -780 -750 -829 -805 -783 -917 -827 -753 -874 -920 -944
4933i44Q2M5J4N3m6k5O6M4j16o5R2L0J26J1P6k44n0P2m9j2O1m5J4Q3J04J3k39Q6m3N4j09L
$$ -944 -862 -817 -803 -750 -796 -821 -755 -711 -827 -892 -800 -770 -644 -633 -557 -801 -851 -779 -828 -840 -779 -824 -810 -727 -623 -610 -849 -763 -806 -752 -861 -858
4926h58N7J35j22m5J26r9Q4K2l1q8Q3j9M7r8M5J7n6Q1m1PNl8n0J8rJ1kK0R1q0o7O9j53R3M4
$$ -858 -801 -666 -788 -833 -707 -806 -722 -700 -731 -819 -736 -755 -708 -806 -761 -744 -800 -719 -760 -753 -748 -786 -836 -818 -827 -816 -818 -798 -707 -787 -854 -785 -938 -845 -801
4918h01p5N3j01O9J14r2J19K0p3J42j09J9j7jj47PO2K7Ko3N4n6Q4K0q9J7J08j88M2J3m6J14
$$ -801 -876 -823 -924 -855 -741 -833 -714 -694 -767 -625 -734 -715 -732 -733 -880 -873 -811 -784 -782 -845 -791 -847 -763 -743 -832 -815 -707 -895 -853 -840 -886 -772
4911g72q1P2j4J2j1jQ3j1ln9k9PJ13%j12Q6Q0Qr7J1J08r0q5p9P7J0N0p4j17Q4q7j3NJ35Jo0
$$ -772 -853 -781 -795 -783 -794 -795 -712 -723 -726 -785 -814 -807 -694 -694 -806 -720 -640 -632 -729 -718 -610 -700 -785 -864 -787 -777 -727 -801 -918 -834 -921 -934 -929 -794 -793 -853
4902h53p9R9Q6n3j3N0M3R3K3p8M2k6j2r0P6n3m0k7J25q0O0n3Q5p9rR1j62Q6j7J6k8JR4p7r8
$$ -853 -932 -833 -747 -800 -813 -763 -720 -627 -604 -682 -640 -666 -678 -768 -692 -745 -785 -812 -687 -767 -707 -760 -675 -754 -763 -672 -834 -748 -765 -749 -777 -776 -682 -759 -857
4894h57J7R1j08k6K4N2PM0j3N3j00L5J4p5M5J7n3J2J06M9r7j18Nk8O2J07K8j12Q5J01k2o8
$$ -857 -840 -749 -857 -883 -859 -807 -800 -760 -773 -720 -820 -785 -771 -846 -801 -784 -837 -825 -719 -670 -767 -885 -880 -908 -846 -739 -711 -823 -738 -637 -659 -727
4887g27m1N4n1j0j01o6NJ17%k6K7lJ63j45J07Q3m7o1J4J5%m2l5J80p4m0k0P2o4J51k80K41
$$ -727 -768 -714 -765 -775 -876 -942 -937 -820 -820 -846 -819 -822 -659 -804 -697 -614 -661 -722 -708 -693 -693 -735 -770 -590 -664 -704 -724 -652 -716 -565 -845 -604
4880f04n6j7j07O5o0J59nN5j34J9PP8p8K7l3m8O2n7l5M2o3p2N2M2L6K6J11P2r6k15P6MNk8
$$ -604 -660 -677 -784 -719 -779 -620 -625 -570 -704 -685 -678 -600 -678 -651 -684 -732 -670 -727 -762 -720 -783 -855 -803 -761 -725 -699 -588 -516 -612 -827 -751 -747 -742 -770
4872g70Jn1J19Kj00J66p9q4M7K3L4Q8j32l7N7L3J2ro7j4o8O3%l5O7o1k1O2L6lj30j00M8L2
$$ -770 -769 -820 -701 -699 -799 -633 -712 -796 -749 -726 -692 -604 -736 -773 -716 -683 -671 -680 -747 -761 -829 -766 -766 -801 -734 -795 -816 -754 -718 -721 -851 -951 -903 -871
4864h71m8P8L8J21K7m9R4j50Q1M2koq5J1l9M4j1m9j33J23J07k3K9j7j96J32N1j71L2L7l5R
$$ -871 -919 -841 -803 -682 -655 -704 -610 -760 -679 -637 -639 -645 -730 -719 -758 -714 -725 -774 -907 -784 -677 -700 -671 -688 -884 -752 -701 -872 -840 -803 -838 -829
4857h29O0o8J30M4j08r0Q9m3Q1p4JJ04j39M3j25K12on3l0Rk5J13J3J4J1qM6j03O6p9l4M9%
$$ -829 -769 -837 -707 -663 -771 -861 -772 -815 -734 -808 -807 -703 -842 -799 -924 -712 -718 -771 -801 -792 -817 -704 -691 -677 -666 -674 -628 -731 -665 -744 -778 -729 -729
4849g29o8LO0N6p6K0n7K6kr0O5n5L8N9o8M6m9Q2n0L0N0j9K3m4l2n1J44k12J82k2j17k1J6K88
$$ -729 -797 -794 -734 -678 -754 -734 -791 -765 -767 -857 -792 -847 -809 -750 -818 -772 -821 -739 -789 -759 -709 -728 -705 -749 -781 -832 -688 -900 -718 -740 -857 -878 -862 -574
4841e74l4j02n6M7l9j40K7K6M4K4J2k8p5k1P3o5p3L4L9J12l2M6P7J4j24M1k00J31J0Q1pq4
$$ -574 -608 -710 -766 -719 -758 -898 -871 -845 -801 -777 -765 -793 -868 -889 -816 -881 -954 -920 -881 -769 -801 -755 -678 -664 -788 -747 -947 -816 -806 -725 -732 -816
4834h16Q8q4R9j32P7rl1r5P6O7M7k8o8rQ9K6P6o6j34M3Q7k7M2o6j17k1L5M8kj8K9M6N9mJ2
$$ -816 -728 -812 -713 -845 -768 -777 -808 -903 -827 -760 -713 -741 -809 -818 -729 -703 -627 -693 -827 -784 -697 -724 -682 -748 -865 -886 -851 -803 -805 -823 -794 -748 -689 -693 -681
4826f81l8j88Q4j5rr3O6k0M7J01lj7K4M8n6j0j1m3q2R8J37M2j05P8j14j7R5L6j76J3O2q5J36
$$ -681 -719 -907 -823 -838 -847 -940 -874 -894 -847 -746 -749 -766 -742 -694 -750 -760 -771 -814 -896 -798 -661 -619 -724 -646 -760 -777 -682 -646 -822 -809 -747 -832 -696
4819f96m3n9k1J50j0j8m9o9K8J02J8k33J75j61J51P0Oq8l3J09N6p8p2M5k3LK6n5n7k0P9J00
$$ -696 -739 -798 -819 -669 -679 -697 -746 -815 -787 -685 -667 -900 -725 -886 -735 -665 -659 -747 -780 -671 -615 -693 -765 -720 -743 -740 -714 -769 -826 -846 -767 -667
4811f67r0L3j0j5m2k3O9K5l1j4k0J22l7j4j17l8K8Q6M7K5J7l7j61o2Q1N6J1N6j61j4J3L3P8
$$ -667 -757 -724 -734 -749 -791 -814 -745 -720 -751 -765 -785 -663 -700 -714 -831 -869 -841 -755 -708 -683 -666 -703 -864 -926 -845 -789 -778 -722 -883 -897 -884 -851 -773
4804g73n3N5j00M8M6M0o9j27N3K0l9lK0J00j02l4pP0L0N2L5j40k2J75Q4j2q6O1j9k0J0j27
$$ -773 -826 -771 -871 -823 -777 -737 -806 -933 -880 -860 -899 -902 -882 -782 -884 -918 -925 -855 -825 -773 -738 -878 -900 -725 -641 -653 -739 -678 -697 -717 -707 -834
4796h34k4l6Q5n7Q7k3M4N0J4K2j40J23k24J31p1%J30r1j5mR9m5l6J23j15k7J1J03j18R5N8
$$ -834 -858 -894 -809 -866 -779 -802 -758 -708 -694 -672 -812 -689 -913 -782 -853 -853 -723 -814 -829 -833 -734 -779 -815 -692 -807 -834 -823 -720 -838 -743 -685
4789f85j0j18k0mnN4n5J80M6j94J0q1k2J70o3OK3p8j00J90P7op6J7qj68J25o1P1j0J1jJ7j16
$$ -685 -695 -813 -833 -837 -842 -788 -843 -663 -617 -811 -801 -882 -904 -734 -797 -791 -768 -846 -946 -756 -679 -685 -761 -744 -752 -920 -795 -856 -785 -795 -784 -785 -768 -884
4782h84J45p8J28Pj20L0l9K6p9R2J0q3M2M4P2P4kj04o8O4P8j79l6N5L9J0q7M9j4K9O4n4l8
$$ -884 -739 -817 -689 -682 -802 -772 -811 -785 -864 -772 -762 -845 -803 -759 -687 -613 -615 -719 -787 -723 -645 -824 -860 -805 -766 -756 -843 -794 -808 -779 -715 -769 -807
4774h07RL4Nq3J17n0l0j00R6l0qO3lj21J10K4N8j06M4L1j1M1J3J22j8j78P7L5j29O6o5J12
$$ -807 -798 -764 -759 -842 -725 -775 -805 -905 -809 -839 -847 -784 -787 -908 -798 -774 -716 -822 -778 -747 -758 -717 -704 -582 -600 -778 -701 -666 -795 -729 -794 -682
4767f82J5l8K5j00J7n3O1r0K0J04Pk5Rm3K7j6L0p6J3k8Q1o2p4K26j16M0k2l2K3Q4j07m2M1
$$ -682 -667 -705 -680 -780 -763 -816 -755 -845 -825 -721 -714 -739 -730 -773 -746 -762 -732 -808 -795 -823 -742 -804 -878 -652 -768 -728 -750 -782 -759 -675 -782 -824 -783
4759g83M7p1m8k5O4K6K7m8R7M5j51O5p3Q9O7r8m0o1J19q4J37Kj53R2k2lp8KOJ06o%j22N2m7
$$ -783 -736 -807 -855 -880 -816 -790 -763 -811 -714 -669 -820 -755 -828 -739 -672 -770 -810 -871 -752 -836 -699 -697 -850 -758 -780 -783 -861 -859 -853 -747 -753 -753 -875 -823 -870
4751h70M0O5o7Po2J20l0o5K5l6N1J7Q8j35N4J9Q8q3j5O2n7m2J02j46J07k8J57n8p3k12P0N
$$ -870 -830 -765 -832 -825 -887 -767 -797 -862 -837 -873 -822 -805 -717 -852 -798 -779 -691 -774 -789 -727 -784 -826 -724 -870 -763 -791 -634 -692 -765 -977 -907 -902
4744i02J78q1p8J32J09rl3p7O2K6l3p2n9M8K5o3O4j72N8Q4j0Jj23P9J01q6J53j02P3m0p5Q3
$$ -902 -724 -805 -883 -751 -642 -651 -684 -761 -699 -673 -706 -778 -837 -789 -764 -827 -763 -935 -877 -793 -803 -802 -925 -846 -745 -831 -678 -780 -707 -747 -822 -739
4737g39m0j53L4J20J40j05o2J5LKJ2jN9j23Q6o7M5M4m0Pl2j81J48J25K2j20KL3M4N3oj25K7
$$ -739 -779 -932 -898 -778 -638 -743 -805 -790 -787 -785 -773 -774 -715 -838 -752 -819 -774 -730 -770 -763 -795 -976 -828 -703 -681 -801 -799 -766 -722 -669 -675 -800 -773
4729g73k6R3p8MJ0K5QJ3m1K0L7Q6j31j6N5M3j1o7K3j5p3n3J20k0pk9jQr6O2J51j66m8Q0M5
$$ -773 -799 -706 -784 -780 -770 -745 -737 -724 -765 -745 -708 -622 -753 -769 -714 -671 -682 -749 -726 -741 -814 -867 -747 -767 -774 -803 -804 -796 -892 -830 -679 -845 -893 -813 -768
4721g68k2o5nK6M4p6R8J28k0q9k1RP1j40J10n4J5J33q0m7j11O5J08n7j9n5O2o7O8J52j84k1
$$ -768 -790 -855 -860 -834 -790 -866 -768 -640 -660 -749 -770 -761 -690 -830 -720 -774 -759 -626 -706 -753 -864 -799 -691 -748 -767 -822 -760 -827 -759 -607 -791 -812
4714h12K4J59KK7r3L1m4o9K2Q3J28k17j05Q1l0J15K3P6j54j23J21O7q7Q2n5o7j4M1N3%p4J61
$$ -812 -788 -629 -627 -600 -693 -662 -706 -775 -753 -670 -542 -759 -864 -783 -813 -698 -675 -599 -753 -876 -755 -688 -775 -693 -748 -815 -829 -788 -735 -735 -809 -648
4706f48j47p1N6Q1R2l5j2m7L5K7j15J19j63J03O3k2J0l7j09R8j9O1n4q8OR7P5j60J9J17J0
$$ -648 -795 -866 -810 -729 -637 -672 -684 -731 -696 -669 -784 -665 -828 -725 -662 -684 -674 -711 -820 -722 -741 -680 -734 -822 -816 -719 -644 -804 -785 -668 -658
4699f58r5Q1l3o0j27N7n0J20O0pn2N5nl7j7J06m4l2n7n3J86o8J2L6j12J98k2j32q2J37r1O8
$$ -658 -753 -672 -705 -765 -892 -835 -885 -765 -705 -712 -764 -709 -714 -751 -768 -662 -706 -738 -795 -848 -662 -730 -718 -682 -794 -596 -618 -750 -832 -695 -786 -718
4692g18n7O0l2L3K3O2Mj07O8pj9K3%j05j41P5J09q6l8L3L7R6J0p6p3K3jqR0o6n7J79Rr5n6
$$ -718 -775 -715 -747 -714 -691 -629 -625 -732 -664 -671 -690 -667 -667 -772 -913 -838 -729 -815 -853 -820 -783 -687 -677 -753 -826 -803 -804 -812 -722 -788 -845 -666 -657 -752 -808
4684h08p7M8R6lM8qr6J32n1L8qq6J3mM6m6l%q0J16J5m6p4Q8M9k4j4j20m6J59Oj7K9m1j2K5
$$ -808 -885 -837 -741 -744 -696 -704 -800 -668 -719 -681 -689 -775 -762 -766 -720 -766 -769 -769 -849 -733 -718 -764 -838 -750 -701 -725 -739 -859 -905 -746 -740 -757 -728 -769 -781 -756
4676g56n6L3j0oNk3q3K4J8n8P6o0J70o9j8m8J0j0N4M9K7j1l8n4p0%J24k8M2Q5o2p3o5J08J38
$$ -756 -812 -779 -789 -795 -790 -813 -896 -872 -854 -912 -836 -896 -726 -795 -813 -861 -851 -861 -807 -758 -731 -742 -780 -834 -904 -904 -780 -808 -766 -681 -743 -816 -881 -773 -635
4668f35j36O9j8m3j56Q3j9r8J5J29O8K7j0L7j48Q9%j60Q8L2j14M8L6M0l7j03n1O1N4%R7P0
$$ -635 -771 -702 -720 -763 -919 -836 -855 -953 -938 -809 -741 -714 -724 -687 -835 -746 -746 -906 -818 -786 -900 -852 -816 -776 -813 -916 -967 -906 -852 -852 -755 -685
4660f85q6j59K8J46J36n8o2J8J0q8N4N7r7k8J82nr8j16N5K1k6O6l8l8k0J7J5N9n1L6J0P9p3
$$ -685 -771 -930 -902 -756 -620 -678 -740 -722 -712 -800 -746 -689 -786 -814 -632 -637 -735 -851 -796 -775 -801 -735 -773 -811 -831 -814 -799 -740 -791 -755 -745 -666 -739
4653g39k3M4m2mP2q7K6J10j25j0J0O3J0j06P3QpJ11r2j02J27NL5j6o0n6M4j17O7O5l1p1k2
$$ -739 -762 -718 -760 -764 -692 -779 -753 -643 -768 -778 -768 -705 -695 -801 -728 -720 -727 -616 -708 -810 -683 -678 -643 -659 -719 -775 -731 -848 -781 -716 -747 -818 -840
4645h40J08J5K1r4J3jMJn4Q5q2RP9j03Q1K4R1q0Q0j69J58j02l8ok2k1J08P5l4p8kK5N5K3n7
$$ -840 -732 -717 -696 -790 -777 -778 -774 -773 -827 -742 -824 -815 -736 -839 -758 -734 -643 -723 -643 -812 -654 -756 -794 -800 -822 -843 -735 -660 -694 -772 -774 -749 -694 -671 -728
4637g28L9J9M1j10P5K8j50l6p3Q0R0P9M7j12m4k7M5j17M6O0j7q4J23l0j64J55j2Q8j25l9J45
$$ -728 -689 -670 -629 -739 -664 -636 -786 -822 -895 -815 -725 -646 -599 -711 -755 -782 -737 -854 -808 -748 -765 -849 -726 -756 -920 -765 -777 -689 -814 -853 -708
4630g08L7m0J5o2j7k3n1Q6q8lJ43m1L3j76K6J06jo8J36ok6n2nL4L9P3j00n9NO2N4k05O0Q6
$$ -708 -671 -711 -696 -758 -775 -798 -849 -763 -851 -854 -711 -752 -719 -895 -869 -763 -764 -832 -696 -702 -728 -780 -785 -751 -712 -639 -739 -798 -793 -731 -677 -882 -822 -736
4622g36K5j43L6P4N7J2r1%O5J5j68J86N3j1q0o1q9M1K00q3o0n2N6j09R5L6n2O8m4N2P%ll0
$$ -736 -711 -854 -818 -744 -687 -675 -766 -766 -701 -686 -854 -668 -615 -626 -706 -767 -856 -815 -615 -698 -758 -810 -754 -863 -768 -732 -784 -716 -760 -708 -701 -701 -704 -734
4615g34K8Qo8j6m3l4K0Q9L0l9J4j7j7J5m9O6noL9L9O0l6m9k6m3K0lK4j05J63j35mk0Q3n5O
$$ -734 -706 -698 -766 -782 -825 -859 -839 -750 -720 -759 -745 -762 -779 -764 -813 -747 -752 -758 -719 -680 -620 -656 -705 -731 -774 -754 -757 -733 -838 -675 -810 -814 -834 -751 -806 -800
4606h00p5J37L1j07N0O5Nj1o1P3K8J4j74J8jRj12M3J22j2qlL2Q1n6r9M1O7o6QJ4j30Q3l6P7
$$ -800 -875 -738 -707 -814 -764 -699 -694 -705 -766 -693 -665 -651 -825 -807 -808 -799 -911 -868 -746 -758 -766 -769 -737 -656 -712 -811 -770 -703 -769 -761 -747 -877 -794 -830 -753
4598g53L6J8j26n7J06k5jJ8J2Q2q1k5M8j43M0J46M4q3M5l5q8pM3j0J06n5R7Oq9J1j04O2Kj11
$$ -753 -717 -699 -825 -882 -776 -801 -802 -784 -772 -690 -771 -796 -748 -891 -851 -705 -661 -744 -699 -734 -822 -829 -786 -796 -690 -745 -648 -642 -731 -720 -824 -762 -760 -871
4591h71J34qn3N3P1j38K9n8Q4L6j75m4J21J33M0p5n6J26j79O7P5q1M2M3k0J2q9m5qQ6l2P1
$$ -871 -737 -745 -798 -745 -674 -812 -783 -841 -757 -721 -896 -940 -819 -686 -646 -721 -777 -651 -830 -763 -688 -769 -727 -684 -704 -692 -781 -826 -834 -748 -780 -709
4583g09Q3j29O4j37r5J54rMm2k5J22qJ3j55K30j94QJ1L9r8J8l0RJ21QP6q4L6m3M8oj01l5P2
$$ -709 -626 -755 -691 -828 -923 -769 -778 -774 -816 -841 -719 -727 -714 -869 -639 -833 -825 -814 -775 -873 -855 -885 -876 -755 -747 -671 -755 -719 -762 -714 -720 -821 -856 -784
4576g84K6M3p0opJ34q5P1j38kQ3l9lJ1o4O7n4K1L2P5k8K8Q9j17N9J3j05l9j5l4O5LK7k38R9
$$ -784 -758 -715 -785 -791 -798 -664 -749 -678 -816 -818 -735 -774 -777 -766 -830 -763 -817 -796 -764 -689 -717 -689 -600 -717 -658 -645 -750 -789 -804 -838 -773 -770 -743 -981 -882
4568h82O1L3l4p2Q8P8r6Pj35J27n7P7J04n1k9Q3J4o5n5qO3O8M2k9m7l4L7j41L9J60j16n0P5
$$ -882 -821 -788 -822 -894 -806 -728 -824 -817 -952 -825 -882 -805 -701 -752 -781 -698 -684 -749 -804 -812 -749 -681 -639 -668 -715 -749 -712 -853 -814 -654 -770 -820 -745
4560g45K1m4%P2nnm7Q0p8j11PO8N3O8m7L1q8o7Q8J3L4j56P9m1P1n4J13L5o5m9j4n4K2%p0J80
$$ -745 -724 -768 -768 -696 -701 -706 -753 -673 -751 -862 -855 -787 -734 -666 -713 -682 -770 -837 -749 -736 -702 -858 -779 -820 -749 -803 -690 -655 -720 -769 -783 -837 -815 -815 -885 -705
4552g05N0L5k71J34J9J2O7K7k68R2oRM3P2o4J8m7l7O4J2J9o7J67l7J42o2r8j24o7R3M0m9O8
$$ -705 -655 -620 -891 -757 -738 -726 -659 -632 -900 -808 -814 -805 -762 -690 -754 -736 -783 -820 -756 -744 -725 -792 -625 -662 -520 -582 -680 -804 -871 -778 -738 -787 -719
4544g19r2P8J7o1N9o9n0jM8l5J38K8j87j7L1m4K4M6J9L3PrJ45j96L4k0J93j66Mm2M4J03r3
$$ -719 -811 -733 -716 -777 -718 -787 -837 -838 -790 -825 -687 -659 -846 -863 -832 -876 -852 -806 -787 -754 -747 -756 -611 -807 -773 -793 -600 -766 -762 -804 -760 -657 -750
4537g50j5n0M1m2l0J36nL8j9n1M6n9m0K9l1P3m6n8J79p4j03J58p4j1M0O3j76m1O0N2N0K2l7
$$ -750 -765 -815 -774 -816 -846 -710 -715 -677 -696 -747 -701 -760 -800 -771 -802 -729 -775 -833 -654 -728 -831 -673 -747 -758 -718 -655 -831 -872 -812 -760 -710 -688 -725
4529g25Q0j32n8l2J1K57j23l1pm6J5KK6K0P6q2q0N7K6r0L7N2K3j55Q7j3p4k7J09J05J1R3M8
$$ -725 -645 -777 -835 -867 -856 -599 -722 -753 -760 -806 -791 -789 -763 -743 -667 -749 -829 -772 -746 -836 -799 -747 -724 -879 -792 -805 -879 -906 -797 -692 -681 -588 -540
4522e40j08j43J7L7j6Q9j02r9J1J6j6n1j6J47k1L2Q3K4J2p1l8nr6Q4n3R4K9K22j71j21M2l3
$$ -540 -648 -791 -774 -737 -753 -664 -766 -865 -854 -838 -854 -905 -921 -774 -795 -763 -680 -656 -644 -715 -753 -758 -854 -770 -823 -729 -700 -478 -649 -770 -728 -761
4514g61M6M5K1r9q6M6lK4J06k01kj3O9l4l5J0Q3L2J46j44L9P1q7K0j16rj11J51p6J15n4J23
$$ -761 -715 -670 -649 -748 -834 -788 -791 -767 -661 -862 -864 -877 -808 -842 -877 -867 -784 -752 -606 -750 -711 -640 -727 -707 -823 -832 -943 -792 -868 -753 -807 -684
4507f84p8j8j70n5K17j0p5J59N8j76J1K5J4l3O0P3j70J55n0l9o7O7R7K2N8q1qk4O6k9j33N8
$$ -684 -762 -780 -950 -1005 -788 -798 -873 -714 -656 -832 -821 -796 -782 -815 -755 -682 -852 -697 -747 -786 -853 -786 -689 -667 -609 -690 -698 -722 -656 -685 -818 -760
4500g60MJ8l8m5Q9l6J8n3J06m9J4n3J29qj30k4j0j7J1M0N5q6j7pJ19l2J51n0n2J29P7j39R
$$ -760 -756 -738 -776 -821 -732 -768 -750 -803 -697 -746 -732 -785 -656 -664 -794 -818 -828 -845 -834 -794 -739 -825 -842 -849 -730 -762 -611 -661 -713 -584 -507 -646 -637
4492f37m8Kj00n3l0P2l8K3kJ22L6j39Rm7J00L0j7q6K1m3Q7j59J16K2J25j11J07o4M1M4j75
$$ -637 -685 -683 -783 -836 -866 -794 -832 -809 -811 -689 -653 -792 -783 -830 -730 -700 -717 -803 -782 -825 -738 -897 -781 -759 -634 -745 -638 -702 -661 -617 -792
4485g92K3o5N3J51j51L4m8kR2n5PM2l8k1m5%l1J09Q1m9nk2M2qn5k6M3k6j01O0L8l7j7N5M1
$$ -792 -769 -834 -781 -630 -781 -747 -795 -797 -705 -760 -753 -711 -749 -770 -815 -815 -846 -737 -656 -705 -710 -732 -690 -698 -753 -779 -736 -762 -863 -803 -765 -802 -819 -764 -723
4477g23O5L7j60j6J26O8k01n1o7Q5rJ06O3L7j27K0m5M3j1r1J11O4p9p4K7j2J47j9l1n1j10
$$ -723 -658 -621 -781 -797 -671 -603 -804 -855 -922 -837 -846 -740 -677 -640 -767 -747 -792 -749 -760 -851 -740 -676 -755 -829 -802 -814 -667 -686 -717 -768 -878
4470h78l0J99j03K4j5P2J8Q2Oo4R2lj54j0OP6p5n0p1kM7kP1K7L6j24N4j12J19p8K1J08j2K1
$$ -878 -908 -709 -812 -788 -803 -731 -713 -631 -625 -689 -597 -600 -754 -764 -758 -682 -757 -807 -878 -880 -833 -835 -764 -737 -701 -825 -771 -883 -764 -842 -821 -713 -725 -704
4462g04PO9m4m8l7k3O9J0L9o5j01J01Mn4n7M4R5m5M1J12j07j27J50j47J56j33J02L2l4k1J02
$$ -704 -697 -628 -672 -720 -757 -780 -711 -701 -662 -727 -828 -727 -723 -777 -834 -790 -695 -740 -699 -587 -694 -821 -671 -818 -662 -795 -693 -661 -695 -716 -614
4455f14L8k2o8Nj34P7q4L9L7l2m4k8L8R7k8mJ7p2J5O6KK7JJ06p8k9M9J8o5K3N9J5j66R6j17
$$ -614 -576 -598 -666 -661 -795 -718 -802 -763 -726 -758 -802 -830 -792 -695 -723 -727 -710 -782 -767 -701 -699 -672 -671 -565 -643 -672 -623 -605 -670 -647 -588 -573 -739 -643 -760
4447g60NR5n8N7N1l2%q6n6K11J47R0N4Q6J20K06J38rJ99K32M49O71J875M565O603N283J683
$$ -760 -755 -660 -718 -661 -610 -642 -642 -728 -784 -573 -426 -336 -282 -196 -76 130 268 259 458 690 1139 1810 3685 8250 14853 20136 21819
4441B1819j567m25l974q530m162j577p21m78k14o1n5q0j54j30j15m3l8j49p6j2pJ1m0k3L3
$$ 21819 20252 19827 15853 7323 3161 1584 863 385 171 110 55 -25 -179 -309 -424 -467 -505 -654 -730 -742 -749 -738 -778 -801 -768
4435g68K8J08M3j09j1J76j43o4q8J02o3K6J6M9P7mOj24r5O9J00l2r0J5K6j04L3K8kN9m9P9
$$ -768 -740 -632 -589 -698 -709 -533 -676 -740 -828 -726 -789 -763 -747 -698 -621 -625 -619 -743 -838 -769 -669 -701 -791 -776 -750 -854 -821 -793 -795 -736 -785 -706
4428g06k4L6o6Mk4l8o5N5r2O2J29r9j7m4P6oJ6J40L8p6l4J8k2J36l8j46p3J22l1O5r6O8k8
$$ -706 -730 -694 -760 -756 -780 -818 -883 -828 -920 -858 -729 -828 -845 -889 -813 -819 -803 -663 -625 -701 -735 -717 -739 -603 -641 -787 -860 -738 -769 -704 -800 -732 -760
4420g60k9l4J2q1J55K5j10K0M5q7J84o2J5q3K4p2J50j0j40KO6j5L7K4L8Lp3k2j9O0L9q6J5
$$ -760 -789 -823 -811 -892 -737 -712 -822 -802 -757 -844 -660 -722 -707 -790 -766 -838 -688 -698 -838 -836 -770 -785 -748 -724 -686 -683 -756 -778 -797 -737 -698 -784 -769
4413g69j7l0Q5J04k04J03Q8l8O2n4r2L9j6k1r8O5J1KL8j5l0J15N0Lm4L6o9q9L4l8Jn7N4j07
$$ -769 -786 -816 -731 -627 -831 -728 -640 -678 -616 -670 -762 -723 -739 -760 -858 -793 -782 -780 -742 -757 -787 -672 -622 -619 -663 -627 -696 -785 -751 -789 -788 -845 -791 -898
4405h98Q8J8k4mL4l8J13R5j41NL2r6K9O2m2J68o6J8j47m2k0P2r6R6M0j58J65N6mk5q1N2n7
$$ -898 -810 -792 -816 -820 -786 -824 -711 -616 -757 -752 -720 -816 -787 -725 -767 -599 -665 -647 -794 -836 -856 -784 -880 -784 -744 -902 -737 -681 -685 -710 -791 -739 -796
4397g96p0J32L9J3k7n6l9L2O0Q9j43K1m5r8J07R8j01l9o7J14K8o0Q5j7k5q7K3L6J72p8k0r
$$ -796 -866 -734 -695 -682 -709 -765 -804 -772 -712 -623 -766 -745 -790 -888 -781 -683 -784 -823 -890 -776 -748 -808 -723 -740 -765 -852 -829 -793 -621 -699 -719 -728
4390g28j2j10R8M2nJ41J33K01J34j02r8P4j10k03q7k8np0k4P1k5j17J43j9J80j15ok9k6k5
$$ -728 -740 -850 -752 -710 -715 -574 -441 -240 -106 -208 -306 -232 -342 -545 -632 -660 -665 -735 -759 -688 -713 -830 -687 -706 -526 -641 -647 -676 -702 -727
4383g27n0k0%k7L3j3m4J89J3M3j43j03K4Lj8J25n0n0j7m0J91L7q3m4LM5q4o3O6Pj9O1k8K3
$$ -727 -777 -797 -797 -824 -791 -804 -848 -659 -646 -603 -746 -849 -825 -822 -840 -715 -765 -815 -832 -872 -681 -644 -727 -771 -768 -723 -807 -870 -804 -797 -816 -755 -783 -760
4375g60J6mK0l3n7K2R2p8O9K1om6M0j6m8l6N9Kj1q8P7O7n0P8j16j7L1m8J63K7k0j06M4j12
$$ -760 -744 -748 -728 -761 -818 -796 -704 -782 -713 -692 -698 -744 -704 -720 -768 -804 -745 -743 -754 -842 -765 -698 -748 -670 -786 -803 -772 -820 -657 -630 -650 -756 -712 -824
4368h24O5Q9L3j5o1j93R4J31j18j3pJ09L5p8J2m2L4j7M0j02Q8J01p3j0K7m7J3j42K5Ok9J00
$$ -824 -759 -670 -637 -652 -713 -906 -812 -681 -799 -812 -819 -710 -675 -753 -741 -783 -749 -766 -726 -828 -740 -639 -712 -722 -695 -742 -729 -871 -846 -840 -869 -769
4360g69L6l7q6j1M8J0P9J37j01M4j32M3l5p5P9JO8n0PjM1RK9j9l9j12JM7J59j26Q3j68l1K6
$$ -769 -733 -770 -856 -867 -819 -809 -730 -593 -694 -650 -782 -739 -774 -849 -770 -769 -701 -751 -744 -745 -704 -695 -666 -685 -724 -836 -835 -788 -629 -755 -672 -840 -871 -845
4353h45J03k8M5q6N6N4k3k6J61k00K2l0o0QQ2P0p4N7j45L3J86q2o4r1Q7J74N0n7r4K8o0P8
$$ -845 -742 -770 -725 -811 -755 -701 -724 -750 -589 -789 -767 -797 -857 -849 -767 -697 -771 -714 -859 -826 -640 -722 -786 -877 -790 -616 -566 -623 -717 -689 -749 -671
4345f71N3r1%Q6M4j92k4J0p1Q0k0K2l8R7j8L9k3nK9j42K0J61m1j23r0Q9p2J68JK5J3n6L3l5
$$ -671 -618 -709 -709 -623 -579 -771 -795 -785 -856 -776 -796 -774 -812 -715 -733 -694 -717 -722 -693 -835 -815 -654 -695 -818 -908 -819 -891 -723 -722 -697 -684 -740 -707 -742
4337g42J8j20J27k8N4n0m0K5j10O0k7L4k8l3J20M8k4p1J11l2q1K8q3P0P8lm8p4R1m2j9k6k6
$$ -742 -724 -844 -717 -745 -691 -741 -781 -756 -866 -806 -833 -799 -827 -860 -740 -692 -716 -787 -676 -708 -789 -761 -844 -774 -696 -699 -747 -821 -730 -772 -791 -817 -843
4330h43N5L0Q1j52L7RP1Pj5N1j14p3K1j64J89O5M0j03M6J02l8q5L2N8j6o3q6J49J1k6r3J41
$$ -843 -788 -758 -677 -829 -792 -783 -712 -705 -720 -669 -783 -856 -835 -999 -810 -745 -705 -808 -762 -660 -698 -783 -751 -693 -709 -772 -858 -709 -698 -724 -817 -676
4323f76j82L5Rk3j4n9Ro2K88j9r7p8J27l9k2j67J74K4r0J17Q4j25m0N0J8n8J44p4P1p6Q5j49
$$ -676 -858 -823 -814 -837 -851 -910 -901 -963 -675 -694 -791 -869 -742 -781 -803 -970 -796 -772 -862 -745 -661 -786 -826 -776 -758 -816 -672 -746 -675 -751 -666 -815
4315h15O5m5J2J5k9qqr1O5M%R5p1Rm5JJ23P6o7o5K0l6LM6R5j00p7pJ58O8Oj96Q2j2oM3Qj66
$$ -815 -750 -795 -783 -768 -797 -805 -813 -904 -839 -835 -835 -740 -811 -802 -847 -846 -723 -647 -714 -779 -759 -795 -792 -746 -651 -751 -828 -835 -677 -609 -603 -799 -717 -729 -735 -692 -684 -850
4307h50K5j4k0K4R2j33M7M4r3O1L1pQ5Rj24m9M0J20r9J27j6o5m7J71l4j64j0k6R6nj25P9J2
$$ -850 -825 -839 -859 -835 -743 -876 -829 -785 -878 -817 -786 -793 -708 -699 -823 -872 -832 -712 -811 -684 -700 -765 -812 -641 -675 -839 -849 -875 -779 -784 -909 -830 -818
4299h18J04o1J9P9o3K0n1L3oK8Qm0K3l9L8kj2j2m3J05M8m9r2M8p7J34K5K1j13K00j50k0PJ2
$$ -818 -714 -775 -756 -677 -740 -720 -771 -738 -744 -716 -708 -748 -725 -764 -726 -728 -740 -752 -795 -690 -642 -691 -783 -735 -812 -678 -653 -632 -745 -545 -695 -715 -708 -696
4291f96p3P9j01J64o1k8J02k3j03J03o7j21N7O8r1n4J11q4m3n4R5qL5J21JL1N0m6j19kmP3
$$ -696 -769 -690 -791 -627 -688 -716 -614 -637 -740 -637 -704 -825 -768 -700 -791 -845 -734 -818 -861 -915 -820 -828 -793 -672 -671 -640 -590 -636 -755 -757 -761 -688
4284f88p6j55j5L8O6p4M1J21n2o7j04N9p1O9j07N3O7K2J66P4j86K7L7Qp5j03J73k6J8m5lo
$$ -688 -764 -919 -934 -896 -830 -904 -863 -742 -794 -861 -965 -906 -977 -908 -1015 -962 -895 -873 -707 -633 -819 -792 -755 -747 -822 -925 -752 -778 -760 -805 -808 -814
4277h14K9N2j48L7J3k5J01k16R4J9P1j46L1J40k0k0n3RR3r3Pl2j2J47M2j08k6L6J54K6q2j6
$$ -814 -785 -733 -881 -844 -831 -856 -755 -971 -877 -858 -787 -933 -902 -762 -782 -802 -855 -846 -753 -846 -839 -871 -883 -736 -694 -802 -828 -792 -638 -612 -694 -710
4269g10q8p5J31%O4Qkl1lN4j8m1R4k8j06q2J99q2p2Mj2P4K7m7J44p0j38R6j10M3J0P3j78O
$$ -710 -798 -873 -742 -742 -678 -670 -672 -703 -706 -652 -670 -711 -617 -645 -751 -833 -634 -716 -788 -784 -796 -722 -695 -742 -598 -668 -806 -710 -820 -777 -767 -694 -872 -866
4262h66J6j7L6l9J30p8L6Q6%r4OR2L2J6k2j13J37kj13p3Q3o2J7KMJ34N2j46l8O4n5m6RjJ09
$$ -866 -850 -867 -831 -870 -740 -818 -782 -696 -696 -790 -784 -692 -660 -644 -666 -779 -642 -644 -757 -830 -747 -809 -792 -790 -786 -652 -600 -746 -784 -720 -775 -821 -812 -813 -704
4254g04q2J50j11j02O6J10o6j2P5j16J6K3O5r5l8J30J9j64pJ48L3j59M5O9J37p4m5q9n2o2
$$ -704 -786 -636 -747 -849 -783 -673 -739 -751 -676 -792 -776 -753 -688 -783 -821 -691 -672 -836 -843 -695 -662 -821 -776 -707 -570 -644 -689 -778 -830 -892
4247h92N0J55j2n8j9K7m3N8J5J00n4M4j19J38k19mQ4M7pNp3O8Kk9N7q0O6K7k0j01J13oj18
$$ -892 -842 -687 -699 -757 -776 -749 -792 -734 -719 -619 -673 -629 -748 -610 -829 -833 -749 -702 -709 -704 -777 -709 -707 -736 -679 -759 -693 -666 -686 -787 -674 -680 -798
4239g98o5N5L4p7Jk1O4J09M7K7o1j67M1N5k5o9l3O2J02j12K4L0J69n0j46k4O6M8QQl3p5K0
$$ -798 -863 -808 -774 -851 -850 -871 -807 -698 -651 -624 -685 -852 -811 -756 -781 -850 -883 -821 -719 -831 -807 -777 -608 -658 -804 -828 -762 -714 -706 -698 -731 -806 -786
4232g86R3l0r8R5K1j11m0J30j10P4L5j09n4J1Q3L6K4L4j6j2j4j5j10J09Mm6N5K9n3K2L1k8
$$ -786 -693 -723 -821 -726 -705 -816 -856 -726 -836 -762 -727 -836 -890 -879 -796 -760 -736 -702 -718 -730 -744 -759 -869 -760 -756 -802 -747 -718 -771 -749 -718 -746
4224g46p0j12J45J63q5p2l7n3J31M9oj24J2LP4r7J6J60k7Rq3J06L9j14n3R7m1M0K5J0j34l1
$$ -746 -816 -928 -783 -620 -705 -777 -814 -867 -736 -687 -693 -817 -805 -802 -728 -825 -809 -649 -676 -667 -750 -644 -605 -719 -772 -675 -716 -676 -651 -641 -775 -806
4217h06K6J68j24j18M1J09p6P6n2p0N2OJ42J6k38J18J17m8J8m6j42O2q3M1J55o0o0j7l8m3
$$ -806 -780 -612 -736 -854 -813 -704 -780 -704 -756 -826 -774 -768 -626 -610 -848 -730 -613 -661 -643 -689 -831 -769 -852 -811 -656 -716 -776 -793 -831 -874
4210h74J38n3K8R1l8R2l1j62J27OL7N0m4o6K4n4l4M2L3j08R9M9n2P4n2m8j03Q7O6pl4J08j69
$$ -874 -736 -789 -761 -670 -708 -616 -647 -809 -682 -676 -639 -589 -633 -699 -675 -729 -763 -721 -688 -796 -697 -648 -700 -626 -678 -726 -829 -742 -676 -683 -717 -609 -778
4203g78j02J23N9q2PN0j14K3J5m0L0K2N0K6M8K1j11R6j16n0K9P9n1pj3om9m0J16J48j55O9
$$ -778 -880 -757 -698 -780 -773 -723 -837 -814 -799 -839 -809 -787 -737 -711 -663 -642 -753 -657 -773 -823 -794 -715 -766 -773 -786 -792 -841 -881 -765 -617 -772 -703
4195g03N1J03k39ON0J2N0j09O5lk9qQ3K4m1pk8k3J7m0J03q0J13j08j7Q9j53n5K8J23L4On9
$$ -703 -652 -549 -788 -782 -732 -720 -670 -779 -714 -717 -746 -754 -671 -647 -688 -695 -723 -746 -729 -769 -666 -746 -633 -741 -758 -669 -822 -877 -849 -726 -692 -686 -745
4188g45J47o6n1j0n8K1j7J5L4L4mq7N4Ll0J16n7o8m3O2N7j48J47L9k4r3n4J16k2o0J27j22
$$ -745 -598 -664 -715 -725 -783 -762 -779 -764 -730 -696 -700 -787 -733 -730 -760 -644 -701 -769 -812 -750 -693 -841 -694 -655 -679 -772 -826 -710 -732 -792 -665 -787
4180g87k0j35K26m8p5M4O7N8j90K4p6K43M0J8m2Nn1kr6M7J11r1L8L7n9q0k1k2O1k2J02p8P5
$$ -787 -807 -942 -716 -764 -839 -795 -728 -670 -860 -836 -912 -669 -629 -611 -653 -648 -699 -701 -797 -750 -639 -730 -692 -655 -714 -794 -815 -837 -776 -798 -696 -774 -699
4173f99n5m6L3J9o3J4J0P8Nj66J98M5j87R9j01J7lK0J0pj1O6J16n4M9n6K5j3N6r1pO9l0o5
$$ -699 -754 -800 -767 -748 -811 -797 -787 -709 -704 -870 -672 -627 -814 -715 -816 -799 -802 -782 -772 -779 -790 -724 -608 -662 -613 -669 -644 -657 -601 -692 -699 -630 -660 -725
4165g25o5j57ll0O4J3J93L6j3p5j39J47p3k4n4P4j4J26k7Q1l0q6P6l2L4j6J43J10j56q1N1
$$ -725 -790 -947 -950 -980 -916 -903 -710 -674 -687 -762 -901 -754 -827 -851 -905 -831 -845 -719 -746 -665 -695 -781 -705 -737 -703 -719 -576 -466 -622 -703 -652
4158f52Nq2R3R1M7J89K0R1J75L97Q36R80Q03N1l64j76j261j004m17k26p5j45J2J5j01j12j6
$$ -652 -647 -729 -636 -545 -498 -309 -289 -198 -23 374 1210 2190 2993 3044 2680 2504 1243 239 -178 -404 -479 -624 -612 -597 -698 -810 -826
4152h26J29J66lo1j55n4J8L0K5j6Q4Qr3J53j18k29J95m8R1O2j25Q4j4m3Q5P0j00J6M5p0O2
$$ -826 -697 -531 -534 -595 -750 -804 -786 -756 -731 -747 -663 -655 -748 -595 -713 -942 -747 -795 -704 -642 -767 -683 -697 -740 -655 -585 -685 -669 -624 -694 -632
4145f32j07oP3Ok0R8K9j00j85Q2N9Q1n0o9J43l8Q7j29o1J51mj52N2M5j23J0J5L1j06J40R2
$$ -632 -739 -745 -672 -666 -686 -588 -559 -659 -844 -762 -703 -622 -672 -741 -598 -636 -549 -678 -739 -588 -592 -744 -692 -647 -770 -760 -745 -714 -820 -680 -588
4138e88LO6k2j38n2m9l8%R2J00r4M3ql9n0R3q8J91j34Q7r9j39J41M0k1J5K6j00OOO0j63k4
$$ -588 -585 -519 -541 -679 -731 -780 -818 -818 -726 -626 -720 -677 -685 -724 -774 -681 -769 -578 -712 -625 -724 -863 -722 -682 -703 -688 -662 -762 -756 -750 -690 -853 -877
4130h77j4J9J32Q1p6j6l6Pl1P3J6J72k9J75N42N47M89J3k74m0n00p45k01j26K9M7J4p9l5k8
$$ -877 -891 -872 -740 -659 -735 -751 -787 -780 -811 -738 -722 -550 -579 -404 138 685 1174 1187 913 873 373 -372 -573 -699 -670 -623 -609 -688 -723 -751
4123g51n4J43j51j5K6N9K6q4R1K9j23N4q7L3P5Q1J1kn3P3n6n5l2j2j7J91k3o5l4j0J0r0Q2
$$ -751 -805 -662 -813 -828 -802 -743 -717 -801 -710 -681 -804 -750 -837 -804 -729 -648 -637 -639 -692 -619 -675 -730 -762 -774 -791 -600 -623 -688 -722 -732 -722 -812 -730
4116g30j00J13p4J01n6k5K86K0k02m1J06K8j56J47j1Q0k8M2J14J72j16j33mp3j88N5j22J02
$$ -730 -830 -717 -791 -690 -746 -771 -485 -465 -667 -708 -602 -574 -730 -583 -594 -514 -542 -500 -386 -214 -330 -463 -467 -540 -728 -673 -795 -693
4109f93J41q9o1JP7j05K7O3J7MJ4op0l1N3n8k1J3l7L2N7j7j53K19k3m8k8k5O4R0k9j73N9J82
$$ -693 -552 -641 -702 -701 -624 -729 -702 -639 -622 -618 -604 -610 -680 -711 -658 -716 -737 -724 -761 -729 -672 -689 -842 -623 -646 -694 -722 -747 -683 -593 -622 -795 -736 -554
4101e54j86J48k1j04O5Kk4K0L8k0j6m6R5j21r3M9p1N9M1J63R2L6J14pJ9K7j51j75N6L5j32
$$ -554 -740 -592 -613 -717 -652 -650 -674 -654 -616 -636 -652 -698 -603 -724 -817 -768 -839 -780 -739 -576 -484 -448 -334 -341 -322 -295 -446 -621 -565 -530 -662
4094f62n6J27J9j68pJ1M2q3R2K1j01n1q0J71R8J09M5J42Ln1r1M8M2j27o0J32J02n4l4J08n6
$$ -662 -718 -591 -572 -740 -747 -736 -694 -777 -685 -664 -765 -816 -896 -725 -627 -518 -473 -331 -328 -379 -470 -422 -380 -507 -567 -435 -333 -387 -421 -313 -369
4087c69n6k5R7L0o8k5J76m5K29J00j13n6J2n7o4k58K7R1O9L3J05Q7J80J29K36J02m0m1r2k59
$$ -369 -425 -450 -353 -323 -391 -416 -240 -285 -56 44 -69 -125 -113 -170 -234 -492 -465 -374 -305 -272 -167 -80 100 229 465 567 527 486 394 135
4080A35j23j06m8o2N1J37J2R8P19J053J072O64k95k04k56j528p76k15j51J9l0J55j1J80n2
$$ 135 12 -94 -142 -204 -153 -16 -4 94 813 1866 2938 3602 3307 3103 2847 1319 543 328 177 196 166 321 310 490 438
4075D38Q9P5R4J04L2P7J13J45J54J2m5J99K55K76K12K67K15M31M74K49M45O14Q26R49J093
$$ 438 527 602 696 800 832 909 1022 1167 1321 1333 1288 1487 1742 2018 2230 2497 2712 3143 3617 3866 4311 4925 5751 6700 7793
4069G793J338J884K685L766N383P253J1088J9821M8782J50880J90610J69444O8775p9918p993
$$ 7793 9131 11015 13700 17466 22849 30102 41190 61011 109793 260673 451283 620727 689502 609584 601591
4066F01591j61824k61832r6086l5116j6209q874o203l556k104r49L78J000J317j92j120n09
$$ 601591 439767 177935 81849 46733 30524 21650 15447 11891 9787 8838 9216 10216 11533 11341 10221 9712
4062I712k335l032j761q08m39j78j66k43j62o9k10J01ok43j9M0Jj93o8n7j30J5O0p3J13j06
$$ 9712 7377 4345 2584 1776 1337 1159 993 750 588 519 309 410 404 161 142 182 183 -10 -78 -135 -265 -250 -190 -263 -150 -256
4056b56r6K06M6L90J087J232J193K66n05k21q92j242r9j70k45k06k87l90N9O4M9r6n7j65o6
$$ -256 -352 -146 -100 290 1377 2609 3802 4068 3563 3342 2450 1208 1109 939 694 488 201 -189 -130 -66 -17 -113 -170 -335 -401
4050d01j54j74%j00K1p1K19jRJ37q4l0j10j2n9q2k2J74j21N8O6K3j34N9J59N6k90L8N0r2K2
$$ -401 -555 -729 -729 -829 -808 -879 -660 -661 -652 -515 -599 -629 -739 -751 -810 -892 -914 -740 -861 -803 -737 -714 -848 -789 -630 -574 -864 -826 -776 -868 -846
4043h46P7r5J2M0l0pn7J04K58L2N7R8j08j8on8K8L7j6n7l8r3m3J1l0j2N1J31R3QQ5o4Kj17
$$ -846 -769 -864 -852 -812 -842 -849 -906 -802 -544 -512 -455 -357 -465 -483 -489 -547 -519 -482 -498 -555 -593 -686 -729 -718 -748 -760 -709 -578 -485 -477 -392 -456 -454 -571
4035e71k21j5n0J19Q7k7j09K7k6J1ML6l6n1k9K6J14l6L4K2q3J04j55k6l5M3N5L5Llo9J57Q0
$$ -571 -792 -807 -857 -738 -651 -678 -787 -760 -786 -775 -771 -735 -771 -822 -851 -825 -711 -747 -713 -691 -774 -670 -825 -851 -886 -843 -788 -753 -750 -753 -822 -665 -585
4028e85m4k2J46j46L1q6k4p7Q2L8O8j21Pj0kmj19N3J02P0j83RO9j28L2K8J1K3j1j3k8N7N9
$$ -585 -629 -651 -505 -651 -620 -706 -730 -807 -725 -687 -619 -740 -733 -743 -745 -749 -868 -815 -713 -643 -826 -817 -748 -876 -844 -816 -805 -782 -793 -806 -834 -777 -718
4020g18L9m4J20j61p5q6P9K4n5J23L8p8P2L3N9q7qm5J8p7N5o1k7J5Q2j1j4l7Q7N1p3M0r4J86
$$ -718 -679 -723 -603 -764 -839 -925 -846 -822 -877 -754 -716 -794 -722 -689 -630 -717 -725 -770 -752 -829 -774 -835 -862 -847 -765 -776 -790 -827 -740 -689 -762 -722 -816 -630
4012f30j43n6M8K7l7J4J14j13p4O6p7pk4O4Q0J5Q6j00K1l5j32R3R9m1o6J37j00om8N0R1J82
$$ -630 -773 -829 -781 -754 -791 -777 -663 -776 -850 -784 -861 -868 -892 -828 -748 -733 -647 -747 -726 -761 -893 -800 -701 -742 -808 -671 -771 -777 -825 -775 -684 -502
4005e02K96J56o8l8k46k76n2j49M9N3n4J70j31L6l7J8J59j11Kr7J08m7o6k8J39k9o1l1k6N8
$$ -502 -206 -50 -118 -156 -402 -678 -730 -879 -830 -777 -831 -661 -792 -756 -793 -775 -616 -727 -725 -822 -714 -761 -827 -855 -716 -745 -806 -837 -863 -805
3998h05j2K8jK1mJ06L5m8j18N3p1J28j03j0N5N4j44l5NP4K3pJ5l3j0J2j2LL8o0J52j17j4k3
$$ -805 -817 -789 -790 -769 -773 -667 -632 -680 -798 -745 -816 -688 -791 -801 -746 -692 -836 -871 -866 -792 -769 -776 -761 -794 -804 -792 -804 -801 -763 -823 -671 -788 -802 -825
3990h25Q4P5j12mj04J13P7j23Mm6J02j01J65J03j57P4r1kJ42Kj42J4N8m5J52l5j8j59k7P8
$$ -825 -741 -666 -778 -782 -886 -773 -696 -819 -815 -861 -759 -860 -695 -592 -749 -675 -766 -768 -626 -624 -766 -752 -694 -739 -587 -622 -640 -799 -826 -748
3984g48k4K10j72OR4M3N6q8r1l5QL5l3q0L9M5n4n8J36j9jL8l8N0l4kl4R2P5O8J06l9k9J63
$$ -748 -772 -562 -734 -728 -634 -591 -535 -623 -714 -749 -741 -706 -739 -819 -780 -735 -789 -847 -711 -730 -731 -693 -731 -681 -715 -717 -751 -659 -584 -516 -410 -449 -478 -315
3976c15K53R98R77R01R0k33r6j054j086o52n9k17n3N3q1J11r5J4q5J47p8L0J23J7p4R7J88
$$ -315 -62 936 1913 2814 2904 2671 2575 1521 435 -217 -276 -493 -546 -493 -574 -463 -558 -544 -629 -482 -560 -530 -407 -390 -464 -367 -179
3970a79J61J48J59j1L34L92O24R88K428P740J4896J2528M413j0441k1392p745k420j171o53
$$ -179 -18 130 289 278 612 1004 1628 2616 5044 12784 27680 40208 44621 34180 12788 5043 2623 1452 799
3965G99m67k68j60Q5j32k03k6j16%N8L0l9j46n5r7J08m1p6N9j42Q8R1j2J11j95l9O0k6M6p3
$$ 799 332 64 -96 -11 -143 -346 -372 -488 -488 -430 -400 -439 -585 -640 -737 -629 -670 -746 -687 -829 -741 -650 -662 -551 -746 -785 -725 -751 -705 -778
3958g78O0p9K9m8Q9R2J19j04Jk0m2q6O9j36Pl9j6J67k7L8k36J22R4Q8k6r3P1j06Q3Q0j50n7
$$ -778 -718 -797 -768 -816 -727 -635 -516 -620 -619 -639 -681 -767 -698 -834 -827 -866 -882 -715 -742 -704 -940 -818 -724 -636 -662 -755 -684 -790 -707 -627 -777 -834
3951h34O9R4k2MQ6P2j55J21q4q8k3k6m7K7O2m0QK2M4r3j9J16o1m0k7P6J9J3q3J54pJ4p2p%
$$ -834 -765 -671 -693 -689 -603 -531 -686 -565 -649 -737 -760 -786 -833 -806 -744 -784 -776 -754 -710 -803 -822 -706 -767 -807 -834 -758 -739 -726 -809 -655 -662 -648 -720 -727 -727
3943g27l6K6n4J59M76L66K64j48o08k63j28n6k1l3j8J03q2J7J05j05j11mK13o9p0J33M9l3
$$ -727 -763 -737 -791 -632 -156 210 474 326 -282 -545 -673 -729 -750 -783 -801 -698 -780 -763 -658 -763 -874 -878 -665 -734 -804 -671 -622 -655
3937f55o4l9k6j5n4p4J78L3p7O7n6K0r5o2J40l5K5j24Q2m0R3q6M8Q1j4j37P1J34qr9J9l2L7
$$ -655 -719 -758 -784 -799 -853 -927 -749 -716 -793 -726 -782 -762 -857 -919 -779 -814 -789 -913 -831 -871 -778 -864 -816 -735 -749 -886 -815 -681 -689 -788 -769 -801 -764
3929g64mP3N0j09KnnJ4n4JN4p5J22P0l0k8p8J7L4K9j3m7o7O5N6j15J44r0j4m8L2N2N7p0p6
$$ -764 -768 -695 -645 -754 -752 -757 -762 -748 -802 -801 -747 -822 -700 -630 -660 -688 -766 -749 -715 -686 -699 -746 -813 -748 -692 -807 -663 -753 -767 -815 -783 -731 -674 -744 -820
3921h20M2n4J9P8m3j5J84p3r2K7lk3k9o7J55J3k04L6O9L5R3j57K5j42J76J25p9j51L4j04J26
$$ -820 -778 -832 -813 -735 -778 -793 -609 -682 -774 -747 -750 -773 -802 -869 -714 -701 -905 -869 -800 -765 -672 -829 -804 -946 -770 -645 -724 -875 -841 -945 -819
3914h19n2J4R3M1r4R0J2o2p7p5Q3rp2J25M2p9N3j02oJ06j0qO3J6o2j53K33j30O7M8n6n3j8
$$ -819 -871 -857 -764 -723 -817 -727 -715 -777 -854 -929 -846 -855 -927 -802 -760 -839 -786 -888 -894 -788 -798 -806 -743 -727 -789 -942 -709 -839 -772 -724 -780 -833 -851
3907h51O5Q8j15r8Q5o4J25k6P4n8k0K6L1L4p6n1J55k16K4N8L8R6j22j39K35j0j22j9L1N0N5
$$ -851 -786 -698 -813 -911 -826 -890 -765 -791 -717 -775 -795 -769 -738 -704 -780 -831 -676 -892 -868 -810 -772 -676 -798 -937 -702 -712 -834 -853 -822 -772 -717
3899g17J9m1N1mqn3K6k8Pj9PM3n4j8M9o7L0m1j9Q7p9k8J23Kj46K4k5J72o1r3o2k8J88J1J6
$$ -717 -698 -739 -688 -692 -700 -753 -727 -755 -748 -767 -760 -717 -771 -789 -740 -807 -777 -818 -837 -750 -829 -857 -734 -732 -878 -854 -879 -707 -768 -861 -923 -951 -763 -752 -736
3891g36n2nk8pM3Q0o0pj04l1J84p5J4q1M3m2M1Mk7R4p6O9q2P4q1m6P0o5O2L5j16J02o7M5P
$$ -736 -788 -793 -821 -828 -785 -705 -765 -772 -876 -907 -723 -798 -784 -865 -822 -864 -823 -819 -846 -752 -828 -759 -841 -767 -848 -894 -824 -889 -827 -792 -908 -806 -873 -828 -821
3883h21k9J6mrM3QmJ1j9j05J29J11qN8r1Kr8l5N0R4j55N0J29r0NJ45P1o6J17j9r0n3P1o3o1
$$ -821 -850 -834 -838 -847 -804 -796 -800 -789 -808 -913 -784 -673 -681 -623 -714 -712 -810 -845 -795 -701 -856 -806 -677 -767 -762 -617 -546 -612 -495 -514 -604 -657 -586 -649 -710
3875g10Qm1K5n2JN2q7j0P7K5m9j15Q0K0M6M5rj7lj04j5M9jJ37k6j68k8P9j1j12R2N7L4oQ1
$$ -710 -702 -743 -718 -770 -769 -717 -804 -814 -737 -712 -761 -876 -796 -776 -730 -685 -694 -711 -714 -818 -833 -784 -785 -648 -674 -842 -870 -791 -802 -914 -822 -765 -731 -737 -656
3867f56P2j54P0n1l2j4q2J8M9nm0K3j22L7O3J64J8M0j99M2lj15n4J42K2P2j42lJ16m0P4j59
$$ -656 -584 -738 -668 -719 -751 -765 -847 -829 -780 -785 -825 -802 -924 -887 -824 -660 -642 -602 -801 -759 -762 -877 -931 -789 -767 -695 -837 -840 -724 -764 -690 -849
3860h49n4J22l3o6J01K22j22lp7p3j3J18o6J20k5L7M0j65k8K5R1k3j9j7k7O0K7k66l8J89m5
$$ -849 -903 -781 -814 -880 -779 -557 -679 -682 -759 -832 -845 -727 -793 -673 -698 -661 -621 -786 -814 -789 -698 -721 -740 -757 -784 -724 -697 -963 -1001 -812 -857
3853h57K2J36N2m4r7n9J10P0j03l5q2R6O3n7K7q3Q9q3m6kK9J02j8K0m9Q7j10%J24kj4J1o0
$$ -857 -835 -699 -647 -691 -788 -847 -737 -667 -770 -805 -887 -791 -728 -785 -758 -841 -752 -835 -881 -883 -854 -752 -770 -750 -799 -712 -822 -822 -698 -700 -714 -703 -763
3846g63j10%K5L7o1OO6L3LK1M8j1PQ5p5n3n3o2J49n2O4n2n0o2J12q0J29m7l2N0j35L3M4j18
$$ -763 -873 -873 -848 -811 -872 -866 -800 -767 -764 -743 -695 -706 -699 -614 -689 -742 -795 -857 -708 -760 -696 -748 -798 -860 -748 -828 -699 -746 -778 -728 -863 -830 -786 -904
3838i04Q3M6p5J19nj7n7J7M5o7M1J29mk08J02J5Lr5N5K4M8k2O9q9r0jJ24l7J3j11jN6pJ05
$$ -904 -821 -775 -850 -731 -736 -753 -810 -793 -748 -815 -774 -645 -649 -857 -755 -740 -737 -832 -777 -753 -705 -727 -658 -747 -837 -838 -714 -751 -738 -849 -850 -794 -801 -696
3830f96Mn6K2M9j40K9K8R7l2j38N7n3J20lj22O0j5p2M5l5o7J04nJ5M5r8J11o6j6M0J2K2qJ32
$$ -696 -692 -748 -726 -677 -817 -788 -760 -663 -695 -833 -776 -829 -709 -712 -834 -774 -789 -861 -816 -851 -918 -814 -819 -804 -759 -857 -746 -812 -828 -788 -776 -754 -762 -630
3822f30j43JK7k5r9j36R1P9l6K0L0k3J11O1j44o0Q8nK1O0k1K5j13L8K1Mj35L9o1J16N1K03
$$ -630 -773 -772 -745 -770 -869 -1005 -914 -835 -871 -851 -821 -844 -733 -672 -816 -876 -788 -793 -772 -712 -733 -708 -821 -783 -762 -758 -893 -854 -915 -799 -748 -545
3815e45r3k04j29J20L7J11R3Ok05L7K7L7J9l0p4N7p7P7P5k3j38o2M4O7l6l2R7n6Q2K2N3m1
$$ -545 -638 -842 -971 -851 -814 -703 -610 -604 -809 -772 -745 -708 -689 -719 -793 -736 -813 -736 -661 -684 -822 -884 -840 -773 -809 -841 -744 -800 -718 -696 -643 -684
3808f84n3L6p3Ll4m0R3R2n1K0n3M6j1l4r5oL0j2l1M4K05j42j37J02mOJ7J8N7p5j29J5nn0O5
$$ -684 -737 -701 -774 -771 -805 -845 -752 -660 -711 -691 -744 -698 -709 -743 -838 -844 -814 -826 -857 -813 -608 -750 -887 -785 -789 -783 -766 -748 -691 -766 -895 -880 -885 -935 -870
3800h70R5k7O5J09j21j4j97J33j4K5P0J12J97j85j75k2J40r0l4j10QJ00oM8O4r5L7j1l1R7
$$ -870 -775 -802 -737 -628 -749 -763 -960 -827 -841 -816 -746 -634 -437 -622 -797 -819 -679 -769 -803 -913 -905 -805 -811 -763 -699 -794 -757 -768 -799 -702
3793g02k5o8M4O9l1L3P8j21j1m0j20J99n1r0m5P9o6j9J34Kj9l9l1Q4k8n2J12j32K01j19j3
$$ -702 -727 -795 -751 -682 -713 -680 -602 -723 -734 -774 -894 -695 -746 -836 -881 -802 -868 -887 -753 -751 -770 -809 -840 -756 -784 -836 -724 -856 -655 -774 -787
3786g87P2n7j3O3K8m9On4n2J41j87J15K7N0%n6O9k7m6O2K7M2l8j65J02q2P6J35o7q7N3j13
$$ -787 -715 -772 -785 -722 -694 -743 -737 -791 -843 -702 -889 -774 -747 -697 -697 -753 -684 -711 -757 -695 -668 -626 -664 -829 -727 -809 -733 -598 -665 -752 -699 -812
3778h12j7P3P8l1J8j05j4j06J09K7P1m7JN8P5j39m6J6K0J37j0j20l6q7J46Q8O2j41k6n6pO1
$$ -812 -829 -756 -678 -709 -691 -796 -810 -916 -807 -780 -709 -756 -755 -697 -622 -761 -807 -791 -771 -634 -644 -764 -800 -887 -741 -653 -591 -732 -758 -814 -821 -760
3771g60L3q9rN4k8K1j66O1J03O2j05O3N5k0n6j3m5NJ35o6P5k20J29l4l7J36k2j41J9J6L2K1
$$ -760 -727 -816 -825 -771 -799 -778 -944 -883 -780 -718 -823 -760 -705 -725 -781 -794 -839 -834 -699 -765 -690 -910 -781 -815 -852 -716 -738 -879 -860 -844 -812 -791
3764g91O2P0o2m5o9R0m0J33q2RJ8j54P9J59j14K5mo7Q1N8p8q4j2O8Nk0n1M5P2j14M4p1J44
$$ -791 -729 -659 -721 -766 -835 -745 -785 -652 -734 -725 -707 -861 -782 -623 -737 -712 -716 -783 -702 -644 -722 -806 -818 -750 -745 -765 -816 -771 -699 -813 -769 -840 -696
3756f96k9j24n4M6N3Q6j00J12n1m6k3m7J25Nk0j23J03J48j17RJ19o0n5j5OM8j16R6k1J6j4
$$ -696 -725 -849 -903 -857 -804 -718 -818 -706 -757 -803 -826 -873 -748 -743 -763 -886 -783 -635 -752 -743 -624 -684 -739 -754 -748 -700 -816 -720 -741 -725 -739
3749g39o2J47j11p5jR2L1j22j4P0n0K8k01L02n3k7O0k40J30R3j09jp6n3J16m6qPJ38j08OJ76
$$ -739 -801 -654 -765 -840 -841 -749 -718 -840 -854 -784 -834 -806 -1007 -705 -758 -785 -725 -965 -835 -742 -851 -852 -928 -981 -865 -911 -919 -912 -774 -882 -876 -700
3742g00p5jL4j3M1J0p6mj5N5%r8J9L1K4N3Q7j04j37M9R6Q5M1j09j47K0J18j5M4j50J66q8o1
$$ -700 -775 -776 -742 -755 -714 -704 -780 -784 -799 -744 -744 -842 -823 -792 -768 -715 -628 -732 -869 -820 -724 -639 -598 -707 -854 -834 -716 -731 -687 -837 -671 -759 -820
3734h20n4J52J13o1o8l3k3j4J02l3R9m2K1m2QM2k0l8j18Q7K3o3K4P5j21j5j31O4J22j58j0
$$ -820 -874 -722 -609 -670 -738 -771 -794 -808 -706 -739 -640 -682 -661 -703 -695 -653 -673 -711 -829 -742 -719 -782 -758 -683 -804 -819 -950 -886 -764 -922 -932
3727i32K2J50J9k0J4RoK0q7Jm9Q3J12N4Op3Pk0J1J13j45k3p9J26j04NQ7J16p0k1l0R8k7k5
$$ -932 -910 -760 -741 -761 -747 -738 -744 -724 -811 -810 -859 -776 -664 -610 -604 -677 -670 -690 -679 -566 -711 -734 -813 -687 -791 -786 -699 -583 -653 -674 -704 -606 -633 -658
3719f58r4o2M5p0R8O1j53R6J33j09l6o8p0N5P1m9L0p0R6M4J0q7nk0J24o0r9N2P5j11l4K4J11
$$ -658 -752 -814 -769 -839 -741 -680 -833 -737 -604 -713 -749 -817 -887 -832 -761 -810 -780 -850 -754 -710 -700 -787 -792 -812 -688 -748 -847 -795 -720 -831 -865 -841 -730
3712g30J41K1j76mp8J01N6j42J56j4r3R2q1Pj6k3om4m5O5N0K5m2On9m7J21J7N4j39O4M2J30
$$ -730 -589 -568 -744 -748 -826 -725 -669 -811 -655 -669 -762 -670 -751 -744 -760 -783 -789 -833 -878 -813 -763 -738 -780 -774 -833 -880 -759 -742 -688 -827 -763 -721 -591
3704e91k12L6p7J7o0K4O6O1R4j5l2k0r4P5j04J7o4L9J71Q6k6j31m4P6r9q1p1J09J24O5q5N5
$$ -591 -803 -767 -844 -827 -887 -863 -797 -736 -642 -657 -689 -709 -803 -728 -832 -815 -879 -840 -669 -583 -609 -740 -784 -708 -807 -888 -959 -850 -726 -661 -746 -691
3697f91j02J9j16J39J2j14j02J44M7O5n6N7j20Q4r0J13j8l7m0O7P3k4n1o4J2L1oQ5j13JK9
$$ -691 -793 -774 -890 -751 -739 -853 -955 -811 -764 -699 -755 -698 -818 -734 -824 -711 -729 -766 -806 -739 -666 -690 -741 -805 -793 -762 -768 -683 -796 -795 -766
3690g66P0l8jK0l3q3M3m7J6P7O3n3o4R9on3O9mJ8p3j08P0Q5qk8j02n0J1Oj0J05o1j3J33r5
$$ -766 -696 -734 -735 -715 -748 -831 -788 -835 -819 -742 -679 -732 -796 -697 -703 -756 -687 -691 -673 -746 -854 -784 -699 -707 -735 -837 -887 -876 -870 -880 -775 -836 -849 -716 -811
3682h11N7O2qQJ2r8J04K4j00k0L6J4j79l4L9M8R2qL3r3Q3P5j30O2J06q2q0q4M1J03k3K2oM3
$$ -811 -754 -692 -700 -692 -680 -778 -674 -650 -750 -770 -734 -720 -899 -933 -894 -846 -754 -762 -729 -822 -739 -664 -794 -732 -626 -708 -788 -872 -831 -728 -751 -729 -735 -692
3674f92j59p7J05J03j08L9n6PL5J35l7j50J58p2J16p3n2N5p9l0L5O5p2K4j8j9j5K59k33J25
$$ -692 -851 -928 -823 -720 -828 -789 -845 -838 -803 -668 -705 -855 -697 -769 -653 -726 -778 -723 -802 -832 -797 -732 -804 -780 -798 -817 -832 -573 -806 -681
3667f81M6j13L1k8J45j33N1q7J2j12o2N2J13m9L3p4J33p2n8k2J53J16p3p4o0lO2J13Qm9m8
$$ -681 -635 -748 -717 -745 -600 -733 -682 -769 -757 -869 -931 -879 -766 -815 -782 -856 -723 -795 -853 -875 -722 -606 -679 -753 -813 -816 -754 -641 -633 -682 -730
3660g30j1K2p2N4M1O3j1k6K1k2J03N0j42j0m2j0m7oJ10o5r8k8Q8j02J36q0j2M2N3Mo7J23l2
$$ -730 -741 -719 -791 -737 -696 -633 -644 -670 -649 -671 -568 -518 -660 -670 -712 -722 -769 -775 -665 -730 -828 -856 -768 -870 -734 -814 -826 -784 -731 -727 -794 -671 -703
3652g03rKn4k5kO2j1K8p9o6K1J06J24n8p9L6n0J6J58o7ll5j13j26k0Q9l3J36L2J44q2jj02
$$ -703 -712 -710 -764 -789 -791 -729 -740 -712 -791 -857 -836 -730 -606 -664 -743 -707 -757 -741 -583 -650 -653 -688 -801 -927 -947 -858 -891 -755 -723 -579 -661 -662 -764
3645g64NQ1o0O1J20m1j05Q2j67J0M5O9p6m2O8m9r9Q7j24K0J39o5J05q2O3P8P7k59nJ53q2n7
$$ -764 -759 -678 -738 -677 -557 -598 -703 -621 -788 -778 -733 -664 -740 -782 -714 -763 -862 -775 -899 -879 -740 -805 -700 -782 -719 -641 -564 -823 -828 -675 -757 -814
3638h14Q4k2no9O5k4J1j05N1n3R6N1j29Qo3Q7J5O1L0m5KK4kJ42Jj38p4M1r5J13l7Q3n1n8K3
$$ -814 -730 -752 -757 -826 -761 -785 -774 -879 -828 -881 -785 -734 -863 -855 -918 -831 -816 -755 -725 -770 -768 -744 -746 -604 -603 -741 -815 -774 -869 -756 -793 -710 -761 -819 -796
3630g96l4n2O8J3J08p3J5l5K5QO0m9j46k0J76p4oJ88o3q1nP6m8m7nJ29p4J10Rp3j41j4J44
$$ -796 -830 -882 -814 -801 -693 -766 -751 -786 -761 -753 -693 -742 -888 -908 -732 -806 -812 -624 -687 -768 -773 -697 -745 -792 -797 -668 -742 -632 -623 -696 -837 -851 -707
3622g07j01m9K0M6P1j3R7J6j50%J5r8P4R7%J2o8r6l7Q3O0J3j16J00N0rr3r5O9R2J4J7j07Q6
$$ -707 -808 -857 -837 -791 -720 -733 -636 -620 -770 -770 -755 -853 -779 -682 -682 -670 -738 -834 -871 -788 -728 -715 -831 -731 -681 -690 -783 -878 -809 -717 -703 -686 -793 -707
3614g07j9o4L2qJ48j42O5O9k5o7k8kK1L2j8j05J34jJ8l4m6ppR3o6l0l4O0j5K2j2r6K0J32N9
$$ -707 -726 -790 -758 -766 -618 -760 -695 -626 -651 -718 -746 -748 -727 -695 -713 -818 -684 -685 -667 -701 -747 -754 -761 -668 -734 -764 -798 -738 -753 -731 -743 -839 -819 -687 -628
3606f28n4o6J3l8k0P8oj20P9m7Ll6J07m7k1L2M4k0j68P5qP5k3j4mL4rJ5K3K9K0l4QR8r1L5
$$ -628 -682 -748 -735 -773 -793 -715 -721 -841 -762 -809 -806 -842 -735 -782 -803 -771 -727 -747 -915 -840 -848 -773 -796 -810 -814 -780 -789 -774 -751 -722 -702 -736 -728 -630 -721 -686
3598f86q2P7L8r5j04K1J06jk2n3L0O9m9K4o1J53J1j6q0om2M8p1J08k9l9J70j50o9o1J00Q7
$$ -686 -768 -691 -653 -748 -852 -831 -725 -726 -748 -801 -771 -702 -751 -727 -788 -635 -624 -640 -720 -726 -768 -720 -791 -683 -712 -751 -581 -731 -800 -861 -761 -674
3591f74k8p9m6J83J11j70j10K0j20R0r0J76O2rl8Ln2MJ6J53q3k3m5j2mN7m1p8M5l3m1J37j9
$$ -674 -702 -781 -827 -644 -533 -703 -813 -793 -913 -823 -913 -737 -675 -684 -722 -719 -771 -767 -751 -598 -681 -704 -749 -761 -765 -708 -749 -827 -782 -815 -856 -719 -738
3583g38j20P3r8K4O5JOk8j6j00J52n7N8R7L4j7k7k9m5j0M9j4K1O2n1l4l2n1Q5o9NL8Q3j2p6
$$ -738 -858 -785 -883 -859 -794 -793 -787 -815 -831 -931 -779 -836 -778 -681 -647 -664 -691 -720 -765 -775 -726 -740 -719 -657 -708 -742 -774 -825 -740 -809 -804 -766 -683 -695 -771
3575g71J5o3J7K6j14L6N5J1P6n1qo0Q6o3%J11p8K1Q3m9k9N0m2N6K3n4J4R5or0p1Rn7p7K12
$$ -771 -756 -819 -802 -776 -890 -854 -799 -788 -712 -763 -771 -831 -745 -808 -808 -697 -775 -754 -671 -720 -749 -699 -741 -685 -662 -716 -702 -607 -613 -703 -774 -765 -822 -899 -687
3567f87J2J2j64R8p0k0K6J5P9L4n6r4k1O1N0N5j2r8n7P8J3m2k0O7M5o8K7k1mJ3Q8J1J21o8
$$ -687 -675 -663 -827 -729 -799 -819 -793 -778 -699 -665 -721 -815 -836 -775 -725 -670 -682 -780 -837 -759 -746 -788 -808 -741 -696 -764 -737 -758 -762 -749 -661 -650 -529 -597
3559e97ln7j72J43q6P9p1PN4P6j61j8P4L7P8n6j35J16jk9j5m5M7J41q3o7O5j06n4K9j2JJ4
$$ -597 -600 -657 -829 -686 -772 -693 -764 -757 -703 -627 -788 -806 -732 -695 -617 -673 -808 -692 -693 -722 -737 -782 -735 -594 -677 -744 -679 -785 -839 -810 -822 -821 -807
3552h07K3kq6J29MK8o1M3j69mQ2O3%Q5o9L0j00M8J0n3o7N2m7K2J8n4Q3M5O3n3km0P1n0m2K4
$$ -807 -784 -786 -872 -743 -739 -711 -772 -729 -898 -902 -820 -757 -757 -672 -741 -711 -811 -763 -753 -806 -873 -821 -868 -846 -828 -882 -799 -754 -691 -744 -746 -786 -715 -765 -807 -783
3544g83N8k8l5%k2P2m9j8M3m0N2J5Kk33L4J49p5J03j9n7k2J07R3j32L3j3K8P2q6Q8n4k11O5
$$ -783 -725 -753 -788 -788 -810 -738 -787 -805 -762 -802 -750 -735 -733 -966 -932 -783 -858 -755 -774 -831 -853 -746 -653 -785 -752 -765 -737 -665 -751 -663 -717 -928 -863
3536h63pJ2j9RJ34P0L1j51n7J09N5n4p9K32j39r5o2O2n8R7l4N7M0N6o9Q3j73k7l9K3mJ06o1
$$ -863 -870 -858 -877 -868 -734 -664 -633 -784 -841 -732 -677 -731 -810 -578 -717 -812 -874 -812 -870 -773 -807 -750 -710 -654 -723 -640 -813 -840 -879 -856 -860 -754 -815
3529h15OO2k9R3j23J0J57l1p5Q4j36Nm9LK2OJ47j41k5m4J13o6P8J7J2j61K08N7q3o7J27km7
$$ -815 -809 -747 -776 -683 -806 -796 -639 -670 -745 -661 -797 -792 -841 -838 -816 -810 -663 -804 -829 -873 -760 -826 -748 -731 -719 -880 -672 -615 -698 -765 -638 -640 -687
3521f87K7j13JN9nQ9j34J4oOJ29j38j06j2J31K6p6J06Q4l2p6Q4J8j69kj05J03J29q8o7L5N2
$$ -687 -660 -773 -772 -713 -718 -629 -763 -749 -755 -749 -620 -758 -864 -876 -745 -719 -795 -689 -605 -637 -713 -629 -611 -780 -782 -887 -784 -655 -743 -810 -775 -723
3514g23o2kkJ23j27L3l5k1NN4Q0P4k8j40l1J56j71O5m0L5k0rmO8p7LK6N0qK7J18r6k6Pj30
$$ -723 -785 -787 -789 -666 -793 -760 -795 -816 -811 -757 -677 -603 -631 -771 -802 -646 -817 -752 -792 -757 -777 -786 -790 -722 -799 -796 -770 -720 -728 -701 -583 -679 -705 -698 -828
3506h28K8NM2O2q8n5J32j0k8J8m1N2K2j6j1l5N3j0J06m9m4j6L6%m4L1O1k16n2n2J78j17m0
$$ -828 -800 -795 -753 -691 -779 -834 -702 -712 -740 -722 -763 -711 -689 -705 -716 -751 -698 -708 -602 -651 -695 -711 -675 -675 -719 -688 -627 -843 -895 -947 -769 -886 -926
3498i26kJ63k8mo0M9L9J50K9q9j3p3L8mj3l1KM0k1q0QL8L1l0o7R5K0J06m1o7j0n1L1nR1j24
$$ -926 -928 -765 -793 -797 -857 -808 -769 -619 -590 -679 -692 -765 -727 -731 -744 -775 -773 -733 -754 -834 -826 -788 -757 -787 -854 -759 -739 -633 -674 -741 -751 -802 -771 -776 -685 -809
3490h09p6N2Q6p8j0lr6J30J49M3m4r0q3J52j01J7J6L1M2j01J35n8m0mn8kP5j4L3l1j6O6k2
$$ -809 -885 -833 -747 -825 -835 -838 -934 -804 -655 -612 -656 -746 -829 -677 -778 -761 -745 -714 -672 -773 -638 -696 -736 -740 -798 -800 -725 -739 -706 -737 -753 -687 -709
3482g09K2k7j7nK6m1r5J07J20n6j1L5k5j51M8q3K54O1j88J04L1p7j02N3N0Kr3N3j04Qk4J7
$$ -709 -687 -714 -731 -736 -710 -751 -846 -739 -619 -675 -686 -651 -676 -827 -779 -862 -608 -547 -735 -631 -600 -677 -779 -726 -676 -674 -767 -714 -818 -810 -834 -817
3475h17Q0M9l0K2M2j16oj54J62m7N7k5p4r8J59Rj04J93j49L2k2M1J43q5m2K3n1J15r0M8j5
$$ -817 -737 -688 -718 -696 -654 -770 -776 -930 -768 -815 -758 -783 -857 -955 -796 -787 -891 -698 -847 -815 -837 -796 -653 -738 -780 -757 -808 -693 -783 -735 -750
3468g50k9N0j4P8K02r0k23J9Nj4j0j34Q7k7K8k6R6M5l8K1J1j07M6k9P2rQr5O5J32n0l1N1R0
$$ -750 -779 -729 -743 -665 -463 -553 -776 -757 -752 -766 -776 -910 -823 -850 -822 -848 -752 -707 -745 -724 -713 -820 -774 -803 -731 -740 -732 -827 -762 -630 -680 -711 -660 -570
3460e70j18J4o2r6o0m0J13mp5n3J93J61j26J2Kl4l4J16M0j14j47l2l9J75O0L5j76L0M3%K9
$$ -570 -688 -674 -736 -832 -892 -932 -819 -823 -898 -951 -758 -597 -723 -711 -709 -743 -777 -661 -621 -735 -882 -914 -953 -778 -718 -683 -859 -829 -786 -786 -757
3453g57m9M6j6M4n7P1J1l3L0OOJ09j08J2l3j5l4KN9o1N5m2j38mQ4J7n8N4o2K00J7p5j35J40
$$ -757 -806 -760 -776 -732 -789 -718 -707 -740 -710 -704 -698 -589 -697 -685 -718 -733 -767 -765 -706 -767 -712 -754 -892 -896 -812 -795 -853 -799 -861 -661 -644 -719 -854 -714
3445g14Q0lj3l6j59L1P5o0J31J28r0j71j41J38k2P4O3r0o2Q0m8P5q6J28L4r5k6j02J32o6r8
$$ -714 -634 -637 -650 -686 -845 -814 -739 -799 -668 -540 -630 -801 -942 -804 -826 -752 -689 -779 -841 -761 -809 -734 -820 -692 -658 -753 -779 -881 -749 -815 -913
3438i13M5K4k4P6qj5o5P2q4N0J11j36J13L3n7k1P4j7j32P3RO2n2J6p2n2K19n0k0J4l6L4kj14
$$ -913 -868 -844 -868 -792 -800 -815 -880 -808 -892 -842 -731 -867 -754 -721 -778 -799 -725 -742 -874 -801 -792 -730 -782 -766 -838 -890 -671 -721 -741 -727 -763 -729 -731 -845
3430h45J02m0o0JpJ32Jj23m2J51q9k5M3Ql5P1m4m1P8l7j06k6J98J00K9j78J17j39j0J3J00
$$ -845 -743 -783 -843 -842 -849 -717 -716 -839 -881 -730 -819 -844 -801 -793 -828 -757 -801 -842 -764 -801 -907 -933 -735 -635 -606 -784 -667 -806 -816 -803 -703
3423g03r7j6k8LK9k1P0P3o9KO3j04N0K4l5k4O5O5j37M0K7p9k7J6K8Q6L3o3j04O0J7m8jl5O7
$$ -703 -800 -816 -844 -841 -812 -833 -763 -690 -759 -757 -694 -798 -748 -724 -759 -783 -718 -653 -790 -750 -723 -802 -829 -813 -785 -699 -666 -729 -833 -773 -756 -804 -805 -840 -773
3415g73m2R0j0Mm2l2k1r6Q4J32j17O7M3j4lJ9K4l5m3q3K8L7k3P1J48o0j28m5P2p3R4j72L6
$$ -773 -815 -725 -735 -731 -773 -805 -826 -922 -838 -706 -823 -756 -713 -727 -730 -711 -687 -722 -765 -848 -820 -783 -806 -735 -587 -647 -775 -820 -748 -821 -727 -899 -863
3408h63Q8R0j67k9J32O3qk7j7n4J08j7j37Q0Q0m6j06N9K7o5P0K2j09R9k6n9O9K1L6l8M8j52
$$ -863 -775 -685 -852 -881 -749 -686 -694 -721 -738 -792 -684 -701 -838 -758 -678 -724 -830 -771 -744 -809 -739 -717 -826 -727 -753 -812 -743 -722 -686 -724 -676 -828
3400h28P1P6M9j14M9j61J4j5m8K2J30N8n8O5L0j32K7KJ12M4p1J7j32K6J24k28K8j9P8N6j8
$$ -828 -757 -681 -632 -746 -697 -858 -844 -859 -907 -885 -755 -697 -755 -690 -660 -792 -765 -763 -651 -607 -678 -661 -793 -767 -643 -871 -843 -862 -784 -728 -746
3393g46K5l7PM0n3Qn2r5Q8M9L0M0j15q3L5M5O5p0J3j30Q7j1L2J6R2mm7n1L6J7q7N2m6K5M9
$$ -746 -721 -758 -751 -711 -764 -756 -808 -903 -815 -766 -736 -696 -811 -894 -859 -814 -749 -819 -806 -936 -849 -860 -828 -812 -720 -724 -771 -822 -786 -769 -856 -804 -850 -825 -776
3385g76j9J5L9r5j85J55j4O0k7j8O3l1j2Q9O0j79K05j28n9P9j17m1Q0M0R5R5j99r5O4R8%n8
$$ -776 -795 -780 -741 -836 -1021 -866 -880 -820 -847 -865 -802 -833 -845 -756 -696 -875 -670 -798 -857 -778 -895 -936 -856 -816 -721 -626 -825 -920 -856 -758 -758 -816
3378h16m0J12m2q3K4QK07L1m9j71J72o2m6J39j6Jl5J42j91l4p2n5J07N8j46N5J41j46P5k1
$$ -816 -856 -744 -786 -869 -845 -837 -630 -599 -648 -819 -647 -709 -755 -616 -632 -631 -666 -524 -715 -749 -821 -876 -769 -711 -857 -802 -661 -807 -732 -753
3371g53l0J00m0O6J34j84Mp5m5J01k1p4N5P8o2m1J15j02n3K4P8J4o3R3l1k%nj4N4n4n8Q3O4
$$ -753 -783 -683 -723 -657 -523 -707 -703 -778 -823 -722 -743 -817 -762 -684 -746 -787 -672 -774 -827 -803 -725 -711 -774 -681 -712 -714 -714 -719 -733 -679 -733 -791 -708 -644
3363f44j2j06P5R5j24N0k3n0lp9R9J38r8J1l8N0l5k4J06p3o0k7J03l6p5m3Kl4N2j6Q0k8K5
$$ -644 -656 -762 -687 -592 -716 -666 -689 -739 -742 -821 -722 -584 -682 -671 -709 -659 -694 -718 -612 -685 -745 -772 -669 -705 -780 -823 -821 -855 -803 -819 -739 -767 -742
3356g42o2Q4P5m0j9q0L4k0r5N9M2Kk3m8L9n4J69j58j14R9J85j5J60K5j36k7j06m7J01N6J3
$$ -742 -804 -720 -645 -685 -704 -784 -750 -770 -865 -806 -764 -762 -785 -833 -794 -848 -679 -837 -951 -852 -667 -682 -522 -497 -633 -660 -766 -813 -712 -656 -643
3349f43j46l1j8M2J35r7N3Qj15R5Qo5o7n2J22L4j8J0q3j03Q0k4j3J39J30n6l9J7k7L8o1J01
$$ -643 -789 -820 -838 -796 -661 -758 -705 -697 -812 -717 -709 -774 -841 -893 -771 -737 -755 -745 -828 -931 -851 -875 -888 -749 -619 -675 -714 -697 -724 -686 -747 -646
3341f46k6onl3R8r1O5n4j38J04M9K2%o2N4p8M8p8m3J02K9o5Q5k5p3j3N3k9j9M4L5J5o0L9n7
$$ -646 -672 -678 -683 -716 -618 -709 -644 -698 -836 -732 -683 -661 -661 -723 -669 -747 -699 -777 -820 -718 -689 -754 -669 -694 -767 -780 -727 -756 -775 -731 -696 -681 -741 -702 -759
3333g59l1K3N1J1O7q3j2l1l9L9K7j31p7Q3ol6J49k5J5M1j7N4j33J3pk8J63p0q2N0J42j77N6
$$ -759 -790 -767 -716 -705 -638 -721 -733 -764 -803 -764 -737 -868 -945 -862 -868 -904 -755 -780 -765 -724 -741 -687 -820 -807 -814 -842 -679 -749 -831 -781 -639 -816 -760
3326g60%pN1Jj8L0j15NJ11j70M4M2mK54j8n5k48r2K13p4R1K3M4L9Lj2j22m3J12ln2j68O0L9
$$ -760 -760 -767 -716 -715 -733 -703 -818 -813 -702 -872 -828 -786 -790 -536 -554 -609 -857 -949 -736 -810 -719 -696 -652 -613 -610 -622 -744 -787 -675 -678 -730 -898 -838 -799
3318g99q9J31k3K5P7j95MmJ51r7J02p3N9N5j1N3r0j7O1J21j64oL7j86J19l2K6j28J11O2n0
$$ -799 -888 -757 -780 -755 -678 -873 -869 -873 -722 -819 -717 -790 -731 -676 -687 -634 -724 -741 -680 -559 -723 -729 -692 -878 -759 -791 -765 -893 -782 -720 -770
3311g70j09j0J5pQ4K1p4J30m5Q9Ql6j56O8K6o8K03k6pn8J8q9M2j9jJ36Nn4mL3j19k4L4L2n
$$ -770 -879 -889 -874 -881 -797 -776 -850 -720 -765 -676 -668 -704 -860 -792 -766 -834 -631 -657 -664 -722 -704 -793 -751 -770 -771 -635 -630 -684 -688 -655 -774 -798 -764 -732 -737
3303g37o9K5J66j08q2rK9M4J7Q7o4p6K6J2j5P1j05O6k9J22l3j1p4j01J16L9m8m7OlrQ5l2j34
$$ -737 -806 -781 -615 -723 -805 -814 -785 -741 -724 -637 -701 -777 -751 -739 -754 -683 -788 -722 -751 -629 -662 -673 -747 -848 -732 -693 -741 -788 -782 -785 -794 -709 -741 -875
3295h75R3P2j15J08KL6No3L3K0n6n3L0l7pPQ6o1P0m7N7K0n1m0L1oj05P6ok0j11O1P7mJ74j14
$$ -875 -782 -710 -825 -717 -715 -679 -674 -737 -704 -684 -740 -793 -763 -800 -807 -800 -714 -775 -705 -752 -695 -675 -726 -766 -735 -741 -846 -770 -776 -796 -907 -846 -769 -773 -599 -713
3287g13P1j95j5J49L5J2j1L4j1k4o3J9L8n1k7O0k05K45o1p3p1Q7K9m0P0Mr5O3r3K30k47Q2
$$ -713 -642 -837 -852 -703 -668 -656 -667 -633 -644 -668 -731 -712 -674 -725 -752 -692 -897 -652 -713 -786 -857 -770 -741 -781 -711 -707 -802 -739 -832 -602 -849 -767
3280g67R5o2l9m5N5J71j29m4n3L0M3K3m9N4m8o7J10P1j15P8q5Q6l1R0nk20l7J22M6R7j00k0
$$ -767 -672 -734 -773 -818 -763 -592 -721 -765 -818 -788 -745 -722 -771 -717 -765 -832 -722 -651 -766 -688 -773 -687 -718 -628 -633 -853 -890 -768 -722 -625 -725 -745
3272g45L1r5J07j99J08On5J09J5j26J4N8J7j2J20J6Rj18Nll0O9k9n2J31q4M1j55j14J00J10
$$ -745 -714 -809 -702 -901 -793 -787 -842 -733 -718 -844 -830 -772 -755 -767 -647 -631 -622 -740 -735 -738 -768 -699 -728 -780 -649 -733 -692 -847 -961 -861 -751
3265g51O2m6K5j9p9M4N1l9M4r1M0o1L6Oj4j9J49jP6j09PJ4K2q6j04O8R4j49N3j9K3K2r9J02
$$ -751 -689 -735 -710 -729 -808 -764 -713 -752 -708 -799 -759 -820 -784 -778 -792 -811 -662 -663 -587 -696 -689 -675 -653 -739 -843 -775 -681 -830 -777 -796 -773 -751 -850 -748
3258g48m9Q1K2R3j02M9l6J2J6j07M9J6J1kO6P3l3m9L2j77J52J0j04K1Nl4n5O1Rp9P7J9k2N3
$$ -748 -797 -716 -694 -601 -703 -654 -690 -678 -662 -769 -720 -704 -693 -695 -629 -556 -589 -638 -606 -783 -631 -621 -725 -704 -699 -733 -788 -727 -718 -797 -720 -701 -723 -670
3250f70k3K0n8J11Nj83J1J90l4Q5j36L5LJ7Q2k1k21J6J33K9j12nJ6mK4N6o6k1l5m9O0k0J62
$$ -670 -693 -673 -731 -620 -615 -798 -787 -597 -631 -546 -682 -647 -644 -627 -545 -566 -787 -771 -638 -609 -721 -726 -710 -714 -690 -634 -700 -721 -756 -805 -745 -765 -603
3242f03j09Q9j00Q7p0K6O7P3j9J5q6N0PL42K37m8k70j88j52l2mL4Pn0j1l1N7jJ3r3p2J87q4
$$ -603 -712 -623 -723 -636 -706 -680 -613 -540 -559 -544 -630 -580 -573 -231 6 -42 -312 -500 -652 -684 -688 -654 -647 -697 -708 -739 -682 -683 -670 -763 -835 -648 -732
3235g32n3kOQ7r5N0QJ1Q9L5l4o7N3q3j9N6O6j17n9N4J09nm3m0J98q2j01N3p3n5R8N3j87J7
$$ -732 -785 -787 -781 -694 -789 -739 -731 -720 -631 -596 -630 -697 -644 -727 -746 -690 -624 -741 -800 -746 -637 -642 -685 -725 -527 -609 -710 -657 -730 -785 -687 -634 -821 -804
3227h04O5K5M8K7ok0q5J13m5O7j33O7l3m5J02l1QJ62q1n3n5o5J42p2o7J0O3m5J33m8n1q4N6
$$ -804 -739 -714 -666 -639 -645 -665 -750 -637 -682 -615 -748 -681 -714 -759 -657 -688 -680 -518 -599 -652 -707 -772 -630 -702 -769 -759 -696 -741 -608 -656 -707 -791 -735
3219g35L7J18o6q6M9N8k5j76O0J17o4j33J00J44m8j3j00J03j50p3N8J53j04K4J07j2m5j3l2
$$ -735 -698 -580 -646 -732 -683 -625 -650 -826 -766 -649 -713 -846 -746 -602 -650 -663 -763 -660 -810 -883 -825 -672 -776 -752 -645 -657 -702 -715 -747
3213g47l1J07m2k9M5l4O5O4oj65J1j1J9M3k3P2k05O3K0J62j1l2n9l9O4M0p9J02l6j3M6l2m6
$$ -747 -778 -671 -713 -742 -697 -731 -666 -602 -608 -773 -762 -773 -754 -711 -734 -662 -867 -804 -784 -622 -633 -665 -724 -763 -699 -659 -738 -636 -672 -685 -639 -671 -717
3205g17%n2M9J0n8M6j31Q0J21Nn1M4N7j35p9N8J11M2q2o5k1M7O2p2q0J47k2M3Kl0P1l6j23
$$ -717 -717 -769 -720 -710 -768 -722 -853 -773 -652 -647 -698 -654 -597 -732 -811 -753 -642 -600 -682 -747 -768 -721 -659 -731 -811 -664 -686 -643 -641 -671 -600 -636 -759
3198g59J04qm2P6p3M6j08j7L5m2N3L3jM7j19J14o5j15J46L6K5p4m4m1N1j4L3K3k1m4m4J5J5
$$ -759 -655 -663 -705 -629 -702 -656 -764 -781 -746 -788 -735 -702 -703 -656 -775 -661 -726 -841 -695 -659 -634 -708 -752 -793 -742 -756 -723 -700 -721 -765 -809 -794 -779
3190g79k5m1J23k3P3m5J00j40J6m3K6j22K8R9J50j11o1o9J02L5j02J38j01J08j0J5p8k1q4
$$ -779 -804 -845 -722 -745 -672 -717 -617 -757 -741 -784 -758 -880 -852 -753 -603 -714 -775 -844 -742 -707 -809 -671 -772 -664 -674 -659 -737 -758 -842
3183h42l5P5J4k5K02m2j18j6J22%j4l2Pn7j2r0R3J15L9n9J37m4j4j04n2J23j44J11p0nP0M7
$$ -842 -877 -802 -788 -813 -611 -653 -771 -787 -665 -665 -679 -711 -704 -761 -773 -863 -770 -655 -616 -675 -538 -582 -596 -700 -752 -629 -773 -662 -732 -737 -667 -620
3176f20j09j72J97P7j6j20J85j11j45J16N3L6j53q1P6N7J11p8L5n5J20lp4Q0N8j37p8Rk9M6
$$ -620 -729 -901 -704 -627 -643 -763 -578 -689 -834 -718 -665 -629 -782 -863 -787 -730 -619 -697 -662 -717 -597 -600 -674 -594 -536 -673 -751 -742 -771 -725
3169g25j34J02M7l1k6kM1n6Ro8J8J88o5QO4j62j7J2J24J45k4R1P3K05M68O59L40j30n10o42
$$ -725 -859 -757 -710 -741 -767 -769 -728 -784 -775 -843 -825 -637 -702 -694 -630 -792 -809 -797 -673 -528 -552 -461 -388 -183 285 944 1284 1154 644 2
3162Bl60j22j17o3j1J09n2jP0p2o0j7j8l1R1q7Q6r9M3O0p2P2q7J5lJ9K0p2N4P4k4N2l0q2J00
$$ 2 -358 -480 -597 -660 -671 -562 -614 -615 -545 -617 -677 -694 -712 -743 -652 -739 -653 -752 -709 -649 -721 -649 -736 -721 -724 -705 -685 -757 -703 -629 -653 -601 -631 -713 -613
3154f13m0k9j16Q4j5m4q9J25m6R1r5J4O3K9k3J40m7n6n5K3K4P9o8m2O8n6n4N2p4k0J53j67
$$ -613 -653 -682 -798 -714 -729 -773 -862 -737 -783 -692 -787 -773 -710 -681 -704 -564 -611 -667 -722 -699 -675 -596 -664 -706 -638 -694 -748 -696 -770 -790 -637 -804
3147h04LJ19n0n4O7L2N0n7L0j68M0L9R7p3m7N2J9Q6m6l6rk6J22o7J6l8K8k1r3J60K7j09R7
$$ -804 -801 -682 -732 -786 -719 -687 -637 -694 -664 -832 -792 -753 -656 -729 -776 -724 -705 -619 -665 -701 -710 -736 -614 -681 -665 -703 -675 -696 -789 -629 -602 -711 -614
3140f14l8l0L5m0n5l1K1j00R2P8j06JP4r2Q5n3M0j31J27l8j1j3J5K1J62m8n1pLk5L7m8J3j3
$$ -614 -652 -682 -647 -687 -742 -773 -752 -852 -760 -682 -788 -787 -713 -805 -720 -773 -733 -864 -737 -775 -786 -799 -784 -763 -601 -649 -700 -707 -704 -729 -692 -740 -727 -740
3132g40J3N3J9K6L3l5pj06J23Pq7j34J30%J01l9k7j44J77J05r8j64J34O9j58K6N5P4k0q0m3
$$ -740 -727 -674 -655 -629 -596 -631 -638 -744 -621 -614 -701 -835 -705 -705 -604 -643 -670 -814 -637 -532 -630 -794 -660 -591 -749 -723 -668 -594 -614 -694 -737
3125g37N8j03M0N2O1oj03L9j27J19J0m9jM3%M5k1Q1Q7o3J16q3m2o3n0O2j4J29k27l0R6j6J27
$$ -737 -679 -782 -742 -690 -629 -635 -738 -699 -826 -707 -697 -746 -747 -704 -704 -659 -680 -599 -512 -575 -459 -542 -584 -647 -697 -635 -649 -520 -747 -777 -681 -697 -570
3117e70m1Q1r9k9o2O4o6l0K7MP6j39m1J01N9J45r0p1M4lP9p9p7o8l2J07K6J6m4p2J03ko7j5
$$ -570 -611 -530 -629 -658 -720 -656 -722 -752 -725 -721 -645 -784 -825 -724 -665 -520 -610 -681 -637 -640 -561 -640 -717 -785 -817 -710 -684 -668 -712 -784 -681 -683 -750 -765
3109g65MJ12j4K06j56l0o1jO2O5j81K2oq4R8j4J54j59K1J5K1j08q7J52j5O7J8o3PJ04mK1j60
$$ -765 -761 -649 -663 -457 -613 -643 -704 -705 -643 -578 -759 -737 -743 -827 -729 -743 -589 -748 -727 -712 -691 -799 -886 -734 -749 -682 -664 -727 -720 -616 -620 -599 -759
3102g59j7M8P5j48J30J9j11O0OLJM9p6jn9k1O8o2l4K3J64K5j16p2m8J47J13k9l3n3qo7M7L1
$$ -759 -776 -728 -653 -801 -671 -652 -763 -703 -697 -694 -693 -644 -720 -721 -780 -801 -733 -795 -829 -806 -642 -617 -733 -805 -853 -706 -593 -622 -655 -708 -716 -783 -736 -705
3094g05lJ8rK4L8Q5j34k6n8oJ32k07j5O0j5k5J12j06L4J25rK0L0k7m4K6mn4N5n4M3p9l6J29
$$ -705 -708 -690 -699 -675 -637 -552 -686 -712 -770 -776 -644 -851 -866 -806 -821 -846 -734 -840 -806 -681 -690 -670 -640 -667 -711 -685 -689 -743 -688 -742 -699 -778 -814 -685
3086f85J55r3n6L1k4r4J15n5j29P3J13KQ9k9l0Qp3J83r0P6o3l5N5j9k0m6j5l6k2J77m6k51
$$ -685 -530 -623 -679 -648 -672 -766 -651 -706 -835 -762 -649 -647 -558 -587 -617 -609 -682 -499 -589 -513 -576 -611 -556 -575 -595 -641 -656 -692 -714 -537 -583 -834
3079h34J50j1J3Q7l8L3Nj58J42l3O8k09P1Rn7N7J07P1k1O0J12J79K67L23J69k42m00j30R3
$$ -834 -684 -695 -682 -595 -633 -600 -595 -753 -611 -644 -576 -785 -714 -705 -762 -705 -598 -527 -548 -488 -376 -197 70 393 562 320 -80 -210 -117
3072a17K51L55O8l13m27k67k2j77J02m7K6q0J62o5j04L1o7q3j1L3N5M9J50j03R6m7J63L54
$$ -117 134 489 557 244 -183 -450 -472 -649 -547 -594 -568 -648 -486 -551 -655 -624 -691 -774 -785 -752 -697 -648 -498 -601 -505 -552 -389 -35
3066c5L29L20r2l14k81O0L74K89N2m87m06k15p1r1%j27j3L1J2M3rOl1L5j08Kq1P8J22l0K4
$$ -35 294 614 522 208 -73 -13 361 650 702 215 -191 -406 -477 -568 -568 -695 -708 -677 -665 -622 -631 -625 -656 -621 -729 -727 -808 -730 -608 -638 -614
3059f14p7j07M4K24l4l3m4j40L3J23K5r9N4O5J6j21RO1j68L7q0O9J35q9R0jl0Q2j2J25J38
$$ -614 -691 -798 -754 -530 -564 -597 -641 -781 -748 -625 -600 -699 -645 -580 -564 -685 -676 -615 -783 -746 -826 -757 -622 -711 -621 -622 -652 -570 -582 -457 -319
3052c19K22l7j68l6L1mJ39j5n0k79j44k3m7J5n9Q4%NJ29J3L1K6M5n8j70J5l1l0k3R4J00Q0
$$ -319 -97 -134 -302 -338 -307 -311 -172 -187 -237 -516 -660 -683 -730 -715 -774 -690 -690 -685 -556 -543 -512 -486 -441 -499 -669 -654 -685 -715 -738 -644 -544 -464
3044d64J9K86K32P5k27k47M1J21J73J16l19j51j16j25j20j3M2R2p3jj0O1j5L9l5n9l1L3K5
$$ -464 -445 -159 73 148 -79 -326 -285 -164 9 125 -194 -345 -461 -586 -706 -719 -677 -585 -658 -659 -669 -608 -623 -584 -619 -678 -709 -676 -651
3038f51Jj5o1Q6N3p5N2O8j2j44J66K9O2L2j13MN3K8j57QO5j42R0j0Kl5nO0J7q1k6O7J06j22
$$ -651 -650 -665 -726 -640 -587 -662 -610 -542 -554 -698 -532 -503 -441 -409 -522 -518 -465 -437 -594 -586 -521 -663 -573 -583 -581 -616 -621 -561 -544 -625 -651 -584 -478 -600
3030f00N5j5k8Q3J58k31l9P9o9K8J38O6P7j85j72oK5J49o8P4k3N5Ml7r1Jo7Mn8J62mj51J04
$$ -600 -545 -560 -588 -505 -347 -578 -617 -538 -607 -579 -441 -375 -298 -483 -655 -661 -636 -487 -555 -481 -504 -449 -445 -482 -573 -572 -639 -635 -693 -531 -535 -686 -582
3022e82j13J00J9L4K0k9n2L9J7QP8R7n6n1N8J22J95J79P7k31j08m3j01j39rL9M9R4j40l1r0
$$ -582 -695 -595 -576 -542 -522 -551 -603 -564 -547 -539 -461 -364 -420 -471 -413 -291 -96 83 160 -71 -179 -222 -323 -462 -471 -432 -383 -289 -429 -460 -550
3015e50Q6M6r0R6pO1J17K22nj02j37kK1M0N6k5n2N9L98M24K52L44N3j28l8n50l13k10j7j24
$$ -550 -464 -418 -508 -412 -419 -358 -241 -19 -24 -126 -263 -265 -244 -204 -148 -173 -225 -166 232 656 908 1252 1305 1177 1139 589 276 66 49 -75
3008g5p2O5n8j30l4K11K58K97J032J111q5j090p45j24j69j50o6k92M3P4L8J25M3P5M47Q4L47
$$ -75 -147 -82 -140 -270 -304 -93 165 462 1494 2605 2520 1430 685 561 392 242 176 -116 -73 1 39 164 207 282 729 813 1160
3002A160Q5j99j72m66j37j59K1J04j44m2J6M1J21J67K10M3n4J1J51J74K72L61L70K76M79M57
$$ 1160 1245 1046 874 408 271 112 133 237 93 51 67 108 229 396 606 649 595 606 757 931 1203 1564 1934 2210 2689 3146
2996C146N93J65n51l20j0N73O46Q50N07j26J49N08P33J171J961L445O020J2381L5353O7635
$$ 3146 3739 3904 3353 3033 3023 3596 4242 5092 5599 5473 5622 6130 6863 8034 9995 13440 19460 31841 67194 134829
2992A34829N2393K5646o0975o7839r601M0887N9231L8033j3458r3172n6384j8577q471n306
$$ 134829 187222 212868 151893 84054 74453 115340 174571 212604 199146 105974 49590 31013 22542 17236
2989A7236k572p83q94j514r15K5Q70J099K4j093o90N49R36J437J887L285O715J4314M0291
$$ 17236 14664 13881 12987 11473 10558 10583 11453 12552 12576 11483 10793 11342 12278 13715 15602 18887 25602 39916 80207
2984H0207Q8274P3035M2271o8534j01852k1466M4352P9016N2028k062j14421q4985k8937j3135
$$ 80207 168481 241516 283787 215253 113401 91935 136287 215303 267331 265269 150848 65863 36926 23791
2981B3791p832l862j517l83j017j426p87q6L61n68q48j283o31R0l9o11j111p04l20l48l87
$$ 23791 15959 12097 10580 10197 9180 7754 6967 6881 7242 6674 5826 4543 3912 4002 3963 3352 2241 1537 1217 869 482
2976D82j11o1j18m8j0j72j24J47M9J33j13j71L5m5q9j4k5p8k4k6Om9O0K6j49J36P6q5J9J09
$$ 482 371 310 192 144 134 -38 -162 -15 34 167 54 -117 -82 -127 -216 -230 -255 -333 -357 -383 -377 -426 -366 -340 -489 -353 -277 -362 -343 -234
2969b34J30K96K26J69j22k98k95K01J50K14j27K1j14p4r7k01j04R3j21q0J45M7j55J6L7l4
$$ -234 -104 192 418 587 465 167 -128 73 223 437 310 331 217 143 46 -155 -259 -166 -287 -367 -222 -175 -330 -314 -277 -311
2963c11N8L50N88l3j96m66l37M7j2K29J77L55L65M0r4k70j63O8K87K84R4j07m13l85k37p3
$$ -311 -253 97 685 652 456 -10 -347 -300 -312 -83 94 449 814 854 760 490 327 395 682 966 1060 953 540 155 -82 -155
2957a55O2p3M4J1p5k2n6j20p9K0lJ35L1j35n5J32P4L2j5lL6O1J0L9k5J19n3J49j55l8K5m6
$$ -155 -93 -166 -122 -111 -186 -208 -264 -384 -463 -443 -446 -311 -280 -415 -470 -338 -264 -232 -247 -250 -214 -153 -143 -104 -129 -10 -63 86 -69 -107 -82 -128
2950a28J25n2r3l8J30J05K99J04k5o7J1o5Q4M0m4j42j69l7j06N3L5o1J11J16N4M2K8R4P9L7
$$ -128 -3 -55 -148 -186 -56 49 348 452 427 360 371 306 390 430 386 244 75 38 -68 -15 20 -41 70 186 240 282 310 404 483 520
2943E20J9N1n3K04J11J37M40N12N90K65K35L3j59j23j59Q9J15N26P04Q86J271J784K591M481
$$ 520 539 590 537 741 852 989 1429 1941 2531 2796 3031 3064 2905 2782 2623 2712 2827 3353 4057 4943 6214 7998 10589 15070
2938A5070R514K5137M3336L4019L3245o826j5506j1283n5657l8144j3627o214l533j840j218
$$ 15070 24584 49721 93057 127076 160321 153495 137989 126706 71049 32905 19278 13064 9531 7691 6473
2934F473p42l75L94N55Q43N52M85M71j25l41M0J76L06L71Q04J569K204L087N249J0488K3636
$$ 6473 5731 5356 5750 6305 7148 7700 8185 8656 8531 8190 8230 8406 8712 9083 9887 11456 13660 16747 21996 32484 56120
2930E6120M8865O9194Q0026M5434J9436k9067m8297o3989q9302m2963j7035q633n094l235
$$ 56120 104985 174179 254205 299639 319075 290008 241711 177722 88420 45457 28422 19789 14695 11460
2926A1460k132j361o25q0J68J64M11N7K09k7j8K63K10J99Q0L94R45J335K323N122J2109L2632
$$ 11460 9328 7967 7342 7262 7430 7594 8005 8062 8271 8244 8226 8489 8699 8898 8978 9372 10317 11652 13975 19097 31206 63838
2921F3838M6778L7694L1879j7073j2241k0880o4639l5025j2706n907l485k147j161q88o04
$$ 63838 110616 148310 180189 163116 150875 129995 65356 30331 17625 11718 8233 6086 4925 4037 3433
2918C433l13n12j75j7L58L12J85J64jm78j29j84l69l40l24o40m83r6n0n4p0n5Jo3lK4J0J84
$$ 3433 3120 2608 2433 2416 2774 3086 3271 3435 3434 2956 2827 2643 2274 1934 1610 970 487 391 341 287 217 162 163 100 97 121 131 315
2911C15J15J81M8j11O1J59N6m6KK3q1J86j9K03J80L06M27N21L24Ml29j26L68P22P64P67J13
$$ 315 430 611 659 548 609 768 824 778 780 803 722 908 889 1092 1272 1578 2005 2526 2850 2854 2525 2399 2767 3489 4253 5020 5133
2905E133K3L82J074J756K202L088M580Q155J7518N2021K03854J71712j5170k46278j37063
$$ 5133 5156 5538 6612 8368 10570 13658 18238 26393 43911 95932 299786 471498 456328 210050 72987
2902G2987l8514j4402p219m070k312j256q65n19l91k99j13m14l76j87o4N3j97O3j13k95l68
$$ 72987 34473 20071 12852 8782 6470 5214 4349 3830 3439 3140 3027 2613 2237 2050 1986 2039 1842 1905 1792 1497 1129
2897A129j31l0m3%J07J80J09J87K57K21K20J37j57j45K5K23L26O39P84O89L67k21k05K67P28
$$ 1129 998 968 925 925 1032 1212 1321 1508 1765 1986 2206 2343 2186 2041 2066 2289 2615 3254 4038 4727 5094 4873 4668 4935 5663
2891E663J046J217Q51R30J323K475L611O021J1681K5452M9520O9151O1454J0684m2114n7889
$$ 5663 6709 7926 8777 9707 11030 13505 17116 23137 34818 60270 109790 178941 240395 251079 208965 151076
2888A51076j9855L1670N3492L7095k4992o7256p1307m1838j9364q725m525k279j321k09p0
$$ 151076 131221 162891 216383 253478 228486 161230 89923 48085 28721 19996 15471 13192 11871 11662 11592
2884A1592m37j016r41l5J232J702R67k44p61K37J467L274N342R957K1030L9443M8321L8274
$$ 11592 11155 10139 9198 9163 10395 12097 13064 12820 12059 12296 13763 17037 22379 32336 53366 92809 141130 179404
2880A79404l777l6097l9396o256K7694L7491J6045k4577m9900m2763k2422j0973p215l076
$$ 179404 175627 139530 100134 93878 121572 159063 175108 150531 100631 57868 35446 24473 17258 14182
2877A4182j126M94Q87k28m450l709j232l25L44L90k15o59j025m80k41K29mk96o22m05l84k56
$$ 14182 13056 13550 14437 14209 9759 6050 4818 4493 4837 5227 5012 4353 3328 2848 2607 2836 2832 2536 1914 1509 1125 869
2872H69pK27N36J178J171J138J256J822K129j32k909q59M07J620J576O76l834l969j280m81
$$ 869 862 1089 1625 2803 3974 5112 6368 8190 10319 10187 7278 6419 6826 8446 10022 10698 6864 2895 1615 1134
2867A134n47l99k01N3K7k7J04P4J05J96l05l02k00j04k7L1J12q6J54o3l1r3J25j32j02J70
$$ 1134 587 188 -13 40 67 40 144 218 323 519 214 -88 -288 -392 -419 -388 -276 -362 -208 -271 -302 -395 -270 -402 -504 -334
2861c34p9J27L1Q2p9j02K5M0l0n8K4n1j14Q2M7J3J41no6K9NLj33p7l0P1K2R4J12J0J21M93
$$ -334 -413 -286 -255 -173 -252 -354 -329 -289 -319 -377 -353 -404 -518 -436 -389 -376 -235 -240 -306 -277 -272 -269 -402 -479 -509 -438 -416 -322 -210 -200 -79 414
2854D14K38K91J30J4j45p9J13O62J475J632J352M85n7k35k0J16M00m5m32r37j046j319j091
$$ 414 652 943 1073 1087 942 863 976 1638 3113 4745 6097 6582 6525 6290 6270 6386 6786 6741 6309 5372 4326 3007 1916
2849A916q36m06k72k67K5m0n4J07J62J5K56L72L90K77J07n6k53j79M16R65J741K370J616N70
$$ 1916 1080 674 402 135 160 120 66 173 335 350 606 978 1368 1645 1752 1696 1443 1264 1680 2645 4386 6756 8372 8942
2843H942k28m36j36K26J54k93n96j150j362j657j247j149q37r7jk33p6j16JQ8k29J33J83J52
$$ 8942 8714 8278 8142 8368 8522 8229 7633 6483 5121 3464 2217 1068 231 134 133 -100 -176 -292 -291 -203 -432 -299 -116 36
2838C6J59l1o1o7l80j08j16j16k4M1J1P1L1j41J14k3j54L8N9m4n5J01r9J21n6KR9m4M1r8O8
$$ 36 195 164 103 36 -344 -452 -568 -684 -708 -667 -656 -585 -554 -695 -581 -604 -758 -720 -661 -705 -760 -659 -758 -637 -693 -691 -592 -636 -595 -693 -625
2831f25n4j1j00j59J41Q3M5l8j0J70j51pP9o6r7qM9J16j4m6m0j7R4k1N7K3N8p1Q8K5j4M6j15
$$ -625 -679 -690 -790 -949 -808 -725 -680 -718 -728 -558 -709 -716 -637 -703 -800 -808 -759 -643 -657 -703 -743 -760 -666 -687 -630 -607 -549 -620 -532 -507 -521 -475 -590
2823e90J20J55q0J40J69j12o7l9l0j6j01J63K2J75Ql8j81l5K5j93q7j2p9K0m3Q9n0M6m5m2
$$ -590 -470 -315 -395 -255 -86 -198 -265 -304 -334 -350 -451 -288 -266 -91 -83 -121 -302 -337 -312 -505 -592 -604 -683 -663 -706 -617 -667 -621 -666 -708
2816g08J1M8m1K5k6n3L3L5qj4PlR8j14M1N2m0j1K0J77k5q8l5LO1j34N6lJ35n5j16P0O3J23
$$ -708 -697 -649 -690 -665 -691 -744 -711 -676 -684 -698 -691 -694 -596 -710 -669 -617 -657 -668 -648 -471 -496 -584 -619 -616 -555 -689 -633 -636 -501 -556 -672 -602 -539 -416
2809d16J58K75L34R6j99k22N6O5J31K06m3l08l08k27j35Q1P5J10J40Q3k5j6r0k26KK13J13
$$ -416 -258 17 351 447 248 26 82 147 278 484 441 133 -175 -402 -537 -456 -381 -271 -131 -48 -73 -89 -179 -405 -403 -190 -77
2802g7O9N7j97m8p8j15J5K1J57J76L58K02q4%l04M5K19J82K7n4rJ93J325P37M7p96Q26J099
$$ -77 -8 49 -148 -196 -274 -389 -374 -353 -196 -20 338 540 456 456 152 197 416 598 625 571 562 755 2080 2817 2864 2068 2894 3993
2796C993J096J319K038J677Q63m082m120j326o35o66j15j71n2J1qr1p1J60K02K3j44p4N5j41
$$ 3993 5089 6408 8446 10123 10986 6904 2784 1458 823 157 42 -129 -181 -170 -178 -269 -340 -180 22 45 -99 -173 -118 -259
2791b59n8N8R6J82P0J99L83M70J428K040J923K018K755K911K056k270o773m362j553o84m26
$$ -259 -317 -259 -163 19 89 288 671 1141 2569 4609 6532 8550 11305 14216 16272 14002 7229 2867 1314 630 204
2786B04l28n2K2m8q7p6L8l5j1o7K12j36L7N2q8P2lo1J10M1K28K44Q19R32Q29Q75J405R36P92
$$ 204 -124 -176 -154 -202 -289 -365 -327 -362 -373 -440 -228 -364 -327 -275 -363 -291 -294 -355 -245 -204 24 268 1087 2019 2848 3723 5128 6064 6856
2779F856k265l006j135m56j81M1K8r9j24J0l3n0r0J89R1M4j89O4KJj99Qm0J7r7R8M9k3p9L7
$$ 6856 4591 1585 450 -6 -187 -146 -118 -217 -341 -331 -364 -414 -504 -315 -224 -180 -369 -305 -303 -302 -501 -493 -533 -516 -613 -515 -466 -489 -568 -531
2772e31l6Q4J66k5P7j19p6j0k9q9O4J26J07j67J04j31J09j1J03l4N5j15j9K5M9mP4j24j46
$$ -531 -567 -483 -317 -342 -265 -384 -460 -470 -499 -588 -524 -398 -291 -458 -354 -485 -376 -387 -284 -318 -263 -378 -397 -372 -323 -327 -253 -377 -523
2766e23L2j7j65q5P5J07m0j6l5ml3rJ2J29j4o6j03J21J09j33M7l5r5M2J13J5j09RO4p1L4N9
$$ -523 -491 -508 -673 -758 -683 -576 -616 -632 -667 -671 -704 -713 -701 -572 -586 -652 -755 -634 -525 -658 -611 -646 -741 -699 -586 -571 -680 -671 -607 -678 -644 -585
2758e85K2j9R4qo6N8o5m3n6P5M1J32k0r2j11Jq8Ok0rOL0l7RO2k6o4N0o8P1P3p3l8R3q7j04
$$ -585 -563 -582 -488 -496 -562 -504 -569 -612 -668 -593 -552 -420 -440 -532 -643 -642 -730 -724 -744 -753 -747 -717 -754 -745 -683 -709 -773 -723 -791 -720 -647 -720 -758 -665 -752 -856
2750h56O4J16j05J44L7j09K5j5k3K1m6J44qq1j4K7O8j04o3Q4j11N7kK8j7L5K8r2J3J4l6m8
$$ -856 -792 -676 -781 -637 -600 -709 -684 -699 -722 -701 -747 -603 -611 -692 -706 -679 -611 -715 -778 -694 -805 -748 -750 -722 -739 -704 -676 -768 -755 -741 -777 -825
2743h25Q9qj58R6J19j30Q9O5j15J1N8l9O2j54L2P3O6k2o8O7J01o6o3L2M7l0KJm4r0J06n5J38
$$ -825 -736 -744 -902 -806 -687 -817 -728 -663 -778 -767 -709 -748 -686 -840 -808 -735 -669 -691 -759 -692 -591 -657 -720 -688 -641 -671 -669 -668 -712 -802 -696 -751 -613
2735f13j18M0JP6j09m8N7K9o9n7L4N2P1j5j00k9N6j18kJ63P3M2k41L8k7pq8J34Q7mlL3J17
$$ -613 -731 -691 -690 -614 -723 -771 -714 -685 -754 -811 -777 -725 -654 -669 -769 -798 -742 -860 -862 -699 -626 -584 -825 -787 -814 -821 -909 -775 -688 -692 -695 -662 -545
2728e45k21J87j45J21m2q5o8j9M4%j72J56r9N2J2O2J8o3r1O2R2M7rP7j8j30MP5K0K0q6q1O4
$$ -545 -766 -579 -724 -603 -645 -730 -798 -817 -773 -773 -945 -789 -888 -836 -824 -762 -744 -807 -898 -836 -744 -697 -706 -629 -647 -777 -773 -698 -678 -658 -744 -825 -761
2720g61j30P4k9M4M2Qk9KK2l6P2P1k5o6J0P5J8j3o4L2L8j58n6J09N3l3r3J9o4Mm4j2J55K07
$$ -761 -891 -817 -846 -802 -760 -752 -781 -779 -757 -793 -721 -650 -675 -741 -731 -656 -638 -651 -715 -683 -645 -803 -859 -750 -697 -730 -823 -804 -868 -864 -908 -920 -765 -558
2712e58j58n2J0J40j64J6Nr3J23N3l1j7q3J42j26mM7J4k2j17J38M8L2n0r8O6j07M2M2J39r1
$$ -558 -716 -768 -758 -618 -782 -766 -761 -854 -731 -678 -709 -726 -809 -667 -793 -797 -750 -736 -758 -875 -737 -689 -657 -707 -805 -739 -846 -804 -762 -623 -714
2705g14mJ01no5J1l1J15Jq6p5J00k12P2L6k1l8P0J6q4lo3J02j12LJ18j72J45PL8m9L9MoN3
$$ -714 -718 -617 -622 -687 -676 -707 -592 -591 -677 -752 -652 -864 -792 -756 -777 -815 -745 -729 -813 -816 -879 -777 -889 -886 -768 -940 -795 -788 -750 -799 -760 -756 -762 -709
2697g09l8r1L7M6K1K3M1j04n5m1J06kK9J04q2L3j51J43PL2j86j4L0M1L5J43m9j6q0Q5P9j72
$$ -709 -747 -838 -801 -755 -734 -711 -670 -774 -829 -870 -764 -766 -737 -633 -715 -682 -833 -690 -683 -651 -837 -851 -821 -780 -745 -602 -651 -667 -747 -662 -583 -755
2690g55LM9j42L5R7j02N8J5j14R2J05k7P9n0M7q6N8q9j10k6R9L5M5j0j2n1R6J19Rl4n2M6o7
$$ -755 -752 -703 -845 -810 -713 -815 -757 -742 -856 -764 -659 -686 -607 -657 -610 -696 -638 -727 -837 -863 -764 -729 -684 -694 -706 -757 -661 -542 -533 -567 -619 -573 -640
2683f40M6J19K9O9j23k4m0rK2o1j09q%j43k8J76L0l9o6n8M0N2K2n1q8O8P8m0Kl5M4m0L7Q8
$$ -640 -594 -475 -446 -377 -500 -524 -564 -573 -551 -612 -721 -729 -729 -872 -900 -724 -694 -733 -799 -857 -817 -765 -743 -794 -882 -814 -736 -776 -774 -809 -765 -805 -768 -680
2675f80j25Q8j48O9J05P6j36K4P9J2n9m0K5K5P2r2o0M1l1m1j45J22J73j78rL6N3L1j3Q5j28
$$ -680 -805 -717 -865 -796 -691 -615 -751 -727 -648 -636 -695 -735 -710 -685 -613 -705 -765 -724 -755 -796 -941 -819 -646 -824 -833 -797 -744 -713 -726 -641 -769
2668g69j0J40r1k6L8r5J9K6L3k9NJ33Lj36r7m7r7O0J08m9J24m4K3O8k6PJ8P1k6L5o8p0L7L5
$$ -769 -779 -639 -730 -756 -718 -813 -794 -768 -735 -764 -759 -626 -623 -759 -856 -903 -1000 -940 -832 -881 -757 -801 -778 -710 -736 -729 -711 -640 -666 -631 -699 -769 -732 -697
2660f97R0k4l6Km6P8M1k03l1J25m6p6m5J58p5M0K4Q3p8On6l4L7n7P8Nl1M4P4j3j60J71l9R2
$$ -697 -607 -631 -667 -665 -711 -633 -592 -795 -826 -701 -747 -823 -868 -710 -785 -745 -721 -638 -716 -710 -766 -800 -763 -820 -742 -737 -768 -724 -650 -663 -823 -652 -691 -599
2652e99n9l6P5q9m0r9N6%J00o9N9p6M2m8K9l5P1n1l7J2K1J23K3j28l4q7K2R5L1r9RLJ7N7J5
$$ -599 -658 -694 -619 -708 -748 -847 -791 -791 -691 -760 -701 -777 -735 -783 -754 -789 -718 -769 -806 -794 -773 -650 -627 -755 -789 -876 -854 -759 -728 -827 -818 -815 -798 -741 -726
2644g26q7Q5k5J03n1n5L9pj45N2nJ2JL2O7Q1j52OJ2m4j19J49PJ8R2j41R5j0o8P1P5j76R3R7
$$ -726 -813 -728 -753 -650 -701 -756 -717 -724 -869 -817 -822 -810 -809 -777 -710 -629 -781 -775 -763 -807 -926 -777 -770 -752 -660 -801 -706 -716 -784 -713 -638 -814 -721 -624
2636f24q3P7k16K9q0Q2J51j39N3r0j5j0q3J19J05M5j23O6o5K1L9J7q3k4Q5q4J8P8L4p5O5p6
$$ -624 -707 -630 -846 -817 -897 -815 -664 -803 -750 -840 -855 -865 -948 -829 -724 -679 -802 -736 -801 -780 -741 -724 -807 -831 -746 -830 -812 -734 -700 -775 -710 -786
2629g86J0k9k1N5okm4pnk9K7M7P6q1Q4J50j02l6k9m1J00l1k9q0K9r5Q3j14J13lpJ05k0n2J18
$$ -786 -776 -805 -826 -771 -777 -779 -823 -830 -835 -864 -837 -790 -714 -795 -711 -561 -663 -699 -728 -769 -669 -700 -729 -809 -780 -875 -792 -906 -793 -796 -803 -698 -718 -770 -652
2621f52nq8j15Q9l1o7n9L0Qj11J14R5j0o4MN4lK9%P0k0l1l5l6k4N6l4L2J53P3mp7k5O6QLk79
$$ -652 -657 -745 -860 -771 -802 -869 -928 -898 -890 -1001 -887 -792 -802 -866 -862 -808 -811 -782 -782 -712 -732 -763 -798 -834 -858 -802 -836 -804 -651 -578 -582 -659 -684 -618 -610 -607 -886
2613h86J35P0j09L5K5N3o6K3o4J03l1R3qk08j5l3m8P4O0J17m4k2q4j3J1j01J46k03J01R0m8
$$ -886 -751 -681 -790 -755 -730 -677 -743 -720 -784 -681 -712 -619 -627 -835 -850 -883 -931 -857 -797 -680 -724 -746 -830 -843 -832 -933 -787 -990 -889 -799 -847
2605h47Q7q0O7j1O9J1p8m0R6m1QJ13n0m9p7J4P0o9rJ68Pj24M8n3j07j6KN6N3J30k3%J27r7
$$ -847 -760 -840 -773 -784 -715 -704 -782 -822 -726 -767 -759 -646 -696 -745 -822 -808 -738 -807 -816 -648 -641 -765 -717 -770 -877 -893 -891 -835 -782 -652 -675 -675 -548 -645
2598f45n8n0j10J23K9Q1Jq1N0l0k5r5k2Q4L0o9j7P2j15m6O2O9M4o7jJ32L8J0j55N5q3L2K5
$$ -645 -703 -753 -863 -740 -711 -630 -629 -710 -660 -690 -715 -810 -832 -748 -718 -787 -804 -732 -847 -893 -831 -762 -718 -785 -786 -654 -616 -606 -761 -706 -789 -757 -732
2590g32l1Pj38K53o4J33n4j65j6R5k9Q1q8K5l6JJ24r0j22J77j3nN3q7M6j28m2LQ7J28j07m2
$$ -732 -763 -756 -894 -641 -705 -572 -626 -791 -807 -712 -741 -660 -748 -723 -759 -758 -634 -724 -846 -669 -682 -687 -634 -721 -675 -803 -845 -842 -755 -627 -734 -776
2583g76LJ5J63l0o8j78J45P0k5%o2L6O1n5n7L8Q6J10j72l5%r1L1j8M6M3Lj20M2J09L4n6j04
$$ -776 -773 -758 -595 -625 -693 -871 -726 -656 -681 -681 -743 -707 -646 -701 -758 -720 -634 -524 -696 -731 -731 -822 -791 -809 -763 -720 -717 -837 -795 -686 -652 -708 -812
2575h12p6J02J22r2J36n3N1m1p5n4J20rp0l3n1m5K51k9k06J5Q3k2qR7r9j6K5o4p2P6R4L2J4
$$ -812 -888 -786 -664 -756 -620 -673 -622 -663 -738 -792 -672 -681 -751 -784 -835 -880 -629 -658 -864 -849 -766 -788 -796 -699 -798 -814 -789 -853 -925 -849 -755 -723 -709
2568g09j51Q3l6k6K4R3p3O4K2k5n3M6K2q1P0j5J2l9l7N7K3J9j7j87P4LQ2j1J10j53N4N3J9
$$ -709 -860 -777 -813 -839 -815 -722 -795 -731 -709 -734 -787 -741 -719 -800 -730 -745 -733 -772 -809 -752 -729 -710 -727 -914 -840 -837 -755 -766 -656 -809 -755 -702 -683
2560f83M4j35m0K8K7j09J43k8K6N6m5o4J06L9j26n9K0L4R7l9r4j1J73m1m4O4o9Mrm4m7R7o9
$$ -683 -639 -774 -814 -786 -759 -868 -725 -753 -727 -671 -716 -780 -674 -635 -761 -820 -800 -766 -669 -708 -802 -813 -640 -681 -725 -661 -730 -726 -735 -779 -826 -729 -798
2553g98N7J07j6q6j3j61Q0L7lJ06m6p5J46p6j14j1R0Km1N0j5P1j8K5r7j4J16j37KO4rk2J43
$$ -798 -741 -634 -650 -736 -749 -910 -830 -793 -796 -690 -736 -811 -665 -741 -855 -866 -776 -774 -815 -765 -780 -709 -727 -702 -799 -813 -697 -834 -832 -768 -777 -799 -656
2545f56K0n5o9k5J09oJ7r2pj8O7n6O9oj12q0M3J11M0n5q3J27o4N3l5j8K3K4M6J6j2N6j34J69
$$ -656 -636 -691 -760 -785 -676 -682 -665 -757 -764 -782 -715 -771 -702 -708 -820 -900 -857 -746 -706 -761 -844 -717 -781 -728 -763 -781 -758 -734 -688 -672 -684 -628 -762 -593
2537e93j80K5J11K0J00j11r5N5mp2q4o2J60N4j21J20M3o0p1J09K4m7n7m5O7R1r2j3R0n5r2
$$ -593 -773 -748 -637 -617 -517 -628 -723 -668 -672 -744 -828 -890 -730 -676 -797 -677 -634 -694 -765 -656 -632 -679 -736 -781 -714 -623 -715 -728 -638 -693 -785
2530g85rNj8J46N0N8j99p8J20n4k7J18j51O4j22O1J43Op0J19r6K5Jn2j4K3k3QO0j14m2rM4
$$ -785 -794 -789 -807 -661 -611 -553 -752 -830 -710 -764 -791 -673 -824 -760 -882 -821 -678 -672 -742 -623 -719 -694 -693 -745 -759 -736 -759 -751 -691 -805 -847 -856 -812
2523h12M3L9Q6n6Op6P2Nm1J2k9n8M1oq2Q7k3m7J19LL4k7l4MNP6Jj53%j8J23n6q6J8J33n1R
$$ -812 -769 -730 -644 -700 -694 -770 -698 -693 -734 -722 -751 -809 -768 -774 -856 -769 -792 -839 -720 -717 -683 -710 -744 -740 -735 -659 -658 -811 -811 -829 -706 -762 -848 -830 -697 -748 -739
2514g39j73J61m1j24J5P5J92l0K4j21N4M3nJ8j52R9M8r9q0J04L2k1q1P2l8PL4%Q3j06K1L3
$$ -739 -912 -751 -792 -916 -901 -826 -634 -664 -640 -761 -707 -664 -669 -651 -803 -704 -656 -755 -835 -731 -699 -720 -801 -729 -767 -760 -726 -726 -643 -749 -728 -695
2507f95n8J1J59j09J2K3L8o4j85J67m8J42o6k1O7l7j73J43N5j49m0p4J01j5Q7J3j7K9J25n3
$$ -695 -753 -742 -583 -692 -680 -657 -619 -683 -868 -701 -749 -607 -673 -694 -627 -664 -837 -694 -639 -788 -828 -902 -801 -816 -729 -716 -733 -704 -579 -632
2500f32Mj50j03N4Q8p6m2R9q6R6j48R6P1L%l6M7J52m9o5j36J79m6kO3k4p9N1L0p7j7mKl5R1
$$ -632 -628 -778 -881 -827 -739 -815 -857 -758 -844 -748 -896 -800 -729 -726 -726 -762 -715 -563 -612 -677 -813 -634 -680 -682 -619 -643 -722 -671 -641 -718 -735 -739 -737 -772 -681
2492f81L9j12Q6J6N0j7j62O9j07J21n7R3N7j1l1k6J5o3r1M6J3N5L7j19N1K8J4K1r2N6m7M3
$$ -681 -642 -754 -668 -652 -602 -619 -781 -712 -819 -698 -755 -662 -605 -616 -647 -673 -658 -721 -812 -766 -753 -698 -661 -780 -729 -701 -687 -666 -758 -702 -749 -706
2485g06Q9n1J01M7n3p2lj1j2p4L1o8J15k5O9l9j8N4P3oq4P9j49l8j5M7O0q2o0l4Q8m0P3r3
$$ -706 -617 -668 -567 -520 -573 -645 -648 -659 -671 -745 -714 -782 -667 -692 -623 -662 -680 -626 -553 -559 -643 -564 -713 -751 -766 -719 -659 -741 -801 -835 -747 -787 -714 -807
2477h07m6J51K8O0j41J16q4q2N8j2QJ18o3j3o7J84p0k0Q7n2l0J18J1k41L0r8K0J55N2J4q8
$$ -807 -853 -702 -674 -614 -755 -639 -723 -805 -747 -759 -751 -633 -696 -709 -776 -592 -662 -682 -595 -647 -677 -559 -548 -789 -759 -857 -837 -682 -630 -616 -704
2470g04Krm2OL9k3n0Q4Q2r6k4K3j28l5J58N8no6o6L1K5R1o9J08o0N0o5j3N8p4j13J15j0J5
$$ -704 -702 -711 -753 -747 -708 -731 -781 -697 -615 -711 -735 -712 -840 -875 -717 -659 -664 -730 -796 -765 -740 -649 -718 -610 -670 -620 -685 -698 -640 -714 -827 -712 -722 -707
2462g07jO0n5K6q8j4p1L1M4O2P5p2p5j7J57j15k5N8j6K3l2P3o3j09J01o3L9M8%j9k9J09J14
$$ -707 -708 -648 -703 -677 -765 -779 -850 -819 -775 -713 -638 -710 -785 -802 -645 -760 -785 -727 -743 -720 -752 -679 -742 -851 -750 -813 -774 -726 -726 -745 -774 -665 -551
2455e51j8J74J64j87j29J4P6R8K25K3K27l45k26j49q5J08J89R5j8j57j50j85J39j02J4R8M2
$$ -551 -569 -395 -231 -418 -547 -533 -457 -359 -134 -111 116 -229 -455 -604 -689 -581 -392 -297 -315 -472 -622 -807 -668 -770 -756 -658 -616
2448f16j1q6J20j44L1m5J01mK0l6p7L3OoJ11j05LN0o0L4J10k00Q1N1j2l4M5o8l4o7J18k8P2
$$ -616 -627 -713 -593 -737 -706 -751 -650 -654 -634 -670 -747 -714 -708 -714 -603 -708 -705 -655 -715 -681 -571 -771 -690 -639 -651 -685 -640 -708 -742 -809 -691 -719 -647
2441f47m1rL4k3m9j3J26j5J55N4oL0k00o4M8L5K69J74Q8m2l35l9j59RK23O9N6j29j20m1J2
$$ -647 -688 -697 -663 -686 -735 -748 -622 -637 -482 -428 -434 -404 -604 -668 -620 -585 -316 -142 -54 -96 -431 -470 -629 -620 -397 -328 -272 -401 -521 -562 -550
2434e50L7j31p7J3N2Ml6p1L0o0J1o3J10Nj0R7m9n9J66p1O1j12p3m0J42O7o4q9pN7K3j15J12
$$ -550 -513 -644 -721 -708 -656 -652 -688 -759 -729 -789 -778 -841 -731 -726 -736 -639 -688 -747 -581 -652 -591 -703 -776 -816 -674 -607 -671 -760 -767 -710 -687 -802 -690
2426f90LoJ28j48qJ02l8Om4N4m6j7l5L8j30N0M7K8kj26J84j44n4J31O9O1p3J5o7m2n8q6j1
$$ -690 -687 -693 -565 -713 -721 -619 -657 -651 -695 -641 -687 -704 -739 -701 -831 -781 -734 -706 -708 -834 -650 -794 -848 -717 -648 -587 -660 -645 -712 -754 -812 -898 -909
2419i09O5J23k2J20q7K9o9J35m3pp1q1p1l5J28K1O9n9O9k2j15o6J37N8J00j4j33J9M6N0p4
$$ -909 -844 -721 -743 -623 -710 -681 -750 -615 -658 -665 -736 -817 -888 -923 -795 -774 -705 -764 -695 -717 -832 -898 -761 -703 -603 -617 -750 -731 -685 -635 -709
2412g09R3o0n6n8J38Nj28Rl4R0J3R3j76LM8P6P0m5J6j84N3J75q6K8j68L8j26j5J02nP9J07
$$ -709 -616 -676 -732 -790 -652 -647 -775 -766 -800 -710 -697 -604 -780 -777 -729 -653 -583 -628 -612 -796 -743 -568 -654 -626 -794 -756 -882 -897 -795 -800 -721 -614
2404f14j32j14j2J47P6o8J5O8rj14QR0K3j01mR2m0j31mJ28j15PJ41n5Q5o1m6mP2n7O9n0Q9
$$ -614 -746 -860 -872 -725 -649 -717 -702 -634 -643 -757 -749 -659 -636 -737 -741 -649 -689 -820 -824 -696 -811 -804 -663 -718 -633 -694 -740 -744 -672 -729 -660 -710 -621
2397f21qj15J94mj90K5j04J7J19L2R7j08l5j97J04R8o8j1n1J16n3J3J02l3J1k4K4K9j9p2J11
$$ -621 -629 -744 -550 -554 -744 -719 -823 -806 -687 -655 -558 -666 -701 -898 -794 -696 -764 -775 -826 -710 -763 -750 -648 -681 -670 -694 -670 -641 -660 -732 -621
2390f21j4n5p0J41Kq9P3p4J61j39j16mM9l8J52Kl8K7k2N5J9J5P7j05Q2K7q6J2k9r7n2J00n7
$$ -621 -635 -690 -760 -619 -617 -706 -633 -707 -546 -685 -801 -805 -756 -794 -642 -640 -678 -651 -673 -618 -599 -584 -507 -612 -530 -503 -589 -577 -606 -703 -755 -655 -712
2382g12J19j65N2L8L0q2P9r1j05J55L4Lo5m2J4j2j0R5k6n8J0L4m6J19k1j4j8n4K8O9lj05P
$$ -712 -593 -758 -706 -668 -638 -720 -641 -732 -837 -682 -648 -645 -710 -752 -738 -750 -760 -665 -691 -749 -739 -705 -751 -632 -653 -667 -685 -739 -711 -642 -645 -750 -743
2375g43Mk4M2j5J8J0P5j24Q5JL4k0N1n8l6r0n8O4J02p0M9oj4Kj6J23l0J42l4j93KK7n2J57
$$ -743 -739 -763 -721 -736 -718 -708 -633 -757 -672 -671 -637 -657 -606 -664 -700 -790 -848 -784 -682 -752 -703 -709 -723 -721 -737 -614 -644 -502 -536 -729 -727 -700 -752 -595
2367e95j24j11J43j7R1q4q7L1J09j0K5o8j14M8J29M2m0q1n3j14K0R7j04J16l0N3J2QL9M2M2
$$ -595 -719 -830 -687 -704 -613 -697 -784 -753 -644 -654 -629 -697 -811 -763 -634 -592 -632 -713 -766 -880 -860 -763 -867 -751 -781 -728 -716 -708 -669 -627 -585
2360e85q8j25P7o5q4R9rO4R5j06n5Q1RN2j85J12O3j23Q5j38J15j41J05K9P7p2M6j4O4N1Ok5
$$ -585 -673 -798 -721 -786 -870 -771 -780 -716 -621 -727 -782 -701 -692 -640 -825 -713 -650 -773 -688 -826 -711 -852 -747 -718 -641 -713 -667 -681 -617 -566 -560 -585
2352e85q6n3N0J2m2L7j86J57R9N6p2m8q0J34K6kR9n9J5j80R9Lq2j50K2J7R8k8QJ46j27N3q6
$$ -585 -671 -724 -674 -662 -704 -667 -853 -696 -597 -541 -613 -661 -741 -607 -581 -583 -484 -543 -528 -708 -609 -606 -688 -838 -816 -799 -701 -729 -721 -575 -702 -649 -735
2345g35J49P0L1j90P2n4l1P2k6m0J09pL8o2L5p7j40J01K3o6N9o6k5J22R1r0j0r3N2p0j08J40
$$ -735 -586 -516 -485 -675 -603 -657 -688 -616 -642 -682 -573 -580 -542 -604 -569 -646 -786 -685 -662 -728 -669 -735 -760 -638 -547 -637 -647 -740 -688 -758 -866 -726
2337g26M3Q2o5j23J09O9J5M4j04Ll0P3J04j25k2om2l6M3l0K0l5MK5L0j4pn3j05O0J01j3N1
$$ -726 -683 -601 -666 -789 -680 -611 -596 -552 -656 -653 -683 -610 -506 -631 -653 -659 -701 -737 -694 -724 -704 -739 -735 -710 -680 -694 -701 -754 -859 -799 -698 -711 -660
2330f60jr2J5M8q2o4P0J01q2Kj4R6r5J1l7m5qQ3Q4L2j75L2rK08j67j07J84L8j66J6O9J24m0
$$ -660 -661 -753 -738 -690 -772 -836 -766 -665 -747 -745 -759 -663 -758 -747 -784 -829 -837 -754 -670 -638 -813 -781 -790 -582 -749 -856 -672 -634 -800 -784 -715 -591 -631
2322f31n1j8n0nJ04N6j00L8Q0N0q5L2O6K5R4J9J5j5q1j20j06qk0J2N7m4K0Mk4J0m2L8m1N4
$$ -631 -682 -700 -750 -755 -651 -595 -695 -657 -577 -527 -612 -580 -514 -489 -395 -376 -361 -376 -457 -577 -683 -691 -711 -699 -642 -686 -666 -662 -686 -676 -718 -680 -721 -667
2315f67m7J19j09LL5r2P5r2J4J7L5m9lO3L5K5r7J80q5j49N4q5O8j15J48K9k5Q2l9l3J4P2j00
$$ -667 -714 -595 -704 -701 -666 -758 -683 -775 -761 -744 -709 -758 -761 -698 -663 -638 -735 -555 -640 -789 -735 -820 -752 -867 -719 -690 -715 -633 -672 -705 -691 -619 -719
2307g19l0N4J9pj38K4L4%j9J46o9R2m5Q4j29q5J21J6J0m3Q5r2m3k4OQ6Q0m2m9oq8P1l1j25
$$ -719 -749 -695 -676 -683 -821 -797 -763 -763 -782 -636 -705 -613 -658 -574 -703 -788 -667 -651 -641 -684 -599 -691 -734 -758 -752 -666 -586 -628 -677 -683 -771 -700 -731 -856
2299h56J15R1n2n0l8j6Q1jN3j9o8l7J18m1K4p9r1J53qQ2j17mo7M2p8J06P5j6M7j48R3q1M4
$$ -856 -741 -650 -702 -752 -790 -806 -725 -726 -673 -692 -760 -797 -679 -720 -696 -775 -866 -713 -721 -639 -756 -760 -827 -785 -863 -757 -682 -698 -651 -799 -706 -787 -743
2292g43n4m2J4L0N8k5Q2j71J50K0q0P0j45N4K4K2K6l1N3j27o1r3J57K2QJ7K0oJ41l7j5j27
$$ -743 -797 -839 -825 -795 -737 -762 -680 -851 -701 -681 -761 -691 -836 -782 -758 -736 -710 -741 -688 -815 -876 -969 -812 -790 -782 -765 -745 -751 -610 -647 -662 -789
2284g89L9P8j9N2jl3r9L8oj00R8J46j40m9J00R4l3J6L5p4N6m7nq4r5J51l1j0l5N5r5J11p0
$$ -789 -750 -672 -691 -639 -640 -673 -772 -734 -740 -840 -742 -596 -736 -785 -685 -591 -624 -608 -573 -647 -591 -638 -643 -727 -822 -671 -702 -712 -747 -692 -787 -676 -746
2277g46K1n2r4J08J35o0J8j07O0N1m3p6L4lQ6L0p6P6M4j8p6j08J49m0p6O1N7k6j06J96n4J0
$$ -746 -725 -777 -871 -763 -628 -688 -670 -777 -717 -666 -709 -785 -751 -754 -668 -638 -714 -638 -594 -612 -688 -796 -647 -687 -763 -702 -645 -671 -777 -581 -635 -625
2270f25J24j13K0Ol6r4J2qO2j03QK1K1k2J1L0M3o9K3Mn1j1K1n7J55nj2J2j95J45j02O7m5p9
$$ -625 -501 -614 -594 -588 -624 -718 -706 -714 -652 -755 -747 -726 -705 -727 -716 -686 -643 -712 -689 -685 -736 -747 -726 -783 -628 -633 -645 -633 -828 -683 -785 -718 -763 -842
2262h42J40O2mj4q7k5L2Q4L6j16p7p7K01J05j24lN3K5K1k6Mj23P8jj67N5Q1j4n7qJ49j12l3
$$ -842 -702 -640 -644 -658 -745 -770 -738 -654 -618 -734 -811 -888 -687 -582 -706 -709 -656 -631 -610 -636 -632 -755 -677 -678 -845 -790 -709 -723 -780 -788 -639 -751 -784
2254g84LP0n7oM6P9J6k41J03m2J5J29q8P8m1K3O3L6%p8q8l5O0Q5L0k0jn4L0j3m7M2m3m9R5
$$ -784 -781 -711 -768 -774 -728 -649 -633 -874 -771 -813 -798 -669 -757 -679 -720 -697 -634 -598 -598 -676 -764 -799 -739 -654 -624 -644 -645 -699 -669 -682 -729 -687 -730 -779 -684
2246f84m0K7K6L5K1PL8j53j3J03m7j75N2J09J1N8Q1k27m6M3J22J7N5j05J3J01j38oO2o5l5
$$ -684 -724 -697 -671 -636 -615 -608 -570 -723 -736 -633 -680 -855 -803 -694 -683 -625 -544 -771 -817 -774 -652 -635 -580 -685 -672 -571 -709 -715 -653 -718 -753
2239g53n2J36r8L8R4q8J52l9r6O5j16n2nJ15K9n0o0L2j01J47N7p9KJ09k3Qp9l9l3J23o1P4
$$ -753 -805 -669 -767 -729 -635 -723 -571 -610 -706 -641 -757 -809 -814 -699 -670 -720 -780 -748 -849 -702 -645 -724 -722 -613 -636 -628 -707 -746 -779 -656 -717 -643
2232f43l2j7p5O9k5l4Q1j27K1P8R2m6l0%m1M9m0O7k1l7P7r3J7M5j09mN3L5j4n5K8Oj2O0j3
$$ -643 -675 -692 -767 -698 -723 -757 -676 -803 -782 -704 -612 -658 -688 -688 -729 -680 -720 -653 -674 -711 -634 -727 -710 -665 -774 -778 -725 -690 -704 -759 -731 -725 -737 -677 -690
2224f90O5L3r7q1M7P2m3k8j3K5P7l1j0P9L2j65k1Ln3jM5O1r9L2m8O3LK1M1j1J10j53R8j05
$$ -690 -625 -592 -689 -770 -723 -651 -694 -722 -735 -710 -633 -664 -674 -595 -563 -728 -749 -746 -799 -800 -755 -694 -793 -761 -809 -746 -743 -722 -681 -692 -582 -735 -637 -742
2216g42kJ29o7L4j47j3L8R8m3J11j05L0j0n0ln9K0j3N1J11k2m2P1Jk32J50K6j7R2Pj11j14
$$ -742 -744 -615 -682 -648 -795 -808 -770 -672 -715 -604 -709 -679 -689 -739 -742 -801 -781 -794 -743 -632 -654 -696 -625 -624 -856 -706 -680 -697 -605 -598 -709 -823
2209h23K0J62j76O6O4L5j29q1J08lJ6m6R5n1J2jj2m1O4M1M2n8j9k5R5Q4r2p7J43K5j0k3k8
$$ -823 -803 -641 -817 -751 -687 -652 -781 -862 -754 -757 -741 -787 -692 -743 -731 -732 -744 -785 -721 -680 -638 -696 -715 -740 -645 -561 -653 -730 -587 -562 -572 -595 -623
2201f23n2nM7q9r4m4j2P6m7J12k0q6K22j54l3O6J0P4J0lj9n0o3M4k8kR4j30qp0M7JJ11o5k0
$$ -623 -675 -680 -633 -722 -816 -860 -872 -796 -843 -731 -751 -837 -615 -769 -802 -736 -726 -652 -642 -645 -664 -714 -777 -733 -761 -763 -669 -799 -807 -877 -830 -829 -718 -783 -803
2193h03N3K1j01J16M2p0k7P1J0p9P9n2M0O7K3k0J0p3J2N0k2K1n6k3J11m7j2j00O8J25K7j01
$$ -803 -750 -729 -830 -714 -672 -742 -769 -698 -688 -767 -688 -740 -700 -633 -610 -630 -620 -693 -681 -631 -653 -632 -688 -711 -600 -647 -659 -759 -691 -566 -539 -640
2186f40J3j45R8o1nj4k5j2P6J01j10O4K0k6L0l0Nj27l4J8K6kKN4JJ52j29J4L5q5m5M1N0l2
$$ -640 -627 -772 -674 -735 -740 -754 -779 -791 -715 -614 -724 -660 -640 -666 -636 -666 -661 -788 -822 -804 -778 -780 -778 -724 -723 -571 -700 -686 -651 -736 -781 -740 -690 -722
2178g22j5J67l3m7kL5M9j51J08q6O2O6j25p6J55q8Q7k8r5j41J32J6J08j3p4j6O0p3K0O0O0
$$ -722 -737 -570 -603 -650 -652 -617 -568 -719 -611 -697 -635 -569 -694 -770 -615 -703 -616 -644 -739 -880 -748 -732 -624 -637 -711 -727 -667 -740 -720 -660 -600
2171f00j17p0R9q8J65n2N0N1j15j03J00J0K4j45J11o0l2P6K5m2J0P0o1oP1L4q1o2O3j40JQ0
$$ -600 -717 -787 -688 -776 -611 -663 -613 -562 -677 -780 -680 -670 -646 -791 -680 -740 -772 -696 -671 -713 -703 -633 -694 -700 -629 -595 -676 -738 -675 -815 -814 -734
2164g34p1K77n7k00N0j5l8JQ3N8l4j6lk2O6q0M6J86k03j18J80M5j05J4P6q3r1N0o1j9O4o5
$$ -734 -805 -528 -585 -785 -735 -750 -788 -787 -704 -646 -680 -696 -699 -721 -655 -735 -689 -503 -706 -824 -644 -599 -704 -690 -614 -697 -788 -738 -799 -818 -754 -819
2156h19N3k2P7r0J21m2j3n2P8l0j9p0K31j16l6J37k1K2J0Ok4np2p2J11o2q6Q7n8M5J0k6J46
$$ -819 -766 -788 -711 -801 -680 -722 -735 -787 -709 -739 -758 -828 -597 -713 -749 -612 -633 -611 -601 -595 -619 -624 -696 -768 -657 -719 -805 -718 -776 -731 -721 -747 -601
2149f01l6o2p7P1m6M8l3J1m5P3l2MJ90K8n3jj7r4N4o7n7M5LM0NJ9n9K9k8o4J02j03M0J44Q7
$$ -601 -637 -699 -776 -705 -751 -703 -736 -725 -770 -697 -729 -725 -535 -507 -560 -561 -578 -672 -618 -685 -742 -697 -694 -654 -649 -630 -689 -660 -688 -752 -650 -753 -713 -569 -482
2141d82j18q4m1kM9n9P2m6P0j17m4M3Lj12J62l6m0m0o3K5P5L0P6k6j9m9p6J61L3qL2p4o0o1
$$ -482 -600 -684 -725 -727 -678 -737 -665 -711 -641 -758 -802 -759 -756 -868 -706 -742 -782 -822 -885 -860 -785 -755 -679 -705 -724 -773 -849 -688 -655 -663 -631 -705 -765 -826
2133h26R1rl7l5j05P3O9r9PJ52l3R1n8M0Q4o5PL0l8m6J42j10R9J38j21j93j%m8J14j8m2N1
$$ -826 -735 -744 -781 -816 -921 -848 -779 -878 -871 -719 -752 -661 -719 -679 -595 -660 -653 -623 -661 -707 -565 -675 -576 -438 -559 -752 -753 -753 -801 -687 -705 -747 -696
2125f96Qok1j12M8P7K5l7K9rm4Or8K0k9MJ56n0j5n2O4q2J45k2j2j34J02M2n5n7R2j04j6n4
$$ -696 -688 -694 -715 -827 -779 -702 -677 -714 -685 -694 -738 -732 -830 -810 -839 -835 -679 -729 -744 -796 -732 -814 -669 -691 -703 -837 -735 -693 -748 -805 -713 -817 -833 -887
2118h87J78Q0J46m6j58o2L5J1Q0j9mqo9O9o0m3p7K1NM6j12M1P0m5q1P1l2J97j30K02j5L6j05
$$ -887 -709 -629 -483 -529 -687 -749 -714 -703 -623 -642 -646 -654 -723 -654 -714 -757 -834 -813 -808 -762 -874 -833 -763 -808 -889 -818 -850 -653 -783 -581 -596 -560 -665
2110f65o1O1o6mN3j21j7r2N1J24m5N0k5l4Q6K6Qj4j13M1k7nN2J6k9Q3%k8K9N4l4l8J31o9j18
$$ -665 -726 -665 -731 -735 -682 -803 -820 -912 -861 -737 -782 -732 -757 -791 -705 -679 -671 -685 -798 -757 -784 -789 -737 -721 -750 -667 -667 -695 -666 -612 -646 -684 -553 -622 -740
2102g40J1Q4q8Rm6J26K5K3j27J1J6K8Nq3P3j41n3J88r8M6j6P4l5L2n7L1l0o0%j09J35P2oj2
$$ -740 -729 -645 -733 -724 -770 -644 -619 -596 -723 -712 -696 -668 -663 -746 -673 -814 -867 -679 -777 -731 -747 -673 -708 -676 -733 -702 -732 -792 -792 -901 -766 -694 -700 -712
2094g12j1Mo5N0J55j57OP5Pj65J2O3O0L4q0J46j00L4K1J03r7o1j6p1N5r7j4J29L2j07jo9J24
$$ -712 -723 -719 -784 -734 -579 -736 -730 -655 -648 -813 -801 -738 -678 -644 -724 -578 -678 -644 -623 -520 -617 -678 -694 -765 -710 -807 -821 -692 -660 -767 -768 -837 -713
2087g13p4q7P0R0j31O7Q2J2j39J48O1lm1L2k5k6p0m2J6L8l5l8O3J0M8k0JlJ18o6R2j25%q3
$$ -713 -787 -874 -804 -714 -845 -778 -696 -684 -823 -675 -614 -617 -658 -626 -651 -677 -747 -789 -773 -735 -770 -808 -745 -735 -687 -707 -706 -709 -591 -657 -565 -690 -690 -773
2079g73oP6j8m4L4QL4L3M6j5L5j83knL2J15r7k0J04N6j52Q5kq7j9L7Q3j6%K1r3p7M5M0J04
$$ -773 -779 -703 -721 -765 -731 -723 -689 -656 -610 -625 -590 -773 -775 -780 -748 -633 -730 -750 -646 -590 -742 -657 -659 -746 -765 -728 -645 -661 -661 -640 -733 -810 -765 -725 -621
2071f21q5J64j38%j8k3q7o9JM7j6J23M0m6J6klR6Rj10j9L7M0R2j66P5n7O4p4l1O8L2j62O2
$$ -621 -706 -542 -680 -680 -698 -721 -808 -877 -876 -829 -845 -722 -682 -728 -712 -714 -717 -621 -612 -722 -741 -704 -664 -572 -738 -663 -720 -656 -730 -761 -693 -661 -823 -761
2063g61K4KN5Nr8j0oj4pL3J7kQ8Pj12m4K02M7j19n4n1K5N6O1j5j4m5k7M6R7p6j69J56m0j11
$$ -761 -737 -735 -680 -675 -773 -783 -789 -803 -810 -777 -760 -762 -674 -667 -779 -823 -621 -574 -693 -747 -798 -773 -717 -656 -671 -685 -730 -757 -711 -614 -690 -859 -703 -743 -854
2055h54O9J19j49P5Jj32L5J36m1j3Q7r5J51j13M7K2M4N6n6p2L1p7n8O0p1Q9J1m2JJ14j3j74
$$ -854 -785 -666 -815 -740 -739 -871 -836 -700 -741 -754 -667 -762 -611 -724 -677 -655 -611 -555 -611 -683 -652 -729 -787 -727 -798 -709 -698 -740 -739 -625 -638 -812
2048h12J61M3N8q2Mj1K1j30j12j4J5L6J32n3l1r8OK36o3om1j13M8m4R9J02j38P9KJ4j7k6J2
$$ -812 -651 -608 -550 -632 -628 -639 -618 -748 -860 -874 -859 -823 -691 -744 -775 -873 -867 -631 -694 -700 -741 -854 -806 -850 -751 -649 -787 -708 -706 -692 -709 -735 -723
2040g23l3k1r0J35n6O4No0j0L0J37J3r4j51P8Q9q5J11n8J13k4j38J41p4%k3O1p3M9j8J8p5
$$ -723 -756 -777 -867 -732 -788 -724 -719 -779 -789 -759 -622 -609 -703 -854 -776 -687 -772 -661 -719 -606 -630 -768 -627 -701 -701 -724 -663 -736 -687 -705 -687 -762
2033g62r9L5J68PM4q6Nm6p7J7o5L3l5J18n5JJ49%L7j59k0oP1L1N9K1o2K8K0lJ01j94rJ7P5
$$ -762 -861 -826 -658 -651 -607 -693 -688 -734 -811 -794 -859 -826 -861 -743 -798 -797 -648 -648 -611 -770 -790 -796 -725 -694 -635 -614 -676 -648 -628 -631 -530 -724 -733 -716 -641
2025f41q1O9K0J01q3j09J5JK7J26q4Jq6R4k3J9j2m4n0k1p3j1J5Q5K12q2j05j02M4mP1K2p6
$$ -641 -722 -653 -633 -532 -615 -724 -709 -708 -681 -555 -639 -638 -724 -630 -653 -634 -646 -690 -740 -761 -834 -845 -830 -745 -533 -615 -720 -822 -778 -782 -711 -689 -765
2018g65J9n7jQ3m1l1LK5N4N2r5J55J9m9k1j24m0k4K01l3n0l8M4L6jRK4j40O7L7J31j33q1p9
$$ -765 -746 -803 -804 -721 -762 -793 -790 -765 -711 -659 -754 -599 -580 -629 -650 -774 -814 -838 -637 -670 -720 -758 -714 -678 -679 -670 -646 -786 -719 -682 -551 -684 -765 -844
2010h44qM7nP3O3r1J71m0l9j24J04J7Oj8l4j5o6K0O9q4Q7k7l6J0K7M7JJl6J0j7j1k0K1N1J7
$$ -844 -852 -805 -810 -737 -674 -765 -594 -634 -673 -797 -693 -676 -670 -688 -722 -737 -803 -783 -714 -798 -711 -738 -774 -764 -737 -690 -689 -688 -724 -714 -731 -742 -762 -741 -690 -673
2002f73j04J7j3L6oJ44K8l5j81M3L7J24j21K2l3jJ6q1Q9j32K0J67q1j9P1J2m0N5J15k10j7
$$ -673 -777 -760 -773 -737 -743 -599 -571 -606 -787 -744 -707 -583 -704 -682 -715 -716 -700 -781 -692 -824 -804 -637 -718 -737 -666 -654 -694 -639 -524 -734 -751
1994g51M1P5p4M1m0L0o2N5q9R2l6j12n2R3P8l0M6jj03nJ18P2l3r2j11NJ05j4L5Jj6%L9Po4
$$ -751 -710 -635 -709 -668 -708 -678 -740 -685 -774 -682 -718 -830 -882 -789 -711 -741 -695 -696 -799 -804 -686 -614 -647 -739 -850 -845 -740 -754 -719 -718 -734 -734 -695 -688 -752
1986g52k6mJ33r8l4J04L8n0j05J05O0O7j60J2j9O6q4J43m5K3l2l1m8J3M8J08n8l1n1J56j36
$$ -752 -778 -782 -649 -747 -781 -677 -639 -689 -794 -689 -629 -562 -722 -710 -729 -663 -747 -604 -649 -626 -658 -689 -737 -724 -676 -568 -626 -657 -708 -552 -688
1979f88p5J23J15J4n1N2j9K0j14L5n2m5o9n5K22j57j00JP3J6J7KJ36n4njRJ5p4R0j00Ko1K8
$$ -688 -763 -640 -525 -511 -562 -510 -529 -509 -623 -588 -640 -685 -754 -809 -587 -744 -844 -843 -770 -754 -737 -735 -599 -653 -658 -659 -650 -635 -709 -619 -719 -717 -778 -750
1972g50J38qQj1j0p1M2J51j36J01j07Kj03j9j0Q0P0K0K1l0RK1q1j43J09k2kp5rL6J65J9q8
$$ -750 -612 -620 -612 -623 -633 -704 -662 -511 -647 -546 -653 -651 -754 -773 -783 -703 -633 -613 -592 -622 -613 -592 -673 -816 -707 -729 -731 -806 -815 -779 -614 -595 -683
1964f83nq4k3J47J26j49J47J13j81j14R6j62Kj1O8K2P0j2p9M4K3l3n6J1j26J23j8L8J21l2
$$ -683 -688 -772 -795 -648 -522 -671 -524 -411 -592 -706 -610 -772 -770 -781 -713 -691 -621 -633 -712 -668 -645 -678 -734 -723 -849 -726 -744 -706 -585 -617
1957f17J02m3q4P5n0K2l3p7L4r3J4L8K6q2J08Q0K3n9m2Q8K4j62R2L2q9nO9K5j54o8P6Q0o9
$$ -617 -515 -558 -642 -567 -617 -595 -628 -705 -671 -764 -750 -712 -686 -768 -660 -580 -557 -616 -658 -570 -546 -708 -616 -584 -673 -678 -609 -584 -738 -806 -730 -650 -719
1950g19M7j47Q8l3J25q0j29J54m5j23J38P9k6m2O3P5j73P5O3l3m9P6p9j1L9RNo6l9M8L4p5
$$ -719 -672 -819 -731 -764 -639 -719 -848 -694 -739 -862 -724 -645 -671 -713 -650 -575 -748 -673 -610 -643 -692 -616 -695 -706 -667 -658 -653 -719 -758 -710 -676 -751
1942g51N0Roj9Q3q8n4l2O4P5N6j47J52N2l0j04J1j4j9J22J26k30jl7kKMO7j29j24K14M4j0
$$ -751 -701 -692 -698 -717 -634 -722 -776 -808 -744 -669 -613 -760 -608 -556 -586 -690 -679 -693 -712 -590 -464 -694 -695 -732 -734 -732 -728 -661 -790 -914 -700 -656 -666
1935f66j83J02R8R6p6n6J7J16n2p0l0n4P0M0Ko4O3K1j36q8J51k6O7p9L4p2J54N8q8L6q5J11
$$ -666 -849 -747 -649 -553 -629 -685 -668 -552 -604 -674 -704 -758 -688 -648 -646 -710 -647 -626 -762 -850 -699 -725 -658 -737 -703 -775 -621 -563 -651 -615 -700 -589
1927e89j3O2l07Q4K8J70j16n5L4J1J34j36p9L8P3m1n2M7m1J5m4N9K5L5n1m7K1n8Q5l2k2J8
$$ -589 -602 -540 -847 -763 -735 -565 -681 -736 -702 -691 -557 -693 -772 -734 -661 -702 -754 -707 -748 -733 -777 -718 -693 -658 -709 -756 -735 -793 -708 -740 -762 -744
1920g44N4J18j97O3k2Q9j45J8m9O0k9M3m8J48r8p5J65k0j42J14j31R0O6L2p7l6R1M3Q4j06
$$ -744 -690 -572 -769 -706 -728 -639 -784 -766 -815 -755 -784 -741 -789 -641 -739 -814 -649 -669 -811 -697 -828 -738 -672 -640 -717 -753 -662 -619 -535 -641
1913f41j7L2K1r5l1qN2J35P9m6q3L0n0r6J09p2Kn3p5J43p0M8j1L2J15n6Olm1L1j87P9J41j17
$$ -641 -658 -626 -605 -700 -731 -739 -687 -552 -473 -519 -602 -572 -622 -718 -609 -681 -679 -732 -807 -664 -734 -686 -697 -665 -550 -606 -600 -603 -644 -613 -800 -721 -580 -697
1905f97M7J05o2q6O3ok1r0R7l4J7k3pj27Q1j4NN3j16O9J50LK4k9o7LNKp6l8M7l7P7j3Rl1J29
$$ -697 -650 -545 -607 -693 -630 -636 -657 -747 -650 -684 -667 -690 -697 -824 -743 -757 -752 -699 -815 -746 -596 -593 -569 -598 -665 -662 -657 -655 -731 -769 -722 -759 -682 -695 -686 -717 -588
1897e88jN7p4o8K9l9P2p3q5MJ2K6Nj18J08l9M0jP2m6K6r1N5j60J52J51n3n3Qk10P4J69K3p4
$$ -588 -589 -532 -606 -674 -645 -684 -612 -685 -770 -766 -754 -728 -723 -841 -733 -772 -732 -733 -661 -707 -681 -772 -717 -877 -725 -574 -627 -680 -672 -882 -808 -639 -616 -690
1889f90K7O7r0l5L5l2K3J11j1jK3q5l1m3N3L3K3l4J9j63P4Q6j46l8k3M0OJ8oJ20m4R0K4j10
$$ -690 -663 -596 -686 -721 -686 -718 -695 -584 -595 -596 -573 -658 -689 -732 -679 -646 -623 -657 -638 -801 -727 -641 -787 -825 -848 -808 -802 -784 -790 -670 -714 -624 -600 -710
1881g10P0m1L9Mj00J2K4N8J5o4R0l8kj18L1K9LK7p0n6M9R4p6%J39k8J53o0j05J4m7Q7l5J35
$$ -710 -640 -681 -642 -638 -738 -726 -702 -644 -629 -693 -603 -641 -643 -761 -730 -701 -698 -671 -741 -797 -748 -654 -730 -730 -591 -619 -466 -526 -631 -617 -664 -577 -612 -477
1874d77J37l9j3l7nj52L3j48N6M8r8K8k8K9j19M9J74o8J9j6r0q3R6M2r9n0J18O8n8j09K6P3
$$ -477 -340 -379 -392 -429 -434 -586 -553 -701 -645 -597 -695 -667 -695 -666 -785 -736 -562 -630 -611 -627 -717 -800 -704 -662 -761 -811 -693 -625 -683 -792 -766 -693
1866f93k5j8K33j21j02Q3Ml6P6p5p6R3K9k6j08J00nj2N8kLq7J16j09K5j47J15Q0r2P2KN5J6
$$ -693 -718 -736 -503 -624 -726 -643 -639 -675 -599 -674 -750 -657 -628 -654 -762 -662 -667 -679 -621 -623 -620 -707 -591 -700 -675 -822 -707 -627 -719 -647 -645 -590 -574
1859e74m1j00P4r2J71l1O5j61J35K4pj03Q1k2o4j26oRL3O2o8r1N3n6J29L4L2j09R7P3k4no5
$$ -574 -615 -715 -641 -733 -562 -593 -528 -689 -554 -530 -537 -640 -559 -581 -645 -771 -777 -768 -735 -673 -741 -832 -779 -835 -706 -672 -640 -749 -652 -579 -603 -608 -673
1851f73O1L8k6p0q6o1k5J27N8Qr1J47N4j73M1m4r9P4J03O6o7LJ%K4j18M7j18j6R6J15r2p4
$$ -673 -612 -574 -600 -670 -756 -817 -842 -715 -657 -649 -740 -593 -539 -712 -671 -715 -814 -740 -637 -571 -638 -635 -634 -634 -610 -728 -681 -799 -815 -719 -604 -696 -770
1844g70J27n1Mj0M9p1oj8M7M3N8o6j42J71l9n3j8J47p7o7O7q6J20j04J3nl3J06m1p2J47r2
$$ -770 -643 -694 -690 -700 -651 -722 -728 -746 -699 -656 -598 -664 -806 -635 -674 -727 -745 -598 -675 -742 -675 -761 -641 -745 -732 -737 -770 -664 -705 -777 -630 -722
1836g22R6jJ7j6O6k8j13q3j9J12j32Q5J3Q9n2k5p0P3J03j79J00J5K7n1O0M0J41j49j76K5l0
$$ -722 -626 -627 -610 -626 -560 -588 -701 -784 -803 -691 -823 -738 -725 -636 -688 -713 -783 -710 -607 -786 -686 -671 -644 -695 -635 -595 -454 -603 -779 -754 -784
1829g84QK8k9O7L7k0O0Rl3rO3K2k17J39K0N0j63J5J07k8pj5L2o2Np2J11k0L1m3j01m1j1N0
$$ -784 -776 -748 -777 -710 -673 -693 -633 -624 -657 -666 -603 -581 -798 -659 -639 -589 -752 -737 -630 -658 -665 -680 -648 -710 -705 -777 -666 -686 -655 -698 -799 -840 -851 -801
1822h01J15O5j4m7P5o2NJ7L9j13j03J11J03jj47k9M8n7K0J40m3%p8K7K8J9p4J6n8J15R8o4
$$ -801 -686 -621 -635 -682 -607 -669 -664 -647 -608 -721 -824 -713 -610 -611 -758 -787 -739 -796 -776 -636 -679 -679 -757 -730 -702 -683 -757 -741 -799 -684 -586 -650
1814f50k6Q5j10o0J39p1l4J7j6m8Q4J6Rj7J6R6o5k7L8p4J04j36j7l6J22Mp6QQ4J1l3r4M1N3
$$ -650 -676 -591 -701 -761 -622 -693 -727 -710 -726 -774 -690 -674 -665 -682 -666 -570 -635 -662 -624 -698 -594 -730 -747 -783 -661 -657 -733 -725 -641 -630 -663 -757 -716 -663
1806f63m5n2J6R0Q6K4o4n8j9r5L8P1m8R8P4j94O0M6k5k14J49lK9L8l1R3k13J06j5P9P6r4J0
$$ -663 -708 -760 -744 -654 -568 -544 -608 -666 -685 -780 -742 -671 -719 -621 -547 -741 -681 -635 -660 -874 -725 -728 -699 -661 -692 -599 -812 -706 -721 -642 -566 -660 -650
1799f50P3j21n8J34j21o1J41p4P8Jkj58L8O6O9P4j60N2q2Q6n7O5N0O3r8j7R3j79q1M8R5K5
$$ -650 -577 -698 -756 -622 -743 -804 -663 -737 -659 -658 -660 -818 -780 -714 -645 -571 -731 -679 -761 -675 -732 -667 -617 -554 -652 -669 -576 -755 -836 -788 -693 -668
1792f68q3R7l8K1J8J8L7l1j3Mo9n4J51l8rN8N1mr5M8j71L4K8L6m0O6p7K8j10J8N2J11R1P4
$$ -668 -751 -654 -692 -671 -653 -635 -598 -629 -642 -638 -707 -761 -610 -648 -657 -599 -548 -552 -647 -599 -770 -736 -708 -672 -712 -646 -723 -695 -805 -787 -735 -624 -533 -459
1784d59j31Pnq4o0K1J28o0n2QKj4n3J45kl8r1M6J4qJ1Q1K1j04mj38M4J33o1k3Q0O8n0r9R3
$$ -459 -590 -583 -588 -672 -732 -711 -583 -643 -695 -687 -685 -699 -752 -607 -609 -647 -738 -692 -678 -686 -675 -594 -573 -677 -681 -819 -775 -642 -703 -726 -646 -578 -628 -727 -634
1776f34L4n2j14J70P1j6l5n4p3M0R5q3m3K5j03L7Q9P8j51n1J42N8o5J78k07k3q1P5o3mN6k0
$$ -634 -600 -652 -766 -596 -525 -541 -576 -630 -703 -663 -568 -651 -694 -669 -772 -735 -646 -568 -719 -770 -628 -570 -635 -457 -664 -687 -768 -693 -756 -760 -704 -724
1768g24J42j41QP2L1ol1m4l0P3n7p3J53j12l9M4K0K7J6P8j85nO9pkj8J07K4p5r9k9O1r0rQ8
$$ -724 -582 -723 -715 -643 -612 -618 -649 -693 -723 -650 -707 -780 -627 -739 -778 -734 -714 -687 -671 -593 -778 -783 -714 -721 -723 -741 -634 -610 -685 -784 -813 -752 -842 -851 -763
1760g63J6q8J4NL1M2J20q9J17r2j16J27j25J66q4m0J16M6r4O3l6N3n0j51Q5Jj5Q8j30M7N3
$$ -763 -747 -835 -821 -816 -785 -743 -623 -712 -595 -687 -803 -676 -801 -635 -719 -759 -643 -597 -691 -628 -664 -611 -661 -812 -727 -726 -741 -653 -783 -736 -683
1753f83O1n3n5R1m5k7oL4P4j32K4l5p2J05O2p6M8N9p5L3o8%jJ08m1n4j05P7NJ2n4O3l2Q2K6
$$ -683 -622 -675 -730 -639 -684 -711 -717 -683 -609 -741 -717 -752 -824 -719 -657 -733 -685 -626 -701 -668 -736 -736 -737 -629 -670 -724 -829 -752 -747 -735 -789 -726 -758 -676 -650
1745f50o6O5q7k8L4L5K9p2J11L7n6k7Pj8P2k00J3n3N5j66K30m8Q0J02j2L1j38J42OL3o9q5
$$ -650 -716 -651 -738 -766 -732 -697 -668 -740 -629 -592 -648 -675 -668 -686 -614 -814 -801 -854 -799 -965 -735 -783 -703 -601 -613 -582 -720 -578 -572 -539 -608 -693
1738f93N4n7L5j3N2l4l7n3j43R6L9N6Lj02r7K69k5R2k0r4Q3jo4j9p1l9n7LN3J04M4M9q0P8
$$ -693 -639 -696 -661 -674 -622 -656 -693 -746 -889 -793 -754 -698 -695 -797 -894 -625 -650 -558 -578 -672 -589 -590 -654 -673 -744 -783 -840 -837 -784 -680 -636 -587 -667 -589
1730e89mk8r6M4J41M1m7l6j6j%J8pj20m7O6P9k10J83K4m3N2j33%P3j71j0K38p9j5J1P0K8L7
$$ -589 -593 -621 -717 -673 -532 -491 -538 -574 -590 -591 -591 -573 -580 -700 -747 -681 -602 -812 -629 -605 -648 -596 -729 -729 -656 -827 -837 -599 -678 -693 -682 -612 -584 -547
1722e47p1nN6N8J62J62k6n0j70k21l8MK2k3O6r0M9Ll9K9O8P4j09k0L4M6r0Nm9L2K1L7J6Q1
$$ -547 -618 -623 -567 -509 -347 -185 -211 -261 -431 -652 -690 -686 -664 -687 -621 -711 -662 -659 -698 -669 -601 -527 -636 -656 -622 -576 -666 -661 -710 -678 -657 -620 -604 -523
1715e23k4r2j45J00R8J2p8J14n8j59J83K2l1m3M8m1k8lL1K0M8j17o4J64j27QN7J2N0j37J0
$$ -523 -547 -639 -784 -684 -586 -574 -652 -538 -596 -755 -572 -550 -581 -624 -576 -617 -645 -648 -617 -597 -549 -666 -730 -566 -693 -685 -628 -616 -566 -703 -693
1708f93L2M9q1K1J9l3N7Q7l2l6J82n8j6oP8M2j01j28J50j70J8L5p1J21nJ2k4M1J30k4j75O6
$$ -693 -661 -612 -693 -672 -653 -686 -629 -542 -574 -610 -428 -486 -502 -508 -430 -388 -489 -617 -467 -637 -619 -584 -655 -534 -539 -527 -551 -510 -380 -404 -579 -513
1700e13M0L9q7J8J34j18p1l5L4O8j8K6N9J7k07J09R1j68j3J9o4J03l5Q6K6l3j28P8j68m6J10
$$ -513 -473 -434 -521 -503 -369 -487 -558 -593 -559 -491 -509 -483 -424 -407 -614 -505 -414 -582 -595 -576 -640 -537 -572 -486 -460 -493 -621 -543 -711 -757 -647
1693f47N7k18J61J90o9j4q6R7j8L3j33j30Q9RK5l6J39n6K2m7J45p9p7n7L1m9k1p3K32L8L3
$$ -647 -590 -808 -647 -457 -526 -540 -626 -529 -547 -514 -647 -777 -688 -679 -654 -690 -551 -607 -585 -632 -487 -566 -643 -700 -669 -718 -739 -812 -580 -542 -509
1686e09K8n3lq2LJM0l6m2%P8j9r9Q0j0J13j32J75j14j42R3L6O9j66J68r8j32j2k7P2M6j44
$$ -509 -481 -534 -537 -619 -616 -615 -575 -611 -653 -653 -575 -594 -693 -613 -623 -510 -642 -467 -581 -723 -630 -594 -525 -691 -523 -621 -753 -765 -792 -720 -674 -818
1679h18J39o8R0j20O1m0jJ28p1P2m4l6J64o3L3l0p4j8K7o9Q7J6q7J18J7p5Jq2j9k2k0J24J4
$$ -818 -679 -747 -657 -777 -716 -756 -757 -629 -700 -628 -672 -708 -544 -607 -574 -604 -678 -696 -669 -738 -651 -635 -722 -604 -587 -662 -661 -743 -762 -784 -804 -680 -666
1671f66p6J19k0j3OJ26k7k5Jr6J43P7j87m4R6j21O2o1K3qJ1r8P8Qj9O0J46p8j19LpO7k6o5
$$ -666 -742 -623 -643 -656 -650 -524 -551 -576 -575 -671 -528 -451 -638 -682 -586 -707 -645 -706 -683 -691 -680 -778 -700 -692 -711 -651 -505 -583 -702 -699 -706 -639 -665 -730
1663g30r8J29K1n7k2R7o2NQ1p2o4n2J56L6L5pM8N0n2M3o2K19K54M99P24L94k05q39o49k10
$$ -730 -828 -699 -678 -735 -757 -660 -722 -717 -636 -708 -772 -824 -668 -632 -597 -604 -556 -506 -558 -515 -577 -358 -104 395 1119 1513 1308 469 -180 -390
1657c90j93K8M7N5q9j03Q4j76K1L1r1J50l2PO3j7J08P2j08K71J4l2K84N50J514K100J702k33
$$ -390 -583 -555 -508 -453 -542 -645 -561 -737 -716 -685 -776 -626 -658 -651 -588 -605 -497 -425 -533 -262 -248 -280 4 554 2068 4168 5870 5637
1650E637k336k078q28m60k60j94l2O4Rj20j2N6j9qJ54j36K5oq0Q9P2M3R6Q3Q6K19L29J318
$$ 5637 3301 1223 395 -65 -325 -519 -551 -487 -478 -598 -610 -554 -573 -581 -427 -563 -538 -544 -624 -535 -463 -420 -324 -241 -155 64 393 1711
1644A711K088J805L00j976k272j155n04k13j33nN6J65J65pJ4j39j38r6j63L4J20O3q2J22M6
$$ 1711 3799 5604 5904 3928 1656 501 -3 -216 -349 -354 -298 -133 32 25 39 -100 -238 -334 -497 -463 -343 -280 -362 -240 -194
1638a94L69J22j76k56MK07P22O45K43o19p19n58j60j42M0K6j74R8%j55qJ54n1k8J5l0j39J01
$$ -194 175 297 121 -135 -131 76 798 1443 1686 1067 348 -210 -370 -512 -472 -446 -620 -522 -522 -677 -685 -531 -582 -610 -595 -625 -764 -663
1632f63kK7j7J71M0k5J36r0J27R0K6j45j96K2K6j9q0QJ48j27P5j08q3m4J9Nj52J32L2J36M5
$$ -663 -665 -638 -655 -484 -444 -469 -333 -423 -296 -206 -180 -325 -521 -499 -473 -492 -572 -564 -416 -543 -468 -576 -659 -703 -684 -679 -831 -699 -667 -531 -486
1625d86o8k9K00q7J7J56O8R9n1n9p2Q5lL7Q1Q9rK73N69P41K104L656L754J800j844m315l754
$$ -486 -554 -583 -383 -470 -453 -297 -229 -130 -181 -240 -312 -227 -230 -193 -112 -23 -32 241 810 1551 3655 7311 11065 12865 11021 6706 2952
1618B952j583n62m57k62j40j56k7j39k16K74k5K7k03R1J5q7P0J6L9m7j9k3j93l9J30m4J9R3
$$ 2952 1369 807 350 88 -52 -208 -235 -374 -590 -316 -341 -314 -517 -426 -411 -498 -428 -412 -373 -420 -439 -462 -655 -694 -564 -608 -589 -496
1612d96k5R4qK9j45LL5K8N7K34K3Q1Q5K01M46Q89J667K127J663l61k451k593j152n37j70k38
$$ -496 -521 -427 -435 -406 -551 -548 -513 -485 -428 -194 -171 -90 -5 196 642 1531 3198 5325 6988 6627 4176 1583 431 -106 -276 -514
1606e14O4q3J2J9L1m1j1l9O5p1R2n2l7n3q3L4L5P0Q2q3j3J73l7K4j0p5n1R4O9l2j28N1n7N0
$$ -514 -450 -533 -521 -502 -471 -512 -523 -562 -497 -568 -476 -528 -565 -618 -701 -667 -632 -562 -480 -563 -576 -403 -440 -416 -426 -501 -552 -458 -389 -421 -549 -498 -555 -505
1598e05k2J70Lp4j42m3J49l3j34Q1J13J34L1j13j39j67j47J60L7J71J04L05M86M63J12k98
$$ -505 -527 -357 -354 -428 -570 -613 -464 -497 -631 -550 -437 -303 -272 -385 -524 -691 -838 -678 -641 -470 -366 -61 425 888 1000 702
1592G02m74m59q8j10k8P1N6J6n5Q8P2j05l5Q8q7N2n2M4n0J02r9j1j42n1j05L3kM9J61m6N2
$$ 702 228 -231 -319 -429 -457 -386 -330 -314 -369 -281 -209 -314 -349 -261 -348 -296 -348 -304 -354 -252 -351 -362 -504 -555 -660 -627 -629 -580 -419 -465 -413
1585d13N1R6J69J02M1j07p0r7j03J8l7J57p8j33k5P5P9Q2M5q3J06J21K66J89o0m98m8o9K75
$$ -413 -362 -266 -97 5 46 -61 -131 -228 -331 -313 -350 -193 -271 -404 -429 -354 -275 -193 -148 -231 -125 -4 262 451 391 -107 -155 -224 51
1579E1K20M06O02M06k86n33n05k19j82P5j30K1Kn1J57j41rj0J56J63L20L29R6k70j60lN87
$$ 51 271 677 1279 1685 1399 866 361 142 -40 35 -95 -74 -72 -123 34 -107 -116 -126 30 193 513 842 938 668 508 505 1092
1572A092Q64M87L55L20O72Q67Q49J515K965O573J9102L5340L8408K2663j6008m0689m1965
$$ 1092 1956 2443 2798 3118 3790 4657 5506 7021 9986 16559 35661 71001 109409 132072 116064 75375 33410
1569C3410j7014n715k273n23l87j221j418j411q34o34l13m4r3k5R5O6QJ42K2q6p8J37P59Q34
$$ 33410 16396 10681 8408 7885 7498 6277 4859 3448 2614 1980 1667 1623 1530 1505 1600 1666 1674 1816 1838 1752 1674 1811 2570 3404
1563C404M64m56o63o86l65rk56k81r0L6J30J99K50K10r7J28j1J96M3K72K47P3P9K01L90O84
$$ 3404 3868 3412 2749 2063 1698 1689 1433 1152 1062 1098 1228 1427 1677 1887 1790 1918 1907 2103 2146 2418 2665 2738 2817 3018 3408 4092
1557D092M99L63K45J24l3l89j69J91M93N33P26Q10L48N85M23M82P46Q91J041J281J430J588
$$ 4092 4591 4954 5199 5323 5290 4901 4732 4923 5416 5949 6675 7485 7833 8418 8841 9323 10069 10960 12001 13282 14712 16300
1552A6300J589J789K152L039L809M997O317R213J2562J5942J7741J9492K7248M9824J01176
$$ 16300 17889 19678 21830 24869 28678 33675 39992 49205 61767 77709 95450 114942 142190 192014 293190
1549B93190K33869N58780P19606O54351J15102n82925r26959n62251k17748r9801n3434l1188
$$ 293190 527059 1085839 1805445 2459796 2574898 1991973 1065014 502763 285015 185214 131780 100592
1546A00592j8065j1991j1798j1307q431n651m741m303m002k657j878j416j455j433j582j206
$$ 100592 82527 70536 58738 47431 39000 33349 28608 24305 20303 17646 15768 14352 12897 11464 9882 8676
1542H676q14o08n37n86m10k88k28k02l01k87l02n73l46k88l35l7Q0mj64k09j83q0o4Mj61j76
$$ 8676 7862 7254 6717 6131 5721 5433 5205 5003 4702 4415 4113 3540 3194 2906 2571 2534 2614 2610 2446 2237 2054 1974 1910 1914 1753 1577
1536A577k82q1K7K3o4K55K22K44K74K83J90K4j87j47rj48n41m01j34M0l6l35j52n4P4J77j3
$$ 1577 1295 1214 1241 1264 1200 1455 1677 1921 2195 2478 2668 2692 2505 2358 2349 2201 1660 1259 1125 1165 1129 794 642 588 662 839 826
1530H26K55P0j35r0l3L08P79J681J985J451l71k114j964j161n53k50j26J05J25M15M51J0m16
$$ 826 1081 1151 1016 926 893 1201 1980 3661 5646 7097 6726 4612 2648 1487 934 684 558 663 788 1203 1654 1664 1248
1525A248m60m65n8k20j44j36j19M7N24O13L86R6j67J50Q75P37M38j125j209k98j35O4J9n8
$$ 1248 788 323 265 45 -99 -235 -354 -307 217 830 1216 1312 1145 1295 2170 2907 3345 2220 1011 713 578 642 661 603
1519F03q0j12j41j03R5R0K84K78j84m63k04lk24J0l8j29M2P4O3r0on8L3o0RM9q5Q2N5j84M0
$$ 603 523 411 270 167 262 352 636 914 730 267 63 60 -164 -154 -192 -321 -279 -205 -142 -232 -238 -296 -263 -323 -314 -265 -350 -268 -213 -397 -357
1512c57O5o7kP0j09p4m1J3J49Q6q5o2O9l8mk7J31jn5L8O0j38O1opPK8j40p6M2j34O2l7J94
$$ -357 -292 -359 -361 -291 -400 -474 -515 -502 -353 -267 -352 -414 -345 -383 -387 -414 -283 -284 -339 -301 -241 -379 -318 -324 -331 -324 -296 -436 -512 -470 -604 -542 -579 -385
1505c85l5n0Q4M7k32p3J59J59K4O3K2K42M5O0N8k99o2j17j57j07L7P8Q5Qm5j7J09M1k3p8j67
$$ -385 -420 -470 -386 -339 -571 -644 -485 -326 -302 -239 -217 25 70 130 188 -111 -173 -290 -447 -554 -517 -439 -354 -346 -391 -408 -299 -258 -281 -359 -526
1497e26P8Q3O1R7P5J6N9n4l08r2Po2q3J1N8J49L7O0L8P1P1j04j49j62J09rnr2N8J6p9m5K6
$$ -526 -448 -365 -304 -207 -132 -116 -57 -111 -419 -511 -504 -566 -649 -638 -580 -431 -394 -334 -296 -225 -154 -258 -407 -569 -460 -469 -474 -566 -508 -492 -571 -616 -590
1490e90j3J64N2k8j35m9j03pk2J76N1Lr0L1l8j00J65p6R1P9N6O1j16M7o2l2o9R0L6N2l5rJ24
$$ -590 -603 -439 -387 -415 -550 -599 -702 -709 -731 -555 -504 -501 -591 -560 -598 -698 -533 -609 -518 -439 -383 -322 -438 -391 -453 -485 -554 -464 -428 -376 -411 -420 -296
1482b96l7j26Ol5oM9l4q1m1j15K14K9j5K5K3Kj0O0l1L1L2J34j33L9J33J01m7P4P2M37M24J271
$$ -296 -333 -459 -453 -488 -494 -445 -479 -560 -601 -716 -502 -473 -488 -463 -440 -438 -448 -388 -419 -388 -356 -222 -355 -316 -183 -82 -129 -55 17 454 878 2149
1475B149K652L952L539N39l162m577k772j277n47l75k61Jj71l2j32l9M0r3M1P5k8m0k9m1j34
$$ 2149 4801 8753 12292 12831 9669 5092 2320 1043 496 121 -140 -139 -310 -342 -474 -513 -473 -566 -525 -450 -478 -518 -547 -588 -722
1469g22P2J07Pj75Q1J04j5j17N0l5K7LQ1n3j58K5k5R6r9J19k3K2N7J9J6j6kM1j4j67J1J49
$$ -722 -650 -543 -536 -711 -630 -526 -541 -658 -608 -643 -616 -613 -532 -585 -743 -718 -743 -647 -746 -627 -650 -628 -571 -552 -536 -552 -554 -513 -527 -694 -683 -534
1462e34J8n1q2M9PL4J48qqJ01N8J36Ql7j57k21M8K1n6J21j00l1k4M3qN4j36P0R1p8nM2K4J77
$$ -534 -516 -567 -649 -600 -593 -559 -411 -419 -427 -326 -268 -132 -124 -161 -318 -539 -491 -470 -526 -405 -505 -536 -560 -517 -525 -471 -607 -537 -446 -524 -529 -487 -463 -286
1454b86l2j2L7l4l8q1o9J00j0o4n8m2J27j7j23j0J07l0k4J32N5l0j42n8Q9p1j44MJ86l7J4
$$ -286 -318 -330 -293 -327 -365 -446 -515 -415 -425 -489 -547 -589 -462 -479 -602 -612 -505 -535 -559 -427 -372 -402 -544 -602 -513 -584 -728 -724 -538 -575 -561
1447e61j7O3q9K16j85o8P5q8M0J9p0J46O0q3p9j15Q1J44L4j0j2j12K6Q3o5o8P5o1N8J4JN3
$$ -561 -578 -515 -604 -388 -573 -641 -566 -654 -614 -595 -665 -519 -459 -542 -621 -736 -655 -511 -477 -487 -499 -611 -585 -502 -567 -635 -560 -621 -563 -549 -548 -495
1440d95o5P3o3q5n9N3N6qJ35j16l2J1R3O0k4o9o6L9K08l7j59R2L4m4k8n3j6MJ6j34kL9L4j1
$$ -495 -560 -487 -550 -635 -694 -641 -585 -593 -458 -574 -606 -595 -502 -442 -466 -535 -601 -562 -354 -391 -550 -458 -424 -468 -496 -549 -565 -561 -545 -679 -681 -642 -608 -619
1432f19K7o8N1j2L8o6k5N6j9n6O8m1j8Q9rO7p7N1L1Q5j70Q6j89R1o5J75m0o7M7LN4M3j13K0
$$ -619 -592 -660 -609 -621 -583 -649 -674 -618 -637 -693 -625 -666 -684 -595 -604 -537 -614 -563 -532 -447 -617 -531 -720 -629 -694 -519 -559 -626 -579 -576 -522 -479 -592 -572
1424e72m7j6O3j14J00P6j46O1j50J02K1o%Q0J3o2n8J16l9K3j6Q8l3P1j40J84J08J9j72j47
$$ -572 -619 -635 -572 -686 -586 -510 -656 -595 -745 -643 -622 -628 -628 -548 -535 -597 -655 -539 -578 -555 -571 -483 -516 -445 -585 -401 -293 -274 -446 -593
1417e93Nn1J38l1P5m4j15m1N5L5r8n5J40l1l4M2L5N9q6Ll5O5N4p5k6N6K05O6j75j99L4j6j4
$$ -593 -588 -639 -501 -532 -457 -501 -616 -657 -602 -567 -665 -720 -580 -611 -645 -603 -568 -509 -595 -592 -627 -562 -508 -583 -609 -553 -348 -282 -457 -656 -622 -638 -652
1410f52K4lO2M3j29Q7j8j24Q3o3k4q3R4O4J78j8k1j41M7n0J82P3n6m4OP3r5O1j18R8j65J18
$$ -652 -628 -631 -569 -526 -655 -568 -586 -710 -627 -690 -714 -797 -703 -639 -461 -479 -500 -641 -594 -644 -462 -389 -445 -489 -483 -410 -505 -444 -562 -464 -629 -511
1403e11n2k6O7J7M3j7r3r9k9P7r8J15m0O6mm5k1O5j63k6J7K7R0J34M5Mp7j41n9qP0R8J12m6
$$ -511 -563 -589 -522 -505 -462 -479 -572 -671 -700 -623 -721 -606 -646 -580 -584 -629 -650 -585 -748 -774 -757 -730 -640 -506 -461 -457 -534 -675 -734 -742 -672 -574 -462 -508
1395e08om5j2j51J02M0nl8J19l7J01J19J4K9kq5j04r8m9j6mj26J49J2J89j17l3L6j8J8J1o5
$$ -508 -514 -559 -571 -722 -620 -580 -585 -623 -504 -541 -440 -321 -307 -278 -280 -365 -469 -567 -616 -632 -636 -762 -613 -601 -412 -529 -562 -526 -544 -526 -515 -580
1387e80o3n3M1n7J38j00j2N4L2o7R3k2K4r2J70k0p5m0J3j3J22k6J3K5j04K1j1N8L5Q6o2q3
$$ -580 -643 -696 -655 -712 -574 -674 -686 -632 -600 -667 -574 -596 -572 -664 -494 -514 -589 -629 -616 -629 -507 -533 -520 -495 -599 -578 -589 -531 -496 -410 -472 -555
1380e55POj15R4l8o3O2J0m0L2l1l4J1L6j07N0Q9l2%k7K2Q3OJ8j36M8P5k12NL8LJ09P3N7J5
$$ -555 -548 -542 -657 -563 -601 -664 -602 -592 -632 -600 -631 -665 -654 -618 -725 -675 -586 -618 -618 -645 -623 -540 -534 -516 -652 -604 -529 -741 -736 -698 -695 -586 -513 -456 -441
1372d41q9M6O3o9j8o3rk1q8M1N2J8r3K1R4Kk8m2J9qn8J0R1m0J05j10Q9P8p6l8N1O2p7Q8l4
$$ -441 -530 -484 -421 -490 -508 -571 -580 -601 -689 -648 -596 -578 -671 -650 -556 -554 -582 -624 -605 -613 -671 -661 -570 -610 -505 -615 -526 -448 -524 -562 -511 -449 -526 -438 -472
1364d72mM6q7mp8N9J2r1n0l2Q2LQ8j12J34p3L7mk5Q5j84j5N8L2N9o2j45O3Q4j7L9l6o2n4Q8
$$ -472 -476 -430 -517 -521 -599 -540 -528 -619 -669 -701 -619 -616 -528 -640 -506 -579 -542 -546 -571 -486 -670 -685 -627 -595 -536 -598 -743 -680 -596 -613 -574 -610 -672 -726 -638
1356f38j92Q4O2N8J9R1lk8k2j30J6J6K2J47j39J00k1n3J13K4l7r4%M5J7n8O7j7l0L2r2R2l8
$$ -638 -830 -746 -684 -626 -607 -516 -519 -547 -569 -699 -683 -667 -645 -498 -637 -537 -558 -611 -498 -474 -511 -605 -605 -560 -543 -601 -534 -551 -581 -549 -641 -549 -587
1349e87K5nn3M1mj0J08j10n4J0J0O2R1p5O1P1r5M9p2j1l4N1M6j07n7l8N4J26k6O1k9r9Qn5
$$ -587 -562 -567 -620 -579 -583 -593 -485 -595 -649 -639 -629 -567 -476 -551 -490 -419 -514 -465 -537 -548 -582 -531 -485 -592 -649 -687 -633 -507 -533 -472 -501 -600 -592 -647
1341f47m2M4n1P7j21J33Q1J0J6M6q5J80p3Kj55J3O7j2Q9k0p5J8K6n1J53P4Lq0k7j70M2P5j35
$$ -647 -689 -645 -696 -619 -740 -607 -526 -516 -500 -454 -539 -359 -432 -430 -585 -572 -505 -517 -428 -448 -523 -505 -479 -530 -377 -303 -300 -380 -407 -577 -535 -460 -595
1333e95q6Qn9pJ66N2kL7q0J34l5q8QJ11O0N1l0K05p5j01j1j57P5J81m9n3j10j5j07m2O9j50
$$ -595 -681 -673 -732 -739 -573 -521 -523 -486 -566 -432 -467 -555 -547 -436 -376 -325 -355 -150 -225 -326 -337 -494 -419 -238 -287 -340 -450 -465 -572 -614 -545 -695
1326f95po0K69j23k07J22Q9m0J58Q9j6l0N7N1o2J45R6j45Pnj36j90J32P2N9j61r7R8K3n8R1
$$ -695 -702 -762 -493 -616 -823 -701 -612 -652 -494 -405 -421 -451 -394 -343 -405 -260 -164 -309 -302 -307 -443 -633 -501 -429 -370 -531 -628 -530 -507 -565 -474
1319d74o1n6J36j14k7L7J14j17j5n9O0o0l5J03L7o4K6J52j01q7j50N4np7J5r0J56N3Lp7p9
$$ -474 -535 -591 -455 -569 -596 -559 -445 -562 -577 -636 -576 -636 -671 -568 -531 -595 -569 -417 -518 -605 -755 -701 -706 -783 -768 -858 -702 -649 -646 -723 -802
1312h02J9N2q6R0o2R2N2j6L0K0j18J23j11j01R6kO2K8j29q4M8P7J64K9m1j09m0R9j19J20j16
$$ -802 -783 -731 -817 -727 -789 -697 -645 -661 -631 -611 -729 -606 -717 -818 -722 -724 -662 -634 -763 -847 -799 -722 -558 -529 -570 -679 -719 -620 -739 -619 -735
1305g35n0J48P1r9N7k7o5M2R5j02j07J28n7L8j30R9q2OQ2L0l0K2O3j4j7M4M7KK4Lo6k2K2o
$$ -735 -785 -637 -566 -665 -608 -635 -700 -658 -563 -665 -772 -644 -701 -663 -793 -694 -776 -770 -688 -658 -688 -666 -603 -617 -634 -590 -543 -541 -517 -514 -580 -602 -580 -586
1297e86j30L1L6N4m4J17l3j01rJN1J63k16J20K8j00J37j98P3p6j09J0J58j65J53j20r5M3J58
$$ -586 -716 -685 -649 -595 -639 -522 -555 -656 -665 -664 -613 -450 -666 -546 -518 -618 -481 -679 -606 -682 -791 -781 -623 -788 -635 -755 -850 -807 -649
1290f49m1P0K9pl1l2O1r9j3R2k0jrJ5k2O0p5j11J58J46r6J4m4Lr2o5K11o7j46J44j0p3m0m4
$$ -649 -690 -620 -591 -598 -629 -661 -600 -699 -712 -620 -640 -641 -650 -635 -657 -597 -672 -783 -625 -479 -575 -561 -605 -602 -694 -759 -548 -615 -761 -617 -627 -700 -740 -784
1282g84J12p5K12j87k9M3Mn9M3J41j7o8j8Q4n2j8P5O9r1q7L2L2L5p0kN2r9J03n1r7o0M7O5
$$ -784 -672 -747 -535 -722 -751 -708 -704 -763 -720 -579 -596 -664 -682 -598 -650 -668 -593 -524 -615 -702 -670 -638 -603 -673 -675 -623 -722 -619 -670 -767 -827 -780 -715
1275g15J7J26j33n5Q0m0Q0l7R8q6m8J46oK2n7j01k2L7J29m9l1Qj0M7m5J08O6m4j42L3M2p8
$$ -715 -698 -572 -705 -760 -680 -720 -640 -677 -579 -665 -713 -567 -573 -551 -608 -709 -731 -694 -565 -614 -645 -637 -647 -600 -645 -537 -471 -515 -657 -624 -582 -660
1268f60r1K5R8p5K7k1K6k5j2J15p4O4o6O0lmM9j18j2N2J4Mp4J02j61J66J1p0q7J98MJ3p8r2
$$ -660 -751 -726 -628 -703 -676 -697 -671 -696 -708 -593 -667 -603 -669 -609 -612 -616 -567 -685 -697 -645 -631 -627 -701 -599 -760 -594 -583 -653 -740 -542 -538 -525 -603 -695
1260f95J5MkP9O3m5q5n4RJ8O0p0R2q4P1p3L1J9j22J39N1j16P3L0J7p5q7l6M0jj27J09J83q1
$$ -695 -680 -676 -678 -599 -536 -581 -666 -720 -711 -693 -633 -703 -611 -695 -624 -697 -666 -647 -769 -630 -579 -695 -622 -592 -575 -650 -737 -773 -733 -734 -861 -752 -569 -650
1252f50Kmj21P8k1o3J15J8qnj28L0K1l3m2J65P9l4m1o6n1m3J24P5m3J01k50K5K00j00n9q3
$$ -650 -648 -652 -773 -695 -716 -779 -664 -646 -654 -659 -787 -757 -736 -769 -811 -646 -567 -601 -642 -708 -759 -802 -678 -603 -646 -545 -795 -770 -570 -670 -729 -812
1245h12Q7j1qP9%j7J2J7N7Ko9N9J7J1j26q1L1J3J62n2q4L4o6N7nk16J69l1jN1l1K7O7o4Q6
$$ -812 -725 -736 -744 -665 -665 -682 -670 -653 -596 -594 -663 -604 -587 -576 -702 -783 -752 -739 -577 -629 -713 -679 -745 -688 -693 -909 -740 -771 -772 -721 -752 -725 -658 -722 -636
1237f36j83M7Q9L7k1O8J3K2m7l9K2M8j54m0R2p9K1p7J41MO3n4j25L0J5J36J0N1o6J0Kj29N
$$ -636 -819 -772 -683 -646 -667 -599 -586 -564 -611 -650 -628 -580 -734 -774 -682 -761 -740 -817 -676 -672 -609 -663 -788 -758 -743 -607 -597 -546 -612 -602 -600 -729 -724
1229g24K7M6l5LJ33j54KL9j6K1N8j25J8k4J38j7O0J9k6j31%k9K3J47k1r7k7jn5m8J17J29K3
$$ -724 -697 -651 -686 -683 -550 -704 -702 -663 -679 -658 -600 -725 -707 -731 -593 -610 -550 -531 -557 -688 -688 -717 -694 -547 -568 -665 -692 -693 -748 -796 -679 -550 -527
1222e27o1j18p7L6Oq7N1J48M8l7o8m0l2L0K2m8N1n5LKk6J46K2o0Q5r3m7nj3Nm0O6K3Rr8P1
$$ -527 -588 -706 -783 -747 -741 -828 -777 -629 -581 -618 -686 -726 -758 -728 -706 -754 -703 -758 -755 -753 -779 -633 -611 -671 -586 -679 -726 -731 -744 -739 -779 -713 -690 -681 -779 -708
1213g08P8o5l5P7j31M9Q6o4k2k8l6P4m8k9J03j2k0L0R6q8R7j45J83l1j50n2J51J63j63j7m1
$$ -708 -630 -695 -730 -653 -784 -735 -649 -713 -735 -763 -799 -725 -773 -802 -699 -711 -731 -701 -605 -693 -596 -741 -558 -589 -739 -791 -640 -477 -640 -657 -698
1206f98q5N9m1L0K04lN8Nj64N6r1n5m1J00L0L3J9j14K8O2lj08J3k6Q4K7j9j06K7pM7J49m8
$$ -698 -783 -724 -765 -735 -531 -534 -476 -471 -635 -579 -670 -725 -766 -666 -636 -603 -584 -698 -670 -608 -611 -719 -706 -732 -648 -621 -640 -746 -719 -726 -679 -530 -578
1199e78Qj47Q2J5n4K5Q3P3k7j2Pj09q3k6J46j27J46j08j5o3K7K08P1j51o7m0l8K0L6O3P5m2
$$ -578 -570 -717 -635 -620 -674 -649 -566 -493 -520 -532 -525 -634 -717 -743 -597 -724 -578 -686 -701 -764 -737 -529 -458 -609 -676 -716 -754 -734 -698 -635 -560 -602
1191f02m6J21j35L3j1r6k8M8m7m7J48j32k9O5J37N3j60J07j31p4J36J09p5kN9j40J87j00K7
$$ -602 -648 -527 -662 -629 -640 -736 -764 -716 -763 -810 -662 -794 -823 -758 -621 -568 -728 -621 -752 -826 -690 -581 -656 -658 -599 -739 -552 -652 -625
1185f25p1J08PJ1m8r8n9O4L6k4J51kp2K5POk3Pj36mP9P7k9r2l4J90j3lLm8j1N8Mn7kL3K6j34
$$ -625 -696 -588 -581 -570 -618 -716 -775 -711 -675 -699 -548 -550 -622 -597 -590 -584 -607 -600 -736 -740 -661 -584 -613 -705 -739 -549 -562 -565 -562 -610 -621 -563 -559 -616 -618 -585 -559 -693
1176f93O6pj03l1O0N8o3M6nK4P2K3j1p2J44O4o1Jp9j10o4M9J0O1j5J58q9J4j10O0k5j01Rj07
$$ -693 -627 -634 -737 -768 -708 -650 -713 -667 -672 -648 -576 -553 -564 -636 -492 -428 -489 -488 -567 -677 -741 -692 -682 -621 -636 -478 -567 -553 -663 -603 -628 -729 -720 -827
1168h27J5J77O2OJ5or3mN1j61J96j10L6J25N1q6m8r9J08J1K7p4O3q5L4j1M5p5n3K4LQ4j9q6
$$ -827 -812 -635 -573 -567 -552 -558 -651 -655 -604 -765 -569 -679 -643 -518 -467 -553 -601 -700 -592 -581 -554 -628 -565 -650 -616 -627 -582 -657 -710 -686 -683 -599 -618 -704
1161g04P2J62l9p7po1r5j46Q9J84j24J9J5K1N6N9Pj4Ro3J45j77j05J4O7J0o0R4oj6P1Oj23
$$ -704 -632 -470 -509 -586 -593 -654 -749 -895 -806 -622 -746 -727 -712 -691 -635 -576 -569 -583 -574 -637 -492 -669 -774 -760 -693 -683 -743 -649 -655 -671 -600 -594 -717
1153g17P9o7L3j48o1R0K15r3p6j4J6J85K3q6lN2J13j59j2m8p3J25M5n5l7M8p4K9j5%P5n5o6
$$ -717 -638 -705 -672 -820 -881 -791 -576 -669 -745 -759 -743 -558 -535 -621 -624 -572 -459 -618 -630 -678 -751 -626 -581 -636 -673 -625 -699 -670 -685 -685 -610 -665 -731
1145g31J36l0ok0j10j7l0J35j06k1k9r8R1J02qJ73K0o7J8n7Oo6j00K0K2J65P3q7j08j1J21
$$ -731 -595 -625 -631 -651 -761 -778 -808 -673 -779 -800 -829 -927 -836 -734 -742 -569 -549 -616 -598 -655 -649 -715 -815 -795 -773 -608 -535 -622 -730 -741 -620
1138f20r1O7J61j13o3l2j36J84L3Nrj68J73J6P1r4m2j7O9Ko4m9P7l5Q3K1o7J58M2j45Q3l8
$$ -620 -711 -644 -483 -596 -659 -691 -827 -643 -610 -605 -614 -782 -609 -593 -522 -616 -658 -675 -606 -604 -668 -717 -640 -675 -592 -571 -638 -480 -438 -583 -500 -538
1131e38q4P2pk5j4o9J01K6m2j03PJ19k7K0n6P1J03o5K3j1J05p3M3J1k0M5K0KP9r1N0j30l0
$$ -538 -622 -550 -557 -582 -596 -665 -564 -538 -580 -683 -676 -557 -584 -564 -620 -549 -446 -511 -488 -499 -394 -467 -424 -413 -433 -388 -368 -366 -287 -378 -328 -458 -488
1124d88M7m6ML6j80PL0J43m4j16j23J90N5J2K6M7K2o5o5l5o3M7OJ3J34P2j1k0M3k9j06q1j7
$$ -488 -441 -487 -483 -447 -627 -620 -590 -447 -491 -607 -730 -540 -485 -473 -447 -400 -378 -443 -508 -543 -606 -559 -553 -540 -406 -334 -345 -365 -322 -351 -457 -538 -555
1116e55K4Rp7k9J65J5L8j86O0R5K0L0K17J50O34R88R53L61l26j079j005m94l14k12M0R6k7
$$ -555 -531 -522 -599 -628 -463 -448 -410 -596 -536 -441 -421 -391 -174 -24 610 1598 2551 2912 2586 1507 502 8 -306 -518 -478 -382 -409
1110d09j14k4R1J1p4LJ8J10L2o6j3P3N2oM3j13J75L03O41J052R26L36n94j021q82n33j56k07
$$ -409 -523 -547 -456 -445 -519 -516 -498 -388 -356 -422 -435 -362 -310 -316 -273 -386 -211 92 733 1785 2711 3047 2453 1432 550 17 -139 -346
1103c46o5k0m1lR1P6J02p3p7r5O6L0q6P2P0N2R3M67O08R48J020M23l12r13r95o64l62j57j95
$$ -346 -411 -431 -472 -475 -384 -308 -206 -279 -356 -451 -385 -355 -441 -369 -299 -247 -154 313 921 1869 2889 3312 3000 2087 1092 428 66 -91 -286
1097b86p1P8k1J5K43j5K63M87M31L76k06m37m84m01k18j75M9J15J2L40N36Q64J035P36Q4q05
$$ -286 -357 -279 -300 -285 -42 -57 206 693 1124 1500 1294 857 373 -28 -246 -421 -372 -257 -245 95 631 1495 2530 3266 3350 2545
1091B545r55q79n15l14j6j07j06O2Qo7J46J32M68M29O82J16m49n67n96l73j00j06p4j4R0m
$$ 2545 1590 711 196 -118 -134 -241 -347 -285 -277 -344 -198 -66 402 831 1513 1629 1180 613 17 -356 -456 -562 -636 -650 -560 -564
1085e64L0J43J6j04k2j33O8N1k2j8K4l5j11J25j4J2o3J37p2R8L8K02L3l6Q8Oj31k1J38R8J54
$$ -564 -534 -391 -375 -479 -501 -634 -566 -515 -537 -555 -531 -566 -677 -552 -566 -554 -617 -480 -552 -454 -416 -214 -181 -217 -129 -123 -254 -275 -137 -39 115
1078A15j95j18j72r5K5j50k6J65j72O7R9j32n9J16j41M5L1j24Q8J47J32j5K03J30J9j64Q3
$$ 115 -80 -198 -370 -465 -440 -590 -616 -451 -623 -556 -457 -589 -648 -532 -673 -628 -597 -721 -633 -486 -354 -369 -166 -36 -17 -181 -98
1072i8j65J03K58L13M0p3j56l07q9j65j20o7p9P2l2K6Q6M2j10k8j32K42J8J7k68j7J23J12
$$ -98 -263 -160 98 411 451 378 222 -85 -174 -339 -459 -526 -605 -533 -565 -539 -453 -411 -521 -549 -681 -439 -421 -404 -672 -689 -566 -454
1065d54J61Q8J12P1p4l6j21j5J87K56Mk98j60%j70l3M3O8k70J5l7j29r1J39N7R3K33O2J20
$$ -454 -293 -205 -93 -22 -96 -132 -253 -268 -81 175 179 -119 -279 -279 -449 -482 -439 -371 -641 -626 -663 -792 -883 -744 -687 -594 -361 -299 -179
1059a79k03Q2J77KJ01J67k9j12l2j69l3j36p5J6P1l9q4L6k0P6mM1o6j83K1L4q8J76L2L54N7
$$ -179 -382 -300 -123 -121 -20 147 118 6 -26 -195 -228 -364 -439 -423 -352 -391 -475 -439 -459 -383 -387 -346 -412 -595 -574 -540 -628 -452 -420 -66 -9
1051in5J4rJ73J36L2K19Q5J98k08q0l71Ll9j01j37J06P4J30l0Q5N8j10JJ62m3j1K47j36K53
$$ -9 -64 -50 -59 114 250 282 501 586 784 576 496 125 128 89 -12 -149 -43 31 161 131 216 274 164 165 327 284 273 520 384 637
1045F37j01J70K4J20L60K80M72K58J63M3k46j61P7j34j8P7K22J66J60L78M39M41L73N51M96
$$ 637 536 706 730 850 1210 1490 1962 2220 2383 2426 2180 2019 2096 1962 1944 2021 2243 2409 2569 2947 3386 3827 4200 4751 5247
1039E247Q16J319J764K387K587K430J817J572K113M047N877P336R696J6113L6466Q6696J52370
$$ 5247 6063 7382 9146 11533 14120 16550 18367 19939 22052 26099 31976 39312 49008 65121 101587 188283 340653
1035C40653J96356J53708L3375j04893j90906j86178j19565n0943k1223j0356o257m832m060
$$ 340653 537009 690717 724092 619199 428293 242115 122550 71607 50384 40028 33771 28939 24879
1032B4879k835j378J47J368J691J563J156J98m81L61K151M590O462Q339J2639K6501O6240
$$ 24879 22044 20666 20813 22181 23872 25435 26591 26789 26308 26669 28820 33410 39872 48211 60850 87351 153591
1028A53591J32313J93494J84960Q5350o0053j74035k04463j53671p3112k9796j3853p509n674
$$ 153591 285904 479398 664358 749708 689655 515620 311157 157486 84374 54578 40725 33216 27542
1025B7542n036l960k681j141o16m43r33j625j741k005j688j181p11o35m32j88j52j75j78j39
$$ 27542 22506 18546 15865 14724 14108 13665 12732 11107 9366 7361 5673 4492 3781 3146 2714 2526 2374 2199 2021 1882
1021A882n0nj14j45q8j63k52k55J3l8Qj50J8k4K2k4O0j38n5j26l1j25mO9n6J22K37K86N50
$$ 1882 1832 1827 1713 1568 1480 1317 1065 810 823 785 793 643 661 637 659 635 695 557 502 376 345 220 216 285 229 351 588 874 1424
1014A424M16L0pl47l60l37j56j24J9j18o8l2O5q7j30K6p6K76Q2M3O2l9k2q8j64k0p1J19R4
$$ 1424 1840 1870 1863 1516 1156 819 663 539 558 440 372 340 405 318 188 214 138 414 496 539 601 562 540 452 288 268 197 316 410
1007D10K80N35K76K31j06m59m73k00k27k5Q2Q9M0Q8j6k19j61K3q5j10J60J01j1M8o1Mm7j36
$$ 410 690 1225 1501 1732 1626 1167 694 494 267 242 324 413 453 541 525 306 145 168 83 -27 133 234 223 271 210 214 167 31
1001C1j57o2K11%l8J24q6j12o3Q9L6j02r5R7R2L9q0q0P9o9o7N1j4j49J0m2R4K8q7J54m8N2
$$ 31 -126 -188 23 23 -15 109 23 -89 -152 -63 -27 -129 -224 -127 -35 4 -76 -156 -77 -146 -213 -162 -176 -325 -315 -357 -263 -235 -322 -168 -216 -164
994a64K1l4O6n4r7m5m1R1n1J14r9J31j54M9o9M5p5P1qp0o6J15L7j02Q2j6j48Nj8R7J6kLLm8
$$ -164 -143 -177 -111 -165 -262 -307 -348 -257 -308 -194 -293 -162 -316 -267 -336 -291 -366 -295 -303 -373 -439 -324 -287 -389 -307 -323 -471 -466 -484 -387 -371 -373 -370 -367 -415
986d15N8n2q9J58k7LPN0n0k06J70j39J03j17M2R0l2p5Q6QP8q4Q0J0L5o4L2k02K8M8J37J2K
$$ -415 -357 -409 -498 -340 -367 -364 -357 -307 -357 -563 -393 -532 -429 -546 -504 -414 -446 -521 -435 -427 -349 -433 -353 -343 -308 -372 -340 -542 -514 -466 -329 -317 -315
978c15j54J4j3p2P4l3p6P2K6n6N1p5L0k1k1OL1P7p0j3K36K4j22QJ22O7r9r0N8m1J37k6R4J52
$$ -315 -469 -455 -468 -540 -466 -499 -575 -503 -477 -533 -482 -557 -527 -548 -569 -563 -532 -455 -525 -538 -302 -278 -400 -392 -270 -203 -302 -392 -334 -375 -238 -264 -170 -18
970a8J37K89P23J182Q83L53o03j073r50o56l58j58j27j0kJ27N1p8J0j10j7J07pN5j3R3R7p7
$$ -18 119 408 1131 2313 3196 3549 2946 1873 923 267 -91 -249 -376 -386 -388 -261 -210 -288 -278 -388 -405 -298 -305 -250 -263 -170 -73 -150
964a50P3Lm8R3M00O59R40J010N13k76q46j036q49k07K95N3K52n83l94j80NL2j06L6J37n0M7
$$ -150 -77 -74 -122 -29 371 1030 1970 2980 3493 3217 2371 1335 486 279 574 627 879 296 -98 -278 -273 -241 -347 -311 -174 -224 -177
958a77k4R6r7j39J8K4J7n0k4J10r0n2o9L4R6q1J18N9J41j07R2L18P56J167J147P47j38j056
$$ -177 -201 -105 -202 -341 -323 -299 -282 -332 -356 -246 -336 -388 -457 -423 -327 -408 -290 -231 -90 -197 -105 213 969 2136 3283 4030 3892 2836
951B836j108q78m42o6L90M41N49L60j71k36l50l03l86k20p6k32j10r5j01j6J21O2O4O9K99
$$ 2836 1728 850 408 342 732 1173 1722 2082 1911 1675 1325 1022 636 416 340 108 -2 -97 -198 -214 -93 -31 33 102 401
946D01P14J078J382O06k62j132j079p71m79j66j61q3K51J20n3p9l9j08j70QO3j8m8k09p1J2
$$ 401 1115 2193 3575 4181 3919 2787 1708 937 458 292 131 48 299 419 366 287 248 140 -30 -22 41 23 -25 -234 -305 -293
940b93q6Lo9M8k2P3J0%J08j17N4n8j0J98Q0K88k83k33QQJ63N6j0J6Lj54R6m3j05L7k05N1K2
$$ -293 -379 -376 -445 -397 -419 -346 -336 -336 -228 -345 -291 -349 -359 -161 -81 207 -76 -309 -301 -293 -130 -74 -84 -68 -65 -219 -123 -166 -271 -234 -439 -388 -366
932c66j60K4J18p0P7o9q8J8J16P8%k7M0O5p8r9n7o4p1J76J35N4L3n9q9j46N1j7o4LP5o2lJ2
$$ -366 -526 -502 -384 -454 -377 -446 -534 -516 -400 -322 -322 -349 -309 -244 -322 -421 -478 -542 -613 -437 -302 -248 -215 -274 -363 -509 -458 -475 -539 -536 -461 -523 -526 -514
924e14j34P0l6K20Q3r7j41J00K7j1K6l5N0j37R8jR3J6j79j55J11MJ27l5o4N3m6n4K8P9k7j61
$$ -514 -648 -578 -614 -394 -311 -408 -549 -449 -422 -433 -407 -442 -392 -529 -431 -432 -339 -323 -502 -657 -546 -542 -415 -450 -514 -461 -507 -561 -533 -454 -481 -642
917f42K1p4M7O7J29q8p9K6O2Q0n3O8ml3J27N5m1j2Ok4j4R1J6L8o1K4J7K65L25N55R98J214
$$ -642 -621 -695 -648 -581 -452 -540 -619 -593 -531 -451 -504 -436 -440 -473 -346 -291 -332 -344 -338 -362 -376 -285 -269 -231 -292 -268 -251 14 339 894 1892 3106
910C106R90Q00O9o25j038j139j164n48l22j56n1p1j1q7J7nJ06J29K17K50M30M14J87r1k56
$$ 3106 4096 4896 4965 4340 3302 2163 999 451 129 -27 -78 -149 -160 -247 -230 -235 -129 0 217 467 897 1311 1498 1407 1151
904A151k79k19l0M62R41J235J299R28K43m76q68j007r82m77l26j18l88m24l12l25J3QJ0J93
$$ 1151 872 653 623 1085 2026 3261 4560 5488 5731 5255 4387 3380 2398 1921 1595 1477 1089 665 353 28 41 49 59 252
898B52L3J45K94M12P7j04k77l77m01j16j17m3L5J7J47O5P9J08J31L23K40J12N4l15k31k78
$$ 252 285 430 724 1136 1213 1109 832 455 54 -62 -179 -222 -187 -170 -23 42 121 229 360 683 923 1035 1089 774 543 265
893B65k29K5j54n0r9N4j28NN3J5n2p8P7j76O1J43k15K1J19q1r0Q6m4JN5L3P%QJ6r8L8n5J72
$$ 265 36 61 -93 -143 -242 -188 -316 -311 -258 -243 -295 -373 -296 -472 -411 -268 -483 -462 -343 -424 -514 -428 -472 -471 -416 -383 -376 -376 -368 -352 -450 -412 -467 -295
885b95Q3j4p2j14j1J1K1K1N6o5j84N1Mn7j0J4J0J9J22j4P1n6lk6J18p1j27J07O2o0P4nj5q
$$ -295 -212 -226 -298 -412 -423 -412 -391 -370 -314 -379 -563 -512 -508 -565 -575 -561 -551 -532 -410 -424 -353 -409 -412 -438 -320 -391 -518 -411 -349 -409 -335 -340 -355 -363
877c63J3K09k32J01p5j45m5n1Q4o6M9J27n2l2l4k0n5O4K7j48J20J12M8O3j04Mk2O7R1n3k70
$$ -363 -350 -141 -373 -272 -347 -492 -537 -588 -504 -570 -521 -394 -446 -478 -512 -532 -587 -523 -496 -644 -524 -412 -364 -301 -405 -401 -423 -356 -265 -318 -588
870e88N5L1M0J1r9q8P2O0j8Q9m4m8RJ58r6R8mj17j1J4O8j14M6RJ37r1QJ0o0J6J07n8J7Q6J71
$$ -588 -533 -502 -462 -451 -550 -638 -566 -506 -524 -435 -479 -527 -518 -360 -456 -358 -362 -479 -490 -476 -408 -522 -476 -467 -330 -421 -413 -403 -463 -447 -340 -398 -381 -295 -124
862a24L65J83J46Mj18l60k40j19k4j47J5m9P7o2J8k3J5Rp2J58O1k1o6j01J49J55j0k19PJ73
$$ -124 241 424 570 574 456 96 -144 -263 -287 -434 -419 -468 -391 -453 -435 -458 -443 -434 -506 -348 -287 -308 -374 -475 -326 -171 -181 -400 -393 -220
855b20K79J21J76J62k8j47k66q5j37j87m5P4r4J90k49q9P2J11R2l8K2qj12K9P6n7M3p6k6j78
$$ -220 59 180 356 518 490 343 77 -8 -145 -332 -377 -303 -397 -207 -456 -545 -473 -362 -270 -308 -286 -294 -406 -377 -301 -358 -315 -391 -417 -595
848e95L7K9L3P3J4j17J95k8k01j66N4O4R2Q9p2M2n1J48Q4Nj22q3n7J07M2k44Om1N5P4L1k1
$$ -595 -558 -529 -496 -423 -409 -526 -331 -359 -560 -726 -672 -608 -516 -427 -499 -457 -508 -360 -276 -271 -393 -476 -533 -426 -384 -628 -622 -663 -608 -534 -503 -524
841e24J01p5k4K4nj32R9m6J99k4N8qr5J2p1MP2k3k4J31J63K04j37K6J40k65j40j34J37n5j09
$$ -524 -423 -498 -522 -498 -503 -635 -536 -582 -383 -407 -349 -357 -452 -440 -511 -507 -435 -458 -482 -351 -188 16 -121 -95 45 -220 -360 -494 -357 -412 -521
834e21j91K07J1J37k36R4l3m8M2N4Q3j59M3M6Q9M9J7o6r0k0PqMJ38j64p3Q4mn7Qm9qK8Q1M0
$$ -521 -712 -505 -494 -357 -593 -499 -532 -580 -538 -484 -401 -560 -517 -471 -382 -333 -316 -382 -472 -492 -485 -493 -489 -351 -515 -588 -504 -508 -565 -557 -606 -614 -586 -505 -465
826d65P2M9k04j52n2N7J88J76j85J24n3k2P1K0o4L4l3N5P0K0K9L0k7P0q7J80pO9k3l7jM6J01
$$ -465 -393 -344 -548 -700 -752 -695 -507 -331 -516 -392 -445 -467 -396 -376 -440 -406 -439 -384 -314 -294 -265 -235 -262 -192 -279 -99 -106 -37 -60 -97 -98 -52 49
818D9J28J43L55L61R27K741P729J0648O984m247j3541p830k468r30n96k31k45j17j53K0r8
$$ 49 177 320 675 1036 1963 4704 12433 23081 30065 25818 12277 4447 1979 1049 453 222 -23 -140 -293 -273 -371
813c71J0J21O2n2p5p2n2o4J17j79M1M2n7K9j55J63O7j05Q1L3Kr0kk3J1N9M5j64J48l2M9L6
$$ -371 -361 -240 -178 -230 -305 -377 -429 -493 -376 -555 -514 -472 -529 -500 -655 -492 -425 -530 -449 -416 -414 -504 -506 -529 -518 -459 -414 -578 -430 -462 -413 -377
806c77m1N8l7q3Jo7J43q6K8J3K1j15J42j22J05n3L8Q1Mm7J05j0N4N3K66Q62J183M18Q9j120
$$ -377 -418 -360 -397 -480 -479 -546 -403 -489 -461 -448 -427 -542 -400 -522 -417 -470 -432 -351 -347 -394 -289 -299 -245 -192 74 936 2119 2537 2626 1506
799A506j132m14j17O7j77l9Km4j5Oj16L6n5R2nO6J39N1J20j73o1j2j37rL8%j13P5lN9Q1k0
$$ 1506 374 -40 -157 -90 -267 -306 -304 -348 -363 -357 -473 -437 -492 -400 -405 -339 -200 -149 -29 -202 -263 -275 -412 -421 -383 -383 -496 -421 -424 -365 -284 -304
792c04P4j15R0K66K66K40J41k70l48k16J5m2r0o0l4J18L6J5J31L06L00N1k08j74j91K65J43
$$ -304 -230 -345 -255 11 277 517 658 388 40 -176 -161 -203 -293 -353 -387 -269 -233 -218 -87 219 519 570 362 188 -3 262 405
786D05j75k92j01Kj32N8Q9j18q5R3J82J12N96O30K16m41o68m00l9o2j28p4o5m5J91l6J75M0
$$ 405 230 -62 -163 -161 -293 -235 -146 -264 -349 -256 -74 38 634 1264 1480 1039 371 -29 -68 -130 -258 -332 -397 -442 -251 -287 -112 -72
779g2K58Q8p9r1N8L64J84j99m39k23rL6j00p2L4K1Pk9Q5M05L84J23k82m21k27j78R3L8j41
$$ -72 186 274 195 104 162 526 710 511 72 -151 -160 -124 -224 -296 -262 -241 -234 -263 -178 227 611 734 452 31 -196 -374 -281 -243 -384
773c84l2k3k5j9J48l3o1l7P2Q4J12K67J10R1l20m9j77p7r1J07q1k7J06L1O3k0N0l3r3j53j3
$$ -384 -416 -439 -464 -483 -335 -368 -429 -466 -394 -310 -198 69 179 270 -50 -99 -276 -353 -444 -337 -418 -445 -339 -308 -245 -265 -215 -248 -341 -494 -507
766e07N1n5R4j06J11O4q6O7N4j19L4K3kQ6l8P3j02N4L0m5l8j3NQJ6K8K3J9p3r6J9l8j2J00
$$ -507 -456 -511 -417 -523 -412 -348 -434 -367 -313 -432 -398 -375 -377 -291 -329 -256 -358 -304 -274 -319 -357 -370 -365 -357 -341 -313 -290 -271 -344 -440 -421 -459 -471 -371
758c71K2R7OK3m8m0L7P6m1L7l4l5j2k0M8j29N3J30j17q0Q8O6jK7nK3J7L6O2N4R9r3j17J11
$$ -371 -349 -252 -246 -223 -271 -311 -274 -198 -239 -202 -236 -271 -283 -303 -255 -384 -331 -201 -318 -398 -310 -244 -245 -218 -223 -200 -183 -147 -85 -31 68 -25 -142 -31
750c1q1J19J5r8j01l1p7M0l8lrMJ34j16P8q5J9P2o6O6m7J35Pk5n3K8r6m0O7J33O9p2nl4q9
$$ -31 -112 7 22 -76 -177 -208 -285 -245 -283 -286 -295 -291 -157 -273 -195 -280 -261 -189 -255 -189 -236 -101 -94 -119 -172 -144 -240 -280 -213 -80 -11 -83 -88 -122 -211
742b11R6j09K1rN7O2Kj51O7P1K5L2Q6N3m0m6L8j7m5n6qj7Q8j4m1R0N9j3m9k0J50j9%p7j05
$$ -211 -115 -224 -203 -212 -155 -93 -91 -242 -175 -104 -79 -47 39 92 52 6 44 27 -18 -74 -82 -99 -11 -25 -66 24 83 70 21 1 151 132 132 55 -50
734e0J63Kj05Q4r8J29q0Qn9k5K45P6r4J8k34J83J8J4l1j00m1K6J13l5pk2l8nL2N4M0K2q0k1
$$ -50 113 115 10 94 -4 125 45 53 -6 -31 214 290 196 214 -20 163 181 195 164 64 23 49 162 127 120 98 60 55 87 141 181 203 123 102
726A02R1o1j48J70J76q5m5J33J73m2L7q0n1M0m9j01R2qon8o4N7m3J05k3j39K6J5L9k7mL8j2
$$ 102 193 132 -16 154 330 245 200 333 506 464 501 421 370 410 361 260 352 344 338 280 216 273 230 335 312 173 199 214 253 226 222 260 248
719B48PQ7L2J06k6k1J06m7J51l1L0mj09p9L0j5O4J2j66J58n0P0L1q9J38j71O6j23P0p1N9M8
$$ 248 255 342 374 480 454 433 539 492 643 612 642 638 529 450 480 465 529 541 375 533 483 553 584 495 633 462 528 405 475 404 463 511
711E11P3M7o5P9o8J30P4J2J33J16Qqr5qo9r9K3LJ9M7q8J9L4n3k4J3n4P7J08l7l9j7O0m0P0
$$ 511 584 631 566 645 577 707 781 793 926 1042 1050 1042 947 939 870 771 794 797 816 863 775 794 828 775 751 764 710 787 895 858 819 802 862 822 892
703H92n1l8O7J02J06n0N8k0j03J14L1j20NO1o9P9m4J7J11o0L6R0l2j04KO6lpJ7J06L8L1J4
$$ 892 841 803 870 972 1078 1028 1086 1066 963 1077 1108 988 993 1054 985 1064 1020 1037 1148 1088 1124 1214 1182 1078 1080 1146 1143 1136 1153 1259 1297 1328 1342
696A342O2l8L0M9m3K3k3p2J80O6O8J4o4j1%O8O2K0J61l3L1P5m8J00M9o6K32J76j02j4o8l4
$$ 1342 1404 1366 1396 1445 1402 1425 1402 1330 1510 1576 1644 1658 1594 1583 1583 1651 1713 1733 1894 1861 1892 1967 1919 2019 2068 2002 2234 2410 2308 2294 2226 2192
689B192j17m1K71j01N7N3pK4m8L9M5R0j5J3R0O8Q9k9LM4n7Q4K06J19Q6j16o1Q0j05j2J00J48
$$ 2192 2075 2034 2305 2204 2261 2314 2307 2331 2283 2322 2367 2457 2442 2455 2545 2613 2702 2673 2676 2720 2663 2747 2953 3072 3158 3042 2981 3061 2956 2944 3044 3192
681C192m6J13J30l2k4m3Q7j78J72R3P4L1l3J96j22J40Q3%ko7J41L4j7OJ89Rj5Q3P7K3Q7m6
$$ 3192 3146 3259 3389 3357 3333 3290 3377 3199 3371 3464 3538 3569 3536 3732 3610 3750 3833 3833 3831 3764 3905 3939 3922 3928 4117 4126 4111 4194 4271 4294 4381 4335
674D335K90l7R6K5J02R4j22pRR8K26J1K6R6J07J0M7J3P5JJ10J59J11P8L4J28j82l8J5J25J03
$$ 4335 4625 4588 4684 4709 4811 4905 4783 4776 4785 4883 5109 5120 5146 5242 5349 5359 5406 5419 5494 5495 5605 5764 5875 5953 5987 6115 5933 5895 5910 6035 6138
667F138o8J27K37m6p0R2O9n8J43m3J3L00J61n5Q9Jm4j4OJ64N9QL6P6k8K9K5nq6K9l3J37J60
$$ 6138 6070 6197 6434 6388 6318 6410 6479 6421 6564 6521 6534 6834 6995 6940 7029 7030 6986 6972 6978 7142 7201 7209 7245 7321 7293 7322 7347 7342 7256 7285 7252 7389 7549
659G549Jq9J26j02Q3k7J72n3O7N1p5n4m7Pk5R5n2j01J4R9M8L2j78jkQ1m5jp9l8K7m7m2m7l0
$$ 7549 7550 7461 7587 7485 7568 7541 7713 7660 7727 7778 7703 7649 7602 7609 7584 7679 7627 7526 7540 7639 7687 7719 7541 7540 7538 7619 7574 7573 7494 7456 7483 7436 7394 7347 7317
651G317P8K4j25J05k00j6o5L8n0k0j38j11p0n1j14J27j5j53k3p5j10J01r8j08J04k42n6Q2
$$ 7317 7395 7419 7294 7399 7199 7183 7118 7156 7106 7086 6948 6837 6767 6716 6602 6729 6714 6561 6538 6463 6353 6454 6356 6248 6352 6110 6054 6136
645F136j68r2k8J12j63j02j30k0o6L7l6j14j70j4q2K0j65l1j25J30L7q9q4J1j26j10n3q0k1
$$ 6136 5968 5876 5848 5960 5797 5695 5565 5545 5479 5516 5480 5366 5196 5182 5100 5120 4955 4924 4799 4929 4966 4877 4793 4804 4678 4568 4515 4435 4414
$$ [...]
-994g62
##$OBSERVED INTEGRALS=	(X Y Z)
(10.126978861116361585, 10.209189075637487676, 1)
(7.4365301156235465996, 7.5128125464782193887, 1.038359754907292265)
(7.2895639644356471365, 7.3637468788447772994, 1.0502001555137481237)
(7.1852879809737588701, 7.2388256503350625337, 1.07519198817907502)
(3.8524272425078707194, 3.892816876256318448, 3.1916396984921311386)
(2.5077374216324845868, 2.6513056320198673532, 2.103530201270787714)
(1.1195743733093856953, 1.3217831203338707979, 1.1569554478976256107)
(0.57158866887302683946, 0.7090906168496777795, 2.1323717565920832229)
(0.23794423628262642567, 0.36937992184854107069, 2.1051748106392764726)
##END=	
##TITLE=	sl119
##JCAMP-DX=	6.0	$$ MestReNova 14.1.0-24037
##BLOCK_ID=	3
##DATA TYPE=	NMR PEAK TABLE
##DATA CLASS=	PEAK TABLE
##CROSS REFERENCE=	NMR SPECTRUM: BLOCK_ID=2                                     
##.OBSERVE FREQUENCY=	399.79071365325000897
##.OBSERVE NUCLEUS=	^1H
##NPOINTS=	246
##FIRSTX=	0.09166466221883287635
##LASTX=	11.108454929922020327
##XFACTOR=	1
##YFACTOR=	1
##FIRSTY=	0.00085714275862886261069
##XUNITS=	PPM
##YUNITS=	ARBITRARY UNITS
##PEAK TABLE=	(XYW..XYW)
0.09166466221883287635,0.00085714275862886261069,0.0068645923587048593081
0.10505106846620181071,0.00098733240538295729063,0.0048407302646733974677
0.11481026745618573559,0.0011401444138271225794,0.0051484442690286442643
0.12882490384571892994,0.00109719594869180136,0.0040043455425778353915
0.14831713324306045054,0.001324110726699620922,0.009922509595271454888
0.16158033183165726454,0.001519360365521076929,0.010392880233706928983
0.18177569036387009049,0.0026202938619392704932,0.0095038435421755593224
0.19628066679555522533,0.0035897714335359500425,0.010206925446189507589
0.21187712388791613005,0.0018759209694187992459,0.0074159580106639855918
0.22521579455868884212,0.00093255879851336371915,0.0036039958274510508485
0.24006548118366527467,0.0014638575969102875229,0.012631250351878207244
0.25666384519552387644,0.0043315311748453070792,0.003675307360815064945
0.26811949680059410372,0.0045274018095861961672,0.0033401499548467426283
0.27576441547601754367,0.00062221596420049263276,0.0029800494696440187926
0.29229723275468177945,0.075427393839661557862,0.002832204851812114392
0.30415860668379468557,0.25297519352735575726,0.003201277371222549864
0.30759090286314672014,0.15976423542256246169,0.0045286908621099512817
0.31641234963240483236,0.16144812661924023978,0.0043042604076560268475
0.31958084858661628402,0.23678090271165760927,0.0037718666630537950497
0.33118495543541465187,0.089043854456863635871,0.0028498976826809891034
0.35563684619072832849,0.0080456387278461261731,0.0033663501225037581639
0.36263382262806570511,0.00047525918741346355727,0.0051785217867562427854
0.36844010157683404483,0.0076533576931709654603,0.0030864241996345002754
0.43765765798874345371,0.00076192876332982755611,0.0078485172634525559449
0.44925492642991693426,0.00088390576559204217001,0.0029184129082226780566
$$ [...]
Compound,Artifact|Weak,,1,0.49682829911594539318,0,0
Compound,None,,1,0.8911907792593085631,0,0
Compound,None,,1,0.60000000000000008882,0,0
Compound,Artifact|Weak,,1,0.42667237846174116411,0,0
Compound,Artifact|Weak,,1,1.1799962509641619413,0,0
Artifact,Artifact|Weak,,1,-0.10086983345467277762,0,0
Solvent,None,,1,0.79605004060298634183,0,0
Compound,Artifact|Impurity|Weak|13C Sat.,,1,1.6073288275173680528,0,0
Compound,Artifact|Impurity|Weak|13C Sat.,,1,1.6153083296289023618,0,0
Compound,Artifact|Weak,,1,0.2000000000000000111,0,0
Compound,Artifact|Weak,,1,0.75593132130996165685,0,0
Compound,None,,1,1.5907735344766840146,0,0
Compound,Artifact|Weak,,1,1.999999999999999778,0,0
Compound,None,,1,0.18620325752476124537,0,0
Compound,Artifact|Weak,,1,1.9448989610278943907,0,0
Compound,None,,1,1.326344309576555025,0,0
Impurity,Artifact|Weak,,1,0.42947009266084062995,0,0
Impurity,Artifact|Weak,,1,0.16132449058464898295,0,0
Impurity,Artifact|Weak,,1,1.999999999999999778,0,0
Compound,Artifact|Impurity|Weak|13C Sat.,,1,-0.40000000000000007772,0,0
Compound,Artifact|Weak,,1,0.69710931173314327758,0,0
Compound,Artifact|Weak,,1,1.0360987374955290541,0,0
Compound,None,,1,1.0263339372045545694,0,0
Compound,None,,1,0.83767410206746661938,0,0
Compound,None,,1,-0.10590300051674020332,0,0
Compound,None,,1,1.9297033168275405934,0,0
Compound,None,,1,1.0417934024863524378,0,0
Compound,Artifact|Weak,,1,-0.40000000000000007772,0,0
Compound,Artifact|Weak,,1,-0.78946808224348319349,0,0
Impurity,Artifact|Weak,,1,0.035106389193187294284,0,0
Solvent,Artifact|Impurity|Weak|13C Sat.,,1,0.44637417195456036145,0,0
Compound,Artifact|Impurity|Weak|13C Sat.,,1,0.60876027448884451054,0,0
Impurity,Artifact|Weak,,1,0.030912650151643961127,0,0
Impurity,Artifact|Weak,,1,0.61745941100223278308,0,0
Artifact,Artifact|Weak,,1,-0.8808465230048034833,0,0
Impurity,Artifact|Weak,,1,0.13065853948837222176,0,0
Impurity,Artifact|Weak,,1,0.97923000023646089574,0,0
Compound,Artifact|Impurity|Weak|13C Sat.,,1,0.70244026166020501201,0,0
Compound,Artifact|Impurity|Weak|13C Sat.,,1,0.40000000000000007772,0,0
Impurity,Artifact|Weak,,1,0.60000000000000008882,0,0
Impurity,Artifact|Weak,,1,0.89560758188956701709,0,0
Impurity,Artifact|Weak,,1,1.5142666913653666239,0,0
Compound,None,,1,1.0303314376152332699,0,0
Compound,Artifact|Impurity|Weak|13C Sat.,,1,1.5993338957625786723,0,0
Impurity,Artifact|Weak,,1,1.9331789661588540952,0,0
Artifact,Artifact|Weak,,1,0.35126313345174081659,0,0
Impurity,Artifact|Weak,,1,1.3094915324314140292,0,0
Compound,Artifact|Weak,,1,1.999999999999999778,0,0
Compound,None,,1,0.74781040641896412424,0,0
Compound,None,,1,1.2413134720057412697,0,0
Impurity,Artifact|Weak,,1,1.999999999999999778,0,0
Artifact,Artifact|Weak,,1,0.94618126280871406308,0,0
Impurity,Artifact|Weak,,1,1.3772976260869715937,0,0
Compound,Artifact|Impurity|Weak|13C Sat.,,1,0.56584192547340306234,0,0
Artifact,Artifact|Weak,,1,0.88529560672412022093,0,0
Compound,None,,1,-0.12741619311274510196,0,0
##END=	
##END=	
