##TITLE=	ml2620

##JCAMP-DX=	6.0	$$ MestReNova 14.1.1-24571
##DATA TYPE=	LINK
##BLOCK_ID=	1
##BLOCKS=	2    
##ORIGIN=	Mestrelab Research S.L.
##OWNER=	ZYisrio!
##$MNOVA/LINK_BLOCK_TYPE=	ITEM	$$ NMR Spectrum
##$MNOVA/ITEM/POLYGON=	(XY..XY)
5321,5835
8722,5835
8722,8208
5321,8208
5321,5835
##$MNOVA/ITEM/Z=	0
##$MNOVA/ITEM/ANGLE=	0
##TITLE=	ml2620
##JCAMP-DX=	6.0	$$ MestReNova 14.1.1-24571
##BLOCK_ID=	2
##DATA TYPE=	NMR SPECTRUM
##DATA CLASS=	XYDATA
##NUMDIM=	1
##ORIGIN=	JEOL
##OWNER=	ZYisrio!
##.OBSERVE FREQUENCY=	399.79071365325000897
##.OBSERVE NUCLEUS=	^1H
##.SOLVENT NAME=	CHLOROFORM-D
##.PULSE SEQUENCE=	proton.jxp
##LONGDATE=	2021/03/16 18:01:03.000
##.ACQUISITIONMODE=	SIMULTANEOUS
##$ORIGINAL FORMAT=	JEOL Delta
##$MNOVA/SCALES_VERSION=	9
##$PARAMETER FILE=	(datafile, ASCII, c:/Users/ZYisrio!/Downloads/ml2620_PROTON-1-1.jdf, 0)
$$ 
##$PARAMETER FILE=	(footer, BASE64, c:/Users/ZYisrio!/Downloads/ml2620_PROTON-1-1.jdf, 540672)
AQAAANsdAABoZWFkZXIKICAgIGZpbGVuYW1lICAgICAgICA9PiAibWwyNjIwX1BST1RPTiI7CiAgICBz
YW1wbGVfaWQgICAgICAgPT4gIm1sMjYyMCI7CiAgICBjb21tZW50ICAgICAgICAgPT4gIiI7CiAgICBw
cm9jZXNzICAgICAgICAgPT4gInByb3Rvbl9hdXRvcGhhc2UubGlzdCI7CiAgICBhdXRvX2R3ZWxsICAg
ICAgPSAgVFJVRTsKICAgIGF1dG9fZmlsdGVyICAgICA9ICBUUlVFOwogICAgYXV0b19nYWluICAgICAg
ID0+IFRSVUU7CiAgICBmaWx0ZXJfbGltaXQgICAgPT4gMTY7CiAgICBmb3JjZV9kdWFsX21vZGUgPT4g
RkFMU0U7CiAgICBkZWNpbWF0aW9uX3JhdGUgPSAgMDsKICAgIGZvcmNlX3R1bmUgICAgICA9PiBGQUxT
RTsKICAgIHNhdmVfYWJvcnRlZCAgICA9ICBUUlVFOwogICAgdmVjdG9yICAgICAgICAgID0gIFRSVUU7
CmVuZCBoZWFkZXI7CgppbnN0cnVtZW50CiAgICByZWN2cl9nYWluID0+IDQ2OwplbmQgaW5zdHJ1bWVu
dDsKCmFjcXVpc2l0aW9uCiAgICB4X2RvbWFpbiAgICAgPT4gIlByb3RvbiI7CiAgICB4X29mZnNldCAg
ICAgPT4gNVtwcG1dOwogICAgeF9zd2VlcCAgICAgID0+IDE1W3BwbV07CiAgICB4X3BvaW50cyAgICAg
PT4gMzI3Njg7CiAgICBzY2FucyAgICAgICAgPT4gODsKICAgIHhfcHJlc2NhbnMgICA9PiAwOwogICAg
bW9kX3JldHVybiAgID0+IDE7CiAgICB4X2FjcV90aW1lICAgPT8geF9wb2ludHMgLyB4X3N3ZWVwOwog
ICAgeF9yZXNvbHV0aW9uID0/IDEgLyB4X2FjcV90aW1lOwplbmQgYWNxdWlzaXRpb247CgpwdWxzZQog
ICAgY29sbGVjdCBDT01QTEVYLE9CUzsKCiAgICBtYWNybyBvYnNfcHJlc2F0X3RpbWUoIGRhbnRlX3By
ZXNhdCwgZGFudGVfbG9vcCwgZGFudGVfcHVsc2UsIGRhbnRlX2ludGVydmFsLCBwaGFzZV9kYW50ZSwg
cGhzX3NoZnQsIGRhbnRlX2F0dGVudWF0b3IsIHByZXNhdF90aW1lICkgaXMKICAgICAgICB3aGVuIGRh
bnRlX3ByZXNhdCBkbwogICAgICAgICAgICBsb29wIDEwMCAqIGRhbnRlX2xvb3AgdGltZXMKICAgICAg
ICAgICAgICAgIGRhbnRlX3B1bHNlLCAoT0JTLkdBVEUsIE9CUy5QSFMucGhhc2VfZGFudGUubHN0ZXAo
cGhzX3NoZnQpLCBPQlMuQVROLmRhbnRlX2F0dGVudWF0b3IpOwogICAgICAgICAgICAgICAgZGFudGVf
aW50ZXJ2YWw7CiAgICAgICAgICAgIGVuZCBsb29wOwogICAgICAgIGVuZCB3aGVuOwogICAgICAgIHdo
ZW4gbm90IGRhbnRlX3ByZXNhdCBkbwogICAgICAgICAgICBwcmVzYXRfdGltZTsKICAgICAgICBlbmQg
d2hlbjsKICAgIGVuZCBvYnNfcHJlc2F0X3RpbWU7CgogICAgbWFjcm8gYWNxKCBkZWFkX3RpbWUsIGRl
bGF5LCBwaGFzZSApIGlzCiAgICAgICAgZGVhZF90aW1lLCBPQlMuUEhTLjA7CiAgICAgICAgZGVsYXks
IChPQlMuUEhTLjAsIFJDVi5HQVRFKTsKICAgICAgICBhY3F1aXJlIChPQlMuUEhTLjAsIFJDVi5QSFMu
cGhhc2UpOwogICAgZW5kIGFjcTsKCiAgICBleHBlcmltZW50ICAgICAgICAgICAgPSAgInByb3Rvbi5q
$$ [...]
AAAAAAAAAAAAAAAAAAAAAAAAAAAAAAAAAAAAAAAAAAAAAAAAAAAAAAAAAAAAAAAAAAAAAAAAAAAAAAAA
AAAAAAAAAAAAAAAAAAAAAAAAAAAAAAAAAAAAAAAAAAAAAAAAAAAAAAAAAAAAAAAAAAAAAAAAAAAAAAAA
AAAAAAAAAAAAAAAAAAAAAAAAAAAAAAAAAAAAAAAAAAAAAAAAAAAAAAAAAAAAAAAAAAAAAAAAAAAAAAAA
AAAAAAAAAAAAAAAAAAAAAAAAAAAAAAAAAAAAAAAAAAAAAAAAAAAAAAAAAAAAAAAAAAAAAAAAAAAAAAAA
AAAAAAAAAAAAAAAAAAAAAAAAAAAAAAAAAAAAAAAAAAAAAAAAAAAAAAAAAAAAAAAAAAAAAAAAAAAAAAAA
AAAAAAAAAAAAAAAAAAAAAAAAAAAAAAAAAAAAAAAAAAAAAAAAAAAAAAAAAAAAAAAAAAAAAAAAAAAAAAAA
AAAAAAAAAAAAAAAAAAAAAAAAAAAAAAAAAAAAAAAAAAAAAAAAAAAAAAAAAAAAAAAAAAAAAAAAAAAAAAAA
AAAAAAAAAAAAAAAAAAAAAAAAAAAAAAAAAAAAAAAAAAAAAAAAAAAAAAAAAAAAAAAAAAAAAAAAAAAAAAAA
AAAAAAAAAAAAAAAAAAAAAAAAAAAAAAAAAAAAAAAAAAAAAAAAAAAAAAAAAAAAAAAAAAAAAAAAAAAAAAAA
AAAAAAAAAAAAAAAAAAAAAAAAAAAAAAAAAAAAAAAAAAAAAAAAAAAAAAAAAAAAAAAAAAAAAAAAAAAAAAAA
AAAAAAAAAAAAAAAAAAAAAAAAAAAAAAAAAAAAAAAAAAAAAAAAAAAAAAAAAAAAAAAAAAAAAAAAAAAAAAAA
AAAAAAAAAAAAAAAAAAAAAAAAAAAAAAAAAAAAAAAAAAAAAAAAAAAAAAAAAAAAAAAAAAAAAAAAAAAAAAAA
AAAAAAAAAAAAAAAAAAAAAAAAAAAAAAAAAAAAAAAAAAAAAAAAAAAAAAAAAAAAAAAAAAAAAAAAAAAAAAAA
AAAAAAAAAAAAAAAAAAAAAAAAAAAAAAAAAAAAAAAAAAAAAAAAAAAAAAAAAAAAAAAAAAAAAAAAAAAAAAAA
AAAAAAAAAAAAAAAAAAAAAAAAAAAAAAAAAAAAAAAAAAAAAAAAAAAAAAAAAAAAAAAAAAAAAAAAAAAAAAAA
AAAAAAAAAAAAAAAAAAAAAAAAAAAAAAAAAAAAAAAAAAAAAAAAAAAAAAAAAAAAAAAAAAAAAAAAAAAAAAAA
AAAAAAAAAAAAAAAAAAAAAAAAAAAAAAAAAAAAAAAAAAAAAAAAAAAAAAAAAAAAAAAAAAAAAAAAAAAAAAAA
AAAAAAAAAAAAAAAAAAAAAAAAAAAAAAAAAAAAAAAAAAAAAAAAAAAAAAAAAAAAAAAAAAAAAAAAAAAAAAAA
AAAAAAAAAAAAAAAAAAAAAAAAAAAAAAAAAAAAAAAAAAAAAAAAAAAAAAAAAAAAAAAAAAAAAAAAAAAAAAAA
AAAAAAAAAAAAAAAAAAAAAAAAAAAAAAAAAAAAAAAAAAAAAAAAAAAAAAAAAAAAAAAAAAAAAAAAAAAAAAAA
AAAAAAAAAAAAAAAAAAAAAAAAAAAAAAAAAAAAAAAAAAAAAAAAAAAAAAAAAAAAAAAAAAAAAAAAAAAAAAAA
AAAAAAAAAAAAAAAAAAAAAAAAAAAAAAAAAAAAAAAAAAAAAAAAAAAAAAAAAAAAAAAAAAAAAAAAAAAAAAAA
AAAAAAAAAAAAAAAAAAAAAAAAAAAAAAAAAAAAAAAAAAAAAAAAAAAAAAAAAAAAAAAAAAAAAAAAAAAAAAAA
AAAAAAAAAAAAAAAAAAAAAAAAAAAAAAAAAAAAAAAAAAAAAAAAAAAAAAAAAAAAAAAAAAAAAAAAAAAAAAAA
AAAAAAAAAAAAAAAAAAAAAAAAAAAAAAAAAAAAAAAAAAAAAAAAAAAAAAAAAAAAAAAAAAAAAAAAAAAAAAAA
AAAAAAAAAAAAAAAAAAAAAAAAAAAAAAAAAAAAAAAAAAAAAAAAAAAAAAAAAAAAAAAAAAAAAAAAAAAAAAAA
AAAAAAAAAAAAAAAAAAAAAAAAAAAAAAAAAAAAAAAAAAAAAAAAAAAAAAAAAAAAAAAAAAAAAAAAAAAAAAAA
AAAAAAAAAAAAAAAAAAAAAAAAAAAAAAAAAAAAAAAAAAAAAAAAAAAAAAAAAAAAAAAAAAAAAAAAAAAAAAAA
AAAAAAAAAAAAAAAAAAAAAAAAAAAAAAAAAAAAAAAAAAAAAAAAAAAAAAAAAAAAAAAAAAAAAAAAAAAAAAAA
AAAAAAAAAAAAAAAAAAAAAAAAAAAAAAAAAAAAAAAAAAAAAAAAAAAAAAAAAAAAAAAAAAAAAAAAAAAAAAAA
AAAAAAAAAAAAAAAAAAAAAAAAAAAAAAAAAAAAAAAAAAAAAAAAAAAAAAAAAAAAAAAAAAAAAAAAAAAAAAAA
AAAAAAAAAAAAAAAAAAAAAAAAAAAAAAAAAAAAAAAAAAAAAAAAAAAAAAAAAAAAAAAAAAAAAAAAAAAAAAAA
AAAAAA==
##XUNITS=	HZ
##YUNITS=	ARBITRARY UNITS
##FIRSTX=	4996.5554867314731382
##LASTX=	-998.53400337775599382
##DELTAX=	-0.11434682122697797935
##XFACTOR=	1
##YFACTOR=	4.3605969390194032262e-08
##FIRSTY=	-0.0002131020446540787816
##MINY=	-0.00024140485038515180349
##MAXY=	0.3053201138973236084
##NPOINTS=	52430
##XYDATA=	(X++(Y..Y))
$$ [...]
2506e233n8P5P6M2M2M2M2K5K5K4K5MNNMk5k5k6k5Q0Q0j07j07L3L2L3L3l9l9J31k9l0l0M0M0
2502d835K4K3L3j26o7o7N6N7N5N5k5k6J0J0J0J0n0n1n0n0m7m8L3L4L4L5L5L4p7p7p8p7Q8Q8
2498e027M4j16K6K5J6J6j2j1j1j1O5O5o9o9N0N0l1l0n5n6P9P8kjkkk9k9k9k9P9P9n4n4klk
2493e064lNMQ5Q4m8m8m8m8jjP9P9j5j5j5j5q5q5M8M9j2j1j1j2jkP9P9JKKJllmlj2j1j2j1N3
2489d949N4k7k6j6j6j5j6O3O3j8j7p3p3QPJ09J09n1j85q0%K6K6J2J1o9o8P2P1qqL5L5m5m5
2485e104kkP9P8j4j4j3j4P0P0o4o4p5p6NNK3K3M9J30P8n5n6n5l3l3l3l3J7J7J7J7k4k4J10
2481e000J09l0l1K6n4o4J23Q8m6j%rrm0l9L6L5K6n5r9O1QRJ8J9J7J7o4o3K1K1K1K1J6J5P1
2476d826rj40J9N0l1M5M5J4o5j20M0K6K5o2o1P2P2p5p6N8N8K4K5K4K5l9l8l9l8k4k3k4k3J6
$$ plain form
2506 -5233 -5291 -5216 -5140 -5098 -5056 -5014 -4972 -4947 -4922 -4898 -4873 -4869 -4864 -4859 -4855 -4880 -4905 -4931 -4956 -4876 -4796 -4903 -5010 -4977 -4945 -4912 -4879 -4918 -4957 -4826 -4855 -4885 -4915 -4875 -4835
2502 -4835 -4811 -4788 -4755 -4881 -4948 -5015 -4959 -4902 -4847 -4792 -4817 -4843 -4833 -4823 -4813 -4803 -4853 -4904 -4954 -5004 -5051 -5099 -5066 -5032 -4998 -4963 -4928 -4894 -4971 -5048 -5126 -5203 -5115 -5027
2498 -5027 -4983 -5099 -5073 -5048 -5032 -5016 -5028 -5039 -5050 -5061 -4996 -4931 -5000 -5069 -5019 -4969 -5000 -5030 -5085 -5141 -5062 -4984 -4986 -4987 -4989 -4991 -5020 -5049 -5078 -5107 -5028 -4949 -5003 -5057 -5059 -5062 -5064
2493 -5064 -5067 -5062 -5058 -4973 -4889 -4937 -4985 -5033 -5081 -5082 -5083 -5004 -4925 -4940 -4955 -4970 -4985 -5070 -5155 -5107 -5058 -5070 -5081 -5092 -5104 -5105 -5107 -5028 -4949 -4948 -4946 -4944 -4943 -4946 -4949 -4953 -4956 -4968 -4979 -4991 -5002 -4949
2489 -4949 -4895 -4922 -4948 -4964 -4980 -4995 -5011 -4948 -4885 -4903 -4920 -4993 -5066 -5058 -5051 -4942 -4833 -4884 -5069 -5149 -5149 -5123 -5097 -5085 -5074 -5143 -5211 -5139 -5068 -5076 -5084 -5049 -5014 -5059 -5104
2485 -5104 -5106 -5108 -5029 -4951 -4965 -4979 -4992 -5006 -4936 -4866 -4930 -4994 -5069 -5145 -5140 -5135 -5112 -5089 -5040 -4910 -4832 -4887 -4943 -4998 -5031 -5064 -5097 -5130 -5113 -5096 -5079 -5062 -5086 -5110 -5000
2481 -5000 -4891 -4921 -4952 -4926 -4980 -5044 -4921 -4833 -4879 -4880 -4880 -4889 -4898 -4938 -4977 -4941 -4906 -4880 -4935 -5034 -4973 -4965 -4956 -4938 -4919 -4902 -4885 -4949 -5012 -4991 -4970 -4949 -4928 -4912 -4897 -4826
2476 -4826 -4835 -4975 -4956 -4906 -4937 -4892 -4847 -4833 -4898 -5018 -4978 -4952 -4927 -4989 -5050 -4978 -4906 -4981 -5057 -4999 -4941 -4917 -4892 -4868 -4843 -4882 -4920 -4959 -4997 -5021 -5044 -5068 -5091 -5075
2473e075J5o4o4Q0Q1n2n3Q2Q3M3j16j00j9N9N9KKKKk3k3k3k3M4M4j1O9K7j33l8l8k2k2k2k2
2469e249N6N7j9j9qP1J17m3J3J3n2K9J16m4p4On9n9Q0Q0k2k2k2k3L2L1m8m9K8K9K8K9nnnn
2464e017k7k6N3N3m3m4m3m4O1O1j9j9J46J46r4r5p4p5OOL3L2L3L2j6j7j6j6l7l6l6l7J9J8
2461e132J8J9O8O9j2j2p9p9KJK0J9K0J9N1N0l0l0k7k6k7k7k4k4N6N6l5l6l6l6O9O9O9O8m9
2457d978n0L0L0LKLKl3l2M7M8n4n4K6K6J1J1o9o9NOONm9n0L1L1M8M8l2l1n7n7P7P6mmnmK4
2452e036K4n6n6O3O3j7j7j1j1j0j1M2M2M2M2j8j8j8j8m5m4m5m4J6J5J6J6kkkkP3P4o1o0J4
2448e062J5J4J5OOOPk4k4k4k4l4l4J00J00n3n3K7K7llq3q3P1P0rj0llklK1K0K1K1p0o9J1R1
2443e024M9q5q4M9N3k8K6K6L4L3L4L4p1p1RRJ6J6J6J6m4m4L6L6j8j8j7j8j3j2j3j3j5j5j5
$$ plain form
2473 -5075 -5060 -5124 -5188 -5108 -5027 -5079 -5132 -5050 -4967 -4924 -5040 -5140 -5159 -5100 -5041 -5039 -5037 -5035 -5033 -5056 -5079 -5102 -5125 -5081 -5037 -5048 -4979 -4952 -5085 -5123 -5161 -5183 -5205 -5227 -5249
2469 -5249 -5193 -5136 -5155 -5174 -5182 -5111 -4994 -5037 -5024 -5011 -5063 -5034 -4918 -4962 -5036 -5030 -5089 -5148 -5068 -4988 -5010 -5032 -5054 -5077 -5045 -5014 -5062 -5111 -5083 -5054 -5026 -4997 -5002 -5007 -5012 -5017
2464 -5017 -5044 -5070 -5017 -4964 -5007 -5051 -5094 -5138 -5077 -5016 -5035 -5054 -4908 -4762 -4856 -4951 -5025 -5100 -5094 -5088 -5055 -5023 -4990 -4958 -4974 -4991 -5007 -5023 -5060 -5096 -5132 -5169 -5150 -5132
2461 -5132 -5114 -5095 -5027 -4958 -4970 -4982 -5061 -5140 -5138 -5137 -5117 -5098 -5078 -5059 -5008 -4958 -4988 -5018 -5045 -5071 -5098 -5125 -5149 -5173 -5117 -5061 -5096 -5132 -5168 -5204 -5135 -5066 -4997 -4929 -4978
2457 -4978 -5028 -4998 -4968 -4965 -4963 -4960 -4958 -4991 -5023 -4976 -4928 -4982 -5036 -5010 -4984 -4973 -4962 -5031 -5100 -5095 -5089 -5083 -5078 -5127 -5177 -5146 -5115 -5067 -5019 -5051 -5082 -5139 -5196 -5119 -5043 -5047 -5051 -5056 -5060 -5036
2452 -5036 -5012 -5068 -5124 -5061 -4998 -5015 -5032 -5043 -5054 -5064 -5075 -5033 -4991 -4949 -4907 -4925 -4943 -4961 -4979 -5024 -5068 -5113 -5157 -5141 -5126 -5110 -5094 -5096 -5098 -5100 -5102 -5029 -4955 -5016 -5076 -5062
2448 -5062 -5047 -5033 -5018 -5012 -5006 -5000 -4993 -5017 -5041 -5065 -5089 -5123 -5157 -5057 -4957 -5010 -5063 -5036 -5009 -5012 -5015 -5098 -5181 -5110 -5040 -5049 -5059 -5062 -5065 -5067 -5070 -5049 -5029 -5008 -4987 -5057 -5126 -5115 -5024
2443 -5024 -4975 -5060 -5144 -5095 -5042 -5070 -5044 -5018 -4984 -4951 -4917 -4883 -4954 -5025 -5016 -5007 -4991 -4975 -4959 -4943 -4987 -5031 -4995 -4959 -4977 -4995 -5012 -5030 -5043 -5055 -5068 -5081 -5096 -5111 -5126
2439e126j5O0N9p3p4POPOj4j3O7O6qqqqk9k8K5n4lJ32R1J1Mp6j10K2QQR1m2jjq4N0R3R4l2
2435d900l2lmllN5N5N5N5k7k7k6k7j3j3O8O7M2M3l8l8M2M2l8l9P7P7n6n7qrqrl7l7l7l7j8
2430d866j9j8j9P4P3pppqpq%jjjj15j14P2P2J%J%k4k3k4k4N5N4k5k6J%J%k5k4k5k5O6O5O5
2426d843O5q9q9M5M5l8l9R5R6m6m5m5m5j1j1j1j1l9m0R5R4J5J4J5J4k3k4k4k4J5J6J5J6l0
2422d872k9N0N1KJKKj3j4j3j3M7M7M7M7n8n8K2K3j7j7j7j7J9J9J9J9Q8Q8M8M7J7J7j0K58Q8
2418d080p3m6m6m1m1l1l1j59JM5M4l2l3l2l2o7o7m0J21J35j31m2m1q4P7J57lj9j8k9k8jjq1
2414d749q1L0K9n1n1M5M5M4M5o5o6J5J5J07J08J07J08M9M9J83J82J41J41PPp2p1j52j51j03
2410d155j02j03j02l4l4l4l3J8J8q1P8J51j0r7r7L2L1L2L2J18J18J18J17k9k9L2j30k15n5
$$ plain form
2439 -5126 -5141 -5081 -5022 -5095 -5169 -5162 -5156 -5149 -5143 -5157 -5170 -5103 -5037 -5045 -5053 -5061 -5069 -5098 -5126 -5101 -5155 -5158 -5026 -4935 -4924 -4920 -4996 -5106 -5084 -5076 -5068 -4977 -5019 -5020 -5021 -5105 -5055 -4962 -4868 -4900
2435 -4900 -4932 -4935 -4939 -4942 -4945 -4890 -4835 -4780 -4725 -4752 -4779 -4805 -4832 -4845 -4858 -4790 -4723 -4681 -4638 -4676 -4714 -4672 -4630 -4668 -4707 -4630 -4553 -4609 -4666 -4674 -4683 -4691 -4700 -4737 -4774 -4811 -4848 -4866
2430 -4866 -4885 -4903 -4922 -4848 -4775 -4782 -4789 -4796 -4804 -4811 -4819 -4819 -4820 -4821 -4822 -4937 -5051 -4979 -4907 -4906 -4906 -4905 -4905 -4929 -4952 -4976 -5000 -4945 -4891 -4916 -4942 -4941 -4941 -4940 -4940 -4965 -4989 -5014 -5039 -4973 -4908 -4843
2426 -4843 -4778 -4867 -4956 -4911 -4866 -4904 -4943 -4848 -4752 -4798 -4843 -4888 -4933 -4944 -4955 -4966 -4977 -5016 -5056 -4961 -4867 -4852 -4838 -4823 -4809 -4832 -4856 -4880 -4904 -4889 -4873 -4858 -4842 -4872
2422 -4872 -4901 -4851 -4800 -4798 -4797 -4795 -4793 -4806 -4820 -4833 -4846 -4799 -4752 -4705 -4658 -4716 -4774 -4752 -4729 -4746 -4763 -4780 -4797 -4778 -4759 -4740 -4721 -4633 -4545 -4497 -4450 -4433 -4416 -4426 -4168 -4080
2418 -4080 -4153 -4199 -4245 -4286 -4327 -4358 -4389 -4548 -4547 -4502 -4458 -4490 -4523 -4555 -4587 -4654 -4721 -4761 -4640 -4505 -4636 -4678 -4719 -4803 -4726 -4569 -4572 -4591 -4609 -4638 -4666 -4667 -4668 -4749
2414 -4749 -4830 -4800 -4771 -4822 -4873 -4828 -4783 -4739 -4694 -4759 -4825 -4810 -4795 -4688 -4580 -4473 -4365 -4316 -4267 -4084 -3902 -3761 -3620 -3613 -3606 -3678 -3749 -3901 -4052 -4155
2410 -4155 -4257 -4360 -4462 -4496 -4530 -4564 -4597 -4579 -4561 -4642 -4564 -4413 -4423 -4520 -4617 -4585 -4554 -4522 -4490 -4372 -4254 -4136 -4019 -4048 -4077 -4045 -4175 -4390 -4445
2407d445k1k2l9l9l9l9J6J5N5N6L8L8l2l2m1J19J10J09J23J23j1j0J1J2o8o8k7k7o7o7n2n2
2403d373n2n2J0J0O1j00KLp7p8p9Q2P1P2K17K17J26K87K75K74J95J94N6j03j91j91k96j35
2400c575j86j85j68j68q8q8j8j9j8j9P7P7n7n7RJ0o1o1j20L9L0K9K6K5J06J06K5K5O4O5K3
2397d152K3j10j11n3n3n3n3j1j2j2j2J49J48J5J5J37J37L24L23K78K77J26J27K8k40k23k23
2394c211j84j85j04j04j09j10j09j09j52j52L5L6J0J1l0k9k3k3J7J8J12J12L1L2J05J04R4
2390c917R5J05n6r9r9j39j39o9o9K2j39j39K2o2o1Q1Q2O3O3O2O3J19J20K9J90J35J35R2o9
2387c579J15m5L5L5L3L2o4k25k05k05q1q1L0L1L0L1l8l9j28L2N9N9J69QQ1K41J40J41Q5Q5
2384c218j56j56k36k36j03j02r8r8r9r8J1J0J0J1NOONRRp1p2J29J28nnM5M4M5M5J00J00J00
$$ plain form
2407 -4445 -4466 -4488 -4527 -4566 -4605 -4644 -4628 -4613 -4558 -4502 -4464 -4426 -4458 -4490 -4531 -4412 -4302 -4193 -4070 -3947 -3958 -3968 -3957 -3945 -4013 -4081 -4108 -4135 -4202 -4269 -4321 -4373
2403 -4373 -4425 -4477 -4467 -4457 -4396 -4496 -4494 -4491 -4568 -4646 -4725 -4643 -4572 -4500 -4283 -4066 -3940 -3653 -3378 -3104 -2909 -2715 -2659 -2762 -2953 -3144 -3440 -3575
2400 -3575 -3761 -3946 -4114 -4282 -4370 -4458 -4476 -4495 -4513 -4532 -4455 -4378 -4435 -4492 -4483 -4473 -4534 -4595 -4715 -4676 -4646 -4617 -4591 -4566 -4460 -4354 -4329 -4304 -4240 -4175 -4152
2397 -4152 -4129 -4239 -4350 -4403 -4456 -4509 -4562 -4573 -4585 -4597 -4609 -4460 -4312 -4297 -4282 -4145 -4008 -3684 -3361 -3083 -2806 -2680 -2553 -2525 -2765 -2988 -3211
2394 -3211 -3395 -3580 -3684 -3788 -3897 -4007 -4116 -4225 -4377 -4529 -4494 -4458 -4448 -4437 -4467 -4496 -4519 -4542 -4525 -4507 -4395 -4283 -4252 -4220 -4115 -4011 -3917
2390 -3917 -3822 -3717 -3773 -3872 -3971 -4110 -4249 -4318 -4387 -4365 -4504 -4643 -4621 -4683 -4744 -4663 -4581 -4518 -4455 -4393 -4330 -4211 -4091 -4062 -3872 -3737 -3602 -3510 -3579
2387 -3579 -3464 -3509 -3474 -3439 -3406 -3374 -3438 -3663 -3868 -4073 -4154 -4235 -4205 -4174 -4144 -4113 -4151 -4190 -4318 -4286 -4227 -4168 -3999 -3991 -3910 -3669 -3529 -3388 -3303 -3218
2384 -3218 -3374 -3530 -3766 -4002 -4105 -4207 -4305 -4403 -4502 -4600 -4589 -4579 -4569 -4558 -4553 -4547 -4541 -4536 -4527 -4518 -4589 -4661 -4532 -4404 -4409 -4414 -4369 -4325 -4280 -4235 -4135 -4035 -3935
2380c935R9J3J3o7o7j43j42rro9o8o9o9qqpqJ01J01J00J01J04J03J3J3R4o7n7n7q5q5q5q5
2376d344k5k5k5k5n0n0L1L0m8m9m8m8K9L0J9K0N4j06o0J9N5N6P0P0m4J15J06n5pj67r7O4R
2372d496QJ14m7o2J7l7l7K7K8K8K7m7m7m7m7N8N9k2k2Q4Q4Q4Q4J34J35%Jj48j48j48j48ll
2369d537klq5q5q5q5qqP2P2P2P1rrM1M1M2M1PQPQj44j45M3M2J2J1J1J1L2L3L3L3J7J7J7J7
2364d394k8k8N3N2j3j3j2j3L1L0L1L1O7O7o6o7k9l0l0k9J6J7K6j34n4n3k1J40K7K6L6L6J1
2361d317J1j4r5o6R5M9l1MQ4%q1K5K5K0K0j9j8j9j8ooooL4L4m6m7j8j8O1O2N9N8N9N8k5k5
2356d123k4k5J3J4QRl2j11q7P4J60Jl5M5P7q4l3M7o9o8P0P0k2k3k2k3J1J1J1J1J2J2R3R2P6
2352c864P5J56J56j0j0j0j1o0o0K0K0mmqrQ5Nm6J16O3j8L8L8M8M8q5q6MNr6O5J67OL6L6n5
$$ plain form
2380 -3935 -3836 -3823 -3810 -3877 -3944 -4087 -4229 -4238 -4247 -4316 -4384 -4453 -4522 -4530 -4538 -4545 -4553 -4452 -4351 -4251 -4150 -4046 -3943 -3930 -3917 -3823 -3890 -3947 -4004 -4089 -4174 -4259 -4344
2376 -4344 -4369 -4394 -4419 -4444 -4494 -4544 -4513 -4483 -4531 -4580 -4628 -4676 -4647 -4617 -4598 -4578 -4524 -4630 -4690 -4671 -4616 -4560 -4490 -4420 -4464 -4349 -4243 -4298 -4305 -4472 -4569 -4505 -4496
2372 -4496 -4488 -4374 -4421 -4483 -4466 -4503 -4540 -4513 -4485 -4457 -4430 -4477 -4524 -4571 -4618 -4560 -4501 -4523 -4545 -4461 -4377 -4293 -4209 -4075 -3940 -3940 -3939 -4087 -4235 -4383 -4531 -4534 -4537
2369 -4537 -4539 -4542 -4627 -4712 -4797 -4882 -4890 -4898 -4826 -4754 -4682 -4611 -4620 -4629 -4588 -4547 -4505 -4464 -4457 -4449 -4442 -4434 -4578 -4723 -4680 -4638 -4626 -4615 -4604 -4593 -4561 -4528 -4495 -4462 -4445 -4428 -4411 -4394
2364 -4394 -4422 -4450 -4397 -4345 -4358 -4371 -4383 -4396 -4365 -4335 -4304 -4273 -4206 -4139 -4205 -4272 -4301 -4331 -4361 -4390 -4374 -4357 -4331 -4465 -4519 -4572 -4593 -4453 -4426 -4400 -4364 -4328 -4317
2361 -4317 -4306 -4320 -4415 -4481 -4386 -4337 -4368 -4364 -4280 -4280 -4361 -4336 -4311 -4291 -4271 -4290 -4308 -4327 -4345 -4351 -4357 -4363 -4369 -4335 -4301 -4347 -4394 -4412 -4430 -4369 -4307 -4248 -4190 -4131 -4073 -4098 -4123
2356 -4123 -4147 -4172 -4159 -4145 -4137 -4128 -4160 -4271 -4358 -4284 -4124 -4123 -4158 -4113 -4036 -4120 -4153 -4106 -4175 -4243 -4173 -4103 -4125 -4148 -4170 -4193 -4182 -4171 -4160 -4149 -4137 -4125 -4032 -3940 -3864
2352 -3864 -3789 -3633 -3477 -3487 -3497 -3507 -3518 -3578 -3638 -3618 -3598 -3602 -3606 -3614 -3623 -3538 -3533 -3579 -3463 -3400 -3418 -3380 -3342 -3294 -3246 -3331 -3417 -3413 -3408 -3504 -3439 -3272 -3266 -3230 -3194 -3249
2348c249J05J39O0J5J4J43J44J6J7R7R7J50J51K05J26R8K59K98K97K84K84M17M18N91N91N18
2345B285O78Q57J124J412J786K660L890N608P799J0342J3069J5648J6878J5885J3159P987
2343A21067j263j0574j5440j5814j3729j1308r543q447p324n814m157k687j564n82K20P00
2342A3741J075R37N62J88p21j479j854j827j559j303r28q09p29m57k97o5R4J47K26L52N12
2339E806N57P18Q92R71J146J225J360J840K349L043M427O512R703J4034J8978K4486L0503
2337A28550L4835L4600L0270K2859P194j5974l2494l6001l1242k4392k0062j7797j5604j2758
2336E1984r283o135l302j196M60J941K850L174L174K822K128J349J831M139P293J0956J4217
2334H8402J5740J4832J2366P286k160j1945j6894j6975j4684j2064j0161q825p291n740l976
$$ plain form
2348 -3249 -3144 -3005 -2945 -2930 -2916 -2773 -2629 -2613 -2596 -2499 -2402 -2252 -2101 -1896 -1770 -1672 -1413 -1115 -818 -534 -250 167 585 1176 1767 2285
2345 2285 2963 3820 4944 6356 8142 10802 14692 20300 28099 38441 51510 67158 84036 99921 113080 121067
2343 121067 119804 109230 93790 77976 64247 52939 43396 34949 27625 21811 17654 14967 13403 12821 13041 13741
2342 13741 14816 15753 16315 16503 15782 14303 12449 10622 9063 7760 6832 6023 5294 4837 4540 4475 4569 4716 4942 5294 5806
2339 5806 6363 7081 7973 8944 10090 11315 12675 14515 16864 19907 24334 30846 40549 54583 73561 98047 128550
2337 128550 163385 197985 228255 251114 258308 242334 209840 173839 142597 118205 98143 80346 64742 51984
2336 51984 42701 36566 33264 32068 32528 34469 37319 40493 43667 46489 48617 49966 51797 55936 63229 74185 88402
2334 88402 104142 118974 131340 138626 136466 124521 107627 90652 75968 63904 53743 44918 37627 31887 27911
2332B7911k426j154J83J232K141L069L872M954O291P734R604J1984J4282J5499J4911J2358
2330A32445N675n475j5258j8360j6381j2886j0159q970p740o357m591k701j150J96J319K175
2328C1782K869L489M185M886N794P336J0489J5795K2906L1168M0309M8062N0788M8877M2087
2327C70822K3963l890k8141m2843m7428m4167l9121l4042k9037k4386j9624j4759j0282o273
2325E0792k944k18J654K669K705K010L00k214m435n665n892n197m553m071l404k708k200j720
2323A4909j171n83l27j66J94N69O76Q36J097J257J418J686K007K487L183M198N863Q268J1656
2321E8057J6843K3798L1765L9824M6827N2608N3945M5000K7090P075j6608m0950n2979n1495
2319B40800m3315l4814k9307k5217k0887j5971j0893o469k780N1K137L373L961L586K250J108
$$ plain form
2332 27911 25485 24331 24514 25746 27887 30956 34828 39782 46073 53807 63411 75395 89677 105176 120087 132445
2330 132445 138120 132645 117387 99027 82646 69760 59601 50631 42891 36534 31943 29242 28092 28288 29607 31782
2328 31782 34651 38140 42325 47211 53005 60341 70830 86625 109531 140699 181008 229070 279858 328735 370822
2327 370822 394785 390895 362754 319911 272483 228316 189195 155153 126116 101730 82106 67347 57065 50792
2325 50792 47848 47630 49284 51953 54658 56668 56968 54754 50319 44654 38762 33565 29012 24941 21537 18829 16629 14909
2323 14909 13738 13155 12828 12662 12856 13425 14101 14937 16034 17291 18709 20395 22402 24889 28072 32270 38133 46401 58057
2321 58057 74900 98698 130463 170287 217114 269722 323667 368667 395757 402832 386224 345274 292295 240800
2319 240800 197485 162671 133364 108147 87260 71289 60396 53927 51147 51198 53335 56708 60669 64255 66505 67613
2317F7613j6o77O58L706P609J1966J5334J6457J5120J1911N335n384j4954j9084j8495j5502
2315H1597j2668j0860r416p806o041m201k436j039K97J455K471L407M422N606P155R040J1339
2314G2322J4188J6807J7629J6400J2751M036r389j9386k1101j7732j3809j1297r980q751o913
2312C5775m828k933j383K7J257K078K667L349L829M478N386O970J0231J5381K1742K8772L5883
2310A68681M0208L8443L2241K2352J631k5260m1271m2287l5360k7714k3398k0991j8218j4637
2308E4420j0680p205m080j568Q7J530K352K352J707O91j181l694n087n087m333l316k865k598
2306A1445k131j757j322r48n71m10k09n0P8K38L44L45N52N52O56O55R03J277J762K563L760
2304A7732N417P755J0804J3965J7227J9639K0014J8332J4323M894r167j9444k1530j8475j4467
$$ plain form
2317 67613 67597 66920 67578 71284 78893 90859 106193 122650 137770 149681 155016 149632 134678 115594 97099 81597
2315 81597 68929 58069 48653 40847 34806 30605 28169 27130 27427 28882 31353 34760 39182 44788 51943 60983 72322
2314 72322 86510 103317 120946 137346 150097 154133 144744 125358 104257 86525 72716 61419 51439 42688 35775
2312 35775 30947 28014 26631 26658 27915 29993 32660 36009 39838 44316 49702 56672 66903 82284 104026 132798 168681
2310 168681 208889 247332 279573 301925 303556 278296 237025 194738 159378 131664 108266 87275 69057 54420
2308 54420 43740 36535 32455 30887 30974 32504 34856 37208 38915 39606 38425 34731 29644 24557 20224 16908 14043 11445
2306 11445 9314 7557 6235 5287 4716 4306 4097 4047 4125 4363 4707 5052 5604 6156 6812 7467 8370 9647 11409 13972 17732
2304 17732 23149 30904 41708 55673 72900 92539 112553 130885 145208 150102 140935 121491 99961 81486 67019
2302F7019j2100j0978r641p876n991m120k483j146k20M75R82J143R81N00l83j612k501k661
2300I388k250j769j438j437j140r79p74o13n51k82k51k51k33k34j29j28j29j29m5m6m6m5n1
2297c562n1n0n1p0o9J0J0m9n0j30j29l3l2l3l2r2r3M1M1Q7Q7Q8Q7j9j8j8j8o8o7o8o8JJJJ
2293d415j32j31LKO0N9k1k1j3j4j03N6O2O2P2P2l3l3l2l3L6L6M6j15N7N6m4J16m3m4M6M6N
2290d335MNMo9o9J2J1J8J8J8J8n6n5K5K4k8k8k7k8O4O4O4O3J3J2J3J2m3m3m2m3p9p8JKL5L4
2285d489m5m5m2m2m2m3j3j4j4j4J2J1J1J2n9n9K1K2K8K8n1n2N3N3N4N3R8R8J7J8j9j9j9j9
2282d511P3P4o0o0K6K5K5K6j9j8j8j9P2P2o2o1J8J8o1o2K1K2K2K2k4k3k4k3q0q0N3N4r4r4
2278d770M0M0K8K8n2n2KLJ2J2J1J71J51j16o2o1KKjjkjKKKLN8N9k1k1P4P5Jp9j98M3J12k2
$$ plain form
2302 67019 54919 43941 34300 26424 20433 16313 13830 12684 12464 12939 13921 15064 16045 16545 16162 14550 12049 9388
2300 9388 7138 5369 3931 2494 1354 375 -399 -1012 -1563 -1845 -2096 -2347 -2580 -2814 -2943 -3071 -3200 -3329 -3374 -3420 -3466 -3511 -3562
2297 -3562 -3613 -3663 -3714 -3784 -3853 -3843 -3833 -3882 -3932 -4062 -4191 -4224 -4256 -4289 -4321 -4413 -4506 -4465 -4424 -4337 -4250 -4162 -4075 -4094 -4112 -4130 -4148 -4216 -4283 -4351 -4419 -4418 -4417 -4416 -4415
2293 -4415 -4547 -4678 -4675 -4673 -4613 -4554 -4575 -4596 -4609 -4623 -4726 -4670 -4608 -4546 -4474 -4402 -4435 -4468 -4500 -4533 -4497 -4461 -4415 -4530 -4473 -4417 -4461 -4345 -4388 -4432 -4386 -4340 -4335
2290 -4335 -4331 -4326 -4322 -4391 -4460 -4448 -4437 -4419 -4401 -4383 -4365 -4421 -4476 -4451 -4427 -4455 -4483 -4510 -4538 -4474 -4410 -4346 -4283 -4270 -4258 -4245 -4233 -4276 -4319 -4361 -4404 -4483 -4561 -4560 -4558 -4523 -4489
2285 -4489 -4534 -4579 -4621 -4663 -4705 -4748 -4761 -4775 -4789 -4803 -4791 -4780 -4769 -4757 -4816 -4875 -4854 -4832 -4804 -4776 -4827 -4879 -4826 -4773 -4719 -4666 -4568 -4470 -4453 -4435 -4454 -4473 -4492 -4511
2282 -4511 -4438 -4364 -4424 -4484 -4458 -4433 -4408 -4382 -4401 -4419 -4437 -4456 -4384 -4312 -4374 -4435 -4417 -4399 -4460 -4522 -4501 -4479 -4457 -4435 -4459 -4482 -4506 -4529 -4609 -4689 -4636 -4582 -4676 -4770
2278 -4770 -4730 -4690 -4662 -4634 -4686 -4738 -4736 -4733 -4721 -4709 -4698 -4527 -4376 -4492 -4554 -4615 -4613 -4611 -4612 -4613 -4615 -4616 -4614 -4612 -4610 -4607 -4549 -4490 -4511 -4532 -4458 -4383 -4382 -4461 -4659 -4616 -4504 -4526
2273d526JJP3P3LKQQoP5J10k4j4O6N8k3l5l5m1m0j40j41pP3J8j15q1%K3K3n3n2K5K5K5K5n3
2269d671n3n4n3K4K4K4K4N3N2N3N2J01J01K1K1l8l8M3r1j23m3j5j6k3k2k2k3k1k0j3j2N2J87
2265d519P6mK9K9K4K4k0j9k0k0L9L9M3r2o6O7j6j6mmlmr1r1kkj19J5J9K0k4k4N6N7J38J38
2261d347J39J38J09J08J08J09J3J4k27k27r2r2r2r1q5q5j75j5K7K7m3m3Q6Q6L1J10J01n9n9
2258d526J01J18L9M3J24J56P5o2o2j48j48o8o9K7K7j04j86r2O9N3N4J6J7K2K1PQ7J42j8k1
2254d306J38L9L9P8P9n6n5r3r4j3j4m1m2j20k00j31K8J13L2J4J5j%J00o1o0R9N2N3J59L19
2251c930K41K41L15L14K43k4j73j73j63k43k18n8J2j49j39K2m5m6l5l5O4O5j6j6p1p1p1p1
2248d230l3l3l3l4m8m8m8m8L3L2m7m8M4M4l6l6llj36j37L4L4L3L4Q1Q0Q1Q0J76J75K56K56
$$ plain form
2273 -4526 -4525 -4524 -4451 -4378 -4375 -4373 -4365 -4357 -4363 -4288 -4178 -4202 -4216 -4150 -4092 -4115 -4150 -4185 -4226 -4266 -4406 -4547 -4554 -4481 -4463 -4578 -4659 -4659 -4636 -4613 -4666 -4718 -4693 -4668 -4643 -4618 -4671
2269 -4671 -4724 -4778 -4831 -4807 -4783 -4759 -4735 -4682 -4630 -4577 -4525 -4424 -4323 -4302 -4281 -4319 -4357 -4314 -4405 -4528 -4571 -4586 -4602 -4625 -4647 -4669 -4692 -4713 -4733 -4746 -4758 -4706 -4519
2265 -4519 -4443 -4447 -4418 -4389 -4365 -4341 -4361 -4380 -4400 -4420 -4381 -4342 -4299 -4391 -4457 -4390 -4406 -4422 -4426 -4430 -4433 -4437 -4528 -4619 -4621 -4623 -4742 -4727 -4708 -4688 -4712 -4736 -4680 -4623 -4485 -4347
2261 -4347 -4208 -4070 -3961 -3853 -3745 -3636 -3623 -3609 -3836 -4063 -4155 -4247 -4339 -4430 -4515 -4600 -4775 -4790 -4763 -4736 -4779 -4822 -4736 -4650 -4619 -4509 -4408 -4467 -4526
2258 -4526 -4425 -4307 -4268 -4225 -4101 -3945 -3870 -3932 -3994 -4142 -4290 -4358 -4427 -4400 -4373 -4477 -4663 -4755 -4686 -4633 -4579 -4563 -4546 -4524 -4503 -4496 -4409 -4267 -4285 -4306
2254 -4306 -4168 -4129 -4090 -4012 -3933 -3989 -4044 -4137 -4231 -4244 -4258 -4299 -4341 -4461 -4661 -4792 -4764 -4651 -4619 -4605 -4590 -4591 -4591 -4491 -4552 -4612 -4513 -4461 -4408 -4249 -3930
2251 -3930 -3689 -3448 -3133 -2819 -2576 -2600 -2773 -2946 -3109 -3352 -3570 -3628 -3616 -3765 -3904 -3882 -3927 -3973 -4008 -4043 -3979 -3914 -3930 -3946 -4017 -4088 -4159 -4230
2248 -4230 -4263 -4296 -4329 -4363 -4411 -4459 -4507 -4555 -4522 -4490 -4537 -4585 -4541 -4497 -4533 -4569 -4572 -4575 -4711 -4848 -4814 -4780 -4747 -4713 -4632 -4552 -4471 -4391 -4215 -4040 -3784 -3528
2244c528K89K90L79K19j9k0k17k17l23l24k80j20q9r0o9p0j35K6o5o5L2L2m8m8Q0Q1J%rj0
2241d317P1P1J11J11K1K1J22l9j90j89j12j11l1l1k7k6j06j06j6j5noo3R6J07n4j8J42J32
2237d457k9J32J32M1M2l3l3j13j14j9k0j00j00q8q7M6M6j9j9O1O1j7j7j7j7J6J7J6J6L02L01
2234d070K21K22K24K25P4q6k17k16k27k26j63j64k9k9o3o3n3n2p5Q6j4j4Q7p3J8J7j01j01
2231d862L2L3k4k5k4k5l6l6M4M4q3q4lmkkjkR1R1J1J1RRRRO7O6O7O6J63J64Q3Q3k2k2j56j56
2226d417r0r1r0r1N9N8k1k2k2k1k2k2R2R2r5r5L0L0L0L1n4n3n4n3KKJKK4K4n6n6M9N0M9M9
2222d751l0k9l0l0M6M5q8q8JKKJM0M0M0M0pqpqm8m7L2L3o8o8J3J3lkq3q3P2P1P2P1l9l9M2
2218d880M1j3j4j4j3n5n6P9P8j4j5r4r5M6M6M5M6J6J6J5J6m5m5j0j0m1j22l7J22M2l8J6J7
$$ plain form
2244 -3528 -3239 -2949 -2570 -2351 -2370 -2390 -2607 -2824 -3147 -3471 -3751 -3871 -3960 -4050 -4119 -4189 -4324 -4298 -4363 -4428 -4396 -4364 -4412 -4460 -4380 -4299 -4298 -4298 -4307 -4317
2241 -4317 -4246 -4175 -4064 -3953 -3932 -3911 -3789 -3828 -4018 -4207 -4319 -4430 -4461 -4492 -4519 -4545 -4651 -4757 -4773 -4788 -4793 -4799 -4862 -4766 -4659 -4713 -4731 -4589 -4457
2237 -4457 -4486 -4354 -4222 -4181 -4139 -4172 -4205 -4318 -4432 -4451 -4471 -4571 -4671 -4759 -4846 -4800 -4754 -4773 -4792 -4731 -4670 -4687 -4704 -4721 -4738 -4722 -4705 -4689 -4673 -4371 -4070
2234 -4070 -3849 -3627 -3403 -3178 -3104 -3190 -3407 -3623 -3850 -4076 -4239 -4403 -4432 -4461 -4524 -4587 -4640 -4692 -4767 -4681 -4695 -4709 -4622 -4695 -4677 -4660 -4761 -4862
2231 -4862 -4830 -4797 -4821 -4846 -4870 -4895 -4931 -4967 -4923 -4879 -4962 -5046 -5049 -5053 -5055 -5057 -5058 -5060 -4969 -4878 -4867 -4856 -4847 -4838 -4829 -4820 -4753 -4687 -4620 -4554 -4391 -4227 -4144 -4061 -4083 -4105 -4261 -4417
2226 -4417 -4507 -4598 -4688 -4779 -4720 -4662 -4683 -4705 -4727 -4748 -4770 -4792 -4700 -4608 -4703 -4798 -4768 -4738 -4708 -4677 -4731 -4784 -4838 -4891 -4889 -4887 -4886 -4884 -4860 -4836 -4892 -4948 -4899 -4849 -4800 -4751
2222 -4751 -4781 -4810 -4840 -4870 -4824 -4779 -4867 -4955 -4954 -4952 -4950 -4949 -4909 -4869 -4829 -4789 -4796 -4804 -4811 -4819 -4867 -4914 -4882 -4849 -4917 -4985 -4972 -4959 -4962 -4964 -5047 -5130 -5058 -4987 -4915 -4844 -4883 -4922 -4880
2218 -4880 -4839 -4852 -4866 -4880 -4893 -4948 -5004 -4925 -4847 -4861 -4876 -4970 -5065 -5019 -4973 -4928 -4882 -4866 -4850 -4835 -4819 -4864 -4909 -4919 -4929 -4970 -5092 -5129 -5007 -4965 -5003 -4987 -4970
2214d970L6L6m4m4J5J5o5o5kkL8L8k3k3k3k2K4K3K4K4K6K7K6K7m0l9JJM6M6l4l4m8m7ppM8
2210e018M8QPJ1J0J1J0J7J7o3o3O8O8K8K8rj0rj0o3o3J7J7jjL9L9k8k8J2J3j3j3K7K8JJJ7
2205d850o4q9P2L1m8p8Q2J47j20r9O0L4L4K4K3n6n6L4L3N4j06r8O2Q7Pk8k8qP3O9r0r6O5J18
2201d805m2o7J2J43J43l9l9q2q2kjk0k0K1K0N7N6k4k4j17j17J6J6m6m6L3L4j9j8K1K1l2l2
2198e081l2l2M4M4MMP7P6lmn5n5K6K5K9K8n1n2J06J05p1p2r1O8J49j1k2k3M8M8q9q9rrL7L8
2193d895m3m3k2k1k1k1l3l4M7M7M7M7l3l4k2k3k3k2%JJ%N8N8k3k3nnL5L5P0P1Q0q0p2p2N1
2189d922N1l4l5M6M6L7L8L7L7J7J7o4o4p4p5J13J12p0p0l0l1P4P3L3L4M1M1r2r2M5M6l5l4
2185d784opooP9P9n5n4N5N6k4k4L7L7L8L7n2n2K9K8Q0Q0%%K0K1j13j13j9k0O1O1j8j7r8r8
$$ plain form
2214 -4970 -4934 -4898 -4942 -4986 -4971 -4956 -5021 -5086 -5088 -5090 -5052 -5014 -5037 -5060 -5083 -5105 -5081 -5058 -5034 -5010 -4984 -4957 -4931 -4904 -4944 -4983 -4982 -4981 -4935 -4889 -4923 -4957 -5005 -5052 -5059 -5066 -5018
2210 -5018 -4970 -4962 -4955 -4944 -4934 -4923 -4913 -4896 -4879 -4942 -5005 -4937 -4869 -4841 -4813 -4822 -4832 -4841 -4851 -4914 -4977 -4960 -4943 -4944 -4945 -4906 -4867 -4895 -4923 -4911 -4898 -4911 -4924 -4897 -4869 -4868 -4867 -4850
2205 -4850 -4914 -5003 -4931 -4900 -4948 -5026 -4944 -4797 -4917 -5016 -4956 -4922 -4888 -4864 -4841 -4897 -4953 -4919 -4886 -4832 -4938 -5036 -4974 -4887 -4880 -4908 -4936 -4944 -4871 -4802 -4892 -4988 -4923 -4805
2201 -4805 -4847 -4914 -4902 -4759 -4616 -4655 -4694 -4776 -4858 -4860 -4861 -4881 -4901 -4880 -4860 -4803 -4747 -4771 -4795 -4912 -5029 -5013 -4997 -5043 -5089 -5056 -5022 -5041 -5059 -5038 -5017 -5049 -5081
2198 -5081 -5113 -5145 -5101 -5057 -5053 -5049 -4972 -4896 -4899 -4903 -4958 -5013 -4987 -4962 -4933 -4905 -4956 -5008 -4902 -4797 -4868 -4940 -5031 -4963 -4814 -4825 -4847 -4870 -4822 -4774 -4863 -4952 -4961 -4970 -4933 -4895
2193 -4895 -4938 -4981 -5003 -5024 -5045 -5066 -5099 -5133 -5086 -5039 -4992 -4945 -4978 -5012 -5034 -5057 -5080 -5102 -5102 -5101 -5100 -5100 -5042 -4984 -5007 -5030 -5035 -5040 -5005 -4970 -4900 -4829 -4749 -4829 -4901 -4973 -4922
2189 -4922 -4871 -4905 -4940 -4894 -4848 -4811 -4773 -4736 -4699 -4682 -4665 -4729 -4793 -4867 -4942 -4829 -4717 -4787 -4857 -4887 -4918 -4844 -4771 -4738 -4704 -4663 -4622 -4714 -4806 -4761 -4715 -4750 -4784
2185 -4784 -4790 -4797 -4803 -4809 -4730 -4651 -4706 -4760 -4705 -4649 -4673 -4697 -4660 -4623 -4585 -4548 -4600 -4652 -4623 -4595 -4515 -4435 -4435 -4435 -4415 -4394 -4507 -4620 -4639 -4659 -4598 -4537 -4555 -4572 -4670 -4768
2181d768J1J2N2N1K5K5n5n5K1K1K1K1J3J4n7n7j16M3J94p4k9J31K4K4o1o1P2P2ooq6q6L6L7
2177d597mlkkklO1O1k0k0k2k2k2k2j2j2j3j2N2N1k9k8n3n3j3j3K0J9K0K0K5K6n5n5R6R6l8
2173d580l8llllj7j7J70J70Q0Q0n4n4KJKJmnL6L6j23j22m3m2K6K6j4j4r7r7J44J44N3N4j7
2169d325j7k7J33J74J3p4p3llo6o6o6o7R8R7J7J8P3P3J63Ln9n9O4O5j2j2K28K29J28J29M8
2165c176M8P7P8J04j63l71k12j31j31j2j1j2j2k8k8R5R6j8j79q8q9N6N6J37J36R5R5N5N6L9
2162c438L9M9j11j15j16RQk9l0o9o9L3L3J34k7m6J15K4j36j77j77j44J7l1l1n1n1j01O0l0
2159d458l1ONJ5J6r3O7J11J10J2J3J45J46o6o5O7O8O0N9j27j28o2o3o2o3J3J3J3J2j5j5j5
2155d312j5j12j12l1l2O2O1j8j8J6J7o3o4k2k2k2k3ppppj7j6j6j7M4M4M4M4J4J5J4J5k4k4
$$ plain form
2181 -4768 -4757 -4745 -4693 -4642 -4617 -4592 -4647 -4702 -4681 -4660 -4639 -4618 -4605 -4591 -4648 -4705 -4821 -4778 -4584 -4658 -4687 -4556 -4532 -4508 -4569 -4630 -4558 -4486 -4492 -4498 -4584 -4670 -4634 -4597
2177 -4597 -4601 -4604 -4606 -4608 -4610 -4613 -4552 -4491 -4511 -4531 -4553 -4575 -4597 -4619 -4631 -4643 -4656 -4668 -4616 -4565 -4594 -4622 -4675 -4728 -4741 -4754 -4734 -4715 -4695 -4675 -4650 -4624 -4679 -4734 -4638 -4542 -4580
2173 -4580 -4618 -4621 -4624 -4627 -4630 -4647 -4664 -4494 -4324 -4244 -4164 -4218 -4272 -4270 -4269 -4267 -4266 -4270 -4275 -4239 -4203 -4326 -4448 -4491 -4533 -4507 -4481 -4495 -4509 -4606 -4703 -4559 -4415 -4362 -4308 -4325
2169 -4325 -4342 -4369 -4236 -4062 -4049 -4123 -4196 -4199 -4202 -4268 -4334 -4400 -4467 -4369 -4272 -4255 -4237 -4164 -4091 -3928 -3925 -3984 -4043 -3979 -3914 -3926 -3938 -3710 -3481 -3353 -3224 -3176
2165 -3176 -3128 -3051 -2973 -2869 -3032 -3403 -3615 -3746 -3877 -3889 -3900 -3912 -3924 -3952 -3980 -3885 -3789 -3807 -3986 -4074 -4163 -4107 -4051 -3914 -3778 -3683 -3588 -3533 -3477 -3438
2162 -3438 -3399 -3350 -3461 -3576 -3692 -3683 -3675 -3704 -3734 -3803 -3872 -3839 -3806 -3672 -3699 -3745 -3630 -3606 -3742 -3919 -4096 -4240 -4223 -4254 -4285 -4336 -4387 -4488 -4428 -4458
2159 -4458 -4489 -4483 -4478 -4463 -4447 -4540 -4473 -4362 -4252 -4240 -4227 -4082 -3936 -4002 -4067 -4000 -3932 -3872 -3813 -3940 -4068 -4130 -4193 -4255 -4318 -4305 -4292 -4279 -4267 -4282 -4297 -4312
2155 -4312 -4327 -4439 -4551 -4582 -4614 -4552 -4491 -4509 -4527 -4511 -4494 -4557 -4621 -4643 -4665 -4687 -4710 -4717 -4724 -4731 -4738 -4755 -4771 -4787 -4804 -4760 -4716 -4672 -4628 -4614 -4599 -4585 -4570 -4594 -4618
2151d618k4k4M5M5l5l6k7k7J07J07M4M5r0q9m1m1M0L9J4J4J4J4m1m1m1m1l0l1l1l1M8M8l3
2147d748l2k2k2k2k2O9O8O8O9K0K0o0o1k5k5k5k5llllM4M4M4M4k7k8k7k8k7k8k7k8NNNMK5
2143d787K5K5K4QQPQpqppl5l5M5M5k0k0j9k0RRJ0RP3P3o1o1m6m6Q8Q8p9p9JJl9l9R4R5MNM
2138d657NNNNNp3p3PPk2k3k2k2QQp2p2K0K1K1K0N6N6k5k4r4r3j4j3k2k2k2k2P4P4poQ3Q4L
2133d833Mk3k3k4k3J1J0J0J1l1l1N0M9oonoopooK7K7K7K7KKKKr0r0j0j0L5L5L5L5OPOOm8m8
2129d906m8m9j4j5J19J18%jq1q0k3k2k2k2k1k0O0O0L5L5L5L5l4l5l4l4k2k3k2k3Q4Q4n0n0
2125d986K0K1K0K0rrP1P1J9K0o1o1N6N6k5k4m9n0L1L1QRQRk0k0k0k0m7m6L7r7m2R2RQP7P6
2120d817lmLLj30j31L0K9L0K9L7L6L6L7o0o0K0K1J4J3J4J4M9M8q5q4k5k5j6j6l5J00K4j10
$$ plain form
2151 -4618 -4642 -4666 -4621 -4576 -4611 -4647 -4674 -4701 -4594 -4487 -4443 -4398 -4488 -4577 -4618 -4659 -4619 -4580 -4566 -4552 -4538 -4524 -4565 -4606 -4647 -4688 -4718 -4749 -4780 -4811 -4763 -4715 -4748
2147 -4748 -4780 -4802 -4824 -4846 -4868 -4799 -4731 -4663 -4594 -4574 -4554 -4614 -4675 -4700 -4725 -4750 -4775 -4778 -4781 -4784 -4787 -4743 -4699 -4655 -4611 -4638 -4666 -4693 -4721 -4748 -4776 -4803 -4831 -4826 -4821 -4816 -4812 -4787
2143 -4787 -4762 -4737 -4713 -4705 -4697 -4690 -4682 -4689 -4697 -4704 -4711 -4746 -4781 -4736 -4691 -4711 -4731 -4750 -4770 -4761 -4752 -4742 -4733 -4660 -4587 -4648 -4709 -4755 -4801 -4713 -4625 -4704 -4783 -4782 -4781 -4820 -4859 -4765 -4670 -4666 -4661 -4657
2138 -4657 -4652 -4647 -4642 -4637 -4632 -4705 -4778 -4771 -4764 -4786 -4809 -4831 -4853 -4845 -4837 -4909 -4981 -4961 -4940 -4919 -4899 -4843 -4787 -4812 -4836 -4930 -5023 -5037 -5050 -5072 -5094 -5116 -5138 -5064 -4990 -4997 -5003 -4920 -4836 -4833
2133 -4833 -4829 -4852 -4875 -4899 -4922 -4911 -4901 -4891 -4880 -4911 -4942 -4892 -4843 -4849 -4855 -4860 -4866 -4872 -4879 -4885 -4891 -4864 -4837 -4810 -4783 -4781 -4779 -4777 -4775 -4865 -4955 -4965 -4975 -4940 -4905 -4870 -4835 -4829 -4822 -4816 -4810 -4858 -4906
2129 -4906 -4954 -5003 -5017 -5032 -4913 -4795 -4795 -4796 -4877 -4957 -4980 -5002 -5024 -5046 -5067 -5087 -5027 -4967 -4932 -4897 -4862 -4827 -4861 -4896 -4930 -4964 -4986 -5009 -5031 -5054 -4970 -4886 -4936 -4986
2125 -4986 -4966 -4945 -4925 -4905 -4914 -4923 -4852 -4781 -4762 -4742 -4803 -4864 -4808 -4752 -4777 -4801 -4850 -4900 -4869 -4838 -4830 -4821 -4813 -4804 -4824 -4844 -4864 -4884 -4931 -4977 -4940 -5037 -5079 -4987 -4978 -4970 -4893 -4817
2120 -4817 -4820 -4824 -4821 -4818 -4948 -5079 -5049 -5020 -4990 -4961 -4924 -4888 -4852 -4815 -4875 -4935 -4915 -4894 -4880 -4867 -4853 -4839 -4790 -4742 -4827 -4911 -4936 -4961 -4977 -4993 -5028 -4928 -4904 -5014
2116e014k6N4JJN6N6N1N1P6mj19J4M5l6J8J8k0k1k0k1o4o4J6J6J8J8o3o2Q1Q0n3n3K9K9n1
2112d963n2llllN2N2k8k8O4O4j6j6K5K4K4K4l0l1l0l1L0K9L0K9m2m2m2m2L2L1L1L2j6j5j5
2108d878j6NNNMM6M5M5M6n0n0n0m9m6m6L5L5l6l6l5l6Q2Q1KJK6K7K6K7j4j4j4j4mmmlrrrr
2104d892k9k9k9k9mnmnJ6J6J5J6L5L5L5L5nnq6q5Q9R0r8r8p4p5J13J13O6O5j4j5M6M6l5l4
2099d819o1o2J9J9N6N6k0j9k6N5K9j30m4J16J6J7P2P2pqNMM5M5K3K3K2K3l5l5l5l5K6K5K6
2095d542K5j12j13K1K2J1J2O6r4m0M0K5K5K2K2K2K1n9o0q0Q0P0r1l1l0PPPPPPPPJ6J6o4o4
2091d808K3K2j7j8MMQ5Q4j0j1L0L0J4J5J4J5n3n3j3j3j01j01k0k1J9J9J9J9k2k3k3k2k2k1
2087d956L3m6n0J10O0k0m1m2m6m7O2O2O2O2N2N2k8k8r6r7L7L7M8M8k2k2rJ52J51rR3R2R3R2
$$ plain form
2116 -5014 -5040 -4986 -4985 -4984 -4928 -4872 -4821 -4770 -4694 -4698 -4817 -4803 -4758 -4794 -4776 -4758 -4778 -4799 -4819 -4840 -4904 -4968 -4952 -4936 -4918 -4900 -4963 -5025 -4944 -4864 -4917 -4970 -4941 -4912 -4963
2112 -4963 -5015 -5018 -5021 -5024 -5027 -4975 -4923 -4951 -4979 -4915 -4851 -4867 -4883 -4858 -4834 -4810 -4786 -4816 -4847 -4877 -4908 -4878 -4849 -4819 -4790 -4832 -4874 -4916 -4958 -4926 -4895 -4864 -4832 -4848 -4863 -4878
2108 -4878 -4894 -4889 -4884 -4879 -4875 -4829 -4784 -4739 -4693 -4743 -4793 -4843 -4892 -4938 -4984 -4949 -4914 -4950 -4986 -5021 -5057 -4975 -4894 -4892 -4891 -4865 -4838 -4812 -4785 -4799 -4813 -4827 -4841 -4845 -4849 -4853 -4856 -4865 -4874 -4883 -4892
2104 -4892 -4921 -4950 -4979 -5008 -5012 -5017 -5021 -5026 -5010 -4994 -4979 -4963 -4928 -4893 -4858 -4823 -4828 -4833 -4919 -5004 -4915 -4825 -4923 -5021 -5095 -5170 -5057 -4944 -4878 -4813 -4827 -4842 -4796 -4750 -4785 -4819
2099 -4819 -4880 -4942 -4923 -4904 -4848 -4792 -4812 -4831 -4857 -4802 -4773 -4903 -4947 -4831 -4815 -4798 -4726 -4654 -4661 -4669 -4664 -4660 -4615 -4570 -4547 -4524 -4502 -4479 -4514 -4549 -4584 -4619 -4593 -4568 -4542
2095 -4542 -4517 -4629 -4742 -4721 -4699 -4688 -4676 -4610 -4704 -4744 -4704 -4679 -4654 -4632 -4610 -4588 -4567 -4626 -4686 -4766 -4686 -4616 -4707 -4738 -4768 -4761 -4754 -4747 -4740 -4733 -4726 -4719 -4712 -4696 -4680 -4744 -4808
2091 -4808 -4785 -4763 -4780 -4798 -4794 -4790 -4705 -4621 -4631 -4642 -4612 -4582 -4568 -4553 -4539 -4524 -4577 -4630 -4643 -4656 -4757 -4858 -4878 -4899 -4880 -4861 -4842 -4823 -4845 -4868 -4891 -4913 -4935 -4956
2087 -4956 -4923 -4969 -5019 -4909 -4849 -4869 -4910 -4952 -4998 -5045 -4983 -4921 -4859 -4797 -4745 -4693 -4721 -4749 -4845 -4942 -4905 -4868 -4820 -4772 -4794 -4816 -4825 -4673 -4522 -4531 -4438 -4346 -4253 -4161
2083d161M8K09K49Q8l0k9j73j73l1l0J03J04J54J54J54J55L33L33J52k21k22o2O6O5j41j42
2080c048j51QK2K1K09K08J60%j0J50K58R8l17m77k50q9n6n6n8n8n8n8O2O1p2p2j38j39r8r9
2077d047j5j6q6q6j14M6l4j94JJj79j9K4K4K4K5R4o6K4K4j01j02k1k1N4N4R4R4n8n9k8k8O4
2073d627r6m6m6k4k5l4l5R7o4o4R7L2L3M3M2l2l2N7j02r0q9K4K5P8q3q3P8P9P9RRo5o4J5J6
2069d888j3j4j3j3L7L7m3m4M8M8M8M7J18J18j5j6Q6Q5Q6Q6j7j7O3O3J70J70J40J39J42L03
2066c059K92J33j81l41k0k1N4N5R4R4J50J50K74K74K54R5j10j10Q8Q8M4j16l23l24p6Q5K00
2063b257K00P0r1L9J99K19N9l62n22m52k92o9o9J0J1L4j27MMj01j01j81j81j32j32n1n2o3
2060d386o4o3o3J9K0j15j14o2o3P1P1o2o2J9J8K3K3K4K3O9O8j01N8J9J9K8K9N9N8M9K09K19
$$ plain form
2083 -4161 -4113 -3904 -3655 -3567 -3597 -3626 -3799 -3972 -4003 -4033 -3930 -3826 -3672 -3518 -3364 -3209 -2876 -2543 -2391 -2612 -2834 -2896 -2830 -2765 -2906 -3048
2080 -3048 -3199 -3191 -3169 -3148 -2939 -2731 -2571 -2571 -2581 -2431 -2173 -2075 -2392 -2869 -3119 -3208 -3264 -3320 -3378 -3436 -3494 -3552 -3490 -3429 -3501 -3573 -3711 -3850 -3948 -4047
2077 -4047 -4062 -4078 -4164 -4250 -4364 -4318 -4352 -4546 -4545 -4544 -4723 -4742 -4718 -4694 -4670 -4645 -4551 -4617 -4593 -4569 -4670 -4772 -4793 -4814 -4760 -4706 -4612 -4518 -4576 -4635 -4663 -4691 -4627
2073 -4627 -4723 -4769 -4815 -4839 -4864 -4898 -4933 -4836 -4900 -4964 -4867 -4835 -4802 -4759 -4717 -4749 -4781 -4724 -4826 -4916 -5005 -4981 -4956 -4878 -4961 -5044 -4966 -4887 -4808 -4799 -4790 -4855 -4919 -4904 -4888
2069 -4888 -4901 -4915 -4928 -4941 -4904 -4867 -4910 -4954 -4906 -4858 -4810 -4763 -4645 -4527 -4542 -4558 -4472 -4387 -4301 -4215 -4232 -4249 -4186 -4123 -3953 -3783 -3643 -3504 -3362 -3059
2066 -3059 -2767 -2634 -2815 -3156 -3176 -3197 -3143 -3088 -2994 -2900 -2750 -2600 -2326 -2052 -1798 -1703 -1813 -1923 -1835 -1747 -1703 -1819 -2142 -2466 -2542 -2457 -2257
2063 -2257 -2057 -1987 -2078 -2039 -1840 -1621 -1562 -1924 -2446 -2898 -3190 -3259 -3328 -3318 -3307 -3273 -3400 -3396 -3392 -3493 -3594 -3775 -3956 -4088 -4220 -4271 -4323 -4386
2060 -4386 -4450 -4513 -4576 -4557 -4537 -4652 -4766 -4828 -4891 -4820 -4749 -4811 -4873 -4854 -4836 -4813 -4790 -4766 -4743 -4674 -4606 -4707 -4649 -4630 -4611 -4583 -4554 -4495 -4437 -4388 -4179 -3960
2056c960K19J49J49j6j6j6j6J02J03J82J83K48K49K11n6j40j40j17j17N3N3J33J33k0k0j53
2053b620j54o4o4P0P0K03K03r0l58k99j38n7n8M6M6l4l5N4N4j34j33q3q4lln5n5j36j35N2
2049c994N3N2N3Q2Q2M2M3K66K66J16m5r4r5o4o4r7r7r7r7N3N4J33J33%jr0P0R0R0q7q6J1J2
2046c307R2R2J02J02l1l2K9K9J08J09J17J16J80J80M0k27k07m6J7J8J08J08j4j3j37j37j18
2043b722M1L2L2J65J66J75J5l22l23r2r3L6L5j4j5J50j0j61j61j96j97j16j17o5o4n5n4q8
2039d018P2j8j8k2k2N8N8K2K1K2K1P9P9j08j08j6j6K14K14R9o3O2K22N3j07j78j7N7N6O6O6
2036c170J18J18k2j83j34K6OPN1N1N1N1j80j80m7m7L4L3L4L3M9N0l8j98k28o7l4l5m9m9m9
2032c998m9L6L6J16J16o0o1P3P4q9q9q9q9l8l9nJ55Q0q0J0J0kj61p2p1J8J9J9J8M8M9M8M8
$$ plain form
2056 -3960 -3741 -3592 -3443 -3459 -3475 -3491 -3507 -3405 -3302 -3120 -2937 -2689 -2440 -2229 -2285 -2425 -2565 -2682 -2799 -2746 -2693 -2560 -2427 -2447 -2467 -2620
2053 -2620 -2774 -2838 -2902 -2832 -2762 -2559 -2356 -2446 -2804 -3103 -3241 -3298 -3356 -3310 -3264 -3298 -3333 -3279 -3225 -3359 -3492 -3575 -3659 -3662 -3665 -3720 -3775 -3911 -4046 -3994
2049 -3994 -3941 -3889 -3836 -3754 -3672 -3630 -3587 -3321 -3055 -2939 -2984 -3078 -3173 -3237 -3301 -3398 -3495 -3592 -3689 -3636 -3582 -3449 -3316 -3316 -3317 -3407 -3337 -3247 -3157 -3244 -3330 -3319 -3307
2046 -3307 -3215 -3123 -3021 -2919 -2950 -2982 -2953 -2924 -2816 -2707 -2590 -2474 -2294 -2114 -2074 -2301 -2508 -2554 -2537 -2519 -2411 -2303 -2317 -2330 -2467 -2604 -2722
2043 -2722 -2681 -2649 -2617 -2452 -2286 -2111 -2096 -2418 -2741 -2833 -2926 -2890 -2855 -2869 -2884 -2734 -2744 -2905 -3066 -3262 -3459 -3575 -3692 -3757 -3821 -3876 -3930 -4018
2039 -4018 -3946 -3964 -3982 -4004 -4026 -3968 -3910 -3888 -3867 -3845 -3824 -3745 -3666 -3774 -3882 -3898 -3914 -3700 -3486 -3387 -3450 -3388 -3166 -3113 -3220 -3398 -3415 -3358 -3302 -3236 -3170
2036 -3170 -3052 -2934 -2956 -3139 -3273 -3247 -3241 -3234 -3183 -3132 -3081 -3030 -3210 -3390 -3437 -3484 -3450 -3417 -3383 -3350 -3301 -3251 -3289 -3487 -3715 -3782 -3816 -3851 -3900 -3949 -3998
2032 -3998 -4047 -4011 -3975 -3859 -3743 -3803 -3864 -3791 -3717 -3806 -3895 -3984 -4073 -4111 -4150 -4155 -4000 -3920 -4000 -3990 -3980 -3982 -4143 -4215 -4286 -4268 -4249 -4230 -4212 -4164 -4115 -4067 -4019
2029d019J1J1R2R1Q2Q2nj66n5J06NNJ59J59J59J59J16J15p1p1m7m7n7J04Q7Q7J95L5p4O0k5
2025b717k6N5N5N5N5P7P7j64j64p3p3OPM0M0L9M0n5n6m7m7j2J21Q6Oq3j62J1R1N2q2j11P5
2021b884O2j8j1O9J06K5n7n8P8P7kllklkM9M9l1l1j3j3J20K01R6l8Pp4j10j11J8J8L4L5M1
2017b379r3m3J44P6nn8n8J7J7l2l1l2l2j5j5J19J19N8N7N8N8R1R1J1J1N5N5N5N5J28J29M8
2014a341M9J10J10J10J10j4j3O7O6J12J12J07J07J99J18Q0K14K71J37J75K56K77K78K82K82
2011B261L65L66J88J88J66L26M24M24N20N21O64O64P98R58J225J226J113J273J685K273K924
2008B0552L833N356Q404J2802J7024J7479J5608J9467K9893K9077J758k3567k2124r881J17
2007A25798P170J3853K2814L0031K7101K5122M2010P3498O8938k541n2701l3188N163K2004
$$ plain form
2029 -4019 -4008 -3997 -3905 -3814 -3732 -3650 -3655 -3821 -3876 -3770 -3765 -3760 -3601 -3442 -3283 -3124 -3008 -2893 -2964 -3035 -3082 -3129 -3186 -3082 -2995 -2908 -2713 -2678 -2752 -2692 -2717
2025 -2717 -2743 -2688 -2633 -2578 -2523 -2446 -2369 -2533 -2697 -2770 -2843 -2837 -2830 -2790 -2750 -2711 -2671 -2726 -2782 -2829 -2876 -2888 -2767 -2681 -2675 -2758 -2920 -2909 -2818 -2766 -2848 -2959 -2884
2021 -2884 -2822 -2840 -2851 -2782 -2676 -2651 -2708 -2766 -2688 -2611 -2613 -2616 -2619 -2621 -2624 -2626 -2577 -2528 -2559 -2590 -2603 -2616 -2496 -2295 -2199 -2237 -2230 -2304 -2414 -2525 -2507 -2489 -2455 -2420 -2379
2017 -2379 -2472 -2515 -2371 -2295 -2300 -2358 -2416 -2399 -2382 -2414 -2445 -2477 -2509 -2524 -2539 -2420 -2301 -2243 -2186 -2128 -2070 -1979 -1888 -1877 -1866 -1811 -1756 -1701 -1646 -1518 -1389 -1341
2014 -1341 -1292 -1182 -1072 -962 -852 -866 -879 -812 -746 -634 -522 -415 -308 -109 9 89 303 574 711 886 1142 1419 1697 1979 2261
2011 2261 2626 2992 3180 3368 3534 3860 4284 4708 5228 5749 6413 7077 7875 8833 10058 11284 12397 13670 15355 17628 20552
2008 20552 24385 29741 38145 50947 67971 85450 101058 120525 150418 179495 181253 157686 135562 125681 125798
2007 125798 132968 146821 169635 199666 226767 251889 293899 367397 436335 433794 381093 347905 353068 375072
2005C75072j500l0315k7956j5072p073M421K3232M4028M1910O785j3627R201N1069M9839k9899
2003D80115q9829p5067m4754k4259j2764q387m805n342r138n141P956K1316J0997k4863m3948
2002A72087l4852k1112j2312r370r883j0791j2351j2351r515o681m854l730k909k642k708
2000A6026k548k102j728j401j133q89p29n62n62m71m70k84k84l67l67l78k16j27j26j06k67
1997I09j76j76j97l6p5p5J5J4RQQQL7L7L7L7K6K5J05J06O0O0P1P0K7J88J77J77K04K03L04
1994B187J43J35K95L82L82J51J51K41K41K98M58N02N01O82O82Q26Q26J143J303J070J069J484
1991A5152K179K837L639N407Q454J2557J5819J5141J4019J9398K8754K2737n545k3501j7674
1990A19373o491J583P730J4199K2677K7541K3331K4240M4158P1478N2010j8826m8982k2091
$$ plain form
2005 375072 373572 343257 315301 300229 293156 297577 320809 364837 406747 413532 399905 409106 460175 510014 480115
2003 480115 390286 315219 270465 246206 233442 225055 220250 214908 205770 200629 208585 229901 240898 216035 172087
2002 172087 137235 116123 103811 94441 84558 73767 61416 49065 39550 32869 28015 24285 21376 18734 16026
2000 16026 13478 11376 9648 8247 7114 6225 5496 4934 4372 3901 3431 3147 2863 2496 2129 1751 1535 1408 1282 1176 909
1997 909 733 557 360 324 249 174 189 203 212 220 228 236 273 310 347 384 410 435 540 646 706 766 837 907 934 1122 1299 1476 1680 1883 2187
1994 2187 2330 2465 2760 3142 3524 3675 3826 4067 4308 4606 5064 5566 6067 6749 7431 8257 9083 10226 11529 12599 13668 15152
1991 15152 17331 20168 23807 29214 37668 50225 66044 81185 95204 114602 143356 166093 160548 137047 119373
1990 119373 112882 114465 122195 136394 159071 186612 209943 234183 278341 349819 401829 383003 334021 311930
1988C11930J1069J8500q854k9652k2534j1788m658P477K6123M2749L2248j699j1003J6852
1986C76760N2630L3759m5679q3262o1132l5417j8375r876o494l767n678q085k404J0586K0069
1985B13635L336k9399l9397k8317j6716r879q008q643r873j1199j0504p878n686l982k753
1983B4737k141k141k298k031j570j088r37r36p00m32l52j91Q3Q2j33j32k03k03M4K05L11L12
1981A0286M14N73N11L50L87O54R28J195J489J863K277K972M092N963R003J3547J8682K2157
1978I7343K2363K4342L2177L6829K0930q527k0420q605J1611K8771L4539L1064L5488N5108
1977C93013O2781K0066m2271n7186l0195r52J7426K5285K4709J4499l18j0208k1518k9484
1975C65647j9072k446O070J4571L0215L5187n36n4906p0784m8811k2261o170l630o677m359
$$ plain form
1988 311930 322999 341499 332645 302993 280459 268671 264013 271490 297613 340362 372610 370911 359908 376760
1986 376760 429390 463149 417470 334208 273076 237659 219284 209408 202914 199147 193469 185384 182980 193566 213635
1985 213635 216971 187572 148175 119858 103142 93263 85255 76612 66739 55540 45036 37158 31472 27490 24737
1983 24737 22596 20455 18157 16126 14556 13468 12531 11595 10895 10463 10111 9920 10003 10085 9952 9820 9617 9414 9458 9663 9974 10286
1981 10286 10700 11273 11784 12134 12521 13175 14103 15298 16787 18650 20927 23899 27991 33954 42957 56504 75186 97343
1978 97343 119706 144048 176225 213054 233984 225457 205037 196432 208043 236814 271353 302417 337905 393013
1977 393013 455794 475860 433589 376403 346208 345256 362682 387967 412676 427175 426857 416649 395131 365647
1975 365647 346575 344129 350199 364770 394985 430172 429636 374730 303946 255135 232874 226704 223074 216397 212038
1974B12038L822M857j2305l3280l6755k6658j6340j1334j0960j1635j0833r071p199n649m420
1972B4278l210k194j382r01p44p44n10l49m40m40m30j62J93M61N14N14L67L67L80N41Q94J269
1969A8272J749K231L036M159N789Q409J2474J7446K0674K0942K2949L0594L4624J9067q687
1968B13728j9540q039J1046K7199L2705K9465L3794N2578N9474J8456m0726n4432k8718r71
1966C26019J6619K4081K3494J3557r32j0230k0976k8441j8230k389N470J3783K9127L4242
1964D05194o68n3442o7929m6544k1149n705l406o715m415L731M960j1721l1982l5291k5614
1963I9304j5657j0685j0410j1213j0726q855o783n232m060l044k262j567j198r30q40n72l92
1961D878l92p06p06o14l46k02k03j34j33j34j34l41l41l51j89j02j02P9P8j01l70m96l35j78
$$ plain form
1974 212038 215860 220717 208412 175132 138377 111719 95379 84045 73085 61450 50617 41546 34347 28698 24278
1972 24278 21068 18874 17492 16591 15847 15103 14593 14244 13804 13364 12934 12772 12965 13426 13940 14454 14821 15188 15568 16109 17003 18272
1969 18272 20021 22252 25288 29447 35236 43645 56119 73565 94239 115181 138130 168724 203348 222415 213728
1968 213728 194188 186149 197195 224394 257099 286564 320358 372936 432410 450866 410140 355708 326990 326019
1966 326019 342638 366719 390213 403770 402838 392608 371632 343191 324961 322572 328042 341825 370952 405194
1964 405194 404526 351084 283155 236611 215462 209757 206351 199636 195221 198952 203912 192191 160209 124918 99304
1963 99304 83647 72962 62552 51339 40613 31758 24975 19743 15683 12639 10377 8810 7612 6682 5842 5270 4878
1961 4878 4486 3780 3074 2460 2114 1912 1709 1575 1442 1308 1174 833 492 141 -48 -150 -252 -173 -95 -196 -566 -1062 -1397 -1575
1958a575j77q6q7p5p4p4p4k75k75q8q7j01j00j00j01q4q3q4q4M0L9m1m1p4p4OOp4p4j64mM6
1954d093M6N7N6j3j4q3q4j00O1N0N0pqpqj07j08k7k8qpqqJ2J1o9o8llL8L7p7p7p7p7L0L0L1
1950d660L0N0N1N0N0q2q3q2q3K3K3K3K2J05J05k9k9K6K6n4n4P0P0j0j0MMp6p7nnL5L5o8o8
1946d673O6O6l0l1l0l0J2J1J2J1j5j5j5j5l2l3QQm4m5L6L6n1n2j2j1K0K1k0j9%JJ%N4N5k6
1942d781k6%jjjM1M1M1M0p3p3p2p3N6N7N6N7J0J0p1p0J0J0p0p0j0j0j0j0L1L1L2L1rrP2P1
1938d743o3o3J7J7R4R4N0j09l6l5L5L5KKl9l8K6K7j3j3K7K7j3j4K1K1j9j9JJJJj2j2j2j2r
1933d775rj0rp7p8l7l7Q4Q3LLMMk6k6m1J21J20m1N7N7l4l4m1m1R3R2N8N7R8R8J67J67j27j27
1929d204p7p8LKR8R8K31K32K60K60L41J80j40k99j32K8N3j08j77j7k4k4P3K34L28J67p9q0
$$ plain form
1958 -1575 -1752 -1838 -1925 -2000 -2074 -2148 -2222 -2497 -2772 -2860 -2947 -3048 -3148 -3248 -3349 -3433 -3516 -3600 -3684 -3644 -3605 -3646 -3687 -3761 -3835 -3829 -3823 -3897 -3971 -4135 -4139 -4093
1954 -4093 -4047 -3990 -3934 -3947 -3961 -4044 -4128 -4228 -4167 -4117 -4067 -4074 -4082 -4089 -4097 -4204 -4312 -4339 -4367 -4375 -4382 -4390 -4398 -4386 -4375 -4444 -4512 -4515 -4518 -4480 -4443 -4520 -4597 -4674 -4751 -4721 -4691 -4660
1950 -4660 -4630 -4580 -4529 -4479 -4429 -4511 -4594 -4676 -4759 -4736 -4713 -4690 -4668 -4563 -4458 -4487 -4516 -4490 -4464 -4518 -4572 -4502 -4432 -4442 -4452 -4448 -4444 -4520 -4597 -4602 -4607 -4572 -4537 -4605 -4673
1946 -4673 -4607 -4541 -4571 -4602 -4632 -4662 -4650 -4639 -4627 -4616 -4631 -4646 -4661 -4676 -4708 -4741 -4733 -4725 -4769 -4814 -4778 -4742 -4793 -4845 -4857 -4868 -4848 -4827 -4847 -4866 -4866 -4865 -4864 -4864 -4810 -4755 -4781
1942 -4781 -4807 -4807 -4808 -4809 -4810 -4769 -4728 -4687 -4647 -4720 -4793 -4865 -4938 -4882 -4825 -4769 -4712 -4702 -4692 -4763 -4833 -4823 -4813 -4883 -4953 -4963 -4973 -4983 -4993 -4962 -4931 -4899 -4868 -4877 -4886 -4814 -4743
1938 -4743 -4806 -4869 -4852 -4835 -4741 -4647 -4597 -4706 -4742 -4777 -4742 -4707 -4705 -4703 -4742 -4780 -4754 -4727 -4740 -4753 -4726 -4699 -4712 -4726 -4705 -4684 -4703 -4722 -4721 -4720 -4719 -4718 -4730 -4742 -4754 -4766 -4775
1933 -4775 -4784 -4794 -4803 -4880 -4958 -4995 -5032 -4948 -4865 -4862 -4859 -4855 -4851 -4877 -4903 -4944 -4823 -4703 -4744 -4687 -4630 -4664 -4698 -4739 -4780 -4687 -4595 -4537 -4480 -4382 -4284 -4117 -3950 -4077 -4204
1929 -4204 -4281 -4359 -4356 -4354 -4256 -4158 -3927 -3695 -3435 -3175 -2834 -2654 -2794 -3093 -3225 -3197 -3144 -3252 -3429 -3446 -3470 -3494 -3421 -3187 -2859 -2692 -2771 -2851
1926b851J45J44J0k56m12k52p4p5mj65p5p4N8N8N8N8j62j62j63j62qqqpl2l1j21L9o2o2n3
1923d709n2j0j0j0j1n3n2P0P1R6o5r8r8oJ54j6j6n3n2j2j2m6m5m6m5M4M3M4M4J4J5q6P4N1
1919d883j10r9O1k7k6j7j7QRQRm1m0M0M0P6P6nmk1k2J9J8K2K2K2K2%%m0m0o3o2J7J8L9L9L8
1914d914L9KKKLJ1J1R2R1KKJ26J26K03M3R3R3j33j33%Jk4k3J10J10K32K31J75J74L52Q4k19
1911c036k20l5l5l5l5j40j39MMJ31K92L51Q5J6J6J22J23j83l43k13k13r6r7n6n6NNl5l6M5
1907c804M5r5k56k41q0O0O0o8o9j08j09p0p0O3O4n6n5j5j6j03j03k3k3O0O0p4p3M6M7l4l3
1904e073M6M6l4l4K1K2K1K1O2O3j8j8KJp8p9j4j4K6K7j0j0j0j0J10J10k4k3j4j4j4j4Q5Q4
1900d758MNJ2J3N6K16J09J10K43K43J13m8r1r1J00J00J81J80K03K03L24J62j39k99q6q6M8
$$ plain form
1926 -2851 -2706 -2562 -2552 -2808 -3220 -3472 -3546 -3621 -3625 -3790 -3865 -3939 -3881 -3823 -3765 -3707 -3869 -4031 -4194 -4356 -4364 -4372 -4380 -4387 -4419 -4450 -4571 -4532 -4594 -4656 -4709
1923 -4709 -4761 -4771 -4781 -4791 -4802 -4855 -4907 -4837 -4766 -4670 -4735 -4833 -4931 -4937 -4783 -4799 -4815 -4868 -4920 -4932 -4944 -4990 -5035 -5081 -5126 -5082 -5039 -4995 -4951 -4937 -4922 -5008 -4934 -4883
1919 -4883 -4993 -5092 -5031 -5058 -5084 -5101 -5118 -5110 -5101 -5093 -5084 -5125 -5165 -5125 -5085 -5009 -4933 -4938 -4942 -4963 -4985 -4966 -4948 -4926 -4904 -4882 -4860 -4860 -4860 -4900 -4940 -5003 -5065 -5048 -5030 -4991 -4952 -4914
1914 -4914 -4875 -4873 -4871 -4869 -4866 -4855 -4844 -4752 -4661 -4659 -4657 -4531 -4405 -4202 -4159 -4066 -3973 -4106 -4239 -4239 -4238 -4262 -4285 -4175 -4065 -3833 -3602 -3427 -3253 -2901 -2817 -3036
1911 -3036 -3256 -3291 -3326 -3361 -3396 -3536 -3675 -3671 -3667 -3536 -3244 -2893 -2808 -2792 -2776 -2654 -2531 -2714 -3057 -3270 -3483 -3579 -3676 -3732 -3788 -3783 -3778 -3813 -3849 -3804
1907 -3804 -3759 -3854 -4110 -4351 -4431 -4371 -4311 -4379 -4448 -4556 -4665 -4735 -4805 -4742 -4678 -4734 -4789 -4804 -4820 -4923 -5026 -5049 -5072 -5012 -4952 -5026 -5099 -5053 -5006 -5040 -5073
1904 -5073 -5027 -4981 -5015 -5049 -5028 -5006 -4985 -4964 -4902 -4839 -4857 -4875 -4873 -4872 -4950 -5029 -5043 -5057 -5031 -5004 -5014 -5024 -5034 -5044 -4934 -4824 -4848 -4871 -4885 -4899 -4913 -4927 -4842 -4758
1900 -4758 -4754 -4749 -4737 -4724 -4668 -4452 -4343 -4233 -3990 -3747 -3634 -3682 -3773 -3864 -3764 -3664 -3483 -3303 -3100 -2897 -2573 -2411 -2550 -2849 -2935 -3021 -2973
1897b973M8Q8Q8K0J9j14j14o3o3p4Q8M7M7m0k00k35k36j48J2o2o1n2n1%Jj87j87j28j28ON
1893d647j1j1q6q6J0R0Jj58RRn6J04R6J7Q1p9o3o3PQJ06J06q1q1j8j9K2K2N8N7k2k2P0P1j0
1889d569j0J36J36J36J36J04J04k9l0m6m6J40J41J96J96K68L47J71r6k89k88n7n6J29K09J08
1886b859n3l7l8j50j49ooK5J85J76J5j82l41k18n8l4l5o4o5l5l5j15j16j22j22j12j12j16
1883d779M4L9m1r7r7k2k2L5L6L1L0J3o7j07N3j23m4J43O3R8o2o8R3j4j3n9K2O6r5m0l9M8M8
1879d927q6q6J4J3J3J4k4k5o4o4L4L3m6m6l4l4M6M7O2O2j8j8MMMMO2O2p1p1J9K0O0N9j7j8
1875e013O2O2m9n0rj0MMMML1L2m9m9M3M4M3M3o2o2o2o2J7J6J7J6Q0P9P9P9q8q7m8m8O0N9k1
1871d891k1J8J8k2k2klllQ8Q8m6m6M5M6l4l4r1r1j1j0R8R9l5l5k9k9p0o9O6O6j4j4k9k8J1
$$ plain form
1897 -2973 -2925 -2837 -2749 -2729 -2710 -2824 -2938 -3001 -3064 -3138 -3050 -3003 -2956 -2996 -3196 -3431 -3667 -3815 -3803 -3865 -3926 -3978 -4029 -4029 -4028 -4215 -4402 -4530 -4658 -4652 -4647
1893 -4647 -4658 -4669 -4755 -4841 -4831 -4741 -4740 -4898 -4889 -4880 -4936 -4832 -4736 -4719 -4638 -4717 -4780 -4843 -4836 -4828 -4722 -4616 -4697 -4778 -4796 -4815 -4793 -4771 -4713 -4656 -4678 -4700 -4630 -4559 -4569
1889 -4569 -4579 -4443 -4307 -4171 -4035 -3931 -3827 -3856 -3886 -3932 -3978 -3838 -3697 -3501 -3305 -3037 -2690 -2519 -2615 -2904 -3192 -3249 -3305 -3176 -2967 -2859
1886 -2859 -2912 -2949 -2987 -3137 -3286 -3292 -3298 -3273 -3088 -2912 -2897 -3079 -3420 -3638 -3696 -3730 -3765 -3829 -3894 -3929 -3964 -4079 -4195 -4317 -4439 -4551 -4663 -4779
1883 -4779 -4735 -4696 -4737 -4834 -4931 -4953 -4975 -4940 -4904 -4873 -4843 -4830 -4897 -5004 -4951 -5074 -5118 -4975 -4912 -4814 -4876 -4944 -4851 -4865 -4878 -4937 -4915 -4849 -4944 -4984 -5023 -4975 -4927
1879 -4927 -5013 -5099 -5085 -5072 -5059 -5045 -5069 -5094 -5158 -5222 -5188 -5155 -5201 -5247 -5281 -5315 -5269 -5222 -5160 -5098 -5116 -5134 -5130 -5126 -5122 -5118 -5056 -4994 -5065 -5136 -5117 -5097 -5037 -4978 -4995 -5013
1875 -5013 -4951 -4889 -4938 -4988 -4997 -5007 -5003 -4999 -4995 -4991 -4960 -4928 -4977 -5026 -4983 -4939 -4896 -4853 -4915 -4977 -5039 -5101 -5084 -5068 -5051 -5035 -4955 -4876 -4797 -4718 -4806 -4893 -4941 -4989 -4929 -4870 -4891
1871 -4891 -4912 -4894 -4876 -4898 -4920 -4922 -4925 -4928 -4931 -4843 -4755 -4801 -4847 -4802 -4756 -4790 -4824 -4915 -5006 -5017 -5027 -4929 -4830 -4865 -4900 -4929 -4958 -5028 -5097 -5031 -4965 -4979 -4993 -5022 -5050 -5039
1867e039J2J3J2R3R3k2k3k2k2L0K9L0L0%J%%QPp3p4O9O9j1j1j3j3j2j3k7k7M4M5R5l9j24J0
1863d875J7o4r0M3J09K8K8J09Rj25q9rK9K9m6m6j9j9j8j9R0R0m4m3o3o2J7J8j6j5j6j6mlr
1859e094rM0m1p9N5J11k3o5J6K2K2L3L2k1N9Rj25j20j20N9N9K6K6m6m6J4J48P2o1L1J11K3
1855d882n8m5m6K9K9k6k7k6k7kjkjk0k0j9k0J4J4J3J4M1M2M1M1NMo7o7k1J12j3j46o6O7J04
1851e032K4O5j5j09j09L2L1L2L1m2m3L8L8m9m9n0m9J01J01l3l3J4J4J4J4m1m2L9L9ooopj0
1847e104j0j1j0K3K3n7n8J50J50l7l8L0K9L9M0j11N0m0m0J6J7J6J7l8l7l8l7K6K6J26l4j11
1843e033M9n1n1O5O4j6j5k3k4k3k3N9N9N9N8K5K5K4K5q9r0qrp8p8LKR6R6l8l8j20j20O6O7
1839e085j3j4j3j4J9J8J8J8p3p4POM5M5M5M5k3k4k3k4K0J9K0J9o7o7O6O6p1p2P2P2n2J09J8
$$ plain form
1867 -5039 -5027 -5014 -5002 -4909 -4816 -4838 -4861 -4883 -4905 -4875 -4846 -4816 -4786 -4786 -4785 -4785 -4785 -4777 -4770 -4843 -4917 -4848 -4779 -4790 -4801 -4814 -4827 -4839 -4852 -4879 -4906 -4862 -4817 -4722 -4761 -4885 -4875
1863 -4875 -4858 -4922 -5012 -4969 -4860 -4832 -4804 -4695 -4686 -4811 -4900 -4909 -4880 -4851 -4897 -4943 -4962 -4981 -4999 -5018 -4928 -4838 -4882 -4925 -4988 -5050 -5033 -5015 -5031 -5046 -5062 -5078 -5082 -5085 -5094
1859 -5094 -5103 -5063 -5104 -5183 -5128 -5017 -5040 -5105 -5089 -5067 -5045 -5012 -4980 -5001 -4942 -4933 -5058 -5178 -5298 -5239 -5180 -5154 -5128 -5174 -5220 -5206 -5058 -4986 -5047 -5016 -4905 -4882
1855 -4882 -4940 -4985 -5031 -5002 -4973 -4999 -5026 -5052 -5079 -5081 -5082 -5084 -5085 -5105 -5125 -5144 -5164 -5150 -5136 -5123 -5109 -5068 -5026 -4985 -4944 -4939 -4935 -5002 -5069 -5090 -4978 -4991 -5137 -5203 -5136 -5032
1851 -5032 -5008 -4943 -4958 -5067 -5176 -5144 -5113 -5081 -5050 -5092 -5135 -5097 -5059 -5108 -5157 -5207 -5256 -5155 -5054 -5087 -5120 -5106 -5092 -5078 -5064 -5105 -5147 -5108 -5069 -5075 -5081 -5087 -5094 -5104
1847 -5104 -5114 -5125 -5135 -5112 -5089 -5146 -5204 -5054 -4904 -4941 -4979 -4949 -4920 -4881 -4841 -4952 -4902 -4942 -4982 -4966 -4949 -4933 -4916 -4954 -4991 -5029 -5066 -5040 -5014 -4888 -4922 -5033
1843 -5033 -4984 -5035 -5086 -5021 -4957 -4973 -4988 -5011 -5035 -5058 -5081 -5022 -4963 -4904 -4846 -4821 -4796 -4772 -4747 -4836 -4926 -4934 -4943 -5021 -5099 -5096 -5094 -4998 -4902 -4940 -4978 -5098 -5218 -5152 -5085
1839 -5085 -5098 -5112 -5125 -5139 -5120 -5102 -5084 -5066 -5139 -5213 -5206 -5200 -5155 -5110 -5065 -5020 -5043 -5067 -5090 -5114 -5094 -5075 -5055 -5036 -5103 -5170 -5104 -5038 -5109 -5181 -5109 -5037 -5089 -4980 -4962
1835d962J9qqpq%jm0m0L7L8m3m2K7K8n3n2k0k0K0K0Q1Q0M1M0K4K5j09j10j5j4K5K5J6J6k4
1831e014k4N5N4J5J4J4J4k7k6OPl4l4l0k9l0l0K5K5n6n5P2P2n2n2j41J8RQQ7Q6OOK2K3K3K2
1827d951PPPOj3j3j3j4j2j3kkj13M8m3m2J9J8J20m2j31K9O2O3m0l9M0M1l6l6M4M4n4n4L6L7
1823e035o1J00RRj5j6Q5p6j36K5MNooP5P5k6k6k5k6NNNNN5N5p8p9k2k3J11J11P5P4n9n9m3
1819d929m2L8L7k7k7N2N3m5m5m4m5POPPpppqm3m3m3m3J02J02O3O2m3m2L8L8p3p3PPM1M1m0
1814d968m0K3K3n7n8j2j2j2j2N5N5k5k5N3N3N4N3l6l7l7l6qrqqL0L1n0n0J1J0R1R0p2p2p3
1810e085p2K8K8K8K8p2p1O2O2rqP1P1n9o0k0k0qrP1P1j0j1j1j0N7N7N7N6l8l8KKP4P5o0n9
1806d830j0rj0j0llllO4O5j6j6p9p9N4N5oopom4m5m4m5KKR3o8l6l7m6m6J21J20o6o7J1J0J1
$$ plain form
1835 -4962 -4943 -4951 -4959 -4966 -4974 -4974 -4975 -5015 -5055 -5018 -4980 -5023 -5065 -5038 -5010 -5063 -5115 -5135 -5155 -5135 -5115 -5034 -4954 -4913 -4873 -4849 -4824 -4933 -5043 -5058 -5072 -5047 -5022 -5006 -4990 -5014
1831 -5014 -5038 -4983 -4929 -4914 -4900 -4886 -4872 -4899 -4925 -4919 -4912 -4946 -4980 -5010 -5039 -5069 -5099 -5074 -5049 -5105 -5160 -5088 -5016 -5068 -5120 -5261 -5243 -5234 -5226 -5139 -5053 -5047 -5041 -5019 -4996 -4973 -4951
1827 -4951 -4944 -4937 -4930 -4924 -4937 -4950 -4963 -4977 -4989 -5002 -5004 -5006 -5119 -5071 -5114 -5156 -5137 -5119 -4999 -5041 -5172 -5143 -5081 -5018 -5058 -5097 -5057 -5016 -5052 -5088 -5044 -5000 -5054 -5108 -5072 -5035
1823 -5035 -5096 -4996 -4987 -4978 -4993 -5009 -4924 -5000 -5136 -5111 -5107 -5102 -5108 -5114 -5039 -4964 -4990 -5016 -5041 -5067 -5062 -5057 -5052 -5047 -4992 -4937 -5015 -5094 -5116 -5139 -5028 -4917 -4842 -4768 -4827 -4886 -4929
1819 -4929 -4971 -4933 -4896 -4923 -4950 -4898 -4845 -4890 -4935 -4979 -5024 -5017 -5011 -5004 -4997 -5004 -5011 -5018 -5026 -5069 -5112 -5155 -5198 -5096 -4994 -4931 -4869 -4912 -4954 -4916 -4878 -4951 -5024 -5017 -5010 -4969 -4928 -4968
1814 -4968 -5008 -4985 -4962 -5019 -5077 -5089 -5101 -5113 -5125 -5070 -5015 -5040 -5065 -5012 -4959 -4905 -4852 -4888 -4925 -4962 -4998 -5006 -5015 -5023 -5031 -5001 -4970 -5020 -5070 -5059 -5049 -4958 -4868 -4940 -5012 -5085
1810 -5085 -5157 -5129 -5101 -5073 -5045 -5117 -5188 -5126 -5064 -5073 -5081 -5010 -4939 -4998 -5058 -5078 -5098 -5106 -5115 -5044 -4973 -4983 -4994 -5005 -5015 -4958 -4901 -4844 -4788 -4826 -4864 -4862 -4860 -4786 -4711 -4771 -4830
1806 -4830 -4840 -4849 -4859 -4869 -4872 -4875 -4878 -4881 -4817 -4752 -4768 -4784 -4863 -4942 -4888 -4833 -4839 -4845 -4852 -4858 -4902 -4947 -4991 -5036 -5034 -5032 -4939 -5007 -5043 -5080 -5126 -5172 -5051 -4931 -4997 -5064 -5053 -5043 -5032
1801e032J0rqP1P1kkkkn4n5o5R6M7M8k3k3M1M2l9l9o3o4J6J7L7L8L7L8j8j7j8j7j8j7j8j7
1797e013KLKLJ8J8RQM3j16j07j07K3K3K4K3l8l9M2M2k8k8J05J06k5k5l4l5P2q9KKm3m4L7L7
1793e127L1L1L1L1QPQPm1m2L9L8MLMLm1m0m1m1P0O9j0j1l9l8M1M2j2j2O8O8o4o5N9N9R0o9
1789d882p0R1M2M2q2q2p1p2RQJ8J8J8J9o4o4J6J7l0k9N1N0k2k3l3l3J13m7m7J13Q0P9j51j50
1785e168K8K9J09J09R7R8j44j43m3m4m3m3l0l0N1N0j8j8j7j8N2N3j18M2K2K1L2L1O2O1j8j9
1781d967K1K1K2K1J6J6J6J6m1m1M9j12j6j6k6k6m2m1K9K8J39k1j01N8k0k1k0k1R3o7K2K3N0
1777d959N0l1l0j1j0j0j1N4N4k6k7j06j07Q1Q1M4M5M5M4j42j43o2o2OOOOK6K6K6K6P6P6mm
1773d967QPQPk1k1j2j1k3J37l3l3j9j9j9j9M1M2l9l9m7m8m7m7P1P1rqm7m6L3L4k0j9O0O0r5
$$ plain form
1801 -5032 -5022 -5031 -5039 -4968 -4897 -4899 -4901 -4903 -4905 -4959 -5014 -5079 -4983 -4936 -4888 -4911 -4934 -4893 -4851 -4890 -4929 -4992 -5056 -5040 -5023 -4986 -4948 -4911 -4873 -4891 -4908 -4926 -4943 -4961 -4978 -4996 -5013
1797 -5013 -5011 -5008 -5006 -5003 -4985 -4967 -4958 -4950 -4907 -5023 -5130 -5237 -5214 -5191 -5167 -5144 -5182 -5221 -5179 -5137 -5165 -5193 -5088 -4982 -5007 -5032 -5066 -5101 -5029 -5118 -5116 -5114 -5157 -5201 -5164 -5127
1793 -5127 -5096 -5065 -5034 -5003 -4995 -4988 -4980 -4973 -5014 -5056 -5017 -4979 -4975 -4972 -4968 -4965 -5006 -5046 -5087 -5128 -5058 -4989 -4999 -5010 -5049 -5087 -5046 -5004 -5016 -5028 -4960 -4892 -4956 -5021 -4962 -4903 -4813 -4882
1789 -4882 -4952 -4861 -4819 -4777 -4859 -4941 -5012 -5084 -5075 -5067 -5049 -5031 -5013 -4994 -5058 -5122 -5106 -5089 -5119 -5148 -5097 -5047 -5069 -5092 -5125 -5158 -5045 -5092 -5139 -5026 -4946 -4867 -5018 -5168
1785 -5168 -5140 -5111 -5002 -4893 -4796 -4698 -4842 -4985 -5028 -5072 -5115 -5158 -5188 -5218 -5167 -5117 -5135 -5153 -5170 -5188 -5136 -5083 -5201 -5159 -5137 -5116 -5084 -5053 -4991 -4930 -4948 -4967
1781 -4967 -4946 -4925 -4903 -4882 -4866 -4850 -4834 -4818 -4859 -4900 -4851 -4963 -4979 -4995 -5021 -5047 -5089 -5130 -5101 -5073 -4934 -4955 -5056 -4998 -5018 -5039 -5059 -5080 -4987 -5054 -5032 -5009 -4959
1777 -4959 -4909 -4940 -4970 -4981 -4991 -5001 -5012 -4958 -4904 -4930 -4957 -5063 -5170 -5089 -5008 -4964 -4919 -4874 -4830 -4972 -5115 -5177 -5239 -5233 -5227 -5221 -5215 -5189 -5163 -5137 -5111 -5035 -4959 -4963 -4967
1773 -4967 -4959 -4952 -4944 -4937 -4958 -4979 -4991 -5002 -5025 -4888 -4921 -4954 -4973 -4992 -5011 -5030 -4989 -4947 -4986 -5025 -5072 -5120 -5167 -5214 -5143 -5072 -5081 -5089 -5136 -5182 -5149 -5115 -5135 -5154 -5094 -5034 -5129
1769e129r5L9L8N1N0N0N0r6r6L7L8O2O3j8j7l8l8R6R6o9p0O5O4j3j3j3j3j5j5j5j4kjjjm3
1765e026m3l3l3j54PllO7O7llo0J01J1J0RRp1p1NOJ29J30J30k9j26j27J9J9J9J9L2L3m8m8
1761e059M8M8M9M8mlmml9m0l9m0ooooJ5J4J5J5o9o9J2J1Q9Q8RQN2N2k9k8K4K4n6n6O3O3j8
1757d834j7p2p2p1p2O0O1k0k0l3l3M7M7j3j4j3j3KJKKn3n4K7K7pppqkkkkL2L1L1L1ppqpN3
1752e016N3k7k7k2k2N8N8J1J1o9o9O8O8O8O8l1l1l1l2m6m6Q7Q8MNMNK4K5n6n6J5J4J5J4l2
1748d850l2l2l3p3p4OOP5P5nnO8O9j1j2mnnmPOPPllllopopMMLMRQRRn1n2n1n1j3j3j4j3jj
1742e067kjR4R4l9l9L5L6L6L6LKLLo2o3J8J8m0m0l9m0l3l3M7M7j2j2j1j2M9M8l2l1K4K3K4
1738d968K4m1m2m1m1M5M5M5M5J1J2J1J2N9N9N9N9M7M7q6q7l2l2l2l2K5K4K5K5n3n2K7K8n1
$$ plain form
1769 -5129 -5224 -5185 -5147 -5096 -5046 -4996 -4946 -5042 -5138 -5101 -5063 -5001 -4938 -4956 -4973 -5011 -5049 -4953 -4857 -4926 -4996 -4931 -4867 -4880 -4893 -4906 -4919 -4934 -4949 -4964 -4978 -4980 -4981 -4982 -4983 -5026
1765 -5026 -5069 -5102 -5135 -5289 -5282 -5285 -5288 -5221 -5154 -5157 -5160 -5220 -5119 -5108 -5098 -5089 -5080 -5151 -5222 -5217 -5211 -5082 -4952 -4822 -4851 -4977 -5104 -5085 -5066 -5047 -5028 -4996 -4963 -5011 -5059
1761 -5059 -5011 -4963 -4914 -4866 -4870 -4873 -4877 -4881 -4920 -4960 -4999 -5039 -5045 -5051 -5057 -5063 -5048 -5034 -5019 -5004 -5073 -5142 -5130 -5119 -5030 -4942 -4933 -4925 -4873 -4821 -4850 -4878 -4854 -4830 -4886 -4942 -4879 -4816 -4834
1757 -4834 -4851 -4923 -4995 -5066 -5138 -5078 -5017 -5037 -5057 -5090 -5123 -5076 -5029 -5042 -5056 -5069 -5082 -5080 -5079 -5077 -5075 -5128 -5182 -5155 -5128 -5135 -5142 -5149 -5157 -5159 -5161 -5163 -5165 -5133 -5102 -5071 -5040 -5047 -5054 -5062 -5069 -5016
1752 -5016 -4963 -4990 -5017 -5039 -5061 -5003 -4945 -4934 -4923 -4992 -5061 -4993 -4925 -4857 -4789 -4820 -4851 -4882 -4914 -4960 -5006 -4919 -4831 -4827 -4822 -4818 -4813 -4789 -4764 -4820 -4876 -4861 -4847 -4832 -4818 -4850
1748 -4850 -4882 -4914 -4947 -5020 -5094 -5088 -5082 -5007 -4932 -4937 -4942 -4874 -4805 -4816 -4828 -4832 -4837 -4842 -4846 -4839 -4833 -4826 -4819 -4822 -4825 -4828 -4831 -4837 -4844 -4850 -4857 -4853 -4849 -4846 -4842 -4833 -4825 -4816 -4807 -4858 -4910 -4961 -5012 -5025 -5038 -5052 -5065 -5066 -5067
1742 -5067 -5069 -5070 -4976 -4882 -4921 -4960 -4925 -4889 -4853 -4817 -4814 -4812 -4809 -4806 -4868 -4931 -4913 -4895 -4935 -4975 -5014 -5054 -5087 -5120 -5073 -5026 -5038 -5050 -5061 -5073 -5024 -4976 -5008 -5039 -5015 -4992 -4968
1738 -4968 -4944 -4985 -5027 -5068 -5109 -5064 -5019 -4974 -4929 -4918 -4906 -4895 -4883 -4824 -4765 -4706 -4647 -4600 -4553 -4639 -4726 -4758 -4790 -4822 -4854 -4829 -4805 -4780 -4755 -4808 -4860 -4833 -4805 -4856
1734d856n1n1n1K4K4K4K4K3K4K4K4J7J8J7J7j09j10k9l0O3O3p1p1l2l2J01J01rj0j0rJ2J2
1730d919R2R2q2q3J05J05MNMNNNMNp2p1J51qp4p3N0N0m7m7M3j17m5m5m5m5m8J12K2K2mmlm
1726d955j9j9j9j9l8l8m9J12L2L1l8l8k5k4k5k4N7N8M7M7O4r7LMl4J27J27l3K4K3J3J4k0k0
1722d751k0k0m4m3l4l3q7P3O4O3KKp8p8J7J7o3o3M4M5M4M4j5j6j6j6KJQ2Q1m2m2m2m2n5n5
1718e074P9P9j7j6O4O3n3n2K7K7l2l3PPJ%M1M0m0m1%jM0L9m1m1O4O5p0o9nmL5L6k4k3k4k4
1713d970j9k0PQ7N3q2jjk0j9k8k8J42Rm1m1o3P1M1m0OO%JJ3J2O7j5n1Q2KKn0m9M7l2j49L8
1709e033J07K7K6K6K1K1p1p1O3O3OOp4p4N2N3k7k8K8K7n3n3j3j3K7K7qrL1L2K5K6n5n4J1J2
1705d919N2N2m9m9L1L1p2p1RRk1k2N9N9O0N9k0k1j6j6O5O4l2l2l2l2P1P1o3o3m0m1%%J1J1
$$ plain form
1734 -4856 -4907 -4958 -5009 -4985 -4961 -4937 -4913 -4890 -4866 -4842 -4818 -4801 -4783 -4766 -4749 -4858 -4968 -4997 -5027 -4964 -4901 -4972 -5043 -5075 -5107 -5006 -4905 -4914 -4924 -4934 -4943 -4931 -4919
1730 -4919 -4827 -4735 -4817 -4900 -4795 -4690 -4686 -4681 -4677 -4672 -4667 -4662 -4658 -4653 -4725 -4796 -4645 -4653 -4727 -4800 -4750 -4700 -4747 -4794 -4751 -4868 -4913 -4958 -5003 -5048 -5096 -4984 -4962 -4940 -4944 -4948 -4951 -4955
1726 -4955 -4974 -4993 -5012 -5031 -5069 -5107 -5156 -5044 -5012 -4981 -5019 -5057 -5082 -5106 -5131 -5155 -5098 -5040 -4993 -4946 -4882 -4979 -4976 -4972 -5006 -4879 -4752 -4785 -4761 -4738 -4725 -4711 -4731 -4751
1722 -4751 -4771 -4791 -4835 -4878 -4912 -4945 -5032 -4959 -4895 -4832 -4830 -4828 -4906 -4984 -4967 -4950 -5013 -5076 -5032 -4987 -4943 -4899 -4914 -4930 -4946 -4962 -4960 -4959 -4877 -4796 -4838 -4880 -4922 -4964 -5019 -5074
1718 -5074 -4995 -4916 -4933 -4949 -4885 -4822 -4875 -4927 -4900 -4873 -4905 -4938 -4931 -4924 -4923 -4923 -4882 -4842 -4882 -4923 -4923 -4924 -4884 -4845 -4886 -4927 -4863 -4798 -4868 -4937 -4942 -4946 -4911 -4875 -4899 -4922 -4946 -4970
1713 -4970 -4989 -5009 -5002 -4915 -4862 -4944 -4945 -4946 -4966 -4985 -5013 -5041 -4899 -4890 -4931 -4972 -5035 -4964 -4923 -4963 -4957 -4951 -4951 -4950 -4937 -4925 -4858 -4873 -4924 -4842 -4840 -4838 -4888 -4937 -4890 -4922 -5071 -5033
1709 -5033 -4926 -4899 -4873 -4847 -4826 -4805 -4876 -4947 -4884 -4821 -4815 -4809 -4883 -4957 -4905 -4852 -4879 -4907 -4879 -4852 -4905 -4958 -4971 -4984 -4957 -4930 -4938 -4947 -4916 -4884 -4859 -4833 -4888 -4942 -4931 -4919
1705 -4919 -4867 -4815 -4864 -4913 -4882 -4851 -4923 -4994 -4985 -4976 -4997 -5019 -4960 -4901 -4841 -4782 -4802 -4823 -4839 -4855 -4790 -4726 -4758 -4790 -4822 -4854 -4783 -4712 -4775 -4838 -4878 -4919 -4919 -4919 -4908 -4897
1701d897k8k9K5K6K6K5mnj38j38O7O8K7K8l9l8JKk1k1J9J9lmL7L7J0J1J0J1Q3Q3LLl3l2M7
1697d762M7k6k6j07j06m2m2L8L8j5j6O5O5Q7Q8PPl4l5M6M5klllQ1Q0JJn2n1n1n2n3n4j4j3
1692d866o6o5J5J5J0J1J1J0j2j2O7O8N8N7k2k3j9k0k0k0m5m4L5L5N5N4p9q0r1r1j1j0M1M1
1689e013M1M1K2K1K1K1N3N3k8k7m7m8L3L3K4K4K4K4j8j8j8j8m6m5m5m6M5M5q9q9N9N9k1k1
1685d994nmmnN3N2N2N3llklj4j4O7O6k5k6k5k6KJJJk0k1k0k0p5p4J12J13O7O8o6o6l6l5M4
1680d834M5l4l4l4l4M7M8l3l3J2J2J2J2j0j0j0j0M3M3l7l7p0p1O3O4n3n2K8K8J7J7J7J7l0
1676d901k9l0l0n8n8P6P6nmmnK2K1n8n9rqrql0l0m5J16%q0N6N5K0K0K0K0j3j4j3j4K6K5n0
1672e011m9k7N4J09n1p1Q9L8m1j6O4O4j7j7O3J13m8p2Q8Q3p8p0J0l9m0m4L7R3o9j14M7M1j18
$$ plain form
1701 -4897 -4925 -4954 -4929 -4903 -4877 -4852 -4856 -4861 -4999 -5137 -5070 -5002 -4975 -4947 -4986 -5024 -5023 -5021 -5042 -5063 -5044 -5025 -5028 -5032 -4995 -4958 -4948 -4937 -4927 -4916 -4833 -4750 -4747 -4744 -4777 -4809 -4762
1697 -4762 -4715 -4741 -4767 -4874 -4980 -5022 -5064 -5026 -4988 -5003 -5019 -4954 -4889 -4802 -4714 -4707 -4700 -4734 -4769 -4723 -4678 -4680 -4683 -4686 -4689 -4608 -4528 -4527 -4526 -4578 -4629 -4680 -4732 -4785 -4839 -4853 -4866
1692 -4866 -4932 -4997 -4982 -4967 -4957 -4946 -4935 -4925 -4937 -4949 -4882 -4814 -4756 -4699 -4721 -4744 -4763 -4783 -4803 -4823 -4868 -4912 -4877 -4842 -4787 -4733 -4812 -4892 -4983 -5074 -5085 -5095 -5054 -5013
1689 -5013 -4972 -4931 -4909 -4888 -4867 -4846 -4793 -4740 -4768 -4795 -4842 -4890 -4857 -4824 -4800 -4776 -4752 -4728 -4746 -4764 -4782 -4800 -4846 -4891 -4936 -4982 -4937 -4892 -4981 -5070 -5011 -4952 -4973 -4994
1685 -4994 -4999 -5003 -5007 -5012 -4959 -4907 -4855 -4802 -4805 -4808 -4810 -4813 -4827 -4841 -4774 -4708 -4733 -4759 -4784 -4810 -4808 -4807 -4806 -4805 -4825 -4846 -4866 -4886 -4961 -5035 -4923 -4810 -4743 -4675 -4741 -4807 -4843 -4878 -4834
1680 -4834 -4789 -4823 -4857 -4891 -4925 -4878 -4830 -4863 -4896 -4884 -4872 -4860 -4848 -4858 -4868 -4878 -4888 -4845 -4802 -4839 -4876 -4946 -5017 -4954 -4890 -4943 -4995 -4967 -4939 -4922 -4905 -4888 -4871 -4901
1676 -4901 -4930 -4960 -4990 -5048 -5106 -5030 -4954 -4959 -4963 -4967 -4972 -4950 -4929 -4987 -5046 -5055 -5063 -5072 -5080 -5110 -5140 -5185 -5069 -5069 -5149 -5093 -5038 -5018 -4998 -4978 -4958 -4971 -4985 -4998 -5012 -4986 -4961 -5011
1672 -5011 -5060 -5087 -5033 -4924 -4975 -5046 -4957 -4919 -4960 -4976 -4912 -4848 -4865 -4882 -4819 -4706 -4754 -4826 -4738 -4655 -4733 -4803 -4793 -4832 -4872 -4916 -4879 -4786 -4855 -4969 -4922 -4881 -4999
1668d999m4L6j8j9K5K5K4K5j00j01Q7Q6KKKJj1j2j2j1M8M8l3l2LKLLnmnnn5n4P3P4M1l9j4
1664d963J46P6q4k9N1l3l2k8k7K4K4K4K4O9O8o5o5p2p2q7P3Q7PJ7R7j3j3qrm4m4R0Q9j9j9
1660d760O1O1P7P6n7n7p2p3O2O1J1J2J1J1J5J4K5K5J22K82L52N13N07O68R19R19O93M26q8
1656H16n69p68p70p09p10n26l66k69k69j21j20J3J4j7j6k7k6%j60j60%l9l9N1N1J11J12p6
1653d589p6RRQRl4l5J53J52J2J2J2J2L9L9L8L9J10J09L0K9J92J91K52M12O81R49J382J971
1650B117K322K696K883K188P50j014k371k746k407k034j572j305j076q10n85l18j98j98j71
1648c849j71j20M1n0n0l9m0l9m0m3m3m3m3k7k8N2N2K9K8K9K8j3j3j3j4J7J6J7J6L7L6J17J17
1644d046P1P0J51J51K85K85N38Q60J166J700K263K583K841K520J504j00j783k746k772k237
$$ plain form
1668 -4999 -5043 -5007 -5025 -5044 -5019 -4994 -4970 -4945 -5045 -5146 -5059 -4973 -4971 -4969 -4967 -4966 -4977 -4989 -5001 -5012 -4964 -4916 -4949 -4981 -4978 -4976 -4973 -4970 -4975 -4979 -4984 -4989 -5044 -5098 -5025 -4951 -4910 -4949 -4963
1664 -4963 -4817 -4741 -4825 -4854 -4803 -4836 -4868 -4896 -4923 -4899 -4875 -4851 -4827 -4758 -4690 -4755 -4820 -4892 -4964 -5051 -4978 -4891 -4884 -4867 -4770 -4783 -4796 -4804 -4813 -4857 -4901 -4811 -4722 -4741 -4760
1660 -4760 -4699 -4638 -4561 -4485 -4542 -4599 -4671 -4744 -4682 -4621 -4610 -4598 -4587 -4576 -4561 -4547 -4522 -4497 -4375 -4093 -3741 -3228 -2721 -2053 -1134 -215 478 904 816
1656 816 247 -521 -1291 -2000 -2710 -3236 -3602 -3871 -4140 -4261 -4381 -4368 -4354 -4371 -4387 -4414 -4440 -4440 -4600 -4760 -4760 -4799 -4838 -4787 -4736 -4625 -4513 -4589
1653 -4589 -4665 -4656 -4647 -4639 -4630 -4664 -4699 -4546 -4394 -4382 -4370 -4358 -4346 -4307 -4268 -4230 -4191 -4081 -3972 -3942 -3913 -3721 -3530 -3278 -2866 -2185 -1236 146 2117
1650 2117 4439 7135 10018 12206 12956 11942 9571 6825 4418 2384 812 -493 -1569 -2379 -2964 -3282 -3480 -3678 -3849
1648 -3849 -4020 -4140 -4099 -4149 -4199 -4238 -4278 -4317 -4357 -4400 -4443 -4486 -4529 -4556 -4584 -4532 -4480 -4451 -4423 -4394 -4366 -4379 -4392 -4405 -4419 -4402 -4386 -4369 -4353 -4316 -4280 -4163 -4046
1644 -4046 -3975 -3905 -3754 -3603 -3318 -3033 -2495 -1635 -469 1231 3494 6077 8918 11438 12942 12842 11059 8313 5541 3304
1642C304j810j489j201q80n40n39k79k78q3q4q3q3j23j24m3m3q7q7opO5O6O5O5n0n0J38J37
1638d129J16J17L6L6K8K8j06j05p1p2p1p1J60J59P9Q0M0M0N0N0Q5K45K16N36O42O42Q15Q15
1635C90P25J91l71o91q87q87n61n60l89l90k03k03j37j37lml3l3l4l3k4k3k3k3k4k3k3k3M7
1632d389M7M7M7K9K9K9K8L8L8r6r6n9n9n9o0Q1Q0J%J0RJ0RJ7J7k3k3j6j5r6r6l5l6l6l6J1
1628d653J1J1J1l9l9M1M2j4j4K6K6j1j1K9K9J3J4J4J4rrP1P2j6j6r5r6J5J5J5J5p7p7MLo0
1624d745o0K0K0L4L3opM0L9%jQ6Q7J26J27R4R5J35J35k9k9j09j09j04j03k3k3j3j3j3j3o1
1620d390o1o0o1j4j4O7O6QQQ8Q8N9N9R9J00J58J58J59J58k4k5k4k5p7p7N6N7K8K8J08J08k1
1616c213k2j56j55q6q5q5q5m9m8l9l8k9J32M2M2K6K7K7K6o5o4k4k5M9M9J30J29L32L32L33
$$ plain form
1642 3304 1494 5 -1196 -2076 -2616 -3155 -3434 -3712 -3795 -3879 -3962 -4045 -4168 -4292 -4335 -4378 -4465 -4552 -4558 -4565 -4500 -4434 -4369 -4304 -4354 -4404 -4266 -4129
1638 -4129 -4013 -3896 -3860 -3824 -3796 -3768 -3874 -3979 -4050 -4122 -4193 -4264 -4104 -3945 -3866 -3786 -3746 -3706 -3656 -3606 -3521 -3276 -3060 -2524 -1882 -1240 -425 390
1635 390 1115 1306 935 244 -643 -1530 -2091 -2651 -3040 -3430 -3633 -3836 -3973 -4110 -4113 -4117 -4150 -4183 -4217 -4250 -4274 -4297 -4320 -4343 -4367 -4390 -4413 -4436 -4389
1632 -4389 -4342 -4295 -4248 -4219 -4190 -4161 -4133 -4095 -4057 -4153 -4249 -4308 -4367 -4426 -4486 -4405 -4325 -4324 -4324 -4314 -4305 -4295 -4286 -4269 -4252 -4275 -4298 -4314 -4329 -4425 -4521 -4556 -4592 -4628 -4664 -4653
1628 -4653 -4642 -4631 -4620 -4659 -4698 -4657 -4615 -4629 -4643 -4617 -4591 -4602 -4613 -4584 -4555 -4542 -4528 -4514 -4500 -4509 -4518 -4447 -4375 -4391 -4407 -4502 -4598 -4583 -4568 -4553 -4538 -4615 -4692 -4688 -4685 -4745
1624 -4745 -4805 -4785 -4765 -4731 -4698 -4704 -4711 -4671 -4632 -4632 -4633 -4547 -4460 -4334 -4207 -4113 -4018 -3883 -3748 -3777 -3806 -3915 -4024 -4128 -4231 -4254 -4277 -4290 -4303 -4316 -4329 -4390
1620 -4390 -4451 -4511 -4572 -4586 -4600 -4533 -4467 -4459 -4451 -4363 -4275 -4216 -4157 -4058 -3958 -3800 -3642 -3483 -3325 -3349 -3374 -3398 -3423 -3500 -3577 -3521 -3464 -3436 -3408 -3300 -3192 -3213
1616 -3213 -3235 -3391 -3546 -3632 -3717 -3802 -3887 -3936 -3984 -4023 -4061 -4090 -3958 -3916 -3874 -3848 -3821 -3794 -3768 -3833 -3897 -3921 -3946 -3897 -3848 -3718 -3589 -3257 -2925 -2592
1613b592L32J68J67J8j44j54j55k45k45j79j80r9r9QQQ8Q8J26J26K60K60L61L60L24N6j8j8
1610a378j14j15j58j58K9K9l7l8j18j18j88j88j78j78o4R8llJ30k9O0O1k22k22k12k12j31
1607c657K9K8j31J14J15J05J04K78K79L48L49K84J24k7k6l04l04k14k14j89k9l9l9N8N8O8
1604b832r2m3m4j86j87q5q5Nj55p3p4N0M9J1J0J45J44Q1Q0M1M0j23j23q3q3%%J33J34K18K17
1600b910L1L1m7m8j81j80j78j77m4m4j45j44o4o5k7k8k7k8L7L6L7L6L7L6L7L6Q6Q6Q6Q5J06
1597c534J06J06J05n1n2n2n1j22j22m2m1K10K10J31J30O0O0j27j27q1q2j61j61j5j4j4j4J29
1593c616J30J30J30K50K50J70J70K43K43N08N07N58R30J410J998K950M288N350O259O439M996
1591C4293K370r99l923n901o436n634m531l622k667j865j373j000o86m19l42j81j21j22j22
$$ plain form
1613 -2592 -2260 -2092 -1925 -1907 -2051 -2205 -2360 -2605 -2850 -3029 -3209 -3308 -3407 -3399 -3391 -3303 -3215 -3089 -2963 -2703 -2443 -2082 -1722 -1398 -1342 -1360 -1378
1610 -1378 -1492 -1607 -1765 -1923 -1894 -1865 -1902 -1940 -2058 -2176 -2364 -2552 -2730 -2908 -2972 -2874 -2877 -2880 -2750 -2779 -2719 -2658 -2880 -3102 -3314 -3526 -3657
1607 -3657 -3628 -3600 -3731 -3617 -3502 -3397 -3293 -3015 -2736 -2388 -2039 -1755 -1631 -1658 -1684 -1988 -2292 -2506 -2720 -2909 -2938 -2977 -3016 -2958 -2900 -2832
1604 -2832 -2924 -2967 -3011 -3197 -3384 -3469 -3554 -3549 -3704 -3777 -3851 -3801 -3752 -3741 -3731 -3586 -3442 -3361 -3281 -3240 -3200 -3323 -3446 -3529 -3612 -3612 -3612 -3479 -3345 -3127 -2910
1600 -2910 -2879 -2848 -2895 -2943 -3124 -3304 -3482 -3659 -3703 -3747 -3892 -4036 -4100 -4165 -4192 -4220 -4247 -4275 -4238 -4202 -4165 -4129 -4092 -4056 -4019 -3983 -3897 -3811 -3725 -3640 -3534
1597 -3534 -3428 -3322 -3217 -3268 -3320 -3372 -3423 -3545 -3667 -3709 -3750 -3540 -3330 -3199 -3069 -3009 -2949 -3076 -3203 -3284 -3366 -3527 -3688 -3703 -3717 -3731 -3745 -3616
1593 -3616 -3486 -3356 -3226 -2976 -2726 -2556 -2386 -2143 -1900 -1392 -885 -327 603 2013 4011 6961 11249 16599 22858 29297 34293
1591 34293 36663 35664 31741 25840 19404 13770 9239 5617 2950 1085 -288 -1288 -1974 -2393 -2735 -2916 -3037 -3159 -3281
1589c281j23m3m2r0q9q9q9k1k1k0k1o7o8o7o8j0j1j1j1l1l1l0l1q2q1q2q1R8R9J9J9n8n9P6
1585d497P5k4k5N5N6M5M6q9q8J2J2J2J2n9n9j49J1M3M3N3N3N3N4P4q7J3J74Q4Q3P5K35K78
1581c426K78L10L10N51P11J095J682K241K722L127L127K588J466j79j836k932l413l233k538
1579B651j903j421r53o86n02k35j26j26j10j09j73j73l0k9q6P4j6j5j05j04K9L0l9l9j20j19
1576d435J9J8o2o1kjkjJ5J6J5J6Q0Q1Q1Q0o3o3J8J7q3q3r4O8M7M8N7N8PPQPr7r7j7j7p0p0
1572d555p1p0M4M4p9q0qJ53p1p2o5o5J21J22N0N0N0N0j2j2J22J22O2O2J52qn0n1K1K0r9r9
1568d222r8r9N1N0N0N0J24J24J24J24l9l8l8l9k8k8N2N2N6N7K00K00J76L37O38O38O32M71
1565d23L41J80k68n36l95l96m08m08l27l28k01k00j91j91j45J6ONO4O4j6j6J41J41m6m6J3
$$ plain form
1589 -3281 -3404 -3447 -3489 -3579 -3668 -3757 -3846 -3867 -3888 -3908 -3929 -3996 -4064 -4131 -4199 -4209 -4220 -4231 -4242 -4273 -4304 -4334 -4365 -4447 -4528 -4610 -4691 -4593 -4494 -4475 -4456 -4514 -4573 -4497
1585 -4497 -4422 -4446 -4471 -4416 -4360 -4315 -4269 -4358 -4446 -4434 -4422 -4410 -4398 -4457 -4516 -4665 -4654 -4611 -4568 -4515 -4462 -4409 -4355 -4281 -4368 -4355 -4181 -4097 -4014 -3939 -3704 -3426
1581 -3426 -3148 -2838 -2528 -1977 -1266 -171 1511 3752 6474 9601 12728 15316 16782 16603 14767 11835 8422 5189 2651
1579 2651 748 -673 -1626 -2312 -2814 -3049 -3175 -3301 -3411 -3520 -3693 -3866 -3896 -3925 -4011 -3937 -3953 -3968 -4073 -4177 -4148 -4118 -4157 -4196 -4316 -4435
1576 -4435 -4416 -4398 -4460 -4521 -4523 -4524 -4526 -4527 -4512 -4496 -4481 -4465 -4385 -4304 -4223 -4143 -4206 -4269 -4251 -4234 -4317 -4400 -4494 -4426 -4379 -4331 -4274 -4216 -4209 -4202 -4194 -4187 -4284 -4381 -4398 -4415 -4485 -4555
1572 -4555 -4626 -4696 -4652 -4608 -4687 -4767 -4775 -4622 -4693 -4765 -4830 -4895 -4774 -4652 -4602 -4552 -4502 -4452 -4464 -4476 -4354 -4232 -4170 -4108 -3956 -3964 -4014 -4065 -4044 -4024 -4123 -4222
1568 -4222 -4320 -4419 -4368 -4318 -4268 -4218 -4094 -3970 -3846 -3722 -3761 -3799 -3837 -3876 -3904 -3932 -3880 -3828 -3772 -3715 -3515 -3315 -3139 -2802 -2164 -1526 -894 -423
1565 -423 -82 98 -170 -706 -1101 -1497 -1905 -2313 -2640 -2968 -3169 -3369 -3560 -3751 -3896 -3880 -3874 -3869 -3805 -3741 -3757 -3773 -3632 -3491 -3537 -3583 -3570
1562c570J2o7o8kkjkp7p7LMj0j0J13J14L5j25l5l5L9L9m8k08j83k3O5O4J11J12k2k2R6R5J05
1558c580n6KKj8J42KKJ2J2k2k3k2k3k8k7k8k7L0L1J11J11L2L3L2L2J1J1J1J1l6l6l6l6K2K2
1554c324K1K2j7j6j7j7O4O3j6j7k6k7k7k6o8o7J2J3L3L2m7m8j7j6j07N3J45J45J46L05L74
1550b472L74O87R56Q27Q28N31J56j12l80l87l86l86l86l20j59J82N55Q31J097J211J372J298
1548E917P10j0n98j166j540j493j119q71p11m96l35j05N5l0k9J13J14Q4Q3Q3Q3L82L82L39
1545a58J77R3R2P3K33L31L31M09K48K9l45n82m21l97l96k52k53k86k86k42q2m2m3l3l2QPM8
1542a771M8J98J97J17J17R5R4R4R4L3L2P6K36P7P7K36K37N31P98J006J273J613J613J163L60
1539H644l95r83j521j521j112r51p28m61l78k19m1m1n6J04J4J4N6N7J36J37J25J25J65J66
$$ plain form
1562 -3570 -3558 -3625 -3693 -3695 -3697 -3698 -3700 -3777 -3854 -3851 -3847 -3857 -3867 -3754 -3640 -3605 -3730 -3765 -3800 -3761 -3722 -3770 -3978 -4161 -4184 -4119 -4055 -3944 -3832 -3854 -3876 -3780 -3685 -3580
1558 -3580 -3636 -3634 -3632 -3650 -3508 -3506 -3504 -3492 -3480 -3502 -3525 -3547 -3570 -3598 -3625 -3653 -3680 -3650 -3619 -3508 -3397 -3365 -3332 -3300 -3268 -3257 -3246 -3235 -3224 -3260 -3296 -3332 -3368 -3346 -3324
1554 -3324 -3303 -3281 -3298 -3314 -3331 -3348 -3284 -3221 -3237 -3254 -3280 -3307 -3334 -3360 -3428 -3495 -3483 -3470 -3437 -3405 -3452 -3500 -3517 -3533 -3640 -3587 -3442 -3297 -3151 -2846 -2472
1550 -2472 -2098 -1411 -455 372 1200 1731 1887 1775 1395 1008 622 236 -150 -470 -629 -447 108 939 2036 3247 4619 5917
1548 5917 6627 6617 6019 4853 3313 1820 701 -170 -881 -1377 -1712 -1817 -1762 -1792 -1821 -1708 -1594 -1510 -1427 -1344 -1261 -879 -497 -158
1545 -158 19 112 204 277 510 841 1172 1581 1829 1858 1513 931 510 113 -283 -535 -788 -1074 -1360 -1602 -1684 -1726 -1769 -1802 -1834 -1826 -1819 -1771
1542 -1771 -1723 -1525 -1328 -1211 -1094 -999 -905 -811 -717 -684 -652 -576 -340 -263 -186 50 287 818 1616 2622 3895 5508 7121 8284 8644
1539 8644 8249 7266 5745 4224 3112 2161 1433 972 594 375 334 293 237 341 355 369 425 482 618 755 880 1005 1170 1336
1536A336P0P1K04K05K43K42M17O84J068J549K027K028J429P35j58q52j190j030q59n92m28
1534G199m27k07m6N7N7p7p6j39l00m13n73n97n96o61l93k11N5L87L86M98O58O18M57M10M09
1531F475K12K12J42J41J71J71K16N5R5K56L13L12L66N26M90M90O33O34P23P24O00O00N18O79
1528A5754N08N08N65N65M95M95M91O52P48P49Q42Q43R22R22Q48Q47Q37R98J007J008J198J359
1526C3161J328R54J014J174J288J449J518J679J609J608J731J892K203K470K818L298L805
1524F4999M392M840N321N816O297O778P259P913Q821R603J0833J2416J4181J6560J9179K2037
1522B27245K4335K5666K6788K8107L1797L8573M9319O5595Q5964J13798J52985K10807L02494
1521A383473M37344O09117P77289R16771R93121R08063O75023L01595j41483n73400r69012
$$ plain form
1536 1336 1406 1477 1681 1886 2129 2371 2788 3472 4540 6089 8116 10144 11573 12308 12150 11298 10108 9078 8219 7627 7199
1534 7199 6772 6565 6519 6576 6633 6556 6480 6341 6041 5628 5055 4458 3862 3201 2808 2597 2652 3039 3425 3923 4581 5199 5656 6066 6475
1531 6475 6687 6899 7041 7182 7353 7524 7740 7795 7890 8146 8459 8771 9137 9663 10153 10643 11276 11910 12633 13357 13957 14557 15075 15754
1528 15754 16262 16770 17335 17900 18395 18890 19381 20033 20781 21530 22372 23215 24137 25059 25907 26754 27591 28589 29596 30604 31802 33161
1526 33161 34489 35443 36457 37631 38919 40368 41886 43565 45174 46782 48513 50405 52608 55078 57896 61194 64999
1524 64999 69391 74231 79552 85368 91665 98443 105702 113615 122436 132039 142872 155288 169469 186029 205208 227245
1522 227245 251580 277246 304034 332141 363938 402511 451830 517425 603389 717187 870172 1080979 1383473
1521 1383473 1820817 2429934 3207223 4123994 5117115 6025178 6700201 7001796 6860313 6286913 5317901
1519E317901j085612r70060q17642o30442m54501l18059k21454j57488j12955q2676o0917
1518D06095m5245l5463k9728k8072k7596k7007k5886k2837j9350j6088j3088j0896q978p749
1517H8112o666n651m942m247l572l091k571k303k146k147k340k607k901k902k799k639k402
1515C2186k242j827j560j379j112r76p09m41o7M71J272K496L939N177N658M896K598q08l855
1512D3717n899o702n982m752l702k794k230j748j320j053r04o36l68l69l54l54k73k74o7o8
1510C868p7p8J28l3j29j30k95k95k05k05l99k38j42j41L8L9P5L42M80M79P31Q90R60N86K5
1507F274n63j087j353j224j223r79p13m89k22L4L01N15P82Q80P21N60L99J91L0l3l01k90k91
1505A919k97k97j22L9J35J36J70J70m3k04m12n71m85l23j62J06L66L66M64M63L63j1l83o51
$$ plain form
1519 5317901 4232289 3262229 2444587 1814145 1359644 1041585 820131 662643 549688 467012 406095
1518 406095 360850 325387 295659 267587 239991 212984 187098 164261 144911 128823 115735 104839 95861 88112
1517 88112 81446 75795 70853 66606 63034 59943 57372 55069 52923 50776 48436 45829 42928 40026 37227 34588 32186
1515 32186 29944 28117 26557 25178 24066 23090 22381 21940 21873 22344 23616 26112 30051 35228 40886 45782 48380 47572 43717
1512 43717 37818 31116 25134 20382 16680 13886 11656 9908 8588 7535 6631 5995 5627 5258 4904 4550 4277 4003 3936 3868
1510 3868 3791 3713 3841 3808 3679 3549 3254 2959 2754 2549 2150 1912 1770 1629 1667 1706 1781 2123 2603 3082 3813 4703 5663 6249 6274
1507 6274 5711 4624 3271 2047 824 -155 -868 -1357 -1579 -1545 -1244 -729 53 933 1654 2214 2613 2804 2834 2801 2500 2210 1919
1505 1919 1622 1325 1203 1242 1377 1513 1683 1853 1810 1606 1194 623 138 -185 -347 -241 125 491 955 1418 1781 1770 1387 736
1502G36q53q54p05m36k93k93k11k10k30p0j0j71p0p0k4k5k5k5J7J7R7R7n6n6n6n6mmmmJ25
1498c726J24J25J25J96J96J97J96j6j5Q1K41K57K56M34N94P83J052J209J208N61k42p19j094
1496B023j346j186q85n12l37j77n7n7m2m2j75j76j50j50j51j50j78j79RRN7N7N8N7O5O5O6
1493c484O5K5K6J15J16J62L23L24L23O47Q07Q97J058J010O35J28l53o18p78o21m60l41l40
1490c34k08k07k27l88k98k97k42k41k32k31k53r3j03j02j00r9j00r9j50j49j60Jo7o8n8n7
1487d562N7N8k3k2j0j0O0O0J02n9j01j02o5o5o5o5Q2Q2j8J42L45J85O1K22K93K94m4l12l00
1484c780j39j13j13k22k22q9q8p3p3l2l3N0M9RRL8L7L8L8J1J2o9o8poP3P4L5L5m5m5q3q2q2
1480d956q3K7K6K6K6J8J8J7J8QPQQn4n3n3n3m9m8m8m9L4L4J15J14O4O4O4O4M2M2l9l8K7K8
$$ plain form
1502 736 -117 -971 -1676 -2112 -2405 -2698 -2909 -3119 -3349 -3419 -3429 -3600 -3670 -3740 -3764 -3789 -3814 -3839 -3822 -3805 -3708 -3611 -3667 -3723 -3779 -3835 -3839 -3843 -3847 -3851 -3726
1498 -3726 -3602 -3477 -3352 -3156 -2960 -2763 -2567 -2583 -2598 -2517 -2276 -2019 -1763 -1329 -735 48 1100 2309 3517 4078 3836 3117 2023
1496 2023 677 -509 -1394 -1906 -2243 -2420 -2477 -2534 -2576 -2618 -2793 -2969 -3119 -3269 -3420 -3570 -3748 -3927 -3918 -3909 -3852 -3795 -3737 -3680 -3615 -3550 -3484
1493 -3484 -3419 -3394 -3368 -3253 -3137 -2975 -2652 -2328 -2005 -1358 -551 346 1404 2414 3049 3177 2824 2206 1428 807 347 6 -334
1490 -334 -542 -749 -976 -1364 -1662 -1959 -2201 -2442 -2674 -2905 -3158 -3251 -3354 -3456 -3556 -3655 -3755 -3854 -4004 -4153 -4313 -4312 -4379 -4447 -4505 -4562
1487 -4562 -4505 -4447 -4470 -4492 -4502 -4512 -4452 -4392 -4290 -4349 -4450 -4552 -4617 -4682 -4747 -4812 -4730 -4648 -4666 -4524 -4179 -3994 -3933 -3711 -3418 -3124 -3168 -3480 -3780
1484 -3780 -3919 -4032 -4145 -4367 -4589 -4678 -4766 -4839 -4912 -4944 -4977 -4927 -4878 -4869 -4860 -4822 -4785 -4747 -4709 -4698 -4686 -4755 -4823 -4830 -4836 -4763 -4689 -4654 -4619 -4664 -4709 -4792 -4874 -4956
1480 -4956 -5039 -5012 -4986 -4960 -4934 -4916 -4898 -4881 -4863 -4855 -4848 -4840 -4832 -4886 -4939 -4992 -5045 -5094 -5142 -5190 -5239 -5205 -5171 -5056 -4942 -4878 -4814 -4750 -4686 -4644 -4602 -4641 -4679 -4652 -4624
1476d624j3j2l7l7R7R6Q0Q0M0M0j71j70r1r0r5r4n2J10L8L8N8j02j8j9j09j08r6r6L8L8J03
1472e178J03J3J73J07J07L8L7m7m6r7O4m2m1p2p2J3J2N3N3J01J01K1K1R3R3J43J43j16M5m5
1469d222m6N5N4k6k7opLj57j23j22KJj4j5j5j4K2K2R2R3J00o0n9J00N7N6K7K6J02J02K46K46
1465c507L82N42Q10J077J483J485J174O92n5o44r21r22o65p7O01J404K191K887L107K519J222
1463A4785o49k507l202l068k695k059j470r94p26m82m82k90j30q6q6p7p7q8q7J6j44n3n4J20
1460d585J20K9L0Q1q0p0o9k3k3o3o2m9m9J92J92J33J33K13K13K50K49M51Q24R70J129J097
1457A233Q30M08j80q41j215j199r33p32n72l24j64j65j64o9o9J2J1J32J31n5n6K0K1o0o0R5
1454c965R6R5R6L76L76P14P13P96O35L17j64o30p91q11q11m51m50j56j57j3j2O7O8k0j9j9
$$ plain form
1476 -4624 -4637 -4649 -4686 -4723 -4626 -4530 -4450 -4370 -4330 -4290 -4461 -4631 -4722 -4812 -4907 -5001 -5053 -4943 -4905 -4867 -4809 -4911 -4929 -4948 -5057 -5165 -5261 -5357 -5319 -5281 -5178
1472 -5178 -5075 -5062 -4889 -4782 -4675 -4637 -4600 -4647 -4693 -4790 -4726 -4768 -4809 -4881 -4953 -4940 -4928 -4875 -4822 -4721 -4620 -4599 -4578 -4485 -4392 -4249 -4106 -4222 -4177 -4222
1469 -4222 -4268 -4213 -4159 -4185 -4212 -4218 -4225 -4222 -4379 -4502 -4624 -4622 -4621 -4635 -4650 -4665 -4679 -4657 -4635 -4543 -4450 -4350 -4410 -4469 -4369 -4312 -4256 -4229 -4203 -4101 -3999 -3753 -3507
1465 -3507 -3125 -2583 -1773 -696 787 2272 3446 4138 4083 3439 2518 1596 931 854 1455 2859 5050 7937 11044 13563 14785
1463 14785 14136 11629 8427 5359 2664 605 -865 -1859 -2585 -3067 -3549 -3839 -3969 -4055 -4141 -4218 -4295 -4383 -4470 -4454 -4598 -4651 -4705 -4585
1460 -4585 -4465 -4436 -4406 -4325 -4405 -4475 -4544 -4567 -4590 -4653 -4715 -4764 -4813 -4621 -4429 -4296 -4163 -3950 -3737 -3487 -3238 -2787 -1963 -993 136 1233
1457 1233 2063 2471 2291 1450 235 -964 -1897 -2629 -3201 -3525 -3689 -3854 -4018 -4087 -4156 -4144 -4133 -4001 -3870 -3925 -3981 -3961 -3940 -4000 -4060 -3965
1454 -3965 -3869 -3774 -3678 -3302 -2926 -2212 -1499 -703 -68 249 85 -545 -1336 -2147 -2958 -3409 -3859 -4015 -4172 -4185 -4197 -4130 -4062 -4082 -4101 -4120
1451d120k0P6P5P5P6JKKKj3j3j4j3Q2Q2Q2Q2N9N9J93J93K69K70K79K80N23O83Q86J154J590
1448B882K285L421M758N861O555O061M083J099k162m782o225o069m946l737k400j458q70n36
1446C820o96q69j137j156r97p99o40m08k48k42k41j51j52j7j8r8r7o2o1j42j42k8k8k8k9l4
1443d700l4l5l4J%p9q0J8J7J8J8J4J4J4J5M8M8q6q5l6l5M4M5P7P6P7P7O6O7j4j3p0o9p0o9
1439d755r5r5M0L9p0o9j50j49L1L1L1L0K4K3K4K3L8L9R3J4K6J88J31N2Mp7l7l7J4J4j19j20
1435d864j9j9k0j9p3p2m8L3N2j08J8R8M7l3J7J7o2o1J9J8j7j7j7j7kkr7O3M1l9J6J5K6K6K6
1431e074K6O2O2j8j9j5j5j5j5J00J00q9rJ53pm6m6%%%%M6M7l3l4J6J5J6J5j6j6J59jj24m4
1427d819L5L5P5P5Q0Q0J2R3K17N8l3l3m3m3j01j00j01j01j02j02k1k2l0l1p0p1jjP9P9k4k3
$$ plain form
1451 -4120 -4140 -4064 -3989 -3914 -3838 -3837 -3835 -3833 -3831 -3844 -3857 -3871 -3884 -3802 -3720 -3638 -3556 -3497 -3438 -3245 -3052 -2783 -2513 -2234 -1954 -1431 -748 138 1292 2882
1448 2882 5167 8588 13346 19207 25762 31823 35906 37005 34843 30061 23836 17767 12821 9084 6684 5226 4356 3820
1446 3820 3124 2255 1118 -38 -1035 -1834 -2474 -2882 -3130 -3372 -3613 -3764 -3916 -3933 -3951 -4049 -4146 -4208 -4269 -4411 -4553 -4581 -4609 -4637 -4666 -4700
1443 -4700 -4734 -4769 -4803 -4802 -4802 -4881 -4961 -4943 -4926 -4908 -4890 -4876 -4862 -4848 -4833 -4785 -4737 -4823 -4908 -4944 -4979 -4935 -4890 -4813 -4737 -4660 -4583 -4517 -4450 -4464 -4477 -4547 -4616 -4686 -4755
1439 -4755 -4850 -4945 -4905 -4866 -4936 -5005 -5155 -5304 -5273 -5242 -5211 -5181 -5157 -5134 -5110 -5087 -5049 -5010 -4917 -4903 -4877 -4689 -4558 -4506 -4502 -4579 -4616 -4653 -4639 -4625 -4744 -4864
1435 -4864 -4883 -4902 -4922 -4941 -5014 -5086 -5134 -5101 -5049 -5157 -5139 -5041 -4994 -5027 -5010 -4993 -5055 -5116 -5097 -5079 -5096 -5113 -5130 -5147 -5149 -5151 -5248 -5185 -5144 -5183 -5167 -5152 -5126 -5100 -5074
1431 -5074 -5048 -4986 -4924 -4942 -4961 -4976 -4991 -5006 -5021 -4921 -4821 -4910 -4919 -4766 -4773 -4819 -4865 -4865 -4865 -4865 -4865 -4819 -4772 -4805 -4839 -4823 -4808 -4792 -4777 -4793 -4809 -4650 -4651 -4775 -4819
1427 -4819 -4784 -4749 -4674 -4599 -4519 -4439 -4427 -4334 -4117 -4059 -4092 -4125 -4168 -4211 -4312 -4412 -4513 -4614 -4716 -4818 -4839 -4861 -4891 -4922 -4992 -5063 -5064 -5065 -4986 -4907 -4931 -4954
1423d954k4k3rqrqNNNMM7M7q7q7L2L3L2L3m4m4R0R0m0m0q1q1rj0L1L0k5k5J5J5M2M1M2M2J0
1419d917J0J0J0J8J7k2k3O1O1k0j9m2m1jkn8n8K2K2R1R2N1N1%JL5L6kq2k01o7Oj27mmm0l9
1415e175%Jk6k5J4J5J5J4J5J4pppqK1K0k0k0N0M9l1l0n9n8K2K2M3M3l7l7J8J9N9N9p4p4O0
1410e122O0Q3Q3M3M3l3l3k3k3m5J15n6n6P3P2o1o1K0K0O0O0lkkkNNNNk4k5m5J15M4j17n6n7
1406d935J8J8k2k1m2m2K1K2J61j05l6l5J1J0J%K1j40rro7o7J3J3OOOOO3O4j7j7M0M0Q9p0R
1402d996J0M0L9M9M9l1l2MLM4M4m3m3l3l3j10N0M9j10N9N9M9M9j1j1j1j2rrQ0p9j8j8J06J06
1398d720m6m5m6m6Q8Q7m7m6n7n7k8k7Q7p3J7J7p2p2O1O1l9l9M1M1nnnnN0N0l1l0k9k9N1N1
1394d897j4j4j5j4k1k1N9N9m1m1L9M0k8k8k8k8P7P7P8P7LLKLK8K8n3n2MLMMl5l5k5k4j03N8
$$ plain form
1423 -4954 -4978 -5001 -5010 -5018 -5027 -5035 -5030 -5025 -5020 -5016 -4969 -4922 -5009 -5096 -5064 -5031 -4999 -4966 -5010 -5054 -4964 -4874 -4914 -4954 -5035 -5116 -5125 -5135 -5104 -5074 -5099 -5124 -5109 -5094 -5052 -5011 -4969 -4927 -4917
1419 -4917 -4907 -4897 -4887 -4869 -4852 -4874 -4897 -4836 -4775 -4795 -4814 -4856 -4897 -4898 -4900 -4958 -5016 -4994 -4972 -4881 -4789 -4738 -4687 -4687 -4686 -4651 -4615 -4617 -4699 -4900 -4967 -4961 -5088 -5092 -5096 -5136 -5175
1415 -5175 -5175 -5174 -5200 -5225 -5211 -5196 -5181 -5167 -5152 -5138 -5145 -5152 -5159 -5167 -5146 -5126 -5146 -5166 -5116 -5067 -5098 -5128 -5187 -5245 -5223 -5201 -5158 -5115 -5152 -5189 -5171 -5152 -5093 -5034 -5108 -5182 -5122
1410 -5122 -5062 -4979 -4896 -4853 -4810 -4843 -4876 -4899 -4922 -4967 -4852 -4908 -4964 -4891 -4819 -4880 -4941 -4921 -4901 -4841 -4781 -4784 -4786 -4788 -4790 -4785 -4780 -4775 -4770 -4794 -4819 -4864 -4749 -4705 -4822 -4878 -4935
1406 -4935 -4917 -4899 -4921 -4942 -4984 -5026 -5005 -4983 -4822 -4927 -4963 -4998 -4987 -4977 -4976 -4976 -4955 -5095 -5104 -5113 -5180 -5247 -5234 -5221 -5215 -5209 -5203 -5197 -5134 -5070 -5087 -5104 -5064 -5024 -4935 -5005 -4996
1402 -4996 -4986 -4946 -4907 -4858 -4809 -4840 -4872 -4868 -4865 -4821 -4777 -4820 -4863 -4896 -4929 -5039 -4989 -4940 -5050 -4991 -4932 -4883 -4834 -4845 -4856 -4867 -4879 -4888 -4897 -4817 -4896 -4914 -4932 -4826 -4720
1398 -4720 -4766 -4811 -4857 -4903 -4815 -4728 -4775 -4821 -4878 -4935 -4963 -4990 -4903 -4976 -4959 -4942 -5014 -5086 -5025 -4964 -5003 -5042 -5001 -4960 -4965 -4970 -4975 -4980 -4930 -4880 -4911 -4941 -4970 -4999 -4948 -4897
1394 -4897 -4911 -4925 -4940 -4954 -4975 -4996 -4937 -4878 -4919 -4960 -4921 -4881 -4909 -4937 -4965 -4993 -4916 -4839 -4761 -4684 -4681 -4678 -4676 -4673 -4645 -4617 -4670 -4722 -4718 -4715 -4711 -4707 -4742 -4777 -4802 -4826 -4929 -4871
1389d871N8j02k8k7l7l7Q6Q6NOrrj0rk9k9k8k9MNMNNNNNN0N0l1l0l8l8k8k8o8R2R2o8l4l3
1385e087L7L7N3N3m6J13J36k4M3j18j48J3L6L6%j60o0o0k5J36M5M6j0j1j0j0J4J5o6o5K8K7
1381e032K8K8L7L8L8L7k1k2J48j1j9j8k9k8j13j12K1K2OOOPL1L1L2L1p7p8N7N6QPQPM1M1l0
1377d818k9r4O6k5k4JJ%Jk8k7k8k8K7K8K7K7RRq1q2Q5p7p6Q4KKJ2J3R0R1J0J1k3k3k3k3PP
1372d899PPJ14J13p3p4n6n7n7n7j19j19k2J38Q2Q1M8j12M2M2L2L2j7j6O3O4p3p3QPL7L8m3
1369d912m3R0R0m4m4pppqPOOPM1M1m5k06LJ64O4O3l3l4l3l3p8p8J3J3p1Q9J30l1j8j7n8n7
1364e037r0P1J05J04l5j95o2R9M1M2k8k8l7l7M4M4N3N4k7k6M9N0l0l0L2L2pqk7k7k7k6J2J3
1361d939J2J3N9O0k1k0rrrql7l7l7l7j7j7j6j7K6K7K7K6o5o5J5J5l4l3k4k3m9J12L2L1o5R5
$$ plain form
1389 -4871 -4813 -4915 -4943 -4970 -5007 -5044 -4958 -4872 -4867 -4861 -4870 -4879 -4889 -4898 -4927 -4956 -4984 -5013 -5009 -5004 -5000 -4995 -4990 -4985 -4980 -4975 -4925 -4875 -4906 -4936 -4974 -5012 -5040 -5068 -5136 -5044 -4952 -5020 -5054 -5087
1385 -5087 -5050 -5013 -4960 -4907 -4953 -4840 -4704 -4728 -4685 -4803 -4951 -4938 -4902 -4866 -4866 -5026 -5086 -5146 -5171 -5035 -4990 -4944 -4954 -4965 -4975 -4985 -4971 -4956 -5022 -5087 -5059 -5032
1381 -5032 -5004 -4976 -4939 -4901 -4863 -4826 -4847 -4869 -4721 -4732 -4751 -4769 -4798 -4826 -4939 -5051 -5030 -5008 -5002 -4996 -4990 -4983 -4952 -4921 -4889 -4858 -4935 -5013 -4956 -4900 -4892 -4885 -4877 -4870 -4829 -4788 -4818
1377 -4818 -4847 -4941 -4875 -4900 -4924 -4923 -4922 -4922 -4921 -4949 -4976 -5004 -5032 -5005 -4977 -4950 -4923 -4914 -4905 -4986 -5068 -4983 -5060 -5136 -5052 -5050 -5048 -5036 -5023 -4933 -4842 -4832 -4821 -4844 -4867 -4890 -4913 -4906 -4899
1372 -4899 -4892 -4885 -4771 -4658 -4731 -4805 -4861 -4918 -4975 -5032 -5151 -5270 -5292 -5154 -5072 -4991 -4943 -5055 -5013 -4971 -4939 -4907 -4924 -4940 -4877 -4813 -4886 -4959 -4951 -4944 -4907 -4869 -4912
1369 -4912 -4955 -4865 -4775 -4819 -4863 -4870 -4877 -4884 -4892 -4885 -4879 -4873 -4866 -4825 -4784 -4829 -5035 -5032 -4868 -4804 -4741 -4774 -4808 -4841 -4874 -4952 -5030 -5017 -5004 -5075 -4986 -4856 -4887 -4905 -4922 -4980 -5037
1364 -5037 -5127 -5056 -4951 -4847 -4882 -5077 -5139 -5040 -4999 -4957 -4985 -5013 -5050 -5087 -5043 -4999 -4946 -4892 -4919 -4945 -4896 -4846 -4876 -4906 -4874 -4842 -4849 -4857 -4884 -4911 -4938 -4964 -4952 -4939
1361 -4939 -4927 -4914 -4855 -4795 -4816 -4836 -4845 -4854 -4863 -4871 -4908 -4945 -4982 -5019 -5036 -5053 -5069 -5086 -5060 -5033 -5006 -4980 -5045 -5110 -5095 -5080 -5114 -5147 -5171 -5194 -5243 -5131 -5099 -5068 -5133 -5038
1356e038NNnnnoL7L7L7L7L0L1n0n0M7M7l3l2PPlkM2j18j17M2J3J2o8R3L3L2J33k8p3p2N1N1
1352d876kjkjJ2J2J2J2l3l3M8M7m4m5j24j25N9N9k1k1lmlmM5M4NMm5m6Q8Q8m4m3lmL4L3op
1348d938r0r1M3M3J2J2J3J2l1l2l1l1N1N2j36j36N5N5J4J5L1L2P1P2M5M5l6l5N9N9O0N9p0
1344d747o9p0o9l2l2p2p2M2M1l8l9M9M8M9M8LMl7l7N1N1k9l0K8K8K8K8o9o9J1J2l3l2l2l2
1340e119j0j0P1P0m1m2jjj8j7O3O3k3k3k2k3j3j2j3j3k1k2M8M9J14m7M3M4L1L2L1L1l3l4l4
1336d902l4llp3p3r4O7k3k3J14J14k0k0k8k8P2q8l1J29K9L0k1k1k1k1j2j2j3j2l2l2l2l3j5
1332e165j5j6j5O0O0p4p4O9O9O8O9m8m9j38K2O4O5ook1k1k1k0mnmmJ6J6J6J6JJJJK1K2K1K1
1327e007L1L1L1L1K0J9j04j04p8Q2qqJ9J8J9J9RJ0Q9R0LLLKp5p5MNo5o5J4J5K6K6K5K6l8l8
$$ plain form
1356 -5038 -5033 -5028 -5033 -5038 -5043 -5049 -5012 -4975 -4938 -4901 -4871 -4840 -4890 -4940 -4893 -4846 -4879 -4911 -4904 -4897 -4900 -4902 -4860 -4978 -5095 -5053 -5040 -5028 -5096 -5003 -4970 -4938 -4805 -4833 -4906 -4978 -4927 -4876
1352 -4876 -4878 -4879 -4881 -4882 -4870 -4858 -4846 -4834 -4867 -4900 -4852 -4805 -4849 -4894 -5018 -5143 -5084 -5025 -5046 -5067 -5070 -5074 -5077 -5081 -5036 -4992 -4987 -4983 -5028 -5074 -4986 -4898 -4942 -4985 -4988 -4992 -4958 -4925 -4931 -4938
1348 -4938 -5028 -5119 -5076 -5033 -5021 -5009 -4996 -4984 -5015 -5047 -5078 -5109 -5058 -5006 -5142 -5278 -5223 -5168 -5154 -5139 -5108 -5076 -5005 -4933 -4888 -4843 -4879 -4914 -4855 -4796 -4736 -4677 -4747
1344 -4747 -4816 -4886 -4955 -4987 -5019 -5091 -5163 -5121 -5080 -5118 -5157 -5108 -5060 -5011 -4963 -4960 -4956 -4993 -5030 -4979 -4928 -4957 -4987 -4959 -4931 -4903 -4875 -4944 -5013 -5002 -4990 -5023 -5055 -5087 -5119
1340 -5119 -5129 -5139 -5068 -4998 -5039 -5081 -5082 -5083 -5101 -5118 -5055 -4992 -5015 -5038 -5060 -5083 -5096 -5108 -5121 -5134 -5155 -5177 -5129 -5080 -4966 -5013 -4970 -4926 -4895 -4863 -4832 -4801 -4834 -4868 -4902
1336 -4902 -4936 -4939 -4942 -5015 -5088 -5182 -5115 -5138 -5161 -5047 -4933 -4953 -4973 -5001 -5029 -4957 -5045 -5076 -4947 -4918 -4888 -4909 -4930 -4951 -4972 -4984 -4996 -5009 -5021 -5053 -5085 -5117 -5150 -5165
1332 -5165 -5180 -5196 -5211 -5151 -5091 -5165 -5239 -5170 -5101 -5033 -4964 -5012 -5061 -5199 -5177 -5113 -5048 -5054 -5060 -5081 -5102 -5123 -5143 -5147 -5152 -5156 -5160 -5144 -5128 -5112 -5096 -5095 -5094 -5093 -5092 -5071 -5049 -5028 -5007
1327 -5007 -4976 -4945 -4914 -4883 -4863 -4844 -4948 -5052 -5130 -5048 -5056 -5064 -5045 -5027 -5008 -4989 -4980 -4970 -4881 -4791 -4788 -4785 -4782 -4780 -4855 -4930 -4926 -4921 -4986 -5051 -5037 -5022 -4996 -4970 -4945 -4919 -4957 -4995
1323d995l7l8n2n1K8K9J7J7J7J7j7j6j6j7J7J7J7J7l0l0j26L5N0l0K5K5J8J8J8J8jkkkK6K6
1319e010K6K6k1k1k1k0j0j0rj0mnK1J00qj68J4J74P3q6q7P4M4j16o1J9K4K4L4L4j3O7J07n3
1315d872k2j02p6Q4j9j8j8j8J00o0j40K1J16J17o0o1O0O0k0k0M3M2l7l7PQm7L2R7o4L2L1l8
1311d879l9l8l9LMMLk5k5k4k5R7R8l6l6L7L8m3m3j7j8j7j8k9l0N1N1p8p9KKmnnnj2j1j03N9
1307e234J53J54P3P4M3j16j7j6j17M4m7m6k5k4N6N6M4M4L4L4M0j20k9l0m7m6L4L3j8j9O1O1
1303d913JJKJj2j3j2j2o7o8O7O6oopon3n3K8K7L7L8L7L7j7j8j8j8k8k9j9j9j51J0N3N3K9K9
1299e029L0K9J09J10p8p8K3K3K2K3l6l6l6l6j0j0j1j0L7L6L7L6k3k2k3k3lkllJ7J7J7J7q8
1295d977q9qqK2K2K2K2PPOPK4K4K4K3j06j07K7K7L8L7r7r6M5M6M5M5j40j41M6M6M2M1M1M2
$$ plain form
1323 -4995 -5032 -5070 -5122 -5173 -5145 -5116 -5099 -5082 -5065 -5048 -5065 -5081 -5097 -5114 -5097 -5080 -5063 -5046 -5076 -5106 -5232 -5197 -5147 -5177 -5152 -5127 -5109 -5091 -5073 -5055 -5056 -5058 -5060 -5062 -5036 -5010
1319 -5010 -4984 -4958 -4979 -5000 -5021 -5041 -5051 -5061 -5070 -5080 -5084 -5089 -5068 -4968 -4976 -5144 -5130 -4956 -4883 -4969 -5056 -4982 -4938 -5054 -5115 -5096 -5072 -5048 -5014 -4980 -4993 -4926 -4819 -4872
1315 -4872 -4894 -4996 -5072 -4988 -5007 -5025 -5043 -5061 -4961 -5021 -5161 -5140 -5024 -4907 -4967 -5028 -4968 -4908 -4928 -4948 -4905 -4863 -4900 -4937 -4930 -4922 -4969 -4937 -4840 -4904 -4872 -4841 -4879
1311 -4879 -4918 -4956 -4995 -4992 -4988 -4984 -4981 -5006 -5031 -5055 -5080 -4983 -4885 -4921 -4957 -4920 -4882 -4925 -4968 -4985 -5003 -5020 -5038 -5067 -5097 -5046 -4995 -5073 -5152 -5150 -5148 -5152 -5157 -5162 -5167 -5179 -5190 -5293 -5234
1307 -5234 -5081 -4927 -4854 -4780 -4737 -4853 -4870 -4886 -5003 -4959 -5006 -5052 -5077 -5101 -5045 -4989 -4945 -4901 -4867 -4833 -4793 -4913 -4942 -4972 -5019 -5065 -5031 -4998 -5016 -5035 -4974 -4913
1303 -4913 -4912 -4911 -4909 -4908 -4920 -4933 -4945 -4957 -5024 -5092 -5025 -4959 -4965 -4971 -4978 -4984 -5037 -5090 -5062 -5035 -4998 -4960 -4923 -4886 -4903 -4921 -4939 -4957 -4985 -5014 -5033 -5052 -5203 -5193 -5140 -5087 -5058 -5029
1299 -5029 -4999 -4970 -4861 -4751 -4829 -4907 -4884 -4861 -4839 -4816 -4852 -4888 -4924 -4960 -4970 -4980 -4991 -5001 -4964 -4928 -4891 -4855 -4878 -4900 -4923 -4946 -4949 -4951 -4954 -4957 -4940 -4923 -4906 -4889 -4977
1295 -4977 -5066 -5074 -5082 -5060 -5038 -5016 -4994 -4987 -4980 -4974 -4967 -4943 -4919 -4895 -4872 -4978 -5085 -5058 -5031 -4993 -4956 -5053 -5149 -5104 -5058 -5013 -4968 -5108 -5249 -5203 -5157 -5115 -5074 -5033 -4991
1291d991klkkL1L2L1L1LLKLj8j7j7j8k0k1k1k1P7P6mmo8o8J3J3M9M9l1l0M1M2l9l8M1M2l9
1286d895l8n4n4K6K7k4k4k3k4KKLKP3P2pqk8k9N2N2n8n8n9n8M3M3M2M3MNMMQ0Q0%%K8K8j05
1282d831j06o4o5O9P0K4K4K4K4L0L0j04j04J8J9J8J8j0j0j0j0J0J0p1p0R2R2J1J2POq3P7L0
1278d823L0r4r4llP6P7k9l0O1j00K4K3J4J4K4K4o6o6M9j11k1k1j1j2jjj27L4K4K4M6M6L7L6
1274d950J38k2o6o6r2r2jkm0J21L0L0k3k2l3J28N3N2O3O3n2n2n1n2K3K4o7R4p3p3QQJ47j2
1270d859n6n6M5M5M6M5nnnnr1r1j1j1J8J8o3o3R2R2J2J2J0J0J1J0ooJ64Mj43j43L4L4qqqq
1266d949l6l7M4M4k4k4N6N6k6k6k6k5m2m2L9L9QRQRJ9J9n5n6l1M9Q8m5o1P2P0o5m5L4j9j9
1262d990J2J3J2J3q8q7M6M6J3J4o7o7K0K1K0K0L0L0L1L0J0J0J0J1k5k4j6j7n4P9Q4Q4K9K9
$$ plain form
1291 -4991 -4993 -4996 -4998 -5000 -4969 -4937 -4906 -4875 -4872 -4869 -4867 -4864 -4882 -4899 -4916 -4934 -4954 -4975 -4996 -5017 -4940 -4864 -4868 -4872 -4940 -5008 -4995 -4982 -4933 -4884 -4915 -4945 -4904 -4862 -4901 -4939 -4898 -4856 -4895
1286 -4895 -4933 -4987 -5041 -5015 -4988 -5012 -5036 -5059 -5083 -5081 -5079 -5076 -5074 -5001 -4929 -4936 -4944 -4972 -5001 -4949 -4897 -4955 -5013 -5072 -5130 -5087 -5044 -5002 -4959 -4955 -4950 -4946 -4942 -4862 -4782 -4782 -4782 -4754 -4726 -4831
1282 -4831 -4937 -5001 -5066 -4997 -4927 -4903 -4879 -4855 -4831 -4801 -4771 -4875 -4979 -4961 -4942 -4924 -4906 -4916 -4926 -4936 -4946 -4936 -4926 -4997 -5067 -4975 -4883 -4872 -4860 -4853 -4847 -4930 -4853 -4823
1278 -4823 -4793 -4887 -4981 -4984 -4987 -4911 -4834 -4863 -4893 -4832 -4932 -4908 -4885 -4871 -4857 -4833 -4809 -4875 -4941 -4892 -5003 -5024 -5045 -5056 -5068 -5069 -5070 -5197 -5163 -5139 -5115 -5069 -5023 -4986 -4950
1274 -4950 -4812 -4834 -4900 -4966 -5058 -5150 -5151 -5153 -5193 -5072 -5042 -5012 -5035 -5057 -5090 -4962 -4909 -4857 -4794 -4731 -4783 -4835 -4886 -4938 -4915 -4891 -4958 -4864 -4937 -5010 -5002 -4994 -4847 -4859
1270 -4859 -4915 -4971 -4926 -4881 -4835 -4790 -4795 -4800 -4805 -4810 -4901 -4992 -5003 -5014 -4996 -4978 -5041 -5104 -5012 -4920 -4908 -4896 -4886 -4876 -4865 -4855 -4861 -4867 -4703 -4699 -4842 -4985 -4951 -4917 -4925 -4933 -4941 -4949
1266 -4949 -4985 -5022 -4978 -4934 -4958 -4982 -4926 -4870 -4896 -4922 -4948 -4973 -5015 -5057 -5018 -4979 -4971 -4962 -4954 -4945 -4926 -4907 -4962 -5018 -5049 -5000 -4912 -4957 -5018 -4946 -4876 -4941 -4986 -4952 -4971 -4990
1262 -4990 -4978 -4965 -4953 -4940 -5028 -5115 -5069 -5023 -5010 -4996 -5063 -5130 -5110 -5089 -5069 -5049 -5019 -4989 -4958 -4928 -4918 -4908 -4898 -4887 -4912 -4936 -4952 -4969 -5023 -4944 -4860 -4776 -4747 -4718
1258d718n1n1J5J6R1m3o1o1J1J1n4n4mJ30O7o7l3M7Rp1k2k1J9J8o1o2jkjkk8k8N2N1p6p7p2
1253e184O2L8L9N1N2p9KL2j02j4j3O3O3j5O5K0j14J5R4l9l9K6K7K6K6onooO8O8j2j3L4L4m6
1249d788m6nnOj55M2M2L2L2K7K7K7K7k3k4k3k3j4j3j3j4J%%%K1K0K0K1o5o5n4n5j5J46J46
1245d763j5J3J3LLl9l8k9k9j33K6J7J7M2M2M2M2o2o2o3o2M3M2M3M3p7p7LMN0N0N0N0m9m8L1
1241d877L2J1J2o9o8pppoQ8Q9QQr4r3L0L0J58jj36K5l6l6k5k6M7M8M8M7llJ30J31p2p2p2p1
1237d839k3k3k2k3qpP2P3l0k9l9m0K8j33j33K7O8O8klRJ0RJ0L3L4L3L4k7k6k7k6M2M2M3M2
1233d783q0p9N4N4j7j7j7j7K6K7n4n4K7K6K7K7LLLLQ0P9n5n4k6k6k6k6J0J0J1J0j8j8j9j8
1229d924l2l1M8M8m2m2L9L8l1l0l1l0l7l8M3M3O5O4O4O5O1O1j27j26MMLMm7m6m7m6P3P3pq
$$ plain form
1258 -4718 -4769 -4820 -4805 -4789 -4698 -4741 -4802 -4863 -4852 -4841 -4895 -4949 -4953 -4823 -4756 -4823 -4856 -4809 -4800 -4871 -4893 -4914 -4895 -4877 -4938 -5000 -5001 -5003 -5004 -5006 -5034 -5062 -5010 -4959 -5035 -5112 -5184
1253 -5184 -5122 -5084 -5045 -4994 -4942 -5021 -5019 -4987 -5089 -5103 -5116 -5053 -4990 -5005 -4940 -4920 -5034 -5019 -4925 -4964 -5003 -4977 -4950 -4924 -4898 -4904 -4909 -4915 -4921 -4853 -4785 -4797 -4810 -4776 -4742 -4788
1249 -4788 -4834 -4839 -4844 -4838 -4993 -4951 -4909 -4877 -4845 -4818 -4791 -4764 -4737 -4760 -4784 -4807 -4830 -4844 -4857 -4870 -4884 -4883 -4883 -4883 -4883 -4862 -4842 -4822 -4801 -4866 -4931 -4985 -5040 -5055 -4909 -4763
1245 -4763 -4778 -4765 -4752 -4749 -4746 -4785 -4823 -4852 -4881 -5014 -4988 -4971 -4954 -4912 -4870 -4828 -4786 -4848 -4910 -4973 -5035 -4992 -4950 -4907 -4864 -4941 -5018 -5015 -5011 -4961 -4911 -4861 -4811 -4860 -4908 -4877
1241 -4877 -4845 -4834 -4822 -4891 -4959 -4966 -4973 -4980 -4986 -4898 -4809 -4801 -4793 -4887 -4980 -4950 -4920 -4762 -4763 -4899 -4874 -4910 -4946 -4971 -4997 -4950 -4902 -4854 -4807 -4810 -4813 -4683 -4552 -4624 -4696 -4768 -4839
1237 -4839 -4862 -4885 -4907 -4930 -4938 -4945 -4873 -4800 -4830 -4859 -4898 -4938 -4910 -5043 -5176 -5149 -5081 -5013 -5015 -5018 -5009 -4999 -4990 -4980 -4947 -4913 -4880 -4846 -4873 -4899 -4926 -4952 -4910 -4868 -4825 -4783
1233 -4783 -4863 -4942 -4888 -4834 -4851 -4868 -4885 -4902 -4876 -4849 -4903 -4957 -4930 -4904 -4877 -4850 -4847 -4844 -4841 -4838 -4758 -4679 -4734 -4788 -4814 -4840 -4866 -4892 -4882 -4872 -4861 -4851 -4869 -4887 -4906 -4924
1229 -4924 -4956 -4987 -4939 -4891 -4933 -4975 -4936 -4898 -4929 -4959 -4990 -5020 -5057 -5095 -5052 -5009 -4944 -4880 -4816 -4751 -4690 -4629 -4756 -4882 -4878 -4874 -4871 -4867 -4914 -4960 -5007 -5053 -4980 -4907 -4914 -4922
1224d922K8K8n2n2p0o9J1J0M8M8M7M8K3K3K3K3o0o1K0K0K1K1n9n9L1L1m9m9j1j2O8O8M5M5
1221d795l5l5J11J12j17M3Qp2j8j7LLQQo8J3O8r3o5R4nol4l4l4l4m3m3R1R0%J%%l1l2M9M9
1216d860k5k4k5k5j9j8O1O1j4j3O6O6n9n9K1K1lmmml7l6L9L8K4n7j11M8Q4p6n7n7J34J34j01
1212d891j02K4J03J59jn3J07k8j08l0l0M5M5j27j26OPJ4J5J4J4lklkl1l0J03J04RJ0J0J0M1
1208d727M2r2r2J2J2J1J2j8j8r8r8L4L4L3L4OOm9L1N3j08j03N8K2K2L2L2P8P7lln2n1n2n2
1204d975J7J6J7J7K2K2K2K2lllln6n6P7P8m3m3L8L7k9l0l0k9QRRQK0J9J9J9P4P5o0n9m5m5
1200d867m5m5K5K6K5K5l4l5M6M6J1J1J1J0ooooK7K7K7K7J9J8J8J8j5j5j5j6n6n6n6n6k3k2
1196d963k3k3K6K6K5K6p4p5N9N9M3M3l8l7L6L5L6L6M1M1M1M1o4o4o5o4R6R6J5J6p2p1RQjk
$$ plain form
1224 -4922 -4894 -4866 -4918 -4970 -5040 -5109 -5098 -5088 -5040 -4992 -4945 -4897 -4874 -4851 -4828 -4805 -4865 -4926 -4906 -4886 -4865 -4844 -4903 -4962 -4931 -4900 -4949 -4998 -5009 -5021 -4953 -4885 -4840 -4795
1221 -4795 -4830 -4865 -4754 -4642 -4759 -4716 -4708 -4780 -4798 -4815 -4812 -4809 -4801 -4793 -4861 -4848 -4780 -4873 -4938 -4844 -4849 -4855 -4889 -4923 -4957 -4991 -5034 -5077 -4986 -4896 -4896 -4895 -4895 -4895 -4926 -4958 -4909 -4860
1216 -4860 -4885 -4909 -4934 -4959 -4978 -4996 -4935 -4874 -4888 -4901 -4835 -4769 -4828 -4887 -4866 -4845 -4848 -4852 -4856 -4860 -4897 -4933 -4894 -4856 -4832 -4889 -5000 -4952 -4868 -4944 -5001 -5058 -4924 -4790 -4891
1212 -4891 -4993 -4969 -4866 -4707 -4708 -4761 -4654 -4682 -4790 -4820 -4850 -4805 -4760 -4887 -5013 -5007 -5000 -4986 -4971 -4957 -4943 -4946 -4948 -4951 -4953 -4984 -5014 -4911 -4807 -4798 -4788 -4778 -4768 -4727
1208 -4727 -4685 -4777 -4869 -4857 -4845 -4834 -4822 -4840 -4858 -4956 -5054 -5020 -4986 -4953 -4919 -4913 -4907 -4956 -4925 -4872 -4980 -5083 -5025 -5003 -4981 -4949 -4917 -4839 -4762 -4765 -4768 -4820 -4871 -4923 -4975
1204 -4975 -4958 -4942 -4925 -4908 -4886 -4864 -4842 -4820 -4823 -4826 -4829 -4832 -4888 -4944 -4867 -4789 -4832 -4875 -4837 -4800 -4829 -4859 -4889 -4918 -4910 -4901 -4892 -4884 -4864 -4845 -4826 -4807 -4733 -4658 -4718 -4777 -4822 -4867
1200 -4867 -4912 -4957 -4932 -4906 -4881 -4856 -4890 -4925 -4879 -4833 -4822 -4811 -4800 -4790 -4796 -4802 -4808 -4814 -4787 -4760 -4733 -4706 -4687 -4669 -4651 -4633 -4648 -4663 -4678 -4694 -4750 -4806 -4862 -4918 -4941 -4963
1196 -4963 -4986 -5009 -4983 -4957 -4932 -4906 -4980 -5055 -4996 -4937 -4894 -4851 -4889 -4926 -4890 -4855 -4819 -4783 -4742 -4701 -4660 -4619 -4683 -4747 -4812 -4876 -4780 -4684 -4669 -4653 -4725 -4796 -4787 -4779 -4780 -4782
1192d782kjnnnnM8M9q5q5K3K4K3K3K7K6K7K6kkq2q3J8J7J7J7M6M5L7L8K6j07l2l2OOOPj5j5
1187d763k0k0J0p0k5J09J09K8j05j05M2M2M2M1P5P5J08p9p8N7l1l0l6l6l6l6k5k6k6k6k9k9
1184d893k9k9l1l1J03J02J9J9J8J9PPPPp7p7p7p7O0O0k0k1k3k4N7N7P6P7mll4l4M6M6J6J6
1179d665J6J6m1m2m1m2M9M9q5q5N5N5k5k5rqlmm9L1O1p3mmq8M6N4N4O2O2J0J1J0J0j8j8r8
1175d776r8K0K0K1K0K0K0K0K0P7P6lmO2O2p2p2J3J3J4J3poq7q7qrP2P2k7k7N3N3l2l3M8M8
1171d511n7n8n8n7ooooj1j1j1j2Q4Q4m9n0J1J1J2J1j7j7j7j8K9K8K8K8J3J4J3J3K6K6n5n4
1167d656K4K5K4K4k4k5k4k5rj0rrL5L5m5m6L4L3L3L4j%j%M5M4l5l6m2m3m2m3M0L9M0L9OPO
1162d558PL1L2m9m9opj6j6Q9p2J9J8l8l8l9l8k3k3N6N7J4J3J3J3l1l2M8M8n2n2K8K8j2j2j2
$$ plain form
1192 -4782 -4784 -4785 -4790 -4795 -4800 -4805 -4757 -4708 -4793 -4878 -4855 -4831 -4808 -4785 -4758 -4732 -4705 -4679 -4681 -4683 -4765 -4848 -4830 -4813 -4796 -4779 -4733 -4688 -4651 -4613 -4587 -4694 -4726 -4758 -4752 -4746 -4740 -4733 -4748 -4763
1187 -4763 -4783 -4803 -4793 -4863 -4888 -4779 -4670 -4642 -4747 -4852 -4810 -4768 -4726 -4685 -4610 -4535 -4427 -4506 -4584 -4527 -4558 -4588 -4624 -4660 -4696 -4732 -4757 -4783 -4809 -4835 -4864 -4893
1184 -4893 -4922 -4951 -4982 -5013 -4910 -4808 -4789 -4770 -4752 -4733 -4726 -4719 -4712 -4705 -4782 -4859 -4936 -5013 -4953 -4893 -4913 -4934 -4957 -4981 -4924 -4867 -4791 -4714 -4718 -4721 -4755 -4789 -4743 -4697 -4681 -4665
1179 -4665 -4649 -4633 -4674 -4716 -4757 -4799 -4750 -4701 -4786 -4871 -4816 -4761 -4786 -4811 -4820 -4828 -4831 -4835 -4884 -4853 -4792 -4865 -4869 -4873 -4961 -4915 -4861 -4807 -4745 -4683 -4673 -4662 -4652 -4642 -4660 -4678 -4776
1175 -4776 -4874 -4854 -4834 -4813 -4793 -4773 -4753 -4733 -4713 -4636 -4560 -4563 -4567 -4505 -4443 -4515 -4587 -4574 -4561 -4547 -4534 -4541 -4547 -4634 -4721 -4729 -4738 -4666 -4594 -4621 -4648 -4595 -4542 -4574 -4607 -4559 -4511
1171 -4511 -4568 -4626 -4684 -4741 -4747 -4753 -4759 -4765 -4776 -4787 -4798 -4810 -4726 -4642 -4691 -4741 -4730 -4719 -4707 -4696 -4713 -4730 -4747 -4765 -4736 -4708 -4680 -4652 -4639 -4625 -4612 -4599 -4573 -4547 -4602 -4656
1167 -4656 -4632 -4607 -4583 -4559 -4583 -4608 -4632 -4657 -4666 -4676 -4685 -4694 -4659 -4624 -4669 -4715 -4681 -4648 -4615 -4581 -4582 -4582 -4583 -4583 -4538 -4494 -4529 -4565 -4607 -4650 -4692 -4735 -4695 -4656 -4616 -4577 -4571 -4564 -4558
1162 -4558 -4551 -4520 -4488 -4537 -4586 -4592 -4599 -4615 -4631 -4542 -4614 -4595 -4577 -4615 -4653 -4692 -4730 -4753 -4776 -4720 -4663 -4649 -4636 -4623 -4610 -4641 -4673 -4625 -4577 -4629 -4681 -4653 -4625 -4637 -4649 -4661
1158d661j2K5K4K4K4MMMNmmmml7l7M3M3P2P1o2o1k5k4J6J6O8O9N8N8L8j23M8M7Q5Q4J75J75
1154c778J54L15L49L48J44j7j83l44l76l76k89j28o8o8n8n8k7k6k6k6PPR8o3opj6j6k9l0k9
1151d622k9j0rrj0l6l7l6l7O3O4O4O3K7K7K7K7J18J17j6j7MNP4P5J23l6J03J04L3J93J94M60
1147b939O26O25O28M68K17j57l75n35n45n45m22m21k40k40j59j59n1n1n1n1o4o4J6J6j4j4
1144d501j4j4K8K8n2n2l3l2J00J01n9o0j9k0O3O4j7j7m0l9M0M1K8K8O8O9j5j4j5j4Q2Q3M2
1140d162M2M5M4K31K32L47L46L70L71K33l5k38l98m97l37j96j96j10j09p0o9n5n6j5j5k7k8
1137d352o7o8o4o5k5k5M9M9M9M9KJp8p9J6J7R6R7o2o2o2o2l0l0N0N0K5K5j5j5N1N2J1J1lk
1133d466kkJ3J3J4J3QRQQL1L0J10J11NNONJ5J5J6J5p2p2p1p2j3j3j3j3l4l3J2R2p1Q9R4o6
$$ plain form
1158 -4661 -4673 -4648 -4624 -4600 -4576 -4572 -4568 -4564 -4559 -4563 -4567 -4571 -4575 -4612 -4649 -4606 -4563 -4491 -4420 -4482 -4543 -4568 -4592 -4576 -4560 -4492 -4423 -4365 -4307 -4269 -4392 -4344 -4297 -4212 -4128 -3953 -3778
1154 -3778 -3624 -3309 -2960 -2612 -2468 -2485 -2668 -3012 -3388 -3764 -4053 -4181 -4249 -4317 -4375 -4433 -4460 -4486 -4512 -4538 -4531 -4524 -4426 -4489 -4495 -4502 -4518 -4534 -4563 -4593 -4622
1151 -4622 -4651 -4661 -4670 -4679 -4689 -4725 -4762 -4798 -4835 -4772 -4708 -4644 -4581 -4554 -4527 -4500 -4473 -4355 -4238 -4254 -4271 -4267 -4262 -4188 -4113 -3990 -4026 -3923 -3819 -3786 -3593 -3399 -2939
1147 -2939 -2313 -1688 -1060 -592 -375 -532 -907 -1442 -1987 -2532 -2954 -3375 -3615 -3855 -4014 -4173 -4224 -4275 -4326 -4377 -4441 -4505 -4489 -4473 -4487 -4501
1144 -4501 -4515 -4529 -4501 -4473 -4525 -4577 -4610 -4642 -4542 -4441 -4500 -4560 -4579 -4599 -4536 -4472 -4489 -4506 -4546 -4585 -4545 -4504 -4476 -4448 -4380 -4311 -4326 -4340 -4355 -4369 -4287 -4204 -4162
1140 -4162 -4120 -4075 -4031 -3800 -3568 -3221 -2875 -2505 -2134 -1901 -1936 -2174 -2572 -3069 -3406 -3602 -3798 -3908 -4017 -4087 -4156 -4211 -4267 -4282 -4297 -4324 -4352
1137 -4352 -4419 -4487 -4551 -4616 -4641 -4666 -4617 -4568 -4519 -4470 -4468 -4467 -4545 -4624 -4608 -4591 -4495 -4398 -4460 -4522 -4584 -4646 -4676 -4706 -4656 -4606 -4581 -4556 -4571 -4586 -4535 -4483 -4472 -4461 -4464 -4466
1133 -4466 -4468 -4470 -4457 -4444 -4430 -4417 -4409 -4400 -4392 -4384 -4353 -4323 -4213 -4102 -4097 -4092 -4086 -4081 -4066 -4051 -4035 -4020 -4092 -4164 -4235 -4307 -4320 -4333 -4346 -4359 -4393 -4426 -4414 -4322 -4393 -4304 -4210 -4276
1128d276q4q5KJ63MMR4R4JJN5k4j7J44J29J29J86J85J86J86J58J59J16m5j10j10m0m0j17j18
1125c070j97j98n1n0j41K0LKJ3J3J40J40N0M9J77J7K7K7llq4q3p4p4j55j54m6m6m6m5q9q9
1121d020M5M5M3M4M3M3L4L3L3L3Q0Q0Q0Q0K06K06J71K51K84M44N47N47M69M69M60M59L65K04
1118A778j6j77l18l17m08m08m27m27m98m98l09j48LKJ55J54K35K34J17J18J07J07J06n5j52
1115a042j51k84k84k13k14k08l69k79k79j08j09k8k9n2n1J35J35L4L3L4L3J7J6J7J7J14J15
1112c000J95J95K06K07K50M10N45N45M74M74M45M44L92K30J43j9k85k86m39m39m66o25n48
1110i52k80k44k44j55NJ02J03K10K11J10K70K53R2R5o5j71j70l68l67l03l02l02l03k40k41
1107c256j61j60p9p9KJo3o4J7J6J09J08K8K9N7N7N7N8n2n1Q2Q3M6M6J27J27J76J77J77J77
$$ plain form
1128 -4276 -4360 -4445 -4443 -4280 -4276 -4272 -4178 -4084 -4083 -4082 -4027 -4051 -4068 -3924 -3795 -3666 -3480 -3295 -3109 -2923 -2765 -2606 -2490 -2535 -2645 -2755 -2795 -2835 -2952 -3070
1125 -3070 -3267 -3465 -3516 -3566 -3707 -3687 -3684 -3682 -3669 -3656 -3516 -3376 -3326 -3277 -3100 -3083 -3056 -3029 -3032 -3035 -3119 -3202 -3276 -3350 -3505 -3659 -3705 -3751 -3797 -3842 -3931 -4020
1121 -4020 -3975 -3930 -3887 -3843 -3800 -3757 -3723 -3690 -3657 -3624 -3544 -3464 -3384 -3304 -3098 -2892 -2721 -2470 -2186 -1742 -1195 -648 -179 290 750 1209 1574 1778
1118 1778 1762 1585 1267 950 542 134 -293 -720 -1218 -1716 -2025 -2173 -2170 -2168 -2013 -1859 -1624 -1390 -1273 -1155 -1048 -941 -835 -890 -1042
1115 -1042 -1193 -1477 -1761 -1974 -2188 -2396 -2765 -3044 -3323 -3431 -3540 -3568 -3597 -3649 -3700 -3565 -3430 -3396 -3363 -3329 -3296 -3279 -3263 -3246 -3229 -3115 -3000
1112 -3000 -2805 -2610 -2404 -2197 -1947 -1537 -992 -447 27 501 946 1390 1782 2012 2155 2136 1851 1565 1126 687 221 -404 -952
1110 -952 -1232 -1476 -1720 -1875 -1870 -1768 -1665 -1455 -1244 -1134 -864 -611 -519 -424 -489 -660 -830 -1198 -1565 -1868 -2170 -2472 -2775 -3015 -3256
1107 -3256 -3417 -3577 -3656 -3735 -3733 -3732 -3795 -3859 -3842 -3826 -3717 -3609 -3581 -3552 -3495 -3438 -3381 -3323 -3375 -3426 -3344 -3261 -3215 -3169 -3042 -2915 -2739 -2562 -2385 -2208
1103b208J07J08J07J08Q9Q9j51j51j91j90j91j91q3q4mlN9N9N9N9Q0Q1J61J61J9K0j67j68
1100b416r0r1r1r0j87j87j87j86K0K0K1K0llllr3r3R3R4j7j8O3O2L9L9M0L9k6k6k6k6K5K6
1096c261K6K6p3p2QPN0M9l0l1J33J33N3N3J13J13J13J13L46L47L47L47N27N28L92L94K67K66
1093A284R0k31l50n10m39m40l93l94l13l13j02j03j02j02r5r5L8L9J31J30J31J30K27K26K27
1090a329K26L28L29Q7Q8j60j61j60j61j57j57j58j57j75j75m1m2j00j00L4L4j0rP0P1J21J21
1087a743K54K55L82L83N25N26P53R14P33P34P28N68M04L0k36l96n69n70o18o19o08o08n49
1084F73l90l35l35k28o8p8p7M6M5L6J97K74K74K64M25N06L44K42K41R3j74l17l18l16l16l16
1081C92l16k05k06l40l40j32j33k13k13m7m7j38K3J13J13M3M2K67K68J76L38L52L51N50N49
$$ plain form
1103 -2208 -2101 -1993 -1886 -1778 -1689 -1600 -1751 -1902 -2093 -2283 -2474 -2665 -2748 -2832 -2836 -2839 -2780 -2721 -2662 -2603 -2523 -2442 -2281 -2120 -2101 -2081 -2248 -2416
1100 -2416 -2506 -2597 -2688 -2778 -2965 -3152 -3339 -3525 -3505 -3485 -3464 -3444 -3447 -3450 -3453 -3456 -3549 -3642 -3549 -3455 -3472 -3490 -3427 -3365 -3326 -3287 -3247 -3208 -3234 -3260 -3286 -3312 -3287 -3261
1096 -3261 -3235 -3209 -3282 -3354 -3346 -3339 -3289 -3240 -3270 -3301 -3168 -3035 -2982 -2929 -2816 -2703 -2590 -2477 -2131 -1784 -1437 -1090 -563 -35 357 751 1018 1284
1093 1284 1374 1143 793 283 -156 -596 -989 -1383 -1696 -2009 -2111 -2214 -2316 -2418 -2513 -2608 -2570 -2531 -2400 -2270 -2139 -2009 -1782 -1556 -1329
1090 -1329 -1103 -775 -446 -359 -271 -431 -592 -752 -913 -1070 -1227 -1385 -1542 -1717 -1892 -1933 -1975 -2075 -2175 -2141 -2107 -2117 -2126 -2056 -1985 -1864 -1743
1087 -1743 -1489 -1234 -852 -469 56 582 1335 2249 2982 3716 4444 5012 5416 5446 5210 4814 4245 3675 3057 2438 1830 1222 673
1084 673 283 -52 -387 -615 -683 -761 -838 -792 -747 -711 -514 -240 34 298 723 1229 1573 1815 2056 2149 1975 1658 1340 1024 708 392
1081 392 76 -129 -335 -675 -1015 -1147 -1280 -1493 -1706 -1753 -1800 -1938 -1915 -1802 -1689 -1646 -1604 -1337 -1069 -893 -555 -203 148 698 1247
1079A247N76N77N69M09R9j69l23l23l87l87l78n38l37l37l56j97j71j71q1q1rrrrK5K6K12
1075e32K12K91K90M25M24K35K35P5q6j96l57k76k76j93j92j92j92r2r1j32j32J1J1R1R1ML
1072e41Q3Q4J26J27J06K66K48Q8K28K28K33K33J93J93K06K06K16N6O5O6N5N6J15J14P5P5M6
1069C246M6l3l4K6K6J07J06J67J66K07K07L11L11L91L92N77N78N77N78P83P83J024J023J194
1067A2759J193J236J397J462J463J482J482J532J691J896K056K462L050L979N423P204R824
1065F1591J3025J6928K1258K5802L0253L3300L3859L2202K9368K6321K2776J7162Q215k853
1063C69207j3239k0778k4586k6779k9271l1998l3340l1577k7131k2159j7735j4260j1410q791
1061E6153o618m854l512k496j787j413j070q01o78m11j61j61m5K24M43O04Q99J379J856K230
$$ plain form
1079 1247 1823 2400 2969 3378 3477 3308 2985 2662 2275 1888 1510 972 635 298 -58 -255 -426 -597 -678 -759 -768 -777 -786 -795 -770 -744 -532
1075 -532 -320 -29 261 686 1110 1345 1580 1655 1569 1373 1016 740 464 271 79 -113 -305 -397 -488 -620 -752 -741 -730 -639 -548 -544 -541
1072 -541 -458 -374 -248 -121 -15 251 499 587 815 1043 1276 1509 1702 1895 2101 2307 2523 2579 2644 2710 2765 2821 2936 3050 3125 3200 3246
1069 3246 3292 3259 3225 3251 3277 3384 3490 3657 3823 4030 4237 4548 4859 5250 5642 6219 6797 7374 7952 8735 9518 10542 11565 12759
1067 12759 13952 15188 16585 18047 19510 20992 22474 24006 25697 27593 29649 32111 35161 39140 44563 51767 61591
1065 61591 74616 91544 112802 138604 168857 202157 236016 268218 297586 323907 346683 363845 372060 369207
1063 369207 355968 335190 310604 283825 254554 222556 189216 157639 130508 108349 90614 76354 64944 56153
1061 56153 49535 44681 41169 38673 36886 35473 34403 33602 32924 32513 32352 32191 32146 32370 32813 33417 34316 35695 37551 39781
1059C9781K624L106L517L783M022M288M290M290M578M577M912N392O152P594R855J3224J7921
1057A43906K4497L3615M5003N7646P0959Q5124R8115J04812J02298R3227Q3337P5631O6062
1056A084232M6010J3987k2601n3876p1930p8505q3845r3628j04426j07793r8009q0314o3504
1054B85798n0940m1283l2462k4467j8105j3173r591p029n264m134l547l181l020k823k556
1053F4223k359k359k108j841j406q17o9O25J228J815K364K844L378L537L685L953M186M346
1050H5225M480M855N510O633Q350J1184J5358K1184K9171L9702N2193O5612P9806R4402J05651
1049F29316J07737J00699Q9954Q0958P3847O0315L3210l648m0484o7061p8769q3408r0840
1047H11826j02220j10934j08579r3663p4745n9293m7968l8505k9790k2253j6291j1747q780
$$ plain form
1059 39781 42405 45511 49028 52811 56833 61121 65411 69701 74279 78856 83768 89160 95312 102906 112761 125985 143906
1057 143906 168403 202018 247021 304667 375626 460750 558865 663677 765975 859202 942539 1018170 1084232
1056 1084232 1130242 1144229 1121628 1067752 995822 917317 833472 739844 635418 527625 429616 349302 285798
1054 285798 234858 193575 161113 136646 118541 105368 95777 88748 83484 79350 75803 72622 69602 66779 64223
1053 64223 61864 59505 57397 55556 54150 53333 53264 53889 55117 56932 59296 62140 65518 69055 72740 76693 80879 85225
1050 85225 89705 94560 100070 106703 115053 126237 141595 162779 191950 231652 283845 349457 429263 523665 629316
1049 629316 737053 837752 927706 1008664 1082511 1142826 1176036 1172388 1131904 1064843 986074 902666 811826
1047 811826 709606 598672 490093 396430 321685 262392 214424 175919 146129 123876 107585 95838 87058
1046H7058o589m859l951l517l356l256k989k942k942l071l072k851k584k260j885j398r16
1044C4620m76k08L3M07O97Q58R78R78J174J174J421J689K229L032M295O059Q433J1694J5731
1042I4818K0168K5029L0109L4425L6511L5409L2362K9234K6508K2421J4562L082r482j9622
1040C75534k5556k8223l0415l3589l6315l6489l3229k7809k2303j7920j4337j1287q453o274
1038D3335m618l241k118j369r95p38m71l74n34o05o04r25j086j169j169j250j249j066r06
1036A8848q53q53p72o12m45k84j35j35l4l4p1Q9R6R6J11L78N76N75Q13Q12J017J177J147J148
1034B2655J204J472J686J846K130K129K095K256K372K639K961L120L482L963M544N133N614
1032G1301O095O673P689R567J2400J6562K2175K9714L9711N2107O6167P9677R0850R7787R7787
$$ plain form
1046 87058 80469 75610 71659 68142 64786 61530 58541 55599 52657 49586 46514 43663 41079 38819 36934 35536 34620
1044 34620 34144 33936 33969 34376 35073 35931 36909 37887 39061 40235 41656 43345 45574 48606 52901 58960 67393 79087 94818
1042 94818 114986 140015 170124 204549 241060 276469 308831 338065 364573 386994 401556 404638 395156 375534
1040 375534 349978 321755 291340 257751 221436 184947 151718 123909 101606 83686 69349 58062 49609 43335
1038 43335 38717 35476 33358 31989 30994 30256 29785 29411 28877 28272 27668 26743 25657 24488 23319 22069 20820 19754 18848
1036 18848 17995 17142 16370 15758 15313 15029 14894 14759 14725 14691 14620 14709 14805 14901 15012 15390 15966 16541 17354 18166 19183 20360 21507 22655
1034 22655 23859 25331 27017 28863 30993 33122 35217 37473 39845 42484 45445 48565 52047 56010 60554 65687 71301
1032 71301 77396 84069 91758 101325 113725 130287 152462 182176 221887 273994 340161 419838 510688 608475 706262
1030G06262Q7058O0701J9555k7116o5462q5724q8794q2967p5169o8058o1031n3172m4505l5897
1028A85681k8112k1643j6517j2614r668p582o072n057m248l552k925k229j555r67m52K43J004
1026F3735J699K300K995L750M231M639M907N127N288N549N816N589N214N075N555O689Q133
1024A46291R723J1059J2741J5253J8474K2484K7857L5396M6395O1525P9561R9289J19925J40187
1023H46160J56929J62542J50413J22239Q3529L5253k2205p8286j15310j27553j25868j23784
1021I64059j24361j22063j12460r7116q0598o5789n3239m2601l3291k5539j9351j4593j1259
1020A61799r174q847r755j0270r896q600p049n889m981m079l063k177j481r77o03k09k10k13
1018G4326n2K24N98R20J400J767K034K663L250L879M467N095O217P870J0062J3491J8248K4797
$$ plain form
1030 706262 793320 854021 873576 846460 780998 695274 606480 523513 448344 380286 319255 266083 221578 185681
1028 185681 157569 135926 119409 106795 97127 89545 83473 78416 74168 70616 67691 65462 63907 62940 62488 62731 63735
1026 63735 65434 67734 70729 74479 78710 83349 88256 93383 98671 104220 110036 115625 120839 125914 131469 138158 146291
1024 146291 156014 167073 179814 195067 213541 236025 263882 299278 345673 407198 486759 586048 705973 846160
1023 846160 1003089 1165631 1316044 1438283 1521812 1557065 1534860 1456574 1341264 1213711 1087843 964059
1021 964059 839698 717635 605175 508059 427461 361672 308433 265832 232541 207002 187651 173058 161799
1020 161799 152625 143778 134023 123753 113857 105257 98208 92319 87338 83259 80196 78019 76538 75561 74958 74749 74539 74326
1018 74326 74274 74498 75096 76016 77416 79183 81217 83880 87130 91009 95476 100571 106788 114658 124720 138211 156459 181256
1016A81256L3725M5153N9107P4527Q9444J01319J07681J05632R1252N9448J0745m2927q3611
1014H32751j01327j00524r2055q3126p5101o7028n7693m7803l8374k9766k2707j7520j3417
1013H6310j0477q292o849n787n091m577m203l788l307k921k546k092j718j441j173q99q99
1011B0250r05r05j102j370j191j190j154r94r18p57q38q37p24p24p24p24o19o18m76m75m80
1008B525l19k67k66l04j43mlJ24l7k6k7j16j16j96j96k98k99j26k88k12k11k22k21l9m0j39
1006a466K1N2j08qqj8j8j8j8j8j8j8j8p9q0o9p0k24o4L3L3o2o2o2o2rrr9O1q1q1K9j31j84
1002b933k4m3m4k4k4j3j4j1J50J93J93J96J97K66K67L00J40K30K30P9P8kkj22j21l08l09k00
998a675j99j90j90k34p4l1l1o7o8J3J3n4n5n4n4l0k9k9l0j2j3j2j3r3r2n0J11j9k0P1P1m0
$$ plain form
1016 181256 214981 260134 319241 393768 483212 584531 692212 797844 889096 948544 959289 916362 832751
1014 832751 731424 630900 538845 455719 380618 313590 255897 208094 169720 139954 117247 99727 86310
1013 86310 75833 67541 60692 54905 49814 45237 41034 37246 33939 31018 28472 26380 24662 23221 22048 21149 20250
1011 20250 19345 18440 17338 15968 14777 13587 12433 11439 10521 9764 8926 8089 7365 6641 5917 5193 4574 3956 3480 3005 2525
1008 2525 2206 1939 1673 1369 1226 1222 1219 1343 1306 1280 1253 1137 1021 825 629 331 32 -94 -382 -594 -805 -1027 -1248 -1287 -1327 -1466
1006 -1466 -1445 -1393 -1501 -1509 -1517 -1535 -1553 -1571 -1589 -1607 -1625 -1643 -1661 -1740 -1820 -1889 -1959 -2183 -2247 -2214 -2181 -2243 -2305 -2367 -2429 -2438 -2447 -2546 -2485 -2566 -2647 -2618 -2749 -2933
1002 -2933 -2957 -3000 -3044 -3068 -3092 -3105 -3119 -3130 -2980 -2787 -2594 -2398 -2201 -1935 -1668 -1368 -1228 -998 -768 -689 -611 -613 -615 -737 -858 -1166 -1475 -1675
998 -1675 -1874 -2064 -2254 -2488 -2562 -2593 -2624 -2691 -2759 -2746 -2733 -2787 -2842 -2896 -2950 -2980 -3009 -3038 -3068 -3080 -3093 -3105 -3118 -3211 -3303 -3353 -3242 -3261 -3281 -3210 -3139 -3179
995c179l9m0l9M3M3M3M3M0M0J20J20M1M0Q4K45L01L01K21L82O06O05O16O16M55M54N44L84
992C090J33J33j87l48n02n02n22n21n21o81n91m30l88k27j83j84l2j93j92l2l8l7N3N3o0n9
989b968J0J1N0j09k0j9jjQ9p1m6m6n6n6Q1Q2JJR4R3R3R3J56J56J66J66K06L66L57L56M43M41
985A18M86O46P07P06O36O36O29O29N39N39K88J27Q5Q4ppR0R1K27M94R59J547K298L315M764
982B0626O529Q420J0291J1407J1781J0696P222J654m387q927j0799j0752r736q550p320o151
980B2004m921l741k833k098j616j267q92o45m85m91l31k77k78k41k41j51J16J35J34L02M62
978B645L63L64L73L74L64L65M46M45N14N14P01P01P32P33P23P23P37N76O21Q87J113J487J989
975A8490K790L971N628P967J0800J4058J7105J9726K1168J9974J5216P577m95p355j2540j5816
$$ plain form
995 -3179 -3218 -3258 -3297 -3254 -3211 -3168 -3125 -3085 -3045 -2925 -2805 -2764 -2724 -2640 -2395 -2094 -1793 -1572 -1190 -584 21 637 1253 1708 2162 2706 3090
992 3090 3223 3356 3169 2821 2319 1817 1295 774 253 -428 -1019 -1449 -1837 -2064 -2247 -2431 -2463 -2656 -2848 -2880 -2918 -2955 -2902 -2849 -2909 -2968
989 -2968 -2958 -2947 -2897 -3006 -3026 -3045 -3046 -3047 -2958 -3029 -3075 -3121 -3177 -3233 -3152 -3070 -3069 -3068 -2974 -2881 -2788 -2695 -2539 -2383 -2217 -2051 -1845 -1479 -1122 -766 -323 118
985 118 604 1250 1957 2663 3299 3935 4564 5193 5732 6271 6559 6686 6771 6855 6848 6841 6931 7022 7249 7743 8702 10249 12547 15862 20626
982 20626 27155 35575 45866 57273 69054 79750 86972 88626 84239 75312 64513 53761 44025 35475 28155 22004
980 22004 17083 13342 10509 8411 6795 5528 4636 3991 3506 3015 2684 2407 2129 1888 1647 1496 1612 1747 1881 2183 2645
978 2645 3008 3372 3745 4119 4483 4848 5294 5739 6253 6767 7468 8169 8901 9634 10357 11080 11817 12393 13014 13901 15014 16501 18490
975 18490 21280 25251 30879 38846 49646 63704 80809 100535 121703 141677 156893 164470 163975 156620 144080 128264
973A28264j7258j7190j6388j4751j2452j0120q035o317m874l775k866k132j650j156r95q42
972G463o81o84n24l64l64k63k64L1L1j10j09k44k43j48j48j48j48j80j81POQ7Q7P7K37L34
969C557L33L54L54M29N90P26R94J392J874K576L698N061O933R184J1163J2701J3395J2494
967H7808R125K717m822j0448j2747j2349j0905r569q125o635n298l902k779j969j274r26r26
965F976q47q46q46q46p29p29p18p19o29m67l62l61l71k11j14j14n4n4K6K6KKp8p9j37j36j37
962b552j37n8n7j91j91k9l0k9k9j3j4j4j3l2l3l2l2k9l0K11K11J61J61J71J71J11K71L69L68
958a340N37N37O70O70Q80Q79N52K85J18k57m63m64o74o74n94n93m74m75m75m75l26l25j91
956b672j92r4r5j84k5qqp8p9k8k8j18M2M4M5l5l5L6j24j23L6l6l5k6k6m5m6m6m6M9M9M8M9
$$ plain form
973 128264 111006 93816 77428 62677 50225 40105 32070 25753 20879 17104 14238 12106 10456 9300 8305 7463
972 7463 6782 6098 5574 5210 4846 4583 4319 4350 4381 4271 4162 3918 3675 3527 3379 3231 3083 2903 2722 2729 2735 2822 2909 2986 3223 3557
969 3557 3890 4244 4598 5027 5617 6343 7337 8729 10603 13179 16877 21938 28871 38055 49218 61919 75314 87808
967 87808 96933 99650 94828 84380 71633 59284 48379 38810 30685 24050 18752 14850 12071 10102 8828 7902 6976
965 6976 6129 5283 4437 3591 2862 2133 1415 696 67 -400 -762 -1123 -1494 -1705 -1819 -1933 -1987 -2041 -2015 -1989 -1987 -1985 -2063 -2142 -2279 -2415 -2552
962 -2552 -2689 -2747 -2804 -2995 -3186 -3215 -3245 -3274 -3303 -3316 -3330 -3344 -3357 -3389 -3422 -3454 -3486 -3515 -3545 -3334 -3123 -2962 -2801 -2630 -2459 -2348 -2077 -1708 -1340
958 -1340 -803 -266 404 1074 1954 2833 3385 3670 3788 3531 3068 2604 1930 1256 662 69 -405 -880 -1355 -1830 -2156 -2481 -2672
956 -2672 -2864 -2958 -3053 -3237 -3262 -3270 -3278 -3356 -3435 -3463 -3491 -3609 -3567 -3523 -3478 -3513 -3548 -3512 -3636 -3759 -3723 -3759 -3794 -3820 -3846 -3891 -3937 -3983 -4029 -3980 -3931 -3883 -3834
952c834opj6J43Q9Q9R9R9K66K66L46L46M27M28M17M18M19K58P5q6k04m70m02m01m35k75m34
949b385m35k86j25j36j35j59j59k5k5o7o8J3J2j19j19j29L1J1J1K1K1OOOOPQPPl1l1l1l1N7
945d266N7k4k3k5k6k5k5k2k2k2k2M6M7M6M7l7l7R6R7l9l9l8l9PPQPJ19J19Q6p5n1J10RRn9
941c999n9K1K1q2q1N2N2N8N7p7p6RRJ0RO7O8n6n6j19M2J39J38R5R5J5J5N6N6k4k5J63J63K9
937c215K9M1M0J37K98L71L71N35Q02R20J082J279J280R25N50J87k95p38j005j226j386j311
934c29r38o18m57m48j81q0q0o1o0p1R0K1K0n0n0k0k0k9l0J16m5m4J16l0k9O0O1J13J13J12
931b848J13P1P1P1P1Q4Q4Q4Q4J17J17K08K07M9K09K09K09L49N09Q47J221J409J783K020K020
928I368J906J425J041N60q3p78j410j784j801j800j610j343j027p59m21k61k08k08j87l48
$$ plain form
952 -3834 -3840 -3847 -3863 -3720 -3631 -3542 -3443 -3344 -3078 -2812 -2466 -2120 -1693 -1265 -848 -430 -11 247 322 236 32 -438 -840 -1241 -1676 -1951 -2385
949 -2385 -2820 -3106 -3231 -3367 -3502 -3661 -3820 -3845 -3870 -3937 -4005 -3992 -3980 -4099 -4218 -4347 -4316 -4305 -4294 -4273 -4252 -4246 -4240 -4234 -4228 -4221 -4213 -4206 -4199 -4230 -4261 -4292 -4323 -4266
945 -4266 -4209 -4233 -4256 -4281 -4307 -4332 -4357 -4379 -4401 -4423 -4445 -4399 -4352 -4306 -4259 -4296 -4333 -4237 -4140 -4179 -4218 -4256 -4295 -4288 -4281 -4273 -4266 -4147 -4028 -3942 -4017 -4068 -3958 -3949 -3940 -3999
941 -3999 -4058 -4037 -4016 -4098 -4179 -4127 -4075 -4017 -3960 -4037 -4113 -4104 -4095 -4085 -4076 -4009 -3941 -3997 -4053 -4172 -4130 -3991 -3853 -3758 -3663 -3648 -3633 -3577 -3521 -3545 -3570 -3407 -3244 -3215
937 -3215 -3186 -3145 -3105 -2968 -2670 -2299 -1928 -1393 -591 329 1411 2690 3970 4895 5445 5632 5337 4599 3594 2368 982 -329
934 -329 -1267 -1885 -2342 -2790 -2971 -3051 -3131 -3192 -3252 -3323 -3233 -3212 -3192 -3242 -3292 -3312 -3332 -3361 -3391 -3275 -3320 -3364 -3248 -3278 -3307 -3247 -3186 -3073 -2960 -2848
931 -2848 -2735 -2664 -2593 -2522 -2451 -2367 -2283 -2199 -2115 -1998 -1881 -1673 -1466 -1417 -1208 -999 -790 -441 68 915 2136 3545 5328 7348 9368
928 9368 11274 12699 13740 14300 14217 13439 12029 10245 8444 6644 5034 3691 2664 1905 1484 1223 1015 807 620 272
926B72k25k24l52l52l41p3q9r0j24j24j24j24k9k8k9k9p6p6o6o6j90k9J4J4m8m8Q6Q6Q3Q3
922b318J62J63N2N2J85J86J62J62L50L49M79M77P40J006J321J481J609J340Q89M08k7n08r45
920G775j320j501j339r61n86k69kN8N9o9o8j10k71l14l14l34l33k42k43k90j29j80j80o6o7
917a296J74J73K06K06J26J26K9K9n2n1r3r3k27k27k72k73j93j92j90j89j50j49j52j52o2o2
914c006o4R5ONk9l0N1N0J01J00J0J1R1o9j9j9P0P0J50J50K66K66K40M00L68J01r6r6j19k80
910a226k70k70k36k36j40K1o6o6o6R4M7M6l3l4N5j06j49j49o3o3o3o3K6K5p4Q5K26O6P6K36
907b370K00K01L45L44K89K89K88K89J86J86%jJJj33j32k38k38k78k78k19k19j79j79k20k19
904b284l90k30j06j07n6n6j5j5j6j5r0r0m7J13j3j2P7P8M9M9QRP4P4J24l6j24j25n4n4l1l1
$$ plain form
926 272 47 -177 -529 -881 -1222 -1295 -1384 -1474 -1598 -1722 -1846 -1970 -1999 -2027 -2056 -2085 -2161 -2237 -2303 -2369 -2559 -2588 -2574 -2560 -2608 -2656 -2570 -2484 -2401 -2318
922 -2318 -2156 -1993 -1941 -1889 -1704 -1518 -1356 -1194 -844 -495 -16 461 1201 2207 3528 5009 6618 7958 8847 9255 9228 8720 7775
920 7775 6455 4954 3615 2654 2068 1799 1797 1855 1914 1845 1777 1667 1396 1082 768 434 101 -141 -384 -674 -803 -983 -1163 -1229 -1296
917 -1296 -1122 -949 -743 -537 -411 -285 -256 -227 -279 -330 -423 -516 -743 -970 -1242 -1515 -1708 -1900 -2090 -2279 -2429 -2578 -2730 -2882 -2944 -3006
914 -3006 -3070 -2975 -2969 -2964 -2993 -3023 -2972 -2922 -2821 -2721 -2711 -2700 -2609 -2678 -2697 -2716 -2646 -2576 -2426 -2276 -2010 -1744 -1504 -1104 -736 -635 -731 -827 -946 -1226
910 -1226 -1496 -1766 -2002 -2238 -2378 -2357 -2423 -2489 -2555 -2461 -2414 -2368 -2401 -2435 -2380 -2486 -2635 -2784 -2847 -2910 -2973 -3036 -3010 -2985 -3059 -2974 -2748 -2682 -2606 -2370
907 -2370 -2170 -1969 -1624 -1280 -991 -702 -414 -125 61 247 247 246 247 248 115 -17 -255 -493 -771 -1049 -1268 -1487 -1666 -1845 -2065 -2284
904 -2284 -2674 -2904 -3010 -3117 -3173 -3229 -3244 -3259 -3275 -3290 -3380 -3470 -3517 -3404 -3417 -3429 -3352 -3274 -3225 -3176 -3168 -3159 -3085 -3011 -2887 -2923 -3047 -3172 -3226 -3280 -3311 -3342
900c342M9N0m4m3llj2j2j3j2k2k2J12J12J40J40K37L98L21L22M11M12L33L34L32L33K01K01
897I10klo9l37k67k65l33l34l33l33k60k59k60k60j75j75r5r6qqqrk5k5N4N5J2J1R2R1n3n3
894b820n3n3j03j03j03j03q9q9rrq8q8M6M6l0l1J03J02M7M6J26J26J10J11L0L0KKKKooJ28
890b724J28O5O4j6j5POPPJ4J3o7o6J7J8J8J8K4K4n5n6KJKKj03j04j03j04K3K3K2K3P0O9P0
886b676O9J80J80J80J80K75K75K76K75K01K02J22J21m5m6L5L4l2l2l2l2mlP6P7J26J24M6M6
882A98L5L6M5M6o4R6POMNQ4Q5L2L1L2L2J50J50J50J51J34J35J35J35K39K40N3N3m2m2m2m2
879B267q7q7q7q7j4j4j4j4R1R1R2R1K26K26L06L06K43K42K43K43l1l1j64j65k53k53k33l93
875B740l99k39k06k06j89j88j09j09j36j36n6n6j34j34j35j34o9p0j48j49k45k45j11j11j97
$$ plain form
900 -3342 -3293 -3243 -3287 -3330 -3333 -3336 -3348 -3360 -3373 -3385 -3407 -3429 -3317 -3205 -3065 -2925 -2688 -2290 -1969 -1647 -1236 -824 -491 -157 175 508 709 910
897 910 908 905 836 499 232 -33 -366 -700 -1033 -1366 -1626 -1885 -2145 -2405 -2580 -2755 -2850 -2946 -2954 -2962 -2970 -2979 -3004 -3029 -2975 -2920 -2908 -2897 -2805 -2714 -2767 -2820
894 -2820 -2873 -2926 -3029 -3132 -3235 -3338 -3427 -3516 -3525 -3534 -3622 -3710 -3664 -3618 -3648 -3679 -3576 -3474 -3427 -3381 -3255 -3129 -3019 -2908 -2878 -2848 -2846 -2844 -2842 -2840 -2846 -2852 -2724
890 -2724 -2596 -2531 -2467 -2483 -2498 -2491 -2485 -2478 -2471 -2457 -2444 -2511 -2577 -2560 -2542 -2524 -2506 -2482 -2458 -2513 -2569 -2567 -2566 -2564 -2562 -2665 -2769 -2872 -2976 -2953 -2930 -2908 -2885 -2815 -2746 -2676
886 -2676 -2607 -2427 -2247 -2067 -1887 -1612 -1337 -1061 -786 -585 -383 -261 -140 -185 -231 -196 -162 -194 -226 -258 -290 -294 -297 -221 -144 -18 106 152 198
882 198 233 269 314 360 296 392 399 405 409 414 498 583 615 646 678 710 860 1010 1160 1311 1445 1580 1715 1850 2089 2329 2382 2435 2393 2351 2309 2267
879 2267 2180 2093 2006 1919 1905 1891 1877 1863 1954 2045 2137 2228 2454 2680 2986 3292 3535 3777 4020 4263 4232 4201 4037 3872 3619 3366 3133 2740
875 2740 2341 2102 1896 1690 1501 1313 1204 1095 959 823 767 711 577 443 308 174 105 35 -113 -262 -507 -752 -863 -974 -1171
873a171j97j54Pr1r0q0q0p6p5p5p5q7q7ppl7l8l8l8K7K8K7K7KKKKl1l1l2l1O9O9O9O9N9O0
868b109N9N9m9n0m9m9j6j6j6j6O6O6O5O6j07j06k6k6q3q2q2q2K3K3n7n7p0p0O4O4m2m1m2m1
865b829NOp5p5O5O6o8o9l4l5l5l5j8j8r9r8J02J03J02J02o5o4o5o5o8o8J2J3k3k3k3k3K2K2
861c355K2K2L4L4m7m6J6J5J6J6P1P1P1P1L2L3L3L2%jjjL2L1L1L1N3N3N3N3l5l6J51J52O6O6
857b161O6O6O3O4O3O3j40j41o1o0m2m2j22j22K4K5n5n6o6o7p7Q3J04J03p3p4M1M0J5o4j82
853b785k1P0P1M1M2M2M2Q1Q2Q2Q2j6j5J18J18N5N4k5k6J13J12J12J13PPPPM4M4M4M5K4K4K4
849a181K4Q2Q1j8J42J33k7P3P4l0k9j54j53j48J2l2j13n1n1K4K4K5K4n6n6P2P1P1P1R4R5J85
845g22J84K56M16L71K92L36L36L22L21L47J88L6L7n8n8j21m0p7l44l60j99j31j31o5j46l22
$$ plain form
873 -1171 -1368 -1522 -1515 -1606 -1696 -1776 -1856 -1932 -2007 -2082 -2157 -2244 -2331 -2338 -2345 -2382 -2420 -2458 -2496 -2469 -2441 -2414 -2387 -2385 -2383 -2381 -2379 -2410 -2441 -2473 -2504 -2435 -2366 -2297 -2228 -2169 -2109
868 -2109 -2050 -1991 -2040 -2090 -2139 -2188 -2204 -2220 -2236 -2252 -2186 -2120 -2055 -1989 -2096 -2202 -2228 -2254 -2337 -2419 -2501 -2583 -2560 -2537 -2594 -2651 -2721 -2791 -2727 -2663 -2705 -2746 -2788 -2829
865 -2829 -2824 -2818 -2893 -2968 -2903 -2837 -2905 -2974 -3008 -3043 -3078 -3113 -3131 -3149 -3248 -3346 -3244 -3141 -3039 -2937 -3002 -3066 -3131 -3196 -3264 -3332 -3320 -3307 -3330 -3353 -3376 -3399 -3377 -3355
861 -3355 -3333 -3311 -3277 -3243 -3290 -3336 -3320 -3305 -3289 -3273 -3202 -3131 -3060 -2989 -2957 -2924 -2891 -2859 -2859 -2860 -2861 -2862 -2830 -2799 -2768 -2737 -2684 -2631 -2578 -2525 -2560 -2596 -2445 -2293 -2227 -2161
857 -2161 -2095 -2029 -1966 -1902 -1839 -1776 -1916 -2057 -2118 -2178 -2220 -2262 -2384 -2506 -2482 -2457 -2512 -2568 -2634 -2701 -2778 -2695 -2591 -2488 -2561 -2635 -2594 -2554 -2539 -2603 -2785
853 -2785 -2806 -2736 -2665 -2624 -2582 -2540 -2498 -2417 -2335 -2253 -2171 -2187 -2202 -2084 -1966 -1911 -1857 -1882 -1908 -1795 -1683 -1571 -1458 -1451 -1444 -1437 -1430 -1386 -1342 -1298 -1253 -1229 -1205 -1181
849 -1181 -1157 -1075 -994 -1012 -870 -737 -764 -691 -617 -647 -676 -830 -983 -1131 -1119 -1151 -1264 -1315 -1366 -1342 -1318 -1293 -1269 -1325 -1381 -1309 -1238 -1167 -1096 -1002 -907 -722
845 -722 -538 -282 134 505 797 1133 1469 1791 2112 2459 2647 2683 2720 2662 2604 2483 2443 2366 2022 1662 1463 1332 1201 1136 990 668
842F68j62p3j53j53p3J0J0k7k7k7k7RJ0Q8R0MLMLN0N1q4q3J0J0J0J0M8M9M8M9Q6Q6Q6Q6O6
838G55O5K00K00J58J58P8P8K24K23J43J43J57J57J56J57L96L96L97L96M29M29L89L88K35K34
835F741M7M7ooj39j40m8m9q8q9j33j33n4n3j0j1P0P0OPJ40J41L61L62L21L22L90L91N24N24
832I505N26N26O07O07P89P88R93R93R99J266J434J434J688K062K453L041L706M507N471O699
830E0094P826Q840R763J0351J0732J0037Q233N827L949L467M282O047P999R762J1166J1968
828A80343J1443R465O297K609q67l699n434n435m697l361j793o71j23l90j740l933o113p770
826A64131q185p597o490n582m994m620m365m098l717l236k651j743q33P5J038J946L043L951
824A16073M907N816O805Q355J0298J2705J5371J8097K0867K3060K4836K5318K4061K1228J7685
$$ plain form
842 668 506 433 280 127 54 64 74 47 20 -7 -34 -25 -15 73 163 167 170 174 177 227 278 194 111 121 131 141 151 199 248 296 345 431 517 603 689 755
838 755 820 1020 1220 1378 1536 1614 1692 1916 2139 2282 2425 2582 2739 2895 3052 3448 3844 4241 4637 5066 5495 5884 6272 6507 6741
835 6741 6788 6835 6829 6823 6684 6544 6496 6447 6359 6270 6137 6004 5950 5897 5887 5876 5946 6016 6022 6029 6169 6310 6671 7033 7354 7676 8066 8457 8981 9505
832 9505 10031 10557 11164 11771 12560 13348 14341 15334 16333 17599 19033 20467 22155 24217 26670 29711 33417 37924 43395 50094
830 50094 57920 66760 76523 86874 97606 107643 115876 121703 125652 129119 133401 139448 147447 157209 168375 180343
828 180343 191786 201251 207548 210157 209290 205591 200157 194722 190025 186664 184871 184200 184077 183687 181947 178014 171901 164131
826 164131 155946 148349 141859 136277 131283 126663 122298 118200 114483 111247 108596 106853 106020 106095 107133 109079 112122 116073
824 116073 120980 126796 133601 141956 152254 164959 180330 198427 219294 242354 267190 292508 316569 337797 355482
822C55482J5280J4357J4839J6770J9711K3135K6076K7380K6363K2819J7418J0930L819k759
820E91620p304r724j0204r489q046o315n299n698p996j1967j5976j8966k0944k2081k2348
819D09263k1631k0508j9446j8537j7635j6726j5530j4086j2631j1295j0018q682p201n651
817B09686m308l079k019q96M47K104L959O043Q383J0681J2967J5052J6629J7324J7688J8170
815C28831J8837J9961K2145K5621L0265L5023L8338L8926L5765K9296J8616O587l337p453
814F37421n910k862L46J895J588j246o278j2533j8641k2971k5063k4903k3109k0703j8285
812D58746j6306j5614j6737j9490k3286k6151k7059k5710k2662j9524j7226j5619j4388j3473
810A85501j2510j1464j0288r256q293p304o128n178m215l199k451j612o50L66J970M113O359
$$ plain form
822 355482 370762 385119 399958 416728 436439 459574 485650 513030 539393 562212 579630 590560 594379 591620
820 591620 584316 574592 564388 554899 546853 540538 535239 529541 521545 509578 493602 474636 453692 431611 409263
819 409263 387632 367124 347678 329141 311506 294780 279250 265164 252533 241238 231220 222538 215337 209686
817 209686 205378 202299 200280 199384 199831 201935 205894 211937 220320 231001 243968 259020 275649 292973 310661 328831
815 328831 347668 367629 389774 415395 445660 480683 519021 557947 593712 623008 641624 648211 644874 637421
814 637421 631511 628649 628995 630890 632478 631232 624954 612421 593780 570809 545746 520843 497734 477031 458746
812 458746 442440 426826 410089 390599 367313 341162 314103 288393 265731 246207 228981 213362 198974 185501
810 185501 172991 161527 151239 141983 133690 126386 120258 115080 110865 107666 105215 103603 102953 103319 105289 109402 115761
808A15761Q671J0489J1771J2307J1798R340M968L70k597k276J175O201J0802J4331J6429J6589
807B46129J4034R008J937n440j1695j5437j6249j4217j0421o038k709o78q9j053m133q730
805A74219j3141j5815j5874j3629j0756q510p366o831o607o447o053n732n234m485l785l037
803D0917k422k101j727j406j593j914k260k581k677k518k219j899j809j809j609j289j201
801G883j042q44o84n77n76m00m00k66k66k60k59j26j25llj37j37j13j13j13j14j84j84j84
798G73j85j50j51j51j50r4r4r5r4j01j01L3L3qpq8q7L1L1L1L1JJQ1Q1J58J58J57J58Q3Q4R4
795D63o7k54k53k64k64r3r3j03N7L7L8M7M7J69J68j9j9j20j21j21j20m2m2m2m2R5R5nJ55J79
791e34J9J9J80J42j7r5r5j87k6J6J7P2P2K06K05K02K04J93J93l3j93j82j83j98j99NOL01N70
$$ plain form
808 115761 124432 134921 146692 158999 170797 180137 185105 185475 182878 180602 181777 187978 198780 213111 229540 246129
807 246129 260163 269171 271108 265668 253973 238536 222287 208070 197649 191611 188902 188224 188135 187082 182949 174219
805 174219 161078 145263 129389 115760 105004 96494 89128 82297 75690 69243 63190 57458 52224 47739 43954 40917
803 40917 38495 36394 34667 33261 31668 29754 27494 24913 22236 19718 17499 15600 13791 11982 10373 9084 7883
801 7883 6841 5997 5313 4736 4160 3760 3360 3094 2828 2568 2309 2183 2058 2055 2052 1915 1778 1665 1552 1439 1325 1141 957 773
798 773 588 438 287 136 -14 -108 -202 -297 -391 -492 -593 -560 -527 -535 -542 -630 -717 -686 -655 -624 -593 -592 -591 -510 -429 -271 -113 44 202 285 369 463
795 463 396 142 -111 -375 -639 -732 -825 -928 -871 -834 -796 -749 -702 -533 -365 -384 -403 -523 -644 -765 -885 -927 -969 -1011 -1053 -958 -863 -868 -713 -534
791 -534 -515 -496 -316 -174 -191 -286 -381 -568 -594 -578 -561 -489 -417 -211 -6 196 400 593 786 753 560 378 195 -3 -202 -197 -191 110 680
788F80P73O14j42o23m83j08L32M93O23O24J53n42j331j329o22k48j11j11J8J7R8R8J60J60
785h07K50Q9N3N3l8l8q6q6k73k73k15k16q1q2k3k3j03j03l8l9l8l8L2L2j02j02kkkkN0N0J30
781b073J30J06J06J86J86m3m3m3m3j79j80r0r1J8J52P6P7J28J28M9M8R4R5l8l9k23k22k23
778a951k23j17j17j17j18NNMNM6M7M6M6M5M4l6l6J8J8J7J8P3P3J98J99J97O3k6J09J5j18j68
775a736j68q8q7q0p9j17J7O8O7J09k4OQ5J03J03K8K8K6K6J59J60l4l3j14j14noq5q6K4K3K3
771a801K3k4k3k4k4jjP9P9M3M4M9M9o8J3N1q2j06K7K5j10r5j4o9o8m3m4m3m3M7M8M8M8OOJ39
767a859J40R2R1R2R1K09K08P5P5J83J83J83J83J63J64J65J64M1M1M1M1m6m6j27j26k9k8j09
764B55j09q6q4onJ5J4o6o6K8K8j06j06J04J03q3q3m7m7j27j26j02j02j82j82j5j5j4j5k2k1
$$ plain form
788 680 1453 2067 1925 1302 819 711 1043 1536 2159 2783 2936 2394 1063 -266 -888 -1136 -1247 -1358 -1340 -1323 -1225 -1127 -967 -807
785 -807 -557 -468 -415 -362 -400 -438 -524 -610 -883 -1156 -1371 -1587 -1668 -1750 -1773 -1796 -1899 -2002 -2040 -2079 -2117 -2155 -2123 -2091 -2193 -2295 -2297 -2299 -2301 -2303 -2253 -2203 -2073
781 -2073 -1943 -1837 -1731 -1545 -1359 -1402 -1445 -1488 -1531 -1710 -1890 -1980 -2071 -2053 -1901 -1825 -1748 -1620 -1492 -1443 -1395 -1301 -1206 -1244 -1283 -1506 -1728 -1951
778 -1951 -2174 -2291 -2408 -2525 -2643 -2638 -2633 -2629 -2624 -2578 -2531 -2485 -2439 -2394 -2350 -2386 -2422 -2404 -2386 -2369 -2351 -2278 -2205 -2007 -1808 -1611 -1548 -1574 -1465 -1450 -1568 -1736
775 -1736 -1904 -1992 -2079 -2159 -2238 -2355 -2338 -2270 -2203 -2094 -2118 -2112 -2027 -1924 -1821 -1793 -1765 -1739 -1713 -1554 -1394 -1428 -1461 -1575 -1689 -1694 -1700 -1785 -1871 -1847 -1824 -1801
771 -1801 -1778 -1802 -1825 -1849 -1873 -1874 -1875 -1796 -1717 -1674 -1630 -1581 -1532 -1600 -1587 -1536 -1618 -1724 -1697 -1672 -1782 -1877 -1891 -1960 -2028 -2071 -2115 -2158 -2201 -2154 -2106 -2058 -2010 -2004 -1998 -1859
767 -1859 -1719 -1627 -1536 -1444 -1353 -1144 -936 -861 -786 -603 -420 -237 -54 109 273 438 602 643 684 725 766 720 674 547 421 392 364 255
764 255 146 60 -24 -30 -35 -20 -6 -72 -138 -110 -82 -188 -294 -190 -87 -170 -253 -300 -347 -474 -600 -702 -804 -986 -1168 -1183 -1198 -1212 -1227 -1249 -1270
760a270k2k2J41J40PPJ79J80J79J79J91J90J91J91J89J89J90J89L53L53K19K19J37J36n1n1
757B533j21j21k01k02j05j05j85j86r8r9r8r9j39j39j39j39m4m4m3m4m4m4j23j25p4p4p4p4
754d50p9p8j59j59j21j20m0m1j1j2O9O8O2O2O2O2O1O0P1P1N8K17K23O3R9J80J70R1J06J07
750F92J02J02J21J22J12J12nj66p5p6j34j34j34j35n4n4j87j88k15k15j35j36j80j80OPn1
747a078n1n1n1NOp4p5m0m0m1m0j91j90N0N0m2m2j33K8P0P0j%o8o9J19J18j6j7j7j6K4K5J58
743a620J58J49J48O8O8o8o8o8o7p3p3p3p3NONNn5n5n5n5RQQRp0p0J5J5l4M7R7o4m4L7O2O1
739a705j8j8j9j8l3l4l3l3QQQQnnq5q6J08J07q0q0K1K0K0K1N2N3N2N2J9J9J9J9j6j6j6j6j7
735a719j8j7j8q9q9M4M4J7J6J6J6j%%%P3P3P3P4N3N3N4N3M4M3j0P0J73M0j3O6J05k8OQ7L3
$$ plain form
760 -1270 -1292 -1314 -1173 -1033 -1026 -1019 -840 -660 -481 -302 -111 79 270 461 650 839 1029 1218 1571 1924 2143 2362 2499 2635 2584 2533
757 2533 2412 2291 2090 1888 1783 1678 1493 1307 1209 1110 1012 913 774 635 496 357 313 269 226 182 138 94 -29 -154 -228 -302 -376 -450
754 -450 -529 -607 -766 -925 -1046 -1166 -1206 -1247 -1258 -1270 -1201 -1133 -1071 -1009 -947 -885 -824 -764 -693 -622 -564 -347 -124 -61 38 218 388 479 585 692
750 692 794 896 1017 1139 1251 1363 1358 1192 1117 1041 907 773 639 504 450 396 209 21 -194 -409 -544 -680 -860 -1040 -1034 -1027 -1078
747 -1078 -1129 -1180 -1231 -1226 -1220 -1294 -1369 -1409 -1449 -1490 -1530 -1721 -1911 -1861 -1811 -1853 -1895 -2028 -2000 -1930 -1860 -1861 -1861 -1929 -1998 -1879 -1761 -1777 -1794 -1811 -1827 -1803 -1778 -1620
743 -1620 -1462 -1313 -1165 -1097 -1029 -1097 -1165 -1233 -1300 -1373 -1446 -1519 -1592 -1587 -1581 -1576 -1571 -1626 -1681 -1736 -1791 -1782 -1774 -1766 -1757 -1827 -1897 -1882 -1867 -1901 -1854 -1757 -1821 -1865 -1828 -1766 -1705
739 -1705 -1723 -1741 -1760 -1778 -1811 -1845 -1878 -1911 -1903 -1895 -1887 -1879 -1884 -1889 -1974 -2060 -1952 -1845 -1925 -2005 -1984 -1964 -1944 -1923 -1871 -1818 -1766 -1714 -1695 -1676 -1657 -1638 -1654 -1670 -1686 -1702 -1719
735 -1719 -1737 -1754 -1772 -1861 -1950 -1906 -1862 -1845 -1829 -1813 -1797 -1798 -1798 -1798 -1798 -1725 -1652 -1579 -1505 -1452 -1399 -1345 -1292 -1248 -1205 -1215 -1145 -972 -932 -945 -879 -774 -802 -796 -709 -676
731f76L4L9L9k2k1k1k2l1l2l1l2J01J00K1K0N1N0N1N0j9k0J14J14j0j0o4J7O0p4l8M1L6L5
727a50M1M1O5O5j5j4L1L1L1L2j1j0J23J23M5M4J25J25J62J61J62J61J51J50J50J51J11J12
724B193J12J12J22J23M2M2K7K7K7K7P9P9P9P9P9P9P9P9J87J88J88J87J96J96J96J96K57K57
721E534L91L90L88L87L97L98M25N86O93O92O71Q32J045J045J289J450J600J600J813J814J981
718B5421K248K511K886L527M329N328O664Q088R638J1214J2549J3482J3482J2396R990N931
716A49684J172l180o442q340q820q784q624q356p982p255o667o025n223m458l870l242k760
714E0828k320j839j551j176q63n96l01l4K75M36O83R50J297J565J859K340K893L373L821M410
712F6050N044N525O047O634P158P854Q294Q562Q688Q849R136R725J0565J1796J3292J4735
$$ plain form
731 -676 -642 -603 -564 -586 -607 -628 -650 -681 -713 -744 -776 -675 -575 -554 -534 -483 -433 -382 -332 -351 -371 -257 -143 -153 -163 -227 -210 -150 -224 -262 -221 -185 -150
727 -150 -109 -68 -3 62 47 33 64 95 126 158 147 137 260 383 428 472 597 722 884 1045 1207 1368 1519 1669 1819 1970 2081 2193
724 2193 2305 2417 2539 2662 2704 2746 2773 2800 2827 2854 2933 3012 3091 3170 3249 3328 3407 3486 3673 3861 4049 4236 4432 4628 4824 5020 5277 5534
721 5534 5925 6315 6703 7090 7487 7885 8310 8896 9589 10281 10952 11784 12829 13874 15163 16613 18213 19813 21626 23440 25421
718 25421 27669 30180 33066 36593 40922 46250 52914 61002 70640 81854 94403 107885 121367 133763 143753 149684
716 149684 150856 147676 141234 132894 124074 115290 106666 98310 90328 83073 76406 70381 65158 60700 56830 53588 50828
714 50828 48508 46669 45118 43942 43079 42483 42182 42148 42423 42859 43542 44492 45789 47354 49213 51553 54446 57819 61640 66050
712 66050 71094 76619 82666 89300 96458 104312 112606 121168 129856 138705 147841 157566 168131 179927 193219 207954
710B07954J6360J8017J9654K1418K3083K4312K5101K4834K2839J8830J2721N183k870j0515
709D26921j6346k0035k1689k1688k0837j9393j7747j6090j4485j3150j1926j0803r828r026
707B03878q461q086p926p551p198o823o215n520m746m157l797l316k698k109j495o93M32J340
705A24859K363L699M933O055P004Q020R088J0105J0803J1177J0986J0987J1752J3302J5309
703B60442J7607K0241K2860K5476K7776K9700L1143L1797L1637L0621K8964K6648K2959J7346
702F25217J0129K357m753j0567j6074k1817k7431l1534l3405l2838l0753k7767k4612k1862
700C54290j9563j7805j6363j4953j4045j3250j2448j1595j1008j0580j0313r746r266q777
699A74578q190p759p277o803o215n692m890m014k999j906p84K99J208K176K978L833M635N220
$$ plain form
710 207954 224314 242331 261985 283403 306486 330798 355899 380733 403572 422402 435123 440306 437436 426921
709 426921 410575 390540 368851 347163 326326 306933 289186 273096 258611 245461 233535 222732 212904 203878
707 203878 195417 187331 179405 171854 164656 157833 151618 146098 141352 137195 133398 130082 127384 125275 123780 123087 123519 124859
705 124859 127222 130921 135854 141909 148913 156933 166021 176126 186929 198106 209092 220079 231831 245133 260442
703 260442 278049 298290 321150 346626 374402 404102 435245 467042 498679 529300 558264 584912 607871 625217
702 625217 635346 637703 632950 622383 606309 584492 557061 525527 492122 459284 428531 400764 376152 354290
700 354290 334727 316922 300559 285606 271561 258311 245863 234268 223260 212680 202367 192621 183355 174578
699 174578 166388 158629 151352 144549 138334 132642 127752 123738 120739 118833 118049 118348 119556 121732 124710 128543 133178 138398
697A38398N487N714O303P543R093J0851J2722J4820J7119J9733K2565K4958K6829K8406K9422
695C79963K9051K6538K1734J5799J0970Q030N443K076k329q584j7324k7429l5257l7983l5678
693C35020l1027k6543k3388k1263j9606j7693j5607j3629j1651j0064q941q103p407p065p064
691A05969o920o546o222n955n701n433n202m828m260l992l495l013k579k098j725j350r36
689C5714o68l75%J74M41P50R12J265J639J770K144K739L541M571N907P631R716J1925J4331
687A04127J6542J8200J9015J8319J5940J1503N078k567j0126j5953j8883j9258j7995j6230
686A07712j4593j3257j2020j0470q762p105n674m445l532k838k256j881j676j516j315j155
684A5217j084r24r15r14p48n87n98n97o65o66n68m08l84l85m05m05k90j30k10l71j94j94p1
$$ plain form
697 138398 143885 149599 155902 163445 172538 183389 196111 210931 228050 247783 270348 295306 322135 350541 379963
695 379963 409014 435552 457286 473085 484055 492085 497528 499604 497275 488691 471367 443938 408681 370698 335020
693 335020 303993 277450 254062 232799 213193 195500 179893 166264 154613 144549 135608 127505 120098 113033 105969
691 105969 99049 92503 86281 80326 74625 69192 63990 59162 54902 50910 47415 44402 41823 39725 38000 36650 35714
689 35714 35046 34671 34671 34845 35286 36036 36948 38213 39852 41622 43766 46505 50046 54617 60524 68155 77871 89796 104127
687 104127 120669 138869 157884 176203 192143 203646 208724 206157 196031 180078 161195 141937 123942 107712
686 107712 93119 79862 67842 57372 48610 41505 35831 31386 27854 25016 22760 20879 19203 17687 16372 15217
684 15217 14133 13209 12294 11380 10632 10045 9447 8850 8185 7519 6951 6543 6159 5774 5369 4964 4674 4544 4334 3963 3769 3575 3504
681C504p0j37j37j46J3o5o5j5j5m5m4L6L6J15J15J16J15J03J04J84J83J15J16L5L5J05J05
678D396k9k8j40j39o0n9p0o9J71J71L54L54N51N51P01Q62R49R48Q39O78N07K41K9j30k98k98
675A0982m29m30k95k96k91k91k10k11k04k05k05k05l4l4l4l5k3k4N7K17J58j09q0Q1J10J09
672H069J19J20J70J70L41J81J02J02K25K26L19L19M53M53N61N61O59O58P38J005R04R05J136
670A8496J296J463J463J651J919J831J832J683J417J099N11K6l48p62r23q26r87j077r17j127
667B7720j127j037j037r78r78q97q98o79o80n89n89m22k60l11l11p0o9o0n9J8J79K48M10L87
665A7911N48N48N48N21N22M35K75M66O27O79P59P35Q95J056J056J137J218J386J547J820J980
662C6669K051K211K180K181K011J850J698J218Q70O03J08m79r14j289j659k033k077k077k153
$$ plain form
681 3504 3434 3297 3160 3014 3027 2962 2897 2882 2867 2822 2778 2814 2850 2965 3080 3196 3311 3414 3518 3702 3885 4000 4116 4151 4186 4291 4396
678 4396 4367 4339 4199 4060 4000 3941 3871 3802 3973 4144 4498 4852 5403 5954 6655 7517 8466 9414 10253 10931 11438 11679 11708 11578 11280 10982
675 10982 10553 10123 9828 9532 9241 8950 8740 8529 8325 8120 7915 7710 7676 7642 7608 7573 7550 7526 7583 7800 7958 7849 7769 7850 7960 8069
672 8069 8188 8308 8478 8648 8989 9170 9272 9374 9599 9825 10144 10463 10916 11369 11930 12491 13150 13808 14546 15551 16455 17360 18496
670 18496 19792 21255 22718 24369 26288 28119 29951 31634 33051 34150 34661 34687 34339 33577 32654 31828 30841 29764 28847 27720
667 27720 26593 25556 24519 23541 22563 21666 20768 20089 19409 18820 18231 17809 17549 17238 16927 16857 16788 16728 16669 16687 16866 17114 17524 17911
665 17911 18459 19007 19555 20076 20598 21033 21308 21774 22401 23080 23839 24574 25469 26525 27581 28718 29936 31322 32869 34689 36669
662 36669 38720 40931 43111 45292 47303 49153 50851 52069 52939 53542 53650 53171 52257 50968 49309 47276 45199 43122 40969
660D0969j993j833j833j622j461j412j413j321j240j191r23q14p33n48l88m02k42k7k8j54
658B1391j53j14j14J83J83K58K58K89K08K10N0N7N8k8N2K19L79N56P16P74Q54J093J254J392
655C0025J660J707J706J790J790J683J523J397J237J045R65O76L01j14m89j180k089k750k911
653C7972k793k527k210k050j719j638j472j204j150j069r48p87o28o27n68n67m68l08l43m23
650A4473k91j30r3r2ooopJ9J8O9r2M1M0r2r3k4J37J27J27j0j0J34J33O5K26L76L76O33O33
647A6675P30Q90J084J085J094R34P83O23J76l06p23j097j210j371j258r90q93p33m66m65l49
645A4213j88l5J26J79J79Q9R0l5l4jJ60P9q1j15j14J5J76K86J26k29k28n5n6o5R5J48J48j00
641A4773k60l75l76m25m26l50l50k54r3o1o1j1j2J01J01J41J41J22J23K02K03K27K27K00M67
$$ plain form
660 40969 38976 37143 35310 33688 32227 30815 29402 28081 26841 25650 24727 23913 23180 22632 22244 21842 21600 21573 21545 21391
658 21391 21238 21124 21010 21193 21376 21634 21892 22181 22389 22599 22649 22706 22764 22736 22788 23007 23386 23942 24658 25432 26286 27379 28633 30025
655 30025 31685 33392 35098 36888 38678 40361 41884 43281 44518 45563 46528 47204 47505 47391 46902 45722 43633 40883 37972
653 37972 35179 32652 30442 28392 26673 25035 23563 22359 21209 20140 19192 18405 17777 17150 16582 16015 15547 15239 14896 14473
650 14473 14182 14052 13959 13867 13861 13855 13849 13842 13861 13879 13948 13856 13897 13937 13845 13752 13728 13865 13992 14119 14109 14099 14233 14366 14431 14657 15033 15409 16042 16675
647 16675 17405 18295 19379 20464 21558 22492 23275 23898 24074 23768 23045 21948 20738 19367 18109 17119 16226 15493 15027 14562 14213
645 14213 14025 13990 14116 14295 14474 14563 14653 14618 14584 14583 14743 14822 14741 14626 14512 14527 14703 14989 15115 14886 14658 14603 14547 14482 14577 14725 14873 14773
641 14773 14513 14138 13762 13337 12911 12561 12211 11957 11864 11803 11742 11731 11719 11820 11921 12062 12203 12325 12448 12650 12853 13080 13307 13507 13974
639A3974N07L46K22K22K99M60N40N39L88J21j84j84n0n0Q4Q3M1M0r4r3j70j71l47l47k52r1
636A5833m7m8K0J9J09n0p7p7q7q6l4l4N6j05j58j58j28j28l0l1k00m1l4l4N6N6n7n8P7P6J14
$$ plain form
639 13974 14481 14827 15049 15271 15570 16030 16570 17109 17497 17618 17434 17250 17200 17150 17234 17317 17358 17398 17304 17211 17041 16870 16523 16176 15924 15833
636 15833 15786 15738 15758 15777 15886 15836 15759 15682 15595 15509 15475 15441 15497 15392 15234 15076 14948 14820 14790 14759 14559 14518 14484 14450 14506 14562 14505 14447 14524 14600 14714
$$ [...]
##$OBSERVED INTEGRALS=	(X Y Z)
(6.719735772350934333, 6.8185692869908542946, 1.9792362200237212377)
(6.847109446298638602, 6.9623271264671053871, 1)
(7.5085454673686244931, 7.5289561479676327949, -0.012015635992322047654)
(5.5808700774619639517, 6.1070120662364857367, 0.7930827650090518377)
(4.6283716495080877706, 5.2180135334795352264, 1.8763919218352513862)
(3.7053553157527829853, 3.8799800275443270259, 2.9745258842811019839)
(2.4971448166521623691, 2.6886123219697855014, 3.9739337108788075348)
(2.3605834341829736722, 2.4950330426964528741, 0.14260837911220200502)
(1.9713131016805995888, 2.1015391622826586904, 2.1912866077608081916)
(1.6974864120903205844, 1.8713558011103677003, 1.97146274507134045)
(1.2800590935118245639, 1.482085468607994061, 11.212229744253594532)
(1.1188603482260304212, 1.266684525125664873, 3.2348915352172018522)
##END=	
##TITLE=	ml2620
##JCAMP-DX=	6.0	$$ MestReNova 14.1.1-24571
##BLOCK_ID=	3
##DATA TYPE=	NMR PEAK TABLE
##DATA CLASS=	PEAK TABLE
##CROSS REFERENCE=	NMR SPECTRUM: BLOCK_ID=2                                     
##.OBSERVE FREQUENCY=	399.79071365325000897
##.OBSERVE NUCLEUS=	^1H
##NPOINTS=	316
##FIRSTX=	0.72691411350492873833
##LASTX=	7.5070132965789211354
##XFACTOR=	1
##YFACTOR=	1
##FIRSTY=	4.8317280064235378133e-05
##XUNITS=	PPM
##YUNITS=	ARBITRARY UNITS
##PEAK TABLE=	(XYW..XYW)
0.72691411350492873833,4.8317280064235378133e-05,0.0026107628461197922645
0.838677287782264691,3.0006526213155552399e-05,0.0039394769771088390675
0.86684454341913941278,0.0027492533390765161103,0.0043341349839893881374
0.87753407650540693474,0.00036559873447405873961,0.0084889306515151963933
0.88235483947716120134,0.0013559040111086578372,0.0023007573592778622976
0.88447909521438361491,0.0063638435744248871007,0.0026086367484048633703
0.89278753253735165796,0.00084147696711961786093,0.016559709495458395379
0.90123265362317339644,0.0020249073192689474865,0.0036681940642118758891
0.95858729062427250334,8.9154917360911118893e-05,0.0022011850820862271724
0.97509079682279697909,9.6828911117177894814e-05,0.0017765389258036653163
1.0381076913396598549,3.2366097368539034607e-05,0.0018970590363515552144
1.0560391867919181053,0.00041593232249776150231,0.0024245483955796149657
1.0750179409008298048,0.0009416005395979453298,0.002237009109819501889
1.0940436727138214135,0.00044192300585540474729,0.0027386697543414655932
1.1588297913404206341,0.0001012379413927862816,0.0085932828503174664425
1.1727691607917931638,7.3150358693448752265e-05,0.0043798930230637750025
1.1848291422518304472,0.00043928462179611591594,0.0029303783587898038325
1.2037565550306124074,0.00094478854957516739208,0.0020758340804474077756
1.2159911249757699991,0.07695249474573685744,0.0025253052174851412653
1.2288516514037237659,0.0012679418210247317845,0.0013594618549191478038
1.2350036368980110701,0.17088197388659512321,0.0022204983585186084671
1.2411229459417645327,0.00057497318736445099299,0.0018001731937212367158
$$ [...]
Compound,Artifact|Impurity|Weak|13C Sat.,,1,0.57568174136943661701,0,0
Compound,Artifact|Impurity|Weak|13C Sat.,,1,-0.12967168951919244568,0,0
Compound,Artifact|Impurity|Weak|13C Sat.,,1,0.56902974743752177123,0,0
Impurity,Artifact|Weak,,1,-0.28692421278470492396,0,0
Artifact,Artifact|Weak,,1,1.3539127257496190726,0,0
Impurity,Artifact|Weak,,1,0.71971173952598044288,0,0
Compound,Artifact|Impurity|Weak|13C Sat.,,1,-0.39971959222339142892,0,0
Artifact,Artifact|Weak,,1,-0.70768594798257555833,0,0
Artifact,Artifact|Weak,,1,1.999999999999999778,0,0
Compound,Artifact|Impurity|Weak|13C Sat.,,1,-0.64666289825848566331,0,0
Compound,Artifact|Impurity|Weak|13C Sat.,,1,1.2329073382121591429,0,0
Impurity,Artifact|Weak,,1,0.23231243936851300735,0,0
Compound,Artifact|Impurity|Weak|13C Sat.,,1,0.075247779507021939072,0,0
Impurity,Artifact|Weak,,1,0.74593089885026642172,0,0
Impurity,Artifact|Weak,,1,0.65244255739275003325,0,0
Compound,Artifact|Impurity|Weak|13C Sat.,,1,0.052159350811176508067,0,0
Compound,Artifact|Impurity|Weak|13C Sat.,,1,0.2000000000000000111,0,0
Artifact,Artifact|Weak,,1,-0.97146726632818425351,0,0
Compound,None,,1,0.17431914182256502688,0,0
Compound,None,,1,0.75963117952371994601,0,0
Compound,None,,1,0.91963772077162275753,0,0
Compound,None,,1,-0.36779497783034370562,0,0
Compound,None,,1,0.40000000000000007772,0,0
Compound,None,,1,-0.34570049412989928284,0,0
Compound,None,,1,0.44643474366944174703,0,0
Compound,None,,1,0.1554973631234239928,0,0
Compound,None,,1,-0.1405099055159980681,0,0
Compound,None,,1,0.83614402168736390308,0,0
Compound,None,,1,0.9114478493583039187,0,0
Compound,None,,1,1.4213525134175182263,0,0
Artifact,Artifact|Weak,,1,0.00062633874098988462364,0,0
Artifact,Artifact|Weak,,1,-0.081320923015486712426,0,0
Impurity,Artifact|Weak,,1,-0.012756673981386301708,0,0
Artifact,Artifact|Weak,,1,0.30104733850113152283,0,0
Artifact,Artifact|Weak,,1,0.80000000000000004441,0,0
Compound,None,,1,1.3068749778912140957,0,0
Artifact,Artifact|Weak,,1,1.1019320920539767972,0,0
Compound,None,,1,0.93694041568242680817,0,0
Artifact,Artifact|Weak,,1,1.1179143088259582139,0,0
Compound,Artifact|Impurity|Weak|13C Sat.,,1,0.80162598024820574949,0,0
Compound,Artifact|Impurity|Weak|13C Sat.,,1,0.045816314649779275869,0,0
Compound,Artifact|Impurity|Weak|13C Sat.,,1,-0.8220782089586271546,0,0
Solvent,Artifact|Impurity|Weak|13C Sat.,,1,0.80427867891341775497,0,0
Impurity,Artifact|Weak,,1,-0.24366921553531589728,0,0
Impurity,Artifact|Weak,,1,0.19999999999999995559,0,0
Impurity,Artifact|Weak,,1,0.8792515571352346182,0,0
Impurity,Artifact|Weak,,1,0.20000000000000006661,0,0
Impurity,Artifact|Weak,,1,-0.00722023119242086453,0,0
Compound,Artifact|Impurity|Weak|13C Sat.,,1,0.65597550585768937825,0,0
Compound,Artifact|Impurity|Weak|13C Sat.,,1,0.21226458927574259894,0,0
Solvent,None,,1,0.95184475565337645087,0,0
Impurity,Artifact|Weak,,1,-0.27760073076244684565,0,0
Solvent,Artifact|Impurity|Weak|13C Sat.,,1,0.60000000000000008882,0,0
##END=	
##END=	
