##TITLE=	wj320
##JCAMPDX=	6.0	$$ NMR Plug-in v.1.14 of MestReNova 12.0.4-22023
##DATATYPE=	LINK
##BLOCKS=	2
##ORIGIN=	JEOL
##OWNER=	
##TITLE=	wj320
##JCAMPDX=	6.0	$$ NMR Plug-in 1.14 of MestReNova 12.0.4-22023
##BLOCKID=	1
##DATATYPE=	NMRSPECTRUM
##DATACLASS=	XYDATA
##NUMDIM=	1
##ORIGIN=	JEOL
##OWNER=	
##.OBSERVEFREQUENCY=	399.79071365325000897
##.OBSERVENUCLEUS=	^1H
##.SOLVENTNAME=	CHLOROFORM-D
##.PULSESEQUENCE=	proton.jxp
##LONGDATE=	2021/03/16 16:16:14.000
##.ACQUISITIONMODE=	SIMULTANEOUS
##$ORIGINALFORMAT=	JEOL Delta
##$PARAMETERFILE=	(datafile, ASCII, //icnas3.cc.ic.ac.uk/wj320/downloads/wj320_PROTON-1-1.jdf, 0)
$$ 
##$PARAMETERFILE=	(footer, BASE64, //icnas3.cc.ic.ac.uk/wj320/downloads/wj320_PROTON-1-1.jdf, 540672)
AQAAANkdAABoZWFkZXIKICAgIGZpbGVuYW1lICAgICAgICA9PiAid2ozMjBfUFJPVE9OIjsKICAgIHNh
bXBsZV9pZCAgICAgICA9PiAid2ozMjAiOwogICAgY29tbWVudCAgICAgICAgID0+ICIiOwogICAgcHJv
Y2VzcyAgICAgICAgID0+ICJwcm90b25fYXV0b3BoYXNlLmxpc3QiOwogICAgYXV0b19kd2VsbCAgICAg
ID0gIFRSVUU7CiAgICBhdXRvX2ZpbHRlciAgICAgPSAgVFJVRTsKICAgIGF1dG9fZ2FpbiAgICAgICA9
PiBUUlVFOwogICAgZmlsdGVyX2xpbWl0ICAgID0+IDE2OwogICAgZm9yY2VfZHVhbF9tb2RlID0+IEZB
TFNFOwogICAgZGVjaW1hdGlvbl9yYXRlID0gIDA7CiAgICBmb3JjZV90dW5lICAgICAgPT4gRkFMU0U7
CiAgICBzYXZlX2Fib3J0ZWQgICAgPSAgVFJVRTsKICAgIHZlY3RvciAgICAgICAgICA9ICBUUlVFOwpl
bmQgaGVhZGVyOwoKaW5zdHJ1bWVudAogICAgcmVjdnJfZ2FpbiA9PiA0NjsKZW5kIGluc3RydW1lbnQ7
CgphY3F1aXNpdGlvbgogICAgeF9kb21haW4gICAgID0+ICJQcm90b24iOwogICAgeF9vZmZzZXQgICAg
ID0+IDVbcHBtXTsKICAgIHhfc3dlZXAgICAgICA9PiAxNVtwcG1dOwogICAgeF9wb2ludHMgICAgID0+
IDMyNzY4OwogICAgc2NhbnMgICAgICAgID0+IDg7CiAgICB4X3ByZXNjYW5zICAgPT4gMDsKICAgIG1v
ZF9yZXR1cm4gICA9PiAxOwogICAgeF9hY3FfdGltZSAgID0/IHhfcG9pbnRzIC8geF9zd2VlcDsKICAg
IHhfcmVzb2x1dGlvbiA9PyAxIC8geF9hY3FfdGltZTsKZW5kIGFjcXVpc2l0aW9uOwoKcHVsc2UKICAg
IGNvbGxlY3QgQ09NUExFWCxPQlM7CgogICAgbWFjcm8gb2JzX3ByZXNhdF90aW1lKCBkYW50ZV9wcmVz
YXQsIGRhbnRlX2xvb3AsIGRhbnRlX3B1bHNlLCBkYW50ZV9pbnRlcnZhbCwgcGhhc2VfZGFudGUsIHBo
c19zaGZ0LCBkYW50ZV9hdHRlbnVhdG9yLCBwcmVzYXRfdGltZSApIGlzCiAgICAgICAgd2hlbiBkYW50
ZV9wcmVzYXQgZG8KICAgICAgICAgICAgbG9vcCAxMDAgKiBkYW50ZV9sb29wIHRpbWVzCiAgICAgICAg
ICAgICAgICBkYW50ZV9wdWxzZSwgKE9CUy5HQVRFLCBPQlMuUEhTLnBoYXNlX2RhbnRlLmxzdGVwKHBo
c19zaGZ0KSwgT0JTLkFUTi5kYW50ZV9hdHRlbnVhdG9yKTsKICAgICAgICAgICAgICAgIGRhbnRlX2lu
dGVydmFsOwogICAgICAgICAgICBlbmQgbG9vcDsKICAgICAgICBlbmQgd2hlbjsKICAgICAgICB3aGVu
IG5vdCBkYW50ZV9wcmVzYXQgZG8KICAgICAgICAgICAgcHJlc2F0X3RpbWU7CiAgICAgICAgZW5kIHdo
ZW47CiAgICBlbmQgb2JzX3ByZXNhdF90aW1lOwoKICAgIG1hY3JvIGFjcSggZGVhZF90aW1lLCBkZWxh
eSwgcGhhc2UgKSBpcwogICAgICAgIGRlYWRfdGltZSwgT0JTLlBIUy4wOwogICAgICAgIGRlbGF5LCAo
T0JTLlBIUy4wLCBSQ1YuR0FURSk7CiAgICAgICAgYWNxdWlyZSAoT0JTLlBIUy4wLCBSQ1YuUEhTLnBo
YXNlKTsKICAgIGVuZCBhY3E7CgogICAgZXhwZXJpbWVudCAgICAgICAgICAgID0gICJwcm90b24uanhw
IjsKICAgIGNvbW1lbnRfMSAgICAgICAgICAgICA9PyAiKioqIFB1bHNlICoqKiI7CiAgICB4X2FuZ2xl
ICAgICAgICAgICAgICAgPT4gNDVbZGVnXSwgMVtkZWddLT4zNjBbZGVnXSA6IDFbZGVnXSwgaGVscCAi
ZmxpcCBhbmdsZSI7CiAgICB4XzkwX3dpZHRoICAgICAgICAgICAgPT4gNi41W3VzXSwgaGVscCAic2V0
$$ [...]
AAAAAAAAAAAAAAAAAAAAAAAAAAAAAAAAAAAAAAAAAAAAAAAAAAAAAAAAAAAAAAAAAAAAAAAAAAAAAAAA
AAAAAAAAAAAAAAAAAAAAAAAAAAAAAAAAAAAAAAAAAAAAAAAAAAAAAAAAAAAAAAAAAAAAAAAAAAAAAAAA
AAAAAAAAAAAAAAAAAAAAAAAAAAAAAAAAAAAAAAAAAAAAAAAAAAAAAAAAAAAAAAAAAAAAAAAAAAAAAAAA
AAAAAAAAAAAAAAAAAAAAAAAAAAAAAAAAAAAAAAAAAAAAAAAAAAAAAAAAAAAAAAAAAAAAAAAAAAAAAAAA
AAAAAAAAAAAAAAAAAAAAAAAAAAAAAAAAAAAAAAAAAAAAAAAAAAAAAAAAAAAAAAAAAAAAAAAAAAAAAAAA
AAAAAAAAAAAAAAAAAAAAAAAAAAAAAAAAAAAAAAAAAAAAAAAAAAAAAAAAAAAAAAAAAAAAAAAAAAAAAAAA
AAAAAAAAAAAAAAAAAAAAAAAAAAAAAAAAAAAAAAAAAAAAAAAAAAAAAAAAAAAAAAAAAAAAAAAAAAAAAAAA
AAAAAAAAAAAAAAAAAAAAAAAAAAAAAAAAAAAAAAAAAAAAAAAAAAAAAAAAAAAAAAAAAAAAAAAAAAAAAAAA
AAAAAAAAAAAAAAAAAAAAAAAAAAAAAAAAAAAAAAAAAAAAAAAAAAAAAAAAAAAAAAAAAAAAAAAAAAAAAAAA
AAAAAAAAAAAAAAAAAAAAAAAAAAAAAAAAAAAAAAAAAAAAAAAAAAAAAAAAAAAAAAAAAAAAAAAAAAAAAAAA
AAAAAAAAAAAAAAAAAAAAAAAAAAAAAAAAAAAAAAAAAAAAAAAAAAAAAAAAAAAAAAAAAAAAAAAAAAAAAAAA
AAAAAAAAAAAAAAAAAAAAAAAAAAAAAAAAAAAAAAAAAAAAAAAAAAAAAAAAAAAAAAAAAAAAAAAAAAAAAAAA
AAAAAAAAAAAAAAAAAAAAAAAAAAAAAAAAAAAAAAAAAAAAAAAAAAAAAAAAAAAAAAAAAAAAAAAAAAAAAAAA
AAAAAAAAAAAAAAAAAAAAAAAAAAAAAAAAAAAAAAAAAAAAAAAAAAAAAAAAAAAAAAAAAAAAAAAAAAAAAAAA
AAAAAAAAAAAAAAAAAAAAAAAAAAAAAAAAAAAAAAAAAAAAAAAAAAAAAAAAAAAAAAAAAAAAAAAAAAAAAAAA
AAAAAAAAAAAAAAAAAAAAAAAAAAAAAAAAAAAAAAAAAAAAAAAAAAAAAAAAAAAAAAAAAAAAAAAAAAAAAAAA
AAAAAAAAAAAAAAAAAAAAAAAAAAAAAAAAAAAAAAAAAAAAAAAAAAAAAAAAAAAAAAAAAAAAAAAAAAAAAAAA
AAAAAAAAAAAAAAAAAAAAAAAAAAAAAAAAAAAAAAAAAAAAAAAAAAAAAAAAAAAAAAAAAAAAAAAAAAAAAAAA
AAAAAAAAAAAAAAAAAAAAAAAAAAAAAAAAAAAAAAAAAAAAAAAAAAAAAAAAAAAAAAAAAAAAAAAAAAAAAAAA
AAAAAAAAAAAAAAAAAAAAAAAAAAAAAAAAAAAAAAAAAAAAAAAAAAAAAAAAAAAAAAAAAAAAAAAAAAAAAAAA
AAAAAAAAAAAAAAAAAAAAAAAAAAAAAAAAAAAAAAAAAAAAAAAAAAAAAAAAAAAAAAAAAAAAAAAAAAAAAAAA
AAAAAAAAAAAAAAAAAAAAAAAAAAAAAAAAAAAAAAAAAAAAAAAAAAAAAAAAAAAAAAAAAAAAAAAAAAAAAAAA
AAAAAAAAAAAAAAAAAAAAAAAAAAAAAAAAAAAAAAAAAAAAAAAAAAAAAAAAAAAAAAAAAAAAAAAAAAAAAAAA
AAAAAAAAAAAAAAAAAAAAAAAAAAAAAAAAAAAAAAAAAAAAAAAAAAAAAAAAAAAAAAAAAAAAAAAAAAAAAAAA
AAAAAAAAAAAAAAAAAAAAAAAAAAAAAAAAAAAAAAAAAAAAAAAAAAAAAAAAAAAAAAAAAAAAAAAAAAAAAAAA
AAAAAAAAAAAAAAAAAAAAAAAAAAAAAAAAAAAAAAAAAAAAAAAAAAAAAAAAAAAAAAAAAAAAAAAAAAAAAAAA
AAAAAAAAAAAAAAAAAAAAAAAAAAAAAAAAAAAAAAAAAAAAAAAAAAAAAAAAAAAAAAAAAAAAAAAAAAAAAAAA
AAAAAAAAAAAAAAAAAAAAAAAAAAAAAAAAAAAAAAAAAAAAAAAAAAAAAAAAAAAAAAAAAAAAAAAAAAAAAAAA
AAAAAAAAAAAAAAAAAAAAAAAAAAAAAAAAAAAAAAAAAAAAAAAAAAAAAAAAAAAAAAAAAAAAAAAAAAAAAAAA
AAAAAAAAAAAAAAAAAAAAAAAAAAAAAAAAAAAAAAAAAAAAAAAAAAAAAAAAAAAAAAAAAAAAAAAAAAAAAAAA
AAAAAAAAAAAAAAAAAAAAAAAAAAAAAAAAAAAAAAAAAAAAAAAAAAAAAAAAAAAAAAAAAAAAAAAAAAAAAAAA
AAAAAAAAAAAAAAAAAAAAAAAAAAAAAAAAAAAAAAAAAAAAAAAAAAAAAAAAAAAAAAAAAAAAAAAAAAAAAAAA
AAAAAAAAAAAAAAAAAAAAAAAAAAAAAAAAAAAAAAAAAAAAAAAAAAAAAAAAAAAAAAAAAAAAAAAAAAAAAAAA
AAAAAAAAAAAAAAAAAAAAAAAAAAAAAAAAAAAAAAAAAAAAAAAAAAAAAAAAAAAAAAAAAAAAAAAAAAAAAAAA
AAAAAA==
##XUNITS=	HZ
##YUNITS=	ARBITRARY UNITS
##FIRSTX=	4996.5554867314831426
##LASTX=	-998.53400337774598938
##XFACTOR=	-0.11434682122697797935
##YFACTOR=	2.7897971868515014174e-10
##NPOINTS=	52430
##XYDATA=	(X++(Y..Y))
$$ [...]
-7249A1542452n69265m90585m06487l28123k28734j56582p2485P791R1889J76583K45392L26622
$$ 11542452 10973187 10482602 10076115 9747992 9519258 9362676 9290191 9297982 9389871 9566454 9811846 10138468
-7237A0138468L95430M67103N35911N85606O23831O64088P02315P34809P46274P52727P64194
$$ 10138468 10533898 11001001 11536912 12122518 12746349 13410437 14112752 14847561 15593835 16346562 17110756
-7226A7110756P68971P46037P24414O86188O52741O14514N74614N36389M78334M24816L72508
$$ 17110756 17879727 18625764 19350178 20036366 20689107 21303621 21878235 22414624 22892958 23317774 23690282
-7215B3690282L07524K35610J62982P4581J953n1087j23716j98019k63004l32289l97273m79938
$$ 23690282 23997806 24233416 24396398 24470979 24472932 24421845 24298129 24100110 23837106 23504817 23107544 22627606
-7203B2627606n44922o00351o57690o87765p14522p49881p84286p97664q16777q41384q29919
$$ 22627606 22082684 21482333 20824643 20136878 19422356 18672475 17888189 17090525 16273748 15432364 14602445
-7192A4602445q22630q22631q00891p74130p52390p25631o95051o53002o07085n65036n11519
$$ 14602445 13779815 12957184 12156293 11382163 10629773 9904142 9209091 8556089 7949004 7383968 6872449
-7181F872449m54181l97796l40456k91241k41546j86715j44667q7327l7632J5406N7455Q8037
$$ 6872449 6418268 6020472 5680016 5388775 5147229 4960514 4815847 4728520 4690888 4706294 4763749 4851786
-7169D851786J30084J66072K00475K36313K47780K69044K95802L15871L15871L13960L13959
$$ 4851786 4981870 5147942 5348417 5584730 5832510 6101554 6397356 6713227 7029098 7343058 7657017
-7158G657017L24711L24710L24234L12765K97713K86246K70593K51480K36667K02263J64993
$$ 7657017 7981728 8306438 8630672 8943437 9241150 9527396 9797989 10049469 10286136 10488399 10653392
-7147A0653392J30589J07653P3250L8726M323m0593r0287j38548j72951k19779k54183k96350
$$ 10653392 10783981 10891634 10964884 11003610 11007933 10967340 10877053 10738505 10565554 10345775 10091592 9795242
-7135I795242l30755l56557l83316l96218m07684m23215m34682m33129m33130m16645l97531
$$ 9795242 9464487 9107930 8724614 8328396 7920712 7497497 7062815 6629686 6196556 5779911 5382380
-7124E382380l77701l58588l34696l15583k89110k54705k37025k10267j79209j60094j32859
$$ 5382380 5004679 4646091 4311395 3995812 3706702 3451997 3214972 3004705 2825496 2665402 2532543
-7113B532543j06101q2567n5809l9562k8095j815K4945L1633M3102N3823O5291P8669P8671
$$ 2532543 2426442 2343875 2288066 2248504 2220409 2218594 2243539 2275172 2318274 2372097 2437388 2516057 2594728
-7100B594728Q8704Q8704R5156R5155J00680J12148R9963R9963J03547J03547J04264R2796
$$ 2594728 2683432 2772136 2867292 2962447 3063127 3175275 3275238 3375201 3478748 3582295 3686559 3779355
-7088C779355R1422R1422O8486N7019N1045N1045K4527k232j6598k8065n4345o5814q3732
$$ 3779355 3870777 3962199 4030685 4087704 4138749 4189794 4214321 4212089 4195491 4167426 4113081 4047267 3963535
-7075C963535j02845j08579j20047j26199j45312j56302j56303j61439j61439j74818j74818
$$ 3963535 3860690 3752111 3632064 3505865 3360553 3204251 3047948 2886509 2725070 2550252 2375434
-7064B375434j68367j68368j67651j67650j57019j45551j37906j37906j21089j09620r6481
$$ 2375434 2207067 2038699 1871048 1703398 1546379 1400828 1262922 1125016 1003927 894307 797826
-7053G97826q5012q6207o7094n8015m6547l3168k1700j7878j7878q201q202O373J7840K8337
$$ 797826 712814 626607 559513 501498 454951 421783 400083 382205 364327 356126 347924 354297 372137 400474
-7039D00474K8338K9054K9054M3509M3508L7058M8526N4140N4141N4140N4140N3662M2195
$$ 400474 428812 457866 486920 530429 573937 610995 659521 713661 767802 821942 876082 929744 971939
-7026I71939K7621K7620J8251J8251P978P977J2756J288j4481k5948l9925l9925n1392o2861
$$ 971939 999560 1027180 1045431 1063682 1071660 1079637 1092393 1093681 1079200 1053252 1013327 973402 922010 859149
-7012H59149o6205o6206p3851q5318r1277r1276r5099j06567j00953j00951j02386r0918p2164
$$ 859149 792944 726738 652887 567569 476292 385016 289917 183350 82397 -18554 -120940 -211858 -284022
-6999b84022p2163p1447p1446m9706m9705n6156m4688l8361l8361k8087k8087j9129j9128
$$ -284022 -356185 -427632 -499078 -548784 -598489 -654645 -699333 -737694 -776055 -804142 -832229 -851358 -870486
-6986h70486j9128j9128j7366j7366j7366j7366j5933j5932j5216j5216k0502r034r034k0502
$$ -870486 -889614 -908742 -926108 -943474 -960840 -978206 -994139 -1010071 -1025287 -1040503 -1061005 -1070039 -1079073 -1099575
-6972a099575k0024k0024k0740k0741k0233k0233k0233k0233j3544j3543j3544j3543j1748
$$ -1099575 -1119599 -1139623 -1160363 -1181104 -1201337 -1221570 -1241803 -1262036 -1275580 -1289123 -1302667 -1316210 -1327958
-6959a327958j1748j1748j1748j8437j8438j8437j8438j3659j3659j3659j3659q881q881q881
$$ -1327958 -1339706 -1351454 -1363202 -1381639 -1400077 -1418514 -1436952 -1450611 -1464270 -1477929 -1491588 -1500469 -1509350 -1518231
-6945a518231q881o432o432o432o432K169K169K169K169Q141Q142Q142Q141P903P903K169
$$ -1518231 -1527112 -1533544 -1539976 -1546408 -1552840 -1550671 -1548502 -1546333 -1544164 -1536023 -1527881 -1519739 -1511598 -1503695 -1495792 -1493623
-6929a493623K169J1662J1662K106K105M33M33M33M33p32p31p32p32p421p421p422p421j3140
$$ -1493623 -1491454 -1479792 -1468130 -1466024 -1463919 -1463486 -1463053 -1462620 -1462187 -1462919 -1463650 -1464382 -1465114 -1472535 -1479956 -1487378 -1494799 -1507939
-6911a507939j3140j3141j3140j1707j1707j1706j1707j2693j2692j2692j2692j7471j7471
$$ -1507939 -1521079 -1534220 -1547360 -1559067 -1570774 -1582480 -1594187 -1606880 -1619572 -1632264 -1644956 -1662427 -1679898
-6898a679898j7470j7471r896r896r897r896n118n118n118n118K766K766K766K767j01j01
$$ -1679898 -1697368 -1714839 -1724735 -1734631 -1744528 -1754424 -1759542 -1764660 -1769778 -1774896 -1772130 -1769364 -1766598 -1763831 -1763932 -1764033
-6882a764033j01j01O306O305O305O305L438L438L438L438M543M544M543M543R321R322R321
$$ -1764033 -1764134 -1764235 -1757929 -1751624 -1745319 -1739014 -1735576 -1732138 -1728700 -1725262 -1720719 -1716175 -1711632 -1707089 -1697768 -1688446 -1679125
-6865a679125R321L110L110L109L110L946L945L946L946P380P381k177k176K960K960k773
$$ -1679125 -1669804 -1666694 -1663584 -1660475 -1657365 -1653419 -1649474 -1645528 -1641582 -1634202 -1626821 -1628998 -1631174 -1628214 -1625254 -1628027
-6849a628027k774r836r837j9393j9393r598r598r597r598j1061j1061j1061j1061r866r867
$$ -1628027 -1630801 -1640637 -1650474 -1669867 -1689260 -1698858 -1708456 -1718053 -1727651 -1738712 -1749773 -1760834 -1771895 -1781761 -1791628
-6834a791628r866r866p661p660J1453J1453M047M046M047M047O794O794O794O794J0378J0378
$$ -1791628 -1801494 -1811360 -1819021 -1826681 -1815228 -1803775 -1799728 -1795682 -1791635 -1787588 -1780794 -1774000 -1767206 -1760412 -1750034 -1739656
-6818a739656J0378J0377J509J508r960r960L659L658p809p810l360l359Q108Q108R41R40
$$ -1739656 -1729278 -1718901 -1717392 -1715884 -1725844 -1735804 -1732145 -1728487 -1736296 -1744106 -1747466 -1750825 -1742717 -1734609 -1733668 -1732728
-6802a732728R41R41N129N129N129N130M412M412M413M412J2387J2386R18R18K02K02K01K02
$$ -1732728 -1731787 -1730846 -1725717 -1720588 -1715459 -1710329 -1705917 -1701505 -1697092 -1692680 -1680293 -1667907 -1666989 -1666071 -1665869 -1665667 -1665466 -1665264
-6784a665264m233m234m233m233m234m233m233m233J769J770J769J769j933j934R534R534
$$ -1665264 -1669497 -1673731 -1677964 -1682197 -1686431 -1690664 -1694897 -1699130 -1697361 -1695591 -1693822 -1692053 -1693986 -1695920 -1686386 -1676852
-6768a676852J1480J1479J7213J7213P417P418J3151J3152J9244J9243P776P776J0643J0643
$$ -1676852 -1665372 -1653893 -1636680 -1619467 -1612050 -1604632 -1591481 -1578329 -1559085 -1539842 -1532066 -1524290 -1513647 -1503004
-6754a503004M909M909M565M566M565M566l677l677l677l677j4010j4010k5478k5478k2731
$$ -1503004 -1498095 -1493186 -1488621 -1484055 -1479490 -1474924 -1478601 -1482278 -1485955 -1489632 -1503642 -1517652 -1543130 -1568608 -1591339
-6739a591339k2730j1263j1263q727q728k994k994K023K024K023K023o7o7N667N666m009m009
$$ -1591339 -1614069 -1625332 -1636595 -1645322 -1654050 -1657044 -1660038 -1658015 -1655991 -1653968 -1651945 -1652012 -1652079 -1646412 -1640746 -1644755 -1648764
-6722a648764P458P459P563P563P563P564Q279Q280Q280Q280R116R116R116R116J4373J4372
$$ -1648764 -1641306 -1633847 -1626284 -1618721 -1611158 -1603594 -1595315 -1587035 -1578755 -1570475 -1561359 -1552243 -1543127 -1534011 -1519638 -1505266
-6706a505266J4372J4372J6944J6945J6944J6944J8378J8378J8377J8378K1723K1722J4555
$$ -1505266 -1490894 -1476522 -1459578 -1442633 -1425689 -1408745 -1390367 -1371989 -1353612 -1335234 -1313511 -1291789 -1277234
-6693a277234K6023K5904J4436J0135J0135Q03Q02n648n648k1297l2765l7782l7782l5423
$$ -1277234 -1251211 -1225307 -1210871 -1200736 -1190601 -1189798 -1188996 -1194644 -1200292 -1221589 -1254354 -1292136 -1329918 -1365341
-6679a365341l5423l5422l5423k5747k5747k5746k5747j3712j3711p261p261k2670j1203o903
$$ -1365341 -1400764 -1436186 -1471609 -1497356 -1523103 -1548849 -1574596 -1588308 -1602019 -1609280 -1616541 -1639211 -1650414 -1657317
-6665a657317o902k333j3801M834M834j2128o61o61j2128J3614J3614N731J7198J9587Q119
$$ -1657317 -1664219 -1666552 -1680353 -1675519 -1670685 -1682813 -1683474 -1684135 -1696263 -1682649 -1669035 -1663304 -1646106 -1626519 -1618400
-6650a618400J5287J5287J7079J7078J7079J7078K3410K3410J7676J7676J8016J8015K9484
$$ -1618400 -1603113 -1587826 -1570747 -1553669 -1536590 -1519512 -1496102 -1472692 -1455016 -1437340 -1419324 -1401309 -1371825
-6637a371825K9483L1515L1514J3596K5063L6233L6233K5482K5482J5686J5686K307r161n338
$$ -1371825 -1342342 -1310827 -1279313 -1265717 -1240654 -1204421 -1168188 -1142706 -1117224 -1101538 -1085852 -1083545 -1092706 -1098044
-6623a098044j6806k3018l4486m5237l3769m0936m0937l0603l0604l0603l0604k9767k9767
$$ -1098044 -1114850 -1137868 -1172354 -1217591 -1251360 -1292296 -1333233 -1363836 -1394440 -1425043 -1455647 -1485414 -1515181
-6610a515181k4034k4033k8509k8509j7041j7042j4055j4055j4055j4054r396r396k229j3697
$$ -1515181 -1539215 -1563248 -1591757 -1620266 -1637307 -1654349 -1668404 -1682459 -1696514 -1710568 -1719964 -1729360 -1731589 -1745286
-6596a745286j750R717K549K550K95K95K95K95O506O507O507O506J5825J5824J5824J5825
$$ -1745286 -1747036 -1737319 -1734770 -1732220 -1731925 -1731630 -1731335 -1731040 -1724534 -1718027 -1711520 -1705014 -1689189 -1673365 -1657541 -1641716
-6580a641716J7258J7257J7258J7258L0529L0529L7696K6228K7662L9130L1245L1246K7542
$$ -1641716 -1624458 -1607201 -1589943 -1572685 -1542156 -1511627 -1473931 -1447703 -1420041 -1380911 -1349666 -1318420 -1290878
-6567a290878J6075K1808K1808J9420P951R385R385P832J9299K2406K2406L0409L0409M3789
$$ -1290878 -1274803 -1252995 -1231187 -1211767 -1203816 -1194431 -1185046 -1177214 -1157915 -1135509 -1113103 -1082694 -1052285 -1008496
-6553a008496M3788M2236M2236M2235M2236L2679L2679L2679L2679L6539L6539L0805L0805
$$ -1008496 -964708 -922472 -880236 -838001 -795765 -763086 -730407 -697728 -665049 -628510 -591971 -561166 -530361
-6540e30361K8535K8536J8261q51j6022j6022k2951k2950j6859j6858j7575j7575l3568m5035
$$ -530361 -501826 -473290 -455029 -455880 -471902 -487924 -510875 -533825 -550684 -567542 -585117 -602692 -636260 -681295
-6526f81295n5787n5786o9286o9285n9728n9729m7305m7305l7748l7749l7271l7270k7714
$$ -681295 -737082 -792868 -862154 -931439 -991167 -1050896 -1098201 -1145506 -1183254 -1221003 -1258274 -1295544 -1323258
-6513a323258k7714k6348k6348r624k1091l1604k0136j0102j0101p235p235j2251j2252o279
$$ -1323258 -1350972 -1377320 -1403668 -1413292 -1434383 -1465987 -1486123 -1496225 -1506326 -1513561 -1520796 -1533047 -1545299 -1551578
-6499a551578N189M472M472J501J500q056q055r968r967k3346k3347j8210j8209k3944k3944
$$ -1551578 -1546389 -1541917 -1537445 -1535944 -1534444 -1542500 -1550555 -1560523 -1570490 -1593836 -1617183 -1635393 -1653602 -1677546 -1701490
-6484a701490j1878j1879o144o145j3274j3275j3275j3274n033n032M525M524J239J240O973
$$ -1701490 -1713368 -1725247 -1731391 -1737536 -1750810 -1764085 -1777360 -1790634 -1795667 -1800699 -1796174 -1791650 -1790411 -1789171 -1782198
-6469a782198O973J001J000J001J000L644L643L644L643O0N9o391N077J852J852K568K568
$$ -1782198 -1775225 -1774224 -1773224 -1772223 -1771223 -1767579 -1763936 -1760292 -1756649 -1756589 -1756530 -1762921 -1757844 -1755992 -1754140 -1751572 -1749004
-6452a749004M002M002M002M002N420N420N421N420R721R721R720R721J9696J9695J9696J9695
$$ -1749004 -1745002 -1741000 -1736998 -1732996 -1727576 -1722156 -1716735 -1711315 -1701594 -1691873 -1682153 -1672432 -1652736 -1633041 -1613345 -1593650
-6436a593650K6266K6266K0531L2000M4050N5517N3607O5074P1884Q3351J02464J02465J02046
$$ -1593650 -1567384 -1541118 -1520587 -1488587 -1444537 -1389020 -1335413 -1270339 -1198455 -1115104 -1012640 -910175 -808129
-6423h08129J02046Q6756P5288O7165N5697N4502M3034K0909K0909J6369M902K034r433k9263
$$ -808129 -706083 -619327 -544039 -476874 -421177 -366675 -323641 -302732 -281823 -265454 -260552 -258518 -267951 -297214
-6409b97214k9264m5091n6559n5843n5842o8266o8266p9018r0485q4437q4438r7339r7339
$$ -297214 -326478 -371569 -428128 -483971 -539813 -608079 -676345 -755363 -845848 -930285 -1014723 -1112062 -1209401
-6396a209401q9932p0820n4812m3344l3698k2231j0762j0762j2674j2674P06P06j707j705
$$ -1209401 -1299333 -1370153 -1424965 -1468309 -1502007 -1524238 -1535000 -1545762 -1558436 -1571110 -1570404 -1569698 -1571405 -1573110
-6382a573110P850P851L311L311L311L312M475M476M476M476N34N34o634M834L625p843o410
$$ -1573110 -1565260 -1557409 -1554098 -1550787 -1547476 -1544164 -1539689 -1535213 -1530737 -1526261 -1525727 -1525193 -1531827 -1526993 -1523368 -1531211 -1537621
-6365a537621o409M1M1r516r515m020m021m020m021l17l18l17l17m222m222m222m222k789
$$ -1537621 -1544030 -1543989 -1543948 -1553464 -1562979 -1566999 -1571020 -1575040 -1579061 -1579378 -1579696 -1580013 -1580330 -1584552 -1588774 -1592996 -1597218 -1600007
-6347a600007k789k788k789K229K228K229K229L662L662L662L662O753O753O753O753K692
$$ -1600007 -1602796 -1605584 -1608373 -1606144 -1603916 -1601687 -1599458 -1595796 -1592134 -1588472 -1584810 -1578057 -1571304 -1564551 -1557798 -1555106
-6331a555106K692R142k326P500P499O783O783J0845J0844M394J5862K0494K0494K1928K1928
$$ -1555106 -1552414 -1543272 -1545598 -1538098 -1530599 -1523816 -1517033 -1506188 -1495344 -1490950 -1475088 -1454594 -1434100 -1412172 -1390244
-6316a390244M4386N5854N0119N0120N9467P0936P6430Q7898R4349Q2881R5782R5782Q5210
$$ -1390244 -1345858 -1290004 -1239885 -1189765 -1130298 -1059362 -982932 -895034 -800685 -717804 -622022 -526240 -441030
-6303d41030Q5211P9476P9477O8247O8247M8418M8416M8059L6592K2734J1266l307l308j6687
$$ -441030 -355819 -276343 -196866 -128619 -60372 -11954 36462 84521 121113 143847 155113 151806 148498 131811
-6289A31811k8154m6424m6424n9802p1272o8523o8524q0708q0708o8524o8524o9240n7772
$$ 131811 103657 57233 10809 -48993 -120265 -188788 -257312 -338020 -418728 -487252 -555776 -625016 -682788
-6276f82788n4787n4786m8335m8335k6848k6848k1114k1114j6456j6455m987m988L29L28n405
$$ -682788 -737575 -792361 -840696 -889031 -915879 -942727 -963841 -984955 -1001411 -1017866 -1022853 -1027841 -1027512 -1027184 -1032589
-6261a032589n406j463j463p47p46j1379R0Q06j0661p795L673P974P974J0900J0901J0900
$$ -1032589 -1037995 -1039458 -1040921 -1041668 -1042414 -1053793 -1053703 -1052897 -1063558 -1071353 -1067680 -1059706 -1051732 -1040832 -1029931 -1019031
-6245a019031J0901K0218K0218K0218K0218J7784J7785J7067J7068K9013J7545J7545K9013
$$ -1019031 -1008130 -987912 -967694 -947476 -927258 -909474 -891689 -874622 -857554 -828541 -810996 -793451 -764438
-6232g64438K3757K3758K3757K3757Q227l240L210L211M78M78M77M78j1587j1588j1587j1587
$$ -764438 -740681 -716923 -693166 -669409 -661182 -664422 -661212 -658001 -657523 -657045 -656568 -656090 -667677 -679265 -690852 -702439
-6216g02439M181M181R915R915P16P17K6281J4812O914O914j2200j2200r093K374P391P392
$$ -702439 -698258 -694077 -684162 -674247 -673531 -672814 -646533 -631721 -624807 -617893 -630093 -642293 -651386 -649012 -641621 -634229
-6200f34229J8172J8173O704O705J9606J9606Q138Q138J1273J1274K2742K2741K9193K9192
$$ -634229 -616057 -597884 -591180 -584475 -564869 -545263 -537125 -528987 -517714 -506440 -483698 -460957 -431764 -402572
-6186d02572K9193K9192K2951K2950J0288J0289P541j1573k6863k6863k7818j6351j7068j7067
$$ -402572 -373379 -344187 -321236 -298286 -287998 -277709 -270168 -281741 -308604 -335467 -363285 -379636 -396704 -413771
-6172d13771l688l688K762K762o316N152J0169J0168K643K643q825q824m338m338m338m338
$$ -413771 -417459 -421147 -418385 -415623 -421939 -416787 -406618 -396450 -393807 -391164 -399989 -408813 -413151 -417489 -421827 -426165
-6156d26165l621l621Q564Q563J3940K5407L8069L8070L3171L3172L3172L3172L4306L4307
$$ -426165 -429786 -433407 -424843 -416280 -402340 -376933 -338864 -300794 -267623 -234451 -201279 -168107 -133801 -99494
-6142i9494K9289K9290L0962M2428N3898M2430M3505M3504L6338L6337L1798K0330K1047K1047
$$ -99494 -70205 -40915 -9953 32475 86373 128803 172308 215812 252150 288487 320285 340615 361662 382709
-6128C82709K1491K1491K2208K2208K5911L7379M1679M1679M5025L3556K7344J5877J4204
$$ 382709 404200 425691 447899 470107 496018 533397 575076 616755 661780 695336 722680 738557 752761
-6115G52761J4204J8505K9973M0126M0126N3506O4974P9308P9308Q0025Q0026P0946P0946
$$ 752761 766965 785470 815443 855569 895695 949201 1014175 1093483 1172791 1252816 1332842 1403788 1474734
-6102A474734N9479N9478N2789N2789M7772L6304J9426J9427J3693K225k434k434q885q885
$$ 1474734 1534213 1593691 1646480 1699269 1747041 1783345 1802771 1822198 1835891 1838116 1835682 1833248 1824363 1815478
-6088A815478l986l987l987l987k3219k3220l5882m7350m9828m9829l8360l8361k4146j2677
$$ 1815478 1811492 1807505 1803518 1799531 1776312 1753092 1717210 1669860 1620032 1570203 1531843 1493482 1469336 1456659
-6074A456659Q347Q347O436J7903K4833J3364J3364L2478L2835L2836N2476N8209O1435Q0547
$$ 1456659 1465006 1473353 1479789 1497692 1522525 1535889 1549253 1581731 1614566 1647402 1699878 1758087 1819522 1900069
-6060A900069Q8074Q8073Q3176R4644J09576J15309J12802J24269J35856J47324J68230J73963
$$ 1900069 1988143 2076216 2159392 2254036 2363612 2478921 2591723 2715992 2851848 2999172 3167402 3341365
-6048C341365J88910K08024K20088K39202K53059K64527K94152L20911L57464L91868M12892
$$ 3341365 3530275 3738299 3958387 4197589 4450648 4715175 5009327 5330238 5687702 6079570 6492462
-6037F492462M54942N03441N53135O08086O57781P45103Q55959R65859J114943J307986J533520
$$ 6492462 6947404 7450845 8003980 8612066 9269847 10014950 10870909 11836768 12951711 14259697 15793217
-6026A5793217J792982K102615K463375K872396L309131L779318M305881M860165N428783
$$ 15793217 17586199 19688814 22152189 25024585 28333716 32113034 36418915 41279080 46707863
-6017D6707863O005995O597629P151902P627826P990975Q214949Q310525Q302399Q267995
$$ 46707863 52713858 59311487 66463389 74091215 82082190 90297139 98607664 106910063 115178058
-6008A15178058Q270506Q327844Q464982Q652289Q827764Q885129Q730766Q237643P333146
$$ 115178058 123448564 131776408 140241390 148893679 157721443 166606572 175337338 183574981 190908127
-5999A90908127O106074M705558L272084J921495Q01449L9793l15698m31925n19856p42535
$$ 190908127 197014201 201719759 204991843 206913338 207714787 207754580 207438882 207006957 206487101 205744566
-5989B05744566j281513k233333l590400n221207o884062q389323r593466j0344629j0539559
$$ 205744566 204463053 202229720 198639320 193418113 186534051 178144728 168551262 158206633 147667074
-5980A47667074j0276513r768114r185644q661943q289828q049008p893709p782851p635444
$$ 147667074 137390561 127622447 118436803 109774860 101485032 93436024 85542315 77759464 70124020
-5971G0124020p371677o925872o348646n704385n027778m360249l737165l193871k708396
$$ 70124020 62752343 55826471 49477825 43773440 38745662 34385413 30648248 27454377 24745981
-5962B4745981k312277j987353j722995j528041j383735j272880j190454j133115j073864
$$ 24745981 22433704 20446351 18723356 17195315 15811580 14538700 13348246 12215131 11141267
-5953A1141267j016525r68712r03727q22975p50344o74370o17030n66857n01873m41787m15028
$$ 11141267 10124742 9156030 8252303 7429328 6678984 6004614 5387584 4820727 4318854 3877067 3462039
-5942C462039l81102l39053l12533k85776k52805k18401j95977j69219j51539j40071j18091
$$ 3462039 3080937 2741884 2429351 2143575 1890770 1672369 1476392 1307173 1155634 1015563 897472
-5931H97472j06623j02083j02084r2885q1418q9063o9949o5291o5291o5530n4062m4773n6242
$$ 897472 790849 688766 586682 493797 412379 323316 253367 188076 122785 57255 3193 -41580 -97822
-5918i7822n5525m4057l8443l8443l7726l7726k9035k9036k8319k8319l3336k1868k8319k8318
$$ -97822 -153347 -197404 -235847 -274290 -312016 -349742 -378777 -407813 -436132 -464451 -497787 -519655 -547974 -576292
-5904e76292j4410j4409j4410j4410l897l897l897l898j2229j2230j2946j2946j0438k1905
$$ -576292 -590702 -605111 -619521 -633931 -637828 -641725 -645622 -649520 -661749 -673979 -686925 -699871 -710309 -732214
-5890g32214j4738j4738k2697j1229K150r317l584l584m300m301P407P406M301p168J2185
$$ -732214 -746952 -761690 -784387 -795616 -793466 -802783 -806367 -809951 -814251 -818552 -811145 -803739 -799438 -806606 -794421
-5875g94421J2184J2185J2185R571K1040K7967K7968K6057K6057L9435L9436M1258M1257M1258
$$ -794421 -782237 -770052 -757867 -748296 -727256 -699289 -671321 -645264 -619207 -579772 -540336 -499078 -457821 -416563
-5861d16563M1257K5848K5847K5848K5847J2663J2662J2663J2662J4813J4813P645J9113K8998
$$ -416563 -375306 -349458 -323611 -297763 -271916 -259253 -246591 -233928 -221266 -206453 -191640 -183995 -164882 -135884
-5847a35884J7531J8247K9715M0108M0106L4374M5842N1960N1960O2234O2233O4503O4503
$$ -135884 -118353 -100106 -70391 -30283 9823 44197 90039 141999 193959 256193 318426 382929 447432
-5834D47432N4947N4946M5271M5271M2164L0697L1891L1892K2334K2335K3709L5176L6371
$$ 447432 502379 557325 602596 647867 690031 720728 752619 784511 806845 829180 852889 888065 924436
-5821I24436M7839N1184O2651P4120P4119R4397R4398J17333J28801J29398J40866J41583
$$ 924436 972275 1023459 1086110 1160230 1234349 1328746 1423144 1540477 1669278 1798676 1939542 2081125
-5809B081125J60696J80743J80742K09412K09412K12877K24344K32468K55403K73650K85119
$$ 2081125 2241821 2422564 2603306 2812718 3022130 3235007 3459351 3691819 3947222 4220872 4505991
-5798D505991L10682L33617L70172L93107M35157M88673N28094N81611O57108P25915Q18137
$$ 4505991 4816673 5150290 5520462 5913569 6348726 6837399 7365493 7947104 8604212 9330127 10148264
-5787A0148264R32814J070430J230981J434177J701760K021907K411815K870530L413343M027833
$$ 10148264 11081078 12151508 13382489 14816666 16518426 18540333 20952148 23822678 27236021 31263854
-5777C1263854M738840N528863O377489P300651Q256311R200981J0080180J0841837J1476404
$$ 31263854 36002694 41531557 47909046 55209697 63466008 72666989 82747169 93589006 105065410
-5768A05065410J1916968J2123377J2127195J1981939J1709105J1258018J0646412R920114
$$ 105065410 116982378 129105755 141232950 153214889 164923994 176182012 186828424 196748538
-5760A96748538R006497P913212O727242N542220M331398L069943J809421O85583l05549j307098
$$ 196748538 205755035 213668247 220395489 225937709 230269107 233339050 235148471 235834054 235528505 234221407
-5750B34221407k386976l587302m934739o471474q065492r556331j0915734j2131349j3140494
$$ 234221407 231834431 228247129 223312390 216840916 208775424 199219093 188303359 176172010 163031516
-5741A63031516j3820951j4107164j4084210j3809006j3250893j2457161j1501495j0338466
$$ 163031516 149210565 135103401 121019191 107210185 93959292 81502131 70000636 59662170
-5733E9662170r046410p740034o463271n301193m284375l435480k739761k198860j763081
$$ 59662170 50615760 42875726 36412455 31111262 26826887 23391407 20651646 18452786 16689705
-5724A6689705j407574j139992r15411p24281n52141m22174k87425j57456o0934K3163J04395
$$ 16689705 15282131 14142139 13226728 12502447 11950306 11528132 11240707 11083251 11022317 11045480 11149875
-5713A1149875J73201K22765K60992K94679L06147K95394K95396K65531K27305J80058J41834
$$ 11149875 11323076 11545841 11806833 12101512 12407659 12703053 12998449 13263980 13491285 13671343 13813177
-5702A3813177R4050K5243k2541o0765j20018j88825k57483l26288m13256m82062n50869o04386
$$ 13813177 13907227 13932470 13909929 13849164 13729146 13540321 13282838 12956550 12543294 12061232 11510363 10905977
-5690A0905977o51931o90156o93143o81675o75463o63995o22902n84677n51227n13001m65204
$$ 10905977 10254046 9563890 8870747 8189072 7513609 6849614 6226712 5642035 5090808 4577807 4112603
-5679D112603m15509l70833l36429l12537k85779k67383k48269k30231k30232k17330j90571
$$ 4112603 3697094 3326261 2989832 2677295 2391516 2124133 1875864 1645633 1415401 1198071 1007500
-5668A007500j78148j78148j59752j40638j20286j08818r7350p8236o7486n6018m0250k8781
$$ 1007500 829352 651204 491452 350814 230528 121710 24360 -53876 -121362 -177380 -217630 -246411
-5656b46411l4576k3107k8842k8841j1281j1282j1281j1281k998k997K736K736j7452j7452
$$ -246411 -280987 -304094 -332936 -361777 -373058 -384340 -395621 -406902 -409900 -412897 -410161 -407425 -424877 -442329
-5642d42329k8920k8919l1399l1398l1399l1399l7610l7610l7611l7610k7442k7441j5974
$$ -442329 -471249 -500168 -531567 -562965 -594364 -625763 -663373 -700983 -738594 -776204 -803646 -831087 -847061
-5629h47061j5974j5256j5257k6725k6725j0747j0748P21P20j191j191J0277J0278n186n185
$$ -847061 -863035 -878291 -893548 -920273 -946998 -957745 -968493 -967772 -967052 -968243 -969434 -959157 -948879 -954065 -959250
-5614i59250k4298k4299k1670k1670k1670k1671k2327k2327l214l214j423j422j422j423K386
$$ -959250 -983548 -1007847 -1029517 -1051187 -1072857 -1094528 -1116855 -1139182 -1142396 -1145610 -1147033 -1148455 -1149877 -1151300 -1148914
-5599a148914K385l348l349j3024j3025j557j556r00r00J0569J0568J3196J3196J3197J3196
$$ -1148914 -1146529 -1149877 -1153226 -1166250 -1179275 -1180832 -1182388 -1183288 -1184188 -1173619 -1163051 -1149855 -1136659 -1123462 -1110266
-5584a110266P514P515K6628K6628J9579J9580Q112Q112N544N543j90j91j2494j2495j2494
$$ -1110266 -1102752 -1095237 -1068609 -1041981 -1022402 -1002822 -994710 -986598 -981054 -975511 -975701 -975892 -988386 -1000881 -1013375
-5569a013375j2495P81P80P80P80R501R500K0969K0968J2786J2786P768K6882K2939K2940
$$ -1013375 -1025870 -1025089 -1024309 -1023529 -1022749 -1013248 -1003748 -982779 -961811 -949025 -936239 -928471 -901589 -878650 -855710
-5554h55710K4134K4134K2700K2701J1233J1232K991K990k744k744p72p73J0695J0695J3921
$$ -855710 -831576 -807442 -784742 -762041 -750808 -739576 -736585 -733595 -736339 -739083 -739855 -740628 -729933 -719238 -705317
-5539g05317J3920K4672N558o83o83j3346j3345r284r284K183K184p014p015M454M453j758
$$ -705317 -691397 -666725 -661167 -661850 -662533 -675879 -689224 -698508 -707792 -705609 -703425 -710439 -717454 -713000 -708547 -710305
-5523g10305j758R710R709J1225J1226K2693K2693L0219L0219L5953L5953N8709N8710O4921
$$ -710305 -712063 -702353 -692644 -681419 -670193 -647500 -624807 -594588 -564369 -528416 -492463 -433754 -375044 -310123
-5509c10123P6389Q2959J02073J14017J25486J62309J89067K17737K75076L27160L69208M18425
$$ -310123 -233734 -150775 -48702 65315 190801 353110 542177 759914 1034990 1362150 1731358 2149783
-5497B149783M68119N07541N34298N77542N77542N55322N20919M42317L16170J41680n3275
$$ 2149783 2617902 3125443 3659741 4237283 4814825 5370147 5891066 6333383 6649553 6791233 6737958
-5486F737958k68297m55606n93698o81619p04077o62028n88323n00402m01014l20740k43330
$$ 6737958 6469661 6014055 5420357 4738738 4034661 3372633 2784310 2283908 1882894 1562154 1318824
-5475A318824j78346j30085p2746l8103j8990N141K4253L7633L7633N1012N1012N9792P1260
$$ 1318824 1140478 1010393 937647 899544 880554 885695 909948 947581 985214 1036226 1087238 1147030 1218290
-5462A218290Q2011J01124J12114J31228J43173J54641J74027J93139K17988K37100K74370
$$ 1218290 1300301 1401425 1513539 1644767 1787940 1942581 2116608 2309747 2527735 2764835 3039205
-5451C039205L31711L83316M40655N01638N66622O23007O80346P28846P78540Q14138Q14138
$$ 3039205 3370916 3754232 4194887 4696525 5263147 5886154 6566500 7295346 8073886 8888024 9702162
-5440I702162P79690O99414N81152M39714K72952J16225l5726j77161l05700m47135n84273
$$ 9702162 10481852 11181266 11762418 12202132 12475084 12591309 12555583 12378422 12072722 11625587 11041314
-5429A1041314p18064q27488q92472r07285q65236p72974o54472n23070l89277k55963j45107
$$ 11041314 10323250 9495762 8603290 7696005 6830769 6057795 5403323 4880253 4490976 4235013 4089906
-5418D089906m5718M9847J29346K01976K67438L17133L51297L85701M07443M07442L74682
$$ 4089906 4044188 4094035 4223381 4425357 4692795 5009928 5361225 5746926 6154369 6561811 6936493
-5407F936493L09696K20104R3957o7550k24277l50663m38583m84455m84455m26399l30833
$$ 6936493 7246189 7466293 7560250 7492700 7268423 6917760 6479177 5994722 5510267 5083868 4753035
-5396D753035k06358j03148J6788J35289K35901L23823L96930M77205N51747O09086O75743
$$ 4753035 4546677 4443529 4460317 4595606 4831507 5155330 5552260 6029465 6581212 7190298 7866041
-5385G866041P33083P66411P66412P11700O16133M76370L34931K09502J21581R9288R9288
$$ 7866041 8599124 9365535 10131947 10843647 11459780 11936150 12271081 12480583 12602164 12701452 12800740
-5374A2800740J27240J46354J13623K5701j02356k66729m35223n53726o03419n69016m74883
$$ 12800740 12927980 13074334 13187957 13213658 13111302 12844573 12409350 11855624 11252205 10683189 10208306
-5363A0208306l33446j54261M8339K18297L36798M15641M34753L96049L08129K00139O6348
$$ 10208306 9874860 9720599 9768938 9987235 10324033 10739674 11174427 11570476 11878605 12078744 12145092
-5352A2145092p0253k04044l11555l99477m95041n90607o78768p28461p64164p64163p08020
$$ 12145092 12074839 11870795 11559240 11159763 10664722 10074115 9395347 8666886 7902722 7138559 6430539
-5341F430539o27744n16171l74733k40941j14795P589J33737K47458L58316M73951N69516
$$ 6430539 5802795 5286624 4911891 4670950 4556155 4563744 4697481 4944939 5303255 5777206 6346722
-5330F346722O65559P53480Q37533R17808R81838J031531J044433J010030R31186P97396O09848
$$ 6346722 7012281 7765761 8603294 9521102 10502940 11534471 12578904 13588934 14520120 15317516 15927364
-5319A5927364M14893K30930Q1847l7611j33176k08673l04239m33940n83022p11557q07124
$$ 15927364 16342257 16573187 16655034 16617423 16484247 16275574 15971335 15537395 14954373 14242816 13435692
-5308A3435692q37227p79887o58519m63565k42599l2354J73590L22672M07129M41532M09996
$$ 13435692 12598465 11818578 11160059 10696494 10453895 10421541 10595131 10917803 11324932 11766464 12176460
-5297A2176460L37365K47795J67520R2979N0931J8318l1376j09740k20598l87089n66753p31127
$$ 12176460 12513825 12761620 12929140 13022119 13073050 13091368 13059992 12950252 12729654 12342565 11775812 11044685
-5285A1044685q64919r36353r24886q53212p34710n98172m41442k89971j48534p335J18811
$$ 11044685 10179766 9243413 8318527 7465315 6730605 6132433 5690991 5401020 5252486 5245151 5363962
-5274E363962K33968L44824M24742M97371N67373O17067O58161O58161O18739N38465L93832
$$ 5363962 5597930 5942754 6367496 6864867 7432240 8049307 8707468 9365629 9984368 10522833 10916665
-5263A0916665J83586n3415l17178n67321p46984q35622q35622p51882o18090m33410k46101
$$ 10916665 11100251 11046836 10729658 10162337 9415353 8579731 7744109 6992227 6374137 5940727 5694626
-5252E694626o7392J19917K73299M07091N31880O42735P38780Q19054Q84995R19398R22266
$$ 5694626 5627234 5747151 6020450 6427541 6959421 7602156 8340936 9159990 10044985 10964383 11886649
-5241A1886649Q64926P63388O14305M26040K23442K6574j30152k45787l33707m21295n09217
$$ 11886649 12751575 13514963 14129268 14555308 14778750 14805324 14675172 14429385 14095678 13674383 13165166
-5230A3165166o19117p45263q51820r32094r73188r54075q85387p74530o46951n20803m04452
$$ 13165166 12546049 11800786 10948966 10016872 9043684 8089609 7204222 6429692 5782741 5261938 4857486
-5219D857486l16532k41513j84173j42990j16232r2818p3705n9848l3089j0632j0632N017
$$ 4857486 4540954 4299441 4115268 3972278 3856046 3763228 3689523 3629675 3596586 3585954 3575322 3580339
-5207C580339N017J0751J0751J2663J2663J6963K8430L5882N4996P5541J02300J34315J61073
$$ 3580339 3585356 3596107 3606858 3619521 3632184 3649147 3677577 3713459 3768455 3843996 3946296 4080611 4241684
-5194D241684K05511K47561K89728L39422L83384M10141M36660M71065M88744M61986M17607
$$ 4241684 4447195 4694756 4984484 5323906 5707290 6117431 6554091 7025156 7513900 7975886 8393493
-5183H393493L44978K09274L7256j62477l80367n83682p40411q13280q13279p67647o72081
$$ 8393493 8738471 8947745 8985001 8822524 8442157 7858475 7118064 6304784 5491505 4723858 4051777
-5172D051777n60986m34839l37840k42274j62813j05473n2912j8508L710J5179L6919M8388
$$ 4051777 3490791 3055952 2718112 2475838 2313025 2207552 2154640 2136132 2139842 2155021 2191940 2240328
-5160B240328N3166N3166N0060L8592K7244J5776K396r071k2062l3531k7079k7079l3172k1704
$$ 2240328 2293494 2346660 2396720 2435312 2462556 2478332 2480728 2471657 2449595 2416064 2388985 2361906 2328734 2307030
-5146B307030k2420k2421j7284j7284k4213l5680m5954m5954n6226n6227o2055o2054o0621
$$ 2307030 2284610 2262189 2244905 2227621 2203408 2167728 2121774 2075820 2019594 1963367 1901312 1839258 1778637
-5133A778637p2089q5706p4239p4956p4956o3756n2289m4165l2698j6929j6930p372p373l072
$$ 1778637 1706548 1620842 1546603 1471647 1396691 1332935 1280646 1236481 1203783 1186854 1169924 1162552 1155179 1152107
-5119A152107j4541k1468k1469k0513k0513j0957j0956m834m834Q99R00O394O395K4791K4791
$$ 1152107 1137566 1116098 1094629 1074116 1053603 1042646 1031690 1026856 1022022 1022921 1023821 1030215 1036610 1061401 1086192
-5104A086192L5572N4686O8781O8781Q2399Q2400R6256J07725J13577J02110R5181R5181P9174
$$ 1086192 1121764 1176450 1245231 1314012 1396411 1478811 1575067 1682792 1796369 1898479 1993660 2088841 2168015
-5091B168015O7707O3405N1938M3859M3860L7409L7408L0958L0959M6965L5497L2033L2034
$$ 2168015 2235722 2299127 2351065 2394924 2438784 2476193 2513601 2544559 2575518 2622483 2657980 2690013 2722047
-5078B722047L5856L5855K6539P424j892j3361l7591o4350q6331j05443r7081q5614j02815
$$ 2722047 2757903 2793758 2820297 2827721 2825829 2812468 2774877 2710527 2624196 2518753 2421672 2336058 2233243
-5065B233243j02816j03890j03890r0512r0511q1910q1910q2627p1160n2553n2554m0369k8901
$$ 2233243 2130427 2026537 1922647 1832135 1741624 1659714 1577804 1495177 1424017 1371464 1318910 1278541 1249640
-5052A249640j3133j665R803R803J5178J5179K2107L3575M3968M3967M3968N5436O1565O1565
$$ 1249640 1236507 1234842 1244645 1254448 1269626 1284805 1306912 1340487 1384455 1428422 1472390 1527826 1589391 1650956
-5038A650956O2282O2282P8887P8886P8887P8886Q8443Q8444Q8443Q8443J02658J02659J19860
$$ 1650956 1713238 1775520 1854407 1933293 2012180 2091066 2179509 2267953 2356396 2444839 2547497 2650156 2770016
-5025B770016J19860J10588J10587J08438J08437P8932M4527P496k6908n2113p1226p6005
$$ 2770016 2889876 3000464 3111051 3219489 3327926 3406858 3451385 3458881 3431973 3379860 3308634 3232629
-5013C232629p6005q2694q2694r2251r2251r5584r5584q6028q6028p7427p7427n2580n2580
$$ 3232629 3156624 3073930 2991236 2898985 2806734 2711150 2615566 2529538 2443510 2366083 2288656 2236076 2183496
-5000B183496m4218m4217l0839l0839k7852k7852j8296j8295m080m081m080m080n036n036
$$ 2183496 2139278 2095061 2064222 2033383 2005531 1977679 1959383 1941088 1937008 1932927 1928847 1924767 1919731 1914695
-4986A914695n036n035Q17Q18K1842K1841M5137M5136N0870N0870N7739N7739M4360M4359
$$ 1914695 1909659 1904624 1905441 1906259 1928101 1949942 1995079 2040215 2091085 2141955 2199694 2257433 2301793 2346152
-4972B346152L5281L5281M4838M4837O5145O5146P3268Q4736J05522J24635J24874J24873
$$ 2346152 2381433 2416714 2461552 2506389 2571534 2636680 2709948 2794684 2900206 3024841 3149715 3274588
-4960C274588J37328J48795J55723J74837J75076J63608J26814P7121J266q6655j54506j96556
$$ 3274588 3411916 3560711 3716434 3891271 4066347 4229955 4356769 4433890 4435156 4348501 4193995 3997439
-4948C997439k03006j76248j40889j14130q9033o9920m5789k6677k6556k6557k5363k5362
$$ 3997439 3794433 3618185 3477296 3363166 3274133 3204213 3158424 3131747 3105191 3078634 3053271 3027909
-4936C027909p682p683J874J874L0305L0305L9861L9861L4053L4053L4053L4052L3575L3576
$$ 3027909 3020227 3012544 3014418 3016292 3046597 3076902 3116763 3156624 3190677 3224730 3258783 3292835 3326410 3359986
-4922C359986N0776N0777O4097O4095O4097O4096P0547P0547O0990O0991M2661M2661M2661
$$ 3359986 3410762 3461539 3525636 3589731 3653828 3717924 3788471 3859018 3920008 3980999 4023660 4066321 4108982
-4909D108982M2661M6365M6364O4282O4284O0878P2346Q4292R5760J08422J08423J22518J22518
$$ 4108982 4151643 4198008 4244372 4308654 4372938 4433816 4506162 4590454 4686214 4794636 4903059 5025577 5148095
-4896E148095J27998J27999J21547J21548J30149J18680J19399J19397J08287J08289Q2007
$$ 5148095 5276093 5404092 5525639 5647187 5777336 5896016 6015415 6134812 6243099 6351388 6433395
-4885F433395O2894M7365L5897M9754P6512J02143J44193J95320K45014K99247L56588M26350
$$ 6433395 6496289 6543654 6579551 6629305 6705817 6807960 6952153 7147473 7392487 7691734 8048322 8474672
-4873H474672M98980N59903O24889O75060P24753P69910P89022Q02879P91411P39583O44016
$$ 8474672 8973652 9533555 10158444 10833504 11558257 12328167 13117189 13920068 14711479 15451062 16095078
-4862A6095078M98756L03802N4615j93858m19391n99056o79928o99040o48869n30368l99682
$$ 16095078 16593834 16897636 16952251 16758393 16339002 15739946 15060018 14360978 13712109 13181741 12782059
-4851A2782059k65888j44521m8956L2321R7305J56556K06251K24168K43283K57378K76491
$$ 12782059 12516171 12371650 12322694 12355015 12452320 12608876 12815127 13039295 13282578 13539956 13816447
-4840A3816447K76968K76970K85808K97277K92260L03727L15195L15196L11313L11313L24214
$$ 13816447 14093415 14370385 14656193 14953470 15245730 15549457 15864652 16179848 16491161 16802474 17126688
-4829A7126688L35682L47150L81553M28381M62786N08775N50825O05774O70760P27621P92606
$$ 17126688 17462370 17809520 18191073 18619454 19082240 19591015 20141840 20747614 21418374 22145995 22938601
-4818B2938601Q59981R17319R82273J047258J127537J223099J315797J388429J431674J431670
$$ 22938601 23798582 24715901 25698174 26745432 27872969 29096068 30411865 31800294 33231968 34663638
-4808C4663638J373257J247111J063865Q61262O70371M98354L59306K86675K60632K87393
$$ 34663638 36036895 37284006 38347871 39209133 39879504 40377858 40737164 41023839 41284471 41571864
-4798D1571864L55721M66576N89857P00716P71432P82898P20633O09776M64995L38849K45192
$$ 41571864 41927585 42394161 42984018 43684734 44456166 45239064 45959697 46569473 47034468 47373317 47618509
-4787D7618509K18436K71235L59156M76385N60480N55943N02427L77233K16686R0536K1729
$$ 47618509 47836945 48108180 48467336 48943721 49504201 50060144 50562571 50939804 51156490 51247026 51268755
-4776E1268755M0457J39842L09952N16371P16820R07956J075195J205158J296983J365785
$$ 51268755 51309212 51449054 51759006 52275377 52992197 53900153 54975348 56180506 57477489 58843274
-4766E8843274J417396J455620J487153J525383J555970J594186J649195J718011J804020
$$ 58843274 60260670 61716290 63203443 64728826 66284796 67878982 69528177 71246188 73050208
-4757G3050208J888111J969100K022632K085700K154496K215708K315102K422616K537288
$$ 73050208 74938319 76907419 78930051 81015751 83170247 85385955 87701057 90123673 92660961
-4748I2660961K625679K625693K569789K439808K227953J975662J717637J465334J201100
$$ 92660961 95286640 97912333 100482122 102921930 105149883 107125545 108843182 110308516 111509616
-4739A11509616Q87651N30232J25027l08194p13385j074637j311645j402667j333851j169479
$$ 111509616 112397267 112927499 113052526 112744332 112030947 110956310 109644665 108241998 106908147 105738668
-4729A05738668r93643q27896p43797p49525p72473p69843p01026n72014l65592j48188J04115
$$ 105738668 104745025 103917129 103173332 102423807 101651334 100881491 100180465 99608451 99242859 99094671 99198786
-4718I9198786L58315O10605Q50236J087249J281246J441792J532094J570331J604735J658249
$$ 99198786 99557101 100167706 101017942 102105191 103386437 104828229 106360323 107930654 109535389 111193638
-4708A11193638J764573J970983K253871K628470L040712L476483L915150M305053M624223
$$ 111193638 112958211 114929194 117183065 119811535 122852247 126328730 130243880 134548933 139173156
-4699A39173156M845967M952018M913802M760532M508236M245457M008424L822319L722944
$$ 139173156 144019123 148971141 153884943 158645475 163153711 167399168 171407592 175229911 178952855
-4690A78952855L677062L654121L605782L445236L175741K801114K332856J759453J143053
$$ 178952855 182629917 186284038 189889820 193335056 196510797 199311911 201644767 203404220 204547273
-4681B04547273M93216j53416p42094j250507j640422j893667k069502k175354k244150k251587
$$ 204547273 205040489 204887073 204144979 202894472 201254050 199360383 197290881 195115527 192871377 190619790
-4671A90619790k240117k199270k115171j987112j780685j549420j342991j205453j182498
$$ 190619790 188379673 186180403 184065232 182078120 180297435 178748015 177405024 176199571 175017073
-4662A75017073j195411j195411j085500q33218m97061j37739K07763N40340Q34926J091042
$$ 175017073 173821662 172626251 171540751 170707533 170210472 170072733 170280496 170820836 171655762 172746804
-4652A72746804J338785J602566J876815K140581K371380K596903K849227L128256L459390
$$ 172746804 174085589 175688155 177564970 179705551 182076931 184673834 187523061 190651317 194110707
-4643A94110707L853138M282927M661371M888270M888284M695008M347129L910156L455291
$$ 194110707 197963845 202246772 206908143 211796413 216684697 221379705 225726834 229636990 233092281
-4634B33092281L002295K532100K115184J843792J796041K044465K500346L008731L461246
$$ 233092281 236094576 238626676 240741860 242585652 244381693 246426158 248926504 251935235 255396481
-4625B55396481L778521L881901L778653L454677L007449K602258K330813K200885K135908
$$ 255396481 259175002 263056903 266835556 270290233 273297682 275899940 278230753 280431638 282567546
-4616B82567546J977245J629392J069356L46891m05912j044306j460500j624852j575658j311932
$$ 282567546 284544791 286174183 287243539 287590430 287184518 286140212 284679712 283054860 281479202 280167270
-4606B80167270q41202j64646P17658J738355K846382L997006N134064O223529P177755P923160
$$ 280167270 279326068 279161422 279879080 281617435 284463817 288460823 293594887 299818416 306996171 314919331
-4596C14919331Q414827Q678608Q815746Q911302R043686R231032R485226R794834J0068629
$$ 314919331 323334158 332012766 340828512 349739814 358783500 368014532 377499758 387294592 397363221
-4587C97363221J0225370J0156120R792911R181065Q443323P680237P011213O536316O218990
$$ 397363221 407588591 417744711 427537622 436718687 445162010 452842247 459853460 466389776 472608766
-4578D72608766O061849O088555O241797O459722O628828O556187O195274N564413M840558
$$ 472608766 478670615 484759170 491000967 497460689 504089517 510645704 516840978 522405391 527245949
-4569E27245949M278707L995404M045132M383823M838796N286024N748528O339649P130965
$$ 527245949 531524656 535520060 539565192 543949015 548787811 554073835 559822363 566162012 573292977
-4560E73292977Q154679R328164J0491287J1481298J2175080J2553566J2572687J2217223
$$ 573292977 581447656 590775820 601267107 612748405 624923485 637477051 650049738 662266961
-4552F62266961J1621774J0807653R710602Q322876O700455N007048L486057K343177J659918
$$ 662266961 673888735 684696388 694406990 702729866 709430321 714437369 717923426 720266603 721926521
-4543G21926521J350229J102766O78453n6298j313854l173057n531723q258942j1137425j3605428
$$ 721926521 723276750 724379516 725057969 725001671 723687817 720514760 714983037 706724095 695586670 681981242
-4533F81981242j5253008j5997747j5970986j5654514j5566543j5968369j6878101j8008481
$$ 681981242 666728234 650730487 634759501 619104987 603538444 587570075 570691974 552683493
-4525E52683493j9178227k0199592k0818916k1078878k1040634k0726031k0198550j9445453
$$ 552683493 533505266 513305674 492486758 471407880 450367246 429641215 409442665 389997212
-4517C89997212j8413352j7204935j5928149j4590259j3267618j2034310j0895196r879307
$$ 389997212 371583860 354378925 338450776 323860517 310592899 298558589 287663393 277784086
-4509B77784086q923667p966532p026221o161330n419744m922147m731008m824642n092255
$$ 277784086 268860419 260893887 253867666 247706336 242286592 237364445 232633437 227808795 222716540
-4500B22716540n385625n561462n506059n207880m750131m268451l838423l479100l186663
$$ 222716540 217330915 211769453 206263394 201055514 196305383 192036932 188198509 184719409 181532746
-4491A81532746k919078k637150k262550j787468j214053m06526P32600K140288L615824M987204
$$ 181532746 178613668 175976518 173713968 171926500 170712447 170305921 171038521 173178809 176794633 181781837
-4481A81781837O202793P234505Q037277Q668006R256670R783244J0081422R670488P980873
$$ 181781837 187984630 195219135 203256412 211924418 221181088 230964332 241045754 250716242 258697115
-4472B58697115M549538p63941p039708j2597818j6058290j7212666j6871518j5747693j4187257
$$ 258697115 263246653 262482712 255443004 242845186 226786896 209574230 192702712 176955019 162767762
-4463A62767762j2436497j0720109r198731p863671o693939n705803m841881m044985l318680
$$ 162767762 150331265 139611156 130412425 122548754 115854815 110149012 105307131 101262146 97943466
-4454I7943466k665005k106912j650583j352413j203810j203817j343231j549654j764193
$$ 97943466 95278461 93171549 91520966 90168553 88964743 87760926 86417695 84868041 83103848
-4445H3103848j955339k102745k202127k270456k308686k342557k342550k351623k328703
$$ 83103848 81148509 79045764 76843637 74573181 72264495 69921938 67579388 65227765 62899062
-4436F2899062k271598k172202k028855j898888j768870j654190j531869j401896j258549
$$ 62899062 60627464 58455262 56426407 54527519 52758649 51104459 49572590 48170694 46912145
-4427D6912145j082710q90619o53616l24574J57078Q54709J856237L294505N488689Q199894
$$ 46912145 45829435 44938816 44285200 43960626 44117704 44972413 46828650 50123155 55611844 63811738
-4417F3811738J0654023J2501260J3961507J5440869J6946990J8300183J9791022K1385068
$$ 63811738 74465761 86967021 100928528 116369397 133316387 151616570 171407592 192792660
-4409A92792660K2814709K3236805K1593085J7369100Q676418l894774j7006398k6728297
$$ 192792660 215607369 238844174 260437259 277806359 286482777 282588003 265581605 238853308
-4401B38853308l0558575l0437407k8182054k4451178k0085728j5794343j2132270r286322
$$ 238853308 208294733 177857326 149675272 125224094 105138366 89344023 77211753 67925431
-4393F7925431p214449n735034m641765l819899l170048k632256k227054j898311j676596
$$ 67925431 60710982 54975948 50334183 46514284 43344236 40711980 38484926 36586615 34910019
-4384C4910019j559708j521481j533906j510969j446699j316733j189630j074950r54897q40217
$$ 34910019 33350311 31828830 30294924 28783955 27337256 26020523 24830893 23755943 22801046 21960829
-4374B1960829p61853o77755o16116n62598n17683m94747m68025m29800l95397l41878k69249
$$ 21960829 21198976 20521221 19905105 19342507 18824824 18330077 17862052 17432252 17036855 16694977 16425728
-4363A6425728k00442r6274j2178R7305K11985L55332N92337R07224J327716J917355K735398
$$ 16425728 16225286 16129012 16116834 16214139 16426124 16781456 17373793 18281017 19608733 21526088 24261486
-4352B4261486L800521N000832O059695O893033P617420Q343718R050904R700753J0349769
$$ 24261486 28062007 33062839 39122534 46015567 53632987 61976705 71027609 80728362 91078131
-4343I1078131J0892573J1054087J0388947Q413132M781617o36002o897456j2193775j5076044
$$ 91078131 101970704 113024791 123413738 131826870 136608487 135972485 129075029 116881254 101805210
-4334A01805210j5383756j4198741j2334732j0186412q057211o184121m674717l550864k758626
$$ 101805210 86421454 72222713 59887981 49701569 41644358 35460237 30785520 27234656 24476030
-4325B4476030k200520j782900j469441j225752j019328q80444p50475o66377o28151n96614
$$ 24476030 22275510 20492610 19023169 17797417 16778089 15897645 15147170 14480793 13852642 13256028
-4315A3256028n73678n59343n21118m59476l90670l36198k82680k17696j79470j51277j51278
$$ 13256028 12682350 12123007 11601889 11142413 10751743 10415545 10132865 9915169 9735699 9584422 9433144
-4304I433144j74389k27905k92174l60981l90367l78900l43779l05553k75808k37581k03178
$$ 9433144 9258755 9030850 8738676 8377695 7987328 7608428 7264649 6959096 6683288 6445707 6242529
-4293F242529j80243j50616j27682j02595o4369n5379m3912k0020q552j4287j4286k102k102
$$ 6242529 6062286 5911670 5783988 5681393 5617024 5561645 5517733 5497713 5489161 5474874 5460588 5458486 5456384
-4280E456384J7938J7937j893j892r180k0647l7372o0307p7192j03950j31664j31665j45401
$$ 5456384 5474322 5492259 5490366 5488474 5479294 5458647 5421275 5360968 5283776 5179826 5048162 4916497 4771096
-4267D771096j64515j58303j58303j53495j34382j18853r9739p8476o7008m5983j9226m875
$$ 4771096 4606581 4448278 4289975 4136480 4002098 3883245 3783506 3705030 3638022 3592039 3572813 3567938
-4255C567938J4238K4750L6217N0792O9905P6356P6356P9939O8471O0349O0347L6697J7582
$$ 3567938 3582176 3606926 3643143 3693935 3763840 3840196 3916552 3996491 4064962 4125311 4185658 4222355 4239937
-4242D239937N398j3716l7292n6407q1253j08012j50299j77058j92826k04295j91273j79805
$$ 4239937 4245335 4231619 4194327 4137920 4056667 3948655 3798356 3621298 3428472 3224177 3032904 2853099
-4230B853099j63082j51613j35129j08370r0213r0212p6759p6758p0309p0307o1708n0239
$$ 2853099 2690017 2538404 2403275 2294905 2204692 2114480 2037721 1960963 1890654 1820347 1758639 1708400
-4218A708400n5973n5973n0240l8771m4505m4505l9369k7901k4794k4795j7419j7418j0968
$$ 1708400 1652427 1596454 1546214 1507443 1462938 1418433 1379064 1351163 1326369 1301574 1284155 1266737 1255769
-4205A255769k2435q698q698r415r415k187k188j471j470K949J4417P966P966R923R922J5657
$$ 1255769 1233334 1224636 1215938 1206523 1197108 1194921 1192733 1191262 1189792 1192741 1207158 1215124 1223090 1233013 1242935 1258592
-4189A258592J5656J9120J9121N742N741J620J620j1759j1759j8090j8091k3824j2356j4085
$$ 1258592 1274248 1293368 1312489 1318231 1323972 1325592 1327212 1315453 1303694 1285604 1267513 1243689 1231333 1217248
-4175A217248k617P657l812q25q25j1815j1815j4085k5552l3676m5144n6969n6970n6493n6492
$$ 1217248 1214631 1222288 1218476 1217651 1216826 1205011 1193196 1179111 1153559 1119883 1074739 1017770 960800 904307 847815
-4160H47815n5342l6229l3601l3601j5324j5324J878J877L909L908J7288J7288R642R642J2749
$$ 847815 792473 756244 722643 689042 673718 658394 660272 662149 666058 669966 687254 704542 714184 723826 736575
-4145G36575K4216K4074K4078L5065L5068K8614M0085L3631L3635L8050L8055M5218L3754
$$ 736575 760791 784865 808943 844008 879076 907690 947775 981406 1015041 1053091 1091146 1136364 1170118
-4132A170118K0611L2081L1362J9897L0346L0349L0346L0350O932J8404J7683O219J5414L950
$$ 1170118 1190729 1222810 1254172 1274069 1304415 1334764 1365110 1395460 1402392 1420796 1438479 1444698 1460112 1464062
-4118A464062L229J4700J9954J9956K0670K0674K6624K6624L1880K0412O555j2557j7098k8565
$$ 1464062 1467291 1481991 1501945 1521901 1542571 1563245 1589869 1616493 1648373 1668785 1675340 1662783 1645685 1617120
-4104A617120m3258m3259n5443o6911p3362q4829q8652q8652q2023q2022p5572p5571o1237
$$ 1617120 1573862 1530603 1475160 1408249 1334887 1250058 1161406 1072754 990731 908709 833137 757566 696329
-4091F96329m9769m5230k6116k4085j2618M345J5813J5933J5933J6649J6649K3201K3205L2757
$$ 696329 646560 601330 575214 551129 538511 542856 558669 574602 590535 607184 623833 647034 670239 702996
-4077G02996L2761L8611L8615M9361M9366N4260P3377O8355O8359O6684O6687N9038M7573
$$ 702996 735757 774368 812983 862344 911710 965970 1039347 1107702 1176061 1242745 1309432 1368470 1416043
-4064A416043M7377L5912L5907L5912L8536L8540K7785J6321Q314Q317J624k5131l7319l7316
$$ 1416043 1463420 1499332 1535239 1571151 1609687 1648227 1676012 1692333 1700647 1708964 1710588 1685457 1648138 1610822
-4050A610822m4725m4722l0055l0054o642M827J4145L3258K7284K7285K1790m969j6675m3434
$$ 1610822 1566097 1521375 1491320 1461266 1454624 1459451 1473596 1506854 1534138 1561423 1583213 1578244 1561569 1518135
-4036A518135p1865r8623j01251q9784q4333q4333p2865o1397m5868m5868l5594l5595k6755
$$ 1518135 1446270 1347647 1246396 1156612 1072279 987946 915081 853684 807816 761948 726354 690759 664004
-4023F64004k6754k1021k1021k2454k2454j6720j6721j1333j1334P780J9248J3513K4982K8804
$$ 664004 637250 616229 595208 572754 550300 533580 516859 505526 494192 501972 521220 534733 559715 588519
-4009E88519K8804L9913L9914M5648M5647L9197L9197K5818K5817K9984K9984K3055J1587
$$ 588519 617323 657236 697150 742798 788445 827642 866839 892657 918474 948458 978442 1001497 1013084
-3996A013084o092o092k4011k4011k0935k0935j1378j1378j4604j4604k1054r586Q892Q892
$$ 1013084 1006992 1000900 976889 952878 931943 911008 899630 888252 873648 859044 837990 828404 837296 846188
-3982H46188K1077L2544L4337M5804M8432M8433L9861K0749J2864o250j5088k6557n1165o2633
$$ 846188 867265 899809 934146 979950 1028382 1076815 1116676 1137425 1150289 1144039 1128951 1102394 1051229 988596
-3968I88596n9363n9363n3151m1683m1086m1085l4635l4636l5292l5292l5292l5292k8244
$$ 988596 929233 869870 816719 775036 733950 692865 658230 623594 588302 553010 517718 482426 454182
-3955D54182k8244l6607l6606l2548j3435l162l162O3O4J3442J3443J0755J0755J0755J0755
$$ 454182 425938 389331 352725 320177 306742 303580 300418 300481 300545 313987 327430 338185 348940 359695 370450
-3940C70450J1710J1711J4816K6284K8062K8061K8778K8778L0809L0808K1969K1969K4717
$$ 370450 382160 393871 408687 434971 463033 491094 519872 548650 579459 610267 632236 654205 678922
-3927F78922L6184M3113M3113O0553O0554O8199Q7312R1325J10438J22384J33852J37435J25968
$$ 678922 715106 758219 801332 861885 922439 990638 1077950 1169275 1279713 1402097 1535949 1673384 1799352
-3914A799352J25012J05898P9022N2262K2637L524J8576L7688O1103P2570R3834J20592J43050
$$ 1799352 1924364 2030262 2109284 2161546 2184183 2187707 2206283 2243971 2305074 2377644 2471478 2592070 2735120
-3901B735120J85099K16874K35988K66091L08140L65599M07647M62120N19460N62463O04514
$$ 2735120 2920219 3137093 3373081 3639172 3947312 4312911 4720558 5182678 5702138 6264601 6869115
-3890F869115O56596O98646P35744P70148P99774Q34176Q67387R09436R73463J076675J231492
$$ 6869115 7525711 8224357 8960101 9730249 10530023 11364199 12231586 13141022 14114485 15191160 16422652
-3879A6422652J479962J865093K411730L144956M096793N275118O647442Q135921R592349
$$ 16422652 17902614 19767707 22179437 25324393 29421186 34696304 41343746 49479667 59072016
-3870E9072016J0905418J2048385J3033188J3893285J4630565J5200156J5487692J5246839
$$ 59072016 69977434 82025819 95059007 108952292 123582857 138783013 154270705 169517544
-3862A69517544J4159789J1870039Q090183K795813l606597j0300028j6139825k0111554k1718966
$$ 169517544 183677333 195547372 203637555 206433368 202826771 192526743 176386918 156275364 134556398
-3853A34556398k1157035j9089474j6233973j3190202j0380562q006594o160262m800840l826068
$$ 134556398 113399363 94309889 78075916 64885714 54505152 46498558 40338296 35537456 31711388
-3844C1711388l100485k530914k072676j678944j347093j090976q90288p33561o32022n51747
$$ 31711388 28610903 26079989 24007313 22328369 20981276 19890300 19000012 18266451 17634429 17082682
-3834A7082682m76249l80683k84522j88955o1853P9584K14572L40719M58741N77244O91235
$$ 17082682 16606433 16225750 15941228 15752273 15690420 15770004 15984576 16325295 16784036 17361280 18052515
-3823A8052515Q17381R79367J204901J547743K017927K662520L514963M580284N868510P305341
$$ 18052515 18869896 19849263 21054164 22601907 24619834 27282354 30797317 35377601 41246111 48551452
-3813D8551452Q784699J0158464J1362581J2431964J3368508J4191844J4868434J5314700
$$ 48551452 57336151 67494615 78857196 91289160 104657668 118849512 133717946 149032646
-3805A49032646J5356776J4674679J2881842R692828M964250j085674p756164j4011916j8748131
$$ 149032646 164389422 179064101 191945943 201638771 206603021 205517347 197761183 183749267 165001136
-3796A65001136k1266051k1522179k0009855j7437215j4462816j1561444r027522o982409
$$ 165001136 143735085 122212906 102203051 84765836 70303020 58741576 49714054 42731645
-3788D2731645n416569m243017l385316k746937k259553j888756j610659j415707j293142
$$ 42731645 37315076 33072059 29686743 26939806 24680253 22791497 21180838 19765131 18471989
-3779A8471989j228158j212869j193753j160366j118317j048077r52511q49777p38922o21375
$$ 18471989 17243831 16030962 14837209 13676843 12558526 11510449 10557938 9708161 8969239 8347864
-3769H347864n18164m31916l59287l02902k60853k28122k01364j86551j67438j41142j14384
$$ 8347864 7829700 7397784 7038497 6735595 6474742 6246620 6045256 5858705 5691267 5550125 5435741
-3758E435741r6227p7114n0832q784M0910R0605J42688J84737K31086K80781L19245L38359
$$ 5435741 5339514 5262400 5211568 5202784 5243694 5334299 5476987 5661724 5892810 6173591 6492836 6831195
-3746F831195L73718L85186L50379K54814Q5184j47996m09608o19852p47433p66546p17329
$$ 6831195 7204913 7590099 7940478 8195292 8280476 8132480 7722872 7103020 6355587 5589041 4871712
-3735D871712o44699n49134m68858l74248k93973k44756j95063j64440j52972j33382j21914
$$ 4871712 4227013 3677879 3209021 2834773 2540800 2296044 2100981 1936541 1783569 1650187 1528273
-3724A528273j10445r8978q6793o7680n8004n8004m7253m7252m2236m2236m1518m1519m6477
$$ 1528273 1417828 1318850 1232057 1164377 1106373 1048369 1001116 953864 911628 869392 827874 786355 739878
-3711G39878l5008l5008m6477m3729m3728m4446m4445l7876l7875l1425l1425k5332j3864
$$ 739878 704870 669862 623385 579656 535928 491482 447037 409161 371286 339861 308436 283104 269240
-3698B69240n025O443K2660L4127M6790M6790O2319Q1433Q5255R6723J09624J09625Q6449
$$ 269240 264215 270658 293318 327445 374235 421025 483344 564777 650032 746755 856379 966004 1052453
-3685A052453P4982N6585K9827q399n0448q4285j11043j51658j70772j77102j88571j81642
$$ 1052453 1127435 1184020 1213847 1205448 1155000 1070715 959672 808014 637242 460140 271569 89927
-3673H9927j81641j60260j33500j29918j10804r6827q5360p1980n2868l4347k2880k2402k2402
$$ 89927 -91714 -251974 -385474 -515392 -626196 -723023 -808383 -880363 -933231 -967578 -990458 -1012860 -1035262
-3660a035262j2367j2368k333R135N551n917m484m483j616j617J5108L639m050P418J1001
$$ -1035262 -1047629 -1059997 -1062330 -1053195 -1047644 -1053561 -1058045 -1062528 -1064144 -1065761 -1050653 -1047014 -1051064 -1043646 -1032645
-3645a032645J1001J3391L2503M4927M4927O9775J04177J47900J89948K51110L23739L84425
$$ -1032645 -1021644 -1008253 -975750 -930823 -885896 -816121 -711944 -564044 -374096 -122986 200753 585178
-3633E85178M41764M86149N35844N93661O35711O67724O79193O42399N69770M19731J86551
$$ 585178 1026942 1513091 2048935 2642596 3278307 3946031 4625224 5267623 5837393 6257124 6443675
-3622F443675j03013m12645o69958q49620r31329q96926p95477o84620n57518m23726l25053
$$ 6443675 6340662 5928017 5258059 4408439 3477110 2580184 1784707 1100087 542569 118843 -206210
-3611b06210k52425j83617j33922r1874p2761n3647l4534j9603m89P754J3487J9371J9371
$$ -206210 -458635 -642252 -776174 -868048 -940809 -994456 -1028990 -1048593 -1049082 -1041328 -1027841 -1008470 -989099
-3598i89099K2357M1470M8041M8040N4969M3501L4900K3433J4353m759k9010m0477m5734l4265
$$ -989099 -966742 -925272 -877231 -829191 -774222 -730721 -695821 -672388 -658035 -662794 -691804 -732281 -778015 -812280
-3584h12280j4839J1920L1988P4037J21343J63391K17864K90493L60854M18193M74100N16148
$$ -812280 -827119 -815199 -783211 -709174 -587831 -424440 -206576 83917 444771 862964 1337064 1853212
-3572A853212N61064N95468O32261O43728O20543N70849M48046K53093k068k96411n73073
$$ 1853212 2414276 3009744 3642005 4285733 4906276 5477125 5925171 6178264 6176196 5879785 5306712
-3561E306712p75672q78287q66819q00400o97190n58142m31994l41684k61410j83464j33769
$$ 5306712 4531040 3652753 2785934 1985534 1288344 730202 298208 -43476 -304886 -488350 -622119
-3550f22119r6021o9263m1788k2674o95J0774K2241M1355M9239M9238P0503Q1970Q7465J06578
$$ -622119 -718140 -787403 -829191 -851865 -852560 -841786 -819545 -778190 -728951 -679713 -609210 -527240 -439775 -333197
-3536c33197J18543J45301J75403K02162K49468L06807L42167L68925M04164M46214M84918
$$ -333197 -214654 -69353 106050 308212 557680 864487 1206654 1575579 1979743 2425957 2910875
-3525B910875N42257N98283O47977O95878O90146N89263L79020K3873m00440p73384r98920
$$ 2910875 3453132 4051415 4699392 5395270 6085416 6674679 7053699 7077572 6677132 5903748 4904828
-3514D904828j038579r43014p73146n93482m47266l13474j95929j15653p3843m7085k7625
$$ 4904828 3866249 2923235 2150089 1556607 1109341 795867 599938 484285 410442 363357 335732
-3503C35732k7624l6703l6703n7250p6363q9743q9741r1773q0305o8120m9008l8734k7266
$$ 335732 308108 271405 234702 177452 101089 11346 -78395 -170168 -250473 -318593 -367601 -406335 -433601
-3490d33601j4126k658J5007J5007L1014M2482M1287N2756O1595O1595P8558R7670J12245
$$ -433601 -447727 -450385 -435378 -420371 -389357 -346875 -305588 -252832 -191237 -129642 -51084 46586 158831
-3477A58831J23713J57878K07571K71123L43754L97105M54445N03661N38066N78680O20730
$$ 158831 282544 440422 647993 919116 1262870 1659975 2114420 2618081 3156147 3734827 4355557
-3466D355557O67078P09128P29794O95390N74500L48964K8102l42692o70006q57314q90928
$$ 4355557 5022635 5731763 6461557 7156947 7731447 8080411 8108513 7765821 7095815 6238501 5347573
-3455E347573q03005o61092m89072l43096k24594j26162o1177j5067J1692K3399K3399q855
$$ 5347573 4544568 3883476 3394404 3051308 2826714 2700552 2639375 2624308 2636000 2659399 2682798 2673943
-3443B673943m3259o7628j02031j19995j19994j21668j02553q2127n5369k8132j373K9923
$$ 2673943 2630684 2563056 2461025 2341030 2221036 2099368 1996815 1914688 1859319 1831187 1829814 1859737
-3431A859737M1392L6614L6613L8167L8167K7893K7893J7127N660J0915L0029L1462L1462
$$ 1859737 1901129 1937743 1974356 2012523 2050690 2078583 2106476 2123603 2129263 2140178 2170207 2201669 2233131
-3418B233131M3646O2760P4348Q5814J03495J14963J10423J21891J29537J29536J31078J31078
$$ 2233131 2276777 2339537 2413885 2499699 2603194 2718157 2828580 2950471 3080008 3209544 3340622 3471700
-3406C471700J36813J36811J41471J41472J52221J52222J50669J69783J66198J54731J49116
$$ 3471700 3608513 3745324 3886795 4028267 4180488 4332710 4483379 4653162 4819360 4974091 5123207
-3395E123207J60584J59868J59867J67557J79026J82131J82131J73530J73530J60151J60152
$$ 5123207 5283791 5443659 5603526 5771083 5950109 6132240 6314371 6487901 6661431 6821582 6981734
-3384F981734J42949J42949J53222J53223J61345J72814K04350K31109K47004K69939K73285
$$ 6981734 7124683 7267632 7420854 7574077 7735422 7908236 8112586 8343695 8590699 8860638 9133923
-3373I133923K84752K91203K91203L05299L05299L16409L16408K94428K71493K33505J95279
$$ 9133923 9418675 9709878 10001081 10306380 10611679 10928088 11244496 11538924 11810417 12043922 12239201
-3362A2239201J57531J34595J24410J24411J40179J40179J73389J73389J67654J67655J61443
$$ 12239201 12396732 12531327 12655737 12780148 12920327 13060506 13233895 13407284 13574938 13742593 13904036
-3351A3904036J61442J66459J89396J92263K03730K08270K31206K43633K66568K79948K79948
$$ 13904036 14065478 14231937 14421333 14613596 14817326 15025596 15256802 15500435 15767003 16046951 16326899
-3340A6326899K76843K76842K71108K71108K73258K73259L00732L12203L20562L43499L64763
$$ 16326899 16603742 16880584 17151692 17422800 17696058 17969317 18270049 18582252 18902814 19246313 19611076
-3329A9611076L87699M07094M45322M88327N41842N96794O50309O99049P67856Q21850Q44786
$$ 19611076 19998775 20405869 20851191 21339518 21881360 22478154 23128463 23827512 24595368 25417218 26262004
-3318B6262004Q92569R30796R62574J016086J070562J139367J217250J286057J374932J474324
$$ 26262004 27154573 28085369 29047943 30064029 31134591 32273958 33491208 34777265 36152197 37626521
-3308C7626521J545280J629375J694363J732590J772128J825645J878207J962306K031112
$$ 37626521 39171801 40801176 42495539 44228129 46000257 47825902 49704109 51666415 53697527
-3299E3697527K084631K132410K201219K288189K448729K653240K890254L145409L412994
$$ 53697527 55782158 57914568 60115787 62403976 64852705 67505945 70396199 73541608 76954602
-3290G6954602L661459L883177M110509M332213M606483M981115N474946O109499O896001
$$ 76954602 80616061 84499238 88609747 92941960 97548443 102529558 108004504 114114003 121010004
-3281A21010004P821087Q891593J0153049J1615218J3151911J4679285J6124242J7426800
$$ 121010004 128831091 137722684 147875733 159490951 172642862 187322147 203446389 220873189
-3273B20873189J8535347J9492216K0340843K1045174K1480944K1512005K0877430J9332163
$$ 220873189 239408536 258900752 279241595 300286769 321767713 343279718 364157148 383489311
-3265C83489311J6679244J2827548P957504K417583l186410q133341j1902486j4116726j4827760
$$ 383489311 400168555 412996103 420953607 423371190 420184780 412051439 400148953 386032227 371204467
-3256C71204467j4372841j3111384j1409351r628025q034793o803943n947652n389538n029881
$$ 371204467 356831626 343720242 332310891 322682866 314648073 307844130 301896478 296506940 291477059
-3247B91477059m808111m637081m522378m442738m312758m070956l696371l223799k696238
$$ 291477059 286668948 282031867 277509489 273066751 268753993 264683037 260986666 257762867 255066629
-3238B55066629k190710j724361j273287q22214l57734J39168O39755J151986J668971K196532
$$ 255066629 252875919 251151558 249878271 249056057 248698323 248837491 249477246 250629232 252298203 254494735
-3228B54494735K742174L300313L950136M737605N765914P134409Q899498J1200692J4073434
$$ 254494735 257236909 260537222 264487358 269224963 274990877 282125286 291024784 302225476 316298910
-3219C16298910J7613171K1974829K6982436L1594494L4782533L6620263L7912378L9171859
$$ 316298910 333912081 355886910 382869346 414463840 449246373 485866636 523779014 562950873
-3211E62950873M0341604M1452115M2805282M4475989M6165711M7293261M7270347M5222009
$$ 562950873 603292477 644744592 687549874 732025863 778191574 825484835 872755182 917977191
-3203I17977191L9541477K8973809J3507523n387349k4156485m0146540n2768847o0965937
$$ 917977191 957518668 986492477 1000000000 994612651 970456166 930309626 877540779 816574842
-3195H16574842o3924753o2387045n8128635n2898695m7707533m2701820l7770620l2907307
$$ 816574842 752650089 690263044 632134409 579235714 531528181 488826361 451055741 418148434
-3187D18148434k8236015k3944168k0144496j6940140j4394259j2560349j1451787j0907535
$$ 418148434 389912419 365968251 345823755 328883615 314489356 301929007 290477220 279569685
-3179B79569685j0762278j0777101j0777100j0631363j0241447r560524q604885p460015o167940
$$ 279569685 268807407 258030306 247253206 236621843 226380396 216819872 208214987 200754972 194587032
-3170A94587032m789910l390822k002135o64205O33586J864450L020321M098331N107478O109012
$$ 194587032 189797122 186406300 184404165 183739960 184373546 186237996 189258317 193356648 198464126 204573138
-3160B04573138P245415Q644490J0444938J2654436J5185013J7792051K0200313K2256876
$$ 204573138 211818553 220463043 230907981 243562417 258747430 276539481 296739794 318996670
-3152C18996670K3936744K5228779K6162492K6812343K7282030K7610761K7642275K7023111
$$ 318996670 342933414 368162193 394324685 421137028 448419058 476029819 503672094 530695205
-3144E30695205K5298082K1987647J6725874R470510O93675q855191j8451970k7236282l4421087
$$ 530695205 555993287 577980934 594706808 604177318 604870993 596015802 577563832 550327550 515906463
-3135E15906463l9230079m1212958m0716056l8306861l4675306l0673066k6751024k3110924
$$ 515906463 476676384 435463426 394747370 356440509 321765203 291092137 264341113 241230189
-3127B41230189j9846385j6939285j4408721j2254185j0411675q854657p516754o381605n468029
$$ 241230189 221383804 204444519 190035798 177781613 167369938 158515281 150998527 144616922 139148893
-3118A39148893m788548m348918m153747m153747m268185m447839m644005m800726m854714
$$ 139148893 134360345 130011427 125857680 121703933 117435748 112987909 108343904 103543178 98688464
-3109I8688464m782091m541259m208695l841241l478098l167088k903320k657721k416894
$$ 98688464 93906373 89365114 85156419 81315178 77837080 74669992 71766672 69108951 66692057
-3100F6692057k186584j968692j779469j630394j536734j502329j512364j577352j647115
$$ 66692057 64505473 62536781 60757312 59126918 57590184 56087855 54575491 52998139 51351024
-3091E1351024j681516j677695j628000j559978j479706j383662j303385j240315j182973
$$ 51351024 49669508 47991813 46363813 44803835 43324129 41940467 40637082 39396767 38213794
-3082C8213794j114166j056828j020630r86225r58992r16942q73938q47181q05128p55438
$$ 38213794 37099628 36042800 35022170 34035945 33076953 32160011 31286073 30438892 29633764 28878326
-3072B8878326o99815o65410o38650n96603n55987n29230n01993m67588m44056m17298l82893
$$ 28878326 28178511 27513101 26874451 26277848 25721861 25192631 24690638 24223050 23778994 23361696 22978803
-3061B2978803l48490l15998k89240k57703k30944k00654j66252j45942j11540q3825q3825
$$ 22978803 22630313 22314315 22025075 21767372 21536428 21335774 21169522 21023580 20912040 20828215 20744390
-3050B0744390p3554r2665j27188j69236k08658k27772k21081k21082k16064j96952j85409
$$ 20744390 20670836 20578171 20450983 20281747 20073089 19845317 19624236 19403154 19187090 18990138 18804729
-3039A8804729k19813k88619l91832n22278o17843o60849o49379n92640n27652m58847m01507
$$ 18804729 18584916 18296297 17904465 17382187 16764344 16103495 15454116 14861476 14333824 13874977 13473470
-3028A3473470l42256k92562k58636k31878k06955j95489j86886j75420j64906j53439j47705
$$ 13473470 13131214 12838652 12580016 12348138 12141183 11945694 11758808 11583388 11418482 11265043 11117338
-3017A1117338j47706j31071j31070j31071j31070j26412j26412j37880j37880j32757j32758
$$ 11117338 10969632 10838561 10707491 10576420 10445350 10318938 10192526 10054646 9916766 9784009 9651251
-3006I651251j27025j27024j32758j32758j27024j27023j30847j30847j29652j29652j28817
$$ 9651251 9524226 9397202 9264444 9131686 9004662 8877639 8746792 8615945 8486293 8356641 8227824
-2995H227824j09702j01341j01340q6749q6748q6748q6749q4120q4120q4120q4121r1616r1616
$$ 8227824 8118122 8016781 7915441 7828692 7741944 7655196 7568447 7484327 7400207 7316087 7231966 7140350 7048734
-2982G048734r1616r1616r4484r4483r4483r4484q2074q2075q2074q2075q1716q1716q2911
$$ 7048734 6957118 6865502 6771018 6676535 6582052 6487568 6405494 6323419 6241345 6159270 6077554 5995838 5912927
-2969E912927q2910p8879r7993q7958p6490p1831p1831n9646n9647n7873n7874n7873n7873
$$ 5912927 5830017 5751138 5653145 5565187 5488697 5416866 5345035 5285389 5225742 5167869 5109995 5052122 4994249
-2956D994249n5723n5723n5722n5723n4081n4081n4081n4080m7391m7391m7391m7390l5864
$$ 4994249 4938526 4882803 4827081 4771358 4717277 4663196 4609115 4555035 4507644 4460253 4412862 4365472 4329608
-2943D329608l5863l5863l5864l2996l2996l2996l2997l9805l9806l9805l9805m4584m4584
$$ 4329608 4293745 4257882 4222018 4189022 4156026 4123030 4090033 4050228 4010422 3970617 3930812 3886228 3841644
-2930C841644m4583m4584l9913l9914l9914l9914l7046l7047l7047l7046l8869l8868l8868
$$ 3841644 3797061 3752477 3712564 3672650 3632736 3592822 3555776 3518729 3481682 3444636 3405767 3366899 3328031
-2917C328031l8869l2179l2178l2179l2179l6210l6211l6210l6211l7644l7644l7644l7644
$$ 3328031 3289162 3256983 3224805 3192626 3160447 3124237 3088026 3051816 3015605 2977961 2940317 2902673 2865029
-2904B865029l1581l1581l1582l1581l4449l4448l4449l4448l4348l4348l4347l4348l3631
$$ 2865029 2833448 2801867 2770285 2738704 2704255 2669807 2635358 2600910 2566562 2532214 2497867 2463519 2429888
-2891B429888l3631l3631l3631l2496l2496k1028k1029k0789k0789k0789k0790j7310j7310
$$ 2429888 2396257 2362626 2328995 2296499 2264003 2242975 2221946 2201157 2180368 2159579 2138789 2121479 2104169
-2878B104169j7310j7310j5160j5160j5160j5159j4085j4085k5553k5552j4324j4324j4323
$$ 2104169 2086859 2069549 2054389 2039229 2024069 2008910 1994825 1980740 1955187 1929635 1915311 1900987 1886664
-2865A886664j4324r825r826r825r825j2692j2693j2692j2693j2453j2454j2453j2453k2966
$$ 1886664 1872340 1862515 1852689 1842864 1833039 1820347 1807654 1794962 1782269 1769816 1757362 1744909 1732456 1709490
-2851A709490k2965k2966k2966j9083j9083j9084j9083j2274j2274j8009j8008j5858j5858
$$ 1709490 1686525 1663559 1640593 1621510 1602427 1583343 1564260 1551986 1539712 1521703 1503695 1487837 1471979
-2838A471979m390m390j2393j2394j8128j8127k2619k2618j6885j6884k1544k1543j5809j5810
$$ 1471979 1467589 1463199 1450806 1438412 1420284 1402157 1379538 1356920 1340035 1323151 1301607 1280064 1264255 1248445
-2824A248445j1748j1748k3215k3216r717r717r717r718j7944j7945j7945j7944j3167j3166
$$ 1248445 1236697 1224949 1201734 1178518 1168801 1159084 1149367 1139649 1121705 1103760 1085815 1067871 1054704 1041538
-2810A041538j3167j3166j2689j2688j2689j2688p911p910p910p911k501k501k501k501r191
$$ 1041538 1028371 1015205 1002516 989828 977139 964451 956540 948630 940720 932809 930308 927807 925306 922805 913614
-2795I13614r191r191r190q832q833q832q833j3252j3252j3253j3252j2789j2789p056p056
$$ 913614 904423 895232 886042 877210 868377 859545 850712 837460 824208 810955 797703 784914 772125 765069 758013
-2780G58013n860n861N607N607k875k874K860K859L696L695j5417j5418p593p593j9060j9061
$$ 758013 752153 746292 751899 757506 754631 751757 754617 757476 761172 764867 749450 734032 726439 718846 699786 680725
-2764F80725j7389j7388j7389j7388q071q071j9539j9538j3088j3088j8822j8822l786l785
$$ 680725 663336 645948 628559 611171 603100 595029 575490 555952 542864 529776 510954 492132 488346 484561
-2750D84561r519r519J948J949J949J948Q967Q967Q966Q967J0400J0401J0400J0400J6347
$$ 484561 475042 465523 467471 469420 471369 473317 482284 491251 500217 509184 519584 529985 540385 550785 567132
-2735E67132J6347J7064J7064K1364L2832M3105O2219P5747Q7215J09673J36431J65579J77046
$$ 567132 583479 600543 617607 638971 671803 714908 777127 852874 940089 1049762 1186193 1351772 1528818
-2722A528818J92816K19573K46989K66102K71836K60369K36476J86783J21320M1045l4812
$$ 1528818 1721634 1941207 2188196 2454298 2726134 2986503 3222979 3409762 3531082 3572127 3537315
-2711C537315r9795j51878j70992j78876j59763j44233j44233j28917j17449j04786j04787
$$ 3537315 3437520 3285642 3114650 2935774 2776011 2631778 2487545 2358628 2241179 2136393 2031606
-2700B031606r4274r4274q0895o9427p3966o2499m9119m9119m2310m2311l6576l6576k6348
$$ 2031606 1937332 1843058 1762163 1692736 1618770 1556271 1507152 1458033 1415723 1373412 1336836 1300260 1273912
-2687A273912k6348j4880j4880q429q429j4163j4163k218k217R967R967R848K1316K8244L9712
$$ 1273912 1247564 1232684 1217804 1209375 1200946 1186783 1172620 1170402 1168185 1178152 1188119 1197967 1219283 1247527 1287239
-2672A287239M7712N9180Q7371J21776J66213K23553K89494L62123M12654M62347N16821N66514
$$ 1287239 1334951 1394131 1481502 1603278 1769491 1993044 2282538 2644661 3057315 3519662 4036483 4602997
-2660D602997O13341O55391O97918P17031O84314N81103L75159O5526l14348o77497r04467
$$ 4602997 5216338 5871729 6569647 7286678 7970992 8552095 8927254 8992780 8678432 8000935 7096468
-2649G096468r69451r40542q37332p11662n93161m79916l84350l01207k36223j87342j60584
$$ 7096468 6127017 5186475 4349143 3637481 3044320 2564404 2180054 1878847 1642624 1455282 1294698
-2638A294698j31437j12323j02767q3654p2186o0718n6536m5069l1690l1690l6229l6229l0495
$$ 1294698 1163261 1050938 948171 864517 792331 731613 675077 630008 598318 566628 530399 494170 463675
-2625D63675l0495k4538k4537k4537j3070j4980l513L416J4883J7990J7989J9901J9901J6317
$$ 463675 433180 408642 384105 359568 346498 331518 328005 331421 346304 364294 382283 402184 422085 438402
-2611D38402L5430M5704N7171O6702P8170R5372J18307J51994J74931J84725K22952K40512
$$ 438402 473832 519536 576707 643409 721579 816951 935258 1087252 1262183 1446908 1669860 1910372
-2599A910372K51980K66315K66315K58192K46724K13037J44229N8042m1348j54114k68794
$$ 1910372 2162352 2428667 2694982 2953174 3199898 3412935 3557164 3615206 3573858 3419744 3150950
-2588C150950l64837m18354m24088m01152l49308k95791k32717j94492j45036j06809q1246
$$ 3150950 2786113 2367759 1943671 1542519 1193211 897420 664703 470211 325175 218366 137120
-2577A37120o9778o3346m0409l3482l3481j7714j7713j7713j7713j9267j9266j9266j9266
$$ 137120 67342 3996 -36413 -69895 -103376 -121090 -138803 -156516 -174229 -193496 -212762 -232028 -251294
-2564b51294j4488j4488j4488j4488k4462k4463k4463k4462j8968j8967j8968j8967j2278
$$ -251294 -265782 -280270 -294758 -309246 -333708 -358171 -382634 -407096 -426064 -445031 -463999 -482966 -495244
-2551d95244j2278q10q11j0127j0128j0128j0128r373r374r373r374m118m117k3231k3231
$$ -495244 -507522 -508332 -509143 -519270 -529398 -539526 -549654 -559027 -568401 -577774 -587148 -591266 -595383 -618614 -641845
-2536f41845j728j728j3197j3196p582p582j847j848j2110j2110o42o42J866J867J866J867
$$ -641845 -643573 -645301 -658498 -671694 -679276 -686858 -688705 -690553 -702663 -714773 -715415 -716057 -714191 -712324 -710458 -708591
-2520g08591j090j090j090j090k524k524k523k524J512J512J512J512n297n297O170O171O469
$$ -708591 -709681 -710771 -711861 -712951 -715475 -717999 -720522 -723046 -721534 -720022 -718510 -716998 -722295 -727592 -721422 -715251 -708782
-2503g08782O470P35P36l924l923l924l923l367l368l367l367j934j933j934j934k143k142
$$ -708782 -702312 -701577 -700841 -704765 -708688 -712612 -716535 -719902 -723270 -726637 -730004 -731938 -733871 -735805 -737739 -739882 -742024
-2486g42024k143k143j8269j8270Q44Q43k456k456j2013j2013n443n443n442n443l113l114
$$ -742024 -744167 -746310 -764579 -782849 -782005 -781162 -783618 -786074 -798087 -810100 -815543 -820986 -826428 -831871 -834984 -838098
-2470h38098l113l114n980n980n981n980Q44Q43Q44Q44k023k024k023k023n906n906n905n906
$$ -838098 -841211 -844325 -850305 -856285 -862266 -868246 -867402 -866559 -865715 -864871 -866894 -868918 -870941 -872964 -878870 -884776 -890681 -896587
-2452h96587P84P84P84P84j643j642q094L375n704n704P46P47n555n554M001M002j015j016
$$ -896587 -895803 -895019 -894235 -893451 -895094 -896736 -904830 -901455 -907159 -912863 -912117 -911370 -916925 -922479 -918478 -914476 -915491 -916507
-2434i16507j015j015J717J717J717J717L151L151L151L150j000j001j000j001m584m584K583
$$ -916507 -917522 -918537 -916820 -915103 -913386 -911669 -908518 -905367 -902216 -899066 -900066 -901067 -902067 -903068 -907652 -912236 -909653
-2417i09653q884j0236J232n936n935k352k352k352k352n935n936J232j0236r280K187L860
$$ -909653 -918537 -928773 -927541 -933477 -939412 -941764 -944116 -946468 -948820 -954755 -960691 -959459 -969695 -978975 -976788 -972928
-2401i72928L860J158j0311r594r594j710j709j710j710o607o608n891n890p563L904k546
$$ -972928 -969068 -967910 -978221 -987815 -997409 -999119 -1000828 -1002538 -1004248 -1010855 -1017463 -1023354 -1029244 -1036807 -1032903 -1035449
-2385a035449k546j926j926j926j926q616q616q616q616J239J240J239J240j628j628j627
$$ -1035449 -1037995 -1039921 -1041847 -1043773 -1045699 -1054315 -1062931 -1071547 -1080163 -1078924 -1077684 -1076445 -1075205 -1076833 -1078461 -1080088
-2369a080088j628K195K195K195K195J478J479P929l539j807j807L927p540l957l957m674
$$ -1080088 -1081716 -1079521 -1077326 -1075131 -1072936 -1071458 -1069979 -1062050 -1065589 -1067396 -1069203 -1065276 -1072816 -1076773 -1080730 -1085404
-2353a085404m674k083k083M368p101j1400j1401k561k561J262J262q295q295l277l278r011
$$ -1085404 -1090078 -1092161 -1094244 -1089876 -1096977 -1108377 -1119778 -1122339 -1124900 -1123638 -1122376 -1130671 -1138966 -1142243 -1145521 -1154532
-2337a154532r012r758r758k02k02j157j157j157j157q59q59j42j41l726P742P026P026J799
$$ -1154532 -1163544 -1173302 -1183060 -1183262 -1183464 -1184621 -1185778 -1186935 -1188092 -1188951 -1189810 -1189952 -1190093 -1193819 -1186077 -1179051 -1172025 -1170226
-2319a170226J799n90j2057j3492k023M189M188j605j605M128M129l039l038l039l039k531
$$ -1170226 -1168427 -1169017 -1181074 -1194566 -1196589 -1192400 -1188212 -1189817 -1191422 -1187294 -1183165 -1186204 -1189242 -1192281 -1195320 -1197851
-2303a197851k531k531k531M159M159M158M159m174m173l457l457p399M069M069p399q537
$$ -1197851 -1200382 -1202913 -1205444 -1201285 -1197126 -1192968 -1188809 -1192983 -1197156 -1200613 -1204070 -1211469 -1207400 -1203331 -1210730 -1219267
-2287a219267q538l520l520j0688j0687j132j131r22r22r22r22n103n103n103n103k923k923
$$ -1219267 -1227805 -1231325 -1234845 -1245533 -1256220 -1257352 -1258483 -1259405 -1260327 -1261249 -1262171 -1267274 -1272377 -1277480 -1282583 -1285506 -1288429
-2270a288429k923k923N917N917l640l640l162l162O395O395L289L289L288L289M439M438
$$ -1288429 -1291352 -1294275 -1288358 -1282441 -1286081 -1289721 -1292883 -1296045 -1289650 -1283255 -1279966 -1276677 -1273389 -1270100 -1265661 -1261223
-2254a261223M439M438J572J572J571J572j086j087j086j086p896p895J661J661k747k748
$$ -1261223 -1256784 -1252346 -1250774 -1249202 -1247631 -1246059 -1247145 -1248232 -1249318 -1250404 -1258300 -1266195 -1264534 -1262873 -1265620 -1268368
-2238a268368k747k748m778m778R55R56q989q989j50j49M868o600o600M868k793k792j359
$$ -1268368 -1271115 -1273863 -1278641 -1283419 -1282464 -1281508 -1290497 -1299486 -1299636 -1299785 -1294917 -1301517 -1308117 -1303249 -1306042 -1308834 -1310193
-2221a310193j358n660N809N808n659l419l420m136m136k106k105k105k106k908k908O649
$$ -1310193 -1311551 -1317211 -1311402 -1305594 -1311253 -1314672 -1318092 -1322228 -1326364 -1328470 -1330575 -1332680 -1334786 -1337694 -1340602 -1333953
-2205a333953O648m461m461n178O291P65P65m252m252l893l894K557K557l445Q022Q022l445
$$ -1333953 -1327305 -1331766 -1336227 -1341405 -1335114 -1334349 -1333584 -1337836 -1342088 -1345981 -1349875 -1347318 -1344761 -1348206 -1340184 -1332162 -1335607
-2188a335607J213J213M97M96o38o38o39o38o38o39o38o39k027k027k027k027k027k027k744
$$ -1335607 -1334394 -1333181 -1332684 -1332188 -1332826 -1333464 -1334103 -1334741 -1335379 -1336018 -1336656 -1337295 -1339322 -1341349 -1343376 -1345403 -1347430 -1349457 -1352201
-2169a352201k743L020q448j997j997m148m147m148m147J344J344J344J343j523j523q06q06
$$ -1352201 -1354944 -1351924 -1360372 -1362369 -1364366 -1368514 -1372661 -1376809 -1380956 -1379612 -1378268 -1376924 -1375581 -1377104 -1378627 -1379433 -1380239
-2152a380239o451N017N017o450k748k747l465l464M756M756K844q623n398J3715Q698k770
$$ -1380239 -1386690 -1381673 -1376656 -1383106 -1385854 -1388601 -1392066 -1395530 -1390774 -1386018 -1383174 -1391797 -1397195 -1383480 -1374782 -1377552
-2136a377552k351k352l069l068l069l068l069l069Q89Q88P340m129J605J605q668q668n174
$$ -1377552 -1379903 -1382255 -1385324 -1388392 -1391461 -1394529 -1397598 -1400667 -1399778 -1398890 -1391550 -1395679 -1394074 -1392469 -1401137 -1409805 -1414979
-2119a414979n174M383M382l740l741J994J993J374J374m361m360l643l644N913N913k38k39
$$ -1414979 -1420153 -1415770 -1411388 -1415128 -1418869 -1416875 -1414882 -1413508 -1412134 -1416495 -1420855 -1424498 -1428142 -1422229 -1416316 -1416554 -1416793
-2102a416793n973n973P17P17P16P17k542k542k543k542j109j108j109j109p50p50p51p50
$$ -1416793 -1422766 -1428739 -1428022 -1427305 -1426589 -1425872 -1428414 -1430956 -1433499 -1436041 -1437150 -1438258 -1439367 -1440476 -1441226 -1441976 -1442727 -1443477
-2084a443477K117K116K117K117j005j004j004j004M29M29M30M29m319m319m319m320k885
$$ -1443477 -1441360 -1439244 -1437127 -1435010 -1436015 -1437019 -1438023 -1439027 -1438598 -1438169 -1437739 -1437310 -1441629 -1445948 -1450267 -1454587 -1457472
-2067a457472k886k885k886p21p20p21p20k154k154k154k154k930k931k930k931o3o4o3o3
$$ -1457472 -1460358 -1463243 -1466129 -1466850 -1467570 -1468291 -1469011 -1471165 -1473319 -1475473 -1477627 -1480557 -1483488 -1486418 -1489349 -1489412 -1489476 -1489539 -1489602
-2048a489602j811j810j811j810L564L566L565L565q500q501J057J056M59M60M59M59K139
$$ -1489602 -1491413 -1493223 -1495034 -1496844 -1493280 -1489714 -1486149 -1482584 -1491084 -1499585 -1498528 -1497472 -1497013 -1496553 -1496094 -1495635 -1493496
-2031a493496K139K139K139p28p28p28p28L812L811L812L811k878k878k878k879J109J109
$$ -1493496 -1491357 -1489218 -1487079 -1487807 -1488535 -1489263 -1489991 -1486179 -1482368 -1478556 -1474745 -1477623 -1480501 -1483379 -1486258 -1485149 -1484040
-2014a484040J108J109p492p492p492p493M962M961M961M961K094K095K094K094k292k292
$$ -1484040 -1482932 -1481823 -1489315 -1496807 -1504299 -1511792 -1506830 -1501869 -1496908 -1491947 -1489853 -1487758 -1485664 -1483570 -1485862 -1488154
-1998a488154k292k292M517M517n040n039m353m353m353m352k083k083k083k083J478J478
$$ -1488154 -1490446 -1492738 -1488221 -1483704 -1488744 -1493783 -1498136 -1502489 -1506842 -1511194 -1513277 -1515360 -1517443 -1519526 -1518048 -1516570
-1982a516570J478J479j031j030Q526Q527p02p02p02p02j04j05j04j05k449k449k448k449
$$ -1516570 -1515092 -1513613 -1514644 -1515674 -1507148 -1498621 -1499323 -1500025 -1500727 -1501429 -1501533 -1501638 -1501742 -1501847 -1504296 -1506745 -1509193 -1511642
-1964a511642o57o57o57o57k778k777m211P257N824n645q66j2334o996M473k696k695n084
$$ -1511642 -1512299 -1512956 -1513613 -1514270 -1517048 -1519825 -1524036 -1516779 -1510955 -1516600 -1517466 -1529800 -1536796 -1532323 -1535019 -1537714 -1542798
-1947a542798n085M473M472N457N458N458N458L904L905J0356j113q81q81j598j597m465m465
$$ -1542798 -1547883 -1543410 -1538938 -1533481 -1528023 -1522565 -1517107 -1513203 -1509298 -1498942 -1500055 -1500936 -1501817 -1503415 -1505012 -1509477 -1513942
-1930a513942l748l748p720L748k702k703Q81Q81Q81Q81j837j837j836j837K942K941K942
$$ -1513942 -1517690 -1521438 -1529158 -1525410 -1528112 -1530815 -1529934 -1529053 -1528172 -1527291 -1529128 -1530965 -1532801 -1534638 -1531696 -1528755 -1525813
-1913a525813K942m136m137m136m136J359J359n092O376J575J575K292K293K61K61K62K61
$$ -1525813 -1522871 -1527007 -1531144 -1535280 -1539416 -1538057 -1536698 -1541790 -1535414 -1533839 -1532264 -1529972 -1527679 -1527418 -1527157 -1526895 -1526634
-1896a526634K322K322p235p235J008J008J008J008l501l502l502l501L188L188L188L188
$$ -1526634 -1524312 -1521990 -1529225 -1536460 -1535452 -1534444 -1533436 -1532428 -1535929 -1539431 -1542933 -1546434 -1543246 -1540058 -1536870 -1533682
-1880a533682J904J904J903J904o04o05o05o05o171o170m37m37p604p604J952J953n86n86
$$ -1533682 -1531778 -1529874 -1527971 -1526067 -1526671 -1527276 -1527881 -1528486 -1534657 -1540827 -1541264 -1541701 -1549305 -1556909 -1554957 -1553004 -1553590 -1554176
-1862a554176n87n86l214l214l214l214m67m67o200o201R329R329m050m051K21K20o947M520
$$ -1554176 -1554763 -1555349 -1558563 -1561777 -1564991 -1568205 -1568672 -1569139 -1575339 -1581540 -1572211 -1562882 -1566932 -1570983 -1570762 -1570542 -1577489 -1572969
-1844a572969M402p067o350N118N00N00Q385l083k367R101R101k367q73J0594L427L427n652
$$ -1572969 -1568567 -1575634 -1581984 -1576866 -1576366 -1575866 -1567481 -1570564 -1572931 -1563830 -1554729 -1557096 -1557969 -1547375 -1543948 -1540521 -1546173
-1827a546173n652L905L905m398m397J336J337L964L965j770j769o667o668m278P190O234
$$ -1546173 -1551825 -1547920 -1544015 -1548413 -1552810 -1551474 -1550137 -1546173 -1542208 -1543978 -1545747 -1552414 -1559082 -1563360 -1556170 -1549936
-1811a549936n233p623p623N058N058n215n215j751j3218m857J4257N566n902m708O761k438
$$ -1549936 -1555169 -1562792 -1570415 -1565357 -1560299 -1565514 -1570729 -1572480 -1585698 -1590555 -1576298 -1570732 -1576634 -1581342 -1574581 -1577019
-1795a577019k438j721j721l09l10l10l10l10l10l09l10N26N26N27N26O46O46P096m371q582
$$ -1577019 -1579457 -1581178 -1582899 -1583208 -1583518 -1583828 -1584138 -1584448 -1584758 -1585067 -1585377 -1584851 -1584325 -1583798 -1583272 -1582626 -1581980 -1574884 -1579255 -1587837
-1775a587837q583M081M080K288K289l446l446K319K318l416l416n48n49J68J68o977M491
$$ -1587837 -1596420 -1592339 -1588259 -1585971 -1583682 -1587128 -1590574 -1588255 -1585937 -1589353 -1592769 -1593317 -1593866 -1593698 -1593530 -1600507 -1596016
-1758a596016M490o977J624J624R07R07k109k109k109k109P58P57P58P58J504J505J504J505
$$ -1596016 -1591526 -1598503 -1596879 -1595255 -1594348 -1593441 -1595550 -1597659 -1599768 -1601877 -1601119 -1600362 -1599604 -1598846 -1597342 -1595837 -1594333 -1592828
-1740a592828J504J505J504J504q25q25q25q25K042K042K042K042k408k407k408k408M59M59
$$ -1592828 -1591324 -1589819 -1588315 -1586811 -1587636 -1588461 -1589286 -1590111 -1588069 -1586027 -1583985 -1581943 -1584351 -1586758 -1589166 -1591574 -1591115 -1590656
-1722a590656M59M60j333j333j333j332M043M043r337r336m517m517O951O951p623p623j889
$$ -1590656 -1590197 -1589737 -1591070 -1592403 -1593736 -1595068 -1591025 -1586982 -1596319 -1605655 -1610172 -1614689 -1607738 -1600787 -1608410 -1616033 -1617922
-1705a617922j889o966o965M502M502J635J635m099m099j374j373j374j374J135J135J135
$$ -1617922 -1619811 -1626777 -1633742 -1629240 -1624738 -1623103 -1621468 -1625567 -1629666 -1631040 -1632413 -1633787 -1635161 -1634026 -1632891 -1631756
-1689a631756J134K270K270K269K270k509k508k509k508J702J702J703J702l076l076l076
$$ -1631756 -1630622 -1628352 -1626082 -1623813 -1621543 -1624052 -1626560 -1629069 -1631577 -1629875 -1628173 -1626470 -1624768 -1627844 -1630920 -1633996
-1673a633996l076k210k210k210k210O57O57O57O57j83j83j83j83J251J250J251J250R52R52
$$ -1633996 -1637072 -1639282 -1641492 -1643702 -1645912 -1645255 -1644598 -1643941 -1643284 -1643467 -1643650 -1643833 -1644016 -1642765 -1641515 -1640264 -1639014 -1638062 -1637110
-1654a637110R52R52q40q40q40q40L782L782j953j952r956r956J512J512k998k998k997k998
$$ -1637110 -1636158 -1635206 -1636046 -1636886 -1637726 -1638566 -1634784 -1631002 -1632955 -1634907 -1644863 -1654819 -1653307 -1651795 -1654793 -1657791 -1660788 -1663786
-1636a663786k281k281k281k281o644o645o645o645j508j508j508j508m137m136J598J598
$$ -1663786 -1666067 -1668348 -1670629 -1672910 -1679554 -1686199 -1692844 -1699489 -1700997 -1702505 -1704013 -1705521 -1709658 -1713794 -1712196 -1710598
-1620a710598n212n211O257O256J79J80J79J79o271o272N196N197R556R557j911j912N615
$$ -1710598 -1715810 -1721021 -1714764 -1708508 -1708329 -1708149 -1707970 -1707791 -1714062 -1720334 -1715138 -1709941 -1700385 -1690828 -1692739 -1694651 -1689036
-1603a689036N614j19j20K636K635K636K635k501k501k501k501l51l51l51l51M069M069r48
$$ -1689036 -1683422 -1683541 -1683661 -1681025 -1678390 -1675754 -1673119 -1675620 -1678121 -1680622 -1683123 -1683474 -1683825 -1684176 -1684527 -1680458 -1676389 -1677337
-1585a677337r48j4846l379K117J3584K475q992j826j825K504K505k512j3980p21p20o455
$$ -1677337 -1678285 -1693131 -1696510 -1694393 -1680809 -1678334 -1687326 -1689152 -1690977 -1688473 -1685968 -1688480 -1702460 -1703181 -1703901 -1710356
-1569a710356o454p970L498L498p970r404r403K542J4010n282n283J169J168N71N72N71N71
$$ -1710356 -1716810 -1724780 -1721282 -1717784 -1725754 -1735158 -1744561 -1742019 -1728009 -1733291 -1738574 -1737405 -1736237 -1735666 -1735094 -1734523 -1733952
-1552a733952n04n04O663m804j937R530K363K363N41N42N41N41L408L409L408L408j250j251
$$ -1733952 -1734456 -1734960 -1728297 -1733101 -1735038 -1725508 -1723145 -1720782 -1720241 -1719699 -1719158 -1718617 -1715209 -1711800 -1708392 -1704984 -1706234 -1707485
-1534a707485j250j251j251j250j251j250J168J169J168J168j0418j0419J049J049L740L741
$$ -1707485 -1708735 -1709986 -1711237 -1712487 -1713738 -1714988 -1713820 -1712651 -1711483 -1710315 -1720733 -1731152 -1730103 -1729054 -1725314 -1721573
-1518a721573j994j993N15N15N15N15j067j068O100n368n368O099j067j068R78R78R78R78
$$ -1721573 -1723567 -1725560 -1725045 -1724530 -1724015 -1723500 -1724567 -1725635 -1719535 -1724903 -1730271 -1724172 -1725239 -1726307 -1725329 -1724351 -1723373 -1722395
-1500a722395j889j889j172j172n861N607N607n861j560j560k278k277k344k344k345k344
$$ -1722395 -1724284 -1726173 -1727345 -1728517 -1734378 -1728771 -1723164 -1729025 -1730585 -1732145 -1734423 -1736700 -1739044 -1741388 -1743733 -1746077
-1484a746077r11r11r11r10L240L240l927P541P302m167p749p750l767P702J250J251j617
$$ -1746077 -1746988 -1747899 -1748810 -1749720 -1746480 -1743240 -1747167 -1739626 -1732324 -1736491 -1744240 -1751990 -1755757 -1748055 -1746805 -1745554 -1747171
-1467a747171j616j617j616k512k513k512k512K266K265K267K265l490l490l491l490L199
$$ -1747171 -1748787 -1750404 -1752020 -1754532 -1757045 -1759557 -1762069 -1759803 -1757538 -1755271 -1753006 -1756496 -1759986 -1763477 -1766967 -1763768
-1451a763768L199L200L199J377J378J377J378n6n6n6n6j075j076j075j075p16p17p17p17
$$ -1763768 -1760569 -1757369 -1754170 -1752793 -1751415 -1750038 -1748660 -1748716 -1748772 -1748828 -1748884 -1749959 -1751035 -1752110 -1753185 -1753901 -1754618 -1755335 -1756052
-1432a756052p137p138j403j404P47P46q093q093n245O223O223n245P28P28J1J1P657P656
$$ -1756052 -1763189 -1770327 -1771730 -1773134 -1772387 -1771641 -1779734 -1787827 -1793072 -1786849 -1780626 -1785871 -1785143 -1784415 -1784404 -1784393 -1776736 -1769080
-1414a769080j900j900k259k258l692P776N125o342j1360J08J303J303K020K019k80k80M37
$$ -1769080 -1770980 -1772880 -1775139 -1777397 -1781089 -1773313 -1768188 -1774530 -1785890 -1785782 -1784479 -1783176 -1781156 -1779137 -1779417 -1779697 -1779260
-1397a779260M37q523K946l506l505m63m63N271N271m763m764M794M793k971k972k971k972
$$ -1779260 -1778823 -1787346 -1784400 -1787906 -1791411 -1791874 -1792337 -1787066 -1781795 -1786558 -1791322 -1786528 -1781735 -1784706 -1787678 -1790649 -1793621
-1380a793621r41r41r40r41l43l44l43l44K524K523L241L240j538R930L479L479j299j299
$$ -1793621 -1794562 -1795503 -1796443 -1797384 -1797727 -1798071 -1798414 -1798758 -1796234 -1793711 -1790470 -1787230 -1788768 -1778838 -1775359 -1771880 -1773179 -1774478
-1362a774478N868n599m185P283J16J16o01o01o01o01l916l916l916l916j049j049l32l33
$$ -1774478 -1768610 -1774209 -1778394 -1771111 -1770995 -1770879 -1771480 -1772081 -1772682 -1773283 -1777199 -1781115 -1785031 -1788947 -1789996 -1791045 -1791377 -1791710
-1344a791710m782O686m81m82L819p649j198j199K386K385Q836k631r60r59r60r59k994Q474
$$ -1791710 -1796492 -1789806 -1790287 -1790769 -1786950 -1794599 -1795797 -1796996 -1794610 -1792225 -1783389 -1786020 -1786980 -1787939 -1788899 -1789858 -1792852 -1784378
-1326a784378K023K024J784J785l950l950n771n771L068L069O652m815J634J636K516K516
$$ -1784378 -1782355 -1780331 -1778547 -1776762 -1780712 -1784662 -1790433 -1796204 -1793136 -1790067 -1783415 -1788230 -1786596 -1784960 -1782444 -1779928
-1310a779928K516K516k262k263J0640q29p638L830O219O220K635K636R803j665r311K158
$$ -1779928 -1777412 -1774896 -1777158 -1779421 -1768781 -1769610 -1777248 -1773418 -1767199 -1760979 -1758344 -1755708 -1745905 -1747570 -1756881 -1754723
-1294a754723K158r310m532O936O219n249l188l188l904l905j755j754M696o772L815L816
$$ -1754723 -1752565 -1761875 -1766407 -1759471 -1753252 -1758501 -1761689 -1764877 -1768781 -1772686 -1774441 -1776195 -1771499 -1778271 -1774456 -1770640
-1278a770640L098L098p055p056J785J784M144p324p325M144r93r93k76k76k808k807k807
$$ -1770640 -1767542 -1764444 -1771499 -1778555 -1776770 -1774986 -1770842 -1778166 -1785491 -1781347 -1782340 -1783333 -1783609 -1783885 -1786693 -1789500 -1792307
-1261a792307k807J971J971J971J971o87o87o87o87o86o87o87o87M076M077J1244k24r542
$$ -1792307 -1795114 -1793143 -1791172 -1789201 -1787230 -1787917 -1788604 -1789291 -1789978 -1790664 -1791351 -1792038 -1792725 -1788649 -1784572 -1773328 -1773552 -1783094
-1243a783094J926M93M93j687j688P153P152L927p540p541L927M469M468m371m372K438K437
$$ -1783094 -1781168 -1780675 -1780182 -1781869 -1783557 -1776404 -1769252 -1765325 -1772865 -1780406 -1776479 -1772010 -1767542 -1771913 -1776285 -1773847 -1771410
-1226a771410K438K438n178n178J990r478r717J751P962P963n626n625L930L931p28p28O440
$$ -1771410 -1768972 -1766534 -1771712 -1776890 -1774900 -1784378 -1794095 -1792344 -1784382 -1776419 -1782045 -1787670 -1783740 -1779809 -1780537 -1781265 -1774825
-1209a774825n029j0075J392L782L782n19n19o970o969N140o327p045M424N140o327Q40Q40
$$ -1774825 -1779854 -1789929 -1788537 -1784755 -1780973 -1781492 -1782011 -1788981 -1795950 -1790810 -1797137 -1804182 -1799758 -1794618 -1800945 -1800105 -1799265
-1192a799265m327m327n401O066J0128M393m804R29O694R59M543M544l103l102l102l102l55
$$ -1799265 -1803592 -1807919 -1813320 -1807254 -1797126 -1792733 -1797537 -1796608 -1789914 -1788955 -1784412 -1779868 -1782971 -1786073 -1789175 -1792277 -1792632
-1175a792632l54l55l55l580l580l580l580M682M681j053j053M323M323n234n233N159N159
$$ -1792632 -1792986 -1793341 -1793696 -1797276 -1800856 -1804436 -1808016 -1803334 -1798653 -1799706 -1800759 -1796436 -1792113 -1797347 -1802580 -1797421 -1792262
-1158a792262n75n75r7r7o906M562Q28m905O682m785l472J5641J0624q43O79O80l8l7P99P99
$$ -1792262 -1792837 -1793412 -1793509 -1793606 -1800512 -1795950 -1795122 -1800027 -1793345 -1798130 -1801602 -1785961 -1775337 -1776180 -1775501 -1774821 -1774859 -1774896 -1774097 -1773298
-1138a773298P99P98N04N04r052r053r3r3o903M565L610k124j407M327j049j050J819l916
$$ -1773298 -1772499 -1771701 -1771197 -1770693 -1779745 -1788798 -1788891 -1788984 -1795887 -1791322 -1787712 -1789836 -1791243 -1786916 -1787965 -1789015 -1787196 -1791112
-1120a791112M565o902p261M207k602k602n827r3P044m424j198M536L818j915J669J669n387
$$ -1791112 -1786547 -1793449 -1800710 -1796503 -1799105 -1801707 -1807534 -1807627 -1800583 -1805007 -1806205 -1801669 -1797851 -1799766 -1798097 -1796428 -1801815
-1103a801815n387n386n387K019K020m790O679l10o044J841l894m969O499K916k819L987L987
$$ -1801815 -1807202 -1812588 -1817975 -1815956 -1813936 -1818726 -1812047 -1812357 -1818401 -1816560 -1820454 -1825423 -1818924 -1816008 -1818827 -1814840 -1810853
-1086a810853L629L628L868L867n689n689M584M584j150j149j150j150L868L867M11j1058
$$ -1810853 -1807224 -1803596 -1799728 -1795861 -1801550 -1807239 -1802655 -1798071 -1799221 -1800370 -1801520 -1802670 -1798802 -1794935 -1794524 -1805582
-1070a805582j500R967K441K442P69j0699o010N457N458o010n174O294N577n891j833j833
$$ -1805582 -1807082 -1797115 -1794674 -1792232 -1791463 -1802162 -1808172 -1802715 -1797257 -1803267 -1808441 -1802147 -1796570 -1802461 -1804294 -1806127
-1054a806127k549k550L781L782L065L065P395m073l356l356P754P753j803j803q571q571
$$ -1806127 -1808676 -1811226 -1807445 -1803663 -1800598 -1797533 -1790138 -1794211 -1797567 -1800923 -1793169 -1785416 -1787219 -1789022 -1797593 -1806164
-1038a806164k837k837m151m152J1857L88j613j612j613j613n316O152O152n315j665j665
$$ -1806164 -1809001 -1811838 -1815989 -1820141 -1808284 -1807896 -1809509 -1811121 -1812734 -1814347 -1819663 -1813511 -1807359 -1812674 -1814339 -1816004
-1022a816004k382k382r48r48r48r49K547K545K546K546l21l21l21l21J35J34J34J35n241
$$ -1816004 -1818386 -1820768 -1821716 -1822664 -1823612 -1824561 -1822014 -1819469 -1816923 -1814377 -1814698 -1815019 -1815340 -1815661 -1815526 -1815392 -1815258 -1815123 -1820364
-1003a820364n242M316M315K583K584J866J867O047n420J030J030O093O092l58J1109M78M78
$$ -1820364 -1825606 -1821290 -1816975 -1814392 -1811808 -1809942 -1808075 -1802028 -1807448 -1806418 -1805388 -1799295 -1793203 -1793561 -1782452 -1781974 -1781496
-986a781496J194J195l404l405O152O152O988O989k569k568q209q209N170N170q5q6q6q6j758
$$ -1781496 -1780302 -1779107 -1782511 -1785916 -1779764 -1773612 -1766624 -1759635 -1762204 -1764772 -1772981 -1781190 -1776020 -1770850 -1770935 -1771021 -1771107 -1771193 -1772951
-967a772951j758j759j758j161j161j161j161o268o267L288L289N439N439K333r134j76j75
$$ -1772951 -1774709 -1776468 -1778226 -1779387 -1780548 -1781709 -1782870 -1789138 -1795405 -1792117 -1788828 -1783389 -1777950 -1775617 -1784751 -1784927 -1785102
-950a785102q92q93m356m357m356m356k3k2k3k2k2k3k2k3M876M875J1326j42l008l009J291
$$ -1785102 -1785994 -1786887 -1791243 -1795600 -1799956 -1804312 -1804335 -1804357 -1804380 -1804402 -1804424 -1804447 -1804469 -1804492 -1799616 -1794741 -1783415 -1783557 -1786565 -1789574 -1788283
-929a788283J2760L725L726n75j2043J576J575Q59Q58J993J994J993J994J993J994J277J276
$$ -1788283 -1775523 -1771798 -1768072 -1768647 -1780690 -1779114 -1777539 -1776680 -1775822 -1773829 -1771835 -1769842 -1767848 -1765855 -1763861 -1762584 -1761308
-912a761308L744p723j273j273j990j990j989j990k169k169k169k169k168k169k169k169j408
$$ -1761308 -1757564 -1765287 -1766560 -1767833 -1769823 -1771813 -1773802 -1775792 -1777961 -1780130 -1782299 -1784468 -1786636 -1788805 -1790974 -1793143 -1794551
-895a794551j407p858L610K6K6P43P43j53j53j53j53k304k303k303k303l259l259Q209Q209
$$ -1794551 -1795958 -1803816 -1800206 -1800180 -1800154 -1799411 -1798668 -1798821 -1798974 -1799127 -1799280 -1801584 -1803887 -1806190 -1808493 -1811752 -1815011 -1806802 -1798593
-876a798593l020l020l737l737P731l737l736P731N63N64J280J281L371L371K654K654Q388
$$ -1798593 -1801613 -1804633 -1808370 -1812107 -1804376 -1808113 -1811849 -1804118 -1803555 -1802991 -1801711 -1800430 -1797059 -1793688 -1791034 -1788380 -1779992
-859a779992l079L371L370N044N043P43j0725p141M326k841k840L255L255K538K539M928o541
$$ -1779992 -1783071 -1779700 -1776330 -1771286 -1766243 -1765500 -1776225 -1783366 -1779040 -1781881 -1784721 -1781466 -1778211 -1775673 -1773134 -1768206 -1774747
-842a774747o540M928n08n08n08n07N943n525R26R26M77M78M78M78q123q123l106Q362J314
$$ -1774747 -1781287 -1776359 -1776867 -1777375 -1777883 -1778390 -1772447 -1777972 -1777046 -1776120 -1775643 -1775165 -1774687 -1774209 -1782332 -1790455 -1793561 -1785199 -1783885
-823a783885J314K031K030j314j314p764L703o7o8O50O49O50O50O49O50p25p24p24p24M054
$$ -1783885 -1782571 -1780540 -1778510 -1779824 -1781138 -1788902 -1785199 -1785266 -1785334 -1784684 -1784035 -1783385 -1782735 -1782086 -1781436 -1782161 -1782885 -1783609 -1784333 -1780279
-803a780279M054M054M054R78R78K62K61L845p623j172j172N00N00N00N01k367k367k367k366
$$ -1780279 -1776225 -1772171 -1768117 -1767139 -1766161 -1765899 -1765638 -1761793 -1769416 -1770588 -1771760 -1771260 -1770760 -1770260 -1769759 -1772126 -1774493 -1776860 -1779226
-784a779226J220J221J221J220l557l558l557l558M14M15M14M15J847J848J848J848j154j153
$$ -1779226 -1778006 -1776785 -1775564 -1774344 -1777901 -1781459 -1785016 -1788574 -1788160 -1787745 -1787331 -1786916 -1785069 -1783221 -1781373 -1779525 -1780679 -1781832
-766a781832j154j153m37m37o887M580P58P58P925l543o75o76j392j393P298P298m169m170
$$ -1781832 -1782986 -1784139 -1784576 -1785013 -1791900 -1787320 -1786562 -1785804 -1777879 -1781422 -1782097 -1782773 -1784165 -1785558 -1778260 -1770962 -1775131 -1779301
-748a779301K998K997R449k020N78N79q55q55Q463l005q022q022N155N155n596n596j0612
$$ -1779301 -1776303 -1773306 -1763857 -1765877 -1765299 -1764720 -1765575 -1766430 -1757967 -1760972 -1768994 -1777016 -1771861 -1766706 -1772302 -1777898 -1788510
-731a788510Q54J3040J572p567L901l267l266m00l99l99m00j661j661j661j662l094l095r545
$$ -1788510 -1787656 -1774616 -1773044 -1780611 -1776710 -1779977 -1783243 -1783643 -1784042 -1784441 -1784841 -1786502 -1788163 -1789824 -1791486 -1794580 -1797675 -1807220
-713a807220J922O343O342m409m409Q015Q015j1098j1098J265J266J265J265o45o46O522m947
$$ -1807220 -1805298 -1798955 -1792613 -1797022 -1801431 -1793416 -1785401 -1796499 -1807597 -1806332 -1805066 -1803801 -1802536 -1803181 -1803827 -1797305 -1802252
-696a802252k408R060J176J176L207q261j811j810J989J990l744l744J2979J2980o133o133
$$ -1802252 -1804660 -1795600 -1794424 -1793248 -1790041 -1798302 -1800113 -1801923 -1799934 -1797944 -1801688 -1805432 -1792453 -1779473 -1785606 -1791739
-680a791739j385j385M349M349n089n088O380O380l662l662l663l662n56n56n56n57O39O38
$$ -1791739 -1793124 -1794509 -1790160 -1785811 -1790900 -1795988 -1789608 -1783228 -1786890 -1790552 -1794215 -1797877 -1798433 -1798989 -1799545 -1800102 -1799463 -1798825
-662a798825O38O39k707k706k707k706K049K050K049K050m760m759R74R74q463q462L005L005
$$ -1798825 -1798187 -1797548 -1800255 -1802961 -1805668 -1808374 -1806325 -1804275 -1802226 -1800176 -1804936 -1809695 -1808721 -1807747 -1816210 -1824672 -1821667 -1818662
-644a818662N752N753n715n716J990J990J989J990l386l385l386l386O350O350O15O17o552
$$ -1818662 -1812910 -1807157 -1812872 -1818588 -1816598 -1814608 -1812619 -1810629 -1814015 -1817400 -1820786 -1824172 -1817822 -1811472 -1810857 -1810240 -1816792
-627a816792o551M916M916l972l972J762J762K121K120r347r348j49j49J1318J1319Q06Q06
$$ -1816792 -1823343 -1818427 -1813511 -1817483 -1821455 -1819693 -1817931 -1815810 -1813690 -1823037 -1832385 -1832534 -1832683 -1821365 -1810046 -1809240 -1808434
-610a808434Q07Q06k24k24k24k24j658j657j657j658J956J956J956J957J956J956J956J956
$$ -1808434 -1807627 -1806821 -1807045 -1807269 -1807493 -1807717 -1809375 -1811032 -1812689 -1814347 -1812391 -1810435 -1808479 -1806522 -1804566 -1802610 -1800654 -1798698
-592a798698L543L542L543L543l625l625l625l624P65P65P65P66P65P65P65P66j527j527j527
$$ -1798698 -1795155 -1791613 -1788070 -1784527 -1788152 -1791777 -1795402 -1799026 -1798261 -1797496 -1796731 -1795965 -1795200 -1794435 -1793670 -1792904 -1794431 -1795958 -1797485
-573a797485j527j526j527j527j527K117K116K117K117j228j229j228j228K150K151K150K150
$$ -1797485 -1799012 -1800538 -1802065 -1803592 -1805119 -1803002 -1800886 -1798769 -1796652 -1797880 -1799109 -1800337 -1801565 -1799415 -1797264 -1795114 -1792964
-556a792964k150k150k151k150N68N67N67N68o600o600M868M868Q059Q060l409l408n678n678
$$ -1792964 -1795114 -1797264 -1799415 -1801565 -1800997 -1800430 -1799863 -1799295 -1805895 -1812495 -1807627 -1802759 -1794700 -1786640 -1790049 -1793457 -1799135 -1804813
-538a804813N790N790k990k990K744K743K36K35K35K35R07R07R08R07n27n26n26n27L237L236
$$ -1804813 -1799023 -1793233 -1796223 -1799213 -1796469 -1793726 -1793490 -1793255 -1793020 -1792785 -1791878 -1790971 -1790063 -1789156 -1789683 -1790209 -1790735 -1791262 -1788025 -1784789
-518a784789L237L236j0381j0382J087J086J49J49J50J49m868m868O601O600r915r915J553
$$ -1784789 -1781552 -1778316 -1788697 -1799079 -1797992 -1796906 -1796757 -1796608 -1796458 -1796309 -1801177 -1806045 -1799444 -1792844 -1802759 -1812674 -1811121
-501a811121J552J076J075J075J075P47P46P47P46M569M570o899o898m958m957O510O510o57
$$ -1811121 -1809569 -1808493 -1807418 -1806343 -1805268 -1804521 -1803775 -1803028 -1802282 -1797713 -1793143 -1800042 -1806940 -1811898 -1816855 -1810345 -1803835 -1804492
-483a804492o57o57o57M502M502M503M501n15n15J0953J0953J127J127J128J127m368m367
$$ -1804492 -1805149 -1805806 -1806463 -1801961 -1797459 -1792956 -1788455 -1788970 -1789485 -1778532 -1767579 -1766452 -1765325 -1764197 -1763070 -1767438 -1771805
-466a771805m368m367J370J370J370J370n081n081n080n081o663o664M804M805m872m871Q62
$$ -1771805 -1776173 -1780540 -1779170 -1777800 -1776430 -1775060 -1780141 -1785222 -1790302 -1795383 -1802046 -1808710 -1803906 -1799101 -1803973 -1808844 -1807982
-449a807982Q62K938K938K938K938l991l990J743J743O014O014n454n454j751j750j751j751
$$ -1807982 -1807120 -1804182 -1801244 -1798306 -1795368 -1799359 -1803349 -1801606 -1799863 -1793849 -1787835 -1793289 -1798743 -1800494 -1802244 -1803995 -1805746
-432a805746O104O103n364n365N148N148o320o320k677k676k677k676N685N685N686N685J400
$$ -1805746 -1799642 -1793539 -1798903 -1804268 -1799120 -1793972 -1800292 -1806612 -1809289 -1811965 -1814642 -1817318 -1811633 -1805948 -1800262 -1794577 -1793177
-415a793177J400J400J400N700N701N700N700O716O716O716O715J1016J1017J1016J1016J6545
$$ -1793177 -1791777 -1790377 -1788977 -1783277 -1777576 -1771876 -1766176 -1759460 -1752744 -1746028 -1739313 -1728297 -1717280 -1706264 -1695248 -1678703
-399a678703J6545J6544J6545q96q96k0009k0009k0367k0368j9650j9651j8695p227k210k210
$$ -1678703 -1662158 -1645614 -1629069 -1629965 -1630861 -1650870 -1670879 -1691246 -1711614 -1731264 -1750915 -1769610 -1776837 -1779047 -1781257
-384a781257n38n37j2006j2005k449k449k449k449J284J285J284J284J284J284n883N585J1012
$$ -1781257 -1781795 -1782332 -1794338 -1806343 -1808792 -1811241 -1813690 -1816139 -1814855 -1813570 -1812286 -1811002 -1809718 -1808434 -1814317 -1808732 -1797720
-367a797720m55m039m040m55J1012m55j1923j979j978j979j978l06J1161L995L994j904j3372
$$ -1797720 -1798175 -1802214 -1806254 -1806709 -1795697 -1796152 -1808075 -1810054 -1812032 -1814011 -1815989 -1816295 -1805134 -1801139 -1797145 -1799049 -1812421
-350a812421M547M547P24P24P25P24j904j904j904j903J440J441J441J441j679j680k397k397
$$ -1812421 -1807874 -1803327 -1802603 -1801879 -1801154 -1800430 -1802334 -1804238 -1806142 -1808045 -1806605 -1805164 -1803723 -1802282 -1803961 -1805641 -1808038 -1810435
-332a810435Q355l113K620K621M711o757p474L995P339m129q429q429j949j948j949j949O80
$$ -1810435 -1802080 -1805193 -1802573 -1799952 -1795241 -1801998 -1809472 -1805477 -1798138 -1802267 -1810696 -1819125 -1821074 -1823022 -1824971 -1826920 -1826240
-315a826240O79O80O79M323M323k845Q623N040o428n712N757j65j64N53N52k792k793k792
$$ -1826240 -1825561 -1824881 -1824202 -1819879 -1815556 -1818401 -1809778 -1804738 -1811166 -1816878 -1811121 -1811286 -1811450 -1810897 -1810345 -1813137 -1815930 -1818722
-297a818722k792q81q81q81q81J747J747J747J747P014P015m454m453M386M386M387M386k13
$$ -1818722 -1821514 -1822395 -1823276 -1824157 -1825038 -1823291 -1821544 -1819797 -1818050 -1811036 -1804021 -1808475 -1812928 -1808542 -1804156 -1799769 -1795383 -1795596
-279a795596k13k12k13k005k004p381K177J799J799K397K397PQPQL889L890L890L890o623
$$ -1795596 -1795809 -1796021 -1796234 -1798239 -1800243 -1807624 -1805447 -1803648 -1801849 -1799452 -1797055 -1797048 -1797040 -1797033 -1797025 -1793136 -1789246 -1785356 -1781466 -1788089
-259a788089o622M845M846J348J347o059j1792m984Q396L737j998k893k893l251l252j579
$$ -1788089 -1794711 -1789866 -1785020 -1783672 -1782325 -1788384 -1800176 -1805160 -1796764 -1793027 -1795025 -1797918 -1800811 -1804062 -1807314 -1808893
-243a808893j579j579j579M517M517p39j0296m562Q818O94O94M26M26M25M26M25M26M25M26
$$ -1808893 -1810472 -1812051 -1813630 -1809113 -1804596 -1805335 -1815631 -1820193 -1811375 -1810681 -1809987 -1809561 -1809135 -1808710 -1808284 -1807859 -1807433 -1807008 -1806582
-224a806582l718l718l718l719P034P033m435m435j538j538r41r41m285N271L121k613k229
$$ -1806582 -1810300 -1814018 -1817736 -1821455 -1814421 -1807388 -1811823 -1816258 -1817796 -1819334 -1820275 -1821216 -1825501 -1820230 -1817109 -1819722 -1821951
-207a821951k229Q881Q881m498m498m499m498P268P268J535q023O98O432Q344j213r397l662
$$ -1821951 -1824180 -1815299 -1806418 -1810916 -1815414 -1819913 -1824411 -1817143 -1809875 -1808340 -1816363 -1815665 -1809233 -1800889 -1802102 -1811499 -1815161
-190a815161L625L625J594m140r038M342P447k109Q77O612j512j512j154j153j083j082j083
$$ -1815161 -1811536 -1807911 -1806317 -1810457 -1819495 -1815153 -1807706 -1809815 -1808938 -1802326 -1803838 -1805350 -1806504 -1807657 -1808740 -1809822 -1810905
-173a810905j083k277k277R191R191l114l113l113l114L815L815L816L815K774K773K774K774
$$ -1810905 -1811988 -1814265 -1816542 -1807351 -1798160 -1801274 -1804387 -1807500 -1810614 -1806799 -1802984 -1799168 -1795353 -1792579 -1789806 -1787032 -1784258
-156a784258m394m394m394m394j168j168j169j169K894K893K893K893p011p010M457M457n60
$$ -1784258 -1788652 -1793046 -1797440 -1801834 -1803002 -1804170 -1805339 -1806508 -1803614 -1800721 -1797828 -1794935 -1801946 -1808956 -1804499 -1800042 -1800602
-139a800602n60n60n60j157j157j157j158K77K76K76K76O4O3O4O3j75j76j75j76p492p492
$$ -1800602 -1801162 -1801722 -1802282 -1803439 -1804596 -1805753 -1806911 -1806634 -1806358 -1806082 -1805806 -1805742 -1805679 -1805615 -1805552 -1805727 -1805903 -1806078 -1806254 -1813746 -1821238
-118a821238J1621J1621P320P321m147m148j829j829j829j830J755J754J755J755J007J008
$$ -1821238 -1809617 -1797996 -1790676 -1783355 -1787502 -1791650 -1793479 -1795308 -1797137 -1798967 -1797212 -1795458 -1793703 -1791948 -1790941 -1789933
-102a789933J008J008j381j381j382j381P32P31P32P32K882K882q586q586K225K225K224K225
$$ -1789933 -1788925 -1787917 -1789298 -1790679 -1792061 -1793442 -1792710 -1791979 -1791247 -1790515 -1787633 -1784751 -1793337 -1801923 -1799698 -1797473 -1795249 -1793024
-84a793024j836j837j837j836k740k740k740k741O05O05O05O04K337K337K337K337j964j963
$$ -1793024 -1794860 -1796697 -1798534 -1800370 -1803110 -1805850 -1808590 -1811331 -1810726 -1810121 -1809516 -1808912 -1806575 -1804238 -1801901 -1799564 -1801528 -1803491
-66a803491j964j963R55R56R56R55K390K389K389K389l285l285l285l285j852j852R617R616
$$ -1803491 -1805455 -1807418 -1806463 -1805507 -1804551 -1803596 -1801206 -1798817 -1796428 -1794039 -1797324 -1800609 -1803894 -1807179 -1809031 -1810883 -1801266 -1791650
-48a791650o432o432N036N036m043m043m043m043L184L185L184L184J034J034Q202l267q089
$$ -1791650 -1798082 -1804514 -1799478 -1794442 -1798485 -1802528 -1806571 -1810614 -1807430 -1804245 -1801061 -1797877 -1796843 -1795809 -1787607 -1790874 -1798963
-31a798963L378l789l789m505m506m506m506L080L080L080L079k65k65k65k65K912K912K911
$$ -1798963 -1795585 -1799374 -1803163 -1807668 -1812174 -1816680 -1821186 -1818106 -1815026 -1811946 -1808867 -1809132 -1809397 -1809662 -1809927 -1807015 -1804103 -1801192
-13a801192K912l300l300l300l300L091L091L091L091j210j209j210j209M629M629M629M629
$$ -1801192 -1798280 -1801580 -1804880 -1808180 -1811480 -1808389 -1805298 -1802207 -1799116 -1800326 -1801535 -1802745 -1803954 -1799325 -1794696 -1790067 -1785438
3a785438j583j583j583j582p17p17j433j434N734n734n734N734k613k613j897j896J210J209
$$ -1785438 -1787021 -1788604 -1790187 -1791769 -1792486 -1793203 -1794636 -1796070 -1790336 -1796070 -1801804 -1796070 -1798683 -1801296 -1803193 -1805089 -1803879 -1802670
21a802670J210J209l837l838P630P631j210j209j210j209K762K762K763K762L74L73L73L74
$$ -1802670 -1801460 -1800251 -1804088 -1807926 -1800296 -1792665 -1793875 -1795084 -1796294 -1797503 -1794741 -1791979 -1789216 -1786454 -1786080 -1785707 -1785334 -1784960
39a784960M92M93M93M93r41r41r40r41j572j571j572j572Q18Q17Q18Q17p95p95p95p95j034
$$ -1784960 -1784468 -1783975 -1783482 -1782989 -1783930 -1784871 -1785811 -1786752 -1788324 -1789895 -1791467 -1793039 -1792221 -1791404 -1790586 -1789769 -1790564 -1791359 -1792154 -1792949 -1793983
60a793983j034R717R717M44j1023j1024M44L072L073L789L789Q03Q02Q03Q02k900k901k900
$$ -1793983 -1795017 -1785300 -1775583 -1775139 -1786162 -1797186 -1796742 -1793670 -1790597 -1786808 -1783019 -1782216 -1781414 -1780611 -1779809 -1782709 -1785610 -1788510
78a788510k901k833k834O007O006N648n820O31O31m565m566m565m566J646J647J646J646O91
$$ -1788510 -1791411 -1794244 -1797078 -1791071 -1785065 -1779417 -1785237 -1784606 -1783975 -1788540 -1793106 -1797671 -1802237 -1800591 -1798944 -1797298 -1795652 -1794961
96a794961O90O91O91R3R3R4R3k535k534J7295N827p910p911k893k893P54P54J471r997K068
$$ -1794961 -1794271 -1793580 -1792889 -1792796 -1792703 -1792609 -1792516 -1795051 -1797585 -1780290 -1774463 -1782373 -1790284 -1793177 -1796070 -1795316 -1794562 -1793091 -1803088 -1801020
116a801020K068q205q205J053J052J053J053K844K845K844K845k292k292k292k292K964K964
$$ -1801020 -1798952 -1807157 -1815362 -1814309 -1813257 -1812204 -1811151 -1808307 -1805462 -1802618 -1799773 -1802065 -1804357 -1806649 -1808941 -1805977 -1803013
133a803013L681L680l785P683P682l785j038j038q205L263O883O884O72j0796J747J747J031
$$ -1803013 -1799332 -1795652 -1799437 -1791754 -1784072 -1787857 -1788895 -1789933 -1798138 -1794875 -1787992 -1781108 -1780436 -1791232 -1789485 -1787738 -1786707
150a786707J030k434k434k434k434M614M614M614M614q317q317j389J0079j508j508p91p92
$$ -1786707 -1785677 -1788111 -1790545 -1792979 -1795413 -1790799 -1786185 -1781571 -1776957 -1785274 -1793591 -1794980 -1784901 -1786409 -1787917 -1788708 -1789500
167a789500J897J896J896J897j449j448j448j449K897K897K897K897k718k718k717k718n226
$$ -1789500 -1787603 -1785707 -1783811 -1781914 -1783363 -1784811 -1786259 -1787708 -1784811 -1781914 -1779017 -1776120 -1778838 -1781556 -1784273 -1786991 -1792217
184a792217n227M331M330N764N764l076l076n152O316N83N82l360Q108J658J657l73l73p541
$$ -1792217 -1797444 -1793113 -1788783 -1783019 -1777255 -1780331 -1783407 -1788559 -1782243 -1781660 -1781078 -1784438 -1776330 -1774672 -1773015 -1773388 -1773761 -1781302
202a781302L927J0617q51r691J777Q336Q335m326m327M275M274n282n282O633O634Q99R00
$$ -1781302 -1777375 -1766758 -1767609 -1777300 -1775523 -1767187 -1758852 -1763178 -1767505 -1763230 -1758956 -1764238 -1769520 -1762887 -1756253 -1755354 -1754454
219a754454k684k684k684k684o83o83o84o83j280j281j280j280M662M663m894m894M065M065
$$ -1754454 -1757138 -1759822 -1762506 -1765190 -1765873 -1766556 -1767240 -1767923 -1769203 -1770484 -1771764 -1773044 -1768382 -1763719 -1768613 -1773507 -1769442 -1765377
237a765377j668j669n170n171N64N64J997J997p559p560M626M625j109j109l139l140K595
$$ -1765377 -1767045 -1768714 -1773884 -1779055 -1778491 -1777927 -1775930 -1773933 -1781492 -1789052 -1784426 -1779801 -1780910 -1782019 -1785158 -1788298 -1785703
254a785703K594L043L042L043L042l767l766l767l767K087K087K087K087N6N5J251J251k233
$$ -1785703 -1783109 -1780066 -1777024 -1773981 -1770939 -1774706 -1778472 -1782239 -1786006 -1783919 -1781832 -1779745 -1777658 -1777602 -1777547 -1776296 -1775045 -1777278
272a777278J6881L024q444J232J231N16N15j038j038j038j037k472k471k471k471P130P130
$$ -1777278 -1760397 -1757373 -1765817 -1764585 -1763354 -1762838 -1762323 -1763361 -1764399 -1765437 -1766474 -1768946 -1771417 -1773888 -1776359 -1769229 -1762099
289a762099P130P130n174n174n174n174m577m576M979M980M41M40n293n294J023J023J023
$$ -1762099 -1754969 -1747839 -1753013 -1758187 -1763361 -1768535 -1773112 -1777688 -1772709 -1767729 -1767288 -1766848 -1772141 -1777435 -1776412 -1775389 -1774366
306a774366J023K934K934K934K934p130p130O249O249m501m503J232J232l867l868l867l867
$$ -1774366 -1773343 -1770409 -1767475 -1764541 -1761607 -1768737 -1775867 -1769618 -1763369 -1767870 -1772373 -1771141 -1769909 -1773776 -1777644 -1781511 -1785378
323a785378J149J150J150J150L598L599n958n958K643K643l091l091k684k684k684k684L169
$$ -1785378 -1784229 -1783079 -1781929 -1780779 -1777181 -1773582 -1779540 -1785498 -1782855 -1780212 -1783303 -1786394 -1789078 -1791762 -1794446 -1797130 -1793961
340a793961L170L169L169L379L378L379L378J587J586J587J586p858p858R82R82M804o664
$$ -1793961 -1790791 -1787622 -1784453 -1781074 -1777696 -1774317 -1770939 -1769352 -1767766 -1766179 -1764593 -1772451 -1780309 -1779327 -1778345 -1773541 -1780205
357a780205r29J0538k363k363N522n947k602Q866J698J699l248l248q58J0609M278p190n756
$$ -1780205 -1781134 -1770596 -1772959 -1775322 -1769800 -1775747 -1778349 -1769483 -1767785 -1766086 -1769334 -1772582 -1773440 -1762831 -1758553 -1765743 -1771499
374a771499n756R056R056m323m322L680L681k053k053p69p69p69p69M129M128M129M129j247
$$ -1771499 -1777255 -1768199 -1759143 -1763466 -1767788 -1764108 -1760427 -1762480 -1764533 -1765302 -1766071 -1766840 -1767609 -1763480 -1759352 -1755223 -1751094 -1752341
392a752341j247j247j247j246j247j247j247m07m07m07m06J90J90J91J90m618m617j512R956
$$ -1752341 -1753588 -1754835 -1756082 -1757328 -1758575 -1759822 -1761069 -1761476 -1761883 -1762290 -1762696 -1762506 -1762316 -1762125 -1761935 -1766553 -1771170 -1772682 -1762726
411a762726j871j870j153j154n86n86n86n86K758K759K759K759k110k109k109k109k109k109
$$ -1762726 -1764597 -1766467 -1767620 -1768774 -1769360 -1769946 -1770532 -1771118 -1768360 -1765601 -1762842 -1760083 -1762193 -1764302 -1766411 -1768520 -1770629 -1772738
429a772738k110k109J561J560J561J560M666M667N383o085m353m353M487M487m10m11m10m11
$$ -1772738 -1774848 -1776957 -1775396 -1773836 -1772275 -1770715 -1766049 -1761382 -1755999 -1762084 -1766437 -1770790 -1766303 -1761816 -1762226 -1762637 -1763047 -1763458
447a763458O010O010l546l546j516j516j515j516k2k3k2k2K127K128m323P145N08N08J224
$$ -1763458 -1757448 -1751438 -1754984 -1758530 -1760046 -1761562 -1763077 -1764593 -1764615 -1764638 -1764660 -1764682 -1762555 -1760427 -1764750 -1757605 -1757097 -1756589 -1755365
466a755365J225K658K657J942J941N405o062o063N406j165j165m48m48n215n215M342M341
$$ -1755365 -1754140 -1751482 -1748825 -1746883 -1744942 -1739537 -1745599 -1751662 -1746256 -1747421 -1748586 -1749034 -1749482 -1754697 -1759912 -1755570 -1751229
483a751229K789K789k946k945k527k528P030P029k766k767L685p783K16K17n01n00j934j933
$$ -1751229 -1748440 -1745651 -1748597 -1751542 -1754069 -1756597 -1749567 -1742538 -1745304 -1748071 -1744386 -1752169 -1751953 -1751736 -1752237 -1752737 -1754671 -1756604
501a756604j934j934r48r48r48r48M069M069n488n487O805O805P522l946l348l349J669J669
$$ -1756604 -1758538 -1760472 -1761420 -1762368 -1763316 -1764264 -1760195 -1756126 -1761614 -1767101 -1760296 -1753491 -1745969 -1749915 -1753263 -1756612 -1754943 -1753274
519a753274N93N94N93N94p21p20p888L580P212m255K911K912K195K195K195K195J150J150
$$ -1753274 -1752681 -1752087 -1751494 -1750900 -1751621 -1752341 -1760229 -1756649 -1749437 -1753692 -1750781 -1747869 -1745674 -1743479 -1741284 -1739089 -1737939 -1736789
537a736789J150J149o017o018o018o017J627J628J628J627k673k673k672k673L73L73P541
$$ -1736789 -1735639 -1734490 -1740507 -1746525 -1752543 -1758560 -1756933 -1755305 -1753677 -1752050 -1754723 -1757396 -1760068 -1762741 -1762368 -1761995 -1754454
554a754454l927p272M196k972k971m054m054m054m054M069M069M068M069k91k91k91k91J142
$$ -1754454 -1758381 -1765653 -1761457 -1764429 -1767400 -1771454 -1775508 -1779562 -1783616 -1779547 -1775478 -1771410 -1767341 -1767632 -1767923 -1768214 -1768505 -1767363
572a767363J142J143J142L039L039l412Q055N31N29J247J247j739j740L994L995o996o996
$$ -1767363 -1766221 -1765078 -1763936 -1760897 -1757858 -1761270 -1753215 -1752684 -1752155 -1750908 -1749661 -1751400 -1753140 -1749146 -1745151 -1752147 -1759143
589a759143K561K561K221K221m946O522N685n782J385J385j9j9j8j9k288k289r455K011L924
$$ -1759143 -1756582 -1754021 -1751800 -1749579 -1754525 -1748003 -1742318 -1748100 -1746715 -1745330 -1745349 -1745368 -1745386 -1745405 -1747693 -1749982 -1759437 -1757426 -1753502
608a753502p545j093J0374N357N357l483l483J683J684J684J683l692l692Q971Q970L028q441
$$ -1753502 -1761047 -1762140 -1751766 -1746409 -1741052 -1744535 -1748018 -1746335 -1744651 -1742967 -1741284 -1744976 -1748668 -1739697 -1730727 -1727699 -1736140
625a736140k706Q761l542l543k109k109j0322J146J0702p65p65p65j482j482m558m558M998
$$ -1736140 -1738846 -1730085 -1733627 -1737170 -1739279 -1741388 -1751710 -1750564 -1739862 -1740627 -1741392 -1742157 -1743639 -1745121 -1749679 -1754237 -1749239
642a749239M999M998M999m558m558M1M1o410N058j989j990j273j273j277j276j277j277j396
$$ -1749239 -1744240 -1739242 -1734243 -1738801 -1743359 -1743318 -1743277 -1749687 -1744629 -1746618 -1748608 -1749881 -1751154 -1752431 -1753707 -1754984 -1756261 -1757657
660a757657j396P444P443J113j0356l904l905K76K76K76K77L009L008L009L009K292K292Q743
$$ -1757657 -1759053 -1751609 -1744166 -1743053 -1753409 -1757313 -1761218 -1760942 -1760666 -1760390 -1760113 -1757104 -1754096 -1751087 -1748078 -1745786 -1743494 -1734751
678a734751k725j501j500k218k217N905N906N906N905k113k112k113k113k352k352K665K666
$$ -1734751 -1737476 -1738977 -1740477 -1742695 -1744912 -1739007 -1733101 -1727195 -1721290 -1723403 -1725515 -1727628 -1729741 -1732093 -1734445 -1731780 -1729114
695a729114R63j0505r48J0520N861N861o085o085l517P952P951l517q772q773O7O8L531L532
$$ -1729114 -1728151 -1738656 -1739604 -1729084 -1723223 -1717362 -1723447 -1729532 -1733049 -1725097 -1717146 -1720663 -1729435 -1738208 -1738141 -1738073 -1734542 -1731010
713a731010L531L531l038l039l039l038K934K934K934K934K934K935K934K934R33R33R34R33
$$ -1731010 -1727479 -1723948 -1726986 -1730025 -1733064 -1736102 -1733168 -1730234 -1727300 -1724366 -1721432 -1718497 -1715563 -1712629 -1711696 -1710763 -1709829 -1708896
731a708896R33R34R33R33L203L203L203L203L203L203L203L203J052J053J053J053l607l606
$$ -1708896 -1707963 -1707029 -1706096 -1705163 -1701960 -1698757 -1695554 -1692351 -1689148 -1685945 -1682742 -1679539 -1678487 -1677434 -1676381 -1675328 -1678935 -1682541
749a682541l606l606m259m260N297N298J60J61n574n573j602j601M132M133k677k676L057
$$ -1682541 -1686147 -1689753 -1694012 -1698272 -1692975 -1687677 -1687517 -1687356 -1692930 -1698503 -1700105 -1701706 -1697574 -1693441 -1696118 -1698794 -1695737
766a695737L057K21K20K20K20m677m678m677m678J01J01J01J01J00J01J01J01k509k508k509
$$ -1695737 -1692680 -1692459 -1692239 -1692019 -1691799 -1696476 -1701154 -1705831 -1710509 -1710408 -1710307 -1710206 -1710105 -1710005 -1709904 -1709803 -1709702 -1712211 -1714719 -1717228
786a717228k509J792J792J792J792L28L29L28L29M629M629M629M629O68O68O68O68j68j68
$$ -1717228 -1719737 -1717945 -1716153 -1714361 -1712569 -1712241 -1711912 -1711584 -1711255 -1706626 -1701997 -1697368 -1692739 -1692071 -1691403 -1690735 -1690067 -1690235 -1690403
805a690403j68j67l334l334O223O223n86n86n86n86k229k228k229k229L028L027L028L027
$$ -1690403 -1690571 -1690738 -1694072 -1697406 -1691183 -1684960 -1685546 -1686132 -1686718 -1687304 -1689533 -1691761 -1693990 -1696219 -1693191 -1690164 -1687136 -1684109
823a684109k467k468k467k468K191K192K191K191J314J314q242q243K389K390K389K389n465
$$ -1684109 -1686576 -1689044 -1691511 -1693979 -1691788 -1689596 -1687405 -1685214 -1683900 -1682586 -1690828 -1699071 -1696682 -1694292 -1691903 -1689514 -1694979
840a694979n465n466n465j762j762j762j762j123j124M610M611m349m349N207N208M341M342
$$ -1694979 -1700444 -1705910 -1711375 -1713137 -1714899 -1716661 -1718423 -1719546 -1720670 -1716060 -1711449 -1715798 -1720147 -1714940 -1709732 -1705391 -1701049
857a701049j393j392M819M820M819M819m334m334m334m334j586j587P970P970J251J250n917
$$ -1701049 -1702442 -1703834 -1699015 -1694195 -1689376 -1684557 -1688891 -1693225 -1697559 -1701893 -1703479 -1705066 -1697096 -1689126 -1687875 -1686625 -1692542
874a692542N551O149n320J848J848n017n017n018n017l58l59l58l58Q033Q034j523j524l673
$$ -1692542 -1686991 -1680842 -1686162 -1684314 -1682466 -1687483 -1692500 -1697518 -1702535 -1702893 -1703252 -1703610 -1703968 -1695935 -1687901 -1689424 -1690948 -1694621
892a694621l673K060K061l987l987l987l986k84k84N450N451N330N331m226m225l987l987
$$ -1694621 -1698294 -1696234 -1694173 -1698160 -1702147 -1706134 -1710120 -1710404 -1710688 -1705238 -1699787 -1694457 -1689126 -1693352 -1697577 -1701564 -1705551
909a705551j0438J031L833L834M551M550n125n126n125n125j781j781L954L953J0643J0643
$$ -1705551 -1715989 -1714958 -1711125 -1707291 -1702740 -1698190 -1703315 -1708441 -1713566 -1718691 -1720472 -1722253 -1718299 -1714346 -1703703 -1693060
925a693060k737k736K214K213K214K214n790n790n790n790K064K065K064K064K065K064K065
$$ -1693060 -1695797 -1698533 -1696319 -1694106 -1691892 -1689678 -1695468 -1701258 -1707048 -1712838 -1710774 -1708709 -1706645 -1704581 -1702516 -1700452 -1698387
942a698387K064J056J057P507l961j810j811k527k527j09j08j08j08O08O09o559M908M365
$$ -1698387 -1696323 -1695267 -1694210 -1686703 -1690664 -1692474 -1694285 -1696812 -1699339 -1699448 -1699556 -1699664 -1699772 -1699164 -1698555 -1705114 -1700206 -1695841
960a695841p105O4O3o53o53o53o54j250j251j967j968N559n909N41N41k20k20n955n954n78
$$ -1695841 -1702946 -1702882 -1702819 -1703472 -1704125 -1704778 -1705432 -1706682 -1707933 -1709900 -1711868 -1706309 -1712218 -1711677 -1711136 -1711356 -1711576 -1717531 -1723485 -1724063
980a724063n79J2801J2800n745n745L811L812k162k161k161k162j474j475j475j474j475j474
$$ -1724063 -1724642 -1711841 -1699041 -1704786 -1710531 -1706720 -1702908 -1705070 -1707231 -1709392 -1711554 -1713028 -1714503 -1715978 -1717452 -1718927 -1720401
997a720401j475j474J123J124J124J123M110M110M111M110p104p104K452K453K333K333K333
$$ -1720401 -1721876 -1723350 -1722227 -1721103 -1719979 -1718856 -1714746 -1710636 -1706525 -1702415 -1709519 -1716623 -1714171 -1711718 -1709385 -1707052 -1704719
1014a704719K333L439L438L438L438K005K004K005K005k849k848k848k849k848k848k849k848
$$ -1704719 -1702386 -1698947 -1695509 -1692071 -1688633 -1686628 -1684624 -1682619 -1680614 -1683463 -1686311 -1689159 -1692008 -1694856 -1697704 -1700553 -1703401
1031a703401n387n386n387n387M648M647M648M647L868L867L868L867M345M346n212n211N838
$$ -1703401 -1708788 -1714174 -1719561 -1724948 -1720300 -1715653 -1711005 -1706358 -1702490 -1698623 -1694755 -1690888 -1686543 -1682197 -1687409 -1692620 -1686782
1048a686782N839l718l718J060J060J060J060M19M18M18M18M18M18M18M18K688K688K688K687
$$ -1686782 -1680943 -1684661 -1688379 -1687319 -1686259 -1685199 -1684139 -1683720 -1683302 -1682884 -1682466 -1682048 -1681630 -1681212 -1680794 -1678106 -1675418 -1672730 -1670043
1067a670043o629o630O749O749O474O473P39P39N00N00n233n234j531j530p265p264K61K61
$$ -1670043 -1676672 -1683302 -1676553 -1669804 -1663330 -1656857 -1656118 -1655379 -1654879 -1654379 -1659612 -1664846 -1666377 -1667907 -1675172 -1682436 -1682175 -1681914
1085a681914K62K61L875L875n682n681J485J486J486J485j202j202M532M532p652p653N726
$$ -1681914 -1681652 -1681391 -1677516 -1673641 -1679323 -1685004 -1683519 -1682033 -1680547 -1679062 -1680264 -1681466 -1676934 -1672402 -1680054 -1687707 -1681981
1102a681981N727K6L0L0K9n349n346n345n346K714K717K718K718o31o27o28o27O190O193O193
$$ -1681981 -1676254 -1676228 -1676198 -1676168 -1676139 -1681488 -1686834 -1692179 -1697525 -1694811 -1692094 -1689376 -1686658 -1687289 -1687916 -1688544 -1689171 -1682981 -1676788 -1670595
1122a670595O193m203m200m200m199l636l633N925N924L770L775j960j960J57J57J56J57K188
$$ -1670595 -1664402 -1668605 -1672805 -1677005 -1681204 -1684840 -1688473 -1682548 -1676624 -1672854 -1669079 -1671039 -1672999 -1672842 -1672685 -1672529 -1672372 -1670184
1140a670184K187K188K187k143k142R325r788m890O577j067j068o007o006L550L550L550L551
$$ -1670184 -1667997 -1665809 -1663622 -1665765 -1667907 -1658582 -1668370 -1673260 -1666683 -1667750 -1668818 -1674825 -1680831 -1677281 -1673731 -1670181 -1666630
1157a666630o007o006K534K535K535K534m51m52m52m51J1J1J1J5n245n245n245n241L058L057
$$ -1666630 -1672637 -1678643 -1676109 -1673574 -1671039 -1668505 -1668956 -1669408 -1669860 -1670311 -1670300 -1670289 -1670278 -1670263 -1675508 -1680753 -1685998 -1691239 -1688181 -1685124
1177a685124L057L061j123j124j124j119M819M819q560q556M581M580j153j150Q47Q48Q47
$$ -1685124 -1682067 -1679006 -1680129 -1681253 -1682377 -1683496 -1678677 -1673858 -1682418 -1690974 -1686393 -1681813 -1682966 -1684116 -1683269 -1682421 -1681574
1194a681574Q51j303j302j303j299N099N099o34o35Q325Q324j231j232o697o697r64r63L696
$$ -1681574 -1680723 -1682026 -1683328 -1684631 -1685930 -1680831 -1675732 -1676366 -1677001 -1668676 -1660352 -1661583 -1662815 -1669512 -1676209 -1677173 -1678136 -1674440
1212a674440L696L695L696l964l965J770J769K486K486p070p070K038K038K038K039M427M427
$$ -1674440 -1670744 -1667049 -1663353 -1667317 -1671282 -1669512 -1667743 -1665257 -1662771 -1669841 -1676911 -1674873 -1672835 -1670797 -1668758 -1664331 -1659904
1229a659904n845n847P620l849m566O903N588n879J288J287n790n790n789n790k445k446k445
$$ -1659904 -1665749 -1671596 -1663976 -1667825 -1672391 -1665488 -1659900 -1665779 -1664491 -1663204 -1668994 -1674784 -1680573 -1686363 -1688808 -1691254 -1693699
1246a693699k445k6k6o477M991R172R172l84l85P231m237K214K214Q99R00Q99R00r41r40p392
$$ -1693699 -1696144 -1696170 -1696196 -1702673 -1697682 -1688510 -1679338 -1679722 -1680107 -1672876 -1677113 -1674899 -1672685 -1671786 -1670886 -1669987 -1669087 -1670028 -1670968 -1678360
1266a678360M077r41r41k24k24K494K494l957P510j328j329o13o12k404k404k404k404L091
$$ -1678360 -1674283 -1675224 -1676165 -1676389 -1676613 -1674119 -1671625 -1675582 -1668072 -1669400 -1670729 -1671342 -1671954 -1674358 -1676762 -1679166 -1681570 -1678479
1284a678479L091J0258j209l629P840O71O72m823m823m823m823M11M10M11M11M10M11l06l06
$$ -1678479 -1675388 -1665130 -1666339 -1669968 -1662128 -1661457 -1660785 -1665608 -1670431 -1675254 -1680077 -1679666 -1679256 -1678845 -1678434 -1678024 -1677613 -1677919 -1678225
1303a678225K292r176r176K292l203l203q220J0893J0221j247l158l158M26M25M26M25M249
$$ -1678225 -1675933 -1685109 -1694285 -1691993 -1695196 -1698399 -1706619 -1695726 -1685505 -1686752 -1689910 -1693068 -1692642 -1692217 -1691791 -1691366 -1687117
1320a687117M248M248M248m591m592J620J3088R064k404m793m794L091L091L091L091M405
$$ -1687117 -1682869 -1678621 -1674373 -1678964 -1683556 -1681936 -1668848 -1659784 -1662188 -1666981 -1671775 -1668684 -1665593 -1662502 -1659411 -1655006
1336a655006M405M405M405q51q51L43L44r004J0109N808n659p61p62j478j479k463k464p5
$$ -1655006 -1650601 -1646196 -1641791 -1642642 -1643493 -1643150 -1642806 -1651810 -1641701 -1635893 -1641552 -1642313 -1643075 -1644553 -1646032 -1648495 -1650959 -1651034
1354a651034J1393M585o884K84K83n34n33n34n34n34n34n34n33m446m446m446m447K722K721
$$ -1651034 -1639641 -1635056 -1641940 -1641656 -1641373 -1641907 -1642440 -1642974 -1643508 -1644042 -1644576 -1645110 -1645643 -1650089 -1654535 -1658981 -1663428 -1660706 -1657985
1373a657985K722K721J154J153J154J153j236j235j236j236o38o38o39o38K706K707K706K707
$$ -1657985 -1655263 -1652542 -1651388 -1650235 -1649081 -1647928 -1649164 -1650399 -1651635 -1652871 -1653509 -1654147 -1654786 -1655424 -1652718 -1650011 -1647305 -1644598
1391a644598K762K763K762K763l450l449l449l450K195K195K195K195M346M345l300Q168O928
$$ -1644598 -1641836 -1639073 -1636311 -1633548 -1636998 -1640447 -1643896 -1647346 -1645151 -1642956 -1640761 -1638566 -1634220 -1629875 -1633175 -1625007 -1618079
1408a618079j2184p17p17j314j314j314j314l852l853N704N704k060k061k061k060k47k46
$$ -1618079 -1630263 -1630980 -1631697 -1633011 -1634325 -1635639 -1636953 -1640805 -1644658 -1638954 -1633250 -1635310 -1637371 -1639432 -1641492 -1641739 -1641985
1425a641985k46k47J187J187J187J188l741l740l741l740N60N60N60N59j164j165j165j164
$$ -1641985 -1642231 -1642478 -1641291 -1640104 -1638917 -1637729 -1641470 -1645210 -1648951 -1652691 -1652131 -1651571 -1651011 -1650452 -1651616 -1652781 -1653946 -1655110
1443a655110j165j165j164j165l0l0l0l0M152M151M151M151p806p806N574N573L782L781n775
$$ -1655110 -1656275 -1657440 -1658604 -1659769 -1659799 -1659829 -1659859 -1659889 -1655737 -1651586 -1647435 -1643284 -1651090 -1658896 -1653322 -1647749 -1643967 -1640186 -1645961
1462a645961n775k579k580L155L154o68o68o69o68O61O61O60O61O61O61O60O61j221j220j221
$$ -1645961 -1651736 -1654315 -1656895 -1653740 -1650586 -1651254 -1651922 -1652591 -1653259 -1652598 -1651937 -1651277 -1650616 -1649955 -1649294 -1648634 -1647973 -1649194 -1650414 -1651635
1482a651635j221j220j221j221j220J553J553J552J553M78M78M78M78n227n226N08N08P316
$$ -1651635 -1652856 -1654076 -1655297 -1656518 -1657738 -1656185 -1654632 -1653080 -1651527 -1651049 -1650571 -1650093 -1649615 -1654842 -1660068 -1659560 -1659052 -1651736
1500a651736P317r407K060J0102j366k91k92R04m831q414L054Q041K307J56J57o772j2505
$$ -1651736 -1644419 -1653826 -1651766 -1641664 -1643030 -1643321 -1643613 -1642709 -1647540 -1655954 -1652900 -1644859 -1642552 -1642396 -1642239 -1649011 -1661516
1517a661516k710Q757L379k356J587J586K065K064K064K065p73p73p73p72O60O61O61O61L572
$$ -1661516 -1664226 -1655469 -1652090 -1654446 -1652859 -1651273 -1649208 -1647144 -1645080 -1643015 -1643788 -1644561 -1645334 -1646106 -1645446 -1644785 -1644124 -1643463 -1639891
1536a639891L573J0381j086l834J900N126o343p656L811j30n865m89m89q47q48N674N675M957
$$ -1639891 -1636318 -1625937 -1627023 -1630857 -1628957 -1623831 -1630174 -1637830 -1634019 -1634149 -1640014 -1640503 -1640992 -1641839 -1642687 -1637013 -1631338 -1626381
1554a626381M958j732j3201l643P824j612j613Q661Q660k687k688k688k688m48m48o182o182
$$ -1626381 -1621423 -1623155 -1636356 -1639999 -1632175 -1633787 -1635400 -1626739 -1618079 -1620766 -1623454 -1626142 -1628830 -1629278 -1629726 -1635908 -1642090
1571a642090O959O958o421o420k539k538k539k538p47p47M988M987k165k165P391P392j090
$$ -1642090 -1635131 -1628173 -1634594 -1641014 -1643553 -1646091 -1648630 -1651168 -1651915 -1652662 -1647674 -1642687 -1644852 -1647017 -1639626 -1632234 -1633324
1588a633324j090j449j448k763q496J657J3126K24K24N958N958K628q840l106Q362k39k39
$$ -1633324 -1634414 -1635863 -1637311 -1640074 -1648570 -1646913 -1633787 -1633563 -1633339 -1627381 -1621423 -1618795 -1627635 -1630741 -1622379 -1622618 -1622857
1605a622857n256n256K359K359l374l375J882J881K598K598n274O193k58k58M60M59M59M59
$$ -1622857 -1628113 -1633369 -1631010 -1628651 -1632025 -1635400 -1633518 -1631637 -1629039 -1626441 -1631715 -1625522 -1625780 -1626038 -1625578 -1625119 -1624660 -1624201
1623a624201j392j393j392j393j392j392j393j392k072k072k072k072K229K229K228K229q47
$$ -1624201 -1625593 -1626986 -1628378 -1629771 -1631163 -1632555 -1633948 -1635340 -1637412 -1639484 -1641556 -1643628 -1641399 -1639170 -1636942 -1634713 -1635560
1640a635560q48N603n864K975K975K259K258n19n19n18n19R14R15R14R15j415j415j414j415
$$ -1635560 -1636408 -1630805 -1636669 -1633694 -1630719 -1628460 -1626202 -1626721 -1627240 -1627758 -1628277 -1627363 -1626448 -1625534 -1624619 -1626034 -1627449 -1628863 -1630278
1659a630278J930J930J930J930j087j086l69l70m551O918O917m551J244J243n208n208P694
$$ -1630278 -1628348 -1626418 -1624488 -1622558 -1623645 -1624731 -1625100 -1625470 -1630021 -1623103 -1616186 -1620737 -1619493 -1618250 -1623458 -1628666 -1620972
1676a620972P694K677q792K292K293m159m159J695J695R78R78M502o966n15n15L068L069L068
$$ -1620972 -1613278 -1610601 -1619393 -1617101 -1614808 -1618967 -1623126 -1621431 -1619736 -1618758 -1617780 -1613278 -1620244 -1620759 -1621274 -1618206 -1615137 -1612069
1694a612069L069j34j35j34j34j568j568j568j568J419J418J419J418m076m077m076m077j280
$$ -1612069 -1609000 -1609134 -1609269 -1609403 -1609537 -1611105 -1612673 -1614241 -1615809 -1614390 -1612972 -1611553 -1610135 -1614211 -1618288 -1622364 -1626441 -1627721
1712a627721j281J0188J0187j280j280j281j280L289L288q179q179J617J616J616J617N56
$$ -1627721 -1629002 -1618814 -1608627 -1609907 -1611187 -1612468 -1613748 -1610459 -1607171 -1615350 -1623529 -1621912 -1620296 -1618680 -1617063 -1616507
1728a616507N56N56N57M498M498j235j236j266j265R486R485n685j7153n686N783j912j911
$$ -1616507 -1615951 -1615395 -1614838 -1610340 -1605842 -1607077 -1608313 -1609579 -1610844 -1601358 -1591873 -1597558 -1614711 -1620397 -1614614 -1616526 -1618437
1745a618437j195j194k031k031L703L704N793N794n674n675K99K99O032O033j896j897j896
$$ -1618437 -1619632 -1620826 -1622857 -1624888 -1621185 -1617481 -1611688 -1605894 -1611568 -1617243 -1616944 -1616645 -1610613 -1604580 -1606476 -1608373 -1610269
1762a610269j897K524K524K523K524q855q855K613K613j209j210j209j210L722L722p746p746
$$ -1610269 -1612166 -1609642 -1607118 -1604595 -1602071 -1610926 -1619781 -1617168 -1614555 -1615764 -1616974 -1618183 -1619393 -1615671 -1611949 -1619695 -1627441
1779a627441R456R455r657r657k640k639r090K378M528M529o223o223K154K153K871K871K154
$$ -1627441 -1617985 -1608530 -1618187 -1627844 -1630484 -1633123 -1642213 -1639835 -1635307 -1630778 -1637001 -1643224 -1641070 -1638917 -1636046 -1633175 -1631021
1796a631021J3622J3622K154j102j101M633o835l85l84j102j101j060j060j060j061l807l808
$$ -1631021 -1617399 -1603777 -1601623 -1602725 -1603826 -1599193 -1606028 -1606413 -1606797 -1607899 -1609000 -1610060 -1611120 -1612180 -1613241 -1617048 -1620856
1813a620856J209J2678p92p91J359j0109r870J597J598r870n988N480M047M047O555O555m913
$$ -1620856 -1619647 -1606969 -1607761 -1608552 -1607193 -1617302 -1627172 -1625575 -1623977 -1633847 -1639835 -1634355 -1630308 -1626261 -1619706 -1613151 -1618064
1830a618064m912j688j687j687j688j687j687r71r71j00J1367O16j0852k251R217Q500k968
$$ -1618064 -1622976 -1624664 -1626351 -1628038 -1629726 -1631413 -1633100 -1634071 -1635042 -1635142 -1623775 -1623159 -1634011 -1636262 -1627045 -1618545 -1621513
1847a621513n178n178N574N573K229K229r240r239K154K154K154K154R321R322k147k146Q99
$$ -1621513 -1626691 -1631869 -1626295 -1620722 -1618493 -1616264 -1625504 -1634743 -1632589 -1630435 -1628281 -1626127 -1616806 -1607484 -1609631 -1611777 -1610878
1864a610878R00R00Q99P81P80P80P80R146R146m233m233q176q175N204N204j815j814L920
$$ -1610878 -1609978 -1609078 -1608179 -1607398 -1606618 -1605838 -1605058 -1595912 -1586766 -1590999 -1595232 -1603408 -1611583 -1606379 -1601175 -1602990 -1604804 -1600884
1882a600884L919j694j695M039M039j12j12j12j12K636K635K636K635m830m831m830m831K934
$$ -1600884 -1596965 -1598659 -1600354 -1596315 -1592276 -1592388 -1592500 -1592612 -1592724 -1590088 -1587453 -1584817 -1582182 -1587012 -1591843 -1596673 -1601504 -1598570
1900a598570K934o622o622K695K695K695K696K098K097K098K098j903j904j904j904p279p280
$$ -1598570 -1595636 -1602258 -1608880 -1606185 -1603490 -1600795 -1598099 -1596001 -1593904 -1591806 -1589708 -1591611 -1593515 -1595419 -1597323 -1604602 -1611882
1917a611882K277K278J142J142J142J143N681N682l875l875M219M218M218M219o80o79o80
$$ -1611882 -1609605 -1607327 -1606185 -1605043 -1603901 -1602758 -1597077 -1591395 -1595270 -1599145 -1594926 -1590708 -1586490 -1582271 -1582951 -1583630 -1584310
1934a584310o79L307L308L307L308R18R19R18R18k695k695k696k695J605J606J605J605J232
$$ -1584310 -1584989 -1581682 -1578374 -1575067 -1571759 -1570841 -1569922 -1569004 -1568086 -1570781 -1573476 -1576172 -1578867 -1577262 -1575656 -1574051 -1572446 -1571214
1952a571214J232J232J232J232J231J232J232n30n30n30n30R03R04R03R03n222n223n222n223
$$ -1571214 -1569982 -1568750 -1567518 -1566286 -1565055 -1563823 -1562591 -1563121 -1563651 -1564181 -1564711 -1563808 -1562904 -1562001 -1561098 -1566320 -1571543 -1576765 -1581988
1971a581988L4L4L3L4l670l669l670l670L140L139L140L139j15j16n850n849O096O096l461
$$ -1581988 -1581954 -1581920 -1581887 -1581853 -1585523 -1589192 -1592862 -1596532 -1593392 -1590253 -1587113 -1583974 -1584089 -1584205 -1590055 -1595904 -1589808 -1583712 -1587173
1990a587173l460J317J318J318J318p13p13LMk46J1221M771M771j680j680j680j680P40P39
$$ -1587173 -1590633 -1589316 -1587998 -1586680 -1585362 -1586075 -1586788 -1586785 -1586781 -1587027 -1575806 -1571035 -1566264 -1567944 -1569624 -1571304 -1572984 -1572244 -1571505
2009a571505P39P39m756m756n114O354J149O884J269j0198n23n23M495M495k166k165K852
$$ -1571505 -1570766 -1570027 -1574783 -1579539 -1584653 -1578299 -1577150 -1570266 -1568997 -1579195 -1579718 -1580241 -1575746 -1571251 -1573417 -1575582 -1572730
2026a572730K852M405p063l479K255j837L898M255j478j239j240j239j239n182N53M136p332
$$ -1572730 -1569878 -1565473 -1572536 -1576015 -1573760 -1575597 -1571699 -1567444 -1568922 -1570161 -1571401 -1572640 -1573879 -1579061 -1578508 -1574372 -1581704
2043a581704j000M733k792K941N876J42l083Q384o94o429r653J814J0475r93K232P966M144
$$ -1581704 -1582704 -1577971 -1580763 -1577822 -1571946 -1571804 -1574887 -1566503 -1567197 -1573626 -1583279 -1581465 -1570990 -1571983 -1569751 -1561785 -1557641
2060a557641p324p324M144Q291K557k938q672m610O857R008L274n984n984o09o08j31j31j30
$$ -1557641 -1564965 -1572289 -1568145 -1559854 -1557297 -1560235 -1568907 -1573517 -1566660 -1557652 -1554378 -1560362 -1566346 -1566955 -1567563 -1567694 -1567825 -1567955
2078a567955j31M215M214M215M215q329q328J228J228K841K841K841K841J048J049J049J049
$$ -1567955 -1568086 -1563871 -1559657 -1555442 -1551227 -1559556 -1567884 -1566656 -1565428 -1562587 -1559746 -1556905 -1554064 -1553016 -1551967 -1550918 -1549869
2095a549869k079k079k079k080L177L177L177L176K670K669K669K669j034j034P58O491J4302
$$ -1549869 -1551948 -1554027 -1556106 -1558186 -1555009 -1551832 -1548655 -1545479 -1542809 -1540140 -1537471 -1534802 -1535836 -1536870 -1536112 -1529621 -1515319
2112a515319K833o962j228o126o126L789L789o126o126P253P254j706j706j706j706L483L483
$$ -1515319 -1512486 -1519448 -1520676 -1526802 -1532928 -1529139 -1525350 -1531476 -1537602 -1530349 -1523095 -1524801 -1526507 -1528213 -1529919 -1526436 -1522953
2129a522953o074o074o98o98o98o98l10l10l10l09J721J720J721J721k303k303q037q038N223
$$ -1522953 -1529027 -1535101 -1535799 -1536497 -1537195 -1537893 -1538203 -1538513 -1538823 -1539132 -1537411 -1535691 -1533970 -1532249 -1534552 -1536855 -1544892 -1552930 -1547707
2148a547707N222N223N222k72k73k72k73K117K117L550L550j1741J1196J1195j1740l498l498
$$ -1547707 -1542485 -1537262 -1532040 -1532312 -1532585 -1532857 -1533130 -1531013 -1528896 -1525346 -1521796 -1533537 -1522341 -1511146 -1522886 -1526384 -1529882
2165a529882m931m932P075P074o305o306k124k124k124k124O410O409O410O410k072k072k072
$$ -1529882 -1534813 -1539745 -1532670 -1525596 -1531901 -1538207 -1540331 -1542455 -1544579 -1546703 -1540293 -1533884 -1527474 -1521064 -1523136 -1525208 -1527280
2182a527280k072O76O76n059n058j355j355M379M378l800l796J934J937j172j169M562M566
$$ -1527280 -1529352 -1528676 -1528000 -1533059 -1538117 -1539472 -1540827 -1536448 -1532070 -1535870 -1539666 -1537732 -1535795 -1536967 -1538136 -1533574 -1529008
2199a529008n025n021M532M536R48R52R48R52k905k900k904k901L21L25n413n409M741M744
$$ -1529008 -1534033 -1539054 -1534522 -1529986 -1529038 -1528086 -1527138 -1526186 -1529091 -1531991 -1534895 -1537796 -1537475 -1537150 -1542563 -1547972 -1543231 -1538487
2217a538487M741M745p683p678R519R523l994l995l994l994L06L06n428n428J829J829J830
$$ -1538487 -1533746 -1529001 -1536684 -1544362 -1534843 -1525320 -1529314 -1533309 -1537303 -1541297 -1540991 -1540685 -1546113 -1551541 -1549712 -1547883 -1546053
2234a546053J829J471J470J471J471K2K3K2K3L606L606k128k128m158m159J575J576k009k008
$$ -1546053 -1544224 -1542753 -1541283 -1539812 -1538341 -1538319 -1538296 -1538274 -1538251 -1534645 -1531039 -1533167 -1535295 -1539453 -1543612 -1542037 -1540461 -1542470 -1544478
2253a544478k008k009L140L143L139L144K72K76O007O010j101j098M633M636p193p190O186
$$ -1544478 -1546486 -1548495 -1545355 -1542212 -1539073 -1535929 -1535657 -1535381 -1529374 -1523364 -1524465 -1525563 -1520930 -1516294 -1523487 -1530677 -1524491
2270a524491O189l311l308l311l307N11N15N12N15M573M576j161j157l908l905J825J830L875
$$ -1524491 -1518302 -1521613 -1524921 -1528232 -1531539 -1531028 -1530513 -1530001 -1529486 -1524913 -1520337 -1521498 -1522655 -1526563 -1530468 -1528643 -1526813 -1522938
2288a522938L874j859j859m248m248J486J485o517o518L038L039M11M10M11M11K531K531K531
$$ -1522938 -1519064 -1520923 -1522782 -1527030 -1531278 -1529792 -1528307 -1534824 -1541342 -1538304 -1535265 -1534854 -1534444 -1534033 -1533622 -1531091 -1528560 -1526029
2306a526029K531m637m636J097J098l114l113K621K620m547m546m547m547K337K337K337K336
$$ -1526029 -1523498 -1528135 -1532771 -1531674 -1530576 -1533690 -1536803 -1534182 -1531562 -1536109 -1540655 -1545202 -1549749 -1547412 -1545075 -1542738 -1540402
2323a540402l397l397O160O159O249O249N16N15L979L980L979L979J72J72n562n562k337k337
$$ -1540402 -1543799 -1547196 -1541036 -1534877 -1528628 -1522379 -1521863 -1521348 -1517369 -1513389 -1509410 -1505431 -1505259 -1505087 -1510649 -1516211 -1518548 -1520885
2341a520885k337k337K382K381K382K382L456L457L457L457j419j418p153p152P31P32P32
$$ -1520885 -1523222 -1525559 -1523177 -1520796 -1518414 -1516032 -1512576 -1509119 -1505662 -1502205 -1503624 -1505042 -1512195 -1519347 -1518616 -1517884 -1517152
2358a517152P31n748n749j5j5J418J419m315m316L59L58L58L59L58L58L59L58K061K060P795
$$ -1517152 -1516421 -1522169 -1527918 -1527933 -1527948 -1526530 -1525111 -1529426 -1533742 -1533383 -1533025 -1532667 -1532308 -1531950 -1531592 -1531233 -1530875 -1528814 -1526754 -1518959
2378a518959P795J821J822p735p735n56n56J60J61l304Q164Q164l303J534J534Q18Q17J01
$$ -1518959 -1511164 -1509343 -1507521 -1515256 -1522991 -1523547 -1524103 -1523943 -1523782 -1527086 -1518922 -1510758 -1514061 -1512527 -1510993 -1510175 -1509358 -1509257
2396a509257J01o350N118L55L54J072J071L461L460L461L460p20p21p20p21k154k154k154
$$ -1509257 -1509156 -1515506 -1510388 -1510033 -1509679 -1508607 -1507536 -1504075 -1500615 -1497154 -1493694 -1494414 -1495135 -1495855 -1496576 -1498730 -1500884 -1503038
2414a503038k154j579j579q029L438o358o357L916L916K214K213l520l520L02L02L03L02P5
$$ -1503038 -1505192 -1506771 -1508350 -1516379 -1512941 -1519299 -1525656 -1521740 -1517824 -1515610 -1513397 -1516917 -1520437 -1520135 -1519833 -1519530 -1519228 -1519153
2432a519153P5J269J269q407J0707O405n062J777J777O078O077P869l598j3156j687O585O585
$$ -1519153 -1519078 -1517809 -1516540 -1524947 -1514240 -1507835 -1512897 -1511120 -1509343 -1503265 -1497188 -1489319 -1492917 -1506073 -1507760 -1501175 -1494590
$$ [...]
##$OBSERVEDINTEGRALS=	(X Y Z)
(6.9050994940972749703, 6.9399474082241576767, 0.98791519968966190479)
(6.7521559652323785983, 6.8182693471870274848, 2.0294356708666194677)
(5.1299589114324408712, 5.189783782209843821, 0.92416782815351417035)
(3.7872008799489602637, 3.8337581382555692144, 3)
(2.6192809312200422411, 2.6946800649840647601, 1.8760704044413956115)
(2.590693581925629374, 2.6192809312200422411, 0.35818707840794472563)
(2.5513859766458093503, 2.590693581925629374, 0.51452724973759045302)
(2.3934408717941670908, 2.4366792376019703603, 0.49925079270523858854)
(2.3541332665143475111, 2.3934408717941670908, 0.3206675866341961445)
(2.0064396307210241588, 2.1919000592685420337, 2.7221409859821492638)
(1.62027929687380845, 1.6405648956044087683, 0.39698582186328779109)
(1.471518239516073745, 1.5772168855334123272, 1.0280541461833723194)
(1.2679504768160165806, 1.4224057373262006809, 35.897265112663966136)
(1.2053142421390765637, 1.2836095354852525841, 6.5117738183097291227)
(1.0647386018129878504, 1.1252395103077592609, 3.1964912003805934226)
(0.82914094638040214402, 0.98751097155789613335, 27.187941554248929776)
##END=	
##TITLE=	wj320
##JCAMPDX=	6.0	$$ NMR Plug-in 1.14 of MestReNova 12.0.4-22023
##BLOCKID=	2
##DATATYPE=	NMRPEAKTABLE
##DATACLASS=	PEAKTABLE
##.OBSERVEFREQUENCY=	399.79071365325000897
##.OBSERVENUCLEUS=	^1H
##NPOINTS=	280
##FIRSTX=	0.11324694608309097965
##LASTX=	7.7323060188433485607
##XFACTOR=	1
##YFACTOR=	1
##FIRSTY=	5.107960014284872993e-05
##XUNITS=	PPM
##YUNITS=	ARBITRARY UNITS
##PEAKTABLE=	(XY..XY)
0.11324694608309097965, 5.107960014284872993e-05
0.74127969493856837868, 0.0011120437032636249115
0.75890432100159888051, 0.0024897792561815890872
0.77554196750541759542, 0.00088475628291304617753
0.79234279819043773596, 3.3671988645116480445e-05
0.81563374010872180531, 2.9998409215752077034e-05
0.83854515297733256407, 0.00010377146821050027082
0.8532399364080265336, 0.00011339223849457714293
0.86066690518780597507, 0.0002507805059881734874
0.86877910679568659535, 0.00082863249044457572973
0.87163928811203184033, 0.00092917353429200716473
0.88503624625595145314, 0.0024619128587578063133
0.89826808257018586623, 0.15304235378929142986
0.91553956567306793435, 0.26936813644627016773
0.93248676779206540743, 0.10720399318623471951
0.96134877820862352227, 0.0009914300626644222212
0.96880959717335035641, 0.00041742794635731087513
0.9803422842994924391, 7.2285829614929722063e-05
0.98465920304391318929, 0.00037041513269708495207
0.98976560523979484341, 0.0023452446708347677445
1.0007319841988275844, 0.00014470580106328462559
1.0063824735288768863, 0.0024404572940661590531
1.0195353102353863495, 0.002221725961238984158
1.027029079895040109, 0.00022878757792340511236
1.0361808414327950967, 0.0023441132314007463201
1.0530033686221884626, 0.00066711504187598436814
1.0616874960703865938, 0.00038235463876596200491
1.0701358714664044314, 0.0019676626630347263114
1.0871070998752476733, 0.056639752057279987851
$$ [...]
5.1115777282346490651, 8.5698982490576720568e-05
5.1150921195427967447, 0.00021544272656234624529
5.1192945610166171733, 0.0001908094901508983394
5.1348197966853605934, 0.00054548651117044860866
5.1384568007693101066, 0.0017991693208819832962
5.1421760115473809094, 0.0028942120979511005291
5.1459485352216445264, 0.0019387133905781428565
5.1523251586114700018, 0.0013264817698000843683
5.1562559409544936884, 0.0030135875646411184464
5.1598644505818374029, 0.0056836257727815257118
5.1636273714199711904, 0.0043866616161933819421
5.1739240241588158042, 0.0016074767201070768764
5.1776524190956720872, 0.0029179668693821397656
5.181346231925289203, 0.0018781846451066369196
5.1849371679216247344, 0.00060980369997366899552
5.3272506054241857143, 2.6290881114975212776e-05
5.3457659047616612469, 4.2255297162209079704e-05
5.3638580590719460162, 2.1880430101825035927e-05
5.6641591017804202579, 1.6826816512827492061e-05
5.6780636262054722252, 3.0192156605617706804e-05
5.6883601777827479395, 6.3884393460115251385e-05
6.5579701445298113072, 3.835855780931689236e-05
6.5626533911232298735, 5.1061856038713721603e-05
6.5779745789310322124, 5.4511675318704013804e-05
6.5828353706737532391, 5.8731573253398252547e-05
6.6049577741016509691, 7.4280631235541742644e-05
6.6098613851401077923, 0.0001169668076324339572
6.6773407214611468774, 4.6413822956906340548e-05
6.7092693547730384296, 7.2044182671913731698e-05
6.718797951250297551, 1.6440053085548837021e-05
6.729302451372763727, 0.00017119881850448403528
6.7588441213811458752, 0.0066400731478555349158
6.7636185008780334016, 0.0095668147942713933213
6.7788138084619271595, 0.0077223046996969793229
6.7836563882662233027, 0.012991702032981593956
6.8018410607094805798, 0.020437797330616448016
6.8066022501261658206, 0.014406276463757496792
6.8684630285771710589, 0.00021233263838334669963
6.8739906733060909261, 9.7935969720127917146e-05
6.8901373849992184617, 0.00014844754529507359119
6.9139747241824620616, 0.025111125325806799707
6.924191058866701276, 0.00026650161544921198127
6.9339434957749759292, 0.019164999096595188716
6.9441446069079670877, 0.00015923396390387476612
6.9588393566236304011, 6.076668469865508746e-05
6.9639993660722181446, 6.357456707071919668e-05
6.9839688308406842054, 6.1897878465968622012e-05
6.9948789562431885614, 5.265526663603424572e-05
6.9993475962030613502, 0.00015513240227507199575
7.0198565614837464821, 3.8181224758785834664e-05
7.0257834820548534793, 3.4498409550587827346e-05
7.1118801396642599144, 0.00012392195732978779832
7.1318535514316447887, 0.00010841465293704314666
7.2474569826983845644, 0.0022946490053748361607
7.4617939331121814206, 2.7849540309884511112e-05
7.5222743281388257941, 1.8643620177626780163e-05
7.5401148982854415692, 2.1654164971181311014e-05
7.6834697116791357274, 2.2667715272125564334e-05
7.702396839523601102, 2.0664798796313244846e-05
7.7137227117211706329, 2.4683335748982145009e-05
7.7323060188433485607, 2.1546309169527517275e-05
##END=	
##END=	
