##TITLE=	jf1520

##JCAMP-DX=	6.0	$$ MestReNova 14.1.0-24037
##DATA TYPE=	LINK
##BLOCK_ID=	1
##BLOCKS=	2    
##ORIGIN=	Mestrelab Research S.L.
##OWNER=	jinba
##$MNOVA/LINK_BLOCK_TYPE=	ITEM	$$ NMR Spectrum
##$MNOVA/ITEM/POLYGON=	(XY..XY)
5321,5835
8722,5835
8722,8208
5321,8208
5321,5835
##$MNOVA/ITEM/Z=	0
##$MNOVA/ITEM/ANGLE=	0
##TITLE=	jf1520
##JCAMP-DX=	6.0	$$ MestReNova 14.1.0-24037
##BLOCK_ID=	2
##DATA TYPE=	NMR SPECTRUM
##DATA CLASS=	XYDATA
##NUMDIM=	1
##ORIGIN=	JEOL
##OWNER=	jinba
##.OBSERVE FREQUENCY=	399.79071365325000897
##.OBSERVE NUCLEUS=	^1H
##.SOLVENT NAME=	CHLOROFORM-D
##.PULSE SEQUENCE=	proton.jxp
##LONGDATE=	2021/03/16 20:15:06.000
##.ACQUISITIONMODE=	SIMULTANEOUS
##$ORIGINAL FORMAT=	JEOL Delta
##$MNOVA/SCALES_VERSION=	8
##$PARAMETER FILE=	(datafile, ASCII, c:/Users/jinba/Desktop/jf1520_PROTON_FT-1-1.jdf, 0)
$$ 
##$PARAMETER FILE=	(footer, BASE64, c:/Users/jinba/Desktop/jf1520_PROTON_FT-1-1.jdf, 540672)
AQAAANsdAABoZWFkZXIKICAgIGZpbGVuYW1lICAgICAgICA9PiAiamYxNTIwX1BST1RPTiI7CiAgICBz
YW1wbGVfaWQgICAgICAgPT4gImpmMTUyMCI7CiAgICBjb21tZW50ICAgICAgICAgPT4gIiI7CiAgICBw
cm9jZXNzICAgICAgICAgPT4gInByb3Rvbl9hdXRvcGhhc2UubGlzdCI7CiAgICBhdXRvX2R3ZWxsICAg
ICAgPSAgVFJVRTsKICAgIGF1dG9fZmlsdGVyICAgICA9ICBUUlVFOwogICAgYXV0b19nYWluICAgICAg
ID0+IFRSVUU7CiAgICBmaWx0ZXJfbGltaXQgICAgPT4gMTY7CiAgICBmb3JjZV9kdWFsX21vZGUgPT4g
RkFMU0U7CiAgICBkZWNpbWF0aW9uX3JhdGUgPSAgMDsKICAgIGZvcmNlX3R1bmUgICAgICA9PiBGQUxT
RTsKICAgIHNhdmVfYWJvcnRlZCAgICA9ICBUUlVFOwogICAgdmVjdG9yICAgICAgICAgID0gIFRSVUU7
CmVuZCBoZWFkZXI7CgppbnN0cnVtZW50CiAgICByZWN2cl9nYWluID0+IDQ2OwplbmQgaW5zdHJ1bWVu
dDsKCmFjcXVpc2l0aW9uCiAgICB4X2RvbWFpbiAgICAgPT4gIlByb3RvbiI7CiAgICB4X29mZnNldCAg
ICAgPT4gNVtwcG1dOwogICAgeF9zd2VlcCAgICAgID0+IDE1W3BwbV07CiAgICB4X3BvaW50cyAgICAg
PT4gMzI3Njg7CiAgICBzY2FucyAgICAgICAgPT4gODsKICAgIHhfcHJlc2NhbnMgICA9PiAwOwogICAg
bW9kX3JldHVybiAgID0+IDE7CiAgICB4X2FjcV90aW1lICAgPT8geF9wb2ludHMgLyB4X3N3ZWVwOwog
ICAgeF9yZXNvbHV0aW9uID0/IDEgLyB4X2FjcV90aW1lOwplbmQgYWNxdWlzaXRpb247CgpwdWxzZQog
ICAgY29sbGVjdCBDT01QTEVYLE9CUzsKCiAgICBtYWNybyBvYnNfcHJlc2F0X3RpbWUoIGRhbnRlX3By
ZXNhdCwgZGFudGVfbG9vcCwgZGFudGVfcHVsc2UsIGRhbnRlX2ludGVydmFsLCBwaGFzZV9kYW50ZSwg
cGhzX3NoZnQsIGRhbnRlX2F0dGVudWF0b3IsIHByZXNhdF90aW1lICkgaXMKICAgICAgICB3aGVuIGRh
bnRlX3ByZXNhdCBkbwogICAgICAgICAgICBsb29wIDEwMCAqIGRhbnRlX2xvb3AgdGltZXMKICAgICAg
ICAgICAgICAgIGRhbnRlX3B1bHNlLCAoT0JTLkdBVEUsIE9CUy5QSFMucGhhc2VfZGFudGUubHN0ZXAo
cGhzX3NoZnQpLCBPQlMuQVROLmRhbnRlX2F0dGVudWF0b3IpOwogICAgICAgICAgICAgICAgZGFudGVf
aW50ZXJ2YWw7CiAgICAgICAgICAgIGVuZCBsb29wOwogICAgICAgIGVuZCB3aGVuOwogICAgICAgIHdo
ZW4gbm90IGRhbnRlX3ByZXNhdCBkbwogICAgICAgICAgICBwcmVzYXRfdGltZTsKICAgICAgICBlbmQg
d2hlbjsKICAgIGVuZCBvYnNfcHJlc2F0X3RpbWU7CgogICAgbWFjcm8gYWNxKCBkZWFkX3RpbWUsIGRl
bGF5LCBwaGFzZSApIGlzCiAgICAgICAgZGVhZF90aW1lLCBPQlMuUEhTLjA7CiAgICAgICAgZGVsYXks
IChPQlMuUEhTLjAsIFJDVi5HQVRFKTsKICAgICAgICBhY3F1aXJlIChPQlMuUEhTLjAsIFJDVi5QSFMu
cGhhc2UpOwogICAgZW5kIGFjcTsKCiAgICBleHBlcmltZW50ICAgICAgICAgICAgPSAgInByb3Rvbi5q
$$ [...]
AAAAAAAAAAAAAAAAAAAAAAAAAAAAAAAAAAAAAAAAAAAAAAAAAAAAAAAAAAAAAAAAAAAAAAAAAAAAAAAA
AAAAAAAAAAAAAAAAAAAAAAAAAAAAAAAAAAAAAAAAAAAAAAAAAAAAAAAAAAAAAAAAAAAAAAAAAAAAAAAA
AAAAAAAAAAAAAAAAAAAAAAAAAAAAAAAAAAAAAAAAAAAAAAAAAAAAAAAAAAAAAAAAAAAAAAAAAAAAAAAA
AAAAAAAAAAAAAAAAAAAAAAAAAAAAAAAAAAAAAAAAAAAAAAAAAAAAAAAAAAAAAAAAAAAAAAAAAAAAAAAA
AAAAAAAAAAAAAAAAAAAAAAAAAAAAAAAAAAAAAAAAAAAAAAAAAAAAAAAAAAAAAAAAAAAAAAAAAAAAAAAA
AAAAAAAAAAAAAAAAAAAAAAAAAAAAAAAAAAAAAAAAAAAAAAAAAAAAAAAAAAAAAAAAAAAAAAAAAAAAAAAA
AAAAAAAAAAAAAAAAAAAAAAAAAAAAAAAAAAAAAAAAAAAAAAAAAAAAAAAAAAAAAAAAAAAAAAAAAAAAAAAA
AAAAAAAAAAAAAAAAAAAAAAAAAAAAAAAAAAAAAAAAAAAAAAAAAAAAAAAAAAAAAAAAAAAAAAAAAAAAAAAA
AAAAAAAAAAAAAAAAAAAAAAAAAAAAAAAAAAAAAAAAAAAAAAAAAAAAAAAAAAAAAAAAAAAAAAAAAAAAAAAA
AAAAAAAAAAAAAAAAAAAAAAAAAAAAAAAAAAAAAAAAAAAAAAAAAAAAAAAAAAAAAAAAAAAAAAAAAAAAAAAA
AAAAAAAAAAAAAAAAAAAAAAAAAAAAAAAAAAAAAAAAAAAAAAAAAAAAAAAAAAAAAAAAAAAAAAAAAAAAAAAA
AAAAAAAAAAAAAAAAAAAAAAAAAAAAAAAAAAAAAAAAAAAAAAAAAAAAAAAAAAAAAAAAAAAAAAAAAAAAAAAA
AAAAAAAAAAAAAAAAAAAAAAAAAAAAAAAAAAAAAAAAAAAAAAAAAAAAAAAAAAAAAAAAAAAAAAAAAAAAAAAA
AAAAAAAAAAAAAAAAAAAAAAAAAAAAAAAAAAAAAAAAAAAAAAAAAAAAAAAAAAAAAAAAAAAAAAAAAAAAAAAA
AAAAAAAAAAAAAAAAAAAAAAAAAAAAAAAAAAAAAAAAAAAAAAAAAAAAAAAAAAAAAAAAAAAAAAAAAAAAAAAA
AAAAAAAAAAAAAAAAAAAAAAAAAAAAAAAAAAAAAAAAAAAAAAAAAAAAAAAAAAAAAAAAAAAAAAAAAAAAAAAA
AAAAAAAAAAAAAAAAAAAAAAAAAAAAAAAAAAAAAAAAAAAAAAAAAAAAAAAAAAAAAAAAAAAAAAAAAAAAAAAA
AAAAAAAAAAAAAAAAAAAAAAAAAAAAAAAAAAAAAAAAAAAAAAAAAAAAAAAAAAAAAAAAAAAAAAAAAAAAAAAA
AAAAAAAAAAAAAAAAAAAAAAAAAAAAAAAAAAAAAAAAAAAAAAAAAAAAAAAAAAAAAAAAAAAAAAAAAAAAAAAA
AAAAAAAAAAAAAAAAAAAAAAAAAAAAAAAAAAAAAAAAAAAAAAAAAAAAAAAAAAAAAAAAAAAAAAAAAAAAAAAA
AAAAAAAAAAAAAAAAAAAAAAAAAAAAAAAAAAAAAAAAAAAAAAAAAAAAAAAAAAAAAAAAAAAAAAAAAAAAAAAA
AAAAAAAAAAAAAAAAAAAAAAAAAAAAAAAAAAAAAAAAAAAAAAAAAAAAAAAAAAAAAAAAAAAAAAAAAAAAAAAA
AAAAAAAAAAAAAAAAAAAAAAAAAAAAAAAAAAAAAAAAAAAAAAAAAAAAAAAAAAAAAAAAAAAAAAAAAAAAAAAA
AAAAAAAAAAAAAAAAAAAAAAAAAAAAAAAAAAAAAAAAAAAAAAAAAAAAAAAAAAAAAAAAAAAAAAAAAAAAAAAA
AAAAAAAAAAAAAAAAAAAAAAAAAAAAAAAAAAAAAAAAAAAAAAAAAAAAAAAAAAAAAAAAAAAAAAAAAAAAAAAA
AAAAAAAAAAAAAAAAAAAAAAAAAAAAAAAAAAAAAAAAAAAAAAAAAAAAAAAAAAAAAAAAAAAAAAAAAAAAAAAA
AAAAAAAAAAAAAAAAAAAAAAAAAAAAAAAAAAAAAAAAAAAAAAAAAAAAAAAAAAAAAAAAAAAAAAAAAAAAAAAA
AAAAAAAAAAAAAAAAAAAAAAAAAAAAAAAAAAAAAAAAAAAAAAAAAAAAAAAAAAAAAAAAAAAAAAAAAAAAAAAA
AAAAAAAAAAAAAAAAAAAAAAAAAAAAAAAAAAAAAAAAAAAAAAAAAAAAAAAAAAAAAAAAAAAAAAAAAAAAAAAA
AAAAAAAAAAAAAAAAAAAAAAAAAAAAAAAAAAAAAAAAAAAAAAAAAAAAAAAAAAAAAAAAAAAAAAAAAAAAAAAA
AAAAAAAAAAAAAAAAAAAAAAAAAAAAAAAAAAAAAAAAAAAAAAAAAAAAAAAAAAAAAAAAAAAAAAAAAAAAAAAA
AAAAAAAAAAAAAAAAAAAAAAAAAAAAAAAAAAAAAAAAAAAAAAAAAAAAAAAAAAAAAAAAAAAAAAAAAAAAAAAA
AAAAAA==
##XUNITS=	HZ
##YUNITS=	ARBITRARY UNITS
##FIRSTX=	4996.3953975176882523
##LASTX=	-998.48826098519202787
##DELTAX=	-0.22869887683603098982
##XFACTOR=	1
##YFACTOR=	1.730250278664357138e-07
##FIRSTY=	3.2560434192419052124e-05
##MINY=	-0.00062345608603209257126
##MAXY=	2.1625864505767822266
##NPOINTS=	26214
##XYDATA=	(X++(Y..Y))
$$ [...]
2932a362J20L58K69o5m08k65j84m1K9K9K25j08r6r5l0l0R9L39Q4j53k66j22n1n1n5n6QPM5
2925a826r8O3q0Q0P9r0N2M7r6P9Q0%K39K39%o3o4J78L5n5Q8J87j47L0L0J8j25k68k69r5M8
2918a704j5j5pol4l5L7L7L9L9l3l2K1K1R2R3P3P4J93J92j58j59QPJ36J35J03j36k12k12o0
2911a518n9jj%jm3m4m4m4K9K9K9K9J1J1J1J1K7K7K7K7K7K7K7K7j1j0j1j1J2J2J2J1poO4O5
2902a259N4N4N5N4J42J42J43J42K88K87L81L81N29Q62J367K177L447O166J5048M9721J13126
2898A93307J8266q4272q4988k3590q472m048k188j301r67p14n71l38l37k11k10r6r7k6k5n5
2893i33n5J6J7M8M8j19j19J36J35J7J7j8j8j7j8j03j02J6J7J84J83L03N88M79Km69m68k25
2887d58K53Q09O67l7p04p99n13j49oR9R9j9j9j9j9J78J78l7l6j2j1q3q2n9n9J65J65N51O96
$$ plain form
2932 -1362 -1242 -884 -615 -680 -1088 -1353 -1537 -1578 -1549 -1520 -1295 -1403 -1499 -1594 -1624 -1654 -1555 -1216 -1132 -1285 -1551 -1673 -1724 -1775 -1830 -1886 -1878 -1871 -1826
2925 -1826 -1924 -1861 -1941 -1861 -1782 -1872 -1820 -1773 -1869 -1790 -1710 -1710 -1471 -1232 -1232 -1295 -1359 -1181 -1146 -1201 -1113 -926 -1073 -1043 -1013 -995 -1120 -1388 -1657 -1752 -1704
2918 -1704 -1719 -1734 -1741 -1747 -1781 -1816 -1779 -1742 -1703 -1664 -1697 -1729 -1708 -1687 -1595 -1502 -1429 -1355 -1162 -970 -1128 -1287 -1279 -1272 -1136 -1001 -898 -1034 -1246 -1458 -1518
2911 -1518 -1577 -1578 -1579 -1579 -1580 -1623 -1667 -1711 -1755 -1726 -1697 -1668 -1639 -1628 -1617 -1606 -1595 -1568 -1541 -1514 -1487 -1460 -1433 -1406 -1379 -1390 -1400 -1411 -1422 -1410 -1398 -1386 -1375 -1382 -1388 -1324 -1259
2902 -1259 -1205 -1151 -1096 -1042 -900 -758 -615 -473 -185 102 483 864 1393 2255 3622 5799 9246 15412 30460 80181 193307
2898 193307 211573 127301 42313 18723 10251 6203 4015 2714 1747 1033 462 124 -213 -424 -634 -730 -827 -853 -878 -933
2893 -933 -988 -972 -955 -907 -859 -978 -1097 -961 -826 -809 -792 -810 -828 -845 -863 -966 -1068 -1052 -1035 -851 -668 -365 223 702 704 235 -233 -458
2887 -458 -205 604 1271 1234 530 -269 -782 -931 -937 -838 -739 -758 -777 -796 -815 -637 -459 -496 -532 -544 -555 -638 -720 -779 -838 -673 -508 43 739
2880G39N25M9n57n58j25L52Q86P42J97o61r00m23l8J04K3K3L1L2q1q1J43J43N5J97L80O66
2874A863N55P8k14k14j13J74Q05Q06P18N0O9L54J091J377K116L166N189Q528J7256M2915Q7852
2869A74421M3689m2395q0645l2103l964J7699O2054Q7531M44q8550p2430k5980j1195o391
2866B2185l624k468j609r60R0Q70Q70O07O08N36J013K426M429P655J1757J9138M1934R4119
2862A99576P7236r612n0914M8821N7500k1513n1751N0105L5321l9330k8360N5993j9648j16975
2859A86449r1508l5580j6789j0040o130l731j919j025K4J029J696P91q32j032L99K270M274
2855B8346O360Q935J6376M0126J00770J02581j3179j14955p2477j8202J1403N6901J23076
2852B76061N0870p6911j29086n8438k3623j2070p204m594k971k185j326n45J23m14j272j038
$$ plain form
2880 739 1264 1313 756 198 73 425 1311 2053 2250 1589 689 266 228 332 355 378 409 441 360 279 422 565 620 817 1197 1863
2874 1863 2418 2496 2282 2068 1955 2129 2934 3740 4458 4508 4577 4931 6022 7399 9515 12681 17870 26398 43654 86569 174421
2869 174421 218110 175715 95070 62967 59003 76702 138756 226287 226731 138181 65751 39771 28576 22185
2866 22185 18561 16093 14484 13524 13614 14484 15354 15961 16569 17105 18118 20544 24973 32628 44385 63523 105457 199576
2862 199576 276812 267200 216286 265107 322607 301094 249343 299448 334769 295439 267079 323072 303424 186449
2859 186449 94941 59361 42572 32532 26402 22671 20752 19727 19751 20780 22476 23267 22435 21403 21802 24072 28346
2855 28346 34706 43641 60017 100143 200913 303494 290315 175360 102883 84681 96084 152985 276061
2852 276061 326931 250020 120934 62496 38873 26803 19599 15005 12034 9849 8523 7978 8101 7687 6415 5377
2848E377l71j88m5J93J93m06q83q64oN73N72k41p18q43n58k85J92O74O74j18r77j102o25l13
2843i5k7N6N6k22k21j02j02K6K6R8R7%jP1P1K54K53M87M86K93j84l39n3O7O7j39j39l48m89
2836e3n00k13r5r5onRRQ1Q1J1J2K26K25M88M88o1l46l43J31L77L78J08j77Q2k04l61k17n3
2829b3Q8K51J2j91m28m87j53m6m6K02K01k8j71R9R9K57K58M73M75J68k62k68k68L26N63K51
2824A352k74n45m02o5o5p3P0j25k68j72k9j96M2Q4Q5p3p2N3J95J07l7O2O1M3J86K63K63O7
2817E37p6r5J45L01L02K89m4j20j20o9J69N90M46L33R5k43mK81Q07P99O57P85P84Q51N16M48
2811H364O86J006J721K615L140L012L440O576J4350L1624P7647J22710R4524j6382r6075j08929
2808A50029l6484K5555J05248J19974M4286j04471j38380q5174l1996j3101n805l002k287
$$ plain form
2848 5377 5006 4818 4773 4966 5159 4753 3870 3006 3000 3573 4145 3904 3186 2343 1785 1500 1692 2366 3040 2922 1945 843 218 -95
2843 -95 -122 -66 -10 -232 -453 -555 -657 -631 -605 -507 -410 -410 -411 -340 -269 -15 238 725 1211 1504 1320 981 928 995 1062 923 784 436 -53
2836 -53 -553 -766 -861 -956 -962 -967 -958 -949 -868 -787 -776 -764 -538 -313 175 663 602 256 -87 44 421 799 907 730 812 608 247 30 -23
2829 -23 65 316 328 137 -291 -778 -931 -977 -1023 -821 -620 -648 -819 -720 -621 -364 -106 367 842 1010 748 480 212 538 1101 1352
2824 1352 1078 533 131 66 1 -72 -2 -127 -395 -567 -596 -792 -750 -666 -581 -654 -726 -673 -478 -371 -408 -346 -285 -242 -56 207 470 537
2817 537 461 366 511 812 1114 1403 1359 1239 1119 1050 1219 1809 2255 2588 2683 2440 2436 2717 3524 4323 4980 5765 6549 7400 7916 8364
2811 8364 9050 10056 11777 14392 17532 20544 23984 30560 44910 76534 154181 276891 371415 355033 258958 150029
2808 150029 113545 139100 244348 364322 408608 304137 165757 80583 48587 35486 29681 26679 24392
2805B4392j643q33o98o98J07Q22Q01R44K416M085M741N361R707K0438M4594J08931J88590
2801D12057J57732O506j44059j85704p8443J1540J06687J71849J09897q9392j81676j53261
2798A43733o3933k7001j3314p581n436m088l278k341j817j012k97n87j398j118m03l99r23
2794H807j061p26p24j153r57p18l16K09O34J5p09p09l81j43j3j3o9p0j22j23j22j23K7K6m5
2788A421m5P2P2P2P2J41J40J56J55K5K62K33K33J69p0N6J99N13N13L28L28P37J071J306J163
2783I322P13M74N70R04J643K263K132J798K120L407N530Q916J5713L1403N8999Q8711Q9520
2779C24138N1510j2047l6513L149P5689J00758M2525o2230j28666j33018q8712m7544k3460
2776F5579j2293o141j567J628M908Q293P218P074J9719K2819K2962N4296J52381J24959k7092
$$ plain form
2805 24392 22749 21916 21218 20520 20627 21449 22250 23194 25610 29695 34436 39797 49504 69942 114536 223467 412057
2801 412057 569789 576295 432236 246532 168089 179629 286316 458165 568062 478670 296994 143733
2798 143733 79800 52799 39485 31904 26468 22380 19102 16761 14944 13932 13635 13048 11650 10532 10129 9730 8807
2794 8807 7746 7020 6296 5143 4186 3468 3152 3361 3995 4010 3301 2592 2211 2068 2055 2042 1973 1903 1781 1658 1536 1413 1440 1466 1421
2788 1421 1376 1448 1520 1592 1664 1805 1945 2101 2256 2281 2543 2776 3009 3178 3108 3164 3363 3876 4389 4717 5045 5782 6853 8159 9322
2783 9322 10035 10509 11079 11983 13626 15889 18021 19819 21939 25346 30876 39792 55505 86908 145907 234618 324138
2779 324138 375648 363601 327088 330237 405926 506684 549209 486979 358313 225295 136583 89039 65579
2776 65579 53286 47145 45578 47206 52114 60407 67625 74699 94418 117237 140199 194495 346876 471835 444743
2772D44743j48277p3046m893N7982Q7266L1833j1187K1546J8398m1563o3979l2257L7278Q0189
2769D04033M9571l6206j02118j13290p7902m0014j6073m602N985J9217Q438o239j184K4665
2766A14281O9210J64046J82646Q5270n5041j20141j32446j7501R7820O8239k0565j16456j27807
2763A91555q7102l6643j8014r907m327m16L77k580n573m524k154n32p41q84m81l38J08J349
2759A9173K755N330R492K0270N4125R6572K5594o4736p3805j7814K1616O6542L0433m3681
2756A51866p8187l4786j3593o057k468j800j661j183o83P48L267K980j372l948k749p46j068
2752H560j544j668q08j83j82k96j0j47m33l44J32M39N83R52K192N295J4738J4899l128j8832
2747B0215j0151l447j445n02L55J077K317N739J6135J7376k942k0492j2575m329j563l79R7
$$ plain form
2772 444743 296466 223420 218527 276509 363775 395608 384421 405967 424365 382802 318823 286566 323844 404033
2769 404033 453604 417398 315280 201990 124088 84074 68001 63399 69384 88601 97039 90800 89616 114281
2766 114281 183491 347537 530183 615453 560412 440271 307825 290324 388144 456383 435818 319362 191555
2763 191555 104453 67810 49796 39889 35562 35146 35523 32943 27370 22846 20692 20160 19419 18535 18054 17716 17824 19173
2759 19173 21928 27258 36750 57020 111145 207717 233311 168575 94770 76956 98572 165114 195547 151866
2756 151866 73679 38893 25300 19243 16775 14975 13314 12131 11448 12196 15463 18443 17071 13123 10374 9628 8560
2752 8560 7016 5348 4540 4357 4175 3879 3869 3722 3289 2945 3077 3516 4099 5051 7243 12538 27276 42175 39047 20215
2747 20215 10064 6617 5172 4670 5025 6102 8419 14158 30293 47669 44727 24235 11660 7331 5768 5389 5486
2743E486q7N6P08J186K021M977J4111K7179J0197r357j6904j1277j0146l374p98M42L127Q946
2739B6493K4899N0176J6690l1288m3056j2056K460N798o75p830o661K592J4115J4115k461
2736E3311j7246j5153o855j906K89K99j76N8R17K598M602P528J4491L2388N6330O1704M9209
2732B42388J671l0665j2822K1231L65k401j9437m8910n7352j0327L603O45J2353M6025O136
2728A52503m6040n2073k1454j1107o052k969j157k87k87p64p63k76N83K353M357R570K2828
2725D8965L3178J6866k2911l7505j9334o839k148K527Q047K420o563q375l534j340n87Q1J89
2721C137k89o43K5R1R0O40K452N367L173k345n302k976r74j90M78R61R61J742N463L597k413
2716A3045o702k601n61O78L165N550l0n658m394j628o59l73k10o7r9M3Q8n5j33j32n4n4J8
$$ plain form
2743 5486 5399 5455 6163 7349 9370 14347 28458 55637 65834 56477 39573 28296 18150 14776 13978 14420 17547 26493
2739 26493 51392 101568 118258 86970 43914 31858 34318 40116 39441 31611 24950 27542 41657 55772 53311
2736 53311 36065 20912 14057 12151 12440 12739 12563 12621 13538 16136 20738 28266 42757 75145 131475 193179 242388
2732 242388 244059 213394 200572 221803 222168 219767 200330 151420 94068 83741 87344 87989 100342 146367 152503
2728 152503 106463 54390 32936 21829 15777 12808 11651 11364 11077 10313 9550 9274 9857 12210 16567 26137 48965
2725 48965 82143 99009 76098 38593 19259 12420 10272 12799 20846 23266 16703 8328 4794 3454 2867 2948 3137
2721 3137 2848 2205 2230 2321 2411 3051 5503 10870 14043 11698 6396 3420 2446 2256 2734 3695 4656 6398 11861 15458 13045
2716 13045 6343 3742 3181 3859 7024 12574 12544 6886 2492 864 205 -168 -378 -445 -544 -501 -413 -468 -601 -733 -787 -841 -823
2711h23J7j3j3m8m9k8k9l7l7P1p2QQ%%%%OOn7n7n8Q4Mj39R1n2O4p9m1m1n8Q4O7O7O7O7K6j16
2702a110m5R8J2J2K2K1M2M2J67K5K76M20N50M08N6l73k76l6K25K26L8l92l85k42k60m03l19
2695a201j75klQ4Q4J2J3l6l5l0J14J46L84R8j41q1J58L66O04M82L39J72J72K0K0Q3j56k67
2689A224k67k52m91n89l52l58j19j42R7k3k3K1K2n0n1N2N2Q8Q7K29K28J48K91M79M81K4k62
2683E44l41n5K38K37L5m43o82l98k99j56j00r9OOo5o5R9R8k0k1q1q2L8L8L3L3L3L3J40J39
2676a157L84L84r1l78k11P6K83K84j25m12k63j19r9r9k2k2n8n8N2N2k0k0j0j1j1j1j2j2q4
2669a790q4L5L6o6o6j18J68PPj6j7N6N5Q9Q8Q8Q8j48j48k9k9RRM5M5L4L3L4L4oop7p8J5J5
2661a688n7n7RRJ28J28k5k4r7r6Q6Q5L5L21K04O1k46k46J11J11qrk8k7o4o3R2R2j13j13j66
$$ plain form
2711 -823 -806 -819 -832 -880 -929 -957 -986 -1023 -1060 -989 -1061 -1053 -1045 -1045 -1045 -1045 -1045 -1039 -1033 -1090 -1147 -1205 -1121 -1117 -1256 -1165 -1217 -1153 -1232 -1273 -1314 -1372 -1288 -1221 -1154 -1087 -1020 -994 -1110
2702 -1110 -1155 -1057 -1045 -1033 -1011 -990 -948 -906 -739 -714 -438 -18 532 940 996 623 347 311 536 762 800 408 23 -219 -479 -882 -1201
2695 -1201 -1376 -1378 -1381 -1297 -1213 -1201 -1188 -1224 -1259 -1289 -1175 -1029 -645 -547 -688 -769 -611 -245 359 841 1180 1352 1524 1544 1564 1647 1491 1224
2689 1224 957 705 214 -375 -727 -1085 -1204 -1346 -1249 -1272 -1295 -1274 -1252 -1302 -1353 -1301 -1249 -1161 -1074 -845 -617 -469 -178 301 782 806 544
2683 544 203 148 386 623 658 215 -467 -865 -1164 -1320 -1420 -1519 -1513 -1507 -1572 -1637 -1538 -1440 -1460 -1481 -1562 -1644 -1606 -1568 -1535 -1502 -1469 -1436 -1296 -1157
2676 -1157 -773 -389 -480 -858 -1069 -993 -710 -426 -551 -963 -1226 -1345 -1444 -1543 -1565 -1587 -1645 -1703 -1651 -1599 -1619 -1639 -1649 -1660 -1671 -1682 -1694 -1706 -1790
2669 -1790 -1874 -1839 -1803 -1869 -1935 -2053 -1885 -1878 -1871 -1887 -1904 -1848 -1793 -1704 -1616 -1528 -1440 -1588 -1736 -1765 -1794 -1785 -1776 -1731 -1686 -1652 -1619 -1585 -1551 -1557 -1563 -1640 -1718 -1703 -1688
2661 -1688 -1745 -1802 -1793 -1784 -1656 -1528 -1553 -1577 -1674 -1770 -1684 -1599 -1564 -1243 -1039 -978 -1224 -1470 -1359 -1248 -1256 -1265 -1293 -1320 -1384 -1447 -1355 -1263 -1376 -1489 -1655
2654a655k2l1l1J3J3O3O4r5J44J29J29q7q8j6j7J36J36J1j32k07o3J00J00J89M5m0m1j67j67
2648a587r5r5J4J3k2k2k4k5J2J1Q3Q3K00N6l5l4k9k9p5J63m3m3LLp4k17j31J3l8J05n7n8n7
2640b031Q5jkPPK1K0o0Q4kkQPN2N2P0p3j29J5p5O8k4J19N6q7j00j00p0P2QPo4P8l9m0m5m6
2632b154J55q5N0N0KKLKj2j2L3j11mmk1J21k9k8M3M3R0n3L6j06RJ0l5l5J5J5k1k1OPOORJ0
2623b008RJ0j3j2j3j3M3M3k8k9l5l4l5l4N5N6j6j6m5m6K6K6K9L0L0L0rj0rj0K3K3j3j3l3l3
2615b074L9L8j6j6j5j6j0j0O2O2l1l1l2l1J6J5J5J5k1k0k1k0J3J4J4J3l0l0M2M1p2p3M7M6
2607b077mmL2L1m6m7K5K5j3j3N8N8l5l6L6L6KKLKk3k4R6R6j16j16LKlllllmllk1k2N1N0m6
2598b060m7K5K5L9L9k4k5p2P0j0j0nnonj9j9j8j9nnj4j4P6o8Q5Q4k1k1j02M2mmNNmmq4N8K7
$$ plain form
2654 -1655 -1677 -1708 -1739 -1726 -1713 -1650 -1586 -1681 -1537 -1408 -1279 -1366 -1454 -1470 -1487 -1351 -1215 -1204 -1336 -1543 -1606 -1506 -1406 -1217 -1172 -1212 -1253 -1420 -1587
2648 -1587 -1682 -1777 -1763 -1750 -1772 -1794 -1818 -1843 -1831 -1820 -1737 -1654 -1454 -1398 -1433 -1467 -1496 -1525 -1600 -1437 -1480 -1523 -1520 -1517 -1591 -1808 -1939 -1926 -1964 -1859 -1916 -1974 -2031
2640 -2031 -1946 -1947 -1949 -1942 -1935 -1914 -1894 -1954 -1870 -1872 -1874 -1866 -1859 -1807 -1755 -1685 -1758 -1887 -1872 -1947 -1879 -1903 -1784 -1728 -1815 -1915 -2015 -2085 -2013 -2005 -1998 -2062 -1984 -2023 -2063 -2108 -2154
2632 -2154 -1999 -2084 -2034 -1984 -1982 -1980 -1977 -1975 -1987 -1999 -1966 -2077 -2081 -2085 -2106 -1985 -2014 -2042 -1999 -1956 -1866 -1919 -1883 -1989 -1980 -1970 -2005 -2040 -2025 -2010 -2031 -2052 -2046 -2039 -2033 -2027 -2018 -2008
2623 -2008 -1999 -1989 -2002 -2014 -2027 -2040 -1997 -1954 -1982 -2011 -2046 -2080 -2115 -2149 -2094 -2038 -2054 -2070 -2115 -2161 -2135 -2109 -2080 -2050 -2020 -1990 -1999 -2009 -2018 -2028 -2005 -1982 -1995 -2008 -2041 -2074
2615 -2074 -2035 -1997 -2013 -2029 -2044 -2060 -2070 -2080 -2018 -1956 -1987 -2018 -2050 -2081 -2065 -2050 -2035 -2020 -2041 -2061 -2082 -2102 -2089 -2075 -2061 -2048 -2078 -2108 -2066 -2025 -2097 -2170 -2123 -2077
2607 -2077 -2081 -2085 -2053 -2022 -2068 -2115 -2090 -2065 -2078 -2091 -2033 -1975 -2010 -2046 -2010 -1974 -1972 -1970 -1967 -1965 -1988 -2012 -1916 -1820 -1936 -2052 -2049 -2047 -2050 -2053 -2056 -2059 -2062 -2066 -2069 -2072 -2093 -2115 -2064 -2014 -2060
2598 -2060 -2107 -2082 -2057 -2018 -1979 -2003 -2028 -2100 -2030 -2040 -2050 -2055 -2060 -2066 -2071 -2090 -2109 -2127 -2146 -2151 -2156 -2170 -2184 -2108 -2176 -2091 -2007 -2028 -2049 -2151 -2109 -2113 -2117 -2112 -2107 -2111 -2115 -2199 -2141 -2114
2588b114K6J16k7m0m1K3K2k2k1k2k1NNONm1m2L0L0j9k0O2q2MMP6o8j8j9L6L5O4p8JKk1k0k1
2580b205k1NNmmN4q9O3O3J3J3NMO0q3llJ5J6POJ05l8k9k9l2l2Q7Q6k6k6k7k6kkjkL8L9l3l3
2570b066llllpqKKq6N7l1l2Q4n9n9Q5l0l0k2k1L3L2L3L3jjjjM3M4k8k7m3m3K9K9j6j5j6j6
2561b165k5k4k5k5ppopL6L6L6L6j3j3j3j3j2j2N9O0NONOo7o8MNK9L0K9L0l6l5l6l5J8J9J8
2552b177J8oopok0j9k0k0j9k0N2N2kkkkn7n7J5J5K8K8K8K8k9k9k9k9K4K5K4K5J4J4J4J4k7
2544b167k6M5M5L3L3L2L3o9o8ooM4j00J07j32O9p3rqmmmlRJ0RJ0L7L8l4l4j3j4K2K2mnmnl5
2534b229l5L7L7n4n3O6O6l2l2L9L9k9l0M2M3j2j1j2j1rrrrk7k7k7k7J5J6J5J6LLL8L9o9p0
2526b309N0N0j5j6j5j5rrj0r%j%%%%%%j7j8j8j7kjkjooook9l0M3M2N1N1k0k1K2K2K2K1qqq
$$ plain form
2588 -2114 -2088 -1972 -1999 -2039 -2080 -2057 -2035 -2057 -2078 -2100 -2121 -2116 -2111 -2105 -2100 -2141 -2183 -2153 -2123 -2142 -2162 -2100 -2182 -2178 -2174 -2098 -2166 -2184 -2203 -2167 -2132 -2068 -2146 -2145 -2143 -2164 -2184 -2205
2580 -2205 -2226 -2221 -2216 -2220 -2224 -2170 -2259 -2196 -2133 -2120 -2107 -2102 -2098 -2038 -2121 -2124 -2127 -2112 -2096 -2089 -2083 -1978 -2016 -2045 -2074 -2106 -2138 -2051 -1965 -1991 -2017 -2044 -2070 -2072 -2074 -2075 -2077 -2039 -2000 -2033 -2066
2570 -2066 -2069 -2072 -2075 -2078 -2085 -2093 -2091 -2089 -2175 -2118 -2149 -2181 -2097 -2156 -2215 -2130 -2160 -2190 -2212 -2233 -2200 -2168 -2135 -2102 -2103 -2104 -2105 -2106 -2063 -2019 -2047 -2074 -2117 -2160 -2131 -2102 -2118 -2133 -2149 -2165
2561 -2165 -2190 -2214 -2239 -2264 -2271 -2278 -2284 -2291 -2255 -2219 -2183 -2147 -2160 -2173 -2186 -2199 -2211 -2223 -2164 -2104 -2099 -2093 -2088 -2082 -2149 -2217 -2213 -2208 -2179 -2149 -2120 -2090 -2126 -2161 -2197 -2232 -2214 -2195 -2177
2552 -2177 -2159 -2165 -2171 -2178 -2184 -2204 -2223 -2243 -2263 -2282 -2302 -2250 -2198 -2200 -2202 -2204 -2206 -2263 -2320 -2305 -2290 -2262 -2234 -2206 -2178 -2207 -2236 -2265 -2294 -2270 -2245 -2221 -2196 -2182 -2168 -2154 -2140 -2167
2544 -2167 -2193 -2148 -2103 -2070 -2037 -2005 -1972 -2041 -2109 -2115 -2121 -2077 -2177 -2070 -2202 -2133 -2206 -2215 -2223 -2227 -2231 -2235 -2238 -2229 -2219 -2210 -2200 -2163 -2125 -2159 -2193 -2206 -2220 -2198 -2176 -2180 -2185 -2189 -2194 -2229
2534 -2229 -2264 -2227 -2190 -2244 -2297 -2231 -2165 -2197 -2229 -2190 -2151 -2180 -2210 -2168 -2125 -2137 -2148 -2160 -2171 -2180 -2189 -2198 -2207 -2234 -2261 -2288 -2315 -2300 -2284 -2269 -2253 -2250 -2247 -2209 -2170 -2239 -2309
2526 -2309 -2259 -2209 -2224 -2240 -2255 -2270 -2279 -2288 -2298 -2307 -2307 -2308 -2308 -2308 -2308 -2308 -2308 -2308 -2325 -2343 -2361 -2378 -2380 -2381 -2383 -2384 -2390 -2396 -2402 -2408 -2437 -2467 -2424 -2382 -2331 -2280 -2300 -2321 -2299 -2277 -2255 -2234 -2242 -2250 -2258
2516b258qp8p8poqppqL2L1mmK6K6m5m6K1K0K0K0j8j8J8J8k4k3M8M8KJL7L7QQM4M4j6j5j6j6
2506b201KLKKj5j5n1n0N9N9o1o0L6L6l6l5KJKKk1k0N1N1n3n3J8J9j1j2O0O1l6l5L7L6j7j7
2498b260lkj03J37KKk5k5k5k5J8J9J8J8j1j2j2j1%%%%N8N8o1o2J8J8J8J8pppqPOPPj2j1j1
2488b271j2k1k1k1k1RRRQj5j5j5j5K2K2K2K2M1M0l0l1j1j1O1O1j9k0J7J6j1j1m7m7RRk7k7
2480b342mnmnl7l8L4L4oopoj8j8j8j9O7O7n2n3qqqqKLKLl3l2l3l3L3L3L3L3K5K6K5K5j7j6
2470b389j7j6k6k7k6k6QQQQl2l3L9L9K9K8K9K8j1j1j1j0L0L1L1L1KKJ7J7j44R4M1j02L3L3
2462b295K5K4m1m1L0L1l1l2M1M1j4j3j3j3%%%%L2L1m0m0ONOOJKJJk3k4k3k4POOPNOONl9l9
2452b414L3L2K7K6m5m5M9M9p0p0J4J5J4J5PPQPrqrqN8N9o1o0qqrqk9k9R1R0l5l6l5l5J4J3
$$ plain form
2516 -2258 -2266 -2344 -2422 -2429 -2435 -2443 -2450 -2457 -2465 -2433 -2402 -2406 -2410 -2384 -2358 -2403 -2449 -2428 -2408 -2388 -2368 -2386 -2404 -2386 -2368 -2392 -2415 -2367 -2319 -2317 -2316 -2279 -2242 -2234 -2226 -2182 -2138 -2154 -2169 -2185 -2201
2506 -2201 -2199 -2196 -2194 -2192 -2207 -2222 -2273 -2323 -2264 -2205 -2266 -2326 -2290 -2254 -2290 -2325 -2323 -2322 -2320 -2318 -2339 -2359 -2308 -2257 -2310 -2363 -2345 -2326 -2337 -2349 -2289 -2228 -2264 -2299 -2262 -2226 -2243 -2260
2498 -2260 -2263 -2265 -2368 -2231 -2229 -2227 -2252 -2277 -2302 -2327 -2309 -2290 -2272 -2254 -2265 -2277 -2289 -2300 -2300 -2300 -2300 -2300 -2242 -2184 -2245 -2307 -2289 -2271 -2253 -2235 -2242 -2249 -2256 -2264 -2257 -2251 -2244 -2237 -2249 -2260 -2271
2488 -2271 -2283 -2304 -2325 -2346 -2367 -2358 -2349 -2340 -2332 -2347 -2362 -2377 -2392 -2370 -2348 -2326 -2304 -2263 -2223 -2253 -2284 -2295 -2306 -2245 -2184 -2203 -2223 -2206 -2190 -2201 -2212 -2259 -2306 -2297 -2288 -2315 -2342
2480 -2342 -2346 -2351 -2355 -2360 -2397 -2435 -2401 -2367 -2373 -2379 -2386 -2392 -2410 -2428 -2446 -2465 -2398 -2331 -2383 -2436 -2444 -2452 -2460 -2468 -2466 -2463 -2461 -2458 -2491 -2523 -2556 -2589 -2556 -2523 -2490 -2457 -2432 -2406 -2381 -2356 -2373 -2389
2470 -2389 -2406 -2422 -2448 -2475 -2501 -2527 -2519 -2511 -2503 -2495 -2527 -2560 -2521 -2482 -2453 -2425 -2396 -2368 -2379 -2390 -2401 -2411 -2381 -2350 -2319 -2288 -2286 -2284 -2267 -2250 -2394 -2300 -2259 -2361 -2328 -2295
2462 -2295 -2270 -2246 -2287 -2328 -2298 -2267 -2298 -2330 -2289 -2248 -2262 -2275 -2288 -2301 -2301 -2301 -2301 -2301 -2269 -2238 -2278 -2318 -2312 -2307 -2301 -2295 -2294 -2292 -2291 -2290 -2313 -2337 -2360 -2384 -2377 -2371 -2365 -2358 -2353 -2347 -2341 -2336 -2375 -2414
2452 -2414 -2381 -2349 -2322 -2296 -2341 -2386 -2337 -2288 -2358 -2428 -2414 -2399 -2385 -2370 -2363 -2356 -2348 -2341 -2350 -2358 -2367 -2375 -2317 -2258 -2319 -2379 -2387 -2395 -2404 -2412 -2441 -2470 -2379 -2289 -2324 -2360 -2395 -2430 -2416 -2403
2443b403J4J4k3k3k3k3N8N9j2j3j2j2j2j2M9M9k2k3N5N4j8j7j1j2j1j2mnnmJ7J8n4n4nmnn
2434b452M5M5M4M5j1j1j1j1j1j1j1j1j4j4j4j4NMMMkkkkm7m7K5K5j2j2N9O0M6M6k5k6kklk
2425b325ppppOPOOk9k9M2M2m8m7K3K4lmmlo2o2P0O9l8l8l8l8J7J7m3m3K5K4l5l5LLLMJ9K0
2415b522j6j6NNNNM3M3QPj5j6K0K1k2k3J4J4nmmnK8K8l2l2QRn2n2N0N0j0rK2K3l7l7M8M8j2
2406b417j1k7k7L3L3K5K5K6K5j1j2j1j2K0K0m0m0J3J3k2k3j3j4m9n0J4J5N0N0KJKJk7k7L2
2398b433L2j1j1m7m7j3j3j4j3l1l1K8K9j3j3j3j2J2J3J2J3j8j8M2M2RQRQoooomml9m0QRQR
2388b571J4J3m6m6P1P0o0o1L0K9L0K9n5n6j9k0J2J3k4k3J2J3M8M8MMMNK2K3l7l7k5k6J0J0
2380b592K8K8qqJ4J5J4J5j7j7j7j7J3J3m7m7J9J8m1m1k7k6J0Rj4j5O9O9k1k2Q5Q6K2K3l6l7
$$ plain form
2443 -2403 -2389 -2375 -2398 -2421 -2444 -2467 -2409 -2350 -2362 -2375 -2387 -2399 -2411 -2423 -2374 -2325 -2347 -2370 -2315 -2261 -2279 -2296 -2307 -2319 -2330 -2342 -2346 -2351 -2356 -2360 -2343 -2325 -2379 -2433 -2438 -2442 -2447 -2452
2434 -2452 -2407 -2362 -2318 -2273 -2284 -2295 -2306 -2317 -2328 -2339 -2350 -2361 -2375 -2389 -2403 -2417 -2412 -2408 -2404 -2400 -2402 -2404 -2406 -2408 -2455 -2502 -2477 -2452 -2464 -2476 -2417 -2357 -2311 -2265 -2290 -2316 -2318 -2320 -2323 -2325
2425 -2325 -2332 -2339 -2346 -2353 -2347 -2340 -2334 -2328 -2357 -2386 -2344 -2302 -2350 -2397 -2374 -2350 -2353 -2357 -2361 -2364 -2426 -2488 -2418 -2349 -2387 -2425 -2463 -2501 -2484 -2467 -2510 -2553 -2528 -2504 -2539 -2574 -2571 -2568 -2565 -2561 -2542 -2522
2415 -2522 -2538 -2554 -2549 -2544 -2539 -2534 -2491 -2448 -2440 -2433 -2448 -2464 -2444 -2423 -2445 -2468 -2454 -2440 -2445 -2449 -2453 -2458 -2430 -2402 -2434 -2466 -2458 -2449 -2501 -2553 -2503 -2453 -2463 -2472 -2450 -2427 -2464 -2501 -2453 -2405 -2417
2406 -2417 -2428 -2455 -2482 -2449 -2416 -2391 -2366 -2340 -2315 -2326 -2338 -2349 -2361 -2341 -2321 -2361 -2401 -2388 -2375 -2397 -2420 -2433 -2447 -2496 -2546 -2532 -2517 -2467 -2417 -2415 -2414 -2412 -2411 -2438 -2465 -2433
2398 -2433 -2401 -2412 -2423 -2470 -2517 -2530 -2543 -2557 -2570 -2601 -2632 -2604 -2575 -2588 -2601 -2614 -2626 -2614 -2601 -2589 -2576 -2594 -2612 -2570 -2528 -2519 -2511 -2502 -2494 -2500 -2506 -2512 -2518 -2522 -2526 -2565 -2605 -2597 -2588 -2580 -2571
2388 -2571 -2557 -2544 -2590 -2636 -2565 -2495 -2555 -2616 -2586 -2557 -2527 -2498 -2553 -2609 -2628 -2648 -2636 -2623 -2647 -2670 -2658 -2645 -2597 -2549 -2545 -2541 -2537 -2532 -2510 -2487 -2524 -2561 -2586 -2612 -2602 -2592
2380 -2592 -2564 -2536 -2544 -2552 -2538 -2523 -2509 -2494 -2511 -2528 -2545 -2562 -2549 -2536 -2583 -2630 -2611 -2593 -2634 -2675 -2702 -2728 -2718 -2709 -2723 -2738 -2669 -2600 -2621 -2643 -2558 -2472 -2450 -2427 -2463 -2500
2372b500N5N5nnNNNNLLL8L9o3o2llK9L0K9K9pqm3m3m1m1J9J9K6K5j0j0j8j9j8j8L4L4jkop
2362b446ppl6l7L5L5nonnnmnnmnmnK2K2K3K2qpqqJ%JJ%J%Jj2j1j2j2J9J8J8J8j3j4j3j4K1
2351b465K1K1K1l9l8L4L3O3O4rqJ2J1J2J2k2k3k2k3MNMMrrrrm2m1L0L0k9k8k8k8j1j1j1j1
2343b544j1j1j1j1J9J9K0J9j1j0j1j1MLMLK1K2K1K1j3j4j4j3J6J6J6J6J1J1J1J2K8K9K9K9
2334b285PPOPj6j6j5j6m6m5P3P4l5l5l6l5k6k6k6k7MMLMPQQPj4j5N7N7k4k4k4k4kjkkoooo
2324b508ooooNNNNONNNM5M5M5M6j3j3j3j3L2L2l9m0ONNOn4n4J7J8k3k3k2k3LLLLK1K1K1K1
2314b423J8J8J8J8J8J8J9J8J9J9J9K0k6k5M6M6L3L4l8l8POPPj3j2j2j2NONOllmlM2M1l0l0
2305b159j1j1O0O0%%j%j6j7J9J9L7L7l5l4M6M6J0J0J8J9J8J8P3P3m7m7M4M5Q0Q0OOM2M2K7
$$ plain form
2372 -2500 -2445 -2390 -2395 -2400 -2395 -2390 -2385 -2380 -2377 -2374 -2336 -2297 -2360 -2422 -2425 -2428 -2399 -2369 -2340 -2311 -2318 -2326 -2369 -2412 -2453 -2494 -2475 -2456 -2430 -2405 -2415 -2425 -2443 -2462 -2480 -2498 -2464 -2430 -2431 -2433 -2439 -2446
2362 -2446 -2453 -2460 -2496 -2533 -2498 -2463 -2468 -2474 -2479 -2484 -2489 -2493 -2498 -2503 -2507 -2512 -2516 -2521 -2499 -2477 -2454 -2432 -2440 -2447 -2455 -2463 -2462 -2462 -2461 -2460 -2460 -2459 -2459 -2458 -2470 -2481 -2493 -2505 -2486 -2468 -2450 -2432 -2445 -2459 -2472 -2486 -2465
2351 -2465 -2444 -2423 -2402 -2441 -2479 -2445 -2412 -2349 -2285 -2294 -2302 -2290 -2279 -2267 -2255 -2277 -2300 -2322 -2345 -2341 -2336 -2332 -2328 -2337 -2346 -2355 -2364 -2406 -2447 -2417 -2387 -2416 -2444 -2472 -2500 -2511 -2522 -2533 -2544
2343 -2544 -2555 -2566 -2577 -2588 -2569 -2550 -2530 -2511 -2522 -2532 -2543 -2554 -2550 -2547 -2543 -2540 -2519 -2497 -2476 -2455 -2468 -2482 -2496 -2509 -2493 -2477 -2461 -2445 -2434 -2423 -2412 -2400 -2372 -2343 -2314 -2285
2334 -2285 -2278 -2271 -2265 -2258 -2274 -2290 -2305 -2321 -2367 -2412 -2339 -2265 -2300 -2335 -2371 -2406 -2432 -2458 -2484 -2511 -2507 -2503 -2500 -2496 -2489 -2481 -2473 -2466 -2480 -2495 -2438 -2381 -2405 -2429 -2453 -2477 -2479 -2480 -2482 -2484 -2490 -2496 -2502 -2508
2324 -2508 -2514 -2520 -2526 -2532 -2527 -2522 -2517 -2512 -2506 -2501 -2496 -2491 -2446 -2401 -2356 -2310 -2323 -2336 -2349 -2362 -2330 -2298 -2337 -2377 -2371 -2366 -2361 -2355 -2409 -2463 -2446 -2428 -2451 -2474 -2496 -2519 -2516 -2513 -2510 -2507 -2486 -2465 -2444 -2423
2314 -2423 -2405 -2387 -2369 -2351 -2333 -2315 -2296 -2278 -2259 -2240 -2221 -2201 -2227 -2252 -2206 -2160 -2127 -2093 -2131 -2169 -2162 -2156 -2149 -2142 -2155 -2167 -2179 -2191 -2186 -2180 -2175 -2169 -2172 -2175 -2179 -2182 -2140 -2099 -2129 -2159
2305 -2159 -2170 -2181 -2121 -2061 -2061 -2061 -2062 -2062 -2078 -2095 -2076 -2057 -2020 -1983 -2018 -2052 -2006 -1960 -1950 -1940 -1922 -1903 -1885 -1867 -1794 -1721 -1768 -1815 -1771 -1726 -1646 -1566 -1560 -1554 -1512 -1470 -1443
2297a443K6rj0kkkkQ5Q5q2q1L6L6l5l5N3N2N3N3mmO7O7N3N3N2N3P1P2%%O2O3O2O3J27J28Q
2288b31QJ11J11L9L9J16J16M4M4J50J49J14J13R0R0K09K09J28J27J99J98K72K72K36K36L26
2282C515L26L26L26L78L77L78L78M75M76N95N96O19O20O91O92Q28Q28R96R95J080J080J199
2277A7774J200J439J439J559J558J579J580J579J579J391J390J107J106P65M30J54j81n02
2273C6946o46r73j116j303j541j503j645j601j601j538j538j368j368j329j187j093j094r66
2269A3536r65q99q98q12o69o03o04n23n23m73m73m02m01l84l84l12l12k84k84k12k13j98j98
2263B510k34k34j96j96j96j96j05j04j76j76j11j12j12j12p8p8l4l3j69k6l6l5m7m6n6n5J4
2257d29j28m8m8p5p5p5p5n2n2n2n3l2l2k3k3r5M7Q4o0q5q6N7q5J7J7n4n4j04M0n0R3m3m4l4
$$ plain form
2297 -1443 -1417 -1426 -1436 -1438 -1440 -1442 -1444 -1359 -1274 -1356 -1437 -1401 -1365 -1400 -1435 -1382 -1330 -1277 -1224 -1228 -1232 -1165 -1098 -1045 -992 -940 -887 -816 -744 -744 -744 -682 -619 -557 -494 -367 -239 -231
2288 -231 -223 -112 -1 38 77 193 309 353 397 547 696 810 923 1013 1103 1312 1521 1649 1776 1975 2173 2445 2717 2953 3189 3515
2282 3515 3841 4167 4493 4871 5248 5626 6004 6479 6955 7550 8146 8765 9385 10076 10768 11596 12424 13420 14415 15495 16575 17774
2277 17774 18974 20413 21852 23411 24969 26548 28128 29707 31286 32677 34067 35174 36280 37045 37475 37629 37448 36946
2273 36946 36300 35327 34211 32908 31367 29864 28219 26618 25017 23479 21941 20573 19205 17876 16689 15596 14502 13536
2269 13536 12571 11672 10774 9962 9293 8690 8086 7563 7040 6567 6094 5692 5291 4907 4523 4211 3899 3615 3331 3119 2906 2708 2510
2263 2510 2276 2042 1846 1650 1454 1258 1153 1049 873 697 586 474 362 250 172 94 60 27 -142 -168 -204 -239 -286 -332 -388 -443 -429
2257 -429 -557 -605 -653 -728 -803 -878 -953 -1005 -1057 -1109 -1162 -1194 -1226 -1249 -1272 -1367 -1320 -1236 -1296 -1381 -1467 -1410 -1495 -1478 -1461 -1515 -1569 -1673 -1633 -1683 -1590 -1633 -1677 -1711
2249a711l5nom1m1m3m3K9K9j6j5k4J18l5l5l6l5M0j02N8q4L0L1K2K3p5p5M4M5j6j6j6j6rq
2241b069rqJ0J1J0J1o7o7NMl9l9L3L2j6j7j6j7o9o8LLN7N7j5j5NNNNJ%J%J2J2J1J2poooJ4
2232b237J5J5J5M0L9l2l2ooL0K9k7k7k7k7j7j7n3n3QQo4o4J4J4J3J4l3l3LLL4L4l8l7o1o0
2223b623J1J1M4M4p6p5L7L6l5l5J5J4J4J4k8k8M3M3l5l5JJK5K5K4K5%%l5l6M7M6J36j51K3
2215b513K3l0l1JJl5l5J3J4n8n7j3j2K3K4mnm0m0K2K2K1K2j6j7n2n3O6O6nnl8l7L4L5L2L2
2207b645l9m0j7j7J9J8J7J6J7J6n1n2K0K0K0K0n1n2J5J5J5J5J0J1J0J0J9J8J9J8j1j2j1j1
2199b651qppqJ1J1J0J1NNNNL5L4L5L5mnmmrrrqJ5J6n6n6p1p2%%k1k0J5J5K1K2n0n0J0J1J0
2189b792J1J0J1J0J1l1l1M0M1m0m0L2L2nmmn%%%%k7k8k7k8L1L1L0L1noO6O7n5n4J7J7R6R7
$$ plain form
2249 -1711 -1746 -1751 -1757 -1798 -1839 -1882 -1925 -1896 -1867 -1883 -1898 -1922 -1804 -1839 -1874 -1910 -1945 -1905 -2007 -1949 -2033 -2003 -1972 -1950 -1927 -2002 -2077 -2033 -1988 -2004 -2020 -2036 -2052 -2061 -2069
2241 -2069 -2078 -2086 -2076 -2065 -2055 -2044 -2111 -2178 -2173 -2169 -2208 -2247 -2214 -2182 -2198 -2215 -2231 -2248 -2317 -2385 -2382 -2379 -2322 -2265 -2280 -2295 -2290 -2285 -2280 -2275 -2274 -2274 -2273 -2273 -2261 -2249 -2238 -2226 -2233 -2239 -2245 -2251 -2237
2232 -2237 -2222 -2207 -2192 -2152 -2113 -2145 -2177 -2183 -2189 -2159 -2130 -2157 -2184 -2211 -2238 -2255 -2272 -2325 -2378 -2370 -2362 -2426 -2490 -2476 -2462 -2449 -2435 -2468 -2501 -2498 -2495 -2461 -2427 -2465 -2502 -2563 -2623
2223 -2623 -2612 -2601 -2557 -2513 -2589 -2664 -2627 -2591 -2626 -2661 -2646 -2632 -2618 -2604 -2632 -2660 -2617 -2574 -2609 -2644 -2643 -2642 -2617 -2592 -2568 -2543 -2543 -2543 -2578 -2614 -2567 -2521 -2385 -2536 -2513
2215 -2513 -2490 -2520 -2551 -2550 -2549 -2584 -2619 -2606 -2592 -2650 -2707 -2720 -2732 -2709 -2685 -2689 -2694 -2734 -2774 -2752 -2730 -2709 -2687 -2703 -2720 -2772 -2825 -2759 -2693 -2698 -2703 -2741 -2778 -2744 -2709 -2677 -2645
2207 -2645 -2684 -2724 -2741 -2758 -2739 -2721 -2704 -2688 -2671 -2655 -2706 -2758 -2738 -2718 -2698 -2678 -2729 -2781 -2766 -2751 -2736 -2721 -2711 -2700 -2690 -2680 -2661 -2643 -2624 -2606 -2617 -2629 -2640 -2651
2199 -2651 -2659 -2666 -2673 -2681 -2670 -2659 -2649 -2638 -2633 -2628 -2623 -2618 -2583 -2549 -2514 -2479 -2483 -2488 -2492 -2496 -2505 -2514 -2523 -2531 -2516 -2500 -2556 -2612 -2683 -2755 -2755 -2755 -2776 -2796 -2781 -2766 -2745 -2723 -2773 -2823 -2813 -2802 -2792
2189 -2792 -2781 -2771 -2760 -2750 -2739 -2770 -2801 -2761 -2720 -2760 -2800 -2768 -2736 -2741 -2745 -2749 -2754 -2754 -2754 -2754 -2754 -2781 -2809 -2836 -2864 -2833 -2802 -2772 -2741 -2746 -2752 -2686 -2619 -2674 -2728 -2711 -2694 -2598 -2501
2180b501p0p0k1k1N0N1qpqqj2j2j2j2K6K6K6K6mmmmJ9J8J9J9k4k3k3k3K1K1K1K1LLLKj6j6
2171b528j7j6J3J4J3J4j7j6j7j6k5k6k5k5RJ0RJ0m0m0L2L2J5J6J5J6j0j0j0j0K5K5K5K5nm
2163b539nnopooK3K3K4K3N5N4N5N4n6n6J6J6R1R2K0K0m8m9m8m9O0O0N9O0L7L7L8L7O1O2j0
2154a813j0j19j19j19j19MLLMo9o8N1N1Q4Q3J2J2j01j02j01j01j6j5j5j5n7n7n7n7L1L1L1
2147b730L1J3J4J3J3OOOPJ5J5J5J5k8k7k8k7lkkkj0j0J09J10J7J7J7J6O5O5n5n4q2q1j0j0
2139b576o0o0o0o0kkkjM7M7M8M7J7J8J7J8l6l7l6l6popok1k0k0k1K0K0n1n2L4L4L4L4N1N2
2130b641k0j9k7k7k6k7m0m0l1l1n3R1p0P2n7n6K3K4J9J9J8J9J9J8j8j8l8l9L3L3P1P1m9m8
2122b845O0O1j2j1qrqqk3k2O7p6j10L4k1k0L5L4L4j08R4m8k2k1J05l8PPMLl2l1J7J7j9j8J3
$$ plain form
2180 -2501 -2571 -2641 -2662 -2683 -2633 -2582 -2590 -2597 -2605 -2613 -2625 -2637 -2649 -2661 -2635 -2609 -2583 -2557 -2561 -2565 -2569 -2573 -2554 -2536 -2517 -2498 -2522 -2545 -2568 -2591 -2570 -2549 -2528 -2507 -2504 -2501 -2498 -2496 -2512 -2528
2171 -2528 -2545 -2561 -2548 -2534 -2521 -2507 -2524 -2540 -2557 -2573 -2598 -2624 -2649 -2674 -2665 -2655 -2646 -2636 -2676 -2716 -2684 -2652 -2637 -2621 -2606 -2590 -2600 -2610 -2620 -2630 -2605 -2580 -2555 -2530 -2535 -2539
2163 -2539 -2544 -2549 -2555 -2562 -2568 -2574 -2551 -2528 -2504 -2481 -2426 -2372 -2317 -2263 -2319 -2375 -2359 -2343 -2252 -2160 -2140 -2120 -2168 -2217 -2265 -2314 -2254 -2194 -2135 -2075 -2038 -2001 -1963 -1926 -1865 -1803 -1813
2154 -1813 -1823 -1942 -2061 -2180 -2299 -2295 -2292 -2289 -2285 -2354 -2422 -2371 -2320 -2236 -2153 -2141 -2129 -2230 -2332 -2433 -2534 -2550 -2565 -2580 -2595 -2652 -2709 -2766 -2823 -2792 -2761 -2730
2147 -2730 -2699 -2686 -2672 -2659 -2646 -2640 -2634 -2628 -2621 -2606 -2591 -2576 -2561 -2589 -2616 -2644 -2671 -2674 -2676 -2678 -2680 -2690 -2700 -2591 -2481 -2464 -2447 -2430 -2414 -2349 -2284 -2339 -2393 -2475 -2556 -2566 -2576
2139 -2576 -2636 -2696 -2756 -2816 -2818 -2820 -2822 -2823 -2776 -2729 -2681 -2634 -2617 -2599 -2582 -2564 -2600 -2637 -2673 -2709 -2716 -2722 -2729 -2735 -2756 -2776 -2796 -2817 -2797 -2777 -2828 -2880 -2846 -2812 -2778 -2744 -2693 -2641
2130 -2641 -2661 -2680 -2707 -2734 -2760 -2787 -2827 -2867 -2898 -2929 -2982 -2891 -2961 -2889 -2946 -3002 -2979 -2955 -2936 -2917 -2899 -2880 -2861 -2843 -2861 -2879 -2917 -2956 -2923 -2890 -2819 -2748 -2797 -2845
2122 -2845 -2785 -2724 -2736 -2747 -2755 -2764 -2772 -2780 -2803 -2825 -2758 -2834 -2944 -2910 -2931 -2951 -2916 -2882 -2848 -2956 -2862 -2910 -2932 -2953 -2848 -2886 -2879 -2872 -2868 -2865 -2897 -2928 -2911 -2894 -2913 -2931 -2918
2114b918J2J3J3K2K1n0n0K4K4j2j2L2L2m9m9N8q4J12l1jkj0j0K5K6L4j08KLK9K9K3K2K3K2
2106b785j0j0P1p3O2O2j00M4n1n0L0K9j4j5n1n0j2j2n6n7J60J7j03M0J%RJ0K6K7P1p2k9k9
2098b920L3L3rrrrk5k6k6k5K0K1K1K0n7n8J5J4jjj%N3N3j8j8KKL7L8j3j3j4j3J9J9J9J9j8
2089b845j8j8j8J2J2J1J2LLKLm6m7P3P3poooj0rO3O2m1m0m0m1l9m0Q0P9K2K2j4j4J4J4J3J4
2080b718PPOPpopon7n6J6J5M5M5k6k7j6j6j6j6J7J7J7J6o5o5N4N4j5j5j6j5K6K5j0j0N1N0
2071b710k1k2j0j0j1j0k0j9j9k0K5K4m7m7j4j3K2K2O5O5oponooN3N3N3N2l6l7l6l7m2m1m2
2063b866m2jjL5L5K4K5m8m7J5J6J5J5J6J6N2N2KJo9p0J3J3n8n8J0J0o2o1o7o8R9J00QPk8k8
2054b995O1O0j1j1OPM2M3OOOPMNo7o7M7M7J1J2nonnK6K5j0j1L0L0m1m2K6K7rj0NNo7o6JJJ
$$ plain form
2114 -2918 -2906 -2893 -2880 -2858 -2837 -2887 -2937 -2913 -2889 -2901 -2913 -2881 -2849 -2898 -2947 -2889 -2973 -2861 -2892 -2893 -2895 -2905 -2915 -2890 -2864 -2830 -2938 -2936 -2933 -2904 -2875 -2852 -2830 -2807 -2785
2106 -2785 -2795 -2805 -2734 -2807 -2745 -2683 -2783 -2739 -2790 -2840 -2810 -2781 -2795 -2810 -2861 -2911 -2923 -2935 -2991 -3048 -2888 -2871 -2974 -2934 -2933 -2933 -2924 -2914 -2888 -2861 -2790 -2862 -2891 -2920
2098 -2920 -2887 -2854 -2863 -2872 -2881 -2890 -2915 -2941 -2967 -2992 -2972 -2951 -2930 -2910 -2967 -3025 -3010 -2996 -2997 -2998 -2999 -2999 -2946 -2893 -2911 -2929 -2927 -2925 -2888 -2850 -2863 -2876 -2890 -2903 -2884 -2865 -2846 -2827 -2845
2089 -2845 -2863 -2881 -2899 -2887 -2875 -2864 -2852 -2849 -2846 -2844 -2841 -2887 -2934 -2861 -2788 -2795 -2801 -2807 -2813 -2823 -2832 -2769 -2707 -2748 -2788 -2828 -2869 -2908 -2948 -2868 -2789 -2767 -2745 -2759 -2773 -2759 -2745 -2732 -2718
2080 -2718 -2711 -2704 -2698 -2691 -2698 -2704 -2711 -2717 -2774 -2830 -2814 -2799 -2754 -2709 -2735 -2762 -2778 -2794 -2810 -2826 -2809 -2792 -2775 -2759 -2824 -2889 -2835 -2781 -2796 -2811 -2827 -2842 -2816 -2791 -2801 -2811 -2760 -2710
2071 -2710 -2731 -2753 -2763 -2773 -2784 -2794 -2814 -2833 -2852 -2872 -2847 -2823 -2870 -2917 -2931 -2944 -2922 -2900 -2835 -2770 -2776 -2783 -2789 -2794 -2800 -2806 -2753 -2700 -2647 -2595 -2631 -2668 -2704 -2741 -2783 -2824 -2866
2063 -2866 -2908 -2909 -2910 -2875 -2840 -2816 -2791 -2839 -2886 -2871 -2855 -2840 -2825 -2809 -2793 -2741 -2689 -2687 -2686 -2755 -2825 -2812 -2799 -2857 -2915 -2905 -2895 -2957 -3018 -3085 -3153 -3054 -2954 -2946 -2939 -2967 -2995
2054 -2995 -2934 -2874 -2885 -2896 -2890 -2883 -2841 -2798 -2792 -2786 -2780 -2773 -2769 -2764 -2831 -2898 -2851 -2804 -2793 -2781 -2786 -2792 -2797 -2802 -2776 -2751 -2761 -2772 -2742 -2712 -2753 -2795 -2769 -2742 -2751 -2761 -2756 -2751 -2818 -2884 -2883 -2882 -2881
2045b881Kn3n2J9J9PQPPj4j4j4j3m7m6K6K5L6L7l5l5nmL1L1m2m2P6P7l5l5l6l5jkL4L4qrj7
2035b999J25k4k4R2n1Q2o0N5q8RQl6l6PPPOK3K3m9R4j01M2l8l8P0p4Q8n5K1K1k3k4K4K3m8
2027b941m8M2M1l0l0QQM4M4n4n4J7J7J0RJ8J8m7R5POK3j19q4N9j2j2J49Om0m0J02m0NMm9R5
2019b773n4n3rrq2q1Q5Q5KLKKK2K1K2K1qrqqJ2J3K1K2o8P5nok7k7k8k7OPPPm4m3K8K7m2m3
2009b964ppn7n6O3O3J6J6n5n6K5K6m7m6kjP0P0n6n5P9P8j40R8Q0o3M2M1lll6l5J%j07j08J2
2001c124J2K0K0K0K0K5K4m7m7j3j4K3K2N0N0k2k1M1M1l1l0kjl7l7k4k3J2J2popoRRRRk0k0
1992c111N1N1KKL8L8m1m0nmPPPQj7j8j7j7K0K0r9r9k1k1k2k1L7L7l5l4N7N7J%j18J21K2K2
1983c135L5L4L5L5o2o3N7N7j3j2m9m9L1L0m1m1j3j3K3K4k4k4J2J2J6J7k0j9L3L2L3L3j3j2
$$ plain form
2045 -2881 -2879 -2932 -2984 -2965 -2946 -2939 -2931 -2924 -2917 -2931 -2945 -2959 -2972 -3019 -3065 -3039 -3014 -2978 -2941 -2976 -3011 -3016 -3020 -2989 -2958 -3000 -3042 -2966 -2889 -2924 -2959 -2995 -3030 -3031 -3033 -2999 -2965 -2973 -2982 -2999
2035 -2999 -2874 -2898 -2922 -2830 -2881 -2799 -2859 -2804 -2892 -2883 -2875 -2911 -2947 -2940 -2933 -2926 -2920 -2897 -2874 -2923 -2829 -2930 -2888 -2926 -2964 -2894 -2968 -2880 -2935 -2914 -2893 -2916 -2940 -2916 -2893 -2941
2027 -2941 -2989 -2947 -2906 -2936 -2966 -2958 -2950 -2906 -2862 -2916 -2970 -2953 -2936 -2926 -2917 -2899 -2881 -2928 -2833 -2826 -2820 -2797 -2916 -3000 -2941 -2953 -2965 -2816 -2810 -2850 -2890 -2788 -2828 -2823 -2819 -2868 -2773
2019 -2773 -2827 -2880 -2889 -2898 -2980 -3061 -2976 -2891 -2889 -2886 -2884 -2882 -2860 -2839 -2817 -2796 -2804 -2813 -2821 -2829 -2817 -2804 -2783 -2761 -2829 -2754 -2759 -2765 -2792 -2819 -2847 -2874 -2868 -2861 -2854 -2847 -2891 -2934 -2906 -2879 -2921 -2964
2009 -2964 -2971 -2978 -3035 -3091 -3028 -2965 -2949 -2933 -2988 -3044 -3019 -2993 -3040 -3086 -3088 -3089 -3019 -2949 -3005 -3060 -2981 -2903 -3043 -2945 -2865 -2928 -2886 -2845 -2848 -2851 -2887 -2922 -2921 -2921 -3028 -3136 -3124
2001 -3124 -3112 -3092 -3072 -3052 -3032 -3007 -2983 -3030 -3077 -3090 -3104 -3081 -3059 -3009 -2959 -2981 -3002 -2961 -2920 -2951 -2981 -2983 -2984 -3021 -3058 -3082 -3105 -3093 -3081 -3088 -3094 -3101 -3107 -3098 -3089 -3080 -3071 -3091 -3111
1992 -3111 -3060 -3009 -3007 -3005 -2967 -2929 -2970 -3010 -3015 -3019 -3012 -3005 -2998 -2990 -3007 -3025 -3042 -3059 -3039 -3019 -3118 -3217 -3238 -3259 -3281 -3302 -3265 -3228 -3263 -3297 -3240 -3183 -3182 -3182 -3300 -3179 -3157 -3135
1983 -3135 -3100 -3066 -3031 -2996 -3058 -3121 -3064 -3007 -3020 -3032 -3081 -3130 -3099 -3069 -3110 -3151 -3164 -3177 -3154 -3130 -3154 -3178 -3166 -3154 -3138 -3121 -3141 -3160 -3127 -3095 -3062 -3029 -3042 -3054
1975c054j3j2mlmlPPPOk2k3k3k3K4K3K4K4l0l1NNN1N0k2k1K1K1K1K1onooL0L0m2m1O4O4qp
1966b904l4l3KKL9L9L9L9o4o5PQj1j1j1j1J9J9J9J9q9q9L0L0K3K4m8m8MNM0M0OOk9l0RRJ0
1957b990RK2K2m9n0k4k5M7M7K2K2j3j4j9k0k0k0L2L2L1L2k4k3k4k3k6k5J0J0K3K3K2K3PPP
1949b939QOOPOJ0J0m9n0%%%%K6K6K6K5j3j4j3j4o3o3M5M4n1n0j5j5m8m8L6L6K1K2j4j4J1J1
1940c091J2J1rqrqM9N0J4J4J2J3m7m7J4J4J5J4j2j2j2j1j4j4j4j4J1J2k4k5j3j3j3j3k6k5
1931c219k6k6L8L8LKk8k8QQK8K7K8K7qqqqK9K9l0l0rrN1N0k8k8k9k8j5j5j4j5onooPPPQJ7
1922c220J6N3N3k3k3k2k3J7J7m3m3P6P5qqj7j7J8J9QRk8k7MLMMJ3J2J3J2qpqqK0J9j6j7%j
1912c102l7l6l1l2N2N3m7m7j1j2L7L6L7L6J3J3J2J3k1k1L9L9n1n0n1n1L3L2mlJ9J9j7j7LL
$$ plain form
1975 -3054 -3067 -3079 -3083 -3086 -3090 -3093 -3086 -3079 -3072 -3066 -3088 -3111 -3134 -3157 -3133 -3110 -3086 -3062 -3092 -3123 -3118 -3113 -3062 -3012 -3034 -3055 -3034 -3013 -2992 -2971 -2977 -2982 -2988 -2994 -2964 -2934 -2976 -3017 -2953 -2889 -2897 -2904
1966 -2904 -2938 -2971 -2969 -2967 -2928 -2889 -2850 -2811 -2875 -2940 -2933 -2925 -2936 -2947 -2958 -2969 -2950 -2931 -2912 -2893 -2982 -3071 -3041 -3011 -2988 -2964 -3012 -3060 -3056 -3051 -3011 -2971 -2965 -2959 -2988 -3018 -3009 -3000 -2990
1957 -2990 -2981 -2959 -2937 -2986 -3036 -3060 -3085 -3038 -2991 -2969 -2947 -2960 -2974 -2993 -3013 -3033 -3053 -3021 -2989 -2958 -2926 -2950 -2973 -2997 -3020 -3046 -3071 -3061 -3051 -3028 -3005 -2983 -2960 -2953 -2946 -2939
1949 -2939 -2931 -2925 -2919 -2912 -2906 -2896 -2886 -2935 -2985 -2985 -2985 -2985 -2985 -2959 -2933 -2907 -2882 -2895 -2909 -2922 -2936 -2999 -3062 -3017 -2973 -3024 -3074 -3089 -3104 -3152 -3200 -3164 -3128 -3107 -3085 -3099 -3113 -3102 -3091
1940 -3091 -3079 -3068 -3077 -3085 -3094 -3102 -3053 -3003 -2989 -2975 -2963 -2950 -2997 -3044 -3030 -3016 -3001 -2987 -2999 -3011 -3023 -3034 -3048 -3062 -3076 -3090 -3079 -3067 -3091 -3116 -3129 -3142 -3155 -3168 -3194 -3219
1931 -3219 -3245 -3271 -3233 -3195 -3192 -3190 -3218 -3246 -3238 -3230 -3202 -3175 -3147 -3120 -3128 -3136 -3144 -3152 -3123 -3094 -3124 -3154 -3163 -3172 -3121 -3071 -3099 -3127 -3156 -3184 -3199 -3214 -3228 -3243 -3249 -3254 -3260 -3266 -3259 -3252 -3245 -3237 -3220
1922 -3220 -3204 -3151 -3098 -3121 -3144 -3166 -3189 -3172 -3155 -3198 -3241 -3165 -3090 -3098 -3106 -3123 -3140 -3122 -3103 -3095 -3086 -3114 -3141 -3137 -3134 -3130 -3126 -3113 -3101 -3088 -3076 -3084 -3091 -3099 -3107 -3087 -3068 -3084 -3101 -3101 -3102
1912 -3102 -3139 -3175 -3206 -3238 -3186 -3133 -3180 -3227 -3238 -3250 -3213 -3177 -3140 -3104 -3091 -3078 -3066 -3053 -3074 -3095 -3056 -3017 -3068 -3118 -3169 -3220 -3187 -3155 -3159 -3162 -3143 -3124 -3141 -3158 -3155 -3152
1904c152LMj3j2K3K4j5j5n0n1k1k0J5J5J9J9j7j6J1J2k4k4j4j5M6M6m6m5J4J4M3M3j7j7K0
1896c213K0K1K0j2j1j2j2l2l2MML1L2L1L1k9k9M2M3J9J9n3n2P2P2%%J0J1k6k5m8m8j2j2lk
1887c181lkJ7J8n4n4O4O3qqj9j9j8j9J1J2o1o0L8L8l4l3k2k2k2k2N3N3j8j8N0N0J5J5QRk8
1879c211k7PPK2K1j77O1P9o4l5l5K7K7J2J2k5k4J0J0J0Rj9j9N2N2L1L1m1m1j%jjN6N5j6j6
1871c162l2l2M0L9M2M1P8P7p2p2l5l6kjjjmmm0m0j5j4N7N6k0k0j9k0O3O3qqj7j7N4N4J5J4
1862b999J4J5m2m1L0L0j0j0m6m6L5L4L5L5k4k3J2J2L3L2l9l9lmllqpqprqqqqrqqK1K1K1K0
1852c028J2J2J2J2J6J6J6J5m9n0K2K2l8l7L5L4k2k1J4J4J5J5j46J41jjJ8J7j3j3j3j3j5j5
1844c017j6j5K2K2j4j4L8L7l4l4KLKKk1k0k0k1klllOOPOl3l2l2l3NNNNN7N8j3j4j9k0k0j9
$$ plain form
1904 -3152 -3149 -3145 -3158 -3170 -3147 -3123 -3138 -3153 -3203 -3254 -3275 -3295 -3280 -3265 -3246 -3227 -3244 -3260 -3249 -3237 -3261 -3285 -3299 -3314 -3268 -3222 -3268 -3313 -3299 -3285 -3242 -3199 -3216 -3233 -3213
1896 -3213 -3193 -3172 -3152 -3164 -3175 -3187 -3199 -3231 -3263 -3259 -3255 -3224 -3192 -3161 -3130 -3159 -3188 -3146 -3103 -3084 -3065 -3118 -3170 -3098 -3026 -3026 -3026 -3016 -3005 -3031 -3056 -3104 -3152 -3164 -3176 -3179 -3181
1887 -3181 -3184 -3186 -3169 -3151 -3205 -3259 -3195 -3132 -3140 -3148 -3167 -3186 -3204 -3223 -3212 -3200 -3261 -3321 -3283 -3245 -3279 -3312 -3334 -3356 -3378 -3400 -3347 -3294 -3312 -3330 -3280 -3230 -3215 -3200 -3192 -3183 -3211
1879 -3211 -3238 -3231 -3224 -3202 -3181 -3358 -3297 -3218 -3282 -3317 -3352 -3325 -3298 -3286 -3274 -3299 -3323 -3313 -3303 -3293 -3284 -3303 -3322 -3270 -3218 -3187 -3156 -3197 -3238 -3239 -3239 -3240 -3241 -3185 -3130 -3146 -3162
1871 -3162 -3194 -3226 -3186 -3147 -3105 -3064 -2986 -2909 -2981 -3053 -3088 -3124 -3126 -3127 -3128 -3129 -3133 -3137 -3177 -3217 -3232 -3246 -3189 -3133 -3153 -3173 -3192 -3212 -3149 -3086 -3094 -3102 -3119 -3136 -3082 -3028 -3013 -2999
1862 -2999 -2985 -2970 -3012 -3053 -3023 -2993 -3003 -3013 -3059 -3105 -3070 -3036 -3001 -2966 -2990 -3013 -3001 -2989 -2956 -2924 -2963 -3002 -3005 -3009 -3012 -3015 -3023 -3030 -3038 -3045 -3054 -3062 -3070 -3078 -3086 -3095 -3103 -3111 -3090 -3069 -3048 -3028
1852 -3028 -3016 -3004 -2992 -2980 -2964 -2948 -2932 -2917 -2966 -3016 -2994 -2972 -3010 -3047 -3012 -2978 -3000 -3021 -3007 -2993 -2978 -2963 -3109 -2968 -2969 -2970 -2952 -2935 -2948 -2961 -2974 -2987 -3002 -3017
1844 -3017 -3033 -3048 -3026 -3004 -3018 -3032 -2994 -2957 -2991 -3025 -3023 -3020 -3018 -3016 -3037 -3057 -3077 -3098 -3100 -3103 -3106 -3109 -3103 -3097 -3090 -3084 -3117 -3149 -3181 -3214 -3209 -3204 -3199 -3194 -3137 -3079 -3092 -3106 -3125 -3145 -3165 -3184
1835c184N3N3j9j8l7l6L5L5j6j6j6j5j2j1j2j1M1M2M2M2j7j6j7j6N7N6j5j4j5j5N6N7LMLL
1827b946k2k2k2k2LMMLl6l7L5L5j5j6j5j5j1j1j1j0%%J%l2l3Q7Q7n4n4J8J8LLLKnoonJ9J9
1817c062j7j7l5l4L7L7j6j6N6N6k7k6k7k7j1j2j2j2L4L4q5q5M8M9J2J3n5n4J6J7K0K0j6j5
1809c212L1L2m0m0MLL9L9NNo7o7M2M1M2M1k4k4k4k3NOOOMNMMj%%jNNo6o7j5j5N6N6J0J1k6
1799c205k6pqK8K8L9M0l2l2M6M6k5k5N7N8j4j3j8j7j8j8k4k4J2J2J6J6n5n5l3l3MLj7j7j7
1791c328j7klP0O9j3j3j3j2K2K3K3K2ppppj2j1j1j2M3M2k9k9P1P2%%J0J0J1J0l6l6L5L5M0
1782b997M0p9q0L1L1m1m1rqqqK0K1K0K0k1k1k2k1K7K7K6K7j5j5j5j5NNNOK7K8K7K7q5q5k2
1774c188k3k1j65L5L5K9K9P4o9K1K1J2J3RJ0RJ0RJ0RJ0MMQ5n9KKN6N5O5p8L8L8ppq8N5NNj20
$$ plain form
1835 -3184 -3131 -3078 -3097 -3115 -3152 -3188 -3153 -3118 -3134 -3150 -3166 -3181 -3193 -3204 -3216 -3227 -3186 -3144 -3102 -3060 -3077 -3093 -3110 -3126 -3069 -3013 -3028 -3042 -3057 -3072 -3016 -2959 -2956 -2952 -2949 -2946
1827 -2946 -2968 -2990 -3012 -3034 -3031 -3027 -3023 -3020 -3056 -3093 -3058 -3023 -3038 -3054 -3069 -3084 -3095 -3106 -3117 -3127 -3127 -3127 -3126 -3126 -3158 -3191 -3104 -3017 -3071 -3125 -3107 -3089 -3086 -3083 -3080 -3078 -3083 -3089 -3095 -3100 -3081 -3062
1817 -3062 -3079 -3096 -3131 -3165 -3128 -3091 -3107 -3123 -3067 -3011 -3038 -3064 -3091 -3118 -3129 -3141 -3153 -3165 -3131 -3097 -3182 -3267 -3219 -3170 -3158 -3145 -3200 -3254 -3238 -3221 -3201 -3181 -3197 -3212
1809 -3212 -3181 -3149 -3189 -3229 -3225 -3222 -3183 -3144 -3139 -3134 -3201 -3268 -3226 -3185 -3143 -3102 -3126 -3150 -3174 -3197 -3192 -3186 -3180 -3174 -3170 -3165 -3161 -3157 -3158 -3158 -3158 -3159 -3154 -3149 -3215 -3282 -3297 -3312 -3256 -3200 -3190 -3179 -3205
1799 -3205 -3231 -3238 -3246 -3218 -3190 -3151 -3111 -3143 -3175 -3129 -3083 -3108 -3133 -3076 -3018 -3032 -3045 -3063 -3080 -3098 -3116 -3140 -3164 -3152 -3140 -3124 -3108 -3163 -3218 -3251 -3284 -3280 -3277 -3294 -3311 -3328
1791 -3328 -3345 -3347 -3350 -3280 -3211 -3224 -3237 -3250 -3262 -3240 -3217 -3194 -3172 -3179 -3186 -3193 -3200 -3212 -3223 -3234 -3246 -3203 -3161 -3190 -3219 -3148 -3076 -3076 -3076 -3066 -3056 -3045 -3035 -3071 -3107 -3072 -3037 -2997
1782 -2997 -2957 -3036 -3116 -3085 -3054 -3095 -3136 -3145 -3153 -3161 -3169 -3149 -3128 -3108 -3088 -3109 -3130 -3152 -3173 -3146 -3119 -3093 -3066 -3081 -3096 -3111 -3126 -3121 -3116 -3111 -3105 -3078 -3050 -3023 -2996 -3081 -3166 -3188
1774 -3188 -3211 -3232 -3397 -3362 -3327 -3298 -3269 -3195 -3264 -3243 -3222 -3210 -3197 -3188 -3178 -3169 -3159 -3150 -3140 -3131 -3121 -3117 -3113 -3028 -3087 -3085 -3083 -3027 -2972 -2907 -2985 -2947 -2909 -2916 -2923 -3011 -2956 -2951 -2946 -3066
1765c066J18n0m9qqJ5j28J05l9pqn2n2M3M2k9k9j1j1K5K5j6j5O6p8j3j3k2k2K4K4K3K4j0j1
1757c213j0j1N4N3j8j8mnQ5n8n3R1JJk0k0j9k0K6K5K6K6n6n7J6J5j4j5j4j4K0K0K0K0MNp6
1748c207O7k7k7j8j8m6m6K6K5j9j9J7J7K8K8qqj5j5j6j5mmnmJ4J3J4J3llllK1K2j5j4l0l1
1739c318M1M2l9l9l8l9l1l2M0M0%%%%ppopRRk6k7Q0Q1RRpoO5O5l1l0M2M1rqm4m5M5M5k6k7
1730c186o0o1J1J1J7J8j8j7M9M9J3J4j8j8N4N3K0J9n2n2M0M1NNrj0rrJ3J4J3J4J6J5J6J6Q5
1721b898Q4J21J21j32j32o1o0n3n3J9J9j5j4m2m1k9J14L3L4n9n9N7q5O9O9kkN6K00O6K08K77
1714b190P05K35l85n96m52p1p1LLp7p8M8r6M8M8J75L3m8R5P5o7j4j4j8j8J7J8J17J17L09N46
1707a603M70n5n31o75k76l6o1o1p3p4PPj3J29J20J21J10J11J73o6j86j86q2q2M1M1M2M1J41
$$ plain form
1765 -3066 -2948 -2998 -3047 -3055 -3063 -3048 -3176 -3071 -3110 -3117 -3125 -3177 -3229 -3186 -3144 -3173 -3202 -3213 -3224 -3199 -3174 -3190 -3205 -3139 -3217 -3230 -3243 -3265 -3287 -3263 -3239 -3216 -3192 -3202 -3213
1757 -3213 -3223 -3234 -3180 -3127 -3145 -3163 -3167 -3172 -3087 -3145 -3198 -3107 -3106 -3105 -3125 -3145 -3164 -3184 -3158 -3133 -3107 -3081 -3137 -3194 -3178 -3163 -3177 -3192 -3206 -3220 -3200 -3180 -3160 -3140 -3136 -3131 -3207
1748 -3207 -3140 -3167 -3194 -3212 -3230 -3276 -3322 -3296 -3271 -3290 -3309 -3292 -3275 -3247 -3219 -3227 -3235 -3250 -3265 -3281 -3296 -3300 -3304 -3309 -3313 -3299 -3286 -3272 -3259 -3262 -3265 -3268 -3271 -3250 -3228 -3243 -3257 -3287 -3318
1739 -3318 -3277 -3235 -3274 -3313 -3351 -3390 -3421 -3453 -3413 -3373 -3373 -3373 -3373 -3373 -3380 -3387 -3393 -3400 -3391 -3382 -3408 -3435 -3355 -3274 -3265 -3256 -3263 -3269 -3204 -3139 -3170 -3200 -3158 -3117 -3126 -3134 -3178 -3223 -3178 -3133 -3159 -3186
1730 -3186 -3246 -3307 -3296 -3285 -3268 -3250 -3268 -3285 -3236 -3187 -3174 -3160 -3178 -3196 -3142 -3089 -3069 -3050 -3102 -3154 -3114 -3073 -3068 -3063 -3072 -3082 -3091 -3100 -3087 -3073 -3060 -3046 -3030 -3015 -2999 -2983 -2898
1721 -2898 -2814 -2693 -2572 -2704 -2836 -2897 -2957 -3010 -3063 -3044 -3025 -3040 -3054 -3096 -3137 -3166 -3052 -3019 -2985 -3044 -3103 -3046 -3131 -3062 -2993 -2995 -2997 -2941 -2741 -2675 -2467 -2190
1714 -2190 -1485 -1250 -1635 -2231 -2683 -2754 -2825 -2822 -2819 -2896 -2974 -2926 -3022 -2974 -2926 -2751 -2718 -2766 -2671 -2596 -2663 -2677 -2691 -2709 -2727 -2710 -2692 -2575 -2458 -2149 -1603
1707 -1603 -1133 -1188 -1719 -2394 -2670 -2706 -2767 -2828 -2901 -2975 -2968 -2961 -2974 -2845 -2725 -2604 -2494 -2383 -2210 -2276 -2462 -2648 -2730 -2812 -2771 -2730 -2688 -2647 -2506
1700b506J42R1R1j44l83j29j29N4N5n6n5r7M7L7L8J12J12J99L41M99M98L19L19J29k05o47
1694a268o46m37j99k3k2kkkkQQQ9n5j3j4K2K2N9K02J93L35L13P5J84J85O79J298J654Q43q80
1687B604j881j600o95m57k19j39j38M7r7J84M0O4O5K22K22J16J15j48j47j28j28j37PK21K20
1682a787N70J094J737J594R2j482j990j180n63k30j33j34p7p8J15J15R2K34N04Q39O50K9p69
1676g58p71n83k49k14p0RJ0K1L56M98M98K72j57n84m41k02n9o0n9r0q9m2J01J16K59M25P60
1670a103Q55M24m62p02o94k65j63j64r6r5q7q7j39LL9j04KKj7J27J3J3j4j4K9K8O5O4J86J86
1663b170K87J44J48r1j08J30Q2o2k13k14k04L4K8K8j12L1K2K2J33J34L30L31P56J996K611
1658D073J371j559k799j772p24l08k2JKJ99J98J99J98j56j56J0J1J29J28J28J29K16K17N34
$$ plain form
1700 -2506 -2364 -2273 -2182 -2326 -2709 -2838 -2967 -2913 -2858 -2914 -2969 -3066 -3019 -2982 -2944 -2832 -2720 -2521 -2180 -1681 -1183 -864 -545 -416 -621 -1268
1694 -1268 -1914 -2351 -2550 -2573 -2595 -2597 -2599 -2601 -2603 -2595 -2587 -2498 -2553 -2566 -2580 -2558 -2536 -2477 -2275 -2082 -1747 -1434 -1359 -1175 -990 -311 987 2641 3484 2604
1687 2604 723 -877 -1572 -2029 -2248 -2387 -2525 -2478 -2575 -2391 -2351 -2287 -2222 -2000 -1778 -1662 -1547 -1695 -1842 -1970 -2098 -2235 -2228 -2007 -1787
1682 -1787 -1217 -123 1614 3208 3300 1818 -172 -1352 -1915 -2145 -2278 -2412 -2489 -2567 -2452 -2337 -2245 -2011 -1507 -668 -18 11 -758
1676 -758 -1529 -2112 -2361 -2575 -2645 -2636 -2626 -2605 -2249 -1751 -1253 -981 -1138 -1722 -2163 -2365 -2424 -2484 -2543 -2633 -2722 -2764 -2663 -2547 -2288 -1863 -1103
1670 -1103 -248 176 -286 -988 -1682 -1947 -2110 -2274 -2370 -2465 -2552 -2639 -2778 -2775 -2736 -2840 -2838 -2836 -2853 -2726 -2713 -2700 -2714 -2728 -2699 -2671 -2606 -2542 -2356 -2170
1663 -2170 -1883 -1739 -1591 -1682 -1790 -1660 -1578 -1640 -1853 -2067 -2271 -2237 -2209 -2181 -2293 -2262 -2240 -2218 -2085 -1951 -1621 -1290 -534 1462 4073
1658 4073 5444 3885 1086 -686 -1410 -1718 -1740 -1739 -1737 -1538 -1340 -1141 -943 -1099 -1255 -1245 -1234 -1105 -977 -849 -720 -504 -287 247
1652B47N35P99R42J411K840O308J0791J0087N604J1629K8321K0416j5925l5906k4554j0271
1648A3274m452k354j495j006p20m24N2o1o1j08J78M82P68J484J960J496O37Q88K318M905R580
1644B7341J6393K2403L4195P5496J04079K9011q9361j12540n4248k0959r894n602l584k727
1640A0003j969j111o57o58l30m3L58Q36J778L590L378K30k022p83J941M516P855J2910K3375
1636F3197N1515J03713R2172k4231j14942r3731l6404j4902p556m433l193k661j803r81o94
1633E066m47L0K33N19Q34J883L326J514j735k976q77P45J847K896M876J0694K4969L7083J6646
1628A07126k4082l7618k0925p739l255j181l22J79Q46J519K377L522N716Q852J3144K0739
1625F8898L8385P5303J11645Q6415r065r4828j06370o6868l3960j8148j0613o881n068l623
$$ plain form
1652 247 782 1581 2523 3934 6774 13082 23873 33960 39564 51193 79514 99930 84005 48099 23545 13274
1648 13274 8822 6468 4973 3967 3247 2823 2875 2814 2753 2645 2823 3305 4073 5557 7517 9013 9650 10538 12856 17761 27341
1644 27341 43734 66137 100332 175828 279907 308918 219557 107017 52769 31810 21916 16314 12730 10003
1640 10003 8034 6923 6266 5608 5278 5235 5593 6429 8207 11797 15175 15405 13383 12600 14541 19057 26912 39822 63197
1636 63197 114712 218425 310597 286366 171424 77693 41289 26387 18831 14398 11205 8544 6741 5760 5066
1633 5066 4619 4649 4882 5401 6235 8118 11444 12958 11223 8247 7370 8115 9962 12858 17734 28428 53397 90480 107126
1628 107126 83044 45426 24501 16762 13507 12326 12004 12183 13029 14548 16925 20447 26163 35015 48159 68898
1625 68898 107283 182586 294231 380646 371581 276753 170383 103515 69555 51407 40794 33913 28845 25222
1621B5222k192j024j65M33R09J410J888K885L744M865O487Q760J3052J9861L0448M6270P8034
1618B40887J53602K97728L59213J84182j74263l67607l11385j54094p3781m0491k5311j7966
1615G0714j3198r667o270l885k359j310m55N94J405K455L691N122P030J0177J5551K4039L6738
1611A40372N8390J06301K15515L57389L12081L1435k99264l85671k39064j10051n5967l2860
1608I8606k1891j6302j2391q886n928m173k933k039j371q82k14K50R18J625K483M033O418
1604C7323J0042J5670K6866N1571R4786J13767N8790n3287j17138j01590n4708k7524j5397
1601C9171r770o924n111l825k823k092j568j240r07o88n46n38n38l63l62k77k78k77k77k05
1597E62k04J0J0q7q7j5j5J3J4k01k00j85j85o6o5j31j30j31j30k17k18n0n0k7k8k7k7O5O5
$$ plain form
1621 25222 23030 22006 21841 22274 23183 24593 26481 29366 33110 37975 44462 53222 66274 86135 116583 162853 240887
1618 240887 394489 692217 1051430 1235612 1061349 693742 382357 228263 154482 113991 88680 70714
1615 70714 57516 47849 41579 37694 35335 34025 33570 34164 35569 38024 41715 46837 53867 64044 79595 103634 140372
1611 140372 198762 305063 520578 877967 1190048 1221483 922219 536548 297484 187433 131466 98606
1608 98606 76715 60413 48022 39136 33208 29035 26102 24063 22692 21810 21596 21846 22764 24389 26872 30905 37323
1604 37323 47365 63035 89901 141472 236258 350025 408815 355528 238390 136800 82092 54568 39171
1601 39171 29401 22477 17366 13541 10718 8626 7058 5818 4911 4223 3677 3139 2601 2238 1876 1599 1321 1044 767 562
1597 562 358 368 378 291 204 189 174 187 201 0 -200 -385 -570 -636 -701 -832 -962 -1093 -1223 -1440 -1658 -1708 -1758 -1785 -1813 -1840 -1867 -1802 -1737
1590a737QQj10J28ooNOP8P7M1M0K6K6N9j80j65j65o7o8o7o8m0m1m1m1j7j8N4N4j6j6j6j6j0
1582b301j1j0j0m0m0L2L1J24J23MMj68j67%jJ1J0J1J1kjQPL0J73J55q3j08j09j24j23pppp
1574b592r3r3k2k2j8j8J01J01L3L2J05J04q6q5j4j4P8P8J80N14N61K27m85m85k91j48j09j10
1568b571K0K0j00r9j5j5noL5J77l1l1Q6n8j29J3M7M7o4J75O9L08M44N88j60m95m49l07o9p0
1561b645J1J1J0J1J0J1l5l4l4l5M9N0J0j33mnj3j4p4p3R3R3J78J78J01m3j97n3p2p2l2l3M7
1553b738r5O8O7O8O8l4J10K82K83N78M36L3l96n60l22j72j73j09j10N8N7j7j7j7j7O3O3O3
1547b480O3m7m7Q1L19rrJ8J61L61O95J379J809J170n95j745j602r64m40k11o7j27j26JKk8
1541b438k8k9k8J8J8R8m5O4O3O4O4J40K83K68N07J121J646J653M60j287j716j305m94k20p7
$$ plain form
1590 -1737 -1729 -1721 -1831 -1703 -1709 -1715 -1710 -1704 -1626 -1549 -1508 -1468 -1442 -1416 -1357 -1537 -1702 -1867 -1934 -2002 -2069 -2137 -2177 -2218 -2259 -2300 -2317 -2335 -2281 -2227 -2243 -2259 -2275 -2291 -2301
1582 -2301 -2312 -2322 -2332 -2372 -2412 -2380 -2349 -2225 -2102 -2098 -2094 -2262 -2429 -2429 -2430 -2419 -2409 -2398 -2387 -2389 -2390 -2382 -2375 -2345 -2172 -2017 -2100 -2208 -2317 -2441 -2564 -2571 -2578 -2585 -2592
1574 -2592 -2685 -2778 -2800 -2822 -2840 -2858 -2757 -2656 -2623 -2591 -2486 -2382 -2468 -2553 -2567 -2581 -2503 -2425 -2245 -1731 -1170 -943 -1428 -1913 -2204 -2352 -2461 -2571
1568 -2571 -2551 -2531 -2631 -2730 -2745 -2760 -2765 -2771 -2736 -2559 -2590 -2621 -2535 -2593 -2722 -2709 -2662 -2615 -2679 -2504 -2435 -2127 -1683 -1095 -1255 -1750 -2199 -2506 -2575 -2645
1561 -2645 -2634 -2623 -2613 -2602 -2592 -2581 -2616 -2650 -2684 -2719 -2670 -2620 -2610 -2743 -2747 -2752 -2765 -2779 -2853 -2926 -2833 -2740 -2562 -2384 -2283 -2326 -2523 -2576 -2648 -2720 -2752 -2785 -2738
1553 -2738 -2833 -2765 -2698 -2630 -2562 -2596 -2486 -2204 -1921 -1343 -907 -874 -1270 -1830 -2152 -2324 -2497 -2606 -2716 -2658 -2601 -2618 -2635 -2652 -2669 -2606 -2543 -2480
1547 -2480 -2417 -2464 -2511 -2430 -2111 -2120 -2129 -2111 -1950 -1589 -894 485 2294 3464 2869 1124 -478 -1442 -1882 -2093 -2160 -2287 -2413 -2412 -2410 -2438
1541 -2438 -2466 -2495 -2523 -2505 -2487 -2389 -2434 -2370 -2307 -2243 -2179 -2039 -1756 -1488 -981 140 1786 3439 3899 2612 896 -409 -903 -1123 -1200
1535a200k0J22K11K10K90K91K23K23R0n4k72k71k81k81j93j93p4p4QQK37L80M40M39l4m63
1529b38l77j39J8J9K71M14M04M04N07N07M98M98L37J94j54k98m22n66m85m85m35k93k71l3
1524a25L98P32L93m18r49o13l44j05K6K5p9p9R4R4Q5K28K57K57J85J86J08l5k26m63l49l50
1518a067k45k45k12k13j73l1k7k7J49J49R5R5J57J58n1j94j85j85j87j87o7o7l8l7l7l8R1
1512b619R1k8k8k4k3k3k3noO7O6J42J42J43J42K27K27J08J08j94j93k64k65p1p1p1p1q6q7
1505b689q6q6LLLL%%%%N4N4N4N3L6L6L6L6R5R6p1p2j14j14NNr5r5k3k4j9j8j9j9L4L3l8l8
1496b981n6n6O3O3p5p5M4M3lmmmJ4J4n7n8K6K5K6K6k1k1k0k1J5J5J4J5k0j9k0k0rj0q2q1P6
1488c238P7NNllllOOOON5N4j8j7O3O3rqk2k2k2k2rqrqJ7J8J7J8J7J8J7J8J0J1J1J0pppql1
$$ plain form
1535 -1200 -1220 -1098 -887 -677 -387 -96 127 350 440 386 114 -157 -438 -719 -912 -1105 -1179 -1253 -1245 -1237 -1000 -620 -180 259 225 -238
1529 -238 -615 -754 -736 -717 -446 -32 372 776 1283 1790 2288 2786 3123 3317 3163 2865 2443 1877 1392 907 472 179 -92 -125
1524 -125 273 1005 1398 980 31 -582 -926 -1031 -1005 -980 -1059 -1138 -1044 -950 -865 -637 -380 -123 62 248 356 321 95 -368 -717 -1067
1518 -1067 -1312 -1557 -1769 -1982 -2155 -2186 -2213 -2240 -2091 -1942 -1847 -1752 -1595 -1437 -1488 -1682 -1867 -2052 -2239 -2426 -2493 -2560 -2598 -2635 -2672 -2710 -2619
1512 -2619 -2528 -2556 -2584 -2608 -2631 -2654 -2677 -2682 -2688 -2621 -2555 -2413 -2271 -2128 -1986 -1759 -1532 -1424 -1316 -1510 -1703 -1967 -2232 -2303 -2374 -2445 -2516 -2602 -2689
1505 -2689 -2775 -2861 -2858 -2855 -2852 -2849 -2849 -2849 -2849 -2849 -2795 -2741 -2687 -2634 -2598 -2562 -2526 -2490 -2395 -2299 -2370 -2442 -2556 -2670 -2665 -2660 -2755 -2850 -2873 -2897 -2916 -2934 -2953 -2972 -2938 -2905 -2943 -2981
1496 -2981 -3037 -3093 -3030 -2967 -3042 -3117 -3073 -3030 -3033 -3037 -3041 -3045 -3031 -3017 -3074 -3132 -3106 -3081 -3055 -3029 -3050 -3071 -3091 -3112 -3097 -3082 -3068 -3053 -3073 -3092 -3112 -3132 -3141 -3151 -3233 -3314 -3238
1488 -3238 -3161 -3156 -3151 -3154 -3157 -3160 -3163 -3157 -3151 -3145 -3139 -3084 -3030 -3048 -3065 -3002 -2939 -2948 -2956 -2978 -3000 -3022 -3044 -3053 -3061 -3070 -3078 -3061 -3043 -3026 -3008 -2991 -2973 -2956 -2938 -2928 -2917 -2906 -2896 -2903 -2910 -2917 -2925 -2956
1478b956l2l1l2LLLLn8n7J4J4k0k1J5J5O4O4pqj8j9j8j9j3j3j2j3j02j03J7J7L4L3l8l9K3
1470c307K3K3K3m2m2L0L0KLo9p0K6K5O1O1M1M1M0M1l6l6L5L5L2L2L2L2J74J74q9q8m3m2m3
1462b891m2l1l1l0l1k9k8k9k8j8j7J9J9j4j4N7N8RJ0k6k6k0j9N2N2j1j1O0O0q0q1m5m4N1N2
1454c097o7o8k3k3k4k3j1j1O0O1J1J2J1J2j3j3j3j3j3j3j3j3j6j6j6j5M1M2ONO6O6ooo5o5
1446c263l0l0K0K0K0J9J8J7J8J7M5M5k7k7K5K4j1j1j7j8j7j7j8j7J8J9P0P1m9m9j0rrj0K1
1438c152K1K2K1mnmmpoO5O5J5J6k1k1mmmmJ0RJ0Rj6j6n2n2K0J9n2n2j9k0J6J6rqrqMNMNj3
1428c214j4j3j3JJJJJKJJj8j7j8j8j3j3j3j3k7k7M4M5j0rrrN1N2k0k0l8l8L3L4J2J1J2J2K5
1418c244K5K5K5l5l5l4l5nnnnQPPPRRQ0Q0KJJJO4O4pqk3k2k3k2LKLLl0k9l0k9K8K9K8K9n5
$$ plain form
1478 -2956 -2988 -3019 -3051 -3048 -3045 -3042 -3039 -3097 -3154 -3140 -3126 -3146 -3167 -3152 -3137 -3073 -3009 -3016 -3024 -3042 -3061 -3079 -3098 -3111 -3124 -3136 -3149 -3251 -3354 -3337 -3320 -3286 -3253 -3291 -3330 -3307
1470 -3307 -3284 -3261 -3238 -3280 -3322 -3292 -3262 -3260 -3257 -3326 -3396 -3370 -3345 -3284 -3223 -3182 -3141 -3101 -3060 -3096 -3132 -3097 -3062 -3030 -2998 -2966 -2934 -2760 -2586 -2675 -2763 -2806 -2848 -2891
1462 -2891 -2933 -2964 -2995 -3025 -3056 -3085 -3113 -3142 -3170 -3188 -3205 -3186 -3167 -3181 -3195 -3138 -3080 -3071 -3061 -3087 -3113 -3133 -3152 -3100 -3048 -3059 -3070 -3010 -2950 -3030 -3111 -3156 -3200 -3149 -3097
1454 -3097 -3164 -3232 -3255 -3278 -3302 -3325 -3336 -3347 -3287 -3226 -3215 -3203 -3192 -3180 -3193 -3206 -3219 -3232 -3245 -3258 -3271 -3284 -3300 -3316 -3332 -3347 -3306 -3264 -3258 -3253 -3187 -3121 -3127 -3133 -3198 -3263
1446 -3263 -3293 -3323 -3303 -3283 -3263 -3244 -3226 -3209 -3191 -3174 -3129 -3084 -3111 -3138 -3113 -3089 -3100 -3111 -3128 -3146 -3163 -3180 -3198 -3215 -3197 -3178 -3108 -3037 -3086 -3135 -3145 -3154 -3163 -3173 -3152
1438 -3152 -3131 -3109 -3088 -3092 -3097 -3101 -3105 -3112 -3118 -3053 -2988 -2973 -2957 -2978 -2999 -3003 -3007 -3011 -3015 -3005 -2996 -2986 -2977 -2993 -3009 -3061 -3113 -3093 -3074 -3126 -3178 -3197 -3217 -3201 -3185 -3194 -3202 -3211 -3219 -3215 -3210 -3206 -3201 -3214
1428 -3214 -3228 -3241 -3254 -3253 -3252 -3251 -3250 -3249 -3247 -3246 -3245 -3263 -3280 -3298 -3316 -3329 -3342 -3355 -3368 -3395 -3422 -3378 -3333 -3343 -3352 -3361 -3370 -3319 -3267 -3287 -3307 -3345 -3383 -3350 -3316 -3304 -3293 -3281 -3269 -3244
1418 -3244 -3219 -3194 -3169 -3204 -3239 -3273 -3308 -3313 -3318 -3323 -3328 -3320 -3313 -3306 -3299 -3290 -3281 -3201 -3121 -3119 -3118 -3117 -3116 -3052 -2988 -2995 -3003 -3026 -3048 -3071 -3093 -3090 -3088 -3085 -3082 -3112 -3141 -3171 -3200 -3172 -3143 -3115 -3086 -3141
1408c141n5J7J6k2k2N0M9k4k5k4k4J4J5J4J5j8j9N3N4k2k1k1k1m6m5P4P4o3o3QQMLLLJ1J0
1400c181o1o1M7M6p3p3o9o8LLK1K1K1K1nmMNq3O1k0k0M3M3N1N2p1P3qql0l1N0r2M1M2l8l9
1391c387N3N2k8J15K4K4L3L3k8k8j9j9j25J8J8J8o7P6q5N8KKJ2J1j9j8j9j8L9M0m1J02mmO
1383c173Nk5k6N6N5m0J02r6r7k7k7k6k7j2j2q3O0n7Q6o7o6J17k6O4O3l5J08J8J9J33j0m9m8
1376c143ononK3K2n7n8R9m4l6l5j8j7O2q0MLnoL1L0m1m1n5n5J7J6N4N4j7j8k0k1k1k1K1K1
1367c374K1K1O3O2n7n6j3j2j2j2P2P2J%QQo3o4J3J2Q4Q4R7R7R7R8n7n6J5J6o0n9n9n9K0K0
1359c032n1n2KLP3P4J4J4J5J4Q8Q9Q9Q8J40J40K12K11Q3Q4j32j31j55j55j55j56l6l6l6l5
1352b729JKo9p0M8M9M8M8J02J03J03J02J21J20K40K39m9n0j21j21j86j87j15j15j27j27n6
$$ plain form
1408 -3141 -3196 -3179 -3163 -3185 -3207 -3157 -3108 -3132 -3157 -3181 -3205 -3191 -3176 -3162 -3147 -3165 -3184 -3131 -3077 -3099 -3120 -3141 -3162 -3208 -3253 -3179 -3105 -3168 -3231 -3223 -3215 -3211 -3208 -3205 -3202 -3191 -3181
1400 -3181 -3242 -3303 -3256 -3210 -3283 -3356 -3425 -3493 -3490 -3487 -3466 -3445 -3424 -3403 -3408 -3412 -3408 -3403 -3486 -3425 -3445 -3465 -3422 -3379 -3328 -3276 -3347 -3274 -3282 -3290 -3320 -3351 -3301 -3393 -3352 -3310 -3348 -3387
1391 -3387 -3334 -3282 -3310 -3195 -3171 -3147 -3114 -3081 -3109 -3137 -3156 -3175 -3300 -3282 -3264 -3246 -3313 -3237 -3322 -3264 -3262 -3260 -3248 -3237 -3256 -3274 -3293 -3311 -3272 -3232 -3273 -3171 -3175 -3179 -3173
1383 -3173 -3168 -3193 -3219 -3163 -3108 -3148 -3046 -3142 -3239 -3266 -3293 -3319 -3346 -3358 -3370 -3453 -3393 -3450 -3364 -3431 -3497 -3380 -3406 -3342 -3279 -3314 -3206 -3188 -3169 -3036 -3046 -3095 -3143
1376 -3143 -3149 -3154 -3160 -3165 -3142 -3120 -3177 -3235 -3136 -3180 -3216 -3251 -3269 -3286 -3224 -3304 -3300 -3297 -3302 -3308 -3277 -3247 -3288 -3329 -3384 -3439 -3422 -3406 -3352 -3298 -3315 -3333 -3353 -3374 -3395 -3416 -3395 -3374
1367 -3374 -3353 -3332 -3269 -3207 -3264 -3320 -3333 -3345 -3357 -3369 -3297 -3225 -3224 -3224 -3216 -3208 -3271 -3335 -3322 -3310 -3226 -3142 -3045 -2948 -2851 -2753 -2810 -2866 -2851 -2835 -2895 -2954 -3013 -3072 -3052 -3032
1359 -3032 -3083 -3135 -3133 -3130 -3057 -2983 -2969 -2955 -2940 -2926 -2838 -2749 -2660 -2572 -2432 -2292 -2080 -1869 -1786 -1702 -1834 -1965 -2120 -2275 -2430 -2586 -2622 -2658 -2694 -2729
1352 -2729 -2728 -2726 -2795 -2865 -2817 -2768 -2720 -2672 -2570 -2467 -2364 -2262 -2141 -2021 -1781 -1542 -1591 -1641 -1762 -1883 -2069 -2256 -2371 -2486 -2613 -2740 -2796
1346b796n6j4j4j4j4j5j5j5j5j4j5j5j5O4O4O4O3k5k6k5k6n4n4n4n4k4k4O2O3j55Q4K1K2%
1338c041J%JK8K9K9K9O0O0q3K03M5L31L85L85Q0k07m36k93j80j81n2n2m9m9m9m9L1L2L1L1
1331b930N0M9J21J21L29L29L91L92m7j89j33J53N02P89J175J177l4j083j339q62o16l29j83
1326b167m0l0k9k1k1M9M9J67J68J49J48K68N54P98J084J348O79n42j211j007l40K66P44J221
1320B284R34l71j230j331j044m88m89k74J2j47j47n8n8M7M8N6N6M3J86K72N58R28J212J417
1315B416L67r68j446j039l72k41K36J92M8j10l96m11m11k23k24j52j52p1p2J%p5p6R2R2P7
1309b918P7J48J48M08M08M82N3l23l23k78k78j84j85j8j8JKJKk7k8r9r9r6r6K4K3k6k6k6k6
1302c297J6J6J6J6K9L0J01J01P8P9m0m1p7p7onl1l1l1l1n6n6J5J5o9p0N0M9j5j6N6N6l9m0
$$ plain form
1346 -2796 -2852 -2866 -2880 -2894 -2908 -2923 -2938 -2953 -2968 -2982 -2997 -3012 -3027 -2963 -2899 -2835 -2772 -2797 -2823 -2848 -2874 -2928 -2982 -3036 -3090 -3114 -3138 -3076 -3013 -3168 -3084 -3063 -3041 -3041
1338 -3041 -3040 -3040 -3039 -3011 -2982 -2953 -2924 -2864 -2804 -2887 -2684 -2639 -2308 -1923 -1538 -1458 -1665 -2101 -2394 -2574 -2755 -2807 -2859 -2908 -2957 -3006 -3055 -3024 -2992 -2961 -2930
1331 -2930 -2880 -2831 -2710 -2589 -2260 -1931 -1540 -1148 -1195 -1384 -1517 -1364 -862 -73 1102 2279 2245 1162 -177 -1039 -1655 -1984 -2167
1326 -2167 -2207 -2237 -2266 -2287 -2308 -2259 -2210 -2043 -1875 -1726 -1578 -1310 -756 42 1126 2474 3153 2611 1400 393 53 319 1063 2284
1320 2284 3218 2847 1617 286 -758 -1246 -1735 -2009 -1997 -2144 -2291 -2349 -2407 -2360 -2312 -2256 -2200 -2157 -1971 -1699 -1141 -213 999 2416
1315 2416 2783 1815 369 -670 -1042 -1283 -1047 -855 -807 -917 -1313 -1724 -2135 -2358 -2582 -2734 -2886 -2957 -3029 -3028 -3028 -3103 -3179 -3087 -2995 -2918
1309 -2918 -2841 -2693 -2545 -2137 -1729 -1247 -1194 -1517 -1840 -2118 -2396 -2580 -2765 -2783 -2801 -2800 -2798 -2797 -2795 -2822 -2850 -2949 -3048 -3144 -3240 -3216 -3193 -3219 -3245 -3271 -3297
1302 -3297 -3281 -3265 -3249 -3233 -3204 -3174 -3073 -2972 -2894 -2815 -2855 -2896 -2973 -3050 -3056 -3061 -3092 -3123 -3154 -3185 -3241 -3297 -3282 -3267 -3336 -3406 -3356 -3307 -3322 -3338 -3282 -3226 -3265 -3305
1294c305Q0Q0K3K3R4R4lmmmkkjkkjkkn8n8n8n8m5m5m4m5N0M9k2k2K3K3K2K3j8j8N4N4k7k6
1285c186M4M5M3M2M3M2q2q3j1j1k7k8k7k8j%jjm6m7K6K5K5K5m7m6J%JJN4N5j8j7rrj0rl2l1
1275c335l2l2MLLMK5K6m6m6l9l9l9l9K6K7K6K7n2n1J9K0N7N8N7N7k3k2k3k2nnnml3l2l3l2
1267c550J03J03o4o3j5j5j5j5l6l6L6L6RJ0RJ0J4J4J4J4mlmlJ4J5J4J5NNNNK3K3K3K3K3K3
1258c235K3K3m3m3K9K9n6n6J5J5O0O0n9n9k1k1r2r3ooooL6L7L6L6L2L1L2L2N6N7j5j5mnmn
1249c211j0j0j1j0J9K0J9K0k2k2k2k1k2k2k2k2jjjjM9M8M8M8p5p5M4M4L5L5l6l6lllkk5k6
1241c286M7M6m6m6K6K6N9N9o0o0j4j3K2K3j%j%o9o8LLNMNMJ3J3J3J2j7j7j7j7K6K7K6K6k8
1232c272k9QQk9k8R1R1L6L7l5l5OPPPl2l1MNo2o2J0RKJKJL6L6L6L7L6L6L6L6jj%jM4M5RRO3
$$ plain form
1294 -3305 -3225 -3145 -3122 -3099 -3005 -2911 -2914 -2918 -2922 -2926 -2928 -2930 -2931 -2933 -2935 -2936 -2938 -2940 -2998 -3056 -3114 -3172 -3217 -3262 -3306 -3351 -3301 -3252 -3274 -3296 -3273 -3250 -3228 -3205 -3223 -3241 -3187 -3133 -3160 -3186
1285 -3186 -3142 -3097 -3054 -3012 -2969 -2927 -3009 -3092 -3103 -3114 -3141 -3169 -3196 -3224 -3225 -3225 -3226 -3227 -3273 -3320 -3294 -3269 -3244 -3219 -3266 -3312 -3311 -3311 -3310 -3309 -3255 -3200 -3218 -3235 -3244 -3253 -3263 -3272 -3304 -3335
1275 -3335 -3367 -3399 -3395 -3392 -3389 -3385 -3360 -3334 -3380 -3426 -3465 -3504 -3543 -3582 -3556 -3529 -3503 -3476 -3528 -3579 -3560 -3540 -3483 -3425 -3368 -3311 -3334 -3356 -3379 -3401 -3406 -3411 -3416 -3420 -3453 -3485 -3518 -3550
1267 -3550 -3447 -3344 -3408 -3471 -3486 -3501 -3516 -3531 -3567 -3603 -3567 -3531 -3522 -3512 -3503 -3493 -3479 -3465 -3451 -3437 -3441 -3444 -3448 -3451 -3437 -3422 -3408 -3393 -3388 -3383 -3378 -3373 -3350 -3327 -3304 -3281 -3258 -3235
1258 -3235 -3212 -3189 -3232 -3275 -3246 -3217 -3273 -3329 -3314 -3299 -3239 -3179 -3238 -3297 -3318 -3339 -3431 -3524 -3530 -3536 -3542 -3548 -3512 -3475 -3439 -3403 -3371 -3340 -3308 -3276 -3220 -3163 -3178 -3193 -3197 -3202 -3206 -3211
1249 -3211 -3221 -3231 -3242 -3252 -3233 -3213 -3194 -3174 -3196 -3218 -3240 -3261 -3283 -3305 -3327 -3349 -3350 -3351 -3352 -3353 -3304 -3256 -3208 -3160 -3235 -3310 -3266 -3222 -3187 -3152 -3188 -3224 -3227 -3230 -3233 -3235 -3260 -3286
1241 -3286 -3239 -3193 -3239 -3285 -3259 -3233 -3174 -3115 -3175 -3235 -3249 -3262 -3240 -3217 -3218 -3218 -3219 -3219 -3288 -3356 -3353 -3350 -3345 -3341 -3336 -3332 -3319 -3306 -3293 -3281 -3298 -3315 -3332 -3349 -3323 -3296 -3270 -3244 -3272
1232 -3272 -3301 -3293 -3285 -3314 -3342 -3251 -3160 -3124 -3087 -3122 -3157 -3151 -3144 -3137 -3130 -3162 -3193 -3189 -3184 -3246 -3308 -3298 -3289 -3287 -3286 -3284 -3283 -3247 -3211 -3175 -3138 -3102 -3066 -3030 -2994 -2995 -2996 -2996 -2997 -2953 -2908 -2899 -2890 -2827
1222b827O3rqJ03J03J39J39J12J12J83J84J50J50j7j7q9q8q9q8j07j08l5l6M5M4Q1Q0J56J57
1215a517J56J56K30K29K65K65K35K36k6k6o9o8j87j87n0n0K2K2j5j5K1K0j5j5K1K1O0O0N9
1208a62O0L0L0q9q9r3r2n7n7k1k2R7R8O9O9J41J39J46J45K17K16J04J03J69K6p0l09k19k19
1202C60l26l26k54k55k15k15r6r6k3k4k4k3R8R7O3O2J40J40K0K1j18j19j90j90j44j43j44
1196a924j43j38j38j8j8k0k0j9k0j2j2j2j3q3q3r9r8O1j77l4l4r9M4KJ46k3k3j4j4Q3Q3KJ46
1188b721J09J10Q0o3j27j26o4o4o5o6p4O9m8m9M1j01J7J7RQK8K7J00R9J0J0J0J0k4k4M8M8
1181b766L0L0n1n0Nj38j38Nj1j2klm7m8m8m8n8n9K2K3m5R8J8J8J5J5o5P7ONOJ49K8K8L7L7
1173b937%J%Jj4j5N8N7L4L4l7l8l3l2L8L9k1k1j2j2oJ37k4k4M6r6j6j6j2j2k0k1O5p8KLn2
$$ plain form
1222 -2827 -2764 -2773 -2781 -2678 -2575 -2436 -2297 -2185 -2073 -1890 -1706 -1556 -1406 -1423 -1440 -1529 -1617 -1706 -1794 -1901 -2009 -2044 -2080 -2035 -1991 -1910 -1830 -1674 -1517
1215 -1517 -1361 -1205 -975 -746 -481 -216 19 255 229 203 134 66 -121 -308 -358 -408 -386 -364 -379 -394 -373 -353 -368 -383 -362 -341 -281 -221 -162
1208 -162 -102 -72 -42 -131 -220 -313 -405 -462 -519 -540 -562 -465 -367 -298 -229 -88 51 197 342 559 775 879 982 1151 1177 1107 798 579 360
1202 360 34 -292 -546 -801 -1016 -1231 -1327 -1423 -1446 -1470 -1494 -1517 -1419 -1322 -1259 -1197 -1057 -917 -897 -876 -994 -1113 -1303 -1493 -1637 -1780 -1924
1196 -1924 -2067 -2205 -2343 -2361 -2379 -2399 -2419 -2438 -2458 -2470 -2482 -2494 -2507 -2590 -2673 -2772 -2870 -2809 -2986 -3020 -3054 -3153 -3109 -3107 -2961 -2984 -3007 -3021 -3035 -2952 -2869 -2867 -2721
1188 -2721 -2612 -2502 -2422 -2485 -2612 -2738 -2802 -2866 -2931 -2997 -3071 -3002 -3050 -3099 -3058 -3159 -3142 -3125 -3116 -3108 -3080 -3053 -2953 -2854 -2844 -2834 -2824 -2814 -2838 -2862 -2814 -2766
1181 -2766 -2736 -2706 -2757 -2807 -2802 -2940 -3078 -3073 -3084 -3096 -3098 -3101 -3148 -3196 -3244 -3292 -3350 -3409 -3387 -3364 -3409 -3311 -3293 -3275 -3260 -3245 -3310 -3233 -3227 -3222 -3216 -3067 -3039 -3011 -2974 -2937
1173 -2937 -2937 -2936 -2936 -2935 -2949 -2964 -2906 -2849 -2815 -2781 -2818 -2856 -2889 -2921 -2883 -2844 -2865 -2886 -2898 -2910 -2916 -2779 -2803 -2827 -2781 -2877 -2893 -2909 -2921 -2933 -2953 -2974 -2909 -2987 -2985 -2982 -3034
1164c034n1j32J1L1L1L9M0KKo9o9j7j6j7j7j0j1j1j1P6P6l5l4k1J22l9J04J5J5n7Q7k4k4o
1156c054oj00M2l7l8K4K5J6J5Q5n9K1K1N3N3K05O2p0o9j59j6l7l6j09L5k8k9N1N2K9L0m3m2
1149c113P8P8R5m7kJ42j9j9L5L6M4M4%J43K05O2o6k09k09o6j09L4j18K5L7L7M6M6lllmmnO7
1141b745O7ooo9o9r5M7L8L9J6J6K07O4pj50j50po8P5MLRRp1P2l9l9k0k1m4R9J9J9O2O2j38
1133b817OOPJ6J6l4l4JKkkp4p3k8k7M4M4n9n9k4k4l9l9mll8l8kkk3k3M9M8P0P0jkK6K5K5K6
1123b990%%%%K7K8K7K8o9o9j05j05K4K4r5r5QQRQOOM2M2M5M5k7k7K5K6j1j0o0o0N9N9J6J5
1114c146Q7Q7m3m2m2m2p3p4kjl0k9M2M2n9n8O1O0K3K3N9N9K3K4K4K3o0o0N9N9J13J14P8P7
1107b624k3k3k4k3%%P1P2M3M3M3M3K9L0J01J01P6P6J48J48K22K22J51J50K14K14R5R5K20K19
$$ plain form
1164 -3034 -3085 -3217 -3206 -3175 -3144 -3105 -3065 -3063 -3061 -3130 -3199 -3216 -3232 -3249 -3266 -3276 -3287 -3298 -3309 -3233 -3157 -3192 -3226 -3247 -3125 -3164 -3060 -3045 -3030 -3087 -3000 -3024 -3048 -3054
1156 -3054 -3060 -3160 -3118 -3155 -3193 -3169 -3144 -3128 -3113 -3028 -3087 -3066 -3045 -2992 -2939 -2734 -2672 -2742 -2811 -2970 -2986 -3023 -3059 -3168 -3133 -3161 -3190 -3139 -3087 -3058 -3028 -3071 -3113
1149 -3113 -3035 -2957 -2862 -2909 -2911 -2769 -2788 -2807 -2772 -2736 -2692 -2648 -2648 -2505 -2300 -2238 -2304 -2513 -2722 -2788 -2897 -2863 -2981 -2956 -2919 -2882 -2836 -2790 -2793 -2796 -2799 -2803 -2807 -2812 -2745
1141 -2745 -2678 -2684 -2690 -2759 -2828 -2923 -2876 -2838 -2799 -2783 -2767 -2560 -2496 -2503 -2653 -2803 -2810 -2878 -2803 -2799 -2796 -2787 -2778 -2849 -2777 -2816 -2855 -2875 -2896 -2940 -2841 -2822 -2803 -2741 -2679 -2817
1133 -2817 -2811 -2805 -2798 -2782 -2766 -2800 -2834 -2833 -2831 -2833 -2835 -2909 -2982 -3010 -3037 -2993 -2949 -3008 -3067 -3091 -3115 -3154 -3193 -3197 -3200 -3238 -3276 -3278 -3280 -3303 -3326 -3277 -3229 -3159 -3089 -3090 -3092 -3066 -3041 -3016 -2990
1123 -2990 -2990 -2990 -2990 -2990 -2963 -2935 -2908 -2880 -2949 -3018 -3123 -3228 -3204 -3180 -3275 -3370 -3362 -3354 -3345 -3337 -3331 -3325 -3283 -3241 -3196 -3151 -3178 -3205 -3180 -3154 -3165 -3175 -3235 -3295 -3236 -3177 -3161 -3146
1114 -3146 -3059 -2972 -3015 -3057 -3099 -3141 -3214 -3288 -3290 -3291 -3321 -3350 -3308 -3266 -3325 -3383 -3322 -3262 -3239 -3216 -3157 -3098 -3075 -3051 -3027 -3004 -3064 -3124 -3065 -3006 -2893 -2779 -2701 -2624
1107 -2624 -2647 -2670 -2694 -2717 -2717 -2717 -2646 -2574 -2531 -2488 -2445 -2402 -2373 -2343 -2242 -2141 -2065 -1989 -1841 -1693 -1471 -1249 -1098 -948 -734 -520 -425 -330 -110 109
1100A09M43M43O87Q29J083J560K126K985M248N489O004M573N79l713n412m936l456k408j431
1095I802n72k51k50o35o35j22L55R28J597K478L719N122O553O506L739j160n643p218o549
1091A7764n146l524k305j637j048r06o82l95j58J29K60N47R81J457J655J654J127K68o07j848
1087G586k247j960j532q63n27k41j15J71M23M23J52l25n97p38n46m03l04j61o6o6k4k4Q0K24
1081a680K44N31O62Q04K66m02q19o76n70k85k87jl3l2J22J23K22N08M91K04j95m82n77m35
1076b297k15p3j89m6l5l5k5k6JKJ36j03O1O1p3p2k1k1N1N1NNM1M1K30K30J11J11k9k8j01j00
1068b352j19j19%%J3J3n9n9rrK7K7lkklN1N0k1k0K1K2K1K2J31J31J52J53K35mk27k27q9q9
1060b344q9q9POo5o5LLLMJ5J6N1N2J6J7n5n5K0K0R2R1ONJ25J25J42J42j21j20jjl6l7K7K7
$$ plain form
1100 109 552 995 1682 2511 3594 5154 7280 10265 14513 20002 26006 30579 31158 27445 22033 17097 13641 11233 9802
1095 9802 9230 8979 8729 8094 7459 7337 7692 8620 10217 12695 16414 21536 28089 34595 38334 37174 31531 24313 17764
1091 17764 12618 9094 6789 5152 4104 3198 2516 2121 1963 2092 2352 2899 3880 5337 6992 8646 9773 10041 9434 7586
1087 7586 5339 3379 1847 984 457 216 101 272 695 1118 1270 945 348 -390 -936 -1339 -1643 -1804 -1870 -1936 -1960 -1984 -1904 -1680
1081 -1680 -1436 -905 -243 561 827 425 -394 -1070 -1640 -1925 -2212 -2213 -2246 -2278 -2156 -2033 -1811 -1303 -812 -608 -803 -1285 -1862 -2297
1076 -2297 -2512 -2585 -2774 -2820 -2855 -2890 -2915 -2941 -2940 -2938 -2802 -2905 -2844 -2783 -2856 -2928 -2949 -2970 -2919 -2868 -2863 -2858 -2817 -2776 -2546 -2316 -2205 -2094 -2123 -2151 -2252 -2352
1068 -2352 -2471 -2590 -2590 -2590 -2577 -2564 -2623 -2682 -2691 -2700 -2673 -2646 -2649 -2651 -2653 -2656 -2605 -2555 -2576 -2596 -2575 -2553 -2532 -2510 -2379 -2248 -2096 -1943 -1708 -1712 -1939 -2166 -2255 -2344
1060 -2344 -2433 -2522 -2515 -2509 -2574 -2639 -2636 -2633 -2630 -2626 -2611 -2595 -2544 -2492 -2476 -2459 -2514 -2569 -2549 -2529 -2437 -2346 -2340 -2335 -2210 -2085 -1943 -1801 -1922 -2042 -2043 -2044 -2080 -2117 -2090 -2063
1052b063O2O3J4J5N0N1P7P7ONJ6J6Q7Q7J0J0o2o2M3M2J14J14K75K75J47r1j87j86q2q2mnJ15
1045a053J15J06J07L4L5P2P2J44J43J63J61J62J62Q9Q8J24J25J48J48K67K67L79L78K59K59
1039B954J22J22N1N0K56K56M23M23O54O54Q30Q30J047J191J601J888K486K629K345K346L010
1034B6168M441O283P523Q660J1426J7758K9489N0904Q8772J40565J63935R3344m9828j53952
1031D45488j54239j02012n8040l2751j9302j2020p918n938m318l041j611J42J955L765M816
1028E4976N184N853P310Q168Q491J0684J5681K3598L4687N2142Q3869J39861K11232K47573
1024I09309J92201L2049j43006k25513k06851j63069j19562p5781m3094k2778j2965j3251
1022A07689j6726j5868j0885o401l221j408q48j134j370l20J706L710N639P452J0289J5917
$$ plain form
1052 -2063 -2001 -1938 -1924 -1909 -1859 -1808 -1731 -1654 -1648 -1643 -1627 -1611 -1524 -1437 -1427 -1417 -1479 -1541 -1498 -1456 -1342 -1228 -953 -678 -531 -622 -809 -995 -1077 -1159 -1163 -1168 -1053
1045 -1053 -938 -832 -725 -691 -656 -584 -512 -368 -225 -62 99 261 423 512 600 724 849 997 1145 1412 1679 2058 2436 2695 2954
1039 2954 3076 3198 3249 3299 3555 3811 4234 4657 5311 5965 6795 7625 8672 9863 11464 13352 15838 18467 20812 23158 26168
1034 26168 30609 36892 44415 53075 64501 82259 111748 162652 251424 391989 555924 649268 599440 445488
1031 445488 291249 189237 131197 98446 79144 67124 59206 53268 48950 45909 44298 44440 46395 50160 54976
1028 54976 60160 66013 73323 81491 89982 100666 116347 139945 174632 226774 310643 450504 661736 909309
1024 909309 1101510 1133559 990553 765040 558189 395120 275558 199777 156683 133905 120940 107689
1022 107689 90963 75095 64210 57809 54588 53180 52332 51198 49828 49508 51214 54924 60563 68015 78304 94221
1018I4221K6329M4738P8671J32373J79728J45484K932j46345j88395j38318q0697m5500k6781
1015G8440j6813j1260q255o783o163n042l850k365j268q83j217k052k052j947j327r78o43
1011E542m68l25m58m58m94l51l16l16l07l08l05l05k96k96k14p1k23p9j63k1N2J93J57L01
1006D71K23Q0O2j77k18k18l23l23k90n2l0l0k3J19K4K3J13l0k47k48q1q1j07L6l6l5r7M6l4
999a483l4J69J70J60J61J89M6j51k94j43j43k33r0p4p5o6o5J12J12opj63j62r2r1r3r3n8n8
992b555j5j5j5j5m7m6K5K5l3l3l3l3ppppl4l5l4l5P9P9J05J06N6q8j17j17j82l9%jL7L6%J
984c001RQQ1Q0OPl0k9j6j6o1Q2JKn2n2m3J00J0J1P3p0K0j24K3K3J4J4K8K7K8K7l0k9l0k9J9
976b919K0J9K0P1P2j%M0M0M0M0K6K7K6K6JJJ20J20m1m2m1m2O0O0j2j2J7J6R7m6M5M5Q4K26
$$ plain form
1018 94221 120550 165288 243959 376332 556060 701544 704476 558131 369736 231418 150721 105221 78440
1015 78440 61627 50367 42112 35329 29166 24124 20274 17909 16641 15758 14541 12489 10437 8490 7163 6185 5542
1011 5542 5074 4749 4291 3833 3339 2988 2672 2356 2049 1741 1436 1131 835 539 325 254 31 -48 -211 -232 -180 13 170 471
1006 471 694 774 836 659 441 223 -100 -423 -713 -765 -795 -825 -848 -729 -705 -682 -569 -599 -846 -1094 -1175 -1256 -1363 -1327 -1363 -1398 -1495 -1449 -1483
999 -1483 -1517 -1348 -1178 -1018 -857 -668 -622 -773 -1067 -1210 -1353 -1586 -1676 -1750 -1825 -1891 -1956 -1844 -1732 -1738 -1745 -1908 -2070 -2162 -2253 -2346 -2439 -2497 -2555
992 -2555 -2570 -2585 -2600 -2615 -2662 -2708 -2683 -2658 -2691 -2724 -2757 -2790 -2797 -2804 -2811 -2818 -2852 -2887 -2921 -2956 -2877 -2798 -2693 -2587 -2531 -2619 -2736 -2853 -3035 -3074 -3074 -3075 -3038 -3002 -3002 -3001
984 -3001 -2992 -2984 -2903 -2823 -2817 -2810 -2840 -2869 -2885 -2901 -2962 -2880 -2879 -2877 -2929 -2981 -3024 -2924 -2914 -2903 -2830 -2900 -2880 -3004 -2981 -2958 -2944 -2930 -2902 -2875 -2847 -2820 -2850 -2879 -2909 -2938 -2919
976 -2919 -2899 -2880 -2860 -2789 -2717 -2718 -2718 -2678 -2638 -2598 -2558 -2532 -2505 -2479 -2453 -2452 -2451 -2331 -2211 -2252 -2294 -2335 -2377 -2317 -2257 -2269 -2281 -2264 -2248 -2151 -2197 -2152 -2107 -2023 -1797
968a797L06M49O48O48K55l65o98o99m01k58j71j71j04j03n9n9o1Q2o1o1m5R8KK41J03J03O1
961b117O1P1L08L15L14N04Q36J189J189O62k45r03j047r72p32n49l10j55j2pok6k7r8r7k9
956a883k9j00j00j1j1K5K5O5O4O5O4J91J91M48N90P52M19m6o66q28n91k95j53M3M3N1N2K5
949a600K5m6m6j56j56j20j20j08j08J1J1j02j03J6J6M3M3M3M3mlmlK5K5K5K5MMJ23J23P3P4
942a927m7m6j0j0j78j77o6o6OOm5m5m5m5L8L8L8L7o7o7l1l2O6O5n3n4J5J6J5J6QRQQn7n8J5
933b722J4P9Q0m0m0l6l6L5L6K1K2N8N7q4q4m8m9ppp9p9J1J2M7M7N2N2Q7Q8Q0Q0RQ%%j%kkQ8
924b253Q8L28O15O68O67N82N82K06k71o52o50p53p53l06l05m4m3J16J17llm7m7K5K5%%L6L6
917b039o0o0N9N9J9J9R1R0P9P8J51J50J02J02j60j61j63j64r3r2J4J4k2k2PPQPp5p4llK7K7
$$ plain form
968 -1797 -1491 -1042 -394 254 509 144 -554 -1253 -1654 -1912 -2083 -2254 -2358 -2461 -2520 -2579 -2640 -2558 -2619 -2680 -2725 -2627 -2625 -2384 -2281 -2178 -2117
961 -2117 -2056 -1985 -1677 -1362 -1048 -544 292 1481 2670 3332 3087 2184 1137 165 -567 -1116 -1426 -1581 -1593 -1600 -1606 -1632 -1659 -1757 -1854 -1883
956 -1883 -1912 -2012 -2112 -2123 -2134 -2109 -2084 -2019 -1955 -1890 -1826 -1635 -1444 -996 -406 346 765 719 53 -775 -1366 -1661 -1814 -1771 -1728 -1677 -1625 -1600
949 -1600 -1575 -1621 -1667 -1823 -1979 -2099 -2219 -2327 -2435 -2424 -2413 -2515 -2618 -2602 -2586 -2543 -2500 -2457 -2414 -2418 -2421 -2425 -2428 -2403 -2378 -2353 -2328 -2324 -2320 -2197 -2074 -2001 -1927
942 -1927 -1974 -2020 -2030 -2040 -2218 -2395 -2461 -2527 -2521 -2515 -2560 -2605 -2650 -2695 -2657 -2619 -2581 -2544 -2611 -2678 -2709 -2741 -2675 -2610 -2663 -2717 -2702 -2686 -2671 -2655 -2647 -2638 -2630 -2622 -2679 -2737 -2722
933 -2722 -2708 -2629 -2549 -2589 -2629 -2665 -2701 -2666 -2630 -2609 -2587 -2529 -2472 -2556 -2640 -2688 -2737 -2744 -2751 -2830 -2909 -2898 -2886 -2839 -2792 -2740 -2688 -2601 -2513 -2433 -2353 -2344 -2336 -2336 -2336 -2337 -2337 -2339 -2341 -2253
924 -2253 -2165 -1837 -1222 -554 113 695 1277 1483 1212 560 -90 -843 -1596 -1902 -2207 -2251 -2294 -2178 -2061 -2064 -2067 -2114 -2161 -2136 -2111 -2111 -2111 -2075 -2039
917 -2039 -2099 -2159 -2100 -2041 -2022 -2003 -1912 -1822 -1743 -1665 -1514 -1364 -1262 -1160 -1320 -1481 -1644 -1808 -1901 -1993 -1979 -1965 -1987 -2009 -2002 -1995 -1987 -1980 -2055 -2129 -2132 -2135 -2108 -2081
910b081m4m5l2l2l3l2k8k8R2R1K26K25J1J1j55j55q4q4l5l6j%M6M6J1J0m4m4m4m4l1l1l0l1
902b435mmm0m0m2m2K9L0M3M3M3M3l1l0l0l0%jr0N4Q3o0K0K1K6j18l7l7M4M4M3M4k6k5k5k6
894b563j6j6O4p9M1M1J12l0R1R2Q3Q2N8N7N7N7m3m3R2j47p4p3qpp8O5k4J19j8j7O3O2J29J28
886a743J29J28Q5Q6Q5Q5J23J22K12O9P0K13P6o7P4p0p0p0k2k3k2k2k8k8l7l7Q2o2J47J47J86
879a82L28J35j98j13K9p2p3P9P7P8P9OOPOK3K2J03l9j85j85p4p5m3m4j24J9o4o5n6n6n1n1
871g53K9j14l0l1L2L2L3L4L3L4kjkkj9k0j9k0p1p1p1p1j7j8j36j37j10j11l9l9k8k9k8k9j8
863a809j8N3N3R6R5K3K3LKKKp4p4J58j27nmr4r4%%%%N7N7j5j5%J%%J27J27J98J98J53J52j10
854h59j10j97j96p7p7p9q0rql7l7Q3Q2kkO9O9N1N1N0N1L0L0l2J10l7K49J27K70K25Q2n8k01
$$ plain form
910 -2081 -2125 -2170 -2202 -2234 -2267 -2299 -2327 -2355 -2263 -2172 -1946 -1721 -1710 -1699 -1854 -2009 -2093 -2177 -2212 -2248 -2249 -2249 -2203 -2157 -2146 -2136 -2180 -2224 -2268 -2312 -2343 -2374 -2404 -2435
902 -2435 -2439 -2443 -2483 -2523 -2565 -2607 -2578 -2548 -2505 -2462 -2419 -2376 -2407 -2437 -2467 -2497 -2497 -2498 -2588 -2534 -2451 -2511 -2491 -2470 -2444 -2562 -2599 -2636 -2592 -2548 -2505 -2461 -2487 -2512 -2537 -2563
894 -2563 -2579 -2595 -2531 -2610 -2569 -2528 -2416 -2446 -2355 -2263 -2180 -2098 -2040 -1983 -1926 -1869 -1912 -1955 -1863 -2010 -2084 -2157 -2165 -2172 -2250 -2185 -2209 -2090 -2108 -2125 -2062 -2000 -1871 -1743
886 -1743 -1614 -1486 -1401 -1315 -1230 -1145 -1022 -900 -688 -619 -549 -336 -260 -327 -253 -323 -393 -463 -485 -508 -530 -552 -580 -608 -645 -682 -600 -662 -515 -368 -182
879 -182 146 281 83 -30 -1 -73 -146 -67 10 88 167 173 179 186 192 215 237 340 301 116 -69 -143 -218 -261 -305 -429 -410 -474 -539 -595 -651 -702 -753
871 -753 -724 -838 -868 -899 -867 -835 -802 -768 -735 -701 -703 -704 -706 -708 -727 -747 -766 -786 -857 -928 -999 -1070 -1087 -1105 -1241 -1378 -1488 -1599 -1638 -1677 -1705 -1734 -1762 -1791 -1809
863 -1809 -1827 -1774 -1721 -1625 -1530 -1507 -1484 -1481 -1479 -1477 -1475 -1549 -1623 -1465 -1592 -1597 -1601 -1695 -1789 -1789 -1789 -1789 -1789 -1732 -1675 -1690 -1705 -1705 -1704 -1704 -1704 -1577 -1450 -1252 -1054 -901 -749 -859
854 -859 -969 -1166 -1362 -1439 -1516 -1595 -1675 -1684 -1692 -1729 -1766 -1683 -1601 -1603 -1605 -1536 -1467 -1416 -1365 -1315 -1264 -1234 -1204 -1236 -1126 -1163 -914 -787 -517 -292 -210 -268 -469
847d69j27j27j36j36m6m7m6m7O5O5ooj6j5q7q6n8n7n8n7K5K4m7m7n0n0M0L9q8J97K04K03L1
839a016L0j84j84j58j59q7q7k4k5j85J01p8p7o0o0QPo3o4K1K2n1n0l4l3L8L8lklkJ4J4n7n8
831b511l5l5l5l5R9R8R9R8j0j0j1j0m0m1L2L1K8K8K9K8MNo7o7kjkkL9L9l3l2K5K5K6K5P0P0
823b081P0P0j4j5J04J05K2K3K3K3J13J12M1M1L5L5L4L5J46J45K94K94J60j27l7J06K29L72
816C58O11J088J454K694O032J7765M0896L6221j0922m5547l2255j0794l794j792q79n94l66
812A76l66k04k03l7l7J69J69k84k84j51j51kkJ63j25q2q2o3o2RJ0M6M7M6M7R0R0J9J8M7M7
805i42J18J19k45k44p8p7l8l7l7l7j10j09l8l8n6n5n6n6m4m5K7K8Q8Q8Q8Q9P2P2P3P2Q1Q1
798a246Q2Q1J0J0J0J0pqqqK3K3K3K3J4J4J5J4l5l5l5l5N4N5N4N5Q3Q2Q3Q3M1M1M1M1m7m6m6
$$ plain form
847 -469 -596 -723 -859 -995 -1041 -1088 -1134 -1181 -1116 -1051 -1057 -1063 -1079 -1094 -1181 -1267 -1325 -1382 -1440 -1497 -1472 -1448 -1495 -1542 -1592 -1642 -1602 -1563 -1651 -1454 -1250 -1047 -1016
839 -1016 -986 -1170 -1354 -1512 -1671 -1758 -1845 -1869 -1894 -2079 -1978 -2056 -2133 -2193 -2253 -2245 -2238 -2301 -2365 -2344 -2322 -2373 -2423 -2457 -2490 -2452 -2414 -2417 -2419 -2422 -2424 -2410 -2396 -2453 -2511
831 -2511 -2546 -2581 -2616 -2651 -2552 -2454 -2355 -2257 -2267 -2277 -2288 -2298 -2338 -2379 -2347 -2316 -2288 -2260 -2231 -2203 -2199 -2194 -2261 -2328 -2330 -2331 -2333 -2335 -2296 -2257 -2290 -2322 -2297 -2272 -2246 -2221 -2151 -2081
823 -2081 -2011 -1941 -1955 -1970 -1866 -1761 -1739 -1716 -1693 -1670 -1557 -1445 -1404 -1363 -1328 -1293 -1259 -1224 -1078 -933 -639 -345 -185 -312 -349 -243 -14 358
816 358 969 2057 3511 6205 12237 30002 70898 107119 96197 50650 18395 7601 3807 2015 1136 542 176
812 176 -190 -394 -597 -634 -671 -502 -333 -617 -901 -1052 -1203 -1205 -1207 -1044 -1169 -1251 -1333 -1396 -1458 -1449 -1439 -1393 -1346 -1300 -1253 -1163 -1073 -1054 -1036 -989 -942
805 -942 -824 -705 -950 -1194 -1272 -1349 -1387 -1424 -1461 -1498 -1608 -1717 -1755 -1793 -1849 -1904 -1960 -2016 -2060 -2105 -2078 -2050 -1962 -1874 -1786 -1697 -1625 -1553 -1480 -1408 -1327 -1246
798 -1246 -1164 -1083 -1073 -1063 -1053 -1043 -1050 -1058 -1066 -1074 -1051 -1028 -1005 -982 -968 -954 -939 -925 -960 -995 -1030 -1065 -1011 -956 -902 -847 -764 -682 -599 -516 -475 -434 -393 -352 -399 -445 -491
789d91m6K4K4K3K4R6R7k4k3Q5Q4Q4Q3J57J58n8n7M5M6L43Q21J077j63j362o93j09j10o7o8
783@p9q1q0q0k2k3k2k2j7j8k6J17J03J04K30K32J64J65OPk32q9j78l5r0q9rj0O4O3n5n5p8
775a35p8p8p8o1o2J0J0l6l6J30J31J22J21K40K41K04K03O1q3p3k17k08k07j28J4k5J15P4P5
769B46J2J2n5n4l7j78k53j09p1p1j5J27l3J10J5J6J77L4K34K35J39lp6p5k74j31k53j09L4
762d06L4Q8Q9Q9Q9M7M8j18j19j51j50j59j60K1j23m2m3l0l0N0N0m0J03J42J41KKj57j56j25
755a014J8J8J8K3J66n8Q5j1J32J41kj42j43p9q0M0M0M0M0J9J9K0J9Q7Q8J59J59j73j73j02
748f46j01lmO9O8M0M0M0M0J71J70MLm4m4K7K8K3K3K3K3q9q9L1L0n9o0J2J2K6K5K6K5MNP6P5
740@M0M0M1M0J58J59Q7Q7nononnM8M8J91r4onRJ0RJ0L5L4L5L5M5M5M5M5K8K7J46J47K03K04
$$ plain form
789 -491 -537 -513 -489 -466 -442 -346 -249 -273 -296 -211 -127 -43 40 197 355 297 240 285 331 674 1495 2572 2409 1047 354 245 135 68 0
783 0 -79 -160 -240 -320 -342 -365 -387 -409 -426 -444 -470 -353 -250 -146 84 316 480 645 651 658 426 337 159 124 34 -55 -64 -74 -10 53 -2 -57 -135
775 -135 -213 -291 -369 -430 -492 -482 -472 -508 -544 -414 -283 -161 -40 200 441 645 848 909 826 753 536 328 121 -7 7 -18 97 171 246
769 246 258 270 215 161 124 -54 -307 -416 -487 -558 -573 -446 -479 -369 -354 -338 -161 -127 107 342 481 478 402 327 53 -78 -331 -440 -406
762 -406 -372 -284 -195 -106 -17 30 78 -40 -159 -310 -460 -619 -779 -758 -881 -923 -966 -996 -1026 -976 -926 -966 -863 -721 -580 -578 -576 -733 -889 -1014
755 -1014 -996 -978 -960 -937 -771 -829 -744 -755 -623 -482 -484 -626 -769 -848 -928 -888 -848 -808 -768 -749 -730 -710 -691 -604 -516 -357 -198 -371 -544 -646
748 -646 -747 -750 -754 -685 -617 -577 -537 -497 -457 -286 -116 -112 -109 -153 -197 -170 -142 -119 -96 -73 -50 -139 -228 -197 -167 -226 -286 -274 -262 -236 -211 -185 -160 -156 -151 -75 0
740 0 40 80 121 161 319 478 565 652 647 641 636 630 625 620 668 716 907 813 807 802 811 821 830 840 875 909 944 979 1024 1069 1114 1159 1187 1214 1360 1507 1710 1914
731A914J33J32J35J35J6J6K9K8K43K43J83J84K55K55L10L11M48M48M66P52P34Q77J054J197
726A0498J591J877K312K789L432M864P142J1054J7014K3596K4518J3357n827k0039k2339j7475
722E8364j1882p590m854l041j980j122n75r8M98R75J724K582L595N026O499Q121J0053J2628
718G8923J3877J3591J3471J5856K0118K5746L4223M4811M8006L1504k631l5539m9416m4741
715B07799l2055k0132j2122q021p055q868j0494r636p370n368l865k243j21K645N785Q934
711I7813J2641J6553J8120J7262J7941K3188L0800L7191M1913M7159M9672M0419J6550j1208
708D56014l4595n1669n8335n0989l6458k3200j4496j0967j1978j4744j5161j3349j1668j0237
705I8168r116p114l975q27K213N169Q106J0109J0979J2220J5513K0187K6864L7451M7870M4721
$$ plain form
731 1914 2047 2179 2314 2449 2465 2481 2510 2538 2781 3024 3207 3391 3646 3901 4211 4522 4970 5418 5884 6636 7370 8247 9301 10498
726 10498 12089 13966 16278 19067 22499 27363 34505 45559 62573 86169 110687 124044 118217 98178 75839 58364
722 58364 46482 38892 34038 30997 29017 27895 27320 27222 27720 28695 30419 33001 36596 41622 48121 56242 66295 78923
718 78923 92800 106391 119862 135718 155836 181582 215805 260616 308622 340126 337495 301956 252540 207799
715 207799 175744 155612 143490 135469 128414 119546 109052 99416 92046 86678 82813 80570 80449 83094 88879 97813
711 97813 110454 127007 145127 162389 180330 203518 234318 271509 313422 360581 410253 450672 467222 456014
708 456014 421419 369750 311415 260426 223968 200768 186272 175305 163327 148583 133422 120073 108405 98168
705 98168 89052 81938 77963 77136 79349 84518 92624 102733 113712 125932 141445 161632 188496 225947 273817 318538
701C18538K7457J0956R46j6701m4338o1030n3096l4305k1106j4524j1078j0028j0191j0335
698G1165r712q854q117o877n253l821k546j497p48q1M68J135J708K757M391P156J1625J9160
694G2059K8994L4812K4047l757k9735l7223k9386j8751j1328o798m210k827k150j816j759
690A0172j760j464j036q57o18m96l53k50k50j70j70j35j36j35j36k9l0k9l0j32j33j32j32
685A559j18j18q3q2l4l4L8L7mnL1L1N1N1J5J6O0O1n8n9O9O8L2L3k0k1N1N1N6N5p9p8J64p5
677A661O0O0R7R7K6K6M1M2P7P7m2m2K9L0J38J38Q8Q8L26Q9N5N6J33J34J4J5L1L0L1L1J44J44
670C924K5K5k0k0k0k0K2K2K2K1LKJ22J22K41K41K76K77J50J50J14J15L2L2l9l9KKP3P4LLM
662E941LO4O4J35J36J4J5J34J34K08K09K80K80L22L22M41M41J93J94j16j17m7m8m8m8J17J16
$$ plain form
701 318538 345995 356951 357897 341196 296858 235828 182732 148427 127321 112797 101719 91691 81500 71165
698 71165 61453 52599 44482 37605 32352 28531 25985 24488 23740 23659 24127 25262 26970 29727 34118 41274 52899 72059
694 72059 101053 135865 159912 156155 126420 89197 59811 41060 29732 22934 18724 15897 13747 11931 10172
690 10172 8412 6948 5912 5055 4437 3941 3588 3338 3088 2918 2748 2613 2477 2342 2206 2177 2147 2118 2088 1956 1823 1691 1559
685 1559 1441 1323 1240 1158 1124 1090 1128 1165 1161 1156 1187 1218 1269 1320 1335 1351 1411 1472 1414 1355 1424 1492 1524 1557 1537 1516 1567 1618 1674 1729 1650 1572 1736 1661
677 1661 1721 1781 1878 1975 2001 2027 2068 2110 2187 2264 2222 2180 2209 2239 2377 2515 2603 2691 3017 3106 3161 3217 3350 3484 3498 3513 3544 3574 3605 3636 3780 3924
670 3924 3949 3974 3954 3934 3914 3894 3916 3938 3960 3981 3984 3986 4108 4230 4471 4712 4988 5265 5415 5565 5679 5794 5826 5858 5819 5780 5782 5784 5857 5931 5934 5937 5941
662 5941 5944 6008 6072 6207 6343 6357 6372 6506 6640 6848 7057 7337 7617 7939 8261 8702 9143 9336 9530 9414 9297 9250 9202 9154 9106 9223 9339
656I339J16J17J34J34K06K06K32K32J12J13J78J79K97K97L15L14M34M34M88M89M89M89K40
651A5584K40P3P3K8K8K8K9J58J59J55M42P42N98M73mJ77L20M25M25L16L15M35M35M75M74M65
645B3068M65N45M01L80R4J18J18O4L51M19k49r34j077p22n79o15l28m54m54l52o6lk89n45
639A9356q32n74n73l29l30j70j71j70j71o0o0n1n2M8J91Q74J159m04k025j724j057n75m33
634A1867l69j32k26J07N36K03j88q07p86m53k44k43k32k32o1k04j23j24j6j6J24J25M21P55
629I682L95l21q80n46l58k15k10k11j93j93K9J73L2k06l95o0J34j05k21k22j58j6j6j60JK
623E762j%P1P2J06J06J16J15J52K96L94P28J417K323J376j153k489j678n97k62N8N8L1J74
617G175N06J031L94o09r67p29l48k04j03J35J21J20J94N0K03L45N10J034J946M092N049M23
$$ plain form
656 9339 9455 9572 9706 9840 10046 10252 10484 10716 10828 10941 11119 11298 11595 11892 12207 12521 12955 13389 13877 14366 14855 15344 15584
651 15584 15824 15897 15970 15998 16026 16054 16083 16241 16400 16555 16997 17739 18337 18810 18806 18983 19303 19728 20153 20469 20784 21219 21654 22129 22603 23068
645 23068 23533 24078 24479 24859 24953 25071 25189 25253 25604 26023 25774 24840 23763 23041 22462 21847 21519 21065 20611 20259 20193 20190 19901 19356
639 19356 18524 17950 17377 17048 16718 16548 16377 16207 16036 15976 15916 15865 15813 15861 16052 16926 18085 17681 15656 13932 12875 12300 11867
634 11867 11498 11366 11140 11247 11783 11986 11798 10991 10205 9752 9508 9265 9033 8801 8740 8536 8413 8289 8273 8257 8381 8506 8927 9682
629 9682 10077 9756 8876 8330 7972 7757 7547 7336 7143 6950 6979 7152 7184 6978 6583 6523 6657 6552 6331 6109 5951 5935 5919 5759 5760 5762
623 5762 5761 5761 5832 5904 6010 6116 6232 6347 6499 6795 7189 7917 9334 11657 13033 11880 9391 7713 7116 6854 6912 6970 7001 7175
617 7175 7681 8712 9106 8497 7530 6801 6453 6249 6146 6281 6402 6522 6716 6766 6969 7314 7824 8858 10804 14896 19945 20368
612B0368m429m573k105q17k75J55K54M92J220K412K048j94k092k092r50m25k53j09P5P5J56
607H941J56J66J66L87N30P89J409K307J495p13k335j533o75l53o7K62K61N31J009J313M54
603A4500n56j034m43L4j20j19l23l6O0O1PPm6m5m5m5J96J96L63L63M07M08M07M07M95M95O14
596A6208R01R61J248J230J230J158M91n53j220j306o37j2M65N25N25P40P39R65J251J590K068
592B8567K559L036L716M765O227P086O394L818J211l0K51K51J6o51q71q72n23n23l20L48J339
587F5794J815K150K817L470M329N008O248P716Q955R850J0326J0419J1087J1248Q863O288
583A76383O287N304K538R6j143j298o31J012L397O628J0730K0882N0547J21216R9372m3461
580D57859j49434q3760k9487j1108l190J471N001Q026J1174J3916J6110J9410J6643R705M649
$$ plain form
612 20368 15939 11366 9261 8444 8169 8324 8578 9070 10290 12702 14750 14556 12464 10372 9422 8997 8744 8635 8710 8785 8941
607 8941 9097 9263 9429 9816 10346 11135 12544 14851 16346 15633 13298 11765 11090 10737 10670 10932 11193 11724 12733 14046 14500
603 14500 13944 12910 12467 12501 12381 12262 11939 11903 11963 12024 12031 12038 11992 11947 11902 11857 12053 12249 12612 12975 13382 13790 14197 14604 15099 15594 16208
596 16208 17109 18070 19318 20548 21778 22936 23427 22874 21654 20348 19711 19699 20164 20689 21214 21954 22693 23658 24909 26499 28567
592 28567 31126 34162 37878 42643 48870 55956 62350 66168 67379 67349 67600 67851 67867 67216 66345 65473 64950 64427 64107 64455 65794
587 65794 67609 69759 72576 76046 80375 85383 91631 99347 108302 118152 128478 138897 149984 161232 170095 176383
583 176383 182670 187974 190512 190608 189465 188167 187536 188548 191945 198573 209303 230185 280732 401948 501320 457859
580 457859 308425 224665 195178 184070 180880 182351 187352 195378 206552 220468 236578 255988 272631 282336 286985
576B86985N838M979L108K058J689l14l533n728l176L597J7964N1444J47070K86237Q3222j95779
572F85661k70509j05971m0882k0184j2690r160o598l449J72J602K319K985N66k392j819J710
569B21361M945Q282J1359J2599J0232N940L222K935N927J4989L9407J01884J16765j5535j37436
565D06876j05101n0134l5922k9447k2485j6013j0958p333m758l541k491j037K03J243K483
562A21585L509M558N523O572O608N177K754P51p75j634k086j608k38J957L736P456J6386L1362
558B11593N6230J06878K20232M10525L67151n0730m43322l93054j84586q4908m3380k3444
555A49185j2935o734k361M04R91Q48J983M178N706P137Q866J1442J5468K0904K4017K6783
551B55882L5165N5100Q8187J51999K92411O09375Q96376L59265m85738r72488n65348k52582
$$ plain form
576 286985 292823 297802 300910 302968 304657 304343 300810 295082 291906 295503 313467 364911 511981 798218 881440 685661
572 685661 415152 309181 268299 248115 235425 226265 219667 216218 216390 217992 220311 223296 223862 221470 219651 221361
569 221361 226306 234588 245947 258546 268778 274718 277940 280875 286802 301791 341198 443082 559847 544312 406876
565 406876 301775 251641 215719 186272 163787 147774 136816 129483 124725 121184 118693 117656 117859 119102 121585
562 121585 125094 129652 135175 141747 148355 153532 156286 157037 156262 154628 152542 150934 150696 152653 156389 163845 180231 211593
558 211593 267823 374701 594933 1005458 1372609 1321879 878557 485503 300917 216009 172629 149185
555 149185 136250 129516 127155 127559 128550 129398 131381 135559 141265 148402 157268 168710 184178 205082 229099 255882
551 255882 291047 346147 434334 586333 878744 1488119 2384495 2743760 2258022 1285534 720186 467604
549D67604j22279o4953l6480k1314j0943l600j071k121j627K093N229O660P679Q728R956J1197
545B54758J2206J2492J4328K0338L2186N4029R9934K03235L83340L62833l1548m22148l95736
542F00247j88083q4197m0797k0295r899l793J17K016P76q34n48N71J620K836M076N093N569
538B74475N665M806L991L513L657M133N538O777O682M679K716J857J047p66l322n134m824
534C15490l584j626mJ689L501N309P503R602J1413J1920J1443J0191P997N919M680M596N836
530D11875P647R651J1177J2226J2500J1642R507P314N901O187P263P931Q386Q530Q813Q146
527E54696O947M945L025J213K38m29n88m45L21K132L924N545O928Q741J0583J2586J3967J3967
523F48296J1779P677K813j289m079n128m325j559J815M391M319K507J279K518M794P559J0218
$$ plain form
549 467604 345325 280372 243892 222578 211635 208035 206964 204843 203216 205309 210538 217198 224877 233605 243561 254758
545 254758 266964 279456 293784 314122 346308 400337 500271 703506 1086846 1449679 1418131 995983 600247
542 600247 412164 327967 287170 266875 256976 253183 253300 255316 256092 255258 254710 255281 256901 259737 263813 268906 274475
538 274475 280140 284946 288937 292450 296107 300240 305778 312555 319237 323916 326632 328489 329536 328770 325448 320314 315490
534 315490 311906 310280 310276 311965 315466 320775 328278 337880 349293 361213 372656 382847 390844 396763 401443 406039 411875
530 411875 419522 429173 440350 452576 465076 476718 486225 493539 499440 505627 512890 520821 529207 537737 546550 554696
527 554696 561643 566588 569613 570826 571064 570635 570047 569602 569923 572055 575979 581524 588452 597193 607776 620362 634329 648296
523 648296 660075 667752 670565 669276 665197 660069 655744 654185 656000 660391 664710 667217 668496 671014 675808 683367 693585
519F93585J2793J5694J8460K1083K3277K3898K2085J8198J4288J3122J5888K0156K4449K6468
515I63444K7517K6778K3630K0530J9481K0017K1066K3410K6366K9979L4081L8263M2173M5321
512A362056M7706M9759N2334N5756N9857O3109O4538O4206O4872O9676P9120R1829J07568
509B232386J27457J51971J66302J84330K17228K62344L07021L53854M02042M52500N08181
507E365616N74092O54959P53490Q66666R77025J043317J003543Q08409M51574q7867p06248
504A1704576j150170j321576j288555j150342r82346q22766o83285n66630m69802l87104l03493
502B578507k43305k26541k24538j87338j55193j32110j14083r9479q7557p7791o9875o3101
499H97596n7283n2467m7983m3848m0320l6850l4083l1290k8524k6116k3921k1787j9594j7435
$$ plain form
519 693585 706378 722072 740532 761615 784892 808790 830875 849073 863361 876483 892371 912527 936976 963444
515 963444 990961 1017739 1041369 1061899 1081380 1101397 1122463 1145873 1172239 1202218 1236299 1274562 1316735 1362056
512 1362056 1409762 1459521 1511855 1567611 1627468 1690577 1755115 1819321 1884193 1953869 2032989 2124818 2232386
509 2232386 2359843 2511814 2678116 2862446 3079674 3342018 3649039 4002893 4404935 4857435 5365616
507 5365616 5939708 6594667 7348157 8214823 9191848 10235165 11238708 12047117 12498691 12410824 11704576
504 11704576 10554406 9232830 7944275 6793933 5811587 4988821 4305536 3738906 3269104 2882000 2578507
502 2578507 2335202 2108661 1884123 1696785 1541592 1409482 1295399 1195920 1108363 1030572 960697 897596
499 897596 840313 787846 739863 696015 655695 618845 584762 553472 524948 498832 474911 453124 433530 416095
496D16095j5433j4265j3217j1058m096M48j2048k5271k0788j4927j2925j1338r145p255p732
492B37045r777r776q340o718n818n150m632m345m167m643n569o237o177n891n077m409m422
489A35897n089n135m467l776l299k822k535k315k316j798l68K517K517k424p099o270m076
485H7142l132k656k301k157j806j520j297j296j189r03r15o28o29o28m06O45K388K531q33
480G0410m554n034l222j588L4K322L180J29l974m525k903j627j151p29m42k19p6K02O78Q90
476D7801Q90P03n37j438k105j464o05J135M283Q998P568k292j0209q186m084j377N4r90k612
471C5533k653j604r48r48p81m95n18n17m29m28l78l77k59k58j70j71M1J85L60Q37J460K891
466C0373M106K485j628m204l491k061j199r13o38m96k96k96j74j73j74j74k41k42k41k42j54
$$ plain form
496 416095 400662 386397 373180 362122 358026 358474 346426 321155 300367 285440 272515 261177 252032 244777 237045
492 237045 227268 217492 209152 202434 196616 191466 186834 182489 178322 173679 168110 161873 155696 149805 144728 140319 135897
489 135897 130808 125673 121206 117430 114131 111309 108774 106459 104143 102345 101977 104494 107011 104587 97488 91218 87142
485 87142 84010 81354 79053 76896 75090 73570 72273 70977 69788 68885 67970 67342 66713 66085 65679 66324 68712 71243 70410
480 70410 65856 60822 57600 56012 56046 58368 61548 61677 57703 53178 50275 48648 47497 46768 46326 46107 46031 46233 46911 47801
476 47801 48691 49394 48857 47419 45314 43850 43245 44380 48663 57661 65229 62937 52728 44542 40458 39081 39135 38145 35533
471 35533 32880 31276 30328 29380 28599 28104 27586 27069 26640 26212 25834 25457 25198 24940 24770 24599 24640 24825 25185 26022 27482 30373
466 30373 34479 36964 35336 31132 27641 25580 24381 23468 22830 22334 22038 21742 21568 21395 21221 21047 20806 20564 20323 20081 19927
462A9927j53O1O1J70J69J70J70L1L1m0m0K6K6R8R8K3K4J4J5L4j08j09L4J26J25J5J6j5j5j6
455B0968j5J60J59K70K69K77J33K85K85L39L39N00L57N25O69M35q8m24j86m3m2J19J19J19
449B5529J19J72J71N2N2jjJ18J18N3N3J33j0R4R5Q5Q5J69J69J81M19O30J058L55q37j283r49
443B6829n04l62k36k35k27k26l55l54l55l55l18l18l90l90l90l90l27l27k83m25l36l36j88
438A9202m5j17k60R4R4j74o04o14o14l45m89l26l25k55l97l97l97l34l35l19l19l19l19l72
432A1714l71l80k37k72k72j92j92j53j53k24k24k09k09lk41k68k67k11k11j48j47j12j11j89
427F718j88j98n4j28j28j18j19j42j41p0o9o4o3J8J7N6J99J10K52M30M30J62J8r2r1N7N7p2
420F787k14l02l01k06k05l9l9o8o7J3J2r4M9L9M0J84J85K68O01J174K080K450O85j744j982
$$ plain form
462 19927 19774 19835 19896 20066 20235 20405 20575 20606 20637 20597 20557 20583 20609 20707 20805 20828 20852 20866 20881 20915 20807 20698 20732 20858 20983 20998 21014 20999 20984 20968
455 20968 20953 21113 21272 21542 21811 22088 22221 22506 22791 23130 23469 23969 24326 24851 25520 25955 25867 25443 25257 25214 25172 25291 25410 25529
449 25529 25648 25820 25991 26043 26095 26094 26093 26211 26329 26382 26435 26568 26558 26652 26747 26832 26917 27086 27255 27436 27855 28485 29543 29898 29061 27778 26829
443 26829 26325 25963 25727 25492 25265 25039 24684 24330 23975 23620 23302 22984 22594 22204 21814 21424 21097 20770 20487 20062 19726 19390 19202
438 19202 19157 19040 18780 18874 18968 18794 18190 17576 16962 16617 16128 15802 15477 15222 14825 14428 14031 13697 13362 13043 12724 12405 12086 11714
432 11714 11343 10963 10726 10454 10182 9990 9798 9645 9492 9268 9044 8835 8626 8623 8382 8114 7847 7636 7425 7277 7130 7018 6907 6718
427 6718 6530 6332 6278 6150 6022 5904 5785 5643 5502 5432 5363 5299 5236 5254 5271 5327 5526 5636 5888 6318 6748 6910 6928 6836 6745 6802 6859 6787
420 6787 6573 6271 5970 5764 5559 5520 5481 5413 5346 5359 5371 5277 5326 5365 5405 5589 5774 6042 6643 7817 9897 12347 13032 11288 9306
415I306r57M5Q44L19p30j350j193o68m06m06j38j38K9L0ppr3r3O8j70r9r9L5J78K98K97L19
408E214P9j58l02k64k63L7J80N1j88l54l55k49k49k48k49j99j99j60j7n9n9nnj32J2N1N1l1
402A930l2N6N5j05J35J67J67O7O7JJ44R6L35K93N4k15m54k01n7k7k7r0q9r9r9r8r9J0J0J1
395A906J0j03j02j02j03k2k3k3k2J1J1M6M7J16J16llk8k8M4M4o6o5o5o5k6k6M5M6J30J31N8
388A886N9l0l1j02j02J4J4Q6Q5N2N2j9k0O1O1L02L02J89j44l63l62p6p5mmO0O0R6R6O8O9L2
381B312L3R9J00O4O4J05J06K25K24J78J77L92L92N8N9j09j09p0p0J45J44K22K21PPL4L5kj
374E042M9M8K16K16L61L62L62L61L01L00L72L72N48N47P85J263J087M19L7L24Q69J155Q54
369A6250N68N18L74j6l03l19J59N45Q32R33R33J184J184J422J709K049K526K981L459M412
$$ plain form
415 9306 8349 8394 9238 9557 8827 7477 6284 5616 5210 4804 4666 4528 4557 4587 4580 4573 4480 4387 4455 4285 4186 4087 4122 4300 4598 4895 5214
408 5214 5293 5135 4833 4569 4306 4343 4523 4574 4386 4032 3677 3428 3179 2931 2682 2483 2284 2124 2107 2048 1989 1984 1979 1847 1859 1910 1961 1930
402 1930 1898 1954 2009 1904 2039 2206 2373 2440 2507 2508 2652 2748 3083 3376 3430 3215 2761 2560 2503 2476 2449 2359 2270 2171 2072 1974 1875 1885 1895 1906
395 1906 1916 1813 1711 1609 1506 1484 1461 1438 1416 1427 1438 1484 1531 1647 1763 1760 1757 1729 1701 1745 1789 1723 1658 1593 1528 1502 1476 1521 1567 1697 1828 1886
388 1886 1945 1915 1884 1782 1680 1694 1708 1794 1879 1931 1983 1964 1944 2005 2066 2368 2670 2859 2715 2352 1990 1914 1839 1835 1831 1891 1951 2047 2143 2211 2280 2312
381 2312 2345 2444 2544 2608 2672 2777 2883 3108 3332 3510 3687 4079 4471 4529 4588 4479 4370 4300 4230 4375 4519 4741 4962 4969 4976 5010 5045 5043 5042
374 5042 5091 5139 5355 5571 5932 6294 6656 7017 7318 7618 7990 8362 8910 9457 10242 11505 12592 13011 13048 13372 14241 15396 16250
369 16250 16818 17336 17710 17694 17391 17072 17231 17776 18608 19541 20474 21658 22842 24264 25973 28022 30548 33529 36988 41400
364D1400N462O644P311O883P168Q522J0334J2802J7094K3992L5343N2392P6526J01870J04828
361E18571O1439q287n4773n8874m5783l4051k5589j9197j5692j5406j6035j5749j4175j1408
357B44991q324n176j635K467O172P411Q759J2669J9370K8623M4004P2714J29430K47421M52618
354A261514M85335Q2161l99437m95251k97327j68041j03275o7398m5364l0284j7980j0445
351A94208r586j3294j4153j1626o570k531M26K917N303P197Q818J1334J5436K1937L2334M9694
348B91844P6879J14396J41390J00732j1536j18745j49554j25613q8318n7711l7776k5424j7697
345I2867j2031p548m769m484o125o984o459n410m235l186k319j842j659j421j116p83n38n39
341B1419k8J14l71q01q84n50m73r02j221j221j132q93p50o07m22m22n65m22l23l23k43k42
$$ plain form
364 41400 46862 53506 60817 67700 74868 83390 93724 106526 123620 147612 182955 235347 311873 413743 518571
361 518571 580010 571723 516950 458076 412293 378242 352653 333456 317764 302358 286323 270574 256399 244991
357 244991 236667 231491 229856 232323 238495 245906 254665 267334 286704 315327 359331 432045 561475 808896 1261514
354 1261514 1746849 1829010 1429573 934322 636995 468954 365679 298281 252917 222633 204653 194208
351 194208 184622 171328 157175 145549 138979 136448 136874 139791 145094 152291 161109 172443 187879 209816 242150 291844
348 291844 368723 483119 624509 725241 713705 594960 445406 319793 231475 173764 135988 110564 92867
345 92867 80836 73288 68519 64035 57910 50926 44467 39057 34822 31636 29317 27475 25816 24395 23279 22496 21958 21419
341 21419 21391 21505 21134 20333 19449 18899 18426 17524 16303 15082 13950 13057 12307 11700 11278 10856 10291 9869 9546 9223 8980 8738
336H738j25j25k05o2O3O3O3K06K56K55L69L68M23J85l61o95m80k41o6o6l58p88p52p51n17
330E397l73l19j77j01j01L6L5o5P8O8O9J11J12K21K22K16P2r7m31l31r3K11L54L46K02j38
324E524n66r12n77l39l39p5p5j20j20K7j17jjRQl6J06J87J86K31Q7o2k06l01l02k78k79k31
317A428q8r4N0j29J4J4J57J95J96O2q2j26J7J84M1k1k1j59P9M55O94J079J079O06J76l49r68
311D489j362j029p42m08k02o0Q2Q3R1R1J33J33J4k24k38r5k3k4j74j75j03j03o7o7o7o7L4
305h0L4L4L4p6p6nmp6p6M3M3M3M2PPJ1J1J1J1K2K2K1K2N6N7J28J27K40K40O27P70P73K49k97
297B995m39l83l83k73k73j77j76j05j06j28j28r2r3LLLMM0M0Q5Q6J58L02L23O57J224K416
291E583L280J039k239l145k061j058o09l70k27k26m5m6j17j17j75j75M0L9L6L5L6L6M3M3J15
$$ plain form
336 8738 8613 8488 8283 8221 8284 8347 8410 8616 8872 9127 9496 9864 10287 10472 10111 9416 8936 8695 8629 8563 8205 7417 6665 5914 5397
330 5397 5024 4705 4528 4427 4326 4362 4397 4332 4410 4478 4547 4658 4770 4991 5213 5429 5501 5404 4973 4642 4549 4760 5114 5460 5662 5524
324 5524 4958 4046 3469 3130 2791 2716 2641 2521 2401 2428 2311 2310 2309 2318 2326 2290 2396 2583 2769 3000 3087 3025 2819 2518 2216 1938 1659 1428
317 1428 1340 1246 1296 1167 1181 1195 1352 1547 1743 1805 1723 1597 1614 1798 1839 1818 1797 1638 1717 2172 2866 3945 5024 5630 5806 5457 4489
311 4489 3127 2098 1356 948 746 686 768 851 942 1033 1166 1299 1313 1089 851 756 733 709 535 360 257 154 87 20 -47 -114 -80
305 -80 -46 -12 22 -54 -130 -135 -139 -215 -291 -248 -205 -162 -120 -113 -106 -95 -84 -73 -62 -40 -18 3 25 81 138 266 393 633 873 1500 2270 3043 3292 2995
297 2995 2556 2173 1790 1517 1244 1067 891 786 680 552 424 332 239 242 245 248 252 292 332 417 503 661 963 1286 1943 3167 5583
291 5583 8863 9902 7663 4518 2457 1399 790 420 193 -33 -78 -124 -241 -358 -533 -708 -668 -629 -593 -558 -522 -486 -443 -400 -285
285b85J14J68J67M39M38R82J125M12o85j199r61m95l51k63j20p2p3n8n8R4m9p3p3j17j18j1
279a122j0m7m6Q7Q6J6J5PPk9k9M8M7M8M8K0K0o1o1Q9n4r0N4onMMj09j09l7l8M6M5k7k6L4L4
271a147K5K4J07l7QQk2k3j03j03R3n0n0n0R1n2qpj7j7l4J08J06l6O1q1L7L7K0J9J12l1M9N0
263i13O4O5J99K00J76M14N79R13R32O93J68j65m46k07p0l09l96n40n45n46l12l13j46j46j60
258h11j60q8q8J9J9K8j15m4m5p2P1K9j14J1J1r6r6k4k5M6M6k6k6j3j2K3K3l8l7L4L4o8o8M
250a668LK1K2K1K1O7O6O7O6l9l8llj21j20m9m9J3J3k3k3mmL2L1k0k1k1k0j9j9k0j9L5L4L5
242a756L4j%j%K2K1K2K2r2r2k0k0L2L3O9O8k5k4k5k5j6j6n1n2n8n9J3J3J2J2J2J2mmmmkkj
232a957kppK8K9jjp2p2j5j5N6N7J2J3n9n9rqK7K8p0p1p0p0o7o8NMjjP1P0L7L7%JnnL1L1k0
$$ plain form
285 -285 -171 -3 164 603 1041 2023 3148 3560 2875 1676 715 220 -131 -394 -514 -586 -659 -717 -775 -681 -730 -803 -876 -993 -1111 -1122
279 -1122 -1132 -1179 -1225 -1138 -1052 -1036 -1021 -1014 -1007 -1036 -1065 -1017 -970 -922 -874 -854 -834 -895 -956 -867 -921 -1011 -957 -963 -968 -964 -960 -1069 -1178 -1215 -1253 -1207 -1162 -1189 -1215 -1181 -1147
271 -1147 -1122 -1098 -991 -1028 -1020 -1012 -1034 -1057 -1160 -1263 -1170 -1220 -1270 -1320 -1229 -1281 -1289 -1296 -1313 -1330 -1364 -1256 -1150 -1186 -1125 -1206 -1169 -1132 -1112 -1093 -981 -1012 -963 -913
263 -913 -849 -784 -585 -385 -209 205 784 1697 2629 3322 3490 3325 2879 2672 2602 2293 1897 1357 812 266 -46 -359 -505 -651 -811
258 -811 -971 -1059 -1147 -1128 -1109 -1081 -1196 -1240 -1285 -1357 -1286 -1257 -1371 -1360 -1349 -1445 -1541 -1565 -1590 -1544 -1498 -1524 -1550 -1563 -1575 -1552 -1529 -1567 -1604 -1570 -1536 -1604 -1672 -1668
250 -1668 -1665 -1644 -1622 -1601 -1580 -1513 -1447 -1380 -1314 -1353 -1391 -1394 -1397 -1518 -1638 -1687 -1736 -1723 -1710 -1733 -1756 -1760 -1764 -1732 -1701 -1721 -1742 -1763 -1783 -1802 -1821 -1841 -1860 -1825 -1791 -1756
242 -1756 -1722 -1723 -1723 -1724 -1724 -1702 -1681 -1659 -1637 -1729 -1821 -1841 -1861 -1829 -1796 -1727 -1659 -1684 -1708 -1733 -1758 -1774 -1790 -1841 -1893 -1951 -2010 -1997 -1984 -1972 -1960 -1948 -1936 -1940 -1944 -1948 -1952 -1954 -1956 -1957
232 -1957 -1959 -1966 -1973 -1945 -1916 -1917 -1918 -1990 -2062 -2077 -2092 -2036 -1979 -1967 -1954 -2013 -2072 -2081 -2089 -2062 -2034 -2104 -2175 -2245 -2315 -2382 -2450 -2445 -2441 -2442 -2443 -2372 -2302 -2265 -2228 -2228 -2227 -2232 -2237 -2206 -2175 -2195
223b195j9J00J00N3N3N3N3L1L1L1L1m9m9K3K2k5k5J0J0n5n5j9k0j8j7j8j8j6j5j6j6J7J7J7
215a993J7JJJJj7j6J8J9j1j2O0O0J2J2J3J2ONOOnmm1m0L4L3q6q5r7r6k5k4j0rO3O2l2l2MM
206b185n4n3n4n3J7J7j44J43POK5K5R2R2K1K1j1j0m6m7L6L5%%nnO7O7k4k4k4k4o6o6NNj7j7
197b248J9J9NMP6P7J2J2J2J1j1j1K5K5q5q4Q3Q3rrrrj4j4j5j4j4j5j4j4L0L0L0L0J0J0J0J0
188a966J2J2k3k3L7L7l5l5ppppj1j1j2j1kkkkJ6J6J6J6nnmnK6K5K5K5j6j7j6j6J3J4J3J3%
179a931%%%k9l0l0l0MLMMk7k6k6k6l7l6l7l6ppppj6j6j6j7J6J6J6J6RQM5M4n7n8J4J4k6k6
169b348k6k6k2k2k2k1k9k9k9k8L6L7L7L7JKJKK0J9J9K0K3K3K4K3kjL4L5K7K8m4m4L9L9l3l2
161b232l2l2l1l2Q6Q7J4J5l6l5L5L6qrrrj5j4j5j5j5j4j5j5J8J7J8J7L6L5L6L5k8k8k9k8j0
$$ plain form
223 -2195 -2214 -2114 -2014 -1961 -1908 -1855 -1802 -1771 -1740 -1709 -1678 -1727 -1776 -1753 -1731 -1756 -1781 -1771 -1761 -1816 -1871 -1890 -1910 -1928 -1945 -1963 -1981 -1997 -2012 -2028 -2044 -2027 -2010 -1993
215 -1993 -1976 -1975 -1974 -1973 -1972 -1989 -2005 -1987 -1968 -1979 -1991 -1931 -1871 -1859 -1847 -1834 -1822 -1816 -1811 -1805 -1799 -1804 -1808 -1849 -1889 -1855 -1822 -1908 -1993 -2090 -2186 -2211 -2235 -2245 -2254 -2191 -2129 -2161 -2193 -2189 -2185
206 -2185 -2239 -2292 -2346 -2399 -2382 -2365 -2509 -2366 -2359 -2353 -2328 -2303 -2211 -2119 -2098 -2077 -2088 -2098 -2144 -2191 -2155 -2120 -2120 -2120 -2125 -2130 -2063 -1996 -2020 -2044 -2068 -2092 -2158 -2224 -2219 -2214 -2231 -2248
197 -2248 -2229 -2210 -2205 -2201 -2125 -2048 -2036 -2024 -2012 -2001 -2012 -2023 -1998 -1973 -2058 -2142 -2059 -1976 -1985 -1994 -2003 -2012 -2026 -2040 -2055 -2069 -2083 -2098 -2112 -2126 -2096 -2066 -2036 -2006 -1996 -1986 -1976 -1966
188 -1966 -1954 -1942 -1965 -1988 -1951 -1914 -1949 -1984 -1991 -1998 -2005 -2012 -2023 -2034 -2046 -2057 -2059 -2061 -2063 -2065 -2049 -2033 -2017 -2001 -2006 -2011 -2015 -2020 -1994 -1969 -1944 -1919 -1935 -1952 -1968 -1984 -1971 -1957 -1944 -1931 -1931
179 -1931 -1931 -1931 -1931 -1960 -1990 -2020 -2050 -2046 -2043 -2039 -2035 -2062 -2088 -2114 -2140 -2177 -2213 -2250 -2286 -2293 -2300 -2307 -2314 -2330 -2346 -2362 -2379 -2363 -2347 -2331 -2315 -2306 -2298 -2253 -2209 -2266 -2324 -2310 -2296 -2322 -2348
169 -2348 -2374 -2400 -2422 -2444 -2466 -2487 -2516 -2545 -2574 -2602 -2566 -2529 -2492 -2455 -2454 -2452 -2451 -2449 -2429 -2410 -2391 -2371 -2348 -2325 -2301 -2278 -2280 -2281 -2247 -2212 -2185 -2157 -2201 -2245 -2206 -2167 -2200 -2232
161 -2232 -2264 -2296 -2327 -2359 -2273 -2186 -2172 -2157 -2193 -2228 -2193 -2157 -2165 -2174 -2183 -2192 -2207 -2221 -2236 -2251 -2266 -2280 -2295 -2310 -2292 -2275 -2257 -2240 -2204 -2169 -2133 -2098 -2126 -2154 -2183 -2211 -2221
152b221j1j0j1M0M0L9M0j4j4j4j4L0L0L0L0K4K5j00J38q4O0m2m2P1P2j%l8l8klmnnmP2P3m7
144a910m7LKLKj8j8j8j8p1p2p2p1J9J9J9J9J9J9J9J9jjjjJJJJl1l2MNj0j0M9N0k3k3n9n9J
134b291Jn9n9%%L5L6l9l9M4M5M0M1j9j9K2K2j3j4j7j6j7j7K7K6O3O2M0M1M0M0M1M2NNJ1J1
126a879m9m9J2J2m7m8L6L6k3k4POOOk3k2k3k3l9l8l9l8j2j2K3K4j0j0N0N0n3n2j7j6J0J1J1
117b246J1m3m3qpk6k5k5k5MML9M0l6l6l7l6K0K0j7j6K2K2j4j4K8K8qrQ6Q6k1k2nom1m2m7m8
108b493m8m8N8N8K2K2M1M1NOK6K6l4l3J1J2J2J2N9N8jjk9k9l0k9n0n1RRrj0m5m5N5N5k9k8
99b445N4N5N4N4K0K0m0m0m5m5O2O2n2n3PQLMLMj6j6O7O8k5k5k4k5P2P3J3J2RQM4M4l4l5l5
91b135l5N5N4nnm3m3m3m3k5k5J0J1J9J9K0J9k0k1k0k0MNNNj4j3L8L7j35J04Q6n8K0K0J1J1
$$ plain form
152 -2221 -2232 -2242 -2253 -2213 -2173 -2134 -2094 -2108 -2122 -2136 -2150 -2120 -2090 -2060 -2030 -2006 -1981 -2081 -1943 -2027 -1967 -2009 -2051 -1980 -1908 -1909 -1909 -1947 -1985 -1987 -1990 -1994 -1999 -2004 -2008 -1936 -1863 -1910
144 -1910 -1957 -1954 -1952 -1949 -1947 -1965 -1983 -2001 -2019 -2090 -2162 -2234 -2305 -2286 -2267 -2248 -2229 -2210 -2191 -2172 -2153 -2154 -2155 -2156 -2157 -2156 -2155 -2154 -2153 -2184 -2216 -2212 -2207 -2217 -2227 -2178 -2128 -2151 -2174 -2233 -2292 -2291
134 -2291 -2290 -2349 -2408 -2408 -2408 -2373 -2337 -2376 -2415 -2371 -2326 -2286 -2245 -2264 -2283 -2261 -2239 -2252 -2266 -2283 -2299 -2316 -2333 -2306 -2280 -2217 -2155 -2115 -2074 -2034 -1994 -1953 -1911 -1906 -1901 -1890 -1879
126 -1879 -1928 -1977 -1965 -1953 -2000 -2048 -2012 -1976 -1999 -2023 -2016 -2010 -2004 -1998 -2021 -2043 -2066 -2089 -2128 -2166 -2205 -2243 -2255 -2267 -2244 -2220 -2230 -2240 -2190 -2140 -2193 -2245 -2262 -2278 -2268 -2257 -2246
117 -2246 -2235 -2278 -2321 -2329 -2336 -2362 -2387 -2412 -2437 -2433 -2429 -2390 -2350 -2386 -2422 -2459 -2495 -2475 -2455 -2472 -2488 -2466 -2444 -2458 -2472 -2444 -2416 -2424 -2433 -2347 -2261 -2282 -2304 -2309 -2315 -2356 -2398 -2445 -2493
108 -2493 -2541 -2589 -2531 -2473 -2451 -2429 -2388 -2347 -2342 -2336 -2310 -2284 -2318 -2351 -2340 -2328 -2316 -2304 -2245 -2187 -2188 -2189 -2218 -2247 -2277 -2306 -2356 -2407 -2398 -2389 -2398 -2408 -2453 -2498 -2443 -2388 -2417 -2445
99 -2445 -2391 -2336 -2282 -2228 -2208 -2188 -2228 -2268 -2313 -2358 -2296 -2234 -2286 -2339 -2332 -2324 -2321 -2317 -2314 -2310 -2326 -2342 -2275 -2207 -2232 -2257 -2281 -2306 -2234 -2161 -2148 -2136 -2127 -2119 -2075 -2031 -2065 -2100 -2135
91 -2135 -2170 -2115 -2061 -2066 -2071 -2114 -2157 -2200 -2243 -2268 -2293 -2283 -2272 -2253 -2234 -2214 -2195 -2215 -2236 -2256 -2276 -2272 -2267 -2262 -2257 -2271 -2284 -2246 -2209 -2344 -2240 -2154 -2212 -2192 -2172 -2161 -2150
82b150rj0rj0k4k5J01j37P9o3KKk2k2J3J4l7l8L5L5P2P3m7m7l5l6l5l5rqrqkkP0P0k9k8M3
73b277M3k7k7k7k8l3l3L9L8L3L3L3L3L6L6l6l6k2k2k2k3k6k7k7k7K6K6K6K6K6K6K6K6J9J8
65b151J9J8JJ%JJ7J8J7J8PPPPo7o7N3N3K5K6m5m6J0J1J0J0llllm9m9k09P6l1l0j3j3m1m0m1
56b492m1M2M1M2M1j3j3N9N8j1j2j1j2POPOj1j1j2j1PPOPpoppP4P3KKmmmmL5L5l6l7j4j4q5
46b322q6K9L0m3m2J1J1J1J1pqppk6k5k6k5J4J4J4J5%Jp1p1J5J5J5J5K1K0K1K1R0R0k9l0N6
37b285N6N5N6K3K3K4K3N9N9j3j2K8K8m4m3k6k5k6k5N4N5N4N5p1p1p0p1L6L6L6L6k6k5m3m3
29b123J93r3n1n1J6J6J6J6nnon%jjjL7L7l4l5m8m8m8m8J0RJ0RJ%JJJ1J0J1J1n5n4n5n5j%j
19b409j%jj%jkjjl9l8l9l8l5l4L7L7n2n2J9J9pqqqM2M1l0l0j3j3N9N8o8o8LMN1N0N1N1m9m9
$$ plain form
82 -2150 -2159 -2169 -2178 -2188 -2212 -2237 -2136 -2273 -2194 -2257 -2255 -2253 -2275 -2297 -2284 -2270 -2307 -2345 -2310 -2275 -2203 -2130 -2177 -2224 -2259 -2295 -2330 -2365 -2374 -2382 -2391 -2399 -2401 -2403 -2333 -2263 -2292 -2320 -2277
73 -2277 -2234 -2261 -2288 -2315 -2343 -2376 -2409 -2370 -2332 -2299 -2266 -2233 -2200 -2164 -2128 -2164 -2200 -2222 -2244 -2266 -2289 -2315 -2342 -2369 -2396 -2370 -2344 -2318 -2292 -2266 -2240 -2214 -2188 -2169 -2151
65 -2151 -2132 -2114 -2113 -2112 -2112 -2111 -2094 -2076 -2059 -2041 -2034 -2027 -2020 -2013 -2080 -2147 -2094 -2041 -2016 -1990 -2035 -2081 -2071 -2060 -2050 -2040 -2043 -2046 -2049 -2052 -2101 -2150 -2359 -2283 -2314 -2344 -2357 -2370 -2411 -2451 -2492
56 -2492 -2533 -2491 -2450 -2408 -2367 -2380 -2393 -2334 -2276 -2287 -2299 -2310 -2322 -2315 -2309 -2302 -2296 -2307 -2318 -2330 -2341 -2334 -2327 -2321 -2314 -2321 -2327 -2334 -2341 -2267 -2194 -2192 -2190 -2194 -2198 -2202 -2206 -2171 -2136 -2172 -2209 -2223 -2237 -2322
46 -2322 -2408 -2379 -2349 -2392 -2434 -2423 -2412 -2401 -2390 -2397 -2405 -2412 -2419 -2445 -2470 -2496 -2521 -2507 -2493 -2479 -2464 -2464 -2463 -2534 -2605 -2590 -2575 -2560 -2545 -2524 -2504 -2483 -2462 -2372 -2282 -2311 -2341 -2285
37 -2285 -2229 -2174 -2118 -2095 -2072 -2048 -2025 -1966 -1907 -1920 -1932 -1904 -1876 -1920 -1963 -1989 -2014 -2040 -2065 -2011 -1956 -1902 -1847 -1918 -1989 -2059 -2130 -2094 -2058 -2022 -1986 -2012 -2037 -2080 -2123
29 -2123 -1930 -2023 -2074 -2125 -2109 -2093 -2077 -2061 -2066 -2071 -2077 -2082 -2082 -2083 -2084 -2085 -2048 -2011 -2045 -2080 -2128 -2176 -2224 -2272 -2262 -2253 -2243 -2234 -2233 -2233 -2232 -2231 -2220 -2210 -2199 -2188 -2243 -2297 -2352 -2407 -2408 -2408 -2409
19 -2409 -2410 -2410 -2411 -2412 -2412 -2413 -2415 -2416 -2417 -2456 -2494 -2533 -2571 -2606 -2640 -2603 -2566 -2618 -2670 -2651 -2632 -2639 -2647 -2655 -2663 -2621 -2580 -2610 -2640 -2653 -2666 -2607 -2549 -2617 -2685 -2682 -2678 -2627 -2577 -2526 -2475 -2524 -2573
9b573P0P0J4J3Q5Q5l4l4L7L8M2M3k9k9L8L8l4l3mmmml4l3Q5Q6jjjjJ7J7n5n5K4K4K4K4j8j7
0b124j8j8j2j2N9O0j1j1j0j1RRRRJ3J4J3J4o9o8LMl7l7l8l7PPPPJ6J5J6J6RJ0RJ0L6L6l5l5
-9b166n7n6J5J5k5k5k6k5K5K5m7m6j01j00O7O7J6J7J6J7M5M5M5M5llllj3j4j3j3N5N5j12j12
-18b393k3k2k3k3NNP6P7J1J0J1J1k5k4M6M7J7J7J7J7L5L6q4q3QRRRL1L1m1m0N8N8j4j4K1K1
-26b116K0K1oopoLLo8o8j1j0j0j1M0L9L9L9K5K6K6K5L4L5l8l7L7L7L7L7m7m7K5K5popoJ1J1
-35a919J1J2m3m2m3m2ooookjkjO0N9j2j2n3n4J8J8J5J6J5J6k3k2M9M9M9M9J3J4J6J7k0j9j7
-44a855j7j7j6o2o1J0J0J9J8j7j7o1o2N7N8K7K6rrJ2J3n9n9o2o1N8N8n2n2K0K0m5m6rj0L3
-53b219L3l8l9J5J5J5J5l8l9Q1Q0ONNOK7K8m4m4l2l3L9L9O9O8lkk7k6M5M5j9k0J6J7l4l3l4
$$ plain form
9 -2573 -2503 -2433 -2419 -2406 -2321 -2236 -2270 -2304 -2267 -2229 -2187 -2144 -2173 -2202 -2164 -2126 -2160 -2193 -2197 -2201 -2205 -2209 -2243 -2276 -2191 -2105 -2106 -2107 -2108 -2109 -2092 -2075 -2130 -2185 -2161 -2137 -2113 -2089 -2107 -2124
0 -2124 -2142 -2160 -2172 -2184 -2125 -2065 -2076 -2087 -2097 -2108 -2099 -2090 -2081 -2072 -2059 -2045 -2032 -2018 -2087 -2155 -2152 -2148 -2185 -2222 -2260 -2297 -2290 -2283 -2276 -2269 -2253 -2238 -2222 -2206 -2197 -2187 -2178 -2168 -2132 -2096 -2131 -2166
-9 -2166 -2223 -2279 -2264 -2249 -2274 -2299 -2325 -2350 -2325 -2300 -2347 -2393 -2494 -2594 -2527 -2460 -2444 -2427 -2411 -2394 -2349 -2304 -2259 -2214 -2217 -2220 -2223 -2226 -2239 -2253 -2266 -2279 -2224 -2169 -2281 -2393
-18 -2393 -2416 -2438 -2461 -2484 -2479 -2474 -2398 -2321 -2310 -2300 -2289 -2278 -2303 -2327 -2281 -2234 -2217 -2200 -2183 -2166 -2131 -2095 -2179 -2262 -2254 -2245 -2236 -2227 -2196 -2165 -2206 -2246 -2188 -2130 -2144 -2158 -2137 -2116
-26 -2116 -2096 -2075 -2081 -2087 -2094 -2100 -2097 -2094 -2162 -2230 -2241 -2251 -2261 -2272 -2232 -2193 -2154 -2115 -2090 -2064 -2038 -2013 -1979 -1944 -1982 -2019 -1982 -1945 -1908 -1871 -1918 -1965 -1940 -1915 -1922 -1928 -1935 -1941 -1930 -1919
-35 -1919 -1908 -1896 -1939 -1981 -2024 -2066 -2072 -2078 -2084 -2090 -2092 -2093 -2095 -2096 -2036 -1977 -1989 -2001 -2054 -2108 -2090 -2072 -2057 -2041 -2026 -2010 -2033 -2055 -2006 -1957 -1908 -1859 -1846 -1832 -1816 -1799 -1819 -1838 -1855
-44 -1855 -1872 -1889 -1905 -1967 -2028 -2018 -2008 -1989 -1971 -1988 -2005 -2066 -2128 -2071 -2013 -1986 -1960 -1969 -1978 -1966 -1953 -2012 -2071 -2133 -2194 -2136 -2078 -2130 -2182 -2162 -2142 -2187 -2233 -2242 -2252 -2219
-53 -2219 -2186 -2224 -2263 -2248 -2233 -2218 -2203 -2241 -2280 -2199 -2119 -2113 -2108 -2103 -2097 -2070 -2042 -2086 -2130 -2162 -2195 -2156 -2117 -2048 -1980 -1983 -1985 -2012 -2038 -1993 -1948 -1967 -1987 -1971 -1954 -1988 -2021 -2055
-61b055l3L4L5l7l7N3N3j9j8J7J7J7J8k2k2k2k2n1n2n2n1K5K5K5K5M3M3M3M3k3k4k4k3M5M6
-69a980p3p4j1j1K5K5l1l0ONM7M8p2p2j1j1O1O1k3k3J3J2K2K2n0n0l5l5%JppK9K9L0L0m1m1
-78b222nmO7O6n9n9J2J2N8N8j3j3j9j9j8j9jjp3p2L2L2L2L2K8K7K8K8k1k0k1k0K2K2j4j3m1
-86b191m0L1L2P3P3KJl2l2MMJKp0p0j5j4j5j4J5J6J5J5j4j4N8N7J3J3J2J3P4P4LKk6k7J0R
-95a952P6P7m3m2J3J4J3J3l2l2L9M0n7n7J5J5POM3M2k7k7k7k7J3J2J3J3j8j7j7j7qpppk5k5
-104b007k5k5k2k2k1k2j7j8j7j7k3k3M8M8MLMMK5K4m6m7N4N4j8j7n4n4j8j8kkp4p4J4J4J5
-113b372J4P7P7m3m2J3J3J3J3Q1Q0RQO6O5n4n3N1N1k0k0p0p0l4l4o9p0M9N0m0l9lmOPOOl9
-121b321l9L3L3j5j4K1K2K9K9m2m3P0O9n0m9qpK8K9K1K1j5j5l7l7l7l7O0N9j2j3k1k0N0N1
$$ plain form
-61 -2055 -2088 -2054 -2019 -2056 -2093 -2040 -1987 -2006 -2024 -2007 -1990 -1973 -1955 -1977 -1999 -2021 -2043 -2094 -2146 -2198 -2249 -2224 -2199 -2174 -2149 -2106 -2063 -2020 -1977 -2000 -2024 -2048 -2071 -2026 -1980
-69 -1980 -2053 -2127 -2138 -2149 -2124 -2099 -2130 -2160 -2154 -2149 -2102 -2054 -2126 -2198 -2209 -2220 -2159 -2098 -2121 -2144 -2131 -2119 -2097 -2075 -2125 -2175 -2210 -2245 -2245 -2244 -2251 -2258 -2229 -2200 -2170 -2140 -2181 -2222
-78 -2222 -2227 -2231 -2164 -2098 -2157 -2216 -2204 -2192 -2134 -2076 -2089 -2102 -2121 -2140 -2158 -2177 -2178 -2179 -2252 -2324 -2292 -2260 -2228 -2196 -2168 -2141 -2113 -2085 -2106 -2126 -2147 -2167 -2145 -2123 -2137 -2150 -2191
-86 -2191 -2231 -2200 -2168 -2095 -2022 -2020 -2019 -2051 -2083 -2079 -2075 -2074 -2072 -2142 -2212 -2227 -2241 -2256 -2270 -2255 -2239 -2224 -2209 -2223 -2237 -2179 -2122 -2109 -2096 -2084 -2071 -1997 -1923 -1920 -1918 -1944 -1971 -1961 -1952
-95 -1952 -1876 -1799 -1842 -1884 -1871 -1857 -1844 -1831 -1863 -1895 -1856 -1816 -1873 -1930 -1915 -1900 -1893 -1887 -1844 -1802 -1829 -1856 -1883 -1910 -1897 -1885 -1872 -1859 -1877 -1894 -1911 -1928 -1936 -1943 -1950 -1957 -1982 -2007
-104 -2007 -2032 -2057 -2079 -2101 -2122 -2144 -2161 -2179 -2196 -2213 -2236 -2259 -2211 -2163 -2159 -2156 -2152 -2148 -2123 -2099 -2145 -2192 -2138 -2084 -2102 -2119 -2173 -2227 -2245 -2263 -2265 -2267 -2341 -2415 -2401 -2387 -2372
-113 -2372 -2358 -2281 -2204 -2247 -2289 -2276 -2263 -2250 -2237 -2156 -2076 -2067 -2059 -1993 -1928 -1982 -2035 -1984 -1933 -1953 -1973 -2043 -2113 -2147 -2181 -2250 -2320 -2271 -2221 -2261 -2300 -2303 -2307 -2301 -2294 -2288 -2282 -2321
-121 -2321 -2360 -2327 -2294 -2309 -2323 -2302 -2280 -2251 -2222 -2264 -2307 -2237 -2168 -2218 -2267 -2275 -2282 -2254 -2225 -2204 -2183 -2198 -2213 -2250 -2287 -2324 -2361 -2301 -2242 -2254 -2267 -2288 -2308 -2258 -2207
-129b207n4n3j8j8m6m6j0j0M6M6J0J0M1M0M1M1K5K5m7m6J8J9J9J8L7L7l5l5J6J7J6J6k3k4
-137b134M8M7l7l8L4L4kkkkmnnm%%%%n0n0K1K1L5L5K0K0J08j31MLPOPOKKJKllklnmp7p6M2
-148b134M3OPm3m2K9K9K8K9K8K8j9k0j9j9mmlmJ9K0j7j6K1K2r8r7M5M5p4p4K5K6m6m6pppp
-157b357j4j3K2K1j8j9j8j9J1J1J2J1O2O2K6K6J1J1M6M6PPM2M3kjkjk4k5L6L5pppppqqpkj
-166b026o2o1k8k9QPk0k0M0L9k6k6k6k6mnL2L1J5J5m4m5RRJ0RN9N9N9N9l2l2N2N1K2K1j5j4
-175a935L5L6L5L5o3o2M4M4J6J6J6J6l1l1NMl1l1K8K9k5k6k5k5M1M1m2m2L6L7JJj8j7n4n3
-183a995N1N1N1N1p8p9ONj0j1m7m6M2M2j7j7m8m7m7m7K8K9K9K9m6m7j0j0L1L1L1L2lko2o1
-191b191L3L4lkj8j7j8j8M7M8j3j2j4j4M5M6j0rj0rRQRQjjl7l6J8J8J9J8QQn2n2k4k3k4k3
$$ plain form
-129 -2207 -2261 -2314 -2332 -2350 -2396 -2442 -2452 -2462 -2416 -2370 -2360 -2350 -2309 -2269 -2228 -2187 -2162 -2137 -2184 -2230 -2212 -2193 -2174 -2156 -2119 -2082 -2117 -2152 -2136 -2119 -2103 -2087 -2110 -2134
-137 -2134 -2086 -2039 -2076 -2114 -2080 -2046 -2048 -2050 -2052 -2054 -2058 -2063 -2068 -2072 -2072 -2072 -2072 -2072 -2122 -2172 -2151 -2130 -2095 -2060 -2040 -2020 -1912 -2043 -2039 -2036 -2029 -2023 -2016 -2010 -2008 -2006 -2005 -2003 -2006 -2009 -2011 -2014 -2019 -2023 -2100 -2176 -2134
-148 -2134 -2091 -2085 -2078 -2121 -2163 -2134 -2105 -2077 -2048 -2020 -1992 -2011 -2031 -2050 -2069 -2073 -2077 -2080 -2084 -2065 -2045 -2062 -2078 -2057 -2035 -2133 -2230 -2185 -2140 -2214 -2288 -2263 -2237 -2283 -2329 -2336 -2343 -2350 -2357
-157 -2357 -2371 -2384 -2362 -2341 -2359 -2378 -2396 -2415 -2404 -2393 -2381 -2370 -2308 -2246 -2220 -2194 -2183 -2172 -2126 -2080 -2073 -2066 -2024 -1981 -1983 -1984 -1986 -1987 -2011 -2036 -2000 -1965 -1972 -1979 -1986 -1993 -2000 -2008 -2016 -2023 -2025 -2026
-166 -2026 -2088 -2149 -2177 -2206 -2198 -2191 -2211 -2231 -2191 -2152 -2178 -2204 -2230 -2256 -2260 -2265 -2233 -2202 -2187 -2172 -2216 -2261 -2252 -2243 -2233 -2224 -2165 -2106 -2047 -1988 -2020 -2052 -2000 -1949 -1927 -1906 -1921 -1935
-175 -1935 -1900 -1864 -1829 -1794 -1857 -1919 -1875 -1831 -1815 -1799 -1783 -1767 -1798 -1829 -1824 -1820 -1851 -1882 -1854 -1825 -1850 -1876 -1901 -1926 -1885 -1844 -1886 -1928 -1892 -1855 -1854 -1853 -1871 -1888 -1942 -1995
-183 -1995 -1944 -1893 -1842 -1791 -1869 -1948 -1942 -1937 -1947 -1958 -2005 -2051 -2009 -1967 -1984 -2001 -2049 -2096 -2143 -2190 -2162 -2133 -2104 -2075 -2121 -2168 -2178 -2188 -2157 -2126 -2095 -2063 -2066 -2068 -2130 -2191
-191 -2191 -2158 -2124 -2127 -2129 -2147 -2164 -2182 -2200 -2153 -2105 -2118 -2130 -2144 -2158 -2113 -2067 -2077 -2086 -2096 -2105 -2096 -2088 -2079 -2071 -2072 -2073 -2110 -2146 -2128 -2110 -2091 -2073 -2065 -2057 -2109 -2161 -2185 -2208 -2232 -2255
-201b255nmmmL7L7p0p0k2k2k3k2O4O4NMN6N6K0K0O6O6L0L0L7L8p0p0M4M5l9l9K9K9J3J4J26
-209a789j12j4j4m0m0J9K0mmL1L2o7o7ppk4k5N9N9J8J8j8j7K4K4K3K4L5L5L6L5o8o8LMj4j5
-217a915q6q5kkkkK3K3K4K3K3K2K3K2j9j9j9j9J4J5J4J5j5j5j6j5%j%jj1j1O1O0j7j8j8j8
-226a964l0l0k9l0L5L4q4q5K5K4K4K4J9J8J8J8rqO3O2l1l1M0M0nmnmj8j8j8j7j8j8j8j8MM
-235b040MMMMMMmnnnLKLKqqJ11J11k1k2k2k1J1J2J1J2o0o0N9N9L3L3l9l9qrrrj7j8J17j21
-244a947j0j0k4k5N5N5j7j6mlO8O9n6n7J6J5K1K1K2K1rrrrNMMNM4M3k8k8m5m6P3P4lllkk5
-254a773k5k6k5QRQQnonno7o7MML5L4l7l8mmnmJ6J7J6J7O8O9llk0k1k1k1L0L0m2m2o4o4PQ
-264b009K3K3m9m8J0RJ0RJ3J2n9o0jjjjM4M4M5M4k9k9k8k9k4k4M8M7j0j1j0j1LLLLj1j0j1
$$ plain form
-201 -2255 -2260 -2264 -2268 -2272 -2235 -2198 -2268 -2338 -2360 -2382 -2405 -2427 -2363 -2299 -2294 -2290 -2234 -2178 -2158 -2138 -2072 -2006 -1976 -1946 -1909 -1871 -1941 -2011 -1967 -1922 -1961 -2000 -1971 -1942 -1929 -1915 -1789
-209 -1789 -1901 -1915 -1929 -1969 -2009 -1990 -1970 -1974 -1978 -1947 -1915 -1982 -2049 -2056 -2063 -2087 -2112 -2053 -1994 -1976 -1958 -1976 -1993 -1969 -1945 -1922 -1898 -1863 -1828 -1792 -1757 -1825 -1893 -1890 -1886 -1900 -1915
-217 -1915 -2001 -2086 -2088 -2090 -2092 -2094 -2071 -2048 -2024 -2001 -1978 -1956 -1933 -1911 -1930 -1949 -1968 -1987 -1973 -1958 -1944 -1929 -1944 -1959 -1975 -1990 -1990 -1991 -1991 -1992 -2003 -2014 -1953 -1893 -1910 -1928 -1946 -1964
-226 -1964 -1994 -2024 -2053 -2083 -2048 -2014 -2098 -2183 -2158 -2134 -2110 -2086 -2067 -2049 -2031 -2013 -2022 -2030 -1967 -1905 -1936 -1967 -1927 -1887 -1892 -1896 -1901 -1905 -1923 -1941 -1959 -1976 -1994 -2012 -2030 -2048 -2044 -2040
-235 -2040 -2036 -2032 -2028 -2024 -2020 -2016 -2020 -2025 -2030 -2035 -2032 -2030 -2027 -2025 -2033 -2041 -1930 -1819 -1840 -1862 -1884 -1905 -1894 -1882 -1871 -1859 -1919 -1979 -1920 -1861 -1828 -1795 -1834 -1873 -1881 -1890 -1899 -1908 -1925 -1943 -1826 -1947
-244 -1947 -1957 -1967 -1991 -2016 -1961 -1906 -1923 -1939 -1943 -1946 -1878 -1809 -1865 -1922 -1906 -1891 -1870 -1849 -1827 -1806 -1815 -1824 -1833 -1842 -1837 -1833 -1829 -1824 -1780 -1737 -1765 -1793 -1838 -1884 -1811 -1737 -1740 -1743 -1746 -1748 -1773
-254 -1773 -1798 -1824 -1849 -1841 -1832 -1824 -1816 -1821 -1827 -1832 -1837 -1904 -1971 -1967 -1963 -1928 -1894 -1931 -1969 -1973 -1977 -1982 -1986 -1970 -1953 -1937 -1920 -1852 -1783 -1786 -1789 -1809 -1830 -1851 -1872 -1842 -1812 -1854 -1896 -1960 -2024 -2017 -2009
-264 -2009 -1986 -1963 -2012 -2060 -2050 -2041 -2031 -2022 -2009 -1997 -2056 -2116 -2117 -2118 -2119 -2120 -2076 -2032 -1987 -1943 -1972 -2001 -2029 -2058 -2082 -2106 -2058 -2011 -2021 -2032 -2042 -2053 -2050 -2047 -2044 -2041 -2052 -2062 -2073
-273b073j0l1l1M0M1%JL6L6j2j2K4K4j7j6J9K0K0K0j5j6Q0Q1q6q7l2l3o8o8l3l3L8L9j5j4
-281b183j4j4L5L6%%P8P9OPO3O3K7K7K9K9ppj0rrrJ9J9j6j6n2n3K0J9m2m2oolkL3L3J1J1k5
-290a881k5L6L5%%k8k8k8k8L5L5l6l6M0M1l1l1M9N0k2k3k7k8M4M4j9j9J8J7k4k4J3J2L0L0
-298a809m1m2Q4Q3J2J2k9l0l0k9QQQQj0j0j0j0k3k3k3k3NNMNJ8J9j8j7L8L8q2q1J2J2k4k4
-307b009m9n0K3K2mmL1L2j6j6j6j6J0J1k6k5j5j6N6N6QQRQJ5J5N0N1k1k2N0N0k1k1R9R8k1
-315a666k1N0N0p9p9M0M0llllNMNNj3j2j3j2j3j2j3j3l8l8l8l8K7K7K8K7qqqqk6k6k6k6J1
-324a927J0J1J1j2j2j1j2K7K6m5m5R6R6k2k3m3m2K9L0m2m1P7P8noL0L1k3k2M9M9MNNMk8k8
-333a721k8k8m5m5K7K6rrrrm7m7K5K5L0K9m2m2j7j7N4N5l0l0M1M1K8K8K9K8L2L3L2L3j2j1
$$ plain form
-273 -2073 -2083 -2114 -2145 -2105 -2064 -2064 -2063 -2027 -1991 -2003 -2015 -1991 -1967 -1984 -2000 -1981 -1961 -1941 -1921 -1936 -1952 -1872 -1791 -1877 -1964 -1996 -2029 -2097 -2165 -2198 -2231 -2193 -2154 -2169 -2183
-281 -2183 -2197 -2211 -2176 -2140 -2140 -2140 -2062 -1983 -1977 -1970 -1907 -1844 -1817 -1790 -1761 -1732 -1739 -1746 -1756 -1765 -1774 -1783 -1764 -1745 -1761 -1777 -1829 -1882 -1862 -1843 -1885 -1927 -1933 -1939 -1942 -1944 -1911 -1878 -1867 -1856 -1881
-290 -1881 -1906 -1870 -1835 -1835 -1835 -1863 -1891 -1919 -1947 -1912 -1877 -1913 -1949 -1909 -1868 -1899 -1930 -1881 -1831 -1853 -1876 -1903 -1931 -1887 -1843 -1862 -1881 -1863 -1846 -1870 -1894 -1881 -1869 -1839 -1809
-298 -1809 -1850 -1892 -1808 -1725 -1713 -1701 -1730 -1760 -1790 -1819 -1811 -1803 -1795 -1787 -1797 -1807 -1817 -1827 -1850 -1873 -1896 -1919 -1914 -1909 -1905 -1900 -1882 -1863 -1881 -1898 -1860 -1822 -1904 -1985 -1973 -1961 -1985 -2009
-307 -2009 -2058 -2108 -2085 -2063 -2067 -2071 -2040 -2008 -2024 -2040 -2056 -2072 -2062 -2051 -2077 -2102 -2117 -2133 -2077 -2021 -2013 -2005 -1996 -1988 -1973 -1958 -1908 -1857 -1878 -1900 -1850 -1800 -1821 -1842 -1743 -1645 -1666
-315 -1666 -1687 -1637 -1587 -1666 -1745 -1705 -1665 -1668 -1671 -1674 -1677 -1672 -1668 -1663 -1658 -1671 -1683 -1696 -1708 -1721 -1733 -1746 -1759 -1797 -1835 -1873 -1911 -1884 -1857 -1829 -1802 -1810 -1818 -1826 -1834 -1860 -1886 -1912 -1938 -1927
-324 -1927 -1917 -1906 -1895 -1907 -1919 -1930 -1942 -1915 -1889 -1934 -1979 -1883 -1787 -1809 -1832 -1875 -1917 -1888 -1858 -1900 -1941 -1864 -1786 -1791 -1797 -1767 -1736 -1759 -1781 -1732 -1683 -1679 -1674 -1669 -1665 -1693 -1721
-333 -1721 -1749 -1777 -1822 -1867 -1840 -1814 -1823 -1832 -1841 -1850 -1897 -1944 -1919 -1894 -1864 -1835 -1877 -1919 -1936 -1953 -1899 -1844 -1874 -1904 -1863 -1822 -1794 -1766 -1737 -1709 -1677 -1644 -1612 -1579 -1591 -1602
-341a602j2j2j6j6j6j7M1M1l1l0rqqrM3M3M2M3o6o6N3N3j1j1j2j1J4J4J4J4rrrrQRRRL5L6
-350a478L6L5m6m7K6K5j2j1j1j2L8L8l4l4n5n6J5J6o9o9KKj1j0j1j1N2N2k0k0J0RRRJ2J2J3
-359a606J2n4n4O6O5r8r9K1K1l6l6l6l6N6N6o2o3jjjjRJ0RJ0L0L1L1L0n1n1K0K0J3J2J3J2
-367a739N7N7j4j4J0J0J0J0j2j2j2j2k1k1k0k1llllNMMMj3j4j4j3M1M2M1M2%j%%k1k1k1k1
-376a712pqpqM7M7k5k4k9k9M2M2L5L5l6l7J2J3J2J3j4j3N8N8j2j2j2j2j4j3j4j3J6J7J6J7
-384a571NNNNONNNk1k2k2k2k1k2k2k1J1J1J1J1l5l5l5l5K1K1n0n0K0K0K0K0J5J5J5J4llll
-394a730jjjjM1M2ONj9j9N2N2j5j5K1K0l4l5L7L7l9l9mlJ4J3J4J3LKo9o9LLLLK8K8K8K8M8
-403a550M8M7M8OONOJ0J0J0Rm8m9m8m8L4L4l7l7rrm5m4N8N8K3K2nnm1m1M0M0L9M0j6j6j7j6
$$ plain form
-341 -1602 -1614 -1626 -1642 -1658 -1674 -1691 -1650 -1609 -1640 -1670 -1679 -1687 -1695 -1704 -1661 -1618 -1576 -1533 -1599 -1665 -1612 -1559 -1570 -1581 -1593 -1604 -1590 -1576 -1562 -1548 -1557 -1566 -1575 -1584 -1576 -1567 -1558 -1549 -1514 -1478
-350 -1478 -1442 -1407 -1453 -1500 -1474 -1449 -1461 -1472 -1483 -1495 -1457 -1419 -1453 -1487 -1542 -1598 -1583 -1567 -1636 -1705 -1703 -1701 -1712 -1722 -1733 -1744 -1692 -1640 -1660 -1680 -1670 -1661 -1652 -1643 -1631 -1619 -1606
-359 -1606 -1594 -1648 -1702 -1636 -1571 -1669 -1768 -1747 -1726 -1762 -1798 -1834 -1870 -1814 -1758 -1820 -1883 -1884 -1885 -1886 -1887 -1878 -1868 -1859 -1849 -1819 -1788 -1757 -1727 -1778 -1829 -1809 -1789 -1776 -1764 -1751 -1739
-367 -1739 -1682 -1625 -1639 -1653 -1643 -1633 -1623 -1613 -1625 -1637 -1649 -1661 -1682 -1703 -1723 -1744 -1747 -1750 -1753 -1756 -1751 -1747 -1743 -1739 -1752 -1766 -1780 -1793 -1752 -1710 -1669 -1627 -1627 -1628 -1628 -1628 -1649 -1670 -1691 -1712
-376 -1712 -1719 -1727 -1734 -1742 -1695 -1648 -1673 -1697 -1726 -1755 -1713 -1671 -1636 -1601 -1637 -1674 -1662 -1649 -1637 -1624 -1638 -1651 -1593 -1535 -1547 -1559 -1571 -1583 -1597 -1610 -1624 -1637 -1621 -1604 -1588 -1571
-384 -1571 -1566 -1561 -1556 -1551 -1545 -1540 -1535 -1530 -1551 -1573 -1595 -1617 -1638 -1660 -1682 -1703 -1692 -1681 -1670 -1659 -1694 -1729 -1764 -1799 -1778 -1757 -1807 -1857 -1837 -1817 -1797 -1777 -1762 -1747 -1732 -1718 -1721 -1724 -1727 -1730
-394 -1730 -1731 -1732 -1733 -1734 -1693 -1651 -1645 -1640 -1659 -1678 -1626 -1574 -1589 -1604 -1583 -1563 -1597 -1632 -1595 -1558 -1597 -1636 -1640 -1643 -1629 -1616 -1602 -1589 -1586 -1584 -1653 -1722 -1719 -1716 -1713 -1710 -1682 -1654 -1626 -1598 -1550
-403 -1550 -1502 -1455 -1407 -1401 -1395 -1390 -1384 -1374 -1364 -1354 -1345 -1393 -1442 -1490 -1538 -1504 -1470 -1507 -1544 -1553 -1562 -1607 -1651 -1593 -1535 -1512 -1490 -1495 -1500 -1541 -1582 -1542 -1502 -1463 -1423 -1439 -1455 -1472 -1488
-412a488J7J6J7J7k6k5k5k5j6j6j6j7l4l4l4l4K1K0K0K0j4j4j4j4L8L9l4l3N1N2o8o8N7N7
-420a607k4k4N6q7n1R1p5p5N2N3J3J2k3k3L6L5l5l6k0k0N1N2PQQPL0L0L1L0j6j6O5p8j9j9
-428a581r9M4q1O2rrj%j%J1J1J1J1L8L7l3l4mln8J82o1Q3J7J8l0k9l0k9O7O8n2n2j3j3O8p6
-437a570N3N4k8k7L4L5j1j0L5j08O2q2p0P2q9N5q1O3K7K6K9K8m3m3M8M9p1p1%%%%K3K2L2L1
-445a526j08L5L6j08J6J6PPOOP8P7J0Rj43%%%RQj8j8j8j8j4j4q6q6N6N6N5N6ONNOnnO6O7j5
-454a484j6j5j6N0N1N0N0L9M0l3l2k2k1l7l7R5j44j0j0ppppLKLLk8k7k7k7j0j0j0j0PQQQJ1
-463a626J2J1J2L4L4l8l8J2J1J2J1K2K2m9n0m0l9L2L2RJ0o2o2J6J6J6J7Q2Q1J1J0J1J1J2J1
-471a434NNo6o6lklkpqppL8L8L8L8k8k8M4M3l0l0M1M2mlmlNNNNk5k4k5k5lklkl0k9M2M2N4
$$ plain form
-412 -1488 -1471 -1455 -1438 -1421 -1447 -1472 -1497 -1522 -1538 -1554 -1570 -1587 -1621 -1655 -1689 -1723 -1702 -1682 -1662 -1642 -1656 -1670 -1684 -1698 -1660 -1621 -1655 -1688 -1637 -1585 -1653 -1721 -1664 -1607
-420 -1607 -1631 -1655 -1599 -1686 -1737 -1646 -1721 -1796 -1744 -1691 -1678 -1666 -1689 -1712 -1676 -1641 -1676 -1712 -1732 -1752 -1701 -1649 -1642 -1634 -1626 -1619 -1589 -1559 -1528 -1498 -1514 -1530 -1465 -1543 -1562 -1581
-428 -1581 -1680 -1636 -1717 -1655 -1664 -1673 -1674 -1674 -1675 -1675 -1664 -1653 -1642 -1631 -1593 -1556 -1589 -1623 -1627 -1630 -1688 -1506 -1567 -1484 -1467 -1449 -1479 -1508 -1538 -1567 -1500 -1432 -1484 -1536 -1549 -1562 -1494 -1570
-437 -1570 -1517 -1463 -1491 -1518 -1484 -1449 -1460 -1470 -1435 -1543 -1481 -1563 -1633 -1561 -1650 -1595 -1676 -1613 -1586 -1560 -1531 -1503 -1546 -1589 -1541 -1492 -1563 -1634 -1634 -1634 -1634 -1634 -1611 -1589 -1557 -1526
-445 -1526 -1634 -1599 -1563 -1671 -1655 -1639 -1632 -1625 -1619 -1613 -1535 -1458 -1448 -1439 -1582 -1582 -1582 -1582 -1573 -1565 -1583 -1601 -1619 -1637 -1651 -1665 -1751 -1837 -1781 -1725 -1670 -1614 -1608 -1603 -1598 -1592 -1597 -1602 -1536 -1469 -1484
-454 -1484 -1500 -1515 -1531 -1481 -1430 -1380 -1330 -1291 -1251 -1284 -1316 -1338 -1359 -1396 -1433 -1338 -1482 -1492 -1502 -1509 -1516 -1523 -1530 -1527 -1525 -1522 -1519 -1547 -1574 -1601 -1628 -1638 -1648 -1658 -1668 -1661 -1653 -1645 -1637 -1626
-463 -1626 -1614 -1603 -1591 -1557 -1523 -1561 -1599 -1587 -1576 -1564 -1553 -1531 -1509 -1558 -1608 -1648 -1687 -1655 -1623 -1614 -1604 -1666 -1728 -1712 -1696 -1680 -1663 -1581 -1500 -1489 -1479 -1468 -1457 -1445 -1434
-471 -1434 -1429 -1424 -1490 -1556 -1559 -1561 -1564 -1566 -1573 -1581 -1588 -1595 -1557 -1519 -1481 -1443 -1471 -1499 -1455 -1412 -1442 -1472 -1431 -1389 -1393 -1396 -1400 -1403 -1398 -1393 -1388 -1383 -1408 -1432 -1457 -1482 -1485 -1487 -1490 -1492 -1522 -1551 -1509 -1467 -1413
-482a413N5j7j7l8l8L4L4m0m0L1L2J8J8n4n3lkllJ1J1J1J0oooooooolmmmO7O6noj1j0j1j1
-491a440K6K7K6K7j2j1j1j2N5N4j7j7PPo4o4N6N7o3o2J8J9J9J9K9K9K9K9J8J8J8J8%%%%l3
-500a201l4l4l4L2L2L2L2J8J9J9J9J8J9J9J9k3k4k3k3J9J8J9J9%%%%m9m9K2K3kkjkLKLLp3
-509a165p4p3p3J7J7j8j9m2m1L0L0JJJJJ1J1o1o1L0L0m1m2O2O2n7n7L9M0L9M0k4k4M8M8Q4
-517a230Q3q3q4N7N6N6N7k0k0j9k0m1m1m1m0j1j2j1j1j3j3j3j3onool5l6Q3Q4n2n1K0K0RJ0
-526a398M5M5n2n3J9K0j5j6j5j5MLL9M0m0l9L3L2N2N3j9j9RRRQNMNMmmmmK2K1K1K2L5L6l7
-535a139l6k5k5J1J1l3l3l3l2J1J1J1J1k1k1k1k1JKJJQ3Q2l7l7M5M5k6k7m2m2L0K9K1K0j5
-543a240j6lmm0l9K4K3j2j1K2K3m9m9K5K5j1j1NNl1l1K7K7m4m5K7K7K7K7J4J3J4J4nnnnK5
$$ plain form
-482 -1413 -1358 -1375 -1392 -1430 -1468 -1434 -1400 -1440 -1480 -1449 -1417 -1399 -1381 -1435 -1488 -1491 -1493 -1496 -1499 -1488 -1477 -1466 -1456 -1462 -1468 -1474 -1480 -1486 -1492 -1498 -1504 -1507 -1511 -1515 -1519 -1452 -1386 -1391 -1397 -1408 -1418 -1429 -1440
-491 -1440 -1414 -1387 -1361 -1334 -1346 -1357 -1368 -1380 -1325 -1271 -1288 -1305 -1298 -1291 -1355 -1419 -1363 -1306 -1369 -1431 -1413 -1394 -1375 -1356 -1327 -1298 -1269 -1240 -1222 -1204 -1186 -1168 -1168 -1168 -1168 -1168 -1201
-500 -1201 -1235 -1269 -1303 -1271 -1239 -1207 -1175 -1157 -1138 -1119 -1100 -1082 -1063 -1044 -1025 -1048 -1072 -1095 -1118 -1099 -1081 -1062 -1043 -1043 -1043 -1043 -1043 -1092 -1141 -1119 -1096 -1098 -1100 -1101 -1103 -1100 -1098 -1095 -1092 -1165
-509 -1165 -1239 -1312 -1385 -1368 -1351 -1369 -1388 -1430 -1471 -1441 -1411 -1410 -1409 -1408 -1407 -1396 -1385 -1446 -1507 -1477 -1447 -1488 -1530 -1468 -1406 -1463 -1520 -1481 -1441 -1402 -1362 -1386 -1410 -1362 -1314 -1230
-517 -1230 -1147 -1230 -1314 -1257 -1201 -1145 -1088 -1108 -1128 -1147 -1167 -1208 -1249 -1290 -1330 -1341 -1353 -1364 -1375 -1388 -1401 -1414 -1427 -1433 -1438 -1444 -1450 -1485 -1521 -1438 -1354 -1406 -1457 -1437 -1417 -1408 -1398
-526 -1398 -1353 -1308 -1360 -1413 -1394 -1374 -1389 -1405 -1420 -1435 -1431 -1428 -1389 -1349 -1389 -1428 -1395 -1363 -1311 -1258 -1277 -1296 -1287 -1278 -1269 -1261 -1256 -1252 -1247 -1243 -1247 -1251 -1255 -1259 -1237 -1216 -1195 -1173 -1138 -1102 -1139
-535 -1139 -1175 -1200 -1225 -1214 -1203 -1236 -1269 -1302 -1334 -1323 -1312 -1301 -1290 -1311 -1332 -1353 -1374 -1373 -1371 -1370 -1369 -1286 -1204 -1241 -1278 -1233 -1188 -1214 -1241 -1283 -1325 -1295 -1266 -1245 -1225 -1240
-543 -1240 -1256 -1259 -1263 -1303 -1342 -1318 -1295 -1307 -1318 -1296 -1273 -1322 -1371 -1346 -1321 -1332 -1343 -1338 -1333 -1364 -1395 -1368 -1341 -1385 -1430 -1403 -1376 -1349 -1322 -1308 -1295 -1281 -1267 -1272 -1277 -1282 -1287 -1262
-552a262K5J1J0J16j23J2J1L0L1m2m1lkL3L3m7m7K4K4mmL1L2%%J%l1l1MNj4j4N7N8J4J4J4
-561a075J4k6k6R3R3m6m6K6K6MMl2l2ONNNo9o8N0N1m8m8K3K4l2l1L9M0jj%jLMLMJ8J8J8J8
-570i88rj0rj0j8j8J8J7N4N3j8j8j1j0m7m6k1k1J5J4QPPPk0k0k0k1J8J8J7J8j7j6j7j6k3k4
-579a177R7R6n3n3J9J8ooooM5M5k6k6k0k0n5n6Q5Q6l4l4l2l1L9M0j6j6N6N5j2j2K3K4n4n4
-587a077j9j8KLKKK3K2K3K2QPPQkkjkk3k4k3k4k3k4k3k3L4L4L4L4o2o2RJ0K9L0ooj2j1j1j2
-597a147RRRQrrrrK0J9K0K0KKKKj0rj0rj0j0rj0N7N7N7N7L6L6l5l6m4m4K7K7o6o7NNOPPOJ4
-607a026J3J3J4j4j4K2K2n2n2J9K0N7N7j4j4N5N6o3o4rrrrNOo6o5J3J4J3J4J1J0J1J1P9Q0
-615h65l9l9l8l8L4L4o1o0J2J1j5j6j5j6K0J9K0K0l2l2M0L9KJl4l4P4P5LLooK9L0o5o5POj7
$$ plain form
-552 -1262 -1237 -1226 -1216 -1100 -1223 -1211 -1200 -1170 -1139 -1181 -1222 -1225 -1227 -1194 -1161 -1208 -1255 -1231 -1207 -1211 -1215 -1184 -1152 -1152 -1152 -1151 -1151 -1182 -1213 -1209 -1204 -1218 -1232 -1175 -1117 -1103 -1089 -1075
-561 -1075 -1061 -1087 -1113 -1020 -927 -973 -1019 -993 -967 -963 -959 -991 -1023 -1017 -1012 -1007 -1002 -1071 -1139 -1089 -1038 -1086 -1134 -1111 -1087 -1119 -1150 -1111 -1071 -1072 -1073 -1073 -1074 -1071 -1067 -1064 -1060 -1042 -1024 -1006 -988
-570 -988 -997 -1007 -1016 -1026 -1044 -1062 -1044 -1027 -973 -920 -938 -956 -967 -977 -1024 -1070 -1091 -1112 -1097 -1083 -1075 -1068 -1061 -1054 -1074 -1094 -1114 -1135 -1117 -1099 -1082 -1064 -1081 -1097 -1114 -1130 -1153 -1177
-579 -1177 -1080 -984 -1037 -1090 -1071 -1053 -1059 -1065 -1071 -1077 -1032 -987 -1013 -1039 -1059 -1079 -1134 -1190 -1105 -1019 -1053 -1087 -1119 -1150 -1111 -1071 -1087 -1103 -1047 -992 -1004 -1016 -993 -969 -1023 -1077
-587 -1077 -1096 -1114 -1112 -1109 -1107 -1105 -1082 -1060 -1037 -1015 -1007 -1000 -993 -985 -987 -989 -990 -992 -1015 -1039 -1062 -1086 -1109 -1133 -1156 -1179 -1145 -1111 -1077 -1043 -1105 -1167 -1158 -1148 -1119 -1089 -1095 -1101 -1113 -1124 -1135 -1147
-597 -1147 -1138 -1129 -1120 -1112 -1121 -1130 -1139 -1148 -1128 -1109 -1089 -1069 -1067 -1065 -1063 -1061 -1071 -1080 -1090 -1099 -1109 -1119 -1128 -1138 -1081 -1024 -967 -910 -874 -838 -873 -909 -953 -997 -970 -943 -1009 -1076 -1071 -1066 -1060 -1053 -1046 -1040 -1026
-607 -1026 -1013 -1000 -986 -1000 -1014 -992 -970 -1022 -1074 -1055 -1035 -978 -921 -935 -949 -894 -838 -901 -965 -974 -983 -992 -1001 -996 -990 -1056 -1121 -1108 -1094 -1081 -1067 -1056 -1046 -1035 -1024 -945 -865
-615 -865 -904 -943 -981 -1019 -985 -951 -1012 -1072 -1060 -1049 -1064 -1080 -1095 -1111 -1091 -1072 -1052 -1032 -1064 -1096 -1056 -1017 -1015 -1014 -1048 -1082 -1008 -933 -930 -927 -933 -939 -910 -880 -945 -1010 -1003 -997 -1014
-624a014j8j7j8NNNNN0N0N1N0JJp0p1k5k6k6k5j3j2j2j2j5j4j5j4JJJJjkl7l7L8L9l3l3M0
-633a216L9MML7L7L8L7J%JJj7j7j7j8J2J2J1J2PPPPM6M7k6k5NOl1l0K4K5K5K4K3K2K3K2K9
-643h02K9K9K9j3j2j3j3J1J1J0J1l1l1l1l1J5J5J5J4m6m6m6m6k5k5M7M7K3K2K3K3k8k8R1R0
-651g12p6p6m0m0N4N4J9J8l0l1Q8Q9N3N3j8j9m1m0L0L1j1j1j1j1m4m4m3m4m6m5K6K6J0J0k5
-659h97k5llO9O9M2M2OOK3K2m9m9K9L0m3m2qrqrqrqqj8j7N4N5j6j6j6j6LLLLnoooj3j3j2j3
-669h92j3j2j3j3j6j6j6j6L7L8L7L7j8j8j8j8J2J2J1J2j9j9j8j9jjjjj6j5j6j6L8L8L8L8J2
-677h61J2J1J2k3k2k3k2K9K9m3m2MMl1l1L2L3l9l9m1m2L1L0L1L1L1L1L9L9q0q0qpK8K9k2k2
-686i92N0N0K0K0J9K0l4l4L8L8m0l9l9l9PPPPl9m0m0m0K6K5K6K6j6j6j6j6KJKKK9K9K8K9K3
$$ plain form
-624 -1014 -1032 -1049 -1067 -1062 -1057 -1052 -1047 -997 -947 -896 -846 -845 -844 -914 -985 -1010 -1036 -1062 -1087 -1100 -1112 -1124 -1136 -1151 -1165 -1180 -1194 -1193 -1192 -1191 -1190 -1191 -1193 -1230 -1267 -1229 -1190 -1223 -1256 -1216
-633 -1216 -1177 -1173 -1169 -1132 -1095 -1057 -1020 -1019 -1019 -1018 -1017 -1034 -1051 -1068 -1086 -1074 -1062 -1051 -1039 -1032 -1025 -1018 -1011 -965 -918 -944 -969 -964 -958 -989 -1019 -995 -970 -945 -921 -898 -876 -853 -831 -802
-643 -802 -773 -744 -715 -728 -740 -753 -766 -755 -744 -734 -723 -754 -785 -816 -847 -832 -817 -802 -788 -834 -880 -926 -972 -997 -1022 -975 -928 -905 -883 -860 -837 -865 -893 -802 -712
-651 -712 -788 -864 -904 -944 -890 -836 -817 -799 -829 -860 -772 -683 -630 -577 -595 -614 -655 -695 -665 -634 -645 -656 -667 -678 -722 -766 -809 -853 -899 -944 -918 -892 -882 -872 -897
-659 -897 -922 -925 -928 -859 -790 -748 -706 -700 -694 -671 -649 -698 -747 -718 -688 -731 -773 -781 -790 -798 -807 -815 -824 -832 -840 -858 -875 -821 -766 -782 -798 -814 -830 -827 -824 -821 -818 -823 -829 -835 -841 -854 -867 -879 -892
-669 -892 -905 -917 -930 -943 -959 -975 -991 -1007 -970 -932 -895 -858 -876 -894 -912 -930 -918 -906 -895 -883 -902 -921 -939 -958 -959 -960 -961 -962 -978 -993 -1009 -1025 -987 -949 -911 -873 -861
-677 -861 -849 -838 -826 -849 -871 -894 -916 -887 -858 -901 -943 -939 -935 -966 -997 -965 -932 -971 -1010 -1051 -1093 -1062 -1032 -1001 -970 -939 -908 -869 -830 -910 -990 -998 -1005 -977 -948 -970 -992
-686 -992 -942 -892 -872 -852 -833 -813 -847 -881 -843 -805 -845 -884 -923 -962 -955 -948 -941 -934 -973 -1013 -1053 -1093 -1067 -1042 -1016 -990 -1006 -1022 -1038 -1054 -1052 -1051 -1049 -1047 -1018 -989 -961 -932 -909
-695i09K4j2j3l1l2M0M0k1k0k1k0RJ0RJ0m5m5rrN8N8j4j4k9k9M2M2K3K3K3K3j0j0j0j0l3l3
-703i45L9L8QPPQK1K1K0K1m1m2P7P8o0n9J2J2P3P4JKk8k7k8k7OOo6o6K2K1j5j4O1O2j0j0m2
-712g83m1ooR0R1k9k9JKJJJ2J2J1J2nnmnnnnnJ3J3J4J3j9j9j9j9J0J1k5k4L5L6l6l6K4K5K5
-722f78K4nnnnQ5Q6l3l4j9j8J7J7KLl4l4j3j3K2K2%jj%j6j5n2n1M8M8p2p1kjL4L5K7K7m4m4
-731g69J6J6J6J6k0k1k0k0L3L3l8l8J6J6n6n5J3J4k2k2M5M5k7k6O0O1j1j1j7j6j7j6llllk3
-740h57k3k2k3%j%%l5l4L7L7j4j4j3j4Q5Q5q2q2N0N0J5J4K0J9K0K0j2j3j2j2kkkkLKLLl1l0
-749h69M2M1j9j9J7J6l5l5l5l5OPOPJ7J8j8j9N4N3j8j9l2l3LL%JJJj7j7N5N4K1K2j5j5M9M8
-758g08k3k3L6L5jjppqpL6L6%%L2L3l9l9K9K8m3m4KKl4l4l6l6l7l6K9K8K9K8J1J0J1J0J4J4
$$ plain form
-695 -909 -885 -897 -910 -941 -973 -933 -893 -914 -934 -955 -975 -966 -956 -947 -937 -982 -1027 -1036 -1045 -987 -929 -943 -957 -986 -1015 -973 -931 -908 -885 -862 -839 -849 -859 -869 -879 -912 -945
-703 -945 -906 -868 -860 -853 -846 -838 -817 -796 -776 -755 -796 -838 -761 -683 -743 -802 -790 -778 -705 -631 -630 -628 -656 -683 -711 -738 -732 -726 -792 -858 -836 -815 -830 -844 -783 -721 -731 -741 -783
-712 -783 -824 -830 -836 -746 -655 -684 -713 -712 -710 -709 -708 -696 -684 -673 -661 -666 -671 -675 -680 -685 -690 -695 -700 -687 -674 -660 -647 -666 -685 -704 -723 -713 -702 -727 -751 -716 -680 -716 -752 -728 -703 -678
-722 -678 -654 -659 -664 -669 -674 -589 -503 -536 -570 -589 -607 -590 -573 -571 -568 -602 -636 -649 -662 -640 -618 -618 -619 -620 -620 -636 -651 -703 -754 -706 -658 -730 -801 -803 -804 -770 -735 -708 -681 -725 -769
-731 -769 -753 -737 -721 -705 -725 -746 -766 -786 -753 -720 -758 -796 -780 -764 -820 -875 -862 -848 -870 -892 -847 -802 -829 -855 -795 -734 -745 -756 -773 -789 -806 -822 -825 -828 -831 -834 -857
-740 -857 -880 -902 -925 -925 -926 -926 -926 -961 -995 -958 -921 -935 -949 -962 -976 -891 -806 -888 -970 -920 -870 -855 -841 -821 -802 -782 -762 -774 -787 -799 -811 -813 -815 -817 -819 -816 -814 -811 -808 -839 -869
-749 -869 -827 -786 -805 -824 -807 -791 -826 -861 -896 -931 -925 -918 -912 -905 -888 -870 -888 -907 -853 -800 -818 -837 -869 -902 -899 -896 -896 -895 -894 -893 -910 -927 -872 -818 -797 -775 -790 -805 -756 -708
-758 -708 -731 -754 -718 -683 -684 -685 -692 -699 -707 -714 -678 -642 -642 -642 -610 -577 -616 -655 -626 -598 -641 -685 -683 -681 -715 -749 -785 -821 -858 -894 -865 -837 -808 -780 -769 -759 -748 -738 -724 -710
-767g10J4J4j5j6j6j6K1K2K1K1m5m4K7K7m7m7K4K5K9K9m3m2J4J5J4J5N5N5j7j7j9k0N1N2j00
-775f69j00O6O7M6M6k5k5L6L6l6l6%j%%k5k5M6M7k3k3J3J3J5J5n6n6N2N2j9j9onm1m1OOOO
-784f57l6l6L5L5%%%JMNNMJ3J2J2J2QPQQL6L6l5l5l8l7L4L4rqm4m4j6j6N6N5k6k7J0Rj0j1
-794f46K5K5J9J9j7j7qqqqk9k9M3M2opppJ3J3J3J3j7j7j7j7J0RJ0J0rqqq%J%Jm2m1m1m1K5
-804g72K5K5K5J6J7J6J6qpJ18j21J07l6L9j04NOllL7L6L6L7m7m7j2j1jkP0P0m1m1L1L0l7l7
-812e68l7l7JKl4l4O5O6ooJ8J9j8j8j7j8j8j7MNM0M1l4l3Q6Q5m9n0K2K2O6O7n3n2O4O3n5n5
-821d73R6R7k3k3%%p1p2lll8l9K0K1j5j6LLKLK4K5K5K4j7j7j7j7J0J0J0J0j2j3j2j2J4J3n7
-830e40n8J%J%J2J2J1J2ooooKKLKl4l4L8L8M0M0l1l2%j%%l8l7L4L4klO9P0m7m6j1j0J5J5J6
$$ plain form
-767 -710 -696 -682 -697 -713 -729 -745 -724 -702 -681 -660 -705 -749 -722 -695 -742 -789 -765 -740 -711 -682 -725 -767 -753 -738 -724 -709 -654 -599 -616 -633 -652 -672 -621 -569 -669
-775 -669 -769 -703 -636 -590 -544 -569 -594 -558 -522 -558 -594 -594 -595 -595 -595 -620 -645 -599 -552 -575 -598 -585 -572 -557 -542 -598 -654 -602 -550 -569 -588 -594 -599 -640 -681 -675 -669 -663 -657
-784 -657 -693 -729 -694 -659 -659 -659 -659 -658 -654 -649 -644 -640 -627 -615 -603 -591 -583 -576 -568 -560 -524 -488 -523 -558 -596 -633 -599 -565 -574 -582 -626 -670 -686 -702 -646 -591 -617 -644 -634 -625 -635 -646
-794 -646 -621 -596 -577 -558 -575 -592 -600 -608 -616 -624 -653 -682 -639 -597 -603 -610 -617 -624 -611 -598 -585 -572 -589 -606 -623 -640 -630 -621 -611 -601 -610 -618 -626 -634 -634 -633 -633 -632 -674 -715 -756 -797 -772
-804 -772 -747 -722 -697 -681 -664 -648 -632 -640 -647 -529 -650 -543 -579 -540 -644 -639 -633 -636 -639 -602 -566 -530 -493 -540 -587 -599 -610 -611 -613 -543 -473 -514 -555 -524 -494 -531 -568
-812 -568 -605 -642 -641 -639 -673 -707 -642 -576 -582 -588 -570 -551 -569 -587 -604 -622 -640 -657 -653 -648 -608 -567 -601 -634 -548 -463 -512 -562 -540 -518 -452 -385 -438 -490 -426 -363 -418 -473
-821 -473 -377 -280 -303 -326 -326 -326 -397 -469 -472 -475 -513 -552 -532 -511 -526 -542 -539 -536 -534 -531 -507 -482 -457 -433 -450 -467 -484 -501 -491 -481 -471 -461 -473 -486 -498 -510 -496 -483 -540
-830 -540 -598 -597 -597 -596 -596 -584 -572 -561 -549 -555 -561 -567 -573 -571 -569 -566 -564 -598 -632 -594 -556 -516 -476 -507 -539 -539 -540 -540 -540 -578 -615 -581 -547 -549 -552 -483 -413 -460 -506 -517 -527 -512 -497 -481
-840d81J5rrj0rK1K0K1K0j3j3j4j3K9K8K9K8J5J4J5J4o4o4N6N5J0J0k6k6j9j8J7J7lmmlj5
-848c83j5j5j5J%P2P2NMMMm5m5j0rj6j6N5N6L3L3L3L3rqrrJ5J4n7n7RQRRJ8J8n3n4K9K9K9
-858b33K8k3k2k3k3L1L1L0L1NONNNNNNk7k6k7k7LLLLk2k3k2k3K0J9K0J9MNMM%%%%JJp0p1j7
-869c78j7N5N5OOOPL3L3l9l8K7K7K7K7k7k7o3o3L8L9l3l3J3J3n8n8J8J8j8j8N3N2J7J6m2m3
-877c69L0K9l4l3KLononk2k1N1N0qpO4O4k6k5k6k5K9K9L0K9j2j3j2j3PPPOPPPOPOOPN5N6o4
-887a31o3l6l6l6l5PPJ42r7J4J5jjj%jjmmmmj9k0J6J7m2m1L0L0qqqqJ1J2J1J2l1l1MNn9n9
-897d56O1O0j8j8J01J02l4l3l4l3J5J6J6J6l1l0l0l0%j%%jjjjllllM0M0NMj6j5N5N6j8j8j9
-907b63j8J6J6J6J6k0k0k0k0opopN0N0k2k2L4L5kkL2L1m0m0K0K1K0K0n9o0J3J2j1j0j0j0n
$$ plain form
-840 -481 -466 -475 -484 -494 -503 -482 -462 -441 -421 -434 -447 -461 -474 -445 -417 -388 -360 -345 -331 -316 -302 -366 -430 -374 -319 -309 -299 -325 -351 -370 -388 -371 -354 -357 -361 -365 -368 -383
-848 -383 -398 -413 -428 -427 -427 -355 -283 -278 -274 -270 -266 -311 -356 -366 -375 -391 -407 -352 -296 -263 -230 -197 -164 -173 -181 -190 -199 -184 -170 -227 -284 -275 -267 -258 -249 -231 -213 -266 -320 -291 -262 -233
-858 -233 -205 -228 -250 -273 -296 -265 -234 -204 -173 -168 -162 -157 -152 -147 -142 -137 -132 -159 -185 -212 -239 -236 -233 -230 -227 -249 -272 -294 -317 -297 -278 -258 -239 -235 -230 -226 -222 -222 -222 -222 -222 -221 -220 -290 -361 -378
-869 -378 -395 -340 -285 -279 -273 -267 -260 -227 -194 -233 -271 -244 -217 -190 -163 -190 -217 -280 -343 -305 -266 -299 -332 -319 -306 -364 -422 -404 -386 -404 -422 -369 -317 -300 -284 -326 -369
-877 -369 -339 -310 -344 -377 -375 -372 -378 -383 -389 -394 -416 -437 -386 -336 -344 -351 -287 -223 -249 -274 -300 -325 -296 -267 -237 -208 -220 -233 -245 -258 -251 -244 -237 -231 -224 -217 -210 -204 -197 -191 -185 -178 -123 -67 -131
-887 -131 -194 -230 -266 -302 -337 -330 -323 -181 -278 -264 -249 -250 -251 -252 -252 -253 -254 -258 -262 -266 -270 -289 -309 -293 -276 -318 -359 -329 -299 -307 -315 -323 -331 -320 -308 -297 -285 -316 -347 -343 -338 -397 -456
-897 -456 -395 -335 -353 -371 -270 -168 -202 -235 -269 -302 -287 -271 -255 -239 -270 -300 -330 -360 -360 -361 -361 -361 -362 -363 -364 -365 -368 -371 -374 -377 -337 -297 -292 -288 -304 -319 -264 -208 -226 -244 -263
-907 -263 -281 -265 -249 -233 -217 -237 -257 -277 -297 -303 -310 -316 -323 -273 -223 -245 -267 -233 -198 -200 -202 -170 -139 -179 -219 -199 -178 -158 -138 -197 -257 -244 -232 -243 -253 -263 -273 -278
-915b78nmnrrrrL5L6l6l5K2K3K2K2POOPo1o1N9N9j6j5j5j5qpqqj4j4j4j4j4j4j4j4J1J1J1
-925c88J1j9j9j9j9K3K2K2K3M5M4k6k7K7K7K7K7ppppJ1J1J1J1J1J1J1J1l0l0l0l0k0k0r1r2
-933e02M6M5j15J70J6J5l8l8L6L6L6L5J4J3J4J3J3J4J3J3k7k8M5M4k7k6k7k7P9P9m0m0m1m1
-941b28L1L0j7j7j7j7K4K5K4K4nonoMMNMMMMMk2k2k1k2PQQQooooPQPQN2N2j9k0j3j3j4j3J3
-952a52J4n9n8J2J2J2J2K0K0J9K0KKKKj6j6j5j6M3M2k9k9RQRQJ2J2J1J2m8m8P2P1K3K1K3K2
-961F1j0j0j0j0K0K0K0K0j1j0j1j1k8k9k7k9qqqqK2K1K2K2nnnonnnnqrqqL1L2l9m0RJ0RJ0
-971e2RJ0RJ0k4k3M8M6MLLLK8K8m3m3qqoqJ3J3n7n9pqpqM4M3p6p6K3K3K3K3l8l8kkJ3J3n8
-981b19n8N4N3j8j8J3J3J3J3L3L3l9l8JKKJqqrqRJ0RJ0K2K3K3K2m2m3P7P6j8k0J6J7n7n7J5
$$ plain form
-915 -278 -283 -287 -292 -301 -310 -319 -328 -293 -257 -293 -328 -306 -283 -261 -239 -232 -226 -220 -213 -274 -335 -276 -217 -233 -248 -263 -278 -286 -293 -301 -309 -323 -337 -351 -365 -379 -393 -407 -421 -410 -399 -388
-925 -388 -377 -396 -415 -434 -453 -430 -408 -386 -363 -318 -274 -300 -327 -300 -273 -246 -219 -226 -233 -240 -247 -236 -225 -214 -203 -192 -181 -170 -159 -189 -219 -249 -279 -299 -319 -410 -502
-933 -502 -456 -411 -526 -356 -340 -325 -363 -401 -365 -329 -293 -258 -244 -231 -217 -204 -191 -177 -164 -151 -178 -206 -161 -117 -144 -170 -197 -224 -145 -66 -106 -146 -187 -228
-941 -228 -197 -167 -184 -201 -218 -235 -211 -186 -162 -138 -143 -149 -154 -160 -156 -152 -147 -143 -139 -135 -131 -127 -149 -171 -192 -214 -207 -199 -191 -183 -189 -195 -201 -207 -200 -192 -185 -177 -125 -73 -92 -112 -125 -138 -152 -165 -152
-952 -152 -138 -197 -255 -243 -231 -219 -207 -187 -167 -148 -128 -126 -124 -122 -120 -136 -152 -167 -183 -140 -98 -127 -156 -147 -139 -130 -122 -110 -98 -87 -75 -123 -171 -99 -28 -5 16 39 61
-961 61 51 41 31 21 41 61 81 101 90 80 69 58 30 1 -26 -55 -63 -71 -79 -87 -65 -44 -22 0 -5 -10 -15 -21 -26 -31 -36 -41 -49 -58 -66 -74 -43 -11 -50 -90 -81 -71 -62 -52
-971 -52 -43 -33 -24 -14 -38 -61 -13 33 37 40 43 46 74 102 59 16 8 0 -6 -14 -1 12 -45 -104 -111 -119 -126 -134 -90 -47 -123 -199 -176 -153 -130 -107 -145 -183 -185 -187 -174 -161 -219
-981 -219 -277 -223 -170 -188 -206 -193 -180 -167 -154 -121 -88 -127 -165 -164 -162 -160 -159 -167 -175 -184 -192 -183 -173 -164 -154 -132 -109 -86 -64 -106 -149 -72 4 -14 -34 -18 -1 -58 -115 -100
-990a00J4LKl3l3NOM1M1n6n6J5J5K3K2j3j3O1O1j0j0j4j4j4j4RRRQRRRQj4j5j5j5%
$$ plain form
-990 -100 -86 -83 -81 -114 -147 -142 -136 -95 -54 -110 -166 -151 -136 -113 -91 -104 -117 -56 5 -5 -15 -29 -43 -57 -71 -62 -53 -44 -36 -27 -18 -9 -1 -15 -30 -45 -60 -60
-998f0
##$OBSERVED INTEGRALS=	(X Y Z)
(7.1250510200890948553, 7.1801055560195763405, 0.97932153864583593172)
(6.9900191808978160424, 7.0302157707484820293, 0.96530273169424007929)
(6.902672780583044343, 6.9604096857315882474, 1.9952926606188261527)
(6.8889231816296838673, 6.9005618463038969068, 0.18387930689159537323)
(4.0685992353300788338, 4.1349350200750301099, 0.43130282388970425655)
(3.9943031564157336355, 4.0685992353300788338, 1.9789622880154214002)
(2.5233523601061578212, 2.5998760110514460564, 2)
(1.7114149352776018009, 1.8281391140914453608, 1.9978989106973097378)
(1.2335441519286194367, 1.3163484839076711186, 30.767674287276388867)
(1.3382966200948887003, 1.4041410286565441101, 4.6828568486186785691)
(1.4041410286565441101, 1.4834536116967185215, 2.8254077555517551623)
(0.82850127501904424765, 0.92976199424643846125, 3.1719056455660079585)
(6.8070233953212326838, 6.8803341153897559224, 0.57584758545448699874)
##END=	
##TITLE=	jf1520
##JCAMP-DX=	6.0	$$ MestReNova 14.1.0-24037
##BLOCK_ID=	3
##DATA TYPE=	NMR PEAK TABLE
##DATA CLASS=	PEAK TABLE
##CROSS REFERENCE=	NMR SPECTRUM: BLOCK_ID=2                                     
##.OBSERVE FREQUENCY=	399.79071365325000897
##.OBSERVE NUCLEUS=	^1H
##NPOINTS=	322
##FIRSTX=	-1.6380356588459159539
##LASTX=	12.453670280526980108
##XFACTOR=	1
##YFACTOR=	1
##FIRSTY=	6.6868028157914175913e-05
##XUNITS=	PPM
##YUNITS=	ARBITRARY UNITS
##PEAK TABLE=	(XYW..XYW)
-1.6380356588459159539,6.6868028157914175913e-05,0.02980000111589865136
-0.24571358213631522283,7.3919293328794394987e-05,0.024680885588948132947
-0.11060943074791060314,0.00010338699608870963219,0.054401264126250507835
0.081013869918592038011,8.5211265382144775037e-05,0.02777294168888025036
0.21683430875955111983,8.3083718669824054058e-05,0.10123672445666302699
0.31200532361236121837,8.4460667480568173485e-05,0.016993636854014185222
0.36375568849600498078,9.4370402304542441762e-05,0.052450117658398548448
0.46739192674891488766,6.6320143752189949669e-05,0.092163162269866774623
0.54964869351520306839,7.410625504564032648e-05,0.009724839054381696074
0.65141955196908052361,0.0008033370826897837276,0.0056060836901729782164
0.69563961984881483858,0.0003028061633174804982,0.26189175527648900221
0.70942455306912577395,0.00076994084469672022155,0.0028602467807004993555
0.72717435764257143394,0.0018451791426085321478,0.002451640097743284976
0.74413197315333601267,0.00061134058045104707532,0.0038503309214995445377
0.77107823162761102154,0.00018000686156854404474,0.0040434578989691580958
0.77973087520140949014,0.00095100223391778352603,0.0044300893716903121111
0.78837084871369522698,0.00012374016818920074382,0.0026526038998656359044
0.79803645459789296357,0.00033417783669604280827,0.0061557977366336518246
0.81053455640039684393,0.00047601585671651607673,0.0036861588630401863342
0.81519793528209572031,0.00049126865794820991171,0.0079077626087103447539
0.82740215865888977476,0.00034069358184329266151,0.0028356381964400063228
$$ [...]
Compound,None,,1,1.505637042717854257,0,0
Compound,None,,1,0.20824928334274378505,0,0
Compound,None,,1,1.4336076988276049704,0,0
Artifact,Artifact|Weak,,1,1.999999999999999778,0,0
Artifact,Artifact|Weak,,1,0.74643971023319344305,0,0
Artifact,Artifact|Weak,,1,-1,0,0
Artifact,Artifact|Weak,,1,-1,0,0
Artifact,Artifact|Weak,,1,-1,0,0
Impurity,Artifact|Weak,,1,-0.88981034829652339013,0,0
Compound,Artifact|Impurity|Weak|13C Sat.,,1,-0.62319411471017305271,0,0
Impurity,Artifact|Weak,,1,-1,0,0
Impurity,Artifact|Weak,,1,1.1855730651045344182,0,0
Compound,Artifact|Impurity|Weak|13C Sat.,,1,-0.060816819561902490943,0,0
Impurity,Artifact|Weak,,1,0.057347702151474000409,0,0
Compound,Artifact|Impurity|Weak|13C Sat.,,1,-1,0,0
Compound,Artifact|Impurity|Weak|13C Sat.,,1,-0.44668038700837742194,0,0
Compound,Artifact|Impurity|Weak|13C Sat.,,1,0.13865416402864277901,0,0
Compound,Artifact|Impurity|Weak|13C Sat.,,1,-0.11900721586280622877,0,0
Artifact,Artifact|Weak,,1,1.0709332091999506087,0,0
Compound,None,,1,0.90971581022897851643,0,0
Compound,None,,1,0.91941292328924129063,0,0
Artifact,Artifact|Weak,,1,-0.69522184219612326306,0,0
Artifact,Artifact|Weak,,1,1.934914851353118026,0,0
Compound,None,,1,1.106124310667342181,0,0
Compound,None,,1,1.1676618055661720508,0,0
Compound,None,,1,1.2039038321831059264,0,0
Artifact,Artifact|Weak,,1,-0.42871811702509826647,0,0
Compound,None,,1,0.52207106470042219382,0,0
Compound,None,,1,1.095233903465402614,0,0
Artifact,Artifact|Weak,,1,1.999999999999999778,0,0
Artifact,Artifact|Weak,,1,1.4750569711815422203,0,0
Artifact,Artifact|Weak,,1,-1,0,0
Impurity,Artifact|Weak,,1,-0.2000000000000000111,0,0
Impurity,Artifact|Weak,,1,1.9625033864277801054,0,0
Artifact,Artifact|Weak,,1,-0.82434530518557358469,0,0
Impurity,Artifact|Weak,,1,-0.25860848868054847616,0,0
Compound,Artifact|Impurity|Weak|13C Sat.,,1,0.93056784393557601121,0,0
Solvent,None,,1,1.18934518415603252,0,0
Impurity,Artifact|Weak,,1,0.51129171895538649828,0,0
Impurity,Artifact|Weak,,1,0.58577280581395507753,0,0
Impurity,Artifact|Weak,,1,1.999999999999999778,0,0
Impurity,Artifact|Weak,,1,0.11561545147990875959,0,0
Impurity,Artifact|Weak,,1,1.1999999999999999556,0,0
Impurity,Artifact|Weak,,1,0.80000000000000004441,0,0
Artifact,Artifact|Weak,,1,0.84578958173122342767,0,0
Impurity,Artifact|Weak,,1,0.41251237083315972498,0,0
Impurity,Artifact|Weak,,1,-1,0,0
Compound,Artifact|Impurity|Weak|13C Sat.,,1,0.42869309993877652287,0,0
Compound,Artifact|Impurity|Weak|13C Sat.,,1,0.66582028211220978253,0,0
Artifact,Artifact|Weak,,1,1.999999999999999778,0,0
Solvent,Artifact|Impurity|Weak|13C Sat.,,1,1.2776122153647146984,0,0
Impurity,Artifact|Weak,,1,1.1984132134465785846,0,0
Impurity,Artifact|Weak,,1,1.3999999999999999112,0,0
Artifact,Artifact|Weak,,1,0.1526929574873394091,0,0
Artifact,Artifact|Weak,,1,-0.2000000000000000111,0,0
Impurity,Artifact|Weak,,1,0.97656665531865982643,0,0
Artifact,Artifact|Weak,,1,-1,0,0
Impurity,Artifact|Weak,,1,0.82094722746412041037,0,0
##END=	
##END=	
