##TITLE=	pkl82.1.fid
1H NMR, 300K, only 1 and 4b are present

##JCAMP-DX=	6.0	$$ MestReNova 14.1.1-24571
##DATA TYPE=	LINK
##BLOCK_ID=	1
##BLOCKS=	1    
##ORIGIN=	Mestrelab Research S.L.
##OWNER=	hrzepa
##$MNOVA/LINK_BLOCK_TYPE=	ITEM	$$ NMR Spectrum
##$MNOVA/ITEM/POLYGON=	(XY..XY)
5321,5835
8722,5835
8722,8208
5321,8208
5321,5835
##$MNOVA/ITEM/Z=	0
##$MNOVA/ITEM/ANGLE=	0
##TITLE=	pkl82.1.fid
##JCAMP-DX=	6.0	$$ MestReNova 14.1.1-24571
##BLOCK_ID=	2
##DATA TYPE=	NMR SPECTRUM
##DATA CLASS=	XYDATA
##NUMDIM=	1
##ORIGIN=	Bruker BioSpin GmbH
##OWNER=	nmrsu
##.OBSERVE FREQUENCY=	300.13185342560802837
##.OBSERVE NUCLEUS=	^1H
##.SOLVENT NAME=	Tol
##.PULSE SEQUENCE=	zg30
##LONGDATE=	2019/11/27 14:54:00.000
##.ACQUISITIONMODE=	SIMULTANEOUS (DQD)
##$ORIGINAL FORMAT=	Bruker XWIN-NMR
##$MNOVA/SCALES_VERSION=	9
##$PARAMETER FILE=	(acqus, ASCII, /var/folders/f6/rjf_tdyn2v98c5c0wvkgn4s80000gn/T/Xj$3md34SXie4i3d2bSLsQ/equilibrium%201%204b%205b%20300K/1/acqus, 0)
$$ ##TITLE= Parameter file, TOPSPIN		Version 3.0
$$ ##JCAMPDX= 5.0
$$ ##DATATYPE= Parameter Values
$$ ##NPOINTS= 11	$$ modification sequence number
$$ ##ORIGIN= Bruker BioSpin GmbH
$$ ##OWNER= nmrsu
$$ $$ 2019-11-27 14:54:28.808 +0100  nmrsu@CZC049C5SM
$$ $$ C:/Bruker/TopSpin3.0/data/King/nmr/pkl82/1/acqus
$$ $$ process C:\Bruker\TopSpin3.0\prog\mod\shimcntl.exe
$$ ##$ACQT0= -2.26890760309556
$$ ##$AMP= (0..31)
$$ 100 100 100 100 100 100 100 100 100 100 100 100 100 100 100 100 100 100
$$ 100 100 100 100 100 100 100 100 100 100 100 100 100 100
$$ ##$ANAVPT= -1
$$ ##$AQSEQ= 0
$$ ##$AQ_mod= 3
$$ ##$AUNM= <au_zg>
$$ ##$AUTOPOS= <11 >
$$ ##$BF1= 300.13
$$ ##$BF2= 300.13
$$ ##$BF3= 300.13
$$ ##$BF4= 300.13
$$ ##$BF5= 300.13
$$ ##$BF6= 300.13
$$ ##$BF7= 300.13
$$ ##$BF8= 300.13
$$ ##$BYTORDA= 0
$$ ##$CAGPARS= (0..11)
$$ 0 0 0 0 0 0 0 0 0 0 0 0
$$ ##$CFDGTYP= 0
$$ ##$CFRGTYP= 9
$$ ##$CHEMSTR= <none>
$$ ##$CNST= (0..63)
$$ 1 1 145 1 1 1 1 1 1 1 1 1 1 1 1 1 1 1 1 1 1 1 1 1 1 1 1 1 1 1 1 1 1 1 1
$$ 1 1 1 1 1 1 1 1 1 1 1 1 1 1 1 1 1 1 1 1 1 1 1 1 1 1 1 1 1
$$ ##$CPDPRG= <>
$$ ##$CPDPRG1= <>
$$ ##$CPDPRG2= <>
$$ ##$CPDPRG3= <>
$$ ##$CPDPRG4= <mlev16>
$$ ##$CPDPRG5= <>
$$ ##$CPDPRG6= <>
$$ ##$CPDPRG7= <>
$$ ##$CPDPRG8= <>
$$ ##$D= (0..63)
$$ 0 1 0 0 0 0 0 0 0 0 0 0 0 0 0 0 0.0002 0 0 0 0 0 0 0 0 0 0 0 0 0 0 0 0
$$ 0 0 0 0 0 0 0 0 0 0 0 0 0 0 0 0 0 0 0 0 0 0 0 0 0 0 0 0 0 0 0
$$ ##$DATE= 1574862868
$$ ##$DBL= (0..7)
$$ 120 120 120 120 120 120 120 120
$$ ##$DBP= (0..7)
$$ 150 150 150 150 150 150 150 150
$$ ##$DBPNAM0= <>
$$ ##$DBPNAM1= <>
$$ ##$DBPNAM2= <>
$$ ##$DBPNAM3= <>
$$ ##$DBPNAM4= <>
$$ ##$DBPNAM5= <>
$$ ##$DBPNAM6= <>
$$ ##$DBPNAM7= <>
$$ ##$DBPOAL= (0..7)
$$ 0.5 0.5 0.5 0.5 0.5 0.5 0.5 0.5
$$ ##$DBPOFFS= (0..7)
$$ 0 0 0 0 0 0 0 0
$$ ##$DE= 12
$$ ##$DECBNUC= <off>
$$ ##$DECIM= 3232
$$ ##$DECNUC= <off>
$$ ##$DECSTAT= 4
$$ ##$DIGMOD= 1
$$ ##$DIGTYP= 12
$$ ##$DL= (0..7)
$$ 0 120 120 120 120 120 120 120
$$ ##$DP= (0..7)
$$ 150 150 150 150 150 150 150 150
$$ ##$DP07= 0
$$ ##$DPNAME0= <>
$$ ##$DPNAME1= <>
$$ [...]
$$ ##$RX22TY= <no>
$$ ##$RXFMAX= (0..7)
$$ 432.5 -1 -1 -1 -1 -1 -1 -1
$$ ##$RXFMIN= (0..7)
$$ 5 -1 -1 -1 -1 -1 -1 -1
$$ ##$RXINTLV= (0..7)
$$ 1 0 0 0 0 0 0 0
$$ ##$RXMSTY= <no>
$$ ##$SCMTY= <no>
$$ ##$SGUC1= (0..15)
$$ 18 19 0 0 0 0 0 0 0 0 0 0 0 0 0 0
$$ ##$SGUC2= (0..15)
$$ 33 256 0 0 0 0 0 0 0 0 0 0 0 0 0 0
$$ ##$SPECTR= 10
$$ ##$SY2FLAG= 0
$$ ##$SYNCTRIG= 11
$$ ##$ShimPowMaxUA= (0..63)
$$ 130000 130000 130000 130000 130000 130000 130000 130000 130000 130000 130000
$$ 130000 130000 130000 130000 130000 130000 130000 130000 130000 0 0 0 0
$$ 0 0 0 0 0 0 0 0 0 0 0 0 0 0 0 0 0 0 0 0 0 0 0 0 0 0 0 0 0 0 0 0 0 0 0 0
$$ 0 0 0 0
$$ ##$ShimPowMaxUC= (0..63)
$$ 130000 130000 130000 130000 130000 130000 130000 130000 130000 130000 130000
$$ 130000 130000 130000 130000 130000 130000 130000 130000 130000 0 0 0 0
$$ 0 0 0 0 0 0 0 0 0 0 0 0 0 0 0 0 0 0 0 0 0 0 0 0 0 0 0 0 0 0 0 0 0 0 0 0
$$ 0 0 0 0
$$ ##$ShimPowMaxUG= (0..63)
$$ 524287 524287 524287 524287 524287 524287 524287 524287 524287 524287 524287
$$ 524287 524287 524287 524287 524287 524287 524287 524287 524287 0 0 0 0
$$ 0 0 0 0 0 0 0 0 0 0 0 0 0 0 0 0 0 0 0 0 0 0 0 0 0 0 0 0 0 0 0 0 0 0 0 0
$$ 0 0 0 0
$$ ##$ShimPowRcbType= 3
$$ ##$ShimPowRes= (0..63)
$$ 1e-020 1e-020 1e-020 1e-020 1e-020 1e-020 1e-020 1e-020 1e-020 1e-020 1e-020
$$ 1e-020 1e-020 1e-020 1e-020 1e-020 1e-020 1e-020 1e-020 1e-020 0 0 0 0
$$ 0 0 0 0 0 0 0 0 0 0 0 0 0 0 0 0 0 0 0 0 0 0 0 0 0 0 0 0 0 0 0 0 0 0 0 0
$$ 0 0 0 0
$$ ##$ShimPowRng0= (0..63)
$$ 1 1 1 1 1 1 1 1 1 1 1 1 1 1 1 1 1 1 1 1 0 0 0 0 0 0 0 0 0 0 0 0 0 0 0 0
$$ 0 0 0 0 0 0 0 0 0 0 0 0 0 0 0 0 0 0 0 0 0 0 0 0 0 0 0 0
$$ ##$ShimPowRng1= (0..63)
$$ 1 1 1 1 1 1 1 1 1 1 1 1 1 1 1 1 1 1 1 1 0 0 0 0 0 0 0 0 0 0 0 0 0 0 0 0
$$ 0 0 0 0 0 0 0 0 0 0 0 0 0 0 0 0 0 0 0 0 0 0 0 0 0 0 0 0
$$ ##$ShimPowRng2= (0..63)
$$ 1 1 1 1 1 1 1 1 1 1 1 1 1 1 1 1 1 1 1 1 0 0 0 0 0 0 0 0 0 0 0 0 0 0 0 0
$$ 0 0 0 0 0 0 0 0 0 0 0 0 0 0 0 0 0 0 0 0 0 0 0 0 0 0 0 0
$$ ##$ShimPowRng3= (0..63)
$$ 1 1 1 1 1 1 1 1 1 1 1 1 1 1 1 1 1 1 1 1 0 0 0 0 0 0 0 0 0 0 0 0 0 0 0 0
$$ 0 0 0 0 0 0 0 0 0 0 0 0 0 0 0 0 0 0 0 0 0 0 0 0 0 0 0 0
$$ ##$ShimSysFunc= (0..63)
$$ 1 2 3 4 5 7 9 11 15 16 8 10 12 14 6 17 13 18 19 20 0 0 0 0 0 0 0 0 0 0
$$ 0 0 0 0 0 0 0 0 0 0 0 0 0 0 0 0 0 0 0 0 0 0 0 0 0 0 0 0 0 0 0 0 0 0
$$ ##$ShimSysMatrix= 0
$$ ##$ShimSysType= 1
$$ ##$TFXNUM= 0
$$ ##$TRIPLO2= 0
$$ ##$VTU= 2
$$ ##$VTUETH= <149.236.99.20>
$$ ##$VTUTY= <no>
$$ ##$WBREFAM= (0..15)
$$ 20.9 49.1 100 100 100 100 100 100 100 100 100 100 100 100 100 100
$$ ##$WBREFLM= (0..15)
$$ 0 0 0 0 0 0 0 0 0 0 0 0 0 0 0 0
$$ ##$WBREFPH= (0..15)
$$ 72.55 -68.79 0 0 0 0 0 0 0 0 0 0 0 0 0 0
$$ ##$XFAC= 2
$$ ##END=
$$ 
##$DECIM=	3232
##$DSPFVS=	20
##XUNITS=	HZ
##YUNITS=	ARBITRARY UNITS
##FIRSTX=	4947.4850139735199264
##LASTX=	-1240.5393747080358935
##DELTAX=	-0.094423199644183358759
##XFACTOR=	1
##YFACTOR=	0.0021938771902804202196
##FIRSTY=	8.7094173431396484375
##MINY=	-6.989330291748046875
##MAXY=	18113.654296875
##NPOINTS=	65536
##XYDATA=	(X++(Y..Y))
$$ [...]
1283g28j8j8j8MMMML2L3L2L3P1P1l9l9m3m2NNj6j7o4o3m2m1OOJ9J9K0J9J0J0J0J0j3j2j3j3
1280h12J9K0O7O6kkkkj4j4L3L3j2j2j1j2j2j2j2j1J9J9k9k8J5J5O3O2L6L5L6L5j3j2j3j3j1
1276d88j1j1j1J6J7J6J6k0k1k1k1RJ0RJ0n7n6rr%%%%K1K1K2K1K0K1k7k7%%j%ll%%RN6N8J2
1272d32n4oM3mk8N0J08O2NNNNP0J18M3M3M5M6M5M6K3K4K4K4L3L3k0o6m8m8l2J4Om0n9n9oo
1269A2n2n4n4n5K4K5ppl7J1Q0L2J0l7q2q2o4j7L6L7L6L6L0j8l9l8J2J3J3J2M3M2M2M3L5L5
1265A6Q2Q3L5L6L5L6N8N8N8N8L5L4L5L4J02J01R9R8N2MNN2K9K9J1l6m1m0LLj9j9o7o6p9p9
1262H35j05n8j3j3J7l1o4o5k1k1M1M0l8l9k4k3k4k4jkjjL5L5L6L5O2O2J4J5M8M8M7M8J2J1
1258H73N9N8M0M0J18J18R2R2R1R2Q8Q7J34J35M6M6M6M6J13J13O5O6K5K5K5K5J7J6J6J7n0n0
$$ plain form
1283 -728 -746 -764 -782 -778 -774 -770 -766 -734 -701 -669 -636 -565 -494 -533 -572 -615 -657 -652 -647 -663 -680 -744 -807 -849 -890 -884 -878 -859 -840 -820 -801 -791 -781 -771 -761 -774 -786 -799 -812
1280 -812 -793 -773 -706 -640 -642 -644 -646 -648 -662 -676 -643 -610 -622 -634 -645 -657 -669 -681 -693 -704 -685 -666 -695 -723 -708 -693 -630 -568 -532 -497 -461 -426 -439 -451 -464 -477 -488
1276 -488 -499 -510 -521 -505 -488 -472 -456 -476 -497 -518 -539 -530 -520 -511 -501 -558 -614 -623 -632 -632 -632 -632 -632 -611 -590 -568 -547 -527 -506 -533 -560 -560 -560 -561 -561 -564 -567 -567 -567 -558 -502 -444 -432
1272 -432 -486 -492 -449 -453 -481 -431 -323 -261 -256 -251 -246 -241 -171 -53 -10 33 78 124 169 215 238 262 286 310 343 376 356 290 242 194 162 176 182 142 83 24 18 12
1269 12 -40 -94 -148 -203 -179 -154 -161 -168 -205 -194 -114 -82 -72 -109 -191 -273 -337 -354 -318 -281 -245 -209 -179 -197 -236 -274 -262 -249 -236 -224 -181 -139 -97 -54 -19 16
1265 16 98 181 216 252 287 323 381 439 497 555 590 624 659 693 795 896 995 1093 1145 1149 1154 1206 1235 1264 1275 1239 1198 1158 1161 1164 1145 1126 1059 993 914 835
1262 835 730 672 659 646 663 632 568 503 482 461 502 542 504 465 441 418 394 370 369 367 366 365 400 435 471 506 568 630 644 659 707 755 802 850 862 873
1258 873 932 990 1030 1070 1188 1306 1398 1490 1581 1673 1761 1848 1982 2117 2163 2209 2255 2301 2414 2527 2592 2658 2683 2708 2733 2758 2775 2791 2807 2824 2774 2724
1255B724l4J4lq1j45j44m1m1m1m1m3m2m3m2n9n9o0n9O3O2j6j6m4m4m4m4%jM6M7K5K4K5K5J7
1252A885J7R5R6N8N8J34J34J19P2N4J34J81J81J87J86J63J62J63J62K03K03K03K03J58J58
1250E369J11J11J54J55J19M1KKn4n3j4o0j44j44r7r7j47j47k05k52k09r9j09j09j02j02j22
1247C798j22j48j02o2o2o0o0n9o0n6n7K2O9M2M2O5O5O7O8L0P8Q1L3M1Q9N8N9P5P4J26J74K24
1244D532K24J75J27J55J54K03K51K66K65K21K22K14K13J67J67J58J59J12J11J5J5n1j30j67
1242G778j67j93k40k87k87k37j91j97j97j94j94j67j67j67j66j58j58j28j76j15o9r7r8o0
1240C668n9n7n6m2Ok1k1mnm8m9o4j7O7O6M4M4J23J23J22J22M2oJ7O5J49J98K04K05J61J60
1237E137J34J34J34J34J31J31Q4Q4J02J03qqm9m8r6r5j72j72j71j72j30j31k09k10j53j53
$$ plain form
1255 2724 2690 2704 2701 2620 2475 2331 2290 2249 2208 2167 2124 2082 2039 1997 1938 1879 1819 1760 1823 1885 1869 1853 1809 1765 1721 1677 1677 1676 1722 1769 1794 1818 1843 1868 1885
1252 1885 1902 1997 2093 2151 2209 2343 2477 2596 2668 2722 2856 3037 3218 3405 3591 3754 3916 4079 4241 4444 4647 4850 5053 5211 5369
1250 5369 5480 5591 5745 5900 6019 6060 6062 6064 6010 5957 5943 5883 5739 5595 5498 5401 5254 5107 4902 4650 4441 4342 4233 4124 4022 3920 3798
1247 3798 3676 3528 3426 3364 3302 3242 3182 3123 3063 3007 2950 2972 3041 3083 3125 3190 3255 3322 3390 3420 3498 3579 3612 3653 3742 3800 3859 3934 4008 4134 4308 4532
1244 4532 4756 4931 5058 5213 5367 5570 5821 6087 6352 6573 6795 7009 7222 7389 7556 7714 7873 7985 8096 8111 8126 8075 7945 7778
1242 7778 7611 7418 7178 6891 6604 6367 6176 5979 5782 5588 5394 5227 5060 4893 4727 4569 4411 4283 4107 3992 3923 3826 3728 3668
1240 3668 3609 3552 3496 3454 3460 3439 3418 3414 3409 3361 3312 3248 3231 3298 3364 3408 3452 3575 3698 3820 3942 3984 3978 3995 4060 4209 4407 4611 4816 4977 5137
1237 5137 5271 5405 5539 5673 5804 5935 6019 6103 6205 6308 6300 6292 6243 6195 6099 6004 5832 5660 5489 5317 5187 5056 4847 4637 4484 4331
1234D331j54j53j21j22j21j21j02j01j02j01r4r5r4r4m3m3m3m3m6m7m6m6j9j9j9j9ONNOJ7
1231B362J7J7J7M6M6M6M6L4L4L4L4O4O4O4O4P2P3ooL8L8L8L8L3L3L4L3n5n6n5n5mmmmo9o8
1228C033o9o8kjkjJ5J5J5J6l6l6l6l6J1J1J2J1%%j%N8N7N8N8M3M3M9M8OJ00J26J26J36J35
1224C894J83J83J76J76J76J76K23K22K69K70K90K90L37L37M40M41M40M41N18N18N97N97O63
1222A1857O63P07P08O70O24N55M62L69K75J65P0Jr2j98k91l31l30l36l36l94l93l15l15k75
1220A3520k75j96j96j70j71n5n4j8P8P7P7R8J92K21K21K72L20L49M45M93M94M99N00O48O48
1218A8017P65P64P68Q62R35J030J162J256J370J465J577J734J962K183K386K544K784L130
1216D6694L424L771M097M318M532M689M730M682M497M151L567K842J944R04q8j065j963k752
$$ plain form
1234 4331 4177 4024 3903 3781 3660 3539 3437 3336 3234 3133 3039 2944 2850 2756 2713 2670 2627 2584 2538 2491 2445 2399 2380 2361 2342 2323 2329 2334 2339 2345 2362
1231 2362 2379 2396 2413 2459 2505 2551 2597 2631 2665 2699 2733 2797 2861 2925 2989 3061 3134 3128 3122 3160 3198 3236 3274 3307 3340 3374 3407 3352 3296 3241 3186 3182 3178 3174 3170 3101 3033
1228 3033 2964 2896 2894 2893 2891 2890 2905 2920 2935 2951 2915 2879 2843 2807 2818 2829 2841 2852 2852 2852 2851 2851 2909 2966 3024 3082 3125 3168 3217 3265 3271 3371 3497 3623 3759 3894
1224 3894 4077 4260 4436 4612 4788 4964 5187 5409 5678 5948 6238 6528 6865 7202 7642 8083 8523 8964 9482 10000 10597 11194 11857
1222 11857 12520 13227 13935 14605 15229 15784 16246 16615 16890 17055 17125 17126 17034 16836 16545 16214 15884 15548 15212 14818 14425 14110 13795 13520
1220 13520 13245 13049 12853 12683 12512 12457 12403 12385 12463 12540 12617 12715 12907 13128 13349 13621 13941 14290 14735 15228 15722 16221 16721 17369 18017
1218 18017 18782 19546 20314 21176 22111 23141 24303 25559 26929 28394 29971 31705 33667 35850 38236 40780 43564 46694
1216 46694 50118 53889 57986 62304 66836 71525 76255 80937 85434 89585 93152 95994 97938 98842 98754 97689 95726 92974
1214I2974l298l646l794l888l896l802l551l329l102k817k526k241j970j750j554j272j043
1213D5495q85p08o14m99l42j53MJ15K09L45M39N22O17P42R00J064J223J374J469J645J804
1211E4766J969K126K299K521K697K918L257L603L989M463N005N667O365P026P802Q715R697
1209A34885J0674J1764J2805J3674J4337J4631J4412J3603J1933R439O258K542j397n174q545
1208B55841j1101j2898j3897j4181j3790j3127j2202j1100j0056r080q150p236o404n616m938
1206A02065m277l725l190k760k414k101j817j486j203j055q36o26m06k19KK34M55O53Q11J052
1204G9157J272J537J759J935K156K381K665K929L275L653M000M406M941N554O280P051P965
1203A42916Q967J0070J1315J2669J4190J5733J7210J8629J9772K0560K0714J9863J7809J4501
$$ plain form
1214 92974 89676 86030 82236 78348 74452 70650 67099 63770 60668 57851 55325 53084 51114 49364 47810 46538 45495
1213 45495 44610 43902 43288 42789 42447 42294 42298 42413 42622 42967 43406 43928 44545 45287 46187 47251 48474 49848 51317 52962 54766
1211 54766 56735 58861 61160 63681 66378 69296 72553 76156 80145 84608 89613 95280 101645 108671 116473 125188 134885
1209 134885 145559 157323 170128 183802 198139 212770 227182 240785 252718 262157 268415 270957 269560 264386 255841
1208 255841 244740 231842 217945 203764 189974 176847 164645 153545 143489 134409 126259 119023 112619 107003 102065
1206 102065 97788 94063 90873 88113 85699 83598 81781 80295 79092 78037 77201 76575 76169 75950 75952 76186 76641 77294 78105 79157
1204 79157 80429 81966 83725 85660 87816 90197 92862 95791 99066 102719 106719 111125 116066 121620 127900 134951 142916
1203 142916 151883 161953 173268 185937 200127 215860 233070 251699 271471 292031 312745 332608 350417 364918
1201C64918R944M431j635p653j3009j7326k0263k1808k2150k1552k0247j8578j6873j5140
1200A83059j3438j1831j0406r177q093p117o243n455m770m108l584l174k814k468k133j912
1199H6336j737j515j245j086r18o96m65k44M7K66M40N98P81R38J147J304J463J683J983K266
1197I1346K589K935L333L806M350M948N606O205P002P916Q826R802J0814J1790J2702J3490
1195B07460J3937J3937J3375J2084R944O950L276q52n031q906j2037j4337j5674j6147j5961
1194A92018j5237j4177j2948j1649j0483r435q394p438o524n760n035m444l972l496l086k783
1192F7157k499k259j975j771j613j457j300j150j055q80o58m68l73l20l20l09l08k32j38o1
1190D8011L4J85L43N16O74Q00J020J226J446J662J947K179K462K793L077L376L597L827M048
$$ plain form
1201 364918 374862 379293 377658 370005 356996 339670 319407 297599 275449 253897 233650 215072 198199 183059
1200 183059 169621 157790 147384 138207 130114 122997 116754 111299 106529 102421 98837 95663 92849 90381 88248 86336
1199 86336 84599 83084 81839 80753 79835 79139 78674 78430 78477 78743 79183 79781 80562 81500 82647 83951 85414 87097 89080 91346
1197 91346 93935 96870 100203 104009 108359 113307 118913 125118 132120 140036 148862 158664 169478 181268 193970 207460
1195 207460 221397 235334 248709 260793 270737 277687 280963 280111 275080 266174 254137 239800 224126 207979 192018
1194 192018 176781 162604 149656 138007 127524 118089 109695 102257 95733 89973 84938 80494 76522 73026 69940 67157
1192 67157 64658 62399 60424 58653 57040 55583 54283 53133 52078 51198 50540 50072 49699 49379 49059 48750 48442 48210 48072 48011
1190 48011 48045 48230 48573 49089 49763 50563 51583 52809 54255 55917 57864 60043 62505 65298 68375 71751 75348 79175 83223
1188H3223M187M188L943L660L174K448J553N76m48j614k677l591m292m828n172n329n263n105
1187F8633m802m455m077l730l413l129k862k578k300k080j812j591j457j300j190j032r35
1185B5890q41p23o28n27l70l00k06j87j88k08k55k95l90m18m19m61m62m02l07j95j48j37m3
1183A7780K5J20P2P3J87J86J37K31L45L91L71L71L53L52L46L47K29J34O3J6n4k11l14m09n05
1181B0636n99o99p45p90p90p46p46o63o63o13o13n51n03m42l47k85k84k78k78j51j50p1p2
1178I557l1l1J6J6P7P7J50J50J94J00Om2j00j01j51j51r2r2j3j3J5J5R4R4J39J39O0O1mln0
1176A0086n1j19j20j19j20k13k12k13k13k18k19k19k18k02k02j97j96j19m1q4q5p9q0p9q0
1173F388L0L0K9L0%%M7M7J58J58J11J11J16J15O6O5K5k2m0L9J61J61Q7Q7Q1Q1Q1Q1O5O5K06
$$ plain form
1188 83223 87410 91598 95541 99201 102375 104823 106376 106952 106504 104890 102213 98622 94330 89502 84330 79001 73738 68633
1187 68633 63831 59376 55299 51569 48156 45027 42165 39587 37287 35207 33395 31804 30347 29047 27857 26825 25890
1185 25890 25049 24326 23698 23171 22801 22501 22295 22108 21920 21712 21457 21162 20772 20354 19935 19474 19012 18610 18303 18108 17960 17823 17780
1183 17780 17805 17925 17997 18070 18257 18443 18580 18811 19156 19547 19918 20289 20642 20994 21340 21687 21916 22050 22113 22129 22075 21864 21550 21141 20636
1181 20636 20037 19338 18593 17803 17013 16267 15521 14858 14195 13582 12969 12418 11915 11473 11126 10841 10557 10279 10001 9850 9700 9629 9557
1178 9557 9526 9495 9511 9527 9604 9681 9831 9981 10175 10275 10281 10239 10139 10038 9887 9736 9644 9552 9539 9526 9541 9556 9650 9744 9883 10022 10082 10143 10139 10136 10086
1176 10086 10035 9916 9796 9677 9557 9344 9132 8919 8706 8488 8269 8050 7832 7630 7428 7231 7035 6916 6875 6791 6706 6627 6547 6468 6388
1173 6388 6418 6448 6477 6507 6507 6507 6554 6601 6759 6917 7028 7139 7255 7370 7436 7501 7526 7504 7464 7503 7664 7825 7912 7999 8080 8161 8242 8323 8388 8453 8659
1170H659K07J72J72K19K19K41K41J94J93K09K08J81J34N6n4j41j89k30k31k80k80l24l25k77
1168H974k76k40k39k40k40k38k39k34k33k06j28j24j25q6q7q6q7m5m5m5m5m8m8%jmmnmK2K1
1165E615O9O9M3M2M2M3J02J02J02J02P5P5J23J23J40J39J40J40J55J54J55J55J51J52J51J51
1163H510P3P3K0K1l9j18j55k01k15j67j96j97k08k07k08k08k23k22j75j76j12j12j13j12j60
1160E173j61j13j13j06j05k6p4q3mK3k4k3k2K1K2J3J3l5l4J7J7J7J7ONNNk9l0J7J8LLKLM8
1157D466M8M9M8K8K9K8K8J0J0J0RQQp1p1l4l4q2q1m8m8m8m8m2m3m2m2k3k3k3k3o9o9o9o9l7
1153C640l6l7l7m5m6j4O5O5J7KKK9L0K7K6L6j0n9j0KKK9j8m0q7o4o3l7l8J0J0O0O0Ql9p9p9
1150C282q2q2J1J2l3l3lM4%m7m7jJ5J5K5k2MNJ3J4J3J4M7M7K6k0m3m2L3L3J4J4o0j3N1N1N4
$$ plain form
1170 8659 8866 9038 9210 9429 9648 9889 10130 10324 10517 10726 10934 11115 11249 11305 11251 11110 10921 10691 10460 10180 9900 9576 9251 8974
1168 8974 8698 8458 8219 7979 7739 7501 7262 7028 6795 6589 6461 6337 6212 6126 6039 5953 5866 5821 5776 5731 5686 5638 5590 5590 5589 5585 5581 5576 5572 5594 5615
1165 5615 5684 5753 5796 5838 5880 5923 6025 6127 6229 6331 6406 6481 6604 6727 6867 7006 7146 7286 7441 7595 7750 7905 8056 8208 8359 8510
1163 8510 8583 8656 8676 8697 8658 8540 8385 8184 7969 7802 7606 7409 7201 6994 6786 6578 6355 6133 5958 5782 5670 5558 5445 5333 5173
1160 5173 5012 4899 4786 4680 4575 4549 4475 4392 4388 4411 4387 4364 4342 4363 4385 4398 4411 4376 4342 4359 4376 4393 4410 4416 4421 4426 4431 4402 4372 4389 4407 4410 4413 4415 4418 4466
1157 4466 4514 4563 4611 4639 4668 4696 4724 4734 4744 4754 4763 4771 4779 4708 4637 4603 4569 4487 4406 4358 4310 4262 4214 4172 4129 4087 4045 4022 3999 3976 3953 3884 3815 3746 3677 3640
1153 3640 3604 3567 3530 3485 3439 3425 3490 3555 3572 3574 3576 3605 3635 3662 3688 3724 3714 3655 3645 3647 3649 3678 3660 3620 3533 3469 3406 3369 3331 3341 3351 3411 3471 3479 3440 3361 3282
1150 3282 3200 3118 3129 3141 3108 3075 3072 3116 3116 3069 3022 3021 3036 3051 3076 3054 3058 3063 3076 3090 3103 3117 3164 3211 3237 3217 3174 3132 3165 3198 3212 3226 3166 3153 3204 3255 3309
1146C309N4M1M2L8L8M6kkM5O3O2J9J8RJ0OOM1pK0K0n0n0n0n0m7m7m4m4o4j8m4m4rrrqj2j2
1143C265J9k7o2J7mn1LLJ%%%M8M7NMk3K5P5P4P7P8N2N3NOL9L8M2M2M1Q8O3j5rP1J31J32O0
1139D413N9O0O0M1M0M1M1K9K9K9K9o7o7o6o7p0o9p0p0ppn4n4o7o6J3J3J3J4J4J4l6l5l6l5
1136D009j3j4o0o1l4l5M4M4N1N1N2N1KLM9M9L6L6L6L7M4M5M5M5N3N3N3N4K5K6K5K6L0L1L5
1133D923L5k0N9J25J25O4O3O3O4qpqppon4n3QQQRPOPPj3j3o0o0J1J0l6l7m2m3O8O8L9M0qp
1129E328j8j7j4j5M1Q7Q8M0M3M2M0L9J8J8qL9N9N8J3l5j3L5Q5Q4L5L5O1J4O0O0N7N7K9K9L0
1125F504K9P0P0P0P0P0O9O7O7N3NL4L5M8R5O9O9J8J7J8J7J8J7J8J7J2J3J2J2N5N6N5N5M9M8
1122H001M8M8M9M8M8M8N9O0Q8M2M1Q8O0N9J06J06P6J24J04N7Q6Q6N5N4Q3L7M8R5O6O6P1P0
$$ plain form
1146 3309 3363 3404 3446 3484 3522 3568 3566 3564 3609 3672 3734 3753 3771 3780 3790 3796 3802 3843 3836 3856 3876 3826 3776 3726 3676 3629 3582 3538 3494 3430 3412 3368 3324 3315 3306 3297 3289 3277 3265
1143 3265 3284 3257 3195 3212 3208 3157 3160 3163 3164 3164 3164 3164 3212 3259 3264 3268 3245 3270 3345 3419 3496 3574 3626 3679 3684 3690 3729 3767 3809 3851 3892 3980 4043 4028 4019 4090 4221 4353 4413
1139 4413 4472 4532 4592 4633 4673 4714 4755 4784 4813 4842 4871 4804 4737 4671 4604 4534 4465 4395 4325 4318 4311 4257 4203 4136 4070 4083 4096 4109 4123 4137 4151 4115 4080 4044 4009
1136 4009 3996 3982 3922 3861 3827 3792 3836 3880 3931 3982 4034 4085 4087 4090 4139 4188 4224 4260 4296 4333 4377 4422 4467 4512 4565 4618 4671 4725 4750 4776 4801 4827 4857 4888 4923
1133 4923 4958 4938 4997 5122 5247 5311 5374 5437 5501 5493 5486 5478 5471 5464 5458 5404 5351 5359 5367 5375 5384 5391 5397 5404 5411 5398 5385 5325 5265 5276 5286 5250 5213 5171 5128 5196 5264 5303 5343 5335 5328
1129 5328 5310 5293 5279 5264 5305 5392 5480 5520 5563 5605 5645 5684 5702 5720 5712 5751 5810 5868 5881 5846 5833 5868 5953 6037 6072 6107 6168 6182 6242 6302 6359 6416 6445 6474 6504
1125 6504 6533 6603 6673 6743 6813 6883 6952 7019 7086 7139 7144 7178 7213 7261 7356 7425 7494 7512 7529 7547 7564 7582 7599 7617 7634 7646 7659 7671 7683 7738 7794 7849 7904 7953 8001
1122 8001 8049 8097 8146 8194 8242 8290 8349 8409 8497 8539 8580 8668 8728 8787 8893 8999 9075 9199 9303 9360 9446 9532 9587 9641 9724 9761 9809 9904 9970 10036 10107 10177
1119A0177M4R1J16J16J19J19J13J14J13J14J28J29J28J29J73J73R5R5R4R5J69J68J28M9O7
1117A3056J14J15J15J18J18J22J21J22J21J38J39J38J38Q8Q8J67J66J32J31J78J79J42J41
1114A6087J42J41J25J25J25J25K17K17K18K17J98J98J50J50J22J21J99K00J51J51J97J98K06
1112A9980K06J58J59J95J95K74K73K51K51K51K52K20K21K20K21K28K28K27K28K16K17K16K16
1110B5103K13K13K12K13K57K56K56K56K42K42K42K42J78J78K57K56K17K17K18K17K52K53K52
1108C0442K53L09L10K31K31K47K48K48K47K65K65K65K64K38K37K40K40K35K83L03K25K33K80
1106C6339K49K50L23L23L23L23K88K87K88K88K81K82K81K82L01L01L02L01K73K74K70K70K97
1104D2996K50K76K77K28K28K28K28K40K39K40K40K33K32K33K32K03K03K47K48K53K06J86J85
$$ plain form
1119 10177 10221 10312 10428 10544 10663 10782 10895 11009 11122 11236 11364 11493 11621 11750 11923 12096 12191 12286 12380 12475 12644 12812 12940 12989 13056
1117 13056 13170 13285 13400 13518 13636 13758 13879 14001 14122 14260 14399 14537 14675 14763 14851 15018 15184 15316 15447 15625 15804 15946 16087
1114 16087 16229 16370 16495 16620 16745 16870 17087 17304 17522 17739 17937 18135 18285 18435 18557 18678 18877 19077 19228 19379 19576 19774 19980
1112 19980 20186 20344 20503 20698 20893 21167 21440 21691 21942 22193 22445 22665 22886 23106 23327 23555 23783 24010 24238 24454 24671 24887 25103
1110 25103 25316 25529 25741 25954 26211 26467 26723 26979 27221 27463 27705 27947 28125 28303 28560 28816 29033 29250 29468 29685 29937 30190 30442
1108 30442 30695 31004 31314 31545 31776 32023 32271 32519 32766 33031 33296 33561 33825 34063 34300 34540 34780 35015 35298 35601 35826 36059 36339
1106 36339 36588 36838 37161 37484 37807 38130 38418 38705 38993 39281 39562 39844 40125 40407 40708 41009 41311 41612 41885 42159 42429 42699 42996
1104 42996 43246 43522 43799 44027 44255 44483 44711 44951 45190 45430 45670 45903 46135 46368 46600 46803 47006 47253 47501 47754 47960 48146 48331
1101D8331J56J56J56J56J61J61K07K08J75J74K22K21J68J67J68J67J32J33J29J29J79J32J15
1099E2103J14J03J50J26J26J48J96K15K16J49J49J46J46J42R5R5J42J61J62J17J18P7P6R8
1097E5370J44Q9Q9R1R2P1P1P0P1Q3Q3L8L9J9O7J9k7J5J6m0q7l8l8m1m1o0o0M4M3k7j37j22
1094E5906j22n8n7j05j04r4r3r4r3j40j39j67j19j00j00j48j47j65k11k30j50j06j06j01j01
1092E2856j13j13j13j12j39j38j39j38j30j29j03j51j76j76j79j79j94j94j94j93j34j34j81
1089D9404j81j71j71j92k39k51k50k06k06k15k16k16k16k52k52k52k53l16l16k37k38k27k27
1087D4104k27k27k84k84k84k84k90k90l33l34k86k38k86l33k72k71l22l22k82k81k82k81k31
1085C7580k30k51k98k81k80k84k84k68k69k39k86k66k20k01k02k88k89k67k21k42k42k57l04
$$ plain form
1101 48331 48487 48643 48799 48955 49116 49277 49484 49692 49867 50041 50263 50484 50652 50819 50987 51154 51286 51419 51548 51677 51856 51988 52103
1099 52103 52217 52320 52470 52596 52722 52870 53066 53281 53497 53646 53795 53941 54087 54229 54324 54419 54561 54722 54884 55001 55119 55196 55272 55370
1097 55370 55514 55603 55692 55783 55875 55946 56017 56087 56158 56241 56324 56362 56401 56420 56487 56506 56479 56494 56510 56470 56383 56345 56307 56266 56225 56165 56105 56149 56192 56165 56028 55906
1094 55906 55784 55726 55669 55564 55460 55366 55273 55179 55086 54946 54807 54640 54521 54421 54321 54173 54026 53861 53650 53420 53270 53164 53058 52957 52856
1092 52856 52743 52630 52517 52405 52266 52128 51989 51851 51721 51592 51489 51338 51162 50986 50807 50628 50434 50240 50046 49853 49719 49585 49404
1089 49404 49223 49052 48881 48689 48450 48199 47949 47743 47537 47322 47106 46890 46674 46422 46170 45918 45665 45349 45033 44796 44558 44331 44104
1087 44104 43877 43650 43366 43082 42798 42514 42224 41934 41601 41267 40981 40743 40457 40124 39852 39581 39259 38937 38655 38374 38092 37811 37580
1085 37580 37350 37099 36801 36520 36240 35956 35672 35404 35135 34896 34610 34344 34124 33923 33721 33433 33144 32877 32656 32414 32172 31915 31611
1083C1611k77k30j86j85k26l05k87k40k67k67k61k61l14k67k46k47k51k51k51k51k48k48k51
1081B5794k52k22k69k70k22k22k23k66k67l09l09k62k62k01k01k04k03k16k64k81k02k03k02
1079B0262k76k76k29k28j81j81j38j38j38j38k13k13k13k13j62j62j62j62j48j47j48j47j48
1076A6101j47j47j48j74j75j74j74j47j47j46j47j74j73j73j74j56j57j09j10j22j23j23j22
1074A2659j51j50j50j50j08j07j55j55j98j98j50j51j15j15j15j14r0q9q9q9j44j44r7r7n9
1072I479o0n9o0n3n3j00j00j17j17j17j17p3p3p2p3o9o8k2k1n5n4j34j33q6q6q6q6o5o6o6
1069G138o6l9l9q6q7o6o5o6o6n7n7n6n7o1o1o1o1j23j23j3j3r8r7r8r8n0n0n1n0kkm9m9l5
1066E086l4L8L9K4p0o4o4PQl9m0m0l9m0l9o9p0k1k2jjjjj5j5j4j5o7o7k0k0n9n8n8n9k9l0
$$ plain form
1083 31611 31334 31104 30918 30733 30507 30202 29915 29675 29408 29141 28880 28619 28305 28038 27792 27545 27294 27043 26792 26541 26293 26045 25794
1081 25794 25542 25320 25051 24781 24559 24337 24114 23848 23581 23272 22963 22701 22439 22238 22037 21833 21630 21414 21150 20869 20667 20464 20262
1079 20262 19986 19710 19481 19253 19072 18891 18753 18615 18477 18339 18126 17913 17700 17487 17325 17163 17001 16839 16691 16544 16396 16249 16101
1076 16101 15954 15807 15659 15485 15310 15136 14962 14815 14668 14522 14375 14201 14028 13855 13681 13525 13368 13259 13149 13027 12904 12781 12659
1074 12659 12508 12358 12208 12058 11950 11843 11688 11533 11335 11137 10987 10836 10721 10606 10491 10377 10287 10198 10109 10020 9876 9732 9635 9538 9479
1072 9479 9419 9360 9300 9247 9194 9094 8994 8877 8760 8643 8526 8453 8380 8308 8235 8166 8098 8076 8055 8000 7946 7812 7679 7593 7507 7421 7335 7270 7204 7138
1069 7138 7072 7033 6994 6908 6821 6755 6690 6624 6558 6501 6444 6388 6331 6270 6209 6148 6087 5964 5841 5828 5815 5717 5620 5522 5424 5374 5324 5273 5223 5221 5219 5170 5121 5086
1066 5086 5052 5090 5129 5153 5083 5019 4955 4962 4970 4931 4891 4851 4812 4772 4733 4664 4594 4573 4551 4550 4549 4548 4547 4532 4517 4503 4488 4421 4354 4334 4314 4255 4197 4139 4080 4051 4021
1062D021k9l0l0k9l0k9n5n4n4n5l2l3J5J4j4j5o2o2LLLLl1l1l0l1o1o0J8J9M3M3l5l6L3L2
1059C322p8p8k0k0k0k0l1l0l0l0PQm1m0M1M0opmmnmj1j1O8O7qrn5n6k4k4k4k4m0m1m0m0k0
1055B658k0k1k0j9j9Ql9m8m7j9O0P1K5n2n1j4L3OPj9j8j9j9J2J2J1J2q3q2o5j8J7k9k7K1J1
1052B216J2J5J4j2j3j3j3PPOPL4L5L4L5RJ0J0J0L3L3J3l4m2m2j4o3l8Qo5o5qL9RJ0J6l1n2
1048B117n1m9n0K7K7J0l6j0j0o0o1k7N3L9L8L9L9Op3p3OJ3J3n9n8j5L2LKM2nj0L7M7l2j1L7
1045A937J7J6K0K0k8k8k4k5QN5P6P6M4M3l5l4onp9p8JR6M8m6n2n3K1K1M7M8o3o3l4l4J3J3
1041A933j3j2j3j2rj0rrm3m2m3m2kkklm6m6L3L2MLLLo1o0o6K8O3O2K2K1%%m7m7L6L5j1j2Q4
1038A700Q3L6L6pppqPPPPOPPPkkjkn6n6rrklkll1l1J6J6J6J6o3o3j3j2j3j3l5l6J2J2K3K3
$$ plain form
1062 4021 3992 3962 3932 3903 3873 3844 3789 3735 3681 3626 3594 3561 3576 3590 3576 3561 3499 3437 3440 3443 3446 3449 3418 3387 3357 3326 3265 3205 3223 3242 3285 3328 3293 3257 3290 3322
1059 3322 3244 3166 3146 3126 3106 3086 3055 3025 2995 2965 2972 2980 2939 2899 2940 2980 2974 2967 2963 2959 2954 2950 2939 2928 2996 3063 3055 3046 2991 2935 2911 2887 2863 2839 2799 2758 2718 2678 2658
1055 2658 2638 2617 2597 2578 2559 2567 2528 2480 2433 2414 2474 2545 2570 2518 2467 2453 2486 2492 2499 2480 2462 2443 2424 2436 2448 2459 2471 2388 2306 2241 2223 2240 2211 2184 2205 2216
1052 2216 2228 2243 2257 2245 2232 2219 2206 2213 2220 2226 2233 2267 2302 2336 2371 2380 2390 2400 2410 2443 2476 2489 2455 2413 2371 2357 2294 2256 2264 2199 2134 2126 2165 2174 2184 2200 2169 2117
1048 2117 2066 2017 1967 1994 2021 2031 1995 1985 1975 1915 1854 1827 1880 1919 1957 1996 2035 2041 1968 1895 1901 1914 1927 1868 1810 1795 1827 1830 1832 1874 1869 1859 1896 1943 1911 1900 1937
1045 1937 1954 1970 1990 2010 1982 1954 1930 1905 1913 1968 2044 2120 2164 2207 2172 2138 2132 2127 2048 1970 1971 2067 2115 2069 2017 1964 1985 2006 2053 2101 2038 1975 1941 1907 1920 1933
1041 1933 1920 1908 1895 1883 1874 1864 1855 1846 1803 1761 1718 1676 1674 1672 1670 1667 1621 1575 1608 1640 1644 1647 1650 1653 1592 1532 1466 1494 1557 1619 1641 1662 1662 1662 1615 1568 1604 1639 1628 1616 1700
1038 1700 1783 1819 1855 1848 1841 1834 1826 1833 1840 1847 1854 1860 1867 1874 1881 1879 1877 1876 1874 1818 1762 1753 1744 1742 1739 1737 1734 1703 1672 1688 1704 1720 1736 1673 1610 1597 1585 1572 1559 1524 1488 1500 1512 1535 1558
1033A558n6n6o0o0J9J9j6j5j6j6j9k0K8K8K1K1J8J8km9j9j9rL9J2J2nnP4P4J0Rl4l5l6J2O3
1030A488O4l1l0J8J7j7j8o4o5klkll7l8L8L9M0pj2L5L1m9p5k7n3n2m6m7k9J9rqmnM3M3lml
1026A132mo4o4J1J1mn1n1mrrooj1j1l8RK1K1k0k0RN6K7K7K8j8k2K6J9k9KJJ0J0L6j0m3m2J
1022I21KqqJ3N9O0N9J2J2j9o7l7l7n6rL8rk1k1k3k4OOj4o2nonol9QK9K9NNKKj5o3o6j8K2k6
1018F26NMPQPQkjkjM0M1J14O7llnon2n2%M8L9M0O9K2o1o1J6O4L7j0J6J7k1o8o8k1j4j5j5j5
1014G99pn5k8k8JJKJj0rn5n4L7Q4L6j1nol8RL8j0k7k7l4l5M5M4RRRRL6L6L3L2l4q1k0N8M2
1010G96M1j%J9J9J9J9%%%%L6L6L5L6j3j3j0j0nM3M0pm9r7p3p4j7j7j7j7k4k4n0mJ7J6k8k8
1007E94%j%%LMl9l9l0N0MNL1L2L1L1J6J6l1l1J5J5J5J5j2j2j3j2QPPQM5M4M5M5KJJKrroon
$$ plain form
1033 1558 1502 1446 1386 1326 1345 1364 1348 1333 1317 1301 1282 1262 1290 1318 1339 1360 1378 1396 1394 1345 1326 1307 1298 1337 1349 1361 1356 1351 1425 1499 1509 1518 1484 1449 1413 1425 1488
1030 1488 1552 1521 1491 1509 1526 1509 1491 1427 1362 1360 1357 1355 1352 1315 1277 1315 1354 1394 1387 1375 1410 1441 1392 1317 1290 1237 1185 1139 1092 1063 1082 1073 1065 1061 1056 1099 1142 1139 1135 1132
1026 1132 1128 1064 1000 1011 1022 1018 967 916 912 903 894 888 882 871 860 822 831 852 873 853 833 842 898 925 952 980 962 940 966 985 956 958 959 969 979 1015 1005 962 920 921
1022 921 923 915 907 920 979 1039 1098 1110 1122 1103 1036 999 962 906 897 935 926 905 884 861 837 843 849 835 773 768 762 757 751 712 720 749 778 783 788 790 792 777 714 648 630 652 626
1018 626 631 635 642 650 657 665 663 662 660 659 699 740 854 921 918 915 910 904 852 800 800 848 887 927 996 1018 957 896 912 976 1013 1003 1019 1036 1015 947 879 858 844 829 814 799
1014 799 792 737 709 681 682 683 685 686 676 667 612 558 595 679 715 704 699 693 655 664 702 692 665 638 604 569 614 658 667 676 685 694 730 766 799 831 797 716 696 754 796
1010 796 837 836 836 855 874 893 912 912 912 912 912 948 984 1019 1055 1042 1029 1019 1009 1004 1047 1087 1080 1031 934 861 787 770 753 736 719 695 671 621 617 634 650 622 594
1007 594 594 593 593 593 596 600 561 522 492 542 546 551 582 614 645 676 692 708 677 646 661 676 691 706 694 682 669 657 665 672 679 687 732 776 821 866 868 869 870 872 863 854 848 842 837
1002H37M3J5J6MNMNk4k3k3k3k8k9k5k5n3oM7M6j7j6j7j7n5n5n5n5j0rj0rK0K0k7k7k2k2K5
999D05K5poM1M1K7K8J0l7qM0J0J0JJJJj1j1qpk2K6jjm7m7J%J7J7ln1k5k5qM0P7P6l0l1k5k5
995D59k5k4j6j6j6j5kkM5M5%%m8m8jjkjo5o5J4J4QQl9l9k8k8k8k8J3J2J3J3J6J6J7J6L7L6
991B45j1j1m0m0L9L9%J%JMLm3m4j4j4j4j4l7l7J0J0QQPQl2l2M7M6NMm3m3m4m6KJJ1J0J1J0
987b9k5k5K2K1J0J0l7l7RRRRoonoK0K0K1J9l6l7J1J0J4J3l4l4K0K0K0K0J1J1l4l6n4n3K5K6
983a14j3j2J7k9J0N8K8K8l9l9l9l9L5L6m3m3k5k6J9J9K9j8l7l6j0L7J1J0J5J4ln0o1j4m3m3
980d10RRN8J05Q6L8j1j1j3j2o1o0nnnnqqqqnonnj2j3L5L6onnnl5l5M9R6P5P4j8r6p0k2ppM4
976b73M4P1K3k5k4j1L8M0pk5k5k3k3n0kO5O4R4M7m1m1l9l9k3N5L8rn6n6j1j1K1K1K1K1j6j6
$$ plain form
1002 837 880 895 911 915 920 924 929 905 882 859 836 808 779 754 729 676 670 717 763 746 730 713 696 641 586 531 476 466 457 447 438 458 478 451 424 402 380 405
999 405 430 423 417 458 499 526 554 564 527 519 559 569 579 580 581 582 583 572 561 553 546 524 550 549 548 501 454 455 455 472 489 486 435 410 385 377 417 494 570 540 509 484 459
995 459 434 410 394 378 362 347 345 343 388 433 433 433 385 337 336 335 333 332 267 202 216 230 238 246 207 168 140 112 84 56 69 81 94 107 123 139 156 172 209 245
991 245 234 223 183 143 182 221 221 222 222 223 227 230 187 143 129 115 101 87 50 13 23 33 41 49 56 64 32 0 47 93 98 102 59 16 -28 -74 -72 -71 -60 -50 -39 -29
987 -29 -54 -79 -57 -36 -26 -16 -53 -90 -81 -72 -63 -54 -60 -66 -71 -77 -57 -37 -16 3 -33 -70 -59 -49 -35 -22 -56 -90 -70 -50 -30 -10 1 12 -22 -58 -112 -165 -140 -114
983 -114 -127 -139 -122 -151 -141 -83 -55 -27 -66 -105 -144 -183 -148 -112 -155 -198 -223 -249 -230 -211 -182 -200 -237 -273 -283 -246 -235 -225 -210 -196 -199 -249 -310 -324 -367 -410
980 -410 -401 -392 -334 -229 -143 -105 -116 -127 -140 -152 -213 -273 -278 -283 -288 -293 -301 -309 -317 -325 -330 -336 -341 -346 -358 -371 -336 -300 -306 -311 -316 -321 -356 -391 -342 -246 -171 -97 -115 -211 -281 -303 -310 -317 -273
976 -273 -229 -158 -135 -160 -184 -195 -157 -117 -124 -149 -174 -197 -220 -270 -272 -207 -143 -49 -2 -43 -84 -123 -162 -185 -130 -92 -101 -157 -213 -224 -235 -214 -193 -172 -151 -167 -183
972a83j6j6J8J7o1o1OOQ5Q5J1J0J1J1L0L1K9L1j5j4r2r3k1k1k2k1j0j1j0j0J7J7J8J7J6J6
969a95J7J6MNMNJ2J2J3J2K7K7K7K6M1M0Q8Q7KKKKN9N8N9N8J35J35J99K92K94L88M67N62O32
965C614P27Q04Q04O36L53R8j22l97o82q29q29p76o83n56l99l47l48j64j64j38j38r0r0o3o3
963A58o3o3j6j6j4j6ppM0L9l3l3l3l4l4l3l4l3J1J1l5l6poool7l7J0J0j6j6j6j6j1j1j1j1
959d68j6j5j6j6K9K9m9n0lklkj0rQN5K9j8j9K9N9J2nol8l8l8l9J4J4O1O1M3M4on3m0QK5K6
956d13K9K9L0K9QQj3o0l8l9LLJ5l3p9p8o7M3J14O8M6kn6n7o7o8J4O0j5o2l1l0MN1N0Mm2m2
952f84m5m6mnnmJKP5P5N9k1k3k3llnoj1n8j0L6P0P0nok0j9N9N9PPm2q9o5j7L2L2j5j4j2j1
948f87jM7M7jmlpoKKLKL4L4j3j3NNNMm4m5LLJ9K0J9K0k0j9m9jK6k1QQOOOOk0k1K7K7L6L6L7
$$ plain form
972 -183 -199 -215 -197 -180 -241 -302 -296 -290 -205 -120 -109 -99 -88 -77 -47 -16 13 44 29 15 -77 -170 -191 -212 -234 -255 -265 -276 -286 -296 -279 -262 -244 -227 -211 -195
969 -195 -178 -162 -158 -153 -149 -144 -132 -120 -107 -95 -68 -41 -14 12 53 93 181 268 270 272 274 276 335 393 452 510 645 780 979 1271 1565 1953 2420 2982 3614
965 3614 4341 5145 5949 6585 6938 7036 6914 6517 5835 5006 4177 3401 2718 2162 1763 1416 1068 904 740 602 464 374 284 221 158
963 158 95 32 16 0 -14 -30 -37 -44 -4 35 2 -31 -64 -98 -132 -165 -199 -232 -221 -210 -245 -281 -288 -294 -300 -306 -343 -380 -370 -360 -376 -392 -408 -424 -435 -446 -457 -468
959 -468 -484 -499 -515 -531 -502 -473 -522 -572 -575 -577 -580 -582 -592 -601 -593 -538 -509 -527 -546 -517 -458 -446 -451 -457 -495 -533 -571 -610 -596 -582 -521 -460 -417 -373 -379 -432 -472 -464 -439 -413
956 -413 -384 -355 -325 -296 -288 -280 -293 -353 -391 -430 -427 -424 -409 -442 -521 -599 -666 -623 -509 -441 -395 -397 -453 -510 -577 -645 -631 -571 -586 -648 -679 -709 -705 -654 -604 -600 -642 -684
952 -684 -729 -775 -779 -784 -789 -793 -792 -790 -715 -640 -581 -602 -625 -648 -651 -654 -659 -665 -676 -734 -744 -708 -638 -568 -573 -579 -599 -618 -559 -500 -493 -486 -528 -617 -682 -699 -667 -635 -650 -664 -676 -687
948 -687 -688 -641 -594 -595 -599 -602 -609 -615 -613 -611 -608 -606 -572 -538 -551 -564 -559 -554 -549 -545 -589 -634 -631 -628 -609 -589 -570 -550 -570 -589 -638 -639 -613 -634 -626 -618 -612 -606 -600 -594 -614 -635 -608 -581 -545 -509 -472
944d72L6jjkjl7l7J1J0L5L5J4l2j1j0j3j4POOPk2k3N2Nn0n0noK9K9K8K9ppopn4n3K5K5J7J6
940d99J6J7L8L8L8L8J12J12J06J07J24M6n2n2p1p1q7j36j45r8p3k5j5L2QQJ2J1o9j17n0mM3
936f58M3K9j9o6j9j7j6j4j4J7J7J7J7k7k6k6k7J0J0J0J0k5k6k2k3j5L3L6j2k4K4L9L8Nm2j5
933g78j5K7K8K8K8lkonjm8o6o5m3NK5K5n4n5kM5NOQQj4j4j5j4ll%%n1lJ8J7mlM3M4N4N4k9
929h28p7p3p3k6k6NN2K9K8lM4M4lk5k4Jm5m6JJ9J9QPPPQPJ0J0j5L2M7M8N6k2mM3rqonl1l0
925h47J8O6L7j1qL9jkkjJ3l4qqk3k3k4k3L3L2L3L3J0J0l4l4nM2M3nl6l6J0N7K8j9j7L1K1K1
921f24K4K4K3K3k4k4J3J3J2J3j8j7j8j8k8k8k8k8j8j8m4KP5P5K8j9K3P0M3M3O0J08O0J3K1
918a88K1l0k9n0n0p6k9J1J1l0l0nM3M2mk5k4K0K0J6J7J7J6K3K2mM4O0O0O3O3J1J2L0P7P7L0
$$ plain form
944 -472 -436 -437 -438 -440 -441 -478 -515 -504 -494 -459 -424 -410 -442 -453 -463 -476 -490 -483 -477 -471 -464 -486 -509 -457 -452 -502 -552 -557 -563 -534 -505 -477 -448 -455 -462 -468 -475 -529 -582 -557 -532 -515 -499
940 -499 -483 -466 -428 -390 -352 -314 -202 -90 16 123 247 293 241 189 118 47 -40 -176 -321 -419 -492 -517 -532 -500 -492 -484 -472 -461 -530 -647 -697 -701 -658
936 -658 -615 -586 -605 -671 -690 -707 -723 -737 -751 -734 -717 -700 -683 -710 -736 -762 -789 -779 -769 -759 -749 -774 -800 -822 -845 -860 -827 -791 -803 -827 -803 -764 -726 -721 -763 -778
933 -778 -793 -766 -738 -710 -682 -685 -687 -693 -698 -699 -747 -813 -878 -921 -916 -891 -866 -920 -975 -977 -932 -927 -921 -913 -905 -919 -933 -948 -962 -965 -968 -968 -968 -1019 -1022 -1004 -987 -991 -994 -951 -907 -853 -799 -828
929 -828 -905 -978 -1051 -1077 -1103 -1098 -1046 -1017 -989 -992 -948 -904 -907 -932 -956 -955 -1000 -1046 -1045 -1026 -1007 -999 -992 -985 -978 -970 -963 -953 -943 -958 -926 -879 -831 -775 -797 -801 -758 -767 -775 -781 -786 -817 -847
925 -847 -829 -763 -726 -737 -745 -706 -707 -709 -711 -712 -699 -733 -741 -749 -772 -795 -819 -842 -809 -777 -744 -711 -701 -691 -725 -759 -764 -722 -679 -684 -720 -756 -746 -689 -661 -680 -697 -666 -645 -624
921 -624 -600 -576 -553 -530 -554 -578 -565 -552 -540 -527 -545 -562 -580 -598 -626 -654 -682 -710 -728 -746 -790 -788 -713 -638 -610 -629 -606 -536 -493 -450 -390 -282 -222 -209 -188
918 -188 -167 -197 -226 -276 -326 -402 -431 -420 -409 -439 -469 -474 -431 -389 -393 -418 -442 -422 -402 -386 -369 -352 -336 -313 -291 -295 -251 -191 -131 -68 -5 6 18 48 125 202 232
914B32N9N9N5N6L4j2j2j1m3LJ9k9m6m7n6n7l5J1KKm3m3LLMLj2j2j1j2N4N4P8L0K0k8J6O4O9
911D21O9qpRQN6N6P0P0rrK3K4K3K4JKQ0Q0J10J11J11J10M8M8M8M8R0Q9M2M2J00J00J46J47
907B373J29J29J30J29J06J06J06J06R8R7R7R8R4R3Qq6j46r8J1J1rrK6J20J77L34M06N01N91
905E728O38O18O17P32P31P69P70O66N08K55L4k32l89n06n05m13j93K6J84L47M42N21O16O66
902A2630P13P87Q82Q93R87J065J161J332J426J568J789K045K266K564K912L286L634M059M531
901E0530N062N533N806O026O281O564O856P517Q554J0160J2428J5359J9161K3793K9736L7266
899B56632M6912N9231P4899R3961J15429J36634J52889J58150J46892J16172O7736P966n3379
898A380124j06155j42669j59462j58320j44110j23051j00396p9735o2436m8773l8219l0109
$$ plain form
914 232 291 350 405 461 495 483 471 460 417 420 439 410 364 317 261 204 169 180 182 184 141 98 101 104 108 111 99 87 76 64 118 172 250 280 300 272 288 352 421
911 421 490 482 475 484 492 548 604 674 744 735 726 749 773 796 820 821 823 903 983 1093 1204 1315 1425 1473 1521 1569 1617 1707 1796 1838 1880 1980 2080 2226 2373
907 2373 2502 2631 2761 2890 2996 3102 3208 3314 3412 3509 3606 3704 3798 3891 3899 3813 3667 3569 3580 3591 3582 3573 3599 3719 3896 4230 4636 5137 5728
905 5728 6366 6984 7601 8333 9064 9833 10603 11269 11777 12032 12066 11834 11445 10939 10434 10021 9828 9854 10038 10385 10827 11348 11964 12630
902 12630 13343 14130 15012 15905 16892 17957 19118 20450 21876 23444 25233 27278 29544 32108 35020 38306 41940 45999 50530
901 50530 55592 61125 66931 72957 79238 85802 92658 100175 108729 118889 131317 146676 165837 189630 219366 256632
899 256632 303544 362775 437674 531635 647064 783698 936587 1094737 1241629 1357801 1425537 1433503 1380124
898 1380124 1273969 1131300 971838 813518 669408 546357 445961 366226 303790 255017 216798 186689
897A86689k3839j9014j5391j2595j0421q716p487o591n992n622n401n203m981m734m386l940
895D2376l404k928k581k194j848j678j520j358j262j180j086r35q40p41p40p28o34o08o08
893A5503o02o02o37p32p91r48j078j172j178j131r75p54m35k15M1J98J98J51J87J87J61J61
891E537J57J58P7L0l3j27j68j69k24k25l03l51l27k32k03j55r3m5n3n3n0n0q6q7j33j34o1
889B597o0J8J8n2n2n2n2m5m5r3r3p5p6k9k8q5q4noK7K7q0q0l1J7J7l1j08j08l0k9K2O9J4o6
885A331n4K6K3n6kM5J4J3j5j5O4J11P6klP7R4M6%jJ7J6o2o3l5l4n6j03q8q9r1r2n9n9n9n9
882H56j7j6j9j9l3q1q0l3j7j8j4j4J8J8J8J9n7n7qL9N6Qm0QO3J5l4l4k6k5J9J9j6o3q3q4k1
879B47k1K9P5N5Ql8l8JM8K2K2R3R3R3R3QQN8J04K6k2QQj0j0j0j0o6o6o5o6k2k3j9j9j2L6L9
$$ plain form
897 186689 162850 143836 128445 115850 105429 96713 89226 82635 76643 71021 65620 60417 55436 50702 46316 42376
895 42376 38972 36044 33463 31269 29421 27743 26223 24865 23603 22423 21337 20402 19562 18821 18081 17353 16719 16111 15503
893 15503 14901 14299 13662 12930 12139 11191 10113 8941 7763 6632 5657 4903 4468 4253 4294 4492 4690 4841 5028 5215 5376 5537
891 5537 5694 5852 5929 5959 5926 5799 5631 5462 5238 5013 4710 4359 4032 3800 3597 3442 3349 3304 3251 3198 3148 3098 3012 2925 2792 2658 2597
889 2597 2537 2555 2573 2521 2469 2417 2365 2320 2275 2182 2089 2014 1938 1909 1881 1796 1712 1707 1701 1728 1755 1675 1595 1564 1581 1598 1567 1459 1351 1321 1292 1314 1383 1397 1331
885 1331 1277 1303 1326 1270 1268 1313 1327 1340 1325 1310 1374 1485 1561 1559 1556 1633 1727 1773 1773 1772 1789 1805 1743 1680 1645 1611 1555 1452 1364 1275 1184 1092 1033 974 915 856
882 856 839 823 804 785 752 671 591 558 541 523 509 495 513 531 549 568 511 454 446 485 541 549 509 517 580 595 561 527 501 476 495 514 498 435 352 268 247
879 247 226 255 330 385 393 355 317 318 366 388 410 503 596 689 782 790 798 856 960 986 964 972 980 970 960 950 940 874 808 743 677 655 632 613 594 582 618 657
875F57ql1J6J7l1o2j4L5L5L5L5j5o1l6J2J1l6q1l3j3j3j4L3N0M9J7o2m4Ll0l1k4k5NN2N3N
871D56J3J4J0J1K7K7P5P4P9P8N2R9N9N8J5J4kkkkj1j0l8J0M5M6MMK4P1J20J20Q5L7J7J7J12
868A806J12J12J12J20J20J20J20J02J02J50J49Q6Q5J36J35K11K58K31K31K97K96L18L65M14
866F188M15M66M65M49M50M46M46M26L79K24J13M2o9j92l01l10l58m16m17m64m64m56l77l32
863F353k54k06j59m3MPm1l7l6QPPPPPM7M8R4R5R6R6J75J74K87K87L66L66M65M66N50N50N63
860A0356O58P20P67P71P71Q53Q53R52R51J023J117J284J504J737J957K241K525K816L036L221
858D0113L378L450L403L159K813K336J673R33J45o71j395k045k581k940l223l362l408l298
857C8480l077k788k442k060j776j474j253j084q64p41o47n91m97m06l12k80k80k24k24j03
$$ plain form
875 657 649 618 634 651 620 558 544 579 614 649 684 669 608 572 584 595 559 478 445 432 419 405 438 488 537 554 492 448 451 421 390 366 341 346 398 451 456
871 456 469 483 493 504 531 558 633 707 786 864 916 1015 1074 1132 1147 1161 1159 1157 1155 1153 1142 1132 1094 1104 1149 1195 1199 1203 1227 1298 1418 1538 1623 1660 1677 1694 1806
868 1806 1918 2030 2142 2262 2382 2502 2622 2724 2826 2976 3125 3211 3296 3432 3567 3778 4036 4267 4498 4795 5091 5409 5774 6188
866 6188 6603 7069 7534 7983 8433 8879 9325 9751 10130 10354 10467 10509 10440 10248 9947 9637 9279 8863 8446 7982 7518 7062 6685 6353
863 6353 6099 5893 5734 5691 5695 5702 5661 5624 5588 5596 5603 5610 5617 5624 5631 5678 5726 5820 5915 6011 6107 6282 6456 6743 7030 7396 7762 8227 8693 9243 9793 10356
860 10356 11014 11734 12501 13272 14043 14896 15749 16701 17652 18675 19792 21076 22580 24317 26274 28515 31040 33856 36892 40113
858 40113 43491 46941 50344 53503 56316 58652 60325 61258 61403 60732 59337 57292 54711 51771 48548 45186 41778 38480
857 38480 35403 32615 30173 28113 26337 24863 23610 22526 21662 20921 20274 19683 19186 18780 18468 18188 17908 17684 17460 17357
855A7357n5K9J25J68K63L53M49N93O89P59R17J024J118J240J335J442J537J617J665J743J837
853C6205J955K112K293K514K781L191L679M214M884N609O480P393Q252Q914R371R591R422
851A28860Q886P906O425M630K583L54j884m040n963p550q779r577r924r943r597q860p946
850G5581o929o016n083m231l503k905k392k046j735j451j285j064q61p66p49p49o48n54n01
848C2113m07k65j07P1K30L75N33P06R27J041J135J283J504J642J736J851K009K143K301K432
846E3253K527K688K909L263L737M256M918N727O641P716Q945J0209J1502J2521J3246J3501
845A67559J3216J2378J0960Q968O479L600M80k784n904q653j0889j2655j3757j4261j4166
843A40571j3567j2589j1254r773q364p072n867m826l857l131k513j978j523j240j055q97q31
$$ plain form
855 17357 17302 17331 17456 17624 17887 18240 18689 19282 19971 20730 21647 22671 23789 25029 26364 27806 29343 30960 32625 34368 36205
853 36205 38160 40272 42565 45079 47860 51051 54730 58944 63828 69437 75917 83310 91562 100476 109847 119438 128860
851 128860 137746 145652 152077 156707 159290 159644 157760 153720 147757 140207 131428 121851 111927 101984 92387 83527 75581
850 75581 68652 62636 57553 53322 49819 46914 44522 42476 40741 39290 38005 36941 36080 35314 34565 33816 33168 32614 32113
848 32113 31706 31441 31334 31405 31635 32010 32543 33249 34176 35217 36352 37635 39139 40781 42517 44368 46377 48520 50821 53253
846 53253 55780 58468 61377 64640 68377 72633 77551 83278 89919 97635 106580 116789 128291 140812 154058 167559
845 167559 180775 193153 204113 213081 219560 223160 223640 220856 214952 206299 195410 182755 168998 154737 140571
843 140571 127004 114415 103161 93388 85024 77952 72085 67259 63402 60271 57758 55780 54257 53017 51962 51065 50234
841E0234p36o73p21q23q24q23q23q15p68p23o29n09k89o0R8K41L99O67Q24R49J106J217J374
839D7893J518J675J821K042K228K512K847L319L878M478N150O002O936P851Q701R552J0064
838A28467J0221R978R252Q168O625M690K579K66k098m350o336q018r246r960j0179j0058r586
836A10415q817p714o533n303m142k976j921r43j5P74J479K078K463K621K602K444K054J518
834I0084Q32M4p36j524k303k965l440l786m007m007l950l729l316k843k343j933j564j217
833D7297q86o03l38j18R8K56M71P55R56J176J438J722K013K359K674K956L284L631L969M189
831G7299M202M107L931L648L136K537J905J243N11k77j084j809k461k933l205l206k959k486
829H2099j772r22N2J154K243L408M607N898P185Q288R147R745R974R753R107Q005O482M560
$$ plain form
841 50234 49498 48825 48104 47281 46457 45634 44811 43996 43228 42505 41876 41367 41078 41018 41116 41357 41756 42423 43247 44196 45302 46519 47893
839 47893 49411 51086 52907 54949 57177 59689 62536 65855 69733 74211 79361 85363 92299 100150 108851 118403 128467
838 128467 138688 148666 157918 166086 172711 177401 179980 180246 178148 173798 167462 159444 150198 140238 130059 120001 110415
836 110415 101598 93884 87351 82048 77906 74930 73009 72066 72051 72825 74304 76382 78845 81466 84068 86512 88566 90084
834 90084 90916 90960 90224 88700 86397 83432 79992 76206 72199 68192 64242 60513 57197 54354 52011 50078 48514 47297
833 47297 46411 45808 45470 45352 45450 45706 46177 46932 47888 49064 50502 52224 54237 56596 59270 62226 65510 69141 73110 77299
831 77299 81501 85608 89539 93187 96323 98860 100765 102008 102519 102242 101158 99349 96888 93955 90750 87544 84585 82099
829 82099 80327 79405 79457 80611 82854 86262 90869 96767 103952 112240 121387 131132 141106 150859 159966 167971 174453 179013
827A79013K332r5k589m951o991q661r874j0597j1018j1017j0547r759q765p599o428n451m530
826F2473l679l041k505k010j536j172q88o16l33j32K5K36L29L68M15M49M96N45N92O16O15
824E1247N37N37N84N84N08N09N14N14N36O30O47P43Q41J063J298J646K091K565L127L853M687
822G9261N727O999Q228R549J1031J2479J3772J4658J4941J4634J3657J2087R975P297M115
820B38410O02k959o278r336j1833j3693j4886j5422j5469j4997j4082j2728j1132r526p973
819G8698o619n508m532l657k995k421k012j645j299j026q70q14o57o00n06m71m71m39m39l89
817D1328l89l69l22k54j60o0L4J17K12L33M91N69O64Q25R83J129J286J559J842K149K559L045
815E7571L707M412N262O233P273Q446R550J0443J1105J1364J1208J0537R309P686N638L330
$$ plain form
827 179013 181345 181250 178661 173710 166719 158058 148184 137587 126569 115552 105005 95246 86481 78882 72454 67003 62473
826 62473 58794 55753 53248 51238 49702 48530 47642 47026 46693 46561 46586 46822 47151 47519 47934 48383 48879 49424 50016 50632 51247
824 51247 51784 52321 52905 53489 53997 54506 55020 55534 56070 56700 57347 58090 58931 59994 61292 62938 65029 67594 70721 74574 79261
822 79261 84988 91987 100215 109764 120795 133274 147046 161704 176645 191279 204936 217023 226998 234295 238410
820 238410 239012 236053 229775 220439 208606 194913 180027 164605 149136 134139 120057 107329 96197 86671 78698
819 78698 72079 66571 62039 58382 55387 52966 50954 49309 48010 46984 46114 45300 44643 44043 43537 43066 42595 42156 41717 41328
817 41328 40939 40570 40248 39994 39834 39774 39808 39925 40137 40470 40961 41530 42194 43019 44002 45131 46417 47976 49818 51967 54526 57571
815 57571 61278 65690 70952 77185 84458 92904 102454 112897 124002 135366 146574 157111 166420 174106 179744 183074
814A83074P15k058m673p021q942j0358j1335j1815j1816j1498j0837r888q722p549o445n418
812E5414m441l642l043k517k108j773j490j295j137r97q40p62p62p06p05o12o13n65n66n04
810B6336n04m73l78l04k08j46j46j28j29j02qL9L9J61L19M50M51N54P12Q86J043J307J716
808C1487K094K440K807L216L699M108M384M479M373M089L605L006K267J354L54o87j766k742
806G2567l496m093m494m714m737m643m380m033l568l096k681k333j971j625j354j132r94q35
805A8388o60o60n62m68m93m93m09m09l69l69l22l22k44k44j96j97j81j81p0p1j10j10o8o9
802A1111r9j94j93j00j31j32j68j69j05k7J7J7J05K46L20L67M54N65O20O68P11P11O59N49
800A5802N12M02K44P2j05k78m59o32p80q28q11q12p46p47o36o36n77n78m74l96l31k53k44
$$ plain form
814 183074 183789 181731 177058 170037 161095 150737 139402 127587 115771 104273 93436 83548 74826 67277 60832 55414
812 55414 50973 47331 44288 41771 39663 37890 36400 35105 33968 32971 32131 31369 30607 29901 29196 28584 27971 27406 26840 26336
810 26336 25832 25359 24981 24677 24469 24323 24177 24049 23920 23818 23810 23849 23888 24049 24368 24818 25269 25823 26535 27421 28464 29771 31487
808 31487 33581 36021 38828 42044 45743 49851 54235 58714 63087 67176 70781 73787 76054 77408 77762 77075 75309 72567
806 72567 69071 64978 60484 55770 51033 46390 42010 37977 34409 31313 28632 26299 24328 22703 21349 20217 19223 18388
805 18388 17728 17068 16506 16038 15545 15052 14643 14234 13865 13496 13174 12852 12608 12364 12168 11971 11790 11609 11539 11468 11358 11248 11180 11111
802 11111 11012 10818 10625 10525 10394 10262 10094 9925 9820 9793 9810 9827 9932 10178 10498 10865 11319 11884 12504 13172 13883 14594 15253 15802
800 15802 16314 16716 16960 17032 16927 16649 16190 15558 14778 13950 13139 12327 11581 10834 10198 9562 8985 8407 7933 7537 7206 6953 6709
798F709k44j67j67q7q8j21j21j69j68j02j03j31k11j89j10m9n0m4m4m4m5j0j1j1j1OOOOp9
795D157p9j26j26r3r2j4j4P8P7P8P7j9j9j9j9q7q6j34j34j15j15mnn3n2j32j31r2r2r2r2q3
792B348q2j31n3M5l4r5r5l5l5l5l4k2k2k2k2oooom9m9K9L0K9K9n0n0J5J4l3l3m7m7m7m7k6
789A320k5K2K1J0RRJ0NNNOj4j3O5O6R6R6R6R5P6P6P6P6k9k9j07j07j25j25r9mj6j7j0j0k3
785A487k2k3k2m8m8j59j58q1q0l3l4k3k3k4k3j8j8j8j8n4n3n4n3OPPOJ9J8J8J9J0RJ0J0R3
782F32R2R3R2N2N2N2N3R2R3R2R3J59J60J13J12R1R1R1R1J58J58J58K52L28M23N33P54J012
779F172J232J459J616J760J760J447R75L88k11p62j298j659j816j836j679j431j210r50p30
777C227n69m12l94l01j98j51j50j04m6m6m4m3o0o1o0o0m4m3m4m3j2j2n9n9k9l0k9l0%jM6M7
$$ plain form
798 6709 6465 6298 6131 6044 5956 5835 5714 5545 5377 5275 5172 5041 4830 4641 4531 4482 4432 4388 4344 4300 4255 4245 4234 4223 4212 4218 4224 4230 4236 4157
795 4157 4078 3952 3826 3733 3641 3627 3613 3691 3768 3846 3923 3904 3885 3866 3847 3760 3674 3540 3406 3291 3176 3172 3167 3114 3062 2930 2799 2707 2615 2523 2431 2348
792 2348 2266 2135 2082 2127 2093 1998 1903 1868 1833 1798 1764 1742 1720 1698 1676 1670 1664 1658 1652 1603 1554 1583 1613 1642 1671 1621 1571 1586 1600 1567 1534 1487 1440 1393 1346 1320
789 1320 1295 1317 1338 1348 1357 1366 1376 1381 1386 1391 1397 1383 1370 1435 1501 1597 1693 1789 1884 1960 2036 2112 2188 2159 2130 2023 1916 1791 1666 1567 1563 1547 1530 1520 1510 1487
785 1487 1465 1442 1420 1372 1324 1165 1007 926 846 813 779 756 733 709 686 668 650 632 614 560 507 453 400 406 413 420 426 445 463 481 500 510 519 529 539 632
782 632 724 817 909 961 1013 1065 1118 1210 1303 1395 1488 1647 1807 1920 2032 2123 2214 2305 2396 2554 2712 2870 3122 3450 3873 4406 5160 6172
779 6172 7404 8863 10479 12239 13999 15446 16421 16809 16598 15836 14538 12879 11063 9227 7548 6117 4907 3957 3227
777 3227 2658 2246 1852 1551 1353 1202 1052 948 902 856 812 769 709 648 588 528 484 441 397 354 342 330 271 212 183 153 124 94 94 93 139 186
774A86m7m7m7m6L9M0M0M1K8K9K8K9m5m4m5m5n3n3n3n4n2n3noM5M5l3l4QQQ7Q7K07K08K08K08
771H09O0O0n1n0j19j19j65j66j07j06k8k7p2p2p2p2q0q0l3l3%j%%j5j4j5j4l7l7l7l7qpP2
768f73P2N1N1k7p4n5M0J0l7QQONJJKJj6j5j6j5n0n0l2J4J6l1JJM7R5O7O8Q0Q1L3L3L7L7Q5
764a40Q4N6N5L5j2M8M9kkK0K0k3k2k9N0J16J16J09J09N4Pr6j43j17j16p9l2j1j1j5j5m2OL3
761F0L3J6l2n8n8o4o4n5j01j20j19r8n0k6k7m4LN3N2J9k7p5k8k3k2j7j7k7K1M1M1O9O8O9O9
757e38Q4Q4Q4Q4K6K5K5K5llllQQl9q7q6qK4K4o9o8o9o9n4n5qpl4l4o1j3rrk6p4m0m0m3m4j0
753a105j0j0j1J0RJ0RJ3J3L7j1l5q1q5l7k2k1K9K8L8L7L8L8M3M3M3M3PQMNN1ML0L1M7M7K1
750f92O7O0O0M3no0n9o2J7K1k5m1m2o0o1j4j4l6l6l6l6J3J3l4l4k1k0k1k0n0n0llKKKKL2L1
$$ plain form
774 186 139 92 45 -1 38 78 118 159 187 216 244 273 228 184 139 94 41 -12 -65 -119 -171 -224 -229 -235 -190 -145 -178 -212 -204 -196 -109 -22 185 393 601 809
771 809 869 929 878 828 709 590 425 259 152 46 18 -9 -81 -153 -225 -297 -377 -457 -490 -523 -523 -524 -524 -524 -539 -553 -568 -582 -619 -656 -693 -730 -738 -745 -673
768 -673 -601 -550 -499 -526 -600 -655 -615 -605 -642 -634 -626 -620 -615 -614 -613 -611 -610 -626 -641 -657 -672 -722 -772 -804 -790 -774 -805 -804 -803 -756 -661 -594 -526 -446 -365 -332 -299 -262 -225 -140
764 -140 -56 0 55 90 78 126 175 173 171 191 211 188 166 137 187 303 419 528 637 691 698 602 459 342 226 147 115 104 93 78 63 21 27 60
761 60 93 109 77 19 -39 -103 -167 -222 -323 -443 -562 -660 -710 -736 -763 -807 -804 -751 -699 -680 -707 -782 -810 -833 -855 -872 -889 -916 -895 -854 -813 -744 -676 -607 -538
757 -538 -454 -370 -286 -202 -176 -151 -126 -101 -104 -107 -110 -113 -105 -97 -136 -223 -309 -317 -293 -269 -338 -406 -475 -544 -598 -653 -661 -668 -702 -736 -797 -810 -819 -828 -854 -928 -968 -1008 -1051 -1095 -1105
753 -1105 -1115 -1125 -1136 -1126 -1117 -1107 -1098 -1085 -1072 -1035 -1046 -1081 -1162 -1247 -1284 -1306 -1327 -1298 -1270 -1232 -1195 -1157 -1119 -1076 -1033 -990 -947 -940 -932 -928 -923 -872 -868 -838 -807 -760 -713 -692
750 -692 -625 -565 -505 -462 -467 -527 -586 -648 -631 -610 -635 -676 -718 -778 -839 -853 -867 -903 -939 -975 -1011 -998 -985 -1019 -1053 -1074 -1094 -1115 -1135 -1185 -1235 -1238 -1241 -1239 -1237 -1235 -1233 -1201 -1170
746a170j6j6L0L1L0L0N6N5L5j2n0n0K2K3pn4n4pj3j4j1j0j5j5ON3L3L2N9J2J6l1ppOOk1K7
743a018K6K7j8j8k5k5k6k5l2l1nn2POMLMMLMj3j2j2j2J4J4J5J4p7p7L3L3P0O9K3K2rj0n7n7
739a216l2l3J5J5K3K4K3K3j7j6R1R1J3l4n5K4jm9j7j8j2j3j2j3PQPPj6j5j6j5L6L5L6L6OO
735a074OOqrrqq3q3nmLKLLJJJJj9j9j9j8M0M1M1M1L7L7m2m2k4k3K3K4J2J1J2J2k4k4k4k4j3
731a240j2j2j3LKNOpM1N8k0j4j4j9j9l0l1l0l1M6M6M6M5k1k1k1k1jj%jk1k0k1k1K9K8K8K8
728a251j0j1j0j0k8k7N1N1k1k0k1k0k1k1k0k1K3K2K3K3k2k3k2k2ONONK7K8K7K7%j%%L2L2L2
724a182L3J2J3J2J3k8k8k7k8%%%%qppqj9j9k0j9j6j6p2K3L9qK4K5ooook5k6k6k5KKLKKKLK
720a426k0k1k0k1K6K6K6K6K6K6k0o7q1J3NMM2M2l6l7K0J9O7O7k0k0k1k0J7J6l1l1mmq0p9k2
$$ plain form
746 -1170 -1186 -1202 -1172 -1141 -1111 -1081 -1025 -970 -935 -947 -997 -1047 -1025 -1002 -1009 -1063 -1117 -1124 -1137 -1151 -1162 -1172 -1187 -1202 -1196 -1143 -1110 -1078 -1019 -1007 -991 -1022 -1029 -1036 -1030 -1024 -1045 -1018
743 -1018 -992 -965 -983 -1001 -1026 -1051 -1077 -1102 -1134 -1165 -1170 -1222 -1215 -1209 -1205 -1202 -1198 -1194 -1191 -1187 -1200 -1212 -1224 -1236 -1222 -1208 -1193 -1179 -1256 -1333 -1300 -1267 -1197 -1128 -1105 -1083 -1092 -1102 -1159 -1216
739 -1216 -1248 -1281 -1266 -1251 -1228 -1204 -1181 -1158 -1175 -1191 -1100 -1009 -996 -1030 -1085 -1061 -1062 -1111 -1128 -1146 -1158 -1171 -1183 -1196 -1189 -1181 -1174 -1167 -1183 -1198 -1214 -1229 -1193 -1158 -1122 -1086 -1080 -1074
735 -1074 -1068 -1062 -1070 -1079 -1088 -1096 -1179 -1262 -1267 -1271 -1268 -1266 -1263 -1260 -1259 -1258 -1257 -1256 -1275 -1294 -1313 -1331 -1291 -1250 -1209 -1168 -1131 -1094 -1136 -1178 -1202 -1225 -1202 -1178 -1166 -1155 -1143 -1131 -1155 -1179 -1203 -1227 -1240
731 -1240 -1252 -1264 -1277 -1274 -1272 -1267 -1261 -1268 -1227 -1169 -1189 -1203 -1217 -1236 -1255 -1285 -1316 -1346 -1377 -1331 -1285 -1239 -1194 -1215 -1236 -1257 -1278 -1279 -1280 -1280 -1281 -1302 -1322 -1343 -1364 -1335 -1307 -1279 -1251
728 -1251 -1261 -1272 -1282 -1292 -1320 -1347 -1296 -1245 -1266 -1286 -1307 -1327 -1348 -1369 -1389 -1410 -1387 -1365 -1342 -1319 -1341 -1364 -1386 -1408 -1402 -1397 -1391 -1386 -1359 -1331 -1304 -1277 -1277 -1278 -1278 -1278 -1246 -1214 -1182
724 -1182 -1149 -1137 -1124 -1112 -1099 -1127 -1155 -1182 -1210 -1210 -1210 -1210 -1210 -1218 -1225 -1232 -1240 -1259 -1278 -1298 -1317 -1333 -1349 -1421 -1398 -1359 -1367 -1343 -1318 -1324 -1330 -1336 -1342 -1367 -1393 -1419 -1444 -1442 -1440 -1437 -1435 -1433 -1431 -1428 -1426
720 -1426 -1446 -1467 -1487 -1508 -1482 -1456 -1430 -1404 -1378 -1352 -1372 -1439 -1520 -1507 -1502 -1498 -1456 -1414 -1450 -1487 -1467 -1448 -1381 -1314 -1334 -1354 -1375 -1395 -1378 -1362 -1393 -1424 -1428 -1432 -1512 -1591 -1613
716a613K6KKlM5M5ln5n6j2j1KLM9N0N1N0M8M8O2J4ooK5K4k3k2NMNNm9n0m9m9j%LLpM0M3mp
712a372M2L8rk0k0n3nrn6k4k3j8K9M8M7L5j2o1o1L0P6LLJ7J7l1p7p6LL5L4N0N1k6k6oM1J5
708a371J5J0J0l3l4k2K5K5k2l6l6QQj5j5m2NLKONOONOmnmmJ2J3J2J3J9K0k8k8J8J9J8J8M5
704a347M4M5M4O1O1O2O1o0o0j02j02n1K8N8J0j1j1j5j4qqrqP7P7J25J24J55J55J3J3n1n2r9
701g95r9j15j16noj2j2j2j2J2J2J7R7J29J76K00J99J61J13L8m1r1j69k09k08j49j49j01j01
698a248p8p7JKL2L2L2L2MMQ2Q3J05J06K6K7rqq7q7j23j23p5p5l1l1J7J6J1J1l7l6M6M6R3R4
695a223O3O3J5J6r3r2r3r2LLLLl3l3l3l3K6K6K6K7l1l0l0l1J3J4J3J3J9K0K0J9k8k9k8k9L
692a553KN0N0l9l9P1P2j8j7j8j7OOp3p2OOPOJ6J7J6J6j2j1L6L5J2J2J2J2l2l3J4J5J8J9J8
$$ plain form
716 -1613 -1587 -1585 -1583 -1586 -1541 -1496 -1499 -1554 -1610 -1622 -1633 -1631 -1628 -1579 -1529 -1478 -1428 -1380 -1332 -1270 -1256 -1262 -1268 -1243 -1219 -1242 -1264 -1259 -1255 -1250 -1245 -1294 -1344 -1393 -1442 -1443 -1443 -1440 -1437 -1444 -1404 -1361 -1365 -1372
712 -1372 -1330 -1292 -1301 -1321 -1341 -1394 -1399 -1408 -1464 -1488 -1511 -1529 -1500 -1452 -1405 -1370 -1382 -1443 -1504 -1474 -1398 -1395 -1392 -1375 -1358 -1389 -1466 -1542 -1539 -1504 -1470 -1420 -1369 -1395 -1421 -1427 -1386 -1371
708 -1371 -1356 -1346 -1336 -1369 -1403 -1425 -1400 -1375 -1397 -1433 -1469 -1461 -1453 -1468 -1483 -1525 -1520 -1517 -1515 -1509 -1504 -1498 -1492 -1487 -1481 -1485 -1490 -1494 -1498 -1486 -1473 -1461 -1448 -1429 -1409 -1437 -1465 -1447 -1428 -1410 -1392 -1347
704 -1347 -1303 -1258 -1214 -1153 -1092 -1030 -969 -1029 -1089 -1191 -1293 -1344 -1316 -1258 -1248 -1259 -1270 -1285 -1299 -1307 -1315 -1324 -1332 -1255 -1178 -1053 -929 -774 -619 -606 -593 -644 -696 -795
701 -795 -894 -1009 -1125 -1130 -1136 -1148 -1160 -1172 -1184 -1172 -1160 -1143 -1046 -917 -741 -541 -342 -181 -68 -30 -71 -162 -331 -540 -748 -897 -1046 -1147 -1248
698 -1248 -1326 -1403 -1402 -1400 -1368 -1336 -1304 -1272 -1268 -1264 -1182 -1099 -994 -888 -862 -835 -844 -852 -939 -1026 -1149 -1272 -1347 -1422 -1453 -1484 -1467 -1451 -1440 -1429 -1466 -1502 -1456 -1410 -1317 -1223
695 -1223 -1160 -1097 -1082 -1066 -1159 -1251 -1344 -1436 -1433 -1430 -1427 -1424 -1457 -1490 -1523 -1556 -1530 -1504 -1478 -1451 -1482 -1512 -1542 -1573 -1560 -1546 -1533 -1520 -1501 -1481 -1461 -1442 -1470 -1499 -1527 -1556 -1553
692 -1553 -1551 -1501 -1451 -1490 -1529 -1458 -1386 -1404 -1421 -1439 -1456 -1450 -1444 -1517 -1589 -1583 -1577 -1570 -1564 -1548 -1531 -1515 -1499 -1511 -1522 -1486 -1451 -1439 -1427 -1415 -1403 -1435 -1468 -1454 -1439 -1421 -1402 -1384
688a384J9qrL9L9K7K7k0k0rrj0rm0l9m0m0L8L8L8L8n7n8n7n8k5k5K2K1l2l2l2l3J2J3J2J2
684a651K4K3K4K4M6M7M6M6l9m0l9m0K4K3k3k4K7K8K7K8K3K4k4k4K2K3K2K2rrrrl2l2l2l1j1
681a505j0O9O8J5J6J5J5L0L0K3J19J55J56J61J62J11J11J59J57J70J70J65J64J86R2l6q4j61
678G23k09j94r9j05j51j67j66j64j64j19j20q1j29j08j3lkm4m4rrn6n7%%%%P1P1K3K4l8l7
675a376l8l7o3o2j5j5K8K8j9j9N0N0N0M9k7k8k8k8j2j3j2j2n1n1llMNNNL6L5L6L5LKKKj7j7
671a521j8j7j0rrrj0rrj0k1k0k1k1OPPOM3M2M2M3rrrrNNNMpoppj6j6J1l6j2j1L2L3LLm4m4
667a659j4j5j4j5M7M7M5M4j7o4o4j7L1L2L4L4M5M4K5k3o7o6J4O2O3O2J4l4JJkkK6K6N2Nl7
664a356l7m1m0k0k1%M8onklj4j4j4j4J8J8k9k9K6K5K5K5J7J7J7J7mnm9m9mM4N9O0K3n6r1r0
$$ plain form
688 -1384 -1365 -1373 -1382 -1343 -1304 -1277 -1250 -1270 -1290 -1299 -1308 -1318 -1327 -1367 -1406 -1446 -1486 -1448 -1410 -1372 -1334 -1391 -1449 -1506 -1564 -1589 -1614 -1592 -1571 -1603 -1635 -1667 -1700 -1688 -1675 -1663 -1651
684 -1651 -1627 -1604 -1580 -1556 -1510 -1463 -1417 -1371 -1410 -1450 -1489 -1529 -1505 -1482 -1505 -1529 -1502 -1474 -1447 -1419 -1396 -1372 -1396 -1420 -1398 -1375 -1353 -1331 -1340 -1349 -1358 -1367 -1399 -1431 -1463 -1494 -1505
681 -1505 -1515 -1446 -1378 -1363 -1347 -1332 -1317 -1287 -1257 -1234 -1115 -960 -804 -643 -481 -370 -259 -100 57 227 397 562 726 912 1004 968 884 723
678 723 514 320 221 116 -35 -202 -368 -532 -696 -815 -935 -1016 -1145 -1253 -1266 -1269 -1271 -1315 -1359 -1368 -1377 -1433 -1490 -1490 -1490 -1490 -1490 -1419 -1348 -1325 -1301 -1339 -1376
675 -1376 -1414 -1451 -1514 -1576 -1591 -1606 -1578 -1550 -1569 -1588 -1538 -1488 -1438 -1389 -1416 -1444 -1472 -1500 -1512 -1525 -1537 -1549 -1600 -1651 -1654 -1657 -1653 -1648 -1643 -1638 -1602 -1567 -1531 -1496 -1493 -1491 -1489 -1487 -1504 -1521
671 -1521 -1539 -1556 -1566 -1575 -1584 -1593 -1603 -1612 -1621 -1631 -1652 -1672 -1693 -1714 -1708 -1701 -1694 -1688 -1645 -1603 -1561 -1518 -1527 -1536 -1545 -1554 -1549 -1544 -1539 -1535 -1542 -1548 -1555 -1562 -1578 -1594 -1583 -1619 -1631 -1642 -1610 -1577 -1574 -1571 -1615 -1659
667 -1659 -1673 -1688 -1702 -1717 -1670 -1623 -1578 -1534 -1551 -1615 -1679 -1696 -1665 -1633 -1599 -1565 -1520 -1476 -1451 -1474 -1541 -1607 -1593 -1531 -1468 -1406 -1392 -1426 -1425 -1424 -1426 -1428 -1402 -1376 -1324 -1319 -1356
664 -1356 -1393 -1434 -1474 -1494 -1515 -1515 -1467 -1473 -1478 -1480 -1483 -1497 -1511 -1525 -1539 -1521 -1503 -1532 -1561 -1535 -1510 -1485 -1460 -1443 -1426 -1409 -1392 -1396 -1401 -1450 -1499 -1503 -1459 -1400 -1340 -1317 -1373 -1464 -1554
660a554j0j0ppJ0N7O2J4k6N2L1j6j7j7m6JM4M4M7M8mmmmkkK5k2o4o5j5L2ppl1J7M4M4%%j0
656a379j0L4L4k3p0k3K5M8M8MMkkkkk5k5k1k2K3P1P1K3PPL1j7k6k5k9k8PQPQQPQQl0l0k9l0
652a359O4O4J7J6J4J4J4J4M4M3M1M0M9Jj9k0pqpqK0K0J9K0N8N8L7j0m3m3JJL0L1L1L0O5O5
648f03L5Q3J27P9L6Q2R7R6J47J47J24J24J30J29J58K37K98K98K52J74J00N3J9k7p8l1KKNN
646B300J9J8J33J81J23J24K15K15K86M44N65P23Q79Q78P63M79J91r2l72m67l14r5L2J90M24
643G842O45P86R45J170J391J782K316L057M097N559P354R215J0948J1767J0790P655K833k491
642H7661p249j0329j1116r884p710n485l564j965o73M69J635K851M270O001Q363J1491J5241
640H0007J9216K2272K2706J8893J0829M00j0046j8457k2671k2071j8436j3931r779o409l785
$$ plain form
660 -1554 -1564 -1574 -1581 -1588 -1578 -1521 -1459 -1445 -1471 -1419 -1388 -1404 -1421 -1438 -1484 -1483 -1439 -1395 -1348 -1300 -1304 -1308 -1312 -1316 -1318 -1320 -1295 -1317 -1381 -1446 -1461 -1429 -1436 -1443 -1474 -1457 -1413 -1369 -1369 -1369 -1379
656 -1379 -1389 -1355 -1321 -1344 -1414 -1437 -1412 -1364 -1316 -1312 -1308 -1310 -1312 -1314 -1316 -1341 -1366 -1387 -1409 -1386 -1315 -1244 -1221 -1214 -1207 -1176 -1193 -1219 -1244 -1273 -1301 -1294 -1286 -1279 -1271 -1263 -1256 -1248 -1240 -1270 -1300 -1329 -1359
652 -1359 -1295 -1231 -1214 -1198 -1184 -1170 -1156 -1142 -1098 -1055 -1014 -974 -925 -924 -943 -963 -970 -978 -985 -993 -973 -953 -934 -914 -856 -798 -761 -771 -814 -857 -856 -855 -825 -794 -763 -733 -668 -603
648 -603 -568 -485 -358 -279 -243 -161 -64 32 179 326 450 574 704 833 991 1228 1526 1824 2076 2250 2350 2403 2422 2395 2317 2286 2288 2290 2295 2300
646 2300 2319 2337 2470 2651 2774 2898 3113 3328 3614 4058 4623 5346 6225 7103 7866 8345 8536 8444 8072 7605 7291 7196 7228 7418 7842
643 7842 8487 9273 10218 11388 12779 14561 16877 19934 24031 29590 36944 46159 57107 68874 79664 87319 90152 87661
642 87661 80412 70083 58967 49083 41373 35888 32324 30359 29686 30155 31790 34641 38911 44912 53275 64766 80007
640 80007 99223 121495 144201 163094 173923 174323 164277 145820 123149 101078 82642 68711 58932 52523 48738
638D8738j674K40K099M056O357R347J3223J8114K3880K9463L2645L0802K2327Q682o914k1360
637B20025l1223l4111l0929k4809j8539j3308r244o160l796j836K4J898L946O467R522J3245
635H1172J7246K0527K1314J7987J0393L40j0026j8509k3016k2723j9290j4933j0932p854n618
634C6078l873k518j366l26P76K069L493N226P144R003J0124R588O933K491k662p356j0610
632F4214j1586j0634q711o714n108l868k955k340j868j462j178r35p13n43l85k87k86k08k08
631D225o6o6l6l6j77j77k05k05k52k53k92k93l71l71k30k29q8q8QPN4N5popom9m9m9m9r2r2
628E08r3r2r4r3r4r3qqqqM4M4l3l4o8o7k0k1j2j2j3j2K6K6K6K6j9j9j9j9ppn5n4k3k3N6N5
624c17L5L5j2j2j2j1j2j1%J%Jn6n6rrj0j1q9r0j8j8j7j8j1j1j1j1JJJJJJKJK4K5K5K5j1j1
$$ plain form
638 48738 47064 47304 49403 53459 59816 69163 82386 100500 124380 153843 186488 217290 239617 248299 241385 220025
637 220025 188802 154691 123762 98953 80414 67106 57862 51702 47906 46070 46094 47992 51938 58405 67927 81172
635 81172 98418 118945 140259 158246 168639 168979 158953 140444 117428 94705 75415 60482 49550 41696 36078
634 36078 32205 29687 28321 27995 28771 30840 34333 39559 46703 55706 65830 75418 82351 84842 82180 74824 64214
632 64214 52628 41994 33283 26569 21461 17593 14638 12298 10430 8968 7790 6855 6142 5599 5214 4927 4641 4433 4225
631 4225 4159 4093 4057 4021 3844 3667 3462 3257 3005 2752 2460 2167 1796 1425 1195 966 878 790 798 805 859 914 907 901 894 888 839 790 741 692 600 508
628 508 415 323 229 136 42 -51 -59 -67 -75 -83 -39 5 -28 -62 -130 -197 -217 -238 -250 -262 -275 -287 -261 -235 -209 -183 -202 -221 -240 -259 -266 -273 -328 -382 -405 -428 -372 -317
624 -317 -282 -247 -259 -271 -283 -294 -306 -317 -317 -316 -316 -315 -371 -427 -436 -445 -455 -466 -555 -645 -663 -681 -698 -716 -727 -738 -749 -760 -759 -758 -757 -756 -755 -754 -752 -751 -727 -702 -677 -652 -663 -674
620f74j0j1L9L9M0L9l9l8RQj3j3j3j3NMP8P7J0q4n8j1J6J6k8k8nmmmk7k7k7k7klllL3L3L2
616f91L3J6J5J6J6m1m0m1m1J2J2K6P4M1n3k4K3M2M1M2M1mn1p8J7O9P0K8K8nmnmo8o8o9o8P
613f86OM0ql7N8P5K9nmppK9L0j8j7m0l9m0l9o7o7p3K2L5L6M1M1K9K8n0n0k3k3j7j7m1N4M8
609g74M7J8J8J9J8LLN1N1L1L1j6j7j5j5j5j5M1M2pok7k8N1N2JJJ%RRl8l9qrrrr1r1m4m4J7
605h03J7J7J7L0L1j8j7kklkLKKLM1M0ool0k9k9k9K7K7K7K7J8J8J4J5j6o3l3M5kkLLK2K3K2
601e98K3n7n6K2K2M4M5klk2k1K5P3L6m2o9o9J4R3R3J4K1K0J5J5n3n3K5K6J6J7J7J6NMMNl2
598c67l1l1l1NONNJ9J9O4O3J0l7n5n4l8RK7K7K5k3k2K5J0J0J3J4J1J1J1J1J7J7n9n9k4K2P5
594c00P4kkK4k3rrj2j2n2n3n2n2M2M2j0n8L4L3L0L1OPOPM2M2L9L9j8o4l9l8onooj9k0j6j7
$$ plain form
620 -674 -684 -695 -656 -617 -577 -538 -577 -615 -606 -598 -611 -624 -637 -650 -645 -641 -563 -486 -476 -560 -618 -629 -613 -597 -625 -653 -658 -662 -666 -670 -697 -724 -751 -778 -780 -783 -786 -789 -756 -723 -691
616 -691 -658 -642 -627 -611 -595 -636 -676 -717 -758 -746 -734 -708 -634 -593 -646 -670 -647 -605 -564 -522 -481 -485 -536 -614 -597 -528 -458 -430 -402 -407 -411 -416 -420 -488 -556 -625 -693 -686
613 -686 -680 -640 -648 -685 -627 -552 -523 -528 -532 -539 -546 -517 -487 -505 -522 -562 -601 -641 -680 -747 -814 -887 -865 -830 -794 -753 -712 -683 -655 -705 -755 -778 -801 -818 -835 -876 -822 -774
609 -774 -727 -709 -691 -672 -654 -651 -648 -597 -546 -515 -484 -500 -517 -532 -547 -562 -577 -536 -494 -501 -507 -534 -562 -511 -459 -458 -457 -456 -456 -447 -438 -476 -515 -523 -532 -541 -550 -641 -732 -776 -820 -803
605 -803 -786 -769 -752 -722 -691 -709 -726 -728 -730 -733 -735 -732 -730 -728 -725 -684 -644 -650 -656 -686 -715 -744 -773 -746 -719 -692 -665 -647 -629 -615 -600 -616 -679 -712 -667 -669 -671 -668 -665 -643 -620 -598
601 -598 -575 -632 -688 -666 -644 -600 -555 -557 -560 -582 -603 -578 -505 -469 -511 -580 -649 -635 -542 -449 -435 -414 -394 -379 -364 -417 -470 -445 -419 -403 -386 -369 -353 -348 -344 -340 -335 -367
598 -367 -398 -429 -460 -455 -449 -444 -439 -420 -401 -337 -274 -264 -301 -356 -410 -448 -439 -412 -385 -360 -383 -405 -380 -370 -360 -347 -333 -322 -311 -300 -289 -272 -255 -314 -373 -397 -375 -300
594 -300 -226 -228 -230 -206 -229 -238 -247 -259 -271 -323 -376 -428 -480 -438 -396 -406 -464 -430 -397 -367 -336 -330 -323 -317 -310 -268 -226 -187 -148 -166 -230 -269 -307 -313 -318 -324 -330 -349 -369 -385 -402
590d02NN3N2NJ5J4J2J1qqqqONk6K2P0rJ1N9M5M5J9O5M1ok0k1JM8N2MPN4N1MRQOOmlllk4k4
586B28K0K0O8K0l2l2kkM5M5J3J3J4J3J9J9K1K2J2N9N9J2J0RPPPQN5N5M1M0M1M1%J%Jj0j0j0
582I47j0l7l8l7l7qqqqMLMMk5k5k5k6%j%jKJm3m2k0K7P9P9N3N4N3N3O4O4J2l5n4n3n6n7j0
578H39j0j0j0k0k0j6j7M7R4O8O8J22J23J49J02J15J16N6Ql3j12j14j15q1l4j3j4k3k4K3K4
575A288O6O6O8O9J16J64K40K40J96Q5p5j55j34j33j65j18p2p2j14j14p9l1qqLN0P1P1J13J14
572A742J11J11P6K9j0q9j88j89j16ojm8n9K0J5J6K0K0J1J0N8N8K5K6J04J04J10J10j%p5p4
569A920MMl8l8RRN6N5N5N6K3K3K3K3PQQPL6L5L5L5l4l4l4l4J7J7l0l0q0q0%jM7M8l2l1jjj
565B061jooooOPPOM2M3M2M2K7K7K7K6K7K7K7K7M9M9M9M9j1j0nnJ2R1M7M7RQRQl5l5l5l5K3
$$ plain form
590 -402 -397 -344 -292 -287 -272 -258 -246 -235 -243 -251 -259 -267 -261 -256 -282 -260 -190 -199 -188 -129 -84 -39 -20 45 86 80 60 39 40 88 140 144 151 205 256 260 269 277 283 289 285 282 279 276 252 228
586 228 248 268 336 356 324 292 290 288 333 378 391 404 418 431 450 469 490 512 524 583 642 654 664 673 680 687 694 702 757 812 853 893 934 975 975 976 976 977 967 957 947
582 947 937 900 862 825 788 780 772 764 756 760 763 767 771 746 721 696 670 670 669 669 668 670 671 628 586 566 593 672 751 804 858 911 964 1028 1092 1104 1069 1015 962 906 849 839
578 839 829 819 809 789 769 753 736 783 877 945 1013 1135 1258 1407 1509 1624 1740 1796 1804 1771 1659 1545 1430 1349 1315 1302 1288 1265 1241 1264 1288
575 1288 1354 1420 1488 1557 1673 1837 2077 2317 2513 2598 2523 2368 2234 2101 1936 1818 1746 1674 1560 1446 1367 1336 1328 1320 1323 1373 1444 1515 1628 1742
572 1742 1853 1964 2040 2069 2059 1970 1782 1593 1477 1471 1470 1422 1363 1383 1398 1414 1434 1454 1465 1475 1533 1591 1616 1642 1746 1850 1960 2070 2069 2069 1994 1920
569 1920 1924 1928 1890 1852 1861 1870 1926 1981 2036 2092 2115 2138 2161 2184 2191 2199 2207 2214 2250 2285 2320 2355 2321 2287 2253 2219 2236 2253 2223 2193 2113 2033 2033 2032 2079 2127 2095 2064 2063 2062 2061
565 2061 2060 2054 2048 2042 2036 2042 2049 2056 2062 2104 2147 2189 2231 2258 2285 2312 2338 2365 2392 2419 2446 2495 2544 2593 2642 2631 2621 2616 2611 2623 2714 2761 2808 2817 2825 2834 2842 2807 2772 2737 2702 2725
561B725K4K4K4QPQPmmrrL8m1MMj6j6o4J6K0k6MNL4L4L5L4l5l5mP5K5k2RRJJm7L3O7K1k7k7
557B910O2O1J4J5J1J1J1J2K0K0n9n9L5L5j2j3j5j6L2L2M5M6M5M6LLMLlkllL6L5L5L5j6j5j6
554C385j6J9K0J9K0K5K5K6K5oooon1n0K8K9NOOOJ4J3J4J4J0J1N7N8R5R6J6J6K6K6K6K6N4N3
550D128k5k5K0K0K1K0k0k1k0k0M8M9M8M8K1K0K4K4PN4K7K7k0k1m8%L3L4j1j1L2L2N9J2K0K1
546D607J7J8L2L2j5j5N3N3N4N3K6K5Ql9rL9N6N7J1J2N7N6L3j4l2l2J7O3L7L7N4N3N4k5l0J7
543E420L3L3LMP9Q0M0qmM3NN2N5QL7L8L4L5L3L3O0J3nmppj0j0l6J1MMJ0J0J6O4L7L7N7N6N7
539F410N7P3P3N5QoM0N9N8N4N3L3j4kjnmM8M7P7L0JM7R2M5K5K6N2MJM8L9Q6J12J12O8O8J8
536G987J8J7J8J3J2O0O0L3L3L3L3K6K6K6K6O5O4J7J7O4O4O4O4klllP2P1J19J19Q8Q9RJ0O4
$$ plain form
561 2725 2749 2773 2797 2805 2812 2820 2827 2823 2819 2810 2801 2839 2798 2802 2806 2790 2774 2710 2726 2746 2720 2724 2729 2763 2797 2832 2866 2831 2796 2792 2867 2892 2870 2879 2888 2889 2890 2843 2876 2943 2964 2937 2910
557 2910 2972 3033 3047 3062 3073 3084 3095 3107 3127 3147 3088 3029 3064 3099 3087 3074 3059 3043 3075 3107 3152 3198 3243 3289 3292 3295 3299 3302 3299 3297 3294 3291 3327 3362 3397 3432 3416 3401 3385
554 3385 3369 3388 3408 3427 3447 3472 3497 3523 3548 3542 3536 3530 3524 3473 3423 3451 3480 3485 3491 3497 3503 3517 3530 3544 3558 3568 3579 3636 3694 3789 3885 3901 3917 3943 3969 3995 4021 4075 4128
550 4128 4103 4078 4098 4118 4139 4159 4139 4118 4098 4078 4126 4175 4223 4271 4292 4312 4336 4360 4367 4421 4448 4475 4455 4434 4386 4386 4419 4453 4442 4431 4463 4495 4554 4566 4586 4607
546 4607 4624 4642 4674 4706 4691 4676 4729 4782 4836 4889 4915 4940 4948 4909 4900 4939 4995 5052 5063 5075 5132 5188 5221 5207 5175 5143 5160 5223 5260 5297 5351 5404 5458 5433 5403 5420
543 5420 5453 5486 5489 5493 5572 5652 5692 5684 5680 5723 5728 5780 5835 5843 5880 5918 5952 5987 6020 6053 6113 6126 6121 6117 6110 6103 6093 6083 6047 6058 6062 6066 6076 6086 6102 6166 6203 6240 6297 6353 6410
539 6410 6467 6540 6613 6668 6676 6670 6710 6769 6827 6881 6934 6967 6953 6951 6950 6945 6941 6989 7036 7113 7143 7144 7191 7283 7328 7353 7379 7431 7435 7436 7484 7523 7609 7721 7833 7901 7969 7987
536 7987 8005 8022 8040 8053 8065 8125 8185 8218 8251 8284 8317 8343 8369 8395 8421 8486 8550 8567 8584 8648 8712 8776 8840 8838 8835 8832 8829 8901 8972 9091 9210 9298 9387 9396 9406 9470
532I470O5J11J12P4P4K7K7M6M6R3R3J02J03N5N4N1N0N1N0P5P6P5P5L4L4L4L5M6M6M6M6R0R0
529A1556R0R0K5K5P2P3M8M8JJQ0P9JJK0K0R8R9M8M7R5R4Q2Q1L4L4Q9Q8Q8Q9J15J15O8O8O7
526A3729O8J15J16P3P4P4P3R2R1R2R1N0N0R7R7J01J01J01J01J08J08J55J55O8O8O9O8K0J9
523A6224Q3J61J93J46R8R9J17J16J17J17Q4Q4Q4Q5J24J25J24J25J21J20M2M2J06J07J09J88
521A9141J79J79J84J84J23J24J24J23J56J57J56J56K04K05J57J57J49J50J49J49J74J75R5
518B2750M9Q4J62J94J94K15K14K15K14J61J60J60J61K22K23K23K22K74K74K74K73L06L06L05
516B7835L06L32L32K85K85L50L50L49L50L44L44L43L44L81L80L33L33L33L34L80L80M64M64
514C5931M63M64N62N62O09O10O13O14O08O09N57M77M63M16L22K12J24P7P7P7nnJ3J3O5J12
$$ plain form
532 9470 9535 9646 9758 9832 9906 9933 9960 10006 10052 10145 10238 10340 10443 10498 10552 10603 10653 10704 10754 10829 10905 10980 11055 11089 11123 11157 11192 11238 11284 11330 11376 11466 11556
529 11556 11646 11736 11761 11786 11858 11931 11979 12027 12028 12029 12109 12188 12189 12190 12210 12230 12328 12427 12475 12522 12617 12711 12793 12874 12908 12942 13031 13119 13207 13296 13411 13526 13594 13662 13729
526 13729 13797 13912 14028 14101 14175 14249 14322 14414 14505 14597 14688 14738 14788 14885 14982 15083 15184 15285 15386 15494 15602 15757 15912 15980 16048 16117 16185 16205 16224
523 16224 16307 16468 16661 16807 16905 17004 17121 17237 17354 17471 17555 17639 17723 17808 17932 18057 18181 18306 18427 18547 18589 18631 18737 18844 18953 19141
521 19141 19320 19499 19683 19867 19990 20114 20238 20361 20517 20674 20830 20986 21190 21395 21552 21709 21858 22008 22157 22306 22480 22655 22750
518 22750 22799 22883 23045 23239 23433 23648 23862 24077 24291 24452 24612 24772 24933 25155 25378 25601 25823 26097 26371 26645 26918 27224 27530 27835
516 27835 28141 28473 28805 29090 29375 29725 30075 30424 30774 31118 31462 31805 32149 32530 32910 33243 33576 33909 34243 34623 35003 35467 35931
514 35931 36394 36858 37420 37982 38591 39201 39814 40428 41036 41645 42202 42679 43142 43558 43880 44092 44216 44293 44370 44447 44442 44437 44450 44463 44528 44640
511D4640J27J27J54K01K35K82K85K38K98K97K49K50K62L09L27K48K00K00K50K98L15L64L69
509E0525L21L45L91M41M41M15M16M18M18M40M88M60M61M88M88M89M88N13N13N12N13N13N14
507F1011M68M69N52N99N69N69N92N44N44N91O39O39O68O21O03O02O79O79O85O85O86O85P04
505G5083P04P01P01P03O56O82P61P35O87O72O72O05O05O52O52O50O49O20O68O73O26O29O77
503I0463P02P02P06P05P38P37P86P85P70P71P70P71Q09Q09Q12Q11Q18Q64Q65Q17P97P97Q77
501A08482R25R49R49R07R08R15R63R83R83R59R60R59R59J014J013J014J013R96R95R96R96
499A28838J012J013J015J016J072J120J125J220J378J474J552J647J670J765J812J907J964
497A52600K058K028J980J879J721J582J424J178R57O69L86P5q2k00l57n00o57p45p46o48n53
$$ plain form
511 44640 44767 44894 45048 45249 45484 45766 46051 46289 46587 46884 47133 47383 47645 47954 48281 48529 48729 48929 49179 49477 49792 50156 50525
509 50525 50846 51191 51582 52023 52464 52879 53295 53713 54131 54571 55059 55519 55980 56468 56956 57445 57933 58446 58959 59471 59984 60497 61011
507 61011 61479 61948 62500 63099 63668 64237 64829 65373 65917 66508 67147 67786 68454 69075 69678 70280 70959 71638 72323 73008 73694 74379 75083
505 75083 75787 76488 77189 77892 78548 79230 79991 80726 81413 82085 82757 83362 83967 84619 85271 85921 86570 87190 87858 88531 89157 89786 90463
503 90463 91165 91867 92573 93278 94016 94753 95539 96324 97094 97865 98635 99406 100215 101024 101836 102647 103465 104329 105194 106011 106808 107605 108482
501 108482 109407 110356 111305 112212 113120 114035 114998 115981 116964 117923 118883 119842 120801 121815 122828 123842 124855 125851 126846 127842 128838
499 128838 129850 130863 131878 132894 133966 135086 136211 137431 138809 140283 141835 143482 145152 146917 148729 150636 152600
497 152600 154658 156686 158666 160545 162266 163848 165272 166450 167407 168076 168462 168537 168455 168255 167898 167398 166741 165996 165250 164602 164049
495A64049m85m38m04l09k36j42J3O0O3J11J32J79K03K03K37K37K37K37K70K70J93J45J43K37
493A65205K91K92K28K28K29K28J53J52J53J53J49J49J02J01J14J14O0O1N5l9j21j22o4L0k3
490A67878k3k3k3n1j46j56k02j82j83k58k58k58k58k93k94j84j83k19k19k66k66k46k45k45
488A63197k46k73k72l21l20l42l42l42l42m35m36m35m36m51m51m51m51m21m22n00n00m99m99
486A54010m21m20m11m11n20n21n30n30n77n78n63n64m84m85n38n39m91m91m09m09m10m09l97
484A42902l98m45m45n35n35o14o14o10o09o09o10o34o34o34o34n84n84n84n84o22o22n55m77
482A29730m57m57m52m52m69m70m69m70m12m12l65l64l51l51l04l04k94k94k94k95k81k82l28
479A21103l29m40m40m74n54o47o48o06o05o10o09o10o10n69n69n67m87m01m01l96l96l24l23
$$ plain form
495 164049 163564 163126 162722 162413 162177 162035 162048 162108 162171 162282 162414 162593 162796 162999 163236 163473 163710 163947 164217 164487 164680 164825 164968 165205
493 165205 165496 165788 166016 166244 166473 166701 166854 167006 167159 167312 167461 167610 167712 167813 167927 168041 168101 168162 168217 168178 168057 167935 167871 167901 167878
490 167878 167855 167832 167809 167758 167612 167456 167254 167072 166889 166631 166373 166115 165857 165564 165270 165086 164903 164684 164465 164199 163933 163687 163442 163197
488 163197 162951 162678 162406 162085 161765 161423 161081 160739 160397 159962 159526 159091 158655 158204 157753 157302 156851 156430 156008 155508 155008 154509 154010
486 154010 153589 153169 152758 152347 151827 151306 150776 150246 149669 149091 148528 147964 147480 146995 146457 145918 145427 144936 144527 144118 143708 143299 142902
484 142902 142504 142059 141614 141079 140544 139930 139316 138706 138097 137488 136878 136244 135610 134976 134342 133758 133174 132590 132006 131384 130762 130207 129730
482 129730 129273 128816 128364 127912 127443 126973 126504 126034 125622 125210 124845 124481 124130 123779 123475 123171 122877 122583 122289 121994 121713 121431 121103
479 121103 120774 120334 119894 119420 118866 118219 117571 116965 116360 115750 115141 114531 113921 113352 112783 112216 111729 111328 110927 110531 110135 109811 109488
477A09488l23l23l23l23k76k76k15k15j68j67k28k28k29k28j85j84j38j38k03k04j97j98m7
475A04472M8K09L03L87L87M00J80l08r07j232j232r52m79j83q9l4l4q6j79j63j62k16k16k33
473I9681k33k91l85m33m34m87m87n26n26n26n27m92m93m93m93m77m77l66l67l29l29k82k81
471H9947k19k19k19k18k08k09k08k08j80j81j86r2j38j37j79j78j45j44j44j44j39j39o1o0
468H5992o1o2o1o1j01j01j01j01j9j8O0O1l8l8q5q4o8o9j46j47j68j67j61j62q8PPq7q1q1
466H3771q6q7n1n1j30j30j72j72j19j19q7QL4L3PPQPj5j5J1J06J03J04J09J09Q4Q3NNo7o8
463H3225o7o8K5K5O3J41J80K27L16L16K75K75J97J97J80J80K38K85L34M12M19M19L71L72K92
460H8829K93K45K44J97J98K01K02J96J97J79J01J7o3j17j17k00k01j89j89j41j42j01j01k2
$$ plain form
477 109488 109165 108842 108519 108196 107920 107644 107429 107214 107046 106879 106651 106423 106194 105966 105781 105597 105459 105321 105118 104914 104717 104519 104472
475 104472 104520 104729 105032 105419 105806 106206 106386 106078 105171 103939 102707 101755 101276 101093 101004 100970 100936 100850 100671 100508 100346 100130 99914 99681
473 99681 99448 99157 98772 98339 97905 97418 96931 96405 95879 95353 94826 94334 93841 93348 92855 92378 91901 91535 91168 90839 90510 90228 89947
471 89947 89728 89509 89290 89072 88864 88655 88447 88239 88059 87878 87692 87600 87462 87325 87146 86968 86823 86679 86535 86391 86252 86113 86052 85992
468 85992 85931 85869 85808 85747 85646 85545 85444 85343 85324 85306 85366 85427 85389 85351 85266 85182 85114 85045 84899 84752 84584 84417 84256 84094 84006 84013 84020 83933 83852 83771
466 83771 83685 83598 83547 83496 83366 83236 83064 82892 82773 82654 82567 82575 82609 82642 82649 82656 82664 82671 82656 82641 82652 82758 82861 82965 83074 83183 83267 83350 83355 83360 83293 83225
463 83225 83158 83090 83115 83140 83203 83344 83524 83751 84067 84383 84658 84933 85130 85327 85507 85687 85925 86210 86544 86956 87375 87794 88165 88537 88829
460 88829 89122 89367 89611 89808 90006 90207 90409 90605 90802 90981 91082 91099 91036 90919 90802 90602 90401 90212 90023 89882 89740 89639 89538 89516
458H9516k2K8K8J38J38J87J86J86J86J37J37R0Q9J02J02J02J02O8O7m3m2j5j4K3J02J68K15
455I1961K72K73K64K65K65K65K87K86L34L81N65R91J255J177J011J011R72R72J116J320J536
453A06779J710J843J891J719J420J089O95J93k95o20r19j173j346j431j431j225j052q12n77
452A06458l70j97m2m1K3K3R5J91K88L84M28M28L56L56K89K90K90K89L99L99M89N35O46P41
449A12747P28P27O72N14L88K94J30J30K81M40N70P29P99Q46R12R60R87J082J121J027J047
447A27131J141J294J514J771J928K099K194K302K397K515K515K478K383K198J914J596J186
446A60556P70L61O9j52l72m66m75m75n65n65o03o02n16l58j05J79M36O55Q94R87J069J116
444A61838J163J116R79Q85P50N92M68L73L69M64O30P24Q89R84R54R06Q13O55N38L80L63L63
$$ plain form
458 89516 89494 89522 89550 89688 89826 90013 90199 90385 90571 90708 90845 90935 91024 91126 91228 91330 91432 91500 91567 91524 91482 91467 91453 91476 91578 91746 91961
455 91961 92233 92506 92770 93035 93300 93565 93852 94138 94472 94853 95418 96409 97664 98841 99852 100863 101835 102807 103923 105243 106779
453 106779 108489 110332 112223 113942 115362 116451 117146 117339 117044 116424 115505 114332 112986 111555 110124 108899 107847 107035 106458
452 106458 106088 105891 105849 105808 105831 105854 105949 106140 106428 106812 107240 107668 108024 108380 108669 108959 109249 109538 109937 110336 110825 111360 112006 112747
449 112747 113475 114202 114874 115388 115776 116070 116200 116330 116611 117051 117621 118350 119149 119995 120907 121867 122854 123936 125057 126084 127131
447 127131 128272 129566 131080 132851 134779 136878 139072 141374 143771 146286 148801 151279 153662 155860 157774 159370 160556
446 160556 161326 161687 161756 161604 161232 160766 160291 159816 159251 158686 158083 157481 156965 156607 156502 156681 157117 157772 158666 159653 160722 161838
444 161838 163001 164117 165096 165981 166731 167323 167791 168164 168533 168997 169627 170351 171240 172224 173178 174084 174897 175552 176090 176470 176833 177196
442A77196M89P11R44J229J565K037K628L164L630L975M250M344M336M336M625M972N305N148
440B34884M174K442L13j609k913l322k595j114N20J938K823L295L590L748L854M012M350M696
438B63086N189N662O083O556P143P679Q585R751J1116J2470J3884J5176J6377J7543J8763
437D25063J9930K1047K2214K3549K5219K7258K9369L1133L2047L2451L3554L6830M2849N2903
435H55416O7429Q6475J10327J40578J79995K33349L07298M11007N52383P31315R22349J058429
434E656350J037350P85650L40978j44409n83408r39578j095068j026963q41350o41098m73947
433B074507l48362k57966j93694j47723j14400q9540p0790n6642m5931l7456l0520k5132k1594
432F34757k0049k0042k0766k1644k1801k0514j8339j6137j4215j2628j1398j0467j0058j0092
$$ plain form
442 177196 177685 178396 179340 180569 182134 184171 186799 189963 193593 197568 201818 206162 210498 214834 219459 224431 229736 234884
440 234884 239058 241500 241813 240204 237291 233969 231374 230260 230780 232718 235541 238836 242426 246174 250028 254040 258390 263086
438 263086 268275 273937 280020 286576 293719 301398 309983 319734 330850 343320 357204 372380 388757 406300 425063
437 425063 444993 466040 488254 511803 537022 564280 593649 624782 656829 689280 722834 759664 802513 855416
435 855416 922845 1009320 1119647 1260225 1440220 1673569 1980867 2391874 2944257 3675572 4597921 5656350
434 5656350 6693700 7479350 7820328 7675919 7092511 6152933 5057865 4030902 3189552 2548454 2074507
433 2074507 1726145 1468179 1274485 1126762 1012362 922822 852032 795390 749459 712003 681483 656351 634757
432 634757 614708 594666 573900 552256 530455 509941 491602 475465 461250 448622 437224 426757 416699 406607
431D06607j0251j0235r763q908p806o688n648m908m436m063l653l347l062k783k436k216k121
429C14283k385k983m039n331o414o886o323m842k832q47O19J343J334J051P67O73Q10R68Q89
427B79855P32M34K4l50o34r31j151j228j323j294j293j146q62n90l70j43P7K42K42J45J46
425B70582j0rn7n6q4q4p5p4m8J10K30L25L38K44mm14q94j178j174q27m11j28M0J98K67K66
423B67073K29K30L10L11L46M40N18O75Q38R33R54R54Q18Q18P25P25P24P25R19R19J018J112
421B82314J306J464J672J956K305K715L238L963M978O395Q246J0672J3446J5683J6002J3197
419C89552P495P83n746j0756j2251j0454p162l917j315O70K202L430M350M886M893M169K666
418C73495O18j552l474m687n097m915m443l819l220k779k306j897j550j181q96n44k61k4J96
$$ plain form
431 406607 396356 386121 376358 367450 359644 352956 347308 342400 337964 333901 330248 326901 323839 321056 318620 316404 314283
429 314283 311898 308915 304876 299545 293131 286245 279922 275080 272248 271401 272020 273363 274697 275748 276515 277188 277998 278966 279855
427 279855 280587 281021 281045 280695 280061 279130 277979 276751 275428 274134 272841 271695 270833 270243 269873 269730 269807 270049 270291 270436 270582
425 270582 270572 270563 270506 270450 270366 270282 270207 270133 270085 270195 270425 270750 271088 271332 271328 270914 270020 268842 267668 266841 266430 266302 266342 266540 266807 267073
423 267073 267302 267532 267842 268153 268499 268939 269457 270132 270970 271903 272857 273811 274629 275447 276172 276897 277621 278346 279265 280184 281202 282314
421 282314 283620 285084 286756 288712 291017 293732 296970 300933 305911 312306 320552 331224 344670 360353 376355 389552
419 389552 397047 397830 392084 381328 369077 358623 351461 347544 346229 346899 349101 352531 356881 361767 366660 370829 373495
418 373495 374113 372561 369087 364400 359303 354388 349945 346126 342906 340127 337821 335924 334374 333193 332297 331753 331492 331468 331664
416C31664M86P07Q53J010J181J402J607J764J970K189K478K698K794K890K845K625K369K085
414C65617J703J357J104Q84Q33R90J272J493J630J788J993K151K316K599K831K988L229L449
413D00227L557L715L861M018M152M309M401M400M390M342M251M031L612L013K399J674R87
411D61339L88j00n73r69j315j441j488j374j154r67p45n45l24j50O9K24M44P08Q65J029J123
409D55044J196J196J277J372J441J487J664J758J861K019K144K237K260K259K195J974J666
407D85050J256R52O69L75K17J54K02K54K54L70N27O49O96O82O82O79P74Q60Q61R89J084J164
405D99400J212J239J238J329J329J329J329J274J274J227J226J236J235J264J483J828J986
404E22438J848J628J406J185R61Q66Q55R49J040J198J350J634K004K414K917L327L334K800
$$ plain form
416 331664 332150 332857 333710 334720 335901 337303 338910 340674 342644 344833 347311 350009 352803 355693 358538 361163 363532 365617
414 365617 367320 368677 369781 370665 371498 372488 373760 375253 376883 378671 380664 382815 385131 387730 390561 393549 396778 400227
413 400227 403784 407499 411360 415378 419530 423839 428240 432640 437030 441372 445623 449654 453266 456279 458678 460352 461339
411 461339 461727 461627 461054 460085 458770 457329 455841 454467 453313 452346 451601 451056 450732 450582 450651 450875 451319 452027 452892 453921 455044
409 455044 456240 457436 458713 460085 461526 463013 464677 466435 468296 470315 472459 474696 476956 479215 481410 483384 485050
407 485050 486306 487258 487927 488302 488519 488673 488875 489129 489383 489753 490280 490929 491625 492307 492989 493668 494442 495302 496163 497152 498236 499400
405 499400 500612 501851 503089 504418 505747 507076 508405 509679 510953 512180 513406 514642 515877 517141 518624 520452 522438
404 522438 524286 525914 527320 528505 529466 530332 531187 532136 533176 534374 535724 537358 539362 541776 544693 548020 551354 554154
402E54154J717L01j293k648l392l392k968k306j569j095q04n21l22j02L1K53M89P72J127J662
400E40094K118K339K107J445O77J5n24o82m89k05j08j08l58o41p02p02p02p02p39p39o64n06
398E40224k55K7L79P89J179J525J760J917K008K008J997J997K123K280K420K326J865R51p5
396E67445j053j808k030j737j013j16O73J313J786J939K034K192K412K723L070L502L912M372
394E89616M719M991N211N656O319P165Q268R576J0993J2313J3416J4142J4426J4489J4490
393G35790J4731J5457J6671J8215J9854K1208K2435K4104K6811L1064L7562M6605N8684P4218
392A163409R4378J20939J56764K05822K72634L59942M63477N64712O28608O12317M89410K67877
391E400289o943k76367m93625o17735o36086n72849m68365l60135k68664j98874j47824j11053
$$ plain form
402 554154 555871 556172 554879 552231 548839 545447 542479 540173 538604 537509 536705 536184 535862 535760 535791 536044 536533 537305 538432 540094
400 540094 542212 544551 546658 548103 548780 548795 548271 547589 547100 546895 546787 546679 546321 545680 544978 544276 543574 542872 542133 541394 540730 540224
398 540224 539969 539996 540375 541164 542343 543868 545628 547545 549553 551561 553558 555555 557678 559958 562378 564704 566569 567520 567445
396 567445 566392 564584 562554 560817 559804 559688 560361 561674 563460 565399 567433 569625 572037 574760 577830 581332 585244 589616
394 589616 594335 599326 604537 610193 616512 623677 631945 641521 652514 664827 678243 692385 706811 721300 735790
393 735790 750521 765978 782649 800864 820718 841926 864361 888465 915276 946340 983902 1030507 1089191 1163409
392 1163409 1257787 1378726 1535490 1741312 2013946 2373888 2837365 3402077 4030685 4643002 5132412 5400289
391 5400289 5393346 5116979 4623354 4005619 3369533 2796684 2328319 1968184 1699520 1500646 1352822 1241769
389A241769q4687o6066n3005m3774l6771l0816k5180j9666j4594j0403p382n586m542m133
388H35164m102m258m671n207n565n407m505k899q46J264L332N443P408R204J0889J2371J3804
387H61419J5285J6895J8817K0979K3342K5894K8510L1136L3689L5700L6677L6476L6130L7082
385A258031M0517M7721N9599P6144R7160J23162J56150J99400K58287L40015M52719O01489
384C710394P78342R46418J030890R42684O43831K03898k49405o50954r37896j024256r27306
383D466640p44080n56828m01455k83331j96149j31779q2997m4336j1725J7671M5800P3369
382B150800J00268J25506J47282J62690J67923J59385J34505R2695L7173k5370q6736j38944
381C027177j75947j95260j98278j89109j72345j52338j31988j13051r6451q2367p0693o1209
$$ plain form
389 1241769 1157082 1091016 1038011 994237 957466 926650 901470 881804 867210 856807 849425 843839 839297 835164
388 835164 831062 826804 822133 816926 811361 805954 801449 798550 797704 798968 802300 807743 815151 824355 835244 847615 861419
387 861419 876704 893599 912416 933395 956737 982631 1011141 1042277 1075966 1111666 1148343 1184819 1220949 1258031
385 1258031 1298548 1346269 1405868 1482012 1579172 1702334 1858484 2057884 2316171 2656186 3108905 3710394
384 3710394 4488736 5435154 6466044 7408728 8052559 8256457 8007052 7356098 6418202 5393946 4466640
383 4466640 3722560 3165732 2764277 2480946 2284797 2153018 2070021 2025685 2013960 2031631 2077431 2150800
382 2150800 2251068 2376574 2523856 2686546 2854469 3013854 3148359 3241054 3278227 3252857 3166121 3027177
381 3027177 2851230 2655970 2457692 2268583 2096238 1943900 1811912 1698861 1602410 1520043 1449350 1388141
380A388141n3450m7053m1481l6471l1768k7388k3433k0126j7415j5493j4327j3918j4066j4791
378A016961j5646j6118j5668j4062j1494q311n105k364k53J353K725M142N694P426R233J1154
377I69667J3191J5554J8281K1400K4889K8576L2194L5249L6940L6718L4914L3117L2582L4693
376A367965M0986N1857O6315Q3108J01548J20736J39487J56344J68927J73874J67419J46214
374B784780J08812N6856m144o6120j20466j60514j83199j89217j82237j67081j47929j27984
373A601557j09240r2636p8682o7308n8214n0999m5088l9951l5432l1368k7665k4420k1646
372I18908j9472j7716j6297j5187j4210j3340j2615j1942j1093j0332r607q883q221p701p166
371G35126o653o181n649n051m381l656k778j927j264j106j622k788m229n522o466o876o793
$$ plain form
380 1388141 1334691 1287638 1246157 1209686 1177918 1150530 1127097 1106971 1089556 1074063 1059736 1045818 1031752 1016961
378 1016961 1001315 985197 969529 955467 943973 935662 930557 928193 927940 929293 932018 936160 941854 949280 958513 969667
377 969667 982858 998412 1016693 1038093 1062982 1091558 1123752 1159001 1195941 1232659 1267573 1300690 1333272 1367965
376 1367965 1408951 1460808 1527123 1610231 1711779 1832515 1972002 2128346 2297273 2471147 2638566 2784780
374 2784780 2893592 2950448 2946304 2880184 2759718 2599204 2416005 2226788 2044551 1877470 1729541 1601557
373 1601557 1492317 1399681 1320999 1253691 1195477 1144478 1099390 1059439 1024007 992639 964974 940554 918908
372 918908 899436 881720 865423 850236 836026 822686 810071 798129 787036 776704 767097 758214 749993 742292 735126
371 735126 728473 722292 716643 711592 707211 703555 700777 698850 697586 696480 694858 692070 687841 682319 675853 668977 662184
369F62184o573o215n867n514n103m667m131l530k742j852p50N20J748K575K622J520q42l886
367F19497p069r792j1398j1627j0903r637q220p007n967n081m356l836l364l113k957k850
366E12320k756k584k364k190j844j436r63m51Q5O22J157J652K062K360K360J937J148k6j445
364E09644k937m292n251n659n652n179m478l691k832k044j507j034n90j17L54Q27J283J567
362D68412J874K157K302K209J914J380O66j85j170k020k714l565m610n713o729p328p305o518
361D33057n210l792k784k500k957m060n362o590p366p461p101o375n604m879m259l723l195
359C49839k723k360j950j490j017o03j30M02J000J709K497L241L903M240M146L574K534J223
357C68035l84k014l495m585n246n411n128m545l820l017k166j378n90J30R81J861K839L802
$$ plain form
369 662184 655611 649396 643529 638015 632912 628245 624114 620584 617842 615990 615240 615760 617508 620083 622705 624225 623383 619497
367 619497 612428 602636 591238 579611 568708 559071 550851 543844 537877 532796 528440 524604 521240 518127 515170 512320
366 512320 509564 506980 504616 502426 500582 499146 498183 497732 497817 498439 499596 501248 503310 505670 508030 509967 511115 511089 509644
364 509644 506707 502415 497164 491505 485853 480674 476196 472505 469673 467629 466122 465088 464498 464381 464735 465562 466845 468412
362 468412 470286 472443 474745 476954 478868 480248 480914 480729 479559 477539 474825 471260 466650 460937 454208 446880 439575 433057
361 433057 427847 424055 421271 418771 415814 411754 406392 399802 392436 384975 377874 371499 365895 361016 356757 353034 349839
359 349839 347116 344756 342806 341316 340299 339696 339566 339968 340968 342677 345174 348415 352318 356558 360704 364278 366812 368035
357 368035 367651 365637 362142 357557 352311 346900 341772 337227 333407 330390 328224 326846 326256 326386 327367 329228 332067 335869
356C35869M906O077P369Q688R917J0874J1473J1591J1307J0662R875R351R257R670J0521J1817
354D89224J3297J4872J6605J8739K1481K5114K9745L5559M2900N1935O3183P7334R5326J18198
353A113512J46964J82017K22631K65437L02711L22163L08898K52282J53442K7249j03667k16302
352B977337k91953l22642l14354k81757k39630j97551j60277j29383j04649q5280p0314n8710
350G20837m9605m2193l5985l0550k5791k1720j8411j5878j4146j2897j1983j1158j0244r173
349D11103q007o697n280m035l121k626k468k399k399k027j177J02J646L224M643O044P336
348C93862Q549R716J0766J1744J2574J3363J4315J5545J7499K0431K4561L0201L7463M6632
346F67221N8026P1984Q9167J10247J36161J67701K04661K44834K82316L06798L04325K62387
$$ plain form
356 335869 340775 346852 354221 362909 372826 383700 395173 406764 418071 428733 438608 447959 457216 466886 477407 489224
354 489224 502521 517393 533998 552737 574218 599332 629077 664636 707536 759471 822654 899988 995314 1113512
353 1113512 1260476 1442493 1665124 1930561 2233272 2555435 2864333 3116615 3270057 3297306 3193639 2977337
352 2977337 2685384 2362742 2048388 1766631 1527001 1329450 1169173 1039790 935141 849861 779547 720837
350 720837 671232 629039 593054 562504 536713 514993 496582 480704 466558 453661 441678 430520 420276 411103
349 411103 403096 396399 391119 387084 383963 381337 378869 376470 374071 372044 370867 370969 372615 375839 380482 386526 393862
348 393862 402411 412127 422893 434637 447211 460574 474889 490434 507933 528364 552925 583126 620589 667221
346 667221 725247 797231 886398 996645 1132806 1300507 1505168 1750002 2032318 2339116 2643441 2905828
345B905828J77825O1024o7448j84816k71036l14172l15998k89122k48860k06481j68053j35632
344I43059j09429q8666p2360n9473m9238m1013l4261k8683k4063k0251j7339j5101j3597j2746
343C56839j2239j1829j1396j0861j0264r539q684p834p213o867o973p319p789q072q009p473
341B14478o738n888n143m544m014l541l179k958k802k708k676k834l081l364l605l762l722
340A49919l565l191k718k248j775j413j318j315j220j215j215j181j087j008j008r91j148
338A22303j296j296j334j333j412j413j429j429j334j177j025q68o94n37l96k39j65p2L9L8
336A04931L8L8m2j36k33m54o59p54p93p94q36q36p26p26o47o47o47o48o90o91o90o90p16p15
334I1237o36o36o25o26o31o31o61p57q76q76p70p69p12o18n92n91n85n85o06o05m95m95l81
$$ plain form
345 2905828 3083653 3144677 3077229 2892413 2621377 2307205 1991207 1702085 1453225 1246744 1078691 943059
344 943059 833630 744964 672604 613131 563893 522880 488619 459936 435873 415622 398283 383182 369585 356839
343 356839 344600 332771 321375 310514 300250 290711 282027 274193 266980 260113 253140 245821 238032 229960 221951 214478
341 214478 207740 201852 196709 192165 188151 184610 181431 178473 175671 172963 170287 167453 164372 161008 157403 153641 149919
340 149919 146354 143163 140445 138197 136422 135009 133691 132376 131156 129941 128726 127545 126458 125450 124442 123451 122303
338 122303 121007 119711 118377 117044 115632 114219 112790 111361 110027 108850 107825 106957 106263 105726 105330 105091 104926 104854 104893 104931
336 104931 104969 105007 104965 104829 104596 104142 103483 102729 101936 101142 100306 99470 98744 98018 97371 96724 96077 95429 94739 94048 93358 92668 91952 91237
334 91237 90601 89965 89340 88714 88083 87452 86791 86034 85158 84282 83512 82743 82031 81413 80821 80230 79645 79060 78454 77849 77354 76859 76478
332G6478l80l24k29k63k63k58k57k41k42k41k42k67k68l15l14k37k37j90j90k17k18m4m4j9
329G0978k0j6j7N7J05J13K08L12M69O12P06Q89J047J134J354J404J309J147R27P02L55j18
327H3657n91r21j268j625j783j808j761j676j518j379j284j112r53q31p36o29n82n58n10m87
325F1645m87m64m64m64m64l98l98l51l51k32k31j22j21j12j11o8o7J7l0j04j0j2j1ooL3L3
323E6644rrL8J32K05K99M13N07N90O85Q22R80J114J271J435J529J527J527J531J436J261J104
321G5032R82O99M03J19j60n07q25j047j240j334j431j431j427j332j224j130r74q17p10n54
319F1092k99j41K6J20J89J89L31L30K95K01R2o5k92n13o76p71q49q49q03q02p31o37n92m97
317E4348m03k45q2P5J90K37L17L17J83l9k81n02p04p51p38o44n11m16l79l79l61k66j78j78
$$ plain form
332 76478 76098 75774 75545 75282 75019 74761 74504 74263 74021 73780 73538 73271 73003 72688 72374 72137 71900 71710 71520 71303 71085 71041 70997 70978
329 70978 70958 70942 70925 70982 71087 71200 71408 71720 72189 72801 73507 74396 75443 76577 77931 79335 80644 81791 82718 83420 83775 83657
327 83657 83066 82145 80877 79252 77469 75661 73900 72224 70706 69327 68043 66931 65978 65147 64411 63782 63200 62642 62132 61645
325 61645 61158 60694 60230 59766 59302 58904 58506 58155 57804 57572 57341 57219 57098 56986 56875 56807 56740 56757 56727 56623 56613 56601 56590 56584 56578 56611 56644
323 56644 56635 56626 56664 56796 57001 57300 57713 58220 58810 59495 60317 61297 62411 63682 65117 66646 68173 69700 71231 72667 73928 75032
321 75032 76014 76713 77116 77235 77075 76568 75743 74696 73456 72122 70691 69260 67833 66501 65277 64147 63173 62356 61646 61092
319 61092 60793 60652 60678 60798 60987 61176 61507 61837 62132 62333 62425 62360 62068 61555 60879 60108 59259 58410 57607 56805 56074 55437 54845 54348
317 54348 53945 53700 53618 53693 53883 54120 54437 54754 54937 54898 54617 54115 53411 52660 51922 51278 50767 50351 49972 49593 49232 48966 48788 48610
314D8610j60j59j59j59o7o6J3J2J18J18J71J71J40K35K92K93K90K90K43K43J62J63J15J16
312E1025N3N3J43J90J88K82L42L88L53K57J56jj46l03n58p78r12r13r27r27r53r54q59p65
310D4434o89n94n22m27l12l12l79l79k84j90j66k14j61j14j17j64j56j55k06k05k35k35l45
308C7873l45k73k73j63j63j42j42j42j42j07j08j07j08o4o5o4o5m3m3r0r0o9o8j48j47r5r4
305C4513r4r5q6q7j19p1r3j73j48j02j32q4q1j29j19j18j22j22j20j19j20j20o2o3J7J6mm
302C1959M3M3J0J0J0J0n7n6n7n6j23j24j23j23q1q1q1q1j01j00j01j01m2m2m3m2nnJ01J00
300C0661M5l4j00j00r5r5r5r5k2k2k3k2J3J3J3J3KLKKn4n4n3n4j4j4m9j27j24j24q2q2k8k8
296B9177k8k8k5k6k5k5j1j2j2j1k9k8J8O7R0J2j5L2N2N2N5N5K0J9K0K0q0q0q0q0j42j42l2
$$ plain form
314 48610 48450 48291 48132 47973 47906 47840 47853 47865 47983 48101 48272 48443 48583 48818 49110 49403 49693 49983 50226 50469 50631 50794 50909 51025
312 51025 51078 51131 51274 51464 51652 51934 52276 52664 53017 53274 53430 53429 53283 52980 52422 51644 50732 49819 48892 47965 47012 46058 45199 44434
310 44434 43745 43151 42629 42202 41890 41578 41199 40820 40536 40346 40180 39966 39805 39691 39574 39410 39254 39099 38893 38688 38453 38218 37873
308 37873 37528 37255 36982 36819 36656 36514 36372 36230 36088 35981 35873 35766 35658 35594 35529 35465 35400 35357 35314 35224 35134 35065 34997 34849 34702 34607 34513
305 34513 34419 34324 34238 34151 34032 33961 33868 33695 33547 33445 33313 33229 33148 33019 32900 32782 32660 32538 32418 32299 32179 32059 31997 31934 31951 31967 31963 31959
302 31959 32002 32045 32055 32065 32075 32085 32028 31972 31915 31859 31736 31612 31489 31366 31285 31204 31123 31042 30941 30841 30740 30639 30597 30555 30512 30470 30465 30460 30561 30661
300 30661 30706 30672 30572 30472 30377 30282 30187 30092 30070 30048 30025 30003 30016 30029 30042 30055 30057 30060 30062 30064 30010 29956 29903 29849 29835 29821 29772 29645 29521 29397 29315 29233 29205 29177
296 29177 29149 29121 29096 29070 29045 29020 29009 28997 28985 28974 28945 28917 28935 29002 29092 29104 29089 29121 29173 29225 29280 29335 29355 29374 29394 29414 29334 29254 29174 29094 28952 28810 28778
293B8778l3J8J7J7J7k7k7p4p5rj0P0O9P0O9O9P0M2M2M1M2J26J26M7M7N9N9J37J38J42J43J43
290C0343J42J32J32K13K13K89L36L79N20O41P52Q75R86J147J194J180J133R29N98K08j86o37
288D1519j000j227j305j235j124j041r32p65o55n59n11m49l70l31k21j93j94j07j08j21j20
286B8951m2m2l3l3l2l3m8m8L1L2L3L3j4j4p5p5MML0L1P8P8J47J47J47J47J76J76J75J76J49
283C0256J49J49J49J84J84L09L57M61O35P51Q62J000J094J147J148J099R41O48L01j59n68
281D1097q55j011j067j067r79q20n74l54k15j21LR7J68K62K68K20J96J96J56kj34k28l22m16
279C4498m71m24k99k52k23j76j06j06j50j51l10l09l31k83j84q8n3nkM5J06J06J95K91L27
277C1645K33O2r6k87m44m64m65l80k85j98j04p3p2k0k0N9N9O5O4J12J13J97J97K25L21L86
$$ plain form
293 28778 28745 28763 28780 28797 28814 28787 28760 28686 28611 28602 28592 28662 28731 28801 28870 28939 29009 29051 29093 29134 29176 29302 29428 29475 29522 29581 29640 29777 29915 30057 30200 30343
290 30343 30485 30617 30749 30962 31175 31464 31800 32179 32699 33340 34092 34967 35953 37100 38294 39474 40607 41536 42134 42342 42156 41519
288 41519 40519 39292 37987 36752 35628 34587 33655 32890 32235 31676 31165 30716 30346 30015 29794 29601 29407 29300 29192 29071 28951
286 28951 28909 28867 28834 28801 28769 28736 28688 28640 28671 28703 28736 28769 28755 28741 28666 28591 28595 28599 28629 28660 28738 28816 28963 29110 29257 29404 29580 29756 29931 30107 30256
283 30256 30405 30554 30703 30887 31071 31380 31737 32198 32833 33584 34446 35446 36540 37687 38835 39934 40875 41523 41824 41665 41097
281 41097 40242 39231 38164 37097 36118 35298 34724 34370 34155 34034 34037 34134 34302 34564 34832 35052 35248 35444 35600 35598 35464 35236 34914 34498
279 34498 34027 33603 33304 33052 32829 32653 32547 32441 32291 32140 31830 31521 31190 30907 30723 30635 30582 30577 30575 30620 30726 30832 31027 31318 31645
277 31645 31878 31940 31844 31557 31113 30649 30184 29804 29519 29321 29217 29144 29072 29052 29032 29091 29150 29215 29279 29391 29504 29701 29898 30123 30444 30830
274C0830M33M92M91M88M88N24O81Q26J048J358J768K079K237K103J693R25j15j089j751k148
272D3361k149j941j595j294j010q37o79n53m58m07l13j82q8k5k5m3m2q9r0j62j63j15j15k6
270C0960k6R4J88J70J70O5O5k3k3k3k4j25j26j73j72j89j89j88j89k44k45k86k86k50j56j62
268B8613j62o5o4o5o4o0o1lR2J23J24K15L72M15M15N10O67P62P62O02N08L24M0k08m28n73
265C2791o66p38p38o61o62o29n36m13l19k81k81j76q1n5n5OPPOrrP0O9m4m5LLJ8J8m1N4K9
262B6642o6r5j89j85j85j12j11j43j42o4o3j3j2j9j8L2o2q7q7M9N0N0N0l8l7l8l8l0l1l0l1
259B4947noooONQ4Q5J02J01N5N5k0j9k0j9J6J6J5J6L0K9n0m9P7P8P7P7L6L6L6L6R4R5M8M7
256B6099P9P8J57J57M7M8R5R4J39J38J38J38K05K06K05K05K21K22L00L00L91L91L96L97M16
$$ plain form
274 30830 31263 31755 32246 32734 33222 33746 34427 35253 36301 37659 39427 41506 43743 45846 47539 48464 48349 47260 45509 43361
272 43361 41212 39271 37676 36382 35372 34535 33856 33303 32845 32438 32125 31943 31855 31830 31805 31762 31720 31631 31541 31379 31216 31101 30986 30960
270 30960 30934 31028 31216 31386 31556 31621 31686 31663 31640 31617 31593 31468 31342 31169 30997 30808 30619 30431 30242 29998 29753 29467 29181 28931 28775 28613
268 28613 28451 28386 28322 28257 28193 28133 28072 28069 28161 28284 28408 28623 28995 29410 29825 30335 31002 31764 32526 33128 33636 33960 34000 33792 33364 32791
265 32791 32125 31387 30649 29988 29326 28697 28161 27748 27429 27148 26867 26691 26610 26555 26500 26506 26513 26520 26526 26517 26508 26578 26647 26603 26558 26561 26564 26582 26600 26559 26613 26642
262 26642 26576 26481 26292 26107 25922 25810 25699 25556 25414 25350 25287 25274 25262 25243 25225 25257 25195 25108 25021 25070 25120 25170 25220 25182 25145 25107 25069 25039 25008 24978 24947
259 24947 24942 24936 24930 24924 24930 24935 25019 25104 25206 25307 25362 25417 25397 25378 25358 25339 25355 25371 25386 25402 25432 25461 25411 25362 25439 25517 25594 25671 25707 25743 25779 25815 25909 26004 26052 26099
256 26099 26178 26256 26413 26570 26617 26665 26760 26854 26993 27131 27269 27407 27612 27818 28023 28228 28449 28671 28971 29271 29662 30053 30449 30846 31262
253C1262N10N37N36N47N47O38P34P64Q11Q85R80J061J156J267J360J494J589J691J850J931
252E2150J978K081K177K174K175K078J921J688J405J022N50J04l06p23j133j481j701j875
250F4284j923j986j986j895j800j686j591j512j418j273j177j068r73q76p82p34o41n82m87
248C9894m46l52k91k92k59k12j77q3j6L2O1J08J39J87K15K63L54M01M90M90M90N84O84P31
246D2995Q64J022J154J249J332J426J466J560J692J850J929J930J929J929J896J737J472J125
244G0557Q11L39j66o38j008j355j685j906k072k166k195k196k074j917j781j687j626j468
242D5767j357j264j185j029q95q48q05p11p03o09n41n41n35n36l90l91l90l91l30l30l31l30
240C1325k33k33k33k33k44k44j34j34j61j60j13j13n2n1mmm4m4m5m4j8j9K9K9J9J9o0o0j9
$$ plain form
253 31262 31772 32309 32845 33392 33939 34577 35311 36075 36886 37771 38751 39812 40968 42235 43595 45089 46678 48369 50219 52150
252 52150 54128 56209 58386 60560 62735 64813 66734 68422 69827 70849 71399 71503 71197 70474 69341 67860 66159 64284
250 64284 62361 60375 58389 56494 54694 53008 51417 49905 48487 47214 46037 44969 43996 43120 42338 41604 40963 40381 39894
248 39894 39448 39096 38805 38513 38254 38042 37865 37782 37766 37798 37859 37967 38106 38293 38508 38771 39125 39526 40016 40506 40996 41580 42264 42995
246 42995 43859 44881 46035 47284 48616 50042 51508 53068 54760 56610 58539 60469 62398 64327 66223 67960 69432 70557
244 70557 71368 71707 71541 70903 69895 68540 66855 64949 62877 60711 58516 56320 54246 52329 50548 48861 47235 45767
242 45767 44410 43146 41961 40932 40037 39189 38384 37673 36970 36361 35820 35279 34744 34208 33818 33427 33037 32646 32316 31986 31655 31325
240 31325 31092 30859 30626 30393 30149 29905 29771 29637 29476 29316 29203 29090 29038 28987 28983 28979 28935 28891 28846 28802 28784 28765 28794 28823 28842 28861 28801 28741 28722
238B8722j9j9j9m5m6KKK3K4q7q6m7m6L3L2opooo9o8o8o9K7K7K7K7K1K1k6k6L4L5m4m4q3q2
234B8039l9l8o4j12j7L0j8j7n9n8o8k0M8M8O5O5L5Q2R8N0P9Q0N7N7L0P8Q9Q9M4M5J41J41P6
231B9056K9K2P0Q4Np3p4J7J6m0l9l9m0k2k1k2k2kklkp8p7rL8n2n3JJk1K5K9j9k4K2K5k3n5
227B8628K4P1P0M9M8M9M8L5L5L4L5M0M0M0M0M6M6M5M6k0k1P4P4ooJ5O2M3M3jjM7M8M8M8J2
224B9928J2J3J2j6j5j6j5Q1Q0N4J02N5N5O1O1N4J01J01N4O1O2N9N9K5K6R4J41R7R8N6N7K3
221C1620P0J98J98J44R5P6P5J06J07J06J07J55J54J55J55J18J19J49J01P0J18J15O7R0R0Q7
218C4645Q7N1N1N2N1N4N4N4N4M2M2M2M2Q6Q6Q6Q6R8R8R7R8J08J07J05J04J51J03J30J31J47
216C7142J48J48J48J42J42J42J42J61J60R8N0J43K21J71J72J15O8J59K07J73J26J29J76J68
$$ plain form
238 28722 28703 28684 28665 28620 28574 28576 28578 28601 28625 28538 28452 28405 28359 28392 28424 28418 28411 28405 28399 28330 28262 28194 28125 28152 28179 28206 28233 28254 28275 28249 28223 28257 28292 28248 28204 28121 28039
234 28039 28000 27962 27898 27786 27769 27799 27781 27764 27705 27647 27579 27559 27607 27655 27720 27785 27820 27902 28000 28050 28129 28209 28266 28323 28353 28431 28520 28609 28653 28698 28839 28980 29056
231 29056 29085 29107 29177 29261 29266 29193 29119 29136 29152 29112 29073 29034 28994 28972 28951 28929 28907 28905 28903 28900 28898 28820 28743 28734 28772 28720 28667 28668 28669 28648 28673 28702 28683 28659 28681 28706 28683 28628
227 28628 28652 28723 28793 28842 28890 28939 28987 29022 29057 29091 29126 29166 29206 29246 29286 29332 29378 29423 29469 29449 29428 29502 29576 29570 29564 29579 29641 29684 29727 29726 29725 29772 29820 29868 29916 29928
224 29928 29940 29953 29965 29949 29934 29918 29903 29984 30064 30118 30220 30275 30330 30391 30452 30506 30607 30708 30762 30823 30885 30944 31003 31028 31054 31148 31289 31386 31484 31540 31597 31620
221 31620 31690 31888 32086 32230 32325 32401 32476 32582 32689 32795 32902 33057 33211 33366 33521 33639 33758 33907 34008 34078 34196 34311 34378 34468 34558 34645
218 34645 34732 34783 34834 34886 34937 34991 35045 35099 35153 35195 35237 35279 35321 35407 35493 35579 35665 35763 35861 35958 36056 36164 36271 36376 36480 36631 36734 36864 36995 37142
216 37142 37290 37438 37586 37728 37870 38012 38154 38315 38475 38573 38623 38766 38987 39158 39330 39445 39513 39672 39879 40052 40178 40307 40483 40651
213D0651J69J71J71J71J71J71J71J65J66J39J86J82J82J59K06K08K09K09K08J87J40J39J87
211D4718J85J85J87J88J78J77J96K43K49K02J66J20J48J96K12K91K75J97J98J99J98J99J98
209D9305J99K61K62K61K62K39K39K39K39L04L04K57K57J69J70K48K48K28K28J80J81K37K36
207E4753K84K84K83K82K82K83K84K85K37K37K67K67K67K67L05L04L05L04L15L14K98K52K48
205F1207L27L27L27L12L12L60L59L62L62L15L15L69L68L68L68L64L65L17L17L56L57L57L56
203F9147L71L70L70L71M13M14L97L51L50M29M61M61M03M04M03M04M60M59M60M60M27M28M28
200G8641M27M74M74M74M74N20N20N67N68M71M71M71M71N47N47M99N00N38N38N39N38N51N51
198I0371N51N51N12N13N59N60O13O13O13O13O16O17O64O64O07O08O07O08N98N99O46O45N98
$$ plain form
213 40651 40820 40991 41162 41333 41504 41675 41846 42011 42177 42316 42502 42684 42866 43025 43231 43439 43648 43857 44065 44252 44392 44531 44718
211 44718 44903 45088 45275 45463 45641 45818 46014 46257 46506 46708 46874 46994 47142 47338 47550 47841 48116 48313 48511 48710 48908 49107 49305
209 49305 49504 49765 50027 50288 50550 50789 51028 51267 51506 51810 52114 52371 52628 52797 52967 53215 53463 53691 53919 54099 54280 54517 54753
207 54753 55037 55321 55604 55886 56168 56451 56735 57020 57257 57494 57761 58028 58295 58562 58867 59171 59476 59780 60095 60409 60707 60959 61207
205 61207 61534 61861 62188 62500 62812 63172 63531 63893 64255 64570 64885 65254 65622 65990 66358 66722 67087 67404 67721 68077 68434 68791 69147
203 69147 69518 69888 70258 70629 71042 71456 71853 72204 72554 72983 73444 73905 74308 74712 75115 75519 75979 76438 76898 77358 77785 78213 78641
200 78641 79068 79542 80016 80490 80964 81484 82004 82571 83139 83610 84081 84552 85023 85570 86117 86616 87116 87654 88192 88731 89269 89820 90371
198 90371 90922 91473 91985 92498 93057 93617 94230 94843 95456 96069 96685 97302 97966 98630 99237 99845 100452 101060 101658 102257 102903 103548 104146
196A04146N98O19O65O78O78O33O33O16O16O16O16O22O23N76N75O47O47O91O91O92O44O44O91
194A18857O81O82O84O85O85O85O36N89O35O83P00P00O98O98O75O27N98N50O18O18O19N72N51
192A33726N52N74N74N74N74N25N25N72N72N36N37N36N36N38N38M91M91M87M87M87M87M78M79
189A45876M28M28L71L24K75K75L22L69L40L40L34K86L13L13L11L10K31J84J56K33K49J38J09
187A52515J09J86K33J75J75J57J11J37J38Q8Q7M6M6M2M3J8k9n0n0j4j5j5j4j32j32j79j79
185A53497k04k04k51k50k40k39j92j92k52k52l30l31l38l38l37l38l47l47l94l95m21m22m22
183A46461m22m91m91n38n39n32n32n33n32n26n27o68o68o51o50o04o03n49n50n49n50o29o30
180A33497o29o29n98n98n98n98o23o22o70o70o63o63o63o62o63o63o63o62p44p44o96o97o72
$$ plain form
196 104146 104744 105363 106028 106706 107384 108017 108650 109266 109882 110498 111114 111736 112359 112935 113510 114157 114804 115495 116186 116878 117522 118166 118857
194 118857 119538 120220 120904 121589 122274 122959 123595 124184 124819 125502 126202 126902 127600 128298 128973 129600 130198 130748 131366 131984 132603 133175 133726
192 133726 134278 134852 135426 136000 136574 137099 137624 138196 138768 139304 139841 140377 140913 141451 141989 142480 142971 143458 143945 144432 144919 145397 145876
189 145876 146304 146732 147103 147427 147702 147977 148299 148668 149008 149348 149682 149968 150281 150594 150905 151215 151446 151630 151786 152019 152268 152406 152515
187 152515 152624 152810 153043 153218 153393 153550 153661 153798 153936 154024 154111 154157 154203 154245 154288 154306 154277 154227 154177 154163 154148 154133 154119 153987 153855 153676 153497
185 153497 153293 153089 152838 152588 152348 152109 151917 151725 151473 151221 150891 150560 150222 149884 149547 149209 148862 148515 148121 147726 147305 146883 146461
183 146461 146039 145548 145057 144519 143980 143448 142916 142383 141851 141325 140798 140130 139462 138811 138161 137557 136954 136405 135855 135306 134756 134127 133497
180 133497 132868 132239 131641 131043 130445 129847 129224 128602 127932 127262 126599 125936 125273 124611 123948 123285 122622 121960 121216 120472 119776 119079 118407
178A18407o72o72o71p04p04p04p04o61o60p08p08p29p30o50o51o78o79o78o78p87p88p87p87
176A02217p68p67p68p67p27p27p27p28p73p73p26p27p37p38p38p38p41p42o95o94o27o27o27
174H5535o27o36o36o36o36o02o02o30n81n53n52n23n70n83n84n87n87n27n28n28n27n51n51
172G2198n51n51n01n00n01n01n10n10m29l82l80m28m79m80m46m94m96m50l88m36m85m84m86
170F1330m86m34l86l06l05l50l50l37l36l36l37l30l31l33l33k96l42l63l64l24l25l72l72
167E3282m26m26m29m28m03m51m68l89l00k99l42l42l27l27l27l27l37l37l36l37k86k85k68
165D5085k20k07k53k54k06k50k96k65k64k60k12k38k39k35k35j90j91k10k57k31k31k06k06
163C9729j89j41j31j78j93j94j81j34j13j14j44j44j24p7j14j15j12j12j40j39j40j40j89
$$ plain form
178 118407 117735 117063 116392 115688 114984 114280 113576 112915 112255 111547 110839 110110 109380 108730 108079 107401 106722 106044 105366 104579 103791 103004 102217
176 102217 101449 100682 99914 99147 98420 97693 96966 96238 95465 94692 93966 93239 92502 91764 91026 90288 89547 88805 88110 87416 86789 86162 85535
174 85535 84908 84272 83636 83000 82364 81762 81160 80530 79949 79396 78844 78321 77751 77168 76584 75997 75410 74883 74355 73827 73300 72749 72198
172 72198 71647 71096 70595 70095 69594 69093 68583 68073 67644 67262 66882 66454 65975 65495 65049 64555 64059 63609 63221 62785 62300 61816 61330
170 61330 60844 60410 60024 59718 59413 59063 58713 58376 58040 57704 57367 57037 56706 56373 56040 55744 55402 55039 54675 54351 54026 53654 53282
167 53282 52856 52430 52001 51573 51170 50719 50251 49862 49562 49263 48921 48579 48252 47925 47598 47271 46934 46597 46261 45924 45638 45353 45085
165 45085 44865 44658 44405 44151 43945 43695 43399 43134 42870 42610 42398 42160 41921 41686 41451 41261 41070 40860 40603 40372 40141 39935 39729
163 39729 39540 39399 39268 39090 38897 38703 38522 38388 38275 38161 38017 37873 37749 37672 37558 37443 37331 37219 37079 36940 36800 36660 36471
161C6471j89j42j42j59j59k06k06j73j73j25j26j38j37r1r1l9l9m0l9o1o0o1o1j19j20m1m1
158C3493p1p1j18j18q6q5j65j64k07k07k07k06j66j65j66j65k24k23j76j76j83j83j84j83
156B9594j94j95j95j95j15j15j15j15j61j61k09k08j93j94j93j94p9p8p9p9j14j14o7o7n7
154B6108n6j0rJ8J9k9k9l7l8M2M2onooL3L3L2L3m7m7r5r4j33j34j33j33q7q7j66j66k16k17
151B4374j37j38j54j54j55j54r6r5j43j42j33j33j33j33o1o0j40j39q4q3q3q3j03j03j03j02
148B1330j44j45j41o2kkKLOOONl0l1l0l0m8m7m7m7r6r7m9m9j27j27j27j26q6q5q6q5j45j45
145A9122j41j42j25p7j33q7qn6j05j05o0o1j6j7o4j12q5q6n7n6n7n7l7l6J3O0N5Om2m2n4n3
142A7285N7N7J%Q0P9O2O3J3l4l4J2O7J14R0R1N6k3m3r0r5m8n5n4n2n2n1n2n1n2n1n2n1n2m6
$$ plain form
161 36471 36282 36140 35998 35839 35680 35474 35268 35095 34922 34797 34671 34533 34396 34305 34214 34175 34136 34096 34057 33996 33936 33875 33814 33695 33575 33534 33493
158 33493 33422 33351 33233 33115 33029 32944 32779 32615 32408 32201 31994 31788 31622 31457 31291 31126 30902 30679 30503 30327 30144 29961 29777 29594
156 29594 29400 29205 29010 28815 28700 28585 28470 28355 28194 28033 27824 27616 27423 27229 27036 26842 26763 26685 26606 26527 26413 26299 26232 26165 26108
154 26108 26052 26042 26033 26051 26070 26041 26012 25975 25937 25979 26021 26015 26010 26004 25998 26031 26064 26096 26129 26082 26035 25940 25846 25713 25579 25446 25313 25226 25139 24973 24807 24591 24374
151 24374 24237 24099 23945 23791 23636 23482 23386 23291 23148 23006 22873 22740 22607 22474 22413 22353 22213 22074 21990 21907 21824 21741 21638 21535 21432 21330
148 21330 21186 21041 20900 20838 20836 20834 20836 20839 20845 20851 20857 20862 20832 20801 20771 20741 20693 20646 20599 20552 20456 20359 20310 20261 20134 20007 19880 19754 19668 19583 19497 19412 19267 19122
145 19122 18981 18839 18714 18637 18504 18417 18409 18353 18248 18143 18083 18022 18006 17989 17925 17813 17728 17642 17585 17529 17472 17415 17378 17342 17355 17415 17470 17476 17434 17392 17338 17285
142 17285 17342 17399 17400 17400 17480 17559 17621 17684 17697 17663 17629 17641 17708 17822 17912 18003 18059 18036 17993 17903 17808 17760 17705 17651 17599 17547 17496 17444 17393 17341 17290 17238 17187 17135 17089
139A7089m6m6m6k1k2k1k1m8m7r5r4l3l2l3l2j4j3j4j3k6k5k5k6J1J0QPL4j3J3J3NMNMj2j2
135A6373O6O6N8N8N8N8K4K5N4Oj2L4L2j6j1j0j4j4J2J1N9N9O2O3O2O3M7M8nn3m3m3kkl8q5
132A7050q6l7rqlkk7K1rq8q8q9r3r4p8p8j05n8KJNMm4m4k6K1k6p2m3m3K7K7K6K7qrJ2O0Q5
128A6101Q4J15O7L4L5L2L1J5J5k9l0kM6J9J9popom2m2NOl5l4j4L3M3M2M5M5O2O1O2O1J9J8
125A6861J8J8M1M0M0M1M2M2nnlmq2q3LKj5o3q6l8l8q6q3l7l9q7q5q5l7J2j7j6j4j3NNKKNm3
121A6115o6o6N8J1p3p3l2l2k8k9j7K9Jp9k6k6p6p5p4k7l5J2J3l4nnmmlmQ2Q1L5L5J8J8M8J
117A5664k7K1O7O6%m8k1k1J8J8O6O5j7j7l4q2n5qqn5q9m1p1p1k3k4j03j02m0l9m5m4j11j89
114A4600j00J0Nm2j19j19r7r6j26p9m0q6j05j04p6p6j55k02j33n4k5k6l6q2j01j00p9l1j1
$$ plain form
139 17089 17043 16997 16951 16930 16908 16887 16866 16818 16771 16676 16582 16549 16517 16484 16452 16438 16425 16411 16398 16372 16347 16322 16296 16307 16317 16325 16332 16366 16353 16366 16379 16384 16388 16393 16397 16385 16373
135 16373 16439 16505 16563 16621 16679 16737 16761 16786 16840 16846 16834 16868 16900 16884 16873 16863 16849 16835 16847 16858 16917 16976 17038 17101 17163 17226 17273 17321 17316 17263 17220 17177 17175 17173 17135 17050
132 17050 16964 16927 16918 16910 16907 16905 16878 16899 16890 16802 16714 16625 16532 16438 16360 16282 16177 16119 16121 16122 16127 16131 16087 16043 16017 16038 16012 15940 15897 15854 15881 15908 15934 15961 15953 15944 15956 16016 16101
128 16101 16185 16300 16367 16401 16436 16468 16499 16514 16529 16500 16470 16468 16514 16533 16552 16545 16539 16532 16526 16484 16442 16447 16453 16418 16384 16370 16403 16446 16488 16533 16578 16640 16701 16763 16824 16843 16861
125 16861 16879 16897 16938 16978 17018 17059 17101 17143 17138 17133 17130 17126 17044 16961 16964 16966 16951 16888 16802 16764 16726 16640 16557 16520 16481 16394 16309 16224 16187 16199 16182 16166 16152 16139 16144 16149 16151 16153 16158 16115
121 16115 16049 15983 16041 16052 15979 15906 15874 15842 15814 15785 15768 15797 15798 15719 15693 15667 15591 15516 15442 15415 15380 15392 15405 15371 15366 15361 15357 15353 15350 15346 15428 15509 15544 15579 15597 15615 15663 15664
117 15664 15637 15658 15725 15791 15791 15743 15722 15701 15719 15737 15803 15868 15851 15834 15800 15718 15663 15655 15647 15592 15503 15462 15391 15320 15297 15273 15170 15068 15028 14989 14944 14900 14789 14600
114 14600 14500 14510 14515 14473 14354 14235 14138 14042 13916 13837 13797 13711 13606 13502 13426 13350 13195 12993 12860 12806 12781 12755 12719 12637 12536 12436 12357 12326 12315
111A2315j1mnnnJ6J6k8k8k0K8K8k0j9j9o7J3O3O4J13J13j5o2l5l6l6l6n7j05p8p9o1j3QQl6
108A1905l7n2n3n2n3l0l1l1l1opn0n1NN3N0Kj2o0o3j6j5j5j1j2m4m4%%j9o7m0m0k8k9k9k9
104A0958MMMLK4K3k5k4k5k5k5k6l0l1k7k8n4pl4l3k1k0n0lL2j6o0j2l0l0N2N2j3j3L4L4K2
101A0584K1Jm7l7l7QPK6K6K5K6RRj8L0N8N7J4J3k7k6k7k7j5j4j4j5j4j4j5j4rj0J7l0q9q9
97A0343m5m5k3k3k3k3r7r7l4M5Qm0j2j1k7p3p7k9M1on5n5k3k3k3k2k0j9KM8N2N2k1k2oM1J2
94I670J1Mm3m4MM3M3M6M6Q7Q8L5j2K6K6K3K3l3l3J4J5l4l3J3J4J0J0L0P8R5R5R9R8J19J19
91A0752O4O5J3r7j73j74q1l4j1L6L6j1K2K1J3O0J14J61J44R7P9J74K80L75M25N21O26P84J000
88A5281J284J672K207K877L665M593N507O322O417N472L360O59k208m517n683n702m978m060
$$ plain form
111 12315 12304 12300 12295 12290 12285 12301 12317 12289 12261 12241 12269 12297 12277 12258 12239 12172 12185 12248 12312 12425 12538 12523 12461 12426 12390 12354 12318 12261 12156 12078 11999 11938 11925 11933 11941 11905
108 11905 11868 11816 11763 11711 11658 11628 11597 11566 11535 11529 11522 11472 11421 11426 11479 11529 11531 11519 11459 11396 11380 11365 11350 11339 11327 11283 11239 11239 11239 11220 11153 11113 11073 11045 11016 10987 10958
104 10958 10962 10966 10970 10973 10997 11020 10995 10971 10946 10921 10896 10870 10840 10809 10782 10754 10700 10693 10659 10626 10605 10585 10535 10532 10564 10548 10488 10476 10446 10416 10468 10520 10507 10494 10528 10562 10584
101 10584 10605 10606 10559 10522 10485 10493 10500 10526 10552 10577 10603 10612 10621 10603 10633 10691 10748 10762 10775 10748 10722 10695 10668 10653 10639 10625 10610 10596 10582 10567 10553 10544 10534 10551 10521 10432 10343
97 10343 10298 10253 10230 10207 10184 10161 10064 9967 9933 9978 9986 9946 9934 9923 9896 9823 9746 9717 9758 9752 9697 9642 9619 9596 9573 9551 9531 9512 9514 9562 9614 9666 9645 9623 9617 9658 9670
94 9670 9681 9685 9642 9598 9602 9645 9688 9734 9780 9867 9955 9990 9978 10004 10030 10053 10076 10043 10010 10024 10039 10005 9972 9985 9999 10009 10019 10049 10127 10222 10317 10416 10514 10633 10752
91 10752 10816 10881 10894 10797 10624 10450 10369 10335 10324 10360 10396 10385 10407 10428 10441 10501 10615 10776 10920 11017 11096 11270 11550 11925 12350 12871 13497 14281 15281
88 15281 16565 18237 20444 23321 26986 31579 37086 43408 49825 55297 58657 59316 57108 52591 46908 41206 36228 32168
86C2168l210k492k020j700j480j385j227j102r45q67q20p39n82m52l58l37l36k83k84k59k59
84A1031j49j49j53j53r6jR0R1M9N0o3o3j10j10j81j81k28k28j97j97j19j19p9p8p9p9j36j36
81H227k5k6o0o0r2m5rj03p4k6K6K7L0K9j3j4j4j3K8K9K9K8k2k3k2k3L5L6L5L5N2N1N2N2J%
78H138m7m6K3K3K3K3l7l7l8l7J2J2l6l5k3k2K4K5jjj8o6l8Rk3k3M9Lj9j8l2l2l1l2l2l2n8
75G550j1j9k0j6j7p0p1k1k0k6K1noJ%J%kklkl4l5K6J05J15L6L9L8K3K4K3K4NOONl4l5j7L0
71G612N2Nm4m5LLj3o1m9L0R0R0J1l6n7n7l9l9k2K6km9o4o4r2m4k4k4m2m2ONj6j7j7j6o5o5
67F828m4Lk8k8k4k5ONOOj%K5k1n4n4K7P4O0O0O2O3M2M1M2M2J7J7J8J7L8L9p1p2J4J3O1O1Q2
63G347Q1Q7Q6O9J48J46J46P9%n0j29j41r3m6m6p6p6p7p6k9k8k9k9k8k9k8k9q0q1q0q1J1J0
$$ plain form
86 32168 28958 26466 24446 22746 21266 19881 18654 17552 16607 15740 14920 14181 13599 13147 12789 12452 12116 11833 11549 11290 11031
84 11031 10882 10733 10580 10427 10331 10330 10420 10511 10560 10610 10547 10484 10374 10264 10083 9902 9674 9446 9249 9052 8933 8814 8735 8657 8578 8499 8363 8227
81 8227 8202 8176 8116 8056 7964 7919 7910 7807 7733 7707 7733 7760 7790 7819 7806 7792 7778 7765 7793 7822 7851 7879 7857 7834 7812 7789 7824 7860 7895 7930 7982 8033 8085 8137 8138 8138
78 8138 8091 8045 8068 8091 8114 8137 8100 8063 8025 7988 8000 8012 7976 7941 7918 7896 7920 7945 7944 7943 7925 7859 7821 7830 7807 7784 7833 7836 7817 7799 7767 7735 7704 7672 7640 7608 7550
75 7550 7539 7520 7500 7484 7467 7397 7326 7305 7285 7259 7280 7275 7269 7270 7270 7271 7271 7269 7267 7264 7262 7228 7193 7219 7324 7439 7475 7514 7552 7575 7599 7622 7646 7651 7657 7663 7668 7634 7599 7582 7612
71 7612 7664 7669 7625 7580 7583 7586 7573 7512 7463 7493 7583 7673 7684 7648 7591 7534 7495 7456 7434 7460 7458 7409 7345 7281 7189 7145 7121 7097 7055 7013 7019 7024 7008 6991 6974 6958 6893 6828
67 6828 6784 6787 6759 6731 6707 6682 6688 6693 6699 6705 6704 6704 6729 6708 6654 6600 6627 6701 6761 6821 6883 6946 6988 7029 7071 7113 7130 7147 7165 7182 7220 7259 7188 7116 7130 7143 7204 7265 7347
63 7347 7428 7515 7601 7670 7818 7964 8110 8189 8189 8139 8010 7869 7776 7730 7684 7608 7532 7455 7379 7350 7322 7293 7264 7236 7207 7179 7150 7070 6989 6909 6828 6839 6849
60F849J0J0l0l1l0l0j1j1j0j1o4o4o3o4LLLLk2k2k2k2j8j8K9K9P6P5lkL2L3P9Q0O3O3J10J10
57G112J9K0J9K0j2j2j2j2m0l9m0m0j17j17j17j17j03j02k4k3k1k1k2k1l6l6l5l6k1k1k1k0
54E952MMMLn7n7K1K1k3k2k3k3n0n0n0n1k2k3k2k2MNNNL2L3L2L2l9l9l9l9k7k8k7k7l1l1l0
50E305l1J2J3J3J2q3q3q3q3k2k1p0o9m6m7N8N8L5n9j07j2J9J8K5K5l0l0k9l0J2J2J1J2L6L5
47D776J0q5n6n6J7J7L7L8j0rl7l6l7l6m0l9m0l9K4K5K5K4llllj4j5j4j5lkllQQQQK0J9K0K0
43D503M3M3M3M3k4k4k4k3k0j9k0j9k0j9j9k0lmlml1l1l1l1k4k4k4k4nmnnm0m1m1m1n5n5K4
39C922K4M2M1l7l8l9l9m0l9j2j2j2j1J5J6J6J6j9j8J2l4k4N4PPL2L2Q0Jl3J5j7j7mnmnmmn
35C860mnmnnl7l7l7l7j3j4L4L4K5K4n5n4rrrrOOOOm3m4m1m1qL9O0j9o0j2O2J4m6m7kloppo
$$ plain form
60 6849 6859 6869 6839 6808 6778 6748 6737 6726 6716 6705 6641 6577 6514 6450 6453 6456 6459 6462 6440 6418 6396 6374 6356 6338 6367 6396 6472 6547 6544 6542 6574 6607 6686 6766 6829 6892 7002 7112
57 7112 7131 7151 7170 7190 7178 7166 7154 7142 7102 7063 7023 6983 6866 6749 6632 6515 6412 6310 6286 6263 6242 6221 6199 6178 6142 6106 6071 6035 6014 5993 5972 5952
54 5952 5956 5960 5964 5967 5910 5853 5874 5895 5872 5850 5827 5804 5754 5704 5654 5603 5581 5558 5536 5514 5518 5523 5528 5533 5565 5598 5630 5662 5623 5584 5545 5506 5479 5451 5424 5397 5366 5335 5305
50 5305 5274 5286 5299 5312 5324 5241 5158 5075 4992 4970 4949 4879 4810 4764 4717 4775 4833 4868 4809 4702 4690 4709 4727 4752 4777 4747 4717 4688 4658 4670 4682 4693 4705 4741 4776
47 4776 4786 4701 4645 4589 4606 4623 4660 4698 4688 4679 4642 4606 4569 4533 4493 4454 4414 4375 4399 4424 4449 4473 4470 4467 4464 4461 4447 4432 4418 4403 4400 4398 4395 4392 4400 4408 4416 4424 4444 4463 4483 4503
43 4503 4546 4589 4632 4675 4651 4627 4603 4580 4560 4541 4521 4502 4482 4463 4444 4424 4421 4417 4414 4410 4379 4348 4317 4286 4262 4238 4214 4190 4185 4181 4176 4171 4131 4090 4049 4008 3953 3898 3922
39 3922 3946 3988 4029 3992 3954 3915 3876 3836 3797 3785 3773 3761 3750 3765 3781 3797 3813 3794 3776 3788 3754 3730 3784 3791 3798 3830 3862 3942 3943 3910 3925 3908 3891 3887 3882 3878 3873 3869 3865 3860
35 3860 3856 3851 3847 3842 3837 3800 3763 3726 3689 3676 3662 3696 3730 3755 3779 3724 3670 3661 3652 3643 3634 3640 3646 3652 3658 3615 3571 3530 3489 3481 3520 3580 3561 3501 3489 3551 3565 3519 3472 3470 3467 3461 3454 3447 3441
31C441QQQQk6k7k6k7k7k6k7k6nmnml3l2l2l2j8j8j8j8m0m0L9L9k7k7K0K0L1L0L4L4K4P2N1
27C302m3r6r6k3k3j4j3j4j4l7l6l7l7RRRRlkllj2j1j1j2j1j2j1j2K7K8K7K7K3K3k7j23j33
24B624l8J3J3l6l5l3l2N2R9N2m2l0O5NOmmppj8o5r5%K1k6k3K4M4m%M6klJ%l0l0l0l0k3k3N6
20B451N6L0K9j8j8l8l9n0M4J03Qj2j2l0l0l0l0JJ%JRRRRRRRRm9n0m9m9ooporrrrK1K1K2K1
16B316l8l8m5N1Q4Q4k1k0k7k6k6k6%j%jM1M1poM5M5l4l4k4k4k3k4MMMMK1K2k1k0n4M1L5L5
12B337j3j3j4j3k1k1k1k1M3M3l6l5QRRQj3j4j4j3L0L1m8m8onnoK5K6K5K5QQQQr0r0m4m3JJ
8B006M8M8llmlmmmmKKKKJ5J5J4J5K6K7n3n2J3J3O0O0M6M5l3l4j5j6j6j5l1l0P5P5N7k1q8q7
4B146m6m6m6m6K3K3k1k1k4K3K3k5oorj0j5j5j5j5Q6Q6Q2Q1J6o2r4r4j4L4L6j0k5K3K0k7l8
$$ plain form
31 3441 3449 3457 3465 3473 3447 3420 3394 3367 3340 3314 3287 3261 3256 3252 3247 3243 3210 3178 3146 3114 3096 3078 3060 3042 3002 2962 3001 3040 3013 2986 3006 3026 3057 3087 3121 3155 3179 3251 3302
27 3302 3259 3163 3067 3044 3021 3007 2994 2980 2966 2929 2893 2856 2819 2828 2837 2846 2855 2852 2850 2847 2844 2832 2821 2810 2798 2787 2775 2764 2752 2779 2807 2834 2861 2884 2907 2880 2757 2624
24 2624 2586 2599 2612 2576 2541 2508 2476 2528 2627 2679 2637 2607 2672 2677 2683 2679 2675 2668 2661 2643 2578 2483 2483 2504 2478 2455 2479 2523 2519 2519 2565 2563 2560 2561 2561 2531 2501 2471 2441 2418 2395 2451
20 2451 2507 2537 2566 2548 2530 2492 2453 2403 2447 2550 2558 2546 2534 2504 2474 2444 2414 2415 2416 2416 2417 2426 2435 2444 2453 2462 2471 2480 2489 2440 2390 2341 2292 2286 2280 2273 2267 2258 2249 2240 2231 2252 2273 2295 2316
16 2316 2278 2240 2195 2246 2330 2414 2393 2373 2346 2320 2294 2268 2268 2267 2267 2266 2307 2348 2341 2335 2380 2425 2391 2357 2333 2309 2286 2262 2266 2270 2274 2278 2299 2321 2300 2280 2226 2267 2302 2337
12 2337 2324 2311 2297 2284 2263 2242 2221 2200 2243 2286 2250 2215 2223 2232 2241 2249 2236 2222 2208 2195 2225 2256 2208 2160 2154 2149 2144 2138 2163 2189 2214 2239 2247 2255 2263 2271 2181 2091 2047 2004 2005 2006
8 2006 2054 2102 2099 2096 2092 2089 2085 2081 2077 2073 2075 2077 2079 2081 2096 2111 2125 2140 2166 2193 2140 2088 2101 2114 2174 2234 2280 2325 2292 2258 2243 2227 2211 2196 2165 2135 2210 2285 2342 2321 2233 2146
4 2146 2100 2054 2008 1962 1985 2008 1987 1966 1942 1965 1988 1963 1957 1951 1942 1932 1917 1902 1887 1872 1958 2044 2126 2207 2223 2161 2067 1973 1959 1993 2029 2019 1994 2017 2037 2010 1972
0A972l8k4K4J7l0k7J9M8M7LMj4j4j0j1l7J1J0l7l9m0m3m2NON0N1L8rl0k9M5M5kkj8j9o6o6
-3A748J1J0j6L2L6L6j0n7n0kM6M7L9L9rql5l5o1j4L1L1j3j3j6j6o1o1m1NK6K6L1L2j6j7J8
-7A693J7k7k7o0j4L9L8M4M3mlm3m3MMLLMLL8L8o7o7k5N4L9qk2K5K2k5m1m2LKjjkjl4l4J3J4
-11A552L5L5j2j2J8J8J7J8o4o3o4o3K7K7K7K7J5J5J5J6LLMLj3j4j3j3OOPOmmmml0k9p4NO0
-15A485O0J8J7j7j8j8j7k0j9O0O0j7j7o5o4j9j9j9j9K4K5K4K4k3k3K3K4J0RRRk4k4k3k4K4
-18A416K5K4K4j1j1n3n3o9RP6P6mln1n1m7m7L2L2M1M2l5l4k4K4llJ8J8J7J8l8l9l5l5m6JK2
-22A223K2M1M2M2M1JJJJm3m2m3m3J6J6J5J6N7N7J0J0n4n4opj3j3j4j3j3j2L5L5K0K0K1K0q
-25A385pJ9k8J8J8J3J2l1p8p8l1K2K2n4n3J2J2O0O0QQJ2J1j1L6PPOm2j4j5LLp0k3K5K5K8K8
$$ plain form
0 1972 1934 1910 1934 1951 1921 1894 1913 1961 2008 2011 2015 2001 1987 1977 1966 1929 1940 1950 1913 1874 1834 1791 1749 1754 1760 1810 1861 1899 1890 1860 1831 1876 1921 1919 1917 1899 1880 1814 1748
-3 1748 1759 1769 1753 1785 1821 1857 1847 1790 1740 1738 1784 1831 1870 1909 1900 1892 1857 1822 1761 1747 1778 1809 1796 1783 1767 1751 1690 1629 1588 1593 1619 1645 1676 1708 1692 1675 1693
-7 1693 1710 1683 1656 1596 1582 1621 1659 1703 1746 1742 1739 1696 1653 1657 1661 1664 1667 1671 1674 1712 1750 1683 1616 1591 1645 1684 1676 1654 1679 1701 1676 1635 1593 1596 1598 1597 1596 1594 1593 1559 1525 1538 1552
-11 1552 1587 1622 1610 1598 1616 1634 1651 1669 1605 1542 1478 1415 1442 1469 1496 1523 1538 1553 1568 1584 1587 1590 1594 1597 1584 1570 1557 1544 1550 1556 1563 1569 1565 1561 1557 1553 1523 1494 1420 1425 1485
-15 1485 1545 1563 1580 1563 1545 1527 1510 1490 1471 1531 1591 1574 1557 1492 1428 1409 1390 1371 1352 1376 1401 1425 1449 1426 1403 1426 1450 1460 1469 1478 1487 1463 1439 1416 1392 1416
-18 1416 1441 1465 1489 1478 1467 1414 1361 1292 1301 1377 1453 1449 1446 1395 1344 1297 1250 1282 1314 1355 1397 1362 1328 1304 1328 1325 1322 1340 1358 1375 1393 1355 1316 1281 1246 1200 1201 1223
-22 1223 1245 1286 1328 1370 1411 1412 1413 1414 1415 1372 1330 1287 1244 1260 1276 1291 1307 1364 1421 1431 1441 1387 1333 1327 1320 1307 1294 1280 1267 1254 1242 1277 1312 1332 1352 1373 1393 1385
-25 1385 1378 1397 1369 1387 1405 1418 1430 1399 1321 1243 1212 1234 1256 1202 1149 1161 1173 1233 1293 1301 1309 1321 1332 1321 1357 1364 1371 1377 1335 1321 1306 1309 1312 1242 1219 1244 1269 1297 1325
-29A325J0J1l6l7m7m7L1L2L2L3Lp6n9J9M9N0lkK4k3m1m1j4o2m8%M5M6L8rl0l0J6J6J7J6L0
-32A238L1L0L0J5J5l2l3k0k1k0k1POm1m1J1J0J1J0K3K4L2o2p1k4N4N4J0J0J0J0l8l7J0J0N
-36A205NNNJ2J3J3J3m9m9K9L0J3J3J3J3l3l3l4l3q8q8N3N4N1N2MMk3k2j02j01K6K6K6K6K1
-39A070K1K1K1KJKKk6k6k6k6jkjkk0k0K6P3J02Pj6j6m2m2NNJ2J2J2J2l6l6l6l6MMMLMMMMk7
-43A000k8k7k7K4K3K4K4lklkk0k1K7K7K3K2k5k5NMNMj9j9j9j9%J%Jj3j2j3j2K3K3K3K3j4j4
-47I69j4j5kkklj2j2j2j2N2N2k7k7ooooM1M0M0M1J6J7J7J6m7m7m8m7J7J7o2o2qqP1P1M0L9
-51A063l9m0m6m6L3L2m4m4m4m4KJM9M8MLLLJ3J3l5l4klklnnonK6K6K6K6L7L8L8L8k0k0k0k0
-55I95%%%jl5l6l6l5L4L4L5L4p3p3k6k6L1L0L0L1k4k4k3k4J7J8l0l0j0j1L7L6M4M5o6o6pp
$$ plain form
-29 1325 1335 1346 1310 1273 1226 1179 1210 1242 1274 1307 1310 1234 1175 1194 1243 1293 1290 1288 1312 1289 1248 1207 1193 1131 1083 1083 1128 1174 1212 1203 1173 1143 1159 1175 1192 1208 1238
-32 1238 1269 1299 1329 1344 1359 1327 1294 1274 1253 1233 1212 1219 1225 1184 1143 1154 1164 1175 1185 1208 1232 1264 1202 1131 1107 1161 1215 1225 1235 1245 1255 1217 1180 1190 1200 1205
-36 1205 1210 1215 1220 1232 1245 1258 1271 1222 1173 1202 1232 1245 1258 1271 1284 1251 1218 1184 1151 1063 975 1028 1082 1133 1185 1189 1193 1170 1148 1046 945 971 997 1023 1049 1070
-39 1070 1091 1112 1133 1135 1136 1138 1140 1114 1088 1062 1036 1035 1033 1032 1030 1010 990 1016 1089 1191 1198 1182 1166 1124 1082 1087 1092 1104 1116 1128 1140 1104 1068 1032 996 1000 1004 1008 1011 1015 1019 1023 1027 1000
-43 1000 972 945 918 942 965 989 1013 1010 1008 1005 1003 983 962 989 1016 1039 1061 1036 1011 1016 1020 1025 1029 1010 991 972 953 953 954 954 955 942 930 917 905 928 951 974 997 983 969
-47 969 955 940 938 936 934 931 919 907 895 883 935 987 960 933 927 921 915 909 950 990 1030 1071 1087 1104 1121 1137 1090 1043 995 948 965 982 920 858 850 842 913 984 1024 1063
-51 1063 1024 984 938 892 925 957 913 869 825 781 783 784 833 881 885 888 891 894 907 920 885 851 849 846 844 841 836 831 825 820 846 872 898 924 961 999 1037 1075 1055 1035 1015 995
-55 995 995 995 995 994 959 923 887 852 886 920 955 989 916 843 817 791 822 852 882 913 889 865 842 818 835 853 823 793 783 772 809 845 889 934 868 802 795 788
-59G88M1M0J4J4J7J7ON3Mr0l4J3Pm0l9l9L7L7nmnmk2k1K6K6K4K4K4K4J4J4l3l3NNm2m2m0m0
-62G41L8L9rqrqJ7J8J8J8M9M9K7o8r2m4KKjjjjOPOOL1L1L1L0KKJ4q1n7L7Nm2j5j5j7j8k4k5
-67F90K3K3j8j8j8j8j1j1O8O7L1L0j6j7j6j6j5j6K4K5k3k3k3k3K5K4J6J6J7J6jjm8m8J4J3
-70G42l4l4j0j0j0j1N1N0N0N1rrrrj3j3j3j3J4J3l4l3l5l5l5l5NNN3N3N7N7k1k2k0k1K7K7
-74G67k4k3k4k3J5J5J5J4J4J3J4J3m8m9jjJ0J1J0J1L8L8m1m0J2J2J2J2j3j2j3j2J5J6J5J6
-77G84j7j7j7j7k7k8K0K1j1j0n8n8L0L1j7j7J1J1J2J1k1k2N7N6LLp6p6n9n9J9K0L0K9L0K9
-80F00J0J0RJ0j0j1j0j0J9J9J9J9jjj%k6k7Om2j1O7K0K0J1J1l7l7n7n8K2K1N1N2LML8L7j0
-84G29j0l9l9RQk3k3K4K4M0M0ppk2k2N2N1pq6o9k1M8M8J6o3o3o4J0J1popol6l5M3M3K7K7n3
$$ plain form
-59 788 829 869 883 897 914 931 937 990 994 904 870 883 890 850 811 772 809 846 841 837 832 828 806 785 811 837 861 885 909 933 947 961 928 895 900 905 863 821 781 741
-62 741 779 818 809 801 792 784 801 819 837 855 904 953 980 912 820 776 778 780 779 778 777 776 782 789 795 801 832 863 894 924 926 928 942 861 804 841 846 804 789 774 757 739 715 690
-67 690 713 736 718 700 682 664 653 642 710 777 808 838 822 805 789 773 758 742 766 791 768 745 722 699 724 748 764 780 797 813 812 811 763 715 729 742
-70 742 708 674 664 654 644 633 684 734 784 835 826 817 808 799 786 773 760 747 761 774 740 707 672 637 602 567 572 577 630 683 740 797 776 754 734 713 740 767
-74 767 743 720 696 673 688 703 718 732 746 759 773 786 738 689 688 687 697 708 718 729 767 805 764 724 736 748 760 772 759 747 734 722 737 753 768 784
-77 784 767 750 733 716 689 661 681 702 691 681 623 565 595 626 609 592 603 614 626 637 616 594 651 707 710 713 637 561 502 443 462 482 512 541 571 600
-80 600 610 620 629 639 629 618 608 598 617 636 655 674 673 672 671 671 645 618 624 582 571 638 658 678 689 700 663 626 569 511 533 554 605 657 660 664 702 739 729
-84 729 719 680 641 650 658 635 612 636 660 700 740 733 726 704 682 734 785 778 692 623 602 650 698 714 651 588 524 534 545 538 532 525 519 483 448 491 534 561 588 535
-88E35n2l0l0J7J7L2L1L2L2N3N3k6k5kjjjnonnj8j7L0L1L1L2m8m7j1j2j2j2J8J7J7J7klkk
-92F20MNNNm6m6m6m7L9L8L9L8K7K7K3K4Om0j5j4ONONj6j7NN1K0K1l0p6nmqpj0rl9QJ2l5oo
-96E17j4j4j4j4O4O3J1l6l3l2j7K9J0l7l8J0J0l8nn%M7M7jJ0RPOj3j4j3j4M3M3l3l4KM9K3
-100E81K2n4n4n2n1KM9M9JMMkkL6j1J5J6ppppNOOOl5l5o1j4kkk6K1PPJ2J3j1L6NNMp5n8j0
-104C29J5J6M4kl0k9K0O8M7M8M8M7K1k8%jQPPQk1k2j8j8p3k6N8N8k9k8k9k9mmmmj1j1j1j0
-108D07l8l8L8L8M3mmM3J7J7J7J7%m7k0k1nmnnk0j9k0k0M1M2pok3k4K3P1O3j6j3j3k8J9K3
-111E19k5l1J6J3l5pqJ9k8kM6J6J6rqonl7J1j6j6j3j3j3j3j3j2n7K1J0J0M2oJ1J2j8K9K3K2
-115D45K6K5l5l4l5l5klJJk9J8P1P0oopol5l6l5l6k0k1N8N8K4K4K4K5n4n4n3n4K3K4K3K3J2
$$ plain form
-88 535 483 453 423 440 457 489 520 552 584 637 690 664 639 637 636 635 634 629 623 618 613 595 578 608 639 670 702 654 607 596 584 572 560 578 595 612 629 627 624 622 620
-92 620 624 629 634 639 593 547 501 454 493 531 570 608 635 662 685 709 715 675 660 646 652 657 663 668 652 635 640 691 711 732 702 626 621 617 609 602 592 583 544 552 564 529 523 517
-96 517 503 489 475 461 525 588 599 563 530 498 481 510 520 483 445 455 465 427 422 417 417 464 511 510 520 529 536 542 529 515 502 488 531 574 541 507 509 558 581
-100 581 603 549 495 443 392 394 443 492 493 497 501 499 497 533 522 537 553 546 539 532 525 530 536 542 548 513 478 417 403 401 399 373 394 401 408 420 433 422 458 463 468 472 397 339 329
-104 329 344 360 404 402 372 343 363 431 478 526 574 621 642 614 614 613 621 628 635 643 622 600 582 564 491 465 523 581 552 524 495 466 462 458 454 450 439 428 417 407
-108 407 369 331 369 407 450 446 442 485 502 519 536 553 553 506 486 465 460 456 451 446 426 407 387 367 408 450 443 437 414 390 413 484 547 531 518 505 477 496 519
-111 519 494 463 479 492 457 450 442 461 433 431 477 493 509 500 492 486 481 444 455 439 423 410 397 384 371 358 346 289 310 320 330 372 366 377 389 371 400 423 445
-115 445 471 496 461 427 392 357 355 352 353 354 325 343 414 484 478 472 465 459 424 388 353 317 297 276 334 392 416 440 464 489 435 381 328 274 297 321 344 367 379
-119C79J1J2J1j7j8j7j8J0J0J0J0rrrrJ0J1J0J1K4K5K5K4n8n8n8n8RJ0J0J0RJ0J0J0MNNMN
-122C56MNNj5j4j5j4j5j4j5j4M4M5M4M5J2J2J2J2ONp3p3jkjjJ5J6J6J6MMMMl7l6l7l7OPOP
-126B98K1K1K1K1popopqppqppqk9l0l0k9QRJ2J1l3J4L4L4K3K3K2K3J6J6M3nn0n1poqrn2n3
-131A93J0N7L0L0j5j4j4j5j4j5j4j4J8J8J5J5O8K1o3o3j1j1j1j0rrL8L8K3K2K2K2J4J3J3J4
-134C92QQRQl5l5l2l2j9K7M6l4m8m8ooM2M1L9L8K0k7m9m8k2k1m9jk4k4lM4P3K6k3k4m6m6K
-138A21JMMN2N1M3M3nnl6l6l6l6N3N4Mm3l0J7j3j2J0J0J0J0RRl9l9J3J3L9qqpj1j0K4K5K2
-141B67K2m2r0r0m2J5J6O5O6KJNMpM0J3J3j6j7j7j6LLLLLLMLK8K8N4Qk1k1k4k4k4k4k4k4N
-145A54OL5j2m0Qk2k2L6L7L6L6k3k3k6k6K6k2NNMML5j2o7J3M3M4MNMMl2l3l2l3llM4M4K0K0
$$ plain form
-119 379 390 402 413 396 378 361 343 353 363 373 383 374 365 356 347 357 368 378 389 413 438 463 487 429 371 313 255 264 274 284 294 303 313 323 333 337 342 347 351 356
-122 356 360 365 370 355 341 326 312 297 283 268 254 298 343 387 432 444 456 468 480 486 491 418 345 344 342 341 340 355 371 387 403 407 411 415 419 382 346 309 272 278 285 291 298
-126 298 319 340 361 382 375 369 362 356 349 341 334 327 319 312 305 297 268 238 208 179 187 196 208 219 186 200 234 268 291 314 336 359 375 391 434 429 379 328 321 315 307 298 246 193
-131 193 203 260 290 320 305 291 277 262 248 233 219 205 223 241 256 271 339 360 297 234 223 212 201 191 182 173 211 249 272 294 316 338 352 365 378 392
-134 392 400 408 417 425 390 355 323 291 272 299 345 311 263 215 209 203 245 286 325 363 383 356 307 259 237 216 167 166 142 118 115 159 232 258 235 211 165 119 121
-138 121 122 126 130 182 233 276 319 314 309 273 237 201 165 218 272 276 233 203 220 207 195 205 215 225 235 244 253 214 175 188 201 240 232 224 217 206 196 220 245 267
-141 267 289 247 157 67 25 40 56 121 187 189 190 195 199 192 232 245 258 242 225 208 192 195 198 201 204 207 210 214 217 245 273 327 335 314 293 269 245 221 197 173 149 154
-145 154 160 195 183 143 151 129 107 143 180 216 252 229 206 180 154 180 158 163 168 172 176 211 199 132 145 188 232 236 241 245 249 217 184 152 119 116 113 157 201 221 241
-149B41k8k7o0o0j0j0j0L8J0J1PPN4N4K3K2Om3j2L4NOJ6J7J7J7j6j5j6j6L6L6Np4p6k9J8J8
-153A96j9j9j8j9m1m1PPK0K0J7J8K5k2m0m0K4P2kn0j4O5J7J7kkn0m9k2k2K5K5M5M6M5M5J0
-156B74J0o9o9rqqqRJ0RJ0L3L3j6o3j6L1JKj4j4L3L4k6k6n2nK8K7L1L0k0k1j8j7m2Nk2k1j8
-160B8j9m4KO4O4J7J7K2k6k5K2KKk2K5J6J6J6J5Pm0o1o1L9M0O6J9QQm1m2l0l0J7J7k5k6k6
-164C1k6pql8J0K0k8k7K0J7l1%jK5K5K3K5K5K5K5K4pqqpk0j9k0j9ooonL2L2j5j4K8K8K8K8
-168A45M3M3J1N9j6r4m4L5J3J3J8J8m2m2NNJ4J4RRMp5o0j3L3j3J5J6k7k7k7k6QRRRj9j8j7
-171cj8MNMNM2M3l6l5N2N2MNn8n9K0K0NMm3m2m5m5L4L4qqM0L9N0N0LKllllJ1J0J1J1jkjjj8
-176A25j8j8j8jkjjK2K2k5k5j3j3L4L4J4J4J4J4j1j1j1j0k7k6k4k4k9J6L7L8o8o7m7JK0K0
$$ plain form
-149 241 213 186 126 66 56 46 36 74 84 95 102 109 163 217 240 262 268 225 213 247 252 258 274 291 308 325 309 294 278 262 298 334 339 265 189 160 178 196
-153 196 177 158 140 121 80 39 46 53 73 93 110 128 153 131 91 51 75 147 145 95 81 146 163 180 178 176 126 77 55 33 58 83 128 174 219 264 274
-156 274 284 215 146 137 129 121 113 122 132 141 151 184 217 201 138 122 153 154 156 142 128 161 195 169 143 91 86 114 141 172 202 182 161 143 126 84 89 67 46 28
-160 28 9 -35 -33 31 95 112 129 151 125 100 122 124 126 104 129 145 161 177 192 199 159 98 37 76 116 182 201 209 217 176 134 104 74 91 108 83 57 31
-164 31 5 -2 -10 -48 -38 -18 -46 -73 -53 -36 -67 -67 -68 -43 -18 5 30 55 80 105 129 122 114 106 99 79 60 40 21 15 9 3 -2 30 62 47 33 61 89 117 145
-168 145 188 231 242 301 285 191 147 182 195 208 226 244 202 160 165 170 184 198 207 216 220 145 85 72 105 92 107 123 96 69 42 16 24 33 42 51 32 14 -3
-171 -3 -21 -17 -12 -8 -3 39 82 46 11 63 115 119 124 66 7 27 47 52 56 13 -29 -74 -119 -85 -51 -59 -67 -27 12 62 112 115 117 114 111 108 105 116 126 137 148 147 145 144 143 125
-176 125 107 89 71 70 68 67 66 88 110 85 60 47 34 68 102 116 130 144 158 147 136 125 115 88 62 38 14 -15 1 38 76 8 -59 -106 -105 -85 -65
-179f5n1mN2N1PQk9k8n5pO1O1J4J4J9k8k7J8QQJ1J2j3j2m1NQ3L8m4m4MMm0m1J6O1J6l2m6m6
-183h2k0N9J11L4n6n5j4L2OOK8K8K8K8kkm8m9k9k8J8J8JKKJM3M4m1q7l5l5l4l5J3O0L4L4m
-187b6ll0J7k1k2j8j8k4k4N5N5L4L3m0m1o3j6L6L7jjjjMNMMj%j%p7p8L8Q5rj0opKLKKQQQP
-191i2J1J1L7j0k6k7n6rN8N9J3J4k7k7k5k4l2J5J5l3m5m5MN2N3N4N3k5l4l4l9l9J7J7rL8N2
-195h5N1L4j3j9j9k2k3NNNNj0j0j0rJ1J2on3m3MN0N0L4j3J4J4J%JJL1L1j6j5n6n6l6J2lkL0
-198a18j7k6K2qqk0j9j9j9K7K7j7j7k5K2K2k5mmK2k5m6KJ9J9QQJ0J0L0P7P7K9LLm6m7j5j6
-202a04j8j8Mm3o4o3L2L2L1L2j%M6M7N5N3QPopm9n1K0O7onpqppqpqqK7K7nq3q6l8M0M1L5L6
-206f7j2j2m8m9L0L0L2L2j5j5l8l8k0K7O7K0J8O4Np3n3oL3L4m5r1nM2J3J3k6k7k6k7NNKKj7
$$ plain form
-179 -65 -116 -120 -68 -17 -10 -2 -31 -59 -114 -121 -60 1 15 29 48 20 -7 11 19 27 38 50 37 25 -16 -11 72 110 66 22 26 30 -10 -51 -35 26 42 10 -36 -82
-183 -82 -102 -43 68 102 46 -9 -23 9 15 21 49 77 105 133 131 129 81 32 3 -25 -7 11 12 14 16 17 60 104 63 -24 -59 -94 -128 -163 -150 -90 -56 -22 -26
-187 -26 -29 -59 -42 -63 -85 -103 -121 -145 -169 -114 -59 -25 8 -32 -73 -136 -152 -116 -79 -80 -81 -82 -83 -79 -74 -70 -66 -67 -67 -68 -68 -145 -223 -185 -100 -109 -119 -125 -132 -130 -127 -125 -123 -115 -107 -99 -92
-191 -92 -81 -70 -33 -43 -69 -96 -152 -161 -103 -44 -31 -17 -44 -71 -96 -120 -152 -137 -122 -155 -200 -245 -241 -189 -136 -82 -29 -54 -88 -122 -161 -200 -183 -166 -175 -137 -85
-195 -85 -34 0 -13 -32 -51 -73 -96 -91 -86 -81 -76 -86 -96 -106 -115 -104 -92 -98 -151 -194 -190 -140 -90 -56 -69 -55 -41 -40 -40 -39 -38 -7 24 8 -7 -63 -119 -155 -143 -146 -148 -118
-198 -118 -135 -161 -139 -147 -155 -175 -194 -213 -232 -205 -178 -195 -212 -237 -215 -193 -218 -222 -226 -204 -229 -275 -273 -254 -235 -227 -219 -209 -199 -169 -92 -15 14 17 20 -26 -73 -88 -104
-202 -104 -122 -140 -136 -179 -243 -306 -274 -242 -211 -179 -180 -180 -134 -87 -32 21 29 36 30 23 -26 -77 -57 10 4 -1 -8 -16 -23 -30 -38 -45 -53 -61 -34 -7 -12 -95 -181 -219 -179 -138 -103 -67
-206 -67 -79 -91 -139 -188 -158 -128 -96 -64 -79 -94 -132 -170 -190 -163 -96 -76 -58 6 11 -62 -115 -121 -88 -54 -99 -190 -195 -153 -140 -127 -153 -180 -206 -233 -228 -223 -221 -219 -236
-210b36o5j8L0L3L3j2j1MMk5K2O7J9l0k9qqqr%J%%M3M3K3k5j7j8k1k0JJJJL5L5J5l2l1l0l4
-214b76l3j%K9j8K6P2P3K5n0lM1oK4K4k7k7j5j6j2j3oM0J4J4j1j1qqj4L2OOOPPPj3j3j3j3
-218a54m3m4m3m4J1J0J1J1l6l7l6M3O8K1ONL8L7RN5K0k7m5m5LKK8j8l1l0J4J4qqJ3N9L9L8
-221i4K0k6o4o4J2J2k7k6oM1L0L1j5j4mnmmRJ0L6j2m6m7klKJKJj3j3L4L4J0J0J1o9n9j1L6
-225b86L5M3M4l6l6J4J4J3J4rrrqLLLLpppoK1K0K1K1m4m5m5m4n1n0K8K8J9J8o0o0O4O4O4O3
-229a99POOPJ5J5J5J5l6l5q3q3n8n7K2K1M3M4M3M3NNNNJ1J0J1J1J1J0J1J1j4j3j4j4p4p5k7
-233c74k8O9O9Lp6n0m9n0m9J5R4N0M9j2j3j2j3J2J2J1J2j6j5j6j6K6K5K1K1M9l1j2L4j8j8
-236b96j5j5j5j5j5j5K5K4K5K4llklK6K7K6K7l3l3l2l3KJJKk1k2k1k1l5l4M4M5L5L6L5L6P
$$ plain form
-210 -236 -301 -319 -289 -256 -223 -235 -246 -242 -238 -263 -241 -174 -155 -185 -214 -222 -230 -238 -247 -247 -246 -246 -246 -203 -160 -137 -162 -179 -197 -218 -238 -237 -236 -235 -234 -199 -164 -149 -181 -212 -242 -276
-214 -276 -309 -310 -310 -281 -299 -273 -201 -128 -103 -153 -156 -115 -121 -97 -73 -100 -127 -142 -158 -170 -183 -189 -149 -135 -121 -132 -143 -151 -159 -173 -141 -135 -129 -123 -116 -109 -102 -115 -128 -141 -154
-218 -154 -197 -241 -284 -328 -317 -307 -296 -285 -321 -358 -394 -351 -283 -262 -256 -251 -213 -176 -167 -112 -92 -119 -164 -209 -206 -204 -176 -194 -225 -255 -241 -227 -235 -243 -230 -171 -132 -94
-221 -94 -74 -100 -164 -228 -216 -204 -231 -257 -263 -222 -192 -161 -176 -190 -194 -199 -203 -207 -198 -188 -152 -164 -210 -257 -259 -262 -260 -259 -257 -256 -269 -282 -248 -214 -204 -194 -183 -252 -311 -322 -286
-225 -286 -251 -208 -164 -200 -236 -222 -208 -195 -181 -190 -199 -208 -216 -213 -210 -207 -204 -211 -218 -225 -231 -210 -190 -169 -148 -192 -237 -282 -326 -377 -427 -399 -371 -352 -334 -394 -454 -390 -326 -262 -199
-229 -199 -192 -186 -180 -173 -158 -143 -128 -113 -149 -184 -267 -350 -408 -465 -443 -422 -379 -335 -292 -249 -244 -239 -234 -229 -218 -208 -197 -186 -175 -165 -154 -143 -157 -170 -184 -198 -272 -347 -374
-233 -374 -402 -333 -264 -261 -337 -387 -436 -486 -535 -520 -426 -376 -327 -339 -352 -364 -377 -365 -353 -342 -330 -346 -361 -377 -393 -367 -342 -321 -300 -251 -282 -294 -260 -278 -296
-236 -296 -311 -326 -341 -356 -371 -386 -361 -337 -312 -288 -291 -294 -296 -299 -273 -246 -220 -193 -226 -259 -291 -324 -322 -321 -320 -318 -339 -361 -382 -403 -438 -472 -428 -383 -348 -312 -277 -241 -234
-240b34QPQJ6J6o2o3m4m3m4m4J1J0J1J0K3K3K3K3K3K4K3K3l5l5l4l5j4j4L4Q0O5j3m6m5qp
-243c59qqN2N2k7p4n4K6K5K5opM1M1pqn5n4M0M1M1M0n3n3k1N7M3mK7K8j4j4j4j4l7l6l6l7
-247d21L1L0L1L1j4j3j3j3j8j7L0L0M7M7l2l2k6k6K1K1l7l6M2M3j1j1j1j1RJ0RRm0m0QP%%
-251c66m7m7j7j8j7j8N0N1N0N0MMMMl7l6M2M2nnnoJ5J4l3l3n1n1K8K8popoK1K1K1K1l2l1J6
-254c95J6m3m4L6L6llllRRl8l8OOOOj7j7j6j7K0J9K0J9K3K2K3K2m2m3NNJ4J3J4J4k7k6k7k6
-258d65J7J6J7J7K0K0K0K0m7m7m7m7K5K5K4K5noonL4L4j4j3k2k2k3k2J3J2J2J3NNONM2M3o5
-262c86o5l0J8rrKKLKL2L2j5j6j3j3L4L4K8K8k2k2K0k6m7m8qpqql1l0P4P5L5m3p3k6J4J4J6
-266d92J7j3j4j4j4J2J2J1J2J1J2J1J2K0J9K0K0l7l6l6l7KLM6M7K4k2k6K2R0M2j0j1l5q3l6
$$ plain form
-240 -234 -226 -219 -211 -195 -179 -241 -304 -348 -391 -435 -479 -468 -458 -447 -437 -414 -391 -368 -345 -322 -298 -275 -252 -287 -322 -356 -391 -405 -419 -385 -305 -240 -253 -299 -344 -352 -359
-243 -359 -367 -375 -323 -271 -298 -372 -426 -400 -375 -350 -356 -363 -322 -281 -288 -296 -351 -405 -365 -324 -283 -243 -296 -349 -370 -313 -270 -274 -247 -219 -233 -247 -261 -275 -312 -348 -384 -421
-247 -421 -390 -360 -329 -298 -312 -325 -338 -351 -369 -386 -356 -326 -279 -232 -264 -296 -322 -348 -327 -306 -343 -379 -337 -294 -305 -316 -327 -338 -329 -319 -310 -301 -341 -381 -373 -366 -366 -366
-251 -366 -413 -460 -477 -495 -512 -530 -480 -429 -379 -329 -325 -321 -317 -313 -350 -386 -344 -302 -307 -312 -317 -323 -308 -294 -327 -360 -411 -462 -434 -406 -413 -419 -426 -432 -411 -390 -369 -348 -380 -411 -395
-254 -395 -379 -422 -466 -430 -394 -397 -400 -403 -406 -397 -388 -426 -464 -458 -452 -446 -440 -457 -474 -490 -507 -487 -468 -448 -429 -406 -384 -361 -339 -381 -424 -419 -414 -400 -387 -373 -359 -386 -412 -439 -465
-258 -465 -448 -432 -415 -398 -378 -358 -338 -318 -365 -412 -459 -506 -481 -456 -432 -407 -412 -418 -424 -429 -395 -361 -375 -388 -410 -432 -455 -477 -464 -452 -440 -427 -422 -417 -411 -406 -364 -321 -386
-262 -386 -451 -481 -463 -472 -481 -479 -477 -474 -472 -440 -408 -423 -439 -452 -465 -431 -397 -369 -341 -363 -385 -365 -391 -438 -486 -494 -501 -509 -517 -548 -578 -504 -429 -394 -437 -510 -536 -522 -508 -492
-266 -492 -475 -488 -502 -516 -530 -518 -506 -495 -483 -472 -460 -449 -437 -417 -398 -378 -358 -395 -431 -467 -504 -502 -499 -453 -406 -382 -404 -430 -408 -318 -276 -286 -297 -332 -415 -451
-269d51J1M9M8MMj0j0j0j0l6l5o3j5O7O7j0rK1K0k4k4k9J9K1k6m2MK0J9mn1nM3J%m1m1%M6
-273d82R4M7j8j7k0k1j7j7m4LN1N1OPl4l4l0l1k7K0K1k7K9K9k4k4J9k8k8J9j7j8L0L0P7K9
-276c96k2k3noooqrqrk0k0m7JM4M5K8k0OPM8M8k4p2m2m2kM6O4O3j4o2l2M7K0J9nM2L7j0Km5
-280c88o0j3NNl3l4l0l0l0J7O7O6J09O2Mm2n4n4l6J2L0L0j5j4k9k8k8k8RRRJ0RRRR%%j%j7
-284d84j7o5o4j5j5j4j5K6K5K9K9NN2N2NMMK8k0l2l2l5l5J7J6J6J6RQRQj6j7j6j6j7j6L0L1
-288e22j6j5j6j5MNNNK8K9j9j9M9M9KKl6l7J1J1PQPQl3l3l3l2QRRRJ4J5O2O2PPm1m0QRl8l9
-292e35k8k8N1N1j3j3j4j3m4m5KLk5k5N4N4%J%JoopoL2L1L2L2rrn6n6k3k4k4k3j8j8L0L0O
-296f58PPOJJJ%j1j2L5L6L5L6j2j2KJKJk9k9N0N0J0J1l6l6NOj8j8L0L1j6j7QQm0l9j5j4j5
$$ plain form
-269 -451 -440 -391 -343 -339 -335 -345 -355 -365 -375 -411 -446 -509 -524 -457 -390 -400 -409 -388 -368 -392 -416 -445 -426 -405 -431 -473 -469 -449 -430 -434 -485 -490 -447 -446 -446 -487 -528 -528 -482
-273 -482 -388 -341 -359 -376 -396 -417 -434 -451 -495 -492 -441 -390 -384 -377 -411 -445 -475 -506 -533 -513 -492 -519 -490 -461 -485 -509 -490 -518 -546 -527 -544 -562 -532 -502 -425 -396
-276 -396 -418 -441 -446 -452 -458 -464 -472 -481 -489 -498 -518 -538 -585 -584 -540 -495 -467 -487 -481 -474 -426 -378 -402 -474 -516 -558 -560 -514 -450 -387 -401 -463 -495 -448 -428 -409 -414 -372 -335 -345 -343 -388
-280 -388 -448 -461 -456 -451 -484 -518 -548 -578 -608 -591 -524 -458 -349 -287 -283 -325 -379 -433 -469 -457 -427 -397 -412 -426 -455 -483 -511 -539 -530 -521 -512 -502 -493 -484 -475 -466 -466 -466 -467 -467 -484
-284 -484 -501 -566 -630 -645 -660 -674 -689 -663 -638 -609 -580 -575 -523 -471 -466 -462 -458 -430 -450 -482 -514 -549 -584 -567 -551 -535 -519 -510 -502 -493 -485 -501 -518 -534 -550 -567 -583 -553 -522
-288 -522 -538 -553 -569 -584 -580 -575 -570 -565 -537 -508 -527 -546 -497 -448 -446 -444 -480 -517 -506 -495 -488 -480 -473 -465 -498 -531 -564 -596 -588 -579 -570 -561 -547 -532 -470 -408 -401 -394 -435 -475 -467 -458 -496 -535
-292 -535 -563 -591 -540 -489 -502 -515 -529 -542 -586 -631 -629 -626 -651 -676 -622 -568 -568 -567 -567 -566 -572 -578 -585 -591 -559 -528 -496 -464 -473 -482 -538 -594 -617 -641 -665 -688 -706 -724 -694 -664 -658
-296 -658 -651 -644 -638 -637 -636 -635 -635 -646 -658 -623 -587 -552 -516 -528 -540 -538 -537 -535 -534 -563 -592 -542 -492 -482 -471 -507 -543 -538 -532 -550 -568 -538 -507 -523 -540 -532 -524 -564 -603 -618 -632 -647
-300f47j5K6K5M9M9L7L8L8m1n7j0OO%%%Jk1k0K7K7l0k9J9J8J3J3o6o6k9k8nmK3K4k4k4J1J2
-303f54J2J1m4m4LMl8l8j4j4Q5Q4L8L8J6J7J6J7J0J1j4j3k6k6K1K2K0K0k8k7J7J6J7J7k2k2
-307e12k1k2%jj%k5k5k1k0lP6J05N8rrJ1J1j4j5j4j5ppM0M1j1j0n8n8l8l8J2J2K2P0K2k5m7
-310e46m6lkn5n4lM5K8K8j6j6jjm5m5j7L1K7K8rqJ5J5J9J9M0M0J1l6j5L2M4mOm2m1m1k6K1
-314f23Mm4j4j4J9K0J9K0M3M3K3k5k6k5k6k5pM1M0pm1m1m4m4PQPPNNk2K6K6K5j8j9j0rj0j0
-318g16L2L3P7P7m3q9j0L6K8K8j7j6k8k7k8k7KKKKJ7J7k6k7nM3km9mM4rj0k1k1KKQQQQj0j0
-322g19j0j1L1L0L0L0l6l7J0J1l9m0RQKKl9m0l8N6N0N0k5k5k5k5j3j3j3j3J2J1J2J1L6L6j1
-325g35j1K2K3k5k5J5J4J5J5k6k7K1K1K4K3K4K4j8j9o6o5k0k0K7K7K5K6J9J9N2m3m3N2O9O9
$$ plain form
-300 -647 -662 -636 -611 -562 -513 -476 -438 -400 -441 -498 -508 -502 -496 -496 -496 -496 -495 -516 -536 -509 -482 -512 -541 -522 -504 -491 -478 -544 -610 -639 -667 -672 -676 -653 -629 -653 -677 -666 -654
-303 -654 -642 -631 -675 -719 -716 -712 -750 -788 -802 -816 -731 -647 -609 -571 -555 -538 -522 -505 -495 -484 -498 -511 -537 -563 -542 -520 -500 -480 -508 -535 -518 -502 -485 -468 -490 -512
-307 -512 -533 -555 -555 -556 -557 -557 -582 -607 -628 -648 -651 -575 -470 -412 -421 -430 -419 -408 -422 -437 -451 -466 -473 -480 -440 -399 -410 -420 -478 -536 -574 -612 -600 -588 -566 -496 -474 -499 -546
-310 -546 -592 -595 -597 -652 -706 -709 -664 -636 -608 -624 -640 -641 -642 -687 -732 -749 -718 -691 -663 -672 -680 -665 -650 -631 -612 -572 -532 -521 -557 -572 -540 -496 -500 -494 -536 -577 -618 -644 -623
-314 -623 -619 -663 -677 -691 -672 -652 -633 -613 -570 -527 -504 -529 -555 -580 -606 -631 -638 -597 -557 -564 -605 -646 -690 -734 -727 -719 -712 -705 -700 -695 -717 -691 -665 -640 -658 -677 -687 -696 -706 -716
-318 -716 -684 -651 -574 -497 -540 -629 -639 -603 -575 -547 -564 -580 -608 -635 -663 -690 -688 -686 -684 -682 -665 -648 -674 -701 -706 -663 -665 -714 -718 -674 -683 -693 -714 -735 -733 -731 -723 -715 -707 -699 -709 -719
-322 -719 -729 -740 -709 -679 -649 -619 -655 -692 -682 -671 -710 -750 -741 -733 -731 -729 -768 -808 -846 -790 -740 -690 -715 -740 -765 -790 -803 -816 -829 -842 -830 -819 -807 -796 -760 -724 -735
-325 -735 -746 -724 -701 -726 -751 -736 -722 -707 -692 -718 -745 -724 -703 -679 -656 -632 -608 -626 -645 -711 -776 -796 -816 -789 -762 -737 -711 -692 -673 -621 -664 -707 -655 -586 -517
-329e17l5l5m3m3MNOOOPMMNMn7n6o3L2K4K5m9m9KKJKk3k4K4K4L3L2L3L3k5k5k5k5J8J8J8J8
-333g04kkkkNNNNL6L5m3m4o3o3J6J6L3L3L3L3m9n0m5m4k7N2N5N5J4J3J4J4j%l2J6O2j6j6j6
-336f71m2m2NOK2K2K2K2k6k7K1K1j8j7j8j7k2k1k2k1j5j4j5j5P8P8jkqqqqppppl1l2M7M7k2
-340g80k3k2k3K6K6K6K5J6J5J5J5K2K2k5k5RJ0RRL3L3j4j4j9j8j9j8n7n7K2K2J7J7l0l0j0
-344g95j0j1j0K8K8K7K8j0j1L7L7j5j5j4j5j1j2porP0P0rj1j1j6j6l8l9l9l8j1j1O7O8J5J4
-347g01l2l3mmlmL7L7rj0m8m7L2L1k5k6k5k5KKKKP4P3nol7l8M1M1KKp7p7K4K3K4K4K7K8K7
-351f81K8m0l9l9m0K6K6K6K7L9M0R3jm0m0m6m5M5M4L9L9j3j08j08j4J0J1J6J6jjjjNMMMm2
-355g58m3L7L7L9M0m0l9n6n7rrN4N5k4k4J3J4J4J3j9j9j8j9j6j6j6j6M3M3M4M3KJKKm9n0m9
$$ plain form
-329 -517 -552 -587 -630 -673 -669 -664 -658 -652 -646 -639 -635 -631 -626 -622 -679 -735 -798 -766 -742 -717 -766 -815 -813 -811 -810 -808 -831 -855 -831 -807 -774 -742 -709 -676 -701 -726 -751 -776 -758 -740 -722 -704
-333 -704 -706 -708 -710 -712 -707 -702 -697 -692 -656 -621 -664 -708 -771 -834 -818 -802 -769 -736 -703 -670 -719 -769 -814 -858 -885 -833 -778 -723 -709 -696 -682 -668 -669 -669 -701 -685 -623 -639 -655 -671
-336 -671 -713 -755 -750 -744 -722 -700 -678 -656 -682 -709 -688 -667 -685 -702 -720 -737 -759 -780 -802 -823 -838 -852 -867 -882 -804 -726 -727 -729 -737 -745 -753 -761 -768 -775 -782 -789 -820 -852 -805 -758 -780
-340 -780 -803 -825 -848 -822 -796 -770 -745 -729 -714 -699 -684 -662 -640 -665 -690 -681 -671 -662 -653 -620 -587 -601 -615 -634 -652 -671 -689 -746 -803 -781 -759 -742 -725 -755 -785 -795
-344 -795 -805 -816 -826 -798 -770 -743 -715 -725 -736 -699 -662 -677 -692 -706 -721 -732 -744 -751 -757 -766 -696 -626 -635 -646 -657 -673 -689 -727 -766 -805 -843 -854 -865 -798 -730 -715 -701
-347 -701 -733 -766 -770 -774 -777 -781 -744 -707 -716 -726 -774 -821 -789 -758 -783 -809 -834 -859 -857 -855 -853 -851 -777 -704 -709 -715 -752 -790 -749 -708 -706 -704 -781 -858 -834 -811 -787 -763 -736 -708 -681
-351 -681 -653 -693 -732 -771 -811 -785 -759 -733 -706 -667 -627 -534 -535 -575 -615 -661 -706 -661 -617 -578 -539 -552 -660 -768 -782 -772 -761 -745 -729 -730 -731 -732 -733 -728 -724 -720 -716 -758
-355 -758 -801 -764 -727 -688 -648 -688 -727 -783 -840 -849 -858 -804 -749 -773 -797 -784 -770 -756 -743 -762 -781 -799 -818 -834 -850 -866 -882 -839 -796 -752 -709 -707 -706 -704 -702 -751 -801 -850
-358h50n0J7J6J6J6llmlMMLMk3k4k4k3L6L6L6L6RQRRk0j9j9j9QQQRj6j5j6j5j6j6j5j6L5L5
-362h47L5L5qrqrL4L4L4L4POPOk8k8k7k8llmll8l8M0M1K2K3k5k4j%jjj5j5j6j5KLKLJ4J4J5
-367g83J4qqqqrqqqk2k3k2k3k0k1N9N8L4L3m5m5lkM4M5j4j4j4j3j1j1j1j1QPQPK2K2K3K2L3
-371g34L3m3m3k5K2mmLMMLJ6J6J5J6j3j2J7l0m5KK0K0j7j8j7j7k6k7k6k6J7J7J6J7N4N3l0
-374g92p8o3o3j4L3M9M9KKL4j3J4J3QPQQl2l3l2l2j7j7N8N9K9j9J1J2k6K2mnj7j8m4LJ7J7
-378h64Lm5o7j9L0L0NNONL2L1N8J1J5J4RRQl8n7n6j6L1L1j6OOJ9O6L5m4p3p2k8J9ppL7L7J7
-382h34l1k6k6J5J6j5o2l3l3j3L5QQk1k2N7N8mlllk2k2mM3L3j4J6J6j1j1L4L4J4l4opK2K2
-385h29Jm5m1m1ON3M1oK1K0%m7k0k1JJK8k0j8j8m7%L7L7l8l9PPPPL2L1j6j5j4j5L3L3J5J6
$$ plain form
-358 -850 -900 -883 -867 -851 -835 -838 -841 -845 -848 -844 -840 -837 -833 -856 -880 -904 -927 -891 -855 -819 -783 -774 -766 -757 -748 -768 -787 -806 -825 -817 -809 -801 -792 -808 -823 -839 -854 -870 -886 -901 -917 -882 -847
-362 -847 -812 -777 -785 -794 -802 -811 -777 -743 -709 -675 -668 -662 -655 -649 -677 -705 -732 -760 -763 -766 -770 -773 -811 -849 -809 -768 -746 -723 -748 -772 -773 -773 -774 -775 -790 -805 -821 -836 -834 -831 -829 -826 -812 -798 -783
-367 -783 -769 -777 -785 -793 -801 -810 -818 -826 -834 -856 -879 -901 -924 -944 -965 -906 -848 -814 -781 -826 -871 -874 -876 -832 -787 -801 -815 -829 -842 -853 -864 -875 -886 -878 -871 -863 -856 -834 -812 -789 -767 -734
-371 -734 -701 -744 -787 -812 -790 -794 -798 -795 -791 -787 -784 -768 -752 -737 -721 -734 -746 -729 -759 -804 -802 -782 -762 -779 -797 -814 -831 -857 -884 -910 -936 -919 -902 -886 -869 -815 -762 -792
-374 -792 -870 -933 -996 -1010 -977 -928 -879 -877 -875 -841 -854 -840 -827 -819 -812 -804 -796 -828 -861 -893 -925 -942 -959 -901 -842 -813 -832 -821 -809 -835 -813 -817 -822 -839 -857 -901 -898 -881 -864
-378 -864 -861 -906 -973 -992 -962 -932 -927 -922 -916 -911 -879 -848 -790 -779 -764 -750 -741 -732 -724 -762 -819 -875 -891 -860 -829 -845 -839 -833 -814 -748 -713 -757 -830 -902 -930 -911 -918 -925 -888 -851 -834
-382 -834 -865 -891 -917 -902 -886 -901 -963 -996 -1029 -1042 -1007 -999 -991 -1012 -1034 -977 -919 -923 -926 -929 -932 -954 -976 -980 -937 -904 -918 -902 -886 -897 -908 -874 -840 -826 -860 -866 -873 -851 -829
-385 -829 -828 -873 -914 -955 -949 -896 -855 -861 -840 -820 -820 -867 -887 -908 -907 -906 -878 -898 -916 -934 -981 -981 -944 -907 -945 -984 -977 -970 -963 -956 -924 -893 -909 -924 -938 -953 -920 -887 -872 -856
-389h56J5J5J3J2L9qM5M5nnLLLLJ%%%l9l9l9l9MML1j7o1o0m3MM2M2M4M5j5j5j5j5n0n0l3J5
-393i76J1l5po%%K9j8J7O5J4l2OPm1m0j1L6L6j1MMJJmml3J4M2nK4K4k9k8k5k5rL9J2J2j2j2
-397i65j2j2LLk7K1M0qK3K2RJ0L6j1o5o5J1J1O5O5J5J4K0k8m6m5KN0k4k4j4j5j4j5L4L4L4
-401h68L4j2j2j1j2j2j2j1j2j%%jlmK7k2j8K8jjK2K1K2K1QPPPk9k8k8k9jkkkJ3J3J0J0M6k
-405h40n4n4l7l8J2O0L5j2l0k9L4L4J7l1k4K3opL7L7L7L7j5j6j5j6j5j6j5j6j2j3j2j3N4N5
-408h64n6n6j9k0O0N9QPm0m0J0J0J0J0nnnmj9j9j8j9JJJJKLKKlkllK5K4n4n5N7N7RJ0l7l6
-412a013M2M2J5J5J4J5j7j7j6j7K6K7K6K7rqqrMLLMm6m6m5m6j8j9j8j8J3J2J2J3%J%Jk4k3
-416a102k4k4mmP5P5K6K6k2k1j9k0K8K8N3N4OOl4l5J3J4j0rrrL1L2m8m7L6L7p4p3l5l5M3R1
$$ plain form
-389 -856 -841 -826 -813 -801 -762 -770 -725 -680 -685 -690 -687 -684 -681 -678 -677 -677 -677 -677 -716 -755 -794 -833 -829 -825 -794 -811 -872 -932 -975 -971 -929 -887 -843 -798 -813 -828 -843 -858 -908 -958 -991 -976
-393 -976 -965 -1000 -1007 -1013 -1013 -1013 -984 -1002 -985 -920 -906 -938 -932 -925 -966 -1006 -1017 -981 -945 -956 -952 -948 -947 -946 -950 -954 -987 -973 -931 -936 -912 -888 -917 -945 -970 -995 -1004 -965 -953 -941 -953 -965
-397 -965 -977 -989 -986 -983 -1010 -989 -949 -957 -934 -912 -903 -893 -857 -868 -933 -998 -987 -976 -911 -846 -831 -817 -797 -825 -871 -916 -914 -864 -888 -912 -926 -941 -955 -970 -936 -902 -868
-401 -868 -834 -846 -858 -869 -881 -893 -905 -916 -928 -929 -929 -929 -930 -933 -937 -910 -932 -950 -922 -923 -924 -902 -881 -859 -838 -830 -823 -816 -809 -838 -866 -894 -923 -924 -926 -928 -930 -917 -904 -894 -884 -838 -840
-405 -840 -894 -948 -985 -1023 -1011 -951 -916 -928 -958 -987 -953 -919 -902 -933 -957 -934 -940 -947 -910 -873 -836 -799 -814 -830 -845 -861 -876 -892 -907 -923 -935 -948 -960 -973 -919 -864
-408 -864 -920 -976 -995 -1015 -955 -896 -888 -881 -921 -961 -951 -941 -931 -921 -926 -931 -936 -940 -959 -978 -996 -1015 -1014 -1013 -1012 -1011 -1009 -1006 -1004 -1002 -1005 -1007 -1010 -1013 -988 -964 -1018 -1073 -1016 -959 -950 -940 -977 -1013
-412 -1013 -971 -929 -914 -899 -885 -870 -887 -904 -920 -937 -911 -884 -858 -831 -840 -848 -856 -865 -861 -858 -855 -851 -897 -943 -988 -1034 -1052 -1071 -1089 -1107 -1094 -1082 -1070 -1057 -1057 -1056 -1056 -1055 -1079 -1102
-416 -1102 -1126 -1150 -1154 -1158 -1083 -1008 -982 -956 -978 -999 -1018 -1038 -1010 -982 -929 -875 -869 -863 -897 -932 -919 -905 -915 -924 -933 -942 -911 -879 -927 -974 -938 -901 -975 -1048 -1083 -1118 -1075 -984
-420i84O0j9k0j9K1K2K1K1k6k5k6k6k4k5K3K2POPOJ0J0RJ0k5k4k5k4K0K1O8O8J3J4l4l5mn
-423i11mnj9j9k0j9n1n1lmO4O4j5j5QQPQj8j8K9L0l3l3l3l2J2J2J2J3J2J2J2J3kjkjl7l7J0
-427a057J0LLN0M9J5J4J5J4n2n2n3n2OPPOoonoM5M5M6M5j2j2j2j2j2j3j2j2K3K2K3K2k1k1
-431i58k1k1kkkjJJJJl5l5J3J2%%M7M7kln0m9j5j4L3L3K8K8j9j9l6l6J1J1LMLLK6K6K5K6K0
-435i17J9K0J9j0j0L7L7MNm3m3j7j6j6j7MLm4m4L7L7j0j1l5l6l6l5K3K4K3K4l6l7J2J1M3M4
-438i87l5l5m2m3NNK5K5K5K4L0L1L0L0onn2n3m2m2L6L7J1J1o8o8O7O6K0J9klkkllllRRRRn
-442i71nnnNNm2m3N7N6Mm3q8q9J9J9N4N4N4N5ooK0k6m2m2k5K4ppk1o8j8L0J%%J%Jool6J2L2
-446a104j6J4J4J0J0J0J0l3l3j3L5L9L9M2M3j1j1j1j1l6l5J2J2J1J2l5l5nnnnM6M7K5k1k0
$$ plain form
-420 -984 -924 -943 -963 -982 -961 -939 -918 -897 -923 -948 -974 -1000 -1024 -1049 -1026 -1004 -997 -991 -984 -978 -968 -958 -949 -939 -964 -988 -1013 -1037 -1017 -996 -928 -860 -847 -833 -867 -902 -906 -911
-423 -911 -915 -920 -939 -958 -978 -997 -1048 -1099 -1102 -1106 -1042 -978 -993 -1008 -1000 -992 -985 -977 -995 -1013 -984 -954 -987 -1020 -1053 -1085 -1073 -1061 -1049 -1036 -1024 -1012 -1000 -987 -989 -990 -992 -993 -1030 -1067 -1057
-427 -1057 -1047 -1044 -1041 -991 -942 -927 -913 -898 -884 -936 -988 -1041 -1093 -1087 -1080 -1073 -1067 -1073 -1079 -1084 -1090 -1045 -1000 -954 -909 -921 -933 -945 -957 -969 -982 -994 -1006 -983 -961 -938 -916 -937 -958
-431 -958 -979 -1000 -1002 -1004 -1006 -1007 -1006 -1005 -1004 -1003 -1038 -1073 -1060 -1048 -1048 -1048 -1001 -954 -956 -959 -1009 -1058 -1073 -1087 -1054 -1021 -993 -965 -984 -1003 -1039 -1075 -1064 -1053 -1050 -1046 -1043 -1040 -1014 -988 -963 -937 -917
-435 -917 -898 -878 -859 -869 -879 -842 -805 -801 -796 -839 -882 -899 -915 -931 -948 -944 -941 -985 -1029 -992 -955 -965 -976 -1011 -1047 -1083 -1118 -1095 -1071 -1048 -1024 -1060 -1097 -1085 -1074 -1031 -987
-438 -987 -1022 -1057 -1099 -1142 -1137 -1132 -1107 -1082 -1057 -1033 -1003 -972 -942 -912 -918 -923 -975 -1028 -1070 -1112 -1076 -1039 -1028 -1017 -1085 -1153 -1086 -1020 -1000 -981 -983 -986 -988 -990 -993 -996 -999 -1002 -993 -984 -975 -966 -971
-442 -971 -976 -981 -986 -981 -976 -1018 -1061 -1004 -948 -944 -987 -1075 -1164 -1145 -1126 -1072 -1018 -964 -909 -915 -921 -901 -927 -969 -1011 -1036 -1012 -1019 -1026 -1047 -1115 -1133 -1103 -1102 -1102 -1102 -1101 -1101 -1100 -1106 -1112 -1148 -1136 -1104
-446 -1104 -1120 -1106 -1092 -1082 -1072 -1062 -1052 -1085 -1118 -1131 -1096 -1057 -1018 -976 -933 -944 -955 -966 -977 -1013 -1048 -1036 -1024 -1013 -1001 -1036 -1071 -1076 -1081 -1086 -1091 -1045 -998 -973 -994 -1014
-450a014k0nM2mn2j8j9l2J7L6L7k5k5qM0L8j0n4oJ6J6J9J9ppJ0N8N5Pm2q9n0K9K9n0l4J4L0
-453a059K9RQJ1J1p4k8opNNPQK2P0M3M3l5l5J3J2l4l4l4l4OPPPJ9J8J9J8m9m9m9m9l3l2J5
-457a229J4OOONMMMLP6P6kll3l3J4J4l3l3J4J5K9K9j9j8MLLLJ2J2J3J2RJ0RJ0J4J3km9l3M6
$$ plain form
-450 -1014 -1034 -1039 -997 -1001 -1053 -1071 -1090 -1122 -1105 -1069 -1032 -1057 -1082 -1090 -1050 -1012 -1022 -1076 -1082 -1066 -1050 -1031 -1012 -1019 -1026 -1016 -958 -903 -896 -938 -1027 -1077 -1048 -1019 -1069 -1103 -1089 -1059
-453 -1059 -1030 -1021 -1013 -1002 -991 -1065 -1093 -1099 -1106 -1101 -1096 -1089 -1081 -1059 -989 -946 -903 -938 -973 -960 -948 -982 -1016 -1050 -1084 -1078 -1071 -1064 -1057 -1038 -1020 -1001 -983 -1032 -1081 -1130 -1179 -1212 -1244 -1229
-457 -1229 -1215 -1209 -1203 -1197 -1192 -1188 -1184 -1180 -1177 -1101 -1025 -1027 -1030 -1063 -1096 -1082 -1068 -1101 -1134 -1120 -1105 -1076 -1047 -1066 -1084 -1080 -1077 -1074 -1071 -1059 -1047 -1034 -1022 -1013 -1003 -994 -984 -970 -957 -959 -1008 -1041 -995
$$ [...]
-1241A44
##END=	
##END=	
