##TITLE=	pkl-82_VT.1.fid
1H NMR equilibrium 1, 4b, 5b
210K

##JCAMP-DX=	6.0	$$ MestReNova 14.1.1-24571
##DATA TYPE=	LINK
##BLOCK_ID=	1
##BLOCKS=	1    
##ORIGIN=	Mestrelab Research S.L.
##OWNER=	hrzepa
##$MNOVA/LINK_BLOCK_TYPE=	ITEM	$$ NMR Spectrum
##$MNOVA/ITEM/POLYGON=	(XY..XY)
5321,5835
8722,5835
8722,8208
5321,8208
5321,5835
##$MNOVA/ITEM/Z=	0
##$MNOVA/ITEM/ANGLE=	0
##TITLE=	pkl-82_VT.1.fid
##JCAMP-DX=	6.0	$$ MestReNova 14.1.1-24571
##BLOCK_ID=	2
##DATA TYPE=	NMR SPECTRUM
##DATA CLASS=	XYDATA
##NUMDIM=	1
##ORIGIN=	Bruker BioSpin GmbH
##OWNER=	nmrsu
##.OBSERVE FREQUENCY=	300.13185342560802837
##.OBSERVE NUCLEUS=	^1H
##.SOLVENT NAME=	Tol
##.PULSE SEQUENCE=	zg30
##LONGDATE=	2019/11/28 10:26:00.000
##.ACQUISITIONMODE=	SIMULTANEOUS (DQD)
##$ORIGINAL FORMAT=	Bruker XWIN-NMR
##$MNOVA/SCALES_VERSION=	9
##$PARAMETER FILE=	(acqus, ASCII, /var/folders/f6/rjf_tdyn2v98c5c0wvkgn4s80000gn/T/wd0hhdQWSPaYPyDB16kb2Q/equilibrium%201%204b%205b%20210K/1/acqus, 0)
$$ ##TITLE= Parameter file, TOPSPIN		Version 3.0
$$ ##JCAMPDX= 5.0
$$ ##DATATYPE= Parameter Values
$$ ##NPOINTS= 11	$$ modification sequence number
$$ ##ORIGIN= Bruker BioSpin GmbH
$$ ##OWNER= nmrsu
$$ $$ 2019-11-28 10:27:26.413 +0100  nmrsu@CZC049C5SM
$$ $$ C:/Bruker/TopSpin3.0/data/King/nmr/pkl-82_VT/1/acqus
$$ $$ process C:\Bruker\TopSpin3.0\prog\mod\shimcntl.exe
$$ ##$ACQT0= -2.26890760309556
$$ ##$AMP= (0..31)
$$ 100 100 100 100 100 100 100 100 100 100 100 100 100 100 100 100 100 100
$$ 100 100 100 100 100 100 100 100 100 100 100 100 100 100
$$ ##$ANAVPT= -1
$$ ##$AQSEQ= 0
$$ ##$AQ_mod= 3
$$ ##$AUNM= <au_zg>
$$ ##$AUTOPOS= <>
$$ ##$BF1= 300.13
$$ ##$BF2= 300.13
$$ ##$BF3= 300.13
$$ ##$BF4= 300.13
$$ ##$BF5= 300.13
$$ ##$BF6= 300.13
$$ ##$BF7= 300.13
$$ ##$BF8= 300.13
$$ ##$BYTORDA= 0
$$ ##$CAGPARS= (0..11)
$$ 0 0 0 0 0 0 0 0 0 0 0 0
$$ ##$CFDGTYP= 0
$$ ##$CFRGTYP= 9
$$ ##$CHEMSTR= <none>
$$ ##$CNST= (0..63)
$$ 1 1 145 1 1 1 1 1 1 1 1 1 1 1 1 1 1 1 1 1 1 1 1 1 1 1 1 1 1 1 1 1 1 1 1
$$ 1 1 1 1 1 1 1 1 1 1 1 1 1 1 1 1 1 1 1 1 1 1 1 1 1 1 1 1 1
$$ ##$CPDPRG= <>
$$ ##$CPDPRG1= <>
$$ ##$CPDPRG2= <>
$$ ##$CPDPRG3= <>
$$ ##$CPDPRG4= <mlev16>
$$ ##$CPDPRG5= <>
$$ ##$CPDPRG6= <>
$$ ##$CPDPRG7= <>
$$ ##$CPDPRG8= <>
$$ ##$D= (0..63)
$$ 0 1 0 0 0 0 0 0 0 0 0 0 0 0 0 0 0.0002 0 0 0 0 0 0 0 0 0 0 0 0 0 0 0 0
$$ 0 0 0 0 0 0 0 0 0 0 0 0 0 0 0 0 0 0 0 0 0 0 0 0 0 0 0 0 0 0 0
$$ ##$DATE= 1574933171
$$ ##$DBL= (0..7)
$$ 120 120 120 120 120 120 120 120
$$ ##$DBP= (0..7)
$$ 150 150 150 150 150 150 150 150
$$ ##$DBPNAM0= <>
$$ ##$DBPNAM1= <>
$$ ##$DBPNAM2= <>
$$ ##$DBPNAM3= <>
$$ ##$DBPNAM4= <>
$$ ##$DBPNAM5= <>
$$ ##$DBPNAM6= <>
$$ ##$DBPNAM7= <>
$$ ##$DBPOAL= (0..7)
$$ 0.5 0.5 0.5 0.5 0.5 0.5 0.5 0.5
$$ ##$DBPOFFS= (0..7)
$$ 0 0 0 0 0 0 0 0
$$ ##$DE= 12
$$ ##$DECBNUC= <off>
$$ ##$DECIM= 3232
$$ ##$DECNUC= <off>
$$ ##$DECSTAT= 4
$$ ##$DIGMOD= 1
$$ ##$DIGTYP= 12
$$ ##$DL= (0..7)
$$ 0 120 120 120 120 120 120 120
$$ ##$DP= (0..7)
$$ 150 150 150 150 150 150 150 150
$$ ##$DP07= 0
$$ ##$DPNAME0= <>
$$ ##$DPNAME1= <>
$$ [...]
$$ ##$RX22TY= <no>
$$ ##$RXFMAX= (0..7)
$$ 432.5 -1 -1 -1 -1 -1 -1 -1
$$ ##$RXFMIN= (0..7)
$$ 5 -1 -1 -1 -1 -1 -1 -1
$$ ##$RXINTLV= (0..7)
$$ 1 0 0 0 0 0 0 0
$$ ##$RXMSTY= <no>
$$ ##$SCMTY= <no>
$$ ##$SGUC1= (0..15)
$$ 18 19 0 0 0 0 0 0 0 0 0 0 0 0 0 0
$$ ##$SGUC2= (0..15)
$$ 33 256 0 0 0 0 0 0 0 0 0 0 0 0 0 0
$$ ##$SPECTR= 10
$$ ##$SY2FLAG= 0
$$ ##$SYNCTRIG= 11
$$ ##$ShimPowMaxUA= (0..63)
$$ 130000 130000 130000 130000 130000 130000 130000 130000 130000 130000 130000
$$ 130000 130000 130000 130000 130000 130000 130000 130000 130000 0 0 0 0
$$ 0 0 0 0 0 0 0 0 0 0 0 0 0 0 0 0 0 0 0 0 0 0 0 0 0 0 0 0 0 0 0 0 0 0 0 0
$$ 0 0 0 0
$$ ##$ShimPowMaxUC= (0..63)
$$ 130000 130000 130000 130000 130000 130000 130000 130000 130000 130000 130000
$$ 130000 130000 130000 130000 130000 130000 130000 130000 130000 0 0 0 0
$$ 0 0 0 0 0 0 0 0 0 0 0 0 0 0 0 0 0 0 0 0 0 0 0 0 0 0 0 0 0 0 0 0 0 0 0 0
$$ 0 0 0 0
$$ ##$ShimPowMaxUG= (0..63)
$$ 524287 524287 524287 524287 524287 524287 524287 524287 524287 524287 524287
$$ 524287 524287 524287 524287 524287 524287 524287 524287 524287 0 0 0 0
$$ 0 0 0 0 0 0 0 0 0 0 0 0 0 0 0 0 0 0 0 0 0 0 0 0 0 0 0 0 0 0 0 0 0 0 0 0
$$ 0 0 0 0
$$ ##$ShimPowRcbType= 3
$$ ##$ShimPowRes= (0..63)
$$ 1e-020 1e-020 1e-020 1e-020 1e-020 1e-020 1e-020 1e-020 1e-020 1e-020 1e-020
$$ 1e-020 1e-020 1e-020 1e-020 1e-020 1e-020 1e-020 1e-020 1e-020 0 0 0 0
$$ 0 0 0 0 0 0 0 0 0 0 0 0 0 0 0 0 0 0 0 0 0 0 0 0 0 0 0 0 0 0 0 0 0 0 0 0
$$ 0 0 0 0
$$ ##$ShimPowRng0= (0..63)
$$ 1 1 1 1 1 1 1 1 1 1 1 1 1 1 1 1 1 1 1 1 0 0 0 0 0 0 0 0 0 0 0 0 0 0 0 0
$$ 0 0 0 0 0 0 0 0 0 0 0 0 0 0 0 0 0 0 0 0 0 0 0 0 0 0 0 0
$$ ##$ShimPowRng1= (0..63)
$$ 1 1 1 1 1 1 1 1 1 1 1 1 1 1 1 1 1 1 1 1 0 0 0 0 0 0 0 0 0 0 0 0 0 0 0 0
$$ 0 0 0 0 0 0 0 0 0 0 0 0 0 0 0 0 0 0 0 0 0 0 0 0 0 0 0 0
$$ ##$ShimPowRng2= (0..63)
$$ 1 1 1 1 1 1 1 1 1 1 1 1 1 1 1 1 1 1 1 1 0 0 0 0 0 0 0 0 0 0 0 0 0 0 0 0
$$ 0 0 0 0 0 0 0 0 0 0 0 0 0 0 0 0 0 0 0 0 0 0 0 0 0 0 0 0
$$ ##$ShimPowRng3= (0..63)
$$ 1 1 1 1 1 1 1 1 1 1 1 1 1 1 1 1 1 1 1 1 0 0 0 0 0 0 0 0 0 0 0 0 0 0 0 0
$$ 0 0 0 0 0 0 0 0 0 0 0 0 0 0 0 0 0 0 0 0 0 0 0 0 0 0 0 0
$$ ##$ShimSysFunc= (0..63)
$$ 1 2 3 4 5 7 9 11 15 16 8 10 12 14 6 17 13 18 19 20 0 0 0 0 0 0 0 0 0 0
$$ 0 0 0 0 0 0 0 0 0 0 0 0 0 0 0 0 0 0 0 0 0 0 0 0 0 0 0 0 0 0 0 0 0 0
$$ ##$ShimSysMatrix= 0
$$ ##$ShimSysType= 1
$$ ##$TFXNUM= 0
$$ ##$TRIPLO2= 0
$$ ##$VTU= 2
$$ ##$VTUETH= <149.236.99.20>
$$ ##$VTUTY= <no>
$$ ##$WBREFAM= (0..15)
$$ 20.9 49.1 100 100 100 100 100 100 100 100 100 100 100 100 100 100
$$ ##$WBREFLM= (0..15)
$$ 0 0 0 0 0 0 0 0 0 0 0 0 0 0 0 0
$$ ##$WBREFPH= (0..15)
$$ 72.55 -68.79 0 0 0 0 0 0 0 0 0 0 0 0 0 0
$$ ##$XFAC= 2
$$ ##END=
$$ 
##$DECIM=	3232
##$DSPFVS=	20
##XUNITS=	HZ
##YUNITS=	ARBITRARY UNITS
##FIRSTX=	4947.4850139735199264
##LASTX=	-1240.5393747080358935
##DELTAX=	-0.094423199644183358759
##XFACTOR=	1
##YFACTOR=	0.0022970163901938392935
##FIRSTY=	12.660994529724121094
##MINY=	-10.232137680053710938
##MAXY=	9764.4794921875
##NPOINTS=	65536
##XYDATA=	(X++(Y..Y))
$$ [...]
$$ plain form
1159 14554 14551 14548 14556 14565 14574 14582 14603 14624 14645 14665 14630 14595 14560 14525 14575 14626 14627 14629 14615 14602 14616 14581 14537 14494 14501 14556 14562 14568 14578 14587 14535 14484 14481 14479 14521 14563 14584 14556 14499 14441 14381
1155 14381 14402 14446 14441 14421 14400 14359 14318 14278 14237 14241 14244 14248 14252 14209 14166 14172 14177 14155 14134 14112 14090 14084 14077 14071 14065 14035 14005 13976 13946 13975 14003 13983 13963 13917 13872 13829 13787 13764 13790
1151 13790 13788 13787 13777 13766 13755 13745 13718 13691 13667 13643 13612 13630 13620 13611 13607 13603 13596 13588 13577 13517 13485 13452 13411 13370 13410 13450 13423 13397 13371 13345 13319 13293 13268 13242 13219 13196 13146
1148 13146 13145 13147 13149 13155 13160 13169 13179 13139 13100 13126 13152 13129 13106 13104 13101 13078 13005 12958 12910 12863 12815 12798 12830 12834 12838 12843 12848 12853 12857 12834 12810 12786 12763 12781 12800 12815 12831 12851 12823 12773 12724
1144 12724 12680 12637 12615 12641 12671 12701 12712 12675 12672 12670 12664 12658 12675 12692 12736 12731 12738 12745 12779 12764 12750 12784 12818 12804 12768 12781 12840 12850 12873 12895 12942 12940 12960 12980 12997 13014 13034 13054
1141 13054 13074 13094 13102 13110 13167 13224 13244 13265 13258 13299 13360 13421 13481 13542 13616 13641 13648 13655 13677 13749 13869 13940 13978 14016 14051 14085 14145 14204 14312 14420 14520 14621 14722
1137 14722 14823 14871 14920 14968 15017 15086 15154 15223 15292 15399 15507 15614 15722 15836 15951 16065 16180 16322 16464 16557 16602 16644 16767 16954 17142 17316
1135 17316 17489 17614 17739 17878 18017 18156 18295 18475 18654 18833 19012 19171 19330 19489 19648 19831 20014 20197 20381 20581 20781 20982 21182
$$ packed form
1159A4554llQRRQK1K1K1K0l5l5l5l5N0N1JKj4j3J4l5m4m3PN5OOJ0Rn2n1lkM2M2K1k8n7n8o0
1155A4381K1M4nk0k1m1m1m0m1MLMMm3m3ONk2k1k2k2opool0l0k9l0K9K8k0k0m6m5m3m2k3K6
1151A3790kjj0j1j1j0k7k7k4k4l1J8j0rmmpqj1o0l2l3m1m1M0M0k7k6k6k6k6k6k5k6k3k3n0
1148A3146jKKONRJ0m0l9K6K6k3k3klk3p3m7m8m7m8j7L2MMNNNMk3k4k4k3J8J9J5J6K0k8n0m9
1144A2724m4m3k2K6L0L0J1l7lkooJ7J7M4nPPL4j5j4L4L4j4l6J3N9J0K3K2M7kK0K0J7J7K0K0
1141A3054K0K0QQN7N7K0K1pM1O1O1O0O1P4K5PPK2P2J20P1L8L8L5L4O0N9J08J08J00J01J01
1137A4722J01M8M9M8M9O9O8O9O9J07J08J07J08J14J15J14J15J42J42R3M5M2J23J87J88J74
1135A7316J73J25J25J39J39J39J39J80J79J79J79J59J59J59J59J83J83J83J84K00K00K01K00
$$ plain form
1133 21182 21412 21641 21825 22009 22211 22461 22766 23070 23275 23480 23737 23994 24267 24589 24932 25275 25584 25894 26204 26514 26779 27044 27331
1131 27331 27666 28056 28447 28792 29136 29512 29887 30262 30637 30994 31350 31707 32064 32423 32783 33112 33490 33843 34148 34456 34812 35183 35554
1128 35554 35925 36295 36645 36946 37274 37602 37915 38228 38541 38854 39180 39506 39832 40158 40484 40810 41139 41468 41856 42292 42728 43115 43500
1126 43500 43884 44265 44647 45067 45487 45959 46431 46905 47429 47925 48421 48937 49453 50052 50652 51272 51941 52582 53224 53846 54468 55090 55712
1124 55712 56420 57127 57834 58542 59198 59854 60511 61167 61790 62413 63036 63658 64303 64947 65507 66067 66659 67203 67660 68118 68580 69043 69484
1122 69484 69877 70231 70585 70849 71065 71318 71571 71740 71909 72077 72244 72409 72574 72757 72891 73002 73112 73201 73242 73359 73477 73650 73823
1120 73823 74000 74176 74409 74690 74943 75197 75433 75668 75953 76237 76583 76928 77246 77613 78039 78465 78894 79323 79767 80212 80628 81094 81619
1118 81619 82144 82672 83200 83683 84166 84650 85133 85564 85996 86427 86859 87248 87637 87972 88258 88449 88639 88823 89007 89097 89138 89171 89123 89055
$$ packed form
1133B1182K30K29J84J84K02K50L05L04K05K05K57K57K73L22L43L43L09L10L10L10K65K65K87
1131B7331L35L90L91L45L44L76L75L75L75L57L56L57L57L59L60L29L78L53L05L08L56L71L71
1128C5554L71L70L50L01L28L28L13L13L13L13L26L26L26L26L26L26L29L29L88M36M36L87L85
1126D3500L84L81L82M20M20M72M72M74N24M96M96N16N16N99O00O20O69O41O42O22O22O22O22
1124E5712P08P07P07P08O56O56O57O56O23O23O23O22O45O44N60N60N92N44M57M58M62M63M41
1122F9484L93L54L54K64K16K53K53J69J69J68J67J65J65J83J34J11J10Q9M1J17J18J73J73
1120G3823J77J76K33K81K53K54K36K35K85K84L46L45L18L67M26M26M29M29M44M45M16M66N25
1118H1619N25N28N28M83M83M84M83M31M32M31M32L89L89L35K86J91J90J84J84R0M1L3m8o8
$$ plain form
1115 89055 88988 88802 88616 88422 88228 87966 87623 87201 86779 86352 85925 85488 85050 84613 84176 83736 83295 82838 82333 81838 81424 81010 80595
1113 80595 80200 79804 79408 79012 78684 78355 78107 77860 77623 77386 77149 76912 76687 76462 76319 76175 76072 75970 75868 75765 75742 75718 75695 75672
1111 75672 75568 75465 75442 75420 75359 75298 75189 75079 74935 74790 74646 74501 74315 74129 73895 73660 73351 73041 72651 72260 71803 71346 70839 70333
1109 70333 69768 69204 68590 67977 67310 66644 65978 65311 64652 63993 63334 62675 62006 61338 60621 59904 59196 58488 57780 57072 56408 55745 55162
1106 55162 54580 53997 53414 52832 52249 51711 51173 50634 50096 49616 49136 48705 48273 47870 47468 47065 46662 46278 45894 45559 45224 44863 44502
1104 44502 44189 43876 43554 43232 42882 42581 42320 42058 41779 41450 41134 40819 40549 40279 39934 39588 39243 38898 38578 38258 37965 37624 37277
1102 37277 36929 36579 36228 35814 35400 35035 34670 34322 33974 33605 33187 32788 32390 31988 31587 31165 30743 30294 29893 29519 29146 28748 28398
1100 28398 28099 27799 27481 27115 26742 26369 25997 25624 25314 25053 24761 24469 24199 23879 23560 23289 23040 22792 22546 22301 22033 21765 21497
$$ packed form
1115H9055o7j86j86j94j94k62l43m22m22m27m27m37m38m37m37m40m41m57n05m95m14m14m15
1113H0595l95l96l96l96l28l29k48k47k37k37k37k37k25k25j43j44j03j02j02j03k3k4k3k3
1111G5672j04j03k3k2o1o1j09j10j44j45j44j45j86j86k34k35l09l10l90l91m57m57n07n06
1109G0333n65n64o14o13o67o66o66o67o59o59o59o59o69o68p17p17p08p08p08p08o64o63n83
1106E5162n82n83n83n82n83n38n38n39n38m80m80m31m32m03m02m03m03l84l84l35l35l61l61
1104D4502l13l13l22l22l50l01k61k62k79l29l16l15k70k70l45l46l45l45l20l20k93l41l47
1102C7277l48l50l51m14m14l65l65l48l48l69m18l99l98m02m01m22m22m49m01l74l73l98l50
1100B8398k99l00l18l66l73l73l72l73l10k61k92k92k70l20l19k71k49k48k46k45k68k68k68
$$ plain form
1098 21497 21228 20994 20759 20570 20381 20216 20002 19815 19628 19394 19159 18974 18788 18618 18447 18277 18106 17893 17680 17548 17416 17279 17143
1096 17143 17003 16863 16714 16516 16319 16170 16042 15913 15788 15663 15479 15296 15113 14930 14777 14624 14519 14415 14347 14279 14208 14055 13861 13666
1093 13666 13547 13429 13330 13232 13134 13036 12934 12833 12732 12630 12517 12403 12290 12176 12078 11980 11882 11784 11698 11612 11526 11440 11369 11298 11226 11155 11086 11018 10950
1091 10950 10881 10798 10715 10650 10634 10638 10593 10530 10467 10426 10384 10345 10305 10245 10210 10191 10124 10060 10045 10014 9960 9905 9874 9859 9795 9702 9657 9583 9510 9467 9449 9446 9394 9359 9348
1087 9348 9335 9298 9273 9273 9271 9245 9206 9168 9128 9088 9060 9033 9005 8977 8952 8926 8900 8875 8842 8809 8822 8835 8801 8719 8650 8606 8560 8514 8469 8425 8425 8425 8425 8425 8400 8375 8350
1084 8350 8324 8294 8264 8282 8301 8320 8339 8359 8378 8352 8326 8300 8274 8260 8246 8232 8218 8198 8179 8159 8139 8119 8100 8080 8060 8005 7949 7897 7844 7855 7914 7973 7984 7951
1081 7951 7919 7884 7848 7822 7796 7818 7841 7809 7778 7747 7715 7720 7725 7682 7638 7614 7589 7565 7540 7579 7617 7574 7532 7508 7485 7461 7437 7437 7437 7440 7443 7410 7427 7443 7411 7343 7276
1077 7276 7289 7303 7277 7300 7295 7290 7249 7208 7167 7126 7124 7122 7120 7118 7112 7106 7051 6996 6922 6849 6857 6864 6889 6914 6966 6970 6934 6898 6859 6820 6818 6815 6813 6810 6779 6748 6716 6685 6674 6663 6653 6642
$$ packed form
1098B1497k69k34k35j89j89j65k14j87j87k34k35j85j86j70j71j70j71k13k13j32j32j37j36
1096A7143j40j40j49j98j97j49j28j29j25j25j84j83j83j83j53j53j05j04o8o8p1j53j94j95
1093A3666j19j18r9r8r8r8j02j01j01j02j13j14j13j14r8r8r8r8q6q6q6q6p1p1p2p1o9o8o8
1091A0950o9q3q3o5j6Mm5o3o3m1m2l9m0o0l5j9o7o4j5l1n4n5l1j5o4r3m5p4p3m3j8ln2l5j1
1087I348j3l7k5%kk6l9l8m0m0k8k7k8k8k5k6k6k5l3l3J3J3l4q2o9m4m6m6m5m4%%%%k5k5k5
1084H350k6l0l0J8J9J9J9K0J9k6k6k6k6j4j4j4j4k0j9k0k0k0j9k0k0n5n6n2n3J1N9N9J1l3
1081G951l2l5l6k6k6K2K3l2l1l1l2NNm3m4k4k5k4k5L9L8m3m2k4k3k4k4%%LLl3J7J6l2o8o7
1077G276J3J4k6K3nnm1m1m1m1kkkkoon5n5p4p3QPK5K5N2Ml6l6l9l9klkll1l1l2l1j1j1j0j1
$$ plain form
1073 6642 6630 6619 6610 6602 6569 6585 6600 6568 6550 6533 6540 6498 6448 6397 6392 6386 6354 6321 6337 6353 6372 6391 6362 6332 6332 6331 6331 6330 6313 6295 6232 6168 6138 6156 6195 6234 6205 6175 6145
1069 6145 6116 6039 5963 5935 5907 5905 5902 5900 5898 5887 5877 5863 5850 5916 5933 5896 5859 5864 5870 5875 5880 5926 5972 5965 5908 5873 5838 5846 5854 5856 5810 5791 5773 5767 5762 5757 5752 5753 5754 5755 5755 5722 5688 5655
1065 5655 5622 5616 5611 5606 5601 5608 5615 5621 5628 5644 5660 5672 5685 5712 5690 5650 5610 5589 5617 5663 5709 5766 5775 5735 5743 5745 5748 5753 5759 5734 5708 5683 5657 5664 5670 5648 5676 5703 5730 5760 5790 5748
1061 5748 5706 5686 5714 5761 5809 5810 5812 5780 5748 5765 5782 5794 5806 5817 5829 5807 5785 5763 5741 5771 5801 5831 5861 5901 5941 5932 5923 5879 5834 5790 5827 5866 5857 5770 5683 5701 5767
1058 5767 5807 5846 5836 5826 5817 5807 5828 5848 5869 5890 5877 5864 5873 5930 5965 6001 5994 5986 6005 6072 6140 6160 6165 6195 6189 6133 6080 6050 6039 6052 6097 6142 6168 6146 6110 6098 6120
1054 6120 6191 6262 6283 6270 6281 6333 6335 6303 6296 6329 6338 6329 6295 6267 6263 6265 6316 6386 6455 6473 6442 6398 6353 6356 6408 6473 6488 6489 6489 6414 6388 6431 6499 6543 6539 6515 6491 6510 6530
1051 6530 6598 6666 6722 6778 6753 6728 6740 6751 6763 6774 6801 6827 6854 6880 6895 6909 6925 6941 6932 6947 6979 6962 6987 7061 7118 7150 7196 7243 7239 7235 7257 7279 7318 7332 7342 7400
1047 7400 7443 7462 7485 7509 7530 7552 7587 7622 7658 7693 7727 7762 7732 7678 7663 7697 7718 7715 7704 7742 7816 7866 7868 7918 7988 7977 7936 7943 7999 8055 8063 8070 8125 8179 8177 8151 8160 8218
$$ packed form
1073F642j2j1rql3J6J5l2j8j7Pm2n0n1nol2l3J6J6J9J9k9l0%j%jj7j8o3o4l0J8L9L9k9l0l0
1069F145k9p7p6k8k8klkkj1j0j4j3O6J7l7l7NONNM6M6pn7l5l5QQKm6j9j8onnnJJJ%l3l4l3
1065E655l3onnnPPOPJ6J6J2J3K7k2m0m0k1K8M6M6N7Rm0QKLNOk5k6k5k6POk2K8K7K7L0L0m2
1061E748m2k0K8M7M8JKl2l2J7J7J2J2J1J2k2k2k2k2L0L0L0L0M0M0rrm4m5m4L7L9rq7q7J8O6
1058E767M0L9j0j0rj0K1K0K1K1j3j3RN7L5L6pqJ9O7O8K0NL0on6n3l0j1J3M5M5K6k2l6j2K2
1054F120P1P1K1j3J1N2Kl2pL3Rrl4k8mKN1P0O9J8l1m4m5LN2O5J5J%p5k6M3O8M4mk4k4J9K0
1051F530O8O8N6N6k5k5J2J1J2J1K7K6K7K6J5J4J6J6rJ5L2j7K5P4N7L2M6M7mmK2K2L9J4J0N8
1047G400M3J9K3K4K1K2L5L5L6L5L4L5l0n4j5L4K1lj1L8P4N0KN0P0j1m1PN6N6QPN5N4kk6RN8
$$ plain form
1044 8218 8285 8352 8374 8396 8411 8427 8442 8458 8506 8555 8603 8652 8675 8698 8721 8744 8729 8714 8748 8782 8851 8921 8909 8897 8877 8856 8890 8972 9090 9209 9280 9302 9282
1041 9282 9310 9357 9404 9434 9464 9493 9523 9515 9506 9498 9490 9550 9611 9671 9732 9787 9842 9898 9953 9955 9958 9960 9962 9982 10003 10023 10043 10083 10124 10164 10205 10229 10253 10277 10301 10323 10345 10416
1037 10416 10486 10529 10572 10566 10560 10593 10627 10633 10688 10737 10787 10840 10893 10971 11049 11154 11211 11229 11247 11261 11276 11321 11366 11363 11359 11431 11502 11556 11560 11557 11604 11619 11635 11640 11646 11730 11814 11899
1033 11899 11937 12001 12066 12104 12142 12181 12219 12249 12278 12307 12336 12364 12391 12467 12543 12587 12632 12631 12630 12643 12705 12818 12931 12959 12939 12898 12857 12882 12907 12936 12964 13012 13108 13204
1030 13204 13252 13298 13344 13386 13429 13472 13515 13558 13600 13611 13622 13635 13649 13720 13841 13933 14026 14068 14110 14151 14193 14201 14209 14221 14232 14232 14281 14351 14421 14455 14488 14522 14555 14606 14658
1027 14658 14709 14760 14769 14777 14835 14892 14967 15041 15098 15106 15119 15180 15215 15249 15233 15266 15320 15375 15404 15434 15464 15494 15502 15509 15520 15531 15548 15613 15700 15786 15799 15812 15825 15838 15854 15871
1023 15871 15887 15903 15922 15941 15961 15980 16000 16021 16090 16159 16198 16237 16276 16315 16336 16358 16380 16401 16398 16394 16363 16381 16451 16521 16574 16577 16528 16480 16476 16473 16471 16469 16470 16471 16459 16495 16553 16611
1020 16611 16670 16729 16815 16852 16831 16810 16788 16767 16731 16744 16781 16866 16954 16994 16979 16965 16962 16910 16886 16861 16896 16931 16920 16909 16907 16954 17001 16999 16962 16925 16884 16844 16837 16830 16824 16817 16852
$$ packed form
1044H218O7O7K2K2J5J6J5J6M8M9M8M9K3K3K3K3j5j5L4L4O9P0j2j2k0k1L4Q2J18J19P1K2k0
1041I282K8M7M7L0L0K9L0qrqqO0O1O0O1N5N5N6N5KLKKK0K1K0K0M0M1M0M1K4K4K4K4K2K2P1
1037A0416P0M3M3ooL3L4ON5M9N0N3N3P8P8J05N7J8J8J4J5M5M5lmP2P1N4MlM7J5J6NOQ4Q4Q5
1033A1899L8O4O5L8L8L9L8L0K9K9K9K8K7P6P6M4M5jjJ3O2J13J13K8k0m1m1K5K5K9K8M8R6R6
1030A3204M8M6M6M2M3M3M3M3M2J1J1J3J4P1J21R2R3M2M2M1M2QQJ2J1%M9P0P0L4L3L4L3N1N2
1027A4658N1N1RQN8N7P5P4N7QJ3O1L5L4j6L3N4N5K9L0L0L0QPJ1J1J7O5Q7Q6J3J3J3J3J6J7
1023A5871J6J6J9J9K0J9K0K1O9O9L9L9L9L9K1K2K2K1lml1J8P0P0N3Lm9m8mlkkJJj2L6N8N8
1020A6611N9N9Q6L7k1k1k2k1l6J3L7Q5Q8M0j5j4ln2k4k5L5L5j1j1kM7M7kl7l7m1m0ppopL5
$$ plain form
1016 16852 16887 16874 16861 16830 16800 16769 16738 16748 16757 16766 16775 16790 16804 16818 16832 16766 16699 16662 16707 16762 16736 16684 16682 16671 16660 16604 16547 16555 16562 16521 16480 16463 16446 16429 16412 16380 16348
1013 16348 16316 16283 16259 16234 16210 16185 16151 16116 16127 16138 16119 16051 15962 15873 15839 15806 15818 15831 15856 15833 15756 15679 15611 15544 15476 15408 15398 15388 15378 15368 15321 15274 15228 15181
1010 15181 15154 15127 15100 15073 15070 15067 15043 14970 14916 14862 14805 14748 14720 14691 14663 14634 14568 14502 14457 14461 14440 14419 14401 14383 14328 14273 14211 14198 14220 14194 14089 14034 14004 13975 13949
1006 13949 13923 13852 13781 13710 13639 13618 13597 13528 13458 13461 13463 13444 13377 13322 13268 13210 13153 13085 13018 12999 12980 12918 12855 12793 12731 12705 12679 12653 12627 12654 12682 12661 12639 12613 12587
1003 12587 12536 12485 12444 12403 12337 12272 12275 12277 12258 12191 12147 12103 12099 12095 12082 11987 11910 11882 11863 11844 11828 11812 11802 11793 11766 11690 11621 11601 11600 11598 11596 11594 11544 11494 11487 11480 11474 11467 11445 11423
999 11423 11402 11380 11353 11326 11296 11266 11255 11195 11114 11114 11121 11080 11019 11007 11009 11011 10967 10923 10861 10798 10787 10775 10732 10737 10715 10692 10705 10718 10683 10647 10601 10555 10485 10415 10392 10370 10371
996 10371 10373 10359 10346 10332 10318 10308 10297 10284 10270 10255 10192 10156 10120 10131 10143 10182 10172 10150 10128 10151 10175 10204 10234 10233 10281 10311 10293 10305 10318 10294 10270 10246 10223 10252 10281
992 10281 10310 10339 10342 10345 10349 10352 10335 10318 10301 10284 10271 10259 10216 10222 10264 10258 10282 10306 10306 10306 10306 10306 10319 10331 10346 10362 10376 10438 10501 10515 10527 10540 10550 10560 10575 10591 10558 10524 10523 10521
$$ packed form
1016A6852L5j3j3l1l0l1l1J0RRRJ5J4J4J4o6o7l7M5N5k6n2kj1j1n6n7QPm1m1j7j7j7j7l2l2
1013A6348l2l3k4k5k4k5l4l5J1J1j9o8q9q9l4l3J2J3K5k3p7p7o8o7o8o8j0j0j0j0m7m7m6m7
1010A5181k7k7k7k7llk4p3n4n4n7n7k8k9k8k9o6o6m5Mk1k1j8j8n5n5o2j3K2k6j05n5l0k9k6
1006A3949k6p1p1p1p1k1k1o9p0LKj9o7n5n4n8n7o8o7j9j9o2o3o2o2k6k6k6k6K7K8k1k2k6k6
1003A2587n1n1m1m1o6o5LKj9o7m4m4mmj3r5p7k8j9j9j6j6j0rk7p6o9k0jkkkn0n0ppopk2k2
999A1423k1k2k7k7l0l0j1o0q1%Pm1o1j2KKm4m4o2o3j1j2m3Nk2k3J3J3l5l6m6m6p0p0k3k2J
996A0371Kj4j3j4j4j0j1j3j4j5o3l6l6J1J2L9j0k2k2K3K4K9L0jM8L0j8J2J3k4k4k4k3K9K9
992A0281K9K9LLMLj7j7j7j7j3j2m3OM2oK4K4%%%%J3J2J5J6J4O2O3J4J2J3J0J0J5J6l3l4jk
$$ plain form
989 10521 10540 10609 10636 10663 10694 10724 10758 10791 10825 10858 10868 10878 10888 10899 10953 11008 11063 11117 11160 11203 11245 11288 11330 11373 11415 11458 11493 11528 11536 11593 11658 11724 11793 11861 11880
985 11880 11899 11917 11936 11905 11874 11816 11806 11827 11848 11872 11897 11895 11894 11893 11892 11886 11881 11894 11955 12009 12015 12051 12087 12105 12123 12141 12159 12177 12195 12213 12231 12259 12287 12315 12343 12375 12406 12440
982 12440 12474 12499 12573 12668 12763 12816 12869 12877 12885 12904 12972 13039 13058 13102 13145 13186 13226 13294 13362 13381 13400 13446 13492 13539 13585 13654 13722 13791 13859 13915 13972 14010 13999 14020 14089
979 14089 14128 14166 14205 14244 14283 14322 14357 14392 14427 14461 14436 14410 14433 14455 14420 14385 14398 14411 14461 14511 14561 14611 14597 14583 14569 14555 14553 14551 14550 14548 14549 14551 14556 14561 14575 14637 14673 14708
975 14708 14762 14816 14870 14924 14985 15046 15059 15071 15057 15044 15033 15022 15034 15094 15158 15172 15146 15169 15210 15250 15239 15229 15266 15304 15326 15348 15373 15398 15422 15494 15588 15601 15595 15637 15675
972 15675 15663 15638 15612 15584 15555 15560 15565 15570 15575 15597 15620 15660 15749 15791 15783 15760 15738 15717 15745 15773 15753 15715 15677 15718 15758 15733 15707 15682 15656 15661 15666 15670 15675 15692 15709 15677 15645 15638 15631 15705
968 15705 15779 15765 15751 15737 15723 15709 15695 15638 15580 15546 15592 15594 15595 15588 15581 15528 15476 15476 15525 15546 15568 15576 15584 15592 15601 15529 15457 15434 15411 15407 15404 15401 15398 15366 15334 15303 15271 15203 15135 15148 15161
964 15161 15151 15142 15133 15123 15132 15142 15070 14998 14962 14927 14892 14856 14805 14754 14722 14738 14754 14721 14671 14620 14567 14514 14460 14407 14407 14407 14406 14406 14421 14435 14399 14315 14223 14180 14158 14136 14057 14027
$$ packed form
989A0521J9O9K7K7L1L0L4L3L4L3J0J0J0J1N4N5N5N4M3M3M2M3M2M3M2M3L5L5QN7O5O6O9O8J9
985A1880J9J8J9l1l1n8j0K1K1K4K5kjjjonJ3O1N4OL6L6J8J8J8J8J8J8J8J8K8K8K8K8L2L1L4
982A2440L4K5P4R5R5N3N3QQJ9O8O7J9M4M3M1M0O8O8J9J9M6M6M7M6O9O8O9O8N6N7L8j1K1O9
979A4089L9L8L9L9L9L9L5L5L5L4k5k6K3K2l5l5J3J3N0N0N0N0j4j4j4j4kkjkJKNNJ4O2L6L5
975A4708N4N4N4N4O1O1J3J2j4j3j1j1J2O0O4J4k6K3M1M0j1j0L7L8K2K2K5K5K4P2R4J3oM2L8
972A5675j2k5k6k8k9NNNNK2K3M0Q9M2qk3k2k1K8K8k0l8l8M1M0k5k6k5k6NNMNJ7J7l2l2ppP4
968A5705P4j4j4j4j4j4j4n7n8l4M6KJppn3n2%M9K1K2QQQRp2p2k3k3mllll2l2l1l2o8o8J3J3
964A5161j0rrj0RJ0p2p2l6l5l5l6n1n1l2J6J6l3n0n1n3n3n4n3%%j%J5J4l6q4r2m3k2k2p9l0
$$ plain form
960 14027 14018 14009 13940 13870 13849 13828 13786 13745 13703 13661 13605 13549 13466 13431 13427 13423 13422 13421 13351 13281 13210 13140 13115 13089 13064 13039 12974 12909 12892 12876 12851 12825 12800 12775 12711 12647 12556
957 12556 12513 12453 12392 12337 12282 12217 12201 12185 12120 12064 12008 11951 11895 11853 11859 11866 11824 11788 11753 11714 11676 11606 11536 11466 11396 11362 11329 11249 11170 11071 11020 11023 11026 10978 10931 10838
953 10838 10744 10701 10706 10684 10662 10606 10551 10495 10440 10387 10334 10282 10229 10172 10115 10106 10097 10020 9942 9868 9793 9722 9700 9700 9699 9673 9647 9572 9497 9472 9446 9420 9394 9326 9258 9235 9212
950 9212 9186 9111 9060 9010 8989 8921 8852 8832 8827 8823 8822 8821 8783 8746 8708 8670 8636 8602 8568 8534 8554 8575 8542 8460 8450 8441 8429 8416 8354 8292 8251 8259 8267 8274 8287 8300 8307 8362 8438
946 8438 8514 8565 8617 8671 8726 8765 8853 8962 9071 9197 9323 9445 9568 9706 9795 9834 9872 9884 9945 10003 10012 10000 9939 9850 9762 9633 9456 9305 9155 8990
943 8990 8825 8659 8494 8281 8069 7905 7741 7619 7497 7375 7252 7148 7044 6940 6836 6777 6718 6689 6611 6508 6454 6446 6389 6272 6155 6088
941 6088 6071 6004 5938 5874 5810 5752 5693 5635 5576 5527 5479 5430 5381 5347 5312 5322 5331 5311 5210 5110 5011 4936 4943 4952 4962 4883 4804 4746 4737 4738 4738 4741 4745 4696 4647 4598 4549 4541
937 4541 4534 4527 4519 4512 4506 4453 4401 4365 4379 4392 4357 4304 4251 4195 4138 4151 4164 4147 4178 4211 4195 4161 4128 4089 4051 3982 3962 3967 3924 3855 3785 3732 3678 3667 3704 3726 3700 3675
$$ packed form
960A4027rro9p0k1k1m2m1m2m2n6n6q3l5mmjjp0p0p1p0k5k6k5k5o5o5j7j6k5k6k5k5o4o4r1
957A2556m3o0o1n5n5o5j6j6o5n6n6n7n6m2OPm2l6l5l9l8p0p0p0p0l4l3q0p9r9n1LLm8m7r3
953A0838r4m3Nk2k2n6n5n6n5n3n3n2n3n7n7rrp7p8p4p5p1k2%jk6k6p5p5k5k6k6k6o8o8k3k3
950I212k6p5n1n0k1o8o9k0nmjjl8l7l8l8l4l4l4l4K0K1l3q2j0rj2j3o2o2m1QQPJ3J3PN5P6
946H438P6N1N2N4N5L9Q8J09J09J26J26J22J23J38Q9L9L8J2O1N8Rj2o1q9q8j29j77j51j50j65
943H990j65j66j65k13k12j64j64j22j22j22j23j04j04j04j04n9n9k9p8j03n4qn7j17j17o7
941F088j7o7o6o4o4n8n9n8n9m9m8m9m9l4l5J0Rk0j01j00r9p5PRJ0p9p9n8rJ%LMm9m9m9m9q
937D541ppqpon3n2l6J4J3l5n3n3n6n7J3J3j7L1L3j6l4l3l9l8o9k0Nm3o9p0n3n4j1L7K2k6k5
$$ plain form
934 3675 3600 3500 3400 3390 3430 3419 3407 3375 3342 3364 3385 3365 3346 3328 3310 3255 3200 3157 3164 3167 3171 3144 3118 3054 2990 2989 3037 3003 2970 2982 3043 3063 3035 3028 3021 3011 3000
930 3000 2996 2992 2988 2984 2970 2957 2943 2929 2898 2867 2873 2880 2893 2858 2809 2761 2750 2739 2728 2718 2693 2668 2668 2668 2612 2556 2540 2524 2561 2598 2595 2592 2597 2603 2584 2566 2534 2502 2494 2487 2455 2422
926 2422 2414 2406 2400 2393 2387 2380 2339 2297 2280 2263 2247 2232 2273 2314 2375 2435 2437 2390 2331 2321 2337 2353 2328 2302 2315 2327 2384 2392 2340 2337 2324 2262 2255 2249 2247 2245 2203 2160 2135 2110 2126
923 2126 2141 2107 2073 2079 2086 2114 2143 2147 2152 2129 2107 2122 2137 2151 2117 2113 2109 2073 2085 2143 2201 2153 2104 2055 2007 1996 1985 1987 2038 2079 2119 2163 2206 2197 2187 2205 2222 2227 2281
919 2281 2348 2415 2443 2471 2500 2528 2559 2590 2621 2651 2694 2737 2780 2823 2831 2839 2847 2854 2850 2845 2841 2837 2786 2736 2686 2636 2586 2536 2491 2446 2405 2446 2486 2446 2387 2328 2267 2206 2200
915 2200 2242 2258 2273 2288 2303 2278 2253 2240 2228 2256 2284 2323 2363 2402 2441 2452 2462 2503 2495 2469 2493 2510 2527 2565 2603 2615 2578 2525 2522 2512 2502 2450 2399 2372 2344 2348
912 2348 2351 2411 2471 2505 2539 2560 2532 2533 2534 2499 2513 2530 2465 2450 2434 2452 2471 2465 2459 2442 2426 2361 2296 2306 2317 2350 2382 2454 2477 2446 2415 2428 2442 2455 2468 2507 2547
908 2547 2558 2619 2681 2743 2756 2770 2770 2721 2697 2721 2756 2792 2806 2820 2822 2824 2826 2828 2828 2828 2828 2829 2823 2817 2811 2805 2799 2793 2787 2781 2784 2786 2789 2792 2828 2864 2900 2936 2990 3044 3077 3061 3011 2961 2930
$$ packed form
934C675p5j00j00j0M0j1j2l2l3K2K1k0j9j8j8n5n5m3PLMk7k6o4o4jM8l4l3J2O1K0k8ppj0j1
930C000mmmmj4j3j4j4l1l1OPJ3l5m9m8j1j1j1j0k5k5%%n6n6j6j6L7L7llNOj9j8l2l2qpl2l3
926B422qqopopm1m2j7j7j6j5M1M1O1O0Km7n9j0J6J6k5k6J3J2N7Qn2lj3o2pokkm2m3k5k5J6
923B126J5l4l4OPK8K9MNk3k2J5J5J4l4mml6J2N8N8m8m9m9m8j1j1KN1M1M0M4M3rj0J8J7NN4
919B281O7O7K8K8K9K8L1L1L1L0M3M3M3M3QQQPmnmmn1n0n0n0n0n0m5m5m1M1M0m0n9n9o1o1o
915B200M2J6J5J5J5k5k5j3j2K8K8L9M0L9L9J1J0M1qk6K4J7J7L8L8J2l7n3lj0j0n2n1k7k8M
912B348LO0O0L4L4K1k8JJl5J4J7o5j5j6J8J9ooj7j6o5o5J0J1L3L2P2K3l1l1J3J4J3J3L9M0
908B547J1O1O2O2J3J4%m9k4K4L5L6J4J4KKKK%%%JooooooooLKLLL6L6L6L6N4N4L3j6n0n0l1
$$ plain form
904 2930 2947 2980 3013 3001 2988 2965 2942 2967 2993 3040 3088 3111 3134 3100 3067 3082 3097 3134 3171 3214 3209 3191 3222 3271 3320 3295 3269 3222 3175 3216 3306 3395 3436 3447 3459
901 3459 3467 3475 3471 3467 3463 3459 3454 3449 3444 3439 3458 3477 3495 3514 3485 3457 3477 3497 3535 3573 3638 3654 3608 3562 3562 3561 3547 3534 3498 3463 3471 3527 3553 3579 3634 3641 3626 3611 3640 3669 3722 3776
897 3776 3747 3718 3738 3758 3818 3878 3913 3949 4000 4051 4084 4069 4032 4043 4073 4103 4120 4138 4128 4167 4194 4220 4282 4295 4307 4400 4472 4495 4524 4553 4578 4604 4628 4651 4724
893 4724 4796 4876 4956 5015 5025 5050 5076 5123 5170 5237 5304 5371 5437 5474 5511 5551 5591 5688 5834 5931 5980 6034 6088 6164 6240 6319 6398 6453 6508 6595 6682 6744 6807 6853
890 6853 6900 6992 7084 7178 7223 7243 7313 7417 7522 7605 7688 7761 7834 7885 7936 8018 8148 8279 8360 8386 8411 8455 8547 8613 8679 8748 8817 8925 9034 9142 9251
887 9251 9425 9599 9772 9946 10068 10189 10359 10528 10714 10899 11132 11366 11603 11840 12077 12314 12554 12795 13149 13504 13794 14084 14375
885 14375 14665 15039 15413 15784 16154 16546 16890 17251 17710 18157 18554 18904 19253 19604 19955 20306 20656 21022 21387 21731 22123 22600 23175
883 23175 23794 24512 25308 26201 27172 28241 29389 30586 31854 33170 34589 36106 37705 39401 41186 43134 45220 47533 50036
$$ packed form
904B930J7L3L3j2j3k3k3K5K6M7M8K3K3l4l3J5J5L7L7M3nj8L1M9M9k5k6m7m7M1R0Q9M1J1J2
901C459QQmmmmnnnnJ9J9J8J9k9k8K0K0L8L8O5J6m6m6%jj4j3l6l5QN6K6K6N5Pj5j5K9K9N3N4
897C776k9k9K0K0O0O0L5L6N1N1L3j5l7J1L0L0J7J8j0L9K7K6O2J3J2R3P2K3K9K9K5K6K4K3P3
893D724P2Q0Q0N9J0K5K6M7M7O7O7O7O6L7L7M0M0R7J46R7M9N4N4P6P6P9P9N5N5Q7Q7O2O3M6
890F853M7R2R2R4M5K0P0J04J05Q3Q3P3P3N1N1Q2J30J31Q1K6K5M4R2O6O6O9O9J08J09J08J09
887I251J74J74J73J74J22J21J70J69J86J85K33K34K37K37K37K37K40K41L54L55K90K90K91
885A4375K90L74L74L71L70L92L44L61M59M47L97L50L49L51L51L51L50L66L65L44L92M77N75
883B3175O19P18P96Q93R71J069J148J197J268J316J419J517J599J696J785J948K086K313K503
$$ plain form
881 50036 52702 55586 58698 62038 65669 69613 73849 78418 83408 88866 94810 101296 108334 116078 124569 133941 144254
880 144254 155598 168143 182070 197523 214781 234086 255618 279586 306325 336019 368913 405086 444518 487099
878 487099 532316 579385 627115 673838 717428 755532 785905 806375 815476 812468 797670 772321 738289 697926
877 697926 653679 607777 561949 517582 475585 436478 400469 367610 337834 310948 286740 264901 245230 227474
876 227474 211457 196966 183895 172025 161254 151425 142435 134192 126647 119784 113488 107679 102288 97302 92686 88444
874 88444 84566 80930 77540 74426 71501 68755 66174 63773 61536 59444 57469 55607 53856 52219 50693 49248 47883
872 47883 46566 45341 44116 42950 41783 40617 39451 38367 37282 36197 35112 34152 33192 32314 31435 30705 29976 29360 28744
871 28744 28200 27656 27161 26666 26246 25826 25455 25083 24759 24435 24191 23948 23767 23586 23404 23223 22993 22763 22581 22400 22208 22016 21873
$$ packed form
881E0036K666K884L112L340L631L944M236M569M990N458N944O486P038P744Q491R372J0313
880A44254J1344J2545J3927J5453J7258J9305K1532K3968K6739K9694L2894L6173L9432M2581
878D87099M5217M7069M7730M6723M3590L8104L0373K0470R101l008j4798k5349l4032m0363
877F97926m4247m5902m5828m4367m1997l9107l6009l2859k9776k6886k4208k1839j9671j7756
876B27474j6017j4491j3071j1870j0771r829q990q243p545o863o296n809n391m986m616m242
874H8444l878l636l390l114k925k746k581k401k237k092j975j862j751j637j526j445j365
872D7883j317j225j225j166j167j166j166j084j085j085j085r60r60q78q79p30p29o16o16
871B8744n44n44m95m95m20m20l71l72l24l24k44k43j81j81j82j81k30k30j82j81j92j92j43
$$ plain form
868 21873 21730 21607 21484 21361 21238 21093 20949 20853 20758 20669 20580 20540 20501 20429 20358 20335 20312 20291 20270 20248 20227 20208 20190 20172 20153 20153 20152 20152 20151 20203 20255 20307 20360
865 20360 20445 20531 20616 20702 20787 20872 20958 21043 21160 21276 21392 21508 21560 21613 21714 21814 21947 22080 22212 22345 22517 22689 22861 23033 23207 23382
863 23382 23556 23731 23876 24022 24120 24217 24374 24532 24671 24761 24849 24985 25139 25294 25515 25737 25959 26180 26417 26654 26894 27134 27364 27642
861 27642 27897 28151 28461 28820 29151 29483 29841 30199 30606 31013 31392 31771 32171 32619 33058 33497 33988 34479 34987 35495 36038 36663 37254
858 37254 37845 38393 38940 39549 40157 40766 41374 41994 42615 43207 43849 44511 45173 45837 46502 47165 47828 48437 48997 49515 50033 50575 51068
856 51068 51554 52040 52501 52913 53250 53586 53919 54253 54539 54826 55059 55243 55383 55522 55708 55893 56063 56234 56426 56667 56912 57156 57426
854 57426 57743 58096 58449 58826 59252 59704 60156 60629 61215 61862 62510 63232 64036 64876 65716 66568 67420 68281 69255 70283 71310 72348
852 72348 73435 74579 75723 76925 78176 79513 80850 82167 83485 84857 86228 87634 89122 90639 92109 93581 95053
$$ packed form
868B1873j43j23j23j23j23j45j44r6r5q9q9m0l9p2p1k3k3k1k1k2k1j9j8j8j9%j%jN2N2N2N3
865B0360Q5Q6Q5Q6Q5Q5Q6Q5J17J16J16J16N2N3J01J00J33J33J32J33J72J72J72J72J74J75
863B3382J74J75J45J46R8R7J57J58J39R0Q8J36J54J55K21K22K22K21K37K37K40K40K30K78
861B7642K55K54L10L59L31L32L58L58M07M07L79L79M00M48M39M39M91M91N08N08N43O25N91
858C7254N91N48N47O09O08O09O08O20O21N92O42O62O62O64O65O63O63O09N60N18N18N42M93
856E1068M86M86M61M12L37L36L33L34K86K87K33J84J40J39J86J85J70J71J92K41K45K44K70
854E7426L17L53L53L77M26M52M52M73N86O47O48P22Q04Q40Q40Q52Q52Q61R74J028J027J038
852G2348J087J144J144J202J251J337J337J317J318J372J371J406J488J517J470J472J472
$$ plain form
850 95053 96519 97985 99417 100800 102150 103451 104664 105763 106737 107597 108372 109034 109582 109984 110246 110361 110366 110256 110065 109792 109439
848 109439 109037 108615 108193 107768 107343 106959 106576 106196 105815 105516 105265 105028 104872 104816 104841 104898 105037 105247 105539 105911 106283 106766 107363 108021
846 108021 108728 109517 110419 111319 112268 113291 114396 115510 116624 117770 118966 120250 121534 122871 124255 125699 127192 128688
845 128688 130184 131705 133275 134927 136579 138234 139889 141512 143135 144747 146279 147743 149094 150347 151487 152517 153402
843 153402 154105 154630 154975 155076 154921 154588 154111 153455 152627 151653 150599 149497 148266 146921 145522 144123 142692 141310 139970 138680
841 138680 137436 136273 135188 134152 133169 132267 131468 130782 130224 129779 129394 129122 128916 128760 128685 128690 128789 128969 129162 129404 129740 130076 130389
839 130389 130751 131169 131588 132021 132504 133045 133635 134215 134795 135329 135864 136424 136984 137593 138202 138845 139489 140108 140727 141333 141940 142507 142994
837 142994 143404 143765 144057 144236 144303 144224 144033 143728 143314 142786 142081 141231 140264 139184 137988 136712 135365 133938 132502 131067 129637
$$ packed form
850I5053J466J466J432J383J350J301J213J099R74Q60P75O62N48M02K62J15Nj10j91k73l53
848A09439m02m22m22m25m25l84l83l80l81k99k51k37j56n6K5N7J39K10K92L72L72M83N97O58
846A08021P07P89R02R00R49J023J105J114J114J146J196J284J284J337J384J444J493J496
845A28688J496J521J570J652J652J655J655J623J623J612J532J464J351J253J140J030Q85
843A53402P03N25L45J01j55l33m77o56q28r74j054j102j231j345j399j399j431j382j340j290
841A38680j244j163j085j036r83r02p99o86n58m45l85k72k06j56p5NR9J80J93K42L36L36L13
839A30389L62M18M19M33M83N41N90N80N80N34N35N60N60O09O09O43O44O19O19O06O07N67M87
837A42994M10L61K92J79O7p9j91l05m14n28p05q50r67j080j196j276j347j427j436j435j430
$$ plain form
835 129637 128208 126781 125355 123981 122656 121410 120244 119122 118081 117103 116206 115377 114597 113931 113346 112825 112354 111898 111524 111235
833 111235 110995 110756 110567 110435 110352 110298 110293 110279 110264 110253 110241 110231 110220 110161 110102 110007 109913 109770 109627 109482 109337 109111 108885 108674 108463 108203 107943
830 107943 107657 107372 107005 106639 106234 105830 105425 105021 104513 104005 103461 102836 102220 101604 100902 100200 99448 98695 97967 97239 96530 95820 95110
828 95110 94400 93715 93031 92346 91661 91070 90479 89942 89405 88876 88428 88048 87668 87329 86990 86699 86409 86207 86004 85802 85600 85435 85270
826 85270 85219 85168 85103 85037 84972 84907 84912 84918 84875 84832 84811 84789 84763 84736 84641 84464 84306 84196 84048 83900 83707 83513 83211 82909 82521 82133 81743 81273 80766
823 80766 80260 79795 79330 78840 78351 77847 77343 76838 76334 75821 75308 74875 74443 74037 73631 73249 72867 72534 72201 71868 71535 71262 70990
821 70990 70798 70607 70382 70156 69979 69803 69683 69564 69420 69276 69173 69071 69049 69027 69013 69000 69011 69021 69047 69073 69104 69135 69187 69320 69438 69507 69570
818 69570 69683 69878 70074 70200 70327 70404 70482 70596 70709 70754 70718 70675 70633 70560 70488 70354 70220 70061 69903 69785 69667 69468 69269 69103 68937 68819
$$ packed form
835A29637j429j427j426j374j325j246j166j122j041r78q97q29p80o66n85n21m71m56l74k89
833A11235k40k39j89j32q3n4nj4j5j1j2j0j1n9n9r5r4j43j43j45j45k26k26k11k11k60k60
830A07943k86k85l67l66m05m04m05m04n08n08n44o25o16o16p02p02p52p53p28p28p09p10p10
828I5110p10o85o84o85o85n91n91n37n37n29m48l80l80l39l39k91k90k02k03k02k02j65j65
826H5270n1n1o5o6o5o5NOm3m3k1k2k6k7r5j77j58j10j48j48j93j94l02l02l88l88l90m70n07
823H0766n06m65m65m90m89n04n04n05n04n13n13m33m32m06m06l82l82l33l33l33l33k73k72
821G0990j92j91k25k26j77j76j20j19j44j44j03j02k2k2j4j3J1J0K6K6L1L1N2J33J18O9O3
818F9570J13J95J96J26J27P7P8J14J13M5l6m3m2p3p2j34j34j59j58j18j18j99j99j66j66j18
$$ plain form
816 68819 68702 68637 68572 68557 68541 68628 68715 68850 68986 69129 69272 69496 69720 70005 70290 70575 70859 71196 71533 71915 72297 72651 72956 73236 73517
814 73517 73831 74098 74307 74517 74663 74760 74849 74857 74815 74773 74701 74630 74513 74396 74201 74006 73817 73678 73541 73355 73129 72952 72829 72705 72605 72553
811 72553 72528 72503 72505 72587 72673 72759 72946 73132 73319 73554 73861 74216 74604 75040 75541 76090 76664 77237 77816 78395 79030 79714 80390 81115 81900
809 81900 82684 83482 84328 85270 86261 87268 88357 89535 90795 92089 93382 94702 96070 97481 98891 100252 101613 102967 104271
807 104271 105500 106582 107504 108313 109062 109731 110217 110493 110645 110650 110514 110199 109665 108952 108109 107184 106208 105183 104139 103096 101973
805 101973 100851 99739 98709 97734 96839 95974 95109 94255 93400 92593 91867 91187 90555 90024 89574 89157 88820 88584 88462 88418 88456 88547 88719
803 88719 88976 89282 89685 90201 90811 91535 92346 93271 94299 95376 96537 97844 99260 100726 102293 103941 105650 107440 109303
801 109303 111216 113187 115158 117153 119149 121122 122982 124730 126396 127917 129259 130442 131480 132226 132695 132902 132866 132556 131970
$$ packed form
816F8819j17o5o5j5j6Q7Q7J35J36J43J43K24K24K85K85K85K84L37L37L82L82L54L05K80K81
814G3517L14K67K09K10J46R7Q9Qm2m2p2p1j17j17j95j95j89j39j37j86k26j77j23j24j00n2
811G2553k5k5KQ2Q6Q6J87J86J87K35L07L55L88M36N01N49N74N73N79N79O35O84O76P25P85
809H1900P84P98Q46R42R91J007J089J178J260J294J293J320J368J411J410J361J361J354J304
807A04271J229J082R22Q09P49O69M86K76J52Nj36l15n34p13q43r25r76j025j044j043j123
805A01973j122j112j030r75q95q65q65q54q55q07p26o80o32n31m50m17l37k36j22m4L8R1J72
803H8719K57L06M03N16O10P24Q11R25J028J077J161J307J416J466J567J648J709J790J863
801A09303J913J971J971J995J996J973J860J748J666J521J342J183J038P46M69K07l6l10n86
$$ plain form
799 131970 131101 130022 128728 127255 125657 123880 121978 119962 117874 115737 113543 111348 109177 107055 105010 103047 101171
798 101171 99377 97630 95998 94475 93065 91704 90424 89263 88184 87202 86302 85490 84759 84126 83574 83113 82734 82454 82255 82149
796 82149 82157 82258 82358 82519 82760 83117 83621 84210 84799 85518 86287 87093 87948 88849 89832 90866 91949 93059 94168 95263 96358 97385
794 97385 98331 99213 100094 100863 101486 101960 102255 102357 102281 101975 101491 100875 100080 99080 97869 96514 95045 93462 91765 89974 88134
792 88134 86307 84480 82625 80770 78910 77049 75241 73546 71909 70321 68738 67205 65773 64423 63122 61870 60674
790 60674 59559 58521 57531 56612 55694 54925 54156 53476 52796 52202 51609 51071 50614 50215 49897 49595 49341 49114 48886 48731 48575 48500 48426
788 48426 48399 48372 48350 48328 48352 48458 48626 48745 48846 48948 49046 49144 49177 49210 49207 49123 48986 48850 48624 48398 48095 47743 47350 46876 46310 45744 45137
785 45137 44449 43712 42974 42182 41391 40615 39840 39064 38289 37505 36721 35937 35154 34401 33649 32977 32306 31671 31035 30400 29765 29187 28610
$$ packed form
799A31970q69j079j294j473j598j777j902k016k088k137k194k195k171k122k045j963j876
798A01171j794j747j632j523j410j361j280j161j079r82r00q12p31o33n52m61l79k80j99j06
796H2149QJ01J00J61K41L57N04N89N89P19P69Q06Q55R01R83J034J083J110J109J095J095J027
794I7385R46Q82Q81P69O23M74K95J02p6l06m84o16p95j000j211j355j469j583j697j791j840
792H8134j827j827j855j855j860j861j808j695j637j588j583j533j432j350j301j252j196
790F0674j115j038r90r19r18p69p69o80o80n94n93n38m57l99l18l02k54k27k28j55j56p5p4
788D8426k7k7k2k2K4J06J68J19J01J02R8R8L3L3lq4j37j36k26k26l03l52l93m74n66n66o07
785D5137o88p37p38p92p91p76p75p76p75p84p84p84p83p53p52o72o71o35o36o35o35n78n77
$$ plain form
783 28610 28081 27552 27060 26568 26124 25680 25298 24915 24532 24150 23787 23424 23062 22699 22449 22199 21949 21699 21443 21186 20979 20771 20553
781 20553 20336 20118 19900 19749 19598 19398 19198 18975 18752 18610 18468 18362 18255 18067 17879 17702 17526 17349 17172 16961 16750 16621 16491
779 16491 16330 16170 15961 15752 15527 15302 15077 14852 14685 14517 14350 14183 13981 13779 13577 13375 13179 12983 12787 12591 12460 12329 12197
777 12197 12066 11906 11747 11587 11427 11311 11194 11078 10961 10872 10783 10646 10508 10408 10308 10208 10108 10050 9991 9912 9783 9678 9573 9468 9363
774 9363 9228 9143 9078 9014 8946 8878 8811 8743 8629 8515 8404 8293 8162 8080 8020 7960 7890 7820 7751 7681 7591 7500 7456 7411 7395 7330 7292 7254 7160 7065 6944
771 6944 6870 6847 6823 6803 6782 6779 6776 6745 6763 6753 6743 6737 6730 6706 6682 6655 6628 6662 6647 6578 6509 6426 6342 6262 6181 6116 6099 6056 6012 5954 5896 5886 5877 5840 5803 5764 5724
768 5724 5672 5571 5497 5423 5403 5382 5361 5340 5292 5245 5243 5241 5233 5177 5148 5118 5049 4980 4914 4848 4788 4776 4786 4796 4782 4767 4753 4739 4699 4659 4619 4579 4526 4473 4423 4373
765 4373 4354 4383 4381 4380 4399 4369 4317 4266 4233 4200 4167 4134 4133 4133 4132 4132 4144 4155 4164 4173 4146 4070 3994 3966 3962 3957 3955 3953 3933 3913 3896 3879 3843 3857 3873 3841 3805 3817 3800 3782 3722
$$ packed form
783B8610n29n29m92m92m44m44l82l83l83l82l63l63l62l63k50k50k50k50k56k57k07k08k18
781B0553k17k18k18j51j51k00k00k23k23j42j42j06j07j88j88j77j76j77j77k11k11j29j30
779A6491j61j60k09k09k25k25k25k25j67j68j67j67k02k02k02k02j96j96j96j96j31j31j32
777A2197j31j60j59j60j60j16j17j16j17q9q9j37j38j00j00j00j00n8n9p9j29j05j05j05j05
774I363j35q5o5o4o8o8o7o8j14j14j11j11j31q2o0o0p0p0o9p0r0r1m4m5j6o5l8l8r4r5j21
771F944p4k3k4k0k1lll1J8j0j0opk4k4k7k7L4j5o9o9q3q4q0q1o5j7m3m4n8n8j0rl7l7l9m0
768E724n2j01p4p4k0k1k1k1m8m7kkqn6k9l0o9o9o6o6o0j2J0J0j4j5j4j4m0m0m0m0n3n3n0n0
765D373j9K9kjJ9l0n2n1l3l3l3l3j%j%J2J1RRk7p6p6k8mnkkk0k0j7j7l6J4J6l2l6J2j7j8o0
$$ plain form
761 3722 3663 3622 3629 3632 3587 3571 3556 3496 3436 3425 3414 3366 3318 3270 3303 3321 3292 3294 3297 3323 3349 3375 3401 3355 3309 3311 3314 3331 3348 3362 3375 3370 3316 3289 3262 3227 3192 3205
757 3205 3218 3233 3247 3258 3270 3273 3229 3214 3199 3204 3258 3311 3316 3303 3289 3273 3256 3237 3217 3171 3172 3166 3160 3157 3155 3159 3163 3164 3165 3240 3267 3240 3213 3216 3219 3223 3226 3243 3260 3276 3293 3322 3351
753 3351 3380 3409 3429 3449 3469 3488 3587 3686 3704 3721 3755 3789 3904 4019 4080 4141 4202 4264 4355 4446 4586 4726 4899 5073 5246 5420 5624 5829 6034
750 6034 6239 6553 6868 7236 7604 7987 8451 9026 9649 10202 10837 11568 12299 12980 13547 14023 14384 14628 14726 14621 14338 13922 13425 12812
748 12812 12150 11522 10895 10313 9731 9155 8578 8073 7649 7323 7046 6750 6454 6150 5895 5710 5606 5509 5364 5202 5040 4919 4798
746 4798 4677 4556 4413 4271 4177 4084 3969 3854 3788 3722 3674 3625 3576 3527 3546 3564 3533 3503 3410 3316 3304 3292 3291 3291 3290 3290 3250 3209 3169 3129 3103 3076 3050 3024
743 3024 3009 2995 2981 2967 2962 2957 2952 2948 2922 2896 2918 2941 2943 2945 2944 2944 2920 2848 2804 2759 2742 2724 2707 2689 2694 2699 2753 2806 2841 2877 2863 2850 2790 2730 2691 2701 2723 2745 2797 2801
739 2801 2803 2806 2806 2805 2815 2826 2787 2749 2707 2666 2673 2680 2744 2809 2852 2846 2796 2747 2695 2642 2641 2640 2666 2644 2626 2607 2586 2564 2504 2444 2438 2481 2508 2535 2563 2590 2628 2618 2586 2554
$$ packed form
761C722n9m1PLm5j6j5o0o0j1j1m8m8m8L3J8k9KLK6K6K6K6m6m6KLJ7J7J4J3nn4k7k7l5l5J3
757C205J3J5J4J1J2Lm4j5j5NN4N3Nj3j4j6j7j9k0m6JoolkMMJJP5K7k7k7LLMLJ7J7J6J7K9K9
753C351K9K9K0K0K0J9R9R9J8J7L4L4J15J15O1O1O1O2R1R1J40J40J73J74J73J74K04K05K05
750F034K05L14L15L68L68L83M64N75O23N53O35P31P31O81N67M76L61K44R8j05k83m16m97o13
748A2812o62o28o27n82n82n76n77n05m24l26k77k96k96l04k55j85j04r7j45j62j62j21j21
746D798j21j21j43j42r4r3j15j15o6o6m8m9m9m9J9J8l1l0r3r4j2j2j%j%m0m1m0m0k6k7k6k6
743C024j5j4j4j4nnnmk6k6K2K3KKj%k4p2m4m5j7j8j7j8NNN4N3L5L6j4j3o0o0l9J0K2K2N2M
739B801KL%jJ0J1l9l8m2m1PPO4O5M3on0m9n2n3jjK6k2j8j9k1k2o0o0oM3K7K7K8K7L8j0l2l2
$$ plain form
735 2554 2562 2570 2578 2586 2524 2461 2448 2434 2409 2383 2379 2423 2432 2441 2375 2309 2285 2309 2306 2303 2268 2234 2200 2165 2117 2068 2073 2127 2119 2110 2105 2099 2126 2153 2159 2116 2097 2079 2106 2133 2102 2072
731 2072 2090 2108 2112 2117 2121 2126 2133 2141 2145 2150 2157 2115 2098 2080 2081 2034 1986 1987 2010 2034 2079 2173 2235 2248 2244 2239 2224 2209 2149 2089 2108 2175 2243 2262 2305 2348 2416 2435 2454 2473 2537
727 2537 2602 2661 2720 2780 2839 2860 2880 2852 2824 2772 2720 2664 2609 2548 2438 2327 2266 2198 2130 2114 2098 2060 2022 1983 1945 1889 1834 1829 1872 1894 1866 1842 1866 1846
724 1846 1826 1805 1785 1794 1754 1696 1638 1583 1577 1592 1607 1561 1516 1470 1424 1401 1378 1404 1430 1414 1399 1428 1458 1522 1537 1466 1395 1399 1404 1409 1414 1429 1444 1459 1474 1445 1415 1385
720 1385 1356 1378 1399 1421 1443 1425 1407 1441 1475 1482 1538 1563 1589 1666 1694 1674 1702 1764 1825 1890 1954 2031 2108 2163 2170 2145 2121 2143 2164 2197 2229 2286 2294 2238 2133 2024
717 2024 1965 1904 1842 1784 1725 1672 1618 1565 1512 1480 1449 1446 1393 1319 1244 1220 1245 1245 1245 1273 1301 1283 1264 1267 1270 1255 1191 1127 1111 1100 1088 1079 1070 1082 1094 1105 1117 1097
713 1097 1077 1058 1038 1032 1026 1027 978 942 955 986 1017 1035 1052 1070 1087 1084 1082 1079 1077 1065 1053 1041 1030 1008 986 1010 1034 1053 1023 969 963 996 1030 1041 1053 1076 1099 1073 1047
710 1047 1022 997 972 947 924 902 926 949 973 948 902 856 861 865 893 922 942 961 981 1001 990 979 1023 1018 964 959 974 1038 1092 1098 1133 1169 1220 1270 1369 1468 1533
$$ packed form
735B554QQQQo2o3j3j4k5k6mM4RRo6o6k4K4lll5l4l4l5m8m9NN4qrnoK7K7Om3j9j8K7K7l1l0
731B072J8J8MNMNPQMNPm2j7j8Jm7m8JK3K4M5R4O2J3mnj5j5o0o0J9O7O8J9M3M3O8J9J9J9O4
727B537O5N9N9O0N9K1K0k8k8n2n2n6n5o1j10j11o1o8o8j6j6l8l8l9l8n6n5nM3K2k8k4K4k0
724A846k0k1k0Rm0n8n8n5oJ5J5m6m5m6m6k3k3K6K6j6j5K9L0O4J5p1p1MNNNJ5J5J5J5k9l0l0
720A385k9K2K1K2K2j8j8L4L4PN6K5K6P7K8k0K8O2O1O5O4P7P7N5Pk5k4K2K1L3L2N7Qn6j05j09
717B024n9o1o2n8n9n3n4n3n3l2l1ln3p4p5k4K5%%K8K8j8j9LLj5o4o4j6j1j2rrJ2J2J1J2k0
713A097k0j9k0ooJm9l6J3L1L1J8J7J8J7lklkj2j2j2j1k2k2K4K4J9l0n4oL3L4J1J2K3K3k6k6
710A047k5k5k5k5k3k2K4K3K4k5m6m6NMK8K9K0J9K0K0j1j1M4nn4nJ5O4N4OL5L6N1N0R9R9O5
$$ plain form
706 1533 1599 1688 1777 1867 1956 1965 1973 1954 1935 1894 1854 1844 1883 1975 2068 2135 2201 2322 2491 2671 2851 3034 3217 3414 3612 3783 3905 4039 4093 4009
703 4009 3812 3564 3317 3116 2964 2826 2688 2505 2370 2314 2307 2300 2341 2421 2550 2736 2921 3146 3370 3554 3656 3707 3678 3496 3232 2956
701 2956 2762 2630 2498 2412 2327 2265 2204 2162 2121 2057 2042 2078 2195 2346 2448 2527 2607 2659 2663 2629 2547 2403 2210 2030 1850 1688 1576 1488 1400
698 1400 1368 1386 1400 1414 1379 1393 1451 1509 1521 1533 1587 1641 1641 1593 1543 1493 1465 1437 1333 1230 1180 1179 1165 1152 1116 1081 1080 1079 1059 991 951 960 987 1014 1031 1049
695 1049 1090 1132 1093 1055 1062 1069 1092 1067 1045 1023 1018 1013 1030 1046 1060 1026 970 914 888 862 884 906 899 892 934 975 994 1013 1032 1051 1038 1025 1040 1006 981 956 1006 1056
691 1056 1089 1074 1038 1002 973 944 963 983 975 968 933 946 942 937 935 934 952 971 990 1008 1028 1047 1066 1086 1072 1058 1043 1029 983 936 910 933 969 1004 997 990 963 984 1027
688 1027 1070 1093 1116 1090 1064 1056 1049 1041 1034 1014 994 972 949 932 866 849 880 915 949 984 1019 1058 1048 1035 1071 1079 1037 999 1010 1020 1030 1043 1056 1099 1143 1137 1132 1197
684 1197 1261 1304 1299 1276 1254 1201 1196 1232 1268 1258 1248 1245 1243 1240 1237 1238 1239 1240 1240 1275 1309 1340 1372 1441 1462 1461 1460 1451 1441 1387 1334 1341 1429 1517 1524 1496 1468 1436 1403 1364 1324 1334
$$ packed form
706A533O6Q9Q9R0Q9RQj9j9m1m0j0L9R2R3O7O6J21J69J80J80J83J83J97J98J71J22J34N4q4
703D009j97k48k47k01j52j38j38j83j35n6ppM1Q0J29J86J85K25K24J84J02N1k9j82k64k76
701B956j94j32j32q6q5o2o1m2m1o4j5L6J17J51J02P9Q0N2Ml4q2j44j93j80j80j62j12q8q8
698A400l2J8J4J4l5J4N8N8J2J2N4N4%m8n0n0k8k8j04j03n0jj4j3l6l5jjk0o8m0RK7K7J7J8
695A049M1M2l9l8PPK3k5k2k2nnJ7J6J4l4n6n6k6k6K2K2ppM2M1J9J9J9J9j3j3J5l4k5k5N0N0
691A056L3j5l6l6k9k9J9K0qpl5J3mnkjJ8J9J9J8K0J9J9K0j4j4j5j4m6m7k6K3L6L5ppk7K1M3
688A027M3K3K3k6k6qpqpk0k0k2k3j7o6j7L1L5L4L5L5L9j0j3L6Qm2l8J1J0J0J3J3M3M4onO5
684A197O4M3nk3k2n3nL6L6j0j0lkllJJJ%L5L4L1L2O9K1jjrj0n4n3PQ8Q8Pk8k8l2l3l9m0J0
$$ plain form
680 1334 1343 1383 1423 1490 1509 1529 1550 1595 1592 1560 1528 1538 1549 1534 1470 1433 1397 1359 1321 1365 1409 1418 1428 1441 1454 1478 1551 1624 1648 1623 1598 1573 1547 1486 1473 1513
677 1513 1554 1560 1566 1571 1577 1534 1491 1502 1562 1608 1654 1649 1595 1572 1549 1526 1503 1498 1541 1507 1474 1484 1493 1506 1518 1520 1571 1622 1624 1577 1529 1500 1519 1546 1572 1553 1534 1546 1557
673 1557 1569 1580 1614 1649 1708 1718 1684 1602 1517 1481 1513 1545 1549 1603 1644 1637 1660 1683 1661 1640 1619 1598 1565 1531 1547 1562 1558 1555 1600 1645 1653 1662 1670 1679 1662 1645 1628 1611 1607
669 1607 1602 1597 1593 1596 1599 1605 1612 1651 1739 1819 1899 1931 1882 1830 1778 1777 1776 1754 1732 1744 1805 1863 1921 1981 2040 2047 2004 1983 1962 1969 1927 1879 1879 1931 1982 1969 1956 1946 1937 1916 1944
665 1944 1970 1995 2045 2095 2127 2110 2038 2015 2040 2065 2077 2041 2007 1974 1965 1957 2000 2043 2055 2115 2148 2181 2182 2182 2183 2184 2206 2228 2226 2223 2206 2188 2219 2250 2247 2243 2215 2187 2196 2205 2214
662 2214 2223 2240 2257 2274 2290 2332 2375 2417 2459 2478 2497 2468 2439 2388 2337 2314 2291 2277 2313 2345 2377 2428 2479 2505 2531 2531 2531 2556 2580 2578 2576 2574 2572 2619 2666 2633 2599 2583
658 2583 2566 2526 2485 2524 2564 2552 2492 2430 2417 2454 2492 2514 2535 2557 2579 2599 2620 2641 2661 2643 2624 2605 2587 2589 2590 2592 2594 2623 2652 2682 2711 2750 2790 2783 2777 2756 2784 2860
654 2860 2888 2859 2830 2795 2808 2854 2899 2924 2948 2973 2998 3001 3005 3001 3046 3063 3080 3081 3081 3127 3173 3208 3194 3158 3123 3114 3105 3177 3249 3258 3267 3249 3280 3349 3418 3490 3562 3610 3658
$$ packed form
680A334RM0M0O7J9K0K1M5ll2l2J0J1j5o4l7l6l8l8M4M4RJ0J3J3K4P3P3K4k5k5k5k6o1j3M0
677A513M1OONOm3m3J1O0M6M6nn4k3k3k3k3nM3l4l3J0RJ3J2KN1N1Km7m8k9J9K7K6j9j9J2J1
673A557J2J1L4L5N9J0l4q2q5l6L2L2MN4M1pK3K3k2k1k1k1l3l4J6J5mlM5M5QRQRj7j7j7j7m
669A607nnmLLOPL9Q8Q0Q0L2m9n2n2jjk2k2J2O1N8N8O0N9Pm3k1k1Pm2m8%N2N1j3j3j0rk1K8
665A944K6K5N0N0L2j7p2k3K5K5J2l6l4l3rqM3M3J2O0L3L3J%JJK2K2klj7j8L1L1lmk8k8RRR
662B214RJ7J7J7J6M2M3M2M2J9J9k9k9n1n1k3k3j4L6L2L2N1N1K6K6%%K5K4kkkkM7M7l3l4j6
658B583j7m0m1L9M0j2o0o2j3L7L8K2K1K2K2K0K1K1K0j8j9j9j8KJKKK9K9L0K9L9M0pok1K8P6
654B860K8k9k9l5J3M6M5K5K4K5K5LMmM5J7J7J%M6M6L5j4l6l5rrP2P2RRj8L1O9O9P2P2M8M8
$$ plain form
651 3658 3706 3754 3785 3816 3875 3885 3907 3929 3923 3918 3861 3805 3800 3795 3830 3912 4054 4245 4477 4710 4949 5187 5470 5802 6133 6465 6827 7238 7731 8223
648 8223 8609 8914 9085 9076 8912 8666 8484 8414 8522 8809 9172 9617 10169 10803 11548 12406 13422 14520 15616 16712 17688 18484 19052
646 19052 19311 19315 19319 19519 20060 21038 22552 24650 27511 31360 36427 42860 50867 60640 72214 85351 99251 112567 123822
644 123822 131613 134778 132866 126522 117259 106972 97262 89094 82891 78716 76547 76374 78254 82326 88840 98162 110847
642 110847 127509 148561 173981 202359 230688 255335 273115 281058 276908 261102 237553 211691 187696 167595
641 167595 152023 140808 133504 129740 129271 132148 138580 148987 163923 184249 210694 243542 281665 321283 356892
640 356892 383505 396986 393580 371846 335915 294286 254510 220561 193420 172560 157027 145958 138696 134826
638 134826 134189 136782 142804 152575 166453 184601 206494 230319 252795 270319 280057 279616 267439 244760 216177
$$ packed form
651C658M8M8L1L1N9J0K2K2onn7n6nnL5Q2J42J91K32K33K39K38K83L32L31L32L62M11M93M92
648H223L86L05J71rj64k46j82p0J08K87L63M45N52O34P45Q58J016J098J096J096R76P96N68
646A9052K59MMK00N41R78J514K098K861L849N067O433Q007R773J1574J3137J3900J3316J1255
644A23822P791L165j912o344r263j0287r710q168o203m175k169j73J880M072O514R322J2685
642A10847J6662K1052K5420K8378K8329K4647J7780P943m150j5806k3549k5862k3995k0101
641A67595j5572j1215p304l764m69K877O432J0407J4936K0326K6445L2848L8123L9618L5609
640C56892K6613J3481l406k1734l5931m1629l9776l3949k7141k0860j5533j1069p262l870
638A34826o37K593O022R771J3878J8148K1893K3825K2476J7524R738m41j2177k2679k8583
$$ plain form
637 216177 187189 161478 140328 123679 111007 101564 94702 89942 87146 86195 87046 89699 94220 100575 108473 117256
635 117256 125829 132787 136742 136659 131950 122831 110580 97123 84202 72814 63262 55465 49146 43982 39678 36027 32913
634 32913 30220 27900 25950 24309 22926 21785 20819 19998 19290 18696 18228 17760 17298 16837 16430 16022 15663 15305 14971 14637 14254
632 14254 13872 13437 13003 12541 12128 11819 11510 11176 10891 10660 10429 10287 10194 10067 9941 9817 9694 9614 9534 9454 9374 9285 9197 9108 9020 8911
629 8911 8802 8693 8585 8484 8384 8284 8184 8104 8024 7944 7864 7814 7764 7713 7663 7628 7593 7561 7529 7485 7491 7514 7538 7507 7427 7347 7315 7290 7265 7243 7221 7229
626 7229 7237 7200 7163 7119 7123 7149 7175 7169 7163 7140 7067 7049 7079 7079 7079 7064 7049 7077 7106 7089 6991 6893 6876 6905 6934 6965 6996 7014 6984 6953 6972 7010 7049 7041 7034 6985 6936 6936 6935 6941
622 6941 6947 7029 7111 7175 7159 7139 7119 7158 7196 7185 7175 7117 7059 7023 7035 7017 7000 6986 6971 7004 7036 7069 7101 7123 7145 7119 7092 7035 6979 7035 7092 7135 7177 7220 7262
619 7262 7291 7320 7350 7379 7363 7348 7333 7317 7281 7245 7213 7182 7113 7124 7171 7218 7232 7246 7260 7274 7302 7330 7407 7483 7453 7422 7391 7360 7376 7393 7410 7426 7459 7491 7524
$$ packed form
637B16177k8988k5711k1150j6649j2672r443o862m760k796r51Q51K653M521O355P898Q783
635A17256Q573O958L955q3m709r119j2251j3457j2921j1388r552p797o319n164m304l651l114
634C2913k693k320j950j641j383j141r66q21p08n94m68m68m62m61m07m08l59l58l34l34l83
632A4254l82m35m34m62m13l09l09l34k85k31k31j42r3j27j26j24j23q0q0q0q0q9q8q9q8j09
629H911j09j09j08j01j00j00j00q0q0q0q0n0n0n1n0l5l5l2l2m4OK3K4l1q0q0l2k5k5k2k2Q
626G229Ql7l7m4MK6K6ook3p3j8L0%%j5j5K8K9j7r8r8j7K9K9L1L1J8l0l1J9L8L9qpm9m9%jO
622F941OQ2Q2O4j6k0k0L9L8j1j0n8n8l6J2j8j7j4j5L3L2L3L2K2K2k6k7n7n6N6N7M3M2M3M2
619G262K9K9L0K9j6j5j5j6l6l6l2l1o9J1M7M7J4J4J4J4K8K8P7P6l0l1l1l1J6J7J7J6L3L2L3
$$ plain form
616 7524 7556 7589 7621 7654 7686 7681 7676 7671 7665 7653 7640 7677 7713 7717 7721 7725 7729 7781 7833 7884 7936 7934 7932 7931 7929 7939 7949 7960 7970 7978 7986 7994 8001 8009 8017 8025 8032 8043 8055 8066 8077 8108 8139 8171 8202
612 8202 8238 8274 8310 8346 8367 8389 8362 8335 8345 8356 8415 8474 8499 8525 8550 8576 8617 8659 8652 8645 8637 8629 8702 8775 8849 8922 8947 8971 8992 9013 9033 9054 9043 9033 9023 9013 9031
608 9031 9049 9067 9085 9090 9095 9100 9106 9126 9146 9167 9187 9265 9344 9340 9337 9331 9325 9400 9476 9548 9621 9645 9670 9681 9693 9705 9717 9767 9817 9867 9917 9933 9949 9966 9982 10029 10076 10043 10009
604 10009 10002 9996 10038 10080 10153 10226 10250 10274 10281 10288 10295 10302 10330 10357 10466 10575 10640 10704 10687 10670 10715 10761 10806 10852 10867 10882 10897 10912 10907 10902 10946 10990 11035 11080 11125 11169 11189
601 11189 11209 11229 11249 11282 11314 11346 11378 11441 11503 11566 11628 11655 11681 11707 11733 11794 11855 11916 11977 12009 12042 12074 12107 12140 12173 12206 12240 12243 12245 12297 12349 12440 12532 12575 12618
598 12618 12652 12686 12720 12753 12843 12933 12974 13016 13056 13096 13136 13176 13195 13214 13233 13252 13299 13346 13394 13441 13503 13565 13627 13689 13775 13861 13861 13813 13819 13825 13832 13838 13851 13913 13993 14074 14125
594 14125 14127 14156 14186 14233 14280 14323 14367 14435 14454 14452 14449 14443 14437 14430 14424 14469 14515 14557 14599 14648 14649 14676 14704 14720 14735 14750 14766 14781 14796 14812 14827 14848 14869 14863 14905 15013 15120 15144
591 15144 15120 15192 15264 15279 15246 15271 15297 15298 15250 15260 15270 15330 15439 15493 15546 15602 15659 15683 15708 15732 15757 15782 15808 15882 15956 16010 16064 16118 16172 16193 16214 16235 16255 16251 16247
$$ packed form
616G524L2L3L2L3L2nnnoj2j3L7L6MMMMN2N2N1N2kkjkJ0J0J1J0QQQPQQQPJ1J2J1J1L1L1L2L1
612H202L6L6L6L6K1K2k7k7J0J1N9N9K5K6K5K6M1M2ppqqP3P3P4P3K5K4K1K1K0K1j1j0j0j0J8
608I031J8J8J8NNNOK0K0K1K0P8P9mlooP5P6P2P3K4K5J1J2J2J2N0N0N0N0J6J6J7J6M7M7l3l4
604A0009poM2M2P3P3K4K4PPPPK8K7J09J09O5O4j7j7M5M6M5M6J5J5J5J5nnM4M4M5M5M5M4K0
601A1189K0K0K0L3L2L2L2O3O2O3O2K7K6K6K6O1O1O1O1L2L3L2L3L3L3L3L4LKN2N2R1R2M3M3
598A2618L4L4L4L3R0R0M1M2M0M0M0M0J9J9J9J9M7M7M8M7O2O2O2O2Q6Q6%m8OOPOJ3O2Q0Q1N1
594A4125KK9L0M7M7M3M4O8J9kloopoM5M6M2M2M9JK7K8J6J5J5J6J5J5J6J5K1K1oM2J08J07K4
591A5144k4P2P2J5l3K5K6Jm8J0J0O0J09N4N3N6N7K4K5K4K5K5K6P4P4N4N4N4N4K1K1K1K0mm
$$ plain form
587 16247 16243 16239 16208 16177 16194 16212 16273 16334 16392 16449 16453 16407 16407 16456 16508 16512 16518 16574 16632 16690 16703 16716 16729 16742 16803 16865 16892 16919 16992 17065 17051 16989 16957 17007 17077 17146 17221
584 17221 17296 17331 17367 17402 17438 17501 17564 17578 17592 17624 17656 17689 17721 17799 17878 17957 18036 18102 18169 18186 18204 18234 18264 18342 18421 18525 18629 18733 18837 18929 19021 19113
581 19113 19205 19270 19335 19351 19367 19380 19392 19404 19416 19404 19391 19459 19528 19590 19652 19796 19939 20099 20258 20417 20576 20803 21029 21249 21388 21459 21481 21445 21408
578 21408 21323 21237 21201 21164 21201 21238 21280 21322 21356 21471 21654 21838 22031 22224 22466 22756 23072 23307 23452 23516 23463 23328 23153 22978 22844 22711 22658
575 22658 22606 22603 22600 22679 22757 22855 22952 23050 23148 23277 23406 23646 23885 24122 24310 24454 24517 24508 24450 24333 24215 24123 24030 24051 24072 24140 24208 24276 24344 24448 24552
572 24552 24655 24759 24872 24985 25098 25211 25290 25369 25424 25478 25478 25477 25433 25389 25395 25483 25606 25729 25821 25913 25981 26048 26076 26103 26085 26148 26247 26347 26403 26458 26542
570 26542 26625 26708 26791 26860 26928 26996 27064 27122 27179 27261 27343 27439 27535 27679 27824 27945 28065 28137 28209 28267 28325 28432 28538 28615 28691 28767 28843 28930 29016 29103 29190
567 29190 29304 29419 29534 29649 29738 29827 29916 30005 30147 30289 30431 30572 30643 30713 30784 30854 30940 31026 31112 31197 31346 31495 31563 31631 31745 31860 31972 32084
$$ packed form
587A6247mml1l1J7J8O1O1N8N7Mm6%M9N2MON6N8N8J3J3J3J3O1O2K7K7P3P3j4o2l2N0P0O9P5
584A7221P5L5L6L5L6O3O3J4J4L2L2L3L2P8P9P9P9O6O7J7J8L0L0P8P9J04J04J04J04R2R2R2
581A9113R2O5O5J6J6J3J2J2J2j2j3O8O9O2O2J44J43J60J59J59J59K27K26K20J39P1K2l6l7
578B1408q5q6l6l7L7L7M2M2L4J15J83J84J93J93K42K90L16K35J45O4n3j35j75j75j34j33n3
575B2658n2llP9P8R8R7R8R8J29J29K40K39K37J88J44O3rn8j17j18r2r3K1K1O8O8O8O8J04J04
572B4552J03J04J13J13J13J13P9P9N5N4%jm4m4OQ8J23J23R2R2O8O7K8K7j8O3R9J00N6N5Q4
570B6542Q3Q3Q3O9O8O8O8N8N7Q2Q2R6R6J44J45J21J20P2P2N8N8J07J06P7P6P6P6Q7Q6Q7Q7
567B9190J14J15J15J15Q9Q9Q9Q9J42J42J42J41P1P0P1P0Q6Q6Q6Q5J49J49O8O8J14J15J12J12
$$ plain form
564 32084 32204 32275 32349 32504 32672 32792 32895 32998 33110 33222 33334 33446 33568 33691 33814 33936 34048 34159 34292 34425 34567 34659 34783 34987
562 34987 35189 35390 35548 35706 35812 35918 36048 36178 36341 36505 36668 36831 36985 37139 37293 37447 37600 37754 37932 38109 38275 38442 38559
560 38559 38676 38819 38961 39152 39343 39521 39698 39892 40135 40379 40542 40675 40856 41053 41202 41354 41555 41760 41966 42175 42383 42567 42752
557 42752 42954 43206 43454 43654 43885 44115 44343 44570 44798 45025 45248 45471 45648 45825 46038 46300 46535 46770 47030 47290 47547 47804 48132
555 48132 48412 48638 48864 49174 49485 49771 50057 50329 50600 50897 51193 51440 51688 52012 52287 52546 52805 53115 53474 53807 54139 54426 54713
553 54713 55002 55291 55629 55967 56301 56636 56922 57208 57515 57821 58176 58531 58892 59254 59570 59885 60164 60492 60842 61191 61526 61862 62198
551 62198 62533 62881 63229 63623 64016 64413 64761 65137 65512 65887 66263 66638 67014 67401 67788 68175 68562 68994 69425 69857 70289 70731 71174
549 71174 71616 72059 72522 72985 73448 73910 74361 74812 75232 75702 76243 76735 77227 77769 78283 78749 79246 79742 80283 80825 81366 81907 82409
$$ packed form
564C2084J20P1P4J55J68J20J03J03J12J12J12J12J22J23J23J22J12J11J33J33J42R2J24K04
562C4987K02K01J58J58J06J06J30J30J63J64J63J63J54J54J54J54J53J54J78J77J66J67J17
560C8559J17J43J42J91J91J78J77J94K43K44J63J33J81J97J49J52K01K05K06K09K08J84J85
557D2752K02K52K48K00K31K30K28K27K28K27K23K23J77J77K13K62K35K35K60K60K57K57L28
555D8132K80K26K26L10L11K86K86K72K71K97K96K47K48L24K75K59K59L10L59L33L32K87K87
553E4713K89K89L38L38L34L35K86K86L07L06L55L55L61L62L16L15K79L28L50L49L35L36L36
551F2198L35L48L48L94L93L97L48L76L75L75L76L75L76L87L87L87L87M32M31M32M32M42M43
549G1174M42M43M63M63M63M62M51M51M20M70N41M92M92N42N14M66M97M96N41N42N41N41N02
$$ plain form
547 82409 82912 83467 84021 84551 85130 85730 86331 86887 87444 88081 88719 89354 89988 90623 91257 91872 92487 93151 93814 94494 95173 95901 96629
544 96629 97378 98128 98901 99675 100420 101165 101858 102599 103420 104242 105090 105939 106827 107716 108629 109542 110472 111403 112311 113268 114262 115337 116417
542 116417 117498 118528 119557 120583 121658 122780 123902 125000 126147 127321 128495 129730 131015 132314 133694 135062 136429
541 136429 137796 139243 140727 142210 143710 145211 146732 148302 149904 151506 153136 154814 156529 158292 160145 161998 163906
539 163906 165815 167759 169784 171896 174008 176125 178291 180511 182779 185110 187489 189915 192340 194789 197351 200002 202701
537 202701 205437 208222 211085 213998 216926 219936 223030 226206 229429 232652 235955 239371 242905 246438 250046 253702 257395
536 257395 261186 265070 269052 273104 277204 281338 285472 289664 293855 298112 302466 306879 311292 315710 320129 324467 328805
534 328805 333112 337420 341672 345925 350088 354153 358176 362101 365868 369538 373029 376358 379590 382660 385589 388289 390806
$$ packed form
547H2409N03N55N54N30N79O00O01N56N57O37O38O35O34O35O34O15O15O64O63O80O79P28P28
544I6629P49P50P73P74P45P45O93P41Q21Q22Q48Q49Q88Q89R13R13R30R31R08R57R94J075J080
542A16417J081J030J029J026J075J122J122J098J147J174J174J235J285J299J380J368J367
541A36429J367J447J484J483J500J501J521J570J602J602J630J678J715J763J853J853J908
539A63906J909J944K025K112K112K117K166K220K268K331K379K426K425K449K562K651K699
537B02701K736K785K863K913K928L010L094L176L223L223L303L416L534L533L608L656L693
536B57395L791L884L982M052M100M134M134M192M191M257M354M413M413M418M419M338M338
534C28805M307M308M252M253M163M065M023L925L767L670L491L329L232L070K929K700K517
$$ plain form
533 390806 393159 395335 397283 399083 400720 402212 403541 404738 405838 406825 407648 408336 408926 409402 409780 410067 410306 410517 410728 410868
531 410868 411007 411122 411237 411350 411463 411606 411750 411919 412187 412519 412850 413222 413690 414250 414810 415429 416048 416723 417559 418469 419379 420350 421322
528 421322 422276 423280 424347 425512 426658 427805 428957 430110 431248 432386 433465 434494 435491 436390 437215 437993 438651 439213 439631
527 439631 439887 439991 439932 439760 439425 438885 438183 437270 436194 434978 433600 432016 430268 428419 426472 424346 422059 419694 417232
525 417232 414652 411974 409219 406367 403510 400603 397638 394673 391705 388737 385802 382867 379967 377148 374391 371633 368932
523 368932 366231 363610 361037 358480 356003 353618 351347 349136 346973 344878 342782 340761 338821 336961 335150 333440 331779
522 331779 330178 328658 327185 325761 324414 323116 321862 320689 319632 318574 317500 316508 315581 314654 313813 312972 312203 311434 310745
520 310745 310057 309337 308616 307920 307224 306613 306003 305417 304832 304269 303707 303120 302533 301928 301323 300742 300161 299591 299021 298472 297842 297133 296425
$$ packed form
533C90806K353K176J948J800J637J492J329J197J100R87Q23O88N90M76L78K87K39K11K11J40
531D10868J39J15J15J13J13J43J44J69K68L32L31L72M68N60N60O19O19O75Q36R10R10R71R72
528D21322R54J004J067J165J146J147J152J153J138J138J079J029R97Q99Q25P78O58N62M18
527D39631K56J04n9j72l35n40p02r13j076j216j378j584j748j849j947k126k287k365k462
525D17232k580k678k755k852k857k907k965k965k968k968k935k935k900k819k757k758k701
523C68932k701k621k573k557k477k385k271k211k163k095k096k021j940j860j811j710j661
522C31779j601j520j473j424j347j298j254j173j057j058j074r92r27r27q41q41p69p69o89
520C10745o88p20p21o96o96o11o10n86n85n63n62n87n87o05o05n81n81n70n70n49o30p09p08
$$ plain form
518 296425 295663 294900 294166 293432 292649 291866 290995 290125 289174 288222 287291 286360 285380 284400 283349 282298 281211 280043 278849 277655 276456
516 276456 275257 274009 272762 271433 270104 268762 267419 266028 264637 263216 261796 260351 258905 257492 256079 254617 253155
514 253155 251651 250147 248643 247139 245602 244064 242575 241086 239616 238146 236627 235108 233611 232114 230665 229217 227818
513 227818 226418 224994 223571 222208 220846 219483 218121 216806 215491 214148 212855 211604 210353 209109 207864 206667 205517
511 205517 204370 203223 202043 200944 199881 198817 197828 196839 195850 194861 193962 193064 192140 191266 190442 189666 188923 188229 187531 186881 186291
509 186291 185701 185132 184611 184117 183671 183287 182903 182497 182092 181694 181297 180948 180599 180233 179866 179443 178971 178480 177941 177375 176808 176196 175535
507 175535 174812 174041 173282 172474 171638 170803 170001 169150 168274 167447 166701 165955 165212 164469 163779 163088 162451 161863 161253 160643 160040 159518 159033
505 159033 158549 158045 157591 157195 156847 156500 156153 155854 155555 155305 155056 154768 154481 154218 153954 153725 153496 153288 153129 152970 152811 152655 152499
$$ packed form
518B96425p62p63p34p34p83p83q71q70r51r52r31r31r80r80j051j051j087j168j194j194j199
516B76456j199j248j247j329j329j342j343j391j391j421j420j445j446j413j413j462j462
514B53155j504j504j504j504j537j538j489j489j470j470j519j519j497j497j449j448j399
513B27818j400j424j423j363j362j363j362j315j315j343j293j251j251j244j245j197j150
511B05517j147j147j180j099j063j064r89r89r89r89q99q98r24q74q24p76p43o94o98o50n90
509A86291n90n69n21m94m46l84l84m06m05l98l97l49l49l66l67m23m72m91n39n66n67o12o61
507A75535p23p71p59q08q36q35q02q51q76q27p46p46p43p43o90o91o37n88o10o10o03n22m85
505A59033m84n04m54l96l48l47l47k99k99k50k49k88k87k63k64k29k29k08j59j59j59j56j56
$$ plain form
502 152499 152360 152220 152084 151948 151832 151765 151695 151626 151594 151563 151483 151403 151353 151303 151277 151251 151220 151189 151182 151176 151126 151077 151082 151135 151150 151165 151232 151299 151391 151483 151578 151673 151753
499 151753 151882 152029 152176 152316 152408 152527 152647 152700 152753 152874 153077 153299 153521 153663 153755 153853 153950 154093 154237 154385 154533 154727 154921 155122 155274
497 155274 155405 155536 155703 155869 156017 156117 156240 156413 156555 156697 156835 156973 157112 157250 157434 157618 157801 157985 158224 158463 158615 158719 158824
495 158824 158929 159112 159294 159490 159685 159880 160076 160267 160458 160650 160841 161028 161214 161449 161685 161892 162100 162308 162516 162699 162881 163067 163253
493 163253 163445 163685 163926 164118 164273 164428 164580 164731 164926 165121 165288 165504 165748 165993 166187 166332 166550 166768 166983 167198 167386 167574 167734
490 167734 167943 168164 168386 168610 168834 169013 169192 169392 169641 169918 170195 170427 170659 170853 171048 171264 171528 171804 172080 172359 172637 172905 173172
488 173172 173442 173712 173938 174212 174462 174712 174952 175241 175551 175861 176192 176522 176852 177183 177508 177833 178130 178476 178851 179226 179576 179975 180358
486 180358 180741 181099 181507 181907 182307 182710 183114 183512 183910 184332 184706 185033 185312 185566 185820 186022 186224 186378 186531 186702 186873 187025 187129
$$ packed form
502A52499j39j40j36j36j16o7p0o9l2l1q0q0n0n0k6k6l1l1pon0m9NN3J5J5O7O7R2R2R5R5Q0
499A51753J29J47J47J40R2J19J20N3N3J21K03K22K22J42R2R8R7J43J44J48J48J94J94K01J52
497A55274J31J31J67J66J48J00J23J73J42J42J38J38J39J38J84J84J83J84K39K39J52J04J05
495A58824J05J83J82J96J95J95J96J91J91J92J91J87J86K35K36K07K08K08K08J83J82J86J86
493A63253J92K40K41J92J55J55J52J51J95J95J67K16K44K45J94J45K18K18K15K15J88J88J60
490A67734K09K21K22K24K24J79J79K00K49K77K77K32K32J94J95K16K64K76K76K79K78K68K67
488A73172K70K70K26K74K50K50K40K89L10L10L31L30L30L31L25L25K97L46L75L75L50L99L83
486A80358L83L58M08M00M00M03M04L98L98M22L74L27K79K54K54K02K02J54J53J71J71J52J04
$$ plain form
484 187129 187220 187360 187551 187742 187927 188112 188273 188482 188752 189071 189366 189661 189951 190242 190581 190921 191222 191524 191826 192128 192477 192827 193225
482 193225 193623 193945 194266 194636 195006 195353 195700 196096 196491 196872 197253 197634 198016 198403 198790 199150 199558 199976 200393 200811 201229 201621 201965
480 201965 202336 202707 203150 203593 204037 204480 204890 205299 205709 206119 206550 206980 207432 207933 208420 208908 209398 209889 210385 210880 211426 212021 212607
477 212607 213145 213631 214117 214688 215259 215879 216498 217138 217778 218418 219058 219750 220443 221135 221828 222504 223180 223856 224531 225236 225941 226703 227465
475 227465 228218 228971 229800 230711 231607 232504 233430 234356 235271 236186 237060 237819 238510 239200 239946 240691 241483 242357 243290 244224 245146 246068 246990
473 246990 247913 248902 249892 250882 251871 252911 253950 254989 256028 257161 258293 259426 260558 261701 262844 263986 265129 266339
471 266339 267548 268831 270114 271384 272654 273901 275147 276456 277766 279132 280498 281904 283309 284714 286120 287520 288920
470 288920 290321 291721 293195 294669 296200 297731 299205 300678 302175 303673 305133 306593 308053 309513 311068 312623 314177
$$ packed form
484A87129R1J40J91J91J85J85J61K09K70L19K95K95K90K91L39L40L01L02L02L02L49L50L98
482A93225L98L22L21L70L70L47L47L96L95L81L81L81L82L87L87L60M08M18M17M18M18L92L44
480B01965L71L71M43M43M44M43M10M09M10M10M31M30M52N01M87M88M90M91M96M95N46N95N86
477B12607N38M86M86N71N71O20O19O40O40O40O40O92O93O92O93O76O76O76O75P05P05P62P62
475B27465P53P53Q29R11Q96Q97R26R26R15R15Q74P59O91O90P46P45P92Q74R33R34R22R22R22
473B46990R23R89R90R90R89J040J039J039J039J133J132J133J132J143J143J142J143J210
471B66339J209J283J283J270J270J247J246J309J310J366J366J406J405J405J406J400J400
470B88920J401J400J474J474J531J531J474J473J497J498J460J460J460J460J555J555J554
$$ plain form
468 314177 315732 317194 318655 320117 321578 323024 324470 325916 327361 328832 330303 331717 333130 334573 336016 337426 338755
467 338755 340009 341181 342353 343525 344681 345837 346903 347970 348944 349919 350894 351788 352662 353455 354183 354912 355578 356245 356839 357432
465 357432 357960 358488 358954 359419 359841 360182 360462 360743 361016 361289 361565 361841 362209 362624 362964 363207 363257 363080 362558 361679 360668 359755 358951
462 358951 358245 357618 357089 356535 355981 355497 355014 354555 354096 353604 353112 352563 352014 351490 350966 350442 349918 349455 348993 348506 348019 347506 346993
460 346993 346586 346178 345849 345520 345247 344975 344686 344398 344182 343966 343801 343635 343542 343449 343351 343254 343197 343140 343194 343247 343358 343468 343630 343793 343995
458 343995 344198 344438 344679 344976 345273 345619 345965 346368 346771 347191 347611 348066 348520 348974 349331 349629 349878 350113 350298 350508 350719 350964 351209
456 351209 351435 351662 351899 352233 352588 352943 353396 353898 354429 355057 355775 356590 357430 358367 359396 360523 361817 363209 364680 366199 367787
454 367787 369471 371249 373123 375063 377051 379093 381183 383323 385462 387680 389898 392205 394513 396881 399249 401641 404034
$$ packed form
468C14177J555J462J461J462J461J446J446J446J445J471J471J414J413J443J443J410J329
467C38755J254J172J172J172J156J156J066J067R74R75R75Q94Q74P93P28P29O66O67N94N93
465C57432N28N28M66M65M22L41K80K81K73K73K76K76L68M15L40K43N0j77n22q79j011r13q04
462C58951p06o27n29n54n54m84m83m59m59m92m92n49n49n24n24n24n24m63m62m87m87n13n13
460C46993m07m08l29l29k73k72k89k88k16k16j65j66r3r3r8r7n7n7N4N3J11J10J62J63K02
458C43995K03K40K41K97K97L46L46M03M03M20M20M55M54M54L57K98K49K35J85K10K11K45K45
456C51209K26K27K37L34L55L55M53N02N31O28P18Q15Q40R37J029J127J294J392J471J519J588
454C67787J684J778J874J940J988K042K090K140K139K218K218K307K308K368K368K392K393
$$ plain form
452 404034 406442 408850 411299 413748 416260 418772 421344 423917 426523 429178 431882 434666 437558 440564 443720 447087 450731
451 450731 454684 458958 463605 468704 474210 480182 486592 493423 500660 508370 516583 525311 534543 544300 554690 565812 577663
449 577663 590312 603854 618373 633913 650487 668180 687175 707581 729404 752802 778009 805148 834406 865920
448 865920 899917 936657 976447 1019597 1066406 1117289 1172634 1232930 1298771 1370765 1449631 1536078 1630823 1734706
446 1734706 1848390 1972252 2106470 2250801 2404337 2565455 2731483 2898566 3061851 3215412 3352666
445 3352666 3466917 3552067 3603338 3617892 3595223 3537252 3448064 3333373 3199770 3054007 2902384 2750125
444 2750125 2601422 2459315 2325730 2201681 2087614 1983554 1889119 1803745 1726698 1657175 1594486 1537883
443 1537883 1486685 1440272 1398063 1359487 1324141 1291664 1261735 1234061 1208416 1184620 1162496 1141873 1122630 1104666
$$ packed form
452D04034K408K408K449K449K512K512K572K573K606K655K704K784K892L006L156L367L644
451D50731L953M274M647N099N506N972O410O831P237P710Q213Q728R232R757J0390J1122J1851
449E77663J2649J3542J4519J5540J6574J7693J8995K0406K1823K3398K5207K7139K9258L1514
448H65920L3997L6740L9790M3150M6809N0883N5345O0296O5841P1994P8866Q6447R4745J03883
446A734706J13684J23862J34218J44331J53536J61118J66028J67083J63285J53561J37254
445C352666J14251Q5150N1271J4554k2669n7971q9188j14691j33603j45763j51623j52259
444B750125j48703j42107j33585j24049j14067j04060r4435q5374p7047o9523o2689n6603
443A537883n1198m6413m2209l8576l5346l2477k9929k7674k5645k3796k2124k0623j9243j7964
$$ plain form
442 1104666 1087821 1072029 1057259 1043417 1030435 1018297 1006954 996312 986367 977090 968479 960553 953228 946506 940416
440 940416 934966 930149 925896 922146 918859 916011 913673 911774 910292 909248 908583 908274 908442 909097 910269 911928 914094 916747
439 916747 919954 923713 927999 932773 938047 943743 949878 956435 963398 970718 978351 986275 994500 1003017 1011709 1020563 1029477
437 1029477 1038489 1047521 1056505 1065384 1074101 1082607 1090819 1098679 1106117 1113056 1119443 1125194 1130329 1134734 1138391 1141274 1143346
435 1143346 1144569 1144980 1144580 1143498 1141686 1139127 1135845 1131945 1127442 1122386 1116805 1110737 1104230 1097431 1090358 1083057 1075579
434 1075579 1068004 1060360 1052716 1045049 1037431 1029888 1022507 1015270 1008195 1001378 994789 988476 982390 976552 971007 965770 960826
432 960826 956092 951716 947680 943937 940517 937455 934693 932223 930025 928055 926360 924957 923769 922809 921990 921399 920949 920596
430 920596 920353 920160 920016 919873 919649 919424 919156 918839 918384 917766 917006 916019 914752 913258 911524 909434 906974 904157 900922 897265
$$ packed form
442A104666j6845j5792j4770j3842j2982j2138j1343j0642r945r277q611p926p325o722o090
440I40416n450m817m253l750l287k848k338j899j482j044o65l09J68O55J172J659K166K653
439I16747L207L759M286M774N274N696O135O557O963P320P633P924Q225Q517Q692Q854Q914
437A029477R012R032Q984Q879Q717Q506Q212P860P438O939O387N751N135M405L657K883K072
435A143346J223M11m00j082j812k559l282l900m503n056n581o068o507o799p073p301p478
434A075579p575p644p644p667p618p543p381p237p075o817o589o313o086n838n545n237m944
432I60826m734m376m036l743l420l062k762k470k198j970j695j403j188r60q19n91m50l53
430I20596k43j93j44j43k24k25k68l17m55o18p60r87j267j494j734k090k460k817l235l657
$$ plain form
429 897265 893142 888662 883783 878548 872883 866795 860350 853613 846526 839148 831542 823644 815503 807200 798789 790232 781563
427 781563 772846 764097 755348 746656 738014 729454 721008 712679 704432 696359 688498 680778 673237 665937 658880 652049 645461
425 645461 639198 633210 627467 621967 616743 611796 607086 602555 598175 593908 589728 585548 581316 576971 572450 567654 562534
424 562534 557074 551310 545302 539008 532471 525817 519164 512549 506016 499612 493354 487286 481428 475775 470366 465162 460169
422 460169 455423 450856 446435 442225 438220 434394 430732 427183 423753 420468 417333 414344 411465 408700 405985 403319 400764
421 400764 398356 396043 393779 391615 389564 387566 385617 383750 381965 380250 378583 376979 375489 374096 372752 371412 370121
419 370121 368935 367798 366691 365584 364522 363542 362640 361786 360963 360221 359588 358955 358349 357824 357372 356969 356587 356205 355861 355599 355319
417 355319 355038 354766 354575 354415 354254 354128 354002 353963 354006 354084 354163 354342 354522 354816 355109 355557 356004 356503 357003 357563 358171 358835 359612 360454
$$ packed form
429H97265m123m480m879n235n665o088o445o737p087p378p606p898q141q303q411q557q669
427G81563q717q749q749q692q642q560q446q329q247q073p861p720p541p300p057o831o588
425F45461o263n988n743n500n224m947m710m531m380m267m180m180m232m345m521m796n120
424E62534n460n764o008o294o537o654o653o615o533o404o258o068n858n653n409n204m993
422D60169m746m567m421m210m005l826l662l549l430l285l135k989k879k765k715k666k555
421D00764k408k313k264k164k051j998j949j867j785j715j667j604j490j393j344j340j291
419C70121j186j137j107j107j062r80r02q54q23p42o33o33o06n25m52m03l82l82l44k62k80
417C55319k81k72j91j60j61j26j26l9M3P8P9J79J80K94K93M48M47M99N00N60O08O64P77Q42
$$ plain form
415 360454 361297 362195 363093 363989 364884 365801 366718 367658 368549 369433 370431 371537 372724 374022 375434 376945 378506 380101 381810 383610
413 383610 385492 387449 389406 391335 393263 395156 396968 398740 400512 402305 404147 406059 408053 410143 412315 414623 417044
411 417044 419575 422252 425095 428052 431145 434352 437679 441185 444868 448697 452666 456813 461068 465469 470006 474625 479288
410 479288 483951 488617 493282 497972 502663 507372 512082 516738 521345 525973 530601 535247 539942 544622 549303 554055 558887
408 558887 563796 568705 573655 578686 583715 588745 593775 598805 603821 608756 613664 618491 623229 627886 632446 636859 641114
406 641114 645223 649186 652971 656528 659908 663177 666236 669108 671834 674426 676871 679189 681360 683407 685372 687283 689194
405 689194 691075 692956 694844 696732 698602 700473 702410 704461 706603 708858 711229 713715 716316 719063 721982 725081 728355
403 728355 731841 735527 739424 743487 747762 752333 757179 762235 767469 772967 778676 784542 790685 797108 803774 810700 817870
$$ packed form
415C60454Q43Q98Q98Q96Q95R17R17R40Q91Q84R98J106J187J298J412J511J561J595J709J800
413C83610J882J957J957J929J928J893J812J772J772J793J842J912J994K090K172K308K421
411D17044K531K677K843K957L093L207L327L506L683L829L969M147M255M401M537M619M663
410D79288M663M666M665M690M691M709M710M656M607M628M628M646M695M680M681M752M832
408E58887M909M909M950N031N029N030N030N030N016M935M908M827M738M657M560M413M255
406F41114M109L963L785L557L380L269L059K872K726K592K445K318K171K047J965J911J911
405F89194J881J881J888J888J870J871J937K051K142K255K371K486K601K747K919L099L274
403G28355L486L686L897M063M275M571M846N056N234N498N709N866O143O423O666O926P170
$$ plain form
402 817870 825251 832844 840626 848621 856777 865047 873420 881907 890522 899251 908067 916964 926011 935237 944692 954390 964381
400 964381 974746 985527 996746 1008360 1020446 1033111 1046378 1060147 1074484 1089387 1104794 1120763 1137429 1154819
399 1154819 1172938 1191798 1211454 1232022 1253581 1276239 1300018 1325049 1351492 1379437 1408956 1440186 1473283 1508397
397 1508397 1545638 1585088 1626859 1671059 1717873 1767487 1820039 1875704 1934729 1997378 2063971 2134851 2210422 2291169
396 2291169 2377582 2470175 2569408 2675621 2789155 2910026 3037893 3172009 3311045 3453032 3595198 3733990
395 3733990 3865234 3984262 4086360 4167075 4222710 4250940 4250875 4223299 4170578 4096395 4005346 3902387 3792495
394 3792495 3680191 3569300 3462904 3363278 3272054 3190229 3118305 3056590 3005042 2963445 2931524 2909068 2895860
392 2895860 2891628 2896172 2909467 2931438 2962093 3001458 3049507 3106122 3170967 3243398 3322467 3406748 3494161 3582027
$$ packed form
402H17870P381P593P782P995Q156Q270Q373Q487Q615Q729Q816Q897R047R226R455R698R991
400I64381J0365J0781J1219J1614J2086J2665J3267J3769J4337J4903J5407J5969J6666J7390
399A154819J8119J8860J9656K0568K1559K2658K3779K5031K6443K7945K9519L1230L3097L5114
397A508397L7241L9450M1771M4200M6814M9614N2552N5665N9025O2649O6593P0880P5571Q0747
396B291169Q6413R2593R9233J06213J13534J20871J27867J34116J39036J41987J42166J38792
395C733990J31244J19028J02098Q0715N5635K8230o5k7576n2721p4183r1049j02959j09892
394C792495j12304j10891j06396r9626r1224q1825p1924o1715n1548m1597l1921k2456j3208
392B895860m232M544J3295K1971L0655L9365M8049N6615O4845P2431P9069Q4281Q7413Q7866
$$ plain form
391 3582027 3667117 3745706 3813825 3867703 3904066 3920490 3915796 3890138 3845082 3783331 3708350 3623902 3533723 3441149
390 3441149 3348950 3259260 3173482 3092464 3016690 2946222 2880770 2819965 2763396 2710572 2660977 2614202 2569781 2527389
388 2527389 2486669 2447370 2409385 2372602 2336971 2302344 2268771 2236366 2205113 2175055 2146280 2118779 2092592 2067747
387 2067747 2044216 2021974 2000982 1981185 1962476 1944735 1927886 1911843 1896434 1881535 1867043 1852924 1839081 1825436
386 1825436 1812003 1798755 1785653 1772695 1759916 1747275 1734714 1722288 1710008 1697862 1685830 1673938 1662224 1650782
384 1650782 1639649 1628905 1618600 1608838 1599645 1591007 1582938 1575552 1568930 1563062 1557925 1553624 1550120 1547400 1545509 1544425
383 1544425 1544071 1544410 1545381 1546897 1548851 1551159 1553711 1556326 1558942 1561403 1563554 1565236 1566349 1566790 1566468 1565301 1563273 1560358
381 1560358 1556550 1551810 1546177 1539656 1532274 1524062 1515055 1505299 1494877 1483835 1472160 1459902 1447142 1433888 1420196
$$ packed form
391C582027Q5090P8589O8119N3878L6363J6424m694k5658m5056o1751p4981q4448r0179r2574
390C441149r2199q9690q5778q1018p5774p0468o5452o0805n6569n2824m9595m6775m4421m2392
388B527389m0720l9299l7985l6783l5631l4627l3573l2405l1253l0058k8775k7501k6187k4845
387B067747k3531k2242k0992j9797j8709j7741j6849j6043j5409j4899j4492j4119j3843j3645
386A825436j3433j3248j3102j2958j2779j2641j2561j2426j2280j2146j2032j1892j1714j1442
384A650782j1133j0744j0305r762r193q638q069p386o622n868n137m301l504k720j891j084
383A544425l54L39R71J516J954K308K552K615K616K461K151J682J113M41l22j167k028k915
381A560358l808m740n633o521p382q212r007r756j0422j1042j1675j2258j2760j3254j3692
$$ plain form
380 1420196 1406163 1391789 1377111 1362157 1346989 1331709 1316299 1300808 1285319 1269912 1254597 1239428 1224376 1209501
379 1209501 1194863 1180502 1166442 1152626 1139032 1125681 1112642 1099945 1087606 1075674 1064210 1053184 1042614 1032515
377 1032515 1022888 1013764 1005217 997238 989788 982875 976477 970583 965192 960337 956032 952230 948914 946038 943606 941580 940007
376 940007 938904 938216 937933 938040 938487 939258 940304 941610 943127 944869 946758 948756 950802 952858 954833 956693 958373 959768
374 959768 960822 961476 961626 961235 960275 958660 956314 953283 949618 945256 940163 934355 927914 920840 913100 904748 895827 886338
372 886338 876379 865985 855218 844175 832856 821291 809548 797728 785826 773904 762063 750313 738645 727104
371 727104 715710 704479 693395 682523 671895 661508 651331 641387 631718 622335 613228 604375 595766 587371 579188
369 579188 571291 563637 556172 548950 541940 535109 528474 522018 515708 509544 503544 497691 492020 486496 481136 475922 470827
$$ packed form
380A420196j4033j4374j4678j4954j5168j5280j5410j5491j5489j5407j5315j5169j5052j4875
379A209501j4638j4361j4060j3816j3594j3351j3039j2697j2339j1932j1464j1026j0570j0099
377A032515r627r124q547p979p450o913o398n894n391m855m305l802l316k876k432k026j573
376I40007j103o88k83J07M47P71J046J306J517J742J889J998K046K056J975J860J680J395
374I59768J054O54J50l91r60j615k346l031l665m362n093n808o441p074p740q352q921r489
372H86338r959j0394j0767j1043j1319j1565j1743j1820j1902j1922j1841j1750j1668j1541
371G27104j1394j1231j1084j0872j0628j0387j0177r944r669r383r107q853q609q395q183
369E79188p897p654p465p222p010o831o635o456o310o164o000n853n671n524n360n214n095
$$ plain form
368 470827 465912 461170 456575 452068 447673 443425 439323 435319 431428 427653 423960 420371 416879 413436 410089 406851 403710
366 403710 400678 397695 394771 391943 389156 386466 383812 381159 378625 376091 373579 371067 368636 366206 363740 361275 358729
365 358729 356183 353647 351112 348632 346151 343736 341418 339126 336834 334571 332307 330163 328019 325885 323847 321874 319949
363 319949 318031 316114 314254 312394 310544 308790 307140 305537 303933 302426 300955 299484 298013 296640 295334 294077 292776
361 292776 291524 290329 289133 287927 286721 285540 284358 283264 282170 281076 279982 279002 278021 277089 276157 275269 274381 273553 272773
360 272773 272037 271397 270828 270307 269857 269456 269090 268820 268580 268341 268156 267970 267774 267578 267411 267342 267288 267282 267317 267450 267673 267945 268288 268680
357 268680 269138 269693 270289 270934 271675 272514 273496 274575 275747 277017 278397 279939 281591 283340 285196 287101 289074 291047 292989
356 292989 294930 296747 298402 299820 300945 301762 302221 302376 302304 302027 301523 300955 300338 299763 299285 298944 298766 298734 298864 299173 299645 300339
$$ packed form
368D70827m915m742m595m507m395m248m102m004l891l775l693l589l492l443l347l238l141
366D03710l032k983k924k828k787k690k654k653k534k534k512k512k431k430k466k465k546
365C58729k546k536k535k480k481k415k318k292k292k263k264k144k144k134k038j973j925
363C19949j918j917j860j860j850j754j650j603j604j507j471j471j471j373j306j257j301
361B92776j252j195j196j206j206j181j182j094j094j094j094r80r81r32r32q88q88q28p80
360B72773p36o40n69n21m50m01l66k70k40k39j85j86j96j96j67o9n4oL5J33K23K72L43L92
357B68680M58N55N96O45P41Q39R82J079J172J270J380J542J652J749J856J905J973J973J942
356B92989J941J817J655J418J125Q17M59J55p2k77n04n68o17n75m78l41j78l2J30L09M72O94
$$ plain form
354 300339 301196 302203 303308 304607 306068 307640 309373 311273 313335 315576 317979 320557 323297 326220 329306 332590 336102
352 336102 339853 343831 348034 352464 357138 362040 367231 372650 378373 384453 390822 397484 404458 411789 419473 427514 435957
350 435957 444823 454143 463821 473950 484500 495526 507103 519216 531816 545014 558828 573207 588268 604051
349 604051 620581 637870 655840 674541 693924 714066 734889 756388 778504 801076 824004 847163 870371 893448
348 893448 916168 938318 959657 979908 998763 1016000 1031386 1044661 1055567 1063972 1069813 1073028 1073613 1071644 1067175
346 1067175 1060437 1051654 1040977 1028710 1015063 1000345 984855 968749 952261 935610 919031 902614 886529 870867
345 870867 855761 841272 827468 814411 802148 790631 779914 770008 760969 752806 745439 738883 733111 728215 724143
344 724143 720882 718434 716797 715952 715919 716676 718181 720493 723552 727411 732146 737770 744206 751467 759606 768531 778268 788866
$$ packed form
354C00339Q57J007J105J299J461J572J733J900K062K241K403K578K740K923L086L284L512
352C36102L751L978M203M430M674M902N191N419N723O080O369O662O974P331P684Q041Q443
350D35957Q866R320R678J0129J0550J1026J1577J2113J2600J3198J3814J4379J5061J5783
349F04051J6530J7289J7970J8701J9383K0142K0823K1499K2116K2572K2928K3159K3208K3077
348H93448K2720K2150K1339K0251J8855J7237J5386J3275J0906Q405N841L215N85j969m469
346A067175o738q783j0677j2267j3647j4718j5490j6106j6488j6651j6579j6417j6085j5662
345H70867j5106j4489j3804j3057j2263j1517j0717r906r039q163p367o556n772m896m072
344G24143l261k448j637q45l3P57J505K312L059L859M735N624O436P261Q139Q925R737J0598
$$ plain form
342 788866 800211 812376 825352 839024 853313 868231 883636 899366 915324 931317 947149 962603 977441 991377
340 991377 1004242 1015743 1025588 1033514 1039329 1042829 1043829 1042212 1038029 1031245 1021962 1010283 996430 980545 962940 943866
339 943866 923525 902221 880234 857765 835004 812174 789441 766939 744795 723095 701948 681389 661447 642170
338 642170 623511 605512 588261 571694 555809 540562 525931 511886 498459 485595 473284 461431 450065 439142
336 439142 428706 418716 409213 400116 391376 382983 374948 367253 359851 352757 345956 339402 333075 327023 321264 315679 310256
335 310256 305100 300105 295229 290449 285841 281396 277064 272830 268717 264766 260983 257363 253820 250325 246944 243724 240652
333 240652 237742 234917 232190 229583 227138 224770 222500 220287 218172 216133 214143 212221 210396 208600 206804 205045 203286
332 203286 201478 199671 197852 196034 194264 192494 190757 189020 187234 185448 183698 181948 180266 178665 177104 175544 173992
$$ packed form
342G88866J1345J2165J2976J3672J4289J4918J5405J5730J5958J5993J5832J5454J4838J3936
340I91377J2865J1501R845P926N815L500J000j617m183o784r283j1679j3853j5885j7605j9074
339I43866k0341k1304k1987k2469k2761k2830k2733k2502k2144k1700k1147k0559j9942j9277
338F42170j8659j7999j7251j6567j5885j5247j4631j4045j3427j2864j2311j1853j1366j0923
336D39142j0436r990r503r097q740q393q035p695p402p094o801o554o327o052n759n585n423
335C10256n156m995m876m780m608m445m332m234m113l951l783l620l543l495l381l220l072
333B40652k910k825k727k607k445k368k270k213k115k039j990j922j825j796j796j759j759
332B03286j808j807j819j818j770j770j737j737j786j786j750j750j682j601j561j560j552
$$ plain form
330 173992 172439 170999 169608 168241 166874 165612 164399 163164 161929 160800 159753 158749 157794 156890 156035 155209 154431 153717 153002
328 153002 152291 151579 150888 150197 149506 148814 148153 147491 146772 146005 145210 144367 143429 142443 141469 140495 139545 138546 137543 136541 135586 134680
326 134680 133766 132804 131873 130941 130059 129178 128296 127414 126515 125617 124767 123917 123085 122254 121476 120747 120001 119254 118560 117865 117160 116455 115754
324 115754 115052 114345 113687 113002 112317 111638 110959 110283 109606 108981 108404 107849 107294 106738 106181 105597 105062 104541 104020 103499 102978 102448 101869
322 101869 101318 100766 100226 99686 99146 98606 98086 97567 97050 96533 96040 95596 95125 94653 94194 93735 93275 92816 92428 92040 91603 91166 90801
320 90801 90437 90090 89792 89448 89055 88693 88330 87968 87606 87243 86881 86500 86120 85742 85365 84983 84650 84371 84092 83790 83487 83212 82888
317 82888 82536 82184 81829 81474 81127 80780 80433 80086 79742 79399 79055 78711 78395 78078 77807 77537 77266 76946 76654 76362 76058 75754 75450
315 75450 75146 74830 74514 74200 73887 73563 73287 72987 72686 72398 72159 71892 71625 71299 70973 70650 70327 70026 69774 69544 69313 69135 68958
$$ packed form
330A73992j553j440j391j367j367j262j213j235j235j129j047j004r55r04q55q26p78p14p15
328A53002p11p12o91o91o91o92o61o62p19p67p95q43r38r86r74r74r50r99j003j002r55r06
326A34680r14r62r31r32q82q81q82q82q99q98q50q50q32q31p78p29p46p47o94o95p05p05p01
324A15754p02p07o58o85o85o79o79o76o77o25n77n55n55n56n57n84n35n21n21n21n21n30n79
322A01869n51n52n40n40n40n40n20n19n17n17m93m44m71m72m59m59m60m59l88l88m37m37l65
320I0801l64l47k98l44l93l62l63l62l62l63l62l81l80l78l77l82l33k79k79l02l03k75l24
317H2888l52l52l55l55l47l47l47l47l44l43l44l44l16l17k71k70k71l20k92k92l04l04l04
315G5450l04l16l16l14l13l24k76l00l01k88k39k67k67l26l26l23l23l01k52k30k31j78j77
$$ plain form
313 68958 68777 68597 68376 68106 67836 67615 67369 67124 66899 66724 66568 66364 66163 66011 65818 65626 65437 65248 65089 64931 64726 64522 64308
311 64308 64143 63999 63855 63668 63482 63341 63200 63035 62821 62608 62443 62303 62164 62027 61890 61723 61556 61389 61221 61086 60950 60817 60684
309 60684 60561 60485 60432 60378 60310 60242 60227 60262 60319 60377 60440 60504 60540 60625 60728 60750 60741 60733 60716 60699 60650 60552 60395 60189 59907 59624 59295 58966 58738 58592
306 58592 58401 58209 58004 57800 57620 57440 57287 57135 57032 56928 56846 56763 56681 56598 56525 56452 56427 56402 56401 56400 56480 56559 56671 56783 56919 57055 57224 57393
303 57393 57616 57839 58096 58435 58813 59306 59871 60484 61164 61893 62682 63471 64284 65048 65792 66422 66939 67310 67508 67495 67326 67011 66569
301 66569 66014 65491 65016 64581 64228 64022 63963 63986 63960 63882 63690 63380 62956 62382 61629 60794 59959 59140 58369 57637 56987 56431 55955 55536
299 55536 55167 54861 54604 54389 54175 54012 53849 53748 53648 53628 53608 53534 53459 53433 53408 53408 53409 53459 53508 53631 53753 53900 54047 54278 54509 54769 55030
296 55030 55325 55701 56204 56853 57614 58553 59737 61198 62947 65036 67451 70141 72913 75507 77661 79116 79675 79308 78083
$$ packed form
313F8958j81j80k21k70k70k21k46k45k25j75j56k04k01j52j93j92j89j89j59j58k05k04k14
311F4308j65j44j44j87j86j41j41j65k14k13j65j40j39j37j37j67j67j67j68j35j36j33j33
309F0684j23p6n3n4o8o8j5L5N7N8O3O4L6Q5J03K2rqj7j7m9r8j57k06k82k83l29l29k28j46
306E8592j91j92k05k04j80j80j53j52j03j04q2q3q2q3p3p3k5k5jjQ0P9J12J12J36J36J69J69
303E7393K23K23K57L39L78M93N65O13O80P29P89P89Q13P64P44O30N17L71J98j3j69l15m42
301F6569n55n23m75m35l53k06n9K3k6p8j92l10m24n74p53q35q35q19p71p32o50n56m76m19
299E5536l69l06k57k15k14j63j63j01j00k0k0p4p5k6k5%JN0M9J23J22J47J47K31K31K60K61
296E5030K95L76N03O49P61R39J184J461J749K089K415K690K772K594K154J455N59l67j225
$$ plain form
294 78083 76063 73491 70707 68038 65644 63571 61838 60404 59214 58232 57396 56708 56134 55627 55169 54771 54373 54029 53684 53337
293 53337 52989 52673 52308 51922 51536 51156 50777 50400 50023 49635 49295 49009 48722 48469 48215 48010 47805 47656 47507 47440 47372 47338 47305 47249 47194
290 47194 47206 47267 47300 47333 47346 47360 47376 47344 47283 47222 47263 47385 47586 47867 48197 48576 49006 49484 50085 50800 51612 52424 53283 54142 54948 55608 56143
288 56143 56532 56756 56768 56566 56152 55566 54899 54132 53283 52424 51564 50740 49997 49302 48688 48158 47676 47258 46922 46694 46516 46381 46247
285 46247 46137 46076 46074 46073 46075 46076 46052 46028 46052 46077 46091 46105 46095 46085 46030 45975 45944 45914 45941 45968 45974 45931 45867 45802 45759 45717 45628 45539 45405 45271 45150 45079 45028 44978 44980
282 44980 44982 44902 44823 44771 44720 44554 44389 44216 44044 43874 43705 43586 43516 43467 43418 43376 43333 43339 43345 43343 43342 43338 43334 43372 43362 43330 43299 43304 43308 43313 43318 43338 43358 43377 43397 43404 43412
279 43412 43440 43518 43606 43694 43785 43877 43959 44041 44041 44042 44041 44040 44088 44135 44171 44206 44242 44277 44303 44329 44383 44387 44318 44249 44176 44104 44033 43962 43888 43814 43770 43677 43565 43535 43519 43504
275 43504 43445 43386 43282 43179 43124 43069 43058 43047 43033 43019 42956 42843 42807 42771 42713 42654 42596 42538 42522 42506 42491 42475 42410 42346 42330 42314 42290 42267 42217 42215 42261 42307 42335
$$ packed form
294G8083k020k572k784k669k394k073j733j434j190r82q36o88n74n07m58l98l98l44l45l47
293E3337l48l16l65l86l86l80l79l77l77l88l40k86k87k53k54k05k05j49j49o7o8l4l3n6n5
290D7194J2O1L3L3J3J4J6l2o1o1M1J22K01K81L30L79M30M78O01P15Q12Q12Q59Q59Q06O60N35
288E6143L89K24J2k02m14n86o67p67q49q59q60q24p43o95o14n30m82m18l36k28j78j35j34
285D6247j10o1kjKJk4k4K4K5J4J4j0j0n5n5l1l0K7K7Om3o4o5m3m2q9q9j34j34j21p1n1n0K
282D4980Kq0p9n2n1j66j65j73j72j70j69j19p0m9m9m2m3OOkjmmL8j0l2l1NMNNK0K0J9K0PQ
279D3412K8P8Q8Q8R1R2Q2Q2%JjjM8M7L6L5L6L5K6K6N4Mo9o9p3p2p1p1p4p4m4r3j12l0j6j5
275D3504n9n9j04j03n5n5j1j1j4j4o3j13l6l6n8n9n8n8j6j6j5j6o5o4j6j6k4k3n0kM6M6K8
$$ plain form
272 42335 42314 42335 42357 42375 42394 42385 42376 42365 42353 42335 42269 42203 42185 42198 42210 42223 42236 42239 42194 42176 42159 42132 42106 42080 42054 42032 42010 42008 42054 42113 42147 42183 42243 42279 42291 42319
269 42319 42346 42373 42401 42460 42544 42578 42563 42551 42587 42639 42715 42759 42755 42770 42785 42769 42803 42865 42927 42944 42960 43004 43048 43091 43133 43194 43231 43254 43325 43383 43441 43454 43466 43444 43422
265 43422 43400 43378 43381 43384 43388 43391 43350 43309 43269 43228 43253 43278 43222 43166 43135 43104 43074 43043 43055 43067 43051 43084 43110 43136 43165 43194 43213 43231 43218 43180 43163 43194 43212 43205 43226 43271 43314
262 43314 43333 43335 43337 43338 43338 43416 43494 43523 43552 43592 43632 43624 43616 43625 43633 43661 43736 43796 43806 43798 43790 43757 43724 43691 43658 43644 43631 43618 43605 43631 43657 43638 43619 43610 43650 43660 43669 43693 43668 43590
258 43590 43462 43404 43426 43476 43477 43448 43419 43386 43354 43377 43400 43422 43445 43407 43369 43331 43293 43292 43291 43291 43290 43289 43289 43288 43287 43296 43304 43312 43320 43333 43345 43279 43213 43183 43202 43239 43276 43299 43273 43247
254 43247 43269 43303 43336 43324 43312 43282 43253 43226 43200 43207 43263 43292 43321 43341 43360 43380 43400 43406 43412 43419 43425 43425 43424 43469 43514 43583 43603 43620 43686 43676 43618 43594 43650 43692 43734 43782 43829 43852
251 43852 43874 43946 44018 44057 44096 44136 44175 44235 44295 44403 44512 44557 44601 44649 44697 44710 44772 44837 44854 44828 44851 44925 44999 45045 45092 45219 45347 45403 45460 45516 45572 45679
248 45679 45786 45815 45844 45893 45990 46087 46135 46156 46177 46198 46219 46255 46339 46423 46458 46477 46495 46559 46622 46692 46762 46832 46901 47017 47132 47194 47207 47244 47281 47318 47355 47409 47512
$$ packed form
272D2335k1K1K2J8J9rrj1j2j8o6o6j8J3J2J3J3Lm5j8j7k7k6k6k6k2k2kM6N9L4L6O0L6J2K8
269D2319K7K7K8N9Q4L4j5j2L6N2P6M4mJ5J5j6L4O2O2J7J6M4M4M3M2O1L7K3P1N8N8J3J2k2k2
265D3422k2k2LLMLm1m1m0m1K5K5n6n6l1l1l0l1J2J2j6L3K6K6K9K9J9J8j3l8j7L1J8pK1M5M3
262D3314J9KKJ%P8P8K9K9M0M0qqRQK8P5O0J0qql3l3l3l3j4j3j3j3K6K6j9j9rM0J0RK4k5p8
258D3590j28n8K2N0Jk9k9l3l2K3K3K2K3l8l8l8l8jj%jj%jjRQQQJ3J2o6o6l0J9L7L7K3k6k6
254D3247K2L4L3j2j2l0k9k7k6PN6K9K9K0J9K0K0OOPO%jM5M5O9K0J7O6j0n8k4N6M2M2M8M7K3
251D3852K2P2P2L9L9M0L9O0O0J08J09M5M4M8M8J3O2O5J7k6K3P4P4M6M7J27J28N6N7N6N6J07
248D5679J07K9K9M9R7R7M8K1K1K1K1L6Q4Q4L5J9J8O4O3P0P0P0O9J16J15O2J3L7L7L7L7N4J03
$$ plain form
245 47512 47588 47663 47755 47847 47891 47934 47955 47976 47970 48013 48069 48125 48181 48237 48320 48353 48366 48378 48424 48470 48515 48561 48624 48687 48669 48651 48653 48656 48708 48759 48796 48832 48868 48905 48950 48995
241 48995 48991 48987 49011 49034 49061 49088 49139 49239 49339 49390 49406 49422 49407 49441 49506 49571 49639 49707 49743 49779 49846 49864 49846 49877 49878 49878 49970 50062 50105 50148 50211 50275 50338 50401 50450
238 50450 50498 50465 50432 50454 50475 50542 50609 50699 50741 50780 50867 50965 51014 51045 51076 51119 51162 51205 51249 51316 51384 51451 51518 51574 51629 51712 51746 51790 51833 51923 52012 52046 52080 52116
235 52116 52153 52212 52319 52399 52478 52541 52604 52666 52729 52822 52916 53009 53102 53176 53249 53322 53395 53509 53623 53737 53851 53965 54079 54193 54306 54450 54594 54738
232 54738 54881 55034 55187 55289 55342 55394 55494 55613 55731 55836 55940 56045 56149 56233 56317 56422 56576 56698 56820 56946 57071 57209 57347 57533
230 57533 57719 57866 58013 58159 58306 58465 58624 58783 58942 59094 59245 59397 59549 59698 59847 60075 60302 60473 60595 60698 60802 60973 61192
228 61192 61461 61680 61820 61959 62126 62374 62627 62798 62971 63144 63347 63550 63780 63961 64095 64229 64413 64647 64863 65079 65271 65511 65741
225 65741 65971 66174 66425 66685 66897 67061 67225 67448 67720 67964 68208 68471 68733 68996 69258 69488 69717 69919 70169 70457 70744 71013 71233
$$ packed form
245D7512P6P5R2R2M4M3K1K1oM3N6N6N6N6Q3L3J3J2M6M6M5M6O3O3j8j8KLN2N1L7L6L6L7M5M5
241D8995mmK4K3K7K7N1J00J00N1J6J6j5L4O5O5O8O8L6L6O7J8j8L1J%R2R2M3M3O3O4O3O3M9
238E0450M8l3l3K2K1O7O7R0M2L9Q7R8M9L1L1M3M3M3M4O7O8O7O7N6N5Q3L4M4M3R0Q9L4L4L6
235E2116L7N9J07Q0P9O3O3O2O3R3R4R3R3P4P3P3P3J14J14J14J14J14J14J14J13J44J44J44
232E4738J43J53J53J02N3N2J00J19J18J05J04J05J04Q4Q4J05J54J22J22J26J25J38J38J86
230E7533J86J47J47J46J47J59J59J59J59J52J51J52J52J49J49K28K27J71J22J03J04J71K19
228F1192K69K19J40J39J67K48K53J71J73J73K03K03K30J81J34J34J84K34K16K16J92K40K30
225F5741K30K03K51K60K12J64J64K23K72K44K44K63K62K63K62K30K29K02K50K88K87K69K20
$$ plain form
223 71233 71460 71686 71932 72225 72490 72754 73021 73289 73590 73892 74193 74495 74779 75063 75350 75637 75926 76264 76623 76982 77285 77589 77892
221 77892 78195 78588 78980 79351 79674 80023 80372 80718 81063 81426 81789 82125 82509 82889 83269 83622 84023 84447 84822 85227 85633 86036 86440
219 86440 86892 87344 87793 88242 88692 89141 89557 89973 90410 90895 91343 91791 92215 92687 93172 93657 94144 94632 95128 95624 96121 96617 97141
217 97141 97665 98140 98615 99120 99625 100132 100640 101170 101749 102301 102852 103401 103949 104498 105047 105661 106276 106890 107505 108046 108588 109183 109827
215 109827 110492 111156 111823 112491 113169 113847 114528 115209 115894 116628 117416 118203 118989 119774 120560 121346 122144 122943 123828 124762 125673 126585 127499
212 127499 128414 129326 130239 131202 132214 133214 134165 135164 136277 137398 138519 139601 140684 141795 142955 144137 145318 146541 147764
211 147764 149036 150308 151613 152917 154225 155614 157078 158542 160032 161572 163144 164717 166299 167962 169679 171444 173277
209 173277 175158 177058 179007 181017 183028 185070 187193 189364 191584 193894 196319 198803 201287 203859 206546 209294 212090
$$ packed form
223G1233K27K26K46K93K65K64K67K68L01L02L01L02K84K84K87K87K89L38L59L59L03L04L03
221G7892L03L93L92L71L23L49L49L46L45L63L63L36L84L80L80L53M01M24L75M05M06M03M04
219H6440M52M52M49M49M50M49M16M16M37M85M48M48M24M72M85M85M87M88M96M96M97M96N24
217I7141N24M75M75N05N05N07N08N30N79N52N51N49N48N49N49O14O15O14O15N41N42N95O44
215A09827O65O64O67O68O78O78O81O81O85P34P88P87P86P85P86P86P98P99Q85R34R11R12R14
212A27499R15R12R13R63J012J000R51R99J113J121J121J082J083J111J160J182J181J223J223
211A47764J272J272J305J304J308J389J464J464J490J540J572J573J582J663J717J765J833
209A73277J881J900J949K010K011K042K123K171K220K310K425K484K484K572K687K748K796
$$ plain form
207 212090 215003 218029 221119 224257 227415 230655 234030 237584 241240 244944 248705 252547 256521 260576 264712 268962 273301
206 273301 277755 282270 286785 291387 296069 300872 305755 310612 315469 320247 325024 329833 334592 339272 343870 348350 352717
204 352717 356968 361074 364978 368671 372167 375453 378491 381220 383660 385856 387804 389444 390765 391843 392725 393396 393793 393947
203 393947 393900 393674 393294 392833 392226 391474 390630 389705 388735 387717 386693 385718 384772 383826 382911 381996 381169 380390 379722 379135 378646 378239
200 378239 377897 377636 377440 377325 377339 377500 377773 378191 378706 379303 379926 380630 381474 382431 383426 384421 385504 386587 387696 388805 389908
198 389908 391012 392105 393116 394018 394805 395452 395952 396292 396421 396330 396028 395490 394644 393522 392222 390688 388846 386666 384210 381477
197 381477 378500 375297 371851 368229 364396 360367 356160 351837 347433 342990 338466 333864 329214 324486 319759 315050 310390
195 310390 305748 301106 296538 292051 287614 283225 278887 274630 270485 266421 262404 258500 254682 250945 247289 243747 240313
$$ packed form
207B12090K913L026L090L138L158L240L375L554L656L704L761L842L974M055M136M250M339
206B73301M454M515M515M602M682M803M883M857M857M778M777M809M759M680M598M480M367
204C52717M251M106L904L693L496L286L038K729K440K196J948J640J321J078Q82O71L97J54
203C93947m7k26l80m61o07p52q44r25r70j018j024r75r46r46r15r15q27p79o68n87m89m07
200C78239l42k61j96j15J4J61K73M18N15N97O23P04Q44R57R95R95J083J083J109J109J103
198C89908J104J093J011R02P87O47N00L40J29r1l02n38q46j122j300j534j842k180k456k733
197C81477k977l203l446l622l833m029m207m323m404m443m524m602m650m728m727m709m660
195C10390m642m642m568m487m437m389m338m257m145m064m017l904l818l737l656l542l434
$$ plain form
193 240313 236959 233657 230403 227238 224121 221121 218201 215369 212650 210006 207442 204943 202443 200008 197621 195310 193081
192 193081 190909 188818 186792 184766 182784 180883 179009 177184 175405 173707 172059 170412 168826 167289 165823 164406 163046
190 163046 161685 160365 159044 157775 156506 155297 154136 153004 151922 150840 149808 148775 147743 146741 145740 144790 143840 142961
188 142961 142132 141323 140515 139716 138918 138201 137484 136795 136106 135418 134729 134077 133424 132793 132211 131585 130959 130357 129804 129233 128662 128142 127622
186 127622 127140 126658 126179 125700 125145 124639 124219 123799 123359 122919 122480 122040 121663 121287 120892 120448 119998 119597 119214 118831 118498 118165 117829
184 117829 117493 117158 116775 116419 116064 115725 115386 115048 114709 114394 114079 113736 113442 113200 112957 112696 112386 112081 111776 111492 111208 110961 110713
182 110713 110442 110170 109869 109568 109286 109052 108807 108514 108202 107891 107586 107282 107026 106770 106512 106253 105976 105650 105331 105060 104805 104549 104244
180 104244 103890 103563 103237 102877 102516 102205 101893 101561 101228 100920 100612 100313 100013 99714 99414 99031 98648 98265 97882 97574 97266 96986 96657
$$ packed form
193B40313l354l302l254l165l117l000k920k832k719k644k564k499k500k435k387k311k229
192A93081k172k091k026k026j982j901j874j825j779j698j648j647j586j537j466j417j360
190A63046j361j320j321j269j269j209j161j132j082j082j032j033j032j002j001r50r50q79
188A42961q29q09q08p99p98p17p17o89o89o88o89o52o53o31n82o26o26o02n53n71n71n20n20
186A27622m82m82m79m79n55n06m20m20m40m40m39m40l77l76l95m44m50m01l83l83l33l33l36
184A17829l36l35l83l56l55l39l39l38l39l15l15l43k94k42k43k61l10l05l05k84k84k47k48
182A10713k71k72l01l01k82k34k45k93l12l11l05l04k56k56k58k59k77l26l19k71k55k56l05
180A04244l54l27l26l60l61l11l12l32l33l08l08k99l00k99l00l83l83l83l83l08l08k80l29
$$ plain form
178 96657 96289 95920 95597 95274 94980 94686 94343 94000 93654 93308 92980 92701 92413 92075 91720 91364 91028 90693 90381 90070 89734 89399 89064
175 89064 88729 88395 88061 87727 87394 87067 86740 86414 86087 85805 85523 85220 84868 84509 84150 83789 83427 83090 82754 82417 82081 81718 81356
173 81356 80993 80631 80280 79930 79580 79229 78897 78565 78233 77901 77579 77258 76936 76615 76278 75940 75579 75217 74876 74536 74241 73947 73660
171 73660 73325 72944 72644 72337 71981 71657 71334 71034 70734 70483 70232 69998 69765 69507 69249 68935 68620 68324 68077 67817 67507 67183 66940
169 66940 66721 66503 66265 66027 65807 65587 65319 65050 64785 64520 64336 64152 63907 63662 63420 63178 62953 62775 62598 62372 62135 61898 61658
167 61658 61418 61211 61004 60843 60681 60539 60347 60102 59857 59609 59361 59141 58920 58661 58451 58262 58073 57929 57784 57615 57447 57309 57171
165 57171 56983 56746 56564 56432 56296 56112 55935 55759 55552 55394 55289 55183 55108 54985 54798 54611 54394 54226 54097 53968 53842 53716 53591
162 53591 53467 53315 53212 53148 53084 52996 52907 52843 52730 52595 52461 52356 52251 52147 52042 51946 51851 51755 51659 51555 51451 51346 51242 51186 51129 51024 50918
$$ packed form
178I6657l68l69l23l23k94k94l43l43l46l46l28k79k88l38l55l56l36l35l12l11l36l35l35
175H9064l35l34l34l34l33l27l27l26l27k82k82l03l52l59l59l61l62l37l36l37l36l63l62
173H1356l63l62l51l50l50l51l32l32l32l32l22l21l22l21l37l38l61l62l41l40k95k94k87
171G3660l35l81l00l07l56l24l23l00l00k51k51k34k33k58k58l14l15k96k47k60l10l24k43
169F6940k19k18k38k38k20k20k68k69k65k65j84j84k45k45k42k42k25j78j77k26k37k37k40
167F1658k40k07k07j61j62j42j92k45k45k48k48k20k21k59k10j89j89j44j45j69j68j38j38
165E7171j88k37j82j32j36j84j77j76k07j58j05j06p5j23j87j87k17j68j29j29j26j26j25
162E3591j24j52j03o4o4q8q9o4j13j35j34j05j05j04j05r6r5r6r6j04j04j05j04n6n7j05j06
$$ plain form
160 50918 50775 50631 50488 50344 50270 50196 50072 49949 49842 49736 49629 49522 49349 49175 49050 48925 48805 48684 48563 48442 48325 48207 48089 47972
158 47972 47877 47782 47687 47591 47509 47426 47343 47260 47154 47048 46942 46836 46743 46649 46555 46462 46384 46307 46230 46153 46060 45968 45876 45783 45737 45691 45596 45501 45433 45366 45298 45231
155 45231 45150 45069 44988 44907 44808 44709 44658 44608 44515 44422 44280 44139 44010 43882 43835 43788 43721 43654 43587 43520 43381 43241 43102 42963 42846 42729 42612 42495
152 42495 42381 42266 42152 42038 41884 41730 41625 41520 41494 41468 41360 41253 41142 41032 40921 40810 40723 40636 40548 40461 40376 40291 40206 40121 40051 39981 39911
149 39911 39841 39822 39803 39703 39602 39548 39493 39438 39384 39278 39171 39065 38959 38870 38781 38692 38604 38610 38616 38573 38530 38451 38372 38342 38311 38257 38202 38148 38093 38042 37990 37939
146 37939 37887 37847 37806 37766 37725 37705 37685 37665 37645 37622 37599 37575 37552 37505 37457 37458 37459 37432 37405 37427 37448 37423 37398 37324 37250 37218 37185 37168 37200 37238 37195 37124 37102 37129 37156
143 37156 37186 37216 37222 37229 37235 37242 37249 37255 37262 37268 37238 37208 37178 37148 37191 37233 37275 37318 37327 37336 37345 37354 37357 37360 37412 37463 37490 37516 37494 37472 37470 37468 37515 37563 37607 37651 37646 37641 37720 37799 37877 37956 37984
139 37984 38012 38040 38068 38139 38209 38231 38253 38285 38317 38379 38523 38659 38715 38739 38764 38855 38946 39037 39128 39146 39164 39182 39200 39244 39288 39380 39472 39507 39542 39576 39611 39649 39687
$$ packed form
160E0918j43j44j43j44p4p4j24j23j07j06j07j07j73j74j25j25j20j21j21j21j17j18j18j17
158D7972r5r5r5r6q2q3q3q3j06j06j06j06r3r4r4r3p8p7p7p7r3r2r2r3m6m6r5r5o8o7o8o7
155D5231q1q1q1q1r9r9n1n0r3r3j42j41j29j28m7m7o7o7o7o7j39j40j39j39j17j17j17j17
152D2495j14j15j14j14j54j54j05j05k6k6j08j07j11j10j11j11q7q7q8q7q5q5q5q5p0p0p0
149C9911p0j9j9j00j01n4n5n5n4j06j07j06j06q9q9q9q8OOm3m3p9p9l0l1n4n5n4n5n1n2n1
146C7939n2m0m1m0m1k0k0k0k0k3k3k4k3m7m8JJk7k7K2K1k5k5p4p4l2l3j7L2L8m3p1k2K7K7
143C7156L0L0OPOPPOPOl0l0l0l0M3M2M2M3RRRRLLN2N1K7K6k2k2kkM7M8M4M4nnP9P9P8P9K8
139C7984K8K8K8P1P0K2K2L2L2O2J44J36N6K4K5R1R1R1R1J8J8J8J8M4M4R2R2L5L5L4L5L8L8
$$ plain form
136 39687 39727 39768 39796 39873 39922 39971 39995 40018 40042 40066 40102 40138 40174 40210 40217 40225 40232 40240 40252 40264 40276 40288 40273 40258 40291 40324 40340 40356 40372 40388 40407 40425 40444 40463 40494 40525
132 40525 40556 40587 40618 40649 40683 40717 40723 40776 40833 40841 40854 40915 40994 41073 41087 41101 41115 41129 41126 41123 41093 41111 41153 41196 41193 41189 41204 41220 41235 41250 41220 41189 41208 41227 41230 41233 41233 41234 41192
129 41192 41101 41011 40969 40949 40930 40913 40897 40851 40804 40731 40706 40747 40788 40751 40714 40653 40592 40549 40555 40586 40569 40501 40433 40427 40420 40413 40407 40416 40424 40433 40442 40425 40408 40391 40375 40358 40341 40325 40308
125 40308 40292 40275 40259 40243 40226 40210 40193 40177 40159 40140 40125 40110 40076 40091 40128 40164 40160 40157 40150 40143 40130 40069 40035 40001 40008 40016 40023 40031 40015 39999 39983 39967 39953 39939 39876 39814 39804 39794
122 39794 39784 39774 39797 39819 39793 39767 39704 39642 39628 39614 39583 39552 39522 39491 39454 39417 39353 39338 39319 39301 39285 39270 39275 39280 39285 39289 39257 39224 39191 39158 39207 39257 39306 39355 39445 39534
118 39534 39575 39616 39675 39734 39762 39840 39906 39923 39971 40019 40057 40095 40181 40268 40339 40409 40483 40557 40677 40845 41072 41347 41619 41890 42205 42601 43065 43610 44237
115 44237 44977 45823 46783 47926 49215 50649 52294 54140 56164 58296 60508 62745 64835 66618 68028 69000 69533 69615 69292
114 69292 68619 67671 66533 65282 63965 62598 61232 59946 58705 57513 56357 55314 54356 53399 52416 51434 50527 49621 48655 47607
$$ packed form
136C9687M0M1K8P7M9M9K4K3K4K4L6L6L6L6PQPQJ2J2J2J2j5j5L3L3J6J6J6J6J9J8J9J9L1L1
132D0525L1L1L1L1L4L4ON3N7QJ3O1P9P9J4J4J4J4lll0J8M2M3lmJ5J6J5J5l0l1J9J9LL%Jm2
129D1192r1r0m2k0j9j7j6m6m7p3k5M1M1l7l7o1o1m3OL1j7o8o8oppoRQRRj7j7j7j6j7j7j6j7
125D0308j6j7j6j6j7j6j7j6j8j9j5j5l4J5L7L6mlppj3o1l4l4PQPQj6j6j6j6j4j4o3o2j0j0
122C9794j0j0K3K2k6k6o3o2j4j4l1l1l0l1l7l7o4j5j9j8j6j5NNNMl2l3l3l3M9N0M9M9R0Q9
118C9534M1M1N9N9K8P8O6J7M8M8L8L8Q6Q7P1P0P4P4J20J68K27K75K72K71L15L96M64N45O27
115D4237P40Q46R60J143J289J434J645J846K024K132K212K237K090J783J410R72N33Q2l23
114F9292o73r48j138j251j317j367j366j286j241j192j156j043r58r57r83r82r07r06r66j048
$$ plain form
112 47607 46565 45604 44673 43822 43068 42394 41792 41238 40697 40238 39890 39543 39201 38858 38569 38279 37990 37700 37426 37153 36928 36703 36471
110 36471 36239 36007 35775 35568 35362 35155 34948 34797 34647 34496 34345 34185 34026 33915 33805 33687 33569 33451 33333 33205 33076 32948 32819
107 32819 32701 32583 32546 32509 32482 32455 32346 32238 32144 32050 31957 31863 31809 31755 31702 31648 31622 31596 31521 31446 31426 31405 31385 31365 31353 31342 31282 31222 31250 31277 31256 31235
104 31235 31180 31126 31071 31017 30953 30890 30876 30861 30840 30818 30748 30677 30605 30532 30541 30549 30536 30524 30462 30401 30344 30288 30232 30176 30142 30108 30122 30137 30123 30110 30096 30082 30027 29972 29916
101 29916 29861 29825 29789 29754 29718 29682 29646 29638 29581 29531 29481 29476 29472 29443 29414 29386 29357 29314 29270 29273 29275 29277 29229 29161 29092 29033 28974 28916 28857 28832 28806 28781 28756 28717 28679 28641 28603
98 28603 28607 28611 28567 28523 28436 28349 28280 28260 28281 28254 28209 28164 28116 28067 28019 27971 27867 27763 27660 27556 27462 27369 27248 27176 27113 27049 26989 26929 26866 26803 26771 26689 26562
94 26562 26484 26456 26429 26400 26371 26342 26314 26229 26144 26060 25975 25895 25816 25709 25650 25601 25552 25506 25460 25409 25359 25309 25259 25156 25053 24950 24847 24769 24691 24613 24535 24477
91 24477 24420 24313 24207 24148 24090 24083 24124 24106 24040 23923 23806 23686 23565 23499 23481 23475 23470 23386 23302 23235 23168 23101 23034 22944 22855 22769 22682 22596 22559 22540 22520 22476 22383
$$ packed form
112D7607j042r61r31q51p54o74o02n54n41m59l48l47l42l43k89k90k89k90k74k73k25k25k32
110C6471k32k32k32k07k06k07k07j51j50j51j51j60j59j11j10j18j18j18j18j28j29j28j29
107C2819j18j18l7l7k7k7j09j08r4r4r3r4n4n4n3n4k6k6p5p5k0k1k0k0j2j1o0o0K8K7k1k1
104C1235n5n4n5n4o4o3j4j5k1k2p0p1p2p3RQj3j2o2o1n7n6n6n6l4l4J4J5j4j3j4j4n5n5n6
101B9916n5l6l6l5l6l6l6qn7n0n0nmk9k9k8k9m3m4LKKm8o8o9n9n9n8n9k5k6k5k5l9l8l8l8
98B8603MMm4m4q7q7o9k0K1k7m5m5m8m9m8m8j04j04j03j04r4r3j21p2o3o4o0o0o3o3l2q2j27
94B6562p8k8k7k9k9k9k8q5q5q4q5q0p9j07n9m9m9m6m6n1n0n0n0j03j03j03j03p8p8p8p8n8
91B4477n7j07j06n9n8pM1j8o6j17j17j20j21o6j8onq4q4o7o7o7o7r0q9q6q7q6l7j9k0m4r3
$$ plain form
88 22383 22317 22251 22198 22146 22094 22041 21989 21936 21884 21831 21783 21734 21689 21643 21607 21619 21631 21595 21507 21419 21349 21328 21305 21282 21262 21242 21225 21208 21191 21174 21181 21187 21194 21200 21163 21126 21138
85 21138 21150 21138 21126 21113 21101 21045 20990 20953 20965 20949 20885 20851 20817 20798 20779 20757 20736 20716 20647 20609 20571 20513 20504 20515 20527 20503 20478 20481 20435 20383 20331 20324 20318 20304 20291 20277 20264
81 20264 20251 20239 20224 20209 20175 20093 20038 20064 20112 20112 20096 20079 20093 20107 20121 20134 20081 20027 20022 20017 20029 20041 20054 20066 20055 20044 20033 20022 20022 20022 19971 19872 19809 19795 19829 19863 19879
78 19879 19847 19842 19838 19796 19754 19760 19767 19742 19717 19741 19765 19762 19759 19799 19839 19854 19788 19719 19650 19595 19541 19508 19523 19547 19571 19597 19624 19612 19600 19540 19479 19483 19486 19490 19493 19515 19537 19555 19574 19592
74 19592 19562 19484 19454 19469 19484 19424 19363 19328 19341 19372 19403 19404 19357 19337 19317 19309 19301 19294 19286 19269 19252 19234 19217 19221 19224 19254 19236 19203 19170 19152 19183 19187 19141 19126 19112 19091 19069 19021 19021
70 19021 19041 19062 19040 19018 19002 19036 19039 19042 19089 19088 19033 18978 18978 18977 18977 18977 18954 18931 18908 18886 18878 18870 18907 18945 18965 18937 18933 18929 18892 18806 18768 18780 18786 18792 18799 18805 18814 18775 18763 18751 18736 18721 18706
66 18706 18691 18714 18737 18730 18771 18837 18854 18850 18846 18890 18885 18859 18834 18793 18751 18710 18669 18670 18671 18672 18673 18673 18674 18705 18688 18678 18717 18775 18832 18769 18705 18663 18670 18727 18784 18823 18814 18787 18760 18779 18797
62 18797 18823 18848 18825 18802 18836 18871 18857 18843 18852 18862 18872 18881 18854 18827 18849 18871 18912 18953 18993 19034 19022 19011 19047 19084 19091 19097 19103 19109 19108 19107 19155 19203 19237 19271 19257 19242 19224 19207 19189
$$ packed form
88B2383o6o6n3n2n2n3n2n3n2n3m8m9m5m6l6J2J2l6q8q8p0k1k3k3k0k0j7j7j7j7POPOl7l7J2
85B1138J2j2j2j3j2n6n5l7J2j6o4l4l4j9j9k2k1k0o9l8l8n8rJ1J2k4k5Lm6n2n2poj4j3j4j3
81B0264j3j2j5j5l4q2n5K6M8%j6j7J4J4J4J3n3n4nnJ2J2J3J2j1j1j1j1%%n1r9o3j4L4L4J6
78A9879l2nmm2m2OPk5k5K4K4llM0M0J5o6o9o9n5n4l3J5K4K4K6K7j2j2o0o1MLMLK2K2J8J9J8
74A9592l0p8l0J5J5o0o1l5J3L1L1Jm7k0k0qqpqj7j7j8j7MLL0j8l3l3j8L1Mm6j5j4k1k2m8%
70A9021K0K1k2k2j6L4LLM7jn5n5%j%%k3k3k3k2qqL7L8K0k8mml7q6l8J2OOPORl9j2j2j5j5j5
66A8706j5K3K3pM1O6J7mmM4nk6k5m1m2m1m1JJJJ%JL1j7j0L9N8N7o3o4m2PN7N7L9rk7k7J9J8
62A8797K6K5k3k3L4L5j4j4RJ0J0Rk7k7K2K2M1M1M0M1j2j1L6L7POOOjjM8M8L4L4j4j5j8j7j8
$$ plain form
59 19189 19172 19164 19157 19195 19234 19266 19250 19185 19168 19216 19263 19313 19364 19438 19513 19539 19565 19584 19604 19623 19643 19647 19651 19655 19660 19680 19700 19720 19741 19754 19767 19829 19890 19904 19918 19963 19959 19970
55 19970 20029 20059 20088 20117 20146 20147 20197 20248 20300 20351 20402 20433 20415 20397 20428 20434 20441 20450 20460 20502 20544 20586 20628 20671 20713 20755 20797 20826 20854 20883 20912 20916 20920 20952 20935 20913 20891 20951
52 20951 21061 21148 21236 21277 21319 21391 21463 21513 21515 21524 21533 21587 21642 21735 21828 21870 21864 21867 21918 21940 21961 22044 22127 22162 22196 22238 22280 22322 22363 22426 22488 22551 22613 22661 22708 22755 22803
48 22803 22877 22952 22978 23004 23045 23086 23127 23168 23224 23280 23309 23386 23534 23682 23765 23768 23796 23824 23896 23969 24043 24117 24191 24265 24341 24417 24493 24568 24645 24722 24848 24973 25041
45 25041 25108 25175 25242 25345 25447 25501 25555 25628 25701 25853 26004 26110 26168 26253 26338 26377 26415 26507 26647 26727 26807 26890 26973 27065 27158 27250 27343 27415 27487 27559 27631 27739
42 27739 27846 27951 28055 28161 28219 28277 28383 28500 28618 28710 28852 28960 29068 29179 29290 29393 29495 29597 29699 29800 29902 29954 30007 30117 30228
40 30228 30338 30449 30563 30676 30790 30903 31052 31200 31345 31491 31622 31704 31765 31826 31964 32101 32239 32377 32464 32551 32687 32823 32962 33101 33240
37 33240 33379 33528 33678 33778 33879 33989 34098 34208 34318 34461 34604 34775 34897 35003 35109 35261 35413 35549 35686 35823 35959 36094 36228
$$ packed form
59A9189j7qpL8L9L2j6o5j7M8M7N0N1P4P5K6K6J9K0J9K0MMMNK0K0K0K1J3J3O2O1J4J4M5mJ1
55A9970N9L0K9K9K9JN0N1N2N1N1L1j8j8L1OPRJ0M2M2M2M2M3M2M2M2K9K8K9K9MML2j7k2k2O0
52B0951J10Q7Q8M1M2P2P2N0KRRN4N5R3R3M2oLN1K2K1Q3Q3L5L4M2M2M2M1O3O2O3O2M8M7M7M8
48B2803P4P5K6K6M1M1M1M1N6N6K9P7J48J48Q3LK8K8P2P3P4P4P4P4P6P6P6P5P7P7J26J25O8
45B5041O7O7O7J03J02N4N4P3P3J52J51J06N8Q5Q5L9L8R2J40Q0Q0Q3Q3R2R3R2R3P2P2P2P2J08
42B7739J07J05J04J06N8N8J06J17J18R2J42J08J08J11J11J03J02J02J02J01J02N2N3J10J11
40C0228J10J11J14J13J14J13J49J48J45J46J31Q2O1O1J38J37J38J38Q7Q7J36J36J39J39J39
37C3240J39J49J50J00J01J10J09J10J10J43J43J71J22J06J06J52J52J36J37J37J36J35J34
$$ plain form
35 36228 36360 36492 36585 36629 36704 36859 37063 37266 37389 37462 37597 37731 37832 37982 38135 38240 38375 38510 38667 38824 39009 39145 39253 39360 39438
33 39438 39564 39720 39877 40036 40196 40313 40431 40503 40576 40660 40793 40899 41005 41119 41234 41349 41464 41542 41621 41720 41869 42005 42142 42282 42421
30 42421 42544 42666 42789 42911 43023 43135 43247 43359 43450 43541 43632 43722 43730 43737 43831 43973 44090 44207 44326 44446 44566 44686 44756 44827 44898 44969 45085 45202
28 45202 45299 45347 45372 45478 45593 45627 45634 45641 45686 45779 45876 45924 45933 45991 46019 46047 46096 46145 46194 46243 46263 46284 46304 46325 46364 46403 46442 46480 46496 46512 46554 46549 46578 46608 46635 46662
24 46662 46636 46610 46605 46649 46675 46701 46730 46759 46776 46793 46788 46735 46681 46626 46649 46673 46660 46647 46634 46621 46592 46564 46536 46507 46486 46465 46395 46325 46264 46204 46146 46088 46030 46021 46061 46052 45995
21 45995 45938 45879 45819 45761 45703 45597 45490 45406 45322 45237 45153 45099 45045 44943 44840 44741 44642 44543 44444 44363 44281 44199 44118 44031 43945 43856 43767 43655 43495 43335 43224
18 43224 43105 42987 42872 42756 42669 42583 42496 42409 42309 42209 42109 42009 41881 41753 41547 41340 41177 41062 40968 40874 40779 40683 40539 40394 40262 40130
15 40130 39998 39865 39703 39540 39426 39312 39198 39083 38969 38854 38715 38575 38435 38295 38148 38001 37854 37706 37542 37378 37213 37049 36933
$$ packed form
35C6228J32J32R3M4P5J55K04K03J23P3J35J34J01J50J53J05J35J35J57J57J85J36J08J07P8
33C9438J26J56J57J59J60J17J18P2P3Q4J33J06J06J14J15J15J15P8P9R9J49J36J37J40J39
30D2421J23J22J23J22J12J12J12J12R1R1R1R0QPR4J42J17J17J19J20J20J20P0P1P1P1J16J17
28D5202R7M8K5J06J15L4PPM5R3R7M8RN8K8K8M9M9M9M9K0K1K0K1L9L9L9L8J6J6M2nK9L0K7K7
24D6662k6k6nM4K6K6K9K9J7J7nn3n4n5K3K4j3j3j3j3k9k8k8k9k1k1p0p0o1o0n8n8n8rM0rn7
21D5995n7n9o0n8n8j06j07q4q4q5q4n4n4j02j03r9r9r9r9q1q2q2q1q7q6q9q9j12j60j60j11
18D3224j19j18j15j16q7q6q7q7j00j00j00j00j28j28k06k07j63j15r4r4r5r6j44j45j32j32
15D0130j32j33j62j63j14j14j14j15j14j15j39j40j40j40j47j47j47j48j64j64j65j64j16
$$ plain form
13 36933 36818 36625 36431 36252 36122 36045 35968 35865 35762 35610 35458 35322 35185 35000 34815 34674 34533 34392 34252 34096 33940 33784 33628 33492
11 33492 33356 33220 33085 32937 32789 32638 32487 32334 32132 31957 31783 31671 31560 31448 31336 31165 30993 30903 30812 30676 30540 30404 30268 30135
9 30135 30001 29864 29728 29576 29375 29253 29179 29072 28916 28791 28665 28497 28330 28165 28000 27839 27726 27614 27453 27297 27142 27006 26918 26804
6 26804 26691 26608 26477 26339 26202 26061 25920 25812 25703 25594 25485 25376 25266 25107 24949 24818 24687 24555 24424 24338 24251 24165 24078 23973 23867
4 23867 23805 23743 23676 23528 23347 23166 23049 22980 22884 22788 22678 22567 22457 22347 22245 22144 22043 21941 21882 21823 21713 21602 21550 21448 21293 21138 21073
2 21073 21008 20894 20781 20720 20659 20521 20382 20280 20228 20224 20172 20076 19981 19855 19778 19701 19623 19531 19390 19257 19174 19059 18945 18875 18806 18736 18666 18592 18519 18475 18383
-1 18383 18263 18192 18140 18087 18005 17923 17838 17754 17729 17657 17566 17475 17359 17292 17246 17200 17112 17023 16935 16846 16799 16752 16656 16559 16476 16392 16311 16230 16112 16042 16026 16010 15979
-5 15979 15948 15895 15794 15709 15625 15586 15547 15505 15463 15372 15282 15222 15161 15101 15041 14949 14858 14769 14680 14608 14584 14532 14481 14420 14360 14317 14324 14306 14240 14202 14163 14129 14046 13990 13935
$$ packed form
13C6933j15j93j94j79j30p7p7j03j03j52j52j36j37j85j85j41j41j41j40j56j56j56j56j36
11C3492j36j36j35j48j48j51j51j53k02j75j74j12j11j12j12j71j72r0r1j36j36j36j36j33
9C0135j34j37j36j52k01j22p4j07j56j25j26j68j67j65j65j61j13j12j61j56j55j36q8j14
6B6804j13q3j31j38j37j41j41j08j09j09j09j09j10j59j58j31j31j32j31q6q7q6q7j05j06
4B3867o2o2o7j48j81j81j17o9r6r6j10j11j10j10j02j01j01j02n9n9j10j11n2j02j55j55o5
2B1073o5j14j13o1o1j38j39j02n2mn2r6r5j26p7p7p8r2j41j33q3j15j14p0o9p0p0p4p3m4r2
-1A8383j20p1n2n3q2q2q5q4k5p2r1r1j16o7m6m6q8q9q8q9m7m7r6r7q3q4q1q1j18p0j6j6l1
-5A5979l1n3j01q5q4l9l9m2m2r1r0o0o1o0o0r2r1q9q9p2k4n2n1o1o0m3Pj8o6l8l9l4q3n6n5
$$ plain form
-8 13935 13929 13923 13876 13829 13745 13661 13631 13600 13557 13465 13404 13343 13264 13233 13206 13130 13068 13055 13011 12968 12899 12830 12761 12692 12643 12593 12544 12495 12472 12448 12425 12402 12376 12350 12286 12223
-11 12223 12191 12208 12198 12188 12163 12138 12113 12088 12008 11928 11889 11850 11832 11814 11769 11676 11577 11528 11537 11546 11496 11447 11373 11299 11259 11220 11156 11092 11051 11010 10993 10976 10944 10912 10880
-15 10880 10848 10818 10788 10758 10728 10718 10709 10699 10689 10680 10670 10660 10650 10612 10574 10536 10498 10448 10398 10348 10298 10235 10173 10111 10049 10030 10010 9991 9972 9953 9934 9915 9895 9877 9859
-18 9859 9840 9822 9822 9821 9797 9772 9681 9589 9543 9546 9537 9529 9523 9517 9504 9491 9468 9397 9344 9339 9345 9351 9322 9292 9239 9185 9179 9173 9141 9060 8979 8947 8925 8903 8901 8898 8869 8888 8943 8998 9011 8975
-22 8975 8919 8864 8805 8747 8739 8731 8682 8633 8606 8579 8551 8524 8552 8580 8584 8587 8580 8572 8555 8488 8438 8437 8405 8374 8376 8378 8343 8308 8303 8347 8337 8326 8302 8230 8145 8060 8054 8049 8044 8039 7988 7937
-26 7937 7886 7835 7818 7801 7808 7815 7803 7790 7738 7685 7690 7694 7669 7692 7744 7748 7725 7703 7697 7692 7687 7681 7672 7663 7614 7564 7564 7564 7523 7483 7433 7383 7358 7332 7292 7252 7239 7308 7375 7442 7452
-30 7452 7414 7378 7341 7302 7263 7218 7173 7131 7090 7096 7151 7203 7207 7158 7061 6988 6916 6882 6849 6818 6788 6778 6817 6828 6839 6825 6811 6846 6881 6849 6817 6827 6838 6835 6736 6664
-33 6664 6640 6652 6664 6679 6694 6726 6758 6742 6725 6667 6609 6632 6655 6661 6667 6624 6581 6578 6574 6522 6470 6445 6420 6395 6370 6390 6410 6429 6449 6415 6381 6395 6410 6463 6516 6488 6460
$$ packed form
-8A3935oom7m7q4q4l0l1m3r2o1o1p9l1k7p6o2j3m4m3o9o9o9o9m9n0m9m9k3k4k3k3k6k6o4o3
-11A2223l2J7j0j0k5k5k5k5q0q0l9l9j8j8m5r3r9m9RRn0m9p4p4m0l9o4o4m1m1j7j7l2l2l2
-15A0880l2l0l0l0l0j0rj0j0rj0j0j0l8l8l8l8n0n0n0n0o3o2o2o2j9k0j9j9j9j9j9k0j8j8
-18I859j9j8%jk4k5r1r2m6Lrqooj3j3k3p1n3nOOk9l0n3n4ool2q1q1l2k2k2klk9J9N5N5J3l6
-22H975n6n5n9n8qqm9m9k7k7k8k7K8K8MLpqj7o7n0jl2l1KKl5l5nM4j0j1k4p2q5q5onnnn1n1
-26G937n1n1j7j7PPj2j3n2n3NMk5K3N2Mk3k2onnorrm9n0%%m1m0n0n0k5k6m0m0j3O9O7O7J0
-30G452l8l6l7l9l9m5m5m2m1ON5N2Mm9r7p3p2l4l3l1l0j0L9J1J1j4j4L5L5l2l2J0J1lr9p2
-33F664k4J2J2J5J5L2L2j6j7n8n8K3K3OOm3m3lmn2n2k5k5k5k5K0K0J9K0l4l4J4J5N3N3k8k8
$$ plain form
-37 6460 6418 6376 6334 6291 6259 6227 6195 6163 6152 6142 6180 6218 6216 6214 6213 6211 6193 6175 6156 6138 6095 6051 6083 6114 6118 6025 5959 5942 5974 6005 6040 6074 6080 6087 6093 6099 6049 6000 5999 5998
-40 5998 5952 5907 5861 5815 5834 5852 5871 5889 5856 5824 5791 5759 5735 5712 5689 5665 5704 5743 5733 5724 5729 5735 5740 5746 5750 5754 5758 5763 5722 5682 5641 5601 5577 5553 5530 5506 5507 5509 5559 5610
-44 5610 5601 5592 5584 5575 5557 5539 5520 5501 5506 5487 5452 5465 5489 5464 5439 5462 5503 5495 5469 5443 5387 5331 5306 5307 5315 5274 5236 5245 5264 5283 5305 5327 5291 5254 5221 5187 5201 5262 5324
-48 5324 5338 5295 5252 5206 5160 5137 5113 5138 5163 5175 5188 5151 5115 5085 5054 5042 5079 5097 5067 5053 5063 5097 5130 5144 5109 5082 5056 5026 4997 4974 4950 4976 5001 4995 4990 4984
-51 4984 4978 4956 4933 4910 4887 4861 4835 4792 4773 4775 4727 4633 4538 4500 4544 4636 4705 4753 4802 4827 4804 4777 4750 4720 4689 4720 4750 4780 4809 4775 4718 4695 4721 4727 4733 4743 4752
-55 4752 4753 4755 4754 4754 4726 4673 4607 4589 4593 4596 4602 4609 4586 4564 4545 4526 4500 4521 4543 4517 4498 4479 4506 4533 4574 4616 4571 4477 4465 4454 4439 4425 4434 4444 4453 4463 4447 4431 4418 4406
-58 4406 4346 4335 4345 4355 4316 4277 4260 4291 4302 4313 4326 4340 4354 4367 4381 4395 4387 4379 4322 4265 4220 4176 4180 4184 4212 4241 4269 4298 4258 4217 4177 4136 4147 4157 4149 4092 4048
-62 4048 4052 4072 4091 4091 4043 3994 3994 4020 4045 4074 4102 4094 4085 4077 4068 4075 4082 4040 3998 4018 4039 4060 4081 4062 4043 4025 4006 3998 3991 3983 3975 3956 3936 3916 3896 3914 3932 3977 3973 3945 3916 3932
$$ packed form
-37F460m2m2m2m3l2l2l2l2j1j0L8L8kkjkj8j8j9j8m3m4L2L1Mr3o6j7L2L1L5L4OPOOn0m9jj
-40E998m6m5m6m6J9J8J9J8l3l2l3l2k4k3k3k4L9L9j0rNONOMMMNm1m0m1m0k4k4k3k4JKN0N1
-44E610rrqrj8j8j9j9Nj9l5J3K4k5k5K3M1qk6k6n6n6k5JQm1l8RJ9J9K2K2l6l7l3l4J4O1O2
-48E324J4m3m3m6m6k3k4K5K5J2J3l7l6l0l1j2L7J8l0j4J0L4L3J4l5k7k6l0k9k3k4K6K5ono
-51D984ok2k3k3k3k6k6m3j9Km8r4r5l8M4R2O9M8M9K5k3k7k7l0l1L1L0L0K9l4n7k3K6OOJ0R
-55D752JKj%k8n3o6j8MLOPk3k2j9j9k6K1K2k6j9j9K7K7M1M2m5r4j2j1j5j4RJ0RJ0j6j6j3j2
-58D406o0j1J0J0l9l9j7L1J1J1J3J4J4J3J4J4qqn7n7m5m4MMK8K9K8K9m0m1m0m1J1J0qn7m4
-62D048MK0J9%m8m9%K6K5K9K8qrqrPPm2m2K0K1K1K1j9j9j8j9qpqqj9k0k0k0J8J8M5mk8k9J6
$$ plain form
-66 3932 3949 3909 3868 3849 3879 3857 3835 3816 3797 3807 3817 3826 3836 3817 3799 3780 3761 3751 3742 3732 3722 3722 3723 3677 3632 3614 3645 3700 3755 3738 3769 3819 3788 3768 3748 3695 3692
-69 3692 3705 3718 3735 3751 3733 3715 3697 3679 3678 3677 3676 3675 3635 3594 3635 3676 3715 3755 3746 3737 3690 3643 3647 3700 3692 3635 3608 3581 3587 3593 3599 3605 3596 3587 3605 3574 3564 3554 3511 3516 3541 3518
-73 3518 3526 3533 3554 3575 3596 3617 3596 3575 3555 3534 3484 3433 3404 3424 3409 3394 3382 3371 3383 3395 3407 3420 3412 3404 3393 3382 3400 3369 3338 3356 3344 3332 3322 3313 3347 3381 3415
-77 3415 3449 3474 3499 3475 3451 3441 3431 3420 3410 3385 3360 3357 3403 3457 3511 3503 3414 3331 3296 3308 3319 3366 3363 3307 3251 3226 3200 3228 3305 3356 3408 3414 3419 3405 3391 3376 3362
-80 3362 3313 3265 3190 3163 3187 3210 3212 3214 3166 3117 3117 3117 3083 3049 3040 3031 3074 3117 3111 3105 3114 3124 3154 3185 3205 3176 3147 3167 3189 3210 3211 3211 3204 3196 3140 3083 3059 3035 3036 3036 3053 3069
-84 3069 3086 3102 3120 3139 3157 3175 3160 3145 3129 3114 3099 3084 3069 3054 3097 3140 3211 3232 3198 3164 3126 3089 3054 3019 3008 2998 2975 2952 2977 3003 3040 3078 3116 3153 3120
-88 3120 3087 3026 3014 2951 2888 2831 2775 2760 2793 2880 2968 2984 3001 2969 2937 2910 2883 2904 2926 2964 3002 3041 3079 3051 3024 2996 2968 2953 2937 2922 2906 2891 2875 2860 2844
-91 2844 2808 2773 2737 2701 2695 2689 2701 2762 2784 2757 2754 2800 2820 2792 2745 2698 2744 2790 2787 2784 2768 2753 2787 2820 2794 2768 2764 2808 2800 2792 2787 2783 2772 2761 2751 2740 2751 2762 2773 2785
$$ packed form
-66C932J7m0m1j9L0k2k2j9j9J0J0RJ0j9j8j9j9j0rj0j0%Jm6m5j8L1N5N5j7L1N0l1k0k0n3l
-69C692J3J3J7J6j8j8j8j8jjjjm0m1M1M1L9M0rrm7m7MN3qn7k7k7OOOOrrJ8l1j0j0m3NK5k3
-73C518QPK1K1K1K1k1k1k0k1n0n1k9K0j5j5j2j1J2J2J2J3qqj1j1J8l1l1J8j2j2j0rL4L4L4
-77C415L4K5K5k4k4j0j0j1j0k5k5lM6N4N4qq9q3l5J2J1M7ln6n6k5k6K8P7N1N2ONj4j4j5j4
-80C362m9m8p5k7K4K3KKm8m9%%l4l4rrM3M3ooRJ0L0L1K0k9k9K0K2K1J%pqn6n7k4k4J%J7J6
-84C069J7J6J8J9J8J8j5j5j6j5j5j5j5j5M3M3P1K1l4l4l8l7l5l5j1j0k3k3K5K6L7L8L8L7l3
-88C120l3o1j2o3o3n7n6j5L3Q7Q8J6J7l2l2k7k7K1K2L8L8L9L8k8k7k8k8j5j6j5j6j5j6j5j6
-91B844l6l5l6l6ooJ2O1K2k7lM6K0k8m7m7M6M6llj6j5L4L3k6k6mM4qqnmj1j1j0j1J1J1J1J2
$$ plain form
-95 2785 2747 2709 2696 2682 2706 2729 2704 2679 2741 2804 2785 2766 2741 2717 2742 2767 2785 2804 2823 2842 2803 2763 2724 2685 2669 2654 2638 2622 2609 2596 2556 2564 2590 2615 2640
-98 2640 2666 2661 2607 2553 2548 2549 2550 2554 2557 2581 2605 2629 2653 2670 2686 2702 2718 2691 2664 2637 2610 2575 2540 2529 2518 2540 2561 2504 2447 2451 2503 2556 2560 2531 2501 2517 2533 2559 2585
-102 2585 2563 2540 2535 2529 2547 2566 2566 2567 2568 2568 2584 2600 2597 2546 2510 2524 2531 2538 2502 2465 2432 2398 2412 2475 2513 2502 2472 2442 2457 2472 2480 2488 2495 2503 2469 2435 2450 2465 2435 2405 2394
-106 2394 2431 2431 2383 2338 2342 2408 2474 2494 2514 2509 2504 2472 2488 2513 2537 2516 2495 2435 2376 2397 2419 2402 2385 2395 2357 2326 2296 2311 2327 2320 2313 2352 2391 2399 2359 2370 2381 2383
-109 2383 2384 2386 2388 2384 2381 2377 2373 2338 2302 2347 2393 2379 2366 2331 2297 2261 2274 2281 2288 2344 2351 2304 2257 2243 2229 2214 2200 2209 2218 2251 2284 2246 2209 2250 2290 2330 2320 2314 2307 2298 2288 2302
-113 2302 2317 2285 2254 2247 2239 2227 2214 2250 2287 2265 2244 2223 2202 2243 2284 2277 2269 2241 2212 2207 2203 2190 2177 2188 2199 2181 2162 2117 2120 2130 2141 2154 2167 2225 2283 2288 2245 2216
-117 2216 2212 2243 2225 2168 2110 2070 2078 2050 1998 2012 2026 2072 2118 2141 2164 2160 2180 2216 2202 2172 2166 2192 2219 2232 2245 2239 2183 2160 2161 2146 2130 2105 2080 2054 2029 2070 2111
-120 2111 2133 2107 2111 2163 2167 2122 2097 2121 2188 2206 2155 2056 2004 2001 2003 2029 2045 2061 2092 2123 2134 2097 2064 2056 2030 2005 2020 2035 2050 2065 2060 2055 2001 1947 1973 1999 2006 1965
$$ packed form
-95B785l8l8j3j4K4K3k5k5O2O3j9j9k5k4K5K5J8J9J9J9l9m0l9l9j6j5j6j6j3j3m0QK6K5K5
-98B640K6nn4n4nJJMLK4K4K4K4J7J6J6J6k7k7k7k7l5l5j1j1K2K1n7n7MN2N3Mk9l0J6J6K6K6
-102B585k2k3noJ8J9%JJ%J6J6ln1l6J4PPl6l7l3l4J4O3L8j1l0l0J5J5QQPQl4l4J5J5l0l0j1
-106B394L7%m8m5MO6O6K0K0nnl2J6K5K4k1k1o0n9K1K2j7j7J0l8l1l0J5J6ppL9L9Qm0J1J1K
-109B383JKKmlmml5l6M5M6j4j3l5l4l6J3PPN6Pm7m7j4j4j5j4RRL3L3l8l7M1M0M0j0oprj0J4
-113B302J5l2l1pqj2j3L6L7k2k1k1k1M1M1pqk8k9nmj3j3J1J1j8j9m5LJ0J1J3J3N8N8Nm3k9
-117B216mL1j8n7n8m0Qk8n2J4J4M6M6K3K3mK0L6j4l0oK6K7J3J3on6k3Jj5j6k5k5k6k5M1M1
-120B111K2k6MN2Mm5k5K4O7J8n1r9n2lKK6J6J6L1L1J1l7l3qk6k5J5J5J5J5nnn4n4K6K6Pm1
$$ plain form
-124 1965 1961 2005 2022 1990 1952 1914 1897 1881 1928 1976 1999 2023 2030 2038 1999 1961 1910 1907 1939 1947 1966 1985 1953 1922 1898 1873 1849 1825 1814 1803 1870 1937 2002 2019 2001 2007 2022
-127 2022 2037 2079 2073 2038 1978 1918 1882 1867 1900 1936 1924 1916 1933 1960 1939 1901 1863 1871 1879 1890 1901 1940 1929 1940 1951 1941 1882 1811 1789 1784 1780 1766 1751 1740 1728 1737 1794 1824
-131 1824 1855 1850 1845 1840 1835 1855 1876 1896 1917 1937 1957 1929 1900 1887 1873 1860 1847 1845 1844 1842 1841 1809 1777 1794 1811 1828 1845 1813 1781 1805 1829 1775 1721 1761 1850 1911 1972 1955
-134 1955 1937 1919 1901 1844 1787 1734 1682 1669 1738 1810 1800 1741 1731 1770 1808 1838 1867 1843 1770 1721 1672 1669 1666 1694 1722 1705 1687 1697 1755 1786 1817 1843 1870 1875 1832 1794
-138 1794 1756 1688 1668 1640 1613 1636 1660 1685 1710 1689 1668 1599 1579 1613 1647 1689 1731 1719 1658 1615 1572 1528 1485 1487 1539 1563 1586 1561 1535 1558 1580 1588 1595 1651 1706 1698
-141 1698 1690 1731 1771 1736 1701 1665 1630 1609 1589 1569 1549 1545 1541 1537 1533 1566 1599 1629 1658 1665 1622 1607 1592 1584 1576 1614 1652 1716 1731 1691 1601 1543 1533 1541 1549 1573 1597 1620 1644
-145 1644 1675 1705 1655 1605 1550 1495 1489 1483 1460 1436 1494 1552 1555 1558 1563 1569 1543 1566 1589 1564 1562 1560 1555 1550 1566 1581 1596 1612 1615 1619 1623 1626 1610 1593 1576 1559 1542 1525 1508 1491 1510
-149 1510 1530 1549 1568 1542 1516 1490 1463 1462 1462 1461 1460 1427 1395 1417 1487 1532 1576 1576 1575 1565 1556 1574 1543 1478 1412 1390 1367 1408 1400 1371 1342 1360 1379 1397 1416 1402 1388 1374
$$ packed form
-124A965mM4J7l2l8l8j7j6M7M8K3K4PQl9l8n1lL2QJ9J9l2l1k4k5k4k4j1j1O7O7O5J7j8OJ5
-127B022J5M2ol5o0o0l6j5L3L6j2qJ7K7k1l8l8QQJ1J1L9j1J1J1j0n9p1k2nmj4j5j1j2RN7L0
-131A824L1nnnnK0K1K0K1K0K0k8k9j3j4j3j3kjkjl2l2J7J7J7J7l2l2K4K4n4n4M0Q9O1O1j7
-134A955j8j8j8n7n7n3n2j3O9P2j0n9j0L9L8L0K9k4p3m9m9llK8K8j7j8J0N8L1L1K6K7Nm3l8
-138A794l8o8k0k8k7K3K4K5K5k1k1o9k0L4L4M2M2j2o1m3m3m4m3KN2K4K3k5k6K3K2QPN6N5q
-141A698qM1M0l5l5l6l5k1k0k0k0mmmmL3L3L0K9Pm3j5j5qqL8L8O4J5m0r0n8j0QQK4K4K3K4
-145A644L1L0n0n0n5n5ook3k4N8N8LLNOk6K3K3k5kknnJ6J5J5J6LMMLj6j7j7j7j7j7j7j7J9
-149A510K0J9J9k6k6k6k7j%jjl3l2K2P0M5M4%jj0rJ8l1o5o6k2k3M1qk9k9J8J9J8J9j4j4j4
$$ plain form
-152 1374 1360 1358 1356 1355 1353 1366 1379 1392 1405 1406 1407 1408 1409 1427 1446 1465 1483 1457 1431 1408 1385 1355 1374 1365 1356 1362 1368 1375 1381 1350 1319 1290 1262 1281 1348 1415 1433 1430 1426 1422 1418 1399 1429
-156 1429 1431 1433 1404 1376 1347 1318 1318 1318 1314 1311 1341 1322 1303 1332 1360 1388 1418 1449 1438 1427 1416 1405 1382 1359 1339 1319 1306 1342 1377 1365 1362 1359 1353 1348 1329 1311 1323 1286 1271
-160 1271 1306 1337 1319 1281 1243 1255 1316 1329 1342 1359 1375 1385 1396 1360 1325 1280 1285 1342 1400 1377 1354 1334 1314 1305 1345 1385 1376 1371 1365 1357 1348 1355 1362 1342 1370 1382 1394 1408 1423
-164 1423 1366 1309 1285 1211 1177 1223 1251 1231 1227 1273 1285 1296 1312 1279 1273 1267 1279 1290 1302 1313 1322 1331 1340 1348 1357 1366 1374 1383 1357 1332 1306 1280 1245 1210 1148 1134 1171 1208 1248 1288
-168 1288 1294 1301 1304 1308 1284 1213 1190 1215 1249 1283 1238 1194 1206 1218 1257 1248 1219 1189 1205 1221 1181 1142 1183 1224 1256 1288 1272 1255 1257 1258 1260 1262 1248 1234 1221 1207 1223 1239 1228
-171 1228 1265 1247 1228 1216 1203 1162 1170 1178 1137 1130 1122 1109 1095 1141 1137 1113 1089 1084 1080 1154 1228 1283 1290 1278 1266 1226 1234 1261 1287 1311 1287 1241 1195 1197 1198 1200 1202 1176 1149 1123 1096
-175 1096 1106 1117 1127 1137 1125 1112 1100 1088 1096 1104 1112 1120 1123 1127 1131 1135 1127 1119 1110 1102 1104 1106 1108 1110 1121 1132 1146 1160 1152 1193 1185 1129 1083 1036 1036 1035 1055 1074 1093 1113 1123 1133 1143 1153
-179 1153 1135 1117 1099 1081 1083 1085 1087 1089 1072 1054 1037 1019 1039 1058 1077 1096 1081 1066 1084 1053 1016 1060 1149 1158 1100 1042 982 922 902 930 931 932 928 923 967 1011 1016 1020 1025 1030 1000
$$ packed form
-152A374j4kkjkJ3J3J3J3JJJJJ8J9J9J8k6k6k3k3l0J9rrOOPOl1l1k9k8J9O7O7J8lmmmj9L0
-156A429KKk9k8k9k9%%mlL0j9j9K9K8K8L0L1j1j1j1j1k3k3k0k0j3L6L5j2llonj9j8J2l7j5
-160A271L5L1j8l8l8J2O1J3J3J7J6J0J1l6l5m5NN7N8k3k3k0k0rM0M0rnoqrPPk0K8J2J2J4J5
-164A423n7n7k4p4l4M6K8k0mM6J2J1J6l3ooJ2J1J2J1RRRQRRQRk6k5k6k6l5l5o2j4L7L7M0M0
-168A288OPLMk4p1k3K5L4L4m5m4J2J2L9rk9l0J6J6m0l9M1M1L2L2j6j7KJKKj4j4j3j4J6J6j1
-171A228L7j8j9j2j3m1QQm1pqj3j4M6mk4k4nmP4P4N5Pj2j2m0QK7K6K4k4m6m6KJKKk6k7k6k7
-175A096J0J1J0J0j2j3j2j2QQQQLMMMqqrqKKKKJ1J1J4J4qM1qn6m6m7%jK0J9J9K0J0J0J0J0
-179A153j8j8j8j8KKKKj7j8j7j8K0J9J9J9j5j5J8l1l7M4Q9Rn8n8o0o0k0K8JJmnM4M4NMNNl0
$$ plain form
-183 1000 970 940 909 932 955 978 1000 1034 1068 1129 1141 1087 1034 998 1012 1011 1010 1012 1014 1020 1025 1030 1035 1053 1071 1088 1106 1131 1156 1135 1114 1077 1089 1101 1064 1035 1005 970
-187 970 934 949 914 880 895 955 1015 965 914 909 903 867 879 900 872 846 870 892 914 936 958 983 958 961 964 925 885 895 905 937 969 1001 1033 1075 1118 1112 1105 1074
-190 1074 1043 1011 980 967 954 941 929 928 927 927 926 899 872 845 818 812 805 798 792 793 795 800 805 804 853 901 901 911 922 880 839 837 835 833 832 837 843 848 854 896 938 980 1022 1006 991
-195 991 972 953 959 917 875 882 920 958 946 884 869 853 883 913 905 896 918 891 852 862 890 918 919 920 921 923 882 842 801 760 765 770 774 779 801 823 845 866 891 915 890
-198 890 866 881 896 911 926 943 960 977 994 985 977 920 863 871 879 886 894 925 955 934 865 813 810 826 841 817 794 774 754 717 730 763 797 852 907 881 855 842
-202 842 830 817 804 820 836 854 873 843 862 931 1000 980 912 871 829 812 796 824 853 912 923 912 901 874 848 870 892 883 875 866 858 844 830 817 803 775 746
-206 746 766 786 777 768 759 751 778 806 829 852 904 875 843 810 808 805 754 702 716 729 742 755 748 741 706 720 732 744 786 779 721 662 654 696 737 779 821 862 851 792
-209 792 759 727 740 754 767 780 773 767 760 753 743 733 723 713 689 665 614 611 654 696 660 624 613 603 592 582 590 598 607 615 621 626 631 637 661 684 687 641 591 540 550 641
$$ packed form
-183A000l0l0l1K3K3K3K2L4L4O1J2n4n3l6J4jjKKONNNJ8J8J7J8K5K5k1k1l7J2J2l7k9l0l5
-187I70l6J5l5l4J5O0O0n0n1nol6J2K1k8k6K4K2K2K2K2K5k5LLl9m0J0J0L2L2L2L2M2M3opl1
-190A074l1l2l1j3j3j3j2jj%jk7k7k7k7oppoJKNNjM9M8%J0J1m2m1kkkjNONOM2M2M2M2j6j5
-195I91j9j9Om2m2PL8L8j2o2j5j6L0L0qrK2k7l9J0K8K8JJJKm1m0m1m1NNMNK2K2K2K1K5K4k5
-198H90k4J5J5J5J5J7J7J7J7rqn7n7QQPQL1L0k1o9n2lJ6J5k4k3k0k0l7J3L3L4N5N5k6k6j3
-202H42j2j3j3J6J6J8J9l0J9O9O9k0o8m1m2j7j6K8K9N9J1j1j1k7k6K2K2rqrqj4j4j3j4k8k9
-206G46K0K0rrrqK7K8K3K3N2k9l2l3kln1n2J4J3J3J3ppl5J4J2J2M2pn8n9qM2M1M2M2M1j1n9
-209G92l3l2J3J4J3J3poppj0j0j0j0k4k4n1lM3M2l6l6j1j0j1j0QQRQONNOK4K3Lm6n0n1J0R1
$$ plain form
-213 641 676 629 606 632 657 681 688 646 620 595 567 538 579 620 612 603 601 598 596 593 588 582 549 565 620 674 711 699 661 624 629 634 656 630 604 627 649 672 649 626
-217 626 593 560 527 494 502 511 520 528 540 552 592 582 569 556 539 523 500 478 533 588 633 628 602 577 574 572 569 567 564 562 559 557 549 540 578 615 673 682 640 598 531 512 514
-221 514 517 510 503 496 490 533 577 621 665 654 643 586 529 495 509 545 580 585 591 596 601 632 662 675 639 612 635 627 619 559 499 487 476 441 406 452 498 470 442 465
-225 465 537 548 510 502 494 501 509 513 517 536 506 504 502 502 502 472 490 496 453 441 429 405 381 357 333 358 384 410 435 489 542 544 546 512 430 348 314 342 370 402 433
-229 433 449 465 509 504 501 499 494 488 483 477 472 466 489 511 533 556 520 485 422 407 430 454 452 500 514 527 496 464 420 377 382 387 381 376 371 366 365 363 362 361 359 358 356 355 333 312 290
-233 290 268 304 341 377 413 466 520 525 530 510 489 469 448 451 454 454 454 456 409 363 365 363 361 392 375 355 384 382 380 419 458 445 432 429 378 326 323 351 379 361 343 328
-237 328 313 343 374 375 326 306 366 436 458 464 469 462 454 449 445 414 431 449 418 337 256 254 302 363 375 369 362 383 403 374 346 314 283 300 317 303 289 275 261 251
-241 251 242 281 319 302 285 267 250 272 294 313 332 351 322 320 318 341 363 337 310 328 345 363 381 378 375 372 370 314 258 224 238 299 360 424 489 475 461 448
$$ packed form
-213F41L5m7k3K6K5K4Pm2k6k5k8k9M1M1qrklklnol3J6N5N4L7j2l8l7NNK2k6k6K3K2K3k3k3
-217F26l3l3l3l3QRRQJ2J2M0j0j3j3j7j6k3k2N5N5M5nk6k5lklklklkqrL8L7N8Rm2m2o7j9K
-221E14LpppoM3M4M4M4j1j1n7n7l4J4L6L5NONNL1L0J3l6k7K3qqo0o0j2j1l5l5M6M6k8k8K3
-225D65P2J1l8qqPQMMJ9l0kk%%l0J8Om3j2j2k4k4k4k4K5K6K6K5N4N3KKl4q2q2l4K8K8L2L1
-229D33J6J6M4nlknononoK3K2K2K3l6l5o3j5K3K4kM8J4J3l1l2m4m3NNonnnjkjjkjkjk2k1k2
-233B90k2L6L7L6L6N3N4NNk0k1k0k1LL%%Km7m6KkkL1j7k0K9kkL9L9j3j3ln1n2lK8K8j8j8j5
-237C28j5L0L1Jm9k0O0P0K2ONpqnml1J7J8l1q1q1kM8O1J2opK1K0k9k8l2l1J7J7j4j4j4j4j0
-241B51rL9L8j7j7j8j7K2K2J9J9J9k9kkK3K2k6k7J8J7J8J8lllkn6n6l4J4O1O1O4O5j4j4j3
$$ plain form
-245 448 434 401 367 363 311 257 251 263 276 312 347 362 328 287 246 250 255 233 211 208 253 272 243 243 244 245 246 247 248 252 256 260 264 240 217 242 267 289 311 333 355 355 354
-249 354 308 262 240 267 267 267 266 266 262 259 268 228 188 196 195 194 195 197 207 218 229 240 201 162 173 234 336 389 358 328 316 305 338 372 379 338 326 315 280 293 279
-252 279 265 250 236 270 304 339 373 359 344 322 300 278 256 268 279 291 302 281 260 239 217 189 161 181 202 195 188 208 180 167 154 186 219 185 152 118
-256 118 84 74 63 53 43 89 135 175 216 229 160 110 108 120 132 144 155 158 112 97 81 68 104 140 127 97 66 82 97 107 116 122 128 126 74 53 32 30
-259 30 77 175 272 261 202 169 137 140 143 146 148 150 152 105 59 65 71 78 84 67 50 33 17 40 63 86 109 141 173 202 231 254 229 182 135 133 131 129 127 131 135 138 142 146 150
-264 150 123 145 183 173 117 109 143 177 166 155 117 79 93 154 216 230 192 154 139 123 125 177 198 172 145 166 171 127 114 100 101 101 102 102 132 162 143 124
-267 124 78 32 66 101 94 88 129 171 111 50 11 20 62 104 149 113 27 -9 2 14 12 11 9 7 11 14 21 27 -11 -1 11 -24 -12 48 78 108 73 39 4 -29
-271 -29 7 44 33 22 54 86 115 144 161 130 125 121 105 90 75 59 44 28 13 -2 -3 -4 -5 -5 10 26 21 -32 -59 -85 -34 16 39 62 85 107 86 65 43
$$ packed form
-245D48j4l3l4mn2n4oJ2J3L6L5J5l4m1m1MNk2k2lM5J9k9%JJJJJMMMMk4k3K5K5K2K2K2K2%j
-249C54m6m6k2K7%%j%mlRm0m0QjjJKJ0J1J1J1l9l9J1O1J02N3l1l0j2j1L3L4Pm1j2j1l5J3j4
-252B79j4j5j4L4L4L5L4j4j5k2k2k2k2J2J1J2J1k1k1k1k2k8k8K0K1ppK0k8j3j3L2L3l4l3l4
-256A18l4j0j1j0j0M6M6M0M1J3o9n0kJ2J2J2J1Lm6j5j6j3L6L6j3l0l1J6J5J0ROOkn2k1k1k
-259C0M7R8R7j1n9l3l2LLLKKKm7m6OOPOj7j7j7j6K3K3K3K3L2L2K9K9K3k5m7m7kkkkMMLMMM
-264A50k7K2L8j0n6qL4L4j1j1l8l8J4O1O2J4l8l8j5j6KN2K1k6k7K1Nm4j3j4J%J%L0L0j9j9
-267A24m6m6L4L5poM1M2o0o1l9RM2M2M5l6q6l6J1J2kjkkMLPOl8J0J2l5J2O0L0L0l5l4l5l3
-271b9L6L7j1j1L2L2K9K9J7l1nmj6j5j5j6j5j6j5j5jjj%J5J6nn3k7k6N1N0K3K3K3K2k1k1k2
$$ plain form
-275 43 22 26 30 34 38 65 91 101 63 18 55 91 128 102 77 52 26 16 6 -3 -13 10 34 58 82 81 80 79 77 43 9 24 38 49 59 69 80 64 48 80
-279 80 113 98 83 68 53 21 -10 -42 -73 -44 -15 13 42 15 -12 -39 -67 -66 -65 -64 -63 -73 -84 -95 -106 -88 -70 -53 -35 -46 -57 -68 -79 -119 -158 -149 -140 -178
-282 -178 -217 -174 -131 -99 -68 -36 -4 -49 -95 -91 -88 -91 -95 -99 -102 -95 -88 -80 -73 -78 -83 -88 -93 -74 -56 -37 -19 -6 7 20 33 45 56 -8 -72 -115 -76 -34 7 18 30 -6
-286 -6 -44 -56 -69 -82 -95 -89 -84 -78 -73 -79 -86 -93 -99 -86 -73 -91 -59 12 35 -21 -78 -140 -153 -112 -72 -60 -47 -57 -114 -152 -190 -182 -173 -176 -178 -180 -182 -163 -145 -126 -108 -101 -95 -88
-290 -88 -82 -106 -129 -153 -177 -169 -162 -154 -146 -152 -158 -121 -83 -69 -136 -184 -184 -180 -176 -169 -162 -143 -123 -104 -85 -119 -153 -184 -214 -231 -199 -167 -184 -191 -198 -208 -217 -207 -197 -189 -182 -177 -221 -238
-294 -238 -254 -254 -253 -255 -257 -233 -258 -282 -258 -238 -219 -169 -169 -168 -168 -170 -173 -109 -46 -64 -82 -85 -88 -91 -95 -136 -178 -217 -256 -297 -289 -261 -232 -207 -182 -158 -133 -123 -113 -107 -100 -81 -111
-298 -111 -113 -115 -174 -232 -236 -191 -172 -153 -180 -206 -193 -179 -166 -152 -136 -119 -102 -86 -93 -101 -108 -115 -111 -106 -101 -96 -132 -168 -204 -240 -228 -216 -204 -193 -208 -224 -191 -157 -130 -103
-302 -103 -125 -146 -197 -248 -327 -356 -302 -247 -193 -138 -89 -88 -109 -130 -146 -163 -179 -196 -182 -167 -126 -133 -149 -165 -184 -203 -193 -182 -172 -162 -144 -127 -158 -190 -206 -223
$$ packed form
-275D3k1MMMMK7K6J0l8m5L7L6L7k6k5k5k6j0j0rj0K3K4K4K4jjjkl4l4J5J4J1J0J0J1j6j6L2
-279H0L3j5j5j5j5l2l1l2l1K9K9K8K9k7k7k7k8JJJJj0j1j1j1J8J8J7J8j1j1j1j1m0l9RRl8
-282a78l9M3M3L2L1L2L2m5m6MLlmmlPPQPnnnnJ9J8J9J8J3J3J3J3J2J1o4o4m3L9M2M1J1J2l6
-286fl8j2j3j3j3ONONoppoJ3J3j8L2P1K3n6n7o2j3M1M0J2J3j0n7l8l8QRlkkkJ9J8J9J8POP
-290h8Ok4k3k4k4QPQQooL7L8J4o7m8%MMPPJ9K0J9J9l4l4l1l0j7L2L2j7ppj0rJ0J0QPNm4j7
-294b38j6%JkkK4k5k4K4K0J9N0%J%klO4O3j8j8lllmm1m2l9l9m1QK8K9K5K5K4K5J0J0OPJ9l0
-298a11kkn9n8mM5J9J9k7k6J3J4J3J4J6J7J7J6pqppMNNNl6l6l6l6J2J2J2J1j5j6L3L4K7K7
-302a03k2k1n1n1p9k9N4N5N4N5M9Jk1k1j6j7j6j7J4J5M1pj6j6j9j9J0J1J0J0J8J7l1l2j6j7
$$ plain form
-306 -223 -240 -256 -253 -249 -246 -242 -196 -151 -186 -222 -232 -242 -252 -262 -250 -238 -226 -214 -206 -198 -238 -279 -317 -355 -312 -268 -234 -200 -215 -229 -231 -233 -235 -237 -238 -240 -239 -238 -271 -256 -223 -189
-310 -189 -181 -222 -235 -248 -261 -274 -287 -299 -284 -268 -252 -237 -225 -214 -202 -191 -183 -176 -214 -252 -253 -206 -207 -257 -294 -331 -368 -405 -437 -420 -381 -343 -285 -226 -216 -207 -194 -182
-313 -182 -218 -255 -300 -345 -310 -274 -246 -218 -190 -162 -173 -185 -196 -207 -198 -188 -148 -156 -242 -279 -294 -310 -338 -318 -276 -234 -229 -224 -191 -207 -229 -251 -276 -301 -297 -294 -290 -287 -298
-317 -298 -308 -319 -330 -317 -305 -292 -279 -311 -342 -325 -307 -318 -330 -389 -449 -441 -434 -426 -418 -372 -326 -249 -221 -246 -223 -203 -231 -262 -294 -356 -369 -359 -350 -337 -324 -321 -317 -313 -310
-321 -310 -320 -330 -324 -269 -236 -283 -282 -281 -302 -322 -342 -362 -351 -340 -329 -318 -278 -238 -277 -315 -355 -347 -339 -379 -427 -474 -476 -478 -438 -398 -359 -319 -319 -319 -320 -320 -300 -280 -308 -337
-324 -337 -392 -446 -419 -393 -403 -413 -423 -432 -411 -390 -369 -348 -348 -347 -346 -346 -360 -374 -388 -402 -387 -373 -358 -344 -350 -356 -361 -367 -358 -349 -339 -330 -369 -408 -399 -389 -378 -368 -330 -340 -365
-328 -365 -389 -398 -358 -333 -357 -354 -351 -356 -410 -465 -470 -470 -471 -468 -384 -335 -334 -350 -365 -401 -437 -427 -418 -407 -446 -484 -474 -464 -453 -484 -514 -538 -480 -441 -450 -430 -410 -393 -376 -427
-332 -427 -478 -529 -580 -597 -615 -583 -552 -542 -532 -522 -511 -513 -515 -517 -519 -511 -503 -544 -584 -583 -582 -532 -483 -432 -382 -353 -373 -404 -435 -469 -503 -512 -522 -531 -540 -534 -528 -522 -516 -520 -523 -509 -446
$$ packed form
-306b23j7j6LMLMM6M5l5l6j0j0j0j0J2J2J2J2QQm0m1l8l8M3M4L4L4j5j4kkkkjkJJl3J5L3L4
-310a89Qm1j3j3j3j3j3j2J5J6J6J5J2J1J2J1QPl8l8jM7jn0l7l7l7l7l2J7L9L8N8N9J0RJ3J2
-313a82l6l7m5m5L5L6K8K8K8K8j1j2j1j1RJ0M0qq6l7j5j6k8K0M2M2NNL3j6k2k2k5k5MLMLj1
-317b98j0j1j1J3J2J3J3l2l1J7J8j1j2n9o0QPQQM6M6P7K8k5K3K0k8l1l2o2j3J0RJ3J3LMML
-321c10j0j0ON5L3m7JJk1k0k0k0J1J1J1J1M0M0l9l8m0QQm0m8m7kkM0M0L9M0%%j%K0K0k8k9
-324c37n5n4K7K6j0j0j0rK1K1K1K1%JJ%j4j4j4j4J5J4J5J4oonoRRJ0Rl9l9RJ0J1J0L8j0k5
-328c65k4rM0K5k4LLnn4n5n%jLQ4M9Jj6j5l6l6J0RJ1l9l8J0J0J1l1l0k4N8L9rK0K0J7J7n1
-332d27n1n1n1j7j8L2L1J0J0J0J1kkkkQQm1m0JJN0M9N1N0K9k0l1l1l4l4rj0rrOOOOmlJ4O3
$$ plain form
-336 -446 -436 -474 -531 -587 -591 -594 -595 -595 -571 -498 -429 -408 -379 -400 -445 -489 -484 -479 -475 -470 -485 -501 -535 -617 -644 -622 -631 -639 -617 -595 -573 -550 -501 -451 -423 -443 -461 -479 -451 -423
-340 -423 -418 -413 -457 -501 -525 -548 -571 -594 -581 -568 -582 -547 -517 -486 -452 -418 -421 -424 -426 -429 -438 -448 -457 -466 -476 -485 -494 -504 -497 -491 -484 -478 -492 -506 -519 -533 -537 -541 -547 -554 -485 -464 -497 -530
-344 -530 -561 -593 -578 -564 -567 -618 -646 -673 -657 -691 -697 -703 -681 -660 -593 -526 -496 -515 -555 -596 -586 -576 -567 -557 -523 -489 -528 -591 -648 -657 -589 -521 -494 -466 -438 -411 -389
-347 -389 -367 -386 -404 -438 -472 -482 -491 -517 -543 -569 -594 -595 -596 -597 -598 -598 -597 -596 -596 -631 -666 -658 -675 -702 -647 -589 -555 -521 -536 -549 -562 -619 -676 -661 -646 -677 -732 -727 -674 -574
-351 -574 -473 -419 -413 -386 -408 -446 -485 -503 -522 -566 -609 -633 -658 -641 -625 -615 -604 -576 -573 -606 -590 -572 -603 -633 -615 -587 -558 -589 -621 -652 -683 -659 -635 -610 -586
-355 -586 -574 -562 -550 -538 -565 -593 -620 -647 -704 -762 -730 -698 -689 -680 -647 -614 -592 -570 -605 -640 -643 -646 -623 -600 -613 -602 -575 -597 -623 -625 -626 -652 -679 -657 -642 -628 -581 -582
-358 -582 -613 -644 -654 -663 -603 -542 -527 -561 -571 -580 -580 -628 -649 -670 -682 -694 -706 -718 -718 -719 -720 -720 -744 -767 -750 -733 -717 -701 -684 -668 -633 -599 -588 -578 -612 -647 -669 -642
-362 -642 -606 -571 -589 -607 -595 -582 -570 -558 -549 -540 -531 -523 -549 -576 -633 -642 -595 -597 -652 -659 -676 -693 -707 -720 -691 -662 -673 -684 -711 -738 -708 -678 -682 -687 -716 -745 -713 -682 -677 -673
$$ packed form
-336d46J0l8n7n6mlj%K4P3O9K1K9k1m5m4NNMNj5j6l4q2k7K2rqK2K2K2K3M9N0K8k0j8j8K8K8
-340d23NNm4m4k4k3k3k3J3J3j4L5L0L1L4L4llklrj0rrj0rrj0POPOj4j4j3j4mmopO9K1l3l3
-344e30l1l2J5J4ln1k8k7J6l4ooK2K1O7O7L0j9m0m1J0J0RJ0L4L4l9o3n7rO8O8K7K8K8K7K2
-347c89K2j9j8l4l4j0rk6k6k6k5jjjj%JJ%l5l5Qj7k7N5N8L4L4j5j3j3n7n7J5J5l1n5NN3J00
-351e74J01N4OK7k2l8l9j8j9m4m3k4k5J7J6J0J1K8Ll3J6J8l1l0J8K8K9l1l2l1l1K4K4K5K4
-355e86J2J2J2J2k7k8k7k7n7n8L2L2RRL3L3K2K2l5l5llK3K3j3J1K7k2k6kjk6k7K2J5J4M7j
-358e82l1l1j0rO0O1J5l4j0r%m8k1k1j2j2j2j2%jj%k4k3J7J7J6J6J7J6L5L4J1J0l4l5k2K7
-362f42L6L5j8j8J2J3J2J2RRRQk6k7n7rM7kn5pj7j7j4j3K9K9j1j1k7k7L0L0mnk9k9L2L1NM
$$ plain form
-366 -673 -639 -653 -667 -633 -661 -690 -716 -741 -745 -749 -712 -676 -667 -658 -649 -641 -619 -597 -615 -634 -671 -708 -745 -782 -777 -772 -767 -762 -720 -678 -608 -588 -586 -585 -643 -702 -687 -672 -681 -691 -700 -709
-369 -709 -715 -721 -721 -673 -584 -544 -587 -630 -651 -673 -666 -659 -652 -644 -624 -603 -582 -561 -573 -585 -597 -609 -648 -687 -678 -669 -661 -654 -647 -640 -618 -597 -624 -700 -759 -736 -684 -632 -573 -562 -605
-373 -605 -649 -659 -668 -678 -688 -655 -622 -638 -654 -657 -659 -662 -665 -668 -670 -673 -676 -679 -683 -638 -593 -611 -630 -649 -668 -664 -660 -657 -653 -683 -712 -769 -778 -771 -764 -757 -750 -697 -693 -711 -728 -756 -784 -766 -749
-378 -749 -743 -787 -833 -830 -784 -787 -789 -743 -690 -685 -699 -713 -755 -798 -819 -792 -750 -708 -712 -716 -735 -753 -771 -790 -815 -841 -817 -794 -838 -881 -904 -877 -842 -806 -773 -740 -704 -750
-381 -750 -778 -757 -756 -755 -752 -748 -754 -761 -768 -774 -750 -727 -748 -770 -799 -778 -740 -701 -732 -811 -890 -921 -858 -794 -777 -759 -748 -737 -771 -805 -818 -782 -745 -758 -755 -752 -769 -834 -842 -769
-385 -769 -717 -714 -695 -677 -710 -743 -781 -818 -834 -801 -782 -762 -740 -717 -726 -735 -744 -754 -790 -827 -814 -802 -782 -763 -743 -723 -709 -696 -731 -766 -766 -767 -767 -768 -771 -775 -778 -782 -761 -741 -723
-389 -723 -705 -707 -757 -826 -894 -922 -902 -860 -818 -803 -788 -774 -759 -756 -752 -749 -745 -790 -834 -829 -825 -828 -831 -833 -836 -845 -854 -860 -866 -876 -838 -732 -708 -769 -830 -811 -793 -800 -757 -743 -728 -758
-393 -758 -788 -818 -848 -848 -848 -848 -848 -823 -798 -745 -741 -754 -767 -782 -798 -814 -829 -842 -854 -870 -838 -805 -821 -846 -871 -850 -830 -823 -817 -811 -804 -823 -842 -861 -880 -875 -869 -864 -858 -856 -854 -854 -855
$$ packed form
-366f73L4j4j4L4k8k9k6k5mmL7L6RRRQK2K2j8j9l7l7l7l7NNNNM2M2P0K0KJn8n9J5J5rj0rr
-369g09oo%M8Q9M0m3m3k1k2PPPQK0K1K1K1j2j2j2j2l9l9RRQPPPK2K1k7p6n9K3N2N2N9J1m3
-373f05m4j0rj0j0L3L3j6j6lklllklllmM5M5j8j9j9j9MMLMl0k9n7rPPPPN3Mj8j7k8k8J8J7
-378g49Om4m6LM6lkM6N3Nj4j4m2m3k1K7M2M2mmj9j8j8j9k5k6K4K3m4m3k3K7L5L6L3L3L6m6
-381g50k8K1JJLMoppoK4K3k1k2k9K1L8L9l1p9p9l1O3O4J7J8J1J1l4l4j3L6L7j3LLj7o5qP3
-385g69N2LJ9J8l3l3l8l7j6L3J9K0K2K3rrrj0l6l7J3J2K0J9K0K0J4J3l5l5%j%jlmlmK1K0J8
-389g23J8kn0o9o8k8K0M2M2J5J5J4J5LMLMm5m4NMllklrrooj0L8J06K4o1o1J9J8pM3J4J5l0
-393g58l0l0l0%%%%K5K5N3Mj3j3j5j6j6j5j3j2j6L2L3j6k5k5K1K0POOPj9j9j9j9NONOKK%j
$$ plain form
-397 -855 -793 -780 -788 -797 -806 -815 -852 -840 -832 -824 -813 -802 -790 -779 -768 -757 -773 -788 -803 -818 -834 -849 -895 -892 -846 -849 -871 -892 -866 -841 -788 -784 -844 -904 -885 -867 -852 -838 -823
-401 -823 -809 -794 -780 -814 -849 -892 -936 -976 -1017 -1001 -937 -873 -858 -865 -872 -882 -892 -891 -890 -889 -888 -900 -911 -922 -934 -936 -937 -939 -941 -903 -865 -876 -887 -873 -859 -844 -830 -878 -925 -927
-404 -927 -929 -904 -926 -998 -1021 -986 -951 -994 -1037 -1013 -988 -964 -940 -930 -919 -909 -899 -927 -955 -934 -914 -895 -876 -857 -839 -834 -829 -873 -917 -900 -883 -866 -849 -820 -792 -812
-408 -812 -833 -826 -818 -808 -798 -841 -835 -856 -877 -900 -922 -923 -875 -820 -765 -710 -655 -655 -703 -770 -837 -884 -883 -829 -774 -801 -828 -856 -883 -884 -885 -889 -893 -895 -946 -997 -999 -975 -951 -925 -898
-412 -898 -921 -944 -967 -990 -1008 -1025 -994 -963 -973 -983 -945 -907 -880 -853 -910 -1015 -1050 -1037 -977 -967 -977 -986 -949 -862 -785 -756 -778 -800 -797 -795 -793 -790 -818 -846 -874 -902 -909
-415 -909 -916 -875 -833 -839 -845 -851 -857 -855 -852 -850 -847 -820 -793 -788 -831 -856 -880 -908 -936 -900 -865 -830 -795 -791 -788 -803 -867 -915 -915 -942 -969 -992 -967 -939 -959 -1011 -1014 -1018 -1070 -1105 -1092 -1032
-419 -1032 -971 -932 -943 -1004 -1065 -1074 -1034 -1021 -1009 -1001 -994 -986 -979 -959 -939 -968 -996 -1025 -1054 -1034 -1014 -996 -977 -959 -941 -920 -899 -877 -856 -859 -861 -864 -866 -905 -944 -983 -1022 -1031 -1040 -1049
-423 -1049 -1058 -1038 -1019 -999 -980 -969 -958 -952 -946 -957 -1050 -1124 -1149 -1162 -1174 -1135 -1095 -1071 -1047 -1023 -999 -991 -984 -977 -969 -1004 -1040 -1026 -1013 -995 -976 -979 -1031 -1071 -1110 -1072 -1033 -1006
$$ packed form
-397h55O2J3qrrrl7J2QQJ1J1J2J1J1J1j6j5j5j5j6j5m6LM6lk2k1K6K5N3Mo0o0J9J8J5J4J5
-401h23J4J5J4l4l5m3m4m0m1J6O4O4J5ppj0j0JJJJj2j1j1j2kjkkL8L8j1j1J4J4J5J4m8m7k
-404i27kK5k2p2k3L5L5m3m3K4K5K4K4J0J1J0J0k8k8K1K0J9J9J9J8NNm4m4J7J7J7J7K9K8k0
-408h12k1PQJ0J0m3Ok1k1k3k2jM8N5N5N5N5%m8o7o7m7JN4N5k7k7k8k7jjmmkn1n1kK4K4K6K7
-412h98k3k3k3k3j8j7L1L1j0j0L8L8K7K7n7j05l5J3O0J0j0rL7Q7P7K9k2k2LKKLk8k8k8k8p
-415i09pM1M2ooooKLKLK7K7Nm3k5k4k8k8L6L5L5L5MLj5o4m8%k7k7k3K5K8k0n2lmn2l5J3O0
-419a032O1L9j1o1o1rM0J3J2QPQPK0K0k9k8k9k9K0K0J8J9J8J8K1K1K2K1lklkl9l9l9l9rrr
-423a049rK0J9K0J9J1J1OOj1r3p4k5j3j2L9M0K4K4K4K4QPPQl5l6J4J3J8J9ln2m0l9L8L9K7
$$ plain form
-426 -1006 -978 -981 -935 -918 -949 -950 -951 -964 -977 -945 -912 -889 -914 -961 -1008 -1024 -1041 -1025 -1058 -1098 -1057 -988 -968 -971 -974 -980 -986 -1005 -1023 -993 -962 -982 -1001 -1021 -1041 -1026 -1011 -999
-430 -999 -987 -933 -928 -977 -1025 -1051 -1078 -1131 -1136 -1100 -1064 -1074 -1084 -1078 -1072 -1067 -1061 -1074 -1086 -1099 -1111 -1148 -1185 -1204 -1174 -1136 -1146 -1126 -1107 -1094 -1081 -1069 -1056 -1101 -1147 -1111 -1075 -1027
-434 -1027 -979 -953 -975 -1040 -1105 -1123 -1092 -1058 -1074 -1086 -1050 -1005 -960 -994 -1027 -1043 -1059 -1075 -1091 -1090 -1090 -1089 -1089 -1060 -1031 -1002 -973 -1011 -1049 -1086 -1124 -1136 -1148 -1112 -1075 -1075 -1074
-437 -1074 -1073 -1073 -1089 -1106 -1122 -1139 -1128 -1117 -1106 -1095 -1111 -1128 -1095 -1063 -1052 -1041 -1030 -1019 -1031 -1042 -1081 -1071 -1066 -1061 -1056 -1051 -1046 -1089 -1089 -1041 -982 -1005 -1028 -1051 -1048 -1045 -1070 -1046 -1047 -1049
-441 -1049 -1096 -1142 -1156 -1169 -1134 -1098 -1081 -1063 -1094 -1124 -1152 -1180 -1159 -1138 -1157 -1177 -1196 -1216 -1196 -1175 -1155 -1135 -1105 -1075 -1065 -1029 -997 -1046 -1061 -1052 -1043 -1034 -1027 -1019 -1026 -1082 -1140
-444 -1140 -1150 -1130 -1159 -1186 -1165 -1105 -1069 -1065 -1061 -1044 -1027 -1010 -993 -979 -965 -951 -937 -963 -990 -1016 -1042 -1057 -1071 -1131 -1191 -1196 -1153 -1170 -1210 -1235 -1211 -1168 -1124 -1075 -1026 -1091
-448 -1091 -1156 -1181 -1206 -1182 -1159 -1163 -1166 -1170 -1174 -1172 -1170 -1167 -1165 -1186 -1208 -1179 -1151 -1141 -1107 -1057 -1056 -1091 -1102 -1078 -1006 -977 -998 -988 -978 -1009 -1039 -1066 -1093 -1121 -1100 -1091 -1107 -1122 -1112
-451 -1112 -1118 -1124 -1141 -1157 -1143 -1178 -1225 -1223 -1203 -1183 -1141 -1100 -1140 -1180 -1163 -1146 -1129 -1112 -1093 -1075 -1104 -1134 -1141 -1148 -1155 -1162 -1143 -1125 -1106 -1087 -1100 -1113 -1125 -1138 -1163 -1188 -1210 -1231
$$ packed form
-426a006K8lM6J7l1jjj3j3L2L3K3k5m7m7j6j7J6l3m0M1O9K0llooj9j8L0L1k0j9k0k0J5J5J2
-430i99J2N4Nm9m8k6k7n3nL6L6j0j0OONOj3j2j3j2l7l7j9L0L8j0K0J9J3J3J2J3m5m6L6L6M8
-434a027M8K6k2o5o5j8L1L4j6j2L6M5M5l4l3j6j6j6j6J%J%K9K9K9K9l8l8l7l8j2j2L6L7%J
-437a074J%j6j7j6j7J1J1J1J1j6j7L3L2J1J1J1J1j2j1l9J0NNNNNm3%M8N9k3k3k3LLk5K4jk
-441a049m7m6j4j3L5L6J7J8l1l0k8k8K1K1j9k0j9k0K0K1K0K0L0L0J0L6L2m9j5RRRPQpn6n8
-444a140j0K0k9k7K1O0L6MMJ7J7J7J7J4J4J4J4k6k7k6k6j5j4o0o0nM3j7m0k5K4M3M4M9M9o5
-448a091o5k5k5K4K3mlmmKKLKk1k2K9K8J0L4N0Jl5j1K4P2K9k1J0J0l1l0k7k7k8K1Rj6j5J0
-451a112ooj7j6J4l5m7KK0K0M2M1m0m0J7J7J7J7J9J8k9l0ppppJ9J8J9J9j3j3j2j3k5k5k2k1
$$ plain form
-455 -1231 -1241 -1203 -1194 -1186 -1147 -1157 -1167 -1129 -1093 -1058 -1068 -1079 -1101 -1123 -1097 -1071 -1076 -1081 -1086 -1091 -1121 -1151 -1181 -1212 -1176 -1139 -1106 -1073 -1074 -1123 -1144 -1166 -1196 -1226 -1253 -1280 -1265 -1202
-459 -1202 -1166 -1130 -1120 -1110 -1100 -1089 -1116 -1142 -1138 -1183 -1240 -1248 -1238 -1229 -1187 -1146 -1153 -1160 -1166 -1171 -1176 -1181 -1216 -1252 -1266 -1231 -1181 -1130 -1126 -1121 -1125 -1129 -1103 -1126 -1137 -1099 -1091 -1084 -1086 -1088 -1089 -1091 -1099 -1107 -1112
-463 -1112 -1117 -1152 -1139 -1126 -1161 -1212 -1264 -1318 -1372 -1366 -1360 -1380 -1353 -1297 -1241 -1230 -1220 -1227 -1234 -1238 -1241 -1242 -1194 -1173 -1152 -1149 -1145 -1142 -1138 -1136 -1133 -1131 -1129 -1123 -1118 -1112 -1107 -1161 -1215 -1248 -1232 -1221 -1210 -1200
-467 -1200 -1189 -1155 -1171 -1208 -1244 -1264 -1283 -1254 -1225 -1214 -1203 -1192 -1181 -1161 -1141 -1094 -1095 -1144 -1192 -1221 -1202 -1183 -1163 -1188 -1214 -1207 -1199 -1165 -1179 -1197 -1215 -1236 -1257 -1232 -1208 -1183
-470 -1183 -1159 -1214 -1268 -1272 -1227 -1218 -1258 -1294 -1282 -1275 -1267 -1257 -1247 -1226 -1206 -1185 -1165 -1173 -1181 -1188 -1196 -1203 -1209 -1215 -1222 -1216 -1210 -1204 -1198 -1188 -1178 -1167 -1157 -1167 -1177 -1187 -1197 -1213 -1230 -1246 -1263 -1259 -1255
-474 -1255 -1251 -1248 -1239 -1231 -1222 -1214 -1261 -1309 -1338 -1318 -1262 -1254 -1292 -1281 -1248 -1216 -1230 -1243 -1228 -1213 -1198 -1183 -1177 -1171 -1165 -1159 -1178 -1197 -1243 -1241 -1237 -1234 -1227 -1221 -1229 -1237 -1245 -1254 -1206 -1159 -1163 -1167 -1154 -1191 -1199 -1208
-479 -1208 -1230 -1252 -1225 -1198 -1200 -1201 -1205 -1209 -1211 -1262 -1281 -1299 -1321 -1263 -1222 -1231 -1262 -1294 -1280 -1266 -1280 -1293 -1307 -1321 -1302 -1282 -1235 -1237 -1279 -1320 -1287 -1254 -1251 -1297 -1315 -1334 -1325 -1316 -1307 -1299
-483 -1299 -1255 -1212 -1217 -1223 -1210 -1197 -1265 -1333 -1358 -1383 -1359 -1335 -1346 -1358 -1367 -1376 -1384 -1343 -1302 -1310 -1332 -1354 -1379 -1404 -1378 -1352 -1375 -1398 -1402 -1407 -1362 -1318 -1351 -1385 -1370 -1355 -1356 -1358 -1387
$$ packed form
-455a231j0L8RQL9j0j0L8L6L5j0j1k2k2K6K6nnnnl0l0l0l1L6L7L3L3jm9k1k2l0l0k7k7J5O3
-459a202L6L6J0J0J0J1k7k6Mm5n7qJ0RM2M1pponnnl5l6j4L5N0N1MNmmK6k3j1L8QPkkjkqqn
-463a112nl5J3J3l5n1n2n4n4OOk0K7N6N6J1J0ppmljM8K1K1LMLMKLKKONONn4n4l3J6J1J1J0
-467a200J1L4j6l7l6k0j9K9K9J1J1J1J1K0K0M7jm9m8k9J9J9K0k5k6PQL4j4j8j8k1k1K5K4K5
-470a183K4n5n4mM5Rm0l6J2PQJ0J0K1K0K1K0qqpqpoopOOOOJ0J0J1J0j0j0j0j0j6j7j6j7MM
-474a255MLRQRQm7m8k9K0N6Ql8J1L3L2j4j3J5J5J5J5OOOOj9j9m6KMLPOqqqrM8M7mmJ3l7qr
-479a208k2k2K7K7kjmmkn1j9j8k2N8M1rl1l2J4J4j4j3j4j4J9K0M7km2m1L3L3Lm6j8j9RRRQ
-483a299M4M3noJ3J3o8o8k5k5K4K4j1j2rrqM1M1qk2k2k5k5K6K6k3k3mnM5M4l3l4J5J5jkk9
$$ plain form
-486 -1387 -1367 -1306 -1245 -1262 -1279 -1299 -1319 -1339 -1359 -1340 -1321 -1305 -1288 -1258 -1276 -1267 -1258 -1273 -1289 -1255 -1222 -1226 -1230 -1234 -1238 -1218 -1199 -1152 -1154 -1199 -1243 -1239 -1235 -1273 -1263 -1280 -1297 -1264 -1231
-490 -1231 -1170 -1158 -1196 -1233 -1274 -1315 -1325 -1334 -1344 -1354 -1367 -1379 -1392 -1405 -1397 -1389 -1336 -1282 -1254 -1275 -1268 -1261 -1292 -1324 -1337 -1301 -1237 -1222 -1225 -1228 -1185 -1143 -1104 -1065 -1048 -1080 -1133 -1187
-494 -1187 -1236 -1286 -1284 -1282 -1317 -1304 -1269 -1235 -1248 -1261 -1228 -1195 -1204 -1261 -1291 -1321 -1337 -1353 -1369 -1384 -1359 -1333 -1307 -1281 -1328 -1374 -1367 -1310 -1294 -1277 -1230 -1232 -1260 -1288 -1319 -1350 -1361
-497 -1361 -1372 -1356 -1388 -1399 -1410 -1424 -1357 -1326 -1343 -1355 -1319 -1282 -1245 -1283 -1321 -1377 -1385 -1417 -1449 -1434 -1371 -1336 -1300 -1259 -1218 -1226 -1234 -1246 -1258 -1225 -1191 -1205 -1268 -1285 -1253 -1256
-500 -1256 -1307 -1355 -1354 -1336 -1318 -1297 -1276 -1289 -1301 -1317 -1332 -1351 -1418 -1436 -1406 -1387 -1367 -1344 -1322 -1313 -1305 -1342 -1379 -1383 -1338 -1321 -1303 -1269 -1234 -1202 -1171 -1176 -1230 -1305 -1380 -1395 -1409
$$ packed form
-486a387K0O1O1j7j7k0k0k0k0J9J9J6J7L0j8RRj5j6L4L3mmmmK0J9M7km5m4MMl8J0j7j7L3L3
-490a231O1J2l8l7m1m1j0rj0j0j3j2j3j3QQN3N4K8k1PPl1l2j3L6O4J5llM3M2L9L9J7l2n3n4
-494a187m9n0KKl5J3L5L4j3j3L3L3rn7l0l0j6j6j6j5K5K6K6K6m7m6PN7J6J7M7kk8k8l1l1j1
-497a361j1J6l2j1j1j4O7L1j7j2L6L7L7l8l8n6ql2l2J5O3L5L6M1M1qqj2j2L3L4j4o3j7L2l
-500a256n1m8JJ8J8K1K1j3j2j6j5j9o7j8L0J9K0K3K2RQl7l7mM5J7J8L4L5L2L1nn4p5p5j5j4
$$ [...]
-1241A79
##END=	
##END=	
