##TITLE=	pkl52CR.3.fid
13C NMR, crystalline 6b contaminated with 4b

##JCAMP-DX=	6.0	$$ MestReNova 14.1.1-24571
##DATA TYPE=	LINK
##BLOCK_ID=	1
##BLOCKS=	1    
##ORIGIN=	Mestrelab Research S.L.
##OWNER=	hrzepa
##$MNOVA/LINK_BLOCK_TYPE=	ITEM	$$ NMR Spectrum
##$MNOVA/ITEM/POLYGON=	(XY..XY)
5321,5835
8722,5835
8722,8208
5321,8208
5321,5835
##$MNOVA/ITEM/Z=	0
##$MNOVA/ITEM/ANGLE=	0
##TITLE=	pkl52CR.3.fid
##JCAMP-DX=	6.0	$$ MestReNova 14.1.1-24571
##BLOCK_ID=	2
##DATA TYPE=	NMR SPECTRUM
##DATA CLASS=	XYDATA
##NUMDIM=	1
##ORIGIN=	Bruker BioSpin GmbH
##OWNER=	nmrsu
##.OBSERVE FREQUENCY=	75.475294945278804448
##.OBSERVE NUCLEUS=	^13C
##.SOLVENT NAME=	C6D6
##.PULSE SEQUENCE=	zgpg30
##LONGDATE=	2019/01/25 22:14:00.000
##.ACQUISITIONMODE=	SIMULTANEOUS (DQD)
##$ORIGINAL FORMAT=	Bruker XWIN-NMR
##$MNOVA/SCALES_VERSION=	9
##$PARAMETER FILE=	(acqus, ASCII, /var/folders/f6/rjf_tdyn2v98c5c0wvkgn4s80000gn/T/uBo10NpIT3qqxGYb7zb0bA/crystalline%206b%20contaminated%20with%204b/3/acqus, 0)
$$ ##TITLE= Parameter file, TOPSPIN		Version 3.0
$$ ##JCAMPDX= 5.0
$$ ##DATATYPE= Parameter Values
$$ ##NPOINTS= 11	$$ modification sequence number
$$ ##ORIGIN= Bruker BioSpin GmbH
$$ ##OWNER= nmrsu
$$ $$ 2019-01-25 22:14:52.696 +0100  nmrsu@CZC049C5SM
$$ $$ C:/Bruker/TopSpin3.0/data/King/nmr/pkl52CR/3/acqus
$$ $$ process C:\Bruker\TopSpin3.0\prog\mod\shimcntl.exe
$$ ##$ACQT0= -1.76470580221224
$$ ##$AMP= (0..31)
$$ 100 100 100 100 100 100 100 100 100 100 100 100 100 100 100 100 100 100
$$ 100 100 100 100 100 100 100 100 100 100 100 100 100 100
$$ ##$ANAVPT= -1
$$ ##$AQSEQ= 0
$$ ##$AQ_mod= 3
$$ ##$AUNM= <au_zg>
$$ ##$AUTOPOS= <5 >
$$ ##$BF1= 75.467749
$$ ##$BF2= 300.13
$$ ##$BF3= 75.467749
$$ ##$BF4= 75.467749
$$ ##$BF5= 75.467749
$$ ##$BF6= 75.467749
$$ ##$BF7= 75.467749
$$ ##$BF8= 75.467749
$$ ##$BYTORDA= 0
$$ ##$CAGPARS= (0..11)
$$ 0 0 0 0 0 0 0 0 0 0 0 0
$$ ##$CFDGTYP= 0
$$ ##$CFRGTYP= 9
$$ ##$CHEMSTR= <none>
$$ ##$CNST= (0..63)
$$ 1 1 145 1 1 1 1 1 1 1 1 1 1 1 1 1 1 1 1 1 1 1 1 1 1 1 1 1 1 1 1 1 1 1 1
$$ 1 1 1 1 1 1 1 1 1 1 1 1 1 1 1 1 1 1 1 1 1 1 1 1 1 1 1 1 1
$$ ##$CPDPRG= <>
$$ ##$CPDPRG1= <>
$$ ##$CPDPRG2= <waltz16>
$$ ##$CPDPRG3= <>
$$ ##$CPDPRG4= <mlev16>
$$ ##$CPDPRG5= <mlev16>
$$ ##$CPDPRG6= <mlev16>
$$ ##$CPDPRG7= <mlev16>
$$ ##$CPDPRG8= <mlev16>
$$ ##$D= (0..63)
$$ 0 2 0 0 0 0 0 0 0 0 0 0.03 0 0 0 0 0.0002 0 0 0 0 0 0 0 0 0 0 0 0 0 0 0
$$ 0 0 0 0 0 0 0 0 0 0 0 0 0 0 0 0 0 0 0 0 0 0 0 0 0 0 0 0 0 0 0 0
$$ ##$DATE= 1548450891
$$ ##$DBL= (0..7)
$$ 120 120 120 120 120 120 120 120
$$ ##$DBP= (0..7)
$$ 150 150 150 150 150 150 150 150
$$ ##$DBPNAM0= <>
$$ ##$DBPNAM1= <>
$$ ##$DBPNAM2= <>
$$ ##$DBPNAM3= <>
$$ ##$DBPNAM4= <>
$$ ##$DBPNAM5= <>
$$ ##$DBPNAM6= <>
$$ ##$DBPNAM7= <>
$$ ##$DBPOAL= (0..7)
$$ 0.5 0.5 0.5 0.5 0.5 0.5 0.5 0.5
$$ ##$DBPOFFS= (0..7)
$$ 0 0 0 0 0 0 0 0
$$ ##$DE= 12
$$ ##$DECBNUC= <off>
$$ ##$DECIM= 1109.33333333333
$$ ##$DECNUC= <off>
$$ ##$DECSTAT= 4
$$ ##$DIGMOD= 1
$$ ##$DIGTYP= 12
$$ ##$DL= (0..7)
$$ 0 120 120 120 120 120 120 120
$$ ##$DP= (0..7)
$$ [...]
$$ ##$RX22TY= <no>
$$ ##$RXFMAX= (0..7)
$$ 432.5 -1 -1 -1 -1 -1 -1 -1
$$ ##$RXFMIN= (0..7)
$$ 5 -1 -1 -1 -1 -1 -1 -1
$$ ##$RXINTLV= (0..7)
$$ 1 0 0 0 0 0 0 0
$$ ##$RXMSTY= <no>
$$ ##$SCMTY= <no>
$$ ##$SGUC1= (0..15)
$$ 18 19 0 0 0 0 0 0 0 0 0 0 0 0 0 0
$$ ##$SGUC2= (0..15)
$$ 33 256 0 0 0 0 0 0 0 0 0 0 0 0 0 0
$$ ##$SPECTR= 10
$$ ##$SY2FLAG= 0
$$ ##$SYNCTRIG= 11
$$ ##$ShimPowMaxUA= (0..63)
$$ 130000 130000 130000 130000 130000 130000 130000 130000 130000 130000 130000
$$ 130000 130000 130000 130000 130000 130000 130000 130000 130000 0 0 0 0
$$ 0 0 0 0 0 0 0 0 0 0 0 0 0 0 0 0 0 0 0 0 0 0 0 0 0 0 0 0 0 0 0 0 0 0 0 0
$$ 0 0 0 0
$$ ##$ShimPowMaxUC= (0..63)
$$ 130000 130000 130000 130000 130000 130000 130000 130000 130000 130000 130000
$$ 130000 130000 130000 130000 130000 130000 130000 130000 130000 0 0 0 0
$$ 0 0 0 0 0 0 0 0 0 0 0 0 0 0 0 0 0 0 0 0 0 0 0 0 0 0 0 0 0 0 0 0 0 0 0 0
$$ 0 0 0 0
$$ ##$ShimPowMaxUG= (0..63)
$$ 524287 524287 524287 524287 524287 524287 524287 524287 524287 524287 524287
$$ 524287 524287 524287 524287 524287 524287 524287 524287 524287 0 0 0 0
$$ 0 0 0 0 0 0 0 0 0 0 0 0 0 0 0 0 0 0 0 0 0 0 0 0 0 0 0 0 0 0 0 0 0 0 0 0
$$ 0 0 0 0
$$ ##$ShimPowRcbType= 3
$$ ##$ShimPowRes= (0..63)
$$ 1e-020 1e-020 1e-020 1e-020 1e-020 1e-020 1e-020 1e-020 1e-020 1e-020 1e-020
$$ 1e-020 1e-020 1e-020 1e-020 1e-020 1e-020 1e-020 1e-020 1e-020 0 0 0 0
$$ 0 0 0 0 0 0 0 0 0 0 0 0 0 0 0 0 0 0 0 0 0 0 0 0 0 0 0 0 0 0 0 0 0 0 0 0
$$ 0 0 0 0
$$ ##$ShimPowRng0= (0..63)
$$ 1 1 1 1 1 1 1 1 1 1 1 1 1 1 1 1 1 1 1 1 0 0 0 0 0 0 0 0 0 0 0 0 0 0 0 0
$$ 0 0 0 0 0 0 0 0 0 0 0 0 0 0 0 0 0 0 0 0 0 0 0 0 0 0 0 0
$$ ##$ShimPowRng1= (0..63)
$$ 1 1 1 1 1 1 1 1 1 1 1 1 1 1 1 1 1 1 1 1 0 0 0 0 0 0 0 0 0 0 0 0 0 0 0 0
$$ 0 0 0 0 0 0 0 0 0 0 0 0 0 0 0 0 0 0 0 0 0 0 0 0 0 0 0 0
$$ ##$ShimPowRng2= (0..63)
$$ 1 1 1 1 1 1 1 1 1 1 1 1 1 1 1 1 1 1 1 1 0 0 0 0 0 0 0 0 0 0 0 0 0 0 0 0
$$ 0 0 0 0 0 0 0 0 0 0 0 0 0 0 0 0 0 0 0 0 0 0 0 0 0 0 0 0
$$ ##$ShimPowRng3= (0..63)
$$ 1 1 1 1 1 1 1 1 1 1 1 1 1 1 1 1 1 1 1 1 0 0 0 0 0 0 0 0 0 0 0 0 0 0 0 0
$$ 0 0 0 0 0 0 0 0 0 0 0 0 0 0 0 0 0 0 0 0 0 0 0 0 0 0 0 0
$$ ##$ShimSysFunc= (0..63)
$$ 1 2 3 4 5 7 9 11 15 16 8 10 12 14 6 17 13 18 19 20 0 0 0 0 0 0 0 0 0 0
$$ 0 0 0 0 0 0 0 0 0 0 0 0 0 0 0 0 0 0 0 0 0 0 0 0 0 0 0 0 0 0 0 0 0 0
$$ ##$ShimSysMatrix= 0
$$ ##$ShimSysType= 1
$$ ##$TFXNUM= 0
$$ ##$TRIPLO2= 0
$$ ##$VTU= 2
$$ ##$VTUETH= <149.236.99.20>
$$ ##$VTUTY= <no>
$$ ##$WBREFAM= (0..15)
$$ 20.9 49.1 100 100 100 100 100 100 100 100 100 100 100 100 100 100
$$ ##$WBREFLM= (0..15)
$$ 0 0 0 0 0 0 0 0 0 0 0 0 0 0 0 0
$$ ##$WBREFPH= (0..15)
$$ 72.55 -68.79 0 0 0 0 0 0 0 0 0 0 0 0 0 0
$$ ##$XFAC= 2
$$ ##END=
$$ 
##$DECIM=	1109.33333333333
##$DSPFVS=	20
##XUNITS=	HZ
##YUNITS=	ARBITRARY UNITS
##FIRSTX=	16560.368355729809991
##LASTX=	-1468.2026997558882613
##DELTAX=	-0.27509836050180358491
##XFACTOR=	1
##YFACTOR=	1.1294458862905922825
##FIRSTY=	0.45025634765625
##MINY=	-442.33074951171875
##MAXY=	141262.515625
##NPOINTS=	65536
##XYDATA=	(X++(Y..Y))
$$ [...]
14721 51 -3 -57 -8 41 44 47 80 113 126 93 35 -23 -81 -140 -168 -150 -112 -74 -63 -52 -58 -110 -156 -156 -140 -123 -100 -78 -12 52 90 81 22 -81 -104 -51 0
14711 0 -26 -56 -85 -74 -63 -42 -21 -1 19 8 -2 -11 -19 -40 -14 10 -10 -29 -48 -70 -92 -102 -111 -121 -131 -111 -91 -74 -57 -24 -37 -100 -163 -172 -181 -187 -193 -192 -145
14700 -145 -78 -10 18 48 147 199 159 72 25 25 -2 -77 -148 -174 -134 -95 -81 -144 -194 -167 -85 -50 -16 18 3 -10 -32 -53 -74 -95 -63 -32 -46 -60 -113
14691 -113 -166 -220 -273 -201 -129 -57 14 44 73 27 -19 -67 -115 -116 -118 -165 -212 -213 -214 -163 -113 -62 -12 -67 -123 -133 -143 -128 -113 -144 -176 -178 -180 -183 -185 -168 -150 -133
14680 -133 -115 -78 -42 -5 31 17 4 -8 -21 -46 -71 -50 -29 6 41 31 -24 -100 -98 -68 -85 -103 -76 -77 -79 -103 -128 -106 -85 -74 -63 -99 -134 -106 -78 -50
14670 -50 -22 -43 -65 -87 -108 -95 -82 -69 -57 -75 -94 -113 -131 -105 -79 -98 -118 -123 -128 -132 -137 -123 -109 -94 -80 -120 -161 -155 -150 -110 -70 -76 -82 -85 -88 -91 -94 -45 2 -25 -53
14659 -53 -50 -47 -45 -42 -113 -184 -231 -185 -130 -74 -90 -106 -118 -131 -98 -64 -43 -22 -1 19 61 102 36 -29 -92 -156 -112 -68 -19 30 79 129 81 34 -13 -60 -35
14649 -35 -9 15 40 56 73 89 105 110 115 73 32 58 83 63 43 23 4 -14 -34 18 70 128 95 73 52 25 -1 -10 -19 -28 -37 -55 -72 -90 -108 -129 -150 -125
14638 -125 -100 -86 -73 -59 -46 -59 -73 -40 -8 -31 -54 -77 -100 -85 -70 -101 -133 -197 -262 -220 -177 -113 -49 -61 -74 -75 -76 23 124 188 161 108 56 15 -25
14629 -25 -20 -14 25 66 51 -55 -120 -185 -178 -172 -134 -95 -102 -110 -161 -212 -193 -173 -75 -68 -114 -115 -48 -27 -23 -19 -11 -4 3 10 -16 -43 6 56 80 104 129 153 178 204 152
14617 152 101 57 12 14 15 -59 -134 -132 -130 -115 -100 -131 -162 -135 -109 -82 -56 -48 -39 -31 -23 35 94 15 -63 -66 -69 -71 -74 -20 33 10 -12 -38 -63 -43 -23 1 25 49
14606 49 73 86 100 113 127 65 3 -13 -29 -8 13 34 55 43 30 94 159 171 183 118 54 79 104 130 155 136 116 96 77 73 70 67 64 77 91 59 27
14596 27 11 -3 20 44 -16 -170 -247 -232 -138 -44 -20 2 -19 -41 -64 -86 -45 -5 -10 -15 -23 -32 -40 -49 -15 17 5 -6 -33 -60 -87 -115 -69 -24 -2 19 73
14586 73 126 134 141 163 184 186 142 69 -3 -81 -114 -93 -73 -72 -72 -66 -60 -32 -3 48 99 131 117 38 -39 -100 -115 -111 -107 -78 -48 -30 -12 -18 -23 -51 -80 -108 -136 -174
14575 -174 -212 -202 -146 -106 -112 -135 -158 -158 -157 -133 -110 -93 -77 -61 -44 -37 -31 -44 -103 -166 -228 -214 -199 -191 -137 -114 -90 -148 -282 -387 -385 -316 -247 -194 -142 -140 -139 -89
14565 -89 5 33 15 26 38 67 97 50 -42 -91 -64 -16 -46 -76 -107 -140 -172 -185 -152 -71 8 68 82 45 8 -38 -86 -133 -181 -158 -136 -68 0 15 31
14555 31 27 -23 -74 -125 -133 -142 -121 -100 -3 93 85 77 23 -30 -23 -17 -57 -96 -157 -219 -142 -65 -18 27 51 75 59 44 29 14 26 38 3 -30 -56 -82 -121 -207
14544 -207 -276 -237 -196 -231 -269 -308 -305 -303 -261 -219 -177 -135 -94 -54 -59 -64 -90 -116 -96 -30 -10 -65 -144 -177 -182 -141 -47 47 77 108 92 76 115 154 117 79 15
14534 15 -49 -37 -25 -3 18 -35 -90 -82 -75 -90 -106 -149 -193 -214 -235 -205 -175 -99 -23 -23 -22 23 69 69 70 29 -11 -93 -99 -38 67 155 197 187 131 66 1 -63
14524 -63 -128 -127 -80 -13 -23 -46 -24 14 -22 -82 -66 -51 -37 -49 -62 -75 -87 -64 -41 -17 5 8 11 -8 -28 -37 -46 -9 27 52 77 58 40 41 89 153 142 117
14513 117 92 109 125 153 181 164 146 129 112 95 78 16 -44 -29 -14 -19 -24 -6 11 20 30 40 50 -8 -67 -126 -184 -188 -193 -197 -201 -130 -60 -35 -11 -40 -69 -98
14503 -98 -127 -193 -259 -187 -115 -80 -45 29 105 149 115 23 -69 -71 3 37 26 29 33 34 34 -56 -148 -193 -239 -218 -198 -177 -156 -144 -132 -120 -108 -132 -156 -179 -203
14493 -203 -166 -130 -91 -129 -177 -148 -90 -33 10 54 52 50 30 11 15 19 14 8 -42 -93 -102 -110 -119 -128 -82 -36 9 55 83 112 140 168 161 154 146 139 84 28 80 132 126 121
14481 121 92 63 38 12 9 6 -47 -102 -156 -211 -202 -194 -144 -49 77 51 -53 -159 -151 -143 -136 -128 -119 -111 -102 -93 -97 -101 -105 -108 -158 -208 -181 -154 -115 -77 -84 -92 -46 0 0 0 11
14469 11 23 -10 -45 -92 -140 -111 -82 -35 11 -18 -47 -106 -164 -146 -128 -63 1 17 -59 -145 -140 -55 -17 0 65 126 142 81 21 -23 24 67 18 -22 -16 5
14459 5 27 7 -13 -70 -127 -107 -88 -86 -84 -82 -80 -72 -63 -32 0 2 5 -37 -79 16 111 100 89 90 91 47 -42 -109 -84 -41 -44 -34 -24 -39 -54 -60 -67 -73 -79 -59 -40 -21 -1
14448 -1 16 35 54 73 50 26 3 -19 -26 -32 -39 -45 -71 -97 -123 -148 -181 -214 -247 -280 -272 -263 -255 -247 -131 -15 5 -49 -92 -135 -183 -231 -214 -197 -134 -71 -36 0
14437 0 -9 -19 -10 -1 7 17 -12 -42 -26 -10 84 179 197 215 153 91 29 -32 -34 -36 -38 -39 10 61 78 19 -33 -86 -98 -110 -100 -90 -80 -70 -111 -152 -146 -141 -92 -43
14426 -43 -70 -97 -105 -113 -121 -129 -95 -61 -27 6 -18 -44 7 58 55 51 48 45 18 -8 -34 -61 -89 -117 -68 -19 -23 -28 -32 -37 -43 -50 -56 -63 -40 -18 -70 -169 -222 -168 -85 -79 -64
14414 -64 -2 28 60 34 9 -61 -133 -140 -147 -152 -156 -97 8 114 173 134 95 54 12 -52 -117 -100 -38 -9 19 48 77 34 -52 -84 -39 -28 -63 -93 -77 9
14404 9 95 78 60 38 16 -5 -27 -55 -83 -91 -52 -17 17 12 7 -25 -12 17 48 118 143 120 97 46 42 57 72 78 84 87 90 128 120 60 1 5 9 -4 -64 -68 -26
14393 -26 -13 0 -27 -55 -109 -117 -93 -70 -46 -22 -13 -50 -61 -72 -99 -126 -103 -33 0 33 95 111 85 60 31 2 1 0 0 0 12 26 22 -27 -65 -57 -7 -2 -16
14382 -16 -30 -45 -59 -81 -57 -33 -56 -102 -148 -151 -154 -143 -132 -95 -104 -130 -155 -138 -120 -45 28 96 164 177 82 2 -77 -156 -234 -262 -244 -247 -251 -252 -253 -243 -234 -222 -209
14372 -209 -214 -173 -112 -50 -63 -76 -63 -97 -117 -138 -204 -271 -307 -297 -310 -324 -318 -266 -239 -213 -153 -92 -80 -113 -117 -76 -35 -39 -23 39 98 112 66 21 -7 10
14362 10 46 82 147 166 140 115 87 59 72 84 97 109 93 77 17 -41 -57 -26 49 79 104 128 145 162 152 66 -20 -30 11 53 18 -62 -112 -161 -211
14352 -211 -261 -296 -286 -255 -225 -193 -162 -131 -100 -72 -44 -62 -80 -103 -127 -134 -94 -29 -10 -41 -73 -51 -75 -102 -83 -72 -106 -109 -112 -115 -71 -56 -41 -27 -59 -66 -72
14342 -72 -61 -50 -54 -104 -117 -53 36 79 63 47 28 9 -21 -51 -82 -112 -133 -154 -144 -58 12 37 47 56 49 42 35 28 -7 -44 -81 -117 -77 -36 4 44 25 5
14332 5 -14 -33 -94 -155 -139 -123 -108 -94 -79 -64 -73 -83 -92 -102 -56 -11 -43 -74 -47 -19 7 35 29 23 62 102 122 142 116 90 93 95 98 101 88 76 63 51 43 36
14321 36 28 21 6 -7 54 117 127 138 103 67 50 34 17 0 65 131 163 118 50 -18 -14 -10 -33 -55 -77 -99 -84 -68 -11 45 82 43 2 -39 -42 -44 -1 42
14310 42 83 125 120 116 112 109 29 -51 -35 -19 -45 -71 -125 -102 -50 -45 -90 -135 -184 -232 -226 -221 -257 -292 -300 -232 -104 -21 -31 -41 -8 24 4 -15 -57 -100 -65 -29
14300 -29 -39 -50 -60 -69 -79 -89 -43 2 -28 -59 -58 -57 -56 -55 -52 -49 -46 -42 -58 -74 -90 -106 -106 -106 -105 -105 -99 -93 -46 0 71 66 32 44 47 49 32 14 30 46 39 32 -55 -144 -156
14287 -156 -167 -183 -200 -259 -241 -200 -159 -113 -67 -42 -18 -40 -62 -21 19 37 55 63 70 32 -5 16 37 35 33 22 11 46 80 94 109 77 45 17 -11 -39
14277 -39 -68 -94 -120 -69 -19 24 68 89 111 113 115 72 28 3 -21 -1 19 -18 -55 -69 -84 -103 -123 -99 -75 -58 -86 -118 -103 -60 -62 -113 -163 -166 -169 -126 -83
14267 -83 -19 44 85 126 148 170 212 254 210 119 14 -91 -146 -125 -70 -15 -22 -29 -13 2 -23 -50 -73 -97 -120 -98 -101 -105 -114 -123 -129 -136 -91 0 61 46 1 -43
14257 -43 -72 -56 -68 -80 -93 -59 -9 40 48 55 73 92 107 123 112 55 23 -7 -22 -36 -80 -77 -20 -9 -13 -17 -33 -3 49 56 -1 -59 -97 -135 -116 -96 -77 -58
14246 -58 -66 -74 -60 -45 -73 -101 -83 -65 -73 -81 -66 -50 -20 10 41 71 54 36 18 1 1 0 29 12 -6 20 45 23 -39 -101 -169 -192 -132 -73 -87 -101 -48 5
14236 5 12 20 14 8 2 -3 -24 -45 -66 -88 -125 -162 -200 -237 -287 -336 -383 -353 -304 -255 -247 -239 -252 -266 -203 -141 -66 7 -25 -58 -99 -140 -222 -304 -307 -233 -202 -172 -159 -147
14225 -147 -134 -122 -124 -126 -82 -38 -72 -106 -139 -173 -159 -145 -131 -117 -60 -4 98 200 206 211 141 70 12 -45 -27 -8 -12 -15 -65 -114 -99 -83 -68 -52 -17 18
14215 18 7 -2 -97 -192 -240 -289 -264 -238 -166 -94 -30 33 20 7 -34 -76 -73 -69 -98 -127 -155 -184 -114 -45 -21 2 -50 -102 -78 -55 -39 -24 -9 5 17 29
14205 29 -35 -100 -138 -176 -215 -253 -268 -283 -253 -222 -201 -180 -159 -137 -112 -87 -78 -114 -153 -115 -98 -127 -97 -67 -87 -106 -145 -184 -147 -110 -144 -178 -166 -154 -124
14195 -124 -94 -18 57 93 129 166 202 186 171 109 48 0 -48 -97 -145 -49 46 34 23 -68 -160 -191 -145 -68 -36 -51 -66 -63 -60 -58 -55 -69 -83 -96 -110 -92
14185 -92 -73 -55 -36 -4 28 15 2 -6 -14 -23 -32 -42 -53 -17 17 -16 -51 -85 -120 -105 -89 -74 -59 -52 -46 -55 -110 -151 -115 -53 -37 0 38 74 109 80 50 20
14175 20 -8 27 64 55 46 -2 -50 -99 -147 -159 -171 -183 -195 -151 -106 -61 -17 -63 -108 -95 -5 67 64 31 0 14 28 43 58 75 91 62 33 47 61 74
14165 74 88 105 121 62 2 -34 -70 -61 -5 2 -66 -151 -161 -133 -59 16 46 33 -25 -61 -97 -86 -76 -66 -56 -65 -73 -104 -136 -154 -172 -144 -116 -106 -97 -88 -78 -71
14155 -71 -64 -100 -137 -121 -59 18 20 -78 -176 -173 -170 -77 14 73 56 16 -23 -67 -112 -96 -80 -65 -49 -40 -32 -23 -14 -11 -8 -5 -3 -19 -36 -52 -69 -46 -24 -16 -55 -110 -88
14143 -88 -36 16 54 93 108 123 175 227 202 178 121 65 32 -1 35 71 64 57 34 56 52 -27 -94 -116 -122 -129 -184 -239 -187 -135 -121 -107 -48 11 49 86 100
14133 100 115 90 65 86 107 99 90 9 -72 -116 -114 -61 -8 18 45 72 99 112 125 135 145 158 125 43 -37 -59 -36 -32 -75 -118 -115 -140 -166 -173 -180 -188 -195 -144 -94
14122 -94 -47 0 14 -18 -24 -31 -14 2 -27 -102 -172 -165 -101 -83 -72 -60 -25 -36 -62 -88 -74 -60 -49 -83 -68 -54 -83 -111 -94 -31 25 5 -42 -90 -99 -61 -27
14112 -27 7 -1 -11 -26 4 33 15 27 39 65 92 118 144 135 126 73 20 33 92 124 157 151 144 112 126 114 102 92 83 31 -21 -73 -126 -90 -55 2 60 91
14102 91 122 107 93 105 117 107 96 94 92 68 43 33 23 35 48 58 68 32 -3 -28 -54 -79 -104 -102 -100 -50 0 17 80 97 68 57 46 -41 -129 -175 -176
14092 -176 -157 -137 -87 -37 -64 -91 -129 -167 -129 -45 1 -28 -38 -1 30 61 70 79 75 25 -72 -170 -253 -291 -277 -264 -227 -190 -110 -30 40 65 8 -47 -5 36
14082 36 55 74 37 1 -54 -110 -108 -60 -35 -57 -42 -28 -39 -51 -74 -98 -102 -105 -85 -110 -158 -160 -109 -58 -25 -37 -25 -13 18 50 59 68 54 40 24 9 -3 -16
14071 -16 -27 7 59 111 101 45 15 -14 -54 -93 -158 -177 -128 -79 -70 -61 -68 -29 54 93 63 32 45 57 70 83 101 74 14 0 4 8 47 87 81 75 98 120
14061 120 143 165 154 142 130 119 111 104 96 89 108 126 122 117 27 -62 -106 -150 -144 -137 -130 -124 -180 -235 -214 -194 -125 -57 -35 -13 4 22 -35 -93 -110 -126 -97 -67 -42
14050 -42 -18 -39 -60 -25 10 45 80 97 115 29 -55 -73 -14 -19 -69 -95 -122 -108 -94 -61 -73 -105 -61 22 60 53 45 63 81 22 -35 -21 -6 -15 -23 -40 -56
14040 -56 -27 1 43 86 82 78 81 84 11 -62 -93 -124 -109 -94 -93 -91 -67 -42 -26 -9 -39 -68 -129 -189 -204 -218 -209 -199 -144 -43 60 87 -8 -104 -171 -238 -198
14030 -198 -158 -163 -168 -173 -178 -155 -131 -107 -84 -25 33 15 -1 -13 -25 -37 -49 -24 0 -20 -41 -65 -90 -115 -139 -133 -127 -164 -201 -247 -247 -199 -151 -128 -151 -174 -152 -139
14019 -139 -125 -155 -185 -185 -185 -185 -185 -168 -152 -109 -113 -149 -184 -203 -175 -134 -93 -49 -5 -7 -10 16 -2 -41 -33 -54 -76 -72 -68 -64 -60 -65 -70 -92 -160 -268 -329 -280 -185 -93 -48
14008 -48 -81 -160 -210 -184 -127 -69 -45 -20 -42 -63 -58 -52 -47 -42 -10 22 54 86 134 182 180 131 107 82 55 27 32 37 -3 -44 -85 -127 -122 -117 -110 -103 -96 -89 -95 -101 -151 -200
13996 -200 -200 -155 -135 -115 -107 -99 -88 -76 -29 63 128 193 195 151 57 -36 -37 -37 -37 -38 -14 10 34 59 50 40 -14 -115 -166 -141 -133 -171 -176 -135 -123 -111 -69 -27 14
13986 14 56 44 32 20 7 12 17 -22 -63 -68 -73 -32 7 -6 -21 -81 -142 -106 -71 -82 -92 -133 -173 -167 -161 -123 -84 -45 -7 -15 -23 14 51 51 51 -20 -92 -124 -80 -5
13975 -5 24 17 56 92 83 58 33 5 -22 -68 -115 -115 -115 -78 -41 -50 -59 -67 -76 -38 -1 -34 -67 -101 -134 -121 -109 -96 -84 -73 -62 -98 -133 -159 -185 -104 -23 -14 -5 4 13
13963 13 14 15 62 109 86 62 41 97 167 238 280 245 139 34 -30 -94 -73 -51 -30 -8 -18 -28 -38 -49 -86 -123 -161 -198 -247 -296 -268 -240 -160 -80 -45
13954 -45 -11 14 40 68 19 -72 -88 -75 -62 -46 -29 -12 4 -8 -22 -20 27 66 28 -9 -47 -45 -43 -41 -39 1 43 84 125 114 103 91 80 50 19 -10 -41
13944 -41 4 50 96 143 167 191 138 86 112 139 166 192 169 146 123 100 102 104 61 17 -45 -109 -96 -83 -8 66 96 125 94 63 31 0 -30 -61 -47 13
13934 13 49 9 -29 -69 -50 -32 32 97 76 55 34 12 11 10 9 8 -4 -16 -29 -42 -30 -19 -7 3 11 19 -18 -57 -77 -98 -43 12 45 78 64 51 38 26
13923 26 59 93 43 -6 -56 -106 -64 -21 -55 -88 -65 -41 -63 -86 -61 -36 -9 18 -1 23 97 170 180 144 62 26 13 1 -7 -17 -42 -67 -46 -25 -5
13914 -5 14 -11 -38 -101 -164 -177 -143 -91 -38 16 72 110 148 110 72 34 -2 -40 -77 -86 -95 -130 -119 -79 -40 0 39 34 -15 -109 -156 -145 -87 -55 -23 -22 -67
13903 -67 -132 -120 -94 -114 -103 -92 -63 -34 20 29 36 44 3 -37 -1 34 23 13 14 15 17 18 18 19 19 19 6 -7 -95 -183 -222 -216 -207 -244 -256 -222 -191 -205 -222 -238 -211
13892 -211 -185 -178 -172 -119 -143 -216 -242 -249 -209 -184 -159 -102 -91 -137 -136 -88 -39 -50 -61 -72 -83 -48 -12 23 59 53 47 15 29 59 89 76 63 95 127 159 191
13882 191 150 109 67 26 -28 -83 -110 -137 -167 -121 -20 34 25 -60 -103 -70 -55 -40 -67 -94 -86 -78 -24 29 47 65 38 10 10 9 9 8 13 18 0 -18 -49 -80
13872 -80 -66 -51 -57 -62 -68 -73 -103 -133 -118 -102 -60 -19 -1 17 24 31 39 46 35 23 12 1 -11 -23 -59 -95 -133 -171 -133 -94 -83 -71 -83 -94 -80 -65 25 117 135
13861 135 154 96 37 34 30 49 68 54 39 24 9 -1 -12 -100 -188 -197 -206 -139 -71 -77 -84 -113 -142 -161 -181 -154 -128 -82 -36 -14 8 -25 -59 -93 -127 -88 -49
13851 -49 -10 29 20 12 -18 -49 -143 -237 -254 -271 -299 -326 -307 -288 -307 -325 -297 -269 -204 -139 -74 -9 -6 -2 46 95 42 -9 -61 -114 -116 -119 -45 28 36 45 7 -29 -78
13840 -78 -128 -154 -180 -212 -244 -230 -216 -177 -138 -77 -15 -22 -30 -83 -137 -160 -184 -161 -139 -184 -230 -270 -311 -309 -231 -150 -70 -40 -10 -26 -43 -87 -132 -154 -176 -187
13830 -187 -198 -163 -127 -93 -58 -101 -143 -130 -118 -105 -93 -90 -88 -40 7 -41 -91 -117 -144 -116 -89 -84 -79 -95 -110 -125 -141 -108 -75 -42 -9 19 48 0 -47 -37
13820 -37 -26 29 85 60 36 -30 -98 -112 -81 -73 -143 -230 -241 -195 -195 -242 -244 -226 -254 -257 -260 -220 -180 -100 -20 -17 -13 -69 -124 -133 -143 -141 -138 -113 -88 -118 -147 -200 -252 -207
13809 -207 -162 -116 -71 -44 -16 11 38 83 128 96 64 68 72 99 126 81 35 -9 -54 -79 -104 -106 -108 -27 54 89 124 124 123 52 -18 -88 -65 -17 29 -15 -59
13799 -59 -81 -103 -56 -8 -12 -16 -28 -133 -237 -249 -217 -184 -100 -17 21 60 53 46 47 47 2 -43 -94 -145 -151 -156 -146 -136 -172 -209 -186 -164 -142 -120 -134 -148 -116 -84
13788 -84 -71 -58 -45 -32 -19 -7 -70 -134 -118 -101 -84 -68 -93 -118 -97 -76 -16 43 27 10 0 -12 21 55 72 89 29 -29 -83 -136 -113 -90 -35 18 50
13779 50 82 53 23 17 11 -36 -83 -108 -133 -72 -11 2 17 22 27 32 37 -17 -71 -92 -36 16 70 83 95 64 32 106 226 302 272 197 123 140 157 174 191
13769 191 230 269 201 133 67 1 -18 -39 -53 -68 -36 -5 65 135 68 0 -63 -128 -159 -113 -19 74 96 118 69 20 18 15 -8 -32 -10 11 37 63 13
13759 13 -37 -92 -148 -157 -166 -150 -133 -93 -53 -1 51 57 63 35 6 54 102 114 126 137 149 147 144 95 47 7 -31 5 42 50 58 43 29 24 20 -6 -33 4 42 35
13748 35 27 15 4 15 26 -50 -127 -158 -190 -171 -153 -88 -24 -32 -40 -48 -57 -35 -13 8 30 -23 -76 -115 -107 -58 -85 -159 -156 -139 -168 -167 -166 -133 -100 -144 -187 -225 -263
13737 -263 -225 -186 -164 -142 -119 -97 -63 -30 3 37 51 65 2 -59 -39 -19 0 19 64 108 106 104 -5 -116 -95 32 128 117 101 131 120 108 54 0
13728 0 17 35 52 69 86 102 73 43 2 -39 -35 -31 -29 -26 -24 -22 -44 -67 -89 -111 -131 -151 -170 -190 -175 -161 -101 -41 -18 4 27 50 18 -12 -43 -75 -72 -69 -66 -63
13717 -63 -46 -29 -12 4 37 70 26 -16 -75 -134 -193 -251 -184 -116 -64 -58 -88 -42 29 101 144 110 73 36 6 -22 -51 -81 -25 30 52 -1 -45 -88 -137
13707 -137 -185 -232 -279 -249 -219 -128 -38 51 142 141 140 140 139 130 122 113 104 127 150 97 43 3 -35 -74 -114 -85 -57 -28 0 -3 -7 -11 -14 -47 -79 -66 -52 -89 -125 -116 -107
13696 -107 -75 -44 -58 -73 -54 -35 -21 -8 24 -33 -86 -138 -137 -136 -89 -42 -43 -45 0 43 26 8 -2 -14 -83 -60 -12 35 48 61 75 88 72 56 40 23
13686 23 -13 -51 -89 -127 -84 -41 1 43 15 -12 -40 -68 -77 -86 -95 -104 -137 -170 -203 -235 -165 -94 -75 -56 -28 -93 -151 -210 -224 -239 -208 -176 -173 -170 -121 -72 -96 -120
13676 -120 -144 -168 -159 -150 -141 -133 -102 -71 -40 -10 -43 -76 -66 -56 -47 -83 -94 -28 13 9 30 97 157 172 169 167 173 180 186 193 161 129 97 64 81 98 92 86 56 26 72
13664 72 118 128 137 147 157 165 174 137 99 27 -44 -70 -96 -28 40 32 24 37 50 63 76 125 173 173 173 130 40 -19 -3 8 20 -8 -37 -65 -94 -76 -59 13
13654 13 85 81 77 66 55 20 -13 -33 -54 -74 -95 -89 -84 -79 -73 -57 -40 -23 -6 -1 4 9 15 63 112 84 56 44 31 19 7 -15 -38 -61 -84 -69 -54 -42 -30 -61
13643 -61 -138 -208 -203 -141 -80 -60 -40 -47 -55 -39 -24 -33 -41 -50 -58 -21 15 93 171 162 77 -34 -99 -112 -78 -22 33 5 -22 -4 13 54 95 29 -36 -75 -114 -82
13632 -82 -49 -61 -149 -236 -248 -220 -192 -159 -126 -93 -60 -27 5 17 30 43 56 51 46 -1 -49 -52 -8 32 -3 -44 -38 -63 -87 -58 -28 1 31 40 49 11 -25 -76
13622 -76 -128 -133 -139 -75 -10 53 117 167 218 192 165 83 1 -4 -10 -20 -30 -17 -4 -57 -110 -137 -164 -134 -57 -7 -33 -106 -133 -84 -35 6 47 89 130 139 148 111
13612 111 74 44 14 -14 -44 -20 3 51 98 71 45 -27 -99 -96 -93 -44 4 -5 -15 -1 11 -7 -25 -21 -16 -5 5 -29 -64 -52 -40 -51 -62 -100 -138 -69 0
13601 0 33 68 102 136 131 125 120 115 63 10 -41 -93 -66 -39 -84 -129 -154 -103 -50 -73 -110 -101 -20 13 -34 -81 -98 -39 7 54 60 65 52 38 25 12 7 3 -1 -5 42
13590 42 91 93 95 62 28 -5 -39 -56 -73 -91 -108 -99 -89 -48 -54 -78 -26 25 76 102 127 106 85 7 -70 -102 -135 -92 -50 -53 -57 -43 -29 -16 -2 2 7 12 17 -45
13579 -45 -108 -172 -235 -223 -212 -129 -46 34 38 -33 -29 21 72 127 182 211 240 192 144 118 91 111 54 -62 -132 -95 -58 -66 -74 -81 -89 -108 -127 -101 -74 -54 -34
13569 -34 -13 6 -2 -11 -19 -28 40 110 102 95 27 -40 -74 -32 -8 15 43 72 58 45 31 17 40 63 9 -44 -134 -225 -208 -191 -171 -152 -133 -113 -73 -33 -38 -44 -60
13558 -60 -76 -92 -108 -100 -92 -84 -76 -51 -25 0 24 -3 -30 -12 6 -16 -39 -61 -84 -41 2 0 -3 -35 -68 -54 -41 -37 -33 -29 -26 -63 -100 -137 -174 -126 -78 -107 -136 -137
13547 -137 -138 -138 -139 -139 -139 -139 -139 -123 -107 -91 -74 -44 -13 -28 -44 -7 29 66 103 111 118 125 132 93 54 45 -8 -106 -127 -87 -46 -51 -55 -59 -64 -108 -153 -236 -320 -362 -297 -249
13536 -249 -277 -315 -353 -365 -301 -183 -111 -116 -121 -124 -127 -131 -134 -93 -52 -58 -63 -57 -50 -66 -83 -96 -110 -124 -137 -147 -156 -165 -175 -149 -124 -102 -80 -104 -175 -217 -259 -233 -161 -90
13525 -90 -64 -64 -64 -67 -70 -122 -174 -180 -186 -209 -233 -236 -193 -124 -54 -2 3 -28 -59 -94 -129 -173 -218 -216 -214 -179 -143 -130 -117 -77 -36 -41 -46 -39 -32 -25 -18 -70 -121 -95 -22 57 91
13513 91 109 126 127 128 155 137 59 -17 -36 21 84 101 70 -6 -33 -15 20 56 22 -11 -43 -74 -111 -103 -43 15 -13 -42 -53 -19 27 27 -17 -16 40 51 -13
13503 -13 -78 -84 -44 -10 24 68 65 13 -85 -211 -261 -218 -176 -122 -68 -57 -45 -73 -54 -61 -68 -84 -100 -70 -40 5 51 20 -10 -22 -34 -69 -105 -120 -136 -149
13493 -149 -162 -147 -87 -52 -17 13 45 31 17 34 51 20 -55 -105 -108 -117 -127 -137 -147 -154 -161 -171 -134 -51 -14 -18 -22 -9 3 38 27 -32 -91 -83 -29 -18 -53 -89
13482 -89 -79 -51 -24 0 26 22 -57 -131 -128 -128 -127 -147 -168 -140 -66 -35 -49 -63 -32 28 43 13 -16 -55 -47 -23 1 17 -12 -62 -111 -107 -102 -54 -6 3 -32 -85 -138
13472 -138 -154 -124 -97 -70 -33 4 41 78 103 128 76 23 26 28 27 26 45 19 -24 -68 -78 -42 -31 -21 7 37 64 90 68 0 -68 -90 -37 15 7 -77 -157
13461 -157 -236 -214 -191 -193 -194 -267 -341 -385 -353 -363 -374 -379 -384 -343 -302 -216 -130 -89 -49 -36 -22 -54 -87 -161 -236 -203 -171 -139 -107 -152 -197 -172 -147 -123 -98 -51
13451 -51 -5 41 88 52 16 -18 -54 -40 -26 -12 2 9 16 23 31 14 -2 -18 -35 -46 -57 -22 12 31 50 22 -4 -10 -17 21 61 63 65 67 69 64 58 98 139 148 158
13440 158 61 -36 -48 -61 -73 -85 -103 -122 -94 -66 -56 -45 -38 -30 -24 -63 -77 -14 101 171 179 111 39 13 -42 -99 -113 -127 -64 -1 17 37 56 76 70 64 57
13430 57 51 8 -35 -33 -30 -50 -69 -88 -108 -148 -189 -229 -270 -254 -239 -225 -135 -29 0 32 64 64 65 20 -25 -63 -102 -64 -26 -42 -58 -73 -89 -91 -92 -124 -110 -52
13420 -52 -70 -119 -168 -154 -141 -127 -114 -144 -175 -129 -83 -7 68 110 76 16 -43 -103 -164 -166 -92 6 60 40 -25 -95 -118 -86 -55 -21 12 33 53 73 94
13410 94 100 106 35 -80 -171 -184 -106 -28 33 95 111 127 97 67 83 98 88 78 68 58 38 17 43 69 77 85 17 -50 -59 -67 -75 -84 -145 -206 -187 -169 -118 -21
13399 -21 19 -16 -33 -5 -7 -10 -15 -21 -27 -32 -9 13 -9 -32 -104 -175 -201 -227 -211 -194 -221 -171 -84 1 -14 -30 -15 0 13 28 13 -1 -31 -108 -161 -138 -84 -30
13389 -30 -16 -2 11 25 20 15 -35 -85 -31 22 76 130 63 -4 -71 -139 -159 -180 -200 -221 -189 -157 -170 -184 -169 -153 -138 -122 -139 -156 -173 -190 -215 -240 -189 -138
13379 -138 -153 -169 -184 -200 -184 -168 -106 -44 -27 -10 5 22 13 4 -4 -13 -13 -13 31 77 60 43 26 8 36 64 46 28 48 69 43 18 18 18 19 19 -15 -51 -41
13368 -41 -30 3 38 26 14 34 54 28 2 -15 -32 -4 23 20 17 14 11 22 33 45 56 32 8 -15 -40 -14 11 -9 -29 -14 1 -29 -59 -48 -36 -24 -13
13358 -13 19 51 84 117 153 190 180 171 96 21 22 23 59 95 131 167 111 54 -1 -58 -47 -36 19 76 98 120 97 73 87 101 114 128 138 147 111 74 55
13348 55 36 16 -2 -41 -81 -74 -67 -45 -22 0 23 2 -17 -38 -59 -102 -146 -82 -19 13 46 3 -40 -44 -47 -5 37 104 172 193 215 215 215 216 216 169 121 22 15
13337 15 50 85 80 74 79 84 12 -59 -84 -109 -57 -5 -1 3 7 12 51 90 129 168 158 149 62 -23 -116 -209 -308 -315 -222 -129 -76 -23 15 55 48 42 32 22 -27 -77 -106
13326 -106 -43 -32 -21 -7 6 20 33 11 -11 -79 -147 -153 -159 -119 -79 -18 41 -5 -52 -83 -114 -144 -175 -168 -161 -138 -69 -23 -54 -115 -176 -205 -234 -309 -383 -334
13316 -334 -284 -234 -185 -168 -152 -90 -28 -6 15 -39 -94 -112 -129 -147 -164 -173 -181 -144 -106 -60 -14 -14 -13 -10 -8 -51 -94 -140 -186 -186 -186 -152 -119 -86 -52 -81 -110 -139
13306 -139 -168 -165 -162 -159 -157 -104 -52 -76 -100 -197 -294 -283 -273 -219 -165 -156 -148 -131 -113 -55 2 12 -54 -121 -112 -5 100 165 231 226 221 140 59 0 -57 -70 -83 -133
13295 -133 -183 -233 -283 -292 -301 -233 -166 -149 -133 -117 -101 -137 -173 -164 -154 -117 -81 -90 -99 -129 -159 -189 -219 -199 -180 -206 -232 -255 -279 -302 -325 -258 -192 -125 -58 -27 4
13285 4 80 203 285 276 183 90 54 17 27 37 12 -12 -37 -62 -51 -41 -30 -20 -35 -50 -19 10 24 37 50 64 26 -12 -50 -88 -99 -110 -76 -41 -48 -55
13275 -55 -63 -70 -68 -65 -17 30 71 111 50 -9 -53 -5 19 0 -18 9 79 150 171 101 14 -27 -30 12 31 51 51 50 50 49 23 -2 17 36 21 6 -8 -23 2
13264 2 27 52 77 58 39 66 93 100 107 154 201 217 141 19 -10 -11 -13 -8 -4 -47 -89 -132 -174 -175 -175 -176 -176 -197 -217 -237 -257 -220 -182 -99 -16 48 113 101 89 60
13253 60 31 48 65 97 129 115 101 85 69 99 129 133 137 64 -8 -59 -110 -161 -211 -199 -187 -128 -70 4 80 79 78 64 50 36 23 20 18 61 105 79 53 27
13243 27 1 -11 -24 -52 -125 -224 -245 -177 -155 -146 -91 -65 -39 -37 -35 -110 -185 -185 -185 -139 -94 -129 -165 -201 -237 -174 -111 -48 13 3 -6 -16 -26 -37 -47 -57 -67 -56
13233 -56 -44 -33 -21 45 112 128 145 95 -31 -129 -119 -13 92 180 221 263 229 158 87 35 -16 -68 -120 -178 -237 -249 -262 -182 -102 -21 58 40 23
13223 23 5 -12 -43 -75 -61 -47 -8 30 70 109 79 48 17 -12 -32 -52 -72 -91 -120 -148 -100 -52 -39 -26 -13 0 -54 -109 -164 -219 -187 -155 -97 -85 -86
13214 -86 -88 -118 -102 -75 -48 -21 4 23 -4 -52 -100 -63 -27 -37 -46 -58 -69 -55 -86 -151 -216 -206 -197 -181 -166 -150 -134 -118 -102 -87 -71 -79 -87 -121 -109 -86 -63
13204 -63 -64 -18 17 53 92 132 130 129 82 35 14 -6 -24 -42 -27 33 95 110 71 32 36 40 32 23 15 7 -47 -103 -158 -213 -194 -175 -156 -137 -76 -15 25 20 12 4 18
13192 18 -12 -62 -112 -145 -132 -113 -94 -74 -55 -21 -32 -64 -95 -82 -69 -40 33 103 96 89 82 69 56 46 36 0 8 17 -18 -20 -21 18 103 135 58 -17 14 51
13182 51 42 19 -2 -2 -1 -1 0 21 42 64 86 78 70 -13 -98 -77 -56 -35 -13 0 15 7 0 17 36 8 -18 -24 -30 -51 -118 -220 -246 -180 -113 -60 -7 45 98 129
13171 129 160 145 131 105 79 52 26 50 73 50 27 0 -29 -12 51 102 77 51 26 42 59 29 0 -26 -53 -57 -61 -51 -42 -55 -68 -6 55 114 96 31
13161 31 -34 -74 -37 37 66 49 32 10 -10 -78 -146 -190 -233 -201 -168 -159 -150 -142 -133 -125 -118 -65 -11 44 101 135 168 155 141 81 21 48 75 102 129 144 159 129
13151 129 98 45 -7 -14 -20 -11 -2 -38 -75 -106 -136 -121 -106 -145 -184 -176 -169 -143 -116 -90 -64 -62 -61 -60 -59 -37 -14 -64 -113 -164 -139 -54 -15 16 47 30 12 -29 -71
13140 -71 -68 -64 -84 -105 -102 -99 -85 -70 -78 -87 -66 -46 -26 -5 -54 -103 -106 -109 -62 -16 -15 -14 -27 -40 -53 -66 -14 37 43 49 31 12 -6 -24 -1 20 20 20 27 33 -5 -45 -73
13128 -73 -101 -103 -105 -121 -91 -44 -73 -135 -198 -265 -332 -316 -300 -284 -268 -242 -216 -144 -72 -68 -65 -38 -12 -37 -63 -161 -258 -318 -301 -251 -246 -221 -119 -24 -35 -69 -58
13118 -58 -50 -88 -157 -179 -154 -128 -95 -61 -28 5 -19 -44 -23 -2 36 74 67 60 64 69 50 32 26 19 85 150 208 190 113 36 -15 23 118 213 207 202 150 98 77
13107 77 56 34 13 3 -6 -16 -26 -44 -62 -34 -5 32 71 33 -4 -99 -193 -212 -230 -180 -131 -81 -31 0 30 15 1 26 52 77 102 88 74 -16 -107
13097 -107 -176 -245 -206 -168 -114 -60 -53 -45 -79 -113 -74 -35 32 55 81 15 -86 -141 -182 -223 -244 -264 -285 -306 -321 -337 -277 -216 -196 -177 -111 -46 -20 6 32
13088 32 58 97 137 123 18 -109 -190 -227 -263 -231 -199 -167 -136 -118 -100 -83 -65 -61 -56 -52 -47 -24 0 22 46 64 82 100 118 63 8 -46 -101 -114 -126 -139
13078 -139 -151 -103 -56 -8 39 56 73 71 -22 -101 -89 -27 34 103 172 221 224 193 162 127 93 72 52 77 103 88 74 59 44 63 81 54 27 13 0
13068 0 33 66 62 57 96 135 81 -19 -73 -81 -80 -79 -75 -71 -34 2 35 69 79 43 -43 -130 -149 -168 -141 -68 20 33 15 -2 11 24 38 51 25 -1 -27 -54
13058 -54 -76 -98 -117 -136 -166 -151 -85 -20 34 88 97 105 65 25 31 37 41 46 50 54 44 34 22 9 -8 -73 -111 -150 -197 -244 -271 -252 -215 -178 -63 97 221
13048 221 239 212 186 147 108 43 24 67 111 137 117 89 62 77 139 153 90 30 46 49 52 63 74 63 97 152 207 204 202 199 197 120 43 -32 -109 -136 -163
13037 -163 -230 -297 -291 -192 -74 42 74 13 -66 -101 -91 -81 -68 -56 -37 -19 -77 -135 -147 -159 -170 -182 -164 -145 -150 -154 -85 -16 -24 -32 -27 -22 4 32 73 114 78
13027 78 42 -28 -98 -92 -86 -49 -13 0 12 -1 -14 -28 -42 -124 -206 -263 -228 -134 -40 -17 6 20 35 50 64 35 6 -23 -52 -61 -69 -32 5 16 28 40 51
13017 51 53 54 56 57 45 33 -24 -82 -144 -206 -222 -238 -183 -128 -95 -154 -270 -340 -271 -157 -52 5 15 26 -43 -112 -136 -160 -135 -110 -156 -202 -212 -130 -54
13007 -54 -23 -14 -50 -17 15 24 33 43 52 86 120 107 95 65 35 28 21 23 25 -18 -62 -100 -137 -98 -58 -74 -89 -104 -119 -132 -145 -111 -78 -100 -121 -166 -211 -160 -110
12997 -110 -60 -10 -26 -42 -12 16 -18 -53 -43 -32 -23 -13 -27 -41 -99 -157 -170 -182 -124 -66 -85 -103 -118 -133 -72 -10 -36 -61 -87 -112 -65 -18 -48 -78 -105
12987 -105 -132 -113 -94 -85 -75 -112 -149 -176 -203 -230 -257 -232 -208 -183 -159 -161 -163 -165 -168 -177 -186 -195 -204 -129 -54 -25 3 61 119 100 36 -47 -54 -4 0 30 61 66 71 51 31
12976 31 11 -8 -73 -137 -141 -67 43 107 95 84 80 77 28 -20 -71 -123 -171 -142 -92 -42 12 67 128 190 175 160 141 123 150 177 127 76 49 21 36 52
12966 52 67 83 70 58 69 79 47 14 27 41 56 70 62 54 57 61 87 113 138 164 112 61 66 70 29 -12 -61 -111 -137 -164 -195 -227 -212 -198 -148 -98 -71 -44
12955 -44 -30 -17 -50 -83 -24 35 112 189 174 82 7 -21 -37 -53 -66 -80 -62 -44 -26 -8 20 49 33 16 -32 -80 -52 -24 -13 -2 -37 -72 -52 -31 35
12946 35 101 64 27 -32 -93 -138 -183 -228 -273 -255 -236 -218 -199 -135 -71 13 52 58 -12 -115 -172 -222 -271 -273 -274 -296 -318 -317 -316 -293 -269 -222 -176 -123 -71 -59 -48
12936 -48 -38 48 161 228 214 153 93 33 -14 -62 -33 -4 -9 -13 -64 -114 -38 36 66 95 70 45 20 -4 2 8 60 113 74 35 19 3 -72 -147 -146 -145 -87
12925 -87 -30 -44 -57 -108 -66 0 66 102 138 97 56 14 -27 -24 -20 -17 -13 -55 -98 -93 -88 -7 73 96 118 64 10 -47 -105 -139 -174 -126 -78 -101 -124 -131 -47 -14
12915 -14 17 13 9 6 2 -57 -118 -102 -85 -66 -46 -72 -99 -112 -126 -117 -108 -80 -52 -30 -8 43 4 -35 17 44 70 26 -17 -10 -2 5 13 56 99 118 44 27 9 32
12904 32 55 73 92 128 164 207 159 122 86 49 105 207 308 339 216 104 -8 -39 -69 -54 -38 5 50 17 -14 -59 -105 -74 -43 1 46 132
12895 132 218 215 136 73 57 40 23 -35 -95 -131 -167 -157 -147 -162 -176 -236 -296 -296 -296 -296 -295 -297 -298 -223 -148 -147 -145 -98 -50 -9 32 -2 -37 -28 -19 34 89 89 89 44 -1
12884 -1 9 21 17 -32 -28 52 113 128 120 113 103 93 81 70 58 46 80 113 101 88 59 30 2 -26 6 40 27 14 65 115 119 123 150 176 156 136 138 140 142 144
12873 144 126 109 46 -16 -16 -17 -17 -17 -8 0 8 16 36 56 76 96 71 46 -54 -156 -145 -133 -122 -111 -139 -167 -149 -131 -81 -32 58 149 153 81 52 23 -64 -153
12862 -153 -191 -183 -179 -175 -168 -161 -132 -104 -76 -48 -30 -11 32 31 -21 -73 -52 -31 -33 -36 -64 -47 -34 -21 -51 -81 -83 -84 -86 -87 -91 -94 -77 -14 60 135 81 -80 -205 -224
12851 -224 -171 -119 -39 40 87 57 33 9 5 -43 -109 -175 -166 -111 -92 -118 -145 -126 -91 -102 -85 -68 -39 -11 16 44 44 43 -2 -49 -75 -101 -82 -62 -22 18
12842 18 59 99 105 110 142 127 96 66 32 -1 -15 -30 -45 -59 -94 -129 -115 -101 -85 -23 11 47 39 30 22 14 24 35 42 50 39 -16 -90 -164 -174 -139 -83 -28 -35
12831 -35 -43 -50 -58 -8 41 42 43 38 -12 -36 -61 -87 -113 -140 -166 -158 -150 -119 -88 -106 -125 -186 -248 -259 -223 -162 -147 -140 -86 -64 -42 -4 -12 -43 -27 10 49 44 40 14 -10
12820 -10 10 77 133 113 65 16 -6 16 38 15 -39 -95 -103 -65 20 105 86 67 106 144 159 175 203 232 210 142 92 42 -12 -22 17 57 97 136 130 79
12810 79 7 -64 -130 -195 -183 -124 -89 -100 -105 -111 -131 -152 -150 -147 -132 -117 -101 -86 -60 -35 19 27 8 36 60 39 -2 -45 -70 -49 -38 -27 -15 -4 21 2 -36
12799 -36 -76 -32 11 -18 -48 -63 -32 19 70 79 88 94 100 139 132 128 123 119 115 65 15 -28 -72 -71 -69 -66 -63 -36 -10 37 84 84 38 19 46 90 134 145 155 166 177 133
12788 133 89 45 1 -43 -88 -82 -30 -23 -16 -49 -82 -90 -52 -17 17 56 95 137 133 109 86 82 79 41 3 11 19 19 18 18 18 42 66 73 34 -15 -20 -10 0 14 -16 -49
12776 -49 -37 32 55 62 68 69 69 24 -21 -47 -73 -79 -40 -23 -7 11 30 53 75 141 131 97 63 24 -13 -2 9 -1 -13 -56 -99 -122 -100 -99 -99 -73 -47 -53 -60
12766 -60 -40 -21 -24 17 31 45 30 -30 -45 -14 -25 -36 -21 -7 18 43 45 48 79 110 121 86 1 -82 -121 -159 -151 -96 -41 -33 -58 -84 -89 -95 -77 -59 -87 -115
12755 -115 -101 -86 3 94 110 127 143 160 183 206 206 206 142 78 60 42 90 138 163 188 156 124 71 -74 -203 -286 -285 -239 -187 -89 -19 49 98 54 -13
12746 -13 -82 -86 -90 -95 -99 -98 -98 -97 -97 -61 -26 -14 -1 -31 -60 -44 -28 -2 23 26 29 51 74 51 28 -18 -64 -65 -66 -59 -52 -91 -130 -95 -60 -95 -130 -119 -15 102 173
12734 173 207 150 118 86 43 1 -40 -83 -93 -104 -69 -34 -33 -33 -10 12 19 25 32 38 -9 -58 -31 -3 4 11 -26 -65 -111 -157 -157 -157 -133 -109 -85 -61 -116 -171 -179 -188
12723 -188 -150 -112 -74 -35 -23 -10 2 15 -2 -21 -40 -58 -39 -20 44 109 117 125 132 140 153 166 103 40 -35 -111 -141 -171 -123 -76 -75 -74 -121 -169 -140 -111 -84
12713 -84 -57 -30 -3 47 98 72 47 76 106 58 11 -81 -173 -189 -205 -166 -126 -63 -1 -4 -8 -35 -62 -75 -88 -80 -73 -97 -166 -215 -173 -88 -3 41 86 73 59
12703 59 69 79 72 66 42 19 22 117 188 168 64 -38 -41 -43 15 74 162 158 68 -21 -40 -59 -47 -35 -23 -11 -4 1 -69 -139 -181 -224 -189 -155 -122 -88 -32 24
12692 24 97 170 105 40 48 56 17 -20 -20 -19 3 27 63 99 134 170 86 1 -6 -14 -21 -28 -7 13 -30 1 79 81 23 -33 -18 -4 -18 -32 -46 -61 -79 -96 -114
12682 -114 -132 -116 -99 -129 -158 -153 -147 -99 -50 -27 -49 -89 -52 12 76 145 215 220 226 232 237 168 99 53 7 3 0 -44 -88 -95 -25 72 125 152 180 128 76 6 -63
12671 -63 -88 -112 -116 -119 -123 -127 -138 -150 -138 -127 -99 -72 -91 -109 -132 -156 -133 -110 -99 -87 -4 78 95 35 -57 -149 -136 -123 -64 -4 45 96 40 -16 -14 -11 13 38
12661 38 23 8 -21 -98 -168 -162 -125 -88 -73 -58 -90 -121 -112 -103 -90 -78 -53 18 84 73 30 -11 -13 -15 -18 -22 -25 -29 -48 -68 -88 -108 -91 -74 -57 -40 -58 -76 -70 -65
12650 -65 -24 16 12 7 -57 -122 -142 -161 -186 -211 -191 -170 -190 -210 -229 -249 -202 -154 -84 -13 -5 2 -35 -74 -82 -91 -23 45 25 5 -14 -34 -54 -74 -93 -113 -91 -70
12639 -70 -49 -28 -23 -18 -36 -54 -56 -57 -18 20 67 23 -46 -115 -95 -75 -79 -82 -68 -54 -17 19 54 89 125 160 160 160 59 -42 -150 -166 -126 -87 -17 53 46 40
12629 40 -7 -54 -56 -57 -62 -67 -72 -77 -75 -73 -26 21 35 49 -13 -76 -106 -137 -4 127 205 190 120 51 50 49 94 139 97 56 61 65 80 95 64 33 58 84 133 181
12618 181 198 214 185 155 113 70 27 -15 -22 -28 10 50 57 64 72 79 131 184 187 191 210 183 136 90 100 111 121 132 91 50 55 60 96 133 123 114 45 -23 -44 -19
12607 -19 10 -6 -70 -180 -234 -211 -132 -99 -109 -119 -88 -11 26 -43 -141 -163 -105 -94 -151 -162 -145 -82 -42 -1 67 137 156 130 136 143 101 59 43 28 39
12597 39 3 -18 -40 -19 1 25 49 30 11 -23 -11 20 51 45 40 34 28 15 3 -12 -27 -44 -106 -166 -180 -141 -56 -15 -19 -64 -108 -108 -61 -6 3 -35 -73 -87
12587 -87 -100 -96 -46 7 16 -80 -178 -232 -240 -198 -156 -97 -38 16 72 124 130 85 41 4 -31 -22 -12 -24 -35 -93 -150 -148 -146 -98 -50 -16 17 4 -7 -9 -10 -12 -14 6
12576 6 28 3 -21 -16 -11 -7 -2 -22 -42 -63 -83 -51 -19 -33 -47 -19 8 82 155 124 92 61 29 5 -18 -42 -66 -106 -146 -110 -74 -60 -46 13 74 107 141
12565 141 128 116 105 95 85 74 70 66 62 58 31 3 -19 -42 -43 32 154 199 138 76 9 -57 -28 0 -16 -33 -105 -178 -189 -124 -41 -4 -15 -71 -99 -81
12555 -81 -20 -5 -80 -154 -155 -156 -117 -77 -38 0 -32 -65 -99 -132 -165 -197 -183 -170 -174 -177 -181 -184 -108 -31 45 122 139 157 128 100 40 -19 -79 -139 -124 -108 -93 -77
12545 -77 -67 -56 -45 -35 -50 -66 25 116 178 240 195 149 78 7 12 17 0 -17 -35 -53 -81 -109 -137 -166 -162 -159 -110 -60 -22 15 53 91 105 119 133 147 91
12535 91 34 -22 -79 -149 -219 -264 -217 -163 -108 -93 -79 -73 -67 -61 -55 -11 32 0 -31 -52 -73 -94 -115 -107 -99 -45 8 -5 -19 -33 -47 -15 16 49 81 72 64 55 46 120
12524 120 194 219 151 117 175 175 175 154 133 112 91 79 68 10 -46 -81 -115 -103 -91 -89 -87 -130 -174 -187 -199 -141 -83 -35 -79 -118 -156 -131 -106 -80 -55 -67
12514 -67 -79 -91 -103 -118 -133 -148 -163 -115 -68 -21 26 11 -3 -64 -126 -96 -66 -36 -6 -8 -10 -13 -15 26 67 33 -1 60 122 107 93 79 66 52 39 25 12
12504 12 75 138 132 125 72 20 33 47 15 -16 -1 12 68 124 124 47 -11 -24 -39 -53 -65 -76 -44 -12 19 51 11 -29 -69 -110 -136 -162 -192 -221 -212 -250 -305
12494 -305 -283 -189 -94 -71 -49 -28 -7 13 34 -21 -77 -56 -35 -21 -7 -36 -65 -150 -189 -133 -1 84 94 75 56 49 43 36 29 36 44 -24 -93 -128 -162 -150 -138
12483 -138 -100 -61 -68 -76 -62 -47 37 123 111 22 -24 -70 -33 3 40 77 86 94 56 19 -10 -40 -24 -8 -52 -96 -95 -93 -114 -135 -156 -177 -140 -104 -67 -31 44
12473 44 121 152 182 199 217 188 159 120 82 43 5 -51 -108 -58 -7 50 108 89 71 49 28 52 77 82 88 139 114 38 7 -6 25 71 70 21 -26 -32 -37
12463 -37 2 43 73 102 132 86 27 15 18 21 34 48 107 166 140 113 87 61 25 -10 0 9 -23 -57 -14 28 48 68 65 61 63 65 86 108 118 83 30 54
12453 54 130 206 225 168 76 29 59 90 126 162 121 80 37 -5 -48 -91 -114 -137 -84 -30 43 118 116 114 58 3 -6 -15 -3 8 -25 -59 -37 -15 5 27 -3
12442 -3 -34 -65 -96 -110 -124 -112 -101 -145 -143 -118 -93 -83 -27 51 84 99 114 128 97 52 6 -24 -9 53 70 39 8 -7 -24 -83 -143 -164 -140 -98 -56 -29
12433 -29 -47 -112 -131 -143 -155 -213 -225 -172 -119 -88 -58 0 12 -22 -57 -78 -52 -26 -47 -95 -144 -145 -100 -24 50 48 0 -42 -84 -126 -167 -218 -222 -207 -191 -153
12423 -153 -114 -79 -43 -26 -55 -58 -61 -57 -53 -32 34 100 119 142 165 157 103 76 48 35 22 9 -3 4 12 45 33 2 -27 -87 -100 -73 -46 -92 -139 -157 -174 -194
12412 -194 -137 -60 -59 -113 -121 -114 -107 -97 -86 -99 -111 -150 -142 -64 13 68 123 68 -31 -85 -94 -70 -46 -66 -85 -146 -206 -190 -174 -151 -128 -134 -216 -253 -213 -175 -136 -71
12402 -71 -7 12 31 -9 -50 -91 -132 -186 -240 -233 -150 -96 -88 -125 -163 -216 -268 -214 -159 -101 -43 -8 26 41 57 72 87 26 -35 -50 -66 -39 -13 13 -36 -114
12392 -114 -146 -132 -118 -92 -66 -63 -60 -78 -97 -116 -135 -128 -121 -115 -108 -86 -63 -41 -18 -18 -19 21 62 60 -17 -52 -11 50 66 35 5 -26 -58 -43 -29 -17 -6 5 17
12381 17 2 -11 -3 5 21 38 -21 -81 -113 -145 -107 -69 -45 -129 -200 -226 -215 -203 -189 -174 -136 -98 -136 -174 -167 -159 -129 -99 -108 -117 -149 -181 -191 -201 -212 -222 -200 -177
12371 -177 -154 -132 -109 -87 -65 -42 -47 -51 -56 -60 -55 -50 -46 -41 -44 -47 -5 37 32 27 -1 -29 -16 -2 -35 -67 -78 -88 -99 -109 -107 -105 -148 -192 -181 -171 -138 -104 -101 -98 -72 -46
12359 -46 -28 -10 -15 -21 -60 -100 -117 -133 -91 -49 -29 -10 -29 -48 -21 5 -7 -20 -33 -46 -2 40 38 36 18 0 5 10 -26 -64 -102 -139 -118 -98 -77 -56 -49 -43 -37
12348 -37 -30 36 103 124 145 106 68 14 -85 -143 -126 -108 -90 -72 -54 -21 57 91 48 -20 -42 -67 -91 -113 -134 -113 -92 -71 -50 -56 -62 -45 -28 -33 -39 -90 -141
12338 -141 -187 -232 -200 -169 -137 -105 -150 -195 -237 -279 -287 -219 -131 -42 -56 -70 -87 -103 -120 -137 -176 -215 -178 -141 -80 -18 -64 -110 -120 -130 -33 64 64 65 66 66 72
12328 72 78 38 -2 5 12 20 28 -24 -77 -85 -92 -77 -62 -93 -124 -121 -119 -74 -28 -35 -87 -114 -64 -44 -70 -88 -106 -112 -117 -77 -37 -20 -4 -11 -17 -27 -37 -1 34 95 156 140
12316 140 125 93 62 76 91 61 31 -21 -74 -49 -23 1 26 -33 -94 -77 -61 -43 -24 -52 -80 -99 -119 -138 -158 -130 -102 -97 -92 -94 -96 -52 -8 38 85 25
12307 25 -34 -36 -39 -56 -120 -170 -142 -54 34 36 39 11 30 19 -67 -151 -159 -117 -75 -28 17 0 -18 -37 -55 -51 -48 -44 -41 -43 -45 -47 -49 -37 -26 -15 -3 -34 -65 -95 -126
12295 -126 -97 -69 -40 -12 9 30 6 -18 -22 -27 -8 9 -24 -59 -93 -128 -142 -156 -94 -32 -15 0 40 79 71 64 33 3 30 58 85 112 59 5 -25 -56
12285 -56 29 115 125 134 133 133 109 85 85 84 129 175 131 88 22 -43 -75 -106 -91 -76 -79 -82 -44 -6 -2 -75 -194 -236 -170 -103 -108 -112 -75 -38 -47 -55 -65 -74 -68 -16 58
12274 58 56 26 42 37 -13 -35 -57 -43 -28 -36 -44 -59 -73 -41 -10 23 56 67 77 58 38 3 -77 -139 -125 -80 -35 -9 16 -3 -23 -55 -87 -96 -105 -82 -58 -81
12264 -81 -104 -86 -69 -74 -80 -78 -77 -75 -73 -3 66 59 53 65 77 90 102 61 21 57 93 151 209 190 172 109 45 28 11 18 25 9 -5 14 34 77 120 119 117 93 68
12252 68 62 56 4 -47 -107 -167 -150 -133 -99 -66 -55 -45 -53 -61 -65 -68 -96 -48 22 17 -19 -55 -50 -46 -35 -24 -59 -94 -127 -160 -117 -74 -19 35 68 100 150 199 173
12242 173 146 109 72 112 152 141 130 73 16 -3 -22 -18 -14 17 49 -26 -101 -175 -248 -215 -182 -162 -143 -124 -104 -143 -182 -219 -255 -263 -226 -167 -184 -190 -119 -70
12232 -70 -67 -92 -118 -146 -174 -170 -166 -142 -118 -138 -204 -223 -197 -174 -151 -125 -100 -97 -94 -91 -89 -147 -205 -212 -173 -132 -91 -73 -55 -14 -19 -45 -70 -54 -38 24 86 121 156
12221 156 167 179 189 199 209 219 228 237 227 170 116 61 52 89 160 185 162 140 85 30 -4 6 0 -4 -52 -101 -146 -191 -191 -191 -147 -102 -38 25 74 77 60 43
12211 43 49 55 38 21 45 69 50 30 5 26 24 -23 -102 -182 -213 -199 -137 -75 -119 -210 -284 -313 -258 -158 -119 -80 -35 -36 -69 -102 -89 -76 -49 23 96 123
12201 123 81 40 72 104 120 136 106 76 82 88 114 140 139 93 29 -34 -66 -53 -20 12 23 34 48 15 -18 -52 -13 26 29 33 37 40 77 115 106 97 98 98 53 8
12190 8 -2 -13 -24 -35 -33 -31 -28 -26 25 77 83 89 90 90 44 0 -8 -16 -19 -22 -49 0 50 23 -1 -25 -54 -84 -43 -3 37 77 105 133 114 96 56 17 -21 -61 -10
12178 -10 40 15 -10 -47 -84 -160 -236 -241 -139 -71 -50 -55 -61 -70 -79 -68 -56 -45 -34 -3 26 -19 -65 -42 -19 50 119 146 173 200 227 210 193 176 159 167 175 137
12168 137 99 0 -101 -125 -150 -119 -89 -13 63 74 86 97 109 92 75 12 -51 -28 -6 16 38 87 135 76 17 11 4 -78 -162 -205 -248 -214 -181 -128 -75
12158 -75 -68 -61 -51 -40 -29 -18 0 17 34 52 13 -26 -65 -105 -108 -111 -114 -117 -134 -150 -90 -30 7 46 8 -29 -57 -84 -112 -139 -107 -75 -89 -103 -93 -83 -27 28
12148 28 43 57 25 -5 -58 -110 -132 -78 -10 10 33 103 195 241 209 177 137 97 103 108 82 55 28 2 11 21 30 40 72 105 61 17 -81 -179 -170 -161 -102 -42
12137 -42 16 76 73 70 21 -27 -26 -25 6 -8 -4 76 154 155 101 46 -12 -71 -59 -46 -34 -22 -67 -112 -50 11 -5 -21 7 36 72 108 83 -18 -109 -154 -153 -153
12127 -153 -147 -141 -182 -222 -246 -271 -188 -105 -20 64 41 19 4 -10 21 100 150 154 110 66 54 43 -14 -71 -81 -91 -100 -110 -123 -136 -146 -156 -120 -37 16 70
12117 70 77 38 25 12 12 12 13 13 24 35 1 -33 -50 -68 -85 -103 -70 -37 -50 -64 -17 29 56 37 25 13 -1 -16 -60 -103 -98 -93 -96 -52 10 -2 -52 -55 -16
12106 -16 23 64 60 8 -44 -75 -60 -45 -77 -94 -111 -55 1 -7 -15 -7 47 131 169 157 144 154 117 64 10 -50 -66 -78 -136 -211 -239 -220 -201 -153 -105 -57 -9
12096 -9 -55 -101 -144 -186 -225 -218 -160 -102 -77 -53 -74 -95 -94 -92 -90 -89 -102 -114 -127 -140 -123 -106 -92 -78 -70 -107 -145 -136 -149 -162 -172 -182 -144 -106 -22 61 118 176 126
12085 126 76 40 4 -31 -68 -50 -33 -15 1 2 4 -40 -85 -68 -51 -34 -17 3 23 44 65 101 138 98 58 9 -38 -139 -147 -107 -66 -19 26 -9 -46
12076 -46 -37 -28 -8 10 29 49 62 76 43 11 -11 -34 -57 -80 -57 -35 62 161 184 206 152 98 38 -22 -77 -132 -162 -99 -43 13 20 26 33 40 0 -40 -120 -201
12065 -201 -252 -211 -145 -79 -92 -106 -74 -42 -2 37 31 25 50 75 146 218 203 188 173 158 72 -13 -98 -184 -171 -158 -145 -132 -63 5 -1 -9 -39 -68 -98 -128
12055 -128 -111 -94 -77 -60 -65 -69 -119 -169 -216 -262 -262 -262 -265 -268 -223 -132 -18 49 39 29 1 -27 -55 -84 -109 -134 -159 -184 -210 -236 -258 -279 -287 -218 -118 -19 48
12045 48 70 69 68 56 -1 -76 -150 -170 -143 -95 -123 -186 -172 -99 19 96 98 99 100 99 98 97 96 104 112 119 127 96 66 64 16 -62 -96 -81 -67 -84 -101 -118 -135 -98 -60
12034 -60 -43 -71 -80 -89 -101 -113 -153 -194 -189 -183 -166 -148 -157 -119 -60 0 13 -17 -70 -77 -36 4 -19 -42 -65 -89 -91 -93 -64 -81 -122 -85 8 103 129 109 68 28 -36
12023 -36 -101 -57 32 131 185 186 142 118 94 24 -44 -131 -172 -161 -103 -24 9 -4 -18 -34 -49 -104 -160 -185 -118 -5 15 -72 -160 -177 -195 -141 -87 -34 19
12014 19 4 -10 -24 -39 -14 11 -9 -29 -57 -84 -65 -47 -57 -67 -75 -82 -88 -49 15 -10 -45 -81 -76 -71 -45 -20 -41 -61 -88 -114 -140 -167 -188 -209 -230 -251 -238
12003 -238 -225 -211 -198 -158 -117 -77 -37 -12 11 32 53 34 -31 -79 -35 -17 -45 -88 -130 -141 -152 -117 -82 -60 -37 -15 7 36 65 48 31 -8 -49 -90
11994 -90 -131 -146 -161 -177 -192 -140 -87 -34 17 17 17 64 110 125 141 111 36 -20 15 67 119 148 85 -27 -140 -205 -178 -159 -141 -165 -236 -286 -245 -187 -130
11984 -130 -112 -95 -64 -33 -22 -103 -182 -185 -160 -135 -109 -83 -11 60 64 69 27 -14 -47 -80 -67 -54 -61 -69 -77 -85 -107 -129 -105 -82 -73 -64 -100 -137 -146 -156 -88 -21 8
11974 8 38 68 98 106 113 121 129 125 121 117 114 152 190 182 175 174 174 127 81 16 -48 -79 -34 18 71 83 94 15 -63 -142 -222 -199 -176 -81 13 46 2 -24 -5 4 13 26
11962 26 38 62 86 34 -18 -94 -170 -200 -231 -207 -184 -206 -229 -176 -124 -178 -233 -245 -256 -268 -279 -327 -375 -350 -324 -257 -235 -235 -159 -13 55 3 -47 -71 -95
11952 -95 -43 9 50 90 131 171 170 168 120 73 59 45 32 18 13 7 2 -2 -16 -29 -43 -57 -71 -84 -98 -112 -79 -47 -15 17 43 68 94 43 -44 -85 -51 -16
11942 -16 0 16 33 50 41 32 22 13 -20 -55 -44 -33 -40 -47 -54 -61 -103 -144 -186 -227 -162 -97 -78 -59 -26 6 -2 -12 13 85 128 95 58 21 -20 -62 -29 3 36
11931 36 70 91 113 135 156 149 142 134 127 75 22 16 9 45 80 112 145 89 -12 -131 -173 -146 -120 -135 -149 -153 -156 -113 -70 -23 24 71 119 86 53 66 79 31
11921 31 -15 -63 -110 -138 -167 -195 -223 -156 -89 -69 -48 -40 -32 -25 -17 -29 -42 -8 25 49 73 21 -30 -20 -10 0 10 65 120 130 139 145 152 112 72 69 66 108 151
11910 151 120 89 12 -64 -63 -61 -60 -58 -67 -75 -83 -92 -92 -91 -88 -85 -66 -1 42 -4 -46 -89 -137 -185 -184 -184 -172 -252 -307 -271 -215 -159 -162 -165 -168 -171 -186 -202 -171 -141 -72 -3 18
11898 18 41 17 -6 -31 -55 -53 -51 -95 -139 -183 -227 -225 -224 -196 -168 -140 -112 -111 -111 -110 -109 -44 19 38 56 58 60 63 65 0 -64 -129 -194 -235 -276 -272 -267 -270 -272 -275 -278 -165 -52
11886 -52 -46 -40 -25 -10 50 111 108 104 101 98 60 22 30 38 49 61 73 84 64 43 69 94 93 92 41 -8 -18 -75 -157 -147 -61 24 40 55 -27 -110 -147 -183 -230 -276
11875 -276 -277 -277 -239 -201 -183 -211 -215 -220 -254 -241 -215 -188 -158 -129 -111 -92 -31 29 100 124 96 67 83 53 6 -40 -43 0 16 33 34 35 35 36 33 30 44 104 163 177
11864 177 174 171 123 75 27 -20 -31 -43 -9 25 7 -9 -27 -44 -83 -122 -127 -55 16 89 118 101 83 110 135 113 81 48 33 64 54 45 38 32 49 67 82
11854 82 97 53 -37 -99 -160 -202 -198 -146 -139 -161 -137 -68 0 87 127 118 108 85 63 43 24 -19 -17 -41 -64 -59 -53 -47 -41 -13 14 42 69 42 14 15 -29 -95 -115
11844 -115 -87 -59 31 122 167 212 223 235 200 166 69 -28 -18 -8 -8 -8 14 37 42 47 76 104 69 34 22 10 2 -4 -35 -66 -92 -118 -98 -78 -61 -44 -70
11833 -70 -96 -95 -47 -3 -35 -124 -168 -133 -52 -8 -11 -8 -5 0 6 -19 1 32 -14 -43 -26 -54 -127 -175 -177 -88 0 44 89 112 136 160 107 28 -3 -20 -37 -49
11823 -49 -60 -26 8 3 -1 -7 -12 -18 -24 15 55 66 78 13 -50 -30 -10 56 122 79 36 -6 -49 -22 4 76 149 164 179 147 116 102 88 97 106 76 45 38 31 -11
11812 -11 -54 -74 -94 -92 -90 -89 -87 -69 -52 -34 -17 32 82 56 29 37 45 53 61 8 -45 -53 -60 -78 -95 -112 -129 -168 -208 -170 -133 -75 -18 -68 -118 -126 -134 -96 -58 -6 44
11801 44 19 -5 -20 -34 -2 29 -9 -47 -85 -123 -132 -141 -104 -67 -39 -11 -28 -46 -103 -161 -172 -183 -174 -164 -200 -237 -125 -14 51 116 91 66 18 -29 -41
11791 -41 -53 -65 -77 -49 -20 8 36 29 22 15 8 61 114 168 221 253 284 239 195 110 26 -8 -43 8 107 127 55 30 51 40 30 19 8 -49 -106 -133 -160
11781 -160 -142 -123 -65 -6 -24 -42 -44 -46 -48 -49 -109 -169 -204 -147 -99 -52 1 54 96 139 135 132 51 -29 -34 -38 -37 -35 -77 -119 -156 -148 -114 -172 -214 -256 -227 -198 -162 -126
11770 -126 -136 -147 -173 -198 -148 -97 -82 -68 -100 -131 -115 -99 -37 24 38 52 -40 -133 -190 -246 -222 -106 3 20 18 17 12 7 2 -2 11 25 39 53 76 98
11760 98 74 51 26 1 -22 -47 -2 41 86 131 98 65 32 0 -24 -49 -27 -6 38 83 128 174 138 103 67 31 7 -16 -40 -64 -55 -47 -38 -30 -43 -57 -71
11750 -71 -84 -30 23 32 40 -48 -138 -150 -163 -109 -55 0 53 29 4 26 48 84 121 157 194 235 276 210 144 100 55 117 179 268 356 479 557 671 938
11740 938 1268 1322 1039 709 536 455 371 287 260 234 205 267 324 381 445 508 624 647 525 403 275 147 129 110 132 153 133 22 -89
11732 -89 -108 -93 -77 -56 -35 -32 -30 -28 -26 58 143 231 319 455 638 691 530 310 181 126 70 9 -50 -3 42 24 6 -9 -24 -17 35 69 10 -48 -108
11722 -108 -127 -147 -115 -82 -127 -171 -147 -123 -53 16 61 106 152 197 249 301 314 372 462 337 118 -8 6 68 109 150 187 225 344 464 598
11714 598 824 1117 1318 1074 676 446 307 249 190 138 85 104 123 97 70 106 143 154 74 59 43 22 1 -32 -66 -95 -123 -139 -63 14 1
11705 1 -55 -66 -38 -10 37 -6 -23 4 9 14 21 29 49 68 87 107 46 -13 -73 -133 -142 -150 -113 -75 -12 49 66 83 82 81 33 -13 6 26 40 55 89 32 -25
11695 -25 9 -13 -36 -52 -69 -92 -114 -66 -18 41 9 -98 -115 -125 -135 -139 -143 -121 -99 -123 -147 -151 -156 -115 -74 -57 -41 -25 -9 21 51 82 112 69 26 -16
11685 -16 -59 -58 -57 -11 35 71 106 96 85 84 83 83 82 80 79 77 76 77 77 32 -13 -19 -26 12 52 -7 -66 -125 -185 -174 -164 -107 -50 30 111 198 286 391 588 847
11674 847 1106 1213 922 570 371 311 250 199 148 66 -16 -22 -28 3 35 21 6 7 7 -38 -83 -85 -87 -88 -90 -83 -76 -72 -68 -54 -87 -90 -94 -98 -55 32 74 89 104
11663 104 116 128 117 105 119 87 43 0 0 0 30 61 53 45 69 200 441 728 1084 1395 1383 1050 690 407 230 160 121 81 49 16 47 78
11654 78 109 140 110 81 52 22 24 27 -13 -54 -65 -30 -38 -93 -147 -155 -85 -15 54 124 180 130 33 -18 -25 -32 -19 -6 6 20 25 30 10 35 69 104 166 183 125
11644 125 66 7 26 47 69 93 117 109 55 1 -6 -5 -4 0 2 -54 -111 -148 -139 -127 -116 -101 -86 -100 -114 -55 4 44 39 -14 -67 -108 -103 -76 -4 45 49 56 108 105
11633 105 101 101 100 152 203 208 213 269 324 451 624 669 562 436 311 243 176 155 133 129 125 121 117 180 244 343 396 517 791 1167 1329 1072 723
11623 723 560 488 393 298 232 166 117 67 95 122 209 296 450 604 593 428 273 118 -3 -126 -141 -156 -132 -107 -128 -149 -162 -175 -166 -156 -124
11615 -124 -93 -61 -30 -37 -45 -6 31 66 101 91 80 58 36 -8 -53 -89 -125 -85 -44 -45 -47 -48 -49 -45 -40 9 59 205 350 498 554 398 196 42 -18
11605 -18 -72 -79 0 79 55 30 5 -19 27 74 121 168 154 139 124 110 76 42 8 -25 6 38 70 102 79 56 10 -35 -39 -43 28 101 68 35 24 14
11595 14 -50 -116 -159 -201 -230 -259 -241 -224 -172 -119 -43 31 78 124 278 431 743 1054 1216 980 626 425 373 321 271 221 194 167 122 77 9
11587 9 -58 -21 16 53 91 95 100 104 109 122 134 70 7 32 58 37 17 119 221 346 471 344 218 296 375 634 986 1311 1238 846 454 272
11578 272 244 245 246 256 267 255 244 232 221 207 194 181 168 133 97 62 27 -27 -81 -59 -37 -10 16 -33 -82 -123 -163 -127 -91 -99 -107 -93 -78 -22 33 43
11568 43 53 35 17 106 195 178 161 37 -87 -199 -312 -318 -323 -299 -276 -175 -75 -53 -32 -10 11 -13 -37 -61 -86 -17 50 42 34 15 -3 -22 -41 -38
11559 -38 -35 -32 -29 6 42 78 115 181 248 269 290 260 229 278 327 393 506 656 883 1178 1473 1378 992 667 481 371 308 279 250 224 198 262
11550 262 326 390 453 607 761 704 510 324 184 91 44 40 37 36 35 48 61 74 87 98 110 45 -19 -38 -57 -76 -95 -142 -188 -189 -189 -204 -219 -234 -249
11540 -249 -165 -80 3 88 132 176 144 111 22 -66 -78 -90 -85 -81 -76 -71 -59 -46 -34 -22 12 48 40 32 20 53 63 -3 -72 -65 -30 5 64 123 105 87 60 33
11530 33 82 131 146 161 130 99 133 167 201 235 204 173 142 111 94 77 63 49 26 50 94 138 154 170 186 202 185 167 76 -14 -68 -76 -62 -2 54
11520 54 64 30 -4 -22 5 33 15 8 2 -6 -15 -24 -33 -42 -51 -46 -40 -34 -28 -27 -26 -5 61 145 230 205 134 47 -40 -54 -68 -53 -37 7 6 -24 -9 22 54 55 56 102 149
11508 149 135 120 179 239 200 115 104 138 118 51 13 -24 7 39 25 11 12 12 13 13 -27 -69 -133 -152 -87 24 53 6 -34 1 18 -10 -63 -70 -103 -136
11499 -136 -175 -167 -112 -56 -57 -104 -171 -238 -214 -190 -185 -227 -234 -241 -206 -170 -103 -35 31 98 80 62 41 20 -12 -90 -142 -195 -201 -206 -135 -64 -62 -59 -103 -146 -132 -117 -102
11488 -102 -87 -12 62 30 -1 10 22 34 46 -3 -54 -59 -64 -1 61 165 270 339 332 261 189 171 152 133 115 76 37 -1 -40 24 89 152 138 75 12
11478 12 -8 -29 -38 -46 -32 -18 32 83 88 93 63 33 3 -26 -41 -57 -57 -11 10 -45 -100 -156 -139 -123 -107 -91 -73 -56 6 69 134 199 188 176 131 85 17
11468 17 -51 -33 -16 47 110 96 82 75 23 -77 -101 -68 -81 -79 -77 -55 -33 -28 -23 -18 -13 12 37 63 88 79 70 61 52 20 -12 1 15 -2 -20 6 34 20 5 -8
11457 -8 -22 5 33 61 88 122 156 144 132 115 98 138 255 387 411 332 252 196 140 84 28 -47 -122 -121 -120 -95 -71 -47 -22 -17 -12 -7 -1 26 54 128 202
11447 202 247 292 230 167 94 20 -30 -81 -146 -210 -229 -248 -259 -270 -251 -155 -54 0 38 77 101 125 172 219 192 164 137 109 137 166 171 176 188 200 183
11437 183 89 -10 -34 -3 -19 -4 11 46 81 86 91 142 193 164 136 131 125 117 109 100 92 75 58 64 71 33 -4 -87 -171 -146 -122 -52 17 -3 -24 -30 9 4 -77 -138
11426 -138 -153 -120 -87 -50 -14 -26 -37 -3 30 -12 -55 -139 -223 -234 -168 -97 -71 -74 -77 -83 -89 -65 -40 -62 -84 -66 -47 16 80 100 121 66 10 23 35 48
11416 48 60 34 7 -19 -45 -40 -35 -30 -25 -48 -71 -94 -116 -178 -240 -250 -167 -37 46 24 1 -23 -48 -93 -139 -98 -12 53 27 -88 -204 -219 -233 -198 -162
11407 -162 -104 -45 -24 -3 11 26 59 1 -81 -164 -194 -225 -209 -194 -174 -155 -136 -116 -78 -40 -1 36 32 29 -20 -70 -75 -81 -10 60 105 151 150 149 137 125 113
11396 113 102 91 81 48 14 -59 -133 -161 -190 -131 -73 -60 -48 -57 -65 -74 -83 -35 11 58 106 88 69 77 85 94 150 185 128 90 51 30 9 24 40 10 -20 9
11386 9 39 68 98 178 258 351 445 586 575 394 259 203 148 118 88 70 52 -5 -64 -97 -38 45 129 137 145 107 69 64 60 55 51 34 17 47 76 95 115
11376 115 135 154 169 183 274 365 408 451 520 634 849 1156 1349 1205 874 635 438 287 238 235 189 97 56 16 -26 -70 -69 -68 -68 -67 -32 2
11367 2 35 67 46 -20 -113 -114 -92 -70 -42 -15 -4 6 -28 -62 -75 -88 -25 38 56 73 45 17 17 18 64 111 102 94 40 -13 -32 -51 -47 -44 -11 21 53 86 63
11356 63 39 16 -6 -31 -56 -81 -105 -111 -117 -122 -128 -98 -69 -40 -10 22 55 12 -30 -52 -73 -49 -24 -46 -68 -68 -67 -11 43 53 63 63 64 18 -26 -91 -156 -175 -194
11346 -194 -211 -229 -200 -172 -102 -32 14 61 42 22 49 75 123 172 113 54 12 -29 -72 -114 -127 -140 -107 -74 -99 -123 -148 -172 -228 -284 -294 -305 -272 -240
11336 -240 -208 -176 -120 -64 -84 -104 -103 -101 -77 -53 -56 -59 -16 26 56 86 70 54 76 98 74 50 29 7 -13 -34 -80 -126 -64 -2 102 208 175 143 129
11327 129 115 101 88 25 -36 -121 -206 -188 -171 -199 -227 -225 -224 -116 -7 -10 -13 -16 -19 -12 -6 0 7 26 45 111 176 140 104 67 31 21 10 76 142 305 468
11316 468 719 1123 1474 1426 1025 623 418 366 338 309 244 225 183 140 97 100 158 262 372 481 615 702 619 460 315 216 156 96 39
11308 39 -17 -9 -1 6 14 31 48 65 82 88 93 79 19 -18 -55 -96 -136 -142 -147 -153 -159 -176 -193 -164 -134 -170 -206 -222 -192 -136 -80 -72 -109 -172 -234 -221 -162 -106 -95 -132
11297 -132 -170 -172 -173 -175 -177 -157 -136 -116 -95 -60 -24 -34 -44 -11 21 3 -59 -84 -108 -90 -72 -31 8 26 43 19 -4 -28 -52 -45 -38 -31 -24 -11 1 13 26 34 41
11287 41 74 61 48 34 -7 -4 43 91 97 102 116 130 121 112 138 164 170 130 62 -5 -52 -100 -87 -74 -61 -48 -10 28 66 105 107 109 66 22 -26 -75 -48 -21 20
11276 20 63 74 132 209 210 180 151 130 109 42 -24 -50 -76 4 86 69 52 35 19 -51 -121 -146 -170 -137 -105 -72 -40 -24 -7 -37 -67 -124 -181 -162 -143
11266 -143 -146 -149 -152 -155 -111 -66 -25 -61 -143 -225 -253 -204 -158 -189 -243 -252 -223 -194 -162 -131 -19 91 136 104 74 0 -54 -108 -107 -105 -104 -103 -77 -52 -27 -1 -8 -14 -66
11256 -66 -118 -128 -138 -148 -158 -95 -32 26 10 -44 -99 -52 -4 14 33 -24 -82 -52 -23 6 35 -6 -49 -45 -42 -40 -38 -37 -35 -65 -94 -47 0 -27 -55 -36 -18 -2
11245 -2 13 29 44 41 37 34 31 47 64 61 12 -59 -132 -127 -123 -158 -147 -116 -85 -87 -88 -87 -85 -115 -99 -32 35 105 175 194 167 83 0 -67 -87 -59 -31 27 41 -19 -34
11234 -34 24 36 -10 -58 -57 -11 -11 -11 -9 -6 -10 -14 -18 -23 -45 -68 -91 -113 -126 -140 -179 -172 -86 0 11 23 -2 -27 -52 -78 -50 -23 4 31 59 86 139 147 135 123
11223 123 115 185 346 584 791 860 866 979 1202 1425 1375 1004 675 515 385 300 281 309 346 384 364 266 131 41 3 10 4 0 40 80 70
11214 70 14 -12 -40 -141 -196 -139 -82 -12 57 79 55 53 97 113 52 -25 -56 -14 27 26 -19 -66 -67 -13 40 97 154 314 475 584 539 357 175
11205 175 69 55 61 66 77 88 96 104 112 119 98 77 102 127 138 149 53 -87 -176 -174 -119 -64 -81 -98 -114 -131 -84 -36 10 58 129 201 273 345 317 289 216
11195 216 142 30 -81 -55 -29 -31 -33 -20 37 117 106 72 38 56 73 91 109 122 136 149 163 126 90 56 23 17 57 129 109 58 99 195 336 552
11186 552 768 1073 1377 1365 1016 666 470 350 277 187 98 59 20 27 34 64 93 123 152 115 77 110 144 163 91 44 43 42 40 -12 25 111 150
11177 150 114 79 104 129 108 88 116 145 128 111 77 44 10 -22 -53 -85 -70 -56 -57 -57 -61 -65 -90 -161 -175 -113 -44 -22 -45 -68 -71 -74 -77 -79 -25 29 22 -60 -132
11166 -132 -157 -105 -54 0 56 65 74 38 2 -33 -69 -59 -48 -37 -26 -16 -6 3 14 25 36 -28 -93 -56 -18 19 57 27 -1 45 93 123 154 184 215 193
11156 193 171 149 127 104 82 60 37 26 15 4 -6 -40 -74 -109 -143 -171 -198 -149 -101 -51 -1 48 98 101 103 60 17 -4 -27 -3 19 36 53 70 87
11146 87 88 90 134 177 138 24 -47 -42 -56 -115 -144 -96 -82 -115 -117 -42 32 61 43 26 15 4 38 73 22 -28 -79 -130 -95 -60 -25 9 46 83 44 4
11137 4 -34 -72 -65 -57 -93 -129 -164 -124 -31 15 -12 -39 -41 2 18 -43 -53 -64 -33 -3 14 31 48 65 58 52 30 -37 -78 -42 -7 -47 -101 -108 -69 -30 -48 -65
11126 -65 -82 -100 -90 -81 -71 -62 -65 -68 -55 2 38 -1 -41 -82 -123 -165 -164 -162 -186 -255 -342 -352 -294 -236 -173 -110 -54 0 -51 -102 -110 -118 -54 9 67 49 -2 -54 -8
11115 -8 37 83 129 105 82 58 34 33 32 31 30 11 -7 -26 -45 2 50 -9 -68 -56 -44 14 72 32 -7 -1 4 19 34 2 -28 -11 5 22 38 46 53 106 159
11105 159 158 156 154 153 127 101 79 56 35 60 59 58 54 49 62 120 135 103 55 6 2 0 -4 -8 -10 -13 -16 -19 17 53 69 40 -20 -81 -70 -60 -53 -92 -173 -209 -208 -161 -136
11093 -136 -112 -138 -163 -211 -214 -146 -31 56 68 7 -53 -116 -179 -216 -208 -152 -96 -35 -20 -25 -31 -85 -140 -146 -107 -51 -42 -77 -113 -128 -98 -93 -88 -102 -116 -129 -143 -37
11082 -37 67 93 118 102 40 3 -32 -19 -6 35 31 10 34 73 112 79 1 -51 -28 0 -19 -4 10 -16 3 70 137 153 124 48 19 -14 -47 -104 -114
11073 -114 -89 -63 -34 -5 0 7 14 21 62 103 97 44 20 43 37 30 11 -8 -101 -195 -152 -63 -28 -70 -129 -110 -64 28 69 33 43 52 37 22 7 -7 29 66
11062 66 102 139 89 39 -10 -60 -77 -94 -88 -82 -35 11 13 14 -27 -68 -86 -104 -101 -97 -47 1 -25 -52 -103 -153 -126 -98 -70 -43 -56 -70 -8 54 94 134 114 18
11052 18 -76 -95 -54 -13 49 112 130 147 107 68 51 34 -49 -133 -110 -86 -49 -12 -21 -30 -16 -2 57 117 92 68 -1 -71 -98 -125 -76 -26 -21 -16 -10 -5 -11 -17 0
11041 0 17 96 176 210 243 222 200 41 -117 -180 -242 -229 -215 -190 -165 -163 -162 -124 -87 -50 -13 25 65 59 52 36 20 81 141 158 175 116 56 43 29 39
11031 39 48 55 62 114 167 196 225 231 237 153 69 15 38 106 128 135 142 157 173 142 112 89 66 28 -55 -119 -107 -96 -84 -71 -57 -90 -123 -137 -151 -142 -133 -138 -144 -103
11020 -103 -63 -67 -72 -76 -80 -48 -17 -8 0 -7 -16 20 58 76 95 37 -19 -45 -72 -52 -32 -6 19 45 71 74 78 35 -6 -18 -30 -65 -100 -60 -20 -26 -32 -78 -124 -94
11009 -94 -63 -82 -100 -119 -137 -90 -43 -42 -41 -117 -192 -176 -83 11 60 89 118 113 32 -31 -49 -54 -59 -62 -65 -53 -41 -29 -18 -28 -39 -4 30 46 62 32 2 29
10999 29 56 82 109 139 169 154 138 107 75 44 12 2 -8 27 62 35 8 -18 -45 -58 -71 -130 -188 -218 -247 -200 -153 -110 -67 -70 -72 -38 -3 -14 -26 -17
10989 -17 -8 0 9 48 87 80 74 62 51 86 120 154 188 145 102 79 57 80 103 62 20 -20 -62 -41 -20 -76 -132 -184 -235 -210 -185 -131 -76 -21 32 52 72
10979 72 46 20 22 25 27 30 -2 -34 -20 -6 -58 -109 -160 -212 -232 -252 -226 -200 -125 -50 -52 -54 -17 19 10 1 -24 -49 -74 -100 -178 -257 -259 -261 -239 -216 -193 -170 -151 -132
10968 -132 -67 -2 7 16 26 36 41 46 5 -35 -50 -65 -80 -95 -91 -86 -81 -76 -120 -164 -101 -38 -36 -34 -31 -29 -20 -10 45 101 122 143 165 186 160 135 109 83 63 42 21
10956 21 0 -31 -64 -139 -138 -71 -3 -8 -12 -28 -45 -61 -77 -130 -183 -190 -197 -139 -81 -69 -57 -16 24 66 107 94 82 70 57 14 -29 34 97 146 194 196 199 158
10946 158 118 78 37 55 72 43 14 16 17 19 20 -35 -91 -147 -203 -210 -217 -177 -138 -93 -48 -3 41 73 106 92 78 105 132 112 93 91 90 88 86 99 112 79 45
10935 45 -40 -126 -167 -207 -180 -154 -127 -101 -91 -81 -71 -61 -58 -55 -6 42 26 10 -5 -21 -23 -25 16 57 58 13 -8 46 87 51 38 70 80 90 56 23 -2
10925 -2 -29 -56 -82 -79 -76 -73 -70 -89 -107 -126 -145 -96 -46 -42 -38 -48 -58 -67 -77 -84 -90 -56 -22 -3 -75 -193 -220 -129 -39 -50 -62 -86 -111 -89 -68 -28 10 4 -2 -14
10914 -14 -26 -38 -50 -50 -49 -49 -48 -6 36 79 121 85 49 13 -23 -81 -139 -198 -256 -290 -324 -281 -239 -205 -171 -137 -103 -68 -32 2 38 46 55 64 72 85 98 111 124
10903 124 122 121 119 118 117 117 70 24 30 36 42 48 17 -12 -43 -74 4 82 135 97 -7 -113 -168 -132 -99 -65 -72 -79 -67 -54 -42 -30 -80 -130 -155 -88 6 102 157
10893 157 213 218 224 229 235 198 160 97 80 87 93 103 113 117 121 151 136 88 41 -8 -58 -84 -109 -138 -166 -152 -184 -191 -197 -209 -220 -181 -96 -45 4 58 111 105 100 140
10882 140 103 -10 -78 -70 -62 -73 -85 -94 -103 -172 -195 -165 -90 -23 -1 2 6 3 0 42 84 69 53 37 22 11 0 15 -15 -44 -74 -59 2 32 15 -17 -50 -106
10871 -106 -162 -187 -135 -38 11 16 20 -4 -29 -54 -79 -71 -63 -53 -43 -39 9 78 148 193 239 210 226 225 179 118 57 -3 -19 -57 -95 -91 -42 9 15 -22 -15 6 27
10860 27 33 -7 -93 -134 -114 -94 -74 -55 -81 -154 -184 -168 -202 -283 -349 -308 -244 -180 -155 -130 -49 30 4 -21 -73 -124 -175 -180 -167 -107 -45 -29 -52 -75 -53 13
10850 13 60 60 43 26 7 -11 -8 -4 -8 -13 28 69 163 257 277 189 130 117 117 117 141 164 167 124 45 -33 -95 -111 -120 -130 -179 -229 -203 -132 -83 -81 -107 -133 -114 -49
10839 -49 -13 -23 -50 -77 -75 -74 -52 -30 -22 -60 -72 -85 -105 -126 -101 -76 -49 -23 -19 -15 -24 -33 3 40 45 51 103 155 83 11 -11 -34 -116 -151 -167 -182 -136 -90 -60
10829 -60 -75 -69 13 53 47 27 8 -10 -29 -19 37 68 99 94 89 84 79 14 -51 -66 -35 -9 16 23 29 67 105 97 89 86 83 80 77 59 41 -47 -136 -179 -145 -82 -66 -54
10817 -54 -42 -33 -24 6 38 -7 -52 -25 1 5 9 40 72 57 43 -19 -82 -68 -54 -45 -36 -73 -110 -82 -54 -26 1 -5 -12 -19 -26 -67 -108 -150 -191 -187 -183 -180 -176 -113 -49 -63
10806 -63 -76 -115 -154 -116 -78 -128 -179 -183 -187 -95 -3 42 88 85 82 79 76 84 91 22 -47 -105 -162 -144 -125 -94 -62 -31 0 -3 -6 -9 -13 -10 -8 -82 -157 -182 -208 -187 -167 -118
10794 -118 -69 -66 -63 -54 -45 9 64 100 135 125 115 108 102 119 136 69 2 -65 -132 -161 -189 -218 -170 -78 -32 -65 -99 -160 -267 -345 -347 -326 -306 -234 -163 -110 -58
10784 -58 -51 -45 -90 -135 -103 -71 -27 15 36 57 24 -8 4 18 40 62 90 26 -63 -153 -172 -191 -130 -68 -53 -38 -6 25 11 -2 11 25 39 52 0 -52
10774 -52 -28 -4 -10 -16 -22 -28 -5 17 63 109 113 117 75 34 -49 -133 -171 -209 -179 -150 -143 -136 -128 -119 -65 -10 -38 -67 -166 -265 -336 -316 -271 -226 -218 -210 -196 -183 -222 -169 -91
10763 -91 -13 5 25 -1 -28 16 60 27 -5 -16 -28 -116 -204 -199 -194 -143 -92 -43 5 30 -37 -105 -174 -202 -230 -228 -226 -148 -70 -41 -13 15 44 51 58 42 26 -37
10752 -37 -101 -119 -137 -90 -44 -74 -105 -66 -28 -13 2 -5 -12 3 19 22 26 52 78 117 156 150 97 61 116 185 209 207 160 90 20 -17 -56 -80 -57 -28 -90 -149
10742 -149 -116 -34 48 83 27 2 23 13 2 7 12 -59 -130 -126 -122 -42 38 49 59 -5 -71 -121 -171 -198 -225 -173 -122 -70 -19 18 56 48 41 -23 -87 -128 -170
10732 -170 -127 -85 -64 -136 -186 -191 -150 -110 -98 -86 -74 -62 -42 -21 -47 -72 -102 -131 -160 -190 -193 -196 -122 -49 -47 -46 -68 -90 -74 -59 -44 -29 -40 -50 -60 -70 -123
10721 -123 -175 -182 -188 -130 -73 -92 -111 -129 -146 -88 -29 22 74 126 178 102 25 2 70 117 118 75 31 -13 -58 -58 -57 -8 39 42 44 16 -12 5 22 -18 -58 -71
10711 -71 -6 42 15 -35 -41 -4 31 93 155 140 124 62 0 -34 -69 -59 -2 47 21 -30 -36 7 51 51 52 26 0 50 100 154 209 156 104 79 55 53 52 29
10700 29 7 -15 -37 -44 -51 -81 -111 -120 -128 -91 -53 -5 42 91 139 158 176 118 60 17 -26 6 38 24 10 -75 -161 -208 -178 -166 -200 -213 -227 -221 -215 -221 -227 -157 -40
10690 -40 37 39 41 43 33 23 -32 -88 -120 -151 -106 -61 -85 -109 -130 -75 -3 67 67 67 71 76 34 -52 -72 -14 67 104 92 79 109 140 158 177 196 215 195 176
10679 176 156 137 101 64 5 -53 -63 -72 -127 -183 -128 -74 -42 -10 -22 -35 -47 -59 -46 -33 -19 -6 -33 -60 -87 -113 -80 -46 -59 -71 -86 -100 -115 -129 -210
10670 -210 -290 -263 -237 -151 -65 -25 14 -1 -17 -32 -48 -24 0 24 48 35 22 55 88 81 74 66 59 28 -2 -33 -64 -69 -74 -79 -83 -91 -99 -107 -115 -79 -44 -54 -65 2
10659 2 70 154 239 277 222 165 199 249 252 241 230 171 111 57 3 -84 -80 -51 -23 -18 -13 -31 -49 -56 -62 -46 -29 4 39 -2 -43 -34 -25 -15 -6 -81 -156 -176 -104 -52
10648 -52 0 63 35 -32 -100 -121 -50 0 3 -63 -84 -23 37 50 17 -51 -120 -189 -258 -287 -270 -207 -190 -254 -317 -364 -364 -284 -205 -169 -133 -114 -96 -124 -152 -143
10638 -143 -134 -125 -116 -124 -132 -141 -149 -113 -77 -84 -91 -108 -78 -52 -72 -117 -207 -242 -200 -122 -44 -8 28 25 23 67 110 45 -20 -65 -64 -59 -53 -45 -37 -19 -1 -29 -57 -50 -43 -36 -29 -19
10626 -19 -9 0 10 -7 -25 -44 -62 -13 34 32 -15 -28 -42 -58 -74 -74 -73 -69 -65 -81 -50 0 50 110 169 152 134 78 22 -59 -95 -98 -102 -131 -114 -51 -33 -61 -88
10615 -88 -90 -45 -1 -2 -15 -28 2 32 0 -32 -62 -91 -141 -145 -99 -52 -57 -62 -66 -71 -59 -47 -35 -23 -81 -138 -196 -254 -294 -333 -327 -320 -257 -193 -129 -65 -98 -130 -117
10604 -117 -103 -58 -13 31 76 78 80 82 84 59 35 10 -14 -23 -32 -41 -50 -25 0 25 50 53 56 59 62 60 58 56 54 43 31 127 223 256 289 321 354 421 487 627 858
10593 858 1163 1254 996 738 588 438 334 230 180 130 156 182 121 60 42 24 -3 -76 -132 -97 -64 -76 -58 -39 -9 21 51 81 111 142 141
10584 141 185 249 221 171 121 71 20 -29 -79 -92 -105 -118 -131 -83 -34 13 61 49 37 25 13 35 57 33 10 23 36 50 63 67 71 75 79 13 -52 -42
10575 -42 -31 -16 -1 13 28 52 76 74 72 72 26 9 68 158 248 265 283 205 127 95 62 57 52 46 41 51 61 71 80 9 -61 -24 11 39 67 73 78 39 0 -39
10563 -39 -78 -120 -163 -67 28 81 135 112 43 -36 -39 14 21 36 51 64 76 94 113 131 150 118 87 56 24 27 30 32 35 -34 -104 -98 -91 -86 -80 -121 -161 -156 -152 -75 0
10552 0 3 -70 -126 -137 -131 -125 -117 -108 -85 -62 -39 -16 -34 -51 -69 -87 -96 -104 -90 -76 -79 -81 -38 4 18 32 -29 -91 -38 14 68 121 114 106 53 0 12 24 35 47 59
10541 59 70 35 1 14 26 62 98 53 8 -37 -82 -71 -60 -49 -39 -9 20 4 -11 -31 -51 1 54 62 23 -17 32 117 202 186 170 193 215 216 124 1
10531 1 -76 -79 -81 -78 -75 -72 -69 -36 -2 45 139 161 91 30 -31 -18 -6 -38 -117 -196 -183 -122 -107 -95 -84 -52 -20 -95 -169 -191 -121 -91 -106 -116 -80 -58 -36 -11
10521 -11 13 48 83 118 154 147 141 112 83 54 24 65 107 98 -2 -150 -253 -241 -183 -146 -154 -161 -167 -130 -94 -54 -14 3 -69 -146 -176 -162 -147 -137 -127 -71
10511 -71 -14 57 129 223 318 332 346 359 373 291 208 149 90 104 118 86 54 47 39 77 115 192 270 322 466 710 1000 1021 706 374 135 31
10502 31 20 35 51 81 19 -35 -43 -37 -31 -45 -59 -72 -86 -88 -90 -93 -95 -52 -9 -12 -16 -12 -9 -51 -93 -50 -6 -9 -11 36 84 57 -15 -70 -32 27 87 106 126 100 73
10491 73 82 90 53 16 -12 -41 -24 -6 -16 -25 -34 -44 -50 -57 -63 -69 -67 -64 -61 -59 -123 -187 -233 -186 -186 -279 -292 -213 -121 -76 -75 -75 -74 -74 2 79 81 84 86 88 79 71 62 53 26 -1 -29
10478 -29 -57 -50 -43 -36 -30 15 62 108 154 119 83 8 -67 -156 -153 -99 -91 -170 -249 -250 -160 -45 -22 -48 -27 25 32 -32 -98 -108 -28 7 -49 -116 -183 -148 -114 -68
10467 -68 -21 -52 -82 -93 -103 -37 28 53 79 58 37 -16 -69 -123 -177 -165 -154 -71 10 31 -39 -110 -89 -50 -12 -45 -77 -64 -50 -37 -24 -29 -35 4 44 41
10457 41 38 34 31 42 53 64 75 94 113 137 162 171 273 420 567 590 460 258 147 92 36 27 18 59 8 -66 -142 -100 -57 -15 26 27 27 -17 -63 -97
10447 -97 -130 -118 -106 -85 -64 7 -11 -33 -55 -37 -19 -34 -50 -19 10 5 1 -3 -8 -91 -174 -201 -136 -149 -162 -169 -176 -172 -167 -163 -158 -112 -65 -19 27 17 7 -2 -12 -105
10436 -105 -197 -182 -167 -118 -68 -64 -60 -84 -108 -86 -64 -73 -82 -92 -101 -156 -210 -218 -227 -152 -77 -48 -19 -27 -34 10 55 96 244 450 518 406 217 68 -4 -46
10427 -46 -43 -61 -79 -116 -154 -191 -228 -222 -216 -186 -157 -181 -205 -183 -161 -126 -92 -104 -115 -113 -110 -84 -58 -66 -73 -103 -133 -127 -121 -93 -64 -72 -81 -89 -97 -61 -24 -33 -43 -40 -37 -57 -77
10415 -77 -68 -59 -50 -41 -88 -134 -181 -228 -209 -190 -95 0 62 126 144 161 138 115 92 69 38 8 1 -6 3 13 69 125 115 104 71 38 64 90 71 51 32 14
10404 14 -21 -58 -25 84 151 172 162 106 26 -52 -60 -68 -75 -83 -73 -63 -53 -43 -31 -20 -8 2 -24 -52 -57 -61 -32 -3 -20 -37 -58 -78 -75 -72 -89 -106 -76 -47
10394 -47 -30 -13 48 111 74 36 -1 -38 -82 -126 -124 -122 -125 -127 -84 -41 16 73 85 96 43 -8 -61 -113 -129 -145 -115 -84 -71 -58 -5 47 36 -66 -118 -169
10384 -169 -174 -179 -137 -96 -118 -141 -118 -95 -108 -121 -58 5 5 4 50 96 129 163 120 76 58 40 22 3 -21 -46 -25 -4 37 79 126 82 62 41 38 35 79
10374 79 122 143 164 144 124 127 130 93 55 17 -19 16 53 90 126 144 161 179 196 202 208 168 128 136 143 104 66 -12 -91 -124 -156 -143 -129 -162 -194 -190 -187 -137 -88
10363 -88 -36 15 43 72 4 -64 -56 -48 -2 42 134 225 235 245 179 112 88 63 39 14 4 -5 -15 -26 -41 -56 -72 -87 -93 -98 -58 -17 -38 -59 -58 -56 -19 17
10352 17 8 -1 -7 -14 -20 -27 -2 22 47 72 37 2 -84 -79 -45 -10 6 23 -13 -50 -40 -31 -59 -86 -68 -49 -2 44 46 47 49 50 6 -38 -57 -77 -51 -24 -44 -64 -43
10341 -43 -22 9 -50 -104 -157 -171 -185 -122 -59 -7 44 19 -5 -8 -12 -62 -111 -156 -200 -168 -136 -107 -79 -51 -22 -17 -12 -7 -2 -16 -31 0 30 59 89 119 148 158
10331 158 167 100 33 -37 -108 -123 -47 37 121 135 149 139 129 143 156 131 107 105 104 139 175 187 200 162 125 134 188 228 191 124 56 11 -33 27 89 107
10321 107 125 97 69 46 23 0 54 135 170 129 88 62 36 56 76 72 69 65 62 63 64 111 158 200 242 222 126 11 -57 -19 18 87 155 178 201 174 146
10311 146 43 -60 -153 -246 -231 -217 -205 -193 -158 -123 -65 -7 -25 -43 15 74 87 101 65 29 17 4 30 56 82 108 94 80 21 -38 -119 -200 -247
10302 -247 -218 -154 -90 -67 -44 -37 -31 -70 -109 -116 -123 -129 -136 -134 -133 -131 -129 -88 -48 -7 33 8 -15 -40 -64 -86 -108 -130 -153 -192 -232 -195 -158 -107 -56 -28 0 -13 -26
10291 -26 6 39 0 -41 -59 -77 -55 -33 -11 10 0 -11 -74 -45 36 118 68 17 -17 -52 -88 -123 -119 -115 -111 -106 -86 -66 -69 -71 -55 -38 -67 -96 -100 -103 -107 -111 -83 -55
10280 -55 -27 0 1 3 4 6 -16 -39 -85 -131 -125 -119 -36 45 90 134 133 132 168 205 241 278 291 303 291 187 96 6 16 27 47 67 41 15 -10 -37 -86 -135
10269 -135 -98 -62 -25 10 -34 -80 -80 -80 -66 -52 -61 -69 -52 -34 -17 0 0 0 46 93 111 129 125 120 140 160 180 200 172 144 70 -3 -71 -139 -99 -60 -86 -113
10259 -113 -162 -212 -207 -203 -155 -108 -76 -89 -154 -218 -201 -183 -124 -65 -53 -117 -138 -159 -127 -95 -64 -32 16 66 95 78 8 -62 -84 -61 -37 -12 14 41 8
10249 8 -24 -57 -90 -124 -157 -188 -219 -216 -168 -119 -116 -95 -73 -100 -127 -93 -58 -41 -70 -146 -175 -127 -78 -35 8 3 -47 -126 -159 -112 -19 38 51 15 -20 -9 1
10239 1 35 69 63 58 52 46 33 19 -40 -99 -140 -180 -187 -118 -46 25 56 86 94 102 87 71 82 93 107 75 74 74 93 112 166 219 222 179 174 169 189 164 91 63 109
10228 109 110 71 33 37 42 8 -25 -61 -52 -16 19 54 90 116 97 60 23 10 42 72 102 91 81 24 -32 -54 -77 -100 -122 -17 87 115 143 131 120
10218 120 154 188 162 135 109 83 60 37 13 -9 21 53 85 116 147 177 162 146 131 116 101 86 51 17 -16 -50 -39 -27 29 87 84 82 33 -15 -19 -22
10208 -22 -72 -122 -58 5 36 -9 -72 -135 -157 -179 -184 -190 -149 -109 -55 -1 52 106 135 164 86 8 -27 -63 -99 -135 -110 -85 -60 -35 -51 -68 -39 -10 -18 -27 -35
10198 -35 -43 -38 -33 -28 -24 10 45 79 114 94 75 98 121 145 122 78 110 137 87 9 -68 -124 -180 -203 -149 -59 30 48 66 44 22 0 -21 -19 -17 -15 -13 -60 -106
10187 -106 -46 13 8 3 -1 -6 -24 -41 -59 -76 -27 21 71 120 108 95 33 -27 -29 -76 -140 -128 -107 -87 -61 -36 -18 0 16 34 77 121 118 116 57 -1 -60 -119
10177 -119 -108 -98 -87 -76 -22 30 87 144 209 320 491 586 508 384 281 179 100 21 -11 -44 3 50 98 146 132 118 103 89 65 42 18 -4
10168 -4 -1 2 5 8 -6 -22 -37 -53 -101 -149 -163 -101 -25 51 133 214 190 165 94 23 22 20 -26 -74 -83 -93 -61 -29 21 -3 -119 -234 -294 -277 -197 -116 -127 -138
10158 -138 -226 -314 -335 -357 -333 -309 -250 -192 -134 -76 -77 -79 -80 -81 0 82 87 93 110 127 98 69 37 5 -25 -57 -73 -88 -103 -119 -105 -90 -76 -62 -67 -72 -77 -82 -52
10147 -52 -22 6 36 57 79 146 214 228 242 233 223 180 136 119 101 108 161 197 141 97 98 91 84 40 -3 -1 0 -9 -19 -7 96 148 153 162 217 311 360 336 313
10136 313 377 533 819 1105 1094 808 548 380 264 149 22 -105 -168 -140 -92 -90 -81 -73 -44 -15 0 15 8 0 52 103 78 52 -12 -78 -97 -117
10127 -117 -101 -84 -45 -6 -8 -11 -13 -15 2 20 16 -78 -167 -210 -208 -206 -174 -141 -108 -76 -71 -66 -15 35 -4 -43 -6 31 80 128 70 12 -44 -101 -112 -123 -103 -84 -110
10117 -110 -136 -163 -190 -171 -151 -113 -75 -60 -46 -52 -59 -65 -72 -71 -70 -46 -22 -13 -5 17 85 146 116 111 153 157 115 73 76 70 18 -30 -33 -55 -77 -73 -69 -64 -58 17 93 106 28
10105 28 -53 -43 -45 -93 -133 -127 -115 -57 34 34 39 136 303 423 390 264 161 104 96 87 81 75 80 86 91 97 72 48 24 0 22 45 21 -2 -24 -45 -67 -89 -120
10094 -120 -151 -136 -121 -77 -33 -66 -99 -68 -38 -7 23 50 77 27 -22 -57 -92 -128 -163 -178 -194 -132 -71 12 96 103 110 123 137 127 118 22 -73 -120 -168 -117
10084 -117 -20 28 -14 -79 -99 -104 -109 -87 -65 1 69 56 44 31 19 46 74 102 129 83 36 36 35 51 67 82 98 80 63 45 28 37 46 55 64 50 35 51
10074 51 21 10 75 162 203 194 109 64 19 -16 -51 -86 -122 -147 -172 -198 -223 -160 -97 -81 -64 -86 -109 -54 0 18 36 55 74 19 -34 -12 9 22 35
10064 35 3 -29 37 103 124 145 85 25 42 59 75 90 60 30 2 -24 -54 -7 73 78 23 -31 -47 -63 -2 57 103 148 148 147 135 123 111 99 67 34
10054 34 1 -30 -17 -4 -67 -131 -126 -121 -70 -19 20 60 100 141 169 197 118 39 24 9 71 132 162 191 175 159 164 170 176 181 132 82 78 75 113 152 196 240 332
10044 332 516 800 1083 1014 668 426 276 189 101 20 -61 -81 -100 -119 -139 -103 -67 -77 -87 -79 -72 -111 -149 -137 -125 -113 -101 -47 7 15 23 -10 -45
10034 -45 -80 -115 -138 -161 -184 -208 -162 -116 -25 66 105 144 137 130 94 57 -24 -107 -71 -35 1 37 38 39 40 41 23 5 -13 -31 -24 -17 -10 -4 -6 -7 -61 -23 7 38 29
10023 29 19 20 20 91 162 203 151 152 152 133 113 93 74 36 0 -37 -74 -112 -149 -186 -224 -191 -159 -126 -94 -45 2 102 111 28 -53 -96 -138 -134 -130 -125 -121 -139 -158
10012 -158 -228 -206 -160 -114 -109 -103 -96 -88 -80 -73 -65 -57 -19 -27 -18 67 104 140 181 176 153 131 151 217 237 211 188 164 134 105 105 60 15 15 14 13 14 16 -19 -55 -88 -121 -118
10001 -118 -68 0 69 87 104 121 138 132 125 118 111 61 10 -66 -96 -95 -95 -91 -87 -76 -65 -25 -32 -55 -33 32 52 25 0 -55 -64 -77 -90 -100 -110 -100 -91 -81 -71 -58
9990 -58 -45 -7 -14 -48 -82 -119 -156 -173 -191 -180 -215 -240 -219 -180 -142 -158 -174 -216 -213 -174 -136 -92 -47 -21 51 98 145 158 171 139 106 61 17 -6 14 22 31
9979 31 24 -27 -122 -171 -142 -113 -105 -98 -62 -72 -70 -21 23 23 34 44 6 -31 -40 -48 -98 -148 -180 -136 -58 18 43 68 47 26 34 42 3 -34 -61 -88 -69 -50 -79 -108
9968 -108 -92 -75 -76 -77 -79 -80 -69 -58 24 107 136 88 57 72 84 95 110 125 89 53 17 -18 -116 -214 -251 -212 -176 -186 -149 -65 29 79 50 21 39 57 29
9958 29 1 -40 -82 -78 -74 -16 42 54 66 90 113 137 160 169 178 188 197 180 164 148 131 168 204 194 185 110 35 -39 -113 -179 -245 -235 -225 -188 -152 -162 -171 -141 -110
9948 -110 -3 103 149 195 165 135 80 24 -30 -85 -78 -71 -64 -57 -31 -5 20 46 12 -22 -56 -90 -59 -28 2 32 -21 -75 -129 -184 -195 -206 -115 -24 2 -46
9938 -46 -78 -65 -38 -11 18 48 -3 -56 -63 -69 -83 -96 -109 -123 -100 -78 -55 -33 -16 0 -28 -57 -107 -156 -159 -162 -168 -173 -132 -91 -31 28 11 -5 -53 -101 -73 -44
9927 -44 -30 -15 -1 13 42 71 23 -24 -19 -14 -116 -218 -261 -304 -271 -237 -170 -104 -83 -62 -68 -74 -80 -86 -19 47 114 181 173 164 156 148 136 123 68 13 -11 8 49
9916 49 13 -14 2 -13 -28 -33 -83 -154 -147 -74 -47 -35 -23 -2 19 -5 -29 -39 -49 -12 23 4 -15 -34 -53 -53 -53 -53 -53 -94 -134 -128 -122 -111 -100 -12 75 58 41
9906 41 23 6 17 29 40 51 28 5 -65 -60 25 34 15 -4 -27 -50 -114 -179 -220 -184 -115 -46 -37 -28 -19 -10 -26 -41 -56 -72 -68 -64 -60 -57 -36 -16 4 24 44 65
9895 65 85 105 103 100 97 94 49 4 -40 -85 -32 19 72 125 89 54 95 136 134 132 84 36 3 -30 -63 -97 -60 -22 60 143 130 117 105 92 29 -33 -50 -67
9884 -67 -72 -77 -83 -88 -142 -195 -202 -210 -155 -100 -121 -143 -116 -90 -17 55 57 60 17 -25 -8 8 25 42 40 38 -9 -57 -52 -46 -40 -34 -28 -23 -17 -11 -80 -148 -168 -188 -128 -21 56 57
9872 57 -9 -75 -147 -218 -183 -148 -159 -93 -8 31 -2 -36 -88 -95 -81 -67 -103 -139 -129 -119 -102 -85 -68 -52 -41 -30 -93 -155 -157 -112 -48 16 75 133 172 164 166
9862 166 168 94 20 5 37 68 54 63 73 79 86 93 100 107 115 110 106 28 -49 -50 -4 60 126 163 201 239 277 231 185 140 94 86 78 24 -29 -34 -38 -43 -47 -29 -10 -38 -65
9850 -65 -89 -113 -137 -161 -214 -266 -240 -169 -110 -97 -101 -105 -103 -101 -124 -102 -5 91 112 87 88 134 153 171 157 144 130 117 119 122 125 128 118 107 56 5 -31 7 50 92
9839 92 97 102 108 113 104 96 88 79 90 100 63 -20 -113 -160 -190 -220 -205 -191 -176 -162 -92 -22 1 25 45 64 84 103 60 16 -27 -70 -96 -122 -71 -21 -39 -57 -30
9828 -30 -2 -13 -25 -67 -63 -24 -63 -124 -139 -127 -70 -55 -87 -108 -130 -155 -180 -143 -107 -70 -34 -31 -29 -27 -25 19 65 110 156 139 122 60 -2 -3 -5 -6 -7 -23 -39 -55
9817 -55 -70 -15 39 94 149 157 165 128 90 54 17 12 -39 -112 -108 -73 -39 -20 -1 18 37 42 46 51 56 31 5 -19 -45 -41 -38 -80 -123 -129 -136 -96 -56 -45 -35 -24 -13
9806 -13 -4 4 13 22 -15 -53 -90 -128 -124 -120 -75 -30 -22 -91 -143 -148 -93 -38 19 77 29 -18 -20 -23 5 33 61 89 91 92 93 95 110 125 94 63 58 53 48 42 35 28 20 13 22 31 39 48
9793 48 70 91 96 54 21 34 44 8 -59 -126 -120 -114 -109 -104 -99 -94 -111 -127 -144 -161 -131 -100 -73 -46 0 0 -19 -39 -35 -32 -58 -37 -6 -20 -51 -83 -77 -71 -45 26 65
9782 65 104 95 40 -15 -70 -106 -96 -81 -21 44 63 26 34 86 91 42 -7 -60 -113 -100 -88 -73 -57 -27 49 114 72 12 -46 -66 -86 -73 -60 -46 -33 -39 -45 -25
9771 -25 -51 -65 -79 -93 -107 -136 -118 -53 12 47 36 4 -26 -18 -9 -1 6 -13 -33 -51 -68 -26 61 146 186 169 106 69 32 54 122 191 213 178 143 151 159 167 176
9760 176 185 194 162 129 97 65 59 53 -25 -104 -146 -142 -121 -100 -104 -155 -206 -210 -196 -183 -189 -149 -122 -49 26 56 20 -15 -51 -87 -102 -71 -40 -55 -64 -74 -86 -99 -116
9750 -116 -133 -150 -167 -205 -242 -175 -108 -51 -41 -76 -112 -143 -98 -48 -75 -86 -20 26 27 11 40 66 47 19 -7 66 140 152 119 68 16 -43 -58 5 69
9740 69 119 123 106 90 85 79 0 -79 -130 -135 -121 -106 -71 -37 -48 -59 -82 -105 -83 -60 -1 57 96 90 31 -26 -85 -143 -125 -61 2 20 40 60 61 15 -31 -33 -17
9729 -17 -1 3 7 -10 -29 -12 3 -25 -55 -77 -99 -44 10 44 79 68 56 73 90 107 124 113 101 90 79 108 138 186 234 262 213 162 111 106 101 50 -1
9719 -1 17 36 55 74 66 58 4 -49 -99 -149 -165 -105 -24 57 98 139 162 186 132 79 63 47 107 167 253 338 346 355 281 208 180 152 103 53 49 45 82 119 156
9708 156 193 223 252 282 312 302 293 306 320 278 236 149 61 115 169 176 184 172 160 171 182 150 117 46 -25 -37 58 139 220 265 309 354 399 389 379 323
9699 323 267 253 239 179 119 93 67 41 16 12 8 3 0 14 29 44 59 56 52 49 45 58 71 83 96 159 222 239 256 284 312 294 276 253 230 229 229 186 143 100
9688 100 57 104 150 197 243 263 283 302 322 331 340 349 358 406 453 455 457 448 438 452 465 400 334 376 418 469 519 575 540 468 396 395 394 413 433 499 564 569 573 623
9677 623 674 738 802 820 838 779 720 738 756 837 919 923 928 925 922 995 1069 1143 1217 1347 1569 1776 1983 2150 2317 2517 2717 2940 3164 3376 3588
9668 3588 3750 3821 3888 4046 4176 4260 4373 4533 4790 5139 5610 6233 7075 8132 9575 11600 14552 18759 24661 32554 42096
9662 42096 52649 63505 74315 84889 95065 104793 113817 121114 125072 124602 120058 112685 103811 94216 84406 74512
9658 74512 64573 54731 45409 37074 30056 24493 20186 16886 14291 12147 10340 8782 7500 6524 5762 5142 4613 4228
9653 4228 3936 3683 3522 3351 3180 3010 2931 2895 2859 2857 2946 3069 3239 3439 3548 3567 3586 3599 3613 3544 3475 3387 3344 3382 3513 3706 3946 4228
9645 4228 4509 4791 5072 5288 5457 5567 5584 5548 5512 5472 5433 5475 5562 5750 6029 6355 6833 7491 8426 9752 11599 14216 18028 23433
9639 23433 30585 39367 49345 59946 70701 81271 91444 101172 110195 117626 122208 122666 118744 111472 102332 92299
9634 92299 81867 71222 60484 49942 40043 31304 24127 18645 14663 11841 9786 8297 7206 6394 5736 5189 4734
9630 4734 4298 3953 3732 3602 3502 3403 3334 3265 3242 3219 3240 3261 3282 3303 3405 3507 3606 3705 3813 3875 3845 3724 3584 3443 3322 3293 3349 3406
9622 3406 3524 3734 4010 4287 4520 4753 4961 5122 5197 5118 4958 4798 4720 4735 4843 5043 5254 5619 6063 6599 7284 8306 9680 11514
9615 11514 13976 17449 22390 28956 37125 46550 56741 67269 77839 88256 98419 107938 116068 121594 123220 120344
9611 120344 113746 105035 95294 84972 74293 63522 52855 42586 33232 25379 19288 14881 11730 9529 7942 6754
9606 6754 5852 5165 4604 4134 3710 3333 2991 2696 2459 2267 2105 1943 1784 1625 1460 1296 1269 1242 1240 1238 1236 1234 1112 990 913 837 815
9599 815 793 771 749 741 734 726 719 730 740 751 762 674 587 545 503 486 470 453 436 434 432 429 427 402 377 352 326 240 153 120 178 208 193 108 23 -21 26 94 116
9588 116 138 160 179 198 185 172 159 147 144 141 139 136 160 184 132 80 45 11 22 34 92 149 161 172 178 183 112 -4 -75 -68 -31 5 35 65 96 126 116 106
9578 106 97 87 127 167 161 155 168 181 240 299 280 260 241 221 201 181 206 232 300 369 361 353 339 324 355 387 386 385 384 384 359 334 310 285 249 214 178 143 137 131
9567 131 125 119 62 4 -6 -17 -30 -43 -56 -69 -8 51 66 81 82 83 85 86 64 43 67 91 45 -1 -47 -94 -90 -87 -7 72 53 34 61 89 101 113 80 46 0
9556 0 -47 -94 -141 -134 -126 -119 -112 -94 -75 -56 -38 -42 -47 -51 -55 -22 10 43 76 94 112 53 -4 -52 -100 -71 -43 -27 -12 80 172 177 182 80 -67 -191 -238 -194 -103
9545 -103 -63 -99 -165 -232 -204 -177 -149 -122 -116 -111 -64 -18 0 -60 -122 -184 -157 -130 -103 -76 -71 -66 -61 -57 -66 -76 -40 -3 3 11 18 26 35 45 70 141 202 187 142 97 78
9534 78 59 86 114 88 63 38 12 35 57 80 102 95 88 127 166 168 169 171 173 113 53 -6 -67 -41 -16 8 33 14 -4 52 110 61 12 10 7 18 29 -5 -40
9523 -40 -27 -14 -1 11 -17 -46 -75 -104 -86 -68 -5 58 66 74 81 89 59 30 46 63 101 140 132 125 112 99 85 72 46 20 -5 -31 -48 -66 -83 -101 -69 -37
9513 -37 -51 -65 -102 -140 -132 -124 -116 -107 -52 1 101 200 266 255 170 85 41 -2 -24 -47 -69 -91 -105 -119 -87 -55 -60 -65 -71 -76 -71 -66 -61 -56 -40 -25 -55 -131 -183 -159 -103
9502 -103 -48 -43 -37 -31 -26 -76 -126 -143 -83 -11 59 59 59 89 119 104 88 47 5 -30 -67 -92 -40 14 68 52 35 41 48 22 -3 -74 -146 -159 -173 -109 -46 -90 -134
9491 -134 -155 -176 -198 -221 -214 -131 -39 -24 -37 -50 -73 -95 -95 -94 -17 60 61 62 81 100 96 92 44 -3 -5 -7 30 68 32 -3 43 137 185 187 169 152 155 158 187 216 265
9480 265 314 328 296 213 130 77 24 13 3 23 -3 -77 -152 -152 -106 -43 19 38 11 -66 -144 -184 -225 -243 -214 -183 -106 -23 13 3 38 72 59 63 67 69 70
9469 70 83 95 107 120 67 14 -16 -46 -89 -132 -125 -72 -44 -16 14 45 54 63 72 81 90 99 105 111 92 27 -37 -56 -34 -12 -4 -42 -93 -98 -55 -11 4 20 37 53 68
9458 68 83 55 27 12 43 54 19 -14 -3 23 49 49 4 -14 -33 -48 -62 -76 -91 -64 -38 -11 14 34 53 79 58 35 57 97 137 137 136 113 89 44 0
9448 0 -27 -9 -44 -125 -153 -89 0 87 135 183 176 169 116 63 2 -59 -44 -29 2 34 65 97 71 46 -25 -97 -85 -74 -62 -51 -69 -87 -105 -123 -148 -173 -198
9438 -198 -223 -182 -142 -102 -62 -61 -61 -60 -60 -40 -20 -1 18 16 13 11 9 -4 -17 -31 -45 -35 -25 -15 -5 -14 -23 -32 -41 -34 -27 -20 -12 -8 -4 0 4 59 113 121 130 107 84 60 37 44
9425 44 51 57 64 59 55 50 45 15 -14 -44 -74 -12 50 36 22 8 -5 -20 -34 -3 26 103 179 115 52 34 16 40 65 89 113 114 115 116 117 138 159 134 109 85 62
9414 62 38 15 0 -16 -32 -47 -87 -126 -88 -51 -45 -39 -34 -28 -73 -118 -164 -209 -177 -144 -112 -80 -52 -24 -42 -60 -40 -21 -1 17 13 9 4 0 -68 -138 -207 -276 -238
9403 -238 -199 -161 -123 -84 -46 -8 30 34 39 44 48 69 90 111 132 129 127 79 31 -22 -76 -125 -173 -201 -136 -52 -14 23 60 18 -23 2 28 53 79 73 68 59 50 82
9392 82 68 26 75 76 32 19 6 35 64 93 122 119 117 114 112 124 137 72 8 -4 -16 16 50 60 70 81 91 70 48 -18 -85 -86 -87 -44 45 142 148 70 -7
9381 -7 -25 -44 -63 -81 -59 -36 -60 -83 -38 6 6 5 -18 -43 -67 -91 -116 -140 -118 -96 -53 -9 10 30 69 108 146 185 252 318 385 452 536 619 669 643 553
9371 553 464 415 367 298 230 208 186 188 191 148 104 70 36 48 60 67 73 33 -5 -48 -91 -88 -85 -71 -57 -66 -75 -54 -34 -14 6 -15 -37 -36 -35 -87 -139 -84 -29 23
9360 23 77 84 92 98 105 65 26 2 -21 -22 -22 -32 -41 -51 -60 4 70 133 119 73 27 22 17 45 73 55 37 46 56 88 120 70 19 46 72 92 112 55 0 -16 -31
9349 -31 -1 29 26 23 20 17 -1 -20 -35 -49 -18 89 180 224 241 257 255 208 168 205 174 142 150 158 123 87 12 -17 3 24 65 106 152 153 120 134 165 196 262
9338 262 327 413 544 680 816 972 1127 1255 1275 1201 1049 895 741 603 510 427 345 288 277 286 341 396 450 512 574 603 555 386 218
9330 218 68 -36 -65 -49 -10 29 34 40 91 142 184 225 269 268 238 208 196 229 272 314 363 411 491 618 790 962 1086 1134 1120 1107 1147 1233 1309
9321 1309 1338 1258 1009 745 589 489 389 373 356 377 398 419 440 460 479 522 611 772 978 1198 1341 1374 1299 1111 923 763 603 469
9313 469 335 232 175 138 100 87 73 59 45 20 -4 -9 31 34 37 47 56 28 47 82 118 162 160 138 116 44 -28 6 41 59 77 49 21 -13 -47 -59
9304 -59 -71 -59 -47 -36 -24 5 35 19 3 22 41 83 125 153 182 134 85 88 91 116 142 131 121 108 95 83 24 -8 35 57 33 14 41 70 100 86
9294 86 73 88 103 72 41 93 145 174 203 247 291 289 287 267 248 206 164 122 81 85 90 103 116 130 143 155 166 201 236 218 201 137 28 -80 -112 -84
9284 -84 -9 93 120 85 50 31 13 17 22 53 85 117 148 161 174 140 107 38 -31 -54 -77 -75 -72 -92 -113 -116 -120 -78 -35 1 38 75 112 148 185 144 104 72
9273 72 41 -66 -175 -208 -241 -229 -216 -214 -212 -134 -55 -1 52 83 114 73 32 37 42 72 101 54 7 6 5 50 96 104 111 119 127 65 3 17 31 79 126 191 256
9263 256 290 232 191 241 291 248 191 180 239 299 338 377 393 410 472 535 556 576 490 404 304 204 150 97 44 -8 45 99 125 151 199 248 267 286
9253 286 305 324 420 516 612 708 839 970 1137 1305 1313 1168 920 764 656 547 445 342 346 350 331 313 201 90 32 65 103 95 73 51
9245 51 19 -11 -19 -27 -23 -19 -14 -10 -3 4 34 65 71 77 69 15 -30 15 33 4 36 67 25 -16 -32 43 93 97 80 64 50 36 -5 28 111 118 104 135 165 149 101 100
9233 100 147 194 200 206 213 219 187 156 124 92 131 170 163 156 198 240 209 177 100 68 72 153 262 326 343 361 388 415 442 469 586 704 891 1077 1123 1061
9223 1061 921 782 670 558 523 488 401 314 227 140 153 166 179 193 164 135 106 77 82 86 90 95 115 136 156 177 180 184 146 108 85 138 194 250 235
9214 235 220 205 190 162 133 59 -14 -19 -24 -29 -34 -30 -27 -23 -19 -7 5 18 30 16 2 -11 -25 16 59 101 144 171 198 123 48 17 62 141 220 228 236 290 344 424
9203 424 505 583 660 691 676 598 445 289 240 265 289 339 389 485 581 637 694 827 960 1093 1227 1254 1281 1176 1071 936 846 776 629 398
9195 398 213 113 60 6 -1 33 113 194 228 183 92 -1 -49 -33 -17 1 20 -6 -34 13 62 41 20 0 -22 -5 11 28 45 45 46 46 47 107 167 150
9185 150 133 170 207 244 281 423 564 628 585 477 369 254 140 77 14 -47 -110 -121 -132 -97 -62 -18 25 23 21 15 10 -67 -144 -161 -101 14 84
9176 84 86 41 20 -1 13 28 88 149 183 217 205 193 182 171 160 149 85 22 4 -13 24 62 23 -14 3 22 41 59 40 20 1 -18 11 41 72 102
9166 102 91 80 69 57 53 49 44 40 60 80 24 -31 -129 -226 -219 -213 -190 -214 -212 -133 -48 -9 -15 -22 -26 -30 11 53 49 44 39 34 -24 -83 -97 -110 -92 -73 -9 54 73 91
9154 91 33 -24 -19 -15 -56 -96 -126 -155 -139 -122 -59 3 64 124 185 200 239 354 441 451 483 561 569 578 590 525 445 412 348 284 256 229 202 175 150 126 107
9144 107 87 94 179 309 362 326 291 297 411 565 719 875 1032 1210 1311 1286 1154 940 726 553 486 465 443 428 413 383 353 323 293 269
9136 269 246 176 107 102 98 93 89 126 164 201 239 231 223 184 69 -35 -95 -121 -70 13 98 106 68 8 -50 -78 -30 41 113 141 169 135 55 21 32 53 73
9126 73 97 120 176 232 305 424 526 581 586 590 541 445 349 299 346 392 442 491 519 546 594 687 861 1035 1118 1063 942 776 629 482 356 277
9117 277 247 218 179 139 100 60 2 -54 -66 -78 -74 -69 -65 -60 -29 2 34 65 104 142 135 127 130 132 132 132 161 144 107 71 57 44 31 17 12 8 6 4 -10 20 54 42
9105 42 26 56 58 59 16 -27 -23 26 50 27 33 40 91 142 173 158 94 30 -32 -96 -96 -49 16 82 114 146 161 130 81 78 46 14 -8 -32 -5 67 107 148 168
9094 168 188 220 253 179 105 87 70 53 35 -5 -47 -66 -85 -150 -215 -174 -132 -61 9 3 -1 -57 -113 -123 -133 -98 -64 -52 -40 8 57 61 64 63 62 16 -30 -25
9084 -25 -21 29 80 90 101 35 -30 -44 -59 -27 3 17 32 -30 -92 -121 -149 -102 -54 -26 1 30 58 47 35 47 59 85 110 59 8 -40 -90 -93 -97 -44 8
9074 8 61 114 68 21 82 143 171 198 149 100 58 17 21 26 92 159 226 292 292 292 298 211 91 -28 -98 -122 -132 -51 29 64 100 135 91 47 18 -9 -60
9064 -60 -112 -92 -73 -54 -35 18 71 79 87 25 -36 -104 -80 -47 -14 -21 -28 -8 11 31 51 30 9 -33 -77 -35 5 -28 -63 -64 -65 -21 23 1 -20 -89 -157 -177
9053 -177 -198 -172 -146 -125 -105 -38 28 50 72 94 116 106 97 87 77 53 29 4 -19 -25 -30 -35 -41 -75 -110 -145 -180 -202 -223 -245 -267 -257 -247 -214 -180 -143 -105
9043 -105 -114 -122 -137 -151 -119 -88 18 124 184 245 216 187 116 46 -1 26 88 150 140 130 74 18 31 44 34 24 27 30 10 -9 -105 -200 -189 -177 -174 -170 -167
9033 -167 -163 -136 -109 -127 -146 -147 -147 -102 -57 -55 -53 -51 -48 -23 1 -19 -39 -44 -49 -31 -13 -8 -3 -44 -85 -78 -70 -20 30 89 102 93 83 129 129 108 88 104 120 115 65 22 -20
9021 -20 -86 -152 -171 -144 -97 -49 -65 -82 -100 -42 42 49 -1 -53 -86 -118 -134 -103 -56 -55 -102 -149 -169 -188 -162 -136 -76 -17 44 60 35 10 6 1 -25 -52 -33
9011 -33 -14 -25 -35 -63 -92 -121 -75 -22 -15 0 15 28 41 50 60 46 33 89 144 179 169 147 125 77 29 23 17 34 51 18 -15 -2 9 51 94 134 173
9001 173 133 48 39 75 89 103 43 -62 -120 -101 -82 -64 -70 -75 -58 -41 -18 4 6 -36 -74 -112 -77 -41 -5 30 -7 -45 -61 -32 -5 -55 -107 -114 -106 -97 -94 -90 -67
8990 -67 1 5 9 16 23 6 -9 20 50 51 52 53 54 58 62 66 70 24 -20 -65 -110 -58 -7 44 95 42 -10 25 138 242 269 297 326 295 263 200 184 160 60 -59
8979 -59 -103 -128 -153 -127 -102 -53 -5 42 90 99 107 116 125 107 89 71 52 39 26 12 0 -85 -170 -175 -180 -146 -65 11 12 -17 -1 91 183 205 226 201 177 150 123
8968 123 97 70 79 87 95 104 56 8 -40 -88 -31 24 16 -68 -119 -169 -225 -281 -257 -232 -162 -92 -58 -23 -35 -47 -48 -49 -73 -97 -80 -62 -44 -27 -12 2 -29 -60
8958 -60 -26 6 -5 -18 6 32 80 128 95 63 30 -1 -5 -8 -11 -14 54 124 193 263 213 163 116 68 58 94 144 86 -11 -64 -41 -19 -77 -136 -166 -197 -194 -114
8947 -114 -32 50 66 82 98 114 113 111 156 201 185 170 154 139 99 59 19 -20 -17 -14 -11 -8 58 125 84 44 63 81 54 27 25 22 19 17 10 3 -3 -10 -11 -12 -36 -60 -46
8935 -46 -33 -65 -97 -68 -39 -33 -27 -38 -50 -15 19 10 1 -30 -63 -93 -124 -109 -94 -68 -43 -17 7 -21 -50 -79 -108 -89 -70 -51 -32 -54 -76 -75 -74 -94 -114 -31
8925 -31 50 56 -15 -68 -76 8 93 117 65 6 -51 -38 -25 49 123 218 237 174 112 118 124 118 67 -4 -76 -91 -106 -98 -91 -95 -99 -150 -124 -52 -27 -44 -61 -90 -73 19
8914 19 113 148 106 62 18 -11 -40 -67 -94 -98 -56 -57 -104 -112 -75 -16 -4 -72 -140 -160 -134 -94 -53 -56 -59 -38 -17 26 70 52 35 17 0 -14 -29 -43 -58 -40
8904 -40 -22 15 53 77 55 16 -23 -71 -73 -25 23 51 79 85 90 125 160 195 184 143 57 -32 -75 -82 -89 -93 -97 -65 -33 -47 -61 -30 0 -17 10 85 160 186 167
8893 167 120 73 69 65 64 63 69 28 -30 -43 -8 26 36 47 58 69 88 107 102 98 81 65 95 124 169 214 208 156 110 63 90 117 125 133 72 11 -7 -26 -22 -18 -22
8882 -22 -25 -29 -33 0 33 28 23 -16 -56 -58 -60 -38 -15 44 105 91 78 11 -55 -135 -216 -227 -238 -224 -209 -217 -226 -196 -166 -144 -167 -192 -140 -52 -41 -98 -155 -163 -172 -201 -230
8870 -230 -206 -181 -121 -62 -71 -80 -65 -50 -89 -127 -95 -63 -54 -45 -64 -82 -17 47 84 120 134 147 115 84 75 66 42 18 -5 -28 -73 -118 -79 -39 -36 -32 -29 -25 7 40
8859 40 73 106 90 75 60 44 71 98 148 198 121 44 5 -33 -16 0 71 142 137 133 128 124 122 121 112 180 298 371 357 266 185 103 86 68 65 61 35 9 11 14
8848 14 17 20 32 45 3 -37 -20 -4 12 29 37 45 15 -14 11 37 64 90 22 -46 -89 -56 29 114 105 19 -58 -90 -99 -108 -65 -22 20 63 32 1 -93 -188 -221
8838 -221 -177 -112 -93 -50 -7 32 71 58 45 31 18 45 71 45 18 -62 -143 -153 -162 -130 -52 -10 -46 -77 -109 -92 -75 -64 -54 -44 -33 -32 -31 -31 -30 -18 -7
8827 -7 26 61 -17 -96 -106 -116 -116 -115 -92 -68 -39 -10 -49 -89 -125 -161 -155 -74 14 102 111 120 94 67 41 15 20 26 32 37 22 7 -7 -22 -13 -5 -19 -34 -55 -77 -45
8816 -45 -13 25 64 81 97 105 113 98 83 72 62 5 -50 -81 -112 -98 -83 -93 -103 -113 -123 -103 -84 -18 46 116 186 180 173 99 24 -3 -32 -23 -13 -4 4 -108
8806 -108 -221 -271 -243 -220 -196 -122 -48 15 79 66 53 2 -48 -99 -151 -134 -117 -100 -83 -41 0 42 84 61 38 61 84 153 222 214 207 149 92 34 -22
8796 -22 -20 -18 -17 -15 -40 -65 -89 -114 -109 -103 -98 -92 -58 -24 -32 -41 -1 84 141 121 114 106 98 90 104 195 286 300 271 242 209 175 197 219 195 170 79 -11 -25 -40 -22 -5
8784 -5 12 29 26 22 19 15 78 142 98 54 13 -27 -63 -99 -110 -45 2 4 -32 -69 -32 3 -5 -15 -24 -34 -54 -75 -142 -209 -205 -201 -197 -193 -202 -210 -173 -136 -79 -23 -12 -2
8773 -2 -28 -54 -80 -106 -86 -66 -46 -27 13 54 18 -17 -56 -95 -58 -21 29 81 56 31 12 -5 -23 -41 -112 -183 -177 -171 -81 7 21 34 30 26 22 18 28 38 48
8762 48 58 41 24 7 -9 -15 -21 -26 -32 -38 -43 -49 -55 -100 -145 -190 -235 -238 -241 -168 -94 -40 13 21 29 47 64 36 8 -14 -38 -15 7 13 19 24 30 18 6 -5 -17 27 72
8750 72 118 163 126 90 53 16 -13 -44 -75 -106 -130 -153 -176 -200 -146 -92 -38 15 15 16 -29 -75 -58 -40 -23 -6 12 30 95 160 151 143 89 35 29 23 17 12 -15
8740 -15 -43 -71 -99 -143 -188 -233 -278 -219 -161 -102 -44 -4 34 74 113 80 46 19 -8 -38 22 84 54 -26 -108 -118 -128 -114 -101 -87 -73 -46 -19 7 34
8730 34 28 23 -28 -79 -114 -150 -139 -128 -118 -109 -80 40 153 175 85 -4 -30 -57 -37 -18 -29 -40 -11 17 58 7 -37 -83 -117 -152 -187 -221 -219 -217 -107 2
8720 2 -3 -8 -13 -19 -27 -36 0 37 63 89 69 49 40 31 23 14 1 -12 20 52 69 87 58 29 10 -8 -28 -47 -44 -42 -40 -37 -54 -71 -88 -105 -125 -145 -165 -185 -181 -178 -174 -170 -86
8708 -86 -2 32 67 72 30 -30 -92 -111 -131 -107 -83 -70 -103 -136 -122 -51 19 59 23 20 17 9 2 -32 -66 -70 2 79 111 99 88 31 20 29 38 51 64 77 90
8697 90 114 138 143 101 35 -29 -78 -80 -44 -8 -15 -22 -56 -91 -78 -19 39 51 16 -18 -17 -16 2 66 123 135 98 61 23 -14 -7 0 23 47 97 100 80 60 37 14
8686 14 11 9 -36 -82 -114 -100 -86 -118 -174 -229 -211 -193 -160 -128 -113 -143 -152 -116 -107 -99 -88 -78 -67 -56 25 108 141 174 186 153 116 126 123 74 -17 -64 -58 -52 -44 -35
8675 -35 -44 -52 15 84 82 81 33 -13 9 33 41 4 -15 42 102 116 95 75 75 75 105 136 144 152 121 91 -16 -123 -188 -254 -182 -110 -65 -21 -22 -24 -25 -26 -50 -74 -62
8664 -62 -51 -24 48 107 90 72 55 43 31 96 160 145 129 113 98 104 110 116 122 114 107 58 10 -9 46 105 164 208 252 219 186 138 89 41 -6 30 68 82
8653 82 96 84 72 14 -43 -80 -118 -78 -39 -17 5 -17 -41 -52 -64 -52 -41 -37 -33 -30 -26 -42 -58 -120 -182 -184 -185 -140 -95 -119 -142 -165 -189 -195 -202 -164 -125 -137 -149
8642 -149 -85 -20 6 34 39 44 54 64 51 39 -14 -68 -100 -131 -111 -91 -71 -52 -23 5 31 57 71 40 -8 19 46 74 107 139 122 105 85 65 62 13
8633 13 -32 -32 16 110 184 212 231 250 220 189 148 107 66 25 -38 -101 -57 -13 -3 6 17 27 25 24 22 21 52 83 95 60 27 -5 -61 -117 -109 -55 -3 47 97
8622 97 148 178 162 70 -22 -69 -70 -72 -120 -206 -215 -128 -42 -27 -12 14 41 68 95 100 105 109 114 92 70 72 73 88 103 45 -13 -56 -53 -31 -8 -12 -15 -16 -63 -74 -85 -82
8610 -82 -33 28 43 39 -10 -78 -100 -77 -54 -16 -23 -79 -134 -172 -163 -134 -105 -98 -91 -41 8 28 1 -41 -85 -81 -31 18 23 57 92 17 -57 -97 -137 -131 -125 -92 -58 -71
8599 -71 -130 -146 -86 -3 33 17 -45 -84 -123 -110 -97 -84 -70 -91 -112 -86 -61 -18 25 -38 -102 -157 -212 -221 -231 -154 -77 -46 -15 -14 -13 -59 -104 -169 -235 -224 -212
8589 -212 -147 -81 -15 50 45 41 -8 -58 -66 -75 -38 0 12 25 39 52 96 139 106 27 -9 28 67 106 127 148 123 98 75 52 30 7 -14 -35 -56 -78 -109
8579 -109 -140 -124 -109 -75 -41 -53 -65 -64 -63 -62 -62 -47 -33 -90 -147 -134 -45 26 52 48 44 37 30 2 -25 -7 10 53 96 32 -31 -90 -148 -206 -265 -219 -173 -127 -82
8568 -82 -67 -53 -42 -30 52 89 75 61 38 14 37 59 59 59 104 150 133 116 100 83 128 172 166 114 104 94 81 69 33 -2 -38 -74 -75 -76 -78 -79 -36 5 45
8557 45 85 96 61 52 43 14 -15 1 17 28 38 39 -66 -127 -80 -26 -18 -52 -40 -9 68 146 179 160 142 163 139 94 49 67 85 104 122 113 105 96 88 63 39
8547 39 58 76 112 102 72 42 30 17 51 84 73 61 29 -47 -93 -140 -140 -141 -103 -19 64 102 76 49 20 -8 -70 -132 -114 -96 -145 -147 -99 -51 -12 27 20
8537 20 14 19 24 -18 -107 -144 -136 -110 -84 -25 32 59 10 -38 -41 -29 -16 -13 -10 -50 -89 -95 -54 -14 -19 -45 -72 -72 -119 -131 -97 -89 -81 -61 4 41 78 94 64 60 56 56 55
8525 55 55 55 36 16 23 -16 -66 -117 -124 -132 -100 -68 -82 -96 -59 -21 -30 -38 -43 -47 19 86 115 67 19 -28 -85 -95 -55 -15 -19 -22 -25 -29 -11 5 -27 -106 -159 -212 -222 -232
8513 -232 -200 -168 -136 -104 -68 -31 4 40 15 -10 -36 -62 -69 -76 -40 -4 7 -25 -33 -41 -120 -199 -257 -270 -208 -146 -81 -16 -18 -20 -22 -24 -55 -87 -119 -150 -136 -122 -150
8502 -150 -177 -216 -180 -114 -94 -104 -114 -49 62 124 141 110 79 50 22 -3 -29 -49 -23 2 -17 -50 -82 -43 -4 32 24 -31 -87 -89 -46 -28 -10 -36 -61
8493 -61 -87 -113 -112 -111 -110 -109 -85 -62 -39 -16 -32 -48 -18 11 -33 -79 -105 -84 -78 -72 -63 -55 -34 -14 5 26 34 43 6 -31 -42 -54 -91 -82 -40 2 2 2 -63 -128 -160 -115
8481 -115 -59 -2 13 29 41 53 62 71 66 15 -34 -39 12 65 75 84 77 70 80 136 181 179 161 142 97 53 54 56 52 49 42 36 -7 -96 -129 -86 -33 -26 -37 -48 -39 -75 -135
8469 -135 -194 -207 -266 -279 -245 -145 -44 38 75 91 108 164 221 232 198 189 180 172 163 154 146 130 114 99 83 104 125 172 172 127 81 -7 -95 -94 -1 48 6 -65
8459 -65 -92 -150 -208 -204 -200 -195 -191 -137 -83 -75 -67 -75 -83 -91 -99 -86 -72 -58 -45 14 74 57 40 30 20 56 93 100 108 69 31 -4 -41 -86 -39 -19 -46 -41 -36 -17 2 21
8447 21 41 51 62 27 -7 -40 -74 -107 -140 -177 -214 -175 -135 -121 -106 -92 -78 -71 -64 -72 -125 -186 -155 -72 11 13 15 17 19 64 110 78 47 61 76 91 105 27 -49
8437 -49 -78 -107 -85 -17 76 78 39 0 31 62 68 74 126 177 208 238 161 84 -3 -91 -73 -10 -5 -93 -126 -159 -206 -252 -222 -192 -130 -67 -5 56 53 49 0 -49
8426 -49 -124 -199 -166 -133 -86 -39 2 44 61 2 -82 -121 -143 -119 -16 87 129 95 33 16 31 46 63 81 26 -29 -38 -48 -34 -19 -51 -82 -69 -56 -89
8417 -89 -122 -139 -155 -126 -97 -113 -128 -144 -160 -120 -80 -40 0 56 113 94 75 112 149 140 132 70 9 24 85 114 66 18 -29 -74 -118 -55 6 20 34 2
8407 2 -29 -41 -52 -64 -76 -72 -67 -63 -59 -51 -43 -35 -28 -47 -66 -85 -104 -90 -76 -62 -47 -114 -180 -170 -160 -138 -116 -140 -165 -145 -125 -59 6 -7 -22 -51 -127 -214 -225 -203
8396 -203 -135 -107 -126 -116 -105 -152 -198 -180 -86 -6 73 81 90 43 -2 -48 -95 -137 -180 -116 -51 -87 -123 -82 -42 -53 -65 -31 2 -11 -24 -84 -144 -170 -195 -145
8386 -145 -94 -17 60 104 71 49 27 0 -26 -54 -82 -88 -93 -63 -34 -51 -67 -93 -119 -122 -126 -121 -116 -65 -14 -6 1 -18 -38 -27 -92 -186 -280 -294 -231 -166 -100 -101 -102 -80
8375 -80 -57 -123 -188 -177 -166 -128 -91 -53 -15 -73 -131 -142 -154 -95 -36 -1 34 -8 -50 -16 16 51 85 97 108 132 156 103 51 0 -50 -78 -105 -97 -89 -104
8365 -104 -119 -135 -152 -192 -231 -231 -231 -154 -78 -68 -59 -72 -85 -38 8 32 56 34 13 37 61 38 14 -8 -32 -32 -33 -54 -74 -48 24 68 35 -32 -100 -97 -93 -86 -79
8354 -79 -97 -70 0 68 121 127 95 62 33 -42 -116 -144 -154 -165 -197 -228 -213 -199 -151 -102 -100 -144 -193 -166 -138 -111 -133 -155 -159 -118 -36 -1 -44 -86 -107 -128 -102
8344 -102 -77 -80 -84 -104 -171 -174 -130 -116 -101 -26 48 47 46 31 17 -20 -57 -72 -87 -122 -157 -149 -96 -19 10 41 71 79 41 -49 -139 -181 -178 -125 -72 -11 4 -5 30
8333 30 64 51 16 -18 -56 -94 -122 -149 -177 -204 -190 -175 -160 -146 -139 -133 -127 -120 -114 -108 -101 -95 -61 -28 4 38 103 168 185 156 89 67 63 59 34 9 3 44 69 93 44
8322 44 -4 2 9 23 -7 -44 -3 36 0 -36 -27 -2 21 12 3 71 138 142 145 102 60 36 13 -10 -34 4 42 81 119 77 34 -8 -51 -21 8 38 68 30 -7
8311 -7 -44 -82 -62 -41 -5 76 135 118 39 -38 -95 -153 -164 -176 -159 -142 -126 -109 -131 -154 -176 -199 -205 -211 -215 -218 -184 -104 -7 12 -39 -91 -102 -113 -98 -82 -112 -143
8301 -143 -128 -113 -98 -83 -23 36 50 64 70 76 6 -64 -137 -210 -207 -204 -173 -143 -112 -82 -122 -163 -157 -151 -125 -98 -72 -46 -21 2 27 51 66 80 17 -44 -101 -157
8290 -157 -168 -179 -161 -143 -125 -107 -70 -34 2 39 -4 -47 -137 -227 -243 -260 -199 -139 -86 -32 -55 -79 -84 -89 -94 -99 -35 27 45 63 69 75 81 87 110 133 111 88 43
8280 43 -1 30 62 100 139 101 63 37 10 60 110 146 183 194 113 39 -34 -114 -194 -157 -120 -37 45 19 -6 -32 -59 -102 -145 -111 -78 -17 42 23 4
8270 4 -20 -91 -187 -192 -150 -109 -21 65 126 96 71 46 1 -43 -11 19 41 62 83 104 156 207 213 219 222 226 229 233 170 107 76 0 -74 -56 -17 22 66 111 155
8259 155 199 216 233 244 255 240 134 53 18 29 40 54 68 36 5 -25 -56 -45 -33 -68 -103 -111 -118 -80 -42 5 54 102 151 112 72 79 85 114 142 171
8249 171 199 181 163 144 126 78 30 -17 -65 -53 -40 -74 -108 -117 -126 -135 -144 -162 -180 -152 -124 -61 1 -42 -86 -130 -174 -172 -170 -121 -73 -70 -67 -4 58 75 92 66 40
8239 40 14 -11 -43 -75 -73 4 82 160 135 111 86 62 37 13 -2 -18 -3 -35 -62 -13 18 4 -28 -16 44 104 116 127 93 58 43 27 11 -4 11 27
8229 27 89 151 153 156 204 253 231 210 189 167 116 65 60 55 32 10 34 57 39 20 2 -16 13 42 71 101 55 9 10 10 -17 -46 -74 -102 -54 -6 -4 -1 42
8218 42 86 131 175 103 32 -5 33 98 163 157 151 158 165 127 88 3 -80 -58 -35 -11 12 -70 -153 -184 -215 -139 -63 -14 34 6 -20 -29 -39 23 85 97 32 11
8208 11 -10 0 8 18 28 38 47 103 204 260 238 156 74 62 51 39 28 45 63 80 97 105 112 12 -87 -171 -254 -262 -269 -196 -124 -111 -174 -235 -219 -174 -129
8197 -129 -132 -134 -90 -123 -180 -191 -156 -121 -78 -36 -39 -43 -50 -57 -65 -72 -32 6 46 86 65 44 23 3 33 63 47 31 29 28 26 25 28 32 36 39 45 50 10 -30 -50 -71 -45 -19
8185 -19 -8 2 -32 -66 -51 -35 -19 -3 20 45 69 93 49 5 -38 -82 -73 -65 -56 -47 -41 -34 -101 -169 -147 -80 -30 -71 -95 -72 -58 -43 -40 -37 -80 -122 -163 -204 -198 -193
8174 -193 -150 -108 -42 23 70 117 136 155 161 75 -28 -133 -188 -152 -68 -29 2 -12 -49 -86 -100 -114 -127 -141 -95 -48 -47 -47 -4 38 1 -35 -72 -156 -265
8165 -265 -283 -211 -139 -62 15 29 42 56 69 95 121 71 -23 -89 -62 -44 -25 31 88 68 48 19 -9 7 24 10 -2 -61 -120 -153 -186 -197 -207 -173 -139
8155 -139 -129 -118 -104 -91 -77 -63 -54 -45 -35 -26 -43 -61 -78 -96 -32 31 95 159 104 49 41 32 0 -33 -20 -7 21 49 1 -46 -122 -198 -167 -135 -153 -171 -116
8145 -116 -60 -36 -59 -61 -18 -15 -58 -73 -87 -90 -92 -47 44 112 135 107 34 -23 -36 0 34 93 151 136 121 114 154 193 187 177 168 155 143 141 139 135 130 107 38 -29
8134 -29 -52 6 65 76 41 -1 -45 -43 3 57 65 56 47 31 15 0 -16 -46 -75 -100 -124 -169 -138 -107 -75 -68 -107 -139 -172 -207 -196 -106 -17 35 41 51 60 65 69 70
8123 70 71 95 72 29 -12 -43 -74 -125 -99 -47 4 15 25 18 11 4 -2 -63 -123 -133 -97 -96 -94 -87 -80 -61 2 66 84 56 27 -3 -35 -8 17 0 -15 -8 44 97
8112 97 104 115 126 160 149 102 56 52 49 64 79 95 110 96 83 69 55 13 -28 -50 -26 -19 -12 -3 6 1 -3 -5 -7 -31 -9 12 -11 -78 -145 -107 -70 -38 -7 21 50
8101 50 55 13 -73 -114 -132 -149 -147 -98 -82 -112 -113 -114 -104 -93 -83 -73 -95 -118 -112 -152 -216 -234 -171 -63 39 95 102 62 47 77 105 87 45 3 -24 -5 9
8090 9 -22 -53 -38 -19 -46 -44 -42 9 61 66 72 68 64 85 61 -15 -92 -80 8 60 65 56 46 41 36 31 26 -26 -78 -131 -184 -232 -280 -298 -238 -155 -117 -153 -188 -185 -136 -112
8079 -112 -89 -82 -75 -23 29 28 28 28 28 37 46 55 64 45 26 28 75 111 147 135 77 19 -38 -82 -79 -13 5 -52 -111 -128 -146 -161 -175 -162 -103 -70 -37 -66 -96 -122 -148
8068 -148 -148 -102 -82 -62 -61 -60 -62 -64 -22 -27 -51 -76 -37 1 11 67 128 144 111 79 -5 -90 -99 -107 -97 -86 -75 -65 -49 -34 -21 -9 8 -19 -50 -35 -23 -57 -88
8057 -88 -73 -44 -15 0 -31 -74 -71 -53 -36 -8 -27 -19 -12 -42 -72 -99 -126 -152 -132 -61 9 56 103 74 44 51 59 66 73 90 107 121 135 119 57 38 65 87 63
8046 63 68 73 76 79 36 -7 -19 -32 -44 -57 -87 -117 -74 -31 -16 -48 -53 -59 -56 -53 -50 -48 -26 -4 17 39 42 45 48 51 111 172 232 292 250 208 166 124 94 63 33 2
8035 2 -26 -55 -84 -112 -130 -147 -165 -182 -166 -151 -135 -120 -125 -130 -182 -233 -209 -186 -116 -46 -55 -64 -73 -81 -54 -26 0 28 29 30 30 31 5 -21 -48 -74 -100 -125 -105 -85 -85
8023 -85 -86 -86 -87 -85 -82 -80 -78 -72 -66 -65 -64 0 -10 -55 -100 -162 -224 -207 -189 -170 -105 -22 -17 -22 -27 -36 -46 -56 -66 -75 -85 -74 -64 -53 -42 -17 7 -12 -33 -15 2 20 37
8011 37 52 68 83 98 93 89 84 80 46 12 -21 -55 -77 -100 -45 8 31 54 76 99 87 74 62 49 37 24 9 -5 -23 -86 -167 -171 -164 -156 -144 -132 -116 -101 -86
8001 -86 -70 -92 -114 -136 -158 -161 -163 -89 -15 83 182 235 288 212 135 59 -17 -90 -162 -158 -155 -118 -81 -45 -8 -16 -25 -33 -41 26 94 162 231 249 268 286 305 256 207
7990 207 159 110 104 98 91 85 55 26 -2 -32 -24 -16 61 139 136 26 -83 -85 -47 -9 36 81 52 22 -6 -35 2 41 34 27 52 78 104 130 153 176 199 221 194
7979 194 166 139 111 133 156 132 108 109 111 69 27 25 68 129 113 22 -67 -129 -115 -63 -11 45 102 133 165 150 136 87 38 35 32 28 24 20 16 27 38 48 59
7968 59 61 63 65 68 67 66 66 65 79 93 61 29 60 91 119 148 129 63 44 71 119 167 171 176 179 182 184 187 174 160 104 47 8 16 43 70 37 4 -25 -55 -55 -9 39
7957 39 42 17 39 72 106 140 97 24 -48 -78 -62 34 131 148 165 182 199 182 166 178 144 61 23 34 44 45 46 75 59 -6 -25 33 93 123 153 133 67
7946 67 34 1 -33 -69 -113 -157 -181 -159 -106 -52 30 67 41 16 33 51 36 21 6 -8 8 25 85 145 145 100 37 -24 -48 -25 16 59 36 14 -8 -30
7937 -30 -36 -41 -46 -52 -51 -50 -36 24 71 12 -55 -77 -78 -78 -73 -68 -100 -86 -25 36 24 -33 -66 -98 -80 -63 -88 -113 -107 -55 11 79 106 57 -51 -113 -121 -129 -134 -138 -103 -68
7925 -68 -78 -89 -92 -96 -99 -103 -47 8 -9 -27 -6 60 101 142 158 173 142 112 107 102 98 93 60 27 36 46 73 54 32 56 80 59 -6 -72 -57 3 38 73 48 22
7914 22 -2 -27 -89 -151 -132 -67 27 122 155 112 31 -50 -116 -136 -92 -47 -30 -89 -149 -162 -129 -97 -81 -64 -5 54 92 85 58 31 55 80 58 37 9 -17
7904 -17 -45 -72 -30 12 54 97 85 73 61 50 1 -47 -51 -54 -33 -12 8 29 43 57 -5 -67 -107 -147 -110 -74 -40 -6 -19 -31 -35 -39 -43 -47 -4 37 80 123
7894 123 137 152 166 181 153 125 97 69 101 132 163 194 170 147 123 100 126 152 101 51 -1 -53 -60 -66 -57 -48 -39 -29 -26 -22 -19 -15 -21 -26 14 54 30 5 -18 -42
7883 -42 -58 -73 -42 -11 22 55 43 31 33 35 82 130 107 84 61 38 41 44 47 50 49 48 94 139 199 259 243 226 156 86 62 38 -37 -113 -81 -50 -34 -17 -1
7872 -1 14 -13 -41 -69 -97 -106 -115 -124 -133 -108 -83 -58 -33 -4 25 54 84 27 -29 -10 8 4 0 -5 -9 -2 4 11 18 67 116 166 215 233 252 270 289 275 261 201 140 94
7860 94 47 107 167 168 168 168 168 142 117 138 159 114 70 26 -18 -15 -13 34 83 40 -2 -44 -87 -37 12 61 111 88 66 43 20 47 74 100 127 124 120 94 -23
7850 -23 -86 -104 -199 -294 -303 -312 -275 -238 -228 -219 -210 -201 -110 -20 -36 -53 -125 -197 -217 -144 -60 -21 -24 -28 -12 49 91 40 10 -19 -9 0 54 108 116 123 72 20 -30 -82
7839 -82 -70 -58 -101 -52 27 62 82 102 138 173 163 152 126 99 26 -46 -87 -129 -171 -213 -216 -218 -175 -131 -91 -50 -86 -123 -84 -45 -53 -60 -127 -195 -268 -249 -200
7828 -200 -150 -98 -46 -47 -94 -141 -142 -95 -47 0 47 73 53 12 -27 -16 -4 49 103 135 120 85 51 27 4 -3 34 79 47 15 -16 2 21 37 53 26
7819 26 -46 -90 -134 -119 -57 -22 12 25 37 50 62 137 212 236 214 167 121 118 114 86 58 4 -3 21 46 28 10 15 20 22 24 36 3 -46 -97 -121 -98 -28 41
7808 41 54 21 14 7 2 -2 -7 -12 5 22 69 69 43 62 53 44 24 4 -14 -34 -45 -56 -67 -78 -110 -142 -154 -120 -129 -138 -144 -150 -118 -86 -100 -115 -137 -160 -137 -114 -128 -142
7796 -142 -136 -85 -62 -40 -15 9 11 14 16 19 2 -14 -4 -41 -98 -154 -168 -181 -171 -160 -150 -139 -140 -141 -142 -143 -138 -133 -129 -124 -101 -79 -57 -35 13 61 63 65 31 -2 -35 -69
7785 -69 -93 -118 -142 -166 -87 -7 -35 -63 -46 -30 -14 2 85 169 177 184 161 139 116 94 102 111 116 122 110 53 21 66 124 137 134 132 132 132 102 118 173 151 69 -13
7774 -13 -6 1 -37 -76 -46 -16 -32 -48 -47 -45 -44 -43 -19 4 28 52 52 53 53 53 0 -52 -59 -67 -81 -94 -108 -122 -136 -149 -162 -176 -81 12 31 49 41 32 24 16 13 9 -39 -89
7762 -89 -117 -145 -128 -110 -132 -155 -132 -108 -64 -19 -6 -68 -87 -60 -37 -61 -84 -108 -88 -69 -40 -12 18 49 62 121 183 198 190 228 234 240 184 81 -17 -71
7752 -71 -77 -38 -21 -4 22 49 53 57 48 38 -17 -72 -101 -130 -85 -40 0 -5 -30 -56 -72 -88 -82 -75 -77 -78 -57 -35 -33 -30 -5 20 -1 -23 -28 13 71 83 101 119 112 105
7740 105 96 87 38 -55 -73 -44 23 92 160 152 119 86 94 102 94 86 81 30 0 -32 -20 -9 -13 -17 -19 -20 -19 27 49 70 47 25 -23 -25 -1 23 50 78 92 106 94 128
7729 128 186 243 256 223 152 127 148 168 141 69 70 117 97 31 -24 -80 -131 -106 -52 -44 -58 -73 -67 -62 -39 -17 -18 -18 -51 -84 -71 -57 -33 -8 -7 -5 14 34 54
7718 54 74 72 69 112 156 171 187 180 174 143 112 36 -40 -42 -43 -22 0 47 95 120 146 218 290 285 281 166 51 26 77 115 75 38 0 2 3 4 6 -16 -39 -16
7707 -16 5 -8 -23 -60 -98 -143 -187 -155 -124 -25 73 111 72 8 -9 -12 -15 -16 -16 -40 -63 -52 -41 -29 -18 -15 -12 -9 -6 0 6 -63 -132 -146 -159 -127 -94 -102 -109 -76 -42
7696 -42 -34 -103 -175 -247 -245 -243 -164 -86 -36 14 18 22 64 106 101 97 95 93 91 90 73 57 41 25 49 73 98 122 123 123 124 124 109 93 123 153 105 57 55 52 13 -26 -65 -104
7683 -104 -53 -1 49 101 99 97 95 93 65 37 55 73 81 89 97 105 128 150 172 195 151 106 62 18 -17 -52 -88 -123 -131 -138 -100 -61 -65 -68 -72 -76 -62 -49 9 69 57 46
7672 46 80 115 99 84 68 53 12 -28 3 36 41 0 -16 42 102 85 39 -5 0 5 9 12 -29 -117 -176 -159 -119 -80 -82 -84 -84 -83 -83 -83 -44 -5 32 71 79 86 93 100 92
7660 92 84 121 159 205 252 221 191 121 51 26 2 46 90 88 85 85 85 84 84 35 -13 13 41 12 -16 0 17 30 42 54 66 73 80 67 8 -8 -24 -43 -62 -42
7649 -42 -22 42 108 85 61 84 107 128 150 126 101 79 57 34 12 -3 -18 -34 -50 -11 27 66 105 154 202 205 208 190 172 108 44 11 -20 -53 -86 -132
7639 -132 -179 -206 -187 -148 -109 -71 -32 -4 -21 -42 -16 -2 -33 -62 -44 -12 19 -19 -58 -59 -14 5 24 12 0 -85 -171 -194 -172 -175 -179 -146 -114 -102 -136 -187
7629 -187 -238 -217 -242 -239 -190 -101 -58 -92 -172 -199 -149 -109 -115 -134 -153 -183 -168 -104 -41 -19 -44 -89 -133 -151 -169 -85 0 27 -21 -72 -124 -157 -191 -178 -166 -112
7619 -112 -59 20 53 24 -4 -33 -62 -60 -12 10 32 37 42 47 52 89 127 159 191 159 35 -82 -154 -165 -131 -74 -16 28 73 72 71 60 48 37 25 28 31 -42
7609 -42 -115 -158 -200 -196 -192 -208 -225 -195 -165 -201 -236 -226 -215 -209 -204 -152 -100 -52 -5 -33 -62 -129 -196 -214 -232 -214 -149 -57 -55 -93 -84 -61 -37 -69 -100 -85 -71 -63 -56
7598 -56 -49 -41 -19 1 23 45 47 48 50 51 24 -3 -8 -12 -35 -58 -36 -13 -46 -79 -112 -145 -83 -20 -34 -48 -28 -8 -11 -14 18 51 89 36 -33 -103 -103 -102 -72 -41 -11
7587 -11 19 52 86 97 108 139 171 156 142 104 66 74 82 101 121 94 68 54 40 26 12 -20 -54 -41 -28 38 105 96 87 24 -37 -97 -80 -25 28 41 54
7577 54 36 18 -41 -100 -125 -74 -39 -51 -31 -11 5 22 56 89 46 3 -24 -52 -79 -107 -134 -161 -142 -122 -59 4 22 39 18 -3 -24 -46 -8 29 20 12
7567 12 31 50 46 42 9 -23 -56 -89 -86 -84 -81 -78 -104 -131 -111 -91 -99 -107 -69 -31 21 75 83 91 51 11 -5 -22 -28 -34 -17 0 28 57 63 70 39 9 52 95 61 -19
7555 -19 -94 -92 -91 -89 -106 -122 -127 -131 -89 -47 -30 -13 -42 -71 -64 -56 -94 -132 -104 -75 -24 26 23 19 16 12 -25 -62 -54 -46 -11 23 10 -3 -16 -74 -133 -145 -123 -100 -28 42
7544 42 73 104 89 74 8 -57 -97 -137 -150 -118 -106 -140 -187 -187 -140 -93 -92 -91 -67 -43 -17 7 -9 -27 -26 20 87 155 167 180 147 113 77 41 51 61 94
7534 94 126 83 -6 -63 -43 -26 -85 -108 -131 -138 -145 -126 -152 -195 -239 -234 -183 -155 -127 -132 -91 -50 -55 -51 -48 -48 -47 -55 -62 -92 -122 -82 -42 -22 -48 -29 -10 5 21 42 64
7522 64 86 107 126 144 143 95 4 -86 -98 -64 -9 45 57 69 120 172 144 71 -45 -117 -110 -104 -76 -48 5 12 10 9 30 5 -5 -15 -29 -42 -45 -47 -49 -52 -11 29
7511 29 69 110 159 209 151 93 120 147 150 154 173 192 211 230 152 74 -4 -82 -83 -85 -86 -88 -149 -211 -165 -120 -78 -36 5 47 71 96 75 54 33 12 -7 -28
7501 -28 2 33 58 84 107 39 -48 -90 -91 -92 -90 -88 -44 0 -1 -3 -5 -8 -10 -13 12 38 64 90 135 180 179 177 169 161 130 98 123 148 151 62 -63 -143 -117 -91 -95 -98 -79
7489 -79 -60 -12 36 38 41 39 37 35 33 -34 -103 -125 -147 -142 -136 -108 -80 -79 -78 -55 -31 -28 -24 1 28 42 57 49 41 3 -35 -50 -65 -83 -101 -73 -45 -65 -85 -105 -125 -134 -143
7477 -143 -105 -68 -35 -2 53 109 80 52 24 -3 -18 -33 -94 -155 -154 -153 -106 -13 96 128 98 22 -40 -56 -25 5 0 -5 -11 -17 -4 8 21 34 -39 -113 -125
7467 -125 -61 26 68 65 61 42 23 5 -13 -4 3 53 103 119 58 -2 13 56 100 72 -1 -45 -11 -24 -37 -64 -91 -16 58 39 -56 -135 -168 -132 -97 -58 -20
7457 -20 52 125 121 117 43 -31 -60 -89 -107 -124 -142 -159 -136 -114 -91 -68 -14 39 48 56 44 32 19 7 -13 -34 -54 -75 -106 -137 -168 -199 -208 -218 -182 -146 -147 -148 -196
7446 -196 -243 -270 -297 -248 -198 -165 -131 -98 -64 -86 -108 -130 -152 -124 -95 -113 -131 -134 -137 -141 -144 -106 -67 -28 9 -9 -28 -47 -66 -85 -105 -125 -145 -148 -152 -156 -159 -135 -111
7435 -111 -133 -156 -171 -186 -202 -217 -187 -157 -127 -97 -67 -37 -7 22 39 56 73 90 117 145 172 200 126 51 53 56 126 196 266 337 273 210 146 83 95 107
7425 107 119 131 87 43 46 48 48 48 94 140 123 106 90 73 40 6 50 93 86 79 25 -27 -23 -18 -14 -10 -21 -32 -43 -54 -58 -62 -113 -163 -137 -111 -85 -59 -15 27 24
7414 24 21 16 10 5 0 7 14 22 30 -43 -116 -113 -110 -115 -121 -126 -132 -108 -83 -59 -35 14 64 68 72 44 15 -13 -41 -44 -47 -4 38 53 68 37 6 -15 -36 -58 -79 -78 -76 -75 -74 -53 -32
7401 -32 -12 8 1 -6 -13 -20 -42 -64 -85 -107 -133 -160 -109 -59 -30 -1 28 57 21 -13 -3 7 -26 -60 -93 -50 3 11 -22 -9 -8 -6 -2 1 -24 -51 -78 -104 -168 -232
7390 -232 -219 -207 -200 -194 -188 -181 -162 -142 -122 -102 -87 -71 -102 -132 -97 -62 -28 6 41 76 66 55 -6 -69 -131 -194 -197 -200 -158 -115 -117 -120 -122 -124 -123 -121 -120 -118 -16 85 122
7379 122 84 32 -18 -28 -39 -32 -25 23 71 129 112 17 0 43 86 27 -31 -45 -59 -27 5 4 4 3 3 -13 -29 -45 -62 -44 -26 -8 9 -13 -35 -58 -81 -113
7369 -113 -145 -132 -118 -64 -10 -3 4 4 3 2 1 -44 -90 -60 -30 -31 -33 -34 -35 -4 26 57 89 65 42 18 -4 -14 -24 5 35 36 -53 -144 -143 -127 -110 -134 -158 -133 -107
7357 -107 -81 -56 -33 -10 -33 -57 -85 -114 -67 -19 3 27 51 75 109 143 70 -2 -57 -113 -123 -132 -58 14 11 9 10 12 14 15 12 9 6 3 -18 -40 -62 -84 -83 -82 -5
7346 -5 72 109 146 76 7 -43 -94 -68 -42 -20 1 -22 -46 -38 -29 -67 -104 -85 -66 -1 63 85 107 129 151 152 153 108 64 16 -31 -33 -35 -46 -57 -115 -172 -197 -222
7335 -222 -248 -273 -251 -228 -152 -77 -26 23 51 79 75 72 122 172 118 64 10 -43 -46 -49 -52 -55 -100 -145 -190 -235 -203 -172 -140 -108 -85 -61 -38 -14 2 18 -2 -24
7325 -24 -7 9 3 -1 28 58 66 73 39 5 -29 -63 -45 -28 -64 -101 -100 -99 -98 -97 -89 -82 -51 -20 7 35 -5 -46 -134 -223 -213 -202 -179 -156 -123 -167 -212 -180 -96 -12
7314 -12 57 126 142 158 153 148 105 62 14 -32 -11 9 4 0 -26 -97 -153 -101 -44 13 58 103 109 116 100 84 90 97 87 78 45 13 -28 -70 1 74 106 138 146 155 158
7302 158 160 132 150 148 70 -25 -76 -84 -92 -120 -148 -177 -206 -195 -138 -77 -62 -42 -21 -14 -6 -50 -93 -129 -118 -95 -72 -32 7 43 80 88 49 37 25 2 -20 -43
7292 -43 -66 -67 -68 -95 -76 -35 6 76 100 78 55 30 4 10 16 22 28 -15 -60 -77 -48 -3 40 22 3 -14 13 80 146 158 93 17 -57 -102 -147 -108 -69 -11
7282 -11 46 6 -110 -204 -222 -186 -104 -24 9 -27 -63 -106 -148 -152 -157 -140 -124 -133 -188 -259 -284 -254 -223 -203 -183 -186 -189 -176 -164 -85 -7 11 -15 -18 23 8 -5 -17
7271 -17 -28 -14 -1 12 26 21 16 13 11 -10 14 38 17 -14 -46 -42 -39 -4 29 84 139 189 193 170 147 95 43 -7 -59 -95 -131 -90 -50 -53 -57 -106 -155 -137 -118 -145
7260 -145 -173 -111 -49 11 73 36 0 -37 -74 -63 -53 -43 -32 -7 16 -4 -25 -34 -43 -51 -60 -66 -72 -32 7 38 70 55 41 84 126 62 -1 -75 -149 -176 -204 -216
7250 -216 -229 -165 -100 -58 -16 -51 -85 -124 -163 -157 -150 -177 -203 -230 -256 -246 -235 -224 -214 -179 -144 -108 -73 -75 -76 -123 -170 -172 -173 -129 -85 -101 -116 -56 4 -16 -36 -57
7239 -57 -77 -113 -149 -139 -129 -99 -69 -39 -9 23 56 89 122 136 149 163 177 171 165 114 63 78 94 64 33 45 57 69 81 59 37 16 -5 -10 -16 -21 -26 15
7229 15 57 82 61 1 -11 -5 45 109 128 98 68 60 51 42 34 20 6 38 70 75 80 65 4 -50 -105 -143 -135 -111 -88 -62 -35 -2 31 21 12 2 37 47 -19 -92
7218 -92 -118 -125 -86 -16 52 103 109 44 -21 -72 -77 -53 -76 -98 -74 -14 0 -4 -7 -6 -6 -5 -4 1 7 13 20 36 53 67 81 157 187 136 39 21 79 163 201 186 171 153
7206 153 136 104 72 85 99 65 30 13 41 105 122 119 116 85 9 -83 -177 -223 -224 -176 -129 -109 -134 -131 -127 -101 -29 16 63 99 136 153 123 101 78 98 119
7196 119 74 30 -11 -53 -77 -55 -59 -63 -47 -31 -38 -45 0 44 43 42 22 3 -24 -5 27 -16 -83 -104 -116 -83 -26 30 73 117 138 159 118 78 38 -1 11 24
7186 24 61 97 100 103 152 202 182 163 102 42 0 36 100 118 113 108 146 107 19 -21 13 48 97 147 220 293 282 272 216 160 122 84 23 -37 -68 -99 -54
7175 -54 -8 -10 -12 -14 -16 -11 -6 13 79 119 82 63 89 100 66 11 2 49 95 68 41 31 21 33 46 -3 -53 -57 -61 -43 -25 -7 10 34 59 38 16 21 26 -15 -56
7164 -56 -87 -119 -104 -90 -67 -44 1 47 28 8 34 60 67 73 33 -6 -23 -41 -13 14 -19 -53 -87 -121 -106 -90 -29 32 27 22 17 12 -10 -32 -55 -78 -61 -44
7154 -44 -51 -57 -69 -82 -140 -199 -149 -100 -97 -93 -100 -107 -113 -120 -111 -102 -70 -38 36 110 139 168 111 54 42 31 5 -20 -1 18 6 -5 -63 -122 -74 -26 -24 -23 -21 -19 5 29
7142 29 29 29 6 -16 -33 -50 9 68 72 76 79 83 75 68 60 52 33 14 -5 -24 -11 0 13 26 -28 -82 -91 -99 -25 48 61 -2 -4 39 75 111 94 78 61 44 -25 -95
7131 -95 -164 -186 -161 -60 -2 -20 -11 -2 44 15 -91 -198 -203 -208 -182 -156 -131 -105 -144 -183 -177 -170 -130 -90 -96 -102 -179 -256 -272 -212 -141 -117 -139 -161 -110 -59 -55 -50 -24
7120 -24 1 27 53 62 72 79 86 96 61 51 42 25 8 -54 -116 -145 -173 -155 -138 -149 -161 -172 -183 -63 55 122 142 131 75 41 8 -58 -126 -147 -168 -120
7110 -120 -71 -23 24 71 117 130 66 -4 -74 -71 -22 33 44 7 -29 -35 -41 0 39 27 14 2 -9 -18 -27 -81 -136 -156 -177 -197 -217 -204 -191 -195 -245 -312 -333 -307
7099 -307 -280 -270 -259 -248 -237 -225 -212 -202 -192 -156 -165 -220 -229 -189 -148 -105 -61 -51 -42 10 63 107 105 84 62 69 75 82 89 67 44 21 -1 -19 -38 -56 -75 -99 -123
7089 -123 -99 -30 12 8 33 58 47 37 27 16 25 33 -4 -42 -34 -27 -20 -12 4 20 34 48 9 -76 -88 -54 -24 -39 -100 -161 -148 -89 -30 -17 14 46 76 105
7078 105 69 33 -2 -38 -67 -96 -122 -148 -131 -67 -29 8 58 109 111 113 109 59 35 11 -8 -28 -49 -69 -77 -86 -95 -103 -110 -116 -122 -129 -108 -87 -41 -41 -57 -73 -46 -20 -55
7067 -55 -91 -19 52 88 123 113 103 64 25 -54 -134 -186 -163 -75 58 110 85 63 41 26 58 90 76 46 15 28 41 20 0 24 49 81 113 145 177
7057 177 122 67 62 56 43 77 65 6 -43 -92 -125 -112 -111 -110 -106 -102 -131 -160 -189 -218 -236 -254 -271 -289 -231 -174 -119 -65 -87 -156 -179 -156 -169 -183 -193 -204 -172 -140
7047 -140 -109 -77 -4 69 96 123 135 146 111 76 -4 -85 -89 -93 -116 -140 -148 -110 -64 -94 -105 -69 -65 -61 -100 -140 -164 -189 -142 -94 -81 -144 -229 -206 -138 -146 -193 -164
7036 -164 -69 26 77 128 168 162 135 109 102 96 90 84 32 -18 -70 -121 -160 -200 -188 -130 -74 -18 -36 -54 -57 -61 -35 65 160 177 136 94 140 187 155 76 19 8
7026 8 45 82 119 155 218 235 180 125 67 9 -26 -62 -124 -140 -138 -136 -131 -126 -113 -100 -40 18 51 83 113 143 144 99 34 -30 -6 18 -3 -24 -5 13 108 203
7016 203 185 167 73 -21 -72 -122 -127 -131 -142 -153 -118 -83 -93 -103 -113 -123 -89 -55 -68 -80 -86 -91 -97 -102 -55 -7 39 87 122 157 85 13 -28 -71 -114 -157 -90 -22
7005 -22 -1 19 9 0 -21 49 92 44 7 -28 -32 -36 5 47 60 73 87 100 89 78 66 55 50 44 -37 -119 -130 -141 -76 -11 -18 -24 -31 -38 -48 -59 -146 -234 -262 -291
6994 -291 -213 -135 -81 -28 -52 -75 -49 -22 3 30 27 24 22 19 -21 -61 -56 -51 -79 -107 -34 38 76 22 -56 -135 -106 -77 -48 -19 -31 -43 -101 -160 -131 -102 -27 47
6984 47 42 36 -14 -66 -99 -133 -121 -109 -102 -94 -87 -80 -52 -23 -36 -49 -46 33 142 205 224 244 214 185 153 121 106 137 167 151 117 84 57 30 -21 -28 1 31 18
6973 18 4 -22 -50 -32 -13 26 65 59 53 46 39 -41 -121 -156 -145 -159 -173 -191 -208 -175 -95 -52 -9 15 -4 -38 -71 -133 -150 -125 -101 -76 -51 -30 -54 -81 -62
6963 -62 -1 13 -16 -46 -16 58 62 65 68 70 69 69 88 60 -14 -89 -114 -93 -52 -11 26 63 27 -9 -16 21 34 47 49 51 24 44 42 -5 -24 -43 -29 -14 -46 -77
6952 -77 -118 -160 -150 -95 -79 -64 -46 -28 13 55 77 53 45 36 -17 -72 -126 -135 -123 -112 -96 -81 -65 -50 -11 28 -6 -40 -72 -57 -40 -68 -76 -38 -28 -18 -43
6942 -43 -68 -47 -26 -9 6 25 45 37 75 162 248 266 238 190 142 57 -27 -82 -60 -24 -35 -43 -6 16 -6 -1 4 -30 -66 -81 -51 -7 36 37 38 52 66 34
6931 34 3 -15 -35 -34 12 90 168 168 121 40 -39 -47 -54 -52 -51 -49 -48 -61 -73 -86 -99 -93 -88 -82 -76 -54 -32 -13 5 20 -9 -57 -105 -86 -21 14 51 75 54 13 -27
6920 -27 -4 19 43 67 60 52 40 28 46 -12 -97 -136 -91 0 65 131 134 91 75 58 18 -21 -61 -100 -118 -136 -179 -177 -159 -141 -117 -93 -57 25 87 57 -45
6910 -45 -148 -149 -151 -64 22 83 53 11 -31 -33 -35 -21 -7 6 20 -21 -63 -29 5 -40 -86 -86 -86 -79 -72 -65 -58 -103 -148 -190 -232 -159 -40 31 10 -22 -10 46 103
6899 103 57 11 -34 -79 -73 -67 -21 24 29 -57 -144 -139 -108 -77 -41 -4 20 46 72 97 59 20 -17 -56 -25 5 -70 -147 -138 -129 -74 -19 43 106 62 17 -8 -34
6888 -34 -14 5 -14 -34 -54 -75 -83 -92 -101 -110 -45 19 38 57 -6 -70 -83 -95 -135 -84 15 68 74 33 16 0 1 4 6 9 -78 -165 -305 -352 -323 -293 -258 -223 -169
6878 -169 -115 -137 -160 -200 -241 -236 -230 -183 -135 -88 -40 -2 35 73 110 48 -14 -76 -139 -141 -143 -99 -56 -64 -73 -82 -91 -84 -76 -69 -62 -23 15 8 1 -32 -66 -100 -133 -99 -65 8
6866 8 83 188 202 160 118 92 65 39 12 5 -1 -8 -15 4 24 44 63 43 23 3 -15 -21 -27 -32 -38 -28 -19 36 92 74 57 -5 -68 -66 -63 -61 -58 -47 -36 -25 -14 -32
6855 -32 -50 -68 -86 -82 -78 -74 -70 -46 -22 -75 -128 -121 -115 -62 -10 -27 -45 -62 -80 -135 -189 -168 -146 -123 -99 -30 39 68 97 126 155 111 66 22 -22 -1 19 39
6844 39 60 36 11 -12 -36 -44 -52 -14 22 25 27 29 32 51 71 91 110 49 -11 -57 -57 -47 -113 -222 -255 -212 -169 -121 -74 -82 -91 -122 -153 -188 -222 -149 -76 -73 -71 -114
6833 -114 -158 -165 -172 -180 -187 -145 -103 -106 -110 -87 -65 -43 -20 -6 7 21 34 19 4 -11 -26 -34 -42 -51 -59 -42 -26 12 51 26 0 -70 -141 -123 -104 -39 24 83 142 155
6822 155 168 193 218 197 176 103 31 4 -22 18 59 -7 -73 -95 -117 -116 -115 -109 -103 -97 -91 -78 -66 -54 -41 -16 9 111 213 238 262 210 158 81 5 -25 -56
6812 -56 -59 -62 -42 -22 0 22 21 21 15 10 50 91 89 88 15 -57 -103 -72 -13 0 -31 -61 -49 -36 7 51 95 139 104 68 -8 -85 -68 25 53 81 106 132 81
6801 81 29 34 39 44 49 38 27 62 97 92 86 34 -16 -7 1 33 65 50 35 -26 -87 -73 -59 -44 -30 3 37 28 20 33 92 126 83 10 -15 -27 -38 -73 -107 -96
6790 -96 -85 -27 29 63 98 81 64 24 -15 3 21 40 59 109 159 163 167 130 92 100 108 82 57 32 6 35 63 46 29 50 71 70 68 81 94 106 119 141
6780 141 163 162 160 192 223 147 72 6 -58 -100 -142 -124 -105 -102 -144 -171 -122 -92 -109 -135 -161 -175 -142 -75 -84 -120 -109 -86 -62 -82 -102 -96 -89 -80 -71 -77 -37 5 2 11
6769 11 67 76 39 -20 -35 -32 -30 -49 -67 -86 -105 -84 -62 -84 -106 -99 -46 -19 7 1 -4 -8 -12 -88 -118 -39 38 26 -31 -63 -95 -145 -194 -244 -293 -272 -250 -272 -294
6758 -294 -296 -253 -190 -127 -103 -80 -57 -34 -6 21 6 -8 -32 -10 14 -5 -10 30 43 55 31 7 -13 -34 -20 39 25 -34 -57 -33 32 99 85 -4 -49 -93
6748 -93 -86 -32 20 27 44 61 75 89 23 -43 -63 -83 -116 -150 -140 -130 -105 -127 -123 -119 -117 -116 -114 -113 -39 34 88 96 59 23 -16 -56 -48 -41 -34 -27 -21 -15 -12 -9 4 -26 -108 -191
6736 -191 -178 -165 -152 -140 -177 -214 -251 -288 -220 -152 -130 -108 -80 -51 -23 5 -22 -51 -79 -108 -109 -111 -112 -114 -80 -46 -13 20 16 11 -69 -150 -206 -263 -258 -177 -82 -33
6726 -33 -30 -27 14 57 23 -10 -22 -34 -46 -58 -77 -96 -70 -43 48 140 186 232 191 151 111 70 39 7 -23 -55 -73 -91 -109 -127 -107 -88 -69 -49 4 58
6716 58 36 13 -18 -50 -36 -22 -20 -19 -17 -15 -11 -6 -2 2 12 23 34 45 98 152 129 107 67 27 -12 -52 -54 -57 -59 -62 -37 -13 11 36 70 104 92 81 26 -28 -36 -45
6704 -45 -103 -160 -172 -183 -165 -146 -128 -109 -79 -49 -24 0 19 -38 -124 -165 -111 -58 -1 54 22 -9 4 19 31 43 55 68 79 90 55 20 26 31 113 195
6694 195 201 208 214 220 231 242 253 264 243 223 203 183 122 62 47 33 20 6 -52 -111 -103 -94 -85 -76 -20 35 45 56 19 -17 -7 1 1 1 47 93 116 139 162 185
6683 185 153 121 90 58 68 79 89 100 68 37 5 -25 -33 -40 -2 36 66 96 127 157 94 32 -30 -93 -95 -97 -100 -102 -98 -95 -194 -293 -348 -326 -301 -277 -245 -212 -165
6673 -165 -71 -6 -17 -90 -162 -157 -152 -101 -50 4 58 37 15 -53 -123 -147 -170 -196 -223 -172 -122 -81 -40 -46 -51 -93 -136 -105 -73 -33 -38 -43 -2 -13 -24 -33 -41 -107 -172
6662 -172 -192 -212 -239 -266 -247 -228 -149 -70 -11 1 -7 -16 -11 40 59 33 35 38 22 6 -55 -117 -129 -142 -108 -74 -41 -9 23 56 49 41 78 160 205 143 72 47
6651 47 59 71 87 102 121 140 113 87 85 83 35 -12 -9 -7 20 2 -13 -29 -90 -152 -179 -160 -121 -82 -33 14 60 30 6 -18 -29 4 55 59 44 29 56 37
6641 37 19 46 35 25 62 100 90 80 42 49 120 144 119 48 7 12 32 52 39 -19 -78 -91 -93 -96 -50 -4 41 87 87 87 96 105 141 130 100 70 37 5 46
6630 46 88 130 172 177 182 142 101 43 -15 -28 -41 -40 -40 -39 -38 -45 -52 -58 -65 -62 -60 -35 -9 11 33 -22 -77 -101 -124 -125 -125 -94 -62 -30 0 -23 -47 -71 -96 -84 -72 -65 -58
6618 -58 -14 -47 -85 -77 -32 12 60 32 -19 -25 -16 -7 45 98 74 50 20 -9 -16 -23 3 30 -18 -68 -69 -71 -26 18 62 106 73 41 -2 -46 -44 -42 -77 -113 -148 -108
6607 -108 -40 -18 -42 -66 -82 -97 -36 24 35 46 11 -24 2 28 32 35 40 45 49 54 23 -6 8 23 3 -15 -34 -54 -57 -61 -19 23 70 117 118 119 93 68 119 170
6596 170 137 104 48 -7 -5 -4 -25 -46 -29 -12 4 22 27 33 10 33 45 12 8 3 -52 -109 -169 -183 -144 -105 -111 -163 -171 -134 -105 -76 -74 -117 -132 -147 -102 -11 53
6586 53 42 -15 -27 -24 -20 16 53 68 82 72 63 76 90 44 0 -45 -91 -138 -186 -157 -128 -151 -174 -124 -73 -19 -11 -29 -1 4 -35 -46 -57 -46 -35 -24 -13 -18
6575 -18 -23 -26 -28 -1 71 57 -32 -63 -47 -62 -77 -96 -115 -134 -153 -132 -112 -65 -64 -110 -155 -125 -48 -20 -37 -72 -107 -75 -44 -61 -33 -4 24 76 127 170 168 168
6565 168 168 141 115 111 108 90 72 54 36 10 -16 -43 -69 -62 -54 -20 -33 -55 -78 -58 -38 -68 -98 -105 -112 -63 -15 33 82 72 61 51 41 7 -26 16 58 75
6554 75 92 87 81 56 32 84 136 158 180 156 132 140 147 155 162 122 83 119 156 128 100 49 -1 -9 -17 -22 -28 -42 -10 19 -26 -75 -48 -23 2 34 66 21 -22 -55
6543 -55 -89 -45 -1 10 23 -10 -43 -1 40 104 169 114 58 3 -51 8 68 82 96 62 27 -6 -40 -43 -46 -26 -6 -9 -13 -63 -113 -158 -203 -172 -140 -97 -54
6533 -54 11 76 69 62 55 47 54 61 67 74 101 128 152 99 57 15 14 60 77 17 -16 26 92 158 228 222 167 158 167 131 52 -26 -61 -97 -25 46 72 99 133 167 125
6522 125 83 81 79 77 75 75 75 74 74 91 108 79 50 59 68 32 -4 -30 -56 -82 -108 -141 -174 -102 -31 -8 -32 -50 8 69 130 89 48 -53 -155 -119 -83 -60 -38
6511 -38 -61 -84 -125 -166 -162 -157 -112 -66 -21 23 1 -21 1 25 -14 -54 -135 -216 -296 -299 -239 -178 -112 -47 -12 -54 -94 -87 -112 -136 -139 -142 -144 -147 -113 -80 -123 -165 -185
6500 -185 -205 -149 -92 -35 21 31 42 -12 -68 -77 -87 -131 -176 -175 -174 -144 -114 -85 -55 -41 -28 -14 -1 -37 -73 -109 -146 -72 0 67 133 180 120 54 65 70 75
6490 75 131 188 153 118 83 48 30 12 -5 -22 -61 -100 -93 -86 -80 -75 -70 -65 -32 0 -9 -17 -70 -46 36 73 84 95 103 111 107 104 100 97 35 -26 -85 -67 -27 11 10 8 23
6478 23 37 51 66 20 -25 -25 -25 -16 -6 -42 -124 -151 -101 -21 59 71 83 79 30 -48 -51 -22 5 28 51 74 97 139 181 177 173 132 91 50 9 -47 -104 -54 -4
6468 -4 15 34 8 -18 30 80 129 178 176 174 95 -28 -136 -166 -136 -105 -70 -35 0 35 50 65 4 -57 -76 -96 -70 -44 -40 -35 -31 -27 30 89 101 114 103 91
6457 91 80 68 48 27 6 -14 -11 -8 -9 -11 33 2 -31 -65 -73 -80 -87 -95 -55 -15 24 64 0 -64 -128 -116 -83 -97 -122 -148 -118 -43 3 -25 -63 -101 -144 -187 -179 -170
6446 -170 -161 -152 -163 -173 -107 -41 58 158 150 142 109 76 1 -73 -146 -143 -76 -9 35 80 79 77 54 31 8 -14 -45 -76 -61 -46 11 68 125 182 204 225 170 115
6436 115 61 6 -1 -9 -43 -76 -64 -52 -22 7 -9 -25 -20 -14 37 88 104 121 60 0 39 78 117 156 149 141 133 125 136 147 154 160 173 109 17 -29 -38 -48 -55 -62 -91
6424 -91 -120 -72 -24 21 68 69 69 101 132 164 195 205 215 225 235 208 181 153 126 67 8 26 43 86 128 124 121 154 187 224 260 253 292 302 236 145 55 67
6414 67 78 82 87 45 3 -49 -103 -110 -117 -133 -148 -117 -86 -38 9 11 13 -13 -39 -66 -93 -73 -53 -34 -14 -21 -28 -35 -42 -68 -94 -121 -147 -133 -120 -61 -2 29 61 94
6403 94 126 127 127 128 129 99 70 41 12 19 26 79 132 105 79 7 -65 -77 -89 -101 -113 -160 -207 -177 -148 -106 -63 -67 -71 -103 -135 -121 -108 -80 -53 -72 -91 -51 -11
6392 -11 -17 -23 0 24 -22 -69 -101 -57 46 150 144 61 41 68 136 205 199 194 147 100 52 5 -2 -10 -18 -26 31 89 144 122 60 -1 -21 -42 -53 -63 -73 -84 -51
6381 -51 -19 -30 -41 46 180 254 252 182 111 82 52 65 78 91 104 115 127 138 150 127 104 5 -94 -103 -113 -76 -40 -31 -22 -13 -5 -9 -12 29 71 73 76 33 -9 -58
6370 -58 -106 -109 -111 -75 -38 -47 -56 -46 -36 -26 -16 38 94 72 51 3 -44 -62 -3 83 123 86 50 79 108 92 75 28 -19 -20 -21 -63 -105 -101 -96 -19 57 26 -3
6360 -3 -8 -13 114 242 302 285 266 246 244 241 192 143 117 91 66 40 47 55 62 70 40 10 -19 -49 -18 12 -2 -17 -5 5 -58 -123 -99 -74 -49 -25 20 66 78
6349 78 14 -52 -118 -82 -47 -70 -94 -71 -49 -18 11 -3 -19 -3 12 5 -1 -24 -47 -48 -48 -62 -77 -92 -106 -121 -136 -151 -166 -72 21 69 117 138 160 104 49
6339 49 -28 -106 -77 -49 -17 13 0 -15 -23 -31 6 44 59 73 88 102 77 52 28 3 -23 -49 -75 -102 -117 -132 -70 -9 57 123 143 164 175 187 153 119
6329 119 111 104 97 90 57 24 37 50 7 -35 -32 -29 -38 -46 -55 -63 -69 -74 -80 -86 -91 -97 -103 -108 -131 -153 -175 -198 -173 -148 -100 -52 19 90 85 80 27 -25 -78 -132 -135 -138 -96 -53 3 60
6316 60 41 67 78 11 -37 -40 -21 -49 -70 -92 -125 -158 -114 -70 -45 -20 -38 -56 -50 1 53 60 50 39 27 14 -1 -17 -33 -49 -59 -69 -33 2 -3 -9 -60 -112
6306 -112 -156 -200 -137 -74 -47 -20 -13 -52 -73 -93 -111 -129 -125 -45 59 119 138 110 82 54 11 -31 -32 -32 -25 -64 -57 -5 63 131 202 196 116 81 93 105 134 164
6295 164 143 76 49 21 -9 -39 -13 12 38 64 88 113 132 152 174 119 58 43 88 133 72 -34 -69 -57 -28 0 27 55 88 76 50 71 86 100
6286 100 83 66 48 31 38 44 28 12 36 61 70 33 -30 -18 24 67 87 106 54 1 -11 52 93 134 193 207 169 132 164 195 181 167 131 96 61 26
6276 26 74 123 172 221 190 158 55 -47 -94 -65 -32 0 -1 -3 -5 -7 -14 -21 17 56 54 53 52 50 78 107 89 71 60 49 38 27 11 -3 -18 -34 7 50 92
6265 92 134 131 127 124 121 152 184 138 93 92 91 131 170 184 120 54 -12 -1 8 19 29 2 -24 -51 -78 -44 -11 21 55 30 5 -19 -44 -147 -251 -290 -252 -248
6255 -248 -244 -189 -134 -100 -65 -30 3 0 -5 -9 -14 -27 -40 -53 -66 -91 -116 -140 -165 -132 -98 -65 -32 -41 -49 -58 -67 -59 -51 -43 -34 -74 -114 -151 -111 -86 -61 -31 -2 21 45
6244 45 69 93 33 -26 -41 -55 -58 -61 -64 -67 -107 -146 -140 -134 -134 -135 -135 -136 -143 -150 -157 -164 -126 -89 -51 -13 22 57 16 -24 -132 -240 -284 -251 -139 -27 12 52 42 32
6233 32 -24 -80 -81 -81 -82 -82 -54 -26 48 122 103 84 64 45 49 53 11 -30 -15 0 14 29 -75 -179 -146 -113 -47 19 8 -1 5 12 -11 10 29 -27 -85 -143 -145
6222 -145 -147 -149 -151 -146 -140 -135 -130 -81 -32 15 64 64 64 -42 -149 -177 -204 -227 -250 -252 -177 -120 -109 -109 -109 -112 -115 -81 -46 -12 21 -1 -24 -47 -70 -68 -66 -65 -63 -67 -71 -116 -161 -156
6210 -156 -75 34 98 99 100 98 96 50 5 -40 -85 -88 -91 -95 -98 -100 -103 -105 -107 -126 -144 -86 -28 11 51 92 132 176 220 219 217 226 234 243 252 185 118 51 -14 -16 -18 -20 -22 -79 -136
6197 -136 -116 -96 -89 -83 -77 -71 -35 0 -9 -19 -30 -41 23 88 58 27 -2 -33 -38 -43 -48 -53 -50 -46 2 52 56 61 65 70 80 90 100 111 112 113 68 23 -14 -52 -14 23 38
6186 38 53 22 -8 0 7 15 23 3 -17 -84 -150 -151 -151 -75 0 79 159 161 164 142 120 98 76 61 47 35 24 11 44 95 69 16 -36 -48 -61 -115 -169 -223 -277
6175 -277 -292 -308 -277 -246 -214 -183 -151 -119 -132 -144 -156 -168 -181 -193 -205 -218 -194 -170 -147 -123 -119 -114 -110 -105 -91 -76 -62 -47 -7 32 27 21 -43 -108 -173 -239 -219 -198
6164 -198 -181 -164 -154 -189 -245 -224 -148 -118 -135 -151 -80 -9 14 39 8 -23 -55 -86 -54 -21 49 121 162 96 -8 -68 -86 -57 -6 -32 -69 -60 -81 -103 -131
6155 -131 -158 -186 -213 -173 -133 -92 -52 -60 -68 -29 8 15 23 30 38 39 41 -33 -108 -152 -195 -239 -282 -233 -185 -136 -87 -110 -132 -108 -84 -39 5 5 4 46 89 85 82 61 40
6143 40 19 -1 1 5 8 11 -18 -49 -79 -109 -40 28 51 75 130 185 132 80 66 52 41 30 18 53 87 76 43 11 -21 -53 -53 -6 42 46 23 47 118 189
6133 189 215 241 216 145 77 10 17 23 13 3 -6 -16 -4 7 -26 -60 -31 -2 6 -30 -41 -51 -64 -77 -32 11 39 20 -6 12 2 -7 -14 -22 -55 -42 44 132
6123 132 171 165 111 58 50 43 11 24 58 92 86 80 74 68 41 14 -12 -39 -45 -51 -11 28 46 63 80 97 97 96 50 3 3 2 -41 -84 -84 -37 -19 -1 -12 -69 -123 -131
6111 -131 -147 -117 -110 -103 -74 -45 -16 12 17 22 27 32 -17 -67 -86 -28 51 84 72 60 87 114 141 168 159 150 144 137 132 172 216 213 169 171 216 215 170 125 77 29 -16 -62
6099 -62 -92 -75 -50 -70 -62 -54 -11 31 74 117 115 112 37 -38 -63 -41 -17 -39 -51 -17 33 84 77 70 -9 -89 -103 -70 -17 35 46 57 68 79 63 48 32 16
6089 16 -40 -96 -102 -62 -22 18 42 20 -37 -95 -79 -63 -96 -130 -118 -106 -143 -181 -173 -164 -108 -52 -41 -31 -55 -79 -83 -41 -20 0 24 48 109 170 122 28 -45
6079 -45 -74 -49 20 53 85 121 156 189 223 210 198 174 151 127 104 130 157 163 123 100 76 93 109 123 91 59 72 117 162 163 165 112 58 26 39 48 58
6069 58 97 90 32 -26 -42 -12 20 -38 -119 -201 -201 -201 -155 -109 -88 -67 -47 -26 -29 -32 -36 -39 -33 -26 -20 -13 -37 -60 -83 -107 -93 -80 9 100 112 125 137 150 94 38 -17
6057 -17 -73 -33 6 45 85 44 4 -36 -77 -37 1 63 126 135 145 108 72 74 77 79 82 80 78 76 75 113 152 113 75 27 -20 -23 -25 4 34 18 3 -28 -59 -44 -29
6046 -29 22 75 81 88 69 50 -10 -26 27 174 246 227 197 167 142 26 -68 -72 -110 -147 -134 -120 -84 -47 -41 -35 -100 -165 -211 -166 -100 -80 -38 3 19 36 -13
6036 -13 -63 -66 -70 -25 20 42 65 90 116 118 121 106 91 55 20 23 71 120 123 80 37 37 38 55 73 44 -29 -52 0 51 101 76 6 -61 -130 -147 -165 -180 -195
6025 -195 -157 -72 -65 -103 -94 -85 -56 -27 -26 -25 -25 -24 17 60 56 52 60 68 119 170 207 197 137 77 36 -4 0 4 13 22 27 33 40 0 -12 -25 -23 -20 -63 -106 -134 -162 -143 -77 -49
6013 -49 -67 -56 -45 -43 -41 -80 -120 -160 -124 -28 21 -20 -61 -57 -8 -6 -51 -67 -83 -82 -80 -56 -32 38 108 128 102 89 77 61 45 7 -29 -21 -13 30 74 98 76
6002 76 43 10 -2 -14 25 66 86 60 -1 -63 -78 -46 -23 0 51 57 52 46 38 30 32 34 36 38 28 19 38 12 -30 -27 -7 12 -6 -25 -44 -63 -97 -132 -121 -110 -105
5991 -105 -101 -93 -86 -90 -47 -5 -9 -72 -134 -197 -260 -244 -181 -118 -101 -126 -151 -133 -116 -162 -209 -205 -155 -124 -93 -38 15 46 31 -30 -93 -134 -129 -107 -84 -58 -77 -116
5980 -116 -155 -161 -167 -174 -180 -169 -159 -125 -92 -48 -5 -7 -9 20 51 39 26 -5 8 38 69 83 50 -27 -60 -46 -31 -43 -131 -208 -209 -124 -39 1 -33 -71 -109 -121
5970 -121 -132 -141 -150 -148 -100 -52 -50 -36 -22 -10 0 -4 -8 37 128 163 198 216 188 132 76 40 4 -29 -63 -74 -85 -111 -137 -118 -98 -77 -55 -16 68 133 151 148
5959 148 99 9 -79 -120 -116 -119 -122 -104 -41 -5 -14 -1 58 88 72 42 12 7 48 63 78 110 142 199 210 175 140 102 64 43 23 0 23 86 150 110 69
5949 69 65 61 11 -38 -53 -69 -78 -133 -167 -155 -98 -41 -27 -59 -111 -163 -153 -143 -133 -123 -117 -111 -105 -99 -26 46 68 44 10 -23 -86 -103 -69 -34 28 46 -19 -84 -101
5939 -101 -73 -15 41 151 214 196 177 173 215 217 173 135 97 99 100 79 58 50 41 7 -26 -46 -113 -150 -188 -213 -193 -127 -60 -19 -54 -132 -133 -106 -34 17 69 115
5928 115 162 183 204 197 144 71 -1 -35 -69 -57 -45 -120 -195 -267 -263 -185 -106 -69 -32 13 60 106 153 107 61 16 -29 -20 -12 -3 5 -61 -128 -118 -108 -92 -75 -59
5918 -59 -42 -50 -58 -65 -73 -36 0 -7 -16 -26 -35 -45 -55 -63 -72 -35 1 16 31 -24 -81 -91 -24 24 28 -23 -75 -53 -32 -31 -30 -29 -29 11 51 15 -20 -78 -136 -194 -253 -185
5906 -185 -118 -55 6 11 -59 -114 -122 -70 -17 37 93 83 74 64 54 78 101 124 148 83 18 -45 -110 -85 -60 -34 -9 -26 -43 -105 -168 -139 -110 -128 -145 -145 -145
5896 -145 -140 -135 -118 -25 52 85 52 65 95 125 155 185 170 154 159 163 122 80 88 95 99 103 167 185 121 58 19 -18 -13 -8 0 -35 -89 -142 -143 -97 -5 85 99 37 -28
5885 -28 -93 -103 -113 -126 -139 -127 -160 -193 -180 -173 -165 -129 -139 -125 -111 -54 2 58 115 125 136 180 225 196 168 88 54 70 87 70 53 11 14 53 93 89 85 60
5874 60 35 10 -14 36 86 60 34 62 91 119 148 81 15 -48 -111 -162 -167 -94 -20 20 15 -40 -96 -119 -142 -120 -97 -63 -30 3 37 27 16 6 -3 4 12 -53
5864 -53 -119 -158 -152 -126 -100 -98 -97 -70 -88 -120 -151 -165 -133 -79 -25 -46 -114 -110 -59 -12 -11 -17 -22 -28 -34 -37 4 21 37 39 41 36 76 157 161 78 42 37 32 31 29 -43 -115 -129
5852 -129 -65 -21 -53 -84 -114 -60 -7 23 54 49 45 63 81 165 248 224 200 195 189 184 178 177 176 197 219 220 221 177 132 70 9 49 90 88 10 -93 -152 -179 -161 -120
5841 -120 -79 -55 -31 -7 15 94 173 205 130 92 55 -11 -77 -84 -91 -75 -59 -59 -59 -36 -13 -31 -49 -67 -85 -38 9 10 11 -9 -30 25 80 130 179 152 124 92
5830 92 60 28 -3 -21 -39 -70 -147 -244 -233 -153 -73 -60 -123 -167 -134 -33 22 1 -19 -12 -5 2 9 37 65 70 75 101 126 74 23 -33 -90 -71 -51 -58 -65 -49 -33
5819 -33 -56 -79 -79 -78 -68 -58 -25 7 -9 -25 -19 -13 -27 -41 -32 -22 -32 -41 -4 32 20 7 -4 -17 -11 -4 -21 -38 -41 -44 -1 42 34 27 66 105 75 44 60 76 57
5808 57 39 20 1 1 1 1 0 -19 -40 -61 -82 -82 -83 -106 -129 -126 -123 -74 -25 8 42 31 19 35 52 68 84 55 25 72 119 140 161 136 111 80 48 63 77
5797 77 29 -19 -63 -107 -112 -41 28 23 0 -25 -54 -83 -88 -93 -120 -148 -183 -218 -177 -89 -18 -23 -59 -95 -79 -62 -64 -66 -74 -6 44 49 32 14 16 18 -7 -34 -14 4 47
5786 47 91 88 86 50 15 34 52 87 122 119 116 109 101 117 132 151 171 190 210 203 197 190 184 133 83 55 28 63 98 65 31 24 17 -12 -42 -26 -9 7 23 12 0
5775 0 27 54 123 192 177 162 131 100 138 176 163 151 139 127 105 84 62 40 28 17 89 162 171 180 135 90 18 -54 -73 -92 -64 -36 14 65 101 136 134
5765 134 131 100 68 91 113 129 146 124 103 67 31 33 35 45 55 88 121 80 40 23 5 -6 -18 -30 -42 -34 -25 -17 -8 -20 -31 -43 -55 -59 -63 -68 -72 -33 5 -24
5754 -24 -53 -58 -63 -68 -72 -115 -158 -117 -76 -71 -66 -60 -55 -64 -73 -82 -91 -35 21 77 133 112 90 69 48 61 74 87 100 77 54 31 8 -1 -11 -21 -31 28 88 48 9 -26
5742 -26 -61 -43 -24 15 55 57 59 6 -47 -62 -77 -78 -80 -104 -128 -146 -164 -143 -122 -48 25 0 -25 -30 -36 42 121 118 115 74 32 9 -14 -37 -61 -109 -157 -167 -177
5731 -177 -144 -110 -76 -43 -74 -106 -137 -169 -151 -132 -114 -96 -117 -138 -153 -168 -182 -103 -57 -103 -174 -152 -134 -116 -134 -152 -85 -19 24 68 58 49 17 -14 -45
5722 -45 -77 -46 -15 15 46 84 122 90 59 36 13 28 43 12 -18 -26 -34 -86 -137 -120 -103 -83 -64 -50 -35 14 -12 -39 -66 -78 -45 8 61 15 -30 -30 -30
5712 -30 -51 -71 -46 -21 -40 -60 -82 -58 -42 -25 -31 -37 -29 -66 -121 -176 -176 -130 -81 -78 -48 27 54 35 -2 -39 -57 -74 -40 -5 -16 -27 -65 -102 -143 -137 -125 -112
5701 -112 -93 -121 -130 -138 -153 -122 -84 -46 -9 28 76 78 80 83 94 59 4 -50 -70 -89 -105 -121 -161 -155 -129 -102 -138 -173 -163 -152 -125 -97 -93 -88 -89 -90 -114 -139 -121 -103
5690 -103 -85 -67 -62 -57 -49 -41 7 101 167 232 269 260 231 202 112 23 -32 -12 58 128 200 273 282 246 189 133 108 83 58 33 65 98 113 82 66 95 96 97 80
5679 80 63 46 29 88 147 160 172 162 152 141 131 90 49 55 60 80 100 97 94 75 56 37 18 17 16 -14 -122 -237 -306 -298 -291 -245 -200 -78 42 53 64
5669 64 29 -6 -53 -101 -103 -104 -90 -76 -39 -2 48 99 150 202 175 149 122 96 84 72 83 94 37 -18 -28 -38 -18 1 -2 -5 10 27 84 142 204 189 141
5659 141 93 80 66 99 131 130 128 127 125 150 174 153 131 132 133 88 42 47 52 97 143 151 83 -18 -119 -128 -137 -100 -63 -53 -42 -77 -112 -107 -102 -51 -1 27 56 8
5648 8 -39 -55 -70 -132 -193 -191 -189 -141 -93 0 94 81 67 34 1 14 27 10 -6 -23 -40 -48 -57 -49 5 85 119 78 36 -4 0 25 50 77 104 88 71 36 47
5637 47 61 29 -6 3 56 109 147 109 67 25 9 -7 23 100 141 136 113 91 20 -49 -116 -184 -230 -230 -180 -129 -89 -49 -9 30 85 140 119 98 47 -3 -54
5627 -54 -105 -90 -75 -35 -40 -69 -98 -110 -76 -61 -45 -27 -9 -22 -35 -48 -62 -86 -110 -160 -164 -146 -128 -135 -97 -30 -9 -33 -57 -74 -44 1 48 67 39 -5 26
5617 26 31 36 42 49 90 86 61 36 33 29 71 113 125 137 103 70 30 -9 -28 -2 1 4 -17 5 69 87 57 27 46 64 83 102 66 30 -5 -41 -29 -17 -6 5
5606 5 65 125 77 30 -36 -102 -61 -20 66 153 133 113 51 -9 -25 -40 -43 -46 -95 -144 -183 -223 -262 -301 -268 -234 -247 -259 -190 -120 -51 17 23 30 36 42 27 13 -47
5595 -47 -108 -108 -108 -109 -109 -75 -41 -7 27 95 164 156 148 91 34 23 12 -60 -133 -129 -126 -88 -49 -11 27 91 155 112 69 32 -4 4 13 16 19 22 25 37 49 61 73 68 63
5583 63 103 144 143 143 96 49 25 0 -23 -48 -4 38 23 -69 -161 -177 -133 -90 -76 -62 -49 -35 -15 5 25 45 27 9 -9 -27 11 50 12 -24 28 81
5573 81 58 35 24 12 0 -10 -34 -58 -81 -105 -109 -114 -118 -123 -118 -114 -109 -105 -66 -27 11 50 30 9 -11 -32 -34 -35 -37 -39 -61 -83 -106 -128 -42 43 53 62 41 21 0 -20
5562 -20 -16 -11 -7 -3 26 57 11 -34 -32 -29 -26 -24 3 31 59 87 62 37 59 80 89 98 108 117 42 -32 0 31 24 16 8 1 0 0 -1 -2 22 47 73 98 76 53 -14 -82 -144
5550 -144 -206 -161 -116 -64 -12 39 91 96 100 59 17 23 30 36 42 63 83 27 -28 -53 -77 -56 -35 -52 -70 -42 -14 16 47 32 17 30 44 57 71 18 -33 -40
5539 -40 -46 -13 19 7 -5 0 4 9 13 -11 -36 -61 -86 -84 -82 -81 -79 -78 -77 -76 -75 -79 -84 -89 -93 -124 -156 -182 -209 -250 -214 -175 -137 -76 -15 0 14 0 -13 -26 -40 -65 -89 -114
5527 -114 -139 -99 -58 -18 21 68 114 160 206 201 196 83 -29 -106 -183 -153 -123 -13 95 128 161 151 141 130 120 85 50 61 72 94 116 138 160 96
5518 96 31 42 54 77 100 169 238 224 210 196 181 135 88 44 76 82 88 99 109 89 69 48 28 -44 -117 -144 -171 -166 -161 -157 -152 -125 -98 -71 -44 -61 -78 -93
5507 -93 -107 -81 -10 33 0 -38 -76 -73 -69 -78 -88 -97 -106 -59 -12 -12 -11 -49 -88 -126 -165 -127 -89 -52 -14 -87 -159 -170 -105 -8 42 47 53 17 -18 -54 -91 -94 -98 -102 -105 -121
5496 -121 -136 -151 -166 -153 -140 -127 -114 -104 -93 -83 -73 -65 -56 -93 -131 -156 -181 -129 -78 -72 -66 -137 -208 -201 -195 -111 -28 -26 -23 -21 -19 5 29 8 -13 -31 -49 -21 6 57
5485 57 109 130 75 43 56 85 114 123 133 143 153 168 183 198 137 44 -2 -6 -10 -48 -133 -189 -169 -122 -76 -25 25 58 91 78 65 40 16 37 59 35 12
5474 12 -10 -33 -61 -89 -40 8 86 165 137 108 111 113 115 117 118 118 118 119 157 196 127 59 2 -53 -33 -13 42 98 109 119 42 -33 -64 -95 -123 -151 -178 -206 -208 -209
5463 -209 -134 -58 -33 -7 -15 -100 -191 -282 -302 -321 -228 -136 -89 -43 -28 -14 0 14 -3 -22 -40 -58 -9 39 43 46 17 -10 -38 -67 -37 -8 21 50 71 92
5454 92 113 134 154 174 149 123 123 123 124 124 147 170 193 216 192 168 144 120 150 180 133 86 125 163 156 148 81 13 22 30 18 6 -36 -33 32 22 -18 -59 -85 -112
5443 -112 -93 -27 -2 -54 -105 -157 -125 -93 -15 61 85 108 54 1 13 24 36 48 22 -2 -28 -53 -60 -66 -72 -79 -28 22 73 124 95 66 36 7 20 32 71
5432 71 63 52 41 48 54 71 42 -8 -105 -172 -193 -240 -286 -270 -209 -175 -142 -103 -109 -89 -69 -34 1 16 -13 -10 -7 42 139 220 300 333 319 289 259 232 159 88
5422 88 63 54 46 57 68 127 141 82 22 -16 -54 -48 -41 -34 -27 -19 -12 -4 2 -5 -13 -49 -40 -11 -27 -120 -212 -257 -255 -234 -212 -179 -146 -139 -86 -48 -10 -14 -19 -28 -36 -22 -8 0 7 -27
5409 -27 -62 -87 -66 -25 15 39 62 112 115 95 75 52 29 7 -13 -35 -57 -61 -65 -75 -39 19 32 22 -32 -119 -206 -215 -178 -138 -99 -62 20 55 44 59 73
5399 73 124 129 83 37 7 -21 -5 10 17 24 -14 -53 -127 -201 -213 -149 -100 -97 -63 -30 -32 -35 -38 -40 -54 -68 -82 -96 -78 -59 -40 -21 -8 5 -27 -60 -67 -75 -37 1
5388 1 47 94 117 141 113 86 12 -60 -65 -69 -97 -124 -142 -160 -102 -44 -30 -16 -2 11 32 53 74 95 73 52 31 10 22 34 47 59 36 13 14 14 25 37
5378 37 120 203 215 150 82 14 -54 -124 -116 -109 -67 -24 14 -22 -73 -124 -133 -143 -116 -90 -63 -36 -3 28 61 94 79 63 48 32 19 7 17 27 54 80 29
5367 29 -20 -51 -81 -35 10 27 45 -13 -73 -120 -167 -168 -170 -109 -48 -63 -79 -102 -126 -149 -172 -158 -144 -130 -116 -103 -91 -79 -67 -54 -41 17 76 63 50 36
5358 36 23 -6 -36 -62 -89 -94 -53 8 -6 -66 -80 -79 -78 -91 -104 -71 -38 -57 -76 -49 -22 26 74 74 73 81 42 -59 -84 -39 5 22 -37 -89 -141 -152 -164 -168
5347 -168 -173 -178 -183 -151 -118 -86 -53 -95 -136 -177 -219 -200 -181 -193 -158 -129 -176 -220 -188 -174 -160 -141 -122 -120 -117 -69 -21 -48 -75 -102 -130 -78 -25 26 78 121 165
5337 165 163 160 107 54 31 -36 -105 -97 -27 41 50 58 67 75 79 83 87 90 49 8 -32 -73 -46 -19 -38 -57 -20 17 54 92 105 119 86 54 50 45 87 128 83 37 -7
5326 -7 -53 -134 -216 -236 -179 -73 -13 -34 -101 -109 -117 -81 -46 -14 18 50 83 73 63 8 -47 8 65 72 80 59 -7 -45 -6 75 158 266 328 346 288 167
5316 167 92 95 97 103 108 118 128 137 147 148 149 104 59 59 58 58 57 54 50 47 43 12 -19 -51 -83 3 91 179 266 304 341 271 201 116 30 -8 -47 -1 45 91 137 109
5304 109 81 53 25 16 6 43 80 41 2 -36 -75 -76 -76 -76 -77 -80 -83 -87 -90 -80 -69 -105 -140 -142 -143 -98 -53 -75 -96 -118 -140 -121 -103 -84 -66 -60 -55 -34 32 84 60
5293 60 7 1 0 -45 -105 -89 -39 11 20 29 10 -9 -28 -47 -43 -38 -34 -29 -51 -74 -96 -118 -94 -69 -45 -20 0 19 -5 -31 -55 -78 -26 26 61 96 131 166 166 166
5282 166 121 75 68 60 52 44 31 17 1 -14 -80 -192 -205 -111 -30 -25 -47 -69 -73 -78 -83 -87 -13 59 133 207 224 240 180 120 81 41 2 -36 -26 -17 -54 -91 -32
5271 -32 26 9 -8 -16 -24 -33 -41 -27 -13 -4 3 33 -13 -60 -31 53 139 182 226 199 172 99 26 -7 -41 -75 -108 -56 -4 2 8 24 40 56 72 20 -31 -37 -44 -41 -39
5260 -39 -36 -34 -56 -79 -101 -124 -53 16 86 157 203 249 249 249 271 293 208 123 46 -30 30 91 150 210 224 238 204 169 135 100 31 -37 -60 -83 -94 -105 -115
5250 -115 -126 -108 -89 -73 -57 -67 -122 -192 -186 -122 -12 73 83 43 4 -6 59 153 248 283 241 180 119 130 140 146 152 112 26 -52 -55 -1 6 9 11 11 10 23 36
5239 36 49 62 17 -28 -73 -119 -104 -89 0 135 262 282 227 172 97 21 -23 8 92 130 153 176 168 160 152 144 132 120 62 4 -31 -68 -105 -141 -139 -136 -129 -122
5229 -122 -116 -34 47 52 36 19 -1 -23 2 27 98 169 146 123 146 169 174 178 182 186 151 116 38 -39 -104 -123 -92 -61 -43 -25 -27 -75 -125 -175 -121 -67 -39 -10
5218 -10 -28 -46 -63 -80 -96 -113 -91 -69 -47 -24 -50 -76 -101 -127 -123 -119 -115 -111 -111 -112 -95 -33 5 -2 -26 -51 -76 -100 -105 -63 -27 9 49 88 73 57 44 32 -14
5207 -14 -14 66 147 109 70 77 84 95 106 100 48 4 6 -20 -47 -52 -58 -18 22 55 89 77 65 70 75 80 85 48 10 -26 -63 -108 -152 -150 -148 -180 -211 -243 -275 -262 -250 -235
5196 -235 -220 -237 -208 -103 1 37 -4 -75 -147 -136 -78 -64 -96 -141 -140 -122 -103 -73 -43 13 23 9 -3 25 55 110 164 216 268 289 263 190 116 82
5186 82 93 78 64 99 134 213 291 339 341 324 306 241 176 114 52 6 7 -15 -38 -53 -21 10 -4 -4 -4 -8 -11 -29 -46 -18 9 34 58 109 113 92 70 0 -69
5176 -69 -125 -182 -235 -289 -296 -258 -202 -147 -102 -103 -125 -146 -67 11 41 71 145 173 90 6 -7 -21 10 42 65 89 69 50 33 63 92 76 37 -1 5 12 20 74
5165 74 100 48 39 29 -27 -84 -113 -96 -32 -15 -18 -21 17 57 58 59 59 60 49 38 70 103 108 68 53 39 -9 -57 -149 -164 -104 -43 -24 -4 -66 -128 -142 -110 -26
5155 -26 11 -29 -70 -112 -153 -149 -145 -91 -37 42 76 94 113 128 67 4 -13 -14 -16 -48 -79 -111 -142 -146 -150 -77 -4 42 88 59 29 -20 -70 -74 -78 -103 -128 -153 -177
5144 -177 -197 -216 -235 -254 -248 -243 -191 -140 -125 -111 -97 -83 -67 -51 -35 -19 -61 -103 -98 -94 -54 -15 -6 -74 -98 -76 -84 -93 -89 -86 -82 -79 -70 -61 -5 49 70 90 65 40 27
5133 27 13 -76 -166 -189 -213 -159 -106 -89 -72 -55 -38 -9 20 49 78 83 88 47 7 6 6 5 5 17 30 -33 -96 -97 -97 -98 -98 -100 -101 -60 -18 -63 -153 -215 -200 -163 -126
5121 -126 -131 -135 -126 -116 -107 -98 -115 -133 -150 -168 -154 -140 -80 -21 70 161 145 130 98 67 -9 -86 -94 -102 -110 -119 -79 -39 0 40 94 149 157 165 158 150 143 135 83 30 -21 -73
5110 -73 -60 -46 -32 -18 -9 0 8 17 28 38 -27 -93 -141 -188 -129 -70 -3 62 21 -19 -58 -97 -59 -22 79 180 235 290 253 215 132 48 46 45 43 41 89 137
5099 137 139 142 120 98 77 55 49 44 -6 -58 -108 -158 -131 -104 -74 -43 -59 -74 -134 -193 -176 -159 -59 39 62 85 89 93 51 9 55 100 100 100 75 50 132 215
5089 215 267 319 265 210 175 141 106 71 72 73 74 75 73 71 69 67 99 131 86 -4 -63 -45 -27 -9 -8 -6 -4 -3 23 49 76 103 129 154 134 114 93 72 51 30 6
5077 6 -16 -40 -64 -42 -20 1 23 45 66 41 16 -31 -80 -128 -177 -236 -295 -301 -216 -120 -70 -34 1 9 17 25 33 36 38 41 44 56 69 35 1 -43 -88 -87 -86 -72 -58
5066 -58 1 61 111 160 133 106 76 45 14 -16 23 63 102 142 124 107 89 71 65 58 51 45 25 6 -12 -31 -98 -165 -125 -85 -86 -87 -89 -90 -101 -112 -123 -134 -131 -128
5055 -128 -165 -202 -226 -158 -116 -119 -159 -200 -166 -132 -145 -157 -215 -274 -270 -266 -230 -241 -251 -170 -117 -110 -142 -173 -131 -89 -61 -32 -4 23 30 36 40 43 8 -73 -154 -189 -176
5044 -176 -162 -120 -124 -156 -189 -224 -259 -242 -225 -205 -184 -158 -87 30 102 97 91 82 74 56 38 20 2 -17 -38 -59 -80 -43 -6 -16 -25 -62 -99 -107 -162 -219 -229 -165
5034 -165 -100 -67 -80 -67 -54 -39 -24 -35 0 66 134 143 75 -4 -38 -56 -75 -36 2 -6 -61 -87 -68 -3 61 81 55 -21 -144 -218 -216 -184 -151 -73 4 31
5024 31 12 41 70 96 123 120 118 70 21 -27 -76 -123 -169 -167 -118 -67 -62 -46 15 75 88 72 57 13 14 24 34 1 -31 -70 -109 -174 -193 -169 -146 -120 -93 -35
5014 -35 22 60 52 77 103 106 63 22 -18 -42 -20 8 37 18 -46 -96 -147 -155 -162 -167 -171 -156 -94 -79 -63 4 26 -3 -33 -61 -88 -110 -54 -16 -24 -38 -52 -72 -47
5003 -47 -1 43 13 -62 -112 -116 -44 27 31 -10 -29 -1 -50 -99 -171 -198 -172 -147 -119 -91 -98 -104 -90 -31 -4 23 50 77 88 54 16 24 21 -27 -30 12 34 9 -60
4992 -60 -129 -108 -40 -1 37 59 35 31 73 148 177 156 89 22 2 -1 -4 16 37 42 0 -57 -68 -32 3 48 93 61 30 54 78 56 34 14 -5 -70 -136
4982 -136 -128 -120 -129 -183 -238 -247 -178 -108 -17 72 83 94 79 18 -16 -51 -61 -70 -83 -49 0 49 68 10 -67 -145 -152 -158 -144 -131 -117 -103 -158 -212 -221 -230 -215 -201 -163
4971 -163 -125 -87 -48 -55 -63 -136 -210 -281 -276 -228 -180 -128 -75 -2 70 120 170 179 188 90 -7 -16 -24 -10 3 8 14 39 64 57 4 -22 26 72 73 47 -55 -119 -75 5
4960 5 40 -18 -76 -137 -198 -144 -89 -35 19 19 19 18 18 -16 -51 -64 -76 -80 -83 -41 46 106 90 40 -9 -79 -195 -283 -294 -260 -227 -143 -59 0 58 71 84 55
4950 55 26 -48 -123 -142 -161 -74 13 102 190 245 223 217 210 176 142 72 2 8 14 -34 -84 -156 -229 -208 -187 -166 -145 -139 -133 -81 -30 -38 -47 -55 -64 -7 48 104 160 169 177
4939 177 140 102 9 -84 -70 -57 -23 10 -1 -13 6 27 48 69 37 6 -25 -57 -41 -26 -11 3 37 70 106 65 15 42 67 92 81 71 61 50 71
4929 71 92 113 134 72 10 -5 -22 -4 12 30 48 29 10 -8 -27 -44 -61 -33 -4 40 85 53 21 -3 -28 22 73 19 -34 -42 -50 -32 -13 20 99 232
4919 232 288 280 227 173 165 199 188 144 101 54 7 -51 -111 -170 -230 -214 -198 -184 -171 -181 -237 -264 -215 -162 -108 -96 -84 -47 -11 25 62 57 52 1 -49 -69 -89
4909 -89 -109 -129 -186 -242 -191 -141 -80 -19 41 102 115 128 138 148 114 34 -24 7 34 62 49 36 30 24 18 12 -54 -120 -186 -253 -215 -177 -139 -101 -102 -103 -60 29
4898 29 120 119 5 -109 -134 -158 -137 -116 -93 -70 -1 67 40 12 -15 -42 -69 -95 -45 49 111 81 3 -28 -38 -49 -102 -155 -135 -114 -94 -73 15 104 116
4889 116 129 85 42 45 48 51 55 59 63 50 37 25 12 9 6 3 0 -53 -108 -141 -82 -20 -5 -3 -2 -12 -23 -33 -43 -95 -147 -153 -159 -174 -190 -159 -129 -123 -117 -111 -105 -98 -91 -43 3
4876 3 16 -61 -134 -206 -236 -265 -187 -110 -102 -94 -86 -78 -95 -112 -84 -55 -45 -36 -26 -17 18 53 43 32 -27 -87 -101 -115 -55 4 41 -12 -64 -70 -108 -146 -164 -182 -124
4866 -124 -65 -36 -8 20 49 37 26 14 2 11 20 -15 -52 -83 -113 -143 -173 -149 -124 -100 -75 -34 6 93 179 198 217 236 255 347 440 594 840 1307
4856 1307 1866 1970 1492 1004 731 570 502 393 283 226 168 160 151 139 128 61 -51 -113 -83 -32 18 69 120 175 139 96 146 188 138 68 0
4848 0 12 25 115 205 269 333 397 460 528 596 709 823 864 905 900 895 799 703 607 511 421 331 287 242 226 210 193 177 166 156 145 134 110 85 106 127
4838 127 117 106 96 85 92 98 104 110 64 17 17 16 24 32 39 47 39 30 22 13 26 38 51 63 67 71 75 79 39 -1 4 9 23 38 52 66 40 14 18 -22 -57 -15 6 -17 -21 -25
4825 -25 -31 -38 -82 -126 -124 -123 -82 -41 -1 39 51 63 29 -4 -66 -128 -189 -251 -227 -204 -181 -157 -173 -190 -206 -222 -188 -153 -119 -84 -11 61 57 7 -41 -14 37 44
4815 44 53 63 23 -15 -10 -4 46 98 85 73 61 48 -19 -88 -50 -11 11 35 -16 -69 -57 -46 41 129 66 3 -59 -121 -117 -113 -68 -23 -6 -66 -129 -115 -134 -199
4804 -199 -256 -267 -246 -179 -89 0 23 46 23 0 -51 -102 -108 -114 -80 -47 63 173 144 116 87 59 47 35 69 102 42 -17 -31 -45 -40 -34 -29 -24 -49 -74 -99
4794 -99 -123 -117 -110 -103 -96 -51 -6 -7 -8 -25 -42 -59 -77 -81 -86 -91 -95 -50 -5 39 84 104 124 143 163 146 128 34 -59 -70 -80 -91 -101 -74 -47 -20 6 -27 -60 -94
4783 -94 -127 -142 -156 -170 -185 -164 -142 -121 -100 -82 -63 -45 -27 -48 -69 -44 -19 -20 -21 -22 -23 -21 -20 -18 -17 -35 -52 -70 -88 -79 -70 -61 -52 -12 28 68 109 135 162 143 124
4772 124 74 23 18 14 81 149 140 131 123 115 107 98 97 96 49 2 2 2 -44 -90 -133 -175 -111 -47 -26 -6 59 126 120 115 33 -48 -108 -168 -151 -135 -126 -118 -109 -101 -106 -112 -72 -32 4
4759 4 41 1 -38 -56 -73 -137 -201 -217 -233 -249 -266 -247 -229 -211 -193 -168 -144 -74 -3 42 89 89 90 40 -9 -12 -16 26 69 112 155 181 207 157 106 31 -44 -73
4749 -73 -103 -109 -115 -121 -127 -80 -34 -91 -149 -73 47 109 94 56 18 20 23 -2 -29 -55 -82 -86 -91 -95 -100 -104 -109 -113 -118 -91 -64 -83 -102 -99 -96 -94 -91 -54 -17 -56 -96 -101 -107 -112 -117 -116
4736 -116 -115 -113 -112 -97 -83 -68 -53 -42 -31 -5 67 82 21 5 -9 -24 -40 -24 -55 -91 -50 21 92 129 166 158 149 148 147 100 53 -32 -119 -182 -246 -168 -90 -12
4726 -12 65 65 64 17 -29 -94 -159 -147 -136 -56 22 56 89 80 70 61 51 49 47 59 117 163 118 78 85 108 132 205 277 260 244 250 257 258 259 184 64 -50 -73 -74
4715 -74 -76 -71 -67 -62 -57 -39 -20 -1 16 19 21 23 26 6 -13 11 37 39 40 41 43 7 -27 -40 -53 14 82 114 146 227 462 859 1103 933 671 505 385 260
4704 260 182 109 36 -45 -35 0 34 64 94 47 1 -37 -76 -66 -56 -46 8 44 -11 -74 -137 -129 -121 -56 8 -3 -15 -16 -16 5 27 27 27 -48 -125 -155 -185 -138
4694 -138 -91 -95 -98 -56 -13 7 28 -27 -83 -79 -75 -90 -104 -108 -36 65 120 114 107 120 134 130 126 99 73 12 -47 0 46 100 154 162 170 85 0 5 88 134 133 114 96
4683 96 85 29 -44 -41 8 58 112 167 167 167 166 166 139 112 85 59 53 48 43 38 11 -15 -42 -69 -76 -84 -45 38 117 119 121 123 96 69 41 14 3 -7 -19 -30 -27 -23 -20 -17
4671 -17 6 30 54 77 71 65 81 98 164 230 219 209 183 158 133 108 63 18 49 81 57 33 33 32 -1 -35 7 49 31 13 102 191 254 316 356 396 373
4660 373 350 282 213 194 176 112 47 13 -21 -55 -90 -58 -25 6 39 -4 -48 -15 16 63 110 112 113 74 36 74 112 126 140 131 122 135 148 115 81 41 0
4650 0 -17 -35 -48 -61 -74 -87 -38 9 12 15 27 39 52 64 70 75 35 -5 -75 -145 -139 -133 -89 -45 -48 -50 -37 -23 -10 2 -29 -61 -92 -124 -129 -134 -140 -145 -150 -155 -161 -166 -103 -40
4638 -40 22 85 42 0 -19 -39 -89 -139 -143 -147 -161 -174 -142 -109 -80 -51 -45 -39 -62 -85 -109 -55 35 81 81 81 22 -35 -70 -105 -80 -55 -30 -5 -36 -67 -98 -129
4628 -129 -110 -92 -74 -55 -56 -57 -57 -58 -55 -52 -18 -30 -37 31 75 42 0 -41 -39 -37 3 89 125 69 6 -56 -47 -39 -49 -58 -113 -168 -189 -210 -154 -98 -88 -79 -69 -59 -39
4616 -39 -19 0 19 35 51 -8 -69 -5 59 47 34 -8 -51 -49 -46 -18 9 14 19 3 -13 16 45 60 75 89 104 41 -21 -83 -146 -91 -37 17 72 77 82 87 92
4606 92 71 49 28 6 -5 -17 -21 -71 -135 -107 -57 -7 -51 -96 -135 -174 -155 -44 60 119 82 -1 -48 -48 -40 -124 -205 -194 -119 -44 -39 -35 -96 -158 -173 -189 -174
4596 -174 -160 -146 -131 -125 -118 -66 -13 3 19 -9 -38 -7 23 31 40 62 85 85 84 50 16 27 39 43 46 47 47 0 -95 -212 -237 -225 -166 -98 -77 -85 -47 8 63 84
4585 84 105 80 55 0 -55 -35 -14 10 34 13 -7 7 22 -7 -38 -80 -122 -118 -114 -112 -110 -62 -14 5 24 43 63 45 27 9 -8 -29 -51 -113 -175 -220 -174
4574 -174 -105 -37 0 -7 -47 4 79 61 26 37 55 27 -1 16 73 84 47 10 -2 -15 -28 -41 -39 -37 10 58 43 29 -31 -91 -109 -126 -98 -70 -85 -100
4564 -100 -112 -124 -105 -40 9 -32 -124 -124 -75 -26 -4 17 39 61 90 120 155 98 80 62 38 14 -9 -34 -105 -176 -184 -192 -155 -117 -85 -53 -68 -82 -32 17
4555 17 21 25 20 15 10 6 -16 -38 -132 -226 -264 -225 -157 -135 -112 -89 -22 89 121 76 31 63 107 105 57 9 -25 -59 -94 -128 -110 -91 -72 -54 -70 -86 -101 -117
4544 -117 -83 -49 -15 18 61 104 70 36 9 -16 -43 -70 -51 -33 30 94 125 155 109 63 28 -6 4 16 21 26 77 128 178 227 270 237 201 119 33 -7
4534 -7 -14 -22 -26 -30 -39 -48 -57 -66 -103 -141 -132 -124 -106 -88 -54 24 103 105 50 41 108 174 137 99 95 92 165 239 255 270 212 155 58 8 -6 55 155 209 212 215 200 108 37
4522 37 11 20 75 107 138 113 87 61 36 37 39 40 -34 -128 -176 -178 -180 -164 -148 -131 -115 -64 -12 -38 -63 -38 -14 -12 -11 -36 -61 -85 -110 -114 -119 -123 -127 -85 -42 0 42
4511 42 67 92 71 50 -2 -54 -61 -68 -71 -73 -33 6 84 117 96 30 -25 -35 1 39 29 20 10 1 1 2 2 3 -35 -74 -110 -146 -164 -137 -90 -42 -9 23 56 89
4500 89 63 36 55 75 71 68 88 107 106 105 87 22 -12 -2 -21 -39 -38 -37 -10 16 -22 -15 11 38 60 83 83 83 82 82 125 167 187 160 136 113 98 83 26 -31 -87
4489 -87 -97 -56 -15 -34 -54 -27 -1 36 73 64 55 70 86 81 30 -49 -129 -134 -92 -53 -59 -60 -60 -35 -9 18 0 -13 -28 -46 -63 -40 -17 5 28 12 -4 -41 -78
4478 -78 -74 -24 72 170 161 106 74 88 69 50 34 18 45 72 48 -21 -51 -81 -88 -95 -43 55 145 236 254 195 107 65 76 86 57 27 -20 -23 20 18 24 30 34 37
4467 37 66 96 79 62 69 75 104 179 301 469 736 1002 1043 824 604 460 400 386 354 276 203 130 100 70 16 -36 -67 -98 -78 -58 -39 -19 -4
4458 -4 10 67 125 136 101 46 -8 -5 -2 -25 -1 -18 -34 -71 -107 -123 -138 -134 -83 14 112 151 114 55 42 41 41 62 38 -9 -10 19 50 60 70 101 131 162 192
4447 192 193 193 151 108 89 117 144 125 87 48 6 -34 -77 -119 -86 -52 -48 -45 -38 -32 15 108 142 100 62 24 12 76 150 179 128 32 -11 -9 -36 -62 -68 -73 -82 -90
4436 -90 -107 -169 -231 -247 -191 -136 -77 -18 -5 7 -25 -57 -64 -71 -78 -85 -70 -54 -39 -23 -18 -12 39 91 118 145 148 106 44 -63 -171 -233 -244 -208 -196 -183 -126 -68
4426 -68 -31 -40 -66 -92 -122 -151 -151 -152 -109 -67 -46 -71 -70 -69 -26 16 56 96 67 -8 -58 -107 -125 -143 -159 -174 -162 -105 -47 -35 -53 -70 -90 -110 -110 -111 -111 -112 -93 -75
4415 -75 -59 -43 -12 -26 -15 -3 0 1 -41 -84 -111 -138 -119 -100 -80 -60 33 126 152 131 136 141 147 153 113 74 65 57 48 40 65 90 141 146 115 85 126 166 188 163 136
4403 136 154 206 212 171 129 105 81 58 34 25 16 -35 -88 -78 -22 33 43 33 23 10 -2 11 25 35 46 47 2 -13 -30 -33 9 55 55 5 1 44 40 36 78
4393 78 117 111 39 -33 -46 15 53 45 22 -1 7 17 26 35 -10 -57 -100 -144 -180 -171 -114 -57 -32 -54 -49 -45 -66 -87 -1 130 186 165 144 123 79 36 -7 -50 -39
4382 -39 -28 -17 -6 -28 -51 -74 -96 -82 -67 -98 -130 -124 -119 -114 -108 -101 -94 -87 -80 -82 -84 -10 64 73 82 92 101 117 134 105 76 22 -30 -83 -136 -70 -5 60 126 142 158 174
4370 174 190 282 373 475 576 759 1096 1634 2079 1947 1415 946 629 490 443 431 419 307 195 190 186 195 205 215 225 229 233 192 150 86 23
4362 23 5 -12 63 139 168 198 118 37 33 30 60 91 122 153 165 177 143 108 71 34 -2 -39 -14 11 36 61 37 14 -9 -32 -22 -11 -46 -81 -39 2
4352 2 -1 -5 -17 -30 -43 -55 -38 -22 40 102 112 122 132 142 83 25 -33 -91 -69 -48 -26 -4 -28 -52 -76 -99 -40 18 32 45 78 111 144 177 137 96 98
4342 98 101 138 129 100 71 52 33 13 -5 -22 -38 -9 20 58 96 134 172 158 144 130 116 91 65 40 14 14 14 14 14 -4 -23 -42 -61 -67 -74 -80 -86 -118 -151 -163
4331 -163 -129 -79 -28 21 -4 -75 -146 -113 -34 -3 -17 -34 -4 34 -2 -65 -83 -42 -2 38 79 57 -9 -77 -99 -108 -117 -123 -130 -76 -22 31 85 128 170 161 107
4321 107 79 52 67 83 62 41 66 91 136 181 149 118 75 31 -8 -48 -67 -39 -37 -35 -22 -9 46 102 139 130 101 72 14 -43 -25 -7 -89 -171 -233 -249
$$ [...]
-1468G4
##END=	
##END=	
