##TITLE=	crystalline 6b contaminated with 4b.1.fid
1H NMR, crystalline 6b contaminated with 4b

##JCAMP-DX=	6.0	$$ MestReNova 14.1.1-24571
##DATA TYPE=	LINK
##BLOCK_ID=	1
##BLOCKS=	1    
##ORIGIN=	Mestrelab Research S.L.
##OWNER=	hrzepa
##$MNOVA/LINK_BLOCK_TYPE=	ITEM	$$ NMR Spectrum
##$MNOVA/ITEM/POLYGON=	(XY..XY)
5321,5835
8722,5835
8722,8208
5321,8208
5321,5835
##$MNOVA/ITEM/Z=	0
##$MNOVA/ITEM/ANGLE=	0
##TITLE=	crystalline 6b contaminated with 4b.1.fid
##JCAMP-DX=	6.0	$$ MestReNova 14.1.1-24571
##BLOCK_ID=	2
##DATA TYPE=	NMR SPECTRUM
##DATA CLASS=	XYDATA
##NUMDIM=	1
##ORIGIN=	Bruker BioSpin GmbH
##OWNER=	nmrsu
##.OBSERVE FREQUENCY=	300.13185342560802837
##.OBSERVE NUCLEUS=	^1H
##.SOLVENT NAME=	C6D6
##.PULSE SEQUENCE=	zg30
##LONGDATE=	2019/01/25 10:28:00.000
##.ACQUISITIONMODE=	SIMULTANEOUS (DQD)
##$ORIGINAL FORMAT=	Bruker XWIN-NMR
##$MNOVA/SCALES_VERSION=	9
##$PARAMETER FILE=	(acqus, ASCII, /var/folders/f6/rjf_tdyn2v98c5c0wvkgn4s80000gn/T/uBo10NpIT3qqxGYb7zb0bA/crystalline%206b%20contaminated%20with%204b/1/acqus, 0)
$$ ##TITLE= Parameter file, TOPSPIN		Version 3.0
$$ ##JCAMPDX= 5.0
$$ ##DATATYPE= Parameter Values
$$ ##NPOINTS= 11	$$ modification sequence number
$$ ##ORIGIN= Bruker BioSpin GmbH
$$ ##OWNER= nmrsu
$$ $$ 2019-01-25 10:28:46.734 +0100  nmrsu@CZC049C5SM
$$ $$ C:/Bruker/TopSpin3.0/data/King/nmr/pkl52CR/1/acqus
$$ $$ process C:\Bruker\TopSpin3.0\prog\mod\shimcntl.exe
$$ ##$ACQT0= -2.26890760309556
$$ ##$AMP= (0..31)
$$ 100 100 100 100 100 100 100 100 100 100 100 100 100 100 100 100 100 100
$$ 100 100 100 100 100 100 100 100 100 100 100 100 100 100
$$ ##$ANAVPT= -1
$$ ##$AQSEQ= 0
$$ ##$AQ_mod= 3
$$ ##$AUNM= <au_zg>
$$ ##$AUTOPOS= <5 >
$$ ##$BF1= 300.13
$$ ##$BF2= 300.13
$$ ##$BF3= 300.13
$$ ##$BF4= 300.13
$$ ##$BF5= 300.13
$$ ##$BF6= 300.13
$$ ##$BF7= 300.13
$$ ##$BF8= 300.13
$$ ##$BYTORDA= 0
$$ ##$CAGPARS= (0..11)
$$ 0 0 0 0 0 0 0 0 0 0 0 0
$$ ##$CFDGTYP= 0
$$ ##$CFRGTYP= 9
$$ ##$CHEMSTR= <none>
$$ ##$CNST= (0..63)
$$ 1 1 145 1 1 1 1 1 1 1 1 1 1 1 1 1 1 1 1 1 1 1 1 1 1 1 1 1 1 1 1 1 1 1 1
$$ 1 1 1 1 1 1 1 1 1 1 1 1 1 1 1 1 1 1 1 1 1 1 1 1 1 1 1 1 1
$$ ##$CPDPRG= <>
$$ ##$CPDPRG1= <>
$$ ##$CPDPRG2= <>
$$ ##$CPDPRG3= <>
$$ ##$CPDPRG4= <mlev16>
$$ ##$CPDPRG5= <>
$$ ##$CPDPRG6= <>
$$ ##$CPDPRG7= <>
$$ ##$CPDPRG8= <>
$$ ##$D= (0..63)
$$ 0 1 0 0 0 0 0 0 0 0 0 0 0 0 0 0 0.0002 0 0 0 0 0 0 0 0 0 0 0 0 0 0 0 0
$$ 0 0 0 0 0 0 0 0 0 0 0 0 0 0 0 0 0 0 0 0 0 0 0 0 0 0 0 0 0 0 0
$$ ##$DATE= 1548408525
$$ ##$DBL= (0..7)
$$ 120 120 120 120 120 120 120 120
$$ ##$DBP= (0..7)
$$ 150 150 150 150 150 150 150 150
$$ ##$DBPNAM0= <>
$$ ##$DBPNAM1= <>
$$ ##$DBPNAM2= <>
$$ ##$DBPNAM3= <>
$$ ##$DBPNAM4= <>
$$ ##$DBPNAM5= <>
$$ ##$DBPNAM6= <>
$$ ##$DBPNAM7= <>
$$ ##$DBPOAL= (0..7)
$$ 0.5 0.5 0.5 0.5 0.5 0.5 0.5 0.5
$$ ##$DBPOFFS= (0..7)
$$ 0 0 0 0 0 0 0 0
$$ ##$DE= 12
$$ ##$DECBNUC= <off>
$$ ##$DECIM= 3232
$$ ##$DECNUC= <off>
$$ ##$DECSTAT= 4
$$ ##$DIGMOD= 1
$$ ##$DIGTYP= 12
$$ ##$DL= (0..7)
$$ 0 120 120 120 120 120 120 120
$$ ##$DP= (0..7)
$$ [...]
$$ ##$RX22TY= <no>
$$ ##$RXFMAX= (0..7)
$$ 432.5 -1 -1 -1 -1 -1 -1 -1
$$ ##$RXFMIN= (0..7)
$$ 5 -1 -1 -1 -1 -1 -1 -1
$$ ##$RXINTLV= (0..7)
$$ 1 0 0 0 0 0 0 0
$$ ##$RXMSTY= <no>
$$ ##$SCMTY= <no>
$$ ##$SGUC1= (0..15)
$$ 18 19 0 0 0 0 0 0 0 0 0 0 0 0 0 0
$$ ##$SGUC2= (0..15)
$$ 33 256 0 0 0 0 0 0 0 0 0 0 0 0 0 0
$$ ##$SPECTR= 10
$$ ##$SY2FLAG= 0
$$ ##$SYNCTRIG= 11
$$ ##$ShimPowMaxUA= (0..63)
$$ 130000 130000 130000 130000 130000 130000 130000 130000 130000 130000 130000
$$ 130000 130000 130000 130000 130000 130000 130000 130000 130000 0 0 0 0
$$ 0 0 0 0 0 0 0 0 0 0 0 0 0 0 0 0 0 0 0 0 0 0 0 0 0 0 0 0 0 0 0 0 0 0 0 0
$$ 0 0 0 0
$$ ##$ShimPowMaxUC= (0..63)
$$ 130000 130000 130000 130000 130000 130000 130000 130000 130000 130000 130000
$$ 130000 130000 130000 130000 130000 130000 130000 130000 130000 0 0 0 0
$$ 0 0 0 0 0 0 0 0 0 0 0 0 0 0 0 0 0 0 0 0 0 0 0 0 0 0 0 0 0 0 0 0 0 0 0 0
$$ 0 0 0 0
$$ ##$ShimPowMaxUG= (0..63)
$$ 524287 524287 524287 524287 524287 524287 524287 524287 524287 524287 524287
$$ 524287 524287 524287 524287 524287 524287 524287 524287 524287 0 0 0 0
$$ 0 0 0 0 0 0 0 0 0 0 0 0 0 0 0 0 0 0 0 0 0 0 0 0 0 0 0 0 0 0 0 0 0 0 0 0
$$ 0 0 0 0
$$ ##$ShimPowRcbType= 3
$$ ##$ShimPowRes= (0..63)
$$ 1e-020 1e-020 1e-020 1e-020 1e-020 1e-020 1e-020 1e-020 1e-020 1e-020 1e-020
$$ 1e-020 1e-020 1e-020 1e-020 1e-020 1e-020 1e-020 1e-020 1e-020 0 0 0 0
$$ 0 0 0 0 0 0 0 0 0 0 0 0 0 0 0 0 0 0 0 0 0 0 0 0 0 0 0 0 0 0 0 0 0 0 0 0
$$ 0 0 0 0
$$ ##$ShimPowRng0= (0..63)
$$ 1 1 1 1 1 1 1 1 1 1 1 1 1 1 1 1 1 1 1 1 0 0 0 0 0 0 0 0 0 0 0 0 0 0 0 0
$$ 0 0 0 0 0 0 0 0 0 0 0 0 0 0 0 0 0 0 0 0 0 0 0 0 0 0 0 0
$$ ##$ShimPowRng1= (0..63)
$$ 1 1 1 1 1 1 1 1 1 1 1 1 1 1 1 1 1 1 1 1 0 0 0 0 0 0 0 0 0 0 0 0 0 0 0 0
$$ 0 0 0 0 0 0 0 0 0 0 0 0 0 0 0 0 0 0 0 0 0 0 0 0 0 0 0 0
$$ ##$ShimPowRng2= (0..63)
$$ 1 1 1 1 1 1 1 1 1 1 1 1 1 1 1 1 1 1 1 1 0 0 0 0 0 0 0 0 0 0 0 0 0 0 0 0
$$ 0 0 0 0 0 0 0 0 0 0 0 0 0 0 0 0 0 0 0 0 0 0 0 0 0 0 0 0
$$ ##$ShimPowRng3= (0..63)
$$ 1 1 1 1 1 1 1 1 1 1 1 1 1 1 1 1 1 1 1 1 0 0 0 0 0 0 0 0 0 0 0 0 0 0 0 0
$$ 0 0 0 0 0 0 0 0 0 0 0 0 0 0 0 0 0 0 0 0 0 0 0 0 0 0 0 0
$$ ##$ShimSysFunc= (0..63)
$$ 1 2 3 4 5 7 9 11 15 16 8 10 12 14 6 17 13 18 19 20 0 0 0 0 0 0 0 0 0 0
$$ 0 0 0 0 0 0 0 0 0 0 0 0 0 0 0 0 0 0 0 0 0 0 0 0 0 0 0 0 0 0 0 0 0 0
$$ ##$ShimSysMatrix= 0
$$ ##$ShimSysType= 1
$$ ##$TFXNUM= 0
$$ ##$TRIPLO2= 0
$$ ##$VTU= 2
$$ ##$VTUETH= <149.236.99.20>
$$ ##$VTUTY= <no>
$$ ##$WBREFAM= (0..15)
$$ 20.9 49.1 100 100 100 100 100 100 100 100 100 100 100 100 100 100
$$ ##$WBREFLM= (0..15)
$$ 0 0 0 0 0 0 0 0 0 0 0 0 0 0 0 0
$$ ##$WBREFPH= (0..15)
$$ 72.55 -68.79 0 0 0 0 0 0 0 0 0 0 0 0 0 0
$$ ##$XFAC= 2
$$ ##END=
$$ 
##$DECIM=	3232
##$DSPFVS=	20
##XUNITS=	HZ
##YUNITS=	ARBITRARY UNITS
##FIRSTX=	4947.4850139735199264
##LASTX=	-1240.5393747080358935
##DELTAX=	-0.094423199644183358759
##XFACTOR=	1
##YFACTOR=	0.0053808340748361027303
##FIRSTY=	8.5726194381713867188
##MINY=	-6.945735931396484375
##MAXY=	9372.34375
##NPOINTS=	65536
##XYDATA=	(X++(Y..Y))
$$ [...]
1204A3697O32N53M44L11K38N2j32k65l93l93m91n71n21n21m70l89l55l55l25l24l25l25k62
1202I510k62k62k62k12k12k07k07j20l9q5q4o3o3o3o3k5k5k6k5kkkkJ28J27J27J28J81J81
1199H069J82J81K29K29M02M02M36M36M55N87O55O54P57P56Q50Q51Q91Q91Q60Q61O74M35J87
1197B0930n2l21o14q41r74j010j011r44r44p97p98o92o92n46n45l86l85l45l46l02l01l02
1195G782l02j70j69j70j69j23j23j23j22j04j04j03j04J3J3N2N3K7K6R4R3P2P3J38J39J72
1193F861J72K12K12K05K05K98K99L58L58M51M51N01N00N94N93O07O07N77M97K99J66M2r0k40
1190A4735m80n88o68p07p07p13p12o28o29n08n09m26m26l34l33k97k98k58k57j69j69j69j69
1188D581j25j25j30n0l5l4r7r6q0q1q0q1j3j3L1J10P3qj8j9n6K4R9R9P6P5P6P5J10J09J10
$$ plain form
1204 13697 14329 14882 15326 15637 15875 15927 15795 15530 15137 14744 14253 13682 13161 12640 12170 11781 11426 11071 10746 10422 10097 9772 9510
1202 9510 9248 8986 8724 8512 8300 8093 7886 7766 7727 7642 7558 7495 7432 7369 7306 7281 7256 7230 7205 7203 7201 7199 7197 7325 7452 7579 7707 7888 8069
1199 8069 8251 8432 8661 8890 9292 9694 10130 10566 11021 11608 12263 12917 13674 14430 15280 16131 17022 17913 18773 19634 20308 20743 20930
1197 20930 20878 20557 19943 19102 18128 17118 16107 15163 14219 13422 12624 11932 11240 10694 10149 9763 9378 9033 8687 8385 8084 7782
1195 7782 7480 7310 7141 6971 6802 6679 6556 6433 6311 6207 6103 6000 5896 5909 5922 5974 6027 6054 6080 6174 6267 6339 6412 6550 6689 6861
1193 6861 7033 7245 7457 7662 7867 8165 8464 8822 9180 9631 10082 10583 11083 11677 12270 12877 13484 14061 14558 14857 15023 15065 14975 14735
1190 14735 14255 13667 12999 12292 11585 10872 10160 9532 8903 8395 7886 7460 7034 6700 6367 6070 5772 5514 5257 5088 4919 4750 4581
1188 4581 4456 4331 4201 4151 4116 4082 3985 3889 3809 3728 3648 3567 3554 3541 3572 3682 3755 3747 3729 3710 3654 3678 3777 3876 3952 4027 4103 4178 4288 4397 4507
1185D507J09J39J40J39J39J46J45J45J45Q7Q7J2o8k5k5r7r7j67j67k08k07k37k36k37k37k14
1183C718k15r4r5j43j44j03j03j02j02j02j01k6k5k6k5l6l5l6l5m4m4m4m4m4m4m3m4N7N8N8
1180A992N8M1M1M1M1RQRQK6K5K5K5NNNNQPQQn9n8j8j8K0K0m7m6k9k9k9k9q0q1j4j4j2j3j3
1176A851j3k5k5k5k5RJ0J0J0K2K1j8j9j3j4Q0P9O3O2nmj0rj0rN1N2N2N2O4O3llK4K4J71J70
1173B710J81J80J13J14J37J37O6O6M2k4j6q2j55j55j19j19j31j30j31j31j31j32o5o5rj0n0
1170B091n0r1r1n2n1PQl3l3pqqqM0M0LO9P2P1J0Rk8k8J1J2L8L7L8L7J0J0N0N0O9O9J62J62
1167B687J35J36R9J00J40K07J70J69J71J71J71J70J18J17J51Q5j5q1j06j73k05k45k89k49
1165C634j91j92j23j23j62j62j22j22j14j14j13j14k8k8k8k9k9l0l0l0rrrrn2n3k6M0L2rk2
$$ plain form
1185 4507 4616 4755 4895 5034 5173 5319 5464 5609 5754 5841 5928 5940 5872 5847 5822 5725 5628 5461 5294 5086 4879 4642 4406 4169 3932 3718
1183 3718 3503 3409 3314 3171 3027 2924 2821 2719 2617 2515 2414 2388 2363 2337 2312 2276 2241 2205 2170 2126 2082 2038 1994 1950 1906 1863 1819 1876 1934 1992
1180 1992 2050 2091 2132 2173 2214 2223 2231 2240 2248 2274 2299 2324 2349 2354 2359 2364 2369 2377 2384 2392 2400 2341 2283 2265 2247 2267 2287 2240 2194 2165 2136 2107 2078 1998 1917 1903 1889 1877 1864 1851
1176 1851 1838 1813 1788 1763 1738 1747 1757 1767 1777 1799 1820 1802 1783 1770 1756 1836 1915 1978 2040 2035 2031 2021 2012 2002 1993 2044 2096 2148 2200 2264 2327 2324 2321 2345 2369 2540 2710
1173 2710 2891 3071 3184 3298 3435 3572 3638 3704 3746 3722 3706 3624 3469 3314 3195 3076 2945 2815 2684 2553 2422 2290 2225 2160 2151 2141 2091
1170 2091 2041 1950 1859 1807 1756 1763 1771 1738 1705 1698 1690 1682 1674 1714 1754 1757 1826 1898 1969 1979 1988 1960 1932 1943 1955 1993 2030 2068 2105 2115 2125 2175 2225 2294 2363 2525 2687
1167 2687 2822 2958 3057 3157 3297 3504 3674 3843 4014 4185 4356 4526 4644 4761 4912 4997 4982 4901 4795 4622 4417 4172 3883 3634
1165 3634 3443 3251 3128 3005 2843 2681 2559 2437 2323 2209 2096 1982 1954 1926 1898 1869 1840 1810 1780 1750 1741 1732 1723 1714 1662 1609 1583 1623 1655 1646 1624
1162A624k2K7K6j3j4LLM3M3Q6Q7J9K0R6R7R8R9O9J09J29O1L6J03J81J80J45J45P8P9M5M5L1
1159C758o2j37j36j43j42j64j63j63j63j08j07j07j07r4r4llj16j56j29o2l8Kj6j7k2k3k2
1156A263k3p2p3p2p3QQPQkklkP3P3P3P3n1n1m8m9k5J5M6J12J02O1K2K2L4L5L4L5N1N1j5j6
1152A629NNNNk9l0k9k9o5o5o5o5k8k9k8k8jjjjl7l7m0m0Ml6n9K1J7J7K3K2j9k0j9j9l6l5l6
1149H26l6K5K5K5K5KJKKK4K4K4K4j0j0k7J2L8J17J20M0NNn0L0J4o5l5NJ3N3Q2Ll1M7K1j9L1
1145A382L1K9K9l0k9l0l0kkkkm0l9K8K7L3L3L3L4%%J%J7J7J7J7N2N3N2N3JJO8O8M5M6Q6Q6
1141B133Q4Q4Q4Q4O1O1O1O2J57J58J57J58J47J47J47J47J17J18J17J17J20J21J20J21M6M7
1139D976M7M6K0K1rp5j01j01j45j45q4q4q6q6q5j25j40p4n4n5n0n0j%j%J7J7J8J7N4N3N4N4
$$ plain form
1162 1624 1602 1629 1655 1642 1628 1631 1634 1677 1720 1806 1893 1912 1932 2028 2125 2223 2322 2391 2500 2629 2690 2726 2829 3010 3190 3335 3480 3558 3637 3682 3727 3758
1159 3758 3696 3559 3423 3280 3138 2974 2811 2648 2485 2377 2270 2163 2056 1962 1868 1865 1862 1746 1590 1461 1399 1361 1363 1347 1330 1308 1285 1263
1156 1263 1240 1168 1095 1023 950 958 966 973 981 979 977 974 972 1045 1118 1191 1264 1213 1162 1114 1065 1040 1055 1101 1213 1315 1376 1398 1420 1454 1489 1523 1558 1609 1660 1645 1629
1152 1629 1634 1639 1644 1649 1620 1590 1561 1532 1467 1402 1337 1272 1244 1215 1187 1159 1158 1157 1156 1155 1118 1081 1041 1001 1005 969 910 931 948 965 988 1010 991 971 952 933 897 862 826
1149 826 790 815 840 865 890 892 893 895 897 921 945 969 993 983 973 946 958 996 1113 1233 1273 1278 1283 1233 1263 1277 1212 1177 1182 1195 1248 1330 1333 1302 1349 1370 1351 1382
1145 1382 1413 1442 1471 1441 1412 1382 1352 1350 1348 1346 1344 1304 1265 1293 1320 1353 1386 1419 1453 1453 1453 1454 1454 1471 1488 1505 1522 1574 1627 1679 1732 1733 1734 1802 1870 1915 1961 2047 2133
1141 2133 2217 2301 2385 2469 2530 2591 2652 2714 2871 3029 3186 3344 3491 3638 3785 3932 4049 4167 4284 4401 4521 4642 4762 4883 4929 4976
1139 4976 5023 5069 5089 5110 5101 5026 4925 4824 4679 4534 4450 4366 4280 4194 4109 3984 3844 3770 3716 3661 3611 3561 3560 3560 3559 3559 3576 3593 3611 3628 3682 3735 3789 3843
1136C843R7R8R8R7J28J27Q8Q7P1P1J90J91K14K15K19K18K49L16L44L44L13L12L60M00L58M24
1133I472M82M83M39M39M34M33L50K58J94J29L6n7k09l02l07l06m06m05m19m18l26l26l38l38
1131H992k98k98k69k69k03k02j49j49j45j45j33o7l8l7n4n3L9M0nmnmL4L5J00J01J58J57J97
1128G326J97K31K31K31K30K82K81K82K81L80L81M60M60M69M70N49N49O06O07O44O44O14N74
1126A6979M83L50K28J89O0j26k90m22m51n30n81o22o78o79n82n03m42m83m95m56m23l83l60
1124I783l60k77k78k19k19j39j39j69j69j29j29q1q0m1m0l1l1l0l1J3J2l2M8J26J25J31J31
1121G745J75J75J74J75K32K31K31K32L17L18L18L18L94L93M34M33M62M61L99L59L56K76K78
1119A4886J99J9o1j14j93k84l63l76m15m05l25l08l47l01k60k85k86l07l06l07l07l07l07
$$ plain form
1136 3843 3940 4038 4136 4233 4361 4488 4576 4663 4734 4805 4995 5186 5400 5615 5834 6052 6301 6617 6961 7305 7618 7930 8290 8690 9048 9472
1133 9472 9954 10437 10876 11315 11749 12182 12532 12790 12984 13113 13149 13092 12883 12581 12274 11968 11562 11157 10738 10320 9994 9668 9330 8992
1131 8992 8694 8396 8127 7858 7655 7453 7304 7155 7010 6865 6732 6665 6627 6590 6536 6483 6522 6562 6557 6553 6548 6544 6578 6613 6713 6814 6972 7129 7326
1128 7326 7523 7754 7985 8216 8446 8728 9009 9291 9572 9952 10333 10793 11253 11722 12192 12741 13290 13896 14503 15147 15791 16405 16979
1126 16979 17462 17812 18040 18229 18289 18163 17873 17451 17000 16470 15889 15267 14589 13910 13328 12825 12383 11900 11405 10949 10526 10143 9783
1124 9783 9423 9146 8868 8649 8430 8291 8152 7983 7814 7685 7556 7475 7395 7354 7314 7283 7252 7222 7191 7204 7216 7184 7232 7358 7483 7614 7745
1121 7745 7920 8095 8269 8444 8676 8907 9138 9370 9687 10005 10323 10641 11035 11428 11862 12295 12757 13218 13617 13976 14332 14608 14886
1119 14886 15085 15104 15043 14929 14736 14452 14089 13713 13298 12893 12568 12260 11913 11612 11352 11067 10781 10474 10168 9861 9554 9247 8940
1117H940l07l07k67k67k67k67j74j75j35j34j47j46o6o6j04j04k4k4j6j6j7j6j1j1j2j1Q5
1115E934Q4Q5Q5J27J28J28J28J37J37J37J37J54J53J54J53J13J12J12J12J12J13J07J07R5
1112H844J6O0O0P8P8Q7QPQ7J12J12Pp3j07j08k17k18k57k58j96j97j62q2j32j32j27j28l4
1110G128l4p9JO7O6P2P1L9L9L9L9N1N1J1J1K4K3j09j10j48j48o8o8j1j1n0n1o4o4J6J6o8o9
1107F612l4M6J9J8O4O4Q2Q3Q3Q3J39J40J39J40J83J83J82J83J67J67J62J62O3j8K8K7k1k1
1104I125N9N9J00J00J39J40J91J92K71K71L08L08L08L08L30L29L65L65L22K42K48J67R4J5
1102A4356l4j14j52j52k45l25l77l77l02l02l39l39k59k59j62j61q2q2j46j47j07j06j3j2
1099I762n3n2m6m7j2O9N4N4K0J9O2O1K7K7N6J36J31J31J48J49J08J09J73J74K09K88L04L05
$$ plain form
1117 8940 8633 8326 8059 7792 7525 7258 7084 6909 6774 6640 6493 6347 6281 6215 6111 6007 5983 5959 5943 5927 5910 5894 5883 5872 5860 5849 5934
1115 5934 6018 6103 6188 6315 6443 6571 6699 6836 6973 7110 7247 7401 7554 7708 7861 7974 8086 8198 8310 8422 8535 8642 8749 8844
1112 8844 8860 8920 8980 9058 9136 9223 9231 9238 9325 9437 9549 9556 9483 9376 9268 9051 8833 8576 8318 8122 7925 7763 7681 7549 7417 7290 7162 7128
1110 7128 7094 7015 7016 7083 7149 7221 7292 7331 7370 7409 7448 7499 7550 7561 7572 7596 7619 7510 7400 7252 7104 7036 6968 6957 6946 6896 6845 6781 6717 6733 6749 6681 6612
1107 6612 6578 6624 6643 6661 6725 6789 6871 6954 7037 7120 7259 7399 7538 7678 7861 8044 8226 8409 8576 8743 8905 9067 9130 9112 9140 9167 9146 9125
1104 9125 9184 9243 9343 9443 9582 9722 9913 10105 10376 10647 10955 11263 11571 11879 12209 12538 12903 13268 13590 13832 14080 14247 14341 14356
1102 14356 14322 14208 14056 13904 13659 13334 12957 12580 12278 11976 11637 11298 11039 10780 10618 10457 10375 10293 10147 10000 9893 9787 9774 9762
1099 9762 9709 9657 9611 9564 9552 9621 9675 9729 9749 9768 9830 9891 9918 9945 10001 10137 10268 10399 10547 10696 10804 10913 11086 11260 11469 11757 12061 12366
1097A2366L49M29M07M87N32N32N39O18O54O53O74O73O39N59M76M76L21K42J22j2j36k16k80
1095B1104k81l60l61l23k42k83k83k19j40n2n2j1j1j1j1k8k8j16j95k71k71l11l90l21l21
1092A6212l26l26k85k85k05k05k25k24j85j84r1r0j1j1l1l0N7J37J82J81J82K61K94K95L32
1090A5419M12M58M18M44N23N18N58O20O21N67N67N27N28N34N34M76L42K55K55K86K87L54L55
1088B5858L99L99M86N67O35P68Q35Q75Q55P74P47N61J95r8l39o31r44j130j232j313j359j280
1086B5628j212j132j056r23q27p47o68o28n52m72m52m12l38k57j87j47j68j27q7m7kL8O4O3
1083A5352J42K22K17K17K34K33L14L14L94L94L94L94N16N15N20N20N48O29O68O68P34Q13R36
1081B5888J069J131J171J273J406J475J554J608J568J406J219R29N84J18l33q36j235j546
$$ plain form
1097 12366 12715 13144 13551 14038 14570 15102 15641 16259 16913 17566 18240 18913 19552 20111 20587 21063 21384 21626 21748 21736 21600 21384 21104
1095 21104 20823 20463 20102 19779 19537 19254 18971 18752 18612 18560 18508 18497 18486 18475 18464 18436 18408 18292 18097 17826 17555 17244 16854 16533 16212
1092 16212 15886 15560 15275 14990 14785 14580 14355 14131 13946 13762 13671 13581 13570 13559 13528 13498 13555 13692 13874 14055 14237 14498 14792 15087 15419
1090 15419 15831 16289 16707 17151 17674 18192 18750 19370 19991 20558 21125 21652 22180 22714 23248 23724 24066 24321 24576 24862 25149 25503 25858
1088 25858 26257 26656 27142 27709 28344 29112 29947 30822 31677 32451 33198 33759 33954 33856 33517 32886 31942 30812 29580 28267 26908 25628
1086 25628 24416 23284 22228 21305 20478 19731 19063 18435 17883 17411 16959 16547 16209 15952 15765 15618 15450 15323 15236 15189 15187 15225 15289 15352
1083 15352 15494 15716 15933 16150 16384 16617 16931 17245 17639 18033 18427 18821 19337 19852 20372 20892 21440 22069 22737 23405 24139 24952 25888
1081 25888 26957 28088 29259 30532 31938 33413 34967 36575 38143 39549 40768 41697 42281 42399 42066 41230 39995 38449
1079C8449j786j928k009j975j842j759j626j450j263j144j065r54q22o84o04n48n47m68l88
1078A5587l49l49k96k16j94j94j45j44j00j9JK%%R4R3R5R5J16J97K62K63L35L34L89L89M56
1075A6702M56N88N89O42P21P49Q29Q60Q60R78J058J074J075J094J015Q64P31M48J56j61n06
1073C0822q82j121j295j376j430j430j338j204j073j072j015q82p50o70n88n87n04n04m05
1071A2696m06l73k92k45k44l01l00k53j72j48j48j42j43j10j10j09j10o6o6m4L6K0J9K5K5
1069I039M5M6J12J12J20J20J87J87K08K09K75K75K22K22K60K60K54K14J88J09N6N6Lj29k26
1067A2424k66k52k51l31l32m24m24m02m02l35l36l42l43k23k23k97k96k92k92k34j53j05j05
1064E764k27k26j61j60j04j05j07j07j15j56j13l4o1j01j13j13p9p9j3j2L9M0j%n7n7J0J0
$$ plain form
1079 38449 36663 34735 32726 30751 28909 27150 25524 24074 22811 21667 20602 19648 18826 18142 17538 16990 16443 15975 15587
1078 15587 15238 14889 14593 14377 14183 13989 13844 13700 13600 13581 13582 13584 13584 13584 13678 13771 13866 13961 14077 14274 14536 14799 15134 15468 15857 16246 16702
1075 16702 17158 17746 18335 18977 19698 20447 21276 22136 22996 23974 25032 26106 27181 28275 29290 30154 30885 31333 31489 31328 30822
1073 30822 29940 28819 27524 26148 24718 23288 21950 20746 19673 18601 17586 16704 15954 15284 14696 14109 13605 13101 12696
1071 12696 12290 11917 11625 11380 11136 10835 10535 10282 10110 9962 9814 9672 9529 9419 9309 9200 9090 9024 8958 8914 8950 8970 8989 9014 9039
1069 9039 9084 9130 9242 9354 9474 9594 9781 9968 10176 10385 10660 10935 11157 11379 11639 11899 12153 12367 12555 12664 12720 12776 12779 12650 12424
1067 12424 12158 11906 11655 11324 10992 10568 10144 9742 9340 9005 8669 8327 7984 7761 7538 7241 6945 6653 6361 6127 5974 5869 5764
1064 5764 5537 5311 5150 4990 4886 4781 4674 4567 4452 4296 4183 4149 4088 3987 3874 3761 3682 3603 3590 3578 3617 3657 3656 3656 3599 3542 3552 3562
1062C562L1L2lmk1N8J25M4j8j9M1Q2K1n9QQ8N2J2%%M1M1k6k6O8O7LLJ7N7M5l5m5L5O8j3o0
1058D272r9o0j00j33j33r6n6o2j41j34j33j11j10p1l1j0q9q2q2p3p3j18l8J0J1J6J6m3m3m3
1055B161m3QPPPqqqqN6N5N5N6M1M2M2M2L2L2R8R9M4M3J11J10P7P7P7P7J43J43J44J43J20J20
1052D194N4N3P7P7J1J1k3k2j16j16j15j15j54j55j39j38j38j39j26j27j27j27o4o3o4o4m9
1050B296m8m9m9l9l9l9l9j1j2j1j2jkjkk3k4k3k3K0J9K0K0M2M3M2M2N9N9N9N9L6L6L6L7R2
1046B570R3R3R3N1N1N1N1J36J36M3M3n0n0j0j0p3p2j12j13j10j09j10j10j07j08j42j42j58
1044A825p9l0l1l7l6l7l7k9k8k8k8m5m5m5m5k3k3k3k2K4K4K5K4LLl7l7%%O7O7J7J6n0n0OO
1040A262M5M6L3L2L3L2P3P2OOk8k8p5MO0K0m5m6J1J0J1J0n9n8n9n8j7j7j7j7n4n4n3n4l5l4
$$ plain form
1062 3562 3593 3625 3622 3618 3597 3655 3780 3824 3806 3787 3828 3910 3931 3872 3880 3968 4020 4032 4032 4032 4073 4114 4088 4062 4130 4197 4200 4203 4220 4277 4322 4287 4242 4277 4345 4332 4272
1058 4272 4173 4113 4013 3880 3747 3651 3595 3533 3392 3258 3125 3014 2904 2833 2802 2792 2703 2621 2539 2466 2393 2275 2237 2247 2258 2274 2290 2247 2204 2161
1055 2161 2118 2126 2133 2140 2147 2139 2131 2123 2115 2171 2226 2281 2337 2378 2420 2462 2504 2536 2568 2666 2765 2809 2852 2963 3073 3150 3227 3304 3381 3524 3667 3811 3954 4074 4194
1052 4194 4248 4301 4378 4455 4466 4477 4454 4432 4316 4200 4085 3970 3816 3661 3522 3384 3246 3107 2981 2854 2727 2600 2536 2473 2409 2345 2296
1050 2296 2248 2199 2150 2111 2072 2033 1994 1983 1971 1960 1948 1947 1945 1944 1942 1919 1895 1872 1849 1869 1888 1908 1928 1970 2013 2055 2097 2156 2215 2274 2333 2369 2405 2441 2478 2570
1046 2570 2663 2756 2849 2900 2951 3002 3053 3189 3325 3368 3411 3361 3311 3301 3291 3218 3146 3034 2921 2811 2702 2592 2482 2375 2267 2125 1983 1825
1044 1825 1746 1716 1685 1648 1612 1575 1538 1509 1481 1453 1425 1380 1335 1290 1245 1222 1199 1176 1154 1178 1202 1227 1251 1254 1257 1220 1183 1183 1183 1250 1317 1334 1350 1300 1250 1256 1262
1040 1262 1307 1353 1386 1418 1451 1483 1556 1628 1634 1640 1612 1584 1509 1513 1573 1593 1548 1502 1513 1523 1534 1544 1485 1427 1368 1310 1293 1276 1259 1242 1188 1134 1081 1027 992 958
1037I58l5l5j1j2j1j1kkjkjkjkk5k4k5k4j5j5j4j5J5J5J5J5J2J2k9k8J0RP6P5RQk6k7l9M1
1033H36J9k1k4k4M0M0j1j2j2j2k8k8L5L6L5npL3rm9k4k4k4k4m6oJ8J9Ll6k7k6J3N2K3j7PQ
1029G21L4L4L4L4K2K2j6N1M3M3M7M7M7M8O9L0%jJ2N2J37R7N1J2J9J9n2r2l0RRl1k0K0J7k3
1026A515n4n4n7n6mmk6J3KJLMl0l1n0j0L9P8M4Mk8J2N3N3J6J6J6J6qpqpM2M2M3M2R1R0R3R3
1022A987N7R6J41J40J20J20J20J20J52J51J74J35P8P8R4N4%o8j25j25j58j57j40j00q5q5j45
1020B629j05k9k9o6o6r4r3k8k7l2l2l3l2k8k8k8k8L1L1NM5L9k8j0L0L4L4L7L7M1M2Q1Q2K5
1016B407K4R2R1R3R3R3R3J11J10J11J11J96J97J92J92K48J81J52J52Q0Q1J4J4k7k6j20j20
1014D835k04k03k17k57k12j46j18j19j41j40j03j03n1r1j06l9k0k1j6j6j5j6j3j3o7k6MP1
$$ plain form
1037 958 923 888 877 865 854 843 841 839 838 836 835 833 832 830 805 781 756 732 717 702 688 673 688 703 718 733 745 757 728 700 710 719 795 870 879 887 861 834 795 836
1033 836 855 834 810 786 826 866 855 843 831 819 791 763 798 834 869 864 857 890 881 832 808 784 760 736 690 684 702 721 724 688 661 635 648 700 723 706 713 721
1029 721 755 789 823 857 879 901 885 936 979 1022 1069 1116 1163 1211 1280 1310 1310 1309 1321 1373 1510 1607 1658 1670 1689 1708 1656 1564 1534 1543 1552 1521 1501 1521 1538 1515
1026 1515 1461 1407 1350 1294 1290 1286 1260 1273 1275 1276 1279 1283 1253 1222 1172 1162 1201 1279 1323 1327 1299 1311 1364 1417 1433 1449 1465 1481 1473 1466 1458 1451 1493 1535 1578 1620 1711 1801 1894 1987
1022 1987 2044 2140 2281 2421 2541 2661 2781 2901 3053 3204 3378 3513 3591 3669 3763 3817 3817 3749 3624 3499 3341 3184 3044 2944 2859 2774 2629
1020 2629 2524 2495 2466 2400 2334 2240 2147 2119 2092 2060 2028 1995 1963 1935 1907 1879 1851 1882 1913 1918 1963 2002 1974 1964 1994 2028 2062 2099 2136 2177 2219 2300 2382 2407
1016 2407 2431 2523 2614 2707 2800 2893 2986 3097 3207 3318 3429 3625 3822 4014 4206 4454 4635 4787 4939 5019 5100 5114 5128 5101 5075 4955 4835
1014 4835 4631 4428 4211 3954 3742 3596 3478 3359 3218 3078 2975 2872 2821 2730 2624 2585 2565 2544 2528 2512 2497 2481 2468 2455 2388 2362 2366 2437
1011B437J32R2N0J1k1J8N8N8M0Jj5N2R2R3R6R7R9R9J00R9J55J56J56J55J91J91J90J91J79
1008E252J79K14K15K20J53R7R8J8J9J8J9K5K6L0L0N4J33J87J87J90K71K97K97L42M22M70M70
1006I933N31N31O24O24O91O91P31P32Q23Q24Q24Q24Q60Q59P53O74O83O03M54L73K33R9L3m6
1004B3961j42k74l38m17m72n51o66p46p85p85p90p90p98p98p26p26o58n79n30n31m94m93m54
1001A0418m54l94l94l01l01k29k29k24k23j76r6m8m8l0k9l0l0Q1Q2J21J21J39J39J84J05J6
999H170J5N1N1M5M5n6j37j42j42j07j08j28j29j69j69j32j32o6o5p4p4l5l4K8K8R4R5J09J09
996F941J09J10K12K12K12K12K12K12K13K12L22L23L28L27M12M91N44N83O07O06O58O97P57
994A5512Q36Q21R01J026J107J224J303J385J424J486J566J602J681J703J703J610J530J379
$$ plain form
1011 2437 2569 2661 2711 2722 2701 2719 2777 2835 2875 2876 2861 2913 3005 3098 3194 3291 3390 3489 3589 3688 3843 3999 4155 4310 4501 4692 4882 5073 5252
1008 5252 5431 5645 5860 6080 6233 6330 6428 6446 6465 6483 6502 6527 6553 6583 6613 6667 6800 6987 7174 7364 7635 7932 8229 8571 8993 9463 9933
1006 9933 10464 10995 11619 12243 12934 13625 14356 15088 15911 16735 17559 18383 19243 20102 20855 21529 22212 22815 23269 23642 23875 23974 24007 23961
1004 23961 23819 23545 23207 22790 22318 21767 21101 20355 19570 18785 17995 17205 16407 15609 14883 14157 13499 12920 12390 11859 11365 10872 10418
1001 10418 9964 9570 9176 8875 8574 8345 8116 7892 7669 7493 7397 7349 7301 7271 7242 7212 7182 7263 7345 7466 7587 7726 7865 8049 8154 8170
999 8170 8185 8236 8287 8332 8377 8321 8184 8042 7900 7793 7685 7557 7428 7259 7090 6958 6826 6760 6695 6621 6547 6512 6478 6506 6534 6628 6723 6832 6941
996 6941 7050 7160 7372 7584 7796 8008 8220 8432 8645 8857 9179 9502 9830 10157 10569 11060 11604 12187 12794 13400 14058 14755 15512
994 15512 16348 17169 18070 19096 20203 21427 22730 24115 25539 27025 28591 30193 31874 33577 35280 36890 38420 39799
992C9799J193R10N64K16p7m02o94r13j100j235j315j353j393j472j472j475j475j370j370
991B5566j347j308j251j171j030r50r25q84q26p87o83o04n68m89m22l83l27k87k99k59j60
989A0606j60j22j23p4Nj1j2J14J13J35J36K07K07K27L07M16M96N01N01N62O42P33Q66R23J004
986A8199J047J046J037J036Q55O15K98m8l87p33j026j213j320j319j308j174j061r81q61p28
984A1974o56n75n64n24m59l80l22k83k58k19j64q3j23j23j18j18o7o8o7o7L5L5L5L5N8N8N9
982G051N8J23J23J23J22J99J98K44K43J91K71L14L94M71M71N14N93O91P30P14P13P50P51Q08
980A6860P68O87O07M97L10L4k58n34p73r69j048j053j054j014r35q33p53o76n96m93m12l74
977G988l33l51l52k89k90k10k09j39j38j38j39j50j50j50j49q1q1kjJ1J1k8k9OOM6M6J79J79
$$ plain form
992 39799 40992 41902 42466 42682 42605 42203 41509 40596 39496 38261 36946 35593 34200 32728 31256 29781 28306 26936 25566
991 25566 24219 22911 21660 20489 19459 18509 17584 16700 15874 15087 14404 13800 13232 12743 12321 11938 11611 11324 11025 10766 10606
989 10606 10446 10324 10201 10127 10132 10121 10109 10223 10336 10471 10607 10814 11021 11248 11555 11971 12467 12968 13469 14031 14673 15406 16272 17195 18199
986 18199 19246 20292 21329 22365 23220 23835 24133 24085 23698 22965 21939 20726 19406 18087 16779 15605 14544 13563 12702 11974
984 11974 11318 10743 10179 9655 9196 8816 8494 8211 7953 7734 7570 7487 7364 7241 7123 7005 6938 6870 6803 6736 6771 6806 6841 6876 6934 6992 7051
982 7051 7109 7232 7355 7478 7600 7799 7997 8241 8484 8675 8946 9260 9654 10125 10596 11110 11703 12394 13124 13838 14551 15301 16052 16860
980 16860 17628 18315 18922 19419 19729 19763 19505 18971 18198 17229 16181 15128 14074 13060 12125 11292 10539 9863 9267 8774 8362 7988
977 7988 7655 7304 6952 6663 6373 6163 5954 5815 5677 5539 5400 5250 5100 4950 4801 4720 4639 4637 4636 4647 4658 4630 4601 4607 4613 4659 4705 4884 5063
975E063J79J79J14J14J14J14K00K00K45K45K82L62L78M16M99N39N19M39L57K78K01O8qq9j45
972A0863k24l49m28m29m28m74m74n49n49m94m14l21l21l09k29k34k34j31j30k10k10j86j85
970C351j06j06p6p5l5l6m5m5m5m5l2l3l2l3rrrj0K1K1K1K0J7J7K1K2O0J40R5R4J13J12J12
967C456J13J68J69J69J69J66J67J61J62J44O4pm6j20k00k37k37k48k48k82k83k25j45j11j10
965B609j14j13j54j53r7r7r5r5j9K0M3l8j29j30m9L1L5nm0%j7j7j5j4k9k8k9k9opP3P3J3J2
962A390k7k8j4j3O6O6M7M7M6M7J5J4R5R4P9Q0P9P9K4K4K3K4PPPPk3k3k4k3J8J7J8J7N2N2J1
958B377J2N2N3J32J32J37J36J37J36J54J54J94J94K39K38L19L18L32L32K85K19J61R4J7k3
956F531j5j6o0j27j15j15j99j99j59j59j59j59k03k02k03k02j80j79j79j80j69j69j70j69
$$ plain form
975 5063 5242 5421 5535 5649 5763 5877 6077 6277 6522 6767 7049 7411 7789 8205 8704 9243 9762 10201 10558 10836 11037 11105 11097 11008 10863
972 10863 10639 10290 9862 9433 9005 8531 8057 7508 6959 6465 6051 5730 5409 5100 4871 4637 4403 4272 4142 3932 3722 3536 3351
970 3351 3245 3139 3063 2988 2953 2917 2872 2827 2782 2737 2705 2672 2640 2607 2598 2589 2580 2570 2591 2612 2633 2653 2670 2687 2708 2730 2790 2930 3025 3119 3232 3344 3456
967 3456 3569 3737 3906 4075 4244 4410 4577 4738 4900 5044 5108 5101 5055 4935 4735 4498 4261 4013 3765 3483 3200 2975 2830 2719 2609
965 2609 2495 2382 2228 2075 1978 1881 1786 1691 1672 1692 1735 1697 1568 1438 1389 1420 1455 1450 1410 1410 1393 1376 1361 1347 1318 1290 1261 1232 1226 1219 1292 1365 1378 1390
962 1390 1363 1335 1321 1308 1374 1440 1487 1534 1580 1627 1642 1656 1751 1845 1924 2004 2083 2162 2186 2210 2233 2257 2264 2271 2278 2285 2262 2239 2215 2192 2210 2227 2245 2262 2314 2366 2377
958 2377 2389 2441 2494 2626 2758 2895 3031 3168 3304 3458 3612 3806 4000 4239 4477 4796 5114 5446 5778 6063 6282 6443 6537 6554 6531
956 6531 6516 6500 6440 6313 6198 6083 5884 5685 5526 5367 5208 5049 4846 4644 4441 4239 4059 3880 3701 3521 3352 3183 3013 2844
953B844j69j70j63j64j17k4l9j06j05j06j10j09j1j1j0j1n4n4n3n4j8j8j8j8m8m7m8m8RRO
950I65Pkm2n7J0M2M3Oo0m5nK3O3M1%j4j4j7j7K3K3N3N3k7k8L1L0L0L0N5N4N4N4Q4Q4Q4Q4O2
947A760O1O2O1R8R8R9R8J17J18J18J17J28J27J28J28J85J85J85J86K35K35K35K35J86J86J86
944E557J86J23J23J23J23K9K9K5K4o9j49j84j83k06k05k06k05k34k34k33k34j97j97j96j97
942C213j97j96j97j97j29j29j30j29r2r3r3r2q5q4q4q4p0o9o9o9q5q4mnJ6J7k4k3k8k7k8k7
939F23rqrqr6r6j7j6N9O0O4j5o0n9o4o5M3M3Q8Qn1n1k2N9K1K2j4j4k3k4k4k4K4K5j6j5j0j0
935C19O9P0K4K4n6n6k0k0k1k0J1J2J1J1k6k7k6k7KKKJl0l0N0N0K1K1K2K1l7l7l3l3k4M2Oo2
932B06p7l7J7J6O1O1O1O1K7K6K7K6n6n7n0n1j8P6O0nJ4J4RJ0J1J0J1J0j9k0j9k0k9k8k9k9
$$ plain form
953 2844 2675 2505 2342 2178 2061 2037 1998 1892 1787 1681 1571 1462 1451 1440 1430 1419 1365 1311 1258 1204 1186 1168 1150 1132 1084 1037 989 941 950 959 965
950 965 972 970 928 871 881 923 966 972 912 867 862 885 948 989 989 975 961 944 927 950 973 1026 1079 1052 1024 1055 1085 1115 1145 1200 1254 1308 1362 1446 1530 1614 1698 1760
947 1760 1821 1883 1944 2042 2140 2239 2337 2454 2572 2690 2807 2935 3062 3190 3318 3503 3688 3873 4059 4294 4529 4764 4999 5185 5371 5557
944 5557 5743 5866 5989 6112 6235 6264 6293 6318 6342 6273 6124 5940 5757 5551 5346 5140 4935 4701 4467 4234 4000 3803 3606 3410 3213
942 3213 3016 2820 2623 2426 2297 2168 2038 1909 1817 1724 1631 1539 1454 1370 1286 1202 1132 1063 994 925 840 756 752 747 763 780 756 733 705 678 650 623
939 623 614 606 597 589 493 397 380 364 423 483 547 532 472 413 349 284 327 370 458 466 415 364 342 401 422 444 430 416 393 369 345 321 345 370 354 339 329 319
935 319 388 458 482 506 450 394 374 354 333 313 324 336 347 358 332 305 279 252 254 256 258 259 229 199 249 299 320 341 363 384 347 310 277 244 220 262 268 206
932 206 129 92 109 125 186 247 308 369 396 422 449 475 419 362 312 261 243 319 379 374 388 402 411 421 432 442 453 463 444 424 405 385 356 328 299 270
928B70k7k6k7k6RQM5M4P9J2l1l0j2j2n1n2KLKKL1L0L0L0J7J7o3o3m0m1L9L9K8K8j1j2KKKK
925B49L6L7L6L6J5J5J5J5l8l7M2M3JJM1M1M4M4LMmnOp4r5j4J6J5k6k6N4N4nmm5m4k9k9J1J1
921D10MLp6p7LKM3M2K0K0K0K0l6l7jP9P0P0mnj3j3j4j3J8J8J8J8j0j1j0j1n8n8j8j8m8m9L1
917C29L1O6O6K6K6l9m0M1M1M8M8l2l1ONOOK4K4K4K4mmj0rK3n6n2Q2R7J7o2o3MMM4M4jkkkJ0
913G57RR0R0L3L3opJ8J8k2k3M8M8RQJ6J5N6N5M9M8M9M8k3k4N6N6N7N7N8N7M6M5OOO3O2J30
910B091J29L3L2L3L3R9R8R9R9J82J82J82J82K11K12K12K12J75J75J75J76J98J99J99J98K15
907F031K16L08L08L44L44M38M37N17N17N57N56O39O39Q38Q38R64R65J057J058J300J300J500
905B1671J500J488J488J398J319J201R63O69L24L5k58o13r07j112j298j492j491j518j518
$$ plain form
928 270 243 217 190 164 173 181 226 270 349 361 330 300 288 276 225 173 175 178 180 182 213 243 273 303 320 337 274 211 171 130 169 208 236 264 253 241 243 245 247 249
925 249 285 322 358 394 409 424 439 454 416 379 421 464 465 466 507 548 592 636 639 643 639 634 640 566 471 457 473 488 462 436 490 544 539 535 490 446 417 388 399 410
921 410 414 417 341 264 267 269 312 354 374 394 414 434 398 361 360 439 509 579 575 570 557 544 530 517 535 553 571 589 579 568 558 547 489 431 413 395 347 298 329
917 329 360 426 492 518 544 505 465 506 547 595 643 611 580 586 591 597 603 627 651 675 699 695 691 681 672 695 639 587 669 766 783 721 658 662 666 710 754 753 751 749 747 757
913 757 766 856 946 979 1012 1006 999 1017 1035 1013 990 1038 1086 1095 1103 1119 1134 1190 1245 1294 1342 1391 1439 1416 1392 1448 1504 1561 1618 1676 1733 1779 1824 1830 1836 1899 1961 2091
910 2091 2220 2253 2285 2318 2351 2450 2548 2647 2746 2928 3110 3292 3474 3685 3897 4109 4321 4496 4671 4846 5022 5220 5419 5618 5816 6031
907 6031 6247 6555 6863 7207 7551 7989 8426 8943 9460 10017 10573 11212 11851 12689 13527 14491 15456 16513 17571 18871 20171 21671
905 21671 23171 24659 26147 27545 28864 30065 31028 31697 32021 32056 31798 31185 30278 29166 27868 26376 24885 23367 21849
903B1849j393j393j320j239j151j018r34q01p20p21o27o27n08n07l83l82l82l82l03l03j84
901F571j83j95j94j94j95j76j76j76j76j97j97j30j31q6q6q6q6r2r2r2r2pqqpk4k5k4k4k4
899C388k4k4k5k8k8k9k8J9K0O5J45J32R3K7K7Q4Q5Q4Q4J55J55J55J55J54J53J54J53J34J34
896E569J35J34K09K10K76K76J87J87K11K91L24L63M18M18M50N30N91O71P53Q32R21R60J042
894A5958J121J212J292J367J446J492J491J479J345J174R88P87M95J99r4l58n97p11p90p78
892B8518o99n88m56l49k17o6O6J85L72O11R03J303J861K496L161M033N124O550Q438J0891
890G2137J4108J8039K2374K6388K8756K8035K3007J3584J216j1644k2363k8890l0779k8907
889A25061k4837k0080j5745j2130r285p113n544m286l303k582k129j746j401j150r64q38p59
$$ plain form
903 21849 20456 19063 17743 16504 15353 14335 13401 12600 11880 11159 10532 9905 9397 8890 8507 8125 7743 7361 7058 6755 6571
901 6571 6388 6193 5999 5805 5610 5434 5258 5082 4906 4709 4512 4382 4251 4165 4079 3993 3907 3815 3723 3631 3539 3532 3524 3516 3509 3485 3460 3436 3412 3388
899 3388 3364 3340 3315 3287 3259 3230 3202 3221 3241 3306 3451 3583 3676 3703 3730 3814 3899 3983 4067 4222 4377 4532 4687 4841 4994 5148 5301 5435 5569
896 5569 5704 5838 6047 6257 6533 6809 6996 7183 7394 7685 8009 8372 8790 9208 9658 10188 10779 11450 12203 13035 13956 14916 15958
894 15958 17079 18291 19583 20950 22396 23888 25379 26858 28203 29377 30365 31152 31647 31846 31752 31394 30797 30086 29296 28518
892 28518 27819 27231 26775 26426 26209 26143 26209 26394 26766 27377 28280 29583 31444 33940 37101 41134 46258 52808 61246 72137
890 72137 86245 104284 126658 153046 181802 209837 232844 246428 247644 236000 213637 184747 153968 125061
889 125061 100224 80144 64399 52269 42984 35871 30327 26041 22738 20156 18027 16281 14880 13730 12766 11928 11169
887A1169p43p42p35p35o96o56n86n06m26l45l01l00k96k15j81j80j06j06j06j06j17j17j18
885B750j17r9j00j9j9n8n8n8n7p1p0l3l3r6j36p9Jjkl6l6j09j09k5N4J3o6m1kJ2k8m2m3p0
882A117p0RJ0OOl4l4J6J5k4k4J%J%m6m6ooL6L6m3m3l3l3l2l3POPPJKKJl0l1M6M7j8n9m3L7
877G28Q5M6o1o0o8o9k8k9j6j7K3K4K0K0K0K0oojjl4M6N1l0m0M0J5k6k0K0onl0l0l0l0NOM5
874E71M6M3M4l7l6m5m6m6m5J9J9J9J9K0J9J9J9j9j9j9j9J1J1J1J1kkkkl2l2l2l2j7j8j7j7
870C65%j%jL8L8L7L8k2k1k1k2M0M0J%N1N1k9k9j9k0j9j9ONOOK7K6K7K7K2K2J7J7O7j3m8m7
867F43qqqpRQRRP0P1j0rj3j2j3j3M8M7J22J22N2k7J7J7Q7Q7Q8Q7P1P2P1P1J63J63L0L0J3J3
863B162J2J3q1q1q1q1j2j3N4N5M0M0M0M0N4N4R8J9lmN8N8l5l4l5l5r5r5j62j62j54j54l5l5
$$ plain form
887 11169 10426 9684 8949 8214 7518 6862 6276 5770 5344 4999 4698 4398 4102 3887 3706 3526 3420 3314 3208 3102 2985 2868 2750
885 2750 2633 2534 2434 2415 2396 2338 2280 2222 2165 2094 2024 1991 1958 1862 1726 1647 1648 1647 1645 1609 1573 1464 1355 1330 1384 1397 1331 1290 1288 1300 1272 1230 1187 1117
882 1117 1047 1056 1066 1072 1078 1044 1010 1026 1041 1017 993 994 994 995 995 949 903 897 891 927 963 920 877 844 811 779 746 753 759 766 773 774 776 778 779 749 718 764 811 793 734 691 728
877 728 813 859 798 738 670 601 573 544 528 511 534 558 578 598 618 638 632 626 625 624 590 636 687 657 617 657 672 646 626 646 640 635 605 575 545 515 520 526 571
874 571 617 660 704 667 631 586 540 494 449 468 487 506 525 545 564 583 602 583 564 545 526 537 548 559 570 568 566 564 562 530 498 466 434 417 399 382 365
870 365 365 364 364 363 401 439 476 514 492 471 450 428 468 508 509 509 560 611 582 553 534 514 495 476 482 487 493 499 526 552 579 606 628 650 667 684 751 738 690 643
867 643 635 627 619 612 621 629 638 647 717 788 778 769 756 744 731 718 766 813 935 1057 1109 1082 1099 1116 1203 1290 1378 1465 1536 1608 1679 1750 1913 2076 2106 2136 2149 2162
863 2162 2174 2187 2106 2025 1944 1863 1851 1838 1892 1947 1987 2027 2067 2107 2161 2215 2313 2332 2329 2325 2383 2441 2406 2372 2337 2302 2207 2112 1950 1788 1634 1480 1445 1410
860A410k9l0l0k9m2m3m2m2k1k2k1k2j2j1n2n2J1J2J1J2mll8l9LQ2L7L8QQPQK6K7O6O6N3N3
856A354J20J20R2R1J58J58K17K16J23J23J90J90J89J90J37J37J33J32R3J3l5l4o6o5o5o5l6
854C810l6N7N7P8P8J44J45J70J69J03J03J03J03Q1Jj04j05k02k03j91j92j92j92j61j61j21
851C342j21j22j22j27m7MNMQ4J27J26R2R2J01J02J68J68J72J72K65K65K69K69K75K74K86L65
849F488L61L61L86L87L62K83K93K52J92J51O7o7j25k04k50k90l34l34l16k36j75r5rP1L1L0
846G280J28J28J63J63J16L5j6K3l8j71k14k14k32k32k32k33j71j72p9p8K6K6P6J15J40K20
844F557K77L18L72M13M44N23N75O15O63O64P27P27P67P67P06P06O67O28O35P15P38P78Q08
841B0790Q08Q73R12Q62P29N70L31M1j45l71o10q07r93j080j121j111j111j008q21o38m52l52
$$ plain form
860 1410 1381 1351 1321 1292 1250 1207 1165 1123 1102 1080 1059 1037 1025 1014 962 910 921 933 944 956 952 949 911 872 875 957 994 1032 1040 1048 1055 1063 1089 1116 1182 1248 1301 1354
856 1354 1474 1594 1686 1777 1935 2093 2310 2526 2649 2772 2962 3152 3341 3531 3668 3805 3938 4070 4163 4176 4141 4107 4041 3976 3911 3846 3810
854 3810 3774 3831 3888 3966 4044 4188 4333 4503 4672 4775 4878 4981 5084 5165 5166 5062 4957 4755 4552 4361 4169 3977 3785 3624 3463 3342
851 3342 3221 3099 2977 2850 2803 2807 2812 2816 2900 3027 3153 3245 3337 3438 3540 3708 3876 4048 4220 4485 4750 5019 5288 5563 5837 6123 6488
849 6488 6849 7210 7596 7983 8345 8628 8921 9173 9365 9516 9583 9516 9391 9187 8937 8647 8313 7979 7663 7427 7252 7157 7148 7219 7250 7280
846 7280 7408 7536 7699 7862 7978 8013 7997 8020 7982 7811 7597 7383 7151 6919 6687 6454 6283 6111 6032 5954 5980 6006 6082 6197 6337 6557
844 6557 6834 7152 7524 7937 8381 8904 9479 10094 10757 11421 12148 12875 13642 14409 15115 15821 16488 17116 17751 18466 19204 19982 20790
841 20790 21598 22471 23383 24245 24974 25544 25875 25916 25771 25400 24790 23983 22990 21910 20789 19678 18567 17559 16738 16100 15648 15296
839A5296k73j52L4J03O3M8M7K0n9j78k18k97l38l39l40k57k57k98k18j83j83n9n9R0J71K04
837A2368L36M62M61N80P13Q45R24J059J245J363J496J557J556J553J553J515J329J134R48
835C2997P32O52N74M42M32M33N13N93P05P06O10M25J90j02m12p04r78j217j447j635j748j749
833C0012j691j558j418j232j076q90o90n05l74k42q5nL8L9R8R9J39J38J11J10P6mq2q2q6q7
831B0753j39j40j35j34j22m1Q6K19L11M44O30Q16J006J192J345J531J710J790J828J828J740
829C6518J607J403J056O34K87k3j56k88k88k91k90k28j48j4j5Kj31l09m95o16q02j009j194
826C5210j281j361j319j319j367j234j060q73p42o09m73k86p8J09K95M28N90P22Q75J007J101
824B8335J101J087J048Q97Q18O91M51K10K4j89l75m63n96o57o58o09m77k95k16j19J4J70L03
$$ plain form
839 15296 15023 14871 14905 15008 15071 15119 15166 15186 15127 14949 14731 14434 14096 13757 13417 13160 12903 12605 12387 12204 12021 11962 11903 11993 12164 12368
837 12368 12704 13166 13627 14207 14920 15765 16689 17748 18993 20356 21852 23409 24965 26518 28071 29586 30915 32049 32997
835 32997 33729 34381 34955 35397 35829 36262 36775 37368 38073 38779 39389 39814 40004 39902 39490 38786 37808 36591 35144 33509 31761 30012
833 30012 28321 26763 25345 24113 23037 22147 21457 20952 20578 20336 20251 20246 20284 20323 20421 20520 20659 20797 20908 21018 21094 21090 21008 20926 20840 20753
831 20753 20614 20474 20339 20205 20083 20042 20128 20347 20658 21102 21732 22548 23554 24746 26091 27622 29332 31122 32950 34778 36518
829 36518 38125 39528 40584 41218 41505 41482 41326 41038 40750 40459 40169 39941 39793 39779 39764 39766 39635 39326 38831 38215 37413 36404 35210
826 35210 33929 32568 31249 29930 28563 27329 26269 25396 24654 24045 23572 23286 23208 23317 23612 24040 24630 25352 26227 27234 28335
824 28335 29436 30523 31571 32468 33286 33977 34428 34638 34662 34473 34098 33635 33039 32382 31724 31115 30638 30343 30127 30008 30022 30192 30495
822C0495M59N91O11O91P07O68N73M39K95J09j22k54l80m20m38n18n22m81m29m30m81m82m82
820C0199m81n18n17n98n97o45o45o82o82p06o65n21l89l45l06j74J3J68L54N17P03R86J225
818B5694J408J594J803J989K024K024K012J933J744J506J204Q58N96L56J00j92l52m32n82
816D5287p14q51r31j096j283j349j388j398j438j454j375j257j125r99r20q20q20p76o95n95
814B4003n15m14l34k65k66j94j94j72j71k17k16k42l21l48l48l98m78m74l93l54k74j14j15
812A7186m8m9L1J64L16M49M93O25P75R61J105J237J338J472J609J743J833J833J878J799J719
810C8469J586J367J234J128J049Q69O30L91R9j81m73q50j197j469j708j902k088k255k334
808C2365k344k265k098j912j731j491j295j109r32p47o33m47l54k73k06j26p4p4j41j40j70
$$ plain form
822 30495 30954 31545 32156 32847 33554 34222 34795 35234 35529 35638 35516 35262 34882 34462 34024 33506 32984 32503 32074 31644 31163 30681 30199
820 30199 29718 29200 28683 28085 27488 26843 26198 25516 24834 24128 23463 22942 22553 22208 21902 21728 21741 21909 22263 22780 23483 24469 25694
818 25694 27102 28696 30499 32488 34512 36536 38548 40481 42225 43731 44935 45793 46389 46745 46845 46653 46301 45869 45287
816 45287 44573 43722 42791 41695 40412 39063 37675 36277 34839 33385 32010 30753 29628 28629 27709 26889 26069 25293 24598 24003
814 24003 23488 23074 22740 22475 22209 22015 21821 21649 21478 21261 21045 20803 20482 20134 19786 19388 18910 18436 18043 17689 17415 17301 17186
812 17186 17138 17089 17120 17284 17600 18049 18542 19167 19942 20903 22008 23245 24583 26055 27664 29407 31240 33073 34951 36750 38469
810 38469 40055 41422 42656 43784 44833 45702 46332 46723 46822 46641 46168 45318 44121 42652 40944 39042 36954 34699 32365
808 32365 30021 27756 25658 23746 22015 20524 19229 18120 17188 16441 15808 15361 15007 14734 14528 14402 14328 14254 14113 13973 13803
806A3803k49k97k97l46l46l38l38l54k21j18j18p1RO6J45J80J81J80K61L66L67M46N26O13
804A4050O13O47P27P98R30R85R85J062J143J164J164J185J184J157J025Q76P43N37L51R0k02
802C1214m96q41j133j373j517j651j765j765j747j613j474j341j194j062r43q11o38n04m02
800H944k69k38k37k44j64j21j21n6j35k10k10j95j95j55j55j36j36q3lj2O8J20J21P3P2P3
798F396P3K2K2K2K1l6l6l2l1O8J48K23K23K90K89L61M94N67N67N31N30M73L94L86L87K52O6
795A2670j9r9j99l31m43n23o41o42o46o47o16o16n36m56l99l19k93k92j99j99j59j59j16j16
793D005r5j4Q6Q6J58J58K19K20K54K54K34J55L9m0j75k56k07k07l9R5J95K76L48K68J11p4
791F054j84k63l24l23l25l25k72j92j35n4k3N8N0J1N6R6J39J40P6P6Q0Q1J16J15P6lJJN0N0
$$ plain form
806 13803 13554 13257 12960 12614 12268 11930 11592 11238 11017 10899 10781 10710 10719 10785 10930 11110 11291 11471 11732 12098 12465 12911 13437 14050
804 14050 14663 15310 16037 16835 17765 18750 19735 20797 21940 23104 24268 25453 26637 27794 28819 29695 30438 30975 31326 31416 31214
802 31214 30718 29877 28744 27371 25854 24203 22438 20673 18926 17313 15839 14498 13304 12242 11299 10488 9850 9346 8944
800 8944 8675 8437 8200 7956 7792 7671 7550 7494 7359 7149 6939 6744 6549 6394 6239 6103 5967 5884 5881 5869 5937 6057 6178 6251 6323 6396
798 6396 6469 6491 6513 6535 6556 6520 6484 6452 6421 6489 6637 6860 7083 7373 7662 8023 8517 9084 9651 10182 10712 11185 11579 11965 12352 12604 12670
795 12670 12651 12552 12353 12022 11579 11056 10415 9773 9127 8480 7864 7248 6712 6256 5857 5538 5245 4953 4754 4555 4396 4237 4121 4005
793 4005 3910 3896 3982 4068 4226 4384 4603 4823 5077 5331 5565 5720 5759 5719 5544 5288 5081 4874 4835 4930 5125 5401 5749 6017 6128 6054
791 6054 5870 5607 5283 4960 4635 4310 4038 3846 3711 3657 3634 3692 3742 3753 3809 3905 4044 4184 4260 4336 4416 4497 4613 4728 4804 4801 4802 4803 4853 4903
788D903N1N0P1P1J17J96K21J81J86K25K55K56K57K58K69K68L08K29J13L3pq7j33k14k97l37
785G443l32l32l18k38k70l50l45k65k07k08k02k03o4o5k0j9J5R5K23K24J79J80J00K1q5j65
783D792k14k13j95j15K1J01J48J48J23M4n0j83l12l13l62l62l13k34j86j86j14j14j31j31
781A649q2lK9K8PM6P2qq0q0k1k1M5M5K5K5j5j5j2j2j2j1llllK1K0K1K0M0L9L4L5Q2KK4O5P8
777B068P9Q2Q1Q2Q1Q1Q2J56J56J55J56K06K06K06K05K95K95K95K95K53K52K53K52J86J86J37
774F781N8KKn6j36k21l02l28l27k96k95l08l48k63j84j65k06k42k01j33j34j17j16j17j17
772B231r3r4%jm1m2m2m2r6r7l0l0p9p9p9p9J2J1n5n5o6o6K6K7K0K1K7n2p4l4%l9k3k2k6k5
769I14L7L6L7L6k0k0k0k0nonnonnnLLMLl3l3l3l3qqpqJ27J26O0N9K5K5K7K8J12J52K04K85
$$ plain form
788 4903 4954 5004 5075 5146 5263 5459 5680 5861 6047 6272 6527 6783 7040 7298 7567 7835 8143 8372 8485 8518 8511 8424 8291 8077 7780 7443
785 7443 7111 6779 6461 6223 5953 5603 5258 4993 4786 4578 4376 4173 4109 4044 4024 4005 4020 4115 4338 4562 4741 4921 5021 5042 4957 4792
783 4792 4578 4365 4170 4055 4076 4177 4325 4473 4596 4640 4590 4407 4095 3782 3420 3058 2745 2511 2325 2139 2025 1911 1780 1649
781 1649 1567 1564 1593 1621 1628 1674 1746 1738 1658 1578 1557 1536 1581 1626 1651 1676 1661 1646 1634 1622 1610 1599 1596 1593 1590 1587 1608 1628 1649 1669 1709 1748 1782 1817 1899 1901 1925 1990 2068
777 2068 2147 2229 2310 2392 2473 2554 2636 2792 2948 3103 3259 3465 3671 3877 4082 4377 4672 4967 5262 5515 5767 6020 6272 6458 6644 6781
774 6781 6839 6841 6843 6787 6651 6430 6128 5800 5473 5177 4882 4574 4226 3963 3779 3614 3408 3166 2965 2832 2698 2581 2465 2348 2231
772 2231 2138 2044 2044 2043 2002 1960 1918 1876 1780 1683 1653 1623 1544 1465 1386 1307 1319 1330 1275 1220 1154 1088 1114 1141 1161 1182 1209 1157 1083 1049 1049 1010 987 965 939 914
769 914 951 987 1024 1060 1040 1020 1000 980 975 969 964 959 953 948 943 938 941 944 948 951 918 885 852 819 811 803 796 788 915 1041 1101 1160 1185 1210 1237 1265 1377 1529 1733 2018
765B018L47L47L30K90K68J88M0l9j53k85l10l09k80k80k31j91j64q4l8p8o0o0o3o2n2n1n2
762I86n2ONNNj6j6j6j6J0J0J0J0K9K8l8l8J1J1N1N1j1j1n0n1klkkK2K2K2K3L6L6l0l0MLML
758A019P9P8P9P8N0N0Jl9r4j73j54j14j05j06l0M9J6k4LMj0rj0rL4L4L3L4J%J%rrj0rk4k4
755F81k3k4l6l6l6l6K8K9j1j1j1j0J05J05Q4J6j2j2QPl2l2l1l1l1l1N3N4j3j3j7j8j7j8k1
752F07k2k2k1K5K6K5K6K9K8l7l8m4m4lmk3k3J7J7M1M1M1M1Q1Q0Q1Q1J%r3r3j08j09o9o8m1
748D26m1K6K6l1l2QRJ4J5J4J5m0l9l5l6J7Q3O3K4M5k2k7k7j7j7M9N0J9K0J9J9j5j6j6j6k9
745E05k8k8k9o2o2NML7L7k9l0j0j0L0L0k0j9K1K1NNNNJ2J2J1J2q7q7n8QK4K3K8K7ONONj1j1
741C08j1j1k9k9k9k9L4L4L4L4K4K4K4K4l0l1k7k8K9P0K7n2j0L0J3o7q0jM3M2N6N6N6N6m6m7
$$ plain form
765 2018 2365 2712 3042 3332 3600 3788 3828 3789 3636 3351 3041 2732 2452 2172 1941 1750 1586 1502 1464 1386 1326 1266 1203 1141 1089 1038 986
762 986 934 940 945 950 955 939 923 907 891 901 911 921 931 960 988 950 912 923 934 985 1036 1025 1014 964 913 911 908 906 904 926 948 970 993 1029 1065 1035 1005 1009 1012 1016 1019
758 1019 1098 1176 1255 1333 1383 1433 1434 1395 1301 1128 974 860 755 649 619 668 684 660 663 667 657 648 638 629 663 697 730 764 765 765 766 766 757 748 738 729 705 681
755 681 658 634 598 562 526 490 518 547 536 525 514 504 609 714 798 814 802 790 798 805 773 741 710 679 648 617 670 724 711 698 681 663 646 628 607
752 607 585 563 542 567 593 618 644 673 701 664 626 582 538 535 531 508 485 502 519 560 601 642 683 764 844 925 1006 1007 1007 914 821 713 604 535 467 426
748 426 385 411 437 406 374 382 391 405 420 434 449 409 370 335 299 316 399 462 486 531 509 482 455 438 421 470 520 539 559 578 597 582 566 550 534 505
745 505 477 449 420 358 296 301 305 342 379 350 320 310 300 330 360 340 321 342 363 368 373 378 383 395 407 418 430 343 256 198 206 230 253 281 308 314 319 325 330 319 308
741 308 297 286 257 228 199 170 204 238 272 306 330 354 378 402 372 341 314 286 315 385 412 360 350 380 393 326 246 245 288 330 386 442 498 554 508 461
738D61m6m6J7J6k3k3p5p4rqJ5J5N4N5K2K1m5m5k6k5M0M1mllmk2k2k3k2J6J7J7J7J7J6J7J7
734C43m0m1m0m0N6N6N1N1oq5m1m0J1J1J1J1OOOOj7j8j7j7j5j5j4j5L1L1R2R3Mp6l1l1RRRJ0
730C14M6M6POK9K9o4o4n2n2J5J5j7j7J0k9p7KK2K2J2J2k8k8nnonLKKLJ0J1J0J0K8K7m0l9j8
726A47j9K2K2N8N9J8J8j3j4N3N3n2n2J5J5L1L2l5l4n3n2j2j3lmlmK2K2K2K3L1L2L1L2j8j8
723C59j9j8k5k6k5k5K4K5K4K5K0K0K0K0k7k7k8k7J0Rk9o9o5J6QQj0j1p2p2KQ2R9R8Kp8p7K
719A43J3J3J7J8K0K1K0K0OOk1J9M4l5j0K9KKNNj4j4j4j3mmmmj0j0rj0K0K0K0K0J1J0J1J1l3
715C17l2l3l2mlmlO2O2j7j8j1j1n0n1M8M8QQRQM8M8m7m6m7m7J6J6J6J6k1k1k1k1NNNNJ5J5
711B40J5J5l9m0l9m0L1L0L1L0j8j9j8j8rrL0L1K5K6n5n5N0N1l0l0J8J7N7N8poppj3j4j4j4
$$ plain form
738 461 415 369 386 402 379 356 281 207 198 190 205 220 274 329 351 372 327 282 256 231 271 312 308 305 302 298 276 254 231 209 225 242 259 276 293 309 326 343
734 343 303 262 222 182 238 294 345 396 390 305 264 224 235 246 257 268 274 280 286 292 275 257 240 223 208 193 179 164 195 226 318 411 415 339 308 277 286 295 304 314
730 314 360 406 413 419 448 477 413 349 297 245 260 275 258 241 251 222 145 147 169 191 203 215 187 159 154 149 143 138 141 143 145 148 158 169 179 189 217 244 204 165 147
726 147 128 150 172 230 289 307 325 312 298 351 404 352 300 315 330 361 393 358 324 271 219 207 194 191 187 184 180 202 224 246 269 300 332 363 395 377 359
723 359 340 322 297 271 246 221 245 270 294 319 339 359 379 399 372 345 317 290 300 309 280 211 146 162 170 178 168 157 85 13 15 97 196 294 296 218 141 143
719 143 156 169 186 204 224 245 265 285 291 297 276 295 339 304 294 323 325 327 332 337 323 309 295 282 278 274 270 266 256 246 237 227 247 267 287 307 318 328 339 350 317
715 317 285 252 220 216 213 209 206 268 330 313 295 284 273 223 172 220 268 276 284 293 301 349 397 350 304 257 210 226 242 258 274 253 232 211 190 195 200 205 210 225 240
711 240 255 270 231 191 152 112 143 173 204 234 216 197 179 161 152 143 173 204 229 255 200 145 195 246 216 186 204 221 278 336 329 323 316 309 296 282 268 254
708B54L4L3m6m6K9K8O9O9MNNMJ5J5J6J5rqqqJ5J5J5J5L8L9M3M3R4J73J33J33J59K39K25K25
704B074J44J1j08j89k73k74j98j99j28j29q9q9l0l0l0l0qrqqqqqqm2m2m1m2M2M1M2M1J6J5
701C98J6J5j7j7n1n2p2QR2R1J4o6k1k1KLKKk1k2k1k1llllm8m8L1L2N1N2N1N1%%%jN1N2N1N1
697F05N6N6N6N6O3O4J43J43K17K17K49K49K19Q6q0k66k92k91j71j71j62j63j27m8l5l5j09
695E29j10j2j2j2j2k7k8J2J2K6K5mq4j12l1N1N1J0RRRJ4J5k6k6OPM4Q4J5p9m6pM3M4op3q0
691B28j5J1J1mmlmk3k3k3k3L6L7L6L6k0k1k0k0QQRQK5K5K5K5J9J9J9J9l4l3l3l4kkO5O5l0
687C63l0l1l0l2l3O0O1K0K1k0j9nmrqM6k0qL2P3L2l5l6j5j6j5j6j0j0j1j0K0K0J9K0j5j5j6
684C18j5K8K8K8K8lmllK7K6K7K7k4k5k1k2nL5J4n3n4J3L7L8P3P3j9k0k5k6J5J5J1J1k8k9l5
$$ plain form
708 254 288 321 275 229 258 286 355 424 428 433 438 442 457 472 488 503 494 486 478 470 485 500 515 530 568 607 650 693 787 960 1093 1226 1385 1624 1849 2074
704 2074 2218 2229 2121 1932 1659 1385 1187 988 860 731 642 553 523 493 463 433 425 416 408 400 392 384 376 368 326 284 243 201 243 284 326 367 383 398
701 398 414 429 412 395 344 292 220 228 320 411 425 359 338 317 319 322 324 326 305 283 262 241 238 235 232 229 181 133 164 196 247 299 350 401 401 401 401 400 451 503 554 605
697 605 661 717 773 829 892 956 1099 1242 1459 1676 1925 2174 2393 2479 2399 2133 1841 1550 1379 1208 1046 883 756 708 673 638 529
695 529 419 407 395 383 371 344 316 328 340 366 391 387 303 191 160 211 262 272 281 290 299 313 328 302 276 282 289 333 417 432 353 307 300 343 387 381 308 228
691 228 213 224 235 231 227 224 220 197 174 151 128 164 201 237 273 253 232 212 192 200 208 217 225 250 275 300 325 344 363 382 401 367 334 301 267 265 263 328 393 363
687 363 333 302 272 240 207 267 328 348 369 349 330 325 321 312 304 350 330 322 354 427 459 424 388 373 357 342 326 316 306 295 285 305 325 344 364 349 334 318
684 318 303 331 359 387 415 412 408 405 402 429 455 482 509 485 460 439 417 412 447 461 408 354 367 404 442 515 588 569 549 524 498 513 528 539 550 522 493 458
680D58l6NMl5l5MNK1K2j9j8j0j0j0j0K8K9K9K8J2J2J2J2K1K1K2K1l6l5l5l5J8J8J8J9nnnn
677D95L5L5L5L6kjjkJ1J1J2J1N4N4N5N4j0rj0j0N8N9J8J9J7J7m9n0j4j5j4j5m6m5m6m5k9k9
673F44k9k9J7J8J8J7m8m9M4M5m5m5mnP7P6L7lj0N6N1j6l5p4r4k7N8N8N8N8J9m8j0j0J2J2J3
669H07J2j1j1j1j1j2j2j1j2P6P7mlK1K0K1K1j0j0j0j0K5K5j5j4O2O3j7j7k3k3k3k3k7k8k8
666H54k8K6K5K3K2K5j6j8K2Pl4rqk9k8K6O6O4K4k9k8J5N6N8J8l2RL6P7P1NQPO0J00P8P7N3
662A653N2km2j2K9J8N9Q1M1j4j4o7o6m9qOPk8k8j4K5K6j5j4j5o8j09r7mM3Ml5l5l9m0l7p7
659A115p7l6JJMMQRQRrqj1j0Rl0qqj1j0j1j0jjjjN0N0J0J0p4p3OOopL3L3NNNNkkklj6j5j6
654I27j6j6j5j6j6k1k1k1k1l0l1k9k8j3K8M6k0k7L9llJ%J%J%J%KLKKJ0J0l0l0n4n4N2R2Q2
$$ plain form
680 458 422 427 431 396 361 365 370 391 413 394 376 366 356 346 336 364 393 422 450 462 474 486 498 519 540 562 583 547 512 477 442 460 478 496 515 510 505 500 495
677 495 530 565 600 636 634 633 632 630 641 652 664 675 729 783 838 892 882 873 863 853 911 970 988 1007 1024 1041 992 942 928 913 899 884 838 793 747 702 673 644
673 644 615 586 603 621 639 656 608 559 603 648 603 558 554 549 626 702 739 736 726 782 833 817 782 708 614 587 645 703 761 819 838 790 780 770 782 794 807
669 807 819 808 797 786 775 763 751 740 728 804 881 877 874 895 915 936 957 947 937 927 917 942 967 952 938 1000 1063 1046 1029 1006 983 960 937 910 882 854
666 854 826 852 877 900 922 947 931 913 935 942 908 899 891 862 834 860 926 990 1014 985 957 972 1028 1086 1104 1072 1081 1117 1194 1265 1270 1278 1285 1345 1445 1523 1600 1653
662 1653 1705 1703 1661 1649 1678 1696 1755 1836 1877 1863 1849 1782 1716 1667 1659 1665 1672 1644 1616 1602 1627 1653 1638 1624 1609 1541 1432 1335 1331 1374 1378 1343 1308 1269 1229 1192 1115
659 1115 1038 1002 1003 1004 1008 1012 1020 1029 1037 1046 1037 1029 1018 1008 1017 987 979 971 960 950 939 929 928 927 926 925 975 1025 1035 1045 971 898 904 910 904 897 930 963 968 973 978 983 981 979 977 974 958 943 927
654 927 911 895 880 864 848 827 806 785 764 734 703 674 646 633 661 707 687 660 699 696 693 694 694 695 695 696 696 697 697 699 702 704 706 716 726 696 666 612 558 610 702 784
650G84J5k1k2J0N0K5m1l4l4l8l8ONNNj1j2j1j1rrrrJ6J6J2J2P2Nn9k0J1J2k6k7j2j3j3j3L
647E72LLLO7O7j3j3k0j9o0n9K3K3O0O0j2n3pQ6R3K7o3o3J3J3o8o7m8m8L2L1J0Rl1l1k4k4L0
643E02O9P2Nl5l5K2K2K1K2ppopoonoM4M4M4M4j3j4j4j4l6l7l7l7M6M6M7M6L4L4opKKp8p8q
639F69qL2L2kkjkpopoNNM6M5M2M2Mo3r7l0O0O1J6J5J5J5pppok6k6k6k6O7O7K5K5k1o1MP1K8
635I47K8L3L2J5J5k5k5o4o4J8J8M8Q8K6m1m3lJ0J0M3M2l7l7l0k9J0J0L3L3L2L3j6j7j6j6O
631A067PPPooook9k9k9k9onnoJ2J1J1J2popopoponnppJ9k1m0K7L8k9k5M2M3M3M8M7j4j5j4
627A045j5j4j4j5j4l6l6l0l0J0J03Q4J8j3p9q4j7NMRRJ3J3J2J3L1L0j0rN5N5k5k5noonl2l2
623I57l2l1MNNNNMNNmnm4m4n3n3K7K6j5j6K5K4M3M4LLQQl3l2J3J3J3J4m5m4M9M9JJl9l9k9
$$ plain form
650 784 799 778 756 766 816 841 800 766 732 694 656 662 667 672 677 666 654 643 632 623 614 605 596 612 628 640 652 724 729 670 650 661 673 647 620 608 595 582 569 572
647 572 575 578 581 648 715 702 689 669 650 590 531 554 577 637 697 685 632 625 711 804 831 768 705 718 731 663 596 548 500 532 563 573 582 551 520 496 472 502
643 502 571 643 648 613 578 600 622 643 665 658 651 645 638 632 626 621 615 659 703 747 791 778 764 750 736 700 663 626 589 635 681 728 774 808 842 836 829 831 833 755 677 669
639 669 661 693 725 723 721 720 718 711 705 698 692 697 702 748 793 835 877 881 818 721 691 751 812 828 843 858 873 866 859 852 846 820 794 768 742 809 876 901 926 905 844 848 919 947
635 947 975 1008 1040 1055 1070 1045 1020 956 892 910 928 976 1064 1090 1049 1006 1003 1013 1023 1066 1108 1071 1034 1004 975 985 995 1028 1061 1093 1126 1110 1093 1077 1061 1067
631 1067 1074 1081 1088 1082 1076 1070 1064 1035 1006 977 948 942 937 932 926 938 949 960 972 965 959 952 946 939 933 926 920 915 910 903 896 915 894 854 881 919 890 865 907 950 993 1041 1088 1074 1059 1045
627 1045 1030 1016 1002 987 973 937 901 871 841 851 954 1038 1056 1043 964 880 863 868 872 881 890 903 916 928 941 972 1002 992 983 1038 1093 1068 1043 1038 1032 1026 1021 989 957
623 957 925 894 898 903 908 913 918 922 927 932 928 923 879 835 782 729 756 782 767 751 776 800 843 887 890 893 901 909 876 844 857 870 883 897 852 808 857 906 907 908 869 830 801
619H01k9L8L7m8m7qqrrN7N7ppm8m7qrL1L1K5K4j5j5M6M6K7n2m0%M0L9J3J2k7k7j4j5j4j4O
616H13POOkl%jj3K6N2k9p4l4NOk0k0k0k0MLm1L8K4K3K9K8kklkj5j4j5j5jjL7P8R6J6l0l0q8
611H02q8k2k2J8J8J8J8nooom3m3K3K3J4J5J4J4K9K8j2j1J1J2P8P8M0M0j%RQn8n7p5p5qqj7
608G47j7K2K3N0N0J1J0QPQQj8j8j8j8J%JJJ4J5J3J2n4r5n0L0L3L3kkK2K3m0l9l1M9M8l1pq
604G91j2j3J1J1J1J0K0J9K0J9J0RJ0RQPQPm0m0m0m0K2K2O2O2q1q1j5j4jjjkN9N9N9N8l6l7
600I29PQ7L9m1l0l1p2p2K0K1N6N6j1j1K5K4j4n4q0JM6M6RQRQqrrrjjjjRRRRMMMLooopnolm
595I44N5R5L6n8p2nM2L%M1J5J5K2K2K2K1jjkjj1j2j1j2k1k1k1k2J5J6J5J5qqqqJ1J2J1J1j9
591A117j8j6j7JM1N6j1jjnnLKLLqpqpK5K5K8K8JM1N6j1l5l5l9m0MMMMMLLLLMLLj0j0n0J7K5
$$ plain form
619 801 772 810 847 799 752 744 736 727 718 775 832 825 818 770 723 715 706 737 768 793 817 802 787 833 879 906 854 814 814 854 893 906 918 891 864 850 835 821 807 813
616 813 820 826 832 830 827 827 826 813 839 891 862 788 754 759 765 745 725 705 685 689 692 651 689 713 736 765 793 791 789 786 784 769 755 740 725 724 723 760 838 934 950 920 890 802
611 802 714 692 670 688 706 724 742 737 731 725 719 676 633 656 679 693 708 722 736 765 793 781 770 781 793 871 949 989 1029 1028 1028 1037 1045 987 930 855 780 772 764 747
608 747 730 752 775 825 875 886 896 904 911 919 927 909 891 873 855 856 856 857 858 872 887 900 912 858 763 713 743 776 809 807 805 827 850 810 771 740 789 837 806 799 791
604 791 779 766 777 788 799 809 829 848 868 887 897 906 916 925 933 940 948 955 915 875 835 795 817 839 901 963 882 801 786 772 771 770 769 767 826 885 944 1002 966 929
600 929 936 1023 1062 1021 991 960 888 816 836 857 913 969 958 947 972 996 982 928 848 849 895 941 950 958 967 975 967 958 949 940 939 938 937 936 945 954 963 972 976 980 984 987 981 975 969 962 957 951 948 944
595 944 999 1094 1130 1072 1000 995 1037 1040 1040 1081 1096 1111 1133 1155 1177 1198 1197 1196 1194 1193 1182 1170 1159 1147 1126 1105 1084 1062 1077 1093 1108 1123 1115 1107 1099 1091 1102 1114 1125 1136 1117
591 1117 1099 1083 1066 1067 1108 1164 1153 1152 1151 1146 1141 1144 1146 1149 1152 1144 1137 1129 1122 1147 1172 1200 1228 1229 1270 1326 1315 1280 1245 1206 1166 1170 1174 1178 1182 1186 1189 1192 1195 1198 1202 1205 1208 1198 1188 1138 1155 1180
587A180j5n5n4l1l0J0J0L7L8P7P7RRRRL5L5L4L5J1J1J1J2j8j8j8j8J3J4p9q0J6J7N6N6QRn8
583A364n8n3n3J3J4J3J3N3N3J2J1J2J1j6j6j6j6J8J7J8J8L1L0j0rp5p4qqPPPPK1K1K1K1j3
580A388j4j3j3J0J0J0J0J3J4J4J3k9l0k9l0J7J7J7J7%%%JRJ0RJ0L0L1L0L0j9k0M7M6ONNNM1
576A668M0k6k6j7j7K3K2j5j6N0N1J6J7N6N7LLMLK9K9L0K9O3O4O3O3O4O3O3O4J04J05J05J04
573B938J77J77J07J06O6jr7r6p3p2j13j12j56j56p6p7n1n1j4j4n1r1k6M0M6M6l0k9jjjjk3
570B290k2k3k2J2J3J2J3lkP7P7K7K6K9L0k1J9J14M7rqj3j3K2K2K2K2mlmlk0k0k0k0k9l0k9
566B556l0j9k0k0j9j5j5j2j3K3O2P7J1o3o3J3J3N1N1N0N1j5j6j6j6j5j6j6j5N4N4N4N5M8M9
563B858QRP8P9jjJ7J8J8J8M5M4M4M5l2l2l2l2k9k9k8k9ononl5l5l5l6q0q0q0q0l3l3M7M7j5
$$ plain form
587 1180 1165 1110 1056 1025 995 1005 1015 1052 1090 1167 1244 1253 1262 1271 1280 1315 1350 1384 1419 1430 1441 1452 1464 1446 1428 1410 1392 1405 1419 1340 1260 1276 1293 1349 1405 1413 1422 1364
583 1364 1306 1253 1200 1213 1227 1240 1253 1306 1359 1371 1382 1394 1405 1389 1373 1357 1341 1359 1376 1394 1412 1443 1473 1463 1454 1379 1305 1297 1289 1296 1303 1310 1317 1338 1359 1380 1401 1388
580 1388 1374 1361 1348 1358 1368 1378 1388 1401 1415 1429 1442 1413 1383 1354 1324 1341 1358 1375 1392 1392 1392 1392 1393 1402 1412 1421 1431 1461 1492 1522 1552 1533 1513 1560 1606 1612 1617 1622 1627 1668
576 1668 1708 1682 1656 1639 1622 1645 1667 1652 1636 1686 1737 1753 1770 1826 1883 1886 1889 1893 1896 1925 1954 1984 2013 2076 2140 2203 2266 2330 2393 2456 2520 2624 2729 2834 2938
573 2938 3115 3292 3399 3505 3571 3570 3473 3377 3304 3232 3119 3007 2851 2695 2619 2542 2491 2440 2426 2412 2361 2270 2244 2284 2330 2376 2346 2317 2316 2315 2314 2313 2290
570 2290 2268 2245 2223 2235 2248 2260 2273 2270 2268 2345 2422 2449 2475 2504 2534 2513 2532 2646 2693 2684 2676 2663 2650 2672 2694 2716 2738 2734 2731 2727 2724 2704 2684 2664 2644 2615 2585 2556
566 2556 2526 2507 2487 2467 2448 2433 2418 2406 2393 2416 2478 2555 2566 2503 2440 2453 2466 2517 2568 2618 2669 2654 2638 2622 2606 2591 2575 2559 2544 2598 2652 2706 2761 2809 2858
563 2858 2866 2875 2953 3032 3031 3030 3047 3065 3083 3101 3146 3190 3234 3279 3247 3215 3183 3151 3122 3093 3065 3036 3030 3025 3019 3014 2979 2944 2909 2873 2793 2713 2633 2553 2520 2487 2534 2581 2566
559B566j5j5j4j7j6k0k0ko9o8kPQJ4J4kL7N3j4m6m6n1n0K9K9O8O9J10J09k4k3JKM1M1J4J5
555B713J4J5k1k0N9N9j1j1k4o4p8j1k8o8n7n8n9o0llllJ4J4J4J4J3J4J4J4nnm4K2O4K4k8k9
552B388k1k2J9J8J9J9k2k1L7L8j5n4j4P9M6PPOMMK8K7K7K8MNMNM2M2KKo2o2J8J8K9L0j3j3
548B683L6mJ8J9l7l6l7l6K8K9K5K6j6n7J0N0j7j7j4j5KKMNm1jJ9J9m1jR4R4%l9j8j7M6M6M
544B815l5j3K7K5j6l4l4K9L0M7M8PQk2k3k2k2K6K7K8K9KM3N7j0j1j1j5j6L5L4L5L4M4M4O7
541C257K6l8l9K3K4J2k7mnL4L4L1L1M7PNM4K8j2j2K8K1j8j6K4L6L6L8L8jkJJM1Q2N6N7M2K
537C932K5K4N2N2j2j2rL1M9M8L0L0j0j0L6L6L5L6K4K3K3K3mnmnK6K5K6K5P5P4P4P5O0N9K5
534D982K4l1M9R6R7L0L0P1P0O3O3J11J91J63J63J01J02J04J05J97J98J64J64J65J64J47J48
$$ plain form
559 2566 2551 2536 2522 2505 2489 2469 2449 2447 2378 2310 2308 2315 2323 2337 2351 2349 2386 2439 2425 2379 2333 2282 2232 2261 2290 2358 2427 2537 2646 2622 2599 2600 2602 2643 2684 2698 2713
555 2713 2727 2742 2721 2701 2760 2819 2808 2797 2773 2709 2631 2620 2592 2524 2467 2409 2350 2290 2287 2284 2281 2278 2292 2306 2320 2334 2347 2361 2375 2389 2384 2379 2335 2357 2421 2445 2417 2388
552 2388 2367 2345 2364 2382 2401 2420 2398 2377 2414 2452 2437 2383 2369 2448 2494 2501 2508 2514 2518 2522 2550 2577 2604 2632 2636 2641 2645 2650 2692 2734 2736 2738 2676 2614 2632 2650 2679 2709 2696 2683
548 2683 2719 2715 2733 2752 2715 2679 2642 2606 2634 2663 2688 2714 2698 2641 2651 2701 2684 2667 2653 2638 2640 2642 2646 2651 2610 2609 2628 2647 2606 2605 2699 2793 2793 2754 2736 2719 2765 2811 2815
544 2815 2780 2767 2794 2819 2803 2769 2735 2764 2794 2841 2889 2896 2904 2882 2859 2837 2815 2841 2868 2896 2925 2927 2970 3027 3017 3006 2995 2980 2964 2999 3033 3068 3102 3146 3190 3257
541 3257 3283 3245 3206 3229 3253 3265 3238 3234 3229 3263 3297 3328 3359 3406 3413 3418 3462 3490 3478 3466 3494 3515 3497 3481 3505 3541 3577 3615 3653 3652 3650 3651 3652 3693 3775 3831 3888 3930 3932
537 3932 3957 3981 4033 4085 4073 4061 4052 4083 4132 4180 4210 4240 4230 4220 4256 4292 4327 4363 4387 4410 4433 4456 4452 4447 4443 4438 4464 4489 4515 4540 4615 4689 4763 4838 4898 4957 4982
534 4982 5006 4975 5024 5120 5217 5247 5277 5348 5418 5481 5544 5655 5846 6009 6172 6273 6375 6479 6584 6781 6979 7143 7307 7472 7636 7783 7931
531G931J47J47R3R4R3R3J40J39J35K14J95J94J33J33J23J23J24J23J30J29Q5J65J87J88K40
529A1498L21M23M24M33M33N17N97O85P65Q57R37J048J181J293J293J363J362J398J318J220
527B9366R80O45K46j46n46q53j092j267j399j388j388j293j160j045r65q16p36o73n94n53
525A5323m73l69k89l29l29j66j66k12j31r3r2q7q8NMJ24J24J00R9J40J40K43K42K83K83K93
523A4579K92K88L67M12M12N49O30O49P29P99Q79R03J036J121J201J279J279J306J385J394
521C1489J393J206R66O12K67j29n29q72j111j287j419j444j444j369j290j252j120j003r23
519B0741p88p09o19m86m36l56l21l21l21k41j67j66k07k07j67j66l7l6L0L0O2O2O1O2R4R4
517A5485J61J61K40K40J73J74J47J47J96K75K93K94K37K38K78L59L59L58L60M40M40M40M58
$$ plain form
531 7931 8078 8225 8318 8412 8505 8598 8738 8877 9012 9226 9421 9615 9748 9881 10004 10127 10251 10374 10504 10633 10718 10883 11070 11258 11498
529 11498 11819 12242 12666 13099 13532 14049 14646 15331 16096 16953 17890 18938 20119 21412 22705 24068 25430 26828 28146 29366
527 29366 30346 30991 31237 31091 30545 29692 28600 27333 25934 24546 23158 21865 20705 19660 18695 17879 17143 16470 15876 15323
525 15323 14850 14481 14192 13863 13534 13368 13202 12990 12859 12766 12674 12587 12499 12504 12508 12632 12756 12856 12955 13095 13235 13478 13720 14003 14286 14579
523 14579 14871 15159 15526 15938 16350 16899 17529 18178 18907 19706 20585 21488 22524 23645 24846 26125 27404 28710 30095 31489
521 31489 32882 34088 35054 35666 35933 35804 35275 34403 33292 32005 30586 29142 27698 26329 25039 23787 22667 21664 20741
519 20741 19953 19244 18625 18139 17703 17347 17026 16705 16384 16143 15976 15810 15603 15396 15229 15063 15026 14990 15020 15050 15112 15174 15235 15297 15391 15485
517 15485 15646 15807 16047 16287 16460 16634 16781 16928 17124 17399 17692 17986 18223 18461 18739 19098 19457 19815 20175 20615 21055 21495 21953
514B1953N38N60N60N20N21N68O49P11P11P16P15Q28Q27R20R20J000J000J000J000J069J069
512C8355J179J259J326J459J568J567J598J678J769J850J962K095K180K180K320K454K565
511F9364K644K726K806K886K886K940K940L034L033L057L056K982K982K896K762K672K591
509A18257K509K322K173K040J852J561J231Q85M62Rm43p35j027j213j261j261j104r17o49
507A24691l57q4K08N47R46J361J865K381K886L378L936M459M910N221N353N397N157M726M008
506A80989L080K096J166L95q8k73l15j29K97P49J109J294J228P76m4j187k430l787m987n865
504A74074o303o437o255n910n345m626l916l252k553j836j132n73p4K71N74Q66R71R71R55
502A30470Q76Q15Q16R07J146J444J843K268K773L266L877M618N337O061O780P519Q238Q853
$$ plain form
514 21953 22491 23051 23611 24131 24652 25220 25869 26580 27291 28007 28722 29550 30377 31297 32217 33217 34217 35217 36217 37286 38355
512 38355 39534 40793 42119 43578 45146 46713 48311 49989 51758 53608 55570 57665 59845 62025 64345 66799 69364
511 69364 72008 74734 77540 80426 83312 86252 89192 92226 95259 98316 101372 104354 107336 110232 112994 115666 118257
509 118257 120766 123088 125261 127301 129153 130714 131945 132830 133292 133301 132858 132123 131096 129883 128622 127361 126257 125340 124691
507 124691 124334 124250 124458 125005 125951 127312 129177 131558 134444 137822 141758 146217 151127 156348 161701 167098 172255 176981 180989
506 180989 184069 186165 187331 187726 187638 187365 187050 186921 187218 187967 189076 190370 191598 192374 192330 191143 188713 184926 179939 174074
504 174074 167771 161334 155079 149169 143824 139198 135282 132030 129477 127641 126509 125936 125862 126133 126707 127573 128544 129515 130470
502 130470 131346 132161 132977 133884 135030 136474 138317 140585 143358 146624 150501 155119 160456 166517 173297 180816 189054 197907
500A97907R305R579R447Q837P801O382M599K638P50j004k467l644m628n388n841n996n810
499B22467n420m861m220l501k852k346k126k260k748l626m796n994p138q017q542q835q789
497A36396q444p939p273o641n975n301m689m142l583l092k692k333j987j655j309r91o99l63
495F7288p1J71M64P50J042J371J771K149K548L004L403L838M237M676N022N230N229M987M429
494A21538L486K129M36j453l318m940o123o841p103o971o696o244n692n134m613m056l520
492E4885l067k669k376k097j858j707j627j497j418j381j301j301j301j181j180j088j088
490B6748r41r41q75q75p31p31o65o64n80n80m86m87m50m51l30l31k94k94k54k54k28k28j62
488A4916j61j44j44j84j84j23j24j23j23q0p9l9m0l3l3O0O0Q5Q5J8J9j04j03j97j97j65j65
$$ plain form
500 197907 207212 216791 226238 235075 242876 249258 253857 256495 257245 256241 253774 250130 245502 240114 234273 228277 222467
499 222467 217047 212186 207966 204465 201613 199267 197141 194881 192133 188507 183711 177717 170579 162562 154020 145185 136396
497 136396 127952 120013 112740 106099 100124 94823 90134 85992 82409 79317 76625 74292 72305 70650 69341 68350 67651 67288
495 67288 67217 67388 67852 68602 69644 71015 72786 74935 77483 80487 83890 87728 91965 96641 101663 106893 112122 117109 121538
494 121538 125024 127153 127589 126136 122818 117878 111755 104914 97811 90840 84144 77900 72208 67074 62461 58405 54885
492 54885 51818 49149 46773 44676 42818 41111 39484 37987 36569 35188 33887 32586 31285 30104 28924 27836 26748
490 26748 25807 24866 23991 23116 22385 21654 20989 20325 19745 19165 18679 18192 17742 17291 16961 16630 16336 16042 15788 15534 15306 15078 14916
488 14916 14755 14611 14467 14283 14099 13976 13852 13729 13606 13526 13447 13408 13368 13335 13302 13362 13422 13507 13592 13610 13629 13525 13422 13225 13028 12863 12698
486A2698j60j60j42o2j07j07j16j16n0m9J4J5J5J4oom6m6N2N3L1m9j00r9J5J5kjjjj3j3j3
482A1457j3L1L1R8R7O7O8O8O7Q6Q6N0N1O4J43J06k6L1L1O6J46J18L8M8M8N4N4J47J47J80J79
480A3818J80J79J79J79K45K46K82K82L21L22L48L48L49L48L74L75L75L74N04N03O24O23O85
477B2063O86P83P84Q92R72R80J059J203J283J352J485J597J783J929K115K324K564K846L191
476E1891L574M026M498M950N389N842O161O454O630O497O049N171L880K205K14j781l581n043
474A13026n974o426o576o496o104n598n131m626m124l671l279k880k504k212j971j678j439
472D2337j306j176j043q84p50o54n20m40l61k35j54j02k1Q1J60K14K94M50N30N83O62P30Q09
470C9204R43J075J232J364J531J664J829K068K284K523K776L175L515L753M032M324M657N108
$$ plain form
486 12698 12538 12378 12236 12174 12067 11960 11844 11728 11678 11629 11643 11658 11673 11687 11681 11675 11629 11583 11635 11688 11719 11670 11570 11471 11486 11501 11499 11498 11497 11496 11483 11470 11457
482 11457 11444 11475 11506 11604 11701 11768 11836 11904 11971 12057 12143 12193 12244 12308 12451 12557 12531 12562 12593 12659 12805 12923 12961 13009 13057 13111 13165 13312 13459 13639 13818
480 13818 13998 14177 14356 14535 14780 15026 15308 15590 15911 16233 16581 16929 17278 17626 18000 18375 18750 19124 19628 20131 20755 21378 22063
477 22063 22749 23532 24316 25208 26180 27160 28219 29422 30705 32057 33542 35139 36922 38851 40966 43290 45854 48700 51891
476 51891 55465 59491 63989 68939 74328 80170 86331 92785 99415 105912 111961 117132 121012 123217 123431 121650 118069 113026
474 113026 107052 100626 94050 87554 81450 75852 70721 66095 61971 58300 55021 52141 49637 47425 45454 43776 42337
472 42337 41031 39855 38812 37928 37178 36524 36004 35564 35203 34968 34814 34712 34691 34772 34932 35146 35440 35890 36420 37003 37665 38395 39204
470 39204 40147 41222 42454 43818 45349 47013 48842 50910 53194 55717 58493 61668 65183 68936 72968 77292 81949 87057
468H7057N581N874N976N897N588M869L716K147L11j630l432n001o080o638o782o701o386n880
467G8486n322m816m313l807l312k859k484k191j922j630j433j246j001q68p74o42n35m02l46
465C8583k13j33n3J1R1J61K01J73J73K15K95M33N13N66O46O68P47P95P95Q77J010J081J161
463D8796J275J355J431J564J654J734J817J950K109K241K378K565K727K966L229L469L710
461H6970L949M248M540M884N282N711O110O557P115P674Q286Q934R705J0587J1517J2593J3736
460B18398J5019J6482J8185J9967K1934K4143K6552K9080L1633L4000L6051L7461L7920L6989
458F03814L4233K9472K2757J4271M551n424j4812k2819k9099l3489l6055l7092l6976l5885
457D57447l4137l1982k9582k7108k4648k2281k0053j8005j6150j4421j2873j1570j0389r299
$$ plain form
468 87057 92638 98512 104488 110385 115973 120842 124558 126705 127016 125386 121954 116953 110873 104235 97453 90752 84366 78486
467 78486 73164 68348 64035 60228 56916 54057 51573 49382 47460 45830 44397 43151 42150 41282 40508 39866 39331 38929 38583
465 38583 38370 38237 38184 38195 38286 38447 38648 38821 38994 39209 39504 39937 40450 41016 41662 42330 43077 43872 44667 45544 46554 47635 48796
463 48796 50071 51426 52857 54421 56075 57809 59626 61576 63685 65926 68304 70869 73596 76562 79791 83260 86970
461 86970 90919 95167 99707 104591 109873 115584 121694 128251 135366 143040 151326 160260 169965 180552 192069 204662 218398
460 218398 233417 249899 268084 288051 309985 334128 360680 389760 421393 455393 491444 528905 566825 603814
458 603814 638047 667519 690276 704547 709098 703674 688862 666043 636944 603455 567400 530308 493332 457447
457 457447 423310 391328 361746 334638 309990 287709 267656 249651 233501 219080 206207 194637 184248 174949
456A74949q308p483o782o064n343m732m223l664l079k574k128j676j340j047p78n92m67l87
454A14282l84m63n87p20p78p78p34o55n00k08Q8L81Q06J206J634K033K489L047L584M196M831
452A32770N336N882O387O806P311P879Q278Q437Q436Q085P315O261M906L369J853M60q44j903
450B27024k676l363l975m516m968n360n760o050o183o183o050n754n355m834m221l552k833
449A45391k073j300n25J94R11J683K438L156L817M483N121N680O069O256O341O262N823N105
447B04832M162K965J456k73k101l778n263o407p060p247o997o492n820n049m191l260k307
445A47170j429o27L7P12J377J896K348K699K939L045K965K729K437K084J685J368J075Q26
444A75336M80P8l21q50j462k109k721l283l789m110m243m293m159l963l616l254k802k330
$$ plain form
456 174949 166641 159158 152376 146312 140969 136237 132014 128350 125271 122697 120569 118893 117553 116506 115728 115136 114669 114282
454 114282 113898 113435 112848 112128 111350 110572 109838 109183 108683 108475 108563 108944 109750 110956 112590 114623 117112 120159 123743 127939 132770
452 132770 138106 143988 150375 157181 164492 172371 180649 189086 197522 205607 212922 219183 224089 227458 229311 229771 228927 227024
450 227024 224348 220985 217010 212494 207526 202166 196406 190356 184173 177990 171940 166186 160831 155997 151776 148224 145391
449 145391 143318 142018 141493 141687 142598 144281 146719 149875 153692 158175 163296 168976 175045 181301 187642 193904 199727 204832
447 204832 208994 211959 213415 213142 211041 207263 202000 195593 188533 181286 174289 167797 161977 156928 152737 149477 147170
445 147170 145741 145114 145151 145863 147240 149136 151484 154183 157122 160167 163132 165861 168298 170382 172067 173435 174510 175336
444 175336 175816 175894 175573 174723 173261 171152 168431 165148 161359 157249 153006 148713 144554 140591 136975 133721 130919 128589
442A28589j825j267p08j48M63J104J717K378L096L791M456M982N380N686N766N630N231M556
440A78877L572K309O87r96k724m267n464o245o591o494o042n313m489l665k734j789r65j89
438A27478N29J244J909K510L016L438L731L896L976M046M085M021L781L361K695J856R79P7
437A76628q53j741k406k978l483m012m464m849n249n514n646n741n700n583n396n113m768
435A03132m434m089l770l424l077k731k438k146j820j528j261j076q89p04n17l84k18q5P8
433F8619K11L30N17P59R99J264J611J956K355K769L274L962M840N897P254Q800J0423J1597
432A37437J1637R900O363K105j326k659j942J91K664M852O581P798Q835J0204J2359J5296
430B30295J8674K2232K5449K8100L0306L3389L9853N2933P5355J08795J52813K01178K31047
$$ plain form
442 128589 126764 125497 124789 124641 125104 126208 127925 130303 133399 137190 141646 146628 152008 157694 163460 169090 174321 178877
440 178877 182449 184758 185445 184449 181725 177458 171994 165749 159158 152664 146622 141309 136820 133155 130421 128632 127667 127478
438 127478 128007 129251 131160 133670 136686 140124 143855 147751 151727 155773 159858 163879 167660 171021 173716 175572 176551 176628
437 176628 175775 174034 171628 168650 165167 161155 156691 151842 146593 141079 135433 129692 123992 118409 113013 107900 103132
435 103132 98698 94609 90839 87415 84338 81607 79169 77023 75203 73675 72414 71338 70449 69745 69228 68844 68626 68541 68619
433 68619 68830 69160 69677 70436 71435 72699 74310 76266 78621 81390 84664 88626 93466 99363 106617 115417 125840 137437
432 137437 149074 158974 165337 167442 166116 163457 161515 161706 164370 169222 175803 183601 192436 202640 214999 230295
430 230295 248969 271201 296650 324750 355056 388445 428298 481231 556586 665381 818194 1019372 1250419
429A250419K02823R4918o5401k08363k63665k35978j80598j30621r3259o6794m8535l6061
428B18885k7603k1672j7317j3886j1243r142p446n983m597l453k852k932l557m168m387m093
426G4554l589l242k994k807k554k262k076j944j833j754j612j426j134r47q46p66p19o39o16
425D0794n37m70l37k21q8k2N8J32K11J77J77J77K57L66M46M56M56M61M61N87N87O75O76O56
422D6135N76N40N39L79J39m1m0j78l11m67n99n68n68n71n72n35m56m07m08k60k60j59q0J6
420D1844J6J53K33K65L45M34N67P32Q11R85J170J336J468J622J808J994K234K444K576K554
418F5591K473K444K630K915L261L663M115M556N008N423N770O145O544O863P155P483P617
416A49656P556P370O958O293N445M408L303K053P33o76k028l278m525n616o430p096p567p807
$$ plain form
429 1250419 1453242 1548160 1482759 1274396 1010731 774753 594155 463534 370275 303481 254946 218885
428 218885 191282 169610 152293 138407 127164 118022 110576 104593 99996 96543 93691 90759 87202 83034 78647 74554
426 74554 70965 67723 64729 61922 59368 57106 55030 53086 51253 49499 47887 46461 45327 44380 43534 42768 42049 41410 40794
425 40794 40257 39787 39450 39229 39141 39119 39177 39309 39520 39697 39874 40051 40308 40674 41120 41576 42032 42493 42954 43541 44128 44803 45479 46135
422 46135 46711 47251 47790 48169 48308 48267 48227 48049 47738 47271 46672 46104 45536 44965 44393 43858 43402 42995 42587 42327 42067 41908 41828 41844
420 41844 41860 42013 42246 42511 42856 43290 43857 44589 45400 46385 47555 48891 50359 51981 53789 55783 58017 60461 63037 65591
418 65591 68064 70508 73138 76053 79314 82977 87092 91648 96656 102079 107849 113994 120538 127401 134556 142039 149656
416 149656 157212 164582 171540 177833 183278 187686 190989 193042 193775 193099 191071 187793 183268 177652 171222 164126 156559 148752
415A48752p835p756p565p221o839o335n879n427m994m543m183l891l602l310l084k897k650
413F0741k463k321k134j944j812j638j400j188j001q76p96o78n46l95k10j8K74O56J215J950
411D5416K561K577J647j85k286l440l360k709k044j521j123q35o49m89m10l03k24k12j71l8
409C2202R6J82K63L82M62N58O38P36Q69R66J099J281J522J778K070K263K302K126J886J587
408E5268J135O14Jn60j013j415j814k093k173k147k014j794j555j256j016p21m82l14k34j83
406C6234j83j82j03n9o0j4j4J5J6J5J6l4l4l4l4k7k7m9j29j92j92j76r5m9m8RR0J32K12L13
403C5317L94M40M41N25N25O08O07O95P75Q00Q00Q93R73R95R95R99J000R30R29R30J063J130
401E2764J050J018J018R99R18Q23Q22P59O26N01M22L81L02J48O7J37J37K11K12L32L31M11
$$ plain form
415 148752 140917 133161 125596 118375 111536 105201 99322 93895 88901 84358 80175 76284 72682 69372 66288 63391 60741
413 60741 58278 55957 53823 51879 50067 48429 47029 45841 44840 43964 43168 42490 41944 41549 41339 41321 41595 42251 43466 45416
411 45416 47977 50554 52201 52016 49730 46290 42930 40221 38177 36656 35533 34698 34049 33560 33150 32847 32623 32411 32240 32202
409 32202 32298 32480 32743 33125 33587 34145 34783 35519 36388 37354 38453 39734 41256 43034 45104 47367 49669 51795 53681 55268
408 55268 56403 57017 57018 56458 55445 54030 52216 50123 47950 45803 43789 41995 40440 39184 38168 37447 36965 36651 36417 36234
406 36234 36051 35869 35766 35707 35647 35633 35619 35634 35650 35665 35681 35647 35613 35579 35545 35518 35491 35442 35313 35121 34929 34753 34658 34609 34561 34570 34660 34792 35004 35317
403 35317 35711 36151 36592 37117 37642 38250 38857 39552 40327 41127 41927 42820 43793 44788 45783 46782 47782 48712 49641 50571 51634 52764
401 52764 53814 54832 55850 56849 57767 58590 59412 60171 60797 61298 61720 62101 62403 62551 62618 62755 62892 63103 63315 63647 63978 64389
399F4389M11M68M68L44K12K7j59k91m25n70p57r35j069j217j296j371j504j604j604j648j569
397E0300j476j342j160r74p98o13m79l47k14q0oP4J37J37K21K22K47K46K90L69M57N89O16
394D6416O96Q12R45J171J411J703K208K687K927K790K019Q55j82o19m32K36J113J872K324
393G0952K369K076J645J646K233L056L779M284M475M474M489M887N469N974O212O212N868
391A40100N097L855K391P03j079k748m158n125n631n751n619n256m751m235l677l132k520
389I8464j938j486r40l82J33P46J496K428L423M514N658O536O628N538L025k47l201m825m983
388A20587m107k812j563m06O85J620K444L172L996M926O070P329Q740J0163J1202J1271R861
386A93178O897L254K75j029n51J019K913M855O558Q073R420J0617J1755J2792J3570J4022
$$ plain form
399 64389 64800 65268 65736 66080 66292 66319 66160 65869 65444 64874 64117 63182 62113 60896 59600 58229 56725 55121 53517 51869 50300
397 50300 48824 47482 46322 45348 44550 43937 43458 43111 42897 42817 42811 42885 43022 43159 43380 43602 43849 44095 44385 44754 45211 45800 46416
394 46416 47112 47924 48869 50040 51451 53154 55362 58049 60976 63766 65785 66640 66458 65839 65407 65643 66756 68628 70952
393 70952 73321 75397 77042 78688 80921 83977 87756 92040 96515 100989 105478 110365 115834 121808 128020 134232 140100
391 140100 145197 149052 151443 152146 151067 148319 144161 139036 133405 127654 122035 116779 112028 107793 104116 100984 98464
389 98464 96526 95040 94100 93718 93851 94597 96093 98521 101944 106458 112116 118652 125280 130818 133843 133596 130395 125570 120587
388 120587 116480 113668 112105 111699 112384 114004 116448 119620 123616 128542 134612 141941 150681 160844 172046 183317 193178
386 193178 200075 203329 203604 202575 202024 203043 205956 210811 217369 225442 234862 245479 257234 270026 283596 297618
385B97618J4019J3566J2646J1183R260P053M769K508M49j225k503l433m000m346m479m345
383C48740l911l192k374j444m57N27J541K685M097N774P635R576J1584J3631J5466J7302J9409
381D46589K1777K4430K7222L0215L3433L7043M1592M7759N6456O8738Q5415J06259J27831
380A154759J41664J35254R7849L0849m8564j15456j50368j52628j34615j10065q7714p0346
379F90619n7379m7618m0024l3826k8553k4059k0201j6611j3270j0318p810n922m409k733n76
378C77310K111N309R006J3353J8592K5165L4076M6656O4822R0595J25623J69404K14539K38224
376A434785K05908J01108m9408j82501k40031k24760j80901j38418j05251q0339o1429m7095
375D31668l6271k8100k1797j6751j2733r549p182n449m251l585l545m170n208o075o261n679
$$ plain form
385 297618 311637 325203 337849 349032 358292 365345 370114 372622 373071 371846 369343 365910 361910 357564 353085 348740
383 348740 344829 341637 339263 337819 337362 337889 339430 342115 346212 351986 359621 369197 380781 394412 409878 427180 446589
381 446589 468366 492796 520018 550233 583666 620709 662301 710060 766516 835254 920669 1026928 1154759
380 1154759 1296423 1431677 1529526 1560375 1511811 1396355 1245987 1093359 958744 848679 760965 690619
379 690619 633240 585622 545598 511772 483219 459160 438959 422348 409078 398760 390950 385028 380619 377886 377310
378 377310 379421 384730 393736 407089 425681 450846 484922 531578 596400 686995 812618 982022 1196561 1434785
376 1434785 1640693 1741801 1692393 1509892 1269861 1045101 864200 725782 620531 540192 478763 431668
375 431668 395397 367297 345500 328749 316016 306467 299285 293836 289585 286000 282455 278285 273077 267002 260741 255062
374B55062m589l439k402j607j102p42l44M07J764L547N755P958R901J1263J1450R814O117
372C08813Q63m801r492j2232j2678j1162q348m759q45L064O870J0302J2872J4122J3503J0924
371C17016O535J242l702p080q343p571n258k039J504N042Q121J0435J1941J2340J1412R045
369C60640N226N72l997p321q571p694n299k295L29J579R31j596n409r426j2431j3894j3863
367B77481j2986j2128j1995j2699j3524j3445j2141r990p517n156k895p81J268L328N430P560
366A79810R661J1709J3492J4744J5250J4532J2218Q155K861k567p062r579r872q266n686k804
364B36596j17K163M105N720O812P130O093L349j093o382j1463j5272j7321j7673j6795j5104
363A70748j3002j0755q547o439m498k682j060M86J950L442N064O854Q795J0839J2728J4098
$$ plain form
374 255062 250473 247034 244632 243025 241923 241181 240837 241244 243008 246555 252310 260268 270169 281432 292882 302696 308813
372 308813 309676 304875 295383 283151 270473 259311 250963 246204 245359 248423 255293 265595 278467 292589 306092 317016
371 317016 323551 324793 321091 314011 305668 298097 292839 290800 292304 297346 305467 315902 327843 340183 351595 360640
369 360640 365866 366438 362441 355120 346549 338855 333556 331261 331590 333169 334100 332504 327095 317669 305238 291344 277481
367 277481 264495 252367 240372 227673 214149 200704 188563 178573 171056 165900 163005 162224 163492 166820 172250 179810
366 179810 189471 201180 214672 229416 244666 259198 271416 279571 282432 279865 272803 263224 253352 245086 239400 236596
364 236596 236479 238642 242747 248467 255279 262409 268502 271851 270758 264376 252913 237641 220320 202647 185852 170748
363 170748 157746 146991 138444 132005 127507 124825 123765 124251 126201 129643 134707 141561 150356 161195 173923 188021
361A88021J4550J3532J0740O119N06n045r541j2427j3678j3817j3471j3025j2521j1898j1021
360A17024r944q747p560o363n305m375l627k909k291j787j294q95n57j57J89N34Q61J206J583
358F5586J928K324K722L032L272L310L017K316J225j41j497k445k951k986k747k202j537q12
357G1414m1P83J608K466L397M433N578P027Q703J0584J2526J4424J5940J6727J6223J3805
355B05597R310L180l656r768j3997j5998j6078j4828j2833j0623q574o726n104l624k374j314
354I2590k23J020K324L779N241O422O980O821O422O442P745J0251J3469J6681J9208K0258
352B25430J9487J6854J2518O759k5p142j3818j9371k3227k4836k3692k0503j6752j3278j0432
351A07972q098o210m687l437k461j636j048n96j43L62Q50J356K027K744L586M569N697P159
$$ plain form
361 188021 202571 216103 226843 232962 233468 228423 218882 206455 192777 178960 165489 152464 139943 128045 117024
360 117024 107080 98333 90773 84410 79105 74730 71103 68194 65903 64116 62822 61927 61370 61213 61402 61936 62797 64003 65586
358 65586 67514 69838 72560 75592 78864 82174 85191 87507 88732 88591 87094 84649 81698 78712 75965 73763 72226 71414
357 71414 71373 72156 73764 76230 79627 84060 89638 96665 105368 115952 128478 142902 158842 175569 191792 205597
355 205597 214907 218087 214431 204663 190666 174668 158590 143762 130929 120306 111732 105006 99902 96278 93904 92590
354 92590 92367 93387 95711 99490 104731 111153 118133 124954 131376 137818 145563 155814 169283 185964 205172 225430
352 225430 244917 261771 274289 281048 281023 273881 260063 240692 217465 192629 168937 148434 131682 118404 107972
351 107972 99874 93664 88977 85540 83079 81443 80395 79799 79656 80018 80868 82224 84251 86995 90581 95150 100847 108006
349A08006Q876J0816J2939J5146J7074J8218J8162J6379J2500O834J89o221j1435j4918j6674
347A95891j7073j6379j4862j2918j0818q703o815n225l816k623j531n87L97J425K515L699
346A02577M949O322P838R524J1465J3610J5765J7636J8780J8620J6626J2625O640n71p672
345B54734j3385j6868j7909j7085j5044j2358r399o499l740j001J712M399P196J0149J3254
343A78156J6685K0226K3816K7470L1008L4191L6345L6222L2312K3595J0376n233j9995l1099
342D14075l7242l8712l7037l3532k9303k4845k0403j6237j2805j0284q767q073q073q179q179
340A12404p841p229o406n529m674m062l574l175k865k573k381k141j901j663j429j137q47
339E2977o61m92l05m3J97M56O95Q87J073J236J422J605J792K030K270K491K731L146L651M296
$$ plain form
349 108006 116882 127698 140637 155783 172857 191075 209237 225616 238116 244950 245139 238918 227483 212565 195891
347 195891 178818 162439 147577 134659 123841 115138 108323 103098 99282 96659 95128 94541 94938 96363 98878 102577
346 102577 107526 113848 121686 131210 142675 156285 172050 189686 208466 227086 243712 256337 262977 262406 254734
345 254734 241349 224481 206572 189487 174443 162085 152686 146187 142447 141446 143158 147557 154753 164902 178156
343 178156 194841 215067 238883 266353 297361 331552 367897 404119 436431 460026 470402 465169 445174 414075
342 414075 376833 338121 301084 267552 238249 213404 193001 176764 163959 153675 144908 136835 128762 120583 112404
340 112404 104563 97334 90928 85399 80725 76663 73089 69914 67049 64476 62095 59954 58053 56390 54961 53824 52977
339 52977 52316 51824 51519 51476 51673 52129 52824 53711 54784 56020 57442 59047 60839 62869 65139 67630 70361 73507 77158 81454
337H1454N068N999P195Q795J0682J2907J5434J8293K1352K4544K7921L1257L4317L6577L7029
335C78824L4200K6673J4182j803j8090l1256l9228m2021m1014l7902l3802k9255k4832k0709
334A33967j7053j3940j1464r415p680o271n167m289l577l019k619k272k004j764j613j533
333D0287j488j622j724j725j613j480j324j192j085r52q15o83n55m75m76m76m13k80k19k20
331B1470j66k46l55l55l95l95l44k64j68j68o0P3J18K51L77N10O20P53R58J143J420J766K081
329B8624K214K052J493M50q00j821k432k605k366k027j627j266r73p84o51n99n19m15m15l18
327A5215j86j76j75k10j30j30j30j20m1nop1p1o7o6q6oQ2Q2ooooR7R7J77J77K20K20K99L80
324A5346L56K23J61Q2M3M3M4J76K34K35K77L58M09M09N47N47O11O11P04P83P73Q52R05R85
$$ plain form
337 81454 86522 92521 99716 108511 119193 132100 147534 165827 187179 211723 239644 270901 305218 341795 378824
335 378824 413024 439697 453879 452076 433986 402730 363502 321481 280467 242565 208763 179508 154676 133967
334 133967 116914 102974 91510 82095 74415 68144 62977 58688 55111 52092 49473 47201 45197 43433 41820 40287
333 40287 38799 37177 35453 33728 32115 30635 29311 28119 27034 26082 25267 24584 24029 23554 23078 22602 22189 21909 21690 21470
331 21470 21304 21058 20703 20348 19953 19558 19214 18950 18782 18614 18554 18627 18745 18996 19373 19883 20503 21256 22214 23357 24777 26543 28624
329 28624 30838 32890 34383 34833 34033 32212 29780 27175 24809 22782 21155 19889 18916 18132 17481 16882 16363 15948 15533 15215
327 15215 15029 14853 14678 14468 14338 14208 14078 13958 13917 13912 13906 13835 13764 13697 13631 13545 13539 13621 13703 13697 13691 13685 13679 13776 13873 14050 14227 14447 14667 14966 15346
324 15346 15702 15925 16086 16168 16211 16254 16298 16474 16708 16943 17220 17578 17987 18396 18943 19490 20101 20712 21416 22199 22972 23824 24729 25714
322B5714J000J080J232J232J313J393J467J601J742J875K014K201K410K703L022L314L701
320E9014M100M522N028N559O118O746P305P836Q288Q508Q427P963P031N562L673J447r73l377
318A52777n479p110q202q789q870q628q177p508o949o335n616m972m412l934l535l236k996
317D8029k753k568k411k224k140k060j917j784j628j441j312j179j045r12p87p88p52o73o25
315A9030n44m46l66l21l22k28j48n5n5p8LR1R0Q6Q6Q5Q6R9R8J07J07K23L56N55Q46J282J893
312B2560K585L144K947J698n22k783m057m056l271k446j819j261r05p19o08n28l67k86j89
310I117j89j89j09j15j14p0o9l5l5p9%O6O6P0P1J34J33J65J64J6j17k23k23k50j69q1q1n9
308G795n9K1K1k3k3o3o3J1J1NOj3r2r3j2R9J00O5O5R2R2m1m0J3J2QQrr0j19j19k9N1l4l4n5
$$ plain form
322 25714 26714 27794 29026 30258 31571 32964 34431 36032 37774 39649 41663 43864 46274 48977 51999 55313 59014
320 59014 63114 67636 72664 78223 84341 91087 98392 106228 114516 123024 131451 139414 146445 152007 155680 157127 156154 152777
318 152777 147298 140188 131986 123197 114327 105699 97522 90014 83065 76730 71114 66142 61730 57796 54261 51025 48029
317 48029 45276 42708 40297 38073 35933 33873 31956 30172 28544 27103 25791 24612 23567 22655 21868 21080 20328 19655 19030
315 19030 18486 18040 17674 17353 17031 16803 16655 16600 16545 16467 16470 16561 16651 16737 16823 16908 16994 17093 17191 17298 17405 17628 17984 18539 19385 20667 22560
312 22560 25145 28289 31236 32934 32412 29629 25572 21516 18245 15799 13980 12719 11814 11095 10487 9959 9592 9306 9117
310 9117 8928 8739 8630 8515 8401 8331 8262 8227 8192 8113 8113 8179 8245 8315 8386 8520 8653 8818 8982 8998 8881 8658 8435 8185 8016 7935 7854 7795
308 7795 7736 7757 7778 7755 7732 7669 7606 7617 7628 7633 7639 7626 7534 7441 7429 7528 7628 7693 7758 7850 7942 7901 7861 7874 7886 7894 7902 7893 7803 7684 7565 7536 7587 7553 7519 7464
304G464n5n4n5m8m7m8m8l1l1l1l1J9J9J9J8K4K4J03J04J15J14J15J15Q9Q9J69J68J33J32R2
302H646R2L0L0J09J10J07J07J87J87K22K22J77K57K38K37K43K43L09L10K34K35K98L78M13
299A3621M14M21M22N06N06N41O22P14P14P68Q47Q87Q87R43J023J127J207J340J473J473J607
297C2063J829K016K125K312K534K827L140L432L776M069M325M617M919N052N072M939M648
296I3695M036L152K009P99n04j742k831l787m398m724m910m937m751m481m136l767l422l132
294E2169k840k540k301k036j795j633j446j287j100j031q98p38o05m43l63l03k24j58k6R6
292C0498R5K22L02L68N02O02O03O54P34P77R10J043J122J239J372J529J767J981K220K433
290E0973K673K938L178L417L710L980M272M472M552M565M432M123L618K895J912N71r45k497
$$ plain form
304 7464 7409 7355 7300 7252 7205 7157 7109 7078 7047 7016 6985 7004 7023 7042 7060 7084 7108 7211 7315 7430 7544 7659 7774 7863 7952 8121 8289 8422 8554 8646
302 8646 8738 8768 8798 8907 9017 9124 9231 9418 9605 9827 10049 10226 10483 10721 10958 11201 11444 11753 12063 12297 12532 12830 13208 13621
299 13621 14035 14456 14878 15384 15890 16431 17053 17767 18481 19249 20096 20983 21870 22813 23836 24963 26170 27510 28983 30456 32063
297 32063 33892 35908 38033 40345 42879 45706 48846 52278 56054 60123 64448 69065 73984 79036 84108 89047 93695
296 93695 97731 100883 102892 103691 103187 101445 98614 94827 90429 85705 80795 75858 71107 66626 62490 58723 55301 52169
294 52169 49329 46789 44488 42452 40657 39024 37578 36291 35191 34160 33262 32524 31919 31476 31113 30810 30586 30428 30402 30498
292 30498 30593 30815 31117 31485 31987 32589 33192 33846 34580 35357 36267 37310 38432 39671 41043 42572 44339 46320 48540 50973
290 50973 53646 56584 59762 63179 66889 70869 75141 79613 84165 88730 93162 97285 100903 103798 105710 106281 105336 102839
289A02839l801m789n349n581n582n437n197m917m571m211l760l379l034k788k495k249j956
287C3743j717j584j433j300j143j011r09q29p82p81o30n51n11n11l75k95k07k07j51j51j8
285A8647j9KKR0J69K21K21K25K26K36K35L29M09M71N51O08O88Q28R61J086J165J252J251J289
283C1143J288J247J114Q24M25l5n40j028j268j380j459j466j386j310j177j105j026r29r29
281B1003q28p48o94n60m84m04l19k40k34k35k00j20j20j21q8rK6K6J20J19J20J19O8O8O8O8
278A6401J9J9J9J9J30J30J36J35J95K74L68L67M27N08N55O35P13P93R48J027J103J102J102
276B7125J103R92R12Q04O18L61O8j89m80q39j078j209j289j317j318j229j149j043r63q53
274A9027p73o65n33m69m69l86l86l06l06k73k73j40j40j89j90k64k65k31j51j16j17p3p2p3
$$ plain form
289 102839 99038 94249 88900 83319 77737 72300 67103 62186 57615 53404 49644 46265 43231 40443 37948 35699 33743
287 33743 32026 30442 29009 27709 26566 25555 24646 23817 23035 22254 21624 21073 20562 20051 19676 19381 19174 18967 18816 18665 18647
285 18647 18628 18630 18632 18722 18891 19112 19333 19558 19784 20020 20255 20584 20993 21464 22015 22623 23311 24139 25100 26186 27351 28603 29854 31143
283 31143 32431 33678 34792 35616 36041 36006 35466 34438 33170 31790 30331 28865 27479 26169 24992 23887 22861 21932 21003
281 21003 20175 19427 18733 18173 17689 17285 16966 16726 16492 16257 16057 15937 15817 15696 15608 15599 15625 15651 15771 15890 16010 16129 16197 16265 16333 16401
278 16401 16420 16439 16458 16477 16607 16737 16873 17008 17203 17477 17845 18212 18639 19147 19702 20337 21050 21843 22791 23818 24921 26023 27125
276 27125 28228 29220 30132 30936 31554 31915 31983 31794 31314 30475 29397 28188 26899 25582 24264 23035 21886 20843 19880 19027
274 19027 18254 17589 17056 16587 16118 15732 15346 15040 14734 14461 14188 14048 13908 13719 13529 13265 13000 12769 12618 12502 12385 12312 12240 12167
272A2167p3j51j51j50j51j74j74j69j69j33n4j8j9N1N1R1R0N5N4OOj18k50k51k51k34j54j19
269I608j20r1r2n1n2r9r9r9r9q2q2q2q3o5o6o6o5j6j5j6j5K1K1K2K1LMLMM4M4MNO8O9j1j1
266H464N4N5K0o0j22j22j27j27j41j40n2K7J03J03J48K27L26M05O18Q05J037J223J173P75
264A4672J26o46j204j390j248r56p76n90m80l48k77k78j66j67j67j67r6r5r6r5j1j2j1j1J7
261E528J8K2K2QQ7J89K69K70L50N07O92R15J048J035P42K03l56o19o18n06n05n35m02k33j53
259G978j50j49o9o9k9j09j89k70k74j94j61j61m4Q9J14J15J22J23J79J80K14K14J97J17l3
257G741j12j74j73j78j78j57j57j56j57j40j40j40j40q3q4q3q4j1j0j1j1J3J2J46J45J46J45
254E969K15L49N16P02R15J048J012P73L10q9m01m81l75j88o5J5J24K03J75J74Q7Pj56k36l24
$$ plain form
272 12167 12094 11943 11792 11642 11491 11317 11143 10974 10805 10672 10618 10600 10581 10632 10683 10774 10864 10919 10973 10979 10985 10867 10617 10366 10115 9881 9727 9608
269 9608 9488 9397 9305 9254 9202 9103 9004 8905 8806 8724 8642 8560 8477 8412 8346 8280 8215 8199 8184 8168 8153 8174 8195 8217 8238 8241 8245 8248 8252 8296 8340 8344 8349 8417 8486 8475 8464
266 8464 8518 8573 8593 8533 8411 8289 8162 8035 7894 7754 7702 7729 7832 7935 8083 8310 8636 9041 9659 10464 11501 12724 13897 14672
264 14672 14798 14152 12948 11558 10310 9354 8578 7988 7508 7160 6883 6605 6439 6272 6105 5938 5842 5747 5651 5556 5545 5533 5522 5511 5528
261 5528 5546 5568 5590 5598 5685 5874 6143 6413 6763 7270 7962 8877 9925 10960 11702 11905 11549 10930 10312 9806 9301 8766 8364 8131 7978
259 7978 7828 7679 7610 7541 7512 7403 7214 6944 6670 6476 6315 6154 6110 6199 6313 6428 6550 6673 6852 7032 7246 7460 7657 7774 7741
257 7741 7629 7455 7282 7104 6926 6769 6612 6456 6299 6159 6019 5879 5739 5656 5572 5489 5405 5394 5384 5373 5362 5375 5387 5533 5678 5824 5969
254 5969 6184 6533 7049 7751 8666 9714 10726 11499 11809 11720 11319 10838 10463 10275 10210 10225 10349 10552 10727 10901 10988 10995 10839 10603 10279
252A0279l24j85j05p1p0o6o5j05j06n6n6n6n7j19j20l9m0NNONK2K2K1K2P4P5P4P4ONM5M6O6
249I212O6J46J45K21K20K55L35L75L75L85L84M09M89N37O17P50Q31P90P11N95N15N16N95P05
246B0179P86Q65R98J128J261J334J520J653J733J796J983K249K489K702K941L227L519L889
245E6252M287M670N068N501N847N973O013N878N480M766L729K412Q97p53k269l532m357m865
243A00997n052m998m706m330l825l279k828k429j977j591j299j090j009j133j319j499j739
241E6894j991k124k222k181k089j956j791j605j445j260j149r10p01n67m36l02r2M0J10J90
239C4413L79N12O60P92Q49R82J122J307J554J687J867K160K439K785L150L443L789M135M467
238G2492M760N089N329N325N246M956M344L356K053M93j075k596l845m753n311n503n371n091
$$ plain form
252 10279 9955 9770 9665 9594 9524 9458 9393 9288 9182 9126 9070 9014 8957 8838 8718 8679 8639 8644 8649 8655 8660 8682 8704 8725 8747 8821 8896 8970 9044 9050 9055 9100 9146 9212
249 9212 9278 9424 9569 9790 10010 10265 10600 10975 11350 11735 12119 12528 13017 13554 14171 14921 15752 16542 17253 17848 18363 18879 19474 20179
246 20179 20965 21830 22828 23956 25217 26551 28071 29724 31457 33253 35236 37485 39974 42676 45617 48844 52363 56252
245 56252 60539 65209 70277 75778 81625 87598 93611 99489 104969 109735 113464 115876 116773 116020 113751 110219 105862 100997
243 100997 95945 90947 86241 81911 78086 74807 71979 69550 67573 65982 64683 63593 62584 61451 60132 58633 56894
241 56894 54903 52779 50557 48376 46287 44331 42540 40935 39490 38230 37081 36171 35470 34903 34467 34165 34073 34113 34223 34413
239 34413 34792 35304 35964 36756 37605 38587 39709 41016 42570 44257 46124 48284 50723 53508 56658 60101 63890 68025 72492
238 72492 77252 82341 87670 92995 98241 103197 107541 110897 112950 113443 112368 109772 105927 101174 95863 90360 84989 79898
236G9898m639m140l635l136k685k209j810j558j371j368j448j618j857k085k324k450k530
234C9035k537k497k382k195k087j954j734j602j448j262j103j023r20p86p46p07o39o38n57
232A2218n57m40m40m38m38l99l60k97k16k52k91k50k09j88k29k43k43k19k18j39j38j56j56
230E702j56j56q0q1q0q1o3o4o4o4q9q9q4q4o8J1j1n1p5p5p8p8o8o8o8o8p3p4p4p3o4o4o3o4
227C221RRRRm8m8m7m8k6k6k6k6k9k8jm2l3M7jjj1j1j1j1L0L1n0m9m7m6opK2K2L0n0m9qLMj2
223B648j1j2j2j5j4j4j5K4K4n6n6j1j1j1j1k6k7k7k6p0p0p0p0kllkn8n7K2K2J%J%k4k4k4k5
220A885j1j2j1j1NNNNl5l5l5l6nnonM3M3M3M3k1k0j8j8j3K7M9l0o5o5ONKp8p8KR3R3O3j6k1
216A767k2k6k6mmmmL7L7llm2m2L7L8J7J6J7J6k2k1k0j9M1Q0J03K3k6k6l0l1o1o1o1o1L3L4
$$ plain form
236 79898 75259 71119 67484 64348 61663 59454 57644 56086 54715 53347 51899 50281 48424 46339 44015 41565 39035
234 39035 36498 34001 31619 29424 27337 25383 23649 22047 20599 19337 18234 17211 16291 15505 14759 14052 13413 12775 12218
232 12218 11661 11221 10781 10343 9905 9506 9146 8849 8633 8381 8090 7840 7631 7443 7214 6971 6728 6509 6291 6152 6014 5858 5702
230 5702 5546 5390 5310 5229 5149 5068 5005 4941 4877 4813 4724 4635 4551 4467 4399 4410 4399 4348 4273 4198 4120 4042 3974 3906 3838 3770 3697 3623 3549 3476 3412 3348 3285 3221
227 3221 3230 3239 3248 3257 3209 3161 3114 3066 3040 3014 2988 2962 2933 2905 2904 2862 2829 2876 2875 2874 2863 2852 2841 2830 2860 2891 2841 2792 2745 2699 2693 2686 2708 2730 2760 2710 2661 2653 2656 2660 2648
223 2648 2637 2625 2613 2598 2584 2570 2555 2579 2603 2547 2491 2480 2469 2458 2447 2421 2394 2367 2341 2271 2201 2131 2061 2059 2056 2053 2051 1993 1936 1958 1980 1981 1981 1982 1982 1958 1934 1910 1885
220 1885 1874 1862 1851 1840 1845 1850 1855 1860 1825 1790 1755 1719 1714 1709 1703 1698 1741 1784 1827 1870 1849 1829 1811 1793 1780 1807 1856 1826 1761 1696 1702 1707 1709 1631 1553 1555 1648 1741 1804 1788 1767
216 1767 1745 1719 1693 1689 1685 1681 1677 1714 1751 1748 1745 1703 1661 1698 1736 1753 1769 1786 1802 1780 1759 1739 1720 1761 1841 1944 1967 1941 1915 1885 1854 1793 1732 1671 1610 1643 1677
212A677j6O4P9jK7O6J9J8K1K1p0p0p8KO6K5k7k6poooONONKKLKK5K6K2K3km2n8RK6K6L0L0J7
208A935J6J7J7%%%%K4K4K4K3K4K4K4K4K0J9K0J9l4l5l4l5mlL6L7K8K9n1n1j8j9j9j8L0L0N7
205B180J7k1M6K5j5Pl2l3PK1O0M1M0K7K6K7K6J3J3J2J3k4k3k4k4K0K0K0K0NNQ5Q5QPQQj1j0
201B675j1j0L4L4QM7O5kJ6N6J7J8K0K1LMLML7L7L7L8K7K7K7K7N7N7J9Q6Q6Q5N1N0J1J2M7J26
197C946P7P6J22J21J14J14L4L5K2K3O2O2J02J01J01J01J46J47J47J47J74J74J74J74J51J51
195F798J51J51K27K28K27K27L04L04L03L04L61L61L61L61M31M31N11N11O21O21O61P41P66
193A5962Q45Q99R78J035J115J174J254J410J597J699J886K046K285K557K797L156L555L948
191E0198M399M878N383N925O377O785P024P007O715O005M807L053Q98j431l638n437o581p189
$$ plain form
212 1677 1661 1725 1804 1803 1830 1896 1915 1933 1954 1975 1905 1835 1757 1759 1825 1850 1823 1797 1790 1784 1778 1772 1778 1783 1789 1794 1796 1798 1801 1803 1828 1854 1876 1899 1897 1855 1797 1806 1832 1858 1888 1918 1935
208 1935 1951 1968 1985 1985 1985 1985 1985 2009 2033 2057 2080 2104 2128 2152 2176 2196 2215 2235 2254 2220 2185 2151 2116 2112 2109 2145 2182 2210 2239 2188 2137 2119 2100 2081 2063 2093 2123 2180
205 2180 2197 2176 2222 2247 2232 2239 2207 2174 2181 2202 2262 2303 2343 2370 2396 2423 2449 2462 2475 2487 2500 2476 2453 2429 2405 2425 2445 2465 2485 2490 2495 2580 2665 2673 2680 2688 2696 2685 2675
201 2675 2664 2654 2688 2722 2730 2777 2842 2840 2856 2912 2929 2947 2967 2988 2991 2995 2998 3002 3039 3076 3113 3151 3178 3205 3232 3259 3316 3373 3392 3478 3564 3649 3700 3750 3761 3773 3820 3946
197 3946 4023 4099 4221 4342 4456 4570 4604 4639 4661 4684 4746 4808 4910 5011 5112 5213 5359 5506 5653 5800 5974 6148 6322 6496 6647 6798
195 6798 6949 7100 7327 7555 7782 8009 8313 8617 8920 9224 9585 9946 10307 10668 11099 11530 12041 12552 13173 13794 14455 15196 15962
193 15962 16807 17706 18684 19719 20834 22008 23262 24672 26269 27968 29854 31900 34185 36742 39539 42695 46250 50198
191 50198 54597 59475 64858 70783 77160 83945 90969 97976 104691 110696 115503 118556 119454 118023 114385 108948 102367 95178
189I5178p375p109o658o065n507m935m376l878l425k993k647k298j952j743j503j256j070
188C0388j006r27p70n84n34m55l42k09j32n3N1J30J33K14K94M28M54N35O40P74R59J040J127
185C2155J260J389J576J849K034K231K470K789L187L524L975M431M883N379N777O141O381
184I1431O443O258N646M608K999J005j176l385n242o546p290p477p317o972o442n831n216
182E5496m604m039l533l052k652k279j932j637j451j254j068q86p52o36n57l97k11j1J21K12
180B4878K91M00N86P69R03J027J214J321J281J211J130Q61M61l4n39r98j397j620j807j874
178B8064j834j689j555j406j272j115j035r22q43p42o09n65n26m40m00l41l40k79k79j91j11
176A1570j10j09o5o5o1o1o0o1rrJ24J25J47J48J52J53J76K56L04L84M37N16N38N79O11O90
$$ plain form
189 95178 87803 80694 74036 67971 62464 57529 53153 49275 45850 42857 40210 37912 35960 34217 32714 31458 30388
188 30388 29382 28455 27685 27101 26567 26112 25770 25561 25429 25376 25427 25557 25690 25904 26198 26626 27080 27615 28255 29029 29988 31028 32155
185 32155 33415 34804 36380 38229 40263 42494 44964 47753 50940 54464 58439 62870 67753 73132 78909 85050 91431
184 91431 97874 104132 109778 114386 117385 118390 117214 113829 108587 102041 94751 87274 79957 72985 66543 60712 55496
182 55496 50892 46853 43320 40268 37616 35337 33405 31768 30317 29063 27995 27109 26357 25721 25164 24767 24556 24545 24666 24878
180 24878 25169 25569 26155 26924 27827 28854 30068 31389 32670 33881 35011 35872 36333 36299 35760 34762 33365 31745 29938 28064
178 28064 26230 24541 22986 21580 20308 19193 18158 17236 16393 15651 15042 14477 13951 13511 13111 12770 12430 12151 11872 11681 11570
176 11570 11460 11351 11286 11221 11160 11099 11039 10978 10969 10960 11084 11209 11356 11504 11656 11809 11985 12241 12545 12929 13366 13882 14420 14999 15610 16300
174A6300P97Q78J010J144J219J300J396J475J504J504J459J273J012O13J44l60q69j268j516
172B9015j649j673j541j469j469j267j082r18q39p52o20m89l57k82k02j77j77q4m%%R4J73
170A4231K23K23K63L43L94L94M35N14N30N31O28P09Q02Q81R39J017J148J281J403J590J687
168C0166J767J969K209K492K891L286L632M056M508M947N452N898O297O662O795O604O099
166A05730N214L911K122P4j987l769n249o286o723o723o509o163n656n098m529m023l518l067
165D7751k673k275j959j667j389j204j040q55o01m69l59k26r4L8J68L54O00P33Q47R79J192
163C7851J379J588J774J935K122K210K210K305K225J962J668J380J033P64N79N07O40R16J315
161F6363J744K196K671L230L832M390M865N264N477N398N055M336L178J609k26k222m086n656
$$ plain form
174 16300 17097 17975 18985 20129 21348 22648 24044 25519 27023 28527 29986 31259 32271 32884 33028 32668 31799 30531 29015
172 29015 27366 25693 24152 22683 21214 19947 18865 17947 17108 16356 15736 15247 14890 14608 14406 14229 14052 13968 13964 13964 13964 14058 14231
170 14231 14454 14677 14940 15283 15677 16071 16506 17020 17550 18081 18709 19418 20220 21101 22040 23057 24205 25486 26889 28479 30166
168 30166 31933 33902 36111 38603 41494 44780 48412 52468 56976 61923 67375 73273 79570 86232 93027 99631 105730
166 105730 110944 114855 116977 117051 115064 111295 106046 99760 93037 86314 79805 73642 67986 62888 58359 54336 50818 47751
165 47751 45078 42803 40844 39177 37788 36584 35544 34689 34088 33619 33260 33034 32940 32978 33146 33500 34100 34833 35680 36659 37851
163 37851 39230 40818 42592 44527 46649 48859 51069 53374 55599 57561 59229 60609 61642 62406 62985 63492 64132 65048 66363
161 66363 68107 70303 72974 76204 80036 84426 89291 94555 100032 105430 110485 114821 117999 119608 119382 117160 113074 107418
159A07418o702p209p306p119o701o249n664n051m530m025l534l030k657k364k102j809j577
158B9789j337j149j017r34p47o34n02l95k62j27m7L6J69L48M81O38P70Q56R36J059J192J199
156C0322J119R66O73K69j29o15j067j422j660j842j842j834j755j626j494j357j224j121r89
154A3372q46p66p15p15o32m99m36m36m17l37k49k49k49k49k54k54k07k86k06j26j43j43j38
152D820j38p9p8j13j93j70j69r5r5k0k0r5r5j50p0l5l5r8r8j5O5Pp3k3k3j1j2r1r1rj0rj0
149B669l8l7l8l8NNNOk0k0j9k0o5o4J5J6j0j0qpj2K7M3k4m9m8n3n3k2k3k3k3J2J2J2J2PPP
145B136PN8N8k1k2%%%%P0P0P0P0P3P3M6Q6K3m3lln7n7n7n7o5o5o5o5jkjkl4l4l4l3RJ0RRl
141B153lK3j7m0K6O7O6lklkk1k1k1k1j8j8j9j8J8J8J9J8J7J7J7J7R1R0J1J0PPQ6Q7P3P3P4
$$ plain form
159 107418 100716 93507 86201 79082 72381 66132 60468 55417 50887 46862 43328 40298 37641 35277 33175 31366 29789
158 29789 28452 27303 26286 25352 24605 23971 23469 23074 22812 22685 22638 22674 22843 23191 23672 24310 25080 25936 26872 27931 29123 30322
156 30322 31441 32407 33080 33349 33220 32605 31538 30116 28456 26614 24772 22938 21183 19557 18063 16706 15482 14361 13372
154 13372 12526 11760 11045 10330 9698 9199 8763 8327 7910 7573 7324 7075 6826 6577 6323 6069 5862 5576 5370 5244 5101 4958 4820
152 4820 4682 4603 4525 4412 4219 4049 3880 3785 3690 3670 3650 3555 3460 3310 3240 3205 3170 3072 2974 2959 3024 3031 2958 2935 2912 2901 2889 2798 2707 2698 2688 2679 2669
149 2669 2631 2594 2556 2518 2523 2528 2533 2539 2519 2499 2480 2460 2395 2331 2346 2362 2352 2342 2334 2327 2315 2342 2385 2361 2312 2264 2211 2158 2136 2113 2090 2067 2079 2091 2103 2115 2122 2129 2136
145 2136 2143 2201 2259 2238 2216 2216 2216 2216 2216 2286 2356 2426 2496 2569 2642 2688 2774 2797 2754 2751 2748 2691 2634 2577 2520 2455 2390 2325 2260 2259 2257 2256 2254 2220 2186 2152 2119 2128 2138 2147 2156 2153
141 2153 2150 2173 2156 2116 2142 2209 2275 2272 2270 2267 2265 2244 2223 2202 2181 2163 2145 2126 2108 2126 2144 2163 2181 2198 2215 2232 2249 2340 2430 2441 2451 2458 2465 2551 2638 2711 2784 2858
137B858P3P3P3P4P3R6R7R6R7J14J14J14J14N4N4R4R4Q2Q3J30K10K46K45K90K90K68K67K63
135F736L42M08M07M07M87N58N57N89O68Q10Q90R33J012J150J282J367J447J542J542J510J324
133B5968J039O93K91j07n62r61j228j415j522j522j481j347j218j085j042r62q28o95o31n52
131A0833m50l71l66l65l55k75k53k53j20j20p5p5p5N%%L6L6J29J29J57J57J57J57J86J85K34
128I248L13M33M33M46M46M79O12O96P76Q47R26J046J125J211J290J344J343J380J379J157
126B6930R17N67J68l08p07j092j386j608j688j653j573j490j357j247j114r41q62q15p35o71
124I335n39m62l82l25l25l18l18k25k25j88j88j84j83j85j04q3q3r9r8ook2k2j15j16k4k5
122D485J5J6J4J5J4J5%JO7O6N9N9N8N9K0K0J14J13P3P4J35J35J49O9J14J14Q8Q7Q8Q7Q1Q1
$$ plain form
137 2858 2931 3004 3077 3151 3224 3320 3417 3513 3610 3724 3838 3952 4066 4120 4174 4268 4362 4444 4527 4657 4867 5113 5358 5648 5938 6206 6473 6736
135 6736 7078 7486 7893 8300 8787 9345 9902 10491 11159 11969 12859 13792 14804 15954 17236 18603 20050 21592 23134 24644 25968
133 25968 27007 27700 27991 27884 27322 26361 25133 23718 22196 20674 19193 17846 16628 15543 14501 13539 12711 12016 11385 10833
131 10833 10383 10012 9646 9281 8926 8651 8398 8145 8025 7905 7830 7755 7680 7685 7685 7685 7721 7757 7886 8015 8172 8329 8486 8643 8829 9014 9248
128 9248 9561 9994 10427 10873 11319 11798 12410 13106 13882 14729 15655 16701 17826 19037 20327 21671 23014 24394 25773 26930
126 26930 27847 28414 28582 28274 27567 26475 25089 23481 21793 20140 18567 17077 15720 14473 13359 12418 11556 10741 10006 9335
124 9335 8796 8334 7952 7627 7302 6984 6666 6441 6216 6028 5840 5656 5473 5288 5184 5101 5018 4919 4821 4815 4809 4787 4765 4650 4534 4510 4485
122 4485 4500 4516 4530 4545 4559 4574 4574 4575 4642 4708 4767 4826 4884 4943 4963 4983 5097 5210 5283 5357 5492 5627 5776 5845 5959 6073 6161 6248 6336 6423 6504 6585
119F585J48J47J62J62K01K02K41K42L09L08L46L47L86L87L75L75M29N08N43O23O54O55P23
117A5058Q03Q68R47R97J131J246J327J393J472J626J758J895K134K354K646K919L213L671
115D7458M123M507M853N202N654O012O197O285O097N606M622L236J559l07k197l792n042n894
113I4179o293o343o157n754n302m846m288l844l393k964k617k287j993j778j591j372j186
112C2171j106r73q16o84o33n01l71k91j81j01m9L1J91K70L44M23M47N79P40Q19R05J039J208
110C3461J394J500J687J857K096K366K604K924L270L586L931M400M799N149N443N560N560
108I1587N329M824L926K622R79q55k731m406n639o464o803o763o577o179n693n187m668m163
106D3139l671l271k926k579k288k047j859j672j481j348j241j109j022r42q86q06p20o40n70
$$ plain form
119 6585 6733 6880 7042 7204 7405 7607 7848 8090 8399 8707 9053 9400 9786 10173 10548 10923 11352 11860 12403 13026 13680 14335 15058
117 15058 15861 16729 17676 18673 19804 21050 22377 23770 25242 26868 28626 30521 32655 35009 37655 40574 43787 47458
115 47458 51581 56088 60941 66143 71797 77809 84006 90291 96388 101994 106616 109852 111411 111104 108907 105115 100073 94179
113 94179 87886 81543 75386 69632 64330 59484 55196 51352 47959 44995 42378 40091 38098 36320 34729 33357 32171
112 32171 31065 30092 29276 28592 27959 27458 27087 26796 26615 26514 26465 26496 26687 26957 27301 27724 28171 28750 29490 30309 31214 32253 33461
110 33461 34855 36355 38042 39899 41995 44361 46965 49889 53159 56745 60676 65076 69875 75024 80467 86027 91587
108 91587 96916 101740 105666 108288 109267 108412 105681 101275 95636 89172 82369 75606 69029 62850 57157 51970 47302 43139
106 43139 39468 36197 33271 30692 28404 26357 24498 22826 21345 19997 18756 17647 16625 15683 14797 13991 13271 12631 12061
104A2061n30n89n88n23m84l87l08k70k70k98k97k58k58j97j98j97j98j65j65j65j65j68j69
102E214j68j69j12j12j07j07j10l1n5r5o9j09r1r1j04j44j56r0m5nKl9p0l0l2p2q5q5qpj9
99B799j9n9n8qrqqmlmmmmmmooool3l3OPL3L4m6m7K9K8O9O8K2K2K2K2l9l9l9l8o0o0o0o0j0
95B373j0j1j0l4l4l1l0l1L5kkK2K1K2K2qrqqK4K3K4K4J4J4J4J4K5K6K1K1%o7o6jK0K0K4K4
91B465P4P4P4P4LMMLJ4J4J3J4O9O9P0O9J45J46J46J46J45J45J27J67K34L01M09M77M23L44
89F462K24R0j4r4j32j32n5K5O4O5O8J48K36K36K60K59L00L79M44N24O00P33Q38R17R80J166
86A4591J426J718K184K849L686M670O117Q005J0415J3208J5356J4904J0327K163o379j1672
85I3568j3131j2147j0203q313o628n218m087l209k485j873j415j068q71o84n15l29j96rK00
$$ plain form
104 12061 11531 10942 10354 9831 9347 8960 8652 8382 8112 7814 7517 7259 7001 6804 6606 6409 6211 6046 5881 5716 5551 5383 5214
102 5214 5046 4877 4765 4653 4546 4439 4329 4298 4243 4148 4079 3970 3879 3788 3684 3540 3384 3294 3249 3244 3246 3207 3137 3107 3075 3003 2918 2833 2825 2818 2799
99 2799 2780 2721 2663 2655 2646 2638 2630 2626 2623 2619 2615 2611 2607 2603 2599 2593 2587 2581 2575 2542 2509 2515 2522 2555 2589 2543 2496 2525 2553 2622 2690 2712 2734 2756 2778 2739 2700 2661 2623 2563 2503 2443 2383 2373
95 2373 2363 2352 2342 2308 2274 2243 2213 2182 2217 2215 2213 2235 2256 2278 2300 2292 2283 2275 2267 2291 2314 2338 2362 2376 2390 2404 2418 2443 2469 2490 2511 2511 2444 2378 2377 2397 2417 2441 2465
91 2465 2539 2613 2687 2761 2764 2768 2772 2775 2789 2803 2816 2830 2899 2968 3038 3107 3252 3398 3544 3690 3835 3980 4107 4274 4508 4809 5218 5695 6118 6462
89 6462 6686 6776 6762 6668 6536 6404 6349 6374 6438 6503 6571 6719 6955 7191 7451 7710 8010 8389 8833 9357 9957 10690 11528 12445 13425 14591
86 14591 16017 17735 19919 22768 26454 31124 37241 45246 55661 68869 84225 99129 109456 111619 105240 93568
85 93568 80437 68290 58087 49774 43146 37928 33841 30632 28147 26274 24859 23791 22920 22236 21721 21392 21196 21187 21387
83B1387L86N08O42P75R61J074J207J293J480J696J935K178K470K819L219L554L794M013M199
81E9590M464M758N092N331N475N476N211M706L857K713J273l49j952l414m562n333n776n908
79H0652n786n493n070m619m191l792l423l024k671k379k110j817j552j313j150j016q98p64
78B9584o84o05n08m27l51k19q5nJ04J84K90L70M47N79P26Q06Q65R45J115J247J357J490J683
76C8908J922K082K321K593K939L284L578L921M320M656M896N131N317N284N098M703L933K865
74A07751J509n2j622l077m275n139n591n698n564n285m833m274l715l274k821k316j810j482
72D8432j082q22o35m94m95n55o89r14j154j384j569j791j924j935j935j878j797j723j590
70B4066j453j320j184j105j026q93p69p68o66n32n27n28m47m47l13l14k32k31k32k31j32j31
$$ plain form
83 21387 21773 22281 22923 23698 24659 25733 26940 28233 29713 31409 33344 35522 37992 40811 44030 47584 51378 55391 59590
81 59590 64054 68812 73904 79235 84710 90186 95397 100103 103960 106673 107946 107597 105645 102231 97669 92336 86560 80652
79 80652 74866 69373 64303 59684 55493 51701 48278 45254 42583 40204 38094 36277 34725 33412 32262 31246 30348 29584
78 29584 28900 28295 27787 27360 27009 26790 26705 26700 26804 26988 27278 27648 28095 28674 29400 30206 31071 32016 33131 34378 35735 37225 38908
76 38908 40830 42912 45233 47826 50765 54049 57627 61548 65868 70524 75420 80551 85868 91152 96250 100953 104886 107751
74 107751 109260 109208 107586 104509 100234 95095 89504 83806 78242 72957 68124 63850 60135 56861 54040 51724 49914 48432
72 48432 47350 46528 45893 45399 44904 44349 43660 42746 41592 40208 38639 36848 34924 32989 31054 29176 27379 25656 24066
70 24066 22613 21293 20109 19004 17978 17085 16316 15548 14882 14350 13823 13295 12848 12401 12088 11774 11542 11311 11079 10848 10716 10585
68A0585r2r1n1n1K9K9J09J09J89J89K54K53K54K54M35M35N68N68O83O83Q15Q16R68R67J101
66B0008J100J092J092R63Q29O08L15Ok86o45r38j115j248j407j406j367j366j293j160j045
64A2737r65q64p31o55o55n65n66m95l61l12l12l49k69j95j96j90j90k47k48k47k48j85j86
62C506k31j51j17j18j57p7m6m5m1m1q3q4q3q4o7o7o1o2n5K4k0k0o5o6o5o5k0k0k0k1n6n6o
59A360q6j21m1LKk9k8k9k9m4m4m5m4J4J5J5J4J4J4n3n2QQQQM7M7M6M7J8J7J8J8K4K4o9o9r4
55I12r3n3n3m7m7qpONj6r6kkppj1j1j1j1k0k0j9k0J0J0J0J0K8K8K8K8j5j6j5j5K7K7K7K7j0
51E51rj0rM8M9M9M8k1k1k1k1J5J4J5J4o1o2o2o2k7k8k7k8p4p4M6M6J3J3k7k7j3j4j3j4mnn
48A82nmnnnK2K2K2K2k5k5k5k6l0l1RRN9N8l5l4k4k3J7J7J2J1J2J2K4K4K4K3L3L2P2P2L1L0
$$ plain form
68 10585 10493 10402 10351 10300 10329 10358 10467 10576 10765 10954 11208 11461 11715 11969 12404 12839 13407 13975 14658 15341 16156 16972 17940 18907 20008
66 20008 21108 22200 23292 24255 25084 25692 26007 26013 25727 25082 24144 23029 21781 20374 18968 17601 16235 14942 13782 12737
64 12737 11772 10908 10177 9522 8867 8302 7736 7241 6880 6568 6256 5907 5638 5443 5247 5057 4867 4620 4372 4125 3877 3692 3506
62 3506 3275 3124 3007 2889 2732 2655 2609 2564 2523 2482 2399 2315 2232 2148 2081 2014 1953 1891 1836 1860 1840 1820 1755 1689 1624 1559 1539 1519 1499 1478 1422 1366 1360
59 1360 1274 1153 1112 1115 1117 1088 1060 1031 1002 958 914 869 825 839 854 869 883 897 911 858 806 814 822 830 838 885 932 978 1025 1043 1060 1078 1096 1120 1144 1075 1006 912
55 912 819 766 713 666 619 611 604 610 615 599 503 501 499 492 485 474 463 452 441 421 401 382 362 372 382 392 402 430 458 486 514 499 483 468 453 480 507 534 561 551
51 551 542 532 523 571 620 669 717 696 675 654 633 648 662 677 691 630 568 506 444 417 389 362 334 260 186 232 278 291 304 277 250 237 223 210 196 192 187 182
48 182 177 173 168 163 158 180 202 224 246 221 196 171 145 115 84 93 102 161 219 184 150 126 103 120 137 149 160 172 184 208 232 256 279 312 344 416 488 519 549
44E49o2o3qpqqk0k0k0k0k0k0k1k0m6m6m7m6J7J7J7J6RRRQq9q8p6N7O6j3k5k6j0j0K7K8l7p6
40a23r4k7Nl5l0RM0M0l8l7K0J9k0q6m4nO3J28M7OL3L3l0k9o8%k5k4Pl3l5L2J5k6KJjkL5L5
37b42L4L5j5j6j5j5rrrrL4L4L5L4NMNNK6K7n4n3K9K9K9L0m5m5lo9q7j9J8J9K1K1K1K1j8j7
33b33j8j7qpqpk0k1k0k1J0J0RJ0j5j4j4j4KLKKK4K4K3K4QRRQL0L0n0n1m8m8m9m8mllmJ4J3
29d81J3J4K0K0O5j5n3n3P5P5J01J01l2l2j2j3j2j2J8J7J8J8L9L9m0m1O7O6O6O7J3J4N8k2p5
25I1p5q0q0l1l0l1l0onooM0L9m4j23q4mL1L1j7O2O3j7k8k8l3l3LMLMlllkPPPPjkkkjkkkj8
21d35j8j8j8J1J2J2J2%JJ%O9O9j1j1J0J0J0J0k2k2N8N8L9L9m1m0K5K6K6K5%%%%L5L5L5L4j5
17A1j3O3O5k3k3k8k9j2r0o7k7j9K2M6l4k5k5l1l0J3J3J3J3m2m1m1m2K0K0K0K0R0R1Mp5m1j
$$ plain form
44 549 487 424 416 409 401 393 373 353 333 313 293 273 252 232 186 140 93 47 64 81 98 114 123 132 141 149 60 -28 -104 -47 19 6 -19 -45 -55 -65 -38 -10 -47 -123
40 -123 -217 -244 -239 -274 -304 -295 -255 -215 -253 -290 -270 -251 -271 -357 -401 -406 -343 -215 -168 -162 -129 -96 -126 -155 -223 -223 -248 -272 -265 -298 -333 -301 -286 -312 -310 -309 -310 -312 -277 -242
37 -242 -208 -173 -188 -204 -219 -234 -243 -252 -261 -270 -236 -202 -167 -133 -128 -124 -119 -114 -88 -61 -115 -168 -139 -110 -81 -51 -96 -141 -144 -213 -300 -319 -301 -282 -261 -240 -219 -198 -216 -233
33 -233 -251 -268 -276 -283 -291 -298 -318 -339 -359 -380 -370 -360 -351 -341 -356 -370 -384 -398 -396 -393 -391 -389 -365 -341 -318 -294 -286 -277 -268 -260 -230 -200 -250 -301 -349 -397 -446 -494 -498 -501 -504 -508 -494 -481
29 -481 -468 -454 -434 -414 -349 -364 -417 -470 -395 -320 -219 -118 -150 -182 -194 -207 -219 -231 -213 -196 -178 -160 -121 -82 -122 -163 -96 -30 36 103 116 130 188 166 91
25 91 16 -64 -144 -175 -205 -236 -266 -272 -277 -283 -289 -249 -210 -254 -377 -461 -465 -434 -403 -420 -358 -295 -312 -340 -368 -401 -434 -431 -427 -424 -420 -423 -426 -429 -431 -424 -417 -410 -403 -404 -406 -408 -410 -411 -413 -415 -417 -435
21 -435 -453 -471 -489 -478 -466 -454 -442 -442 -441 -440 -440 -371 -302 -313 -324 -314 -304 -294 -284 -306 -328 -270 -212 -173 -134 -175 -215 -190 -164 -138 -113 -113 -113 -113 -113 -78 -43 -8 26 11
17 11 -2 61 126 103 80 52 23 11 -79 -146 -173 -192 -170 -124 -158 -183 -208 -239 -269 -256 -243 -230 -217 -259 -300 -341 -383 -363 -343 -323 -303 -213 -122 -118 -193 -234 -235
13b35k4k3jQ0P9%o5o6J0RJ7J7J7J7N0N0l0k9j%%%M5M5om7n1K9J09J08M7l2j3K7N0J0m5m5p
10I6qpqJ6J7o4o3j8j9j9j8k8k7k7k7rrrrL9M0m0m1p5p5J0R0K1k0QPl1l1l1l2o0o0K0K0K5K5
6d31K4K5PPPPllklJ0J0RJ0jkq1q2l4l5l0l1K6R1N1N0M2k5q6m7J1N1Q3rn8n8J5J6L5L4L4L4
2c32jkjjm7m6L4L3oopok4k5k5k4j1j1J5k4n4J2N2N2mnmnJ1J0J1J0L8L8L8L7l2l1l2l2ooK1
-2c98j9k2M5M3k4k4k4k8k9J5J6J5J5PQPQk9k9k9k9K4K4K5K4oonojjk7J3J3n3l6NJ1J0J4J3
-6d70l0k9l0l0J6J6J6J6JKk5J5L7l0j2K7N6N6k2k1k8k8k8k8MMLMJ9J9J9J9K9K9K9K9m4m4m4
-10d78m4J3J3J2J3K8K8K8K8n2n2l3M7M3Kl7l7l4l5ONJ1J0K3O3K7n2n0K9J1J0J6J5J7J8p6p6
-13e40k5k5O8O9ppopj3j3j3j4M3M4LLn0n1J6J6k5k5M1M2K2K2K2K2k6k6k6k6n1n1J6J5J9J8
$$ plain form
13 -235 -259 -282 -283 -203 -124 -124 -189 -255 -245 -236 -219 -202 -185 -168 -118 -68 -98 -127 -128 -128 -128 -128 -83 -38 -44 -91 -142 -113 -4 104 151 119 106 133 183 193 148 103 96
10 96 88 81 73 89 106 42 -21 -39 -58 -77 -95 -123 -150 -177 -204 -213 -222 -231 -240 -201 -161 -201 -242 -317 -392 -382 -292 -271 -291 -283 -276 -307 -338 -369 -401 -461 -521 -501 -481 -456 -431
6 -431 -407 -382 -375 -368 -361 -354 -357 -360 -362 -365 -355 -345 -336 -326 -327 -329 -410 -492 -526 -561 -591 -622 -596 -505 -454 -404 -362 -387 -473 -520 -509 -458 -375 -384 -442 -500 -485 -469 -434 -400 -366 -332
2 -332 -333 -335 -336 -337 -384 -430 -396 -363 -369 -375 -382 -388 -412 -437 -462 -486 -497 -508 -493 -517 -571 -559 -507 -455 -459 -464 -468 -473 -462 -452 -441 -431 -393 -355 -317 -280 -312 -343 -375 -407 -413 -419 -398
-2 -398 -417 -439 -394 -351 -375 -399 -423 -451 -480 -465 -449 -434 -419 -412 -404 -397 -389 -418 -447 -476 -505 -481 -457 -432 -408 -414 -420 -425 -431 -432 -433 -460 -447 -434 -487 -523 -518 -507 -497 -483 -470
-6 -470 -500 -529 -559 -589 -573 -557 -541 -525 -524 -522 -547 -532 -495 -525 -537 -510 -454 -398 -420 -441 -469 -497 -525 -553 -549 -545 -542 -538 -519 -500 -481 -462 -433 -404 -375 -346 -390 -434 -478
-10 -478 -522 -509 -496 -484 -471 -443 -415 -387 -359 -411 -463 -496 -449 -406 -404 -441 -478 -512 -547 -541 -536 -525 -515 -492 -429 -402 -454 -504 -475 -464 -454 -438 -423 -406 -388 -464 -540
-13 -540 -565 -590 -522 -453 -460 -467 -473 -480 -493 -506 -519 -533 -490 -446 -443 -440 -490 -541 -525 -509 -534 -559 -518 -476 -454 -432 -410 -388 -414 -440 -466 -492 -543 -594 -578 -563 -544 -526
-17e26m9m8lmL4L4j2n3p5NM4M4Q9Q8L4L4l3l2j3j3j4j3l3l4l4l4O7O6O6O7jjjjJ3J4n3n3o6
-20e00o7j%k3k3j0L0K7m0l7K9P8P7J5J5j1j0j1j1m5m5m6m5%%O7O7J5J5J5J5KLKKj5j5j6j5
-24e12k6k5k6k5L0L0L0L0MMo2o2J1J1J0J1j6j7j6j7M4M5M4M5l2l2l2l2K4K4K4K4J4J5J4J4
-27d30KKJKn4n5n5n4L4L4K9K8M7m6j7K4J2J2J5J4j5j5j5j5m5m5j8n8q0j4L5nLLM0M1K7K7j3
-31f17j2j0j0N7R6O5jk4J6j0rqpK1K0K0K1pppoj7j7j6j7J6J6J6J6k0k1k0k1MLMMLMLMj0j0
-35d95rj0j0j0j0rKLLLj5j6K5K4n6n6J1J0M6M5M5M6n1n1n1n1pqN9N9J9J9k0k1J6J6J6J6no
-39d84nnJ1J2J1J1j5j6j6j5L8L8L8L9j8j7n7n8k0k0M7M7j5j5K5K5m0m1m0m1O6O6%jj9k0j9
-42e23k0J3J2J3J3J7J6J7J7n7n7J0RmnnmMMNMl3l2l2l2KKLKKLKLJ6J6J6J6nmklmL7R0K5n0
$$ plain form
-17 -526 -575 -623 -626 -630 -596 -562 -574 -627 -702 -697 -653 -609 -520 -432 -398 -364 -397 -429 -442 -455 -469 -482 -515 -549 -583 -617 -550 -484 -418 -351 -352 -353 -354 -355 -342 -328 -381 -434 -500
-20 -500 -567 -568 -568 -591 -614 -624 -594 -567 -607 -644 -615 -537 -460 -445 -430 -441 -451 -462 -473 -518 -563 -609 -654 -654 -654 -587 -520 -505 -490 -475 -460 -458 -455 -453 -451 -466 -481 -497 -512
-24 -512 -538 -563 -589 -614 -584 -554 -524 -494 -490 -486 -548 -610 -599 -588 -578 -567 -583 -600 -616 -633 -589 -544 -500 -455 -487 -519 -551 -583 -559 -535 -511 -487 -473 -458 -444 -430
-27 -430 -428 -426 -425 -423 -477 -532 -587 -641 -607 -573 -544 -516 -469 -515 -532 -508 -496 -484 -469 -455 -470 -485 -500 -515 -560 -605 -623 -681 -761 -775 -740 -745 -742 -739 -699 -658 -631 -604 -617
-31 -617 -629 -639 -649 -592 -496 -431 -432 -456 -440 -450 -459 -467 -474 -453 -433 -413 -392 -399 -406 -413 -419 -436 -453 -469 -486 -470 -454 -438 -422 -442 -463 -483 -504 -500 -497 -493 -489 -486 -482 -479 -475 -485 -495
-35 -495 -504 -514 -524 -534 -544 -553 -551 -548 -545 -542 -557 -573 -548 -524 -580 -636 -625 -615 -569 -524 -479 -433 -484 -535 -586 -637 -644 -652 -593 -534 -515 -496 -516 -537 -521 -505 -489 -473 -478 -484
-39 -484 -489 -494 -483 -471 -460 -449 -464 -480 -496 -511 -473 -435 -397 -358 -376 -393 -450 -508 -528 -548 -501 -454 -469 -484 -459 -434 -474 -515 -555 -596 -530 -464 -464 -465 -484 -504 -523
-42 -523 -543 -530 -518 -505 -492 -475 -459 -442 -425 -482 -539 -529 -520 -524 -529 -534 -538 -534 -530 -525 -521 -554 -586 -618 -650 -648 -646 -643 -641 -639 -636 -634 -631 -615 -599 -583 -567 -572 -576 -578 -581 -585 -548 -458 -433 -483
-47d83m9jO6%m1j4j3j1j1j0j1L8L7L8L7JJJJj4j5j4j5KKLKk4k4k4k4J9J9J9J9j8j8k1k0J1
-51e59k8m7J9P9J3j2j3J1J1J1J1l0l0l0l0popojj%jK0K0K0K1m5m4mL6L8k9n0j1L1L1L4L4q
-54e59qqpmmm4m3J7J8Q4Q5KLLLj0j0rj0ppopK3K3K3K3l2l1l2l2LLMLj7j6N9O0Qn7k1k0ooo
-59e72oM4M4M4M4n0m9k2o1q7PK9K9K3j8l3L4K2K2K6K7l6l6l6l6m3m2L7L7M6M6l4l4m0l9O5
-62f48J05Mq9p1nL8L8M3M2J2J2o8o8OPPP%J%Jrj0rrl1l0l1l0J9J9K0J9J9J8J9J8N4N3k6k7
-66e80k5k5k5k5K0J9K0K0j4j5j4j5rj0P0P1lkkln4n4n4n4J3J2J2J2LKKKJ8J8J8J8J8J8J8J7
-70e62rj0j0j0OPPPMMMMJ5J4J4J4nmnnnmnnl2l2l2l3J8J8J7J8llmlllmlQQQQl7l7M3M3K0J9
-75e40K0J9j9j8j9j9RRRQoommK3O3Ko4j7M9QQL3L4L3L4j02j01k1k2lmmml4l3M6M6J8J7J8J8
$$ plain form
-47 -483 -532 -533 -467 -467 -508 -522 -535 -546 -557 -567 -578 -540 -503 -465 -428 -427 -426 -425 -424 -438 -453 -467 -482 -480 -478 -475 -473 -497 -521 -545 -569 -550 -531 -512 -493 -511 -529 -550 -570 -559
-51 -559 -587 -634 -615 -536 -523 -535 -548 -537 -526 -515 -504 -534 -564 -594 -624 -631 -637 -644 -650 -651 -652 -652 -653 -633 -613 -593 -572 -617 -661 -665 -629 -591 -620 -670 -681 -650 -619 -585 -551 -559
-54 -559 -567 -575 -582 -586 -590 -634 -677 -660 -642 -558 -473 -471 -468 -465 -462 -472 -482 -491 -501 -508 -515 -521 -528 -505 -482 -459 -436 -468 -499 -531 -563 -560 -557 -553 -550 -567 -583 -524 -464 -456 -513 -534 -554 -560 -566 -572
-59 -572 -578 -534 -490 -446 -402 -452 -501 -523 -584 -671 -664 -635 -606 -583 -601 -634 -600 -578 -556 -530 -503 -539 -575 -611 -647 -690 -732 -695 -658 -612 -566 -600 -634 -674 -713 -648
-62 -648 -543 -539 -628 -699 -704 -666 -628 -585 -543 -531 -519 -587 -655 -649 -642 -635 -628 -628 -627 -627 -626 -635 -645 -654 -663 -694 -724 -755 -785 -766 -747 -727 -708 -689 -671 -652 -634 -580 -527 -553 -580
-66 -580 -605 -630 -655 -680 -660 -641 -621 -601 -615 -630 -644 -659 -668 -678 -608 -537 -540 -542 -544 -547 -601 -655 -709 -763 -750 -738 -726 -714 -711 -709 -707 -705 -687 -669 -651 -633 -615 -597 -579 -562
-70 -562 -571 -581 -591 -601 -595 -588 -581 -574 -570 -566 -562 -558 -543 -529 -515 -501 -506 -510 -515 -520 -525 -529 -534 -539 -571 -603 -635 -668 -650 -632 -615 -597 -600 -603 -607 -610 -613 -616 -620 -623 -615 -607 -599 -591 -628 -665 -622 -579 -559 -540
-75 -540 -520 -501 -520 -538 -557 -576 -567 -558 -549 -541 -547 -553 -557 -561 -538 -475 -473 -537 -554 -505 -497 -489 -456 -422 -389 -355 -457 -558 -579 -601 -604 -608 -612 -616 -650 -683 -637 -591 -573 -556 -538 -520
-78e20pppqj6j6j7j6N8N9k2k1MLMLO0O0j9k0m3m3m0m1kL7J3J3j4n3j7K4P4L3p4p4nnk8J3N8
-82f19N8Ll6L5L6J5k5rj0K6K5M0Jj7j8j8j8j8j8J6J6M1Jk9J1j4j4k8k8n0j0J7J7J9K0J1J1
-86e60J1J1POM5k3j4j5j9j8M1M1M2k3p6qK9L0k4k3k0j9k7M0KLj7j7j4j4j3K7MNPPPPrj0j2
-90f03j2K1k0LLJ4J4J5J4J6J5o1o2j3K7K9j1j6K4K2j9L0K9K7K7rrl2RN2N2p8p8n8n8K1K2K6
-93f27K5K6K6mllml6l7LML5L6m4m4pppoj2j2j2j2rqrqK1K2K1K1j2j2j1j2K4K5K5K4J4J3J4
-97e79J3J6J6j0K9K6m1jjk3k4k3k3j7j6L7P6M3k3k3k3J9J9k2k1k9k9K3O4L7l0l2l2j2n2o7
-101g35jM6M5M9M9J3J3J3J3rqrqk6k6J4J4M3M3l6l7k4k4k5k4PPo8o9kO4N0Rl8l9lO4O4lm1
-104f35m1K9K8K9K8k0j9k0k0k9l0k9l0K7K7K7K8L2L3K8K9L3l3l5L1K2j7J0Rl0k9l0l0j2j2
$$ plain form
-78 -520 -527 -534 -541 -549 -565 -581 -598 -614 -556 -497 -519 -540 -536 -533 -529 -526 -466 -406 -425 -445 -488 -531 -571 -612 -614 -577 -564 -551 -565 -618 -635 -611 -537 -504 -578 -652 -657 -662 -690 -677 -619
-82 -619 -561 -558 -594 -559 -523 -508 -533 -542 -552 -526 -501 -461 -460 -477 -495 -513 -531 -549 -567 -551 -535 -494 -493 -522 -511 -525 -539 -567 -595 -645 -655 -638 -621 -602 -582 -571 -560
-86 -560 -549 -538 -531 -525 -480 -503 -517 -532 -551 -569 -528 -487 -445 -468 -544 -552 -523 -493 -517 -540 -560 -579 -606 -566 -564 -561 -578 -595 -609 -623 -636 -609 -605 -600 -593 -586 -579 -572 -581 -591 -603
-90 -603 -615 -594 -614 -611 -608 -594 -580 -565 -551 -535 -520 -581 -643 -656 -629 -600 -611 -627 -603 -581 -600 -570 -541 -514 -487 -496 -505 -537 -528 -476 -424 -502 -580 -638 -696 -675 -653 -627
-93 -627 -602 -576 -550 -554 -557 -560 -564 -600 -637 -634 -630 -595 -559 -603 -647 -654 -661 -668 -674 -686 -698 -710 -722 -731 -739 -748 -756 -735 -713 -692 -671 -683 -695 -706 -718 -694 -669 -644 -620 -606 -593 -579
-97 -579 -566 -550 -534 -544 -515 -489 -530 -531 -532 -555 -579 -602 -625 -642 -658 -621 -545 -502 -525 -548 -571 -552 -533 -555 -576 -605 -634 -611 -547 -510 -540 -572 -604 -616 -668 -735
-101 -735 -736 -690 -645 -596 -547 -534 -521 -508 -495 -504 -512 -521 -529 -555 -581 -567 -553 -510 -467 -503 -540 -564 -588 -613 -637 -630 -623 -691 -760 -762 -698 -648 -639 -677 -716 -719 -655 -591 -594 -635
-104 -635 -676 -647 -619 -590 -562 -582 -601 -621 -641 -670 -700 -729 -759 -732 -705 -678 -650 -618 -585 -557 -528 -495 -528 -563 -532 -510 -527 -517 -508 -538 -567 -597 -627 -639 -651
-108f51j2j2J7J8J8J8L3L3L3L4k4k3k4k3j5j6j6j5K7K8K8K7K5K6K5K5n1n1n1n1MNMMPPk1J8
-111e92L3o0k8J2%JLLj3j2j2j2J8J7J8J8L2L2L2L2j8j8j8j8J9J9J8J9m4m4m4m5k1k1k1k1R
-115g27RRRL4L5L4L4j6j5j6j6LLLLJ3J3J3J3pqpql1l0l1l1NONNKKO9O8j1j1jq1n6K4J3J4N
-119f57Nl4l5POPPj%jjK3K3K2K3kjkjm5m4m5m5ooooL7L7L7L7M5M5M5M5nnnnm4m5m4m5K6K5
-123f34K5K6m3m3m3m3K1K0K1K0nnnmjj%jN1N2Np4q8m9nL5K4K3j4j3j3j3N4N3J8J8J8J7l2l2
-127f60k9l0M8Q7M5l4l1RPl4lL7J2J2kklkj6j5j6j6PQPQk1k1k1k1k1k1k1k1J0J0J0J0L3L3
-131f68L3L4L2L2P7kk8k8l2l3k8k8k9k8KJKKJ9K0O4j5j11j10k7N3L8L8M3M3M0M0m0m0j5j5
-134f64j5j5m3m4qP1K5K5L0L0k8k9k8k8K1K1K1K2j6j5j0j1m5L5j0j0M5M4M5M5k7k7k7k7O0
$$ plain form
-108 -651 -663 -675 -658 -640 -622 -604 -571 -538 -505 -471 -495 -518 -542 -565 -580 -596 -612 -627 -600 -572 -544 -517 -492 -466 -441 -416 -467 -518 -569 -620 -616 -611 -607 -603 -596 -589 -610 -592
-111 -592 -559 -619 -647 -635 -635 -634 -631 -628 -641 -653 -665 -677 -659 -642 -624 -606 -574 -542 -510 -478 -496 -514 -532 -550 -531 -512 -494 -475 -519 -563 -607 -652 -673 -694 -715 -736 -727
-115 -727 -718 -709 -700 -666 -631 -597 -563 -579 -594 -610 -626 -623 -620 -617 -614 -601 -588 -575 -562 -569 -577 -584 -592 -623 -653 -684 -715 -710 -704 -699 -694 -692 -690 -621 -553 -564 -575 -576 -657 -713 -689 -676 -662 -657
-119 -657 -652 -686 -721 -714 -708 -701 -694 -695 -695 -696 -697 -674 -651 -629 -606 -608 -609 -611 -612 -657 -701 -746 -791 -797 -803 -809 -815 -778 -741 -704 -667 -622 -577 -532 -487 -492 -497 -502 -507 -551 -596 -640 -685 -659 -634
-123 -634 -609 -583 -626 -669 -712 -755 -734 -714 -693 -673 -678 -683 -688 -692 -693 -694 -694 -695 -644 -592 -587 -661 -749 -798 -803 -768 -744 -721 -735 -748 -761 -774 -720 -667 -649 -631 -613 -596 -628 -660
-127 -660 -689 -719 -671 -584 -539 -573 -604 -595 -588 -622 -625 -588 -576 -564 -566 -568 -571 -573 -589 -604 -620 -636 -629 -621 -614 -606 -627 -648 -669 -690 -711 -732 -753 -774 -764 -754 -744 -734 -701 -668
-131 -668 -635 -601 -569 -537 -460 -462 -490 -518 -550 -583 -611 -639 -668 -696 -694 -693 -691 -689 -670 -650 -586 -601 -712 -822 -849 -796 -758 -720 -677 -634 -594 -554 -594 -634 -649 -664
-134 -664 -679 -694 -737 -781 -789 -718 -693 -668 -638 -608 -636 -665 -693 -721 -700 -679 -658 -636 -652 -667 -677 -688 -733 -698 -708 -718 -673 -629 -584 -539 -566 -593 -620 -647 -587
-137e87N9k0k0k7k7QQ8O3O3j6r5p7Km8m8k8k8k8k8QPJ2J3jP9L4L4M9N0l0l0jkkkm2m2l8l8
-141g36k5M1MLj0j1j1j1L2L3L2L2%%%%j7j6j9k0J5k6m2K3M0JMM5K5K4n2n3M3M2L8L8Pn9m5
-145f31nK6K5K8K7llllPOPPm8m9m8m9QRQQJ2J3J3J2kkklL7L6m4m3j5j5j6j5L3L3L3L3lmml
-149e92%J%JJ7J7J3J3ko8o8kN1N1k4k5k0k0k1k0kkkkQQPQkkklMMMMpqqpl0l0N0N0J5J5J5J5
-154e98J1J2J1J1l3l3M6M6k3k4k3k3rqrqL0K9L0L0n8n8K2K1k5k6k2k1k0M6L2rL0K9K4K4Pl2
-157e71m7J9J9J9K4K4PPPPo4o3o3o4M5M5l3l2J1N0O6jk9k9l4l3KLKLJ2J2J3J2J6J6J6J6OO
-161e78POl5l5l4l5J7J7J6J7K8K8n3n2k4k4N6N6M2M3r1r1J2J2J3J2K3K3K3K3k0k0k0k1l1l1
-164g21l2l1L2L1L2L2LKLKk5k6k6k5Q3Q4LMm6m6m7m6o1o1L0R7K2m4llkllkK0K1K1K0L4L3Q6
$$ plain form
-137 -587 -528 -548 -568 -595 -622 -614 -526 -463 -400 -416 -511 -588 -586 -634 -682 -710 -738 -766 -794 -786 -779 -767 -754 -755 -676 -642 -608 -559 -509 -539 -569 -570 -572 -574 -576 -618 -660 -698 -736
-141 -736 -761 -720 -716 -713 -723 -734 -745 -756 -724 -691 -659 -627 -627 -627 -627 -627 -644 -660 -679 -699 -684 -710 -752 -729 -689 -688 -684 -639 -614 -590 -642 -695 -652 -610 -572 -534 -527 -586 -631
-145 -631 -636 -610 -585 -557 -530 -533 -536 -539 -542 -535 -529 -522 -515 -563 -612 -660 -709 -701 -692 -684 -676 -664 -651 -638 -626 -628 -630 -632 -635 -598 -562 -606 -649 -664 -679 -695 -710 -677 -644 -611 -578 -581 -585 -589 -592
-149 -592 -592 -591 -591 -590 -573 -556 -543 -530 -532 -600 -668 -670 -619 -568 -592 -617 -637 -657 -678 -698 -700 -702 -704 -706 -698 -690 -683 -675 -677 -679 -681 -684 -680 -676 -672 -668 -675 -683 -691 -698 -728 -758 -708 -658 -643 -628 -613 -598
-154 -598 -587 -575 -564 -553 -586 -619 -573 -527 -550 -574 -597 -620 -629 -637 -646 -654 -624 -595 -565 -535 -593 -651 -629 -608 -633 -659 -681 -702 -722 -676 -644 -653 -623 -594 -570 -546 -539 -571
-157 -571 -618 -599 -580 -561 -537 -513 -506 -499 -492 -485 -549 -612 -675 -739 -694 -649 -682 -714 -703 -653 -587 -588 -617 -646 -680 -713 -711 -708 -706 -703 -691 -679 -666 -654 -638 -622 -606 -590 -584 -578
-161 -578 -571 -565 -600 -635 -669 -704 -687 -670 -654 -637 -609 -581 -634 -686 -710 -734 -678 -622 -580 -537 -628 -719 -707 -695 -682 -670 -647 -624 -601 -578 -598 -618 -638 -659 -690 -721
-164 -721 -753 -784 -752 -721 -689 -657 -654 -652 -649 -647 -672 -698 -724 -749 -666 -582 -579 -575 -621 -667 -714 -760 -821 -882 -852 -755 -733 -777 -780 -783 -785 -788 -791 -793 -773 -752 -731 -711 -677 -644 -558
-168e58qo1o2J3J3O0O0J8m8p6p6%jK2K2K2K2LMLMJ7J6J7J7opopj9j9j9j9n0n0j1N5K0m5k7
-172g67J4JKMMk2k2k2k2L4L5L4L5j3j2j3j2j3j3j2j3K3K2K2K2K2K2K3K2k3k4o0OK5K5K9L0
-176f07k7k7k7k7mmlmJ9K0K0J9mlmmrrrrK7K7K8K7mlmmj0rj0rk1k1M6M6k8k9k8k8QPQQNON
-180f63NL1L1J9k1q4lM1M2k2k2k2k3PPPPj9j9k0j9rrrrM4M4M4M4l3l2l0l0KM2O7j3m3mJ7o3
-184g20m6ol3l4NONOJ9K0K0K0J5J4O3j8n4j4m2m1J1J0J1J1RRRRjjL9L9K9L0l7l7q0q0l5M6
-188h24P5L6l0l1M8M9QQkkkkL2L2L2L2rqrql4l5l4l4n5n5J1J1K7K6j3j4LKKKK1K0K1K0j2j2
-192g07N5N5%J%Jm3m3l9l9nO2M6Pn2n3J1J2M1M1k5k5ppppJ6J7J6J7K0K0k0k0RJ0n8n7k0k0
-195g97P2P3k7k7k7k6j2j2j4j4N6J6lO3K4m3k3J6L3L3L5L5l3l3l3l3j0j0j0j0K1K0K1K1j%
$$ plain form
-168 -558 -566 -627 -689 -676 -663 -603 -543 -525 -573 -649 -725 -725 -726 -704 -682 -660 -638 -635 -631 -628 -624 -607 -591 -574 -557 -563 -570 -576 -583 -602 -621 -640 -659 -709 -759 -770 -715 -695 -740 -767
-172 -767 -753 -752 -750 -746 -742 -764 -786 -808 -830 -796 -761 -727 -692 -705 -717 -730 -742 -755 -768 -780 -793 -770 -748 -726 -704 -682 -660 -637 -615 -638 -662 -722 -716 -691 -666 -637 -607
-176 -607 -634 -661 -688 -715 -719 -723 -726 -730 -711 -691 -671 -652 -656 -659 -663 -667 -676 -685 -694 -703 -676 -649 -621 -594 -598 -601 -605 -609 -619 -628 -638 -647 -668 -689 -643 -597 -625 -654 -682 -710 -702 -695 -687 -679 -674 -668 -663
-180 -663 -658 -627 -596 -577 -598 -682 -685 -644 -602 -624 -646 -668 -691 -684 -677 -670 -663 -682 -701 -721 -740 -749 -758 -767 -776 -732 -688 -644 -600 -633 -665 -695 -725 -723 -681 -614 -627 -670 -674 -657 -720
-184 -720 -766 -772 -805 -839 -834 -828 -823 -817 -798 -778 -758 -738 -723 -709 -646 -664 -718 -732 -774 -815 -804 -794 -783 -772 -763 -754 -745 -736 -737 -738 -699 -660 -631 -601 -638 -675 -755 -835 -870 -824
-188 -824 -749 -713 -743 -774 -726 -677 -669 -661 -663 -665 -667 -669 -637 -605 -573 -541 -550 -558 -567 -575 -609 -644 -678 -712 -767 -822 -811 -800 -773 -747 -760 -774 -771 -769 -767 -765 -744 -724 -703 -683 -695 -707
-192 -707 -652 -597 -597 -596 -596 -595 -638 -681 -720 -759 -764 -702 -656 -649 -701 -754 -743 -731 -690 -649 -674 -699 -706 -713 -720 -727 -711 -694 -678 -661 -641 -621 -641 -661 -652 -642 -700 -757 -777 -797
-195 -797 -725 -652 -679 -706 -733 -759 -771 -783 -797 -811 -755 -739 -742 -679 -655 -698 -721 -705 -672 -639 -604 -569 -602 -635 -668 -701 -711 -721 -731 -741 -720 -700 -679 -658 -659 -659
-199f59%%k0j9K1K0k9k9L7L7RRQRk4k3k4k4M4M4M3M4j3j3j3j3k7k8k8k7KKKLJ2J2J2J3j3j3
-203f56j3j2l7l7M3M3J5J5J4J5k2k2k1k2J4J5J5J5mllmL2L1m8m8RJ0RJ0J4J5J5J4k7k7k7k7
-206f97lmmlK2K3K3K3K2K3K3K2m7m8m7m8LKLKlkklM1M1M1M0o2o3o2o3ooooL0L1L1L0ooj0j0
-210g41L9k7l0L7Nl4l5NJ03L6k6J3J6J5J8J7QPQPl6l6l6l5j6j5j5j6J5J5J4J5opopn1n2K9
-214h05K8j%j%M1M1M1M1l1l2l1l2k2k1k2k1K2K3K2K3jjjjPPPPL6L7L7L6l1l2l2l2NMNNj1j2
-218f98j1j1NNONk6k6k7k6L5L6m5m5pqqqK3K4K4K3O0O1O0O0m9n0m9n0j1j0j1j1J9K0J9J9K0
-222f63J9K0K0l7l7l7l7nnonO8O8j2j2k8k7N2N2O1O1p3p2j2j1j2j2k5k5k5k5N1N1k9k9l0k9
-225g97N1N1J1J1J1J2m9m9qrK2K3o5o6k2N8P4P4O1j8o1o2j8O1J7J7PQQPMLMLL9M0k8k7n1n1
$$ plain form
-199 -659 -659 -659 -679 -698 -677 -657 -686 -715 -678 -641 -632 -623 -615 -606 -630 -653 -677 -701 -657 -613 -570 -526 -539 -552 -565 -578 -605 -633 -661 -688 -686 -684 -682 -679 -667 -655 -643 -630 -643 -656
-203 -656 -669 -681 -718 -755 -712 -669 -654 -639 -625 -610 -632 -654 -675 -697 -683 -668 -653 -638 -642 -645 -648 -652 -620 -589 -637 -685 -676 -666 -657 -647 -633 -618 -603 -589 -616 -643 -670 -697
-206 -697 -700 -704 -708 -711 -689 -666 -643 -620 -598 -575 -552 -530 -577 -625 -672 -720 -717 -715 -712 -710 -713 -715 -717 -720 -679 -638 -597 -557 -619 -682 -744 -807 -813 -819 -825 -831 -801 -770 -739 -709 -715 -721 -731 -741
-210 -741 -702 -729 -759 -722 -717 -751 -786 -781 -678 -642 -668 -655 -639 -624 -606 -589 -581 -574 -566 -559 -595 -631 -667 -702 -718 -733 -748 -764 -749 -734 -720 -705 -711 -718 -724 -731 -782 -834 -805
-214 -805 -777 -778 -778 -779 -779 -738 -697 -656 -615 -646 -678 -709 -741 -763 -784 -806 -827 -805 -782 -760 -737 -738 -739 -740 -741 -734 -727 -720 -713 -677 -640 -603 -567 -598 -630 -662 -694 -689 -685 -680 -675 -686 -698
-218 -698 -709 -720 -715 -710 -704 -699 -725 -751 -778 -804 -769 -733 -778 -823 -830 -838 -846 -854 -831 -807 -783 -760 -700 -639 -579 -519 -568 -618 -667 -717 -728 -738 -749 -760 -741 -721 -702 -683 -663
-222 -663 -644 -624 -604 -641 -678 -715 -752 -757 -762 -768 -773 -705 -637 -649 -661 -689 -716 -664 -612 -551 -490 -563 -635 -647 -658 -670 -682 -707 -732 -757 -782 -731 -680 -709 -738 -768 -797
-225 -797 -746 -695 -684 -673 -662 -650 -699 -748 -756 -765 -743 -720 -785 -851 -873 -815 -741 -667 -606 -624 -685 -747 -765 -704 -687 -670 -663 -655 -647 -640 -636 -633 -629 -626 -587 -547 -575 -602 -653 -704
-229g04J6J6LMLMm2m3m2m2N0N0M5M5K0o0j5j5nnnnnnnoj6j7j7j7%j%%J9J9J9J9POPPj4j4N3
-233f88N3pqqqj1j1j1j1J2J3J2J2j9k0j9k0K4K4K4K4NOOOj3j2K7K7l7l7K9K9n8n8j8j8PPO
-237g39PJ0RRRn0n0n0n0J4J3J3J3M3M3M3M3j8j8j8j8K6K5m1m1L5L6L5L6RRn7n8MLMLrj0rj0
-241g52NNNMk9k9L8L8l3l2QPj0j1j1j1L3L2L3L2m6m6K1K0l9m0J%RQQRJ1J0J1J1rrrrk6k6k6
-245h44k5N6N6N6N6j6j6q3q2K1K1K1K1mmO2O3rj0j0rnonoj8j9j9j8j6j5N1N1J4J3k6k6K5K5
-249f79j4j5k7k8J3J2J8J7J5J5j6n6p1nP1P1j8j8MMNMQQQRRJ0RJ0k0k0k1k0oonoj6j5j6j6
-253g94ooopL1L0L0L1qpqpK2K3m4m4j9j9K1K1J1J1J1J1lllll6l7N7N7L7L7k6k7j4K7Mo2q2
-256g99m3kkk0k1k0k1K5K5O5O5L7L6k9l0poK0k0l2L5K0k0RM8M6OPQNNk6k6k6k6k6k6k6k6Q
$$ plain form
-229 -704 -688 -672 -669 -665 -662 -658 -700 -743 -785 -827 -777 -727 -682 -637 -617 -677 -692 -707 -712 -717 -722 -727 -732 -737 -742 -748 -764 -781 -798 -815 -815 -816 -816 -816 -797 -778 -759 -740 -733 -727 -720 -713 -727 -741 -688
-233 -688 -635 -642 -650 -658 -666 -677 -688 -699 -710 -698 -685 -673 -661 -680 -700 -719 -739 -715 -691 -667 -643 -638 -632 -626 -620 -633 -645 -618 -591 -628 -665 -636 -607 -665 -723 -741 -759 -752 -745 -739
-237 -739 -732 -722 -713 -704 -695 -745 -795 -845 -895 -881 -868 -855 -842 -799 -756 -713 -670 -688 -706 -724 -742 -716 -691 -732 -773 -738 -702 -667 -631 -622 -613 -670 -728 -724 -721 -717 -714 -723 -733 -742 -752
-241 -752 -747 -742 -737 -733 -762 -791 -753 -715 -748 -780 -772 -765 -775 -786 -797 -808 -775 -743 -710 -678 -724 -770 -749 -729 -768 -808 -807 -807 -798 -790 -782 -773 -762 -752 -741 -730 -739 -748 -757 -766 -792 -818 -844
-245 -844 -869 -813 -757 -701 -645 -661 -677 -760 -842 -821 -800 -779 -758 -762 -766 -704 -641 -650 -660 -670 -679 -684 -690 -695 -701 -719 -738 -757 -775 -791 -806 -755 -704 -690 -677 -703 -729 -704 -679
-249 -679 -693 -708 -735 -763 -750 -738 -720 -703 -688 -673 -689 -745 -816 -821 -750 -679 -697 -715 -711 -707 -702 -698 -690 -682 -674 -665 -656 -646 -637 -627 -647 -667 -688 -708 -714 -720 -725 -731 -747 -762 -778 -794
-253 -794 -800 -806 -812 -819 -788 -758 -728 -697 -705 -712 -720 -727 -705 -682 -726 -770 -789 -808 -787 -766 -755 -744 -733 -722 -725 -728 -731 -734 -770 -807 -750 -693 -656 -619 -645 -672 -686 -659 -655 -717 -799
-256 -799 -842 -844 -846 -866 -887 -907 -928 -903 -878 -813 -748 -711 -675 -704 -734 -741 -747 -727 -747 -779 -744 -724 -744 -735 -687 -641 -635 -628 -620 -615 -610 -636 -662 -688 -714 -740 -766 -792 -818 -810
-260h10RQRKLLKk0k0M6M6M8M8QQppqppqppj4j3K6K7n7n6jO5M7M7J2J1j3j3K7K7k3k4k4k3p
-264f47pm9J8J0n6l8LJ9J9K2K2K0K1K0K0klppj9q5o6k6N2J17O9k4OOlmJ9m7r6n6nL4J5J4J3
-268g08J3k7L9M6Nl4l4J0J1J0J1j5j4j5j5NMNMJ9J9m7m8mnmmN0N0j7j6J3J3J4J3k1k0J9J9
-272f56K4K4m2m3K7K7K7K6k0k1k1k0J8J8rL1Oo1m4lnnlkPQJ0J0j6K5M9l0k2J8j0rl1l2l1l1
-276h12n3n3M0M1O9P0k3k4K0K0m6m7k1k1M6M5K9K9l8l7QQl2l2p8p8l1M7L9jJM2M4NL0K9k0
-279g85k1k0k0QRRQp1p0k0N9O5J05O5j4j8j9J7J6m5m5nnL0L0j0j0NNNNJ1J1J1J1%JJJJ3J2
-283f65QQJ8o1l9JK4K4k4N6K3n8l3Qj5n5k9l0K5K4K5K4LLKLMLn8n9k7M0KKk1k1k2k1j5j5j6
-287i54j5J5J4J1J0J1n5n5J2N7N8K3K2K4K4j5n6n0J7M4M3K3K3K3K3MMMMK7K7K7K7m3m3m3m3
$$ plain form
-260 -810 -801 -793 -784 -782 -779 -776 -774 -794 -814 -768 -722 -674 -626 -618 -610 -617 -624 -632 -639 -646 -654 -661 -668 -682 -695 -669 -642 -699 -755 -756 -691 -644 -597 -585 -574 -587 -600 -573 -546 -569 -593 -617 -640 -647
-264 -647 -654 -703 -685 -675 -731 -769 -766 -747 -728 -706 -684 -664 -643 -623 -603 -605 -608 -615 -622 -641 -726 -792 -818 -766 -649 -580 -604 -598 -592 -595 -599 -580 -627 -723 -779 -784 -750 -735 -721 -708
-268 -708 -695 -722 -683 -637 -632 -666 -700 -690 -679 -669 -658 -673 -687 -702 -717 -712 -708 -703 -699 -680 -661 -708 -756 -760 -765 -769 -773 -723 -673 -690 -706 -693 -680 -666 -653 -674 -694 -675 -656
-272 -656 -632 -608 -650 -693 -666 -639 -612 -586 -606 -627 -648 -668 -650 -632 -641 -610 -604 -665 -709 -712 -717 -722 -725 -727 -720 -712 -702 -692 -708 -683 -634 -664 -686 -668 -678 -687 -718 -750 -781 -812
-276 -812 -865 -918 -878 -837 -768 -698 -721 -745 -725 -705 -751 -798 -819 -840 -794 -749 -720 -691 -729 -766 -758 -750 -782 -814 -892 -970 -1001 -954 -915 -916 -915 -873 -829 -824 -794 -765 -785
-279 -785 -806 -826 -846 -838 -829 -820 -812 -883 -953 -973 -914 -849 -744 -679 -693 -711 -730 -713 -697 -742 -787 -792 -797 -767 -737 -747 -757 -752 -747 -742 -737 -726 -715 -704 -693 -693 -692 -691 -690 -677 -665
-283 -665 -657 -649 -631 -692 -731 -730 -706 -682 -706 -650 -627 -685 -718 -710 -725 -780 -809 -839 -814 -790 -765 -741 -738 -735 -733 -730 -726 -723 -781 -840 -867 -827 -825 -823 -844 -865 -887 -908 -923 -938 -954
-287 -954 -969 -954 -940 -929 -919 -908 -963 -1018 -1006 -949 -891 -868 -846 -822 -798 -813 -869 -919 -902 -858 -815 -792 -769 -746 -723 -719 -715 -711 -707 -680 -653 -626 -599 -642 -685 -728 -771
-290g71j1j1j1j0J2J2J3J2L1L1L0L1k6k6k5k6j9j8j9j8M4M5k2k2kjL8L8m3m4llJ7J8k3k2K
-294h02KLKkkjkQQQQKKKKk8k8k8k8J2J2J2J2KKKKO2O3O2O3j%jjk8k8k8k8m2m2K4K4K7K7K6
-298f39K7l9l9l9l9K2K1N9pm0m0m4m4RRRQk5k5J4J5m2m2kO4M0%j4j4J3J4J3J3O8O8j2j2QQ
-302f56J9N9P0k4j25q4mnjkMML1j0k5M0K3j6J8J8o4o4KLKLj7j7j6j7noL1L0L6l0p3p3j9j9
-306i79K1K1N7N6N7N6onool5l6l6l6jkjkK2K1K2K2j6j6j6j6M0M1M1M0rj0rj0rj0rj0J3J4J3
-310g34J3J1J1RQK1j9j2n2m6pM8M8L0K9K9L0k9k9l2l1nm4m5mK0K0K3K3nnm5K2M9J0j9n9l5
-313h03Ok0j9J6J6J2J2M5k1q4m4nL5J5J6K1K1J8J9J4k7k8J1J7k2j9K0NOJ0J0k2J8N3m1n0J8
-317g71jm1k7J3J1k9k9k8K2O2N7rm9m9J3J4J5J6J4N3K7K7Qn8n9QJ1J0J5J5k2k1k2k2POOOK3
$$ plain form
-290 -771 -782 -793 -804 -814 -802 -790 -777 -765 -734 -703 -673 -642 -668 -694 -719 -745 -764 -782 -801 -819 -775 -730 -752 -774 -776 -777 -739 -701 -744 -788 -791 -794 -777 -759 -782 -804 -802
-294 -802 -800 -797 -795 -797 -799 -800 -802 -794 -786 -778 -770 -768 -766 -764 -762 -790 -818 -846 -874 -862 -850 -838 -826 -824 -822 -820 -818 -756 -693 -631 -568 -569 -569 -570 -571 -599 -627 -655 -683 -725 -767 -743 -719 -692 -665 -639
-298 -639 -612 -651 -690 -729 -768 -746 -725 -666 -673 -713 -753 -797 -841 -832 -823 -814 -806 -831 -856 -842 -827 -869 -911 -913 -849 -809 -809 -823 -837 -824 -810 -797 -784 -716 -648 -660 -672 -664 -656
-302 -656 -637 -578 -508 -532 -657 -741 -745 -750 -751 -753 -749 -745 -714 -724 -749 -709 -686 -702 -684 -666 -730 -794 -792 -789 -787 -784 -801 -818 -834 -851 -856 -862 -831 -801 -765 -795 -868 -941 -960 -979
-306 -979 -958 -937 -880 -824 -767 -711 -717 -722 -728 -734 -769 -805 -841 -877 -878 -880 -881 -883 -861 -840 -818 -796 -812 -828 -844 -860 -820 -779 -738 -698 -707 -717 -726 -736 -745 -755 -764 -774 -761 -747 -734
-310 -734 -721 -710 -699 -690 -682 -661 -680 -692 -744 -790 -797 -749 -701 -671 -642 -613 -583 -612 -641 -673 -704 -709 -753 -798 -802 -782 -762 -739 -716 -721 -726 -771 -749 -700 -690 -709 -768 -803
-313 -803 -797 -817 -836 -820 -804 -792 -780 -735 -756 -840 -884 -889 -854 -839 -823 -802 -781 -763 -744 -730 -757 -785 -774 -757 -779 -798 -778 -773 -767 -757 -747 -769 -751 -698 -739 -789 -771
-317 -771 -772 -813 -840 -827 -816 -845 -874 -902 -880 -818 -761 -770 -819 -868 -855 -841 -826 -810 -796 -743 -716 -689 -681 -739 -798 -790 -779 -769 -754 -739 -761 -782 -804 -826 -819 -813 -807 -801 -778
-320g78K3K2K3l3l3l0l1kL8N7j0p5rN2J2J1J0QQj9j9j8j9j6j7m3lM1k7rL1M8M8N0N0k2k2k2
-324g25k2j8j8j8j8j9j8PP3M3k4m8m8K0K0K1K0K4K4K3K4q0q0%O6L0j0J4J4K4j5J0P6K1K1m1
-327f27m1j5j5j4j5j9j9j9j9j3j3j3j4MLLMKKKKKKKLkjkjj8j8j8j8J2J2J2J2R6R6k4k3n1n1
-331h12n0n1K1K1K0K1N1N1j6j6kjkjmlllM4M3n0m9n1n0k6M1L3l4l0L7Q5Q4mml1l0l1l1L9L9
-335g55kjm6m6K0K1pppoO8O9LKJ0J1l0k9J4J3k6k6k4k3J6J6ONM5M6k2k1k2k2l5l6l3l3k8J3
-339i09L1l7j6K4k6J5L9M0M2M2jjjjm7m7m6m7K3K4K3K3JJJJJJJJK8K8K8K8J9J8m9m8M0M1k6
-343g38k7K8K8k3r1r2k7L9J05Q0M0%%j1j0j1j0nnnmooonJ1J1J0J1JJJ%JJ%Jj1j2j1j1NNJ%
-347g47qq8o6k6K4K3K6K6L8L9L8L8n8n8n8n8J5J5J5J5J3J4N3N3m5m5K2K2RRl0l1onK1j8m3
$$ plain form
-320 -778 -755 -733 -710 -743 -776 -806 -837 -839 -801 -744 -754 -829 -838 -786 -774 -763 -753 -745 -737 -756 -775 -793 -812 -828 -845 -888 -891 -850 -877 -886 -855 -807 -759 -709 -659 -681 -703 -725
-324 -725 -747 -765 -783 -801 -819 -838 -856 -849 -776 -733 -757 -805 -853 -833 -813 -792 -772 -748 -724 -701 -677 -757 -837 -837 -771 -741 -751 -737 -723 -699 -714 -704 -628 -607 -586 -627
-327 -627 -668 -683 -698 -712 -727 -746 -765 -784 -803 -816 -829 -842 -856 -852 -849 -846 -842 -840 -838 -836 -834 -832 -830 -828 -825 -827 -828 -830 -831 -849 -867 -885 -903 -891 -879 -867 -855 -759 -663 -687 -710 -761 -812
-331 -812 -862 -913 -892 -871 -851 -830 -779 -728 -744 -760 -762 -763 -765 -766 -770 -773 -776 -779 -735 -692 -742 -791 -842 -892 -918 -877 -844 -878 -908 -871 -786 -702 -706 -710 -741 -771 -802 -833 -794 -755
-335 -755 -757 -758 -804 -850 -830 -809 -816 -823 -830 -836 -768 -699 -696 -694 -684 -673 -703 -732 -718 -705 -731 -757 -781 -804 -788 -772 -766 -761 -716 -670 -692 -713 -735 -757 -792 -828 -861 -894 -922 -909
-339 -909 -878 -915 -931 -907 -933 -918 -879 -839 -797 -755 -756 -757 -758 -759 -806 -853 -899 -946 -923 -899 -876 -853 -852 -851 -850 -849 -848 -847 -846 -845 -817 -789 -761 -733 -714 -696 -745 -793 -753 -712 -738
-343 -738 -765 -737 -709 -732 -823 -915 -942 -903 -798 -718 -678 -678 -678 -689 -699 -710 -720 -725 -730 -735 -739 -745 -751 -757 -762 -751 -740 -730 -719 -718 -717 -716 -716 -715 -714 -714 -713 -724 -736 -747 -758 -753 -748 -747 -747
-347 -747 -755 -843 -909 -935 -911 -888 -862 -836 -798 -759 -721 -683 -741 -799 -857 -915 -900 -885 -870 -855 -842 -828 -775 -722 -767 -812 -790 -768 -759 -750 -780 -811 -817 -822 -801 -819 -862
-351h62L7J2k9pqj5O4Q7Q6kkm6m7r1j1J4J5J9J9mnmnqrooJ8N7J4o6m7m7j3j2POPOL3L2L2L3
-355g54j4j4j4j4J4J4l3M6L1j0J7J8J5J5J5J5kklkl3l2l2l2j3j2j3j3j2j3j2j3NNk3J7K6n5
-358i17k9J0L5L5L7L7PPPQJ4J5J4J5k3k2k2k2lllkJJJKm0l9K7K7opooLKO4O4J6o4o4J6M6M5
-362g22j6j5L6L6llm2m2kkNOl5l4j3j4J5k6l2M7M8l3j8K1ooL3L3L3L3ONOOj1j1j1j1j3j2j3
-366g77j3j3j3j3j3j%jjl9l9m6L3P8L9jjK0J9K0K0%%%%n0n0n0n0L2L2L2L2J3J3J2J3n1n1J5
-370h50J6J0J1l0k9llllL1L1L1L1k4k3k4k4rj0j0rn3n3J4J3K2K2K2K2N4N5j2j2l6l5j0m9l4
-374i63L2N9N9L6L6L6L5k2k3k3k3%J%Jk5k4k5k4L9L8L9L9k5k5k5k4kjkkj1j1j1j1j2j3K7K7
-377h23k0k1M2M2n3j18m1N3K7K7L3L3J6J5J6J5RQRQJ9J8J9J8l3l4l3l4j4j5j4j4l4l4OPM4
$$ plain form
-351 -862 -825 -813 -842 -849 -857 -872 -808 -721 -635 -637 -639 -685 -732 -823 -834 -820 -805 -786 -767 -771 -776 -780 -785 -793 -802 -808 -814 -796 -739 -725 -791 -838 -885 -898 -910 -903 -897 -890 -884 -851 -819 -787 -754
-355 -754 -768 -782 -796 -810 -796 -782 -815 -769 -738 -748 -731 -713 -698 -683 -668 -653 -655 -657 -660 -662 -695 -727 -759 -791 -804 -816 -829 -842 -854 -867 -879 -892 -887 -882 -905 -888 -862 -917
-358 -917 -946 -936 -901 -866 -829 -792 -785 -778 -771 -763 -749 -734 -720 -705 -728 -750 -772 -794 -797 -800 -803 -805 -804 -803 -802 -800 -840 -879 -852 -825 -831 -838 -844 -850 -847 -845 -781 -717 -701 -765 -829 -813 -767 -722
-362 -722 -738 -753 -717 -681 -684 -687 -729 -771 -773 -775 -770 -764 -799 -833 -846 -860 -845 -871 -903 -856 -808 -841 -859 -838 -844 -850 -817 -784 -751 -718 -712 -707 -701 -695 -706 -717 -728 -739 -752 -764 -777
-366 -777 -790 -803 -816 -829 -842 -843 -843 -844 -845 -884 -923 -969 -936 -858 -819 -820 -821 -801 -782 -762 -742 -742 -742 -742 -742 -792 -842 -892 -942 -910 -878 -846 -814 -801 -788 -776 -763 -814 -865 -850
-370 -850 -834 -824 -813 -843 -872 -875 -878 -881 -884 -853 -822 -791 -760 -784 -807 -831 -855 -864 -874 -884 -893 -946 -999 -985 -972 -950 -928 -906 -884 -830 -775 -787 -799 -835 -870 -880 -929 -963
-374 -963 -931 -872 -813 -777 -741 -705 -670 -692 -715 -738 -761 -761 -760 -760 -759 -784 -808 -833 -857 -818 -780 -741 -702 -727 -752 -777 -801 -803 -804 -806 -808 -819 -830 -841 -852 -864 -877 -850 -823
-377 -823 -843 -864 -822 -780 -833 -951 -992 -939 -912 -885 -852 -819 -803 -788 -772 -757 -748 -740 -731 -723 -704 -686 -667 -649 -682 -716 -749 -783 -797 -812 -826 -840 -874 -908 -902 -895 -851
-381h51M4k2k2LLLKjjkjj0j0j0j0OOOOj6j6P7P7k3k4Ml7q1j4J6J7K2Q9N1N1j9k0k0k0mlll
-385g60k9l0k9k9j0j0N7N7%JJ%J5J5J5J5pppoj1j0n0n0PPM7Q6N0j8m4m3k4k3j9j8k0M6L2q
-389h11PPNMj2j2j2j2J4J5J5J4K5K4K5K4j4j5j4j4k4k4k5k4J6J5J6J6NOONL0K9K9K9l6l6l7
-392g41l6o9o9klN5N5J6J5l6l6MLopL3L3JJKJl2l1l2l2Q4Q4rrK1K0K0K0LMLMl7l7K6K6K1m6
-396g15p1l1j4j4j2j1LMMMQQQQk7k6M0L9l9l9K7K8M7M7j9j9LMLLJ5J6J5n1n9j9M8M8MMl5l6
-400g99pqpprqrqK8K8K8K8qqrql6l5l6l6M5M5k1k1mlllj0j1N7N6l8l7l8l8M3M2M2M2J9J9J9
-404g24J9mnnmJ8J9J4J5Lo2m8qJ8J9m6m5n1n0M2M3M7M7j7j8k1J9K2j9m7qL4L4llllKJJJk0
-408g96k0k0k0J4J3L7mm5m5m8m8J8J8J8J7K2K2m1m1l1L6O5O5K9L0j0j0RJ0RRk9k9J0J1L6L6
$$ plain form
-381 -851 -807 -829 -851 -848 -845 -842 -840 -841 -842 -844 -845 -855 -865 -875 -885 -879 -873 -867 -861 -877 -893 -816 -739 -762 -786 -782 -819 -900 -914 -898 -881 -859 -770 -719 -668 -687 -707 -727 -747 -751 -754 -757 -760
-385 -760 -789 -819 -848 -877 -887 -897 -840 -783 -783 -782 -781 -781 -766 -751 -736 -721 -728 -735 -742 -748 -759 -769 -819 -869 -862 -855 -808 -722 -672 -690 -734 -777 -801 -824 -843 -861 -881 -835 -803 -811
-389 -811 -804 -797 -792 -788 -800 -812 -824 -836 -822 -807 -792 -778 -753 -729 -704 -680 -694 -709 -723 -737 -761 -785 -810 -834 -818 -803 -787 -771 -766 -760 -754 -749 -719 -690 -661 -632 -668 -704 -741
-392 -741 -777 -846 -915 -917 -920 -865 -810 -794 -779 -815 -851 -847 -844 -850 -857 -824 -791 -790 -789 -787 -786 -818 -849 -881 -913 -829 -745 -754 -763 -742 -722 -702 -682 -679 -675 -672 -668 -705 -742 -716 -690 -669 -715
-396 -715 -786 -817 -831 -845 -857 -868 -865 -861 -857 -853 -845 -837 -829 -821 -848 -874 -834 -795 -834 -873 -846 -818 -771 -724 -743 -762 -759 -755 -752 -749 -734 -718 -703 -754 -813 -832 -784 -736 -732 -728 -763 -799
-400 -799 -806 -814 -821 -828 -837 -845 -854 -862 -834 -806 -778 -750 -758 -766 -775 -783 -819 -854 -890 -926 -881 -836 -857 -878 -882 -885 -888 -891 -901 -912 -855 -799 -837 -874 -912 -950 -907 -865 -823 -781 -762 -743 -724
-404 -724 -705 -709 -714 -719 -723 -705 -686 -672 -657 -654 -716 -764 -772 -754 -735 -781 -826 -877 -927 -885 -842 -795 -748 -765 -783 -804 -785 -763 -782 -829 -837 -803 -769 -772 -775 -778 -781 -779 -778 -777 -776 -796
-408 -796 -816 -836 -856 -842 -829 -792 -796 -841 -886 -934 -982 -964 -946 -928 -911 -889 -867 -908 -949 -980 -944 -879 -814 -785 -755 -765 -775 -766 -756 -747 -738 -767 -796 -786 -775 -739 -703
-412g03k9k8K1O1O1K1m2m2m4m5o2o3OM5N5J5nmN8ql5l5nL4L4nk0j9m4mJ4J3L9jk4k4k4k5l0
-415h93J0N1N2K0k0l7l8J7J6k3k3K3K3j5j4OM6K4K4j2j2rrj1K9L0j1l3l4o0k1K2j7PQM1M1
-419h02M1M0qrrrj9j9j8j9L2L1L1L2k9k9k9k9%Jm4L6K4K4n2n1k9k9l0k9J2J2J8J7J6R6J00
-422g29K1q8pK2K3j3j2j3j2k9k8N1N2N6N6k3k4p3p3OPOPOPpopoLMLMlllll3l3l2l3J4J4J5
-427i16J4J5J4J4J5J5J6O1j9RRMNooook3k2k3k3JJJJM6M5l4l4k6k6k7k6J2J2J2J2MMNMK1K1
-431h30K1K1l6l5l5l5K1K2K1K2rrrrj9j9j9j9L6L6L6L6ppqpK5K4K5K5nnonk7k8k7k7L5L6L6
-435g64L6l3l3l2l3l2l3l3l2lmlll4l3J00J00N6N7k3k3j3j3j3j3J3J2J3J2j7j7j8j7J3J3J3
-438h34J3lmlmNONO%J%Jm4m4L5L6k5k6k6k6%%%%L2L1P7lj0j0j4j5m3m2L7L6oopoRQRQj9j9
$$ plain form
-412 -703 -732 -760 -739 -678 -617 -596 -638 -680 -724 -769 -831 -894 -888 -843 -788 -773 -778 -782 -724 -732 -767 -802 -807 -773 -739 -744 -764 -783 -827 -831 -817 -804 -765 -766 -790 -814 -838 -863 -893
-415 -893 -883 -832 -780 -760 -780 -817 -855 -838 -822 -845 -868 -845 -822 -837 -851 -845 -799 -775 -751 -763 -775 -784 -793 -804 -775 -745 -756 -789 -823 -883 -904 -882 -899 -892 -884 -843 -802
-419 -802 -761 -721 -729 -738 -747 -756 -775 -794 -812 -831 -799 -768 -737 -705 -734 -763 -792 -821 -821 -820 -864 -828 -804 -780 -832 -883 -912 -941 -971 -1000 -988 -976 -958 -941 -925 -829 -729
-422 -729 -708 -796 -803 -781 -758 -771 -783 -796 -808 -837 -865 -814 -762 -706 -650 -673 -697 -770 -843 -837 -830 -824 -817 -811 -804 -811 -817 -824 -830 -827 -823 -820 -816 -819 -822 -825 -828 -861 -894 -926 -959 -945 -931 -916
-427 -916 -902 -887 -873 -859 -844 -829 -813 -752 -771 -762 -753 -749 -744 -750 -756 -762 -768 -791 -813 -836 -859 -858 -857 -856 -855 -809 -764 -798 -832 -858 -884 -911 -937 -925 -913 -901 -889 -885 -881 -876 -872 -851 -830
-431 -830 -809 -788 -824 -859 -894 -929 -908 -886 -865 -843 -852 -861 -870 -879 -898 -917 -936 -955 -919 -883 -847 -811 -818 -825 -833 -840 -815 -791 -766 -741 -746 -751 -757 -762 -789 -817 -844 -871 -836 -800 -764
-435 -764 -728 -761 -794 -826 -859 -891 -924 -957 -989 -992 -996 -999 -1002 -1036 -1069 -969 -869 -813 -756 -779 -802 -815 -828 -841 -854 -841 -829 -816 -804 -821 -838 -856 -873 -860 -847 -834
-438 -834 -821 -824 -828 -831 -835 -830 -824 -819 -813 -813 -812 -812 -811 -855 -899 -864 -828 -853 -879 -905 -931 -931 -931 -931 -931 -899 -868 -791 -794 -804 -814 -828 -843 -886 -928 -891 -855 -861 -867 -874 -880 -871 -863 -854 -846 -865 -884
-442h84j9j9K2K2K1K2l3l3L4L3jkmmj6n5m4L7M9l1m8m7K1K2K1K1j2j3j2j3J8J9J8J8K2K2j9
-446h67j8l0l0L7L6k4k4M2M2J4J3J3J3QPPQ%%m7L3K4j6n4n5nnnnrrrrMMNMK1K1K1K1j2j3j2
-450h60j2kkkkK6K7K6K7j3j2j2j3K2K1j8j8j5j4M8M7Qp1rL0RQJ1J1l9l8l9l9M1M0M0M1J6J7
-454g14n0n0k3k2k3k2ppqpk3k3O6O6L5l1l2L5J6J6K0K0J4J3J4J3j7j6j7j6j5j5j5j5o5o5K
-457i68KK8K8j1j2j8j9M9M8P0P1J5n2j1j2j6j6J4J4n2n3j5j5j6j5L6L6L6L6j5j4j4j4J5J4
-461h46M1Jl3L4J6k4l1l0l4l3J0J0J0J0K6K6K6K5J4J3k7o6k3M4M3M4J4J4k7k6norqj8n8p6
-464i59rK4j5K4O4Q6J9l4l4k7k8J2J2QRl1l1j8j7K3K2K8K7K8K7JJJJJJJJkkK3j7m0%k1k1L
-468h59O9N3J4j1j2J2k7l4L4J8k1k0K0J8k2kjk7J4rrpoj3j3l9%L4l2j4K5K5K4K5K5L4n%m0
$$ plain form
-442 -884 -903 -922 -900 -878 -857 -835 -868 -901 -867 -834 -835 -837 -841 -845 -861 -916 -960 -923 -874 -905 -953 -1000 -979 -957 -936 -915 -927 -940 -952 -965 -947 -928 -910 -892 -870 -848 -867
-446 -867 -885 -915 -945 -908 -872 -896 -920 -878 -836 -822 -809 -796 -783 -775 -768 -761 -753 -753 -753 -800 -767 -743 -759 -813 -868 -873 -878 -883 -888 -897 -906 -915 -924 -920 -916 -911 -907 -886 -865 -844 -823 -835 -848 -860
-450 -860 -872 -874 -876 -878 -880 -854 -827 -801 -774 -787 -799 -811 -824 -802 -781 -799 -817 -832 -846 -798 -751 -743 -814 -823 -793 -784 -776 -765 -754 -793 -831 -870 -909 -868 -828 -788 -747 -731 -714
-454 -714 -764 -814 -837 -859 -882 -904 -911 -918 -926 -933 -956 -979 -913 -847 -812 -843 -875 -840 -824 -808 -788 -768 -754 -741 -727 -714 -731 -747 -764 -780 -795 -810 -825 -840 -905 -970 -968
-457 -968 -966 -938 -910 -921 -933 -951 -970 -921 -873 -803 -732 -717 -769 -780 -792 -808 -824 -810 -796 -848 -901 -916 -931 -947 -962 -926 -890 -854 -818 -833 -847 -861 -875 -860 -846
-461 -846 -805 -804 -837 -803 -787 -811 -842 -872 -906 -939 -929 -919 -909 -899 -873 -847 -821 -796 -782 -769 -796 -862 -885 -841 -798 -754 -740 -726 -753 -779 -784 -790 -799 -807 -825 -883 -959
-464 -959 -968 -944 -959 -935 -871 -785 -766 -800 -834 -861 -889 -877 -865 -857 -848 -879 -910 -928 -945 -922 -900 -872 -845 -817 -790 -789 -788 -787 -786 -785 -784 -783 -782 -784 -786 -763 -780 -820 -820 -841 -862 -859
-468 -859 -790 -737 -723 -734 -746 -734 -761 -795 -761 -743 -764 -784 -764 -746 -768 -770 -771 -798 -784 -793 -802 -809 -815 -828 -841 -880 -880 -846 -878 -892 -867 -842 -818 -793 -768 -734 -739 -739 -779
-472g79o0o0l5L0M2Kj2j1j7j6l9KJ9J9K0J9om6k3k4k0k0j7j8k9J1P9Q0L4oL2P2J2k8J2N2j4
-475g43n4k6k6RM9M9Rj2j2j2j2l2QN0M9J8k2o2o2m6K1j5j4l6MO2lm2K5M7M7jm2l9%K5O5O7
-479g09K7j0j1j4j3QQMMJo6n0j1k9k9k6k6L9M0L9L9j7j7K3K3J4J5n2n2MNMM%%J%j2j2j2j2
-483h78j2j2j4j5J8k2l6K9L3L3L7L7J8J7J8J7qqqqo1o1l5L2J05O4kkl8l8KKj6j6j3j2lO3K5
-486g68K6k7k7k6k7l2l2l2l2kkkkJ9K0K0K0J9K0K0J9k4k5k0j9mQ9N9J9qqj0j0M6M6m7m7n1
-490h42n0k2M5mmM0M0mmm4m4j3j3rrm3K4P5P6O3ml2l3m6m6K1K1N2N3j5j4p0p1K3K3k0k0K1
-493h99K0j1j2j1j1N4N5J4J5l8l9K6K5Rl2m7K0N4N4K9l7n3n2n7n6LKLKM6M6M6M6k5k4k4k5
-497h84l2l3PPm0m1K6K6K4K3j6j6K4K4K5K4kjjkOOQRNM5O0oj9j9k4k3PPPOmmmnj0j0j0j0l4
$$ plain form
-472 -779 -839 -899 -934 -904 -862 -860 -872 -883 -900 -916 -955 -953 -934 -915 -895 -876 -882 -928 -951 -975 -995 -1015 -1032 -1050 -1079 -1068 -989 -909 -875 -881 -849 -777 -765 -793 -781 -729 -743
-475 -743 -797 -823 -849 -840 -791 -742 -733 -745 -757 -769 -781 -813 -805 -755 -706 -688 -710 -772 -834 -880 -859 -874 -888 -924 -920 -858 -861 -903 -878 -831 -784 -785 -827 -866 -866 -841 -776 -709
-479 -709 -682 -692 -703 -717 -730 -722 -714 -710 -706 -705 -771 -821 -832 -861 -890 -916 -942 -903 -863 -824 -785 -802 -819 -796 -773 -759 -744 -796 -848 -844 -839 -835 -831 -831 -831 -830 -830 -842 -854 -866 -878
-483 -878 -890 -902 -916 -931 -913 -935 -971 -942 -909 -876 -839 -802 -784 -767 -749 -732 -740 -748 -756 -764 -825 -886 -921 -889 -784 -720 -722 -724 -762 -800 -798 -796 -812 -828 -841 -853 -856 -793 -768
-486 -768 -742 -769 -796 -822 -849 -881 -913 -945 -977 -979 -981 -983 -985 -966 -946 -926 -906 -887 -867 -847 -828 -852 -877 -897 -916 -920 -831 -772 -753 -761 -769 -779 -789 -743 -697 -744 -791 -842
-490 -842 -892 -914 -869 -873 -877 -837 -797 -801 -805 -849 -893 -906 -919 -928 -937 -980 -956 -881 -805 -742 -746 -778 -811 -857 -903 -882 -861 -809 -756 -771 -785 -855 -926 -903 -880 -900 -920 -899
-493 -899 -879 -890 -902 -913 -924 -870 -815 -801 -786 -824 -863 -837 -812 -803 -835 -882 -862 -808 -754 -725 -762 -815 -867 -924 -980 -977 -975 -972 -970 -924 -878 -832 -786 -811 -835 -859 -884
-497 -884 -916 -949 -942 -935 -975 -1016 -990 -964 -940 -917 -933 -949 -925 -901 -876 -852 -854 -855 -856 -858 -852 -846 -838 -829 -824 -779 -719 -725 -744 -763 -787 -810 -803 -796 -789 -783 -787 -791 -795 -800 -810 -820 -830 -840 -874
-501h74l5L0K9J9k1l6L1L4L5L6L6j7n8p3oN5N4qpm3m3lkKJKKk2k2J8J7L5L5J1n5l2O0K7j4
-505h02j8j7k1k0J6J7J6J6K7K8K7K7m2m3m3m2m3m4m3m3L9M0M0M0j5j6j5j5J9J9J9J9J3J3k7
-508h74k7J9J9m8m7K3K3O3O3nmm1m0KO9N3J4j9j8k2k1l9m0m0l9N9O0N9N9k1k2J9J8K7K8l9
-512g29l9k3k4M1M1l3p3m8J8K9K8L3L3l2l2l2l2j7j7K3K3M8M8j9j8m2m1m1m1J8J8J8J7kkk
-515i03lj4j3j4j4j9j8O2O1J7J6J7J6J7J6J6J6M5M4l5l6j1j0j1j1j6j6j5j6lmqqL4m7q1q1
-518a030Q1Q1KKkkkjLLLMj4j3j4j3J3J3J2J3LKLLL0L1L1L0l9l9m0l9J9J8J8J9M0M0m0m0k0
-522h31j9k0k0L3L4L3L4L8L8m1m2j3j3j3j3LLLLkkkkl6l6M4M3j1j1j1j1kkjkm7m6j7O3R6J7
-526g81j3j4oppop1p0RRj3j2j3j2MLMLMMLMK9K9K9L0J2J3J2J3l8l8l3l4lO3M7Qj5j5j8j8K5
$$ plain form
-501 -874 -909 -879 -850 -831 -852 -888 -857 -823 -788 -752 -716 -733 -791 -864 -870 -815 -761 -769 -776 -819 -862 -865 -867 -865 -864 -862 -860 -882 -904 -886 -869 -834 -799 -788 -843 -875 -815 -788 -802
-505 -802 -820 -837 -858 -878 -862 -845 -829 -813 -786 -758 -731 -704 -746 -789 -832 -874 -917 -961 -1004 -1047 -1008 -968 -928 -888 -903 -919 -934 -949 -930 -911 -892 -873 -860 -847 -874
-508 -874 -901 -882 -863 -911 -958 -935 -912 -849 -786 -791 -795 -836 -876 -874 -805 -752 -738 -757 -775 -797 -818 -857 -897 -937 -976 -917 -857 -798 -739 -760 -782 -763 -745 -718 -690 -729
-512 -729 -768 -791 -815 -774 -733 -766 -839 -887 -869 -840 -812 -779 -746 -778 -810 -842 -874 -891 -908 -885 -862 -814 -766 -785 -803 -845 -886 -927 -968 -950 -932 -914 -897 -899 -901 -903
-515 -903 -906 -920 -933 -947 -961 -980 -998 -936 -875 -858 -842 -825 -809 -792 -776 -760 -744 -699 -655 -690 -726 -737 -747 -758 -769 -785 -801 -816 -832 -835 -839 -847 -855 -821 -868 -949 -1030
-518 -1030 -949 -868 -866 -864 -866 -868 -870 -871 -868 -865 -862 -858 -872 -885 -899 -912 -899 -886 -874 -861 -858 -856 -853 -850 -820 -789 -758 -728 -767 -806 -846 -885 -866 -848 -830 -811 -771 -731 -771 -811 -831
-522 -831 -850 -870 -890 -857 -823 -790 -756 -718 -680 -721 -763 -776 -789 -802 -815 -812 -809 -806 -803 -805 -807 -809 -811 -847 -883 -839 -796 -807 -818 -829 -840 -842 -844 -845 -847 -894 -940 -957 -894 -798 -781
-526 -781 -794 -808 -814 -821 -828 -834 -905 -975 -966 -957 -970 -982 -995 -1007 -1003 -1000 -996 -993 -989 -985 -982 -978 -949 -920 -891 -861 -849 -836 -824 -811 -849 -887 -920 -954 -957 -894 -847 -839 -854 -869 -887 -905 -880
-530h80K5K5K6l4l3pm7j04l7K4j5l7l7L9M0j0j0rj0O8O9O5O5O4lm5m5mnnmPPPPl7l7l7l7J3
-534i78J4N3j3o9l0jL9L9%K4K5J8J8J8J9K9L0L0L0%jp6p6q3j6N3R2O0om2m2o8jO3K4j7j7k0
-538h78k0RQRRj2j3j2j2j%j%L8L8m1m2oppoJ5J5J4J5J5J5J5J5J9J9J9K0l8l7l7l8k0k0k1k0
-542i82M1M1JJL9L9k7k8k2k3k2k3M3M3L8L7K2n7l6Nk4k5k1k2K8K8K9K8nm%Jj7O3L7kPl4l7
-545h40MRQJ1J1j3j4qqp4NK4j7k9k9L6L5MNMNm9m8J8J7L7L7K5j5JQ1P9jo7o8lmm2kK3n7p3
-549i82l3L3L3O2O3K3K2o5o5o6o5K6K7K6K6k3k4k4k3L0L1L0L0j2j3rrm1K5J0k9K6K7K4K5n
-553h89nnmk9k8k8k8L2L2L2L2l1l2l1l1J4J4J4J4K4K4K4K4J1J1J1J1j8j9j9j9J8J8J8J9l9
-556h58l8l9l8QQQPM5M4M5M4k2k1k2k2l1l2l1l2L5L5L5L5j5j5j0j1j9M8L3pj3j2j6j5n8n8
$$ plain form
-530 -880 -855 -830 -804 -838 -871 -878 -925 -1029 -1066 -1042 -1057 -1094 -1131 -1092 -1052 -1062 -1072 -1081 -1091 -1023 -954 -889 -824 -760 -763 -808 -853 -857 -862 -867 -871 -864 -857 -850 -843 -880 -917 -954 -991 -978
-534 -978 -964 -911 -924 -993 -1023 -1024 -985 -946 -946 -922 -897 -879 -861 -843 -824 -795 -765 -735 -705 -705 -706 -782 -858 -941 -957 -904 -812 -752 -758 -800 -842 -910 -911 -848 -824 -841 -858 -878
-538 -878 -898 -889 -881 -872 -863 -875 -888 -900 -912 -913 -913 -914 -914 -876 -838 -879 -921 -927 -934 -941 -947 -932 -917 -903 -888 -873 -858 -843 -828 -809 -790 -771 -751 -789 -826 -863 -901 -921 -941 -962 -982
-542 -982 -941 -900 -899 -898 -859 -820 -847 -875 -897 -920 -942 -965 -922 -879 -841 -804 -782 -839 -875 -870 -894 -919 -940 -962 -934 -906 -877 -849 -854 -858 -858 -857 -874 -811 -774 -776 -769 -803 -840
-545 -840 -836 -827 -819 -808 -797 -810 -824 -832 -840 -914 -909 -885 -902 -931 -960 -924 -889 -885 -880 -876 -871 -920 -968 -950 -933 -896 -859 -834 -849 -848 -767 -688 -689 -756 -824 -827 -831 -873 -875 -852 -909 -982
-549 -982 -1015 -982 -949 -887 -824 -801 -779 -844 -909 -975 -1040 -1014 -987 -961 -935 -958 -982 -1006 -1029 -999 -968 -938 -908 -920 -933 -942 -951 -992 -967 -957 -986 -960 -933 -909 -884 -889
-553 -889 -894 -899 -903 -932 -960 -988 -1016 -984 -952 -920 -888 -919 -951 -982 -1013 -999 -985 -971 -957 -933 -909 -885 -861 -850 -839 -828 -817 -835 -854 -873 -892 -874 -856 -838 -819 -858
-556 -858 -896 -935 -973 -965 -957 -949 -942 -897 -853 -808 -764 -786 -807 -829 -851 -882 -914 -945 -977 -942 -907 -872 -837 -852 -867 -877 -888 -907 -859 -826 -833 -846 -858 -874 -889 -947 -1005
-559a005RRNOJ8N9O4kk4J5MMOOqqqrk0k1n8QK7K6L0L1k2k2k2k2k6k5J4N4M8j8K2K1l4l4k8
-563i30k8J1J05R0K3j3j3j8j7l6l6l6l5l8l8M2M2PPPPkkjkm0m0nP4J11J12j7j7m0m0m0m0J7
-567h69J6J7J7j2j1j2j1K8K9n2n1j2j1j2j1l6l5M4M4L6L6L5L6k3k4k3k3k4k3k3k4O3O3O2O3
-570g33k0k0k1k0j7j7j7j7L3L4L3L3k4k4j9j9o5J4M9N0J1J2J1J2l4l3l3l4J5J5J6J5m1m2m1
-574i38m1MMjjO0j9k0O1N3N4k2k1l4l3l3l3J6J7J6J6L3L3L3L3l7l8l7l8j%mlj4n5n4j4L1L0
-577i97L4L3j2j1j2j1k6k7N1N1L7lK0K0k1k1k1k1mmopK6j4RQJ6J6J4J3l3p4n1n2kl%%K1O1
$$ plain form
-559 -1005 -996 -987 -982 -976 -958 -899 -835 -837 -861 -846 -842 -838 -832 -826 -834 -842 -850 -859 -879 -900 -958 -950 -923 -897 -867 -836 -858 -880 -902 -924 -950 -975 -961 -907 -859 -877 -855 -834 -868 -902 -930
-563 -930 -958 -947 -842 -752 -729 -742 -755 -773 -790 -826 -862 -898 -933 -971 -1009 -967 -925 -918 -911 -904 -897 -899 -901 -902 -904 -944 -984 -989 -915 -804 -692 -709 -726 -766 -806 -846 -886 -869
-567 -869 -853 -836 -819 -831 -842 -854 -865 -837 -808 -860 -911 -923 -934 -946 -957 -993 -1028 -984 -940 -904 -868 -833 -797 -820 -844 -867 -890 -914 -937 -960 -984 -921 -858 -796 -733
-570 -733 -753 -773 -794 -814 -831 -848 -865 -882 -849 -815 -782 -749 -773 -797 -816 -835 -900 -886 -837 -787 -776 -764 -753 -741 -775 -808 -841 -875 -860 -845 -829 -814 -855 -897 -938
-574 -938 -979 -975 -971 -972 -973 -913 -932 -952 -891 -838 -784 -806 -827 -861 -894 -927 -960 -944 -927 -911 -895 -862 -829 -796 -763 -800 -838 -875 -913 -914 -914 -918 -921 -935 -990 -1044 -1058 -1027 -997
-577 -997 -963 -930 -942 -953 -965 -976 -1002 -1029 -978 -927 -890 -893 -873 -853 -874 -895 -916 -937 -941 -945 -951 -958 -932 -946 -937 -929 -913 -897 -883 -870 -903 -977 -1028 -1080 -1082 -1085 -1085 -1085 -1064 -1003
$$ [...]
-1241d1
##END=	
##END=	
