##TITLE=	(1) Mar13-2020.320.fid
DH001

(2) Mar13-2020.320.fid
DH001
##JCAMP-DX=	6.0	$$ MestReNova 14.1.0-24037
##DATA TYPE=	LINK
##BLOCK_ID=	1
##BLOCKS=	2    
##ORIGIN=	Mestrelab Research S.L.
##OWNER=	David
##$MNOVA/LINK_BLOCK_TYPE=	PAGE
##TITLE=	Mar13-2020.320.fid
DH001
##JCAMP-DX=	6.0	$$ MestReNova 14.1.0-24037
##DATA TYPE=	LINK
##BLOCK_ID=	2
##BLOCKS=	2    
##ORIGIN=	Mestrelab Research S.L.
##OWNER=	David
##$MNOVA/LINK_BLOCK_TYPE=	ITEM	$$ NMR Spectrum
##$MNOVA/ITEM/POLYGON=	(XY..XY)
5321,5835
8722,5835
8722,8208
5321,8208
5321,5835
##$MNOVA/ITEM/Z=	0
##$MNOVA/ITEM/ANGLE=	0
##TITLE=	Mar13-2020.320.fid
##JCAMP-DX=	6.0	$$ MestReNova 14.1.0-24037
##BLOCK_ID=	3
##DATA TYPE=	NMR SPECTRUM
##DATA CLASS=	XYDATA
##NUMDIM=	1
##ORIGIN=	Bruker BioSpin GmbH
##OWNER=	nmrsu
##.OBSERVE FREQUENCY=	400.05240029999998796
##.OBSERVE NUCLEUS=	^1H
##.SOLVENT NAME=	CDCl3
##.PULSE SEQUENCE=	zg30
##LONGDATE=	2020/03/13 18:13:00.000
##.ACQUISITIONMODE=	SIMULTANEOUS (DQD)
##$ORIGINAL FORMAT=	Bruker XWIN-NMR
##$MNOVA/SCALES_VERSION=	8
##$PARAMETER FILE=	(acqus, ASCII, c:/Users/David/Downloads/Mar13-2020%20(1)/Mar13-2020/320/acqus, 0)
$$ ##TITLE= Parameter file, TOPSPIN		Version 3.2
$$ ##JCAMPDX= 5.0
$$ ##DATATYPE= Parameter Values
$$ ##NPOINTS= 11	$$ modification sequence number
$$ ##ORIGIN= Bruker BioSpin GmbH
$$ ##OWNER= nmrsu
$$ $$ 2020-03-13 18:13:54.005 +0000  nmrsu@nmrpc
$$ $$ /opt/topspin/data/ug1/nmr/Mar13-2020/320/acqus
$$ $$ process /opt/topspin3.2/prog/mod/shimcntl
$$ ##$ACQT0= -2.04831932773109
$$ ##$AMP= (0..31)
$$ 100 100 100 100 100 100 100 100 100 100 100 100 100 100 100 100 100 100
$$ 100 100 100 100 100 100 100 100 100 100 100 100 100 100
$$ ##$AMPCOIL= (0..19)
$$ -1 0 0 0 0 0 0 0 0 0 0 0 0 0 0 0 0 0 0 0
$$ ##$ANAVPT= -1
$$ ##$AQSEQ= 0
$$ ##$AQ_mod= 3
$$ ##$AUNM= <au_zg>
$$ ##$AUTOPOS= <15 >
$$ ##$BF1= 400.05
$$ ##$BF2= 400.05
$$ ##$BF3= 400.05
$$ ##$BF4= 400.05
$$ ##$BF5= 400.05
$$ ##$BF6= 400.05
$$ ##$BF7= 400.05
$$ ##$BF8= 400.05
$$ ##$BYTORDA= 0
$$ ##$CAGPARS= (0..11)
$$ 0 0 0 0 0 0 0 0 0 0 0 0
$$ ##$CFDGTYP= 0
$$ ##$CFRGTYP= 9
$$ ##$CHEMSTR= <none>
$$ ##$CNST= (0..63)
$$ 1 1 1 1 1 1 1 1 1 1 1 1 1 1 1 1 1 1 1 1 1 1 1 1 1 1 1 1 1 1 1 1 1 1 1 1
$$ 1 1 1 1 1 1 1 1 1 1 1 1 1 1 1 1 1 1 1 1 1 1 1 1 1 1 1 1
$$ ##$CPDPRG= (0..8)
$$ <> <> <> <> <> <> <> <> <>
$$ ##$D= (0..63)
$$ 0 1 0 0 0 0 0 0 0 0 0 0 0 0 0 0 0.0002 0 0 0 0 0 0 0 0 0 0 0 0 0 0 0 0
$$ 0 0 0 0 0 0 0 0 0 0 0 0 0 0 0 0 0 0 0 0 0 0 0 0 0 0 0 0 0 0 0
$$ ##$DATE= 1584123233
$$ ##$DE= 6.5
$$ ##$DECBNUC= <off>
$$ ##$DECIM= 2496
$$ ##$DECNUC= <off>
$$ ##$DECSTAT= 4
$$ ##$DIGMOD= 1
$$ ##$DIGTYP= 12
$$ ##$DQDMODE= 0
$$ ##$DR= 22
$$ ##$DS= 4
$$ ##$DSPFIRM= 0
$$ ##$DSPFVS= 20
$$ ##$DTYPA= 0
$$ ##$EXP= <proton>
$$ ##$F1LIST= <>
$$ ##$F2LIST= <>
$$ ##$F3LIST= <>
$$ ##$FCUCHAN= (0..9)
$$ 0 2 0 0 0 0 0 0 0 0
$$ ##$FL1= 90
$$ ##$FL2= 90
$$ ##$FL3= 90
$$ ##$FL4= 90
$$ ##$FOV= 20
$$ ##$FQ1LIST= <>
$$ ##$FQ2LIST= <>
$$ ##$FQ3LIST= <>
$$ ##$FQ4LIST= <>
$$ ##$FQ5LIST= <>
$$ ##$FQ6LIST= <>
$$ ##$FQ7LIST= <>
$$ [...]
$$ 130000 130000 130000 130000 130000 130000 130000 130000 130000 130000 130000
$$ 130000 130000 130000 130000 130000 130000 130000 130000 130000 130000 130000
$$ 130000 130000 130000 130000 130000 130000 130000 0 0 0 0 0 0 0 0 0 0 0
$$ 0 0 0 0 0 0 0 0 0 0 0 0 0
$$ ##$ShimPowMaxUC= (0..63)
$$ 130000 130000 130000 130000 130000 130000 130000 130000 130000 130000 130000
$$ 130000 130000 130000 130000 130000 130000 130000 130000 130000 130000 130000
$$ 130000 130000 130000 130000 130000 130000 130000 130000 130000 130000 130000
$$ 130000 130000 130000 130000 130000 130000 130000 0 0 0 0 0 0 0 0 0 0 0
$$ 0 0 0 0 0 0 0 0 0 0 0 0 0
$$ ##$ShimPowMaxUG= (0..63)
$$ 524287 524287 524287 524287 524287 524287 524287 524287 524287 524287 524287
$$ 524287 524287 524287 524287 524287 524287 524287 524287 524287 524287 524287
$$ 524287 524287 524287 524287 524287 524287 524287 524287 524287 524287 524287
$$ 524287 524287 524287 524287 524287 524287 0 0 0 0 0 0 0 0 0 0 0 0 0 0 0
$$ 0 0 0 0 0 0 0 0 0 0
$$ ##$ShimPowRcbType= 3
$$ ##$ShimPowRes= (0..63)
$$ 1e-20 1e-20 1e-20 1e-20 1e-20 1e-20 1e-20 1e-20 1e-20 1e-20 1e-20 1e-20
$$ 1e-20 1e-20 1e-20 1e-20 1e-20 1e-20 1e-20 1e-20 1e-20 1e-20 1e-20 1e-20
$$ 1e-20 1e-20 1e-20 1e-20 1e-20 1e-20 1e-20 1e-20 1e-20 1e-20 1e-20 1e-20
$$ 1e-20 1e-20 1e-20 1e-20 0 0 0 0 0 0 0 0 0 0 0 0 0 0 0 0 0 0 0 0 0 0 0 0
$$ ##$ShimPowRng0= (0..63)
$$ 1 1 1 1 1 1 1 1 1 1 1 1 1 1 1 1 1 1 1 1 1 1 1 1 1 1 1 1 1 1 1 1 1 1 1 1
$$ 1 1 1 1 0 0 0 0 0 0 0 0 0 0 0 0 0 0 0 0 0 0 0 0 0 0 0 0
$$ ##$ShimPowRng1= (0..63)
$$ 1 1 1 1 1 1 1 1 1 1 1 1 1 1 1 1 1 1 1 1 1 1 1 1 1 1 1 1 1 1 1 1 1 1 1 1
$$ 1 1 1 1 0 0 0 0 0 0 0 0 0 0 0 0 0 0 0 0 0 0 0 0 0 0 0 0
$$ ##$ShimPowRng2= (0..63)
$$ 1 1 1 1 1 1 1 1 1 1 1 1 1 1 1 1 1 1 1 1 1 1 1 1 1 1 1 1 1 1 1 1 1 1 1 1
$$ 1 1 1 1 0 0 0 0 0 0 0 0 0 0 0 0 0 0 0 0 0 0 0 0 0 0 0 0
$$ ##$ShimPowRng3= (0..63)
$$ 1 1 1 1 1 1 1 1 1 1 1 1 1 1 1 1 1 1 1 1 1 1 1 1 1 1 1 1 1 1 1 1 1 1 1 1
$$ 1 1 1 1 0 0 0 0 0 0 0 0 0 0 0 0 0 0 0 0 0 0 0 0 0 0 0 0
$$ ##$ShimSysFunc= (0..63)
$$ 1 2 3 4 5 6 7 8 9 10 0 37 38 35 16 15 14 13 12 11 28 27 26 25 24 23 36
$$ 22 30 29 20 21 34 33 32 31 17 18 19 0 0 0 0 0 0 0 0 0 0 0 0 0 0 0 0 0 0
$$ 0 0 0 0 0 0 0
$$ ##$ShimSysMatrix= 0
$$ ##$ShimSysType= 4
$$ ##$TFXNUM= 0
$$ ##$TRIPLO2= 0
$$ ##$VTU= 2
$$ ##$VTUETH= <149.236.99.20>
$$ ##$VTUTY= <no>
$$ ##$WBREFAM= (0..15)
$$ 136.7 118.7 100 100 100 100 100 100 100 100 100 100 100 100 100 100
$$ ##$WBREFLM= (0..15)
$$ 0 0 0 0 0 0 0 0 0 0 0 0 0 0 0 0
$$ ##$WBREFPH= (0..15)
$$ 77.55 -71.28 0 0 0 0 0 0 0 0 0 0 0 0 0 0
$$ ##$WBSGU= (0..15)
$$ 0 0 0 0 0 0 0 0 0 0 0 0 0 0 0 0
$$ ##$XFAC= 2
$$ ##END=
$$ 
##$DECIM=	2496
##$DSPFVS=	20
##XUNITS=	HZ
##YUNITS=	ARBITRARY UNITS
##FIRSTX=	6406.710256386850233
##LASTX=	-1606.1102564336499654
##DELTAX=	-0.12226780365942625795
##XFACTOR=	1
##YFACTOR=	0.0049228621272878513374
##FIRSTY=	7.5044331550598144531
##MINY=	1.5705181360244750977
##MAXY=	14075.8359375
##NPOINTS=	65536
##XYDATA=	(X++(Y..Y))
$$ [...]
1611B982M47O11Q48J173J493J600J305N88l56j190j617j573j246q88o14m05k33j12l5L8J21
1609B937J78J76J17J6j07k11k60k59k35j89j10l7l0p3r1n1JMk3l3j0J1Jl3n4k9K7N3J0n3o5
1605A578j6K5J6j0lK8L6Nk9k5J0L2J7p%K6J9k7n3j7L3L6Mj2mPJ8M1N1J4m2n5j6Ok5o1n9l3
1600A508k6m0m1k2QL3N0O1O6N6K9ql4l8k8rJ8M3L5ql8l0rKJ7N2O6L1j8k8k5m6o3j6O3Q1K1
1596A713l7m9n0o1n1pL5N5Q0R6N8k7o5k3K1Jl0kM8L5k3l3L2R2Q7N1L4K9mm9n1QO8N9km1k9
1591A968j8m5o5k1N6Q0K0n2o0j1L4L5Kk0MN2O7L1%J1K7Ml3k9j0l2p6p2l2k5o6q0l7K4P4J31
1587A836J76J55Q1L4M8P2O5M9M0J8jM1J24J51R1L5L8M4on5m4mJ8L6Q2J23J39J77K67L40L28
1583D498K58J79R2QJ0J37K82L20K82K69K85K63K06J79K03K32K54K76K52J30m1j57j99k28k67
$$ plain form
1611 2982 3429 4040 4888 6061 7554 9154 10459 11047 10691 9501 7884 6311 5065 4177 3563 3158 2925 2813 2778 2816 2937
1609 2937 3115 3291 3408 3424 3317 3106 2846 2587 2352 2163 2053 2016 1986 1913 1822 1771 1772 1776 1753 1720 1710 1721 1722 1689 1635 1606 1633 1686 1696 1643 1578
1605 1578 1562 1587 1603 1593 1590 1618 1654 1659 1630 1605 1615 1647 1664 1657 1657 1683 1702 1675 1622 1605 1638 1674 1678 1666 1662 1669 1687 1728 1779 1793 1751 1696 1680 1686 1661 1600 1541 1508
1600 1508 1482 1442 1401 1379 1387 1420 1470 1531 1597 1653 1682 1674 1640 1602 1574 1565 1583 1626 1661 1653 1615 1585 1576 1578 1595 1647 1713 1744 1726 1698 1673 1627 1564 1548 1611 1692 1713
1596 1713 1676 1627 1577 1516 1465 1458 1493 1548 1628 1724 1782 1755 1690 1667 1688 1689 1659 1657 1705 1740 1717 1684 1716 1808 1895 1946 1980 2009 2005 1956 1905 1913 1981 2040 2038 1997 1968
1591 1968 1950 1905 1840 1819 1875 1955 1975 1923 1863 1852 1886 1921 1923 1903 1907 1959 2026 2057 2057 2068 2095 2099 2066 2037 2027 1995 1919 1847 1815 1790 1724 1644 1607 1631 1705 1836
1587 1836 2012 2167 2248 2282 2330 2402 2467 2516 2556 2574 2573 2614 2738 2889 2980 3015 3053 3097 3091 3036 2992 2988 3006 3042 3124 3247 3386 3563 3830 4170 4498
1583 4498 4756 4935 5027 5035 5045 5182 5464 5784 6066 6335 6620 6883 7089 7268 7471 7703 7957 8233 8485 8615 8574 8417 8218 7990 7723
1580G723k68k09j34q7r9k01l68m87m53l11k11k11k48k50k21j85j33o6kM2O4O4M8M1N4M9Ql2
1577C917j8K0L2J7J0J0KJ7P1J00M5m8p7l5J0J9J0kj0OM1L4l2n6L7J63J72Q7M5R2J42J54J90
1573E165K74L55M14M91N97P10Q80J171J500J661J568J371J287J467K070L226M754N975O003
1570D0939M323J181k454n332o565o095m612k964j609n83J84O23N93J07n83j089j154q23l74
1568A3713j15k00n80j036j317j330j178r99q00n43l03j96k03j94j17m5l0m6o6r1q0%P9O2k3
1565D362m2L6J03J06J03J20J00K1k8MN8O9O2P6J08J69K72L70L72K72J53L2j28k99l59k83j91
1562E638j63j48q8k1J7M9R6J21J14R3M7n2j41j28l7K4N1J18J75R8o4j15k4K7m4q9l0lr7j70
1558E254j00RK8K2Q4J35P6j6j8M0O5O7R5J00N0K4Q0J42J36J15J33J39J04J12K04K74K47J83
$$ plain form
1580 7723 7455 7246 7112 7025 6926 6725 6357 5870 5417 5106 4895 4684 4436 4186 3965 3780 3647 3581 3579 3621 3685 3749 3797 3838 3892 3941 3949 3917
1577 3917 3899 3919 3951 3968 3978 3988 3990 4007 4078 4178 4223 4175 4098 4063 4073 4092 4102 4100 4090 4096 4137 4171 4139 4083 4120 4283 4455 4542 4587 4679 4821 4975 5165
1573 5165 5439 5794 6208 6699 7296 8006 8886 10057 11557 13218 14786 16157 17444 18911 20981 24207 28961 34936 40939
1570 40939 45262 46443 43989 38657 32092 25997 21385 18421 16812 16229 16413 17036 17629 17736 17153 16064 14910 14087 13713
1568 13713 13598 13398 12818 11782 10465 9135 7957 6958 6158 5615 5312 5116 4913 4719 4602 4557 4527 4481 4415 4324 4244 4244 4323 4385 4362
1565 4362 4320 4356 4459 4565 4668 4788 4888 4909 4881 4885 4943 5012 5074 5150 5258 5427 5699 6069 6441 6713 6866 6898 6770 6471 6112 5829 5638
1562 5638 5475 5327 5239 5218 5235 5284 5380 5501 5615 5708 5755 5703 5562 5434 5397 5421 5472 5590 5765 5863 5799 5684 5660 5687 5643 5554 5524 5521 5424 5254
1558 5254 5154 5163 5191 5213 5297 5432 5508 5492 5474 5514 5579 5646 5741 5841 5891 5915 5995 6137 6273 6388 6521 6660 6764 6876 7080 7354 7601 7784
1555G784J19k0k07k63j44m8j04j50m3Q6O3k7l8j3n1p6JP6M5J8J11K09J76J13J45J72Q8L3J44
1551H199K53J65Jj3O2O0N1J80L21K68J29J44K57K51J61J83K84K88K41L09M15L54J83J18J41
1548A3005Q9J5O8J59J16N7J97M11M43L81M60N79M76K72K88M49M20K47K58M42M85M05M87O95
1545B0904P00N29N22P02P91Q05R99J241J166R02R17J183J246J120J261J662J875J929K271
1543D2725K792K910K695K846L442L887M241N252O826P890Q126Q391R044R573J0414J3162J8163
1541A62379K4130L1421M3394O3199R2529J35849J99903K79127L39830L29320K14339J7198
1539A932618j87816l20327l45055k86819k01384j32058q9189o1954m0269k2427q074O827K5041
1538B69114M1879M7310L4176M414l0752n6355o2632n1505l4135k1081j5230j3676j3462j3478
$$ plain form
1555 7784 7903 7883 7676 7413 7269 7221 7117 6967 6924 7010 7073 7046 7008 6995 6944 6868 6869 6945 6990 7008 7119 7328 7504 7617 7762 7934 8022 8055 8199
1551 8199 8452 8617 8618 8605 8667 8727 8778 8958 9279 9547 9676 9820 10077 10328 10489 10672 10956 11244 11485 11794 12209 12563 12746 12864 13005
1548 13005 13094 13109 13177 13336 13452 13509 13706 14117 14560 14941 15401 15980 16456 16728 17016 17465 17885 18132 18390 18832 19317 19722 20209 20904
1545 20904 21604 22133 22655 23357 24148 24953 25952 27193 28359 29261 30178 31361 32607 33727 34988 36650 38525 40454 42725
1543 42725 45517 48427 51122 53968 57410 61297 65538 70790 77616 85506 93632 102023 111067 120640 131054 144216 162379
1541 162379 186509 217930 261324 324523 417052 552901 752804 1031931 1371761 1701081 1915420 1932618
1539 1932618 1744802 1424475 1079420 792601 591217 459159 369970 308016 267747 245320 237246 244073 269114
1538 269114 310993 358303 392479 396893 366141 309786 247154 195649 161514 140433 125203 111527 98065 84587
1536H4587j2910j1060q521o593n468m376l238k693k702k487j872j440j332j091o73n59p45
1534A6827o42j05L60N26O85Q69O77R2l32k88m2K31P75J678K554K925K503J088j161l330m303
1531B1587l898k943k158j587j117q85q78p82m76k34k02j59KO6m9j02L1J22M0m0k1p3k57l45
1528E642k51j91k70k64p1P1Rn2M1J14J1j03o9j0o5j10l8K7l2p9j7Qj28k69k42j34r4q5l6k
1525C311k1J4J27J63O6kL6Qj63k65j56k2n5j32p0L9K6l0K8J24Q6k9m1M7P6Qn8p5p0m8k3m2
1521B857j04j05k6J4l1m2N0J36J30J10J21O6q9j94j49q5j14j29l9L9kk3R8K23J65Po0n2q3
1517B689j24r2n0p9q2L1J19K2j35j28J5R4R3J42K36K57J99J60J19jj32j37n2qnL9Q3M5PP8
1513C403J48N8j04j17%J4j21k21j89j16o1J4P5M0l4NJ34J81J18O8N1m8j94j97m5N1mo3j8L1
$$ plain form
1536 84587 71677 60617 52096 45503 40035 35659 32421 29728 27026 24539 22667 21227 19895 18804 18131 17572 16827
1534 16827 16185 16080 16440 16966 17651 18520 19197 19289 18957 18669 18627 18858 19633 21311 23865 26790 29293 30381 29220 25890 21587
1531 21587 17689 14746 12588 11001 9884 8999 8121 7339 6863 6629 6427 6268 6270 6336 6287 6185 6216 6338 6378 6338 6317 6244 5987 5642
1528 5642 5391 5200 4930 4666 4595 4666 4675 4623 4664 4778 4789 4686 4617 4607 4542 4432 4394 4421 4389 4310 4293 4301 4173 3904 3662 3528 3434 3349 3313 3311
1525 3311 3290 3304 3431 3594 3660 3658 3694 3702 3539 3274 3118 3096 3041 2909 2839 2878 2904 2874 2902 3026 3112 3083 3042 3089 3165 3173 3115 3040 2970 2922 2899 2857
1521 2857 2753 2648 2622 2636 2605 2563 2613 2749 2879 2989 3110 3176 3087 2893 2744 2659 2545 2416 2377 2416 2414 2391 2489 2712 2877 2884 2824 2772 2689
1517 2689 2565 2473 2423 2344 2262 2293 2412 2434 2299 2171 2186 2280 2373 2515 2751 3008 3207 3367 3486 3485 3353 3216 3164 3156 3151 3190 3273 3318 3325 3403
1513 3403 3551 3609 3505 3388 3388 3402 3281 3060 2871 2755 2694 2708 2783 2823 2789 2794 2928 3109 3227 3295 3346 3298 3104 2907 2862 2913 2909 2846 2828 2859
1510B859kk7K6N9rj02j15r0q8r2o7o4j02j17p5k8j4PL0Kn4m4L5O2om9MO2K4n1n6OO1N6j2j15
1505A914j61q5M3Q0K1j1K6M1kj4L0L6l1n9jK9n1j33j00j7PMN7J17R2J6j6pl0p0o0j4nm4n9
1501A543j9K3L4K4J8J1mk5m1l4j2JnkK0J9k9n2J4R8P9j4m3J9M5k9j06r9m0J5O7R9N7l2n6N
1497A549K4m9j07n9J8K9K7P4J07N5k4l4jmk3nJ7LpL2O2K0l8k8Pk6j02j20p6l8j3L3P7O3J4
1492A457qKQK1O3Q3L5rL8J18J02j0r3q4m4k5j5j4m2o6k5N2P6L1j1rLJ2L8O7L9m7j03q3k7Q
1488A538K1K9K9J4kpNL0N6N1Km4n0l7m4n4l4MJ4pl0m6m2QQ7J07K3o5m7M3P8L1j7k4l1n5n2
1483A482j3J0kqJ0J9K1N0R7Q8K2k3jJ9k7r3r1k7J2j0m9m4jK9K0%JJ5J0lKJ7%m5m9LL6Nk7Q
1479A463O2N5J4K3Q1J10Q6O3Q5J32J75J97J82J45J26J23O1r6k49k83k26j90j86j52q8o9r5
$$ plain form
1510 2859 2857 2830 2856 2915 2906 2804 2689 2599 2511 2419 2352 2288 2186 2069 1994 1966 1952 1959 1989 1991 1937 1893 1928 1990 1984 1935 1939 2001 2025 1974 1918 1924 1985 2041 2029 1914
1505 1914 1753 1668 1711 1791 1812 1801 1827 1868 1866 1852 1882 1918 1887 1828 1827 1856 1805 1672 1572 1555 1562 1566 1623 1740 1832 1848 1832 1825 1795 1725 1665 1651 1646 1602 1543
1501 1543 1524 1547 1581 1605 1623 1634 1630 1605 1564 1530 1518 1519 1514 1512 1532 1551 1522 1470 1484 1582 1661 1647 1604 1623 1668 1639 1533 1434 1394 1409 1476 1575 1632 1600 1544 1549
1497 1549 1573 1524 1417 1358 1376 1405 1432 1506 1613 1668 1644 1610 1609 1605 1582 1577 1594 1597 1590 1622 1684 1704 1666 1638 1645 1619 1517 1397 1321 1283 1270 1303 1380 1443 1457
1492 1457 1449 1451 1459 1480 1543 1626 1661 1652 1690 1808 1910 1900 1807 1723 1679 1654 1639 1625 1583 1517 1492 1544 1620 1651 1640 1631 1634 1646 1684 1751 1790 1743 1640 1557 1530 1538
1488 1538 1559 1588 1617 1631 1629 1622 1627 1657 1713 1764 1766 1722 1672 1635 1591 1537 1503 1507 1521 1514 1484 1438 1396 1404 1491 1598 1621 1556 1509 1552 1630 1661 1644 1620 1589 1534 1482
1483 1482 1469 1479 1477 1469 1479 1498 1519 1569 1666 1754 1776 1753 1752 1771 1744 1651 1560 1533 1545 1535 1486 1442 1441 1470 1490 1490 1491 1506 1516 1513 1515 1532 1532 1487 1438 1441 1477 1482 1455 1463
1479 1463 1525 1580 1594 1617 1698 1808 1894 1957 2042 2174 2349 2546 2728 2873 2999 3122 3183 3087 2838 2555 2329 2139 1953 1801 1713 1644 1549
1475A549q3j6L1K7J5J2k5q6r7l4L7O7Q5J04R3N2L8N2K9m7r6p3l2k3j3K9O9O3L2J7J4K9P6J32
1471B027J34P8L4K8%q4j48j30p1m8n7m8j2K7M3L2jj7K1Q0Q8M6M6J26K05K08J55J12R1Q0Q6
1467C131J14J51K16L64O01Q84J192J487J583J218L61o36j322j526j383j093p86n46m12l48
1465C250k70j58m3N5J25J43J00L0l4j13k13k74k40j55j04r6q5n4l0j3NQj8m6m9m7o4o0J6J21
1461A687J65J20K9n8j11j09o2k8m3o7n9n3p6q2qQ6Q9%o0k9L0M4K0%k5p5j12q0J2Q3O3k3q1
1457A187n6PL3K4L6P0O1pp3r6r6q3k6N7O9j1p4l9L3M1QKMl3n7%Q4Q1kn4l7j1j1j2j5l7n0j
1453I16O6O9K6K4N9M4j5k5K9M4k2p4m6j4l9n8lO4M6l4n6J3R5J05M4rJ0Q1J10L2r1j24m6L1
1448A252J6m1m9KM6M1Jl3k3L6R5R1K6k1j3J9L3L3L8L6J6ok1l9o3p2o4n2l8oJ9on2m7J9N9K4
$$ plain form
1475 1549 1466 1450 1481 1508 1523 1535 1510 1424 1327 1293 1330 1397 1482 1586 1679 1731 1769 1821 1850 1803 1707 1634 1602 1579 1566 1595 1664 1727 1759 1776 1790 1819 1895 2027
1471 2027 2161 2239 2273 2301 2301 2217 2069 1939 1868 1820 1763 1715 1703 1730 1773 1805 1804 1787 1808 1888 1976 2022 2068 2194 2399 2607 2762 2874 2965 3045 3131
1467 3131 3245 3396 3612 3976 4577 5461 6653 8140 9723 10941 11302 10666 9344 7818 6435 5342 4556 4010 3598 3250
1465 3250 2980 2822 2779 2834 2959 3102 3202 3232 3198 3085 2872 2598 2358 2203 2099 2003 1918 1864 1834 1821 1826 1834 1816 1770 1721 1674 1610 1550 1566 1687
1461 1687 1852 1972 2001 1943 1832 1723 1661 1633 1590 1523 1464 1411 1335 1253 1245 1331 1420 1420 1360 1331 1361 1405 1425 1425 1400 1325 1213 1133 1145 1228 1291 1268 1187
1457 1187 1131 1138 1171 1195 1231 1301 1362 1355 1282 1186 1090 1007 981 1038 1107 1096 1022 983 1016 1057 1065 1067 1071 1038 981 981 1065 1146 1144 1090 1053 1042 1031 1019 1004 967 917 916
1453 916 982 1051 1077 1101 1160 1204 1189 1164 1193 1237 1215 1141 1095 1081 1042 984 981 1045 1091 1057 1001 1014 1109 1214 1258 1249 1259 1340 1450 1482 1391 1267 1221 1252
1448 1252 1268 1227 1178 1180 1226 1267 1268 1235 1212 1248 1343 1434 1460 1439 1426 1445 1478 1511 1549 1585 1601 1595 1574 1535 1472 1400 1336 1284 1246 1240 1259 1253 1201 1154 1173 1232 1256
1444A256l3m5l5m7n8l1J9M5L8J9j1n5p5m4J1L6K2mj8j4J7O6Q9N9Oj6MJ6ml7m0pK8K2j8l8r
1439A114K5np6j02m2M4P9O2L8M1N6M7j1r2j23p2RL7Ok5k9l3l1J3P9J06Q2N1K5l6j07j02j3
1435A015M4%n6l0L3M3Rkln7j34j38n2M0O6M8L1K8L8N3O0L9jk7k5pJ5K5J3nmK3M5M2L4M0L9
1431A282J5j4k6k2j8k0k6l9l5OM3K2k4oP8J11L3n9n4K1O6O1M1Pn4r1n9%Nk3j9Pqn7p2m7k9
1426I96k1K6J04J37R7L6j1n3q8p8l3qj5oK7L3lk7oJ8Mk6l9l3j7J7M8K5m9r3n5J8M4K3J2L3
1422A037M8K8j5l9k1J6L9L0%m0q4j08o5K0N7%o3k4P6J05L0m3l0K6M6L0K6M0M6K8om1m8j6J7
1418A102kn4n6J6R2R2L1k8o1p9q1n5JO3J00Q8K3n6q8o1j8kqqOK0K1J4RJ1Ok0m9m6mK8J3j9
1413I41j5J9M5N1N5M1lm9o1o3p8o6J2R5Q4Jm2j8ml1k9L0O1J8k3RO7P3M1J7j1o5r4l9O0R5L9
$$ plain form
1444 1256 1223 1178 1143 1096 1038 1007 1026 1071 1109 1128 1117 1062 987 943 954 990 1012 1008 990 976 993 1059 1148 1207 1213 1197 1201 1217 1213 1176 1136 1129 1157 1179 1161 1123 1114
1439 1114 1139 1134 1058 956 914 958 1037 1099 1137 1178 1234 1281 1270 1178 1055 983 992 1029 1035 1010 981 948 917 930 1009 1115 1197 1248 1273 1237 1130 1028 1015
1435 1015 1059 1059 1003 973 1006 1049 1058 1056 1053 996 862 724 672 712 778 826 857 885 923 976 1036 1075 1074 1047 1022 1015 1030 1055 1068 1063 1059 1082 1127 1169 1203 1243 1282
1431 1282 1297 1283 1257 1235 1217 1197 1171 1132 1097 1103 1146 1168 1144 1138 1216 1327 1360 1301 1247 1268 1334 1395 1436 1443 1389 1298 1239 1239 1244 1221 1202 1209 1201 1144 1072 1025 996
1426 996 975 1001 1105 1242 1339 1375 1364 1311 1223 1145 1112 1104 1089 1083 1110 1143 1140 1113 1107 1125 1129 1103 1064 1031 1014 1031 1079 1104 1055 962 907 925 969 992 1004 1037
1422 1037 1085 1113 1098 1059 1038 1054 1093 1123 1123 1083 999 891 826 846 903 903 840 816 892 997 1027 984 954 980 1026 1056 1082 1122 1168 1196 1190 1149 1101 1085 1102
1418 1102 1100 1046 990 1006 1098 1190 1221 1193 1132 1053 972 917 918 981 1081 1169 1192 1136 1048 987 969 967 959 951 957 977 998 1012 1021 1032 1038 1018 969 923 919 947 960 941
1413 941 926 945 990 1041 1096 1137 1134 1085 1024 961 883 817 829 924 1008 1009 967 949 945 914 885 915 976 994 971 980 1047 1120 1161 1178 1167 1102 1008 969 1029 1124 1163
1408A163m8r2p2kP0Q7L6k5m2k5j6j8j7j5j2JK4K6Jj4jJ1J1K0M2L2k5o6m7j4j3j6K2O1M1pj4
1404A047J8K6j1m4m3k2pj0j9mN7J24J08Np6n8pj8n5k3N6P5J5m1m4l5m0k1L0O3M1Lj1ol%mk2
1399A044m0l2nQJ3L8N5J0p7j10n0J8J1l4k2N3J04O5l1r8q2j1M7N6L3J1qk3pM2P0L8k0l9l4
1395I93n7r4p4J0P3O1K1J6L8M6L9L9K6rl5j9J1J0j3oK7L1j8o2m0K1M3J2pL1P4M9k7n7qM3K4
1390A212m0p6o9n0l6k2j4j1LL7N4L3KJJ3J7K5M6L3l8r2n1K6K6m6o8rK9pm0kM7L1k0k9%J8J3
1386I46K1L8M7M7M7L0pk2RM1J3m5m8J5O3L1n7j14q4mN0K7l6o3k9J8L1J2nJK8O3P6M6j2m9m5
1381A080l3m9p5o9k8J0J9QKJ5L8N3N9P6Q3K7q9j53q3M7Q1qq4n6RJ1l2l8PM8N6M0J7lkJ9K4
1377A027mk9k3j1j1JM3P0M1nrJ6K2QRJ1k3p0n3L4J13J15N5j2n5p3n9j6L3N5K8l2p3n4J0N9
$$ plain form
1408 1163 1115 1023 951 949 1019 1106 1142 1117 1075 1050 1034 1016 999 984 972 973 997 1023 1024 1010 1009 1020 1031 1051 1093 1125 1100 1034 987 973 960 944 966 1027 1068 1061 1047
1404 1047 1065 1091 1080 1036 993 971 964 954 935 931 988 1112 1220 1225 1149 1091 1084 1066 1011 988 1044 1119 1134 1093 1049 1014 974 953 983 1046 1087 1090 1079 1073 1070 1070 1066 1044
1399 1044 1004 972 967 975 988 1026 1081 1091 1014 904 854 872 883 849 827 880 984 1049 1018 920 838 827 874 930 963 974 966 943 936 978 1048 1086 1066 1027 993
1395 993 936 842 768 778 851 912 933 949 987 1033 1072 1111 1137 1128 1093 1074 1085 1095 1082 1076 1103 1134 1116 1054 1014 1035 1078 1090 1083 1114 1188 1237 1210 1153 1145 1188 1212
1390 1212 1172 1096 1027 977 941 919 905 894 897 934 988 1021 1023 1024 1037 1054 1079 1125 1158 1120 1028 977 1003 1029 983 915 906 935 928 888 886 933 964 944 915 915 933 946
1386 946 967 1005 1052 1099 1146 1176 1169 1147 1156 1197 1210 1165 1117 1132 1195 1226 1169 1055 971 967 1017 1044 1008 945 916 934 965 977 972 973 1001 1064 1140 1186 1174 1125 1080
1381 1080 1047 998 923 854 826 836 855 863 865 880 918 971 1030 1106 1189 1216 1127 974 891 938 1019 1011 927 871 880 891 859 821 828 876 932 972 989 986 984 1003 1027
1377 1027 1023 994 971 960 949 950 993 1063 1104 1099 1090 1106 1128 1136 1145 1156 1133 1063 1010 1044 1157 1272 1327 1315 1260 1187 1128 1112 1145 1200 1228 1196 1123 1069 1079 1138
1372A138O0M7N4O0K3m0p5o1l3j8lJ4J5lj4LK2Ql0n0l3jJ8K8M5O2N3J1m1p1p7o2j3N4P6K6m0
1368A152m0K1O3N3L1L0K5Plpl1n7k3O4J10O6J7M1R9R5L1nL2J04J46J34R1P1J05J46J19L7L
1364B727O0J20R9L7K8P5J16J17P8nr9j25o3j6p7j70j62o0Kl0q0q5p2q3j10j33j46j36r7o4
1360A646p7j01q8m2j4OM9Q3N4nj2K9M5L6Q1J77K23J72R6O6N7M0L4O6J05J23J23J07O3K9N7
1356C228J18J27O8Pk8p5j33j42j03r7j41j41o4j8p7j54j42q6q4j20j15p1o0q6r5q3q7r2n9
1353A195p%l9o1m2j9j4nK0L5L0K1J5%j9l6n1n6l0K1M4%p1r2m8J9P5J03P9J0m4k6M0P8O4L0
1348A219Pj8m2n9o6o2k8L9R1P7K4j4j6oJ5N0O0Lq1j04l7M3O6L5lk6l7l6k3j4k1k9k5j1MK0
1344I95L6L5Mm1n6k1K8L6mk6J2O8N6k3q3o3j0J4QQJ9K4J8Rpk6j4L2O9M9qn6q2r1p3j6N5R9
$$ plain form
1372 1138 1198 1245 1299 1359 1382 1342 1267 1206 1173 1155 1152 1166 1181 1178 1164 1167 1189 1197 1167 1117 1084 1083 1101 1129 1174 1236 1289 1300 1259 1188 1111 1049 1036 1090 1166 1192 1152
1368 1152 1112 1133 1196 1249 1280 1310 1335 1342 1339 1332 1301 1244 1221 1285 1395 1461 1478 1519 1618 1713 1744 1739 1771 1875 2021 2155 2246 2317 2422 2568 2687 2724 2727
1364 2727 2787 2907 3006 3043 3071 3146 3262 3379 3457 3452 3353 3228 3165 3149 3072 2902 2740 2680 2682 2652 2572 2487 2415 2332 2222 2089 1943 1807 1710 1646
1360 1646 1569 1468 1380 1338 1324 1330 1379 1462 1516 1511 1499 1528 1573 1609 1690 1867 2090 2262 2358 2424 2481 2521 2555 2621 2726 2849 2972 3079 3142 3171 3228
1356 3228 3346 3473 3541 3548 3520 3445 3312 3170 3067 2970 2829 2688 2624 2606 2529 2375 2233 2147 2063 1943 1828 1757 1697 1611 1516 1433 1346 1254 1195
1353 1195 1188 1188 1149 1088 1046 1027 1013 1008 1028 1063 1093 1114 1129 1129 1110 1074 1023 967 937 958 1002 1002 931 839 791 810 885 988 1067 1077 1033 1007 1047 1125 1189 1219
1348 1219 1226 1208 1166 1107 1041 979 951 990 1081 1158 1182 1168 1152 1146 1161 1211 1271 1274 1193 1089 1052 1095 1161 1196 1193 1167 1130 1094 1071 1057 1036 1007 982 971 975 995
1344 995 1031 1066 1070 1029 973 952 980 1016 1012 986 998 1066 1122 1099 1016 953 943 957 965 973 992 1016 1034 1043 1036 1010 996 1028 1097 1146 1138 1082 1000 909 836 820 875 974
1339I74J05P3Kq6j33j12n8k1J3O5J06R0K8k3l2j2J3K6K4K9N1O3K7l0l5J3K5k7n9j1M4K9j0
1335A151J1M1mq6q1J3P5N0ll5n5n9j3M9N7J7PK7%o3n9K8R0O0J5J5Ko7j13n2M7O7K4J6N1O1
1331A284K9OJ3J5%%J7J0k7n4m7k4lJ4J9jl0l4j8j6k5JO5R2K2r1j26m6N3O9J8k5l1l5m5j9L7
1326A067O3K5j8j5QOojJj3JO5J14Q1Rj4j2m9q8m2N1O0l1q3l1L7N2N6Q6Q3J9k7ML2j8r6j11
1322A265q4o4l4M1J00O0l1o2k0J5lk8k3NK8L0lm4l0M1P3mj04r7J2Q5M7m1q3o0JO6R4O3ro3
1317A139p1m2mJ6OmL3R4Q4j8j07p6K3O5K5rK1P0P4K6l7o3j9N6P5Kq0q8n2n2p4l5N3R4M3k0
1313A148k8KJ5J3J9M0N5N1J3l9n9k6J1on5o9m3l2m6l7%K3J4K4P0R2L7o1j14q5j6L0L0K7O3
1309A061J03P9nn5j9K4j2p5o9qK4J7L1O4N5J0pLj4n3m2J0K2mMM4K0o7r3j6L9k0r1n8K6M3L
$$ plain form
1339 974 1079 1152 1154 1068 935 823 765 744 757 822 928 1018 1046 1023 991 979 992 1018 1042 1071 1122 1185 1212 1182 1147 1160 1185 1158 1099 1088 1132 1161 1151
1335 1151 1162 1203 1199 1113 1032 1045 1120 1170 1167 1132 1077 1018 1005 1054 1111 1128 1135 1162 1162 1099 1040 1068 1158 1218 1233 1248 1250 1183 1070 1018 1065 1132 1156 1172 1223 1284
1331 1284 1313 1319 1332 1347 1347 1347 1364 1374 1347 1293 1246 1222 1219 1233 1252 1251 1221 1187 1169 1153 1128 1129 1194 1286 1308 1217 1091 1045 1098 1167 1185 1160 1129 1094 1049 1030 1067
1326 1067 1130 1155 1137 1122 1130 1136 1130 1129 1130 1117 1118 1183 1297 1378 1387 1373 1361 1312 1224 1182 1233 1293 1262 1179 1148 1185 1237 1293 1379 1462 1481 1454 1458 1490 1472 1376 1265
1322 1265 1181 1117 1083 1124 1224 1284 1253 1191 1171 1186 1183 1155 1132 1137 1165 1195 1192 1148 1118 1159 1232 1228 1124 1027 1039 1124 1171 1130 1047 987 988 1054 1148 1211 1202 1139
1317 1139 1068 1026 1022 1038 1044 1040 1073 1167 1251 1233 1126 1050 1073 1138 1163 1154 1175 1245 1319 1345 1308 1245 1226 1282 1357 1359 1279 1191 1139 1087 1013 978 1031 1125 1168 1148
1313 1148 1120 1122 1137 1150 1169 1209 1264 1315 1328 1289 1230 1204 1215 1209 1154 1085 1042 1010 964 927 927 950 964 988 1058 1150 1187 1126 1012 927 911 941 971 998 1061
1309 1061 1164 1243 1238 1183 1164 1188 1176 1101 1032 1024 1048 1065 1096 1160 1215 1225 1218 1221 1207 1154 1112 1122 1144 1140 1144 1188 1208 1141 1048 1032 1071 1051 960 902 928 971 974
1304I74kM0O0M1J8OjJ2L9K1o7j34r3J1N7K6qnJj6l1k1%K6M4K7j8l1K7Q5N9k9p5l9J5L0K3L5
1300A107M8K8l2r1r4l5L4M4J2J0M8M2m6j25r9j3K8J7L7Q9R9M2j2k0j3k1j8J0K2j2m6l7KK5
1295A030L1L8M7M0Rk0j7J9N0L0k3l7PM5J6m5n9k0Lj5l5k7rjOJ8K5L3N5O0J9l5k9L3O7L0j2
1291A327nJ9Nl3m2j3J3Ok9o2o9l4J7M1K8J2J8J3k4n6l8J2L2Rj6rJ8L1K2MmRL2L7J0j9j4J9
1286A267K9mm0k5K9O0L6qk8l3m6m9j5K4Qn4o6NO9L6m9o2J7P8M1l9n9oM3L2k1n5m9k5j2j8j3
1282I98QK3Qk4l3j3Qjk8l7j4K5N1M8L4L0L5M3N4O3M0l0r0p5j1Rm9j02p8j2K6L5M9O1N1M2N8
1277A202M7k3r2p3JK5j8l7J2N9M2j3n3o6n6k0K0K6jj5n%j0lK1K6Kqjj0l3k0K4M3K3J2L2K6
1273A086j3k6QK0k9p0m1kj8m7j9K6Rl4rP1J01M5k5m3l5m2n0k6K7P1O5J0m5l4K6M7Mk6K1P2
$$ plain form
1304 974 972 1012 1072 1113 1131 1137 1136 1148 1187 1208 1141 1007 914 925 982 1008 1000 995 996 980 949 928 928 954 998 1025 1007 976 1003 1088 1147 1118 1043 1004 1019 1049 1072 1107
1300 1107 1155 1183 1151 1060 966 931 965 1009 1021 1031 1079 1121 1075 950 851 838 866 883 920 1009 1108 1150 1138 1118 1105 1084 1066 1076 1098 1086 1040 1003 1005 1030
1295 1030 1061 1099 1146 1186 1195 1175 1158 1177 1227 1257 1234 1197 1204 1249 1265 1220 1161 1141 1144 1129 1094 1067 1058 1057 1063 1081 1106 1139 1194 1254 1273 1238 1209 1242 1309 1339 1327
1291 1327 1322 1341 1346 1313 1271 1258 1271 1277 1248 1186 1117 1083 1100 1141 1169 1181 1199 1212 1188 1132 1094 1106 1138 1147 1131 1122 1140 1171 1193 1197 1193 1202 1234 1271 1281 1262 1248 1267
1286 1267 1296 1292 1252 1227 1256 1316 1352 1344 1316 1283 1237 1188 1173 1197 1205 1151 1085 1090 1159 1195 1146 1084 1101 1179 1220 1181 1122 1116 1159 1191 1170 1115 1066 1041 1029 1011 998
1282 998 1006 1029 1037 1013 980 967 975 974 946 909 895 920 971 1019 1053 1083 1118 1161 1215 1278 1318 1288 1198 1123 1112 1121 1072 970 892 880 906 941 990 1051 1102 1144 1202
1277 1202 1249 1226 1134 1061 1062 1087 1069 1032 1044 1103 1145 1132 1079 1013 957 937 957 983 982 967 962 962 952 949 970 996 998 990 989 979 946 926 950 993 1016 1028 1060 1086
1273 1086 1073 1047 1055 1075 1046 976 935 933 915 868 849 875 884 850 841 912 1013 1058 1033 990 955 913 863 837 864 935 1000 1010 965 931 957 1004 1008 982 1003 1075
1268A075L6m0m5K1M1j7o7m8pNLJ2Rj7k2PJ9rk5J6O0M5lk1qnnK2N5M0j1k7K3O6K9p0j36j07
1264H94j2N9N2Jj4K8N4J1o5r0m8LL0M9P4P4K4m1o5l6QL3K1k9p9p7qN0K9l6m6J4N1Qm4j6O5
1259I26J00N9%l2m4l5PO1P1K8k2l8l5l0j3K4N3M9K2ok8l3oL1L5NrJ6L0ro2o3j2L8M6J5l6q1
1254A022r1o1j5K7N5N2J8j7j6%j7n1l5K6M5OqL5M3l2p5jR1M7q1j10j0P9P0J6k2n6p3j8Q1J06
1250A030L0l0NN2J8m4l4K8N1Pl7l3nJ0Kj3j0J8L4no9o7J6Q3N4l4q9q4n6k7J2M5N1L2Lk9n1
1245H64l8jJ6pk3MM4M9K9J8J2jlK6N4L3j5l6j6NJ2K6M8M8J0l3l6nJ1j8n2l8J7L5j8p1l9L6
1241I47N5J3nK2J5n1q4l2K7J2k1QN5L1l8n5j3Lk8m6j6K2L5L7L6K2OOnn0q4l9N6J02O3jk9k8
1236I48qL6O7L7l3n3kM1J1m5n5j9J7L6M6M6K8pm7q6r1m5J7L6J9J9M5M7J0j9k6n2j00r8k2M1
$$ plain form
1268 1075 1111 1071 1026 1047 1088 1071 1004 956 949 954 957 969 978 961 939 946 965 956 931 947 1007 1052 1049 1028 1020 1015 1010 1032 1087 1127 1116 1089 1112 1178 1207 1137 1001 894
1264 894 882 941 993 994 980 1008 1062 1073 1008 918 870 873 903 952 1026 1100 1124 1083 1018 982 990 1023 1044 1015 936 859 851 901 930 894 848 862 913 921 877 861 926
1259 926 1026 1085 1085 1053 1009 974 981 1042 1113 1141 1119 1081 1046 1016 1003 1027 1080 1129 1151 1145 1117 1084 1078 1109 1144 1149 1140 1156 1186 1177 1115 1052 1040 1078 1124 1139 1103 1022
1254 1022 931 870 855 882 937 989 1007 990 974 974 957 906 871 897 942 948 940 975 1018 986 911 910 1001 1048 967 857 847 926 996 1012 990 934 861 843 924 1030
1250 1030 1060 1030 1035 1087 1105 1061 1027 1055 1106 1113 1076 1043 1038 1048 1050 1037 1027 1045 1079 1074 1005 938 954 1037 1091 1057 968 884 828 801 813 858 909 941 944 915 864
1245 864 826 825 841 834 811 815 859 908 937 955 967 966 963 989 1043 1076 1061 1025 1009 1014 1026 1052 1100 1148 1158 1125 1089 1084 1095 1077 1025 987 1004 1039 1021 950 911 947
1241 947 1002 1015 1010 1032 1047 996 912 880 907 919 898 906 961 992 954 899 886 889 861 815 799 821 856 893 929 951 957 963 958 908 824 785 841 943 1006 1005 976 948
1236 948 940 976 1043 1080 1047 994 992 1033 1044 999 944 925 942 978 1024 1070 1098 1091 1044 958 867 822 839 875 894 913 958 1005 1015 996 970 918 818 720 698 739
1232G39K7mL5J01Q1k6r5n0L1M4j2m9j0O4Q3K6m5m8QM3J8k9m5l4j4J4M1K9j6k1L5P2K5l6j1
1227I71N8N3k5n5J7Q4N3k4n4l3k0j9lJ5jk3rL1L8km3n0m2k7MM9O2K8j8k8j2j%NOk0n4n0lL5
1223H93K4j6l6l4k3jM4Q3N9k2p7m7L1Q1P0L6K1J9J4kj8l0m1n8o3l3K2N4J6n8q0j5O2O7J8N
1218I65M4O2J2m9m9ON6P7P9M5l3j05r0LP4N8Jl1l8m6m6j4K9M3K3Nnk1l0j0J6J5LK1M6J1o4
1214A063p6OP9N9nk0qm1r0n9N4J24P2k2m9kL0Pk8j7K7L4l2j06q9K8J20Q4k7p4k4L0J5k2qM0
1209A073N8J9m5q3n0L8R6L8r2j52p9L9R0P9O8O0K6j8l2l6n4n6J4J05J12K3n8n7j3J2QLJJP
1205A145J0lj1K0O6N9jl0J2M1j7j07j11l1K3ml8oO1Q2M1j1j9QL2K3rl2k4KJ2lj5nJ1lm4p1
1200A053m0L6J00J07N8mn1p4p4n0j3Ook1mL4M9K2j6l3k6rJ5L7L3jk3nK2Nm1o1l9j3OM4R3Q9
$$ plain form
1232 739 766 762 797 898 979 953 858 808 839 883 871 822 812 876 959 985 940 892 900 943 961 932 887 853 839 853 894 923 907 886 921 993 1018 982 971
1227 971 1029 1082 1057 1002 1019 1103 1156 1132 1078 1045 1025 1006 1003 1018 1017 994 985 1016 1054 1052 1009 959 917 890 894 943 1005 1033 1015 987 975 974 974 979 985 965 911 861 858 893
1223 893 917 901 865 831 808 807 851 934 993 971 894 847 878 959 1029 1065 1086 1105 1119 1117 1099 1069 1028 970 907 874 896 950 966 908 828 813 875 942 960 965
1218 965 1009 1071 1083 1034 985 991 1047 1124 1203 1248 1215 1110 1020 1023 1097 1155 1156 1125 1087 1041 995 981 1010 1053 1076 1081 1076 1055 1025 1015 1031 1046 1049 1070 1116 1127 1063
1214 1063 987 993 1072 1131 1126 1106 1098 1057 967 908 962 1086 1158 1136 1087 1085 1115 1122 1094 1077 1104 1138 1106 1000 911 939 1059 1143 1116 1042 1018 1048 1063 1041 1033 1073
1209 1073 1131 1150 1105 1022 972 1010 1106 1144 1052 900 821 860 950 1029 1097 1157 1183 1165 1133 1097 1043 987 1001 1106 1218 1241 1183 1126 1113 1125 1133 1136 1137 1138 1145
1205 1145 1155 1152 1141 1161 1227 1286 1285 1255 1267 1308 1291 1184 1073 1042 1065 1061 1023 1017 1078 1160 1201 1190 1171 1179 1211 1234 1225 1193 1169 1171 1183 1180 1165 1160 1171 1168 1124 1053
1200 1053 1013 1049 1149 1256 1314 1310 1259 1185 1111 1061 1048 1054 1048 1027 1023 1057 1106 1128 1112 1079 1053 1044 1059 1096 1129 1128 1105 1100 1122 1127 1086 1025 986 973 979 1023 1116 1205
1196A205J5m5k0M2M7kk0RJ6k6n8k8K2J9k9o6o2l8j9mJ6M9Q3Q4L4k6l2K0N7K5l8o6m7j8kkK
1191A097J4L7N3M5K1Krk0k5nK6K6pl5l6l4l3j0K1J6k2l0LJ5j5j6N0R1L5m8n6j1%oK8O1J9m8
1186A194l0M0L6m1o1MK5m9r2j0R0Q5K6K1M1j3j08j27n4K0L5J4k0o2o7nO9O0k3p6l8L2O1M0
1182A017J0JJ2J8nm7n2jM8M9L2M9P1L7l3n4j6J0j6m1k7OL7P5R6M5n7j05m9J9kq0j02l8L7O5
1178A009N5L5Qj3jL4M1j2q2j07o1J4N2K9k0l7%M3L8lk8j6mj0qK2M8K6k8n5k9RK5K6K6J6nj1
1173A026J1J4k3m9jP7Q1pq2o8qJ7J2K7N7N7K8J6L4M2J0m1p6q1o5m3k9j7J0M6N9M1K0J3kk7
1169A079j6M9Q2J2r0r3mL7k5q7o6j9j3j3L8R5P7ln3m3j4J6N4P8N1Jj3NNj1JK9J0m8n4J2N9
1164A125K0l2j0O3R4N6km8q7j07q9m8j6J1M5O0K4l9n8k7J0K9M5M7Pl6qP5R0Kp3l9L1J4o8r1
$$ plain form
1196 1205 1220 1175 1155 1197 1244 1242 1222 1231 1247 1221 1163 1135 1157 1176 1147 1081 1019 981 962 958 974 1023 1106 1190 1224 1198 1166 1186 1243 1268 1230 1164 1117 1099 1097 1095 1097
1191 1097 1111 1148 1201 1246 1267 1269 1260 1240 1215 1210 1236 1262 1255 1220 1184 1150 1117 1107 1128 1144 1122 1092 1095 1110 1095 1079 1129 1220 1255 1207 1151 1140 1140 1134 1162 1223 1242 1194
1186 1194 1164 1204 1240 1199 1138 1142 1167 1118 1026 1016 1106 1191 1217 1238 1279 1266 1158 1031 977 997 1032 1046 1026 964 897 892 961 1021 998 922 884 916 977 1017
1182 1017 1027 1028 1040 1058 1053 1006 954 953 1001 1050 1082 1131 1202 1239 1206 1152 1136 1146 1130 1089 1062 1068 1105 1180 1276 1321 1264 1159 1110 1129 1127 1047 945 907 944 1009
1178 1009 1064 1099 1107 1094 1093 1127 1168 1156 1074 967 906 920 972 1001 981 944 944 987 1025 1022 994 978 974 964 956 978 1026 1052 1024 969 940 949 974 1000 1026 1042 1037 1026
1173 1026 1037 1051 1028 979 978 1055 1136 1129 1047 979 971 988 1000 1027 1084 1141 1169 1185 1219 1261 1271 1230 1154 1073 1008 965 936 919 929 975 1034 1075 1095 1108 1106 1079
1169 1079 1063 1112 1194 1206 1116 1023 1019 1056 1031 944 878 859 846 833 871 966 1043 1040 987 944 930 946 1000 1078 1129 1130 1117 1122 1127 1116 1117 1146 1156 1108 1054 1066 1125
1164 1125 1145 1113 1103 1166 1260 1316 1314 1266 1179 1072 983 935 919 930 975 1035 1059 1020 962 935 945 974 1019 1066 1073 1037 1029 1104 1194 1196 1123 1084 1115 1129 1061 970
1160I70l4K1L7O0R4O1l8q8j5Q8R4J7l0oL5M1K2jk5l9k8PK7Mn0r3r2m2QJ6oqJ1Jm1m2K9Q8N6
1155A109k1m2%L3L1L8M7K2j3J2P4N7n7j34p4L9O9K2pJ0K0mk6l1m0m9l7j4lLL9Q2O6nn6m8k8
1151A084m2n7j3P4J17O5l8r3o1J1L4j1n7m1J3L9K6J7K8K6pl4k2Jqm6o2k2M7Q8P1K3qjJ0mk6
1146A121k4j0k0m3l1K3O3M8Mj7j3lKLnj9j2J8M5M5L7K8po8r4m1L2L5rj1L9N2on8l8Ojm4m9
1141I78qK6J8%mlj1k2k3j1KJk0l6j9K3M2J6mJ5L0nn7m8K3P5O2J6k7n8o8l2L5P6P1M2Nm8r5
1137I57p6MN7L3j3j3K3L9L0K6J4k6p0q3n9k1L0P5O2j0n2kN9K6o6p8J3Q4N1k3m2k0lPK3L1J3
1132A000qj1j7m1m1NN0M5J5RK4J8jPM0N7L9Rj7m3n9n4k8j6k7l8j8K9O4M8j4n8m1J1K9OnK5
1127I93M7K1k9m0j0K2L5L4K5Jl2n4n3k3K7O2M7LKO5J29J33J02R4J04Q6L0l2q8j46j78j50p7
$$ plain form
1160 970 936 957 994 1054 1148 1209 1171 1083 1068 1156 1250 1267 1237 1231 1266 1307 1329 1328 1303 1264 1236 1243 1270 1274 1224 1131 1039 997 1005 1021 1015 1007 1018 1019 978 936 965 1053 1109
1155 1109 1088 1046 1046 1079 1110 1148 1195 1217 1204 1216 1290 1347 1290 1156 1082 1121 1190 1212 1205 1215 1235 1231 1205 1174 1134 1085 1048 1034 1031 1034 1073 1155 1221 1216 1160 1112 1084
1151 1084 1042 985 972 1046 1163 1228 1190 1097 1036 1047 1081 1070 1013 972 985 1024 1050 1067 1095 1121 1114 1080 1058 1059 1051 1005 943 921 968 1056 1127 1150 1142 1141 1151 1147 1121
1146 1121 1097 1087 1067 1024 993 1016 1079 1127 1131 1114 1101 1098 1100 1103 1098 1079 1067 1085 1130 1175 1212 1240 1233 1165 1071 1030 1062 1097 1088 1077 1116 1168 1162 1104 1066 1072 1071 1027 978
1141 978 970 996 1014 1014 1010 1007 996 974 951 940 942 943 923 887 868 891 933 949 945 960 990 985 928 880 903 978 1040 1056 1029 971 903 871 906 982 1053 1095 1100 1052 957
1137 957 881 885 942 975 962 949 972 1011 1041 1067 1081 1055 985 902 843 822 852 927 989 979 927 925 984 1010 944 866 879 963 1014 991 949 929 926 933 956 987 1000
1132 1000 992 981 964 923 882 887 937 982 997 1006 1030 1048 1047 1054 1094 1151 1190 1199 1182 1139 1080 1026 998 982 955 917 899 928 992 1040 1026 968 927 938 967 973 968 993
1127 993 1040 1061 1032 992 982 1004 1039 1073 1098 1099 1067 1013 960 937 964 1026 1073 1076 1078 1143 1272 1405 1507 1601 1705 1791 1821 1789 1701 1555 1377 1227 1150
1123A150j9jpj9l8m7k6RL0L5M5M5Nm7n0nJ7j4m1j3L5L9jk2RN3M6j9q7r2k8N3R3Q6N3J1j5P
1119A230N9O6mp4m8N6J31J34J16J27J31R4K8m1j11j67j66j02l5k4m8n4l0k0m9r2r4l6L8M9
1115A064j2o7m6K2M4Rj2K0N4N0L3K8jo5j06o1K7P2N2K1J1Qok5l0j1J7J5l5p9m1P2J50J04q
1111A268o6k4N1O9J4n3n4K1Q2L4q8j50q5J8N3L1J9K7J3j5k2j9l2m1rL5L9K1M0O8M1k2k6L8
1107A276P4M2J2L7O7N4M8J01J51J21L7nJ0Pn3j26j52j12l2L7L7l6j08r5qP3R9Q5N6J2k6l1
1103A652j1j4m8o7m2j7l1n8m8oK3K1Lk2n2n5j0M3N4L8M5O2K9m7o1K7J09Q9K7L9J11J38J00
1099B021Q3J15J22P3N6J28J96J48J2r6j27j33j48j50j21r5r4j00q6n6l2l0l7k3K1N5L0m0q1
1095A611o4l8m5n8l9j9l5o2n2l1m1n9j9N8R0N6K7M3M7mm9k9L3N8K0l1m9k0L1O3M9K0K9Q5J35
$$ plain form
1123 1150 1131 1130 1123 1104 1066 1019 993 1002 1032 1067 1112 1157 1162 1115 1065 1060 1077 1063 1022 1009 1044 1083 1082 1060 1069 1122 1168 1149 1062 970 942 995 1088 1174 1227 1238 1223 1230
1119 1230 1289 1355 1351 1277 1229 1285 1416 1550 1666 1793 1924 2018 2046 2005 1894 1727 1561 1459 1424 1400 1352 1298 1268 1248 1199 1107 1013 977 1015 1064
1115 1064 1052 985 939 961 1005 1014 1002 1022 1076 1126 1159 1187 1186 1121 1015 954 981 1053 1105 1126 1137 1145 1139 1114 1084 1073 1090 1105 1070 991 950 1022 1172 1276 1268
1111 1268 1202 1178 1229 1298 1312 1259 1205 1226 1308 1342 1254 1104 1019 1037 1090 1121 1140 1167 1180 1165 1143 1124 1092 1051 1042 1077 1116 1137 1177 1245 1286 1264 1238 1276
1107 1276 1350 1392 1404 1441 1508 1562 1610 1711 1862 1983 2020 2015 2025 2032 1979 1853 1701 1589 1557 1594 1631 1595 1487 1392 1384 1457 1556 1641 1697 1709 1683 1652
1103 1652 1641 1627 1579 1512 1470 1453 1422 1364 1316 1310 1333 1354 1357 1335 1283 1228 1218 1261 1315 1353 1398 1460 1489 1442 1381 1408 1517 1606 1633 1672 1783 1921 2021
1099 2021 2104 2219 2341 2414 2470 2598 2794 2942 2954 2858 2731 2598 2450 2300 2179 2084 1990 1890 1804 1748 1716 1686 1649 1626 1647 1702 1732 1692 1611
1095 1611 1547 1509 1464 1406 1367 1348 1313 1251 1199 1168 1127 1068 1049 1107 1197 1253 1280 1323 1370 1366 1317 1288 1321 1379 1399 1368 1319 1299 1330 1393 1442 1462 1491 1576 1711
1091A711J31R6P9Q0O0On2p0n3m4p5j22j28p1j5k0o2p4m9m3o7p1l1J1K4L2N5N5Om9n1nM1N0
1087A285K4k8o8n9j0K2J4J4M9N7j0r5r0kO2M6Jj6j1qQM1O1M3Ll7q0j03o2L1Q5L9m1n0J3N0
1082A178J3l6l0KQJK3N0K9j4mO2R4M4j7j1J9Lm8n6j9ol2m6j8Lrj6J5M7M1J1j5l2m0j8L8O7
1078A281L7oqJ6J9J4L7O9N0j2m2k1j4n4q1m0L1N6J7l3n5n5l7KM3N2K5pj2j3k1j3L8R4R5M7
1073A499J2Pk0q0r5k1O8O3k1p2m9%L6P4R7N0m9r4k9N6O5K3RK4J4j6k0QK5J5OJ4K7K6%m8r1
1069A513q3l1J2K0K9O0O4%p7r3n8k4RO2J01P6J7%J9J3l0m7k0Kpj3LJ3MojLJ6M9P5M7orK9K8
1064A759j8j9N3J00N7opK2Ml0qM7N2jl5j3J6K0K2L8M0K3K5O7J01P3Pk8j3Nj4m8n1j0M7R4J19
1059B490J03M2kM4J60K23J55L7lL6N2Om6o1o8q9r2m9QM0M9M6L1J8K7L7J3k5j2L8M1j5m2J0
$$ plain form
1091 1711 1842 1938 2017 2097 2157 2163 2111 2041 1988 1944 1869 1747 1619 1548 1533 1513 1451 1377 1328 1285 1218 1147 1116 1127 1151 1183 1238 1293 1299 1250 1199 1194 1235 1285
1087 1285 1309 1281 1213 1154 1144 1166 1180 1194 1243 1300 1290 1195 1105 1103 1165 1211 1212 1196 1185 1177 1185 1226 1287 1330 1333 1296 1216 1113 1051 1082 1167 1206 1165 1115 1128 1178
1082 1178 1191 1155 1125 1127 1135 1136 1159 1209 1238 1224 1220 1282 1376 1420 1403 1392 1411 1414 1366 1310 1291 1285 1253 1207 1189 1192 1183 1167 1182 1229 1270 1281 1266 1234 1194 1176 1214 1281
1078 1281 1318 1312 1304 1320 1339 1353 1390 1459 1509 1497 1455 1434 1420 1366 1285 1245 1276 1332 1349 1316 1261 1206 1169 1171 1214 1266 1291 1284 1272 1259 1238 1225 1263 1357 1452 1499
1073 1499 1511 1518 1498 1418 1323 1302 1370 1433 1412 1340 1291 1291 1327 1401 1498 1548 1499 1405 1376 1432 1497 1520 1529 1553 1567 1551 1531 1539 1564 1579 1585 1599 1626 1652 1652 1604 1513
1069 1513 1430 1399 1411 1431 1460 1520 1584 1584 1507 1414 1356 1332 1341 1403 1504 1580 1597 1597 1616 1629 1599 1552 1532 1534 1527 1514 1517 1530 1534 1528 1527 1530 1546 1595 1670 1717 1711 1702 1731 1759
1064 1759 1741 1722 1775 1875 1932 1926 1919 1941 1945 1915 1907 1954 2006 2005 1970 1957 1973 1993 2015 2053 2093 2116 2141 2208 2309 2382 2389 2361 2348 2353 2339 2291 2240 2230 2277 2371 2490
1059 2490 2593 2635 2633 2677 2837 3060 3215 3252 3249 3285 3337 3343 3297 3236 3168 3079 2987 2938 2946 2986 3035 3081 3112 3130 3157 3194 3207 3182 3170 3208 3249 3234 3192 3202
1055C202N3J9k1L5J37J61R0J5rqPM7J02J22J06R2Q7O2K0QK8M6M6N5Q4J11J34J71K07K15K09
1051E633K35K91L13K71K14J77J40P3nn3n2pP6J73K54L06L38L53L54L63M16N03N79O41P46R58
1048A3290J286J710K217K816L506M248M885N092M501K972P83j442l081l823l783l329k803
1046B9045k337j906j476j084p73n38l33j32M5J63K28L23N23P95J024J165J315J557J837K061
1044C1502K269K593L091L732M571N795P570R968J3039J6843K1209K5375K7836K6631K0273
1042B22297Q980m698j6811k4160k5961k3692j9560j5153j1151p704m747k109L49K581M341
1040H2802N313N270M164K147m17k980m966o034o260o018n649n230m675l947l118k297j559
1038D6546r45m36J2M16P19Q76R52J052J225J472J837K367L025L727M472N343O421P796R679
$$ plain form
1055 3202 3255 3274 3253 3288 3425 3586 3676 3691 3682 3674 3681 3728 3830 3952 4058 4150 4237 4299 4319 4327 4355 4401 4447 4502 4586 4697 4831 5002 5209 5424 5633
1051 5633 5868 6159 6472 6743 6957 7134 7274 7347 7342 7289 7237 7230 7306 7479 7733 8039 8377 8730 9084 9447 9863 10366 10945 11586 12332 13290
1048 13290 14576 16286 18503 21319 24825 29073 33958 39050 43551 46523 47306 45864 42783 38960 35177 31848 29045
1046 29045 26708 24802 23326 22242 21469 20931 20598 20466 20511 20674 20902 21225 21748 22543 23567 24732 26047 27604 29441 31502
1044 31502 33771 36364 39455 43187 47758 53553 61123 71091 84130 100973 122182 147557 175393 202024 222297
1042 222297 231277 226579 209768 185608 159647 135955 116395 101242 90091 82387 77640 75531 75880 78461 82802
1040 82802 88115 93385 97549 99696 99279 96299 91333 85299 79039 73021 67372 62142 57467 53520 50402 48105 46546
1038 46546 45601 45165 45177 45593 46312 47188 48140 49192 50417 51889 53726 56093 59118 62845 67317 72660 79081 86877 96556
1036I6556J2363J6045K0804K6638L3216L9391M3146M2391L5958K4077Q318q600k3315l3066
1034C33922l7080l6755l4285l1065k7370k3157j8698j4437j0577p097l989j378N43J517J232
1032I1326m10k979n559p256p705p148o106n027m126l405k778k191j683j333j132r84q05o01
1030C0098m05k02N8L53N98P59R04J124J420J724K026K429L069M005N227O778Q866J1756J5562
1028I6149K0080K4747K8498K9571K5848J6148J776j3390k4882l0244k9989k6407k1713j7188
1026G9004j3343j0315q051o383n142m191l412k748k242j916j698j490j309j212j163j062q93
1024A2434p19n67m32l58l87m41l94k83k70l93m83m31l27k90k85k31j68j71k07j89j38j28j49
1021D993j42j24j51j84j32k4%r6j86j66q7n5o9n5rJ6jj2K1O6O2jp4r8q1o2n3k1M0P7M8j1m2
$$ plain form
1036 96556 108919 124964 145768 172406 205622 245013 288159 330550 366508 390585 398903 390303 366988 333922
1034 333922 296842 260087 225802 194737 167367 144210 125512 111075 100498 93401 89412 88034 88577 90094 91326
1032 91326 90916 87937 82378 75122 67417 60269 54163 49136 45010 41605 38827 36636 34953 33620 32488 31504 30699 30098
1030 30098 29693 29491 29549 29902 30500 31259 32163 33287 34707 36431 38457 40886 43955 47960 53187 59965 68831 80587 96149
1028 96149 116229 140976 169474 199045 224893 241041 242817 229427 204545 174301 144312 117905 96192 79004
1026 79004 65661 55346 47295 40912 35770 31579 28167 25419 23177 21261 19563 18073 16764 15552 14389 13327 12434
1024 12434 11715 11148 10716 10358 9971 9530 9136 8853 8583 8190 7707 7276 6949 6659 6374 6143 5975 5804 5597 5408 5270 5142 4993
1021 4993 4851 4727 4576 4392 4260 4236 4236 4140 3954 3788 3701 3646 3577 3522 3513 3529 3528 3516 3537 3603 3665 3664 3590 3492 3411 3349 3296 3275 3315 3392 3440 3429 3387
1017C387m4n3o1m0lpn3q2o8n0o0o3k9K0K9j1o2r7j03p5k7N%k6m5n9p7r0o9k5Nnl5n4n1k8R
1012A903M6N2J4k3qM0M7j3p3o8k8k5m7k7L8P3N6M3O0M1n0j34j17l1K5K1Omj7j5L6Q5M3n9q5
1008A805J6J11O5p0j38q9rL3N4P9O6j3j01j13m7J1Rj0JK2Ll4k5J7J1o4j14o1L4N7J0j1L0P1
1004A606O4L4J3j3o4r9p5j5J6pn0o5l9ljk4l0JK7J4j0LL0J2m0n0J2Q3Q7L0k6m5l2j6j6j5K0
999A317P3O9k6j33j39m9L7N8N6N0J4m2m0K4N2j5q4n8J2K3j6j3M5O9J8n1p0l6J7O1O7K8k1m6
995A251n0n9n6lQ0J21R1J5o1j09j00k8N6Q1M4ol6n2n6l0J2K3kj4OK3J0oJKk7n3k9L2P1O3K7
991A232j8n3m9OO2N2rl8lL3oq5j12n6K2N3L9K3K7L6K4k7r1j10n0K7L5k2l5L5J02Q0K7M0Q1
986A272M5n7j01m2J9Lk6jL4K0oJ1M6M0Mj9l6o7p0pN2K6l3j6P0J00K8m4l4J0J7KOJ0j2k7%K7
$$ plain form
1017 3387 3343 3290 3229 3189 3186 3179 3126 3044 2976 2926 2866 2803 2774 2794 2823 2812 2750 2653 2550 2475 2448 2453 2453 2427 2382 2323 2246 2156 2087 2062 2067 2062 2027 1973 1922 1894 1903
1012 1903 1949 2001 2015 1992 1984 2024 2071 2058 1985 1917 1889 1864 1817 1790 1828 1901 1957 2000 2060 2101 2051 1917 1800 1769 1794 1815 1821 1817 1800 1785 1821 1906 1949 1890 1805
1008 1805 1821 1932 1997 1927 1789 1700 1691 1724 1778 1857 1923 1910 1809 1696 1649 1660 1669 1659 1660 1682 1685 1651 1626 1643 1654 1590 1476 1415 1449 1506 1516 1505 1535 1606
1004 1606 1670 1704 1717 1704 1640 1541 1466 1451 1467 1460 1410 1345 1306 1303 1302 1278 1248 1249 1276 1290 1280 1283 1313 1325 1285 1235 1247 1330 1417 1447 1421 1376 1344 1328 1312 1297 1317
999 1317 1390 1459 1433 1300 1161 1112 1149 1207 1263 1313 1327 1285 1245 1269 1321 1306 1222 1164 1176 1199 1183 1170 1215 1284 1302 1251 1181 1145 1162 1223 1290 1318 1297 1251
995 1251 1201 1142 1086 1083 1163 1284 1375 1390 1329 1220 1120 1092 1148 1229 1273 1267 1231 1179 1123 1093 1105 1128 1126 1112 1118 1141 1151 1145 1146 1148 1121 1068 1039 1071 1142 1205 1232
991 1232 1214 1161 1112 1118 1180 1232 1223 1185 1182 1215 1209 1124 1012 956 978 1031 1070 1093 1120 1156 1180 1153 1062 952 902 929 964 942 907 942 1044 1124 1151 1191 1272
986 1272 1317 1260 1159 1117 1136 1139 1113 1112 1146 1166 1160 1171 1217 1257 1261 1242 1206 1139 1069 1062 1114 1140 1107 1091 1161 1261 1289 1245 1211 1221 1238 1240 1246 1256 1244 1217 1217 1244
982A244%m5l0L1M3k2o2kQ7P8k5r0l9N1P2L4J6K2Jl0MR2J12Oj15j31o4lL3Q2J27J09N0L1O9
978A736J08J16J20J17P2mm2k7j9n7r9r6o8n9p8r4p8j9O1R8M1n4r2m9%Mj6l0m4m5lO0P4J9l1
973A522k5jkrmj5n5o8oP6R3M5jj1jPJ9M1Q1J20J26Q0M4R1J93K43K19K08K49K38J12k7n4j6
969C512k9q9j05p2p0r7p1J2N9M1K8L9K0l3m0J7K7p1j72j64j01r8j33j14m0j6o4r1m0K4J9k4
965B064m0l1m9q8r3m2OMk0qM4R2R9P8O2O3Q4J22J66J88J73J39J17J12J13J06Q8N6J9rk7m8
961C540q0r2o7l8m5p5p1k1K2J3j5oM1N5mq5j05m4K6K1m7r9o7J1N3J7m9p1l8lj8o0p5n4m8p8
957B344j02p9m0m2p7q4l8J6L2Ql7q0q6m4QJ6j7m2k9kK7N5P0N8M2N3O2K8kN0J44J49M6k6K4
953B405J09J09N7L6K5m0j22j31q2o2p5o5l6m4p8p8n2o8j14j02k6K1mm8n2m5m5l3JK4J6jj9
$$ plain form
982 1244 1244 1199 1169 1200 1243 1221 1159 1157 1244 1322 1297 1207 1168 1219 1291 1325 1341 1363 1364 1334 1338 1430 1542 1548 1433 1302 1238 1235 1268 1350 1477 1586 1636 1667 1736
978 1736 1844 1960 2080 2197 2269 2265 2223 2196 2177 2120 2021 1925 1857 1798 1720 1626 1548 1529 1590 1688 1729 1675 1583 1534 1534 1538 1522 1492 1448 1403 1400 1460 1534 1553 1522
973 1522 1497 1496 1494 1485 1481 1466 1411 1343 1337 1413 1506 1551 1550 1539 1538 1545 1564 1605 1686 1806 1932 2012 2056 2147 2340 2583 2802 3010 3259 3497 3609 3582 3528 3512
969 3512 3483 3394 3289 3217 3147 3050 2979 2991 3050 3091 3119 3158 3178 3145 3105 3122 3149 3078 2906 2742 2641 2543 2410 2296 2256 2240 2176 2085 2045 2069 2088 2064
965 2064 2024 1993 1944 1856 1763 1721 1727 1731 1711 1703 1747 1839 1938 2016 2078 2141 2225 2347 2513 2701 2874 3013 3130 3242 3355 3461 3549 3605 3624 3615 3588 3540
961 3540 3460 3368 3301 3263 3218 3143 3072 3051 3073 3086 3071 3065 3106 3161 3157 3072 2967 2923 2949 2970 2923 2824 2757 2768 2821 2838 2789 2718 2680 2677 2659 2599 2524 2470 2422 2344
957 2344 2242 2163 2123 2081 2004 1920 1882 1898 1930 1938 1901 1821 1735 1691 1699 1715 1698 1656 1627 1625 1652 1707 1777 1835 1877 1930 1992 2020 2018 2068 2212 2361 2407 2381 2405
953 2405 2514 2623 2680 2716 2741 2701 2579 2448 2366 2304 2229 2164 2128 2084 2006 1928 1876 1808 1694 1592 1566 1587 1583 1535 1483 1438 1393 1360 1361 1385 1401 1400 1381
949A381m7n7j8J7l3j31j45l5Q5J06O3L1J6jMM6N9%q0j03p4m2j4K9O2N0Km0n9n3k4QMl9n7j7
944H94M4P9Q0N4mo6o7mL0j3n7j1O9P4Ql3k3k2m6l3L3P3L6j0J3P1P0mo7n8j7j2l0pN7Q1J8m9
940A151k9N6Q7L1l6m3j3OJ1Pj7m2l1NJm8n9QP7O8J5lKk1o6p6l5K8P6Q5L1n2q1l0K7K5NL2O4
935A216L6l6p7p9o4k6L3M9j2n7MJ01R2ml8L1Q9O8K2Lj7m9m7kK7K7M3O8L4m6p4j9J6k0m6kL5
930A279Nk0L5R4N3k7j4P2Q5j3r4o2J9M7J8nJJk3n6o6n2l7l3k0K1O3N6Nl5k7pmJL8Q0Q5N9L9
925A561L4L3K9K2OrOL3K1m7j03q7l9l3o0m7J3N1K7k1k9lJ4pn5q4n9MM5K7k2m1qL2L8Ml5l6
921A175QM9L3k2l8J7P2M6l4p3l7J2J9%KL6P0P0L0j5k1K2P0Q5P7P9P7M3J%K3On9q6l3L4J7p3
916A682j31j11o3m4m0j9QOk4l8j7J5K5J1k1o1q2n6QN1L5%J1O7J11J11P2J6m6q8q6n0k1j3r
$$ plain form
949 1381 1334 1277 1259 1276 1243 1112 967 932 1017 1123 1186 1217 1233 1232 1236 1282 1341 1341 1261 1158 1084 1042 1028 1057 1119 1169 1171 1131 1072 1019 995 1003 1007 968 911 894
944 894 938 1017 1097 1151 1147 1081 1014 1010 1040 1027 970 959 1028 1102 1110 1077 1054 1032 986 953 986 1059 1095 1085 1098 1169 1239 1235 1168 1110 1093 1081 1051 1044 1101 1182 1200 1151
940 1151 1122 1178 1265 1296 1260 1217 1204 1210 1221 1228 1211 1169 1138 1143 1144 1096 1037 1045 1122 1190 1205 1202 1204 1183 1117 1041 1006 1034 1110 1195 1226 1174 1093 1063 1090 1115 1120 1152 1216
935 1216 1252 1216 1139 1060 996 970 1003 1052 1040 983 987 1088 1180 1176 1138 1169 1258 1326 1348 1351 1334 1285 1238 1236 1263 1290 1333 1401 1435 1389 1315 1296 1312 1292 1246 1244 1279
930 1279 1284 1264 1299 1393 1446 1419 1405 1477 1562 1549 1455 1393 1412 1459 1477 1472 1473 1474 1451 1395 1329 1277 1240 1207 1187 1208 1271 1327 1332 1297 1270 1263 1259 1260 1298 1378 1463 1522 1561
925 1561 1595 1628 1657 1679 1685 1676 1682 1715 1736 1689 1586 1499 1460 1427 1367 1320 1333 1384 1411 1390 1361 1358 1372 1365 1310 1226 1167 1171 1216 1243 1221 1180 1172 1204 1242 1246 1211 1175
921 1175 1183 1232 1265 1243 1205 1222 1294 1340 1306 1233 1196 1208 1227 1227 1229 1265 1335 1405 1435 1420 1399 1421 1491 1576 1653 1732 1809 1852 1853 1853 1876 1882 1823 1737 1704 1738 1755 1682
916 1682 1551 1440 1377 1333 1293 1274 1282 1288 1264 1226 1209 1224 1249 1260 1239 1178 1096 1040 1048 1099 1134 1134 1145 1212 1323 1434 1506 1522 1476 1388 1302 1252 1231 1218 1209
912A209%J2L1M5J6o2j17p5K6O4J2l1lM1M2L5O1P5M1J8N4R2M7m1o4k4kk4l7l4m5m0L5J43J80
908A680J61K10L32L45J32j62l13k91k31k05j65r6n9p9q7n4l5o2p0%P7N5l3o0J7R8R0K6j3l0
904A178n3n6lN2K2o7r7l4K6Qj4L6J01P2l2r3o2qJj4mK9N1L9ll7l0J5M9M0K7M1N3Np1q3j4O2
899A132P4M1J3RK0M2P3R8J14J33J46J20M7m1j00j21j12r1p0n0k0Jk4q3j03m2K7J9l9m6kko3
895A100q9k2O5Q6O9O5N2k6j16j18j7Q1R1K7m2q0q5o5k9JKk3m1k0K5N2M1K5L9O1N4J9lj0l1
891A138n9n7k4jorJ1K6J4j5m1n5l5K1N8J7n9o4J0N1Mn0j9M3M0oj1L1L7j2n5m2PN8Q2N9nn4
886A028l7J3K2j2j7K8O0L2j6k3LJ5j0l6l0%J3nj9LL9L5j6n6m7j8qkJ2J3m%M3P0L7%K1O0L0
882A221m8p9m6k4l6k6Pln5m8O0J46Q9o0j43j04nP5J02O6ol3M1J57J92J14Rl7k9J2R7K13K92
$$ plain form
912 1209 1209 1221 1252 1297 1313 1251 1134 1059 1085 1149 1161 1130 1127 1168 1210 1245 1306 1381 1422 1440 1494 1586 1633 1592 1528 1504 1502 1478 1441 1407 1362 1322 1357 1500 1680
908 1680 1841 2051 2383 2728 2860 2698 2385 2094 1863 1658 1493 1397 1338 1259 1172 1118 1083 1021 951 951 1028 1083 1050 990 1007 1105 1195 1221 1208 1178
904 1178 1125 1069 1066 1118 1140 1073 976 942 968 976 962 998 1099 1171 1139 1046 984 976 977 963 959 988 1039 1078 1075 1038 1008 1023 1072 1112 1139 1180 1233 1238 1167 1084 1070 1132
899 1132 1206 1247 1260 1269 1289 1331 1404 1502 1616 1749 1895 2015 2062 2021 1921 1800 1688 1597 1527 1477 1457 1458 1434 1351 1248 1206 1233 1252 1213 1167 1165 1163 1100
895 1100 1011 989 1054 1140 1209 1274 1326 1300 1184 1066 1049 1130 1221 1248 1206 1126 1041 976 947 948 950 927 886 866 891 943 984 1009 1048 1109 1163 1182 1179 1169 1138
891 1138 1079 1022 998 997 991 982 993 1019 1033 1018 977 922 887 908 966 983 924 860 870 921 925 875 856 899 939 933 922 953 990 978 923 881 888 946 1028 1087 1082 1028
886 1028 991 1004 1026 1014 997 1025 1085 1117 1101 1078 1081 1096 1086 1050 1020 1020 1033 1028 1009 1012 1051 1086 1070 1014 967 949 941 939 951 964 960 960 1003 1073 1110 1110 1131 1191 1221
882 1221 1173 1094 1048 1024 988 962 969 966 911 863 923 1069 1158 1098 955 851 846 921 1023 1089 1083 1050 1091 1248 1440 1554 1563 1526 1497 1509 1606 1819 2111
878B111K84K36K15J92Q5j03k60k96k51k16k16k14j94j68j25m6M2P3K5m1n9k6J2K4K3L2N5O3
874A257K6k9l2K5N1k3j21j06J0O5kp6m5K9K7l0m5qNqJ4O8O4k6j10j02k3M2M9J3k1j6J8L3J0
870I83mK7N7K4m1n4oL1K5J1Mk1n9n0K3R4J05P7N4M0K5J1kj8k5oJ2om1l7MK1J1J1J8k0q1p5
865A122J2P2M5KJ8L5k0j00j03k7L6M1K7K2J4%qnOL0O0O7M9N1R7J42J44J43J88K49K65K25J72
861C071J32J00P5M7j7j26k07k06j69j83k39k51j84r6m9m1m9o1o9n5k5%Rj6p9j42j28k4P0N2
857A140l4o9k8K3M1O0Q1N8j6o9n3rPoj9k1k0j4rj6k1JL1L7J9J0Jl6q0p3k8k3p3q1J4J18J06
853I49rr3o3K5P6O6L2J8K7M0L7K4J3Ml1q6j11o6K9R7R0L0j3qJ7J8j1k9k4k5n5p5m3K0N5M3
849I68J1j6l4k9QL4Pl9k6M2O2rq3n3M0P8K1n5p6m1NL4K9j1m8l4K3N8L1rpL2M5J4j5rJ3J0j1
$$ plain form
878 2111 2395 2631 2846 3038 3123 3020 2760 2464 2213 1997 1781 1567 1373 1205 1080 1034 1076 1149 1174 1133 1074 1048 1060 1084 1107 1139 1194 1257
874 1257 1283 1254 1222 1247 1298 1275 1154 1048 1058 1123 1121 1045 1000 1029 1056 1026 981 973 978 970 984 1052 1116 1090 980 878 855 897 946 959 938 922 940 973 983
870 983 979 1006 1063 1087 1046 992 986 1017 1042 1053 1057 1036 977 927 950 1044 1149 1226 1280 1320 1345 1356 1354 1336 1311 1305 1317 1311 1270 1233 1237 1258 1269 1280 1298 1278 1197 1122
865 1122 1134 1206 1251 1253 1271 1306 1286 1186 1083 1056 1092 1133 1160 1182 1196 1196 1188 1183 1189 1219 1279 1346 1395 1446 1543 1685 1829 1972 2160 2409 2674 2899 3071
861 3071 3203 3303 3378 3425 3408 3282 3075 2869 2700 2517 2278 2027 1843 1747 1698 1657 1608 1547 1478 1423 1398 1398 1407 1391 1312 1170 1042 1018 1088 1140
857 1140 1106 1037 1009 1032 1073 1133 1214 1272 1256 1187 1134 1125 1132 1126 1107 1086 1066 1052 1043 1027 1006 1007 1038 1075 1094 1104 1105 1069 989 916 888 865 792 711 725 843 949
853 949 940 847 784 809 885 951 983 1001 1028 1068 1105 1129 1142 1146 1115 1029 918 852 881 978 1068 1098 1085 1077 1094 1112 1101 1072 1048 1023 968 893 850 870 925 968
849 968 979 963 929 900 908 942 949 910 884 926 988 979 896 843 883 961 982 927 851 810 815 849 878 867 819 785 808 866 897 888 881 913 958 972 957 948 961 971 960
844I60k4k3j2QL3M0J2k1k2MJ4nk4k9k3RP4J21Q0k0o7k7Pk8n7kP9Q2K0j5k1o1j08p1M6J10M3
839A082p0j09o3PN0M2jk6PO1P0M2N2J00J03M5LK2L2j7o0k3L4K2l8n1pL0L6M7O0K1p6j53j41
835A133o1OJ8mlK8N2L5Nlqm9r2o6J3L7k7p7k8N7P0K0mK9O8P6O0K9j0l8m1m0l9pN6R4P9P2J20
830A560J47O4p2j25o8jJ4J6N2J16K16M02O55Q40Q13N22L9m57p52p13m33j44MO0J29K04J91
827C279N0j40k57k36j20k1kk3JP9J53J84J78J25kj69k81k91k55k39k35k01j31n2J5N3L6j8
823A480n6m3j3j3l2l2j1Jj0k7k0RL8L5Kj7J4P3J13J29J63K29K83K89K51J79O8o4j63j94j67
820B494j10k7O0J11J23J35J58J36K8j13j96k10k06k05j81j26q1p0p1n1k2k1m9p2o5l4rj1l6
816A279o5o9l5K0N1K6k3m0k3k8p0q4j9O5Q3M0J5K3J7j3j4K2M8L3Oj2l5n7m5nK0L4Q6J67K22
$$ plain form
844 960 936 913 901 909 942 982 994 973 951 955 969 964 940 911 888 897 971 1092 1172 1152 1085 1058 1065 1037 980 978 1057 1139 1159 1144 1123 1062 954 883 929 1039 1082
839 1082 1012 903 840 847 897 939 938 912 919 980 1050 1092 1144 1244 1347 1392 1395 1417 1449 1432 1372 1349 1383 1405 1367 1316 1309 1339 1375 1422 1482 1503 1427 1274 1133
835 1133 1072 1078 1096 1092 1089 1117 1169 1204 1209 1206 1198 1149 1057 991 1004 1041 1014 937 909 966 1036 1056 1052 1081 1149 1225 1285 1314 1304 1266 1225 1185 1146 1139 1195 1289 1368 1440 1560
830 1560 1707 1771 1699 1574 1506 1505 1519 1535 1587 1703 1919 2321 2976 3816 4629 5151 5190 4733 3981 3268 2835 2691 2695 2755 2884 3088 3279
827 3279 3329 3189 2932 2696 2576 2555 2553 2530 2531 2610 2763 2947 3125 3250 3248 3079 2798 2507 2252 2013 1778 1577 1446 1394 1409 1462 1498 1480
823 1480 1424 1381 1368 1355 1323 1291 1280 1281 1271 1244 1224 1233 1271 1306 1308 1291 1305 1378 1491 1620 1783 2012 2295 2584 2835 3014 3082 3018 2855 2661 2494
820 2494 2384 2357 2417 2528 2651 2786 2944 3080 3108 2995 2799 2589 2383 2178 1997 1871 1790 1720 1649 1598 1576 1555 1506 1434 1369 1335 1326 1315 1279
816 1279 1214 1145 1110 1130 1181 1207 1184 1144 1121 1093 1023 939 920 985 1068 1108 1123 1146 1163 1150 1136 1158 1206 1239 1245 1233 1198 1141 1096 1091 1111 1145 1231 1398 1620
812A620K73L97N43M78R5l82o02m83k48j17j10j33j19o2K0P7O0j0o2n5j7K6O9Q6M0m1p3k6K1
808A265po8o9MO8N8Lk5j0kl0n4k4L8N3pp2o9j6J4pl3j6M0Q7P3Nm8k3M8P5K9k1j4Qj7o3n5O
804A124L7jm4k6L8Q0O3J2k7l0j8k6n1n5j6L9O8O4M0Lk8k0K1N2M4K1J0j1m5m8oK0j3n5m6k5
799A145m4n6J5J14J20L8OO5R8K5p0q4l8j1j1NL1L7K1Qnk1j4K3M5K1j5j3J3K1J3Rjk7m7k3K3
795A416M2K3Joj0mK1M9M0pm8m4%M2N6N1M1J7l5r5r7j7Q4J18Q3N4O9P5K3o1r9o0K0O3L6rJ3
790A845R2J14K4o6k7Q7J16M4rLj1o3l5Q9J40J4j37j25oM6J3PL3J3l3mP5P0k1n3L3J07O7j4
786B428l7k3k4j7L7R8J08Q8Q1P8M4NkJ2K0K9N5P4O3M7N7Q6J05J11J06P7L1J2L2M4J6j7qK3
782C839L0J4J3K9M4N3O4O4M4K7L7N5N5M8N0N2M9O4J12J44J14N7M4Q0J18J46J93K62L01K77
$$ plain form
812 1620 1893 2290 2833 3311 3406 3024 2422 1939 1691 1574 1464 1331 1212 1150 1170 1247 1307 1297 1235 1180 1163 1189 1258 1344 1384 1343 1270 1244 1265
808 1265 1258 1190 1121 1125 1193 1251 1254 1229 1219 1217 1187 1133 1109 1147 1200 1193 1121 1052 1036 1050 1043 1010 994 1034 1121 1194 1199 1151 1128 1176 1251 1280 1259 1245 1253 1236 1173 1118 1124
804 1124 1161 1160 1116 1090 1128 1208 1271 1283 1256 1226 1208 1182 1131 1076 1060 1099 1167 1231 1271 1274 1246 1226 1247 1299 1343 1364 1374 1363 1318 1270 1264 1284 1271 1216 1170 1145
799 1145 1101 1045 1060 1174 1294 1332 1338 1403 1501 1526 1456 1372 1334 1323 1312 1317 1348 1385 1406 1414 1409 1388 1374 1397 1442 1463 1448 1435 1448 1469 1482 1491 1490 1463 1416 1393 1416
795 1416 1458 1481 1482 1476 1466 1462 1483 1532 1572 1565 1517 1473 1473 1515 1571 1622 1663 1680 1645 1550 1453 1436 1520 1638 1721 1775 1844 1919 1942 1881 1782 1722 1742 1805 1841 1832 1845
790 1845 1937 2051 2075 2009 1982 2069 2185 2229 2220 2223 2212 2149 2114 2203 2343 2357 2220 2095 2089 2135 2148 2155 2188 2201 2168 2164 2239 2309 2288 2235 2268 2375 2442 2428
786 2428 2391 2368 2344 2327 2364 2462 2570 2658 2739 2817 2861 2866 2864 2876 2896 2925 2980 3054 3117 3164 3221 3307 3412 3523 3629 3706 3737 3749 3781 3825 3841 3824 3816 3839
782 3839 3869 3883 3896 3925 3969 4022 4086 4150 4194 4221 4258 4313 4368 4416 4466 4518 4567 4631 4743 4887 5001 5058 5102 5182 5300 5446 5639 5901 6202 6479
778F479K16J69J51J48J40J24J23J55K06K53L13M26N60O31O52P61J034J358J644K063K918M360
775B4884O444R258J2469J4540J3071O827k362j0311j3612j2154q505n157k738o06J713M232
773C7993P084J0325J2832J2207O804j991j0135j4042j3269j0092o960m772l280k225j605j304
772A7570j039p01m38l41k96j82m7K3N0J03J82K55L28M16N01N64O44P67Q99J019J158J359J626
769B4420K026K745L927N584P766J0572J3554J5048J2809O062k960j0121j2489j0407o505l003
767E9028l10K200M898P814J1122J4785J7564J7227J2631N701Q08J679Q875K0251L3314M6130
765B63717N5650N6502M3716J7953j2518l6360m6476m3298l1974j7555k639J2116K6469L8907
763C24210M5362M0338K1257p443l5473n3172n7385n1639m1775l1989k3969j7907j3473j0267
$$ plain form
778 6479 6695 6864 7015 7163 7303 7427 7550 7705 7911 8164 8477 8903 9463 10094 10746 11507 12541 13899 15543 17606 20524 24884
775 24884 31328 40586 53055 67595 80666 87493 85131 74820 61208 49054 40549 35392 32654 32048 33761 37993
773 37993 45077 55402 68234 80441 87245 85254 75119 61077 47808 37716 30756 25984 22704 20479 18874 17570
772 17570 16531 15830 15392 15051 14755 14573 14526 14549 14599 14702 14884 15139 15467 15883 16384 16948 17592 18359 19258 20277 21435 22794 24420
769 24420 26446 29191 33118 38702 46468 57040 70594 85642 98451 104513 101553 91432 78943 68536 62031 59028
767 59028 58718 60918 65816 73630 84752 99537 117101 134328 146959 152660 153468 155147 164022 184273 217587 263717
765 263717 319367 375869 419585 437538 425020 388660 342184 298886 266912 249357 246718 258834 285303 324210
763 324210 369572 409910 431167 423724 388251 335079 277694 226055 184280 152291 128322 110415 96942 86675
761H6675q016o539n557m713l817k919k113j380o67M4P68J530K308L039L700M339N040N949
759G7671P279R279J2221J6494K2553L0623M0280M9921N6127N3938L9437J3812j5137l6932
757C77566m5121m0540k8570j4174M21J4742K8181L8670M2240L4417J3918j4223m0171n5296
756C12060n7351n0324m0098l0637k3229j7707j3597j0535q287o675n504m612l941l483l162
754C2918k868k558k252j944j607j264r56o58l28MK59M18N36O15N79L66j2m68q59j021q68n13
751A7519j75J2Q8J58K58L40L03N3l94q76j187j247j120q91o34m52m48n70o41n67m38l76l58
748H357k90j66p0m3m8n0m2j6K8O4O3M6O3J21J96K85L94N14O19P34Q82J021J053R24O53K54
745A5546k46p18r57q60n46k23J2K05M07N77O24M89J51l52q93j272j352j164q93p06o21n39
$$ plain form
761 86675 78659 72120 66563 61850 58033 55114 53001 51621 50954 50998 51766 53296 55604 58643 62343 66682 71722 77671
759 77671 84950 94229 106450 122944 145497 176120 216400 266321 322448 376386 415823 429635 414498 377566
757 377566 332445 291905 263335 249161 249582 264324 292505 331175 373415 407832 421750 407527 367356 312060
756 312060 254709 204385 164287 133650 110421 92714 79117 68582 60295 53620 48116 43504 39563 36080 32918
754 32918 30050 27492 25240 23296 21689 20425 19469 18811 18483 18487 18746 19164 19700 20315 20894 21260 21248 20780 19921 18900 18032 17519
751 17519 17344 17356 17444 17602 17860 18200 18503 18556 18162 17286 16099 14852 13732 12841 12207 11755 11307 10737 10096 9529 9091 8715 8357
748 8357 8067 7901 7831 7788 7740 7690 7648 7632 7660 7724 7787 7833 7896 8017 8213 8498 8892 9406 10025 10759 11641 12662 13715 14639 15292 15546
745 15546 15300 14582 13625 12765 12219 11996 12008 12213 12620 13197 13821 14310 14461 14109 13216 11944 10592 9428 8535 7829 7208 6669
743F669m11k91k54k64k13q2J7jp5q5k3Rl4p2l2L2L2k1m2mK8Pk2j5%m0j12j31n6M2N3l8j24
738D447j02RQ0K6q4j23o9k8n4q3m4Pj0n9l9L8O2mo5n4k5l7m2J0O9N5OMM7N2Pj8OL0K8L4P0
734D147R3Q5Q6J26J56J27O7L1K6M0P9J53K12K12J78J82K43L05L19L03L17L92N02O05O78P25
731A0389P24O14L74Q9j10j93k34k80k80j82m3N9J34K35L52M33M75N25N95O76P97J021J328
728A7498J643J958K358K890L456L879L996L674K834J545P8j228k150k627k716k539k236j891
726C0422j518j139q31o45n34m15k73j50m3R8K89M82O45P79Q94R97J128J314J493J537J383
723C5913J093P73M80K51J40J85L73O60J005J353J632J809J925K028K124K225K402K708L103
721F2182L510L921M396M941N494O015O504O892O969O488N292L376R11j739m081n713o505o576
$$ plain form
743 6669 6258 5967 5713 5449 5236 5154 5171 5170 5095 5010 4987 4996 4962 4890 4858 4890 4922 4901 4859 4855 4883 4890 4868 4853 4853 4813 4701 4570 4514 4556 4609 4571 4447
738 4447 4345 4354 4434 4460 4376 4253 4184 4156 4102 4019 3975 3982 3972 3913 3874 3912 3974 3970 3905 3851 3826 3789 3747 3757 3826 3881 3887 3891 3938 3990 3997 3979 3985 4015 4043 4077 4147
734 4147 4240 4325 4411 4537 4693 4820 4887 4918 4944 4984 5063 5216 5428 5640 5818 6000 6243 6548 6867 7170 7487 7879 8381 8986 9664 10389
731 10389 11113 11727 12101 12190 12080 11887 11653 11373 11093 10911 10868 10927 11061 11296 11648 12081 12556 13081 13676 14352 15149 16170 17498
728 17498 19141 21099 23457 26347 29803 33682 37678 41352 44186 45731 45809 44581 42431 39804 37088 34549 32313 30422
726 30422 28904 27765 26934 26289 25755 25340 25067 24917 24874 24972 25261 25743 26388 27167 28061 29058 30186 31500 32993 34530 35913
723 35913 37006 37779 38259 38510 38650 38835 39208 39868 40873 42226 43858 45667 47592 49620 51744 53969 56371 59079 62182
721 62182 65692 69613 74009 78950 84444 90459 96963 103855 110824 117312 122604 125980 126891 125152 121071 115358 108853 102277
719A02277o133n386m534l739l074k538k129j854j680j527j355j187j054r28p49n06k39JK13
716F3879M08N75O59O10M42K37Q1J0J6R6K44M48P05J045J458J847K099K235K410K751L261L879
714H9395M576N329O073O720P244P665P986Q182Q212P975P268N911L943J648o35k725m607o296
711A63864p740q803r313r161q424p369o298n354m533l834l316l003k818k662k518k401k264
709G4053k036j712j367j059q10o78p40r62j172j219j123r90q78p96p81q59r34q35n24j30K14
707E4662N07Q22J190J611K102K655L228L820M508N367O334P257P960Q218P769O505M712K964
705A32191J717R67L30o58k287m549p083r247j0399j0270r136p607o212n143m328l680l192
703E1414k852k574k277j996j812j732j681j590j444j242r88p18m87l21k30k60m71q41j251
$$ plain form
719 102277 96144 90758 86224 82485 79411 76873 74744 72890 71210 69683 68328 67141 66087 65159 64410 63904 63665 63666 63879
716 63879 64287 64862 65521 66131 66573 66810 66891 66901 66917 67013 67257 67705 68410 69455 70913 72760 74859 77094 79504 82255 85516 89395
714 89395 93971 99300 105373 112093 119337 127002 134988 143170 151382 159357 166625 172536 176479 178127 177492 174767 170160 163864
711 163864 156124 147321 138008 128847 120423 113054 106756 101402 96869 93035 89719 86716 83898 81236 78718 76317 74053
709 74053 72017 70305 68938 67879 67069 66391 65651 64689 63517 62298 61175 60185 59307 58511 57730 56871 55937 55102 54578 54448 54662
707 54662 55169 55991 57181 58792 60894 63549 66777 70597 75105 80472 86806 94063 102023 110241 118010 124515 129227 132191
705 132191 133908 134875 135205 134547 132260 127711 120628 111381 100982 90712 81576 73969 67757 62614 58286 54606 51414
703 51414 48562 45988 43711 41715 39903 38171 36490 34900 33456 32214 31226 30508 30021 29700 29470 29210 28739 27898 26647
700B6647j563j685j599j347j043p82n55k93j4J66J95J71K06L04M11N49P97J186J674K239K914
698B8578L693M484N127N412N097L994K111k77k703m673n821o039n527m681l855l183k618k106
695A7013j672j355j128r36p52n81m21k69j66j47j85k23k55l27m25m58l94l21l14l04j91j8
693F171P6N1Oll4j45k66l03k61k21k20k35k32k05j70j53j58j49q8j1%o1j11q9l6j6k3j3M%
689C105k3k5nK0L7M2K2k0m7l8j7j9l5m9o2p0m9%K7Lk7j5Rj2n7n6jM2L2kj7k0l3o4q6p3k8R
684B398J1jkpl2l9J8Q4O5j9m2J9L7m9j18o4K7K1m3l8L4N7J0k6k4k8m2k7jk2o5n0QL0%j5lj5
680B047m8m9k2k4k9K0P3K4r1j15k3M6K4JK4Pp8j05j3P9O1J7M0P3J9n9n4kQnK0M8J2l9j7M0
675A910L7j4j8K2K9j8o1p9r5r0m2QJ5K0O6R0K5o6o8%K9kl1m2n9l9N9J44R2k7m6L9O3k1p0q
$$ plain form
700 26647 25084 23399 21800 20453 19410 18628 18073 17780 17766 17932 18127 18298 18504 18808 19219 19768 20565 21751 23425 25664 28578
698 28578 32271 36755 41882 47294 52391 56385 58496 58219 55516 50843 45022 38983 33456 28775 24920 21737 19119 17013
695 17013 15341 13986 12858 11922 11170 10589 10168 9899 9733 9586 9401 9178 8923 8596 8171 7713 7319 6998 6684 6380 6189 6171
693 6171 6247 6298 6304 6301 6267 6122 5856 5553 5292 5071 4851 4616 4384 4179 4009 3856 3698 3549 3461 3450 3450 3389 3278 3189 3153 3137 3114 3101 3105 3105
689 3105 3082 3057 3052 3072 3109 3151 3173 3153 3106 3068 3051 3032 2997 2948 2886 2816 2767 2767 2794 2797 2770 2755 2764 2752 2695 2639 2638 2680 2712 2710 2693 2673 2640 2576 2490 2417 2389 2398
684 2398 2409 2408 2406 2399 2367 2328 2346 2430 2495 2476 2434 2453 2490 2441 2323 2259 2286 2307 2264 2226 2260 2317 2327 2301 2277 2249 2207 2180 2179 2157 2092 2042 2050 2080 2080 2065 2062 2047
680 2047 1999 1950 1928 1904 1875 1895 1968 1992 1901 1786 1763 1809 1833 1834 1858 1865 1787 1682 1669 1748 1809 1826 1866 1939 1958 1899 1845 1843 1851 1846 1866 1914 1926 1887 1870 1910
675 1910 1947 1933 1915 1937 1966 1948 1887 1808 1713 1623 1581 1589 1604 1624 1690 1780 1805 1739 1671 1671 1700 1698 1667 1625 1566 1527 1586 1730 1822 1795 1749 1788 1851 1830 1760 1752
671A752N8L7nm%k9k2M5O8lo4m0pn0r6m6L0J7n3n3K0N1Pl3j6L5P1P1J8o4j00m9K3L0LJ0L9J8
666A669l3l1K4M1Jj6J8L6%k4J4O5N8J9OK5L9M2N1M9Qm3m3RN4L9qk8rJ7K5K4K9L5L1J8ll8q8
662B082j15q4k3jk7m7j8K9L1pl7l3j4MJ3J3LmMJ6J9K1K9M0M3M7O1O8M6Nk0rJ5K0kj5PM7O0
657B267K7%K5O0L0m8o8QQ0O3J0J6N7L7l3m1M2J02M4q0j45j14n0j4j8l4m5l6j7j3k5k5J3O0
653B135O1Pn3n8j8J7J8jj6k4k7j8LJ8J2jKJ3K6M5P7Q8N2ok3J1M3M0K9M2O5P5Q0Q1N5Rj3J5
648B861M9L9%j9LL4L1j9r5j31q7j5qp0r2k2N2M2mQN9N1k5p4o0l7l9l0J7N9N8K1k0m6m7j5J3
643B442Kj7J1O1N0k8p7l3M2P5O8O0N0J9j3k0rJ0N4J08J13O2K4M8P6M1j6k5NRj2mK6J2n0p0
639C094j4M7L6j3k7%K0J3J2K7L3J6NJ4J7j6n5n0LM2L3LJK6N5Q5J17J13M9k4k0N0Q9N3J8M8
$$ plain form
671 1752 1810 1847 1842 1838 1838 1809 1787 1832 1900 1897 1833 1793 1786 1736 1640 1594 1624 1641 1588 1535 1555 1606 1613 1580 1564 1599 1670 1741 1759 1695 1595 1546 1569 1599 1602 1612 1651 1669
666 1669 1636 1605 1629 1670 1671 1655 1673 1709 1709 1685 1699 1764 1822 1841 1847 1872 1911 1953 2004 2053 2061 2018 1975 1984 2038 2077 2069 2041 2032 2049 2074 2098 2127 2162 2193 2211 2208 2170 2082
662 2082 1967 1883 1860 1859 1832 1785 1767 1796 1827 1820 1783 1750 1736 1740 1753 1766 1769 1765 1769 1785 1804 1825 1854 1894 1937 1984 2045 2113 2159 2164 2144 2135 2150 2170 2168 2153 2160 2207 2267
657 2267 2294 2294 2319 2379 2409 2361 2293 2301 2381 2444 2454 2470 2527 2564 2531 2490 2532 2634 2678 2598 2453 2339 2289 2275 2257 2223 2178 2142 2125 2112 2087 2062 2075 2135
653 2135 2196 2203 2150 2092 2074 2091 2109 2108 2092 2068 2041 2023 2026 2044 2056 2055 2057 2070 2096 2141 2218 2306 2358 2352 2329 2340 2383 2423 2452 2494 2559 2634 2714 2795 2850 2859 2846 2861
648 2861 2910 2949 2949 2930 2933 2967 2998 2979 2884 2753 2666 2651 2643 2573 2481 2459 2511 2553 2549 2557 2616 2667 2642 2568 2508 2471 2432 2402 2419 2478 2536 2557 2537 2491 2444 2429 2442
643 2442 2444 2427 2438 2499 2549 2521 2444 2411 2453 2528 2596 2656 2706 2725 2712 2692 2683 2693 2747 2855 2968 3030 3054 3102 3178 3219 3203 3178 3183 3192 3180 3176 3202 3214 3164 3094
639 3094 3080 3127 3163 3150 3123 3123 3143 3156 3168 3195 3228 3244 3249 3263 3280 3264 3209 3159 3162 3204 3237 3240 3241 3267 3322 3407 3524 3637 3686 3662 3642 3692 3781 3834 3852 3900
635C900R4P8K4K1P9J28J28J08R8R7J16J77K42K29J36P2J14K02K26J81J68K35L05L07K69K87
632H021L80M88N44N53N57N87O42P21Q38R85J139J276J413J597J876K247K683L177L782M555
629C8061N511O602P788R023J0156J0847J0605Q975N789J386l369p398r946j0914j0709r819
627F2588q581p247o048n103m355l695l114k656k294j956j633j386j223j079r20q00p49p02
625I047n86m44l74l89l95l38k79k88l28l12k38j82j73j59j07p0r1j27j22j00j14j45j30p8
622C478o1q6r1m7j3k8n2l7j2k2o1r3j07r7n2NJ1l7o3j7M1K8l4o2m1l1n8p6n2lM3O7N3J2j0
618B395K1N6K7m4o9k1K8L0K4M1M5oo8o8qM6O2N2K8j8n9n5j3jn0j00q0j3K2J1J8P0J00M3m0
613B406n4rKl0j9N4Q9L2l7k9Nk7q3n2N3J10O9J9K5L7Pk7k0MJ2J6K7J6k3l3J6P2O7K7RJ4QQ
$$ plain form
635 3900 3994 4072 4096 4117 4196 4324 4452 4560 4658 4755 4871 5048 5290 5519 5655 5727 5841 6043 6269 6450 6618 6853 7158 7465 7734 8021
632 8021 8401 8889 9433 9986 10543 11130 11772 12493 13331 14316 15455 16731 18144 19741 21617 23864 26547 29724 33506 38061
629 38061 43572 50174 57962 66985 77141 87988 98593 107568 113357 114743 111374 103976 94030 83116 72407 62588
627 62588 54007 46760 40712 35609 31254 27559 24445 21789 19495 17539 15906 14520 13297 12218 11298 10498 9749 9047
625 9047 8461 8017 7643 7254 6859 6521 6242 5954 5626 5314 5076 4894 4721 4562 4455 4385 4294 4167 4045 3945 3831 3686 3556 3478
622 3478 3417 3331 3240 3193 3180 3152 3100 3063 3051 3029 2968 2875 2768 2671 2619 2624 2635 2598 2535 2518 2559 2587 2553 2491 2450 2419 2361 2285 2233 2230 2273 2340 2393 2405 2395
618 2395 2416 2472 2499 2455 2386 2365 2393 2423 2447 2488 2533 2527 2459 2391 2383 2429 2491 2543 2571 2553 2494 2439 2426 2425 2375 2275 2195 2182 2204 2215 2233 2303 2403 2446 2406
613 2406 2352 2343 2345 2315 2296 2350 2439 2471 2434 2405 2410 2383 2300 2248 2301 2411 2480 2499 2524 2561 2568 2541 2521 2525 2537 2553 2580 2596 2573 2540 2556 2628 2695 2722 2731 2745 2753 2761
609B761M8Q9O3j8n9k3K6K9J4K7M9K6k5m1mK9J2j4MN1N4Pj7L2R9J05N1ol3l3nN8J08Q4Ql7k5
604C494j5m0m1K2Q2O6J1J0O8R4M6k0k4L1Q3Q4M0lJM4O5L0j7nO2J08R4N5L5L1K8L7O4Q8Q0O1
600D849N7O7O6M4J6mqK4Q0J13Q4M2N7J20J44J05Q8J49K10J67N8K1R9J95K28K34K58K83K70
596H116K51K61K78K68K55K63K59K09J70K11K96L22K94L07L76M08L64L54M69O39P36P55Q08
593A6669R44J097J193J220J192J107R61P73N79M02K63J94K12K75L12K84K48K75L40L37K24
591B9101J05R4J60J94J83K16L23M15M18L89M15N07O08O92P54P85P86P90Q30Q88R41R82J007
588D1583J018J067J218J437J593J618J593J622J683J693J661J657J677J653J581J539J544
586F7437J517J400J229J078R73Q83P62N66L04M7j23j92k06j87j14KJ10J84K53L38M08M32M20
$$ plain form
609 2761 2809 2898 2961 2943 2884 2861 2887 2916 2930 2957 3006 3032 3007 2966 2962 2991 3003 2989 2993 3044 3098 3105 3088 3120 3219 3324 3375 3369 3336 3303 3298 3356 3464 3548 3556 3519 3494
604 3494 3479 3439 3398 3420 3502 3568 3579 3589 3657 3751 3797 3777 3753 3784 3867 3951 3991 3988 3989 4033 4098 4128 4111 4106 4168 4276 4370 4425 4460 4491 4519 4556 4620 4708 4788 4849
600 4849 4906 4973 5039 5083 5099 5095 5087 5111 5191 5304 5388 5430 5487 5607 5751 5856 5944 6093 6303 6470 6528 6549 6648 6843 7071 7305 7563 7846 8116
596 8116 8367 8628 8906 9174 9429 9692 9951 10160 10330 10541 10837 11159 11453 11760 12136 12544 12908 13262 13731 14370 15106 15861 16669
593 16669 17613 18710 19903 21123 22315 23422 24383 25156 25735 26137 26400 26594 26806 27081 27393 27677 27925 28200 28540 28877 29101
591 29101 29206 29300 29460 29654 29837 30053 30376 30791 31209 31598 32013 32520 33128 33820 34574 35359 36145 36935 37765 38653 39594 40576 41583
588 41583 42601 43668 44886 46323 47916 49534 51127 52749 54432 56125 57786 59443 61120 62773 64354 65893 67437
586 67437 68954 70354 71583 72661 73634 74517 75279 75845 76149 76196 76073 75881 75675 75488 75374 75376 75486 75670 75923 76261 76669 77101 77521
583G7521M02L92L86L75L43K63J42K4m1m9k5J0N9J28K13K90L61M73O58Q66J019J128J291J542
580H7771J777J894J949K059K218K301K252K148K070K003J880J694J482J286J115R39P06M25
578A17969J83N2pq4k16l79n94q97j243j529j727j879j964j898j680j429j224j014p53n18m01
576I8768l74l40k72k12j85j89k28k84l04k68k51l25m47n15m96m55m48m64m52l77k41r3ML1
573I1583M3P7J03P9K1l3q4j45j63o9J15K86L98M88N88O43N75L98K03M0j25l50o09q06q97r38
569I1421r93j040j027r89j013j096j125j066j028j124j311j476j594j720j868j976k018k012
567F6945j978j899j778j647j521j396j283j196j127j034r11p87o87o13n46m74l90k99k12j25
565D7042j4J22K57L80N09O33O91O65O31O52O68N67L57J59M1n4j89l32m21m72n40o33o95p00
$$ plain form
583 77521 77923 78315 78701 79076 79419 79682 79824 79848 79807 79758 79733 79743 79802 79930 80143 80433 80794 81267 81925 82791 83810 84938 86229 87771
580 87771 89548 91442 93391 95450 97668 99969 102221 104369 106439 108442 110322 112016 113498 114784 115899 116838 117544 117969
578 117969 118152 118204 118197 118113 117897 117518 116924 116027 114784 113255 111528 109649 107685 105787 104107 102678 101454 100440 99687 99169 98768
576 98768 98394 98054 97782 97570 97385 97196 96968 96684 96380 96112 95861 95536 95089 94574 94078 93623 93175 92711 92259 91882 91641 91548 91552 91583
573 91583 91626 91703 91806 91885 91906 91873 91789 91644 91481 91412 91527 91813 92211 92699 93287 93930 94505 94903 95106 95146 95021 94671 94062 93256 92359 91421
569 91421 90428 89388 88361 87372 86359 85263 84138 83072 82044 80920 79609 78133 76539 74819 72951 70975 68957 66945
567 66945 64967 63068 61290 59643 58122 56726 55443 54247 53120 52086 51175 50388 49701 49088 48542 48068 47678 47379 47167 47042
565 47042 47028 47150 47407 47787 48296 48929 49620 50285 50916 51568 52236 52803 53160 53319 53360 53306 53117 52785 52364 51892 51352 50719 50024 49324
562D9324o87p05p48p71p49p17p05o81n86m38l16k49j88r5j9rk5LO5R8R8J22J94K73L10L00
559D3099K70K58K85L15K93K41K53L51M23L86L22L57M50M59L84L74M87O06O31O07O23O67O87
556E2828P07P69Q62R45J006J048J068J095J180J308J379J352J311J346J418J448J439J439
554G3948J436J378J288J227J194J137J055R96R62R00P88O85O34N97N21M15L36L15L21L11K86
551I0730K75K90K95K62K33K65L37L51K79J95J70J67J37J16J66K58K97K82L16M53O25P56Q48
548I8103R41J025J080J120J172J209J186J102J023J002J029J034R66Q50P80Q36R87J125J204
546A17774J284J438J631J758J769J708J620J485J281J054Q67P26N96M71L77L19K87K93L77
544A37115N27O69P49P88Q32Q79R10R40R92J047J041R60Q60Q21Q76R75J021R72Q86Q58Q91R08
$$ plain form
562 49324 48637 47932 47184 46413 45664 44947 44242 43561 42975 42537 42221 41972 41784 41689 41670 41661 41636 41639 41704 41802 41900 42022 42216 42489 42799 43099
559 43099 43369 43627 43912 44227 44520 44761 45014 45365 45788 46174 46496 46853 47303 47762 48146 48520 49007 49613 50244 50851 51474 52141 52828
556 52828 53535 54304 55166 56111 57117 58165 59233 60328 61508 62816 64195 65547 66858 68204 69622 71070 72509 73948
554 73948 75384 76762 78050 79277 80471 81608 82663 83659 84621 85521 86309 86994 87628 88225 88746 89161 89497 89812 90133 90444 90730
551 90730 91005 91295 91590 91852 92085 92350 92687 93038 93317 93512 93682 93849 93986 94102 94268 94526 94823 95105 95421 95874 96499 97255 98103
548 98103 99044 100069 101149 102269 103441 104650 105836 106938 107961 108963 109992 111026 111992 112842 113622 114458 115445 116570 117774
546 117774 119058 120496 122127 123885 125654 127362 128982 130467 131748 132802 133669 134395 134991 135462 135839 136158 136445 136738 137115
544 137115 137642 138311 139060 139848 140680 141559 142469 143409 144401 145448 146489 147449 148309 149130 150006 150981 152002 152974 153860 154718 155609 156517
541A56517Q88R13J035J184J284J381J558J792K005K218K498K808L013L093L165L298L405L379
539A95434L218K968K635K231J832J470J107P06L35P8m6n2P3L16O00Q58J130J461J808K085
536B20247K272K409K534K664K832L038L219L333L400L445L437L370L329L359L378L277L102
534B72645K984K934K835K631K387K163J949J748J606J538J499J464J472J539J610J640J669
532C06313J755J884J987K003J906J684J340Q86L65j63o51j089j499j856k088k159k132k083
530C06403j996j803j515j217r43o36k79N9K92M29N56P70J100J470J755J916K054K269K543
528C13227K802L077L440L833M091M185M271M459M641M646M473M258M069L830L481L102K876
526C78761K928L215L584L935M305M762N253N616N766N733N562N222M721M167L691L316L012
$$ plain form
541 156517 157405 158318 159353 160537 161821 163202 164760 166552 168557 170775 173273 176081 179094 182187 185352 188650 192055 195434
539 195434 198652 201620 204255 206486 208318 209788 210895 211601 211936 212014 211968 211916 211989 212305 212905 213763 214893 216354 218162 220247
536 220247 222519 224928 227462 230126 232958 235996 239215 242548 245948 249393 252830 256200 259529 262888 266266 269543 272645
534 272645 275629 278563 281398 284029 286416 288579 290528 292276 293882 295420 296919 298383 299855 301394 303004 304644 306313
532 306313 308068 309952 311939 313942 315848 317532 318872 319758 320123 319960 319309 318220 316721 314865 312777 310618 308486 306403
530 306403 304407 302604 301089 299872 298929 298293 298014 298073 298365 298794 299350 300120 301220 302690 304445 306361 308415 310684 313227
528 313227 316029 319106 322546 326379 330470 334655 338926 343385 348026 352672 357145 361403 365472 369302 372783 375885 378761
526 378761 381689 384904 388488 392423 396728 401490 406743 412359 418125 423858 429420 434642 439363 443530 447221 450537 453549
523D53549K783K672K674K741K868L096L425L799M151M499M924N485O129O743P271P801Q452
521E33062R228J0007J0662J1175J1606J2051J2591J3220J3819J4268J4595J4927J5272J5454
520G11937J5308J4870J4315J3812J3482J3455J3845J4674J5850J7230J8704K0256K1998K4076
518I43812K6572K9510L2884L6657M0700M4939M9526N4760O0777O7418P4515Q2142R0495R9564
516A734271J09011J18301J26804J33784J38397J39686J36582J28085J13621R3382O8332L9965
515C080221R965k0169m9488p7542j03847j27301j46230j59092j65186j64926j59642j51079
513A765684j40851j30073j19396j09201r9720r1002q2999p5696o9111o3160n7662n2505m7713
512F26595m3325l9307l5616l2289k9385k6881k4676k2639k0709j8918j7369j6111j5063j4081
$$ plain form
523 453549 456332 459004 461678 464419 467287 470383 473808 477607 481758 486257 491181 496666 502795 509538 516809 524610 533062
521 533062 542290 552297 562959 574134 585740 597791 610382 623602 637421 651689 666284 681211 696483 711937
520 711937 727245 742115 756430 770242 783724 797179 811024 825698 841548 858778 877482 897738 919736 943812
518 943812 970384 999894 1032778 1069435 1110135 1155074 1204600 1259360 1320137 1387555 1462070 1544212 1634707 1734271
516 1734271 1843282 1961583 2088387 2222171 2360568 2500254 2636836 2764921 2878542 2971924 3040256 3080221
515 3080221 3090186 3070017 3020529 2942987 2839140 2711839 2565609 2406517 2241331 2076405 1916763 1765684
513 1765684 1624833 1494760 1375364 1266163 1166443 1075441 992442 916746 847635 784475 726813 674308 626595
512 626595 583270 543963 508347 476058 446673 419792 395116 372477 351768 332850 315481 299370 284307 270226
510B70226j3104j2163j1281j0454r690r010q375p727p079o509o034n609n231m952m769m581
508A43658m327m077l911l798l661l474l260l041k867k836k975l154l188l028k794k603k450
506H8214k264k040j839j700j570j377j152r65p91n34k36j72n41j164j607j650j479j357j318
504F4458j249j152j125j177j215j205j208j249j247j143j001r40r99j116j221j281j291j251
501D3388j180j111j076j052r90q88q07p95q16p86o96o09n65n42n10m89n01n22n21n00m86m80
499B7466m58m04l33k81k57j95mK90M50K22l53r32j176j064q07n85m21k77j49o9m5n9o3k1M3
496B0518N3n0k28l92m74m69m30m16m57n05m87l98l26l36l92m10l79l37l05k73k43k35k40k28
493A2561j90j59j67j97k13j94j55j30j32j36j16q7p8q4q6q1q4p6k9K2J0n6r5o7l0k8l6l0n3
$$ plain form
510 270226 257122 244959 233678 223224 213534 204524 196149 188422 181343 174834 168800 163191 157960 153008 148239 143658
508 143658 139331 135254 131343 127545 123884 120410 117150 114109 111242 108406 105431 102277 99089 96061 93267 90664 88214
506 88214 85950 83910 82071 80371 78801 77424 76272 75307 74516 73982 73746 73574 73033 71869 70262 68612 67133 65776 64458
504 64458 63209 62057 60932 59755 58540 57335 56127 54878 53631 52488 51487 50547 49548 48432 47211 45930 44639 43388
501 43388 42208 41097 40021 38969 37979 37091 36284 35489 34673 33887 33191 32582 32017 31475 30965 30476 29975 29453 28932 28432 27946 27466
499 27466 27008 26604 26271 25990 25733 25538 25534 25824 26274 26496 26143 25211 24035 22971 22164 21579 21158 20881 20732 20663 20618 20559 20496 20475 20518
496 20518 20571 20521 20293 19901 19427 18958 18528 18112 17655 17150 16663 16265 15939 15603 15211 14801 14422 14085 13780 13507 13264 13029 12789 12561
493 12561 12371 12212 12045 11848 11635 11441 11286 11156 11024 10888 10772 10685 10607 10523 10437 10356 10272 10196 10167 10189 10199 10143 10048 9981 9951 9923 9887 9857 9804
489I804j26j78j46q5q6j37j48j00n8n7p3q2r8j14j07r3j12j43j29p2l6m8n7k2J8Nm6q8q9n4
486G243j1nn0r4o5J3M3j9q6p0oJ1k8m2%K3k3p6m3N1R3L5l9m7j1rm7o2l4nloNKk6n2n6n2n2
481F400l8j6k7p2r4o4l4m8o0j5M4M1nRQ9J36P1m1r4n3J0K1k4p6q4n9l3j1K4N4M4Lj7lj0n0
476E918o8l5j9n3n2M9J59J47M2pM1P5K7n0q4q4q2p6n7l9j8J6M0K0j6pK2Nn2o7k7j2n1p1l3
472E501%k8o5m8pQJ2L5M6Rl7l3J0M3N1N6N6K9j5n2o3m0J4N6L6k3l8K7J13J39J08P2N7O5Q1
468F175P8L2oK8J15J44Q1J7K0L1JoO6J33Q2m1j05r1q5r3l7Q0J35O5m5q6o3l1mK9M3J2l2l7
464F605jL7N7O4O7O0L5ll7l8NO3R4Q4M1kj6QL9L6%k0NL8M4L6M6N8M0QjKj5m2l0K1O0N8L7J9
459G562j1n6q0n7j4J4K8M5N7K8l1o5l1M6Q9O4J3pORj1j2K6P9J00P1%p0p8nP7Q0J3k8nJ0l0
$$ plain form
489 9804 9678 9500 9354 9269 9183 9046 8898 8798 8740 8683 8610 8528 8430 8316 8209 8116 8004 7861 7732 7660 7624 7576 7519 7497 7515 7520 7474 7386 7297 7243
486 7243 7232 7227 7177 7083 7018 7031 7074 7055 6969 6899 6893 6904 6876 6834 6834 6857 6834 6758 6715 6766 6859 6894 6855 6808 6797 6788 6741 6679 6645 6640 6637 6631 6636 6638 6612 6560 6504 6452 6400
481 6400 6362 6346 6319 6247 6153 6089 6055 6007 5947 5932 5976 6017 6012 6021 6110 6246 6317 6276 6182 6129 6139 6160 6136 6060 5976 5917 5884 5873 5897 5951 5995 5998 5981 5978 5968 5918
476 5918 5850 5815 5796 5743 5691 5740 5899 6046 6088 6081 6122 6197 6224 6174 6090 6006 5924 5848 5791 5752 5734 5750 5790 5810 5794 5787 5809 5814 5762 5695 5668 5656 5605 5534 5501
472 5501 5501 5473 5408 5360 5353 5361 5373 5408 5454 5463 5426 5393 5403 5446 5497 5553 5609 5638 5623 5571 5508 5468 5482 5538 5574 5551 5513 5540 5653 5792 5900 5972 6029 6094 6175
468 6175 6253 6285 6279 6307 6422 6566 6647 6664 6684 6715 6716 6710 6776 6909 6991 6950 6845 6754 6669 6576 6539 6619 6754 6819 6774 6688 6625 6594 6590 6619 6662 6674 6642 6605
464 6605 6604 6641 6698 6762 6829 6889 6924 6921 6884 6846 6851 6914 7008 7092 7133 7131 7115 7123 7162 7198 7198 7178 7183 7221 7265 7301 7347 7405 7445 7453 7452 7454 7439 7397 7367 7388 7448 7506 7543 7562
459 7562 7551 7495 7415 7358 7344 7358 7386 7431 7488 7516 7485 7420 7389 7435 7524 7588 7601 7594 7600 7609 7598 7586 7612 7691 7791 7862 7862 7792 7714 7709 7786 7866 7879 7851 7846 7856 7826
454G826o7m1J4L6L8M8L6l3r6o8J5M0k5q4p1k2nl9q8j08o6J1M4j2p9o4J3M4j1p9j00r1q4n8
450F774kM2L6om3o1o1m4k5j3JK6L2j7r8j36r6k7J4J5ok6k2OL2J6k9o5p3o0l2lJl4o8o7o4r0
445E727j05o4j6m5j18j20l7J4k5p7p2m3l5j9K2L1l3j12j12m4J2K1Mj0j7j0lj1l0k4J1M0L7
441D737Om3j08j54j27m9%pk1nLj6j8K3M8Lo7r1p5o4n2k0J3Ok3l7l6l9l7j2J8K6J2Jj1l4m8
437C702l9j7%J4K0nm5m4K1R7J29J14N2m4j12p0M4Q6J5l9K2R2M1n5l0R7J57R7M5P5J22J36J74
433D852K75L29K41P2k4PQ3J13R0N6L1ln2q5o2j4qm4m6J1M9Rl1L1J40J77J39J37K01K44K37
429G155K65L63M60N18O14P98R75J010R10P59N92L93J94P4L7pj39l56o04q04q95q50p23o03
426A0136n22m52l54k28j09m2m8j06j43q6O8K41L29K73P4k03m49n53m90l47k37j78j14j2P0
$$ plain form
454 7826 7759 7718 7732 7768 7806 7854 7890 7857 7761 7693 7708 7748 7723 7639 7568 7546 7541 7502 7414 7306 7240 7251 7295 7283 7204 7140 7153 7197 7186 7107 7007 6916 6832 6774
450 6774 6772 6814 6850 6844 6801 6740 6679 6635 6610 6597 6598 6624 6656 6639 6541 6405 6309 6282 6296 6311 6305 6279 6257 6263 6295 6311 6282 6217 6144 6084 6052 6049 6050 6016 5948 5881 5817 5727
445 5727 5622 5558 5542 5497 5379 5259 5222 5236 5211 5134 5062 5019 4984 4965 4987 5018 4985 4873 4761 4717 4729 4750 4754 4744 4727 4717 4714 4703 4673 4649 4660 4700 4737
441 4737 4743 4700 4592 4438 4311 4262 4262 4255 4234 4229 4232 4216 4198 4221 4269 4272 4205 4114 4039 3975 3923 3903 3916 3922 3899 3862 3826 3787 3750 3738 3756 3782 3794 3795 3784 3750 3702
437 3702 3663 3646 3646 3660 3680 3675 3630 3586 3607 3704 3833 3947 3999 3955 3843 3773 3817 3903 3918 3879 3901 3993 4034 3979 3949 4046 4203 4300 4345 4420 4542 4678 4852
433 4852 5127 5456 5697 5769 5745 5752 5835 5948 6038 6094 6125 6122 6070 5985 5923 5909 5901 5857 5811 5822 5871 5880 5849 5880 6020 6197 6336 6473 6674 6918 7155
429 7155 7420 7783 8243 8761 9375 10173 11148 12158 13068 13827 14419 14812 15006 15080 15117 15110 14971 14615 14011 13207 12312 11462 10739 10136
426 10136 9614 9162 8808 8580 8471 8429 8381 8275 8132 8046 8114 8355 8684 8957 9031 8828 8379 7826 7336 6989 6752 6574 6460 6448 6518
423F518Q6Q2J35K41L37M06N07O74Q54R77R97Q88O37L16O3m1n2o6j23k34m34p14r64j067j021
420I002r07p73o16m66l80l60l35k66j76j06o0m1m8o0m8rL5O4O7K5n0r8q0n4r4j74j99j43q4
416C566r1j33j44j15p4l8oJ0j3o7j04o7K6R1P7M0N5R7P3j3n3k1j1o6q6j1M9k1j30j18k1Po4
412B624j03n9j9l5m5j0K7L3M5O2L5k8m7PO6P4O3N8L9JrJ4K0mj5J2L0J0k1m3o0o1k5K1L3L3
408B723P1J18J03N5O9J39J54Q3Mm2q5j12n8L7M7l8q8n4k3k9J7J13J12k7j26n9M9K5p8j06n4
404B940j3%L2M5j4r0r2m6k1j7LJ0l5p8n1J3N5P8R2N5l2o0K0R1N7OO8J90K42K21J94J15p8k86
400C614l35k29j14n4%M1J7l5k3L3L3j3j7J1j4o4l6O0J02P5P4J06O9n0j24j00o1o9o8k6Oj2
396B797l1k0rmL1P3N2k0m9JN3O4O2P0N6L9Q3J73K00J23J1o7j13j36j17p0n0n5l5MQk2l2j4
$$ plain form
423 6518 6604 6686 6821 7062 7399 7805 8312 8986 9840 10817 11814 12702 13339 13655 13718 13677 13625 13559 13436 13202 12768 12054 11090 10023 9002
420 9002 8095 7322 6706 6240 5860 5500 5165 4899 4723 4617 4557 4516 4468 4408 4360 4351 4386 4450 4517 4542 4492 4394 4314 4260 4166 3992 3793 3650 3566
416 3566 3475 3342 3198 3083 3009 2971 2965 2975 2962 2895 2791 2724 2750 2841 2918 2958 3013 3110 3183 3170 3117 3096 3085 3019 2933 2922 2971 2950 2820 2702 2681 2688 2624
412 2624 2521 2462 2443 2408 2363 2353 2380 2413 2458 2520 2555 2527 2480 2487 2553 2627 2690 2748 2787 2788 2779 2793 2813 2809 2794 2806 2836 2846 2825 2782 2722 2661 2636 2657 2690 2723
408 2723 2794 2912 3015 3070 3139 3278 3432 3515 3519 3477 3392 3280 3222 3259 3306 3268 3180 3126 3103 3074 3091 3204 3316 3289 3163 3104 3153 3178 3100 2994 2940
404 2940 2927 2927 2959 3004 2990 2900 2808 2762 2741 2724 2727 2737 2702 2624 2573 2586 2641 2719 2811 2866 2834 2774 2794 2885 2942 2948 3016 3206 3448 3669 3863 3978 3900 3614
400 3614 3279 3050 2936 2882 2882 2923 2940 2905 2882 2915 2948 2935 2918 2929 2915 2851 2815 2875 2977 3052 3126 3232 3301 3251 3127 3027 2966 2897 2829 2803 2809 2797
396 2797 2766 2746 2737 2733 2764 2837 2889 2869 2820 2821 2874 2938 3000 3070 3126 3165 3248 3421 3621 3744 3755 3688 3575 3439 3322 3252 3202 3147 3112 3116 3124 3102 3070 3056
392C056ojL1N8L0nL4J05J04N7Q6J90K47K31K25K37J62Jj14j25j32j85j92j10m2n7p1j2L6q
388C830p9p4nN4Q7J16J33J16P1No3p4J4J09R9K0K2R3P9m8j04RJ47J44N7K6O0P0M6M2P0J04
384E176J23J12O6K2L3P4Q7Q9J42K13K08J49J32J48R3k3p3m2m3r1p9KL1jK8J21J34N5M8J45
381G079J66O3J4R4J22J7k8J02K16J41J6L4J21J31J14J64K00J36P0J15J80J62J42K00K41J89
378A0201J71K66L23K32J49K15K82K07J35K34L69L36K27K34L01K79K39L18M27M27M14N14N99
375A7099N15M24N25O88O72N89O89Q97R46Q60R04J125J345J528J764J989K078K103K208K316
372D1264K305K333K628L101L573M192N219O545P821Q927R856J0380J0339J0220J0873J2702
370A52278J5455J8629K1495K2820K1268J6356Q889N77o579j1019j2483j2112j1242j0278r083
$$ plain form
392 3056 3050 3049 3080 3138 3168 3163 3197 3302 3406 3463 3549 3739 3986 4217 4442 4679 4841 4842 4728 4603 4471 4286 4094 3984 3942 3885 3814 3802 3838 3830
388 3830 3751 3677 3672 3726 3813 3929 4062 4178 4249 4254 4191 4117 4131 4240 4339 4359 4381 4474 4553 4505 4401 4410 4557 4701 4758 4784 4844 4914 4960 5002 5072 5176
384 5176 5299 5411 5477 5499 5532 5606 5693 5782 5924 6137 6345 6494 6626 6774 6867 6844 6771 6729 6686 6595 6516 6518 6549 6548 6576 6697 6831 6886 6934 7079
381 7079 7245 7308 7322 7416 7538 7555 7527 7629 7845 7986 8002 8036 8157 8288 8402 8566 8766 8902 8972 9087 9267 9429 9571 9771 10012 10201
378 10201 10372 10638 10961 11193 11342 11557 11839 12046 12181 12415 12784 13120 13347 13581 13882 14161 14400 14718 15145 15572 15986 16500 17099
375 17099 17614 18038 18563 19251 19923 20512 21201 22098 23044 23904 24808 25933 27278 28806 30570 32559 34637 36740 38948 41264
372 41264 43569 45902 48530 51631 55204 59396 64615 71160 78981 87908 97764 108144 118483 128703 139576 152278
370 152278 167733 186362 207857 230677 251945 268301 277190 277767 271188 260169 247686 235574 224332 214054 204971
369B04971p894p128o606n860n025m597m514m311m008l981m071l771l156k746k541k126j604
366A31032j396j286p14J07N30P21J356K272K774L071L952N294O475P985J0830J4753J8981
364B06737K3791K8452K8860K1957J2740J1686K3637M4316O8755R4738J12687J01655M8672
363H28683k8912r2004j14538j03223q1618o4073n0642l8911l0098k4803k0822j6851j3964
361A48224j2497j0912q479o330n154m233l254k961l464l740l345k957k865k416j416o25l96
359G3180j49M34Q74R66J239J937K583K941L425M225M908N343O088P459Q967J0025J0554J0684
357A55683J0606J1000J2826J6320K0681K4672K6696K4440J6013K306j2601k4236l0644l2424
355B21338l0991k7646k3595j9743j6346j3349j0867r024p618o378n320m517l790k987k269
$$ plain form
369 204971 197077 189949 183343 177483 172458 167861 163347 159036 155028 151047 146976 143205 140049 137303 134762 132636 131032
366 131032 129636 128350 127636 127743 128273 128994 130350 132622 135396 138467 142419 147713 154188 162173 173003 187756 206737
364 206737 230528 258980 287840 309797 322537 334223 357860 402176 470931 565669 678356 780011 828683
363 828683 799771 707767 593229 490006 408388 344315 293673 254762 224664 199861 179039 162188 148224
361 148224 135727 124815 116336 110006 104852 100619 97365 94404 90940 87200 83855 80898 78033 75617 74201 73576 73180
359 73180 73031 73465 74339 75305 76544 78481 81064 84005 87430 91655 96563 101906 107994 115453 124420 134445 144999 155683
357 155683 166289 177289 190115 206435 227116 251788 278484 302924 318937 321243 308642 284406 253762 221338
355 221338 190347 162701 139106 119363 103017 89668 78801 69777 62159 55781 50461 45944 42154 39167 36898
353C6898j823j555j349j332j560j769j729j578j512j423j182r56r38r97r30q03p59p07n35
351A3461l97m45n23m22k64k78l98l97k87k46k92l01k65k57k52j98j65k19k51j71q2r3j12m2
348G104Jj03k22j81p8j03j92j62m3j2o8p0j6k5q1o4QLq8j45j19p2l5OJ9j3j9M0O6j0p4j9M3
344E276l0j55j68j08j10j38o8M4M7k5j4N6K1j07j49p2k8p0q3m2n3j25j27k2N3K3j8j1k1q0
340C696j09o6k5l2k9RJ7l8q2n8oK3K7J9j1l5j6J1k1o3k8M9M8k9n3J0L7k9r6q0k7lJ3L9L5j0
336C087k8PL1J3J4M8N0j4n8l6j1m6q6p0l7m4p0n7j2K1M4O3N3Qj9kJ5j9p2r0o8l0MK6K4Mkp
331B634l1n7l5K4M5J2j1J0J4l4p9o2lM0N1L5j0o0n8JN3N2J9j0l0l2ON6O2K4jpm5j14j23m5
327B291J9RoM5R7O2j7m4j5QMPMk8n9l6J0J1k9m1j1Nj5k4J0N4N3Jn3n8j2L3J2n7q8m3J7J8j9
$$ plain form
353 36898 35075 33520 32171 30839 29279 27510 25781 24203 22691 21268 20086 19130 18192 17195 16265 15462 14703 13996 13461
351 13461 13064 12619 12096 11674 11410 11132 10734 10337 10050 9804 9512 9211 8946 8689 8437 8239 8074 7855 7604 7433 7351 7258 7146 7104
348 7104 7105 7002 6780 6599 6521 6418 6226 6064 6021 6009 5941 5871 5855 5830 5749 5685 5693 5696 5608 5463 5344 5272 5237 5243 5262 5249 5230 5270 5336 5326 5252 5233 5276
344 5276 5246 5091 4923 4815 4705 4567 4499 4543 4590 4565 4551 4607 4628 4521 4372 4300 4272 4202 4119 4077 4024 3899 3772 3750 3803 3826 3808 3797 3776 3696
340 3696 3587 3521 3496 3464 3435 3444 3461 3423 3341 3283 3277 3300 3327 3346 3335 3300 3284 3295 3274 3211 3183 3232 3280 3251 3198 3208 3245 3216 3120 3040 3013 3010 3023 3062 3097 3087
336 3087 3059 3066 3097 3110 3124 3172 3222 3208 3150 3114 3103 3057 2971 2901 2864 2820 2750 2693 2681 2702 2746 2809 2862 2870 2851 2849 2864 2845 2773 2683 2615 2585 2589 2615 2639 2643 2641 2634
331 2634 2603 2546 2511 2535 2580 2592 2581 2591 2605 2571 2492 2430 2427 2467 2518 2553 2543 2483 2425 2426 2479 2531 2550 2540 2510 2478 2484 2540 2602 2626 2625 2618 2573 2459 2336 2291
327 2291 2310 2319 2313 2358 2455 2517 2500 2456 2441 2449 2453 2460 2464 2436 2377 2341 2351 2362 2333 2292 2281 2286 2271 2247 2257 2311 2364 2365 2312 2254 2242 2275 2287 2230 2142 2099 2116 2134 2115
322B115l3oK1K9K8K0lk0qJ0Nj3j7lJ6L4M1Mp8j27p2L3P4K5k3jL9K3k8m3MN2N9M3M4N1K3m4
318B274r5q1k6J2J3RK0J3k8p3o5mM6L3k4o1l7K4O6O4N3N9N3J0m2n5l6k6m4o5p3o9m4J9Q2Q8
313A990M1J0K5M4K8%mMmk3k6rJ8L8L6ln7p5m0J5M9N5M3L1L3M6M3J3j7j9j9l7l5K1O5K1n4l0
308B217R2J69J31P0P5J04R6Q5J16J57J61J52J39O7q2j96j73p6l8p4r5o8m0l6l5l7n3o0l5k
305B731jj7j4kmj0mrm0n6k7J1J8J4K8J9l9p4j9N3M0j9JJ09J83J60J02Q0J07J56J99J77Q4K2
301C959J03K95M73N86O48N86K87j80n51o51n54m25l20k29j65j45j28r3r1j48j92j52p4m7p6
298B716j00q0l4J4N3O4M5J1k2n6p1l5L4N6kq4j03m7L0P2O1J1m4o1k2N9J49K11J98J08J3j3
294C131K5P6J20J76K18K02J38Q1K2q0k00k47k01j33j12j18j19j11r3n9m4q5j37j18m4rl7n7
$$ plain form
322 2115 2082 2076 2097 2126 2154 2174 2171 2151 2143 2153 2158 2145 2128 2125 2141 2175 2216 2220 2142 2015 1943 1976 2050 2075 2052 2051 2090 2113 2085 2042 2046 2098 2157 2200 2244 2295 2318 2274
318 2274 2179 2098 2072 2084 2097 2106 2126 2139 2111 2038 1973 1969 2015 2048 2024 1963 1926 1950 2016 2080 2133 2192 2245 2255 2213 2158 2122 2096 2052 1987 1914 1845 1801 1820 1902 1990
313 1990 2031 2041 2066 2110 2138 2138 2134 2138 2134 2111 2085 2076 2094 2132 2168 2165 2108 2033 1993 2008 2057 2112 2155 2186 2219 2265 2308 2321 2304 2285 2266 2229 2194 2215 2280 2301 2247 2217
308 2217 2309 2478 2609 2679 2754 2858 2954 3039 3155 3312 3473 3625 3764 3831 3749 3553 3380 3304 3266 3192 3097 3029 2989 2953 2918 2881 2828 2768 2733 2731
305 2731 2730 2713 2699 2697 2693 2683 2679 2670 2630 2574 2547 2558 2576 2590 2618 2637 2598 2524 2505 2558 2598 2579 2580 2689 2872 3032 3134 3214 3321 3477 3676 3853 3937 3959
301 3959 4062 4357 4830 5416 6064 6650 6937 6757 6206 5555 5001 4576 4256 4027 3862 3717 3589 3496 3405 3257 3065 2913 2839 2792 2716
298 2716 2616 2536 2502 2516 2569 2633 2678 2689 2667 2611 2540 2505 2539 2595 2593 2509 2406 2359 2389 2461 2522 2533 2489 2428 2406 2465 2614 2825 3023 3131 3144 3131
294 3131 3156 3232 3352 3528 3746 3948 4086 4167 4189 4109 3909 3662 3461 3328 3216 3098 2979 2868 2775 2716 2672 2587 2450 2332 2288 2279 2242 2185
290B185l6l2n8m7J5L2l4q1l6J9qp5q9n6l1qL3N3K9J3M3O0J1m8m5j0JK1P6R4K3m1NQ0M5p1j22
286A910q5n9o0j2P4Q5J2k3K1L7l6j05q5k1J6M6Q3P7jp4o7j1J9Rpj8k3qK0K9R%Rro1p3j1M4
281A651K2l0j9L9N5Ql4k6jpm8q5p6nQ4J16O7pl6j9LK1M7N8K3m0n6rM8N3J8j2k3l4n0n9m5j1
276A581K5M4L1j1m9l7J8N3L1j3j4J6J7k8o3n1k8k8k3K5Q0Q0L1ppQJ5J0k1p2r9o1NL2PoJ7M1
272A549M0K8J8ml9n6l3J3M8N2J3n8j08q4lO6P5M0LoJ9N9O8K6j8j1K8L3Jj8lRjj4l6q0j17q5
267A414MP0P3N4M2J8k1k4J5M2K2rk2l9n6k1N9P9nr9r1oN4O3O5P6P3N6L7Kn1p6m7j5k9m6pM5
263A699K7m4p4m0mj0k6k0j0lK1N8O1J9k2k7j6j9l2l3k9l4m8m3kO5J02O9j2n8k6L1N0M0M9P7
258A736Q2N4K1k0p5j11p9%M6K1k9m7k9NK9K7jl1m0m1m3k1M1R5P6qo9o4j5L2O4O2J9k4j6K1
$$ plain form
290 2185 2149 2117 2059 2012 2027 2059 2025 1944 1908 1927 1919 1844 1755 1699 1668 1660 1693 1746 1775 1788 1831 1891 1902 1854 1809 1799 1800 1821 1897 1991 2014 1973 1978 2058 2103 2032 1910
286 1910 1825 1766 1706 1694 1768 1853 1865 1842 1863 1900 1864 1759 1674 1653 1669 1715 1798 1875 1874 1800 1733 1722 1741 1750 1743 1725 1702 1694 1714 1743 1752 1752 1761 1752 1691 1618 1607 1651
281 1651 1673 1643 1624 1663 1718 1726 1692 1666 1665 1658 1610 1525 1449 1444 1528 1644 1711 1704 1668 1649 1652 1673 1720 1778 1801 1761 1705 1696 1744 1797 1815 1803 1780 1746 1696 1637 1592 1581
276 1581 1606 1650 1681 1670 1621 1584 1602 1655 1686 1673 1659 1675 1692 1664 1601 1550 1522 1494 1471 1496 1576 1656 1687 1680 1673 1681 1696 1706 1685 1613 1514 1453 1458 1490 1497 1491 1508 1549
272 1549 1589 1617 1635 1631 1592 1536 1503 1516 1564 1616 1629 1571 1463 1379 1376 1442 1517 1557 1560 1554 1573 1632 1700 1726 1708 1697 1725 1758 1759 1741 1738 1747 1746 1732 1696 1616 1499 1414
267 1414 1418 1488 1561 1615 1657 1675 1654 1630 1645 1687 1709 1700 1678 1639 1583 1562 1621 1700 1695 1596 1505 1499 1553 1616 1681 1757 1830 1886 1923 1925 1874 1798 1751 1736 1707 1661 1654 1699
263 1699 1726 1682 1608 1568 1564 1554 1528 1508 1498 1495 1516 1574 1635 1654 1632 1605 1589 1570 1538 1505 1476 1442 1394 1351 1349 1414 1516 1585 1573 1515 1489 1520 1570 1610 1659 1736
258 1736 1818 1872 1893 1873 1798 1687 1608 1608 1654 1675 1646 1599 1570 1575 1604 1631 1630 1599 1559 1518 1475 1454 1495 1590 1666 1658 1589 1525 1510 1542 1606 1668 1687 1663 1647 1668
254A668Oo8j08n4K8M5Kk5lK5J7j3k6j1K0M1M3L6M8P3P4L0l4o3l7Kln8r6n8K5O3L3ljj0p0j24
249A414q4J9P0L1k1k1jpk2pK5L0J1kOK1K5J5Mkjnj2jL0N2M0K0J8J3k9p2o1rK2K2K1K3j1o1
244A503n4J6P1O0K8J1j5o8r0l5M3O5L5J6J9J2j8m4n2n1l7KM0L4j6o3n2K1R2Q3qq6o1L2P4L6
240A543oNJ1l4p4m1K4L9Mj3mk0o0p2l8kNRL9P1O6J8l5m3NN9M9j8o6n0rMLK0K3j5n6l7NNk7
235A287j0M7O2Jn3l7J4M2M1K8mm1m6jL7L1QRK6J6j4l4k5j1ooJJ9M4N3L5Jj0PJ4k3o9p3l0K3
230A353N4O7Q2R7Q3J7q0j34r5lN4L4j2k4j7l5o6n2K1Q1O6Nk7j4Kj4l6k7J3N6Q3P0jr8j38p6
225A289K3N5J6j4pjj6nM7O7J5n3o1k6nlMMj6j6K8O4L0l5n1k0nmL2P8M7o4j37q6L4J15J08L4
221A465n4r2n0L4P5N1Pk0m6o4l5L5P4N0Kk4m2n9n0rJ5jrK7P7Q6N0Ml1m2l4k8m4m6QP3P1Rj6
$$ plain form
254 1668 1674 1606 1498 1444 1472 1517 1519 1494 1491 1516 1533 1520 1494 1483 1503 1544 1587 1623 1671 1744 1818 1848 1814 1751 1714 1716 1713 1655 1559 1501 1526 1589 1622 1619 1618 1608 1538 1414
249 1414 1330 1349 1419 1450 1429 1408 1407 1400 1378 1371 1396 1426 1437 1435 1441 1462 1487 1502 1506 1504 1503 1498 1486 1485 1515 1567 1607 1627 1645 1658 1629 1557 1496 1487 1509 1531 1552 1575 1564 1503
244 1503 1449 1465 1536 1596 1624 1635 1620 1552 1462 1427 1470 1535 1570 1586 1605 1617 1599 1555 1503 1452 1415 1417 1457 1491 1475 1412 1360 1381 1473 1556 1548 1462 1401 1433 1507 1543
240 1543 1537 1542 1553 1519 1445 1404 1428 1467 1471 1458 1454 1434 1374 1302 1264 1262 1267 1276 1315 1386 1452 1470 1435 1392 1397 1456 1505 1487 1421 1371 1362 1366 1369 1389 1412 1397 1341 1304 1309 1314 1287
235 1287 1277 1324 1386 1387 1334 1297 1311 1353 1394 1422 1418 1377 1331 1330 1367 1398 1406 1415 1441 1457 1443 1409 1384 1373 1367 1361 1362 1381 1425 1478 1513 1514 1504 1511 1525 1502 1433 1360 1330 1353
230 1353 1407 1474 1556 1653 1736 1753 1673 1539 1444 1441 1495 1529 1517 1493 1476 1441 1375 1323 1344 1425 1491 1496 1469 1455 1457 1443 1407 1380 1393 1449 1532 1602 1601 1503 1365 1289
225 1289 1312 1367 1383 1369 1362 1361 1345 1340 1387 1454 1469 1416 1355 1329 1324 1321 1325 1329 1313 1297 1325 1389 1419 1384 1333 1313 1308 1304 1336 1414 1461 1397 1260 1174 1208 1323 1431 1465
221 1465 1411 1319 1269 1303 1378 1429 1436 1416 1370 1306 1271 1306 1380 1430 1432 1408 1366 1307 1257 1248 1263 1262 1253 1280 1357 1443 1493 1497 1466 1424 1390 1362 1318 1272 1280 1353 1424 1433 1417
216A417Nj8j01j25k7P4P0K4M5Q2L5m4k5P1R0lp1k6N7P4L1k3o4q7o9k2J2K6M3L8k3r5p9K3Q9
212A404N2j4k7rn%L0L7j5o0j6Q8J37Q3k3j00j10p1k8k8n0l2M4J05P9qo8o8m5k9pL9R6J23Q7
207A591pr0r1j8M6N2L7L3J6k4m0NN3L0l5o0l5k6n4o8m5j9j2j1j1j8j9RL9J3m6m8L3J10J10
203A400O4L2J2k6n5m6k9m6o7k3P4J33R7J0n0n5l0mMJNJ8Mm9q4l9N3R4N1pj7JMlLQj0j7QK4
198A443j3o5n4J7O2L9%oJqj7kJ4kk9k4%Pj1l3m2l9k0J4K7Jk0RP3R4N0j1l7l3k5j3PJ2j2k9
193A325jM5L9l3q9n7L1P8M5oj5OLj4lK9J3n6r1l6M9O3Ol8l1ook5l5k7MM6O9M9J6J2K2%m5n5
189A281j9J3J8K7N0M0j2m4j3K8J0m6o3k2K7L5J8RJ8K4qp0r7l5O0P7Kn1j1M9L2k1qN3N5j5m8
184A343RO8M0l8o5k1K8K4k4p0p1k6K4L2NoJ6M0L4J6POKpj3j1olj9n0n6k1J6Nj9QO9P9J8m1
$$ plain form
216 1417 1422 1404 1303 1178 1151 1225 1295 1319 1364 1446 1481 1437 1412 1483 1573 1570 1499 1473 1530 1604 1635 1612 1548 1461 1392 1370 1382 1408 1451 1489 1466 1371 1292 1315 1404
212 1404 1456 1442 1415 1406 1401 1401 1431 1468 1453 1393 1377 1465 1602 1685 1662 1562 1452 1381 1353 1325 1275 1243 1287 1392 1471 1463 1395 1327 1282 1253 1246 1285 1381 1504 1591
207 1591 1584 1494 1403 1385 1431 1483 1520 1553 1569 1545 1505 1510 1563 1593 1558 1498 1463 1437 1383 1315 1270 1251 1239 1228 1217 1199 1180 1189 1228 1241 1195 1147 1180 1290 1400
203 1400 1464 1496 1508 1482 1427 1381 1352 1306 1239 1216 1290 1423 1520 1530 1480 1425 1395 1391 1395 1396 1401 1419 1423 1374 1290 1251 1304 1398 1449 1442 1425 1426 1430 1427 1430 1438 1428 1411 1419 1443
198 1443 1430 1365 1311 1328 1390 1429 1429 1423 1424 1416 1399 1397 1411 1409 1380 1356 1356 1363 1352 1319 1277 1238 1218 1232 1259 1260 1240 1249 1322 1416 1466 1455 1418 1385 1360 1347 1354 1366 1354 1325
193 1325 1324 1369 1408 1375 1286 1229 1260 1338 1383 1377 1362 1368 1371 1357 1354 1383 1396 1340 1249 1213 1262 1325 1331 1293 1262 1256 1250 1225 1190 1163 1167 1213 1282 1331 1347 1359 1381 1381 1336 1281
189 1281 1262 1275 1293 1320 1370 1410 1398 1354 1341 1369 1379 1333 1270 1248 1275 1310 1328 1337 1355 1379 1371 1301 1204 1169 1229 1306 1308 1257 1246 1295 1327 1306 1298 1351 1406 1391 1343
184 1343 1352 1420 1460 1422 1357 1336 1364 1388 1364 1294 1223 1197 1221 1253 1258 1252 1268 1308 1342 1358 1365 1371 1373 1366 1353 1342 1336 1333 1314 1264 1208 1187 1203 1208 1189 1197 1266 1345 1363 1322
179A322m1j7j1%L0K8k2m1K6J00Q0jl3PL4Ol5m8n5o2m4j1jj3J0O2P1J6l7l6k3l7l9J2P2P7M3
175A389K5K1j9p9q9m0Mjj5J1O4Q0L4l7o8k9L2L8j3m8j2M9N6Nl4l1k1l1k9PN0N9M1K5J4lk3
170A382k8k7l9o3p3m6J8P9R2N2pm1n1o0o1l5J2M3M5M1L8K1jML3L4jj7K1N1J6l9l7PJ2l0m7
166A298k1ok5j8L9P2J6o2m6N1J00L1q0j17o1J4L6Ol6n1k3K9O9P2L6j8o5p8m0L0P8O5J7%K6
161A338M1jo8p7rO4O2k2j10j23n0M6R0O1Rj2KK1L4L8J2n2r8o5K2O2K5k0nL2L8K1J6Pk7m7k0
157A235J1j1n3k6N7R9N8mk8k7k6k4k2l0l0J0N8N3Jk1%Nk7m1j5j0m7o6j9L4L7K6M6O3L7PJ1
152A321mp5j19l7R2J02j4r5m3N7Q1L0j3nK2J7k8p1o1qJ6j8m1PP8Q0K5j1pMK2P2R2Oj25j47
148A202m1M1Rm6k6L2M6L1L5L8lm5k6L1N6M2K4j6r1j34o6O3J28Q0Mk6j5jNMk2n8n8j3L6M6K4
$$ plain form
179 1322 1281 1264 1253 1253 1283 1311 1289 1248 1274 1374 1454 1453 1420 1427 1461 1467 1432 1384 1329 1267 1223 1212 1211 1198 1208 1270 1341 1357 1320 1284 1261 1224 1185 1197 1269 1346 1389
175 1389 1414 1435 1416 1337 1248 1208 1212 1211 1196 1207 1271 1351 1385 1348 1280 1251 1283 1321 1308 1260 1248 1297 1353 1358 1324 1293 1272 1241 1212 1219 1269 1328 1369 1394 1408 1405 1382
170 1382 1354 1327 1288 1225 1152 1106 1124 1203 1295 1347 1340 1299 1248 1188 1127 1092 1104 1147 1192 1233 1271 1292 1291 1295 1328 1362 1361 1344 1365 1416 1432 1393 1356 1363 1375 1345 1298
166 1298 1277 1271 1246 1228 1267 1339 1355 1293 1247 1298 1398 1429 1349 1232 1171 1185 1221 1227 1191 1140 1117 1146 1215 1287 1323 1305 1240 1162 1122 1152 1230 1295 1312 1312 1338
161 1338 1379 1378 1310 1233 1224 1288 1350 1328 1218 1095 1045 1091 1181 1242 1251 1239 1241 1262 1296 1334 1346 1294 1196 1131 1153 1215 1240 1220 1215 1247 1285 1306 1322 1329 1302 1255 1235
157 1235 1246 1235 1182 1156 1213 1312 1370 1366 1338 1311 1285 1261 1239 1209 1179 1189 1247 1300 1301 1280 1280 1285 1258 1217 1202 1192 1145 1079 1060 1094 1131 1157 1203 1266 1303 1310 1321
152 1321 1317 1242 1123 1086 1178 1280 1266 1171 1128 1185 1266 1296 1283 1278 1300 1317 1289 1218 1157 1149 1165 1147 1106 1113 1191 1271 1296 1285 1278 1282 1304 1376 1468 1474 1349 1202
148 1202 1161 1202 1211 1165 1139 1171 1217 1248 1283 1321 1318 1273 1247 1278 1334 1376 1400 1384 1293 1159 1093 1156 1284 1364 1368 1342 1327 1326 1331 1335 1313 1255 1197 1184 1220 1266 1290
143A290J0J6K4J0k3m0j7K1K1j4k4J7M8Rn3m7K7P3K2p4j16o9J5O4N4K4J8L5L6Jl4m0l2l5m0
139A177l6k8l0j1M1Q3N9om2k6JJ8M2P0N6po9p5l7%Lk1m2k9J9N9M7Lk4k1j2qoj5n0q0m4M6J04
134A109Q8M8M9O8M8Kj8kJl4p3p7m7j5j1k0j0L1O7M2k6n7%P8Q1Qn2m4j8l3o3m1L0P2M7J4L4
130A276P2M3n3j17o9M8J25J08K6m4n1j2Ql2q3n8L5Q7L7m1l8K3L1m2j03p6oK5Oj2mK1M0M4J9
125A233k7n8m3jK8J3k2l5j1K3L1J5RK7M0K1j1j6LK0K3J5rm1m9k0Nj4m3k1K9L7j0m3k5MNJ0
121A092L7N1K2k2m0m2m1j1N8J04P0j3n0mO3P6K1n2q7p0k8RM0P3Q6M4m2j00q6l1J3K3Rj7k3
117A132RN0L9k5o8l8K2M9L6K4J4nk0j8j2j4oK1L9J8k4m4l4nK7L3qo2n6J3N8J9m3m3kJ6J1K7
112A130N0L9QJ1L7K7k4n7m4j5K0O5Q6M0l6o5l5j1j9k5j1mj2j6j4l2m6oN7O8K0KL6M9Qk1J6
$$ plain form
143 1290 1300 1316 1340 1350 1327 1287 1270 1291 1312 1298 1274 1291 1339 1348 1295 1248 1275 1348 1370 1296 1180 1111 1126 1190 1244 1268 1286 1321 1357 1358 1324 1284 1252 1217 1177
139 1177 1141 1113 1083 1072 1113 1196 1255 1249 1207 1181 1182 1200 1242 1312 1368 1361 1292 1217 1180 1180 1183 1162 1120 1091 1110 1169 1216 1219 1195 1174 1162 1154 1148 1133 1083 1003 959 1005 1109
134 1109 1197 1245 1294 1362 1410 1412 1394 1392 1393 1359 1286 1209 1162 1147 1136 1116 1106 1137 1204 1246 1220 1163 1163 1241 1322 1330 1278 1234 1216 1183 1120 1079 1109 1181 1228 1242 1276
130 1276 1348 1391 1338 1221 1152 1200 1325 1433 1459 1415 1364 1352 1360 1328 1245 1187 1222 1309 1346 1305 1267 1290 1321 1279 1176 1100 1094 1119 1125 1113 1109 1130 1170 1214 1233
125 1233 1206 1148 1105 1104 1132 1145 1123 1088 1077 1100 1131 1146 1155 1182 1222 1243 1232 1216 1219 1239 1262 1277 1268 1227 1178 1158 1163 1149 1106 1085 1114 1151 1141 1098 1073 1077 1082 1092
121 1092 1129 1180 1202 1180 1140 1098 1057 1046 1104 1208 1278 1265 1215 1211 1274 1350 1371 1319 1232 1162 1134 1143 1183 1256 1342 1386 1344 1244 1158 1127 1140 1163 1172 1155 1132
117 1132 1141 1191 1230 1205 1137 1099 1121 1170 1206 1230 1244 1239 1219 1201 1189 1175 1169 1190 1229 1247 1223 1179 1145 1140 1167 1200 1192 1130 1074 1087 1145 1164 1121 1078 1076 1092 1103 1130
112 1130 1180 1219 1227 1238 1275 1302 1278 1221 1177 1162 1182 1247 1333 1373 1337 1272 1237 1226 1207 1182 1171 1167 1155 1139 1125 1093 1047 1041 1098 1166 1186 1188 1224 1273 1281 1260 1276
107A276N2K4k3j9J9J9j2k4rqk6m2m7m4j8K4M3J2k1nL1K6j7l9j1L1M2K1j6m3l6mJ6jk4j8mj5
103A110l8l2jJ7J2RK3M1M7M6L4J5LQLl0o9o8l1qj9k7J1P8J02M0o8j19o3L6O6J3l3j0K4Mm2
98A084l6K0N2K8oj2pmPL5N4M2Pj9l1l7m6m7k2K8O0M4Kj4OOk5l2J9O3K9m4o3nN7O5L3j0m0l8
93A203rJk9m6J3R0P7k3p5j2O9N4l0p4m5o%mQJ8nm5m7J3Q3P4j8q8m6N4Q1Pn8l8QJl4k2K9L9
88A168j4o1l4M5J11J12M7l6p1l7K2M3J5k2l9m9n3m0jL4L3ql9j6N0R2N3k9o4j6N0N0qn4m5r
84A180J5J5jk5l7j8J7L7K6RLOKj3k6k8pL0N1L4lj3J1K3pn1o0l9k9l3j8J1Rl2n4j7L5L9K4N0
79A116R5O9l1r5m5M8P1K2rJ0L0J3j9l0l0l3k4J0M9N4J5l3m7j8J0mk8%O8P9kp6m6M4P0J6k8
75A291k1j2k9k6J0J5l5o0mP2Q1K9j9m6o6o8m6k9l6k2L9Q6M6k8m1J4M7J1l7m1j6JK%RL0N0L1
$$ plain form
107 1276 1328 1352 1329 1310 1329 1348 1336 1312 1303 1295 1269 1227 1180 1136 1118 1142 1185 1197 1176 1171 1202 1228 1211 1172 1161 1192 1234 1255 1239 1196 1160 1156 1172 1171 1147 1129 1125 1110
103 1110 1072 1040 1039 1056 1068 1077 1100 1141 1188 1234 1268 1283 1286 1294 1297 1267 1198 1130 1099 1091 1072 1045 1056 1134 1236 1276 1208 1089 1026 1062 1128 1141 1108 1098 1122 1126 1084
98 1084 1048 1068 1120 1148 1142 1130 1123 1119 1126 1161 1215 1257 1264 1245 1214 1177 1131 1084 1062 1090 1150 1194 1196 1182 1188 1194 1169 1137 1156 1219 1248 1204 1141 1136 1193 1258 1291 1281 1241 1203
93 1203 1194 1195 1166 1120 1133 1223 1300 1277 1202 1190 1259 1313 1283 1209 1164 1158 1158 1154 1162 1180 1175 1130 1083 1096 1179 1253 1235 1147 1101 1155 1236 1243 1185 1147 1155 1156 1122 1100 1129 1168
88 1168 1154 1093 1059 1104 1215 1327 1374 1338 1267 1230 1252 1295 1310 1288 1249 1200 1147 1107 1106 1140 1173 1165 1126 1110 1160 1252 1305 1276 1212 1196 1246 1296 1288 1234 1189 1180
84 1180 1195 1210 1209 1184 1147 1129 1146 1183 1209 1218 1221 1227 1229 1216 1190 1162 1155 1185 1236 1270 1267 1254 1265 1288 1281 1230 1170 1131 1102 1069 1051 1062 1071 1039 985 968 1003 1042 1066 1116
79 1116 1211 1280 1249 1154 1109 1157 1228 1250 1241 1251 1281 1294 1275 1245 1215 1182 1158 1168 1217 1271 1286 1253 1206 1188 1198 1194 1166 1166 1234 1313 1311 1235 1189 1233 1303 1319 1291
75 1291 1270 1258 1229 1203 1213 1228 1193 1133 1129 1201 1282 1311 1292 1246 1180 1112 1066 1037 1001 979 1018 1104 1150 1122 1081 1095 1142 1153 1116 1075 1059 1060 1062 1062 1071 1101 1151 1182
70A182k7n6rN5M5k4m8NO0N0Kl8o6q0m6K3O1L6J3M5Q1M7l3o9m2k0n1q8o6PO2N5Nk0PN0M4mk3
65A125K0N8K1o5j08p2qK6K9K6L1L4L6L7K6Kk9m8n3m1k7k0j3J6N4N4ln4k2O3Q6Lq4o9MJ4m8
61A001o2K8J15Q8kk0M7Q4K5n9q1m6j3LK3K8om6m2J2N7O3M1K7L0M1L3j0p0r5o9l9m3n0j2M8
56A029O4L5J2J6J5jpjqk0NN4N8oo4n2j6k1m7k4M1P2L1l3o4n2k0J8M8N8M7L5J9j0n2p5n9k0
52A005KJJ6P4J35J19K4n6n1jjm8o6k4Qj3m8m4j1J6L1M3M8M8N1L8j9q3o7K5P5Qq3q5k6JmK5
47A063P2N3j9n1j6J5PNK3J1l1m0kJ4j5j8M0Q2L9k2j9K5K5j6l0j3j0k3j6NQLK0L7Jo3q1l3J2
42A042Ok2k7NN3R2R3N0OJJ0k7r4j09m8J5J5k0l5k7k1JM9Q0N1pj3L9Q1O6K7ol4o5p1l2J0J1
38A145j8k1J7M2J9k4l6k1k3m9n3j0M7O2L4Jj3j4oK1O0P5M6pn0p4p5l7L8R7Q0lp0o2j3Lk0k5
$$ plain form
70 1182 1155 1099 1090 1145 1190 1166 1118 1123 1183 1233 1235 1197 1131 1051 1005 1028 1089 1125 1138 1183 1264 1311 1278 1209 1167 1147 1096 1008 942 949 1011 1066 1071 1051 1058 1108 1152 1148 1125
65 1125 1145 1203 1224 1159 1051 979 971 997 1026 1052 1083 1117 1153 1190 1216 1218 1189 1141 1088 1047 1020 1000 987 1003 1057 1111 1108 1054 1032 1095 1181 1184 1100 1031 1035 1049 1001
61 1001 939 967 1082 1170 1168 1148 1195 1279 1304 1245 1164 1118 1105 1108 1131 1159 1153 1107 1065 1077 1134 1197 1238 1265 1295 1336 1369 1359 1289 1194 1125 1086 1043 993 981 1029
56 1029 1093 1128 1140 1156 1171 1170 1163 1162 1154 1134 1139 1193 1251 1245 1181 1129 1113 1092 1045 1021 1062 1134 1165 1132 1068 1016 996 1014 1062 1120 1167 1202 1221 1211 1159 1084 1025 1005
52 1005 1007 1008 1024 1098 1233 1352 1376 1320 1269 1268 1267 1219 1153 1129 1137 1124 1076 1032 1021 1037 1068 1111 1159 1207 1258 1296 1277 1194 1127 1152 1227 1235 1152 1067 1041 1042 1038 1063
47 1063 1135 1188 1169 1118 1102 1117 1124 1129 1152 1163 1132 1092 1090 1104 1089 1071 1111 1193 1232 1210 1191 1216 1241 1225 1195 1182 1172 1149 1133 1138 1146 1149 1169 1206 1207 1144 1063 1030 1042
42 1042 1048 1026 999 1004 1057 1149 1242 1292 1298 1299 1309 1282 1188 1079 1031 1046 1061 1041 1006 979 958 959 1008 1088 1139 1132 1119 1158 1239 1305 1332 1326 1292 1227 1156 1124 1134 1145
38 1145 1127 1106 1123 1165 1184 1160 1124 1103 1080 1031 978 968 1015 1077 1111 1112 1099 1085 1079 1100 1160 1235 1281 1274 1224 1150 1075 1038 1076 1173 1253 1250 1180 1118 1105 1108 1088 1063
33A063J5N2L5oj4P%l8m5LM0J4k8j4L2K7k4m1J1N5L2k0k7OK7J6j1m0n7l3L8R0N3m3j01p0JM6
28A051M5J0k5j4N2J04N6o7j35q3RM5M1N8Q5N3l8j07j05n4NO4R2N5j8m3J4P0L4o0r5l9K5K5
24A110j1j1K3L1jk4j0J4J7K7N5N0l3j28j24k0N9L8k2l4mPjPK0Rj0JL2L3PjJ8K6J2PJ6J0j2
19A183j1J8L0Ok0l6o3r4o9J7Q2O0kk6j3oj2mKj0oM6R9P7jm4k3Nrm0m0j0L2N7M3jl4k6j8n7
14A082j01p2K2P7N1QLKl8o7k5O1J01O7%m9o3m5mK4K4J9L2M6L7J8Oj6p6j34j25m4L9P3N6J6
10A005j7k0J3N1N8M5M3M3Ko7q5k9L0K4k4m2k2OL1O4P2K2m8n1J6N4or8j16l6O8J29J27P5Qk9
6A296oK6lq2j21p8rJ7J0K1M9N1Pm1n2l4j1MJ4K2K5J8Jj0nONj2k6k8k4j1K2M7K4l4n7j2M2K4
1A075m3p3l3K4L8J8MJ5M8P2N5Qk3JL8K3l3n6j6L7M9K2j7m3m3j3J5J0j2j0J5J4j1j8QK0MlJ0
$$ plain form
33 1063 1078 1130 1165 1159 1145 1152 1152 1114 1069 1072 1112 1126 1098 1084 1116 1143 1119 1078 1089 1144 1176 1156 1129 1135 1162 1178 1167 1127 1070 1037 1075 1165 1218 1175 1074 1004 1005 1051
28 1051 1096 1106 1081 1067 1119 1223 1279 1212 1077 994 1003 1048 1089 1147 1232 1285 1247 1140 1035 981 986 1050 1142 1197 1179 1136 1150 1220 1254 1194 1099 1060 1085 1110
24 1110 1099 1088 1111 1142 1141 1117 1107 1121 1138 1165 1220 1270 1237 1109 985 965 1024 1062 1040 1006 1002 1009 1008 1015 1035 1044 1034 1035 1067 1100 1107 1106 1124 1150 1162 1169 1185 1195 1183
19 1183 1172 1190 1220 1226 1206 1170 1107 1013 944 961 1043 1103 1101 1075 1062 1056 1044 1040 1042 1032 1026 1072 1171 1248 1247 1203 1180 1185 1176 1136 1096 1086 1118 1175 1218 1217 1183 1157 1139 1082
14 1082 981 909 931 1008 1059 1067 1070 1072 1034 967 942 1003 1104 1171 1171 1122 1059 1014 1010 1034 1058 1077 1109 1155 1192 1210 1216 1200 1124 990 865 821 860 933 989 1005
10 1005 988 968 981 1032 1090 1135 1178 1221 1223 1156 1071 1042 1072 1096 1072 1030 1008 1014 1045 1109 1181 1203 1155 1104 1120 1174 1168 1070 954 918 986 1115 1242 1317 1325 1296
6 1296 1290 1316 1313 1231 1110 1032 1023 1040 1050 1071 1120 1171 1178 1137 1085 1051 1040 1044 1058 1080 1105 1123 1124 1114 1109 1115 1120 1108 1082 1054 1030 1019 1041 1088 1112 1078 1021 1009 1051 1075
1 1075 1032 959 926 950 988 1006 1010 1025 1073 1145 1200 1208 1185 1186 1224 1247 1214 1158 1142 1179 1228 1250 1233 1190 1147 1134 1149 1159 1147 1137 1152 1166 1155 1137 1145 1165 1169 1166 1176
-4A176mm9n5PN3J3n2m2K7N8J9k2k8l0m2l8pJ9K4L3N2M4km4l9qnl5n2k3L0M7J1k4oM0N1J3k5
-9A085l7n2o7l6M7R3L8m7n4J7P0O0K3rl2m2l2k2l8m4LO6P1J8j5mLj4j3J8L4J5jJ1J1j9m1k2
-13A042jj8n7o0j6N2J13J25P1j8o6l3K8N0K1k1m6m8l9k5j2PJ8ro4q7l3M2N8K8K2M5M2J1QK5
-18A155j1r0j03j7N4J9l9j8M8N5jm4m2k1KK5J6k5m0QO3O7M9N3M9%m5l1nl3p0l8K0J4l0k2J7
-22I89qo6l6P0J01J5m9jN0Lo6n4NJ3pJ3M9J9m9n2K2P4M0k7n0j8K9M7K4j6k1K3N7L4j6k9jJ2
-27A123j0l2l6l5m0k9J1M2J8l8n7qO4P9K4l5l8pkk4j8L0O4M0pk6j4pj7k5j4MJ0j0l3j8M0R1
-32A060Q7N0L8L2k7j17j44p9kL4Q0J43J29j3j43j05K7O1k9p7j0M2on4%P6L8n9n7N0J04L7l9
-36A127qO5N6l4r0o2%L6N6O6M2j7n3k8K4L2qn1p1o7l9QL0Kk2K6J13J25K8p3q2k7J5L1M8M3
$$ plain form
-4 1176 1172 1123 1068 1075 1128 1141 1089 1047 1074 1132 1151 1129 1101 1071 1029 991 984 1003 1027 1060 1112 1156 1154 1110 1071 1063 1058 1023 971 948 978 1025 1036 1012 1006 1046 1097 1110 1085
-9 1085 1048 996 929 893 940 1033 1071 1024 970 987 1057 1117 1140 1131 1099 1057 1025 1003 965 921 924 990 1061 1079 1064 1060 1063 1049 1036 1054 1088 1103 1102 1113 1124 1105 1064 1042
-13 1042 1041 1023 966 906 890 942 1055 1180 1251 1233 1167 1134 1162 1212 1233 1212 1166 1118 1079 1054 1042 1049 1067 1058 994 907 874 916 974 1002 1024 1069 1111 1122 1130 1155
-18 1155 1144 1054 951 934 988 1007 968 950 998 1053 1052 1008 966 945 947 972 988 963 923 931 994 1061 1110 1163 1212 1212 1167 1136 1131 1098 1028 990 1010 1024 994 972 989
-22 989 981 915 879 949 1050 1065 1016 1015 1065 1068 1002 948 953 966 959 972 1021 1040 991 939 961 1035 1075 1048 998 980 1009 1056 1080 1064 1043 1066 1123 1157 1141 1112 1111 1123
-27 1123 1113 1081 1045 1010 970 941 952 994 1012 974 917 909 973 1052 1076 1041 1003 996 994 970 952 982 1046 1086 1079 1053 1039 1032 1015 990 976 980 990 980 947 929 969 1060
-32 1060 1147 1197 1235 1267 1240 1123 979 900 898 932 1012 1155 1284 1271 1128 1023 1050 1111 1082 1005 995 1037 1031 977 977 1053 1091 1032 975 1025 1129 1166 1127
-36 1127 1119 1184 1240 1206 1116 1054 1054 1090 1146 1212 1254 1237 1184 1156 1180 1212 1204 1153 1082 1015 976 984 1014 1016 994 1020 1133 1258 1286 1213 1131 1104 1119 1150 1198 1241
-40A241j9q8p8PO1K7m4p6n9k2J3M0M6L5L2M4L9Nl3l8k6k4l0k4%J5J7J7J4rn0p3m0K2N2J6l9
-45I71m7MN7N5J4j8j4KLonJ1K8K6Lj1JK2J4j9l3j1Kl2o9n2J1N5N4L0QrnK8O1N0Oj2ol6j03
-50A028j17l3N9N5j1k3L9Q1M3j1rL1L4nl6k3PK3J0k8o3o0oN2M7j5n3j0O4P2Rm5l0J9L7J1k1
-54A122k7j1J1K5K4J2lj1j1olrl0m8l7nJ2RK7Q2J20Q1j6p5m8K1N3J6l9m7lM0K8k2m8k8knj9
-59A130k5l2n1m6%M5L5j0l0j1JnpOJ5J3Qql4m4pL6K7j2qM3O5K8pJ1L7J8k7m4k6jK0K7Rk5l3
-64A081JL4K4rk3oJ8K9J4j8l4j1J4qn2n1mOl4m0K3P7O9O1R9R7j6j32j16j6J4l8m4K4O2K1r
-68A107J9K5m2r2m5M7Q0L8k0o0q1o9k9OK9O5J07J01L1l4m4l6n4n3JN4L4k7l2L9J03R7L5l6
-73A264o3l1K5L0l3q9p1rK5K4L1M4K8PK4N5L3l3o1k3J0rl2k0pk6l9lN6P0L6mk8m2l5J2N6L9
$$ plain form
-40 1241 1222 1134 1056 1063 1124 1151 1107 1031 972 950 963 1003 1049 1084 1116 1160 1199 1204 1171 1133 1107 1083 1053 1029 1029 1044 1061 1078 1092 1083 1033 960 920 942 994 1010 971
-45 971 924 928 985 1040 1054 1036 1022 1024 1027 1021 1016 1027 1055 1081 1084 1073 1074 1096 1110 1091 1058 1047 1049 1017 948 896 907 962 1016 1046 1054 1045 1040 1068 1129 1179 1185 1173 1167 1131 1028
-50 1028 911 878 937 992 981 958 997 1078 1121 1110 1101 1132 1166 1161 1125 1102 1109 1132 1142 1114 1051 991 985 1037 1084 1069 1016 1006 1070 1142 1151 1106 1076 1095 1132 1143 1122
-54 1122 1095 1084 1095 1120 1144 1156 1153 1142 1131 1125 1122 1113 1083 1035 998 993 1005 1014 1041 1123 1243 1324 1308 1233 1185 1206 1259 1275 1236 1189 1186 1226 1254 1232 1184 1156 1154 1149 1130
-59 1130 1105 1073 1022 976 976 1021 1056 1046 1016 1005 1006 1001 994 1000 1015 1028 1036 1028 994 950 943 979 1006 994 986 1029 1094 1122 1115 1126 1163 1181 1154 1110 1084 1083 1103 1130 1139 1114 1081
-64 1081 1082 1116 1140 1131 1108 1102 1120 1149 1163 1145 1111 1100 1114 1106 1054 1003 999 1005 971 931 954 1031 1100 1161 1260 1357 1341 1209 1093 1077 1091 1053 1009 1033 1095 1116 1107
-68 1107 1126 1151 1109 1017 972 1019 1099 1137 1117 1057 976 907 878 884 913 978 1085 1186 1217 1183 1139 1103 1049 996 997 1051 1085 1058 1026 1065 1168 1265 1300 1264
-73 1264 1201 1170 1195 1225 1192 1103 1032 1023 1048 1072 1103 1147 1175 1182 1206 1261 1294 1261 1200 1177 1187 1178 1146 1126 1119 1093 1054 1051 1107 1177 1213 1209 1181 1139 1104 1116 1172 1211
-77A211k7n6j0M0Lr2j27m5P8J25P5jl3k0RK8K0j8m6k8J9L2j2n0l9qMJ5M5M3l7j17r0K0P9L7
-82A027j0J5N6L3j7k5NJ6OQJ1j2l4nN4P4M4J1OLj9m8p3q5o4jN5M9jk5pJ1J2K1K5j6q2q2NQ4
-87A025R2P7R1Q4%r5r0j0K4k1o1m3j8l2m1nL5J9k3k7J4L5Pl1l3pJ3PrrOJ6%k1j8PK8L4L0J3
-91A063k8p6q0k2N4Q7N9kn1m9JM5K2n3q7l5M2M4j9m7QP8P1qo7m5K6O5L6rjM2N0jm7l2RQk8
-96A023m2j0K1J4qj1JJ3K9M5N0L5J1j3l7m4j7K1L0Lj7j2j6l6j6O4J23P0m4p8kO4J5q5j02l0
-101A012K7Ol1j6L2M2Ll7m2k0J2M5N6L1nj1J1K7J9J5K0Pl3n4k3J7Kn3o6oP0Q4L8qj7j0k4n3
-105A067n3KO1M3n1j14n9O0J22Q2J3j2rj7l0j4K4M5K4rj0L2P3M7m6j19r4j2K1k2m9jO8P1J6
-110A150k5k4j1j8m2o3o2k2M3Q0O0Pk7l7l9k1J8M3J5l8n5l9l3l4J0J01J48R2mm6k4jj2k2r
$$ plain form
-77 1211 1184 1128 1118 1158 1161 1069 942 897 975 1100 1175 1174 1141 1121 1130 1158 1178 1160 1114 1086 1105 1137 1125 1075 1036 1028 1032 1047 1092 1135 1098 981 891 911 990 1027
-82 1027 1017 1032 1088 1121 1104 1079 1084 1100 1106 1114 1125 1113 1079 1074 1128 1202 1246 1257 1263 1266 1247 1199 1126 1041 977 976 1031 1080 1079 1054 1047 1058 1070 1091 1116 1100 1018 936 941 1025
-87 1025 1117 1194 1285 1369 1369 1274 1184 1174 1198 1177 1116 1073 1055 1023 982 977 1012 1031 1008 981 995 1030 1037 1006 973 966 979 986 977 968 974 990 990 969 951 958 986 1020 1050 1063
-91 1063 1035 959 879 857 911 998 1057 1055 1004 955 956 1001 1023 970 883 848 890 934 915 868 876 954 1025 1017 950 905 931 996 1032 1023 1022 1064 1114 1113 1066 1034 1043 1051 1023
-96 1023 981 971 992 1006 998 987 988 1001 1030 1075 1125 1160 1171 1158 1121 1077 1060 1081 1111 1114 1097 1085 1069 1033 1017 1081 1204 1274 1230 1152 1150 1214 1229 1144 1042 1012
-101 1012 1039 1045 1014 998 1030 1072 1075 1038 996 976 988 1033 1089 1120 1115 1104 1115 1142 1161 1176 1196 1203 1170 1116 1093 1110 1112 1059 993 987 1057 1141 1179 1171 1154 1144 1120 1067
-105 1067 1014 1016 1077 1120 1069 955 896 956 1078 1160 1173 1161 1152 1135 1105 1091 1115 1160 1184 1175 1165 1197 1270 1317 1271 1152 1058 1046 1067 1045 996 995 1063 1134 1150
-110 1150 1125 1101 1090 1072 1030 967 905 883 926 1006 1066 1073 1046 1009 970 949 967 1010 1025 987 932 893 860 826 836 937 1085 1177 1173 1127 1103 1102 1090 1068 1059
-114A059Olk4k1JPrj9%L1M4L8M4O8P7L3m2r4r2n7k5oJ0K5K2Mj1m%l0p1n1L4R6N4l3n1PM0M
-119A061l7k1J2J3J0M4P1L4l3n3j6J5J8J6J2k8q5r4l5K4K3j6k2K0O8O7J7l1k5J7K9j3o4p6
-123I22o2m7j5L9O7M1K0O2J09O9k9o4j0L0lm4l3loj8j2Jpj1jLNL6P9O3j5n8j5M0K3k6l0QK3
-128A131J2QPj0j5J9M5J2m9o4l5j1JJ8No3j08k9J21J77P9n3r6n9k3j6j0J7N6P1L0m7q0k0O5
-132A086P5K1qJ1J4k1k5K5N5J7l2l2j2j3j4J5K6k1p3n0K5N4J6l0m0l1k1J3O0O4lp8r1m6KK4
-136I62L6M5L4RJ2N1P1K3n2p5m8l5n1m2QL7K0J9O6P1l6j57j35kP8M5RL7O1K1k8k2NJ3K6M7
-141A123K3n2p8j1M1k2j06o8N4R5K0l5J0O7N0pl3l1l3l1rJ2PlKJ0PRK3K8Rk1l8m6n2m8k4N
-145H47K1J8OjJ0L1K9jk0OM9O1M5L5L5J8j2k0j5m1p9p4k7ol2l1J9M5qo5k7P1J11O0ok6j4o
$$ plain form
-114 1059 1065 1062 1038 1017 1018 1025 1016 997 997 1028 1072 1110 1154 1222 1299 1332 1290 1196 1104 1047 1022 1016 1026 1051 1073 1077 1066 1062 1062 1032 961 910 944 1040 1094 1061 1010 1017 1057 1061
-119 1061 1024 1003 1015 1028 1038 1082 1153 1187 1154 1101 1085 1100 1118 1134 1146 1118 1033 939 904 928 951 935 913 933 1001 1068 1085 1054 1029 1046 1075 1062 998 922
-123 922 860 813 798 837 904 945 965 1027 1136 1205 1176 1112 1102 1132 1129 1085 1052 1049 1043 1025 1013 1014 1007 996 995 998 1003 1039 1118 1181 1166 1108 1093 1133 1156 1130 1100 1108 1131
-128 1131 1143 1151 1158 1148 1133 1152 1197 1209 1160 1096 1061 1050 1051 1069 1074 1011 903 874 995 1172 1251 1198 1102 1043 1020 1004 994 1011 1067 1138 1168 1121 1041 1021 1086
-132 1086 1161 1182 1174 1185 1199 1178 1153 1178 1233 1250 1218 1186 1174 1161 1147 1162 1188 1167 1094 1044 1069 1123 1139 1109 1069 1038 1017 1030 1090 1154 1151 1073 982 936 938 962
-136 962 998 1043 1077 1086 1098 1149 1220 1243 1191 1116 1068 1033 982 940 948 985 1005 1024 1090 1161 1125 968 833 831 909 954 963 1000 1061 1082 1054 1032 1037 1050 1076 1123
-141 1123 1146 1094 1016 1005 1046 1024 918 850 904 999 1019 984 994 1061 1111 1104 1071 1040 1007 976 967 979 986 983 985 995 1002 1011 1034 1062 1071 1050 1012 966 914 866 842 847
-145 847 868 886 892 891 901 932 961 960 940 946 995 1056 1101 1136 1171 1189 1177 1157 1142 1101 1022 948 921 915 883 852 871 916 908 843 816 887 998 1058 1052 1026 1012 1006
-150A006KJ7K4J3nqJ1L4K9j3m9k9K0Oq7j46o8Q6J53P7l0o2l5k2l5k3K7P7Q3M2j2m2l7j8rj5
-154I62k4k6rK6N9M9kl5mM9M7ql8j2J4ol7k7QJ9Noj2k2j6K3O5O0J7KK9L8j2p1p5l0Lqk7k4
-159I44mJ4K9M2L9Rk3j9J7L7J9j2j8qnnJ8M2K9k6o8o2k9o%PMk1n5n6pO6J09Q5J2n2n3lL1K1
-164A042JJ5M1M1K1J7K5J3k2n0n4n7p1p3m3RM8N8L7%k1pJ3Mk4k3J0K3j1l7qM3N3K3QJ9Pm8
-169A022q3l6P1J31Q8j1o6m8k1l8o2m3PK3KkK1L4J8J8M0K5m6r3m1N3Q6M2lk1l5n0l9j3jPM3
-173I79P4N0j0k7J2K9j5n9n3k6j0J3N1O3L5J3K2J9k1m3qK6km9m2KJ3j6l3k8l0k6J8P8Q2K3
-178A104l5m7l3j7PK6J5NL2O2J9p9j15l3O8P5J7nL1M8Ko0o9j5L7L1k9p2m1L5P8N3J5OOk3o6
-182A033p0l0J1K1J7K9N8P1L1m7j01r1m5k0l0k9QM7O0N2M0K2MJJ2J0rj8qk3p3r9m8L5O1J0
$$ plain form
-150 1006 1008 1025 1049 1062 1057 1049 1060 1094 1123 1110 1061 1032 1052 1058 971 825 757 843 996 1073 1043 981 946 924 889 866 893 970 1053 1095 1083 1041 1004 986 977 962
-154 962 938 912 903 929 988 1037 1035 1000 996 1045 1092 1084 1046 1034 1048 1042 1005 978 986 1005 1010 1004 992 970 954 977 1042 1102 1119 1121 1150 1188 1176 1105 1030 1000 1003 995 968 944
-159 944 940 954 983 1025 1064 1073 1050 1031 1048 1085 1104 1092 1074 1066 1061 1056 1074 1116 1145 1119 1051 989 960 954 954 961 965 944 889 833 826 892 1001 1086 1098 1046 993 990 1021 1042
-164 1042 1043 1058 1099 1140 1161 1178 1203 1216 1194 1144 1090 1033 962 889 846 855 903 961 998 998 977 970 983 987 963 940 950 973 962 925 917 960 1013 1036 1044 1063 1070 1022
-169 1022 939 903 974 1105 1193 1182 1116 1068 1047 1009 947 904 911 934 936 934 955 989 1007 1025 1065 1090 1044 951 910 963 1049 1091 1088 1067 1032 982 943 930 929 936 979
-173 979 1053 1103 1093 1066 1078 1107 1092 1033 980 954 944 957 1008 1071 1106 1119 1141 1160 1139 1096 1088 1114 1112 1063 1021 1023 1036 1020 987 959 929 903 921 999 1081 1104
-178 1104 1069 1022 989 972 979 1005 1020 1025 1057 1119 1138 1059 944 911 979 1054 1071 1066 1097 1145 1147 1087 1018 1003 1040 1071 1042 970 929 964 1042 1095 1110 1116 1122 1099 1033
-182 1033 963 933 944 965 982 1011 1069 1140 1171 1124 1023 932 887 867 837 808 816 863 923 975 1015 1037 1041 1042 1054 1064 1055 1037 1029 1006 933 834 786 821 882 892
-187H92m4l8J9O8O5J7l2m2j6J8M9Q0R3N1k9o9l1K6J9k8m4rK3J7PK5N7N6%q5j36j00NR4R6L8
-191A112j0k1k0k5l0l7n6n9j4N5Q0M2jp%j3k5JM3M5om9k8M2R6Q0J6m3o9q6j08j02m1M2P6M9
-196I29J5J0K0J2j5l9m3k9oK0L8N4O3M9Pm0o7o5m5j3K4M2K6lk6n4q5p0K1J18J20L1l7j1M9
-200A000P0M8J9j8o7r3n6J6P0Q5P2M1jk2j3ok9n1l1NLm0o0k1L1M4Rl4n1l9mL6O9Q5P3L7pl3
-204A137m0m0l7j6J6M0M1K2j5o5r4o0J8O2K7l7n0kN0O4M3Nk7k3JLl5n6j5L6K0n4q7l5M4Q3
-209I24P5M8Rl3n3l7j2pj0lLqk8l7k7lJ9K8K1K0L5L9qp3p9mP6P8K6nPJ8NrlLj0k0mL1N0L5
-214A077Nj1qmkMJ7K1%l1l6jL6L9J1j3j4pj7m4p6j03j08p1RR7J30Q3Ml9l2j2NL0O2N6pp0p2
-219I08k0K3L7N2O7M8jk3NJ8l4r8q7oO0O4M6M0J9l4p9n0L8R2N9k1o0m0nL%QK4J9j8o9r8o8
$$ plain form
-187 892 848 810 829 897 962 979 947 905 889 907 956 1036 1129 1180 1151 1082 1051 1077 1096 1068 1024 1015 1038 1055 1062 1087 1144 1200 1200 1115 979 879 884 978 1074 1112
-191 1112 1102 1081 1061 1036 1006 969 913 854 840 895 975 1017 1016 1009 1009 996 971 972 1015 1060 1054 1005 977 1019 1115 1195 1211 1168 1099 1013 905 803 762 804 880 929
-196 929 944 954 974 986 971 932 889 860 854 874 912 966 1029 1078 1085 1045 978 913 868 855 879 921 947 944 918 864 779 709 730 848 968 999 962 951 1000
-200 1000 1070 1118 1137 1119 1052 959 903 919 989 1074 1146 1187 1186 1164 1151 1145 1116 1065 1034 1039 1042 1002 942 921 952 996 1005 971 920 881 877 913 982 1067 1140 1177 1170 1137
-204 1137 1097 1057 1020 1004 1020 1060 1101 1123 1108 1043 949 889 907 969 996 959 909 907 957 1021 1064 1069 1042 1019 1020 1023 988 932 917 953 973 919 832 797 841 924
-209 924 999 1047 1056 1023 970 933 921 914 904 901 904 896 868 831 804 801 820 848 869 889 924 963 955 882 803 799 875 953 979 974 981 999 1004 995 992 995 985 965 961 992 1042 1077
-214 1077 1082 1071 1063 1059 1057 1061 1078 1099 1099 1068 1032 1031 1067 1106 1117 1104 1090 1083 1066 1022 946 843 735 664 673 770 900 983 987 948 916 904 909 939 1001 1057 1050 980 908
-219 908 888 911 948 1000 1067 1115 1114 1091 1096 1114 1080 982 895 889 949 1013 1059 1099 1118 1084 1005 955 993 1085 1144 1123 1063 1023 1018 1021 1021 1029 1053 1072 1054 985 887 819
-223H19K1J06J12M3j3%K9Ml8k4K7K1m8p5j6M1K4mK6N6nr3p1O1J33M8q9j22m0N2Q1N7Nm9p1
-228A008m6lRrj1J5L7K9J5J6Pm3j09j18m3M4N6Lk4K4P5M5m0p5k4L3J5l6k8M6R3M4m8q3l8K4
-232H60L8Rj8j2K4O9R9Q6L1m1r3r7n1L1J05J09K7o8q6l0K1J6j4j9qkJ0L4K4l7q1k3R0J24L8
-236A165n5n4%Rl3n2j3K6J8k3m3k5MRkkJ4K0pl4j9K1K7j1l9k5jmj6p%j8k5J8P4O8J3rL3O5
-241A067K9l4n3k3oj6j2L3O4K1o9j05m6L3L8okN4O7po3j4O0L7m8n6K9P3K3k6JL6J5rK1L5l2
-246A109r6l7P6Q6rn6LM5oo4m4%nk2ML4Jm6k2N0P8L8MQJ6Jj9l4m4l8LL5K0pJ7N7J4j00j44
-251I06n2O1P0Qj4J5K7%k4k0j4j3QM3O3N8M4K4rl1j4J2qo7r1m2M0Q6P9L5k4o8o7k1K3L0%l1
-255A022l7mN4Q5N3j2m8m5m2n2m2qQj4k7mK0RON0Q9M7m6r0m6J9M4L6J8pk5oM4P6N1pn1n4k2
$$ plain form
-223 819 840 946 1058 1101 1088 1088 1117 1121 1083 1059 1086 1107 1059 984 968 1009 1033 1029 1055 1111 1106 1013 942 1003 1136 1184 1095 973 933 985 1066 1123 1128 1079 1008
-228 1008 962 959 968 959 948 963 1000 1029 1044 1060 1067 1024 915 797 754 798 854 857 833 857 932 977 937 862 838 871 886 850 822 868 961 1005 957 874 836 860
-232 860 898 907 889 877 901 970 1069 1155 1186 1145 1052 955 904 935 1040 1149 1176 1108 1022 992 1013 1029 1015 996 988 986 996 1030 1054 1017 936 913 1003 1127 1165
-236 1165 1110 1056 1056 1065 1032 980 967 993 1011 988 945 920 924 933 931 929 943 963 956 922 903 924 951 940 901 876 875 871 855 848 848 830 805 823 897 965 978 969 1002 1067
-241 1067 1096 1062 1009 986 980 964 952 985 1049 1070 1001 896 850 883 921 915 913 967 1034 1027 964 950 1010 1047 999 943 972 1045 1068 1042 1043 1079 1094 1085 1106 1141 1109
-246 1109 1013 976 1052 1138 1129 1073 1076 1121 1115 1051 1007 1007 1002 980 984 1018 1019 973 951 1001 1079 1117 1121 1129 1145 1146 1127 1093 1049 1011 1014 1049 1069 1062 1079 1136 1150 1050 906
-251 906 854 915 985 993 979 994 1021 1021 997 977 963 950 958 1001 1064 1122 1166 1190 1181 1150 1136 1148 1140 1073 982 940 980 1066 1145 1180 1156 1088 1021 1000 1023 1053 1053 1022
-255 1022 985 981 1035 1120 1173 1161 1113 1068 1026 974 932 924 932 918 891 887 907 916 922 972 1061 1108 1062 972 926 945 989 1025 1043 1036 1011 1005 1049 1125 1176 1169 1118 1064 1042
-260A042J1Ql6o7k6N1P7K0m2m9k3k2m1n0m8m2lQ8J62J30Kj07j07k6M2M4Mk6k7j4j1j1J3O1
-264I77R2O9J2l1m4m5l7j5J4L1K4mm3p4o6j0M7N7K6kj2k6l6j5K0J9j9l2PL9Om5l2K8M8Pk2
-269I13J3N7M0k1m4j0Ol4o8k2O3P6kn9mR8J35Q4K0k1n7p6l8K8L7k7o9l2K2J3l3n0m0l4j2M7
-273H99P8J8p0p2MM4J6QN2O7Nn9m8KJ3JJ4L6J9j1NM3K8m6r9q5m0j5RM7O7L1l1m0J1N8L4k7
-278I66m7jN0L5k3m8qM8O1L1ok4j5OMm3j02r1J4J26J43O0l4o5m2rQNprJ4M8O1K3m8j01q6r
-282H85O6O8Qm0l1rj6l8l0lPJ0L2N3K7k8n1j9J5K5L0M1K4l2o9m9NM2N4M4Mo1q6l1N5Q1M0m
-287A019j4l0o5p7k5M4O4L5QKj5m3l0L4P8M1l2l7L1P0K4m7n5oL5L9J9mk1j9nj6n7o2QQ6Q0
-291A057Rj6K8N4Qm9n0k2j5k4j5nk6n2l9JRk2l6lM5N1J1l1l5kJ9Oj3NM7N5J2l1k5PK2J0j7
$$ plain form
-260 1042 1053 1061 1025 958 932 983 1060 1080 1038 989 966 944 903 853 805 763 760 848 1010 1140 1142 1035 928 902 944 988 992 966 939 925 914 903 916 977
-264 977 1069 1138 1150 1119 1075 1030 993 978 992 1023 1047 1043 1000 926 860 850 897 954 980 978 966 940 904 889 909 928 909 877 884 923 929 884 852 880 928 935 913
-269 913 926 983 1023 1002 958 948 954 920 852 830 893 969 967 908 904 1002 1137 1221 1241 1220 1163 1087 1049 1077 1114 1087 1018 986 1008 1021 988 938 898 864 852 899
-273 899 977 995 925 853 857 901 917 925 977 1044 1049 990 942 944 957 958 972 1008 1027 1016 1021 1064 1092 1046 947 862 822 807 816 863 930 961 930 890 901 959 993 966
-278 966 919 918 968 1003 980 932 924 972 1033 1064 1058 1034 1019 1025 1029 986 884 793 807 933 1076 1136 1102 1037 995 986 994 999 992 983 997 1045 1106 1129 1081 980 894 885
-282 885 951 1019 1027 987 956 947 931 893 863 860 867 877 909 962 989 961 910 891 906 931 961 1002 1026 994 925 876 881 923 977 1021 1025 964 878 847 902 983 1023 1019
-287 1019 1005 975 910 833 808 852 916 951 959 961 946 903 873 907 985 1026 994 957 988 1058 1082 1035 980 974 1009 1048 1067 1063 1042 1023 1018 1002 945 883 891 977 1057
-291 1057 1066 1050 1078 1132 1140 1091 1041 1019 1004 980 965 960 934 882 843 844 853 831 795 792 837 888 899 868 833 831 850 856 843 848 895 950 962 931 906 913 935 945 928
-296I28m8n0OR0J07J6r1j03l7J5K4L6O7O1Ql7l6k0k0j0K4M7K3j9l6l3l3k5J6N4L5l4o8k7M8
-301H78Q4P2M0Rk0l8l0j3j8l1j5L4N2ko8o4PO1N2L1M3O5M7pn5p7q1n9lN1N2Nk8lM0M2j0o6
-305I77p5l1J5K5J4J3K7K2rk2ML1K3kj3j7k9l8j2K5K5qk1J2O1P3L3l1p0n1LK7qm7l5J2M1L6
-310I80K2%l8n9k4L1L2j4k8K1O2M2JNL2K5j8n1m5k4k4n0o4l3J9K6k3m1L7J36J30L0l3nJ2m4
-314A025r2m5L3L7mON7N2k5q7r4q7q4l7N6J15R1M1L0K9rm3oO8Q4L2kJ8J2o4j23p4K7N1lj5
-319I70M6O7k0j02n6N7Q1Mn5l6j0k5k9J4L9Ok7NO0N4rn5m5lL1M1K4kk0k5k6j2J7J9m1j06q7
-323G44KN0J4k3oJ0kJ0P4R9J9q0q3k2J0J4L8N1Mm8k9J4j0o2l8L6L5l3l9M5R3M3j5j7j7n2m4
-328G85M3J01L5p9r7j6O2P4N2K9RJJ1K5Rl5p5p6k5M3O0Om4qP2R2L6rj9m9r0n4O7J31N7n3o0
$$ plain form
-296 928 880 830 836 926 1033 1049 958 855 818 833 857 893 960 1021 1029 992 956 936 916 906 930 977 1000 981 945 912 879 854 870 924 959 925 857 830 878
-301 878 962 1034 1074 1083 1063 1025 995 982 964 933 918 952 1004 1002 934 870 877 938 990 1021 1064 1129 1176 1169 1114 1037 956 897 894 945 997 1002 974 971 1011 1053 1043 977
-305 977 902 871 886 911 925 938 965 987 978 956 960 991 1014 1012 999 982 953 915 903 928 953 945 924 936 997 1070 1103 1072 1002 951 954 981 973 926 891 903 944 980
-310 980 1002 1002 964 905 881 912 944 930 902 923 985 1027 1028 1033 1065 1090 1072 1021 976 952 928 878 814 781 800 826 803 762 799 935 1065 1095 1062 1057 1069 1025
-314 1025 933 888 921 958 954 960 1017 1069 1044 957 863 776 692 655 711 826 917 958 988 1017 1008 965 959 1027 1111 1143 1141 1159 1171 1107 984 910 937 988 985 970
-319 970 1016 1083 1063 961 905 962 1043 1047 992 956 946 921 892 906 945 951 924 929 989 1043 1034 979 934 931 962 1003 1027 1025 1005 980 954 942 959 978 937 831 744
-323 744 746 796 810 787 781 791 789 799 873 972 991 911 828 806 816 830 868 919 923 875 846 860 850 788 750 786 821 788 749 794 887 930 915 898 881 829 785
-328 785 828 929 964 885 788 772 834 908 960 989 998 999 1010 1035 1044 1009 934 858 833 876 936 942 898 890 962 1054 1090 1081 1062 1013 923 869 936 1067 1124 1071 1011
-332A011LJ7k2l6jK8K1pm6p9n9J7P5N7J1KPk6o0k9L6M9Mk5j6j0j6j3KMOL3M9J6k8k4j1m6q0
-337H14k0Q7R5j4q3k3P3Q5M4K7K4ok7J3O6M5k8o4m3k5m0n0j9K4L6K3J1J3J8J4%j7k9m0n4n7
-341H73l2J7N4O0N6O0N0np3p5LO8K9p5j14m4M3M1k3m6oK6J5lQK5L6M9M4j3r4r9j4N6M2J2M3
-346I94P4J8o4n7K0L6l4p9l9K2M3L1Nm7r1o1K0O1K8lJ2K8RmJ8K8jk4qKj9l3j7rk0J2R1J02
-351A044j5j27r6J5L5m5p3J6J08R6K4rJ1J7j5n4n5rN2Q1N7kn2o7m7rJ0ql6k8J0K5lk2o%l2
-355G91m8J1Q6Q4K1rJ8L1lj9K8P0K6o8q8jR8R5%p1n4mLk4k9j8l9p8o1K0O6K5k5j3J2k5p6m8
-360F84M3R1O0J6J5L6L7Rl9p1m4L2P0J2p3p8k2Kj0K3J01J16M0k3jK9k0r6j04m0RMk4l9k5R
-364G29M7O1M6L3L0Om0o0k2L8O1L4j4n7p0k6N6J01O8Mk1rj8n7o7k2L4M4J0k1j7J3L9M8M9L6
$$ plain form
-332 1011 1014 1031 1009 973 972 1000 1021 1014 968 889 830 847 922 979 990 992 999 973 913 884 920 969 973 948 932 922 906 893 895 899 905 938 987 1003 975 951 940 894 814
-337 814 794 881 976 962 879 856 929 1014 1058 1085 1109 1103 1076 1089 1155 1200 1172 1108 1065 1040 1000 950 931 955 991 1014 1025 1038 1056 1070 1070 1053 1024 984 930 873
-341 873 841 858 912 972 1028 1088 1138 1133 1060 985 988 1056 1085 1010 896 852 895 936 913 867 861 887 902 899 907 932 968 1017 1061 1048 954 855 841 897 939 951 994
-346 994 1068 1086 1022 965 985 1021 987 908 869 891 934 965 970 923 832 771 791 852 880 877 889 917 926 922 940 968 967 943 935 937 918 885 868 859 839 851 942 1044
-351 1044 1029 902 806 821 856 811 738 754 862 958 982 973 984 1001 986 932 877 868 920 1001 1058 1056 1004 937 890 881 891 883 847 819 829 854 851 829 823 823 791
-355 791 743 754 840 924 945 936 954 985 982 963 991 1061 1087 1019 931 930 1028 1123 1123 1052 998 994 997 973 944 926 887 809 748 768 834 859 834 821 833 808 732 684
-360 684 727 818 878 894 909 945 982 991 952 881 837 869 939 951 878 800 778 780 770 793 894 1010 1050 1027 1026 1055 1035 939 835 795 804 808 784 745 720 729
-364 729 776 837 883 916 946 952 912 852 830 868 929 963 949 892 822 796 852 953 1021 1025 1004 995 977 920 853 831 865 909 919 898 881 894 933 981 1030 1066
-369A066nn7p2l3J9L0J9L3N8L9j9n8n1k7qJ8M3L1j2k6mJl1m3lL1Qk6j8Lj4l1J2P0N7j7n3k1
-373I09J8Qk5l7k1NL4M3J9oKL2L7Jm1o8q2o5lP2R7O9K9nm7q1o5pK2%j4K4O4L6k7m6pL6M3L1
-378I84K3J7J3K1K5Km5o4l2J1Nm6q0n6lJ5lj8pJ1RPK9O7Q2N8J5j7k4k2m0q8j21q5J1R0R6O0
-383I00M7N8M5j0o0o5k5J8L4J5k3n5n6k9J5N5P1M7jk9k5j5j8j3J8L9K1mjJ4mk6PP1P3po7l8
-387I77J8J1n0p2k2L8M5J3j3k5m3p1p6l7K5O2N3J9j1l1l6j5L6Q7J01P2K3k2m1k0K3L7J8QK4
-392A105J2n5r9n0L6M5j9m1J0M5J3j5J3L6rp4p0j6J4OJ0K2Rl3n7m5j4K4N7N8K0k1k4j7l9o7
-396G70m0K6N8M0K6N0O4K6l5n7k6J5L2L2L2L3K7J0OJ9J5l7j06j16n1J8L2K3L0L3Mj9J7O6M4
-400A061m1q4m0K6M1J3qJK2L0Ml6m2nJ4m1j01o6L9Q4L2j5J2M4J1m3l6J1L4L3L5J3n0q2j7P3
$$ plain form
-369 1066 1061 1004 932 899 918 948 967 1000 1058 1097 1078 1020 969 942 934 952 995 1026 1014 988 984 985 954 911 908 939 947 921 903 906 892 861 873 943 1000 983 930 909
-373 909 927 935 910 873 852 857 891 934 953 947 949 981 1018 1019 978 910 828 763 760 832 929 998 1027 1022 975 894 829 822 844 844 830 854 918 954 927 881 874 910 953 984
-378 984 1007 1024 1037 1058 1083 1085 1040 976 944 955 960 914 834 778 775 790 787 769 762 773 782 789 818 885 967 1025 1040 1023 999 977 937 849 728 643 654 744 840 900
-383 900 947 1005 1050 1040 980 915 890 908 942 957 934 879 823 794 809 864 935 982 981 952 927 912 894 881 899 938 959 955 954 968 964 938 945 1016 1089 1082 1015 977
-387 977 995 1006 956 884 862 900 945 958 945 920 877 806 730 693 718 780 833 852 841 810 774 759 795 882 983 1055 1078 1056 1015 995 1018 1055 1073 1081 1105
-392 1105 1117 1062 963 913 949 994 975 934 944 989 1002 987 1000 1036 1027 953 883 867 881 887 897 919 928 895 838 793 779 803 860 918 938 917 893 876 837 770
-396 770 730 756 814 854 880 930 994 1020 985 928 902 917 949 981 1013 1046 1073 1083 1089 1108 1123 1086 980 864 813 831 863 886 916 949 953 934 951 1017 1061
-400 1061 1020 936 896 922 963 976 968 969 991 1021 1025 989 947 942 956 915 814 748 787 871 903 888 900 944 955 912 876 887 921 954 989 1002 952 870 853 926
-405I26O5k5o3KO5L7k7l8NL5J9j8m3l4OL0J4j1J0N2L6l4o8l2Mj3j2O0J14M5r2j46r1m2n5m7
-409F34K9R3N9k5n4j0M0O0O3N6L0%oLj3n0o2k1L5N0Qn0n8RR5J08L3m5n2rJ3MQK5Om2n7j5L3
-414I25L7J8Pj0m9p2l9J9M2K4J3K9M0K6Nkj2l4m1j0L4M9K5mqJJj2j8rPJ6K0Qk6o0n1NM6L1
-419I71nON5O3J1m2l8nQMNKj0j1J7L4Nm1m5j1J2Kj4k1k6k6kL3M3K1ql0m5l4MK8Ll2j3M0N6
-424I64J5k0pK1L6N4P5N1k5q2p3m2m9p3m9PK3j5n0l3J5M9L9pm8l5L8J01Q6J8k7j3J9J6j8o0
-428I01q9q6l7M1R5Q6K8k8l9j0J4J7J7L6M8J7l3m2lK4J0JK7M5J6rJ3K3m0j02n7M1L8o7j08
-432G88j0Q4N0j5K5J13Q8m1j12n7Opl6lM6K9m3r1p5j0O7J07O5l0o9KR4Q1j6p1k4M3N0K4J8
-437A070K4j5r1j26p0L5R6O5k4p9n7jJ6j1k7jL3L5J5LRK5M4N6M1Jk8k1mj3m5n9l1K4P4Q1K6
$$ plain form
-405 926 991 966 903 905 970 1007 980 942 947 982 1001 983 940 906 912 942 956 945 955 1007 1043 1009 941 909 913 900 888 948 1062 1107 1015 869 778 736 681 634
-409 634 663 756 815 790 736 726 766 826 889 945 975 975 969 972 959 909 847 826 861 911 919 869 811 820 915 1023 1056 1011 959 950 963 967 975 1000 1006 964 907 892 925
-414 925 962 980 987 977 928 856 817 836 878 902 915 944 984 1010 1015 1013 1001 967 926 916 950 999 1024 1020 1012 1013 1014 1002 984 975 982 998 1018 1026 1000 940 889 894 940 971
-419 971 966 972 1027 1090 1101 1059 1021 1016 1024 1028 1033 1035 1025 1014 1031 1065 1070 1029 984 973 985 987 973 952 926 900 898 931 974 995 987 957 912 878 882 910 913 881 868 908 964
-424 964 979 959 952 973 1009 1063 1138 1189 1164 1082 1009 967 918 845 796 803 826 811 761 728 743 792 831 824 776 741 779 880 966 984 957 944 963 979 961 901
-428 901 812 726 689 730 825 911 939 911 872 862 876 893 910 946 994 1011 978 936 933 957 967 968 995 1040 1056 1047 1060 1083 1043 941 884 925 963 896 788
-432 788 778 862 912 897 922 1035 1123 1082 970 913 919 912 876 873 919 948 905 814 739 729 796 903 968 938 869 871 965 1046 1030 959 935 978 1028 1052 1070
-437 1070 1094 1079 988 862 792 827 923 988 964 885 828 827 843 832 805 804 837 872 887 890 899 924 968 1024 1065 1066 1038 1017 1013 1000 955 896 865 889 963 1044 1070
-441A070m5n1J3M9j4j08j10j9N7O3N1O1M8j6p0n3QM3L1Lk0k8j1J5Qm0p2m5PK1JJL6O0M5Pj7
-446I79j2lj6m8n2MP6P6lo3m7j9l2m2J4Q4P6J6jK3Qn0n6J0M2j7q3n9PJ8k3l5J0N5O3N1M9L8
-450A038%m0n2l3k1l3l9LO7Q3K2m7m7KK8J7J3K6J7j9l3j7jkNJ9Ll5l0J9K9k4n3NQ1P2mn1l6
-455I32jK8M1K0m2q0l8L8M7j6o5n7k8pK4O3O2J2k5mK4%n8p8l1L4N9L5P%%j1j0L5R0P6j0o8
-460I98l1L5L8qk8j3j7m3m0mJ2KNJ4j3n5l3N1Q9L2l5l0Kj4n0l3K3L3j5n2k3M6J04J05L6o0
-464A028r4l6L6L6rk0Orp1q7pQ4Q7J7k6qK5K3jk1l4l8j9K0M1J5l3n4l4KK8M3M9M5M1M8L9k3
-469A089j07j22l7N6O3J1j4%MpRM6M2rl6j6nl2m6rL2L8L6M6K5m2q0l4K9J9k6k4Jl0q7o4L8
-473G57Q9K7m6k8M7Q2N5Ql5o2n1jM3L3j2l2nM4P2N8J2l0l1RL7J8k2l6j0J9Rl5o6m0J7L6pm5
$$ plain form
-441 1070 1025 974 987 1036 1022 914 804 785 842 905 956 1017 1065 1049 979 926 934 977 1008 1011 991 963 952 967 975 935 863 818 825 846 847 848 884 944 989 996 979
-446 979 967 964 948 900 848 852 928 1004 1001 938 891 872 840 798 812 896 972 988 987 1010 1018 968 912 922 964 947 864 805 812 830 807 772 782 837 900 951 1000 1038
-450 1038 1038 998 946 913 892 859 820 823 890 973 995 948 901 903 931 948 961 987 1004 985 952 935 934 932 937 956 959 924 894 913 942 918 865 870 951 1023 1019 968 932
-455 932 931 959 1000 1020 978 898 860 898 945 929 864 807 779 772 796 859 921 933 908 904 928 928 870 792 761 795 854 889 896 896 896 885 875 910 1000 1076 1066 998
-460 998 967 1002 1040 1032 1004 991 974 931 891 887 899 901 906 920 907 852 819 870 959 991 956 926 928 914 864 831 854 887 872 820 797 843 947 1052 1088 1028
-464 1028 934 898 934 970 961 941 947 938 867 780 773 857 944 961 935 927 952 975 974 953 919 881 862 882 923 938 905 851 817 819 847 890 939 984 1025 1073 1112 1089
-469 1089 982 860 823 879 942 953 939 939 943 936 945 991 1033 1024 988 972 967 935 889 880 912 950 986 1032 1057 1015 935 901 930 949 923 899 900 870 783 719 757
-473 757 846 873 827 799 846 928 983 991 956 894 843 842 885 918 906 874 869 913 985 1043 1055 1025 994 1003 1040 1058 1036 1000 990 1009 1018 983 917 877 894 930 923 878
-478H78k2K5L7K3L3M4Ko7o8KL3j9p1n1j1j3k7J2P2P4K0l1n4n7k2N3J12R2K3j1pj3l4j6L1K8
-482A000l5p6m2J4K5OOJ9Ok0j6K1M5K0l0n5l7jJ2knK1N0N2L4K6Qm3q8n7L2O2qp8l3P9J06P
-487A025r8r1jN6L4rj7rj7k3OM7L4m1r0m4N3R4N3nk3k1l0l6j2J4oo5r4m2M8R2N4qk6ojj4J
-492G82M1M0j3l1M6J17O1o4q9PO7No6k5O7P9Pm4l4oQK3L2J0k6l7k4k8l3QP9R8L5m6o5l0J3
-496I64L5L1J0j3k0j3rj1pmk0m5n8m5j0L4O7N1pm1j0M1M7L3N1O8Lj03j06J6J12O9l2m7PJ8
-501A056k8m2jK1j5m9l2ok8p6r0m8J8O1N9K8QJ8L2K4J4K9N1L2j8m3k0Jj2l4k5jJ0RPmk5k7
-505H54J3N0M0nk4NM1M9L4Qk3m8l8MK6on8o4LQ5J14O6j5n7l3J2J1m8r0o3nJ1j0nM4O5J9k4
-510I38jL9J0o8r5m0J7J8PK8M6J8l0l7jL3M9N2L3j6n5l8J2L1Kl0l7k3NM3N8J9m0n0kK9Jk9
$$ plain form
-478 878 856 881 918 941 974 1018 1020 953 885 887 920 901 830 779 768 755 728 740 812 886 906 875 821 764 742 795 907 999 1022 1011 1004 991 957 941 972 1000
-482 1000 965 889 847 861 886 892 898 917 923 903 887 908 953 973 943 888 851 850 862 860 855 876 926 978 1012 1038 1046 1003 915 858 890 952 944 866 833 912 1018 1025
-487 1025 927 836 835 891 925 916 899 890 873 850 856 903 937 896 806 762 815 909 962 957 934 913 883 847 835 849 843 778 684 642 690 782 836 828 802 796 795 781 782
-492 782 823 863 850 819 865 982 1043 979 890 897 964 969 903 878 945 1024 1031 987 953 947 955 978 1010 1020 994 957 933 905 872 880 959 1057 1092 1046 981 951 964
-496 964 999 1030 1040 1027 1007 994 985 974 967 963 943 898 840 795 785 819 886 937 930 889 879 920 967 1000 1051 1119 1122 1019 913 929 1041 1110 1078 1031 1038 1056
-501 1056 1028 986 985 1006 991 942 910 904 876 800 710 662 680 741 800 828 836 854 886 910 924 953 1004 1036 1018 975 955 956 944 910 885 884 894 903 910 906 881 854
-505 854 867 917 957 952 928 933 974 1023 1057 1065 1042 994 956 960 986 980 922 858 861 946 1060 1126 1111 1054 1021 1033 1044 996 906 843 838 849 839 834 878 943 962 938
-510 938 937 976 986 918 823 783 800 818 825 853 899 917 887 850 849 882 931 983 1016 1000 945 907 919 950 952 922 885 862 867 910 968 987 947 897 895 924 925 896
-515H96oM0M4Ll0k8j0nj5k9m2l8j4J2K0Pj8l9l8pL2M8L7L8O3P2L7j9m9n5n3l7JL2J8k1k6Q
-519H29L0J8NRqo5j08p5J2P6P4L1j1l1k4%J2j4n8o9l1J4K2J2J6L3L3J6J8M4N5K1l6o4m2J6
-524G60P4R1M8k0m5j4J1j5n2l1L1O1L7ll4p1j02p7QP2O6L0K3L3K1kNK5J8qpJ1qn8o6OQ9Q8
-528I95Pp1p6k6K3L2J7J3K2J2k4m4k0J5J4j3j8NJ7Q%Mmk6k0J7M6L2JqNK9N6O3J9n5q3l5J5
-533I44jm1k3M6P8L5k7m9m9n1m3rK4K3mk5k2MM9Q5P2Ko8p7l7j9m3n2MP6Q3J8l4pN3O0Nl2m
-538I44L7K1l8o6k9K7M2J9mk0l9n5l4K3O5M5j4m2j1L9N4L0J4J8J8j7o6r5q5m7LM8O4L6j9n9
-542H07n8k4K0N2O1N3L4%m7p7m9J9M7j0p3m0O9J28O0n5r9o2k0j2j1J9O6R8R1L8l9q1n1OJ8
-547H78j9k9RK8l0j04r5j0N9O1M1M1L5j3p6q1j1P2R1K8n4p9l1L6O6N7M0K3j0l7k5K2M5J3m0
$$ plain form
-515 896 890 930 974 977 947 919 909 904 889 860 818 780 766 778 798 805 787 748 710 703 735 783 820 858 921 993 1030 1011 962 907 854 817 818 850 868 847 821 829
-519 829 859 877 882 891 883 818 710 635 647 723 797 828 817 786 762 762 774 760 702 633 602 616 638 650 666 699 732 748 766 810 865 886 850 786 744 760
-524 760 834 925 973 953 908 894 905 890 838 807 838 899 936 933 899 828 726 649 657 729 795 825 848 881 902 900 905 930 948 940 933 944 936 878 812 818 907 995
-528 995 1002 931 855 829 852 884 901 914 936 948 924 880 860 875 889 876 858 863 880 888 888 892 888 862 842 859 905 937 938 930 935 964 1020 1083 1102 1047 964 929 944
-533 944 943 902 879 925 1003 1038 1011 962 913 862 819 810 834 857 853 828 806 810 859 944 1016 1018 950 873 836 817 774 722 726 802 885 903 869 862 915 975 980 948 944
-538 944 981 1002 964 898 869 896 938 957 953 933 894 839 805 828 893 938 924 882 871 910 964 994 1008 1026 1044 1027 961 866 781 734 737 785 849 885 866 807
-542 807 749 725 745 797 858 911 945 945 898 821 772 791 838 828 755 715 784 912 972 917 818 756 736 724 713 732 798 896 987 1025 986 905 854 860 878
-547 878 859 830 839 867 837 733 638 628 687 748 789 830 865 852 776 695 684 756 847 875 821 742 711 747 813 870 910 933 923 886 861 883 928 941 901
-551I01o6o0m4k0MJ1OJ9N5O2J6k4J0O9N5k4n3J6P2J9q6j06j9P1P9L2rk8l2j4K1K5k6q0o5j
-555G86K2k3m9mN1L1k0MR4J18K6o7l8N8Q6K5l5m2l4l3j6J7Qn2j01q8l3J7M6M4J0k0KN1L8n0
-560H29j02l5Q4J26O8j3n7o3m0OM0L1QKjk6n0l1Mjk6kO2P8J9m1l9JJ8J7K5L4K4Jj5j6j3j2
-564H94k2l5k9J1N5N4J7j1j5l3o2n5%M7M4K9L1K2j6l4OM8K0m8o4j8J1j0k5NK1j7n3nJ01J39
-569A003N3o5r1k4L1On6p5m6k4k2nL6O2M3J3LMqj1J4M4L1j4m5l7j2LRPJOK3K9Kl5k9J9M5P
-574H95m8m0L6R7O2l8j11r7k8K7M7M6L7J7lj6l7o7o3J2J06J07J2o1k3O1P1Mm6m1k2j3RM5M8
-578I85J3j6j2j5m2n1MP6Q5K3l7l7QL3Pl9n1k2PRkPK4J0l1m7j6K8L9J8j0k5l0l2l4l1j2K2
-583H06L4Jm3m6oK4K2K1K5%m5l9M9J19O7o9j41r1JM1L0K0L1N2O6N4Mo0p8k6M7P4M4Mk1l7m8
$$ plain form
-551 901 835 775 731 711 715 726 732 751 806 868 884 860 870 939 994 970 917 933 1005 1024 938 832 813 884 963 995 986 958 926 912 933 958 932 852 787 786
-555 786 808 785 736 732 783 814 794 798 892 1010 1036 969 931 989 1075 1100 1065 1023 989 956 940 957 965 913 812 724 691 708 754 798 808 788 790 841 879 829
-560 829 727 692 776 902 970 957 900 837 797 803 843 874 882 884 883 857 807 776 780 779 753 751 813 891 910 869 830 831 849 866 891 925 949 950 935 919 906 894
-564 894 872 837 808 819 874 928 945 934 919 886 824 769 769 816 860 889 920 942 926 892 898 946 966 918 854 836 847 837 812 817 838 821 768 763 864 1003
-569 1003 1056 991 900 876 907 913 857 782 736 712 690 685 721 783 826 839 842 846 838 827 841 885 916 902 857 820 808 811 820 827 828 834 857 886 888 853 824 843 888 895
-574 895 847 807 843 940 1002 964 853 756 728 755 802 848 885 902 899 883 846 779 716 728 834 941 953 892 869 930 1001 1005 959 918 896 883 892 937 985
-578 985 998 982 970 955 913 862 866 942 1027 1050 1013 976 984 1017 1024 985 934 912 919 928 926 933 957 967 936 889 873 901 940 958 948 923 893 861 827 796 784 806
-583 806 840 841 798 752 746 770 792 813 838 838 793 754 803 922 989 920 779 688 689 730 760 780 811 863 929 983 987 927 849 823 870 944 988 992 971 934 886
-587H86m1j9j7m9p3m3J9N7N6N7P5O5lq0r3m1RK2K8N3O3K5j6jN1O5J0m9n5l7n9j08j07k6O2
-591F86P3L3J9M9N8Qm4l0K4N1M3M3N6L6j9n0l2j3k8l4OM1J5l5l6MJ6oJM8M8m0j23r7%M4Pk2
-596H00J5O2M5rk4K0O4O4K7k8p3p5j1P4R1J3q3r7l6K5L3Ok6m8m8j7K0K2j7m9l5K0P1P9L0m4
-600H61q0m0K8M1ol3MM8K1n1p6l0K1J9oON3P8M4j8m6k5OJ4K2N7R7Q3Oo2o5j8K6L1Ml5m7j3
-605I19L8L7k1o2k9L1M5J2k1m4p4r0n5PL5J7%PJ3J2K3L8K8MNK6K0nkK7J2n2p5j1M5Op9r7m9
-610F41j9k5qM8Q0N4J9K9N7N2J2j6j6pj8m7o2m1%J7KKM7R9R4K9l0n1m9m1j7J4K6RnQJ2k4p0
-615H05p0k2J7J5jJ8O3P9K6m8o7mO8P1Po4r2p7l0K7N2J7l8l8K5N8Qo1n5J6O0M4K1L6N5L0l0
-619I21p3n6J5R3J13O2pm1m2m8n4l1Kj0n7o6j0L6Jo8q0k3M3P5P5M4Jj4K3O1L7k3l7RN1N8N3
$$ plain form
-587 886 845 826 809 760 687 644 663 720 776 833 908 973 970 890 797 756 765 787 815 868 931 956 940 939 990 1055 1065 1016 961 924 865 757 650 624 686
-591 686 759 792 811 860 918 926 882 852 876 927 970 1013 1069 1105 1086 1036 1004 991 963 929 935 976 991 956 920 924 940 934 935 983 1031 991 868 771 771 815 822 800
-596 800 815 877 922 913 889 909 973 1037 1064 1036 963 888 877 951 1042 1055 972 875 839 864 897 903 877 829 781 764 784 806 789 740 705 725 796 875 905 861
-600 861 781 741 769 810 804 771 775 823 844 793 717 687 708 727 721 727 780 858 902 884 838 813 819 833 855 912 1009 1092 1098 1036 971 953 979 1010 1014 979 932 919
-605 919 957 994 973 911 882 913 958 970 949 905 831 741 686 693 728 745 745 752 765 777 800 838 866 870 875 901 921 916 914 941 953 901 826 815 860 866 787 690 641
-610 641 622 597 589 637 717 771 790 819 876 928 940 924 908 901 883 836 774 733 733 750 752 754 801 900 994 1023 993 942 893 852 835 849 875 884 879 887 899 875 805
-615 805 735 713 730 745 744 762 825 904 930 882 815 811 879 950 957 893 801 724 694 721 773 790 752 714 739 797 805 744 689 705 765 809 830 866 921 951 921
-619 921 848 792 807 900 1013 1075 1068 1027 985 937 883 852 854 844 787 721 711 747 748 680 600 577 620 695 770 814 815 801 824 885 922 899 862 871 922 980 1033
-624A033M5%p6j09o7qJ2J5K1Mn0p5k0N1M7rj6L9O0Om5j2O5R7N3k0q1j12j01n3OM7O3O6N0J3
-628I39k4k8JK1on7p1k0M8N9J6k1j9nnmJ1J9J2K5O3O6Mn4l0L1K1n9q8j4O8O2kl7j9QJ5ll7
-633H86o6n6qL0K8RRK0J9Mk2n4o6l2J8K6lrK4L4nk0L4Q4M2n1r0m8ljj7j7nJ4L1L4J2pLJ9J2
-638H12%J7M9M8J3j8l2m3l4J4O4N0j8o5n2j6JMJ3K1K4K3J9J1J0Rj0m6m6J8P7N0k9o6m2l6p2
-642G22p8j9M1L8Mj8k8l7j0O0J11Q2Nn1n7m2rM0Q2P4K9qrLml1m4j2L8K8n0r9l6P2Q6%n7j3
-647H03M4K5k4k3PQj1mJ6Rj1NM3N1K2j2m2o3m6QM4J7j6ON1N2J6%pm6q7n9J3M9L4L4N4L6rn
-652I82M2K4q7j57r4K4P3N1L1J7k4m8LR1J06L1m3n5l9m0l9rL5M8L1R%NJ9K8J3k5n4m5j2Mj4
-656H82l2k2rk9o0m0M3J11R7K2m9r0j01p5mO4P5M6K7K7Jl5k8K2L8pm8k9RMk2rL4N3L6J8J8
$$ plain form
-624 1033 1078 1078 1002 893 826 818 830 845 866 870 820 745 725 776 823 814 798 837 897 903 858 846 911 1008 1061 1041 960 848 747 694 700 747 810 876 926 939
-628 939 915 887 888 909 903 846 775 755 803 862 878 857 838 833 828 824 835 854 866 891 954 1020 1024 970 940 971 992 933 845 831 899 961 959 922 903 911 926 923 886
-633 886 820 764 756 786 814 823 832 852 871 875 853 799 733 701 719 745 742 733 757 791 786 766 800 884 926 875 785 737 734 733 716 699 694 708 739 773 785 778 781 800 812
-638 812 812 829 878 926 939 921 889 846 812 826 890 940 922 857 805 789 790 794 807 828 852 875 894 905 915 924 914 868 822 840 917 967 938 872 830 794 722
-642 722 644 625 666 704 708 690 662 625 615 675 786 868 873 822 765 723 714 754 836 910 939 931 922 925 921 890 846 834 872 900 850 751 715 787 873 873 816 803
-647 803 847 872 848 825 832 840 829 825 841 850 839 844 887 938 960 948 906 843 797 805 849 866 850 856 907 959 975 975 968 922 835 776 789 838 872 906 960 996 987 982
-652 982 1024 1048 961 804 710 734 807 858 889 906 882 834 837 928 1034 1065 1022 967 928 888 849 840 875 923 954 963 963 968 987 1015 1028 1003 949 904 892 896 882
-656 882 850 828 819 790 730 690 733 844 941 963 914 824 723 648 644 708 783 829 856 883 884 849 821 843 881 874 826 797 806 810 788 779 813 866 902 920 938
-661I38J7Oj6m2n9m8j7LNK7P2P3kq0p3j5po5r0l0M5N5K1RL7O1N2K9K1K7K4ll6m0lL3K7pk7
-666I22k3k7m7m8j8Mrl1j9J6K9J1RM3P0L7m0q0l6L6O2L6K2M7N4Rm5m6j5k0o0o1MN8J9p1r2
-670G00oR2Q9lo5k9M0M7ol1nRk5m4RP6P3J0k0MK0j7o3p2m4KN0O8K8l9n4PO9O7K2j2k5k7nM4
-675I34P1M5Lj1k0n2p2l8J8K2j8k7RK9km1m1j0J7L0K1knL7Q3N7l5r7o9j1O%K5O8O6%p1r5o8
-680G56oN8Q0M3oj3J0Jn6j03q4qO2Q1M8kk7k2k4l9j8N6J07M6p9j28n0N2P4M4L6L7Lm3m1lJ4
-684H56KQL9M1%l3k5LJ8J9J7P%J2L0J8j5k2J1L7L1J6J6Jm7q2o8l5k3j8J8N1L0k7m7j0J9jk9
-689H18j9J8L5K4J2J1nm3p3n0J7P2P0L2OKj7n2n8k3J2J1%Ojl7n0QP9O3j1l9RM0Nk6%K0k7q0
-694G59m3N8J09O0k1n6m2lM0O2L4k9p0n0oOj4j4K7P0N4j2n5k9K6L7lk6%K4lm6l6L7J00Q7N
$$ plain form
-661 938 955 961 945 903 844 796 779 782 787 814 886 959 957 877 804 789 782 717 627 597 642 697 718 727 764 825 877 906 927 954 978 975 939 899 896 929 956 949 922
-666 922 899 872 825 777 759 763 754 723 704 720 749 760 769 812 882 919 879 799 763 799 861 897 919 966 1020 1029 984 938 923 903 843 782 786 844 863 792 700
-670 700 694 786 875 872 807 778 818 865 859 828 823 832 807 763 772 848 921 931 911 915 935 918 855 783 739 741 791 859 887 848 794 801 870 937 959 947 922 895 890 934
-675 934 1005 1050 1053 1042 1022 970 898 860 878 900 882 855 864 893 891 850 809 799 816 846 867 865 860 897 980 1037 1002 905 836 825 831 831 856 924 990 990 919 824 756
-680 756 750 808 888 931 925 912 922 923 867 764 680 672 734 815 863 861 834 812 788 749 731 787 894 940 861 733 683 735 809 853 889 926 929 886 845 842 856
-684 856 858 866 905 946 946 913 888 891 909 928 945 952 952 964 994 1012 997 975 986 1023 1054 1070 1086 1087 1040 958 890 855 832 814 832 883 913 886 839 829 848 847 818
-689 818 799 817 852 876 888 899 894 851 778 728 745 817 887 919 925 927 910 858 800 777 789 800 800 806 805 768 718 726 805 868 857 818 827 867 872 846 846 866 839 759
-694 759 716 774 883 943 922 866 824 821 861 923 957 928 858 808 802 808 794 780 807 877 931 919 864 835 861 898 895 869 869 893 890 844 808 845 945 1032 1037
-699A037p4p8j3M3K6l8n4QO6N4lk1KJ2j0k3rJj3k4k4k5k7pJ9Mm6n0L0J12Q9k4j05q1nL4J1
-703G94l0m4k2J7M4L6%l2k5J2M2M5L2K1QopJ7L5J1l7m7pK6J6qpol6n7j0O0O4%l0J7O4M6J2
-708A008K9O6M9qk9j1j7n7o4j7J9j6p2p1j3L0K2olL9Q0O6qq3q9j9N9P1J2o5j03o9K0R1Q0N
-712I26m5j8K7Lr1j56j22j0R2J21Q0K1j0lJ2J2NJ2K7L1J8Mj0k4l8m4l9k0J3M6L7rl0K1R2Q4
-717A015op5n3RK1k4o4o4l4ML1K8OOL8N2J1k8JO2N3l7j09r4k7J9K8J9ol5l2PK7j0m4lQ3J02
-721H77J5r1j11m5K8M7K7J2K4N7Q1P1J9n5j06r7k8M7O9M2J7J7Rk6n5m1j1ljL6Q0O6po6o8n7
-726G73o9p1j6N6P3K9oNL2K9ll0k9PO1R3O7ro8n9lM1M1J4k0o4j04r6k6O2R6N9Lk3j0K5O3Q0
-730A003N9K1pj5k7m8m7j6J3J6J4L0K2l9r9p4K3P7L1m6n9j0K4Km7p5n1J1O9P4L0p%J6qm6m5
$$ plain form
-699 1037 963 885 872 915 941 903 849 857 923 977 974 953 955 967 957 934 925 926 913 889 865 840 813 806 825 829 783 733 763 875 964 940 835 754 749 783 794
-703 794 764 720 698 715 759 795 795 763 738 750 792 837 869 890 898 892 885 902 937 948 911 864 857 883 899 891 884 878 842 785 775 835 899 899 869 886 950 996 1008
-708 1008 1037 1103 1152 1144 1115 1104 1087 1030 966 949 968 952 880 809 796 826 848 842 839 878 958 1024 1016 933 844 825 884 955 967 902 799 730 750 841 921 926
-712 926 881 863 890 893 802 646 524 514 606 727 807 828 818 815 827 839 844 856 883 914 932 936 926 902 864 820 781 761 774 820 857 848 818 839 931 1015
-717 1015 1009 934 881 890 911 887 823 759 725 729 760 788 794 800 838 890 901 873 874 936 989 952 843 749 722 741 769 788 782 747 715 722 749 739 695 692 775 877
-721 877 892 801 690 645 673 720 747 759 783 840 921 992 1011 956 850 753 725 772 841 883 900 917 926 900 845 804 793 790 789 825 905 971 964 898 830 773
-726 773 704 633 617 673 746 775 769 774 806 835 832 802 773 780 841 934 1001 992 924 865 862 903 944 958 938 874 770 674 648 710 806 865 868 845 835 860 923 1003
-730 1003 1062 1083 1076 1061 1034 986 939 923 936 952 966 996 1018 979 880 806 829 906 937 891 832 822 846 848 801 726 675 686 755 829 859 852 852 868 860 814 769
-735G69LN5Q4R6Q8M0l2p9q0n7l4jL4L2j5n0k7J5Ln7q7l2O4J09O9j8p8o4MO4O8L4Pkj6l6l5
-739H38jK7K1nj9j9j8k2j7KJ7K6K9K9K8L0K6Nl2n7n3l3j3J4M8M8Ll8k6J1Rj8JN8O4j2p5m4
-744H32K9M0ol1j0RKLL3O4N1qo1n9PO6L8n1q6mR4Q0l1j13r9m0KJ9J8kk1lL1L5J7K2L8On5n7
-749G99RM2om6kO0M4j3j9K5L3k8q8r9o1MP0R2M7j9m2l0l2l7jO2Q7N2J1mk0n9q7o7pM6O0M2
-754H18L1N0P5N0l1q6m1O0J02M7l9p7n9k1QK2K4J9Mk2k9J7P8O8k3q3l5M3M5j1k3O%m3m5nj
-758H93l4k4L0L2n0j06p1j4MJ3M1K9n1j07o0K7O2O4P7O4qo5k7M2L8k1l0J0J9oJM2M1jj7jj0
-763H26m4k4M7P8L2j3mJ4j2m9m8rM3Q4P8Oo8o1KPo1q6qP0M7k1k7K1L3Jj5MJ4%rpj6l7m1k5
-768G22qJkj4j9K7J12J52R1j8o9m8j9k3k9rK0K4pm7n3kN9N4j9o4j5N9N8%k4rj4m7m9j0J0N
$$ plain form
-735 769 772 827 911 1007 1095 1135 1103 1024 944 887 853 852 886 918 903 853 826 841 844 787 700 668 732 841 910 892 814 750 754 818 886 920 927 925 909 873 838
-739 838 837 864 885 880 861 842 824 802 785 787 804 830 859 888 916 946 972 977 945 888 835 802 789 803 851 899 902 864 838 849 858 840 841 899 963 951 876 832
-744 832 861 901 895 864 854 863 865 868 901 965 1016 1008 947 888 895 961 999 948 862 858 952 1032 1001 888 789 749 751 770 788 786 765 762 793 828 845 867 905 911 856 799
-749 799 808 850 844 798 796 856 900 887 868 893 926 898 810 711 650 654 724 816 863 844 802 772 740 703 702 764 851 903 914 910 890 831 744 677 670 716 776 818
-754 818 849 899 974 1024 993 907 866 926 1028 1075 1036 959 900 879 887 909 933 952 956 934 905 922 1000 1068 1045 962 927 970 1015 1004 981 987 987 944 899 894 893
-758 893 859 835 865 897 847 741 670 656 660 673 714 743 692 585 525 552 614 678 755 819 811 746 719 761 799 778 748 758 777 771 772 814 855 854 837 836 826
-763 826 782 758 805 883 915 902 898 912 900 851 803 794 837 921 999 1005 937 876 878 885 824 738 730 800 847 826 799 820 853 854 839 843 857 857 848 841 825 788 747 722
-768 722 714 715 713 699 680 707 819 971 1062 1044 975 927 908 885 856 847 867 891 884 837 784 782 841 895 876 812 797 856 914 914 890 881 867 820 771 761 771 776
-772G76L1Q6Q9J6m5l9j8m6p2k3N2N8nm5j4L4N1M2K5jk9l7k5j7j2J5O2P2J2n7n2K7Q8N0m7j07
-777H95q6l6qPK8K6k5p0k5O8Q0k6j21q4L1Q8N8K1K4L0J8OMj1l4l8j5jrk1l0m6n0oO0P8L2j6
-781G96k6k7l4rO2R8N3j8k6Kjl1k0L1M2j3p0o6j0N2R7J05N5l1q6p1k3NNorkL0P4R4O5Om5o5
-786I83n3k7j5l2n6m2J2N4M2ol4j7K4M6L8J3J0K7K9j1m9l0K5M0jl0qK2Pk3j6J5J3k3m3k5n
$$ plain form
-772 776 807 893 982 998 953 914 896 850 778 755 807 865 860 815 801 835 886 928 953 952 923 886 861 844 832 847 909 981 993 936 884 911 999 1049 1002 895
-777 895 809 773 765 772 800 826 801 731 706 774 854 828 707 623 654 742 800 821 845 875 893 899 903 892 858 820 805 804 795 774 744 698 648 642 702 780 812 796
-781 796 770 743 709 700 762 860 913 895 869 871 870 839 819 850 892 879 809 743 733 785 882 987 1042 1011 925 854 831 836 841 835 826 824 854 928 1022 1087 1093 1048 983
-786 983 930 903 888 856 800 758 770 824 866 860 826 809 833 879 917 930 940 967 996 985 936 906 931 971 970 940 932 954 961 938 922 937 950 927 884 859 854
$$ [...]
##$OBSERVED INTEGRALS=	(X Y Z)
(6.8725437461868068567, 6.988445271274627224, 0.97692844884441054631)
(3.8249313037541234905, 3.869926366027324427, 1.030064904828951633)
(2.5440253445502634122, 2.639311797774723356, 0.72985130522966290556)
(1.8675254916517149972, 1.9330475000757132431, 0.97163148809851707099)
(1.7192490507805537892, 1.8482822465755865959, 0.74934413815423683847)
(1.3893989448127108677, 1.4851589679316237191, 0.8376779540522265588)
(1.3090179115357982731, 1.3893989448127108677, 2.1147224940407363114)
(1.2639036638117764344, 1.3090179115357982731, 5.3619495890731512233)
(0.86683206528418854653, 0.94565533760556652609, 1.2278296776781074673)
(7.2112893232337418326, 7.3360823928016483109, 0.21122810337307607043)
(6.3207906292800668524, 6.4810187679845334685, 0.3531764691729816219)
(6.1405339732375372463, 6.2915181808629032645, 0.30373172034549500431)
##END=	
##TITLE=	Mar13-2020.320.fid
##JCAMP-DX=	6.0	$$ MestReNova 14.1.0-24037
##BLOCK_ID=	7
##DATA TYPE=	NMR PEAK TABLE
##DATA CLASS=	PEAK TABLE
##CROSS REFERENCE=	NMR SPECTRUM: BLOCK_ID=6                                     
##.OBSERVE FREQUENCY=	400.05240029999998796
##.OBSERVE NUCLEUS=	^1H
##NPOINTS=	236
##FIRSTX=	0.73166775186444632517
##LASTX=	9.9730233947120634497
##XFACTOR=	1
##YFACTOR=	1
##FIRSTY=	9.228149869982214426
##XUNITS=	PPM
##YUNITS=	ARBITRARY UNITS
##PEAK TABLE=	(XYW..XYW)
0.73166775186444632517,9.228149869982214426,0.0044693694808749387729
0.74939467026313111297,21.154832721599849066,0.0030563130523541121031
0.76682797604817898307,7.0606207201362609638,0.0038036693825243502766
0.88932959642078912577,1355.321294722373068,0.0043848919792367968204
0.90688285306418436882,3549.9066385469923262,0.0030252782762403879376
0.92315780646896594686,1182.9667870310117905,0.005849443344390281227
0.97449283759025262519,6.7227537226623264033,0.0027561328642209939263
0.98387848354680629281,4.0114400511457919407,0.0022183484967585624312
1.0006865613255544467,5.6853494433133482389,0.0018046069142398323253
1.0171400150359803938,3.8783110045114295161,0.0028402872846236852308
1.0524445380709648301,44.603401477445522971,0.005562267141185103618
1.0605330457707184966,12.606573716079701342,0.0024150505323582162863
1.0679432813432290228,53.558495048668042671,0.0070315402360484283856
1.133323730514102845,17.499662710013112132,0.047433246425612973773
1.238041255581858513,16.149828268428940703,0.0046044959720187737459
1.2434767833911970492,18.420532048923327295,0.002082345949074237805
1.254769867484015311,15.434959272128210728,0.004125593142117000775
1.259770800029094806,42.850124927093546034,0.0048571470110973825884
1.2864011949483771247,13339.102022812005089,0.0078970150049101073275
1.2972680337404727258,1957.5468601967145332,0.016938348896333842858
1.3094830365509881887,702.95214695776144254,0.010385590691225068602
1.3148200849973064042,132.45230849538842222,0.0044287555679487292104
1.3276156259121691949,1077.0638045194875758,0.029186425324022800126
$$ [...]
Impurity,Artifact|Weak,,1,0.72476203829654717303,0,0
Impurity,Artifact|Weak,,1,0.25289615571649293191,0,0
Compound,Artifact|Impurity|Weak|13C Sat.,,1,0.40000000000000007772,0,0
Impurity,Artifact|Weak,,1,0.13497471598622801103,0,0
Impurity,Artifact|Weak,,1,-1,0,0
Compound,Artifact|Impurity|Weak|13C Sat.,,1,0.20991313938468725286,0,0
Impurity,Artifact|Weak,,1,0.19356612074516693633,0,0
Compound,Artifact|Impurity|Weak|13C Sat.,,1,0.025436816561693248451,0,0
Impurity,Artifact|Weak,,1,-0.33319345790237336891,0,0
Impurity,Artifact|Weak,,1,-1,0,0
Impurity,Artifact|Weak,,1,0.28756907624214095298,0,0
Impurity,Artifact|Weak,,1,1.0103525990251347455,0,0
Impurity,Artifact|Weak,,1,1.8715511103734669973,0,0
Artifact,Artifact|Weak,,1,-0.2000000000000000111,0,0
Artifact,Artifact|Weak,,1,0.12298857764492679423,0,0
Impurity,Artifact|Weak,,1,0.92575847606224415109,0,0
Impurity,Artifact|Weak,,1,0.50189903353992382229,0,0
Compound,None,,1,0.087589726501609066478,0,0
Compound,None,,1,0.52336685614314704118,0,0
Impurity,None,,1,0.70836575416633262847,0,0
Compound,None,,1,0.16480648081916624004,0,0
Compound,None,,1,0.2295936301315265049,0,0
Impurity,Artifact|Weak,,1,-0.053620518947228364148,0,0
Compound,None,,1,0.5458777898465578815,0,0
Compound,None,,1,0.12043457189676598507,0,0
Artifact,Artifact|Weak,,1,-0.60478813738416370427,0,0
Compound,None,,1,0.49881557037759272077,0,0
Impurity,None,,1,1.7005069927220570758,0,0
Impurity,None,,1,0.62471698378809759067,0,0
Impurity,Artifact|Weak,,1,0.16046631392936810956,0,0
Impurity,Artifact|Weak,,1,0.15517673529444869773,0,0
Impurity,None,,1,0.71459892701806926318,0,0
Solvent,Artifact|Impurity|Weak|13C Sat.,,1,1.3359623903865813777,0,0
Impurity,Artifact|Weak,,1,0.20000000000000006661,0,0
Impurity,Artifact|Weak,,1,-0.80971604745007086379,0,0
Impurity,Artifact|Weak,,1,-0.046211137384093201042,0,0
Impurity,Artifact|Weak,,1,-0.090167309437358220126,0,0
Impurity,Artifact|Weak,,1,0.16571957014145627385,0,0
Impurity,Artifact|Weak,,1,-0.80000000000000004441,0,0
Impurity,Artifact|Weak,,1,-0.41525000248484444931,0,0
Impurity,Artifact|Weak,,1,-1,0,0
Compound,Artifact|Impurity|Weak|13C Sat.,,1,1.8510235028154140569,0,0
Compound,Artifact|Impurity|Weak|13C Sat.,,1,1.1999999999999999556,0,0
Compound,Artifact|Impurity|Weak|13C Sat.,,1,0.096530088608139719142,0,0
Impurity,Artifact|Weak,,1,-0.12863279402893773584,0,0
Impurity,Artifact|Weak,,1,0.22835271796296019442,0,0
Solvent,None,,1,0.46834782397036628376,0,0
Artifact,Artifact|Weak,,1,-0.21817834652019618691,0,0
Artifact,Artifact|Weak,,1,1.999999999999999778,0,0
Artifact,Artifact|Weak,,1,-1,0,0
Artifact,Artifact|Weak,,1,0.42014323750726589868,0,0
Impurity,Artifact|Weak,,1,0.2000000000000000111,0,0
Impurity,Artifact|Weak,,1,0.11112277441923851251,0,0
Artifact,Artifact|Weak,,1,1.1674818085876890184,0,0
Solvent,Artifact|Impurity|Weak|13C Sat.,,1,0.40000000000000007772,0,0
Impurity,Artifact|Weak,,1,0.3371561946909800711,0,0
##END=	
##END=	
##END=	
