##TITLE=	Mar13-2020.270.fid
##JCAMPDX=	6.0	$$ NMR Plug-in 1.14 of MestReNova 12.0.4-22023
##DATATYPE=	NMRSPECTRUM
##DATACLASS=	NTUPLES
##NUMDIM=	1
##ORIGIN=	Bruker BioSpin GmbH
##OWNER=	nmrsu
##.OBSERVEFREQUENCY=	400.05240029999998796
##.OBSERVENUCLEUS=	^1H
##.SOLVENTNAME=	CDCl3
##.PULSESEQUENCE=	zg30
##LONGDATE=	2020/03/13 17:54:00.000
##.ACQUISITIONMODE=	SIMULTANEOUS (DQD)
##$ORIGINALFORMAT=	Bruker XWIN-NMR
##$PARAMETERFILE=	(acqus, ASCII, /Users/hrzepa/Downloads/270/acqus, 0)
$$ ##TITLE= Parameter file, TOPSPIN		Version 3.2
$$ ##JCAMPDX= 5.0
$$ ##DATATYPE= Parameter Values
$$ ##NPOINTS= 11	$$ modification sequence number
$$ ##ORIGIN= Bruker BioSpin GmbH
$$ ##OWNER= nmrsu
$$ $$ 2020-03-13 17:54:08.677 +0000  nmrsu@nmrpc
$$ $$ /opt/topspin/data/ug1/nmr/Mar13-2020/270/acqus
$$ $$ process /opt/topspin3.2/prog/mod/shimcntl
$$ ##$ACQT0= -2.04831932773109
$$ ##$AMP= (0..31)
$$ 100 100 100 100 100 100 100 100 100 100 100 100 100 100 100 100 100 100
$$ 100 100 100 100 100 100 100 100 100 100 100 100 100 100
$$ ##$AMPCOIL= (0..19)
$$ -1 0 0 0 0 0 0 0 0 0 0 0 0 0 0 0 0 0 0 0
$$ ##$ANAVPT= -1
$$ ##$AQSEQ= 0
$$ ##$AQ_mod= 3
$$ ##$AUNM= <au_zg>
$$ ##$AUTOPOS= <10 >
$$ ##$BF1= 400.05
$$ ##$BF2= 400.05
$$ ##$BF3= 400.05
$$ ##$BF4= 400.05
$$ ##$BF5= 400.05
$$ ##$BF6= 400.05
$$ ##$BF7= 400.05
$$ ##$BF8= 400.05
$$ ##$BYTORDA= 0
$$ ##$CAGPARS= (0..11)
$$ 0 0 0 0 0 0 0 0 0 0 0 0
$$ ##$CFDGTYP= 0
$$ ##$CFRGTYP= 9
$$ ##$CHEMSTR= <none>
$$ ##$CNST= (0..63)
$$ 1 1 1 1 1 1 1 1 1 1 1 1 1 1 1 1 1 1 1 1 1 1 1 1 1 1 1 1 1 1 1 1 1 1 1 1
$$ 1 1 1 1 1 1 1 1 1 1 1 1 1 1 1 1 1 1 1 1 1 1 1 1 1 1 1 1
$$ ##$CPDPRG= (0..8)
$$ <> <> <> <> <> <> <> <> <>
$$ ##$D= (0..63)
$$ 0 1 0 0 0 0 0 0 0 0 0 0 0 0 0 0 0.0002 0 0 0 0 0 0 0 0 0 0 0 0 0 0 0 0
$$ 0 0 0 0 0 0 0 0 0 0 0 0 0 0 0 0 0 0 0 0 0 0 0 0 0 0 0 0 0 0 0
$$ ##$DATE= 1584122047
$$ ##$DE= 6.5
$$ ##$DECBNUC= <off>
$$ ##$DECIM= 2496
$$ ##$DECNUC= <off>
$$ ##$DECSTAT= 4
$$ ##$DIGMOD= 1
$$ ##$DIGTYP= 12
$$ ##$DQDMODE= 0
$$ ##$DR= 22
$$ ##$DS= 4
$$ ##$DSPFIRM= 0
$$ ##$DSPFVS= 20
$$ ##$DTYPA= 0
$$ ##$EXP= <proton>
$$ ##$F1LIST= <>
$$ ##$F2LIST= <>
$$ ##$F3LIST= <>
$$ ##$FCUCHAN= (0..9)
$$ 0 2 0 0 0 0 0 0 0 0
$$ ##$FL1= 90
$$ ##$FL2= 90
$$ ##$FL3= 90
$$ ##$FL4= 90
$$ ##$FOV= 20
$$ ##$FQ1LIST= <>
$$ ##$FQ2LIST= <>
$$ ##$FQ3LIST= <>
$$ ##$FQ4LIST= <>
$$ ##$FQ5LIST= <>
$$ ##$FQ6LIST= <>
$$ ##$FQ7LIST= <>
$$ ##$FQ8LIST= <>
$$ ##$FRQLO3= 15959.0749999881
$$ ##$FRQLO3N= 2
$$ ##$FS= (0..7)
$$ 83 83 83 83 83 83 83 83
$$ ##$FTLPGN= 0
$$ ##$FW= 125000
$$ ##$FnMODE= 0
$$ ##$FnTYPE= 0
$$ ##$GPNAM= (0..31)
$$ <> <> <> <> <> <> <> <> <> <> <> <> <> <> <> <> <> <> <> <> <> <> <> <>
$$ <> <> <> <> <> <> <> <>
$$ ##$GPX= (0..31)
$$ 0 0 0 0 0 0 0 0 0 0 0 0 0 0 0 0 0 0 0 0 0 0 0 0 0 0 0 0 0 0 0 0
$$ ##$GPY= (0..31)
$$ 0 0 0 0 0 0 0 0 0 0 0 0 0 0 0 0 0 0 0 0 0 0 0 0 0 0 0 0 0 0 0 0
$$ ##$GPZ= (0..31)
$$ 0 0 0 0 0 0 0 0 0 0 0 0 0 0 0 0 0 0 0 0 0 0 0 0 0 0 0 0 0 0 0 0
$$ ##$GRDPROG= <>
$$ ##$GRPDLY= 67.9842376708984
$$ ##$HDDUTY= 20
$$ ##$HDRATE= 1
$$ [...]
$$ ##$SguType= 3
$$ ##$ShimPowMaxUA= (0..63)
$$ 130000 130000 130000 130000 130000 130000 130000 130000 130000 130000 130000
$$ 130000 130000 130000 130000 130000 130000 130000 130000 130000 130000 130000
$$ 130000 130000 130000 130000 130000 130000 130000 130000 130000 130000 130000
$$ 130000 130000 130000 130000 130000 130000 130000 0 0 0 0 0 0 0 0 0 0 0
$$ 0 0 0 0 0 0 0 0 0 0 0 0 0
$$ ##$ShimPowMaxUC= (0..63)
$$ 130000 130000 130000 130000 130000 130000 130000 130000 130000 130000 130000
$$ 130000 130000 130000 130000 130000 130000 130000 130000 130000 130000 130000
$$ 130000 130000 130000 130000 130000 130000 130000 130000 130000 130000 130000
$$ 130000 130000 130000 130000 130000 130000 130000 0 0 0 0 0 0 0 0 0 0 0
$$ 0 0 0 0 0 0 0 0 0 0 0 0 0
$$ ##$ShimPowMaxUG= (0..63)
$$ 524287 524287 524287 524287 524287 524287 524287 524287 524287 524287 524287
$$ 524287 524287 524287 524287 524287 524287 524287 524287 524287 524287 524287
$$ 524287 524287 524287 524287 524287 524287 524287 524287 524287 524287 524287
$$ 524287 524287 524287 524287 524287 524287 0 0 0 0 0 0 0 0 0 0 0 0 0 0 0
$$ 0 0 0 0 0 0 0 0 0 0
$$ ##$ShimPowRcbType= 3
$$ ##$ShimPowRes= (0..63)
$$ 1e-20 1e-20 1e-20 1e-20 1e-20 1e-20 1e-20 1e-20 1e-20 1e-20 1e-20 1e-20
$$ 1e-20 1e-20 1e-20 1e-20 1e-20 1e-20 1e-20 1e-20 1e-20 1e-20 1e-20 1e-20
$$ 1e-20 1e-20 1e-20 1e-20 1e-20 1e-20 1e-20 1e-20 1e-20 1e-20 1e-20 1e-20
$$ 1e-20 1e-20 1e-20 1e-20 0 0 0 0 0 0 0 0 0 0 0 0 0 0 0 0 0 0 0 0 0 0 0 0
$$ ##$ShimPowRng0= (0..63)
$$ 1 1 1 1 1 1 1 1 1 1 1 1 1 1 1 1 1 1 1 1 1 1 1 1 1 1 1 1 1 1 1 1 1 1 1 1
$$ 1 1 1 1 0 0 0 0 0 0 0 0 0 0 0 0 0 0 0 0 0 0 0 0 0 0 0 0
$$ ##$ShimPowRng1= (0..63)
$$ 1 1 1 1 1 1 1 1 1 1 1 1 1 1 1 1 1 1 1 1 1 1 1 1 1 1 1 1 1 1 1 1 1 1 1 1
$$ 1 1 1 1 0 0 0 0 0 0 0 0 0 0 0 0 0 0 0 0 0 0 0 0 0 0 0 0
$$ ##$ShimPowRng2= (0..63)
$$ 1 1 1 1 1 1 1 1 1 1 1 1 1 1 1 1 1 1 1 1 1 1 1 1 1 1 1 1 1 1 1 1 1 1 1 1
$$ 1 1 1 1 0 0 0 0 0 0 0 0 0 0 0 0 0 0 0 0 0 0 0 0 0 0 0 0
$$ ##$ShimPowRng3= (0..63)
$$ 1 1 1 1 1 1 1 1 1 1 1 1 1 1 1 1 1 1 1 1 1 1 1 1 1 1 1 1 1 1 1 1 1 1 1 1
$$ 1 1 1 1 0 0 0 0 0 0 0 0 0 0 0 0 0 0 0 0 0 0 0 0 0 0 0 0
$$ ##$ShimSysFunc= (0..63)
$$ 1 2 3 4 5 6 7 8 9 10 0 37 38 35 16 15 14 13 12 11 28 27 26 25 24 23 36
$$ 22 30 29 20 21 34 33 32 31 17 18 19 0 0 0 0 0 0 0 0 0 0 0 0 0 0 0 0 0 0
$$ 0 0 0 0 0 0 0
$$ ##$ShimSysMatrix= 0
$$ ##$ShimSysType= 4
$$ ##$TFXNUM= 0
$$ ##$TRIPLO2= 0
$$ ##$VTU= 2
$$ ##$VTUETH= <149.236.99.20>
$$ ##$VTUTY= <no>
$$ ##$WBREFAM= (0..15)
$$ 136.7 118.7 100 100 100 100 100 100 100 100 100 100 100 100 100 100
$$ ##$WBREFLM= (0..15)
$$ 0 0 0 0 0 0 0 0 0 0 0 0 0 0 0 0
$$ ##$WBREFPH= (0..15)
$$ 77.55 -71.28 0 0 0 0 0 0 0 0 0 0 0 0 0 0
$$ ##$WBSGU= (0..15)
$$ 0 0 0 0 0 0 0 0 0 0 0 0 0 0 0 0
$$ ##$XFAC= 2
$$ ##END=
$$ 
##$DECIM=	2496
##$DSPFVS=	20
##XUNITS=	HZ
##YUNITS=	ARBITRARY UNITS
##FIRSTX=	6406.710256386850233
##LASTX=	-1605.9879904956492283
##XFACTOR=	-0.12226593800080108598
##YFACTOR=	1.1160747070312501369e-05
##NPOINTS=	65536
##XYDATA=	(X++(Y..Y))
$$ [...]
-17969B357018R18046J078935Q72857M41856N273l99111p98043j051857r71079o22216l01808
-17958A529871j86026j79845j42591q5160p0716p1810l6474K618q068l6461j8351K9075L5863
-17945G61925p841m6308m9413l9818l4564k0148P647K5323J7146K23Q73K0221L2574J6485
-17931F84325j4690k2820L677K4408k19m4812n0166j3801M543k1111l9600n147M7791N6463
-17917F08841K0348r022o460O268P467M04p474j5894j9134p141J6548L4771L5892K2095K640
-17902F90149j1203j1133q66P079R519J5693K6989L0061J8564L897n489j6418l1161l5689
-17888F89992k2395n882j004k897l137o333j4810j6340m354Q279J2028J6738K7392K5985j141
-17873G02121l7434n7831n7010l9043n365K5894K1029j8264l6879P03M8723M0837r860k9787
$$ plain form
-17969 2357018 3275064 4353999 5226856 5668712 5673985 5274874 4476831 3424974 2453895 1831679 1529871
-17958 1529871 1343845 1164000 1021409 936249 865533 793723 757249 759867 751799 715338 696987 726062 761925
-17945 761925 754084 707776 658363 618545 583981 563833 571480 596803 613949 614172 615045 635266 667840 684325
-17931 684325 669635 646815 650492 674900 674681 629869 579703 565902 570445 549334 509734 504587 552378 608841
-17917 608841 629189 620167 613707 619975 627442 627846 620372 604478 585344 578203 594751 629522 665414 687509 690149
-17902 690149 678946 667813 666947 674026 683545 699238 726227 756288 774852 778749 773260 756842 725681 689992
-17888 689992 667597 661715 660711 657814 654677 648344 633534 617194 612840 621119 633147 649885 677277 703262 702121
-17873 702121 664687 606856 549846 510803 505438 531332 552361 534097 497218 497921 546644 587481 577621 547834
-17859E47834N618M3028L6994O896r047p416k863L092R388K059j9974k9880r022K1470K8989
-17844F27166J3629J029K840O970J103j2956k5925k8312j3583J4017L5975L4271J1501r532
-17830F58193r356O647J3180n396l2936l7498j0428K2800L5660K8740J5297k319k3292l2277
-17816F27015j8476K32J3r574K33K7448L7573J6107j0164j5179p908r062j7377j7311m655
-17801E98915J1330K0796J8005L402j2376j6954j1754p700o067O1O685K083r860j1619J25
-17786E85072J0799J3739J5498J4985N678j215J0408K3761N546l2719l8746k099K0421o920
-17772F24208l7686j7003K7854K9650j5237m8212l8480j1823M591J0183M200j5839k5022P989
-17758D99373O2423P7586L6362j1230k3381j6214j5568q908J7883L5473Q739m2853o5462m1050
$$ plain form
-17859 547834 553452 596480 633474 640370 631323 623907 621044 624136 633524 635583 615609 585729 576707 598177 627166
-17844 627166 640795 641824 644664 651634 652737 639781 613856 585544 571961 585978 621953 656224 667725 658193
-17830 658193 648837 655484 668664 663268 630332 592834 582406 605206 640866 669606 684903 682584 659292 627015
-17816 627015 608539 608771 608784 599210 599443 626891 664464 680571 670407 655228 647320 638258 620881 603570 598915
-17801 598915 610245 631041 649046 652448 640072 623118 611364 603664 597597 597658 604343 606426 596566 584947 585072
-17786 585072 595871 609610 625108 640093 645771 644556 654964 678725 684271 651552 612806 610707 631128 624208
-17772 624208 586522 569519 597373 627023 611786 563574 525094 513271 517862 528045 532245 516406 491384 499373
-17758 499373 561796 639382 675744 664514 641133 624919 609351 600443 618326 653799 662538 619685 554223 513173
-17744E13173k006J8955K1655K0402J8428Q394j3314l6535l9921j1200L2099N4933M3659J8078
-17730F46800o10j3196k3888k2833o086P563K358q033k716J2817J9704J8471K1805K5879J7581
-17715F95616K530l329l948j5019k9721k4745R7K0095K4685K4842J9451o780m2249m6873j1726
-17700F02926J7637N074k2516j9626P895J8777L786p385Q53J2619J6415J9171K0013O839j3138
-17685F69340j5472k252o103l3410m2807q960K8307J9490j5814j5767K8930O0655M1187K717
-17671G10041q168L432K482j6380k8766k6576k7193l7320l8964j9472P092J9923J7380J1956
-17657E69467J0260R430P140N104M552M914O233R053J2329J3196Q482k565j4580j7366o261
-17642F19388J0116J9279K0704K2807K3812R361k3309n0957m7733j7819Q884J2672K835j238
$$ plain form
-17744 513173 511167 530122 551777 572179 590607 599001 585687 549152 509231 498031 530130 585063 628722 646800
-17730 646800 646190 632994 609106 586273 580187 587750 590108 582075 579359 592176 611880 630351 652156 678035 695616
-17715 695616 698146 694817 690869 675850 646129 621384 621481 641576 666261 691103 710554 703774 661525 614652 602926
-17700 602926 620563 625637 603121 583495 591390 610167 613953 606568 607421 620040 636455 655626 675639 682478 669340
-17685 669340 653868 651616 645513 612103 569296 560336 588643 608133 592319 576552 605482 666137 707324 710041
-17671 710041 701873 705305 707787 691407 662641 636065 608872 571552 532588 513116 520208 540131 557511 569467
-17657 569467 579727 589157 596297 601401 605953 610867 617100 626153 638482 651678 660160 657595 643015 625649 619388
-17642 619388 629504 648783 669487 692294 716106 725467 702158 651201 603468 585649 594533 607205 610040 608802
-17628F08802M445Q747L045r720k1055k5617k3690j7152l984J9776M7992N8945L4714j0908
-17614F74340l8027k4251P460J7612j326k2071k2892r888L043J3736K1307J5351p480k7335
-17600E99579j9335J5567M9996N7747L5015J022j5734k708J6908M957l8882o5691m0184O670
-17586F04927K0979L956R98K1095K3316o330k2812M043L3546J4940l2480m9109k1000J3312
-17572F09381K6843K5639J3792j3260l8393l0603Q102M0068M3092L0470J6622P54r458P85
-17558G23834J7348N074l2442m5036j1109K3594J4753j3779j4511N420J879k8964m4564k4009
-17544E77488M197R513j757n860N479K1444K5099O671k2929l5655j8399O846J3471R037J7641
-17529F12286L3598K6656p066l2865k4156N343K5681K5028J1046l888j0418p680l647m43J2208
$$ plain form
-17628 608802 613247 621994 625039 615319 594264 568647 544957 527805 523821 543597 591589 650534 685248 674340
-17614 674340 636313 612062 619522 637134 635808 613737 590845 580957 584000 597736 619043 634394 626914 599579
-17600 599579 580244 595811 645807 703554 738569 739591 723857 721149 738057 743014 704132 638441 598257 604927
-17586 604927 625906 629862 630860 651955 675271 668941 646129 650172 683718 698658 666178 617069 596069 609381
-17572 609381 636224 661863 675655 662395 624002 593399 601501 641569 684661 715131 731753 732507 723049 723834
-17558 723834 741182 746256 713814 668778 657669 681263 696016 682237 667726 673146 675025 646061 601497 577488
-17544 577488 581685 591198 589441 583581 589060 610504 635603 642274 619345 583690 565291 572137 585608 594645 612286
-17529 612286 645884 672540 665474 632609 608453 613796 639477 664505 675551 671663 661245 653565 649918 649475 661683
-17514F61683L2751L3311j458l5949k6088P990M187m3035o6055k6144K6635L2340Q036N584
-17500F13788K3061J8858r764k4961j6089j0413j5509o682J8549K5345l47k3413j4044O874
-17486E85253O307p231k290K3118M1786M0093K9682J9351K963j9334k9063j0678K3364L9905
-17472G43226J9867j8004l5459k0179j919j0874l1460k2820J8442N0180M8380M2056O0392
-17459H41828P8068N2443n296m2649m3130m2260n8859n9253j5340L9611N0990J8601n007J5097
-17445H24844N8927Q4018O7995J6976m3248p7514o5483k7005o850k2995m4505l2498J0665
-17432G43327M7481M9332J8316k5540n8790o0978k9641P391J4481q796k4554o992K2082K5715
-17418G12834M470r964p240j1564l4984m9988l0802K257J0855k989l662J6533K3952J816j8600
$$ plain form
-17514 661683 694434 727745 726287 690338 664250 672240 676427 633392 567337 541193 567828 600168 608204 613788
-17500 613788 636849 655707 645943 620982 604893 594480 578971 572289 590838 616183 615836 592423 578379 585253
-17486 585253 591560 584329 582039 605157 646943 687036 716718 736069 739032 719698 690635 679957 703321 743226
-17472 743226 763093 745089 709630 689451 687532 676658 645198 622378 640820 691000 739380 781436 841828
-17459 841828 919896 972339 967043 924394 881264 839004 780145 720892 705552 745163 796153 814754 809747 824844
-17445 824844 883771 967789 1035784 1052760 1009512 931998 866515 839510 832660 809665 765160 732662 743327
-17432 743327 790808 840140 858456 832916 774126 713148 683507 690898 705379 696583 672029 665037 687119 712834
-17418 712834 717304 707340 700100 688536 653552 603564 572762 575019 585874 582885 579223 595756 619708 621524 602924
-17403F02924q501J2034J2543Q540L3228O9108O2184O418l8604l0126M388K1255K5046M2713
-17389H23150O5711O3040L4389P426q841k8216m9237n1960l5041k0323j4828j746K2323L3772
-17375H39619J8901l159r313o30J1038K0556K0149k127l8000n6590m4270k3940j6642j1159
-17361G04433M076P949j8678m7707l6642M033K1263l548l0656k2880P752K8023K6025Q656
-17347F52099j5953l4714l0015k153K4791L2344K4924R309j6387l8574k5740K2570N3413K4767
-17333F80681k9021l9708k3L2770K4961N235N281J3176R459N690J5508K3355J7263K0129M8197
-17318H32953O8245M4790O107M912K8307J5450l4700m9592J091N1088M4530L0813Q2591J62766
-17304A289351J59119M2106r0542j39921j11706p1302m8812k8892j370K1503K8221K0143L992
$$ plain form
-17403 602924 594423 606457 619000 627540 660768 729876 792060 798478 759874 729748 734136 755391 780437 823150
-17389 823150 888861 951901 986290 993716 984875 956659 907422 855462 820421 800098 785270 783524 805847 839619
-17375 839619 858520 855361 846048 845418 856456 877012 897161 895034 857034 800444 756174 732234 715592 704433
-17361 704433 708509 716458 697780 650073 613431 617464 638727 635179 604523 581643 589395 617418 643443 652099
-17347 652099 636146 601432 571417 569264 594055 626399 651323 660632 644245 605671 579931 602501 655914 680681
-17333 680681 651660 611952 611929 644699 669660 674895 680176 693352 702811 708501 724009 747364 764627 784756 832953
-17318 832953 901198 945988 952095 957007 985314 1000764 966064 916472 917563 968651 1013181 1043994 1126585 1289351
-17304 1289351 1448470 1490576 1400034 1260113 1148407 1077105 1028293 999401 998031 1019534 1047755 1067898 1071890
-17291A071890j2746k4658l4320m6043n2057m2824l2995m9234q2057q2225k8048L2725M1322
-17278F58730P412j0450O663J6260j0689l7360j2937M8579P8985M2138k2907n6857n2947m8707
-17264F05913n7457m6758K883N2840N2821J3507p889R991K7482J0561j8240j8681P427K3811
-17250F58211R383k4028n0437m7459r661L7697N3881K9323l66m934q01j6087l7699k9980O918
-17235E73961L5107L1222Q257j1878j7793l760K4622M1253K4468j0682l1082l0166k4122j3658
-17221E95749J0549L0332J5407j9661k3663J3269L8577J5598k3098k9660p502J0641J6176
-17208F42714J7087N584k4189m6362l3630l819M244q484n806K1538L9281K1772j2554k9094
-17194E88282j7036Q435K6328K5061R774k637l766l045o890k800J6322K7301O109k7062k7537
$$ plain form
-17291 1071890 1059144 1034486 1000166 954123 902066 859242 826247 777013 694956 612731 584683 617408 658730
-17278 658730 666142 655692 662355 678615 667926 630566 617629 666208 745193 787331 764424 707567 654620 605913
-17264 605913 548456 501698 504581 557421 610242 623749 615860 625851 653333 663894 645654 626973 634400 658211
-17250 658211 667594 643566 593129 545670 536009 573706 627587 656910 656544 651610 650809 634722 597023 567043 573961
-17235 573961 609068 640290 648547 636669 618876 615116 639738 680991 705459 694777 663695 633529 609407 595749
-17221 595749 606298 636630 652037 632376 608713 621982 660559 676157 653059 623399 615897 626538 642714
-17208 642714 659801 665385 641196 594834 561204 557385 561629 553145 547339 568877 608158 629930 617376 588282
-17194 588282 571246 579681 606009 631070 640844 638207 634441 631396 624506 621706 638028 665329 671438 644376 616839
-17179F16839R330L8952K9473q32j9724k2778k1148j5469m576O0p839j1896M182K7205K9120
-17164F50899M721k3616l4526k5185m492J6703L0019L5143L8527L9474K6048m200k9507k7045
-17150F92963n488M313r061k3750j6897N289J9669J7903J2779J4637J3744n525l6482m9134
-17136F34960k6113R196J7129o792k4868p817K7059M1357K3085p623k7206k5257l421K2896
-17122F46585K9997J1725q245p661K731O65q990o823K071j484q858M771K8036K1259j5422
-17107F90357l3575j3495L521j2018k6412n464K1278J3644l053J8078N3598L8271k4896o0755
-17093F59079l5739j681m591j6918K724L6892M2449J8952j584q654j5196k1231j3142P679
-17079F49039K3587K3775R142j6902m4624n5425m1037j5782M619K2913M2937M9279K8276j249
$$ plain form
-17179 616839 626169 665121 694594 693762 674038 651260 630112 614643 610067 610127 602288 590392 594574 621779 650899
-17164 650899 655620 632004 597478 572293 567801 584504 614523 649666 688193 727667 753715 749515 720008 692963
-17150 692963 687475 691788 682727 658977 642080 647369 667038 684941 697720 712357 726101 720576 684094 634960
-17136 634960 608847 618043 635172 628380 603512 595695 622754 664111 687196 679573 652367 627110 623689 646585
-17122 646585 676582 688307 680062 672401 675132 675797 666807 659984 662055 660571 651713 656484 684520 705779 690357
-17107 690357 656782 643287 646808 634790 608378 602914 624192 637836 634783 652861 706459 744730 719834 659079
-17093 659079 623340 621659 617068 600150 602874 639766 682215 701167 699583 690929 675733 654502 641360 649039
-17079 649039 672626 696401 705543 688641 644017 588592 547555 531773 536392 559305 602242 651521 679797 678548
-17065F78548m840K0702L8949J8072k9019n6778l7434M770J7624j6274n3966m5490J48L0041
-17051E65053K1362M417Q734K3888K6628J4099n573k6646l5636j7626J3839K5034J2667R384
-17037F39624K4617K5503k06j1905J7713N0320M0171M252j4528j7185k6835l0147l393K6736
-17023G24737J5042k3205l1256k137J5962O216O160L1213M1127J0317k3147j5726J4152J7071
-17009G86526j2348k9617l353M3467O0934K8796k3265n2986n2238m0872k3060J5596O1738
-16996G59318O9088K4252k1749k1285O336J7373J2330J3709R400k1790n1723l4805J3135L0635
-16982H04224K178k4249j3629J5095L0777K7434J3291j104k754N810j091l0754m4605j2764
-16968G67859K9838L2174O407J9J2259N584j5451q425K9071N2269L9025Q868k1141m3509l6857
$$ plain form
-17065 678548 673708 694410 733359 751431 722412 665634 628200 632970 650594 634320 580354 534864 535012 565053
-17051 565053 586415 590832 599566 623454 650082 664181 658608 631962 596326 578700 592539 617573 630240 639624
-17037 639624 664241 689744 689538 677633 695346 745666 785837 790089 775561 758376 731541 701394 698001 724737
-17023 724737 739779 716574 685318 683181 699143 705359 711519 742732 783859 794176 771029 755303 769455 786526
-17009 786526 774178 744561 741208 784675 845609 874405 851140 798154 745916 705044 681984 697580 759318
-16996 759318 828406 852658 830909 809624 815960 833333 845663 859372 868772 846982 795259 760454 773589 804224
-16982 804224 806402 782153 768524 783619 814396 841830 855121 854017 851263 857073 855982 825228 780623 767859
-16968 767859 797697 829871 836278 836297 848556 854140 838689 830264 859335 911604 950629 959497 938356 894847 857990
-16953H57990M434L4065J1484k5253j4059K7970L5081L234j6714j5049j9734j7077K2946N9363
-16939I48681K7631l7246m1276J1645K8006r881k0837J9172L6097K057j4307J8041L6526R924
-16925A014233l602K5992M2323J3858r087J432J149k4503k2330J7541K9192l720j1083K7375
-16911A098770L6887q390k9134J1921M0870J5477O46L1736M1463l55j4131M0105P9083M7827
-16897A392775J6746L8590M8035j646l9044r050K5358R333o712J7067L1991J7217L0037O9725
-16883A640422N2204j2243P78R9045J27612L7504k0882K9265O2162P758j1210O6127J02786
-16870B181328L0546o060P4297J36842J07403J15841K05566K12275R9801P6179J98635K40807
-16858C673460J43344J69225L96032N35190N04039O39542J074034J535413K061408L050237
$$ plain form
-16953 857990 862424 896489 907973 882720 868661 896631 931712 934946 918232 903183 883449 866372 889318 948681
-16939 948681 976312 939066 897790 909435 937441 927560 906723 925895 961992 964049 949742 967783 1004309 1014233
-16925 1014233 1010631 1036623 1078946 1092804 1083717 1085149 1086298 1061795 1039465 1057006 1086198 1082478 1071395 1098770
-16911 1098770 1135657 1127267 1098133 1110054 1150924 1166401 1167047 1198783 1240246 1239891 1225760 1265865 1344948 1392775
-16897 1392775 1409521 1448111 1496146 1494500 1455456 1446406 1471764 1481097 1474385 1491452 1523443 1540660 1570697 1640422
-16883 1640422 1692626 1680383 1681161 1780206 1907818 1945322 1924440 1953705 2015867 2023625 2012415 2078542 2181328
-16870 2181328 2211874 2205814 2280111 2416953 2524356 2640197 2845763 3058038 3157839 3234018 3432653 3673460
-16858 3673460 3816804 3986029 4382061 4917251 5421290 6060832 7134866 8670279 10731687 13781924
-16848A3781924M078564L686208J288831j516154k685205k125324j188297m58724M86959J645557
-16838A6994339K674602M213003P160137J0343254J0785982P096529J218566l851766o773487
-16829D9861159p685652o894135m882696k583616n43731J545076L931850O312231Q526566
-16820D7587052J0290380R772600M588476m336613j1788764j3279987r877501o074339m099721
-16811B2781583k770931j004382O18831J797281L116330M027971K703707j012558m499355
-16802B5758477n424682m351102l173971k476156j757709j051672p95227p94482n69773k61936
-16792E101767k42858l13106j25819Q3113l7204k39409j52990J1598p8298k01624m1968J56456
-16780C919658N8337j01099K1397K09120J28626q355J25795L22929K63169J56640L13171N06364
$$ plain form
-16848 13781924 17860488 21546696 22835527 21319373 18634168 16508844 15320547 14861823 15348782 16994339
-16838 16994339 19668941 23881944 31042081 41385335 52171317 59267846 60486412 56634646 49861159
-16829 49861159 42175507 35281372 30398676 27815060 27271329 28816405 32748255 39060486 47587052
-16820 47587052 57877432 67650032 72238508 67901895 56113131 42833144 32955643 26881304 22781583
-16811 22781583 20010652 19006270 19625101 21422382 24538712 28566683 31270390 30257832 25758477
-16802 25758477 20333795 15982693 12808722 10332566 8574857 7523185 6727958 5933476 5363703 5101767
-16792 5101767 4858909 4545803 4419984 4503097 4465893 4226484 4073494 4085092 4006794 3805170 3763202 3919658
-16780 3919658 3977995 3876896 3898293 4107413 4236039 4227684 4353479 4676408 4939577 5096217 5409388 5915752
-16768E915752M33871L83898P47125J277227J588780K040893L292051N079008O087226N093926
-16758C1939757K069984j537217l551259k825911m95109J460502L097846O328334J0907751
-16749D7394678J2597469P731193j238110p462563p224110l499432j352270j887939k279696
-16740D2779220m82468K063082K568383N97744j193469k15753K539461L124507o74312o241362
-16730D4865033q949405p425313m379808k476843j454347O9966J821339K270958Q53022j438250
-16720B3756352l227213l744560l044507j872797j049184o58719j95853M75481R98860J376238
-16710A2814098J955412K375087J669944j21636j572791j683329j027679m79763O4747R27074
-16700A4921164J787990K572361M069708O467253Q186610P488332M579431J015625k202024
$$ plain form
-16768 5915752 6349623 6733521 7480646 8757873 10346653 12387546 15679597 20758605 26845831 31939757
-16758 31939757 34009741 32472524 28921265 26095354 25600245 27060747 30158593 36486927 47394678
-16749 47394678 59992147 67723340 66485230 59022667 51798557 48299125 46946855 45058916 42779220
-16740 42779220 42296752 44359834 46928217 47525961 46332492 46116739 48656200 51780707 51106395 44865033
-16730 44865033 35915628 28490315 24110507 21633664 20179317 20249283 22070622 24341580 25194602 23756352
-16720 23756352 20529139 16784579 13740072 11867275 10818091 10159372 9963519 10439000 11437860 12814098
-16710 12814098 14769510 17144597 18814541 18692905 17120114 15436785 14409106 13929343 13994090 14921164
-16700 14921164 16709154 19281515 23351223 29818476 38005086 45493418 50072849 51088474 48886450
-16691D8886450m708921n812059n009458l043950j094971P03826K850949N295036P868384
-16682D5935286J0824178J3251956J2206379O005359k226049p226089p778656p248807p717549
-16673E6026008p166562l784236N85959L854426P456379J2988970J6928969J3239324J575728
-16664A01704965j0641549j5709108j3026136p881140m808975l863721k556234K54717K849211
-16655D6322030K693182k66678k995285k766138o31360j77758k879945o250014p131417n373591
-16645B0543026l190054j968759j183022p4171R94604J154319J89929j278366k386887k617708
-16635A0182911k074319j320088q37759o51980n39851m27962l84877l80473l12961k02466
-16625C050175j45565j33791r2022l1610n935J5224P7005J19745P0003k4351q1294j20208
$$ plain form
-16691 48886450 44177529 38365470 33356012 30312062 29217091 29920917 32771866 38066902 45935286
-16682 45935286 56759464 70011420 82217799 88223158 85997109 78771020 70992364 63743557 56026008
-16673 56026008 48859446 45075210 45661169 49515595 56971974 69960944 86889913 100129237 101704965
-16664 101704965 91063416 75354308 62328172 54447032 49638057 45774336 43218102 43472819 46322030
-16655 46322030 49015212 48748534 45753249 42987111 42355751 42177993 39298048 33048034 25916617 20543026
-16645 20543026 17352972 15384213 14201191 14127020 15121624 16275943 16465872 15187506 12800619 10182911
-16635 10182911 8108592 6788504 5950745 5298765 4758914 4330952 3946075 3565602 3252641 3050175
-16625 3050175 2904610 2770819 2678797 2647187 2641252 2656476 2733481 2853226 2923229 2898878 2817584 2697376
-16613B697376j78786j92748j05641o361j164l1985J7437J14102J45544J25694J42464J50383
-16601B876315K0999k08947l38265k78992j61347j17093j13169o5836J3677P2386J15565J63490
-16589A978783J74111R2698n3399j71210j96923j41304o0435p704P267K8698J00667J91303
-16577A942552K05522R5361o9902j71295j60839r1872m1863l1235k1856J9695P1945Q0606
-16565A826819K8783l2661m0759L189L3378m234r2292j62536j65159j13017o1130m4232l9839
-16552A136310n296N1705O8496R222p6769j10922q2047m5308l2872j7995J8987M2359J6377
-16539I72247k7449k8355J5530M7499L6539J0210m313k0092m7311n6420k2721K4118L7832
-16526I37314K1157J0454J1194k679l1819m4124k9215j4035j3563r128P991J2673j0401l3901
$$ plain form
-16613 2697376 2518590 2325842 2220201 2213840 2212676 2180691 2198128 2312230 2457774 2583468 2725932 2876315
-16601 2876315 2897314 2688367 2350102 2071110 1909763 1792670 1679501 1613665 1627342 1699728 1815293 1978783
-16589 1978783 2152894 2245592 2192193 2020983 1824060 1682756 1622321 1614617 1621884 1650582 1751249 1942552
-16577 1942552 2148074 2243435 2173533 2002238 1841399 1749527 1707664 1676429 1654573 1674268 1746213 1826819
-16565 1826819 1855602 1822941 1782182 1785371 1818749 1814515 1722223 1559687 1394528 1281511 1220381 1176149 1136310
-16552 1136310 1131014 1182719 1251215 1260437 1183668 1072746 990699 945391 912519 894524 913511 955870 972247
-16539 972247 944798 916443 931973 979472 1016011 1026221 1021908 1001816 954505 898085 875364 899482 937314
-16526 937314 958471 968925 980119 977440 945621 901497 872282 858247 844684 835556 843547 856220 845819 811918
-16512H11918k6757M08J6631J6293J5907K0611K0642J2918N734N984J3006J8257P090k4852
-16498I13790n3986m8438j1445J8614J8914N686k675j2522k6722k3641P058L4525K5589n992
-16484H38755k2173j7673j9188l4952m0349j8034J5062L1250K5961J6028J1519K509k0258
-16471G68457l9706k6876J3097L3748O759l3418l5502l067J9969K0209J9816J8151j0752n5384
-16457F95501o3726k3168J3608R228o742J352J5646P280p347Q03J9691K0262N775k756m541
-16442F80866o934k102J1876J5902N826Q156K8101K4779k0924n8281l8330O784J5676n474
-16428F65921n498J6657J2934k4892m6487k1229J9829L3183J3622j4612k7441j6583L227O669
-16414F15300o273m835K1900L6758Q217l5348m4222j6762R921J7650J5039P226k958j722J2849
$$ plain form
-16512 811918 785161 785569 802200 818493 834400 855011 875653 888571 894305 900289 913295 931552 938642 913790
-16498 913790 859804 811366 799921 818535 837449 843135 840460 827938 801216 777575 784633 819158 844747 838755
-16484 838755 816582 798909 779721 744769 704420 686386 701448 732698 758659 774687 786206 788715 768457
-16471 768457 728751 701875 714972 748720 755479 722061 686559 683492 703461 723670 743486 761637 750885 695501
-16457 695501 631775 608607 622215 631443 624701 626053 641699 648979 641632 642435 662126 682388 688163 685407 680866
-16442 680866 673932 671830 683706 699608 705434 713590 741691 766470 745546 687265 648935 655719 671395 665921
-16428 665921 660423 677080 690014 665122 618635 597406 617235 650418 664040 649428 621987 605404 608631 615300
-16414 615300 609027 604192 626092 662850 671067 635719 591497 574735 584656 602306 617345 624571 621613 619891 632740
-16399F32740J6970J735l677J6436K9220J1130n033Q540J7008j0323k8115J0689N5728K8356
-16385G81404m4621o8455k8800L753M434J7056M4785L3396j7905l7452k081K4001N559p290
-16371G07784J8188L3479J719l1371k0096K793p026k6988k0886j0297k5130l4454K934N8356
-16357F49005P1025L7242K555j0934j5373j5960q121l93m51N177K4797L6729K1994k306j2276
-16342G82710j3852k0384k1636p150N545k419j9527k5519k0644j1065N915K1107J1660j8115
-16328F66626l1265j5572m221j4683j5806J1989L4242K0159n186r616p232j6534j4589J2826
-16314F11138K4200j1785m7617k5164K4937K9682q440k2348O225K6908J2926k634Q344L1094
-16300F57466M4729M4245K2408j9981m8318l2059k003j0169l9767k6952K6772M5369j83m2340
$$ plain form
-16399 632740 649710 651445 647768 664204 693424 704554 699521 708061 725069 714746 686631 697320 753048 781404
-16385 781404 736783 668328 639528 643281 647715 664771 709556 742952 725047 687595 685514 709515 715074 707784
-16371 707784 725972 759451 761170 729799 709703 712496 705470 678482 657596 647299 622169 587715 590649 649005
-16357 649005 720030 757272 759827 748893 733520 717560 709439 709046 708595 713772 738569 775298 797292 794986 782710
-16342 782710 768858 748474 726838 719688 725233 722814 703287 677768 657124 646059 651974 673081 684741 666626
-16328 666626 635361 619789 615568 600885 585079 597068 631310 651469 646283 636667 629435 612901 598312 611138
-16314 611138 635338 623553 575936 550772 575709 605391 596951 574603 580828 607736 620662 618028 626372 657466
-16300 657466 702195 746440 768848 748867 700549 668490 666487 656318 616551 589599 616371 661740 661557 619217
-16286F19217k4713J4038J3624j1752j1257J2517J6383m890j3617M801K0642P562k3332m1914
-16272E77309k9546Q015M1686L9684L275k7142j7626J8811M4047M2182K3370m022l4624m7712
-16258F37707k2884K2377M2393K0955p755j0237N83o132k5471k4958M66J6963K887j8385j4697
-16243F13812P104J3213p541k9206k2535J2217M5866M4606M98n1879o0985j6717K9345K4215
-16229F02013j8078l7235q120L3518M6859L0898N808j5581k3789j0614J1937J6227k218j5127
-16215F16498m547J1877J4642J2183J6148J5700K452m272J3020L5192L2292R628j743R341
-16201G78411K5307L0548K7836K7471L5374M6893M4179J3536k7622m3297k8999k0639l6927
-16188H72071m7058k2441J3915K7020K8844N0752P8305O6572J2998l5675n0649m9718n2662
$$ plain form
-16286 619217 594504 608542 622166 610414 599157 611674 628057 623167 609550 614351 634993 642555 619223 577309
-16272 577309 547763 555778 597464 637148 640423 613281 595655 614466 658513 700695 724065 720043 685419 637707
-16258 637707 614823 637200 679593 700548 692793 682556 683139 677007 651536 626578 627044 644007 646894 628509 613812
-16243 613812 620916 634129 626588 597382 574847 587064 632930 677536 678034 626155 565170 548453 577798 602013
-16229 602013 583935 546700 538580 572098 618957 649855 655663 640082 616293 605679 617616 633843 631625 616498
-16215 616498 611951 623828 638470 650653 666801 682501 684953 680681 693701 728893 761185 770813 769070 778411
-16201 778411 803718 834266 862102 889573 924947 971840 1016019 1029555 1001933 958636 929637 908998 872071
-16188 872071 825013 802572 816487 843507 872351 923103 1001408 1067980 1080978 1045303 994654 944936 892274
-16175H92274n1214l6794k1584j4110k229K0915L6097K2330j1382l4410k8529n538N043j5248
-16161G55621n1419o4789l4143J7446M7248L8691J0586j1564j6659m734J7742L5737L2793
-16148G72556P783k0453k9170j3319P713R106q703j7258l13J5884k699m2239n4855k7136M449
-16133F01346J2466J0111J1173M301j1145q349J8737L2054P849k1131j8599j411k036j1240
-16119F24126m296R179J0248J3991L6371M8349J9240k1640k6405n851q40j748K8180O5155
-16105G94059M5643k3718o0047k4197K8471M1943L4668M5390O1950M8137M568l4599m2971
-16092I19297j8735J6732K6131q576n0546m2473J4649N5914L8740m912k1652o059P646k066
-16078I24090k3572l1187j3404J0330N442l0583n3576k9977J1010J8962n181k3087k4655k4541
$$ plain form
-16175 892274 841060 804266 782682 768572 766343 787258 823355 845685 834303 799893 771364 765826 770869 755621
-16161 755621 704202 639413 605270 622716 669964 708655 719241 707677 691018 686284 704026 739763 772556
-16148 772556 780339 759886 730716 717397 725110 734216 725513 708255 707942 723826 721127 678888 624033 596897 601346
-16133 601346 613812 623923 635096 639397 628252 619903 638640 670694 678543 657412 638813 637402 635366 624126
-16119 624126 619830 629009 639257 653248 689619 737968 757208 735568 709163 703312 702472 700724 728904 794059
-16105 794059 839702 815984 755937 731740 760211 802154 836822 882212 944162 992299 996867 962268 919297
-16092 919297 900562 917294 943425 934849 884303 841830 856479 912393 951133 946221 924569 918510 926156 924090
-16078 924090 900518 869331 855927 866257 871699 841116 787540 757563 768573 787535 782354 759267 734612 710071
-16064G10071j2087K7920N6672K1708m3414m3750L7065J03766Q4335K0150j5643j6771j4394
-16051I15628j3005q053j6346l9273l9973j105L7769M0936K8562K6417J3496l0520p1230o7601
-16037G75702l7210k1326j9097p391P194Q437J1959L5014N3350L9221J3969J0678J3166j1514
-16023H72152m5516m6005j9768j0335k1882j5338K3458O4985Q4074P9948N1381j797n2836
-16010I62521o7213m9465l4210l2133k2107M337K7494L1778K4469J9489K2931L0161K2969
-15997I41021j3915n7852n9321j3289J6789j5103o3358n3930P010M7253L2962k660k5529l4821
-15983G05257l2513j4760K675j534j4159o901R083p03k7608k6707P435L0383K1545J0512J5937
-15968F77942J4995n843k1855j6221q373j1593p217J2304J8240n407k7123j6586O088O472
$$ plain form
-16064 710071 697984 725904 782576 804284 760870 717120 754185 857951 942286 962436 946793 930022 915628
-16051 915628 902623 894570 878224 838951 798978 797873 835642 876578 905140 931557 945053 914533 843303 775702
-16037 775702 738492 717166 698069 690678 697872 706309 718268 753282 806632 845853 859822 870500 883666 872152
-16023 872152 826636 780631 760863 750528 728646 713308 736766 801751 885825 965773 1017154 1015357 962521
-16010 962521 895308 845843 811633 779500 757393 761730 789224 821002 845471 864960 887891 918052 941021
-15997 941021 927106 869254 809933 796644 813433 798330 734972 681042 688052 735305 768267 765607 740078 705257
-15983 705257 672744 657984 660659 659125 644966 638065 647148 646445 618837 592130 599565 629948 651493 662005 677942
-15968 677942 692937 687094 665239 649018 640645 629052 621835 634139 652379 646972 619849 603263 609351 615823
-15954F15823p611m873J5302K7001K3099J9062J6770l57l2068m8605k6511J7079L9912K2484
-15940F76507r660j8548k670L506j8015l9761k8995M204K5066K4387J8550J0600j0265l2895
-15926F02011k8314K435K0381K174k7872l4462j5320P506J9893K2675K0704J8233J6368R347
-15912F35759p125k3498k6467j9872j7547j6003L047L8102N7917L8126n620l2665k0754J0937
-15898F14337K1999l797l6363l4791k177J9529J2573N573J7847K3990M465j0120J0154L5212
-15884F78431K0709j5173k1978k262J037j1371J827L7142M0978J588k6300j0445J1113j426
-15870G03870l2217m9895n1941m1310j0359K4873K6696j75j661L8178O1948K9900j4039j6273
-15856F67595K428m073k2947j3964J1668J4203R76R146K9837J9531j8686l2448m008K2974
$$ plain form
-15954 615823 608212 603339 618641 645642 668741 687803 704573 704216 672148 623543 597032 614111 654023 676507
-15940 676507 666847 648299 645629 649135 631120 591359 562364 566568 591634 616021 634571 645171 634906 602011
-15926 602011 573697 576132 596513 598687 570815 536353 521033 528539 548432 571107 591811 610044 626412 635759
-15912 635759 628634 605136 578669 558797 541250 525247 528294 566396 624313 662439 656819 624154 603400 614337
-15898 614337 636336 632539 596176 561385 559208 578737 591310 596883 614730 638720 643185 633065 643219 678431
-15884 678431 699140 683967 661989 659727 660764 649393 651220 688362 729340 730928 704628 694183 705296 703870
-15870 703870 671653 621758 569817 528507 518148 543021 569717 569542 567881 606059 668007 697907 683868 667595
-15856 667595 670023 665950 643003 629039 640707 654910 655886 665032 694869 714400 695714 663266 659258 682232
-15842F82232J3328j3600k5403k2421k1181k2684j7522l497J4820L0242L1629J3443j0617
-15829F48769j7692j334K3456L7643L0670L637k7044l8180k5651j1745j3210j6292j711J9976
-15815F11292K2028K367j2879m724J7055K7366J1025k1490l9373k3127P479J6081J382k923
-15801F11559J3260J6559j1475l5607j8398K1861M0670K8236N204j6546l0866k0640J4436
-15788F18253L6817K0582k931M429J9847O96l1897k2948J5722J5875l1994n6217j8411K6915
-15774E94738K3191n531r509N565O174l523j1P375k673j3825K850L0600K6854p352k9277k3618
-15758F02028j9523l2800l8811j8282R841K1622K1349J9554P296k0229l7219j7061K3175L9403
-15744E60343J8442q264j0070R368K9750M0695L9121K1755k552r622R383K5100K816m5602
$$ plain form
-15842 682232 695560 681960 656557 634136 612955 590271 572749 569252 584072 614314 645943 659386 648769
-15829 648769 631077 629743 653199 690842 721512 725149 698105 659925 634274 622529 609319 593027 591316 611292
-15815 611292 633320 635687 622808 618084 635139 662505 673530 652040 612667 589540 597019 613100 614482 611559
-15801 611559 624819 641378 629903 594296 575898 597759 638429 666665 671869 655323 624457 603817 618253
-15788 618253 655070 675652 672721 677150 696997 697693 665796 642848 658570 674445 642451 586234 567823 594738
-15774 594738 617929 612398 602889 608454 614628 611105 611094 618469 615796 601971 604821 635421 662275 654923 625646 602028
-15758 602028 582505 549705 510894 492612 502453 524075 545424 564978 572274 552045 514826 497765 520940 560343
-15744 560343 578785 570521 560451 569819 599569 640264 679385 701140 698588 688966 698349 723449 726265 680663
-15730F80663o8660l9137J1576L3918J7120q776j5401l375Q620P032o861k1606k5194j1705
-15716E58214J7049N0638O9582N5886J4011k5563l6943k7956k3632k7201k0010J037J3572
-15703F18684N293o122k683N957K104r538j0908R48J2609J4242O530n467j3513r245K840M735
-15687F16466j1234k6799j8999R718L4278L5421J6800k182n694J984j96k1710m1107l1752
-15673E54994j459J7999J8000J8032K2445J1745j2630j7744O178K2508P692p775N690K0939
-15659F66614Q02l2525l1621m897j640k5899k8693R564M6795M4542J7167l402j1785j5771
-15645F29251j1860K149J2630P863m879j1292m806J4099L5419L6674N706l3740m5413k9511
-15631F02290j7777j9657j2285Q874J3731q341k0308N441L6915K8634p355k0825N74K0355
$$ plain form
-15730 680663 612003 572866 584442 618360 635480 626704 611303 607928 616548 623580 616719 595113 569919 558214
-15716 558214 575263 625901 695483 751369 765380 739817 702874 674918 651286 624085 604075 605112 618684
-15703 618684 623977 617855 615172 621129 623233 613695 602787 603735 616344 630586 637116 631649 618136 608891 611731 616466
-15687 616466 605232 578433 559434 569152 603430 638851 655651 653469 647775 649759 649563 627853 586746 554994
-15673 554994 553535 571534 589534 607566 630011 641756 629126 611382 617560 640068 647760 639985 645675 666614
-15659 666614 667416 634891 603270 598373 596733 570834 542141 551705 598500 643042 660209 656807 645022 629251
-15645 629251 617391 619540 632170 640033 635154 623862 619056 633155 668574 705248 710954 677214 631801 602290
-15631 602290 584513 564856 552571 561445 575176 566835 546527 551968 588883 617517 610162 589337 589911 610266
-15617F10266J6011Q113J6655K7350K1246P750K438m344k5324l8888j3685L2427M2209J016
-15603G03240l3304j1538L2170L0967j3442l6385j1150J5778K980k7385l6036k5570j8331
-15590E71994j1695N339J8054Q460p310j162K1271L0906J9276J467j3421k5730k9511j9986
-15576E67952o764J787J2148K4408K0610j620j2029O033K2489R062j1724q190L681l990j0775
-15561F13078J4529M3370K5329k1226l1313J940K2286R106O80R344l829m6543o4915k9741
-15547E42095J4185K2781J5678K3588K8943O406k2684k4183n531M799K899j37m833j0115k469
-15532E91422J5402J6812l548j2250Q811K9362K1294L238J689N674l352j1599j386J2224J0185
-15517F83978M255P220J315k4735m0078j6992J7337J9519m582j8272j4611j2129j0491J575
$$ plain form
-15617 610266 626277 634390 651045 678395 699641 707391 709829 705485 680161 641273 627588 660015 702224 703240
-15603 703240 669936 658398 690568 721535 708093 671708 660558 676336 679316 651931 615895 590325 571994
-15590 571994 560299 565638 583692 592152 584842 583680 604951 635857 655133 656600 643179 617449 587938 567952
-15576 567952 561188 562975 575123 599531 620141 618521 606492 612525 635014 644076 632352 624162 627843 623853 613078
-15561 613078 627607 670977 696306 675080 643767 645707 667993 677099 677779 687123 683294 636751 571836 542095
-15547 542095 556280 579061 594739 618327 647270 653676 630992 606809 601278 606077 608976 608839 604006 593891 591422
-15532 591422 606824 623636 620088 607838 616649 646011 667305 670543 672232 677906 674554 662955 661569 673793 683978
-15517 683978 688233 695453 696768 672033 631955 614963 632300 651819 647237 628965 614354 602225 591734 593309
-15503E93309J0179m163k2498r526K7349M4109K2039j4163l6104l5351j3144J8671L0893N025
-15489F16625l3313l9159n964K7697K8929N592j0424L94K5285L1189N593j8722m728K7789
-15475F56783K5345j1450k2057J2790L2633m9k9214J83M0031J3897n2877p1855l1747j620
-15461E60793o326P39L4551M5181J0813k0787j5313k460r699j4591j650j863k9703l8819O195
-15446E17061O0857O0537J4119j7970j3940l598o848j1839r999p801k241J7853M2203M3548
-15432F81942J9051p55N381K0859J8249k778k0815k4841k2710k0705j2700M065J6888J3268
-15418F74399mp929j1061k0333l1872k9054j1183L368P012J1237J8866J6418M845O594K5993
-15403F57296L4435J6036m003k139M946n298k0018k0139k0006l7035m8393k4665J5045K9670
$$ plain form
-15503 593309 603488 599325 576827 567301 594650 638759 660798 646635 610531 575180 562036 580707 611600 616625
-15489 616625 583312 544153 538189 565886 594815 600407 589983 590377 615662 646851 652444 633722 628994 656783
-15475 656783 682128 670678 648621 661411 694044 693995 664781 664964 704995 718892 666015 594160 562413 560793
-15461 560793 554467 555206 589757 634938 645751 624964 609651 607191 597492 582901 581251 579388 549685 510866 517061
-15446 517061 577918 638455 652574 634604 620664 617066 610218 598379 588380 580579 578338 596191 638394 681942
-15432 681942 700993 700238 705619 726478 744727 741949 721134 696293 673583 652878 640178 644243 661131 674399
-15418 674399 674395 666466 655405 635072 603200 574146 562963 566331 573343 584580 603446 619864 624709 631303 657296
-15403 657296 691731 707767 703764 701625 706571 701273 681255 661116 641110 604075 555682 531017 546062 575732
-15389E75732J9702J5268J6822J240k3372k3262L044K1695J7943Q922M974J749N825K3707
-15375F69989L2441P742k7263l1131j0994n427j2754p98K0543J0022k2051k0268J7239K8431
-15361F55721m828k1802J2319M6103K9644q919k3603k2915k9250k5290K180J7574m702k3645
-15347E98587M296M6253M2764K152k0913j4001q437j2567q203l52q637j7790L926M0811M2171
-15332F90060R74l3735l0402j1516n023m758K369O436m993k0420j8996R47K0869K2259K973
-15317F17044k1177l1888k8530k4752k2051m759K7957M7075L1154P81q390O080J6776Q245
-15303F13565q930j9598j7523k139J9409L0261J9540l293k0003k2273j0516J2853L7087M2922
-15289F71362K2282j0385l4136l8296k1809O240K3508J4815k524j203R184m548l6044l8367
$$ plain form
-15389 575732 595434 610702 627524 628764 605392 582130 585174 606869 624812 633734 638708 640457 646282 669989
-15375 669989 702430 710172 682909 651778 640784 635357 622603 621805 642348 652370 630319 610051 627290 655721
-15361 655721 650893 629091 641410 687513 717157 708238 684635 661720 632470 607180 609360 626934 622232 598587
-15347 598587 602883 649136 691900 694052 673139 659138 650701 638134 629931 629579 620942 603152 607078 647889 690060
-15332 690060 691034 657299 626897 615381 610358 605600 607969 614405 609412 588992 569996 570943 591812 614071 617044
-15317 617044 595867 563979 535449 510697 488646 483887 511844 558919 590073 590854 582464 588544 605320 613565
-15303 613565 604635 585037 567514 565375 584784 615045 634585 631292 611289 589016 578500 591353 628440 671362
-15289 671362 693644 683259 649123 610827 589018 595258 618766 633581 631057 629854 639038 634490 598446 560079
-15275E60079N9L1192K2879M550N035J276k5458l6344K354M7458L7082j1656l2281j2124N199
-15260E99300L463O995J7818J1334m923L717L0560L0318q38j4084Q424K3545K806k2918k2670
-15245F72847j3886j8958k2888r863J805k321n8K3522L7253J1998k4472k7829p613o950k8093
-15230E84494l1228l877J9284J4583L529J1169K5299K1784N360l886r083k8779n4039m8175
-15216E06435j851M0219L2727p505k3224N542L9407L9045J2972p608j2296r351k695O680J2276
-15201F30773J2867J5505J4471q296m4303n0755j0112L2139K6450r165k0270J043J4652L098
-15187F08097r326p272l151P93K0244M6536M2562J82l7760l5145r460J528q595k0201k1376
-15172E67656j3282J160J4733J5725M168n301n934p052j1838q188P112J7295J2738P674J3295
$$ plain form
-15275 560079 560138 591330 614209 618759 623794 625070 599612 563268 565622 613080 650162 638506 606225 594101 599300
-15260 599300 602763 609758 627576 638910 633987 637704 668264 698582 697744 683660 692084 715629 718435 695517 672847
-15245 672847 658961 640003 617115 607252 609057 606736 606678 630200 667453 679451 654979 627150 619537 612587 584494
-15230 584494 553266 549389 568673 583256 586785 597954 623253 645037 650397 646511 637428 608649 554610 506435
-15216 506435 504584 544803 577530 570025 546801 552343 591750 630795 643767 636159 623863 614512 611817 618497 630773
-15201 630773 643640 659145 673616 665320 621017 570262 560150 592289 618739 609574 589304 590347 604999 608097
-15187 608097 598771 591499 588348 589141 609385 655921 698483 698665 660905 625760 616300 617828 609233 589032 567656
-15172 567656 554374 555534 570267 585992 590160 584859 578925 571873 560035 551847 558959 576254 588992 596666 609961
-15157F09961J5243j047k0526j9013j659N201m737j0863j500Q104L582k996N998J8945O900
-15142F11593k8022m4130j6475K1892K4068j388o037J8629K7110j949k5566n782K5009J3734
-15128F12686k9543m9363k9133n390k449j822J6660M1600M9893L5327R723r370j2844j1635
-15114F14340k2098l2423j1622L2542M6031R593j9806L481L3033N006m8284m6437L486J9254
-15100E86096j5285k7216J2509L8353P839k6572j4042J1232L693j0238R036L3674J9406j2040
-15086F16445j4456m32r231k5082n367L2360L1027p669k1999R211L5032J6648j7181k3114
-15072F16192n218M387m669j6525j5844j153J6924K1811O018j6600k4040j1202Q942K5015
-15058F04038L3916L2091J5685j0008l1694l8130k5073J322K0882J3327j3885k6801p239K0770
$$ plain form
-15157 609961 625204 624157 603631 584618 582959 588160 583423 572560 571060 579164 582746 579750 585748 604693 611593
-15142 611593 583571 539441 522966 544858 568926 567538 561501 580130 607240 605291 579725 573943 598952 612686
-15128 612686 583143 533780 504647 499257 496808 494986 511646 553246 603139 638466 648189 638819 625975 614340
-15114 614340 592242 559819 548197 580739 626770 636363 616557 620038 653071 658077 609793 563356 566842 586096
-15100 586096 570811 543595 556104 594457 602296 575724 561682 572914 576607 566369 575405 609079 628485 616445
-15086 616445 601989 601557 592326 567244 561877 594237 625264 617595 595596 604807 639839 656487 639306 616192
-15072 616192 610974 615361 610692 594167 578323 577170 594094 615905 621923 605323 581283 570081 579023 604038
-15058 604038 637954 670045 685730 675722 644028 605898 580825 582147 603029 616356 602471 575670 568431 589201
-15044E89201K3496L622p024N405J8128L500l2451n1612k6881J9083L2879j856l6146k0674
-15030E18670K0851K5651j1541l1957q437J4026k190k5252j1723K1168L0500J9083J8142K4193
-15016F01184R158k0313k7288m961J4433J2158K574k873j0974j8166m782K6790M0153J3019
-15002F30112k4796k6933O555K8099P511k5578k2769J2709K8301m23l1558k0576J1219J3794
-14988E85667j0183j5462N772J5808N352J0539M0254M9622J3892k7335l2442j3721K540K0908
-14974F51211M3022L8217o411m8427m7207k0000j58J6078L5320K8271j7575n0030k1842K7578
-14960F28047K7818j4930l6364j7312M026Q635J4191K1762J0561j4127k4152j7841j5804j4749
-14946E59761L647K8204L4244L1263M0997M4871J3552k7855l1398r803j5626m5766m5498p468
$$ plain form
-15044 589201 612697 616319 609295 614700 632828 636328 603877 552265 525384 544467 577346 575490 539344 518670
-15030 518670 539521 565172 553631 521674 513237 527263 525073 499821 488098 509266 539766 558849 576991 601184
-15016 601184 610342 590029 562741 557780 572213 584371 586945 584072 573098 554932 550150 576940 617093 630112
-15002 630112 605316 578383 584938 613037 620548 594970 572201 584910 613211 612788 581230 560654 571873 585667
-14988 585667 575484 560022 565794 581602 586954 597493 637747 687369 701261 673926 641484 627763 630303 651211
-14974 651211 694233 732450 726039 677612 630405 610405 610247 626325 661645 689916 672341 622311 600469 628047
-14960 628047 655865 640935 604571 587259 591285 599920 614111 635873 646434 632307 608155 590314 574510 559761
-14946 559761 563408 591612 625856 657119 698116 742987 756539 728684 697286 687483 671857 626091 580593 573125
-14932E73125J4808J824m042J6250K3051m537k5957p487K5850L8605L2646J8800q220l9101
-14918F55615m2775j6393K183o345j6610j0492n684j2253j1205K281M831n445J494K7397L2750
-14903E99349Q775M46K5569L4531o087m8855l7055P554K3865O75k5829l3802k5983l165K8297
-14888E48285M2634K5170k019j2730j0526o231O133K4589K5733N135n295R668J7796m900k9194
-14873F34248k1774K90N688P41K300j951j9234j7152K3647N8399L8177r557k2032J661Q714
-14858F82165j8203m3871m5693l7223k7235o872J9952L5248L5406K7706R331j5422j7112J6306
-14844F14483M1101J4006l3520l7517k382R693j6018k7517p82K0852N509j5529q032J0321
-14830E74668J3266J4998L2609M0059P936l8193m7120j4095J8200K1475O717p780j6984j5694
$$ plain form
-14932 573125 587933 589757 585715 601965 625016 620479 594522 587035 612885 651490 684136 702936 694716 655615
-14918 655615 612840 596447 598630 592285 575675 565183 559499 547246 536041 538322 543153 537708 539202 566599 599349
-14903 599349 608124 608570 634139 668670 662583 613728 576673 584227 608092 608767 582938 549136 523153 519988 548285
-14888 548285 590919 616089 614070 601340 590814 584583 590716 615305 641038 646173 640878 650546 668342 663442 634248
-14873 634248 612474 612764 618452 619193 621493 619542 600308 583156 606803 665202 703379 693822 671790 673451 682165
-14858 682165 663962 620091 574398 537175 509940 503068 523020 558268 593674 621380 630711 615289 598177 614483
-14844 614483 655584 669590 636070 598553 596171 605864 589846 562329 561547 582399 587908 572379 564347 574668
-14830 574668 587934 602932 635541 675600 683536 645343 598223 584128 602328 623803 630520 622740 605756 590062
-14816E90062K649K4541K0316j5876m8927m2436l803K7470K9219J5892J0279J6130K4645L0009
-14802F80170K7634J1819j1950k5794k4049k3281l1454k8241j342J9858M635k2802j5667J6532
-14788E76068J8409j9689m2791k0013R670R664M361K3453L9901J7540j8956k1038L124N176
-14774E84879k0701l0407l958K4241J9085q479k1875m868K1716K2108j1119l6434r246M7397
-14760E72339N7904m76n3664l0026L8116O3368K2705k9274m6520l2611o058J9735K4750J11
-14746F00399k3754j1498J8988J9586j0829k3671J535K7728K0775m877j7129q069R531K0308
-14732F19023J2218j1647k5548r975J6191K0695O844K804J0392O195r990j2687J128N118r239
-14717F21522k0634j9991k2588k9301j7789J4435L7431L4230K2923J9475J4260J123n002K311
$$ plain form
-14816 590062 592711 617252 637568 621692 572765 530329 526526 553996 583215 599107 609386 625516 650161 680170
-14802 680170 707804 719623 707673 681879 657830 634549 603095 574854 573512 593370 598005 575203 559536 576068
-14788 576068 594477 574788 531997 511984 521654 531318 535679 559132 599033 616573 597617 576579 579703 584879
-14774 584879 564178 533771 529813 554054 573139 564660 542785 537917 559633 581741 570622 534188 524942 572339
-14760 572339 630243 629767 576103 546077 584193 647561 670266 640992 594472 561861 555803 575538 600288 600399
-14746 600399 576645 565147 584135 603721 592892 569221 570756 598484 619259 614382 597253 589184 598715 619023
-14732 619023 631241 619594 594046 584071 600262 620957 627801 630605 640997 647192 637202 624515 625643 630761 621522
-14717 621522 600888 580897 558309 529008 511219 525654 563085 597315 620238 639713 653973 655096 650094 652405
-14703F52405N204o553j6190r411K946P110N652J000j3664l2334l1285l367K5444K9694J4828
-14688F31479R46l824j269O344J1728N596o986j0062k270M67p094j0029J358J6305K0433J0645
-14672F63767r552l1419l7292j7119J0820J7633J752j3433j6363j4026n087J9331M3950L4246
-14658F47208j3728n7004n5345j6942J9117K9265K1344J4299J3314O778j0549j8723K800L3091
-14644F14925K7149j3965l3931n800K3529J0862j3708q627l96k9008n7864k6557L6009M8290
-14630E70908R918l195K6233L4992M281l778L4448N2470Q437m0518l4236o90O097r929k1816
-14615F33622l4704n0491l7298R911L5663O688k7290j2497K4113K9680J2844J1197J7205L079
-14601F21722j8753k2876k2834l6074l4119R884N8203N6690J7100q843r507q450p272O830
$$ plain form
-14703 652405 657609 651056 634866 625455 628401 635511 641163 642163 628499 596165 564880 561513 586957 616651 631479
-14688 631479 632425 628601 627332 633676 645404 651000 644014 633952 631682 632149 625055 615026 616384 632689 653122 663767
-14672 663767 654215 622796 585504 568385 579205 596838 598590 585157 568794 554768 549681 569012 612962 647208
-14658 647208 633480 576476 521131 504189 523306 552571 573915 588214 601528 608306 597757 579034 581834 614925
-14644 614925 642074 628109 594178 588378 611907 622769 609061 600434 600038 571030 513166 486609 522618 570908
-14630 570908 580826 577631 603864 638856 643137 639359 673807 726277 734714 694196 659960 659270 665367 655438 633622
-14615 633622 598918 548427 511129 521040 556703 563391 536101 523604 547717 577397 590241 601438 618643 621722
-14601 621722 602969 580093 557259 521185 487066 496950 555153 611843 628943 620100 610593 602143 594871 601701
-14587F01701J9560J1212k431N20N851k928m916J3711J7792j6599m5265k4204J1991J2858
-14573E98853M120L0548N3411Q814o3522o3447J0394N7619L3445j739k902j892k0654k2969
-14559F20079P065K3554j191k7503j9094K184Q197Q633J0448m508k8769k0074K3189M2369
-14545F44579J2116j3822N048K5643n91m0359l5764O1J4385M559N711J5519J980k9171l9776
-14530E70118k5199j5664j5708K07K9514L6285J5461Q650L4248M9137J3763l9830m7904n547
-14516F07531K7239J0921k2044j9086J8071M0522K0311k0850m9242n4178l9144r234J8091
-14503E28908J8011o128j7328M072L0105L0302J7392J5042J0019j8388m4354k5442K4117M5756
-14489F12084K2131k570N136K5571K8948J6119r69k0912l7220l4763j8004j1474j8827j4431
$$ plain form
-14587 601701 621261 632473 630042 630562 636413 633485 628569 642280 660072 643473 598208 574004 585995 598853
-14573 598853 602973 633521 686932 695746 632224 568777 579171 636790 670235 668496 665594 663702 643048 620079
-14559 620079 627144 650698 649507 622004 602910 605094 613291 621924 632372 627864 599095 579021 602210 644579
-14545 644579 656695 642873 647921 673564 672973 632614 596850 596911 611296 615855 621566 637085 639065 609894 570118
-14530 570118 544919 529255 513547 513754 543268 579553 595014 603664 637912 687049 700812 660982 613078 607531
-14516 607531 634770 645691 623647 604561 622632 663154 683465 662615 613373 559195 520051 510817 528908
-14503 528908 546919 540791 523463 527535 557640 587942 605334 620376 630395 612007 567653 542211 566328 612084
-14489 612084 634215 631645 636781 662352 691300 707419 706450 685538 648318 613555 595551 584077 565250 550819
-14475E50819J0829L0071K4643J4418K1854L4175K5523m708l6005n1168m1974j0469K1640
-14462E89648K5864K693j6304j3126m695n911j087K3512M3329K4466k2445m9190l1257L282
-14448E68779J4315P68n503J0692K7092K1457P901J0854J8270k52l2957l3460R92J5071j4728
-14433F09291l4699j624M0841L4008K905Q144L6801K7711j6445l3223q784P381j810K10J9048
-14418F89755J2912j9602k3448J2457K4847j5949n0116k8101R323O169k0011k3737r197k211
-14404E63091N165K3014K1920j7161n1809l6062O563K5378K2430K9502L7883J7814j3718j1852
-14390F22158J9208K8992q2k8506k0522J0826K7631J0631k4346l9981j5748K0403K0604j4855
-14376F16413l2905o568K4909K0751j090m335O113P142L746R316J1780Q09l708Q784Q121k4055
$$ plain form
-14475 550819 561648 591719 616362 630780 652634 686809 712332 707624 671619 620451 578477 568008 589648
-14462 589648 615512 618205 601901 588775 584080 578169 577082 600594 643923 668389 645944 596754 565497 568779
-14448 568779 583094 583862 578359 589051 616143 637600 645501 656355 674625 674373 641416 607956 608948 624019 609291
-14433 609291 574592 572968 613809 647817 650722 658866 695667 723378 706933 673710 664926 672307 670497 670707 689755
-14418 689755 702667 683065 659617 672074 696921 680972 630856 602755 612078 618247 598236 574499 565302 563091
-14404 563091 568256 591270 613190 596029 544220 508158 514721 540099 562529 592031 629914 647728 634010 622158
-14390 622158 641366 670358 670276 641770 621248 632074 659705 670336 645990 606009 590261 610664 631268 616413
-14376 616413 583508 576940 601849 622600 621510 617175 623288 630430 634176 643492 655272 656081 652373 661157 669278 645223
-14360F45223m9170l0320K214J729j4250O17L4518L7160P796p254L977P417r767k1534j4246
-14345E94110k285P793K0292K2211M39k0382p729J9713J6798j1906j9027N971K4052J5178
-14331F65228R46o556k0384l4347k0115J7253L3448J0903j7327k4614k3746k5701j3374J9070
-14317E60684M1006K6931n694k2308j2417R821K5164K0027l313k3583k5020j8989j9937j5729
-14303E36643N901J9676l041l5979k7384J7569M0919K1358J331J3590L6643M1577L2672J9556
-14289G21031n268l6632m4411j6195K0002L5265L1620K0048o38k6716m2137m1628l4374j9558
-14275E60409R329L4030K6339j843q391J1229J5473j1342l1662k0075m125j0925k0079m411
-14261E43956K1295K7246J3285l415j6458k0449l210K8084M3226L2698K2056K3028J0791k4509
$$ plain form
-14360 645223 596053 565733 567947 569676 555426 556043 590561 627721 635517 628263 632240 639657 629890 608356 594110
-14345 594110 591825 599618 619910 642121 642560 622178 614449 634162 650960 639054 620027 625998 650050 665228
-14331 665228 666174 659618 639234 604887 584772 602025 635473 646376 629049 604435 580689 554988 541614 560684
-14317 560684 601690 628621 622927 600619 588202 598023 623187 643214 639901 616318 591298 572309 552372 536643
-14303 536643 542544 562220 559179 523200 495816 513385 554304 575662 576993 590583 627226 668803 701475 721031
-14289 721031 715763 679131 634720 618525 638527 673792 705412 725460 724822 698106 655969 614341 579967 560409
-14275 560409 569738 603768 630107 628264 619873 631102 646575 635233 603571 583496 579371 568446 548367 543956
-14261 543956 565251 592497 605782 602367 585909 565460 562250 590334 633560 666258 688314 711342 722133 697624
-14247F97624m7318l2203r391j4611k9621j7476J3215K6648J9342J4177J2783L86j4396r692
-14233F09467O898P610p016q700R096J9377N352j5641k1345j2998l684L009J0736J7102J3797
-14218F33060p81j3600p603J4705K5489L327l3603m5419k0645J3573L1295L0621J3709k1894
-14204F22234n7963n5104k494N4523O2262K0185k5664l8097j9126N274J4056Q088M251Q469
-14190F00894J979k7244m8869k0217M6616Q6487O2705J0559j8373k0234k1742k8670k3901
-14177E99990k003K0322K2948K59l0767l8962j3343J3686M345k6361k8151P698L4963K6046
-14163E90670R076J2064K0008J5933J7192L4922L9254N901l7104m9292l4349j8731m671J4460
-14149F15333K0545k861l2050l2743j0218O890J2343J5655J2193j735o297R628J7103q742
$$ plain form
-14247 697624 650306 618103 608712 594101 564480 547004 560219 586867 606209 620386 633169 633555 619159 609467
-14233 609467 616365 623975 616959 608259 617355 636732 642084 626443 605098 592100 588416 591425 602161 619263 633060
-14218 633060 632279 618679 611076 625781 651270 654597 620994 575575 554930 568503 599798 630419 644128 622234
-14204 622234 564271 509167 506673 561196 623458 643643 617979 579882 560756 566030 580086 588174 592425 600894
-14190 600894 602873 575629 526760 506543 553159 639646 702351 712910 694537 674303 652561 623891 599990
-14177 599990 597987 618309 641257 641516 610749 571787 558444 572130 576475 550114 521963 529661 564624 590670
-14163 590670 599746 611810 631818 647751 664943 699865 739119 745020 707916 658624 624275 605544 600873 615333
-14149 615333 635878 633017 600967 568224 558006 564896 577239 592894 605087 603352 597055 606683 623786 615044
-14135F15044l6898k2803J6648K5956j618j6848M934L0513K6884O936n06P068J1719J999j7814
-14120F51214l2030k4514K411K3600J8870k790k0044k7316k9109k1214M54K3197L0497K3381
-14106F16607J4105R837J3034K1939K2862M924j2339k0K4231Q309m8647p7896m1135P752P498
-14091E71061j7395q816K4170K7537l961k5944k0291p951Q13J1571J5759R007J8872N8228
-14077F52660P7920L2088l5094m4384l005J3302j2797k3939m38P033k4443m7574l0271n847
-14063E55211m921p690J833Q50j6296j1137K8889N1960J9499k8003l0563O573L3177K6601
-14049F25983L039j8201k7310k0544p697l257J48K0779M5175L7214k140l0685l0177k4551
-14035E67776k1806R22L5469L3042j2387l7601o549L1102K4577J788P487K0507J265k6306
$$ plain form
-14135 615044 578146 555343 571991 597947 596329 579481 584415 614928 641812 648748 648242 655310 667029 669028 651214
-14120 651214 619184 594670 597081 620681 639551 636761 616717 589401 560292 539078 539532 562729 593226 616607
-14106 616607 630712 640549 653583 675522 698384 703308 690969 690949 715180 723489 674842 596946 555811 563563 571061
-14091 571061 553666 544850 569020 596557 592596 566652 546361 538410 539223 550794 566553 575560 594432 652660
-14077 652660 730580 762668 727574 683190 680185 693487 680690 656751 656313 663346 638903 591329 561058 555211
-14063 555211 550290 542600 544433 545283 528987 517850 546739 598699 618198 590195 559632 566205 599382 625983
-14049 625983 629022 610821 583511 562967 555270 552013 552161 572940 618115 655329 653189 622504 592327 567776
-14035 567776 545970 546892 582361 615403 603016 565415 558866 589968 614545 616333 623820 644327 645592 619286
-14021F19286j4964J8031J8010j5068l2676k1335j3013j9089j5761M786K0789J9485P498j2160
-14007E63819l3724l0959J0733N5825N7151K2120m495j0282j7534k7873k1312n924j0842k8207
-13993E18496j9123J6967L5988K2954J3753K5371K1952j9550n9594n0075k054L7510M9247
-13980E91842M6886M0350K6967Q159j0624k8374m1466m0451k6527j5409j3604j0224k466l581
-13966E21478j1943l346K4784L5116P180k0213m861K8363K5156q418j5276J8422M4391L7453
-13952F78286L1853M6424M0032j3331o2453n1602j0642l234j9299l98M6097N0145K45l1362
-13938G00761r712O042k8900o2156l4256J6602J9044j2402j0357K5267L2257q99j7689M296
-13924F27898J6903j1461m2907l4768j315K0316K0591O820j6653l1830r993M1523P0512M5188
$$ plain form
-14021 619286 604322 622353 640363 625295 592619 571284 558271 539182 523421 528207 548996 568481 575979 563819
-14007 563819 530095 499136 509869 565694 622845 644965 640470 630188 612654 584781 563469 557545 546703 518496
-13993 518496 499373 516340 552328 575282 589035 614406 636358 616808 557214 507139 505085 542595 591842
-13980 591842 638728 679078 706045 714204 703580 675206 633740 593289 566762 551353 537749 527525 525059 521478
-13966 521478 509535 506189 530973 566089 573269 553056 548195 576558 601714 593296 578020 596442 640833 678286
-13952 678286 710139 756563 796595 783264 720811 669209 658567 655333 636034 635636 681733 731878 732123 700761
-13938 700761 691049 697091 668191 606035 571779 588381 607425 595023 584666 609933 642190 641291 623602 627898
-13924 627898 644801 633340 590433 555665 554350 574666 595257 602077 585424 553594 543601 585124 655636 700824
-13910G00824k553k4431j6741p376q417j1001j0394j0710j3085j3055l627J9231M1430L1605
-13896F71700j6943n8092m4855R57J9595O355J1227M2090M2255j0420n3499l2563J4921K0652
-13882F13380j4886l8663k8091n481Q544J1614N969J610J3992L3446K5777j0696k6694N572
-13868E95393M1348K7879j6614l7451k5274j0118R19K3246M7093M3703J2910j8284l6391m3531
-13854F04828l2763j003K6420K3460L590l580J23m769j1829j760J5128J2397o424j4569n293
-13839F03956O661J3916J4068l228l2598m0054j1347J5030N750j0050O019K7022O635l0695
-13825E71085k5166J2008J5611j6361j6432L0037N1000P669l7746k2307K0334K1849j3362
-13812E98219k5625N503M0940M3311J5482j6969l2498k6011j1328o019p782l8J6686K2347
$$ plain form
-13910 700824 698271 673840 657099 649723 641306 630305 619911 609201 596116 583061 579434 598665 640095 671700
-13896 671700 654757 596665 551810 552767 572362 578717 589944 632034 674289 663869 610370 577807 592728 613380
-13882 613380 598494 559831 531740 526259 534803 546417 552386 553996 567988 601434 627211 616515 589821 595393
-13868 595393 636741 664620 648006 610555 585281 575163 576082 599328 646421 690124 703034 684750 648359 604828
-13854 604828 572065 571062 597482 620942 624532 620952 621075 616306 604477 602717 617845 630242 623818 609249 603956
-13839 603956 610617 624533 638601 635373 602775 562721 551374 566404 572154 562104 568123 595145 601780 571085
-13825 571085 545919 557927 573538 557177 540745 570782 621782 629451 591705 569398 589732 611581 598219
-13812 598219 572594 578097 619037 662348 677830 660861 628363 602352 591024 585005 577223 577185 593871 616218
-13798F16218J2158O440J5050J8981L247j5422j3311M173R689j0589m0550n0448k7104R396
-13784E37928K5078J2992O18O801J4052L870o002Q272L0611K8847Q985K112O985p390m3453
-13769F30306o4166m6369r186J6332J6921k204j9623q510K6896M1759J1537k0401j204M7897
-13755F19985O2199L0160k935j5538k6244l5663k3332l382j1343l1320j1526L9741N4578J7407
-13741F62787q451Q531J7973j4162m2582k8793j1297k8312m1245o170L7552K8181j3765k1719
-13727E38528P091J7379m992j4836J0822L6189K4329j2399l4453k2155Q793K7109J9954O961
-13713F08320R063J2771m850k4953r051K8043K8569j2795l2097K04L0698J7039k754J1079
-13699F59286K1371j6211o2655n3991o415J7533J2859J9725L4313J8736j4482j3304K1066
$$ plain form
-13798 616218 628376 634816 649866 668847 672094 656672 643361 647534 657223 646634 606084 555636 528532 537928
-13784 537928 563006 575998 576616 583417 597469 601339 595337 603609 634220 663067 672052 674164 681149 673759 630306
-13769 630306 566140 519771 510585 526917 543838 541634 522011 513501 540397 582156 593693 573292 572088 619985
-13755 619985 682184 712344 709409 693871 667627 631964 608632 605250 593907 562587 551061 590802 645380 662787
-13741 662787 654336 662867 680840 666678 624096 595303 584006 555694 514449 508279 545831 574012 560247 538528
-13727 538528 545619 562998 558006 543170 553992 590181 614510 602111 567658 545503 554296 581405 601359 608320
-13713 608320 617383 630154 625304 600351 591300 619343 647912 635117 603020 603224 633922 650961 648207 659286
-13699 659286 680657 664446 601791 547800 541385 558918 571777 591502 625815 644551 630069 616765 637831
-13686F37831L1992K660k1275j5696j3573l6012n0357k5944J6092L7048L0162J4658Q009J8242
-13672F33837L9121M5359J6976k8900n5472n3505m3046l2183q556K5989M5002K9669r953m7540
-13658E56798n8072l1586J1166L0712J7793R317K9490M5368K0802j6442j6396P843K257l2460
-13644E76590l9549l309K3934R008j3868q884N849K818m505N076J6311P567n650K494K1140
-13629E95022K2068R673J1711K7611K4277j1476m6156l9400N111M3278M0795Q558j4965r094
-13615F67013J0620J7059J970k2010l7439l3582j2975P022J0068K250L299J4282J6163N130
-13601F48870M63O084k032l0463m5415k3329Q123J4162Q272K2949M9925N4396L1200L241k1084
-13586G25362m5027n3045l0403k185m245k2630j2107K8347N0080K8229p979k5808k5252j5841
$$ plain form
-13686 637831 669823 672483 651208 635512 621939 585927 535570 509626 525718 562766 592928 607586 615595 633837
-13672 633837 672958 718317 735293 706393 650921 597416 554370 522187 513631 539620 584622 614291 604338 556798
-13658 556798 498726 467140 478306 509018 526811 536128 565618 610986 631788 615346 598950 606793 609050 576590
-13644 576590 537041 533732 557666 566674 552806 543922 549771 552589 548084 553160 569471 577038 571388 573882 595022
-13629 595022 617090 626763 638474 666085 690362 678886 632730 593330 598441 641719 682514 691072 676107 667013
-13615 667013 677633 694692 696662 674652 637213 603631 590656 597678 607746 609996 613295 627577 643740 648870
-13601 648870 649333 655417 653385 622922 577507 554178 562301 576463 584735 607684 657609 712005 743205 746446 725362
-13586 725362 680335 627290 596887 594702 590457 567827 555720 584067 634147 662376 654397 628589 603337 587496
-13572E87496O76J3553O944r322q008J0076J6123M248M81J1377Q346j9192l7726k1950L043
-13557E66165K427j3292p981K1556L9810K2502j2841l2180k5856j2639p204J57K0247L5682
-13543E96553K1400j0782k2363o086O086J393M568K0575J5757j3103j2859L6122O6646K4992
-13529G28899l3950l1709M744m904n1215n3900n538J8354n819j8039N773J3163j4990j9382
-13515E31487K6893N8361K5293k1241j6509J6122J8627l409o099J0999J3490n209k2917k8502
-13501E97386k2846l874J7599J5839q854k0101r37J8463J2629k192q030j5201k4989j3060
-13487E41832J8578K6461j628j4976J6982M7091K6551j5023k2994l311N738M544J2066J3229
-13473F55140q713k1459Q004M4093L0567j6742l5410j5663k709j1911j4197k963n247k0094
$$ plain form
-13572 587496 588172 601725 608669 599347 591339 601415 617538 621786 622267 633644 641990 622798 585072 563122 566165
-13557 566165 568592 555300 547319 568875 608685 631187 618346 586166 560310 547671 540467 540624 560871 596553
-13543 596553 617953 607171 584808 578722 584808 586201 590769 611344 627101 613998 601139 637261 703907 728899
-13529 728899 694949 663240 667984 663080 611865 557965 552427 570781 564962 546923 552696 565859 550869 531487
-13515 531487 558380 616741 642034 620793 604284 620406 639033 635624 629525 640524 654014 648805 625888 597386
-13501 597386 574540 570666 588265 604104 595250 575149 574212 592675 605304 603112 595082 579881 554892 541832
-13487 541832 560410 586871 585243 570267 587249 634340 660891 645868 622874 619563 625301 629845 641911 655140
-13473 655140 646427 624968 632972 677065 707632 690890 655480 639817 637108 625197 611000 608037 602790 582696
-13459E82696j1699K1387K9619j1026n3581m1590J4432N1100K9014k4298m6974j2378L9702
-13446E66404N1221J8876p787j347J0891K834q622n559p449k8663l8911j2982J6128O600k0217
-13431E41417j4882J6352K4126j504k1861j7459q021m308P048K4261K3361P86j6223j2642
-13417E40451o230j3838k3554j2584K1420N3306N1863J6558q709J5940O1421N4495j7464p7035
-13403F56040o2726j1929P103m356k374J4733J7495J0682J6647J6926j6887n2491l4283J9493
-13389E74073L7269R515P19L5686N6526J9684l5549n2714l5427j9709j3302k440J1397J6044
-13375F01772J1209L881l562p659k806O847J1092J0755J2559J0522m490k1017j7587N760K8566
-13360F45842L6161K5406k033l0299l2503q154O843m329o961K4636N2475L2763p128j3108
$$ plain form
-13459 582696 570997 592384 622003 610977 557396 515806 530238 581338 610352 586054 539080 526702 566404
-13446 566404 617625 636501 628714 627367 638258 641092 632470 626911 619462 590799 551888 538906 555034 561634 541417
-13431 541417 526535 542887 567013 565509 543648 526189 518168 513860 520908 545169 568530 569316 553093 540451
-13417 540451 534221 520383 496829 484245 505665 558971 610834 627392 618683 634623 696044 750539 733075 656040
-13403 656040 593314 581385 588488 584132 581758 596491 613986 624668 641315 658241 641354 588863 554580 574073
-13389 574073 611342 620857 621576 657262 713788 733472 697923 645209 609782 590073 576771 574331 585728 601772
-13375 601772 612981 616862 613300 605641 602835 609682 620774 631529 644088 654610 650120 629103 611516 617276 645842
-13360 645842 682003 707409 705376 675077 642574 634420 641263 636934 629973 654609 707084 739847 732719 719611
-13346G19611L906o783l9708m1803p329J4600O096k276j465j4237l0682j3293K2782J5882
-13332F25301l7919o7852m0483q161j1778j3791K5649P3058P4879L5747l491k4012k7294j5146
-13318E84707k912j1942k5227M13N5123O8451J3257m4594m2645p750M547n83J0236K3325N209
-13303F29615k4473j6082K7316M9594K1026k7637n1041l5511n12K1791J2145j5083k6299j2836
-13289E52013o19o649j3220o88K1802L5566L6784K7599R531l108O788K6556K5293M932j282
-13274G21298J1001P725j9533l4681k2777j7516l4776l6657N50L6592K9955K985k596O385
-13260F47955k81j8490k4617j9164j4754p313N923J0144M465J2862L5228L3598N75j2677J9350
-13245F72804M1365K929n3532n8024k1626n566j6676j2870R135J0792j1755j8908M601L1192
$$ plain form
-13346 719611 723517 716734 677026 635223 627894 642494 648590 646314 644849 630612 599930 586637 609419 625301
-13332 625301 587382 519530 479047 470886 459108 445317 470966 544024 618903 654650 651159 627147 599853 584707
-13318 584707 581795 569853 544626 545039 600162 668613 681870 637276 594631 586881 591428 590845 601081 624406 629615
-13303 629615 605142 589060 616376 665970 686996 659359 608318 572807 572295 594086 606231 591148 564849 552013
-13289 552013 551394 544745 531525 530837 552639 588205 624989 652588 662119 659011 665799 692355 717648 722580 721298
-13274 721298 732299 740024 720491 685810 663033 645517 610741 574084 574634 611226 641181 644166 641570 647955
-13260 647955 647674 629184 604567 585403 570649 563336 569259 579403 583868 596730 631958 665556 666131 653454 672804
-13245 672804 714169 717098 663566 605542 583916 578350 561674 548804 557939 568731 556976 538068 542669 573861
-13231E73861L8567K7297j512l7930m5881o120L7398K9067j3840k7302j24J7241O16j7427
-13217E73911j2523k981m730m428N443R214J096l712k580j1111k4804j5274K0112M2762K6963
-13202E97358j522l177K0985L5103J6835j7288l3454j9509K889R432P875K1453M2444L6639
-13188G16063J108k4086j9665j7734l9880n1605k1067J8703J9012o597j1517L175k80k0973
-13174E44657j9416J1308L3102K4645O536N06N265J5041K5436K2728J483j4585l809J4205
-13160F67102Q784q584n614J1541J0727n993q317K327n918l3887m4481k2798M490J6521K1029
-13145F06929K3932J8030Q189R259J4770M881j2952j0420J2045K1195K593j8722j6806L641
-13131F66564J8949J0354j9029l6908j0705L8655M5742p277n0667k4427K9569L4469l377j9190
$$ plain form
-13231 573861 612428 639725 638213 600283 554402 548282 585680 614747 600907 573605 573481 590722 591338 573911
-13217 573911 561388 558407 553677 549249 554692 563906 565002 561290 558710 547599 522795 507521 527633 570395 597358
-13202 597358 595836 592659 613644 648747 665582 648294 614840 595331 598220 607652 615527 636980 679424 716063
-13188 716063 717171 693085 673420 655686 615806 564201 543134 561837 580849 574252 562735 565910 565630 544657
-13174 544657 525241 536549 569651 594296 600832 601338 606603 621644 647080 669808 671291 656706 652897 667102
-13160 667102 675886 667302 661688 673229 683956 677963 669646 671973 666055 632168 587687 564889 569379 585900 606929
-13145 606929 630861 648891 657080 666339 681109 685990 673038 662618 674663 695858 698451 679729 662923 666564
-13131 666564 685513 695867 676838 639930 629225 667880 713622 706345 655678 631251 660820 695289 691912 672722
-13117F72722j910M976l023J1254L9989L2218r914k3703R673L5078J8217p856j5210k3600
-13103G38911m0934l3953N894L3072K2038R539K4575L4899P860k6193j9198K3715O0804P0850
-13089I11879N9738L7760J9192J9868L3799L7016K8816L9930Q7712J55712K31394L33811M87279
-13076B483906O80323Q42681Q48082N83444P8528m53340p76160q32023p30618n74876l92472
-13065A757475k21279j31954j27460j22304p0080k7751m8050r0789r4675o4752l4408n679
-13053G18294K1107K0106q088j6950Q374J7196j7576m5186k4403L995p913l2879k5879l956
-13039F06242j827l053J6798L0881J3454L9K4557M6387J5367l6392m6135k2304j3582j3853
-13025F16579J4722N1857M2345n156k6810n696J1743J551o427R142K7198K3449o77l2365n4578
$$ plain form
-13117 672722 670812 675788 672765 684019 724008 756226 746312 722609 732282 767360 785577 777721 762511 738911
-13103 738911 697977 664024 669918 702990 725028 734567 759142 794041 801901 775708 756510 780225 841029 911879
-13089 911879 971617 1009377 1028569 1048437 1082236 1119252 1148068 1187998 1275710 1431422 1662816 1996627 2483906
-13076 2483906 3164229 4006910 4854992 5438436 5516964 5063624 4287464 3455441 2724823 2149947 1757475
-13065 1757475 1536196 1404242 1276782 1154478 1084398 1056647 1008597 917808 823133 758381 723973 718294
-13053 718294 739401 759507 751419 734469 742843 760039 742463 697277 672874 676869 668956 636077 610198 606242
-13039 606242 604415 601362 618160 649041 662495 662534 687091 733478 748845 712453 666318 644014 630432 616579
-13025 616579 631301 683158 725503 720347 693537 687841 699584 701135 694708 703850 731048 754497 753820 721455 666877
-13010F66877m4833j998L6046L5008R314o297o952n270J958J4743O980l2315o2942m5238j161
-12995E63920K1402J7497J1860P672j548J590K7775M5005K3762j0951k2747k4033l8279m1159
-12981E81766m617L5247K6235j2034k0904J309J0751L235R163J9656m64l4458k9147J2613
-12967E98351L2379J2138m684M476J0023n173j5481m429Q727R658P638M413q970j9636m719
-12952F24711K1802K2800K25o605J2047K2052M945j5950j8641j0826n988m236j464P047K5193
-12937F77112L7228J3585l6031n0500k93N5326M7758j786k5684j6526j6212k7576j8632L668
-12923F41437N253l244J3633L7950K3400j2968j1941K1878K6545o871k4188j1108r320k1304
-12909F69152n66M5556M7116n808l4141k965J6954k5683o9362m0521K8230N6222L4875J6153
$$ plain form
-13010 666877 622044 620046 656092 691100 700414 694117 687165 681895 683853 698596 705576 673261 610319 565081 563920
-12995 563920 585322 602819 614679 622351 620803 622393 650168 695173 718935 707984 685237 661204 622925 581766
-12981 581766 577149 612396 638631 626597 605693 607002 617753 620988 630151 649807 649343 614885 585738 598351
-12967 598351 630730 642868 638184 642660 652683 647510 632029 627600 636327 645985 653623 658036 649066 629430 624711
-12952 624711 646513 669313 669538 662933 674980 697032 701977 686027 667386 656560 650572 646336 644872 651919 677112
-12937 677112 714340 727925 691894 641394 641101 696427 744185 742399 716715 700189 683977 656401 637769 641437
-12923 641437 646690 643446 657079 695029 718429 705461 693520 715398 741943 735072 710884 699776 690456 669152
-12909 669152 668586 714142 761258 755450 721309 718344 735298 709615 640253 599732 627962 684184 719059 735212
-12895G35212K0292K2733R268j0215k8354m1406l7971j5338P197J0573l183k0701k8222j3026
-12881F06859J9754L7400J9301m508M410K6806J4984k3851l5400n518K4000K7129J8293N575
-12867G35234j6419k7617l672K5517R495l3311l7799j738J3406n374l692L3498N1552K4872
-12853G63952m475j0315j4917j7399J4074N5420L6538l1059m7546J3626N3513J1554l6602
-12840G86364j7005K0509P472j8132N297M0383K1106k0633r171M2412N8422K5390l263l580
-12826I35571N95j176O349L0216P0173J24378J55599J01831k9716j34175j33424p5856n0736
-12813I99629n9997m7729o891K2864K8291K2272L202k3086j8315K9837O4536L7212j3332k1674
-12799A016819P792K9083L3340L2398J0242l7490o0082k1046L1769L7386J6693K0183L1674
$$ plain form
-12895 735212 755504 778237 787505 777290 748936 707530 669559 654221 661418 671991 668808 648107 619885 606859
-12881 606859 626613 664013 683314 678806 683216 710022 725006 701155 665755 660237 684237 711366 729659 735234
-12867 735234 718815 691198 687526 713043 722538 689227 651428 649690 663096 657722 654030 687528 739080 763952
-12853 763952 759477 749162 734245 716846 730920 786340 822878 791819 744273 757899 811412 822966 786364
-12840 786364 769359 789868 797340 779208 784505 824888 845994 825361 816190 858602 917024 942414 939151 935571
-12826 935571 936166 934990 941339 971555 1041728 1166106 1321705 1423536 1393820 1259645 1126221 1050365 999629
-12813 999629 939632 891903 885012 907876 936167 958439 961641 938555 920240 950077 1014613 1051825 1038493 1016819
-12799 1016819 1024611 1053694 1087034 1119432 1129674 1092184 1032102 1011056 1042825 1080211 1096904 1117087 1148761
-12786A148761J2322n286L4136R9984J16626Q8834Q6354J19953J33137J10534R8049J16273
-12774B159677J47412K09609L48847N56631Q16811J260976K107198L271263M085493L642210
-12764A8606127J626489j179066l366815m012286l329833k241695j437025r75307o54001m19879
-12754B616709l14162k70348j86442r1337o8913r1048p4439l7202n1383r1079p2915j1263
-12742A256178N408l2768n6907n0247n5508o9529m9383r589j800j4296J050K4640M148l0673
-12728I20724p288N3854O3165Q634l8032m8054n1007m0314J2803O4435M5561n727P983P1919
-12714A058656P7340J1045k4402M710J3070l5551o0257j5661K4636K043l0488j6151O247j6144
-12700I99093n4936n5421j9899J6576L5892K8332n304k2836J9267Q1892P8180M794m8440l5521
$$ plain form
-12786 1148761 1161083 1155797 1189933 1289917 1406543 1495377 1581731 1701684 1834821 1945355 2043404 2159677
-12774 2159677 2307089 2516698 2865545 3422176 4238987 5499963 7607161 10878424 14963917 18606127
-12764 18606127 20232616 19053550 15686735 11674449 8344616 6102921 4665896 3690589 3036588 2616709
-12754 2616709 2302547 2032199 1845757 1754420 1685507 1594459 1520020 1482818 1431435 1340356 1267441 1256178
-12742 1256178 1261586 1228818 1171911 1121664 1066156 996627 947244 937655 935855 921559 922609 947249 951397 920724
-12728 920724 913436 967290 1030455 1039089 1001057 953003 901996 861682 874485 938920 984481 978754 986737 1058656
-12714 1058656 1135996 1147041 1122639 1127349 1140419 1104868 1044611 1028950 1053586 1055629 1025141 1008990 1015237 999093
-12700 999093 944157 888736 868837 885413 921305 949637 944333 921497 940764 1022656 1100836 1105630 1057190 1021669
-12686A021669q192j0810j5781L748K2062J6184O76j5819l8895m2838N825P2467Q5214M6080
-12672A141590K4116L7161L6643J2574J0482L4796L7743J4194P396J6099L72k1749K699M6104
-12658A400220L3686r667J3911R4621J11211K9882m4355m7279l5468m7113l5526P360R360
-12645A480843m1452n5054K805M9113L7339L1935O8151Q0155L6983R955L3283L5394j8148
-12632A751302n1231k0173Q165m455O769O5699Q2501J3078n0252l8411j6212m1728n7315j8615
-12618A629122R154j3575q486P1447J36988J14507O8602O7057O1580J2925o723M6464Q4698
-12605B273760M3935L754L1805N2812J141m0897M224N8437L4003k918L8734J08868J22533
-12592B730191J08703J15544R4581J6037l0076J9649R0132J24588J91754L02641L03639J18400
$$ plain form
-12686 1021669 1013477 1002667 986886 990634 1012696 1028880 1029556 1013737 974842 932004 937829 1010296 1095510 1141590
-12672 1141590 1165706 1202867 1239510 1252084 1262566 1297362 1335105 1349299 1356695 1372794 1373166 1351417 1354116 1400220
-12658 1400220 1433906 1424239 1438150 1532771 1643982 1673864 1629509 1582230 1546762 1499649 1464123 1471483 1480843
-12645 1480843 1439391 1384337 1387142 1436255 1473594 1505529 1573680 1653835 1690818 1700773 1734056 1769450 1751302
-12632 1751302 1700071 1679898 1688063 1683608 1690377 1756076 1838577 1851655 1801403 1762992 1746780 1705052 1647737 1629122
-12618 1629122 1638276 1624701 1616215 1687662 1824650 1939157 2007759 2074816 2136396 2149321 2142598 2189062 2273760
-12605 2273760 2317695 2321449 2353254 2406066 2407207 2366310 2370534 2428971 2462974 2460056 2498790 2607658 2730191
-12592 2730191 2838894 2954438 3049019 3065056 3034980 3054629 3144761 3269349 3461103 3763744 4067383 4185783
-12580D185783q0824j22173p9426q4494q3734M889P4850J1570p0396j7340Q3207O1339l5417
-12567C847834n4877k0890m2797o9160M693R7362P1284o285J3581Q9503R4131O9041J16367
-12554D209787J63079J01541L2498R2185J78302J36952P0213J46766K63852K34502J55103
-12543E784780K25010L50840L17433K11173K62726L98182L76584K56339K74541L70276K99332
-12532I127216J29165J29399K53588K39502J47094K56600M96257N41814M39527N31752P93627
-12521A3085541Q74523P84212Q67221J092202J088243R20079J050427J464407J671042J689823
-12511B4587720K113854K994889L642817L810190M039256M508219M728828M872046O038751
-12502F1336570Q484287J1079704J3619855J8046920K5947732L7054894N3177181Q1275230
$$ plain form
-12580 4185783 4104959 3982786 3903360 3818866 3735132 3740021 3814871 3826441 3756045 3738705 3821912 3883251 3847834
-12567 3847834 3792957 3772067 3729270 3660110 3664803 3762165 3833449 3827164 3840745 3930248 4024379 4093420 4209787
-12554 4209787 4372866 4474407 4506905 4599090 4777392 4914344 4984557 5131323 5395175 5629677 5784780
-12543 5784780 6009790 6360630 6678063 6889236 7151962 7550144 7926728 8183067 8457608 8827884 9127216
-12532 9127216 9256381 9385780 9639368 9878870 10025964 10282564 10778821 11320635 11760162 12291914 13085541
-12521 13085541 13960064 14744276 15611497 16703699 17791942 18712021 19762448 21226855 22897897 24587720
-12511 24587720 26701574 29696463 33339280 37149470 41188726 45696945 50425773 55297819 61336570
-12502 61336570 69820857 80900561 94520416 112567336 138515068 175569962 228747143 310022373
-12494C10022373J25625678J73206310J91548487J50118059M9479092p1221903j59472744
-12487G69305352j86051841j60685140j15821594p8094287n4391699l9170332k7628372j9539240
-12479H7922847j4974394j1942966q826274o127481m704402m084299l488486l085766l193106
-12470B7495673l288894k807695k123452j853051j826117j555855j161678j027629j012618
-12461A0838684p64491m38732l92623m90536l85713k02451k84757n15780n24448l64959l74931
-12450F099263n23908m99882l18137k69867l52711k97321j03794l6143j14581r8168M0066
-12439C524817P7109k0507m9571K5987K6856o8798q5208m392r35r6136j20161m5239k8081
-12426C135741r3390r2542n790J9934l8322m6527P188p066q2532p3506N439k1228j55826j93575
$$ plain form
-12494 310022373 435648051 608854361 800402848 950520907 999999999 928778096 769305352
-12487 769305352 583253511 422568371 306746777 228652490 174260791 135090459 107462087 87922847
-12479 87922847 72948453 61005487 52179213 46051732 41347330 37263031 33774545 30688779 27495673
-12470 27495673 24206779 21399084 19275632 17422581 15596464 14040609 12878931 11851302 10838684
-12461 10838684 10074193 9635461 9242838 8752302 8366589 8164138 7879381 7363601 6839153 6474194 6099263
-12450 6099263 5575355 5075473 4757336 4487469 4134758 3837437 3733643 3697500 3582919 3484751 3524817
-12439 3524817 3601926 3581419 3531848 3557835 3584691 3515893 3430685 3426293 3425358 3329222 3209061 3163822 3135741
-12426 3135741 3042351 2949809 2944019 2963953 2925631 2879104 2886292 2879226 2796694 2723188 2728627 2707399 2551573 2357998
-12412B357998p5851J5194j7159m5511J2077N0533J679m2417k7379l8931j16582j66112j36829
-12399A770710r7095p3253o459P9743P2097j9897m9210J9246N3145j286l6360p014j3227q2117
-12385A609023r0999M98N6208K089m8104j3123J2931m2611q5028l4106K4916O721k1043J5551
-12371A392923N0572J5385k0462J6571N9192K5027l1804k8332k668k6322o6254n9697l6832
-12358A287299n0731o8244m0641l867o816j7257O600K9093J0311j3217l820M422j3667j1058
-12344A108407L3732N0945k382n4033l6221R42j0248l4015j0215L1503L7748L2424N5167P5629
-12330A279383O1153M9252O1798L5399o2598j38708j05768k8896k1271o9006q2257n3785l9116
-12317H85580l3478L874M5235L5481K196J0706M3218L4704k249j356L3889M1158J4958M762
$$ plain form
-12412 2357998 2282147 2297341 2280182 2234671 2246748 2297281 2298960 2256543 2229164 2190233 2073651 1907539 1770710
-12399 1770710 1673615 1600362 1593903 1673646 1745743 1725846 1676636 1695882 1749027 1747741 1711381 1704367 1691140 1609023
-12385 1609023 1518024 1518522 1574730 1576819 1528715 1515592 1528523 1485912 1400884 1366778 1391694 1398415 1377372 1392923
-12371 1392923 1443495 1458880 1438418 1454989 1514181 1539208 1507404 1479072 1476404 1450082 1383828 1324131 1287299
-12358 1287299 1236568 1168324 1127683 1123816 1117000 1099743 1106343 1135436 1145747 1132530 1128710 1133132 1119465 1108407
-12344 1108407 1142139 1193084 1190702 1136669 1100448 1101390 1091142 1057127 1046912 1078415 1116163 1148587 1203754 1279383
-12330 1279383 1340536 1389788 1451586 1486985 1424387 1285679 1179911 1151015 1129744 1060738 978481 924696 885580
-12317 885580 852102 855976 901211 936692 938888 949594 992812 1027516 1025267 1023911 1057800 1098958 1113916 1118678
-12303A118678J1196j2148n9479p2188l8103o471l565q698j0634j7832j9205N33J7958M682
-12289I04724j4568q3K9699K9539P226K024O868j4059m8728n2279k5464q918j1333q034K727
-12274G99341M553Q131L0891N0462L8720J9169K6667L6289M006m4482m3586N926L6368J4307
-12260I86762k5750m6741m6941l4511j7098j1072j7066m655L4942N3391J6761k6798j8165
-12247H43059J3269J640l8069l7231M067K0385j490o972J9845K9219J589j6451K608K1569
-12233H57037P018j9915k8663k1711j0272N107J4188K632j2959j329K7277L0132J083k0899
-12219H28726j7229j1254j6876j7369o049j23l816r05Q655O444o423j0487p542j6080k8687
-12204G00985j9340Q202K4859K6398L2563M0137K7257K092m020Q199Q022q322j3564k814l00
$$ plain form
-12303 1118678 1129874 1117726 1058247 986059 947956 941485 937920 929222 918588 900756 881551 882084 900042 904724
-12289 904724 890156 890073 919772 949311 956537 958561 965429 951370 902642 850363 824899 815981 804648 796614 799341
-12274 799341 803894 812025 842916 893378 932098 951267 977934 1014223 1018229 973747 930161 936087 972455 986762
-12260 986762 961012 914271 867330 832819 815721 804649 787583 782928 817870 871261 888022 861224 843059
-12247 843059 856328 857968 819899 782668 786735 807120 805630 798658 818503 847722 849311 832860 835468 857037
-12233 857037 864055 844140 815477 793766 783494 788601 802789 805421 792462 791133 818410 848542 849625 828726
-12219 828726 811497 800243 783367 765998 759949 759826 756010 755105 763760 770204 763781 753294 745752 729672 700985
-12204 700985 681645 689847 714706 741104 773667 813804 841061 843153 839133 847332 855354 847032 833468 830654 830354
-12189H30354j1144j5031q745q174j0133L79J0772j261j8339n758K4920L1195R239j1278k9184
-12174G87812o0362p5561k9736M7293P3517L7446J3757L7884N1022M101o0102p4413l8407
-12161G14251P51J3726J233k1214k7081k796K1826R003k0461j1733L1638M8114J9883j511
-12147G75629R997J3538j4723l3820j5669J291j5341l0818q936J8939R307j7625j8559m156
-12133F69054j2454l2925j9627L0328O3473L8921k1435n7565l4399J9464L9760M059l5838
-12120F50816k5923J0539J4771q351l073L2926L8868l467l6614k4796p036j9316l5579k5972
-12106E57793q819l559Q153L4774M6148K9685J7834K5458K1502k854o415K2589L1433p582
-12092G66140m5662m4541l8100n1426m0310J8866N8929K4696k5658j2876L3814L7946J0165
$$ plain form
-12189 830354 819210 804179 795434 787260 777127 777506 788278 787017 768678 762920 787840 819035 828274 816996 787812
-12174 787812 727450 651889 622153 669446 742963 780409 794166 832050 883072 887173 827071 752658 714251
-12161 714251 715002 728728 729961 708747 681666 678870 700696 709699 689238 677505 709143 757257 777140 775629
-12147 775629 785626 799164 784441 750621 734952 736243 720902 690084 681148 700087 709394 691769 673210 669054
-12133 669054 656600 623675 604048 634376 697849 736770 715335 657770 623371 642835 682595 686654 650816
-12120 650816 624893 635432 650203 641852 638779 671705 710573 707106 670492 645696 638660 619344 583765 557793
-12106 557793 548974 545415 553568 588342 634490 664175 682009 707467 728969 726115 719700 742289 773722 766140
-12092 766140 720478 675937 637837 586411 546101 564967 623896 648592 622934 610058 643872 681818 691983
-12079F91983J3231L5235J1889m7548o6209k4468J8383K5871K0268J6417J986j2818o51K4354
-12065G07923K1793j833l086J7930J7431r521j6318J5943M8511M6844K3864J4527M3909J10048
-12051A037965J61079J18889k0216j42947j46311p4381m5038p1963o5497N73M2052N095n1930
-12038G47370n7397k1753R050K3939K8681J7478p58m63R599j0366n3895n8379l338M6123L3739
-12023G09630q703k2067q458p923k4995k9994j2061R344J4141l23j8172j3510K0102M9524
-12009F56535M1564J5854J5808L4459K5874j1083k7865j3385j2447l7052l6383J0276M4817
-11996G06972K2074j5189q364K5229L2231J0033o344r132j3315j5594q113o652k0256k1944
-11982F71636M808K2900m543m6540m5903n470K3788K3186J7518J6606L018k2179l1624j5706
$$ plain form
-12079 691983 705214 740449 752338 704790 638581 614113 632496 658367 678635 695052 697038 684220 683569 707923
-12065 707923 729716 727883 724797 742727 760158 750637 734319 750262 798773 845617 869481 884008 927917 1037965
-12051 1037965 1199044 1317933 1297717 1154770 1008459 934078 889040 817077 751580 752153 794205 799300 747370
-12038 747370 689973 668220 677270 701209 729890 747368 746610 746147 755746 745380 691485 633106 629768 675891 709630
-12023 709630 700927 678860 670402 662479 637484 607490 595429 604773 618914 618591 600419 586909 607011 656535
-12009 656535 698099 713953 729761 764220 790094 779011 751146 737761 725314 688262 651879 662155 706972
-11996 706972 729046 713857 705493 730722 762953 772986 766642 757510 744195 728601 720488 713836 693580 671636
-11982 671636 676444 699344 694801 648261 602358 596888 620676 643862 661380 677986 681004 658825 627201 611495
-11968F11495M770J4154J6359J2921n19j3973r763P105J1890k702j5509q211R510J2267j0822
-11953F38972l8769l4037J1947N3464L8555j6083l7873J026M2401K9281j2085k1006N708K4819
-11939F86320K2984K2890K7151J4873q403j1080R247J8030o28k2368k6098k0571j6208o321
-11925F89818R029J1974l618j6876j0053P119J6953J8508J9082J7988J3601J3976K5767L9399
-11911H52667L7466J6842m615n558J5239L6382M0100L6653M9934Q1970J13188J41711J96224
-11898A608203K99139M42936O11245P78769Q61241P20887K99912k57960o89791q40129p66694
-11887C067758o18024m71828l29160k04761j40816j36447j32095q9201m1809l6221n2080l1702
-11875G83614K4253M7015Q16n6709n2178J893L2751J3428j4482j7901j1405r792k01J6502
$$ plain form
-11968 611495 616265 630419 646778 659699 659180 645207 635444 642549 654439 651737 636228 628017 637527 649794 638972
-11953 638972 600203 566166 578113 631577 670132 654049 616176 617202 659603 688884 676799 655793 661501 686320
-11939 686320 709304 732194 759345 774218 765815 754735 763982 782012 781384 759016 732918 712347 696139 689818
-11925 689818 698847 710821 707203 690327 680274 687393 704346 722854 741936 759924 773525 787501 813268 852667
-11911 852667 890133 906975 902360 896802 912041 948423 988523 1025176 1075110 1157080 1270268 1411979 1608203
-11898 1608203 1907342 2350278 2961523 3740292 4601533 5322420 5622332 5364372 4674581 3834452 3067758
-11887 3067758 2449734 1977906 1648746 1443985 1303169 1166722 1034627 945426 903617 867396 815316 783614
-11875 783614 807867 854882 855698 798989 746811 748704 781455 794883 780401 762500 751095 741303 741102 757604
-11861G57604R857k4389m1120j4345J5872O848j8232j4867O650O954q552l906J7757K1955
-11847G18086J0298J5705L2574J7031l4414o8491n4576k4355j0258K236L0577N0877L6571
-11834G21861O687m056J098n238k4669l2694j9190J314J6093K6092L2257K9524J6150l146
-11820G62083k1808l1273k2737K79J7570J3248l311j0410n235o782k4490l9419k9124k144
-11806E96447J0874R20o293P648K1480R151j0912n74K9530K5485k3690n5843k2694L5374M5580
-11791F62483L968l0088k3291l15Q925N523%n994q638l595k069j5806k7813j2453J6824K0528
-11775E88189k232p433K1937M3171J9003k2717l0215k920J4302J197j2060N354L7192L9937
-11761F92705J052m0740m0330r50L2009K9449Q565k408l495q591j4382r838j137p94m350k314
$$ plain form
-11861 757604 767461 743072 701952 687607 703479 710327 692095 677228 683878 690832 682280 678374 696131 718086
-11847 718086 728384 744089 776663 793694 759280 690789 636213 611858 601600 603836 634413 685290 721861
-11834 721861 728548 724492 725590 720352 695683 662989 643799 645113 661206 687298 719555 749079 765229 762083
-11820 762083 740275 709002 686265 686544 704114 717362 714051 703641 698406 691624 667134 627715 598591 596447
-11806 596447 607321 608241 601948 609596 631076 640227 629315 628741 658271 683756 660066 604223 581529 616903 662483
-11791 662483 666451 636363 613072 612757 621682 627205 627205 621211 612573 608978 606909 591103 563290 550837 567661 588189
-11775 588189 585957 578524 600461 643632 662635 639918 609703 606783 621085 622282 610222 615576 652768 692705
-11761 692705 693757 653017 612687 611737 643746 673195 681760 679352 675857 667266 652884 643046 641909 641115 636765 634451
-11745F34451r76o088l680J4049K4537J1083oJ8279L7245J3373l1069l3248Q814K9038l978
-11730G11824m4291m7510k9228j7633n477J6739K8823J7920N762O912P60k2133k8516L751
-11716E97703L8368L0360o660k5590j4398O23J893n791j4410j6070j766J9354J9016r042l0435
-11701E83155j7437J0249J9682J4146J6967K7545K6258P835j6746l7064m2815k7058o180q669
-11687E49868k7601k1204J8264M1691K0633k226J4891L8956J9816j8450j4963K5459M2398
-11674F87532K0186L471J2888J7098L33q057O785J3045j1192l4158j6698K8755N7118M9856
-11660H26962K9470K4225L7085M8694M3040K6249J4829R638N6n379J5916N2974N8021J6855
-11646A198635j7156K151M1781M1160L500k2841k9941m9734p9161p6047l3803K353N040l442
$$ plain form
-11745 634451 633475 627387 623707 637756 662293 673376 673370 691649 728894 742267 711198 677950 686764 715802 711824
-11730 711824 667533 620023 590795 573162 567685 584424 613247 631167 636929 643841 644601 622468 593952 597703
-11716 597703 636071 666431 659771 634181 619783 620406 622299 616508 602098 586028 584262 603616 622632 613590 583155
-11701 583155 565718 575967 595649 609795 626762 654307 680565 688400 671654 634590 591775 564717 558537 549868
-11687 549868 522267 501063 519327 561018 581651 579425 594316 633272 653088 634638 619675 645134 687532
-11674 687532 707718 711189 724077 741175 741508 733451 740236 753281 742089 707931 691233 719988 777106 826962
-11660 826962 856432 880657 917742 966436 1009476 1035725 1050554 1060192 1060248 1054869 1070785 1123759 1181780 1198635
-11646 1198635 1181479 1183630 1225411 1266571 1270071 1247230 1217289 1167555 1088394 1012347 978544 980897 985937 982495
-11632I82495p31L962M31n671j7113m3138o6203n6307k4914j5575l2714l2214M706M1354M6113
-11617G84481L1117J2264j5714m1867l1700J3891M4200L5224K8117N3441P0483L4094k0700
-11604I97331k2477L1735P3477N6600O832k2408r467K2920L3776N150l1801k5608K9813P9292
-11590A225165P1124J4946m0700o3832n3040k3133j87q217l7820m8784k3295P387R095r566
-11576A019143k1687k5547l5584n0636n7880n2577l5722j1465Q67j8458m8612l9490J5322
-11563F37674N8211M7310J2673j511m109k1231l7026k6016r495j9311l4277j6049J5686J2775
-11549F15304j3152o394L3742M6134R882j9507J91L3786K8366j0366l8547l7863k3996j1249
-11535F06331K035J9804L5985L4964O478l3224m7973k5745K033Q768J5874N0081Q2013O1568
$$ plain form
-11632 982495 981764 985726 986157 980486 963373 920235 854032 797725 772811 757236 724522 692308 697014 738368 784481
-11617 784481 815598 827862 812148 770281 738581 752472 796672 831896 860013 913454 983937 1018031 997331
-11604 997331 974854 1006589 1080066 1136666 1143498 1121090 1111623 1134543 1168319 1173469 1141668 1116060 1145873 1225165
-11590 1225165 1296289 1311235 1270535 1206703 1153663 1130530 1130343 1122126 1084306 1035522 1012227 1019614 1028709 1019143
-11576 1019143 997456 971909 936325 885689 827809 775232 739510 728045 728912 710454 661842 622352 637674
-11563 637674 695885 743195 755868 754357 750248 729017 691991 665975 656480 637169 602892 586843 602529 615304
-11549 615304 602152 595758 629500 675634 685516 666009 666200 699986 728352 717986 679439 641576 617580 606331
-11535 606331 608366 628170 664155 699119 705597 672373 624400 598655 600688 609456 625330 675411 757424 818992
-11521H18992K574k8471r113J3879M410j7905k9309l9156m9671l3396J4565M8100L2162m069
-11507G23592j3043N048J8725J8043J3286M462j1878k3808k2147j9234k4391k3549q715j36
-11493F36255r619j2165R728K4505j0l3018k0822K4847L9232L869k5919o394L3490M1410J3295
-11478G18684j4675k0670j3882p532P29J9956M6514N7006K7518l2173p3662n7404k52M3726
-11464F93883M5103K0900o81r514o349N113J1659N19j6727j4755M611J0043r770k5475j3465
-11449F95095P088Q770p2K129O348q540k7040j1854L2531N4000K2308l0360n4420l9488p554
-11434F48941K3319M3285L8770N754l3123m8518l6966j5397P907L3858N1090M2097J2898q763
-11420G65152j0579p624j0096m888J5940L1401J8428j2133k9354k3302j0243k419M402J3013
$$ plain form
-11521 818992 821566 793095 783982 797861 802271 784366 755057 715901 666230 632834 647399 695499 727661 723592
-11507 723592 710549 715597 734322 752365 765651 770113 758235 734427 712280 693046 668655 645106 636391 636255
-11493 636255 626636 614471 624199 648704 648694 615676 594854 619701 658933 662802 636883 630489 663979 705389 718684
-11478 718684 704009 683339 669457 661925 662654 682610 729124 786130 813648 781475 707813 650409 650157 693883
-11464 693883 738986 759886 759205 749691 743342 748455 760114 760633 743906 729151 733762 743805 734035 708560 695095
-11449 695095 702183 710953 710881 713010 719358 710818 683778 671924 704455 758455 780763 750403 695983 656495 648941
-11434 648941 672260 715545 754315 760069 726946 678428 641462 626065 633972 667830 718920 761017 773915 765152
-11420 765152 754573 746949 736853 731965 747905 779306 797734 785601 756247 732945 722702 720283 724685 737698
-11406G37698J5623P962l045j1015j6671j9463j5961r835q725o857J0570L6687L7822j467
-11392G53323m4921m4165m943J8171k345k9584j8772J6900K8866O918q434R802L4331K5201
-11378G40348j2491l7160k5073P169L0502L3558K2946Q655l980j3461j7518j1702K751J2920
-11364G37464Q490R21Q607K1412R133k3852k8998J5606O1157N4226J5240r90L481j4938m8388
-11349H18571l9825J3420L9843N957k7925q462K3532P117l3518l1054J4027L8992J6830j9291
-11335H18214l9495m3344k8301R135M0906L1527k508q407K3940M8562L4747K752k0473l3636
-11321H33619l7669k4684m229pq469j53K8151M5020L8355L2392L6906K7456l693k3943j3076
-11306I25976L082r43j0729p675n107j6452k3339r325P336Q285R720K6870L6152J3496j6894
$$ plain form
-11406 737698 753321 761283 758238 747223 730552 711089 695128 685293 676568 669711 680281 716968 754790 753323
-11392 753323 708402 664237 659294 677465 675120 645536 626764 643664 672530 679448 671014 680816 715147 740348
-11378 740348 727857 690697 665624 672793 703295 736853 759799 768454 764474 751013 733495 721793 724544 737464
-11364 737464 745954 746875 755482 776894 786027 762175 733177 748783 809940 864166 879406 878416 881897 866959 818571
-11349 818571 778746 792166 832009 837966 810041 801579 825111 832228 798710 767656 781683 820675 837505 818214
-11335 818214 778719 735375 707074 716209 757115 788642 786134 777727 801667 850229 884976 887728 867255 833619
-11321 833619 795950 771266 767037 767030 758561 758408 786559 831579 869934 902326 939232 966688 962995 939052 925976
-11306 925976 929058 928115 917386 909711 904604 888152 864813 855488 862824 871109 880829 907699 943851 957347 940453
-11291I40453j5645J1619K9081K6551J8628N930j8468l6367k3747L998R485o994o984K4586
-11277I62126N6179N5757K8637P46j1178o286L618J883j2050j5178N852K5223J0459k4203
-11263A081585l2410k310K9098L3735K6558K7818K6682P613j2482m989K4044L7438J6967j3029
-11249A246318j9489j567J4879J4107M789j056l770l113J0491L5013M4908K4625PM308K4148
-11234A394598J9843m904m120L1725N2774K8295l648j03J9688J5905j760J755K0124J9176
-11220A589348J401K792L0900N4060N1883L6249K2079J2604J1794J9528J9243P26j4711l279
-11206A834617K0832K9760L0044M3788N8182M4751J8738K4133O1598Q5160P3155N0943M0485
-11193B416186L9258N1987Q7164J16353R7113M7662L6381Q0007J16865J06318Q8399J07823
$$ plain form
-11291 940453 924808 936427 965508 992059 1010687 1016617 998149 961782 938035 942033 951518 944524 937540 962126
-11277 962126 1018305 1074062 1102699 1103445 1092267 1085981 1089599 1091482 1079432 1064254 1070106 1095329 1105788 1081585
-11263 1081585 1049175 1046865 1075963 1109698 1136256 1164074 1190756 1198369 1185887 1180898 1204942 1242380 1259347 1246318
-11249 1246318 1226829 1225262 1240141 1254248 1259037 1257981 1254211 1251098 1261589 1296602 1341510 1366135 1366142 1370450 1394598
-11234 1394598 1414441 1409537 1405417 1437142 1489916 1518211 1514563 1514460 1534148 1550053 1548293 1550048 1570172 1589348
-11220 1589348 1590749 1593541 1624441 1678501 1730384 1766633 1788712 1801316 1813110 1832638 1851881 1852607 1837896 1834617
-11206 1834617 1855449 1885209 1915253 1959041 2017223 2061974 2080712 2104845 2166443 2251603 2324758 2375701 2416186
-11193 2416186 2455444 2507431 2594595 2710948 2808061 2855723 2892104 2972111 3088976 3195294 3283693 3391516
-11181C391516J41104J47294J39282J50742J73028J79425J81095K06359K47607K76688K93470
-11170E527610L14500L31708L27197L16401L34602L86992M46216M93484N35086N85828O57123
-11159A0256747P51444Q57166R71161J136221J423386J870096K482017L286829M272142N218701
-11149C2525910N745143N692656N397050N350276N551470N423032M542702L324936K727597
-11140G6280772L247536M378017N156004N137225M701722M448126M455553M209711L158675
-11131A15173341J250874j007822k907736l985264m304681m376135m672082n111965n114119
-11122H4944411m305852l127880k533889l030182m156861n013473n184031n009623n019456
-11113D7563164n286551n407443m996479m077285l004419k104251j450079r42744n10438j70218
$$ plain form
-11181 3391516 3532620 3679914 3819196 3969938 4142966 4322391 4503486 4709845 4957452 5234140 5527610
-11170 5527610 5842110 6173818 6501015 6817416 7152018 7539010 7985226 8478710 9013796 9599624 10256747
-11159 10256747 11008191 11865357 12836518 13972739 15396125 17266221 19748238 23035067 27307209 32525910
-11149 32525910 38271053 43963709 49360759 54711035 60262505 65685537 70228239 73553175 76280772
-11140 76280772 79528308 83906325 89062329 94199554 98901276 103349402 107804955 112014666 115173341
-11131 115173341 116424215 115416393 112508657 108523393 104218712 99842577 95170495 90058530 84944411
-11122 84944411 80638559 77510679 74976790 71946608 67789747 62776274 57592243 52582620 47563164
-11113 47563164 42276613 36869170 31872691 27795406 24790987 22686736 21236657 20293913 19783475 19613257
-11103A9613257O9743K82234N62067R43657J428062K065698K929062L953578M849115N278499
-11093D1974972N197080M962695M973781N158203M968268M048979K853307K354098L032260
-11084G9523643M300022N094202M972857M444494M220551M340556M139011K968997Q48660
-11075A14852993j537567l361467m226412m391350m483946m893544n369585n283071m372663
-11066G6933388l192061k689037l290461m480555n347963n488509n271870n259101n525341
-11057C6388490n643763n226836m325913l305083k468164j881555j468895j156800r19956
-11048I991525p54625o48390n71706m98926m38280m18354m31473m21712l58000k87628k72588
-11037D889843k95172k83299k21089j71389j78755k10151k16744k01509j89329j73220j35559
$$ plain form
-11103 19613257 19683000 19965234 20527301 21470958 22899020 24964718 27893780 31847358 36696473 41974972
-11093 41974972 47172052 52134747 57108528 62266731 67234999 71283978 74137285 76491383 79523643
-11084 79523643 83823665 88917867 93890724 98335218 102555769 106896325 111035336 114004333 114852993
-11075 114852993 113315426 109953959 105727547 101336197 96852251 91958707 86589122 81306051 76933388
-11066 76933388 73741327 71052290 67761829 63281274 57933311 52444802 47172932 41913831 36388490
-11057 36388490 30744727 25517891 21191978 17886895 15418731 13537176 12068281 10911481 9991525
-11048 9991525 9236900 8588510 8016804 7517878 7079598 6661244 6229771 5808059 5450059 5162431 4889843
-11037 4889843 4594671 4311372 4090283 3918894 3740139 3529988 3313244 3111735 2922406 2749186 2613627
-11026B613627r4255q1574r2603r5100p9983o5119n6925m4905l1924l5313n3682o1049m1242
-11013A779953q018J4156J4811J242j0901j2717j3856k9083m7875l9903m175J6697l151k8249
-10999A628931j3881K3835L5663J7358P974K2276M0242N8028Q9997J17804J00288M7819K5872
-10986B202206O0270R4371P3147K2932R199M9494J03527J25154R8358M5375J6321M2022Q5171
-10973C027547P6446J0710m2833m5337m2714q0403j25521j26925r9939q6746p4973l0293J7356
-10960B376375M35p9330j42446j37686r8411q0889r4810j10966j03307o9748l3563k5451m6025
-10947A354178n7454l4047m89J0152R573K3964L7329J9764o101J1155O8197J08560J08433
-10934A653214J01354J10772J16819J03538Q5816P2525N1010K4306J7836L3780M4732M7466
$$ plain form
-11026 2613627 2519372 2437798 2345195 2250095 2170112 2104993 2048068 2003163 1971239 1935926 1882244 1821195 1779953
-11013 1779953 1771935 1786091 1800902 1802144 1791243 1778526 1764670 1735587 1687712 1647809 1643634 1660331 1657180 1628931
-10999 1628931 1615050 1638885 1674548 1691906 1699880 1722156 1762398 1820426 1910423 2028227 2128515 2176334 2202206
-10986 2202206 2262476 2356847 2429994 2452926 2462125 2511619 2615146 2740300 2838658 2884033 2900354 2942376 3027547
-10973 3027547 3103993 3114703 3071870 3026533 2983819 2903416 2777895 2650970 2551031 2464285 2389312 2359019 2376375
-10960 2376375 2376810 2297480 2155034 2017348 1918937 1838048 1743238 1632272 1528965 1459217 1425654 1400203 1354178
-10947 1354178 1296724 1262677 1262188 1272340 1281913 1305877 1343206 1362970 1356869 1368024 1436221 1544781 1653214
-10934 1653214 1754568 1865340 1982159 2085697 2171513 2244038 2295048 2319354 2337190 2370970 2415702 2463168
-10922B463168P3247J24838J53604J26431P0121J9888l0827r2825j34705j21716p7461o0882
-10910B512881q9476j20121j07054n7378k3834m7306j07315j40215j17842q7265j03011j42735
-10898A369329j40558r1424n7140o4124o5447k6991J5672K2301J0130P118k840l5849n4526
-10885H85651j9262L7945N0810J1343k8490l4271j8467j089J2613J7645J0753M285Q246O766
-10871I44478j7040m4442m3846k0222n292n062M541K9772M3592K5868q225k9505k6833j2631
-10857H35153p611j9648l1323j7749J6062L3556J5590j0410j0266Q316J2649n379k3789k4094
-10843G71057p212J5230K7106J7315k283n430Q919J0981r506k0952l608J1706m577k5372j0851
-10828G72523K0921K1889p121k2604j1986l603p217j415J6573K1300O835l530k830r204k1205
$$ plain form
-10922 2463168 2536415 2661253 2814857 2941288 3011409 3031297 3000470 2907645 2772940 2651224 2573763 2512881
-10910 2512881 2423405 2303284 2196230 2138852 2115018 2067712 1960397 1820182 1702340 1615075 1512064 1369329
-10898 1369329 1228771 1137347 1080207 1016083 950636 923645 939317 961618 971748 978866 976026 940177 885651
-10885 885651 866389 904334 955144 966487 937997 903726 885259 884170 896783 914428 925181 929466 937712 944478
-10871 944478 927438 882996 839150 818928 813636 808574 813115 842887 886479 912347 904122 874617 847784 835153
-10857 835153 827542 807894 776571 758822 774884 808440 824030 813620 803354 811670 824319 818940 795151 771057
-10843 771057 763845 779075 806181 823496 821213 815783 824702 835683 826177 805225 801617 813323 808746 783374 772523
-10828 772523 793444 815333 808212 785608 773622 770019 762802 761387 777960 799260 806095 802565 799735 790531 769326
-10813G69326j2809J4239K1265n319k7319j3734J2880J6060j668j4166j3890j0623o494K911
-10799G30659J4072J9097J4644k22k1396l2092j7597Q720J6410p88j8376j8511p381P262K3926
-10784G18427K8390M526k6064j7294L0159N3913J5194m0091m4297o98L1908K6300R179M848
-10770G94400N067L90N01R247J0121o463k4037k4770j5457j1327q558N582K2865J8729j0242
-10755G66048l4580k8588l336J2295J1757J1471J7038J3820m532k0892j8337j922J2765J6615
-10741G49622N073k0540l9958k6419J2464L1944R099k1771j9960J609L754j2613j2366J1721
-10727F71659K9071K3978J4936J3517L191k5193m7377l5645J932K7801J4611k5512m8871k5311
-10713E92787K0747L4205L582k0415k346K2080Q225j8609o426K9679L0427m183j3928J6865
$$ plain form
-10813 769326 756517 770756 792021 786702 759383 745649 758529 774589 772921 758755 744865 734242 727748 730659
-10799 730659 744731 763828 778472 778250 756854 724762 707165 715885 732295 731507 713131 694620 687239 694501 718427
-10784 718427 746817 751343 725279 707985 738144 792057 807251 767160 722863 722165 754073 780373 789552 794400
-10770 794400 799467 799857 800358 809605 819726 813263 789226 764456 748999 737672 729114 734696 757561 776290 766048
-10755 766048 731468 702880 699544 711839 723596 735067 752105 765925 761393 740501 722164 720242 733007 749622
-10741 749622 754695 734155 694197 667778 680242 712186 721285 699514 679554 681163 684917 672304 659938 671659
-10727 671659 700730 724708 739644 753161 756352 731159 683782 648137 650069 677870 692481 666969 618098 592787
-10713 592787 613534 647739 651321 630906 628560 650640 658865 640256 633830 663509 693936 689753 675825 692690
-10699F92690L4791J3411n743L187K619l0880n1855k2721J4760O864k1319j0958K9448L9535
-10685F93829N126k6974k7266j6286j4273j0116N669J6671P522r778j1492R168L6253M5949
-10671G04002K7475m517k2963j7581j075J5378L2993M5090L1537j0105m8790n4326l1332l744
-10657F62042J5534K2750J1488j5021l3558k3532P482L2916L3402Q984k0949k8378n689J7990
-10643F85461J2912o224n770O231m434k5094n391M7634N8222j060n3349k9121L0498M5376
-10629G55891J7070N352K4490L9532L9511M0801L5755P931j5854K822M1272M3584J3696R582
-10615A061435M4599O6290M3557Q309o277r273j3657q837N077K551k3037l9277k1519J2550
-10601A122491L2591L0521J3058j2178l3345m2906n2044o9397p1952l5483J2177J6798k2085
$$ plain form
-10699 692690 727481 740892 735149 738336 740955 710075 658220 635499 650259 657123 635804 624846 654294 693829
-10685 693829 698955 671981 644715 628429 614156 604040 609709 626380 633902 624124 612632 621800 658053 704002
-10671 704002 731477 726960 703997 686416 685341 700719 733712 778802 810339 800234 751444 697118 665786 662042
-10657 662042 677576 700326 711814 696793 663235 639703 647185 680101 713503 722487 701538 673160 667471 685461
-10643 685461 698373 692149 686379 692610 688176 663082 657691 705325 763547 762487 709138 680017 710515 755891
-10629 755891 772961 778313 802803 842335 881846 922647 958402 966333 950479 953301 994573 1038157 1051853 1061435
-10615 1061435 1106034 1172324 1215881 1224190 1217913 1208640 1194983 1186146 1191223 1193774 1170737 1131460 1109941 1122491
-10601 1122491 1155082 1185603 1198661 1186483 1153138 1110232 1058188 988791 916839 881356 893533 910331 888246
-10588H88246m8599l5592j7585k3047k9069j0735J2171J1260m862j3234j4354j7840j6497
-10575F80263j668J7301L0376M1689N0357M2301J8766N423J4130K3500J7811J5112L1575M6417
-10561A033353L3918Q667N141K5502L9991L3385K1944K2189K5336J2439j5513l4178k5905
-10548A186269o775r474l7005n4407l8868j3204o671q845K290J0069j5331n5364o1272l0419
-10534H60993r758j9535k8719j7394q429j8541k8043k2295j7609k2027j3833J4704L2730J7488
-10520G19732j0209k2537k2595k2627j8728r286n267l978J0617K7096J1805k6710l1653J6087
-10506F11747N9874M9978J2025p356j0883j8590j5013J5135L9236K3284p511j1361j307j4642
-10492G24616l9791l6646q781O380L021L394M020j4349l4359k0425J6151K8359P603q181q29
$$ plain form
-10588 888246 839647 804055 786470 763423 734354 723619 735790 747050 742188 728954 714600 696760 680263
-10575 680263 678595 695896 726272 767961 818318 860619 879385 884808 898938 922438 940249 955361 986936 1033353
-10561 1033353 1067271 1075938 1081079 1106581 1146572 1179957 1201901 1224090 1249426 1261865 1246352 1212174 1186269
-10548 1186269 1179494 1170020 1133015 1078608 1039740 1026536 1019865 1011020 1013310 1023379 1008048 952684 891412 860993
-10534 860993 851235 831700 802981 785587 777158 758617 730574 708279 690670 668643 654810 669514 702244 719732
-10520 719732 709523 686986 664391 641764 623036 613750 608483 604505 615122 642218 654023 627313 595660 611747
-10506 611747 671621 721599 733624 726268 715385 696795 681782 696917 736153 759437 751926 740565 739258 724616
-10492 724616 684825 648179 639398 645778 648799 652193 656213 641864 607505 587080 603231 631590 639193 631012 630183
-10477F30183O147l914j6619j5859J89K9405N6864M9176m73l9818k1442J9662J4407k9444
-10463F78464l8136Q532M7229L3735L79j3826k1466m0572m9191k6487N909K0865K6218L6390
-10449F68043L9026K0056r201l4496n5879o3411l4968J6803L8572Q672k4348j1464K4466K8627
-10435F10498l153k7250j9243M279K0823K3589J3774j316p758j264N865O005N441J409j9658
-10420F12041m2989k4466L8739P6714L4752l8563n2004j988K7133p070m7205l0864J9315M1724
-10406F05269K6450R436L452r978k8237k1123J2619K7186o216m8592m0887J4200N5213M3722
-10392F42514O900j0271k524N435J402p229j4384j8407j3091K333J1725J603j4929j4994P37
-10377E76820J3599J7417J8128J1352r784k9296k3114J975J6610J5245J8513K7500J7379j3537
$$ plain form
-10477 630183 636330 632416 615797 599938 600127 629532 686396 735572 735099 695281 673839 693501 707908 678464
-10463 678464 640328 648860 696089 729824 730203 716377 694911 654339 605148 578661 584570 605435 631653 668043
-10449 668043 707069 727125 717924 683428 627549 564138 529170 545973 584545 593217 568869 557405 581871 610498
-10435 610498 607345 580095 560852 565131 585954 609543 623317 622001 614243 612979 618844 624849 630290 631699 612041
-10420 612041 569052 544586 583325 660039 694791 656228 604224 602236 629369 622299 575094 544230 563545 605269
-10406 605269 631719 641155 644607 634629 606392 585269 597888 625074 618858 570266 529379 543579 598792 642514
-10392 642514 649414 639143 636619 642054 643456 636227 621843 603436 590345 592678 604403 606006 591077 576083 576820
-10377 576820 590419 607836 625964 637316 627532 598236 575122 577097 593707 608952 627465 654965 672344 658807
-10363F58807l0542j5882L445K920k239O180J1625l871j9315q087J1108O68l1328l7744k345
-10348E43400L6427L9142J1986j2115j6121q548l066j514M129J7033K6079J7386n596k4790
-10334F23832l1548l2347k7650p255K3360L6317J9272j005M388K3479K4026L785r899n162
-10320F43593o94j2623k9336k7238J65L3309M2259J6115j9074k4333L077K3072Q697j4188
-10306F42801p163K1028K8998N882j7034j6744n422p67k96L153M460j507p296l793P642J9000
-10290F72942K1056N593k2971m0472k6958L494J9208J6125J7849K7436J5595k6368n7042l9218
-10276E86269J168Q091k4437m5506k1545K0131L5930K4234J5451K1129K1241L20k7002l4739
-10262E80735j6765J0228K7074K5853Q790j4512k8977k3878m738J1525J5793J3214Q626j958
$$ plain form
-10363 658807 628265 612383 615828 618748 616509 622689 634314 630443 611128 603041 614149 614817 583489 545745 543400
-10348 543400 579827 618969 630955 618840 602719 594171 591105 589591 593720 610753 636832 654218 648622 623832
-10334 623832 592284 559937 532287 525032 548392 584709 603981 602976 607364 630843 654869 658654 648755 643593
-10320 643593 642899 630276 600940 573702 573867 607176 649435 665550 646476 622143 625220 648292 656989 642801
-10306 642801 635638 656666 685664 691546 674512 657768 652346 651579 651283 654436 658896 657389 650093 646300 653942 672942
-10290 672942 693998 699591 676620 636148 609190 612684 631892 648017 665866 693302 708897 682529 625487 586269
-10276 586269 587437 595528 571091 525585 504040 524171 560101 584335 599786 620915 642156 642476 615474 580735
-10262 580735 563970 574198 601272 627125 635915 621403 592426 568548 563810 575335 591128 604342 612968 611010
-10248F11010j7447k2026m963J7468J8893p3j2216n013P76j3468k9740j6723K2453N1214M7517
-10233F47662K6897J2160L887n702r953p2J2217P487j0720k0297j4296q606j3760j9960j6157
-10218E90787n584M262J0883J1126M466M585K4404M5241L1711j1543l3965j0888J6219M267
-10204F85971k2090j2230K5473L6965R496j3526p051J669j2774l4099l8438k8855j5550M143
-10190E79104K6227L1613J6256J912J121N10p544r752l785q907k5777k4517L018J9615K465
-10175F01559j4017M818L0847J7210k1790l0103M367L6809L4627J1646r085k3298k7923j2694
-10161F02973J6882L4473K4133j21j3448p409M287L98k2863l8425j6724K5931L5499o002m7430
-10146E92154l8414J16J6130Q729J7309M5283N3435K7469k378j5731k6230m0230l8081j4405
$$ plain form
-10248 611010 593563 571537 566574 584042 602935 602862 590646 585633 586409 572941 543201 526478 548931 600145 647662
-10233 647662 674559 686719 690606 684904 674951 674879 687096 694583 683863 663566 649270 640664 626904 606944 590787
-10218 590787 585203 589465 600348 611474 615940 620525 644929 690170 721881 710338 676373 665485 681704 685971
-10204 685971 663881 651651 677124 714089 723585 710059 703008 704677 691903 657804 619366 590511 574961 579104
-10190 579104 605331 636944 653200 655112 656233 656743 649199 639447 635662 626755 600978 576461 579479 599094 601559
-10175 601559 587542 592360 623207 640417 618627 588524 592891 629700 664327 675973 666888 643590 615667 602973
-10161 602973 619855 654328 678461 678340 664892 657483 661770 662168 639305 600880 584156 610087 645586 639584 592154
-10146 592154 553740 553856 569986 578715 596024 641307 694742 722211 719833 704102 677872 637642 599561 585156
-10132E85156K943m906j8204j1345R678K0167Q946j2670j9639Q327N7127P5650L3009l0386
-10118G03853m8070j7200N620l614q069J3660K6627N111j7619p349R906n874l6772l4657J663
-10103E87216K8331K3523P161N7K876J2242K3219J9439p191l1695k3561M646J1115j2120k6232
-10088F19026m804K6057K3974j4410n2002n4048k0628J7287K8145J0431p193j847J3925J0997
-10074E94910j4120l4838l1747j3737L034J7129L1428L7364K6680R751L698N317n141k9613
-10060F00115m0832j8372J7749K9634J1969l187O129K4237K7594J7860P658n141k4222l3293
-10046F17898j7236O243P849q234j3856n880o448j5228o037K0257K6092n48j9203o97K3849
-10031F08821J6002l941P386L9284M0730K295k9907k6369j0792j0168j2443N44J2393j463
$$ plain form
-10132 585156 588099 583193 564989 553644 563322 583489 592435 579765 560126 568453 625580 701230 734239 703853
-10118 703853 655783 638583 644203 640589 632520 646180 672807 677918 660299 652950 662856 656982 620210 585553 587216
-10103 587216 615547 639070 646231 646288 649164 661406 684625 704064 696873 665178 641617 646263 657378 645258 619026
-10088 619026 614222 640279 664253 649843 597841 543793 523165 540452 568597 579028 571835 569988 583913 594910
-10074 594910 580790 545952 514205 500468 503502 520631 552059 589423 616103 625854 629552 634869 629728 600115
-10060 600115 559283 540911 558660 588294 600263 597076 603205 627442 655036 672896 680554 675413 651191 617898
-10046 617898 600662 606905 614754 606520 592664 586784 580336 565108 559071 579328 605420 604872 585669 584972 608821
-10031 608821 624823 620882 628268 667552 708282 710577 680670 654301 643509 633341 620898 621442 633835 632372
-10017F32372k6386k4533O423K4397J751l2976l2314N309L3826K2069q052j7749k855J3437
-10003E94719K2599L2871L5731R240l6562n4930k4283J4980J3937j7300k9717r516O859p513
-9989E51115l0884k7612J998K6366K6808J8431K5039M4506M9543K4257j0819k2795j0441m273
-9975F61239j9409l2046j7787P341R251j2411k4146r507Q378M699r872q211J0473J9453N380
-9960E92825r963J067L3038N3282M2840J5308p255j9981k7921k8999j9340o118J03p06l796
-9945F14384r671j5223q091J2769K5182J3826l649o727r262k9540m0424n21O8618R2631M3714
-9930G48016k0533l6617q578J9703K3467K945l1448n3816l7372K429J5805r128k5271k535
-9916E87067K5191K2783J0512J2938M594l5303o2381l1607J6568J2962k5812k5142K1372M4285
$$ plain form
-10017 632372 605986 581453 587876 612273 614024 581048 548734 554043 587869 609938 601886 584137 581282 594719
-10003 594719 617318 650189 685920 695160 658598 603668 579385 594365 608302 591002 561285 551769 558628 551115
-9989 551115 520231 492619 494617 520983 547791 566222 591261 635767 685310 709567 698748 675953 665512 661239
-9975 661239 641830 609784 591997 599338 608589 596178 572032 562525 570903 575602 565730 557519 567992 587445 592825
-9960 592825 582862 583929 616967 670249 713089 728397 721142 701161 673240 644241 624901 618783 618886 618180 614384
-9945 614384 604713 589490 581399 594168 619350 633176 629527 622800 613538 583998 543574 543053 611671 704302 748016
-9930 748016 727483 690866 682288 701991 725458 728403 696955 643139 605767 608196 624001 614873 589602 587067
-9916 587067 612258 635041 645553 658491 663085 627782 565401 533794 550362 563324 537512 512370 533742 578027
-9902E78027J7109p661K873J2342p116k3389r479N290p039j9954l786J7826J2043k791P188
-9887E71483K7173J9136r809j7053Q169L3724L6232K3131N034j5871k7335j1952K1068L7294
-9873G00424K0822n528j3921n266L173O623J1180J3116Q59k1666l1855j8348j152o379k7507
-9858F24575l1767o440K2011K3695J854j8491k1699p193J8940L9684L0615r594m4334l8730
-9844E83126m454J8829J6924Q693P517N674k322p571k829P624J5734J4627J883r789O75K8558
-9828F82899L7014R230j7350k631L4257M7022L3966K6193K2270l562l6747l4313m489m493
-9814G89266m4910o6393l6356j324o865k6649j6337J3378K6996K5835K9700L0428J2153q933
-9800G19989r464r5k098p590k458k136k1500l4453j1125K4544K4160j1874l8393l3433j5679
$$ plain form
-9902 578027 595136 587475 590348 602690 595574 572185 562706 567996 560957 541003 537217 555043 567086 564295 571483
-9887 571483 598656 617792 607983 590930 599099 632823 669055 692186 697220 681349 654014 642062 663130 700424
-9873 700424 721246 715718 701797 696531 699704 706327 717507 730623 731482 709816 677961 659613 658461 652082 624575
-9858 624575 592808 586368 608379 632074 633928 615437 593738 586545 605485 645169 675784 666190 621856 583126
-9844 583126 578672 597501 614425 623118 630635 636309 633987 626416 623587 631211 646945 661572 663455 653666 654341 682899
-9828 682899 719913 729143 711793 709162 743419 790441 824407 850600 872870 869308 832561 798248 793759 789266
-9814 789266 744356 677963 641607 640283 633418 606769 590432 603810 630806 656641 686341 716769 728922 719989
-9800 719989 710525 710430 708332 700742 698284 696148 674648 640195 629070 653614 677774 665900 627507 594074 578395
-9785E78395j76J6915K9419K0457l813j5816p520J756J824M687J5668K1224J5078J2590K7842
-9770G18530N2019O3208M9694K1768M058R430J8147k26l8772n3684k6910L504M36j6939j0950
-9755G93313R380O465k0756l8502l5437l0596k8261j2613J0746J4053m708j5631p565k991
-9741F36897r907k221L0246N0728K4906k4908m6791k5539N453J1419p085k4085j9792R69J7136
-9726F17426J6636R809J2094J9277J3465o709j7611L36L3748M6331J9599k0668k7703J0691
-9712G26721N1636M9476J7614Q166L3851N1319L1032k110j9153l1691n2423n5833k4238M380
-9698G88747j0839m2783l8191p008k982k9120l5167q554N445j3021k4109j301K1930J0553
-9684F13600j6364k2347o810R700K0347K4272J3563p319j5872n723J127o410q176Q901K3623
$$ plain form
-9785 578395 578219 595134 624553 645010 641197 625381 617861 619617 621441 626128 641796 663020 678098 690688 718530
-9770 718530 770549 833757 883451 905219 909277 918707 936854 936628 897856 844172 817262 820766 821202 804263 793313
-9755 793313 802693 809158 788402 749900 714463 683867 655606 642993 653739 667792 663084 647453 639888 636897
-9741 636897 626990 624769 655015 705743 730649 705741 658950 633411 638864 650283 643198 619113 599321 600290 617426
-9726 617426 634062 643871 655965 675242 688707 681998 664387 664723 698471 744802 764401 743733 716030 726721
-9712 726721 778357 827833 845447 853613 887464 938783 969815 967705 948552 916861 864438 808605 784367 788747
-9698 788747 777908 735125 696934 689926 686944 657824 622657 614103 619548 606527 582418 581117 603047 613600
-9684 613600 597236 574889 568079 577779 598126 622398 635961 628642 612770 607047 608174 601764 593588 602489 626112
-9669F26112J3587j2455l4437m5445l9936r481L1206M7205L2094J9750K7818K8806L510j7969
-9655F70365m277K3309K4850K140j3794j2399l919Q719K3076K2086p38k0671j7232p057j0050
-9640F84408j1634L799J2859p111k6974r725J8322M105l8389m2024M687L4293M307l9767l7298
-9625E53858K525K7512J8459j417j1122r767r16J2406K0784J6059M758K121J3406K6664K3442
-9610F98772j848l0459l5242j5425j625j1611j9204O412M5396M8495Q807k7172k4801l84J4877
-9595F54988J4629O561o108j4998n896J4628J7874m754k4440j8121j803N91n162k774K478
-9580F27693k61q29J1713K1372J0062o618l163J1474J0884q68o66M408j1837l7239k9706Q462
-9564F14881K1915j0440l5608j0218K6425J4796k6943l1035J2509M3201K5517n021p275P546
$$ plain form
-9669 626112 639699 627244 592807 547362 507426 497945 529151 576356 608450 628200 656018 684824 688334 670365
-9655 670365 666088 689397 714247 716387 702593 690194 686275 694994 718070 740156 739418 718747 701515 694458 684408
-9640 684408 672774 676573 689432 682321 655347 645622 663944 668049 629660 587636 592323 626616 630923 591156 553858
-9625 553858 556383 583895 602354 600937 589815 580048 579132 591538 612322 628381 633139 635260 648666 675330 698772
-9610 698772 696924 666465 631223 615798 614173 602562 583358 589770 635166 683661 692468 665296 640495 640111 654988
-9595 654988 669617 676178 670070 655072 649176 663804 681678 676924 652484 634363 632560 633151 627989 625215 627693
-9580 627693 627432 626603 638316 659688 669750 663132 659969 671443 682327 681459 680793 685201 673364 636125 606419 614881
-9564 614881 636796 626356 590748 580530 606955 621751 594808 563773 576282 619483 645000 639979 632704 640250
-9550F40250J0855O745J1802J5487q30k3306k1269M437K1930J4905m02q181j5862l3347m8834
-9535E74380m1298r636K3077L4453K4845J1618N468J037o001m928J3118L2461K8187K248j8492
-9520F70537k1160j7990j5630n543O412j386k1289j1997L2832N5855J8380k9715k0183K5818
-9506F64941L1306j3037l9443j7847K974j0794k2362j042J5016j3184m8465l0933K6629N8539
-9492F02298M0602P733j0854j9840k2955q782J9228L3921J8299j2882l2080k6591q330m419
-9478E75348k7422m7882j9914N0225R2581O0251k790k2575J618R183k0622m3079k8992r207
-9464E66723j4535k2591m83L5542M4063K1571K782N698J0366m477k9066l7477k0976M580J9753
-9449E81473K0412J4057N119p109j7580j4721M472K7648M0347L6299J1599l3986q0403r1266
$$ plain form
-9550 640250 651105 657850 669652 685139 684309 661003 639734 644171 666101 681006 680604 672423 656561 623214 574380
-9535 574380 533082 523446 546523 580976 605821 617439 622907 623944 617943 613015 626133 658594 686781 689029 670537
-9520 670537 649377 631387 615757 610214 616626 615240 593951 581954 614786 670641 689021 659306 639123 664941
-9506 664941 696247 683210 643767 625920 628894 618100 595738 594696 609712 596528 548063 517130 543759 602298
-9492 602298 642900 650633 639779 619939 596984 588202 607430 641351 659650 646768 614688 588097 579767 575348
-9478 575348 547926 500044 480130 530355 622936 683187 680397 657822 659440 668623 648001 604922 575930 566723
-9464 566723 552188 529597 529114 564656 608719 630290 633072 638770 649136 644659 615593 578116 557140 561720 581473
-9449 581473 601885 615942 621061 613952 596372 581651 586123 613771 654118 690417 702016 668030 587627 496361
-9435D96361n2986L675L9367M9282N0541M4246K1133n423q552R463J6242l151k6982l2860
-9421F00356k5119j4654J290K2301L0223J2571j2633j6003O056K9452L3308J9233J281j0980
-9407F76682j6943j9900k1972k2707k0333j3525l124O438R581P448R931K1951L0632J8363
-9393F62522j1745l6558l9141k0185J2844M5603M9317P246m5314m6832Q064N3049M1675J0091
-9379F90636R872K2531j245m7863n6091j5623J8061J2109k816N103K0391J6776j320j6652
-9365F53869k4007j9631J725K5120K3382q67j4695o387j07q661j3950q597j1269k1704r893
-9350E64328K3164K6337k1150n8863k6208M3617O9038L4002m518r668l845j2222k2006j4325
-9336E87681J963P623L70q894j0904j715J5632L0253L4083L0601K3583P044j9187l5728k5320
$$ plain form
-9435 496361 443375 447050 486417 535699 586240 630486 651619 646196 637644 647107 663349 660198 633216 600356
-9421 600356 575237 560583 561873 584174 614397 626968 614335 598332 604388 633840 667148 686381 687662 676682
-9407 676682 659739 639839 617867 595160 574827 561302 558178 564616 574197 581645 591576 613527 644159 662522
-9393 662522 650777 614219 575078 554893 567737 613340 662657 669903 624589 577757 585821 638870 680545 690636
-9379 690636 700508 723039 721794 673931 617840 602217 620278 632387 629571 634674 655065 671841 670521 653869
-9365 653869 629862 610231 611956 637076 660458 659591 644896 638509 638402 629741 615791 607194 595925 574221 564328
-9350 564328 587492 613829 592679 533816 507608 551225 620263 654265 649747 640079 636234 624012 602006 587681
-9336 587681 589644 597267 597637 588743 577839 576124 591756 622009 656092 686693 710276 717320 698133 662405 637085
-9321F37085K65J5283J4357J1051R343k98j9597l8161m8212m5556k1284K5138O6846O7414
-9307F73674K3019k9109m7857k3717J9969M7873L8423K965k3204k0597r168j7626l8827l8412
-9293E57406m854L2760M1450K0793l447r550J900J1689J889k2648l5903k0656R218K5899K0202
-9278F26148N664l599n128j647M934J2934K0798K4906J6747o135k4791j5173J1690J2243k7871
-9263F51720o1655m0736J3668L8665J6538r650o121R919R799l236j0709j0692r450M82K8572
-9248F17114N9412N8395R394n9602r4019o2340P742N1486L5474n491j4187J6810M1981K7706
-9234F89875p543k4523j1870R102J3764l281k6606l3903j7760M285R234k455q430M440K2874
-9219F17203K5176P610j1707j2299N189J6237J633k1311j6148J7757L5225R566k2487j3981
$$ plain form
-9321 637085 637350 652633 666990 678041 687384 687086 667489 629328 581116 535560 514276 539414 606260 673674
-9307 673674 696693 667584 619727 596010 615979 663852 702275 705240 682036 661439 652271 634645 595818 557406
-9293 557406 552552 585312 626762 647555 644108 634558 636458 648147 650036 627388 591485 570829 580047 605946 626148
-9278 626148 631812 628213 623085 621438 626372 639306 660104 685010 701757 695622 670831 655658 667348 679591 651720
-9263 651720 590065 549329 562997 601662 618200 608550 602429 612348 622147 618911 608202 597510 588060 588542 617114
-9248 617114 676526 734921 744315 684713 590694 528354 536096 587582 623056 617565 603378 620188 662169 689875
-9234 689875 682332 657809 645939 655041 668805 665524 638918 605015 587255 591540 600774 598319 589889 594329 617203
-9219 617203 642379 649989 638282 625983 631172 647409 649042 627731 611583 629340 664565 674131 651644 637663
-9205F37663J8278J9984j3031k8526k677K4066J5253n928j56K4995L2144J1032j5697l0250
-9191F87150l4369l3659k9960k5100j7490j612J9095K9410K2171Q623Q87j181P42P542Q906
-9176F41155j0141l8403m2328j5383P486L922k130J2500K6122J2870o444r21J1908o93j8246
-9161E81274K751M3414M0243r747l7430j0850J9356J3253N041K6464L6271q011o2051n5700
-9147E84278n322J6271r87k072K3939K3814j6252l3887P724N4591M5017p51k6213k5985l0032
-9132F14133l6270j9536J2297K6069J5572M81j3785l0680l2122k301K9464K1616j1411j7972
-9118E55555P774K0619M775m208Q847J0167j4185k3533N744K9752O243l2448l1499k726P2
-9103E40949k7040l4753k512L4441M5548M1528L6903J9524j9176n2909m6999m775L1966K8113
$$ plain form
-9205 637663 655941 675925 662894 634368 631691 655757 671010 665082 664926 689921 722065 733097 717400 687150
-9191 687150 652781 619122 589162 564062 546572 544960 564055 593465 615636 624259 625146 623965 624707 632249 641155
-9176 641155 631014 592611 550283 534900 542386 546308 544178 556678 582800 595670 589226 588305 600213 599520 581274
-9161 581274 584025 627439 667682 657935 620505 609655 629011 642264 647305 673769 710040 702029 639978 584278
-9147 584278 578956 595227 594240 592168 616107 639921 623669 589782 597506 652097 697114 696363 670150 644165 614133
-9132 614133 577863 558327 570624 596693 612265 612746 598961 568281 536159 533858 563322 584938 573527 555555
-9118 555555 563329 583948 588723 584515 593362 603529 589344 565811 571555 601307 607550 575102 543603 540877 540949
-9103 540949 513909 479156 476644 511085 556633 598161 635064 654588 635412 582503 535504 530729 562695 590808
-9089E90808p717l3901k2453J0935L1513L1111K8100K6582J0131j6172j7918J2385L0140L170
-9075F76714l2938k6403J1358K7757J1850O99R625J0618j3331l7672l2952J55L9323N7264
-9061G02067L2221k6635o8732n2977n165J4340n003j8122j420J8035J8969J7025K1820J4323
-9047F60746q908j6467M595K0145N179j2695j577K0482J9563K310l977j546r247k0384j6656
-9032F41563q274j6979l0802j8610J5900L5317K2993L79j1073j2479r850m888o449k1665l2430
-9017E42653j0927L4697O0537M3850J2272J226O902J810k1116m2875m7037l3949j1514J0299
-9003E46828J7767L306j9623k4680k160K7817L7237J9335q853k5928k0957L946L4138M7695
-8989F35868L2404lk4873k9976k1287o940R565K0791J8460Q811O441R660M042n717K674K5412
$$ plain form
-9089 590808 583091 549190 526737 537672 569185 600296 628396 654978 665109 648937 631019 643404 673544 676714
-9075 676714 643776 617373 628731 656488 668338 669037 678662 689280 675949 638277 605325 605480 644803 702067
-9061 702067 734288 707653 638921 585944 580779 595119 590116 571994 570574 588609 607578 624603 646423 660746
-9047 660746 651838 635371 639966 660111 665290 652595 651018 671500 691063 693373 689396 687850 678603 658219 641563
-9032 641563 633289 616310 585508 566898 582798 618115 641108 641487 630414 617935 608085 603197 596748 575083 542653
-9017 542653 531726 566423 626960 670810 683082 684308 691210 693020 671904 629029 581992 548043 536529 546828
-9003 546828 564595 567901 548278 523598 521438 549255 586492 605827 596974 571046 550089 554035 588173 635868
-8989 635868 668272 668269 643396 613420 592133 585193 594758 615549 634009 642820 649261 658921 662963 657246 659920 685332
-8973F85332K5993o923l1170j1956K1378J9064j5799m2068m5933m2296k9483K026K7017J0300
-8959E65482k9112l6271l895K1163J9043K0721L7802L4443m501l6202k3989R937K7838K7486
-8945F29945J9566p43k6232k4806J0297L6110J9748j4541k9714k7034k0378k761K3763K7417
-8931F20637k542k4837q016J7911J5394K69n67n128l1020l9606M246N4549M4362n281j9274
-8916F21097Q720J5849j4345k7219J389K3657M508k4062k4513r481l679m06J0957J5653J871
-8901E99996j4438j7004j2433r103k841K658n966k0135j0835K3300M4162K8190l73r373j766
-8886E94039K064n78J170J0257K0524K3883J2582r967k1416n371J9112J9942J14r057P41Q486
-8870F66525P690J2785J8230L53k9038k3108K3919N0949J2855n2274p6558n0488j7521m750
$$ plain form
-8973 685332 711325 704402 673232 661276 682654 701718 685919 643851 597918 555622 526139 528165 555182 565482
-8959 565482 536370 500099 496204 517367 536410 557131 594933 629376 624875 588673 564684 574621 602459 629945
-8945 629945 649511 648768 622536 597730 608027 644137 663885 649344 619630 592596 572218 569457 593220 620637
-8931 620637 618095 593258 585242 603153 618547 618816 618249 613121 582101 542495 546741 601290 645652 640371 621097
-8916 621097 629817 645666 631321 604102 605491 629148 633656 609594 585081 575600 571921 571515 582472 598125 599996
-8901 599996 585558 568554 556121 547018 544177 546835 540869 520734 509899 533199 577361 605551 605178 595805 594039
-8886 594039 596103 595525 596695 606952 627476 651359 663941 653974 632558 627187 646299 666241 666355 657298 658039 666525
-8870 666525 674215 687000 705230 705583 676545 653437 677356 728305 741160 688886 612328 561840 544319 539569
-8856E39569j141O096J0798M504q578j5283l292K5825M8252L7292j048k7888j5891K1486N1402
-8841F72103N4548L1072n154k9812k5820n433M247O01M808J8256J3230j9595m6479l4999Q93
-8826F32466K2000J2301j2076k7305j9940O000K8377K5356J234j8877k0915j0760M857K1097
-8812F43815K1782l986l1793k5337O727J8395k013j4338L981K0054L494k2768k3381m832P133
-8797E96933J1845J8538J5537o510k4395j3199J2433K3008J9613J8661J3168q651k3584l16
-8783F53081M0867M3298o567n6324n6266j7810J3129J6202R292J3307K3846K0723k201k5451
-8769F69126k6589q001R338J5371J6630J3816l053l0494m5032l2540o794J2001K0920K7006
-8755F31705L2155L4865L3941K5451R533q10L154M653j5118l6085j8570L3083O7037N5407
$$ plain form
-8856 539569 538428 544524 555322 559826 551248 535965 532673 558498 606750 644042 642994 615106 599215 620701 672103
-8841 672103 726651 757723 752569 722757 696937 691504 695751 696352 701160 719416 732646 713051 666572 631573 632466
-8826 632466 654466 666767 654691 627386 607446 613446 641823 667179 668413 649536 628621 617861 622718 643815
-8812 643815 665597 661611 629818 604481 611208 629603 627590 613252 617233 637287 640781 618013 594632 589800 596933
-8797 596933 608778 627316 642853 636343 611948 598749 611182 634190 653803 672464 685632 676981 653397 653081
-8783 653081 693948 737246 730679 674355 618089 600279 613408 629610 638902 652209 676055 696778 694577 669126
-8769 669126 642537 634536 643874 659245 675875 689691 686638 656144 611112 578572 571778 583779 604699 631705
-8755 631705 663860 698725 732666 758117 767650 766840 769994 774647 759529 723444 704874 737957 804994 860401
-8741H60401K8379J9445J6292q144m7632p3451p1517m8501k0317o133j1506j3033J0911L5544
-8727F70738J8617k4585l1697Q310L0044p412n5407n0610j936M0525N6727N2837K9651r78
-8713G34824p582J2782J8945n262j6870R633K9161L211k7594j2856J8816J3172j5100j9845
-8699G35435j3183l2715n4248k7862K3983L5501O925n554M738o702l7555l5012M866K5092
-8685F23709P216l194J3793K0385q91j5916r432j2266l2884l2926J528L1204L2881L2305M2103
-8670F97615L3496n21j9384n321K691k0181m0072k7295o358n381j0028n447r989k7905k2160
-8655E33760K2247N8030M3743O411q591n418q525q087J3676L6433L2534J6615J9144L5035
-8641G87007L9721L1747K1044j7l5883o1817n4998k9791j1168J791J6052J8381J944j0801
$$ plain form
-8741 860401 888780 908225 924517 916373 868741 795290 723773 675272 654955 648822 637316 624283 635194 670738
-8727 670738 689355 664770 633073 641383 671427 664015 608608 557998 556062 596587 653314 706151 735802 734824
-8713 734824 727242 740024 758969 753707 736837 746470 775631 778842 751248 738392 757208 770380 755280 735435
-8699 735435 722252 689537 635289 607427 631410 666911 673836 668282 673020 666318 628763 593751 598617 623709
-8685 623709 630925 627731 641524 661909 661018 645102 635670 623404 590520 557594 559122 590326 623207 655512 697615
-8670 697615 731111 730590 711206 705885 708576 688395 648323 621028 614670 609289 599261 593814 583825 555920 533760
-8655 533760 556007 614037 657780 664191 655600 650182 641657 633570 647246 683679 716213 732828 751972 787007
-8641 787007 826728 858475 879519 879502 843619 781802 726804 697013 685845 687636 703688 722069 724013 713212
-8627G13212n402l714j9755k3212R857M4129L3878k637j2991M745N701k1836l7892j7521J1909
-8612F78471J4811m690j4895J995L0556L7320O798l4607m3675j4592J3191J0397o339r975
-8598F64766l683j968P06J2553J8236J381k3311k9010j4541O03N535K217m359l368J5497L7960
-8582F79214L1615o694l7475l1815q152N190J1513K3849L4068L2962L0862L0226J0916k6600
-8568G79679m0219o038L5030L2542k315k4262k3265j9635j5731j864R311J242j0632m119Q075
-8553G17799M763J628K2519M6319L4367m533k7430k2998j4851j1455k178O859J043q067j555
-8538G42230P077k682j1147R981L6563K3316j6820l0008j0593l794k0523k1574M696J9944
-8524G26666P848J203J4643J4557j4452l2341q811K4952K8728J4727J6843L2768L5907K0371
$$ plain form
-8627 713212 707810 704096 684341 661129 670986 715115 748993 746356 733365 738110 743811 721975 684083 666562 678471
-8612 678471 693282 688592 673697 675692 706248 743568 750366 715759 672084 657492 670683 681080 674741 664766
-8598 664766 661083 659115 659821 672374 690610 691991 668680 639670 625129 625732 631267 633484 629125 625757 641254 679214
-8582 679214 710829 704135 666660 634845 626693 631883 643396 667245 701313 734275 765137 795363 806279 779679
-8568 779679 739460 733422 768452 800994 798679 774417 751152 731517 715786 713922 723233 724475 713843 709724 717799
-8553 717799 722562 724190 746709 793028 827395 822862 795432 772434 757583 746128 743950 750809 751852 743785 742230
-8538 742230 749307 746625 735478 745459 782022 805338 788518 758510 747917 744123 723600 702026 706722 726666
-8524 726666 734514 735717 750360 764917 750465 718124 709313 734265 762993 777720 794563 827331 863238 883609
-8510H83609N61j4811k1997j4688O44J146k0495l9085l0452m871R554K221j4026j9358l066
-8495G14886K2628K5638q441m5840m0357K418L1461K2420L309N47K708m432p041P345K1686
-8480G48935J7263M477J762O026O686Q835J9838K9640K5314J1627k67j2216l1060n1469n9813
-8465G25578m8304j8742J8627M6292N0544L4664J3528j371l643Q894K2383J1868k0526l3033
-8451H06759K68M3788M8329K1346J654j1560m0974o0328k2164M3782M8237k0800o6281k6132
-8437G65924L2984K3316l2091m7435n224L6064L6685J0193j9165l5339k0711K1010M5997K1828
-8423H34036j8363k1599M148J0645m466K202L5730M6388J2087k2998j8338M307N505p961l942
-8408H57381J5824J9847J423q962Q974L3344L0325K017j3814P780M4567N1118J3677l1271
$$ plain form
-8510 883609 884170 869359 847362 832674 833318 834464 813969 774884 744432 739561 749115 751336 737310 717952 714886
-8495 714886 737514 763152 754711 708871 668514 670932 702393 724813 728122 728669 731377 726945 719904 727249 748935
-8480 748935 766198 770675 772437 778463 785149 793984 813822 843462 868776 880403 880136 867920 836860 785391 725578
-8465 725578 677274 658532 677159 723451 773995 808659 822187 820816 817173 826067 848450 860318 839792 806759
-8451 806759 807027 850815 899144 920490 922144 910584 869610 809282 787118 830900 879137 858337 792056 765924
-8437 765924 798908 822224 790133 742698 737474 773538 810223 820416 801251 765912 745201 766211 812208 834036
-8423 834036 815673 794074 798222 808867 804401 806603 842333 888721 900808 877810 859472 863779 869284 861323 857381
-8408 857381 873205 893052 894475 885513 894487 927831 958156 960173 946359 954139 998706 1049824 1063501 1032230
-8394A032230l8033l459L2376L5311J5212Q298K6656M2226K8861M509P811L8842N5743L7289
-8380A323872J3719J6779L4447M3489N2234P1190P3644L8136N052K8570Q6177J05198P6022
-8367A968529O4763J03756J47171J60870J81959K48357L34195M05845M89494O28906Q17492
-8356E551337J021673J227937J406722J464170J299413R03667L60789k27312p67509j157554
-8346A1083333j318709j261843j079934q65740o60588m72451l04288j61553n6377J417L6022
-8335D939289J05594K37907L88715N07013O24076Q27810J157055J572847K029836K509572
-8325A4899714K950795L186592K999994K262172J037345m18919j765274k721802l166684l136075
-8315A6127858k767329k241156j723019j302258r79738p25336n30055l89145k71809j49099
$$ plain form
-8394 1032230 994197 990738 1023114 1058425 1073637 1081935 1108591 1150817 1179678 1184187 1191998 1230840 1286583 1323872
-8380 1323872 1337591 1354370 1388817 1432306 1484540 1555730 1629374 1667510 1672562 1701132 1787309 1892507 1968529
-8367 1968529 2033292 2137048 2284219 2445089 2627048 2875405 3209600 3615445 4104939 4733845 5551337
-8356 5551337 6573010 7800947 9207669 10671839 11971252 12874919 13235708 13008396 12240887 11083333
-8346 11083333 9764624 8502781 7422847 6557107 5896519 5424068 5119780 4958227 4901850 4903267 4939289
-8335 4939289 5044883 5282790 5671505 6178518 6802594 7630404 8787459 10360306 12390142 14899714
-8325 14899714 17850509 21037101 24037095 26299267 27336612 26917693 25152419 22430617 19263933 16127858
-8315 16127858 13360529 11119373 9396354 8094096 7114358 6389022 5858967 5469822 5198013 5048914
-8305E048914l3008N0694J13681J92959L04607M49949O51836R35036J269588J567683J730346
-8294A2282285J669442J314864O68968j38376r00303j457176j752239j790631j610536j301636
-8284F984662r84778p34817n50198m07867l06220k39604j78928j08923n2113k8111j7685O396
-8272C381814L9325O3775Q7523J29950J83960K21500K34446K47843K90146L65434M61457N78873
-8260F286046P43635R85412J312169J721317K221354K789836L284073L445954L065568K143438
-8250B7998802Q66387n35138j839748k794843l177344k975592k443325j892805j456299j088457
-8240A0661638p41225m44074k27426o0991J02486K78820M74298P10176R98943J340764J778941
-8229A4872350K414985L311386M395826N500371O444468O980828O691606N144711K331196
$$ plain form
-8305 5048914 5015906 5066600 5180281 5373240 5677847 6127796 6779632 7714668 8984256 10551939 12282285
-8294 12282285 13951727 15266591 15935559 15797183 14896880 13439704 11687465 9896834 8286298 6984662
-8284 6984662 5999884 5265067 4714869 4307002 4000782 3761178 3582250 3473327 3421214 3393103 3375418 3381814
-8272 3381814 3421139 3484914 3572437 3702387 3886347 4107847 4342293 4590136 4880282 5245716 5707173 6286046
-8260 6286046 7029681 8015093 9327262 11048579 13269933 16059769 19343842 22789796 25855364 27998802
-8250 27998802 28865189 28330051 26490303 23695460 20518116 17542524 15099199 13206394 11750095 10661638
-8240 10661638 9920413 9476339 9248913 9187922 9290408 9569228 10043526 10753702 11752645 13093409 14872350
-8229 14872350 17287335 20598721 24994547 30494918 36939386 43920214 50611820 55756531 58087727
-8220E8087727j085664m106249o040085o806184o687679n980886m930337l809415k856749
-8211A5784479k138923j583386j137498q09685n77630l68613j49537N0030K26534M35863P11575
-8200A0443209J027106J380952J845918K458293L081833L439517L286991K548818J328424
-8191C0841061j55541j633755k835164l542243l667879l313947k728330k152689j694007j341006
-8181G776500j062985q45837o61965m80381l16287k17053j89224j85776j70884j47706j17507
-8170C380895o7206r609J9369K0650L6902Q2451J24124J50898K01874K97997M06639N11068
-8158E156052O59514R00900J215534J543529J825717J968106J825474J304863M82151m25927
-8148A6455913j194028j677421j829861j706138j434655j132810q45015n79128l64616k27650
$$ plain form
-8220 58087727 57002063 52895814 46855729 40049545 33361866 27380980 22450643 18641228 15784479
-8211 15784479 13645556 12062170 10924672 10114987 9537357 9168744 9019207 9069237 9295771 9731634 10443209
-8200 10443209 11470315 12851267 14697185 17155478 20237311 23676828 26963819 29512637 30841061
-8191 30841061 30685520 29051765 26216601 22674358 19006479 15692532 12964202 10811513 9117506 7776500
-8181 7776500 6713515 5867678 5205713 4725332 4409045 4191992 4002768 3816992 3646108 3498402 3380895
-8170 3380895 3313689 3304080 3323449 3344099 3381001 3463452 3587576 3738474 3940348 4238345 4644984 5156052
-8158 5156052 5815566 6716466 7932000 9475529 11301246 13269352 15094826 16399689 16881840 16455913
-8148 16455913 15261885 13584464 11754603 10048465 8613810 7481000 6635985 6056857 5692241 5464591
-8138E464591j38746m3801O4661J57659K39661L55130N26631P36769R81330J301528J747266
-8127A1392679K323488K963375L520093L783092L543160K686278J266264m69242k120453l280321
-8117B5608413l739735l591154l117654k573857k068920j613066j208130q73718o21828m40144
-8107E760207l03492j94092j04193j7834R4770K45412M05184N49802P20884R88311J334902
-8096I479861J626402J722093J574160J198487O13713j28015q85973j478518j794395j835566
-8086A0092249j676223j416343j149337r23813p35358n73436m52692l76503l09416k26112
-8076B253016j54716j27819j23589j04102q0124q2231r4930p9701m3167k2797k2583k1136
-8064A296121k4779m9819o9144m4003L081J5281q891k3312k1078l5228n6988m0036N793J3292
$$ plain form
-8138 5464591 5325845 5282044 5346705 5504364 5744025 6099155 6625786 7362555 8343885 9645413 11392679
-8127 11392679 13716167 16679542 20199635 23982727 27525887 30212165 31478429 31009187 28888734 25608413
-8117 25608413 21868678 18277524 15159870 12586013 10517093 8904027 7695897 6822179 6200351 5760207
-8107 5760207 5456715 5262623 5158430 5140596 5235366 5480778 5885962 6435764 7156648 8144959 9479861
-8096 9479861 11106263 12828356 14402516 15601003 16214716 16086701 15200728 13722210 11927815 10092249
-8086 10092249 8416026 6999683 5850346 4926533 4191175 3617739 3165047 2788544 2479128 2253016
-8076 2253016 2098300 1970481 1846892 1742790 1662666 1580435 1485505 1405804 1362637 1339840 1317257 1296121
-8064 1296121 1271342 1221523 1152379 1108376 1111457 1126738 1117847 1094535 1073457 1038229 981241 941205 946998 960290
-8050I60290l0082n5329k6235M294p274k1537M253L3755J4567k9708l8701r631J1207N901
-8036H15770k924m61P366J6560K2776J1737j5979k9857j0501J6237J8163N151L062L910j5407
-8021H45603m2315m1036q628J9350J6728q191l0044k6448P557M3389L6076j6127n3333l0274
-8007G12307J3742R192l7295n1050l447M5170L7056k386j2178J3888K9260R080k0648k8294
-7993G14397j6903q852j2351j7358j3110K872K6266M4945M2074J4126j6224k1520o176k835
-7979G29351k4235m0704k3682Q502J6571l95p000J0074K3289J1952p167j3638j6509k9702
-7965F36707l9420k4937M444K2247K4447K7892L4752K7757L095j7840j8254q186o014j1949
-7951F54741j2245j621J0529J3549P037o92j416M379O064n638k2814k4054k272J9510J5853
$$ plain form
-8050 960290 930208 874879 848644 852938 845664 824127 828380 862135 876702 846994 808293 798662 809869 815770
-8036 815770 812846 812385 819751 836311 859087 870824 854845 824988 814487 830724 848887 854038 857100 861010 845603
-8021 845603 803288 762252 753624 772974 789702 781511 751467 725019 732576 775965 812041 795914 742581 712307
-8007 712307 726049 735241 697946 646896 643449 688619 725675 723289 711111 724999 754259 763339 742691 714397
-7993 714397 697494 688642 676291 658933 645823 648695 674961 719906 761980 776106 759882 738362 732186 729351
-7979 729351 705116 664412 640730 649232 665803 665408 658408 668482 691771 703723 696556 682918 666409 636707
-7965 636707 597287 572350 576794 599041 623488 651380 686132 713889 716984 699144 680890 672704 666690 654741
-7951 654741 642496 640875 651404 664953 671990 671298 669882 674261 680325 674687 651873 627819 625547 645057 660910
-7936F60910k576j612K2268L0748L345k3175q396K3557J7212k4415m0299p347K3651J0557
-7922F84428j7652j7807l062p087j6220L695L6848L5754L14k0954r166Q98j5092l3103k5543
-7907E96251m181M052m066j2991j2267j373J3626K0270J0954l379m714P962K0874K5654K0750
-7892F77422L482j8758k3092j985J6246P149q226J752K2172J6158p893q671J4580J9221o507
-7877G03050k4866j5640n645j2979j4189Q439L1833L0493J2646l691j5996k1184j0912J036
-7863F62395j4486n1101o2959k9443J6674M2675N3094N4179L0581j4048l8923k1751O279J1438
-7849F44604M053M180L057o301j601K5387L5990l97m9874n7582k2275J4403L0000L0910K0000
-7834F74554l406k3197k0923k085J5344K4613K4746J3344K225J3090L9503M5427K0630q86
$$ plain form
-7936 660910 658334 656722 678990 709738 713083 689908 681512 705069 722281 697866 657567 650220 673871 684428
-7922 684428 666776 648969 645907 638820 622600 626295 663143 698897 699211 678257 669091 669989 654897 621794 596251
-7907 596251 592070 596122 592056 579065 566798 565425 579051 599321 610275 606896 602182 610144 631018 656672 677422
-7892 677422 680904 662146 639054 637069 653315 660464 652238 653990 676162 692320 684427 675756 690336 709557 703050
-7877 703050 678184 662544 656899 643920 629731 638170 670003 700496 713142 709451 693455 672271 661359 662395
-7863 662395 647909 596808 533849 504406 521080 563755 616849 671028 701609 687561 648638 626887 633166 644604
-7849 644604 648657 652837 655894 649593 647992 673379 709369 708972 659098 601516 579241 593644 623644 654554 674554
-7834 674554 671148 647951 627028 624943 640287 664900 689646 702990 705215 718305 757808 803235 823865 822979
-7820H22979j28n946l7851o1919m3834n486J3152J1868R143J278j5728k1701j1567j6805m4309
-7805E93146m3421J2955O6103N5129J4334J2539L9104L5389N334J660K2656J6681j8922l3453
-7791G79234j6013p346j6739j0971Q618J957k7776l1390n052O37k1520j7878K1103L0876j4303
-7776F73437m7456j8432K4084K0030n572k112J3320r74k2822j340M9151O5847L2118r086k4909
-7761G45284j8594K931L1945L8668J310m6645n0631j3999Q855k218j1131K783J0465o379j5475
-7746F77169Q120K8719L187m2590m5693j304L0863J6997r219j1452m899j3929j9686M655L6635
-7731F57573L4039L452j3199q509r464j3759Q804M6130M5603N588p132L3541N7762P033o5431
-7716G82031p0655j4191K5439J8710P197J7217K5625J3871m427j6362k1974j2606J8514M6338
$$ plain form
-7820 822979 822851 816905 779054 717135 673301 667815 680967 692835 701978 703256 687528 665827 654260 637455 593146
-7805 593146 549725 562680 628783 683912 698246 710785 749889 785278 790612 792272 814928 831609 812687 779234
-7791 779234 763221 755875 739136 728165 736783 738740 710964 679574 674522 675159 653639 635761 656864 687740 673437
-7776 673437 625981 607549 631633 651663 646091 643979 657299 656325 633503 632163 681314 747161 779279 770193 745284
-7761 745284 726690 729621 761566 800234 801544 754899 704268 690269 699124 696906 685775 688558 699023 692644 677169
-7746 677169 685289 714008 717195 674605 628912 627608 658471 675468 666249 654797 649898 635969 616283 620938 657573
-7731 657573 691612 695064 681865 673356 663892 650133 658937 705067 750670 756258 749126 782667 840429 847462 782031
-7716 782031 711376 697185 722624 741334 748531 765748 791373 805244 800817 784455 762481 749875 768389 814727
-7702H14727L8821Q216m927O740J5157Q794J650k407q800l747K6713N7541N1783J7349j0119
-7687A017491k5518m2675m4338q935K7846J1650l8264n3088k7821k4424n3896m8403K0273
-7674G09898Q0630O4989M618k6911j1878J5175K6860J9702L973K373K8381N4499M1536L339
-7660A017184q786J0259J3199j4269l1386k0003j1354j5761k603K5203J9277j9376k0657L5904
-7646I76831P1053L1379j9954p618L7489M4043J8344J0549J6483J875j5258P304N4357P8922
-7632A305799Q5832J16789J72712K19739K53558K92269L22559L16228K85694K65771K54917
-7621C891867K25529J71148R3892k3991j76436k92268l08475k66095k63772l26131l82238
-7610B343030l67526k87665j86573j05692p1286p5310p5144m8505k7824m1833n8056l5376
$$ plain form
-7702 814727 853548 861764 856837 863577 878734 887528 889178 886771 877971 874224 900937 958478 1010261 1027610 1017491
-7687 1017491 991973 949298 904960 896025 923871 935521 897257 844169 816348 791924 738028 689625 709898
-7674 709898 790528 855517 860135 833224 821346 836521 863381 883083 887056 889429 917810 972309 1013845 1017184
-7660 1017184 1008398 1018657 1031856 1017587 986201 966198 954844 939083 936480 961683 980960 961584 940927 976831
-7646 976831 1047884 1079263 1059309 1051691 1089180 1133223 1151567 1162116 1178599 1180474 1165216 1172520 1226877 1305799
-7632 1305799 1391631 1508420 1681132 1900871 2154429 2446698 2769257 3085485 3371179 3636950 3891867
-7621 3891867 4117396 4288544 4382436 4358445 4182009 3889741 3581266 3315171 3051399 2725268 2343030
-7610 2343030 1975504 1687839 1501266 1395574 1324288 1248978 1173834 1125329 1097505 1055672 997616 962240
-7598I62240K596R233l481N343K3690J0433k2725l0889j7998k0205k6547j339L0131J0942
-7584I31424l9899m5744M09K5418K997r838J4082K2314j6237n0877l6303k720R088J2565K6692
-7569H43371K7971L019r189J8703M7265L2340k569q923J0538J9596J0272j423j3743k8802
-7555I48426k9378p506P793q684l2357k3972Q223K1828L184k0173k3449j0538J373J391q706
-7540H27455j5006m708J5069K4142J7506Q332K152o146p962J2647M1341M0437P115j4638o53
-7525I47083J4243o957m1783m1492m367K2264N795l4478n2900k4993K7640N5014L1293j1253
-7511H85109j9645J0827L4310K3461L316K950J1254M973r596j2155m600m500j6251l0713m1862
-7496H36878m6275l7594j7016J203O851O227Q530J1385P908j775j1352j2671r47J4674J3821
$$ plain form
-7598 962240 964836 974069 970588 975931 999621 1010054 987329 956440 938442 918237 891690 890351 920482 931424
-7584 931424 891525 845781 846190 871608 874605 864767 878849 901163 884926 834049 797746 795026 804114 816679 843371
-7569 843371 871342 874361 865172 883875 931140 963480 960911 951988 962526 982122 992394 990971 977228 948426
-7555 948426 919048 911542 919335 910651 878294 854322 862545 884373 887557 867384 843935 833397 834770 836161 827455
-7540 827455 812449 807741 822810 846952 864458 872790 874942 868796 860834 873481 914822 955259 962374 947736 947083
-7525 947083 961326 954369 912586 871094 866727 888991 894786 860308 807408 782415 810055 865069 896362 885109
-7511 885109 865464 876291 910601 934062 937378 940328 951582 956555 946959 934804 930204 925704 909453 878740 836878
-7496 836878 790603 753009 735993 737196 744047 750274 758804 770189 778097 776322 764970 752299 751352 766026 779847
-7481G79847p257k3738j7820p965j4197j6744Q968L6139K0496k0598k6473R654L0013R919
-7467G60244n663J0884J6485k6022p5640p0384j6838K8294L7618K8452J9769J3890Q565n73
-7453G29081j6835k6615r770K1561K7353j048k3889j5075P57k198r446n155o591k1776j7955
-7438F22399K2265N4868L6934q73j721K5904K6352j0621l7351k3930P425K6014K6570J5616
-7424G89851k98r420n293l78o530j1767p27J5181J5003J810p578j0760j1944n348N849j859
-7408G55792l2330m5252j1584L1880L0458o737k5016r241M764k686j1372o048L719J1772J9571
-7393G07690J2391k2140n2206l0843K7442N3931K2928j3559j0008Q729K404j4433m947K0475
-7379G07854K0527o449j9258o37J7409P618r461J74K9236L9020J6882o495n218M071o709k7380
$$ plain form
-7481 779847 772590 748852 731032 723067 708870 692126 701094 737233 757729 737131 710658 720312 750325 760244
-7467 760244 754581 765465 781950 755928 680288 609904 593066 621360 658978 687430 707199 721089 729654 729081
-7453 729081 712246 685631 675861 697422 724775 723727 699838 684763 685520 683322 673876 668721 662130 640354 622399
-7438 622399 644664 699532 736466 735593 733872 759776 786128 775507 738156 714226 721651 747665 774235 789851
-7424 789851 789553 780133 774840 774462 767932 756165 755438 770619 785622 787432 779854 769094 757150 751802 757651 755792
-7408 755792 723462 678210 666626 698506 728964 722227 697211 687970 692734 690048 678676 672628 676347 688119 707690
-7393 707690 720081 697941 645735 614892 642334 696265 719193 705634 695626 704355 706759 692326 687379 707854
-7379 707854 728381 721932 702674 702037 719446 727064 717603 717777 747013 786033 802915 796420 791202 795273 788564 761184
-7363G61184k3315P084K5596J2122o019r15J1452J944j9987k0680K276J4240n026l1846l0066
-7348F98044L809L6240L2767m188l4884k5688R249K4715M388j7758o131K8209M6159L1882
-7334H26813N397p849k632P898R027M06m269J601M182q254j9971r958R311R024n456k221J9432
-7317H32481K6562J3968J4799L4842L2888q014m4711m2426k6509k7689k7462l656J8068R685
-7303H02826n286L440J6042O739K077L0652N4516K4975k5137k6796R674J1920k9967m6622
-7289H29053o275L5629K8600j781q060R065J9902J5272O968N959J9074M3756N7083L5885p063
-7274A083067l3157k6136m816R005Q241o637k3542j8310J1064K6637L049k4664j2065J9022
-7260A010758J4532j9337k5807O328K8070J7114Q953K5466L7454K1045m861k0075l0364l3045
$$ plain form
-7363 761184 737869 744953 770549 782671 776652 775737 787189 789133 769146 748466 750742 764982 759956 728110 698044
-7348 698044 701853 738093 770860 766672 731788 706100 715349 740064 744452 726694 720563 748772 794931 826813
-7334 826813 832210 824361 821729 829627 838654 839060 834791 836392 840574 832320 812349 802391 811702 820726 815270 813049 832481
-7317 832481 859043 873011 887810 922652 955540 947526 902815 860389 833880 806191 778729 775073 793141 802826
-7303 802826 797540 800980 817022 823761 825838 856490 911006 935981 910844 884048 893722 905642 875675 829053
-7289 829053 822778 858407 887007 885226 877166 886231 906133 921405 928373 934332 953406 997162 1054245 1090130 1083067
-7274 1083067 1049910 1023774 1018958 1027963 1036204 1029567 1006025 987715 998779 1025416 1028465 1003801 991736 1010758
-7260 1010758 1025290 1005953 980146 986474 1014544 1031658 1040611 1066077 1103531 1124576 1119715 1099640 1069276 1036231
-7246A036231p605L6670N4533L1614R564J8542L1919J8185o380j0880J129Q971J0753J1859
-7232A245105M811j2443k1567j0167Q639K0331K9321M0014M2545L2188J9879J1541R76q162
-7218A403011N78K7908N1549N4131L6997P754k0103k2540P327L5906L1029J4128K4683M8271
-7204A700629L9358O682M898L9961N7293L6585K1729L5201L8830J1751n086J8706N2983P1006
-7190B130526R6851J40374J49534Q8585J1369p422K6249N4260O0796P4886J02949J20230J19440
-7177C168627J20180J36158J65929K04246K37252K46632K42549K68198L48754M63656N88870
-7166F191051P28069Q76283R94200J051487J057176J017142R07638P30241N47460M17028L28880
-7155A4846655K51891K00749K04720K49661L10211M07309N70305P62196R01764R47171R11047
$$ plain form
-7246 1036231 1028626 1065296 1119829 1151443 1161007 1179549 1211468 1229653 1223273 1212393 1213522 1222493 1233246 1245105
-7232 1245105 1249916 1237473 1215906 1205739 1214378 1234709 1264030 1304044 1346589 1378777 1398656 1410197 1411173 1403011
-7218 1403011 1403589 1431497 1483046 1537177 1574174 1581928 1561825 1539285 1546612 1582518 1613547 1627675 1652358 1700629
-7204 1700629 1739987 1746669 1751567 1791528 1848821 1885406 1907135 1942336 1981166 1992917 1987831 2006537 2059520 2130526
-7190 2130526 2227377 2367751 2517285 2605870 2617239 2609817 2636066 2690326 2751122 2826008 2928957 3049187 3168627
-7177 3168627 3288807 3424965 3590894 3795140 4032392 4279024 4521573 4789771 5138525 5602181 6191051
-7166 6191051 6919120 7795403 8789603 9841090 10898266 11915408 12823046 13553287 14100747 14517775 14846655
-7155 14846655 15098546 15299295 15504015 15753676 16063887 16471196 17041501 17803697 18705461 19652632 20563679
-7144B0563679Q13266O73762N39317M66185M80932N92477Q19462J157244J533504J845709
-7134B9485537K036953K104098K059241J931746J783280J657190J515769J276220R05220M37964
-7124D5193218p5770n79841r65125j085339q65247l82070J69637N85182P39964O22456L12902
-7113D3669967o5324l84750n39266m79548k39178R4973M36293O97069P69317O01238L12344
-7102D4873135J36161J86500L41435M06729L18351J18683j79287n86899j034767j378684j508744
-7091D1692613j393571j061363o27669l06235k74490n14197q57312j175523j440604j621674
-7081C2419975j646283j493306j236194r66016p41878o22489o48660p60969q22328p70419
-7071B2711433o80294o36282o14446n46142m35725l45920k99433k53592j56844J0400K36185
$$ plain form
-7144 20563679 21376945 22050707 22590024 23056209 23537141 24129618 24949080 26106324 27639828 29485537
-7134 29485537 31522490 33626588 35685829 37617575 39400855 41058045 42573814 43850034 44755254 45193218
-7124 45193218 45117448 44537607 43572482 42487143 41621896 41239826 41409463 41994645 42734609 43357065 43669967
-7113 43669967 43604643 43219893 42680627 42201079 41961901 42056874 42493167 43190236 43959553 44560791 44873135
-7102 44873135 45009296 45195796 45537231 45943960 46262311 46380994 46201707 45614808 44580041 43201357 41692613
-7091 41692613 40299042 39237679 38610010 38303775 38029285 37515088 36657776 35482253 34041649 32419975
-7081 32419975 30773692 29280386 28044192 27078176 26336298 25713809 25065149 24304180 23481852 22711433
-7071 22711433 22031139 21394857 20780411 20234269 19798544 19452624 19153191 18899599 18742755 18753155 18989340
-7060A8989340M82541O94478Q21595Q29147O96738M36793J17242j69411l71692m90983n32531
-7049B1503257m87309l69763k28939j00785K0527J50322K84151M16574N60731P29859R13126
-7038B3391751J075137J165620J139599R97749Q06288O53049N90486O42500Q37564J177555
$$ plain form
-7060 18989340 19471881 20166359 20987954 21817101 22513839 22950632 23067874 22898463 22526771 22035788 21503257
-7049 21503257 21015948 20646185 20417246 20316461 20336988 20487310 20771461 21188035 21748766 22478625 23391751
-7038 23391751 24466888 25632508 26772107 27769856 28576144 29229193 29819679 30462179 31299743 32477298
$$ [...]
##END=	
