##TITLE=	Mar13-2020.420.1.1r
CZ002
##JCAMP-DX=	6.0	$$ MestReNova 14.1.0-24037
##DATA TYPE=	LINK
##BLOCK_ID=	1
##BLOCKS=	2    
##ORIGIN=	Mestrelab Research S.L.
##OWNER=	cz1619
##$MNOVA/LINK_BLOCK_TYPE=	ITEM	$$ NMR Spectrum
##$MNOVA/ITEM/POLYGON=	(XY..XY)
5321,5835
8722,5835
8722,8208
5321,8208
5321,5835
##$MNOVA/ITEM/Z=	0
##$MNOVA/ITEM/ANGLE=	0
##TITLE=	Mar13-2020.420.1.1r
##JCAMP-DX=	6.0	$$ MestReNova 14.1.0-24037
##BLOCK_ID=	2
##DATA TYPE=	NMR SPECTRUM
##DATA CLASS=	XYDATA
##NUMDIM=	1
##ORIGIN=	Bruker BioSpin GmbH
##OWNER=	nmrsu
##.OBSERVE FREQUENCY=	400.05240029848198446
##.OBSERVE NUCLEUS=	^1H
##.SOLVENT NAME=	CDCl3
##.PULSE SEQUENCE=	zg30
##LONGDATE=	2020/03/13 18:53:00.000
##.ACQUISITIONMODE=	SIMULTANEOUS
##$ORIGINAL FORMAT=	Bruker XWIN-NMR
##$MNOVA/SCALES_VERSION=	8
##$PARAMETER FILE=	(acqus, ASCII, //ch-nmrserv3.ch.ic.ac.uk/Av400D/ug1/nmr/Mar13-2020/420/acqus, 0)
$$ ##TITLE= Parameter file, TOPSPIN		Version 3.2
$$ ##JCAMPDX= 5.0
$$ ##DATATYPE= Parameter Values
$$ ##NPOINTS= 11	$$ modification sequence number
$$ ##ORIGIN= Bruker BioSpin GmbH
$$ ##OWNER= nmrsu
$$ $$ 2020-03-13 18:53:36.922 +0000  nmrsu@nmrpc
$$ $$ /opt/topspin/data/ug1/nmr/Mar13-2020/420/acqus
$$ $$ process /opt/topspin3.2/prog/mod/shimcntl
$$ ##$ACQT0= -2.04831932773109
$$ ##$AMP= (0..31)
$$ 100 100 100 100 100 100 100 100 100 100 100 100 100 100 100 100 100 100
$$ 100 100 100 100 100 100 100 100 100 100 100 100 100 100
$$ ##$AMPCOIL= (0..19)
$$ -1 0 0 0 0 0 0 0 0 0 0 0 0 0 0 0 0 0 0 0
$$ ##$ANAVPT= -1
$$ ##$AQSEQ= 0
$$ ##$AQ_mod= 3
$$ ##$AUNM= <au_zg>
$$ ##$AUTOPOS= <25 >
$$ ##$BF1= 400.05
$$ ##$BF2= 400.05
$$ ##$BF3= 400.05
$$ ##$BF4= 400.05
$$ ##$BF5= 400.05
$$ ##$BF6= 400.05
$$ ##$BF7= 400.05
$$ ##$BF8= 400.05
$$ ##$BYTORDA= 0
$$ ##$CAGPARS= (0..11)
$$ 0 0 0 0 0 0 0 0 0 0 0 0
$$ ##$CFDGTYP= 0
$$ ##$CFRGTYP= 9
$$ ##$CHEMSTR= <none>
$$ ##$CNST= (0..63)
$$ 1 1 1 1 1 1 1 1 1 1 1 1 1 1 1 1 1 1 1 1 1 1 1 1 1 1 1 1 1 1 1 1 1 1 1 1
$$ 1 1 1 1 1 1 1 1 1 1 1 1 1 1 1 1 1 1 1 1 1 1 1 1 1 1 1 1
$$ ##$CPDPRG= (0..8)
$$ <> <> <> <> <> <> <> <> <>
$$ ##$D= (0..63)
$$ 0 1 0 0 0 0 0 0 0 0 0 0 0 0 0 0 0.0002 0 0 0 0 0 0 0 0 0 0 0 0 0 0 0 0
$$ 0 0 0 0 0 0 0 0 0 0 0 0 0 0 0 0 0 0 0 0 0 0 0 0 0 0 0 0 0 0 0
$$ ##$DATE= 1584125616
$$ ##$DE= 6.5
$$ ##$DECBNUC= <off>
$$ ##$DECIM= 2496
$$ ##$DECNUC= <off>
$$ ##$DECSTAT= 4
$$ ##$DIGMOD= 1
$$ ##$DIGTYP= 12
$$ ##$DQDMODE= 0
$$ ##$DR= 22
$$ ##$DS= 4
$$ ##$DSPFIRM= 0
$$ ##$DSPFVS= 20
$$ ##$DTYPA= 0
$$ ##$EXP= <proton>
$$ ##$F1LIST= <>
$$ ##$F2LIST= <>
$$ ##$F3LIST= <>
$$ ##$FCUCHAN= (0..9)
$$ 0 2 0 0 0 0 0 0 0 0
$$ ##$FL1= 90
$$ ##$FL2= 90
$$ ##$FL3= 90
$$ ##$FL4= 90
$$ ##$FOV= 20
$$ ##$FQ1LIST= <>
$$ ##$FQ2LIST= <>
$$ ##$FQ3LIST= <>
$$ ##$FQ4LIST= <>
$$ ##$FQ5LIST= <>
$$ ##$FQ6LIST= <>
$$ ##$FQ7LIST= <>
$$ ##$FQ8LIST= <>
$$ ##$FRQLO3= 15959.0749999881
$$ ##$FRQLO3N= 2
$$ ##$FS= (0..7)
$$ 83 83 83 83 83 83 83 83
$$ ##$FTLPGN= 0
$$ ##$FW= 125000
$$ ##$FnMODE= 0
$$ ##$FnTYPE= 0
$$ ##$GPNAM= (0..31)
$$ [...]
$$ 130000 130000 130000 130000 130000 130000 130000 130000 130000 130000 130000
$$ 130000 130000 130000 130000 130000 130000 130000 130000 130000 130000 130000
$$ 130000 130000 130000 130000 130000 130000 130000 0 0 0 0 0 0 0 0 0 0 0
$$ 0 0 0 0 0 0 0 0 0 0 0 0 0
$$ ##$ShimPowMaxUC= (0..63)
$$ 130000 130000 130000 130000 130000 130000 130000 130000 130000 130000 130000
$$ 130000 130000 130000 130000 130000 130000 130000 130000 130000 130000 130000
$$ 130000 130000 130000 130000 130000 130000 130000 130000 130000 130000 130000
$$ 130000 130000 130000 130000 130000 130000 130000 0 0 0 0 0 0 0 0 0 0 0
$$ 0 0 0 0 0 0 0 0 0 0 0 0 0
$$ ##$ShimPowMaxUG= (0..63)
$$ 524287 524287 524287 524287 524287 524287 524287 524287 524287 524287 524287
$$ 524287 524287 524287 524287 524287 524287 524287 524287 524287 524287 524287
$$ 524287 524287 524287 524287 524287 524287 524287 524287 524287 524287 524287
$$ 524287 524287 524287 524287 524287 524287 0 0 0 0 0 0 0 0 0 0 0 0 0 0 0
$$ 0 0 0 0 0 0 0 0 0 0
$$ ##$ShimPowRcbType= 3
$$ ##$ShimPowRes= (0..63)
$$ 1e-20 1e-20 1e-20 1e-20 1e-20 1e-20 1e-20 1e-20 1e-20 1e-20 1e-20 1e-20
$$ 1e-20 1e-20 1e-20 1e-20 1e-20 1e-20 1e-20 1e-20 1e-20 1e-20 1e-20 1e-20
$$ 1e-20 1e-20 1e-20 1e-20 1e-20 1e-20 1e-20 1e-20 1e-20 1e-20 1e-20 1e-20
$$ 1e-20 1e-20 1e-20 1e-20 0 0 0 0 0 0 0 0 0 0 0 0 0 0 0 0 0 0 0 0 0 0 0 0
$$ ##$ShimPowRng0= (0..63)
$$ 1 1 1 1 1 1 1 1 1 1 1 1 1 1 1 1 1 1 1 1 1 1 1 1 1 1 1 1 1 1 1 1 1 1 1 1
$$ 1 1 1 1 0 0 0 0 0 0 0 0 0 0 0 0 0 0 0 0 0 0 0 0 0 0 0 0
$$ ##$ShimPowRng1= (0..63)
$$ 1 1 1 1 1 1 1 1 1 1 1 1 1 1 1 1 1 1 1 1 1 1 1 1 1 1 1 1 1 1 1 1 1 1 1 1
$$ 1 1 1 1 0 0 0 0 0 0 0 0 0 0 0 0 0 0 0 0 0 0 0 0 0 0 0 0
$$ ##$ShimPowRng2= (0..63)
$$ 1 1 1 1 1 1 1 1 1 1 1 1 1 1 1 1 1 1 1 1 1 1 1 1 1 1 1 1 1 1 1 1 1 1 1 1
$$ 1 1 1 1 0 0 0 0 0 0 0 0 0 0 0 0 0 0 0 0 0 0 0 0 0 0 0 0
$$ ##$ShimPowRng3= (0..63)
$$ 1 1 1 1 1 1 1 1 1 1 1 1 1 1 1 1 1 1 1 1 1 1 1 1 1 1 1 1 1 1 1 1 1 1 1 1
$$ 1 1 1 1 0 0 0 0 0 0 0 0 0 0 0 0 0 0 0 0 0 0 0 0 0 0 0 0
$$ ##$ShimSysFunc= (0..63)
$$ 1 2 3 4 5 6 7 8 9 10 0 37 38 35 16 15 14 13 12 11 28 27 26 25 24 23 36
$$ 22 30 29 20 21 34 33 32 31 17 18 19 0 0 0 0 0 0 0 0 0 0 0 0 0 0 0 0 0 0
$$ 0 0 0 0 0 0 0
$$ ##$ShimSysMatrix= 0
$$ ##$ShimSysType= 4
$$ ##$TFXNUM= 0
$$ ##$TRIPLO2= 0
$$ ##$VTU= 2
$$ ##$VTUETH= <149.236.99.20>
$$ ##$VTUTY= <no>
$$ ##$WBREFAM= (0..15)
$$ 136.7 118.7 100 100 100 100 100 100 100 100 100 100 100 100 100 100
$$ ##$WBREFLM= (0..15)
$$ 0 0 0 0 0 0 0 0 0 0 0 0 0 0 0 0
$$ ##$WBREFPH= (0..15)
$$ 77.55 -71.28 0 0 0 0 0 0 0 0 0 0 0 0 0 0
$$ ##$WBSGU= (0..15)
$$ 0 0 0 0 0 0 0 0 0 0 0 0 0 0 0 0
$$ ##$XFAC= 2
$$ ##END=
$$ 
##$DECIM=	2496
##$DSPFVS=	20
##XUNITS=	HZ
##YUNITS=	ARBITRARY UNITS
##FIRSTX=	6406.710256386850233
##LASTX=	-1606.1102564336499654
##DELTAX=	-0.24453933874997710318
##XFACTOR=	1
##YFACTOR=	2.5073387896665453312
##FIRSTY=	33.42578125
##MINY=	-1291.4459228515625
##MAXY=	20332882
##NPOINTS=	32768
##XYDATA=	(X++(Y..Y))
6407 13 43 43 73 53 0 9 21 43 120 111 65 34 27 77 166 141 66 80 24 -44 -43 14 53 67 132 56 60 10 102 129 149 132 60 27 99 126 143 73
6397 73 52 56 102 115 95 -10 27 128 98 172 154 -1 73 128 138 140 142 111 76 103 165 119 142 114 148 99 187 133 110 163 238 141 100 114 194
6389 194 197 157 88 -20 -33 83 101 63 145 184 176 125 18 85 46 -21 33 61 95 77 74 42 41 145 120 106 59 39 22 44 -14 -44 31 63 73
6380 73 85 92 107 81 15 27 101 246 140 33 42 110 50 -48 6 86 58 0 70 199 94 -12 51 87 46 -44 -68 -49 -15 -36 56 70 100
6372 100 96 93 61 44 1 103 206 85 58 99 110 99 116 98 -20 -9 32 61 64 67 81 91 63 54 74 64 78 75 47 78 47 13 117 135 83
6364 83 152 200 142 166 110 112 72 49 52 86 140 67 1 13 107 140 81 57 122 129 78 44 78 110 118 126 162 76 54 83 98 63 91 125 95 64 124 99
6354 99 103 104 94 60 11 111 124 58 -5 11 -10 91 60 102 30 65 147 124 120 131 130 45 41 43 -14 -29 24 51 6 -5 93 167 145 204 148 117 100
6345 100 90 89 64 -48 69 156 101 42 37 66 23 55 97 101 165 8 39 -2 17 50 80 125 70 108 170 119 67 6 63 109 -15 90 142 42
6337 42 -7 105 77 -38 -14 -50 108 49 31 22 34 15 -16 22 -9 -118 -95 -39 1 -26 25 17 -16 19 50 14 33 -2 5 -64 -47 87 112 -19
6329 -19 -103 -24 32 43 44 -91 -38 -27 90 -40 -44 -20 3 -5 35 120 100 68 54 -81 -97 -23 -47 -20 8 116 139 135 39 44 55 24 13 118 152
6320 152 48 42 161 194 42 15 113 92 -51 52 132 13 -85 -101 4 112 13 -9 19 47 89 285 171 80 87 85 69 -11 -118 -23 0
6313 0 -60 38 -26 -23 -12 -30 22 33 23 74 -47 -51 -83 -88 -87 49 175 232 221 190 262 264 261 198 84 239 203 183 250 247 173 165 244 226 222 212 137 92
6303 92 62 85 59 -10 5 52 -6 -15 105 81 54 156 112 63 89 10 31 2 -22 4 6 89 134 84 0 64 49 48 -3 -142 -176 -42 78 68
6295 68 25 36 -87 -114 -55 18 -12 -160 -140 -23 -1 33 -5 -71 28 63 16 -27 -67 50 105 119 125 194 86 26 2 42 77 83 142 79 82 78 74
6286 74 171 97 107 114 62 -39 12 44 87 122 128 20 -32 29 -50 2 41 -76 -117 -74 -112 -38 42 -32 -69 -168 -145 -49 -63 53 66 -126 -25
6278 -25 33 98 89 37 13 110 197 153 -50 -37 73 61 23 145 130 5 87 32 96 211 153 154 92 14 38 131 141 139 179 180 77 21 124 220
6270 220 99 61 85 158 119 100 96 109 146 167 157 87 74 139 183 129 135 91 93 128 57 36 68 39 142 10 17 -21 -62 -68 -10 23 -25 8 20 65
6261 65 9 -82 -114 -105 -44 -29 -5 19 -113 -119 15 -27 48 69 27 126 59 -110 -108 -19 90 129 29 85 39 14 111 70 80 19 -41 -19 -204 -35
6253 -35 65 85 159 49 -90 -74 20 39 65 96 84 109 73 106 127 39 95 137 84 -16 -5 46 -33 -20 -81 20 1 39 66 53 66 46 41
6245 41 115 60 12 -67 -23 87 16 -12 -127 -42 -44 42 44 58 48 53 38 71 149 130 142 37 -24 12 73 56 28 -75 -89 -50 -24 48 53 -5 -62
6236 -62 -58 -92 -17 108 97 54 13 36 102 134 171 176 64 -124 -85 11 4 81 87 35 -44 -50 -11 -24 72 136 80 110 96 -5 59 71 -143 -159 -48
6228 -48 -72 -42 -34 0 -64 -116 87 134 -51 -55 -95 -53 -119 -109 -88 56 22 -37 54 6 -188 -34 22 36 -30 -107 -89 26 26 -21 14 -52 -104 -103
6219 -103 -87 -60 4 -65 -46 -2 28 41 74 48 29 5 64 27 -51 -8 -87 -115 -9 -35 -12 36 161 113 189 143 51 84 139 92 39 38 29 110 154
6211 154 37 26 201 264 267 41 -36 -23 -115 -137 3 26 87 77 148 59 99 85 61 -52 -28 -26 -28 -54 113 73 111 132 170 210 162 102 72
6203 72 130 135 110 171 176 57 -88 -49 75 54 52 0 30 96 110 47 48 46 0 -54 -33 7 68 99 85 47 -27 58 -92 -107 -61 9 92 96 60 26
6194 26 114 96 115 150 64 -97 87 225 119 120 61 181 172 135 86 67 -16 -53 34 80 111 144 70 -23 76 68 -13 14 43 91 79 80 133 80 111
6185 111 111 157 23 -61 -61 -123 -96 -38 -66 33 90 115 146 109 119 101 158 65 -10 -49 -55 -45 -63 -23 -43 4 43 18 36 4 -36 25 101 42 -22 4
6177 4 -1 -38 -122 -74 73 9 37 70 46 96 0 -41 -89 -92 -55 -31 45 19 37 82 94 0 6 27 25 49 84 160 43 19 -23 92 -24 -125 -29
6168 -29 39 -50 76 41 27 26 -46 7 9 -76 -149 -118 -63 -232 -222 -51 4 -56 -136 -92 94 96 -19 -8 65 158 42 52 58 -39 104 30 22 -33
6160 -33 -11 -22 -24 32 30 72 106 11 47 -8 8 103 16 -76 -103 11 57 46 4 -22 -16 24 91 73 -43 11 161 46 35 100 10 -43 -1 -89 -148
6151 -148 -65 11 16 23 57 60 53 -52 -80 -65 111 170 126 75 36 70 63 79 99 -21 -34 85 118 108 0 -16 -43 18 -3 17 67 -40 -8 88
6143 88 -2 -30 36 36 17 16 94 73 -25 6 36 33 -71 48 17 120 100 187 113 60 130 146 52 91 80 33 54 4 -58 -10 -10 61 116 161 162 37
6134 37 92 155 121 -48 -89 -5 -15 -110 13 34 111 210 191 165 161 21 -128 -61 98 146 141 173 179 56 29 68 78 58 -2 61 -4 -93 -94 -16
6126 -16 136 162 187 60 -2 75 43 5 -102 -12 0 63 50 28 -25 50 100 23 -3 31 -119 -123 -128 -101 -105 -78 -48 -94 12 102 53 11 121 71
6117 71 90 76 28 -78 -58 -58 -107 -103 -25 -50 8 -70 -31 13 74 25 -46 -113 -71 124 65 -81 -19 28 20 -35 -42 -55 -82 -16 -45 10 80 139 40 -19
6109 -19 0 -13 30 61 146 225 165 16 91 85 63 6 94 43 125 12 -90 -100 -119 -163 -108 -41 7 -27 33 30 55 79 93 17 5 -28 -84 34
6100 34 6 73 70 15 -65 -74 -9 68 126 8 35 114 26 17 112 -8 -37 -46 86 104 37 -5 10 -102 -64 -43 -24 18 -57 -71 -89 -75 -88 -152 -63
6092 -63 -143 -144 -120 -94 -167 -123 -30 -28 -7 -53 -38 -64 -140 -146 -110 -53 -61 -66 33 104 -20 0 38 31 -15 104 41 -18 57 -38 -113 -56 -64 -92 -57 -60 24 49
6082 49 5 51 33 190 199 27 41 79 170 11 -5 -16 -57 27 36 -1 28 81 130 53 -3 -6 136 42 -23 9 42 10 -47 93 106 101 63 21 12
6074 12 -26 -25 45 15 2 -35 -19 57 143 238 184 95 115 75 89 132 93 52 -41 -88 -58 -181 -129 23 -76 -144 -128 -26 118 160 -18 69 51
6066 51 15 -62 -50 5 -37 37 -1 25 18 -41 -157 -53 29 -4 4 -70 -30 -104 -42 -7 9 26 -33 -46 -17 27 13 -116 -101 -23 0 -62 -82 -5 -73
6057 -73 -70 -79 0 115 142 102 18 28 6 -7 -59 -79 -12 72 87 -39 -53 -45 -85 -26 -17 -56 -119 -70 74 86 28 37 102 127 44 29 -54 1 -42 -16
6048 -16 47 51 -33 -37 23 63 -50 -3 150 142 54 31 -1 56 32 159 108 80 162 56 41 -3 -39 -66 -51 12 57 88 42 -47 58 159 52
6040 52 31 -2 63 -61 -93 -69 -77 -92 5 47 -158 -157 -69 -11 -17 -96 -44 12 -72 -108 -118 -34 -44 -15 -50 -182 -15 6 -64 0 28 -7 -75 -115 -46
6032 -46 -43 -28 44 22 -30 10 -13 0 10 -98 -139 -60 -73 -74 13 82 155 150 96 37 66 106 112 153 149 26 71 145 137 73 -71 -8 -29 -64 25 116 87
6023 87 44 37 -56 12 41 -11 -42 -43 -38 -141 -194 -50 -38 -93 -18 -4 -51 -105 -148 -45 34 66 112 65 -176 -152 25 34 -49 -100 -6 16 -47 -89 -65
6014 -65 -89 -101 -75 -85 -76 -39 -93 -221 -153 37 -37 -87 -71 -136 -128 -62 -58 -127 -61 -148 -66 85 -49 -151 -98 119 121 108 77 36 -85 1 -42 3
6006 3 41 90 16 -63 -121 -150 -99 -34 -40 27 80 151 84 49 29 3 7 -68 -23 -71 -124 -78 -202 -217 -111 -41 -4 -9 -110 -210 -119 -14 -38 -82 25
5997 25 24 13 -14 -3 -89 -93 -61 -9 -2 -101 -188 -29 44 -37 30 -61 -108 -116 -102 -40 -80 -111 -119 -9 160 168 104 18 73 149 85 52 21 84 151 112 48
5988 48 2 22 -80 -182 -4 79 9 -65 10 -76 -9 104 -24 -119 -69 6 -20 65 80 60 -18 -61 62 10 -32 -22 -20 -96 10 58 88 45
5980 45 25 -86 -129 -35 23 -122 -42 84 57 80 103 -35 54 33 -23 -16 13 20 42 -16 -50 -34 109 8 3 48 -27 -77 19 62 85 -8 -128
5972 -128 -100 -118 -164 -21 -54 -88 -7 18 12 87 -89 -41 21 17 62 14 -88 -151 -157 -81 -16 -99 -154 -103 -74 -154 -248 -143 -137 -102 20 10 3 50 50
5964 50 31 -48 -37 -42 -30 -38 -15 -77 -58 27 -44 -124 19 57 74 110 83 119 23 -49 0 -63 -72 -8 -42 62 121 109 -19 -91 -44 -71 -214 -159 -4
5955 -4 -24 43 60 8 72 -62 -58 43 52 51 14 -51 -12 75 -16 -2 90 70 134 88 -26 -7 90 99 36 -44 -90 30 40 34 180 107 175 79 102 -26
5946 -26 -44 40 -92 -31 13 18 -22 1 -5 -21 53 76 169 75 48 106 -16 3 -11 -54 13 -70 -52 15 30 79 14 -38 -46 35 73 -12 -61 -73 -33 -94
5938 -94 -59 -45 -59 -98 -66 -44 21 -5 -7 0 -58 -115 -74 -55 10 -39 -48 -9 -1 -55 36 -44 -46 -25 -112 -108 -118 -93 -105 -141 -176 -153 -89 40 14 -60 -10 -133
5928 -133 -183 -140 -91 -67 40 48 -72 -76 -22 -29 33 -14 53 120 75 125 -26 -2 57 45 32 -43 -34 -66 -85 -86 -88 -5 -72 -120 -109 -65 81 103 -50
5920 -50 -72 -25 23 -16 -75 -96 -50 94 90 15 25 57 -40 -34 -147 -71 -114 -58 -10 -21 17 -3 -25 -81 -60 -36 2 -77 9 142 79 -14 -19 69 108
5911 108 84 -39 -117 -108 -173 -71 -28 -28 -128 -78 20 4 104 -34 -74 -129 -133 -4 -34 -164 -193 -143 -40 49 103 131 80 -63 -213 -206 -13
5904 -13 -69 -75 12 27 20 12 -84 -41 -7 2 -33 -23 70 -72 -105 -51 -92 80 11 -133 -162 -163 -184 -53 -16 7 -2 -33 -29 7 -48 -67 28 51 -95 -56
5895 -56 -48 -105 -35 33 -62 -44 -1 -51 -117 -144 -159 -248 -83 -55 -15 26 -47 -104 -111 -164 -163 -151 -247 -73 2 -73 -77 -5 73 -32 22 62 -53 57 -29
5886 -29 -13 109 -5 -135 -182 -39 23 46 21 -105 -207 -182 -237 -148 -81 -45 -20 6 56 93 41 76 135 32 7 18 -15 -48 -3 -11 -32 22
5879 22 -53 -67 46 -47 -175 -158 -47 33 14 31 -92 -6 57 99 85 106 57 -47 -34 -22 24 77 76 86 117 -26 7 65 88 63 -34 -13 -18
5870 -18 -60 -51 -107 -70 -91 -169 -85 74 73 121 -5 -13 7 -60 78 23 -89 -73 6 -14 -73 -242 -245 -167 -86 -9 11 4 2 -70 -72 -4 39 -54 -68 -44
5862 -44 -91 -138 -96 -82 -21 -72 -23 -32 -28 -51 63 41 -69 -35 54 -131 -140 -124 7 65 19 23 -5 -100 -40 -152 -158 -148 24 0 -39 -50 -22 84
5853 84 100 70 -51 -80 -64 -110 -59 -37 6 -61 5 -6 -15 7 -37 -81 -78 -25 47 -122 -61 28 48 -40 19 11 -95 -165 -163 -41 -59 -66 -63 -100 -55 -4
5845 -4 -37 -71 -98 -93 -112 -127 -147 -85 -29 -45 -49 12 75 55 17 -41 -57 -69 20 99 101 58 -88 -102 -52 -105 32 119 31 -55 81 -88 -36 25 75
5836 75 168 55 -30 -41 -57 -210 -137 -154 -111 29 -28 -23 120 -22 -41 -39 37 36 -45 14 59 8 64 49 28 -23 -124 44 50 64 120 88 62 54
5828 54 17 -18 19 -21 -44 -96 -95 -42 -87 -170 -67 -106 -40 -121 -114 -199 -170 -70 2 -86 -70 -13 -47 -68 25 -40 -81 -33 -61 -152 -135 -137 -169 12 43
5819 43 11 -35 -81 64 41 19 -1 -6 21 -29 -37 -10 -57 -67 -67 21 -13 1 63 65 45 91 -34 -62 -118 -12 -73 -132 -140 -93 -80 -43 -20 -25 49 47 -9
5810 -9 -11 -5 126 -58 -144 -113 -136 -100 -95 -105 -92 -8 13 -33 -84 -47 -96 -181 -77 -18 -33 16 -38 -98 -90 -26 -158 -190 10 27 37 44 27 65 21 50
5801 50 -16 -61 26 -29 3 113 124 63 -58 -25 -29 -17 -15 -163 -19 -34 -37 -5 12 34 -12 -40 0 71 59 94 20 -45 7 36 117 131 104 -74
5793 -74 50 53 25 -15 -75 -77 -52 -120 -99 -43 23 72 -4 -19 48 73 125 50 62 -82 -113 -80 24 -18 -7 38 61 -45 -145 -129 -154 -187 2
5785 2 67 -88 12 -1 -56 -149 -142 -124 16 -36 34 5 -56 -107 -140 -168 -47 -101 -152 -47 15 35 77 26 1 25 -16 9 -25 -36 -44 -93 -15 13
5777 13 -3 155 77 -5 80 18 -77 -64 -65 -69 30 124 79 -21 -32 -75 -119 12 81 25 -65 -77 -2 -34 -72 -95 -51 -110 -56 22 52 -49 -59 57
5768 57 130 91 97 94 -5 -124 -30 -45 -23 -9 -75 -97 -199 -89 -80 -64 -143 -133 -19 4 -37 -97 -134 -131 -17 15 55 -16 -119 -80 -38 7 52 -55
5760 -55 -49 -16 -22 -30 66 44 -23 -91 32 39 68 -12 -80 -130 -134 -84 93 11 -27 -10 -38 5 78 109 91 -2 -96 -63 16 -27 -131 -84 -103 -78 -199 -183
5751 -183 -57 66 -14 30 2 -190 -93 -39 -56 10 -76 -14 -22 -168 -178 -69 134 93 44 -28 -47 75 43 -109 -161 -91 8 -31 -23 -146 -125
5744 -125 -48 -47 14 7 0 35 40 41 1 28 -51 -92 -163 -75 21 -67 -128 -14 -49 -41 -60 18 -10 3 -37 -133 -237 -110 -148 -149 -74 -97 -188 -169 -175 -123 -71
5734 -71 -43 -101 -9 67 32 -59 -40 63 2 -42 -63 -13 -88 -170 -151 -53 -60 -69 -48 -9 -1 -41 37 90 -4 46 -54 -94 -81 46 115 123 9 -96 -95
5726 -95 -70 -17 -99 -92 -145 -107 -32 -6 -22 -51 -13 56 -112 -46 58 1 -105 -117 0 -119 -150 -87 -161 -215 -243 -209 -150 -46 -144 -206 -73 -1
5718 -1 9 39 14 22 60 -11 -50 -70 -86 -68 -1 -79 -98 41 7 -121 -137 -124 -15 -2 12 27 67 -90 -94 -97 17 3 21 -75 -132 -43 -51 10 20
5710 20 -100 -107 -137 -166 10 48 25 0 -18 72 53 -19 46 44 15 13 -27 -91 -110 -15 35 67 -73 -114 -62 -129 -114 -82 -129 -92 -138 -187 -179 -30 -20
5701 -20 33 50 -17 79 -7 -73 -67 38 13 -46 -71 -133 78 72 -10 -35 -87 -36 53 44 57 -33 -79 -178 -153 -108 -176 -155 -33 -63 -27 -42 -146 -138 -77
5692 -77 -125 -34 41 -45 -149 -52 -20 -63 -50 -36 -89 -45 -3 48 49 -32 59 -82 -209 -87 3 -43 -63 135 63 75 67 -28 -71 -97 -66 -12 1 -23
5684 -23 -61 -66 145 120 -1 -23 -61 50 -23 -166 -174 -96 -43 -23 -12 -27 36 73 -19 -28 -57 -117 -116 -80 -141 -73 -15 16 -107 -130 -121 -55 -26 -110 -44
5676 -44 -51 -30 -113 -61 20 35 -18 -10 12 78 109 25 33 76 -51 -121 -29 -106 -120 -15 -53 -4 -96 -109 -31 -55 -69 -103 -42 -18 -20 60 72 -109 -92 -107
5667 -107 -13 4 41 -22 -74 33 43 27 -134 -131 -156 -172 -149 -135 -61 -53 -68 -115 -46 2 -8 13 -13 -70 20 81 13 29 24 172 135 -24 -57 -7
5658 -7 96 18 64 83 -27 -2 27 47 -54 -45 71 87 26 -9 -60 -172 -100 -62 -44 -67 -87 -165 -166 -69 -101 -106 -31 -34 23 -33 -42 -52 -50 -101 -104 -34 109
5649 109 20 -49 49 -34 35 -13 -29 -49 -79 -91 -112 -78 4 -3 -67 -26 -58 -17 -1 67 16 -18 -10 53 -57 12 4 -114 -70 -37 -25 36 76 54 53 -70
5641 -70 -116 -112 28 -79 -60 31 -180 -206 -147 -79 -133 -86 40 31 34 -77 -7 0 -46 -114 -30 18 -56 -126 -55 -172 -301 -145 57 64 17 -96 -148
5632 -148 -61 2 -165 -76 -57 -41 -60 -60 27 73 -30 32 17 26 -8 -50 -127 -146 -55 33 -39 74 130 19 -145 -144 5 -63 -100 -85 -134 3 71
5624 71 21 -12 17 -24 -188 -120 49 49 21 -54 -58 -149 -207 -133 -47 -189 -107 -36 -77 -139 -64 -167 -205 -201 -147 -112 -112 5 107 149 -11 -9 -10 -57 -31
5616 -31 -5 -7 -86 8 1 80 120 107 108 7 -40 -51 -86 52 19 -26 -144 -72 -36 -35 -29 -3 67 12 74 129 108 80 64 98 85 164 95 -15 4 -86
5607 -86 -166 -73 -24 -103 -113 -102 -74 -152 -167 -101 -150 -148 -118 -18 -29 -12 -15 -37 -20 20 -33 17 -48 -179 -103 -108 -100 -175 -82 -124 -182 -151 -116 -22 -8 -111
5598 -111 -59 -26 -80 -119 -107 -148 -68 -171 -186 -154 -52 -67 -33 -40 -85 -145 -227 -191 -127 -135 -33 65 50 56 -63 -17 -121 -154 -87 -126 -131 -242 -178 -57
5590 -57 -91 -104 36 44 -58 -136 -84 -33 69 8 -10 11 -15 6 -41 -161 -225 -249 -182 -122 17 -153 -208 -89 -137 -120 -10 -42 -66 -105 -117 -117
5582 -117 -40 -10 -76 -113 -81 -200 -134 4 -22 -61 -6 -49 0 74 44 21 24 -69 -98 -121 -91 -121 -139 -2 -5 14 105 81 79 3 -196 -244 -117 -82
5574 -82 -32 -89 -130 -74 -11 -1 -41 -12 4 -82 -94 -15 44 101 25 -57 -12 34 153 -10 -70 -105 -19 141 70 47 82 -83 -108 -4 33 -118
5566 -118 48 146 53 18 64 40 108 -2 45 107 11 -89 -140 -116 -162 -126 -41 28 15 -35 -96 -130 -36 -53 -114 -197 -109 -56 24 -29 -25 90 147
5558 147 139 -18 -87 -2 44 36 50 5 69 59 16 -6 -51 -22 134 45 23 84 131 170 131 -1 -7 -117 -47 -16 -26 -43 -14 39 -37 -171 -202 -127
5550 -127 -67 26 -99 -134 37 96 78 -5 -71 -33 -130 -133 -101 -205 -47 -86 -79 19 35 -82 -68 -37 -62 -39 9 0 -81 -14 23 1 -56 -64 -68 -109 -44
5541 -44 -67 -21 -28 -86 -23 -43 -5 -61 -56 -11 -12 -44 -104 -24 39 12 -112 -82 -26 35 -26 -80 82 121 98 141 14 -6 26 -26 -4 87 69 14 -10
5532 -10 -84 -45 -41 -135 -78 8 39 120 32 0 10 -33 -106 -158 -191 -191 -167 -73 -36 78 83 -21 -102 -32 39 13 -14 -8 9 -26 -62 -127 -136 -160 -57 -42
5524 -42 7 -52 19 9 -26 7 20 -60 12 35 98 155 52 7 -53 -86 -134 -143 -119 -105 8 -8 -107 -202 -137 0 74 123 70 -37 17 -26 21 101
5515 101 52 13 -71 -111 -168 -30 11 -11 -26 -41 -116 -78 -76 -106 21 49 -4 -81 -43 8 -29 12 92 129 104 -47 -36 -106 -98 -6 22 43 -83 -154
5507 -154 -164 -131 -12 -29 -33 25 81 123 123 42 55 63 77 -21 -74 -32 -94 -147 -80 -157 -84 -1 -19 65 -81 -124 -58 -81 -58 -67 -22 -6 72 98 178 132
5498 132 -21 -95 -38 -15 53 62 118 83 88 39 -15 -43 -57 -64 34 -66 -192 -88 0 3 107 -36 -92 -80 39 -6 -72 -115 -48 -87 -144 -84 4
5490 4 -29 -125 -210 -79 5 0 -40 -139 -141 -170 -51 93 -35 -158 -97 -170 -137 -101 -175 -190 -70 -95 -94 -65 -25 -83 -239 -220 -102 -67 0 -31 68
5482 68 41 16 24 -23 78 45 94 76 -59 -178 -137 -193 -93 -36 -137 -80 -39 -84 -155 -206 -216 -92 -62 -14 16 -33 -96 -90 -81 -121 -76 33 -116
5474 -116 -107 -57 -93 -21 24 -37 -92 -80 -105 -119 -171 -253 -141 -91 -123 -206 -95 17 49 12 26 -17 55 34 29 23 -22 -18 -1 -21 18 45 72 -2 -35
5465 -35 -12 -88 -54 -28 -112 24 9 12 28 -47 -114 -120 -163 -105 -89 -41 8 91 97 75 64 44 45 1 -23 -60 -88 -23 68 140 -15 -13 37 -75 -124 -3
5457 -3 38 -39 -84 -44 -95 -166 -70 45 -41 -75 -25 44 -58 -27 23 -37 -17 -70 -32 -57 -64 -56 -55 -86 -82 -38 -123 -147 -133 -73 7 76 1 38 11 31 67
5448 67 5 59 16 99 129 83 116 51 14 -57 -33 -137 -175 -213 -213 -92 -95 -114 -153 -37 -50 -25 -90 -44 88 12 -33 -86 8 -86 -178 -242 -181 -167
5439 -167 -45 -113 -76 -88 -1 87 91 8 -31 -86 -51 -68 -23 2 6 38 91 24 93 139 -1 0 25 -11 21 35 -116 -218 -131 -169 -127 -197 -46 -13
5431 -13 -31 -16 89 29 -49 155 128 88 -54 -130 -35 -90 -84 -77 -89 -54 -106 89 10 -104 -97 -92 -225 -191 -199 -222 -192 -98 8 -7 -141 -118 -112 -120 -152
5422 -152 -145 -125 -18 79 27 -154 -163 -53 7 94 38 -102 6 -85 -81 -78 51 33 56 -13 -65 -165 -137 -141 -135 -56 -111 -54 -81 -113 -97 -159 -196 -130
5414 -130 -56 -104 -78 -17 -42 -123 -119 -77 -70 -78 -50 -85 -116 -142 -153 -146 -28 -59 -1 -14 -71 -87 -179 -156 -63 -56 -164 -193 -92 -10 90 105 35 -5 13
5406 13 -76 -93 -93 -58 117 134 120 43 41 -6 -99 -62 -47 38 -35 -123 -106 -63 -16 -8 -102 4 -31 -107 -106 -3 136 86 7 -47 -81 -33 12 84 23
5397 23 6 -19 57 0 13 17 43 111 55 -13 -102 -73 6 1 -55 19 -72 -60 -97 -162 -105 -82 -122 -93 -61 -123 -151 -130 -92 -137 -50 13 -6 -27 24 -107
5388 -107 -72 -128 -193 -41 66 94 31 -8 16 -42 -88 -64 -34 66 61 54 -3 -63 -93 -4 18 8 -108 -144 35 54 115 107 46 -50 -116 -104 -144 -83
5380 -83 55 10 -80 -85 -92 -108 -20 39 80 35 -36 -3 38 21 -90 -100 -148 -138 -64 52 41 4 104 26 -72 -35 -58 -114 -129 -168 -114 -54 -52 -70 -61
5371 -61 -10 46 -77 -80 77 -67 -67 -151 -165 -126 -202 -211 -164 39 109 75 -73 -70 -19 -25 -10 13 41 78 25 47 -46 -2 18 -5 -32 -176 -37 -51
5363 -51 -32 -18 -68 -87 -32 -89 -86 -11 -28 103 54 50 133 25 -112 -175 -86 59 40 7 91 107 3 -37 -128 -116 -54 6 -23 62 48 32 109 19
5355 19 -148 -77 58 -18 -21 -18 82 144 81 -71 -79 -36 -24 -35 -94 16 -56 -206 -157 -181 -201 -143 -79 -61 -55 -135 -30 -143 -46 60 -23 -75 21
5347 21 -59 -24 -110 -103 -62 -88 -119 -160 -94 -70 -121 -75 -157 -155 -76 -31 49 54 -36 -37 -4 -79 -1 -145 -164 -105 10 -34 4 28 38 26 -10 -42 33 33 -84
5338 -84 -27 0 17 -61 -31 -142 -165 -68 -77 -148 -149 -104 -92 -130 -55 -71 32 56 22 -96 -101 -123 -36 -109 -80 -81 0 -7 -64 78 110 23 -41 -15 39 -63
5329 -63 -200 -187 -41 -21 9 164 22 -50 -49 -102 -54 -105 -26 -94 -39 -101 -66 -98 19 -60 25 4 -38 6 -135 -137 -79 -106 -124 -178 -96 -58 -20
5321 -20 53 -25 -26 -4 7 -27 -128 -178 -115 -61 43 -50 -88 9 46 -59 -138 -116 -42 -88 -181 -148 -124 -21 93 13 34 14 -41 -7 -44 -33 -47
5313 -47 46 68 -8 139 133 162 -30 -20 -6 5 94 80 55 27 28 -36 -25 -81 -151 -128 -107 -91 -90 21 -43 -103 -110 -134 -87 -34 -94 -97 -14 20 -17 -7
5304 -7 -163 -22 77 54 -4 -69 -64 -37 11 6 59 21 -54 -38 -104 61 98 32 -29 -50 -99 -127 -137 -82 -52 -50 -151 -200 -210 -107 72 6 -38 -76
5296 -76 4 -53 -80 -9 55 113 49 -77 -34 -84 -79 37 -10 -46 42 30 -122 -153 -151 -124 -128 -214 -129 -19 18 21 -18 -76 -78 -22 22 -55 -136 -109 33
5287 33 -10 57 56 4 -6 -5 -39 51 56 -20 0 88 69 15 131 125 174 51 -2 67 91 2 80 39 35 -105 -179 -76 -81 -80 103 82 33 38 58 109 76
5278 76 -20 -32 141 122 137 -43 -88 -54 -26 -76 -93 77 87 129 94 -8 -50 14 -54 16 65 -59 -134 -80 -188 -59 -5 63 107 -30 -112
5270 -112 -143 -79 43 71 62 33 -20 47 -5 -166 -107 -141 -93 -80 -31 79 155 237 157 32 18 63 24 -105 -21 -26 -77 -55 -40 -42 49 -32 -58 -25
5262 -25 -7 -35 12 50 11 2 -3 0 31 -11 -27 -121 -71 45 -39 -2 70 -121 -112 -42 60 74 45 48 53 -43 -111 -210 -154 -32 4 -45 -151 -94 3 38
5253 38 -102 -16 -39 -97 -27 -7 -53 -56 -27 0 0 -29 81 -32 -165 -205 -142 -28 8 -62 -135 -105 -21 -33 -88 -47 31 -17 -53 -57 -101 89 41 23
5245 23 56 90 77 -20 26 49 -127 -92 -33 5 -64 -11 -5 -40 -147 -18 -3 0 -91 -59 66 150 182 -79 -150 -126 -99 -264 -218 -126 -51 6 110
5237 110 62 29 78 81 29 -92 -94 42 44 10 7 2 5 68 125 25 -37 -58 117 1 13 -28 -63 -158 -222 -136 -113 -19 -129 -156 -14 -70 -64 -45 -73
5228 -73 -56 -54 -52 10 7 59 3 34 15 86 47 -16 25 127 81 97 100 86 91 13 -47 38 118 -56 -161 -140 -28 46 34 47 76 -28 -84 -127 -103
5220 -103 -85 -33 -8 6 -30 -23 61 -54 -94 -188 -144 -135 -139 -63 55 25 11 -13 -114 -88 -35 -99 -29 0 -36 14 29 38 33 32 32 41 34 22 -92 -179 -23
5211 -23 23 -44 46 16 -140 25 -2 -52 -19 -101 -84 -49 -12 -17 -6 90 111 -4 -109 -127 -105 -39 -83 6 -28 -37 -50 -68 53 -62 -125 -15 -80
5203 -80 41 -1 30 77 -19 -35 -73 -13 12 -6 65 102 68 124 90 -3 29 -41 -10 53 74 7 12 63 -15 -5 -40 -27 -40 -74 -140 -96 -17 -44 -79
5194 -79 -99 -128 -31 72 -24 -16 117 219 79 25 -5 -66 -30 -104 -22 -22 0 2 -25 -40 -51 48 48 48 34 10 59 -1 -20 -3 -35 -16 -96 -84 -199
5185 -199 -119 61 46 -71 -37 -5 -45 -60 -78 -162 -149 -186 -41 -138 -141 -46 -129 -24 27 101 47 -36 -24 25 32 152 87 -20 -65 -134 -114 -49 55
5177 55 94 65 40 21 47 56 150 59 3 -162 -31 64 59 97 -51 -82 -110 -89 -69 12 17 -22 -10 138 67 22 45 16 -28 71 122 64 -27 -47 -78
5169 -78 4 -37 -20 72 51 117 5 -59 -75 4 -34 154 63 63 30 -116 -81 -5 -23 0 -6 -26 -34 -71 -151 -29 -38 -126 -83 -84 -120 -31 4 -47 -138 -48
5160 -48 -48 -79 -14 -16 -33 -69 -119 -123 -98 -104 -113 -75 -50 109 62 -59 50 187 138 13 -121 -24 0 57 24 68 37 -48 -106 -47 24 60 -13 -39 -85
5151 -85 -17 97 66 -122 -53 -31 -23 -35 13 -56 -51 -52 -43 31 93 13 -86 -59 -229 -163 -64 11 55 -3 87 68 -16 -14 -8 -103 -109 -128 -178 -98 -2 -26 -205
5142 -205 -136 80 -87 -83 -62 -51 13 98 66 -75 -25 -1 -59 -96 -165 -188 -142 -49 -102 -73 20 -57 -38 -62 8 33 -11 -1 -6 110 40 -44 -89 -85
5134 -85 53 22 -107 -124 -78 -52 63 44 -111 -86 -87 -34 -48 15 112 58 -107 -22 -59 -63 -35 -25 31 71 -18 3 -60 -19 49 143 106 21 13 -43
5126 -43 7 0 32 -62 9 95 107 44 -2 -51 -165 42 72 -39 -65 -24 -31 -123 -17 -5 35 -18 11 37 6 27 34 -59 57 2 22 22 43 -37 -56
5117 -56 -64 -2 42 63 160 36 -84 -26 -14 -204 -150 -22 -104 -111 -71 -50 -97 2 21 48 -53 -14 -3 29 -41 46 53 51 9 -23 -79 74 77 -16 -39
5109 -39 -116 -83 -50 -56 -73 -93 37 -8 164 112 63 -21 -31 -69 -63 -47 -50 -32 -64 26 144 164 195 130 53 74 64 64 35 -17 114 68 66 97 96 120
5100 120 36 78 -20 -140 -38 14 49 10 8 105 95 95 34 17 87 25 58 -7 -11 -145 -142 -18 -81 -120 0 11 -141 -144 -124 -37 -19 -18 72 88 41
5091 41 -17 -22 -81 58 49 39 118 80 23 25 11 47 62 101 139 110 58 16 -3 17 -13 -50 -35 -66 -106 -60 -41 19 95 67 65 -34 -70 -21 -80 -95 -29
5082 -29 64 53 -38 -76 32 -26 -73 -63 40 17 -51 -115 -175 -106 -48 50 52 25 4 -7 93 170 145 157 148 114 21 -59 -4 73 5 -58 4 -76 -39
5074 -39 -65 -63 45 -42 -75 -40 33 28 -85 -131 -95 -93 -21 -12 -49 -129 -60 -66 -135 -5 50 -20 -16 54 90 -11 64 141 0 -14 40 33 -19 -3 29 27 -21
5065 -21 83 141 9 -9 -26 -3 -3 103 -35 -40 -36 86 103 131 207 69 -95 29 27 -56 46 35 55 -71 -23 -6 -82 -44 -50 -76 -139 -196 -117
5057 -117 -31 57 -8 -138 -194 -122 -61 17 72 101 79 -52 54 39 -72 -171 -20 9 44 64 22 44 109 -31 -3 70 105 -54 -149 -85 -137
5049 -137 -59 -42 -152 -46 -35 -82 -17 27 -36 14 -67 -38 -43 -81 -154 -7 6 -21 -29 -103 -217 -63 -60 -28 5 -45 -55 108 155 63 -51 -46 -90
5041 -90 -15 29 -56 -32 -53 4 59 -20 -6 -85 26 153 119 112 140 162 315 135 83 60 24 -1 5 1 23 -15 -39 29 76 63 73 79 59 31 -52
5032 -52 -97 10 64 -7 4 -53 -7 -54 -66 -5 -80 -68 42 61 19 -9 -51 -20 176 112 -9 37 -64 -149 -180 -17 83 117 86 66 80 98
5025 98 45 -27 2 84 28 1 76 26 -80 -7 128 43 -15 -89 -98 -18 54 -12 -19 -11 79 65 -2 2 -22 26 -65 -71 43 14 -76 -173 -181 -226 -36 15
5016 15 -9 -32 31 -38 33 12 -32 -21 -55 25 -50 -110 -90 -106 -10 -37 52 74 105 95 1 -59 -6 79 23 31 37 -5 11 147 106 78 47 9 33 7
5007 7 -17 -25 56 126 132 -4 58 143 -1 -54 -47 -23 5 -29 109 181 123 15 -7 49 43 38 24 41 19 -37 -11 -47 -2 25 -19 47 34 39 189 29
4998 29 40 -2 -19 19 -19 -80 -89 -80 -148 -188 -14 -101 -117 -134 9 61 95 146 107 143 252 134 65 76 59 71 117 63 103 157 -39 -14 131
4990 131 45 65 52 -56 -4 12 -15 5 -83 -32 -21 -39 22 22 38 -97 -60 -51 -44 -20 -41 99 126 48 132 199 87 -83 -97 -56 52 54 -23 -8
4982 -8 -67 -60 54 54 -67 22 -18 44 31 110 58 -5 59 43 -36 -79 15 -73 -81 45 99 15 -20 63 35 76 96 140 107 53 25 36 91 20 -6 97
4973 97 11 -13 -48 -44 -22 -60 -84 -47 -11 108 35 83 1 -110 -159 -139 -6 -61 -60 -57 73 32 -65 -52 -59 14 35 46 96 -46 -113 -29 62 169
4965 169 147 16 -108 -99 4 75 33 47 40 -10 -58 -80 -73 -162 -84 1 -28 -11 -24 -133 -137 -51 -27 -60 -32 33 -59 -129 -78 -69 4 129 82 -88
4956 -88 -91 -129 -44 -76 -59 -96 -131 -217 -120 -13 -68 -97 -123 98 119 2 -31 -48 -15 78 77 -34 5 164 112 -13 -79 -27 84 32 -9 -115
4949 -115 -113 -47 -56 -19 -71 -41 -20 -74 -46 -35 86 59 -12 86 115 -5 -143 -68 20 84 5 -107 -45 7 21 17 47 39 65 50 137 163 176 85 42
4940 42 18 -34 27 72 81 93 98 78 102 13 18 102 -75 -117 -69 17 2 -53 -3 29 -33 -46 52 0 -71 -35 -98 -46 -104 -55 -42 -117 -114 -140 -191 34
4931 34 174 135 -4 -18 -43 4 2 84 32 0 -5 2 -94 -59 -58 -76 -86 -162 -29 -28 -1 -37 -72 72 28 -82 74 89 -17 -60 -3 84 146 99
4923 99 56 49 -24 -38 -12 39 66 67 107 141 160 134 18 -17 -46 31 -5 47 45 63 53 -42 -47 49 29 55 43 185 170 126 116 231 137 2 -59
4914 -59 -14 -65 -121 -127 -55 -60 30 11 -39 83 17 51 4 33 34 -6 -117 11 68 102 54 2 15 -2 58 105 21 87 32 -47 0 24 102 60 105
4906 105 153 114 31 -64 38 37 5 21 0 33 58 -6 -138 -85 10 55 41 98 88 39 -1 -38 -63 4 98 103 80 99 122 70 45 72 46 1 91
4897 91 184 134 6 36 105 30 0 26 40 -8 34 -12 -67 -129 -134 -127 8 100 158 92 64 59 -7 73 95 4 -146 -186 -174 -171 4 176 121 24 -100
4889 -100 -24 43 97 34 48 -115 -146 -92 -26 -113 -134 -67 0 37 51 24 -20 -97 -81 -16 -35 -90 38 142 117 84 45 50 67 3 71 63 27 -30
4880 -30 -19 -15 -141 -139 -78 -43 -21 -24 40 -9 -94 -73 -18 19 -52 8 54 0 29 95 50 59 109 140 62 116 78 105 72 70 117 50 61 40 81 110 41
4871 41 -50 116 -61 -3 -4 157 136 107 131 192 155 94 101 35 -2 -96 -65 148 125 22 -51 -12 1 28 96 -12 -44 -62 -52 25 -9 -27 -161
4863 -161 19 110 131 56 -55 -9 106 168 44 -53 -94 -79 -48 -25 28 36 160 167 62 -6 -23 -119 -86 -103 -37 44 -16 21 12 -89 -123 -70 -168
4855 -168 -68 66 28 -79 -172 -132 -139 -83 -97 -58 -37 -67 -93 -66 82 52 81 78 -59 -72 -31 62 82 41 13 -95 -116 -16 -49 -90 -62 -21
4847 -21 -28 51 18 60 104 5 21 -51 21 -70 21 188 52 15 43 24 80 114 27 76 113 94 135 20 -22 39 111 126 117 58 20 58 54 36 71
4839 71 55 125 64 49 -26 60 13 -82 147 107 106 52 18 39 84 91 31 39 237 82 70 124 29 -88 -96 46 107 72 -20 -107 -51 6 160 124
4830 124 -26 -62 -63 -15 -66 -52 20 2 -78 -15 26 32 175 182 133 118 61 93 67 52 24 118 34 -66 4 120 93 89 113 133 93 240 125 27
4822 27 103 70 -1 -104 -127 -43 -113 -123 125 157 53 125 24 -28 74 103 30 45 -65 -44 18 26 25 24 85 111 115 59 43 9 -69 -57 -111 -71
4814 -71 -60 14 38 11 32 78 33 11 42 63 0 -90 -15 17 -74 -65 -11 64 119 103 -4 75 50 49 66 36 -24 17 -7 -18 6 -102 -132 -73 54
4805 54 63 13 124 105 -34 -41 5 -12 75 81 118 -62 2 6 123 88 -73 -88 -26 0 27 -19 36 88 101 181 210 68 47 13 79 152 116 196
4797 196 248 349 348 220 27 -50 -93 86 246 134 100 0 80 222 86 96 111 122 124 -89 -88 -112 -73 -116 -118 -153 -130 1 5 -50 23 4
4789 4 38 -68 3 -76 -137 -102 53 107 49 149 80 28 -36 -53 89 21 -129 -17 50 28 35 77 15 67 -112 -150 -90 -73 -32 -63 -28 -50 23
4781 23 -5 -50 -70 -121 -151 -133 -115 -83 -1 72 42 60 42 -36 31 5 0 -9 36 64 44 75 111 -18 25 14 16 29 23 10 20 -31 37 -36 71 20
4772 20 9 78 -4 -66 -74 -105 -27 -75 15 28 28 51 83 94 84 -28 5 126 155 -8 -42 -31 103 123 0 -36 -14 63 60 60 79 14 75 91 38
4764 38 83 91 57 132 137 136 124 29 27 8 -35 -10 -67 -117 -14 32 63 151 86 -4 -45 -55 -109 -91 -3 45 95 49 -13 -29 8 6 21 9 -45 -10 135
4755 135 105 111 141 109 87 49 55 77 -20 -40 4 -62 0 -42 -9 -79 15 81 21 -84 -80 -7 14 16 -2 3 22 -70 -52 -29 73 29 59 -3 -129 -129
4746 -129 -91 -59 -54 -43 5 -58 -36 26 61 26 57 10 -37 16 39 97 30 72 44 44 28 -17 46 196 221 125 90 13 7 46 117 54 89 -51 -72
4737 -72 -4 38 123 62 47 54 52 28 33 57 55 24 25 85 149 -15 -96 36 -10 13 91 119 58 45 138 138 152 157 41 119 56 56 49 52 -51 4 56 149
4728 149 43 16 -42 -168 -62 -1 87 -54 -32 49 41 105 149 64 98 8 16 97 17 129 151 -10 -44 59 44 53 116 127 170 174 -2 -13 61
4720 61 64 118 111 -10 -218 -251 -12 -5 -181 -77 -54 -13 113 107 -45 -49 -6 71 89 159 69 -27 -55 21 1 9 13 -1 -27 -7 15 42 33 -28 32 47
4711 47 161 169 163 173 70 38 108 55 33 -6 -41 75 70 46 32 59 123 159 86 3 34 141 116 112 66 35 1 0 45 70 113 170 233 107 117
4703 117 77 -63 7 63 220 174 181 60 67 24 12 40 108 184 144 -11 48 -96 -107 -38 12 -67 -13 62 22 -4 48 18 10 -114 2 30 -12
4694 -12 -20 -17 -34 -16 -11 -18 -47 -80 -93 13 -45 -159 -27 28 173 166 7 36 -74 -9 68 15 -15 51 49 38 121 -44 6 -9 -105 -110 -189 -104 -75
4686 -75 -84 -91 -61 -137 -24 41 50 181 166 99 15 -27 10 97 197 151 144 189 118 10 1 102 82 15 46 61 96 98 110 125 84 51 48 158 166 57
4677 57 77 149 90 -6 67 57 -11 32 94 15 -102 -82 39 87 148 202 132 211 152 134 137 140 30 28 62 20 -28 -156 -100 -191 -159 -112 -37 -22 80
4669 80 173 65 0 27 -39 30 15 33 63 -63 0 24 -19 -44 -67 -8 62 115 -17 -57 -78 -13 123 85 19 -17 23 -15 -7 73 67 30 47 94
4660 94 154 103 226 193 126 -16 -97 -41 -17 -118 -79 -58 -84 -54 -55 -101 -23 51 -35 -63 -68 -37 23 11 90 40 25 52 1 -36 3 31 69 60 121
4652 121 135 66 -16 -102 12 40 -2 -110 38 177 42 -86 -17 -42 -70 40 67 92 23 -56 -131 0 -29 4 98 60 -86 -25 34 5
4644 5 -61 2 34 19 33 -5 9 48 163 94 -45 28 -13 26 10 7 -20 -5 32 88 89 -19 -83 34 93 111 91 32 49 121 142 98 -45 110
4636 110 219 208 10 -128 -147 -66 57 204 225 85 155 135 177 155 133 196 165 163 80 154 121 137 186 101 -34 -95 -93 87 11 -33 -87 -18
4628 -18 -110 -42 -3 8 70 161 87 75 7 28 108 110 140 98 -63 57 57 -108 -92 31 70 -21 18 15 105 8 46 58 131 157 44 3 -18 13
4620 13 14 122 132 -35 -148 -225 -177 -131 22 -51 -26 68 14 -79 -40 -35 14 -6 -115 -8 0 0 76 95 118 111 192 199 226 187 188 136 -10 -44 -21
4611 -21 -24 126 48 4 139 95 68 39 59 -12 20 56 80 43 66 16 -12 -96 -54 -61 -27 -69 -1 31 -84 -114 -113 -53 115 89 135 180 215 14
4603 14 19 24 -23 25 98 134 -37 -3 6 72 24 106 49 51 148 85 -56 -103 -44 24 55 -10 106 77 -33 14 66 3 -109 -77 -14 35 38 86 -5
4594 -5 -77 -8 -20 -83 -144 -135 68 100 56 -22 -26 -26 -12 -57 37 53 75 62 106 21 7 -22 -88 -15 268 150 103 98 29 1 2 8 105 119 25 48 56 59
4585 59 -30 15 42 4 119 13 114 169 94 109 191 91 30 29 155 154 139 208 113 76 -70 4 51 -32 -132 -83 -9 18 -21 -2 20 -22 -20
4577 -20 122 168 124 40 -180 -18 -43 -74 -149 -51 95 98 96 7 31 36 -65 3 27 67 3 66 18 0 169 247 158 22 -20 61 53 50 80 118
4569 118 111 84 20 178 89 -39 -4 -11 -79 -69 -32 66 103 33 -92 -23 106 80 1 -61 -22 -118 13 105 170 101 -35 2 -95 -82 67 191
4561 191 157 123 23 61 104 -15 -90 21 82 94 25 -27 36 -30 -43 -68 -21 50 -1 -108 -75 -4 41 100 184 159 162 148 149 189 17 -30 33
4553 33 182 173 83 63 -26 -4 -9 166 136 39 51 72 -11 -21 -46 6 -28 -68 -44 -153 -201 -83 177 136 109 121 43 34 200 283 184 22 49
4545 49 22 -17 14 66 -2 -118 -122 -84 -121 -96 7 45 9 31 -29 -66 -69 -39 107 34 -11 7 -19 70 56 -53 -112 25 127 0 -139 8
4537 8 91 60 53 88 37 -27 36 -16 -37 -83 -24 -63 -24 -24 -109 -2 66 -91 -206 -121 -33 34 -52 -55 12 24 14 -61 -27 2 93 70 97 -32 97
4528 97 99 -1 110 172 84 60 68 81 61 1 -44 63 151 166 127 95 20 16 85 102 54 78 -47 -32 46 155 78 186 138 145 188 196 84 22
4520 22 -104 -129 -96 -35 33 -3 -24 -67 -58 -121 -24 76 89 154 128 91 41 46 18 61 12 -32 18 -12 49 99 15 19 127 136 49 27 45 155 124
4512 124 97 64 -47 4 -21 -83 -49 91 113 81 133 4 -10 24 2 -73 -101 123 86 96 102 -7 22 109 80 120 75 -50 -46 -30 116 103
4504 103 21 28 126 99 168 170 80 104 89 -8 49 -67 -12 70 148 142 28 -109 -13 22 -65 60 118 74 48 36 91 129 88 52 176 38 73
4496 73 -95 -147 -40 20 25 -23 123 93 110 121 160 34 -9 27 44 -46 7 40 -40 66 38 18 43 181 95 34 51 46 104 87 -17 -90 8
4488 8 82 32 27 -4 85 112 76 2 16 104 58 20 168 99 30 51 13 91 11 8 -25 -66 -10 33 -29 -26 29 90 44 -63 -169 -126 -69 159 206
4479 206 148 155 48 -82 -134 -28 103 23 33 113 70 -22 -17 94 73 -7 -29 53 104 85 81 108 59 65 169 25 73 116 163 191 102 19 86
4471 86 22 81 131 120 113 141 65 -3 -77 102 91 77 155 71 33 63 -51 15 -42 0 126 121 130 76 128 156 169 95 85 107 49 -55 56 76
4463 76 128 103 -20 129 166 121 67 108 177 163 60 149 60 4 47 163 161 103 -2 134 54 12 26 51 5 38 0 67 67 146 95 35 3
4455 3 -9 41 34 93 137 122 72 -9 9 70 33 55 3 -20 47 22 40 20 80 47 15 -17 73 2 -15 -49 84 124 98 93 167 183 113 65 85 172
4446 172 85 34 -59 -88 -57 19 -9 136 140 48 -55 -12 33 -19 104 80 54 94 64 46 25 -88 -99 -40 -16 -17 33 81 58 -51 -83 73 27
4438 27 33 109 111 32 11 45 60 210 72 -51 -13 63 47 -72 -65 17 -55 -5 74 150 122 0 -29 -18 43 -76 -66 1 -2 -29 58 193 230 255
4429 255 73 -28 18 24 -17 -16 82 58 -45 18 -12 -19 5 -30 54 97 56 25 47 -8 4 -70 -116 -59 36 133 61 23 81 2 105 130 73 7
4421 7 -5 -47 42 54 92 100 130 58 64 -16 -128 -64 73 84 -27 13 -46 -35 -34 127 111 176 118 26 140 145 111 186 87 112 157 48 111 100 145
4412 145 128 131 -53 4 62 -14 5 41 43 72 11 2 -105 -53 4 61 148 204 -14 1 16 22 -88 -128 -63 -99 -20 48 67 87 -23 -63 -100 -16
4404 -16 172 178 93 98 111 92 80 179 221 124 134 71 52 179 88 110 84 154 -9 78 224 156 97 149 146 262 260 178 135 139 37 21 28 -102 -84
4396 -84 -87 -41 113 15 -59 -8 95 187 183 43 1 -105 -15 69 167 173 50 23 -43 -115 17 44 68 168 123 136 116 -17 119 214 138 92
4388 92 112 56 17 -44 -53 -58 -47 -11 58 105 -24 -68 51 142 131 67 41 -57 -20 15 125 167 138 84 -49 -67 -21 -89 -91 107 20 37 41 103 167
4379 167 125 104 50 78 58 -1 20 23 102 86 42 2 74 70 54 21 -9 -16 -31 31 -46 -71 9 11 198 199 193 211 171 9 -65 -29 84 123 55 26
4370 26 -11 47 41 33 -79 -54 -15 61 149 226 188 -27 -15 136 111 49 60 24 101 176 35 31 133 33 26 52 -10 -69 -59 -38 4 39 -52 -138
4362 -138 -77 -7 14 -8 -3 52 63 92 41 64 149 131 183 97 55 159 173 4 34 28 24 -54 -24 -56 -30 92 88 59 130 99 74 179 126 21
4354 21 13 45 154 130 100 188 252 213 265 288 157 175 148 32 32 -20 22 -14 -69 -66 -22 -37 51 133 176 137 139 -24 -30 13 -8 -59 1 4 149 120
4345 120 13 -24 129 121 -24 -91 -187 -60 -32 -103 -9 -18 -24 77 2 -5 57 -25 1 -100 -172 -132 -50 -68 -39 124 117 -75 -25 -38 0 119 171
4337 171 10 -19 -38 -1 25 66 106 126 135 83 38 90 3 15 59 91 144 -1 4 52 -8 -19 -102 -185 -93 -3 -15 -49 69 84 -15 28 -34 -28 -29
4328 -29 -92 -29 110 128 73 40 -7 133 75 109 52 22 96 75 50 56 118 90 3 -51 15 157 120 85 170 146 81 -49 25 47 0 34 103 -87
4320 -87 -109 -111 -121 -28 -19 22 80 198 150 55 141 95 1 -32 -117 -46 60 117 -18 -140 -69 -19 -34 -23 66 68 134 61 -14 34 74 132 227 21
4312 21 69 110 -2 -66 -63 -43 30 51 62 19 -63 -49 -103 57 141 42 113 142 97 -5 -16 52 13 139 44 -22 127 112 -50 105 96 77 6
4304 6 -31 23 138 60 94 73 87 89 -52 -7 8 -75 -122 -141 -21 -33 -71 -74 53 94 58 16 -12 -11 110 38 38 60 -6 -104 -10 37 116 41 67
4295 67 137 59 63 57 -1 15 51 16 -108 -65 -24 -86 -23 91 68 184 166 251 53 -122 -5 92 119 35 -20 -15 13 43 -51 1 95 114 196 199
4287 199 87 86 33 -20 25 70 -31 -44 -39 20 169 236 307 211 71 70 3 -106 105 168 78 79 100 168 116 33 67 47 110 174 58 18 50
4279 50 52 137 166 109 79 42 147 83 3 109 162 129 171 233 94 -30 5 -1 -5 -18 74 119 89 34 35 51 55 26 16 36 22 -3 -5 14 102 112
4270 112 137 153 137 76 128 71 17 18 55 130 75 121 188 58 54 127 162 80 84 44 -100 6 117 47 -3 92 20 3 61 16 -60 21 164 138
4262 138 86 52 17 174 188 108 124 54 -19 -86 -53 -88 -113 -132 -147 -8 103 128 133 99 2 50 49 -92 -4 56 100 -10 45 39 68 55 8 -11
4253 -11 82 27 7 199 119 76 100 110 -33 62 -50 -45 80 146 162 102 145 116 55 5 20 80 59 17 104 177 47 -117 2 133 112 76
4245 76 63 16 5 75 72 27 17 5 3 165 79 175 133 49 4 -2 -9 -72 23 -54 4 -49 -30 -26 18 20 72 145 107 37 174 122 14 -27 31 162
4237 162 195 3 -59 22 66 82 74 103 9 -47 -21 7 -57 -68 -72 32 17 70 -23 5 -10 -27 27 -11 -56 -84 -48 39 49 70 -24 60 51 108 75
4228 75 33 156 232 145 77 118 173 95 18 30 71 63 86 24 -52 -34 13 -4 1 -121 -28 33 128 97 60 -24 -6 -56 10 32 -12 16 27 22 67 -52
4219 -52 -22 2 -5 45 5 71 101 55 38 28 44 40 77 53 37 -53 -71 -114 -144 -19 -44 -125 3 -20 -131 -153 -118 -56 92 77 75 41 108 172 112
4211 112 197 139 169 199 100 108 107 92 105 106 -17 1 29 57 55 22 -27 -56 2 47 -103 -146 -73 71 93 38 58 169 190 57 23 40 12 80
4202 80 -13 -26 -46 -36 46 139 116 125 15 89 25 -79 -24 19 -75 -59 -25 -92 -38 -33 -43 -108 -104 -54 -137 -119 -33 126 202 176 181 142 139 109 102 93 53
4193 53 -8 -87 -41 -7 -1 138 46 57 57 16 73 182 303 273 77 7 15 55 79 103 138 86 -46 -139 -49 -51 -65 24 -86 -89 -134 -133 -88 -51 -12
4185 -12 131 111 128 58 36 108 55 86 127 82 -8 13 62 66 147 174 80 48 65 64 -26 -125 -49 3 109 35 -20 -47 48 3 36 111 84 56 61 8
4176 8 -30 83 85 5 -29 29 -3 -84 -42 -69 -53 -52 -25 -30 72 152 147 215 247 59 -36 65 40 -34 -3 -43 -125 -124 23 -56 -18 -7 -47 -98 -50 -44
4167 -44 -44 -64 59 53 -17 -13 33 92 93 -54 -101 -121 16 -46 30 49 61 106 52 -117 -72 -122 -159 -58 60 152 111 -7 -64 -145 70 28 -75
4159 -75 -1 0 -51 -153 -178 -125 -85 -132 -85 41 49 -8 6 19 45 176 111 30 -6 10 79 98 103 135 -8 -95 -55 11 -48 -2 3 45 -15 -53 7
4151 7 162 105 2 -97 -159 -141 -83 -134 -41 60 -12 20 73 32 33 -49 -28 54 85 111 59 69 9 -20 -61 -167 -35 45 137 136 13 -29 43 -8
4142 -8 -66 107 16 -48 -30 25 77 -25 -105 -8 -13 55 12 48 171 -2 42 -50 26 16 -6 23 22 -5 55 84 -35 15 41 5 17 50 6 75
4134 75 39 77 89 0 -63 23 -19 -137 -167 -39 -52 10 -18 5 -48 -134 -92 -61 -2 23 -31 -81 -25 -106 -51 105 150 133 114 169 128 176 255 255
4126 255 135 76 50 157 208 211 137 -14 39 100 73 141 49 68 -91 -145 -42 -134 -109 35 -14 50 -19 -46 66 -1 106 86 36 0 -6 113
4118 113 122 -57 -42 87 30 30 -111 -75 -92 -21 -170 -182 -191 -23 81 55 91 127 31 33 -23 80 19 -40 50 139 132 66 6 -40 -66 -77 -98 -37
4110 -37 -49 78 141 75 -9 -6 24 58 72 -16 -56 25 78 177 67 -91 -32 67 47 7 -156 -151 -5 36 15 122 3 -175 -103 3 98 215
4102 215 254 162 117 26 8 95 192 178 -16 16 36 123 41 56 -21 45 55 55 -14 -3 -14 11 47 -51 92 146 68 19 -1 135 24 -101 -116
4094 -116 -49 -20 108 16 -79 7 54 18 142 91 116 113 -6 -51 60 39 37 169 133 115 142 169 -61 -54 61 -16 -6 4 186 80 -23
4086 -23 -88 -33 49 -22 -29 -29 -21 -1 39 -24 31 59 144 -18 -121 -63 -14 -34 4 22 84 96 -33 -102 -98 -92 -5 -123 -124 -34 -19 51 68 84 83 125 66
4077 66 -77 -85 -13 -12 -1 -14 0 30 -5 -9 -80 -110 -66 89 119 129 -82 -55 97 94 95 35 -11 -8 -80 2 -104 -14 151 83 117 24 -57 -152 -76
4068 -76 15 42 118 132 48 -61 67 56 10 7 -35 -127 -69 -103 -81 27 18 -53 -84 -53 140 215 173 160 94 139 90 166 223 85 141 90 114 113
4060 113 161 156 111 113 132 142 127 39 -24 -104 -27 -45 -77 -18 6 38 56 20 -40 -62 -37 -42 -98 -33 -30 -38 54 -6 7 -25 41 -62 -43 52 65 -16 -17
4051 -17 -16 -1 -35 -12 13 33 -30 96 -25 0 63 16 30 106 126 79 -45 -34 -97 -51 0 14 -23 59 33 24 51 55 70 -6 -41 -34 11 -104 -82
4043 -82 6 35 140 104 9 -39 -58 -64 7 -29 68 26 -24 26 -46 -21 98 63 68 36 23 -59 8 -44 -38 73 118 117 103 81 188 67 121 156 83
4034 83 -10 -10 5 17 2 39 47 26 9 106 -32 -73 41 -63 18 96 82 26 18 -32 101 137 163 190 102 112 96 -12 38 102 80 89 55 52 -33
4025 -33 -32 -55 -23 126 -3 2 60 117 56 -37 9 -45 17 -110 4 102 72 112 46 30 -38 -20 -29 -74 6 -142 -148 -43 -8 -47 -53 17 -30 83
4017 83 -17 -38 88 68 124 103 60 -51 -122 -76 18 137 88 114 106 191 173 148 57 89 208 186 188 80 198 190 19 31 -40 12 -25 18 -61
4009 -61 -64 -31 50 30 58 23 -4 -6 76 77 -46 -157 -25 -7 41 71 -18 -21 65 72 -32 -67 -47 69 132 79 81 35 135 165 217 96 -24 26
4001 26 68 -20 55 8 -20 45 133 100 138 49 41 59 -23 -77 30 -16 -38 30 17 -15 89 243 213 15 -26 3 36 9 -6 29 156 117 97
3993 97 -41 -11 1 27 19 -58 52 96 101 79 9 -56 -76 30 49 74 14 31 22 30 -15 -17 64 20 -74 59 30 -99 -74 55 4 73 105 104 19
3984 19 112 78 38 95 94 11 22 10 129 160 110 73 210 136 55 78 44 29 66 66 72 14 -48 15 50 46 98 129 57 65 68 156 146 77 87 25 -25
3975 -25 41 -87 -11 7 35 86 48 6 -13 109 162 75 45 129 20 -2 0 0 -73 -101 -52 4 50 85 63 67 -6 5 133 128 169 70 -38 -39 6
3966 6 -22 19 172 0 -42 -87 -23 11 106 219 63 117 178 122 -13 -15 -38 -16 12 -54 36 -7 -74 -123 -28 5 -67 -70 -28 -91 -98 -58 -89 -33 58
3958 58 25 3 122 205 226 85 87 109 102 90 78 74 138 133 146 86 13 -44 -9 117 103 41 5 87 103 54 38 -83 -9 34 49 42 166 141 172
3949 172 168 162 15 -2 43 58 70 70 -34 37 146 95 65 74 71 72 125 -1 -100 -43 -10 20 55 -17 -102 -3 55 74 62 137 12 73 135 65 83
3941 83 113 -48 -84 -109 -29 -38 -84 -22 -11 -18 22 47 95 31 71 56 44 60 11 -48 -81 -110 -7 71 63 -26 54 4 85 81 102 3 4 -47 49 140 115
3932 115 160 177 60 88 82 2 -122 -70 144 242 50 -17 -4 3 136 212 107 160 159 110 -70 -43 0 -16 71 72 -31 -26 37 -33 -37 20 -26 7
3923 7 23 78 -29 68 197 160 137 96 -3 32 83 193 189 262 305 195 67 74 33 291 338 184 70 47 44 11 0 -8 -3 -76 -98 16 6 -41
3915 -41 -2 82 110 -23 -32 18 57 125 135 169 38 94 37 37 106 86 -75 -167 -33 17 -79 -18 100 42 36 109 120 34 42 24 -57 3 34 16 28
3907 28 -12 48 108 212 136 140 160 243 139 99 127 127 7 -126 -37 -36 -140 -106 -51 97 95 70 75 134 158 112 -38 -149 -76 79 29 51 32
3898 32 -69 -46 -16 -24 -17 39 49 72 61 -13 81 145 96 133 216 144 88 -34 8 -9 2 91 83 41 42 76 118 20 107 155 252 154 172 94 -27 -62
3890 -62 50 66 -36 0 -1 -21 147 123 91 -19 -18 -158 -101 -35 11 -31 -112 -33 93 113 124 100 143 188 210 98 -8 3 90 -8 -66 169
3882 169 74 17 38 -102 -95 6 -1 24 50 -12 40 38 -1 12 -85 -156 -153 -115 -65 -156 -77 -47 -85 -32 2 -72 31 49 60 14 122 81 163 66 -28
3873 -28 75 139 125 -35 -103 -35 -166 -52 137 68 -8 -42 -95 -20 34 11 49 118 26 38 81 24 -21 161 111 171 147 80 66 155 154 145 33
3865 33 18 -59 -61 -20 2 49 59 -13 0 51 19 -26 84 79 -34 -32 -55 -92 -48 44 160 142 -12 -131 -117 -89 22 -54 -108 -36 84 109 43
3857 43 -1 -19 60 70 18 8 -31 33 110 159 119 71 48 14 30 94 91 -36 -133 -135 -58 19 9 -19 -46 -114 21 -61 -24 -5 -38 36 49 127 195
3849 195 121 89 0 -105 27 38 48 161 68 69 146 122 77 69 80 -15 -66 16 56 122 131 136 74 10 -74 -80 -44 -49 44 113 50 -5 50 0 9 44 -57
3840 -57 -5 -136 -108 20 -7 57 174 51 -21 90 73 -59 -54 62 50 0 121 130 27 10 34 40 124 131 150 55 168 114 47 59 183 299
3832 299 290 68 11 40 142 106 163 80 108 70 87 48 115 163 77 46 26 122 97 25 -5 -71 -110 52 153 23 -60 -65 -18 20 -2 66 93
3824 93 142 95 -4 20 50 115 60 76 18 -3 66 93 60 185 117 60 63 98 -17 -51 -142 -13 -23 -127 -110 15 -51 -50 25 75 -19 -93 -107 -99
3815 -99 -122 -39 17 52 117 158 255 288 209 193 84 99 14 48 85 125 28 42 68 58 -45 0 33 -59 -20 -57 -53 -4 117 93 -49 -46 -38 -48 -29
3807 -29 50 36 87 129 185 191 103 -11 107 176 162 -16 14 3 37 125 93 86 175 89 57 -42 32 141 138 111 48 49 18 -24 9 -23 43 61 78
3798 78 154 166 48 44 69 38 101 95 92 68 20 68 99 68 83 94 63 -94 -71 -17 74 49 -198 -165 111 214 125 77 155 101 49 90 74 67 210
3790 210 166 158 114 71 27 95 99 64 27 18 42 -29 -19 118 102 45 62 -7 -36 -33 -23 -63 -65 -33 -108 -68 -100 -58 -15 44 28 -12 -66 -48 -11 48 35
3781 35 9 3 104 41 55 163 84 66 62 -1 8 95 -15 -77 -39 -47 -42 -133 -99 -156 -139 -43 1 -25 10 56 50 -17 -60 -108 -61 -29 11 22 18 137 12
3772 12 -3 58 63 -27 -97 -103 -236 -150 19 -3 -58 26 61 13 83 67 -26 104 65 33 -66 10 46 41 -9 80 31 189 89 53 114 118 -75 -118
3763 -118 -97 83 107 -50 68 35 -45 -17 -85 21 -8 66 -47 -98 7 -5 -162 -50 -106 -84 -96 -151 -80 -40 -43 -12 67 129 11 30 13
3756 13 -8 -2 -16 -45 127 -26 -100 -37 -38 -81 -53 -15 17 58 -19 0 112 85 39 127 90 131 123 -47 12 32 129 130 152 194 139 93 115 129 236
3747 236 189 163 167 109 -3 52 52 55 51 -46 -157 -183 -52 -27 -58 -17 72 48 70 19 -8 -84 -67 -102 -76 -91 -78 -43 -70 -16 -5 25 44 71 38
3739 38 -22 61 2 -43 -134 -87 -34 -51 12 -76 -24 -12 26 48 30 -21 -98 -76 -64 -139 -83 -85 -41 -25 -67 12 67 2 21 54 2 -55 -14 98 76
3730 76 -78 -88 -132 28 -98 -155 -19 2 35 7 57 96 12 6 55 77 44 -28 65 152 31 -51 -3 -68 -173 -290 -169 -174 -142 -17 -41 -54
3722 -54 -59 54 125 90 24 51 73 -9 -62 -122 -95 -3 32 -53 -83 -19 101 31 -6 -79 -35 84 57 -50 -36 78 80 -33 3 55 96 -5 -24
3714 -24 -5 70 128 124 0 43 28 119 68 46 0 -9 4 40 -20 -131 -75 -57 45 -40 -38 28 48 59 98 135 -13 96 48 16 -52 -81 -91 -79
3706 -79 -111 -106 -24 0 -2 32 -66 -84 -75 30 -71 -13 -33 9 -72 -52 -97 -3 -55 51 25 -13 -42 -1 18 26 -50 -59 -16 -45 -52 -88 -168 -32 11 30
3697 30 16 143 140 90 48 72 55 4 -15 15 -4 185 80 -21 -45 -31 -68 35 80 68 106 28 -3 19 19 49 51 -20 27 15 -90 -10 27 67
3689 67 43 39 74 55 -56 -155 -139 -57 -69 12 89 -6 -40 16 -21 -74 -81 -99 -20 1 -77 -16 -48 -153 -122 -92 23 143 -2 -19 -52 9 7 -59
3680 -59 -120 -167 -67 8 33 110 55 -73 -104 -72 -169 -95 -33 -105 -17 8 -106 -19 26 12 0 38 -21 -56 -124 -185 -126 -70 -109 1 -15 -9 97
3672 97 26 -10 27 -46 19 115 90 94 1 68 109 59 -90 -149 -155 -197 -79 120 94 49 -52 -72 -76 -17 -32 -23 17 -32 -68 18 6 8 15 45 59 117
3663 117 66 54 60 77 37 -18 -30 -32 -84 -79 -8 23 -104 -94 -79 33 14 0 -109 -144 -195 -79 -107 -151 -94 18 -45 10 8 32 23 15 26 84 -4
3655 -4 24 1 -85 -60 78 70 -70 70 70 -139 -37 -36 97 65 -55 -103 24 1 69 55 154 170 199 58 -5 25 10 54 13 22 -42 -83 -94
3647 -94 -119 -167 -83 -10 93 7 -56 6 -15 -22 -8 65 17 114 148 31 -78 21 28 -130 -168 -97 9 11 -41 2 -17 -44 -157 -156 -40 -74 -200
3639 -200 -96 -110 -119 -80 -119 -153 -136 -67 20 -73 -16 -52 -27 -105 -48 -6 55 -57 -44 -141 -55 -10 -52 -137 -7 26 -161 -241 -31 110 120 -58
3631 -58 -154 -106 -56 -84 -29 68 101 72 23 50 85 -5 -189 -142 61 76 111 45 49 6 -71 -127 -11 -13 -91 -28 15 70 -73 2 -22 -51 6 9 122
3622 122 144 99 33 17 -29 41 62 -7 -69 -45 39 74 17 101 -28 -103 -72 -81 -44 13 -45 8 5 17 56 2 -143 -93 -47 -91 -67 1 -55 -80 -87
3614 -87 -85 -147 -129 -133 -45 -31 -9 -85 -160 -133 -103 -64 3 -7 -107 4 16 -6 -60 -81 -79 44 3 39 -6 -83 -86 7 46 87 50 57 36 65 -90 -164
3605 -164 -91 -75 -43 -71 -84 -25 -29 8 55 30 0 -19 75 33 -138 -47 5 -2 -193 -48 -62 40 70 10 -17 2 -92 -69 -75 -104 -64 -167 -129 68
3597 68 37 36 -159 -55 3 -1 -21 50 12 36 -106 -19 -22 92 -1 -26 20 41 70 60 -35 -107 -331 -136 -68 -71 -120 -65 -70 -90 -108 -14 71 70 -45
3588 -45 -31 -41 0 74 -42 -69 10 0 -5 -25 60 -81 -44 13 39 -4 -43 -9 -20 -42 -32 -120 -194 -125 17 14 20 -42 -34 16 20 -18 -15 -56 -54 -66 -52
3579 -52 -2 -8 -10 -31 -33 -21 -16 -10 -7 -94 -150 -115 -73 130 92 122 -28 62 -25 -32 77 56 81 -6 -152 -20 -45 -95 -49 105 80 -18 -53 -26 -10 -9
3570 -9 -40 14 34 -135 -127 -58 -17 16 -113 -183 -113 -58 -21 -17 -66 -178 -205 -47 4 -53 -21 -168 -160 -145 -156 -18 4 -68 -77 -43 17 10 78 41 15
3562 15 -30 -114 -164 -147 -71 -44 0 35 3 -66 -73 -150 -130 -65 -39 -96 -49 -30 -64 14 107 -15 -58 -75 3 -91 -144 -8 -92 -140 -123 -88 9 110
3553 110 46 -42 -28 -13 -9 80 57 -72 -78 -72 -45 72 -10 -60 -132 -120 -24 99 107 60 1 17 97 106 57 57 -44 12 -23 -88 -75 -26 -73 -59 4 63
3545 63 -21 21 39 4 -37 22 -15 25 8 84 58 44 49 96 72 80 182 147 77 -53 -20 9 -73 -53 -19 15 -22 -13 -75 -5 31 26 -103 -91 -90 -42
3536 -42 -66 -83 -48 21 -7 -2 -151 -140 -141 -91 -14 9 -54 23 -32 -38 -7 -9 -54 -35 -50 -60 -59 -59 -24 55 101 99 44 -37 -52 8 -17 -29 -62 53 40 74
3527 74 101 36 -110 -107 -80 -1 -99 -111 -160 -72 -152 -166 -216 -225 -168 -119 -64 -52 -64 -30 -71 72 -11 -30 -34 -38 -120 -33 -109 -82 -89 -182 -156 -110 -179 -15
3518 -15 -37 -162 -176 -160 -46 72 -49 -145 -102 -62 -54 -115 -207 -12 71 49 114 117 68 -30 -51 78 49 31 16 -5 -58 1 46 -27 -55 -13 21
3510 21 79 -30 -59 -45 -18 -18 37 36 -31 20 4 29 85 -65 -141 -62 -161 -137 -16 0 -4 -72 -95 -66 -4 -47 7 101 64 28 69 -18 -52 -18 -47
3501 -47 -62 -5 75 83 71 56 99 115 111 73 156 79 52 86 17 -29 -94 -160 -69 59 50 -1 -63 -68 -129 -109 -33 -49 -76 -104 -42 14 -52 -27 -28 -82 -28
3492 -28 -102 -59 -94 -184 -168 -183 -133 -29 -34 -24 -127 -117 -49 35 -56 29 -54 -114 -181 -121 -120 -72 -102 -104 -105 -24 -25 -23 -66 -144 -141 -82 -21 -91 -159 -181 -149 -120
3483 -120 -26 27 -30 1 -23 25 0 -36 -89 66 3 25 -4 -95 6 9 31 57 -108 -144 -49 -110 29 87 -17 -16 -66 -44 -139 -171 -53 7 46
3475 46 105 11 12 -76 -6 76 166 185 107 0 115 99 28 23 57 -19 -30 -40 -4 -140 -48 -24 40 -18 12 -54 -31 48 133 98 147 10 -39 -57
3466 -57 -31 -32 33 -28 -16 -71 -16 -119 -62 -20 13 156 108 27 -26 -20 105 33 95 54 24 85 96 22 -4 -107 -46 75 83 -3 41 -16 33 48
3458 48 28 -121 -89 24 -39 -66 -68 -142 -24 22 -19 37 36 82 84 7 147 52 66 19 5 -14 0 -37 -26 -25 -101 -159 0 -69 -154 -41 54 -29
3450 -29 -54 -114 -31 -96 -56 18 19 -79 -27 -21 6 27 72 47 71 132 153 113 15 -59 -90 -101 -118 14 80 6 61 16 -12 -71 -36 42 9 -164 -49
3441 -49 106 21 -38 -81 43 -49 -45 65 138 44 84 -29 -31 -37 47 -34 -15 25 75 -9 34 85 62 3 -17 -105 -100 -71 -42 -25 -16 -46 74 115 42
3433 42 40 52 7 -9 16 11 -14 110 103 91 -54 -116 -12 -35 -48 85 -37 -28 1 67 110 65 -40 -6 40 58 10 -32 -87 24 73 66 -26 40
3424 40 56 -3 -53 76 20 17 -77 -34 -105 -55 39 39 -41 -85 -86 11 -93 -105 -28 100 40 69 -14 97 -19 -27 45 111 43 2 -104 44 127 35
3416 35 -18 43 95 50 -97 16 88 -30 -77 2 -116 -126 -38 -60 -107 -30 16 16 -50 -78 -69 -70 -63 -23 -41 4 19 -28 -145 -153 -101 -22 51 -33 -117
3407 -117 -132 -271 -162 -52 23 -162 -93 11 -20 57 31 -5 0 -29 -17 75 85 -15 -27 -85 -217 -134 -118 -168 -106 -134 -158 -102 -12 10 -34 -144
3400 -144 -5 21 -34 -156 -75 -109 -33 -91 -188 -199 -124 -86 -2 -69 -74 -7 -36 -180 -25 -34 -79 -40 -3 -110 -1 -71 -37 23 11 -101 -84 92
3392 92 67 57 -4 -134 -52 -58 -118 -70 100 52 12 67 66 -61 45 103 13 -10 56 -17 -9 108 123 27 -30 -34 -15 -168 -179 -156 11 -21 -32 -212
3383 -212 -182 8 -70 -61 4 106 -29 -20 45 83 -133 -163 -67 -73 -47 -43 -99 -120 -104 -39 -127 -143 -39 75 -95 -6 22 -77 -139 -19 -94 -73 -21
3375 -21 21 -23 -51 -93 5 -80 -142 -84 1 2 35 40 93 53 1 8 64 1 2 -38 7 24 -23 -41 1 24 104 -1 -53 -85 -190 -233 -210 -218 -103 3
3367 3 1 -103 -157 -153 -153 -80 -25 -107 -14 -50 -9 -21 -112 -147 -92 -60 116 7 -73 -10 2 -139 -159 -45 126 -32 -90 -57 13 0 73 -132 -11
3359 -11 -5 -121 -154 -39 -96 -79 -105 14 25 -15 -85 -103 -112 15 -39 72 4 34 -58 -31 -66 -146 -171 -260 -185 -57 -96 -16 19 69 -131 -106 -14
3350 -14 30 42 100 26 40 32 21 -17 -47 -57 5 -6 3 53 -36 -165 -67 -1 10 -95 -61 -163 -27 99 100 26 -28 -4 14 -52 -23 -57 -114 -172
3342 -172 -59 -121 -86 -138 -52 -61 -56 -176 -189 -117 -116 -122 -49 3 -147 -126 21 35 81 138 156 -25 -90 -104 -138 -122 -127 0 107 -31 -131 -171 -129
3334 -129 -19 -49 37 -79 -148 -46 -184 -255 -95 45 60 17 45 51 4 -26 6 -91 -116 -46 1 -24 -48 -220 -243 -75 -81 -136 -139 45 57 -103
3326 -103 -72 -125 -85 -172 -181 -71 -72 -104 -164 -58 2 -74 -79 -99 -171 -79 -26 53 -47 -28 33 -1 30 39 153 190 168 91 44 -3 -121 -256 -176 -119
3318 -119 -55 17 -5 0 22 -49 -7 -81 -164 -122 -54 4 2 30 74 88 37 -47 -9 -70 -73 -18 -104 -137 -156 -165 -37 -36 65 82 43 -8 137 45 13 -31
3309 -31 -86 43 18 -196 -72 26 -45 -95 -55 -111 -174 -221 -143 -163 -195 -89 113 98 13 -168 -50 -50 21 47 51 -52 -9 -87 -63 64 -8 -124
3301 -124 -17 -25 -6 -108 -133 -219 -147 -194 -148 -128 19 -16 -100 -214 -24 -61 -61 -127 -81 -90 -164 -263 -194 -77 127 37 -52 -13 118 106 17 -42
3293 -42 -72 -90 -21 -166 -106 18 105 -31 -83 -173 -60 -60 10 35 121 -26 -5 -77 -49 -30 12 -135 88 90 105 32 -11 -63 -106 -98 -140 -172 -88
3285 -88 60 88 -6 -49 -140 -100 -3 -1 -49 -67 -129 -85 -83 -96 -170 -172 -116 -142 -177 -126 -90 19 -66 -19 71 46 -111 -143 2 -1 -67 2 -107 -120 -89
3277 -89 -52 -72 -190 -172 -136 -227 -130 -94 -152 -225 -162 -159 -125 -12 -43 -44 49 34 -29 -113 -152 -95 -154 -39 0 -64 -82 -37 -66 -189 -143 -50 -47 -90 -76
3268 -76 -43 106 43 -11 -39 -101 -37 -44 -15 -49 -38 -100 -77 -161 -145 -67 38 54 -23 -83 -109 -55 -24 -86 27 -34 -116 -145 -11 4 -4 3 -22 0 7
3260 7 -89 -72 -97 -75 -102 -128 -213 -78 5 -46 -101 -47 15 -46 -127 -120 -151 -64 -97 -90 -57 31 -64 -133 -90 -158 -107 -64 -122 -141 -186 -149 -160 -123 -224 -118
3251 -118 -167 -101 -57 -67 -143 -34 -97 -116 -131 -73 -17 26 -12 62 -8 -48 -165 -232 -319 -227 -179 -97 -26 -43 -78 -61 -51 9 -67 46 -37 -119 -90
3243 -90 -48 -225 -166 -202 -132 -74 -48 -158 -99 -50 37 9 65 19 -73 -187 -169 -53 -3 -120 -82 -88 5 -89 -21 14 17 -145 -128 -54 -29 -72 -114
3235 -114 -130 -42 -141 -153 -213 -17 -150 -6 24 -58 -79 -56 -115 28 -1 -10 8 72 -113 -133 -196 -136 -84 -141 -197 -166 -79 -86 -98 -42 -39 -47 -93 -107
3226 -107 -110 -44 -134 -51 -9 -71 -169 -137 -96 -31 -62 -67 -102 -25 29 -14 -102 2 -15 -54 -98 -144 -183 -107 -77 -37 -38 -101 -270 -190 -202 -92 -93 -200 -202
3218 -202 -75 -160 -32 -81 -152 -4 116 31 -150 -153 -130 -84 -85 -120 -136 -94 -64 -109 -128 -109 -8 78 100 11 -33 -68 -150 -179 -155 -144 -110 -41 -84
3210 -84 -164 -199 -139 -60 21 -22 61 -35 -25 -1 -125 -179 -127 -47 117 91 26 -93 -7 -46 18 61 -29 -104 -171 -138 -164 -43 101 -15 -190 -165
3202 -165 -39 -8 -4 -149 -153 -72 1 -128 -59 -4 -31 -112 -67 -163 -162 -218 -233 -152 -129 -234 -146 -137 -63 -107 -237 -68 -127 -262 -219 -237 -144 -61 -109
3194 -109 -257 -154 -88 21 0 18 -27 29 -48 -2 -10 -35 -97 -47 -100 -57 -112 -27 -23 15 -14 -79 -190 -61 -49 9 -109 -160 -191 -115 -186 -207 -327
3186 -327 -124 -60 -90 -120 -49 -144 -128 -87 -34 -180 -45 -114 -79 -72 -64 -94 -24 -91 -181 -210 35 63 130 -7 -25 -186 -101 -54 33 -31 -6 -41 -42
3178 -42 -188 -104 0 -104 -78 -55 -153 -113 -244 -160 -123 -40 -131 -86 -20 -36 -131 -107 -123 -32 -60 -40 -111 -41 -39 33 8 28 32 -46 -101 88 99 83
3169 83 -61 -122 -110 4 -147 -93 -107 -187 -219 -161 -96 -79 -140 -13 -98 -76 -52 -87 -105 -78 -161 -50 -124 -161 -178 -188 -37 28 -56 0 -129 -194
3162 -194 -181 -245 -186 -98 38 -28 -111 -35 -29 63 62 182 156 -76 -80 -78 -78 -117 -114 -67 -152 -113 -256 -234 -111 -5 7 2 11 -7 -93 -177 -119 -138 -17
3153 -17 -107 -191 -130 -171 -189 -155 -128 -66 -85 -103 -117 -158 -46 -46 -104 -45 -31 -157 -197 -118 -139 -106 -178 -112 -53 -65 -71 -40 -137 -139 -88 -12 -41 -108 13
3145 13 125 53 119 63 116 47 -68 -93 -132 -60 -48 -72 -3 -107 -45 -70 -3 -26 6 -70 -114 -113 -90 -193 -50 -87 -94 -178 -165 -214 -144 6 0 -189
3136 -189 -138 -107 -41 -133 -172 -216 -152 -122 -21 0 17 -103 -53 -113 -33 -99 -148 -230 -118 -106 -51 -135 -113 -97 -29 -11 72 -59 -4 -34 -56 -56 116
3128 116 15 48 -57 -111 -103 -67 -144 -101 -116 -67 -89 -106 -121 -24 -120 -131 -277 -171 -255 -276 -291 -212 -193 -96 -148 -132 -260 -130 -135 -192 -251 -176 -127
3120 -127 -56 -119 -41 -67 -59 -92 -76 -98 3 -63 69 -34 75 57 23 -132 -71 -109 -20 -62 4 -71 10 -72 -32 -166 -53 -92 -3 -91 -84 -180
3112 -180 -220 -110 -95 -218 -152 -243 -194 -109 30 -101 -129 -238 -111 -25 -89 -214 -77 -93 -121 -35 0 -105 -70 -202 -134 -71 64 -37 -61
3105 -61 -147 -136 9 24 4 -167 -116 61 -45 42 27 -46 -144 -170 -201 -23 143 114 -12 -13 -44 -74 5 -52 -58 -80 -71 9 -21 -42 -116 -103 -2
3097 -2 87 -5 -105 16 53 -25 -49 87 23 -151 -142 -115 -70 -120 -71 -42 -72 -95 -213 -155 -283 -177 -64 -84 -176 -131 -79 -202 -229 -205 -115 -117
3089 -117 -216 -239 -129 -99 -110 -133 -200 -233 -218 -177 -79 -72 -183 -84 -164 -110 -10 -73 -73 -25 -173 -170 -257 -168 -243 -151 -246 -199 -247 -51 -129 -66 -43 48
3081 48 -41 5 -92 -13 -62 -140 -206 -136 -84 -42 -155 -100 -135 -52 -198 -75 -164 -127 -137 -66 -136 -49 -129 -72 -161 -60 -247 -238 -155 -56 -78 -85 -146 -71
3073 -71 -174 4 -168 -183 -242 -207 -227 -19 -204 -228 -167 -136 -204 -58 -166 -209 -220 -167 -151 -62 -179 -116 -223 -262 -380 -234 -106 43 -68
3066 -68 -4 -86 -48 -159 -18 -129 16 -113 -163 -202 -2 -32 -73 -115 39 -125 -17 -114 -137 -195 -45 -160 -110 -150 24 -112 -110 -103 31
3058 31 16 28 126 120 28 112 -14 -85 -173 -91 -61 24 -179 -94 -39 72 -63 -6 -160 -141 -104 -120 -202 -82 -153 -128 -86 -76 -62 -28 -89 45
3051 45 -9 5 -42 -20 -101 -109 -222 -50 -11 -11 -62 -118 -179 -57 -126 -199 -93 -78 -251 -57 -54 71 24 17 -21 -41 -178 -213 -231 -278 -199 -73 -35
3043 -35 -88 -163 -194 -174 -112 -22 -32 -4 -28 -16 -75 -109 -124 -103 -179 -141 -48 -63 1 3 -40 -98 -134 -147 -153 -149 -113 8 -16 16 -60 -45 -143 -124 -158 -159 -119
3034 -119 19 31 -70 -115 -69 -58 -16 -134 -91 -39 -58 -89 -56 -103 35 -22 -49 -2 73 -69 -27 -53 8 37 34 -159 -169 -91 -9 -87 -16 -115
3026 -115 -116 -125 9 -51 -11 -64 -18 -49 -50 -171 -73 -184 -41 -45 55 -120 -11 -15 66 16 124 -58 -33 -69 72 0 149 108 230 139 523
3018 523 1016 2342 2027 859 306 248 92 31 -55 -34 -137 41 44 207 76 139 4 147 33 -14 -151 -75 -97 13 -156 -8
3012 -8 -161 3 24 35 -142 -74 -192 -75 -97 49 -174 -144 -151 43 -1 102 -66 66 -29 144 8 49 -107 -13 -20 49 -49 140 -85
3005 -85 10 -156 -74 -327 -132 -92 -39 -134 -128 -49 65 -25 84 -17 -50 -23 53 -150 -66 -80 44 -75 -9 -94 -34 -23 57 -72 -22 -90 24
2997 24 -102 -98 -233 -153 -230 -19 -121 -75 -111 1 -84 -48 -108 75 0 75 -42 -5 68 160 -25 5 8 58 -143 -199 -120 3 -53 32 65
2990 65 183 111 132 -10 -19 -61 7 -78 -39 -24 -2 -118 -15 9 6 5 -77 -70 -16 8 44 -84 -124 -28 -15 -21 1 -54 -70 -23 55 151 109 65 143
2981 143 80 68 175 116 269 185 250 251 386 339 426 602 676 770 1268 1540 1696 1459 1185 1064 1352 1595 1839 1793 1592 1215 1292 1260
2974 1260 1154 902 790 670 771 744 949 871 791 618 762 601 712 801 1109 1149 1636 2048 2587 2772 3036 3089 3229 3081 3281
2968 3281 3276 3460 3257 3426 3148 2871 2236 2100 1943 1857 1401 1419 1341 1396 1305 1525 1170 922 656 775 555 852 794 1078 993 1433
2962 1433 1694 2183 1760 1699 1599 1796 1785 2204 2018 1796 1391 1659 1433 1549 1101 994 688 789 640 1019 954 992 552 702
2956 702 381 509 255 478 239 398 127 366 132 405 87 225 -80 195 109 323 138 347 99 303 168 458 190 287
2950 287 61 280 -128 119 16 291 69 380 217 467 144 257 63 389 96 425 208 395 401 640 499 759 393 573
2944 573 336 473 241 594 257 406 160 427 233 454 217 357 59 366 177 471 292 530 295 494 426 597 351 552
2938 552 480 620 348 529 319 590 526 645 469 591 448 646 591 712 605 793 807 1027 850 870 629 817 782 1007 820
2932 820 922 864 988 1007 1077 937 1133 1251 1356 1204 1107 893 992 1073 1189 1215 1273 1272 1214 1182 1154 1342 1332 1443 1319 1375 1436 1733 1643
2925 1643 1825 1644 1706 1579 1866 1835 2176 2058 2391 2402 2847 2663 3192 3299 4305 4452 5350 5153 5684 5158 5702 5433 6673
2919 6673 6611 7153 6081 6485 5450 6574 6188 8054 7532 9525 8847 11492 11493 15568 15741 21678 24635 37915 54291 108997
2914 108997 244565 484069 361896 137703 80065 46202 42382 29522 27438 19110 19462 14155 14007 9432 10110
2911 10110 7014 8513 6564 8008 6108 7237 5336 6623 5487 7148 6086 7224 6016 6904 5582 6536 5546 6597
2906 6597 5868 7033 6272 7211 6600 7660 6965 7964 7432 8502 8161 9386 9171 10565 10842 12484 12837 13870 13345 14186 14534
2901 14534 16574 17598 19496 20035 22081 24281 29112 34860 46080 64145 91816 117832 157451 233755 310388 277634
2897 277634 204877 187935 204231 235373 294988 357913 304412 208965 179067 199080 214819 170142 119784 96525
2894 96525 97177 112443 145739 167762 138337 99029 82922 80091 88595 107606 140883 175352 224999 321607 450861
2890 450861 478636 442928 503557 588314 559199 531227 598794 618569 559559 580298 624491 543813 410116
2887 410116 328295 323608 320555 270408 242576 255151 245780 219041 228060 220175 162360 115044 96132 92751 100640
2883 100640 120768 153031 183982 231871 331820 441475 405319 298282 267897 285370 326143 401480 488496
2880 488496 425616 292373 240464 261210 280448 218708 144121 108438 104734 122816 163207 192882 151278 90482
2877 90482 57333 41818 33207 27712 23568 20051 16710 14575 13655 13133 12402 11827 11454 10988 10044 9335 8828 8761 8813 9351
2872 9351 9147 8384 7060 6031 5417 5495 5499 5640 5453 5248 4655 4339 4106 4228 4061 4044 3745 3874 3790 4003 3975 4261 4355 4593 4466
2866 4466 4305 3786 3867 3818 4060 4281 4430 3860 3606 3132 3220 3114 3320 3263 3422 3263 3222 3162 3561 3462 3523 3480 3519 3378 3630 3362
2859 3362 3509 3420 3393 3447 3667 3615 3695 3480 3514 3312 3564 3595 3783 3751 4015 3733 3875 3774 3986 3873 4107 4152 4324 4397 4772 4913
2853 4913 5190 5194 5474 5537 5814 5753 5992 6009 6245 6226 6431 6551 6929 7018 7411 7811 8264 8598 9059 9206 9460 9805 10242 10581 11067
2847 11067 11705 12756 13801 14913 16107 17416 18581 19910 21500 23183 25064 27243 30113 33518 38505 45385 56621
2843 56621 77139 121081 185938 269631 359826 429141 440580 396829 348366 329612 355919 417030 463579 447930
2839 447930 382662 303336 249457 233508 236905 228918 202827 177698 167184 175794 198527 216558 209394 179166
2836 179166 141054 112263 100443 106712 131973 194454 288907 412278 543342 643081 653766 580296 494485
2833 494485 452721 475661 552456 618939 609978 532143 431594 359431 334964 335452 317442 272527 228843 207131
2829 207131 213808 241796 265515 258974 222836 175658 140124 123298 118593 114131 109920 108022 109019 113646 118926 117034
2825 117034 108804 97749 86182 75052 65511 55219 44831 35307 28393 23844 21612 20128 19600 19103 19535 20116 21435
2821 21435 23200 26849 34213 47221 65207 89714 113962 131831 137918 139098 140299 143344 150463 158937 157895 147342
2817 147342 131838 116008 100450 86888 72323 57770 44130 34354 27506 24320 22200 21510 20788 21004 20835 21491
2813 21491 21885 23140 23809 25428 26821 29074 30566 32217 32891 34506 36577 40612 44371 48559 52250 57978 66556 82260
2809 82260 108481 155824 236301 355389 484683 568062 569160 535804 552629 654379 767538 784188 673943
2806 673943 518101 406789 364909 354123 337381 309752 299619 325079 369151 383868 346839 276895 213915
2803 213915 176428 167094 177069 204854 245299 315318 416944 567046 744438 800741 774419 796768 889985
2800 889985 1007887 1066319 1008205 947207 914343 882770 807454 678197 558227 495696 454352 409299 356530
2796 356530 308614 289403 311322 354692 380282 368831 320327 277494 282149 342965 438072 566188 728711
2793 728711 813795 804694 733511 668972 686285 765610 808078 802443 712055 585016 459662 358812 305345
2790 305345 292890 280699 249702 195556 143332 111548 99977 104043 117447 144197 162116 166378 172034 190320
2787 190320 213436 241594 274371 314467 381160 397558 332282 268347 243917 261733 313900 322138 283461 227096
2783 227096 162851 123701 107609 110860 121967 115208 85013 59213 42846 37946 36363 43157 53169 69096 77482
2779 77482 77011 72393 79903 81155 76407 66445 59711 61925 61440 48140 33821 22821 18681 16996 17283 14397 11770
2775 11770 9308 8417 7187 7176 6480 6885 6484 7177 6897 7084 6290 6394 5662 5920 5362 5390 4496 4558 4087 4500 4394 4806 4643
2770 4643 5488 6367 8636 8834 7442 5181 4740 4006 4246 3844 3909 3591 4027 3982 4802 5480 7920 9733 9422 6857 5574
2765 5574 4995 5781 6552 7786 10007 12246 10832 7907 5687 5081 4561 4788 4647 5107 5762 7137 9564 14709 23701 34331
2760 34331 35873 27623 17605 12979 11077 10730 10435 10852 11329 11596 12400 15298 18737 21396 25929 38504 51414 53171
2755 53171 58336 50447 34014 29839 36881 57394 74996 69406 58949 47545 28955 22561 20552 18815 14642 12243
2751 12243 10322 10219 10637 15038 17068 12919 10677 12694 13256 8996 6031 4885 4044 3730 3345 3478 3337 3093 2881 2880
2746 2880 2681 2535 2290 2331 2150 2208 2236 2298 2344 2401 2261 2173 2112 2130 2130 2295 2348 2247 2489 3022 2347 1622 1412 1384 1507 1713 2396
2740 2396 2352 1693 1402 1454 1466 1548 1562 1645 1659 1700 1738 1845 1768 1783 1813 1913 1786 1681 1428 1349 1207 1134 974 1000 952 969 918 910 928 1073
2733 1073 1018 1128 1025 1173 1106 1248 1121 1286 1124 1178 1296 1418 1262 1498 1550 1772 1885 2539 3168 4075 4384 4306 3970 4264 4579
2726 4579 5004 4699 4193 3619 3733 3883 3983 3715 3625 3334 3180 2832 2782 2274 2051 1663 1719 1782 2155 2225 2422 2468 2751 2710 2963
2720 2963 3271 4223 5098 5826 5991 6076 5708 5533 5306 5477 5304 5268 4750 4297 3736 3528 3110 2979 2883 3055 3025 3062 2685 2498 2161
2714 2161 2237 2161 2531 2595 2787 2678 2725 2803 3437 3897 4525 4821 5144 4808 4599 4313 4792 5195 5814 5893 5849 5069 4025 2933 2563
2708 2563 2356 2334 1769 1509 1114 1103 1184 1549 1581 1748 1656 1589 1417 1644 1766 2019 2074 2521 2854 3013 2811 2758 2552 2701 2815 2621
2702 2621 2079 1717 1291 1140 980 1077 985 985 711 649 569 632 621 834 891 1032 858 866 762 895 870 889 789 640 484 583 472 415
2695 415 403 453 391 363 308 302 245 369 345 352 348 284 200 249 222 219 181 170 60 244 140 211 250 254 314 226 154 224 265 254 195 140 159 250 257 179
2686 179 143 179 178 199 207 201 166 46 41 148 165 51 93 77 136 117 126 152 217 232 256 180 191 301 344 136 161 179 268 138 133 280 389 216
2678 216 226 137 187 83 105 166 143 99 181 229 396 240 287 237 258 198 337 124 162 86 162 128 110 13 66 -11 150 85 213 127 127 224
2670 224 308 47 171 120 231 186 194 130 157 107 139 145 284 282 278 168 202 99 234 29 -8 38 61 -144 102 67 182 29 119 122 209
2662 209 82 132 3 66 -65 -12 -2 69 61 213 157 185 133 145 68 146 -16 70 -18 98 87 201 -42 80 75 75 54 71 -87 -20 -7
2655 -7 141 -2 97 -7 73 5 24 7 34 -205 -26 -53 69 -73 -4 -5 84 46 126 118 182 75 64 -10 -9 -62 -19 -142 -79 -51 122 57
2647 57 79 -7 -44 5 114 65 26 -46 87 -17 34 -85 -15 9 23 5 115 46 15 18 6 86 -25 -58 62 -30 17 -50 -56 -101 -100 -135 -129 -153
2639 -153 83 -58 -82 102 129 55 111 127 -34 -68 17 87 31 -70 -9 -109 -86 77 175 134 0 -37 -40 93 24 54 104 119 124 61 79
2631 79 35 -18 23 -37 -116 -50 -163 -195 -36 -33 43 15 -38 13 41 -55 -52 17 25 -19 -117 -126 -116 -117 -142 -72 7 43 63 54 65 36 -34 -76 -22 0 -16
2622 -16 -56 60 38 39 -70 -26 41 71 43 145 -11 39 88 62 116 137 166 232 65 -38 -115 -21 -5 91 36 81 -5 109 88 232 43
2614 43 68 -51 56 -59 43 -8 76 57 58 30 28 7 76 61 114 -18 48 159 118 17 9 -22 28 17 99 30 15 -88 52 -58 -36 -42
2607 -42 112 13 54 -45 -50 -74 56 44 -38 -58 54 -58 -24 -57 72 71 102 -7 9 -19 89 41 84 83 129 26 123 71 7 0 158 139 122
2598 122 14 109 -4 -70 -196 -39 -21 60 0 -63 -48 163 66 135 120 48 -72 -51 -60 9 30 160 131 56 97 135 115 183 4 47 81
2591 81 155 123 165 189 236 186 318 331 559 858 1254 1364 1561 1618 1625 1394 1272 1061 834 592 492 372 217 109 164 99 106 -74
2584 -74 -4 -29 13 -14 51 -67 114 -24 -91 0 -20 8 41 130 47 -130 0 81 45 101 61 163 454 626 669 935 1133 1512 1743
2577 1743 1834 1818 1738 1601 1377 1126 874 716 499 315 279 410 566 869 1198 1573 1940 2133 2241 2264 2224 1949 1707 1357 1058
2571 1058 826 651 488 246 187 176 135 96 56 51 53 29 -7 19 9 106 36 129 49 66 89 166 220 199 206 111 167 162 110 260 379 604 636
2563 636 951 1343 1777 2189 2571 2624 2551 2323 2048 1747 1431 940 673 383 223 -23 10 -21 41 47 39 -69 166 77 45 46 30 14
2556 14 38 -85 -62 11 89 -42 0 81 125 -59 -7 -116 -6 26 73 37 202 190 138 136 140 139 129 194 165 115 204 238 294 160 297 281 138
2548 138 80 40 -103 -99 -116 91 72 128 144 206 -2 1 -22 101 -48 10 -73 -76 43 153 80 63 59 10 -65 -4 -50 -100 -65 37 -2 10 -4
2540 -4 127 -59 28 -23 -4 38 55 53 173 77 -120 -82 -24 44 -6 -168 -16 -60 3 44 57 -75 -28 122 177 146 75 -64 29 53 14 -20
2532 -20 34 -35 -85 -23 121 25 45 -7 50 25 -42 -36 44 -73 -138 -96 -93 8 106 25 -33 -98 -73 -77 -67 -11 -28 -29 -52 -38 -83 -42 -82 -194 -94
2523 -94 -88 -9 87 99 56 50 4 -28 -52 -106 -27 39 -46 125 125 155 96 36 33 79 10 80 98 -20 -84 -33 -78 -2 56 6 -4 -39 23 80 94 -7
2515 -7 6 6 29 73 166 74 113 184 104 -86 -29 31 169 176 165 227 197 175 294 406 450 618 742 784 988 1402 1857 2411 2978 3283 3546
2507 3546 3805 3917 3835 3737 3428 2992 2449 2019 1540 1183 911 745 571 475 346 376 265 96 47 76 -64 -66 0 146 82 56 90
2500 90 205 119 224 169 318 188 44 -12 56 79 125 86 149 152 97 183 206 83 191 204 204 129 179 82 112 299 500 610 748 801 1032
2493 1032 1372 1709 1899 2286 2475 2694 2717 2706 2506 2223 1926 1701 1329 1050 829 652 461 420 304 244 194 153 148 333 234 328
2487 328 312 447 373 531 515 538 608 800 1066 1282 1526 1982 2490 2796 3130 3447 3783 4075 4281 4517 4558 4432 4327 4133 3821
2480 3821 3539 3066 2707 2191 1891 1632 1511 1259 1159 943 834 707 718 751 916 1127 1178 1384 1523 1620 1719 1786 1903 1848 1833 1784
2474 1784 1736 1512 1339 1269 1251 1125 936 677 550 467 423 367 339 245 215 209 111 145 108 156 248 204 104 53 54 39 166 47 61 129 0
2466 0 -87 -61 -59 -52 -43 -91 -146 -89 65 192 148 154 187 208 182 95 264 146 118 258 301 228 310 181 153 249 233 183 277 277 313 322 342 408 225
2458 225 33 40 38 87 54 77 261 348 240 203 250 228 143 137 218 189 153 237 208 158 238 298 306 345 262 193 256 425 500 453 446 489 326 282 310
2449 310 284 270 321 365 370 425 349 242 216 201 134 108 121 168 212 144 147 120 279 317 302 284 321 433 445 451 560 587 672 662 633 612 614 543 489
2441 489 638 585 697 725 716 703 607 672 605 620 639 693 634 532 444 565 568 531 397 444 478 572 577 592 617 546 545 568 527 552 517 473 474 559 652
2432 652 718 588 593 571 540 579 646 622 637 748 774 830 816 811 869 881 954 882 905 1017 1121 1123 1241 1290 1301 1266 1278 1335 1386 1421 1430 1444 1471 1573
2424 1573 1800 1775 1964 2140 2199 2364 2463 2544 2473 2545 2705 2741 2730 2855 2970 3003 3021 2973 3037 3071 3058 3099 3346 3456 3487 3604 3714 3812 3971
2417 3971 4162 4362 4615 4812 4861 5045 5174 5289 5463 5794 6023 6097 6276 6590 6873 6946 6969 7290 7512 7804 8062 8385 8849 9232
2411 9232 9640 10142 10587 11173 11700 12414 13205 13994 14709 15667 16942 18315 19860 21712 23699 26126 28967 32605 37038 42886
2406 42886 51095 62690 77546 97005 122762 157465 201973 252133 309515 373631 445838 525115 592839 659913
2403 659913 719876 768498 810302 822478 818480 799097 764201 723127 663065 593891 517017 439938 372408 309470
2399 309470 253697 204593 166185 140472 126038 121697 124693 134782 152216 172575 198994 229962 257983 288551
2396 288551 312718 325916 334441 335309 329584 324867 312437 290764 261960 227771 191975 160786 133283 108402 86674
2392 86674 66942 50495 37789 28578 22230 18378 15375 13213 11494 10164 9044 8134 7155 6536 5808 5231 4721 4469
2388 4469 4112 3865 3578 3486 3207 3146 3014 3002 2821 2742 2495 2410 2336 2356 2208 2244 2164 2141 2012 2182 2219 2285 2247 2314 2109 2037 1860 1775
2381 1775 1706 1714 1611 1614 1502 1606 1557 1770 1847 1924 1954 2150 2235 2433 2491 2691 2758 2945 3024 3213 3204 3367 3345 3347 3351 3238 2889 2772 2476 2305
2374 2305 2079 1919 1761 1814 1586 1481 1224 1139 989 972 817 715 675 734 702 757 681 860 770 845 772 969 1037 1069 1134 1259 1338 1474
2367 1474 1535 1754 1850 2034 2066 2222 2370 2545 2487 2451 2307 2282 1989 2005 1885 1681 1556 1586 1446 1158 898 816 700 672 648 591 552
2360 552 498 319 259 55 -16 -6 80 68 132 15 135 208 374 358 320 118 276 325 233 171 90 -11 44 -33 -146 38 116 -18 117
2353 117 49 115 98 72 180 267 140 65 122 85 218 277 238 208 246 344 439 414 222 193 182 160 228 65 13 65 86 0 -80 5 21 75
2345 75 82 -32 188 162 72 7 103 223 60 -59 -24 130 166 63 46 -17 -26 107 127 20 53 44 53 1 51 168 117 48 114 133 156 90
2337 90 30 5 23 35 26 90 114 -20 142 60 56 109 118 132 215 253 296 320 269 271 319 309 377 268 306 195 229 238 244 145 161 130 275 215 229 211
2329 211 280 236 265 185 276 257 273 233 290 250 272 299 296 274 384 379 422 406 564 763 963 1102 1274 1402 1813 2158 2678 3103 3514 3781
2321 3781 4123 4287 4416 4495 4537 4412 4130 3766 3558 3149 2882 2501 2165 1739 1382 1099 929 772 813 716 896 870 1019 1033 1126
2315 1126 1213 1514 1699 1970 1956 2024 1965 1851 1850 1710 1572 1426 1179 1102 854 642 425 446 347 277 212 246 199 77 -18 73 58 55 64 75
2308 75 74 70 1 112 4 42 20 198 246 170 82 -12 -113 -111 13 77 -11 103 115 58 -5 21 83 66 41 128 178 241 116 63 99 143 207
2300 207 266 117 151 182 145 97 121 168 153 117 163 168 62 63 85 75 23 5 9 67 -4 77 167 146 203 119 -50 26 126 137 39 83 180 140
2291 140 212 239 316 163 34 58 77 212 259 215 244 394 611 720 754 729 628 727 714 811 854 849 949 936 850 673 530 576 399 245
2284 245 236 251 263 368 230 261 246 84 256 309 265 294 184 106 98 170 185 145 119 81 95 108 95 158 163 254 175 81 178 232 164 248 250 223
2276 223 221 312 269 256 141 142 185 253 149 194 231 292 274 299 256 215 146 91 53 88 173 224 234 309 333 527 403 526 636 666 770 922
2268 922 865 1064 1166 1408 1588 1895 2412 3621 6610 11193 15030 16138 14600 12779 11598 11619 12513 13836 14424 13601 12436
2263 12436 12386 13076 13896 14041 13684 13545 14100 14972 15379 14489 13449 13741 14533 13699 10863 7391 4705 2826 1883 1356 1135
2258 1135 987 894 737 647 448 307 376 499 425 255 239 354 303 190 35 82 5 59 116 153 170 257 246 260 270 349 416 526 363
2251 363 360 307 440 463 458 376 343 247 236 263 259 281 271 175 212 227 243 128 90 29 160 -9 -39 -43 9 18 -69 20 19 -32 87 123 96 -13 139
2242 139 203 131 107 56 87 176 151 166 158 77 65 128 166 94 18 49 -65 -78 -73 -42 9 6 -76 -102 -160 -131 -142 -143 -220 -74 -14 -34 -124 -40 59 -10
2233 -10 -98 -136 40 27 -135 -77 3 -24 -3 -34 72 -20 -25 -122 -197 -205 -42 38 37 36 33 25 60 55 -29 -90 -57 -52 -52 -53 -73 -96 -61 -45 -12 -20 39 -99
2224 -99 -20 -13 -9 68 1 -37 -139 -249 -128 20 61 48 88 31 54 9 89 107 38 29 50 -30 -63 -67 24 -25 24 -14 -37 -55 73 163 147 149 123
2215 123 12 26 -61 -82 -52 55 -19 -54 -155 -91 -41 -82 -113 -86 -86 14 119 122 55 90 76 136 114 13 -68 45 -30 9 -18 10 -7 90
2207 90 26 -86 -33 43 -6 15 -60 -17 45 -56 -91 28 -49 77 29 8 -49 63 62 116 108 18 -67 48 104 96 92 165 99 174 48 62 28 77
2199 77 73 112 89 127 156 228 191 109 50 150 142 170 122 169 182 209 209 327 327 444 320 340 296 319 302 362 432 444 366 398 340 461 502 522 462
2191 462 478 420 437 525 613 549 631 628 602 644 788 786 670 662 876 1036 1227 1311 1410 1481 1674 1669 1992 2435 2932 3547 4405 5242 6483 7736
2183 7736 9078 10884 12738 14640 16548 18525 20421 21905 23313 24253 24716 25212 25343 24928 24053 22848 21475 19957 18489
2179 18489 17014 15288 13761 12696 12021 11733 11931 12575 13627 15363 17644 20363 23713 27421 30944 34601 38425 41875
2174 41875 44803 47275 48966 49671 50090 49944 48436 46102 43187 39811 36331 32753 28901 25260 21852 18981 16630 14500
2170 14500 13041 12056 11493 11560 12244 13107 14383 15988 17580 19308 21078 22571 23852 24894 25496 25516 25657 25269 24235 22880
2165 22880 21207 19348 17467 15572 13567 11493 9621 8073 6645 5312 4326 3509 2881 2234 1901 1504 1277 1054 1068 906
2160 906 874 735 792 699 665 732 697 656 669 603 811 835 901 1072 1077 1053 1083 1120 1179 1187 1193 1206 1280 1207 1305 1186 1203 1293 1336 1267 1325 1311 1462 1342
2152 1342 1414 1358 1316 1332 1429 1258 1345 1461 1557 1640 1637 1495 1518 1396 1383 1302 1434 1382 1345 1187 1146 1130 1211 1282 1390 1394 1530 1472 1527 1537 1578
2144 1578 1573 1711 1804 1820 1728 1799 1755 1673 1660 1754 1681 1708 1621 1485 1352 1413 1390 1453 1556 1690 1614 1736 1765 1876 1734 1896 1855 1996 2075 2012
2137 2012 1958 2014 1964 1920 1778 1810 1821 1766 1707 1728 1575 1511 1324 1251 1251 1364 1328 1369 1264 1359 1211 1100 1146 1086 1060 959 839 837 864 870 650
2129 650 576 576 499 480 640 567 474 310 309 407 423 413 472 322 337 330 350 338 354 340 335 211 173 291 317 400 518 551 516 500 362 360 429 395
2121 395 419 427 472 399 342 646 591 524 621 694 772 881 1018 1039 1054 1115 1022 970 965 933 804 790 707 700 582 521 479 512 561 724 653 575 529
2113 529 613 638 631 559 637 616 554 432 534 592 724 557 554 697 709 686 686 701 658 754 885 789 810 746 680 657 702 713 775 885 952 944 936 851
2105 851 931 930 1020 860 968 995 1122 1069 1215 1163 1176 1146 1215 1241 1382 1431 1450 1544 1582 1522 1741 1824 1814 1743 1929 1925 2070 2106 2142 2027 2270
2097 2270 2242 2438 2444 2445 2426 2486 2411 2436 2372 2464 2351 2429 2351 2423 2423 2466 2442 2486 2535 2691 2764 2885 2936 3262 3253 3322 3301 3405 3610 3830 3908 4196
2089 4196 4417 4719 4850 5160 5376 5771 6270 6980 7642 8378 9292 10529 11800 13664 16031 18695 21355 24433 27781 31946
2084 31946 36876 41798 46184 50818 55156 60075 65302 69411 72459 75088 76681 78834 81067 81617 80978 79661 77773 76915
2080 76915 76611 75899 74575 73328 72766 74551 77584 80851 84393 88815 94589 103642 113975 122718 131643 140656 149681 161341
2075 161341 172085 178793 184702 189414 192512 197241 200305 198993 196401 192697 189154 187537 186223 183148 179660 177601 178189
2071 178189 181701 186909 191960 196287 200932 208194 218336 229366 241336 251814 257899 262002 266524 270594 276667 283810
2067 283810 286697 286296 283118 277612 274109 274336 275414 279147 281297 279683 278992 280736 283128 293485 304280 309978 313004
2063 313004 314152 314114 322502 333248 337421 334136 324771 314669 311092 311362 308632 299993 285462 269848 258075 249141
2059 249141 241184 232903 222985 212906 203500 195183 187308 180543 174905 169298 162925 155862 147874 140739 134882 128773 121128
2055 121128 111988 102335 93465 86060 78920 70815 62245 53942 46974 41605 37208 33234 29759 26871 24738 23113 22279
2051 22279 21542 20961 20182 19299 18209 17245 16246 15131 14004 12917 11887 11183 10414 9918 9568 9437 9243 9270 9343 9423 9682 9826
2046 9826 9847 10099 10406 10722 11084 11411 11822 12617 13993 15964 18559 22440 27667 33889 41681 50320 60084 71471 81805
2041 81805 92198 101947 109398 115390 117971 116944 114331 109306 101884 92379 81027 69099 57652 47221 37476 29501
2037 29501 22613 17128 12968 9909 7810 6501 5581 5091 4576 4243 3849 3681 3351 3155 2984 2880 2590 2306 2160 2169 2033
2032 2033 2095 1982 1973 1894 1938 1957 2038 1997 2005 1965 1993 1951 2010 2148 2362 2376 2496 2685 2864 2862 3086 3271 3532 3579 3807 4090 4447 4792 5368
2025 5368 5788 6546 7816 10024 12992 17454 22987 29610 37183 45956 54914 65505 76069 86694 97430 105660 111070
2021 111070 113646 112961 110334 106704 100666 92414 81822 70164 58358 47983 38717 30660 23617 17739 13029 9578
2017 9578 7242 5813 4760 4048 3676 3305 2970 2713 2593 2316 2169 2103 1962 1818 1714 1414 1289 1199 1192 1268 1241 1069 923 866
2011 866 914 984 933 936 831 802 796 801 716 733 898 912 923 1016 962 967 994 1114 1118 1102 1061 1032 1057 1034 1102 1031 901 966 1044 881 904 889 863 899 816
2002 816 766 888 865 861 810 975 996 957 1080 1116 1139 1181 1248 1170 1326 1267 1347 1386 1433 1478 1508 1471 1401 1422 1473 1546 1523 1437 1498 1519 1592 1569 1592
1994 1592 1779 1996 2174 2446 2672 3003 3457 3841 4244 4651 4988 5254 5461 5713 6105 6433 6702 6777 6911 6922 6712 6467 6133 5709
1988 5709 5046 4654 4155 3618 3285 3002 2802 2678 2658 2728 2747 2978 3069 3145 3434 3934 4094 4386 4655 4909 5230 5469 5368 5539 5593
1982 5593 5654 5560 5458 5250 5039 4705 4397 4162 3977 3615 3275 2939 2666 2385 2108 1871 1741 1394 1347 1201 1166 1030 888 796 805
1976 805 697 515 428 502 327 321 362 256 245 272 275 318 286 379 210 192 26 90 91 161 63 195 240 272 160 37 106 238 150 233 162
1969 162 186 145 187 171 151 0 33 39 177 283 281 184 107 103 182 137 197 99 119 179 274 115 99 280 380 433 449 485 548 734 820 760 631
1960 631 633 627 645 643 628 584 469 429 324 294 215 198 145 97 48 106 66 -2 18 69 182 343 233 227 208 64 22 -23 -40 -3 105 104 -48
1952 -48 7 0 99 84 48 -120 -103 -118 -94 21 95 71 32 -43 -23 -48 -70 -2 87 72 0 -24 5 29 -61 -208 -152 -139 -60 6 -5 25 157 237
1944 237 253 341 338 256 426 643 639 590 637 619 586 626 554 579 623 673 503 351 332 289 133 141 189 156 26 -1 76 140 117 155 182 77 -190
1936 -190 -173 -125 -134 -101 117 42 37 100 70 1 -8 -158 -147 -72 22 -67 -95 18 -1 -39 12 -109 -70 -83 -89 -31 86 -97 -105 -201 -64 -51 57
1928 57 -138 -204 33 196 52 60 7 11 -68 -94 -79 -100 -115 -8 -47 16 -134 -98 14 142 143 127 -44 9 60 94 81 196 118 221 164
1920 164 -24 -115 26 39 209 199 332 255 341 447 614 536 654 758 903 884 949 932 1042 980 959 978 1034 1010 1088 1021 964 821 884
1913 884 874 794 744 707 485 406 347 425 379 452 395 395 260 148 189 212 123 118 63 72 67 54 18 148 159 235 233 225 128 228 244 352 381 330 350
1905 350 433 390 449 448 501 408 366 412 478 566 619 677 811 794 877 1097 1296 1314 1501 1641 1686 1814 2098 2206 2340 2439 2363 2342 2338 2371 2424
1897 2424 2252 2117 2038 1956 1851 1713 1578 1400 1228 1095 965 931 883 754 592 642 555 525 579 618 659 668 745 713 821 961 886 848
1890 848 972 980 944 996 1135 1284 1418 1305 1332 1393 1391 1472 1287 1193 1307 1239 1146 1114 1111 1101 1060 997 946 871 805 766 813 775 727 677 686 648 569
1882 569 440 508 478 519 481 514 435 453 372 208 153 159 26 157 175 118 21 25 -2 -39 -119 -76 -52 -26 -65 -61 -54 37 -58 -123 25 175 36
1874 36 -23 -75 -178 -65 29 107 125 -114 -119 62 121 79 123 -60 8 -30 27 54 -11 -184 -75 -59 44 24 44 109 78 62 97 -58 -88
1867 -88 -19 57 4 98 35 84 30 104 96 60 -145 -183 -120 -85 -133 -39 -106 -67 -136 16 -11 -19 -22 5 -37 -39 -68 78 -20 12 -32 34 81 55 -39 -21
1858 -21 -80 52 -43 -161 -172 59 -4 -9 -51 12 -60 -15 32 164 17 76 -31 -66 -112 -107 -148 -18 -180 -218 -260 -147 -232 -211 -153 -108 -188 -63
1850 -63 -14 36 -164 -93 -222 -146 -87 62 -1 -39 -35 -12 -54 53 -64 -64 -79 -28 -33 -117 -50 26 -32 42 5 -85 -81 82 -48 -34 -118 -37 66
1842 66 -13 -79 -20 -9 6 -51 -13 15 1 -99 -93 -57 -4 -101 0 95 65 77 27 20 76 -11 -113 -108 -42 0 37 107 114 39 -75 -10 -41 -35 -140
1833 -140 -225 -113 -125 -131 -108 -31 -121 -234 -82 14 -68 -45 4 -86 -118 -88 -137 -173 -173 -157 -66 -109 -175 -109 6 39 108 32 -26 -115 -118 -234 -184 -99
1825 -99 -93 49 80 67 79 -24 58 22 58 -15 -61 -148 -123 -81 -29 -93 95 13 14 -18 78 70 113 31 27 -72 12 -50 -31 20 70 -15 37 -25 -85 -65
1816 -65 9 -76 -19 -65 19 -87 -35 -76 -63 -70 -73 -58 90 75 -39 -60 17 -76 -32 32 81 -9 27 -168 -140 -137 10 -130 -71 -134 -26 -107 -14
1808 -14 -10 29 -45 -7 -50 3 -119 -20 -179 -145 -109 20 0 -80 -67 -65 -61 84 33 -11 -15 55 -104 -86 -158 -108 -44 16 -22 63 -52 22 -56 -54 -92
1800 -92 79 61 78 -80 136 61 -11 -128 26 -13 -3 -121 -104 -81 -10 49 89 22 33 -30 -36 -28 84 28 49 -12 29 -96 -87 -215 -132 -109
1792 -109 -67 -105 -20 -10 96 65 58 -52 -8 17 54 -62 -3 -52 -41 50 118 94 204 117 -53 -78 112 -28 20 -50 -129 -232 -177 -136 -6
1784 -6 53 126 130 56 9 40 42 103 -51 -71 0 -8 -125 -23 59 65 78 116 57 32 32 9 -22 33 -16 20 -66 -51 55 120 12 -4 -47 -37 63
1776 63 135 117 53 65 63 -63 -123 -156 -117 0 224 120 -29 14 51 -8 -9 -15 -97 -110 -35 36 -35 106 170 21 -86 45 75 13 -51 23
1768 23 -6 57 41 10 69 71 -4 6 -67 54 -50 2 62 44 25 199 144 160 153 201 51 109 88 87 -26 41 -45 70 163 160 129 208 114 226
1759 226 207 266 91 86 -3 -49 -102 103 46 -48 -177 43 0 24 75 81 -95 -6 -83 62 63 129 37 76 -92 -124 -103 66 -80 -72 -130 -70
1752 -70 -99 30 32 -21 -52 53 -53 -86 -124 35 -41 28 -7 122 60 43 3 102 21 119 -59 50 -34 32 54 118 43 99 137 263 138
1744 138 135 42 152 182 249 -3 -12 -92 47 -47 15 -76 58 53 169 -5 134 82 94 -128 -28 65 219 46 29 71 80 25 211 29
1737 29 151 30 41 -111 54 -14 101 48 77 48 173 237 318 81 178 204 271 146 174 -1 29 31 168 108 104 92 188 44 192 79
1729 79 -1 -8 1 -121 0 34 48 -48 -22 17 -48 -164 43 82 111 -10 -77 -35 134 113 155 73 75 156 155 23 101 98 96 81 -5 25 54 61 182
1721 182 80 1 -33 73 154 198 91 34 -10 4 -46 -56 -86 -143 -28 -23 -61 -78 -20 26 -8 -20 33 54 209 130 41 22 4 -12 122 121 97
1713 97 -1 -28 18 93 82 300 351 190 118 215 170 246 202 160 1 58 38 58 5 14 -45 98 108 122 151 269 160 143 36 160 104 150
1705 150 34 65 -3 130 40 205 293 258 116 207 157 258 22 94 44 101 -42 67 171 310 242 225 207 271 37 98 39 252 44
1698 44 75 -13 108 42 96 90 328 166 281 204 189 47 199 124 203 46 101 139 219 68 186 14 162 125 132 135 376 263 266 106
1691 106 244 49 145 63 201 111 217 72 58 -32 145 51 120 192 254 0 44 114 242 11 105 122 297 79 155 78 287 209 278
1683 278 86 178 111 260 53 239 247 318 127 150 112 219 135 241 233 303 135 236 97 153 171 321 304 369 132 246 54 241
1677 241 197 343 211 280 55 183 119 189 107 270 156 318 237 298 190 215 67 91 27 249 106 159 37 205 236 361 242
1670 242 232 210 272 194 256 196 228 74 170 75 248 165 119 188 175 240 275 228 257 225 284 311 295 128 202 231 144 20 162 227 257 301
1662 301 312 216 207 219 253 161 165 367 464 365 223 278 288 321 370 387 392 375 328 338 332 244 281 329 436 380 229 289 212 156 202 216 164 320
1654 320 321 384 265 290 268 205 149 325 299 303 246 355 273 219 73 307 300 423 222 171 149 277 275 425 180 380 329 354 283 397 271
1646 271 283 47 263 65 261 207 272 176 262 228 369 233 263 91 397 334 471 403 513 295 379 251 461 353 399 155 244
1640 244 134 312 187 379 297 453 347 626 385 529 388 523 367 516 463 599 418 806 866 1261 1234 1342 1102 1191 884
1634 884 1069 717 820 651 721 523 829 497 508 362 658 507 649 495 629 498 673 503 683 527 809 655 918 658
1628 658 767 578 821 655 730 527 766 557 841 664 991 767 954 676 930 691 857 730 936 771 868 671 910 655
1622 655 973 897 1072 884 1119 1063 1202 1095 1481 1251 1325 1176 1480 1627 1989 1901 2424 2462 3067 3466 4476 5591 8268 13221
1616 13221 24040 38030 41704 29973 17460 10855 7921 6234 5436 4592 4113 3677 3528 3553 4406 5913 9659 15422
1612 15422 18325 14199 8596 5312 4062 3126 2921 2626 2408 2197 2218 2129 2478 2907 4018 5871 8665 10970 10685 7462
1607 7462 4733 3263 2645 2202 1929 1762 1619 1397 1353 1128 1233 1285 1305 1336 1214 1053 1110 1240 1256 1177 1247 1355 1367 1387 1396 1386 1320
1600 1320 1303 1298 1258 1315 1385 1215 1278 1292 1361 1381 1370 1373 1491 1428 1385 1171 1324 1228 1367 1291 1443 1452 1649 1584 1721 1586 1738 1531 1710 1699
1593 1699 1932 1846 1796 1392 1480 1426 1772 1783 1986 1813 2071 1785 2026 1808 2100 2132 2391 2092 2251 1793 2062 1954 2218 2038 2420
1587 2420 2094 2317 2113 2656 2550 2976 2845 3353 3510 4186 3681 3542 2995 3085 2631 2945 2499 2859 2630 3307 3216 3625 3234 3655
1581 3655 3281 3724 3127 3429 2887 3330 2892 3216 2573 3050 2664 3351 3181 3727 3335 3984 3695 4278 3738 4366 3874 4424 3792
1575 3792 4142 3401 3930 3470 4166 3769 4398 3910 4612 4041 4737 4388 5241 4995 5829 5411 6158 5529 6167 5768 6710 6517 7384
1569 7384 6691 7370 6921 8029 7651 8707 8526 9804 9908 11557 11780 13403 13510 15885 18640 26212 32462 32021 28102 30632
1565 30632 35828 49252 77381 122674 138676 137176 137376 134646 118272 106909 90513 61689 45293 39111 34868
1561 34868 33117 31388 31604 29456 27664 25134 24014 21920 22478 23421 25610 25750 26414 25114 25432 24513 25007 24587 25652
1556 25652 25192 26338 26234 27810 27939 29119 28931 30829 31356 33363 34169 36338 37269 40056 41360 43635 44186 47063 50251
1552 50251 55087 56890 59375 61298 65517 68267 72386 76703 84410 90479 96482 100704 107150 113705 124757 139450 160016
1547 160016 182183 208531 240874 289299 354667 425711 502896 626401 842900 1238934 2046513 3844998
1545 3844998 6745930 8109347 6285482 3577847 2059027 1380311 1064350 879369 754034 664301 593865
1542 593865 533673 519010 585278 826436 1439886 2642873 3485651 2873273 1643519 922475 618279 475174
1539 475174 397160 340150 304719 277453 255402 240069 253290 311996 465001 786573 1273960 1859838 2063714
1536 2063714 1535920 850424 495730 342819 268251 221673 183478 153505 124761 98107 73696 58456 47944
1533 47944 43094 37876 34912 30786 29979 29121 31183 29351 26758 22299 20744 17794 17182 15321 15498 13790 14000 12340
1528 12340 12561 10957 11274 10103 10733 9533 10238 9316 9891 8352 8643 7424 8091 7228 8711 8822 9565 7273 6746 5398
1523 5398 6080 5221 5945 5052 5363 3910 4471 3730 4735 4168 5247 4871 5641 4394 4622 3592 4142 3185 3820 3170 3780
1518 3780 2933 3531 2862 3944 3871 5171 5447 6949 6332 6406 4785 4495 3333 3966 3559 4012 3016 3289 2287 2374 1616 2279
1513 2279 1618 2266 1875 2420 1745 2393 1775 2256 1549 1975 1512 2173 1604 1896 1116 1639 1168 1642 1031 1448 793 1254 712
1507 712 1181 879 1641 1662 2238 1638 1820 1103 1300 965 1532 1113 1144 517 939 501 774 508 908 730 1179 784 1096 603
1501 603 799 579 911 559 721 193 419 205 578 325 671 454 699 392 580 376 697 545 870 585 610 365 444 172
1495 172 613 440 478 186 396 258 404 319 589 637 807 666 692 467 508 414 555 564 676 779 1144 1042 1223 1088 1094 1023 1021 1025
1489 1025 1018 990 1391 1658 1854 1799 1413 1018 834 770 694 686 805 900 862 684 585 657 541 466 471 762 792 816 663 608 427 472 407 480
1481 480 385 298 171 376 302 339 303 319 284 356 395 514 470 544 525 624 502 684 638 830 672 719 626 738 749 821 650 925 1024 1203
1474 1203 1243 1831 2082 2424 2668 3364 4321 6490 9996 18159 32081 42191 35652 21781 12510 8368 6130 5250 4350
1469 4350 4021 3292 3134 3041 3577 4566 7616 13058 17807 15347 9554 5477 3869 2709 2394 1916 1962 1491 1529 1194 1435
1464 1435 1597 2463 3695 6138 8716 10659 8606 5325 2843 2008 1249 1216 818 801 480 634 335 377 18 286 93 339
1459 339 79 161 -79 171 12 247 11 122 -206 107 -65 181 -91 154 14 114 -112 96 -134 123 7 264 -86 50
1453 50 -74 96 -86 23 -321 -94 -155 -61 -246 -83 -244 7 -134 98 35 186 -2 200 -67 105 -43 77 -145 55 -220
1447 -220 -93 -248 -9 -59 186 -31 106 68 262 109 194 -9 188 73 112 38 170 30 172 78 193 39 217 0 71 90
1440 90 272 180 306 65 225 140 183 70 213 77 84 -15 26 -147 19 -43 19 -31 48 -22 76 -46 110 49 161 50 49 1 93 131
1433 131 214 5 -3 -94 2 -48 15 -5 -4 -72 -73 -119 -48 -71 87 126 88 116 130 88 -34 -22 74 32 -54 -80 -69 53 24 -19 16 -60 -28 165
1425 165 4 -42 2 57 36 -32 -36 17 -5 -48 -21 -2 -167 -48 -9 63 103 211 71 50 -103 24 11 62 -58 20 5 114 75 231
1417 231 160 106 -31 81 48 89 52 10 -97 -7 -43 42 -51 157 -31 160 105 145 84 243 84 205 55 227 131 263 313 590
1411 590 577 758 874 1120 1127 1271 1130 1194 1002 965 620 522 314 390 303 377 127 304 185 258 287 552 392 630 731 1166 1242
1404 1242 1572 1630 1743 1594 1527 1332 1358 1034 1052 861 786 405 498 300 414 278 279 -59 135 48 160 -13 199 94 119 -53
1398 -53 222 69 123 0 136 58 92 -116 20 -68 212 144 166 37 278 240 186 107 120 74 214 -35 65 -15 152 85 176 33
1391 33 162 44 274 46 193 189 283 146 317 156 207 73 170 150 235 80 249 138 266 58 77 7 121 84 188 70 321
1384 321 168 221 120 210 209 344 190 188 76 299 248 343 197 265 506 577 621 613 601 830 727 849 880 898 831 895 699 633 560 560 465
1377 465 423 307 383 328 408 329 235 239 306 273 197 236 342 258 343 266 251 275 397 400 498 600 590 594 553 544 527 514 498 494 488 517 526 510 598 776
1368 776 836 1098 1308 1321 1474 1520 1639 1766 1926 2031 2005 2019 1984 1910 1820 1652 1620 1579 1326 1283 1172 1231 1204 1318 1290 1321 1264 1425 1545
1361 1545 1679 1732 2011 2135 2426 2407 2542 2562 2725 2719 2784 2654 2582 2478 2595 2506 2423 2299 2299 2196 2357 2358 2414 2308 2560 2550 2732 2787
1354 2787 3009 3213 3605 3729 4118 4326 4796 4871 5217 5228 5493 5679 6132 6470 7268 7831 8758 9602 10946 12160 13866 15464
1348 15464 17732 20276 24391 30578 41600 58384 83923 117136 156063 195336 227783 246171 248946 235361 207778
1345 207778 171223 131656 95481 67433 49119 38625 33309 30906 29904 30466 31848 34720 39953 49792 66281
1341 66281 92769 128761 173256 220350 261548 291891 307317 310298 303122 285194 255786 214963 166726 120007
1338 120007 81773 55107 38717 28943 23027 18948 16446 14423 12942 11476 10186 8824 7764 6718 5935 4988 4377
1333 4377 3688 3422 2997 2806 2545 2371 2253 2182 2059 2119 1924 1848 1745 1724 1607 1635 1475 1463 1331 1497 1402 1425 1342 1373 1299 1417 1364
1327 1364 1532 1561 1743 1884 2223 2845 4118 5516 7414 8512 7946 6230 4387 3037 2533 2134 2147 2014 1968 1844 2029 2045
1322 2045 2164 2153 2450 2613 2821 2946 3255 3573 3905 4387 4929 5391 6080 6843 7856 9114 11207 14637 19708 26709 36051
1316 36051 47790 60987 74476 88236 100975 110221 114154 113744 110163 103017 91632 77330 62632 49205 37404
1313 37404 27376 19472 13931 10364 8208 6742 5695 5031 4417 3756 3364 2903 2518 2193 1790 1557 1385 1221 1083 1106
1308 1106 856 658 627 581 541 547 505 532 443 506 435 456 524 429 346 285 265 356 294 273 308 201 258 259 81 162 121 210 102 198 219 268 188
1300 188 209 209 257 141 143 139 145 271 269 135 201 138 134 108 195 57 54 95 91 0 92 191 258 246 323 195 205 15 52 68 129 44 174 245 166
1291 166 85 118 150 260 -57 -58 -85 -22 -76 -72 -80 247 202 129 68 58 -28 165 -68 20 0 145 82 9 37 193 108 288 111 133 91 188
1283 188 88 235 175 261 290 472 429 616 663 929 1065 1247 1309 1467 1220 897 631 578 439 406 196 237 22 166 135 204 194
1277 194 271 224 361 455 584 681 921 1204 1443 1304 1454 1484 1593 1486 1363 1111 963 868 681 482 415 351 340 238 336 256 306
1270 306 98 185 86 93 37 71 103 222 96 177 144 43 -16 68 10 68 -64 -36 17 150 184 204 1 61 61 30 17 56 -72 -25 69 220
1262 220 169 181 92 129 -13 -81 -107 16 55 218 81 34 -60 -133 0 61 -19 127 99 146 24 14 2 98 142 140 126 261 156 98 17
1255 17 -32 -128 -37 67 -31 -65 90 75 41 72 115 150 187 220 263 402 592 530 488 619 717 771 721 602 467 527 408 337 393 208 34
1247 34 113 87 138 1 17 84 123 125 142 24 25 132 221 91 275 383 302 309 416 272 301 193 254 184 258 258 183 179 169 80 91 45 -30
1239 -30 -15 150 176 264 114 213 263 378 461 561 352 342 270 244 265 283 263 236 -13 127 140 247 188 296 146 104 39 38 2 94 131
1232 131 98 67 209 145 146 154 209 221 310 104 140 148 240 164 217 118 31 -20 134 159 177 119 248 68 121 157 191 156 279 226 256 103 122
1223 122 70 116 125 246 333 497 277 238 173 429 514 550 344 321 327 344 190 308 236 224 154 251 199 215 165 260 199 187 188 228 140 254
1216 254 176 192 170 159 -2 171 116 249 230 370 284 284 158 237 235 274 231 279 255 316 269 320 272 308 235 237 119 169 234 318 130 221 84
1208 84 174 280 312 145 198 14 75 189 238 266 270 347 435 506 492 390 399 340 403 290 315 365 293 282 366 343 315 267 468 430 417 267
1200 267 396 395 450 485 454 518 569 627 585 506 473 543 513 500 441 485 404 443 411 349 493 439 410 457 337 376 488 485 444 447 456 405 422 368 327
1191 327 398 423 519 518 461 475 344 348 539 562 489 490 513 552 547 475 399 370 410 386 333 381 394 369 448 362 483 475 458 414 502 382 260 255 387
1183 387 474 492 473 422 416 529 318 356 278 389 410 475 289 273 258 217 263 262 240 310 354 452 435 364 258 470 406 394 326 413 268 358
1175 358 305 331 221 215 193 345 371 513 449 465 339 326 282 315 344 384 296 429 317 378 399 460 418 354 306 447 433 487 420 414 343 617
1167 617 759 681 570 636 632 707 699 896 963 1254 1365 1576 1590 1711 1680 1729 1507 1485 1264 1096 851 848 826 815 756 884 893 973 858 779
1160 779 737 839 885 1003 1012 1128 1151 1409 1602 1753 2027 2312 2477 2888 2979 2999 2856 2693 2536 2462 2299 2111 1787 1750 1667 1556 1536
1153 1536 1589 1410 1447 1431 1480 1512 1517 1420 1471 1497 1570 1540 1731 1708 1833 1998 2348 2625 2945 3138 3316 3472 3820 3736 3627 3821 4013 4395
1146 4395 5036 5695 6513 7606 8820 10325 12169 13950 15880 18111 20339 22479 24545 26507 28365 29932 31274 32165
1142 32165 32566 32456 31942 31177 30134 28791 27208 25622 24117 22660 21480 20504 20088 19945 20242 21063 22520 24688 27468
1137 27468 30622 34168 37894 41880 45866 49797 53322 56524 59076 60830 61845 62042 61414 60129 58030 55438 52411 48908
1133 48908 45402 41857 38472 35610 33161 31271 30129 29644 29725 30504 31930 33784 35883 38162 40559 42789 44815 46482
1128 46482 47777 48471 48787 48433 47686 46347 44534 42597 40518 38398 36360 34151 31990 29988 28342 27115 26595 26722 27487
1124 27487 28771 30498 32424 34559 36314 37915 39166 40099 40535 40427 39782 38827 37235 35335 33017 30573 27894 25176
1119 25176 22486 20083 17867 16086 14618 13531 12647 12140 11987 12165 12614 13280 14027 15173 16258 17346 18371 19309 20079
1115 20079 20641 20712 20692 20364 19791 18816 17795 16586 15450 14077 12777 11493 10187 9097 8174 7234 6630 5970 5583 5184 5067
1109 5067 4835 4742 4465 4541 4495 4571 4520 4565 4671 4918 5031 5227 5383 5707 5729 6094 6529 6765 7073 7506 7972 8522 9054 9843 10783
1103 10783 11956 13453 15207 17408 20107 23094 26918 31621 38389 49092 66406 91353 122617 158946 196286 226934
1099 226934 247019 252310 240750 214470 178660 140234 105521 78158 59608 48358 41829 38130 36449 35705 36177
1096 36177 38405 42716 48542 56269 65147 74012 83170 93536 106706 124356 148425 183395 225154 269496 315047
1092 315047 352205 375512 383967 375206 353793 322841 286156 249934 216225 185804 159388 136127 117744 102800
1089 102800 90977 82697 75416 67806 59918 51923 45327 40594 38201 38123 39982 43725 50013 60719 78756 105276
1085 105276 139456 180000 221971 258136 282357 289797 278480 249219 207939 162444 119944 85115 60240 44276
1081 44276 34560 28471 24117 20795 17889 15310 13121 11117 9592 8361 7216 6226 5542 5095 4680 4333 3938 3621 3375
1077 3375 3178 2987 2918 2805 2559 2422 2461 2489 2436 2429 2622 2805 2729 2749 2766 2652 2592 2516 2565 2521 2482 2529 2781 2857 3038 3094 3019 2960 2865 2604
1069 2604 2469 2329 2185 2092 2252 2265 2344 2442 2395 2385 2355 2346 2227 2250 2472 2664 2790 2955 3064 2961 2786 2591 2714 2861 2923 2849 2803
1063 2803 2637 2477 2290 2040 1677 1455 1343 1407 1384 1256 1055 1193 1175 1237 1155 1141 1128 1111 992 979 937 918 901 858 805 846 800 863 827
1056 827 913 935 825 840 912 954 867 853 1006 1082 1248 1271 1139 990 962 954 995 861 897 824 885 857 932 909 986 884 963 954 974 936 1011 1047
1048 1047 1152 1039 1219 1284 1248 1075 1047 1031 1112 1025 933 995 1063 1102 1239 1221 1254 1263 1360 1163 1093 1004 1022 878 838 910 1157 1243 1360 1327
1041 1327 1424 1311 1299 1160 1228 1255 1430 1456 1611 1706 1646 1413 1422 1305 1300 1293 1364 1241 1231 1289 1275 1197 1306 1334 1551 1790 2107 2199 2403 2460
1033 2460 2553 2571 2532 2371 2132 1785 1563 1395 1362 1299 1281 1249 1194 1174 1010 1047 1098 1163 1215 1234 1255 1266 1396 1640 1790 1922 2166 2355
1026 2355 2535 2615 2663 2653 2569 2450 2299 2129 2072 1883 1810 1706 1521 1294 1375 1453 1410 1244 1226 992 1000 946 969 977 998 1103 1126 1131 1228 1338
1019 1338 1531 1758 1924 2093 2255 2278 2299 2176 1834 1625 1499 1306 1176 1058 1060 961 861 838 830 973 1043 942 955 1014 904 887 887 771
1012 771 784 820 816 852 848 814 844 827 829 837 758 757 766 874 719 840 936 810 778 826 796 820 919 958 900 909 958 921 960 902 918 964 924 851 760 873
1003 873 912 969 869 976 968 896 857 1056 1051 917 940 1028 907 875 845 1030 1029 1044 1160 1240 1185 1150 1036 1080 1019 1048 958 920 932 956 907 972
996 972 961 1107 1204 1141 1098 1028 996 1082 1147 1274 1234 1257 1286 1212 1246 1300 1242 1213 1133 1102 1200 1294 1257 1309 1275 1325 1301 1321 1354 1483 1382 1348 1327
987 1327 1356 1303 1426 1436 1390 1482 1618 1730 1731 1604 1736 1806 1915 1963 2137 2184 2497 2759 2978 3129 3509 3650 3869 3970 4056 4056 3919 3785
981 3785 3738 3572 3285 3032 3013 2972 3066 3237 3314 3354 3560 3523 3608 3716 3774 3841 4009 4269 4798 5264 5803 6231 6576 7010 7355 7313 7165
974 7165 6815 6542 6303 6171 6046 6163 6254 6405 6558 6654 6669 6751 6730 6561 6277 6167 5955 5855 5734 5764 5696 5779 5920 6159 6400 7001
968 7001 7625 8534 9531 10963 12683 15267 17769 20460 23118 24849 26047 26207 25441 24619 23539 21926 19370 16349 13128
963 13128 10702 9084 8159 7669 7312 6925 6636 6517 6350 6180 6196 6138 5917 5765 5566 5294 5139 4985 4945 4955 4971 4957 4872 4988 4995
957 4995 5024 5247 5402 5609 5772 5850 6220 6383 6376 6295 6137 5948 5720 5669 5558 5470 5419 5478 5582 5593 5632 5626 5525 5302 5164 5143 5008 4970
950 4970 4945 4991 5004 5075 4988 4875 4882 4879 4907 4959 4934 4909 4955 5024 5192 5359 5451 5465 5440 5495 5549 5528 5518 5617 5534 5367 5521 5536 5692 5725 5812 5878 5961
942 5961 6192 6247 6335 6427 6388 6323 6376 6448 6428 6407 6403 6502 6562 6666 6805 7023 7195 7135 7252 7272 7307 7393 7535 7609 7779 8068 8447 8819 9376
935 9376 9962 10519 11007 11361 11482 11459 11522 11503 11567 11622 11768 11807 11974 12113 12107 12232 12429 12892 13373 13940 14440 14889 15457 16107 16721 17508
929 17508 18192 18884 19490 20463 21635 23078 24741 26638 28720 30970 33160 35336 37402 39561 41485 43436 45583 48347
924 48347 51645 55825 60919 66658 72354 77114 80576 82347 82905 82540 81044 79085 77376 76646 77176 78777 81443 85130
920 85130 89737 95476 102753 111995 122850 134346 144056 150544 153316 154779 156878 159555 161107 160553 157522 154690 153642
916 153642 155218 158932 164921 172863 183377 197836 219014 246891 280884 317431 349582 371580 386284 402554 427833
912 427833 461725 502433 555665 636828 763665 948904 1195753 1495073 1818325 2128503 2394929 2603743
909 2603743 2733423 2757844 2666523 2484067 2258282 2037847 1852590 1711519 1609176 1537824 1484883 1437988
906 1437988 1389200 1340156 1295326 1259812 1234852 1221607 1217920 1225796 1248872 1308042 1452418 1765482 2183935
903 2183935 2589601 3085123 3497571 3777554 3932240 3861076 3765307 3641757 3428261 3076906 2556512 1978507
900 1978507 1419579 1040006 827558 706038 634870 591332 560995 536423 514640 493460 473172 452906 431027
897 431027 407552 382353 357076 332393 308180 285529 264560 245962 229869 216127 204915 196284 189569 185103
893 185103 182185 181325 182335 184809 188898 194907 201743 209782 217989 226574 235303 243736 251314 258973 265069 269432 270967
889 270967 269690 265026 256671 244448 229881 212452 193657 173795 154183 135137 117709 102271 89402 78441
886 78441 69974 63324 59038 56246 55574 56171 58258 61144 65135 69278 73977 78589 83116 86677 89675 91334 91930 90548
881 90548 87934 83517 78148 71417 64192 56347 49002 41902 35884 30464 26023 22122 19050 16343 14696 13234 12458 11190
877 11190 10386 9490 9150 8469 8216 7794 7649 7226 7382 7019 7095 6833 6849 6495 6602 6256 6131 5753 5818 5539 5667 5294 5389 5119
871 5119 5441 5319 5395 5187 5478 5468 5739 5716 6197 6525 7661 9050 11224 12882 13036 11305 10785 10934 12375 12822 11392 8677
866 8677 7132 5999 5796 5396 5578 5330 5426 5061 4887 4529 4608 4215 4244 3956 3966 3745 3893 3614 3745 3421 3539 3339 3696 3456
860 3456 3783 3716 3860 3792 4007 3922 4261 4356 4589 4474 4699 4490 4559 4381 4495 4203 4262 4029 4323 4260 4564 4791 5338 5610 6303 6582
853 6582 7063 7259 7431 7179 7108 6740 6763 6358 6364 5899 5967 5900 5990 5841 5956 5715 5747 5560 5786 5687 5900 5967 6248 6159 6211 6123 6324 6329
847 6329 6746 6906 7249 7613 8420 8886 9488 9844 10272 10260 10112 9722 9595 9227 8793 8234 7862 7362 7290 6992 6996 6886 6910 6896 6869 6730
840 6730 6964 7060 7470 7929 8632 9807 11851 14632 17502 20579 23648 25797 27387 27450 26854 26168 25137 23335 20489 17284
835 17284 14120 11904 10737 10070 9722 9450 9325 9144 8985 8993 8728 8637 8373 8221 7891 7491 7150 6992 6698 6544 6258 6121 6081
830 6081 6051 6025 6086 6016 6250 6334 6591 6825 7222 7024 6821 6470 6363 6213 6332 6311 6581 6551 6995 7029 7285 7178 7305 7298 7548 7398 7434
823 7434 6903 6792 6337 6303 5871 5946 5698 5791 5556 5802 5610 5977 5790 6108 6044 6416 6450 7231 7190 7610 7503 8158 8142 8897 8934 9654
817 9654 9907 10923 11025 11724 11058 11142 10457 10805 10469 11162 10883 11589 11491 12590 12479 13631 13526 14824 15208 16750 16791 18458
811 18458 18725 20489 20942 23535 24681 27625 28544 31269 32267 36334 39504 47137 53564 64305 71451 79118 85183 100966
807 100966 119694 150363 184760 248196 362786 597109 930596 1373526 1624864 1408302 1111222 1062812
804 1062812 1255170 1563443 1539944 1100990 664015 396228 266056 193109 155567 126530 103023 78344
801 78344 64665 54564 51463 45406 39149 30696 26194 21339 19129 15789 14588 12385 12340 10870 10847 9559 9518 8316
797 8316 8344 7358 7533 6797 6950 6108 6201 5458 5786 5171 5218 4617 4976 4449 4702 4212 4355 3879 4078 3779 4093 3688 3705 3319 3539
791 3539 3454 3716 3433 3516 3214 3482 3362 3466 3129 3284 3039 3079 2847 3061 2898 2980 2792 2975 2994 3402 3367 3599 3671 3862 3582 3696
784 3696 3676 4009 3980 4108 3893 3797 3799 3979 4031 4252 4326 4199 4062 4262 4482 4659 4616 4639 4497 4614 4783 5019 5176 5467 5612 6025
778 6025 6379 7015 7320 7732 8153 8790 9374 10012 10549 11379 12391 13588 15163 17119 19925 24304 31759 43191 55233 69535
773 69535 86858 105818 130365 154023 176490 201113 222501 241026 252987 254453 250097 245108 236455 223660 201476
769 201476 173005 144453 117979 97253 78627 60898 44988 31745 23314 18194 14945 12777 11148 9787 8885
766 8885 8205 7412 6787 6325 5942 5814 5804 5818 6083 6601 7282 8316 9375 10646 11976 13454 14995 16257 17284 18167 18702
761 18702 18772 18340 17667 16591 15064 13283 11434 9751 8340 7202 6332 5788 5497 5340 5300 5471 5726 5778 5966 6258 6389 6519
755 6519 6721 6819 6874 6898 6821 6669 6515 6289 6125 5785 5613 5441 5296 5190 5046 5004 5044 5046 5206 5272 5338 5392 5639 6064 6227 6386 6722
749 6722 7051 7329 7722 8329 8916 9692 10748 12073 13789 16141 19658 25333 33252 42744 55633 72700 90304 107524
744 107524 125735 140945 152705 161548 164589 162137 156600 147101 133293 116839 99688 82582 67119 54916 43468
740 43468 32941 25995 23084 22910 23307 22171 20668 20248 21138 22446 23809 25061 25979 26428 26520 26158 25353 24256 22768 21072
736 21072 19565 18492 18045 18566 19930 21595 23301 24913 26082 26698 26759 26374 25481 24084 22295 20107 18051 16572 15843
731 15843 15937 16901 18382 19939 21443 22638 23496 23839 23887 23353 22313 20673 18454 16017 13656 11727 10206 9094 8360 7830
726 7830 7594 7492 7483 7453 7449 7476 7491 7520 7501 7600 7838 7986 8104 8247 8307 8470 8733 9054 9197 9482 9829 10117 10517 11036 11615 12392 13196
719 13196 14116 15199 16420 17510 18441 19263 19902 20411 20637 20577 20321 20003 19533 19049 18524 17979 17510 17410 17382 17545 17679 18218 18629
714 18629 19086 19572 20058 20528 21015 21449 21844 22256 22968 23580 24344 25415 26830 28138 29823 31537 33288 34908 36463 37890
709 37890 39351 40566 42015 43142 44378 45387 46547 47615 49137 50659 52872 55293 58391 61542 65466 69620 74492
705 74492 79701 86077 93180 101973 111685 123452 137103 154440 175558 204094 243601 302034 385975 503076 654392
701 654392 843655 1063780 1313024 1575130 1850468 2120422 2379344 2598695 2764105 2856812 2879770 2829901
698 2829901 2707236 2508578 2239413 1922815 1589328 1274298 998814 779019 616308 509977 451015 429475
695 429475 433042 452654 481139 515970 553985 594716 634388 670291 695901 708529 705079 689515 663424 630006
692 630006 586587 532604 469159 401898 337018 279632 230170 188836 154201 126913 106478 92922 83898 78413
688 78413 74671 72293 70767 70439 70733 71975 73990 77814 83361 91738 104313 124181 153423 194596 246964 313283
684 313283 392179 486522 589774 697560 803705 901693 989424 1056476 1098901 1111355 1097945 1060394 1004580
681 1004580 926371 831177 721075 608439 502364 407911 327446 257806 200439 155348 123272 102061 88661
678 88661 79884 74099 69924 67235 65658 65348 66446 69287 74612 83430 96722 115226 139597 169611 203976 241652
674 241652 279917 317917 353754 385171 410817 429966 441023 444195 438710 426453 409317 390999 374005 361490
671 361490 356426 364053 392888 455241 565785 737764 984815 1304975 1675197 2072202 2449239 2779176 3036491
668 3036491 3215137 3310782 3337419 3278496 3124045 2857239 2489437 2056550 1619212 1227121 911537 675381
665 675381 505521 385171 298881 236950 192127 159663 135455 117114 102760 91411 82240 75579 70384 66858
661 66858 64459 63381 62972 63685 65194 67868 71477 76528 83246 93338 108771 133894 172768 229984 308957 413391
657 413391 536616 673706 813498 941990 1053416 1135991 1185102 1200797 1181586 1129687 1048159 937802 808410
654 808410 666906 527467 400387 293374 210888 150977 110563 84754 68160 56778 48293 41513 35855 30937
651 30937 27107 23704 21120 18772 17054 15587 14615 13840 13278 12701 12407 11936 11731 11459 11327 10856 10561 10123 9821 9376 8927
646 8927 8311 8047 7763 7610 7350 7191 6993 6911 6656 6760 6828 6799 6841 7020 6997 7188 7425 7956 8465 9357 10725 13018 17181 25750
640 25750 41004 53972 54378 49313 45831 46659 50929 55314 54736 51997 52551 55790 58705 59318 60050 62838 65992 66168 61877
635 61877 60093 60391 55731 44154 32791 23819 17686 13538 10978 9071 7879 6943 6508 6128 6117 6101 6177 6167 6283 6201 6347
630 6347 6212 6226 6060 5965 5709 5610 5192 4895 4446 3971 3650 3459 3201 3063 2812 2751 2503 2548 2333 2368 2249 2323 2255 2272 2164 2119 2118
623 2118 2159 1997 1970 1967 2112 2237 2619 3010 3564 4067 4367 4780 5467 5866 6432 6776 7085 7117 7123 7081 6907 6623 6319 5676 5184 4568
617 4568 4023 3434 3074 2553 2190 1866 1727 1532 1537 1512 1535 1409 1469 1316 1417 1606 1688 1605 1679 1625 1759 1749 1865 2055 2345 2497 2752
610 2752 2895 3132 3270 3519 3421 3410 3324 3262 3138 3054 2892 2982 2941 3021 3141 3586 4090 5003 6324 8064 10135 12389 14419 16208
605 16208 17590 18622 19250 19434 19049 18129 16615 14706 12227 9717 7424 5735 4419 3581 3047 2640 2213 2054 1986 1887 1627
599 1627 1551 1483 1427 1408 1492 1506 1544 1559 1648 1637 1667 1668 1514 1471 1465 1516 1633 1721 1861 2198 2673 3238 3892 4606 5426 6123 6760 7243 7532
592 7532 7670 7590 7216 6843 6232 5512 4780 4181 3579 2878 2412 2147 1950 1668 1670 1576 1582 1410 1300 1262 1227 1205 1218 1195 1195 1024 917 1019
585 1019 1035 1014 915 839 923 858 988 1049 1033 1095 1154 1303 1262 1293 1462 1503 1712 1724 1647 1568 1530 1464 1561 1620 1592 1559 1549 1444 1463 1366 1440 1335
578 1335 1416 1445 1435 1314 1436 1575 1835 2094 2530 2687 2833 3302 4121 4831 5550 6081 6340 6071 5387 4404 3614 2963 2528 2346
572 2346 2292 2254 2195 2139 2252 2187 2105 1975 1969 1797 1719 1590 1432 1332 1391 1290 1398 1455 1442 1465 1551 1478 1569 1597 1584 1471 1560 1610 1729 1832
564 1832 1877 1682 1637 1580 1644 1552 1698 1783 1829 1732 1787 1818 2009 1993 1990 1800 1690 1744 1786 1611 1645 1701 1789 1806 1803 1767 1932 2089 2254 2514 2805
557 2805 2846 2962 2967 3098 3088 3176 3200 3357 3360 3558 3697 3802 3866 4020 4281 4334 4542 4600 4587 4906 5243 5496 5745 6065 6450 6868 7251
550 7251 7788 8163 8673 8922 9145 9325 9556 9742 10082 10370 10548 10789 11291 11829 12570 13220 14045 14864 15864 16919 17935 19130
545 19130 20267 21390 22484 23465 24580 25706 26880 27777 28527 29227 29524 29506 29274 28780 28251 27589 27172 27130 27205 27397 27969 28790
539 28790 29844 31319 33444 35864 38415 41174 44204 47523 50940 53999 56874 59159 61073 62514 63196 62999 61921 60408
535 60408 58519 56616 54970 53415 52149 51192 50812 50838 51175 52140 53857 55953 58318 61178 64143 67142 70392 73238 76040
530 76040 78478 80682 83145 85593 88204 90455 92226 93460 93805 93716 93059 92056 91103 90866 92063 94513 98580 104657 111600
526 111600 119656 128074 136151 144228 151840 158704 164726 170149 175564 180592 185226 189864 194816 200082 206140 213859 222433
522 222433 230654 238379 244004 246607 245876 240339 231495 220642 208739 196120 183528 171427 159506 147364 135560
518 135560 124347 113458 102006 90984 81203 72952 66062 60372 55772 52231 49148 46681 44633 42895 40887 39046
514 39046 37653 36548 35317 34455 33479 32383 31481 30406 29213 27776 26300 24794 23282 21795 20208 19029 17991 17236
510 17236 16852 16694 16492 16302 15893 15287 14389 13424 12518 11636 10695 9905 9069 8322 7706 7331 7229 6960 6487 6037 5590 5296 5316
504 5316 5278 5073 4792 4464 4376 4186 3970 3848 3944 3916 4160 4499 5324 6363 7552 8474 8981 8475 7221 5736 4437 3233 2635
498 2635 2319 2235 2174 2304 2248 2309 2333 2249 2246 2252 2128 2175 2081 2105 1897 1898 1676 1451 1216 1164 1180 1259 1278 1260 1221 1245 1110 1226 1288 1314 1240 1228
491 1228 1188 1217 1014 1144 1330 1548 1936 2672 3783 5223 6662 7304 6891 5720 4159 2777 1893 1490 1265 1134 1005 871
485 871 894 873 703 710 709 616 458 411 375 253 293 332 314 295 361 332 397 528 589 570 534 618 716 754 713 828 847 835 808 777 849 813 683
477 683 709 679 637 709 840 852 880 942 1017 949 1039 1108 1227 1225 1159 1209 1177 1203 1203 1298 1423 1517 1486 1448 1512 1523 1414 1471 1508 1491 1560 1482 1434 1152
469 1152 1071 1102 1033 1087 1115 1226 1244 1258 1284 1301 1353 1411 1416 1382 1432 1384 1412 1513 1542 1604 1457 1477 1495 1491 1445 1317 1282 1158 1154 1193 1099 1144 1073 1090
460 1090 1141 1134 1106 1147 1274 1173 1037 1102 1136 1289 1434 1451 1311 1368 1325 1239 1282 1402 1370 1376 1318 1324 1282 1258 1133 1193 1208 1209 1198 1284 1278 1256 1245
452 1245 1249 1166 1146 1188 1289 1318 1503 1543 1660 1796 1915 1801 1861 1804 1626 1553 1536 1331 1204 1218 1225 1073 1148 1254 1340 1363 1336 1380 1412 1423
445 1423 1517 1495 1696 1987 2355 2687 3058 3463 3718 3747 3565 3087 2669 2194 1858 1587 1549 1449 1420 1449 1508 1386 1466 1399 1448 1423 1412
438 1412 1409 1632 1782 2017 2505 3123 3635 4022 4183 4278 4030 3618 3226 2793 2233 1879 1628 1533 1545 1512 1454 1278 1202 1403 1425 1408 1407
432 1407 1394 1259 1306 1499 1696 1786 1918 2103 2288 2472 2384 2141 1877 1499 1281 1217 1178 1089 987 926 993 1036 1111 1124 1058 1035 1043 1014 967
425 967 1011 991 852 872 909 920 951 967 858 863 834 739 656 565 576 387 271 305 388 365 421 398 275 413 503 452 405 470 467 466 397 319 334 383
416 383 334 212 355 330 164 194 144 73 69 157 243 237 194 200 131 143 100 177 218 179 232 235 287 203 286 196 256 317 317 216 173 317 338 264 146
408 146 246 328 425 577 600 503 543 712 859 1198 1699 2110 2520 2752 2955 2906 2484 1997 1425 913 667 475 419 380 549 439
402 439 507 495 471 436 479 647 652 675 710 902 1433 1873 2193 2637 2966 3139 3083 2894 2370 1786 1336 1183 1088 1019 958 1017 1045 1055 1037
394 1037 1183 1208 1209 1194 1331 1295 1421 1603 1706 1773 1872 1848 1866 1851 2074 2006 2022 1952 1942 2144 2385 2364 2447 2572 2636 2826 3057 3115 3321
387 3321 3418 3638 3809 4052 4098 4134 4214 4302 4378 4370 4427 4670 4619 4703 4799 5087 5183 5333 5435 5537 5675 6026 6317 6610 6784 7252 7696 8204
381 8204 8701 9481 10205 11031 11871 12835 13797 15034 16321 18100 20036 22254 24806 27857 31735 37279 45527 57823 72890
376 72890 89360 106392 122916 135533 142929 143772 138743 129353 118178 108463 101610 96532 92588 89168 86520 84338
372 84338 82889 81922 82223 83110 85057 87674 91889 97854 108156 126413 162242 209526 245990 293210 333619 348671
368 348671 348815 319962 275526 216635 156918 118461 93857 79523 70056 64374 60577 58189 56059 54174 52451 51563
364 51563 51070 51763 53248 56370 61360 68758 79892 95328 111715 127763 142193 151271 153016 146057 131090 110359
360 110359 86420 64509 47774 36842 30078 26258 24009 22715 21880 21055 19978 18691 17085 15324 13659 12169 11011
356 11011 10050 9308 8736 8413 8036 7520 6922 6330 5628 5087 4761 4374 4013 3779 3531 3375 3372 3354 3249 3130 3221 3377 3476 3769 4066
350 4066 4228 4416 4414 4387 4337 4184 4056 3727 3280 2841 2466 2068 1879 1639 1528 1348 1217 1167 1095 919 771 729 698 703 635 554 516 414
343 414 415 367 298 343 379 373 271 143 218 259 340 305 283 231 320 227 288 303 357 208 53 10 197 164 10 18 88 85 33 95 91 -17 -155 -86
335 -86 -101 -34 -59 -49 6 -64 -117 -34 -82 -69 -144 -254 -243 -251 -320 -311 -277 -292 -222 -227 -267 -202 -151 -208 -169 -201 -174 -130 -61 -120 -247 -249 -326 -296 -208 -243 -221
326 -221 -186 -204 -226 -237 -196 -196 -189 -295 -273 -143 -167 -115 -115 -133 -236 -290 -259 -288 -230 -116 -134 -274 -248 -251 -283 -254 -309 -319 -248 -238 -191 -114 -90 -127 -198
317 -198 -166 -105 -118 -223 -203 -154 -149 -93 -75 -31 -98 -136 -99 -78 23 70 104 98 290 488 507 567 543 598 513 454 314 225 202 248 185 161 157 109
309 109 84 161 131 125 30 50 -21 132 256 361 688 924 1140 1469 1687 1762 1613 1439 1096 644 310 222 123 98 87 148 95 80 35
302 35 -116 -117 -144 -211 -98 -81 -7 109 110 278 541 685 675 678 653 570 628 550 359 74 23 18 -6 -27 -105 -116 -127 -146 -259 -302 -216 -131 -274
294 -274 -263 -86 -251 -328 -338 -343 -322 -272 -279 -228 -272 -339 -344 -240 -263 -417 -415 -248 -129 -125 -183 -242 -225 -230 -356 -406 -290 -234 -311 -318 -381 -350 -316 -423
285 -423 -330 -244 -290 -374 -273 -274 -280 -235 -164 -302 -269 -134 -156 -334 -298 -364 -386 -334 -259 -243 -295 -296 -188 -263 -345 -251 -309 -273 -231 -258 -269 -259 -392 -455
277 -455 -360 -140 -152 -238 -212 -322 -347 -444 -335 -202 -220 -324 -251 -175 -259 -311 -342 -247 -236 -331 -343 -342 -204 -83 -230 -229 -218 -185 -259 -401 -338 -281
269 -281 -251 -227 -202 -380 -362 -349 -311 -267 -245 -253 -306 -309 -393 -244 -278 -297 -258 -192 -304 -342 -352 -375 -325 -367 -296 -189 -356 -433 -515 -364 -191 -168 -209
261 -209 -281 -302 -466 -375 -248 -318 -310 -189 -324 -292 -309 -183 -190 -174 -88 -43 -158 -162 -187 -283 -159 -21 -98 -87 -175 -372 -360 -263 -257 -161 -140 -141 -93
253 -93 -269 -256 -262 -274 -271 -379 -355 -314 -259 -373 -377 -293 -177 -221 -196 -199 -256 -285 -216 -263 -322 -366 -399 -201 -248 -314 -290 -316 -378 -378 -305 -380 -333 -269 -262 -275
244 -275 -242 -333 -301 -203 -173 -164 -41 -81 -234 -308 -254 -232 -131 -129 -203 -265 -293 -232 -213 -155 -125 -131 -189 -143 -180 -310 -268 -158 -121 -178 -269 -283 -241 -308
236 -308 -301 -209 -225 -264 -168 -213 -290 -324 -332 -324 -271 -182 -151 -209 -111 -103 -215 -212 -147 -131 -228 -327 -345 -302 -184 -135 -127 -131 -183 -258 -315 -252 -138 -212 -286 -244 -249 -317
227 -317 -251 -269 -256 -221 -206 -133 -247 -269 -342 -298 -156 -154 -201 -226 -262 -335 -295 -241 -286 -185 -269 -248 -225 -207 -220 -205 -136 -40 -116 -291 -343 -371 -357 -286
218 -286 -313 -318 -272 -281 -234 -374 -332 -344 -304 -298 -253 -257 -126 -115 -158 -229 -271 -305 -367 -318 -315 -246 -161 -254 -350 -353 -383 -284 -184 -169 -242 -276 -271 -304 -325 -279 -390
209 -390 -396 -302 -185 -129 -208 -144 -78 -258 -259 -301 -318 -250 -295 -295 -284 -255 -415 -326 -165 -183 -187 -139 -178 -265 -265 -144 -148 -163 -236 -73 -159 -275 -326 -256 -163
201 -163 -250 -232 -187 -255 -332 -387 -272 -165 -232 -255 -301 -154 -100 -204 -193 -209 -295 -368 -341 -314 -272 -288 -300 -256 -283 -243 -263 -216 -217 -145 -175 -177 -206 -205 -147
192 -147 -92 -169 -80 -96 -168 -183 -203 -267 -128 -205 -300 -369 -299 -309 -263 -258 -289 -144 -142 -174 -182 -300 -197 -221 -242 -210 -165 -353 -390 -345 -262 -348 -349 -319 -248
184 -248 -267 -205 -186 -118 -160 -216 -168 -182 -350 -416 -340 -343 -331 -342 -281 -212 -172 -185 -292 -249 -159 -212 -181 -179 -172 -195 -304 -304 -209 -152 -191 -222 -219 -183 -152 -196
175 -196 -331 -335 -234 -255 -194 -186 -146 -170 -269 -131 -138 -153 -144 -154 -90 -191 -197 -252 -376 -434 -319 -212 -228 -162 -67 -158 -171 -157 -154 -263 -381 -333 -343 -383
167 -383 -257 -263 -318 -214 -187 -228 -357 -312 -233 -218 -290 -282 -251 -265 -319 -371 -387 -315 -219 -196 -322 -297 -330 -229 -179 -114 -71 -105 -192 -261 -241 -169 -261 -233
158 -233 -342 -268 -288 -362 -242 -243 -336 -272 -158 -145 -221 -170 -182 -150 -86 -43 -235 -215 -244 -341 -263 -199 -238 -233 -221 -326 -397 -333 -314 -302 -170 -230 -322
150 -322 -357 -237 -163 -242 -244 -218 -319 -303 -185 -141 -132 -171 -213 -249 -336 -295 -228 -187 -209 -186 -199 -245 -192 -110 -189 -155 -229 -168 -221 -201 -164 -204 -224 -201 -270
142 -270 -292 -314 -309 -262 -277 -231 -132 -140 -126 -178 -112 -265 -130 -145 -167 -156 -162 -154 -142 -201 -267 -228 -252 -416 -393 -353 -419 -389 -270 -290 -251 -124 -164 -201 -146
133 -146 -149 -205 -105 -4 -60 -216 -341 -321 -315 -237 -230 -209 -231 -252 -355 -292 -253 -248 -234 -168 -252 -276 -286 -190 -188 -251 -255 -218 -251 -165 -234 -340 -388 -325 -222
124 -222 -162 -124 -222 -346 -331 -176 -164 -134 -189 -248 -228 -316 -255 -269 -254 -223 -219 -133 -118 -120 -119 -176 -247 -157 -211 -309 -290 -272 -239 -266 -215 -226 -232 -270 -253 -259 -129
115 -129 -208 -285 -255 -222 -161 -74 -140 -224 -301 -349 -250 -220 -257 -246 -323 -385 -398 -348 -256 -162 -175 -218 -195 -238 -211 -266 -388 -226 -151 -186 -194 -214 -254 -272 -197
107 -197 -179 -296 -315 -269 -225 -142 -159 -82 -136 -111 -102 -269 -162 -152 -159 -170 -235 -262 -374 -301 -258 -145 -111 -180 -163 -256 -176 -186 -119 -214 -187 -150 -144 -23
99 -23 -193 -253 -135 -113 -246 -323 -282 -328 -297 -305 -248 -183 -292 -332 -339 -203 -138 -157 -174 -163 -132 -126 -236 -278 -345 -289 -285 -306 -184 -81 -133 -180 -92 -37
90 -37 -24 14 -133 -147 -98 -130 -186 -231 -361 -329 -242 -286 -151 -215 -318 -333 -248 -122 -208 -273 -228 -259 -267 -244 -128 -134 -101 -107 -19 -189 -210 -125 -187 -202
82 -202 -308 -220 -209 -201 -171 -103 -203 -197 -65 -72 -158 -188 -226 -188 -225 -228 -343 -249 -193 -115 -117 -145 -240 -331 -302 -331 -308 -287 -263 -188 -213 -186 -292 -296 -269 -71
73 -71 -56 -77 -219 -226 -266 -213 -130 -172 -183 -101 -211 -216 -167 -160 -207 -230 -230 -195 -174 -204 -250 -163 -142 -174 -211 -129 -153 -145 -168 -104 -37 -88 -221 -273 -202 -127 -172
64 -172 -223 -252 -206 -145 -202 -273 -208 -274 -286 -258 -216 -206 -168 -88 -113 -190 -62 -198 -203 -96 -179 -220 -152 -169 -203 -255 -335 -310 -406 -364 -305 -229 -127 -162
56 -162 -145 -107 -179 -154 -113 -296 -262 -186 -178 -129 -173 -122 -94 -98 -38 -156 -135 -73 -184 -188 -191 -229 -297 -302 -287 -232 -286 -106 -77 -148 -115 -7 14 -20 -156
47 -156 -61 24 46 67 201 370 339 393 441 405 366 314 219 77 -85 -11 -112 -158 -168 -141 -88 -198 -281 -156 -37 -108 -151 -210 -269 -204 -142 -162
39 -162 -213 -198 -135 -22 -11 -105 -37 -147 -222 -251 -166 -161 -266 -292 -299 -166 -144 -220 -289 -205 -159 -166 -136 -23 -103 -140 -80 -234 -160 -185 -192 -157 -134 -138 -197
31 -197 -192 -216 -169 -147 -113 -171 -179 -61 -214 -45 -76 -299 -211 -152 -171 -229 -215 -261 -191 -302 -345 -223 -159 -88 -107 -26 -48 -140 -116 -124 -276 -243 -101
23 -101 -201 -249 -218 -188 -127 -92 -103 -172 -210 -257 -236 -116 -96 -54 -110 -253 -113 -109 -139 -168 -181 -138 -229 -282 -145 -111 -207 -255 -80 -48 -81 -119 -111 -54
14 -54 -62 -112 -122 -181 -139 -253 -174 -134 -159 -124 -85 -206 -231 -266 -185 -135 -118 -258 -457 -340 -153 -161 -20 -12 -44 -38 -110 -125 -105 -43 -153 -228 -168 -228
6 -228 -199 -154 -171 -211 -258 -318 -201 -159 -209 -235 -157 -185 -73 -30 -116 -177 -143 -186 -143 -146 -78 -128 -207 -216 -199 -136 -233 -207 -175 -156 -237 -271 -167 -126 -110 -120
-3 -120 -142 -215 -253 -175 -122 -206 -165 -105 -159 -58 -19 -169 -315 -237 -245 -243 -260 -195 -154 -69 -131 -215 -152 -246 -127 -40 -1 -101 -233 -189 -175 -58 -77
-11 -77 -274 -185 -124 -211 -194 -168 -124 -100 -92 -128 -193 -190 -154 -175 -180 -135 -243 -143 -93 -151 -239 -162 -79 -68 -149 -234 -216 -88 -60 -83 -96 -126 8 -43 -80
-19 -80 19 19 -149 -153 -194 -142 -242 -256 -182 -158 -134 -153 -131 -153 -142 -81 -86 -108 -132 -134 -108 -214 -320 -169 -67 -103 -110 -76 -45 34 -60 -168 -241 -294 -350
-28 -350 -265 -130 -175 -257 -292 -347 -279 -253 -252 -125 -151 -140 -103 -101 -148 -147 -152 31 39 -178 -258 -186 -207 -201 -130 -142 -209 -113 -103 -215 -257 -215 -206 -96 -61 -166
-37 -166 -96 -106 -165 -188 -244 -175 -185 -280 -256 -210 -162 -212 -201 -198 -175 -168 -115 -92 96 101 -84 -103 -87 -100 -119 -129 -151 -282 -275 -204 -319 -287 -216 -209 -128 -250
-45 -250 -269 -258 -176 -131 -229 -234 -115 -184 -276 -136 -262 -265 -115 -123 -84 -126 -92 -125 -37 -22 27 -35 -127 -223 -249 -163 -41 -116 -127 -210 -258 -215 -197 -176
-54 -176 -152 -199 -277 -142 -98 -97 -55 -163 -167 -145 -153 -160 -231 -120 -42 -157 -74 -165 -323 -252 -83 -113 -57 -73 -125 -156 -85 -84 -167 -235 -193 -98 -29 -86 -41
-62 -41 -78 -124 -138 -216 -153 -229 -203 -201 -197 -138 -92 -42 -35 -16 -107 -127 -122 -94 -220 -184 -109 -58 22 -49 -141 -83 -76 -95 -50 -95 -84 -113 -88 -139 -158 -138 -64 -138
-72 -138 -168 -42 -164 -214 -154 -202 -221 -176 -144 -222 -267 -225 -138 -189 -247 10 -50 -70 -15 78 -8 -50 -61 -112 -120 -152 -151 -175 -195 -31 -51 -154 -171 -127
-80 -127 -45 -58 -74 -67 -63 -116 -182 -166 -247 -185 -255 -254 -146 -126 -247 -223 -200 -298 -225 -194 -150 -180 -97 -139 -138 -121 -104 -176 -234 -161 -221 -126 -156 -222 -253 -286
-89 -286 -217 -200 -188 -40 -153 -237 -275 -261 -242 -142 -82 -51 -78 -114 -138 -81 -34 -7 -107 -137 -97 -54 -161 -244 -137 -180 -175 -282 -138 -128 -247
-96 -247 -196 -233 -177 -165 -143 -102 -114 -98 -184 -3 -81 -154 -230 -193 -242 -142 -206 -226 -183 -155 -281 -278 -229 -122 -119 -61 -71 -2 -122 -159 -77 -163 -204 -218
-105 -218 -301 -273 -147 -151 -127 -147 -251 -192 -68 -108 -64 5 -19 -82 -283 -195 -85 -83 -99 -128 -112 -122 -180 -158 -273 -235 -147 -44 -123 -133 -166 -190
-112 -190 -139 -118 -70 -161 -250 -179 -122 -140 -171 -63 -133 -157 -248 -183 -56 -46 10 18 -96 -171 -188 -72 -172 -143 -87 -41 -6 -68 -43 -208 -234 -42
-120 -42 -137 -79 -56 -110 -181 -91 -34 -178 -275 -106 -75 -116 -24 -68 -13 -113 -147 -119 -159 -108 -139 -152 -60 0 -37 -27 -40 -51 -153 -86 -15 -21 -139
-128 -139 -90 -68 -160 -206 -168 -129 -30 -68 -172 -69 -108 -42 -3 -67 -138 -47 -81 -124 -156 -285 -206 -287 -294 -229 -255 -180 -145 -205 -92 -227 -242 -235 -226 -213
-137 -213 -248 -246 -278 -174 -126 -106 -72 -106 -207 -213 -151 -206 -260 -301 -290 -201 -111 -65 -104 -21 -133 -160 -119 -143 -146 -126 -81 -128 -101 -39 11 -144 -207 -128
-145 -128 -213 -113 -139 -198 -179 -93 -6 158 72 -91 -213 -225 -205 -197 -125 -95 -25 -36 -63 -81 -97 -93 -85 46 60 -35 -94 -120 -158 -142 -216 -175 -137 -51
-153 -51 -105 -185 -107 -99 -141 -67 -76 -19 74 -12 -128 -154 -38 -75 -108 -50 0 -17 -31 59 7 -74 -170 -185 -168 -161 -134 -80 -253 -123 10 69 54 31
-162 31 -3 -56 -125 -78 -93 -143 -156 -84 -110 -167 -128 -84 -143 -148 -169 -124 -233 -197 -77 -135 -229 -107 -137 -34 -39 34 52 -82 -113 -188 -286 -282 -174 -114
-170 -114 -155 -159 -64 78 -11 21 -37 -136 -181 -159 -129 -119 -211 -318 -280 -190 -88 -141 -175 -137 40 45 23 140 27 26 -16 -19 -71 -178 -84 -85 -90 35
-178 35 -51 -71 -91 -52 -113 -181 -148 -91 -219 -262 -200 -145 -77 -119 -73 -103 -65 -166 -248 -107 88 81 -47 -85 -66 -82 -122 -117 -127 -148 -1 8 -69 -106
-187 -106 -109 7 20 -48 -160 -182 -181 -193 -154 -77 -62 -124 -154 -96 -96 -166 -178 -165 -74 -23 -105 -121 -39 -24 -94 -126 -87 -35 -118 -131 -106 0 13 -52 -108
-195 -108 -98 -169 -126 -28 9 80 12 45 -2 8 87 34 -28 -93 -9 75 -51 -127 -106 -21 -59 -20 125 62 131 147 34 -69 -73 -187 -203 -71
-203 -71 34 -23 -15 35 37 -68 -91 -102 -73 10 -85 -154 51 23 -4 -20 -30 -13 -46 -77 -240 -161 -184 -150 -193 -93 84 35 11 59 28 9 30
-211 30 -29 -158 -157 -121 -60 -31 97 37 -26 -95 -59 -29 94 -82 -91 -58 0 16 -17 2 38 90 0 -97 -116 -157 -104 -104 -194 -135 -90 -19 44 -64
-219 -64 17 64 39 -70 -55 -116 -177 -259 -170 -206 -152 -194 -164 -74 -168 -135 -58 -109 21 -16 -9 20 -39 -76 -10 -50 -70 -58 4 -17 -12 -103 -92 -171 -278
-228 -278 -176 -7 -48 -136 -155 -191 -197 -78 -47 27 -69 -129 -126 -100 -83 7 81 -35 -30 -66 -148 -117 -231 -317 -204 -146 -3 -54 -130 -47 -53 -134 -98
-236 -98 -145 -54 -110 -115 -45 45 -27 -160 -74 -43 36 51 -15 -62 -90 -148 -165 -110 -86 -17 -48 -108 -57 -80 15 61 99 74 -33 -54 -49 -18 -43 -77 -63
-245 -63 -53 -118 -140 15 -26 -56 -122 -139 33 123 15 -36 9 32 -47 -179 -162 -117 -208 -259 -181 -142 -103 12 -50 -129 -194 -142 -27 -143 -188 -124
-252 -124 -8 80 -34 -48 -142 -74 -7 -88 -130 -174 -153 -144 -133 -109 -47 -68 -134 -176 -113 -131 -75 -152 -177 3 -6 -158 -97 -51 -58 13 -10 -5 -63 -35 8
-261 8 -71 -61 -26 -13 -80 -133 -126 -143 -100 15 -21 -128 -105 -46 -25 -103 -92 -57 -72 -92 -157 -182 -120 -60 -51 -35 -142 -48 -47 -54 -141 -17 1 47 69 31
-270 31 -45 -49 -57 -91 -152 -134 -93 -133 -240 -149 -56 -76 -59 -124 -97 -74 31 52 -20 0 -154 -53 -37 -70 -29 -23 54 106 73 12 -102 -136 -133 -72 -37
-278 -37 18 44 17 -73 -170 -178 -67 -6 -23 -50 -73 -164 -209 -262 -194 -179 -143 -159 -146 -93 4 -83 -165 -152 -149 -100 -157 -160 -150 -191 -240 -249 -194 -3 45 -102
-287 -102 -59 -183 -228 -66 -18 -62 -99 -61 -124 -183 -23 -45 -153 -295 -232 -134 -67 -35 -101 -44 -59 -110 -155 -115 -45 -74 -33 115 -20 -56 -87
-295 -87 -38 -62 -80 -95 -74 -71 -45 -142 -251 -228 -141 -144 -82 -61 -64 -114 -1 121 35 -80 -178 -97 -26 -79 -36 -4 -138 -135 -82 -16 -46 -116 -79 29
-303 29 -25 31 9 -40 19 -6 12 -34 -95 25 77 33 -68 -8 -82 66 74 28 -37 -53 46 45 69 32 -25 28 -28 -76 -86 -88 -90 -69 -97 -89 -97 -153 -194
-312 -194 -56 98 120 -59 -185 -80 -63 -166 -177 -51 -16 -54 -159 -185 -85 46 11 -94 -81 -26 -19 -34 -14 -37 -93 -103 -13 6 -100
-319 -100 -122 45 31 71 -65 -156 -174 -59 36 -10 -18 -63 -176 -81 -82 -95 -29 37 -27 -91 -165 -257 -138 -40 -58 -158 -142 -70 -139 -231 -123 -95
-327 -95 -171 -25 -67 -44 19 67 6 -26 -57 -45 -58 -61 -42 -141 -21 77 94 2 -36 -142 -112 -109 -34 -25 -68 -127 -95 -7 -60 -140 -12 56 -61 -45
-335 -45 0 -32 -10 0 95 78 72 121 -14 -13 0 -12 20 -7 49 -23 -73 -50 -26 -34 -20 -63 -26 -105 -87 -76 -47 -47 -67 -200 -216 -209 -45 -13 7 -89
-344 -89 -98 -130 -137 -81 30 13 7 -32 28 -50 -68 -28 -156 -166 -59 -45 -50 -66 -15 -127 -127 -93 10 -40 28 -73 10 16 -83 -81 -18 -11 -50 -101 -92 -10 14
-353 14 -87 -10 40 -43 -72 -99 -122 -62 -16 -6 -53 61 -38 -64 0 53 71 74 -11 58 44 15 25 21 -23 -96 -64 -63 -101 -27 46 33 8 -8 -108
-362 -108 -176 -205 -101 -90 -109 -7 -73 23 8 -35 -110 -83 -3 8 -46 -141 -137 -54 -41 -42 -94 -28 -93 -115 -54 28 -110 -119 -166 -64 -38 -34 4 -38 6
-370 6 19 22 32 -49 -53 -25 -91 -161 -139 -48 -1 -17 -95 -162 -16 -127 -136 -46 -39 -107 -148 8 11 4 -99 -52 -65 -50 22 39 127 102 60 68 92 24 19 51
-380 51 -48 -61 -9 23 -35 6 -17 -84 -109 -45 95 87 34 -44 -42 0 25 53 100 16 72 115 -5 -27 -71 2 -35 -80 -60 -39 96 73 -54 -91
-388 -91 -71 -188 -107 -67 -170 -111 -47 -51 -86 22 -21 -123 -100 30 -54 -116 59 82 -8 17 46 0 24 10 40 64 74 27 -2 -23 2 73 111
-396 111 52 99 51 71 -110 -28 -66 -102 -52 62 8 89 97 71 -30 24 87 139 82 78 -58 -22 8 -68 -48 -87 -126 -37 -74 -43 0 -39 -108 -141
-404 -141 -194 -212 -72 -109 -62 -72 19 10 -7 -88 -96 -98 -41 13 13 6 -96 -66 -48 79 71 -110 -96 -91 -56 -31 -36 -11 -39 -9 152 106 -60 8 47 117
-413 117 -2 -150 -86 29 32 -2 -40 9 -10 -100 17 80 -57 74 38 39 39 108 150 -66 -141 -87 -131 -136 56 -30 -27 40 -86 -72 -58 13 171
-421 171 72 -50 -57 0 4 44 92 -62 -99 -62 -21 14 9 17 57 -12 -52 -104 -106 60 -20 -9 146 123 114 -27 -54 92 159 90 76 -36 -98 -118
-429 -118 -129 -7 17 -48 -93 -9 46 122 33 77 93 39 123 56 -47 -97 50 115 171 97 0 3 46 67 105 68 20 0 4 -50 -70 -125 -76 -3
-438 -3 100 14 -27 -54 32 103 88 -9 19 9 47 30 29 19 22 74 131 -15 16 134 82 31 -131 -82 -24 -28 -126 43 -1 -103 -58 -93 -55 66
-446 66 23 29 -9 -6 -49 -125 -81 -16 -12 -16 0 51 11 34 71 -55 -48 -3 -37 -8 -73 -75 -54 -33 -62 0 67 158 126 99 119 166 61 61 -57 3 11 40
-455 40 97 84 -36 -42 -4 70 60 -5 11 18 -67 53 22 -42 37 75 -10 15 1 36 43 5 -73 -80 42 115 108 131 121 59 49 -28 -90 -48 -67 -104
-464 -104 -33 -72 20 107 33 37 -11 4 -48 -53 -18 70 -10 -89 -79 -66 -46 -11 -58 -71 -44 -65 30 63 54 -15 -68 -89 -105 51 101 77 89 49 1 -18
-473 -18 -18 141 109 41 11 87 160 57 22 58 37 62 19 -27 -35 9 -133 -143 -86 17 -9 100 114 57 -2 -11 43 -52 -105 99 148 117 -23
-481 -23 -19 61 70 119 105 15 10 28 10 -37 30 -5 -42 -62 -36 11 45 15 29 60 68 69 -43 -90 -50 12 214 118 44 31 -14 -79 -71 -41 60 38 132
-490 132 171 91 141 79 73 50 121 104 66 30 135 40 -19 107 104 22 26 -35 90 89 -119 -184 -107 -28 69 45 76 -16 -46 64 87 69 3 9 60
-499 60 0 19 31 -28 29 73 -39 50 195 147 5 7 -35 49 8 60 46 166 130 15 165 95 50 46 114 133 73 -28 -23 100 40 -26 -34
-507 -34 -5 -14 -3 -3 27 11 131 89 14 84 84 81 114 74 78 16 15 1 32 31 -13 -39 93 23 24 55 40 -88 -95 -29 -14 -13 29 -43 -34 42 41 35 -8 -21
-516 -21 -56 -93 -39 -82 -105 -124 -65 18 46 -44 -10 -133 -19 114 140 78 2 -125 -43 -5 -53 66 35 8 62 19 56 74 -50 -76 -23 5
-524 5 13 10 -28 -29 -22 -13 29 143 60 18 71 26 0 25 21 -16 30 -33 -29 24 15 18 146 70 13 6 -48 -23 25 91 27 24 -68 -213 -198 -100 -8 -7 -15 -10 -5 40
-535 40 51 34 90 110 57 43 59 -54 -16 -84 -53 40 47 41 -36 11 -2 17 144 142 35 -5 61 87 -107 -123 -73 -13 41 32 45 -6 75 9 -32
-543 -32 37 -50 -44 82 179 127 115 40 81 171 97 90 114 18 33 80 -99 -98 -58 -13 36 129 105 48 22 83 -2 36 90 83 -46 -24 -17 -21 34 40 33 78
-552 78 58 74 141 70 -31 -21 24 65 54 27 6 -48 22 127 67 16 60 -17 -30 -61 34 108 69 64 13 -61 43 28 -9 29 69 119 80 108
-561 108 33 -33 14 57 56 26 10 82 214 122 108 -7 22 88 115 169 4 -91 -66 1 37 -32 16 -12 43 165 197 140 131 36 -20 93 143
-569 143 207 231 55 65 168 263 322 190 116 81 -53 28 155 123 -4 17 69 83 25 -24 19 17 65 78 2 37 126 100 111 62 1 104
-577 104 92 -7 -9 53 -89 25 51 -31 62 197 60 51 44 -38 -25 83 63 15 -35 -12 -62 13 99 211 73 -42 107 3 -81 -70 62
-584 62 95 32 111 75 86 114 141 18 -39 100 225 45 28 8 83 2 -3 36 120 60 79 91 45 70 54 58 74 108 170 159 197 207 128 30
-592 30 6 37 122 70 21 9 92 71 146 180 124 67 93 128 29 69 79 83 158 68 -12 -7 18 114 83 -101 -3 63 102 28 29 64 80 43 137 66
-601 66 7 -39 0 43 68 -14 -72 -74 33 135 158 36 74 175 77 76 10 42 -10 -54 20 100 31 135 135 110 49 48 59 -27 -13 20 89 -27
-610 -27 -3 12 -34 161 216 128 138 22 46 123 100 149 183 216 19 -57 -65 -5 9 58 108 62 -39 -28 -6 28 37 112 198 231 217 120 0 66
-618 66 22 -49 -49 81 -53 -62 72 147 83 93 69 -62 -162 -169 -57 26 14 -15 -20 119 180 182 116 31 -73 -36 0 65 36 92 -27 138 318
-626 318 169 -33 0 39 101 126 144 197 150 81 118 25 -47 -57 70 126 41 -6 -59 -131 -107 -150 -69 58 27 -162 -201 -71 16 111 135 128
-634 128 24 -32 14 -5 0 12 126 66 0 98 160 88 172 183 61 38 115 125 102 181 177 163 164 88 160 177 131 85 52 83 66 88 87 -22 -29
-642 -29 61 102 84 49 37 100 30 1 42 53 -50 -18 18 122 104 3 102 93 -2 143 191 157 52 -25 12 27 93 119 66 96 -80 -48 112
-650 112 170 13 27 62 88 190 208 114 176 244 171 20 30 76 57 24 124 91 50 145 191 144 157 228 219 84 41 39 66 159 121 164 192
-659 192 207 102 106 60 40 81 103 67 -18 99 16 20 151 145 196 78 54 -22 25 44 -24 -23 78 169 131 97 97 137 69 13 79 122 78 81 113
-667 113 38 -45 -128 -107 0 104 150 69 40 -8 -26 -54 71 152 40 81 29 -69 -12 54 98 142 41 22 12 80 94 132 131 148 88 68 70
-675 70 52 170 311 198 68 101 122 0 99 96 57 173 174 21 68 50 112 74 53 62 62 14 -12 0 8 58 99 118 93 137 132 137 120 74 67 16
-684 16 30 51 -13 40 26 97 26 73 151 47 75 77 183 179 132 183 342 146 39 -63 -46 5 115 45 52 81 152 126 107 36 123 112 -115
-692 -115 -81 -21 21 192 186 45 34 33 135 130 126 150 128 7 52 32 -33 -35 -46 -53 -110 71 165 169 178 108 95 29 80 99 131 180 113 103 98 223
-701 223 114 86 98 165 77 52 138 112 71 102 107 148 125 106 136 148 15 138 165 2 2 31 129 148 92 -13 3 -50 34 52 52 172 262
-709 262 284 213 282 165 137 61 -10 -29 21 -62 59 160 178 98 119 139 193 199 172 150 130 55 87 62 108 61 -16 38 156 164 24 73 168
-717 168 125 191 193 136 115 121 80 62 63 115 96 -48 -25 -58 -4 -4 -9 -4 29 95 127 52 -67 -89 -1 74 47 -8 14 -86 -119 -99 -50 -66 29 67
-726 67 47 18 38 73 71 68 207 274 111 181 105 54 73 49 9 0 63 65 125 3 -52 50 198 -7 -60 -110 -143 -83 -7 85 127 152 72 62
-734 62 63 96 -3 -10 3 15 137 195 164 117 166 124 99 80 160 44 -87 -63 55 45 43 107 117 81 35 20 88 75 52 84 96 18 42 112 97
-743 97 29 17 109 183 44 28 6 151 163 159 70 158 99 24 13 62 76 -10 35 115 77 107 0 -19 8 77 88 57 27 33 36 132 100 0 79
-751 79 164 156 30 135 168 58 -1 53 -7 -40 -1 -8 39 60 16 31 108 166 252 178 64 45 218 80 3 18 2 76 163 117 198 192 145 184
-760 184 138 53 127 203 105 -42 50 122 129 4 79 97 84 111 93 84 125 80 97 154 60 28 60 68 87 107 24 126 126 117 105 135 59 125 147 66
-768 66 94 19 -85 -52 94 18 -85 15 125 147 71 -39 -106 24 142 228 102 65 71 25 43 37 113 192 71 49 120 63 5 77 106
-776 106 87 201 212 139 135 22 -21 -25 -14 4 2 5 80 74 97 178 126 93 183 178 61 -9 111 200 91 93 70 99 18 -30 -19 111 124 78 78 90
-785 90 32 -6 54 213 115 16 38 153 156 148 156 217 202 140 216 194 197 112 48 63 94 99 44 67 26 -51 -95 46 147 76 89 114 102 84 143 135
-794 135 87 70 73 -18 -56 86 113 77 5 51 36 90 88 129 208 203 171 187 170 211 262 153 93 87 64 134 95 121 119 101 1 -38 -46 -81 11 45
-802 45 -10 0 102 105 78 117 94 137 254 137 153 144 130 127 135 109 74 -52 40 58 115 9 -8 100 42 -65 -26 15 46 -29 -5 31 150
-810 150 110 144 29 35 -51 26 -12 -75 -114 -75 28 158 76 -14 -40 31 -12 22 -66 2 69 134 96 -17 40 116 68 95 116 126 111 142 166
-818 166 248 220 87 58 88 47 25 -54 14 52 189 162 150 71 76 92 16 48 125 208 199 90 35 8 7 80 195 208 187 201 141 198 161 87
-827 87 154 50 31 51 137 121 116 134 89 166 186 103 175 64 120 237 239 93 44 170 236 181 200 288 316 274 191 267 192 130 109 128 60 6
-835 6 141 182 60 67 43 117 103 154 241 182 11 1 53 -14 28 122 137 160 149 146 144 132 19 32 29 46 -12 86 115 131 130 171 225 125 16
-844 16 20 66 44 23 -3 -6 9 -44 16 86 120 171 114 129 165 223 69 -7 -1 57 186 100 26 71 155 155 192 249 287 230 133 74 116 107 78 59 70
-853 70 144 185 116 234 182 105 224 118 49 112 67 144 73 -19 134 167 73 214 141 38 146 121 79 50 117 18 -72 89 211 185 55
-860 55 121 166 120 -35 -43 -28 92 194 249 212 28 74 -7 -48 242 149 122 117 161 97 138 227 255 230 245 172 212 340 145 121 155 93 219
-868 219 105 96 58 94 74 100 87 60 26 40 19 38 38 157 9 59 256 274 142 154 130 -17 62 210 187 105 85 201 144 89 102 155
-876 155 233 237 239 117 103 153 131 219 150 100 23 93 199 168 124 135 58 53 58 39 78 47 -21 64 87 172 184 163 175 186 256 252 122 75 59 37
-885 37 27 69 144 220 281 263 227 258 160 41 5 46 53 159 99 146 346 369 301 187 129 50 -6 14 66 -15 48 177 195 23 110 128 5
-893 5 32 -2 0 25 75 249 174 258 80 2 21 -13 124 82 -41 53 188 257 218 198 61 -82 25 88 115 177 287 131 0 151
-900 151 141 137 108 54 43 169 164 76 23 1 41 13 -47 72 75 200 174 178 87 139 125 43 71 86 49 150 149 70 195 182 129 17 10 60 72
-909 72 165 195 220 188 63 -21 17 105 253 241 247 223 396 323 187 187 63 22 76 2 91 169 72 80 54 10 17 -4 84 182 229 73 66 97 57
-917 57 126 191 155 136 126 163 181 228 301 277 189 180 138 163 214 107 92 97 -40 -37 115 125 156 83 52 55 108 107 108 75 56 200 153 229 247 189
-926 189 39 147 116 114 141 144 164 258 164 96 51 9 37 175 260 244 208 133 131 146 64 103 224 265 200 190 144 159 183 166 205 179 96 161
-935 161 63 22 93 216 190 188 177 122 111 41 94 106 73 -9 -36 -59 -36 -94 64 121 262 248 211 156 47 5 20 -2 154 198 169 81 1
-943 1 54 -63 -33 -3 81 174 98 250 217 53 0 56 188 152 75 38 52 109 83 104 98 38 126 126 105 154 162 204 114 102 39 79 127 136 144 121
-951 121 96 88 46 60 43 -51 36 44 -11 31 38 41 169 295 253 180 140 120 66 38 21 -84 -7 140 56 7 83 40 124 195 134 94 110 9
-960 9 30 89 146 166 78 26 30 120 160 122 164 296 169 71 124 116 52 39 52 157 165 -22 -42 21 78 128 152 72 88 156 213 192 144 95 52
-968 52 7 -32 -85 0 33 10 11 41 51 58 33 22 51 37 92 102 25 150 198 194 152 95 148 114 159 98 186 112 18 11 -59 -34 -16 47 75 134 60
-977 60 21 113 0 -5 54 50 56 203 289 226 117 28 174 203 134 127 92 39 134 112 161 242 176 197 187 245 286 154 161 241 238 102 94 117 90 84
-986 84 35 105 -4 79 198 300 194 275 196 185 100 -41 -117 -50 51 147 70 118 121 104 167 103 54 3 44 130 63 -34 22 136 164 162 105
-994 105 138 46 121 101 1 -25 38 49 73 125 162 156 108 159 197 -42 3 112 124 51 -13 104 179 181 178 115 -18 45 121 46 44 87 43 -17
-1003 -17 23 68 37 65 116 8 29 120 183 86 44 101 78 23 163 140 151 40 33 6 -6 14 41 77 69 98 153 76 -24 13 21 51 67 102
-1011 102 147 63 -24 23 34 55 105 89 -13 -48 30 186 174 140 172 155 239 270 156 118 58 64 146 222 124 160 114 119 100 109 150 217 135 181
-1019 181 192 139 168 196 23 70 77 150 209 217 291 302 223 134 16 28 2 -21 34 78 110 54 54 23 6 4 17 -79 12 7 -8 70 100 55 89 167
-1028 167 118 84 93 34 98 155 81 181 241 231 133 100 138 142 162 77 71 77 -33 74 55 60 143 110 293 204 98 21 38 116 106 79 75 204
-1036 204 94 96 128 45 76 115 235 92 -80 51 85 127 71 136 57 110 66 129 168 73 92 91 51 91 89 -33 -43 42 34 184 128 55 101
-1044 101 101 137 166 172 154 140 91 44 113 145 196 105 120 64 114 87 187 96 97 90 97 26 140 164 158 77 12 49 59 71 58 143 185 107 -4 70
-1053 70 9 49 96 60 68 155 212 168 14 75 77 120 173 148 162 92 61 67 188 226 150 116 39 83 129 128 86 169 81 26 26 109 117 110 105 143 255
-1062 255 248 142 88 134 51 92 136 93 191 246 189 212 226 220 101 -19 56 119 75 25 94 107 155 212 124 114 99 45 158 140 39 70 77
-1070 77 8 38 122 79 172 226 156 125 136 15 69 12 21 27 88 13 -7 94 194 237 277 300 224 134 189 72 74 95 118 190 57 109 175 90
-1079 90 17 15 29 79 45 119 230 121 155 210 228 196 181 226 55 62 59 124 149 177 117 211 213 176 219 116 127 219 132 24 98 149 226 224 156
-1087 156 129 149 191 186 185 60 79 21 -20 -53 31 150 147 197 258 179 112 26 94 81 75 139 68 73 139 137 177 184 39 -57 -13 21 67 8 -48 -69
-1096 -69 -23 -4 -73 34 209 213 118 5 -66 -87 -123 -26 110 67 117 182 114 83 20 16 156 90 66 93 89 119 186 167 218 223 136 165 140 98
-1104 98 5 17 -34 110 157 150 232 236 196 204 180 97 2 9 59 59 191 163 30 -39 -16 -29 25 34 112 133 93 29 16 8 81 12 17 129 140 98 115
-1113 115 180 241 134 59 143 153 112 239 164 151 231 159 120 218 85 124 129 178 166 78 35 98 69 114 81 -1 18 0 -67 1 141 163 152
-1121 152 18 12 104 164 128 44 94 110 42 75 151 137 113 43 114 -2 71 -15 -78 7 79 34 84 210 100 46 9 3 172 330 259 69
-1129 69 54 53 -54 -6 78 99 92 36 92 80 30 130 41 53 0 113 158 141 118 112 215 129 113 125 130 181 194 203 170 211 160 143 180 50 20
-1138 20 77 89 261 203 171 102 58 208 305 170 223 135 153 237 224 262 141 207 169 111 108 171 187 108 56 65 94 77 54 134 202 88 95 80
-1146 80 130 169 110 167 194 197 121 86 40 112 80 35 -30 69 78 130 -23 -58 -84 -58 -1 10 50 60 93 113 166 155 151 59 146 184 124 13 33
-1155 33 -46 81 123 42 35 136 94 53 42 74 151 119 33 114 24 -44 -13 72 106 143 173 170 109 169 100 139 60 50 8 78 92 42 9 -6 116
-1163 116 107 39 10 42 172 61 42 89 198 137 29 -41 12 67 103 167 209 307 227 186 179 46 63 60 39 109 109 80 223 188 111 33 74
-1171 74 88 56 29 -13 43 94 89 73 80 74 108 181 105 117 146 111 50 -2 117 152 78 -21 32 67 101 112 176 185 121 131 138 137 116 128 76 78 104 63
-1181 63 97 145 102 68 11 -23 29 0 39 45 -1 76 -88 9 53 51 108 161 79 89 99 107 28 -36 2 35 -6 47 77 63 52 91 5 26 55 20
-1189 20 21 1 -4 85 204 179 181 141 192 159 137 86 -95 79 138 114 146 222 253 120 -65 -42 21 -47 -20 45 44 57 102 43 79 -30 -2 43
-1198 43 33 2 105 211 106 47 -52 32 175 209 68 36 27 -36 139 73 -24 84 115 -48 -8 62 146 140 147 78 75 137 117 -44 111 78
-1206 78 184 242 165 138 9 104 81 113 68 20 90 101 109 -24 -17 27 131 163 168 70 100 42 140 177 120 27 16 -14 -46 28 -15 -8 40 30 88
-1214 88 114 181 61 41 107 186 162 134 86 100 44 132 208 38 70 143 54 153 236 46 91 33 12 35 -98 -73 -77 -68 -96 -73 84 192 33
-1222 33 139 222 185 105 68 102 106 64 62 132 105 143 85 -4 43 20 145 247 253 280 225 93 152 238 252 145 78 93 29 96 143 91 129 125
-1230 125 119 27 -11 59 43 53 48 -10 -19 58 37 98 61 52 -7 -6 83 58 114 115 79 47 10 73 158 41 88 84 24 76 112 157 124 127 157 150 124 126 105
-1240 105 100 97 28 1 29 48 50 84 68 155 124 62 95 94 65 15 13 122 198 170 206 207 17 -41 -17 17 -9 195 219 259 136 -61 -46 89
-1248 89 -8 135 188 197 124 108 106 92 36 87 130 177 168 106 67 70 73 108 145 160 143 75 41 -19 69 46 135 87 188 196 151 197 191 239 340 242 148
-1257 148 102 17 121 197 151 84 -49 19 50 24 -42 101 172 174 172 94 -10 -29 -27 -2 -53 -52 -33 99 105 55 -2 -4 -8 -30 -91 102 82 27 124
-1266 124 92 32 98 84 65 57 71 9 85 110 153 93 82 156 121 72 94 135 35 5 -14 44 95 193 92 -43 -49 -118 -130 -56 96 138 198
-1274 198 157 9 -1 135 -16 -92 -64 32 159 139 97 34 25 48 20 53 67 85 56 35 -38 -11 -12 73 30 129 89 78 10 49 27 -15 -54
-1282 -54 -121 -57 11 59 91 119 87 129 58 -59 1 34 99 148 96 45 -54 2 0 -13 105 23 -39 14 103 29 11 51 27 -86 -59 5 28 -9
-1290 -9 -51 -43 44 47 -117 -35 21 -12 -5 -26 -1 72 60 11 48 -2 -55 -81 -46 0 27 -36 -111 -65 -12 62 89 79 0 40 226 156 125 147 162 158
-1299 158 50 6 -79 -102 44 66 48 116 23 7 81 74 20 -65 -59 -44 37 -29 -34 69 -13 1 -57 7 70 64 89 -65 -128 -67 23 -22 -32 -21
-1308 -21 37 100 78 -20 -35 -26 79 61 -18 -41 -179 -140 -78 50 -6 44 -32 -65 -10 -31 83 79 48 123 103 93 99 170 101 109 165 216 306 262 153
-1316 153 104 67 -34 34 66 29 -7 14 133 163 84 27 -15 42 50 65 34 41 -32 37 82 121 178 59 53 139 223 74 14 -73 0 -85 -156 29
-1324 29 29 14 -34 -21 124 191 175 70 113 14 -96 -100 -3 -46 -70 -153 -78 -4 84 105 -5 6 103 94 31 7 -1 -53 -7 91 35 3 66 37 13
-1333 13 150 77 64 164 149 176 79 54 6 1 10 88 51 -50 -154 -33 -18 55 35 74 -13 23 50 52 33 -31 13 -8 -19 130 218 173 98
-1341 98 89 107 -14 -47 50 16 -44 17 126 57 62 55 48 43 21 -1 -40 -88 -82 43 -3 61 119 3 -45 -56 -54 14 -33 120 220 257 120 19
-1349 19 156 122 31 54 58 48 25 -15 44 64 105 140 62 -17 -75 -53 6 -45 -25 -166 -56 68 24 55 87 106 -10 13 166 90 18 27 53
-1357 53 -37 47 87 65 26 0 -19 -43 -28 7 20 52 13 23 -5 -62 -35 8 -90 -16 -5 36 -10 11 -9 -44 0 19 118 106 137 148 67 109 34
-1366 34 -57 4 57 60 52 43 -14 71 -19 27 120 112 29 -6 42 120 58 13 79 -2 70 19 172 165 15 47 -16 199 117 24 96 65 -1 0 80 100
-1375 100 53 18 -106 76 208 67 -2 -33 -24 133 139 132 88 -72 -51 30 13 31 -49 36 70 -22 -91 -138 -68 -54 39 13 -22 106 23 62
-1383 62 9 -38 -23 52 12 -92 -27 -18 -42 40 40 -17 -59 -79 -159 -85 45 76 -3 -4 -120 -94 -132 -52 71 -28 -62 -66 -1 52 1 -145 -56 -9
-1391 -9 44 204 113 48 -18 64 72 33 -4 4 -9 77 -104 -104 -75 5 35 75 69 73 88 56 -87 -88 -102 -108 -38 -79 -71 -82 -96 -9 4 -21 3 -5 0 15 9
-1400 9 9 5 20 49 156 153 59 -9 58 119 110 103 191 165 73 -10 -54 -84 -32 -57 -36 50 55 79 -24 25 70 36 105 34 36 56 74 64 54 90 10 -70
-1410 -70 0 121 61 -1 96 138 91 57 93 28 -69 -34 10 -58 -176 -73 -98 -75 -62 -27 73 102 -6 -28 -51 -45 -21 -42 31 -44 -57 -59 -80
-1418 -80 -65 -103 -179 -68 -89 -68 42 24 27 139 205 100 55 15 0 98 187 115 115 79 68 -29 -135 -70 -94 -134 -40 23 -40 4 71 34 -14
-1426 -14 -84 64 48 90 65 -16 -30 65 62 64 -22 -109 -70 3 56 46 1 -82 -8 -10 -30 -41 -106 9 75 27 0 -16 130 98 -16 -2 1 -72 -142
-1434 -142 -189 -145 -66 -5 -11 22 74 136 184 107 0 -12 -8 48 137 127 58 81 -5 -113 -143 -68 -19 -95 -63 7 52 -69 -105 -97 -132 -9 109
-1443 109 97 90 32 -12 -122 -71 -20 44 60 -14 -141 -91 11 82 25 -79 -9 -5 -30 1 -11 17 -37 -70 -37 -56 -12 5 -60 -33 -36 38 -56 -76
-1451 -76 -65 46 37 54 131 158 52 183 92 3 1 -26 44 71 -81 -125 -70 -1 12 -29 61 37 48 -18 63 121 45 1 -14 -6 106 -1 -33
-1459 -33 89 43 80 6 -43 -28 -29 -140 -103 -4 26 66 73 102 107 79 98 -83 -53 -91 -78 -87 -55 112 15 25 54 -25 -47 -2 -66 -176 -161 -120
-1467 -120 -104 -55 48 91 70 27 119 5 -6 -85 -62 -8 23 -75 -60 -26 -38 -113 -174 -93 -124 -98 0 19 -51 -86 -94 41 34 46 -61 -117 -28
-1475 -28 -43 -87 -59 -40 -51 -98 -34 40 62 -30 48 131 197 81 7 33 94 47 76 96 90 52 14 5 48 36 61 44 36 -9 60 10 -61 75 105
-1484 105 -17 -88 -38 21 -36 -44 -34 -61 -91 16 -10 3 113 5 26 118 102 74 112 -51 -67 -79 3 55 -76 -196 -208 -188 -178 -202 -110
-1491 -110 -97 -74 -112 -10 43 24 122 158 56 9 -91 -142 -146 -128 -68 -19 -86 -94 -57 -111 -7 -1 11 -28 -21 -90 -127 22 68 -32 -36 -91 -117 14
-1500 14 -26 -33 12 -7 -43 -94 29 -5 38 6 -121 -8 27 84 88 15 -120 -68 22 -23 47 37 -16 73 69 -81 -69 -78 -72 -76 -10 85 117 25 16 -63
-1509 -63 -62 -129 -158 -38 -22 -78 -111 -77 -93 -196 -60 -29 33 25 -39 7 55 166 222 116 65 13 46 44 -11 -46 -46 -66 -23 9 33 137 32
-1517 32 37 143 42 -98 -214 -199 -156 -270 -168 -150 -110 -96 -100 -9 -48 -30 -44 -20 -108 -15 -33 -80 -61 -99 -19 74 73 76 22 58 44 -59 -29
-1525 -29 75 -14 15 49 -22 -77 26 42 -23 -77 -66 -11 -40 -56 -116 -170 -65 18 40 -85 -86 -49 -50 -44 -49 36 44 -118 -123 -40 22 -22 -12 131 98
-1533 98 46 90 64 40 8 -3 -59 -153 -52 -108 -50 -142 -132 -36 -11 -83 -147 -52 2 28 -34 -66 -126 -79 -32 11 -41 -42 54 -38 -44 -29 -42 -104 -176
-1542 -176 -199 -55 26 2 -142 -198 -221 -118 -40 -62 -33 -20 -58 -21 -78 -83 -18 -163 -123 -42 -60 -44 23 84 64 -57 -44 -29 -86 -162 -109 -101 -46
-1550 -46 -77 -68 -31 -49 -31 -32 -64 -139 -41 -72 -115 -99 -132 -103 -91 -43 -6 -79 -109 -42 -171 -166 -126 -88 -37 80 67 62 132 66 -19 38 83 2 -72 -23
-1559 -23 -49 -132 -99 -120 -113 -144 6 52 -92 -121 -51 -37 -108 -115 0 -82 -111 -72 -46 -96 -65 -12 32 2 -72 -77 -70 7 42 -18 82 83 -41 -22 -39
-1567 -39 -99 -167 -144 -68 8 -38 -10 -105 -114 13 145 160 55 -33 -117 -1 46 10 -78 -100 -145 -87 84 24 -44 -103 -149 -207 -221 -152 -126 -95 -87
-1575 -87 -82 -97 -159 -133 29 48 81 67 -16 -57 -7 -20 -50 -63 -60 -103 -93 -92 -42 -12 -16 -73 -93 -149 -69 -44 3 -2 62 110 96 -25 -32 -24 0 1 34 71
-1585 71 139 55 -18 -37 -54 -61 0 -31 -8 -25 -10 1 -47 -94 -70 -39 -29 -79 -26 -28 -52 -160 -81 -97 -161 -137 -29 -19 29 18 14 -42 -59 -64 -61 -89
-1593 -89 -102 -114 -123 -159 -47 5 52 12 14 -26 -110 -116 -108 -116 -141 -57 -36 -106 -84 -86 -50 -104 -104 -72 -58 -5 -74 -141 -161 -48 -71 -116 -114 1 27 -1 -83
-1602 -83 -65 -36 14 -28 -107 -61 -114 -169 -170 -116 -21 -74 -63 -53 -106
-1606a06
##$OBSERVED MULTIPLETS=	
(1, 7.1771233036313955012, 7.2470652934768224895, 7.2146374978454668181, 0.89182216888763665708, 1, m, A)
(2, 7.0557231169805456616, 7.1247466373018211172, 7.0903196952144309506, 0.99541996592873838168, 1, dd, B, 1.72949 7.88281)
(3, 6.9546662016714337895, 7.0405861577649444527, 6.9974939306617258694, 2.3607725293912862341, 2, ddd, C, 1.53882 6.95947 7.92773)
(4, 3.8165003102906309707, 3.8821377246541595163, 3.8547313084590104637, 4.1167149985595834494, 4, m, D)
(5, 2.2287866156893980651, 2.2935578345966454172, 2.2589252169532714198, 5.6769296880053161658, 6, m, E)
(6, 1.985961050755607582, 2.0342541156656599455, 2.0101075832106340968, 1.0222163785947768755, 1, d, F, 1.31909)
(7, 1.6432768938568349526, 1.6914234205437290726, 1.6673501572002820126, 2.9361242706326660112, 3, d, G, 1.2605)
##$OBSERVED MULTIPLETS PEAKS=	
(1, 7.2245674190445781093, 556363.42646661808249)
(1, 7.22213557437675302, 760812.8551486270735)
(1, 7.21975591544253259, 796954.65616976306774)
(1, 7.2178820159060226302, 823804.73908719082829)
(1, 7.2038628842392773421, 874715.52211412845645)
(1, 7.1996211780636398814, 932041.9314312353963)
(2, 7.102248762869576737, 912491.24528677389026)
(2, 7.0980951445011628564, 980557.70641228719614)
(2, 7.0827138820741968317, 1330746.2262567714788)
(2, 7.0782209914127900419, 1421575.749114405131)
(3, 7.0180882833327000725, 1112311.1674808377866)
(3, 7.0145774727392566916, 1804943.4476140986662)
(3, 7.0002155168809609975, 1026162.5137367707212)
(3, 6.9969811183001713317, 2143460.6166887818836)
(3, 6.9940846677149659527, 1017028.8820086668711)
(3, 6.990928197659814991, 442979.17746399121825)
(3, 6.9813463795603460937, 1680946.8147508022375)
(3, 6.9771640761036781697, 1829166.9397565736435)
(4, 3.8596398502219151361, 20417511.878047827631)
(4, 3.8498227666961062354, 8442275.4421161878854)
(4, 3.8389981847228753509, 5175509.5163776874542)
(5, 2.271059960164401037, 6453518.1916829608381)
(5, 2.2544312005737716653, 7367287.1984295342118)
(5, 2.2512844901216424454, 5024142.7966817552224)
(6, 2.0117562412334155653, 3749775.8535784613341)
(6, 2.0084589251878521843, 3356916.9540522377938)
(7, 1.6689255461114844703, 5345762.3578951070085)
(7, 1.6657747682890795549, 5677884.3972665388137)
##END=	
##TITLE=	Mar13-2020.420.1.1r
##JCAMP-DX=	6.0	$$ MestReNova 14.1.0-24037
##BLOCK_ID=	3
##DATA TYPE=	NMR PEAK TABLE
##DATA CLASS=	PEAK TABLE
##CROSS REFERENCE=	NMR SPECTRUM: BLOCK_ID=2                                     
##.OBSERVE FREQUENCY=	400.05240029848198446
##.OBSERVE NUCLEUS=	^1H
##NPOINTS=	30
##FIRSTX=	1.6657747682890795549
##LASTX=	7.2839210858972567308
##XFACTOR=	1
##YFACTOR=	1
##FIRSTY=	5677884.3972665388137
##XUNITS=	PPM
##YUNITS=	ARBITRARY UNITS
##PEAK TABLE=	(XYW..XYW)
1.6657747682890795549,5677884.3972665388137,0.0049898657598550395786
1.6689255461114844703,5345762.3578951070085,0.0057446333086267923826
1.7460916001282564824,7099733.8375787036493,0.0080358801119215558101
$$ [...]
3.8596398502219151361,20417511.878047827631,0.0023554245538866345339
6.9771640761036781697,1829166.9397565736435,0.0041191366855428930907
6.9813463795603460937,1680946.8147508022375,0.0037706665367249845439
6.990928197659814991,442979.17746399121825,0.0040913370050782429596
6.9940846677149659527,1017028.8820086668711,0.0037923744675503637085
6.9969811183001713317,2143460.6166887818836,0.0052352856277573462176
7.0002155168809609975,1026162.5137367707212,0.0023050883883681066132
7.0145774727392566916,1804943.4476140986662,0.0037182913314881206775
7.0180882833327000725,1112311.1674808377866,0.0030813176376128167955
7.0782209914127900419,1421575.749114405131,0.004677230883923420672
7.0827138820741968317,1330746.2262567714788,0.0031323861281560777883
7.0980951445011628564,980557.70641228719614,0.0038980636067745119341
7.102248762869576737,912491.24528677389026,0.0030978590742413067947
7.1996211780636398814,932041.9314312353963,0.0035088312489678658707
7.2038628842392773421,874715.52211412845645,0.0029416065207056728455
7.2178820159060226302,823804.73908719082829,0.0024107950203134352607
7.21975591544253259,796954.65616976306774,0.004535525386914534586
7.22213557437675302,760812.8551486270735,0.0046100210597029827458
7.2245674190445781093,556363.42646661808249,0.0020825455445218112038
7.2839210858972567308,1197509.7893074552994,0.0016615489070594899063
##$MNOVA/PEAK_DATA_TABLE=	(T,F,A,ST,SP,APT,APC)
$$ Complementary to PEAK TABLE
$$ T: Type
$$ F: Flags
$$ A: Annotation
$$ ST: Shape Type
$$ SP: Shape Parameter
$$ APT: Attached Peaks Type
$$ APC: Attached Peaks Count
Compound,None,,1,0.18544468919578535604,0,0
Compound,None,,1,1.2028273690179918098,0,0
Compound,2ry Solvent,,1,1.4108099799943518704,0,0
Compound,None,,1,0.90773781756166116441,0,0
Compound,None,,1,0.23251052255678661407,0,0
Compound,None,,1,0.31560667026720856665,0,0
Compound,None,,1,0.43232292091088381225,0,0
Compound,None,,1,0.1624485856956962293,0,0
Compound,None,,1,0.077044397605669889817,0,0
Compound,None,,1,0.44954123551166041972,0,0
Compound,None,,1,0.54214815520593861997,0,0
Compound,None,,1,-0.023000611519442208663,0,0
Compound,None,,1,0.24435255101881159234,0,0
Compound,None,,1,-0.53591605341504888749,0,0
Compound,None,,1,0.050133179645289599469,0,0
Compound,None,,1,-0.018288511305046259436,0,0
Compound,None,,1,-0.049334410050791685509,0,0
Compound,None,,1,0.22346699114043228063,0,0
Compound,None,,1,0.22486602687206869167,0,0
Compound,None,,1,-0.57548567057945587688,0,0
Compound,None,,1,0.1251996053521084451,0,0
Compound,None,,1,-0.62230071707722223184,0,0
Compound,None,,1,0.33745057398970507156,0,0
Compound,None,,1,-0.053553127388191512637,0,0
Compound,None,,1,0.093222875336205934804,0,0
Compound,None,,1,-0.42854150270152524538,0,0
Compound,None,,1,-0.75813564978943326356,0,0
Compound,None,,1,0.95658680398271278555,0,0
Compound,None,,1,-0.53628912045310517254,0,0
Compound,None,,1,0.94797232805699760405,0,0
##END=	
##END=	
