##TITLE=	Jan31-2020.20.fid
AA001
##JCAMP-DX=	6.0	$$ MestReNova 14.1.0-24037
##DATA TYPE=	LINK
##BLOCK_ID=	1
##BLOCKS=	1    
##ORIGIN=	Mestrelab Research S.L.
##OWNER=	aaa419
##$MNOVA/LINK_BLOCK_TYPE=	ITEM	$$ NMR Spectrum
##$MNOVA/ITEM/POLYGON=	(XY..XY)
5321,5835
8722,5835
8722,8208
5321,8208
5321,5835
##$MNOVA/ITEM/Z=	0
##$MNOVA/ITEM/ANGLE=	0
##TITLE=	Jan31-2020.20.fid
##JCAMP-DX=	6.0	$$ MestReNova 14.1.0-24037
##BLOCK_ID=	2
##DATA TYPE=	NMR SPECTRUM
##DATA CLASS=	XYDATA
##NUMDIM=	1
##ORIGIN=	Bruker BioSpin GmbH
##OWNER=	nmrsu
##.OBSERVE FREQUENCY=	400.05240029999998796
##.OBSERVE NUCLEUS=	^1H
##.SOLVENT NAME=	CDCl3
##.PULSE SEQUENCE=	zg30
##LONGDATE=	2020/01/31 15:47:00.000
##.ACQUISITIONMODE=	SIMULTANEOUS (DQD)
##$ORIGINAL FORMAT=	Bruker XWIN-NMR
##$MNOVA/SCALES_VERSION=	8
##$PARAMETER FILE=	(acqus, ASCII, //ch-nmrserv2.ch.ic.ac.uk/Av400D/ug1/nmr/Jan31-2020/20/acqus, 0)
$$ ##TITLE= Parameter file, TOPSPIN		Version 3.2
$$ ##JCAMPDX= 5.0
$$ ##DATATYPE= Parameter Values
$$ ##NPOINTS= 11	$$ modification sequence number
$$ ##ORIGIN= Bruker BioSpin GmbH
$$ ##OWNER= nmrsu
$$ $$ 2020-01-31 15:47:25.056 +0000  nmrsu@nmrpc
$$ $$ /opt/topspin/data/ug1/nmr/Jan31-2020/20/acqus
$$ $$ process /opt/topspin3.2/prog/mod/shimcntl
$$ ##$ACQT0= -2.04831932773109
$$ ##$AMP= (0..31)
$$ 100 100 100 100 100 100 100 100 100 100 100 100 100 100 100 100 100 100
$$ 100 100 100 100 100 100 100 100 100 100 100 100 100 100
$$ ##$AMPCOIL= (0..19)
$$ -1 0 0 0 0 0 0 0 0 0 0 0 0 0 0 0 0 0 0 0
$$ ##$ANAVPT= -1
$$ ##$AQSEQ= 0
$$ ##$AQ_mod= 3
$$ ##$AUNM= <au_zg>
$$ ##$AUTOPOS= <2 >
$$ ##$BF1= 400.05
$$ ##$BF2= 400.05
$$ ##$BF3= 400.05
$$ ##$BF4= 400.05
$$ ##$BF5= 400.05
$$ ##$BF6= 400.05
$$ ##$BF7= 400.05
$$ ##$BF8= 400.05
$$ ##$BYTORDA= 0
$$ ##$CAGPARS= (0..11)
$$ 0 0 0 0 0 0 0 0 0 0 0 0
$$ ##$CFDGTYP= 0
$$ ##$CFRGTYP= 9
$$ ##$CHEMSTR= <none>
$$ ##$CNST= (0..63)
$$ 1 1 1 1 1 1 1 1 1 1 1 1 1 1 1 1 1 1 1 1 1 1 1 1 1 1 1 1 1 1 1 1 1 1 1 1
$$ 1 1 1 1 1 1 1 1 1 1 1 1 1 1 1 1 1 1 1 1 1 1 1 1 1 1 1 1
$$ ##$CPDPRG= (0..8)
$$ <> <> <> <> <> <> <> <> <>
$$ ##$D= (0..63)
$$ 0 1 0 0 0 0 0 0 0 0 0 0 0 0 0 0 0.0002 0 0 0 0 0 0 0 0 0 0 0 0 0 0 0 0
$$ 0 0 0 0 0 0 0 0 0 0 0 0 0 0 0 0 0 0 0 0 0 0 0 0 0 0 0 0 0 0 0
$$ ##$DATE= 1580485644
$$ ##$DE= 6.5
$$ ##$DECBNUC= <off>
$$ ##$DECIM= 2496
$$ ##$DECNUC= <off>
$$ ##$DECSTAT= 4
$$ ##$DIGMOD= 1
$$ ##$DIGTYP= 12
$$ ##$DQDMODE= 0
$$ ##$DR= 22
$$ ##$DS= 4
$$ ##$DSPFIRM= 0
$$ ##$DSPFVS= 20
$$ ##$DTYPA= 0
$$ ##$EXP= <proton>
$$ ##$F1LIST= <>
$$ ##$F2LIST= <>
$$ ##$F3LIST= <>
$$ ##$FCUCHAN= (0..9)
$$ 0 2 0 0 0 0 0 0 0 0
$$ ##$FL1= 90
$$ ##$FL2= 90
$$ ##$FL3= 90
$$ ##$FL4= 90
$$ ##$FOV= 20
$$ ##$FQ1LIST= <>
$$ ##$FQ2LIST= <>
$$ ##$FQ3LIST= <>
$$ ##$FQ4LIST= <>
$$ ##$FQ5LIST= <>
$$ ##$FQ6LIST= <>
$$ ##$FQ7LIST= <>
$$ ##$FQ8LIST= <>
$$ ##$FRQLO3= 15959.0749999881
$$ ##$FRQLO3N= 2
$$ ##$FS= (0..7)
$$ 83 83 83 83 83 83 83 83
$$ ##$FTLPGN= 0
$$ ##$FW= 125000
$$ ##$FnMODE= 0
$$ ##$FnTYPE= 0
$$ ##$GPNAM= (0..31)
$$ [...]
$$ 130000 130000 130000 130000 130000 130000 130000 130000 130000 130000 130000
$$ 130000 130000 130000 130000 130000 130000 130000 130000 130000 130000 130000
$$ 130000 130000 130000 130000 130000 130000 130000 0 0 0 0 0 0 0 0 0 0 0
$$ 0 0 0 0 0 0 0 0 0 0 0 0 0
$$ ##$ShimPowMaxUC= (0..63)
$$ 130000 130000 130000 130000 130000 130000 130000 130000 130000 130000 130000
$$ 130000 130000 130000 130000 130000 130000 130000 130000 130000 130000 130000
$$ 130000 130000 130000 130000 130000 130000 130000 130000 130000 130000 130000
$$ 130000 130000 130000 130000 130000 130000 130000 0 0 0 0 0 0 0 0 0 0 0
$$ 0 0 0 0 0 0 0 0 0 0 0 0 0
$$ ##$ShimPowMaxUG= (0..63)
$$ 524287 524287 524287 524287 524287 524287 524287 524287 524287 524287 524287
$$ 524287 524287 524287 524287 524287 524287 524287 524287 524287 524287 524287
$$ 524287 524287 524287 524287 524287 524287 524287 524287 524287 524287 524287
$$ 524287 524287 524287 524287 524287 524287 0 0 0 0 0 0 0 0 0 0 0 0 0 0 0
$$ 0 0 0 0 0 0 0 0 0 0
$$ ##$ShimPowRcbType= 3
$$ ##$ShimPowRes= (0..63)
$$ 1e-20 1e-20 1e-20 1e-20 1e-20 1e-20 1e-20 1e-20 1e-20 1e-20 1e-20 1e-20
$$ 1e-20 1e-20 1e-20 1e-20 1e-20 1e-20 1e-20 1e-20 1e-20 1e-20 1e-20 1e-20
$$ 1e-20 1e-20 1e-20 1e-20 1e-20 1e-20 1e-20 1e-20 1e-20 1e-20 1e-20 1e-20
$$ 1e-20 1e-20 1e-20 1e-20 0 0 0 0 0 0 0 0 0 0 0 0 0 0 0 0 0 0 0 0 0 0 0 0
$$ ##$ShimPowRng0= (0..63)
$$ 1 1 1 1 1 1 1 1 1 1 1 1 1 1 1 1 1 1 1 1 1 1 1 1 1 1 1 1 1 1 1 1 1 1 1 1
$$ 1 1 1 1 0 0 0 0 0 0 0 0 0 0 0 0 0 0 0 0 0 0 0 0 0 0 0 0
$$ ##$ShimPowRng1= (0..63)
$$ 1 1 1 1 1 1 1 1 1 1 1 1 1 1 1 1 1 1 1 1 1 1 1 1 1 1 1 1 1 1 1 1 1 1 1 1
$$ 1 1 1 1 0 0 0 0 0 0 0 0 0 0 0 0 0 0 0 0 0 0 0 0 0 0 0 0
$$ ##$ShimPowRng2= (0..63)
$$ 1 1 1 1 1 1 1 1 1 1 1 1 1 1 1 1 1 1 1 1 1 1 1 1 1 1 1 1 1 1 1 1 1 1 1 1
$$ 1 1 1 1 0 0 0 0 0 0 0 0 0 0 0 0 0 0 0 0 0 0 0 0 0 0 0 0
$$ ##$ShimPowRng3= (0..63)
$$ 1 1 1 1 1 1 1 1 1 1 1 1 1 1 1 1 1 1 1 1 1 1 1 1 1 1 1 1 1 1 1 1 1 1 1 1
$$ 1 1 1 1 0 0 0 0 0 0 0 0 0 0 0 0 0 0 0 0 0 0 0 0 0 0 0 0
$$ ##$ShimSysFunc= (0..63)
$$ 1 2 3 4 5 6 7 8 9 10 0 37 38 35 16 15 14 13 12 11 28 27 26 25 24 23 36
$$ 22 30 29 20 21 34 33 32 31 17 18 19 0 0 0 0 0 0 0 0 0 0 0 0 0 0 0 0 0 0
$$ 0 0 0 0 0 0 0
$$ ##$ShimSysMatrix= 0
$$ ##$ShimSysType= 4
$$ ##$TFXNUM= 0
$$ ##$TRIPLO2= 0
$$ ##$VTU= 2
$$ ##$VTUETH= <149.236.99.20>
$$ ##$VTUTY= <no>
$$ ##$WBREFAM= (0..15)
$$ 136.7 118.7 100 100 100 100 100 100 100 100 100 100 100 100 100 100
$$ ##$WBREFLM= (0..15)
$$ 0 0 0 0 0 0 0 0 0 0 0 0 0 0 0 0
$$ ##$WBREFPH= (0..15)
$$ 77.55 -71.28 0 0 0 0 0 0 0 0 0 0 0 0 0 0
$$ ##$WBSGU= (0..15)
$$ 0 0 0 0 0 0 0 0 0 0 0 0 0 0 0 0
$$ ##$XFAC= 2
$$ ##END=
$$ 
##$DECIM=	2496
##$DSPFVS=	20
##XUNITS=	HZ
##YUNITS=	ARBITRARY UNITS
##FIRSTX=	6406.710256386850233
##LASTX=	-1606.1102564336499654
##DELTAX=	-0.12226780365942625795
##XFACTOR=	1
##YFACTOR=	0.0048802887892252459073
##FIRSTY=	8.4718923568725585938
##MINY=	-1.3776439428329467773
##MAXY=	28110.912109375
##NPOINTS=	65536
##XYDATA=	(X++(Y..Y))
$$ [...]
3613 349 279 251 222 227 231 209 187 197 208 256 304 320 335 355 376 331 285 313 340 368 395 321 248 240 232 265 297 296 295 279 263 280 298 277 256 235 214 214
3609 214 215 215 216 219 223 226 230 234 239 244 249 155 60 119 179 188 197 173 149 153 156 225 295 304 314 323 333 363 393 314 234 318 402 376 350 296 241 253 264 259 253 281 308 246
3603 246 183 187 190 200 210 154 98 140 182 290 398 358 318 277 237 228 218 209 199 287 374 428 483 480 476 363 250 265 281 296 311 290 268 246 225 278
3599 278 331 351 372 312 253 259 266 250 235 253 270 256 241 227 212 204 196 253 311 336 360 385 410 345 281 282 283 286 289 225 162 139 116 203 290 296 303 276 250 282
3594 282 314 314 313 360 406 387 368 261 155 202 249 295 340 386 431 412 393 374 355 321 286 251 217 155 92 140 188 274 360 336 312 289 267 310 353
3590 353 354 356 357 358 294 229 274 319 326 333 340 347 348 349 285 220 192 163 135 106 97 88 145 201 206 211 216 221 330 439 439 438 416 393 371 348 356 364 306 247 256 265 274 282 250 218
3584 218 251 284 263 242 221 200 224 248 207 165 184 204 289 374 340 306 272 238 172 106 106 106 107 109 110 111 155 198 242 286 276 266 256 246 292 338 319 299
3579 299 317 334 352 369 351 332 313 295 276 258 239 221 233 244 256 268 276 284 292 300 386 472 492 512 465 418 371 324 327 330 333 336 264 192 119 47 27 8 98
3575 98 189 201 213 225 237 212 186 160 135 126 117 108 99 145 190 232 274 255 171 120 180 278 266 175 151 202 253 242 231 262 293 325 356 285 215 148 192
3570 192 279 366 350 334 324 314 303 293 272 250 229 207 282 357 347 226 160 203 218 168 88 73 127 181 231 281 265 249 227 205 294 382 394 406
3566 406 352 299 322 345 302 259 244 229 279 330 286 242 198 154 211 268 260 251 248 245 242 238 276 313 285 256 219 182 255 328 341 353 365 377 358 338 319 300
3561 300 284 268 252 236 161 86 164 243 220 197 174 151 121 91 61 31 108 185 262 338 296 253 276 300 291 283 275 267 259 251 242 234 293 351 344 336 252 167 237 306
3556 306 298 290 283 275 277 278 280 282 282 281 281 281 374 467 406 346 264 182 209 237 232 227 222 217 237 257 276 296 278 259 241 222 174 126 78 30 75 121 166 212 222 233 243
3551 243 254 333 413 382 352 301 251 310 369 339 309 279 249 223 197 280 364 380 396 346 296 351 406 396 385 330 275 330 385 408 432 345 259 249 240
3547 240 230 221 262 304 346 388 420 452 375 297 282 267 252 237 182 127 138 148 161 174 121 68 106 143 181 218 242 265 288 311 358 405 342 278 305
3543 305 332 359 386 342 298 319 341 318 295 272 248 253 257 262 266 316 366 350 334 301 268 302 335 307 278 249 220 285 350 304 259 257 256 254 253 244 236 227 219 218 218 218
3537 218 218 279 341 292 244 234 224 214 204 211 217 290 362 321 280 238 197 232 266 300 335 324 313 302 291 238 184 131 77 128 179 164 149 113 78 108
3533 108 139 199 260 254 249 225 200 176 151 149 146 143 141 158 174 257 339 370 400 364 328 284 240 196 152 128 104 80 55 96 136 111 85 144 202 261 320 285
3528 285 250 215 180 174 168 227 287 310 332 351 369 353 271 227 182 205 227 250 273 254 235 216 197 243 288 268 248 243 239 235 230 177 123 138 218 271 257 219
3524 219 181 220 258 231 204 201 198 194 191 188 184 181 178 264 350 407 399 382 365 348 332 323 380 437 428 355 283 317 351 349 348 285 221 177 199 250 301 278 254 231 208
3519 208 242 276 311 345 285 225 193 228 246 264 220 177 148 120 116 178 265 286 238 190 222 255 263 204 127 115 172 230 240 250 198 146 110 139 197 255
3514 255 279 303 262 220 215 210 206 201 234 267 234 201 192 182 214 180 160 207 318 429 445 395 346 362 418 475 467 393 327 327 352 377 356 335 313 292 325
3510 325 357 389 422 384 346 307 269 250 232 279 326 334 343 290 236 204 237 270 238 192 147 164 180 187 194 201 207 212 216 221 225 230 234 238 243 200 157 114 71 104 137 169
3505 169 202 183 164 211 258 254 250 205 225 292 293 185 77 56 101 150 133 84 101 186 272 229 185 171 222 233 243 258 273 264 255 247 238 217 197 176 155
3500 155 173 191 208 226 234 242 251 259 260 262 263 264 343 423 429 370 320 270 220 170 147 189 259 330 286 241 197 152 160 168 175 183 181 179 243 307 315 323 331 339 313 286 260 234
3495 234 238 242 246 250 307 365 313 260 275 289 303 317 333 349 430 512 522 533 478 422 297 172 156 141 174 206 239 272 273 274 275 276 291 305 319 333 357 381
3490 381 339 296 278 259 240 221 284 348 345 343 295 247 199 152 167 182 198 213 290 367 378 389 342 295 249 202 143 85 181 276 301 327 352 378 337 296
3486 296 255 214 165 116 177 237 312 386 351 315 376 437 432 427 330 233 246 259 333 407 370 334 283 231 246 260 247 234 222 209 222 236 249 263 293 323
3481 323 353 383 332 280 228 177 163 150 137 124 142 161 179 197 228 259 290 321 332 344 289 235 234 233 298 363 277 190 170 149 152 155 158 161 198 235 206 177
3477 177 206 235 264 293 258 224 256 288 354 420 420 420 399 379 292 206 191 176 161 146 172 199 226 252 262 272 283 293 263 233 204 174 172 169 167 165 205 244
3472 244 284 323 324 325 326 328 324 320 316 312 347 381 350 318 343 368 282 197 177 158 204 251 282 313 279 244 241 238 235 232 306 381 301 222 191 159 128 97 109 122 134
3467 134 147 155 164 172 180 203 226 315 404 389 373 358 342 376 411 335 259 237 215 197 179 180 248 315 317 313 309 301 293 283 272 261 250 222 193 231 268 294 320 346
3462 346 372 372 372 372 372 347 323 298 274 282 291 336 316 250 184 183 248 270 226 223 220 167 113 60 6 22 37 52 67 124 181 237 294 352 410 439 403 306 209
3457 209 261 314 339 364 389 414 379 344 309 274 247 220 193 166 203 240 273 306 322 272 157 107 160 213 246 212 168 189 236 282 237 192 216 306
3453 306 386 400 346 291 274 257 240 222 212 202 191 181 201 220 240 259 323 386 377 302 269 236 203 170 156 209 261 247 224 201 239 278 245 212 179
3449 179 146 53 -39 -22 -5 121 248 309 369 352 335 318 301 294 286 279 271 250 230 209 189 114 40 76 112 134 157 179 201 154 106 125 143 202 262 255
3445 255 249 246 244 307 371 338 304 271 238 261 284 308 331 309 288 266 244 215 185 147 241 313 386 400 415 445 475 351 227 240 254 267 280 275 271 266 261
3440 261 230 199 168 137 181 226 270 315 317 320 257 195 248 302 356 410 363 316 269 222 207 192 243 293 251 209 167 125 161 197 234 270 214 158 102 45
3436 45 140 235 264 293 266 239 322 405 391 376 361 347 274 202 121 172 234 296 300 304 318 332 346 359 396 432 402 373 404 436 434 433 425 417 409 402 344 287 296 305
3431 305 309 314 253 191 234 276 253 230 245 261 277 293 315 338 328 317 306 295 218 141 219 296 307 319 290 262 233 204 249 294 273 252 237 221 205 190
3426 190 175 160 211 262 267 271 242 214 210 206 236 265 265 265 297 330 362 393 358 324 298 273 247 221 263 305 346 388 343 297 252 206 244 282 287 292 254 215 243
3422 243 271 237 203 169 135 181 226 162 98 128 157 187 217 176 136 95 55 92 129 166 203 222 240 226 212 295 378 351 324 220 115 165 214 284
3417 284 353 356 359 307 256 204 152 193 234 275 316 294 272 249 227 241 254 268 281 323 365 374 382 392 401 345 288 318 347 311 274 280 285 290 296 277 258 272 287
3413 287 263 239 326 412 428 444 460 476 465 453 408 364 375 386 331 276 268 261 253 245 225 205 185 165 208 251 295 338 330 323 381 439 402 364 326 288 248 208
3408 208 201 195 154 114 140 165 218 270 257 244 233 222 211 199 184 168 185 202 168 134 166 198 311 423 381 340 294 248 268 288 299 310 321 332 292
3404 292 252 245 237 204 172 205 238 243 248 253 258 294 329 254 180 203 225 248 271 235 198 162 126 134 142 150 158 163 167 171 175 226 278 264 249 206 162 85 8 36 63 90
3399 90 118 98 78 124 170 204 239 273 308 279 250 287 325 291 257 223 189 201 212 219 227 188 83 -46 -66 30 127 165 203 169 134 99 65 159 253
3394 253 314 374 368 361 288 216 252 289 325 362 309 257 204 151 195 239 251 262 209 156 169 182 184 186 85 -15 -19 86 200 248 218 188 187 186 208 229
3390 229 184 139 113 87 171 255 219 183 151 120 186 319 443 458 381 305 288 271 288 306 324 342 386 430 475 519 458 397 369 341 287 233 245 256
3386 256 254 252 184 116 152 188 191 194 170 146 188 230 271 311 286 260 264 267 271 274 219 165 220 275 245 215 185 155 80 6 41 76 170 264 292 319 300 281 229
3381 229 177 133 90 113 135 191 247 237 227 188 148 141 135 139 144 149 154 145 137 129 120 106 91 143 194 300 405 445 485 417 348 313 277 241 205 235 265 310 355
3376 355 334 313 300 286 273 260 258 256 287 318 371 425 325 225 154 84 123 163 227 291 289 287 229 171 223 275 352 429 440 451 363 275 220 165 258 351
3372 351 290 228 207 186 231 276 212 148 194 241 256 272 288 304 310 316 257 197 171 145 185 225 223 222 221 219 203 186 170 153 156 158 161 164 209 255 301 347 350 353 356
3367 356 359 311 262 279 296 312 328 344 360 332 305 277 250 222 195 167 140 168 196 225 253 251 249 247 245 249 252 255 258 262 265 268 271 288 306 323 340 332 324 317 309 268 227
3362 227 186 145 168 192 281 370 363 356 349 342 421 501 426 352 283 214 211 208 206 205 269 333 321 309 296 284 299 314 263 213 210 208 206 203 205 207 209 210 241 273 304 335 314
3356 314 293 272 251 230 209 188 167 203 240 277 313 281 249 217 185 158 130 168 206 189 173 156 140 207 274 342 409 411 413 416 418 408 398 388 378 383 389 328
3352 328 268 221 174 193 212 220 228 235 243 194 146 251 356 379 402 359 316 319 323 327 330 277 224 171 117 171 225 213 201 222 243 198 153 129 104 146 188 178
3347 178 169 160 151 212 273 268 263 224 184 211 238 223 209 195 180 161 141 122 102 81 60 105 150 157 164 170 177 220 262 305 347 269 190 222 253 246 239 166 93 135
3342 135 177 218 260 290 319 348 378 342 306 270 235 240 245 251 256 295 334 372 411 401 390 314 237 214 191 234 277 320 364 341 318 257 196 201 206 240 274 308
3337 308 342 322 301 215 128 234 340 380 419 389 358 327 296 301 306 311 315 325 334 409 484 426 368 310 252 266 280 294 308 341 375 298 221 135 49 117
3333 117 185 232 279 260 242 210 179 148 117 149 181 213 245 174 103 97 92 187 282 311 340 325 310 362 413 343 274 270 267 332 397 352 307 325 344 395 446
3328 446 370 295 252 209 306 404 391 379 271 163 121 79 135 192 248 304 297 290 316 341 372 403 367 332 325 318 311 304 336 368 335 301 304 308 278 248 247 245 244
3324 244 243 225 207 188 170 192 214 236 258 173 88 69 50 94 138 182 226 209 191 240 289 299 309 209 109 121 133 144 156 155 155 220 285 305 324
3319 324 278 232 210 189 200 212 176 141 138 136 135 135 167 200 279 359 372 385 334 283 265 247 218 190 162 133 119 104 156 207 188 170 184 198 231 264 231
3315 231 198 265 333 335 336 331 326 321 316 219 122 134 147 265 384 436 488 479 470 395 320 278 236 193 151 178 205 232 259 262 265 235 205 157 108 125 143 189 236
3310 236 217 198 264 330 330 330 312 295 311 327 239 152 131 110 130 151 105 60 146 232 245 193 150 107 93 78 88 98 140 182 235 287 314 276 235 261
3306 261 351 441 453 399 316 234 248 263 278 292 329 366 378 324 256 255 322 390 441 492 477 462 398 334 274 214 204 259 315 304 272 240 270 300 291 281
3301 281 272 262 283 304 291 279 250 221 258 295 280 265 283 302 293 284 276 267 280 292 239 186 186 186 248 310 345 315 256 197 165 134 73 13 29 112 191 270
3297 270 310 350 325 299 247 195 167 206 294 316 230 143 117 156 225 293 323 354 351 349 339 329 318 308 311 314 317 320 361 402 414 360 295 231 228 225 183 142 210
3292 210 345 457 460 330 201 108 16 77 138 160 181 203 224 243 262 216 169 202 235 301 367 332 298 231 164 137 109 147 185 199 214 195 176
3288 176 246 315 318 322 354 386 386 385 351 318 317 316 342 369 329 289 204 118 98 79 71 63 121 179 235 292 238 185 215 244 274 304 291 278 265 253 245 238 230 222 211
3283 211 199 188 176 233 290 282 273 281 289 264 238 182 126 103 79 95 111 160 209 288 367 336 306 266 226 186 147 195 244 226 209 199 188 243 299 301 303 195
3278 195 87 96 106 148 190 254 317 315 313 323 333 342 352 369 385 368 351 318 284 317 349 351 352 386 420 336 252 201 150 198 245 293 341 289 237 186 134
3274 134 141 148 154 161 186 211 236 260 318 376 323 271 226 181 245 310 337 365 283 201 176 152 194 235 276 317 292 266 208 150 158 166 208 250 182 114 147 181
3269 181 214 248 276 304 332 360 324 288 285 282 296 309 257 205 227 248 269 291 241 191 207 223 247 271 263 254 210 166 156 145 155 165 174 184 201 218 234
3265 234 251 227 203 147 90 77 63 116 169 158 147 136 124 180 235 290 345 265 185 138 91 142 194 179 165 104 44 93 142 210 278 280 282 277 273 302 330
3260 330 354 378 293 207 160 114 177 241 288 335 316 298 227 156 118 80 122 164 239 315 277 239 202 164 203 242 281 320 286 253 219 185 204 224 177
3256 177 131 178 224 271 318 306 294 348 403 393 384 342 300 290 280 303 326 314 303 291 280 265 250 235 220 186 152 184 216 193 170 212 255 215 175
3251 175 135 94 131 168 237 307 241 175 176 176 165 153 142 130 241 352 353 354 327 301 340 379 348 317 318 320 310 300 290 280 262 244 292 339 301 263 258
3247 258 253 271 289 240 192 197 203 208 213 177 141 171 201 242 282 322 362 338 314 289 265 236 208 179 150 137 123 176 228 245 262 279 296 330 365 334 303
3242 303 185 67 59 52 100 148 131 113 130 146 162 178 204 230 255 281 268 255 242 229 241 252 264 276 250 225 200 175 175 174 174 173 196 218 241 264 267
3238 267 270 274 277 269 261 252 244 266 288 310 333 320 308 296 283 344 404 465 525 540 554 459 363 276 189 212 234 254 273 293 313 324 335 281 226 233 239 246 253 247 241
3233 241 235 230 251 272 293 314 278 243 208 173 211 250 222 195 218 241 265 288 310 333 355 377 374 372 369 367 339 310 282 254 291 329 256 184 162 140 183 227
3228 227 244 262 279 297 223 149 141 133 142 150 159 167 189 211 167 123 141 159 177 195 217 239 261 283 298 314 329 344 236 127 128 129 176 222 203 184 140 96
3224 96 163 229 216 202 189 176 219 263 307 350 369 388 407 426 427 428 429 430 402 374 412 450 434 417 400 383 391 399 407 414 401 387 307 228 184 140 162 184 221
3219 221 258 296 333 284 234 251 268 318 368 309 249 214 180 211 242 259 276 228 179 228 276 325 374 363 351 230 108 123 137 152 166 161 156 150 145 252
3214 252 359 357 354 304 253 268 284 309 335 327 320 312 303 295 287 262 238 214 190 217 244 271 298 239 180 154 128 178 229 213 197 199 200 267 335 332 329 260 191 167
3210 167 144 120 96 93 90 153 215 264 312 327 343 304 266 293 321 353 385 351 317 235 152 179 206 241 276 312 347 328 309 291 272 300 328 355 383 341
3205 341 299 257 215 212 210 208 205 168 131 159 188 217 245 274 302 362 421 415 408 370 332 294 256 264 271 279 287 319 351 273 196 177 158 205 252 275 299 289 280 252
3200 252 225 231 237 282 328 308 287 258 228 265 301 341 381 315 249 220 256 325 328 273 217 223 229 245 261 245 228 222 215 242 269 239 209 150 92 68 111 219
3196 219 261 272 283 322 362 298 235 277 319 286 186 58 -4 -22 25 102 179 229 213 235 256 258 260 262 264 237 210 187 164 130 163 224 284 279 274 268 263 250
3191 250 237 225 212 241 269 364 393 321 183 126 179 203 228 256 283 293 238 182 192 176 160 114 69 92 114 196 278 342 295 245 194 214 234 253
3187 253 273 257 242 226 210 269 327 382 436 444 386 324 328 352 310 239 234 322 409 390 372 370 369 306 243 256 336 416 429 380 330 277 223 198 174 259 344
3182 344 315 285 256 227 247 266 285 304 281 258 234 211 189 167 211 255 295 335 308 282 312 341 305 268 264 261 257 254 259 265 271 277 278 280 282 283 319 355 325 295 302
3177 302 309 316 323 306 289 272 255 224 194 163 132 200 268 335 403 405 407 342 278 249 220 257 294 296 298 301 303 345 387 318 250 261 273 284 295 341 386 321 256
3172 256 274 292 376 459 443 427 411 396 360 325 290 255 304 352 335 318 352 385 419 453 365 276 188 100 174 248 321 395 365 334 303 273 278 283 288 293 262
3168 262 231 200 169 137 104 138 172 213 255 297 339 322 305 288 271 248 226 204 182 243 305 300 296 282 268 254 240 230 220 211 201 228 256 284 312 335
3164 335 359 383 406 401 396 325 255 245 236 227 218 204 190 176 162 214 265 251 237 234 231 294 357 360 363 365 368 310 253 196 138 172 205 238 271 276 281 285 290 332 374 349
3158 349 325 297 268 239 210 235 260 284 309 318 327 336 345 338 332 260 188 221 254 287 320 303 287 270 254 200 147 203 260 305 351 331 310 268 226 184 142 181
3154 181 220 325 430 324 217 182 279 399 387 304 221 209 198 187 175 236 297 292 287 330 373 383 394 429 465 469 341 238 201 229 257 215 172
3150 172 240 307 320 334 281 228 211 194 177 160 166 171 176 182 179 176 173 170 152 134 116 98 165 232 307 251 179 108 137 167 192 216 240 265 227 190 152 114 137
3145 137 160 183 205 277 348 420 491 448 404 360 316 312 307 303 299 307 315 322 330 345 360 309 258 313 369 424 479 453 426 366 307 233 159 238 318 349 380 301 222
3140 222 194 166 204 242 235 229 222 216 215 213 278 343 327 311 295 278 243 208 172 137 104 71 103 136 155 173 126 78 91 105 151 197 188 178 136 94 139 184
3136 184 197 209 201 193 251 309 308 308 308 308 233 159 128 208 286 299 246 193 180 168 156 144 177 209 132 55 67 79 156 234 261 287 203 120 113 107 133 159 158
3131 158 157 189 221 254 288 322 356 332 307 316 325 320 316 202 87 84 81 144 207 236 264 227 189 192 194 196 198 182 166 150 133 171 209 279 350 282 215 214 212 210 207
3126 207 205 203 147 91 141 190 196 136 112 199 286 307 263 218 240 261 249 238 238 238 238 238 245 251 258 265 278 291 272 252 243 234 290 347 298 248 198 149 146 142 205 267
3121 267 297 326 356 385 391 396 335 274 251 227 203 180 200 219 239 259 200 142 193 245 235 225 216 206 203 200 198 195 247 298 350 402 360 319 277 236 242 249 256 262
3116 262 198 133 134 135 209 283 247 210 203 196 254 313 272 231 190 149 201 254 306 359 366 374 315 257 256 255 254 254 214 174 201 227 259 290 322 354 315 276 303 330
3111 330 336 342 349 355 310 265 220 175 187 198 209 221 233 246 193 140 140 141 207 273 333 394 344 294 301 308 314 321 246 170 205 239 287 336 318 300 305 310 315 320 293 267
3106 267 240 213 191 168 146 123 256 389 411 434 362 291 223 156 170 251 357 352 244 136 130 125 215 304 328 351 295 239 249 259 261 263 198 134 121
3101 121 107 159 212 223 234 245 256 245 234 222 211 253 295 272 248 237 226 215 204 185 165 146 127 72 16 115 279 327 265 203 140 130 120 175
3097 175 231 245 260 274 289 270 251 233 214 275 336 331 326 250 173 162 151 186 220 255 290 221 152 149 146 157 168 179 190 243 297 196 96 165 233 302
3093 302 370 374 378 382 386 329 272 216 159 147 134 121 109 161 213 199 185 217 250 283 316 311 305 300 294 294 294 360 425 361 296 231 166 137 108 79 50 149 248 280
3088 280 313 313 314 314 314 327 340 287 233 159 84 76 67 101 135 104 72 81 91 101 110 157 204 251 298 323 349 375 401 402 403 404 405 341 278 214 151 117 83 115 146
3083 146 189 231 240 250 233 216 233 249 263 278 292 307 305 304 303 302 335 368 336 303 251 199 214 228 188 148 108 68 130 191 186 181 158 135 144 154 155 155 156 157 151
3078 151 145 140 134 208 282 355 429 381 333 285 236 269 302 335 367 340 313 221 128 113 98 194 289 295 301 241 181 164 147 129 112 84 55 137 218 182 145
3073 145 109 72 109 145 116 87 113 139 198 258 264 271 212 153 61 -29 -11 6 100 194 134 74 103 132 161 190 173 155 71 -12 16 45 140 234 224 214
3069 214 203 193 221 249 277 305 250 195 206 218 169 120 104 89 170 252 267 283 262 240 186 131 180 229 212 195 208 222 236 249 198 147 162 177 190
3065 190 203 217 230 225 219 213 208 169 130 123 117 78 39 65 92 70 48 26 4 32 61 89 117 98 78 58 39 32 26 85 145 190 234 213 191 153 115 142 170
3060 170 201 232 230 228 232 236 174 112 95 79 95 111 176 241 195 150 168 186 170 155 155 155 155 155 153 151 149 147 159 172 185 198 223 248 273 299 338 377 311 245 166
3055 166 153 213 273 286 299 312 325 315 305 294 284 264 245 221 197 225 186 118 51 91 131 110 88 81 140 194 249 209 170 69 -31 -23 49 152
3051 152 255 304 353 334 248 187 193 194 129 64 0 1 2 13 89 198 241 222 202 244 286 199 111 72 142 218 293 310 326 266 207 172 203 235 201 139
3046 139 142 225 307 284 261 250 239 228 217 226 234 218 136 61 53 113 173 171 169 168 166 161 157 153 148 163 178 193 208 188 168 148 128 108 88 68 48 67 86 105 124
3041 124 143 162 181 200 200 200 200 200 219 238 257 276 222 168 114 60 95 130 99 69 85 101 117 133 158 184 209 235 178 121 63 6 -39 -85 -22 41 102
3037 102 164 115 66 75 84 159 234 250 266 216 167 164 161 192 222 238 255 271 287 194 101 74 47 83 119 155 191 222 252 283 313 320 326 179 32 7 -17
3032 -17 23 64 102 140 244 347 320 294 234 174 160 146 165 184 201 217 233 249 224 198 239 279 326 373 355 336 269 202 245 289 298 307 284 260 260 259
3028 259 259 258 249 239 230 221 283 346 299 252 244 235 292 350 290 231 172 112 126 139 152 166 166 167 167 167 204 241 245 248 200 151 168 185 221 257 293 328 346 365 383
3023 383 401 355 310 297 284 305 326 281 236 260 285 277 269 241 214 252 290 322 354 320 287 327 367 341 315 350 385 388 390 324 257 341 424 480 469 426 514
3018 514 700 953 1290 1848 2580 3245 3392 2880 2019 1225 738 470 372 340 350 360 351 341 332 322 246 169 202 235 200 165 196 227 203 179
3015 179 155 131 188 246 303 360 376 392 408 424 345 266 186 107 104 101 99 96 84 72 94 115 194 273 286 299 297 295 260 225 182 139 129 119 130 141 86 30
3010 30 68 106 143 181 230 278 261 244 249 254 259 264 241 219 262 306 293 280 235 189 197 205 179 154 143 131 186 241 302 364 316 268 277 287 230 174 95 16 46
3005 46 77 65 52 73 93 82 70 59 47 63 78 93 109 113 117 121 125 112 100 71 174 295 284 245 206 223 239 190 140 135 130 59 -11 -3 4 45 86 124
3001 124 162 135 107 111 116 121 125 196 267 228 189 202 214 194 173 191 209 161 113 100 87 74 61 86 110 134 159 170 181 160 138 112 87 127 168 135 102
2996 102 69 36 114 193 205 218 208 198 221 244 197 150 104 57 92 127 162 197 192 187 182 178 238 298 330 295 241 186 164 142 158 239 317 395 383 371 326
2992 326 281 221 161 206 252 291 264 207 151 138 126 105 149 253 291 259 228 240 251 197 143 156 169 149 129 141 153 166 178 187 197 101 5 17 95
2987 95 111 62 -3 -2 22 47 44 42 40 37 89 140 126 111 179 247 247 180 123 132 205 279 322 299 247 196 226 256 220 185 235 286 312 272 274 343 370 287 233
2983 233 245 254 198 130 128 195 262 264 266 268 270 300 330 250 169 118 67 81 96 199 302 296 223 187 260 304 282 298 314 392 469 452 435 418 401 374 347
2978 347 320 294 337 380 314 247 231 214 243 207 144 212 313 413 482 551 620 689 710 730 857 984 1179 1309 1268 1096 879 728 685 642
2974 642 676 710 719 729 890 1182 1455 1507 1423 1273 1080 887 726 565 478 391 322 386 478 505 425 345 327 308 314 320 293 265 283 301 287 272
2970 272 264 257 316 375 407 439 405 371 382 393 404 415 400 385 479 574 720 867 1079 1291 1528 1765 1882 1868 1789 1776 1830 1951 2053 2089 2013
2967 2013 1805 1647 1708 1836 1963 1994 2024 1947 1803 1755 1840 1949 1927 1722 1451 1210 968 830 692 620 547 532 517 502 486 436 385 389 393
2963 393 364 335 306 277 292 307 289 271 244 217 267 317 318 319 352 386 396 405 448 491 535 580 625 669 727 785 1007 1230 1464 1699 1742 1566 1288
2959 1288 1077 947 882 852 887 897 908 979 1183 1455 1595 1562 1397 1198 1000 878 756 680 537 398 390 483 511 441 370 359 348 277 337
2956 337 420 437 374 378 451 392 290 254 294 333 293 253 268 283 250 216 260 304 249 194 215 237 220 203 240 278 263 248 311 373 318 263 263 263 233 204
2951 204 273 342 354 365 422 413 330 379 464 483 426 370 390 410 359 374 485 464 352 306 377 382 309 301 433 498 397 296 334 372 308 244 264 350
2947 350 408 466 561 546 425 370 476 582 560 473 455 438 399 359 397 434 380 327 376 425 401 444 588 622 504 386 434 547 619 691 859
2943 859 961 891 821 805 790 687 650 733 751 601 451 506 561 455 349 370 458 473 488 540 592 536 481 507 533 466 464 608 643 515 387
2939 387 505 623 551 480 529 579 489 400 559 718 706 628 689 816 760 638 663 753 759 764 866 901 726 550 585 687 652 618 789 960
2936 960 913 756 801 956 968 870 898 992 923 787 796 915 917 919 1049 1178 1030 883 963 1153 1136 1010 1054 1163 1081 934 966 1108 1097 955
2932 955 1010 1196 1194 1061 1127 1259 1186 1112 1240 1433 1416 1268 1312 1489 1447 1273 1304 1468 1386 1303 1470 1702 1581 1327 1356 1516 1481 1314
2929 1314 1389 1596 1554 1380 1530 1811 1797 1562 1652 1961 1967 1754 1744 1954 1908 1731 1833 2156 2160 1944 2008 2292 2307 2014 2002 2297 2301 1997
2925 1997 1984 2279 2338 2177 2297 2724 2856 2680 2752 3043 2997 2643 2646 3044 3146 2851 2843 3230 3323 3021 3004 3383 3435 3091 3198 3789 3981
2922 3981 3689 3684 4162 4304 3964 3947 4502 4672 4359 4414 4953 5117 4621 4538 5114 5407 5129 5340 6210 6528 6010 5949 6635 6860 6249
2919 6249 6177 7027 7532 7201 7415 8551 9067 8659 8900 10327 11157 10800 11234 12943 13847 13300 13660 15734 17158 16956 17754 20529
2916 20529 22491 22564 24131 28378 31569 32519 35924 43767 51021 56648 68648 91151 119384 161550 247806 389041
2914 389041 530304 580023 500402 348486 214028 136044 95119 65928 45719 37156 32801 25941 19966 18606
2913 18606 18185 15083 12061 11983 12213 10202 8162 8452 8896 7362 5828 6183 6737 5752 4744 5363 6069 5325 4504 5046 5680
2910 5680 5041 4380 4993 5612 5044 4344 4743 5246 4651 3896 4239 4835 4597 4210 4659 5211 4929 4476 4770 5146 4688 4094 4335
2907 4335 4801 4609 4284 4706 5233 5101 4853 5264 5824 5724 5341 5529 5821 5542 5085 5198 5460 5239 4832 4996 5352 5225 5037
2904 5037 5333 5778 5826 5804 6266 6886 6936 6774 7008 7303 7026 6574 6605 6900 6975 7019 7547 8349 8756 8820 9016 9240 9067 8728 8608
2901 8608 8603 8466 8453 9011 9684 9874 9847 10128 10546 10656 10506 10577 10795 10882 10959 11344 11884 12358 12906 13673 14313 14557 14725 15200 15724
2898 15724 16117 16711 17613 18606 19599 20979 22843 24684 26526 29071 32451 36290 41140 48516 59101 74257 98949 138153
2896 138153 185926 221218 222890 190416 144803 108253 86866 74777 67919 67509 73473 83809 102012 135921 184025
2894 184025 226310 237084 208547 157992 110721 79404 61195 49357 41195 36417 33518 31014 29065 28214 27694
2892 27694 26602 25505 25243 25366 25269 25268 25926 26821 27320 27729 28534 29432 30198 31184 32565 33771 34757 36170 38242 40473 43013
2890 43013 46774 51810 57324 63849 73398 86595 103841 130008 172261 227917 277152 295755 277432 240959 215708
2888 215708 221090 256310 301506 328805 320197 282830 245331 235761 260250 300495 328303 323738 288628 247862
2886 247862 233334 256732 296084 313236 286748 227711 164411 117085 88086 70174 57578 48708 42958 38932
2885 38932 35391 32343 30218 28918 27925 27151 26598 26250 25903 25714 25921 26353 26653 26800 26946 27194 27574 28358 29626 31130 32503
2882 32503 33732 35094 36790 39234 42837 47540 53044 60087 70044 83825 104247 138689 192859 256742 301134 298809
2880 298809 251335 188699 140396 112880 97349 88894 89508 98429 112708 137667 184095 248146 301164 310190 268241
2878 268241 199879 137173 95167 70147 53784 42469 35593 31327 27456 23785 21125 19328 17399 15247 13666
2876 13666 12868 12070 11113 10727 11000 11273 10978 10552 10389 10007 9135 8264 7816 7367 6815 6571 6892 7346 7531 7716 8262 8587 8314
2874 8314 7821 7512 7071 6153 5236 4824 4631 4216 3800 3786 3903 3644 3385 3470 3686 3564 3311 3469 3847 3868 3757 3924 4091 3847
2871 3847 3471 3381 3422 3099 2775 2789 3023 2923 2692 2702 2932 2934 2804 2966 3259 3188 2985 3112 3371 3298 3092 3249 3714 3943 4041 4404
2867 4404 4768 4566 3968 3609 3558 3295 2900 2839 3085 3160 3168 3574 4287 4593 4327 3984 3642 3082 2522 2380 2457 2249 1908 1881 2161
2864 2161 2155 1842 1776 2018 2013 1788 1767 1965 1963 1741 1679 1836 1785 1602 1694 2006 2016 1718 1612 1814 1791 1461 1417 1681 1746 1504 1460 1723
2861 1723 1785 1540 1492 1752 1913 1766 1850 2330 2635 2544 2370 2329 2131 1713 1559 1800 1986 1865 1902 2248 2531 2507 2577 2778 2679 2184
2858 2184 1876 1963 1959 1647 1444 1638 1724 1502 1390 1585 1729 1477 1340 1511 1616 1414 1278 1449 1561 1365 1318 1578 1765 1557 1348
2855 1348 1535 1719 1596 1478 1667 1776 1578 1445 1620 1693 1459 1290 1429 1600 1463 1326 1496 1686 1568 1450 1640 1746 1545
2852 1545 1398 1647 1801 1560 1324 1484 1673 1554 1441 1636 1826 1708 1586 1770 1951 1735 1580 1821 2115 2013 1857 2008 2298
2849 2298 2280 2191 2410 2533 2261 1984 2102 2347 2196 1946 2004 2126 1939 1698 1852 2078 1909 1684 1768 1942 1808 1675 1849 2084
2846 2084 2011 1867 2030 2296 2167 1928 2085 2395 2397 2207 2324 2570 2507 2335 2471 2622 2467 2256 2441 2690 2544 2288 2427 2676
2843 2676 2530 2268 2490 2887 2889 2666 2750 3068 3077 2933 3097 3389 3374 3150 3322 3651 3584 3325 3374 3692 3615 3262 3218 3382 3328 3152 3284
2840 3284 3608 3536 3179 3218 3516 3507 3223 3246 3545 3624 3412 3508 3793 3770 3461 3548 3921 3899 3569 3547 3921 3986 3755 3832 4293 4447 4265
2837 4265 4304 4679 4747 4502 4477 4783 4871 4639 4627 4958 5069 4840 4830 5240 5431 5341 5472 5864 5949 5643 5646 6077 6200 5922 5952 6406 6641
2833 6641 6409 6396 6854 7091 6884 6808 7125 7223 6936 6869 7351 7701 7623 7677 8131 8366 8144 8143 8616 8870 8640 8543 8986 9298 9176 9274
2830 9274 9950 10494 10454 10480 11033 11454 11362 11403 12093 12783 13084 13517 14577 15572 15846 16055 16824 17593 17864 18134 19040 19946 20107 20269
2827 20269 21185 22322 22964 23606 25031 26675 27724 28904 31214 34008 35989 37575 40154 43567 46641 50197 56676 66627
2825 66627 78842 95671 124829 171962 232213 290751 332039 347177 333574 293470 236553 180208 140986 123167
2823 123167 119251 123289 140259 179071 238197 301850 349747 366836 346792 293919 224279 159254 112705 84394
2822 84394 66697 54757 47570 43767 41091 38810 37707 37352 36431 35291 35043 35542 35596 35431 35913 36528 36390 36120 37056 38651
2819 38651 39405 39852 41355 43430 44823 46348 49766 54370 57853 60502 64714 70376 75572 81514 92334 109086 130036
2817 130036 159819 211636 293821 395954 492944 560866 585147 558811 484702 382381 284850 218687 187462
2815 187462 177620 180040 200901 251691 331966 423976 500477 536414 517573 447269 347147 247683 171313 122498
2814 122498 92740 72959 59392 50966 45601 41159 37259 34282 31920 29690 27712 26394 25472 24549 23545 22540 21607
2812 21607 20806 20479 20547 20616 20376 19903 19211 18236 17328 17005 17253 17494 17515 17477 17439 17258 17077 17266 17676 17819 17742 17810 18010 18172 18553
2809 18553 19398 20022 19669 18744 18157 17966 17522 16859 16588 16714 16669 16492 16651 17207 17564 17702 18251 19107 19640 19865 20424 21291 21867
2806 21867 22311 23260 24605 25500 25911 26533 27375 27734 27697 28193 29348 30371 31263 32849 35007 36796 38102 39666 41538 43058
2803 43058 44270 46133 48830 51604 54598 58836 64612 71416 79845 91705 108530 131459 162342 202999 251698 302599
2801 302599 348271 381992 398353 395047 375964 350824 330827 325238 340174 376402 426209 475171 508971 518052
2800 518052 498172 450989 385303 314138 248115 192133 148150 117151 97182 83719 73639 66710 62550 59017
2798 59017 55352 53211 52960 52555 51052 50413 51401 51949 51223 51357 53292 54777 54548 55106 57906 60596 61836 64202 69073
2796 69073 73593 76134 80125 87851 96236 103786 115479 135214 160591 194537 253446 346591 448597 509159 498424
2794 498424 436137 370983 338922 345092 375829 418448 469549 529457 588529 621661 603857 536074 451108 388451
2792 388451 365743 375145 399972 426316 442419 437959 408580 359051 299457 239603 186648 144648 114382 93881
2790 93881 80104 70535 63999 60039 57793 55597 52917 50766 50064 49917 49639 50146 51840 53193 53272 54046 56797 59565 60883
2788 60883 63514 69968 77790 84689 94460 111130 132212 157645 201025 276179 370424 446342 477160 469876 446380
2786 446380 413874 366168 306288 253660 229378 241656 282280 329815 360255 363067 346498 321310 285267 232141
2785 232141 170358 119677 89608 72248 58096 47125 41648 38430 33761 29362 27907 27529 25701 23856 24165 25206
2783 25206 24798 23763 23739 24022 23295 22535 22961 23686 23400 22833 23102 23750 23826 23801 24347 25148 25949 26917 28369 30115 32344 35265
2780 35265 38670 42964 49324 58227 70339 90839 127644 178183 220855 229528 199131 151144 111727 90211 80692
2778 80692 77349 81960 100011 132257 168366 188785 178204 140859 97948 67299 49843 37705 27962 22570 20429
2776 20429 17804 14536 13246 13563 12693 10718 9931 10331 9720 8176 7818 8574 8495 7521 7469 8255 8031 6922 6736 7569 7655 6703
2774 6703 6323 6807 6808 6106 6063 6696 6581 5698 5562 6271 6322 5460 5082 5424 5370 4624 4449 4977 5022 4270 3914 4261 4212 3521 3313
2770 3313 3808 3908 3376 3240 3736 3836 3217 2993 3505 3710 3283 3164 3713 3955 3559 3472 4018 4257 3788 3450 3618 3566 3041 2825
2768 2825 3215 3385 3012 2858 3272 3466 3022 2799 3133 3247 2817 2607 2914 3088 2684 2411 2739 3068 2943 2950 3421 3673 3283 2893
2765 2893 3019 3078 2679 2411 2627 2776 2515 2386 2766 3014 2752 2489 2786 3083 3006 2994 3417 3709 3437 3166 3253 3274 2840 2539 2725
2762 2725 2910 2687 2464 2651 2838 2652 2466 2765 3065 2992 2918 3404 3890 3905 3788 4097 4472 4559 4711 5248 5654 5327 4691 4306
2759 4306 3987 3384 2848 2809 2903 2693 2483 2658 2966 2907 2782 3033 3285 3167 3048 3338 3760 3955 4084 4512 5072 5365 5791 6657
2756 6657 7457 7528 7028 6745 6858 7144 7430 7502 7090 6170 5382 5275 5476 5600 5944 6872 8021 8708 9087 9400 9406 8834 8195 7949
2753 7949 7703 6837 5664 4893 4518 4022 3394 3097 3021 2747 2340 2221 2321 2180 1974 2101 2360 2387 2283 2610 3157 3342 3130
2750 3130 2899 2799 2547 2228 2263 2606 2785 2744 2704 2665 2377 2023 1897 1990 1928 1734 1815 2028 1999 1839 1860 2013 1930 1715 1712 1929 1870
2747 1870 1592 1534 1784 1869 1734 1739 1876 1859 1711 1705 1918 1940 1742 1700 1878 1847 1685 1674 1796 1769 1611 1642 1892 1951 1789 1769 1968 2052
2743 2052 2004 2042 2301 2446 2592 3005 3726 4211 4301 4260 4219 3878 3318 2954 2898 2902 2775 2790 3113 3452 3791 4106 4421 4292 3766 3241
2740 3241 2935 2560 2186 2106 2246 2252 1949 1773 1817 1855 1674 1622 1789 1951 1893 1784 1807 1825 1711 1768 1957 2004 1830 1687 1764 1786 1676
2737 1676 1650 1756 1769 1563 1444 1632 1766 1680 1630 1711 1727 1611 1602 1813 1985 2025 2250 2782 3196 3303 3301 3299 3091 2663 2356 2357 2467 2358
2733 2358 2307 2563 2948 3202 3482 3762 3809 3461 2950 2659 2461 2132 1876 1840 1826 1680 1573 1687 1751 1683 1637 1722 1796 1650 1520 1609
2730 1609 1698 1568 1513 1679 1839 1779 1638 1629 1670 1490 1297 1324 1405 1354 1227 1232 1302 1241 1201 1292 1384 1344 1280 1349 1357 1233 1100 1187 1383 1360 1261
2726 1261 1294 1328 1229 1154 1298 1503 1576 1558 1673 1726 1648 1547 1665 1783 1681 1533 1516 1565 1483 1392 1522 1601 1549 1493 1569 1699 1610 1502 1614
2723 1614 1726 1618 1502 1606 1814 1890 1819 1969 2267 2433 2566 2830 3197 3432 3496 3560 3556 3331 3035 2957 2991 2959 2943 3147 3456 3546 3408
2719 3408 3269 3101 2713 2286 2079 2020 1829 1475 1341 1402 1397 1272 1214 1276 1339 1311 1414 1526 1506 1380 1385 1500 1483 1328 1305 1435 1433 1297
2716 1297 1292 1400 1442 1381 1386 1461 1470 1379 1419 1573 1595 1510 1557 1714 1739 1625 1642 1783 1925 1981 2169 2488 2808 3070 3464 3924 4252 4459 4666
2713 4666 4841 4707 4323 3938 3754 3702 3674 3778 3971 4163 4250 4337 4317 3901 3261 2620 2254 1888 1593 1518 1635 1621 1492 1364 1381 1398
2709 1398 1341 1283 1418 1421 1281 1273 1468 1663 1616 1569 1721 1872 1873 1874 1950 1894 1706 1518 1475 1433 1353 1274 1348 1422 1359 1297 1432 1567 1600 1634 1821
2706 1821 2008 2129 2250 2648 3047 3349 3519 3602 3464 3126 2787 2484 2312 2248 2404 2809 3215 3373 3400 3338 3057 2611 2165 1991
2703 1991 1817 1649 1481 1512 1542 1405 1267 1328 1388 1272 1156 1150 1143 1056 969 992 1014 1023 1031 1039 1048 959 870 978 1087 1046 1006 1075 1144 1137 1129 1232 1334
2699 1334 1234 1135 1115 1227 1227 1226 1300 1374 1478 1582 1830 2079 2206 2180 2067 1844 1585 1436 1426 1415 1395 1529 1845 2096 2099 1949 1813 1611
2695 1611 1291 1036 1005 1083 1044 939 947 1021 973 858 858 924 936 949 965 982 840 699 799 899 869 838 918 997 984 972 1025 1144 1122 989
2691 989 948 972 899 760 747 844 908 862 844 892 905 852 866 945 977 942 949 956 845 733 776 819 788 757 791 826 783 740 762 785 768 752 736 719
2687 719 740 761 848 934 844 754 774 793 791 789 853 916 892 869 911 953 918 883 914 945 894 842 900 959 985 1012 1039 1065 977 888 910 931 842 752 816 880
2683 880 832 784 803 887 888 780 781 893 905 852 864 942 931 810 835 969 994 821 739 810 861 802 779 865 937 899 856 879 866 788 792 906 926
2679 926 835 778 831 854 768 747 836 893 840 787 844 880 807 736 775 810 779 748 783 799 705 613 631 682 700 739 779 756 667 694 832 904 778 642
2675 642 616 608 600 624 714 736 692 711 796 810 714 656 752 794 726 724 831 905 825 741 812 894 823 690 712 814 850 826 868 910 886 830 839 879 854
2670 854 800 857 918 868 819 880 956 922 826 839 889 873 826 846 878 845 784 833 912 880 810 807 822 771 721 736 739 676 649 732 790 694 597 654 759
2666 759 731 644 688 812 870 862 920 937 822 707 724 832 874 808 742 740 738 724 776 869 831 768 771 784 796 767 804 905 875 772 735 772 743 652
2662 652 627 711 796 819 842 783 723 726 728 742 691 626 694 796 766 670 707 777 715 633 617 677 738 769 800 822 843 795 747 755 697 627 689 800 778
2658 778 689 665 720 709 637 630 684 738 686 635 677 720 697 673 676 679 645 610 614 551 481 542 636 664 631 663 756 784 745 773 864 890 847 803 786 768 717
2653 717 666 701 737 706 675 750 825 830 835 818 736 645 687 779 805 730 720 828 936 894 852 824 796 769 741 780 819 793 766 788 811 723 635 637 638 640
2649 640 642 728 815 748 681 744 806 758 710 726 741 757 773 781 790 755 786 833 771 672 638 689 739 728 716 803 891 824 757 797 836 809 782 752 721 690
2644 690 659 712 765 752 739 759 778 688 597 713 828 834 839 847 855 797 738 774 809 734 660 718 776 724 673 732 792 786 779 754 729 704 678 672 666 660 654 741 828
2640 828 805 782 767 752 737 722 771 820 760 699 702 705 707 710 760 810 750 690 644 598 551 505 552 599 536 473 594 715 682 650 644 638 633 627 722 816 757 698
2635 698 745 792 730 667 739 811 773 735 756 777 733 688 783 878 886 783 726 734 699 664 708 752 730 709 770 831 805 669 619 635 607 579 670 761 742
2631 742 723 771 820 783 636 605 685 732 714 744 774 737 701 723 810 864 807 771 845 912 869 797 724 711 698 742 787 765 744 724 705 685 666 697
2627 697 728 654 579 622 731 761 682 678 784 824 754 707 771 831 781 764 812 818 715 657 709 795 815 785 754 720 685 655 626 662 698 735 771 704
2622 704 638 601 675 752 720 666 677 645 613 635 658 685 712 707 769 796 713 674 744 813 771 655 605 621 637 700 764 827 781 715 715 737 760 826 892
2618 892 892 893 842 791 741 690 627 563 566 568 584 599 581 564 639 714 723 731 734 737 740 742 734 726 717 709 768 826 841 746 651 622 614 607 628 650 638 626 628 630 606 581 578 684
2613 684 765 781 795 810 758 707 676 711 714 608 536 618 714 744 734 790 871 842 773 769 832 894 884 874 798 722 712 702 692 682 646 611 582 554 547 651
2608 651 725 690 678 733 749 655 548 594 722 741 683 691 762 767 704 706 734 762 737 713 754 795 773 752 730 708 715 722 729 736 764 793 821 850 839 827 816
2604 816 805 721 637 663 689 651 613 685 757 730 703 709 715 762 809 823 837 793 749 771 793 772 751 730 708 647 585 590 594 636 678 654 631 621 612 636 660
2599 660 678 695 724 687 649 721 801 815 755 761 792 823 846 870 896 813 657 611 694 778 796 815 801 787 766 745 768 725 655 695 768 731 658 650 709
2595 709 767 726 685 711 736 744 753 762 770 768 766 763 761 753 744 769 793 760 726 759 791 770 749 761 773 764 755 746 736 721 705 756 806 734 662 656 650 646 643 705 768 729 689
2590 689 716 742 717 692 700 708 726 743 760 778 717 657 707 756 788 820 827 768 695 687 784 816 779 742 811 880 784 688 658 628 622 616 716 816 798 713 666
2585 666 619 583 547 577 607 572 537 612 688 647 606 631 656 677 698 719 740 679 619 668 717 695 672 650 628 555 483 527 638 682 726 775 823 792
2581 792 762 731 700 677 653 633 613 559 571 655 739 651 562 546 596 623 649 680 710 707 703 740 712 628 610 704 799 748 697 752 807 765 657 630 713
2577 713 741 703 672 707 708 709 714 719 728 737 746 755 673 592 539 552 535 518 574 695 716 670 666 662 667 673 678 683 607 530 522 580 611 576 544 579 624 669 718 767 767 766 700
2572 700 634 596 558 674 789 747 705 663 621 585 550 624 699 678 658 660 727 756 675 619 628 632 571 572 639 670 590 539 555 577 599 625 651 678 706 733
2567 733 761 795 830 798 767 735 703 672 640 652 665 677 689 598 506 524 542 563 584 605 626 669 711 688 665 642 619 596 573 519 465 477 489 508 527
2563 527 480 433 408 382 467 551 570 589 607 626 639 651 659 668 660 586 549 622 727 766 784 801 730 658 652 646 650 655 593 532 547 563 578 593 605 616 627 638
2558 638 680 723 656 589 619 649 679 708 707 705 704 702 686 670 654 638 658 677 697 717 708 699 690 680 702 723 744 765 736 706 677 648 588 529 469 410 465 520
2554 520 576 631 628 626 623 621 617 613 610 606 594 582 570 558 547 535 524 513 496 479 528 577 647 717 720 724 700 677 653 629 615 601 588 574 623 673 722 771 732 692
2549 692 653 614 578 543 574 604 612 620 624 628 630 567 538 619 688 647 572 563 602 641 619 596 632 668 704 740 718 695 673 650 626 602 544 487 487 488 510 598 671
2544 671 634 561 598 695 682 584 486 550 615 569 524 539 554 569 584 550 516 482 449 494 539 617 695 727 758 723 688 711 733 690 646 604 562 520 479
2540 479 531 583 660 737 787 705 550 462 485 509 537 565 603 640 644 648 695 741 721 701 651 601 550 500 530 560 623 686 696 706 651 595 662 729 762
2535 762 796 823 850 811 772 802 832 829 826 832 839 780 721 705 689 640 591 631 670 677 684 756 828 747 666 646 625 671 717 731 746 695 644 669 695 687 680 720 761
2531 761 768 776 820 865 755 646 658 670 715 760 732 704 643 582 609 636 597 558 604 650 696 742 724 706 689 671 681 691 668 645 597 549 567 584 685
2526 685 786 777 768 723 677 565 453 492 531 570 609 617 625 633 641 616 592 534 477 542 606 605 604 638 671 672 672 706 741 709 677 775 872 816 760 756 752 748 745 723
2521 723 702 681 659 684 708 666 624 625 626 626 627 617 607 597 587 645 703 651 599 595 591 588 584 583 583 583 583 607 632 656 681 660 640 620 600 635 670 706 741 740 738 704
2516 704 670 746 822 788 755 725 695 665 636 679 722 699 676 698 720 750 649 582 514 505 495 527 558 589 621 682 744 695 647 654 660 667 673 730 786 776 766
2512 766 755 745 734 724 695 667 638 610 614 618 623 627 606 586 565 545 571 598 624 651 672 693 604 515 495 476 567 657 671 684 632 580 613 646 613 580 619
2507 619 658 632 605 554 502 484 466 532 599 600 601 584 566 582 598 615 633 651 668 678 689 699 709 684 659 601 543 503 463 489 515 587 660 699 739 740
2503 740 741 633 524 501 478 455 432 496 560 559 557 537 518 564 610 641 673 638 604 557 511 531 551 566 581 563 545 587 629 605 581 588 595 603 610 598 587
2498 587 608 630 671 712 688 663 688 713 705 697 686 675 664 653 658 663 646 563 499 545 628 645 658 671 679 688 672 657 751 845 822 798 774 750 794 837 852 801
2494 801 784 768 748 727 653 578 499 487 517 548 479 411 459 618 739 707 611 581 571 560 544 527 515 503 516 595 707 753 713 673 566 460
2490 460 417 440 459 477 502 526 588 584 588 593 635 610 570 596 646 697 639 582 558 533 595 656 693 664 624 649 699 749 732 715 698 681 643 605 599 594 654
2485 654 714 705 630 566 568 632 630 609 588 596 603 583 562 546 530 496 529 566 537 474 478 507 535 559 582 647 645 605 631 689 682 580 544 621 697 667 636 639 642
2480 642 635 629 623 617 612 608 608 608 627 711 821 820 693 566 505 510 518 525 536 547 512 478 509 540 599 659 722 720 676 632 649 667 641 615 618 687 775 863 843 756
2476 756 628 566 573 579 584 588 559 531 538 546 557 569 598 692 750 697 563 494 492 489 459 429 509 589 579 569 559 550 566 582 598 615 626 636 647 658 667 676 685 694
2471 694 704 714 733 685 588 557 595 632 593 554 547 541 535 529 523 518 490 461 499 537 557 577 597 617 617 618 618 619 615 611 546 480 454 494 538 517 458 465 578 624 538
2466 538 451 473 561 640 654 642 631 594 557 586 615 615 614 646 679 689 699 746 727 655 584 618 652 641 630 620 609 549 489 582 676 700 723 747 771 768
2461 768 766 763 761 712 664 615 566 580 593 606 619 585 550 581 612 559 505 518 530 559 587 583 579 558 538 584 630 682 734 639 544 487 540 605 604 528 519 577
2457 577 636 640 643 646 649 653 657 662 666 702 738 775 811 801 791 814 837 740 643 656 668 690 711 667 623 559 494 584 674 655 636 584 532 529 526 589 652 627 601 576
2452 576 550 611 672 667 662 623 583 610 636 631 626 621 615 555 496 545 661 733 695 657 619 629 639 648 658 627 595 564 532 471 410 434 568 679 680 641 601
2447 601 617 633 682 731 729 727 724 722 704 686 734 782 764 746 728 710 632 553 584 616 624 633 608 584 539 494 559 624 594 564 600 636 661 686 678 670 656 641 660
2442 660 679 657 634 579 523 477 432 496 560 611 662 604 545 485 426 518 677 722 635 487 471 545 619 635 652 590 528 576 624 646 667 622 578 568
2438 568 559 582 605 610 615 620 625 551 478 470 463 476 489 535 581 562 542 555 568 568 568 600 633 606 580 582 585 620 590 518 578 667 690 692 695 689 683 678 672 639 607 575 542
2433 542 546 550 542 599 702 673 612 551 583 615 581 547 568 589 610 630 611 592 573 554 559 565 570 576 611 646 714 782 754 726 632 538 545 551 591 630 645 660 675
2428 675 690 686 682 645 608 536 464 502 539 596 652 638 625 588 485 420 464 520 510 503 562 624 620 583 612 677 676 650 624 653 683 679 676 658 640 622 604 640
2424 640 676 646 617 667 718 703 687 648 608 536 463 529 594 594 593 623 653 617 581 580 579 578 577 551 525 532 539 590 642 628 613 651 689 660 632 578 525 537 549
2419 549 573 597 589 580 584 587 555 633 781 820 729 639 658 678 698 718 780 842 749 657 647 638 628 618 650 682 649 615 579 543 540 537 499 460 487 515 515 515 548
2414 548 581 562 544 460 375 468 560 586 612 639 666 583 500 512 524 602 679 662 644 626 608 570 532 493 455 485 515 545 575 603 631 593 555 527 500
2410 500 506 511 568 625 573 520 612 703 685 667 659 650 642 633 620 606 526 447 451 455 459 464 488 512 537 561 572 583 593 604 562 520 477 435 470 506 541 576 576 576 543
2405 543 510 479 448 483 518 561 605 582 559 593 627 660 694 778 862 792 722 646 569 559 549 536 523 544 564 596 628 659 691 694 697 635 572 593 613 634
2400 634 655 629 603 577 551 568 585 598 611 622 567 457 413 480 547 562 578 619 659 600 541 575 608 569 529 543 622 651 614 567 586 634 616 587
2396 587 559 559 559 508 457 446 501 538 575 560 546 557 569 580 591 658 725 672 552 518 593 695 730 714 697 676 655 689 723 680 637 626 614 602 591
2392 591 599 607 615 624 660 696 733 769 762 754 714 673 698 722 706 625 544 462 439 481 559 637 603 569 544 585 598 544 524 571 648 726 709 625 542 524 600 676
2387 676 717 691 650 608 563 518 532 547 561 576 621 666 617 568 548 595 642 623 608 594 576 557 576 596 615 635 674 713 654 594 582 570 562 554 603 717
2383 717 762 697 641 650 693 736 721 705 620 535 513 602 698 729 721 713 668 623 584 546 540 535 571 607 567 526 527 527 528 529 500 472 521 569 565 561 557 553 595 637 679
2378 679 721 708 694 681 667 670 672 674 677 593 510 548 586 635 685 635 520 484 559 684 699 622 545 561 576 585 595 571 548 592 637 681 725 657 588 552
2373 552 516 564 612 561 510 523 536 549 562 545 527 509 491 500 508 516 525 541 558 574 591 614 637 659 682 640 597 555 512 575 637 666 695 708 721 643 565
2369 565 503 573 643 581 529 477 487 497 551 671 766 730 693 722 747 706 620 600 649 697 651 605 668 732 699 666 633 600 595 589 584 578 550 522 603 685
2365 685 713 741 769 797 739 681 623 566 534 502 536 570 572 573 574 575 605 635 666 696 688 680 673 665 649 633 683 733 705 676 714 751 750 750 683 616 596 576 623 669
2360 669 693 717 714 579 413 379 460 542 558 575 592 609 584 560 601 643 635 627 685 743 718 694 669 644 586 528 581 633 663 693 723 753 691 629 633 637
2355 637 645 653 594 536 578 620 728 836 795 753 712 671 643 616 592 569 492 482 584 687 712 671 631 656 656 656 660 664 644 625 605 586 599 612 563 514
2351 514 487 526 569 546 460 441 490 539 541 542 609 676 703 730 794 792 734 675 617 559 497 501 575 583 503 489 583 678 639 534 539 610 650 689 726 763 717
2346 717 562 469 485 550 548 525 501 533 564 596 627 601 574 548 522 525 528 592 657 639 556 472 454 539 623 668 602 479 422 475 527 511 494 478 462
2342 462 459 456 416 442 487 532 581 630 594 558 484 477 540 602 607 612 613 680 747 748 713 679 641 603 633 663 694 724 673 622 571 519 534 549 502 455 375 362
2337 362 378 393 352 311 387 529 592 656 719 783 763 677 590 570 611 652 697 742 673 604 498 458 500 542 588 635 691 747 737 661 612 674 772 805
2333 805 697 590 591 658 685 647 584 630 720 743 701 658 644 630 653 610 585 560 531 501 470 438 512 586 590 528 532 602 648 694 678 661 682 703 761
2329 761 753 706 658 610 562 462 428 550 672 712 686 656 692 710 662 614 632 647 596 545 559 578 531 526 520 559 598 636 675 656 637 618 599 612 624
2325 624 636 649 632 616 661 706 735 698 656 681 690 634 582 595 610 624 639 653 637 556 536 582 649 651 591 597 636 675 652 629 678 727 710 693 685 678 671 663
2320 663 683 704 662 621 620 686 752 751 687 623 620 618 672 726 714 702 665 627 656 684 734 783 832 881 817 752 753 755 748 741 693 711 713 649 585 587 618 583 523 463
2315 463 468 473 506 606 739 873 894 850 758 667 539 476 481 552 627 636 597 558 581 604 561 518 504 555 591 626 600 573 588 603 618 633 655 677 694
2311 694 712 737 695 691 687 658 630 601 573 513 453 422 456 533 609 580 551 558 564 608 586 510 434 467 566 633 634 611 587 570 552 596 641 645 584 498 521 580
2306 580 639 595 550 572 594 616 637 618 599 646 693 747 801 789 776 692 607 632 657 655 653 585 517 514 510 540 569 608 646 684 723 746 769 727 684 679 673 727
2302 727 781 801 711 580 514 512 509 543 578 572 567 583 666 728 681 572 573 646 720 690 661 690 720 683 647 651 654 658 661 621 580 540 499 584 669 600 531 499
2297 499 466 544 621 636 650 632 613 581 548 548 548 602 656 676 697 670 643 615 588 543 497 452 406 446 486 526 565 564 563 561 560 604 648 691 735 784 832 771
2292 771 710 675 640 604 569 573 577 580 584 644 704 698 692 712 733 754 775 750 726 701 676 656 636 616 596 606 616 626 636 616 596 575 555 554 553 552 551 565 579 594
2287 594 608 631 653 610 567 605 644 617 590 618 646 608 569 626 682 629 576 580 584 588 593 608 624 640 655 685 714 678 641 658 676 627 578 562 547 597 647
2283 647 722 797 806 815 944 1074 1138 1202 1179 1156 1068 979 917 854 825 795 779 763 715 666 688 710 732 754 733 712 659 605 681 758 680 602 580 558 536
2279 536 514 523 532 542 551 537 522 508 494 532 570 607 645 626 606 587 568 602 637 606 575 601 627 620 613 654 695 703 711 740 770 774 713 658 669 675 616 579 542
2274 542 501 460 486 512 472 432 453 474 495 516 590 665 670 610 592 639 645 651 658 665 673 680 697 713 664 615 617 618 620 622 639 656 673 690 692 694 630 566 548 531 517
2269 517 504 541 644 710 666 588 577 591 605 621 702 747 681 582 548 536 524 496 468 505 543 580 617 654 691 692 693 695 696 666 637 713 790 870 885 870
2264 870 856 793 731 668 605 646 686 726 767 755 744 732 721 762 803 778 753 801 849 873 831 775 785 753 722 683 644 610 575 569 629 689 683 605 527 555
2260 555 582 655 728 772 751 750 749 744 739 804 869 934 999 962 925 887 850 855 861 932 1003 1021 1038 1056 1073 1153 1232 1312 1391 1473 1555 1641 1728 1760 1859 2058 2476
2255 2476 3096 4022 5422 7304 9226 10488 10432 9103 7096 5155 3696 2721 2086 1671 1415 1225 1090 1020 984 947 858 770
2253 770 747 724 759 794 828 863 780 696 679 661 697 733 768 804 775 746 783 820 773 725 744 762 739 717 694 671 674 677 680 683 661 640 618 596 635 674 712
2248 712 751 760 768 627 486 497 573 625 546 507 534 619 638 670 701 728 755 713 671 630 588 594 599 584 503 421 470 595 720 706 693 679 665 685 704
2244 704 657 611 607 603 599 595 560 524 598 673 754 835 806 777 706 636 632 628 639 650 596 541 475 410 352 295 288 413 539 532 546 560 565 571 510 450 499 548 536
2239 536 524 511 499 505 511 516 522 541 559 577 596 549 502 522 541 554 566 579 591 622 652 683 713 739 765 792 818 757 696 701 706 740 773 741 709 675 642 674
2235 674 707 686 664 709 754 746 738 730 722 709 696 682 669 600 531 616 701 645 590 535 479 516 553 655 758 700 642 583 525 563 601 639 677 662 648 634
2230 634 619 614 608 602 596 529 461 504 546 549 551 554 556 529 501 539 578 542 507 472 436 509 583 590 597 541 485 495 504 569 634 699 763 723 683 643 604 562 521 545
2225 545 570 602 634 666 698 684 669 721 772 718 664 610 556 586 616 646 676 656 636 616 596 611 627 643 659 658 658 657 657 615 573 532 490 523 555 588 621
2221 621 636 650 665 680 632 584 646 708 750 791 767 742 676 609 608 608 611 615 618 622 575 528 547 565 567 568 569 570 584 597 611 625 593 562 596 631 624 617 610 603 575 548
2216 548 586 625 611 598 651 704 661 619 643 733 816 790 763 736 695 653 611 570 580 590 601 611 630 648 667 685 689 693 696 700 689 679 669 659 618 577 536
2211 536 495 490 486 544 602 630 592 554 582 625 668 711 754 743 666 590 579 616 653 628 604 587 570 553 536 573 610 647 683 686 688 691 693 650 607 630 653 645
2206 645 637 629 621 563 506 554 602 632 597 557 582 624 599 615 631 579 528 501 539 550 494 479 464 495 525 552 578 550 456 403 459 523 587 591 596 558 520
2202 520 507 560 602 578 529 480 541 602 634 600 562 524 507 555 594 567 581 595 629 663 632 600 541 482 452 487 562 636 604 572 566 559 552 545 578 611 644
2197 644 677 719 762 775 723 628 532 505 544 550 556 566 576 620 663 641 619 600 582 626 669 626 518 475 498 509 519 493 533 557 515 478 506 584 662
2193 662 634 606 569 533 521 575 647 652 634 615 632 649 630 676 748 820 743 665 643 621 604 586 559 597 640 617 612 674 731 723 646 569 556 609 643 611
2189 611 578 612 695 712 704 697 721 745 707 669 663 723 807 782 699 616 637 657 662 667 672 678 669 661 652 643 651 659 605 552 481 477 501 525 517 508 565 623 635 648 661 674 691
2183 691 708 725 742 746 750 754 757 724 691 761 831 820 699 575 560 599 572 544 583 639 586 529 583 673 654 563 538 571 538 477 481 549 616 567 518 491
2179 491 464 449 543 721 834 819 738 694 649 601 553 605 657 677 696 646 596 622 649 644 639 601 563 591 618 569 519 530 541 552 563 583 603 624 644
2175 644 635 627 604 692 792 783 634 484 564 644 625 607 611 615 653 690 673 655 638 620 601 582 564 545 561 577 593 609 646 684 622 560 573 586 600 613
2170 613 591 570 549 528 553 579 637 696 751 806 802 798 736 608 511 523 620 716 699 681 688 696 703 710 692 675 657 639 683 727 651 574 574 575 608 642 609 577
2166 577 577 578 616 653 570 487 483 478 506 534 544 554 509 463 473 483 525 568 613 657 603 549 572 596 619 642 639 636 556 475 495 516 536 556 602 648 595 542
2161 542 557 572 554 536 590 644 665 576 509 508 540 572 592 612 562 511 482 562 695 761 716 672 656 640 657 674 658 642 627 613 653 693 718 743 669
2157 669 595 671 748 703 659 672 686 670 655 637 686 708 621 524 492 494 496 456 416 475 533 587 640 660 681 696 711 671 631 553 474 472 470 523 576 629 681
2152 681 696 710 670 630 603 576 549 522 520 518 516 514 494 473 508 543 614 686 637 588 646 704 762 819 835 851 802 752 734 716 698 680 754 828 910 860 766
2148 766 671 678 685 697 710 722 735 681 628 575 522 577 632 621 611 598 585 571 558 550 541 532 523 540 557 574 591 606 622 572 521 497 473 450 426 480 534 589
2143 589 643 602 562 522 481 603 724 810 764 696 627 615 604 605 606 608 609 657 704 686 668 660 651 643 634 634 634 633 633 656 679 702 724 710 696 624 553 511 601 691
2138 691 650 601 552 561 570 569 569 568 567 607 646 685 724 703 681 660 639 661 683 705 728 727 725 724 723 663 602 608 613 581 550 518 486 490 494 497 501 480 459 504 549 621 693
2133 693 699 705 714 723 732 741 756 772 787 803 769 735 767 799 704 609 580 551 561 570 579 589 596 602 609 616 600 583 567 551 605 659 648 570 560 659 796 867 821 776
2128 776 727 677 645 612 645 678 675 673 671 668 579 490 555 620 664 708 686 665 662 659 657 654 691 728 765 803 764 726 687 649 662 676 623 570 596 622 582 541 530
2123 530 519 578 637 671 771 830 780 677 574 575 575 636 697 648 599 560 522 550 578 569 561 553 545 573 601 629 657 658 658 659 659 666 672 678 685 642 599 666 733 751
2118 751 768 724 680 604 594 612 631 630 630 640 585 558 640 750 707 561 526 617 708 678 648 684 720 666 612 624 636 569 503 465 494 510 527 609 691
2114 691 667 576 485 460 513 566 623 680 645 610 644 744 815 821 757 694 662 631 661 691 726 696 637 577 573 569 593 683 776 869 878 778 659 606 620
2110 620 633 628 623 618 614 603 593 583 573 552 531 577 622 643 663 651 639 615 591 600 609 618 627 637 646 610 575 606 637 682 728 668 608 541 539 610 682 698 714 669
2105 669 623 588 618 653 622 577 598 619 574 485 462 508 553 471 389 424 525 543 562 519 476 479 483 519 556 544 533 555 576 567 558 582 605 581 556 597
2101 597 638 624 611 532 453 432 411 455 500 491 483 584 685 678 672 666 660 625 591 523 456 452 449 555 661 625 588 585 581 546 511 475 440 419 399 444 489 502
2096 502 516 529 543 544 545 612 679 679 680 746 812 764 717 670 622 589 555 554 554 578 601 560 518 555 593 597 602 532 461 501 540 518 495 472 450 505 561 616 672
2091 672 711 751 791 831 810 789 768 748 767 786 805 824 834 843 852 862 741 620 534 581 611 640 613 585 596 608 619 630 665 700 735 769 732 694 657
2087 657 619 620 621 622 623 606 590 573 556 535 515 494 473 467 462 522 583 589 596 628 725 773 755 774 793 821 784 718 652 584 516 557 599 609 619 651 749 831 803
2082 803 775 747 754 760 762 764 778 726 673 687 728 769 748 727 685 643 629 681 746 811 814 817 761 706 712 719 716 647 639 698 763 762 802 842 843 845 842 840 836 765 691 682 730
2077 730 712 669 626 650 674 632 590 611 632 715 797 873 882 863 844 860 876 827 777 743 709 675 641 630 619 608 598 630 662 694 727 759 791 823 855
2073 855 863 871 879 887 808 730 680 696 725 754 722 690 726 762 798 834 823 812 801 790 700 611 631 651 675 698 721 744 728 713 698 682 660 638 682 726 733
2068 733 740 743 746 750 689 599 619 695 705 649 593 658 722 721 720 688 657 625 594 618 643 668 692 690 687 684 681 623 566 508 450 464 478 491 505 562 620 677 735 717
2063 717 699 681 663 615 568 586 670 701 622 547 581 656 731 703 675 648 621 660 699 713 727 631 535 555 574 593 613 616 619 622 625 698 772 735 698 701 704 707
2059 707 710 668 625 583 541 539 538 537 535 563 590 618 645 702 759 663 566 576 587 597 607 649 691 624 556 562 569 575 582 638 695 685 676 617 558 565 573 593 613 633 653
2053 653 639 624 507 390 384 488 633 712 726 741 751 762 774 787 734 681 648 616 583 551 546 541 536 531 527 522 517 512 521 529 538 546 564 582 600 619 725 831
2049 831 828 824 720 616 622 628 662 696 620 544 601 658 649 641 636 631 627 622 623 624 559 494 540 586 632 678 692 706 721 735 716 697 677 658 651 644 637 631 654 677 634 591
2044 591 641 692 742 793 795 797 733 669 636 602 568 535 623 712 690 669 689 708 728 748 770 792 748 704 697 690 683 677 664 652 640 628 631 634 637 640 591 541 602 663
2039 663 644 625 671 783 880 845 697 616 647 678 647 616 594 572 550 528 559 589 619 650 645 640 570 499 526 553 580 607 622 637 653 668 662 657 652 646 571
2034 571 495 529 563 626 689 686 683 744 804 755 706 656 607 624 640 663 686 643 600 635 670 640 609 613 617 621 625 602 578 555 531 503 474 511 549 598 648 698
2030 698 747 706 664 623 581 578 574 571 568 551 535 518 501 508 515 521 528 589 650 645 640 660 679 699 719 643 566 556 546 581 616 651 686 666 647 627 607 626 644 663
2025 663 681 643 605 567 529 550 571 570 503 399 405 499 593 586 580 573 567 575 582 590 597 621 645 669 693 702 711 720 729 629 530 496 462 515 567 613 658 730 692 612 599
2020 599 663 727 648 569 556 653 730 740 726 778 854 821 741 727 771 750 656 562 530 498 526 554 582 611 629 648 667 686 692 699 705 712 717 722 662 601 621 640
2015 640 659 678 716 754 682 610 612 614 617 619 611 602 660 718 693 668 644 619 599 580 626 672 689 705 721 737 743 749 647 480 388 451 569 622 635 649 658 667
2010 667 634 601 568 534 597 660 723 786 756 725 695 664 673 681 690 698 649 600 617 633 675 716 692 668 635 602 570 537 549 562 575 587 610 632 588 545 541
2006 541 537 533 529 571 612 654 695 685 675 665 655 581 506 498 489 489 490 490 490 522 554 586 618 657 695 734 773 729 685 707 729 694 659 690 721 789 857 815 773
2001 773 733 692 652 612 603 594 585 576 567 557 548 539 520 501 548 595 582 570 558 546 511 475 506 536 529 523 413 303 320 447 549 585 574 564 550 535 538 540
1997 540 542 544 563 581 600 619 610 601 592 583 613 643 673 703 716 730 743 757 727 697 667 637 615 594 572 550 543 535 527 519 546 573 641 643 637 698 754 744 716 687 658
1991 658 629 586 608 635 595 490 451 524 597 627 656 686 715 684 653 728 803 801 733 664 662 664 666 672 678 694 710 727 743 736 728 721 714 688 661 697 732 740 682 599
1987 599 516 441 432 495 558 613 669 658 647 640 632 625 618 561 504 513 522 561 600 676 686 644 601 621 641 578 516 520 523 488 454 485 516 474 432 419 473 523 573
1982 573 628 682 621 560 568 642 674 641 583 524 543 562 581 599 536 472 518 565 571 578 585 591 555 519 549 579 576 573 636 699 654 608 563 517 457 397 381 475
1977 475 540 539 516 493 498 503 574 645 637 630 688 747 706 665 625 584 623 662 701 740 684 629 639 650 609 569 591 612 560 442 406 479 563 581 577 573 575 577 578
1972 578 580 616 652 688 724 700 677 653 630 609 588 501 415 447 480 579 677 668 658 648 638 597 556 581 606 567 527 488 448 459 469 480 491 518 545 572
1968 572 599 613 627 640 654 640 627 613 599 639 679 719 759 701 644 652 660 644 628 611 595 636 678 653 629 626 622 619 616 614 612 713 815 858 792 722 652 640
1963 640 627 615 602 548 493 504 516 535 555 465 374 416 458 499 541 545 550 554 558 530 502 475 447 471 495 519 543 521 498 476 453 492 532 567 602 607 545
1959 545 546 612 646 613 581 614 655 629 579 529 502 475 448 421 410 399 450 500 510 453 392 398 477 491 479 468 487 506 484 528 599 604 541 478 501 524
1954 524 519 447 392 336 389 508 593 611 601 591 588 520 451 448 486 523 564 605 599 592 585 578 564 550 561 638 696 687 654 621 601 580 559 539 547 555 563 571 599 626
1950 626 650 673 701 663 593 634 713 681 572 529 574 619 602 586 599 613 627 640 648 656 660 664 697 663 630 663 676 689 640 591 636 681 660 638 594 550
1945 550 506 463 512 561 501 441 482 524 566 608 636 664 582 500 513 526 540 553 653 752 786 820 735 649 630 610 657 703 683 664 693 722 685 648
1941 648 594 541 553 565 631 697 697 697 677 656 636 615 646 678 643 608 603 597 591 585 612 639 666 693 683 673 663 652 730 808 776 744 760 777 793 809 806 804 802
1936 802 800 765 729 760 791 730 669 674 679 665 651 637 623 606 590 573 556 622 688 643 599 609 618 562 505 520 535 550 565 553 541 530 518 585 651 652 653 611
1932 611 570 528 487 503 519 535 552 585 619 712 805 859 803 699 595 607 620 600 580 595 609 623 637 649 662 641 620 554 489 489 489 584 678 662 646
1927 646 624 602 613 624 620 617 635 719 787 745 660 574 555 537 452 367 381 395 441 488 555 623 624 626 669 712 690 667 712 758 737 716 742 769 763 756 731 706
1923 706 747 788 755 721 687 653 636 619 602 585 634 683 666 649 675 702 619 535 552 569 586 603 611 618 560 502 517 533 549 565 584 604 562 520 537 620
1918 620 625 519 458 507 590 607 554 501 554 607 658 710 754 798 842 777 663 550 610 670 620 571 601 631 661 691 690 690 689 688 688 687 686 685 661 636 612 587
1914 587 582 577 571 566 563 560 557 554 570 587 603 619 631 644 656 668 686 704 690 675 673 670 602 533 480 428 485 542 606 670 667 665 651 637 656 676 643 610 643 676 639
1909 639 601 630 658 690 722 644 566 571 575 547 519 546 574 569 563 525 487 558 630 648 666 575 483 455 428 433 438 496 553 611 668 643 617 592 567 614 662 710
1904 710 757 764 770 777 783 738 693 648 603 646 690 700 711 758 806 787 768 679 590 566 543 585 628 670 713 675 638 667 696 691 686 682 677 690 704 611 519 458 463
1899 463 497 531 603 674 672 605 563 521 474 428 484 539 594 650 696 742 723 703 704 705 644 583 545 573 630 687 693 699 709 719 703 753 803 787 743 700 652
1895 652 604 619 634 649 664 703 743 753 698 664 630 591 553 557 561 565 570 576 583 590 597 603 610 621 632 641 715 790 798 750 703 589 476 447 484 526 501 492 548 605
1890 605 595 583 637 715 684 608 599 652 640 525 475 538 601 586 571 556 541 537 534 534 535 460 451 555 659 731 737 630 523 454 450 513 509 463 416 435 455
1885 455 474 560 670 780 777 708 675 643 658 673 687 702 701 701 700 699 675 651 627 603 646 688 665 642 633 624 614 605 563 521 588 656 652 648 644 640 591 543 560 577
1880 577 607 637 600 564 449 334 417 499 498 497 496 495 552 609 600 591 604 616 629 642 562 481 467 452 556 659 697 734 728 722 715 709 631 553 541 530 516 503
1876 503 489 476 519 562 605 647 624 601 578 555 566 578 589 600 588 576 630 684 633 582 598 613 617 621 625 629 618 607 596 585 607 630 653 675 650 624 709
1871 709 793 783 773 763 753 700 646 592 538 593 647 636 625 672 718 699 613 565 626 725 758 728 699 776 852 853 853 853 853 808 763 718 672 702 731 761 791
1867 791 692 593 604 615 590 566 575 583 591 599 673 746 793 840 821 801 736 671 638 606 628 650 671 693 682 672 661 651 603 555 616 678 674 670 666 662 605 547 643
1862 643 740 712 684 689 694 703 712 721 730 729 728 727 725 646 568 599 630 684 738 727 715 645 574 613 653 671 690 709 727 694 660 688 716 669 557 526 605 650 630
1857 630 616 668 711 753 832 911 923 935 881 827 756 685 680 674 684 694 704 714 738 761 785 809 807 806 738 671 670 668 667 665 619 573 593 613 633 653 607 561 582
1852 582 603 624 645 653 662 670 679 642 606 569 532 521 510 608 707 678 648 652 655 639 623 672 722 681 641 666 691 680 668 623 578 562 546 563 580 584 587 590 593 565
1847 565 536 618 699 663 627 620 613 608 538 503 577 625 563 467 436 458 481 540 599 688 777 756 735 698 662 692 721 650 579 575 570 590 611 631 651 637 622
1843 622 673 725 712 699 653 607 579 550 587 625 686 746 741 736 639 542 489 545 601 590 558 526 519 512 538 564 645 727 742 758 763 767 772 777 718 658 632 606 641
1838 641 677 647 616 624 632 673 714 652 589 526 464 480 496 574 652 670 621 573 591 662 732 697 662 652 642 632 622 617 613 670 728 755 716 674 697 745 727
1834 727 685 642 658 673 688 703 725 747 764 782 779 710 674 638 658 612 561 577 606 570 537 570 609 648 687 726 729 666 640 615 656 698 673 649 634 620
1829 620 667 714 769 758 718 678 648 618 654 755 798 731 661 701 754 698 667 701 780 750 632 514 504 494 509 590 705 755 735 716 683 650 580
1825 580 576 608 640 672 704 710 650 591 597 647 697 682 666 740 748 683 618 616 615 614 613 652 692 728 764 809 788 739 689 673 656 639 623 653 683 713 743 693 643
1820 643 618 659 691 656 621 653 681 644 607 635 710 719 660 601 644 688 665 643 661 679 692 706 763 753 671 588 606 623 640 658 701 745 678 612 619 626
1816 626 572 518 580 708 755 693 637 648 619 590 557 590 586 581 594 607 619 632 614 597 542 554 597 640 621 602 620 638 657 675 673 671 669 667 603 539 542 544
1811 544 544 545 508 537 571 604 576 548 583 619 655 690 670 649 563 586 725 797 720 643 650 723 730 670 611 552 489 426 443 461 479 497 516 536 555 575
1807 575 586 598 609 620 637 655 672 689 687 685 683 681 709 738 767 796 834 873 801 730 686 643 600 556 578 599 554 509 481 452 490 527 629 731 721 644
1803 644 591 604 642 680 686 692 593 493 447 466 554 642 705 702 671 639 642 645 585 526 504 548 555 562 570 577 584 592 595 598 602 605 613 622 696 771 772 774 775 777 775 774 731 754 818 816
1797 816 746 676 710 745 673 602 569 602 598 594 621 647 608 568 581 594 578 496 443 390 402 479 573 601 521 440 491 607 682 647 648 649 643 637 628 618 609 599
1792 599 602 605 607 610 701 792 726 594 555 583 573 563 574 650 665 613 599 651 698 680 677 675 668 661 678 695 711 728 773 817 752 687 718 749 736 613 529 511
1788 511 515 520 632 745 770 685 642 666 683 634 616 598 577 555 577 599 621 643 682 721 693 666 637 609 646 684 698 712 660 608 641 675 708 741 740
1783 740 739 738 737 727 718 708 698 653 609 569 529 584 705 785 755 699 643 580 517 530 543 560 577 623 735 809 774 692 676 661 579 489 509 617 724
1779 724 728 731 669 606 631 657 660 598 519 550 585 509 401 404 485 500 473 446 525 604 635 666 631 597 612 628 643 658 673 687 679 605 573 651 756 708
1775 708 580 562 670 778 724 670 682 693 687 681 675 669 603 538 545 617 672 728 714 634 543 451 428 471 547 624 675 661 647 634 649 664 695 725 756 787
1770 787 765 743 721 699 695 691 699 640 593 656 756 789 746 702 654 606 600 594 588 582 593 603 614 624 621 618 620 621 641 728 814 835 805 775 741 707 636 565 564 563 566
1765 566 635 732 720 652 649 709 704 568 499 585 672 715 758 768 778 740 702 697 693 694 696 705 649 566 550 558 566 529 493 522 551 565 579 629 614 549 484 524 565
1761 565 540 515 461 408 386 431 479 462 395 394 506 618 578 538 498 458 455 451 485 518 473 493 624 688 635 582 591 600 602 604 672 740 747 754 761 769 692 615 605
1756 605 594 551 507 610 714 717 610 503 506 557 608 638 601 560 519 584 649 650 651 651 652 607 561 581 601 602 602 603 603 602 601 666 731 719 707 756 806 786 700
1751 700 623 545 446 413 536 660 697 667 667 733 731 663 636 610 584 559 600 640 633 626 652 678 680 682 746 810 825 774 760 746 675 603 536 578 612 647 683
1746 683 720 727 668 608 615 637 659 619 579 549 520 523 527 526 526 525 525 526 527 590 652 693 668 646 625 602 579 622 664 685 706 723 741 751 695 643 592 574 556 614
1742 614 673 714 755 757 692 637 582 600 617 564 510 533 557 558 559 611 663 669 608 515 487 541 595 682 769 719 603 543 548 557 566 580 593 596 598 563 595 644 694
1737 694 714 735 788 842 840 839 805 772 738 704 684 665 717 770 775 714 652 657 696 736 747 757 703 648 649 649 677 705 781 857 848 728 600 539 502 465 467 536
1732 536 646 690 659 627 612 662 712 697 676 656 708 760 757 754 783 813 813 812 779 746 690 634 650 667 676 620 600 581 604 627 650 673 633 593 608 624 593
1728 593 563 588 613 621 630 638 647 645 643 675 772 810 738 662 652 649 646 647 648 645 643 640 638 603 568 534 499 499 498 597 695 721 747 695 644 637 630 622 615 621 628 634 641 619 597 608 620
1722 620 702 784 745 706 687 669 727 786 697 609 553 498 496 494 569 645 650 655 711 767 765 697 637 687 736 785 786 787 735 682 629 576 556 536 570 604 685 765
1717 765 769 772 718 664 730 797 733 669 638 606 586 566 579 591 571 550 562 575 594 613 599 585 568 552 612 673 688 703 718 733 707 681 651 621 663 638
1713 638 585 642 699 691 685 745 801 792 823 854 805 755 706 656 640 623 672 722 747 773 733 692 693 694 695 696 694 692 690 688 660 631 603 575 543 510 544 577 602 628
1708 628 653 678 745 813 770 728 717 706 695 684 734 784 826 869 931 883 750 683 651 619 588 667 792 806 738 737 795 788 712 636 635 635 634 634 657 680 702
1703 702 725 766 806 781 756 766 776 786 796 794 791 789 787 751 715 679 643 706 769 723 676 735 794 788 781 758 735 711 688 745 803 860 917 888 859 829 800 790
1699 790 781 837 893 916 939 853 766 731 697 662 627 610 593 576 559 566 574 581 588 591 594 593 591 618 579 574 679 815 842 783 725 683 642 600 558 575 591 607 623
1694 623 702 780 749 718 785 853 855 856 857 858 858 859 836 813 724 635 629 623 551 479 525 571 617 663 679 694 709 724 754 785 705 625 678 731 777 822 898 865 739
1689 739 613 653 694 668 642 680 717 755 793 759 726 692 659 691 724 646 569 638 707 710 713 817 920 870 753 689 734 780 825 865 905 879 853 799
1685 799 745 691 637 635 633 632 630 706 783 749 716 693 671 648 626 675 725 708 692 790 887 831 775 759 742 791 841 872 904 781 659 687 714 742 770 795
1681 795 820 779 738 750 763 775 788 818 848 725 601 632 663 584 505 607 710 702 694 745 795 735 676 664 653 641 630 746 862 868 874 882 889 787
1677 787 685 715 746 714 683 709 801 812 713 693 738 718 631 594 667 673 680 762 843 859 809 787 876 940 937 950 1029 1037 980 927 874 823 773 792 921 1029
1672 1029 1072 1125 1245 1398 1552 1842 2287 2740 2997 2937 2635 2181 1727 1421 1269 1140 1011 1010 1009 941 808 762 826 865 838 827 883 900
1669 900 807 750 803 828 787 773 824 834 844 892 939 945 841 787 842 870 832 822 878 892 906 967 1028 1093 1158 1264 1436 1574 1601 1607 1723 1897 2072
1665 2072 2393 2999 3967 5265 6751 7953 8249 7468 6051 4633 3464 2581 2055 1771 1534 1298 1154 1209 1308 1254 1138 1088
1662 1088 1142 1130 1069 1074 1078 1017 951 950 1011 1006 990 974 995 950 930 976 1018 994 996 998 1000 1002 1032 1128 1223 1253 1260 1267 1314 1294 1264 1344 1433 1523 1690 2010 2430 2850
1657 2850 3460 4576 6171 7657 8390 8046 6776 5177 3796 2833 2235 1834 1604 1483 1320 1156 1059 1071 1069 1000 952 1058 1139
1655 1139 1111 1017 990 963 870 788 816 925 968 915 862 870 879 864 849 876 836 810 850 853 856 878 967 996 959 912 974 1074 1107 1105 1102 1105 1108 1163 1372 1699
1650 1699 2027 2383 2850 3213 3203 2848 2339 1838 1446 1192 1047 950 853 787 788 826 798 748 764 743 722 683 710 768 716 664 723 781 730 697
1646 697 775 847 765 708 804 953 948 830 823 908 884 762 706 749 726 630 644 732 754 721 753 863 906 852 864 912 894 802 820 915 900 776 717
1642 717 761 806 745 750 832 848 748 647 667 688 621 620 703 786 725 665 725 785 808 830 894 891 791 757 846 935 896 856 916 976 912 848 839 830 824 819 891
1638 891 963 942 922 935 947 931 914 968 956 872 788 799 810 762 713 745 778 777 842 969 987 890 859 927 995 899 803 807 810 794 778 836 828 710 658 730
1633 730 801 763 724 740 756 726 696 786 876 836 795 854 912 821 729 825 920 886 852 873 894 836 777 752 726 708 690 749 808 803 799 794 789 708 628 668 708
1629 708 672 635 698 760 739 719 698 678 631 584 635 687 693 699 848 996 941 885 906 927 848 770 834 899 772 645 659 782 815 738 743 814 879 878
1625 878 918 958 903 848 870 892 833 773 834 895 836 776 793 810 805 801 851 901 866 830 850 869 841 812 949 1085 1053 1021 1043 1066 1000 935 925 915 911
1621 911 908 982 1056 1054 1052 1105 1159 1110 1062 1068 1075 965 855 931 1074 1063 943 946 1015 1017 953 987 1088 1063 972 965 1090 1137 1117 1212 1306 1307 1176 1158 1207 1194
1616 1194 1181 1247 1379 1409 1308 1305 1433 1466 1433 1474 1515 1461 1342 1302 1394 1393 1326 1303 1411 1458 1439 1540 1708 1765 1691 1716 1872 2013 2087 2180 2404
1612 2404 2560 2583 2706 2960 3180 3267 3434 3821 4264 4707 5339 6367 7778 9759 12818 17239 22580 27525 30410 30088 26589
1610 26589 21200 15713 11324 8314 6315 5041 4163 3510 2989 2641 2425 2191 1957 1840 1855 1806 1692 1655 1684 1602 1387 1312 1368
1607 1368 1327 1154 1031 1127 1220 1181 1119 1189 1243 1231 1260 1289 1255 1156 1132 1240 1263 1153 1159 1296 1397 1278 1179 1212 1296 1313 1364 1480 1509 1405
1603 1405 1331 1388 1391 1263 1233 1335 1412 1356 1296 1367 1402 1217 1087 1177 1352 1396 1377 1358 1369 1250 1176 1235 1265 1163 1137 1244 1359 1341 1269 1329
1600 1329 1376 1292 1174 1189 1327 1333 1321 1375 1425 1342 1256 1301 1349 1266 1238 1341 1423 1372 1322 1403 1466 1397 1256 1246 1312 1313 1313 1379 1438 1365 1288 1342 1441 1407
1595 1407 1316 1291 1293 1228 1221 1346 1465 1452 1433 1547 1678 1589 1451 1444 1512 1448 1384 1452 1568 1553 1439 1456 1550 1511 1373 1368 1418 1337 1256 1306 1438 1437
1592 1437 1375 1379 1433 1355 1272 1322 1520 1587 1607 1627 1650 1541 1446 1571 1722 1653 1491 1548 1702 1724 1609 1626 1749 1740 1698 1788 1874 1827 1726 1844
1588 1844 2072 2080 1934 1920 2023 1994 1812 1631 1461 1225 995 984 1158 1222 1184 1255 1421 1478 1463 1558 1730 1704 1548 1547 1685 1714 1616 1584 1670
1584 1670 1645 1552 1569 1693 1707 1627 1702 1909 1962 1845 1838 1919 1890 1751 1722 1827 1822 1663 1614 1702 1681 1556 1542 1692 1842 1886 1996 2157 2164 2040
1581 2040 2025 2172 2210 2069 2082 2304 2416 2316 2282 2386 2423 2306 2342 2646 2950 3047 3078 3103 2929 2619 2462 2476 2424 2239 2165 2260 2245 2077
1577 2077 2018 2148 2169 2018 2021 2246 2470 2458 2446 2555 2597 2480 2428 2509 2481 2279 2230 2441 2652 2671 2757 3003 3096 2949 2802 2940 3077 3013
1574 3013 2949 3064 3114 2966 2884 3006 3129 3060 3058 3237 3350 3219 3088 3205 3321 3290 3325 3586 3847 3826 3805 3978 4151 4119 4021 4008 3995 3794
1570 3794 3724 3861 3997 3944 3891 3988 4084 3997 4041 4259 4476 4504 4532 4765 4997 4988 4979 5275 5570 5712 5854 6143 6433 6524 6615 6950 7284 7553
1567 7553 7953 8642 9463 10504 12116 14713 18935 25691 34599 42279 44113 38773 29873 22278 18067 16334 15787 15662 15141
1565 15141 13539 11453 9872 8951 8148 7345 7056 6987 6641 6163 6116 6289 6176 5931 6101 6490 6599 6489 6609 6948 7035 6991 7205
1562 7205 7551 7612 7541 7819 8228 8319 8190 8441 8911 9096 9061 9419 9996 10354 10492 10786 10948 10512 9855 9660 9947 10070 10062 10369 10896
1559 10896 11010 10818 10804 10922 10717 10291 10219 10454 10316 9958 9949 10248 10266 9977 10056 10444 10540 10416 10581 11054 11196 11120 11350 11887 12013
1556 12013 11831 12003 12483 12716 12729 13042 13663 13845 13630 13784 14421 14718 14619 14798 15285 15415 15061 15051 15524 15739 15646 15933 16616 16974
1553 16974 16937 17180 17818 18088 17963 18209 18939 19344 19266 19408 20033 20411 20393 20845 21782 22355 22269 22472 23070 23262 22882 22888 23554 23977 23917
1550 23917 24233 25297 26152 26523 27349 28746 29621 29661 29866 30730 31309 31228 31555 32718 33556 33560 33915 35017 35800 35749 36117 37409 38371
1547 38371 38498 38924 40273 41348 41587 42214 43938 45416 45971 46852 48657 50000 50156 50666 52537 54557 55918 58193 62271
1545 62271 66326 69019 71801 75681 79155 81179 83414 86836 89670 90878 92811 97249 102199 105961 110405 117178 124286
1543 124286 130031 136772 146457 156527 164794 173862 186313 199643 211874 226896 248467 273323 297167 322048 350927
1541 350927 380142 407379 441024 490446 553784 628768 729673 877646 1083604 1371349 1819299 2532740
1539 2532740 3524357 4612792 5463118 5760091 5386025 4481724 3361936 2344064 1599539 1123494 822181
1538 822181 617950 479416 389885 326789 275163 236200 212136 195306 178081 161422 147444 132629 114605
1536 114605 97867 86535 77980 68766 60897 56852 54373 50443 46646 45265 44448 41828 38923 38084 37943 36351 34364
1534 34364 33651 32991 30440 27187 25296 24019 21995 20327 20638 21795 21852 21416 21726 22017 20857 19044 18241 17873 16757 15510
1532 15510 15449 15906 15441 14585 14389 14303 13205 11817 11440 11585 10983 10012 9965 10379 10047 9362 9337 9683 9371 8729 8834 9318 9230 8967
1529 8967 9715 11078 11782 11704 11625 11478 10495 9158 8569 8484 7915 6984 6624 6649 6191 5518 5592 6168 6174 5701 5623 5895 5683 5141 5083
1526 5083 5424 5369 4868 4676 4808 4632 4197 4246 4726 4810 4444 4386 4637 4494 3976 3855 4118 4075 3663 3559 3809 3751 3369 3295 3637
1523 3637 3758 3545 3639 4032 4118 3797 3696 3971 4025 3794 3782 4051 4100 3819 3759 4049 4120 3856 3812 4015 3910 3437 3184 3338 3272 2883
1520 2883 2713 2960 3076 2945 3033 3424 3594 3390 3252 3332 3192 2757 2630 2894 3027 2872 2784 2867 2730 2260 2009 2169 2197 1949 1833
1516 1833 2119 2340 2184 2028 2138 2183 2028 2005 2256 2374 2251 2260 2555 2718 2589 2526 2664 2671 2388 2237 2336 2304 1985 1799 1849 1767 1402
1513 1402 1257 1550 1843 1774 1772 2139 2375 2227 2079 2163 2247 2090 1932 2121 2310 2305 2519 3250 3914 3957 3516 3160 2805 2378 2084 2169
1510 2169 2254 2149 2045 2147 2249 1978 1706 1723 1740 1560 1379 1602 1825 1718 1612 1775 1939 1817 1695 1804 1912 1739 1567 1653
1507 1653 1804 1672 1408 1369 1462 1320 1112 1235 1489 1502 1383 1397 1478 1407 1336 1468 1666 1664 1530 1605 1745 1637 1398 1357 1448 1348 1182
1504 1182 1205 1361 1409 1391 1513 1634 1597 1560 1677 1794 1708 1490 1491 1624 1603 1451 1437 1555 1522 1423 1522 1687 1695 1571 1619 1799 1861 1790 1772
1500 1772 1753 1625 1496 1487 1610 1630 1584 1621 1658 1537 1416 1490 1565 1489 1413 1473 1598 1566 1403 1371 1406 1293 1181 1246 1444 1451 1327 1239 1283 1220
1497 1220 1157 1269 1512 1566 1487 1540 1725 1712 1568 1518 1601 1574 1415 1329 1374 1317 1194 1227 1392 1408 1292 1310 1460 1457 1321 1323 1458 1487 1385
1493 1385 1328 1490 1570 1518 1529 1672 1749 1693 1683 1804 1860 1783 1784 1917 2001 2019 2038 1991 1702 1194 790 693 660 627 685 874 918 830 730 762
1489 762 778 794 910 1027 1028 898 899 1033 1130 1094 1072 1116 1130 1013 1004 1127 1140 1020 973 1057 1075 962 981 1133 1175 1085 1051 1149 1182 1082 996
1486 996 1042 1088 1002 987 1104 1160 997 861 857 881 773 753 865 977 956 897 970 1009 917 897 1009 1054 968 938 1039 1140 1109 1003 1028 1120
1482 1120 1079 1000 1052 1125 1132 1177 1222 1236 1118 1037 1089 1103 1052 1002 1084 1104 992 968 1077 1185 1162 1115 1200 1219 1106 1001 1027 1119 1080 1044 1141 1237
1478 1237 1202 1110 1151 1260 1303 1328 1420 1486 1421 1407 1525 1690 1854 2104 2662 3194 3331 3141 2820 2481 2011 1563 1334 1224 1114 988
1475 988 995 1115 1104 991 944 962 979 997 1016 1079 1077 1063 1182 1300 1287 1223 1226 1265 1173 1082 1122 1229 1204 1135 1198 1290 1316 1279 1373 1472 1439 1341 1374 1513
1471 1513 1520 1448 1442 1581 1654 1664 1674 1725 1710 1612 1645 1752 1792 1726 1726 1839 1951 2032 2114 2228 2342 2441 2540 2672 2805 2990 3175 3438 3636 3828
1467 3828 4151 4677 5334 6245 7551 9522 12592 17081 22670 27841 30682 30143 26571 21235 15680 11141 8051 6182 4884
1465 4884 3953 3331 2958 2586 2236 2106 2168 2098 1883 1667 1597 1528 1448 1369 1355 1342 1216 1089 1073 1057 1051 1046 1106 1166 1094 1022 1059 1097 1103 1110 1127
1461 1127 1079 972 975 1064 1086 1020 1019 1125 1164 1079 993 969 946 957 968 984 999 978 1023 1067 1001 872 853 984 1006 897 854 921 987 918 849 845 842 795
1457 795 747 854 960 901 842 893 944 936 929 888 848 835 822 810 797 738 679 730 781 772 762 818 875 875 874 874 874 823 773 788 803 762 720 789 858 843 828
1452 828 923 1018 1012 1005 1060 1006 841 677 703 730 728 726 790 855 827 800 805 811 744 677 764 852 777 702 782 861 852 843 901 958 916 874 943 1011 944 877 843 808
1448 808 765 721 831 941 858 775 802 829 856 883 906 929 845 696 631 676 698 719 748 776 709 642 729 816 854 891 896 900 904 909 946 984 900 816 797
1443 797 779 728 677 659 641 639 638 746 854 816 777 804 832 812 792 804 817 823 828 833 839 801 763 835 907 821 736 716 696 724 752 846 940 861 782 813 844
1439 844 796 748 809 871 820 769 784 865 870 765 690 680 641 602 634 665 655 646 702 758 749 739 839 939 858 777 757 738 710 616 604 701 724 681 679
1434 679 787 853 810 733 721 681 641 671 701 684 666 682 697 676 655 700 745 778 810 810 809 773 738 768 798 728 658 651 643 590 471 437 513 554 596 645
1430 645 693 683 673 728 784 803 821 840 859 852 845 839 832 753 673 746 885 853 690 592 626 710 729 727 726 734 742 816 891 842 793 811 828 809 790 804 817 805
1425 805 793 810 826 805 718 696 805 840 743 711 812 908 872 772 737 753 770 790 811 836 861 886 912 891 870 816 763 743 723 724 791 848 772 709
1421 709 646 596 545 605 664 672 681 689 698 744 790 771 751 713 674 701 728 776 825 869 913 918 858 818 910 980 917 834 818 805 792 804 882 924 834 781 795
1417 795 812 763 777 856 924 861 793 857 923 858 723 655 692 662 604 612 681 750 823 896 846 797 747 697 714 730 747 764 785 806 795 783 722 661 587
1412 587 645 702 693 716 806 875 813 726 705 707 709 714 720 744 767 725 683 699 716 753 856 931 875 752 762 800 773 750 792 859 859 823 852 911 838 703
1408 703 700 762 823 783 743 777 811 811 812 805 799 726 653 720 787 787 788 871 953 970 986 967 948 895 843 926 1008 981 954 940 925 845 764 773 781 756 731 715 698
1403 698 748 798 826 855 817 780 768 757 745 733 773 812 785 759 807 855 793 731 778 826 764 702 684 665 713 760 763 766 735 705 730 755 779 804 901 998
1399 998 1022 1046 1062 967 807 757 806 854 844 833 881 929 910 892 941 990 885 780 751 722 692 663 700 736 773 810 827 845 797 748 793 838 818
1395 818 797 803 808 814 820 884 947 901 855 769 684 598 512 506 500 494 488 572 656 674 693 689 685 681 677 764 850 827 804 811 818 759 701 704 708 712 716 724 732 740 748 780 813 845 877 925
1389 925 972 910 848 831 815 798 782 716 650 650 716 826 825 737 649 719 788 704 554 504 564 596 561 536 510 547 584 646 709 706 703 765 828 781 734 763
1385 763 792 711 630 655 679 704 729 715 701 753 805 813 821 719 617 624 631 639 646 696 746 690 634 652 737 756 708 701 693 682 670 739 808 808 742 714 751 747 743
1380 743 728 712 697 682 761 841 848 788 757 725 630 535 513 601 693 785 842 898 926 889 856 824 787 751 832 914 908 792 714 702 713 723 758 793 828
1376 828 863 920 977 884 791 738 750 730 710 707 770 838 839 858 941 955 903 846 788 793 797 760 724 687 650 638 626 614 602 667 732 768 738 735 732 730 727 721 780
1371 780 844 842 837 897 917 937 945 953 855 758 736 779 761 678 606 600 657 647 667 688 708 729 731 798 866 868 838 808 778 749 736 789 805 712 622 598 641 683
1366 683 665 647 629 611 675 739 760 670 573 541 575 609 660 712 698 684 678 671 730 790 833 877 855 832 804 775 779 784 786 788 790 792 874 956 972 988 925 862 799
1362 799 736 759 781 837 892 902 912 855 799 772 745 784 824 816 808 735 661 720 779 772 699 703 817 868 809 770 842 886 864 816 834 853 805 756 773 791
1357 791 742 726 775 825 809 765 788 844 834 756 744 800 856 865 873 881 890 841 792 810 827 836 844 820 796 795 793 792 790 783 776 769 762 759 756 731 640 542 553 609 664 671 677 716
1352 716 755 783 811 843 809 728 647 672 698 664 630 657 685 695 639 621 602 653 704 755 806 788 771 753 735 725 714 704 694 697 700 703 707 701 695 689 683 667 651
1347 651 606 561 590 685 718 685 637 654 696 738 765 792 757 722 711 767 826 820 791 828 866 837 740 709 747 785 778 771 732 692 641 589 604 618 650 683
1343 683 752 755 740 725 776 760 694 627 622 617 628 639 624 609 620 741 870 934 926 919 916 847 753 726 760 729 664 598 639 679 649 619 695 770 794 751 746
1338 746 740 787 835 858 814 756 764 796 828 746 664 648 632 636 641 711 782 762 741 721 701 716 730 744 758 744 730 716 702 696 690 684 679 691 704 717 730 766 803
1333 803 806 809 750 692 710 728 728 727 727 727 738 750 795 839 743 647 672 696 745 794 810 825 772 720 634 548 511 473 513 553 515 477 560 642 650 657 664 672 779
1329 779 886 938 990 881 773 720 666 631 595 637 678 654 631 684 738 692 647 634 622 591 561 607 654 597 541 517 494 532 569 574 579 591 602 647
1324 647 692 692 692 770 847 861 875 856 837 750 662 674 685 706 726 746 767 723 679 690 702 746 791 781 771 724 676 684 692 658 623 666 709 687 664 642 620
1320 620 615 610 682 754 703 653 701 816 807 688 606 634 684 734 737 739 732 725 772 820 789 757 759 761 792 823 850 877 843 743 670 706 770 768 734 699 666 634
1315 634 656 679 645 611 632 653 643 634 570 505 533 561 644 726 729 732 702 671 667 663 758 853 811 770 761 753 701 649 652 655 653 651 650 648 658 667 677 687 653 618 584 550
1310 550 584 618 653 687 711 736 760 784 750 715 713 778 859 831 770 709 691 673 688 703 716 729 741 754 784 814 767 720 741 763 729 696 615 534 530 526
1306 526 560 593 627 660 694 727 706 684 686 689 691 693 668 642 616 590 616 642 667 693 684 676 667 658 721 783 780 776 758 739 720 702 681 659 638 617 659 701 743 785
1301 785 785 786 786 786 784 782 781 779 827 876 891 907 839 770 768 766 759 753 714 674 710 745 781 816 784 752 720 689 694 699 704 710 723 737 685 633 657 682 739 796 802 809 771 799
1295 799 869 830 709 654 698 743 725 708 761 814 757 700 738 777 782 787 731 675 685 694 685 676 666 657 676 696 715 734 746 757 768 779 771 763 755 747 754 760 767 773 752
1290 752 730 742 753 696 638 647 656 682 709 702 696 702 708 781 853 851 849 781 714 666 618 603 588 581 573 566 558 572 586 600 613 640 667 727 786 799 811 758 704 673 642
1285 642 677 712 699 686 607 528 525 523 586 649 670 690 678 666 658 650 643 635 679 722 700 677 653 628 604 579 590 601 644 688 713 737 696 655 688 721 721 721 763
1281 763 805 781 757 695 634 638 642 647 653 658 664 696 728 695 662 658 655 652 649 689 730 661 591 646 700 688 677 670 664 657 651 699 747 729 711 658 605 586 566 570 574 579 583 595
1275 595 606 618 630 604 579 553 528 528 528 594 659 740 821 836 851 848 844 775 706 682 658 700 742 740 737 735 733 773 813 853 893 915 936 957 979 980 980 871 762
1270 762 747 732 717 702 700 697 760 824 827 831 769 707 771 835 789 744 785 826 801 777 745 713 748 782 748 715 681 648 668 688 708 728 739 751 762 773 839
1266 839 905 817 729 765 800 769 738 735 731 728 724 714 703 692 681 664 646 629 611 673 736 688 640 670 699 728 758 700 642 695 747 716 686 656 626 646 666
1261 666 621 575 579 583 587 591 615 638 596 554 621 687 753 820 808 797 786 775 817 859 835 812 799 786 773 760 742 725 708 691 708 724 741 758 805 852 789
1257 789 726 769 812 794 775 766 823 843 863 814 766 718 670 671 672 673 675 647 619 592 564 634 704 708 712 723 734 744 755 735 714 755 797 866 869 800 731 768 806
1252 806 738 670 642 681 719 692 653 614 576 537 597 723 768 703 638 639 662 685 730 776 796 751 710 735 784 834 797 761 724 687 698 708 718 728 787
1248 787 847 837 762 695 694 718 742 708 674 640 606 647 689 625 561 571 648 647 536 529 632 707 717 730 809 908 898 816 734 756 777 785 794 740 687 668
1243 668 714 724 734 710 686 703 655 597 604 637 669 680 690 701 712 718 725 666 606 578 549 587 624 614 603 593 582 548 513 632 751 757 762 767 772 762 751
1239 751 740 730 795 860 925 990 932 874 882 890 836 783 663 543 467 391 468 545 560 574 588 602 639 676 712 749 769 789 743 697 706 714 656 599 613 627
1235 627 641 655 678 701 724 747 749 752 754 757 748 739 663 588 662 735 808 881 955 1028 1098 1057 963 869 834 799 814 830 907 875 746 618 636 655 691 728 699
1230 699 669 637 605 639 673 731 789 781 773 872 971 961 950 910 869 770 671 633 706 757 743 708 739 794 849 796 743 690 637 658 680 636 592 564 537 575
1226 575 613 653 694 734 774 655 536 465 504 589 673 699 724 729 734 739 744 729 713 638 563 538 623 749 808 791 774 752 731 693 655 683 711 702 693 684 675
1221 675 686 698 775 852 800 747 761 774 778 782 785 789 798 808 751 694 676 658 706 753 732 710 688 666 638 611 650 688 746 804 861 919 872 826 845 864 827
1217 827 789 751 713 703 693 748 804 741 678 615 552 561 569 644 718 748 777 806 835 807 779 860 941 900 859 818 777 733 689 711 733 730 726 723 719 780 841 836
1212 836 831 755 678 712 745 751 757 763 769 759 748 738 728 732 736 739 743 760 777 794 811 808 806 804 801 775 748 722 695 755 815 807 732 686 706 787 802 712 622 637 653 675
1207 675 697 720 742 708 674 640 606 624 641 659 677 621 566 577 588 602 616 630 644 618 592 632 672 619 567 583 665 741 752 737 723 690 656 729 801
1203 801 835 803 808 813 760 707 721 734 703 672 708 743 737 731 725 719 699 679 659 639 590 541 560 646 700 688 676 729 779 763 722 682 674 666 658 650 668 686 703 721
1198 721 711 702 754 806 837 803 740 677 678 678 678 678 688 698 646 594 549 570 663 757 789 821 854 886 812 739 694 716 728 740 757 773 774 776 777 779 751 723 696
1193 696 668 656 643 697 750 706 663 619 575 589 603 679 755 773 724 713 702 674 647 685 723 785 847 881 848 719 590 545 610 719 762 783 804
1189 804 816 827 839 850 814 778 743 707 679 651 586 587 599 611 648 752 831 800 725 650 662 674 686 698 728 757 783 809 831 787 739 757 775 727 679
1185 679 697 684 606 532 524 569 615 598 582 588 595 602 608 648 687 661 635 651 668 685 701 693 685 677 669 645 620 624 694 776 859 835 812 790 769 747 725 706 688 735
1180 735 782 757 732 708 683 709 736 762 788 782 776 770 764 759 754 750 745 783 820 748 676 713 751 788 826 849 872 830 787 788 789 791 792 745 698 760 823 828 833 838 843 807 772
1174 772 802 832 817 801 786 771 700 630 559 489 580 672 755 838 851 733 688 644 682 720 692 664 711 758 739 720 709 698 688 677 678 678 679 680 635 590
1170 590 612 633 620 608 595 582 669 755 775 796 785 774 764 753 733 713 759 804 836 867 833 799 775 752 729 705 750 794 839 884 817 750 750 749 707 664
1166 664 622 579 599 618 637 657 667 678 688 699 812 926 929 933 886 838 791 744 726 707 652 662 768 874 871 802 754 771 814 856 884 911 873 834
1161 834 807 779 752 724 746 768 790 812 789 766 742 719 649 579 577 641 663 619 616 613 626 640 653 667 667 666 666 666 685 704 723 742 720 698 676 654 684 714
1157 714 744 774 725 677 695 713 742 772 797 823 814 739 664 655 706 757 807 858 889 855 748 641 657 674 691 708 711 714 718 721 784 848 801 755 767 780 731
1152 731 681 708 800 831 796 781 832 879 860 780 701 685 736 807 813 749 686 708 730 723 650 645 639 630 620 658 697 735 774 812 850 889 927 914 901 887 874
1148 874 843 812 780 749 770 792 747 702 708 714 720 726 776 825 874 923 861 799 803 807 815 824 832 840 835 829 824 818 835 853 804 755 744 732 721 709 675 640 606 572 613 654
1143 654 761 868 860 852 844 835 842 849 790 731 695 660 690 720 735 751 766 781 861 942 869 795 800 805 810 815 769 722 676 629 647 666 684 702 779 857 869 880 947
1138 947 1014 1014 1015 959 904 848 793 811 830 848 867 810 752 761 770 820 870 854 838 820 801 783 764 761 758 755 751 748 744 741 737 780 823 866 909 860 811 763 714 821
1133 821 929 988 938 937 935 926 918 889 860 831 802 849 897 945 993 976 959 943 926 907 888 934 981 991 1001 944 888 825 761 764 766 813 859 905 952 927 903
1128 903 878 854 855 857 859 860 909 958 941 924 920 915 911 906 942 978 1014 1050 1035 1020 1071 1122 1070 1018 966 914 902 890 878 865 873 880 887 895 890 885 880 875 930 985 974 963 981
1123 981 999 1017 1035 1019 1004 988 973 972 972 971 971 1001 1032 996 960 944 928 977 1027 1020 1013 1006 999 964 928 958 989 946 903 926 949 957 965 973 981 961 941 987 1033 1038 1043 1048
1118 1048 1053 1063 1074 1019 964 1069 1174 1195 1106 1029 1083 1130 1112 1060 1075 1158 1241 1209 1177 1178 1179 1240 1300 1327 1354 1364 1373 1383 1392 1401 1411 1420 1430 1450 1471 1524 1578
1113 1578 1691 1804 1852 1899 2003 2108 2258 2342 2461 2713 3111 3642 4291 5160 6180 7199 8019 8531 8578 8054 7075 5875 4720
1111 4720 3784 3041 2517 2147 1909 1746 1715 1683 1652 1596 1540 1550 1560 1556 1553 1484 1415 1360 1304 1403 1501 1552 1603 1588 1573 1591 1609 1693 1777 1724 1670 1683
1107 1683 1695 1710 1724 1771 1819 1913 2007 2114 2088 2020 2017 2130 2308 2479 2651 2964 3408 3913 4638 5648 6967 8310 9346 9843 9682
1104 9682 8842 7606 6249 5025 4068 3330 2869 2540 2277 2081 1968 1921 1847 1708 1606 1570 1584 1597 1582 1566 1556 1546 1470 1394 1398 1402 1405 1409
1100 1409 1403 1397 1358 1320 1295 1271 1356 1442 1429 1416 1403 1390 1399 1408 1417 1426 1486 1547 1541 1536 1571 1607 1642 1678 1644 1609 1640 1672 1655 1638 1556 1473 1501 1528 1446 1363 1352 1341
1096 1341 1330 1319 1315 1311 1307 1304 1345 1386 1362 1337 1338 1339 1340 1340 1332 1324 1382 1439 1439 1438 1470 1503 1525 1546 1568 1590 1533 1476 1485 1493 1444 1394 1410 1427 1464 1501 1571 1641 1604 1567 1562 1558
1091 1558 1591 1623 1656 1689 1665 1641 1683 1725 1766 1807 1815 1823 1769 1714 1660 1605 1621 1637 1652 1668 1613 1559 1570 1581 1516 1451 1420 1388 1422 1455 1489 1523 1555 1588 1621
1086 1621 1653 1661 1669 1677 1685 1681 1677 1673 1670 1674 1679 1683 1688 1682 1676 1670 1665 1726 1788 1783 1779 1829 1879 1929 1980 1920 1861 1867 1873 1906 1938 1971 2003 2009 2014 1953 1892 1921 1950 1979 2008 1989 1969 2016 2063
1081 2063 2200 2336 2363 2390 2386 2382 2379 2375 2307 2239 2170 2102 2095 2089 2082 2075 2085 2095 2171 2247 2273 2299 2326 2352 2408 2463 2453 2443 2536 2629 2655 2682 2669 2655 2707 2759 2828
1076 2828 2897 2856 2815 2819 2823 2894 2964 2991 3017 2978 2938 2924 2909 2961 3012 3051 3090 3129 3169 3177 3185 3260 3334 3397 3460 3414 3367 3399 3431 3462 3494 3489 3483 3478 3472 3514 3555 3596
1072 3596 3637 3694 3750 3806 3863 3874 3886 4007 4128 4188 4248 4307 4367 4431 4495 4518 4607 4706 4739 4703 4667 4709 4751 4793 4835 4955 5076 5196 5317 5374 5431
1068 5431 5488 5545 5512 5479 5445 5412 5452 5493 5534 5575 5635 5694 5792 5823 5822 5821 5882 5943 5939 5936 6005 6140 6256 6373 6493 6613 6661 6708 6756 6804 6952 7101 7250
1064 7250 7399 7540 7680 7821 7961 8050 8138 8226 8314 8354 8394 8434 8474 8594 8714 8896 9078 9186 9228 9331 9501 9706 9845 9981 10183 10411
1061 10411 10530 10607 10750 10960 11103 11135 11166 11240 11313 11387 11461 11595 11729 11825 11988 12296 12605 12851 13097 13374 13650 13930 14210 14486 14829
1057 14829 15206 15650 16107 16565 16950 17268 17547 17760 17850 17873 17935 18062 18303 18543 18802 19062 19350 19705 20097 20490 20825 21160 21654 22215
1055 22215 22746 23278 23829 24513 25290 26198 27100 28002 28802 29603 30458 31313 32066 32820 33738 34789 35984 37400 39069 40958 43050
1052 43050 45450 48166 51277 54641 58313 62120 65795 69206 72486 76054 80105 84931 90768 97842 105927 114517 123240
1050 123240 131946 140783 150220 161458 175891 195027 220980 257437 309926 386104 495254 644968 832078 1034086
1048 1034086 1211830 1325716 1354041 1298733 1177425 1013092 829556 649843 492835 368657 277774 214623
1047 214623 172051 143674 124581 111596 102621 96064 90583 85586 80951 76712 72678 69040 66083 64049 63034 62942
1045 62942 63856 65692 68246 71283 74738 78412 82046 85459 88444 90858 92865 95091 98153 102489 108424 116072 125347
1043 125347 135633 146031 156123 166000 176360 188682 204827 226971 257509 300112 360777 448729 576455 756143
1041 756143 990459 1259308 1515015 1695288 1750175 1665506 1466966 1205135 933768 693346 503948 367235
1040 367235 273811 211179 169070 140238 120063 105613 95075 87028 79992 72874 65360 57790 50528 43990 38552
1038 38552 34313 31173 29083 27915 27599 27766 28125 28265 27872 26732 25009 23067 21193 19451 17877 16435 15219 14003
1035 14003 12845 11819 10915 10230 9769 9527 9434 9341 9254 9167 9023 8748 8436 8125 7936 7747 7493 7238 6990 6742 6494 6246 6052
1033 6052 5859 5599 5340 5248 5156 5064 4972 4944 4916 4822 4728 4640 4551 4463 4374 4326 4278 4128 3978 3914 3982 4122 4262 4379 4364 4270 4176 4165 4154 3990
1029 3990 3825 3725 3625 3524 3424 3362 3300 3304 3308 3264 3220 3175 3131 3068 3005 3007 3010 2946 2882 2819 2755 2761 2767 2708 2648 2538 2428 2385 2341 2280 2220 2151 2215 2271
1025 2271 2327 2325 2323 2378 2432 2487 2542 2661 2780 2746 2711 2721 2730 2740 2749 2667 2584 2567 2551 2530 2510 2423 2336 2358 2380 2337 2293 2276 2259 2208 2158 2159 2159 2159 2159 2152 2145 2105
1020 2105 2066 2053 2039 1960 1881 1771 1661 1661 1661 1677 1693 1642 1592 1639 1687 1624 1562 1569 1577 1585 1593 1594 1595 1595 1596 1645 1694 1743 1791 1884 1977 1959 1942 1974 2006 1973 1939 1917
1016 1917 1896 1874 1853 1814 1775 1676 1578 1526 1584 1689 1795 1806 1818 1796 1774 1726 1677 1629 1581 1597 1613 1629 1645 1625 1604 1517 1430 1427 1424 1421 1418 1437 1456 1475 1494
1011 1494 1529 1565 1534 1504 1570 1636 1670 1703 1692 1681 1670 1660 1718 1776 1769 1762 1717 1673 1695 1717 1734 1751 1735 1719 1707 1695 1748 1802 1795 1787 1839 1891 1940 1880 1779 1744
1007 1744 1782 1820 1797 1773 1813 1852 1896 1874 1843 1813 1811 1809 1797 1786 1774 1762 1833 1903 1941 1979 1948 1917 1910 1970 2081 2126 2059 1992 1994 1996 1936 1876 1928 2046 2131 2150
1002 2150 2180 2210 2236 2262 2316 2371 2401 2365 2365 2431 2465 2432 2405 2444 2476 2507 2507 2507 2478 2449 2382 2380 2408 2435 2449 2462 2409 2357 2361 2366 2370 2375 2366 2357 2381 2405 2463 2521 2557
998 2557 2527 2534 2650 2767 2774 2742 2777 2877 2977 2976 2974 2911 2847 2848 2914 3009 3105 3174 3243 3279 3315 3346 3376 3418 3393 3374 3465 3593 3655 3688 3722 3817 3913 4020
994 4020 4126 4171 4216 4290 4430 4532 4635 4720 4805 4889 4974 5049 5124 5237 5415 5711 6140 6660 7180 7824 8600 9505 10542 12003 14035
990 14035 16480 19056 21610 23945 25598 26065 25341 23783 21724 19358 16833 14439 12436 10828 9637 8843 8333 7956 7683
988 7683 7542 7532 7523 7448 7373 7363 7354 7364 7374 7494 7614 7743 7872 8067 8262 8456 8650 9041 9433 9799 10166 10533 10900 11282 11664 12208 12752
985 12752 13457 14293 15140 15988 16865 18050 19573 21404 23602 26547 30464 35305 41140 48073 55836 63819 71335 78104 83698
983 83698 87577 89528 90029 89778 89130 88082 86462 83969 79938 74099 66986 59532 52386 45481 38972 33331 28964 25729
980 25729 23329 21659 20473 19527 18712 18023 17554 17226 17029 16948 16998 17254 17642 18228 19033 20012 21210 22463 23584 24309 24725 25147
978 25147 25701 26481 27655 29264 31268 33524 35999 38717 41653 44892 48878 53930 60169 67579 76527 87211 99082
976 99082 111109 122565 133557 144242 154731 165221 175686 185492 193406 198463 200509 199347 194259 185172 173070
974 173070 159341 144705 129674 115006 101612 89480 78272 68123 59425 52174 45758 40046 35432 31979 29362
972 29362 27167 25456 24225 23302 22485 21976 21796 21683 21546 21628 21980 22463 22890 23382 24090 24929 25859 27097 28592 30153 31833
969 31833 33909 36523 39620 43304 48088 54239 61489 69717 79219 90085 102049 114832 128801 144251 160800 177832
967 177832 195084 212156 227603 239506 247058 250716 250901 247230 239296 227841 214233 199437 183895 167721 151151
966 151151 134554 118353 103054 89118 76599 65531 55992 47992 41524 36331 32341 29274 26904 24930 23275 21928
964 21928 20915 20122 19559 19215 18974 18800 18744 18821 19003 19317 19792 20399 21077 21887 22908 24149 25511 27093 29000 31391 34370
961 34370 38008 42459 47745 53850 61053 69601 79512 90521 102717 116310 131003 145542 158454 169104 177337 182993
959 182993 185792 185900 183678 179336 172840 164453 154614 143595 131389 117967 103797 89550 76051 63818 53298
957 53298 44482 37292 31546 27163 23819 21133 18972 17294 15962 14763 13686 12830 12166 11633 11158 10814 10657 10565 10518 10537
955 10537 10690 10843 11070 11517 12097 12743 13388 14164 15091 16149 17245 18473 19815 21222 22747 24579 26907 29895 33575 38002
952 38002 42996 48386 54023 59727 64945 69152 72415 75546 78896 81675 82920 82364 80269 76636 71126 63902 55802 47702
950 47702 40066 33002 26786 21757 17887 14939 12711 11055 9852 8868 8013 7289 6647 6072 5547 5154 4838 4522 4214 3906
948 3906 3775 3644 3578 3513 3472 3432 3391 3350 3330 3310 3356 3402 3452 3502 3552 3602 3671 3739 3808 3877 4170 4463 4764 5065 5487 6042 6715 7607 8913
944 8913 10703 12687 14671 16567 18330 19531 19721 18886 17392 15692 13772 11638 9505 7704 6299 5264 4537 4044 3770
942 3770 3544 3317 3171 3024 2846 2667 2489 2311 2208 2105 2069 2032 1958 1884 1876 1868 1880 1891 1837 1782 1838 1894 1949 2005 2076 2148 2228 2307 2505 2835
938 2835 3289 4050 5423 7455 9268 9630 8281 6186 4551 3752 3449 3278 3246 3522 3994 4532 5002 5253 5104 4646 4178 3842
935 3842 3735 3848 4124 4466 4743 4800 4725 4518 4218 3852 3514 3177 2846 2514 2306 2230 2175 2120 2182 2245 2318 2391 2399 2406 2488 2569 2541 2512 2368
932 2368 2223 2145 2066 1963 1860 1823 1785 1701 1616 1682 1747 1763 1713 1687 1794 1898 1937 2021 2105 2201 2296 2440 2717 3123 3750 4633 5824 7148
929 7148 8406 9341 9793 9866 9718 9400 8775 7689 6296 4898 3807 3008 2430 2130 1962 1852 1675 1470 1397 1374 1351 1336 1322 1329
926 1329 1336 1277 1218 1166 1114 1128 1141 1166 1191 1216 1240 1281 1321 1361 1401 1342 1284 1296 1441 1562 1552 1514 1476 1429 1381 1400 1418 1474 1530 1586 1642 1676 1710 1678
921 1678 1645 1642 1639 1558 1609 1714 1754 1773 1792 1773 1755 1670 1586 1497 1409 1320 1232 1291 1351 1300 1250 1224 1198 1172 1146 1191 1236 1180 1123 1072 1152 1269 1385 1422
917 1422 1460 1497 1534 1695 1856 1950 2045 2031 2017 2003 1989 2024 2058 2092 2126 2125 2124 2123 2122 2187 2252 2288 2390 2651 3044 3425 3806 4089 4240 4211 4049 3748
913 3748 3448 2993 2539 2070 1732 1532 1463 1414 1365 1324 1283 1260 1238 1215 1192 1243 1295 1346 1398 1436 1473 1511 1549 1573 1597 1621 1645 1669 1692 1826 1960
910 1960 2030 2100 2235 2371 2540 2708 2767 2826 2949 3072 3085 3098 3033 2968 2903 2838 2766 2695 2557 2419 2260 2100 1941 1781 1640 1498 1422 1346
906 1346 1361 1376 1325 1274 1254 1234 1214 1194 1187 1181 1175 1168 1153 1138 1188 1239 1218 1197 1177 1156 1225 1294 1298 1301 1410 1519 1628 1738 1852 1966 2080 2194 2295
902 2295 2396 2496 2597 2665 2733 2801 2869 3002 3134 3267 3400 3486 3572 3583 3595 3562 3396 3107 2818 2629 2440 2316 2193 2090 1987 1885
899 1885 1782 1630 1478 1435 1393 1299 1205 1176 1148 1146 1145 1143 1142 1145 1147 1150 1153 1139 1125 1112 1098 1131 1164 1197 1230 1301 1372 1443 1514 1550 1587 1623 1660 1741 1822 1837 1852
894 1852 1966 2080 2084 2088 2206 2324 2442 2560 2651 2741 2766 2791 2759 2727 2696 2664 2550 2436 2321 2207 2153 2099 1978 1858 1724 1590 1522 1454 1379
891 1379 1304 1229 1154 1140 1125 1111 1096 1136 1175 1105 1034 1006 978 950 923 936 949 963 976 987 998 977 955 1039 1123 1097 1071 1082 1094 1138 1182 1223 1265 1372
887 1372 1479 1532 1585 1573 1560 1631 1703 1709 1715 1794 1872 1918 1964 2014 2063 2146 2229 2240 2252 2263 2274 2230 2185 2074 1963 1914 1865 1750 1635 1636 1636 1571 1506 1449
883 1449 1392 1335 1278 1319 1360 1401 1442 1466 1491 1449 1408 1403 1397 1458 1518 1488 1457 1426 1395 1453 1511 1602 1693 1873 2052 2342 2631 3042 3453 3797 4142 4425
879 4425 4708 5006 5370 5720 5849 5481 4716 3850 3116 2547 2110 1775 1572 1501 1430 1308 1186 1130 1074 1048 1022 996 969 945 920 961 1002
875 1002 1042 1083 1013 944 967 991 948 905 927 949 937 926 952 979 985 925 879 966 1077 1122 1079 1036 1055 1073 1065 1056 1081 1105 1090 1076 1061 1047 1064 1082 1100 1118
871 1118 1110 1101 1092 1083 1126 1168 1177 1187 1256 1325 1241 1156 1140 1125 1089 987 903 951 995 974 883 857 945 1032 1029 1026 994 962 1016 1136 1228 1187 1123 1059 1097 1135 1142 1149
866 1149 1066 982 980 1111 1241 1239 1255 1271 1278 1286 1190 1095 1120 1146 1262 1378 1418 1457 1451 1446 1440 1434 1444 1453 1463 1472 1530 1588 1592 1530 1446 1494 1577 1595 1504 1414 1319 1225
862 1225 1277 1328 1347 1365 1314 1262 1265 1269 1321 1372 1424 1476 1491 1506 1577 1647 1558 1468 1456 1443 1454 1465 1476 1487 1508 1528 1549 1570 1602 1634 1612 1589 1662 1734 1811 1888
857 1888 1944 2066 2225 2252 2225 2199 2219 2240 2176 2112 2124 2137 2080 2022 1931 1841 1808 1775 1819 1863 1883 1902 1889 1875 1840 1805 1826 1846 1909 1972 2036 2099 2097 2096 2094
853 2094 2092 2140 2189 2237 2286 2280 2275 2269 2263 2282 2301 2286 2272 2221 2171 2241 2311 2325 2339 2254 2169 2139 2109 2134 2159 2135 2110 2140 2171 2202 2234 2233 2232 2244 2256 2213 2171 2140
848 2140 2110 2112 2115 2039 1964 1921 1879 1943 2008 2073 2137 2199 2261 2322 2384 2404 2425 2446 2466 2463 2460 2458 2455 2469 2483 2498 2512 2552 2591 2598 2605 2644 2683 2667 2651 2528 2404 2402
844 2402 2400 2467 2534 2502 2471 2368 2264 2161 2058 2005 1952 1976 1999 2009 2018 2083 2147 2210 2273 2336 2399 2373 2347 2321 2295 2261 2227 2226 2224 2221 2218 2161 2103 2139 2175 2211
839 2211 2248 2178 2109 2094 2080 2025 1970 2058 2145 2185 2225 2210 2195 2174 2153 2078 2002 1984 1965 2002 2038 2054 2070 2086 2102 2135 2169 2202 2236 2176 2117 2058 1998 1948 1898
835 1898 1903 1908 1940 1972 2003 2035 2063 2092 2157 2156 2153 2150 2197 2245 2202 2159 2193 2228 2208 2189 2169 2150 2163 2177 2186 2195 2152 2043 1898 1753 1726 1764 1799 1833 1811 1788 1798
830 1798 1809 1833 1857 1882 1906 1874 1841 1863 1886 1914 1943 1921 1899 1889 1945 2059 2173 2149 2060 1957 1854 1795 1801 1847 1893 1927 1961 1995 2028 1971 1913 1933 1952
826 1952 1939 1926 1990 2054 2047 2041 2067 2093 2104 2116 2127 2138 2137 2136 2135 2134 2111 2089 2106 2189 2238 2286 2298 2375 2496 2551 2523 2430 2333 2303 2330 2358 2357 2356 2355 2354 2336 2318 2377
822 2377 2436 2521 2607 2657 2641 2550 2525 2624 2722 2730 2738 2746 2753 2704 2655 2690 2790 2879 2968 3007 3045 2997 2949 2976 3069 3131 3062 3015 2969 2981 2993 3038 3083 3123 3164 3204
817 3204 3244 3179 3113 3112 3243 3335 3361 3391 3487 3638 3724 3707 3690 3726 3761 3796 3832 3854 3877 3900 3923 3966 4009 3997 3985 4006 4026 4145 4265 4303 4341 4456 4570
813 4570 4602 4633 4664 4695 4756 4818 4879 4941 4906 4872 4936 5065 5165 5133 5142 5217 5285 5353 5425 5497 5568 5639 5787 5935 6144 6352 6484 6616 6725 6835
810 6835 6911 6987 7093 7199 7378 7558 7637 7651 7741 7962 8164 8235 8244 8254 8190 8125 8116 8106 8152 8198 8244 8290 8378 8466 8631 8796 8997 9198 9433 9667
806 9667 10084 10501 10994 11553 12078 12470 12741 12879 12973 13067 13281 13715 14282 14849 15383 15916 16299 16461 16549 16638 16778 16919 17026 17134 17342
803 17342 17551 17958 18364 18790 19215 19722 20449 21316 22314 23433 24772 26377 28290 30692 33840 37942 43318 50211 58641 67830
800 67830 76272 82395 85661 86572 86384 86146 86304 86712 87428 89088 92551 97434 101922 103543 101076 95491 89423 85339 84462
798 84462 86527 90219 93789 95734 94956 91498 86347 80889 76302 73166 71766 72167 73953 76486 78936 80640 81389 81479 81618
796 81618 82416 83750 84865 85128 84995 85814 88962 94901 102642 110023 114899 116441 115477 113936 113757 116139 121376 129026 138301
793 138301 148599 159204 169311 177616 183087 185437 185318 184188 183597 184016 184241 182487 178218 173290 170630 171530 174669 177808
791 177808 179748 180239 178991 175325 169125 161825 155465 151435 149840 149695 149902 149889 149851 150472 152539 156055 160138 163298 164250
789 164250 162873 160405 159036 161155 168328 180454 195349 209486 220590 229085 237360 246789 255471 259297 255169 243125
787 243125 225938 207651 192044 181831 178431 181482 188796 197038 202512 202895 198401 191467 185105 181417 181112 183955 188600
785 188600 191993 190243 181231 166550 150821 138827 133184 133825 139054 146612 154115 159640 162462 163043 162303 161563 161894 164027
783 164027 168129 173682 180461 188602 198331 208896 218636 225343 227382 224454 218261 211848 208368 209504 215176 224058 234290
781 234290 244127 252587 259421 264217 265804 262381 253202 239929 225822 213834 205054 198537 192504 186087 179977 175471
779 175471 172855 170925 168600 166385 165444 166039 167030 167322 166780 165295 161833 155096 145327 134684 126195 122244 124137 131929
776 131929 144247 157829 168554 173439 172216 167378 162320 159591 160597 165662 173673 181705 186001 184524 178257 170041
774 170041 162396 156009 150281 144536 138570 132665 126980 121594 116516 111718 107491 104202 102187 101261 100730 99699 97834 95678
772 95678 94269 94730 97432 101300 103893 102878 97865 90906 85134 82521 82765 84346 85928 86868 86974 86261 85065 83715 82365
770 82365 80814 78604 75723 72975 71725 73509 78868 87084 96141 103308 106161 103873 97843 90627 84427 80381 79235
768 79235 81209 85324 88517 87199 79772 67835 54799 43599 35255 29455 25369 22316 19922 17849 15997 14320 12862
766 12862 11703 10676 9798 9140 8705 8335 7951 7566 7214 6993 6808 6623 6483 6342 6209 6076 6065 6185 6421 6657 6883 6977 6945
763 6945 6847 6777 6772 6772 6706 6615 6656 6853 7117 7278 7219 6949 6547 6201 5921 5723 5744 6006 6400 6796 7192 7540 7823 7880 7717 7296 6656
760 6656 6065 5606 5420 5454 5601 5748 5754 5541 5072 4471 3968 3596 3314 3164 3108 3119 3100 3082 3102 3122 3142 3162 3186 3211 3235 3260 3383 3507
756 3507 3571 3636 3775 4024 4188 4198 4105 4012 3976 3939 3826 3713 3600 3487 3518 3550 3581 3612 3589 3565 3542 3519 3581 3642 3638 3634 3547 3459 3306 3152 3084
752 3084 3015 2954 2893 2973 3164 3330 3430 3468 3506 3430 3354 3289 3223 3158 3093 3075 3058 3107 3156 3339 3523 3640 3758 3822 3886 3841 3795 3769 3743 3717 3691
749 3691 3778 3865 3952 4039 4148 4257 4305 4353 4380 4473 4525 4466 4387 4307 4155 4003 3923 3843 3764 3684 3646 3607 3634 3661 3667 3672 3677 3682 3729 3777 3758 3739 3711 3683 3654
744 3654 3626 3592 3558 3568 3511 3466 3531 3728 3924 4045 4165 4219 4274 4354 4434 4427 4310 4207 4170 4163 4155 4141 4237 4421 4604 4751 4831 4858 4753 4619 4486
741 4486 4298 4110 3998 4017 4033 3982 3916 3849 3834 3819 3836 3854 3872 3890 3800 3710 3595 3480 3458 3568 3717 3800 3815 3830 3917 4005 4114 4223 4233 4243
737 4243 4236 4229 4226 4223 4234 4312 4375 4307 4243 4245 4278 4312 4363 4414 4465 4516 4444 4372 4333 4294 4270 4247 4278 4309 4363 4416 4436 4457 4475 4492 4543 4594 4494 4393 4326 4259
733 4259 4142 4025 4007 3989 3917 3845 3828 3811 3828 3846 3864 3881 3927 3973 4019 4064 4071 4077 4083 4090 4033 3976 3886 3796 3755 3713 3727 3740 3782 3823 3940 4058 4147 4236 4183
728 4183 4129 4045 3961 4042 4123 4277 4432 4531 4631 4749 4866 4889 4912 4919 4992 5030 4935 4774 4678 4680 4681 4664 4646 4684 4721 4792 4862 4965 5069 5194 5319
724 5319 5420 5389 5296 5203 5178 5154 5139 5123 5109 4963 4775 4652 4627 4602 4466 4330 4270 4211 4267 4323 4412 4501 4530 4559 4511 4463 4414 4365 4394 4357 4297 4369
721 4369 4503 4571 4570 4635 4777 4853 4828 4868 5032 5196 5274 5351 5506 5660 5806 5953 6074 6064 6008 5952 5944 5935 5920 5906 5925 5943 5884 5824 5863 5902 5922 5942
717 5942 6148 6355 6511 6667 6853 6972 6885 6667 6441 6216 6057 5898 5904 5910 5962 6014 6164 6315 6355 6395 6435 6475 6479 6482 6453 6423 6407 6390 6495 6599
713 6599 6713 6827 6888 6883 6839 6927 7079 7232 7258 7284 7431 7578 7754 7930 8249 8567 8917 9267 9613 9828 9949 10069 10241 10282 10120 9738
710 9738 9370 9002 8681 8491 8441 8456 8441 8557 8838 9118 9316 9382 9456 9530 9537 9543 9440 9337 9139 8941 8824 8773 8769 8896 9151 9407 9498 9590
706 9590 9836 10081 10261 10441 10621 10800 10943 11085 11396 11838 12368 12898 13371 13843 14269 14695 15074 15453 15934 16723 17807 18957 20045
704 20045 21133 22220 23087 23471 23547 23805 24547 25595 26776 28114 29759 31661 33564 35310 36924 38499 39943 41015 41427
701 41427 41354 41346 41623 41768 41201 39976 38444 36846 35272 34006 33739 34834 36926 39502 42533 46136 50050 53569 56110 57464
699 57464 57646 56552 54141 50718 47091 44124 41914 40100 38505 37394 37168 37513 37834 37848 37810 37772 37498 36916 36244 35879 35824
696 35824 36077 36682 37770 39402 41869 45781 51495 58405 65622 72466 78739 84163 88224 90681 92040 92906 93289 92919 91977
694 91977 91335 91704 92666 93233 92880 92308 92378 93371 95312 98440 103606 111101 120266 129826 138694 146288 152489 157416 161288 164149
691 164149 165654 165094 162007 156678 150045 142928 135987 130057 126368 125799 128054 131583 135181 138472 141427 143547 144263 143880
689 143880 143492 143850 144871 146639 149708 154668 161080 167360 171713 173384 172921 171711 170754 170016 169045 168293 168986 171481 174506
687 174506 176081 175419 173306 170854 168336 165336 161940 159378 159409 162956 169536 177937 187788 199447 212908 226668 238274
685 238274 246491 252379 258106 264140 268735 269945 267970 264369 260248 256127 253563 254999 261409 271290 281793 290406 294459
683 294459 290997 278797 260577 240944 222499 204954 188244 174424 165922 163123 164762 169506 176667 185094 193037
681 193037 198750 200816 198609 193193 186651 180415 174487 168492 163026 159098 156957 156882 160148 168203 180220 192983 203818
679 203818 212236 218549 221654 219595 212306 202682 194069 187565 182160 177168 173538 172683 175036 180355 188882 201068 216023
677 216023 231535 245420 256394 262841 262769 255359 242521 227793 213458 199342 184685 170028 157183 147635 141425
675 141425 137807 136106 136384 139100 144322 151274 158710 164986 168669 169667 169655 170840 173563 175495 173340 165916 154669 142322
673 142322 130809 120818 112629 106808 104019 104087 105517 106561 106331 105117 103331 101192 99448 98962 99662 100335 100437 100869 102750
670 102750 105709 108359 110106 111546 113255 114964 116692 119079 122785 127765 133180 137583 139506 138484 135896 133968 134051 135583
668 135583 137044 136880 134257 129305 122870 116215 110445 106389 104469 104352 105175 106306 107893 110140 111999 111529 107949 102655
666 102655 98101 96404 98376 103733 111825 122246 134645 147967 160247 169934 176682 180662 181320 178243 172512 166650
664 166650 162451 160054 158980 158566 157647 154837 150199 144989 139557 132323 121688 108285 94626 82681 73258 66516 62320
662 62320 60278 59912 61523 65705 71777 77531 80252 78773 74350 69581 66790 66674 69063 73793 80675 88867 96750 103986
660 103986 112408 124423 139909 155160 164565 164576 156194 144224 133528 126104 121537 119573 120994 126346 135082 146323
658 146323 159102 171470 180805 185646 187367 189086 193135 199771 207769 215133 220431 223263 224029 222771 219095 214150 211359
656 211359 214058 222515 233136 240901 241942 235820 225984 217510 212701 209166 202247 189571 172997 156554 143392 134492
654 134492 128954 125218 122795 122702 125746 131031 136920 143117 150970 161329 173363 185968 199103 213337 227829 239728
652 239728 245776 245100 239689 232740 226055 219150 210723 199967 186769 171770 156979 145308 138843 137607 140613 147529
650 147529 158305 172290 188257 205411 222725 238149 249843 258505 267376 278312 288473 292174 285874 271091 252760
648 252760 235176 219771 206430 195590 188309 185461 187755 195839 208890 221940 227651 221886 207552 191262 176863
646 176863 163900 150937 138988 130247 126244 127296 132529 139915 146873 152556 158674 167472 179220 191364 200273 203424
644 203424 200675 194015 186740 182233 182637 187832 195080 199911 198891 190972 177372 160476 143102 127705 115330 105459
642 105459 97950 93913 94445 99151 106950 117254 129365 141783 153003 163037 172165 178787 180213 175178 165439 154425
640 154425 145054 138452 133940 130263 128108 129952 136464 144426 148893 147340 140558 130830 120960 113859 110078 106693 100611
638 100611 92024 83616 76745 71204 67465 66486 67661 69747 73723 81237 91168 100132 106416 110681 113145 113631 113722 115183
636 115183 116776 116397 115358 116660 119676 121791 124302 130364 138492 145795 156571 178539 212504 259539 338172 469980
634 469980 632684 746088 733933 599988 424688 286250 203054 152045 115495 92410 80883 72353 62637
632 62637 54706 49719 44716 39142 36122 36310 36793 36704 38433 42668 46812 48890 49117 47366 43299 38574 35946 35648 35290
630 35290 33833 32227 30842 28716 26282 25293 26106 27312 28650 31190 34654 36893 36891 36027 35382 34421 32538 30206 27875
628 27875 25311 22879 21538 21120 20377 18799 17282 16512 16168 16132 16936 18136 18209 16569 14315 12456 10897 9405 8416 8087
625 8087 7792 7277 6966 7050 7019 6592 6275 6266 6107 5466 4912 4753 4505 4037 3794 4035 4245 4060 3963 4173 4327 4086 3954 4218 4406
622 4406 4286 4232 4574 4813 4744 4786 5223 5706 5882 5915 6080 5994 5512 5091 5065 5130 4976 4848 5117 5479 5710 5979 6556 6942 6669 5975
619 5975 5347 4727 4041 3538 3432 3418 3273 3150 3334 3537 3520 3508 3716 3912 3888 3793 3917 3984 3744 3438 3439 3473 3286 3000 2934 3027 2988
616 2988 2950 3043 3160 3057 2932 2939 2932 2705 2511 2536 2612 2556 2451 2565 2661 2537 2424 2618 2866 2807 2687 2875 3134 3174 3115 3187 3324 3241
612 3241 3053 2998 2987 2845 2681 2737 2927 2897 2806 2847 2999 2931 2715 2631 2610 2457 2238 2151 2184 2085 1920 1887 2058 2096 2025 2085 2260 2303 2229
609 2229 2221 2273 2195 2046 2029 2070 1980 1857 1865 2004 2011 1951 2024 2223 2290 2247 2336 2495 2522 2393 2329 2391 2388 2314 2306 2354 2271 2122 2104 2205 2240 2237 2367
605 2367 2580 2662 2630 2665 2771 2811 2737 2729 2732 2603 2408 2345 2469 2527 2512 2498 2596 2563 2406 2249 2220 2191 2129 2068 2070 2073 1922 1770 1746 1721 1647 1705
601 1705 1815 1792 1705 1750 1876 1893 1829 1830 1949 2001 1904 1873 1928 1984 2043 2103 2248 2392 2427 2528 2746 2854 2830 2873 3005 3028 2886 2810 2946 3149
597 3149 3208 3267 3351 3435 3321 3208 3154 3100 3047 2993 3021 3050 3067 3150 3265 3270 3151 3097 3201 3305 3215 3125 3043 2962 2771 2580 2497 2414 2302 2300 2386
593 2386 2472 2411 2350 2426 2501 2379 2257 2260 2262 2264 2267 2305 2344 2317 2290 2390 2491 2558 2626 2809 2993 3023 3053 3071 3089 3041 2993 3085 3177 3236 3296 3485 3675
589 3675 3832 3988 4107 4225 4190 4154 4101 4049 3887 3724 3681 3639 3596 3553 3576 3599 3644 3755 3917 3968 3845 3721 3736 3751 3613 3474 3414 3354 3228
586 3228 3102 3056 3010 2965 2919 2959 3000 2974 2948 3009 3070 3054 3039 3023 3007 2914 2821 2828 2836 2843 2850 3064 3278 3305 3332 3385 3439 3350 3261 3273 3284 3218 3153 3182 3211
582 3211 3192 3174 3332 3600 3750 3747 3746 3745 3636 3527 3459 3391 3246 3036 2908 2890 2839 2788 2848 2908 2968 3027 3039 3050 2985 2853 2803 2862 2926 2923 2869 2815
578 2815 2757 2699 2775 2850 2925 3000 3117 3233 3251 3268 3322 3376 3331 3286 3189 3093 2948 2804 2816 2939 3011 2973 2936 2965 2951 2936 2882 2827 2773 2718 2708 2697
574 2697 2654 2610 2634 2657 2566 2475 2514 2663 2733 2736 2767 2799 2705 2611 2556 2501 2398 2295 2254 2323 2367 2345 2345 2346 2342 2338 2330 2322 2241 2160 2268 2442 2505 2458 2489 2630
569 2630 2719 2654 2624 2705 2806 2841 2880 2920 2926 2932 2982 3097 3168 3084 2963 2907 2805 2703 2690 2676 2718 2759 2824 2888 2834 2670 2562 2564 2615 2600 2625 2716 2777
565 2777 2728 2643 2624 2616 2608 2639 2670 2667 2599 2584 2678 2781 2818 2817 2883 2949 2948 2951 3019 3082 3080 3077 3074 3110 3080 3071 3171 3271 3262 3234 3272 3307 3276 3231 3253 3329 3340 3350 3427
561 3427 3536 3580 3622 3731 3836 3874 3841 3807 3803 3798 3832 3865 3847 3830 3899 4034 4104 4065 4058 4205 4380 4445 4412 4444 4525 4540 4560 4580 4595 4611 4666 4721 4853
557 4853 4985 5106 5228 5360 5383 5351 5384 5429 5473 5538 5603 5679 5689 5744 5908 6072 6127 6164 6266 6402 6538 6683 6829 6975 7121 7165 7210 7254
553 7254 7298 7432 7566 7699 7833 7895 7957 8137 8318 8442 8697 9099 9632 10354 11208 12040 12653 13035 13199 13267 13270 13256 13242 13159 13010 12906
550 12906 12933 13037 13075 13157 13371 13852 14553 15405 16389 17230 17676 17689 17394 16969 16478 16066 15875 15885 15895 15839 15783 15735 15687 15682 15808 16058 16308
547 16308 16625 16942 17333 17724 18160 18728 19446 20229 21129 22337 23771 25337 26903 28601 30442 32415 34758 37761 41950 47677
544 47677 55275 64587 74372 82793 88248 90583 90803 90451 90594 91484 92916 94480 96034 97522 98824 99644 99516 98027 95005
542 95005 90708 86095 82581 81078 81552 83326 85407 86659 86108 83462 79190 74303 69548 65372 61855 59234 57535 56763
540 56763 56650 57026 57709 58709 60192 62268 65003 68506 72844 78050 84179 90954 97596 102871 105641 105351 102469 98175
537 98175 93749 90506 89418 90845 94865 101455 110638 121892 133893 144806 153390 160062 166954 176719 190660 207166
536 207166 222134 230952 231551 225322 216236 208077 202423 198301 194048 188976 183772 179107 174837 170073 164122 157166 149727
533 149727 142603 136666 132932 131966 133853 137806 142248 145239 145214 142069 137144 132351 129234 128095 128439 129531 130913 132955
531 132955 136370 141762 148701 155948 162025 166036 168322 170300 173987 181234 192741 207016 220836 230568 234062 231360
529 231360 224087 214573 204698 195745 188627 184015 182687 185798 194332 208183 225283 241812 254045 260521 262251 261299
527 261299 258722 254079 246656 236375 224244 211717 200218 190608 182778 175871 169239 163004 157620 153422 150378 148608
525 148608 148168 148739 149600 149978 149433 148580 148727 150940 155158 160123 164577 168724 173777 180896 190155 200512 210517 218721
523 218721 224259 227380 228853 229140 227866 224087 217199 207894 197683 188483 182041 179774 182545 190282 201227 212040 219025
521 219025 219989 214987 205986 195449 185396 176837 170344 166141 164619 166114 170904 178597 187478 194633 197173 194037 186461
519 186461 176535 165949 155517 146008 137993 131429 125775 120693 116446 113386 111595 111166 112671 116592 123033 131714 141890
517 141890 152286 160844 165579 165897 163094 159667 158218 160356 165877 172946 179443 184083 187097 189567 192256 194747 196140
515 196140 195844 194185 191279 186308 177714 164769 148600 131595 115871 102739 92618 85354 80531 77775 77133 78381
513 78381 80396 81839 82310 82385 82324 81076 77416 72043 67128 64366 63682 64008 64509 64791 64138 61948 58445 54458 50823 47583
510 47583 44704 42220 40197 38482 36875 35575 34780 34732 35403 36820 39023 42061 46033 51104 57180 63388 68203 70161
508 70161 68917 65519 61880 59866 60341 62970 66704 70131 71789 70942 67738 63260 58622 54644 52041 51240 51906 52352 50763
506 50763 46493 40383 33965 28682 25288 23844 23324 22298 20085 17208 14638 12821 11574 10636 10005 9709 9633 9554 9475 9287
503 9287 8966 8566 8166 7741 7316 7061 7026 7220 7545 7843 7922 7536 6754 5874 5125 4518 4042 3623 3337 3193 3050 2980 2911 2841 2772
500 2772 2812 2852 2875 2899 2923 2946 3091 3235 3371 3507 3541 3443 3310 3177 3055 2933 2934 3068 3180 3293 3414 3535 3707 3878 4000 3990 3836
497 3836 3463 3064 2797 2630 2463 2361 2260 2159 1925 1692 1591 1510 1430 1358 1285 1331 1377 1423 1469 1527 1585 1635 1685 1770 1724 1686 1647 1680 1712
494 1712 1634 1557 1531 1506 1414 1323 1324 1325 1392 1459 1480 1502 1457 1413 1430 1447 1464 1481 1432 1383 1335 1286 1374 1462 1485 1507 1498 1489 1476 1462 1469 1410 1347 1350 1376 1337 1232
489 1232 1128 1153 1243 1272 1235 1179 1188 1262 1336 1357 1311 1266 1287 1392 1498 1535 1506 1412 1318 1330 1408 1450 1382 1277 1238 1215 1193 1174 1155 1191 1228 1326 1424
485 1424 1499 1509 1519 1594 1729 1864 1893 1922 1972 2022 1962 1903 1857 1811 1728 1711 1791 1872 1923 1909 1866 1757 1644 1597 1580 1564 1485 1407 1466 1525 1583 1642 1608
481 1608 1574 1565 1621 1716 1745 1706 1666 1699 1732 1765 1799 1855 1912 1968 2025 2070 2115 2160 2205 2255 2306 2416 2525 2552 2470 2342 2280 2237 2128 2028 1993 2053 2180
477 2180 2310 2375 2401 2427 2450 2472 2507 2542 2573 2604 2567 2465 2363 2327 2334 2341 2242 2143 2054 1965 1876 1786 1807 1827 1848 1868 1912 1955 1999 2043 2082 2122 2052 1982
473 1982 2102 2223 2344 2465 2529 2593 2658 2722 2762 2801 2775 2749 2750 2750 2685 2620 2589 2558 2527 2496 2608 2721 2724 2726 2693 2660 2586 2402 2227 2161 2181 2201 2170
469 2170 2139 2108 2077 2105 2133 2161 2189 2192 2195 2198 2202 2263 2325 2386 2448 2408 2368 2328 2288 2224 2160 2097 2033 2034 2035 2101 2234 2317 2290 2182 2139 2239 2338 2441 2545
464 2545 2589 2633 2568 2502 2505 2509 2512 2515 2609 2703 2687 2672 2620 2569 2517 2466 2416 2366 2206 2047 1980 1914 1913 1913 1879 1845 1811 1777 1740 1703 1666 1629 1693 1757 1711 1664 1689
460 1689 1714 1742 1771 1855 2006 2108 2100 2100 2165 2224 2217 2151 2084 2014 1943 1922 1901 1880 1859 1850 1840 1830 1820 1750 1680 1665 1649 1671 1692 1681 1669 1711 1752 1739 1725 1696
456 1696 1666 1636 1607 1589 1571 1608 1645 1581 1517 1398 1278 1221 1164 1106 1049 1093 1137 1181 1225 1208 1192 1176 1159 1147 1136 1124 1113 1163 1214 1320 1426 1448 1470
452 1470 1492 1513 1525 1537 1618 1700 1715 1620 1444 1268 1243 1218 1139 1059 1037 1015 1048 1080 1028 976 891 805 820 834 881 928 994 1059 1003 947 889 832 741 650
447 650 675 699 724 748 742 736 729 723 738 753 768 783 733 683 710 737 731 724 663 602 641 681 643 606 643 679 771 863 896 929 863 797 783 769 722 676 647 618
443 618 622 626 696 766 781 796 695 594 592 589 655 721 687 654 649 644 639 634 622 611 545 479 503 528 497 467 431 395 458 521 534 546 482 418 395 372 405 437
438 437 454 472 419 367 387 518 597 567 484 466 502 471 436 467 534 600 608 616 591 565 522 479 513 547 530 514 530 546 579 613 679 745 717 688 659 630
434 630 595 561 526 491 513 535 558 580 553 526 498 471 452 433 417 402 438 539 633 616 555 495 504 514 537 560 551 541 486 430 408 386 392 399 405 412 411 410 409
429 409 408 435 461 488 515 495 476 457 438 386 334 348 361 398 435 406 378 402 427 456 484 533 647 725 692 639 652 662 606 553 566 579 527 443 425
425 425 432 439 447 456 497 538 509 479 450 420 407 394 446 499 525 551 544 537 560 582 605 627 574 520 576 632 600 567 600 634 632 630 596 561 509 458 472 486 500
420 500 513 527 540 534 529 523 517 462 407 462 516 531 546 495 444 394 345 329 313 396 479 452 424 405 385 366 346 335 323 378 432 401 371 373 375 383 391 366 340
415 340 354 368 382 396 412 427 476 525 527 530 467 403 351 300 357 415 442 469 435 400 411 489 562 526 428 396 431 465 408 352 405 459 501 544 520 497
411 497 421 346 380 415 400 385 370 355 351 348 344 340 362 384 406 427 474 521 534 548 437 327 414 501 494 487 414 341 356 371 452 533 488 443 464 485 467
406 467 448 463 478 506 533 495 457 378 298 329 359 437 514 559 604 529 455 491 527 537 548 559 570 504 437 436 436 465 495 558 621 601 582 529 476 469 462
402 462 565 667 789 911 993 1075 1053 921 740 560 509 458 473 488 498 509 487 465 431 397 473 549 561 573 585 597 560 523 552 581 562 543
398 543 491 438 454 470 486 501 554 607 594 581 568 556 608 661 643 625 606 588 551 515 545 574 627 680 799 984 1187 1280 1219 1048 891 800 731
394 731 661 600 538 586 634 599 564 561 559 524 490 488 487 501 515 497 478 521 565 608 651 637 622 607 593 629 665 635 605 617 629 641 653 575 496 571 646
389 646 657 668 679 690 670 650 597 544 561 578 660 743 749 756 828 900 888 876 863 851 853 855 857 859 843 828 845 863 780 696 679 661 673 684 761 904 984 955
385 955 926 896 880 864 881 897 849 801 787 772 849 926 937 948 970 992 981 970 999 1029 1058 1088 1061 1034 1073 1113 1080 1048 1049 1050 1099 1149 1199 1248 1258 1268
380 1268 1278 1288 1351 1413 1475 1537 1502 1468 1433 1398 1366 1335 1413 1491 1458 1424 1424 1423 1456 1489 1489 1490 1542 1595 1680 1766 1797 1829 1893 1957 1922 1886 1917 1947 2035 2123 2178
376 2178 2233 2256 2280 2303 2326 2359 2392 2491 2590 2700 2810 2953 3096 3183 3270 3389 3509 3726 3942 4268 4594 4880 5166 5423 5745 6148 6683
372 6683 7362 8348 9608 11087 12839 14590 16066 16882 16915 16289 15248 14075 13023 12191 11556 11140 10863 10651 10410 10168 9997
370 9997 9825 9695 9564 9434 9303 9101 8899 8803 8707 8645 8518 8353 8320 8305 8290 8284 8277 8445 8612 8846 9080 9259 9439 9554 9668 9799 9931
366 9931 10063 10327 10629 11063 11739 12635 13707 15000 16831 19409 22800 27465 34065 41938 48177 49538 45246 37658 30139
364 30139 24333 20060 16886 14635 13131 12009 10887 9830 8906 8132 7491 6965 6658 6401 6210 6112 6081 5988 5764 5489 5346
362 5346 5274 5203 5110 5018 4926 4833 4749 4664 4690 4715 4790 4865 5050 5234 5386 5538 5690 5842 6143 6445 6717 7056 7601 8277 9052 9826 10665
358 10665 11723 13054 14692 16363 17638 18199 17925 16812 15040 12970 10966 9221 7697 6437 5485 4819 4284 3813 3342
356 3342 2985 2761 2572 2383 2326 2269 2179 2089 2076 2063 2017 1970 1872 1773 1711 1649 1671 1759 1819 1746 1646 1545 1502 1459 1353 1247 1207 1167 1137 1107 1044
352 1044 981 985 989 993 998 1035 1073 1045 1017 917 817 827 837 863 889 850 810 848 885 813 741 758 776 760 745 765 786 807 827 766 705 644 583 564 545 526
348 526 507 562 617 672 727 692 657 622 587 613 640 666 693 753 813 763 713 722 732 713 694 747 865 903 831 757 748 737 660 586 577 592 608 591 574 556
343 556 539 555 571 587 603 567 531 463 394 377 361 410 459 413 368 389 410 438 466 428 391 478 565 586 607 569 530 492 453 476 500 457 414 375 336
339 336 364 391 429 468 441 414 416 418 453 488 446 405 396 387 407 428 448 468 411 354 297 239 317 395 473 551 546 542 471 401 358 315 337 360 409 458 441 424
334 424 422 420 418 416 393 370 347 325 365 406 447 487 503 519 430 340 365 457 512 456 380 371 383 395 421 447 415 382 371 471 570 559 495 430 359 287 254
330 254 221 188 155 188 221 254 287 270 253 269 284 319 354 323 291 195 98 112 125 127 129 240 352 337 322 307 293 290 287 283 280 305 329 353 378 394 410
325 410 426 442 394 346 363 381 380 379 379 378 365 352 339 326 319 312 305 298 295 292 289 287 277 268 325 381 343 305 377 449 471 494 450 407 438 468 389 310 318 325 310 230 205
320 205 290 408 416 365 380 454 462 358 255 256 258 219 180 207 234 216 198 284 369 398 318 229 206 258 310 367 423 401 380 359 337 373 410 336 262 243
316 243 225 272 319 294 270 246 221 257 293 329 365 376 386 430 473 520 567 504 441 428 414 434 453 398 342 352 362 358 353 381 409 373 338 302 267 367
311 367 467 457 447 447 447 447 447 424 400 377 354 369 383 398 412 406 400 394 388 390 392 329 265 284 302 387 472 456 441 425 409 469 529 479 429 453 476 433 325
307 325 279 343 444 479 425 371 345 320 349 378 341 304 300 295 356 417 381 345 374 470 526 472 375 277 298 320 374 428 404 380 422 464 561 657 644 630
302 630 625 619 614 609 580 552 523 494 473 451 430 408 474 539 538 537 515 493 471 448 450 451 452 453 487 520 554 587 586 585 519 452 439 425 416 407 447 554 595 505 341
297 341 308 347 386 315 243 238 233 286 339 326 313 350 386 423 460 458 457 456 455 441 428 414 400 329 258 252 247 265 283 301 319 344 370 395 420 375 330 395 460
292 460 430 400 370 339 296 252 273 295 349 402 455 508 445 383 387 390 392 393 394 395 397 398 399 400 471 542 547 552 504 457 410 363 345 328 376 425 488 552 506 460 422
287 422 384 455 527 569 610 542 474 371 269 232 196 256 317 378 439 423 406 456 506 469 432 395 358 399 441 482 523 526 529 532 535 464 393 329 265 246
283 246 337 469 535 525 514 498 483 415 346 343 341 278 216 264 311 305 299 294 288 275 263 317 370 450 530 499 469 381 294 360 426 426 426 382 404 477 440 365 357
278 357 431 505 474 442 446 449 453 456 419 381 343 306 326 346 256 167 199 232 264 297 308 319 329 340 359 378 398 417 396 376 356 336 306 276 312 348 320
274 320 292 264 236 279 323 366 409 447 484 455 426 422 418 414 410 338 266 223 246 301 355 389 357 229 166 217 333 383 324 264 205 182 160 142 123 122 187
269 187 281 374 325 275 258 241 197 153 135 181 299 350 333 316 296 276 322 368 361 354 347 340 341 342 343 344 313 282 313 343 394 379 367 356 406 456 401 345 302
264 302 326 378 430 414 398 382 366 407 449 490 532 483 433 413 458 493 528 462 395 351 373 428 417 373 328 345 362 337 312 312 378 403 363 294 291 292 292
260 292 268 244 246 315 408 501 484 401 350 366 383 400 388 376 363 350 300 316 384 453 415 377 340 302 260 284 291 298 243 188 235 283 331 378 372 365 392 418
255 418 436 454 405 357 345 333 387 441 447 452 392 332 355 379 402 425 409 393 438 483 460 371 257 253 305 357 350 343 354 365 310 255 256 257 323 390 391 393 361
250 361 329 327 325 426 527 558 480 422 430 449 401 358 380 376 372 372 372 400 428 424 419 441 463 375 288 360 432 438 445 471 497 457 418 383 348 346 344 368 393 418 443
245 443 463 484 505 525 478 431 350 270 335 400 399 398 435 472 443 413 373 332 357 382 356 331 371 411 366 320 275 229 255 281 307 333 363 394 358 322
241 322 336 349 363 376 409 441 408 375 344 313 282 252 248 244 306 368 363 357 286 215 212 210 273 336 378 419 351 282 298 314 264 214 151 87 177 267 316 366
236 366 305 244 228 211 260 309 387 465 433 402 360 319 343 368 340 312 284 256 255 255 254 254 324 395 400 405 372 338 371 403 385 368 350 332 328 324 320 316 385 455
231 455 415 374 304 234 274 314 357 401 411 421 458 495 422 350 390 429 469 509 479 449 352 256 231 206 247 287 369 451 423 395 350 304 324 344 378
227 378 412 380 348 286 225 230 235 240 245 284 322 314 305 297 288 332 376 387 398 285 171 124 77 154 231 308 385 427 470 402 335 404 472 431 390 326 263 266 268
222 268 297 326 322 317 309 301 326 351 333 315 264 214 236 258 248 237 233 229 292 354 400 446 493 539 496 453 410 367 382 397 411 426 468 510 552 594 529 463
218 463 397 332 334 336 371 407 433 459 376 292 298 303 309 315 313 312 278 244 306 368 364 360 318 277 268 260 271 281 325 369 349 330 310 290 297 304 343 383 339 295 317 339
213 339 377 416 388 361 377 393 376 358 391 423 422 422 402 381 361 341 408 475 432 389 376 364 351 339 358 377 396 415 403 390 378 366 317 268 252 237
208 237 262 287 422 558 533 508 483 458 492 526 494 461 433 404 342 281 279 278 276 274 275 277 311 345 369 393 307 221 220 218 283 347 347 347 347 347 364 380 397 413
203 413 387 361 401 441 444 447 383 320 314 307 366 425 416 407 431 455 434 412 390 369 342 316 355 395 412 429 446 464 446 428 476 524 535 545 523 500 488 476
199 476 463 451 398 344 401 457 468 479 424 370 351 333 380 428 441 454 467 480 416 352 398 444 409 374 339 304 288 271 255 238 273 307 341 376 431
194 431 486 432 377 306 235 230 225 226 227 228 229 247 264 282 299 293 288 347 407 447 486 493 499 526 553 548 542 502 463 457 450 359 267 329 391 403 415 423 431 418 338 293 357
189 357 440 413 345 277 312 346 348 349 412 475 471 468 406 345 349 353 368 383 365 347 355 362 336 310 287 265 242 219 273 327 381 435 420 405 390 376 376 375 375 375 366 358
184 358 349 341 356 371 386 401 438 476 447 418 375 332 355 378 387 396 342 289 298 372 443 403 294 252 275 298 221 144 178 211 291 371 418 465 493 521 516 511
179 511 492 473 454 436 398 361 324 286 296 306 316 326 303 279 354 429 451 473 417 362 344 326 307 289 284 279 351 422 383 343 358 373 377 380 384 387 447 506
175 506 489 472 399 325 307 289 305 321 267 214 218 354 490 494 431 368 330 291 254 216 277 339 375 411 370 329 310 291 349 407 428 449 415 381 378 376
170 376 373 370 410 450 413 376 372 369 365 361 337 313 344 375 391 406 366 326 306 285 231 178 197 216 235 254 292 329 366 404 397 390 417 443 391 338 363 387 393 399
165 399 351 302 332 363 394 425 395 365 335 306 297 288 377 467 482 497 457 417 384 351 351 350 346 342 392 443 455 468 425 382 310 239 288 338 347 356 310 264 243
161 243 222 201 180 230 281 331 382 326 270 291 312 310 307 305 302 338 375 378 382 321 259 318 378 435 491 449 407 362 318 329 339 336 332 328 324 293 262 285 309 316 324
156 324 331 338 317 295 373 451 433 416 399 382 435 487 485 482 445 408 425 443 494 545 519 493 479 465 397 328 237 145 196 248 269 291 313 335 358 382 350
151 350 319 321 323 358 394 303 213 243 274 275 276 277 277 358 438 441 445 428 411 395 378 385 393 400 407 433 459 484 510 414 317 297 278 294 311 328 344 340 335 330 326 314 303
146 303 291 279 347 414 371 329 278 227 286 345 346 347 348 349 366 382 398 414 399 383 368 352 411 470 419 368 337 306 341 376 443 509 466 423 410 397 385
141 385 372 366 360 354 349 348 348 348 347 306 264 289 313 288 264 305 346 298 250 202 154 144 134 234 334 326 317 308 300 331 361 392 422 442 462 415 369 353 336 386
136 386 435 364 293 331 370 403 436 403 370 381 392 403 414 417 421 425 428 413 397 382 366 351 335 319 304 344 385 360 334 349 363 377 392 366 341 315 290
132 290 289 288 287 285 308 330 286 243 247 252 256 261 271 281 357 433 439 444 450 456 456 456 456 456 406 355 371 386 373 360 346 333 360 387 414 442 484 526 458 391 362 333 304
127 304 276 288 300 313 325 328 330 436 542 582 512 401 355 358 361 368 375 422 469 449 430 478 525 463 401 410 419 428 437 418 400 381 363 369 375 381 387 429 471 513 555
122 555 543 532 454 376 364 351 338 325 338 351 364 378 370 363 356 348 341 334 327 319 348 377 406 435 444 454 463 473 445 417 389 361 324 288 252 215 267 319 371 423
117 423 407 390 373 356 350 344 338 332 308 284 326 368 361 353 345 338 342 347 352 356 345 333 321 309 296 283 270 256 327 397 313 230 270 310 349 389 341 292 353 415 405
112 405 394 384 374 317 260 268 277 323 369 414 460 458 455 452 450 451 453 344 236 271 307 342 377 371 365 359 353 381 408 369 330 292 253 280 307 342 376 410 444 372
107 372 300 295 289 314 339 298 257 232 208 249 291 339 388 327 265 251 236 222 207 229 251 273 295 354 413 406 399 431 463 494 526 500 474 448 422 395 368
102 368 407 445 403 360 384 407 450 492 425 357 335 313 291 268 329 390 341 292 263 234 206 177 218 258 298 338 292 246 200 153 244 334 314 294 262
98 262 230 197 165 221 276 332 388 438 488 428 368 313 259 314 369 418 466 448 431 407 384 360 336 292 248 270 292 369 446 369 292 306 320 334 348 316
94 316 285 254 222 191 159 128 97 115 133 151 170 192 214 237 259 243 227 277 327 266 205 144 82 124 166 207 249 304 360 349 338 337 337 270 203 194 185 176
89 176 167 194 221 248 276 288 300 312 324 328 331 401 470 483 496 509 522 505 488 471 454 401 348 295 242 288 333 378 424 400 377 354 330 368 405 442 479
84 479 429 378 393 409 448 487 460 433 383 334 394 454 482 509 503 497 427 356 319 282 280 277 275 273 301 328 355 383 364 345 327 308 354 400 446 492 590 688 676
80 676 664 620 577 533 489 494 498 502 506 514 523 531 539 516 494 537 580 543 507 470 433 437 441 378 316 256 197 247 298 330 363 396 429 404 380 355 330 347 363 314 264
75 264 301 338 309 280 327 373 354 334 307 279 361 443 496 549 537 458 388 429 507 519 439 359 384 410 399 387 376 365 369 373 444 514 519 525 531 536 506 475 444
70 444 414 391 369 346 324 401 479 556 634 712 789 713 637 548 459 481 502 597 693 722 752 722 693 729 765 838 911 918 924 888 852 849 845 867 890 846 736
65 736 623 619 660 701 649 597 578 558 522 486 516 546 539 532 557 583 522 462 401 340 408 475 543 611 660 709 758 807 796 785 774 762 845 928 1011 1094 1007
61 1007 920 800 681 629 576 590 604 625 645 633 621 638 655 672 689 710 731 685 640 685 730 709 688 678 668 724 780 897 1014 977 875 798 831
57 831 901 906 857 808 820 833 844 856 867 878 824 770 782 794 850 905 850 796 774 752 763 774 809 844 879 914 894 874 854 834 980 1126 1269 1411
53 1411 1592 1707 1696 1553 1471 1454 1458 1462 1568 1674 1780 1885 1869 1852 1836 1819 1947 2076 2204 2332 2715 3097 3493 3889 4553 5437 6570
49 6570 8627 12503 17654 21321 20990 16873 11745 7920 5720 4400 3562 3236 3130 2878 2495 2359 2355 2246 2006 1870 1954 2021
47 2021 1957 1864 1705 1462 1219 1096 1105 1089 1072 1173 1339 1491 1510 1542 1574 1472 1370 1388 1537 1643 1683 1806 1928 2017 2172 2570 3188 3936
43 3936 5169 7230 9600 11025 10473 8393 6182 4811 4363 4440 4517 4237 3562 2670 1997 1634 1490 1346 1203 1197 1192 1187 1181 1105 1028
40 1028 951 875 883 891 965 1039 1161 1283 1321 1228 1040 786 597 540 518 496 483 470 558 646 625 603 514 426 447 468 516 565 504 443 419 396 405 415
36 415 474 533 526 519 479 440 433 426 477 528 513 498 457 417 442 467 468 469 470 470 483 495 442 388 440 492 511 530 510 490 535 581 513 445 376 308 395 482 635
31 635 788 806 825 777 730 703 676 649 623 675 728 715 702 644 585 527 468 475 482 488 495 504 513 457 400 371 342 378 415 394 373 352 332 317 303 288 274 301
27 301 329 323 318 381 444 441 438 347 256 230 205 285 366 380 395 372 348 358 368 344 320 296 272 311 349 322 294 295 296 231 166 199 231 263 296 292 289 351 413 363
22 363 313 324 336 392 383 369 421 531 575 550 525 518 510 436 362 361 360 359 358 402 447 462 412 384 356 327 299 303 373 443 447 345 243 210 243 299 356 350 345 332
17 332 318 366 415 448 415 314 213 195 244 296 283 272 326 376 361 325 288 317 411 466 455 420 384 395 406 351 296 297 297 298 298 269 239 234 295 375 390
12 390 335 281 298 315 332 349 352 356 293 231 289 347 340 332 337 341 350 358 394 496 532 502 495 487 476 464 398 331 331 330 365 400 436 471 451 431 411 392 301 210 148
7 148 151 199 247 299 351 333 315 297 279 262 244 226 208 216 223 230 237 245 252 259 266 267 267 267 267 291 316 341 366 347 329 310 291 306 320 269 217 163 109 209 309 322
2 322 335 349 362 364 365 301 237 306 375 334 293 327 361 460 560 492 424 356 288 278 269 259 250 254 258 263 267 312 356 401 446 447 448 383 317 306 294 349 403 413 424
-3 424 368 313 327 342 290 239 197 155 180 204 216 228 240 253 299 346 392 439 444 450 456 462 405 349 359 369 354 339 324 309 350 392 433 475 456 438 419 401
-7 401 369 337 305 272 295 317 339 361 275 189 212 236 285 334 383 432 460 489 451 414 422 431 506 581 607 632 504 375 287 198 219 241 267 294 255 216
-12 216 214 212 276 340 370 399 363 327 332 338 343 348 321 293 265 238 175 113 160 208 323 438 399 359 388 416 379 341 335 330 324 318 271 225 244 264 314 363 347
-17 347 331 307 283 259 235 193 152 220 288 327 367 340 313 242 170 164 158 178 198 219 239 226 214 267 320 307 294 280 267 233 199 166 132 151 170 189
-21 189 208 197 186 175 164 207 249 291 334 331 328 391 454 416 378 340 302 283 265 246 227 294 362 363 364 393 422 384 347 317 286 256 226 245 264 279 294
-26 294 307 255 180 106 137 278 394 444 423 402 443 484 519 555 484 414 375 402 392 382 352 323 360 396 361 325 395 465 499 467 407 346 324 302
-30 302 280 258 307 355 403 451 408 365 285 271 316 361 304 248 210 239 296 354 373 392 345 298 278 258 243 227 236 311 452 527 504 482 455 429 401
-34 401 373 411 449 415 381 412 510 560 500 356 212 176 206 237 201 174 147 181 215 235 256 276 296 321 347 306 266 261 256 255 254 254 320 411 502 487 405
-39 405 361 317 364 412 391 304 232 225 243 261 244 228 278 327 325 323 427 531 540 483 463 443 422 401 343 350 362 374 390 406 378 350 322 294 252 210 234
-43 234 258 262 265 291 382 481 469 333 196 169 252 273 294 319 345 370 395 380 366 289 213 212 277 342 341 323 304 282 259 268 277 286 295 373 451 501 484 425
-48 425 366 368 371 381 392 402 413 451 489 498 441 367 293 281 268 267 266 265 264 287 310 329 348 374 334 265 196 256 316 310 305 351 397 419 375 380 452 519 521 490 460
-53 460 426 392 393 394 433 405 368 331 290 249 256 263 270 277 288 299 351 337 298 325 348 305 235 166 205 310 353 329 281 232 235 237 240 242 214 186 157 129 142 155
-58 155 168 180 195 210 224 239 247 254 328 402 368 334 301 267 210 153 162 171 192 213 167 122 132 142 151 161 167 172 178 183 204 225 246 266 304 342 314 286 267 247
-62 247 227 207 259 311 298 284 332 380 428 476 426 377 328 279 267 254 242 230 281 332 316 301 281 260 349 438 424 411 397 383 357 331 304 278 277 275
-67 275 274 272 247 222 263 304 281 257 234 210 319 427 469 512 468 424 380 335 334 332 331 329 335 342 348 354 360 366 372 378 375 373 371 368 366 363 361 358 316 274 232 191 188 186 184 182 193
-73 193 204 281 357 321 285 250 214 208 203 264 324 278 231 185 138 157 176 261 346 335 323 312 301 286 272 323 374 358 342 326 310 325 341 356 371 367 363
-77 363 359 356 369 382 395 409 440 471 436 401 343 285 227 168 193 217 307 397 380 362 345 327 333 339 345 351 333 315 296 278 342 406 360 314 281 247 324 401
-82 401 380 359 338 317 304 290 210 130 152 174 195 217 256 295 268 241 221 201 291 381 379 377 309 241 258 275 293 310 331 351 372 393 317 242 166 91
-86 91 129 167 206 244 236 227 219 210 187 165 142 119 115 112 214 316 354 327 270 214 226 238 250 262 249 236 288 341 363 386 342 299 273 248 222 196 190 184 283
-91 283 382 395 341 284 292 287 216 148 147 144 141 164 253 369 376 341 373 490 542 481 420 372 325 278 230 224 218 274 330 351 307 299 292 326 361 329 298 295 292 290 287
-96 287 259 230 165 165 198 232 163 95 122 215 271 327 360 392 359 326 315 305 294 283 315 347 379 412 387 362 342 321 332 409 486 497 432 366 321 342
-100 342 367 326 289 318 400 483 415 348 337 326 315 304 323 341 360 379 376 373 407 375 291 206 227 249 240 231 288 345 332 319 307 294 321 348 375 403 413
-105 413 423 433 444 449 453 392 331 294 257 285 314 311 308 305 302 308 315 255 195 209 222 235 248 273 298 323 347 316 284 315 345 361 311 236 271 357 443 382 321
-110 321 323 325 261 197 228 259 290 320 298 275 318 361 406 450 385 319 214 109 113 118 133 148 164 179 224 269 314 359 275 191 173 154 210 265 210 155
-114 155 154 153 218 283 273 262 252 242 209 175 252 328 397 466 425 384 344 303 262 221 258 295 332 369 308 248 293 338 344 283 193 213 355 430 392 289
-118 289 243 262 282 236 158 146 158 171 188 204 221 238 240 243 312 381 370 359 348 338 342 346 284 223 189 155 187 219 238 256 209 161 135 109 148 188 253
-123 253 317 315 314 279 243 273 304 312 321 329 338 300 261 223 185 221 257 293 329 300 271 242 213 226 240 253 267 208 148 199 250 311 373 368 364 341 318 295 272
-128 272 253 234 281 328 369 409 339 270 266 263 259 255 261 266 271 276 305 334 297 259 263 266 270 274 236 198 227 255 286 317 341 365 401 326 210 160 191 222 256 291
-133 291 404 518 477 436 416 397 315 233 262 356 413 360 312 330 406 417 337 256 282 307 378 449 444 438 400 362 269 176 164 152 216 281 304 328 318
-137 318 309 338 366 318 270 277 284 291 297 308 318 328 338 340 342 311 280 351 422 372 322 267 213 214 215 227 239 285 330 369 407 347 286 246 206 243 279 307 335
-142 335 363 391 350 309 345 381 373 366 358 351 362 373 384 394 379 364 381 399 347 295 342 390 389 389 334 278 294 311 327 343 325 308 290 273 310 348 385 422
-146 422 432 441 450 460 405 350 328 306 352 398 367 336 295 255 247 239 280 321 307 293 278 263 249 234 294 354 381 408 301 194 207 220 290 360 331 302
-151 302 331 360 334 308 292 276 315 354 396 439 427 414 341 269 273 277 352 427 425 423 312 202 190 179 250 322 316 311 381 451 400 350 273 196 195 195 233 271
-155 271 253 236 235 234 232 231 222 214 238 262 225 187 248 310 348 387 327 266 285 304 322 341 382 423 409 396 393 390 355 319 318 316 315 314 330 347 363 379 349 319 288
-160 288 258 296 333 371 409 372 336 299 263 282 302 321 341 346 352 358 363 350 337 323 310 227 144 160 176 182 188 194 199 185 170 155 140 143 146 204 261 285 309 301
-165 301 292 346 401 423 444 449 453 425 396 354 311 268 226 235 244 252 261 373 486 444 402 390 377 364 351 320 289 258 227 230 234 237 240 223 206 254 303 301 298 296 294
-170 294 293 291 290 288 306 324 341 359 322 285 248 210 227 243 260 276 275 275 209 142 177 213 248 283 213 144 184 224 157 90 89 87 171 255 338 422 348 274 309
-175 309 345 362 379 330 281 220 159 163 168 227 287 346 405 405 406 406 406 379 352 324 297 214 130 113 95 110 126 141 157 146 136 125 115 142 169 196 223 238
-180 238 253 268 282 286 290 227 165 191 216 242 268 241 214 253 292 258 224 256 289 345 401 347 294 293 293 359 425 446 467 488 510 455 401 346 292 277 262
-184 262 247 232 278 325 306 287 294 302 310 317 285 253 330 408 485 561 484 407 351 294 304 313 344 375 406 437 422 406 390 375 322 268 325 382 404 427 383
-189 383 340 303 266 294 323 329 334 274 214 226 239 251 264 290 316 342 368 443 518 396 273 276 280 283 287 332 377 356 335 332 329 326 323 296 269 242 215 246 277
-194 277 307 338 275 212 148 85 114 143 238 333 359 385 411 437 458 478 433 387 353 319 285 250 288 325 252 179 185 190 196 201 208 215 287 360 304 248 257 267
-198 267 244 220 197 174 194 214 234 254 278 302 326 350 341 331 388 445 416 388 359 331 374 417 350 283 248 213 243 274 312 349 277 205 174 143 178
-202 178 213 169 125 146 168 169 171 172 173 149 126 168 210 225 240 320 401 352 303 254 206 241 276 311 346 356 366 376 386 343 301 259 217 257 297 337 377
-207 377 359 341 323 305 326 346 366 386 379 371 298 225 142 59 130 201 239 277 315 353 318 282 247 211 250 288 327 365 316 267 218 168 221 273 325 378
-211 378 344 311 278 244 237 230 222 215 181 147 179 277 378 370 275 179 201 224 180 137 169 201 233 265 336 406 411 415 350 285 285 285 278 270 329 387 414 441 401 362
-216 362 357 353 348 343 298 254 209 164 206 248 289 331 316 301 287 272 343 413 418 423 362 300 349 398 392 387 382 376 378 379 381 382 367 353 338 323 313 302 292 281 267 252
-221 252 304 355 402 450 431 413 333 253 239 225 277 329 381 433 403 374 344 315 293 272 251 229 260 290 320 351 313 274 302 329 271 213 221 229 272 316
-226 316 249 183 167 151 244 338 373 408 332 257 262 267 272 277 244 211 177 144 162 180 264 348 326 304 283 261 279 297 316 334 322 310 298 286 267 248 229
-230 229 211 223 236 249 262 316 370 359 347 238 129 129 130 187 244 235 227 237 247 258 268 255 242 229 215 238 260 283 306 315 324 334 343 352 362 371 380 353 325
-235 325 298 270 283 295 307 320 290 260 296 333 314 295 276 258 283 308 268 227 302 377 386 395 367 338 310 282 279 275 272 268 219 169 185 202 285 369 343 316
-240 316 308 300 226 152 208 265 255 246 237 228 219 211 189 168 147 126 205 284 363 442 418 394 370 346 342 337 399 460 448 437 426 414 372 330 288 246 285 324 254
-245 254 183 170 158 146 133 125 117 174 232 307 382 391 399 353 307 261 215 231 248 264 280 339 398 346 295 280 265 250 235 283 331 314 230 191 262 333 404
-249 404 430 456 482 507 485 462 440 417 327 237 213 189 217 245 272 300 295 290 284 279 233 188 208 228 262 296 264 232 231 230 230 229 249 268 288 308 291 274 256
-254 256 239 270 301 228 156 135 224 288 286 270 254 300 346 343 339 335 332 309 286 263 240 318 397 409 422 369 317 265 213 238 262 287 311 348 385 356 327
-258 327 312 298 284 270 245 220 194 169 183 197 313 430 449 358 292 292 312 331 355 378 347 317 286 255 310 364 385 407 407 407 297 188 203 218
-263 218 233 249 269 289 309 329 349 370 357 345 364 384 294 204 162 119 143 167 248 330 345 361 388 416 377 339 325 311 298 284 281 278 275 271 237 203 235
-267 235 267 296 325 321 318 210 103 149 195 216 237 191 146 194 243 291 339 300 262 223 184 170 156 142 128 144 159 175 190 245 299 321 343 378 413
-271 413 383 352 314 275 269 263 309 354 399 445 373 302 297 291 280 269 225 182 222 263 270 278 227 175 157 139 163 187 212 236 246 257 267 278 271 263 256 249 266 284
-276 284 235 187 188 189 190 190 182 174 231 289 301 314 260 206 182 157 242 327 334 342 349 357 338 320 334 348 351 354 290 227 277 327 377 427 373 319 375 431 391 352 279
-281 279 206 252 297 309 322 296 269 243 217 146 75 114 153 194 235 277 318 282 246 211 175 240 306 305 304 299 295 356 417 431 444 392 340 292 243 305 367
-286 367 349 331 313 295 257 218 246 273 285 297 243 189 170 151 165 179 126 72 85 97 213 329 379 430 415 400 385 370 360 351 342 332 244 157 223
-290 223 289 302 315 361 407 428 448 468 489 436 382 329 276 230 184 204 224 301 377 299 222 159 95 142 188 199 209 252 295 330 364 289 213 174 135
-294 135 206 277 310 343 310 278 279 281 348 416 389 362 335 308 316 325 334 342 251 159 134 108 153 198 210 222 283 343 337 332 289 247 237 227 152 76 110 145 158
-299 158 171 184 197 223 250 277 304 304 303 303 302 269 237 204 171 210 248 221 193 234 275 250 225 206 186 277 367 377 387 331 275 305 335 366 396 365 335
-304 335 370 405 398 392 386 380 297 214 123 164 241 319 295 271 268 264 326 388 386 383 381 379 393 408 357 306 325 344 329 315 330 345 326 308 320 332 278 224 212 199
-308 199 253 307 258 210 194 179 242 304 301 298 254 209 275 340 313 285 224 163 203 243 283 324 274 224 240 256 263 269 276 282 322 361 401 440 397 355 312 269
-313 269 276 284 292 300 324 348 372 397 380 363 346 329 339 350 360 371 348 326 304 281 288 295 302 309 267 224 215 205 231 257 216 176 224 272 320 367 390 412 369
-318 369 325 306 287 301 315 306 297 288 280 304 328 352 377 407 438 435 432 352 272 258 244 295 346 331 316 346 375 339 303 238 173 217 262 243 225 206 187 262
-323 262 336 345 354 357 360 363 365 348 330 312 295 284 274 263 253 242 232 221 211 203 196 188 181 249 317 319 321 325 329 333 337 368 400 431 462 382 301 287 272 271 271 270 269 367 465
-328 465 409 353 287 220 219 218 222 226 230 234 219 203 298 392 375 358 340 323 296 269 304 339 266 127 29 41 114 187 266 346 307 268 230 191 268 345 355
-333 355 366 285 203 231 259 249 239 126 13 -16 64 148 233 231 229 227 225 257 290 323 355 310 264 328 392 369 346 323 301 290 279 335 390 374 358 403
-337 403 449 404 293 219 255 298 274 229 184 175 167 159 151 183 216 249 282 270 257 179 101 142 183 225 266 287 308 329 350 348 347 345 344 304 263 223 183 166
-342 166 149 131 114 172 230 223 215 244 274 303 333 375 417 349 281 197 112 94 75 154 233 246 259 276 292 309 325 277 229 181 133 184 235 286 337 316
-346 316 296 275 255 249 244 238 233 240 247 254 261 252 243 168 93 65 37 119 201 196 191 186 181 211 240 270 299 252 204 157 109 96 83 136 189 210 231 253 274 272 270 267 265 247
-351 247 228 209 191 224 258 182 105 98 91 194 297 271 244 218 192 196 200 203 207 269 331 282 234 211 189 232 276 363 450 340 230 236 242 183 123 146 169
-356 169 191 214 197 180 163 146 153 161 168 176 186 196 206 216 150 85 129 173 152 131 111 90 111 133 155 176 217 257 297 337 291 245 198 152 216 280 235
-360 235 189 186 183 180 177 178 178 179 180 233 286 339 392 338 284 230 176 245 313 315 318 278 238 198 159 161 164 167 170 157 144 131 118 186 254 213 171 193 214 236 258 265
-366 265 271 274 276 242 143 18 4 110 216 175 69 90 222 324 361 333 305 273 241 238 235 233 230 268 307 345 384 341 298 259 220 224 295 325 245 143
-370 143 41 87 132 144 157 169 181 223 266 308 350 313 275 238 200 236 271 307 342 371 400 318 237 230 223 217 210 130 50 81 111 188 266 278 289 311
-374 311 332 353 374 388 401 348 295 261 226 191 156 197 237 278 319 254 189 190 190 180 170 161 151 187 224 261 298 326 355 318 281 276 272 268 264 306 348 324
-379 324 300 206 112 127 143 209 275 275 275 285 295 304 314 331 347 298 248 265 282 298 315 267 219 238 256 277 298 319 340 291 241 258 275 291 308 259
-383 259 210 174 139 103 68 124 181 237 294 262 231 199 168 150 132 180 228 246 265 349 433 404 376 347 319 334 348 363 378 329 281 233 184 205 226
$$ [...]
##$OBSERVED INTEGRALS=	(X Y Z)
(3.5491732217895610724, 3.9657451902867348892, 1)
(2.4951199075618664125, 2.7097175883028348231, 0.65658614559664496557)
(2.3120807092828079554, 2.4951199075618664125, 0.32072372127080939208)
(1.8197683828770576664, 2.0785479390646925957, 0.65533568846132028707)
(1.6619759705675234418, 1.7377163284760979156, 0.60103289807228277297)
(1.4978718617656050505, 1.6177940951208531484, 0.34592036741642612219)
(1.1444168581922462558, 1.3590145389332122239, 0.6621635809148000984)
(7.2778692763295680379, 7.3033236948156714519, 0.069488976472356397962)
(7.1755802242650403855, 7.25712863904459482, 0.30203769848704731249)
(7.0228537133484270072, 7.073291172200522503, 0.2927462895633486939)
(6.9172650144431111485, 7.011069260345601073, 0.60303642328587747645)
##END=	
##END=	
