##TITLE=	Jan31-2020.30.fid
KF001
##JCAMP-DX=	6.0	$$ MestReNova 14.1.0-24037
##DATA TYPE=	LINK
##BLOCK_ID=	1
##BLOCKS=	2    
##ORIGIN=	Mestrelab Research S.L.
##OWNER=	kf119
##$MNOVA/LINK_BLOCK_TYPE=	ITEM	$$ NMR Spectrum
##$MNOVA/ITEM/POLYGON=	(XY..XY)
5321,5835
8722,5835
8722,8208
5321,8208
5321,5835
##$MNOVA/ITEM/Z=	0
##$MNOVA/ITEM/ANGLE=	0
##TITLE=	Jan31-2020.30.fid
##JCAMP-DX=	6.0	$$ MestReNova 14.1.0-24037
##BLOCK_ID=	2
##DATA TYPE=	NMR SPECTRUM
##DATA CLASS=	XYDATA
##NUMDIM=	1
##ORIGIN=	Bruker BioSpin GmbH
##OWNER=	nmrsu
##.OBSERVE FREQUENCY=	400.05240029999998796
##.OBSERVE NUCLEUS=	^1H
##.SOLVENT NAME=	CDCl3
##.PULSE SEQUENCE=	zg30
##LONGDATE=	2020/01/31 15:52:00.000
##.ACQUISITIONMODE=	SIMULTANEOUS (DQD)
##$ORIGINAL FORMAT=	Bruker XWIN-NMR
##$MNOVA/SCALES_VERSION=	8
##$PARAMETER FILE=	(acqus, ASCII, //ch-nmrserv2.ch.ic.ac.uk/Av400D/ug1/nmr/Jan31-2020/30/acqus, 0)
$$ ##TITLE= Parameter file, TOPSPIN		Version 3.2
$$ ##JCAMPDX= 5.0
$$ ##DATATYPE= Parameter Values
$$ ##NPOINTS= 11	$$ modification sequence number
$$ ##ORIGIN= Bruker BioSpin GmbH
$$ ##OWNER= nmrsu
$$ $$ 2020-01-31 15:52:15.270 +0000  nmrsu@nmrpc
$$ $$ /opt/topspin/data/ug1/nmr/Jan31-2020/30/acqus
$$ $$ process /opt/topspin3.2/prog/mod/shimcntl
$$ ##$ACQT0= -2.04831932773109
$$ ##$AMP= (0..31)
$$ 100 100 100 100 100 100 100 100 100 100 100 100 100 100 100 100 100 100
$$ 100 100 100 100 100 100 100 100 100 100 100 100 100 100
$$ ##$AMPCOIL= (0..19)
$$ -1 0 0 0 0 0 0 0 0 0 0 0 0 0 0 0 0 0 0 0
$$ ##$ANAVPT= -1
$$ ##$AQSEQ= 0
$$ ##$AQ_mod= 3
$$ ##$AUNM= <au_zg>
$$ ##$AUTOPOS= <3 >
$$ ##$BF1= 400.05
$$ ##$BF2= 400.05
$$ ##$BF3= 400.05
$$ ##$BF4= 400.05
$$ ##$BF5= 400.05
$$ ##$BF6= 400.05
$$ ##$BF7= 400.05
$$ ##$BF8= 400.05
$$ ##$BYTORDA= 0
$$ ##$CAGPARS= (0..11)
$$ 0 0 0 0 0 0 0 0 0 0 0 0
$$ ##$CFDGTYP= 0
$$ ##$CFRGTYP= 9
$$ ##$CHEMSTR= <none>
$$ ##$CNST= (0..63)
$$ 1 1 1 1 1 1 1 1 1 1 1 1 1 1 1 1 1 1 1 1 1 1 1 1 1 1 1 1 1 1 1 1 1 1 1 1
$$ 1 1 1 1 1 1 1 1 1 1 1 1 1 1 1 1 1 1 1 1 1 1 1 1 1 1 1 1
$$ ##$CPDPRG= (0..8)
$$ <> <> <> <> <> <> <> <> <>
$$ ##$D= (0..63)
$$ 0 1 0 0 0 0 0 0 0 0 0 0 0 0 0 0 0.0002 0 0 0 0 0 0 0 0 0 0 0 0 0 0 0 0
$$ 0 0 0 0 0 0 0 0 0 0 0 0 0 0 0 0 0 0 0 0 0 0 0 0 0 0 0 0 0 0 0
$$ ##$DATE= 1580485934
$$ ##$DE= 6.5
$$ ##$DECBNUC= <off>
$$ ##$DECIM= 2496
$$ ##$DECNUC= <off>
$$ ##$DECSTAT= 4
$$ ##$DIGMOD= 1
$$ ##$DIGTYP= 12
$$ ##$DQDMODE= 0
$$ ##$DR= 22
$$ ##$DS= 4
$$ ##$DSPFIRM= 0
$$ ##$DSPFVS= 20
$$ ##$DTYPA= 0
$$ ##$EXP= <proton>
$$ ##$F1LIST= <>
$$ ##$F2LIST= <>
$$ ##$F3LIST= <>
$$ ##$FCUCHAN= (0..9)
$$ 0 2 0 0 0 0 0 0 0 0
$$ ##$FL1= 90
$$ ##$FL2= 90
$$ ##$FL3= 90
$$ ##$FL4= 90
$$ ##$FOV= 20
$$ ##$FQ1LIST= <>
$$ ##$FQ2LIST= <>
$$ ##$FQ3LIST= <>
$$ ##$FQ4LIST= <>
$$ ##$FQ5LIST= <>
$$ ##$FQ6LIST= <>
$$ ##$FQ7LIST= <>
$$ ##$FQ8LIST= <>
$$ ##$FRQLO3= 15959.0749999881
$$ ##$FRQLO3N= 2
$$ ##$FS= (0..7)
$$ 83 83 83 83 83 83 83 83
$$ ##$FTLPGN= 0
$$ ##$FW= 125000
$$ ##$FnMODE= 0
$$ ##$FnTYPE= 0
$$ ##$GPNAM= (0..31)
$$ [...]
$$ 130000 130000 130000 130000 130000 130000 130000 130000 130000 130000 130000
$$ 130000 130000 130000 130000 130000 130000 130000 130000 130000 130000 130000
$$ 130000 130000 130000 130000 130000 130000 130000 0 0 0 0 0 0 0 0 0 0 0
$$ 0 0 0 0 0 0 0 0 0 0 0 0 0
$$ ##$ShimPowMaxUC= (0..63)
$$ 130000 130000 130000 130000 130000 130000 130000 130000 130000 130000 130000
$$ 130000 130000 130000 130000 130000 130000 130000 130000 130000 130000 130000
$$ 130000 130000 130000 130000 130000 130000 130000 130000 130000 130000 130000
$$ 130000 130000 130000 130000 130000 130000 130000 0 0 0 0 0 0 0 0 0 0 0
$$ 0 0 0 0 0 0 0 0 0 0 0 0 0
$$ ##$ShimPowMaxUG= (0..63)
$$ 524287 524287 524287 524287 524287 524287 524287 524287 524287 524287 524287
$$ 524287 524287 524287 524287 524287 524287 524287 524287 524287 524287 524287
$$ 524287 524287 524287 524287 524287 524287 524287 524287 524287 524287 524287
$$ 524287 524287 524287 524287 524287 524287 0 0 0 0 0 0 0 0 0 0 0 0 0 0 0
$$ 0 0 0 0 0 0 0 0 0 0
$$ ##$ShimPowRcbType= 3
$$ ##$ShimPowRes= (0..63)
$$ 1e-20 1e-20 1e-20 1e-20 1e-20 1e-20 1e-20 1e-20 1e-20 1e-20 1e-20 1e-20
$$ 1e-20 1e-20 1e-20 1e-20 1e-20 1e-20 1e-20 1e-20 1e-20 1e-20 1e-20 1e-20
$$ 1e-20 1e-20 1e-20 1e-20 1e-20 1e-20 1e-20 1e-20 1e-20 1e-20 1e-20 1e-20
$$ 1e-20 1e-20 1e-20 1e-20 0 0 0 0 0 0 0 0 0 0 0 0 0 0 0 0 0 0 0 0 0 0 0 0
$$ ##$ShimPowRng0= (0..63)
$$ 1 1 1 1 1 1 1 1 1 1 1 1 1 1 1 1 1 1 1 1 1 1 1 1 1 1 1 1 1 1 1 1 1 1 1 1
$$ 1 1 1 1 0 0 0 0 0 0 0 0 0 0 0 0 0 0 0 0 0 0 0 0 0 0 0 0
$$ ##$ShimPowRng1= (0..63)
$$ 1 1 1 1 1 1 1 1 1 1 1 1 1 1 1 1 1 1 1 1 1 1 1 1 1 1 1 1 1 1 1 1 1 1 1 1
$$ 1 1 1 1 0 0 0 0 0 0 0 0 0 0 0 0 0 0 0 0 0 0 0 0 0 0 0 0
$$ ##$ShimPowRng2= (0..63)
$$ 1 1 1 1 1 1 1 1 1 1 1 1 1 1 1 1 1 1 1 1 1 1 1 1 1 1 1 1 1 1 1 1 1 1 1 1
$$ 1 1 1 1 0 0 0 0 0 0 0 0 0 0 0 0 0 0 0 0 0 0 0 0 0 0 0 0
$$ ##$ShimPowRng3= (0..63)
$$ 1 1 1 1 1 1 1 1 1 1 1 1 1 1 1 1 1 1 1 1 1 1 1 1 1 1 1 1 1 1 1 1 1 1 1 1
$$ 1 1 1 1 0 0 0 0 0 0 0 0 0 0 0 0 0 0 0 0 0 0 0 0 0 0 0 0
$$ ##$ShimSysFunc= (0..63)
$$ 1 2 3 4 5 6 7 8 9 10 0 37 38 35 16 15 14 13 12 11 28 27 26 25 24 23 36
$$ 22 30 29 20 21 34 33 32 31 17 18 19 0 0 0 0 0 0 0 0 0 0 0 0 0 0 0 0 0 0
$$ 0 0 0 0 0 0 0
$$ ##$ShimSysMatrix= 0
$$ ##$ShimSysType= 4
$$ ##$TFXNUM= 0
$$ ##$TRIPLO2= 0
$$ ##$VTU= 2
$$ ##$VTUETH= <149.236.99.20>
$$ ##$VTUTY= <no>
$$ ##$WBREFAM= (0..15)
$$ 136.7 118.7 100 100 100 100 100 100 100 100 100 100 100 100 100 100
$$ ##$WBREFLM= (0..15)
$$ 0 0 0 0 0 0 0 0 0 0 0 0 0 0 0 0
$$ ##$WBREFPH= (0..15)
$$ 77.55 -71.28 0 0 0 0 0 0 0 0 0 0 0 0 0 0
$$ ##$WBSGU= (0..15)
$$ 0 0 0 0 0 0 0 0 0 0 0 0 0 0 0 0
$$ ##$XFAC= 2
$$ ##END=
$$ 
##$DECIM=	2496
##$DSPFVS=	20
##XUNITS=	HZ
##YUNITS=	ARBITRARY UNITS
##FIRSTX=	6406.710256386850233
##LASTX=	-1606.1102564336499654
##DELTAX=	-0.12226780365942625795
##XFACTOR=	1
##YFACTOR=	0.007567527707955473866
##FIRSTY=	8.3555889129638671875
##MINY=	3.9913542270660400391
##MAXY=	5163.79931640625
##NPOINTS=	65536
##XYDATA=	(X++(Y..Y))
$$ [...]
2719B201j20j21j1N1N6ql0L1L5k9l9O5J48J48J4J4P6J39J00mmmJ9J9N3J16K01L06L86M91O00
$$ 2201 2081 1960 1949 2000 2056 2048 2018 2049 2084 2055 2016 2081 2229 2377 2391 2405 2481 2620 2720 2716 2712 2708 2727 2746 2799 2915 3116 3422 3808 4299 4899
2716D899P05P51P50O72N68M08K21O0j28k58l20k65p7J34L63N57P45Q22P59N89L80J61j30m43
$$ 4899 5604 6355 7105 7777 8345 8753 8974 9034 8906 8648 8328 8063 7986 8120 8483 9040 9785 10607 11366 11955 12335 12496 12366 11923
2713A1923p34q68r93j035r72q91p66o81n57m56l32k34j71r5r5r8r7o3%P8K03K62L86N23O47
$$ 11923 11189 10321 9328 8293 7321 6430 5664 4983 4426 3970 3638 3404 3233 3138 3043 2945 2848 2785 2785 2863 3066 3328 3714 4237 4884
2710D884O64N38L65M89Q46Q46L21l86p41o16l55k94m18m81l92j85PPM1M0K88K87L8l36m75
$$ 4884 5548 6086 6451 6940 7786 8632 8953 8567 7826 7210 6855 6561 6143 5662 5270 5085 5092 5099 5140 5180 5468 5755 5793 5457 4982
2707D982l50j76l02m44m45l33k09k10j47p8p9m3m3l1l2%%N9O0m4m5m0m1p2p1NOO8O8Q4Q5J16
$$ 4982 4632 4456 4154 3710 3265 2932 2723 2513 2366 2288 2209 2166 2123 2092 2060 2060 2060 2119 2179 2135 2090 2050 2009 1937 1866 1871 1877 1945 2013 2097 2182 2298
2703B298J16j2j3K2Q5J86L10M73N98M78K71L12O03O60K86k44n36l83j74j32k56k87k23j09
$$ 2298 2414 2402 2389 2411 2496 2682 2992 3465 4063 4541 4812 5124 5727 6387 6673 6429 5893 5510 5336 5204 4948 4661 4438 4329
2700D329J7KKJ87L94M17J24l07m31l29k03j81l05l55l56l32l33j71j72o8o7mml5l5p3p3j0
$$ 4329 4346 4348 4350 4537 4931 5348 5472 5165 4734 4405 4202 4021 3716 3361 3005 2673 2340 2169 1997 1929 1862 1858 1854 1819 1784 1711 1638 1628
2696A628j1P9P9k6k5k7k7k7k8j1j2N1N1K3K3K3K3Q4Q4Q4Q4l7l7l7l7l9l9p0p0j7j7p9p9l8
$$ 1628 1617 1696 1775 1749 1724 1697 1670 1643 1615 1604 1592 1643 1694 1717 1740 1763 1786 1870 1954 2038 2122 2085 2048 2011 1974 1935 1896 1826 1756 1739 1722 1643 1564 1526
2692A526l8ooJ11J11J05J05K8p7j63j64k6k7L6L6JJo1o2M9M9M8M9J9K0j2j2n7n7NNk4k4L8
$$ 1526 1488 1482 1476 1587 1698 1803 1908 1936 1859 1696 1532 1506 1479 1515 1551 1552 1553 1492 1430 1479 1528 1576 1625 1644 1664 1652 1640 1583 1526 1531 1536 1512 1488 1526
2688A526L9K0K0m2m2j7j7j6j7j2j2J9K0J00J01L8L8L6L6k7k6K0K0j1j1NMk6k7p6p6j4j3J2
$$ 1526 1565 1585 1605 1563 1521 1504 1487 1471 1454 1442 1430 1449 1469 1569 1670 1708 1746 1782 1818 1791 1765 1785 1805 1794 1783 1788 1792 1766 1739 1663 1587 1573 1560 1572
2684A572J3n0n0P1P0l3r5l3P2P2P1L8L8L8L7n6n6OOl1l0r3r3POOOJ8J8J8J8k3k3k4k3k7k7
$$ 1572 1585 1535 1485 1556 1626 1593 1498 1465 1537 1609 1680 1718 1756 1794 1831 1775 1719 1725 1731 1700 1670 1577 1484 1491 1497 1503 1509 1527 1545 1563 1581 1558 1535 1511 1488 1461 1434
2679A434k7k7NNO7O7k5k5k5k5J5J5J5J5mlo6o6mnN8N8PPn6n5KJKJn3n3J0RJ2J2J2J2O3O3%
$$ 1434 1407 1380 1385 1390 1457 1524 1499 1474 1449 1424 1439 1454 1469 1484 1480 1477 1411 1345 1341 1336 1394 1452 1459 1466 1410 1355 1357 1358 1360 1361 1308 1255 1265 1274 1286 1298 1310 1322 1385 1448 1448
2674A448%K4K4l8l8l3l3l4l3M2M1M1M1J3J2n0n0m8m9J4J4J4J4m8m9KJo1o1j8j8M4M5mllmR5
$$ 1448 1448 1472 1496 1458 1420 1387 1354 1320 1287 1329 1370 1411 1452 1465 1477 1427 1377 1329 1280 1294 1308 1322 1336 1288 1239 1241 1242 1181 1120 1102 1084 1128 1173 1169 1166 1163 1159 1254
2670A254R4j0p2j0R4R0j3o5o4rqO9P0PPk1k1k2k1l9l8l8l9Q8Q8j2j3l9K2N3n1r6RQ9Q9l6l6
$$ 1254 1348 1338 1266 1256 1350 1440 1427 1362 1298 1289 1281 1350 1420 1427 1434 1413 1392 1370 1349 1310 1272 1234 1195 1283 1371 1359 1346 1307 1329 1382 1331 1235 1244 1333 1422 1386 1350
2665A350K7K6n0n0J2P5O4m0p6j2J3J3J7J7m4m5m4m5K7K7K7K7L8L8o6o6l4l3l4l4O8O8O8O8
$$ 1350 1377 1403 1353 1303 1315 1390 1454 1414 1338 1326 1339 1352 1369 1386 1342 1297 1253 1208 1235 1262 1289 1316 1354 1392 1326 1260 1226 1193 1159 1125 1193 1261 1329 1397
2661A397j0j1j0j0J2J1J2J2qqqqn4n5M9N0M1M2k1k1J2J2J2J1j4j4j4j4j9j9M4M3l8l8l8l9
$$ 1397 1387 1376 1366 1356 1368 1379 1391 1403 1395 1387 1379 1371 1317 1262 1311 1361 1402 1444 1423 1402 1414 1426 1438 1449 1435 1421 1407 1393 1374 1355 1399 1442 1404 1366 1328 1289
2657A289K7K6K6K7n6n5OPj0j1j1j1M4M4j8j9j6j7j6j7P2P2RJ0nnnnM9M8j4j4M1M1k1k1p9p9
$$ 1289 1316 1342 1368 1395 1339 1284 1290 1297 1287 1276 1265 1254 1298 1342 1324 1305 1289 1272 1256 1239 1311 1383 1392 1402 1397 1392 1387 1382 1431 1479 1465 1451 1492 1533 1512 1491 1412 1333
2652A333p8p9K4K4K4K4kkkknnmnP8P9J6J6j1j0j08j08k1Q3Q7j7o9pN6N5J3J3n0n0K7K7K6K7
$$ 1333 1255 1176 1200 1224 1248 1272 1270 1268 1266 1264 1259 1254 1250 1245 1323 1402 1418 1434 1423 1413 1305 1197 1176 1259 1346 1329 1260 1253 1309 1364 1377 1390 1340 1290 1317 1344 1370 1397
2647A397k7k6k7k6N6N7N6N6rj0p3j34q5K0O1O2N2N2n2n1l8l7K5K4K7K6l6l6j3j2j2j2PQPP
$$ 1397 1370 1344 1317 1291 1347 1404 1460 1516 1507 1497 1424 1290 1205 1225 1286 1348 1400 1452 1400 1349 1311 1274 1299 1323 1350 1376 1340 1304 1291 1279 1267 1255 1262 1270 1277 1284
2643A284J8J9J8J8n2n3N2N2J4J4m9m8m9m8N5N6P4P5l0k9NONOk8k8L5L4J6J7m7m6ooooMLLL
$$ 1284 1302 1321 1339 1357 1305 1252 1304 1356 1370 1384 1335 1287 1238 1190 1245 1301 1375 1450 1420 1391 1396 1402 1407 1413 1385 1357 1392 1426 1442 1459 1412 1366 1360 1354 1348 1342 1346 1349 1352 1355
2638A355kkjkL7L8L7L7k9k9k9k9K6K6K6K5K1K0K0K0j20j20K5K5nno8o8N4N5qqk2k2M0M1J3
$$ 1355 1353 1351 1350 1348 1385 1423 1460 1497 1468 1439 1410 1381 1407 1433 1459 1484 1505 1525 1545 1565 1445 1325 1350 1375 1370 1365 1297 1229 1283 1338 1330 1322 1300 1278 1318 1359 1372
2633A372J3J3J4m5m5J8J7l1l2O6O6Pr7p3j1P0O9L2p2r9l7O7O7J1J1J1J1l8l9l9l9M3M3M3M4
$$ 1372 1385 1398 1412 1367 1322 1340 1357 1326 1294 1360 1426 1433 1336 1263 1252 1322 1391 1423 1351 1252 1215 1282 1349 1360 1371 1382 1393 1355 1316 1277 1238 1281 1324 1367 1411
2629A411n6n6M8M9K5K5l8l7k2k1k2k1L4L5L4L5J6J7J6J7l3l3l3l3K1K1K1K1l4l4l3l4RRRR
$$ 1411 1355 1299 1347 1396 1421 1446 1408 1371 1349 1328 1306 1285 1319 1354 1388 1423 1439 1456 1472 1489 1456 1423 1390 1357 1378 1399 1420 1441 1407 1373 1340 1306 1315 1324 1333 1342
2625A342k4k3k4k3L3L4l0k9n6n6OOm2m1O2O3J2J2J1J2K3K2l9m0m4m4O0J23L7o7o3M0J11J11
$$ 1342 1318 1295 1271 1248 1281 1315 1285 1256 1200 1144 1150 1156 1114 1073 1135 1198 1210 1222 1233 1245 1268 1290 1251 1211 1167 1123 1183 1306 1343 1276 1213 1253 1364 1475
2621A475k8k8mlmmk1k0k1k1l2l2l3l2O4O4O4O4j2j1j2j1JKJKkjkjJ1J2n1n1m7m6N7N7jjkj
$$ 1475 1447 1419 1415 1412 1408 1404 1383 1363 1342 1321 1289 1257 1224 1192 1256 1320 1384 1448 1436 1425 1413 1402 1403 1405 1406 1408 1406 1405 1403 1402 1413 1425 1374 1323 1276 1230 1287 1344 1343 1342 1340 1339
2615A339k2k2M0M1J5J6q1q0j32qJ10J10J1J1n2n1l2l3J06J05%j25q7q6RJ0P2P1N2N1N2N2q6
$$ 1339 1317 1295 1335 1376 1391 1407 1326 1246 1114 1106 1216 1326 1337 1348 1296 1245 1213 1180 1286 1391 1391 1266 1179 1093 1102 1112 1184 1255 1307 1358 1410 1462 1376
2611A376q6k4k3l6l5O9O9N3N4rrk2k2k2k2k1k1k2k1K0J9N1N1K2K1q2q2j4j5J7J8MML6L6on
$$ 1376 1290 1266 1243 1207 1172 1241 1310 1363 1417 1408 1399 1377 1355 1333 1311 1290 1269 1247 1226 1246 1265 1316 1367 1389 1410 1328 1246 1232 1217 1234 1252 1256 1260 1296 1332 1326 1321
2607A321N7N7p3p4m2m2QQk3k3j0j0K1K1N7N6oop1p2L3L3J2J3O8O8L7o6j30k4K3K3l3l3LLK
$$ 1321 1378 1435 1362 1288 1246 1204 1212 1220 1197 1174 1164 1154 1175 1196 1253 1309 1303 1297 1226 1154 1187 1220 1232 1245 1313 1381 1418 1352 1222 1198 1221 1244 1211 1178 1181 1184 1186
2602A186LqqN5N5M5M5M6M5j4j5j4j5p6p7K7K8lkklM5M4M5M5m2m2j0j1J%o2o2k2k2M0M0Q9R0
$$ 1186 1189 1181 1173 1228 1283 1328 1373 1419 1464 1450 1435 1421 1406 1330 1253 1280 1308 1305 1303 1301 1298 1343 1387 1432 1477 1435 1393 1383 1372 1373 1373 1311 1249 1227 1205 1245 1285 1374 1464
2598A464j5j4o2o1JJNNn8n7m0m0qrR0R0K7K7l0l1L2L2J2J2J3J2O7O6K6p9r4l2L0L1p0o9pp
$$ 1464 1449 1435 1373 1312 1313 1314 1319 1324 1266 1209 1169 1129 1121 1112 1202 1292 1319 1346 1316 1285 1317 1349 1361 1373 1386 1398 1465 1531 1557 1478 1384 1352 1382 1413 1343 1274 1267 1260
2593A260J8J9Q2Q1K0K0m2m2k3k3k3k3J2J2J3J2k6k5k6k5O0O0O0O1n6n6n5n6NONOL1L2l1l0
$$ 1260 1278 1297 1379 1460 1480 1500 1458 1416 1393 1370 1347 1324 1336 1348 1361 1373 1347 1322 1296 1271 1331 1391 1451 1512 1456 1400 1345 1289 1294 1300 1305 1311 1342 1374 1343 1313
2589A313l5l4l5l4J6J6J6J6K0K0K0K0L1L1l2l1onoom0m0K2K2j3j2j3j3J5J6J5J6P0P0p5p6
$$ 1313 1278 1244 1209 1175 1191 1207 1223 1239 1259 1279 1299 1319 1350 1381 1349 1318 1312 1307 1301 1295 1255 1215 1237 1259 1246 1234 1221 1208 1223 1239 1254 1270 1340 1410 1335 1259
2584A259l1l1P3P4J7J7m5m5MLMMJ8J9J8J8k3k3k3k3J8J7J8J7KKo1o1M4M3j9j9mlmlL1L2L1
$$ 1259 1228 1197 1270 1344 1361 1378 1333 1288 1292 1295 1299 1303 1321 1340 1358 1376 1353 1330 1307 1284 1302 1319 1337 1354 1356 1358 1297 1236 1280 1323 1304 1285 1281 1278 1274 1271 1302 1334 1365
2579A365L2J0J1J0J0opopJ1J0n2n1lklkp4p4L1L0O3O3O3O3k9k9k9k9m3m3m3m3O2O3m2m1K0
$$ 1365 1397 1407 1418 1428 1438 1432 1425 1419 1412 1423 1433 1381 1330 1327 1325 1322 1320 1246 1172 1203 1233 1296 1359 1422 1485 1456 1427 1398 1369 1326 1283 1240 1197 1259 1322 1280 1239 1259
2575A259K1K1K1J2J2n0n0l6l6K6K7N3N3rrmlmml2l2l2l2M3M3M4M3J7J7J6J7m2m2K1K1n2n1
$$ 1259 1280 1301 1322 1334 1346 1296 1246 1210 1174 1200 1227 1280 1333 1324 1315 1311 1308 1304 1300 1268 1236 1204 1172 1215 1258 1302 1345 1362 1379 1395 1412 1370 1328 1349 1370 1318 1267
2570A267n1n1N7N6noR9R8onj1j1j1j1m0l9m0m0N1N1j1j1M2M1k0k1m8m8J4J5nmnnk1k2P5P5
$$ 1267 1216 1165 1222 1278 1273 1267 1366 1464 1458 1453 1442 1431 1420 1409 1369 1330 1290 1250 1301 1352 1341 1330 1372 1413 1393 1372 1324 1276 1290 1305 1300 1296 1291 1286 1265 1243 1318 1393
2566A393J49K5r3r2kjjkn7n7n7n8J4J3J3J3k6k6k6k6j2j1N0N1J0J1J0J0N8N7onl3l3l4l3M0
$$ 1393 1542 1567 1474 1382 1380 1379 1378 1376 1319 1262 1205 1147 1161 1174 1187 1200 1174 1148 1122 1096 1084 1073 1123 1174 1184 1195 1205 1215 1273 1330 1324 1319 1286 1253 1219 1186 1226
2561A226L9M0L9O0O0kkLLLLk4k3L9L9l2l1l1l1n4n3RRl6l5l5l6K2K2Q5Q4l1l2l1l2j5j5j6
$$ 1226 1265 1305 1344 1404 1464 1462 1460 1463 1466 1469 1472 1448 1425 1464 1503 1471 1440 1409 1378 1324 1271 1280 1289 1253 1218 1183 1147 1169 1191 1276 1360 1329 1297 1266 1234 1219 1204 1188
2556A188j5L4L4L4L4l2l3l2l3J0J1J0J0k7k6%O3J11J12Nn7o4o4l6l7K2K1ko5m0K2Q0J8m0m1
$$ 1188 1173 1207 1241 1275 1309 1277 1244 1212 1179 1189 1200 1210 1220 1193 1167 1167 1230 1341 1453 1458 1401 1337 1273 1237 1200 1222 1243 1241 1176 1136 1158 1238 1256 1216 1175
2552A175N6N6K7l6l6K7M1M2J4J5K2K3l9m0m0m1m0m0m1m1p5j4L5L5LO6J64J65l5j39j08L8Q9
$$ 1175 1231 1287 1314 1278 1242 1269 1310 1352 1366 1381 1403 1426 1387 1347 1307 1266 1226 1186 1145 1104 1029 1015 1050 1085 1088 1154 1318 1483 1448 1309 1201 1239 1328
2548A328K6m3m3k0M3M3M3j6j6K6K6K6K6k7k7q6q6n2RP5P4M0k2n0n0M7M8J6J5j0j1o9p0j5M7
$$ 1328 1354 1311 1268 1248 1291 1334 1377 1361 1345 1371 1397 1423 1449 1422 1395 1309 1223 1171 1180 1255 1329 1369 1347 1297 1247 1294 1342 1358 1373 1363 1352 1283 1213 1198 1245
2544A245N1j1l2L1N4N5j5j5J6J7k0j9k0j9L1L2l0l1k0j9J1J2J4J4r1r0K4K3l1l1K2J47J47
$$ 1245 1296 1285 1253 1284 1338 1393 1378 1363 1379 1396 1376 1357 1337 1318 1349 1381 1351 1320 1300 1281 1292 1304 1318 1332 1241 1151 1175 1198 1167 1136 1158 1305 1452
2540A452K2j43j44m8m7P7P8M6M6J5J4J5J4q2q2j9k0L2L1O2O3k2k2RRM4M5j01j01K8K7mljj
$$ 1452 1474 1331 1187 1139 1092 1169 1247 1293 1339 1354 1368 1383 1397 1315 1233 1214 1194 1226 1257 1319 1382 1360 1338 1347 1356 1400 1445 1344 1243 1271 1298 1294 1291 1290 1289
2535A289O2O2K3K3l9m0o1o0M3M3l5l5o6o7POP0O9onl7l7M1M2J0J0j0j0j0j0m7m7J6J5L3L2
$$ 1289 1351 1413 1436 1459 1420 1380 1319 1259 1302 1345 1310 1275 1209 1142 1149 1155 1225 1294 1288 1283 1246 1209 1250 1292 1302 1312 1302 1292 1282 1272 1225 1178 1194 1209 1242 1274
2531A274L2L3j7j6j6j7RQL9M0rj0N4N3m3m2K0K0l3l2L1L0M0M0k3k2n0n0q1q1l4l5llJ6J5J5
$$ 1274 1306 1339 1322 1306 1290 1273 1282 1290 1329 1369 1360 1350 1404 1457 1414 1372 1392 1412 1379 1347 1378 1408 1448 1488 1465 1443 1393 1343 1262 1181 1147 1112 1109 1106 1122 1137 1152
2527A152J5PPO9O9K3K4qrl5l6l6l6m6m7m7m7J02J02J9q6n9LK4K4lllll8l8O6O6K1K0m2m3L4
$$ 1152 1167 1174 1181 1250 1319 1342 1366 1358 1349 1314 1278 1242 1206 1160 1113 1066 1019 1121 1223 1242 1156 1097 1100 1124 1148 1145 1142 1139 1136 1098 1060 1126 1192 1213 1233 1191 1148 1182
2522A182L3L3L3MMNMr4r3J1J0M3M2M2M3OONOn2n2J1P3P3l1o7lN8N9%%j2j1j2j2K1K1m2m2m1
$$ 1182 1215 1248 1281 1285 1289 1294 1298 1204 1111 1122 1132 1175 1217 1259 1302 1308 1314 1319 1325 1273 1221 1232 1305 1378 1347 1280 1277 1335 1394 1394 1394 1382 1371 1359 1347 1368 1389 1347 1305 1264
2517A264m2K1K0L2L2L2L2M0L9o4o4l9l9m0l9J5J4po9j5Q8O1jQPMMj6j7j7j6K7K8K8K7J4J3
$$ 1264 1222 1243 1263 1295 1327 1359 1391 1431 1470 1406 1342 1303 1264 1224 1185 1200 1214 1207 1138 1123 1211 1272 1271 1279 1286 1290 1294 1278 1261 1244 1228 1255 1283 1311 1338 1352 1365
2512A365J3J4n2n2J1J1k6k5L7L7j6j6j7j6L8L8j02j01l8O6M7j5k1M1M2k1n2J1P5P6k0k0K0
$$ 1365 1378 1392 1340 1288 1299 1310 1284 1259 1296 1333 1317 1301 1284 1268 1306 1344 1242 1141 1103 1169 1216 1201 1180 1221 1263 1242 1190 1201 1276 1352 1332 1312 1332
2508A332m3p8j6M9N0m4m3J9J9l8l8K4K5l5l4L1R3K3m0l5K6N7N7m3m4lllll7l7l6l7K3K3K3
$$ 1332 1289 1211 1195 1244 1294 1250 1207 1226 1245 1207 1169 1193 1218 1183 1149 1180 1273 1296 1256 1221 1247 1304 1361 1318 1274 1271 1268 1265 1262 1225 1188 1152 1115 1138 1161 1184
2504A184K3k0k0k0j9K8K8K9K8k4k5jO2Q5K2m5j07o2%K4K5l1l1P4P3L5L5L1L0j4p7j9M4N6o
$$ 1184 1207 1187 1167 1147 1128 1156 1184 1213 1241 1217 1192 1191 1253 1338 1360 1315 1208 1146 1146 1170 1195 1164 1133 1207 1280 1315 1350 1381 1411 1397 1320 1301 1345 1401 1395
2500A395o8o7K5Q7M8n5p9p8J9J9L5L4k4k3k2M1J03M1n9o0%jj5j6j5j6KJKJK8K7O3%o8o7pN6
$$ 1395 1327 1260 1285 1372 1420 1365 1286 1208 1227 1246 1281 1315 1291 1268 1246 1287 1390 1431 1372 1312 1312 1311 1296 1280 1265 1249 1251 1252 1254 1255 1283 1310 1373 1373 1305 1238 1231 1287
2495A287O1jk5k5K1K1K0K1rj0rj0p0o9L4L4K4K4qpL0L0l3l3n1n2N3N2n6n6OOk3k4QPRRRRn3
$$ 1287 1348 1347 1322 1297 1318 1339 1359 1380 1371 1361 1352 1342 1272 1203 1237 1271 1295 1319 1311 1304 1334 1364 1331 1298 1247 1195 1248 1300 1244 1188 1194 1200 1177 1153 1161 1168 1177 1186 1195 1204 1151
2490A151n2k1k2K5K5l7l8J2J3J2J2j6j7j6j6kkO0O1J7J7M8M8M4M4j8j8k8k9k9k8j0j0K2K1
$$ 1151 1099 1078 1056 1081 1106 1069 1031 1043 1056 1068 1080 1064 1047 1031 1015 1013 1011 1071 1132 1149 1166 1214 1262 1306 1350 1332 1314 1286 1257 1228 1200 1190 1180 1202 1223
2486A223J5J4P7P7L5L6j10j10l3l4K8K9K7K7N8N7J4J3n0m9n6n6OOL0L0l3l3m0m0K3K2J0Rn3
$$ 1223 1238 1252 1329 1406 1441 1477 1367 1257 1224 1190 1218 1247 1274 1301 1359 1416 1430 1443 1393 1344 1288 1232 1238 1244 1274 1304 1271 1238 1198 1158 1181 1203 1213 1222 1169
2482A169n3K4K5Q6Q7L3L3L3L3o6o7mmNNr9j00K6K5Q8Q8l8l8ooK3K4q1q0l7l7K5K6N1N1N0N1
$$ 1169 1116 1140 1165 1251 1338 1371 1404 1437 1470 1404 1337 1333 1329 1334 1339 1240 1140 1166 1191 1279 1367 1329 1291 1285 1279 1302 1326 1245 1165 1128 1091 1116 1142 1193 1244 1294 1345
2477A345k4k5L8L8rrrrj2j3j3j3j4j3j4j4K0J9N1N0K5K4l8l8PPk5k4N2N1K0K1llo6o5o5o4
$$ 1345 1321 1296 1334 1372 1363 1354 1345 1336 1324 1311 1298 1285 1271 1258 1244 1230 1250 1269 1320 1370 1395 1419 1381 1343 1350 1357 1332 1308 1360 1411 1431 1452 1449 1446 1380 1315 1250 1186
2472A186M0M0RQn4n3N9O0klk2k2k2k2O8O9l6l5O9O9OPrrm1m0L1L2l0l1J7J6J7J7o4o3o4o4
$$ 1186 1226 1266 1275 1283 1229 1176 1235 1295 1293 1290 1268 1246 1224 1202 1270 1339 1303 1268 1337 1406 1412 1419 1410 1401 1360 1320 1351 1383 1353 1322 1339 1355 1372 1389 1325 1262 1198 1134
2468A134N9N9K6j00p5p6K1K1P6P6M5M6J2J2n1n0k4k3L9L9l0l0l0l0j0j1N2N1P1P2QRp5p6K8
$$ 1134 1193 1252 1278 1178 1103 1027 1048 1069 1145 1221 1266 1312 1324 1336 1285 1235 1211 1188 1227 1266 1236 1206 1176 1146 1136 1125 1177 1228 1299 1371 1379 1388 1313 1237 1265
2463A265K8l5l5K7K7NNNNL4L3p0p0j9j8j9j9RRQRN3N3N0M9j07j69q9J6O1O2J31J30N0N0n4
$$ 1265 1293 1258 1223 1250 1277 1282 1287 1292 1297 1331 1364 1294 1224 1205 1187 1168 1149 1158 1167 1175 1184 1237 1290 1340 1389 1282 1113 1024 1040 1101 1163 1294 1424 1474 1524 1470
2459A470n4o1o0M3M4ooo9o8k1k1M2M1mmmmo6o6k5P9P5J3j7M7P6J3rj0m2m1p3p3K2K1N3N3K3
$$ 1470 1416 1355 1295 1338 1382 1376 1370 1301 1233 1212 1191 1233 1274 1270 1266 1262 1258 1192 1126 1101 1180 1255 1268 1251 1298 1374 1387 1378 1368 1326 1285 1212 1139 1161 1182 1235 1288 1311
2454A311K3qpN4N4r1r2mmK7K7K8K8l4l5OPk6k5j5j5M7M8QQn4n4L0L0O1O0K7K6mnLMk8k8j8
$$ 1311 1334 1326 1319 1373 1427 1336 1244 1240 1236 1263 1290 1318 1346 1312 1277 1283 1290 1264 1239 1224 1209 1256 1304 1312 1320 1266 1212 1242 1272 1333 1393 1420 1446 1442 1437 1440 1444 1416 1388 1370
2450A370j8q1q0M0M1RRj4j5J7J7k2k3M0M0J2J2j8j9llo5o5J4J4j7j7OOPOL3L3L3L3k8k7k8
$$ 1370 1352 1271 1191 1231 1272 1281 1290 1276 1261 1278 1295 1273 1250 1290 1330 1342 1354 1336 1317 1314 1311 1246 1181 1195 1209 1192 1175 1181 1187 1194 1200 1233 1266 1299 1332 1304 1277 1249
2445A249k7l7l6l3l3q1k0N3J14Q6K4m2m1j9j8M4M4nnj2N0J01L9p0j32p9j6M9M9N5N5ppM2M3
$$ 1249 1222 1185 1149 1116 1083 1002 982 1035 1149 1235 1259 1217 1176 1157 1139 1183 1227 1222 1217 1205 1255 1356 1395 1325 1193 1114 1098 1147 1196 1251 1306 1299 1292 1334 1377
2441A377k1k0J0Rj3p7n4RO9P0J3n0m9J3L5L6o5o5K2K2m0m1J3J2m4m3j7Q6R5L2nnl7l7k0M3
$$ 1377 1356 1336 1346 1355 1342 1265 1211 1220 1289 1359 1372 1322 1273 1286 1321 1357 1292 1227 1249 1271 1231 1190 1203 1215 1171 1128 1111 1197 1292 1324 1319 1314 1277 1240 1220 1263
2436A263M7j6n4QP3P3j4j4j5j4K7K7l8j00q0j8NOOPPPJKL7k6o0n9M3J06N1j2l5l4J2J3J2J3
$$ 1263 1310 1294 1240 1248 1321 1394 1380 1366 1351 1337 1364 1391 1353 1253 1173 1155 1160 1166 1172 1179 1186 1193 1194 1196 1233 1207 1147 1088 1131 1237 1288 1276 1241 1207 1219 1232 1244 1257
2432A257M9N0m5m4p0p0K4K4M8M7J6J6m0l9rrj1j2m3m3J5J6J6J5k8k9k8k8L5L5j6p9j9Q4J68
$$ 1257 1306 1356 1311 1267 1197 1127 1151 1175 1223 1270 1286 1302 1262 1223 1214 1205 1194 1182 1139 1096 1111 1127 1143 1158 1130 1101 1073 1045 1080 1115 1099 1020 1001 1085 1253
2427A253J06K2m0o0o1p5p6O1O0O2O3J1J0p0p0j9j8QQR6R5K0q5o1KnmJ0P2J13Qq5q5NNm6m7
$$ 1253 1359 1381 1341 1281 1220 1145 1069 1130 1190 1252 1315 1326 1336 1266 1196 1177 1159 1167 1175 1271 1366 1386 1301 1240 1242 1237 1233 1243 1315 1428 1436 1351 1266 1271 1276 1230 1183
2423A183NNNNL5L6L5L6k5k5k5k5J%JJQ1Q1n4n4m7m7M7M6J3J3l9l9m5m5j4j4K7K8K7K8k0k0
$$ 1183 1188 1193 1198 1203 1238 1274 1309 1345 1320 1295 1270 1245 1246 1246 1247 1248 1329 1410 1356 1302 1255 1208 1255 1301 1314 1327 1288 1249 1204 1159 1145 1131 1158 1186 1213 1241 1221 1201
2418A201k0k0J7J8J7J8l9l9m0l9O7O6L5L5J2J2l9m0R1R1J3j11m3Q3P5n0n9n9K7K7K6K5N6N6
$$ 1201 1181 1161 1178 1196 1213 1231 1192 1153 1113 1074 1141 1207 1242 1277 1289 1301 1262 1222 1313 1404 1417 1306 1263 1346 1421 1371 1312 1253 1280 1307 1333 1358 1414 1470
2414A470M6M5o9o9k6k6k5k6kko6o7p6N0N2N2j2j3J9J9j8j8j9j8mmO8O9nnl6l6J8J7R1R1M7
$$ 1470 1516 1561 1492 1423 1397 1371 1346 1320 1318 1316 1250 1183 1107 1157 1209 1261 1249 1236 1255 1274 1256 1238 1219 1201 1197 1193 1261 1330 1325 1320 1284 1248 1266 1283 1374 1465 1512
2409A512M8k5k6l9l9K1K0L4J58K99K99L20J95J7j90l15l15j10j09o0n9L4L4o0n9o0n9k9k8
$$ 1512 1560 1535 1509 1470 1431 1452 1472 1506 1664 1963 2262 2582 2777 2794 2604 2289 1974 1864 1755 1695 1636 1670 1704 1644 1585 1525 1466 1437 1409
2406A409k9k8%j%%l1l0M3M2ooK5K5J2J3M4M4m2m2m1m2N3N3N3N3k0k1k0k0O2O2J89J90K65M74
$$ 1409 1380 1352 1352 1351 1351 1351 1320 1290 1333 1375 1369 1363 1388 1413 1425 1438 1482 1526 1484 1442 1401 1359 1412 1465 1518 1571 1551 1530 1510 1490 1552 1614 1803 1993 2258 2732
2401B732O87O87L62j79n85n85m37l12k19k19j66m1L4L4J1J2k0k0o7o8r8r9L6L6L5L6N7N7J33
$$ 2732 3419 4106 4468 4289 3704 3119 2682 2370 2151 1932 1766 1725 1759 1793 1804 1816 1796 1776 1709 1641 1543 1444 1480 1516 1551 1587 1644 1701 1834
2398A834K58L01L00J13r4k61k61j69j70n5n5M9M9M4M3j9j8q5q5m5m6rJ16J91J91K14K14K71
$$ 1834 2092 2393 2693 2806 2712 2451 2190 2021 1851 1796 1741 1790 1839 1883 1926 1907 1889 1804 1719 1674 1628 1619 1735 1926 2117 2331 2545 2816
2394B816J47o3k71k59k58j68m2j0rJ9J8M9N0j10j10m8m7l6l6O8O8J21J20J98M06N89P13P96
$$ 2816 2963 2900 2629 2370 2112 1944 1902 1892 1883 1902 1920 1969 2019 1909 1799 1751 1704 1668 1632 1700 1768 1889 2009 2207 2613 3202 3915 4711
2391D711O72J82l58p77p77n89l80j85j85j15j15m7P7P4n0p7p7q7q6q7q6j4j3m5m4QQn4n4j0
$$ 4711 5383 5565 5207 4430 3653 3064 2684 2499 2314 2199 2084 2037 2114 2188 2138 2061 1984 1897 1811 1724 1638 1624 1611 1566 1522 1530 1538 1484 1430 1420
2387A420j0rj0OOONM0M0J03J02J6J6j5j6J7J8R2K18K97K98L99P73J098R73L35n39r91r28o53
$$ 1420 1410 1401 1391 1397 1403 1409 1414 1454 1494 1597 1699 1715 1731 1716 1700 1717 1735 1827 2045 2342 2640 3039 3812 4910 5883 6218 5679 4688 3760 3107
2384C107m44k60j97j57j57l5l4l5l5rj0N3N3j9j9J1J2M1M1J48J49L03L67K62k9k52l15k29
$$ 3107 2663 2403 2206 2049 1892 1857 1823 1788 1753 1744 1734 1787 1840 1821 1802 1813 1825 1866 1907 2055 2204 2507 2874 3136 3107 2855 2540 2311
2380B311j67j15j15q0q0o9o9P7P7J0J1k1k1POP3P2L2R4K46L72K96Q9j49k75k72k10j42q0m3
$$ 2311 2144 2029 1914 1834 1754 1685 1616 1693 1770 1780 1791 1770 1749 1756 1762 1835 1907 1939 2033 2279 2651 2947 3036 2887 2612 2340 2130 1988 1908 1865
2377A865m3p0p1p7p8j5j5J2J3J58J58PPP0P0J08J09L59P33R38O48Kn39p83o58l95k70j67j67
$$ 1865 1822 1752 1681 1604 1526 1511 1496 1508 1521 1679 1837 1844 1851 1921 1991 2099 2208 2567 3300 4238 4886 4888 4349 3566 2908 2513 2243 2076 1909
2373A909j28j28p4p5L0K9j4j4p7p6k7k8L5L5m8m8J4J4Q0Q0k2q5o7N8N8o7j35p3L7J00M4M5
$$ 1909 1781 1653 1579 1504 1534 1563 1549 1535 1458 1382 1355 1327 1362 1397 1349 1301 1315 1329 1409 1489 1467 1382 1315 1373 1431 1364 1229 1156 1193 1293 1337 1382
2369A382M8M9m1m2m9P6O7O6K0K0J21K45L86L86K74j7k54l79l28k03j36j36r6r7l4l4j8j8Q6
$$ 1382 1430 1479 1438 1396 1347 1423 1490 1556 1576 1596 1717 1962 2348 2734 3008 2991 2737 2358 2030 1827 1691 1555 1459 1362 1328 1294 1276 1258 1344
2366A344Q6J4J5j7j6l5l4j1j2L5r0q3q3R5R4L2L2k6k5k5k6n3n3n3n3O7O7O6O7J0J0J1J0on
$$ 1344 1430 1444 1459 1442 1426 1391 1357 1346 1334 1369 1279 1196 1113 1208 1302 1334 1366 1340 1315 1290 1264 1211 1158 1105 1052 1119 1186 1252 1319 1329 1339 1350 1360 1354 1349
2361A349nok6k6k6k6n5n5PPL4L5LLn6n6o4O1R0R1onJ8J7m4m5N4N4n0n0m8m8N6N6M9N0J7J8
$$ 1349 1344 1338 1312 1286 1260 1234 1179 1124 1131 1138 1172 1207 1210 1213 1157 1101 1037 1098 1188 1279 1273 1268 1286 1303 1259 1214 1268 1322 1272 1222 1174 1126 1182 1238 1287 1337 1354 1372
2357A372KKJKp9p9K6K5o7o7l4R2O5O4p3p3k9k8J17J17k1k1J1J0J2J1j9k0j5j5j5j4M9N0n5
$$ 1372 1374 1376 1377 1379 1300 1221 1247 1272 1205 1138 1104 1196 1261 1325 1252 1179 1150 1122 1239 1356 1335 1314 1325 1335 1347 1358 1339 1319 1304 1289 1274 1260 1309 1359 1304
2352A304n4j4j3j3j3l9m0K4K3MMNMj7j6MO7Q9j4r8r8M1M0k1k2RRk3k2P7P7J5J5k6k6L6L6O
$$ 1304 1250 1236 1223 1210 1197 1158 1118 1142 1165 1169 1173 1178 1182 1165 1149 1153 1220 1309 1295 1197 1099 1140 1180 1159 1137 1146 1155 1132 1110 1187 1264 1279 1294 1268 1242 1278 1314 1320
2348A320Nk6k6J5J6j6j5M8M9j4j3k2k2n3n2j2j1j1j1OPL8L9k9k9J10J10M7n7o1o1n8n9MMJ2
$$ 1320 1325 1299 1273 1288 1304 1288 1273 1321 1370 1356 1343 1321 1299 1246 1194 1182 1171 1160 1149 1155 1162 1200 1239 1210 1181 1291 1401 1448 1391 1330 1269 1211 1152 1156 1160 1172
2343A172J2J2J2L1L2o6o6m8N7O0O0J1J0k1k1m3m4J9J9J3J3M5M4o6o6l5l4O8O8L7L6j6j6J5
$$ 1172 1184 1196 1208 1239 1271 1205 1139 1091 1148 1208 1268 1279 1289 1268 1247 1204 1160 1179 1198 1211 1224 1269 1313 1247 1181 1146 1112 1180 1248 1285 1321 1305 1289 1304
2339A304J5j%jjl5l6K7K7O3O3JJr6r5r5r6O6O6O6O6NOn7n8J1J0J1J0n7n8NNl1l2L1L1P1P1
$$ 1304 1319 1318 1318 1317 1316 1281 1245 1272 1299 1362 1425 1426 1427 1331 1236 1141 1045 1111 1177 1243 1309 1314 1320 1263 1205 1216 1226 1237 1247 1190 1132 1137 1142 1111 1079 1110 1141 1212 1283
2334A283P0P1n3n3n3n3j3j2j3j3J08J09M5M6k0j9k0k0j7j7j7j8n4n4M9N0K6K7K6K6j1j2Q7
$$ 1283 1353 1424 1371 1318 1265 1212 1199 1187 1174 1161 1269 1378 1423 1469 1449 1430 1410 1390 1373 1356 1339 1321 1267 1213 1262 1312 1338 1365 1391 1417 1406 1394 1481
2330A481Q6oj10r1k8mo6o6lL8k5q9r0L5L6L5L5M2M2M1M2qrrqN4N4n1n0MLO6O6K6K6l7l6m1
$$ 1481 1567 1561 1451 1360 1332 1328 1262 1196 1193 1231 1206 1117 1027 1062 1098 1133 1168 1210 1252 1293 1335 1327 1318 1309 1301 1355 1409 1358 1308 1312 1315 1381 1447 1473 1499 1462 1426 1385
2326A385m0m0m0OPPOM9M8j3j4J6J6m7m6p0p1pqRRRRK8K9l5l4J7J6l9m0q1K2J05J06P2J1j7
$$ 1385 1345 1305 1265 1271 1278 1285 1291 1340 1388 1375 1361 1377 1393 1346 1300 1230 1159 1152 1144 1153 1162 1171 1180 1208 1237 1202 1168 1185 1201 1162 1122 1041 1063 1168 1274 1346 1357 1340
2321A340j7K1K1K2K1j4j4p3p2pN5P9P9Qn4j9j8MNNNM5M6k0q2p8j6QPk2k2M0M0n8n7MMJ3J2
$$ 1340 1323 1344 1365 1387 1408 1394 1380 1307 1235 1228 1283 1362 1441 1449 1395 1376 1358 1362 1367 1372 1377 1422 1468 1448 1366 1288 1272 1280 1287 1265 1243 1283 1323 1265 1208 1212 1216 1229 1241
2316A241QRmo7o6mOPk5L8J00J01oo8k7k7K8K8M1k2q7q6j9M3QRL5L5L5L6j3j3j3j3POn1n2j7
$$ 1241 1249 1258 1254 1187 1121 1117 1123 1130 1105 1143 1243 1344 1338 1270 1243 1216 1244 1272 1313 1291 1204 1118 1099 1142 1150 1159 1194 1229 1264 1300 1287 1274 1261 1248 1255 1261 1210 1158 1141
2312A141M6J0J1J1J0m8m8m1K1Q6Q6oo8l3l3K8K8K7K8J9J9P8P7k8r0n6M9O9On7n6N3N3K5l6
$$ 1141 1187 1197 1208 1219 1229 1181 1133 1092 1113 1199 1285 1279 1211 1178 1145 1173 1201 1228 1256 1275 1294 1372 1449 1421 1331 1275 1324 1393 1399 1342 1286 1339 1392 1417 1381
2307A381r0r1k5L8MNRRJ1J1J1J1O2O1m2m2J1J1J1J1k5k6q8q7K3K4K4K3l3l4l3l4J04J03%o3
$$ 1381 1291 1200 1175 1213 1217 1222 1231 1240 1251 1262 1273 1284 1346 1407 1365 1323 1334 1345 1356 1367 1342 1316 1228 1141 1164 1188 1212 1235 1202 1168 1135 1101 1205 1308 1308 1245
2303A245J8J22O2m2r1J3Q3K1l6r9j02m1M2M2M6M5J8J9J8J8j1j1p4p4mlN9N8lmmlK0J9K0K0
$$ 1245 1263 1385 1447 1405 1314 1327 1410 1431 1395 1296 1194 1153 1195 1237 1283 1328 1346 1365 1383 1401 1390 1379 1305 1231 1227 1224 1283 1341 1338 1334 1330 1327 1347 1366 1386 1406
2299A406jko0o0j73j11K1J24J79J17oj10q5J9N8N8l6l7K6K6K6K6p9p8l0l1L2L1M9M9M4M5p4
$$ 1406 1405 1403 1343 1283 1110 999 1020 1144 1323 1440 1434 1324 1239 1258 1316 1374 1338 1301 1327 1353 1379 1405 1326 1248 1218 1187 1219 1250 1299 1348 1392 1437 1363
2294A363j36r8PO3O2POO6O6MLl5l6l5l6J4J4J4J3m7m7J5P7P4k9p2p1N6N7polmlmOONOl6l5
$$ 1363 1227 1129 1136 1199 1261 1268 1274 1340 1406 1410 1413 1378 1342 1307 1271 1285 1299 1313 1326 1279 1232 1247 1324 1398 1369 1297 1226 1282 1339 1332 1326 1323 1319 1316 1312 1318 1324 1329 1335 1299 1264
2289A264l2l2K9R2L0l3rrj2j3m0l9K2K3O0N9m0m1J7P9Q3K1l1L2L1l1l9K2J9m4p3p2j4j4n0
$$ 1264 1232 1200 1229 1321 1351 1318 1309 1300 1288 1275 1235 1196 1218 1241 1301 1360 1320 1279 1296 1375 1458 1479 1448 1480 1511 1480 1441 1463 1482 1438 1365 1293 1279 1265 1215
2285A215n0J2J2L5L4L5L5m4m3k0M3N3j0p1p0j1N2P8P9LKn6n6q2j9M9M9J2J2J2J2o7o7m4J9
$$ 1215 1165 1177 1189 1224 1258 1293 1328 1284 1241 1221 1264 1317 1307 1236 1166 1155 1207 1285 1364 1367 1369 1313 1257 1175 1156 1205 1254 1266 1278 1290 1302 1235 1168 1124 1143
2281A143L1l0QQQ8Q8Mr9j03m0j5j5K7R0R1K7o6o7p1p0M5M5M5M5P9P9J3m9q2k0M0M1Rn3j9j8
$$ 1143 1174 1144 1152 1160 1248 1336 1340 1241 1138 1098 1083 1068 1095 1185 1276 1303 1237 1170 1099 1029 1074 1119 1164 1209 1288 1367 1380 1331 1249 1229 1269 1310 1319 1266 1247 1229
2277A229llJKNO9O8Om0m0J9J9j7j8j7j8m4m5J8J8m2m1K0K1L4L4L4L4k6k6k6k6K4K3K4K3k3
$$ 1229 1226 1223 1224 1226 1231 1300 1368 1374 1334 1294 1313 1332 1315 1297 1280 1262 1218 1173 1191 1209 1167 1126 1146 1167 1201 1235 1269 1303 1277 1251 1225 1199 1223 1246 1270 1293 1270
2272A270k3k4k3N9N8m5m5rqqqK4K4K4K5k0k0j9k0m2m1J04J04rrrrK9K9p6p5l9m0K3K3j9j9
$$ 1270 1247 1223 1200 1259 1317 1272 1227 1218 1210 1202 1194 1218 1242 1266 1291 1271 1251 1232 1212 1170 1129 1233 1337 1328 1319 1310 1301 1330 1359 1283 1208 1169 1129 1152 1175 1156 1137
2267A137j9j9L3L3L2L3k2k3k2k2K2K1K1K2L1L2l1l0m5m5J8J8J8J8J7J8kkkkN0N0j3j2l7l7
$$ 1137 1118 1099 1132 1165 1197 1230 1208 1185 1163 1141 1163 1184 1205 1227 1258 1290 1259 1229 1184 1139 1157 1175 1193 1211 1228 1246 1244 1242 1240 1238 1288 1338 1325 1313 1276 1239
2263A239K6K6PPn4n5KKO5O4j5j6p1p1n2P3J48J48l7l7l6l7J4J3J4J3k4k4k4k4m7m7J6P8L8
$$ 1239 1265 1291 1298 1305 1251 1196 1198 1200 1265 1329 1314 1298 1227 1156 1104 1177 1325 1473 1436 1399 1363 1326 1340 1353 1367 1380 1356 1332 1308 1284 1237 1190 1206 1284 1322
2259A322o6m2J9N7oj06j06l7O7J48Q5norrq8q9o1KPOJ1J1O4O4O0O0Jo1o1JP9P9N5on2n1n4
$$ 1322 1256 1214 1233 1290 1284 1178 1072 1035 1102 1250 1335 1330 1324 1315 1306 1218 1129 1068 1070 1077 1083 1094 1105 1169 1233 1293 1353 1354 1293 1232 1233 1312 1391 1446 1440 1388 1337 1283
2254A283n5JJJJJ0J1J0J1L3L4L0L0po9o9pqqmmJ0J0O9O9K4l9o7o6J1J2J1J1M2M1k1k1Q7Q8
$$ 1283 1228 1229 1230 1231 1232 1242 1253 1263 1274 1307 1341 1371 1401 1394 1325 1256 1249 1241 1233 1229 1225 1235 1245 1314 1383 1407 1368 1301 1235 1246 1258 1269 1280 1322 1363 1342 1321 1408 1496
2249A496Mj00p2j0J1J1J3J2J3J3L0L0K9L0kjkjn8n7j9Q6J12Pj10j11j6M5J1J0j3j4j3j4P5
$$ 1496 1500 1400 1328 1318 1329 1340 1353 1365 1378 1391 1421 1451 1480 1510 1508 1507 1505 1504 1446 1389 1370 1456 1568 1575 1465 1354 1338 1383 1394 1404 1391 1377 1364 1350 1425
2245A425P5J0n2n2J1J1n1p7j3RJ0L1L2L1L2j9j9k0j9klkkj7j6J5J6rrN3N3L0K9K9L0QQn4n4
$$ 1425 1500 1510 1458 1406 1417 1428 1377 1300 1287 1296 1306 1337 1369 1400 1432 1413 1394 1374 1355 1353 1350 1348 1346 1329 1313 1328 1344 1335 1326 1379 1432 1462 1491 1520 1550 1558 1566 1512 1458
2240A458j1j1j1j1%J%Jp3p3p3p3L7L7O9O8K5K5l8l7k3k3L9M0K4K4l9l8K4K4l9l8RQP1P1KL
$$ 1458 1447 1436 1425 1414 1414 1415 1415 1416 1343 1270 1197 1124 1161 1198 1267 1335 1360 1385 1347 1310 1287 1264 1303 1343 1367 1391 1352 1314 1338 1362 1323 1285 1294 1302 1373 1444 1446 1449
2236A449o0o0q4q3K0K1K1K0m2m2J3J3M3M4j0rK1K1m1m1K1K2L5L4k7k8J6J6j5j5qqqqK9K9l3
$$ 1449 1389 1329 1245 1162 1182 1203 1224 1244 1202 1160 1173 1186 1229 1273 1263 1254 1275 1296 1255 1214 1235 1257 1292 1326 1299 1271 1287 1303 1288 1273 1265 1257 1249 1241 1270 1299 1266
2231A266l3noN8N7n4n4n4n4Q6Q7N5N5J6J7q7j50q9J4J5J5J6J6P8P9o5o4jkM3M3J2J2m7m8J5
$$ 1266 1233 1228 1222 1280 1337 1283 1229 1175 1121 1207 1294 1349 1404 1420 1437 1350 1200 1111 1125 1140 1155 1171 1187 1265 1344 1279 1215 1214 1212 1255 1298 1310 1322 1275 1227 1242
2227A242J5k6k6k6k6mmN9N9QRk3k2l1l1L2R4M9n6n9LO1O0l9l9K6K6K6K7K1K2m1m0j4j3J8J7
$$ 1242 1257 1231 1205 1179 1153 1149 1145 1204 1263 1271 1280 1257 1235 1204 1173 1205 1299 1348 1292 1233 1236 1297 1357 1318 1279 1305 1331 1357 1384 1405 1427 1386 1346 1332 1319 1337 1354
2222A354n6n6k5k4n1n1J1J2P4P5p2p1K5K5Q7Q7L4L4k9k9j5j5j5j5K1K2j0j0m2m3K0K1L0L1
$$ 1354 1298 1242 1217 1193 1142 1091 1102 1114 1188 1263 1191 1120 1145 1170 1257 1344 1378 1412 1383 1354 1339 1324 1309 1294 1315 1337 1327 1317 1275 1232 1252 1273 1303 1334
2218A334%%L4L5k7k8k1k0J0J1j3j3j3j3L9L8PPJ7J6m5m6p8p8J03J03M4n9o7mk0k0j6j6Q9Q9
$$ 1334 1334 1334 1368 1403 1376 1348 1327 1307 1317 1328 1315 1302 1289 1276 1315 1353 1360 1367 1384 1400 1355 1309 1231 1153 1256 1359 1403 1344 1277 1273 1253 1233 1217 1201 1290 1379
2214A379K6K6KKo0o0PQn4n5RQM0M0m2m3K0K1K0K1j0j1j01j01LLO9O8OOL4L4L5L4l3l3l3l4
$$ 1379 1405 1431 1433 1435 1375 1315 1322 1330 1276 1221 1230 1238 1278 1318 1276 1233 1253 1274 1294 1315 1305 1294 1193 1092 1095 1098 1167 1235 1241 1247 1281 1315 1350 1384 1351 1318 1285 1251
2209A251j5j5j5j5L6L5L6L5k4k5k4k4QRQRJ3J2J3J2p0p1qrM3M3M2M3%JJ%m4m4j3j3j1j0N1
$$ 1251 1236 1221 1206 1191 1227 1262 1298 1333 1309 1284 1260 1236 1244 1253 1261 1270 1283 1295 1308 1320 1250 1179 1171 1162 1205 1248 1290 1333 1333 1334 1335 1335 1291 1247 1234 1221 1210 1200 1251
2204A251J14J08Mp9p9K3K3K4K3j0rrj0J1J0J1J0n2n2N3N2J5J5m8m7p1p1rqO0O0m4m4r0r1J3
$$ 1251 1365 1473 1477 1398 1319 1342 1365 1389 1412 1402 1393 1384 1374 1385 1395 1406 1416 1364 1312 1365 1417 1432 1447 1399 1352 1281 1210 1201 1193 1253 1313 1269 1225 1135 1044 1057
2200A057J4O9P0l4l5OOOOj8j8M4M5L5L4MLJ0J0J0Rl6l7l6l6K2K2K2K2J2J2j8j9k4k5Q0Q0P
$$ 1057 1071 1140 1210 1176 1141 1147 1153 1159 1165 1147 1129 1173 1218 1253 1287 1291 1294 1304 1314 1324 1333 1297 1260 1224 1188 1210 1232 1254 1276 1288 1300 1282 1263 1239 1214 1294 1374 1381
2195A381OPOkkkkJ6J6J0Rl4j38j14n2K5K5O1O0P9P9k5k5l2l2r5r4j3j2N0M9RRn3n4J4J3M5
$$ 1381 1387 1394 1400 1398 1396 1394 1392 1408 1424 1434 1443 1409 1271 1157 1105 1130 1155 1216 1276 1355 1434 1409 1384 1352 1320 1225 1131 1118 1106 1156 1205 1214 1223 1170 1116 1130 1143 1188
2191A188M5j1j2p4p4N6N6N6N6M1M1k1k2k6k7n7n8mlmmP8P9lj06p3L1O4Kl2l2K7K6qqK4K3R
$$ 1188 1233 1222 1210 1136 1062 1118 1174 1230 1286 1327 1368 1347 1325 1299 1272 1215 1157 1153 1150 1146 1142 1220 1299 1296 1190 1117 1148 1212 1214 1182 1150 1177 1203 1195 1187 1211 1234 1243
2186A243Rn4n4k2k1Q2Q2L9L8o5o6J7J6m6m6K5K5K4K5L4L5k8k8j%L0L1l8l8ppP8P8k6k6l6l6
$$ 1243 1252 1198 1144 1122 1101 1183 1265 1304 1342 1277 1211 1228 1244 1198 1152 1177 1202 1226 1251 1285 1320 1292 1264 1263 1263 1293 1324 1286 1248 1241 1234 1312 1390 1364 1338 1302 1266
2181A266K6K6pql8l9N7N7NNJ1J1o2o2MMMMm3m3L0L0K8K7K8K8opopj4j5j4j4qpppLLm9m8%J
$$ 1266 1292 1318 1311 1303 1265 1226 1283 1340 1345 1350 1361 1372 1310 1248 1252 1256 1260 1264 1221 1178 1208 1238 1266 1293 1321 1349 1343 1336 1330 1323 1309 1294 1280 1266 1258 1251 1244 1237 1240 1243 1194 1146 1146 1147
2176A147P3P4K1K2n2n1o4o4L0L0l2l3P8P8j3p6l3P1O9l4r8l6N4N5n7n6L6L7L6L6k5k6j8j9
$$ 1147 1220 1294 1315 1337 1285 1234 1170 1106 1136 1166 1134 1101 1179 1257 1244 1168 1135 1206 1275 1241 1143 1107 1161 1216 1159 1103 1139 1176 1212 1248 1223 1197 1179 1160
2172A160J5J19R6L3l2l2l6l6kkkkm3m4m4m3J2J2J27J27j8j8m9m9qrqqRRk2k2J%P4P3%jL1L1
$$ 1160 1175 1294 1390 1423 1391 1359 1323 1287 1285 1283 1281 1279 1236 1192 1148 1105 1117 1129 1256 1383 1365 1347 1298 1249 1241 1232 1224 1216 1225 1234 1212 1190 1191 1191 1265 1338 1338 1337 1368 1399
2167A399kkr6r5opM6M6K6K6nnk8k9o0n9QRL9M0k5k6k5k6J6J5J6J5rj0rj0J2J1O3O4PQo5o6
$$ 1399 1397 1395 1299 1204 1198 1191 1237 1283 1309 1335 1330 1325 1297 1268 1208 1149 1157 1166 1205 1245 1220 1194 1169 1143 1159 1174 1190 1205 1196 1186 1177 1167 1179 1190 1253 1317 1324 1332 1267 1201
2162A201m3m3L0L0K4K5m9m8QRQQk8k9J40J41N4p1n3n2l4l3L9L9M6M6o9o9m2m3L1L0J1J0J0
$$ 1201 1158 1115 1145 1175 1199 1224 1175 1127 1135 1144 1152 1160 1132 1103 1243 1384 1438 1367 1314 1262 1228 1195 1234 1273 1319 1365 1296 1227 1185 1142 1173 1203 1214 1224 1234
2158A234J1O8O9k6k5%%L2L1j4j4L8L9M9N0K7r9j05j05KKp9p9P7P7L4L3j8j9M4M4k9k9k1k2
$$ 1234 1245 1313 1382 1356 1331 1331 1331 1363 1394 1380 1366 1404 1443 1492 1542 1569 1470 1365 1260 1262 1264 1185 1106 1183 1260 1294 1327 1309 1290 1334 1378 1349 1320 1299 1277
2154A277P3P2kkr6r5mmR0R0k4k3k4k3k4k5k4k4K5K5K5K5k1k2k2k2j2j3j2j3J00R9J08j8m8
$$ 1277 1350 1422 1420 1418 1322 1227 1223 1219 1309 1399 1375 1352 1328 1305 1281 1256 1232 1208 1233 1258 1283 1308 1287 1265 1243 1221 1209 1196 1184 1171 1271 1370 1478 1460 1412
2149A412m9OOL5L5J05k0r4r5LKp5p4K9L0nnK6K6O4O4KJm5m5j4j4m8m7J5J5n2n1J1J0O7O6L6
$$ 1412 1363 1369 1375 1410 1445 1550 1530 1436 1341 1344 1346 1271 1197 1226 1256 1251 1246 1272 1298 1362 1426 1428 1429 1384 1339 1325 1311 1263 1216 1231 1246 1194 1143 1154 1164 1231 1297 1333
2145A333L5lko5o5%%L2L1LKk8k9j1j0N1N2K0K1j0j0J1J1M3M2m7m8J5J5N8N7m7m6n3n4J0Rq
$$ 1333 1368 1365 1363 1298 1233 1233 1233 1265 1296 1299 1301 1273 1244 1233 1223 1274 1326 1346 1367 1357 1347 1358 1369 1412 1454 1407 1359 1374 1389 1447 1504 1457 1411 1358 1304 1314 1323 1315
2140A315qpql4l5l4l4P9Q0M8M8ppo9p0l8l8K4K4Q6Q5o0o1%%%%J7J8J7J7j4j4m6m5n4n4QRJ31
$$ 1315 1307 1300 1292 1258 1223 1189 1155 1234 1314 1362 1410 1403 1396 1327 1257 1219 1181 1205 1229 1315 1400 1340 1279 1279 1279 1279 1279 1296 1314 1331 1348 1334 1320 1274 1229 1175 1121 1129 1138 1269
2135A269J30N6p0p6p6O2O2qpqpK9K8K9K9m4m4J8J8L1L0p3p4m0m0j0rL6L6L6L5k0j9M2M3lk
$$ 1269 1399 1455 1385 1309 1233 1295 1357 1349 1342 1334 1327 1356 1384 1413 1442 1398 1354 1372 1390 1421 1451 1378 1304 1264 1224 1214 1205 1241 1277 1313 1348 1328 1309 1351 1394 1391 1389
2131A389O0O0J4J3L8L8k3j28r6QN7N8JJk3k3q5q5K1K1K1K1n2n3n3n3K9L0L0K9j9k0k0k0K5
$$ 1389 1449 1509 1523 1536 1574 1612 1589 1461 1365 1373 1430 1488 1489 1490 1467 1444 1359 1274 1295 1316 1337 1358 1306 1253 1200 1147 1176 1206 1236 1265 1246 1226 1206 1186 1211
2126A211K5K6K5l0k9l0k9K6K5K6K6J4J4P7P6qqpqn0n1J3J2k2k3RQrj0N3N3l9m0rrM0L9k3k3
$$ 1211 1236 1262 1287 1257 1228 1198 1169 1195 1220 1246 1272 1286 1300 1377 1453 1445 1437 1430 1422 1372 1321 1334 1346 1324 1301 1310 1318 1309 1299 1352 1405 1366 1326 1317 1308 1348 1387 1364 1341
2121A341J0J0k2k2K8K8N9N9n6n7OPk0k0PQm9j11o1Q6R1j3m3J9N9O0%JJ3J2n0n0j9j9j9j9K6
$$ 1341 1351 1361 1339 1317 1345 1373 1432 1491 1435 1378 1384 1391 1371 1351 1358 1366 1317 1206 1145 1231 1322 1309 1266 1285 1344 1404 1404 1405 1418 1430 1380 1330 1311 1292 1273 1254 1280
2117A280K7l6l6N3N4rrl7l6l6l7O0O0L3l0o6o7L0L0N2j1l9l8K1K1m1m1qpqpk1k1M5J07P5J3
$$ 1280 1307 1271 1235 1288 1342 1333 1324 1287 1251 1215 1178 1238 1298 1331 1301 1235 1168 1198 1228 1280 1269 1230 1192 1213 1234 1193 1152 1144 1137 1129 1122 1101 1080 1125 1232 1307 1320
2112A320m9J3Q3K1q2q2%O2K7K7klklM1M1k1q3n5M9Q4K1p2p3j5j4K5K4O4Jq7k4P8P8M5j9J4
$$ 1320 1271 1284 1367 1388 1306 1224 1224 1286 1313 1340 1338 1335 1333 1330 1371 1412 1391 1308 1253 1302 1386 1407 1335 1262 1247 1233 1258 1282 1346 1347 1260 1236 1314 1392 1437 1418 1432
2108A432J3lo5q9q8J4P7J00J00M3j9q8q8o1o0KJM0L9J2n1n2n1OPmnN4N5P2J0n9n9l7l8l7l7
$$ 1432 1445 1442 1377 1288 1200 1214 1291 1391 1491 1534 1515 1427 1339 1278 1218 1220 1221 1261 1300 1312 1261 1209 1158 1164 1171 1167 1162 1216 1271 1343 1353 1294 1235 1198 1160 1123 1086
2103A086M2M2M2M2opopL3L2p1p2k1k0M1M2l5l6l5l5j3j3J32J33J5J6m7m7k4k3k3k4M7M7j5
$$ 1086 1128 1170 1212 1254 1248 1241 1235 1228 1261 1293 1222 1150 1129 1109 1150 1192 1157 1121 1086 1051 1038 1025 1157 1290 1305 1321 1274 1227 1203 1180 1157 1133 1180 1227 1212
2099A212j6K9K8K9K8NNNNk0k0M3M3j6j6j6j5k5k5k4k5J%O2O3k6k6k5k6RRP2P2MMn8n8j6j5
$$ 1212 1196 1225 1253 1282 1310 1315 1320 1325 1330 1310 1290 1333 1376 1360 1344 1328 1313 1288 1263 1239 1214 1215 1215 1277 1340 1314 1288 1263 1237 1246 1255 1327 1399 1403 1407 1349 1291 1275 1260
2094A260j5j5L7L7k5k5n3n4RRRJ0RJ0k5k6k5k6K9K9K8K9RJ0RRq2q3k0k1MLo0n9P2P1P2P1q3
$$ 1260 1245 1230 1267 1304 1279 1254 1201 1147 1156 1165 1174 1184 1193 1203 1178 1152 1127 1101 1130 1159 1187 1216 1225 1235 1244 1253 1171 1088 1068 1047 1051 1054 994 935 1007 1078 1150 1221 1138
2090A138q4m9P5J10J09k9k8j6j5j6j5j9j9j9j8q5q6J9J9O9O8O8O9RJ0J0J0J6J6J6J6RJ0r5
$$ 1138 1054 1005 1080 1190 1299 1270 1242 1226 1211 1195 1180 1161 1142 1123 1105 1020 934 953 972 1041 1109 1177 1246 1255 1265 1275 1285 1301 1317 1333 1349 1358 1368 1273
2085A273r4N1N0N1N1k1k1k0k1k5k6k5k5KKo1o0m4m4m3m4Q0P9Q0Q0K7K6K7K6k8k8r1r0R9J00
$$ 1273 1179 1230 1280 1331 1382 1361 1340 1320 1299 1274 1248 1223 1198 1200 1202 1141 1081 1037 993 950 906 986 1065 1145 1225 1252 1278 1305 1331 1303 1275 1184 1094 1193 1293
2081A293L8L7k8k7k8k8NMNMJ0J0n3n3j6j6M6M6O1O2m2m3k4k4L8L9K0K0m2m2M7M6j5j6K0J9
$$ 1293 1331 1368 1340 1313 1285 1257 1262 1266 1271 1275 1285 1295 1242 1189 1173 1157 1203 1249 1310 1372 1330 1287 1263 1239 1277 1316 1336 1356 1314 1272 1319 1365 1350 1334 1354 1373
2077A373K0J9n2n3RJ0QRQQl9l8l9l9k5k4k5k4j9k0Q5Q5j3j3j3j2L1L2L1L2l4l3l3l4L7L6L6
$$ 1373 1393 1412 1360 1307 1316 1326 1334 1343 1351 1359 1320 1282 1243 1204 1179 1155 1130 1106 1087 1067 1152 1237 1224 1211 1198 1186 1217 1249 1280 1312 1278 1245 1212 1178 1215 1251 1287
2072A287L7L9L9j07j06P0P0PQl2l2l1l2K1K1K1K1K1K1K1K1n6n6m8m8JJ24R0K8mmqql6l7l6
$$ 1287 1324 1363 1402 1295 1189 1259 1329 1336 1344 1312 1280 1249 1217 1238 1259 1280 1301 1322 1343 1364 1385 1329 1273 1225 1177 1178 1302 1392 1420 1416 1412 1404 1396 1360 1323 1287
2068A287l6NONOm5m5N9N9l4l4l3l4N9N8N9N8n2n3m9m9L9J02P5n1n7n6o5o5KKO4O4n4n4RQN8
$$ 1287 1251 1256 1262 1267 1273 1228 1183 1242 1301 1267 1233 1200 1166 1225 1283 1342 1400 1348 1295 1246 1197 1236 1338 1413 1362 1305 1249 1184 1119 1121 1123 1187 1251 1197 1143 1152 1160 1218
2063A218N8mnN1N2j1j2o7o7L7L7qpqpjkjjL1L1L1L2j4j3j3j3L4L5L4L4L4L5L4L4K0K0K0J9
$$ 1218 1276 1272 1267 1318 1370 1359 1347 1280 1213 1250 1287 1279 1272 1264 1257 1256 1254 1253 1252 1283 1314 1345 1377 1363 1350 1337 1324 1358 1393 1427 1461 1495 1530 1564 1598 1618 1638 1658 1677
2058A677LLLLKKJ07J06p3p3j5j5J0n3q1M5K12L37M43L80R4j14j82j19j47j46j01K3J95L19
$$ 1677 1680 1683 1686 1689 1691 1693 1800 1906 1833 1760 1745 1730 1740 1687 1606 1651 1863 2200 2643 3023 3117 3003 2821 2702 2555 2409 2308 2331 2526 2845
2055B845M81P72R21P97M01n6m33o41o15m90l40k16k3J85L87O80R34J058O85k3p88j079r97
$$ 2845 3326 4098 5019 5816 6217 6161 5728 5087 4472 3982 3642 3426 3403 3588 3975 4655 5589 6647 7332 7309 6521 5442 4445
2052D445p05m76k68r4L1J29K54L55K93K5k67m18l57k57j95k10k11j73m7l4l4k5k6R8R9nnJ4
$$ 4445 3740 3264 2996 2902 2933 3062 3316 3671 3964 3989 3722 3304 2947 2690 2495 2285 2074 1901 1854 1820 1786 1761 1735 1833 1932 1927 1922 1936
2048A936J4J4J4J7J6K5K4R2K17L01M27N04M43J71j21k65k65j84o0J17M91R43J152P96J71m38
$$ 1936 1950 1964 1978 1995 2011 2036 2060 2152 2369 2670 3097 3601 4044 4215 4094 3829 3564 3380 3320 3437 3928 4871 6023 6819 6990 6552
2045F552o45n17l10k27j64PK98L06J5j90j28J99L23mm62o96n71l46k22j25%J05J05P2n4j90
$$ 6552 5907 5390 5080 4853 4689 4696 4994 5300 5315 5125 4997 5196 5519 5515 5053 4357 3786 3440 3218 3093 3093 3198 3303 3375 3321 3131
2042C131l15l23j98j48j49j33j33k8R6J30J31K8K9l4l4j3j3j4j3m1m1P3J97K59J97Q4K1n8
$$ 3131 2816 2493 2295 2147 1998 1865 1732 1704 1800 1930 2061 2089 2118 2084 2050 2037 2024 2010 1997 1956 1915 1988 2185 2444 2641 2725 2746 2688
2039B688j20j24o2N5N5J01K26M25N49O25O25N36M10K42J79J72J09j20l28l18k7M10R52J570
$$ 2688 2568 2444 2382 2437 2492 2593 2819 3244 3793 4418 5043 5579 5989 6231 6410 6582 6691 6571 6243 5925 5898 6308 7260 8830
2036H830J945J716R26k57j213j702j578j185p27m20j28M16R57R31L07n76j034r32p25n88n89
$$ 8830 10775 12491 13417 13160 11947 10245 8667 7482 6755 6335 6207 6623 7580 8511 8818 8242 7208 6276 5551 4963 4374
2033D374n75m51l59k35j87j24j15j15m9m9m6m5m5m5mlo7o6q3q3k1k1J7J6m6m6JJJJm2m2m3
$$ 4374 3799 3348 2989 2754 2567 2443 2328 2213 2164 2115 2069 2024 1979 1934 1930 1927 1860 1794 1711 1628 1607 1586 1603 1619 1573 1527 1528 1529 1530 1531 1489 1447 1404
2029A404m2J3J2J3J3K5K6K6K6q3q2K2K2k3k3k3k3K8K7K8K8J3J3J3J4j2j1j2j1o0o0KLJ3J2
$$ 1404 1362 1375 1387 1400 1413 1438 1464 1490 1516 1433 1351 1373 1395 1372 1349 1326 1303 1331 1358 1386 1414 1427 1440 1453 1467 1455 1444 1432 1421 1361 1301 1303 1306 1319 1331
2025A331J3J3p3p4L1L1J7J7j5j4k9l0L3L3L5L5L4L5n7n8n3n4k6L6N9O0m8j10l3P1R5L1J1J2
$$ 1331 1344 1357 1284 1210 1241 1272 1289 1306 1291 1277 1248 1218 1251 1284 1319 1354 1388 1423 1366 1308 1255 1201 1175 1211 1270 1330 1282 1172 1139 1210 1305 1336 1347 1359
2021A359rqrqJ1J1J1J1OPOPk4k4n8MJ9J9K4K3K5K5K5K6m4m3m7J5N5N5oo8j18n4M8M8j1p4m2
$$ 1359 1350 1342 1333 1325 1336 1347 1358 1369 1375 1382 1388 1395 1371 1347 1289 1293 1312 1331 1355 1378 1403 1428 1453 1479 1435 1392 1345 1360 1415 1470 1464 1396 1278 1224 1272 1320 1309 1235 1193
2016A193K0M1M1j7j8m2m1K3Q6Q0J7m8m8L5L6l0r2n4QP4P4K6K6nnk7k7q6q5KO4On6o3jK6K6
$$ 1193 1213 1254 1295 1278 1260 1218 1177 1200 1286 1366 1383 1335 1287 1322 1358 1328 1236 1182 1190 1264 1338 1364 1390 1385 1380 1353 1326 1240 1155 1157 1221 1227 1171 1108 1107 1133 1159
2011A159QP0P1Qm4m4N7N6KKKJl6l6K2K3K2m1l7l7K3K2K2K3m4m3J9J9L5L6L5L6l8l9l8l8J4
$$ 1159 1167 1237 1308 1316 1272 1228 1285 1341 1343 1345 1347 1348 1312 1276 1298 1321 1343 1302 1265 1228 1251 1273 1295 1318 1274 1231 1250 1269 1304 1340 1375 1411 1373 1334 1296 1258 1272
2007A272J4K2m1p7j6N0N0k9k8nN7N3j0kkm7m8J7Q0K0m4m3K0M5j8p6j3N9N9no9n6n6jkK2l9
$$ 1272 1286 1308 1267 1190 1174 1224 1274 1245 1217 1212 1269 1322 1312 1310 1308 1261 1213 1230 1310 1330 1286 1243 1263 1308 1290 1214 1201 1260 1319 1314 1245 1189 1133 1132 1130 1152 1113
2002A113l6l6L2L3L2L3Q0Q0J8J7k2k2q0q1LO6L8k4k6L6N9N9l4l4klllK5K4L4k7n5n5k9k9k5
$$ 1113 1077 1041 1073 1106 1138 1171 1251 1331 1349 1366 1344 1322 1242 1161 1164 1230 1268 1244 1218 1254 1313 1372 1338 1304 1302 1299 1296 1293 1318 1342 1376 1349 1294 1239 1210 1181 1156
1998A156k5KO3O4Jl2l1K6K7j7j6M5M6J1J1k1k0m8m9m1m2M3J48J24O2n7n7o0o1l6l7K6K6L3
$$ 1156 1131 1133 1196 1260 1261 1229 1198 1224 1251 1234 1218 1263 1309 1320 1331 1310 1290 1242 1193 1152 1110 1153 1301 1425 1487 1430 1373 1313 1252 1216 1179 1205 1231 1264
1994A264L3O0O1k0q2q1k0M7M7N1N1k0k0J2J1k3k3L6L5J7m7j1j1j8j7M2J05N9q6j40p7J9J9
$$ 1264 1297 1357 1418 1398 1316 1235 1215 1262 1309 1360 1411 1391 1371 1383 1394 1371 1348 1384 1419 1436 1389 1378 1367 1349 1332 1374 1479 1538 1452 1312 1235 1254 1273
1990A273qqM8M8J7J7l2l3l2l3K9K9K4K5m8j12q0j7N7N6L4k9j0j1M9M8L2L3L2L3J8J8J4J4l5
$$ 1273 1265 1257 1305 1353 1370 1387 1355 1322 1290 1257 1286 1315 1339 1364 1316 1204 1124 1107 1164 1220 1254 1225 1215 1204 1253 1301 1333 1366 1398 1431 1449 1467 1481 1495 1460
1985A460r8r7l5K7K8l2l1n3n2J2P4Q1J8m7m7klK9K9J%llM4k0m6m7J8J7L8J00J14Ro7nM2M1
$$ 1460 1362 1265 1230 1257 1285 1253 1222 1169 1117 1129 1203 1284 1302 1255 1208 1206 1203 1232 1261 1262 1262 1259 1256 1300 1280 1234 1187 1205 1222 1260 1360 1474 1483 1416 1411 1453 1494
1981A494n8n8kko0o0q7k4M7J09O4Jl0L2P5J3r3r4KLk9k9M5M5M5M4J3J2J2J2JKo2o1L3L3JK
$$ 1494 1436 1378 1376 1374 1314 1254 1167 1143 1190 1299 1363 1364 1334 1366 1441 1454 1361 1267 1269 1272 1243 1214 1259 1304 1349 1393 1406 1418 1430 1442 1443 1445 1383 1322 1355 1388 1389 1391
1976A391PPn1n1K5Q7M9n6p1p0j5j5j7j7J5J4j2j2j3j2K2K2K2K3J8J8J8J9M2M2k0k0k5k5k6
$$ 1391 1398 1405 1354 1303 1328 1415 1464 1408 1337 1267 1252 1237 1220 1203 1218 1232 1220 1208 1195 1183 1205 1227 1249 1272 1290 1308 1326 1345 1387 1429 1409 1389 1364 1339 1313
1972A313k5N7N7oo8KJ06M4o0q8k6L7L7j%L1L1k4k5k5k4j7j8M5M5J4J3m9m9qrqql0k9JKJ3J2
$$ 1313 1288 1345 1402 1396 1328 1330 1436 1480 1420 1332 1306 1343 1380 1379 1379 1410 1441 1417 1392 1367 1343 1326 1308 1353 1398 1412 1425 1376 1327 1319 1310 1302 1294 1264 1235 1236 1238 1251 1263
1967A263P5P5J4J5r0r0m0m1K2K2O3O4m1m1o4o4P4P5M7n8o2o2N1N2N1N1J9J8J8J8n2n2n2n3
$$ 1263 1338 1413 1427 1442 1352 1262 1222 1181 1203 1225 1288 1352 1311 1270 1206 1142 1216 1291 1338 1280 1218 1156 1207 1259 1310 1361 1380 1398 1416 1434 1382 1330 1278 1225
1963A225J8J8J7J8m6m6m6m7j2j3N2J15J12N0n7n7j3j2j2j2J1J1J1J1K6K5l3l2%O3L5k7m7J5
$$ 1225 1243 1261 1278 1296 1250 1204 1158 1111 1099 1086 1138 1253 1365 1415 1358 1301 1288 1276 1264 1252 1263 1274 1285 1296 1322 1347 1314 1282 1282 1345 1380 1353 1306 1321
1959A321L8L9n4n3QRjjL0L1j6j6j6j6l6l5j2N1Q4K1m4m4k2k2RRL6L6Rn4o3o3mnn2n3k5L7N8
$$ 1321 1359 1398 1344 1291 1299 1308 1307 1306 1336 1367 1351 1335 1319 1303 1267 1232 1220 1271 1355 1376 1332 1288 1266 1244 1253 1262 1298 1334 1343 1289 1226 1163 1159 1154 1102 1049 1024 1061 1119
1954A119N7jkQQQQN2N3j0rj9j8J3J3K1K0J6J7K2m1p2j0O7O6l3l4L7L8p0j32p2j0J4J3R7R8
$$ 1119 1176 1175 1173 1181 1189 1197 1205 1257 1310 1300 1291 1272 1254 1267 1280 1301 1321 1337 1354 1376 1335 1263 1253 1320 1386 1353 1319 1356 1394 1324 1192 1120 1110 1124 1137 1234 1332
1950A332L2l0k6L6O3Jo5o5l8l8k1k2M2M1J9K0K0J9M9M9K2m1n4n4k7k6j4j5J7J7j4j4M8M8Q7
$$ 1332 1364 1334 1308 1344 1407 1408 1343 1278 1240 1202 1181 1159 1201 1242 1261 1281 1301 1320 1369 1418 1440 1399 1345 1291 1264 1238 1224 1209 1226 1243 1229 1215 1263 1311 1398
1945A398Q7J7m4q9q9J3P6L7k6r2r1l4l4l0l0o1JJ08J08P7J4J8J9l9l8m3K1J7J7rj0N2N3K1
$$ 1398 1485 1502 1458 1369 1280 1293 1369 1406 1380 1288 1197 1163 1129 1099 1069 1008 1009 1117 1225 1302 1316 1334 1353 1314 1276 1233 1254 1271 1288 1279 1269 1321 1374 1395
1941A395K1pol8l8k6k7q4q5n3J0P8P9P0P1k9l0LO5L3k9n2n2OOrqK3K3p5p6m7J4R1R0O7No8
$$ 1395 1416 1409 1403 1365 1327 1301 1274 1190 1105 1052 1062 1140 1219 1289 1360 1331 1301 1304 1369 1402 1373 1321 1269 1275 1281 1272 1264 1287 1310 1235 1159 1112 1126 1217 1307 1374 1379 1311
1936A311o7m8J4N4rl3l2M0M0k2k2N0N0j2j3opl4l4kO1K5K5L2L1Qn5p8j6PPL8L8O9O9j5j5p3
$$ 1311 1244 1196 1210 1264 1255 1222 1190 1230 1270 1248 1226 1276 1326 1314 1301 1295 1288 1254 1220 1218 1279 1304 1329 1361 1392 1400 1345 1267 1251 1258 1265 1303 1341 1410 1479 1464 1449 1376
1932A376p4p5j3J5J4M1M1J4m9n2n1J7J7kkN0N0LKk9k8j6j6J6J5L8L7n6n6n6n6L8L7L0L1kj
$$ 1376 1302 1227 1214 1229 1243 1284 1325 1339 1290 1238 1187 1204 1221 1219 1217 1267 1317 1320 1322 1293 1265 1249 1233 1249 1264 1302 1339 1283 1227 1171 1115 1153 1190 1220 1251 1249 1248
1927A248MLk7k8QQRQl0l0l0l0M6M7M6M6k1k1k2k1J3J3J3J3j2j1M0M0k0k1N2N2KJp1p2ppM5
$$ 1248 1252 1255 1228 1200 1208 1216 1225 1233 1203 1173 1143 1113 1159 1206 1252 1298 1277 1256 1234 1213 1226 1239 1252 1265 1253 1242 1282 1322 1302 1281 1333 1385 1387 1388 1317 1245 1238 1231 1276
1923A276M4NNONl1l0%JJ%N3N3j9j9j9j9l2l3K0J9K3K4k9k9nmmmQRRQk7k8M5M5L0L0k3k2J%
$$ 1276 1320 1325 1330 1336 1341 1310 1280 1280 1281 1282 1282 1335 1388 1369 1350 1331 1312 1280 1247 1267 1286 1309 1333 1304 1275 1270 1266 1262 1258 1266 1275 1284 1292 1265 1237 1282 1327 1357 1387 1364 1342 1343 1343
1917A343J%o7o7ONK7K6K7K6m4m5K9K8k8k8k9k8jjjkJ5J4J4J5K1K1K0K1M6M5o8o9n3n2O2O2
$$ 1343 1344 1344 1277 1210 1216 1221 1248 1274 1301 1327 1283 1238 1267 1295 1267 1239 1210 1182 1181 1180 1179 1177 1192 1206 1220 1235 1256 1277 1297 1318 1364 1409 1341 1272 1219 1167 1229 1291
1913A291K8K8o6o6L1L0L1L1k1k2n3n3l6l6J6J6N8N8k8k8p3N2N4N5p3p3M1M2j3j3J8J9ppO6
$$ 1291 1319 1347 1281 1215 1246 1276 1307 1338 1317 1295 1242 1189 1153 1117 1133 1149 1207 1265 1237 1209 1136 1188 1242 1297 1224 1151 1192 1234 1221 1208 1226 1245 1238 1231 1297
1908A297O5PPPPj5j5j4j5lmlmN1N1k1k2q2q3n9O6P5P5n2n3l2l1K0K0J5J6j6j5kjjkqrK3K3
$$ 1297 1362 1369 1376 1383 1390 1375 1360 1346 1331 1328 1324 1321 1317 1368 1419 1398 1376 1294 1211 1152 1218 1293 1368 1316 1263 1231 1200 1220 1240 1255 1271 1255 1240 1238 1237 1236 1234 1226 1217 1240 1263
1903A263M9M9klj4j3o5o5lln5n5N3N4K1K2l3l4Q1Q0M7M7k6k6o6o5M8M9RRk2k3K7K7l6l6m1
$$ 1263 1312 1361 1359 1356 1342 1329 1264 1199 1196 1193 1138 1083 1136 1190 1211 1233 1200 1166 1247 1327 1374 1421 1395 1369 1303 1238 1286 1335 1344 1353 1331 1308 1335 1362 1326 1290 1249
1899A249m2m1m2j0j1j0j1O0N9O0O0K6K5K6K6m5m5m4m5J5J4J4J5j7j7M5M6KKo1o0llmlkkkk
$$ 1249 1207 1166 1124 1114 1103 1093 1082 1142 1201 1261 1321 1347 1372 1398 1424 1379 1334 1290 1245 1260 1274 1288 1303 1286 1269 1314 1360 1362 1364 1303 1243 1240 1237 1233 1230 1228 1226 1224 1222
1894A222k0k0k0k0ppppn2n3j1R4J30O8OOpqppO9P0PPm4m3m4m4L2L2L2L1j9j9j8j9k7k8L6L5
$$ 1222 1202 1182 1162 1142 1135 1128 1121 1114 1062 1009 998 1092 1222 1290 1296 1302 1295 1287 1280 1273 1342 1412 1419 1426 1382 1339 1295 1251 1283 1315 1347 1378 1359 1340 1322 1303 1276 1248 1284 1319
1889A319l1l1q7q7m8N5R4L2pqN2N1k9k8P1P2o5j27n1N4K3l9l2L0M7M6N1N1l0l0l0l1k6k6L6
$$ 1319 1288 1257 1170 1083 1035 1090 1184 1216 1209 1201 1253 1304 1275 1247 1318 1390 1325 1198 1147 1201 1224 1185 1153 1183 1230 1276 1327 1378 1348 1318 1288 1257 1231 1205 1241
1885A241L6mnmnM3M2k0k0lllkk2k1q3q4M6M6M6M6l3l4l3l3rqqqN7N6N7N7J8J9J8J8k2k2k2
$$ 1241 1277 1273 1268 1264 1259 1302 1344 1324 1304 1301 1298 1295 1293 1271 1250 1167 1083 1129 1175 1221 1267 1234 1200 1167 1134 1125 1117 1109 1101 1158 1214 1271 1328 1346 1365 1383 1401 1379 1357 1335
1880A335k2k2k2M0M0mlmmN3N4n0j11j03K2Q8K4q9r0J0J0qqN1N0K5l9j8J06R1l5j37p4J06J07
$$ 1335 1313 1291 1269 1309 1349 1345 1342 1338 1334 1387 1441 1391 1280 1177 1199 1287 1311 1222 1132 1142 1152 1144 1136 1187 1237 1262 1223 1205 1311 1402 1367 1230 1156 1262 1369
1876A369POm5m6m5m6QPQQL3L4k9k9m0l9K3K3llllL7L8L8L8K0J9m2m3jko4o4l5l5K7K7m0m0
$$ 1369 1376 1382 1337 1291 1246 1200 1208 1215 1223 1231 1264 1298 1269 1240 1200 1161 1184 1207 1204 1201 1198 1195 1232 1270 1308 1346 1366 1385 1343 1300 1299 1297 1233 1169 1134 1099 1126 1153 1113 1073
1871A073K2K3R9R9nnkjjjk1k0k1k0%%%%r4r5N1N1j7j6j6j7J4J4P2P2j7q1nR8Q3k1o0o0M2M2
$$ 1073 1095 1118 1217 1316 1311 1306 1304 1303 1302 1301 1280 1260 1239 1219 1219 1219 1219 1219 1125 1030 1081 1132 1115 1099 1083 1066 1080 1094 1166 1238 1221 1140 1135 1233 1316 1295 1235 1175 1217 1259
1866A259J0J0j1j2m3m3J1J1P4P3lklkpopoq4q5k2k2l2l3P1P2P7P6o9o9m4m4N9O0L4L4k9k9
$$ 1259 1269 1279 1268 1256 1213 1170 1181 1192 1266 1339 1336 1334 1331 1329 1322 1316 1309 1303 1219 1134 1112 1090 1058 1025 1096 1168 1245 1321 1252 1183 1139 1095 1154 1214 1248 1282 1253 1224
1861A224o2o2M2M2KLL3L4M3M2j9k0M4M3j9j9o2o3%%Q6Q6K3K3q7q8k5k5l3l4L0K9MLn9n9M4
$$ 1224 1162 1100 1142 1184 1186 1189 1222 1256 1299 1341 1322 1302 1346 1389 1370 1351 1289 1226 1226 1226 1312 1398 1421 1444 1357 1269 1244 1219 1186 1152 1182 1211 1215 1218 1159 1100 1144
1857A144M3M4M4M8M8n6n6q8q8R5R6Qn5n0N3R2K8QQk1k2J0J0l4l4l4l4J5J5m8m8L3L2p1p1M8
$$ 1144 1187 1231 1275 1323 1371 1315 1259 1171 1083 1178 1274 1282 1227 1177 1230 1322 1350 1358 1366 1345 1323 1333 1343 1309 1275 1241 1207 1222 1237 1189 1141 1174 1206 1135 1064 1112
1852A112M9M8M9KKL4L3n3n3M3M2Q3m2p6p6K1K2m1m1l7l7O7O7K8K8K8K8n4n4RRK1K1m2m1k6
$$ 1112 1161 1209 1258 1260 1262 1296 1329 1276 1223 1266 1308 1391 1349 1273 1197 1218 1240 1199 1158 1121 1084 1151 1218 1246 1274 1302 1330 1276 1222 1231 1240 1261 1282 1240 1199 1173
1848A173k7L7L6L8L8PQL9L9o6o5L8L7k4k5j7j7q0q0J0J0P2P2l6l6nnppl9l9J4J3J4J3N3N3
$$ 1173 1146 1183 1219 1257 1295 1302 1310 1349 1388 1322 1257 1295 1332 1308 1283 1266 1249 1169 1089 1099 1109 1181 1253 1217 1181 1176 1171 1164 1157 1118 1079 1093 1106 1120 1133 1186 1239
1843A239n2n1K7K7K6K7Q8Q9K6K6k5k5n6n6MLk8k8n1n1J1J1P5P5J3J2n7n8NNP6P7J4J4jkr8
$$ 1239 1187 1136 1163 1190 1216 1243 1331 1420 1446 1472 1447 1422 1366 1310 1314 1317 1289 1261 1210 1159 1170 1181 1256 1331 1344 1356 1299 1241 1246 1251 1327 1404 1418 1432 1431 1429 1331
1839A331r7n8O7N9O0PPn5n5n6n6M9M8n3n4N1N1Q3Q3o2o3q3q3k1k1O9O8POn6n6n6n6O9O8O9
$$ 1331 1234 1176 1243 1302 1362 1369 1376 1321 1266 1210 1154 1203 1251 1198 1144 1195 1246 1329 1412 1350 1287 1204 1121 1100 1079 1148 1216 1223 1229 1173 1117 1061 1005 1074 1142 1211
1835A211O8J4J4J4J4m4m3m3m4k9k9L4L3M7M7M1M1rj13j13qN0N0m4m3R5J59O5q0r2J2M1k0n4
$$ 1211 1279 1293 1307 1321 1335 1291 1248 1205 1161 1132 1103 1137 1170 1217 1264 1305 1346 1337 1224 1111 1103 1153 1203 1159 1116 1211 1370 1435 1355 1263 1275 1316 1296 1242
1830A242n3n7n7nmN8N8J5J5J4J5j2j2j2j2%JR9R8M2o2j01l9L6L6k3k3m9m8m9m8M4M4M4M3l3
$$ 1242 1189 1132 1075 1070 1066 1124 1182 1197 1212 1226 1241 1229 1217 1205 1193 1193 1194 1293 1391 1433 1371 1270 1231 1267 1303 1280 1257 1208 1160 1111 1063 1107 1151 1195 1238 1205
1826A205l3l3l3KKO0O0Rn4p8K7Q6Q7j2j1k3k2k3k3l1l1L2L2l7l8l7l7L4L4R7R6L4L3k9l0l3
$$ 1205 1172 1139 1106 1108 1110 1170 1230 1239 1185 1107 1134 1220 1307 1295 1284 1261 1239 1216 1193 1162 1131 1163 1195 1158 1120 1083 1046 1080 1114 1211 1307 1341 1374 1345 1315 1282
1822A282l3l3l3l6l7O8O8L1L2l1l1poooLMo0n9o5o5M0L9MMNMJ06J07LKkllkk2k3Q2Q2p0p0
$$ 1282 1249 1216 1183 1147 1110 1178 1246 1277 1309 1278 1247 1240 1234 1228 1222 1225 1229 1169 1110 1045 980 1020 1059 1063 1067 1072 1076 1182 1289 1292 1294 1292 1289 1286 1284 1262 1239 1321 1403 1333 1263
1817A263qqK8K9l4l4j4j5j4j4j0j0N3N2l2l2l1l2J3J3J2J3o3o4M0M0J5J5J4J5N0N0N0N0n8
$$ 1263 1255 1247 1275 1304 1270 1236 1222 1207 1193 1179 1169 1159 1212 1264 1232 1200 1169 1137 1150 1163 1175 1188 1125 1061 1101 1141 1156 1171 1185 1200 1250 1300 1350 1400 1342
1812A342n8n8n8RQRQQ7Q6o0o0k0k1k0k1K2K1m1m1K9K9K9L0LLn9n9L1L1p4p3rrN4N3K5K5K5
$$ 1342 1284 1226 1168 1177 1185 1194 1202 1289 1375 1315 1255 1235 1214 1194 1173 1195 1216 1175 1134 1163 1192 1221 1251 1254 1257 1198 1139 1170 1201 1127 1054 1045 1036 1090 1143 1168 1193 1218
1808A218K4n2n2n2n2M5M5n8n9O9O8O9O9o5o6o5o5L3L2L3L2ppK4K4l3l2r5r5J2J1P5P4QRk2
$$ 1218 1242 1190 1138 1086 1034 1079 1124 1066 1007 1076 1144 1213 1282 1217 1151 1086 1021 1054 1086 1119 1151 1144 1137 1161 1185 1152 1120 1025 930 942 953 1028 1102 1110 1119 1097
1803A097k3j4j4j4j4M2M1M1M2%%J%RJ0k2k1K0K0m3m2J3J3M5M4o2o3%jO3O3m2m1K1K1K1K2l
$$ 1097 1074 1060 1046 1032 1018 1060 1101 1142 1184 1184 1184 1185 1185 1194 1204 1182 1161 1181 1201 1158 1116 1129 1142 1187 1231 1169 1106 1106 1105 1168 1231 1189 1148 1169 1190 1211 1233 1230
1799A230klkk8k8k8k8O1O1L0L0L8L8k4k5j0j0j0j0J1J1J1J1MMn8n8k1k2Q2Q3j4j3j4j3o8o8
$$ 1230 1228 1225 1223 1195 1167 1139 1111 1172 1233 1263 1293 1331 1369 1345 1320 1310 1300 1290 1280 1291 1302 1313 1324 1328 1332 1274 1216 1195 1173 1255 1338 1324 1311 1297 1284 1216 1148
1794A148pN6O9n6j21n8N5N5mmRQn4n4k1k1k2k1Q6Q7K5l7qJ16N8o7j53k9klj7j7M6M5qqnnM9
$$ 1148 1141 1197 1266 1210 1089 1031 1086 1141 1137 1133 1142 1150 1096 1042 1021 1000 978 957 1043 1130 1155 1118 1110 1226 1284 1217 1064 1035 1033 1030 1013 996 1042 1087 1079 1071 1066 1061 1110
1789A110J11P7k8p6j4Q4K1p6p7K3K4k2k2RRJ6J6J7J6k1k1k1k2qqqqK3K2K2K3K4K5N5N6J4J4
$$ 1110 1221 1298 1270 1194 1180 1264 1285 1209 1132 1155 1179 1157 1135 1144 1153 1169 1185 1202 1218 1197 1176 1155 1133 1125 1117 1109 1101 1124 1146 1168 1191 1215 1240 1295 1351 1365 1379
1785A379m8m9l8l9l9l8j8j9Q6Q6k0k0J1J1m6m6J6J6J3J4J3J3j09j09J3J17J27K2n8n8n0n0
$$ 1379 1331 1282 1244 1205 1166 1128 1110 1091 1177 1263 1243 1223 1234 1245 1199 1153 1169 1185 1198 1212 1225 1238 1129 1020 1033 1150 1277 1299 1241 1183 1133 1083
1781A083J3J2R0Q9M4o0j04j04L6L5j8j8j8j8K8K7l5l5K9L0R3R2N1N1N1N0p5p6m5m5%%o3j25
$$ 1083 1096 1108 1198 1287 1331 1271 1167 1063 1099 1134 1116 1098 1080 1062 1090 1117 1082 1047 1076 1106 1199 1291 1342 1393 1444 1494 1419 1343 1298 1253 1253 1253 1190 1065
1777A065q8J6J00R9o1o1M3M3%jK7K7M5j8m7N7P5k8j06j05K8R0J6q8q6J7N4rk7L5L1l1n5n5
$$ 1065 977 993 1093 1192 1131 1070 1113 1156 1156 1155 1182 1209 1254 1236 1189 1246 1321 1293 1187 1082 1110 1200 1216 1128 1042 1059 1113 1104 1077 1112 1143 1112 1057 1002
1773A002M6M5M7M7M6M7n8n9M6M5K1K1m2m2mmlmqpN5N5QQP1P0m6m7m6m7l8l9O3J25M5j02j92
$$ 1002 1048 1093 1140 1187 1233 1280 1222 1163 1209 1254 1275 1296 1254 1212 1208 1204 1201 1197 1189 1182 1237 1292 1300 1308 1379 1449 1403 1356 1310 1263 1225 1186 1249 1374 1419 1317 1125
1768A125j29QP0L9M0M9N0n4n5j7j8j8j8k1k1Q4Q3POPOl0l1l0l1j6j6M6M7K8K9K8K9j5j4p7
$$ 1125 996 1004 1074 1113 1153 1202 1252 1198 1143 1126 1108 1090 1072 1051 1030 1114 1197 1204 1210 1217 1223 1193 1162 1132 1101 1085 1069 1115 1162 1190 1219 1247 1276 1261 1247 1170
1764A170p7l5l6K7K7K8K8K9K8K6K5l6l7J3J2J3J3L4L5k8k7j6j7j6j6LLMLl3l2L1L0J3J2J3
$$ 1170 1093 1058 1022 1049 1076 1104 1132 1161 1189 1215 1240 1204 1167 1180 1192 1205 1218 1252 1287 1259 1232 1216 1199 1183 1167 1170 1173 1177 1180 1147 1115 1146 1176 1189 1201 1214
1759A214J3K4K4l8l8K4K3l9l8k8k7P7P7l0l0l0k9JKJJO1O1kjm6m6J7J7l7l6l6l6M2M2M2M2
$$ 1214 1227 1251 1275 1237 1199 1223 1246 1207 1169 1141 1114 1191 1268 1238 1208 1178 1149 1150 1152 1153 1154 1215 1276 1274 1273 1227 1181 1198 1215 1178 1142 1106 1070 1112 1154 1196 1238
1755A238N6N5m8m8n1n1n1n1j34j34L3J37O9PJ0P2K5l7l4L0N6N7m4m4k1k1k1k1j0rj0rM3M3
$$ 1238 1294 1349 1301 1253 1202 1151 1100 1049 915 781 814 951 1020 1027 1037 1109 1134 1097 1063 1093 1149 1206 1162 1118 1097 1076 1055 1034 1024 1015 1005 996 1039 1082
1751A082M4M3J1J1PPo5j28m6N7O8O7J2J2l0l1l0l0M2M3M2M3P4P4p2p1k9k8k9k9K6K6K6K7m3
$$ 1082 1126 1169 1180 1191 1198 1205 1140 1012 966 1023 1091 1158 1170 1182 1152 1121 1091 1061 1103 1146 1188 1231 1305 1379 1307 1236 1207 1179 1150 1121 1147 1173 1199 1226 1183
1746A183m3J9K0PPPPL0L0L1L0%%o3o2L1L1l1l2ppqpNOONL8L7o6o7mmmmn7n7OOR0R1j4j4l8
$$ 1183 1140 1159 1179 1186 1193 1200 1207 1237 1267 1298 1328 1328 1328 1265 1203 1234 1265 1234 1202 1195 1188 1180 1173 1178 1184 1190 1195 1233 1270 1204 1137 1133 1129 1125 1121 1064 1007 1013 1019 1109 1200 1186 1172 1134
1741A134l9O0N9K1q3q2K1J02J02l7l7OONOMLMLpop0o9m0m0K3K2J5J5m8m8Q8Q8K5K5n1n1J2
$$ 1134 1095 1155 1214 1235 1152 1070 1091 1193 1295 1258 1221 1227 1233 1238 1244 1248 1251 1255 1258 1251 1245 1175 1106 1066 1026 1049 1071 1086 1101 1053 1005 1093 1181 1206 1231 1180 1129 1141
1736A141J1K3K3qqJ1J0J15J15jjo3o4j4j5J7J6J6J6m6m7j8j9q0q1nmmnM9M9j3j4ppN5N5M2
$$ 1141 1152 1175 1198 1190 1182 1193 1203 1318 1433 1432 1431 1368 1304 1290 1275 1292 1308 1324 1340 1294 1247 1229 1210 1130 1049 1044 1040 1036 1031 1080 1129 1116 1102 1095 1088 1143 1198 1240
1732A240M3k1k0m7m7J5J5poN6N6J3J4j8j8n0n0n0n0P6P7J3J4n4n4k4k3J8J8J8J7L2L1L2L1
$$ 1240 1283 1262 1242 1195 1148 1163 1178 1171 1165 1221 1277 1290 1304 1286 1268 1218 1168 1118 1068 1144 1221 1234 1248 1194 1140 1116 1093 1111 1129 1147 1164 1196 1227 1259 1290
1727A290L6L5o8o8l8l7ooJ8J8j3j3j4j3m4m5J3J3M4M4R1R1j3j4l7l7l7l8j3j4j4j4n0n0N4
$$ 1290 1326 1361 1293 1225 1187 1150 1144 1138 1156 1174 1161 1148 1134 1121 1077 1032 1045 1058 1102 1146 1237 1328 1315 1301 1264 1227 1190 1152 1139 1125 1111 1097 1047 997 1051
1723A051N4M8M8J7J7llo6o5KJKJnonoR8R8m8m8M0L9RQm1m1j0j0j7j8M5M4K9K8l4l4l4l3l4
$$ 1051 1105 1153 1201 1218 1235 1232 1229 1163 1098 1100 1101 1103 1104 1099 1093 1088 1082 1180 1278 1230 1182 1222 1261 1270 1278 1237 1196 1186 1176 1159 1141 1186 1230 1259 1287 1253 1219 1185 1152 1118
1718A118l4M4M4j9j9lmK8K8qqJ3P5R8om8m8P9P8J6J6J40J40J19N6J62K66K51O3j3N0J17J3
$$ 1118 1084 1128 1172 1153 1134 1131 1127 1155 1183 1175 1167 1180 1255 1353 1347 1299 1251 1330 1408 1424 1440 1580 1720 1839 1895 2057 2323 2574 2637 2624 2674 2791 2804
1714B804j85k90k73k10j44j43p7p7J0J0J0J0j2j2j3j2n0n0n0n0o4o3M0M1L9L9k3k3J6J7P8
$$ 2804 2619 2329 2056 1846 1702 1559 1482 1405 1415 1425 1435 1445 1433 1421 1408 1396 1346 1296 1246 1196 1132 1069 1109 1150 1189 1228 1205 1182 1198 1215 1293
1710A293P9R5R4kjK7J53K28K28K46K47J00J01J5J5r8k23k68k06j45j45p4p5j2j2o4o5M0M0
$$ 1293 1372 1467 1561 1559 1558 1585 1738 1966 2194 2440 2687 2787 2888 2903 2918 2820 2597 2329 2123 1978 1833 1759 1684 1672 1660 1596 1531 1571 1611
1707A611mmo7o6%%%jJ12J11M8M9P4P3J40J39K64L27L43M68O54R46J028R04O74L82J64j27m60
$$ 1611 1607 1603 1536 1470 1470 1470 1470 1469 1581 1692 1740 1789 1863 1936 2076 2215 2479 2806 3149 3617 4271 5217 6245 7149 7823 8205 8369 8242 7782
1703G782p52r05r05q08n99m71l47k05j42j39j39j00j01LLj0j1p2p3rrrqPQPQR7R7J28J28K61
$$ 7782 7030 6125 5220 4412 3813 3342 2995 2790 2648 2509 2370 2270 2169 2172 2175 2165 2154 2082 2009 2000 1991 1982 1974 1981 1989 1996 2004 2101 2198 2326 2454 2715
1699B715K62L37L37M73O80R39J230J661J953J927J469Q86L46j23o64j265j722j785j577j318
$$ 2715 2977 3314 3651 4124 4804 5743 6973 8634 10587 12514 13983 14869 15215 15092 14428 13163 11441 9656 8079 6761
1697F761j027q08o00m77l52k94k32j87j23r3r2j24j25j28o5j5j4j52j51o5jkkK8Q9Q6Q6Q7
$$ 6761 5734 4926 4326 3849 3497 3203 2971 2784 2661 2568 2476 2352 2227 2099 2034 2019 2005 1853 1702 1637 1636 1634 1632 1660 1749 1835 1921 2008
1693B008Q8O1O0P2J34K21K84M29O16Q40R43R21P34M84K55J23o5m32q26r91q86o92n45m50l45
$$ 2008 2096 2157 2217 2289 2423 2644 2928 3357 3973 4813 5756 6677 7411 7895 8150 8273 8208 7776 6950 5959 5073 4381 3836 3386 3041
1690C041k43j80j94j94j28j27q4q5q0q0q8k5J0n3n0J1P7P7l5l6mN8J07J69K41L04K56J51N7
$$ 3041 2798 2618 2424 2230 2102 1975 1891 1806 1726 1646 1558 1533 1543 1490 1440 1451 1528 1605 1570 1534 1530 1588 1695 1864 2105 2409 2665 2816 2873
1687B873mj0p3j89k52k69k06j34p2j9j8p4p3o0Kk8k9j6M6P7J5m4m4J4J5j2j1J9K0K8K8l5l5
$$ 2873 2869 2859 2786 2597 2345 2076 1870 1736 1664 1645 1627 1553 1480 1420 1422 1394 1365 1349 1395 1472 1487 1443 1399 1413 1428 1416 1405 1424 1444 1472 1500 1465 1430
1683A430%jL0L1L3L4k5k5%O3J73J74K26K26J85Q1L0R2P0p5k64k64j68j69j33j32l2l3l8j00
$$ 1430 1430 1429 1459 1490 1523 1557 1532 1507 1507 1570 1743 1917 2143 2369 2554 2635 2665 2757 2827 2752 2488 2224 2056 1887 1754 1622 1590 1557 1519 1419
1679A419o6L9M2k2q3q4k1k2k1k2O7O7NMm9m9n0m9N9N8N9N9k8k8k8k8J6J5m8m7l4l5l4l4N2
$$ 1419 1353 1392 1434 1412 1329 1245 1224 1202 1181 1159 1226 1293 1298 1302 1253 1204 1154 1105 1164 1222 1281 1340 1312 1284 1256 1228 1244 1259 1211 1164 1130 1095 1061 1027 1079
1675A079N3norN3K1q3j24k1J01J02k2k1k2k2RQQRL5L5L6L5qpqpJ6J5m6m7QQQQrrk9r3n9M4
$$ 1079 1132 1127 1121 1112 1165 1186 1103 979 958 1059 1161 1139 1118 1096 1074 1083 1091 1099 1108 1143 1178 1214 1249 1241 1234 1226 1219 1235 1250 1204 1157 1165 1173 1181 1189 1180 1171 1142 1049 990 1034
1670A034P9J7J4J3RRk1k2M0M1K7K8K7K7p2p3j0j1p9q0K4K4P2P1l3l3l4l4K8K9m1m0K2K2J0
$$ 1034 1113 1130 1144 1157 1166 1175 1154 1132 1172 1213 1240 1268 1295 1322 1250 1177 1167 1156 1077 997 1021 1045 1117 1188 1155 1122 1088 1054 1082 1111 1070 1030 1052 1074 1084
1666A084J0J0J0N6N5por9r9ONQ0Q0J7J7ppopj00j01M6M5K7K7K7K8p5p4P1P2K8K8K8K8m4m5
$$ 1084 1094 1104 1114 1170 1225 1218 1212 1113 1014 1020 1025 1105 1185 1202 1219 1212 1205 1199 1192 1092 991 1037 1082 1109 1136 1163 1191 1116 1042 1113 1185 1213 1241 1269 1297 1253 1208
1661A208m5m4j6j6M7M6k7k8k7k8j2j3j2j3k0k1k0k0J4J4J4J4llO0N9MMMMl9l9O5O5K2K1q3
$$ 1208 1163 1119 1103 1087 1134 1180 1153 1125 1098 1070 1058 1045 1033 1020 1000 979 959 939 953 967 981 995 992 989 1049 1108 1112 1116 1120 1124 1085 1046 1111 1176 1198 1219 1136
1656A136q3M6M6M6M5m9n0J3J2J3J3J3J2n8n7M6M6m2m3K1Q2O1m3p8j5KLr1r1p3L0J18J18PP
$$ 1136 1053 1099 1145 1191 1236 1187 1137 1150 1162 1175 1188 1201 1213 1155 1098 1144 1190 1148 1105 1126 1208 1269 1226 1148 1133 1135 1138 1047 956 883 913 1031 1149 1156 1163
1652A163LLk1q3j07lJ04J04OPm7m7J6J5k2k2k3k2nnN7N8N6N6j32j31o1o1KKL5L5L6L5J0J1
$$ 1163 1166 1169 1148 1065 958 955 1059 1163 1169 1176 1129 1082 1098 1113 1091 1069 1046 1024 1019 1014 1071 1129 1185 1241 1109 978 917 856 858 860 895 930 966 1001 1011 1022
1648A022J0J0rrrrJ3J4P6P6o4o4kkK4K4K4K4l0l1l1l0o6o5L8L9Q6Q7K4K5n1n1N4N3l6l6l7
$$ 1022 1032 1042 1033 1024 1015 1006 1019 1033 1109 1185 1121 1057 1055 1053 1077 1101 1125 1149 1119 1088 1057 1027 961 896 934 973 1059 1146 1170 1195 1144 1093 1147 1200 1164 1128 1091
1643A091l6M9M9j4j4l4l5l4l5J1J1P4P3k1k2k1k2mmnmo1o1KJK8K7N9N9L0L1%jm1m2j0j1K2
$$ 1091 1055 1104 1153 1139 1125 1091 1056 1022 987 998 1009 1083 1156 1135 1113 1092 1070 1066 1062 1057 1053 992 931 933 934 962 989 1048 1107 1137 1168 1168 1167 1126 1084 1074 1063 1085
1639A085K2m0m0M0L9R9R8o8j30n0N4J04J04K4q1r0r0QQm0m0K3K2MMMMl9l8qpJ2J1J10J09k5
$$ 1085 1107 1067 1027 1067 1106 1205 1303 1235 1105 1055 1109 1213 1317 1341 1260 1170 1080 1088 1096 1056 1016 1039 1061 1065 1069 1073 1077 1038 1000 992 985 997 1008 1118 1227 1202
1634A202j29r3N2Q8K6l3l4ppppj4j3j4j3L7L8L8L7nnnoJ%o2o2l6l7K6K6L0L1O2O2LKK4Q6R9
$$ 1202 1073 980 1032 1120 1146 1113 1079 1072 1065 1058 1051 1037 1024 1010 997 1034 1072 1110 1147 1142 1137 1132 1126 1127 1127 1065 1003 967 930 956 982 1012 1043 1105 1167 1170 1172 1196 1282 1381
1629A381mm6m6m1m0K2K2mll5l6k1k1k2k1J9J8J9J9NOn7n6o9o9L5L5KLL3L4L1L2%%K9L0kkk9
$$ 1381 1377 1331 1285 1244 1204 1226 1248 1244 1241 1206 1170 1149 1128 1106 1085 1104 1122 1141 1160 1165 1171 1114 1058 989 920 955 990 992 995 1028 1062 1093 1125 1125 1125 1154 1184 1182 1180 1151
1624A151k9k8k9L4L4L5L4l5l4l5l4j1j1j5j5J6m6p4L1R6L5J4J3QQr6r6O9O9PPoonol3l3l3
$$ 1151 1122 1094 1065 1099 1133 1168 1202 1167 1133 1098 1064 1053 1042 1027 1012 1028 982 908 939 1035 1070 1084 1097 1105 1113 1017 921 990 1059 1066 1073 1067 1061 1056 1050 1017 984 951
1620I51l3K4K5K4K5MMk7k7K1K0m2m2lmN9N9N9N9mlonj09j10o6o7l5l6J09J08M6M6L2L2L2L2
$$ 951 918 942 967 991 1016 1020 1024 997 970 991 1011 969 927 924 920 979 1038 1097 1156 1152 1149 1143 1138 1029 919 853 786 751 715 824 932 978 1024 1056 1088 1120 1152
1615A152L0L0K9L0ppj10j11m3m3K0J9J2J3J2J2m5m5m5m5mmN9N8K5K4l7l8M1M1M1M1K7K7l6
$$ 1152 1182 1212 1241 1271 1264 1257 1147 1036 993 950 970 989 1001 1014 1026 1038 993 948 903 858 854 850 909 967 992 1016 979 941 982 1023 1064 1105 1132 1159 1123
1611A123l5K6K6p7p8RRM0M0J3J2J2J2K8K8l5l4m2m2j1j0J15J15N2N3M7M6M7M7J11J10K15K14
$$ 1123 1088 1114 1140 1063 985 994 1003 1043 1083 1096 1108 1120 1132 1160 1188 1153 1119 1077 1035 1024 1014 1129 1244 1296 1349 1396 1442 1489 1536 1647 1757 1972 2186
1607B186J70J70P3P4K06L31N16O40N53R4m04o96o65n40m66l41k06j44j09j09l0l1l1l1L4L4
$$ 2186 2356 2526 2599 2673 2879 3210 3726 4366 4919 5013 4609 3913 3248 2708 2242 1901 1695 1551 1442 1333 1303 1272 1241 1210 1244 1278
1604A278p1p0r8r8OPO6O6MLj9k0k0j9%%J%j4j5j4j5K7K7mnK6K7p8p8L0L0R2R2NMr9j00J8J7
$$ 1278 1207 1137 1039 941 947 954 1020 1086 1090 1093 1074 1054 1034 1015 1015 1015 1016 1016 1002 987 973 958 985 1012 1008 1003 1029 1056 978 900 930 960 1052 1144 1149 1153 1054 954 972 989
1599I89M9M9J2J2n0n0k6k6NNkkL0L0O0O1m4m3qqp0p0MMMML4L4L4L3j6j7j6j7J00J00mmn2n2
$$ 989 1038 1087 1099 1111 1061 1011 985 959 964 969 967 965 995 1025 1085 1146 1102 1059 1051 1043 973 903 907 911 915 919 953 987 1021 1054 1038 1021 1005 988 1088 1188 1184 1180 1128 1076
1594A076q3q3K4K4l8l9L5L5k8k7jjl2l2J07J08M5M5L7L6k5k6j0j0N3N2J28J27P3J35L45N32
$$ 1076 993 910 934 958 920 881 916 951 923 896 895 894 862 830 937 1045 1090 1135 1172 1208 1183 1157 1147 1137 1190 1242 1370 1497 1570 1705 2050 2582
1590B582N76M72K51k1l24n12m72l68k87k24j00j00j59j59l4l4l4l4MMj00j00O3O3JJJ4J3m4
$$ 2582 3158 3630 3881 3860 3536 3024 2552 2184 1897 1673 1573 1473 1314 1155 1121 1087 1053 1019 1023 1027 927 827 890 953 954 955 969 982 938
1587I38m5J6P9J8j08j14J2L7L7L8L9o5o6L1L1J2n1m5Q0M1k1m7m8n1n1ONONL3L3L3L3j1j0j07
$$ 938 893 909 988 1006 898 784 796 833 870 908 947 882 816 847 878 890 839 794 874 915 894 847 799 748 697 703 708 714 719 752 785 818 851 840 830 723
1582G23j07k6R9L2L2Q0J42J15j0%jrqK2K3m0m0o0n9j7p9p1N3M2M1L4L4k7r0p7M7P2Ql0l0l5
$$ 723 616 590 689 721 753 833 975 1090 1080 1080 1079 1070 1062 1084 1107 1067 1027 967 908 891 812 741 794 836 877 911 945 918 828 751 798 870 878 848 818 783
1578G83l4K3K2l8j01p4N2J6m6j3N0J0J1K2K3m0m0K3K3l5l5J2P4N4p0k4J02R4l2n0n1MML1L0
$$ 783 749 772 794 756 655 581 633 649 603 590 640 650 661 683 706 666 626 649 672 637 602 614 688 742 672 648 750 844 812 762 711 715 719 750 780
1573G80l2l1K6K7K7K6J0Rn3n2n6n5m8m8lJ22O7n8k3J02R9k7m8J3N0p6j24JK7K7j2j2R3R2J23
$$ 780 748 717 743 770 797 823 833 842 789 737 681 626 578 530 527 649 716 658 635 737 836 809 761 774 824 748 624 625 652 679 667 655 748 840 963
1569I63J22k3k4j7j7mmJ30L38N68R43J289J228M42n97j148j023p00m92l94j85o1o0o4o3M9
$$ 963 1085 1062 1038 1021 1004 1000 996 1126 1464 2032 2975 4264 5492 5934 5337 4189 3166 2466 1974 1580 1395 1334 1274 1210 1147 1196
1566A196M9R0K15L89O81R85J193Q35M3p28j019r04o97m66k58j75j75q1q1l8j00o3O2J13r6
$$ 1196 1245 1335 1550 1939 2620 3605 4798 5633 5676 4948 3929 3025 2328 1862 1604 1429 1254 1173 1092 1054 954 891 953 1066 970
1563I70j73m8J4J4J3J3P9P9K7Q9P0n5m1Q4K35K35J93J93R5j97l89k65j16j16j38j3N9kq6k4
$$ 970 797 749 763 777 790 803 882 961 988 1077 1147 1092 1051 1135 1370 1605 1798 1991 2086 1889 1500 1235 1119 1003 865 852 911 909 823 799
1559G99L9k3l6K6K7l6l0L3P2n3j07J7Q3K0o6lK8K8K3J48J56L0j0J14K10Q5JJP1n3l1R5J41
$$ 799 838 815 779 805 832 796 766 799 871 818 711 728 811 831 765 762 790 818 841 989 1145 1175 1165 1279 1489 1574 1575 1576 1647 1594 1563 1658 1799
1555A799o7j53k8J15N2p3j2R0l4j21MJ94J31pN5K00J38M7J09J85J23J25M16O42P04Q62J403
$$ 1799 1732 1579 1551 1666 1718 1645 1633 1723 1689 1568 1572 1766 1897 1890 1945 2145 2283 2330 2439 2624 2747 2872 3288 3930 4634 5496 6899
1552F899K257K882L342L800M101L894L428K886K102Q11p42j949k694l235l701l764l420l045
$$ 6899 9156 12038 15380 19180 23281 27175 30603 33489 35591 36402 35660 33711 31017 27782 24081 20317 16897 13852
1550A3852k641k099j434j059q43o36l63k37k61k61j42j41j14J1J65M0j35j0J91J90O7J91L04
$$ 13852 11211 9112 7678 6619 5776 5140 4777 4540 4279 4018 3876 3735 3621 3632 3797 3837 3702 3692 3883 4073 4140 4331 4635
1547D635J78K5J50L84L84K54K54M49M50L46M72O69O06M19M81O24M99L55M80Q44R69J084J626
$$ 4635 4813 4838 4988 5372 5756 6010 6264 6713 7163 7509 7981 8650 9256 9675 10156 10780 11279 11634 12114 12958 13927 15011 16637
1544A6637K603L561M952P658J1975J6927K1559K5095K7010K7301K6519K5061K1395J4111L934
$$ 16637 19240 22801 27753 35411 47386 64313 85872 110967 137977 165278 191797 216858 238253 252364 256298
1542B56298o179j3883j9085k2711k5167k6404k6197k4031j9911j5041j1089q445o240m263
$$ 256298 250119 236236 217151 194440 169273 142869 116672 92641 72730 57689 46600 38155 31915 27652
1541B7652l139k625j917q96n20p86p86m09m09q76q77k52m4l10j01M68M68k34m42j2p4o84n59
$$ 27652 24513 21888 19971 19075 18555 17769 16983 16574 16165 15289 14412 14160 14116 13806 13705 14173 14641 14407 13965 13953 13879 13195 12636
1538A2636L34O26K35O93J962K087R24N50J627K167J773K730N233O606P326J1529K0041L0736
$$ 12636 12970 13596 13831 14524 16486 18573 19497 20047 21674 23841 25614 28344 33577 40183 47509 59038 79079 109815
1536A09815M9459Q7623J37574J59672J15129J4041q5179j30750j21012q9758o3529m5508l1239
$$ 109815 159274 246897 384471 544143 659272 673313 588134 457384 336372 246614 183085 137577 106338
1534A06338k1126j6122j3000r254o216n050m177k372j248j679k304j964j589j867j867j064
$$ 106338 85212 69090 56090 46836 40620 35570 31393 29021 27773 26094 23790 21826 20237 18370 16503 15439
1532A5439n24p07q33l52o1m46o54k47J27k9k37q7J21J88M80J137J263N50l25p53q78j084j083
$$ 15439 14915 14208 13375 13023 12962 12516 11862 11615 11742 11713 11476 11389 11510 11698 12178 13315 14578 15128 14803 14050 13172 12088 11005
1529A1005p60o35p55p54m21k13k87l50j42j8j95k57r7K8j49k11j0J16k6k33j27o4j68k30n4
$$ 11005 10245 9610 8855 8101 7680 7467 7180 6830 6688 6670 6475 6218 6121 6149 6000 5789 5779 5895 5869 5636 5509 5445 5277 5047 4993
1526D993J54Oj18p9M6k4q7l8K4j1j1J17J79O8n7p8p9j6j6J77L02K32K32J70J71L8L8J80L89
$$ 4993 5147 5153 5035 4956 5002 4978 4891 4853 4877 4866 4855 4972 5151 5219 5162 5084 5005 4989 4973 5150 5452 5684 5916 6086 6257 6295 6333 6513 6902
1523F902N95Q03R32R94J160J367J132L41m60o68m86j95J38P63J316J442J519J644J665J540
$$ 6902 7497 8300 9232 10226 11386 12753 13885 14226 13766 13098 12612 12417 12555 13318 14634 16076 17595 19239 20904 22444
1520B2444J863K986M183N224P164J1035J6278K4144M0396P0318J07501J30766J17464O2404
$$ 22444 24307 27293 31476 36700 43864 54899 71177 95321 135717 206035 313536 444302 561766 624170
1518F24170j4343q0139j11435j06733q2495n7565m0342k9313k0974j4773j1085q796o526m321
$$ 624170 609827 529688 418253 311520 229025 171460 131118 101805 80831 66058 54973 46177 39651 35330
1517C5330l124k750k251j794j830k121j958j417j197j259j091o32m99o23n86l77l57m82m56
$$ 35330 32206 29456 27205 25411 23581 21460 19502 18085 16888 15629 14538 13906 13407 12784 12198 11821 11464 10982 10526
1514A0526k47l05n13m23k15j58k82j59M9Kj23r8K6k6k34j49N9J16rk6J81K39J14J35K60L45
$$ 10526 10279 9974 9461 9038 8823 8665 8383 8224 8273 8275 8152 8054 8080 8054 7820 7671 7730 7846 7837 7811 7992 8231 8345 8480 8740 9085
1511I085L45N74Q64J033J159J509K300L617O155J0432J5051J7023J3819N742m121j1737j4775
$$ 9085 9430 10004 10868 11901 13060 14569 16869 20486 26641 37073 52124 69147 82966 88708 84587 72850 58075
1509E8075j3444j0156p201n328l911k704j929j555j230p74n57n57n67l60k53l77m01k75j24
$$ 58075 44631 34475 27274 21946 18035 15331 13402 11847 10617 9843 9286 8729 8162 7802 7549 7172 6771 6496 6372
1507F372j86k61j36k2q5j58l4oo9j32p0l1j56k12q8K0m3r1k9P1Rm5m5m8m9m6m7lo6o1O3O4
$$ 6372 6186 5925 5789 5767 5682 5524 5490 5484 5415 5283 5213 5182 5026 4814 4726 4746 4703 4612 4583 4654 4663 4618 4573 4525 4476 4430 4383 4380 4314 4253 4316 4380
1503D380o2j69j07m6m6o3o3M1M1n8n7n0n0m4Q0Q5m0j20n7MMl1l2L1L1j4j3j0ro3%M2q2j14
$$ 4380 4318 4149 4042 3996 3950 3887 3824 3865 3906 3848 3791 3741 3691 3647 3727 3812 3772 3652 3595 3599 3603 3572 3540 3571 3602 3588 3575 3565 3556 3493 3493 3535 3453 3339
1499C339J1J15N1p1p2j3j3qqL6k8j27lO9O9o5o5Q1Q0MLn9n9n2n3n2n3o7o7P9P8K8K8l5l5M2
$$ 3339 3350 3465 3516 3445 3373 3360 3347 3339 3331 3367 3339 3212 3209 3278 3347 3282 3217 3298 3378 3382 3385 3326 3267 3215 3162 3110 3057 2990 2923 3002 3080 3108 3136 3101 3066 3108
1494C108M1k2k1o2o1j9q1n0P5P9m5j22LJ06k0r2J2J16N3n5n5ppn5n5L8L9k7k6K5K6m8m8M6
$$ 3108 3149 3127 3106 3044 2983 2964 2883 2833 2908 2987 2942 2820 2823 2929 2909 2817 2829 2945 2998 2943 2888 2881 2874 2819 2764 2802 2841 2814 2788 2813 2839 2791 2743 2789
1490B789M6RRRRj03j04l0l1poK4K5k6k6M6M7l4l4J8J8o8o8j5j6m3m3R2R2k1k1R4R3RRk2k3
$$ 2789 2835 2844 2853 2862 2871 2768 2664 2634 2603 2596 2590 2614 2639 2613 2587 2633 2680 2646 2612 2630 2648 2580 2512 2497 2481 2438 2395 2487 2579 2558 2537 2631 2724 2733 2742 2720 2697
1486B697p7p8J00R9N1N0N1N0p6p6J7J8OONOj23j23n0n0j3j3L9L9j01j01L5L4K8K8N9N9K1K0
$$ 2697 2620 2542 2642 2741 2792 2842 2893 2943 2867 2791 2808 2826 2832 2838 2843 2849 2726 2603 2553 2503 2490 2477 2516 2555 2454 2353 2388 2422 2450 2478 2537 2596 2617 2637
1482B637n2n2q4q3J0J0l4l4L9L8rrK2K1n7n7J2J2qp0k5Q0P9J7n7n6LKJ38J38R1R0J22J23J39
$$ 2637 2585 2533 2449 2366 2376 2386 2352 2318 2357 2395 2386 2377 2399 2420 2363 2306 2318 2330 2322 2252 2227 2307 2386 2403 2346 2290 2293 2295 2433 2571 2662 2752 2874 2997 3136
1477C136J39J35J35On6k1k2q2q2q2q3j19j19j20j19q9r0j4M9M3j9j11j11q6k2L5L6n5n4M1
$$ 3136 3275 3410 3545 3551 3495 3474 3452 3370 3288 3206 3123 3004 2885 2765 2646 2557 2467 2453 2502 2545 2526 2415 2304 2218 2196 2231 2267 2212 2158 2199
1474B199J04L6k7j9j9K2K1K2K1mnL1l2r8r8m3J9L3L4L7L8m3m3RJ0l7l7J5J5J8J7Q7Q6J4m8
$$ 2199 2303 2339 2312 2293 2274 2296 2317 2339 2360 2356 2351 2382 2350 2252 2154 2111 2130 2163 2197 2234 2272 2229 2186 2195 2205 2168 2131 2146 2161 2179 2196 2283 2369 2383 2335
1469B335j3j3o4o4RJ13O7Mk0M2N0N0j5j5l0L3J71J71J13N0Pn6j54j54j01j02q7k5N0N1k1q3
$$ 2335 2322 2309 2245 2181 2190 2303 2370 2374 2354 2396 2446 2496 2481 2466 2436 2469 2640 2811 2924 2974 2981 2925 2771 2617 2516 2414 2327 2302 2352 2403 2382 2299
1465B299j8j7l9l9L0L0n5j18o8L6J6J6K3K3J7J7O8O9R4R3J60J60K66M95P40P40L19k02m81
$$ 2299 2281 2264 2225 2186 2216 2246 2191 2073 2005 2041 2057 2073 2096 2119 2136 2153 2221 2290 2384 2477 2637 2797 3063 3558 4298 5038 5357 5155 4674
1462D674m81n06n06l49k03j40j40n1N4K2q2j07kL0L0ONk1k2L7L7K8l4o1M3M1k1j8M4J7m5m1
$$ 4674 4193 3687 3181 2832 2629 2489 2349 2298 2352 2374 2292 2185 2183 2213 2243 2249 2254 2233 2211 2248 2285 2313 2279 2218 2261 2302 2281 2263 2307 2324 2279 2238
1458B238K2N2N3N6N7l8l8l7l8N2N2j0j1rrj0rJJj03j03l6l5l5l5n5n5PQM6M5n8n8m3m3K0J9
$$ 2238 2260 2312 2365 2421 2478 2440 2402 2365 2327 2379 2431 2421 2410 2401 2392 2382 2373 2374 2375 2272 2169 2133 2098 2063 2028 1973 1918 1925 1933 1979 2024 1966 1908 1865 1822 1842 1861
1453A861N8N7nnJ7J7J7J7l0l0L3R5M9n5n9LL2L2k6k7k0k0n2n1j%jjL3L2L2L3L1L1l2l1n1n1
$$ 1861 1919 1976 1971 1966 1983 2000 2017 2034 2004 1974 2007 2102 2151 2096 2037 2040 2072 2104 2078 2051 2031 2011 1959 1908 1907 1907 1906 1905 1938 1970 2002 2035 2066 2097 2065 2034 1983 1932
1449A932J2P3L7o7o7L7R1K8l5l4N2N3N3N3j5j5j6j5J10J10Q5Q5J73K77M37N82N44L57N8k13
$$ 1932 1944 2017 2054 1987 1920 1957 2048 2076 2041 2007 2059 2112 2165 2218 2203 2188 2172 2157 2267 2377 2462 2547 2720 2997 3434 4016 4560 4917 4975 4762
1445D762l86m49m58l97l43k40j43q0j11j11q9N7J17N4q9q8JJJJllmlN9N9m4m5m0m1K3K2PQ
$$ 4762 4376 3927 3469 3072 2729 2489 2346 2266 2155 2044 1955 2012 2129 2183 2094 2006 2007 2008 2009 2010 2007 2004 2000 1997 2056 2115 2071 2026 1986 1945 1968 1990 1997 2005
1441B005PQm0l9p1p0N6N5poM2M3J2J1M9M9n6n5l9l8K3K4J6J6J6J6J6J7J6J7J6J7J6J7N1N2
$$ 2005 2012 2020 1980 1941 1870 1800 1856 1911 1904 1898 1940 1983 1995 2006 2055 2104 2048 1993 1954 1916 1939 1963 1979 1995 2011 2027 2043 2060 2076 2093 2109 2126 2142 2159 2210 2262
1437B262N2N1q6q6q6q6j0j0j0j0q2q1K2K3rrrrR0R0j5j4mmnmp7p8MJ07J43L9m1m2P1P2l3l3
$$ 2262 2314 2365 2279 2193 2107 2021 2011 2001 1991 1981 1899 1818 1840 1863 1854 1845 1836 1827 1917 2007 1992 1978 1974 1970 1965 1961 1884 1806 1810 1917 2060 2099 2058 2016 2087 2159 2126 2093
1432B093l3l4K9K9m6m7m6m6K6K7K7K6J1J2r3r3K3K4l9l9k4k3k3k4J7J6J6J7K5K5K6K5L8L8
$$ 2093 2060 2026 2055 2084 2038 1991 1945 1899 1925 1952 1979 2005 2016 2028 1935 1842 1865 1889 1850 1811 1787 1764 1741 1717 1734 1750 1766 1783 1808 1833 1859 1884 1922 1960
1428A960k4k4J8J9J8J9k8k8k7k8k3k2M0M0ooo8o8L1L0L1L1K5K4K5K5k2k2q4q5OOO9O8lllk
$$ 1960 1936 1912 1930 1949 1967 1986 1958 1930 1903 1875 1852 1830 1870 1910 1904 1898 1830 1762 1793 1823 1854 1885 1910 1934 1959 1984 1962 1940 1856 1771 1777 1783 1852 1920 1917 1914 1911 1909
1423A909MNn8n8o1o2M1J03N2p4l5K8N9N9m1m2k2k2Q2Q2L1L1K4K3M4q1j09m6K9K8p2p2K0K0
$$ 1909 1913 1918 1860 1802 1741 1679 1720 1823 1875 1801 1766 1794 1853 1912 1871 1829 1807 1785 1867 1949 1980 2011 2035 2058 2102 2021 1912 1866 1895 1923 1851 1779 1799 1819
1419A819K0K0RJ0RJ0k9k9r2r1R7R7L4L5o8o8m2Q3J51K5p9q0J03J66N9o6r9l7j00j62n9O6O6
$$ 1819 1839 1859 1868 1878 1887 1897 1868 1839 1747 1656 1753 1850 1884 1919 1851 1783 1741 1824 1975 2000 1921 1841 1944 2110 2169 2103 2004 1967 1867 1705 1646 1712 1778
1415A778n9r3l0P2P3K9K8l4l3OPOPm4m4J02J02%%K2Q3P6k8o9p0l3l3r5r6K3K4K3K3rrrj0j0
$$ 1778 1719 1626 1596 1668 1741 1770 1798 1764 1731 1737 1744 1750 1757 1713 1669 1771 1873 1873 1873 1895 1978 2054 2026 1957 1887 1854 1821 1726 1630 1653 1677 1700 1723 1714 1705 1696 1686 1676
1410A676j0j1j0M4M4n9o0M5M6j7j7l3l3k6k6K3J28J27K4o1o1L6L7MMMNP7P7m8j52j21n9LL
$$ 1676 1666 1655 1645 1689 1733 1674 1614 1659 1705 1688 1671 1638 1605 1579 1553 1576 1704 1831 1855 1794 1733 1769 1806 1810 1814 1818 1823 1900 1977 1929 1777 1656 1597 1600 1603
1406A603k2k3M0L9J7J6J6J7j7j6M6M7P3P3j0j15r3l1L1L2j1j0N2N2k6k7k6k6MLMLL9L9o6o5
$$ 1603 1581 1558 1598 1637 1654 1670 1686 1703 1686 1670 1716 1763 1836 1909 1899 1784 1691 1660 1691 1723 1712 1702 1754 1806 1780 1753 1727 1701 1705 1708 1712 1715 1754 1793 1727 1662
1402A662kjjkk2k2k2k2O2O3m2m1k2k2M0M0k2k3M0M0L3L3L3L2N3N2r7r7l4P0Q4Q4m5m6r7r7
$$ 1662 1660 1659 1658 1656 1634 1612 1590 1568 1630 1693 1651 1610 1588 1566 1606 1646 1624 1601 1641 1681 1714 1747 1780 1812 1865 1917 1820 1723 1689 1759 1843 1927 1882 1836 1739 1642
1397A642J0J1m2m1K0K0j2j1n7n7J6J5R5R5M2M3k3k2k3k2jjjjJ7J7n5n6PPN9N9j1j2n7n7l0
$$ 1642 1652 1663 1621 1580 1600 1620 1608 1597 1540 1483 1499 1514 1609 1704 1746 1789 1766 1744 1721 1699 1698 1697 1696 1695 1712 1729 1674 1618 1625 1632 1691 1750 1739 1727 1670 1613 1583
1393A583P4Q2J9o1o2QPK5K5k7k7nonnm3m3RRJ00J01OPn8n8n4n4P3J35N1r5j27o6M9J12J15
$$ 1583 1657 1739 1758 1697 1635 1643 1650 1675 1700 1673 1646 1641 1635 1630 1625 1582 1539 1548 1557 1657 1758 1764 1771 1713 1655 1601 1547 1620 1755 1806 1711 1584 1518 1567 1679 1794
1388A794N3k2k3J9J9j2j2JKJKo0n9qpk4k5k4k4j3j3N9O0n4n5n5n4N3N3Ko2l7O7J53M9q8j50
$$ 1794 1847 1825 1802 1821 1840 1828 1816 1817 1819 1820 1822 1762 1703 1695 1688 1664 1639 1615 1591 1578 1565 1624 1684 1630 1575 1520 1466 1519 1572 1574 1512 1475 1542 1695 1744 1656 1506
1384A506o6L9K8K8LLM9M8m5m5J8J8R2R1j0j0o2o3o9p0K3K4J0J0o3o3J4J4J5J4J1J0Q4Q3J%
$$ 1506 1440 1479 1507 1535 1538 1541 1590 1638 1593 1548 1566 1584 1676 1767 1757 1747 1685 1622 1553 1483 1506 1530 1540 1550 1487 1424 1438 1452 1467 1481 1492 1502 1586 1669 1670 1670
1379A670n1n1J12J12O0O0MMo9o8l3l3m3j06j09oM7M6k2k2RRPOOPJ2J2J2J3j7j8L5L5j9k0k0
$$ 1670 1619 1568 1680 1792 1852 1912 1916 1920 1851 1783 1750 1717 1674 1568 1459 1453 1500 1546 1524 1502 1511 1520 1527 1533 1539 1546 1558 1570 1582 1595 1578 1560 1595 1630 1611 1591 1571
1375A571j9k2k1N2N2LKKLn3n3K0K0N7N8NNLLLKNNNMq9q9NNO5O4qqm6m6O9O8J8J8n4n5q9q8
$$ 1571 1552 1530 1509 1561 1613 1616 1618 1620 1623 1570 1517 1537 1557 1614 1672 1677 1682 1685 1688 1691 1693 1698 1703 1708 1712 1623 1534 1539 1544 1609 1673 1665 1657 1611 1565 1634 1702 1720 1738 1684 1629 1540 1452
1370A452M6M7OPL4L4l4r6q8J5J14J14M7M8j9j9j9j9jj%jQQRQJ%j03j04M7M8M7M7K0K1Q2Q3
$$ 1452 1498 1545 1551 1558 1592 1626 1592 1496 1408 1423 1537 1651 1698 1746 1727 1708 1689 1670 1669 1668 1668 1667 1675 1683 1692 1700 1701 1701 1598 1494 1541 1589 1636 1683 1703 1724 1806 1889
1365A889L5L6L6L6l9l8K4K3J%J%L5L6R7R8M0M0M1M0NNO8O7J1J0n2n2J4J4J5J4J5J4J5J4k7
$$ 1889 1924 1960 1996 2032 1993 1955 1979 2002 2003 2003 2004 2004 2039 2075 2172 2270 2310 2350 2391 2431 2436 2441 2509 2576 2587 2597 2545 2493 2507 2521 2536 2550 2565 2579 2594 2608 2581
1360B581k7RP0J18K42L22L21M06M06M69M68M66M66M74L48K18K17L27M51M61M61M64M65M75
$$ 2581 2554 2563 2633 2751 2993 3315 3636 4042 4448 4917 5385 5851 6317 6791 7139 7357 7574 7901 8352 8813 9274 9738 10203 10678
1357A0678M13K81J57p8k02l27l28l78l78l15l16k24k25k87k87m31m32l70l69m49m48m45m45
$$ 10678 11091 11372 11529 11451 11249 10922 10594 10216 9838 9523 9207 8983 8758 8471 8184 7753 7321 6951 6582 6133 5685 5240 4795
1355D795m35l72k06q2n0m9m2m2r7r7n5O9K09L33L75L75L58L58M19M82M82L57K44J83K13L38
$$ 4795 4360 3988 3782 3700 3650 3601 3559 3517 3420 3323 3268 3337 3546 3879 4254 4629 4987 5345 5764 6246 6728 7085 7329 7512 7725 8063
1351H063M52M51L32L31L94N19M81K72nk14k66k66k71l96m96m96m28l03k40k40l35l36m60m60
$$ 8063 8515 8966 9298 9629 10023 10542 11023 11295 11290 11076 10810 10544 10273 9877 9381 8885 8457 8154 7914 7674 7339 7003 6543 6083
1348F083m60m60l98l98l90l89l32k06r0q9j40j41j40j40m7m7m7m7ppopo9o9ooQQn5n4m2m1
$$ 6083 5623 5163 4765 4367 3977 3588 3256 3050 2960 2871 2731 2590 2450 2310 2263 2216 2169 2122 2115 2108 2102 2095 2026 1957 1951 1945 1953 1961 1906 1852 1810 1769
1345A769O2O3j6j6j5j6M8M8M8M8q6q6k4k4K3K2K3K2K9K9l3l4l9l9K3K3M7M8M8M8%%o2o2jj
$$ 1769 1831 1894 1878 1862 1847 1831 1879 1927 1975 2023 1937 1851 1827 1803 1826 1848 1871 1893 1922 1951 1918 1884 1845 1806 1829 1852 1899 1947 1995 2043 2043 2043 1981 1919 1918 1917
1340A917O2O1p9p8j6j7PQn6n5k4k4L9L8ooN7N7M7M8n6n6j4j3j4j3N1N1j2j1j5j5j5j5MLk8
$$ 1917 1979 2040 1961 1883 1867 1850 1857 1865 1809 1754 1730 1706 1745 1783 1777 1771 1828 1885 1932 1980 1924 1868 1854 1841 1827 1814 1865 1916 1904 1893 1878 1863 1848 1833 1837 1840 1812
1336A812k8O5O5l9l9l4l5K9K8J2J2k0j9M9M9N0M9r1r0k8k8l2l1L1L1J8J8m4m4m3m2N8N8j9
$$ 1812 1784 1849 1914 1875 1836 1802 1767 1796 1824 1836 1848 1828 1809 1858 1907 1957 2006 1915 1825 1797 1769 1737 1706 1737 1768 1786 1804 1760 1716 1673 1631 1689 1747 1728
1331A728q3l2J14J58N3k5k5l0l0l0l0N3N3n1n0n0n0J3J3M5M4r5r5p7K6J07J06N8m6n0n0J8
$$ 1728 1645 1613 1727 1885 1938 1913 1888 1858 1828 1798 1768 1821 1874 1823 1773 1723 1673 1686 1699 1744 1788 1693 1598 1521 1547 1654 1760 1818 1772 1722 1672 1690
1328A690J7J8J8N6N6oon3n3n3n3N8N7m6m6p9p9K5K5O1O0jkL0L1L1L0m1m2K0K1J0J0r4r4L0
$$ 1690 1707 1725 1743 1799 1855 1849 1843 1790 1737 1684 1631 1689 1746 1700 1654 1575 1496 1521 1546 1607 1667 1666 1664 1694 1725 1756 1786 1745 1703 1723 1744 1754 1764 1670 1576 1606
1323A606L0L0L0M9M9j3j3m4m5J8J8j8j7j7j8qqN5N4K4K4qpJ1J2J1J1K7K6l6l6J4J4J3J4J9
$$ 1606 1636 1666 1696 1745 1794 1781 1768 1724 1679 1697 1715 1697 1680 1663 1645 1637 1629 1684 1738 1762 1786 1778 1771 1782 1794 1805 1816 1843 1869 1833 1797 1811 1825 1838 1852 1871
1319A871K0m3m3j9j9n1n0J4J3M6M5K6K5nnn5n5QQj9j8j9j9J4J4J4J4L9L9M0L9QQr6r6L5L5
$$ 1871 1891 1848 1805 1786 1767 1716 1666 1680 1693 1739 1784 1810 1835 1830 1825 1770 1715 1723 1731 1712 1694 1675 1656 1670 1684 1698 1712 1751 1790 1830 1869 1877 1885 1789 1693 1728 1763
1314A763J4m9oR7J01L9%jl6l5q7q7k5k4K5K5opm9m9N5N5J1J1L5L6L2p2j07m4R3J56L8o7o8
$$ 1763 1777 1728 1722 1819 1920 1959 1959 1958 1922 1887 1800 1713 1688 1664 1689 1714 1708 1701 1652 1603 1658 1713 1724 1735 1770 1806 1838 1766 1659 1615 1708 1864 1902 1835 1767
1310A767o8j2j1j9j8j9j8M6M6J5J4POO9O8q2q2q2q2k5k4n2n2R5J56P7k8k9k9l5l5k7k7MNk5
$$ 1767 1699 1687 1676 1657 1639 1620 1602 1648 1694 1709 1723 1730 1736 1805 1873 1791 1709 1627 1545 1520 1496 1444 1392 1487 1643 1720 1692 1663 1634 1599 1564 1537 1510 1514 1519 1494
1306A494k4L8L9M4M4o0o0m2m3K1K0L2L2l0l1RQQQN8N8nnM2M2M2M2r8r9l6l6llklpoppMMMN
$$ 1494 1470 1508 1547 1591 1635 1575 1515 1473 1430 1451 1471 1503 1535 1505 1474 1483 1491 1499 1507 1565 1623 1618 1613 1655 1697 1739 1781 1683 1584 1548 1512 1509 1506 1504 1501 1494 1488 1481 1474 1478 1482 1486 1491
1300A491l2l1L2L1JKlkj5p6l8O6J40J39J%l6l6l6l6m6m7m6m7J4J3P6P6J6J7q8q8L3L3k9k9
$$ 1491 1459 1428 1460 1491 1492 1494 1491 1489 1474 1398 1360 1426 1566 1705 1706 1706 1670 1634 1598 1562 1516 1469 1423 1376 1390 1403 1479 1555 1571 1588 1500 1412 1445 1478 1449 1420
1296A420KKKKN8N8N8N8J7J7J6J7K6K7K6K6jjo4o3L4L4k8k8j7j7M6M6j6j5M7M7n6n5n5n6kk
$$ 1420 1422 1424 1426 1428 1486 1544 1602 1660 1677 1694 1710 1727 1753 1780 1806 1832 1831 1830 1766 1703 1737 1771 1743 1715 1698 1681 1727 1773 1757 1742 1789 1836 1780 1725 1670 1614 1612 1610
1291A610kkqqqrn7n7MNJ31J30K6K6m9n0m9m9j7j8j7j7j1j2Q5Q6M6n9j04j04O1O1O1O1j0j0
$$ 1610 1608 1606 1598 1590 1582 1573 1516 1459 1463 1468 1599 1729 1755 1781 1732 1682 1633 1584 1567 1549 1532 1515 1504 1492 1577 1663 1709 1650 1546 1442 1503 1564 1625 1686 1676 1666
1287A666j0j0LLLLj8j8j7j8K3K2K3K2p9p9K4K5K5K5K4K5n7n6NOjjN8N7n9j22q2K1L9L8M5M5
$$ 1666 1656 1646 1649 1652 1655 1658 1640 1622 1605 1587 1610 1632 1655 1677 1598 1519 1543 1568 1593 1618 1642 1667 1610 1554 1559 1565 1564 1563 1621 1678 1619 1497 1415 1436 1475 1513 1558 1603
1282A603P2P2l2l2k8k9k8k8j5j5j4j5j3j4j3j3O7O8l6l6J5J4J5J4mnnmj6j7j6j6K7K8l5l5
$$ 1603 1675 1747 1715 1683 1655 1626 1598 1570 1555 1540 1526 1511 1498 1484 1471 1458 1525 1593 1557 1521 1536 1550 1565 1579 1575 1570 1565 1561 1545 1528 1512 1496 1523 1551 1516 1481
1278A481l4l3P0P1J22J21k4k4o8o8L5L6N1N2r5r4K5K5l7l7L2L3l0l0opopj8j8j4j4J5P8M5
$$ 1481 1447 1414 1484 1555 1677 1798 1774 1750 1682 1614 1649 1685 1736 1788 1693 1599 1624 1649 1612 1575 1607 1640 1610 1580 1574 1567 1561 1554 1536 1518 1504 1490 1505 1583 1628
1274A628n9o6L8O3m1q1q0K7K7j4j4N8N8P7P7MLn2n3jjl7l7J5J4opM6M5k2k1k2k1m1m0J1J2
$$ 1628 1569 1503 1541 1604 1563 1482 1402 1429 1456 1442 1428 1486 1544 1621 1698 1702 1705 1653 1600 1599 1598 1561 1524 1539 1553 1547 1540 1586 1631 1609 1588 1566 1545 1504 1464 1475 1487
1269A487QRo5o4l0k9K3K2P6P6M5M5m4m4L0K9MNMNj0rrrj2j2m3m3j7j7L4L5JJQ8Q8N3n1j01
$$ 1487 1495 1504 1439 1375 1345 1316 1339 1361 1437 1513 1558 1603 1559 1515 1545 1574 1578 1583 1587 1592 1582 1573 1564 1555 1543 1531 1488 1445 1428 1411 1445 1480 1481 1482 1570 1658 1711 1660 1559
1264A559l9M4M4nnj24j24n2N3R0K8mlK4K3pqQ3Q2j1p4o7L7Q2K0o3o2OOK9K9K9K9l7l7l6l7
$$ 1559 1520 1564 1608 1603 1598 1474 1350 1298 1351 1441 1469 1465 1462 1486 1509 1502 1494 1577 1659 1648 1574 1507 1544 1626 1646 1583 1521 1527 1533 1562 1591 1620 1649 1612 1575 1539 1502
1260A502L7L6L7L6k8k8k9k8qqqqL0L0m3m3K8K9k4k4j6j7J5J5kjkjQQQRL5L5L4L5qqo0o0n4
$$ 1502 1539 1575 1612 1648 1620 1592 1563 1535 1527 1519 1511 1503 1533 1563 1520 1477 1505 1534 1510 1486 1470 1453 1468 1483 1481 1480 1478 1477 1485 1493 1501 1510 1545 1580 1614 1649 1641 1633 1573 1513 1459
1255A459n4jkk5k5K8K7L2L1L1L1k5k5K6K7k2k2n3n3L1L0k2k2k3k4N0M9M9M9klMLm8m8QRQQ
$$ 1459 1405 1404 1402 1377 1352 1380 1407 1439 1470 1501 1532 1507 1482 1508 1535 1513 1491 1438 1385 1416 1446 1424 1402 1379 1355 1405 1454 1503 1552 1550 1547 1551 1554 1506 1458 1466 1475 1483 1491
1250A491K0J9l2l2j9j9N4N5n4n3k3k2O6O6opj03j02j0rR3R4R3R3QRo4o4n8n9k8k7J8J9J8J9
$$ 1491 1511 1530 1498 1466 1447 1428 1482 1537 1483 1430 1407 1385 1451 1517 1511 1504 1401 1299 1289 1280 1373 1467 1560 1653 1661 1670 1606 1542 1484 1425 1397 1370 1388 1407 1425 1444
1246A444L3L4L3L4LLLLj25j26J0J0QQM0L9LMMLn2n2k1k0J02J03L0L0o8o8noQ7Q6K4K4m7m7
$$ 1444 1477 1511 1544 1578 1581 1584 1587 1590 1465 1339 1349 1359 1367 1375 1415 1454 1457 1461 1465 1468 1416 1364 1343 1323 1425 1528 1558 1588 1520 1452 1447 1441 1528 1614 1638 1662 1615 1568
1241A568m7m6l2l1L2L1j4j4j4j4L2L3L3L2n3n3RJ0RRP2P2L5L5L5L5j03j03M3M3rrrqrrqrk9
$$ 1568 1521 1475 1443 1412 1444 1475 1461 1447 1433 1419 1451 1484 1517 1549 1496 1443 1452 1462 1471 1480 1552 1624 1659 1694 1729 1764 1661 1558 1601 1644 1635 1626 1617 1609 1600 1591 1583 1574 1545
1236A545k9L4L4kjnoK9l4o4M1J18J4j07j08j4j4j4j4l8l7K5K5N2N1N2N2OOOPKLKLk1k1k0k1
$$ 1545 1516 1550 1584 1582 1581 1576 1570 1599 1565 1501 1542 1660 1674 1567 1459 1445 1431 1417 1403 1365 1328 1353 1378 1430 1481 1533 1585 1591 1597 1603 1610 1612 1615 1617 1620 1599 1578 1558 1537
1231A537m5m5m5m5M4M3j8j9k0j9M4M3L8L8L8L8J%JJo7o7nnJ0J0n2n3l4l5K8R1Qr5r1J2Q3Q3
$$ 1537 1492 1447 1402 1357 1401 1444 1426 1407 1387 1368 1412 1455 1493 1531 1569 1607 1608 1608 1609 1610 1543 1476 1471 1466 1476 1486 1434 1381 1347 1312 1340 1431 1439 1344 1253 1265 1348 1431
1227A431j5j5L2L1L1L1N6N6poQQn4n4r0q9J5J5K7K8K8K7L0L1l2l3qqqqj7j7M5M5M8M9j5j4
$$ 1431 1416 1401 1433 1464 1495 1526 1582 1638 1631 1625 1633 1641 1587 1533 1443 1354 1369 1384 1411 1439 1467 1494 1524 1555 1523 1490 1482 1474 1466 1458 1441 1424 1469 1514 1562 1611 1596 1582
1222A582j4j4j4j4n1n0n1n1O0O0kkmllmJ2J3P4P5j8j8j9j8k1k1M2M1j3j3j3j3J3J3m9n0j5
$$ 1582 1568 1554 1540 1526 1475 1425 1374 1323 1383 1443 1441 1439 1435 1432 1429 1425 1437 1450 1524 1599 1581 1563 1544 1526 1505 1484 1526 1567 1554 1541 1528 1515 1528 1541 1492 1442 1427
1218A427j5j5j5J5J5J5J5L0L0L0L0j6j5j6j5m3m4K0J9nmmmq4q3O1J24R6k9j00j00K7K7K7K6
$$ 1427 1412 1397 1382 1397 1412 1427 1442 1472 1502 1532 1562 1546 1531 1515 1500 1457 1413 1433 1452 1447 1443 1439 1435 1351 1268 1329 1453 1549 1520 1420 1320 1347 1374 1401 1427
1213A427K6K6K5K6J0J0J0J0poppN9N8m4j06m1Q5M6j7o1o1o5o5M1M2M2M1J1J2J1J1kkkkJJ%
$$ 1427 1453 1479 1504 1530 1540 1550 1560 1570 1563 1557 1550 1543 1602 1660 1616 1510 1469 1554 1600 1583 1522 1461 1396 1331 1372 1414 1456 1497 1508 1520 1531 1542 1540 1538 1536 1534 1535 1536 1536
1208A536JL3L4L3L3j7j8M5M5LKKKp1p1p1p1P9P8mj09j17n4N0M9O8O8O8O8r7r6j4R0P3J0n3
$$ 1536 1537 1570 1604 1637 1670 1653 1635 1680 1725 1728 1730 1732 1734 1663 1592 1521 1450 1529 1607 1603 1494 1377 1323 1373 1422 1490 1558 1626 1694 1597 1501 1487 1577 1650 1660 1607
1204A607n3J0RJ0J0jjnnl8j01o2M2N6N7m2m1o4o5kkO0O0kkL7L6R5R6q0j41j03KN6N7%%j6j7
$$ 1607 1554 1564 1573 1583 1593 1592 1591 1586 1581 1543 1442 1380 1422 1478 1535 1493 1452 1388 1323 1321 1319 1379 1439 1437 1435 1472 1508 1603 1699 1619 1478 1375 1377 1433 1490 1490 1490 1474 1457
1199A457j6j7j2j2N0N0J5J5J5J5MNMNl5l4l5l4nmmmK4K5K4K5j4j4j3j4KKO5O4L1L1l2l2%j
$$ 1457 1441 1424 1412 1400 1450 1500 1515 1530 1545 1560 1564 1569 1573 1578 1543 1509 1474 1440 1435 1431 1427 1423 1447 1472 1496 1521 1507 1493 1480 1466 1468 1470 1535 1599 1630 1661 1629 1597 1597 1596
1194A596o3o2J4J4m9m8JJJJj%j%q3q2O3O4%%%%N8N9N8N9n7n7n7n7M8M9j4j4J6J6J6J7K0K0
$$ 1596 1533 1471 1485 1499 1450 1402 1403 1404 1405 1406 1405 1405 1404 1404 1321 1239 1302 1366 1366 1366 1366 1366 1424 1483 1541 1600 1543 1486 1429 1372 1420 1469 1455 1441 1457 1473 1489 1506 1526 1546
1190A546K0K0l9m0l9l9J9J9m3m4j0j1j1j1k4k3Q0Q0nnnnK8K9l4l4J7J6J7J7p0o9L5L5K1K0
$$ 1546 1566 1586 1547 1507 1468 1429 1448 1467 1424 1380 1370 1359 1348 1337 1313 1290 1370 1450 1445 1440 1435 1430 1458 1487 1453 1419 1436 1452 1469 1486 1416 1347 1382 1417 1438 1458
1185A458K1K1QQn5n5k8k8k8k9P0O9PPK3K2l9m0M0M0M0M0O5O6l8l8k4k4k4k4KKJKMNn5n4oN6
$$ 1458 1479 1500 1508 1516 1461 1406 1378 1350 1322 1293 1363 1432 1439 1446 1469 1491 1452 1412 1452 1492 1532 1572 1637 1703 1665 1627 1603 1579 1555 1531 1533 1535 1536 1538 1542 1547 1492 1438 1432 1488
1180A488L7q8q0M4J06M3m1m1N8N9o3o4M1M0J8J7m5m5m3m2m3m2J3J3J2J3J3J3J2J3N1N1N0N1
$$ 1488 1525 1437 1357 1401 1507 1550 1509 1468 1526 1585 1522 1458 1499 1539 1557 1574 1529 1484 1441 1399 1356 1314 1327 1340 1352 1365 1378 1391 1403 1416 1467 1518 1568 1619
1176A619p6p5j3j3J4J5J4J5%%%%K4K4K4K4o1o0JKK2K3K2K2K0K0q5q4M9M9M9M9k7k6j24j24
$$ 1619 1543 1468 1455 1442 1456 1471 1485 1500 1500 1500 1500 1500 1524 1548 1572 1596 1535 1475 1476 1478 1500 1523 1545 1567 1587 1607 1522 1438 1487 1536 1585 1634 1607 1581 1457 1333
1172A333k4Q0O0jn5PL1L0j6j7j6j6j0j0N2N3l5l5K7K8J9K0J9K0llmlk1k2k1k1LLLML7L7L7
$$ 1333 1309 1389 1449 1448 1393 1400 1431 1461 1445 1428 1412 1396 1386 1376 1428 1481 1446 1411 1438 1466 1485 1505 1524 1544 1541 1538 1534 1531 1510 1488 1467 1446 1449 1452 1455 1459 1496 1533 1570
1167A570L7m2m1m1m2L2L1l1l1q7q7pR7R4j1m9n0L3L4L3L3N0N0M7M6n2j15j14n2J5J6J9K0l
$$ 1570 1607 1565 1524 1483 1441 1473 1504 1473 1442 1355 1268 1261 1358 1452 1441 1392 1342 1375 1409 1442 1475 1525 1575 1622 1668 1616 1501 1387 1335 1350 1366 1385 1405 1402
1163A402kllrrM9N0rp0p1qL4L3L7L8P8P7J5J6o6o5m2K0N7ok9k9N6N7m8m7NNNNonnoL3L2l0
$$ 1402 1400 1397 1394 1385 1376 1425 1475 1466 1396 1325 1317 1351 1384 1421 1459 1537 1614 1629 1645 1579 1514 1472 1492 1549 1543 1514 1485 1541 1598 1550 1503 1508 1513 1518 1523 1517 1512 1507 1501 1534 1566 1536
1158A536l0m9n0m5m6mN8K2K3N1N0K6l5k4L8L4k8o9p0L0L1j3j4j3j4JJJJkjjkk9k8L6R9Q8K6
$$ 1536 1506 1457 1407 1362 1316 1312 1370 1392 1415 1466 1516 1542 1507 1483 1521 1555 1527 1458 1388 1418 1449 1436 1422 1409 1395 1396 1397 1398 1399 1397 1396 1395 1393 1364 1336 1372 1471 1559 1585
1153A585l9l9LMMMnmmnllo5o6K7K7K7K7o3o3n9n9K2Q4M9M9J8J8m5m5OOOOrrj0rm8m8K8R0L8
$$ 1585 1546 1507 1510 1514 1518 1522 1517 1513 1509 1504 1501 1498 1433 1367 1394 1421 1448 1475 1412 1349 1290 1231 1253 1337 1386 1435 1453 1471 1426 1381 1387 1393 1399 1405 1396 1387 1377 1368 1320 1272 1300 1390 1428
1148A428k4p2j0M5M6J7J8PPm6m5J3J2J2J3L6L7J9m3o0o1l3l4L2L2%JllN0M9j9j9j9j9M0M0
$$ 1428 1404 1332 1322 1367 1413 1430 1448 1455 1462 1416 1371 1384 1396 1408 1421 1457 1494 1513 1470 1410 1349 1316 1282 1314 1346 1346 1347 1344 1341 1391 1440 1421 1402 1383 1364 1404 1444
1143A444P1P1N3N4m0m0l0k9p7p8m7J6j6j5j3N0O7O7m4m4l2L2J00L9n8j20p4L1O1O2M4M4k5
$$ 1444 1515 1586 1639 1693 1653 1613 1583 1554 1477 1399 1352 1368 1352 1337 1324 1374 1441 1508 1464 1420 1388 1420 1520 1559 1501 1381 1307 1338 1399 1461 1505 1549 1524
1139A524k6NO6O7Mn8n8j0rm3m3m3m3L4L4L4L4j8j7j8j7l4l3J8J8j5j6m6J6P0J33Q7j6n9n9
$$ 1524 1498 1503 1569 1636 1640 1582 1524 1514 1505 1462 1419 1376 1333 1367 1401 1435 1469 1451 1434 1416 1399 1365 1332 1350 1368 1353 1337 1291 1307 1377 1510 1597 1581 1522 1463
1135A463M5M5N3j0o8o9mnmnm0l9l6l6L2R4O3Jn4n4noL8L9L8L9m4m4m4m4K8K8k5k4j0rM2M2
$$ 1463 1508 1553 1606 1596 1528 1459 1455 1450 1446 1441 1401 1362 1326 1290 1322 1416 1479 1480 1426 1372 1367 1361 1399 1438 1476 1515 1471 1427 1383 1339 1367 1395 1370 1346 1336 1327 1369 1411
1130A411j1j1K0K0QRQ2Q1l8l8J4J4J0J1k1k1j8j8j8j8KKKLj6j6J5J5k0k1L2L2M5M5k7k8j5
$$ 1411 1400 1389 1409 1429 1437 1446 1528 1609 1571 1533 1547 1561 1571 1582 1561 1540 1522 1504 1486 1468 1470 1472 1474 1477 1461 1445 1460 1475 1455 1434 1466 1498 1543 1588 1561 1533 1518
1126A518j4j5j4j0rrj0n1n1M2M3L6L7l7l6K8K7lmPOm5m5M5M5ppJ9J8P1P0RQRQo0n9J3J2oo
$$ 1518 1504 1489 1475 1465 1456 1447 1437 1386 1335 1377 1420 1456 1493 1456 1420 1448 1475 1472 1468 1475 1481 1436 1391 1436 1481 1474 1467 1486 1504 1575 1645 1654 1662 1671 1679 1619 1560 1573 1585 1579 1573
1121A573l8l7l5l5J7J7L5L6j6j6O6O6L4L5n9n9opnmnnl6l6L7L7m0m0rqj5j5j4j5J5J4J5J5
$$ 1573 1535 1498 1463 1428 1445 1462 1497 1533 1517 1501 1567 1633 1667 1702 1643 1584 1578 1571 1566 1562 1557 1552 1516 1480 1517 1554 1514 1474 1465 1457 1442 1427 1413 1398 1413 1427 1442 1457
1116A457j7j6M6M6J5J5J1J1jo4o3kO6O5M1k0n3n4k9L2O2O1%o2p1rJ5J4k7k7k7k7o6o6M0J03
$$ 1457 1440 1424 1470 1516 1531 1546 1557 1568 1567 1503 1440 1438 1504 1569 1610 1590 1537 1483 1454 1486 1548 1609 1609 1547 1476 1467 1482 1496 1469 1442 1415 1388 1322 1256 1296 1399
1112A399P5J3M8M9K7l5%%P5P5M8j4q1q1k2k3o3o2m0K3P4J1j2j2OOOOM9M8j4j3qppqK5K4K0
$$ 1399 1474 1487 1535 1584 1611 1576 1576 1576 1651 1726 1774 1760 1679 1598 1576 1553 1490 1428 1388 1411 1485 1496 1484 1472 1478 1484 1490 1496 1545 1593 1579 1566 1558 1551 1544 1536 1561 1585 1605
1107A605K0j1p3l8l9o4o5o4L9J01L8k5k4P3P3M6j7k2k2k6k5p6p6pN5O8O7QRkjonL0l3kjM3
$$ 1605 1625 1614 1541 1503 1464 1400 1335 1271 1310 1411 1449 1424 1400 1473 1546 1592 1575 1553 1531 1505 1480 1404 1328 1321 1376 1444 1511 1519 1528 1526 1525 1519 1514 1544 1511 1509 1508 1551
1102A551j9j23j23k7P7N4r%%lmL2L3l0r2oR8R9oq8k5P9P8mnnno6o6mlJJO4O4q9q8N7N7%%j
$$ 1551 1532 1409 1286 1259 1336 1390 1381 1381 1381 1378 1374 1406 1439 1409 1317 1311 1409 1508 1502 1414 1389 1468 1546 1542 1537 1532 1527 1461 1395 1391 1388 1389 1390 1454 1518 1429 1341 1398 1455 1455 1455 1454
1097A454%n5n5QPL3L3qN4P2l2j09m6P9P9k1k1p7p7K7K7%%%jl6l7K6K5L0L0L0L0nmmmj9k0P8
$$ 1454 1454 1399 1344 1352 1359 1392 1425 1417 1471 1543 1511 1402 1356 1435 1514 1493 1472 1395 1318 1345 1372 1372 1372 1372 1371 1335 1298 1324 1349 1379 1409 1439 1469 1464 1460 1456 1452 1433 1413 1491
1092A491P8K8p5n6OO5Lk1k0k0j9k0j9p1p2rrN8N7N8N7klkkj2j1j2j1r1r0N5N5llmlJ7J8J7
$$ 1491 1569 1597 1522 1466 1472 1537 1540 1519 1499 1479 1460 1440 1421 1350 1278 1269 1260 1318 1375 1433 1490 1488 1485 1483 1481 1469 1458 1446 1435 1344 1254 1309 1364 1361 1358 1354 1351 1368 1386 1403
1087A403J7J0RLLLj02j06jQ6K4l9l9M0M0J06J06R4j0o4jN5pr9j00L7J00K9p4m4m4KJK9K9m4
$$ 1403 1420 1430 1439 1442 1445 1448 1346 1240 1239 1325 1349 1310 1271 1311 1351 1457 1563 1657 1647 1583 1582 1637 1630 1531 1431 1468 1568 1597 1523 1479 1435 1437 1438 1467 1496 1452
1083A452m4J5J5j7j6k3k3K8K9L8L8j4j4p6p7lmL3L3l9m0N9N8N9N9j4j4m5m5J3J3j8q1l9O6
$$ 1452 1408 1423 1438 1421 1405 1382 1359 1387 1416 1454 1492 1478 1464 1388 1311 1308 1304 1337 1370 1331 1291 1350 1408 1467 1526 1512 1498 1453 1408 1421 1434 1416 1335 1296 1362
1079A362R1K8l5l4l9l8KJKJJ8J8J7J8l3l2J9J9MLLLJ7J7J7J7j7j6j7j7L6L5L6L5qrrqn5n6
$$ 1362 1453 1481 1446 1412 1373 1335 1337 1338 1340 1341 1359 1377 1394 1412 1379 1347 1366 1385 1389 1392 1395 1398 1415 1432 1449 1466 1449 1433 1416 1399 1435 1470 1506 1541 1533 1524 1515 1507 1452 1396
1074A396n5n5L5L6L6L6mmmmL5L5L5L5j00j00j00j01klK8K9PON5N5Lo0MJ09P9k5q8k6J7J6j9
$$ 1396 1341 1286 1321 1357 1393 1429 1425 1421 1417 1413 1448 1483 1518 1553 1453 1353 1253 1152 1150 1147 1175 1204 1211 1217 1272 1327 1330 1270 1274 1383 1462 1437 1349 1323 1340 1356 1337
1069A337M4O2jp6p6M9M9M9M9O4O4l0l0K4K4o6o5m4J8m4m5k7L5L2L1l0k9L9M0P1Rp1p0l8l9
$$ 1337 1381 1443 1442 1366 1290 1339 1388 1437 1486 1550 1614 1584 1554 1578 1602 1536 1471 1427 1445 1401 1356 1329 1364 1396 1427 1397 1368 1407 1447 1518 1527 1456 1386 1348 1309
1065A309l4l4n5QM6M5J01J01K5l7o3kL3L2MMMMK5K6n0j13j05m2J2J2lmM9M8P2P3J7m4n8MN6
$$ 1309 1275 1241 1186 1194 1240 1285 1386 1487 1512 1475 1412 1410 1443 1475 1479 1483 1487 1491 1516 1542 1492 1379 1274 1232 1244 1256 1253 1249 1298 1346 1418 1491 1508 1464 1406 1410 1466
1060A466N5n1j13j05kL1L2j5j4O3O3M7j6l3l3onM6M6m3m4OO8K6p9j35l1L9L9K5K5K4K5J3J2
$$ 1466 1521 1470 1357 1252 1250 1281 1313 1298 1284 1347 1410 1457 1441 1408 1375 1369 1364 1410 1456 1413 1369 1375 1443 1469 1390 1255 1224 1263 1302 1327 1352 1376 1401 1414 1426
1056A426J3J2POL7L7m4m5LMj4p5p2p2L1L1k1k0p2p1K2K2J0J0O2O2M9M9J7J8N2N3o3o2o0o0
$$ 1426 1439 1451 1458 1464 1501 1538 1494 1449 1452 1456 1442 1367 1295 1223 1254 1285 1264 1244 1172 1101 1123 1145 1155 1165 1227 1289 1338 1387 1404 1422 1474 1527 1464 1402 1342 1282
1052A282L3L3POPOM4M4l0k9L2L1Q4Q3l1l1K1K1n6n5mml0l0K2K2l2l1O2O2O4O5J2J3j7j6j10
$$ 1282 1315 1348 1355 1361 1368 1374 1418 1462 1432 1403 1435 1466 1550 1633 1602 1571 1592 1613 1557 1502 1498 1494 1464 1434 1456 1478 1446 1415 1477 1539 1603 1668 1680 1693 1676 1660 1550
1047A550j10J5J5J4J5K6K5K6K6m5m5m4m5j3j2j3j2KKn1n0J2J2j9k0O0O0O0O0KKKKk7k7k7k7
$$ 1550 1440 1455 1470 1484 1499 1525 1550 1576 1602 1557 1512 1468 1423 1410 1398 1385 1373 1375 1377 1326 1276 1288 1300 1281 1261 1321 1381 1441 1501 1503 1505 1507 1509 1482 1455 1428 1401
1043A401lmmmQ4Q5rrqpK4K3O9O9J6J7L8L9L9L8n7n7nnrro1o1k4k4k4k5m3m3K9L0rrn7n8J6
$$ 1401 1398 1394 1390 1386 1470 1555 1546 1537 1529 1522 1546 1569 1638 1707 1723 1740 1778 1817 1856 1894 1837 1780 1775 1770 1761 1752 1691 1630 1606 1582 1558 1533 1490 1447 1476 1506 1497 1488 1431 1373 1389
1038A389P9J05M4l9j01p4j1N1N1j8j8j6j7L2L1J6m8q0q1M0J03N5pk2M1M1k1l6K8P5J3m5m5
$$ 1389 1468 1573 1617 1578 1477 1403 1392 1443 1494 1476 1458 1442 1425 1457 1488 1504 1456 1376 1295 1335 1438 1493 1486 1464 1505 1546 1525 1489 1517 1592 1605 1560 1515
1034A515M5M4k2k3oN6R0Q9L5k7q5q4q5q5j9M4M3j9k4k4k8k9j1j2K7l6j04m2L4L4LLN5N5K0
$$ 1515 1560 1604 1582 1559 1553 1609 1699 1788 1823 1796 1711 1627 1542 1457 1438 1482 1525 1506 1482 1458 1430 1401 1390 1378 1405 1369 1265 1223 1257 1291 1294 1297 1352 1407 1427
1029A427K0K0K0J7J7J7J7k2k1k2k2K8K9K4K5l0r2o2Kl6l6JO5J00L8l7l7l4l3r6l3O2J24L9
$$ 1427 1447 1467 1487 1504 1521 1538 1555 1533 1512 1490 1468 1496 1525 1549 1574 1544 1452 1390 1392 1356 1320 1321 1386 1486 1524 1487 1450 1416 1383 1287 1254 1316 1440 1479
1025A479k4%O2N8mr6r6m1K1L9L9m4m5k4Q0J30O6p2p3p6p7kkjkM5M5M5M5j2j2p5p5n1n2R4R4
$$ 1479 1455 1455 1517 1575 1571 1475 1379 1338 1359 1398 1437 1393 1348 1324 1404 1534 1600 1528 1455 1379 1302 1300 1298 1297 1295 1340 1385 1430 1475 1463 1451 1376 1301 1250 1198 1292 1386
1021A386O5O6KLl6l5K6K7j3j2j3j3lmmml3l3K9L0K5K5oommmmk3k3M0L9k0k0k1k0N7N7m8m7
$$ 1386 1451 1517 1519 1522 1486 1451 1477 1504 1491 1479 1466 1453 1450 1446 1442 1438 1405 1372 1401 1431 1456 1481 1475 1469 1465 1461 1457 1453 1430 1407 1447 1486 1466 1446 1425 1405 1462 1519 1471 1424
1016A424p1p1L4L3lkllJ5J6m7m7ONOOm0l9K3K2N0M9n5n5rrN3N3j5j6j5j6N9N8m5m6m8m8J4
$$ 1424 1353 1282 1316 1349 1346 1344 1341 1338 1353 1369 1322 1275 1281 1286 1292 1298 1258 1219 1242 1264 1314 1363 1308 1253 1244 1235 1288 1341 1326 1310 1295 1279 1338 1396 1351 1305 1257 1209 1223
1011A223J4p2p2L3L2Q0P9J7J7j0j0K1K1pol8l8K8K7K7K8NNn8n7K0K1K0K1m1m2K1K1J1J1J1
$$ 1223 1237 1165 1093 1126 1158 1238 1317 1334 1351 1341 1331 1352 1373 1366 1360 1322 1284 1312 1339 1366 1394 1399 1404 1346 1289 1309 1330 1350 1371 1330 1288 1309 1330 1341 1352 1363
1007A363J0L3L2l0l0K4K3K4K3JKJJk0k1M2M1j5j6j5j6j6j6m8m7M0M1k2k2M9M9J0r4j21j8O4
$$ 1363 1373 1406 1438 1408 1378 1402 1425 1449 1472 1473 1475 1476 1477 1457 1436 1478 1519 1504 1488 1473 1457 1441 1425 1377 1330 1370 1411 1389 1367 1416 1465 1475 1381 1260 1242 1306
1002A306O3LLL4L4qqpqPQPPnonopqpqk7k7n9n8O4O5KKMMPQpN5P9k6m5m5k1k1k0k0M3M2m9n0
$$ 1306 1369 1372 1375 1409 1443 1435 1427 1420 1412 1419 1427 1434 1441 1436 1430 1425 1419 1412 1404 1397 1389 1362 1335 1276 1218 1282 1347 1349 1351 1355 1359 1366 1374 1367 1422 1501 1475 1430 1385 1364 1343 1323 1303 1346 1388 1339 1289
996A289R6R6J3J3m9n0j03j03M3M3N1N1j2j2m1m2K1K1J1J2J2J2n1n0N3N4M7M7j6j5m8m8J5J4
$$ 1289 1385 1481 1494 1507 1458 1408 1305 1202 1245 1288 1339 1390 1378 1366 1325 1283 1304 1325 1336 1348 1360 1372 1321 1271 1324 1378 1425 1472 1456 1441 1393 1345 1360 1374
992A374M5M4j01j01P6P6P5P6l8l8j01j00M2M2J0J1O1O1jjm5m5j3j4j4j4N5N4J26K29K71K71
$$ 1374 1419 1463 1362 1261 1337 1413 1488 1564 1526 1488 1387 1287 1329 1371 1381 1392 1453 1514 1513 1512 1467 1422 1409 1395 1381 1367 1422 1476 1602 1831 2102 2373
988B373K13J50R2j3j29k33k43k43j49j48m5m4o1o0M3M4K4K4K0K0n9j20q2K3O9O8J3J3k9k9
$$ 2373 2586 2736 2828 2815 2686 2453 2210 1967 1818 1670 1625 1581 1520 1460 1503 1547 1571 1595 1615 1635 1576 1456 1374 1397 1466 1534 1547 1560 1531 1502
985A502KKK4K4l9l9K5K6K5K5K8K7K8K8q7q8J7J7L9L9L9L9J30J30J31J30J50J51J47Q6lj06
$$ 1502 1504 1506 1530 1554 1515 1476 1501 1527 1552 1577 1605 1632 1660 1688 1601 1513 1530 1547 1586 1625 1664 1703 1833 1963 2094 2224 2374 2525 2672 2758 2755 2649
981B649j56j56j64j63j33j32r3r2l1l0L1L0l2l2p4p3j1j1j5j5M8M7K1K2K1K1L7L6k5k6lkl
$$ 2649 2493 2337 2173 2010 1877 1745 1652 1560 1529 1499 1530 1560 1528 1496 1422 1349 1338 1327 1312 1297 1345 1392 1413 1435 1456 1477 1514 1550 1525 1499 1496 1494 1491
977A491kR5R4r2r2n6n6PPj2j1j2j2llllJ5J5J5J6K0K0K0K0nmnnl1l1L1L2j8j7J3J4j4j5M9
$$ 1491 1489 1584 1678 1586 1494 1438 1382 1389 1396 1384 1373 1361 1349 1346 1343 1340 1337 1352 1367 1382 1398 1418 1438 1458 1478 1473 1469 1464 1459 1428 1397 1428 1460 1442 1425 1438 1452 1438 1423 1472
972A472M8m2m2m1m2j4j3m5m5Q6Q6j8j8jjkjL0L0l1r4j04K0J34J34O3O4m1m0o9o9oorrrrK4
$$ 1472 1520 1478 1436 1395 1353 1339 1326 1281 1236 1322 1408 1390 1372 1371 1370 1368 1367 1397 1427 1396 1302 1198 1218 1352 1486 1549 1613 1572 1532 1463 1394 1388 1382 1373 1364 1355 1346 1370
967A370K5K4K4k4k5n6n5lkO0N9k9k9L3L4N1N1j2j1m2m3K0K0L0K9p4p4l0l0L2L3J7J6Q0P9o3
$$ 1370 1395 1419 1443 1419 1394 1338 1283 1280 1278 1338 1397 1368 1339 1372 1406 1457 1508 1496 1485 1443 1400 1420 1440 1470 1499 1425 1351 1321 1291 1323 1356 1373 1389 1469 1548 1485
963A485o2o3o2l9l9O6O5K5K6K5K5K7K7K7K7j3j4j3j3j6j6J26J26O9OP5K00K51K50J88J88P7
$$ 1485 1423 1360 1298 1259 1220 1286 1351 1376 1402 1427 1452 1479 1506 1533 1560 1547 1533 1520 1507 1491 1475 1601 1727 1796 1802 1877 2077 2328 2578 2766 2954 3031
959C031m7j71k33k67k67j96p1L1L1j07j08q0q1K3K3P3P3p3p3n6n6M8M9KKL3L4m3m2m3m2N0
$$ 3031 2984 2813 2580 2313 2046 1850 1779 1810 1841 1734 1626 1546 1465 1488 1511 1584 1657 1584 1511 1455 1399 1447 1496 1498 1500 1533 1567 1524 1482 1439 1397 1447
955A447N1N1N0llllj1j2K0K0J2J3m6m6R1J54R3l3l3R2K55L81L56L55L24K60J66m1j65k26k35
$$ 1447 1498 1549 1599 1596 1593 1590 1587 1576 1564 1584 1604 1616 1629 1583 1537 1628 1782 1875 1842 1809 1901 2156 2537 2893 3248 3572 3832 3998 3957 3792 3566 3331
951C331k35k70k71k03k03j41j40j03j03m1m0K1K1j0j0M2M2J1J1m9m8m9m8K8K9K9K9n4n4QQ
$$ 3331 3096 2826 2555 2352 2149 2008 1868 1765 1662 1621 1581 1602 1623 1613 1603 1645 1687 1698 1709 1660 1612 1563 1515 1543 1572 1601 1630 1576 1522 1530 1538
947A538PPPPQPQPl6l7K6K5qqN4N5J06J06LKQ8Q7J92J91L04L03J79N4j04k28l05k42j43j42
$$ 1538 1545 1552 1559 1566 1574 1581 1589 1596 1560 1523 1549 1574 1566 1558 1612 1667 1773 1879 1882 1884 1972 2059 2251 2442 2746 3049 3228 3282 3178 2950 2645 2403 2260 2118
943B118j38j39p1p1p1p1k1k0j7j6R5J58J31Oq7q6r4r5j6j6M7M6l3l3l2l3K7K7K7K7qqN4N5
$$ 2118 1980 1841 1770 1699 1628 1557 1536 1516 1499 1483 1578 1736 1867 1873 1786 1700 1606 1511 1495 1479 1526 1572 1539 1506 1474 1441 1468 1495 1522 1549 1541 1533 1587 1642
939A642l5l5l5l5M7M7j5j6K0J9q4q5p1p1P5P5k2k3RRP2P2l2l3k3k3k3k3k5k5P9P9J9J9j2j2
$$ 1642 1607 1572 1537 1502 1549 1596 1581 1565 1585 1604 1520 1435 1364 1293 1368 1443 1421 1398 1407 1416 1488 1560 1528 1495 1472 1449 1426 1403 1378 1353 1432 1511 1530 1549 1537 1525
934A525K6K6K6K6K4K4l8l9K3K2m0m0m5m6J7J7j2j2N1N1poo9o9M0M0M0M1j2j1j2j1k9k8L4L4
$$ 1525 1551 1577 1603 1629 1653 1677 1639 1600 1623 1645 1605 1565 1520 1474 1491 1508 1496 1484 1535 1586 1579 1573 1504 1435 1475 1515 1555 1596 1584 1573 1561 1550 1521 1493 1527 1561
930A561K7K6K6K6k8k8j26j26k3Q2N8mMML1L2m8m7k0M3P2P2J4J4rrm1m0PPPPl2l2l2l2J4J4
$$ 1561 1588 1614 1640 1666 1638 1610 1484 1358 1335 1417 1475 1471 1475 1479 1510 1542 1494 1447 1427 1470 1542 1614 1628 1642 1633 1624 1583 1543 1550 1557 1564 1571 1539 1507 1475 1443 1457 1471
925A471J4J5n6n5n9LN9N9J%J0J1k2k1O3O2lo5m3K0M8j6l9l9J9K0K5K4l7l8l3l4K9K9Q7Q8J23
$$ 1471 1485 1500 1444 1389 1330 1333 1392 1451 1452 1452 1462 1473 1451 1430 1493 1555 1552 1487 1444 1464 1512 1496 1457 1418 1437 1457 1482 1506 1469 1431 1398 1364 1393 1422 1509 1597 1720
921A720O0POLKK5K4ppJ7J7oo8r4l2K7l5r7r6l2L1J21J21N6ok5k5KKl4l4l0l0l7K6N3N3J0J0
$$ 1720 1780 1787 1793 1796 1798 1823 1847 1840 1833 1850 1867 1861 1793 1699 1667 1694 1659 1562 1466 1434 1465 1586 1707 1763 1757 1732 1707 1709 1711 1677 1643 1613 1583 1546 1572 1625 1678 1688 1698
916A698M2M1l3l4l3l3q1q0K4Q6L2p2m1m1rj0j0j0J2J1J2J2N9O0O0N9n0n0n1n0j7j6J5J4O6
$$ 1698 1740 1781 1748 1714 1681 1648 1567 1487 1511 1597 1629 1557 1516 1475 1466 1456 1446 1436 1448 1459 1471 1483 1542 1602 1662 1721 1671 1621 1570 1520 1503 1487 1502 1516 1582
912A582O5l8l9n1n1k0k0P8P9M8M7m3m3J9K0mlmlj36j35r0J5O9P0M5M4J2J2n1n1PQO9P0%%J
$$ 1582 1647 1609 1570 1519 1468 1448 1428 1506 1585 1633 1680 1637 1594 1613 1633 1629 1626 1622 1619 1483 1348 1258 1273 1342 1412 1457 1501 1513 1525 1474 1423 1430 1438 1507 1577 1577 1577 1578
907A578%J4J3J3J4O4O3KJM1M1k1k2k0k0n1n2n9o0LKONONK6K5l8l7r3r2l1l0J03J02jko1o2
$$ 1578 1578 1592 1605 1618 1632 1696 1759 1761 1762 1803 1844 1823 1801 1781 1761 1710 1658 1599 1539 1542 1544 1550 1555 1561 1566 1592 1617 1579 1542 1449 1357 1326 1296 1399 1501 1500 1498 1437 1375
902A375M3M2R1R0N9N8QQP0P1J62J63J00J00K9K8klp9p9p8p9l6l5r7r8j00r9l8l7rj0m0m1j7
$$ 1375 1418 1460 1551 1641 1700 1758 1766 1774 1844 1915 2077 2240 2340 2440 2469 2497 2495 2492 2413 2334 2256 2177 2141 2106 2009 1911 1811 1712 1674 1637 1628 1618 1578 1537 1520
898A520j7J4J4p1p1L3L3k5k5L8L8j%%%K2K2m0m0R4R5L2L2m9n0N4N5j9j8j9j8RJ0k2k2K3K3
$$ 1520 1503 1517 1531 1460 1389 1422 1455 1430 1405 1443 1481 1480 1480 1480 1480 1502 1524 1484 1444 1538 1633 1665 1697 1648 1598 1652 1707 1688 1670 1651 1633 1642 1652 1630 1608 1631 1654
894A654m0l9n1n1N4N3L3L4k9k9jkkjm7m8J6J5K1K1m2m1J9K0j2j2j0j0K2K1K0K1j1j1jjL0L1
$$ 1654 1614 1575 1524 1473 1527 1580 1613 1647 1618 1589 1588 1586 1584 1583 1536 1488 1504 1519 1540 1561 1519 1478 1497 1517 1505 1493 1483 1473 1495 1516 1536 1557 1546 1535 1534 1533 1563 1594
889A594P0P1P1P1n5n4n5n5m2m1m2m2l9l9O4O5M1M1k2k2K8K8K8K7J3J2J2J2o1o2%JL0L0L0L0
$$ 1594 1664 1735 1806 1877 1822 1768 1713 1658 1616 1575 1533 1491 1452 1413 1477 1542 1583 1624 1602 1580 1608 1636 1664 1691 1704 1716 1728 1740 1679 1617 1617 1618 1648 1678 1708 1738
885A738m8m8N6J19J07Mj15j16p9K4J04M3p2p2NJ09J12Pl1l2J0J1n2n3L3L2L3L2Q4Q3K1K1j2
$$ 1738 1690 1642 1698 1817 1924 1928 1813 1697 1618 1642 1746 1789 1717 1645 1650 1759 1871 1878 1847 1815 1825 1836 1784 1731 1764 1796 1829 1861 1945 2028 2049 2070 2058
881B058j2m3m4jkkkL2L2Q1Q2J36M29P01N77J14l44m76l51k57k56k15r0j0j0o5o5nol7l6l3
$$ 2058 2046 2003 1959 1958 1956 1954 1952 1984 2016 2097 2179 2315 2744 3445 4022 4136 3792 3316 2965 2708 2452 2237 2147 2137 2127 2062 1997 1992 1986 1949 1913 1880
877A880l2l2l2N0N1J12J13j2j3m4m4J2J2q5q5J2J37J05j9r7r6m2m1o8o7onk2k1RRQ5Q4K2K1
$$ 1880 1848 1816 1784 1834 1885 1997 2110 2098 2085 2041 1997 2009 2021 1936 1851 1863 2000 2105 2086 1989 1893 1851 1810 1742 1675 1669 1664 1642 1621 1630 1639 1724 1808 1830 1851
872A851j6j6M6M6j21j22j7j8L3L3L2L3j0j1K0K1l8l8K3Q6L6r0n0J2J5J4m4m4J7J7m5m5n4n4
$$ 1851 1835 1819 1865 1911 1790 1668 1651 1633 1666 1699 1731 1764 1754 1743 1763 1784 1746 1708 1731 1817 1853 1763 1713 1725 1740 1754 1710 1666 1683 1700 1655 1610 1556 1502
868A502RQj1j1N2N1J7J6J7J6k2k3L6L6j6p8p8j6L0K9L4L4K4K4K4K5q4q4j5M8O4O5M1k1p0p0
$$ 1502 1511 1519 1508 1497 1549 1600 1617 1633 1650 1666 1644 1621 1657 1693 1677 1599 1521 1505 1535 1564 1598 1632 1656 1680 1704 1729 1645 1561 1546 1594 1658 1723 1764 1743 1673 1603
864A603m3m3n7n6l0L3N7N6kkJ6J6M7M7J1J1J1J1opl7l7n0n0J6P8K8l4n7n7K7K7Q6Q6J0n1q0
$$ 1603 1560 1517 1460 1404 1374 1407 1464 1520 1518 1516 1532 1548 1595 1642 1653 1664 1675 1686 1680 1673 1636 1599 1549 1499 1515 1593 1621 1587 1530 1473 1500 1527 1613 1699 1709 1658 1578
859A578p9k7k8l2L1N2N3pokjkkm8m8N2N2Ln9l2L0O6Mj9k0O6O7O6Mp0j33j32p0j9M3P0P1L2
$$ 1578 1499 1472 1444 1412 1443 1495 1548 1541 1535 1533 1532 1530 1528 1480 1432 1484 1536 1539 1480 1448 1478 1544 1548 1529 1509 1575 1642 1708 1712 1642 1509 1377 1307 1288 1331 1401 1472 1504
855A504l1k7k6onN4N3J2n0n0J2L9M0j9j9k8k7nN8N9no2jJ%l5K7R3L0p3p3k3L8L9k4k0k0L4
$$ 1504 1473 1446 1420 1414 1409 1463 1516 1528 1478 1428 1440 1479 1519 1500 1481 1453 1426 1421 1479 1538 1533 1471 1470 1471 1471 1436 1463 1556 1586 1513 1440 1417 1455 1494 1470 1450 1430 1464
850A464L5N8nl2l1M2M3n8n8J4P7Lj02r6RQ9Q9kjl3l3j%L1L1J8J8J8J8qrqrm0l9m0m0j7j8j8
$$ 1464 1499 1557 1552 1520 1489 1531 1574 1516 1458 1472 1549 1552 1450 1354 1363 1452 1541 1539 1538 1505 1472 1471 1471 1502 1533 1551 1569 1587 1605 1597 1588 1580 1571 1531 1492 1452 1412 1395 1377 1359
845A359j7qqK0Q2R9R9kjn5n5n4n5L8L8PPL4L5J1n1r1k9nno1o1M2M3L7L7O4O4m3j05oN7L8k4
$$ 1359 1342 1334 1326 1346 1428 1527 1626 1624 1623 1568 1513 1459 1404 1442 1480 1487 1494 1528 1563 1574 1523 1432 1403 1398 1393 1332 1271 1313 1356 1393 1430 1494 1558 1515 1410 1404 1461 1499 1475
840A475n2J1j%nN8L1l1q9k7NNK9R2J11Pj17j18L0L0K5K6L1l1n9n9N1N1K3l9l1l1qN4R0R0K8
$$ 1475 1423 1434 1433 1433 1428 1486 1517 1486 1397 1370 1375 1380 1409 1501 1612 1619 1502 1384 1414 1444 1469 1495 1526 1495 1436 1377 1428 1479 1502 1463 1432 1401 1393 1447 1537 1627 1655
836A655K8M9j2q2q2M6M6j7j6K7K8l5l5J8J8qj33j07J9M4M5j0j0K2K2J1J1k0k0j8j7q0q0NN
$$ 1655 1683 1732 1720 1638 1556 1602 1648 1631 1615 1642 1670 1635 1600 1618 1636 1628 1495 1388 1407 1451 1496 1486 1476 1498 1520 1531 1542 1522 1502 1484 1467 1387 1307 1312 1317
832A317MNLML4L5M1M1k1k2l6l5nnL2L3l0l1JKJJP1P1RRj7j8j7j8ONNOP7P8M6M7k9k8r1r1j2
$$ 1317 1321 1326 1329 1333 1367 1402 1443 1484 1463 1441 1405 1370 1365 1360 1392 1425 1395 1364 1365 1367 1368 1369 1440 1511 1520 1529 1512 1494 1477 1459 1465 1470 1475 1481 1558 1636 1682 1729 1700 1672 1581 1490 1478
826A478j2j3j2l8l9K4K5K1K1K1K1K2K1K1K1N3N2j0j0QPL9L9J4J3J4J4r5r4l3l2M1M0M1M1q2
$$ 1478 1466 1453 1441 1403 1364 1388 1413 1434 1455 1476 1497 1519 1540 1561 1582 1635 1687 1677 1667 1675 1682 1721 1760 1774 1787 1801 1815 1720 1626 1593 1561 1602 1642 1683 1724 1642
822A642q1j9k0O4O4O4O3J3J2P5P5R3R3O2O2j8j9NNJ5j10j86j85m5m4m5m4m1m0m1m1n3n4N1
$$ 1642 1561 1542 1522 1586 1650 1714 1777 1790 1802 1877 1952 2045 2138 2200 2262 2244 2225 2230 2235 2250 2140 1954 1769 1724 1680 1635 1591 1550 1510 1469 1428 1375 1321 1372
818A372N0O6O5LLM7M8m9m9p7M9M0M1p5p5K9K9J0J0RJ0N0N0j2j3o5o6L8L9K7K8p6p6n7n7M7
$$ 1372 1422 1488 1553 1556 1559 1606 1654 1605 1556 1479 1528 1568 1609 1534 1459 1488 1517 1527 1537 1546 1556 1606 1656 1644 1631 1566 1500 1538 1577 1604 1632 1556 1480 1423 1366 1413
813A413M7M0M1k2k2L7L8L7L8q2q3p4p4m7P8J11J12l1l1J%N3N2rj0j3j3j3j3p7p8j5j5L1L0
$$ 1413 1460 1500 1541 1519 1497 1534 1572 1609 1647 1565 1482 1408 1334 1287 1365 1476 1588 1557 1526 1527 1527 1580 1632 1623 1613 1600 1587 1574 1561 1484 1406 1391 1376 1407 1437
809A437%jL1L1j%L8L9PQPQk4k4j05j04%jO1O1jjj5j4Q9R0NMn8n8J4J3J4J3l1l2P2P2mnmnk9
$$ 1437 1437 1436 1467 1498 1497 1497 1535 1574 1581 1589 1596 1604 1580 1556 1451 1347 1347 1346 1407 1468 1467 1466 1451 1437 1526 1616 1621 1625 1567 1509 1523 1536 1550 1563 1532 1500 1572 1644 1640 1635 1631 1626 1597
804A597k9l0k9k9l0k9l0nnonm0m1K2K2N0M9N0M9j4j5p6p7P9P8k5k6K6K5K5K5nnN7N7k6k6L6
$$ 1597 1568 1538 1509 1480 1450 1421 1391 1386 1381 1375 1370 1330 1289 1311 1333 1383 1432 1482 1531 1517 1502 1426 1349 1428 1506 1481 1455 1481 1506 1531 1556 1551 1546 1603 1660 1634 1608 1644
799A644L7j5j5j4j5n0n0m9n0NOONQ4Q3o2o2m1m1K1K1N6N7oo9n5N0R1R1l9l9l9m0j9j9M3M3
$$ 1644 1681 1666 1651 1637 1622 1572 1522 1473 1423 1428 1434 1440 1445 1529 1612 1550 1488 1447 1406 1427 1448 1504 1561 1555 1486 1431 1481 1572 1663 1624 1585 1546 1506 1487 1468 1511 1554
795A554mnnnJ6J6J6J6J3J2n0n1j2j3j3j2rrqrK2K3K2K3l6l6O8O8M6M7M7M6k3k4k3k4L0L0p4
$$ 1554 1550 1545 1540 1535 1551 1567 1583 1599 1612 1624 1574 1523 1511 1498 1485 1473 1464 1455 1447 1438 1460 1483 1505 1528 1492 1456 1524 1592 1638 1685 1732 1778 1755 1731 1708 1684 1714 1744 1670
790A670p4l2l2L0L0j1j0j0j0poN2N2K1m2o9p0K7K8K7K7M7M8j5j5k4k4k4k4LLL8k5j3j3j6j7
$$ 1670 1596 1564 1532 1562 1592 1581 1571 1561 1551 1544 1538 1590 1642 1663 1621 1552 1482 1509 1537 1564 1591 1638 1686 1671 1656 1632 1608 1584 1560 1563 1566 1604 1579 1566 1553 1537 1520
785A520ooooqpN5N5L6L5L2L1l2r5r5l2M1M1M5M4O2O2jjl9m0l9l9p6p6L1R3J09M6k1q4m0K1
$$ 1520 1514 1508 1502 1496 1488 1481 1536 1591 1627 1662 1694 1725 1693 1598 1503 1471 1512 1553 1598 1642 1704 1766 1765 1764 1725 1685 1646 1607 1531 1455 1486 1579 1688 1734 1713 1629 1589 1610
781A610M5M6o3o3l5K7L6L6NO8Q1Q1k5q8m1m0m1m1m1K2ppjJ02J03kr5r4LLKLLLp2p3O9O9M4
$$ 1610 1655 1701 1638 1575 1540 1567 1603 1639 1644 1712 1793 1874 1849 1761 1720 1680 1639 1598 1557 1579 1572 1565 1564 1666 1769 1767 1672 1578 1581 1584 1586 1589 1592 1595 1523 1450 1519 1588 1632
776A632k0m6m7k1k0M1M2k6k6L3L2m9j12o1Q4J12Pk9k8QQn4n5k4k4LO5M9M9n1n1j2j2j2j2J3
$$ 1632 1612 1566 1519 1498 1478 1519 1561 1535 1509 1542 1574 1525 1413 1352 1436 1548 1555 1526 1498 1506 1514 1460 1405 1381 1357 1360 1425 1474 1523 1472 1421 1409 1397 1385 1373 1386
772A386J3J3J3L6L6L6L6rrj0rm1m2j0j0ONO8O7J2J1k0k0J9J9j1j2kkl4l3K2K2K2K2L5L4L5
$$ 1386 1399 1412 1425 1461 1497 1533 1569 1560 1551 1541 1532 1491 1449 1439 1429 1435 1440 1508 1575 1587 1598 1578 1558 1577 1596 1585 1573 1571 1569 1535 1502 1524 1546 1568 1590 1625 1659 1694
767A694L4l6l5r9r8M2M2M1M2M9M9J8J8K6K6p8p9k7k6MMK5K4K4K5K6K6K7K6o1o1o1o1qqN4N5
$$ 1694 1728 1692 1657 1558 1460 1502 1544 1585 1627 1676 1725 1743 1761 1787 1813 1735 1656 1629 1603 1607 1611 1636 1660 1684 1709 1735 1761 1788 1814 1753 1692 1631 1570 1562 1554 1608 1663
762A663M0M1J0Rp3p3j1j1LMn9n9ppl8l8k3k3RRP6P6J4J4J2J3j9j9j5j6M6M7o6o6mmk1k2M1
$$ 1663 1703 1744 1754 1763 1690 1617 1606 1595 1598 1602 1543 1484 1477 1470 1432 1394 1371 1348 1357 1366 1442 1518 1532 1546 1558 1571 1552 1533 1518 1502 1548 1595 1529 1463 1459 1455 1434 1412 1453
758A453M0R0R0n1n2q2j8M6M6Ko1o1KJ14J13M8j4l3l3K2K2qp0o6o5j0j0K1K1P7P7N0j3J7J7
$$ 1453 1493 1583 1673 1622 1570 1488 1470 1516 1562 1564 1503 1442 1444 1558 1671 1719 1705 1672 1639 1661 1683 1675 1605 1539 1474 1464 1454 1475 1496 1573 1650 1700 1687 1704 1721
753A721J2J3k2k2P8P8ko3o4jj3j3qrk2k2QRk8k8nN8J14N2n5n5nonoN2N3K5l8l1l1lmpoppk5
$$ 1721 1733 1746 1724 1702 1780 1858 1856 1793 1729 1728 1715 1702 1694 1685 1663 1641 1649 1658 1630 1602 1597 1655 1769 1821 1766 1711 1706 1700 1695 1689 1741 1794 1819 1781 1750 1719 1716 1712 1705 1699 1692 1685 1660
748A660k5k5k5K0K1K0K1J9J9m4m3k0k0M2M3L5L5L2L1j5p7p3p3m1m1K1K2J8J9j2j2llK0Q3Q1
$$ 1660 1635 1610 1585 1605 1626 1646 1667 1686 1705 1661 1618 1598 1578 1620 1663 1698 1733 1765 1796 1781 1704 1631 1558 1517 1476 1497 1519 1537 1556 1544 1532 1529 1526 1546 1629 1710
744A710J9m7m6k5k4k4k4P7P7N0j3n0n0M6M6m2j05j05m3M7M6N1N0K8K8mmppj11j11P6P7J4J5
$$ 1710 1729 1682 1636 1611 1587 1563 1539 1616 1693 1743 1730 1680 1630 1676 1722 1680 1575 1470 1427 1474 1520 1571 1621 1649 1677 1673 1669 1662 1655 1544 1433 1509 1586 1600 1615
739A615K2K1K2K2m7m7m8m7K6K6K6K6J1J1k0k0J9J8m3m4m0l9O5O5M3M4j9j8j7j6J5J5ppK4K4
$$ 1615 1637 1658 1680 1702 1655 1608 1560 1513 1539 1565 1591 1617 1628 1639 1619 1599 1618 1636 1593 1549 1509 1470 1535 1600 1643 1687 1668 1650 1633 1617 1632 1647 1640 1633 1657 1681
735A681L5L4o9p0o2o2M2M3JKKJP4P3p2p2J2J2n0n0m4m4N9O0O1O0K9L0O6O7MNRJ0n3n3ppK4
$$ 1681 1716 1750 1681 1611 1549 1487 1529 1572 1573 1575 1577 1578 1652 1725 1653 1581 1593 1605 1555 1505 1461 1417 1476 1536 1597 1657 1686 1716 1782 1849 1853 1858 1867 1877 1824 1771 1764 1757 1781
730A781K4M3M2J1J2n6n6PPj8j7j7j8J0J0RJ0L5L5k7k8N0M9J9J8k8k8k8k8JJJJK2K3rrK0K0
$$ 1781 1805 1848 1890 1901 1913 1857 1801 1808 1815 1797 1780 1763 1745 1755 1765 1774 1784 1819 1854 1827 1799 1849 1898 1917 1935 1907 1879 1851 1823 1824 1825 1826 1827 1849 1872 1863 1854 1874 1894
725A894Q2Q2rj0m0m1%%l2l1mmmmJJO4O4K3K4p7p7J8Q0M5o0p2j0J2J1jjjjJ1J2J2J2M9M8j4
$$ 1894 1976 2058 2049 2039 1999 1958 1958 1958 1926 1895 1891 1887 1883 1879 1880 1881 1945 2009 2032 2056 1979 1902 1920 2000 2045 1985 1913 1903 1915 1926 1925 1924 1923 1922 1933 1945 1957 1969 2018 2066 2052
720B052j4mml6l5m6m7N8N8k0j9k0j9K3K3m0l9l3l4K9K9ool7l7J02J03O4m1m9N5R4R4J7J7J7
$$ 2052 2038 2034 2030 1994 1959 1913 1866 1924 1982 1962 1943 1923 1904 1927 1950 1910 1871 1838 1804 1833 1862 1856 1850 1813 1776 1878 1981 2045 2004 1955 2010 2104 2198 2215 2232 2249
716B249J7noonp4p4m3m2lkO0O0mmo7o7llO0N9O3O4%JK2K2K2K2n2n2n2n2M3M3M3M3K0K1j1j1
$$ 2249 2266 2261 2255 2249 2244 2170 2096 2053 2011 2008 2006 2066 2126 2122 2118 2051 1984 1981 1978 2038 2097 2160 2224 2224 2225 2247 2269 2291 2313 2261 2209 2157 2105 2148 2191 2234 2277 2297 2318 2307 2296
711B296q0q0O6O6l4l5l4l4K9L0k3k3J1J1J1J1l4l5L8L8K2K2N3N4K6K7m6m6MLk8k7m4m4K9K9
$$ 2296 2216 2136 2202 2268 2234 2199 2165 2131 2160 2190 2167 2144 2155 2166 2177 2188 2154 2119 2157 2195 2217 2239 2292 2346 2372 2399 2353 2307 2311 2314 2286 2259 2215 2171 2200 2229
707B229m3m3RROOOPqqM5M4J1J0m1m2noM7M7q4q3L1L1K2K3K2K3l7l6N8N7J7J7J7J8n4n3K0J9
$$ 2229 2186 2143 2152 2161 2167 2173 2179 2186 2178 2170 2215 2259 2270 2280 2239 2197 2192 2186 2233 2280 2196 2113 2144 2175 2197 2220 2242 2265 2228 2192 2250 2307 2324 2341 2358 2376 2322 2269 2289 2308
702B308K3K2rrn6n5n6n6N2N2N1N2l8l7l8l8L4L4J07J06n1n1JJJ9J9J8J9M0M0l3l3N8N8j6j5
$$ 2308 2331 2353 2344 2335 2279 2224 2168 2112 2164 2216 2267 2319 2281 2244 2206 2168 2202 2236 2343 2449 2398 2347 2348 2349 2368 2387 2405 2424 2464 2504 2471 2438 2496 2554 2538 2523
697B523n5n5Q0Q0J07J06N5N5m7m6m6m7J0J0o2o3k7k7K5K6l5l5l5l4j7j6j7j6L8L9j3j3k7k7
$$ 2523 2468 2413 2493 2573 2680 2786 2841 2896 2849 2803 2757 2710 2720 2730 2668 2605 2578 2551 2576 2602 2567 2532 2497 2463 2446 2430 2413 2397 2435 2474 2461 2448 2421 2394
693B394k7k7J0J0Q3Q3L7L6Q8Q9JJP4P4N0N0J23J23J55J56J03J03P9P9l5l6q0q0q1q0j21j22
$$ 2394 2367 2340 2350 2360 2443 2526 2563 2599 2687 2776 2777 2778 2852 2926 2976 3026 3149 3272 3427 3583 3686 3789 3868 3947 3912 3876 3796 3716 3635 3555 3434 3312
689C312o9o9n2n2q3q3o8o9j6j7j4j5m5m6j4j4j3j4NNP8P8K1K1R4R4L5L6Q8Q8J29J30J29J29
$$ 3312 3243 3174 3122 3070 2987 2904 2836 2767 2751 2734 2720 2705 2660 2614 2600 2586 2573 2559 2564 2569 2647 2725 2746 2767 2861 2955 2990 3026 3114 3202 3331 3461 3590 3719
685C719J42J42K14K15J20J21OPj00j00j00r9r1r1j42j43j94j94j63j63r0r1j9j8k6k7k6k7
$$ 3719 3861 4003 4217 4432 4552 4673 4679 4686 4586 4486 4386 4287 4196 4105 3963 3820 3626 3432 3269 3106 3016 2925 2906 2888 2862 2835 2809 2782
682B782n4n3J9J9l7l7l8l7K9K9K9K9l8l9P6P6J56J57J05J05J15J15J15J16J10J10J10J11Q0
$$ 2782 2728 2675 2694 2713 2676 2639 2601 2564 2593 2622 2651 2680 2642 2603 2679 2755 2911 3068 3173 3278 3393 3508 3623 3739 3849 3959 4069 4180 4260
678D260Q0k3k4j29j28j28j29j68j68j99j99j64j63o0n9k7k6NNn4n5k3k3M5M5P5P6llK8K8N9
$$ 4260 4340 4317 4293 4164 4036 3908 3779 3611 3443 3244 3045 2881 2718 2658 2599 2572 2546 2551 2556 2502 2447 2424 2401 2446 2491 2566 2642 2639 2636 2664 2692 2751
674B751O0lmP9P8J5J6k8k9L4L4N7N7onJ5J5P1P1N9m5j32j32r2r2k9l0j12j12n0n0LLo0n9o8
$$ 2751 2811 2808 2804 2883 2961 2976 2992 2964 2935 2969 3003 3060 3117 3111 3106 3121 3136 3207 3278 3337 3292 3160 3028 2936 2844 2815 2785 2673 2561 2511 2461 2464 2467 2407 2348 2280
670B280o8l7l7O0O0K8K9j4j4J7J7N1N1N1N1N0M9j4j3P6P5M5M4K7K6K6K7j4j4j4j4KJk9l0o9
$$ 2280 2212 2175 2138 2198 2258 2286 2315 2301 2287 2304 2321 2372 2423 2474 2525 2575 2624 2610 2597 2673 2748 2793 2837 2864 2890 2916 2943 2929 2915 2901 2887 2889 2890 2861 2831 2762
665B762o9ppj5j6j20j20o9o9L5L5k4k4k4k5K2K1p9p9L0R2N7m7p9j8M6M5N8N9nmj09j10noN0
$$ 2762 2693 2686 2679 2664 2648 2528 2408 2339 2270 2305 2340 2316 2292 2268 2243 2265 2286 2207 2128 2158 2250 2307 2260 2181 2163 2209 2254 2312 2371 2366 2362 2253 2143 2138 2132 2182
661B182N0N0N0M0M1M1M1K2K3K3K2O5O4KKl6l6O8O8J07J07q0q0j37j37p4p5L8L7k5k5p6p5j4
$$ 2182 2232 2282 2332 2372 2413 2454 2495 2517 2540 2563 2585 2650 2714 2716 2718 2682 2646 2714 2782 2889 2996 2916 2836 2699 2562 2488 2413 2451 2488 2463 2438 2362 2287 2273
657B273j3QRL9L9l0l1l1l1L4L5k9k8QQL9L9m1m2J7J7Nn8n4N0Q9K7l5l5j1j1R2R3P7P6k7k8
$$ 2273 2260 2268 2277 2316 2355 2325 2294 2263 2232 2266 2301 2272 2244 2252 2260 2299 2338 2297 2255 2272 2289 2294 2236 2182 2232 2321 2348 2313 2278 2267 2256 2348 2441 2518 2594 2567 2539
652B539RQk3k3nmN8N8M5M5j8j8N9N8mmo3o3l1l2K2K2m0m0l0l1L2L2RJ0M1M1K7K8mmL5L5O5
$$ 2539 2548 2556 2533 2510 2505 2501 2559 2617 2662 2707 2689 2671 2730 2788 2784 2780 2717 2654 2623 2591 2613 2635 2595 2555 2525 2494 2526 2558 2567 2577 2618 2659 2686 2714 2710 2706 2741 2776 2841
648B841O6J6J5J5J6QQn4n4MNMNQ5Q5j9q1n2N1R3R3K8K9K8K8J2J1J2J2M0M1M0M0POPOJ5J6J6
$$ 2841 2907 2923 2938 2953 2969 2977 2985 2931 2877 2881 2886 2890 2895 2980 3065 3046 2965 2913 2964 3057 3150 3178 3207 3235 3263 3275 3286 3298 3310 3350 3391 3431 3471 3478 3484 3491 3497 3512 3528 3544
643C544J5L6L7k6k6N8N8N9N8jjkjL6L6L7L6P8P8k6k6O6O6O7O6J7J6J7J7R4R5L2L3lmO0N9P4
$$ 3544 3559 3595 3632 3606 3580 3638 3696 3755 3813 3812 3811 3809 3808 3844 3880 3917 3953 4031 4109 4083 4057 4123 4189 4256 4322 4339 4355 4372 4389 4483 4578 4610 4643 4640 4636 4696 4755 4829
638D829P3J1J2K2K2K2K2J09J09J09J09N3N3N4N3K1K0K1K1P3P4J1J1P4P3P4P3P0P0l4l4R0Q9
$$ 4829 4902 4913 4925 4947 4969 4991 5013 5122 5231 5340 5449 5502 5555 5609 5662 5683 5703 5724 5745 5818 5892 5903 5914 5988 6061 6135 6208 6278 6348 6314 6280 6370 6459
634F459R0Q9N5N5N4N5L7L8J00J00P9Q0P9P9l8l7LJ08J38P5N4N4J32J32K8K8L1L1L1L1R2R2
$$ 6459 6549 6638 6693 6748 6802 6857 6894 6932 7032 7132 7211 7291 7370 7449 7411 7374 7377 7485 7623 7698 7752 7806 7938 8070 8098 8126 8157 8188 8219 8250 8342 8434
630H434L4L3J13J75R5j0JJL0l3p3p4j5j5R1R0K5l7QP1R4j0l0L1J36J36O9O9l4r7j08lL8L8
$$ 8434 8468 8501 8614 8789 8884 8874 8875 8876 8906 8873 8800 8726 8711 8696 8787 8877 8902 8865 8873 8944 9038 9028 8998 9029 9165 9301 9370 9439 9405 9308 9200 9197 9235 9273
626I273j4j3M5M5l9j02o7o7oopom5m6N3N2j6j19j59r6K2K2p8p8o2o2n8n8p0qm2m3p0o9r3j55
$$ 9273 9259 9246 9291 9336 9297 9195 9128 9061 9055 9049 9042 9036 8991 8945 8998 9050 9034 8915 8756 8660 8682 8704 8626 8548 8486 8424 8366 8308 8238 8230 8188 8145 8075 8006 7913 7758
621G758j35p2ppr1r1j26o3K4K4l8j00j20n9LLJ1n2j58j59j36p3nmM0M1k4q6r6l4l4r6j34p1
$$ 7758 7623 7551 7544 7537 7446 7355 7229 7166 7190 7214 7176 7076 6956 6897 6900 6903 6914 6862 6704 6545 6409 6336 6331 6327 6367 6408 6384 6298 6202 6168 6134 6038 5904 5833
617E833oop2p1p2p1POPPm3m3j05j06j9k0m3j05j02m1K5K5l7l8r6r6o7ol7l6p3j1po9r7l5L0
$$ 5833 5827 5821 5749 5678 5606 5535 5542 5548 5555 5562 5519 5476 5371 5265 5246 5226 5183 5078 4976 4935 4960 4985 4948 4910 4814 4718 4651 4645 4608 4572 4499 4488 4481 4412 4315 4280 4310
613D310L0J6J7m2m2qN5K3l8p8p7m6j08j27j27k5L8Qn5m7m7J7J8J7J7M7M6K0m4j19j20o1o2
$$ 4310 4340 4356 4373 4331 4289 4281 4336 4359 4321 4243 4166 4120 4012 3885 3758 3733 3771 3779 3724 3677 3630 3647 3665 3682 3699 3746 3792 3812 3768 3649 3529 3468 3406
609C406K7K8K7K7qqqqJ5J5n0j13j04m2m5m6o2%K7K7k0k0m7m7n0J2J6m7o1JO6O6opl7l7n8n7
$$ 3406 3433 3461 3488 3515 3507 3499 3491 3483 3498 3513 3463 3350 3246 3204 3159 3113 3051 3051 3078 3105 3085 3065 3018 2971 2921 2933 2949 2902 2841 2842 2908 2974 2968 2961 2924 2887 2829 2772
604B772NMK7K7L5k7q9k6L8L9l3l4L6R7M4M4M7M8P1P2J34J34N0N1K0J9k9k9KKj16j15q4q4o6
$$ 2772 2777 2781 2808 2835 2870 2843 2754 2728 2766 2805 2772 2738 2774 2871 2915 2959 3006 3054 3125 3197 3331 3465 3515 3566 3586 3605 3576 3547 3549 3551 3435 3320 3236 3152 3086
600C086o6o6o6o7o8o8o8n7n8NNr3r3n2N2Q4K1m2m1mmo7o6J0RM1M1jkjkk4k4Q0Q0pqppL9M0
$$ 3086 3020 2954 2888 2821 2753 2685 2617 2560 2502 2507 2512 2419 2326 2274 2326 2410 2431 2389 2348 2344 2340 2273 2207 2217 2226 2267 2308 2307 2305 2304 2302 2278 2254 2334 2414 2407 2399 2392 2385 2424 2464
595B464J02J02J81J82J77J78J09M6m4j47j79j16j2j2o1o1JJj19j18j18j18o1o0KKPQk4k3k1
$$ 2464 2566 2668 2849 3031 3208 3386 3495 3541 3497 3350 3171 3055 3043 3031 2970 2909 2910 2911 2792 2674 2556 2438 2377 2317 2319 2321 2328 2336 2312 2289 2268
591B268k0M2M2l4l4K8K8j8j9M4M4L0K9J34J34J46J46J15J15RRRJ0P7P8P7P8lml2L1J11K15
$$ 2268 2248 2290 2332 2298 2264 2292 2320 2302 2283 2327 2371 2401 2430 2564 2698 2844 2990 3105 3220 3229 3238 3247 3257 3334 3412 3489 3567 3564 3560 3528 3559 3670 3885
587C885L06L06L67L66K76Q8j76l21l95m56m25k78r4r4j62j62n8n8q7q6n6n5RRn3n4n3n3N0
$$ 3885 4191 4497 4864 5230 5506 5594 5418 5097 4702 4246 3821 3543 3449 3355 3193 3031 2973 2915 2828 2742 2686 2631 2640 2649 2596 2542 2489 2436 2486
583B486N1L1L0J76J76J01J00J31J32J43J44J78L02L72L72L80K55R2l2p7j39k42j79J5K23K12
$$ 2486 2537 2568 2598 2774 2950 3051 3151 3282 3414 3557 3701 3879 4181 4553 4925 5305 5560 5652 5620 5543 5404 5162 4983 4998 5221 5433
580E433J50M0q6j77j78LKO4O5K02K02R6l0k01l26n32n31l81k55k42k41j62l7l3r5q8k5l0l0
$$ 5433 5583 5623 5537 5360 5182 5185 5187 5251 5316 5518 5720 5816 5786 5585 5259 4727 4196 3815 3560 3318 3077 2915 2878 2845 2750 2662 2637 2607 2577
577B577P8P8N3N4K3K3J50J50K95K96L45L44M36M35L09J00j1j2K4K4J26J89R4l1k37l61l62
$$ 2577 2655 2733 2786 2840 2863 2886 3036 3186 3481 3777 4122 4466 4902 5337 5646 5746 5735 5723 5747 5771 5897 6086 6180 6149 5912 5551 5189
573E189k99j48O1J37J38J73J74O9n5k20l45l65k40q7k5j41k03j41p9j09j72j64j64j07j08
$$ 5189 4890 4742 4803 4940 5078 5251 5425 5494 5439 5219 4874 4509 4269 4182 4157 4016 3813 3672 3593 3484 3312 3148 2984 2877 2769
570B769m5m5j31j32n9O4J2n1J8J43J83N7L2L1J81J81L27L27L97L97L85L84K32K4j84l09k92
$$ 2769 2724 2679 2548 2416 2357 2421 2433 2382 2400 2543 2726 2783 2815 2846 3027 3208 3535 3862 4259 4656 5041 5425 5657 5681 5497 5188 4896
567D896k93j55j54j85j84j85j85j77j76p3p3opO1J86J70M5o4o5j18j17j18j18j20j20n7n7
$$ 4896 4603 4448 4294 4109 3925 3740 3555 3378 3202 3129 3056 3050 3043 3104 3290 3460 3505 3441 3376 3258 3141 3023 2905 2785 2665 2608 2551
564B551onJ32J33Q0m4K5K6L1L1L1L1m1m1K2K2mlj0J14J13J14J8J8N9N9J27K52K21R6r7r6j66
$$ 2551 2545 2540 2672 2805 2885 2841 2866 2892 2923 2954 2985 3016 2975 2934 2956 2978 2974 2971 2961 3075 3188 3302 3320 3338 3397 3456 3583 3835 4056 4152 4055 3959 3793
560C793j65o2o1m9m9m9m9n7n7n6n7M6M6J09J09R0R1R0R0L5L5K7J52J03J04R6K21K42J17Q3
$$ 3793 3628 3566 3505 3456 3407 3358 3309 3252 3195 3139 3082 3128 3174 3283 3392 3482 3573 3663 3753 3788 3823 3850 4002 4105 4209 4305 4526 4768 4885 4968
556D968Q3M1q4m5m5n4n5n4n4m1m1K2K2j5j4k8J80L09L10K33J09q8k95k57j32r4r4o1O5Jj23
$$ 4968 5051 5092 5008 4963 4918 4864 4809 4755 4701 4660 4619 4641 4663 4648 4634 4606 4786 5095 5405 5638 5747 5659 5364 5107 4975 4881 4787 4726 4791 4792 4669
552D669p1J37J21q8o6N8J55K9L0J55K49J24J32J31J54K8L6K45L20J94R7K20K55J30k9k8q4
$$ 4669 4598 4735 4856 4768 4702 4760 4915 4944 4974 5129 5378 5502 5634 5765 5919 5947 5983 6228 6548 6742 6839 7059 7314 7444 7415 7387 7303
549G303k08k01QJ7j07k06q2k6j51j87o3L6j71k29j04N1p4n8J50K22R6m4Q1J23jo5O1J46K0
$$ 7303 7095 6894 6902 6919 6812 6606 6524 6498 6347 6160 6097 6133 5962 5733 5629 5680 5606 5548 5698 5920 6016 5972 6053 6176 6175 6110 6171 6317 6337
545F337nK02L35M3n5J52L36J27O5K73M39K31L9K47L43N1j83J09L75Q4k23j5J77j15k14K44
$$ 6337 6332 6534 6869 6912 6857 7009 7345 7472 7537 7810 8249 8480 8519 8766 9109 9160 8977 9086 9461 9545 9322 9307 9484 9369 9155 9399
542I399N91L00J12M88P90M16J41O81J212R21O14J155J360M87J33J423K776K651L337O792J0917
$$ 9399 9990 10290 10402 10890 11680 12096 12237 12918 14130 15051 15665 16820 18180 18667 18800 20223 22999 25650 28987 35779 46696
540D6696J4954K5389M6905O6926O1890K4164k3820n1638n0931l7145k6034j9570j3868q921
$$ 46696 61650 87039 133944 200870 262760 286924 263104 211466 160535 123390 97356 77786 63918 54997
538E4997o798o130m507k654k031j960j169l03o78j547j547r54r54j325j118o96o97j046p55
$$ 54997 48199 42069 37562 34908 32877 30917 29748 29445 28767 27220 25673 24719 23765 22440 21322 20626 19929 18883 18128
536A8128k32k33m16m17j83l91o09m02Q5K10j8j9k7k35m63k56J35J35o6o5J22q7l28k04J16
$$ 18128 17896 17663 17247 16830 16647 16256 15647 15245 15330 15540 15522 15503 15476 15241 14778 14522 14657 14792 14726 14661 14783 14696 14368 14164 14280
533A4280J16n4P2M15M15L59O50J288J828J738J113K9j095j729j730j299j009q89n98j81j82
$$ 14280 14396 14342 14414 14829 15244 15603 16253 17541 19369 21107 22220 22249 21154 19425 17695 16396 15387 14498 13900 13719 13537
530A3537k14k13j10j10l16l15j83l07m83m84j78j79k00k00L8L7l3R1K85K84j1j36o6o5k51
$$ 13537 13323 13110 13000 12890 12574 12259 12076 11769 11286 10802 10624 10445 10245 10045 10083 10120 10087 10178 10463 10747 10736 10600 10534 10469 10218
527A0218k50j47j47l13l13k37j13j58j58j51j50j57j57q7q6q5M0J56J57j8j8K11K11R0R1O0
$$ 10218 9968 9821 9674 9361 9048 8811 8698 8540 8382 8231 8081 7924 7767 7680 7594 7509 7549 7705 7862 7844 7826 8037 8248 8338 8429 8489
524H489N9o2o2%Jj48j47q5q5j79j79j17j17j01j02pqj61j61J7J6q9q9l7l7mlJ11J11k3k4M9
$$ 8489 8548 8486 8424 8424 8425 8277 8130 8045 7960 7781 7602 7485 7368 7267 7165 7158 7150 6989 6828 6845 6861 6772 6683 6646 6609 6605 6602 6713 6824 6801 6777 6826
520F826N0N7N8J72J72K5K4K4K5l6l6N7N8llJ32J32L0K9J03J02Q6Q7K21K22J40J40J71J71J40
$$ 6826 6876 6933 6991 7163 7335 7360 7384 7408 7433 7397 7361 7418 7476 7473 7470 7602 7734 7764 7793 7896 7998 8084 8171 8392 8614 8754 8894 9065 9236 9376
516I376J40K55K55K17K17K82M07M97M98N36N37N86N86P21P21P83P82R55J162J240J364J497
$$ 9376 9516 9771 10026 10243 10460 10742 11149 11646 12144 12680 13217 13803 14389 15110 15831 16614 17396 18351 19513 20753 22117 23614
514B3614J621J701J700J836J836J818J693J497J290R65O74L46k8n75j115j699k239k679k887
$$ 23614 25235 26936 28636 30472 32308 34126 35819 37316 38606 39571 40245 40591 40563 39988 38873 37174 34935 32256 29369
511B9369k778k486k298k090j866j658j463j254r87p78p07p07n67m42m93m94m83l58k99l00
$$ 29369 26591 24105 21807 19717 17851 16193 14730 13476 12489 11711 11004 10297 9730 9288 8795 8301 7818 7460 7161 6861
509F861j98j99k58k59k57j31q9q9q1q2j53j54q0q1n7n6n7n7q4q5q4q5o1o1o2o1oppom8m7M
$$ 6861 6663 6464 6206 5947 5690 5559 5470 5381 5300 5218 5065 4911 4831 4750 4693 4637 4580 4523 4439 4354 4270 4185 4124 4063 4001 3940 3934 3927 3920 3914 3866 3819 3823
505C823O7pj11q8k6L2l1m3m4j3j4j3j4k4k5k4k4k4k4k3k4o2o3L1L1L0K9m3m4l3l4J8J9l8l8
$$ 3823 3890 3883 3772 3684 3658 3690 3659 3616 3572 3559 3545 3532 3518 3494 3469 3445 3421 3397 3373 3350 3326 3264 3201 3232 3263 3293 3322 3279 3235 3202 3168 3186 3205 3167 3129
500C129l7l8k1k2j08j09p1L3J24J24J3r0q4q4k9k9O5O4n1n1n1n1N9O0N9N9n4n4M0M0m1m0L2
$$ 3129 3092 3054 3033 3011 2903 2794 2723 2756 2880 3004 3017 2927 2843 2759 2730 2701 2766 2830 2779 2728 2677 2626 2685 2745 2804 2863 2809 2755 2795 2835 2794 2754 2786
496B786L3k1k0k4k4j7q0j6Q9L5o8r4l2no8j8Q6J01L8j2N1Q2J9o0o1p3j36j07lK3K3kkj3j3
$$ 2786 2819 2798 2778 2754 2730 2713 2633 2617 2706 2741 2673 2579 2547 2542 2474 2456 2542 2643 2681 2669 2720 2802 2821 2761 2700 2627 2491 2384 2381 2404 2427 2425 2423 2410 2397
492B397j3j3P0P0J8J8j5j5j8j9N4qm3J9O8No0n9l6l5l6l5J5J6j5j6J15J15Q8K5j3j3p9q0o3
$$ 2397 2384 2371 2441 2511 2529 2547 2532 2517 2499 2480 2534 2526 2483 2502 2570 2575 2515 2456 2420 2385 2349 2314 2329 2345 2330 2314 2429 2544 2632 2657 2644 2631 2552 2472 2409
488B409o4KO4Q4K3m3m3O6O6m1j03j00l7j4j5m1m1m5J8P1P0J3J2k2k2RRp6p5MJ09J18J5k5k4
$$ 2409 2345 2347 2411 2495 2518 2475 2432 2498 2564 2523 2420 2320 2283 2269 2254 2213 2172 2127 2145 2216 2286 2299 2311 2289 2267 2276 2285 2209 2134 2138 2247 2365 2380 2355 2331
484B331oop2rN1N0pqn5n6k3k4jjmN8N2N2opm1m2m5J7J2J3k3M0O6Mo1o0J3J3q7q7lN9K4K4N3
$$ 2331 2325 2319 2247 2238 2289 2339 2332 2324 2269 2213 2190 2166 2165 2164 2160 2218 2270 2322 2316 2309 2268 2226 2181 2198 2210 2223 2200 2240 2306 2310 2249 2189 2202 2215 2128 2041 2038 2097 2121 2145 2198
479B198N2rj0RQm9n0QP0L5L5L0L0On5j6M7J12J12O5O4J23J22J23O0n6j19o8o9rj0p5p6j07
$$ 2198 2250 2241 2231 2240 2248 2199 2149 2157 2227 2262 2297 2327 2357 2363 2308 2292 2339 2451 2563 2628 2692 2815 2937 3060 3120 3064 2945 2877 2808 2799 2789 2714 2638 2531
474B531j07m1m1j0rl9l9K3K4k3k2RRllllooK6K5n1n1J2J2l4l4l4l4j1j2j2j1L3L4qN5O9l5
$$ 2531 2424 2383 2342 2332 2323 2284 2245 2268 2292 2269 2247 2256 2265 2262 2259 2256 2253 2247 2241 2267 2292 2241 2190 2202 2214 2180 2146 2112 2078 2067 2055 2043 2032 2065 2099 2091 2146 2215 2180
470B180p0qL4L5k5k4L9L8R4R4N1n3j20j5M4j8j16n3Q7Q7r0r0M0J44M0o4o9o8j3j3QQm8m7m5
$$ 2180 2110 2102 2136 2171 2146 2122 2161 2199 2293 2387 2438 2385 2265 2250 2294 2276 2160 2107 2194 2281 2191 2101 2141 2285 2325 2261 2192 2124 2111 2098 2106 2114 2066 2019 1974
465A974N9R9L6qrN1N0j0j0p2p2j2j2N1N1k3k2RRk2k2k1k2k9k8r1r1R9R9nnL8L9L9L9o5o5k
$$ 1974 2033 2132 2168 2160 2151 2202 2252 2242 2232 2160 2088 2076 2064 2115 2166 2143 2121 2130 2139 2117 2095 2074 2052 2023 1995 1904 1813 1912 2011 2006 2001 2039 2078 2117 2156 2091 2026 2024
461B024kL5L6MNKJK9L0O5Ko6o6l2l2l1l2M2M2k1k0mmlmL2L2K9K8M0k3q7q8L3R5K2q3q2K3O1
$$ 2024 2022 2057 2093 2097 2102 2104 2105 2134 2164 2229 2231 2165 2099 2067 2035 2004 1972 2014 2056 2035 2015 2011 2007 2004 2000 2032 2064 2093 2121 2161 2138 2051 1963 1996 2091 2113 2030 1948 1971 2032
456B032O2j4j5M4M4N9mp3p3l4l4K5K5M9j3p8p8KO4Nn7oN6J7J7j2j2j1j2L9L9k7q8r3l0ppn
$$ 2032 2094 2080 2065 2109 2153 2212 2208 2135 2062 2028 1994 2019 2044 2093 2080 2002 1924 1926 1990 1995 1938 1932 1988 2005 2022 2010 1998 1987 1975 2014 2053 2026 1938 1845 1815 1808 1801 1796
451A796oN7N7P8P9Rn3r2r2o8pQ6Q6O3%k2k2o1KN1N2ppL3L4o7o7OO9K9p4o8o8rN3R4L3l3l2
$$ 1796 1790 1847 1904 1982 2061 2070 2017 1925 1833 1765 1758 1844 1930 1993 1993 1971 1949 1888 1890 1941 1993 1986 1979 2012 2046 1979 1912 1918 1987 2016 1942 1874 1806 1797 1850 1944 1977 1944 1912
446A912J09J09j1j14l1J15R1j3n4N0Q2K0m4m4qp1r5l2P5P5J9J9J9J9m9m8m9m8qqN5N4N3N3
$$ 1912 2021 2130 2119 2005 1974 2089 2180 2167 2113 2163 2245 2265 2221 2177 2169 2098 2003 1971 2046 2121 2140 2159 2178 2197 2148 2100 2051 2003 1995 1987 2042 2096 2149 2202
442B202j4j39r9K6R4R3oopoj8j7Q6Q7J5J5J5J5k9k9l0k9l0l1K4K4l8j63j63l8R1R2m2m2j9
$$ 2202 2188 2049 1950 1976 2070 2163 2157 2151 2144 2138 2120 2103 2189 2276 2291 2306 2321 2336 2307 2278 2248 2219 2189 2158 2182 2206 2168 2005 1842 1804 1895 1987 1945 1903 1884
438A884M3Q2m2j00l8K4K4K7K7K3K3j1p3m6P9J16J15l2j56r0k8L3L4R0R0K7K8m8m8m8m8J4J4
$$ 1884 1927 2009 1967 1867 1829 1853 1877 1904 1931 1954 1977 1966 1893 1847 1926 2042 2157 2125 1969 1879 1851 1884 1918 2008 2098 2125 2153 2105 2057 2009 1961 1975 1989
434A989J4J4j6j6j6j6J52J53L9q6j13n0l1l1K6K6K6K6M8M7j4j4nnk4q7j2J12J71M6m0m0J5
$$ 1989 2003 2017 2001 1985 1969 1953 2105 2258 2297 2211 2098 2048 2017 1986 2012 2038 2064 2090 2138 2185 2171 2157 2152 2147 2123 2036 2024 2136 2307 2353 2313 2273 2288
430B288J4qrrrj1j1j1j2PPPPk0k1j7j6n0J4L6o7j32j31QQM9M9j5p8p8j5M7j5q4k3J23J22J3
$$ 2288 2302 2294 2285 2276 2267 2256 2245 2234 2222 2229 2236 2243 2250 2230 2209 2192 2176 2126 2140 2176 2109 1977 1846 1854 1862 1911 1960 1945 1867 1789 1774 1821 1806 1722 1699 1822 1944 1957
425A957m9m6m5k5k4POK6K5K5K6k8k7L5L5n0n0k2L9O5O4l6l5j6j5M7M7M0L9o1o0l3L1R2L1l0
$$ 1957 1908 1862 1817 1792 1768 1775 1781 1807 1832 1857 1883 1855 1828 1863 1898 1848 1798 1776 1815 1880 1944 1908 1873 1857 1842 1889 1936 1976 2015 1954 1894 1861 1892 1984 2015 1985
421A985l0K9K9M2M1J4m9j02j01kkMNn5n4r0k7M2M2n1n1k4L9O0O1L4L3K6K7L0l3j03j04LO5
$$ 1985 1955 1984 2013 2055 2096 2110 2061 1959 1858 1856 1854 1858 1863 1808 1754 1664 1637 1679 1721 1670 1619 1595 1634 1694 1755 1789 1822 1848 1875 1905 1872 1769 1665 1668 1733
417A733L6L6M0M0p9q0j1N2N8N7L4k8q0p9k1k1j4j4m4m5m7m8j2j2qN5J20J20M8j5j1j1J2J1
$$ 1733 1769 1805 1845 1885 1806 1726 1715 1767 1825 1882 1916 1888 1808 1729 1708 1687 1673 1659 1615 1570 1523 1475 1463 1451 1443 1498 1618 1738 1786 1771 1760 1749 1761 1772
412A772j9k0o1o0L9M0qp0m3K0J5m8m4J9O8O9L7L7On7j22j22mN8K4K3L3L2L3L2n1n1PQj5p7
$$ 1772 1753 1733 1672 1612 1651 1691 1683 1613 1570 1590 1605 1557 1513 1532 1600 1669 1706 1743 1749 1692 1570 1448 1444 1502 1526 1549 1582 1614 1647 1679 1628 1577 1584 1592 1577 1500
408A500m2O2J14N1n6j18p3j0N4N4M6M5J4J3K5K4p6p5j1N2K1m2p0o9j1j1l6l5O4O5P8J6j1j2
$$ 1500 1458 1520 1634 1685 1629 1511 1438 1428 1482 1536 1582 1627 1641 1654 1679 1703 1627 1552 1541 1593 1614 1572 1502 1433 1422 1411 1375 1340 1404 1469 1547 1563 1552 1540
404A540NMk2k3K8Q9N5m9r1k9P6P5n7n7PP1N0j3l6l6M3M3J9m3n2J1L8k5q7q7N5N4L2L1N9N9
$$ 1540 1545 1549 1527 1504 1532 1621 1676 1627 1536 1507 1583 1658 1601 1544 1551 1622 1672 1659 1623 1587 1630 1673 1692 1649 1597 1608 1646 1621 1534 1447 1502 1556 1588 1619 1678 1737
399A737lo4pN7K3l8o6mN1N1N9lp1p0m7J6M2M2j6j6L6L6k5q7k9R6N7np7p7j9j9J0J0J0J0RR
$$ 1737 1734 1670 1663 1720 1743 1705 1639 1635 1686 1737 1796 1793 1722 1652 1605 1621 1663 1705 1689 1673 1709 1745 1720 1633 1604 1700 1757 1752 1675 1598 1579 1560 1570 1580 1590 1600 1609 1618
395A618P2P1p4p4K9R1N1p3o1o1QRRRNMNNl5l4K8K8klO0O0L1L2p3p3m6m6N7J19Q2m4o6nJ5J4
$$ 1618 1690 1761 1687 1613 1642 1733 1784 1711 1650 1589 1597 1606 1615 1624 1629 1633 1638 1643 1608 1574 1602 1630 1628 1625 1685 1745 1776 1808 1735 1662 1616 1570 1627 1746 1828 1784 1718 1713 1728 1742
390A742J9J8rrrrL4L4L3L4N1N2N2N2L1L2L1L2J68J68J76J76K53L77O09Q18J099J474J901K191
$$ 1742 1761 1779 1770 1761 1752 1743 1777 1811 1844 1878 1929 1981 2033 2085 2116 2148 2179 2211 2379 2547 2723 2899 3152 3529 4138 4956 6055 7529 9430 11621
386A1621K176J802J015k4j025j649j858j796j596j304j058p67o01m76k86j61j89j89j19j19
$$ 11621 13797 15599 16614 16590 15565 13916 12058 10262 8666 7362 6304 5537 4936 4460 4174 4013 3824 3635 3516 3397
384C397q0q0p9q0n7n7n7n6mlmlM9M9n5n5o1o2Q5Q4J1J1P3P3Q7Q6Q6Q6J88J87J95J96K78M03
$$ 3397 3317 3237 3158 3078 3021 2964 2907 2851 2847 2844 2840 2837 2886 2935 2880 2825 2764 2702 2787 2871 2882 2893 2966 3039 3126 3212 3298 3384 3572 3759 3954 4150 4428 4831
380D831O04Q12J157J699K646M019N428N970N002K464o98l236m441m441l783l075k406j783
$$ 4831 5435 6247 7404 9103 11749 15768 21196 27166 32168 34632 33934 30698 26257 21816 18033 14958 12552 10769
377A0769j296r22p19n94m34l09k11j50j26kR5K20L36L99L64L64K65J41l1j56k35k36j80j81
$$ 10769 9473 8551 7832 7238 6804 6495 6284 6134 6008 6006 6101 6321 6657 7056 7420 7784 8049 8190 8159 8003 7768 7532 7352 7171
375G171j41j42m1m1k4q7j22LJ12J11J19J20J16J17k1k1O4J89K84L47M77O86R06J197J453J744
$$ 7171 7030 6888 6847 6806 6782 6695 6573 6576 6688 6799 6918 7038 7154 7271 7250 7229 7293 7482 7766 8113 8590 9276 10182 11379 12832 14576
371A4576J843J718J104K30o25j167j442j443j231r41o17m10k64n6J28K52M92P00R45J235J663
$$ 14576 16419 18137 19241 19471 18846 17679 16237 14794 13563 12622 12005 11595 11331 11275 11403 11655 12147 12847 13792 15027 16690
369A6690K120K014J057l84j425j786j661j505j297j018q10o65n39m25l01l23l86m12l48k70
$$ 16690 18810 20824 21881 21497 20072 18286 16625 15120 13823 12805 11995 11330 10791 10366 10065 9742 9356 8944 8596 8326
366H326k07j07J7j4p6j01j02j37j37k36k37j73j74l0k9L3L4R3R3K72K73K02P7p3p4R9K23L24
$$ 8326 8119 8012 8029 8015 7939 7838 7736 7599 7462 7226 6989 6816 6642 6612 6583 6616 6650 6743 6836 7108 7381 7583 7660 7587 7513 7612 7835 8159
363H159M50O62Q70J027R02M77o3n32p39n65l56k20k20l20l82m61n85n94n32m57l33k82k83
$$ 8159 8609 9271 10141 11168 12070 12547 12484 11952 11213 10648 10292 10072 9852 9532 9150 8689 8104 7510 6978 6521 6188 5906 5623
360E623k43k44j84j84j21j21j18j18n6n6k4k4q7q7k5k4q7q7q9q9J5J5l7l6onK9L0K9K9K1K0
$$ 5623 5380 5136 4952 4768 4647 4526 4408 4290 4234 4178 4154 4130 4043 3956 3931 3907 3820 3733 3644 3555 3570 3585 3548 3512 3506 3501 3530 3560 3589 3618 3639 3659
356C659Q4Q3J04J04K04K05K54J92O5o1j74k37k41k40k44k44j73m8o2j26j72j10J8J43Q4m1
$$ 3659 3743 3826 3930 4034 4238 4443 4697 4889 4954 4893 4719 4482 4241 4001 3757 3513 3340 3292 3230 3104 2932 2822 2840 2983 3067 3026
353C026j11j11j5j5KKo0o0lllmp2p3j0j0j2j2m3m3J8J9J9J8J4J4m8m9k6k7P8P8NOn7n7k8k8
$$ 3026 2915 2804 2789 2774 2776 2778 2718 2658 2655 2652 2649 2645 2573 2500 2490 2480 2468 2456 2413 2370 2388 2407 2426 2444 2458 2472 2424 2375 2349 2322 2400 2478 2483 2489 2432 2375 2347 2319
348B319P6P7m9m9j7j8L5L5k7k7llllm6m6J7J7j2j2N0N0J2J1J2J1k9l0l0k9J2J2q5q6m8N7J33
$$ 2319 2395 2472 2423 2374 2357 2339 2374 2409 2382 2355 2352 2349 2346 2343 2297 2251 2268 2285 2273 2261 2311 2361 2373 2384 2396 2407 2378 2348 2318 2289 2301 2313 2228 2142 2094 2151 2284
344B284P0J8m6p6p6qqR6R7K6K6l7l6o6o6P7J39P0p6j71j08M3M2J5J6n7n7n7n7k2k2k2k2M2
$$ 2284 2354 2372 2326 2250 2174 2166 2158 2254 2351 2377 2403 2366 2330 2264 2198 2275 2414 2484 2408 2237 2129 2172 2214 2229 2245 2188 2131 2074 2017 1995 1973 1951 1929 1971
340A971M2k0k1j0j1j1j1MMLMmmlmJ9K0K0K0N9O0N9O0p1p1m0m0K1K2q2q3n7n7NOlkO0O0J8J8
$$ 1971 2013 1993 1972 1962 1951 1940 1929 1933 1937 1940 1944 1940 1936 1933 1929 1948 1968 1988 2008 2067 2127 2186 2246 2175 2104 2064 2024 2045 2067 1985 1902 1845 1788 1793 1799 1796 1794 1854 1914 1932 1950
335A950m5m4j2j3m3m3N4N3n0n0j9j8Q6Q6L1L1l1l1o3o3%%R2R2n3n4l3l3l2l3M7M6n7n8N6N6
$$ 1950 1905 1861 1849 1836 1793 1750 1804 1857 1807 1757 1738 1720 1806 1892 1923 1954 1923 1892 1829 1766 1766 1766 1858 1950 1897 1843 1810 1777 1745 1712 1759 1805 1748 1690 1746 1802
330A802opk2k2Q2Q2L4L4k8k8q7q7k4k4L7L8L8L7N4N4n0n0RQk3k2J0J1J0J1m8m9J4J4k1k1k1
$$ 1802 1796 1789 1767 1745 1827 1909 1943 1977 1949 1921 1834 1747 1723 1699 1736 1774 1812 1849 1903 1957 1907 1857 1866 1874 1851 1829 1839 1850 1860 1871 1823 1774 1788 1802 1781 1760 1739
326A739k1L5L5L5L5j5j4j4j5POPOk9k9k9l0L0K9kknno8o7J4J5P7P7K7K7l5l6n8n9q9r0P7P7
$$ 1739 1718 1753 1788 1823 1858 1843 1829 1815 1800 1807 1813 1820 1826 1797 1768 1739 1709 1739 1768 1766 1764 1759 1754 1686 1619 1633 1648 1725 1802 1829 1856 1821 1785 1727 1668 1579 1489 1566 1643
321A643J4m8j3R2R5L3l2l2K6K7o3o3l2l2M3M3k0j9m0l9K3K3K1K1m1m2ooK5K6O7O7p4p4j8M4
$$ 1643 1657 1609 1596 1688 1783 1816 1784 1752 1778 1805 1742 1679 1647 1615 1658 1701 1681 1662 1622 1583 1606 1629 1650 1671 1630 1588 1582 1576 1601 1627 1694 1761 1687 1613 1595 1639
$$ [...]
##$OBSERVED INTEGRALS=	(X Y Z)
(7.3053332281104106372, 7.4342792884574722123, 4.8371031091301368576)
(7.1604765970943997644, 7.248876778279162103, 2.1135358364011747057)
(6.987953194114974842, 7.0514053201531208259, 1.937982318558631345)
(6.955861907065256311, 6.987953194114974842, 2.0788725134618739609)
(6.9035989538700004431, 6.955861907065256311, 5.2174113290321271208)
(6.7237013005371641938, 6.8224874725317974367, 0.96860924117608471207)
(3.8182509275185236852, 3.940706270274510814, 9.880236747692547894)
(3.7879934283002181239, 3.8182509275185236852, 5.4551471548826677704)
(3.7507948308677923066, 3.7879934283002181239, 1.329783632847535646)
(3.3527926955263125386, 3.4145075888940010778, 0.81587149080617948904)
(1.324697990441915163, 1.3696930527151165435, 3.5923574830067876995)
(1.2577850139590536216, 1.3027800762322550021, 1.5455632126868203979)
(0.86505481047956533924, 0.98689759959375156217, 2.2275259303174350656)
##END=	
##TITLE=	Jan31-2020.30.fid
##JCAMP-DX=	6.0	$$ MestReNova 14.1.0-24037
##BLOCK_ID=	3
##DATA TYPE=	NMR PEAK TABLE
##DATA CLASS=	PEAK TABLE
##CROSS REFERENCE=	NMR SPECTRUM: BLOCK_ID=2                                     
##.OBSERVE FREQUENCY=	400.05240029999998796
##.OBSERVE NUCLEUS=	^1H
##NPOINTS=	166
##FIRSTX=	0.88755234161616591848
##LASTX=	7.7429728304120164495
##XFACTOR=	1
##YFACTOR=	1
##FIRSTY=	15.624850283367420545
##XUNITS=	PPM
##YUNITS=	ARBITRARY UNITS
##PEAK TABLE=	(XYW..XYW)
0.88755234161616591848,15.624850283367420545,0.0031398251766889349185
0.90499106589469990869,64.032966178707496852,0.0069383756817025009703
0.92076172424040025888,123.98278733116190153,0.0034931890216257873751
0.92719099618949663011,94.931954111880457958,0.002977760049975784664
0.93786638655743270743,21.008044003347148276,0.003637077999822623843
0.94579935342822829547,236.60652131505224816,0.0023313566222942570631
0.96440006845715098294,110.50186009037244617,0.0028270574174020369866
1.1885552632806903883,6.852365897714548737,0.0030521316510635958588
1.2802825450956543119,271.56134693537035218,0.0071849221053575246243
1.3089646209485561457,16.783826868506086072,0.0076937609640221884741
1.3278747591589443733,67.536370916823685207,0.0022081979078939798986
1.3420260925012224007,50.874268702672331699,0.004186098644258436606
1.3471955215785158533,2128.0575406454559015,0.0019172999557472906844
1.3728609822784403338,17.763242138474367948,0.005145380948548782668
1.3836183719601000686,9.4189492174781044298,0.0017354791393083570088
1.400096040495950156,8.1687506664577220761,0.0023190541137089936904
1.4184811366346858907,23.053203893719377504,0.0030082348406989339006
1.4308613005451196187,18.563342457576549549,0.0029950934691111482516
1.4353099137258085172,23.534938823644999673,0.0057367462978175206775
1.4471323660731907346,22.391925099215352901,0.005219485881630149364
1.465581406051629676,23.063570208332340172,0.0031398251766889349185
1.4844280014197395179,9.3371552670019006825,0.0033011500936012366618
$$ [...]
Compound,None,,1,-0.090138816701643101337,0,0
Compound,None,,1,0.24387018064489132674,0,0
Compound,None,,1,1.2525656641535092284,0,0
Compound,None,,1,0.46086289280178704963,0,0
Compound,None,,1,0.25301244781028292552,0,0
Compound,None,,1,-0.2000000000000000111,0,0
Compound,None,,1,0.40000000000000007772,0,0
Compound,None,,1,0.8854362914027437137,0,0
Compound,None,,1,0.51114771000811476398,0,0
Compound,None,,1,0.97788087212858187947,0,0
Solvent,Artifact|Impurity|Weak|13C Sat.,,1,-0.04972601983537774939,0,0
Compound,None,,1,0.2000000000000000111,0,0
Compound,None,,1,0.81448785926830757909,0,0
Artifact,Artifact|Weak,,1,1.8650252978172183749,0,0
Impurity,Artifact|Weak,,1,0,0,0
Compound,None,,1,0.089745158394459859097,0,0
Compound,None,,1,0.5285941911235002566,0,0
Compound,None,,1,-0.86265420372556056439,0,0
Compound,None,,1,-0.4258513966647955451,0,0
Compound,None,,1,0.25478716555891306461,0,0
Compound,None,,1,0.43103900686005069964,0,0
Artifact,Artifact|Weak,,1,0.388434465761449077,0,0
Compound,None,,1,-0.049135211261027843255,0,0
Compound,None,,1,0.44903937490848838676,0,0
Solvent,None,,1,0.21553479718821139111,0,0
Artifact,Artifact|Weak,,1,1.9664345261212845539,0,0
Artifact,Artifact|Weak,,1,0.2346109690786588875,0,0
Artifact,Artifact|Weak,,1,0.34619956989600758623,0,0
Artifact,Artifact|Weak,,1,-0.34293752403999899769,0,0
Artifact,Artifact|Weak,,1,-0.16825221150264529912,0,0
Artifact,Artifact|Weak,,1,1.3999999999999999112,0,0
Artifact,Artifact|Weak,,1,1.999999999999999778,0,0
Artifact,Artifact|Weak,,1,1.1531809026956831854,0,0
Artifact,Artifact|Weak,,1,1.5999999999999998668,0,0
Artifact,Artifact|Weak,,1,1.999999999999999778,0,0
Artifact,Artifact|Weak,,1,1.999999999999999778,0,0
Artifact,Artifact|Weak,,1,1.5999999999999998668,0,0
Artifact,Artifact|Weak,,1,-0.026009358394957257654,0,0
Compound,None,,1,0.090389116141718961472,0,0
Compound,None,,1,-0.48478916830174717534,0,0
Compound,None,,1,0.29491959376713061669,0,0
Compound,None,,1,-0.85265835459265248986,0,0
Compound,None,,1,-0.68185917186014588509,0,0
Compound,None,,1,-0.87530516841947547668,0,0
Compound,None,,1,0.23370494500624122702,0,0
Compound,None,,1,-0.46305661355485444597,0,0
Compound,None,,1,-0.058234904565590828174,0,0
Compound,None,,1,1.1077334058187531252,0,0
Compound,None,,1,0.59002658481408576385,0,0
Compound,None,,1,0.40000000000000007772,0,0
Compound,None,,1,0.45110884619536850693,0,0
Compound,None,,1,0.10264719338598127241,0,0
Compound,None,,1,-0.74250034645716223025,0,0
Compound,None,,1,0.40000000000000007772,0,0
Solvent,Artifact|Impurity|Weak|13C Sat.,,1,0.30137494598168246274,0,0
Impurity,None,,1,0.26036494720548281068,0,0
Impurity,None,,1,0.2000000000000000111,0,0
Impurity,None,,1,0.2000000000000000111,0,0
Impurity,None,,1,-0.86574787991542723198,0,0
Impurity,None,,1,0.53161250637263179897,0,0
Impurity,None,,1,0.2000000000000000111,0,0
Impurity,None,,1,0.60000000000000008882,0,0
Impurity,None,,1,0.20000000000000006661,0,0
##END=	
##END=	
