##TITLE=	Feb07-2020.40.fid
NP001
##JCAMP-DX=	6.0	$$ MestReNova 14.1.0-24037
##DATA TYPE=	LINK
##BLOCK_ID=	1
##BLOCKS=	1    
##ORIGIN=	Mestrelab Research S.L.
##OWNER=	np619
##$MNOVA/LINK_BLOCK_TYPE=	ITEM	$$ NMR Spectrum
##$MNOVA/ITEM/POLYGON=	(XY..XY)
5321,5835
8722,5835
8722,8208
5321,8208
5321,5835
##$MNOVA/ITEM/Z=	0
##$MNOVA/ITEM/ANGLE=	0
##TITLE=	Feb07-2020.40.fid
##JCAMP-DX=	6.0	$$ MestReNova 14.1.0-24037
##BLOCK_ID=	2
##DATA TYPE=	NMR SPECTRUM
##DATA CLASS=	XYDATA
##NUMDIM=	1
##ORIGIN=	Bruker BioSpin GmbH
##OWNER=	nmrsu
##.OBSERVE FREQUENCY=	400.05240029999998796
##.OBSERVE NUCLEUS=	^1H
##.SOLVENT NAME=	CDCl3
##.PULSE SEQUENCE=	zg30
##LONGDATE=	2020/02/07 14:46:00.000
##.ACQUISITIONMODE=	SIMULTANEOUS (DQD)
##$ORIGINAL FORMAT=	Bruker XWIN-NMR
##$MNOVA/SCALES_VERSION=	8
##$PARAMETER FILE=	(acqus, ASCII, //ch-nmrserv2.ch.ic.ac.uk/Av400D/ug1/nmr/Feb07-2020/40/acqus, 0)
$$ ##TITLE= Parameter file, TOPSPIN		Version 3.2
$$ ##JCAMPDX= 5.0
$$ ##DATATYPE= Parameter Values
$$ ##NPOINTS= 11	$$ modification sequence number
$$ ##ORIGIN= Bruker BioSpin GmbH
$$ ##OWNER= nmrsu
$$ $$ 2020-02-07 14:46:36.010 +0000  nmrsu@nmrpc
$$ $$ /opt/topspin/data/ug1/nmr/Feb07-2020/40/acqus
$$ $$ process /opt/topspin3.2/prog/mod/shimcntl
$$ ##$ACQT0= -2.04831932773109
$$ ##$AMP= (0..31)
$$ 100 100 100 100 100 100 100 100 100 100 100 100 100 100 100 100 100 100
$$ 100 100 100 100 100 100 100 100 100 100 100 100 100 100
$$ ##$AMPCOIL= (0..19)
$$ -1 0 0 0 0 0 0 0 0 0 0 0 0 0 0 0 0 0 0 0
$$ ##$ANAVPT= -1
$$ ##$AQSEQ= 0
$$ ##$AQ_mod= 3
$$ ##$AUNM= <au_zg>
$$ ##$AUTOPOS= <33 >
$$ ##$BF1= 400.05
$$ ##$BF2= 400.05
$$ ##$BF3= 400.05
$$ ##$BF4= 400.05
$$ ##$BF5= 400.05
$$ ##$BF6= 400.05
$$ ##$BF7= 400.05
$$ ##$BF8= 400.05
$$ ##$BYTORDA= 0
$$ ##$CAGPARS= (0..11)
$$ 0 0 0 0 0 0 0 0 0 0 0 0
$$ ##$CFDGTYP= 0
$$ ##$CFRGTYP= 9
$$ ##$CHEMSTR= <none>
$$ ##$CNST= (0..63)
$$ 1 1 1 1 1 1 1 1 1 1 1 1 1 1 1 1 1 1 1 1 1 1 1 1 1 1 1 1 1 1 1 1 1 1 1 1
$$ 1 1 1 1 1 1 1 1 1 1 1 1 1 1 1 1 1 1 1 1 1 1 1 1 1 1 1 1
$$ ##$CPDPRG= (0..8)
$$ <> <> <> <> <> <> <> <> <>
$$ ##$D= (0..63)
$$ 0 1 0 0 0 0 0 0 0 0 0 0 0 0 0 0 0.0002 0 0 0 0 0 0 0 0 0 0 0 0 0 0 0 0
$$ 0 0 0 0 0 0 0 0 0 0 0 0 0 0 0 0 0 0 0 0 0 0 0 0 0 0 0 0 0 0 0
$$ ##$DATE= 1581086795
$$ ##$DE= 6.5
$$ ##$DECBNUC= <off>
$$ ##$DECIM= 2496
$$ ##$DECNUC= <off>
$$ ##$DECSTAT= 4
$$ ##$DIGMOD= 1
$$ ##$DIGTYP= 12
$$ ##$DQDMODE= 0
$$ ##$DR= 22
$$ ##$DS= 4
$$ ##$DSPFIRM= 0
$$ ##$DSPFVS= 20
$$ ##$DTYPA= 0
$$ ##$EXP= <proton>
$$ ##$F1LIST= <>
$$ ##$F2LIST= <>
$$ ##$F3LIST= <>
$$ ##$FCUCHAN= (0..9)
$$ 0 2 0 0 0 0 0 0 0 0
$$ ##$FL1= 90
$$ ##$FL2= 90
$$ ##$FL3= 90
$$ ##$FL4= 90
$$ ##$FOV= 20
$$ ##$FQ1LIST= <>
$$ ##$FQ2LIST= <>
$$ ##$FQ3LIST= <>
$$ ##$FQ4LIST= <>
$$ ##$FQ5LIST= <>
$$ ##$FQ6LIST= <>
$$ ##$FQ7LIST= <>
$$ ##$FQ8LIST= <>
$$ ##$FRQLO3= 15959.0749999881
$$ ##$FRQLO3N= 2
$$ ##$FS= (0..7)
$$ 83 83 83 83 83 83 83 83
$$ ##$FTLPGN= 0
$$ ##$FW= 125000
$$ ##$FnMODE= 0
$$ ##$FnTYPE= 0
$$ ##$GPNAM= (0..31)
$$ [...]
$$ 130000 130000 130000 130000 130000 130000 130000 130000 130000 130000 130000
$$ 130000 130000 130000 130000 130000 130000 130000 130000 130000 130000 130000
$$ 130000 130000 130000 130000 130000 130000 130000 0 0 0 0 0 0 0 0 0 0 0
$$ 0 0 0 0 0 0 0 0 0 0 0 0 0
$$ ##$ShimPowMaxUC= (0..63)
$$ 130000 130000 130000 130000 130000 130000 130000 130000 130000 130000 130000
$$ 130000 130000 130000 130000 130000 130000 130000 130000 130000 130000 130000
$$ 130000 130000 130000 130000 130000 130000 130000 130000 130000 130000 130000
$$ 130000 130000 130000 130000 130000 130000 130000 0 0 0 0 0 0 0 0 0 0 0
$$ 0 0 0 0 0 0 0 0 0 0 0 0 0
$$ ##$ShimPowMaxUG= (0..63)
$$ 524287 524287 524287 524287 524287 524287 524287 524287 524287 524287 524287
$$ 524287 524287 524287 524287 524287 524287 524287 524287 524287 524287 524287
$$ 524287 524287 524287 524287 524287 524287 524287 524287 524287 524287 524287
$$ 524287 524287 524287 524287 524287 524287 0 0 0 0 0 0 0 0 0 0 0 0 0 0 0
$$ 0 0 0 0 0 0 0 0 0 0
$$ ##$ShimPowRcbType= 3
$$ ##$ShimPowRes= (0..63)
$$ 1e-20 1e-20 1e-20 1e-20 1e-20 1e-20 1e-20 1e-20 1e-20 1e-20 1e-20 1e-20
$$ 1e-20 1e-20 1e-20 1e-20 1e-20 1e-20 1e-20 1e-20 1e-20 1e-20 1e-20 1e-20
$$ 1e-20 1e-20 1e-20 1e-20 1e-20 1e-20 1e-20 1e-20 1e-20 1e-20 1e-20 1e-20
$$ 1e-20 1e-20 1e-20 1e-20 0 0 0 0 0 0 0 0 0 0 0 0 0 0 0 0 0 0 0 0 0 0 0 0
$$ ##$ShimPowRng0= (0..63)
$$ 1 1 1 1 1 1 1 1 1 1 1 1 1 1 1 1 1 1 1 1 1 1 1 1 1 1 1 1 1 1 1 1 1 1 1 1
$$ 1 1 1 1 0 0 0 0 0 0 0 0 0 0 0 0 0 0 0 0 0 0 0 0 0 0 0 0
$$ ##$ShimPowRng1= (0..63)
$$ 1 1 1 1 1 1 1 1 1 1 1 1 1 1 1 1 1 1 1 1 1 1 1 1 1 1 1 1 1 1 1 1 1 1 1 1
$$ 1 1 1 1 0 0 0 0 0 0 0 0 0 0 0 0 0 0 0 0 0 0 0 0 0 0 0 0
$$ ##$ShimPowRng2= (0..63)
$$ 1 1 1 1 1 1 1 1 1 1 1 1 1 1 1 1 1 1 1 1 1 1 1 1 1 1 1 1 1 1 1 1 1 1 1 1
$$ 1 1 1 1 0 0 0 0 0 0 0 0 0 0 0 0 0 0 0 0 0 0 0 0 0 0 0 0
$$ ##$ShimPowRng3= (0..63)
$$ 1 1 1 1 1 1 1 1 1 1 1 1 1 1 1 1 1 1 1 1 1 1 1 1 1 1 1 1 1 1 1 1 1 1 1 1
$$ 1 1 1 1 0 0 0 0 0 0 0 0 0 0 0 0 0 0 0 0 0 0 0 0 0 0 0 0
$$ ##$ShimSysFunc= (0..63)
$$ 1 2 3 4 5 6 7 8 9 10 0 37 38 35 16 15 14 13 12 11 28 27 26 25 24 23 36
$$ 22 30 29 20 21 34 33 32 31 17 18 19 0 0 0 0 0 0 0 0 0 0 0 0 0 0 0 0 0 0
$$ 0 0 0 0 0 0 0
$$ ##$ShimSysMatrix= 0
$$ ##$ShimSysType= 4
$$ ##$TFXNUM= 0
$$ ##$TRIPLO2= 0
$$ ##$VTU= 2
$$ ##$VTUETH= <149.236.99.20>
$$ ##$VTUTY= <no>
$$ ##$WBREFAM= (0..15)
$$ 136.7 118.7 100 100 100 100 100 100 100 100 100 100 100 100 100 100
$$ ##$WBREFLM= (0..15)
$$ 0 0 0 0 0 0 0 0 0 0 0 0 0 0 0 0
$$ ##$WBREFPH= (0..15)
$$ 77.55 -71.28 0 0 0 0 0 0 0 0 0 0 0 0 0 0
$$ ##$WBSGU= (0..15)
$$ 0 0 0 0 0 0 0 0 0 0 0 0 0 0 0 0
$$ ##$XFAC= 2
$$ ##END=
$$ 
##$DECIM=	2496
##$DSPFVS=	20
##XUNITS=	HZ
##YUNITS=	ARBITRARY UNITS
##FIRSTX=	6406.710256386850233
##LASTX=	-1606.1102564336499654
##DELTAX=	-0.12226780365942625795
##XFACTOR=	1
##YFACTOR=	0.0044198718762949321462
##FIRSTY=	7.4617161750793457031
##MINY=	0.21382291615009307861
##MAXY=	19922.748046875
##NPOINTS=	65536
##XYDATA=	(X++(Y..Y))
$$ [...]
1628I42no6p2k4Ppj5J9M5K1j0J2N3N0J2j2k5o0p9j8R9J50P5m7j03p7m1l1k1J3M6M5K3K4M3
1623I66K9l5p8l3O0R5L9l0m3j8oj0j1j2j4OM9O2Qn6n2OM1K8J4Rl0j08j39p1K6N5K7K9P2P6
1619I51mr8j25r1n1mQ2J77J79N7p8r5NR6Q6Pn3m9j6Kql1m3l0rlj0oK1M7L7mm3m6k5oMJ9L7
1614H79L6Lk3j2J6Rl3n2j4L9O2O6P8Q0M1k3o0n0k1JJ9L7M6M7L5J4NM4J03R7lq3l8P0R5K3k9
1610A504nK5J9L8J12J63J42J33K19L55M61N42O47P55Q12Q23Q34Q19P33N81M08K03n2l11n02
1607I458o30p40q21q32p89p35o59n45m43m16m08l26j94j19j22j19q7p6q7n8lj5r2j09k3N1
1604A061L6RM2N8j5q6l3P6Q2j9r3q9p3q3o6JN1N6N5O8L9m8j07o4L1P2L9PJ7K8no0o6MQ8J01
1599A114L4m0n3k6j7l1k7LL1L7L7K7pm5m1RN8O6M7J9k6q0r0l1L9M6kl7k2%jj1kJ7L5N0M7L
$$ plain form
1628 942 937 871 799 775 782 775 760 779 824 845 835 847 900 950 962 950 925 865 786 768 867 1017 1092 1045 942 865 824 793 772 785 831 876 899 923 966
1623 966 995 960 882 849 909 1004 1043 1013 970 952 946 936 925 913 899 905 954 1016 1024 968 916 922 963 991 1005 1014 984 876 737 666 692 747 774 803 875 951
1619 951 947 849 724 633 582 578 660 837 1016 1073 995 900 905 1001 1087 1094 1041 992 976 978 970 939 896 866 857 854 844 838 859 906 943 939 896 850 825 819 823 842 879
1614 879 915 918 895 883 899 908 875 823 809 848 910 976 1054 1134 1175 1152 1092 1042 1021 1022 1041 1078 1124 1171 1206 1220 1225 1269 1372 1469 1466 1383 1345 1415 1510 1533 1504
1610 1504 1499 1524 1543 1581 1693 1856 1998 2131 2350 2705 3166 3708 4355 5110 5922 6745 7579 8398 9131 9712 10120 10323 10271 9960 9458
1607 9458 8828 8088 7267 6435 5646 4911 4252 3707 3264 2848 2440 2114 1920 1801 1679 1560 1473 1397 1310 1252 1249 1234 1142 1033 1010 1061
1604 1061 1097 1106 1148 1206 1191 1105 1072 1148 1230 1211 1118 1029 956 873 807 808 859 915 970 1038 1077 1029 922 858 889 961 1000 1007 1024 1052 1047 987 921 925 1013 1114
1599 1114 1148 1108 1055 1029 1012 981 954 957 988 1025 1062 1089 1082 1037 996 1005 1063 1129 1176 1195 1169 1089 999 968 1007 1053 1051 1014 992 992 991 980 978 995 1030 1080 1127 1130
1594A130n5n7J4P3N0j2j3M9Q0M2NJ9K9rn2k5M1O2K5j6k6k2j6rk3o7r2l6N3O8j4q8p1mK4ll9
1590A015m8l0QL9M1K6L0M9L2k9o8m5rj8l9j5L1L7Jj6J0M0L4QmJ2L4L9J4k1l8m4n2m2J6Q4P7
1585A159mo1l7%j3k0M1J15J03L0J5Q0J22Q5K9J0OlOK8Rn8r6o9m4p6j10o9MJ3l9n1J1O0J9n7
1581A138n7L3J04P8rn4l4n%J2N4P3K0n1n3J0N1L6J3J5J5rk1prm2o0k6J9K2QL0N9L7k5o1m9
1577A255k8mM7J02J03M2nkPk2m2oM8M2j0l3j1Kj7k0K5O2L9k7p6q6p3k4N0Q7L4o3j01o2k0k0
1572A193rN6J15R6L0J2O4J08Q0Ol5qN1P5L8j2k0RK0ok1QN5P7Q2Q8Q1N3K9K5K1KlRro6r1l6
1567B167J3m4j48j55n3L9M6K0J3Jl0l6JL6M8P3J14J06L4k0NN3N1J7NJ5K0L7R2J46J43R1N9
1563B959O5P5N4J3j1PM7M5l0j16j15l3K7J0k4k8k8m1k0N0Q7L9j5QO3P7Q1J45K12J74N2j2K8
$$ plain form
1594 1130 1075 1018 1032 1105 1155 1143 1130 1179 1259 1301 1306 1325 1354 1345 1293 1268 1309 1371 1396 1380 1354 1332 1316 1307 1284 1217 1125 1089 1142 1210 1196 1108 1037 1033 1057 1054 1015
1590 1015 967 937 945 984 1025 1051 1081 1130 1162 1133 1065 1020 1011 993 954 939 970 1007 1008 992 1002 1042 1076 1084 1080 1092 1126 1165 1179 1158 1120 1076 1024 982 998 1082 1159
1585 1159 1155 1094 1057 1057 1044 1024 1065 1180 1283 1313 1328 1408 1530 1615 1644 1654 1660 1657 1663 1691 1700 1642 1546 1477 1433 1357 1247 1178 1182 1195 1156 1105 1116 1176 1195 1138
1581 1138 1081 1114 1218 1296 1287 1233 1199 1194 1194 1206 1260 1333 1353 1302 1249 1259 1310 1346 1359 1374 1389 1380 1359 1352 1343 1301 1241 1215 1234 1256 1264 1294 1353 1390 1365 1304 1255
1577 1255 1227 1223 1270 1372 1475 1517 1512 1510 1517 1495 1453 1447 1495 1537 1527 1494 1483 1485 1468 1448 1473 1535 1574 1547 1471 1385 1312 1288 1338 1425 1459 1396 1295 1233 1213 1193
1572 1193 1184 1240 1355 1451 1481 1493 1557 1665 1745 1751 1716 1708 1759 1834 1872 1860 1840 1849 1869 1863 1842 1850 1905 1982 2064 2152 2233 2286 2315 2340 2361 2363 2360 2369 2360 2294 2203 2167
1567 2167 2180 2136 1988 1833 1780 1819 1865 1885 1898 1899 1869 1833 1834 1870 1918 1991 2105 2211 2245 2225 2230 2283 2334 2351 2356 2371 2391 2428 2520 2666 2809 2900 2959
1563 2959 3024 3099 3153 3166 3155 3162 3209 3254 3224 3108 2993 2960 2987 2997 2973 2945 2917 2876 2856 2906 2993 3032 3017 3025 3088 3165 3246 3391 3603 3777 3829 3817 3845
1559C845P4N8L0M2N5K9kJ3N5P2N3J7j6k0J8P7J04P8L8K5M4P1Q6P7N7N5Q0Q6M7J6M6J03J12
1555E525Q5J09J94K39J94J34J41J86J90J46J17J27J57J75J74J57J43J72K32K55J91Q8N1J02
1552I284J60J57J30J63K55L05K49J55J52K58L61L75L33L11L13L03K85L02L55M19M71N02M89
1550A6087M32M06M65N47N57N25N57O72P66P90Q18R12J021J087J160J319J545J765J979K245
1547C5655K597K995L383L718L978M184M393M638M860M984N017N048N151N357N726O370P409
1545A15463Q957J1236J4673J9857K7385L7749N1331O8302Q8317J10209J32064J51622J66610
1544A003775J74743J73748J61873J38670J05345O4384J8883k7851p2384j11319j41752j61809
1542A326306j71015j70209j61089j45731j26381j05391q5011o6929n1913l9899l0415k2998
$$ plain form
1559 3845 3919 3977 4007 4049 4104 4133 4131 4144 4199 4271 4324 4341 4325 4305 4323 4400 4504 4582 4620 4645 4689 4760 4846 4923 4980 5035 5115 5201 5248 5264 5310 5413 5525
1555 5525 5610 5719 5913 6152 6346 6480 6621 6807 6997 7143 7260 7387 7544 7719 7893 8050 8193 8365 8597 8852 9043 9131 9182 9284
1552 9284 9444 9601 9731 9894 10149 10454 10703 10858 11010 11268 11629 12004 12337 12648 12961 13264 13549 13851 14206 14625 15096 15598 16087
1550 16087 16519 16925 17390 17937 18494 19019 19576 20248 21014 21804 22622 23534 24555 25642 26802 28121 29666 31431 33410 35655
1547 35655 38252 41247 44630 48348 52326 56510 60903 65541 70401 75385 80402 85450 90601 95958 101684 108054 115463
1545 115463 124420 135656 150329 170186 197571 235320 286651 354953 443270 553479 685543 837165 1003775
1544 1003775 1178518 1352266 1514139 1652809 1758154 1822538 1841421 1813570 1741186 1629867 1488115 1326306
1542 1326306 1155291 985082 823993 678262 551881 446490 361479 294550 242637 202738 172323 149325
1541A49325j7342j3201j0269q193o726n758n176m769m375m047l898l852l700l420l217l198
1539D8184l205l082k914k843k806k632k306j979j734j539j370j237j111r52p95p09o72o11
1536A5687n51n56o03n94n32m94m63l31n5K83O35R94J233J092M65m04j120j469j486j306j035
1534I390p68n79m77m18l55k78k05j58j51j72j92k06k17k26k18k03j85j46p0OL5L2L3L0jk5
1531D276jK3k9j07j02k9k3j15j69j09n3r3j34n5O0N8l6o0JPr5j74j27l0Mj8k2j5m9j20j47
1527B517r3%N4L4k7o5m8k4m4q1o9j1J5j4k9J6N4L6J4N6R8M4n8n9O1J46J01J3j2rl9n8jN4K
1523B574j01j01LN5j0p8n2K3P9J40K12K03O2j09j80j72j70j68j08m1n1j06q8KM0j6o8m1PJ0
1519A750roLoj8j8k1l0j8J6K9J0MK5J9m6j10r9k2M4M7j3q7j15o6QL3J3J4N3P0L8%rk3o2p7
$$ plain form
1541 149325 131983 118782 108513 100320 93594 87836 82660 77891 73516 69469 65571 61719 58019 54599 51382 48184
1539 48184 44979 41897 38983 36140 33334 30702 28396 26417 24683 23144 21774 20537 19426 18474 17679 16970 16298 15687
1536 15687 15136 14580 13977 13383 12851 12357 11894 11563 11508 11791 12426 13420 14653 15745 16210 15806 14686 13217 11731 10425 9390
1534 9390 8622 8043 7566 7148 6793 6515 6310 6152 6001 5829 5637 5431 5214 4988 4770 4567 4382 4236 4166 4172 4207 4239 4272 4302 4301 4276
1531 4276 4275 4298 4269 4162 4060 4031 4008 3893 3724 3615 3562 3469 3335 3280 3340 3398 3362 3302 3303 3310 3215 3041 2914 2884 2888 2870 2848 2833 2784 2664 2517
1527 2517 2424 2424 2478 2512 2485 2420 2372 2348 2304 2223 2154 2143 2158 2144 2115 2131 2185 2221 2235 2291 2389 2433 2375 2316 2377 2523 2624 2637 2625 2616 2577 2519 2518 2572 2574
1523 2574 2473 2372 2375 2430 2420 2342 2290 2313 2392 2532 2744 2947 3009 2900 2720 2548 2378 2210 2102 2061 2010 1904 1816 1818 1858 1842 1774 1733 1740 1750
1519 1750 1741 1735 1738 1732 1714 1696 1675 1645 1627 1643 1672 1682 1686 1711 1730 1684 1574 1475 1453 1497 1544 1531 1444 1329 1263 1271 1304 1317 1331 1384 1454 1492 1492 1483 1460 1398 1321
1514A321m0KJ0J4M2N0Nm4l5RL1K4J4j0n2p6m9pKplNJ2L5O5L4o8j40r9nM9N4M4mr8j36m2Q0
1510I87P4j4qJ02J35K1r0p5nQrJ5N0K7j7jN0M4k7q1o4j5J2QLJ5K1mm0l8J8O4M1nJ4Q6J03L9
1505A444j2J4M1j4j06j21n0K7N6N6L6j6o9p5l2Lmj7J0N6O6K8nJ4O4O1j7q5n1M2O4k4j05q5
1501A194rK2RMno2j23j01%O3K6l1j9M4P6N1J0k0l4k1K7P6P9K6m6r6j04o0K0Q7Q4J8m6n4j5
1497A070J7J8lk8m8n2l3jK4M3O0O1K0m7p2k5M1L9k3n1QR3J05L9j6JM3L0k9m8lL9J2n0o3j7
1492A154J0j7n4n8m2k9JM3M7j1o7m1M7R3N8j1n7o7n2k7j9m3o8n7k8j6rL3R1J02O3L1L0J9j3
1488A036j5K6M5%m3j1O9J05P7M3M1M9L9J1k4n6o3l6j0k5o6p2j9L7L4rmO5J09N5l6m2L7O9j3
1484A403j03q2MK6k6m6KM3K4j2qJ2K4M1O6N6J4KN7J17J16P8O8Q2P6N1M5P9J38K01K62L21L96
$$ plain form
1514 1321 1281 1283 1293 1307 1349 1399 1404 1360 1325 1334 1365 1389 1403 1393 1341 1265 1216 1209 1211 1204 1201 1206 1218 1253 1318 1352 1284 1144 1045 1040 1089 1143 1187 1183 1085 949 907 987
1510 987 1061 1047 1039 1141 1276 1297 1207 1132 1127 1135 1126 1141 1191 1218 1201 1200 1250 1294 1267 1186 1122 1107 1119 1127 1130 1145 1166 1162 1122 1084 1102 1166 1207 1202 1216 1302 1405 1444
1505 1444 1432 1446 1487 1473 1367 1246 1196 1223 1279 1335 1371 1355 1286 1211 1179 1182 1178 1161 1171 1227 1293 1321 1316 1330 1394 1455 1438 1353 1302 1344 1408 1384 1279 1194
1501 1194 1185 1207 1216 1220 1215 1153 1030 929 929 992 1018 987 968 1012 1088 1139 1149 1129 1095 1074 1101 1177 1256 1282 1236 1140 1036 976 996 1083 1167 1185 1139 1085 1070
1497 1070 1087 1105 1102 1074 1026 974 941 940 964 1007 1067 1128 1148 1101 1029 1004 1045 1084 1061 1010 1018 1111 1216 1255 1239 1240 1283 1313 1284 1236 1233 1272 1284 1234 1171 1154
1492 1154 1164 1147 1093 1035 993 964 965 1008 1055 1044 977 936 983 1076 1134 1123 1066 999 947 920 901 858 790 733 705 689 680 713 804 906 969 1000 1030 1049 1036
1488 1036 1021 1047 1092 1092 1049 1038 1107 1212 1289 1332 1373 1422 1461 1472 1448 1392 1329 1293 1283 1258 1192 1120 1101 1138 1172 1163 1159 1224 1333 1388 1352 1310 1347 1416 1403
1484 1403 1300 1218 1222 1248 1222 1176 1178 1221 1245 1233 1225 1237 1261 1302 1368 1424 1438 1440 1497 1614 1730 1808 1876 1958 2034 2085 2130 2209 2347 2548 2810 3131 3527
1480C527N11O41P45Q49J017J231J365J337J203J049Q55N81K78M7r6j97k61k63k36k56l39m33
1477A3155n21o42p90q98r18q85q57q52q41p94p02n88m90m04l04j87j11j01j18j21j29j62j73
1474A567j08rL2ln6q3q0m5PK4k2p4n5LK1%K0Q4J03K5p4j02o0qJ9J4k0o6p8m2J5N2M8J0m0o2
1470I57l8KJ9J1QPkqKRpk6l1l9o1n4J3P7O5Mj4J6K8J1J4L5J8l2m6j0J5OOJ8j2q4j14p2j8L
1465F76K5O2O4J8pL0O6N5K6K0J2j1j7Mjm5o5l0pk1nO2Q4%q4n4K9M7RNM1M6J7Jql9n3oL5j5
1460I66r7p8L1R4O3L6N7M8m1j26j15l8K6N7O9N3Ok7j0L2M4J3l5o1m2NK9oo2o1jM1K5KK1N0
1456I68K7m3q4n8ML7K4mj8k4k8j6K2N6M0j0k2J9N3L3kmJj9m8m8k8j1K1O7P0Om6k1K3mp1q0
1451G82l4p%N6J31J14kp8l2M6M5j7n7n4l7j4J8L9L5J8%l1n8m2J0L5Qk8k7qmj8l8n2l5J8N2
$$ plain form
1480 3527 4038 4679 5424 6273 7290 8521 9886 11223 12426 13475 14330 14911 15189 15236 15140 14943 14682 14419 14183 13927 13588 13155
1477 13155 12634 11992 11202 10304 9386 8501 7644 6792 5951 5157 4455 3867 3377 2973 2669 2482 2371 2270 2152 2031 1902 1740 1567
1474 1567 1459 1450 1482 1479 1423 1340 1260 1215 1222 1246 1224 1150 1095 1098 1119 1119 1139 1223 1326 1351 1277 1175 1115 1107 1126 1140 1120 1054 976 934 949 1001 1049 1059 1019 957
1470 957 919 921 940 951 959 966 964 956 958 967 960 934 903 864 803 749 762 839 904 908 894 910 938 949 963 998 1016 984 938 928 943 949 955 973 961 877 763 691 673 676
1465 676 701 763 827 845 838 868 934 989 1015 1035 1047 1036 1019 1023 1022 977 912 882 875 854 849 911 995 995 911 857 886 933 942 947 988 1034 1051 1052 1044 1005 952 946 981 966
1460 966 869 791 822 916 979 1015 1072 1120 1079 953 838 800 826 883 952 1005 1011 984 974 1006 1050 1063 1028 967 925 930 959 953 891 830 829 870 895 897 918 968
1456 968 995 952 868 810 814 851 875 871 853 829 801 785 807 863 903 893 871 890 943 976 974 970 971 952 904 856 828 817 838 905 975 981 935 914 937 933 862 782
1451 782 748 741 741 797 928 1042 1040 962 930 976 1021 1004 947 893 856 842 860 899 934 952 952 921 863 821 831 866 874 846 819 811 807 789 751 699 664 682 734
1446G34J4l9oQ1R2Kn4kN3Pp0n3K9N8J7pJ4K7Mk5l8l1J6Q3Q2k8j40j11L6J26Q3lk2%om1m5p
1442H30K9K7kl0k6%Ql1p7n7K9R9Q1Ql9l3j8k1j2L7Q3M5o9j46r8QM8Kl1NN7P1O4O2L3m9j12
1437G75q5JM7L7L5O6P1K3k4j5K3K3k3n4l6lk1q2r6j6Q8R4jp2m2K5L2pj7QPk3k6J7M7K4pLL0
1432H26J5l6n4qM4L6rj2L7N2k3j09r2NN2Ql6pL8L8K9O1Q0J4r6j43r9l1K4P3J07R0L6MOjl1
1428H88m6k4QK2J4lj4JK6Rn6r4n5NMm4n4k2j6m2l8J8P5P7M0ql4j9K4K3l2m1P0J80J17p3j48
1423G38k2J13Q8l0p3k9QJ2K0L4J7j8l5m1m6k1L0L8l4j04o9L9J07R5N6L6L1L6M2J5n3j01o4
1419H15K5O5L0k3m8n6o2n4l4j1J2L4M6L8L0J8k7r3r9nR4Q9J3j8J5K3k8o4l0K8M0Ml9n2k5L0
1415F81O6M4mk1jNj4j8JNrMN1P0K2m1o4m7pN4R8O0l5p7j5M2j1j15j28l0O5P9M2J4lj0JJ8K
$$ plain form
1446 734 748 709 703 784 876 878 824 822 875 882 812 759 788 846 863 856 870 897 901 876 838 807 823 906 988 960 820 709 745 871 954 951 929 929 923 882 837 830
1442 830 859 886 884 854 828 828 836 805 728 671 700 799 880 888 849 816 798 777 765 802 885 930 861 715 617 625 673 675 644 649 706 777 841 903 936 887 775
1437 775 690 691 738 775 810 876 947 970 946 931 954 977 954 900 864 861 840 758 662 646 734 828 827 755 713 738 770 763 746 754 761 738 712 729 776 800 793 796 826
1432 826 841 805 751 743 787 823 814 802 839 891 868 759 667 672 724 732 696 689 727 765 794 855 935 949 853 710 611 580 604 677 784 874 910 914 920 919 888
1428 888 842 818 826 848 862 859 845 846 872 881 825 731 676 681 685 641 587 565 549 507 469 487 562 639 679 671 637 618 642 665 633 592 662 842 959 886 738
1423 738 716 829 917 887 814 785 793 805 825 859 876 858 823 782 736 715 745 783 749 645 576 615 722 817 873 909 940 976 1018 1033 980 879 815
1419 815 840 905 935 912 864 808 746 692 658 647 659 693 739 777 807 825 798 705 606 601 695 784 797 779 794 817 789 725 695 723 763 767 728 676 651 681
1415 681 747 791 787 766 765 770 756 738 739 744 735 739 790 860 882 841 777 730 723 777 875 935 900 823 808 850 839 724 596 566 631 710 752 766 763 753 754 772 774
1410G74m3n6oN0M6mj9L2J01J10L5o9j13o2K3N3Pm4l0K2L9Nj9RM3J4o1r0l7L8N4J3k0j2NRO
1406H03OMNJ8L0J2k3k3K7O1K1n2p3k9Qnl7m2k9k3k4j2%mnJ9N5O2M4M1O3O2J7l1k0K8M2lm3
1401I50qP5J23Q2j3q3p9j5M9N8Pn4p9o4l4j2JNPJ2K0K4J9J0OOkk2m1n0m8m7m7l1K1Q3R7L9
1396I65m6p1k3L6M0nn7q5q1l4L7P4M1k0l5QN5O5M9K4ql6l4%K5J2j5j9j5l0n5n0qK8J4l2m8
1392F66mO1O9Qo2p5m9l2k2K3Q8Q9Oo9m3L8O5K4kL0N0Pn4o1k8nQN0R8Q4Qm1j5L5L5ml6n2o7
1387H21p2n2l2n1p1l1N2R1N3NJOk6n6k7L1M1%k7rJ0QJ0L2M0J6pPL2K5nj4jj2n9q7n3J7N6M6
1382G08K3J7Ok8l8J0Q2Q8K7j6J9O5M1k8m4J1N7L6ok6m8j09j66j36k5O3N5PQO0P0Ko6m6L7P7
1378G87L0l3n1l7l1k2J3M5L2nmN1J03J00M3k8o8m8JJ1m1q5n2J8M0Lj5OPm0o7k9K3K2nLL8L4
$$ plain form
1410 774 731 675 669 719 765 761 742 774 875 985 1020 951 838 776 799 852 859 815 785 807 846 851 832 841 884 898 837 747 710 748 802 815 795 783 788 797 803
1406 803 809 813 818 836 866 878 855 832 859 920 941 889 816 787 795 790 753 711 682 659 635 623 623 619 614 633 688 750 794 835 898 960 977 946 926 954 996 993 950
1401 950 942 1017 1140 1222 1209 1126 1047 1032 1081 1139 1146 1092 1013 949 915 903 904 909 916 928 948 972 991 1001 1007 1013 1011 989 948 898 850 803 756 725 746 829 926 965
1396 965 919 848 825 861 901 896 839 754 673 639 676 750 791 771 736 744 799 864 913 937 929 893 859 859 884 896 881 862 847 817 762 712 704 732 746 714 666
1392 666 662 723 792 800 738 663 614 582 560 583 671 760 766 697 654 692 757 781 779 809 859 866 812 751 723 718 726 776 874 958 966 925 910 945 980 976 940 888 821
1387 821 749 697 665 614 543 512 564 655 708 713 714 720 694 638 611 642 683 683 656 647 657 665 675 707 747 763 756 763 795 820 815 801 800 788 729 642 589 606 662 708
1382 708 731 748 754 726 688 698 780 868 895 879 898 963 1004 976 932 943 1000 1036 1030 1004 956 847 681 545 520 583 638 645 653 713 783 785 719 673 710 787
1378 787 817 784 733 696 665 643 656 701 733 728 724 775 878 978 1021 993 925 877 878 889 848 763 711 729 769 772 757 763 770 730 663 634 657 679 674 677 715 749
1373G49j7m8j1N6P8L7j7l4j0J3J1lj7k9l7j5L3N0Lm7k9K6L6PK0Q5R6Nr4r5j8M7O0M4J7LL1
1369I86Q7J00L5l2k2K9M2J7K0N1N9M6N9Q7P3K8K0N4N4Jk8K2Q2N6l4r5q7n9n2o5p1p3p2o0k4
1364A234K5M7Np3j20j02n8m6m7j5M5P4N7K8J5Jk0k3MK5J9J8N0Q4P8L6OJ8N0O8N1Rk0%N9J04
1360A686R9O0L1J7om7o8l9J9L5l2j28j42m9N4N3l3r7q7o0o5p4n3k9m1o3n4k2nnlj0l7m9qM8
1355G96M8nl0J1N4M0lk2j9k3k3jJ3j1m2k7J4Nn8p6oP1M4n5j09n8L8J00J01N9Nj9JK5Jn2n5
1351G32J8Q6P7J8pK1M7K0l7o9n1j0J4Kj7k2k2l2l4qJ4qn4n5j7jqL5J30J60P1l5m2MKl8l1J4
1346H67J3k6k6J7K5j8l7j0om5n7j4K0Mj9j7k5m6k4N1Q8L9j7qK0Lj7K3P4M2m1o2lM1L1J6L2
1342H88M3K2nqj0k4k2klm3p1l3L9P4N4K6J8J5jqJ0J5k3p9r0o5n7p2m3M7J04N8j6mO8Q2K0j6
$$ plain form
1373 749 732 684 673 729 807 844 827 793 783 796 807 804 787 758 721 706 739 789 792 745 716 742 778 785 805 890 986 991 897 802 784 831 891 935 952 955 986
1369 986 1073 1173 1208 1176 1154 1183 1225 1242 1262 1313 1372 1418 1477 1564 1637 1665 1685 1739 1793 1794 1766 1788 1870 1926 1892 1797 1710 1651 1599 1534 1463 1390 1318 1258 1234
1364 1234 1259 1306 1311 1238 1118 1016 958 912 865 850 895 969 1026 1054 1069 1070 1050 1027 1031 1056 1075 1093 1143 1227 1305 1341 1347 1365 1415 1483 1534 1543 1523 1523 1582 1686
1360 1686 1785 1845 1876 1893 1887 1840 1772 1733 1752 1787 1755 1627 1485 1436 1490 1543 1510 1413 1326 1266 1201 1127 1074 1045 1004 941 887 865 860 855 852 842 805 756 748 796
1355 796 844 839 809 820 874 914 911 889 870 847 824 823 836 825 783 756 770 775 717 641 635 706 750 695 586 528 566 666 767 826 831 812 813 838 839 787 732
1351 732 750 836 913 931 924 945 992 1012 975 906 855 845 859 861 844 822 800 768 734 726 740 732 678 623 606 605 597 632 762 922 993 958 916 920 922 884 853 867
1346 867 880 854 828 845 870 852 815 805 799 754 697 683 703 707 688 671 646 600 576 627 715 754 737 729 749 752 735 758 832 874 833 771 768 809 840 856 888
1342 888 931 953 948 940 930 906 884 882 879 836 765 732 771 845 899 925 943 958 957 949 959 974 951 872 782 717 660 588 545 592 696 754 738 734 802 884 904 888
1337H88J8M4Om0l9k6k8j6K5L1k1n2%P8Q9M6Jm9r7q2K8J21R1rl4K3M7j5r1j21j15q5qQ1J13
1333H02P8M2M0L6J2lok6n4m3jJn4q5k8O6J07P7Rm9o7m1mJ3K3M5N2J3l0kO2N8k2p3m0Mlj3L0
1328I26P4M2n1j10q9k0M5O5L3j0k1MK2K7L6K7l3r2n0O5J14M0l9k1J8k8j04q7LM8J3k4k3j6
1324G84j3OK1j2o0n2rj5o2m9M1R9N6lJ1N7M4k1n1k5LJ1K7N6N4Ol2j3L8N3J3l4m6m0l7k2L2
1319H16R5R3Nr4j15n3J9M7L3J2pk6m7n6l8OM2L6j7p0p4k0N1Q1N6Kk8j6J0J4JNK5K3j1m9n4
1315F97l0LL6O0N3Om8o9n2j4K4M7L7J1lMJ1NLRJl1n3l3RL6M0K7qn7p1k9K8M5K2mj2j7j9j1
1310F53jKNJ7J5rk5j4lk1l9j8J8J8j6j9K9P6P3L2kjK2L3Mn2q0n1LK2jj8mL1N5M9J1l0l2ML5
1305G71L3K4K8J8k7o6o0l1k5k1J3N0L9kj7rj4l0j7J7K8J6J8K4J1J2Q2J84K12J50P9K9m0j23
$$ plain form
1337 888 906 950 956 916 877 851 823 807 832 863 842 790 790 868 957 1003 1004 955 858 776 804 925 1016 1007 973 996 1043 1028 937 816 701 616 608 689 802
1333 802 880 922 962 998 1010 1007 1001 975 921 878 877 878 824 739 711 777 884 961 970 921 854 813 809 822 845 890 942 955 925 923 985 1043 1021 948 908 912 909 896 926
1328 926 1000 1042 991 881 792 772 817 882 915 905 884 888 910 937 973 1000 967 875 825 890 1004 1044 1005 984 1002 974 870 783 786 834 847 823 800 784
1324 784 771 777 798 786 726 674 665 650 588 539 580 679 735 732 743 800 844 823 772 747 750 761 788 844 898 904 872 859 897 950 963 929 883 843 806 784 816
1319 816 911 1004 1009 915 800 747 766 813 846 858 851 825 778 722 684 690 732 768 751 681 607 587 638 719 775 777 749 733 743 757 758 763 788 811 800 751 697
1315 697 667 670 706 766 819 825 777 708 656 642 666 713 750 761 758 762 773 778 781 790 791 760 707 674 683 719 759 786 778 721 650 621 649 694 716 712 700 683 664 653
1310 653 652 654 659 676 691 682 657 643 640 619 580 562 580 598 582 563 592 668 741 773 771 770 792 825 829 777 697 646 649 671 670 652 648 679 734 783 794 764 732 736 771
1305 771 804 828 856 874 847 781 721 690 665 644 657 707 746 744 727 718 704 674 657 674 702 718 736 760 771 783 865 1049 1261 1411 1490 1519 1479 1356
1301A356j39p3l5q4j37j02j6L2L0J3j1m2m4jK7mm8l1L0P1O2L2pl1j1N0Q2M5pj5j4m9o5j0M4
1297H98lj06j17k1M4J0l5lM1J2n7p0k2J1J3K6N9O6K4k4l6k2mJ4L1L4J5kJ1L4J9k5l5K3Q6O9
1292I58j8q2o0OM7N2N0N6P9J25J80J81Q9l5q1k8L1J1o8j17j09p3m0j5lk9q7j14o0L1O1Kp0
1288H70o9j1K1kl8l5%K7J8j6l7kP3J19Q5J2k4j3KMOOj2j2N3J36J34M7J1J01K22K60K31K28
1284B395K47K21J47P9K8m3j26j69j66j75k41l22l48k85j61m7%j2k2k%m4q6p0k6j2j1L2R8J04
1280I83L7k8k9NK2J4nk0j9mJ1J1J9M1M6Qk1J5Q8J29J35J66K26K64K80L19L84L92L06J77O2
1276D014l6j25j83k24k84l36l08k06j40j72k13j77j11j01j28j05l3jm0q0n9pJ9Lj8j7OK3J3
1273I74omPj0l7j2P0J17O3l7p8m4pPL2Q4J34J59J78K05K21K16K11K20K22J81J01K1l1o1j00
$$ plain form
1301 1356 1217 1144 1109 1025 888 786 770 802 832 845 834 792 748 747 774 770 722 691 721 792 854 886 879 848 837 887 969 1014 1007 992 978 929 864 854 898
1297 898 895 789 672 651 695 705 670 667 708 720 663 593 571 582 595 621 680 746 770 746 710 688 684 698 729 763 778 776 787 821 840 815 780 803 889 958
1292 958 940 858 798 804 851 903 953 1009 1088 1213 1393 1574 1663 1628 1547 1519 1550 1561 1493 1376 1267 1194 1154 1139 1136 1107 1020 906 846 877 938 940 870
1288 870 801 790 811 809 771 736 736 763 781 765 728 726 799 918 1003 1015 991 978 980 984 990 996 984 972 1025 1161 1295 1342 1353 1454 1676 1936 2167 2395
1284 2395 2642 2863 3010 3089 3117 3074 2948 2779 2613 2438 2197 1875 1527 1242 1081 1034 1034 1022 1000 998 998 954 868 798 772 760 749 781 879 983
1280 983 1020 992 963 968 990 1004 999 979 960 956 967 978 997 1038 1084 1092 1071 1086 1174 1303 1438 1604 1830 2094 2374 2693 3077 3469 3775 3952 4014
1276 4014 3978 3853 3670 3446 3162 2826 2518 2312 2172 2000 1787 1610 1499 1398 1270 1165 1132 1131 1091 1011 952 945 964 967 949 932 938 961 974
1273 974 968 964 971 961 924 912 982 1099 1162 1125 1047 1003 996 1003 1035 1119 1253 1412 1590 1795 2016 2232 2443 2663 2885 3066 3167 3188 3157 3096 2996
1269B996j60k09k13j85j70j79j85j57j00m5j9l5p3p5j1M9K2p7j33r6m0l9m7%P0P2lp8r6o9
1265G15k6Pkn4q1k0R0J42R6K4nLJ8M2Q8J46J89J91J35L7l5k9K1L8RrLlm8p4m6j4l7q5q0k7
1261A319mn1j23j44r4j3L8K9k7q5j02p9l0K7O5O2K1j1oQol2j3L8M8j2o5l6L0K9m2p9k4N1N0
1257G37nj8L5Q6Q1M9L7M1K7jj2RM7P0N2j0p5r2m8RL2J8nj9j9j1j7n2q9q1j8M4N9L8Rj9m4m2
1252H03j5ml7o5m1LJm4o1l0NPMK1L5J3k7m3k4J3N0Q3J01Q2J0q3j29q0K1Q8Q7O1M3K1j6k9n
1248H19J1k8p9o9j1K4K7L9O1N2Ol5n4o9o6j6M5M2k9p7m8MJ9J6L7N2J6m0m8J0P9R4L9m6j01
1243F76q0kP2R1N4j1o0n5LN5M7POM1M1j9p1o0j4J6K7K1j9o8o3MN1K9oJJ7RK2P7J02K8p2q7
1239H10m4m2o7l3N3P5J8j2L2O0J3l5j8J7nm5l7k%j4RN1N3K1J0J7j0o6p7j6M7M1j1m5m4k6P
$$ plain form
1269 2996 2836 2627 2414 2229 2059 1880 1695 1538 1438 1393 1374 1339 1266 1191 1180 1229 1251 1174 1041 945 905 866 819 819 889 961 958 880 784 715
1265 715 689 696 694 640 559 539 629 771 867 891 886 889 907 949 1037 1183 1372 1563 1698 1735 1700 1671 1692 1730 1739 1730 1733 1730 1682 1608 1562 1548 1511 1426 1346 1319
1261 1319 1315 1264 1141 997 903 890 928 957 930 845 743 664 634 661 726 788 809 798 792 800 794 762 749 787 835 823 758 722 752 781 739 660 636 687 737
1257 737 732 714 749 835 916 965 1002 1043 1070 1069 1057 1066 1113 1183 1235 1225 1150 1058 1010 1019 1051 1069 1064 1045 1026 1015 998 946 857 776 758 802 861 899 908 889 845 803
1252 803 788 784 747 682 641 644 645 601 540 510 515 522 526 547 582 595 568 525 501 514 564 647 748 830 840 757 628 548 569 657 744 805 848 869 853 824 819
1248 819 830 802 723 654 643 667 694 733 794 846 852 817 763 694 628 612 657 699 670 593 545 549 568 584 621 673 689 649 601 611 690 784 823 777 676
1243 676 596 594 666 757 811 800 740 685 688 743 790 797 803 844 885 866 795 735 721 737 764 785 766 698 635 639 690 719 713 714 731 740 762 839 941 969 897 810
1239 810 766 724 657 624 677 752 770 758 790 850 863 828 810 827 822 777 740 738 738 724 733 784 837 858 868 885 875 809 732 716 763 804 793 748 704 678 685
1234F85N3P5L6k6l8J5O2M1j2l1lK0J3k%kk1m0k9jJ7J5jk5m7k7L6P9M6k6n1k2pl9m8J3Q8Q0
1230H76jo3o2m0m8o6n0LN3O2L9J6J4L4M8L0j8o2o5k7RQj5j6PJ0k4l7J8R4R6K1l8j6L2J3n8
1225G77r1n3LK5K3L3M1K5pk1j6j3j9j7KK2K4Rj2k5j9J1M5N1K7%rj4k5k5J0N3N8K1%K5N0J6
1220I85n3q7n8mJ8Pj3k6k7rK2M7M0Rj6j6j4m0r3j21q3kN3L7j0k6jK9M5N8P6P0K6k4m8m6l5
1216F70j6J2K1j0l7kP4J01M3j0J7Q1P5mm6J2R7R5lj18j66j35n6K6O9N9J4j9j8J1L8L6nn3o7
1212G86m3j4kK3O3O8Lp4p8j2M7N8N6N8L4k9q0p3k7J7L8L2Kk6qM8P6M2lnK8M6M2L4K1pl0j8
1207A093J3K2Kk2l3l5l3l1l7m9m4j7Llj1MK4K0PJ5L7N2O4Q0O9J1m8m8rMj7j4L1N9K6n0j11
1202A024j21p2J5Q1R1O6N1M2Ql0k5J8M6N1O4Q2N7k0q1q9p5o5l6K4O4L6l5q5q3m0J5L9Om3k8
$$ plain form
1234 685 738 813 849 823 785 800 862 903 891 860 857 877 890 888 888 886 865 825 796 795 812 827 826 801 754 727 763 842 888 862 811 789 782 743 695 708 796 876
1230 876 875 812 750 710 662 596 546 549 602 664 703 719 733 767 815 845 827 765 700 673 682 690 675 659 666 676 652 615 633 727 823 844 806 790 822 835 777
1225 777 686 633 636 661 684 717 758 783 776 755 739 726 707 690 692 714 738 747 735 710 691 702 747 798 825 825 816 802 777 752 762 815 873 894 894 919 969 985
1220 985 932 845 787 783 801 808 795 769 742 733 755 802 842 851 835 819 805 765 672 551 468 466 519 556 546 520 519 548 593 651 727 797 823 799 751 705 670
1216 670 654 666 687 677 640 638 712 813 856 846 863 944 1019 1015 969 981 1078 1173 1170 1052 886 751 695 721 790 849 863 844 826 837 875 911 906 853 786
1212 786 743 729 727 750 813 881 884 810 732 720 767 825 881 939 973 944 864 791 764 781 819 851 853 827 819 867 943 985 982 977 1005 1051 1093 1127 1148 1141 1111 1093
1207 1093 1106 1128 1130 1108 1075 1040 1007 976 939 890 846 829 832 829 818 822 846 866 873 888 925 977 1041 1121 1190 1201 1153 1105 1096 1100 1083 1069 1100 1159 1185 1135 1024
1202 1024 903 831 846 927 1018 1084 1135 1177 1185 1155 1130 1148 1194 1245 1309 1391 1448 1428 1347 1258 1183 1118 1082 1106 1170 1206 1171 1086 1003 963 978 1017 1023 980 952
1198I52M9J04P8K2RL7P2J15J65J72J07L2J4K8mq4j38j35j21j19r0k9%l4p2n0ok3p6o2M8J34
1194A095R0j3l6L9Q2K8l6kQ2R6J5o6p3l3jj4o1r4n8L3P6J0q4p7NM5K0L1J19J84J62J10R6R7
1190A867Q3R1J22J04Pp6p6o2j19j89j69q7o0r9j21r8p7p2m9pJ3K0L6L4k3p7l7O3R8L9j3KJ9
1186A087j6m7k5Kk4p5q4m7j3%J8N1Q5R2O8M1L6M3J7l8n1L2J32J48R4P7J19J24N1j9k9m3j24
1182A682k06j90j04o0q7j03o5k5l1m8rP2J16P4j3o6o5m7l4mN2Q1M2k9n9l4jJ3K5L4J4l2o1
1178H32m9j7J9N5O7L7j1k6rJKK4O1O5L8L0N3N7K3omj8o3q8n7j5j3l4m2m5o1o0l8k9m4k4N6
1173F67J16Q7J7%K3Ql7m6j2nn1q8n7J5O6N7J1k3%O3R4M7k7n3l6l2n6o0k2K3L7K3NprkOJKK9
1169G74O1N2po0m1L9R5N6m0q4k6M6L6k5l3Pjo8p2L8J29P9k7m8nk1q2n6N8R6j9j42j15J3Q9
$$ plain form
1198 952 1001 1105 1183 1205 1214 1251 1323 1438 1603 1775 1882 1914 1928 1956 1952 1868 1730 1595 1474 1355 1265 1236 1236 1202 1130 1080 1074 1051 975 913 961 1095
1194 1095 1185 1172 1136 1175 1257 1285 1249 1247 1329 1425 1440 1374 1301 1268 1267 1253 1192 1098 1040 1073 1149 1159 1075 998 1003 1048 1068 1099 1218 1402 1564 1674 1770 1867
1190 1867 1950 2041 2163 2267 2274 2198 2122 2060 1941 1752 1583 1496 1436 1337 1216 1118 1041 969 920 913 926 946 982 1016 993 916 879 942 1040 1079 1066 1068 1087
1186 1087 1071 1024 999 1001 977 902 818 771 758 758 776 827 912 1004 1072 1113 1149 1192 1209 1171 1120 1152 1284 1432 1526 1603 1722 1846 1897 1878 1849 1806 1682
1182 1682 1476 1286 1182 1122 1035 932 867 842 811 763 754 826 942 1016 1003 937 872 825 791 787 839 920 962 933 874 840 839 852 877 911 925 893 832
1178 832 783 766 785 840 907 944 933 907 898 899 901 925 986 1051 1089 1119 1172 1229 1252 1246 1242 1224 1161 1073 1016 1001 988 954 912 867 806 746 708 679 635 611 667
1173 667 783 870 887 887 910 918 881 835 823 818 767 679 622 637 703 760 771 748 748 811 905 952 925 872 836 804 748 688 666 689 726 749 754 747 738 736 742 743 745 774
1169 774 835 887 880 820 779 818 913 969 929 845 819 865 901 876 843 850 849 781 709 747 876 955 928 880 875 854 772 716 774 870 851 709 594 607 696
1164F96O9L5L9M7L1J8J7Jm7p7m5PNn3q1k2O5Q5L3k3l6k4LN8J10R7K4k0mjo3j04l6Q8J50J24
1160A166P9M5Jm5n1k9l3n7n5k7j7l6m2k6j6nK9N8L2j9k8LJ3kK1Q6J11O8Kl6m9k6L8P6J9p1
1155A177o1K7N0l3p7nP5M8k1k8OJ9L4Q2J04N1JK5M6k3r9n2N3N4l1m2M5P1k6j03n2M4O2L6N5
1151A512J07J05L9k1k4K6R1J27R5K8J5Q2J40J08K8JN1J13J49J68J81J85K12K99M42N98P62
1148E619R49J125J202J151J060J001R19O96L29n6l77o55r09j061j044r36q67q45p66n93m15
1145E527l24k83k21j40q2n0rL5N5N0N0P1J10J56J89J83J67K08L24M31M43L98L96M64N48O01
1142I297O51P33Q68J082J404J840K388L093L985N006O001O827P367P481P043O022M509K619
1140G8216M77j717l693n236o279o834o908o542n861n029m154l307k572j997j555j169q34o03
$$ plain form
1164 696 765 800 839 886 917 935 952 953 906 829 784 791 796 743 662 640 705 790 823 800 764 740 743 801 911 1008 1032 1012 1008 1007 944 840 804 892 1042 1166
1160 1166 1245 1290 1291 1246 1195 1166 1133 1076 1021 994 977 941 899 873 857 852 881 939 971 952 924 927 940 938 959 1045 1156 1224 1226 1190 1141 1115 1153 1229 1248 1177
1155 1177 1116 1143 1193 1160 1083 1078 1153 1201 1180 1152 1158 1177 1211 1293 1397 1448 1449 1474 1520 1497 1398 1346 1399 1453 1422 1380 1425 1496 1470 1367 1315 1359 1421 1457 1512
1151 1512 1619 1724 1763 1742 1718 1744 1835 1962 2057 2085 2100 2182 2322 2430 2458 2459 2510 2623 2772 2940 3121 3306 3518 3817 4259 4857 5619
1148 5619 6568 7693 8895 10046 11106 12107 13026 13722 14051 13995 13618 12963 12054 10993 9949 9013 8146 7301 6535 5942 5527
1145 5527 5203 4920 4699 4559 4477 4427 4418 4453 4508 4558 4608 4679 4789 4945 5134 5317 5484 5692 6016 6447 6890 7288 7684 8148 8696 9297
1142 9297 9948 10681 11549 12631 14035 15875 18263 21356 25341 30347 36348 43175 50542 58023 65066 71088 75597 78216
1140 78216 78693 76976 73283 68047 61768 54934 48026 41484 35623 30594 26440 23133 20561 18564 17009 15840 15006 14403
1138A4403n00m61m13l28k11q7K2R3J53K53L97N33O21P06Q44J001J094J115J154J274J450J646
1135B4759J917K360L026L933N158O831Q984J1498J4141J6606J8496J9382J8960J7132J3942
1133A87125R507M100j767p424j2259j5849j7988j8682j8139j6676j4602j2208r796p653n923
1131D1766m576l506k644j977j503j196j010q78p48o01m49l09j94r5J7J86M03O18P97R62J133
1129B6196J286J407J543J755K036K382K866L613M696O165Q120J0688J3856J7407K0962K4019
1127A48997K5975K6297K4725K1277J6065R260J332o813j4136j9904k3833k5873k6063k4596
1125A32710k1917j8604j5172j1973r224p041n404m191l251k513j959j575j316j150j046r52
1123B5422q09o42n27m64l53j31J19K97M35O06P83Q82R28J049J278J547J859K335L065M030
$$ plain form
1138 14403 13903 13442 13029 12701 12490 12403 12425 12518 12671 12924 13321 13854 14475 15181 16025 17026 18120 19235 20389 21663 23113 24759
1135 24759 26676 29036 32062 35995 41153 47984 56968 68466 82607 99213 117709 137091 156051 173183 187125
1133 187125 196632 200732 198965 191541 179282 163433 145445 126763 108624 91948 77346 65138 55342 47689 41766
1131 41766 37190 33684 31040 29063 27560 26364 25354 24476 23728 23127 22678 22369 22175 22080 22097 22283 22686 23304 24101 25063 26196
1129 26196 27482 28889 30432 32187 34223 36605 39471 43084 47780 53945 62065 72753 86609 104016 124978 148997
1127 148997 174972 201269 225994 247271 263336 272596 273928 267115 252979 233075 209242 183369 157306 132710
1125 132710 110793 92189 77017 65044 55820 48779 43375 39184 35933 33420 31461 29886 28570 27420 26374 25422
1123 25422 24613 23971 23444 22980 22627 22496 22615 22912 23347 23953 24736 25618 26546 27595 28873 30420 32279 34614 37679 41709
1121D1709N273O959R195J1835J4554J7017J8876J9736J9265J7338J4006R396L767k367q289
1119A98270j3324j7032j9236j9975j9426j7841j5534j2899j0345q135o308m815l661k828k211
1117B4700j696j305j110j059r96q67p57p27p10o28m99l74k65j51m0N5J43K20K60K74L23M52
1114A5243O34Q13J009J317J809K487L306M245N284O332P179P610P530O978N981M487K480J18
1112H4842k297m477o214p380p921p888p403o611n654m673l762k940k226j678j317j047p67
1110A0587n20m33n07n90n72m85m15l84l80l88l72k95k01j62j70j38n2j3n9q1KJ14J46J36J96
1107D964L13L95M47N75P94R93J079J099J117J109J002P89N17K03j62n57r07j144j260j284
1105A0082j245j150j015q73p58o66n58m20k92k18j88j62j21q8p5p0o0n1o0q3j00q8n5j9ll
$$ plain form
1121 41709 46982 53941 63136 74971 89525 106542 125418 145154 164419 181757 195763 205159 208926 206559 198270
1119 198270 184946 167914 148678 128703 109277 91436 75902 63003 52658 44523 38215 33400 29739 26911 24700
1117 24700 23004 21699 20589 19530 18534 17667 16910 16183 15473 14845 14346 13972 13707 13556 13516 13571 13714 13934 14194 14468 14791 15243
1114 15243 15877 16690 17699 19016 20825 23312 26618 30863 36147 42479 49658 57268 64798 71776 77757 82244 84724 84842
1112 84842 82545 78068 71854 64474 56553 48665 41262 34651 28997 24324 20562 17622 15396 13718 12401 11354 10587
1110 10587 10067 9634 9127 8537 7965 7480 7065 6681 6301 5913 5541 5246 5045 4883 4713 4575 4523 4510 4451 4370 4372 4486 4632 4768 4964
1107 4964 5277 5672 6119 6694 7488 8481 9560 10659 11776 12885 13887 14676 15193 15396 15234 14677 13770 12626 11366 10082
1105 10082 8837 7687 6672 5799 5041 4375 3817 3397 3105 2887 2699 2537 2416 2328 2253 2183 2123 2072 2012 1929 1829 1741 1686 1667 1664 1661
1101A661qj8l7n9o7n5k8NK6J2l7o1k2L7L2l9p2j8M5K6l9m6J0K6l6j00q5k7%j6k3kK0J6jrr
1097A002qroJ1M2Q2R5N6k9j00r9k0P2R5L1n5r4p2l4k0j6PM4N4J4l5m3j7mk7n3n0k6mK0O0R3
1092I57Q7M2pm2o8p0k6M2O9J7o1r2n0J7N2K7l5p4n1LJ1l7p4l3N2J00R3O1J6n0j06q2J9R8P8
1088H83J0oM7Q5N4j3m5l8k9l0k5j0nk3m6m8k7lJ2J7K0K2J3j5m2l6OL3Pl3j4N2P9L2l2m8l0
1084G74j8JM4O7L0k4k0K4K7j8m4j9LlmJ9K5LLL8M5j1p1p0m5m9n1KP1O6ll9JM9L4k3n0j9K9
1079G74M2lo3p8l4K2M4L1J9K3L4M4M3J5l5o3m0RL6K4qk8lP7J51J35L2l7NP5N3n0j10q0k4j4
1074A018l1m3m3l6j8kopK1M1lo8o5J3O1K5k1oL3K6j3k4nNKNJ7K1L0N6O9M6Pj0k0n2q4n4K8
1070I13R0Q8N8N1O5P6P9Q4Q4P5O7P2P0K7m1q3p5o2q3j11q5k6k9j06j42o3K1k9j60j83m5R1
$$ plain form
1101 1661 1653 1635 1598 1539 1472 1417 1389 1394 1420 1432 1395 1334 1312 1349 1381 1342 1270 1252 1297 1323 1284 1238 1248 1274 1238 1138 1053 1026 1026 1010 987 985 1005 1021 1020 1011 1002
1097 1002 994 985 979 990 1032 1114 1209 1265 1236 1136 1037 1017 1089 1184 1215 1160 1066 994 960 940 924 931 975 1029 1043 1008 965 948 944 917 864 814 788 784 804 864 957
1092 957 1044 1086 1079 1037 969 899 873 915 984 1001 940 848 798 815 867 894 859 785 734 737 748 711 637 604 656 756 849 910 926 876 770 688 707 805 883
1088 883 893 887 934 1019 1073 1060 1015 977 948 918 893 883 878 855 809 761 734 731 743 760 780 802 815 800 758 722 728 761 768 735 721 773 852 884 852 804 774
1084 774 756 757 801 868 898 874 854 878 905 887 843 824 827 824 820 839 864 867 870 908 953 942 871 801 756 707 656 658 729 795 792 753 754 803 837 814 764 745 774
1079 774 816 813 750 672 638 660 704 735 754 777 811 855 898 913 878 815 775 784 820 844 836 808 805 882 1033 1168 1200 1163 1168 1243 1296 1246 1136 1056 1032 1018
1074 1018 987 944 901 865 847 845 839 832 853 894 891 823 758 771 832 857 836 830 863 889 876 852 847 852 854 859 876 897 927 983 1052 1098 1105 1095 1075 1023 939 885 913
1070 913 1003 1091 1149 1200 1265 1341 1420 1504 1588 1663 1730 1802 1872 1899 1858 1775 1700 1638 1555 1444 1359 1333 1304 1198 1056 993 1014 985 825 642 597 688
1066F88Q8J2j4RPlK8O0K0n6n1L5Q2L1k9j9K0J7j6k4%K3L2L8L7L4M6P5J00J16J37J53J22O0
1062A858N1J17J62Q5n1j11q0p7j45j91j38m6k5p2j08j00r4j12j19q2k2J6J9PMJ5K0J3%kMn
1058G91k7l3qK4M2M6M6L1J4K7O3N3l1j06o7O3J59J57J02O0L9K8M3Q1J09J13J03O6j8j07j11
1054A752l7%o2j39j38r3p6o5j3M2K4m3o1nO0R5J21J51J48R4J8n2j02j07o8m9r3j42j05mN2
1050A103L0J0M0P1O5O4J00J48J79J99J96J29K7k5j3l4j22j70r6K1N2po6q3q3p5n5m8n9l4O2
1046A526J61J73J11N9L3mn8p5n1l8n8o4j5P4J54J88J67J13O0Qo8j43j55r7o6j21j79j26OQ6
1043A601O8J8%J3O1J62K74L19K78K21J87J52R0Jj17k54l39l06j99j32j38j51j25r5p7k9O2
1039A545J29J38J37J64J74J25O2N4P1M5m8j56k20k10j40p7p3r9p2J6Q5Q3N3K9j1p1j02r1j03
$$ plain form
1066 688 776 788 774 783 790 787 815 875 895 839 788 823 905 936 907 888 908 925 909 885 885 908 940 978 1015 1049 1095 1170 1270 1386 1523 1676 1798 1858
1062 1858 1909 2026 2188 2273 2222 2111 2031 1954 1809 1618 1480 1434 1409 1337 1229 1129 1035 923 804 722 700 716 735 742 746 761 781 794 794 792 796 791
1058 791 764 731 723 747 789 835 881 912 926 953 1016 1069 1038 932 865 928 1087 1244 1346 1406 1445 1473 1516 1597 1706 1819 1922 1988 1970 1863 1752
1054 1752 1715 1715 1653 1514 1376 1283 1207 1142 1129 1171 1195 1152 1091 1086 1146 1241 1362 1513 1661 1755 1773 1721 1619 1512 1444 1395 1302 1160 1055 1051 1103
1050 1103 1133 1143 1183 1254 1319 1383 1483 1631 1810 2009 2205 2334 2361 2336 2323 2289 2167 1997 1901 1922 1974 1967 1901 1818 1735 1660 1605 1557 1498 1464 1526
1046 1526 1687 1860 1971 2030 2063 2059 2001 1926 1875 1837 1779 1715 1700 1774 1928 2116 2283 2396 2456 2464 2396 2253 2098 2001 1935 1814 1635 1509 1515 1601
1043 1601 1669 1687 1687 1700 1761 1923 2197 2516 2794 3015 3202 3354 3444 3445 3328 3074 2735 2429 2230 2098 1960 1809 1684 1589 1512 1483 1545
1039 1545 1674 1812 1949 2113 2287 2412 2474 2528 2599 2644 2596 2440 2220 2010 1870 1793 1720 1621 1549 1565 1650 1733 1786 1815 1804 1733 1631 1540 1437
1036A437j60j53k4J05Q9k6o6JN7M2L8R1J28J01R6J81K64K11M9p5j01j18j92k62k33j29o1p5
1032A215j02o6J0N5M6L2M5O9P2N7M5N2P6R0N5m8j62k02j48p1m4o5q3p9m8%L7K3m1p9m7QJ3
1028G15k0l6k7k4k1K2Q4J05O9K0rm6q8r4m0J4J5j3j4J3K2mk8j0L8O2L0k0k6J6M9L5K0N6J00
1024I65O9l0j00q2k0K0L8M5K3k9n4k0L1L7K1L7N9K4m7n6K3J02J00N3L1M0M2M6Q3J25J17O1
1020A754L4Q9J86K68L44M78O86Q96J026J073J119J211J292J260J085Q36N83L30N0k53n51q25
1017A2971j056j199j224j173j108j052r74q67p48o18m51k69j41j04j23j41j36r6k9L0J3p4
1015A431j50j46j05q7q0l5K6K2n2j09p4K4R0P6J0m2m4j9rj0QK4j1q3r1JQ7O4qj1M3M7ql2m
1010G43jl9m0RJ9k8j9Q0J30K5j06q6N2J25P6J0pk0n6n5kK6k9r4p1K0P3L7k7l5QL6J4lL1P1
$$ plain form
1036 1437 1277 1124 1100 1205 1294 1268 1202 1203 1260 1302 1340 1431 1559 1660 1756 1937 2201 2412 2461 2386 2285 2167 1975 1713 1480 1351 1290 1215
1032 1215 1113 1047 1057 1112 1158 1190 1235 1304 1376 1433 1478 1530 1606 1696 1751 1703 1541 1339 1191 1120 1076 1011 928 849 801 801 838 861 820 741 694 702 715
1028 715 695 659 632 608 587 609 693 798 867 887 878 832 744 650 610 624 639 626 612 625 647 643 615 605 643 705 735 715 689 705 754 789 809 865 965
1024 965 1034 1004 904 822 802 822 860 905 928 899 845 825 856 893 914 951 1010 1034 987 931 954 1056 1156 1209 1240 1280 1322 1368 1451 1576 1693 1754
1020 1754 1788 1877 2063 2331 2675 3153 3839 4735 5761 6834 7953 9164 10456 11716 12801 13637 14220 14550 14600 14347 13796 12971
1017 12971 11915 10716 9492 8319 7211 6159 5185 4318 3570 2952 2501 2232 2091 1987 1864 1723 1587 1491 1462 1492 1505 1431
1015 1431 1281 1135 1030 943 863 828 854 876 824 715 641 665 755 831 841 799 755 736 727 717 725 749 738 655 564 565 652 716 708 697 740 787 779 747 743
1010 743 742 703 663 672 691 663 644 724 854 879 773 687 739 864 940 950 943 923 867 812 810 836 807 713 642 662 735 772 745 710 718 754 768 765 796 867
1006H67M1l7n5NM9J0n2o4m5l5mO3Q5K0m0NQ2M3q2j29n9kl3o0j2L3Lm6l3J3K4K0M7P4N5J9L1
1001H01O4M7j5o1p6q9r1k7Q7J42Q1k3o2j1N4P0L7ql8m7k6J6M5L9J4J4L4K2l6p3l4M1O8L2m
997I87%K0L5M4M7L4K3K6K3j9n8l2M3P5L9RL2N0Oo5r9r1p5m8RP1R6P5K8k9o3m0L4R1Q3M7L6
993A444O2J07J56J76J33M9J6P0J51J97K43L57N20O94Q95J135J331J376J298J222J217J225
990A4074J142Q93M49j29o47r24r86j034j195j392j475j408j246j042q23o21m57l25k22j62
988B470j30r1l8k5p0j08p6j3ll8m1RL6j4q1p5j3J5k9p7o3j4J6K2L4L6qp3p7j2M6L8K5O7J38
983A783J59J35J27J53J72J65J50J15L5o0j00q7r7j58j89j32m5k3n6o3j4K7J0m7r0q7l7L7Q5
980A868N6k5p7m4J9L6OkK9M2J0JO9J43J31M8J2N0P5L1j4J0P0Q5O0O1J04J49J57J32Q5L8K2
$$ plain form
1006 867 908 871 816 821 870 880 828 764 719 684 680 743 828 848 808 813 895 938 856 727 668 666 633 573 561 594 597 551 518 531 555 575 622 696 751 770 801
1001 801 865 912 897 836 760 671 580 553 640 782 863 840 778 767 821 891 928 920 882 835 809 825 870 909 923 937 971 993 957 884 850 891 959 991 987
997 987 987 1007 1042 1086 1133 1167 1190 1216 1239 1220 1162 1130 1173 1248 1287 1296 1328 1378 1384 1319 1220 1129 1054 1006 1015 1086 1182 1257 1285 1256 1193 1153 1187 1278 1361 1408 1444
993 1444 1506 1613 1769 1945 2078 2127 2143 2213 2364 2561 2804 3161 3681 4375 5270 6405 7736 9112 10410 11632 12849 14074
990 14074 15216 16109 16558 16429 15782 14858 13872 12838 11643 10251 8776 7368 6122 5080 4257 3636 3179 2854 2632 2470
988 2470 2340 2249 2211 2186 2116 2008 1932 1919 1916 1878 1837 1846 1882 1868 1787 1712 1699 1714 1685 1608 1545 1531 1547 1569 1603 1639 1631 1558 1481 1469 1515 1553 1578 1645 1783
983 1783 1942 2077 2204 2357 2529 2694 2844 2959 2994 2934 2834 2747 2650 2492 2303 2171 2126 2103 2047 1984 1970 1997 2007 1960 1870 1783 1746 1783 1868
980 1868 1924 1899 1822 1778 1797 1833 1839 1837 1866 1908 1918 1919 1988 2131 2262 2310 2322 2372 2447 2478 2464 2474 2544 2629 2689 2750 2854 3003 3160 3292 3377 3415 3437
976C437L8M3J0j6jLn9j36j28n6k3n3n2K8J05J00O1O5J02J10R8J07J29J15P0N2Q0J09R8O5N2
972D553P1R4Q4M1KRN8J00R6N6K8K9M1L4Nj2J1O2R1P1L4K8N6Q4Q9Q7J01J31J64J78J64J45J59
968F944K08K38K18J92K17K83L31L40L32L01K26J37J03J30J48J20R1R3J12J35J87K70L35L50
965A2041L51L63L47K82K31K58L15L17K82K99L94M85N02M62M13L81L71L87M08M05L80L76M12
962B0462M61M88M94N09N59O44P40Q17Q65R13R88J069J123J178J291J464J646J830K097K498
960D2136K983L493M065M760N524O234O850P421P964Q427Q823R252R802J0522J1580J3313J6130
958A79279K0485K7120L7106N1454P0631R4446J21975J51277J79311K02758K19195K27396K26624
956A809057K16054J94964J63094J20767O9323J2010m5988r9230j44054j78996k03752k18367
$$ plain form
976 3437 3475 3518 3528 3512 3511 3514 3455 3319 3191 3135 3112 3059 3007 3035 3140 3240 3301 3366 3468 3578 3676 3783 3912 4027 4097 4149 4229 4338 4436 4501 4553
972 4553 4624 4718 4802 4843 4845 4854 4912 5012 5108 5164 5192 5221 5262 5296 5301 5289 5300 5362 5453 5524 5558 5586 5642 5726 5815 5902 6003 6134 6298 6476 6640 6785 6944
968 6944 7152 7390 7608 7800 8017 8300 8631 8971 9303 9604 9830 9967 10070 10200 10348 10468 10559 10652 10764 10899 11086 11356 11691 12041
965 12041 12392 12755 13102 13384 13615 13873 14188 14505 14787 15086 15480 15965 16467 16929 17342 17723 18094 18481 18889 19294 19674 20050 20462
962 20462 20923 21411 21905 22414 22973 23617 24357 25174 26039 26952 27940 29009 30132 31310 32601 34065 35711 37541 39638 42136
960 42136 45119 48612 52677 57437 62961 69195 76045 83466 91430 99857 108680 117932 127734 138256 149836 163149 179279
958 179279 199764 226884 263990 315444 386075 480521 602496 753773 933084 1135842 1355037 1582433 1809057
956 1809057 2025111 2220075 2383169 2503936 2573259 2585269 2539281 2440051 2295997 2117001 1913249 1694882
955A694882k23269k19220k06937j87287j62147j34612j07872q3976o3803m7697l5638k7021
953A95403k0881j6464j3386j1324r882q828q118p679p334o987o674o389o021n528n008m539
951E0361m095l640l202k794k410k071j822j622j379j107r23q63q29p45o71o70o96o71o12n92
949A8947o29o41n49l43j06P3J98L65O24R15J135J272J346J342J238J084R17O84L41k4k97n36
946B7356q77j279j530j551j487j478j484j413j276j116r20o96n14m06l02j52k1J3j1j4NJ3
943A0860J6J7j0o5p7j4L4rq0p1lJ8l1q0r7j12j12n0O2J31J02L3jJ6M4N3N1N7Q4J13J08P6R0
939A1153K00L62M82N35N81O87Q37R63J022J032J043J065J051R51P61N25K79N6j00j75k27l36
937B2747m83n57n06m02l30k93k54k01j26j6J17K03K29K69L70M50M20L33L17L74L90L23K59
$$ plain form
955 1694882 1471613 1252393 1045456 858169 696022 561410 453538 369562 305759 258062 222424 195403
953 195403 174522 158058 144672 133348 123466 114638 106520 98841 91507 84520 77846 71457 65436 59908 54900 50361
951 50361 46266 42626 39424 36630 34220 32149 30327 28705 27326 26219 25296 24433 23604 22859 22188 21518 20822 20151 19539 18947
949 18947 18318 17677 17128 16785 16679 16752 16950 17315 17939 18854 19989 21261 22607 23949 25187 26271 27188 27872 28213 28189 27892 27356
946 27356 26479 25200 23670 22119 20632 19154 17670 16257 14981 13865 12945 12249 11735 11329 11027 10875 10854 10867 10856 10842 10847 10860
943 10860 10876 10893 10883 10818 10741 10727 10761 10752 10672 10601 10598 10616 10585 10505 10408 10296 10184 10134 10196 10327 10429 10462 10461 10477 10521 10574 10625 10682 10766 10879 10987 11063 11153
939 11153 11353 11715 12197 12732 13313 14000 14837 15800 16822 17854 18897 19962 21013 21964 22725 23250 23529 23585 23485 23310 23083 22747
937 22747 22264 21707 21201 20799 20469 20176 19922 19721 19595 19579 19696 19899 20128 20397 20767 21217 21637 21970 22287 22661 23051 23374 23633
934B3633K83L58M29M96N70O16O17O50P95J002J122J082R62Q95R53J139J424J766K116K482
931D3390K941L564M336N187O097P058P989Q736R239R582R888J0175J0417J0650J1020J1766
929A72035J3237J5872K0183K6853L7045N2723P6602J11120J55849K04381K44221K62930K57856
928A650907K40243K26613K22520K14020J77366J00348l778j03126j69671j98312k06813k17800
926A932517k39357k60681k64438k42620k01764j55741j15529q4927o2771m6652l4719k5826
925A97492j9333j4885j2078j0327r089q135p507p257p294p409p379p086o578o003n486n043
923E6603m601m100l556l064k702k446k191j873j527j240j043r18q25p38o18m08n9M20R76J515
920B7605J943K188K232K157K114K177K195J879J091L5r11j522j845k062k308k615k917l071
$$ plain form
934 23633 23916 24274 24703 25199 25769 26385 27002 27652 28447 29449 30571 31653 32615 33510 34463 35602 37026 38792 40908 43390
931 43390 46331 49895 54231 59418 65515 72573 80562 89298 98537 108119 118007 128182 138599 149249 160269 172035
929 172035 185272 201144 221327 248180 285225 337948 414550 525670 681519 885900 1130121 1393051 1650907
928 1650907 1891150 2117763 2340283 2554303 2731669 2832017 2828239 2725113 2555442 2357130 2150317 1932517
926 1932517 1693160 1432479 1168041 925421 723657 567916 452387 367460 304689 258037 223318 197492
925 197492 178159 163274 151196 140869 131780 123645 116138 108881 101587 94178 86799 79713 73135 67132 61646 56603
923 56603 52002 47902 44346 41282 38580 36134 33943 32070 30543 29303 28260 27342 26517 25779 25161 24753 24694 25114 26090 27605
920 27605 29548 31736 33968 36125 38239 40416 42611 44490 45581 45616 44705 43183 41338 39276 36968 34353 31436 28365
918B8365k963k617k194j849j627j479j330j130q88o62n13m39l97l58l16k66k08j73j73j69
916H614j18m7k3n0o9n1j7QK4J8k1n8o1o2j21j97j84q1k0q2j76j73q8m8j05j83j89j37r9j12
912F092j36j22q8r1j28j37r7p7j28j75j26k1J6n4j27j19o4k7j6j3j4j9j6j1j9k6ON7P3N1M4
908D488O0N3K0K6R3J34R1J5j6j2k1l7j9L0O9Q7R8Q6K8n6j12j09q5q7j26j65j64j34j30j56
905C949j59j07n5o4r5o8kJ3l4o2l7pnoom3r8j07o6l9n1m6oJ3NL1Q7O8m0j02m2L6J3n6n9j4
900B739j3m6m5j4poK9O0J4o3o5kK3k3n1oN6O3J5l5m0pJ6j5p2o5J0N1Jn5k3M4L7m1r1p3k1L8
896B317Q6P9J5j7M0J01O8kJ4Q3P0rnR7J47Q4N0J62L34M32M74N63P21Q89J024J118J162J167
892A1264J169J166J085Q61N24J67j48m10o46q89j126j277j266j140j029r98r68q54o75n07
$$ plain form
918 28365 25402 22785 20591 18742 17115 15636 14306 13176 12288 11626 11113 10674 10277 9919 9603 9337 9129 8956 8783 8614
916 8614 8496 8449 8426 8376 8307 8256 8239 8247 8271 8289 8268 8210 8149 8087 7966 7769 7585 7504 7484 7402 7226 7053 6965 6917 6812 6629 6440 6303 6204 6092
912 6092 5956 5834 5746 5655 5527 5390 5293 5216 5088 4913 4787 4766 4782 4728 4601 4482 4418 4391 4375 4362 4348 4329 4313 4302 4283 4257 4263 4320 4393 4444 4488
908 4488 4548 4601 4621 4647 4740 4874 4965 4980 4964 4952 4931 4894 4875 4905 4974 5061 5159 5245 5273 5217 5105 4996 4911 4824 4698 4533 4369 4235 4105 3949
905 3949 3790 3683 3628 3564 3469 3401 3399 3412 3378 3316 3279 3272 3267 3261 3255 3212 3114 3007 2941 2902 2851 2805 2799 2812 2817 2848 2935 3003 2963 2861 2819 2855 2868 2812 2753 2739
900 2739 2726 2680 2635 2621 2614 2608 2637 2697 2711 2648 2583 2581 2604 2581 2530 2524 2580 2643 2658 2623 2583 2576 2592 2577 2505 2440 2450 2501 2502 2447 2424 2468 2505 2464 2373 2300 2279 2317
896 2317 2403 2482 2497 2480 2520 2621 2689 2687 2701 2784 2854 2845 2840 2937 3084 3168 3218 3380 3714 4146 4620 5183 5904 6793 7817 8935 10097 11264
892 11264 12433 13599 14684 15545 16069 16236 16088 15678 15032 14143 13017 11740 10474 9334 8305 7307 6339 5485 4810 4303
890D303l85k92k11j53j33j42j39q6KL8j3p5n1K8N6Kn2n6m4m7m2k5k6n2o7n1l2j5K0N5L1m7
886B299r6p0j4J5J7Qj9m9m8k6j9k2PM2J6m9m4M3J02N4k9n3l3k1j1J4K1%JN0Q6O3L1M7Q6J18
881B517J98L86N96O46M29Pm31o75o24l87j90j51j76j43o3k6l6l2onk8l8k7j9k5k9k8j8QL9
878A669L4rm3m3m3n7l8J9M4Pk5kJ0m0q5m2L9N3J7J7N0L5l5p3m7j2j3k8m4o3o1j1N3O1K3ML1
873A352N6N4L8L3L8N2O1K5n2q4k3O2O2pn1l9k5k8jN5Q0M9Mj6j6jK7L3j4p3o5J1P0O2J8k6n9
869A662p0l9J2M7O1O0L0l3o1j1L5j1q6n9N9J12N5J2N7J04P8N0R9J61J34M3j1kK9O3J11J63
865B854K14L20N24P79R90J141J268J361J369J302J246J214J100P79K56l15p62j010j100j145
862A2385j227j354j447j408j214r49p26n76m39k82j50r3r7j10j17j21j03n8k6k8k6%Kn5j03
$$ plain form
890 4303 3918 3626 3415 3262 3129 2987 2848 2762 2764 2802 2789 2714 2663 2691 2747 2749 2697 2641 2597 2550 2508 2483 2457 2405 2338 2287 2255 2240 2260 2315 2346 2299
886 2299 2203 2133 2119 2134 2151 2159 2140 2091 2043 2017 1998 1976 1983 2025 2041 1992 1948 1991 2093 2147 2118 2065 2032 2011 2000 2014 2035 2035 2036 2086 2172 2235 2266 2313 2399 2517
881 2517 2715 3101 3697 4343 4772 4779 4348 3673 3049 2662 2472 2321 2145 2002 1939 1913 1877 1845 1839 1834 1806 1768 1741 1722 1697 1668 1640 1622 1630 1669
878 1669 1703 1694 1651 1608 1565 1508 1470 1489 1533 1540 1515 1513 1523 1483 1398 1356 1395 1448 1465 1482 1532 1567 1532 1459 1412 1400 1387 1359 1315 1252 1191 1180 1233 1294 1317 1321 1352
873 1352 1408 1462 1500 1533 1571 1623 1684 1709 1657 1573 1550 1612 1674 1667 1616 1577 1552 1524 1523 1578 1658 1707 1711 1695 1679 1678 1705 1738 1724 1651 1586 1597 1667 1729 1747 1721 1662
869 1662 1592 1553 1565 1612 1673 1733 1763 1730 1669 1658 1693 1682 1596 1537 1596 1708 1763 1775 1832 1936 2014 2064 2163 2324 2458 2501 2490 2488 2517 2580 2691 2854
865 2854 3068 3388 3912 4691 5681 6822 8090 9451 10820 12122 13368 14582 15682 16461 16717 16402 15640 14630 13530 12385
862 12385 11158 9804 8357 6949 5735 4786 4060 3484 3045 2763 2613 2520 2423 2313 2196 2075 1972 1914 1888 1860 1834 1834 1836 1781 1678
859A678p1LJ9j8l2k1l9p8o3nOl6m1J7N5L9M0Q4Q1j3r9q1rJ3j0j3J0K0L1N6O3J5m2m0QM3M6
855A616L1jm8p2m8k2k0rM0O6J0p2p9j7K5J3rrk0m7m7KO2P9N4J9j0l7m9l2QL3Pm8o5k1K3J2
850A318j5J9R1R4Lq3p9k1Oj2l5k6J8P8R3K3p4r1k6J9lrM8Q4L0m9n8k4k7n2m1mNkJ6M1K9J8
845A302N5Q7L5n2n7J4M1k9j08j12o1qL2N5M5J2mnk4m8l4J5M5M4N1O9M9j7n8l4Mml9m5k4j3
841A179k2k4j1NJ7L2N3O1L3k3p0p0l2LK1M0O2N9K4j8m7n9m9MN8N1kkO5Q2k9j49j21QO7Pm2
837A161pM2J6m4n3nL1K3nqL4Q5Q7J6o7q5l2K6L0j6p4q6k4O4R1M2rj5l5r5j20m8L3J2o3m9O6
832I19J53J48R9M2l3q2l9N4O5k7r5n8PJ3j6l0k9k0J9O7O5Nk9mJ8j5n5m6oJ7J8Ok9o5m9J7N0
828A055J6l0l1j2mRK9J6k6k2L7P4M0mnj0o1q5k5M7L1l4l0M6R4O7K0LKj8m6n5k9K2N1K9j6k0
$$ plain form
859 1678 1607 1610 1629 1611 1579 1558 1519 1441 1378 1373 1379 1343 1302 1319 1374 1413 1453 1537 1618 1605 1506 1425 1416 1429 1419 1406 1416 1436 1467 1523 1586 1601 1559 1519 1527 1570 1616
855 1616 1647 1646 1598 1526 1478 1456 1436 1427 1467 1533 1543 1471 1392 1375 1400 1413 1404 1395 1375 1328 1281 1283 1345 1424 1478 1497 1487 1450 1401 1369 1377 1410 1417 1369 1304 1283 1306 1318
850 1318 1303 1322 1413 1507 1510 1427 1348 1327 1333 1321 1286 1260 1278 1356 1449 1472 1398 1307 1281 1300 1297 1288 1336 1420 1450 1401 1343 1319 1292 1240 1199 1195 1200 1198 1214 1255 1284 1302
845 1302 1357 1444 1479 1427 1370 1384 1425 1396 1288 1176 1115 1107 1139 1194 1239 1251 1247 1242 1218 1170 1136 1151 1196 1240 1291 1360 1409 1392 1334 1300 1304 1300 1261 1216 1192 1179
841 1179 1157 1133 1122 1127 1144 1176 1229 1290 1323 1300 1230 1160 1128 1131 1152 1192 1254 1313 1337 1319 1272 1213 1164 1168 1226 1277 1275 1273 1338 1420 1391 1242 1121 1129 1196 1203 1161
837 1161 1154 1196 1212 1168 1115 1110 1141 1164 1159 1151 1185 1270 1357 1373 1306 1221 1189 1215 1245 1229 1155 1069 1045 1109 1200 1242 1233 1218 1183 1088 968 920 953 965 902 853 919
832 919 1072 1220 1319 1361 1328 1246 1207 1261 1326 1299 1204 1146 1153 1166 1150 1120 1091 1071 1090 1157 1222 1227 1198 1194 1212 1197 1142 1096 1090 1107 1125 1131 1102 1037 988 1005 1055
828 1055 1071 1041 1010 998 994 1003 1032 1048 1022 1000 1037 1111 1151 1147 1142 1132 1071 986 961 1008 1039 1005 975 1021 1115 1182 1202 1205 1207 1189 1143 1088 1059 1081 1132 1161 1145 1125
823A125J8L3qm9m3j6%J3L3M2L1L4N5O0L9L3N2N0K1K4P2Q6L0k6l0k7n8o4j1K2k4q1o4k2l5o4
818A251k9L5L9NQK3k5j00r9l2NKL6J00R8Qn7l5J3J4j7l1k7k1j5j3k4k3RN5P1O4O2M9j0p8q6
814A225m1j1k1k8j3NRMj6l5j4O1J14R5N8P6J11J00Q7J34J92J78J62K85N54R06J372J909K103
810I561J428l8j465k048j784j260q98o71m47k50j58j33j05p2o6q9j08j07p4j9K2K0qk2k0k4
807A165l8m4l5j6J6N4O2L1%OK8K3mj0QOl8q3p6%R0J17N1m9q5m2Kj4m9l5J5L4Mk1oJ5mm6n3
802I79j9J4K0J8K3Pm2p5l2N8Q7K0n2l7L1M4j5p3o6j3L9N7L7j2n3n9l5j0J1L2M3M0L8L0on2
798I77l0N6R4J2q5o6K1K9n3q7j7M3K0j5K2P8O9J8%J8J8j6m0j7L1N6K6l4n9k5Pj0m5l9k1l4
794I02m3J3Q3P9K0J5O2N8j5n1k0pm6n5mJ9j2%Q1R8pr0m0M7K7n1o8m3n6p4j9M7K2n0m2L1N8
$$ plain form
823 1125 1143 1176 1168 1119 1076 1060 1060 1073 1106 1148 1179 1213 1268 1328 1367 1400 1452 1502 1523 1547 1619 1705 1735 1709 1679 1652 1594 1530 1519 1541 1517 1436 1372 1350 1315 1251
818 1251 1222 1257 1296 1301 1309 1332 1307 1207 1108 1076 1081 1083 1119 1219 1317 1325 1268 1233 1246 1260 1243 1212 1185 1164 1149 1136 1112 1089 1098 1153 1224 1288 1350 1399 1389 1311 1225
814 1225 1184 1173 1152 1124 1111 1116 1125 1129 1113 1078 1064 1125 1239 1334 1392 1468 1579 1679 1766 1900 2092 2270 2432 2717 3271 4177 5549 7458 9561
810 9561 10989 10951 9486 7438 5654 4394 3496 2825 2378 2128 1970 1837 1732 1660 1594 1505 1397 1290 1216 1197 1219 1239 1231 1209 1189 1165
807 1165 1127 1083 1048 1032 1048 1102 1164 1195 1195 1201 1229 1252 1248 1238 1246 1252 1214 1131 1055 1055 1145 1262 1313 1264 1179 1137 1139 1125 1076 1041 1056 1090 1094 1073 1067 1082 1078 1032 979
802 979 960 974 994 1012 1035 1042 1000 925 893 951 1038 1058 1006 969 1000 1044 1029 956 890 877 916 973 1010 998 945 886 851 841 852 884 927 967 1005 1035 1029 977
798 977 947 1003 1097 1109 1024 958 979 1008 955 868 851 894 914 899 921 999 1068 1086 1086 1104 1122 1106 1066 1049 1080 1136 1162 1128 1069 1044 1051 1041 996 957 936 902
794 902 859 872 955 1034 1054 1069 1131 1189 1174 1123 1103 1096 1050 995 991 1010 998 998 1079 1177 1170 1080 1040 1087 1114 1063 995 952 896 822 803 850 872 822 780 811 869
789H69K9L2O7N4LKM5K6o4j08n0K2L4K4L6M0J1j2mMj1k0j7l7p1m8N4J37J07pr7r4k7L3M1J8
785A021PJ7Ol7o7l9J7L8K8K4L4L7L2K2kl5l5JMn7r6l6N5N8nk7L%m0k2N2O8j1o9j8O3O8J4r
780A064J1J7j0l7m2l3k0n%qk0k3nL4Q4J06P5J2l5m9l6rJ3j2p8j13o2K3N8L6J6J4kk1kL5L7
775A013J3J6M8M8J0oJ2J5j2k4mJ3J6K7L9Qm8o0j3J4k2n8l3L7Q6Q4L6k8o6o1n0o9p7l1K3J3
771I09l5k7L5N5J5lK8L6M%M6N1j3n7j3M6L3k3m0j8PK9M6K6j6k2L0O7M6J4J1mn6q5m4J5L2L0
766A155L9K6k9n8j6L3Po0q9p2o4o9m8MO9J23J30N3n5p5J3P6K6o0o7k1j7m0j7M2O3L9J7jl1
762A026m9k3J6K5K3K9Jp1r8j4Q4P5PjM6L7k2k3N2R0L7k8l2rmkQQrk2l4p1j01p0J6O8M2k0o1
757I26o1k3L4N2Rm0k5K5L1mmM2N2%l9j5K1%n2o1j4L3K4l0n4oO1N3k4m3N8J57J17j8q7l4M7
$$ plain form
789 869 898 930 997 1051 1054 1056 1101 1127 1063 955 905 927 961 985 1021 1061 1072 1060 1056 1060 1049 1029 1012 975 904 856 910 1047 1154 1147 1050 956 929 962 1003 1021
785 1021 1028 1045 1051 1014 947 908 925 963 991 1015 1049 1086 1118 1140 1138 1103 1068 1069 1073 1016 920 884 939 997 992 965 968 968 928 906 958 1026 1015 946 928 991 1059 1073 1064
780 1064 1075 1092 1082 1045 1003 970 950 945 945 937 917 894 889 923 1007 1113 1188 1200 1165 1116 1080 1071 1084 1072 994 881 819 842 900 936 952 966 964 943 941 976 1013
775 1013 1026 1042 1090 1138 1148 1142 1154 1169 1157 1133 1129 1142 1158 1185 1224 1232 1184 1124 1111 1125 1103 1045 1012 1049 1135 1219 1255 1227 1161 1100 1050 981 904 873 896 909
771 909 874 847 882 937 952 949 977 1013 1017 1017 1063 1114 1101 1044 1031 1077 1110 1087 1047 1029 1036 1065 1111 1137 1121 1099 1129 1196 1242 1256 1267 1263 1207 1122 1078 1093 1125 1155
766 1155 1194 1220 1191 1133 1117 1150 1157 1097 1008 936 872 803 755 759 828 951 1081 1134 1079 1004 1017 1093 1119 1059 992 971 954 914 897 939 1002 1041 1058 1057 1026
762 1026 977 954 970 995 1018 1047 1048 977 879 865 949 1024 1031 1030 1076 1113 1091 1068 1120 1210 1247 1219 1187 1178 1174 1172 1180 1188 1179 1157 1123 1052 951 881 897 965 1007 987 926
757 926 865 842 876 928 937 897 872 897 928 924 920 962 1014 1014 975 960 981 981 929 868 854 887 911 881 827 821 882 935 911 868 926 1083 1200 1182 1095 1061 1108
753A108O7L7pn0o8n3l8m7l6K8Q1M7k6m0jLk1KM6Qq6q5L5J16M5p4j12p7m6k4RL1K0J5M3N4J2
748I16l9m7l2j8J2N9P3M5L2M7J9o5r8j7Q7Q9K8OK5J0m1o0l2j5k7k9rOMJ5L9M8L4J9K0K0Kl7
744A089q2j01o6ON0L8J8K8L8qr2j21m8P7J46J12J9m8n3l0k2k1pQlj1J4M9L6j8m2rK9L4K2O
739A037k0l7MQ2J14N9k0o2o7n5j1M5N7J7j4%J0k1m2j4K0Qj4%L2L3J3Lpk5k1K6N4Qo0n8QM8
735A130K4j1oK1K4qm9n8l1%J0J3L0M7M0K9M3N0J5j6L0J09J02J3l5lJ5j7nR1J38M2p7p8pJ2
730A627JN1J24J12L1j3j0l8q7p8j7Jl7m2JK0qj9J0J6k9o2l6J7N5P0N6%n6m9OK3k8p5o1j4R
726A471Jj5k6j8J1N1Q1R8R6N6qj9M7J15J02N1N1Q6P8L0J0J5nk8K7J28J31mj34j41p0k8l1l8
722B171m4o6p5m3OL3L5J7j7m4j8M9Q1K7n7q4m9j4k4m7k5M2Q4L8n6r1m6mk0l0K6R0P1Nj1K2
$$ plain form
753 1108 1175 1212 1205 1155 1087 1034 996 949 913 941 1022 1069 1043 1003 1002 1005 984 986 1032 1040 954 869 904 1020 1065 991 879 802 756 732 741 772 792 807 850 904 916
748 916 877 830 798 780 792 851 924 969 1001 1048 1067 1002 904 887 974 1063 1091 1097 1122 1132 1091 1031 999 984 957 928 919 925 929 944 983 1031 1065 1084 1104 1124 1126 1089
744 1089 1007 906 840 846 896 934 952 980 1018 1010 918 797 749 826 972 1084 1103 1055 1002 972 950 929 922 930 927 916 930 979 1015 997 955 946 975 1009 1031 1037
739 1037 1017 980 984 1066 1180 1239 1219 1157 1090 1035 1024 1069 1126 1143 1129 1129 1139 1118 1076 1062 1082 1090 1076 1076 1108 1141 1154 1157 1150 1125 1104 1130 1184 1192 1132 1074 1082 1130
735 1130 1154 1143 1137 1158 1182 1174 1125 1067 1036 1036 1046 1059 1089 1136 1176 1205 1248 1298 1313 1297 1327 1436 1538 1551 1516 1513 1528 1511 1506 1597 1735 1777 1700 1622 1615 1627
730 1627 1628 1679 1803 1915 1946 1933 1923 1885 1798 1720 1703 1704 1667 1625 1626 1646 1638 1619 1629 1645 1616 1554 1518 1535 1590 1660 1716 1716 1660 1611 1617 1640 1612 1537 1476 1462 1471
726 1471 1472 1457 1431 1413 1424 1475 1556 1654 1750 1806 1798 1779 1826 1941 2043 2094 2145 2231 2309 2339 2349 2364 2359 2331 2358 2486 2617 2613 2479 2338 2268 2240 2209 2171
722 2171 2127 2061 1986 1943 1949 1982 2017 2034 2017 1973 1955 2004 2085 2112 2055 1971 1922 1908 1884 1837 1812 1854 1938 1976 1920 1829 1783 1779 1759 1729 1755 1845 1916 1921 1910 1932
717A932L5K6N8J06Q8K2J2O8Q1Rm1%N0J1p3r8m5J7K6j7o7o6%N5J7p7j14o6j4j0j1J0K1jj6p
713A921j9n3n6j0K1jk6j2J3J8J1j2o8j20r4j6%o2p7J6J07R2L8N4R1M5o2j14p1LM8O6O1M6M3
708A821O2O1K6jRJ6j6m6k7jk8q6j06p9m9l6l9m4l1J1M2No4n8L2P4kq0m4M6O4J3j3Jj0m1l9
704A343j4k7p2p3j9L1M0K9J9J0J5L8M1J0j9j1j2m7n7J4R5Q3Mk9J2M9L0j4m2n1l9j1nl6m6R
699A248N9J2q1q8oN0K0j5J0M8L8j0m5n6o0m5mN6J00Q8J1q0j08n4NJ3moj9o2o7J5R6Q2K2K4
695A187O8N0k1l7J1J8l5n3kK2j4k9J1J4o3j08k6Q6Q3j1n7j7J6j5n4l1K0J3n5r0k7P9J02J9
691A054n7l7J5Km4j9O2Q5K5j6K3P3O2K6J4J5NLK2K1j2k9LL1Ln0p2n9l7j9j2m0q5q4j6M8L6
686I40j5l1%J6ml0l0rRK0K6L1L0K3K1K8K7ro2o7nN3L7j1j2L0L9P%M0P7P2M6K0j7n6n1rJ0j7
$$ plain form
717 1932 1967 1993 2051 2157 2245 2267 2279 2347 2428 2437 2396 2396 2446 2457 2384 2286 2241 2258 2284 2267 2200 2134 2134 2189 2206 2129 2015 1949 1935 1925 1914 1924 1945 1944 1928 1921
713 1921 1902 1849 1793 1783 1804 1803 1777 1765 1778 1796 1807 1795 1727 1607 1513 1497 1497 1435 1358 1374 1481 1573 1611 1665 1756 1801 1739 1625 1554 1557 1605 1671 1732 1778 1821
708 1821 1883 1944 1970 1969 1978 1994 1978 1932 1905 1904 1876 1790 1684 1605 1556 1520 1481 1437 1406 1417 1459 1464 1400 1342 1374 1448 1446 1366 1322 1368 1432 1445 1432 1433 1423 1382 1343
704 1343 1329 1302 1230 1157 1138 1169 1209 1238 1257 1267 1282 1320 1361 1371 1352 1341 1329 1282 1225 1239 1334 1417 1421 1392 1404 1453 1483 1469 1427 1376 1337 1326 1321 1285 1239 1248
699 1248 1307 1319 1238 1150 1144 1194 1214 1199 1209 1257 1295 1285 1240 1184 1124 1079 1075 1131 1231 1319 1330 1250 1142 1088 1093 1106 1102 1096 1077 1015 948 963 1059 1141 1163 1187
695 1187 1255 1305 1284 1247 1258 1276 1241 1188 1186 1208 1194 1165 1176 1190 1127 1019 993 1079 1162 1151 1094 1077 1093 1078 1024 993 1013 1026 971 881 854 933 1035 1054
691 1054 997 960 975 977 933 914 976 1061 1086 1070 1093 1166 1228 1254 1268 1283 1288 1291 1313 1334 1322 1293 1296 1327 1330 1280 1208 1149 1112 1093 1081 1041 956 872 856 904 940
686 940 925 894 894 910 906 876 846 837 846 866 892 923 953 976 997 1025 1052 1043 981 914 909 962 999 988 976 1006 1045 1052 1052 1092 1169 1241 1287 1307 1290 1234 1183 1174 1184 1167
682A167m0j9J3Ml7o7n9j6L5N4L6K2L4K2m5r1l5O9Q0j0q2o1nK9N5P1L2m1o0j4Lm7o5QP1K4p1
677I64q3pN2N1L6L6M3L9K3nk5rK4J2n0q7o0j9j9l7l0k2l5l7RO7P2K6j2j1K8P1Q1L3l6o7p2
672I44r8j22o9M2Q8J6n1oQ7R7K3l3k0K8O5O8K8l5o7m6j1llOJ2J7L6O0M9Pj5j2l0n6k2N2O3
668A089OoO1R1J8n5m1j1m3p2j6N7M1l5o4m0nL9P5L8o6j04j4P6M4rL6R6L3p4m9O9R6J7j6L3
664A295L8l5p2k7J1j3k9kRj0jL8L3j9l3J3L7Rj0J4L5L4M3M4rq1o8J6N7J4k2LL3K1RJ4km2n2
659A293l0k5l7lO1P1J5j6ok2o6m7M4Q1J1o6n7jK5L2M3L7Oj1qj5j6L7R7P3oj7M3L5o2r8kQ7
654A480N1k6k9ml8q7p3k9j8oN3R9O5Kj8j9l9l2K3M5l0j01o7J2K5PM2Q1K6o8n9M1Q7K4m1m0
650A339k3l2k9J6N8O1M5L3J9KQK7J4l1n8l9%K1K4J8Qjnj6l1l3j4MLnnpj3JM6P8O8L3Rmj5j3
$$ plain form
682 1167 1127 1108 1121 1125 1088 1021 962 946 981 1035 1071 1093 1127 1149 1104 1013 978 1047 1127 1117 1035 974 969 998 1053 1124 1156 1115 1055 1041 1044 997 932 940 1011 1035 964
677 964 881 874 926 977 1013 1049 1092 1131 1154 1149 1124 1115 1139 1151 1101 1014 954 935 916 879 849 827 792 755 764 831 903 929 917 906 934 1005 1086 1119 1083 1016 944
672 944 846 724 655 697 785 801 750 744 831 928 951 918 898 926 991 1059 1087 1052 985 939 928 925 922 928 940 957 993 1053 1102 1109 1094 1082 1052 996 974 1026 1089
668 1089 1095 1089 1150 1241 1259 1204 1163 1152 1109 1037 1021 1078 1119 1084 1020 980 975 1014 1089 1127 1061 957 943 1019 1063 1054 1090 1186 1219 1145 1096 1165 1261 1278 1262 1295
664 1295 1333 1298 1226 1199 1210 1197 1168 1166 1175 1165 1164 1202 1235 1216 1183 1196 1233 1242 1232 1246 1281 1315 1358 1402 1393 1312 1244 1260 1317 1331 1309 1312 1345 1366 1375 1389 1387 1345 1293
659 1293 1263 1238 1201 1198 1259 1330 1345 1329 1323 1301 1235 1188 1232 1313 1324 1258 1201 1200 1225 1257 1300 1337 1343 1332 1324 1309 1293 1330 1427 1500 1494 1477 1520 1555 1493 1395 1393 1480
654 1480 1531 1505 1476 1472 1434 1347 1274 1245 1227 1221 1274 1373 1438 1440 1422 1403 1364 1332 1355 1400 1370 1269 1202 1214 1239 1246 1288 1369 1395 1327 1268 1309 1396 1420 1379 1339
650 1339 1316 1284 1255 1271 1329 1390 1435 1468 1487 1489 1497 1524 1538 1507 1449 1410 1410 1431 1455 1473 1481 1480 1475 1459 1428 1395 1381 1385 1388 1383 1378 1371 1358 1359 1405 1483 1551 1584 1593 1589 1574 1561
645A561krm4n6jQ9J39J03J0n8m1M3R3L4o3p3J4Q4N8j0m2k5K0P9J11O6k6p0k6L7M9K1k0n6n3
640A936J3P0K6p2o3Q0J88J45M6J0K2J7K2N8O1j1o0oP6P6K1kJ0J3L7J11J65J11Ol0J0N4P0Q0
636C290P2L3J1L6N6K8RN3R8P4L8P5J42J38P7M1M2L4K7O3J14J31J26J24J09P7R8J81K23J54
632E774O9P8J20J02P9J43K31K24J64J59J94J72J27J55K33K57K49L00L70L56K94L11L77L53
630A0891K46K09K73L11K76K63L12L52L49L50L61L30K82K86L15K81K15K12K40J81O4K1N6M3
627A6719k9l2L6K7p8j36j15j48k65l05k15j60k53l58l42k79k82l03k77k73l58m39m02k96k50
624A1187k83l34l69l68l06k28k26l00l23k42j59j69k15k19k00j93j64j04q1j13j31j03j10
621F247j84k30j81j14j14j43j46j41j50j28o4l2n8q2q3j11j45q7M1P6l6j45j34r3j04j07n3
$$ plain form
645 1561 1559 1550 1506 1450 1449 1538 1677 1780 1790 1732 1691 1734 1827 1861 1798 1725 1739 1823 1881 1871 1829 1804 1824 1903 2014 2080 2054 1984 1958 1995 2044 2065 2045 1989 1936
640 1936 1949 2019 2045 1973 1910 1990 2178 2323 2369 2379 2401 2418 2440 2498 2559 2548 2488 2482 2558 2634 2655 2653 2663 2676 2713 2824 2989 3100 3106 3076 3086 3140 3210 3290
636 3290 3362 3395 3406 3442 3498 3526 3535 3588 3686 3760 3798 3873 4015 4153 4230 4271 4313 4347 4374 4437 4551 4682 4808 4932 5041 5118 5216 5397 5620 5774
632 5774 5843 5921 6041 6143 6222 6365 6596 6820 6984 7143 7337 7509 7636 7791 8024 8281 8530 8830 9200 9556 9850 10161 10538 10891
630 10891 11137 11346 11619 11930 12206 12469 12781 13133 13482 13832 14193 14523 14805 15091 15406 15687 15902 16114 16354 16535 16599 16620 16676 16719
627 16719 16690 16658 16694 16721 16643 16507 16392 16244 15979 15674 15459 15299 15046 14688 14346 14067 13785 13482 13205 12932 12574 12135 11733 11437 11187
624 11187 10904 10570 10201 9833 9527 9299 9073 8773 8450 8208 8049 7880 7665 7446 7246 7053 6889 6785 6704 6591 6460 6357 6247
621 6247 6063 5833 5652 5538 5424 5281 5135 4994 4844 4716 4652 4620 4562 4480 4397 4286 4141 4054 4095 4171 4135 3990 3856 3763 3659 3552 3499
617C499l1r6j38p6j0m1q2l5J8k0q9p6k5k2k9J5M6lo1n3m9j06j35n1L8Pn8j9O6M8l4m3J0Jo5
613B301q1l5j2k1qJ2j1l8j3J0m1r8n8J9K0l3m3k4n5q5k6N2K1o8n4M5O8j0m6RM1j1p2p9n9l6
609A481J3N5L3k7m1k1l4o7m1K1L6%j0J2Kl1j8L7N9M2L3K1k5p0n6k8m4n0K6J00N9l2l3L4L7
604A473j9k0L5L5j7k2J6J3j2K1N3k5j42j11L2P2l4j02m8Oj2JQ0R6Rn1j1L3J3QN1L6o5j21o6
600A205j5l1k2P3J36Q2OPK6rl4J7P6O7K7J9Ol6m7PN4M0K1L6L3j0j6M1O4Jn8k7L4L3j2n2q1
596A661r4m5L8N3j2m9j1J8%QO8Q3J9k2J2K4m1p8rP6Q0L8K2J6LL4Q8N8n5q8J6J00N6oK1N2K
591B136k6P7J99J84P4J0pm3o7k4J6k5p6m3J3lm2j9J6j5m8jN1Kq4p7oK1RL5O8M6K1O5J07N2
587B596l1j7M5L4j3L4J41J61Q6N2Q5P9jn7m3l2o6r6p7l9pNj3n2m8J9P3O2L7M8L6l9q0j3O7
$$ plain form
617 3499 3468 3372 3234 3158 3148 3107 3025 2990 3008 2988 2899 2823 2798 2776 2747 2762 2808 2805 2744 2691 2642 2536 2401 2350 2388 2395 2337 2318 2384 2432 2398 2355 2365 2366 2301
613 2301 2220 2185 2173 2152 2144 2156 2145 2107 2094 2104 2063 1965 1907 1926 1946 1913 1870 1846 1791 1706 1680 1732 1753 1685 1631 1676 1744 1734 1688 1697 1738 1727 1655 1576 1517 1481
609 1481 1494 1549 1582 1555 1514 1493 1459 1392 1351 1372 1408 1408 1398 1410 1412 1381 1363 1400 1459 1501 1534 1555 1530 1460 1404 1376 1332 1282 1308 1408 1467 1435 1402 1436 1473
604 1473 1454 1434 1469 1504 1487 1465 1481 1494 1482 1503 1556 1531 1389 1278 1310 1382 1348 1246 1198 1204 1192 1193 1273 1369 1378 1327 1316 1349 1362 1370 1421 1457 1392 1271 1205
600 1205 1190 1159 1137 1210 1346 1428 1434 1441 1467 1458 1424 1441 1517 1584 1611 1630 1636 1600 1553 1560 1614 1654 1675 1711 1744 1734 1718 1759 1823 1824 1766 1739 1773 1806 1794 1742 1661
596 1661 1567 1522 1560 1613 1601 1552 1541 1559 1559 1567 1635 1718 1737 1715 1727 1751 1710 1632 1623 1699 1779 1817 1839 1855 1858 1892 1980 2038 1983 1895 1911 2011 2067 2061 2082 2134 2136
591 2136 2110 2187 2386 2570 2644 2654 2647 2604 2537 2513 2529 2504 2428 2385 2398 2395 2353 2334 2350 2335 2287 2286 2337 2339 2255 2178 2172 2193 2202 2237 2305 2351 2372 2437 2544 2596
587 2596 2565 2548 2593 2627 2614 2648 2789 2950 3036 3088 3173 3252 3251 3194 3151 3119 3053 2957 2880 2841 2834 2839 2826 2774 2726 2745 2818 2880 2917 2965 3001 2962 2882 2869 2936
582B936M3k8l9k2n6q8l6K6no1j5N9K9n3j9R3J18M5K5Q6J05O3O3J04Q2Oj8np5j94j78rJ11O8
578C161j1KN0M7Ol0p1j01p8l5n8j19r8LM4k6q8n8mNqj4l7m8J4J06J13J7n7m6k2k0LM4K1n5
574B552q0l9l8j06j24k9Q2J12Q3M8lm3j6M7L5m4o4J0M9j2o4k5K6J1oN1J22J10M0j0m4r7j45
570B389j39r5n8l1KL3L4Lm9q9p6k0J6J2L3R8R8l5j57r3Q0J42O3NM1N9Jn1m6l4l5rJ0n8j49
566A895j01N9J28L2n8k0N3M9Jl7q7j28p4N6J17P3M5Q8R2jp6m7J7N4R3J30O4q4j37k5J01J04
562B376L8jl2n7j2Q0R2K4K9J16R7p1j53j9J10K3j34j16K9Q2J6l3k8l0l0RL3Jj1M7P9Lo9k9
558B459M3K6k2J7Q6O6nrL8N3M8P7R9M9j3LN6P5Q1J07R5K5LQ0J44J08O3J02J26M5k3M5J55J55
553D457Q6O3M2m6j05l9M7J6m2K5J34J23M6P0J60J66Q3L2J6k2j4J17K53K38J50J62K34K06J24
$$ plain form
582 2936 2979 2951 2912 2890 2834 2746 2710 2736 2731 2670 2655 2714 2743 2690 2671 2764 2882 2927 2952 3038 3143 3206 3269 3373 3455 3461 3443 3438 3363 3169 2991 2982 3093 3161
578 3161 3150 3152 3202 3249 3255 3225 3154 3053 2975 2940 2882 2763 2665 2668 2712 2686 2598 2540 2536 2541 2533 2519 2482 2434 2448 2554 2667 2684 2627 2581 2559 2539 2542 2586 2607 2552
574 2552 2472 2433 2395 2289 2165 2136 2218 2330 2413 2461 2458 2415 2399 2446 2481 2437 2373 2383 2432 2420 2356 2331 2357 2368 2362 2413 2535 2645 2685 2675 2631 2534 2389
570 2389 2250 2155 2097 2066 2068 2101 2135 2138 2089 2000 1924 1904 1920 1932 1965 2063 2161 2126 1969 1876 1956 2098 2161 2166 2207 2266 2267 2216 2170 2136 2101 2092 2102 2044 1895
566 1895 1794 1853 1981 2013 1955 1935 1988 2037 2038 2001 1914 1786 1712 1768 1885 1958 2003 2091 2183 2182 2106 2059 2076 2130 2223 2353 2417 2333 2196 2171 2272 2376
562 2376 2414 2413 2381 2324 2312 2392 2484 2508 2537 2653 2750 2679 2526 2507 2617 2640 2506 2390 2419 2501 2517 2484 2456 2426 2396 2405 2438 2439 2428 2475 2554 2557 2488 2459
558 2459 2502 2528 2506 2523 2609 2675 2670 2661 2699 2752 2800 2877 2976 3025 3012 3015 3071 3146 3227 3334 3429 3454 3457 3537 3681 3789 3852 3954 4080 4125 4102 4147 4302 4457
553 4457 4543 4606 4648 4602 4497 4458 4505 4521 4479 4504 4638 4761 4807 4877 5037 5203 5286 5318 5334 5312 5298 5415 5668 5906 6056 6218 6452 6658 6782
550F782J42K26J86K9n8qO7J21J89K44K29K03K36K28P7p9m7Q9J13M9P6J68J36J5K8J82K63K16
546A0102K19L10L35K65K72L90M41L63L19L85M33M03M09M93N25M46L79L88L79L22L30M45N45
544A8898N52N39N40M88L85L52M21N00N45O04O34N17K79O6r8k93m63m47k86k21l17l78k99k00
541B2318j68j23l3ln0n4J1L1K1J33L56M66M01L49L97M04L30L79O50R39J078J181J391J614
538C2018J713J698J563J222P49M65N57Q43J087J303J555J697J580J293R83O19J56k45m15m43
535D9998n33p00q10q14p72p33p19p29o95n37l58l89o59r09r21p60n51k73Q4L50L84K95K87
532C9536M04N89Q01R67R76Q45P49P98R43J168J517J860J898J588J253J124J022P32L94K73
530E9437L60M89O43Q89J136J231J187J085R19P12O48Q48J154J317J288J116P52J73m40q74
$$ plain form
550 6782 6924 7150 7336 7365 7307 7299 7366 7487 7676 7920 8149 8352 8588 8816 8893 8814 8767 8856 8969 9018 9094 9262 9398 9413 9441 9623 9886 10102
546 10102 10321 10631 10966 11231 11503 11893 12334 12697 13016 13401 13834 14237 14646 15139 15664 16110 16489 16877 17256 17578 17908 18353 18898
544 18898 19450 19989 20529 21017 21402 21754 22175 22675 23220 23824 24458 24975 25254 25320 25222 24929 24466 24019 23733 23512 23195 22817 22518 22318
541 22318 22150 22027 21994 21991 21941 21887 21898 21929 21950 22083 22439 22905 23306 23655 24052 24456 24786 25165 25815 26754 27832 29013 30404 32018
538 32018 33731 35429 36992 38214 38963 39428 39985 40828 41915 43218 44773 46470 48050 49343 50326 50945 51101 50856 50441 49998
535 49998 49465 48765 47955 47141 46369 45636 44917 44188 43493 42956 42598 42209 41550 40641 39720 38960 38409 38136 38220 38570 38954 39249 39536
532 39536 39940 40529 41330 42297 43273 44118 44867 45665 46608 47776 49293 51153 53051 54639 55892 57016 58038 58770 59164 59437
530 59437 59797 60286 60929 61818 62954 64185 65372 66457 67376 68088 68736 69584 70738 72055 73343 74459 75211 75384 74944 74070
528G4070j130j311j382j279j072q51n47q2M38Q52J180J522J876K193K500K785K930K920K988
525H8600L333L845M249M374M160L612K892K267J808J347R07Q57J429K333L104L566L709L389
523A39781K548J543Q80P19Q80J174J443J479J283J244J775K827M042N168O059O466O258N700
521A91269N150M524L421J745j26j707k748l238l334l226k930k354j741j749k750m279n443
519A70484n713n043l545j564J34Q10M00o18j929l516n252o794p961q776r175q988q271p321
517H7362o353n435m692m253m007l710l298k865k389j790j195q55q17r46j139j319j317j067
514C9915p90p01p11o29m90m00k51P2M69Q77J559K883N018P862J0629J1328P790L19p388j1236
512F6125j0546p940n880m618l484k482j914j549j053o39o08p53p09m94k51J20P27J409J992
$$ plain form
528 74070 72940 71629 70247 68968 67896 67045 66498 66416 66854 67706 68886 70408 72284 74477 76977 79762 82692 85612 88600
525 88600 91933 95778 100027 104401 108561 112173 115065 117332 119140 120487 121394 122251 123680 126013 129117 132683 136392 139781
523 139781 142329 143872 144752 145471 146351 147525 148968 150447 151730 152974 154749 157576 161618 166786 172845 179311 185569 191269
521 191269 196419 200943 204364 206109 205983 204276 201528 198290 194956 191730 188800 186446 184705 182956 180206 175927 170484
519 170484 164771 159728 156183 154619 154753 155563 155963 155345 153416 149900 144648 137854 129893 121117 111942 102954 94683 87362
517 87362 81009 75574 70882 66629 62622 58912 55614 52749 50360 48570 47375 46520 45703 44757 43618 42299 40982 39915
514 39915 39125 38424 37713 37084 36594 36194 35943 36015 36484 37361 38920 41803 46821 54683 65312 76640 84430 84749 77361 66125
512 66125 55579 47639 41759 37141 33657 31175 29261 27712 26659 26020 25412 24659 23950 23456 23205 23325 24052 25461 27453
510B7453K479K705K272J109k91j420k200k682k754k431k014j713j409j032p65p09o70n29m30
507A4969m48m01k02j6O3J85M60Q60J465K517M195O539R248J0998R560L917l671q948r585p033
505C4672m254k749k336k532k969l063k464j596j052p52l04J82L77M52Q20J432J933K283K564
503B0644K462J578J50j169k056k578k714k402j902j575j389j096p32n19m25k89j83k40l06
500E259j99p5j46k37j10N5l9k46k21j3P0K9R6K59L34L97O84J147J497J525J118J85j001j740
497H628j626j085p62o67m56j77j45k85k51o8m4j62j40OJ2j04r2L1K5q6o9O0R3N7J26K22J59
494C200M0P1J44N0n3R5L38L47K28L15N63O96Q22J254J819J946J408M70n77j527k019j809j243
491F578q95q16o50l57k20k43j62lk7j90j95o5n6j31n8N8n9k49j39J43J54o5p5J17R7j45j67
$$ plain form
510 27453 29932 32637 34909 36018 35727 34307 32107 29425 26671 24240 22226 20513 19104 18072 17307 16598 15928 15399 14969
507 14969 14521 14120 13918 13902 13965 14150 14610 15470 16935 19452 23647 30186 39434 50432 59992 63909 60238 51290 41705 34672
505 34672 30418 27669 25333 22801 19832 16769 14305 12709 11657 10905 10601 10783 11160 11612 12432 13864 15797 18080 20644
503 20644 23106 24684 24834 23665 21609 19031 16317 13915 12013 10438 9049 7953 7221 6702 6277 5988 5805 5565 5259
500 5259 5060 4985 4839 4602 4492 4547 4508 4262 4041 4028 4098 4127 4223 4482 4816 5213 5897 7044 8541 10066 11184 11369 10368 8628
497 8628 7002 5917 5155 4488 4032 3855 3710 3425 3174 3106 3062 2900 2760 2766 2778 2674 2582 2613 2638 2552 2483 2543 2636 2693 2819 3041 3200
494 3200 3240 3311 3455 3505 3452 3547 3885 4232 4460 4775 5338 6034 6856 8110 9929 11875 13283 13753 13176 11649 9630 7821 6578
491 6578 5683 4867 4217 3860 3640 3397 3235 3232 3205 3015 2820 2755 2699 2568 2510 2568 2509 2260 2121 2264 2418 2353 2278 2395 2492 2347 2180
488B180R5K17P6K9J84K25P3L8J97K49J50K21M90N78L76K26K95L72M44P99J427J839J694J072
485A3546J12j034j894j987j517j136j009p83m22l05m23l37j9O0j65k08N3J51o5j55M2J04j36
482B473k59p2M9o4o4J56J74j17k29L5J93j5j63K9J96Q5K9K07K40l8j58J34L87K66J23K25K13
479D035j38l89k26n2k09l46j42N4q2k11j6J61kj69j0J38n4k33m6J73L8j57k9J61O7n9R7K36
475B590L6j82o3R8n7k34n7J87J03o2M3J66j1j83PK35P8j83j13O9j4j46J9K33J44J0J50K68
472C131L2k11o4J42j7k28o4J45m0k79p8K39J42r1O1L28J76j48q4J72R3j40k9K27J26j25j9
469C397K38J44j02J0K78J97j4J51M47L16j1O7L65K71r6j67k7j42l50j97N6j17m15k23K05J96
465D477p7K3L22J96j40k4L36K27j63p7L40L13p6n9L36L56j6p8K15K49K0Q8L38J73k30j68K07
$$ plain form
488 2180 2275 2492 2568 2597 2781 3006 3079 3117 3314 3563 3713 3934 4424 5002 5378 5604 5899 6271 6715 7514 8941 10780 12474 13546
485 13546 13658 12624 10730 8743 7226 6090 5081 4298 3876 3571 3148 2811 2792 2852 2687 2479 2532 2683 2618 2463 2505 2609 2473
482 2473 2214 2142 2191 2127 2063 2219 2393 2276 2047 2082 2275 2260 2097 2126 2322 2407 2436 2643 2883 2845 2687 2821 3208 3474 3597 3822 4035
479 4035 3897 3508 3282 3230 3021 2675 2533 2587 2505 2294 2278 2439 2437 2268 2258 2396 2342 2109 2063 2236 2274 2117 2088 2249 2316 2257 2354 2590
475 2590 2626 2444 2381 2479 2422 2188 2131 2318 2421 2359 2402 2568 2557 2374 2381 2616 2694 2511 2398 2467 2453 2307 2326 2559 2703 2713 2863 3131
472 3131 3163 2952 2888 3030 3013 2785 2721 2866 2826 2547 2469 2708 2850 2759 2820 3148 3324 3176 3092 3264 3357 3217 3188 3415 3541 3416 3397
469 3397 3635 3779 3677 3687 3965 4162 4148 4299 4746 5062 5051 5118 5483 5754 5658 5491 5464 5322 4972 4775 4831 4714 4299 4076 4281 4477
465 4477 4400 4423 4745 4941 4801 4777 5113 5340 5177 5100 5440 5753 5677 5618 5954 6310 6294 6216 6431 6680 6700 6788 7126 7299 7069 6901 7108
462G108J40k47j64L02L33m6m3L34L23m9j1M06M08M1J20N94N79O0q6K03J17l30k77K57L25j27
459A0270j62L24M28O8J40O99P87L09K11N79M68j47j89M46O37J57O1N82O91J77R2O55P89K44
456A8316R4N92O56M8j14M46O07J12J16Q77J184P40P55J482J576O83J78N61O07q0k30M83O59
453C0348q5k91N11Q95M78Q18K283L012K201J421J471J068o9j32J357K378K097K228L314L430
451E8733K189K079L993N485N419O040Q369J0083J0272J1481J4580J6620J6473J7147J9643
449B08606K0433J8385J7902K1560K6511L2177M3776O3681Q8284J19340J69391K50204L65671
447A445921N16111O81953P85663P04133L73758j08479n27865p20526o89137n52577m16384
446A492571l13150k35646j77983j37514j06615p9503n7901m3495l2615k2341j4875j2336j2577
$$ plain form
462 7108 7248 7001 6837 7139 7472 7426 7383 7717 8040 7991 7980 8386 8794 8835 8955 9549 10128 10188 10102 10305 10422 10092 9815 10072 10397 10270
459 10270 10108 10432 10860 10928 11068 11767 12554 12863 13074 13653 14121 13974 13785 14231 14868 15025 15086 15668 16359 16536 16628 17283 18072 18316
456 18316 18410 19002 19658 19706 19592 20038 20645 20757 20873 21750 22934 23674 24429 25911 27487 28170 28348 28909 29516 29436 29206 29689 30348
453 30348 30263 29972 30483 31378 31856 32674 34957 37969 40170 41591 43062 44130 44061 43929 45286 47664 49761 51989 55303 58733
451 58733 60922 63001 66994 72479 77898 83938 92307 102390 112662 124143 138723 155343 171816 188963 208606
449 208606 229039 247424 265326 286886 313397 345574 389350 453031 541315 660655 830046 1080250 1445921
447 1445921 1962032 2643985 3429648 4133781 4507539 4399060 3871195 3150669 2461532 1908955 1492571
446 1492571 1179421 943775 765792 628278 521663 442160 384259 340764 308149 285808 270933 258597 246020
444B46020j2747j2630j2628j2038j0660r247p726n327k442k59J126K416L822N518Q062J1067
442A92327J3130J4056J4945J5582J4728J3540J5085K0003K6788L6424N1696P2400R8055J35476
441G34235J96655K89991M19459N80064P28116P59722N66496J52425l20055o40663p17400o20577
439B128468m77275l58640k70148k02594j54870j22161r4381o9075n0819l8948k7777j7213
438B44567j2280j3119j4491j4300j4676j5557j4444j1891j0766j0689q971o198n409o482o543
436G8751n222m598m657l556j850j864l308l774l099l118l596k560l85M70l46q47n37q38j791
434C3275j836r59p86j418j315l92j88q76j008l75k91q93q96k00r5o95p49j47j27p91q97l12
431A8029k34p79p43JK12l37m77O9K37k18k88K17K43m25p31l76k85o77o25L3K94j12k45J75
$$ plain form
444 246020 233273 220643 208015 195977 185317 176070 168344 163017 160575 160316 161442 163858 167680 173198 181260 192327
442 192327 205457 219513 234458 250040 264768 278308 293393 313396 340184 376608 428304 500704 598759 734235
441 734235 930890 1220881 1640340 2220404 2948520 3708242 4274738 4427163 4107108 3466445 2749045 2128468
439 2128468 1651193 1292553 1022405 819811 664941 542780 448399 379324 328505 289557 261780 244567
438 244567 232287 219168 204677 190377 175701 160144 145700 133809 123043 112354 103383 97185 91776 85294 78751
436 78751 73529 68931 64274 60718 58868 57004 53696 49922 46823 43705 40109 37549 37164 37634 37288 36441 35904 35066 33275
434 33275 31439 30480 29694 28276 26961 26569 26381 25505 24497 24122 23831 22938 22042 21842 21747 21052 20303 20156 20029 19238 18341 18029
431 18029 17795 17016 16273 16274 16486 16149 15672 15741 15978 15760 15472 15689 15932 15507 14776 14400 14115 13438 12813 12846 13140 13028 12783 12958
428A2958K63k14l55R5K43j91l47P1K35j65l59q4q0n34o11r6J21k92n01j09J40j22k31J19K35
425A0189j81m11j18L1k71l65L7K45p2k44O5K00j74m00j06J05j24k24J09K53j12l47p5J05j89
422G926l68m3K08k6k12N1K33o1l08q8J15r0k15J06L46O6k50j45m1l22n21k09J32Kk17m8J67
419F188j2k55j35O0n1j90l0J11p4k10K3K15j8k78j31Q7l1j77L7K70R9j75j10O0m6k01q3M6
415D989j24k75p2J50J0j73LK39J08j22m4J09n2k63j23J06%k28j50N9K7p6P6K43P7j59o1J34
412D408Rk27j39Q6J7j85r8J43J13q7p8N7j6j64o7J20O3r0j0J29j2k16r2J69J14j21j05Q2M8
408C851j13l2J75J09j26j23O1M6j07l7J73J36q4r8P6P1j05j33j9k1q3M0K02R5j13l3K28K76
405D312K06L99P24O81K60q1k25m35o64n85k75j57k59k22k0J0j40j29O4J11j5k6P8K3j20l3
$$ plain form
428 12958 13221 13007 12652 12747 12990 12799 12452 12523 12758 12593 12234 12150 12070 11536 10925 10829 10950 10658 10157 10048 10188 10066 9835 9954 10189
425 10189 10008 9597 9479 9510 9239 8874 8911 9156 9084 8840 8905 9105 8931 8531 8425 8530 8406 8182 8291 8544 8432 8085 8010 8115 7926
422 7926 7558 7515 7723 7697 7485 7536 7769 7708 7400 7312 7427 7337 7122 7228 7574 7640 7390 7245 7204 6882 6361 6152 6284 6286 6069 6021 6188
419 6188 6176 5921 5786 5846 5795 5605 5575 5686 5612 5402 5425 5640 5622 5344 5213 5300 5269 5092 5129 5399 5498 5323 5213 5273 5227 5026 4943 4989
415 4989 4865 4590 4518 4668 4678 4505 4508 4747 4855 4733 4689 4798 4746 4483 4360 4466 4466 4238 4088 4147 4174 4098 4174 4417 4494 4335 4274 4408
412 4408 4417 4190 4051 4137 4154 3969 3871 4014 4127 4040 3962 4019 4003 3839 3772 3892 3955 3865 3855 3984 3972 3756 3664 3833 3947 3826 3721 3803 3851
408 3851 3738 3706 3881 3990 3864 3741 3802 3848 3741 3704 3877 4013 3929 3831 3907 3978 3873 3740 3721 3700 3617 3657 3859 3954 3841 3808 4036 4312
405 4312 4518 4917 5641 6322 6582 6501 6276 5841 5177 4592 4317 4160 3901 3679 3659 3669 3529 3400 3464 3575 3560 3534 3612 3635 3515 3482
402C482J88J38j30j75K6O6j06j09R5J22o6o4J79K27l7j76kJ36L2n4K5K0j57k14l9R4P4J57
398C732M12N45M53L90M06K03k55n67n36m34m37l45r4L0p6j25pK3j22j47M9J49Rp3O2J47J7
395C409q1NM5q3j39rM9q0j26L0J00n4j21P6K28R9n3J3J09L4k8Q7J70M1q8k7N7pm8O6J48P5
391C897O5K41L52K36J28K06K38L9j63j44q9j84k49j21j6j20k14q8O0J2o8J1Q0j0n0J22K41
388D412P3j28p1P9N9mR5J88Q0k3J07K58J59OQ7K35J56oN6K24J95N8R1K20K13J65L19N44N79
384H426N63Q36J354J820K252K857L446L506K792J487j38j764k905l219k925k488k050j533
382A2317j063q47p58n29k35j36j80j22Kqo3O0K45K24R5J44K91K45R0J56L98M56L12K83M06
379A1783L89K07J73L57M81M45M69O19P14P37Q89J145J254J243J435J923K470K998L661M352
$$ plain form
402 3482 3670 3808 3678 3503 3529 3595 3489 3380 3475 3597 3531 3467 3646 3873 3836 3660 3658 3794 3826 3772 3797 3817 3660 3446 3407 3501 3575 3732
398 3732 4144 4689 5142 5532 5938 6141 5886 5319 4783 4349 3912 3567 3473 3503 3427 3302 3295 3318 3196 3049 3098 3247 3256 3183 3245 3392 3409
395 3409 3328 3333 3378 3295 3156 3147 3196 3116 2990 3020 3120 3066 2945 3021 3249 3348 3295 3308 3417 3451 3423 3510 3680 3721 3633 3606 3663 3656 3608 3674 3822 3897
391 3897 3962 4203 4555 4791 4919 5125 5363 5402 5239 5095 5006 4822 4573 4452 4436 4316 4102 4014 4074 4086 4018 4029 4109 4099 4049 4171 4412
388 4412 4485 4357 4286 4365 4424 4420 4515 4703 4783 4760 4867 5125 5284 5290 5377 5612 5768 5762 5818 6042 6237 6295 6386 6606 6819 6984 7303 7847 8426
384 8426 8989 9825 11179 12999 15251 18108 21554 25060 27852 29339 29201 27437 24532 21313 18388 15900 13850 12317
382 12317 11254 10407 9649 9120 8885 8749 8569 8447 8449 8441 8378 8438 8683 8907 9002 9146 9437 9682 9772 9928 10326 10782 11094 11377 11783
379 11783 12172 12379 12552 12909 13390 13835 14304 14923 15637 16374 17263 18408 19662 20905 22340 24263 26733 29731 33392 37744
376C7744M630M263L453K458J500J067J745L593O114Q861J1550J3494J3584J1213O867J692
375A33828l113o498p881p594o616n590m510l379k557k207k004j698j498j550j605j501j472
372G2555j635j658j374j168j340j558j416j072q57o49j82M01P99J057J316J392J128Q09P51
370F7299Q11P75Q53J234J658K003K801M453O522Q637J1553J6308K3045L1801M3098N4867N9169
368C36887M6323J5384k1171m6414n2819m5958l5875k7919k2111j7554j4397j2550j1121r541
366H1164q020o699n296l768k540j859j497j276j320j609j793j679j492j422j331j107r22q87
364C6647p95m79j25P4K67O44J039J174J094J052J128J274J573K127K809L461M201N214O360
362F8739P376Q409R926J1980J3754J3914J1397O111p71p311j1968j4410j5137j4607j3055
$$ plain form
376 37744 42374 46637 50090 52548 54048 55115 56860 60453 66567 75428 86978 100472 114056 125269 132136 133828
375 133828 130715 124217 116336 108742 102126 96536 92026 88647 86090 83883 81879 80181 78683 77133 75528 74027 72555
372 72555 70920 69262 67888 66720 65380 63822 62406 61334 60477 59828 59646 60047 60846 61903 63219 64611 65739 66548 67299
370 67299 68110 68885 69738 70972 72630 74633 77434 81887 88409 97046 108599 124907 147952 179753 222851 277718 336887
368 336887 383210 398594 377423 331009 278190 232232 196357 168438 146327 128773 114376 101826 90705 81164
366 81164 73144 66445 61149 57381 54841 52982 51485 50209 48889 47280 45487 43808 42316 40894 39563 38456 37534 36647
364 36647 35852 35373 35248 35322 35589 36233 37272 38446 39540 40592 41720 42994 44567 46694 49503 52964 57165 62379 68739
362 68739 76115 84524 94450 106430 120184 134098 145495 151606 150835 143524 131556 117146 102009 87402 74347
360G4347j0920q856p216n913m834m040l486k948k358j888j607j334r61o23m37l51l22l95n13
358A5345m99l45k61l40m58n29o26p28o77m73l41l76m15l45k84l09k98j81r6j03p5M8J05K0
355G759o7q2j62l46m23k84j36j54k08j46q1j33j77r2k0r6j63o7N5J0r6p9j5o3j39q0K1k1j44
351D371j51p0m8n9K8J44J28J8j6K5J2l7KQ4O2l3m0M2O2jk5L0P6P4N1j8j53k46k01r9q0j15
347C817q6k0j2k7J2M8j3r3o7mm9j47j49p7o9j01m8N8P2RON1J6p5q8k9k5o3k7N3L6n2o0Jj6
343B782r9q6K8P4J1k7Jro9o6nj5r1q3J8M4l5n3M0Q5J0m3NL8k2n6RN9Ko9n3j0j1j1K4K3m9r2
338B199m6ml3m8K7J13J18P8O5M5l5j22j24m5M1P7N2j0l9NN3J2p0p4oNo7j02m2K0K0L%j4k3
334B029M6J55J79J05Q0J76K77K78K07J12l1j96k72k25j61j47j32q5p5j17j18m2Nl8o6LQ7Q4
$$ plain form
360 74347 63427 54571 47355 41442 36608 32568 29082 26134 23776 21888 20281 18947 17986 17363 16926 16575 16253 15858 15345
358 15345 14846 14501 14240 13900 13442 12913 12287 11559 10882 10409 10068 9692 9277 8932 8648 8339 8041 7860 7764 7661 7586 7634 7739 7759
355 7759 7692 7610 7448 7102 6679 6395 6259 6105 5897 5751 5670 5537 5360 5268 5248 5152 4989 4922 4977 4987 4891 4812 4797 4734 4595 4515 4536 4515 4371
351 4371 4220 4150 4102 4043 4071 4215 4343 4361 4345 4370 4382 4345 4347 4431 4493 4460 4420 4462 4524 4523 4498 4528 4604 4678 4729 4711 4558 4312 4111 4012 3932 3817
347 3817 3731 3711 3699 3672 3684 3732 3719 3626 3559 3555 3506 3359 3210 3133 3064 2963 2915 2973 3045 3054 3060 3111 3127 3052 2964 2935 2910 2847 2820 2873 2909 2857 2797 2798 2782
343 2782 2683 2597 2625 2699 2710 2683 2684 2675 2606 2540 2535 2520 2429 2346 2364 2408 2373 2320 2360 2445 2455 2412 2417 2455 2433 2377 2386 2445 2447 2378 2325 2315 2304 2293 2317 2340 2291 2199
338 2199 2153 2149 2116 2068 2095 2208 2326 2404 2469 2514 2479 2357 2233 2188 2229 2306 2358 2348 2309 2314 2367 2379 2309 2235 2229 2234 2167 2065 2023 2043 2063 2066 2066 2052 2029
334 2029 2075 2230 2409 2514 2594 2770 3047 3325 3532 3644 3613 3417 3145 2920 2759 2612 2480 2395 2320 2203 2085 2043 2048 2010 1944 1947 2034 2118
331B118J6l8n8n4j0M4M0nkN2M4n3j14o3J1K8L0N0K9m9q6k5L9K7JL1P3N5%l8m7j3Q2J78J85
326B478J57K44M53N87N35L83K01n9l70n37m70l34k95k86j98r6r8j48j31o9m7n0k1J2N%L9O6
323A951L5J1L8L6m7j13o8K1M6J4j9n8j01q1J0O0J5k5KJ1n2q0oN7K3PR8J61P3l8QJ29J45Q5
319B348J01J79J82J13P4N0m1j57j88j70k01k33j53k6Km8l5M1N3j1m4l1l9n6qO0L5m8n3K6P4
315A796O3M6J2p6j26l6R2P8m0o6J9M1m2o9K4J04P9K6J6J2OO6J77K17J49O3Kq1j60j30j2L5
311B285m0r4l8K4nn8m8j6k9n2l0PJ6J2K4J7k0m0oM6O4M6J3j9k9k1l3p5p9rM5Kn9rR7R0l4j00
306A845l1O2P6N0M9O7J03J95L34M30M25L18J14j54l52l63k53j92j98j68r9r6j56j45m6Ol0
303A791l5J8Mj13j53j6J43J38J9n9o2n3l9RN9O1K5j7n3o4j6O4Q0K4j8JK0nk6j1MJ0M1Q3P7
$$ plain form
331 2118 2134 2096 2038 1984 1974 2018 2058 2053 2051 2103 2147 2094 1980 1917 1928 1956 1986 2036 2065 2016 1930 1905 1944 1971 1972 2003 2076 2131 2131 2093 2046 2033 2115 2293 2478
326 2478 2635 2879 3332 3919 4454 4837 5038 4979 4609 4072 3602 3268 2973 2687 2489 2393 2295 2147 2016 1947 1900 1850 1829 1841 1846 1846 1885 1951
323 1951 1986 1997 2035 2071 2024 1911 1843 1864 1910 1924 1905 1847 1746 1665 1675 1735 1750 1725 1727 1738 1686 1606 1600 1657 1680 1687 1785 1946 2019 1981 1989 2118 2263 2348
319 2348 2449 2628 2810 2923 2997 3047 3006 2849 2661 2491 2290 2057 1904 1878 1880 1832 1797 1838 1891 1880 1836 1805 1766 1710 1702 1762 1797 1749 1696 1722 1796
315 1796 1859 1905 1917 1841 1715 1679 1771 1849 1809 1743 1762 1803 1761 1692 1716 1820 1899 1925 1941 1953 1959 2025 2202 2419 2568 2631 2633 2552 2392 2262 2250 2285
311 2285 2245 2151 2113 2137 2132 2074 2026 2010 1981 1929 1899 1906 1922 1934 1958 1975 1955 1915 1909 1955 2019 2065 2078 2059 2030 2009 1976 1901 1822 1813 1858 1860 1801 1792 1889 1979 1945 1845
306 1845 1814 1876 1952 2002 2051 2118 2221 2416 2750 3180 3605 3923 4037 3883 3531 3168 2915 2723 2525 2357 2258 2162 2006 1861 1815 1821 1791
303 1791 1756 1774 1778 1665 1512 1496 1639 1777 1796 1737 1675 1622 1583 1592 1651 1712 1737 1720 1667 1603 1587 1651 1731 1755 1737 1738 1758 1753 1727 1716 1720 1730 1771 1854 1931
299A931L4M3R3R0L4L9J18J38M0n6p1q1j48j74q9J4J3n1q5p8o1k6J2mo8q5k7J8KKM1L0m8o4
295A476L7J20Q4J7J3Lq8j53q8K9N7J9J9L7Nl4mL6j7j09r9K3J28J33N5m3r7o0K5L7m6j08o5
291A342LJ4J9P9J30Q9Nk9l8o6p0j2M2K5j2j0k0q2j07k8O1O2L5O3Q5K4n3n0k5o2q9j4P9P0K1
286A481M0P6J6p7p1qj7o2j7P3N4o0j03m2J2K2N8J01O1k8m0J7K6k4l0J2lp3q9l1%j8jN8P5M2
282A430L6N1J6l2oL9rr9o4P2J14J6n4k1Jm9o1J0N0j4p7o4l9l7J5J18J43M1m4k1J4k7o0lN4
278A439Mq1p3PO1O1M5J5k0j2M4N7j6q2n1J9L1MJ3N1O4L5Jk9n4n6m0l4m0k2K1M1J7j9n1p0l1
273A249P5J48P1q8j43n7K6K2J3O4R9N4oj1ol3m6pK2ll7k5jMPJ2j4m6j4N6M2o5j15l2O8P2L6
269A391M5O6L3k0l9m8o2m1J8L9QJ0N5L4p2j10mR2M5l6KR2O5n8j19q1l8k9rK7L7L1L9L9mn2
$$ plain form
299 1931 1965 2008 2101 2191 2225 2264 2382 2520 2560 2504 2433 2352 2204 2030 1941 1955 1968 1917 1832 1754 1693 1667 1679 1675 1607 1522 1495 1513 1515 1517 1558 1588 1540 1476
295 1476 1513 1633 1717 1734 1747 1750 1662 1509 1421 1450 1507 1526 1545 1582 1587 1553 1549 1585 1568 1459 1360 1383 1511 1644 1699 1656 1559 1499 1524 1561 1515 1407 1342
291 1342 1345 1359 1378 1457 1587 1676 1681 1652 1614 1548 1478 1466 1508 1533 1521 1511 1491 1409 1302 1274 1335 1397 1432 1495 1580 1604 1551 1501 1476 1414 1325 1311 1390 1460 1481
286 1481 1521 1597 1613 1536 1465 1457 1440 1378 1361 1434 1488 1428 1325 1283 1295 1317 1375 1476 1537 1509 1469 1486 1512 1488 1458 1470 1467 1394 1305 1274 1274 1256 1255 1313 1388 1430
282 1430 1466 1517 1533 1501 1495 1534 1525 1426 1362 1434 1548 1564 1510 1489 1490 1441 1380 1390 1440 1426 1349 1285 1246 1209 1224 1342 1485 1526 1482 1461 1475 1448 1388 1385 1439
278 1439 1443 1362 1289 1296 1357 1418 1463 1478 1458 1446 1490 1547 1531 1449 1398 1417 1448 1452 1465 1516 1580 1615 1616 1587 1533 1477 1437 1403 1363 1341 1362 1403 1420 1401 1350 1280 1249
273 1249 1324 1472 1543 1455 1312 1255 1281 1303 1316 1380 1479 1533 1527 1516 1510 1477 1431 1424 1446 1443 1406 1381 1380 1384 1391 1403 1389 1343 1329 1385 1427 1362 1247 1215 1283 1355 1391
269 1391 1436 1502 1535 1515 1476 1428 1366 1325 1343 1382 1390 1400 1455 1489 1417 1307 1303 1395 1440 1404 1406 1498 1563 1505 1386 1305 1267 1238 1229 1256 1293 1324 1363 1402 1398 1346
264A346m3nPKJ7K5J2J5M6L9m0r7o1JJ0jJ6J5m4o3K7J12O3m3m4M1N1m5j10p0PM6M5K0k2l8m
260A233K7j0p0o0J9Q7R9P3K4l3n0k2pl4l5J9M3j3m7L0J12O5m7p0j1jn4o0NM6K9J0J2Kj1J0
255A310L0ro0l5L6M8j0m6k4K0O3R8P4k4r2m6K7On9l3N5O2k0o6l9k9m3qO4P2Rj7Oon1l0N3O5
251A351j1n5j4Pm5p7k2M2L4j8m9m7k0K8O5N6L7N4N5j0o1NR3K7j36j73m7M6J8jN5O1k8o2M7
246A205J40P5n3q8n2m0l8MM1K0PM8P1J9l7j6K5J4kL8P7M1k8o2q2j12r3MP7L7m8n7KM5N2M5
242A279J5l1k9K7M2l1q0j2P3M3n7p7kO4O6L8ln4o5nO1N6J5QK0nm3l5RJ8j5m3m6l0ON0N7J5
237A299j3k%l8n1lM5L6J4J1j5o6n3N5J13K7p6l4Q8R6k0j00p6k6j0LK2J8KJ3K1j7n3j5M7L5
233A277k7l2L3O3K2k0k4k2k4RP1R0L4l6n9k3L2N5J5o5j00n5jll0k2NJ1J5M1M6%l5qK4ll7r
$$ plain form
264 1346 1303 1298 1305 1307 1324 1349 1361 1376 1422 1461 1421 1324 1263 1264 1274 1273 1289 1304 1260 1197 1224 1336 1399 1356 1312 1353 1404 1359 1249 1179 1186 1232 1277 1297 1275 1237 1233
260 1233 1260 1250 1180 1120 1139 1226 1325 1398 1422 1389 1339 1317 1310 1276 1241 1260 1303 1290 1243 1273 1385 1450 1403 1333 1322 1321 1267 1207 1212 1258 1287 1297 1309 1311 1300 1310
255 1310 1340 1331 1271 1236 1272 1320 1310 1264 1240 1260 1323 1421 1495 1471 1379 1333 1360 1366 1307 1274 1329 1391 1371 1305 1266 1237 1194 1186 1250 1322 1331 1314 1320 1314 1263 1233 1286 1351
251 1351 1340 1285 1271 1278 1233 1156 1134 1176 1210 1192 1143 1096 1076 1104 1169 1225 1262 1316 1371 1361 1300 1305 1398 1425 1289 1116 1069 1115 1133 1132 1187 1248 1220 1158 1205
246 1205 1345 1420 1367 1279 1227 1187 1149 1153 1194 1214 1221 1269 1340 1359 1322 1306 1331 1345 1343 1381 1458 1499 1471 1409 1327 1215 1122 1126 1203 1240 1192 1135 1137 1182 1234 1279
242 1279 1294 1263 1234 1261 1303 1272 1192 1180 1253 1296 1239 1162 1160 1224 1290 1328 1325 1271 1206 1201 1262 1318 1333 1341 1361 1356 1313 1278 1287 1305 1290 1247 1201 1171 1177 1227 1284 1299
237 1299 1286 1284 1284 1246 1195 1192 1237 1273 1287 1298 1283 1217 1164 1219 1332 1359 1283 1249 1337 1433 1413 1313 1237 1211 1201 1204 1226 1244 1246 1259 1280 1263 1210 1195 1242 1277
233 1277 1250 1218 1251 1314 1336 1316 1292 1270 1246 1255 1326 1416 1450 1414 1355 1332 1364 1419 1434 1369 1269 1214 1213 1210 1180 1158 1163 1174 1189 1230 1276 1276 1241 1233 1257 1254 1217 1208
228A208K9jm5k6J1j9o1j4O9N0n3q7j8M6M7L5K4j7n7j5P4R9M1qk0m5o1pN1%j03q6N2J15K9m8
224A189kO1K6l8k7L3N1K6on8j18j21n1J9L8M5N8L0l9o1lM4K1kK9N7K2j9pK1J3j4k4l7m7j7
219A092M1L3l7l8P9J57O4r8j32k5O8O7K2j3m5o6m6lK2L3N9P7K8o2r6k7O4O8k3j04p7K8R3M9
215A252l1m5mJ8PJ9M2J1n7o6MN2J2m8m4%J2mpJ8N1P3N2j6p0m8J0J3l2l1K2L1k3l9K1N5Ml9
211A175nL4QnM9Q1Oq6o5K5M7ml0j1j5m0l0Jjk3oK5Pk8jO5P7K3j6j3l2p9p0J9R1O0l2p6k9N5
206A151R9P1Pm4o3o9n9j6K9J1n6p9j0P0P3L8M6P9O2j1p4q3n2kM2N1K2kJNnQM0K6n5j10o9L
201A075J6kJ7M4J0m4l2L5O1K6plNJNJ4J5J8L1K2j6l0J0L9no6n7q%k4j2K3J4k0rL5L1k3n6m7
196A086l4j8L4R0Q1J4l3m2m3k9L0Q3N3k6m3J7N4J7l2l4rONj1k8qM7N7j6o5J0J12P6o2j12k2
$$ plain form
228 1208 1237 1236 1191 1165 1176 1157 1096 1082 1151 1201 1148 1061 1043 1089 1136 1171 1195 1178 1121 1106 1180 1279 1320 1312 1292 1247 1186 1179 1230 1230 1127 1041 1093 1208 1237 1189
224 1189 1187 1248 1274 1236 1209 1242 1293 1319 1313 1255 1137 1016 965 984 1022 1067 1125 1155 1116 1055 1052 1096 1117 1115 1144 1201 1223 1204 1197 1218 1231 1217 1193 1156 1109 1092
219 1092 1133 1166 1129 1091 1170 1327 1391 1293 1161 1136 1204 1271 1293 1280 1235 1169 1123 1120 1142 1175 1234 1311 1339 1277 1181 1154 1218 1286 1263 1159 1082 1110 1203 1252
215 1252 1221 1176 1172 1190 1197 1216 1258 1269 1212 1146 1150 1202 1214 1166 1122 1122 1134 1130 1123 1141 1192 1265 1317 1301 1231 1183 1193 1206 1174 1143 1165 1196 1173 1134 1155 1210 1214 1175
211 1175 1170 1204 1212 1207 1256 1337 1343 1257 1192 1217 1264 1260 1230 1219 1204 1164 1134 1135 1134 1111 1105 1130 1137 1109 1108 1173 1250 1273 1257 1244 1212 1133 1063 1082 1173 1233 1201 1125 1096 1151
206 1151 1250 1321 1328 1284 1221 1152 1093 1077 1106 1117 1061 982 972 1042 1115 1153 1199 1278 1340 1329 1255 1172 1120 1118 1160 1211 1233 1231 1232 1237 1232 1240 1280 1306 1251 1141 1072 1075
201 1075 1091 1089 1106 1150 1160 1116 1084 1119 1180 1206 1199 1196 1201 1202 1207 1221 1236 1254 1285 1307 1291 1261 1271 1310 1305 1239 1182 1174 1174 1150 1138 1161 1175 1155 1146 1181 1212 1189 1133 1086
196 1086 1052 1034 1068 1158 1239 1253 1220 1178 1135 1106 1136 1219 1272 1246 1203 1220 1274 1291 1259 1225 1216 1222 1227 1216 1188 1180 1227 1284 1268 1203 1213 1325 1401 1339 1227 1205
192A205N2Rn9l7L1M6Jn3p8n5jK5k0o1jR8R6Jm0J7N1qo5l9J2K4K3L0qq5j08m5Pj2k4L1P4M2
187A076nOK0k4o5j3Q5J18O5j2o1o2nN6M2m1p6j6M3J8k1J1O9N0k2m9j1K5K0rm2n0mN6M3l8p2
183A105lO2L2l1k6Oj6o0m1Pqo9p3j3K7J4kNJ3K0M1N0K1jL6R4J01N2J5Pnk6m3n4n9l0K9M8j7
178A208q7o6J4N0J6k6l6k0J6O3O2rq2q4m1j4J7Q0J17N8m0p1m1l5n2k1M7O4K5J1L5L2loL0K2
173A233m3p8m1KJj4qoj7jM9P8O0L3K7Pm2p3n6k2nJ2M2N8K9k2n7m6J5Q5Q9nj07j09k6K0rk9
169A024J0N0M0K6M4N0jm8k9K1J4n5j06q5j5M0M4J4pQM5N3J9k2k6J8P0O7j9j31j61q7jK2J4
165I00L4N5K5j9RQ1R1K2l3k0J6K7K8K3j5p0p2j8J9mm1m3k7j0K1M4J3m1k5P0J24P0j1j8J3P
160A225k9k9OL0L6M0J8l9p1k3M7M4k4n7k3km8j05r7k9L4M9L5K2J3OOK3L9K8lj5J8N3L8rl1
$$ plain form
192 1205 1257 1266 1207 1170 1201 1247 1248 1195 1117 1062 1061 1086 1066 1005 1004 1102 1198 1199 1159 1176 1227 1219 1154 1115 1127 1151 1174 1204 1196 1111 1003 958 965 953 929 960 1034 1076
187 1076 1071 1077 1097 1073 1008 995 1080 1198 1263 1251 1190 1128 1123 1179 1221 1180 1104 1088 1131 1149 1128 1139 1208 1258 1236 1187 1176 1201 1221 1212 1170 1120 1116 1172 1215 1177 1105
183 1105 1102 1164 1196 1165 1139 1145 1129 1069 1028 1035 1027 958 885 872 899 913 911 916 929 949 990 1040 1061 1060 1096 1190 1291 1343 1358 1365 1360 1334 1291 1237 1178 1148 1177 1225 1208
178 1208 1121 1055 1069 1119 1135 1109 1073 1053 1069 1132 1194 1185 1103 1019 978 964 981 1061 1178 1236 1196 1125 1084 1049 997 976 1023 1087 1112 1123 1158 1190 1187 1181 1211 1233
173 1233 1190 1112 1071 1073 1074 1060 1052 1046 1029 1028 1077 1155 1215 1248 1275 1282 1240 1167 1111 1089 1084 1096 1138 1196 1225 1203 1146 1100 1115 1200 1289 1284 1177 1068 1042 1062 1053 1024
169 1024 1034 1084 1124 1150 1194 1244 1243 1195 1166 1187 1201 1146 1040 955 940 980 1024 1038 1031 1039 1084 1137 1156 1134 1108 1126 1196 1263 1244 1113 952 865 864 886 900
165 900 934 989 1014 995 1004 1085 1176 1198 1165 1145 1161 1188 1216 1239 1224 1154 1082 1064 1083 1079 1038 995 968 958 979 1023 1036 995 970 1040 1164 1234 1223 1205 1218 1225
160 1225 1196 1167 1173 1203 1239 1279 1297 1258 1187 1164 1211 1255 1231 1174 1151 1149 1101 996 899 870 904 953 988 1010 1023 1029 1035 1058 1097 1125 1122 1107 1125 1178 1216 1207 1176
156A176j2Lk1n7p0m3J2N6M3j9n5pO7N7l3q0k2O2P4K4j2j1j3l4m7l4rLkKK9M0qq0q0J1P7L0
151A017m6j5Q5R5j6j07p5J5O0N6M8L8J9J2K5L2K6K3K6Pj2J1M3J9m2m5J4K3n0q6k0M7J5o0o4
147A118j0J4jj1pqJK5J9l1n9k2J8rn5m6%J5OJ2K7J7JNkm8o1J4J11J14K6m9o7o0l8RM7L1k2
142A024n3m3k3qlk1l3J8J17J44M6o2n4J1J1m1l8K2L8j0l5rLj9j2L6N1Jm9l9PM7O5N6K3j2l7
137A119p7j22r7K4J22Q9jjP4Q0j3q0n2j3j3%N1O3pq2q6m9j7J8O2O8J4l1k0J2K4K4K1j5p8r4
133I17m4NJ1K7Q6J26Q0j2p1q2o0j1M6M9j9p2m5J6L5K6M7P6N2j3m3qL1J8l3o7n9j9J5J8ok1
129I96j0RK4M1N7N2K9J1Nmj6j7j0k0l6j4L8N9J5m4o3l6lPj4m7m6NO2N9Km1l4j7j8k9m3o1n5
124G93J3R9J12K9n7o3j1L5M8L8K5L3O6P5J4o5o6J1O6M3kk7o5j17j34r2m7k8PO3P4K7jL3N7
$$ plain form
156 1176 1164 1167 1146 1089 1019 976 988 1044 1087 1068 1013 1006 1073 1130 1097 1017 995 1057 1131 1155 1143 1132 1119 1085 1038 1004 995 998 996 998 1027 1067 1059 979 899 910 987 1017
151 1017 971 956 1041 1136 1120 1013 938 953 1013 1069 1117 1155 1174 1186 1211 1243 1269 1292 1318 1325 1313 1324 1367 1386 1344 1299 1313 1336 1286 1200 1180 1227 1242 1182 1118
147 1118 1108 1122 1121 1110 1103 1095 1096 1121 1140 1109 1050 1028 1046 1037 982 936 936 951 957 969 996 1013 1014 1019 1017 969 908 922 1033 1147 1173 1124 1057 997 959 968 1015 1046 1024
142 1024 971 928 905 897 894 873 840 858 975 1119 1165 1103 1049 1060 1071 1030 992 1014 1052 1042 1007 998 1001 982 970 1006 1057 1058 1009 970 977 1024 1089 1145 1168 1156 1119
137 1119 1042 920 823 847 969 1058 1057 1056 1130 1210 1197 1117 1065 1052 1039 1039 1090 1153 1146 1064 978 929 912 930 992 1060 1074 1043 1023 1035 1059 1083 1104 1089 1011 917
133 917 873 878 889 916 1002 1128 1208 1196 1125 1043 983 972 1018 1067 1048 976 931 947 982 1008 1055 1131 1183 1170 1127 1119 1150 1168 1135 1068 1009 990 1005 1023 1017 996
129 996 986 995 1019 1060 1117 1169 1198 1209 1214 1210 1194 1177 1167 1147 1111 1097 1135 1194 1209 1165 1102 1066 1063 1070 1056 1009 963 968 1030 1089 1091 1050 1016 999 981 952 909 848 793
124 793 806 905 1017 1046 989 926 915 950 998 1036 1061 1094 1160 1235 1249 1184 1118 1129 1195 1238 1236 1209 1144 1027 893 801 754 726 733 796 870 897 896 929 986
120I86K6NL6N3Lm3j2L6K0j9%M0Po8r4n9l3j6L2Q1N9j4l6J2N3L9J9L0M6K9j2m9n7l1NJm7p1
115I57k8K8K9lnNj8m3nP3J00N3MlRRnl0m8j8O8J34J02Qn7o9p1p4m9k2k5l4NN6L6m1p2k7K1
110I50K7L0M8L6j1l7j0J5Mj1mj1n3p9m9lOj4j5J6M6N5M5K8K2K5J2j9l5j3J8J2lK1N9L8l0o1
106A055k1J8Lk1qOk1m9k1L8O3L5Mmlj0j4j2k7o8j01o9J8Q1N5j6l1K5O9L7k2l5j2j1l1j9L4
101I15Q3R8Q4M6j1o7q5o5l2jJ4pn2o2j8J9J0OM4N9j1r0n7M4P9K1k1mRj4j9J1Pm0n2PO6O7M8
96A029N1M8J6rj4l3p1o9j7J4oj9J4L5J0j2OJ5k8o5l4L0N7M9M8M2J8OK4K6k5p6o1j0Nj8l4k6
92I16k4k6pL3O3O9N2K6Mlj8o4j00o2L0P2K8k4j2L5N2L7J8j0l5j1N2O7rq9p8j3Ql3o5n2qL7
87H56O2M9J5%J5J6llJ9Pm3o1k0Qj8l7mJ5k9n5K2J23J23M3KK7M2Kn2q9r7n4J9L8l2q2j6R3R2
$$ plain form
120 986 1012 1017 1053 1106 1109 1066 1054 1090 1110 1091 1091 1131 1138 1070 976 917 884 868 900 981 1040 1026 990 1002 1055 1094 1113 1143 1189 1218 1206 1157 1100 1069 1074 1075 1028 957
115 957 929 957 986 983 978 983 965 922 917 990 1090 1143 1147 1144 1153 1162 1157 1127 1079 1061 1129 1263 1365 1373 1316 1247 1176 1102 1053 1031 1006 972 977 1033 1069 1028 956 929 950
110 950 977 1007 1055 1091 1080 1043 1033 1048 1052 1041 1037 1026 973 894 845 842 848 834 819 835 881 936 981 1009 1031 1056 1068 1049 1014 1001 1019 1031 1028 1049 1108 1146 1116 1055
106 1055 1034 1052 1055 1034 1026 1032 1011 962 941 979 1042 1077 1081 1077 1074 1064 1050 1038 1011 943 842 773 791 872 927 911 880 905 974 1011 989 954 942 931 900 881 915
101 915 998 1096 1180 1226 1215 1148 1063 998 966 965 979 972 920 858 840 859 869 875 919 978 967 877 820 864 943 964 943 939 948 934 915 926 933 893 841 848 914 981 1029
96 1029 1080 1128 1144 1135 1121 1088 1017 948 931 945 939 920 934 969 979 967 973 988 960 895 861 891 948 997 1045 1087 1105 1111 1135 1161 1136 1060 999 989 994 976 942 916
92 916 892 866 859 892 955 1024 1076 1102 1106 1103 1085 1021 921 859 889 961 989 965 953 988 1040 1077 1095 1085 1050 1039 1091 1158 1149 1060 982 969 977 944 879 827 819 856
87 856 918 967 982 982 997 1013 1010 1007 1026 1033 990 929 909 917 899 862 858 873 844 789 811 934 1057 1100 1102 1129 1171 1173 1121 1032 935 881 900 938 906 824 808 901 993
82I93nn4lN6N0J7mk7m3j3M0M5pm7l4lJ3K0J7kj6LK0qm2k5J6J1k1nM4L5l3o5k7Mj3k5J2N6O8
77I98O2M2j0o8p2l0j9n4o1qL2Ok9j5J1RML0O2N4L2L5N1M3K5L2N8N8J6m4r1j07r3o0j3L9P4
73I99M6l8r1n2L4O5K4k0l0j9kK5M1J7r%J5j7n4j9N9O6j6p6n3oK2M6N6J1o0n2L5O6nn9lP0M3
68A059l4m9qNj5oK4K7J1K7M7J1o6r6m7J5L0OlJ7L7K2k1l7mL3On8o9j0M2L1j0k9k8j8MK3Pk1
63H55oL7K7m0o1RQ6P7K1j4k0j4J3M2J5o0q2k0K9QlN3Q7K2n3k1N2L6l6m6LLn2o1j5Kk4j3L8
58H74L5m2p8kR8J19O6J2j4j5nJk3n3l7K8P7N8Kk3lK4J5l1n8j7N3O1on6k7J8Ml0j8J7J4j4q
53A016K0J4k0l6l3l8k2L8P5J7p9q4jN1K4j3pOLOK0J2pJ1N3O2L0%k2m6l5M4J04N2m6l4P8J12
49A325J0r0p3jK4J0qm0p4m3M8Q5K5l2j0K1ok8J6M2l6j21p4N3R5K5k9mK6Mk4j1K4M7O5P9P1
$$ plain form
82 993 988 934 931 987 1037 1054 1050 1023 980 967 1007 1052 1045 998 964 961 974 994 1011 1009 993 996 1016 1008 966 941 957 968 947 942 986 1021 988 923 896 900 887 862 874 930 998
77 998 1060 1102 1092 1024 952 922 903 849 788 780 812 818 789 774 785 794 798 828 890 944 976 1011 1062 1105 1130 1162 1220 1278 1294 1250 1159 1052 959 899 886 925 999
73 999 1045 1007 916 864 898 963 987 967 937 918 916 941 982 999 990 990 1005 988 934 915 974 1040 1024 948 895 889 911 957 1013 1024 964 912 947 1013 1008 949 946 1016 1059
68 1059 1025 976 968 973 958 952 976 1003 1014 1041 1088 1099 1033 937 890 905 935 941 938 955 992 1014 993 956 952 985 991 933 864 854 896 927 917 888 860 842 846 869 876 855
63 855 849 886 913 873 812 821 907 984 1005 991 971 957 970 1012 1027 967 885 865 894 902 899 952 1039 1061 1008 987 1039 1075 1039 993 996 999 947 886 871 873 849 836 874
58 874 909 867 789 787 885 1004 1070 1082 1068 1053 1048 1049 1026 973 936 964 1041 1099 1101 1078 1075 1099 1114 1083 1025 1008 1061 1122 1116 1060 1033 1051 1055 1025 1007 1024 1038 1024 1016
53 1016 1036 1050 1030 994 961 923 901 939 1014 1031 952 868 867 918 942 929 922 928 931 937 957 969 962 973 1026 1088 1118 1118 1096 1050 1015 1059 1163 1215 1169 1135 1213 1325
49 1325 1335 1245 1172 1171 1195 1205 1197 1157 1083 1040 1088 1173 1198 1166 1156 1177 1171 1143 1159 1201 1165 1044 970 1023 1118 1143 1114 1110 1136 1140 1116 1105 1129 1176 1241 1320 1391
44A391L6RJ3M2O9P2M4J3Pko1j31j22k5K5m5j32j01%K1m1o9k7j5o0n3O4J57R2n6j03j6N7K0
40A073m8l8J7J4m8o8nN7M1j4k2J8M3L1J8J2j5n4n1%L8K8NMPj3l7m9n6n9l0L8Q8P5K8JqqNL8
35A056M2j6r1j08n7J3M9M1kl3lP5J08L9n7p0oL5%n4n6j3J9Rk6m2j0N6R7O3j5o7n2mK2J0oK
31I48K0Mm2n1LM7Lq2q4K2J19J18N0j8q7j57j59m7J01J52R0Qj7kNj8n3o9m0OK6K2M2R2R8K7
26A077m5m1PJ7j5k6LK4K3J9J9Jk1j9NJ6J8L6N6M3jm5p0q3p5l5OPj5j1J4K2jj5nJ3K6L2K5Q
21I94NK7M4J6k0j5J4j0q4j19n0O7J22P2j7o2m3j0mkL2P4N8rm5j7J2lk7k7l5o7o2J9R5P7Qj5
17I93QKk6j5K6L7K0K6K6l8j20j02PP2L3j6MM0K1k1j7K2M1J5l2p7r5o1RN6N1J3j5j6J5N5N6
12I97Mm2k7Qj5p4p0J4R2J02O0On4q9o7nL5M0L8K6j3l9OO7M5l6n4J0L8j0m3pJ7j1j6M4O9pq2
$$ plain form
44 1391 1427 1436 1449 1491 1560 1632 1676 1689 1696 1694 1633 1502 1380 1355 1380 1335 1203 1102 1102 1123 1082 1013 986 971 911 858 922 1079 1171 1115 1012 996 1053 1073
40 1073 1025 987 1004 1018 970 902 897 954 995 981 959 977 1020 1051 1069 1081 1066 1012 961 961 999 1027 1032 1036 1043 1030 993 944 888 829 799 837 925 1000 1028 1029 1021 1013 1018 1056
35 1056 1098 1082 991 883 826 839 888 929 927 894 891 966 1074 1113 1056 986 980 1015 1015 961 905 892 911 920 894 852 842 898 995 1058 1043 976 924 920 942 952 946 948
31 948 968 972 930 879 882 929 932 850 766 788 907 1025 1075 1057 970 813 654 607 708 860 950 958 941 939 944 926 873 804 764 770 796 818 860 952 1050 1077
26 1077 1032 991 998 1015 1000 974 977 1001 1024 1043 1062 1063 1042 1023 1028 1044 1062 1098 1154 1197 1196 1151 1081 998 923 888 894 901 886 875 889 911 910 895 890 903 929 961 986 994
21 994 999 1026 1070 1086 1066 1051 1065 1055 971 852 802 869 991 1063 1046 984 941 931 927 925 957 1031 1089 1080 1035 1018 1030 1027 1000 973 938 871 809 828 923 1000 1008 993
17 993 1001 1003 977 962 988 1025 1045 1071 1097 1059 939 837 844 916 949 933 937 977 998 977 960 982 1023 1038 1006 929 834 773 782 838 889 902 887 871 886 941 997
12 997 1001 959 932 940 925 851 781 795 887 989 1049 1055 1001 912 845 840 875 915 953 979 966 927 933 1000 1045 1009 955 965 1003 993 950 943 960 949 933 977 1046 1039 957
7I57m3M5O0Pk5k6l3k8K1N6K0l0lO0M7m2r8p6l1pJ4L5K7J0K6N9M5j1k9J0L9Qm1n3l0LK9M5L2
3A049kk3j2PLk0l2j9pk4n7o1k3Lk6n8k4N7R1M5k0m5l8mO0J15Q5pn9l5j7m8o5l2j4m0l1N1R7
-2H20M0j9L5J15P9l7p9k3K0Lq%j4l9oO4P9J9l8m0k0nPKl1m2RN1Jq7r1j8K3J9M6R5O0m9q9p
-7H45P0N7K8N3P3K2l9m5k8l6k7L1O7J9n3o1k7j6j6J1K7j6o7m0L8O1Kn0l1K9O6N8J7j8j7NJ
-12I93m0n7j7K6Pm8n5jM6M0Pj3j4lJ4L5M5L3Kk8l3mL4L5qm8l2L0P4M7l1p5m1K2K4k4k7M1P6
-16A032Mo6rJ07R2n8j51p8L8O2K2Nmm1n5NO2K3o1o5J5O3L5pnJ0Nj2j2MJ8J3j8n0l7J7M1Ll0
-21I17J5R0R4K0m8o0n5n6l8J4O8R0P7K9m6j02r1k5K6L1J3nl0n8n7j7J7J8KkRJ1MmpKK7N9O6
-26I98K8l7q0o5j1K3Om0o1m2kL9P1P4L0k3k5J9K9k8q3o8j5RJ2M2Q0O2rm3j0K0j5o7n0K1N3
$$ plain form
7 957 914 959 1019 1026 1001 975 942 914 935 991 1011 981 978 1038 1085 1043 945 869 838 831 845 880 907 917 943 1002 1047 1036 1007 1017 1056 1064 1023 970 940 943 972 1017 1049
3 1049 1047 1024 1012 1019 1022 1002 970 951 944 920 863 802 779 782 756 698 674 731 822 867 847 802 764 760 820 935 1020 1013 954 919 902 854 789 757 743 703 672 723 820
-2 820 860 841 876 991 1070 1033 954 931 951 954 946 946 932 893 887 951 1030 1049 1011 971 951 946 953 955 924 882 891 942 943 856 765 747 770 789 835 930 990 941 852 845
-7 845 915 972 1000 1053 1126 1148 1109 1064 1036 1000 973 1004 1071 1090 1037 976 949 933 917 928 955 939 872 832 870 931 933 883 852 881 947 1005 1022 1004 987 992 993
-12 993 953 896 879 905 912 864 809 808 854 894 901 888 874 871 885 920 965 998 1000 972 939 935 969 1004 996 948 916 946 1020 1067 1036 961 920 942 966 942 915 956 1032
-16 1032 1036 970 961 1068 1160 1102 951 873 911 973 995 1000 996 955 900 905 967 990 929 864 879 942 977 970 965 975 980 968 956 960 978 991 973 923 886 903 944 947 917
-21 917 932 1022 1116 1136 1088 1028 973 917 879 893 961 1051 1128 1157 1111 1009 918 893 919 950 963 958 928 870 813 796 813 831 833 831 840 851 855 851 844 846 873 932 998
-26 998 1026 989 909 844 833 856 862 822 761 719 717 756 827 901 931 908 883 902 931 903 820 752 737 746 758 800 880 942 933 890 880 900 885 818 768 789 842
-30H42Rl6j0N3O6J5j8KK7Ml3l1qqqL0N3j0j05q4O4J76J32J1n1n6p2r4o5J0P2R9J05P2qp3o0
-35A012j0j4p4r4l1N3Q5N3rn6n9j7K4K3rk5rJ3K2J0k0l5JO1Q1M1QK2L5J2mK1J9o2j49j29j5
-39G75P5Q7M9j1o8o2K9J08Q2KqL6K6l9m0L2N0m3j21q6j1qn4n2MM4L8J7J1J2J2Npj2mKjNK5
-44H99K0k8n6j9K4pn5j6P0O8k1m7K8O4k2r8m1N8M8m4p0%O0M4pl7l3qJ5J0k0k6KK3J7L1P6P6
-49I78ko9l5M5N4j4n9l6J5N2P5P5L1k8m6j5K0K4Kl4o1m5PM0J8k9m0j8rj9k6j5QM1O7N9J2k3
-54A000l1l7n4l2L8Q3M3k4l9j9k3l6jN8O5J2l4l7l6m9n6l6jM5R4J07O8J9RNl9r1p5pL1J2K
-58I34L0N7N9N2L4k0q9j00m3Jj1k9kL1J3m2p4o1k5LMj0j1J1K9J7LK6N5L0k9l8J9O5N7L2K0
-63I98om8n6j2J0l0n7lQ1R1L4pqj3l1j5L1L2k8p6m5K5N3K9J0K9N4L6k5r1j15q2j3M8O6M6J8
$$ plain form
-30 842 851 815 805 858 924 939 921 923 950 954 921 890 882 874 866 896 949 939 834 750 814 990 1122 1133 1082 1026 954 860 795 805 877 976 1081 1153 1145 1072 1012
-35 1012 1002 988 914 820 789 842 927 980 971 915 856 839 863 886 877 852 843 856 878 888 868 833 834 895 976 1017 1025 1047 1082 1094 1090 1111 1130 1068 919 790 775
-39 775 850 937 986 975 907 845 874 982 1064 1066 1058 1094 1120 1081 1041 1073 1123 1080 959 873 862 854 800 748 752 796 834 851 862 874 886 891 884 872 868 870 869 874 899
-44 899 919 891 835 816 840 833 778 762 832 900 879 832 860 924 902 804 763 821 869 825 755 755 815 859 852 815 782 774 789 799 779 753 755 778 795 826 902 978
-49 978 976 907 872 917 971 957 898 862 877 929 1004 1079 1110 1082 1036 1021 1041 1065 1067 1033 972 927 934 974 992 963 923 905 896 877 851 836 844 885 952 1011 1023 1000
-54 1000 969 932 878 846 884 967 1010 986 947 928 905 869 868 926 991 1003 969 932 896 847 791 755 754 799 893 1000 1068 1087 1096 1101 1062 971 896 889 920 932 934
-58 934 964 1021 1080 1132 1166 1146 1057 957 914 915 904 875 873 904 917 875 801 740 715 718 722 712 701 712 741 758 761 787 842 872 843 805 824 889 946 978 998
-63 998 992 944 888 876 886 856 799 796 877 968 1002 995 987 974 943 928 959 991 963 887 842 867 920 949 959 988 1042 1078 1053 962 847 765 752 800 866 912 930
-67I30PRRLj2m3o7m2M2J14R3lo5m2Jk5q8q7PR7Q6pn9rP7Q1%n2%O5L4n7p6%N1Rn0m7j9j8rL9
-72H77O7K8j2L4J01O6n6j28r8l5OM0O3L4l4o7l5J3K6J4rl7n3k7J2J6%J7N2L2l1m7RN0J7l5
-77H70m1oL4O0N1mn7k6O2Q9J8m2j6L1Qm1l5NJ1j9l0k1k2k7nK3J0l0l5J9Q0Q4K3m9o5k3J3m
-81H93l7j3M1M3j9n7l7j4k5k2J3K1j7k9K4O1L2RM9P1Jq4p3rPjM6R6M5n5n5L7N6m0j06m7M2
-86H47N7L4M0M6J5j2J5M2J3m7o9n8m4j3L9N4j4q9p0K9J01R4N7L1Kl6m6j4J5km9p1n5j5K3M1
-90H91K7j6n8o4l3J5N1O2L4k1o0n1k0j2k8j3L5N9J5l5k0M5Q3O5J9k9o8o5J0R4Q3j4q1n5kM
-95H47j8j7qk4l6j1J3ql3nL9K8l6o6l3J2K0J3L1O6O8Pp9j10n0M3O7J8nM0P9L2n5q9o0j4K4
-99F90M9L2k9p3n0mQJ0M4O9M1J4M8R0L6o4p5J6P3K7m3n5l5k8k0mNPK4L2j3o4l4N1O8jl5K2
$$ plain form
-67 930 937 946 955 958 946 903 836 794 836 950 1043 1040 975 933 934 909 821 734 741 838 924 917 858 849 926 1007 1007 955 955 1020 1054 997 921 921 972 981 931 884 865 847 838 877
-72 877 944 972 960 994 1095 1161 1105 977 879 844 850 890 953 987 953 886 851 864 890 904 895 858 805 778 790 806 806 823 875 907 876 829 838 888 905 870
-77 870 829 823 857 917 968 964 907 881 943 1032 1050 1008 992 1023 1031 990 955 960 971 952 922 901 879 852 847 870 880 850 815 834 914 998 1021 972 907 884 897 893
-81 893 856 843 884 927 908 851 814 800 775 753 766 787 770 741 765 826 858 867 916 987 988 904 831 822 829 828 874 970 1015 960 905 942 998 958 852 805 847
-86 847 904 938 978 1024 1039 1027 1042 1084 1097 1050 981 923 879 866 905 959 945 856 786 815 916 1010 1067 1098 1100 1064 1018 1004 1019 1017 968 897 842 827 850 891
-90 891 918 902 844 780 747 762 813 875 909 888 828 777 757 745 717 704 739 798 813 778 758 803 886 951 970 941 873 808 818 912 995 981 900 845 843 847
-95 847 829 812 804 780 744 733 746 738 705 700 739 767 731 665 632 644 664 677 708 774 842 849 770 660 610 653 720 738 733 773 852 884 829 740 680 666 690
-99 690 739 771 742 669 619 615 623 633 677 746 787 801 849 939 975 911 836 852 925 952 909 854 819 791 771 767 772 779 803 835 822 758 724 775 843 842 807 829
-104H29P1K3m5l2K8M3J5NJ6Kk6k6%K7M7O3L1o0j39j22k4O2P9L6k8p3p0k0K9L9J9%qrLK6L1
-108H42K3L4O5O6J5m0m1rLj1l1m7n2k7K7N6L1rj3RJ4mk4l2j8K4O1M0l7q4m2M0P1L6ok2j6M
-113H96K5K0k2o3n3nL3L4Ml2m7l2oLjJ4L9L2KPO1R1L9m0p1m9k1nkj8m0l0QK0mKN2N8l1j17
-118G51q7K0P4M6J1LmpK6P7Q4M9L0L0Lo1j00q3n4l6%O9J17Q7Ko0n5j3lk9k9K7O9Pj15j47m3
-122F56P1P2Jl2j1LlLJ8K3K9M1K3l3n8rL9J0l7mP4Q0kp1n8RP6J05N3n2r7l4K7j7q6l6P1P1
-127I15l5p6pM0Lj9K2L1l1p0k9J4J2K5P8O5m7j26o7M0O5L6L9M7Nl8JP1N9l8j07q3%O2M6l1
-131H72p4NJ32J27l1j55j08RM5K1L9P7N4MK1O1K4o3p6rK6j4o2p4p4n1K7J15J08Lq3q4n2l1
-136G29NP4J12P3jl9l0pMnj3jK1Rl6n5j9km3o1J5R3M9n5n7L5N1m4q6J1J02N4m6m5L5N7Jl3
$$ plain form
-104 829 900 923 878 846 874 917 932 937 953 955 929 903 903 930 977 1040 1071 1011 872 750 726 788 867 903 875 802 732 712 741 780 799 799 791 782 785 811 842
-108 842 865 899 964 1030 1045 1005 964 955 958 947 916 869 817 790 817 873 904 895 882 891 905 901 877 845 827 851 912 952 915 831 789 829 900 936 930 908 892 896
-113 896 921 941 919 856 803 798 831 865 869 837 790 758 752 755 754 768 807 839 841 848 909 1000 1039 999 928 879 858 853 851 833 793 763 771 791 787 789 841 899 868 751
-118 751 664 684 758 804 815 818 814 807 833 910 994 1043 1073 1103 1106 1045 945 862 808 772 772 841 958 1045 1047 987 932 919 916 887 858 885 954 961 846 699 656
-122 656 727 799 800 768 757 760 757 760 778 801 830 871 894 861 803 794 833 843 806 802 876 956 954 883 825 834 910 1015 1068 1016 919 885 912 895 809 773 844 915
-127 915 880 804 797 837 840 821 843 874 843 773 744 758 770 795 873 938 891 765 698 738 803 839 878 925 930 892 893 964 1023 985 878 795 795 857 903 872
-131 872 798 803 935 1062 1031 876 768 777 822 843 882 959 1013 1017 1038 1099 1123 1060 984 975 1001 987 925 851 777 726 753 868 976 979 896 812 760 729
-136 729 734 808 920 993 992 953 923 916 920 915 902 901 922 931 895 840 821 819 776 715 730 823 872 817 760 795 846 802 716 727 829 883 837 792 827 884 885 852
-140H52nK3J9J0J5Pk0l4j7JKqj0rj8l7l9pL3L0j6l1L2Q7K6j00j25j0Q8N2l1k3L6J8o3o7L2
-145F93R6L9n3p2m0k5k1J8N9K8m8p3k5J8NqL1Q3P5J6k8l4m1n3k8K8N6L2K2P0J09O5k3n2j4
-149I05nn6q5l0N4P3J9m2o0l7J6O6O7Lo5o3NO0N8K6%j8l4l0nJ3jk8m0l9l4qM8Q2M1m0o2%N2
-154H06K0l6k3M0N2j0n1mP0P7J7l6l8j2jk3o3o9j5N7O4nn9l3L3N0J5jK7M5J0l5l8jK4K8L9
-158I21O4N6j2q6q4j8J6j8m6LO7O1Oj1kl1p9m9M4P5Nn1j2M3L8K6O5P9Kq7p7j2qo0p1l8k2r
-163F88M5R2N8pMN3J7q0r7j3K5k4l7M3R9M8j4jL0mn2m1k0m6p0k8K1J2nM2R2M6m5o0ML1nk4
-168G77QK7kk9nM1O4N3K8PJMj8o3q0m2jj3m6k5M4P9M1k6q0r9o5J6Q2O6pm1nN4Q0P5N0Km1l7
-173H74MK5Nj6lRj0l4j8J9K1k8p4n8KL0j1o2l9M9R8O0LMK9J2k6j9J7Om8o1nK7j7o2j6P3R2
$$ plain form
-140 852 847 870 889 899 914 921 901 867 850 851 853 845 835 826 808 771 732 725 758 788 772 741 773 860 886 786 661 651 739 791 760 737 773 791 728 661 693
-145 693 789 828 775 703 663 638 617 635 694 722 674 601 576 594 599 591 622 705 780 796 768 734 693 640 612 640 696 728 750 820 929 994 971 919 905
-149 905 900 844 759 729 783 856 875 833 773 736 752 818 885 888 823 760 765 825 883 909 909 891 857 827 822 835 834 806 766 727 693 685 733 815 856 816 754 754 806
-154 806 826 790 767 807 859 849 798 794 864 941 958 922 884 872 871 848 785 716 701 758 822 817 758 725 758 808 823 822 849 894 904 869 831 830 854 882 921
-158 921 985 1041 1029 943 859 841 857 839 793 796 863 924 930 919 917 886 807 758 802 877 882 831 819 862 900 926 991 1070 1072 985 908 896 888 828 757 719 697 688
-163 688 733 825 883 876 880 933 950 870 773 760 785 761 724 767 866 914 900 899 929 925 873 832 812 766 696 668 689 701 696 738 830 876 831 771 775 806 801 777
-168 777 785 812 810 781 776 817 881 934 962 969 970 974 956 893 813 771 770 757 711 686 730 809 850 824 744 645 580 596 678 744 737 696 691 745 825 900 950 952 911 874
-173 874 878 903 908 892 889 898 888 854 836 855 876 848 774 716 718 748 737 675 636 685 783 843 846 850 879 891 865 846 863 869 821 760 755 782 765 703 687 760 852
-177H52K9k4j5Jl4q1o8jN1N5M6N4N8K2l0m8k5OK4K8K2Lj4jK6K9%l0l4k5j4lORJ7L5K5m4j23
-182G84j13j3Q0R3N7K7Lj9mM2N5J0l3j7J8J4j1j3j7o0r6o4kJ2j7j4K9M7K7K2N1O2J6m0m7l
-186H66L1J3m4q2o2kM4N4M5J8l7p9n8pj0n2j6J06J58N5o4m6M7N5j0k6J1Km9k8O2Q3j1j05j00
-191G62m6j8j7j8j8QQ0J36R5om4j2j1o8p6QP4M8PK4L7j9q8p1J0O0N2J8k2n6m9oJ9pm1l9k0
-195F86KN3J22J18Oj13j20k8M9N1Rl4m5j5L7O8O6N0J4m9r3n6J6J6n8p4J1Q4N7Kljl2l6M1J00
-200I01M8m7o5l2m0o9l9K5L7QJ3M4K7k6l1Jj4o9o2K6Q2L9l8o0l5j0J0L1N0N7M5On3p7l2L6
-204F87N9L8J4nl1m2j4J3jk5j3J9K6K3L7L3j7m9j2K7j7q1n3L5N5%k3J7L5QJ3N7N4qk4M6J02
-209I83O7nl9m4n3m0rJj2MM0J5q0j35q7jM5O0O7M3jLN3M7m1j02n1L8O3L4Jl8p5m5M8P7%n0
$$ plain form
-177 852 881 857 842 843 809 728 660 659 710 765 811 865 923 945 915 867 842 848 872 900 922 925 911 910 936 965 965 935 901 876 862 859 865 874 891 926 951 907 784
-182 784 671 658 738 831 888 915 918 899 895 937 992 1002 969 952 970 984 973 960 943 883 787 723 721 733 716 702 731 778 805 827 878 940 956 916 869 866
-186 866 897 910 866 784 722 720 764 818 863 881 844 765 707 700 690 638 622 728 886 941 877 831 878 933 923 897 908 910 861 833 895 978 967 862 762
-191 762 716 698 681 663 645 653 733 869 964 958 914 902 891 823 747 755 829 877 884 908 945 926 838 767 777 837 889 907 885 829 780 774 793 786 745 706 686
-195 686 688 741 863 981 987 874 754 726 775 826 835 801 756 741 778 846 912 962 976 927 834 778 794 810 752 678 689 773 830 832 829 828 796 760 801 901
-200 901 949 902 837 805 765 696 657 682 719 727 740 784 811 785 754 755 741 672 610 636 718 757 719 659 624 614 624 655 705 762 807 813 760 683 651 687
-204 687 746 784 798 793 762 720 706 719 718 693 680 699 725 748 785 818 801 752 740 767 750 669 616 651 706 706 683 700 735 743 756 813 867 859 835 881 983
-209 983 1050 1045 1006 962 909 869 860 861 849 853 893 908 828 693 606 605 650 710 777 820 819 822 875 922 881 779 728 766 829 863 864 826 751 706 754 831 831 781
-213G81L7J34P4p7j20l5J8j5k1N3J04O4QLQj8k3L0O5Pp9q5rN1N5L7K6j3q2j14n8K3K4o6j31
-218F56o9O5J22M4o5p7lM7J3m4l3M4J05Q7J7l0k2RK9M1N4M0k0q3r1n0j5roJ2L3N3P8Q4M3k5
-222A034n8m2j7%J7J3m1j02q7lN2L2nj1j2j7K0R4J08J6q8j00l5K7O0P3M8j1l5nJ7j5k8L2Q3
-226A014L5n8p8l9k3l3qL2On9o1RN5L8J8L1L5J1nk3p9j39j00L3J24R9M0L7N1J2m3m6rRkqk
-231H74j0j3LJ3j8o2n1J6O6M9ONN2P7L6l8o9m1rj1k0qmk9l9NN8N1ql1LL0J7JJ2J7ok2QN0M4
-236A004j0n5m7%K7J1j8j7Mj7q0r7qR5R2mn7mP3Q7L4k9p7r8p8l0J2L7O3P5K9n0p7j9M9N1R
-240H80mJ9K2k1n8l9K1N3K3k3rM7N2j9o6j4O0M9j3k6Pj0p5p0L2J07N9l7p5m6j0J0J4lj6K1
-245H42Q0P0k6r9p6j3QLK5N0M0K4M1N5K0k9l7k4m3p3o7l5j7j0PJ6nk1lJ1k3n7k8L3M9K0JL
$$ plain form
-213 781 818 952 1026 949 829 794 812 797 776 829 933 997 1005 1008 1016 998 975 1005 1070 1077 998 913 904 955 1010 1047 1073 1060 978 864 806 829 853 787 656
-218 656 587 652 774 818 753 676 673 720 733 689 656 700 805 892 909 879 857 866 895 936 990 1030 1010 927 836 786 771 762 756 768 801 854 932 1016 1059 1034
-222 1034 976 934 917 917 934 947 906 804 717 714 766 798 793 782 770 753 773 867 975 991 903 803 768 795 855 928 976 965 930 925 942 927 899 931 1014
-226 1014 1049 991 913 874 851 818 810 842 848 789 728 737 792 830 848 879 914 925 920 897 818 679 579 612 736 835 875 912 963 975 932 886 877 886 884 876 874
-231 874 864 851 854 867 849 787 736 752 818 867 873 878 930 1007 1043 1005 936 895 886 875 855 847 843 814 775 780 838 889 881 850 853 883 900 901 913 930 924 902 910 960 1004
-236 1004 994 939 892 892 919 930 912 895 899 882 802 705 697 792 884 880 823 819 892 979 1013 984 907 809 731 701 713 750 813 888 917 867 790 771 820 871 880
-240 880 876 895 917 896 838 799 820 873 896 873 864 911 963 944 878 864 924 973 960 934 941 931 856 786 818 925 984 947 872 826 816 826 840 837 821 842
-245 842 922 992 966 867 791 778 786 789 814 864 904 928 969 1024 1044 1015 978 954 911 838 771 736 719 709 716 732 727 706 703 714 691 634 606 639 688 708 709 712
-249G12LPL9O8M8OKK0J1k2l4k9l7k7L7R1M5o1q5lO1K1n3p3m4j6RM1N4M5M0L5j0q4j05m8RJ0
-254F83%L5O9L6l1n7l7k2j7K1P2P0jn2l2J7J9j1j2L1N8L2k4o9r4j01o8J3Q6Q5K7rJ3L9K3k
-258G90PL5L9K0mk9m4k1L4N9J5m8o0l6j8%L7N2mp1n0L9Q1M2KPNl4n1rK7Km6m6j7nj0J5O3Q2
-263H50N3Mk7j5K3M9L0j2l2k2k4m8m4JL8K5rk4k7m2m4j0L0L9L2M5O0L9rl7l9m2m3j4L5N4M
-268H47q0j29r7j5N6O8M3L0M1M7L6K8K3jl8m2pNl1n9k2L7M7J2nMLj6k0rj1k8k6ML8N1M6J5
-272H45l4o4l6J0J2l5n7k3K2L4L1L5K7qm4m4j8J0L9O3O1K2k6m0k9j9rPJ6nl4l3oNrrK2M4L4
-277G57K0K9L4J5QM7Q0L6n3p5j3L5%m3j5M8M7ok3J5L3om0l0k2n3p2k7M2N9L3K8M6K3n4j02
-282H01o7j1j8o8o7J0P4N7RJ8O5O7Qk7lJ1l7p7l0O1P6Rl3MN6M6%k9l0k6j7KJ9K0Qk5p9j12
$$ plain form
-249 712 715 722 761 829 877 883 885 905 916 894 860 831 794 767 804 895 940 879 794 791 852 873 820 747 703 687 696 737 791 836 876 911 901 817 712 664 673 683
-254 683 683 718 787 823 792 735 698 676 659 680 752 822 821 769 737 754 773 762 750 781 839 871 847 778 684 583 515 528 614 699 726 717 730 769 792 790
-258 790 797 832 871 891 887 858 814 793 827 886 901 853 793 757 739 739 776 828 824 753 703 742 823 865 867 874 879 845 794 785 812 814 768 722 705 700 690 705 768 850
-263 850 903 907 880 865 888 937 967 955 923 901 877 829 785 786 824 849 840 816 789 747 703 693 723 762 794 839 899 938 929 892 853 811 768 754 789 843 847
-268 847 767 638 541 526 582 650 693 723 764 811 847 875 898 897 859 817 810 815 784 725 703 740 787 799 794 798 801 785 765 756 745 717 691 695 733 784 830 845
-272 845 811 747 711 721 733 698 641 618 640 674 705 740 767 759 715 671 653 663 702 765 826 848 822 782 753 734 725 732 748 743 709 676 670 675 666 657 679 723 757
-277 757 777 806 840 855 863 910 990 1026 973 898 885 920 920 877 862 910 957 951 928 943 976 970 930 900 878 825 753 726 768 827 860 888 934 957 903 801
-282 801 734 723 705 637 570 580 654 711 720 738 803 870 878 851 848 859 822 745 715 776 852 861 828 832 888 934 934 905 875 849 832 834 853 873 881 856 777 665
-286F65o3M6J01M2m1l9J6K7j4j9L5N9Pn4m0K1L7nm1m0l6m4j6P1J36R2k2p5l2J3j6n4j5P0J06
-291H78P7L5qp7j31r6JN4K8KK5M0Ml3l1k0k7j4L4N4nq3q9k4M6Q3P7K7l5m0K3O2J4n0m8j0r
-295G34k6RO8P3K2o%ol9m8k4%J3L6M9J0o5j01p2j8J6K2kk8j6L4N4J2k1K8R9R1J8l7o5j06j10
-300E98qJ15J05k5j01n3Jj2j3M9O7k1r9n1M6O2K2L8R7R8L0j6j5k5n9n9jN3N2J8rj1PK9K4k6
-304I07q5q1qO4N6j8p3m1M5Q5K7o3q0j5N3P1N9L3mk6J0P2O9k0j04j05n2rK1N2O0K3l3o1o0
-308G69l2K4P3N4j9n1mL4rp6p8k5K4N8Q3N5l1p7j1P7M9o3j15n5K2M4L2J3j8l9j0M3M7MlN1
-313H40R9Q0J6l9o6o4m2l4n4o6k7K3J7j4PN7M1m4p1RQ8P5K3K0L7J1k4JN5M8j8n5k9jj2l2l0
-317H25k4l6m2k6oOK6M5J2p3j16m5P6J11M2k1qJ8j1m5k0L4M3J7J5J6l9r7o2M4Q3K0k9jJ8k2
$$ plain form
-286 665 602 648 749 791 750 711 727 754 740 721 756 815 822 768 728 749 786 781 740 700 664 620 604 675 811 903 881 806 774 787 771 717 702 772 878
-291 878 955 990 982 905 774 678 679 733 761 763 788 828 832 799 768 748 721 707 741 795 790 707 618 594 640 723 800 827 792 752 775 837 851 801 753 743 734
-295 734 708 717 785 858 880 874 874 868 829 781 757 757 770 806 855 865 800 699 627 609 625 647 645 617 601 635 689 701 680 708 807 898 916 879 814 708 598
-300 598 590 705 810 785 684 631 632 620 607 656 723 702 603 552 598 660 682 720 817 915 945 929 914 889 830 771 770 823 875 893 884 873 880 909 933 907
-304 907 822 741 733 797 853 835 762 721 766 851 878 815 735 720 773 844 903 936 932 906 916 988 1057 1037 933 828 776 767 788 840 900 923 890 829 769
-308 769 737 761 834 888 869 818 814 848 839 763 685 660 684 742 825 880 849 772 761 838 887 824 709 654 676 720 752 765 747 708 698 741 788 792 789 840
-313 840 939 1019 1035 996 930 866 824 790 736 670 643 666 683 669 676 733 774 730 659 668 756 831 854 874 911 922 898 899 954 1002 984 929 900 899 887 855 825
-317 825 801 765 723 697 691 697 723 768 780 707 591 546 622 733 775 754 746 764 753 708 688 722 765 782 797 813 774 677 615 659 742 762 733 732 750 728
-322G28m0K3P2J6o0l8K9K3l5l3K7M7J6J2L8J2o0p6j1N0M5J0k1m9n7pN4N0RJ8O2M4l4n6KL4
-326H44kj1N1Q5J9o8q5o3n6l9RM1K4J4M0L9qj5M9P4j6j10q3J3L9j4n4n1l9oO4R6K5o6o0J3
-330F93K8j8k5L1N3J4j8mLk2l8l2l5l8PP7Q0J1l5j1J8ml3k7qrj5pj4k8kO3R0L7k8k1K0J7l0
-335G40m8j0K7J5k3l3lK3J2pJ2N4L8m9j17q2kJ5j9mP1J02M2j9mK8rq3q3JP9R2O7M9L1j2n5
-340H36n1qJ7ql8k2K5L6Jk3jK5J6JJ0Ql5p2m3J6L0OJ8N7M9k0o1k2L3L6Jj6j1kQJ4OJ1N6J01
-345I84O8l2r6p6m3n8p9m7RK9K0K1J9j3m7m0PM8O3O3M7K2J1Jl2p3n2K6O5Qn4k9M0M2k3n9m6
-349F94l3l4qK4Om6m1L3P8M7RK6M7J5k6j0L4K4l3m5J9Q3P3Pl9l9k8m0n4l3QJ8k4o3m1J8M2
-354F68%n2n4mM5N9L9J1MK6O4P8M9j3o6o9j9M2M9km8k6L6M9qo5o7n1o4p7k2Q9J49R7Jl8oJ7
$$ plain form
-322 728 688 711 783 799 739 701 730 753 718 685 712 759 775 787 825 837 777 701 690 740 785 795 774 725 668 661 715 765 774 792 854 898 864 808 810 844
-326 844 842 831 882 967 986 918 833 770 714 675 684 725 749 763 803 842 834 819 868 942 926 816 733 746 785 771 717 666 627 621 685 781 806 740 680 693
-330 693 721 703 678 709 762 776 758 754 757 735 697 665 630 592 599 676 756 767 732 721 739 735 702 675 667 658 643 636 622 594 592 655 745 782 754 733 753 770 740
-335 740 692 682 709 724 701 668 665 688 700 693 705 759 797 748 631 549 547 562 543 539 610 712 754 735 731 759 750 667 584 585 664 756 823 872 903 891 836
-340 836 785 777 794 786 748 726 751 787 788 765 764 789 805 806 816 824 789 717 674 690 720 726 744 801 850 830 769 747 780 816 817 801 790 788 796 810 816 827 883 984
-345 984 1052 1020 924 848 805 747 668 621 630 659 679 700 719 706 659 619 626 674 737 800 847 869 880 881 849 776 724 750 815 823 769 740 780 822 799 740 694
-349 694 661 627 619 643 649 603 562 595 673 720 729 755 802 817 791 781 815 839 806 761 780 863 936 943 904 865 837 797 743 710 718 736 712 649 608 626 668
-354 668 668 616 562 558 603 662 701 712 716 742 806 884 933 920 854 785 766 808 857 855 807 781 817 866 858 793 726 675 611 534 512 601 750 847 848 810 804 821
-358H21rm3l3PL4L8M4M8K5j6l6k9k6l7l6qJ3%j7pJ2Nj7l1l3l2nM5O5J8m1j9N2O3j3o7k2M9
-363G62M3j9m3j8ok5j4L9N6kn8l3M1O7K8rmJ2J3K0M0L0l0q2o9j8kk5l1LL7L6J1j8l7l1J0M8
-368G22L8j2l9k5j8l4l8oJ9J7J7L7L1j6l8J5Q3Q2K5j4k0m0o1l2L3O3L6MnolL2P3M9l3q0n8
-372G98l9o8p7jR0Q8%o3n2k5j8%M8P9N0K%L2J4p3j38q6M0R5K4o3l9N8R6L7k9l1nkMM3O8L0
-377H87l1m6k1j5m5n4k0J4Rk2l5j3J5J9qk4mK8K1j4k2J4L2rn6m3QL3K9M5Q2Q5M4Mqk3n2o1
-381G43l6kJ2J1Nj1k1nK2K6K4N0P3K1p5r9j2N8J0p7o5L1Q3M6jmKkJ2M1K2n5j00o3ML2M2P0
-386H12Q4L7l7p2o2n0m0j3J4J3NL3O6M6j4l4kJ5j4l4j8j0l4l3K0O3L3j5nL3K2l7o3l7j8l1
-390F23k5L2R2J00N7jn0o7l2L0N5K3k0l1k7l8m6k4J6L7L1J1j4l6l8j0K1K2ol4l2mL7N6M1Q
$$ plain form
-358 821 812 769 736 743 777 815 859 907 932 916 880 851 825 788 752 744 757 757 740 733 745 750 733 702 669 637 632 677 742 760 719 700 752 815 802 735 713 762
-363 762 805 786 743 725 719 694 680 719 775 773 715 682 723 790 818 809 805 817 830 850 890 920 890 808 739 721 719 694 663 666 703 739 750 732 695 664 674 722
-368 722 760 748 709 684 666 632 594 588 607 624 641 678 709 693 655 670 753 835 860 846 826 786 725 693 726 789 825 829 824 818 815 847 920 969 936 856 798
-372 798 759 691 614 613 703 791 791 728 676 651 633 633 681 760 810 812 812 844 858 785 647 561 601 696 720 657 618 676 772 809 780 749 744 742 746 789 857 887
-377 887 856 810 789 774 729 675 655 669 678 656 621 608 623 642 634 610 606 634 655 641 619 633 665 656 600 557 565 598 627 672 754 839 883 887 879 856 804 743
-381 743 707 705 717 728 733 722 701 696 718 744 768 818 891 912 837 738 726 784 794 717 652 683 766 812 811 807 809 807 819 860 882 827 727 664 668 700 742 812
-386 812 896 933 896 824 762 712 672 659 673 686 691 724 790 836 822 788 786 801 787 753 735 725 691 658 678 741 774 759 754 787 809 772 709 672 654 623
-390 623 598 630 722 822 879 878 828 761 729 759 814 837 817 786 759 721 675 651 667 704 735 746 732 696 658 648 669 691 685 651 619 615 652 708 749 757
-395G57%K2K7j8o6n2J2N2L2jJ2N2N0pn6m0J9M2Rl1k9j0k2n2n0nL1J9j2j3J2L1K4kk7l2%N6
-399G34Q9N7j5o6o0j8J5J9Lj2j4pkPK3K9J1k4m7l7j2jj2l4m6k9RL9L9K5K8L7K7pl2l4k0ML5
-404G01M4Qm3m6lJ6j4l6j2K0J9J7N1Q0L9l7o7l2QRrk0k8l4j6L2P6Q1M1k0n6l1K8M7km8k3M2
-409G82N2nn1m6k1pJ3M3N0J2l3l7j5jj1k8l7k7mJ2lk5j2M4R2Q9M5pm6o1m0JK9K1nj6kK2K6
-414G93j2n9n5K0P7M4l1l6L7P3K1m5n4l5l2j5M1P2J0q8j18p3l5k2J8Q1R5M2OL3N6J3m9m5P
-418G35K3j1k7OL3jo6q2k6N7J12J18O7k3r6r2j3M6K6k5k9J2L0J0KJ9Nn3q6m3J8K5QK8O7M7
-422H21l3q4o6l0k3j7K3P5Q4M1qk3JK9K9nl1j7J3J2j5j2L3N4Jq2j10n9J9O8P2L6j6n3m6jM1
-427G21M8K9J6K0K8J6pk1j6j0j2nJ2J0k2l7J7R1Q1k5j18j17o4l8m3m0l1l5mR2J69J20k1r2
$$ plain form
-395 757 757 779 806 788 722 670 682 734 766 765 777 829 879 872 816 776 795 837 846 815 786 776 754 702 652 647 678 697 685 672 684 715 739 737 710 678 678 734
-399 734 823 880 865 799 739 721 736 755 758 746 732 725 723 730 753 782 793 769 722 685 673 672 660 626 580 551 560 599 638 663 691 728 755 748 716 682 662 666 701
-404 701 745 753 710 664 661 677 663 627 615 635 654 671 722 802 841 804 737 705 713 722 713 693 665 631 615 647 723 804 845 825 769 738 766 813 811 763 740 782
-409 782 834 829 778 732 711 704 717 760 810 822 789 752 737 736 725 697 660 633 629 641 638 613 601 645 737 826 871 864 818 757 717 718 747 768 763 747 745 767 793
-414 793 781 722 667 687 764 808 777 741 778 851 872 827 773 738 706 691 732 804 814 726 608 535 500 478 496 577 672 714 720 753 809 822 773 728 735
-418 735 758 747 720 726 759 758 692 610 584 641 753 871 938 915 819 727 714 760 786 761 732 744 774 784 786 805 810 757 671 628 646 671 679 707 774 821
-422 821 788 704 638 608 585 568 591 666 750 791 783 760 761 790 819 814 783 766 779 791 776 764 797 851 852 770 660 601 620 688 760 796 780 727 681 680 721
-427 721 769 798 814 834 862 878 871 850 834 824 812 807 819 829 807 770 787 878 959 934 816 699 635 597 554 514 483 448 444 536 705 825 804 712
-431G12l2M2L0j3pJ9j0n9m8J0L4J6J4K5qp4p9MQ5R1N7L6J1l5o0k8J6K6K0L7M5J1k1JM9M9Q
-436I74j6j6m2q8r7o1m0m4k1M4R0O5J2oQJ2j0l5m2k1J7L3J4JL3O6K8n1o4RO3L3rK0P5M7n8
-440I23j32r8lN1Lr8j38n3P2R2Nl7M8J35R3k6p2k5J1LJ3N3N3no0o6n0l0J7P6Q4L0j6j6oj7
-444H14k3j0j6n7p6m2oj5k2K8Q3N3m0q0k7L8L9J2K3O1N6rn9l9K0M2J4j8k2k0l4m6m1l2k6Q
-449E31P0R9N0k6n6m6m8m0K0R0P2k4p0j1N5K4n7p9j6O9J18J16O2pl9k3k0o2q8l8L8M4j9n4
-453F35j4M5N7K5j3k8j6RK3K3K3L2K7nl0k3j1k9m8j6M5O1J9j5NL3No6j03o2K3Q0P2L1J4L5
-457H43N4L5Jj3rj1j7mK3K8Pj3k1m5p9p5KR2J00Qq2o8K5P2J7n9m8L2O7J3m7m4j0j0k7j4J1
-462G34%l4l3PK5ll5m0k8j4J1L8L0k1o7n5%M9N2J1l1j9M8R8O9jl4l0m2o3j8Q4J21K7q5p4L1
$$ plain form
-431 712 680 722 752 739 732 751 741 682 634 644 678 694 708 733 725 651 572 576 661 752 809 845 856 821 761 733 749 775 795 832 877 888 867 868 917 966 974
-436 974 958 942 900 812 715 654 614 570 549 593 683 748 760 754 762 774 764 729 687 666 683 716 730 731 764 830 858 807 743 752 815 848 839 859 934 981 923
-440 923 791 693 690 741 744 646 508 455 527 619 624 587 635 770 863 837 765 740 751 754 767 820 873 868 808 742 692 662 679 755 839 869 853 837 831 814
-444 814 791 781 765 708 632 590 584 569 547 575 658 711 671 591 564 602 641 653 676 737 793 784 725 686 706 748 762 744 722 702 668 622 581 549 523 531
-449 531 601 700 750 724 668 622 574 534 554 644 716 692 622 611 666 690 633 554 538 607 725 841 903 896 857 834 814 752 664 626 664 708 689 635
-453 635 621 666 723 748 735 707 691 700 723 746 769 801 828 823 793 770 759 730 682 666 711 772 791 776 781 814 819 753 650 588 611 691 763 794 808 843
-457 843 897 932 933 920 911 900 883 879 902 930 937 924 903 858 779 704 706 798 898 906 824 756 781 853 870 811 763 795 862 875 828 784 774 764 737 723 734
-462 734 734 700 667 674 699 696 661 621 593 579 590 628 658 637 570 515 515 564 616 627 596 577 625 723 792 791 757 727 685 622 604 688 809 836 751 677 708
-466G08Q4L9k3l0j0njJ2J6QK1N8N9qq2r3n6m7p0n2L5J20J20M4m0p5o0j2K9K9j3m1pN5P3K2
-471H07m1o2l2J4M6M8K5RK7N5M2k0p5p5l6JK1K6Nl8p1o0j3L0N2N0L1Onoj6l7l0J7N9N0jm6
-475G57n8m1nK3K0JMK7J2m3n5J1P5M6k0k5J6J7j5lL8K6l9n7j4j0o9p3L8J32Q6k5m4J9L3k9
-480G56o1kO5N1j6m1QO4N4k1p9n6J7N0J5k7j0L4M8K4lk1l3l4j8oj4l0k9k1qJ6M1J6o1j08n3
-484E07N0R6O3K4J6J2onK4M1K6QJ3J5j7o5r2p6k7L4Q0P8K4m2o6l9MK1J6J4K2K5J4K0N8Q1L2
-489I83n8r7n7j4k1m1k0J2Kk9k2QMl2l6J3M9L2%QM3N2J2m6p0l5K5M6J2k4j3J8K2OJ5M5M5L
-494H40k9j7J1J5k0p6j19j04k3P4J08O9J8OK6M7M7K0k3m0nM2L9j5o9q9r4r0n4J2O5Q4Q2O4
-498H02J2o0j08j09p9l0M1J06J16O5Mk4k6k2j0PJ7K2L4L2rn9o2k3mk0k5OL5L7L2K5j1n1m2
$$ plain form
-466 708 792 831 808 778 768 763 762 774 790 798 819 877 936 928 846 753 697 650 580 528 563 683 803 847 807 732 672 660 689 718 705 664 657 712 785 807
-471 807 766 704 672 686 732 780 805 814 841 896 938 918 843 768 732 733 754 780 785 747 676 616 603 633 685 735 766 772 767 761 745 708 678 695 754 804 803 757
-475 757 699 658 653 676 696 697 701 728 740 697 642 653 728 774 754 729 745 762 747 744 782 808 769 712 698 688 619 546 584 716 802 777 733 752 785 756
-480 756 695 693 758 809 793 752 760 824 878 857 778 722 739 789 804 777 767 801 849 873 870 849 816 782 764 758 744 714 685 664 656 672 713 729 668 560 507
-484 507 557 653 716 740 756 768 762 757 781 822 848 856 869 884 867 802 710 634 607 641 721 799 823 781 715 676 680 701 717 731 753 778 792 812 870 951 983
-489 983 925 828 771 757 736 695 675 687 689 660 638 646 650 618 582 595 644 676 676 684 727 779 791 745 675 640 665 711 723 699 686 704 726 732 747 792 837 840
-494 840 811 794 805 820 800 724 605 501 478 552 660 729 747 753 779 826 873 893 870 830 825 867 906 891 822 733 639 549 495 507 572 656 738 802
-498 802 814 754 646 537 458 428 469 575 691 756 760 736 710 688 678 685 702 724 758 790 781 722 660 637 633 613 588 594 629 666 698 723 712 661 619
-502F19J3L9J9K1O0N3k0o0mM9%p8o0J8L4j1j8L2N5K6NQj6o7o7%N0K4k9m2k0jJ1K0J9Nj1k0
-507F56k3%M4N0l4j36j21L2J76J85Q4j7n9o3n5n0m5k9LK3nn9p5l6MJ2K2N8P6M6J4L4P6O6n
-511H49o9o0J8R6J01K1o8q4l2J0jk4j6krj8mLk3n1m0j2j4l2j2M9Q9O6Pl2k3LQj8l9k2Pjl4
-516E87k9L1P8N7J0jJ4Pj8k1LK0J4Kpj4j3j0k7n4n0jM6M4K8L7M6J5k5k9j9m2n9kP9O5l6q4
-520F42j6M9J0o2m4M6R0N6J6nn0j28j55q1L4Q8O8M6P0J01Q0K1j3nj4p7j31r4J4R5R0L1l0o2
-525F80m1L9J08R0jm6lL9%o4o1oK6K8M2N1J6m9p6o5o6p6n2%K0OJ5M7M1j3l7JL5J0j7J7P1O6
-529G75J0l3m1m2l4NO0P6L4l5q4q3l6J4K0%L0J19J60P7m9q8m0j2l8m6jK7Kk6j7j3m3n1J0P8
-534F85O2j8o7m8rJ9M6O6M2j0l3j3kl2m7lM8K0p2j16n3M5P7M5K2L4K7k8p5m4L2O8M1NOJ8J6
$$ plain form
-502 619 632 671 690 711 771 824 804 744 740 789 789 711 651 669 703 692 674 706 761 787 792 800 784 717 650 650 700 724 695 653 633 632 643 663 682 687 676 656
-507 656 633 633 677 727 693 557 436 468 644 829 913 896 837 774 719 669 624 595 598 621 616 557 482 446 450 462 484 542 618 664 678 712 788 854 849
-511 849 780 720 738 834 935 956 888 804 772 782 781 757 741 739 730 712 708 711 688 637 597 585 571 539 527 576 665 731 738 706 683 686 694 676 637 615 622 621 587
-516 587 558 589 667 724 734 733 747 754 736 715 718 738 752 754 747 733 720 710 683 629 579 578 624 668 696 733 779 794 769 740 721 679 620 618 697 762 726 642
-520 642 626 675 685 623 579 625 715 771 787 782 732 604 449 368 402 490 558 604 674 775 855 876 863 858 844 767 636 542 556 651 741 772 742 680
-525 680 639 678 786 876 875 829 826 865 865 801 740 734 760 788 830 881 897 848 772 707 641 565 513 513 533 539 554 601 642 629 592 593 628 638 621 638 709 775
-529 775 785 752 711 669 635 640 700 776 810 775 691 608 572 586 606 606 636 755 915 992 943 855 815 803 765 719 718 745 747 721 704 691 648 597 607 685
-534 685 747 729 662 614 605 624 670 736 778 768 735 722 720 688 641 638 686 706 634 518 465 510 587 632 654 688 715 687 612 568 600 668 709 714 720 738 754
-538G54NQLk5n1l6J4N8O3L4ql3l0j4j0k0j9LJ1j3l5qM6P0L6j6m9o0n4l3ML1K5j0l8l2JL0L6
-543F38L0K1Nj5jO2J06M9p6j38p6K2N4M0L8L2l0r6p1K5P6M1jjj0n7p5j0P2P9L6K4L9Qo9j06
-547F65m9L6P5O6O1O1K7m9j10j08o4l9m4l9LL9K9OL5R3R3J0p1o7oL9M4L6K5jl0l6k3j5j4j
-552F77K8N6O1L9kl8l8rJ7K1K2K2j0o0n1M7J28P6o0j18m6L1J3m6m4J2L1j9o7o4k3J6L3L5J7
-556F87k2o3p6m2K2O7N7J1j1K2O7N6rn7m4MK0j1m5m0oJ4J2J3L6N4L7ml2l8m1l9%P0J11P0j3
-560H37n5k4K2M2M7O0N5lq0r5m4om0j00r9k7M9P1L7k1n5m1MK4Lj7RL7J3k6MR4J31O3l0n2k1
-565G66LNKk2p6j07n8M5J24J33Q8Qo7r3n9k3pK8R4R1l4j60j11P0J72R8k7p6o6o4m4J3M9J6
-569G11k6j1J4k7q3n6M5J02O3ok9qK3M7N0J9k9n0l4lJ2J3Mj0j8j1lpj8k0j9j6NN3Q3N5Kj7
$$ plain form
-538 754 759 767 770 745 694 658 672 730 793 827 819 786 756 742 732 712 693 696 707 694 659 651 697 767 803 787 738 678 624 591 595 626 651 641 603 571 572 602 638
-543 638 668 689 694 679 678 740 846 895 819 681 605 627 681 721 759 791 761 665 594 619 695 736 735 734 724 667 592 582 654 733 769 793 832 840 771 665
-547 665 616 652 727 793 854 915 942 893 783 675 611 572 528 489 492 531 560 566 601 694 787 797 726 659 653 692 736 772 797 796 766 730 707 692 678 677
-552 677 705 761 822 861 859 821 783 774 791 812 834 856 846 786 735 782 910 986 926 808 762 793 806 760 716 728 759 740 673 609 586 602 635 670 687
-556 687 665 602 526 484 506 573 630 641 630 652 719 775 766 709 665 669 689 678 633 593 587 601 613 626 662 716 753 749 717 679 638 599 599 669 780 850 837
-560 837 782 758 780 822 869 929 984 981 901 806 762 756 716 616 517 490 539 610 647 626 571 530 534 558 561 544 553 590 603 577 581 675 806 869 839 787 766
-565 766 769 774 776 754 678 571 513 558 682 815 903 911 844 751 692 669 662 690 784 875 841 681 570 640 812 910 883 807 741 677 633 646 695 711
-569 711 685 674 688 661 578 522 567 669 732 726 697 689 712 759 809 828 799 749 715 712 724 737 741 731 713 702 699 692 674 654 635 619 624 677 760 815 817 800
-574H00nrm4o2m8k7j3K1P8R4L4n1p8l9OJ1pj3jQLlMJ8J6j1l0j6J4J8mj5%J3%j7pK6M3L2J3
-579G52Jj0l0m7l2J1L8K8KpPJ5J4Ppn0q3n0M5R9M1o4r4k2N8P2K9k0m6m4pL3L0j7m7j2N4P7
-583G24L6k2m2j0M3O8L7k0l7J7P3N0l9r1m8K6K5m6q9m5K3L6J1K1N3L5m4r6o3lJ0pKK5J4j5
-588F12nM3O9N3L2K3Mk9m3l5m1n1k5L2N5J5k9l8l3l5j8K8M7J2j4K3O2K9l3l4J0J0m1n4LN3
-592F57M0J0J3J8j4m4j9M0O6M1nn0q1o4PO7N0j0j6L5M3l0r0m4N7Q3J8m8n9n0m4oO2Q7L4k3
-597G31mM8M3lpK6J2o3j04n2L0O3M9Po5j34j14J3J14P8k5m9J7N9L0JJ7L4J8PK9M4J3k4k8j4
-601G97j9l4m1n6q0p5k0L7M6J6qj9j9QN4O3kp3o3J2O9P6P3P1M2j6n4n7n9n5mP5Q4jq0n6J6
-606F48L0k6n8k8K0L5K5J8J3NJ0K1J9rm5o6n7j5M3O1K0l4l0K3M4Nl7k6J5L4J6j6m0l5ON0L6
$$ plain form
-574 800 795 786 742 680 632 605 592 613 691 785 819 768 690 651 657 668 661 648 647 655 658 655 659 677 693 682 652 636 650 668 664 649 649 662 662 645 638 664 707 739 752
-579 752 753 743 713 666 634 645 683 711 713 706 713 728 742 749 742 692 609 559 604 703 744 680 586 564 622 694 723 703 657 613 606 639 669 652 605 593 647 724
-583 724 760 738 696 686 729 797 834 814 777 794 867 917 878 787 739 765 790 744 655 610 633 669 680 701 754 789 745 649 586 583 593 586 588 613 627 612
-588 612 607 650 719 772 804 827 831 802 759 724 683 632 607 639 694 709 680 642 609 574 556 584 631 643 629 652 714 743 710 676 686 696 655 601 604 657
-592 657 697 707 720 738 724 680 661 701 767 808 803 753 672 608 615 682 732 722 706 741 784 754 664 620 677 760 778 730 671 621 577 571 633 720 754 731
-597 731 727 775 818 815 808 834 846 783 679 627 657 720 769 776 711 577 463 476 590 668 643 594 611 670 700 701 718 752 770 777 806 850 863 839 811 797
-601 797 778 744 703 647 567 492 472 509 555 571 563 544 525 533 587 650 648 575 512 524 593 669 742 813 855 839 785 728 669 614 610 685 769 768 688 632 648
-606 648 678 652 594 566 586 621 646 664 677 682 692 713 732 723 678 612 555 540 583 644 664 630 600 623 667 672 635 609 624 658 674 658 618 583 589 639 675
-610F75l2o9k4M7O4L5K3K3mm5m7j7j7n3o1j5L3L3J1nk0k3J6Q2Q6Qn6k5M5M4j8l9JJ5k8m8J5
-615F10R2Q6J0m9l9J1N4O3L3j1k3RL3j1q3r5j8O5O7Pl6k5LPpj8j9j9j6j6k6m2l5nQj9m2rO3
-619E58Q9L4l7m8MM6L8RQL2M3Qn3r3p9j7N8J05R2K7m0m6J5P9P9K7j8l7n2p2p5n0j4OJ1J0j
-624F46j1pLjj6j8jJ2J4J6J7ll1k3K4N5K4l2n2k9PL0L0J0k3m1m2l7k5J8P8J02O0j0n7o2k9
-628E96L7R3P7no3m6oNJ1L9M2j8o8k3O4P9J7k2nJ3%j0pj4k2%J6j8n6j6N2K0r6j29j9Q3N5j8
-633F38j2L9L9J3K9N2Oo4m6L9O7Kn5m0j0k4n5n5k4J2M0N5M8L0K3L1L1J8PKrk4k6j6ppj5k5
-638G07k0K4Q3R3K9m0m7j4j4m8o0k8Mj2n7q5o1MN2L7nJ2Q5J04K4n1k2L7Mp4n7L9O7mm0K6P6
-642G68J5p9q8l0J9N1Q4P2qp5n4mj6p2o3J5O7M7Q%J0K3L6L1rm8l0K5M6K2J7L5Ro8j00k5P1
$$ plain form
-610 675 643 574 550 597 661 696 719 742 738 693 646 629 612 559 498 483 516 549 560 555 535 512 528 610 696 704 648 623 668 712 694 655 656 671 643 595 610
-615 610 702 788 798 749 710 721 775 838 871 860 837 846 879 868 785 690 672 737 804 811 775 750 753 760 753 735 716 697 681 665 639 597 562 557 565 546 504 495 558
-619 558 647 681 644 596 600 646 684 693 701 733 776 784 731 638 559 542 600 705 797 824 784 738 753 832 911 938 920 883 831 759 684 634 620 626 637 647 646
-624 646 635 628 631 630 614 596 595 607 621 637 654 651 620 597 621 676 700 668 616 587 594 624 654 664 641 600 558 521 496 514 592 694 754 744 687 625 596
-628 596 633 726 803 798 735 689 683 688 699 738 780 762 694 671 735 814 831 809 804 817 817 807 800 786 764 764 780 762 706 690 742 762 666 537 518 601 656 638
-633 638 626 665 704 717 746 798 804 740 694 733 800 802 747 707 697 673 618 563 539 551 591 646 694 724 747 778 809 827 834 836 827 803 777 761 754 747 732 707
-638 707 687 711 794 887 916 876 829 815 801 753 693 665 669 657 600 515 454 458 510 547 542 554 639 743 767 716 694 731 735 661 604 643 710 706 666 692 768
-642 768 783 704 616 586 605 656 740 812 804 729 675 671 655 583 520 535 602 649 657 657 667 690 726 757 748 700 670 695 741 763 780 815 824 756 656 631 702
-647G02O8j3n5j2L1Om6m5J5O2N1J0oJ6L4J0l9n9k8J6J9j0k3PL2Qm1n4j6J7Ml1l8j3J6L9N7
-651F91M9Nm5m4KK8Ll4m1l1l0l5k7mK1M2N1L5OkJ5J8oj8J3M0K0j1QN3N0nm0k6k3o1p4j1O5
-656F47O5J0j4QJo8j18p8K0R1R8O6J3m3o6l5PNk4j1M2N5Ll7j4J2k7q3n0N2J07O0j6l6%M9P8
-661G69O0rq1q3k2J9J0RM2L9m6j29j06j2L8K1RM2O6L7rl0k4rJ1K8K5RmlMK3M7L6l2j00p4L7
-665F08J16Q5jl8oL6M3J4l1o9o7j9K5J8k7n0k7MMk2m9m9j6L9P6N7pn0l1RJ0k6l7jK2j4o9o5
-670C95mM6M8L4K9K6J2QJ8J8kj0Jol8l8K0O8L5l6m7PL8J7pOK2Pj0%K3L0Ql4p9q8k7N9Q5L7
-675F71qKK3jn2o0k4J0J0lpMK1K9K8L1M6M2j3q3q8j9L9K4k4k6J7N1N1K9qm4n0j8J4J1LK4K7
-680F79l3j02p7L1J01P0kl2l0k7oM0O3J8m2m5OL8K4LJ0K4J4j3l5n2o0m5lL9M2Qk1rK9M8J6
$$ plain form
-647 702 770 757 702 690 721 727 681 636 651 713 764 774 768 784 818 828 789 730 702 718 737 727 704 711 743 751 710 656 640 657 661 630 592 579 595 634 691
-651 691 740 745 700 656 658 686 689 655 614 583 553 518 491 487 508 550 601 636 642 640 655 673 667 649 662 702 722 711 719 772 822 817 777 751 728 667 593 582 647
-656 647 712 722 708 716 717 649 531 453 473 564 662 728 741 698 632 597 604 609 585 574 616 671 674 637 623 635 608 525 475 527 634 694 678 642 642 691 769
-661 769 829 820 739 656 634 653 663 672 714 753 707 578 472 460 498 519 528 570 636 673 664 634 610 601 612 640 665 674 670 667 671 694 741 777 745 645 571 608
-665 608 724 809 808 770 764 800 843 857 826 757 690 671 696 714 687 637 610 614 618 596 547 498 482 521 597 654 647 597 566 575 585 559 522 521 543 529 460 395
-670 395 391 437 485 519 548 574 586 594 612 630 628 618 619 613 575 537 557 625 660 624 577 584 622 639 632 638 660 667 657 657 680 710 718 684 605 517 490 549 634 671
-675 671 663 665 688 687 635 575 551 561 571 568 561 565 586 615 643 674 720 762 749 666 578 559 598 622 598 572 589 640 691 720 712 668 618 600 614 625 628 652 679
-680 679 646 544 467 498 599 669 667 635 605 578 572 612 675 693 651 606 612 650 674 677 687 711 725 712 677 625 565 520 517 556 598 606 585 576 605 653 669
-684F69l0l5LL5J9j1jL7M5no2o8k9NMj0lL1O0M9pn9o9m5k1%N1J14J07lj11r4K1R1M9j4j0J9
-689G22Nk8k2nl8q5o1J9N4K1NN4Q9L5n1o6NQ1R1K7p0j27r0J1P9O7K9K7L1ro3n7ON2M3J0j6
-693G75l3l9k3lJKL1O9O0jn4o3n2n7p2o0j1N3Q9P0Rm4n7l6j0K1M7M8J1k2k1pk9o0l9L0P4N1
-698F48om2l1K2Q3R7L6m6p1l6pj5l7n3p0o4j3M1L9OK6P6M8n3q8J0J04O2n1r1n1k6k8RP8R5
-702F01N7M0O3O0jn3m2ML9N0L3k0p7q6m9k0j3J5O6P9K7k8k5J4K8Mk4l7k9qnl3n7k5M4O9L5
-707F96J1K8L2j5m2JL7j7j07j14l9J8K4L4O3M9ql7oJ3j9l1K6Q3N1k6m0K8Q2N6j8o9o3j6K3
-711F88K4PK5P6P9mq5o4J9L8l2q4o0k1k6k8K7R1Q0Jo8q1n6j0N1Q1M1l0m6QN0K5k4l5j1KLK0
-716F71M2K9k8p7o0PN5L1l4o4j9M5N5J1k3j5Lnj7ML4K7j5l3MN8O9L4mj3qj2k0pJ6Rl8p0l8
$$ plain form
-684 669 639 604 607 642 661 650 649 686 731 726 664 596 567 572 576 566 563 594 654 703 696 637 568 523 502 502 553 667 774 771 660 566 587 678 727 713 703 722
-689 722 727 699 677 672 634 549 488 507 561 582 587 641 730 765 714 648 653 734 825 852 782 655 565 576 655 722 751 778 809 800 737 680 686 738 781 791 775
-693 775 742 703 680 677 678 680 711 780 840 839 785 722 670 613 541 481 470 523 612 682 691 647 590 554 544 565 612 660 671 649 628 621 592 532 493 523 597 648
-698 648 642 600 569 591 674 771 807 761 690 654 647 632 595 542 472 408 395 436 475 481 507 583 631 578 490 500 604 666 615 524 473 447 419 428 506 601
-702 601 658 698 761 821 820 767 725 729 768 818 851 831 754 668 619 599 586 601 667 746 773 745 720 734 762 766 742 705 676 668 663 630 573 548 592 661 696
-707 696 707 735 767 752 710 711 748 731 624 510 471 489 513 547 610 659 651 614 608 621 602 571 597 680 731 705 665 693 775 831 813 744 681 665 688
-711 688 712 719 744 820 899 895 810 746 765 803 771 687 627 606 580 552 579 670 750 751 683 602 546 536 587 668 709 679 633 641 691 716 692 657 646 648 651 671
-716 671 713 742 714 637 577 584 639 670 636 572 553 598 653 664 641 626 629 624 607 611 645 672 657 624 628 686 755 789 785 772 764 752 732 725 741 750 712 642 604
-721F04L6P6N7J6rk1j7J5N2L8l1p1k5N4P7L2k1m0k9JL3L9J1j3%Pl6q8p2mK7lk6oLk8l9J5P0
-725F84N8J0PL8M0jk9k1qnOJ9Pk8m5k5%J1K6M4L8Lk9l4l0l2j4L3O4L7k1m6l1k8o3q7n7PM3
-730E41K4qqJ7K5Jj2K1O2M2l2p3m1QKk0J0O5N3l6q3k9N2O4L0L4O6N3j3o2m8nK9N0L5m1j27
-735F46j25k7M0Mn4k0O7Q5K0k4lJ3k4n5k5K7L3nl3k9KN0Q8O6j4q0o1J4O2N6L2J3j2k7qK3R
-739G24n0q0m1Oj2n1k8N9J16R0K3k1k5j1J5L8K2l6p6m4K5N3K1mJ1K4rn3n6l0k0k6pL3N2L0
-744F62NNJ1ol7m9k7K3P0P3Oq5j14o2KJ0j6j1K9N6N0M3O2P7M8j6o8p5m2oJ3K5L8K9k0q2q4
-748E37jQ9R2J2n8n5qK0J6J9M4N1J0n3p2l1K1L2J5J2K6J4l9p8o1jN5Q1O5%r0j26o6K5N2Rj9
-753E39J0M7M5K5K0J7j1m9m7PO5P0K1l5m2oJ4j1l7rM2M0j5m7j5K6K3jmj3n2p6l3K9K5l4n6
$$ plain form
-721 604 640 716 773 789 780 759 742 757 809 847 816 745 720 774 851 883 862 822 793 794 827 866 877 864 864 871 835 747 675 671 698 695 669 663 666 638 599 614 684
-725 684 742 752 759 797 837 836 807 786 778 773 779 798 805 777 732 707 707 718 744 788 826 829 800 766 736 704 690 723 787 824 803 757 726 698 635 548 491 498 541
-730 541 565 557 549 566 591 592 580 601 663 705 673 600 559 567 569 549 559 624 677 641 558 529 581 645 675 709 775 828 815 753 705 700 729 779 814 773 646
-735 646 521 494 534 538 484 464 531 616 636 612 609 622 598 543 518 545 578 573 540 511 513 563 651 717 703 623 562 576 638 694 726 739 727 700 692 715 724
-739 724 674 594 553 559 547 496 468 527 643 733 756 735 710 699 714 752 774 738 662 618 643 696 717 713 724 748 739 686 630 600 580 554 547 580 632 662
-744 662 667 672 683 677 640 591 564 587 657 730 736 651 537 475 477 487 471 460 489 545 595 638 700 777 825 809 741 666 624 618 631 656 694 723 703 621 537
-748 537 536 625 717 729 671 616 608 628 644 663 707 758 768 715 643 612 633 665 680 692 718 732 693 615 554 553 608 689 754 754 664 538 472 497 549 558 539
-753 539 549 596 641 666 686 703 692 643 596 603 668 738 759 724 682 676 690 679 642 633 675 715 700 653 638 664 687 686 682 669 617 541 508 537 562 528 472
-757D72rL0Ol7l2J4N4O9O6N3L9L9M0Mo5r4l7M1M5j9n2oM7K8m7q9m7M3R9P6mo5n1K5Q7P2np9
-762G11r5n9j1K1L3L3K3MlJ6L5J0n4q1k9M8O1Ol1pJ7ro2o9k4K8N8N7K5k1l2QM0qr2j04k5M8
-766D66M6J2J2L2K7OJ0L1K3j0j8J0L2J6rj4j1j8j4J9O2O9K4l6p6q7q6o5j0N4P3K6k0lM2K4
-771F39m9p0%O5M0k1j4M0M6JrK9K9l4p6l1K7J5k5qN1O6J4l4l8l2m2l9pK5J4k1l5lM1O0M0M
-775F58j3lJ0Jk5m0k4%%k8n0k8L3P9Q2O1M8K8k2p6p4j9K4K2J2J2j4q5j39j01OQ6Q7M4MrML7
-780E88N8L9%j9k1l5o7o9k1M2O8M3nl3j3L8O3L6j3l4l2l7l4J7Q1Q2Mo6o2j5K1L7M5L7J2NL1
-785G71L5k4r3q5jO0L3l3o1m0j5rJL4O9O8J8l8n1k1J0J7J3J7K6K8K6J7j0m5n2k0Q%k7k7jJ4
-789F12J6K1K3j0o1o1LN2J1p0q6j5N0L8mkL5L3j4l3J6O4L9l0o5m3j1NK3M1K9mrK6M7K2k0l6
$$ plain form
-757 472 463 493 499 462 430 444 498 567 633 686 725 764 804 808 743 649 612 653 698 679 627 621 668 696 649 560 513 556 655 731 727 662 611 636 723 795 790 711
-762 711 616 557 546 567 600 633 656 660 657 673 708 718 664 583 554 602 663 669 638 631 648 639 577 508 484 512 570 627 652 631 599 607 647 639 547 443 418 466
-766 466 512 524 536 568 595 601 611 642 665 655 637 647 679 695 686 672 661 643 629 648 710 779 803 767 691 604 518 453 443 497 570 596 576 573 615 639
-771 639 590 520 520 585 625 604 590 630 676 677 668 697 726 692 616 585 612 627 602 594 645 711 725 691 653 621 579 540 533 558 572 551 516 513 554 614 654 658
-775 658 645 642 652 653 628 588 564 564 564 536 486 458 491 570 652 713 761 789 767 691 617 598 622 644 656 668 654 569 430 329 335 421 508 552 556 547 551 588
-780 588 646 685 685 666 645 610 543 474 453 495 563 606 601 568 555 593 656 692 679 645 613 576 542 559 640 722 726 660 598 583 604 641 686 723 735 740 771
-785 771 806 782 689 604 603 663 696 663 602 562 547 538 539 573 642 710 728 690 639 618 628 645 658 675 701 729 755 772 762 717 665 645 653 653 626 599 598 612
-789 612 628 649 672 662 601 540 543 595 606 536 450 435 485 523 519 517 552 585 571 538 554 618 657 627 562 519 508 513 536 577 606 602 593 619 666 688 668 632
-794F32k6OO2J03O8l6r1l7L6K2l9k8M4N3k4o5kO0J1r6j23m8L3N2L1K0K3L2L1J0k7l4J8P7O3
-798H11k3q8n8K5P4O2K7ll3o2o2k0K3K5j2m6n2m2k8oK6M5M3L4K7Rk3l3LN2N5J3k9n0o9p7m6
-803D92J2M2K6PJ1lm5o3k4J8Oj9J4P8Q2J4m1m4l9n5n4rL4L8L1M4M7J5j8qJ5jm5m9jM2M0J4
-807F04koJJ8K4rn6n4JM7M1J8K1K7%k4nK1j6q1p4K3J01O6k6o6l4J5L6L6J8j6l6j3K6L0jj9
-812F36j5j6k2J3Q1J00K3p7j05o5k7mM2R9R9K3n2m8QL0pm9l9J1M2J8m0p5n4JL8K7rm3n8m9
-816D37k7lK1M9P6O1jm9j9O1Q3K5k7kM1K1l3l6MPm3o1j6K8J4qJ7N3M2%j9k2n6r8o6L7J07P0
-821F68j1l4ML1Rk3k1LJ9J3PM%ppPK3K3Kj9k5k4k5j8%J7J5PJ6K9J5j5oL9N3%n2l0K2Pp2j02
-826E42k8P0R3M1j8m6n8m5LN8O3J7k1j1J5J1j8l4k3j5l3n1l5J5N6N7L7L2M7M8K2j6m9o6n8
$$ plain form
-794 632 606 612 674 777 845 809 718 681 717 739 700 672 716 769 745 680 678 738 749 653 530 482 515 567 598 618 641 673 704 714 687 653 671 748 811
-798 811 788 700 642 667 741 803 830 827 794 732 670 650 673 698 686 640 588 546 518 512 538 583 626 660 687 696 673 640 643 695 750 763 734 684 615 538 492
-803 492 504 546 572 579 590 587 542 479 455 473 479 460 474 552 634 648 607 563 524 469 415 406 440 478 509 553 600 615 597 589 604 603 558 509 508 550 590 604
-807 604 602 596 597 615 639 630 574 520 521 568 609 627 648 675 675 651 646 667 651 570 496 519 620 686 660 594 560 575 611 647 665 649 613 600 626 656 655 636
-812 636 621 605 583 596 677 777 800 723 618 553 526 522 564 663 762 785 733 685 693 723 716 667 628 639 681 699 659 584 530 531 569 596 587 544 486 437
-816 437 410 407 428 477 553 614 613 564 545 606 689 714 687 685 726 747 714 678 682 689 646 585 569 597 611 603 620 673 715 715 696 674 618 520 454 491 598 668
-821 668 657 623 627 658 667 644 623 626 645 658 665 669 669 662 655 662 685 708 710 691 666 642 617 599 599 616 631 638 654 683 698 683 677 716 769 769 717 687 709 716 644 542
-826 542 514 584 677 718 700 654 596 551 554 612 675 692 671 660 675 686 668 634 611 596 563 512 477 492 548 605 642 674 721 769 791 775 726 660 602
-830F02j7K1J0m8q4n7LK8J4%J2M1P1Q7N7j3o2m4J4M6L9L0J7k9p8n7K8P8M2j7k4LJ5J0J3Ll5
-835G19o0l1J8K8KqLMj1j5kQJ4K2Mm4p0l2J4kl8pP0Q6K1k9rJ1k2n2k4L1N3M9M2K2j2k4mkk4
-840F99j7K6J6o6j04j2R5P7k9p8n2l4l8kM5J4o0n6K9N5qk9N1J05M3l0LO4L5m0l5K7K6m2o0
-844F18LM6Qn5p1l4K0O6P1J4n3n0K5P9N8Jl8n3n9m8j4J8L2L4L5K5Kj6j0NJ3%l2n9m2J8N5L7
-849F49J4M4P7L1o2r8o5n7j00j04k6M4K7j1K6R2Q6J7j8J5M6K9nj2J0M2O3M5k2q0p5l4l3o3
-853D92n8kM0K9JjJj4k6pJ8K3J8J7Nk4l2K0R2J10N1k2m9k1K1L7J5j7j9J2L0J5pmKl9j09j31
-858D67o7K7P4O6M8M1J0n9j10o6N6J50J24J4o6n8rJ1j2l9m1j7K3O0O3K7k0l1%L0K1k5o2n2
-862E78kN1O3K1m5p9n8JN4O4K9k3n9o1l9j4nmOL3O3P5O5L8jn6r6q4k6J8Rj8j2J5J7j3j5K5
$$ plain form
-830 602 585 606 616 568 484 427 430 458 472 472 484 525 596 683 740 727 665 621 635 681 720 750 767 738 660 603 631 709 751 734 710 713 728 738 751 754 719
-835 719 659 628 646 674 676 668 671 675 664 649 647 655 669 691 695 651 581 549 563 561 523 516 586 672 693 664 655 666 644 592 568 599 652 701 743 765 753 729 725 723 699
-840 699 682 708 724 658 554 542 637 714 685 607 555 521 483 481 526 540 480 424 453 508 500 471 522 627 670 640 643 707 742 702 667 694 720 678 618
-844 618 621 667 675 620 549 515 535 601 672 686 633 583 608 687 745 746 708 655 596 548 534 552 584 618 653 678 680 664 654 659 672 672 640 581 539 557 612 649
-849 649 663 707 784 815 753 655 590 533 433 329 303 347 374 363 389 481 567 584 566 581 627 656 651 639 649 691 754 799 777 697 622 588 555 492
-853 492 434 432 472 501 502 501 502 488 462 455 473 496 514 531 536 512 480 500 592 702 753 731 682 661 682 719 734 717 698 710 740 755 748 744 746 707 598 467
-858 467 400 427 501 567 615 656 666 607 497 431 487 637 761 775 709 651 642 653 641 602 561 544 567 627 690 717 697 666 666 696 717 692 630 578
-862 578 576 627 690 711 666 587 529 530 584 648 677 654 595 534 495 481 476 472 478 511 574 649 714 752 751 695 599 515 489 507 516 498 486 501 518 505 490 515
-867E15O1N5K0qk2k0J0M8M4rn0l2PJ0j3qJ8K0pk1j1%OK6M3K1k2k8jkm1m4J8O7L6k0k5%j6n4
-871E71m6%J5j2pM5Q0N3J2Jlm8j10j22n7L2Q2N6j0m6rN4N7nn6m2mLjK7P5Q3L8j4m0l9k2LJ3
-876F07j0m4m2NO0Q4O1Jo3r0n6QM8L7j1n6n9j7K9L4J2K4P9R8K6o3o3J6O5L5o%K4K0Jooj4k6
-881G42m0o2p3m2Kop5j06l9N8Q6N5M5O5O2J7k1j9n%OJ1QOK4L7jp4j06o3ML0J7J7M2P1O8K6
-886G67l3o8n6k0oj8j6J4M1L5Qj4k4k3rQPpkK5L1j3o4o4pM4M4Pk2k3j4j2rJ2L7L1ql1oK2j
-891E63m4k5N2R1L9l3m0QM1M2L4J2l1o9n8j1J5QKMk1p1q0j2P9R6K5m4l1M1P6L1l3l4J5K5l2
-895F30p3l1M4O1J6j3NK7J5JJ4K2j8q4j20r7k7N1J03J10P2J6k9n8o4m4%L9L8%m1n2l2j1lP
-900D74K6L9K9Pknj4k0KL0K3j1j0K5L0j8l4L0Q6M2m9o2qMm5m8K3O0ko1k2M7L2m2n3J7P3N7
$$ plain form
-867 515 576 631 651 643 621 601 611 659 703 694 644 612 619 629 616 608 626 646 639 618 607 607 613 639 682 703 681 653 652 650 609 565 583 650 686 666 641 641 625 571
-871 571 525 525 540 528 521 566 646 699 711 712 709 661 551 429 372 404 486 542 532 486 477 531 588 583 527 485 481 484 483 510 585 668 706 692 652 613 591 594 607
-876 607 597 553 511 516 576 660 721 722 659 569 513 521 569 606 595 539 480 463 492 526 538 562 641 739 765 702 639 655 720 755 749 749 773 793 794 788 782 768 742
-881 742 702 640 567 525 527 521 446 340 301 359 445 500 545 610 672 689 668 649 644 644 650 661 669 675 699 736 735 661 555 492 496 526 543 560 602 673 741 767
-886 767 734 666 610 590 584 566 550 564 605 640 648 634 610 587 578 586 593 586 584 609 640 627 563 499 492 536 580 587 565 542 528 516 507 519 556 587 579 548 542 564 563
-891 563 519 494 546 637 676 643 603 611 652 694 728 740 709 640 582 571 586 594 596 600 579 508 428 416 495 591 616 572 541 582 658 689 656 622 637 662 630
-895 630 557 526 570 631 647 634 639 666 681 682 696 718 700 616 496 399 372 423 526 636 708 724 695 637 573 529 529 568 606 606 565 513 481 470 467 474
-900 474 500 539 568 575 573 568 554 534 536 566 589 578 568 593 623 605 571 601 687 729 680 618 610 614 569 521 544 604 602 541 519 566 598 556 503 520 593 650
-904F50J0k1l3k1K7O9M2m1r1p0l7m6n5qO8R9N9om3l7rRNML1N6K0o1r7k6Q0J09N2j2l1k8k3
-909E94lL0L7Jk6pK7J7l6p5o5k7OK4L6L2Rk4m2l5j7j2j6NO8J26J11K4n4n9k1ok6m0l3k2j5
-913D86rj5l5l2K2Q8R0L2pPJ5j7m9m2k4k1NO6R1K6o1p2k1RLJ0K6Ml0mP3J03M7k4n0n4n7l6
-918E43J5M7L7K3K2oo3p7j6N4O5L5Pk0n0m3J1M1J3nL2N8Pm8j9M4J9o9r4k7L3M7P5J25J09l
-922I22j06j15p0m0k4KJ9kk1nK1K8L1M1L4Mj0NOk6l1J9N8J7n9r1p8n5j9N0R3M8l4n5k1j4n2
-927D70m8J8O4L2j8j3K7K8j4m1j9L9R4J05N7j5m5k5nk3n1m6k9l4m1j1M4P0N5K7Mk2m8m1QO2
-931F15Q4O8K4k9o4n4k4j5l4l7j1J0J3L5Q1Q4rj29j65r5QQ4J14Q1j2q2m0O3P6k8j04n3L1K0
-935E06l5j1O7P2j3o1j8K2qn5n0j7%K0O2P9M7K0M1M9j7q3m3O5Q9k5j45j35j6Q0Q1L3J3L7N6
$$ plain form
-904 650 660 639 606 585 612 681 723 682 591 521 484 438 383 375 443 542 601 595 552 515 506 515 520 524 555 611 631 570 473 447 527 636 688 676 645 617 594
-909 594 591 621 658 659 633 626 653 670 634 559 494 467 473 497 533 565 574 550 508 473 456 444 428 433 501 627 738 762 708 649 628 622 596 556 523 501 486
-913 486 477 462 427 395 417 505 595 627 620 627 642 625 576 534 510 489 494 560 651 677 616 544 523 532 535 545 571 575 545 541 614 717 764 740 690 636 579 543
-918 543 558 605 642 665 687 681 618 541 525 579 644 679 686 666 616 573 584 625 638 633 665 723 730 682 663 707 726 657 563 536 569 616 691 816 925 922
-922 922 816 701 631 591 567 569 588 586 565 560 581 609 640 681 715 719 709 714 720 694 663 682 740 757 698 607 529 474 455 505 598 646 612 557 536 522 470
-927 470 422 440 504 536 518 505 532 560 546 505 486 525 619 724 781 766 721 696 691 668 617 571 542 508 467 456 500 570 625 652 656 634 586 545 553 615
-931 615 699 767 791 762 698 644 620 605 571 534 523 533 546 581 662 746 737 608 443 348 356 440 554 635 623 541 501 564 640 612 508 455 486 506
-935 506 471 460 527 599 586 525 507 529 521 466 416 399 399 419 481 560 607 627 668 717 700 617 574 639 728 703 558 423 407 487 568 601 614 651 707
-940G07L4j3l1j8k3p7j15o4N3J25Q4j6p2n5j7j1j4J4O9Q4L0m0m6J1M4Jo4p3l3rk1l6j5L6Q7
-944E16J12Q4J6m4m6mK5J1k5m2l4pK2L5K9J8Rrl9o1n5l1j4mJ9M2L9J4rk4l8m3j8K2M1K8J0
-948E45lj9k7pL4N4M1K0pm5p2l1O0J10O1l2p6n6j6RK2K3Pj2j5nJLJ5L2M0L3J3j5m1m9k0L3
-953F08P7P3J8n7r3o0jJ9qk0J8O0L6m3r8p3jM9M9K3J7L2K6k5q5r0l3L3N3L1nj3K6Q9J02K1
-957G55q5j07l7J8qm8l1Q%m3m6MN6P0M7%n0m9J0N9M6J5K7N7K9l6n5j7mm1n3j1J2l0p3m4L1
-962C76P4P1N1K2j8l6jM5L9j7m8j3N4Q8N9on7o1l7l2m7l5J6L8j4q1o7K1P8N1%rQQnRM5N1J0
-967F30l3l1OL2K9J7Rol8o9p5n1qM0O5M9J5K0N8M6m3j12o1M8P1jm1JJ1p0j22k9J14J31J8p5
$$ plain form
-940 707 741 728 697 679 656 579 464 400 453 578 662 646 574 519 502 491 477 491 560 644 674 634 588 599 643 644 580 507 474 465 444 408 393 429 516
-944 516 628 712 728 684 638 634 659 670 645 603 569 562 584 619 648 666 675 666 627 566 511 480 466 462 481 523 562 576 567 543 505 462 444 466 507 535 545
-948 545 542 523 496 489 523 577 618 638 631 586 514 483 543 653 714 682 606 550 534 543 565 588 595 583 568 563 564 567 582 614 654 687 700 685 644 595 575 608
-953 608 685 758 776 719 626 566 565 584 576 556 574 634 670 627 529 456 455 504 553 576 593 625 651 626 541 451 418 451 504 535 530 517 543 632 734 755
-957 755 670 563 526 544 536 488 457 465 465 422 376 380 436 506 553 553 503 454 464 523 569 584 611 668 697 661 606 589 585 544 491 480 492 462 389 345 376
-962 376 450 521 572 594 576 540 539 584 623 606 558 545 599 687 746 740 683 622 585 553 506 471 487 525 511 430 363 384 462 513 513 504 512 520 515 524 569 620 630
-967 630 597 566 572 604 633 650 659 653 615 546 471 420 412 452 517 566 581 601 659 705 662 550 489 537 608 607 566 567 578 508 386 357 471 602 620 545
$$ [...]
##$OBSERVED INTEGRALS=	(X Y Z)
(2.7116400605614643382, 2.9442661573058477309, 1)
(3.7773921782043315964, 3.9153448634829763897, 2.0624728422108136172)
(6.7665526176215147203, 6.8369452530889294195, 0.93252784093879248495)
(6.9483185593437806205, 7.0581232274823682005, 0.99379402497347446577)
(7.1481238394031008099, 7.2351832548558370206, 2.8686621601989208408)
(7.2632226611840842168, 7.2887130305733993652, 0.30683233473341375852)
(7.2979287795064591293, 7.339889849116559617, 1.8442506681081993758)
(0.87272022188954700983, 0.95566312257034857769, 0.83853953773777434311)
(1.1080841673279204773, 1.1368987464605342375, 3.0386563602567728815)
(1.0816932443840270306, 1.1064683965354364936, 2.9418658629290774797)
(2.3658919458307767769, 2.4068795009926220452, 2.911593437975788401)
(2.2956742218483254803, 2.32947670757941383, 2.9349267174206765674)
##END=	
##END=	
