##TITLE=	Jan31-2020.40.1.1r
ACR001
##JCAMP-DX=	6.0	$$ MestReNova 14.1.0-24037
##DATA TYPE=	LINK
##BLOCK_ID=	1
##BLOCKS=	2    
##ORIGIN=	Mestrelab Research S.L.
##OWNER=	acr119
##$MNOVA/LINK_BLOCK_TYPE=	ITEM	$$ NMR Spectrum
##$MNOVA/ITEM/POLYGON=	(XY..XY)
5321,5835
8722,5835
8722,8208
5321,8208
5321,5835
##$MNOVA/ITEM/Z=	0
##$MNOVA/ITEM/ANGLE=	0
##TITLE=	Jan31-2020.40.1.1r
##JCAMP-DX=	6.0	$$ MestReNova 14.1.0-24037
##BLOCK_ID=	2
##DATA TYPE=	NMR SPECTRUM
##DATA CLASS=	XYDATA
##NUMDIM=	1
##ORIGIN=	Bruker BioSpin GmbH
##OWNER=	nmrsu
##.OBSERVE FREQUENCY=	400.05240029848198446
##.OBSERVE NUCLEUS=	^1H
##.SOLVENT NAME=	CDCl3
##.PULSE SEQUENCE=	zg30
##LONGDATE=	2020/01/31 15:56:00.000
##.ACQUISITIONMODE=	SIMULTANEOUS
##$ORIGINAL FORMAT=	Bruker XWIN-NMR
##$MNOVA/SCALES_VERSION=	8
##$PARAMETER FILE=	(acqus, ASCII, //ch-nmrserv3.ch.ic.ac.uk/Av400D/ug1/nmr/Jan31-2020/40/acqus, 0)
$$ ##TITLE= Parameter file, TOPSPIN		Version 3.2
$$ ##JCAMPDX= 5.0
$$ ##DATATYPE= Parameter Values
$$ ##NPOINTS= 11	$$ modification sequence number
$$ ##ORIGIN= Bruker BioSpin GmbH
$$ ##OWNER= nmrsu
$$ $$ 2020-01-31 15:56:10.844 +0000  nmrsu@nmrpc
$$ $$ /opt/topspin/data/ug1/nmr/Jan31-2020/40/acqus
$$ $$ process /opt/topspin3.2/prog/mod/shimcntl
$$ ##$ACQT0= -2.04831932773109
$$ ##$AMP= (0..31)
$$ 100 100 100 100 100 100 100 100 100 100 100 100 100 100 100 100 100 100
$$ 100 100 100 100 100 100 100 100 100 100 100 100 100 100
$$ ##$AMPCOIL= (0..19)
$$ -1 0 0 0 0 0 0 0 0 0 0 0 0 0 0 0 0 0 0 0
$$ ##$ANAVPT= -1
$$ ##$AQSEQ= 0
$$ ##$AQ_mod= 3
$$ ##$AUNM= <au_zg>
$$ ##$AUTOPOS= <4 >
$$ ##$BF1= 400.05
$$ ##$BF2= 400.05
$$ ##$BF3= 400.05
$$ ##$BF4= 400.05
$$ ##$BF5= 400.05
$$ ##$BF6= 400.05
$$ ##$BF7= 400.05
$$ ##$BF8= 400.05
$$ ##$BYTORDA= 0
$$ ##$CAGPARS= (0..11)
$$ 0 0 0 0 0 0 0 0 0 0 0 0
$$ ##$CFDGTYP= 0
$$ ##$CFRGTYP= 9
$$ ##$CHEMSTR= <none>
$$ ##$CNST= (0..63)
$$ 1 1 1 1 1 1 1 1 1 1 1 1 1 1 1 1 1 1 1 1 1 1 1 1 1 1 1 1 1 1 1 1 1 1 1 1
$$ 1 1 1 1 1 1 1 1 1 1 1 1 1 1 1 1 1 1 1 1 1 1 1 1 1 1 1 1
$$ ##$CPDPRG= (0..8)
$$ <> <> <> <> <> <> <> <> <>
$$ ##$D= (0..63)
$$ 0 1 0 0 0 0 0 0 0 0 0 0 0 0 0 0 0.0002 0 0 0 0 0 0 0 0 0 0 0 0 0 0 0 0
$$ 0 0 0 0 0 0 0 0 0 0 0 0 0 0 0 0 0 0 0 0 0 0 0 0 0 0 0 0 0 0 0
$$ ##$DATE= 1580486169
$$ ##$DE= 6.5
$$ ##$DECBNUC= <off>
$$ ##$DECIM= 2496
$$ ##$DECNUC= <off>
$$ ##$DECSTAT= 4
$$ ##$DIGMOD= 1
$$ ##$DIGTYP= 12
$$ ##$DQDMODE= 0
$$ ##$DR= 22
$$ ##$DS= 4
$$ ##$DSPFIRM= 0
$$ ##$DSPFVS= 20
$$ ##$DTYPA= 0
$$ ##$EXP= <proton>
$$ ##$F1LIST= <>
$$ ##$F2LIST= <>
$$ ##$F3LIST= <>
$$ ##$FCUCHAN= (0..9)
$$ 0 2 0 0 0 0 0 0 0 0
$$ ##$FL1= 90
$$ ##$FL2= 90
$$ ##$FL3= 90
$$ ##$FL4= 90
$$ ##$FOV= 20
$$ ##$FQ1LIST= <>
$$ ##$FQ2LIST= <>
$$ ##$FQ3LIST= <>
$$ ##$FQ4LIST= <>
$$ ##$FQ5LIST= <>
$$ ##$FQ6LIST= <>
$$ ##$FQ7LIST= <>
$$ ##$FQ8LIST= <>
$$ ##$FRQLO3= 15959.0749999881
$$ ##$FRQLO3N= 2
$$ ##$FS= (0..7)
$$ 83 83 83 83 83 83 83 83
$$ ##$FTLPGN= 0
$$ ##$FW= 125000
$$ ##$FnMODE= 0
$$ ##$FnTYPE= 0
$$ ##$GPNAM= (0..31)
$$ [...]
$$ 130000 130000 130000 130000 130000 130000 130000 130000 130000 130000 130000
$$ 130000 130000 130000 130000 130000 130000 130000 130000 130000 130000 130000
$$ 130000 130000 130000 130000 130000 130000 130000 0 0 0 0 0 0 0 0 0 0 0
$$ 0 0 0 0 0 0 0 0 0 0 0 0 0
$$ ##$ShimPowMaxUC= (0..63)
$$ 130000 130000 130000 130000 130000 130000 130000 130000 130000 130000 130000
$$ 130000 130000 130000 130000 130000 130000 130000 130000 130000 130000 130000
$$ 130000 130000 130000 130000 130000 130000 130000 130000 130000 130000 130000
$$ 130000 130000 130000 130000 130000 130000 130000 0 0 0 0 0 0 0 0 0 0 0
$$ 0 0 0 0 0 0 0 0 0 0 0 0 0
$$ ##$ShimPowMaxUG= (0..63)
$$ 524287 524287 524287 524287 524287 524287 524287 524287 524287 524287 524287
$$ 524287 524287 524287 524287 524287 524287 524287 524287 524287 524287 524287
$$ 524287 524287 524287 524287 524287 524287 524287 524287 524287 524287 524287
$$ 524287 524287 524287 524287 524287 524287 0 0 0 0 0 0 0 0 0 0 0 0 0 0 0
$$ 0 0 0 0 0 0 0 0 0 0
$$ ##$ShimPowRcbType= 3
$$ ##$ShimPowRes= (0..63)
$$ 1e-20 1e-20 1e-20 1e-20 1e-20 1e-20 1e-20 1e-20 1e-20 1e-20 1e-20 1e-20
$$ 1e-20 1e-20 1e-20 1e-20 1e-20 1e-20 1e-20 1e-20 1e-20 1e-20 1e-20 1e-20
$$ 1e-20 1e-20 1e-20 1e-20 1e-20 1e-20 1e-20 1e-20 1e-20 1e-20 1e-20 1e-20
$$ 1e-20 1e-20 1e-20 1e-20 0 0 0 0 0 0 0 0 0 0 0 0 0 0 0 0 0 0 0 0 0 0 0 0
$$ ##$ShimPowRng0= (0..63)
$$ 1 1 1 1 1 1 1 1 1 1 1 1 1 1 1 1 1 1 1 1 1 1 1 1 1 1 1 1 1 1 1 1 1 1 1 1
$$ 1 1 1 1 0 0 0 0 0 0 0 0 0 0 0 0 0 0 0 0 0 0 0 0 0 0 0 0
$$ ##$ShimPowRng1= (0..63)
$$ 1 1 1 1 1 1 1 1 1 1 1 1 1 1 1 1 1 1 1 1 1 1 1 1 1 1 1 1 1 1 1 1 1 1 1 1
$$ 1 1 1 1 0 0 0 0 0 0 0 0 0 0 0 0 0 0 0 0 0 0 0 0 0 0 0 0
$$ ##$ShimPowRng2= (0..63)
$$ 1 1 1 1 1 1 1 1 1 1 1 1 1 1 1 1 1 1 1 1 1 1 1 1 1 1 1 1 1 1 1 1 1 1 1 1
$$ 1 1 1 1 0 0 0 0 0 0 0 0 0 0 0 0 0 0 0 0 0 0 0 0 0 0 0 0
$$ ##$ShimPowRng3= (0..63)
$$ 1 1 1 1 1 1 1 1 1 1 1 1 1 1 1 1 1 1 1 1 1 1 1 1 1 1 1 1 1 1 1 1 1 1 1 1
$$ 1 1 1 1 0 0 0 0 0 0 0 0 0 0 0 0 0 0 0 0 0 0 0 0 0 0 0 0
$$ ##$ShimSysFunc= (0..63)
$$ 1 2 3 4 5 6 7 8 9 10 0 37 38 35 16 15 14 13 12 11 28 27 26 25 24 23 36
$$ 22 30 29 20 21 34 33 32 31 17 18 19 0 0 0 0 0 0 0 0 0 0 0 0 0 0 0 0 0 0
$$ 0 0 0 0 0 0 0
$$ ##$ShimSysMatrix= 0
$$ ##$ShimSysType= 4
$$ ##$TFXNUM= 0
$$ ##$TRIPLO2= 0
$$ ##$VTU= 2
$$ ##$VTUETH= <149.236.99.20>
$$ ##$VTUTY= <no>
$$ ##$WBREFAM= (0..15)
$$ 136.7 118.7 100 100 100 100 100 100 100 100 100 100 100 100 100 100
$$ ##$WBREFLM= (0..15)
$$ 0 0 0 0 0 0 0 0 0 0 0 0 0 0 0 0
$$ ##$WBREFPH= (0..15)
$$ 77.55 -71.28 0 0 0 0 0 0 0 0 0 0 0 0 0 0
$$ ##$WBSGU= (0..15)
$$ 0 0 0 0 0 0 0 0 0 0 0 0 0 0 0 0
$$ ##$XFAC= 2
$$ ##END=
$$ 
##$DECIM=	2496
##$DSPFVS=	20
##XUNITS=	HZ
##YUNITS=	ARBITRARY UNITS
##FIRSTX=	6397.081942494469331
##LASTX=	-1615.7385703260308674
##DELTAX=	-0.24453933874997710318
##XFACTOR=	1
##YFACTOR=	2.7294993052519300747
##FIRSTY=	383.0938720703125
##MINY=	-1126.85302734375
##MAXY=	28418712
##NPOINTS=	32768
##XYDATA=	(X++(Y..Y))
$$ [...]
3423a4N0N0PPPPp7p6K2K1O0O0l8l9j04j05L3L4l3l3O6O6l7l7K3K2o2o2P7P7p3p4K6K6n6n5
3414b34M3M3P7P7o1o2o3o3L6L6K3K2K3K2K9K8l1l1L4L4k6k5ppppl0l0L0L0k1k1P8P7o4o5P3
3405d0P3o2o3L6L7K5K6j12j13L1L1R1R0o2o2llNOONp1p2O7O7J9J9J9J8j8j9j8j9k3k2L7L7
3396c7J9J8J9J9k2k1L6L7o0o0jjJ0J1n0m9N5N5o4o4M9M9M9M8l9l8l9l9R4R3k5k5l2l2r3r2
3387b22K3K3K4K3ooooK4K4K3K4mlmmj6j6j6j6J05J03r2r4J8J8J8J8k0j9k0j9OPn4n3R1R1k8
3378f1k8J1J2m9m8O9O8n1n0J57J57m0m1n2n2PQp1p2M8M7n3n3POj3j3J06J05n0n0RRk0k1q0
3369a42q0J46J46K7K8l9l8l8l8K9L1L0L0j09j10RRL7L7k3k3q6q6J12J13QQj11j12P5P5J6J5
3361e4qqN1N1MMJ9k18ppR8R6o9p0L4L4J0k27j9j9r3J46J2J2O8O8n2n1M6M5M5M6rrrrl9l9l8
$$ y = [-14, 36, 86, 93, 100, 107, 114, 37, -39, -17, 4, 64, 124, 86, 47, -57, -162, -129, -95, -128, -161, -95, -29, -66, -103, -80, -58, -120, -182, -105, -28, -101, -175, -149, -123, -179, -234, -191, -148, -71, 6, -55, -117, -180, -243, -207, -171, -148, -126, -103, -81, -52, -24, -55, -86, -52, -18, -44, -69, -76, -83, -90, -97, -127, -157, -127, -97, -118, -139, -61, 16, -48, -113, -40, 33, -29, -92, -56, -19, 6, 32, -80, -193, -162, -131, -40, 50, -12, -74, -77, -80, -75, -69, -63, -58, -129, -201, -134, -67, -48, -29, -10, 8, -10, -29, -47, -66, -89, -111, -74, -37, -18, 0, 19, 38, 16, -5, 31, 68, 8, -52, -53, -54, -44, -33, -83, -132, -77, -22, -86, -150, -101, -52, -3, 45, 6, -32, -71, -110, -16, 77, 52, 27, -5, -37, -130, -222, -199, -176, -152, -129, -135, -141, -147, -153, -129, -105, -82, -58, -62, -65, -69, -73, -89, -105, -121, -137, -32, 71, -21, -115, -97, -79, -61, -43, -63, -82, -102, -121, -115, -108, -162, -215, -124, -33, -61, -89, -78, -66, -115, -163, -94, -26, -77, -127, 30, 187, 147, 106, 54, 2, 9, 17, -54, -126, -78, -31, -84, -137, -130, -124, -137, -150, -44, 61, 11, -39, -30, -21, -41, -62, -142, -222, -76, 70, 97, 125, 86, 48, 10, -28, 1, 32, 62, 92, -17, -127, -118, -109, -72, -35, -58, -81, -167, -253, -141, -28, -20, -12, -123, -235, -160, -85, -69, -54, -62, -70, -19, 32, 36, 40, 59, -159, -166, -173, -75, 21, -48, -118, -84, -50, -40, -267, -286, -305, -398, -252, -240, -228, -160, -92, -144, -195, -149, -104, -59, -13, -22, -31, -40, -49, -88, -127, -165]
3351a65l9P1P2P1P2o9o8O5O5j25J11q1q1R4R4k4k5j07j07m8m8PQK06K06n2n1Q3j55noL9L9
3343D7r9r9J9J9N3N3n1n1q8J50J7J6k6k6k6k6M2M1J59p8N0j88N0M9K1K0l9l8L1L2q7q7O4O4
3335a2n5n4j5j6J04J03j63j64J14J14M6M7p1p2k2k2J13j26MNj1j0l6l6K4K4M6M6n3n3L8L9
3327a24L9L8m5m6m6m6J0RJ88J87q1q2q0q1L2L3L2L3L4L5o4o4N1M9rqj26j26R3R3L4L4o5o6
3319a35M6M5n4n4OOOORQRQM8M7n0n1K3K3l6l7L2L1L2L1l6l5l6l5j0j0Q9Q9K8K9j09j11k9k9
3310b06P0P0j4j3j3j3m4m5J35J33n9n8n9n9K8K7l1l2Q7Q7j2j2j6j5j6j6k5k6L4L4J7J6J7J7
3301a2q9q9J1J0K2K1l8l7Q4Q5K6K4k4k4k5k5J5J5J5J5M9N0n0m9NOj20K78j00r9p6p5J00J00
3293a%Jj1j0O3O3j98L9MNPOn2n3LLO3O3MLJ9J9j31J05k7k9m8m9n9J80O0j75L2L1l3l3J06J04
$$ y = [-165, -204, -133, -61, 10, 82, 13, -55, 10, 75, -50, 61, -20, -101, -7, 87, 63, 38, -69, -176, -224, -272, -265, -257, -51, 155, 103, 52, 135, -20, -25, -31, 8, 47, -52, -151, -132, -113, -60, -7, -58, -109, -197, -47, -30, -14, -40, -66, -92, -118, -76, -35, 124, 46, 96, -92, -42, 7, 28, 48, 9, -29, 2, 34, -53, -140, -76, -12, -67, -121, -136, -152, -48, 55, -108, -272, -158, -44, 2, 49, -22, -94, -116, -138, -25, -151, -147, -142, -153, -163, -199, -235, -211, -187, -141, -95, -148, -201, -163, -124, -85, -47, -92, -138, -184, -230, -220, -211, -23, 164, 83, 1, -79, -160, -128, -95, -63, -30, 4, 39, -25, -89, -38, 11, 2, -6, -132, -258, -165, -72, -38, -4, -69, -135, -89, -44, -98, -152, -146, -140, -134, -128, -119, -111, -102, -94, -46, 1, -49, -100, -77, -54, -90, -127, -95, -64, -32, -1, -37, -72, -108, -143, -153, -163, -74, 15, 43, 72, -37, -148, -177, -206, -136, -66, -80, -93, -106, -119, -163, -208, -73, 60, 1, -57, -116, -175, -147, -120, -151, -183, -96, -9, -21, -33, -49, -64, -80, -96, -121, -147, -113, -79, -62, -46, -29, -12, -101, -190, -179, -169, -147, -126, -164, -201, -117, -32, -6, 18, -6, -30, -55, -80, -65, -50, -35, -20, 29, 79, 29, -20, -15, -9, -129, 149, 49, -50, -126, -201, -101, -1, -1, 0, -11, -21, 42, 105, -93, -54, -50, -45, -38, -32, -84, -137, -134, -131, -68, -5, -1, 2, 21, 40, -91, 14, -13, -42, -90, -139, -198, -18, 42, -133, -101, -70, -103, -136, -30, 74]
3284G4j05j07J12J11o2o1m7m7j40R8J03J02J0J1j97M0J11j25l6l7L3L3k6k7K7K6K7K7l1l0
3276a33J23J22k28RJ07j28J9J9NNl7l6p1J67L2L1n1n2l7l8M7M7J68o9j83N5J27j09L9L8J6
3269DJ8m2m2K5K4l5l5k8k9k8k8q0p9j5K24nmJ1J0k6k7k7k6P0P1P0P0j5j5j34j34K2K2l7l8
3260b88L9L8L8L8K8K8M3M1q5J51j16j16P8j60R3R3N7N8ok44j0rn5J84J63p4m4m4LLj01j01
3252b77l3K06J2J2j8j9J16j23L8L8K2K3j3j2j2j3J0J0J0J0M3M4p4p5J0J1m9m9L1L0L1L1N9
3244C0O1n9n7K2K2n1n1J30j07K7K6J2J3j05j07Q4Q4K4K3J2J2J3J2k1k1poj63P3P4j64K6K7
3236a12J2J1O5O4n3n5J3J3J2J3J3J1J3J3j7j6j7j7nnnnnnnnPQPP%%j%n6n5O3O4j11j10L11
3226F0q5MMk1k1n3n3O6O6L3L2q5q6MLMLQQQQj8j8M2M2L9L9p9p9OOOPk2k1k1k1K8K9K8K9j2
$$ y = [74, -31, -138, -26, 85, 23, -38, -85, -132, -272, -174, -71, 31, 41, 52, -145, -105, 6, -119, -155, -192, -159, -126, -152, -179, -152, -126, -99, -72, -103, -133, -10, 112, -116, -107, 0, -128, -109, -90, -85, -80, -117, -153, -224, -57, -25, 6, -45, -97, -134, -172, -125, -78, 90, 21, -162, -107, 20, -89, -50, -12, 4, 22, -20, -62, -37, -13, -48, -83, -111, -140, -168, -196, -276, -355, -370, -146, -151, -155, -144, -134, -160, -187, -214, -240, -170, -99, -29, 41, 26, 11, -123, -257, -235, -213, -250, -288, -249, -211, -173, -135, -107, -79, -36, 5, -80, 71, -45, -161, -83, -243, -150, -57, 0, 58, 52, -192, -202, -211, -266, -82, 81, 7, -37, -81, -78, -75, -176, -277, -310, -104, -92, -80, -98, -117, -1, -124, -86, -48, -26, -3, -16, -28, -40, -53, -43, -33, -23, -13, 30, 74, 0, -75, -65, -54, -103, -152, -121, -91, -60, -29, 30, 91, 32, -25, -3, 19, -32, -83, 47, -60, -33, -7, 5, 18, -87, -194, -110, -26, -2, 21, 33, 45, 58, 70, 49, 28, 21, 15, -148, -75, -1, -165, -139, -112, -100, -89, -24, 40, -13, -68, -55, -42, -30, -17, -4, 7, 20, 33, 16, 0, -17, -34, -39, -44, -49, -54, -59, -64, -69, -74, -67, -59, -52, -45, -45, -45, -46, -46, -102, -157, -94, -30, -141, -251, 60, -25, -21, -17, -38, -59, -112, -165, -99, -33, 0, 32, -53, -139, -135, -132, -128, -125, -117, -109, -101, -93, -111, -129, -87, -45, -6, 33, -46, -125, -119, -113, -107, -100, -122, -143, -164, -185, -157, -128, -100, -71, -83]
3216h3j2j2j1l0k9R0Q9m8m9m9m9m0l9Q0Q0j7j7j7j8J3J2J3J2P4P2m5m5m9m8m8m8k1k1k0k1
3207c51P5P5J5J5J06J05j3j3m1m2j01j01L2L3P7P7Q7j50M2M3N4N5J1J0j67O9L5L6M9M9k62
3200i1k6J6J6nK34j05j04r1r0M0M1n0J90J53q4j68P0j3j4PK44n5n4l9l9mnk0j9J38r8j59Q0
3192a04J4J3K9K9j0j0j1j0k1k1k1k2l3l3K6K6J66J66j31j31m6m7N2N3j17j18J26J26P6j60
3184a44k6k7J9J9P9P9q8q8N1N1%J%%n0m9Q9Q8o7o8rrKJO1O1p8p8K1K2L9M0k0k0Q3Q2K3K4l1
3175H3l2l1l0P2P3m1m1j20K75N3N3j65j63j05j05J11J12o8o7P8P7k1k1l4l4l4l5M6M5n4n4
3167a77N3N2N2N2R1R1j53j51o9J68J74J75nmM5j93k30Qkkk6k5k6k6j09j09J5K54o2o2m7m7
3159b95J28J28j95K02l8l8j4j3j4j4O0j78Q7Q7k8k8O2O2p7p8pqR1R2m2m2j16J22j2j2J02J01
$$ y = [-83, -95, -107, -118, -148, -177, -87, 2, -46, -95, -144, -193, -233, -272, -192, -112, -129, -146, -163, -181, -168, -156, -143, -131, -57, 15, -30, -75, -124, -172, -220, -268, -289, -310, -330, -351, -276, -201, -186, -171, -65, 40, 27, 14, -27, -69, -170, -271, -239, -206, -129, -52, 35, -115, -73, -30, 24, 79, 90, 100, -67, 2, 37, 73, 122, 171, -91, -117, -101, -85, -90, 144, 39, -65, -156, -246, -206, -165, -215, -25, 128, 44, -124, -54, -67, -81, -74, 170, 115, 61, 22, -17, -21, -26, -46, -65, 73, -25, -184, -104, -90, -77, -48, -19, -29, -39, -50, -60, -81, -102, -123, -145, -178, -211, -185, -159, 7, 173, 42, -89, -135, -182, -130, -77, -194, -312, -186, -60, 16, -144, -170, -197, -178, -159, -80, -1, -89, -177, -126, -75, -75, -74, -74, -74, -124, -173, -84, 4, -63, -131, -140, -149, -147, -146, -85, -24, -102, -180, -159, -137, -98, -58, -78, -98, -15, 67, 90, 114, 83, 51, 20, -10, 62, 135, 94, 53, -67, 208, 261, 314, 149, -14, -119, -224, -113, -1, -69, -136, -58, 19, -2, -23, -57, -91, -125, -160, -114, -69, -123, -177, -124, -72, -20, 32, 123, 214, 61, -90, -159, 9, 183, 358, 353, 349, 394, 201, -29, -21, -23, -25, -51, -76, -102, -128, -237, -346, -331, -77, -139, -201, -248, -295, -167, -39, -234, -32, -70, -108, -122, -135, -149, -163, -103, -281, -194, -107, -135, -163, -101, -39, -116, -194, -201, -209, -118, -26, -68, -110, -226, -104, -116, -128, -26, 75]
3152G5m6m5j44j45J10J11j37J01J39r6m8m8J32J31j80N7n4n5l9m0J19J18n8n9LMMLQPn2n2
3144a76O1O1KKj1j1j1j1p6p7K8K8J91m7l2l1l2l2m7m7J64p4p4J64m2m3j62P6M4M4N9N9L6L6
3135A9q2q3k8k8K25j3k3k3l8l8J9J9L4L4j09J27J29j10O1O0p4p3n6n6J8J8j42R7l8l8K1K0
3128a51K1K1n8n7O1O2o8o9qrR0Q9j5j5j24J14R9R8j13j15Q5Q3j21j21kkl8l9Q1Q1L7L6k3k4
3119a14L2L1q8q8M0L9J14j24j4j4k9k8J9J9MMK04l2j8j8kkJ31j05j59j60J59q0Q2Q2J40r5
3111g0j38j38M6M6K7K8K7K7O5O4n5n4l6l7Q4Q3m1m1m1m2lmmmL8L8L8L9q5q4J14J14n3n3OP
3103i2p3p3M6M6J18J16q2q0k0j9J00R9m6m6J2J3J2J2m7m8j09j10Q9Q8q4q5J15J14j5j5j5j5
3095i4oonom3m4P6P6rj0rj0p7p6J22J21RJ0j87j89O9P0J88J88j57j55M2M2QPPQn9n9n9o0K7
$$ y = [75, 29, -16, -160, -305, -195, -84, -221, -120, 19, -77, -125, -173, -41, 90, -90, -33, -87, -142, -181, -221, -102, 16, -42, -101, -98, -94, -90, -87, -79, -72, -124, -176, -115, -54, -52, -50, -61, -72, -83, -94, -170, -247, -219, -191, 0, -47, -79, -110, -142, -174, -221, -268, -104, -178, -252, -88, -130, -173, -335, -259, -215, -171, -112, -53, -17, 19, -63, -146, -174, -202, 23, 10, -13, -36, -74, -112, -93, -74, -40, -6, -115, 12, 141, 31, 92, 152, 78, 5, -51, -107, -89, -71, -213, -116, -154, -192, -171, -151, -130, -109, -167, -224, -163, -101, -169, -238, -246, -255, -165, -76, -91, -106, -230, -116, -17, 81, -32, -147, -62, 21, -100, -221, -223, -225, -263, -302, -221, -140, -103, -67, -90, -114, -82, -51, -139, -227, -187, -148, -34, -158, -172, -186, -215, -243, -224, -205, -201, -197, 7, -25, -43, -61, -63, -65, 66, -39, -198, -358, -199, -279, -197, -115, 25, -70, -208, -346, -300, -254, -227, -199, -172, -145, -80, -16, -71, -125, -161, -198, -114, -31, -72, -113, -154, -196, -199, -203, -207, -211, -173, -135, -97, -58, -143, -227, -113, 1, -52, -105, -99, -92, -165, -238, -192, -146, -28, 88, 6, -74, -94, -113, -13, 86, 40, -6, 6, 19, 31, 43, -4, -52, -161, -271, -182, -94, -178, -263, -148, -34, -49, -64, -79, -94, -100, -106, -111, -117, -160, -204, -128, -52, -61, -71, -80, -90, -167, -243, -121, 0, 9, 19, -168, -357, -288, -218, -30, 158, 1, -154, -112, -70, -62, -55, -48, -40, -99, -158, -217, -277, -250]
3086b50K7K6K7M2M2j8j8m6m7J53J51k9l0k9k9kkkkMMMMppQQj22J15M1M1q3q4k4k4P6P6J6J6
3076B6j8j7p8p7j1j1M9M9m0m0N9N9Q2Q2r5r5O6O6l3l1j8j8j8j8N4N3O9O9k78m1l6l6L0L0R0
3068g6Q8J1J0q7q9M0M1j9k0j9k0P9P9j65j67J72J70J2J1Q6Q6k06L2j00j02rj0N0N0L3L4Q3
3060G8j54j61P7K7K8n7n7j81K16M0L9l5l5ppopK3K2l7l7n8n8J20J21J0J0m9n0LKO3O2P6P8
3051I9j95M3N3N3RJ0n8n7n7n8j1j2M8M8K2K1p7p8R7R8q2q1K8K8M3M3j84N4O0N9N2N2ppo5o7
3042g6o1J76L0L1K24K25j32j32j32j32l6l6K3K3j4j4JJk15K2O8O8j0rj0rl4l4J04J04M9M9
3035A12p5p4k16K2R2R1K56J9J3J4j12j11j11j11J8J9n6J83K3K3j24j26q4J54J54q4J8J7l2
3028h8l1j59K39m5m4jkjkM5M4M5M3l2l2j67P2j2j3r7r7J03J04j45R3K70L3M3M2m9n0j83N5
$$ y = [-250, -223, -197, -170, -128, -86, -104, -122, -168, -215, -62, 89, 60, 30, 1, -28, -30, -32, -34, -36, -32, -28, -24, -20, -27, -34, -26, -18, -140, -25, 16, 57, -26, -110, -134, -158, -82, -6, 10, 26, 8, -9, -87, -164, -175, -186, -137, -88, -128, -168, -109, -50, 32, 114, 19, -76, -10, 56, 23, -8, -26, -44, -62, -80, -26, 27, 96, 165, -113, -154, -190, -226, -196, -166, -76, 12, 23, 33, -54, -143, -103, -62, -81, -101, -120, -140, -61, 18, -147, -314, -142, 28, 40, 51, 137, 223, 17, 49, -51, -153, -162, -172, -122, -72, -39, -5, 78, -76, -237, -160, -133, -105, -162, -219, -400, -184, -144, -105, -140, -175, -182, -189, -195, -202, -179, -157, -194, -231, -289, -347, -227, -106, -96, -86, -135, -185, -182, -180, -117, -55, 21, 99, -96, -53, 0, 53, 62, 72, 14, -43, -100, -158, -169, -181, -133, -85, -63, -42, -119, -197, -100, -2, -84, -165, -137, -109, -66, -23, -207, -153, -93, -34, 18, 70, 63, 56, -9, -76, -137, 39, 69, 100, 324, 549, 417, 285, 153, 21, -15, -51, -28, -5, -19, -33, -32, -31, -246, -224, -156, -88, -98, -107, -117, -126, -160, -194, -90, 14, 63, 112, 37, -37, -253, -231, -139, -48, 208, 227, 240, 254, 142, 31, -80, -191, -173, -154, -210, -27, -4, 19, -105, -231, -315, -161, -7, -91, -73, -56, -88, -119, -278, -39, -84, -128, -129, -131, -132, -134, -89, -45, 0, 43, 11, -21, -188, -116, -128, -141, -238, -335, -232, -128, -273, -180, 90, 123, 166, 208, 159, 109, -74, -19]
3020a9JKJJJ10j26j27J11j1j2m2m1J6K53J%q4q4L4L4PQk45pO9O8J57p9p6p5K9K9k5k6L4L5
3011g9k5k4k4k5P0P1K37JL13Q70J853m51j782n90k52k52LMO3O1o6o8o7o8L6L6L6L6l4l4l4
3003a85l3O3O3O3O2OOOOr6r7m7J90J39j00k5k4O6j70r7r7J11J10rqN6N6k6k8J02k93oK32j05
2995a09j04K9L0n5n4K76M0j30j30J07j31L9L8K3K3K7K7J2J2P5j60k8k8%%J20j19J77n8M5M3
2987C7J31j09K6K6Q2Q1R7j42j10j11o5o6O9O9O9P0j28j27J25j12M1M1K5K7j53j53J10J10Q3
2980D3j53K4K5J00j36klo9p0L4L5J44r5k0k0O2O2O1j75R7j40J57q1J67o9p0p0K7K7J46r1J37
2972H4r8nnJ89k06J6J6J3J4J48r1q9r1J46q9kjj7j6p0p0J83n5RQpoJ7J7m2m3M4M3N7j79J6
2964a62J6JJj6j7J03J02q0q1L8L8n0n0K17j78J31j04LLL5L4L3L5j70j70K8K8K6K6r4r3R4R5
$$ y = [-19, -18, -16, -15, -14, 96, -30, -157, -46, -57, -69, -111, -152, -136, 117, 118, 118, 34, -50, -16, 18, 25, 33, -212, -219, -150, -82, 75, -4, -80, -155, -126, -97, -122, -148, -114, -79, -104, -128, -152, -177, -107, -36, 201, 202, 515, 1385, 3238, 2787, 1005, 415, 163, -89, -86, -82, -19, 42, -24, -92, -159, -227, -191, -155, -119, -83, -117, -151, -185, -218, -155, -92, -29, 33, 39, 45, 51, 57, -39, -136, -183, 7, 146, 46, 21, -3, 63, -107, -204, -301, -190, -80, -89, -97, -41, 15, -11, -39, 63, -230, -236, -4, -109, -213, -184, -154, -209, -263, 13, 53, -77, -207, -100, -231, -192, -154, -131, -108, -81, -54, -42, -30, 45, -115, -143, -171, -171, -171, -51, -170, 7, -51, -6, 37, 168, 59, 85, 111, 193, 274, 371, 229, 119, 8, -57, -123, -54, 15, 84, 154, 26, -101, 24, -88, -47, -6, 19, 46, -107, -260, -150, -40, 43, -110, -86, -61, 39, -97, -99, -102, -171, -241, -207, -172, -28, -123, -143, -163, -101, -39, 22, -153, -56, -196, -39, -120, 47, -22, -92, -162, -135, -108, 38, -53, 84, -14, -19, -24, 165, -41, -25, -9, 4, 18, 166, 75, -14, -105, 41, -48, -50, -51, -68, -84, -154, -224, -41, -96, -87, -79, -86, -92, -75, -58, -100, -143, -99, -56, 1, -178, -162, -146, -145, -144, -160, -177, -74, 28, -52, -133, -95, -57, -107, -157, 60, -118, 13, -91, -88, -85, -50, -16, 17, 52, -118, -288, -260, -232, -206, -180, -274, -367, -273, -178]
2955a78k5k4O1O1j33J06L8L8o6o7P2P1m7m8O0O0m5m4j33J06R0R0p0p1j2j1P9P8j5j5k43J54
2948h3n5n5k8K11n7J80o0n8j9j9j74K23J%k5k6m2m1R8j40k00L56O2O4q6q4j64P4P5P3j50Q6
2940f3K8K7j41R8j11J28O3O3r9J38j59P8l1K08k26J71k34J60o0L36j80N9j16J23j75O4q3J55
2933B21j33J06k54J41n6J82j34K64k62J34j81K15k50J45l9J99k37J60q7J51j46K51j94L63
2927E59k43J54q6L11k95K61j73K24j54K44k71K86m10J46k21J77k31L25k01L55l50L65k73K83
2921G82j94L63l72L44k43L14k11L46l00M16k11L45l01K56l72N01l13M02k88M27k89M27k53
2916A576M61m32O00l78L37n17N16k88P46l28N47l89M85l99O34l15Q75m44P47k98Q94j08J242
2910E764m64P28o43J026r91J471K21K047m97J806R9L196P48M322J492O496L473J2609J2330
$$ y = [-178, -203, -227, -166, -105, -238, -132, -94, -56, -122, -189, -117, -46, -93, -141, -81, -21, -66, -110, -243, -137, -47, 43, -27, -98, -110, -121, -42, 36, 21, 6, -237, -83, -138, -193, -221, -10, -67, 113, 53, -5, -24, -43, -217, 6, 7, 7, -18, -44, -86, -127, -29, -169, -369, -13, 49, 113, 27, -57, -221, -147, -72, 1, -149, -63, -35, -8, -149, -51, -162, -34, 29, 92, -7, 131, -28, 50, 19, 227, 1, 172, -62, 98, 38, 374, 194, 253, 137, 260, 85, 149, 66, 221, 88, 194, -60, 81, 25, 207, 73, 337, 75, 209, 28, 243, -7, 138, 99, 298, 61, 221, 134, 285, 139, 390, 196, 559, 316, 470, 384, 695, 400, 661, 488, 712, 558, 802, 531, 817, 407, 553, 332, 509, 278, 603, 402, 757, 407, 772, 499, 782, 588, 951, 579, 923, 680, 994, 783, 1129, 829, 1245, 1034, 1379, 1078, 1334, 962, 1463, 1150, 1552, 1264, 1691, 1402, 1829, 1576, 2037, 1605, 2205, 1827, 2164, 1647, 2163, 1875, 2621, 2293, 2840, 2451, 2936, 2537, 3171, 2856, 3731, 3287, 4034, 3736, 4630, 4522, 5764, 5300, 6028, 5385, 6411, 5420, 6891, 7112, 9159, 8662, 10468, 10567, 13763, 14511, 18833, 20325, 26821, 30294, 42903, 55233]
2905E5233L8307P5919K66173J96526k70172k24714p2431k7867j2535o949m963k541k143r71
2902F872j210l26q82p15j112J15J15k89q45k49o47k72k72K05K05M6j91O2O2NNK1k18q4q4K0
2896C37K0P2P2l2l2j80N8j35J03j21J18k26J72n5n5j5j6j27J10l2K07j11Pj93K03p5J63j64
2889G3P4k98K57k3R7k33J63k59J37mK34J4J3j30j0j91L63NOk78J20k54J41k04J90o6J69k55
2882a49J41j12K84j42R7j81K15j91K05k21J73k11J83l42K13j14J23j65L89j39j9k70K84j29
2876g8J07k47J48o0L36k72J24j32J03r2J45k81J15j54M01l91L22j49Q7j98J96j49K47k69J29
2870a2j89K07j97J97j38R9k26J71O0J77j91K05j58Q0k27J69k19J78p1J67k43J53j45K51j24
2864b6J12j54Q2l06K49r9J39j58K38j18K78j71O8j60P6m4J94j10j08p3J64qK29q8M68L74R30
$$ y = [55233, 93540, 169459, 435632, 632158, 361986, 137272, 64841, 36974, 24439, 17490, 12527, 9986, 7843, 6872, 5662, 5336, 4454, 3739, 2627, 2742, 2857, 2568, 1723, 1474, 827, 555, 283, 488, 693, 739, 548, 610, 672, 677, 682, 703, 485, 401, 317, 337, 357, 429, 501, 469, 437, 257, 315, 180, 283, 162, 280, 54, 226, 171, 116, 101, 85, -42, 68, 36, 243, 132, 139, -54, 149, 74, 237, 73, 147, -151, 106, 83, 180, -53, 110, -149, -12, -16, 218, 232, 245, 115, 105, -86, 277, 282, 288, 10, 130, -124, 17, -187, 3, -63, 106, -149, -8, -120, 164, 22, 119, -62, 153, -38, 167, -54, 119, -92, 91, -251, -38, -152, -29, -194, 195, 56, 37, -233, 51, -78, 29, -218, -70, -130, 206, -66, 58, -74, 29, -63, 82, -199, -84, -238, 163, -228, 94, -55, 32, -166, 30, -119, 128, -141, -12, -201, 6, -191, 6, -132, -33, -259, -88, -28, 149, -42, 163, 5, 85, -142, 27, -192, -14, -85, 82, -161, -8, -153, 98, -26, 86, -68, 14, -292, -43, -142, -3, -161, 77, -41, 237, 66, 134, -26, 50, 6, 200, 90, -18, -91, 73, 65, 294, 206, 674, 1048, 1978]
2857A978Q27Q26j81p37j111n54l36r8l47N0q4q4j54Q3j39K56j37J01n3n3j75O2P1P2n9L39
2851C63j13J26qL89K35O32Q76Q76K55m60j216q18l17l16k92n4o9o8p8q0M0M0LLJ8J7r5J42
2844C1j09j10k3k4l8K00J05J05k12K6M4M4j%o4o6n0n1r9J39ONK0K0j15J25R0R0r2r3p7p7l2
2836b83l2K33oRRl2l1J03j35Q1Q0O5O6o4o4p9p9J50q7j4j3N6N7o3o3kkrrN8o2L23Q5m2k79
2827g5l4l4m1P8J29j07R9j37K34mr0q9J47q9K6K7J31j07R1j47R1R1K8K8R5j43Pj13O6j71P4
2820F1m4PQJ04J05r5r4K5K5J51q6J12pM6j93J01j37J61p8J12j27J19j19Q1l7Q2j57J60M1J82
2812E09k15L5k04K24j6J79o0O7j71O2n8K04j94K58K0K09j89K29j69j14j14K24j73J69o9O3
2806G06j75P7j60J21J21K16k3J72k25R5k4K27j1J39k57Q9Q9J83n5O0j78M5M4K39%J89J89N25
$$ y = [1978, 2805, 3631, 3450, 2713, 1602, 1048, 712, 614, 267, 317, 233, 149, -5, 78, -61, 195, 58, 159, 106, 53, -122, -60, 11, 83, 24, 363, 250, 376, 368, 757, 992, 1624, 2500, 3376, 3631, 3171, 1955, 1137, 820, 504, 212, 158, 89, 21, -57, -137, -97, -57, -54, -51, -33, -16, -111, 31, -78, -188, -211, -235, -273, -73, 32, 137, -75, -49, -5, 39, 38, 38, -26, -92, -142, -193, -292, -153, -147, -142, -122, -102, -217, -92, -2, 88, -4, -97, -174, -251, -283, -315, -82, -88, -79, -70, -102, -133, -30, -165, -84, -4, 61, 127, 63, -1, -80, -159, -9, -96, -110, -123, -67, -10, -73, -136, -138, -140, -149, -158, -100, -162, 161, 246, 204, -75, -109, -143, -184, -106, 23, -84, 15, -122, 112, 108, 18, -71, 76, -13, 13, 40, 171, 64, 155, 8, 99, 190, 218, 246, 341, 198, 205, 92, 158, -13, 61, 17, 24, 32, 136, 241, 146, 52, 77, 102, 253, 167, 279, 272, 318, 125, 226, 89, 250, 172, 284, 157, 276, 157, 238, 201, 283, 126, 286, 327, 509, 294, 329, 125, 349, 333, 512, 452, 519, 348, 410, 352, 556, 362, 620, 640, 849, 660, 889, 720, 606, 492, 716, 543, 712, 643, 706, 531, 608, 448, 569, 690, 906, 883, 1055, 830, 925, 901, 1128, 1117, 1256, 999, 1088, 1177, 1360, 1305, 1365, 1187, 1232, 1276, 1515, 1515, 1704, 1893, 2418]
2799B418J398J116j665j027m71Q8l2J41r9J48r1J36j01L52m5J89P0K24J05J48r0K35K35L03
2793C685L02N46N46P95K38J14k83j56Q3L96L96O34q1k20m58l83l83j35j35L3k04J83n6K0K1
2787E498J24J24K95K94K35K35K19K19L38L38M85M86O20O19J136J375J704J824J786P54K10
2782A8918P66J019J257J694J297R84K69R84K334L947N615P193Q386J1741K0083L9426Q3673
2778B09586J68474K17329J05838r6332k21313j81196r0995l9280j7691q397m504k994l085
2775C5440k687j644J83R62J201J054R35l14j506j398J381L336O116Q230J0376J2242J9630
2771I3537L6094P6210J63020K66527K12411j8992k39746k65086j55521p1714l2564j7550r304
2767C7322n728l559l559k973k417r21r20p62p61m19j611j734j338k45j119j650j651j054o58
$$ y = [2418, 3816, 4932, 3267, 2240, 1769, 1857, 1825, 1966, 1867, 2015, 1924, 2060, 1959, 2311, 2266, 2455, 2525, 2749, 2854, 3002, 2912, 3147, 3382, 3685, 3987, 4533, 5079, 5874, 6112, 6226, 5943, 5787, 5870, 6266, 6662, 7296, 7215, 6995, 6537, 6154, 5771, 5636, 5501, 5534, 5330, 5513, 5457, 5477, 5498, 5622, 5746, 6041, 6335, 6570, 6805, 7024, 7243, 7581, 7919, 8404, 8890, 9510, 10129, 11265, 12640, 14344, 16168, 17954, 18708, 18918, 19684, 20703, 21960, 23654, 24951, 25935, 26204, 27188, 29522, 33469, 39084, 46277, 54663, 66404, 86487, 125913, 209586, 378060, 595389, 701227, 604895, 383582, 202386, 111391, 72111, 54420, 46023, 41519, 38525, 35440, 32753, 31109, 31292, 32254, 33455, 34509, 35444, 35130, 33624, 32226, 33607, 36943, 43059, 51289, 61665, 73907, 93537, 129631, 205841, 368861, 635388, 847799, 828807, 589061, 323975, 168454, 96740, 64176, 46626, 37322, 31594, 28035, 24476, 21503, 19086, 18165, 17245, 16483, 15722, 15303, 13692, 11958, 10620, 10375, 9256, 7606, 5955, 4901, 4243]
2763D243l79l79O9j69k49k48N3j86RQJ14J13j64j64j72j71Q1j57NMM9M9j02j03p7p8k18J80
2756A961K39j59j27j27qqo6L31k6k6J67p2j32J07k5k5NNr9J39r9j00n4J83j0j0j2j3p2p2J22
2748A917J21K7K8l8L60P7P7o1o1p2L26J38L76K21K22M07O45O00J633L961Q965J2231K938j0454
2742B4584j1169n569k152r57m00l65L2r1r1L3M30L66J080J577K292R20r07k118j563j205l31
2737D396o3J75RM06L86O24R18J632K730O939J4124J4124k950j5898j2751n681k116p66o03
2733E635l65k55j8j81N8p2L25R7L35J22J22j46R2n7J81J07J07K7K8M3M41K18K17J94J93J49
2726G597J49K12M51P8L17J03L41M36M35K22M61M06O44K68N07L62P60O28O28O53Q91Q10J049
2721A8408Q30J069R27J484J572J970K335K574K609K608K480K876L478M827O081P907R645J3537
$$ y = [4243, 3864, 3485, 3554, 3385, 3136, 2888, 2941, 2755, 2764, 2772, 2886, 2999, 2835, 2671, 2499, 2328, 2409, 2252, 2257, 2261, 2310, 2359, 2257, 2154, 2077, 1999, 1781, 1961, 2200, 2041, 1914, 1787, 1779, 1771, 1705, 2036, 2010, 1984, 2151, 2079, 1947, 2054, 2029, 2004, 2009, 2014, 1915, 2054, 1955, 1855, 1801, 1984, 1974, 1964, 1952, 1939, 1867, 1795, 1917, 2038, 2065, 2093, 2055, 2415, 2492, 2569, 2508, 2447, 2375, 2701, 2839, 3215, 3436, 3658, 4065, 4710, 5310, 6943, 10904, 19869, 32100, 35038, 24584, 13415, 7846, 5694, 4737, 4337, 3972, 4004, 3913, 3822, 3855, 4285, 4651, 5731, 7308, 9600, 10520, 9613, 7495, 5932, 4727, 4396, 4333, 4508, 4517, 4923, 5309, 5933, 6851, 8483, 11213, 18152, 32276, 46400, 43450, 27552, 14801, 9120, 7004, 6238, 5635, 5270, 5015, 4997, 4816, 4874, 4802, 5127, 5224, 5559, 5681, 5803, 5657, 5749, 5692, 5873, 5980, 6087, 6114, 6142, 6185, 6626, 6844, 7061, 7255, 7448, 7597, 7746, 7958, 8409, 8487, 8804, 8907, 9248, 9684, 10119, 10341, 10802, 11208, 11852, 12120, 12627, 12989, 13749, 14377, 15005, 15658, 16549, 17359, 18408, 19238, 20307, 21234, 22718, 24290, 26260, 28595, 31169, 33778, 36386, 38866, 41742, 45220, 50047, 56128, 64035, 73680, 87217]
2716H7217K1010L6023N6945P8791R1306Q2171M8578L696k5468j6650K4081O8806R6061P7869
2713G30436J0606p1136j26762j40823j19266q2009m5827j9851j591J6760M7885Q7206O5272
2710C50900O8370Q6137n5818q4107m5263n8022k3944p619J6133K7628m2356m8921l4860m6403
2706A01855l3455j6723q382m429k126j499p85L42N81J305K021L640M673Q387J4345K9388N5047
2702A54185N8254L9427P4501J0394o4685k7270l1182j6962M784R152M2968r859n8743l2766
2699A52198m5839m2582k3617j0668o361l104k875j525j565n33j336l04m82P10P19M81q84j440
2694A0993k513j321j269l95p53l8m57o0l18P9l19P8k40jj23J15j93K05l22K34j07J3j98M0
2688C130o6J71j05M51J31L69K9r1m85q8m72p4m8P2j02J36j24J13J48J47%J20L5M33K66N05
$$ y = [87217, 108227, 144250, 201195, 279986, 371292, 453463, 502041, 505737, 480269, 463619, 487700, 556506, 652567, 730436, 741042, 669906, 543144, 402321, 283055, 201046, 155219, 135368, 133777, 150537, 198422, 285628, 350900, 419270, 505407, 449589, 365482, 320219, 262197, 238253, 230634, 246767, 274395, 232039, 183118, 148258, 101855, 68400, 51677, 43295, 38866, 36740, 35241, 34456, 34798, 35379, 36684, 38705, 42345, 47018, 55405, 69750, 99138, 154185, 212439, 251866, 326367, 336761, 272076, 244806, 213624, 196662, 201446, 210598, 253566, 243707, 184964, 152198, 106359, 63777, 40160, 29492, 23131, 20027, 17152, 15627, 14062, 13529, 12193, 11889, 11407, 12117, 12836, 13317, 12433, 10993, 8480, 7159, 5890, 5495, 4742, 4704, 4247, 4187, 3869, 3948, 3629, 3707, 3467, 3466, 3343, 3458, 3265, 3470, 3148, 3382, 3275, 3288, 3090, 3130, 3064, 3235, 3130, 3581, 3712, 4081, 4110, 4019, 3534, 3446, 2974, 2900, 2852, 2924, 2822, 2958, 2834, 2947, 3095, 3242, 3242, 3362, 3397, 3830, 4096, 4601]
2682D601R05J938K078J362J998J124j002j27N89K258L299K585M139J200l765k574l025k787
2678A4796N12M087N851N971L586o25l962m360k492P64L197L912J569k642n322n720m637j540
2673A2945J619K333J618L128p72l553k152k867k306p97l11P23p19j751j215j454j404q47l17
2669A901p8j16j17J8J8j04j04j04j04j30j29O9O9O2O2j37j37L2L2q7q7q2q2L7L7J77J77k2
2662A071k2o4o4o4o4o3o3N6N7ooj25j25J09J10r0q9L7L7L7L7M4M4p4p5MNMNj03j03R6R6K6
2653F75K7K6K6j61j61L7L8nnmnj8j8j7j8N3N3pon4n3O5O6O2O2n7n8llmlL5L6L5L5J4J4m5m6
2644F08j08j09J0J1J3J4J3J4K8K8J4J3Q8j51Q7Q8N6j82J2J1Q4Q5Q4Q4p6p6M4M3L00L00L64
2636A794O03M89M88K80M2l88l88L5L4J54J53q5l23k76n15o48m10j11j11QQN2j87PPl2l1J91
$$ y = [4601, 5506, 7444, 9522, 10884, 12882, 14006, 13004, 12877, 13466, 15724, 19023, 21608, 25747, 26947, 23182, 20608, 17583, 14796, 15308, 19395, 25246, 31217, 34803, 34178, 30216, 25856, 23364, 24128, 27325, 31237, 32806, 30164, 24842, 19122, 14485, 12945, 14564, 16897, 18515, 21643, 20871, 17318, 15166, 12299, 9993, 9196, 8885, 9608, 8889, 7138, 5923, 4469, 3065, 2218, 1901, 1823, 1707, 1590, 1608, 1626, 1522, 1418, 1314, 1210, 1080, 951, 1020, 1089, 1151, 1213, 1076, 939, 971, 1003, 916, 829, 747, 665, 702, 739, 916, 1093, 1071, 1049, 985, 921, 857, 793, 730, 667, 723, 780, 774, 768, 643, 518, 627, 737, 647, 558, 595, 632, 669, 706, 750, 794, 720, 645, 649, 654, 658, 663, 560, 457, 553, 649, 675, 702, 728, 754, 593, 432, 469, 507, 502, 497, 493, 488, 470, 452, 435, 417, 470, 523, 516, 510, 456, 403, 468, 534, 596, 658, 601, 543, 540, 537, 533, 530, 565, 601, 636, 671, 685, 699, 654, 608, 500, 391, 401, 412, 425, 439, 452, 466, 494, 522, 536, 549, 637, 486, 573, 661, 717, 535, 547, 558, 642, 727, 811, 895, 819, 743, 787, 830, 1130, 1430, 1794, 2397, 2886, 3374, 3654, 3696, 3308, 2920, 2955, 2989, 3143, 3296, 3211, 2888, 2612, 2097, 1449, 1039, 928, 817, 825, 833, 885, 698, 705, 712, 680, 649, 840]
2629H40M31K33K33L83J44k78k78p9q0LK41J07J06l47l48j48j49k46k46J8J8J06j31n7n7K3
2623D42K2l7l7N5N4J74J74K86K85K60K61j5m12p0p0O6O6J84J85j87j88l07l06k92k91j73j71
2617d2J21J22O2O2o4o4N5N4j2j2p2p1J5J6J6J6r6r6J72o6p6J62N8N8Q4j55l5l5K00l8k3k3
2609B93j05j05R3R4p0o9M9N0J0J0J0J0JJJ35j03J6J6j48R1J59p9p9J60P5j64j4j5MLLLllM2
2600C71M2l1k69O4O4M8M7j2j2m0m1J9K0MMMMJ4J5j05j06R9R9ooj46R1m2m2O6O6o9o8R8j40
2592A04N3N4j7j6J03J03j03j03k8k9j12J27qpn0m9P0O9j6j6M4M4l1l0l0l1k6k7k6k6K7K9K8
2583G4K8K6K6r3r3nmnnO6O7n2n1p0p0J28J28J7J7m3m3J5J5P4P4o6o6ooL2L2L2L2j07j06m7
2575e5m7O2O1O2O2J2J2q7q6L4L4L5L5L7L7j02j02kkjkR8R9j%q3q2k3k2N0N2qrL5L5j05j03
$$ y = [840, 1271, 1504, 1737, 2120, 2264, 1986, 1708, 1629, 1549, 1552, 1793, 1900, 2006, 1659, 1311, 1163, 1014, 768, 522, 540, 558, 664, 533, 476, 419, 442, 464, 427, 390, 445, 499, 673, 847, 1133, 1418, 1678, 1939, 1924, 1512, 1442, 1372, 1438, 1504, 1688, 1873, 1686, 1498, 1191, 885, 593, 302, 129, -42, 79, 201, 263, 325, 261, 197, 252, 306, 294, 282, 210, 139, 154, 170, 186, 202, 106, 10, 182, 116, 40, 202, 260, 318, 402, 247, 212, 177, 377, 339, 316, 293, 188, 83, 176, 270, 200, 131, 180, 230, 240, 250, 260, 270, 271, 272, 407, 304, 320, 336, 188, 279, 438, 359, 280, 440, 515, 351, 337, 322, 326, 329, 332, 335, 332, 329, 371, 413, 382, 113, 177, 241, 289, 336, 324, 312, 272, 231, 250, 270, 274, 278, 282, 286, 300, 315, 210, 104, 203, 302, 296, 290, 144, 235, 193, 151, 217, 283, 214, 146, 244, 104, 157, 211, 194, 178, 281, 384, 281, 178, 150, 121, 9, 136, 128, 121, 71, 22, 92, 161, 145, 129, 173, 217, 186, 156, 126, 95, 69, 42, 16, -10, 17, 46, 74, 102, 128, 154, 61, -32, -37, -41, -46, -51, 15, 82, 30, -21, -91, -161, -33, 95, 112, 129, 86, 43, 58, 73, 147, 221, 155, 89, 83, 77, 109, 141, 173, 205, 98, -8, -55, -102, -40, 21, 83, 145, 157, 169, 82, -4, 30, 64, 99, 134, 171, 208, 106, 4, 2, 0, -1, -3, 95, 194, 193, 193, 110, 28, 5, -17, 33, 85, 77, 68, 103, 138, 33, -70]
2566g0P6P6J8J7k3k2L7L7K6K6p4p3k7k7k8k7R4R6mmn7n6ML%%N9N9k5k6k5k6L8L8k2k2N5N4
2556A75nnp2p2J07J06j8j7M1M2n6n6j16j15L3L1L3L2K2K1l8l9q9r1M8M9m0m0O0N9J4J5J5J6
2548E0OOPOj2j3j2j2PQO7O7p4p3j4j3L6L6o3o3O3O3l5l6N9N8j%L4L5k5k5LKn7n7L8L7o2o1
2538b0k1k1J57J58q7q7q5q7M0M0L9L9l8l7O0O2j9j8j8j8m9m9N0M9POn3n2j3j3J25J26j2j1
2530A50p2p1qj0rrL5L7L6L7l5l5l6l4N8O0m0m1N3N3j24j26P1P1J2J2k6k5k6k6j2j2Q7Q6o3
2521A8o2mmjjjjJ3J2J3J2J5J7m3m3k0k0k0j9O6O5l3l3l4l3K6K6K8K7r1r2P0O9J29J29q1q0
2512A9L8L9r4r3K5K6m0l9Q0P9N0N0o9o9m4m4m4m4M6M6M6M5K9K8K9K9j38j39O0N9N2N2o7o6
2504f3n8n7O1O1R5R6k3k3r0r2J06J08o2o1o1o2O3O3O3O3j13j12OOL8L8L8L8mmmml0k9l0l1
$$ y = [-70, 6, 82, 100, 117, 94, 72, 109, 146, 172, 198, 124, 51, 24, -3, -31, -58, 36, 132, 128, 124, 67, 11, 15, 18, 18, 18, 77, 136, 111, 85, 60, 34, 72, 110, 88, 66, 121, 175, 170, 165, 93, 21, 128, 234, 216, 199, 240, 282, 226, 170, 54, -61, -28, 3, 36, 68, 90, 111, 73, 34, -55, -146, -98, -49, -89, -129, -69, -10, 4, 19, 34, 50, 56, 62, 69, 75, 63, 50, 38, 26, 33, 41, 108, 175, 101, 28, 14, 1, 37, 73, 10, -53, 10, 73, 38, 2, 61, 119, 118, 118, 152, 187, 162, 137, 140, 142, 85, 28, 66, 103, 41, -20, -41, -62, 95, 253, 166, 79, -6, -93, -53, -13, 26, 65, 27, -10, 50, 112, 93, 75, 57, 39, -10, -59, -9, 40, 47, 53, 0, -52, -65, -78, 47, 173, 161, 150, 78, 7, -1, -11, -20, -29, 6, 43, 79, 116, 81, 46, 10, -24, 34, 94, 54, 13, 66, 119, -5, -131, -60, 11, 23, 35, 9, -16, -42, -68, -80, -92, -5, 81, 18, -44, -48, -52, -53, -54, -55, -56, -43, -31, -18, -6, 9, 26, -17, -60, -80, -100, -120, -139, -73, -8, -41, -74, -108, -141, -115, -89, -61, -34, -125, -217, -147, -78, 51, 180, 99, 19, 57, 96, 2, -91, -66, -40, -80, -119, -39, 40, 90, 140, 71, 2, -42, -86, -130, -174, -128, -82, -36, 9, 38, 66, 95, 124, -14, -153, -93, -34, 18, 70, 3, -63, -121, -178, -117, -56, 39, 135, 112, 89, -1, -93, 13, 121, 59, -2, -63, -125, -62, 1, 64, 127, 14, -98, -92, -86, -48, -10, 28, 66, 62, 58, 54, 50, 20, -9, -39, -70]
2495g0P1P2P1P2j47j46N2N1n2n4O6O4m9m8J0J0L6L6k3k3p0p0j0j1kkJ18J16m5m4J4J4m4m5
2487h2J5J4J5J6J5J4O9O8l5l6k15K3K35kj10J28o6o5q6J51K01K02J37j02q6q7p8p8lmj22J16
2479A62N6j82R3R3J4k24M7M8L3L2k0k1NMk7L71J82J81K37j61m29j90r5r5q0p9O9P0K04l4Q0
2471C44Q0J70k28j13j12j8j8P1P2l3l3p0J67J29J28Q9l07k5k4k3k4k3k3N0N0J84J84N07P45
2464A896k5q98o13k16n7n6L8L9L9L9Q1Q1j18j17O4O5m0l9j39R9Q5Q5M1M1J70M08O25L86o81
2457A283o81j94M4j04j05P2j66j66P1J65J65J80J80j48j48j48j48ONNOR7R7Q2Q3J65p3l51
2450B74j12m7m7Q8Q7J5J4m5m5K42K42O59n6n57l18j24j24nK33j00r9j9j8mlj20J18j6j6K1
2443A18K2K1K1J8J8m2m2J70J70N1N1j15j15n6n5L3L3q6q6L3L3O3j75o0J78m5m5N9j78J4J4
$$ y = [-70, 1, 73, 144, 216, 69, -77, -25, 26, -26, -80, -14, 50, 1, -47, -37, -27, 9, 45, 22, -1, -71, -141, -151, -162, -164, -166, -48, 68, 23, -21, -7, 7, -37, -82, -67, -53, -38, -22, -7, 7, 76, 144, 109, 73, -142, -119, 116, 114, 4, 132, 66, 1, -85, 66, 267, 469, 606, 504, 418, 331, 253, 175, 172, 168, 46, 162, 218, 36, 129, 222, 236, 12, 59, 107, 140, 172, 152, 131, 136, 140, 113, 484, 666, 847, 1084, 923, 494, 304, 209, 114, 34, -45, 24, 94, 298, 264, 344, 424, 594, 366, 253, 141, 123, 105, 176, 248, 215, 182, 112, 279, 408, 536, 625, 318, 293, 269, 246, 222, 199, 176, 226, 276, 460, 644, 1151, 1896, 1871, 973, 360, 144, 87, 31, 69, 108, 147, 186, 267, 348, 230, 113, 177, 242, 202, 163, 24, 123, 208, 293, 334, 375, 545, 953, 1578, 1964, 1283, 602, 408, 452, 348, 243, 315, 149, -17, 54, 219, 384, 564, 744, 596, 448, 300, 152, 158, 163, 168, 174, 271, 368, 450, 533, 698, 625, 274, 162, 115, 68, 156, 243, 258, 272, 227, 182, 424, 666, 1325, 1269, 712, 394, 270, 146, 141, 374, 274, 175, 156, 138, 134, 131, 11, 129, 113, 97, 118, 140, 161, 182, 200, 218, 176, 134, 304, 474, 525, 576, 461, 346, 290, 235, 268, 301, 215, 129, 162, 195, 258, 83, 23, 201, 156, 111, 170, -8, 6, 20]
2436B0P0P0m9m9R6R6k3k3p7p8M2M1O0O0j38j37J07J08M9M8kkm7m7j12J27J86n3k2k3l7l7J07
2427C31J07M3j96J7J6O2O1L0L0L0L0k9k8k9k8n4n4O6O5JJJ20J19J2J3J2J2M9M9N0M9MMMMM
2419I77MMMqqqqO1O2O1O1O0O0O0O0M5M5M5M5L3L3L3L2P1P0P0P0O6O6J85J86J43J43K4K4K8
2410B899K8J47J48K65K65L55L55J45O21O32O31J065J064J442J919L063N128J0967K4153L8006
2405I3298O69l6765k4532j1537n022k938j507j190N58J650J889j952j714q59K52K63J057R38
2401A2558K049J419K212K828N211O791J5528L0740P3796O5593n7855p9144l3864j4571n515
2397B7776l648r47P10N317Q515P720J3366L5767J6900l1875l2380j4745o702k413j424L23
2393B2260J694N348Q146J0212K0619L7300J73l7480k5590r861l564J0R28L551N853J1653J6429
$$ y = [20, 90, 160, 111, 62, 158, 254, 231, 208, 131, 53, 95, 136, 196, 256, 118, -19, 88, 196, 245, 293, 291, 289, 242, 195, 83, 210, 396, 343, 321, 298, 261, 224, 331, 438, 481, 285, 302, 318, 380, 441, 471, 501, 531, 561, 532, 504, 475, 447, 393, 339, 405, 470, 471, 472, 592, 711, 723, 736, 748, 760, 809, 858, 908, 957, 961, 965, 969, 973, 977, 981, 985, 989, 981, 973, 965, 957, 1018, 1080, 1141, 1202, 1262, 1322, 1382, 1442, 1487, 1532, 1577, 1622, 1655, 1688, 1721, 1753, 1824, 1894, 1964, 2034, 2100, 2166, 2351, 2537, 2680, 2823, 2847, 2871, 2899, 2927, 3074, 3222, 3487, 3752, 4107, 4462, 4607, 5228, 5860, 6491, 7556, 8620, 10062, 11981, 15044, 20172, 31139, 55292, 93298, 93967, 57202, 32670, 21133, 16111, 13173, 11666, 10476, 11034, 12684, 14573, 12621, 10907, 10048, 10300, 10563, 11620, 12558, 14607, 16026, 18238, 21066, 26277, 33068, 48596, 79336, 153132, 218725, 160870, 81726, 47862, 33291, 27776, 24128, 23181, 23891, 29208, 37723, 45443, 58809, 94576, 111476, 79601, 47221, 32476, 25774, 23361, 21937, 22260, 23954, 29302, 37448, 47660, 68279, 105579, 105752, 68272, 42682, 32821, 29257, 29267, 30195, 33746, 39599, 51252, 67681]
2389F7681L3191Q0225J31462p643j32122q1347l6147j4738q939m416l065K098N355K266p186
2385B6675n588k807m06O27J444J046J938K057K928M438P162J1373K1669M6693J03416J17318
2381C39983n8449j37966o5745k8172j0298p041k096n87O451R232P984P866L2712L1680k3765
2378A01789m1639j9546j0251m292l418k81m2M208O194R838J6272M1075K3042l5494l8433j5808
2374C3214o832j301j062K111K986Q754J1535K1439M6622J00172K3515r9665p0512k9383j1986
2370B9607p126m345k856K43M120L087n959n084k250r00m43M32L67P65O65R04J464K816M165
2365A9672Q535J7173L7272L4898k4283m3587k2694j0143m503k979j787o26J361J931j643l252
2361E345j424r28n31m17j78j73j74j58j58n8n8n7n8o8o9rro5o4N5N6r3r3K7K6p2p1J26J27
$$ y = [67681, 100872, 181097, 312559, 304916, 172794, 91447, 55300, 40562, 31623, 27207, 24142, 26240, 31595, 33861, 26675, 21087, 18280, 17874, 18501, 19945, 20991, 22929, 24986, 27914, 32352, 39514, 50887, 72556, 119249, 222665, 339983, 281534, 143568, 77823, 49651, 39353, 32312, 30216, 29629, 36080, 45312, 53296, 61162, 93874, 125554, 101789, 60150, 40604, 30353, 26061, 22643, 22362, 22320, 26528, 32722, 42560, 58832, 99907, 122949, 87455, 49022, 33214, 26382, 25081, 24019, 26130, 29116, 37870, 49405, 70844, 117466, 217638, 241153, 141488, 70976, 41593, 29607, 22481, 18136, 15280, 15523, 19643, 22730, 16771, 11687, 9437, 8537, 8094, 8526, 8893, 9658, 10323, 11227, 12691, 15507, 19672, 28207, 45380, 82652, 117550, 93267, 49680, 26986, 16843, 12340, 9361, 7574, 6948, 8309, 10240, 8597, 5345, 3921, 2993, 2462, 2045, 1867, 1694, 1520, 1362, 1204, 1146, 1088, 1031, 973, 905, 836, 827, 818, 753, 689, 744, 800, 707, 614, 641, 667, 595, 524, 650, 777]
2354G77j22j21lkN4N3o5o5n1n0O8O9J6J6j03j03L1L1q9q8P9P9m0m0j33j34J45J45n1n0QRL4
2346C04L4k6k6o2o2N8N7n5n4O5O4K4K4l6l6POj13j13ONO4O5n8n8O1O1J4J5J5J5j8j7K05j91
2338B44l6l6o1o1L4L5k5k5O5O5n4n4N2N3J12J12j58j59l9l9J63J63j15j15K1K2K1K2J5J5m4
2330A93m4m5m5P4P5j%%%Q6Q7K7K6M6M5k87m9J2J1j72j72J32J31J46r1o0o0j5j5N1N0N1N1r0
2322A48q9N4K93P2P2J7M14K32m84k55k56r7r8K2K1J21J21O1O1J06J06j72j73noj99M0j6j5
2315I6M4M4J56q3J56J56L2k07j47R1n8n8P6P6M2M3J61J62N21N21m71p10l45N3k01L7J3J3J4
2308B27J3n9k96J00R9J26j12k30PJ41J42L8L8J41J41N1K90O24L85n38n38j87j86j72j72k2
2301E1K17l7l7J63J62J03J02k06k06q7q8K9K8K8K8JJJ05J06J72o7k10k10onN4N4K3K3K3K3
$$ y = [777, 655, 534, 531, 529, 583, 636, 571, 506, 455, 405, 473, 542, 558, 574, 471, 368, 399, 430, 341, 253, 332, 411, 371, 331, 198, 64, 209, 354, 303, 253, 261, 270, 304, 338, 312, 286, 224, 162, 220, 277, 222, 168, 233, 297, 321, 345, 309, 273, 280, 286, 173, 60, 66, 71, 135, 200, 142, 84, 145, 206, 220, 235, 250, 265, 247, 230, 435, 244, 208, 172, 111, 50, 84, 119, 94, 69, 134, 199, 145, 91, 143, 196, 308, 420, 262, 103, 64, 25, 188, 351, 236, 121, 142, 164, 185, 207, 222, 237, 193, 149, 104, 59, 133, 208, 207, 207, 207, 207, 293, 380, 407, 433, 479, 524, 237, 188, 200, 211, 39, -133, -1, 130, 276, 185, 125, 65, 50, 35, 86, 136, 187, 238, 148, 59, 113, 406, 478, 550, 567, 981, 1213, 729, 474, 218, 121, 23, 45, 66, 187, 308, 369, 430, 536, 642, 470, 297, 292, 286, 87, 127, 111, 96, 140, 184, 340, 257, 413, 569, 601, 394, 247, 338, 280, 222, 298, 374, 416, 459, 620, 782, 1303, 1824, 1353, 643, 298, 351, 150, 187, 200, 213, 227, 240, 181, -115, -15, 84, 210, 98, -132, -125, 16, 158, 196, 234, 375, 516, 567, 857, 1481, 1866, 1328, 790, 603, 417, 245, 73, 51, 268, 231, 194, 357, 519, 622, 724, 518, 312, 225, 137, 166, 194, 222, 250, 251, 252, 357, 463, 635, 568, 358, 148, 142, 137, 191, 245, 268, 291, 314, 337]
2294C37L10L09L00m15m68p1j41j40K1K1j12J24L2L2n8n7j01J35j2j3J49q9p4p3Q9R0R0Q9J35
2287D39J34Q0l17j32j31l7l6Q3Q4j93j94J06J06j3j3rrJ25j12J4J3jjj7j7j7j8qqN1N0L0L0
2279F2q9q9lkN7N7%j%jJ7J8L3L3j69O8Q2j55j34J04P4P4l6l4K4K4O9O9n1n0n6n7J36j01m2
2270f9m2LKqpPPj16J22MLj26J13Q3Q2J29j08r2r4n8n8O1O1k4k3R6R4p0p1M8M8l8l8K2K2o1
2261i6o2N8N8m8m8m8m7R0R0j09j09J67J66j10j11J1J1J31J29o3o3N5N6j22j24mnm1m2P8P7
2254g5j1j1j1j2M0M0R8R9j20j20kjj5j6j5j5M3M2M3M2K7K8K8K8l7l6l7l5l0l1Q8Q9l6l6K4
2245E7K4L5L5q5q3K9K9L0L0r5r3K4K5N4N5N5N5p2p2J27J27J7J7j03j02j16j15LLpqN2N2j6
2237c2j6j6j6l0l0R0Q8M8M9j1j1O1O2n7n7OOOOl6l6l6l7M0M0k0k0j09j10m5J93O0O0m4m4l0
$$ y = [337, 647, 956, 1256, 841, 373, 302, 161, 21, 42, 63, -49, 75, 107, 139, 81, 24, -77, 58, 46, 33, 182, 93, 19, -54, 35, 125, 215, 304, 439, 573, 653, 336, 204, 73, 36, 0, 83, 167, -26, -220, -114, -8, -21, -34, -43, -52, 73, -39, -25, -12, -13, -14, -31, -48, -65, -83, -91, -99, -48, 2, 32, 62, -27, -116, -119, -121, -64, -7, -7, -8, -8, -9, 8, 26, 59, 92, -77, -9, 73, -82, -216, -112, -38, 36, 0, -34, -10, 14, 83, 152, 101, 51, -5, -62, 74, -27, -69, -111, -108, -106, -114, -121, -114, -107, -223, -101, -97, -94, -220, -107, -24, 58, 187, 79, -13, -107, -165, -223, -162, -101, -125, -148, -52, 42, -28, -99, -51, -3, -41, -79, -57, -35, -96, -158, -100, -42, -90, -138, -186, -233, -143, -53, -162, -271, -104, 62, -48, -159, -148, -137, -6, 123, 60, -3, 52, 108, -14, -138, -142, -147, -188, -230, -152, -75, -86, -97, -108, -120, -80, -40, 58, 157, 37, -83, -85, -86, -101, -117, -132, -147, -104, -62, -19, 23, 50, 78, 106, 134, 97, 61, 24, -11, -41, -72, 16, 105, 69, 33, 57, 81, 116, 151, 66, -17, 12, 41, 71, 101, 6, -87, -63, -38, 16, 71, 126, 181, 109, 37, 164, 291, 308, 325, 222, 120, 4, -111, -108, -105, -112, -120, -68, -16, -32, -48, -64, -80, -110, -140, -50, 38, 86, 135, 124, 113, 174, 236, 179, 122, 128, 134, 140, 146, 110, 74, 38, 1, 41, 81, 61, 41, -68, -178, -223, -30, 30, 90, 46, 2, -28]
2228b8l1l1l0LMJ37r9k6k6P9P7P1P2m9m8M2M2p7p7r2r2K7K7J00J00mmj23J15Q5Q5k1k58po
2219f3o2o2N7N7L0L0m4m5J37r9L3L3L8L9q0q1nnN4N3K2K2L7k01O3O2J07J08q6q6k7k6PPn2
2211b8n3P2P1P2P2o1o0N8N8o5o5N4N4l5l6M9M9k25J70PPj5j5J04J04l5l4l5l4L1L2j18J21
2203B71J88n1jjj9k0M0M0K9K9Q8Q9K6K7J10J11J87n2j7j7J74J74K34K33J01J01K55K55K25
2196B809M63K55M93Q72Q71J185J582J949K981M730P351R381Q508K758n265r738r341o670m207
2191A0967k885j694j079j078p78p77m01m01q0q0j40j40k12k12k11k12j5j4j4j4j00j00%jJ6
2185C45J5J6J6j20j20NMJ03j35Q3Q3J39r9k38%J9J8M9M8j10J28o6o5k4k4l9l8J27j11j10J27
2177B6K5K6r8r9j7j6j7j7J26J26n3n1P2P3o6o5M6M8j2j1l3l2l3l3J17J19j40j39J54J54j04
$$ y = [-28, -59, -90, -120, -117, -113, 24, -75, -101, -127, -48, 29, 100, 172, 123, 75, 117, 159, 82, 5, -87, -179, -152, -125, -25, 75, 71, 67, -56, 59, 144, 229, 208, -50, -57, -63, -125, -187, -130, -73, -43, -13, -57, -102, 35, -64, -31, 2, 40, 79, -1, -82, -87, -92, -38, 15, 37, 59, 96, -105, -42, 20, 127, 235, 149, 63, 36, 10, 17, 24, -28, -81, -9, 62, 134, 206, 145, 85, 143, 201, 136, 71, 125, 179, 144, 108, 157, 206, -19, 151, 158, 165, 150, 135, 239, 343, 308, 274, 239, 205, 236, 268, 150, 271, 459, 408, 407, 406, 387, 367, 407, 447, 476, 505, 593, 682, 708, 735, 845, 956, 1143, 1091, 1074, 1057, 1231, 1405, 1639, 1872, 1973, 2074, 2329, 2584, 2809, 3272, 3527, 4020, 4892, 5763, 6948, 8530, 10479, 13460, 18190, 25541, 34922, 43430, 46188, 40923, 31185, 21844, 15174, 10967, 8082, 6388, 5309, 4231, 3453, 2676, 2275, 1874, 1794, 1714, 1574, 1434, 1222, 1010, 799, 587, 572, 558, 544, 530, 430, 330, 330, 329, 345, 360, 376, 392, 272, 152, 157, 161, 264, 129, 212, 295, 434, 335, 97, 97, 116, 134, 183, 231, 121, 249, 183, 118, 94, 70, 31, -7, 120, 9, -101, 26, 51, 77, -21, -120, -137, -153, -170, -187, -61, 65, 12, -39, 33, 106, 40, -25, 21, 69, 57, 46, 13, -19, -52, -85, 32, 151, 11, -128, 26, 180, 76]
2170G6j03j2j3M7M6k4k2l9l9J35j03J54J55K5k14K0K0J2J2q7q6P7P8L4L3j41R8j69O7k6k4
2162a3M8N0K1K1k12K6m8m9J16j23m2J96M7M7J8J7l2K06P9j61p1p0Q1Q2J57q2n9n8n8n8j60
2155h4P7J36j02N7N7n7n6j0j0N0N0N7N8q2q2K7K6K7K6K5K5l5l4k7k8k7k7j1j2M8M9l0l0J5
2146F6J4J04j35N9N9l1l1K9K9o3o4J1J1j03J34JJl1l1j65P4J05J07j8j7j2j2j3j2M2M3p7p6
2138bO0O1JKm2m2m1m2J8J8J7J8N9O0j%j06j05J3J3L9L9L9L9l8l8Q1Q1n3n3O7O6J51J52J51
2130F82J51j64j64J09L48N47P2k92k91l16J61K25M63N31k64q10l34j10J29K77L9k61k61p7
2124C90p8n2n3n2n2N7N7N8N7L5L5L5L5K68K68p5p4J21L59P08K30m87k49j75O3j13J24K14k63
2117A391l73l72J14J14k02k03mmm1m1m1m1n5n5J44J44Q4Q4K4K5K75K75K15K16o4o4M58K19
$$ y = [76, -27, -39, -52, -5, 41, 17, -5, -44, -83, 52, -51, 103, 258, 283, 69, 89, 109, 121, 133, 46, -40, 37, 115, 149, 182, 41, 139, -30, 37, 11, -13, 35, 85, 106, 127, -85, -59, -107, -156, -40, -163, -205, -9, 38, 85, 103, 120, 88, 294, 373, 212, 141, 71, 152, 234, 391, 309, 250, 192, 134, 76, -84, -7, 129, 27, 84, 141, 84, 28, 18, 8, 58, 108, 165, 223, 141, 59, 86, 112, 139, 165, 190, 215, 180, 146, 119, 91, 64, 37, 26, 14, 62, 111, 81, 51, 66, 80, 184, 49, 108, 167, 136, 105, 134, 163, 100, 36, 47, 58, -45, 89, 90, 91, 60, 29, -136, -62, 43, 150, 132, 115, 103, 91, 78, 66, 108, 151, 74, -2, 58, 119, 120, 122, 80, 38, -3, -45, -27, -9, 8, 26, 85, 145, 144, 144, 38, -67, -54, -41, -2, 37, 76, 115, 77, 39, 120, 201, 148, 95, 162, 228, 379, 531, 682, 833, 669, 505, 614, 962, 1509, 1581, 1289, 998, 682, 843, 1068, 1531, 2062, 1798, 988, 654, 544, 673, 950, 989, 728, 467, 390, 312, 260, 207, 155, 103, 160, 217, 275, 332, 367, 402, 437, 472, 740, 1008, 933, 859, 980, 1339, 2047, 2277, 1790, 1541, 1366, 1429, 1316, 1440, 1654, 1391, 1018, 646, 760, 874, 672, 469, 465, 461, 420, 379, 338, 297, 242, 187, 331, 475, 559, 643, 667, 692, 967, 1242, 1457, 1673, 1609, 1545, 2003, 2222]
2110B222K53P29r5r4j06n02l04R3j1j1l43l44l76l76r7r8p4p5j4j5j05j04j%J20j18J5J6O
2103A91OONj2j3j47R1j9j9P0j68l4l4P0O9m1m1J9J7J22J21LKp8p8J06J05J33j05K9K8r1r1
2095B22J08J07l8l7K2K1L0L0j04J34j4j3K24j72n4n4M0M0r7r8K2K2L8L8ppq3J56r7r8nnnn
2086B61P7P7P7P7j9j9k0j9RJ0O8O9O5O4m0m0r0J47K9K8M9K88j25j25J13J14onl2l1l1l1K4
2078A013K3K4K3N8N7o1o2O8O8O7O8M9N0p0o9Q6Q7Q7Q7L1L0L1L0J30J30o8o9J41J40n8n8j9
2070B044j8J01J01kkJ18J17N8N8N8N8O9O9O9O9Q6Q7l3l3J63J63J63J63J53J54L4L4K01K02
2063D504K01K02P7P8J96J97J95J96J96J95K33K33K33K33L53L53J90M28O66J89L53L54P09P09
2057A1473Q28Q29N30N31N90J066J457K251K121K122K231L661N835J0761K1257M1435K6679
$$ y = [2222, 2475, 3204, 3109, 3015, 2909, 2407, 2103, 2196, 2185, 2174, 1831, 1487, 1111, 735, 638, 540, 466, 391, 377, 362, 257, 153, 152, 152, 272, 154, 169, 185, 191, 197, 203, 208, 196, 183, 36, 127, 108, 89, 159, -9, -43, -77, -7, 62, 21, -20, -1, 16, 138, 259, 262, 264, 186, 108, 214, 319, 452, 347, 376, 404, 313, 222, 330, 437, 399, 362, 384, 405, 435, 465, 361, 495, 481, 468, 692, 520, 466, 412, 452, 492, 395, 297, 319, 341, 379, 417, 410, 403, 320, 476, 379, 281, 276, 271, 266, 261, 338, 415, 492, 569, 550, 531, 511, 492, 501, 511, 579, 648, 713, 777, 737, 697, 607, 754, 783, 811, 860, 1148, 1023, 898, 1011, 1125, 1119, 1114, 1082, 1051, 1020, 989, 1013, 1036, 1060, 1083, 1141, 1198, 1137, 1075, 1143, 1211, 1278, 1346, 1395, 1445, 1375, 1306, 1392, 1479, 1566, 1653, 1684, 1714, 1745, 1775, 1905, 2035, 1967, 1898, 2039, 2179, 2121, 2063, 2044, 2026, 2127, 2228, 2226, 2224, 2342, 2459, 2517, 2575, 2633, 2691, 2760, 2829, 2898, 2967, 3053, 3140, 3107, 3074, 3237, 3400, 3563, 3726, 3879, 4033, 4067, 4101, 4302, 4504, 4705, 4907, 4984, 5062, 5258, 5455, 5650, 5846, 6042, 6237, 6470, 6703, 6936, 7169, 7522, 7875, 8065, 8493, 9159, 9348, 9701, 10055, 10764, 11473, 12301, 13130, 13660, 14191, 14781, 15847, 17304, 19555, 21676, 23798, 26029, 29690, 35525, 46286, 67543, 108978, 135657]
2053A35657k2732k1158J562K5095O8468J18397M2930o5682q4587m1458R224N9706J06893P1625
2050D03940r6306j31358n7164j5939J6312M1493M794n5627m3393k2084r215n561j271k026
2046B6595n96j836q9p84O46L1J460J89J620J060L126L027N410O581J3731K4019N4363N4954
2042A93507j1614k8932J1581P3299J29383l338p6263k0168j5560J7525M339l13K7172n9972
2039B40646p8877k5143O157J6483j7358l7818j3192J4651K6567r777k3282o938J2605L7354
2035A42078Q5176P1333j2711o4856n0398n674M1194R3787J17778j8677j20835l2735L5105
2032B80565J3755N971K9708O036P8046J0206j12975o1976k5355J6747K6191k3220l122l9187
2029B01390p5374l0729l005J1134k658l0461k4722r311o095k441o54n578n172j518J263L646
$$ y = [135657, 112925, 91767, 93329, 118424, 186892, 305289, 348219, 282537, 197950, 156492, 165716, 225422, 332315, 403940, 307634, 176276, 119112, 103173, 119485, 160978, 165772, 110145, 66752, 44668, 35453, 29892, 28621, 26595, 25999, 24163, 24074, 23290, 23936, 23967, 25427, 25616, 27236, 28296, 31422, 34449, 39859, 46440, 60171, 84190, 138553, 193507, 181893, 152961, 164542, 237841, 367224, 363886, 287623, 267455, 251895, 269420, 273759, 273446, 300618, 240646, 161769, 136626, 142783, 159266, 141908, 104090, 90898, 105549, 132116, 122339, 99057, 92119, 104724, 142078, 227254, 298587, 285876, 221020, 170622, 164948, 206142, 299929, 417707, 399030, 278195, 245460, 280565, 294320, 300291, 329999, 336035, 414081, 424287, 311312, 249336, 223981, 240728, 266919, 243699, 240577, 201390, 126016, 95287, 92282, 103416, 100758, 70297, 45575, 36264, 30169, 27728, 27074, 21496, 16324, 14806, 16069, 19715]
2025A9715j309m963k461l95R40L323M237R00k781m528k006O94L257N322L594n144o722k431
2020I242l47J719M528M053k144m845k252P66N345N821m179m178j031n54J869n14j011J055
2016A3343l339l816j279J51J470l58k150j117m44k06k16k16RQn1n0l6l6j85N3N6j81j52j52
2010A106J33J33o5o5KKj18j17p7p8J16j22jjM4M4j22j23llj2j1j1j2lmmmJ8J8J7J8l2l1l2
2001F00l2rrqrl3l2r2r2R7R8k2k1J1J2K7K7j27J12J12j27j4j5l0l0N9N9o1o0p9p9J74o4M9
1993C92N0k5k5N3N3o6o6L8L8L8L8l8l9l9l9k6k6k7k6n6n7M9M8M1j97N7N6K0J9J9J9n0n0O9
1985B45O9m3m3P6P7P5P4m4m4nmj54Q5J10j29K0K0k4k5k4k4M2M3M3M3n0n0O9O9o3o3llL8L8
1976D41L8L8K66K65r1r2K5K4M27M27K51l05m30m29K57K57M75K37j19o75l03l03J4K52q1q1
$$ y = [19715, 18406, 13443, 10982, 10587, 11527, 14850, 19087, 19987, 17206, 12678, 10672, 11366, 14623, 19945, 23539, 18395, 11673, 9242, 8895, 10614, 15142, 19195, 17051, 12206, 9954, 10720, 16065, 21886, 17707, 13529, 12498, 11944, 13813, 13299, 12288, 13343, 10004, 6188, 4909, 5060, 6530, 6172, 4022, 2905, 2461, 2255, 2039, 1823, 1832, 1840, 1789, 1739, 1703, 1667, 1482, 1535, 1591, 1410, 1258, 1106, 1239, 1372, 1307, 1242, 1244, 1246, 1128, 1011, 934, 856, 972, 850, 849, 848, 892, 936, 814, 691, 688, 685, 673, 662, 651, 639, 636, 632, 628, 624, 642, 660, 677, 695, 663, 632, 600, 568, 559, 550, 542, 533, 500, 468, 376, 284, 381, 479, 457, 436, 447, 459, 486, 513, 386, 498, 610, 483, 469, 454, 424, 394, 453, 512, 451, 391, 312, 233, 407, 343, 392, 442, 417, 392, 445, 498, 432, 366, 404, 442, 480, 518, 480, 441, 402, 363, 337, 311, 284, 258, 202, 145, 194, 242, 283, 86, 143, 199, 219, 238, 257, 276, 226, 176, 245, 314, 271, 228, 304, 381, 456, 530, 486, 442, 437, 433, 279, 364, 474, 345, 365, 385, 361, 336, 312, 288, 330, 373, 416, 459, 409, 359, 428, 497, 434, 371, 368, 365, 403, 441, 479, 517, 783, 1048, 957, 865, 890, 914, 1341, 1768, 2019, 1714, 1284, 855, 1112, 1369, 1844, 2081, 1962, 1287, 984, 681, 695, 947, 866, 785]
1970G85k48k48o5o4J54q5N0N0k8k8k8k8L4L4J68p0o5o6L9L9oooo%JJ34J35J5K53L43n4o5o6
1962A002L37N76K37l18j10j10K9K9K9K9j74j75n6n5j9k0j53Q4L56L55p7l14l15p7J87J86N32
1955A995J34o20o20nK33R9R9j49j49M9M9KJJKO13O13m59m59k7k6J37k60o0o0j90j89j01J38
1948G91J8k20j69j69J5J5q0q0k0k0J08J08j2j1j18j18O6O6J63p6j40j39M4M4M5M4j0j0k5k5
1941H5Q5j53R9J00j26j25P1P3J05J05j73j72Q4Q5Q5Q6p6p6p5p6k9k9l0l0N3N3ppO3O4m0m0
1933C2j08J28nnn6n7P6P7j64P2P2P3j79N8p4p5Q9Q8M5M4j92M6L0L1J1J1J1J1k2k2L7L7j19
1925Aj18J%J16J17kko1o0j6j6J53q5q3J53J7J7q7q6N8N8j35J02m2m4k8k9J08J09q9q8j1j1
1917h3j0j1K7K6M2M0j29J06j59P7M8M7O3O3m2m2m3m1l5l5l5l4R2R1m0m2K45Qj21j20r8J40
$$ y = [785, 537, 289, 224, 160, 314, 229, 279, 329, 301, 273, 245, 217, 251, 285, 453, 383, 318, 252, 291, 330, 324, 318, 312, 306, 306, 307, 441, 576, 591, 844, 1187, 1133, 1068, 1002, 1339, 1915, 2152, 1834, 1724, 1614, 1643, 1672, 1701, 1730, 1556, 1381, 1325, 1270, 1251, 1231, 1078, 1162, 1518, 1873, 1796, 1482, 1167, 1090, 1277, 1463, 1995, 2129, 1509, 889, 884, 1117, 1216, 1315, 1166, 1017, 1066, 1115, 1117, 1118, 1119, 1121, 1734, 2347, 1888, 1429, 1402, 1376, 1513, 1253, 1193, 1133, 943, 754, 653, 791, 809, 589, 420, 251, 266, 281, 201, 121, 101, 81, 189, 297, 285, 274, 156, 38, 104, 170, 333, 257, 117, -22, 22, 66, 111, 155, 145, 135, 110, 85, 170, 17, 116, 216, 90, -35, 36, 109, 214, 319, 146, -26, 58, 143, 228, 314, 238, 162, 87, 11, -18, -47, -77, -107, -54, -1, -8, -15, 48, 112, 72, 32, -76, 52, 47, 42, -14, -71, 5, 82, -82, -10, 62, 135, -44, 14, -60, -135, -46, 42, 87, 131, -61, -15, 15, 46, 57, 68, 79, 90, 68, 46, 83, 120, 1, -117, -116, -116, 0, 117, 115, 113, 52, -8, -24, -40, 113, 28, -55, 98, 115, 132, 45, -41, 17, 75, -60, 42, 0, -44, -72, -101, 7, 116, 27, -61, -72, -83, -93, -104, -77, -51, -9, 31, -98, 8, -151, -74, -26, 21, 84, 147, 105, 63, 20, -21, -56, -91, -126, -160, -68, 23, -17, -59, 186, 194, 73, -47, -145, -5]
1909eNPN5N6o3o2ooj40R9n3n3Q1Q1P0P1j28j26P5P4J5J5j4j4J20j19j32j33J99l9j1K27J9
1901A65J9m3m3J7J7j3j3KKj27J09k4k4k1k2k1k1m1m0J57J59l3l3J2J1J03j36kko7o7N1N1k3
1892E9k3k2k2N3N4o5o5KKKKJ4J3J4J4L9L9q0q0k5k5R4R3m9m9n0n0M5M6M4M6k4k4k3k4K5K4
1883B4K4K5J0J0J0J0m7m6m5m6L9L9L9M0K3K4l6l6r1r1K7K7m3m2P6P6J6J7J7J7o9o9p0o9J17
1875i3J15P7j60j70K26j2j1L3L4q4q5N7N7lkn2n1O8O7r3r5K4K5K6K7K7K7j28j27P1P2J6J7
1867a00J6J7n6n6O3O3k9k9O5O5K29j68o4o3J%JJJ6J7J6J7rrrrn7n8KKj14j13Q5Q5K1K0K1K0
1857a00Q9Q8l0l1k8k9L0K9p7p8M2M1%%j%K1K1r9r8N8N7kkMMn5n6P1P1J1J1j48j48N1N1M7M6
1848a39p2p2O3O2MLm5m5P4P4M7M7p0p1k8k7R2R2o8o8N1N1JJn9n8L2L2L2L2J3J4J3J4P3P3m6
$$ y = [-5, 0, 7, 62, 118, 55, -7, -13, -19, -159, -60, -113, -166, -85, -4, 66, 137, 9, -117, -42, 32, 47, 62, 48, 34, 154, 35, -97, -230, -31, -70, -81, 146, 165, 184, 141, 98, 115, 132, 119, 106, 108, 110, -17, 92, 68, 44, 23, 1, -20, -41, -82, -122, 35, 194, 161, 128, 140, 151, 254, 118, 116, 114, 47, -20, 31, 82, 59, 36, 14, -8, 45, 99, 34, -31, -29, -27, -25, -23, -9, 4, 18, 32, 71, 110, 30, -50, -75, -100, -6, 87, 38, -11, -61, -111, -66, -20, 24, 70, 46, 22, -1, -25, 0, 24, 48, 73, 83, 93, 103, 113, 66, 20, -25, -71, -32, 7, 46, 86, 109, 133, 97, 61, -30, -121, -94, -67, -110, -152, -76, 0, 16, 33, 50, 67, -2, -71, -141, -210, -93, 22, 99, -61, -231, -5, -17, -28, 5, 39, -45, -130, -73, -16, -19, -21, -73, -124, -56, 11, -82, -177, -153, -128, -102, -75, -48, -21, -149, -276, -205, -133, -117, -100, -84, -67, -123, -179, -116, -53, -82, -111, -46, 19, 248, 80, 16, -47, -46, -46, -45, -44, -28, -11, 5, 22, 13, 4, -5, -14, -71, -129, -127, -125, -239, -352, -267, -182, -161, -141, -120, -100, -11, 77, 47, 16, -12, -41, -11, 18, -59, -137, -95, -54, -54, -54, -55, -55, -34, -13, -112, -210, -152, -95, -97, -99, -95, -91, -146, -202, -131, -60, -49, -38, -186, -334, -283, -232, -185, -139, -211, -283, -220, -158, -154, -151, -196, -241, -167, -93, -46, 1, -69, -140, -168, -195, -103, -11, -79, -147, -96, -45, -44, -43, -102, -160, -128, -96, -64, -32, -19, -5, 8, 22, 95, 168, 122]
1839A22m5q6q7L3L2o0o1jjJ6J6J5J6k3k2k3k3l1l0Q8Q9l2l2l2l2N3N3pom8m8P2P1N6N7o1o2
1830f4p0o9M9N0k2k2k1k2K0J9K0J9QQO8O7QRr6r6r1J47m7m6M6M6J20j16j2j2L3L3M0M0p8p8
1821a12N3N3o6o6J06J06j3j2j1j0o9o9m4m4J6J6qpq2J56LMn6J81m4m5k9l0P8P8m0m1j02j02
1813b52J7J7R1R2k7k8O9O8n0n0J50J51j12j13j86N1q3q2N7N7J17J16j13j15NNN3N3j46j45
1806c33N9O0N9O0Q4Q4l5l5NMK0J9j99L8L8L8j53Q6J1J1K5K6K6K5j3j2p3p3p6p7M3M3K2K2L7
1797a34L7j39R9l5l5M3M2M2M3M5M6M6M6p0p0rj1r8r9K1K1r8r8J01J01j0j1j1j0N2N3o7o6J17
1789a16J16jkj5j4j4j5QQQQk0j9j9k0r0r0ooj09K89n5n4J8J9J9J9J0J0J29J28j9k0j38j39
1780a92L1L1L2L1l9l8l9l8J10J09q9q9m3m3J56J54rro7o9o7o7N2N2m6m5P4P4L2L2q8q7LML
$$ y = [122, 77, -9, -96, -63, -31, -91, -152, -153, -154, -138, -122, -107, -91, -114, -136, -159, -182, -213, -243, -155, -66, -98, -130, -162, -194, -141, -88, -95, -101, -149, -197, -125, -54, 2, 59, -2, -64, -134, -203, -154, -104, -126, -148, -169, -191, -171, -152, -132, -113, -105, -97, -29, 38, 46, 55, -41, -137, -228, -81, -128, -174, -128, -82, 38, -78, -90, -102, -69, -36, 4, 44, -34, -112, -59, -6, -72, -138, -32, 74, 61, 49, 38, 28, -41, -110, -154, -198, -182, -166, -174, -181, -263, -107, -104, -100, -156, 25, -19, -64, -93, -123, -45, 33, -7, -48, -150, -252, -235, -218, -127, -35, -62, -90, -21, 47, -3, -53, 97, 248, 136, 23, -163, -112, -195, -277, -220, -163, -46, 70, -43, -158, -153, -148, -95, -42, -188, -333, -274, -214, -155, -95, -11, 73, 38, 3, 8, 12, 32, 51, -148, -110, -72, -34, -187, -101, -90, -79, -54, -28, -2, 23, 10, -2, -75, -148, -224, -301, -258, -215, -193, -171, -134, -97, -236, -137, -172, -207, -164, -122, -80, -37, 8, 54, 100, 146, 76, 6, -3, -14, -112, -211, -190, -169, -267, -365, -264, -163, -173, -184, -195, -205, -153, -100, -167, -233, -116, 0, -1, -3, -18, -32, -46, -61, -53, -45, -37, -29, -49, -68, -87, -107, -197, -287, -293, -299, -408, -119, -174, -228, -210, -191, -172, -153, -143, -133, -4, 124, 105, 85, -53, -192, -161, -130, -98, -67, -106, -144, -183, -221, -111, -2, -91, -180, -223, -266, -110, 44, 35, 26, -41, -110, -177, -244, -192, -140, -186, -231, -157, -83, -51, -19, -107, -194, -191, -187, -184]
1772a84MQ5Q6j13j13k3k2R6R7j19j20%%L9M0L9L9J7J7J7J7j0j0j0rK0K0K0K0k3k2k2k3k2k3
1763a95k2k3pqpqL4L3k6k6LMJ07J08Q0j55k3k3kjkjkkjkm9m8m9m9L7L7K2K2J47r0j7j6J06
1754a14J07j3j3p7p7M2M3K7K7r2r2N3N3o6o7L6L5J54q3O3j75O3O3K9L0J03j33j%j5j5popo
1745a31j16j15O8O8J94m3j08j09Q1Q0l9l8noK19j79ppK8K8o5o6M0L9M9j90O4O4j4j4M5M5n
1737a45nnnK9K9J3J4P8j59J09j30J9K0j1j1J13j27QQppppJ4J5J5J4n6n6M8M9J54q2OOk13K5
1728b47P4P5Q5j53j9k0L8L8r6r6K05l4j9j9L2L2j61P6k9k9J04J05J9J9j15J23p8p8o3o4M6
1720b49M7M6M6j4j4j3j4j7j7p7p7P9P9m0m0O1O1n9n9P3P2P3P1j07j07J1J2m2m1J8J8N7N6P2
1712c5j67o0n9J24J24r5r6L9L8p3J65k8k8n0m9R9j39K9K66q0q0k4k3rqp9J60K6K6o4o3P0j67
$$ y = [-184, -180, -95, -9, -122, -235, -258, -280, -184, -87, -206, -326, -326, -326, -287, -247, -208, -169, -152, -135, -118, -101, -111, -121, -131, -140, -120, -100, -80, -60, -83, -105, -127, -150, -172, -195, -217, -240, -247, -255, -262, -270, -236, -203, -229, -255, -252, -248, -141, -33, 47, -108, -131, -154, -156, -157, -159, -160, -162, -164, -165, -167, -216, -264, -313, -362, -325, -288, -266, -244, -97, -187, -204, -220, -114, -7, -20, -33, -110, -187, -145, -102, -75, -48, -140, -232, -179, -126, -192, -259, -223, -188, -34, -117, -54, -229, -166, -103, -74, -44, 59, -74, -75, -75, -90, -105, -112, -118, -125, -131, -247, -362, -294, -226, -32, -75, -183, -292, -211, -131, -170, -208, -213, -219, 0, -179, -186, -193, -165, -137, -202, -268, -228, -189, -140, -330, -266, -202, -216, -230, -185, -140, -145, -150, -155, -160, -131, -102, -89, -75, 3, -156, -47, -177, -158, -138, -149, -160, -47, -174, -166, -158, -165, -172, -179, -186, -172, -157, -142, -128, -184, -240, -192, -143, 11, -71, -65, -59, -272, -247, -173, -98, -13, -166, -185, -205, -167, -129, -225, -321, -116, -150, -169, -188, -156, -124, -285, -209, -238, -267, -163, -58, -39, -20, -135, -12, -90, -168, -231, -295, -249, -202, -156, -110, -124, -138, -151, -165, -182, -199, -276, -353, -274, -195, -235, -275, -214, -153, -212, -271, -198, -126, -53, 18, -89, -196, -185, -173, -215, -256, -238, -220, -163, -107, -35, -202, -262, -321, -197, -73, -168, -264, -225, -187, -260, -95, -123, -151, -201, -250, -151, -290, -261, 5, -75, -155, -179, -202, -211, -219, -298, -138, -112, -86, -150, -213, -143, -310]
1704c10M0M0K5K5m2m1m2m2J39J40j24j24m2J96n7n7J04J04j5j5K0K1l9l9K6K6r4r3R9R9no
1696h3r9J39j15j14k1k0M0L9j8j8r2J46N0M9K9L0j96K01N2N2k06L1J6J7o8o8qqK0K1r9r9J07
1688b93J07k26J2R3R3M8M9N0N1j33j33p6J62l1l2L6L6L5L6j10j09Q9Q9k7k6k7k7J6J5L1L0
1680a72p9J59K4K5o2o2o2o2J12J11q7q6L7L7L7L8j06j06R4R3J8J9q6q5j02J36KKJ0J0J0Rl5
1672b09l5k0k0l0K08m5m5m4m4P5P5k1k1L9L9r0r1J09J08p0p0M8M9L1L0k9k8j1j0j30j29O5
1665c16O4O5O5j19j19%JN7N8N8N8k4k4k5k4K9K9j06J33rqOON0M9p0p0K2K2r8r7J34J33n0n0
1656a70j81N8k6K12J45r1j36J01K0K0k48J49JJp8p8p8J60l4l3l9l9O5O5J66p3j3j3J24j14
1649a57P9P9ppj42R7m3m4k8k9L3L4L3L4r2r2J07J06nnnnk9k8k9k8R0R0j07j09j9k0l5K03j2
$$ y = [-310, -270, -230, -205, -180, -222, -263, -305, -347, -208, -68, -192, -316, -358, -162, -219, -276, -172, -68, -83, -98, -78, -57, -96, -135, -109, -83, -177, -270, -171, -72, -77, -83, -182, -43, -158, -272, -293, -313, -273, -234, -252, -270, -362, -216, -166, -117, -88, -58, -254, -53, -1, 51, -155, -124, -108, -91, -159, -227, -235, -243, -223, -202, -301, -400, -293, -186, -412, -400, -307, -214, -166, -117, -67, -16, -149, -282, -358, -196, -227, -259, -223, -187, -152, -116, -226, -335, -246, -157, -184, -210, -237, -264, -248, -233, -202, -172, -251, -92, -68, -43, -105, -167, -229, -291, -179, -68, -155, -241, -204, -167, -130, -92, -198, -304, -210, -117, -99, -80, -166, -251, -353, -217, -215, -213, -203, -193, -183, -174, -209, -244, -264, -284, -314, -106, -151, -196, -240, -284, -209, -134, -155, -176, -137, -98, -188, -279, -170, -62, -132, -202, -154, -105, -74, -44, -73, -101, -112, -122, -252, -381, -316, -252, -187, -122, -241, -360, -360, -359, -302, -244, -186, -128, -152, -176, -201, -225, -196, -167, -273, -140, -149, -157, -151, -145, -95, -46, -116, -186, -164, -142, -240, -337, -203, -70, -120, -170, -351, -293, -319, -107, 38, -53, -189, -88, -68, -48, -296, -147, -146, -145, -223, -301, -379, -219, -253, -286, -325, -364, -299, -234, -68, -141, -154, -167, -43, -157, -78, 1, -6, -13, -155, -58, -101, -145, -173, -202, -169, -135, -102, -68, -160, -252, -145, -39, -44, -49, -54, -59, -88, -116, -145, -173, -83, 7, -100, -209, -228, -248, -283, -80, -92]
1640i2j3j17j16P2P1N7N7P4j64l0l0M7M7M7M7llj7j8J10j27rqQ5j52K34mj06j06lkK1K1Q1
1632d9Q0k4k3P9Q1K7k10M1j96J14j25ooM3M2j01j02K73j25M0L9j7j7j6j7p4p5J09J10L20Q4
1624B99J42J43k3k62rrj0j0L28N66K83m31n71l32k06L2J05j31%JJ19j18J9J9NMP7P8P8P8j75
1617H9j74K4K3p1p1M7M8opN3N1j20j20P2j65P5P5M5M6K07k9L9j97KLj2j3k3k2J11j27jjj5
1608a64j5J07J06j2j2N9N9%jk8k7k7k8L1L1L1L1j32j31O7O5P1P0J1J1Q4Q4l5l6RQn1n1P5P6
1600C36J6J6J0J0n0m9Q3Q3Q3Q3N5N5J73J74L56L57L8M36M55Q53J349K700N659R233N262n463
1593B2313r539n964k767j257p32m95k56k56j54j54l5l5p0o9p0p0j44j44N4N5L7L7L7L7o8o7
1587B24N2N2j2j1j1j2RQRQJ58J58j20j20l4l4K5K5L4L4q5q5P5P5P5P5q8q7q7q8L5L4L4L5m2
$$ y = [-92, -105, -222, -338, -266, -195, -138, -81, -7, -171, -201, -231, -184, -137, -90, -43, -46, -49, -66, -84, 26, -101, -110, -118, -33, -185, 49, 45, -61, -167, -170, -172, -151, -130, -49, 31, 7, -16, 63, 144, 171, -39, 2, -194, -80, -205, -211, -217, -174, -132, -233, -335, -62, -187, -147, -108, -125, -142, -158, -175, -249, -324, -215, -105, 215, 299, 441, 584, 561, 299, 290, 281, 271, 261, 589, 1155, 1438, 1007, 436, 104, -102, -70, 35, -96, -96, -95, 24, -94, -75, -56, -51, -47, 30, 108, 186, 264, 89, -85, -61, -38, -109, -180, -133, -85, -91, -98, -45, 6, -114, -234, -162, -327, -252, -177, -132, -86, 121, 92, 131, -66, -64, -61, -73, -86, -109, -131, -20, -147, -148, -149, -164, -179, -72, 34, 22, 10, 69, 128, 128, 127, 99, 72, 45, 17, 48, 79, 110, 141, 9, -122, -55, 10, 81, 151, 162, 173, 257, 341, 306, 270, 279, 287, 236, 185, 260, 336, 352, 368, 378, 388, 338, 289, 372, 455, 538, 621, 676, 731, 904, 1078, 1434, 1791, 1829, 2265, 2720, 3573, 4922, 7622, 13281, 22514, 27776, 22313, 12774, 6810, 4043, 2786, 2054, 1559, 1303, 1047, 893, 739, 704, 669, 599, 530, 460, 390, 246, 102, 156, 211, 248, 285, 322, 359, 291, 224, 276, 328, 316, 305, 294, 282, 291, 299, 308, 316, 474, 632, 512, 392, 358, 324, 349, 374, 408, 442, 357, 272, 347, 422, 497, 572, 484, 397, 310, 222, 257, 291, 325, 360, 318]
1578C18m1J57J57n8n7J7J7q5J53J9J9nmj24J15k8K10k8k8L9L9q0J58j70O8n0n1O1O1p3J65
1571H91J19J18j06J33j15J23k34Mj8K21J02J01lkj07K90p1p1j80N8J13J12m6m6p5L22l5K03
1564A801J13J14RK48L4K72k0k1l30O6o8J71k7L70p7J62r2J47J47J46M6M7j23M33m3L54K85
1557D164K84k5k5M5M42J83M22J14J15J61J61K85Q42Q07Q06L75P72P29J285J999K715K630K869
1552B2155M526Q102J5596L4423R0665J22042n509j24746r0171l5279j4813o632l761j934j979
1548A2685j582j354p97j189l14j26J12M8M45j75j76l33O3r5J42q0q1q5M70J88M26L56P54J28
1542I430k69m98k59j05J34K28O25L05L05L29L30L74L75M1K80J86J86L44N83L51L51K46M84
1537A4356K82N19N29P68O22L84N48N48J007J246O74M37O74J072J340J101J035J272J273J035
$$ y = [318, 277, 434, 591, 533, 476, 493, 510, 425, 578, 597, 616, 611, 607, 483, 598, 570, 780, 752, 724, 763, 802, 722, 880, 710, 778, 728, 677, 738, 799, 726, 891, 1010, 1128, 1022, 1155, 1040, 1163, 929, 933, 915, 1136, 1238, 1339, 1336, 1334, 1227, 1517, 1446, 1375, 1195, 1253, 1366, 1478, 1432, 1386, 1311, 1633, 1598, 1801, 1914, 2028, 2037, 2285, 2319, 2591, 2571, 2550, 2220, 2286, 2218, 2389, 2362, 2732, 2655, 2817, 2725, 2872, 3019, 3165, 3211, 3258, 3135, 3568, 3525, 3879, 4164, 4448, 4423, 4398, 4443, 4885, 5068, 5490, 5604, 5719, 5880, 6041, 6326, 7168, 7975, 8781, 9156, 9928, 10657, 11942, 13941, 16656, 19286, 22155, 26681, 34783, 50379, 84802, 175467, 297509, 292000, 167254, 77083, 41804, 26991, 20359, 16598, 14664, 12685, 11103, 9749, 8952, 7763, 7449, 7323, 7435, 7483, 7928, 7753, 7577, 7244, 7307, 7212, 7354, 7274, 7193, 7108, 7578, 7766, 8192, 8548, 9302, 9430, 9161, 8663, 8404, 8299, 8433, 8661, 9286, 9591, 9896, 10225, 10555, 10929, 11304, 11345, 11625, 11811, 11997, 12341, 12924, 13275, 13626, 13872, 14356, 14638, 15157, 15686, 16454, 17076, 17460, 18008, 18556, 19563, 20809, 21483, 21920, 22594, 23666, 25006, 26107, 27142, 28414, 29687, 30722]
1532C0722J159J399J785J229J034J430K101K100K440K678L174L175M242M798N200L532K223
1528G4421J827L410L410P164J0897J2779J0475J3206J7416K5429L3770M8357N3520N7622P4065
1524D47768J27462K19690M29853R42625J832121J430723p36605j970197j353477o01756k81611
1521D86596j43150q3741m4895l5115l3446l0027j9144j5649j1915j1602n645l772l773p339
1518C7383n671o252m742l417jn27K9j253k21j075k00j286k53j186l13j108K43k94K63p58m3
1513I318q57l02r05J27l20P7n53J62m74K42n93j96p42K91m1J96n98J18n45J2n15K00j02K95
1507D295k72J26n86k9k98R9k27M88j47K49l2L65o6o7n53J63P9L16l45j07n14M2j79K19o16
1501B403o0j50K47l39N8j64K33o7N2k50J48k67J31m33l6k25J4k25J73j85K12q4J54q9J49K14
$$ y = [30722, 31881, 33280, 35065, 36294, 37328, 38758, 40859, 42959, 45399, 48077, 51251, 54426, 58668, 63466, 68666, 72198, 74421, 76248, 79658, 83068, 90232, 101129, 113908, 124383, 137589, 155005, 180434, 214204, 262561, 316081, 373703, 447768, 575230, 794920, 1224773, 2167398, 3999519, 5430242, 4693637, 2723440, 1369963, 768207, 486596, 343446, 259705, 214810, 179695, 146249, 116222, 97078, 81429, 69514, 57912, 52267, 48495, 44722, 37383, 31712, 25460, 20718, 17301, 17300, 16773, 16802, 15549, 15328, 14253, 14053, 12767, 12514, 11328, 11015, 9907, 10150, 9856, 10119, 9361, 9318, 8461, 8159, 7254, 7381, 7061, 7138, 6585, 6747, 6273, 6515, 5922, 5726, 4984, 5275, 5234, 5430, 4832, 4950, 4405, 4417, 3902, 4102, 4000, 4295, 4023, 4149, 3563, 3534, 3236, 3335, 3108, 3596, 3449, 3698, 3666, 4031, 3965, 3898, 3345, 3508, 3587, 3903, 3558, 3451, 2937, 2979, 2800, 3019, 2403, 2343, 2193, 2440, 2101, 2159, 1995, 2228, 2161, 2213, 1963, 2111, 1844, 1975, 1542, 1506, 1281, 1295, 1070, 1243, 1058, 1270, 1186, 1340, 1251, 1400, 1614]
1494A614K15j70n0l09Q8o8N1j08J1k47J50j39K59qK31k0R8l70J86k88m9k9k9P7P6j69O9j57
1487I15l8O9L07n8J80m3m4j52Q5j82N6J6J6L2L1j23j23j38J01J14J15k03L5j9j8r8r7j86K11
1480G61M8M7n1n0j85N4J20J20L1L1Q2L22M50M50m23o61k24J5j19j18J5J6m1m0J9J9j5j4j5
1473F44j4p1p0M9M8N7N6P1j67p0p0L4L4k8k8L2L2O2O2J51q7k26J2J81n8N6j82o3o3K1K2J55
1465E82q3M0L9q0q0r1J48P2P3l1l0l1l1L3L2M7j90q0q0K4K5L9L9M0L9%j%%k1k0K33nM9N0q4
1457F66q4J5J5K39j59M7M6PPJ66p1k2k2K42j55j85N3J52J51K86K85K77K77N51N50J047K238
1450F619M607Q340P861k068r278p451l687j860p33l36l46l46k02k02r1r0j05j06J45r3j73
1445D05j73O2j77m3m2K2K2Q1Q2N7N8P3j66n7n8M7M7K4K4M0j99N6N6M1M1q3q4L7L6j4j4J21
$$ y = [1614, 1829, 1659, 1609, 1300, 1388, 1320, 1371, 1263, 1274, 1027, 1177, 1038, 1297, 1289, 1520, 1500, 1598, 1228, 1414, 1126, 1077, 1048, 1019, 1096, 1172, 1003, 1072, 915, 877, 946, 1253, 1195, 1375, 1332, 1288, 1136, 1221, 1039, 1095, 1111, 1127, 1159, 1190, 1067, 944, 806, 907, 1021, 1136, 933, 968, 949, 931, 833, 736, 550, 761, 809, 856, 805, 755, 570, 624, 744, 864, 895, 926, 1008, 1330, 1780, 2230, 1807, 1146, 922, 937, 818, 700, 715, 731, 690, 650, 669, 688, 673, 659, 644, 630, 559, 489, 538, 586, 643, 699, 770, 603, 533, 463, 497, 531, 503, 475, 507, 539, 601, 663, 814, 727, 501, 513, 694, 636, 692, 510, 447, 384, 405, 427, 582, 499, 539, 578, 498, 418, 327, 475, 547, 620, 589, 559, 528, 497, 530, 562, 609, 419, 339, 259, 283, 308, 347, 386, 426, 465, 465, 464, 464, 464, 443, 423, 656, 651, 700, 750, 666, 582, 597, 612, 851, 692, 739, 785, 792, 799, 965, 894, 872, 850, 1092, 937, 752, 805, 957, 1108, 1394, 1679, 1956, 2233, 2784, 3334, 4381, 6619, 11226, 19566, 27427, 25359, 16081, 8630, 4943, 3083, 2350, 2014, 1668, 1322, 1120, 918, 827, 737, 632, 526, 671, 578, 405, 232, 294, 117, 74, 32, 54, 76, 157, 239, 296, 354, 427, 261, 204, 146, 193, 240, 264, 288, 328, 129, 185, 241, 282, 323, 240, 156, 193, 229, 215, 201, 322]
1437C22j18m7m7M2M2J17j21m7m8O0O0J34j04M6M6L1k07Nk33O9P0K04l3J00j38J53q6j01j01
1430G0J65p3O1O0L5L4J09j29o1o0M3M3L3L2q7q7O4O4p0p0J61p8o3o2M0M0M0M1o4o4N5N5K8
1422C05K7K8K7N0N0N0N0R6R6R7R6L86L85L26L26J41J42K60K61K69K69q8q8l47l47k27k28j14
1415B298j13m46k08j88j88n3n4l7l6J62J62K68K68K68K69K21K20M75K35K08K07k59k60k26
1409C193m64m05j66k13k14l03l03l29r0k6k6n2n3l7l7j37J02Q7Q7o7o8o7o8KLKKR1R2k8k8
1402D80k7k8L2L2L7L8k3k2O5O5N0N0O1j78j77O1R6R6k3K14l6l7ppk5K14l9m0j8j8j52Q6N8
1394H78N9m5m6J7J7J46L84K03l5k99o0o4o4J00j38L8K76j36j35M9K87l0l1j62P6J7J7p5J63
1386A407l0l1Q4Q4Q4Q3K54K53l03o5j56Q2l7l7N7N7N7N7K7K8K7K7K5K4K5K4K0K0J53J54j57
$$ y = [322, 204, 157, 110, 152, 194, 311, 190, 143, 95, 155, 215, 349, 245, 291, 337, 368, 161, 166, -67, 2, 72, 276, 243, 343, 205, 358, 272, 171, 70, 235, 162, 223, 283, 318, 352, 461, 332, 271, 211, 254, 297, 330, 362, 275, 188, 252, 316, 246, 176, 337, 259, 196, 134, 174, 214, 254, 295, 231, 167, 222, 277, 305, 332, 360, 387, 437, 487, 537, 587, 683, 779, 876, 972, 1358, 1743, 2069, 2395, 2536, 2678, 2938, 3199, 3468, 3737, 3649, 3561, 3214, 2867, 2640, 2412, 2298, 2185, 1739, 1531, 1343, 1155, 1102, 1048, 1011, 975, 1137, 1299, 1567, 1835, 2103, 2372, 2593, 2813, 3288, 3523, 3731, 3938, 3679, 3419, 3193, 2729, 2324, 2158, 1945, 1731, 1428, 1125, 796, 706, 680, 654, 602, 549, 512, 475, 338, 440, 527, 614, 547, 479, 412, 344, 346, 349, 351, 353, 444, 536, 508, 480, 453, 425, 457, 489, 526, 564, 541, 519, 584, 649, 699, 749, 810, 632, 455, 516, 612, 708, 685, 899, 863, 826, 819, 812, 787, 1001, 962, 922, 904, 886, 734, 820, 878, 937, 892, 846, 863, 880, 1026, 1410, 1613, 1578, 1279, 1219, 1155, 1091, 1191, 1053, 1091, 1367, 1231, 1096, 1145, 1432, 1402, 1371, 1209, 1285, 1302, 1319, 1244, 1407, 1377, 1346, 1430, 1514, 1598, 1681, 1935, 2188, 1885, 1820, 1664, 1746, 1709, 1672, 1729, 1786, 1843, 1900, 1927, 1955, 1982, 2009, 2034, 2058, 2083, 2107, 2127, 2147, 2300, 2454, 2297]
1379B297Q2J46J47J20J20O1O0KLKKJ44J44n0J88J2J3J46J46K21K20QPJ95m4J6K55Q2Q2R7R6
1371E020K16K16Q1Q2K97O0K08K08J90M28K94K93M1M1K54K54J5K53J84M22K53K53L87L88L46
1365A0684L47M81M80O16Q54Q85M86L25L24K75O71Q82Q82R06R06P39P38Q87J284J347J584J863
1360B8446K260K824L061L350M065M452N167O184P218Q663J1364J5013K1527L6258N6435O2711
1356B78998O0009N8353L9447L5315N2951N2078M6516L0907j0559m3898n1365n6569m8465l1640
1352D12078m4191n6881n5768n7418m4230k2544r040r76M902J1435K2399M1824N7553N6262
1349C15405N5468M5389K8072M2212N3174M6152M1228J0226l4417n0891n5180n8200l9928l6621
1346C62089n6163n9916o0710n7364l8458k1220j2482q510o126m975m498l793l317l093k855
$$ y = [2297, 2379, 2525, 2672, 2792, 2912, 2973, 3033, 3035, 3038, 3040, 3042, 3186, 3330, 3280, 3468, 3480, 3493, 3639, 3785, 4006, 4226, 4234, 4241, 4436, 4392, 4408, 4663, 4745, 4827, 4924, 5020, 5236, 5452, 5533, 5615, 5912, 5972, 6180, 6388, 6578, 7006, 7300, 7593, 7634, 7675, 7929, 8183, 8198, 8451, 8635, 9057, 9310, 9563, 9950, 10338, 10684, 11031, 11512, 11992, 12608, 13462, 14347, 14833, 15158, 15482, 15757, 16428, 17310, 18192, 19098, 20004, 20743, 21481, 22368, 23652, 24999, 26583, 28446, 30706, 33530, 36591, 39941, 44006, 48458, 53625, 59809, 67027, 75690, 87054, 102067, 123594, 159852, 216287, 278998, 339007, 397360, 436807, 472122, 525073, 577151, 623667, 654574, 644015, 600117, 548752, 492183, 443718, 412078, 367887, 311006, 255238, 197820, 153590, 131046, 122006, 121030, 125932, 137367, 159766, 201590, 259143, 315405, 370873, 416262, 444334, 486546, 539720, 585872, 627100, 637326, 602909, 552018, 496838, 438638, 398710, 362089, 305926, 246010, 185300, 127936, 89478, 68258, 55776, 47266, 41140, 36165, 31667, 27874, 24557, 21464, 18609]
1342A8609k184k184j922j444r13r14n26n26l67l67j69j68k56k55j37j36L6L5L6L6J36J36R1
1336F647L30K88P64R48J424K975L452L064L064J533J057L013K536K661J866p41k806k824l063
1332B6188k641q93k125l236k840l316k294j182l82R4K28M67J176K289L273K796K955K161N18
1327B3236K582K901K106K651K68k453k930k888l364j497j498l166l167l251l013j608q14o24
1323C471l87j33j33j18j18k94k95j75j75j91j92QPj39j39N9N9qqqql3l4l3l3J24J23MMj8j8
1315A169j8j8K7K7K7K7n4n5j74j74j1j2j1j1J1J1J1J1J7J6J7J7k8k8R1R2j1j0j30j30K5K4
1307G45Q4Q4r2r1l1l2j6j5j6j5N7N7llm4m3P5P6j09j09J0J0L8L7k2k2m5m5J4J4M1M0p9p9R0
1299E61R0L1L0K7K6K7K7K1K1K1K1r5r6K4K3k0k1k0k0qqk3K15R3R3K26K27K91K91K77N14J55
$$ y = [18609, 16425, 14241, 12319, 10875, 9962, 9048, 8522, 7996, 7629, 7262, 7093, 6925, 6669, 6414, 6277, 6141, 6177, 6212, 6248, 6284, 6420, 6556, 6647, 6977, 7265, 8029, 8977, 10401, 13376, 16828, 19892, 22956, 24489, 25546, 28559, 31095, 33756, 35622, 34881, 32075, 29251, 26188, 23547, 22654, 20529, 17293, 14453, 11137, 8843, 7661, 7279, 7373, 7601, 8068, 9244, 11533, 14806, 17602, 20557, 22718, 23236, 25818, 28719, 30825, 33476, 33744, 31291, 28361, 25473, 22109, 20612, 19114, 15948, 12781, 9530, 6517, 4909, 4095, 3471, 3084, 2951, 2818, 2700, 2582, 2288, 1993, 1818, 1643, 1452, 1260, 1268, 1275, 1136, 997, 1056, 1115, 1107, 1099, 1091, 1083, 1050, 1016, 983, 950, 1074, 1197, 1201, 1205, 1187, 1169, 1151, 1133, 1160, 1187, 1214, 1241, 1187, 1132, 958, 784, 773, 761, 750, 739, 750, 761, 772, 783, 800, 816, 833, 850, 822, 794, 885, 977, 966, 956, 826, 696, 721, 745, 829, 913, 821, 730, 699, 667, 651, 636, 620, 605, 662, 719, 716, 713, 669, 626, 701, 777, 668, 559, 569, 579, 617, 654, 632, 610, 565, 520, 534, 548, 589, 629, 550, 471, 561, 651, 682, 712, 739, 765, 792, 819, 840, 861, 882, 903, 808, 712, 736, 759, 739, 718, 698, 678, 670, 662, 639, 854, 947, 1040, 1266, 1493, 1784, 2075, 2352, 2866, 3021]
1291C021J55K89K89J38J37Ml94l04l04l15l14n05k67k03k02j08j08J1J1K7K6K24K25L41L41
1285B215K22K22K32K32L36L36K6k12l56l56k02k03l21l21k89k89j70j69j03j03j02j03N1N0
1279F23k02L5j05j06J07J08r3r2K6K6r5r5K4K4L0L0j03J34k1k2ppooj39R8L0L0M5M5L0K9l0
1271C45l0m2m1R3R2j57Q1O7O6j83j83J5J6M4M4j5j5j3j3p2p3M9M8p1p0R5R5L6L6j5j5j%o4
1262A49J75p9p8P4P4m5m5p5p5N9N9k05L2J7J8j2j3j2j2k0k1k1k1j0j0o9o9J15J15mmO8O9j29
1254ej29rrJ10J09n1n1O7O8m5m6m4m6QQJ26J27n3n2j26J11m5m4K8L0p3p4L1L0K01l7j01j00
1246h6n3n4J40r8J2J2J2J3j3K25k8k7k8k7k7k7J2J1J30J31m6m5m6m5RRj49Q8J85k11M0M1j60
1238a00P6O1O2p2p2q7J50j9k0nnr8r8K0K1P1P1J1J1n0n0l5l5M7K84m7m8n6n8O2O1l6l5l6l5
$$ y = [3021, 3176, 3465, 3754, 3892, 4029, 4033, 3639, 3335, 3031, 2716, 2402, 1897, 1630, 1427, 1225, 1117, 1009, 1020, 1031, 1058, 1084, 1308, 1533, 1874, 2215, 2437, 2659, 2891, 3123, 3459, 3795, 3821, 3609, 3253, 2897, 2695, 2492, 2171, 1850, 1561, 1272, 1102, 933, 830, 727, 625, 522, 573, 623, 421, 456, 351, 245, 352, 460, 367, 275, 301, 327, 232, 137, 161, 185, 215, 245, 142, 276, 255, 233, 226, 219, 213, 207, 68, 166, 196, 226, 271, 316, 346, 375, 345, 315, 273, 232, 325, 417, 260, 341, 408, 474, 291, 108, 123, 139, 183, 227, 212, 197, 184, 171, 99, 26, 75, 123, 52, -18, 77, 172, 208, 244, 229, 214, 213, 213, 149, 324, 245, 167, 241, 315, 270, 225, 150, 75, 134, 193, -12, 20, 37, 55, 43, 30, 18, 6, -14, -35, -56, -77, -87, -97, -166, -235, -120, -5, -9, -13, 55, 124, -5, -134, -143, -152, -42, 67, 16, -35, 32, 100, 55, 9, -35, -81, -73, -65, 61, 188, 135, 83, -43, 68, 23, -21, 7, 37, -36, -110, -79, -49, 152, 115, 14, -86, -139, -193, -53, -151, -139, -127, -115, -102, -115, 110, 82, 55, 27, 0, -27, -54, -42, -31, 99, 230, 184, 139, 93, 48, 57, 66, -83, 5, 190, -21, 19, 60, -100, -24, 37, 99, 27, -45, -132, 18, -1, -21, -26, -31, -129, -227, -207, -186, -115, -44, -33, -22, -72, -122, -157, -192, -145, 139, 92, 44, -12, -70, -8, 53, 17, -18, -54, -89]
1229h9P2P1m7m6k8k9L1L1O4O4n4n4l2l1Q6Q8l7l7l5l7j5j4j5j4J5J5J5J5KKJKk9k8k8k8L9
1220a14M0M0L9j21j22O2O2J22j14J8J9J2J3m7m7j25j25P4P4R2R3J06j30M1L9r2r4j9k0J00
1213a24J00J3J1j06j07P1P0J1J1j9j9l3l4M6j93OK44M0L9nnm9m9J0J0M0L9o4o4j42R6l9l8
1205b33K7K6J75o3j60P9M8M9QQQQJ9J8J9J9n5n5LMq0q1Q3Q3P3j63J04j34J1J0J30j08j1j2
1197a43J08j31K7K7j22J17J1J0p3p4J06J05M4M6l6l5l7l6K0K0q0p9J44J44l4l4J10J10j63
1190G2P5j00r9J3J4M8M8j1j1J5J5m4m4m1m0N8N8j1j1rj1L9M0r8r8P6P5J7J6m2m0J7J7K4K4
1181E1J59q1j12j12N2N0L6L6N0N1j61P6LKklj01j02N9N7j20j20Q5Q5R9R9k80m3J90m7j81N7
1173a68Q7Q6mmR4R4o4o4L5L5j19j18K0K0k5k5L5L4q9q9l0l0J39J40j19j18J53J52o4o5j4j4
$$ y = [-89, -17, 54, 7, -39, -67, -96, -65, -34, 30, 94, 40, -14, -46, -77, 9, 97, 60, 23, -12, -49, -64, -78, -93, -107, -92, -77, -62, -47, -45, -43, -42, -40, -69, -97, -125, -153, -114, -74, -34, 5, -116, -238, -176, -114, 8, -106, -88, -69, -57, -44, -91, -138, -263, -388, -314, -240, -148, -55, 51, -79, -38, 1, -91, -185, -204, -224, -124, -24, -11, 0, -106, -213, -142, -72, -61, -50, -69, -88, -121, -155, -109, -302, -296, -52, -12, 27, 22, 17, -32, -81, -71, -61, -21, 18, -46, -110, -252, -156, -195, -233, -206, -180, -5, -68, -228, -149, -101, -52, -44, -36, -28, -20, -1, 17, 36, 55, 0, -55, -52, -48, -128, -209, -126, -43, 30, -133, -29, -163, -152, -142, -12, -120, -131, -143, -35, -166, -139, -112, -234, -117, -106, -96, -169, -243, -137, -32, 12, 58, 22, -13, -50, -86, -66, -46, -126, -205, -61, 83, 49, 15, 125, 235, 72, 147, 47, -52, -39, -25, 23, 71, 60, 49, 64, 79, 35, -9, -50, -90, -32, 26, 15, 4, -5, -16, 23, 63, -35, -133, -57, 18, 35, 51, 9, -31, -14, 3, 27, 51, 210, 129, 17, -95, -43, 7, 43, 79, 129, 180, 19, 95, 98, 100, 98, 95, -6, -108, -49, 8, -112, -232, -147, -62, 37, 136, -144, -187, 3, -44, -225, -168, -81, 5, 1, -3, 91, 185, 121, 57, 92, 127, 8, -110, -90, -70, -95, -120, -85, -51, -140, -229, -259, -289, -150, -10, -129, -247, -94, 58, -6, -71, -85, -99]
1165i9j49R1J8J8M8M8j61P8O7O7k68J29J77o1K7K7j26j27k1k2k1k2QQK02l7J4J5j6j6J26j10
1158h8K2K3o2o2J3J2m0J96l4l6J4J4j80N8N2N1POp3p3K7K6nno5o5l1l1O8O8J%j4j4J22j16
1149b14J8J8K3K2l7l7N0M9N0N0l1l1K8K9l5l5l4l5PQj27J12PQl7l8M8M8j2j2K2K2K2K1j5j5
1140h3q9J49j9j8mmj0j1j1j0l4l5j68P0R1R1l2l3OPj27J11N7N7J3J3M9M9O5O5k13K4o4o5J27
1131A4j08j10J29K2K2o2o2P9P8j9k0k3k2k3k3J4J3P3P2q1q2J8J7J5J5J4J5J4J2J4J3p1p2M2
1123g3M3o0J77M4M5m1m0k5k5j82N6nmj27J12k3k3O5O4O4O5o2o1lkk5k5q4q4O4O5NNO3O3J8
1114D4k18Q0Q1K0K1j48R0N3N5p6p5K4K4NOOOr2r2M7M7llP2P0j6K22r1r1n5n4n6n5P2P1P1P1
1105A33O0O1j19j18j%L4k03J6J7J01J00l1l1k9l1O4O5O5O5j8j9M2M1M3M3M2M3J31J31L25L24
$$ y = [-99, -248, -157, -139, -121, -73, -25, -186, -108, -41, 26, -242, -113, 64, 3, 30, 57, -69, -196, -217, -239, -260, -282, -274, -266, -64, -101, -87, -72, -88, -104, 22, -88, -66, -43, -105, -167, -154, -142, -182, 14, -20, -56, -42, -28, -208, -150, -98, -47, -40, -34, -107, -180, -153, -127, -132, -137, -202, -267, -298, -329, -261, -193, -192, -192, -206, -220, -98, -214, -196, -178, -155, -133, -170, -207, -157, -108, -58, -8, -39, -70, -42, -13, -48, -83, -117, -152, -145, -137, -264, -152, -145, -137, -174, -212, -164, -116, -128, -140, -118, -96, -74, -53, -68, -83, -172, -23, -42, -60, -64, -68, -78, -89, -100, -110, -144, -179, -347, -277, -186, -95, -127, -160, -154, -147, -274, -163, -106, -49, -36, -23, 26, 75, 140, 205, -8, 16, -48, -113, 14, -94, -204, -75, -53, -31, -93, -155, -76, 2, -17, -37, -60, -82, -105, -128, -114, -101, -28, 44, -37, -119, -101, -84, -69, -54, -40, -25, -11, 1, 15, 28, -43, -115, -73, -30, -90, 87, 131, 176, 135, 95, 70, 45, -137, -81, -86, -90, -217, -105, -128, -151, -86, -22, 42, 107, 45, -16, -19, -21, -46, -71, -155, -239, -175, -110, -105, -100, -37, 26, 44, -174, -94, -13, 7, 28, -120, -30, 23, 78, 2, -73, -49, -25, -20, -14, -8, -2, -94, -186, -139, -92, -95, -98, -26, 44, 28, 250, 159, 68, 13, -41, -97, -152, -80, -9, 62, 133, 193, 254, 135, 17, 16, 16, 50, -153, -137, -120, -19, 81, 50, 19, -10, -41, 23, 88, 153, 218, 200, 181, 223, 264, 307, 350, 392, 435, 566, 697, 1022, 1346]
1097A346L99O38N28j87n02n02m77k39j58l96J1J1POK39Kq8q9n8n8J77o1P4P3J98J98k5L72
1091A439M84M84O97R36P09M71k79q35q98q97o58k62k72k72mmJ61p8k01k01llJ31j07K0J9j0
1084E67j0K10k9K45K44L65L65O68O68ln59p43n04m02j63j68j68j19J21j4j4k3k2q3q2l5l6
1077B76O4O3m5m6m5m6M2M1K7K6K12k7M8M8j07j07K2K61K5k14nnk0k0J00R9ooool3l2Q6Q7J9
1069G70J9NMJ25j13K0K1m4m4J55J55P4P4m5m5p8p7J21J21n2n2R7j41p2J67J8J7l0l1Q8Q9Q4
1061A400Q5l5l4Q1Q0POJ54q4j0j0L0L0R0Q9J61J60k3k4oK33J73o5l2l2P2P3O6O5O6O5R8R8
1053C027k1k1M6M7L00O1J20J20j04J35K31qJ41J40J27J26L6K75K34nK6K5J70J71J70J71K47
1046E987K47K48K47O8O7J87J86K75K74K15K15K48K48L08L08M01M01L41L42N47N48N47N48O61
$$ y = [1346, 1745, 2383, 2911, 2724, 2222, 1720, 1243, 1004, 846, 450, 461, 472, 479, 485, 724, 726, 638, 549, 491, 433, 610, 549, 623, 696, 894, 1092, 1067, 1439, 1923, 2407, 3104, 4040, 4749, 5220, 4941, 4106, 3208, 2311, 1653, 1391, 1119, 847, 843, 839, 1000, 922, 721, 520, 517, 514, 645, 538, 558, 577, 567, 557, 767, 738, 983, 1227, 1592, 1957, 2625, 3293, 3290, 2731, 1988, 1484, 1082, 919, 751, 583, 464, 585, 571, 557, 534, 512, 429, 347, 312, 276, 340, 403, 358, 312, 267, 221, 263, 304, 331, 357, 569, 542, 590, 638, 531, 424, 446, 707, 732, 518, 513, 508, 488, 468, 568, 667, 661, 655, 649, 643, 610, 578, 664, 751, 770, 789, 794, 798, 923, 810, 830, 851, 807, 763, 918, 1073, 1147, 1221, 1176, 1131, 1053, 976, 1097, 1218, 1166, 1114, 1211, 1070, 998, 1165, 1183, 1200, 1170, 1139, 1227, 1316, 1400, 1485, 1450, 1416, 1497, 1577, 1584, 1590, 1744, 1660, 1650, 1640, 1670, 1700, 1790, 1879, 2040, 2200, 2177, 2153, 2147, 2380, 2553, 2488, 2456, 2424, 2496, 2569, 2635, 2700, 2766, 2831, 2929, 3027, 3006, 2985, 3031, 3078, 3378, 3439, 3559, 3679, 3575, 3710, 3941, 3933, 4074, 4214, 4341, 4467, 4503, 4778, 5012, 5007, 5033, 5058, 5228, 5399, 5569, 5740, 5987, 6234, 6482, 6729, 6797, 6864, 7051, 7237, 7512, 7786, 8001, 8216, 8464, 8712, 9020, 9328, 9729, 10130, 10471, 10813, 11360, 11908, 12455, 13003, 13664]
1040A3664O62O62O61P72P72J130J130J034J034J123J123J758K234K830L625L362L363M027
1036D4966N458P513R261J1187J3888J9771L1370N2063Q7492J34584J49677N8046r1775j55359
1033C78142j24696p6716m4146k5414j5086r070o050m281k851j023J041L227N609O930P724
1029I3340Q768Q767R552J3524J9561K7028L7375N4057Q6011J40188K10887K35831J42938m0563
1026A047264j87683k16121j83321j37404r0219n4154l0785j6326j0250j2315j4819j1802p034
1022G5031l381j262p85q85m08J535L919O440R142J2280J8477K9300M8206Q1332J31378J65913
1018E76232R9663o6726j72696j56470j00070n7550l3560k0334j2866q636o889o015m902l911
1015B5270k799j786j309j852k328k284j807j472j234q56o18m23m23k84m6k95k96m7k85j38
$$ y = [13664, 14326, 14988, 15649, 16421, 17193, 18323, 19453, 20487, 21521, 22644, 23767, 25525, 27759, 30589, 34214, 37576, 40939, 44966, 50424, 57937, 67198, 78385, 92273, 112044, 143414, 195477, 282969, 417553, 567230, 625276, 533501, 378142, 253446, 176730, 132584, 107170, 92084, 83014, 76964, 72683, 69832, 68809, 69850, 73077, 78686, 85616, 93340, 102108, 110875, 120427, 133951, 153512, 180540, 217915, 271972, 357983, 498171, 709058, 944889, 1087827, 1047264, 859581, 643460, 460139, 322735, 232516, 178362, 147577, 131251, 121001, 108686, 93867, 82065, 75031, 71650, 70388, 69603, 68718, 68310, 69845, 73764, 80204, 89346, 101626, 120103, 149403, 197609, 278941, 410319, 576232, 675895, 609169, 436473, 280003, 179933, 122383, 88823, 68489, 55623, 46987, 40098, 34083, 29181, 25270, 22471, 20685, 19376, 17524, 15196, 12912, 11105, 9633, 8399, 7543, 6925, 6502, 6079, 5795, 5749, 5454, 5158, 5111, 4826, 4688]
1010D688j37j53j52k38k38j78j78q3q2j43j42O6O6j53j53j03j03j03j03m0m0m0m0j37j37M2
1004A986M2q1q0l6l5J08j30r5r6q5q6J4J3L7L7o2o2m8m9l3l4n5J84n0n0nnj05j05l0l0K9K9
996A032j06j06L3L3%%j%K7K8j26j26Q6j52M1M2n6n6J37j00j16j16J28J28NMn4n5l0l0L0K9
988E53q1q0M3M3R2j47j2j3J21J21R2j47j72O7L1L2j22J15j8j9o2o2j36J02k8k8M6M6j9k0j9
980C19k0O3O3l6l6L3L4L3L3p8p9J40J40r7r7J36j02p4p4J44r4L1L2J6J6K7K6K1k17J19J19
973E41j29J10j2j3O3O2J%q9J50J28j11K32K33L31N70P14M76j63p18o53m16j83j83j69j68l1
966E73l2O8O8k1k2L9L8N1N1N1N2O7O7P3L10L29L29N92Q30J057N00P3o42r86p49o44m06k06
959A510k06l40j02%k38RJ0nnJ0Rj29J09P5P4J1J1JK39N15K76M35O73M72q4n95n96p38n01j38
$$ y = [4688, 4551, 4398, 4246, 4008, 3770, 3592, 3414, 3331, 3249, 3106, 2964, 3030, 3096, 2943, 2790, 2687, 2584, 2481, 2378, 2338, 2298, 2258, 2218, 2081, 1944, 1986, 2028, 1947, 1867, 1831, 1796, 1904, 1774, 1679, 1583, 1498, 1412, 1426, 1439, 1476, 1513, 1451, 1389, 1341, 1292, 1259, 1225, 1170, 1354, 1304, 1254, 1249, 1244, 1139, 1034, 1004, 974, 1003, 1032, 926, 820, 853, 886, 886, 886, 885, 885, 912, 940, 814, 688, 774, 622, 663, 705, 649, 593, 730, 630, 514, 398, 526, 654, 659, 663, 609, 554, 524, 494, 524, 553, 472, 392, 435, 478, 570, 423, 411, 398, 519, 640, 732, 585, 413, 480, 511, 543, 421, 536, 518, 499, 437, 375, 239, 341, 313, 285, 331, 377, 358, 338, 319, 299, 362, 425, 389, 353, 386, 420, 453, 486, 408, 329, 469, 609, 512, 415, 551, 449, 375, 301, 445, 351, 382, 414, 430, 446, 473, 499, 520, 303, 422, 541, 412, 522, 510, 497, 560, 622, 623, 623, 534, 684, 812, 701, 933, 1166, 1497, 2067, 2781, 3257, 3094, 2376, 1723, 1307, 1124, 941, 772, 604, 573, 541, 609, 677, 656, 634, 673, 711, 762, 813, 864, 916, 983, 1050, 1123, 1433, 1762, 2091, 2683, 3513, 4570, 5070, 5143, 4501, 3515, 2766, 2122, 1716, 1510, 1304, 964, 862, 862, 624, 633, 643, 638, 633, 643, 652, 523, 632, 707, 781, 792, 803, 804, 1043, 1558, 1834, 2269, 2942, 3414, 3330, 2735, 2139, 1401, 900, 762]
952G62j37m8m7j07j07p5p5L0K9R3j46MLj12J25PPj20J19j6j6p1p2J81n7M8M7L3L2m9n0O9P0
944C54M7M7p2p2k7k6R2R3j23j23P5P5o2o3P2j67m2m3J41J41j11j12j10j12R0Q9Q9R0k4k3R6
936B79j43R9j40j54Q2Q8Q7r6r6j3j4j4j5L0K8J5J5J08j31O3O3n7n8p1J65q1q0n1n1o5J73L9
928DL9K4K4K5K4n1n2j84N3K8K8N7N8n3J86N1N2J8J8m2m2O8O9j31j30l4l3l4l4l1l2J2J2J87
920A54n1l6l6L2L2j01j02K00l8R7R6J17J17J16J17q4q4k34Nk2k61o1J75R4j45j28J08k9k8
913B0J1J0j02K93m8m9Q0Q1k4k4j14J24J84n5J75J75j19j18j31j32O7O7J4J5j84j84l7l7l8
906h0l7P3P2m5m6j3j4j48R1j3j3KKJ4J3J3J4J10J10N1N1LLj17j15llj8j8j8k56P6P7L1L2j02
897b21J36j%j20J18lmJ2J1J2J1j08J31j17J20KKm5m6j79N9L6L6k03L6J03J03N3j85K5K5J44
$$ y = [762, 625, 577, 530, 423, 316, 241, 166, 196, 225, 318, 172, 176, 179, 67, 192, 199, 206, 86, 205, 189, 173, 102, 30, 211, 154, 202, 249, 282, 314, 265, 215, 284, 354, 401, 448, 376, 304, 277, 251, 343, 436, 313, 190, 265, 340, 278, 215, 287, 120, 78, 35, 176, 317, 206, 94, -16, -128, -38, 51, 140, 230, 206, 183, 279, 136, 235, 95, -59, 23, 111, 198, 102, 6, -7, -21, -35, -50, -20, 8, 23, 38, 146, 15, 78, 141, 84, 26, -45, 120, 39, -41, -92, -143, -208, -35, 4, 43, 67, 91, 116, 140, 89, 37, -147, -94, -66, -38, 19, 77, 24, 210, 261, 313, 331, 349, 307, 265, 333, 402, 271, 141, 107, 74, 40, 6, -25, -57, -45, -33, 154, 103, 67, 31, 63, 95, -6, -108, 92, 54, 151, 247, 364, 481, 597, 714, 630, 546, 312, 317, 295, 34, -27, 148, 242, 97, -31, 77, 48, 20, 31, 41, -61, 232, 184, 135, 215, 296, 272, 248, 134, 258, 442, 387, 562, 737, 618, 500, 369, 237, 304, 371, 385, 400, 216, 32, -5, -42, -80, -117, -44, 28, -17, -63, -76, -90, -238, -147, -160, -173, -171, -169, -155, -142, -129, -115, -5, 105, 156, 207, 210, 213, 96, -19, -22, -25, -43, -61, -79, -335, -259, -182, -151, -119, -221, -85, -86, -86, -206, -88, -91, -95, -83, -72, -60, -49, -157, -26, -143, -23, -21, -19, -64, -110, -289, -230, -194, -158, -361, -325, -222, -119, -66, -251, -226, -201, -57]
889e7J43j84N3q1q1K5K4p5p4J26J26K7K7n1n1n2n1K8K8K9K8J5J6m4m4J03J03n9o1P6l19KL
881c02O9P0J0J0L2L2o7o8M1M1n8n9O6O5O6O5o7o7pqL0K9l0l0MMLMN4N3noK7K7j6j6n8J80j3
872A05j2O2O3j15j15K0K0P6P5J98J072L28j023l80l78j01J36j8j7llN1N3Q8j51K6K7J11J11
865C06K0J9p9q0N4N4nnj16j16K4K3M9N0r0r0RRRRN5N5J29j08J1J1K30qJ37J37n7n7QPQQm0
856E80m0r9r9p8p8p8p8ooRRj38R9O4O5j5j5j5j4o7o9K44OQ3Q2J11J12M0j98L5L5p6p6p5p6
847A78p5p5j08J27o2o4J44r3N3N3J13j25l2l2R2R2k2k3k2k2n6n4Q2Q3m2m3N7N7L7L7k3k3J7
839B26J6N1j87J15J14J00J00m9m8J86n3j64j64j18j19J01J00KKo5o4L5L5K1K1K2K1L1L1j4
832B85j4j74O4p0p0P0P0k9k9l7l6K3K3QQl6l7o6J70L2k06kjr1J46l8m0k4k4O9O7m9n0O6O6
$$ y = [-57, 86, -98, -45, -126, -207, -182, -158, -233, -307, -181, -55, -28, -1, -52, -103, -155, -206, -178, -150, -121, -93, -78, -62, -106, -150, -47, 56, -3, -64, 12, -307, -305, -302, -233, -163, -153, -143, -111, -79, -146, -214, -173, -132, -190, -249, -183, -118, -52, 13, -54, -121, -128, -136, -106, -77, -107, -137, -133, -129, -126, -122, -68, -15, -20, -26, 1, 28, 12, -4, -62, 118, 105, 93, 155, 218, 103, -12, 8, 28, 104, 179, 377, 1449, 1777, 754, 374, -4, -105, 31, 13, -4, -7, -10, 41, 94, 182, 31, 57, 84, 195, 306, 326, 345, 266, 186, 240, 294, 289, 284, 168, 52, 76, 99, 148, 198, 108, 18, 27, 36, 45, 54, 109, 164, 293, 185, 196, 207, 437, 429, 566, 703, 646, 589, 597, 604, 612, 620, 580, 540, 441, 342, 264, 186, 108, 30, 24, 18, 27, 36, -102, -3, 61, 126, 111, 96, 81, 67, 0, -69, 175, 181, 264, 346, 457, 569, 609, 411, 446, 481, 405, 329, 254, 178, 103, 28, -80, 47, -15, -79, 65, -28, 25, 78, 191, 66, 34, 2, 94, 186, 164, 141, 119, 97, 41, -13, 69, 152, 110, 67, 124, 181, 218, 255, 232, 209, 226, 242, 293, 106, 221, 335, 435, 535, 486, 438, 624, 571, 407, 243, 125, 6, 107, 207, 209, 211, 146, 82, 117, 152, 173, 194, 216, 237, 268, 299, 285, 271, 97, 161, 91, 21, 91, 161, 132, 103, 66, 30, 53, 76, 84, 92, 56, 19, -47, 123, 155, -51, -53, -54, -145, 1, -37, -77, -101, -125, -56, 11, -38, -88, -22, 44]
823D4n1n2PQPPK2K0K2K1K1K2K1K2k4k4k4k4k3k3k4k4M1M0M2M1jjjjn7n7O1O2k8k8k7k8j6j6
813b3J02J02L1L1j68j67R9J00j9j9OOOO%J%JL7L8q1q2k2k4k4k3J04J05j3j4J7J7J7J7RJ0R
804A92J0j9j8j9j8j9j8j8j9J2J2J2J2Q0P9m0m0l5l4l5l4K0K0K0K0K6K6r4r2l4l4l4l4R9R7
796D9k1k1j5j6j5j6k6k6R3R3rqj57Q1J35j02M7M7L2L2L2L1j5j6j6j6K2K1K2K1p8p9r3J45o
787A52pK4K3r7J42QPj9k0j9k0J8J7LK41j0rNNJ03J03J03J03q5q6q5q6j5j6j5j6j5j6j5j5j1
778C80j1j1j1J18J18jkR1R0k9k9K39K39K39K39j9k0J15j24k30k30o2o2P6j63m3m4K37kj45
771I43j45R0R1k9k8J57J58L8L8J54J53J53J53J76J75J61J61Kk36k37Kk28k29k14k14l3l2Q6
764A266Q7j45j44k5k5M4M5p4p5N0N0J69J69M2M2J62J61R8R8L9L8j42j42k62k61L0L0j68j69
$$ y = [44, -7, -59, -52, -44, -37, -30, -8, 12, 34, 55, 76, 98, 119, 141, 117, 93, 69, 45, 22, -1, -25, -49, -8, 32, 74, 115, 114, 113, 112, 111, 54, -3, 58, 120, 92, 64, 37, 9, -7, -23, 79, 181, 212, 243, 75, -92, 7, 107, 88, 69, 75, 81, 87, 93, 93, 94, 94, 95, 132, 170, 89, 7, -15, -39, -63, -86, 18, 123, 110, 96, 113, 130, 147, 164, 173, 183, 192, 202, 183, 165, 146, 128, 109, 91, 73, 54, 66, 78, 90, 102, 182, 261, 221, 181, 146, 112, 77, 43, 63, 83, 103, 123, 149, 175, 81, -11, -45, -79, -113, -147, -48, 49, 28, 7, -8, -24, -39, -55, -81, -107, -14, 79, 70, 62, -95, -14, 121, 19, 66, 113, 145, 177, 209, 240, 225, 209, 193, 177, 199, 220, 242, 263, 185, 106, 13, 158, 152, 145, 169, 192, 95, 237, 245, 252, 233, 213, 194, 174, 192, 209, 212, 453, 443, 434, 439, 444, 547, 650, 753, 856, 771, 685, 600, 514, 499, 483, 468, 452, 437, 421, 406, 391, 380, 369, 358, 347, 465, 583, 582, 580, 671, 761, 732, 703, 942, 1181, 1420, 1659, 1640, 1620, 1735, 1611, 1381, 1151, 1089, 1027, 1103, 940, 897, 853, 1090, 1088, 943, 798, 888, 979, 950, 922, 1079, 1237, 1275, 1313, 1467, 1620, 1773, 1926, 2102, 2277, 2438, 2599, 2601, 2365, 2128, 2130, 1902, 1673, 1459, 1245, 1212, 1180, 1266, 1353, 1208, 1064, 1039, 1014, 1058, 1103, 1029, 954, 1004, 1054, 1223, 1392, 1434, 1476, 1638, 1799, 1897, 1995, 2034, 2072, 1930, 1788, 1526, 1265, 1295, 1325, 1157, 988]
757I88n8n8O2O1J71J72j06j07j3j3M6M7n7n6j17j16M8M7J08J07P7P8J7J8j43j42q4q3J3J4
750I21J33J32Q3Q2l7l7L8L8L8L7q7q8q8q7Q2Q3K3K3m4m3P5P6L8L9L8L8p1p1j1j2Q8Q8l2l1
741A454Q0Q1K1K1R5R6k4k3J31J32P2P3r8r8K1K2J00R9J00J00n7n6K21K22O7O7n2n3M1M1J01
734B997J00J43J44K4K4O5O5O5O5O3O3O3O3J53J52J52J53J27J26J27J27J01J01J60J61J04J05
727E793K24K23K13K13K72K72K96K97K36K37L04L04M23M23L89L90N09N09O08O09J075J075J233
722A6127J711K088K088K817L612M059N171O973J0310J5096K0338J9550P633q154j6258j5813
718G7348j2159q187n486l520k408j633q39QQ03J339K452L687N118P004Q433J0640J2705J3897
713A09202J3419J4537J7874K2342K6949L2315L6605L4063J6745j0874l2958l8657l1826k2683
$$ y = [988, 930, 872, 934, 995, 1166, 1338, 1232, 1125, 1112, 1099, 1145, 1192, 1135, 1079, 962, 846, 894, 941, 1049, 1156, 1233, 1311, 1328, 1346, 1203, 1061, 977, 894, 907, 921, 1054, 1186, 1269, 1351, 1314, 1277, 1315, 1353, 1391, 1428, 1341, 1253, 1165, 1078, 1160, 1243, 1266, 1289, 1245, 1202, 1277, 1353, 1391, 1430, 1468, 1506, 1435, 1364, 1353, 1341, 1429, 1517, 1485, 1454, 1534, 1615, 1636, 1657, 1752, 1848, 1824, 1801, 1932, 2064, 2136, 2209, 2111, 2013, 2034, 2056, 2156, 2255, 2355, 2455, 2398, 2342, 2563, 2785, 2852, 2919, 2867, 2814, 2855, 2896, 2997, 3097, 3240, 3384, 3408, 3432, 3497, 3562, 3627, 3692, 3755, 3818, 3881, 3944, 4097, 4249, 4401, 4554, 4681, 4807, 4934, 5061, 5162, 5263, 5423, 5584, 5688, 5793, 6017, 6240, 6453, 6666, 6938, 7210, 7506, 7803, 8039, 8276, 8580, 8884, 9307, 9730, 10119, 10509, 11018, 11527, 12135, 12744, 13819, 14894, 16127, 17838, 19926, 22014, 24831, 28443, 32502, 37673, 44646, 54956, 70052, 90390, 109940, 117573, 109419, 93161, 77348, 65189, 57002, 51516, 47996, 45588, 43955, 43116, 43124, 43927, 45266, 47718, 51405, 56523, 63527, 71960, 82600, 95305, 109202, 122621, 137158, 155032, 177374, 204323, 236638, 273243, 307306, 324051, 313177, 280219, 241562, 209736, 187053]
710A87053j5852j1711r963r839r839q677o612m651k904n41J842N298Q953J2914J6250J7313
706A69034J7313K0242K6757L4412M0608M3646M4124L8606K0653m648k6414m3677n2097m7132
702B81427l5217k4361j8165j5692j5692j5330j3900j2018j0588r057p229m752j336K174N590
699A05854P973Q688J0219J4112J9385K6137L4493M2993M2109K5030Q319j81j3457l9274n7073
695B35327m9686l3252k1733j6103j2847j0562r530r614q899p995p281n981m471l071j880r51
691C1471p7P37J610K594M103O457R872J5999K4022K9176K1629k175k6245l3374k6463j7120
687D2216j0525o356m052k917k202j929j930j610j372j039o42o59m20m69m70l33l34n21j25
683D311Q6l12j82j83r9r9r9r9m0l9n4J84k9k9j4j5J06J05r3r3KLM7M7J07j31j95j96n1n1Q
$$ y = [187053, 171201, 159490, 149527, 139688, 129849, 121172, 114560, 109909, 107005, 106464, 108306, 113604, 122557, 135471, 151721, 169034, 186347, 206589, 233346, 267758, 308366, 352012, 396136, 434742, 455395, 450747, 424333, 380656, 328559, 281427, 246210, 221849, 203684, 187992, 172300, 156970, 143070, 131052, 120464, 111407, 104178, 99426, 98090, 100264, 105854, 113827, 122515, 132734, 146846, 166231, 192368, 226861, 269854, 311963, 336993, 345312, 345131, 331674, 292400, 235327, 185641, 152389, 130656, 114553, 101706, 91144, 81614, 72000, 63101, 55106, 47825, 41844, 37373, 34302, 32422, 31471, 31394, 32131, 33741, 36335, 40438, 46895, 56767, 72766, 96788, 125964, 147593, 145418, 119173, 85799, 59336, 42216, 31691, 25335, 21283, 18366, 16164, 14235, 12305, 10695, 9323, 8284, 7642, 6983, 6563, 6094, 5624, 5291, 4957, 4436, 4311, 4397, 4085, 3903, 3720, 3621, 3522, 3423, 3324, 3284, 3245, 3191, 3375, 3346, 3317, 3303, 3288, 3394, 3499, 3406, 3313, 3315, 3318, 3365, 3412, 3519, 3388, 3193, 2997, 2946, 2895, 2903]
675B903Qj83j83o4o4k4k4q4q3l4l4l4l4L3L3k6k7o6o6N3N3q9q8k9k9J25J24ONo5o6J34J33
667B214k7k6k7k6N6N7o2o3m2m3J8J7l5l5l5l5N3N3J12J13j86j85J3J3N2N2qqM3M3p6p6R7R6
659B107K16K15N2N2N1N2K9K9K9L0n3n3n3n3j7j7J02J02Q3Q4K4K3o5o4o5o5j1j0J09J09N5N6
651C083mlJ26J27J26J27J65J65J65J65J16J17N7N7K02K02MMk03k02j43j43NNJ23J24p6p6M3
644D458M3J8J8J9J8R5R5K15K14J28J29K47K48M88M88K90K90M9M9M9M9j56j56l7l6J04J04J79
637G699J78j61P7O2O2J51J51R2R2L21L22M25M26N21K83N36N36M77M77O10L72N80N80O98M61
631A6028N43N44M69P07P72J009J168J169J517J517J666K063K306K545K982L697L935M491N186
626E4314N742O230O944P337P337O647N455L504Q82j997m618o421p454p846p845p364o491n769
$$ y = [2903, 2911, 2728, 2545, 2481, 2417, 2393, 2369, 2285, 2202, 2168, 2134, 2100, 2066, 2099, 2132, 2106, 2079, 2013, 1947, 2000, 2053, 1964, 1876, 1847, 1818, 1943, 2067, 2073, 2078, 2013, 1947, 2081, 2214, 2187, 2161, 2134, 2108, 2164, 2221, 2159, 2096, 2054, 2011, 2029, 2046, 2011, 1976, 1941, 1906, 1959, 2012, 2124, 2237, 2051, 1866, 1879, 1892, 1944, 1996, 1988, 1980, 2023, 2066, 1990, 1914, 2011, 2107, 2323, 2538, 2590, 2642, 2693, 2745, 2774, 2803, 2832, 2862, 2809, 2756, 2703, 2650, 2633, 2616, 2718, 2820, 2903, 2987, 3011, 3034, 2969, 2905, 2840, 2775, 2764, 2754, 2863, 2972, 3027, 3083, 3079, 3076, 3202, 3329, 3455, 3582, 3747, 3912, 4077, 4242, 4358, 4475, 4532, 4589, 4791, 4993, 4997, 5001, 4798, 4596, 4453, 4310, 4315, 4320, 4443, 4567, 4491, 4415, 4458, 4501, 4519, 4537, 4556, 4574, 4669, 4764, 4979, 5193, 5321, 5450, 5697, 5945, 6433, 6921, 7211, 7501, 7550, 7599, 7648, 7697, 7541, 7385, 7348, 7312, 7416, 7520, 7699, 7877, 7716, 7793, 7855, 7917, 8068, 8219, 8311, 8403, 8724, 9046, 9471, 9897, 10418, 10701, 11237, 11773, 12250, 12727, 13337, 13709, 14289, 14869, 15567, 16028, 16571, 17115, 17584, 18291, 19063, 20072, 21240, 22409, 23926, 25443, 27109, 29172, 31478, 34023, 37005, 40702, 44637, 49128, 54314, 60056, 66286, 73230, 80567, 87904, 94551, 100006, 103510, 104392, 102395, 97777, 91356, 83902, 76056, 68211, 60847, 54356, 48587]
622D8587n054m459l903l426l028k582k185j996j599j494j257j181j182j023p85q03q04n90
617A1236n90m91m90l47l47n37j39j64j65k73k74j54j54k11k11r2r2n4n5j74j73n2n2n2n3k08
611E632k08k5k5jk40P8P8K09l0L0K9Q9j49l0K08J1J1K5K6J8J8LK41q3q4N0N0J30J30J45r3
603F243l9l9J45J45L5L4J54J54j1j2M8M9J99J99O5O5J95m3P6L15J07J07J38j02J82J82M8M7
597H686J93J92P3P3J38J38L46J08J36L74K85K86K51K52J32J33L29L30L89L90L00L00K40K41
591A4315J45J45K64K64K94K94M92M93M75M75N35N35P32P32Q76J114J527J527J899K296K788
586C2217L821M754N786O745O189L870J249K36K36O33O33K62k93o76m37L22Q79J374J931K608
581G2339L163L700M573N566O758Q039R072R318Q922Q509Q271P988P988P517O007L868J406
$$ y = [48587, 43533, 39074, 35171, 31745, 28717, 26135, 23950, 21954, 20355, 18861, 17604, 16423, 15241, 14218, 13433, 12630, 11826, 11236, 10646, 10155, 9665, 9318, 8971, 8434, 8295, 8131, 7966, 7693, 7419, 7265, 7111, 6900, 6689, 6597, 6505, 6451, 6396, 6222, 6049, 5997, 5945, 5893, 5840, 5632, 5424, 5399, 5374, 5373, 5133, 5211, 5289, 5498, 5468, 5498, 5527, 5616, 5467, 5437, 5645, 5656, 5667, 5692, 5718, 5736, 5754, 5757, 5998, 5915, 5831, 5881, 5931, 6061, 6191, 6336, 6243, 6204, 6165, 6310, 6455, 6490, 6524, 6678, 6832, 6821, 6809, 6857, 6906, 7105, 7304, 7369, 7434, 7629, 7586, 7662, 7977, 8084, 8191, 8329, 8227, 8409, 8591, 8639, 8686, 8879, 9071, 9144, 9217, 9355, 9493, 9839, 9947, 10083, 10457, 10742, 11028, 11279, 11531, 11663, 11796, 12125, 12455, 12844, 13234, 13534, 13834, 14074, 14315, 14460, 14605, 14869, 15133, 15427, 15721, 16213, 16706, 17181, 17656, 18191, 18726, 19458, 20190, 21066, 22180, 23707, 25234, 27133, 29429, 32217, 36038, 40792, 46578, 53323, 59512, 63382, 64631, 64867, 65103, 65736, 66369, 66631, 66338, 65662, 65225, 65547, 66426, 67800, 69731, 72339, 75502, 79202, 83775, 89341, 96099, 104138, 113210, 122528, 131450, 139959, 148230, 156218, 164206, 171723, 177730, 181598, 183004]
577A83004o79j713j310m36O17Q54L05m11r84j540j865j746j242l68J236K905M881P184R637
572A98329J1941J3589J4145J3104J1435R161O857M311K165M48r03k400n023q388j0375r699
568B48697p713n092k947j493j096j434j830k030k585l082l638l705k831j144O84J796K194
564B12751J408Q53R12K262M020M893M794L285N54k067l970n003n218n338n683o080p264q774
559A86335j0381j1413j1374j0182q644o975n386m035k729j537l76O58J635K668L512M227M233
555A30236L836K109l7j769k802l261m135m611m729m300l586k664j631p83o7L23L24N19P58
551A03730J125J245J473J353J098J337J205J443J507J905K362K599L084L798M215M772N526
546A43777O241O971P209P280P280P155O441N811N413M961M088L862L067K482K005J837J598
$$ y = [183004, 182325, 180612, 179302, 178866, 179483, 180337, 180642, 180231, 179247, 177707, 175842, 174096, 172854, 172486, 173722, 176627, 181508, 188692, 198329, 210270, 223859, 238004, 251108, 262543, 271704, 278561, 282872, 285037, 285485, 284582, 282182, 277159, 268771, 258396, 248697, 240984, 235892, 232945, 231452, 230356, 228922, 227092, 225062, 222477, 219395, 215757, 212052, 209221, 208077, 208761, 210557, 212751, 214159, 215012, 215924, 218186, 222206, 227099, 231893, 235178, 235732, 233665, 229695, 224692, 219474, 214136, 208453, 202373, 195109, 186335, 175954, 164541, 153167, 142985, 134341, 127366, 121980, 117945, 115216, 113679, 113303, 113961, 115596, 118264, 121776, 126003, 130236, 134072, 136181, 136144, 134375, 131573, 128312, 124177, 119566, 114837, 110537, 106951, 104287, 102656, 101873, 101806, 102129, 102453, 102972, 103730, 104855, 106100, 107573, 108926, 110024, 111361, 112566, 114009, 115516, 117421, 119783, 122382, 125466, 129264, 133479, 138251, 143777, 150018, 156989, 164198, 171478, 178758, 185913, 192354, 198165, 203578, 208539, 212627, 216489, 219556, 222038, 224043, 225880, 227478]
542B27478J235J236J062N85O9O9K03R97K358L787M908N384N404N404M947M947M714M476M783
538B84046N895P202Q631Q998P887N657L592K268K030K392L187M026M820N307N306M801M323
534C70368L773L296L356L117L301M413N718P465R808J2510J4421J5215J5434J4322J1571P599
530E05687L588N69j064n88K093N747Q575J0958J2844J4910J6598J7710J8420J8658J8076J7282
526F70063J6076J4010J0817Q117P029O791O490O012O723P517P751O320K667j941n878q262
522G60302q976q499o152k814n5K012M455P157R103J0851J3229J6883J9311K0105K1712K1949
518H80573K1687J9939J6712J5281J6136K0426K5476K7859K6866K3530J9578J6877J5208J5685
514A161833J7800K0817K4254K8543L3095L8339M5285N2752N6986O1514O5938O9513P2297P0630
$$ y = [227478, 228713, 229949, 231011, 231596, 231665, 231734, 231937, 232934, 235292, 239079, 243987, 249371, 254775, 260179, 265126, 270073, 274787, 279263, 284046, 289941, 297143, 305774, 314772, 322659, 328316, 331908, 334176, 336206, 338598, 341785, 345811, 350631, 355938, 361244, 366045, 370368, 374141, 377437, 380793, 383910, 387211, 391624, 397342, 404807, 414615, 427125, 441546, 456761, 472195, 486517, 498088, 505687, 509275, 509844, 508780, 508192, 510285, 516032, 524607, 535565, 548409, 563319, 579917, 597627, 616047, 634705, 652781, 670063, 686139, 700149, 710966, 719083, 726112, 732903, 739393, 745405, 752128, 759645, 767396, 773716, 776383, 774442, 768564, 760302, 751326, 742827, 736675, 733861, 733806, 735818, 740273, 747430, 756533, 767384, 780613, 797496, 816807, 836912, 858624, 880573, 902260, 922199, 938911, 954192, 970328, 990754, 1016230, 1044089, 1070955, 1094485, 1114063, 1130940, 1146148, 1161833, 1179633, 1200450, 1224704, 1253247, 1286342, 1324681, 1369966, 1422718, 1479704, 1541218, 1607156, 1676669, 1748966, 1819596]
511A819596O2686N4663N5180O4157P5139Q9040J09491J34991J63757J97518K40492K91729
508C358439L53283M29465N15412O12087P20709Q39469R59904J039262R72354O11310j02034
505A0309660r33035j460224j524649j310586j031520p88291o01850m63087l58467k78821k19957
503A339173j77258j44132j17947r8327q3426p1591o1949n4243m7039l9651l3981k9453k5417
500C54759k2636k0333j8347j6769j5896j5260j3909j2390j0246q637r192q182o990o026n153
496A64793m935n333n522n918o018o256o326o087n893n654n059m661m412m015l499l261l116
492G8828k879k560k561k303k304j797k035l021k783k554j998j675j437j520j521q34n94m22
487D4030o59r84j380j674j673j242j003j242j241j424j184j121j120j025j024q26q27o15o15
$$ y = [1819596, 1882282, 1936945, 1992125, 2056282, 2131421, 2220461, 2329952, 2464943, 2628700, 2826218, 3066710, 3358439, 3711722, 4141187, 4656599, 5268686, 5989395, 6828864, 7788768, 8828030, 9800384, 10411694, 10309660, 9376625, 7916401, 6391752, 5081166, 4049646, 3261355, 2659505, 2196418, 1837951, 1559130, 1339173, 1161915, 1017783, 899836, 801509, 718083, 646492, 584543, 530300, 483261, 443610, 409629, 380176, 354759, 332123, 311790, 293443, 276674, 260778, 245518, 231609, 219219, 208973, 200336, 191144, 182962, 175972, 169946, 164793, 159858, 154525, 149003, 143085, 137067, 130811, 124485, 118398, 112505, 106851, 101792, 97131, 92719, 88704, 85205, 81944, 78828, 75949, 73389, 70828, 68525, 66221, 64424, 62389, 59368, 56585, 54031, 52033, 50358, 48921, 47401, 45880, 45046, 44452, 44030, 43371, 42387, 41007, 39333, 37660, 36418, 35415, 34173, 32932, 31508, 30324, 29203, 28083, 27058, 26034, 25208, 24381, 23766, 23151]
483B3151n21n20l04K53Mj028r11r10o97o96n88n87m69m68l47l46o9o9l31l32j33j34j25j25
477A3698k55m93l64j25j30j31P1M68Q45J30o89o89k97k96Q2Q3j17j16j42j42N6N6j40j39k00
471A1024j99p2p1q7q6l8k77N6N6P3P4o1J78P2P2K21j7J29J29K19j79j09j10j35j35l7l8O6
464A0718l31o3o4J10J10j28j28P1P0J5J5J34J34K94K94K35K34l7l8K95N7N1N0J40J40J66p2
457A2472n7n7K4K5K5K4O7O7J07j32o8L28K10K10L38L38K29M67R85M28j57j57K8K7J62p6J45
451A6002J46o8o7PPO7O7N8N9o1o1Q4Q4Q4Q4J7J7J36J36J86J85K01l8k48k48l37r9k87k87j53
443A5673j53j54j54l6l5j98j98j99j98k19k20k64k64l28r1j05j05j79j78n9o0k63k64k64k64
437A1221j87j87j87j86k51k50k50k50j81j80j81j81k57k57k58k57j25j24j25j24j69j70j09
$$ y = [23151, 22630, 22110, 21806, 22059, 22063, 21035, 20124, 19214, 18517, 17821, 17233, 16646, 16177, 15709, 15362, 15016, 14947, 14878, 14547, 14215, 14082, 13948, 13823, 13698, 13443, 12950, 12586, 12461, 12331, 12200, 12271, 12739, 13584, 13714, 13025, 12336, 12039, 11743, 11825, 11908, 11791, 11675, 11533, 11391, 11447, 11503, 11363, 11224, 11024, 10825, 10753, 10682, 10595, 10509, 10471, 10194, 10250, 10306, 10379, 10453, 10392, 10570, 10642, 10714, 10935, 10918, 11047, 11176, 11395, 11216, 11107, 10997, 10862, 10727, 10690, 10652, 10718, 10387, 10324, 10260, 10370, 10480, 10352, 10224, 10295, 10365, 10380, 10395, 10529, 10663, 10957, 11251, 11486, 11720, 11683, 11645, 11940, 11997, 12048, 12098, 12238, 12378, 12544, 12472, 12415, 12358, 12382, 12407, 12432, 12456, 12523, 12590, 12697, 12565, 12497, 12825, 13035, 13245, 13583, 13921, 14150, 14617, 15602, 16030, 15873, 15716, 15744, 15771, 15933, 15857, 16002, 16148, 16080, 16013, 16020, 16027, 16094, 16161, 16219, 16278, 16217, 16156, 16240, 16324, 16408, 16492, 16509, 16526, 16662, 16798, 16984, 17169, 17370, 17332, 17084, 16836, 16499, 16400, 16113, 15826, 15673, 15520, 15366, 15212, 15176, 15141, 14943, 14745, 14546, 14348, 14129, 13909, 13645, 13381, 13053, 12962, 12857, 12752, 12573, 12395, 12336, 12276, 12013, 11749, 11485, 11221, 11034, 10847, 10660, 10474, 10223, 9973, 9723, 9473, 9292, 9112, 8931, 8750, 8493, 8236, 7978, 7721, 7596, 7472, 7347, 7223, 7054, 6884, 6775]
432F775j10r3r4K6K6k78k78j59j59q7q7k06L2j36J02M29Q27J201j49j340r44o16o1j25J13
425D609J03J03J4J4J05L44J61p8j4K25J80J80J93m7j90j90j75j75j90M8j63j62k9k9K1K1r8
419D781r8M8M8J12L51M95M94J97J97N26J241K149J117j863k259j495p80o33l96k61k2m6m5
413C858j5j5k21J9J8J8r9J40OOJ35J36J36J36K66K66J81J82n9m56n66l27k56k57j22j23QQ
406C003QQl6l5j70O9o3o3K7K6K3K61QQJ26J27K30K31J96m2k51k51l18q0%%p6J62j65P3N2N3
399C141O7O7K26K25L29L29j06l45j96j95j14J24j43R5P0P1J01J00p3J65o3o4m2L55K41J115
392E480Q27l63j024m68j16j16k1k1lllK36K0K60j39j38O7O7K01K00p1J66J17J17J01M98R95
386F866R94l11q67o79L6J7J6J81J80P4P4N8K98K00K01K15K15K01K00J36j02J06J06K10K11
$$ y = [6775, 6665, 6572, 6478, 6504, 6530, 6252, 5974, 5815, 5656, 5569, 5482, 5276, 5308, 5172, 5274, 5703, 6530, 7731, 7582, 6242, 5298, 4682, 4621, 4496, 4609, 4712, 4815, 4829, 4843, 4948, 5292, 5453, 5375, 5361, 5586, 5766, 5946, 6139, 6092, 5902, 5712, 5537, 5362, 5172, 5220, 5057, 4895, 4866, 4837, 4858, 4879, 4781, 4683, 4731, 4779, 4891, 5242, 5737, 6231, 6428, 6625, 7151, 8392, 10541, 11658, 9795, 7536, 6041, 5261, 4628, 4232, 3971, 3949, 3903, 3858, 3843, 3828, 3607, 3626, 3644, 3662, 3563, 3703, 3709, 3715, 3850, 3986, 4122, 4258, 4524, 4790, 4971, 5153, 5094, 4638, 4072, 3745, 3489, 3232, 3110, 2987, 2995, 3003, 3011, 3019, 2983, 2948, 2778, 2847, 2784, 2721, 2748, 2774, 2797, 3058, 3066, 3074, 3200, 3327, 3557, 3788, 3984, 3942, 3691, 3440, 3122, 3042, 3042, 3042, 2966, 3128, 2963, 3036, 3088, 3141, 3208, 3275, 3501, 3726, 4055, 4384, 4278, 3933, 3737, 3542, 3428, 3552, 3409, 3504, 3574, 3645, 3746, 3846, 3773, 3938, 3875, 3811, 3769, 4124, 4365, 5480, 6307, 5944, 4920, 4452, 4336, 4220, 4199, 4178, 4175, 4172, 4169, 4405, 4425, 4685, 4546, 4408, 4475, 4542, 4743, 4943, 4872, 5038, 5155, 5272, 5373, 5871, 6866, 7860, 7549, 6682, 6003, 6039, 6056, 6072, 6253, 6433, 6507, 6581, 6639, 6937, 7137, 7338, 7553, 7768, 7969, 8169, 8305, 8203, 8309, 8415, 8625, 8836]
379H836K00K00K01K00L13L13L13L13L79L79L20L19K64K63L83L83M03M03N08N08O72M33M23
374A6929J85L07L06M36O74N25N25M66M66Q47O09O84O83Q20Q21R39R39J199J199J198J199J354
368C3310J354J413J414J940J940K138K139K279K279K750K751L720M276N214N612P081Q431
364I0041J0517J1232J1922J4544K1017L0312L9586L8078L2496L9090O4684R3837R7055M2004
361F36415l1784o1731n3967m1336l0338k4062j8431j7081j5498j3670r480p812m249j787M588
357C09777R592J9498K4979M1740O8511J18467R1696J098M0260J85270M13654M89894r3736
354A720700n41489m06842k28403j26803q2277n2012l6879k0276j2329q596j2438j1246r222
351A71888k945J43O100Q964J4128J7792K3431L1555L9736L2239K9301M6684Q5848J20940P8916
$$ y = [8836, 9036, 9236, 9437, 9637, 9950, 10263, 10576, 10889, 11268, 11647, 11967, 12286, 12550, 12813, 13196, 13579, 13982, 14385, 14893, 15401, 16073, 16506, 16929, 17114, 17421, 17727, 18163, 18837, 19362, 19887, 20353, 20819, 21666, 22275, 22959, 23642, 24462, 25283, 26222, 27161, 28360, 29559, 30757, 31956, 33310, 34664, 36077, 37491, 39431, 41371, 43509, 45648, 47927, 50206, 52956, 55707, 59427, 63703, 68917, 74529, 81610, 90041, 100558, 111790, 123712, 138256, 159273, 189585, 229171, 267249, 299745, 338835, 403519, 497356, 594411, 636415, 604631, 542900, 488933, 447597, 417259, 393197, 374766, 357685, 342187, 328517, 319037, 311225, 306976, 305189, 309777, 319369, 338867, 363846, 405586, 474097, 592564, 684260, 685358, 725618, 910888, 1324542, 1814436, 1720700, 1179211, 772369, 543966, 417163, 334886, 282874, 245995, 225719, 213390, 204794, 192356, 181110, 171888, 168943, 169086, 175186, 184150, 198278, 216070, 239501, 271056, 310792, 343031, 372332, 419016, 504864, 625804, 704720]
347G04720n2821j42665j45357j08100p1455m4366k9272j9343j3187p705n586n188p200p201
344D5274o758m613l775k583k424j868k241k004j715j000j085n29q86l30p68l71o54o54p09
339A0307l11l76K1l23P3l54j15n02j06m03on3J85m25m25m55k17k71l3j04J34l27l27k90n2
333E245l6k76k90n2o6o7j99L8l5l6k31k30q7J52j67j68qK30j08j07k12K6j11J27K2K3k69l1
326C077J18k79j84j85O9O8m2m3j02j02q5q4p0p0j18J20p4p3k0k0J73o5M4M4P4P4M8j91l39
319A763N7l6l7J37j01j68P0j9j9n0n0o4o5J72o5QRJJP6j63l2l3J3J2L2L1j02J36ooRJ0O2O3
310A646j31j31J03j34jjj4j4j5j4j0j1k5k6J21j17P6P7j1j1J24j15l3l3N2N1J1J1J44r4j4
303A461j4J94k03j9j9R5R5J9J8J44J43L46J08J44J43K72K72R07O70J03m53m13m13k98k97r5
$$ y = [704720, 651899, 509234, 363877, 255777, 184322, 139956, 110684, 91341, 78154, 70449, 64863, 59675, 52475, 45274, 38516, 33903, 30128, 27545, 25121, 23253, 21012, 19008, 17293, 16293, 15208, 14679, 13793, 13463, 12695, 12324, 11670, 11016, 10307, 9996, 9620, 9641, 9318, 9391, 9037, 8922, 8420, 8314, 7911, 7905, 7852, 8037, 7612, 7187, 6732, 6515, 6244, 6211, 6107, 6241, 5914, 5587, 5297, 5245, 5209, 4933, 4643, 4591, 4525, 4458, 4259, 4297, 4262, 4226, 3995, 3765, 3678, 3830, 3663, 3495, 3487, 3717, 3609, 3502, 3290, 3316, 3205, 3332, 3354, 3377, 3108, 3077, 3195, 2916, 2732, 2547, 2616, 2684, 2642, 2599, 2497, 2395, 2310, 2226, 2156, 2086, 1968, 2088, 2014, 1941, 1921, 1901, 2074, 2009, 2053, 2097, 2171, 2245, 2293, 2102, 1763, 1820, 1784, 1747, 1884, 1783, 1615, 1685, 1666, 1647, 1597, 1547, 1483, 1418, 1590, 1525, 1533, 1542, 1543, 1544, 1620, 1457, 1425, 1392, 1405, 1417, 1449, 1480, 1378, 1514, 1508, 1502, 1511, 1521, 1583, 1646, 1515, 1384, 1487, 1353, 1352, 1351, 1337, 1323, 1308, 1294, 1284, 1273, 1248, 1222, 1343, 1226, 1302, 1379, 1368, 1357, 1481, 1366, 1333, 1300, 1352, 1403, 1414, 1425, 1569, 1475, 1461, 1447, 1641, 1438, 1419, 1400, 1495, 1590, 1609, 1627, 1771, 1914, 2260, 2368, 2512, 2655, 2927, 3199, 4106, 4776, 4879, 4426, 4013, 3600, 3302, 3005, 2910]
297B910r4nk43j19J19k0k58K9L0J14J15J14J14M60M59Q07K51P8O33J845K877J053k522k859
291E888j668r88n90k04k03k05k06J3J3q2q3J7J7J8J8J8J8J41J40K80K80J68J67M16O54Q63
284D900L06p66j163r25n29k94n7k59k59R4R4l5l4l4l4j3j4j3j3p7p7p7p7NNO4O5n8n8M2M2
277G51K5K5K6K5j12j12j3j3N4N4ook5k5k5k6P7P6k3k2j4j3j4j3mmN6N6k2k2k3k2K3K3l6l6
268F40m5m5R5R4r6r6M4M3k0j9k0j9J1J2m8m9J29J28n1n0J6J6J7J6k5k5k5k5l4l3l4l4P9P8
260F25o0o1R5R5q4q4l5l5O4O5JJn9n9RQRQm0m0R9R9n0n0RR%jo0o1n1n2J27J27l8l7l8l8N6
250D73N6j23j22J40J41Q0Q1o0o1o0o1M1M1M2M1m9m8j09j08R8R8R8R8o2o1kkj0rj0rKLn8n7
242D52P3P3j05j06P5P5J5J5j5j6j6j5L4L4k6k6q9q9J1J0R1R1q8q8O9O9l1l1M8M8n1n2jkkk
$$ y = [2910, 2816, 2811, 2568, 2449, 2568, 2548, 2290, 2319, 2349, 2463, 2578, 2692, 2806, 3266, 3725, 4532, 4783, 4861, 5494, 7339, 10216, 11269, 8747, 5888, 4220, 3232, 2642, 2438, 2235, 2030, 1824, 1837, 1850, 1768, 1685, 1702, 1719, 1737, 1755, 1773, 1791, 1932, 2072, 2352, 2632, 2800, 2967, 3383, 4037, 4900, 5206, 4440, 3277, 2352, 1823, 1529, 1472, 1213, 954, 1048, 1142, 1107, 1073, 1039, 1005, 992, 978, 965, 952, 875, 798, 721, 644, 649, 654, 718, 783, 725, 667, 709, 751, 776, 801, 827, 852, 740, 628, 615, 602, 656, 710, 704, 698, 673, 648, 623, 597, 674, 750, 727, 705, 691, 678, 664, 651, 647, 643, 699, 755, 733, 711, 688, 666, 689, 712, 676, 640, 595, 550, 645, 739, 643, 547, 591, 634, 614, 595, 575, 556, 567, 579, 531, 482, 611, 739, 688, 638, 654, 670, 687, 703, 678, 653, 628, 603, 569, 536, 502, 468, 547, 625, 565, 504, 599, 694, 610, 526, 491, 456, 520, 585, 586, 587, 528, 469, 478, 486, 495, 503, 463, 423, 522, 621, 571, 521, 530, 539, 539, 538, 478, 417, 366, 314, 441, 568, 530, 493, 455, 417, 473, 529, 406, 284, 424, 565, 645, 726, 666, 605, 545, 484, 525, 566, 608, 649, 600, 552, 443, 335, 433, 531, 629, 727, 665, 604, 602, 600, 590, 581, 571, 562, 564, 567, 509, 452, 525, 598, 493, 387, 462, 537, 552, 567, 552, 536, 520, 505, 539, 573, 547, 521, 432, 343, 354, 364, 455, 546, 458, 370, 439, 508, 477, 446, 494, 542, 491, 439, 438, 436, 434, 432]
233D32L1L1L1L2L1L1L1L1o8o8o9o8M8M7M7M7r2r3PPj0j1j49K48Q0j59J%l0l1J09J08r7r8K
224C89KK8K8K7K8K0K0Q0Q0j03j03j03j03L1L1L2L1L3L4o6o5N3N4poK5K5l5l5LMLLM0M0M1M0
215E99N5N6q4q3q0q0N9N9%%O0O0k9k8L1L1o8o8o8o9O2O2LKm4m4J6J5n5n5MNppppQ2Q3j7j7
205D27k3k4k4k3LMn6n6L3L3L2L3n3n2Q6Q6K3K4l6l6p1p1p1p0P4P5m5m4O7O8j27J12O2O3k06
197B17J91r1r2J86n1P0P0o4o4L2L2q8q7J9J8P9P8ooO8j70j0j1R4R4n9n8p4p4P3j66Q7Q7k8
188B96k9L1L2k4k3k4k3j8j7J02J02l2l1m7m6J64p3O0O0l1l1j50Q8j03J36J6J6q0q0L9M0o9
181B51o9N0N1K8K8l1l1p5p5M5M4J15J16k9k67J27J28l1l2J97k01K2K3j7j7j7j8P5P4Q9j50
173D03p2p2L1L2J6J6L1k08l8l9K00l9q8q8Q1Q2K15k4q7q8J01J00j9j8o6o6o6o5POJ26J26l8
$$ y = [432, 463, 494, 525, 557, 588, 619, 650, 681, 613, 545, 476, 408, 456, 503, 550, 597, 505, 412, 419, 426, 416, 405, 256, 504, 584, 425, 426, 426, 396, 365, 474, 582, 485, 387, 389, 391, 419, 447, 474, 502, 522, 542, 622, 702, 599, 496, 393, 290, 321, 352, 384, 415, 448, 482, 416, 351, 404, 458, 451, 445, 470, 495, 460, 425, 428, 432, 435, 438, 478, 518, 559, 599, 654, 710, 626, 543, 463, 383, 442, 501, 501, 501, 561, 621, 592, 564, 595, 626, 558, 490, 422, 353, 415, 477, 480, 482, 438, 394, 410, 425, 370, 315, 319, 324, 317, 310, 303, 296, 378, 461, 444, 427, 404, 380, 356, 333, 336, 340, 284, 228, 261, 294, 326, 359, 306, 254, 340, 426, 449, 473, 437, 401, 330, 259, 188, 118, 192, 267, 222, 178, 245, 313, 186, 298, 360, 423, 217, 408, 317, 225, 411, 360, 430, 500, 436, 372, 404, 436, 348, 261, 280, 298, 377, 455, 449, 443, 511, 341, 331, 320, 414, 508, 449, 391, 317, 243, 316, 150, 237, 324, 296, 267, 298, 330, 306, 283, 259, 236, 218, 201, 303, 405, 373, 342, 295, 249, 413, 340, 400, 460, 429, 398, 248, 336, 233, 369, 385, 401, 321, 241, 280, 320, 251, 182, 232, 283, 311, 339, 308, 277, 202, 127, 172, 216, 331, 447, 418, 151, 278, 406, 375, 343, 540, 339, 361, 384, 367, 350, 333, 315, 390, 464, 553, 403, 331, 259, 290, 322, 338, 354, 385, 177, 139, 100, 300, 261, 173, 85, 166, 248, 463, 439, 352, 264, 365, 465, 446, 428, 362, 296, 230, 165, 172, 178, 304, 430, 392]
165C92l7l8l8K9K9r0r0O0O1%JM1M1M1M1q0p9M0L9j8j8j9j8j1j1j1j0J8J8J9J8qqpqo2o2lk
155A60Q4Q5l5l5k4k4L5L5o9o8j0rK1K2K1K2K1K2K1K2O3O3LMN6N5j43j43K5K6l5l4K3K2Q3Q2
147D47q3q4q3q4K6K6K6K6K6K6l4l3N9O0o0o0P1P1m9m8k6k7L4L3M8M7j2j2q8q8L1L1rj0N0N0
138B98j5j5j4j5q2q2R7R7K9L0j5j5j19J18j5j5qqj42R7QQl6l7K1K1K1K0M8M8n2n1QQn2n2N9
129A96N8P4P3j94M5j04j04J61p7N8N7k7k8k7k7K8K9K8K8o1o1o1o1L8L9J87n1j75O3J32j05
121A31J66p2j46R2Q2Q2m3m2M6M5p9p8r2J48q7q6N9O0j%QQRQj16j15O2O3R0R1m9m9j9j9j53
113DQ5L7L6j27j26R1R0rqJ6J6J31J30j91M7J2J3N9O0m0m0k8k9p3p3JK40OOllo2o3L2L2k8k7
104B14qqN2N2MNr5r5p0o9j1j1K1K1Q1Q1klo2o2M3M2j7j8QQO7O7J6J5J5J5n7n7l2l2j29K68
$$ y = [392, 355, 317, 279, 308, 337, 247, 157, 217, 278, 278, 279, 320, 361, 402, 443, 363, 284, 324, 363, 345, 327, 308, 290, 279, 268, 257, 247, 265, 283, 302, 320, 312, 304, 297, 289, 227, 165, 162, 160, 244, 329, 294, 259, 235, 211, 246, 281, 212, 144, 134, 125, 146, 168, 189, 211, 232, 254, 275, 297, 360, 423, 426, 430, 486, 541, 398, 255, 280, 306, 271, 237, 260, 282, 365, 447, 364, 280, 197, 113, 139, 165, 191, 217, 243, 269, 235, 202, 261, 321, 261, 201, 272, 343, 294, 246, 220, 193, 227, 260, 308, 355, 343, 331, 243, 155, 186, 217, 208, 198, 248, 298, 283, 268, 254, 239, 157, 75, 172, 269, 298, 328, 313, 298, 179, 297, 282, 267, 259, 251, 109, 206, 214, 222, 186, 149, 170, 191, 212, 232, 280, 328, 276, 225, 233, 241, 189, 137, 196, 254, 328, 401, 207, 252, 148, 44, 205, 128, 186, 243, 216, 188, 161, 134, 162, 191, 219, 247, 186, 125, 64, 3, 41, 80, 267, 216, 41, 104, 236, 131, 297, 225, 79, 171, 253, 335, 292, 250, 296, 341, 262, 184, 92, 240, 153, 67, 126, 186, 185, 185, 193, 201, 210, 218, 102, -13, 49, 112, 202, 293, 244, 195, 176, 157, 4, 89, 126, 162, 35, -91, 0, 90, 81, 73, 89, 105, 236, 366, 175, 222, 234, 247, 306, 366, 326, 286, 258, 229, 156, 83, 84, 324, 330, 336, 333, 330, 268, 205, 237, 269, 241, 214, 206, 198, 250, 302, 306, 311, 216, 121, 51, -18, -29, -40, -19, 2, 83, 164, 162, 159, 97, 35, 78, 120, 103, 85, 93, 101, 168, 235, 251, 266, 281, 296, 239, 182, 150, 118, -11, 257]
94B57j5j5l7l6K3K3n4n4OON6N6m3m4n3n3n2n4O3O2O3O3M1M0j9j9%jr9j00R7R6q2q3R8R8jj
85B33j07j07P2P2J3J4J4J3o5o4nnP2P2k7k7POOPk8k7L2L2m3m4J6J7N6N6q3q3QPQQRRr0q9O2
75B7O2l7l6N1N1q7q7N9O0O0O0r4r2J9K0l4K04K5k13ONj0rjjp4J62J18J18Q9j50k3k3K1K2j25
66A43j25r4J43O6j71P5P7k9l0N6N5J84n4r8r9J4J5q5q4J26J27LMj46R2m2m2k4k5k4k4P2P2
58A28K7K8r8J41Q1j58k4k5q9J49J60p8k8k8p4p3p3p4J0RP0O8J06J07PQj22j22k2k2P3P4J5
50A51J4M7M7n3n2o0n9K6K5R3j44J23j15M1M2l3l3L6L7L6L7j2j2Q8Q8m4m4j04j03OPJ40r8N
42A23NQ0j59j09J26L9L8j40j40J72J72k47j0J68o9K1K1OPq7q5N3N1M3M3j07J32N3j86K2K3
34E9j0j0N0N0j0j0j0rJ13J13J4J3J03J02K26j70k60k61J3J3L0K9p0p0mmJ1J1j46R2N6N7on
$$ y = [257, 242, 227, 190, 154, 177, 200, 146, 92, 98, 104, 160, 216, 173, 129, 76, 23, -29, -83, -20, 42, 105, 168, 209, 249, 230, 211, 211, 210, 111, 11, 108, 204, 122, 39, 137, 235, 234, 233, 126, 19, 91, 163, 176, 190, 204, 217, 152, 88, 83, 78, 150, 222, 195, 168, 175, 181, 187, 194, 166, 139, 171, 203, 160, 116, 132, 149, 205, 261, 178, 95, 103, 110, 118, 126, 135, 144, 54, -35, 27, 89, 52, 16, 67, 118, 31, -56, 3, 63, 123, 183, 89, -3, 16, 36, 2, 206, 231, 18, 24, 29, 19, 10, 9, 8, -66, 96, 214, 332, 421, 271, 248, 225, 246, 268, 143, 18, -76, 67, 133, -38, 37, 114, 85, 55, 111, 166, 350, 296, 198, 99, 113, 128, 43, -41, 85, 212, 215, 219, 73, 165, 123, 81, 57, 32, 8, -16, 56, 128, 155, 183, 85, 226, 307, 149, 125, 100, 11, 160, 320, 242, 214, 186, 112, 39, -34, -108, -98, -89, -19, 49, 155, 262, 269, 277, 155, 33, 11, -11, 62, 136, 151, 165, 212, 259, 206, 154, 94, 35, 61, 86, 179, 35, 158, 43, 84, 126, 93, 60, 96, 133, 169, 206, 194, 182, 270, 358, 314, 270, 166, 63, 69, 76, 216, 118, 123, 128, 208, 49, -60, 66, 105, 143, 3, -137, 35, 207, -40, -50, 118, 49, 70, 91, 97, 104, 17, -68, -15, 36, 79, 122, 15, 147, 200, 14, 36, 59, 49, 39, 89, 139, 129, 119, 109, 100, 213, 326, 340, 353, 456, 558, 784, 614, 354, 93, 106, 119, 149, 178, 108, 38, 34, 30, 41, 52, -94, -2, 54, 111, 105, 100]
26A00nnn7n6Q1Q2N3N4m6m6nnj04j03P6P7J66p2j65P4j5j6k2k1L7L8l6l6l4l6RQJ27j09J02
17I0j34O8O8J38j00o6o5k0k1k0k1LLO3O1O3O3l7l7p5p4J17j19N6N6M1M2n2n2QQl8l7O0O2R
8A11RO8O9l3l2K6K7K3K3p6p6l3l3l3l3rrj0rJ1J0J0J1N6N6m4m4l4l4K5K4Q5Q6r3r3jjjkM3
-1D0M3n6n5L0L1L1L1m9m8m8m9R1R0L1L2JJKJq4q4J4J4qpR1R1j9j8j9j9M7M7n2n3l8l8K2K2
-11E9L7L8o2o1jjjkR4R3q6q5J5J4J5J5n6n5M2M3J0Rn0m9J04J05p3p4K0K0K1K0m7m6m6m7N0
-20a8M8m9n0%j%%Q6Q7LLk31PP6P5J23j14k5k4l3K05J2J2j18j17N9O1O5O5l3l4m5m4J5J5l2
-29D9l2K7K8Q0Q1j13J26j25j24O7O8qpQ1j57q7J48JJPPr2r2PPqqJ55q3m8m8k2k2J17J15N4
-37A50N3j79N8m4m4K9L0J1J2J1J2j07j07J10J10k2k3k2k2M3M4j7j6m5m4J4J3P4P4m1m0Nk32
$$ y = [100, 95, 90, 33, -23, 58, 140, 193, 247, 201, 155, 150, 145, 41, -62, 14, 91, 257, 185, 20, 94, 79, 63, 41, 20, 57, 95, 59, 23, -11, -47, -38, -30, 97, -12, 90, -44, 24, 92, 230, 130, 64, -1, -21, -42, -62, -83, -80, -77, -14, 47, 110, 173, 136, 99, 24, -50, 67, -52, 4, 60, 101, 143, 91, 39, 47, 55, 17, -20, 40, 102, 111, 120, 188, 257, 224, 192, 218, 245, 268, 291, 215, 139, 106, 73, 40, 7, -2, -11, -21, -30, -19, -9, 1, 12, 68, 124, 80, 36, 2, -32, -7, 17, 102, 188, 95, 2, 1, 0, -1, -3, 40, 83, 27, -28, 2, 33, 64, 95, 46, -2, -50, -99, -8, 82, 113, 145, 146, 147, 149, 150, 66, -18, -4, 10, 2, -5, 86, 177, 158, 140, 121, 102, 149, 196, 144, 91, 53, 15, 37, 59, 96, 134, 72, 11, 10, 9, 8, 6, 100, 193, 107, 22, 37, 51, 66, 81, 25, -30, 12, 55, 65, 74, 24, -25, 79, 184, 111, 37, 57, 77, 98, 118, 71, 25, -21, -68, -18, 30, -19, -69, -69, -70, -70, -70, 16, 103, 106, 109, -122, -115, -39, 36, 159, 45, 20, -4, -37, 168, 180, 192, 74, -43, 16, 77, 142, 207, 174, 140, 95, 51, 66, 81, 49, 17, 44, 72, 152, 233, 120, 246, 121, -3, 64, 132, 124, 117, 198, 41, -46, 102, 103, 104, 111, 118, 26, -66, -59, -52, -60, -68, 87, 4, -44, -92, -114, -136, -19, 96, 150, 203, 24, 82, 38, -6, 23, 53, 64, 76, 87, 99, -8, -115, -5, 105, 83, 60, 38, 16, 59, 103, 86, 70, 25, -19, -5, 8, 82, 156, 115, 75, 80, -152]
-46a52Q0P9M3M3r5r7J01J02l7l7KLKLOOOOk8k7L2L2m5m3m5m4J12J13o5o5%%N8N9n5n4LNj21
-55a14j22R7R6O6O7l3l3n1n3PPjjN9N8K4K4l5l6M6M7n3n3%JO0O1l8l8l8l7R5R6m4m3k5k4L4
-64G3L5o2o1klP9P9n9o0qrN1N1o0o0jjM7M8n1n0ooN2N3p6p7j7j8M8M9M7M8o0o0L9L8j7j7j7
-74b1j7J2J1J2J0QQPQqqo7o7M9M9M8M9M7M7n2n2q4q6R4R2K1K1l9l8JJn8n8Q6Q7n3n2o6o7L3
-84i2L2M3M2j7j6%jj%N5N7q3q1J9J9J9J9n6n7Q2Q2k5k4k4k4J35J37q1q2mlj02j03R0Q9q9q9
-93a34J02J01l7l6qrN0N2k9k8L1L1j8j9p7p8J1J1P0P0j3j2p2p2NMO4O4m6m6J3J4J7J7J6J7
-102B6n8n8J%j2j3M7M7m4m4J6J6PPPPO2O4p6p5P8Q0K0J9J4J3q5q5K9K9k9k9L6L8L7L8j6j6
-111I8j6j6j8j8j7j7NOO5O5p2p2M5M7q7q7L1L2K2K1l6l7L7L6k1k3PPPOo4o4N5N6l4l4J00j37
$$ y = [-152, -72, 7, 50, 93, -2, -99, 2, 104, 67, 30, 32, 35, 37, 40, 46, 52, 58, 64, 36, 9, 41, 73, 28, -15, -60, -104, 8, 121, 56, -9, -9, -9, 49, 108, 53, -1, 2, 7, -114, -236, -139, -43, 23, 90, 57, 24, -27, -80, -73, -66, -67, -68, -9, 49, 73, 97, 62, 26, 72, 119, 66, 13, 13, 14, 74, 135, 97, 59, 21, -16, 79, 175, 131, 88, 63, 39, 73, 108, 46, -15, -17, -20, 59, 138, 79, 19, 11, 2, 53, 104, 44, -16, -17, -18, 29, 77, 26, -24, -30, -36, 16, 69, -7, -84, -101, -119, -71, -22, 25, 73, 13, -47, -8, 30, 13, -4, -21, -38, -26, -15, -3, 7, 15, 23, 30, 38, 30, 22, -45, -112, -63, -14, 34, 83, 130, 177, 125, 73, -11, -97, -3, 89, 110, 131, 92, 54, 55, 56, -2, -60, 26, 113, 60, 8, -58, -125, -92, -60, -17, 25, 8, -8, -8, -9, -10, -10, 45, 102, 19, -62, -43, -24, -5, 14, -42, -99, -17, 65, 40, 16, -8, -32, 103, 240, 159, 77, 73, 70, -32, -135, -45, 44, -45, -134, -32, 69, 32, -4, -12, -21, 29, 81, 52, 24, 55, 86, 68, 49, -28, -106, -95, -84, -14, 56, 43, 31, -41, -113, -108, -104, -40, 24, -22, -68, -55, -41, -24, -7, 9, 26, -32, -90, -89, -89, -101, -114, -67, -20, -64, -108, -92, -76, -69, -62, -55, -48, 14, 78, 2, -73, 5, 85, 105, 124, 138, 151, 66, -19, 10, 39, 10, -19, 17, 55, 92, 130, 114, 98, 82, 66, 48, 30, 13, -4, 1, 7, 72, 137, 65, -7, 38, 85, -2, -89, -58, -26, -4, 17, -19, -56, -19, 17, -4, -27, -20, -13, -6, 0, -64, -128, -73, -17, -51, -85, 15, -122]
-120a22J00J00l4l3l0l1l1l1Q1P9j16j18ooJ13J12l3l3Q4Q6l8l9j71O6q0p9J34J33l9l8K0
-128@K0MLn6n6K8K8M2M3j50Q6m7m8M7M7p3p2J36J35o2o2OMONK7K6p6p8n3J85qrk9l1M3M4q7
-137c2J49J5J6n8n9k52j4J13J13O1j74k3k2Q1Q2n4n4O6O4l4l5R8j39M6M6P5P6l4k72J14j23
-145a64L6L7K1K2J7J7J5J7J16J15q3q3q1q0L9L8o2o3N6N6PPj13j12P4P4m5m4K2K2K2K2k8k8
-153a34R1R0p1p3M6M7j0j1j0j0L5L3L5L5q9q8L1L0J3J2J3J3J7J7L1L2j46R0R1j47ook0k1N2
-162A2N4j1k49KJJ06J04q2q3L6L6JJj4K24n1n2l5l6n5n5N0M9J53q5N0M9q7q6j17J21J29j07
-170b7j9j9N0M9o8p0K1K0m0l9J11J11qql9l7L4k01O4O4j0j0Q5Q7l3l2nmj37J00MNL3L4k45
-178a79qK49J2j8j8J2J2Q6j52l3l3J88m9J0J1J20j18m4m4J9J8P8P8j45j43L4L4K6K6K7K7J6
$$ y = [-122, -22, 78, 44, 11, -19, -50, -81, -112, -31, 48, -68, -186, -192, -198, -85, 27, -6, -39, 45, 131, 93, 54, -117, -51, -131, -210, -76, 57, 18, -20, 0, 20, 24, 27, -29, -85, -57, -29, 13, 56, -94, -8, -55, -103, -56, -9, -82, -154, -18, 117, 55, -7, -1, 3, 9, 14, 41, 67, -9, -87, -140, 45, 37, 28, -1, -32, 11, 55, -32, 117, 132, 148, 90, 31, -221, -235, -122, -9, 52, -122, -145, -167, -86, -4, -58, -112, -46, 18, -16, -51, 47, -92, -46, 0, 75, 151, 117, -155, -41, -164, -128, -91, -70, -48, -31, -14, 1, 18, 134, 249, 166, 83, 2, -78, -39, -1, -63, -126, -70, -14, -7, 0, -113, -225, -151, -77, -122, -166, -144, -122, -100, -78, -106, -134, -43, 47, -24, -97, -51, -4, -14, -25, -35, -45, -10, 23, 58, 93, 4, -84, -53, -23, -10, 2, 15, 28, 45, 62, 93, 125, -21, 69, 160, 13, 7, 1, -19, -40, 12, 66, 55, -194, -192, -191, -85, 19, -63, -146, -110, -74, -73, -72, -86, 138, 87, 35, 0, -36, -91, -146, -96, -47, 106, 21, 71, 120, 33, -53, -170, -49, 80, -27, -46, -65, -15, 34, -34, -104, -83, -63, -103, -142, -31, 80, 72, 64, 25, -12, 22, -179, -115, -51, -61, -71, 14, 101, 68, 36, 31, 27, -110, -10, -6, -1, 32, 66, -179, -187, 62, 74, 56, 38, 50, 62, 148, -4, -37, -70, 118, 69, 79, 90, 210, 92, 48, 4, 23, 41, 119, 197, 52, -91, -57, -23, 3, 29, 56, 83, 99]
-186I9J6J6J6o7o7ppj1j2j1j2jkJ4J3j49Q9N4N3LKj3j3J73o5k67l1K98r9l8l9l2l1K7K8L7
-195c6L6L6L7m1m0J8J8k3k3J09j26m8m8L7L6l4l4K38Jq2q1M3M1m9n1n0n1m1m0N8N9N9N8m0
-203e4m1J7J7J6J7k3k3L7L6K0K2K1K1r1r2QPo4o3P6P5m1m1J8J9P0P0r2r3j27J11k2k3P2P2
-212f8J2J3k9k9o3J74j0qn5n4l4l4O5O5m9m8N0N1j9j8R4R5j78N9K3K4M5M5n4n4ONOOk7k5k7
-221d5k6m2m2J7J8J7J8J15J17m6m6j80N8KKR1j46nmM0L9K2K1J10j27j56Q2o7o6k1k1J33J33
-229ej62P7KKK2K2K2K1l5l7l6l6M3M3n6n6P6P7k3k2popppqo8o7P5P5P5P5m0l8j74O5K7K8M2
-238b8M1o7o8N1N1L8L9q0q0P7P5J2k25J31J30j36J01r9j00L5L4K2K2K2K1L3L3q5q6N1M9N1
-246F5N0n4n4n4n4RRO9O8n0m8O9P0J1J2j08j06k4k4P1P0J17k79q6J53J37r9M9M8q3q5r8J39
$$ y = [99, 115, 131, 147, 80, 13, 6, -1, -12, -24, -35, -47, -48, -50, -36, -23, -172, -83, -29, 24, 27, 29, 16, 3, 176, 111, -156, -187, 111, 12, -26, -65, -97, -128, -101, -73, -36, 0, 36, 73, 32, -8, 10, 28, 5, -18, 91, -35, -83, -131, -94, -58, -92, -126, 112, 113, 31, -50, -7, 34, -15, -66, -116, -167, -208, -248, -190, -131, -72, -14, -54, -95, -78, -61, -45, -28, -51, -74, -37, -1, 19, 41, 62, 83, -8, -100, -92, -85, -149, -212, -136, -61, -102, -143, -125, -106, -36, 34, -58, -151, -278, -167, -189, -212, -140, -68, -56, -43, -72, -101, -164, 10, 0, -8, -63, -117, -151, -185, -120, -55, -104, -152, -102, -51, -70, -88, 6, 101, -77, -18, 5, 29, 74, 119, 65, 11, 17, 22, 28, 34, 7, -18, -45, -71, -113, -155, -138, -120, -103, -85, 30, 147, 101, 55, -125, -67, -65, -63, 28, -118, -123, -127, -87, -48, -26, -5, 105, -22, -178, -96, -163, -229, -250, -271, -138, -5, -167, -90, -88, -86, -64, -42, -20, 1, -34, -71, -107, -143, -100, -57, -113, -169, -93, -16, -39, -61, -68, -74, -81, -88, -95, -103, -171, -238, -163, -88, -13, 62, 22, -16, -190, -125, -98, -70, -28, 13, -54, -122, -71, -20, 18, 57, -23, -103, -26, 49, 61, -164, -33, 97, -39, 62, -37, -137, -102, -68, -46, -24, -2, 19, 52, 85, 0, -86, -35, 14, 65, 115, 61, 7, -47, -101, -92, -83, -14, 54, 4, -44, 25, 95, 106, 118, 10, -96, -120, -144, -73, -3, 114, -165, -251, -98, 39, -60, -11, 37, -46, -131, -229, -90]
-254i0K4K5J13j24L6L4J55q3k3k2l8l6pqpqL7L6r6J41qqQPJ0J0J0J0j50j51M7M7L1L1L1L0
-263A4m4m6l1l1r0J48J4J4p5p5M4M4P2P1m6m8K8K7J1J2J10j28j28J09J7J6J06j32r4r5J0R
-271a87O9P0RJ0p6p6N8N8k12K7R2R2j07j07J72J70K2K3L7k00N8N8p5p5L3L4J9J7R0j47j4j4
-279g2M0M0M0M1l1l0l0l0j6j6j5j6L5L5L3L5L6L6q3q2qqq3J55p1p1O3O2j3j3j3j4nooon9o0
-288b06n9o0L0L0L0L0K3K4J57q1j6j6l1l1N6N7M1M1R3j44j0j1l0l0m5J92m1m1L3L2J3J2kl
-296C7K4k13J71o4k4k4J10j27o6J72J56q0j5j5m3m5J48q9p3p5j2j3J07J06k4k4q2q3J2J2J2
-304a24J2P0P0j28j28N2N2N2N2ooopk8k8J6J6K8k11M3M2Q2Q2l7l8Q9Q9j78O0M3j94m5m5N7
-312b02N8N8N7L9L9nnk44pN8N8M2M2j56j56P6P7O2O2P6j60j3j2q7J51J50q6PPj42R6M5M3n9
$$ y = [-90, -66, -41, 72, -52, -16, 18, 173, 90, 67, 45, 7, -29, -36, -44, -51, -59, -22, 14, -82, 59, 51, 43, 51, 58, 68, 78, 88, 98, -52, -203, -156, -109, -78, -47, -16, 14, -30, -76, -107, -138, -228, -80, -66, -52, -127, -202, -158, -114, -42, 29, -17, -65, -37, -10, 1, 13, 123, -5, -133, -24, -7, 9, 115, -17, -111, -206, -196, -187, -118, -48, -39, -29, -105, -181, -123, -65, -277, -250, -158, -66, -173, -280, -108, 62, 84, 107, 144, -56, 2, 60, -15, -90, -57, -23, -4, 13, 103, -44, -58, -72, -32, 8, 48, 89, 58, 28, -2, -32, -48, -64, -79, -95, -60, -25, 8, 43, 79, 115, 32, -50, -58, -66, -149, 6, -65, -136, -73, -11, -24, -37, -50, -64, -69, -75, -81, -87, -146, -206, -265, -325, -295, -265, -235, -205, -182, -158, -1, -82, -98, -114, -145, -176, -120, -63, -22, 19, 112, -32, -42, -53, -83, -113, -158, 34, -7, -48, -15, 17, 30, 42, 40, 37, 61, -152, 19, -45, -69, -93, 17, -110, -176, -4, 152, 72, 57, 42, -1, -46, 102, 13, -60, -135, -147, -160, -53, 53, 29, 5, -77, -160, -148, -136, -124, -112, -42, 28, -100, -228, -176, -124, -72, -20, -26, -32, -38, -45, -73, -101, -85, -69, -41, -252, -209, -167, -85, -3, -40, -78, 11, 100, -78, -18, 25, -169, -214, -259, -202, -144, -86, -29, 10, 49, 44, 39, -205, -212, -154, -96, -54, -12, -168, -324, -248, -171, -109, -47, 29, -131, -144, -156, -243, -92, 58, -28, -21, -14, -156, -60, -15, 28, -31]
-321c1o0K4K5RJ0J63p3j92M6O3O2J9J8o5o3N3N5o2o1N7N6klo1o2M4M2l0l1O5j71K1K1K7K7
-329f0l3l3P5P3j24j24m1m1P8P8K9K8K9K8j6j7j6j7m3m2J7J7O4O4n6n5M5M5M6M4m7m7m8m7
-338a47L4L4L5L4j37j37O2O2P9P9m0m1O4O3n4n5k6k6R4R3j35j36j7j7O6O7OPJ3J3J2J3m1m1
-346a20m0m1L5L5L6L5O5O7OPj38j39N9N9OOOOP9Q0l9l9j8j7j8j8J5J5P3P5j08j07J2J1p6p5
-355b05M3M4m1m1P9P8j32j33O6O6J0J0P0P0JKj18j18KJO1O1N8N8o1o2J3J4m7m6QRRRNNNNK2
-364a20K2K2K2n2n2j87N2Q6Q5l3K04l8l8k3k4rj0NNj52Q6J01j38j24J14O5O5M4M4O0N9j72
-372c1O4L0L0QQn2n1nmnmj8j7j7j7j3j3Q6Q5p1p3p2p3k3k3P6P6O9O7o9p0O9O9P0O9n7n7n5
-381a4n7O3O3p5p6J%Q4Q4L7k01pqM7M7j3j3L4L3o5o5L6L6L6L6j2j1j2j1m8m9q4J55m0m0K0
$$ y = [-31, -91, -67, -42, -33, -23, 140, 67, -125, -79, -16, 46, 65, 83, 18, -45, 8, 63, 1, -60, -3, 53, 51, 48, -13, -75, -31, 11, -19, -50, 15, -156, -135, -114, -87, -60, -93, -126, -51, 22, -102, -226, -267, -308, -230, -152, -123, -95, -66, -38, -54, -71, -87, -104, -147, -189, -172, -155, -91, -27, -83, -138, -93, -48, -2, 42, -5, -52, -100, -147, -113, -79, -44, -10, -147, -284, -222, -160, -81, -2, -42, -83, -19, 44, -10, -65, -91, -117, -23, 70, -65, -201, -218, -235, -169, -102, -96, -89, -76, -63, -51, -38, -79, -120, -160, -201, -166, -131, -95, -60, 5, 72, 78, 85, -53, -192, -133, -74, -68, -62, -56, -50, 29, 109, 70, 31, 13, -4, -22, -40, -25, -10, 63, 138, 30, -77, -65, -54, -130, -205, -162, -118, -159, -200, -121, -43, -175, -308, -242, -176, -166, -156, -86, -16, -15, -13, -131, -249, -247, -246, -185, -124, -66, -8, -69, -131, -118, -104, -151, -197, -189, -180, -171, -162, -157, -152, -147, -142, -120, -98, -76, -54, -106, -158, -345, -293, -207, -122, -155, 49, 11, -27, -50, -74, -83, -93, -88, -83, -235, -149, -48, -186, -310, -196, -131, -66, -22, 22, 82, 141, -31, 33, 63, 93, 101, 109, 57, 6, 1, -3, -8, -12, -30, -47, -64, -81, -94, -107, -21, 64, -7, -80, -152, -225, -248, -271, -195, -119, -50, 17, -52, -122, -53, 16, 86, 155, 98, 41, -14, -71, -8, 55, -20, -96, -95, -95, -11, 73, 110, -91, -98, -106, -59, -12, -25, -38, -4, 29, -36, -101, -65, -29, 7, 43, 31, 20, 8, -3, -51, -100, -184, -29, -69, -109, -89]
-390h9J9J09j29m5J93Mk32q0J58poO8O6k9l0l0l1M1M0P5j62m4m3J20J20q2q3JKK29qn3n3m4
-398c5m4J6J5K8K6K8K8j2j2j2j2p9q0J9J9M6M6j3j3M2M3j79K16n5n3J03j34K1K0NNJ3J5jj
-407A9j7k53J8J9N0N1m9m8P8P9P7P9j70j71Q7Q8m8m7J31J30L5L4k5k5m5m4J5J5m8m6J3J2L8
-415C2L9o1n9n7n7M3M2J9J9J8J9r5r4Q5Q4p3p2J06J05QQM3j94j0rk4k5N7N6llm2m3L2L2j01
-424a75J38LMQ1Q2r6r6N6N5m3m2N0N1qrp3p5M5M5j4j5M4M6j1j1j1j0KKj3j2J20j16j17J21
-432bqrOPrqk4k3J30j07K6K6m1m2m2m1O3O3MMo7o7N2N2N8N8m7m5j28J10k4k4r1r1K9K8O8O8
-442h8QRn1n0RRN6N5k0j9J54q1q3J54l8l8R5j41J19j18p4J64q7q7O1O1j56Q1J31J31k6k64
-450a24n6n6m0K00O5O4k6k5k5k5m2m1m2m2mmnmppJ11J12m1m2J7J8OOn4n4J0Rl5l5m3J96n8
$$ y = [-89, -70, 39, -90, -135, 58, 62, -170, -250, -92, -99, -105, -37, 29, 0, -30, -60, -91, -50, -10, 65, -97, -141, -184, -64, 56, -26, -109, -108, -106, 123, 115, 62, 9, -35, -79, -63, -48, -20, 6, 34, 62, 50, 38, 26, 14, -65, -145, -126, -107, -61, -15, -28, -41, 1, 44, -135, 81, 26, -27, 76, -58, -37, -17, -12, -7, 6, 21, 20, 19, 2, -251, -233, -214, -164, -113, -162, -210, -132, -53, 24, 103, -67, -238, -151, -63, -111, -158, -27, 103, 138, 172, 147, 122, 77, 33, 48, 63, 15, -31, -18, -6, 32, 71, 10, -49, -106, -163, -120, -78, -59, -40, -22, -3, -98, -192, -107, -23, -96, -168, -62, 43, 51, 59, 102, -92, -102, -111, -135, -160, -103, -47, -50, -53, -95, -138, -106, -74, -175, -37, -34, -30, 51, 133, 37, -59, -3, 52, 9, -33, 17, 68, 60, 51, -22, -97, -52, -7, -21, -36, 8, 54, 43, 32, 21, 11, 13, 15, 2, -10, 110, -6, -123, -2, -10, -19, -13, -6, -15, -23, -47, -70, 60, -47, -21, 5, -36, -78, -120, -161, -98, -35, -31, -27, -94, -161, -109, -57, 1, 59, 12, -33, -161, -51, -75, -99, -190, -281, -252, -224, -156, -88, -80, -71, -122, -172, -163, -154, -98, -43, -63, -82, 72, -9, -92, 62, 24, -14, 81, -60, 59, -59, -133, 31, -56, -143, -82, -21, -177, -96, 35, 166, 140, -124, -180, -236, -276, -76, -11, 53, 27, 2, -23, -48, -90, -131, -173, -215, -219, -223, -228, -232, -239, -246, -135, -23, -64, -106, -89, -71, -65, -59, -113, -167, -157, -148, -183, -218, -261, -65, -123]
-459a23n8j6j7J02J03k5k4k4k4N4N3o4o5o3o3lmR3R2k7k7QQQQ%J%Jj4j5j4j4L6L5L6L5LKL
-468cLk8k7k7k7k0j9j9j9P0P0O9P0j7j7j6j7n3n4N0M9J19j19L0K9j05J30j21j21Q8Q7K3k13
-476a55poR8R7j09j10RJ0O6O6n3n2K0K1K1K0j6j7l1l2J25j15K0K0K7K7K8K7l0l1Q8Q9j07j06
-485i8J2J2l9l9Q0P9j5j5o1o0j11J28J27j11J15J17r7r7jjjkklklmmo3o4RQJ27J27PPn2n2
-494d2m1m1P8P7p7p7M2M2k5k5k6k5O9P0n0n0J6J7J7J7M4M5M5M5j08j06J1J1k7k7L3L2j09j09
-502b54R0R0J6J7m2m3O6O4O5O6j02j01R5R6j12j11PPPPQPq3q2L7L7L0L1L0L1M8M9j1j0q7q8
-511a25L2L1Q9R0l0k9r8r9J00R9m2m1m1m2Q3Q1l6l6j30j31O8O7K6K6K6K5m5m5j04j05J66J65
-519eM5M6m6m6m7m7L7L8q2q2J00J00r7r8K3K3Q2Q2j19j20j%N7N8N8N6k3k5k4k4QQQRN5N7o3
$$ y = [-123, -181, -197, -214, -112, -9, -34, -58, -82, -106, -52, 1, -63, -128, -191, -254, -257, -261, -168, -76, -103, -130, -122, -114, -106, -98, -98, -97, -97, -96, -110, -125, -139, -153, -117, -82, -46, -11, -8, -6, -3, 0, -28, -55, -82, -109, -129, -148, -167, -186, -116, -46, 23, 93, 76, 59, 43, 26, -27, -81, -31, 18, 137, 18, 48, 77, -28, 102, -19, -140, -52, 35, 58, -155, -162, -168, -70, 27, -82, -192, -183, -173, -107, -41, -94, -146, -126, -105, -84, -64, -80, -97, -128, -160, -35, -150, -130, -110, -83, -56, -28, -1, -31, -62, 26, 115, 8, -98, -86, -74, -113, -152, -72, 7, -8, -23, -84, -144, -255, -127, 0, -111, 4, 121, 24, -73, -74, -75, -76, -78, -80, -83, -85, -88, -92, -96, -159, -223, -214, -206, -79, 48, 55, 62, 10, -42, -83, -124, -46, 31, -46, -123, -81, -39, -64, -89, -115, -140, -71, -1, -51, -101, -85, -68, -51, -34, 10, 55, 100, 145, 37, -69, -58, -47, -74, -101, -68, -36, -145, -254, -164, -74, -58, -41, -83, -126, -60, 4, 69, 135, 33, -68, 27, 123, 11, -100, -93, -86, -79, -72, -64, -57, -140, -222, -185, -148, -118, -87, -57, -26, 22, 71, 60, 50, -37, -125, -93, -62, 27, 117, 87, 58, -40, -139, -39, 60, 18, -23, -64, -106, -23, 58, 22, -14, -144, -275, -207, -140, -114, -88, -62, -37, -82, -127, -231, -336, -170, -5, 40, 86, 40, -6, -53, -100, -63, -25, -107, -189, -89, 11, -86, -184, -161, -138, -56, 26, -93, -213, -214, -214, -157, -99, -41, 15, -8, -33, -57, -81, -73, -65, -57, -48, 7, 64, 1]
-528Ao1k6k5q6q5J6J5J34J34M0M1p9p7N8N9n9o0J6J5m3m4P2P0m6m8P0P1m8m7r3r2K6K6P4P4
-537gm6m6l4l5K6K5M1M1M0M2M2M3p7p6k3k3k3k4J9J9J9J9k2k2k2k2K8K7K8K7l3l4l4l4RQQ
-546a26Rl3l2J66J65J9K0j00r9m6m7P3P1KKn7n8j8j9j8j8L5L5L5L5m7m7P2P2j7j7j6j7M7M9
-554G5p1o9K6K6K5K6k2k0k2k2j8j8j8j8QQO7O6R4R3k6k5r4r2K5K6m5m6P2P3m3m3m3m3j9j8
-563a25j9j8J03J03r4r5J6J7J7J6K5K4K5K4j8j6j8j7N4N6j42j43L5L6k4k4M1M1J00R9m6m5
-571a2m7m6oonoL1L2L1L1l6l7Q1Q2j00j01J7J8m0l9m0m0L8L7L7L7L2L3L1L2o2o3mmk8k8R0
-580f0R0m2m3J6J7K7K9q9r1mnJ14J14j72j72K6K6R2R2L2L1r3r5K5K5P5P3m4m4j7j6M3M3o4
-588f1o5nnL8L9k2k1M2M2M1M2k4k4q2q4m8m7P1P2jjj%K1K2K1K2l6l5l6l5P4P3P3P4l4l4l4
$$ y = [1, -60, -86, -111, -197, -282, -266, -251, -117, 17, 57, 98, 19, -58, 0, 59, 0, -60, -44, -29, -72, -116, -44, 26, -20, -68, 2, 73, 25, -22, -115, -207, -181, -155, -81, -7, -53, -99, -133, -168, -142, -117, -76, -35, 5, 47, 89, 132, 55, -21, -44, -67, -90, -114, -95, -76, -57, -38, -60, -82, -104, -126, -98, -71, -43, -16, -49, -83, -117, -151, -142, -134, -126, -117, -150, -182, -16, 149, 168, 188, 88, -11, -57, -104, -31, 40, 42, 44, -13, -71, -89, -108, -126, -144, -109, -74, -39, -4, -51, -98, -26, 46, 29, 12, -4, -21, 26, 75, 4, -65, -39, -13, 12, 38, 16, -4, -26, -48, -66, -84, -102, -120, -112, -104, -37, 29, 123, 216, 190, 165, 71, -21, 4, 30, -15, -61, 11, 84, 41, -2, -45, -88, -107, -125, -144, -162, -59, 44, -50, -145, -129, -112, -95, -79, -54, -30, -5, 19, 1, -15, -33, -50, 4, 60, -82, -225, -190, -154, -178, -202, -161, -120, -20, 79, 33, -12, -59, -105, -111, -117, -122, -128, -97, -65, -34, -3, -39, -76, 5, 87, -13, -114, -97, -79, -119, -158, -198, -238, -200, -163, -126, -89, -57, -24, 7, 39, -23, -86, -90, -94, -122, -150, -60, 30, -12, -55, -39, -22, 5, 34, -55, -146, -150, -155, -41, 73, -99, -271, -245, -219, -127, -35, -3, 28, -65, -160, -135, -110, -35, 38, -6, -50, -67, -83, -40, 3, -61, -126, -131, -136, -98, -59, -81, -102, -60, -18, 23, 65, 41, 17, -65, -149, -197, -244, -173, -101, -102, -103, -104, -104, -83, -61, -40, -18, -54, -89, -125, -160, -86, -13, 60, 134, 100, 66, 32]
-597C2l3j2j2j1j2N1N3o6o7L7L7L7L7p7p8M1M1Q6Q7l2l3k0k0p9q0N0M9o8o8lkJ17J15l3l4
-606C0K7K6q3q3L6L6PNn3n3L9L9L8L9l0k9l1l0m5m4J5J5J34J36o3o4MMj14j15J12J10ppK5
-615B6K4l4l4O5O6j32j33N5N6o4o3M3M3j6j7j7j7M2M2k4k5R5R3j33j33j5j4R5R5k5k4K5K5
-623c0r3r4J02J02j7j7LLKLj43j42J35J36o1o1kjO8O8O7O8m3m3j02j03J59J58l9m0p8p9M0
-631g4M0N7N8o2o1llklQ9R0k9k9n4n3NNk8k8k8k8Q9Q7l0l0l8l8Q1Q0j15j16LLQ8Q6l1l1l1
-640h4l1Q8Q8NNn4n4l8l8Q0Q0p2p3j4j3K5K6K6K6O6O7n3n2NNNOk1k0k1k1J4J3m6m6M7M7p2
-649i9p2O4O4n5n5l7l6Q3Q2P2P4J4J3o2o1o2o2K5K5r5r4O8O8RRO1O0n6n8kkkkQ3Q2l7l5op
-659d1poO0O2n8n7j3j3M7M5J5J4m5m5J3J3m6m7P1P0j26j28M4M4j6j6OPOOJ1J1P1O9jjj20j20
$$ y = [32, -1, -13, -25, -36, -48, 3, 56, -10, -77, -40, -3, 34, 71, -6, -84, -43, -2, 84, 171, 139, 106, 86, 66, -13, -93, -43, 6, -62, -130, -133, -135, -18, 97, 64, 30, 57, 83, 0, -83, -47, -11, -4, 1, -52, -105, -66, -27, 11, 50, 20, -9, -40, -70, -115, -159, -144, -129, 5, 141, 78, 14, 18, 22, -92, -207, -95, 15, 8, 1, 26, 50, 16, -18, 47, 113, -19, -152, -97, -41, -105, -168, -125, -82, -98, -115, -132, -149, -107, -65, -89, -114, -19, 74, -59, -192, -207, -221, -126, -31, -56, -80, -55, -30, -123, -217, -115, -13, -30, -47, -44, -41, -39, -36, -179, -321, -186, -50, -111, -172, -174, -175, -107, -39, 28, 96, 53, 10, -92, -195, -36, 122, 83, 43, -35, -114, -74, -34, 23, 81, 19, -42, -45, -48, -50, -53, 36, 126, 97, 68, 14, -39, -34, -29, -57, -85, -113, -141, -52, 35, 5, -25, -63, -101, -20, 60, -55, -171, -168, -165, -77, 9, -22, -53, -84, -115, -27, 61, 66, 71, 17, -37, -75, -113, -33, 47, -25, -98, -112, -125, -100, -74, -48, -22, 44, 111, 58, 6, 11, 16, 21, 27, 6, -14, -35, -56, -42, -29, -75, -121, -74, -27, -99, -171, -107, -43, -98, -153, -190, -226, -143, -61, 11, 85, 99, 112, 50, -11, -73, -135, -110, -85, -180, -274, -206, -138, -129, -120, -59, 1, -55, -113, -115, -117, -119, -121, -38, 44, 7, -28, -34, -41, -48, -54, 6, 68, 10, -47, -60, -73, -26, 19, 34, 48, 3, -42, -29, -16, -62, -109, -38, 32, -94, -222, -178, -134, -150, -166, -160, -153, -147, -141, -130, -119, -48, 21, 20, 19, -101, -221]
-668b21K0J9K0K0J8J7J8J8K1K1Q0Q1n9n9O1O0j17j17KKJ18J19j58j58J9K0K0K0J0J0J0J0J39
-676H4J40j38j36k1k1L8L8K2K2l6l7J13J14j04j03l0l0L0L0j3j2M7M7k6k5k6k6n7n7M2M2j8
-684a07j7M2M2o2o2o2o1Q4Q5K5K5j0j1j0j1M2M1M1M1p5p7K3K3j4j5j4j5j8j9M2M1J7J8k01
-692b29L7K72j24k6k5ononK6K7K7K6m2m3J7J6M4M3n4n5k5k6k5k6K8K9K8K8m2m3N7N7K4K4K5
-701B8K4K6K6l3l4J9J9j19j20M2M1j8j8l2l2K7K8J02J01j15j17j6j7M3M3j5j4J00R9j49Q8
-709GM4j93j04J35M5M5k7k8k8k8l4l4K5K5Q6Q4j5j3j1j2O2O2j82N4K0J9j6j7j8j7K0J9L3L5
-717D3j57Q0o9o8J98l9l0k9r8J41r3r3R2R2L1L3o9o9j0j0K7K7n8n8k3K14K1K2p0p1K8K8M2
-725EM3n5n6m8m7llJ21j17J7J7J9J8j15J23Q5Q5l8l8m8m8J1J1l7l7O2O2POPPj6j7J76o1m4
$$ y = [-221, -201, -182, -162, -142, -124, -107, -89, -71, -50, -29, 51, 132, 73, 14, 75, 135, 18, -99, -97, -95, 23, 142, -16, -174, -155, -135, -115, -95, -85, -75, -65, -55, 84, 224, 86, -50, -71, -92, -54, -16, 6, 28, -8, -45, 68, 182, 78, -25, -55, -85, -55, -25, -38, -50, -3, 44, 18, -7, -33, -59, -116, -173, -131, -89, -107, -124, -82, -40, -102, -164, -226, -287, -203, -118, -93, -68, -78, -89, -99, -110, -68, -27, 14, 55, -20, -97, -74, -51, -65, -80, -94, -109, -127, -146, -104, -63, -46, -28, -229, -192, 80, -44, -70, -95, -101, -106, -112, -117, -91, -64, -37, -11, -53, -96, -79, -63, -19, 24, -30, -85, -110, -136, -161, -187, -159, -130, -102, -74, -116, -159, -102, -45, -21, 3, 28, 52, 78, 104, 71, 37, 56, 75, -44, -164, -122, -81, -99, -117, -149, -181, -154, -126, -24, 77, -38, -155, -171, -188, -145, -102, -117, -131, -31, 68, -81, 7, 51, -142, -246, -111, -66, -21, -48, -76, -104, -132, -166, -200, -175, -150, -64, 20, 5, -8, -19, -31, 31, 93, -89, -35, -15, 4, -12, -29, -47, -64, -44, -25, 8, 43, -114, -34, -103, -171, 27, -12, -42, -71, -169, -28, -121, -214, -122, -30, 1, 34, -35, -104, -114, -124, -97, -70, -128, -186, -209, 5, 26, 48, -22, -93, -65, -37, 5, 48, -7, -63, -111, -158, -161, -164, -43, -160, -143, -126, -107, -89, -204, -81, 4, 89, 51, 13, -35, -83, -72, -61, -98, -135, -73, -11, -4, 2, 9, 16, 0, -17, 159, 98, 54]
-734E4m4JJk8k9k9k8OPPPn3n3PPJ4J3P4P2k5k6k6k6L0L1L1L0l8l8l9l8J1J2J1J2l3l3Q6Q5
-743B3o2o3N6N6n5n6MNM1M2j7j8p0p0N0M9rqJ09J11o6o5N2N4k8k7k7k7N5N6mlK5K5r4r2L2
-753a6L2k6k7K0J8K0J9QQRQr6r7K3K2O8O7n0n0N4N4mnm8m7m8m8QRQQRQQRJ8J8J9J7OOOOL8
-763F9L8j60j61M8M8p1p1J9J8J9J9O8O9O7O9j13j14NNN1N1o8o8L7L6k3k2L6L7k3k2J6J6J6
-772e9J7N2N4o5o5k1k1J71o4j7j8J01j35M3M1K8K8M3M3r1J47m6m5l1l1%Jm5m3j80N9J23J21
-780I5K8K7r2r0m9m9P1O9N6N6o4o2P6P7j76O1k0j8nnO6O7n1n2l2l4J2J1O0j76m4m3Q9Q9j4
-788f6j5j57Q2J99l7j6j6l1l2K4K3R7j39M4M4q8r0M6M7M6M5K4K3K4K4n7n6n8n7k7k8k7k8L3
-797b00L3L2L3j2j2J36j00j07J32j7j7K8K9l1l1l6l7K8K65j00r9L3L4qrqrJ4J3q5q6R2R2q8
$$ y = [54, 10, 11, 12, -16, -45, -74, -102, -96, -89, -82, -75, -128, -181, -174, -167, -153, -140, -66, 6, -19, -45, -71, -97, -67, -36, -5, 25, -13, -51, -90, -128, -117, -105, -94, -82, -115, -148, -62, 23, -39, -102, -46, 10, -45, -101, -97, -92, -51, -9, -26, -44, -114, -184, -134, -85, -94, -102, 7, 118, 52, -13, 39, 93, 65, 38, 11, -16, 39, 95, 91, 88, 113, 138, 44, -48, -16, 16, -10, -37, -17, 1, 21, 40, 48, 56, 65, 73, -23, -120, -97, -75, -7, 60, 10, -40, 14, 68, 64, 59, 11, -36, -84, -132, -124, -115, -107, -99, -90, -82, -74, -65, -47, -29, -10, 7, 13, 19, 25, 31, 69, 107, -53, -214, -166, -118, -189, -260, -241, -223, -204, -185, -117, -48, 19, 88, -25, -139, -134, -129, -78, -27, -95, -163, -126, -90, -113, -135, -99, -62, -85, -107, -91, -75, -59, -42, 10, 64, -1, -66, -87, -108, 63, -1, -18, -36, 65, -70, -27, 14, 42, 70, 113, 156, 65, 212, 166, 121, 90, 59, 59, 60, 15, -28, -208, -149, -26, 95, 123, 150, 58, -32, -81, -130, -59, 10, 66, 122, 58, -4, 72, 149, -27, 34, 14, -4, -9, -14, 52, 119, 68, 16, -16, -50, -38, -27, 33, -143, -187, -230, -141, -52, -66, -81, -238, -156, 43, 6, -10, -26, -57, -89, -65, -42, 55, -84, -40, 4, -84, -174, -128, -81, -35, 10, 34, 57, 81, 105, 48, -8, -66, -123, -150, -178, -205, -233, -200, -167, -135, -102, -114, -126, 10, -90, -197, -65, -82, -99, -71, -42, -73, -104, -140, -177, -149, 116, 16, -83, -50, -16, -24, -33, -41, -50, -36, -23, -108, -194, -102, -10, -98]
-805i8q7J04J03l4l5n2n2QPL3L2k7k7J1J0P1P0o1o1L9L8M7M8q9r1R9J01p9p7m9m9N1N0n0n0
-813a46RJ0L0L0L1L0j5j4M4M5m7m6m7m7POOPK9K9L0K8%j%jk0k2k2k2K4K4K4K3L9L9k1k1l0
-823B2k8K9L0q9r1J0RPOPPj1j1j1j1K5K5K5K5o0n9L9M0l8l9K1K1M1M1j8j9K1K1p8p8P9P9J8
-832GK0M1M2r7r7m6m6N4N3K0K0J9J9j47j48J10J10nnN4N3l3l5j34j34Q8Q9K8K9k4k3k3k4K6
-841a39K6K7K6onN4N4j3j3j11j12M4M4M5M4l8l7l8l8J12J11J3J3l7l6O1O2o5o5o5o6J34J34
-849A20m5m4o2o3llqqN2N2l3l3K7K6JJJ%k6k7L3L3j5j6M3M4j37j38J59J59n3n1Q5Q6o1o2o0
-858b6o2LLO3O1j1j2j2j1qqo8o8K8K9l2l1O8O7RQn9n9M0M0j0j1j0j1N9N9k5k4j52Q7Q6j51
-867a51J3J4p6p5J88m9K5K5M7M6k01L7J90m6l8l7N8N7m0m1M2M1M2M2j04j02k0j9J39r7r9J40
$$ y = [-98, -185, -81, 22, -12, -47, -99, -151, -143, -136, -103, -71, -98, -125, -114, -104, -33, 37, -24, -85, -46, -8, 39, 87, -2, -93, 6, 107, 28, -49, -98, -147, -96, -46, -96, -146, -137, -127, -97, -67, -36, -6, -21, -35, 9, 54, 7, -39, -86, -133, -126, -120, -114, -107, -78, -49, -19, 9, 9, 8, 8, 7, -13, -35, -57, -79, -55, -31, -7, 16, 55, 94, 73, 52, 22, -6, 23, 53, -36, -127, -117, -108, -101, -95, -88, -81, -92, -103, -114, -125, -100, -75, -50, -25, -85, -144, -105, -65, -103, -142, -121, -100, -59, -18, -36, -55, -34, -13, -91, -169, -90, -11, 7, 27, 68, 110, 13, -84, -130, -176, -122, -69, -49, -29, -10, 9, -138, -286, -176, -66, -71, -76, -22, 31, -2, -37, -171, -305, -217, -128, -100, -71, -95, -118, -141, -165, -139, -113, -86, -60, -66, -71, -17, 37, 24, 11, -100, -212, -168, -124, -79, -35, -73, -110, -148, -186, -74, 37, 50, 63, 26, -10, 51, 113, 48, -17, -82, -148, -14, 120, 75, 31, -31, -94, -97, -100, -108, -116, -64, -12, -45, -78, -51, -25, -24, -23, -22, -22, -48, -75, -42, -9, -24, -40, 3, 47, -90, -228, -69, 90, 37, -14, 71, 157, 96, 34, -26, -88, -85, -82, -19, 42, 31, 19, 7, -4, -12, -20, -88, -156, -128, -99, -131, -162, -94, -27, -18, -10, -69, -128, -88, -48, -58, -69, -79, -90, -31, 28, 3, -21, -173, -86, 0, -151, -138, -124, -200, -275, -87, -136, -111, -86, -39, 7, -194, -157, 33, -13, -51, -88, -30, 27, -13, -54, -12, 29, 71, 113, 9, -93, -113, -132, 7, -90, -189, -49]
-875d9RJ0l5l6J14J15k4k4j16j18K1K1N1N1m8m8O3O3p5p5J00J00J35j02j25j25P9P7J4J4j20
-882h3J17j8j8J1J1r8J38NNM1M1n9n8O2O2J7k20l7l8J02J00j87M9m0m0J44r3j9k0P4P3J08
-890A32j29n1n1o7o6J50J50j06j08l3l2J06J06LLj30J08l3l3n4J85nnJ0J0j2j3j2j3o1o2o3
-898a76o2L8L8L7L8j6j5j6j6N4N3QRj38J00l3l4l6l6K3K4M0M1m8J88O4j74k6k6J2J3J2J3j1
-906e8j1J22j15nnj9k0P3P2o5o6llllL7L7K2K1O0j78N4N4p8p9p3J65J2J2M3M1j45R2J7J8k1
-915Bk0J72o5j11j11O7O7J56k39lkj12J26J25j11M1L9l2l4M4M3M5M4q1q0J9J7l0l1K8K7l1
-923c1l3l3l2K1K2l8l8J00J00KJj1j2LLj58P9P8j59j4j4R1Q9JJJJq5q6L4L3LMLMn5n5O4O4
-932e2k6k5L4L4J0J0n0n0K8K8l1l1k5k5R5R3p5p5j6j6ooN5N4M2M2j6j6PPNPJ5J4m4m6N5N5
$$ y = [-49, -40, -30, -65, -101, 13, 128, 104, 80, -36, -154, -133, -112, -61, -10, -58, -106, -43, 20, -55, -130, -30, 70, 205, 103, -22, -147, -68, 9, 23, 37, -83, 34, 16, -2, 9, 20, -78, 60, 65, 70, 111, 152, 93, 35, 97, 159, 176, -44, -81, -119, -17, 83, -104, -55, -95, -135, 9, -84, -103, -123, -49, 24, 132, 3, -48, -99, -166, -232, -82, 68, -38, -146, -179, -211, -105, 1, 4, 7, -123, -15, -48, -81, -135, 50, 45, 40, 50, 60, 48, 35, 23, 10, -51, -113, -176, -238, -200, -162, -125, -87, -103, -118, -134, -150, -96, -43, -35, -26, -164, -64, -97, -131, -167, -203, -180, -156, -116, -75, -123, 65, 129, -45, -71, -97, -85, -72, -60, -47, -58, -69, 53, -62, -67, -72, -91, -111, -38, 34, -31, -97, -100, -103, -106, -109, -72, -35, -13, 8, 68, -110, -56, -2, -80, -159, -232, -67, -55, -43, 0, 41, -104, -12, 5, 23, 2, -18, 154, 89, -22, -133, -66, 1, 157, -82, -85, -87, -199, -73, 52, -59, -18, 21, -11, -45, -1, 42, 87, 131, 50, -30, -11, 6, -24, -55, -27, 0, -31, -64, -97, -129, -108, -86, -124, -162, -62, 38, 40, 41, 30, 18, 21, 24, -134, -55, 23, -136, -150, -164, -73, 16, 17, 18, 19, 20, -65, -151, -117, -84, -81, -77, -74, -70, -125, -180, -116, -52, -78, -103, -69, -35, -25, -15, -65, -115, -87, -59, -90, -121, -146, -171, -76, 17, -58, -133, -149, -165, -171, -177, -122, -68, -26, 16, 0, -16, -9, -2, 3, 10, 25, 39, -5, -51, 4, 59]
-942E9o3o4K9L0K8K9k9k9k9l0J7J6m3m3J62J64j15j13P0P2J2J2m3m4m3m2RJ0J0Rk1k3R5R7
-950A56j01j00m1m1O2O2n7n8O2O1LKNMNMk8k8k9k9N1N0N1N1j8j9j8j8m9m9n0m9%%J20J18q6
-959aq7L2L1n7n8n7n7N4N4N4N4j30j31O8O8M2M3j7j7Q4Q2j14j15Q9Q8l0l0J13J13q5q4n5n5
-967a11O4O3l3l5K6K5l4l5l4l4o8o8N1N1K9K9K9K9POPPonnoqqqqJ54J55j23j23l0l0Q8Q9l0
-977F7l1K9K9j12j14NOM3M4M2M3K9K8r0r0onooJ7J7J6J7J2J3J1J2J3J2J2J3k8k7k6k8L9L9
-986C9p8q0K9K9K9K9jjjjn2n2O7O6l3l3K6K5poqpn9o0J%J09J08j0j0r4r6K3K4K6K7K7K5j6
-995Dj4j6j6J8J8J7J8k0j8j9k0O5O6n3n2lkN6N7N0N0j49j47KLO2O1l2l4l4l3J18J19q0p8Q9
-1004E3Q9j09j08M4M3M3M4m7m7J2J3p2p4M6M6oooojjkjn0n0J48J47m0m0m1l9M1M3p6p6J2J3
$$ y = [59, -4, -68, -39, -9, 19, 48, 19, -10, -39, -69, -52, -36, -79, -122, 40, 204, 89, -24, 46, 118, 130, 142, 99, 55, 12, -30, -21, -11, -1, 8, -13, -36, 59, 156, 55, -45, -86, -127, -65, -3, -60, -118, -56, 5, 8, 10, 15, 19, 24, 28, 0, -28, -57, -86, -35, 15, 66, 117, 99, 80, 62, 44, -5, -54, -104, -153, -153, -153, -33, 85, -1, -88, -56, -25, -82, -140, -197, -254, -200, -146, -92, -38, -168, -299, -231, -163, -121, -78, -95, -112, -28, 54, -60, -175, -86, 2, -28, -58, 55, 168, 83, -1, -56, -111, -47, 16, -17, -52, -26, -1, -35, -70, -104, -138, -206, -274, -223, -172, -143, -114, -85, -56, -49, -43, -36, -29, -35, -40, -45, -51, -59, -67, -75, -83, 71, 226, 103, -20, -50, -80, 8, 97, 67, 36, 65, 94, -18, -132, -127, -121, -78, -34, 8, 51, 80, 108, 18, -72, -78, -83, -89, -95, -78, -61, -45, -28, -16, -3, 8, 20, 33, 45, 57, 70, 42, 15, -11, -39, 0, 39, -39, -119, -90, -61, -32, -3, -4, -5, -6, -7, -59, -111, -44, 22, -11, -44, -18, 7, 0, -6, -14, -21, -80, -140, -139, -139, -30, 78, 68, 58, -36, -132, -109, -85, -59, -32, -5, 20, 4, -10, -26, -42, -24, -6, 11, 29, 9, -9, -28, -48, 17, 83, 30, -22, -25, -27, 29, 86, 136, 186, 37, -110, -108, -105, -43, 18, -14, -48, -82, -115, 3, 122, 42, -36, 53, 142, 33, -75, -31, 12, 55, 99, 52, 5, 17, 30, -42, -116, -70, -24, -30, -36, -42, -48, -49, -50, -52, -53, -103, -153, -5, 142, 102, 62, 21, -18, 23, 66, -10, -86, -74, -61]
-1013f1J3J3M0M2p6p7qqJ12J10mlmml7l7K2K2q3q5L4L5K2K2l8l7J11J13q7q5p5p5M4M4j2j1
-1022a08j2j2N3N3N2N3j19j19j%K2K2K1K2LKKLL9L9L9M0o1n9N7N9K2K3l8l7j39j41N9N8m3
-1030a46m2P6P7N9O1n9n8J6J5P4P6p6p5j7j6LMLMNMNNJJn9n8O8O7n0n1J28J29RJ0n9n9n9n8
-1040d2O9P0m9m9JKKKJ03J03r7r6L0L0k9l0K9K8q9r0O9O9P0O9M0M0j04j04J36k59l7l7J12
-1048c8J11q6q7O0N9N9O0j02j00J7J8Q2Q3j15j14M1M1M0M1p8p9M0M0l0l1K9K9l2l3l2l3K8
-1056a12K9K8K8o3o4N6N5j1j1j2j1J5J5J5J5MLO3O3j00j00J9J9NNNNM0M1M2M1m8m8m7m8QQ
-1065d8QRk2k2k1k2MNMNJ22J24p5p4l7l6Q2Q3rrj0rQ2Q1j18j16ONOMM0M0k0j9j10j10RRJ12
-1074d7J12ppNONOj05j06J3J3N5N6N4N6n2n1n1n1K2K2K1K2l8l8K2K1l3l3Q6Q5K2K1l8l8L7
$$ y = [-61, -48, -35, 5, 47, -29, -106, -114, -122, -10, 100, 96, 93, 89, 85, 48, 11, 33, 55, -28, -113, -79, -44, -22, 0, -38, -75, 36, 149, 62, -23, -98, -173, -129, -85, -97, -108, -120, -132, -79, -26, 26, 79, -40, -159, -160, -160, -138, -116, -95, -73, -70, -68, -66, -63, -24, 15, 54, 94, 33, -26, 31, 90, 112, 135, 97, 60, -79, -220, -161, -103, -146, -188, -112, -35, 24, 85, 26, -32, -16, -1, 73, 149, 73, -2, -19, -35, -32, -28, -25, -21, -16, -12, -7, -2, -1, 0, -59, -117, -49, 18, -32, -83, 45, 174, 183, 193, 134, 75, 16, -42, 27, 97, 48, -1, 0, 2, 4, 6, 109, 212, 115, 19, 49, 79, 50, 20, 49, 77, -12, -102, -33, 36, 106, 175, 215, 255, 151, 47, 183, -76, -113, -150, -38, 73, -13, -100, -40, 19, 78, 138, 36, -64, -47, -29, 53, 136, 21, -93, -52, -11, 29, 70, -8, -87, -47, -7, -37, -68, -39, -10, -42, -75, -107, -140, -112, -83, -55, -27, -90, -154, -98, -43, -54, -65, -77, -88, -73, -58, -43, -28, -24, -21, 42, 105, 5, -95, -76, -57, -52, -47, -42, -37, 3, 44, 86, 127, 79, 31, -16, -64, -56, -48, -40, -31, -53, -75, -96, -118, -114, -109, -105, -100, 22, 146, 71, -3, -40, -76, 6, 89, 80, 71, 61, 52, 134, 215, 97, -19, -13, -8, -2, 2, 42, 82, 62, 43, -67, -177, -168, -159, -47, 65, 58, 51, 56, 62, 67, 73, -32, -138, -125, -112, -57, -1, 53, 109, 57, 6, -45, -96, -74, -52, -31, -9, -47, -85, -63, -42, -75, -108, -22, 63, 85, 106, 68, 30, 67]
-1083F7L6q3q1O3O4NMM5M4p5p5O5O4NMj29j29j0j0R6R4L6L6o3o3N5N6l8l9r7r8J04J04r4r4
-1092a31J9J9J9J9L6L5L6L7k9k9k8k8j3j4j4j3j3j3j3j3J1J1P1O9J11J10q7q8j0j0rj0K7K7
-1100I2r2r0R6R8j00j00M2M2j8j8R2R2k6k7J5J4j04j04R9J00r8r8kkN7N6k5k6L4L3LMn6n6
-1108g3N1M9N1N0j1j2j2j1j9j9j9j9O1O2n8n8j3j2j3j4j1j1J07J08J1J1J1J1p2p2p2p2J7J7
-1117e6J7J8J2J2J3J3J6J7J6J7j0rL5L6M8j91j30J08MNJ9J9p2p4O6O4q2q4R5R5M4M4n5n5m
-1125A1nLLJ2J31K7k11M1J61l2Q7k28RK2K3o0o1jjJ00J01o3o3r6J40L0q8j38J01m1m1L7L8
-1133e2k2k2L7L8J18Jj31J06K6K5j5j4qpj56l8J67p0L6L6K1K2K5K5p4p4K6K5K5K5QQp6p6j01
-1142a36J36LLm7m7R2k4p0J67j13J22Q4l5M2j96O5O5j27j29J27J25r2r1R0R2L2L2m5m5R4R4
$$ y = [67, 103, 20, -61, 2, 66, 71, 75, 120, 164, 89, 14, 79, 143, 148, 152, 23, -106, -116, -126, -30, 64, 100, 136, 73, 10, 65, 121, 83, 44, -53, -151, -47, 57, -37, -131, -112, -93, -74, -55, -19, 16, 52, 89, 60, 31, 3, -25, -38, -52, -66, -79, -92, -105, -118, -131, -120, -109, -38, 31, 142, 252, 165, 77, 67, 57, 48, 38, 65, 92, 0, -90, 6, 104, 4, -96, -54, -12, -30, -48, 44, 136, 110, 83, 98, 112, 8, -96, 3, 103, 5, -93, -95, -97, -40, 16, -9, -35, -1, 32, 35, 39, -17, -73, -22, 27, 78, 128, 117, 105, 93, 82, 63, 44, 25, 6, 67, 129, 71, 13, 0, -12, -25, -39, -50, -61, 46, 154, 165, 176, 187, 198, 126, 54, -18, -90, -73, -56, -39, -21, -9, 3, 16, 29, 45, 62, 78, 95, 85, 76, 111, 147, 195, 4, -126, -18, -14, -9, 10, 29, -43, -117, -51, 13, -69, -153, -58, 37, 81, 125, 70, 15, 11, 6, 9, 12, 24, 155, 182, -29, 12, 173, 141, 228, 0, 9, 31, 54, -6, -67, -68, -69, 31, 132, 69, 6, -90, 50, 80, -8, -146, -45, -86, -127, -90, -52, -74, -96, -59, -21, 97, 98, -33, 73, 99, 124, 109, 95, 87, 80, -76, -114, 53, -17, 19, 55, 76, 98, 123, 148, 74, 0, 26, 51, 76, 101, 109, 117, 41, -35, -136, 0, 3, 6, -41, -88, 4, -20, -90, 77, -36, 86, 170, 135, 177, -19, 46, 111, -16, -145, -18, 107, 15, -76, 14, 106, 138, 170, 125, 80, 174, 268]
-1149B68j11j11n0n1L4L4L5L5o6o5P2P4o9o7rqL6L5L6L6KLLKPOn3n3OOOOJ7J7m2m2K0J9l9
-1159b1m0J25J26j32j31O5O3p3p4M8M7M9M8j24j26N4N3P1P2J2J3J7J7m3m2j31j32Q6Q7J18
-1166A02J20n9n9j14j15O3O3J9J9J8J9N9N8q1q0qqqpklllp0p1J48J47p2p2K8K7l3l3J05J05
-1175A99n0m9J0Rn2n2n1n2N4N4nnJ0J1J1J1k2k3k2k2PQQQ%J%%N5N5o4o2O5O7PPk5k6k5k5n8
-1185c3n9O1N9n0n2O8O7k2k1L8L8p6p4j6j6P7P6J8J7j3j2j3j3m6m5m6m7L7L7L7L6k4k5k5k6
-1193h8LKJ20J21L2L2q7q8N3N3N3N3j27j27oqk6k5L5L3k1k1k1k2L1L0L0L1%JJJQQPQj1j1j29
-1203g2j30O3O2J21J22n6n5O3O4m3m2m3m3O6O5n4n4j1j2M8M8q6q5L3L2pqN1N2p4p4M4M4J5
-1211D4J6m4m3M2M3J17j21n2n1J30J32o6o6o6J73j62P7m2m2j8j6l3l2K56J9j80N8p5p7J31
$$ y = [268, 157, 46, -4, -55, -21, 13, 48, 83, 17, -48, 24, 98, 29, -38, -47, -55, -19, 16, 52, 88, 90, 93, 96, 98, 105, 111, 58, 5, 11, 17, 23, 29, 46, 63, 21, -21, -1, 18, -21, -61, 64, 190, 58, -73, -8, 55, -18, -92, -44, 3, 52, 100, -24, -150, -96, -43, 28, 100, 112, 125, 142, 159, 116, 74, -57, -189, -103, -16, 102, 222, 163, 104, -10, -125, -62, 1, 20, 39, 57, 76, 135, 193, 112, 32, 24, 16, 8, 1, -1, -4, -7, -10, -80, -151, -3, 144, 72, 0, 28, 55, 22, -11, 94, 199, 149, 100, 110, 119, 67, 15, -36, -88, -34, 20, 15, 10, 20, 31, 42, 53, 31, 8, -14, -36, -29, -21, -13, -5, -5, -4, -4, -4, 51, 106, 42, -20, 45, 112, 119, 126, 101, 75, 50, 25, -33, -92, -31, 28, -22, -74, -6, 61, 39, 18, 56, 94, 18, -56, -72, -88, -11, 65, 83, 100, 87, 75, 62, 49, 3, -42, -88, -135, -98, -61, -24, 12, -12, -37, -62, -88, -85, -83, 37, 158, 190, 222, 135, 47, 100, 153, 206, 259, 132, 5, -1, -9, -35, -60, -25, 8, -13, -34, -55, -77, -46, -16, 14, 45, 45, 46, 47, 48, 56, 64, 71, 79, 68, 57, -72, -202, -139, -77, 44, 166, 110, 55, 118, 182, 139, 97, 54, 11, 77, 142, 88, 34, 23, 11, 59, 107, 21, -64, -31, 1, -6, -14, 37, 89, 15, -59, -15, 29, 44, 60, 16, -27, 15, 58, 175, 54, 2, -49, 81, 213, 147, 81, 15, 188, 26, 103, 61, 19, 1, -15, -48, -80, 176, 195, 15, 73, -2, -79, 52]
-1219E2j06M1M1K6K7M4M4p6p5L0K9Q9j50J15j23mmJ9J9K0J9j0j1k5k5J51q7M7M7n7n7n7n7
-1227f4LMLLJ8J8J8J8nnnnK2K1j71O6l6l6K32oM3M3r2r0k0k0l5K02LKm2m3j2j3M7M7K6K6P1
-1236B36P0M4j95o1o0l0k9k9l0O1N9m3m4p7J60l2l3k0k0k0k1M6M6M4M6M3M3M3M3p2p2j3j3
-1244G0o7o6N2N1J8J9m1m0O2O3LMopo6o5L5L7k4k3P3P3m6m6j8j8j7j7k2k2L8L7p3p4M5M6N0
-1253A8N1N2N1PPOPn5n5n6n4n1n1O8O7k1k1k1k2ppJ11J12k4k4k5k4rqqrpqqrK3K1K3K2P2P2
-1263B06j26j26l0k9Q9Q8Q8Q9l1l1j3j3p2p2LLMLj8j7j8j8L2L1L1L2j0rj0ro7o8J29J31l4
-1272A38l4K5K5q5q4L3L4L0L0Q4j94o2K14p9p7J0J1P0P0JJp1p1K17J9o8o8n4n5n3n4J14J14
-1280A31o1o1j94J62K0K0J6J6P5P6n0n0J0J0l8l7Q1Q1mmmmj00r9J9J9O3O3LLo5o5N4N5r9r7
$$ y = [52, -54, -13, 28, 54, 81, 125, 169, 93, 18, 48, 77, 166, 16, 131, 8, 4, 0, 19, 38, 58, 77, 67, 56, 31, 6, 157, 70, 117, 164, 107, 50, -7, -64, -61, -57, -54, -51, -33, -15, 3, 21, 16, 11, 6, 1, 23, 44, -127, -61, -97, -133, 99, 93, 136, 179, 87, -3, -23, -43, -78, 124, 127, 129, 87, 44, 32, 19, 66, 113, 139, 165, 236, 306, 350, 155, 94, 34, 4, -25, -54, -84, -23, 36, -7, -51, -128, 32, 0, -33, -53, -73, -93, -114, -68, -22, 22, 68, 111, 154, 197, 240, 168, 96, 83, 70, 3, -63, -11, 40, 58, 77, 36, -4, 58, 121, 124, 128, 122, 115, 49, -16, 19, 56, 32, 9, 82, 155, 109, 63, 45, 27, 10, -7, -29, -51, -13, 24, -49, -123, -78, -32, 18, 69, 121, 172, 179, 186, 192, 199, 144, 89, 33, -21, -72, -123, -55, 12, -9, -30, -51, -73, -80, -87, 24, 136, 112, 88, 63, 39, 30, 22, 14, 5, -2, -10, -18, -27, -4, 17, 40, 62, 134, 206, 80, -46, -76, -105, -16, 72, 160, 249, 218, 187, 174, 161, 89, 17, 20, 23, 27, 30, 12, -5, -23, -41, -9, 22, 53, 85, 75, 66, 56, 47, -20, -88, 41, 172, 138, 104, 129, 154, 69, -15, 18, 52, 82, 112, 196, 2, -60, 154, 75, -2, 8, 19, 89, 159, 160, 161, 90, 19, 236, 255, 187, 119, 65, 10, -43, -97, 17, 131, 70, 9, -185, -23, -3, 17, 33, 49, 124, 200, 150, 100, 110, 120, 82, 45, 126, 207, 203, 199, 195, 191, 91, -8, 11, 30, 93, 156, 159, 162, 97, 32, 86, 141, 42, -55]
-1289e5R9J00m8m7m8m7jkkjjjN8N9O2O3n7n6j7j7j7j7N8N7n4J44m1m2k9k9j1j2j2j2J19J18
-1298B61q0q1J6J5m4m5QQQQj8j9j8j8J25J26OOp5p6p6p4K7K6K7K7k8k7R1R2r6r7J02J02j01
-1306A08j01R7R7j05j03R3R3j17j16Q1Q1j9j9j9j9L6L5L6L6j29j27P0O9QQQQl5l6l4l5q2q1
-1314b13J17J17O5O5NOJKKJk5k6k5k6L0L1l0k9K2K1r7r6J33J35J6J5NOj15j13L4L5L5L5nn
-1323A29nnL6L6k3k4n9n9O1O0j8j8j8j8N8N8o1o1o5o4N4N3M4M4j5j6J00J00k0j9p1p2M8M8
-1331B18j2j1j2j2K0J9K0J9q9r0L0K9n0n0P0O9m8m7m8m6O0O2n8n7Q3Q4l5l6M3M2p6p7L3L3
-1340H0L3L2k7k8k8k8O2O2n8n8L2L1q8q7Q1Q2K2K3P0P1j28j29L6L6k4k4n3n5O3O4r4r6K3K4
-1348g8POJ26J26k3k3k3k3k4k3k4k4LKn6n8Q3Q1l7l5N5N6o3o1P4P6m3m4M6M6p3p3R3R3k6k6
$$ y = [-55, 44, 144, 96, 49, 1, -46, -47, -49, -51, -52, -53, -54, 4, 63, 125, 188, 131, 75, 58, 41, 24, 7, 65, 122, 68, 212, 171, 129, 100, 71, 60, 48, 36, 24, 143, 261, 181, 100, 116, 131, 87, 42, 50, 58, 66, 74, 56, 37, 19, 1, 126, 252, 258, 264, 189, 113, 37, -37, -10, 16, 43, 70, 42, 15, 106, 198, 102, 5, 107, 209, 108, 7, 104, 201, 96, -7, 86, 179, 62, -54, 27, 108, 89, 70, 51, 32, 68, 103, 139, 175, 46, -81, -11, 58, 66, 74, 82, 90, 55, 19, -15, -50, -132, -213, -96, 21, 86, 151, 156, 162, 163, 165, 167, 168, 143, 117, 92, 66, 96, 127, 97, 68, 90, 111, 14, -82, 51, 186, 202, 217, 222, 228, 113, 0, 34, 69, 104, 139, 134, 129, 124, 119, 155, 191, 168, 144, 85, 26, 87, 147, 129, 111, 93, 75, 133, 191, 130, 69, 4, -60, -6, 47, 91, 135, 120, 104, 204, 304, 284, 265, 194, 122, 170, 218, 206, 195, 183, 171, 191, 210, 230, 249, 160, 70, 100, 129, 79, 29, 99, 168, 120, 73, 25, -21, 39, 101, 43, -14, 69, 153, 118, 82, 125, 167, 91, 14, 47, 80, 113, 145, 118, 90, 62, 34, 96, 158, 100, 42, 74, 105, 17, -70, 11, 93, 115, 138, 208, 279, 151, 22, 58, 94, 70, 46, -7, -62, 1, 65, -29, -125, -102, -78, -71, -65, 61, 187, 164, 141, 118, 95, 71, 48, 24, 0, 3, 5, -51, -109, -26, 55, 18, -17, 38, 94, 31, -30, 44, 120, 77, 33, 79, 125, 52, -21, 72, 165, 139, 113]
-1357A13k3k2L7L7r3r3K6K5kkN8N8noonn8n7O0O2K8K7l2l2K7K6r2r2M6M6M7M6jkkkj00r9L9
-1366a8L8J6J5J05j33j74O4J4J4O2O3P7P8k01L7n1n1J19j18P4P4k3k3qrr6J39PPj47j47L1
-1374a65L2P5P4J64p4r8J41o8o8kkkkQ1Q1n8n8j3j3j3j3J9K0l9m0J19J21n9n8M1M2j9j8k3
-1382A05k3L7L6m1m2N8N7j8j8j8j8n9n9K5K5M7j90N8N6q7J49J5J6J6J6J6J6j17j15K2K3K4
-1390A2K5J59q0o0o0K3K3KJn7n8NMNNL5L3k4k5M3M4M4M4o9o9J10J09j83j81J54J54j5j5j5
-1399A23j5p8p7O0O1p4p3O5O3R3R3m6m6j%%jj27j26J2J1O8O7l2l1R8R9o4o5k16K2K50j46L3
-1407@L1J07J07o3o3llPPQPk9l0O9P0j9j9j9j9o1o1P8P8k6k6k5k6J9J9J9K0p5p4K6K5m0m0
-1416b4J9J8O5O4l4l5JKJJo8o7L1L0l6l7J41J41j42j41J54J56p0p0j1j1opj06j06P9P8k0k0
$$ y = [113, 90, 68, 105, 142, 49, -44, -18, 7, 5, 3, 61, 119, 114, 108, 102, 97, 39, -18, 42, 104, 132, 159, 127, 95, 122, 148, 56, -36, 10, 56, 103, 149, 148, 146, 144, 142, 42, -57, -18, 20, 36, 51, 156, 23, -151, -87, -73, -59, 3, 66, 143, 221, 20, 57, 6, -45, 74, -44, 30, 104, 81, 58, 50, 41, -55, 84, 91, 98, -49, -196, -165, -133, -58, 16, 180, 106, 8, 149, 81, 13, 11, 9, 7, 5, 86, 167, 109, 51, 38, 25, 12, -1, 18, 38, -1, -41, 78, 199, 140, 82, 123, 165, 146, 128, 105, 82, 119, 155, 114, 72, 130, 187, 169, 151, 133, 115, 56, -3, 22, 47, 94, -96, -38, 18, -69, 80, 95, 111, 127, 143, 159, 175, 58, -57, -35, -12, 12, 37, 196, 116, 56, -4, 19, 42, 44, 45, -12, -70, -65, -61, -56, -51, -16, 17, -7, -32, 11, 55, 99, 143, 74, 5, 115, 224, 41, -140, 14, 168, 153, 138, 123, 108, 30, -47, 13, 74, 0, -73, -8, 55, 148, 241, 195, 149, 148, 148, 148, 147, 20, -106, -94, -83, -15, 52, 20, -11, 87, 186, 122, 57, -159, -137, 113, -33, 0, 31, 138, 245, 182, 119, 116, 113, 120, 127, 135, 142, 113, 83, 152, 222, 203, 184, 165, 146, 85, 24, 102, 180, 154, 128, 103, 77, 96, 115, 134, 154, 79, 5, 31, 56, 16, -24, -5, 13, 78, 142, 108, 73, 74, 76, 77, 78, 10, -57, -26, 4, -32, -69, 72, 213, 71, -70, 84, 240, 170, 100, 89, 78, 72, 65, -41, -147, -68, 10, -10, -30]
-1424c0QQRPj7j7J20J21K4K3j56j54l5l5J04J03m1m1l9m1J8J8J7J8QRRRL5L5L5L5j0j0p0p0
-1433Gr7r9J01R9K2K2K2K2J01J02j77j75K6K5K7K6k1k0k0k1J3J2J2J3k7k9R0R1LKk15K3K21
-1441A81j75O3O3LKLKJ3J2j07j05J00J02j8j7o3o1N6N7j21j22P7P5N6N6mmn1n0n0n0j6j6J04
-1449eJ02L5L4k5k5n1n1O8O8n2n2n1n1P1P2m7m5OPPPl6l8Q1Q1l6l7l7l6lmllJ4J4m6m5J05
-1459gJ03J%j62P5J65k32K1K1mmP7P9m1m1KLn6n7N3N2o5o6P9P8m0l9klklj0j0j0j0M4M2M3
-1468G4M3o6o5N2N3m4m4P4P5k0k1q0q0j0j1j0j1P9P8P9P9r1r2l1l1Q7Q7l1l2M1M0j9j9l0l0
-1477G3l0l0J10J10qrq6q6L4L3M8M8p2p1qqN1N1r6r5k00J97k0k0MNJ6J5J6J6M0M2j8j8K5K5
-1485H4r3r4J05J05j3j4jjjjnnN5N5q1q0L8L9k2k2R7R7m7m6m6m7j3j2j3j3%jn9o0J25J27P
$$ y = [-30, -22, -14, -5, 2, -15, -32, 88, 209, 233, 256, 100, -54, -89, -124, -20, 83, 42, 1, -38, -79, -61, -43, -26, -8, 0, 9, 18, 27, 62, 97, 132, 167, 157, 147, 77, 7, -90, -189, -88, 11, 33, 55, 77, 99, 200, 302, 125, -50, -24, 1, 28, 54, 33, 13, -7, -28, -15, -3, 9, 22, -5, -34, 56, 147, 150, 152, -63, -40, 181, 6, 69, 132, 135, 137, 140, 142, 155, 167, 60, -45, 55, 157, 139, 122, 59, -2, 54, 111, -10, -132, -55, 20, 76, 132, 128, 124, 73, 23, -27, -77, -93, -109, -5, 97, 132, 166, 141, 116, 65, 14, 82, 150, 98, 46, -5, -56, 15, 87, 40, -5, 1, 8, 15, 22, -14, -52, 29, 110, 74, 37, 0, -36, -39, -43, -46, -49, -35, -21, -67, -112, -7, 96, 97, 97, -65, 10, 175, -57, -36, -15, -19, -23, 54, 133, 92, 51, 53, 56, 0, -57, -4, 48, -17, -83, -4, 74, 34, -5, -7, -10, -12, -15, -25, -35, -45, -55, -11, 31, 74, 117, 51, -14, 38, 91, 47, 3, 77, 152, 132, 111, 31, -49, -59, -70, -80, -91, -12, 66, 145, 224, 133, 41, 10, -21, 66, 153, 122, 90, 131, 171, 152, 133, 103, 73, 43, 13, 123, 233, 225, 216, 130, 44, 78, 111, 159, 207, 135, 64, 56, 48, 99, 150, 54, -41, -241, -44, -64, -84, -80, -75, -59, -44, -28, -12, 28, 70, 52, 34, 59, 84, -9, -103, 2, 107, 94, 80, 79, 78, 77, 76, 71, 66, 121, 176, 95, 15, 53, 92, 70, 48, 145, 242, 195, 149, 103, 56, 43, 31, 18, 5, 5, 4, -55, -115, 10, 137, 144]
-1494A44Pk7k7q7q6J5J5P4P5l0k9k9k8O6O8n2n1J7J7m2m2l5l4K4K5K5K5K4K5jjjkRRRRRQR
-1504A04RPPPPj12j11Q5Q7M5M6p3p4l1l0K7K8K7K7l3l3K0J9J9K0j1j1j0j1m4m3P4P5m7m6J3
-1513C3J3RRRJ0N7N6o2o2L1L0k8k9o5o4N4N4K8K9l1l2qpo7o7J04J05M6M5l9l8l9l8rrqrJ0
-1522B1J0O9P0K6K6r3r3P5P6m4m4J5J6J5J6MNMNm6m5m5m4LNNNJ9K0K0J9POPOk3k3k4k3lkl
-1533B0lL4L5q5q4MMMMJ1J2J1J1L9M1M0M0k9l0k9k9kkkjkkkkkkkkK6K8K7K7K3K3K3K3p4p4
-1543E0M6M5n5n5n5n5Q4Q5l4l4L3L2k7k7o3o4nnN0N0M8N0J1J1j08j07J0J1J0J0j2j2j3j2L1
-1552g6L0L0L0j5j6j5j6J6J5P4P5L2L1o7o8nnN4N5l8l7K2K3K0K0l9l9RRRRnoo4o4L7L8L9L8
-1561A40n1n1n0n1J8J9J8J8j%%%%%N9N9m0m0K0J9K0K0J9K0klkkl6l5l6l6L1L1k9k8K9L0l0
$$ y = [144, 151, 124, 97, 10, -76, -61, -46, 28, 103, 73, 44, 15, -13, 53, 121, 69, 18, 35, 52, 10, -32, -67, -101, -77, -52, -27, -2, 22, 47, 46, 45, 44, 42, 51, 60, 69, 78, 87, 95, 104, 113, 120, 127, 134, 141, 29, -82, 3, 90, 135, 181, 108, 34, 3, -27, 0, 28, 55, 82, 49, 16, 36, 55, 74, 94, 83, 72, 62, 51, 7, -36, 38, 113, 66, 20, 33, 46, 55, 64, 73, 83, 140, 196, 134, 72, 103, 133, 105, 76, 11, -53, 1, 55, 83, 112, 81, 49, 41, 34, -33, -100, 4, 109, 155, 200, 161, 123, 84, 46, 37, 28, 20, 11, 21, 31, 100, 170, 196, 222, 129, 36, 111, 187, 143, 99, 114, 130, 145, 161, 165, 170, 174, 179, 133, 88, 43, -1, 2, 7, 12, 17, 36, 56, 76, 95, 102, 108, 115, 121, 98, 75, 51, 28, 25, 23, 20, 17, 51, 86, 1, -83, -79, -75, -71, -67, -56, -44, -33, -22, 17, 58, 98, 138, 109, 79, 50, 21, 19, 17, 15, 14, 12, 10, 8, 6, 4, 2, 0, -2, 24, 52, 79, 106, 129, 152, 175, 198, 124, 50, 96, 141, 86, 31, -24, -79, 5, 90, 56, 22, 55, 87, 60, 33, -30, -94, -99, -104, -54, -4, 44, 94, 105, 116, 8, -99, -89, -78, -68, -58, -70, -82, -95, -107, -76, -46, -16, 14, -1, -17, -32, -48, -32, -17, 57, 132, 164, 195, 128, 60, 55, 50, 104, 159, 121, 84, 106, 129, 149, 169, 130, 91, 100, 109, 118, 127, 122, 116, 52, -12, 25, 63, 102, 140, 89, 38, -12, -63, -45, -26, -8, 10, 9, 9, 9, 9, 9, 9, 68, 127, 87, 47, 67, 86, 106, 126, 145, 165, 163, 160, 158, 156, 120, 85, 49, 13, 44, 75, 46, 18, 47, 77, 47]
-1571D7l0Q2Q2n8n7k0k0M0L9N5N5mnq6q7k6k6j1j1M8M9M9M9j1j1j0j0o9o9J0RRJ0J2J3J2J2
-1580F1L7L7k2k3Q8Q7n2n1q4q3k5k4N7N7kkQQO7O8j11j10j2j2K2K1K1K2K1K1l8l9O5O4NNo4
-1589H8o4L6L5m9m8Q9R0m9m9J1J0J9K0J9J9n4n3OOl2l1K8K8klklK0K0m0l9L3L3L3L3k1k0k1
-1598I6k0nmnmL5L5k5k4m6m6N2N3ppopnnnnN5N5m5m5k0k1M0L9l5l4l4l3N1N1qqRJ0n1m9L8
-1608A0L9L8L9o5o5J13J13n6n7n6n5Q8Q9n0n0p9q1J9J8L7L7k3k1L7L9L8L9%%%
$$ y = [47, 17, 99, 181, 123, 66, 46, 26, 66, 105, 160, 215, 211, 206, 120, 33, 7, -19, -30, -41, 7, 56, 105, 154, 143, 132, 122, 112, 43, -26, -16, -7, 2, 12, 24, 37, 49, 61, 98, 135, 113, 90, 178, 265, 213, 162, 78, -5, -30, -54, 3, 60, 58, 56, 64, 72, 139, 207, 96, -14, -26, -38, -16, 5, 26, 48, 69, 90, 52, 13, 78, 142, 147, 152, 88, 24, 60, 95, 46, -2, 87, 177, 128, 79, 90, 100, 119, 139, 158, 177, 123, 70, 76, 82, 50, 19, 47, 75, 73, 70, 68, 65, 85, 105, 65, 26, 59, 92, 125, 158, 137, 117, 96, 76, 71, 67, 62, 58, 93, 128, 103, 79, 33, -13, 39, 92, 85, 78, 72, 65, 60, 55, 50, 45, 100, 155, 110, 65, 45, 24, 64, 103, 68, 34, 0, -33, 18, 69, 61, 53, 62, 72, 21, -28, 10, 49, 87, 126, 61, -4, 109, 222, 166, 109, 53, -2, 86, 175, 125, 75, -4, -85, -66, -48, -11, 26, 3, -18, 19, 58, 96, 135, 135, 135, 135]
-1616A35
##$OBSERVED INTEGRALS=	(X Y Z)
(6.8999887790205978177, 6.9645580299356124598, 0.043745099748234088366)
(6.7248991222544534097, 6.8081242930399685775, 0.089062853160782606832)
(5.8877172985256773785, 6.033901696142507376, 0.043715573670992387278)
(5.0455505367582924592, 5.1131217603190775023, 0.067245791995233242244)
(3.783203561107542523, 3.8281993088890842181, 0.1342266993236880257)
(3.3409252326565854752, 3.4107884613753656211, 0.09137800971927741156)
(2.5226705371782340848, 2.6050317410660439599, 0.092071654105788949818)
(1.6986229924278639647, 1.8182469071495916957, 0.093164942628272559566)
(1.3641910554986322879, 1.4326535108940163799, 0.088755948317521274338)
(1.2529395654811339433, 1.3641910554986322879, 1.1020378954617804368)
(0.84546108102962491682, 0.92446630470290747095, 0.15459553186842894812)
##END=	
##TITLE=	Jan31-2020.40.1.1r
##JCAMP-DX=	6.0	$$ MestReNova 14.1.0-24037
##BLOCK_ID=	3
##DATA TYPE=	NMR PEAK TABLE
##DATA CLASS=	PEAK TABLE
##CROSS REFERENCE=	NMR SPECTRUM: BLOCK_ID=2                                     
##.OBSERVE FREQUENCY=	400.05240029848198446
##.OBSERVE NUCLEUS=	^1H
##NPOINTS=	213
##FIRSTX=	0.076275512485727420264
##LASTX=	7.6014881471861306395
##XFACTOR=	1
##YFACTOR=	1
##FIRSTY=	1886.9517419702735879
##XUNITS=	PPM
##YUNITS=	ARBITRARY UNITS
##PEAK TABLE=	(XYW..XYW)
0.076275512485727420264,1886.9517419702735879,0.002686125707021500518
0.71036357205861067055,11554.916268531324022,0.0037432598350598720281
0.72796263236156311116,25748.447124652437196,0.002667722421339791157
0.73160484333229536258,4724.3579707419567058,0.0052819296120870697087
0.7450525126126847919,10345.212165761591677,0.0052819296120870697087
0.83942568032807773903,2942.7407538185657359,0.00086816945873145301253
0.86795895492039565333,1661494.6363379699178,0.004613217330176783669
0.87741263158390125909,115742.99211830252898,0.0045881712336952613224
0.88540717355717346582,4351163.7293470352888,0.0023845340671286418405
0.8892920790167248013,858603.82647947466467,0.013035250144806387329
0.90196843081213673443,1599744.0257889449131,0.0061284826345480028845
0.9344087465142694171,4497.2113980852691384,0.0085738669987527518085
0.96311576036922030841,6564.7907065315666841,0.0018412044177887208676
0.97963315056045630058,6794.5362855902876618,0.001952749858287698443
0.99239358753754858267,3257.3714614480722958,0.0025819675491755636476
1.0041256886263780768,3151.8642945265237358,0.003340521029630262595
1.0222202750222735279,5632.1823471961879477,0.0051888007031522772119
1.039034349763929832,21064.665214789270976,0.0028206674802269751656
1.0425265390292703938,3817.5350883016490116,0.0026325367781272670381
1.0551002947869481119,4710.714774198608211,0.0054898137199109950379
1.0675056845667465488,7046.6064025392115582,0.001862936920052247862
1.11072744485444308,27547.390140335297474,0.039770479163675605261
1.1304800670261512252,4669.4347537378016568,0.0027004056876124078908
1.2641036759649117993,26832543.788952283561,0.0064627024046970977383
$$ [...]
Compound,None,,1,0.40395675214188181412,0,0
Compound,None,,1,-0.44889938419374902923,0,0
Compound,None,,1,0.17829208166690552195,0,0
Compound,None,,1,-0.66065527642277732667,0,0
Compound,None,,1,-0.29512762293572186723,0,0
Compound,None,,1,0.10223755147227740758,0,0
Impurity,Artifact|Weak,,1,-1,0,0
Compound,None,,1,0.30230058418822375321,0,0
Compound,Artifact|Impurity|Weak|13C Sat.,,1,0.60000000000000008882,0,0
Artifact,Artifact|Weak,,1,-0.34618089575863558727,0,0
Compound,Artifact|Impurity|Weak|13C Sat.,,1,0.085686749850814036833,0,0
Compound,Artifact|Impurity|Weak|13C Sat.,,1,1.8184457406068172958,0,0
Compound,Artifact|Impurity|Weak|13C Sat.,,1,0.80000000000000004441,0,0
Impurity,Artifact|Weak,,1,-0.31950878883855698964,0,0
Compound,Artifact|Impurity|Weak|13C Sat.,,1,0.2000000000000000111,0,0
Impurity,Artifact|Weak,,1,1.3599499363645790595,0,0
Compound,Artifact|Impurity|Weak|13C Sat.,,1,1.999999999999999778,0,0
Compound,Artifact|Impurity|Weak|13C Sat.,,1,0.35346726960146185315,0,0
Impurity,Artifact|Weak,,1,1.9780545127830924113,0,0
Impurity,Artifact|Weak,,1,0.88958776981888698643,0,0
Impurity,None,,1,-0.15882320505347496953,0,0
Impurity,Artifact|Weak,,1,0.2910077762794765488,0,0
Impurity,Artifact|Weak,,1,-0.64083966524467583792,0,0
Impurity,Artifact|Weak,,1,0.40000000000000007772,0,0
Artifact,Artifact|Weak,,1,-0.10345900745506712848,0,0
Compound,Artifact|Impurity|Weak|13C Sat.,,1,0.60000000000000008882,0,0
Compound,None,,1,0.61430136770680587865,0,0
Compound,None,,1,1.792853432091702226,0,0
Compound,None,,1,0.24157561396417742694,0,0
Compound,None,,1,1.0631931226611461838,0,0
Compound,None,,1,0.033789038466197976462,0,0
Compound,None,,1,0.50323783141795830343,0,0
Artifact,Artifact|Weak,,1,-0.97385593470261277993,0,0
Impurity,None,,1,0.23635817487434165884,0,0
Impurity,Artifact|Weak,,1,-0.33644051206469055559,0,0
Impurity,Artifact|Weak,,1,0.40000000000000007772,0,0
Artifact,Artifact|Weak,,1,1.3847211868138076252,0,0
Artifact,Artifact|Weak,,1,1.999999999999999778,0,0
Artifact,Artifact|Weak,,1,1.999999999999999778,0,0
Compound,None,,1,0.11493730703045562658,0,0
Artifact,Artifact|Weak,,1,1.3999999999999999112,0,0
Artifact,Artifact|Weak,,1,-0.10114460033205638356,0,0
Compound,None,,1,0.64542508137236132004,0,0
Compound,Artifact|Impurity|Weak|13C Sat.,,1,1.999999999999999778,0,0
Artifact,Artifact|Weak,,1,1.3999999999999999112,0,0
Compound,Artifact|Impurity|Weak|13C Sat.,,1,-0.53527633035080834922,0,0
Compound,Artifact|Impurity|Weak|13C Sat.,,1,-0.40000000000000007772,0,0
Solvent,Artifact|Impurity|Weak|13C Sat.,,1,0.33630566952178253537,0,0
Impurity,Artifact|Weak,,1,0.39002673366375156805,0,0
Compound,Artifact|Impurity|Weak|13C Sat.,,1,1.0500827971938300198,0,0
Solvent,None,,1,0.14666053598377570832,0,0
Artifact,Artifact|Weak,,1,0.80000000000000004441,0,0
Artifact,Artifact|Weak,,1,0.40000000000000007772,0,0
Solvent,Artifact|Impurity|Weak|13C Sat.,,1,0.44972125018974956623,0,0
Artifact,Artifact|Weak,,1,0.20000000000000006661,0,0
##END=	
##END=	
