##TITLE=	(1) Feb07-2020.50.fid
ED5727

(2) Feb07-2020.50.fid
ED5727

(3) Feb07-2020.50.fid
ED5727
##JCAMP-DX=	6.0	$$ MestReNova 14.1.0-24037
##DATA TYPE=	LINK
##BLOCK_ID=	1
##BLOCKS=	3    
##ORIGIN=	Mestrelab Research S.L.
##OWNER=	ed519
##$MNOVA/LINK_BLOCK_TYPE=	PAGE
##TITLE=	Feb07-2020.50.fid
ED5727
##JCAMP-DX=	6.0	$$ MestReNova 14.1.0-24037
##DATA TYPE=	LINK
##BLOCK_ID=	2
##BLOCKS=	1    
##ORIGIN=	Mestrelab Research S.L.
##OWNER=	ed519
##$MNOVA/LINK_BLOCK_TYPE=	ITEM	$$ NMR Spectrum
##$MNOVA/ITEM/POLYGON=	(XY..XY)
5321,5835
8722,5835
8722,8208
5321,8208
5321,5835
##$MNOVA/ITEM/Z=	0
##$MNOVA/ITEM/ANGLE=	0
##TITLE=	Feb07-2020.50.fid
##JCAMP-DX=	6.0	$$ MestReNova 14.1.0-24037
##BLOCK_ID=	3
##DATA TYPE=	NMR SPECTRUM
##DATA CLASS=	XYDATA
##NUMDIM=	1
##ORIGIN=	Bruker BioSpin GmbH
##OWNER=	nmrsu
##.OBSERVE FREQUENCY=	400.05240029999998796
##.OBSERVE NUCLEUS=	^1H
##.SOLVENT NAME=	CDCl3
##.PULSE SEQUENCE=	zg30
##LONGDATE=	2020/02/07 14:50:00.000
##.ACQUISITIONMODE=	SIMULTANEOUS (DQD)
##$ORIGINAL FORMAT=	Bruker XWIN-NMR
##$MNOVA/SCALES_VERSION=	8
##$PARAMETER FILE=	(acqus, ASCII, //ch-nmrserv3.ch.ic.ac.uk/Av400D/ug1/nmr/Feb07-2020/50/acqus, 0)
$$ ##TITLE= Parameter file, TOPSPIN		Version 3.2
$$ ##JCAMPDX= 5.0
$$ ##DATATYPE= Parameter Values
$$ ##NPOINTS= 11	$$ modification sequence number
$$ ##ORIGIN= Bruker BioSpin GmbH
$$ ##OWNER= nmrsu
$$ $$ 2020-02-07 14:50:15.137 +0000  nmrsu@nmrpc
$$ $$ /opt/topspin/data/ug1/nmr/Feb07-2020/50/acqus
$$ $$ process /opt/topspin3.2/prog/mod/shimcntl
$$ ##$ACQT0= -2.04831932773109
$$ ##$AMP= (0..31)
$$ 100 100 100 100 100 100 100 100 100 100 100 100 100 100 100 100 100 100
$$ 100 100 100 100 100 100 100 100 100 100 100 100 100 100
$$ ##$AMPCOIL= (0..19)
$$ -1 0 0 0 0 0 0 0 0 0 0 0 0 0 0 0 0 0 0 0
$$ ##$ANAVPT= -1
$$ ##$AQSEQ= 0
$$ ##$AQ_mod= 3
$$ ##$AUNM= <au_zg>
$$ ##$AUTOPOS= <34 >
$$ ##$BF1= 400.05
$$ ##$BF2= 400.05
$$ ##$BF3= 400.05
$$ ##$BF4= 400.05
$$ ##$BF5= 400.05
$$ ##$BF6= 400.05
$$ ##$BF7= 400.05
$$ ##$BF8= 400.05
$$ ##$BYTORDA= 0
$$ ##$CAGPARS= (0..11)
$$ 0 0 0 0 0 0 0 0 0 0 0 0
$$ ##$CFDGTYP= 0
$$ ##$CFRGTYP= 9
$$ ##$CHEMSTR= <none>
$$ ##$CNST= (0..63)
$$ 1 1 1 1 1 1 1 1 1 1 1 1 1 1 1 1 1 1 1 1 1 1 1 1 1 1 1 1 1 1 1 1 1 1 1 1
$$ 1 1 1 1 1 1 1 1 1 1 1 1 1 1 1 1 1 1 1 1 1 1 1 1 1 1 1 1
$$ ##$CPDPRG= (0..8)
$$ <> <> <> <> <> <> <> <> <>
$$ ##$D= (0..63)
$$ 0 1 0 0 0 0 0 0 0 0 0 0 0 0 0 0 0.0002 0 0 0 0 0 0 0 0 0 0 0 0 0 0 0 0
$$ 0 0 0 0 0 0 0 0 0 0 0 0 0 0 0 0 0 0 0 0 0 0 0 0 0 0 0 0 0 0 0
$$ ##$DATE= 1581087014
$$ ##$DE= 6.5
$$ ##$DECBNUC= <off>
$$ ##$DECIM= 2496
$$ ##$DECNUC= <off>
$$ ##$DECSTAT= 4
$$ ##$DIGMOD= 1
$$ ##$DIGTYP= 12
$$ ##$DQDMODE= 0
$$ ##$DR= 22
$$ ##$DS= 4
$$ ##$DSPFIRM= 0
$$ ##$DSPFVS= 20
$$ ##$DTYPA= 0
$$ ##$EXP= <proton>
$$ ##$F1LIST= <>
$$ ##$F2LIST= <>
$$ ##$F3LIST= <>
$$ ##$FCUCHAN= (0..9)
$$ 0 2 0 0 0 0 0 0 0 0
$$ ##$FL1= 90
$$ ##$FL2= 90
$$ ##$FL3= 90
$$ ##$FL4= 90
$$ ##$FOV= 20
$$ ##$FQ1LIST= <>
$$ ##$FQ2LIST= <>
$$ ##$FQ3LIST= <>
$$ ##$FQ4LIST= <>
$$ ##$FQ5LIST= <>
$$ [...]
$$ 130000 130000 130000 130000 130000 130000 130000 130000 130000 130000 130000
$$ 130000 130000 130000 130000 130000 130000 130000 130000 130000 130000 130000
$$ 130000 130000 130000 130000 130000 130000 130000 0 0 0 0 0 0 0 0 0 0 0
$$ 0 0 0 0 0 0 0 0 0 0 0 0 0
$$ ##$ShimPowMaxUC= (0..63)
$$ 130000 130000 130000 130000 130000 130000 130000 130000 130000 130000 130000
$$ 130000 130000 130000 130000 130000 130000 130000 130000 130000 130000 130000
$$ 130000 130000 130000 130000 130000 130000 130000 130000 130000 130000 130000
$$ 130000 130000 130000 130000 130000 130000 130000 0 0 0 0 0 0 0 0 0 0 0
$$ 0 0 0 0 0 0 0 0 0 0 0 0 0
$$ ##$ShimPowMaxUG= (0..63)
$$ 524287 524287 524287 524287 524287 524287 524287 524287 524287 524287 524287
$$ 524287 524287 524287 524287 524287 524287 524287 524287 524287 524287 524287
$$ 524287 524287 524287 524287 524287 524287 524287 524287 524287 524287 524287
$$ 524287 524287 524287 524287 524287 524287 0 0 0 0 0 0 0 0 0 0 0 0 0 0 0
$$ 0 0 0 0 0 0 0 0 0 0
$$ ##$ShimPowRcbType= 3
$$ ##$ShimPowRes= (0..63)
$$ 1e-20 1e-20 1e-20 1e-20 1e-20 1e-20 1e-20 1e-20 1e-20 1e-20 1e-20 1e-20
$$ 1e-20 1e-20 1e-20 1e-20 1e-20 1e-20 1e-20 1e-20 1e-20 1e-20 1e-20 1e-20
$$ 1e-20 1e-20 1e-20 1e-20 1e-20 1e-20 1e-20 1e-20 1e-20 1e-20 1e-20 1e-20
$$ 1e-20 1e-20 1e-20 1e-20 0 0 0 0 0 0 0 0 0 0 0 0 0 0 0 0 0 0 0 0 0 0 0 0
$$ ##$ShimPowRng0= (0..63)
$$ 1 1 1 1 1 1 1 1 1 1 1 1 1 1 1 1 1 1 1 1 1 1 1 1 1 1 1 1 1 1 1 1 1 1 1 1
$$ 1 1 1 1 0 0 0 0 0 0 0 0 0 0 0 0 0 0 0 0 0 0 0 0 0 0 0 0
$$ ##$ShimPowRng1= (0..63)
$$ 1 1 1 1 1 1 1 1 1 1 1 1 1 1 1 1 1 1 1 1 1 1 1 1 1 1 1 1 1 1 1 1 1 1 1 1
$$ 1 1 1 1 0 0 0 0 0 0 0 0 0 0 0 0 0 0 0 0 0 0 0 0 0 0 0 0
$$ ##$ShimPowRng2= (0..63)
$$ 1 1 1 1 1 1 1 1 1 1 1 1 1 1 1 1 1 1 1 1 1 1 1 1 1 1 1 1 1 1 1 1 1 1 1 1
$$ 1 1 1 1 0 0 0 0 0 0 0 0 0 0 0 0 0 0 0 0 0 0 0 0 0 0 0 0
$$ ##$ShimPowRng3= (0..63)
$$ 1 1 1 1 1 1 1 1 1 1 1 1 1 1 1 1 1 1 1 1 1 1 1 1 1 1 1 1 1 1 1 1 1 1 1 1
$$ 1 1 1 1 0 0 0 0 0 0 0 0 0 0 0 0 0 0 0 0 0 0 0 0 0 0 0 0
$$ ##$ShimSysFunc= (0..63)
$$ 1 2 3 4 5 6 7 8 9 10 0 37 38 35 16 15 14 13 12 11 28 27 26 25 24 23 36
$$ 22 30 29 20 21 34 33 32 31 17 18 19 0 0 0 0 0 0 0 0 0 0 0 0 0 0 0 0 0 0
$$ 0 0 0 0 0 0 0
$$ ##$ShimSysMatrix= 0
$$ ##$ShimSysType= 4
$$ ##$TFXNUM= 0
$$ ##$TRIPLO2= 0
$$ ##$VTU= 2
$$ ##$VTUETH= <149.236.99.20>
$$ ##$VTUTY= <no>
$$ ##$WBREFAM= (0..15)
$$ 136.7 118.7 100 100 100 100 100 100 100 100 100 100 100 100 100 100
$$ ##$WBREFLM= (0..15)
$$ 0 0 0 0 0 0 0 0 0 0 0 0 0 0 0 0
$$ ##$WBREFPH= (0..15)
$$ 77.55 -71.28 0 0 0 0 0 0 0 0 0 0 0 0 0 0
$$ ##$WBSGU= (0..15)
$$ 0 0 0 0 0 0 0 0 0 0 0 0 0 0 0 0
$$ ##$XFAC= 2
$$ ##END=
$$ 
##$DECIM=	2496
##$DSPFVS=	20
##XUNITS=	HZ
##YUNITS=	ARBITRARY UNITS
##FIRSTX=	6406.710256386850233
##LASTX=	-1606.1102564336499654
##DELTAX=	-0.12226780365942625795
##XFACTOR=	1
##YFACTOR=	0.0024840377449344562717
##FIRSTY=	8.635860443115234375
##MINY=	-4.4209675788879394531
##MAXY=	24076.693359375
##NPOINTS=	65536
##XYDATA=	(X++(Y..Y))
$$ [...]
$$ plain form
1332 -621 -690 -666 -641 -617 -609 -601 -593 -585 -637 -689 -685 -682 -640 -598 -649 -700 -696 -693 -634 -576 -523 -470 -472 -475 -429 -383 -337 -291 -318 -345 -372 -398 -421 -443 -465 -487 -436 -385 -464 -543
1327 -543 -556 -569 -581 -594 -583 -572 -560 -549 -558 -567 -576 -585 -560 -536 -530 -579 -652 -631 -574 -517 -548 -579 -609 -640 -575 -511 -483 -548 -616 -629 -623 -617 -623 -628 -541 -454 -444 -434 -424
1322 -424 -415 -393 -371 -299 -227 -176 -218 -300 -382 -351 -321 -383 -445 -516 -588 -566 -545 -528 -510 -548 -586 -590 -593 -541 -489 -501 -513 -581 -649 -634 -620 -606 -591 -622 -652 -590
1318 -590 -527 -443 -359 -441 -523 -558 -593 -572 -552 -553 -554 -500 -446 -422 -397 -373 -349 -363 -377 -391 -405 -383 -361 -339 -317 -290 -262 -240 -218 -175 -225 -352 -480 -485 -491 -497
1314 -497 -503 -474 -444 -502 -559 -584 -516 -449 -474 -561 -649 -651 -652 -556 -460 -368 -368 -463 -558 -529 -500 -425 -350 -441 -533 -602 -672 -649 -627 -538 -450 -417 -383 -380 -376 -373 -369 -346 -322
1309 -322 -299 -276 -280 -285 -289 -294 -226 -159 -184 -210 -219 -228 -255 -338 -427 -423 -382 -342 -343 -345 -346 -348 -462 -575 -559 -543 -503 -463 -479 -494 -512 -529 -547 -565 -586 -608 -630 -651 -622
1304 -622 -593 -563 -534 -512 -490 -469 -447 -485 -523 -562 -600 -586 -573 -559 -545 -499 -453 -407 -361 -361 -362 -362 -362 -293 -224 -154 -85 -71 -58 -44 -30 -67 -104 -141 -178 -186 -194 -202
1299 -202 -210 -269 -328 -387 -446 -452 -459 -466 -472 -511 -550 -589 -628 -598 -569 -539 -510 -480 -451 -421 -392 -382 -372 -362 -352 -309 -267 -225 -182 -150 -118 -86 -53 16 86 157 227
$$ packed form
1332f21o9K4K5K4QQQQn2n2MLM2M2n1n1MLN9N8N3N3klM6M6M6M6k7k7k7k6k3k2k2k2N1N1p9p9
1327e43j3j3j2j3J1J1J2J1rrrrK5K4Om9p3K1N7N7l1l1l0l1O5O4K8o5o8j3OOonQ7Q7J0J0J0
1322d24RK2K2P2P2N1m2q2q2L1L0o2o2p1p2K2K1J7J8l8l8mlN2N2j2j2o8o8J5J4J4J5l1l0O2
1318e90O3Q4Q4q2q2l5l5K1K0jjN4N4K4K5K4K4j4j4j4j4K2K2K2K2K7K8K2K2M3n0j27j28noo
1314d97oK9L0n8n7k5O8O7k5q7q8kjR6R6R2%r5r5K9K9P5P5r1r2o9p0K3K2Q9Q8L3L4LMLMK3K4
1309c22K3K3mnmnO8O7k5k6rrk7q3q9MM1M0jkjkj14j13J6J6M0M0j6j5j8j7j8j8k1k2k2k1K9
1304f22K9L0K9K2K2K1K2l8l8l9l8J4J3J4J4M6M6M6M6%j%%O9O9P0O9J4J3J4J4l7l7l7l7qqq
1299b02qn9n9n9n9oppol9l9l9l9L0K9L0K9L0K9L0K9J0J0J0J0M3M2M2M3L2L2L2L3O9P0P1P0
$$ plain form
1295 227 344 460 670 879 1128 1378 1680 1981 2258 2479 2614 2656 2592 2472 2301 2037 1720 1404 1174 945 795 645 495 345
1292 345 258 171 176 181 129 76 23 -28 35 99 71 43 6 -29 -10 8 6 4 57 110 168 226 284 341 422 502 583 663 759 854 957 1059 1289 1631 2095
1288 2095 2669 3368 4177 4987 5796 6521 7246 7795 8011 7937 7678 7318 6847 6172 5387 4602 3928 3299 2781 2410 2040 1734 1428
1285 1428 1221 1014 929 954 918 881 746 612 570 529 495 461 428 394 434 474 515 555 592 629 665 702 813 924 987 1049 1143 1348 1626 1905
1281 1905 2174 2554 3089 3809 4693 5687 6791 7894 8974 9943 10785 11368 11638 11576 11251 10667 9890 9003 8039 7075 6155 5347
1279 5347 4616 3997 3509 3021 2602 2183 1828 1583 1406 1229 1132 1035 938 842 759 676 722 769 715 662 608 555 564 573 674 775 810 845 880
1275 880 915 1031 1147 1269 1392 1608 1936 2379 2932 3561 4190 4967 5855 6773 7691 8399 8922 9225 9417 9439 9275 8855 8250 7645
1272 7645 7040 6395 5751 5107 4462 3962 3462 2968 2475 1997 1629 1414 1310 1196 1082 974 867 751 636 613 590 524 458 385 423
$$ packed form
1295B27J17J16K10K09K49K50L02L01K77K21J35M2o4j20j71k64l17l16k30k29j50j50j50j50
1292C45q7q7NNn2n3n3n1O3O4k8k8l7l5J9J8kkN3N3N8N8N8N7Q1Q0Q1Q0R6R5J03J02K30L42M64
1288B095N74O99Q09Q10Q09P25P25N49K16p4k59l60m71o75p85p85o74o29n18l71l70l06l06
1285A428k07k07q5K5l6l7j35j34m2m1l4l4l3l4M0M0M1M0L7L7L6L7J11J11O3O2R4K05K78K79
1281A905K69L80N35P20Q84R94J104J103J080R69Q42N83K70o2l25n84p77q87r64r64r20q08
1279E347p31o19m88m88m19m19l55k45j77j77r7r7r7r6q3q3M6M7n4n3n4n3RRJ01J01L5L5L5
1275H80L5J16J16J22J23K16L28M43N53O29O29P77Q88R18R18P08N23L03J92K2j64m20o05o05
1272G645o05o45o44o44o45n00n00m94m93m78l68k15j04j14j14j08j07j16j15k3k3o6o6p3L8
$$ plain form
1269 423 444 466 402 338 409 480 496 511 482 454 518 582 701 820 1031 1243 1458 1673 2055 2436 2851 3266 3674 4082 4278 4364 4383 4401
1266 4401 4377 4354 4226 3987 3731 3475 3261 3046 2799 2441 2082 1835 1631 1426 1173 920 728 536 411 397 396 396 311 225 173 122 126
1262 126 129 169 209 193 177 143 108 73 39 33 27 21 16 66 116 167 217 226 234 243 252 301 350 400 449 555 661 767 873 883 893 848 803 747 691 724 757
1258 757 763 713 639 565 470 375 336 297 238 180 121 63 59 54 54 53 40 82 93 104 52 0 2 5 -37 -80 -66 3 33 7 -39 -85 -96 -107 -118 -128 -101 -74
1253 -74 -46 -19 -27 -35 -74 -58 -22 13 53 92 70 48 -4 -2 9 22 38 54 57 60 64 67 32 -2 -68 -78 -34 9 53 97 100 47 25 96 189 227 209 191 182 172
1248 172 111 49 21 48 99 150 147 144 141 139 158 178 197 217 250 284 317 351 355 360 364 369 391 413 400 442 476 455 434 468 488 452 421 444 460 476 495 514 519
1243 519 524 526 528 573 562 551 595 647 698 753 808 820 831 842 854 849 844 839 834 802 770 848 927 974 1022 1014 1006 1030 1053 1077 1101 1144 1187 1231 1274 1330 1387 1405 1478
1239 1478 1536 1483 1464 1500 1532 1565 1600 1636 1639 1642 1641 1641 1669 1641 1579 1627 1701 1720 1776 1833 1885 1937 1989 2042 2094 2146 2198 2251 2299 2348 2396 2445 2507 2570 2632 2694
$$ packed form
1269D23K1K2o4o4P1P1J6J5k9k8O4O4J19J19K11K12K15K15L82L81M15M15M08M08J96Q6J9J8
1266D401k4k3j28k39k56k56k14k15k47l58l59k47k04k05k53k53j92j92j25j4j%q5q6n2n1M
1262A26LM0M0j6j6l4l5l5l4ooonN0N0N1N0RQRRM9M9N0M9J06J06J06J06J0J0m5m5n6n6L3L3
1258G57On0p4p4r5r5l9l9n9n8n9n8mn%jj3M2J1J1n2n2KLm2m3J4O9L0k6m6m6j1j1j1j0K7K7
1253g4K8K7qql9J6L6L5M0L9k2k2n2KJ1J3J6J6LLMLl5l4o6j0M4M3M4M4Ln3k2P1R3L8j8j8rj0
1248A72o1o2k8K7N1N1lllkJ9K0J9K0L3L4L3L4MNMNK2K2j3M2L4k1k1L4K0l6l1K3J6J6J9J9N
1243E19NKKM5j1j1M4N2N1N5N5J2J1J1J2nnnnl2l2P8P9M7M8qqK4K3K4K4M3M3M4M3N6N7J8P3
1239A478N8n3j9L6L2L3L5L6LLj%K8k8o2M8P4J9N6N7N2N2N2N3N2N2N2N3M8M9M8M9O2O3O2O2
$$ plain form
1234 2694 2764 2834 2904 2974 3021 3067 3114 3161 3321 3482 3643 3803 4005 4208 4410 4612 4850 5088 5326 5564 5850 6137 6430 6724 7108 7603
1231 7603 8096 8699 9467 10420 11636 13111 14967 17229 19760 22401 24969 27351 29331 30757 31492 31451 30707 29334 27524
1229 27524 25456 23325 21194 19195 17456 15991 14785 13870 13141 12629 12303 12101 11954 11871 11843 11866 11945 12079 12269 12516 12818 13141
1226 13141 13575 14082 14589 15232 15986 16877 17879 18955 20142 21408 22784 24202 25805 27634 29722 32241 35387 39357 44399
1224 44399 50841 59096 69444 81973 96495 112459 128978 144868 158960 170131 177358 179815 177182 169927 158945
1222 158945 145265 130095 114593 99731 86312 74787 65371 57896 52085 47606 44199 41715 39859 38471 37415
1220 37415 36744 36332 36030 35784 35608 35543 35619 35953 36564 37360 38351 39600 41191 43114 45264 47598 50233 53201 56474 60080
1218 60080 64110 68768 74290 81033 89491 100279 114242 132237 155213 183848 218265 257675 300178 343013 383158
$$ packed form
1234B694P0P0P0P0M7M6M7M7J60J61J61J60K02K03K02K02K38K38K38K38K86K87K93K94L84M95
1231G603M93O03P68R53J216J475J856K262K531K641K568K382J980J426P35m1p44j373j810
1229B7524k068k131k131j999j739j465j206r15p29n12l26k02j47q3k8K3P9J34J90K47L02L23
1226A3141M34N07N07O43P54Q91J002J076J187J266J376J418J603J829K088K519L146L970N042
1224D4399O442Q255J0348J2529J4522J5964J6519J5890J4092J1171P227K457k633p255j0982
1222A58945j3680j5170j5502j4862j3419j1525r416p475n811m479l407k484j856j388j056
1220C7415o71m12l02k46j76o5P6L34O11P96R91J249J591J923K150K334K635K968L273L606
1218F0080M030M658N522O743Q458J0788J3963J7995K2976K8635L4417L9410M2503M2835M0145
$$ plain form
1216 383158 417497 442996 456993 457714 445010 420478 386885 347449 305314 263441 224416 190111 161464 138530
1214 138530 120663 106886 96402 88428 82340 77709 74224 71571 69473 67629 66043 64672 63485 62423 61621 61174 61133
1212 61133 61458 62190 63347 64984 67023 69469 72368 75672 79403 83613 88390 93942 100498 108422 118255 130713 146850
1210 146850 167758 194718 228889 270946 320658 376400 434990 492327 544081 586190 614728 626264 618976 593496
1208 593496 552891 501631 444195 384833 327357 275173 230497 194101 165359 143116 126014 112955 102965 95360
1207 95360 89493 84879 81116 77893 75078 72612 70330 68132 66045 64235 62758 61698 60969 60666 60769 61326 62289 63631
1204 63631 65306 67379 69932 73016 76654 81023 86317 92939 101300 111962 125694 143389 166002 194250 228378 267808
1202 267808 310751 354365 395575 431220 458323 474040 476185 464187 439357 404440 362830 317856 272696 230079
$$ packed form
1216C83158L4339K5499J3997P21j2704k4532l3593l9436m2135m1873l9025l4305k8647k2934
1214A38530j7867j3777j0484p974o088m631l485k653k098j844j586j371j187j062q02m47m1
1212F1133L25P32J157J637K039K446K899L304L731M210M777N552O556P924R833J2458J6137
1210A46850K0908K6960L4171M2057M9712N5742N8590N7337N1754M2109K8538J1536p288k5480
1208E93496m0605n1260n7436n9362n7476n2184m4676l6396k8742k2243j7102j3059r990p605
1207I5360n867m614l763l223k815k466k282k198k087j810j477j060p29l03J03N57R63J342
1204F3631J675K073K553L084L638M369N294O622Q361J0662J3732J7695K2613K8248L4128L9430
1202B67808M2943M3614M1210L5645K7103J5717K145j1998k4830l4917m1610m4974m5160m2617
$$ plain form
1201 230079 192307 160606 135082 115081 99555 87596 78410 71310 65725 61317 57834 54946 52392 49968 47654
1199 47654 45526 43508 41599 39875 38354 37019 35861 34962 34331 33959 33828 33881 34142 34663 35444 36485 37785 39491 41722
1197 41722 44656 48482 53380 59610 67577 77597 89799 104112 120088 136920 153493 168582 180898 189391 193113
1195 193113 191455 184361 172611 157422 140248 122297 104703 88476 74325 62504 52966 45389 39450 34805 31159
1193 31159 28289 26025 24168 22570 21156 19957 18869 17823 16776 15818 14859 13900 13052 12364 11786 11289 10793 10377 10072 9841
1190 9841 9610 9526 9553 9622 9691 9931 10356 10864 11372 12143 13247 14685 16383 18444 20837 23501 26164 28702 30907 32588 33565
1188 33565 33716 33015 31515 29386 26798 23950 21037 18236 15656 13409 11495 9914 8674 7693 6883 6184 5656 5240 4867
1186 4867 4494 4096 3809 3626 3443 3199 2955 2766 2578 2414 2250 2086 1922 1822 1722 1622 1521 1400 1279 1159 1038 995 953 911
$$ packed form
1201B30079l7772l1701k5524k0001j5526j1959r186p100n585m408l483k888k554k424k314
1199D7654k128k018j909j724j521j335j158q99o31l72j31N3K61N21P81J041J300J706K231
1197D1722K934L826M898O230P967J0020J2202J4313J5976J6832J6573J5089J2316Q493L722
1195A93113j658p094j1750j5189j7174j7951j7594j6227j4151j1821r538p577n939m645l646
1193C1159k870k264j857j598j414j199j088j046j047r58r59r59q48o88n78m97m96m16l05k31
1190I841k31q4K7O9O9K40M25N08N08P71J104J438J698K061K393K664K663K538K205J681R77
1188C3565J51p01j500k129k588k848k913k801k580k247j914j581j240r81q10o99n28m16l73
1186D867l73l98k87j83j83k44k44j89j88j64j64j64j64j00j00j00j01j21j21j20j21m3m2m2
$$ plain form
1183 911 868 898 928 957 987 1017 1046 1076 1105 1093 1080 1067 1054 997 939 881 823 840 857 881 794 688 583 563 543 496 449 403 356 399 443 451 368 242
1178 242 209 211 213 180 147 207 266 262 258 255 251 239 227 215 203 157 112 67 21 -10 -41 -73 -104 -101 -97 -94 -90 -54 -18 17 53 20 -13 -46 -79 -81 -82 -83 -84 -102 -120 -139
1173 -139 -157 -134 -111 -88 -64 -88 -112 -136 -160 -174 -187 -164 -196 -228 -168 -129 -145 -159 -118 -80 -97 -86 -74 -66 -58 -130 -203 -183 -163 -182 -200 -163 -126 -93 -61 -84
1169 -84 -107 -126 -145 -108 -71 -83 -95 -107 -119 -136 -152 -166 -179 -181 -129 -52 -67 -151 -179 -152 -125 -141 -156 -172 -188 -199 -210 -128 -47 -68 -90 -111 -133 -94 -55 -16
1164 -16 22 61 100 139 178 139 99 59 19 -20 -60 -100 -140 -151 -162 -169 -177 -162 -92 -47 -112 -174 -237 -214 -191 -136 -80 -117 -155 -200 -246 -237 -227 -254 -281 -253 -225
1160 -225 -300 -375 -320 -266 -187 -108 -29 49 28 8 79 151 209 267 325 384 410 436 517 653 710 657 540 423 317 211 161 110 108 106 104 102 39 -24
1156 -24 -87 -151 -201 -250 -245 -239 -206 -173 -232 -292 -241 -191 -141 -90 -57 -23 -43 -119 -203 -176 -123 -69 -85 -100 -115 -130 -98 -66 -34 -2 132 266 401 536
1152 536 715 895 1075 1255 1417 1579 1790 2001 2080 2049 1950 1851 1688 1524 1361 1198 985 772 558 345 288 231 174 117 122 128 133 139 167
$$ packed form
1183I11m3L0L0K9L0L0K9L0K9j2j3j3j3n7n8n8n8J7J7K4q7j06j05k0k0m7m7m6m7M3M4Qq3j26
1178B42l3KKl3l3O0N9mmlmj2j2j2j2m6m5m5m6l1l1l2l1LMLML6L6L5L6l3l3l3l3kjjjj8j8j9
1173a39j8K3K3K3K4k4k4k4k4j4j3K3l2l2O0L9j6j4M1L8j7J1J2QQp2p3K0K0j9j8L7L7L3L2k3
1169h4k3j9j9L7L7j2j2j2j2j7j6j4j3kN2P7j5q4k8K7K7j6j5j6j6j1j1Q2Q1k1k2k1k2L9L9L9
1164a6L8L9L9L9L9l9m0m0m0l9m0m0m0j1j1pqJ5P0M5o5o2o3K3K3N5N6l7l8m5m6RJ0k7k7K8K8
1160b25p5p5N5N4P9P9P9P8k1k0P1P2N8N8N8N9K6K6Q1J36N7n3j17j17j06j06n0n1kkkko3o3
1156b4o3o4n0m9NOL3L3n9o0N1N0N0N1L3L4k0p6q4K7N3N4j6j5j5j5L2L2L2L2J34J34J35J35
1152E36J79J80J80J80J62J62K11K11P9l1r9r9j63j64j63j63k13k13k14k13n7n7n7n7NONOK8
$$ plain form
1148 167 196 114 32 0 -34 -12 9 -5 -20 20 60 -4 -70 -143 -105 -46 12 23 33 111 188 321 454 527 600 728 856 1100 1344 1588 1832
1144 1832 2046 2260 2467 2674 2779 2774 2720 2665 2422 2179 1936 1693 1401 1110 929 748 589 430 382 334 275 215 211 207 185 162 84 6
1141 6 -57 -121 -74 -27 -22 -17 -11 -6 -16 -27 -38 -48 -16 15 47 79 64 48 89 129 154 179 315 452 583 715 840 1075 1297 1518 1740 1962 2091
1137 2091 2109 2072 2034 1915 1685 1462 1239 1033 827 621 416 325 234 254 275 249 223 197 171 198 225 141 57 -3 -63 -83 8 82 46 -32
1133 -32 -110 -95 -80 -120 -160 -151 -142 -133 -124 -141 -159 -176 -193 -123 -53 16 86 133 180 227 274 373 472 571 669 758 846 823 801 778 755 677 599 504 408 313 218
1129 218 167 116 65 15 24 33 43 52 33 14 -4 -23 -85 -147 -97 -48 -29 -9 -45 -81 -24 31 32 33 85 136 188 239 292 345 401 457 537 672 909 1239
1124 1239 1667 2094 2408 2592 2659 2598 2373 2093 1764 1435 1106 870 728 586 450 314 297 280 263 246 218 189 161 133 61 -9 30
1121 30 70 87 105 67 29 68 106 89 72 100 129 157 185 250 314 378 442 537 631 836 1041 1386 1731 2099 2411 2636 2731 2636 2411 2081 1751
$$ packed form
1148A67K9q2q2l2l4K2K1j4j5M0M0o4o6p3L8N9N8J1J0P8P7J33J33P3P3J28J28K44K44K44K44
1144A832K14K14K07K07J05nn4n5k43k43k43k43k92k91j81j81j59j59m8m8n9o0mmk2k3p8p8
1141Fo3o4M7M7NNONj0j1j1j0L2L1L2L2j5j6M1M0K5K5J36J37J31J32J25K35K22K21K22K22J29
1137B091J8l7l8j19k30k23k23k06k06k06k05r1r1K0K1k6k6k6k6K7K7q4q4o0o0k0R1P4l6p8
1133c2p8J5J5m0m0RRRRj7j8j7j7P0P0O9P0M7M7M7M7R9R9R9R8Q9Q8k3k2k3k3p8p8r5r6r5r5
1129B18n1n1n1n0RRJ0Rj9j9j8j9o2o2N0M9J9K0l6l6N7N5JJN2N1N2N1N3N3N6N6Q0J35K37L30
1124A239M28M27L14J84O7o1k25k80l29l29l29k36j42j42j36j36j7j7j7j7k8k9k8k8p2p0L9
1121C0M0J7J8l8l8L9L8j7j7K8K9K8K8O5O4O4O4R5R4K05K05L45L45L68L12K25R5r5k25l30l30
$$ plain form
1117 1751 1413 1075 880 685 619 553 545 537 529 521 451 380 402 424 393 363 333 303 285 267 249 231 268 304 341 377 386 396 312 229 221 212 204 196 199 202 204 207 250
1112 250 292 279 265 288 310 248 185 226 378 530 571 646 722 791 859 1009 1158 1259 1360 1464 1679 1933 2243 2613 3038 3459 3826 4087
1109 4087 4238 4196 3970 3594 3162 2774 2441 2171 1900 1633 1366 1245 1125 1004 884 801 718 635 552 517 481 446 410 404 398 485 571 608
1106 608 645 626 607 640 673 762 850 862 875 942 1010 1191 1371 1607 1843 2159 2476 2878 3281 3645 3898 3997 3910 3649 3278 2864 2451 2153
1102 2153 1856 1566 1275 1032 900 798 696 600 504 500 496 492 487 426 366 300 234 168 102 129 157 184 212 194 176 157 139 159 179 107 34 75 116
1098 116 157 197 154 110 67 23 21 18 16 14 9 4 55 106 102 98 186 274 263 252 241 230 251 272 293 314 358 402 354 305 281 256 286 317 331 346 305 264 268
1093 268 272 221 170 146 123 99 76 93 111 128 146 196 246 296 346 330 314 298 282 299 315 332 348 380 411 443 474 455 436 416 397 407 418 428 439
1089 439 436 432 429 426 480 533 587 641 589 536 484 431 467 503 539 575 580 585 590 594 677 759 712 664 645 625 661 697 728 759 790 821 814 807 800 792 818 844 870 896 923
$$ packed form
1117A751l38l38j95j95o6o6qqqqp0p1K2K2l1l0l0l0j8j8j8j8L7L6L7L6RJ0q4q3qrqqLLKLM3
1112B50M2j3j4K3K2o2o3M1J52J52M1P5P6O9O8J50J49J01J01J04K15K54L10L70M25M21L67K61
1109D087J51m2k26l76m32l88l33k70k71k67k67j21j20j21j20q3q3q3q3l5l6l5l6ooQ7Q6L7
1106F08L7j9j9L3L3Q9Q8J2J3O7O8J81J80K36K36L16L17M02M03L64K53R9q7k61l71m14m13k98
1102B153k97k90k91k43j32j02j02r6r6mmmno1o0o6o6o6o6K7K8K7K8j8j8j9j8K0K0p2p3M1M1
1098A16M1M0m3m4m3m4klkknnN1N1mmQ8Q8j1j1j1j1K1K1K1K1M4M4m8m9k4k5L0L1J4J5m1m1M
1093B68Mn1n1k4k3k4k3J7J8J7J8N0N0N0N0j6j6j6j6J7J6J7J6L2L1L2L1j9j9k0j9J0J1J0J1
1089D39lmllN4N3N4N4n2n3n2n3L6L6L6L6NNNMQ3Q2m7m8j9k0L6L6L1L1L1L1pppqK6K6K6K6K7
$$ plain form
1084 923 949 975 1001 1013 1026 1038 1050 1031 1011 991 971 1010 1049 1088 1127 1166 1205 1244 1283 1298 1312 1326 1341 1437 1534 1630 1726 1729 1733 1791 1850 1893 1937 1888 1839 1839
1080 1839 1839 1783 1728 1749 1769 1790 1811 1853 1894 1936 1978 1942 1907 1871 1836 1814 1792 1937 2082 2133 2184 2235 2286 2281 2276 2271 2266 2261 2256 2251 2246 2309 2371 2434 2496 2595 2693 2791
1075 2791 2890 2991 3092 3100 3109 3118 3128 3193 3258 3294 3329 3420 3511 3573 3635 3642 3649 3727 3806 3885 3964 4007 4050 4093 4136 4194 4252 4310 4368 4406 4445 4483 4522 4657 4793
1071 4793 4836 4880 4975 5070 5166 5261 5381 5502 5622 5743 5852 5960 6014 6067 6146 6226 6434 6643 6887 7131 7431 7731 7984 8237 8490 8743
1068 8743 8931 9118 9212 9307 9533 9759 10040 10322 10634 10947 11426 11905 12494 13083 13672 14261 14789 15317 15715 16113 16456 16799 17184 17753
1065 17753 18605 19715 20980 22356 23803 25251 26620 27989 29362 30846 32500 34412 36636 39266 42327 45721 49503
1063 49503 53839 59054 65563 73899 85082 100430 121806 151669 192737 247470 316367 396123 477470 545767 584885
1061 584885 584180 543868 475044 394275 316363 250100 198060 159001 130272 109197 93508 81627 72573 65626
$$ packed form
1084I23K6K6K6J2J3J2J2j9k0k0k0L9L9L9L9L9L9L9L9J5J4J4J5R6R7R6R6LMN8N9M3M4m9m9%
1080A839%n6n5K1K0K1K1M2M1M2M2l6l5l6l5k2k2J45J45N1N1N1N1nnnnnnnnO3O2O3O2R9R8R8
1075B791R9J01J01QRRJ0O5O5L6L5R1R1O2O2PPP8P9P9P9M3M3M3M3N8N8N8N8L8L9L8L9J35J36
1071D793M3M4R5R5R6R5J20J21J20J21J09J08N4N3P9Q0K08K09K44K44L00L00K53K53K53K53
1068H743J88J87R4R5K26K26K81K82L12L13M79M79N89N89N89N89N28N28L98L98L43L43L85N69
1065A7753Q52J110J265J376J447J448J369J369J373J484J654J912K224K630L061L394L782
1063D9503M336N215O509Q336J1183J5348K1376K9863M1068N4733O8897P9756Q1347O8297L9118
1061E84885p05m0312o8824q0769p7912o6263n2040l9059k8729k1075j5689j1881r054o947
$$ plain form
1059 65626 60339 56420 53749 52151 51306 51016 51085 51339 51535 51547 51477 51408 51627 52327 53614 55456 57759 60470 63564 67139 71282
1056 71282 76276 82561 90880 102356 118381 140992 172812 216742 275132 348292 432287 516947 586483 624085
1055 624085 619270 573207 498336 412078 329555 259467 204356 163033 132693 110425 93815 81273 71726 64375
1053 64375 58688 54342 50994 48293 46073 44149 42335 40612 38889 37344 35984 34806 33887 33284 33087 33170 33365 33540 33716
1051 33716 33776 33725 33651 33576 33516 33455 33571 34019 34876 36066 37546 39137 40698 42259 43788 45501 47480 49719 52350 55537 59370
1048 59370 63906 69136 75068 81782 89420 98479 109720 124457 144333 171555 209020 260210 328375 415121 518102
1046 518102 628540 730361 802925 828043 798516 721987 617469 506627 405882 323146 259339 211620 176113
1045 176113 149445 129112 113476 101445 92188 85205 80108 76545 74203 72769 71963 71453 71053 70650 70357 70202 70381 71116
$$ packed form
1059F5626n287l919k671j598q45k90O9K54J96J2p0o9K19P00J287J842K303K711L094L575M143
1056G1282M994O285Q319J1476J6025K2611L1820M3930N8390P3160Q3995Q4660O9536L7602
1055F24085m815m6063p4871q6258q2523p0088n5111m1323l0340k2268j6610j2542r547p351
1053F4375n687m346l348k701k220j924j814j723j723j545j360j178r19o03j97Q3J95J75J76
1051C3716O0n1p4p5o0o1J16M48Q57J190J480J591J561J561J529J713J979K239K631L187L833
1048E9370M536N230N932O714P638R059J1241J4737J9876K7222L7465N1190O8165Q6746J02981
1046E18102J10438J01821P2564K5118k9527p6529j04518j10842j00745q2736o3807m7719l5507
1045A76113k6668k0333j5636j2031r257o983n097l563k342j434q06n10m00m03k93j55J79P35
$$ plain form
1042 71116 72628 74916 77981 81726 86099 91133 96944 103888 112571 123796 138756 159208 187759 227524 282192 355155
1040 355155 448124 558354 676017 783123 857056 878679 841318 754488 639367 519064 410484 321560
1039 321560 253086 202086 164435 136511 115576 99697 87481 77848 70101 63847 58592 54116 50269 46958 44128
1037 44128 41732 39743 38036 36441 34733 32841 30955 29070 27337 25715 24216 22717 21303 19889 18630 17556 16684
1035 16684 15812 14903 13994 13116 12348 11636 10924 10247 9682 9246 8810 8429 8159 8034 8021 8139 8442 8900 9358 9803 10138 10267 10137
1032 10137 9688 9128 8614 8100 7596 7092 6698 6305 6003 5702 5598 5604 5586 5569 5639 5894 6195 6496 6643 6604 6403 6017 5539 5061 4666
1029 4666 4271 3987 3703 3478 3253 3036 2818 2694 2681 2716 2752 2751 2751 2806 2861 2892 2923 2843 2762 2680 2599 2628 2657 2630 2604 2577 2551 2487 2423 2359 2295
1025 2295 2204 2113 2134 2154 2145 2136 2182 2229 2327 2426 2413 2401 2364 2328 2291 2254 2372 2490 2608 2727 2979 3232 3485 3738 3969 4201 4519 4836 5102
$$ packed form
1042G1116J512K288L065L745M373N034N811O944Q683J1225J4960K0452K8551L9765N4668P2963
1040C55155R2969J10230J17663J07106P3933K1623l7361q6830j15121j20303j08580q8924
1039C21560o8474n1000l7651k7924k0935j5879j2216r633p747o254n255m476l847l311k830
1037D4128k396j989j707j595j708j892j886j885j733j622j499j499j414j414j259j074q72
1035A6684q72r09r09q78p68p12p12o77n65m36m36l81k70j25j3J18L03M58M58M45L35J29j30
1032A0137m49n60n14n14n04n04l94l93l02l01j04Oj8j7P0K55L01L01J47l9k01l86m78m78l95
1029D666l95k84k84k25k25k17k18j24j3L5L6j%N5N5L1L1q0q1q2q1K9K9k7k6k7k6o4o4o4o4
1025B295r1r1K1K0rrM6M7R8R9j3j2l7l6l7l7J18J18J18J19K52K53K53K53K31K32L18L17K66
$$ plain form
1022 5102 5257 5264 5087 4664 4241 3837 3544 3327 3110 2992 2874 2776 2678 2636 2593 2503 2413 2322 2232 2159 2087 2014 1941 1877 1813 1749 1686 1622 1558 1494
1018 1494 1431 1392 1354 1316 1278 1330 1382 1342 1302 1337 1371 1358 1344 1335 1437 1532 1627 1602 1578 1609 1639 1659 1678 1649 1619 1593 1678 1823 1968 2042 2006 1939 1873
1014 1873 1890 1908 1926 1944 1942 1940 1938 1936 1908 1880 1852 1824 1802 1780 1887 1995 2038 2081 2124 2167 2140 2113 2085 2058 2008 1958 1908 1858 1933 2008 2082 2157 2145 2133 2122
1010 2122 2110 2049 1989 1984 1979 1931 1883 1865 1958 2065 2172 2286 2400 2482 2565 2647 2730 2836 2942 3047 3153 3228 3303 3378 3453 3575 3697 3948 4254
1006 4254 4537 4710 4774 4727 4593 4515 4539 4675 4866 5056 5285 5569 5909 6361 6989 7803 8880 10364 12422 15108 18282 21714
1004 21714 24992 27863 30438 33013 35576 37659 38628 38154 36463 34144 31632 29065 26362 23399 20210 17077 14363 12278
1001 12278 10710 9550 8713 8062 7551 7151 6841 6642 6525 6409 6354 6300 6198 6097 5995 5893 5741 5590 5438 5397 5403 5519 5708 5953
999 5953 6116 6167 6070 5861 5617 5373 5233 5204 5285 5478 5649 5765 5901 6092 6390 6798 7220 7642 8029 8305 8395 8300 8097 7838 7592
$$ packed form
1022E102J55Pj77m23m23m04k93k17k17j18j18r8r8m2m3r0r0r1r0p3p2p3p3o4o4o4o3o4o4o4
1018A494o3l9l8l8l8N2N2m0m0L5L4j3j4rJ02R5R5k5k4L1L0K0J9k9l0k6Q5J45J45P4l6o7o6
1014A873J7J8J8J8kkkkk8k8k8k8k2k2J07J08M3M3M3M3k7k7k8k7n0n0n0n0P5P5P4P5j2j2j1
1010B122j2o1o0nnm8m8j8R3J07J07J14J14Q2Q3Q2Q3J06J06J05J06P5P5P5P5J22J22K51L06
1006D254K83J73O4m7j34p8K4J36J91J90K29K84L40M52O28Q14J077J484K058K686L174L432
1004B1714L278K871K575K575K563K083R69m74j691k319k512k567k703k963l189l133k714k085
1001A2278j568j160q37o51n11m00l10j99j17j16n5n4j02j01j02j02j52j51j52m1OJ16J89K45
999E953J63N1r7k09k44k44j40k9Q1J93J71J16J36J91K98M08M22M22L87K76R0r5k03k59k46
$$ plain form
996 7592 7401 7310 7275 7256 7237 7278 7318 7410 7503 7650 7798 7875 7951 7972 7992 8066 8140 8269 8398 8493 8588 8682 8777 8818 8859 8900 8941 8963 8984 9006 9027 9009
992 9009 8990 9113 9347 9574 9802 10129 10457 10710 10964 11155 11347 11397 11337 11246 11155 11063 10970 11014 11058 11149 11352 11658 11964 12292 12620 13004 13277
988 13277 13264 13140 13065 13101 13155 13208 13447 13797 14142 14487 15012 15537 16127 16827 17773 18718 19511 20193 20992 21792 22342 22892 23761 25111
985 25111 26743 28634 30809 32984 34717 36044 37174 38120 38894 39779 41372 43741 46772 50653 55727 61651 67507 72955
983 72955 78389 84083 90517 98985 111341 128837 152900 187206 237317 308988 407458 536068 687495 832154
981 832154 922424 920130 825716 678605 528103 403894 311273 244279 196559 162707 137550 117903 102863
980 102863 92003 83994 77946 73624 70301 66635 62119 57582 53747 50527 47862 46142 45420 44995 44458 44278 44726 45230
978 45230 45253 45106 45217 45402 45476 45756 46369 47181 48178 49722 51820 53858 55563 57594 60476 63916 67616 72133 77870 84129
$$ packed form
996G592j91r1l5j9j9M1M0R2R3J47J48P7P6K1K0P4P4J29J29R5R5R4R5M1M1M1M1K2K1K2K1j8
992I009j9J23K34K27K28L27L28K53K54J91J92N0o0r1r1r2r3M4M4R1K03L06L06L28L28L84K73
988A3277j3j24p5L6N4N3K39L50L45L45N25N25N90P00R46R45P93O82P99Q00N50N50Q69J350
985B5111J632J891K175K175J733J327J130R46P74Q85J593K369L031L881N074N924N856N448
983G2955N434N694O434Q468J2356J7496K4063L4306N0111P1671R8470J28610J51427J44659
981H32154R0270k294r4414j47111j50502j24209r2621o6994m7720l3852k5157j9647j5040
980A02863j0860q009o048m322l323l666m516m537l835l220k665j720p22m25n37j80M48N04
978D5230K3j47J11J85P4K80O13Q12R97J544K098K038J705K031K882L440L700M517N737O259
$$ plain form
975 84129 90056 95825 102002 108626 116323 127067 142950 165102 195649 239645 303795 394040 515607 669580 840674
973 840674 987754 1056842 1016361 882578 707967 543970 414812 320305 252280 203893 169248 143146 122855
972 122855 107926 97518 90031 84481 80596 77302 73158 68011 62975 58903 55607 52977 51420 50833 50505 50163 50301 50937
970 50937 51314 51007 50514 50326 50396 50900 52403 55085 58174 61179 64369 68033 72029 76686 83376 93165 106540 125194 152835
967 152835 193625 251020 328440 426163 532022 616690 645975 605328 512233 402903 307099 235148 183820
966 183820 147470 122002 103819 89938 79052 71028 65407 61275 58142 55794 53631 50978 48140 45830 44221 42868
964 42868 41699 41003 40641 40163 39685 39630 39982 40205 40168 40351 40941 41718 42495 43542 44701 45674 46536 47731 49185 50371 51299 52591
961 52591 54586 57009 59840 63590 68191 72878 77158 81354 85884 90839 97090 106298 119612 137825 163471 201446
$$ packed form
975H4129N927N769O177O624P697J0744J5883K2152L0547M3996O4150R0245J21567J53973J71094
973H40674J47080O9088m0481j33783j74611j63997j29158r4507o8025m8387l4645k6102k0291
972A22855j4929j0408p487n550l885l294m144n147n036m072l296k630j557n87l28l42J38O36
970E0937L77l07m93j88P0N04J503K682L089L005L190L664L996M657O690R789J3375J8654K7641
967A52835M0790N7395P7420R7723J05859Q4668K9285m0647r3095j09330r5804p1951n1328
966A83820l6350k5468j8183j3881j0886q024n621m132l133k348k163k653k838k310j609j353
964D2868j169o96l62m78m78n5L52K23l7J83N90P77P77J047J159R73Q62J195J454J186R28J292
961E2591J995K423K831L750M601M687M280M196M530M955O251R208J3314J8213K5646L7975
$$ plain form
959 201446 256765 333671 435614 559593 684866 771423 781097 706957 580712 448272 339759 260784 204701
957 204701 165001 137097 116742 100862 88578 79807 73630 68895 65166 61991 58392 54015 49806 46594 44108 41882
956 41882 40043 38833 37954 37075 36498 36551 36836 36789 36412 35923 35268 34429 33739 33383 33324 33266 33380 33753 34196 34453 34696 34938 35096 35068
953 35068 35024 35091 35208 35215 35276 35449 35556 35479 35349 35404 35615 35825 36126 36613 37176 37627 38021 38526 39023 39521 40047 40685 41276 41867 42539
950 42539 43470 44547 45734 47103 48805 50745 52685 54757 57015 59298 61470 63654 66024 68449 70763 72890 74906 76709
947 76709 78254 79678 80991 82041 82832 83663 84900 86545 88596 91077 94038 97509 101312 105429 109804 114346 118999 123930
945 123930 129193 134738 140542 146856 154020 162326 172149 183936 197757 213491 231112 250818 272780 296855 322519
943 322519 349224 376779 405296 435255 467385 502583 542733 590834 651101 729156 833371 976379 1175803
$$ packed form
959B01446N5319P6906J01943J23979J25273Q6557R674p4140j26245j32440j08513p8975n6083
957B04701l9700k7904k0355j5880j2284q771o177m735l729l175l599m377m209l212k486k226
956D1882j839j210q79q79n77N3K85m7l77m89o55q39o90l56n9n8J14L73M43K57K43K42J58k8
953C5068m4O7J17PO1J73J07p7j30N5K11K10L01M87N63M51L94N05M97M98N26O38N91N91O72
950D2539R31J077J187J369J702J940J940K072K258K283K172K184K370K425K314K127K016J803
947G6709J545J424J313J050P91Q31J237J645K051K481K961L471L803M117M375M542M653M931
945A23930N263N545N804O314P164Q306R823J1787J3821J5734J7621J9706K1962K4075K5664
943C22519K6705K7555K8517K9959L2130L5198M0150M8101O0267P8055J04215J43008J99424
$$ plain form
942 1175803 1454256 1835571 2330899 2919220 3541380 4126318 4636590 5090487 5530662 5962226 6318682
940 6318682 6493958 6416691 6104875 5654196 5170067 4700176 4221978 3690564 3098765 2495243 1951385 1515031
939 1515031 1192199 961191 795371 674409 584608 516738 464644 424051 391423 363713 339091 316872 296734
937 296734 278038 259795 241072 221581 201979 183297 166279 150925 136940 123995 112196 101771 92863 85485
936 85485 79402 74201 69703 65894 62639 59801 57295 55055 52926 50764 48601 46498 44394 42151 39852 37640 35687
934 35687 34002 32575 31408 30425 29642 29043 28623 28313 27978 27643 27430 27329 27121 26803 26435 25956 25457 25014 24588 24051 23341 22520
931 22520 21755 20990 20270 19551 18832 18113 17340 16568 15922 15386 14871 14412 14040 13667 13215 12762 12586 12411 12347 12282 12218 12154 11960 11767
928 11767 11666 11566 11313 11061 10938 10816 10791 10767 10687 10607 10475 10343 10267 10191 10054 9917 9780 9644 9514 9384 9254 9124 8983 8841 8755
$$ packed form
942A175803K78453L81315M95328N88321O22160N84938N10272M53897M40175M31564L56456
940F318682J75276p7267l11816m50679m84129m69891m78198n31414n91799o03522n43858m36354
939A515031l22832k31008j65820j20962q9801o7870n2094m0593l2628k7710k4622k2219k0138
937B96734j8696j8243j8723j9491j9602j8682j7018j5354j3985j2945j1799j0425q908p378
936H5485o083n201m498l809l255k838k506k240k129k162k163k103k104k243k299k212j953
934C5687j685j427j167r83p83n99m20l10l35l35k13j01k08l18l68m79m99m43m26n37p10q21
931B2520p65p65p20p19p19p19p73p72o46n36n15m59l72l73m52m53j76j75o4o5o4o4j94j93
928A1767j01j00k53k52j23j22k5k4q0q0j32j32p6p6j37j37j37j36j30j30j30j30j41j42q6
$$ plain form
925 8755 8669 8599 8529 8458 8388 8301 8213 8070 7927 7790 7652 7681 7710 7676 7642 7738 7833 7902 7971 8132 8293 8421 8549 8676 8804 8913 9023 9132
921 9132 9241 9551 9861 10300 10739 11193 11648 12194 12741 13135 13528 13866 14204 14529 14853 15239 15626 15977 16439 17379 18874 21041 24133
919 24133 28815 35606 44560 55104 66249 76914 86656 95844 104980 113710 120473 123279 121116 114774 106158 96987 87848
917 87848 78155 67392 55779 44467 34744 27287 22086 18599 16185 14393 13081 12109 11322 10656 9990 9539 9088 8729
914 8729 8370 8011 7652 7384 7116 6978 6840 6692 6545 6528 6510 6441 6373 6304 6236 6114 5992 5871 5749 5604 5459 5314 5170 5145 5120 5102
911 5102 5084 5101 5228 5379 5530 5493 5346 5291 5347 5484 5621 5820 6019 6193 6367 6611 7039 7690 8453 9206 9848 10276 10372 10072 9513
908 9513 8787 8061 7429 6909 6505 6211 6066 5921 5774 5628 5641 5654 5674 5583 5492 5512 5514 5517 5434 5351 5384 5417 5505 5593 5631 5668 5706 5743 5723 5703 5683
904 5683 5662 5721 5779 5837 5895 5955 6014 6073 6132 6189 6246 6469 6692 6946 7200 7588 8087 8574 8951 9147 9084 8817 8439 8138 7947 7839 7730
$$ packed form
925H755q6p0p0p1p0q7q8j43j43j37j38K9K9l4l4R6R5O9O9J61J61J28J28J27J28J09J10J09
921I132J09L10L10M39M39M54M55N46N47L94L93L38L38L25L24L86L87L51M62R40J495K167L092
919B4133M682O791Q954J0544J1145J0665R742R188R136Q730O763K806k163o342q616r171r139
917H7848r693j0763j1613j1312r723p457n201l487k414j792j312r72p87o66o66m51m51l59
914H729l59l59l59k68k68j38j38j48j47j7j8o9o8o9o8j22j22j21j22j45j45j45j44k5k5j8
911E102j8J7J27J51J51l7j47n5N6J37J37J99J99J74J74K44M28O51P63P53O42M28R6l00n59
908I513p26p26o32n20m04k94j45j45j47j46J3J3K0r1r1K0KLq3q3L3L3Q8Q8L8L7L8L7k0k0k0
904E683k1N9N8N8N8O0N9N9N9N7N7K23K23K54K54L88M99M87L77J96o3k67l78l01j91j08j09
$$ plain form
901 7730 7758 7786 7783 7780 7778 7775 7746 7716 7680 7755 7857 7960 8056 8262 8522 8671 8711 8640 8432 8224 8008 7904 7885 7978 8185 8504 8866 9117 9216 9204
897 9204 9149 8983 8774 8510 8203 7896 7690 7594 7563 7533 7601 7670 7708 7745 7846 8058 8320 8526 8740 9008 9362 9715 10142 10753 11570 12498
894 12498 13474 14394 15040 15280 15103 14740 14441 14326 14384 14553 14800 15047 15177 15251 15399 15731 16395 17392 18707 20280 22029 23889
891 23889 25629 26963 27686 27706 27006 25678 23980 22171 20466 19019 17934 17181 16785 16647 16698 16804 16884 16852 16788 16723 16672 16510 16245
889 16245 15925 15648 15481 15392 15488 15798 16219 16695 17225 17864 18613 19424 20345 21442 22798 24404 26195 28258 30802 33901 37554
886 37554 41729 46459 51688 57176 62604 67699 72493 77027 81507 85930 90031 93208 94821 94252 91469 87022 81981 77347
884 77347 73720 71240 69813 69089 68440 67309 65399 62859 59775 56209 52597 49393 46784 44508 42674 41838 42074 43013 45053
882 45053 49348 55626 60906 61673 57744 52770 50274 50654 52327 54629 58078 62816 68405 74729 82199 90999 100871 111704
$$ packed form
901G730K8K8llklk9l0l6P5J02J03R6K06K60J49M0p1k08k08k16j04j9R3K07L19L62K51R9j2
897I204n5j66k09k64l07l07k06r6l1l0O8O9L8L7J01K12K62K06K14K68L54L53M27O11Q17R28
894A2498R76R20O46K40j77l63k99j15N8J69K47K47J30P4J48L32O64R97J315J573J749J860
891B3889J740J334P23K0p00j328j698j809j705j447j085p53l96j38N1J06Q0l2o4o5n1j62k65
889A6245l20k77j67q9R6L10M21M76N30O39P49Q11R21J097J356J606J791K063K544L099L653
886C7554M175M730N229N488N428N095M794M534M480M423M101L177J613n69k783m447n041m634
884G7347l627k480j427p24o49j131j910k540l084l566l612l204k609k276j834q36K36R39K040
882D5053M295O278N280P67l929m974k496L80J673K302L449M738N589O324P470Q800R872J0833
$$ plain form
879 111704 123757 136828 150158 162715 173682 182355 188253 191577 193385 194826 196452 198280 200107 201581 202647 203587
877 203587 205008 207273 210241 213569 216713 218826 218757 215479 208393 197522 183655 168434 153915 141317 130753 121830
875 121830 114202 107563 101700 96554 92332 89155 86903 85450 84848 85132 86340 88469 91596 95943 101585 108720 117667 128424
873 128424 140624 153771 167251 180530 193254 205634 218013 230540 242587 253281 262237 269590 275870 282091 289532
871 289532 299074 310724 323494 335930 346379 353094 354913 351888 345144 336145 325832 314521 302159 288428 273315
870 273315 257278 241279 226428 213531 202965 194705 188109 182073 175408 167325 157725 147386 137380 128495 121127
868 121127 115505 111770 109954 109876 111393 114648 119803 126918 135799 146196 157567 169048 179772 189201 197481 205429 214204
866 214204 224717 237454 252225 268425 285105 301439 316848 331415 345429 358990 371627 382092 388748 389925
$$ packed form
879A11704J2053J3071J3330J2557J0967Q673N898L324J808J441J626J828J827J474J066R40
877B03587J421K265K968L328L144K113o9l278p086j0871j3867j5221j4519j2598j0564q923
875A21830p628o639n863n146m222l177k252j453o02K84J208K129L127M347N642P135Q947J0757
873A28424J2200J3147J3480J3279J2724J2380J2379J2527J2047J0694Q956P353O280O221P441
871B89532R542J1650J2770J2436J0449O715J819l025o744q999j0313j1311j2362j3731j5113
870B73315j6037j5999j4851j2897j0566q260o596o036o665q083r600j0339j0006q885p368
868A21127n622l735j816p8J517L255N155P115Q881J0397J1371J1481J0724R429Q280P948Q775
866B14204J0513J2737J4771J6200J6680J6334J5409J4567J4014J3561J2637J0465O656J177
$$ plain form
864 389925 385001 374881 361766 348152 335759 325543 317583 311157 304917 297581 288655 278326 267220 255930 244972
862 244972 234340 223376 211311 198026 184100 170508 158136 147502 138830 131970 126664 122652 119787 117994 117321
860 117321 117867 119510 122002 125018 128366 132077 136120 140760 146399 153678 162918 174298 187786 203074 219287 235186
858 235186 249421 261120 269972 276230 280824 284867 289243 294340 300213 306514 312630 317854 321932 325167 328291 331729 335352
856 335352 338178 338674 335569 328359 317548 304334 290297 276815 264638 253682 243500 233577 223685 213792 203915 194519
854 194519 186009 178571 171974 165932 160231 154640 149143 143904 139284 135663 133050 131361 130595 130754 131838 134141 137890 143154
852 143154 149695 157012 164701 172279 179589 186714 194112 202361 211830 222741 234963 248184 261918 275837 289622 302779
850 302779 314840 325458 334408 341619 347199 351559 355273 358877 362675 366583 370245 373204 375132 376210 376994 378259 380319
$$ packed form
864C89925m924j0120j3115j3614j2393j0216p960o426o240p336q926j0329j1106j1290j0958
862B44972j0632j0964j2065j3285j3926j3592j2372j0634q672o860n306m012k865j793o73
860A17321N46J643K492L016L348L711M043M640N639P279R240J1380J3488J5288J6213J5899
858B35186J4235J1699Q852O258M594M043M376N097N873O301O116N224M078L235L124L438L623
856C35352K826M96l105p210j0811j3214j4037j3482j2177j0956j0182r923r892r893r877r396
854A94519q510p438o597o042n701n591n497n239m620l621k613j689p66J59J084K303L749N264
852A43154O541P317P689P578P310P125P398Q249R469J0911J2222J3221J3734J3919J3785J3157
850C02779J2061J0618Q950P211N580M360L714L604L798L908L662K959J928J078P84J265K060
$$ plain form
848 380319 383007 385707 387408 387422 385623 382515 378851 375130 371409 367476 362692 356409 348461 339087 328937 318569 308312
846 308312 298336 288544 278679 268628 258543 248643 239237 230756 223468 217400 212460 208519 205726 204228 204181 205651 208609
844 208609 212640 217105 221571 225796 230021 234782 240690 248063 256879 266679 277034 287636 298571 310051 322530 336425
842 336425 351836 368477 385598 402450 418377 433001 446774 460424 474333 488274 501586 513468 523391 530919
840 530919 536044 539190 540819 541150 540038 537096 532046 524666 515179 503959 491446 477841 463238 447678 431342 414450
838 414450 397300 380171 363300 346562 329823 313052 296540 280737 266081 252729 240599 229388 218731 208699
837 208699 199517 191496 184917 179975 176697 174833 174264 174933 176970 180319 184815 190449 197303 205401 214719 225193 236740
834 236740 248967 261305 273356 285001 296343 307685 319320 331215 342894 353797 363453 371518 378002 383192 387670
$$ packed form
848C80319K688K700J701J4j799l108l664l721l721l933m784o283p948r374j0150j0368j0257
846C08312r976r792r865j0051j0085r900r406q481p288o068m940l941k793j498m7J470K958
844B08609M031M465M466M225M225M761N908P373Q816R800J0355J0602J0935J1480J2479J3895
842C36425J5411J6641J7121J6852J5927J4624J3773J3650J3909J3941J3312J1882R923P528
840E30919N125L146J629L31j112k942n050p380r487j1220j2513j3605j4603j5560j6336j6892
838D14450j7150j7129j6871j6738j6739j6771j6512j5803j4656j3352j2130j1211j0657j0032
837B08699r182q021o579m942l278j864n69O69K037L349M496N634O854Q098R318J0474J1547
834B36740J2227J2338J2051J1645J1342J1342J1635J1895J1679J0903R656Q065O484N190M478
$$ plain form
833 387670 391964 396081 399496 401534 401760 400280 397506 393853 389498 384431 378514 371558 363604 354707 345108 334949 324236
831 324236 312903 300793 287907 274541 260939 247448 234240 221217 208177 195138 182263 169794 157974 147006
829 147006 137092 128177 120075 112677 106064 100302 95465 91552 88610 86740 85749 85534 86025 87292 89267 91796 94824 98481
827 98481 102749 107571 112837 118437 124290 130144 136161 142179 148455 154732 161054 167377 173242 178331 182594 186155 189258
825 189258 191954 194215 195921 196721 196300 194595 191817 188160 183875 179168 174128 168565 162226 155135 147490 139565 131640 123759
822 123759 116062 108516 101154 94024 87300 81021 75148 69819 65120 61035 57505 54432 51915 49947 48460 47324 46594
820 46594 46309 46430 46907 47717 48721 49836 51080 52508 54149 55975 57948 60032 62183 64222 66138 68054 70079 72214
818 72214 74353 76381 78307 80048 81568 82828 83866 84646 85125 85271 85135 84667 83936 83020 81840 80254 78260 75935 73287
$$ packed form
833C87670M294M117L415K038K26j480k774l653m355n067n917o956p954q897r599j0159j0713
831C24236j1333j2110j2886j3366j3602j3491j3208j3023j3040j3039j2875j2469j1820j0968
829A47006r914q915q102p398o613n762m837l913k942j870r91k15M91J267J975K529L028L657
827I8481M268M822N266N600N853N854O017O018O276O277O322O323N865N089M263L561L103
825A89258K696K261J706Q00m21j705k778l657m285m707n040n563o339p091p645p925p925p881
822A23759p697p546p362p130o724o279n873n329m699m085l530l073k517j968j487j136p30
820D6594k85J21M77Q10J004J115J244J428J641J826J973K084K151K039J916J916K025K135
818G2214K139K028J926J741J520J260J038P80M79J46j36m68p31r16j180j586j994k325k648
$$ plain form
816 73287 70381 67366 64351 61424 58497 55322 52037 48768 45610 42600 39850 37349 35034 32822 30795 28990 27370
814 27370 25927 24670 23666 22922 22434 22131 21937 21742 21673 21788 22151 22624 23234 23955 24817 25790 26858 27925 29006 30088 31238
811 31238 32500 33799 35097 36202 37121 37874 38517 39129 39741 40277 40702 40873 40712 40290 39534 38594 37654 36748 35732 34626 33409
809 33409 32026 30457 28817 27288 25894 24610 23430 22435 21630 21084 20968 21258 21336 20416 18512 16498 15096 14249 13570 12891
806 12891 12402 12098 11751 11405 11118 10942 10745 10549 10359 10169 9948 9726 9504 9283 9030 8777 8636 8494 8226 7959 7821 7682 7469
803 7469 7256 7098 6940 6760 6580 6530 6479 6386 6292 6199 6106 6054 6003 6007 6012 5962 5912 5917 5922 5883 5845 5935 6026 6063 6101 6083 6065 6010 5956 6030 6105 6173 6241 6309
799 6309 6377 6359 6341 6324 6306 6160 6014 5924 5834 5727 5621 5514 5408 5328 5248 5169 5089 4972 4856 4739 4623 4509 4395 4336 4333 4254 4083 3936
796 3936 3844 3770 3696 3717 3739 3705 3672 3694 3716 3769 3822 3876 3929 3902 3876 3941 4007 4029 4051 4073 4095 4090 4085 4203 4322 4326 4238 4171 4159 4135 4110 4089 4068 4002 3936
$$ packed form
816G3287k906l015l015k927k927l175l285l269l158l010k750k501k315k212k027j805j620
814B7370j443j257j004p44m88l03j94j95o9J15L63M73O10P21Q62R73J068J067J081J082J150
811C1238J262J299J298J105R19P53O43O12O12N36M25J71j61m22p56r40r40r06j016j106j217
809C3409j383j569j640j529j394j284j180r95q05n46j16K90P8r20j904k014j402q47o79o79
806A2891m89l04l47l46k87j76j97j96j90j90k21k22k22k21k53k53j41j42k68k67j38j39k13
803G469k13j58j58j80j80n0n1r3r4r3r3n2n1MNn0n0NNl9l8R0R1L7L8j8j8n5n4P4P5O8O8O8
799F309O8j8j8j7j8j46j46r0r0j07j06j07j06q0q0p9q0j17j16j17j16j14j14n9lp9j71j47
796C936r2p4p4K1K2l4l3K2K2N3N3N4N3k7k6O5O6K2K2K2K2nnJ18J19Mq8o7j2k4k5k1k1o6o6
$$ plain form
791 3936 3925 3915 3840 3766 3692 3618 3524 3430 3336 3243 3115 2987 2860 2732 2656 2579 2502 2426 2353 2280 2208 2135 2154 2172 2283 2394 2405 2416 2427 2437 2475 2512
788 2512 2642 2771 2878 2985 3140 3295 3409 3411 3469 3527 3596 3554 3512 3580 3600 3620 3592 3564 3585 3607 3621 3747 3877 4007 4077 4037 3939 3841 3792 3743
784 3743 3658 3574 3489 3404 3270 3135 2994 2964 2939 2915 2805 2695 2557 2419 2374 2328 2285 2242 2199 2156 2107 2057 2008 1959 1923 1888 1852 1817 1891 1966 2040
780 2040 2115 2207 2299 2391 2482 2504 2526 2604 2681 2690 2698 2791 2885 2990 2984 3041 3097 3187 3277 3390 3614 3807 3888 3909 3931 3952 3973 3939 3905 3857 3810 3811 3812 3825 3726
776 3726 3635 3543 3417 3291 3221 3150 3062 2974 2817 2771 2753 2624 2509 2394 2293 2192 2091 1990 1954 1917 1929 1942 1943 1834 1739 1829 1969 2110 2140
772 2140 2170 2329 2599 2893 3186 3342 3388 3378 3479 3619 3759 3814 3869 3960 4051 4227 4404 4554 4593 4528 4463 4422 4381 4333 4286 4156 3915 3737
769 3737 3559 3458 3358 3258 3157 3117 3077 3030 2982 2953 2812 2733 2655 2602 2549 2489 2429 2422 2303 2247 2191 2095 2000 1905 1809 1761 1712 1663 1615 1660 1705 1657
765 1657 1610 1625 1640 1656 1671 1668 1665 1599 1645 1757 1868 1895 1921 1954 1988 2076 2165 2241 2317 2392 2468 2487 2506 2526 2545 2671 2798 2925 3051 3174 3297 3451
$$ packed form
791C936j1j0p5p4p4p4r4r4r4r3j28j28j27j28p6p7p7p6p3p3p2p3J9J8J11J11J1J1J1J0L8L7
788B512J30J29J07J07J55J55J14KN8N8O9m2m2O8K0K0k8k8K1K2J4J26J30J30P0m0r8r8m9m9
784C743q5q4q5q5j34j35j41l0k5k4j10j10j38j38m5m6m3m3m3m3m9n0m9m9l6l5l6l5P4P5P4
780B040P5R2R2R2R1K2K2P8P7RQR3R4J05oN7N6R0R0J13K24J93Q1K1K2K1K1l4l4m8m7JJJ3r9
776C726r1r2j26j26p0p1q8q8j57m6j8j29j15j15j01j01j01j01l6l7J2J3Jj09r5R0J40J41L0
772B140L0J59K70K94K93J56M6j0J01J40J40N5N5R1R1J76J77J50L9o5o5m1m1m8m7j30k41j78
769C737j78j01j00j00j01m0m0m7m8k9j41p9p8n3n3o0o0pj19n6n6r6r5r5r6m8m9m9m8M5M5m8
765A657m7J5J5J6J5llo6M6J12J11K7K6L3L4Q8Q9P6P6P5P6J9J9K0J9J26J27J27J26J23J23J54
$$ plain form
761 3451 3715 4127 4539 4946 5353 5525 5511 5376 5425 5743 6172 6606 6929 7209 7379 7497 7726 8168 8795 9602 10520 11389 12074 12555
758 12555 12925 13381 14022 14906 16048 17322 18596 19693 20530 21049 21161 20945 20618 20365 20223 20247 20456 20733 20825 20589 20020 19137
755 19137 17921 16495 15068 13827 12771 11862 11065 10394 9724 8931 8138 7351 6565 5878 5190 4652 4225 3951 3787 3614 3441
753 3441 3275 3109 3048 2987 2927 2866 2866 2867 2867 2868 2869 2871 2780 2689 2629 2569 2509 2449 2424 2400 2376 2352 2289 2227 2164 2102 2118 2134 2151 2167 2181 2196 2211 2226 2229 2232 2180 2128
748 2128 2082 2036 2120 2203 2292 2382 2416 2450 2444 2438 2433 2427 2441 2455 2469 2483 2492 2500 2508 2517 2554 2591 2536 2480 2500 2520 2547 2574 2713 2963 3275 3772 4359 4761 4853 4760
744 4760 4684 4718 4907 5097 5227 5173 4919 4777 4838 4899 4838 4591 4391 4302 4400 4498 4483 4209 3736 3263 2981 2810 2706 2602 2626 2649 2616 2584
740 2584 2509 2434 2414 2395 2428 2462 2495 2529 2545 2561 2514 2578 2754 2929 2982 3035 3072 3108 3060 3011 3078 3255 3371 3486 3524 3562 3599 3637 3713 3789 3773 3756
736 3756 3735 3714 3693 3672 3693 3713 3734 3754 3813 3872 3875 3878 3904 3931 3864 3798 3817 3835 3853 3871 3918 3965 3920 3875 3911 3947 3928 3909 3988 4067 4097 4128 4237 4457 4614
$$ packed form
761C451K64M12M12M07M07J72j4j35M9L18M29M34L23K80J70J18K29M42O27Q07R18Q69O85M81
758A2555L70M56O41Q84J142J274J274J097Q37N19J12k16l27k53j42K4K09K77R2k36n69q83
755A9137j216j426j427j241j056r09p97o71o70p93p93p87p86o87o88n38m27k74j64j73j73
753C441j66j66o1o1o0o1%J%JJKr1r1o0o0o0o0k5k4k4k4o3o2o3o2J6J6J7J6J4J5J5J5LLn2n2
748B128m6m6Q4Q3Q9R0L4L4oonoJ4J4J4J4RQQRL7L7n5n6K0K0K7K7J39K50L12M97N87M02R2r3
744D760p6L4J89J90J30n4k54j42O1O1o1k47k00q9R8R8j5k74m73m73k82j71j04j04K4K3l3l2
740B584p5p5k0j9L3L4L3L4J6J6m7O4J76J75N3N3L7L6m8m9O7J77J16J15L8L8L7L8P6P6j6j7
736C756k1k1k1k1K1K0K1K0N9N9LLK6K7o7o6J9J8J8J8M7M7m5m5L6L6j9j9P9P9L0L1J09K20J57
$$ plain form
732 4614 4772 4917 5061 5151 5240 5326 5411 5501 5702 6054 6590 7255 8032 8993 10140 11374 12719 14147 15687 17219 18752 20221
729 20221 21580 22774 23784 24668 25293 25624 25696 25702 25707 25680 25653 25461 25010 24335 23475 22500 21341 19959 18578 17255 15933 14622
727 14622 13311 12231 11336 10595 9965 9458 9062 8788 8626 8538 8451 8371 8290 8344 8398 8396 8394 8573 8751 8930 9109 9284 9459 9467 9476 9505 9533 9618
723 9618 9702 9869 10037 10075 10113 10062 10011 9827 9643 9517 9335 9083 8923 8917 9003 9070 9194 9499 9860 10083 10213 10387 10616 10805 10901 11044 11187
720 11187 11268 11294 11391 11579 11768 11865 11947 12085 12279 12473 12692 12912 13039 13166 13398 13630 13863 14095 14285 14476 14605 14735 14833 14839 14730 14621
717 14621 14630 14638 14646 14654 14848 15042 15181 15319 15466 15612 15666 15720 15804 15888 15843 15797 15744 15690 15590 15489 15521 15682 15863 16044 16279 16513 16633 16660 16643
713 16643 16627 16579 16587 16758 17023 17215 17463 17881 18428 18958 19489 20080 20615 20946 21148 21364 21672 22034 22489 23065 23642 24095 24548 25045
710 25045 25542 25862 26090 26404 26903 27477 28051 28707 29363 29791 30033 30310 30587 30878 31169 31774 32786 34101 35749 37773 40056
$$ packed form
732D614J58J45J44R0Q9Q6Q5R0K01L52N36O65P77R61J147J234J345J428J540J532J533J469
729B0221J359J194J010Q84O25L31P2ONk7k7j92m51o75q60r75j159j382j381j323j322j311
727A4622j311j080q95p41o30n07l96k74j62q8q7q0q1N4N4kkJ79J78J79J79J75J75QRK9K8Q5
723I618Q4J67J68L8L8n1n1j84j84j26j82k52j60oQ6O7J24L05L61K23J30J74K29J89R6J43J43
720A1187Q1K6R7J88J89R7Q2J38J94J94K19K20J27J27K32K32K33K32J90J91J29J30R8Oj09j09
717A4621RQQQJ94J94J39J38J47J46N4N4Q4Q4m5m6n3n4j00j01L2J61J81J81K35K34J20K7j7
713A6643j6m8QJ71K65J92K48M18N47N30N31N91N35L31K02K16L08L62M55N76N77M53M53M97
710B5045M97L20K28L14M99N74N74O56O56M28K42K77K77K91K91O05J012J315J648K024K283
$$ plain form
708 40056 42334 44354 46033 47306 48177 48937 49963 51396 52931 54281 55330 55972 56153 56000 55642 55025 54186 53532 53318 53362
705 53362 53189 52535 51494 50120 48528 47048 46035 45354 44850 44604 44890 45509 46079 46649 47388 48312 49195 50077 51255 52543 53726
703 53726 54908 56463 58204 59803 61292 63083 65059 66885 68710 70838 73224 75481 77738 80258 83037 85701 88364
701 88364 91634 95384 99083 102782 107051 111875 116873 122055 127931 134361 140903 147703 155498 164513 174291 185067 197665
699 197665 212000 227432 244083 262819 283885 307313 334624 368564 411564 466260 537042 628572 742105 875437
697 875437 1025152 1185480 1345254 1491959 1622060 1743509 1867879 2004804 2166469 2367718 2612345 2880581
695 2880581 3136871 3349992 3501391 3580705 3586463 3535294 3461825 3402765 3380945 3401958 3455034 3512491 3536999
694 3536999 3498820 3387898 3209554 2976440 2710247 2444055 2209853 2020139 1866267 1733290 1610274 1487665
$$ packed form
708D0056K278K020J679J273Q71P60J026J433J535J350J049O42J81j53l58o17q39o54k14M4
705E3362j73o54j041j374j592j480j013o81n04k46K86O19N70N70P39R24Q83Q82J178J288J183
703E3726J182J555J741J599J489J791J976J826J825K128K386K257K257K520K779K664K663
701H8364L270L750L699L699M269M824M998N182N876O430O542O800P795R015R778J0776J2598
699A97665J4335J5432J6651J8736K1066K3428K7311L3940M3000N4696P0782R1530J13533J33332
697H75437J49715J60328J59774J46705J30101J21449J24370J36925J61665K01249K44627K68236
695B880581K56290K13121J51399P9314N758n1169p3469n9060k1820K1013N3076N7457K4508
694C536999l8179j10922j78344k33114k66193k66192k34202j89714j53872j32977j23016j22609
$$ plain form
692 1487665 1355094 1207842 1052195 900505 762207 641771 541346 461593 400061 352470 315419 286615
691 286615 263760 244788 228761 215360 203685 193008 183414 175114 167761 160815 154424 148809 143477 138035 132823 128240
689 128240 124054 119758 115669 112209 109016 105490 101812 98319 94915 91253 87619 84391 81407 78237 74999 72093 69356
687 69356 66434 63560 61020 58855 56690 54611 52864 51279 49582 47959 46669 45618 44457 43281 42364 41696 40917 40031
685 40031 39257 38517 37592 36530 35580 34744 33908 33044 32439 31989 31540 31051 30747 30669 30479 30149 30003 30017 30032 29988 30056 30275 30385 30383 30492
682 30492 30639 30675 30600 30637 30809 30871 30743 30615 30608 30601 30420 30350 30477 30604 30627 30650 30894 31139 31199 31259 31502 31746 31927 32219 32685 33151 33494
678 33494 33838 34372 34906 35126 35346 35678 36009 36212 36414 36890 37365 37747 38130 38732 39335 39740 40146 40786 41537 42108 42679 43587 44680
676 44680 45676 46671 47934 49308 50489 51560 52917 54459 55834 57099 58559 60203 61649 62984 64539 66352 68101 69739
$$ packed form
692A487665j32571j47252j55647j51690j38298j20436j00425p9753o1532m7591l7051k8804
691B86615k2855j8972j6027j3401j1675j0677r594q300p353o946o391n615n332n442n212m583
689A28240m186m296m089l460l193l526l678l493l404l662l634l228k984l170l238k906k737
687F9356k922k874k540k165k165k079j747j585j697j623j290j051j161j176r17o68p79q86
685D0031p74p40r25j062r50q36q36q64o05m50m49m89l04p8j90l30j46J4J5m4O8K19J10kJ09
682C0492J47L6p5L7J72O2j28j28ppj81p0J27J27K3K3K44K45O0O0K43K44J81K92M66M66L43
678C3494L44N34N34K20K20L32L31K03K02M76M75L82L83O02O03M05M06O40P51N71N71R08J093
676D4680R96R95J263J374J181J071J357J542J375J265J460J644J446J335J555J813J749J638
$$ plain form
673 69739 71722 74112 76417 78721 81313 84238 86985 89547 92483 95975 99457 102828 106718 111386 116373 121618 127753
671 127753 135109 143075 151596 161367 172654 184769 197365 211262 227119 244382 262864 283733 308189 336578 369812
669 369812 410863 463785 532267 620755 735214 880404 1057098 1262304 1490711 1734908 1987039 2243496
668 2243496 2505958 2773043 3032630 3267181 3466633 3631728 3763916 3858716 3912078 3930346 3929383 3923871 3917699
666 3917699 3901283 3857145 3771033 3641050 3475157 3279670 3054710 2802698 2535709 2269506 2011549 1760592
665 1760592 1516255 1284363 1073068 888056 732665 608140 511757 437389 379551 334833 299988 271123
663 271123 245993 224677 206948 191164 176156 162605 150940 140084 129413 119659 111422 103835 96248 89436 83917
662 83917 78845 73514 68526 64535 60996 57346 54154 52034 50381 48617 47204 46790 46836 46696 46913 47981 49404 50568 51756
$$ packed form
673F9739J983K390K305K304K592K925K747K562K936L492L482L371L890M668M987N245O135
671A27753P356P966Q521R771J1287J2115J2596J3897J5857J7263J8482K0869K4456K8389L3234
669C69812M1051N2922O8482Q8488J14459J45190J76694K05206K28407K44197K52131K56457
668B243496K62462K67085K59587K34551J99452J65095J32188R4800N3362J8268r63n512o172
666C917699j6416m4138q6112j29983j65893j95487k24960k52012k66989k66203k57957k50957
665A760592k44337k31892k11295j85012j55391j24525r6383p4368n7838m4718l4845k8865
663B71123k5130k1316j7729j5784j5008j3551j1665j0856j0671r754q237p587p587o812n519
662H3917n072n331m988l991l539l650l192k120j653j764j413m14M6j40K17J068J423J164J188
$$ plain form
659 51756 53498 55325 56672 57857 59522 61338 62673 63846 65352 66821 67735 68321 69166 69861 69705 69036 68478 67854 66601
657 66601 64852 63159 61404 59169 56653 54322 52071 49414 46582 44156 41924 39359 36642 34332 32372 30301 28212
655 28212 26530 25218 23794 22422 21456 20797 19953 19086 18626 18351 17816 17088 16693 16564 16250 15802 15687 15824 15702 15381 15319 15474
652 15474 15370 14988 14866 14974 14824 14406 14172 14149 13941 13493 13230 13135 12855 12437 12278 12356 12175 11763 11535 11581 11441 11066 10876 10902 10817
649 10817 10566 10500 10630 10650 10530 10670 11061 11267 11168 11179 11359 11353 11038 10834 10972 11000 10768 10648 10743 10728 10528 10438 10596 10644 10502 10470 10686
646 10686 10718 10446 10174 10160 10035 9725 9526 9533 9540 9299 9170 9208 9135 8877 8730 8837 8833 8578 8433 8595 8757 8667 8577 8782 8988 9009 9030 9299
642 9299 9567 9584 9601 9957 10425 10768 11221 11879 12536 12914 13180 13486 13533 13238 12943 12829 12714 12267 11819 11500 11181 10702 10408 10465 10522
639 10522 10406 10290 10454 10619 10599 10578 10837 11096 11169 11243 11620 11996 12103 12098 12289 12480 12487 12493 12811 13241 13504 13767 14342 15029 15542 16055
$$ packed form
659E1756J742J827J347J185J665J816J335J173J506J469R14N86Q45O95j56o69n58o24j253
657F6601j749j693j755k235k516k331k251k657k832k426k232k565k717k310j960k071k089
655B8212j682j312j424j372r66o59q44q67m60k75n35p28l95j29l14m48j15J37j22l21o2J55
652A5474j04l82j22J08j50m18k34k3k08m48k63r5k80m18j59P8j81m12k28M6j40l75j90K6q5
649A0817k51o6J30K0j20J40L91K06r9J1J80ol15k04J38K8k32j20R5j5k00r0J58M8j42l2K16
646A0686L2k72k72j4j25l10j99PPk41j29L8p3k58j47J07mk55j45J62J62r0r0K05K06K1K1K69
642I299K68J7J7L56M68L43M53O58O57L78K66L06M7k95k95j14j15m47m48l19l19m79k94N7N7
639A0522j16j16J64J65k0k1K59K59P3P4L77L76J07nJ91J91POL18M30K63K63N75O87N13N13
$$ plain form
636 16055 16814 17573 18289 19004 20046 21274 22397 23520 24883 26245 27429 28614 29979 31456 32758 34061 35517 36972
634 36972 38146 39208 40273 41154 41604 41721 41811 41715 41292 40758 40416 40186 39967 39933 40308 40683 40695 40374 39968 39451 38616 37726 37176
631 37176 36885 36624 36362 36226 35980 35237 34087 32874 31475 29738 28057 26855 25986 25172 24414 23969 23709 23210 22526 22043 21819
629 21819 21647 21585 21893 22386 22802 23219 23936 24985 26049 27112 28463 30072 31789 33914 36958 41222 46877 54567 65159
626 65159 78969 95580 113856 131751 145837 152675 150601 140483 124855 106809 89318 74536 62896 53832 46801
624 46801 41620 37881 35020 32788 31234 30161 29286 28523 28111 27884 27580 27277 27312 27680 28141 28601 29336 30403 31527 32706
622 32706 34226 36005 37835 39720 42076 45060 48600 53065 59137 67316 77756 90970 107507 126892 147326 166244
620 166244 181364 191121 195724 197480 199592 203663 208377 210318 206206 194291 175252 152330 129607 110028 94521
$$ packed form
636A6055P59P59P16P15J042J228J123J123J363J362J184J185J365J477J302J303J456J455
634C6972J174J062J065Q81M50J17R0r6m23n34l42k30k19l4L75L75J2l21m06n17q35q90n50
631C7176k91k61k62j36k46p43j150j213j399j737j681j202q69q14p58m45k60m99o84m83k24
629B1819j72o2L08M93M16M17P17J049J064J063J351J609J717K125L044M264N655P690J0592
626F5159J3810J6611J8276J7895J4086O838k074j0118j5628j8046j7491j4782j1640r064p031
624D6801n181l739k861k232j554j073q75p63m12k27l04l03L5L68M61M60P35J067J124J179
622C2706J520J779J830J885K356K984L540M465O072Q179J0440J3214J6537J9385K0434J8918
620A66244J5120R757M603J756K112M071M714J941m112j1915j9039k2922k2723j9579j5507
$$ plain form
618 94521 82897 74699 69201 65539 63318 62748 63990 66905 71780 79326 89941 103275 118494 134170 147812 156198
616 156198 157077 150501 138341 123249 107973 94786 84667 77262 71965 68538 66848 66462 67222 69476 73541 79535 87710
614 87710 98948 113995 132773 154324 176692 196581 210411 216289 215540 212018 210382 214329 225526 242454 260593
612 260593 274184 278545 271553 254156 230435 206046 185762 171861 164950 165032 171363 181989 193982 204502 211286
610 211286 213207 211245 207940 205707 204847 203581 199605 191081 177574 160479 142450 126010 112317 101545 93627 88336
609 88336 85004 82966 82130 82588 84243 87045 91437 98085 107363 119636 135601 156040 180709 208226 236251 261428
607 261428 280102 290307 293336 293221 294646 300471 310476 320813 325372 319243 301502 275662 247478 222585 204962
605 204962 196251 195916 202201 212861 225112 235702 242188 244364 244283 244984 249124 257941 270049 281172 286046 280963 265266
$$ packed form
618I4521j1624q198n498l662k221n70J242K915M875P546J0615J3334J5219J5676J3642Q386
616A56198Q79o576j2160j5092j5276j3187j0119p405n297l427j690l86P60K254M065N994Q175
614H7710J1238J5047J8778K1551K2368J9889J3830N878p49l522j636L947J1197J6928J8139
612B60593J3591M361o992j7397k3721k4389k0284j3901o911Q2O331J0626J1993J0520O784
610B11286J921j962l305k233q60j266l976q524j3507j7095j8029j6440j3693j0772p918n291
609H8336l332k038q36M58J655K802M392O648R278J2273J5965K0439K4669K7517K8025K5177
607B61428J8674J0205L029j15J425N825J0005J0337M559o129j7741k5840k8184k4893j7623
605B04962q711l35O285J0660J2251J0590O486K176q1P01M140Q817J2108J1123M874n083j5697
$$ plain form
603 265266 241137 212682 184327 159412 139064 123043 110775 101725 95023 89985 86459 84671 84648 86438 90523 97825
601 97825 108955 124486 144946 170029 197474 222885 241046 247558 240437 221372 195437 168579 144993 126326
599 126326 112713 103797 98668 96607 97444 101647 109381 120776 136207 156186 180132 206112 231224 252010 265246
597 265246 269571 266996 261795 258065 257403 258786 259022 253965 240661 219263 192725 164888 138789 116360 98406 84552
595 84552 73768 65258 58634 53466 49223 45638 42903 40867 39089 37418 36153 35273 34503 33744 33170 32806 32443 32174 32386
593 32386 33007 33739 34519 35632 37153 38858 40764 43372 47151 52297 59118 68490 81084 97117 116576 138661 161022
591 161022 179723 190695 191276 181034 162029 138380 114546 93504 76123 62390 52022 44423 38636 33971 30451
589 30451 27903 25909 24127 22678 21587 20496 19255 18199 17390 16470 15376 14468 13910 13353 12740 12127 11865 11603 11195 10787
$$ packed form
603B65266k4129k8455k8355k4915k0348j6021j2268r050o702n038l526j788k3J790M085P302
601I7825J1130J5531K0460K5083K7445K5411J8161O512p121j9065k5935k6858k3586j8667
599A26326j3613q916n129k061Q37M203P734J1395J5431J9979K3946K5980K5112K0786J3236
597B65246M325k575n201l730o62J383K36n057j3304k1398k6538k7837k6099k2429j7954j3854
595H4552j0784q510o624n168m243l585k735k036j778j671j265q80p70p59n74l64l63k69K12
593C2386O21P32P80J113J521J705J906K608L779N146O821R372J2594J6033J9459K2085K2361
591A61022J8701J0972N81j0242j9005k3649k3834k1042j7381j3733j0368p599n787m665l520
589C0451k548j994j782j449j091j091j241j056q09r20j094r08n58n57o13o13k62k62m08m08
$$ plain form
587 10787 10656 10525 10332 10139 10297 10455 10503 10551 10839 11127 11021 10915 10816 10717 10333 10060 10038 10017 9849 9681 9716 9752 9553 9354 9358 9363 9146
583 9146 8928 8921 8914 8701 8599 8712 8826 8747 8668 8726 8783 8645 8618 8813 9008 8953 9010 9355 9700 9723 9746 10046 10346 10407 10468 10592 10604 10250 9896
580 9896 9664 9432 9019 8605 8543 8481 8287 8093 8213 8333 8235 8138 8360 8692 8728 8653 8825 9108 9155 9202 9423 9643 9575 9506 9678 9849 9809
576 9809 9768 9923 10079 9987 9784 9848 9911 9796 9681 9855 10140 10231 10322 10660 10998 11051 11105 11362 11730 11775 11634 11701 11879 11852 11714 11811 12019
573 12019 11989 11774 11725 11862 11843 11713 11725 11847 11735 11623 11722 12005 12161 12207 12460 12824 13050 13165 13447 13839 14040 14129 14429 14840 15051
570 15051 15263 15696 16241 16644 17047 17742 18622 19282 19942 20864 22118 23377 24821 26715 28942 31098 33253 35664 38335 41096
568 41096 44337 48901 55128 63238 73974 88583 107742 131231 158012 185648 209549 224106 225755 214462 193295
566 193295 166943 140185 116625 97614 82648 71046 62348 55980 51150 47468 44936 43329 42039 40860 39884 39020
$$ packed form
587A0787j31j31j93j93J58J58M8M8K88K88j06j06r9r9l84k73k2k1j68j68L5L6j99j99MNk17
583I146k18ppk13j02J13J14p9p9N8N7j38k7J95J95n5N7L45L45K3K3L00L00O1O1J24J2l54l54
580I896k32k32m13m14o2o2j94j94J20J20r8r7K22L32L6p5J72K83M7M7K21K20o8o9J72J71m0
576I809m1J55J56r2k03O4O3j15j15J74K85R1R1L38L38N3N4K57L68M5j41O7J78k7j38R7K08
573A2019l0k15m9J37j9j30J2J22j12j12R9K83J56M6K53L64K26J15K82L92K01Q9L00M11K11
570A5051K12M33N45M03M03O95Q80O60O60R22J254J259J444J894K227K156K155K411K671K761
568D1096L241M564O227Q110J0736J4609J9159K3489K6781K7636K3901J4557J649j1293k1167
566A93295k6352k6758k3560j9011j4966j1602q698o368m830l682k532j607j290j179r76q64
$$ plain form
564 39020 37952 36773 35827 35214 34638 34061 33893 34132 34471 34920 35927 37488 39259 41030 43215 45732 48167 50490 53202
561 53202 56542 60359 64952 71251 79880 91204 105967 125251 149232 176594 204881 230543 249067 256601 252338
560 252338 239232 222243 206074 194602 190536 194864 206914 225140 247268 269211 285842 293560 292472 286096 279669
558 279669 278383 285727 301095 319373 332954 335007 321786 294064 257133 218326 183328 154489 131827 114647
556 114647 101941 92213 84444 78525 74417 71593 69545 68412 68278 68675 69183 70006 71309 72926 74727 77162 80670 85174
554 85174 90825 98441 109052 123227 141433 164160 191214 220700 249780 275938 297474 313821 325547 333306 336368
552 336368 332760 321940 306535 291241 280651 277716 283332 295421 309007 318414 319865 312405 297203 277157 256571
550 256571 239497 228567 225440 231322 245600 264442 281547 290470 286930 270169 243682 214071 187454 166941 153048
$$ packed form
564C9020j068j179r46o13n76n77j68K39L39M49J007J561J771J771K185K517K435K323K712
561E3202L340L817M593O299Q629J1324J4763J9284K3981K7362K8287K5662J8524P534m263
560B52338j3106j6989j6169j1472m066M328J2050J8226K2128K1943J6631P718j088o376o427
558B79669j286P344J5368J8278J3581K053j3221k7722l6931l8807l4998k8839k2662j7180
556A14647j2706r728p769n919m108k824k048j133j34L97N08Q23J303J617J801K435L508M504
554H5174N651P616J0611J4175J8206K2727K7054K9486K9080K6158K1536J6347J1726P759L062
552C36368l608j0820j5405j5294j0590k935N616J2089J3586R407J451p460j5202k0046k0586
550B56571j7074j0930l127N882J4278J8842J7105Q923l540j6761k6487k9611k6617k0513j3893
$$ plain form
548 153048 145922 145193 148362 150902 149120 142789 134956 129823 130038 135986 146482 160269 175869 190765 201337 204624
546 204624 200139 189701 176300 163306 153852 149761 151166 157638 168797 183839 200337 214949 224731 228041 224761
545 224761 217154 209765 207220 212183 225244 245516 270486 295565 316170 329780 335884 334221 324090 305282 278745
543 278745 246656 212606 180651 153762 132430 115794 103194 94255 87928 83191 79734 77794 76938 76488 76395 76930 77857
541 77857 78672 79402 80465 81731 82997 84839 88197 93442 100499 109798 122167 137434 154661 172724 189863 203022
539 203022 209192 207757 200739 191483 183225 178924 180208 186412 194725 201942 205128 202046 192270 178112 163177 150243
537 150243 140674 135533 135829 141593 152054 165931 180807 192500 196391 190403 176168 157088 136863 118759 104538
535 104538 93980 85751 79159 74528 71699 70016 69286 69776 70989 71869 72123 72377 72763 72520 71508 70606 70347 70273 70180 70568
$$ packed form
548A53048p126p29L169K540j782o331p833n133K15N948J0496J3787J5600J4896J0572L287
546B04624m485j0438j3401j2994r454m091J405O472J1159J5042J6498J4612R782L310l280
545B24761p607p389k545M963J3061K0272K4970K5079K0605J3610O104j663j0131j8808k6537
543B78745l2089l4050l1955k6889k1332j6636j2600q939o327m737l457j940q56m50r3N35R27
541G7857Q15P30J063J266J266J842L358N245P057R299J2369J5267J7227J8063J7139J3159
539B03022O170j435p018r256q258m301J284O204Q313P217L186l082r776j4158j4935j2934
537A50243r569n141K96N764J0461J3877J4876J1693L891n988j4235j9080k0225j8104j4221
535A04538j0558q229o592m631k829j683p30M90J213Q80K54K54L86k43j012r02k59p4r3L88
$$ plain form
532 70568 71715 73120 74437 76013 77752 79306 80877 83224 86424 89623 92622 95806 99131 101902 104187 107101 111544
530 111544 117579 125623 136590 150271 164506 176435 183593 184094 177237 164684 150097 136607 125595 117342 111937
529 111937 108876 107035 106049 106432 108176 110327 112076 113492 114678 115236 115169 114992 114913 114500 113894 114138 115787 118212 120794 123561
526 123561 126237 127988 128510 128847 129808 131102 132197 133033 133498 133408 133146 134032 136613 140268 144514 149388 154608 159198 162731
524 162731 165856 168704 170110 169255 166736 163565 159987 156035 152415 149484 146886 144501 142670 140910 137782 132786 127161
522 127161 122082 117705 114234 112206 111292 109898 106913 102930 98688 93892 88512 83392 79154 75175 71072 67597 65296
520 65296 63402 61348 59701 58849 57997 56495 55104 54414 53982 53500 53646 54534 54793 53360 51151 49427 48184 46959 46141 46172
517 46172 46388 46045 45701 45834 45967 45535 45215 45459 45369 44471 43758 44043 44735 45134 45865 47434 49003 49806 50425 51198 51343 50587 50015
$$ packed form
532G0568J147J405J317J576J739J554J571K347L200L199K999L184L325K771K285K914M443
530A11544O035Q044J0967J3681J4235J1929P158N01o857j2553j4587j3490j1012q253n405
529A11937l061j841r86L83J744K151J749J416J186N58o7j77p9m13o06K44J649K425K582K767
526A23561K676J751N22L37R61J294J095Q36M65r0k62Q86K581L655M246M874N220M590L533
524A62731L125K848J406q55k519l171l578l952l620k931k598k385j831j760l128m996n625
522A27161n079m377l471k028r14j394k985l983m242m796n380n120m238l979m103l475k301
520F5296j894k054j647q52q52j502j391o90m32m82J46Q88K59j433k209j724j243j225q18L1
517D6172K16l43l44J33J33m32l20K44r0q98p13K85O92L99P31J569J569Q03O19P73J45p56n72
$$ plain form
514 50015 50360 50816 50690 50748 51505 51928 51529 51315 51922 52639 53353 55360 59152 64090 70942 82269 99749 124367 158975
512 158975 203382 244766 260819 239964 194812 149920 118970 99470 85554 75942 70287 66088 62074 59852 59960
510 59960 60754 61548 63892 67828 71261 73030 73928 73828 71467 67442 64131 62115 60059 58003 57464 58368 59052 59182 59898 60947
508 60947 60966 60356 60751 62071 62771 63065 64495 66629 67745 68233 69808 72160 73770 75437 79113 84379 90317 99028 113661
505 113661 135061 164394 204119 248984 279537 275878 239713 193821 158692 137300 123490 114793 111088 109292 106793
504 106793 105335 106873 109649 112093 116015 122416 128442 131842 134295 137450 139907 141144 143975 149580 155181 159043 163267
502 163267 169082 174102 177014 180291 185084 188675 189641 190795 193835 196717 198823 203412 211587 219837 226422 234187 244060
499 244060 252139 257001 263046 272900 283452 292932 304865 320903 336895 351149 368510 391528 416026 440264 469800
$$ packed form
514E0015L45M56j26N8P57M23l99k14O07P17P14K007L792M938O852J1327J7480K4618L4608
512A58975M4407M1384J6053k0855m5152m4892l0950j9500j3916r612n655m199m014k222J08
510E9960P94P94K344L936L433J769Q98j00k361m025l311k016k056k056n39R04O84J30P16J049
508F0947J9o10L95J320P00K94J430K134J116M88J575K352J610J667L676N266N938Q711J4633
505A13661K1400K9333L9725M4865L0553l659l6165m5892l5129k1392j3810q697l705j796k499
504A06793j458J538K776K444L922O401O026L400K453L155K457J237K831N605N601L862M224
502A63267N815N020K912L277M793L591R66J154L040K882K106M589Q175Q250O585P765R873
499B44060Q079M862O045R854J0552R480J1933J6038J5992J4254J7361K3018K4498K4238K9536
$$ plain form
498 469800 507655 549038 591568 640328 696670 753077 806784 867087 942220 1032020 1142863 1294898 1505992
496 1505992 1786143 2161668 2687419 3421337 4403370 5654219 7123750 8575640 9570792 9692563 8864883
495 8864883 7429642 5886536 4570457 3561570 2809590 2255718 1852248 1550143 1312940 1127580 988630
493 988630 885007 807308 753299 718928 693215 666430 636155 603329 568926 535891 507798 485067 466706 453855
492 453855 447998 448021 452362 461622 475727 492088 509982 532129 559676 590588 625499 667844 716341 765763 817163
490 817163 878807 955414 1048256 1167550 1331999 1555867 1854029 2263361 2841142 3638604 4690680 6004235
488 6004235 7477733 8798107 9502043 9265024 8171264 6662257 5205875 4031610 3144132 2481338
487 2481338 1996237 1642678 1370293 1151285 982016 855956 757594 680412 627602 593537 562541 526520
$$ packed form
498D69800L7855M1383M2530M8760N6342N6407N3707O0303P5133Q9800J10843J52035K11094
496A505992K80151L75525N25751P33918R82033J250849J469531J451890R95152J21771q27680
495H864883j435241j543106j316079j008887p51980n53872m03470l02105k37203j85360j38950
493I88630j03623p7699n4009l4371k5713k6785l0275l2826l4403l3035k8093k2731j8361j2851
492D53855n857K3M341R260J4105J6361J7894K2147K7547L0912L4911M2345M8497M9422N1400
490H17163O1644P6607R2842J19294J64449K23868K98162M09332N77781P97462J052076J313555
488F004235J473498J320374P03936k37019j093760j509007j456382j174265q87478o62794
487B481338m85101l53559k72385k19008j69269j26060r8362p7182n2810l4065l0996l6021
$$ plain form
486 526520 489131 452441 413568 374043 339659 310755 282554 255296 233917 218514 203961 189195 177351 167738
484 167738 155869 141554 129200 119998 111351 103610 99752 98995 97166 93677 91408 90205 86820 81373 77369 75368 72442
482 72442 68121 65094 63525 60735 56689 54306 53994 53127 51303 50847 51866 51813 50266 49496 49913 49332 47442 46403 46597 45942
479 45942 44108 43198 43552 42908 40775 39123 38451 37077 34732 33459 33610 33207 31634 30616 30671 30170 28815 28236 28805 28672
477 28672 27369 26547 26744 26461 25188 24544 24952 24878 23765 23206 23827 24114 23560 23635 24826 25611 25351 25276 25842 25704 24522 23821
474 23821 24276 24472 23623 22959 23084 22801 21617 20766 20895 20839 20061 19691 20365 20928 20692 20640 21354 21661 20949 20237 20179 19788 18644
471 18644 17758 17849 17939 17352 17025 17487 17765 17301 17021 17581 18142 18025 18019 18653 19028 18491 17953 18116 18094 17325 16667 16848 17141 16961 17115
468 17115 18283 19636 20418 21201 22394 23181 22972 22577 22666 22496 21561 20626 20514 20512 19986 19461 19630 19800 19334 18868 19133 19582 19507
$$ packed form
486E26520l7389l6690l8873l9525l4384k8904k8201k7258k1379j5403j4553j4766j1844r613
484A67738j1869j4315j2354r202q647p741l858p57j829l489k269j203l385n447m004k001k926
482G2442m321l027j569k790m046k383l12q67j824m56J019n3j547p70M17n81j890j039J94o55
479D5942j834r10L54o44k133j652o72j374k345j273J51m03j573j018N5n01j355n79N69j33
477B8672j303q22J97k83j273o44M08p4j113n59O21K87n54P5J191P85k60p5N66j38j182p01
474B3821M55J96q49o64J25k83j184q51J29n6p78l70O74N63k36n2P14L07p12p12n8l91j144
471A8644q86R1R0n87l27M62K78m64k80N60N61j17oO34L75n37n38J63k2p69o58J81K93j80J54
468A7115J168J353P82P83J193P87k09l95Q9j70r35r35j12kn26n25J69J70m66m66K65M49p5
$$ plain form
466 19507 19543 20219 20784 20543 20117 20160 20203 19632 19060 19204 19460 19123 18786 19072 19468 19393 19317 19962 20866 21291 21605 22396 23075 22881 22354
463 22354 22305 22440 22025 21499 21485 21656 21390 21125 21605 22492 23150 23809 25060 26311 26922 27126 27612 28098 27949 27614 27748 27992 27705
460 27705 27307 27480 27911 27936 27849 28384 29177 29563 29838 30648 31717 32339 32629 33277 33925 34053 33996 34525 35460 36114 36656 37594 38643
457 38643 39063 39150 39756 40842 41734 42441 43442 44332 44431 44049 44118 44740 45310 45880 47205 49011 50491 51639 53092 54804 56109
454 56109 57008 58146 59470 60466 61276 62579 64362 66023 67684 69911 72915 76287 80213 85180 90850 96187 100673 104596
452 104596 107816 109843 111242 113279 116463 120220 124309 129324 135558 142699 150912 161062 173468 187677 203624 221658
450 221658 241282 261292 281302 302063 324414 348793 376092 407955 445993 492361 551340 629644 735795 881044
448 881044 1082097 1361745 1745124 2251017 2873954 3557187 4177514 4572540 4614728 4285794 3691299 3000694
$$ packed form
466A9507L6O76N65k41m26M3M3n71n72J44K56l37l37K86L96p5p6O45R04M25L14P91O79j94n27
463B2354m9J35m15n26j4J71k66k65M80Q87O58O59J251J251O11K04M86M86j49l35J34K44k87
460B7705l98J73M31K5q7N35P93L86K75Q10J069O22K90O48O48J28n7N29R35O54N42R38J049
457C8643M20Q7O06J086Q92P07J001Q90R9l82O9O22N70N70J325J806J480J148J453J712J305
454E6109Q99J138J324R96Q10J303J783J661J661K227L004L372L926M967N670N337M486L923
452A04596L220K027J399K037L184L757M089N015O234P141Q213J0150J2406J4209J5947J8034
450B21658J9624K0010K0010K0761K2351K4379K7299L1863L8038M6368N8979P8304J06151J45249
448H81044K01053K79648L83379N05893O22937O83233O20327L95026M2188l28934n94495o90605
$$ plain form
447 3000694 2360643 1844539 1458646 1177160 970856 816903 699006 606701 534698 479827 438677 407682
446 407682 384342 366970 353407 341473 329798 318072 306345 294551 283534 274572 268309 264884 264529 267759 274649
444 274649 284494 296594 310405 325214 340550 357106 376436 400019 428567 462624 503399 553455 617001 700627
442 700627 814342 972471 1194277 1503322 1923244 2464723 3101337 3745901 4254156 4475992 4333820 3871281
441 3871281 3229605 2569550 1999992 1558056 1232464 995146 819374 685205 580118 496960 431423 380347
439 380347 341341 312210 290294 272928 257881 243464 228168 211430 194124 177521 162212 148345 136240 125947
437 125947 117045 109068 102152 96308 91020 85916 81279 77567 74880 73193 72682 73169 73754 73488 72209 69858 66222 61514
435 61514 56637 52388 48690 45250 42220 39892 37853 35814 33996 32806 32012 31329 30964 31155 31461 31508 31483 31717 32072 32167 32265
$$ packed form
447C000694o40051n16104l85893k81486k06304j53953j17897r2305p2003n4871m1150l0995
446D07682k3340j7372j3563j1934j1675j1726j1727j1794j1017q962o263l425l55L230O890
444B74649R845J2100J3811J4809J5336J6556J9330K3583K8548L4057M0775N0056O3546Q3626
442G00627J13715J58129K21806L09045M19922N41479O36614O44564N08255K21836j42172m62539
441C871281o41676o60055n69558m41936l25592k37318j75772j34169j05087q3158o5537n1076
439C80347l9006k9131k1916j7366j5047j4417j5296j6738j7306j6603j5309j3867j2105j0293
437A25947q902p977o916n844n288n104m637l712k687j687n11M87N85k66j279k351l636m708
435F1514m877m249l698l440l030k328k039k039j818j190p94o83l65J91L06M7k5K34L55R5R8
$$ plain form
433 32265 32770 33559 34348 35381 37191 39896 43303 47611 52918 58405 62672 64703 63960 60245 54200 47318 41065 35857
430 35857 31499 28066 25631 23835 22223 20801 19859 19153 18337 17503 17077 16863 16464 15913 15548 15261 14863 14482 14433 14620 14696 14763
428 14763 15090 15449 15402 15049 14882 14867 14742 14579 14675 14942 15025 14976 15187 15564 15830 16011 16525 17399 18384 19620 21558 24356 27783
425 27783 31950 37189 43107 48471 52071 53120 51296 46773 40705 34582 29254 24778 21205 18631 16848 15397 14125
423 14125 13259 12696 12132 11465 10982 10636 10179 9599 9204 9024 8845 8638 8616 8768 8808 8726 8828 9000 8913 8557 8312 8266 8036 7630 7335
420 7335 7275 7105 6796 6598 6567 6424 6189 6065 6112 6049 5855 5847 5968 5978 5806 5818 5960 5917 5606 5405 5440 5365 5146 5038 5175 5201 5079
416 5079 5141 5476 5754 5780 5806 5983 6049 5829 5608 5543 5367 5025 4795 4773 4696 4451 4317 4438 4559 4518 4588 4873 5158 5252 5346 5560 5664
413 5664 5555 5500 5607 5602 5386 5280 5420 5559 5621 5684 5987 6235 6287 6450 6902 7353 7672 8046 8731 9675 10730 12193 14186 16439
$$ packed form
433C2265N05P89P89J033J810K705L407M308N307N487M267K031p43l715o045o882o253n208
430C5857m358l433k435j796j612j422r42p06q16q34m26k14l99n51l65k87l98l81m9J87P6O7
428A4763L27L59m7l53j67j5j25j63R6K67Q3m9K11L77K66J81N14Q74R85J236J938K798L427
425B7783M167N239N918N364L600J049j824m523o068o123n328m476l573k574j783j451j272
423A4125q66n63n64o67m83l46m57n80l95j80j79k07k2J52M0q2J02J72q7l56k45m6k30m06k95
420G335o0j70l09j98l1j43k35j24M7o3j94qJ21J0j72J2J42m3l11k01L5p5k19j08J37K6j22
416E079O2L35K78K6K6J77O6k20k21o5j76l42k30k2p7k45j34J21J21m1P0K85K85R4R4K14J04
413E664j09n5J07nk16j06J40J39O2O3L03K48N2J63M52M51L19L74O85R44J055J463J993K253
$$ plain form
410 16439 18593 20487 22044 22972 23134 22963 22648 21927 20655 19051 17594 16323 15333 14898 15294 16246 17507 19101 21037 22789
408 22789 23926 24509 24782 24648 23796 22241 20145 17642 15043 12851 11417 10464 9583 8812 8404 8182 7967 7752 7691 7686 7570 7566
405 7566 7780 7994 8033 8073 8371 8854 9316 9964 11031 12432 14075 15978 18167 20244 21671 22468 22877 22880 22403 21594 20600 19348
402 19348 17730 16223 15298 15002 15131 15815 17215 19095 20972 22589 24007 24945 25227 24954 24338 23169 21215 18781 16504
400 16504 14708 13330 12358 12016 12154 12515 12988 13658 14383 14851 15060 15081 14769 13897 12619 11364 10220 9087 8066 7416 7026
397 7026 6584 6143 5929 5826 5633 5386 5338 5475 5467 5275 5217 5344 5344 5233 5256 5390 5411 5321 5330 5451 5480 5510 5755 6111 6353 6485 6884 7543
394 7543 8218 8782 9499 10327 10909 11011 10935 10860 10817 10885 11269 11987 12695 13292 13969 14591 14794 14442 13743 12785 11541 10186 9115 8450
391 8450 7972 7549 7282 7200 7041 6697 6486 6461 6404 6237 6194 6336 6396 6271 6192 6224 6223 6111 6054 6109 6139 6058 6106 6266 6314 6251 6313 6560 6770
$$ packed form
410A6439K154J894J557R28J62j71l15p21j272j604j457j271r90m35L96R52J261J594J936J752
408B2789J137N83K73j34q52j555k096k503k599k192j434r53q81p71m08k22k15k15o1nj16m
405G566K14K14L9M0K98M83M62O48J067J401J643J903K189K077J427P97M09Lm77q09r94j252
402A9348j618j507r25k96J29O84J400J880J877J617J418R38K82k73o16j169j954k434k277
400A6504j796j378r72l42J38L61M73O70P25M68K09K1l12q72j278j255j144j133j021o50l90
397G026m42m41k14j03j93k47m8J37qj92n8J27%j11K3J34K1r0RJ21K9L0K45L56K42J32L99O59
394G543O75N64P17Q28N82J02p6p5m3O8L84P18P08N97O77O22K03l52o99r58j244j355j071o65
391H450m78m23k67q2j59l44k11k5n7j67m3J42O0j25p9L2jj12n7N5L0q1M8J60M8o3O2K47K10
$$ plain form
388 6770 6869 7024 7363 7710 7945 8384 9229 10230 11341 12711 14267 15305 15345 14650 13696 12784 11983 11602 11703 12108 12697 13782
385 13782 15643 18143 21050 24321 27647 30126 30867 29815 27395 24196 20812 17928 15894 14374 13114 12171 11709 11504
383 11504 11243 11058 11131 11318 11395 11435 11659 11890 11935 11944 12211 12653 12983 13281 13765 14333 14791 15336 16067 16838 17424 18031 18970 20111 21252
380 21252 22568 24365 26505 28644 30911 33584 36524 39648 43378 48550 55762 65305 77492 92009 107205 120293
378 120293 128745 131021 127159 118674 108248 98377 90110 83359 78013 74109 71311 68845 66580 64870 63629 62388 61154
376 61154 60179 59452 58539 57474 56816 56662 56693 56858 57651 59082 60402 61245 61904 62431 62403 61759 61114 60581 59863 58931 58479 58771 59174
373 59174 59490 60286 61835 63569 65562 68997 74558 81562 90253 102975 121778 147053 180274 224552 276909 321093
371 321093 335169 310600 260944 209255 169334 140989 119418 102691 90495 80924 71952 63609 56995 51971 47858
$$ packed form
388F770R9J55L39L47K35M39Q45J001J111J370J556J038M0o95r54r12q01l81J01M05N89J085
385A3782J861K500K907L271L326K479P41j052k420l199l384k884k034j520j260r43m62k05
383A1504k61j85P3J87P7M0K24K31M5RK67M42L30K98M84N68M58N45P31P71N86O07R39J141J141
380B1252J316J797K140K139K267K673K940L124L730N172P212R543J2187J4517J5196J3088
378A20293Q452K276l862q485j0426r871q267o751n346l904k798k466k265j710j241j241j234
376F1154r75p27r13j065o58j54L1J65P93J431J320Q43O59N27k8o44o45n33p18r32m52K92M03
373E9174L16P96J549J734J993L435N561P004Q691J2722J8803K5275L3221M4278N2357M4184
371C21093J4076k4569m9656n1689l9921k8345k1571j6727j2196r571q972q343o614n024m113
$$ plain form
369 47858 44669 42825 41980 41424 41126 41289 41636 41757 41878 42515 43336 43729 43494 42783 41517 39445 36965 34777 33144 31906
367 31906 31001 30762 31152 31863 32684 33620 34555 35499 36554 38139 40352 43035 46346 50582 55742 61608 68103 75767 85243
364 85243 96422 108008 117524 122269 120636 113124 101752 88716 75502 63138 52443 43856 37111 31809 27638 24393
362 24393 21660 19261 17296 15885 14784 13794 13056 12577 12296 12015 11880 11856 11701 11361 10965 10755 10597 10329 9993 9658 9186 8529
360 8529 7886 7502 7294 7086 6938 6789 6537 6100 5575 5161 4939 4717 4594 4656 4809 4851 4690 4529 4273 4017 3747 3588 3485 3271
357 3271 3113 3065 3081 2987 2892 2908 2920 2821 2636 2562 2554 2546 2427 2419 2461 2503 2452 2402 2425 2337 2194 2162 2215 2268 2236 2204 2186 2169 2089 2120 2281 2442 2480
353 2480 2518 2424 2331 2223 2226 2254 2170 2093 2127 2301 2475 2515 2555 2550 2362 2048 1845 1787 1728 1611 1604 1699 1739 1652 1621 1677 1679 1585 1491 1461 1430 1344 1258
349 1258 1255 1252 1215 1233 1279 1269 1204 1194 1248 1247 1153 1114 1176 1183 1100 1073 1108 1142 1089 1092 1175 1202 1134 1066 1100 1135 1111 1087 1127 1111 965 875 932 989 957 925 940
$$ packed form
369D7858l189j844q45n56k98J63L47J21J21O37Q21L93k35p11j266k072k480k188j633j238
367C1906r05k39L90P11Q21R36R35R44J055J585K213K683L311M236N160N866O495P664R476
364H5243J1179J1586R516M745j633p512j1372j3036j3214j2364j0695q587o745n302m171l245
362B4393k733k399j965j411j101r90p38m79k81k81j35k4j55l40l96k10j58k68l36l35m72o57
360H529o43l84k08k08j48j49k52m37n25m14k22k22j23O2J53M2j61j61k56k56k70j59j03k14
357C271j58m8J6r4r5J6J2r9j85p4qqj19qM2M2n1n0K3q8j43l2N3N3l2l2j8j7q0L1J61J61L8
353B480L8r4r3j08LK8q4p7L4J74J74M0M0nj88l14k03n8n9j17pR5M0q7l1N6Kr4r4l0l1q6q6
349A258lll7J8M6j0o5j0N4jr4l9O2Pq3k7L5L4n3LQ3K7o8o8L4L5k4k4M0j6j46r0N7N7l2l2J5
$$ plain form
344 940 955 935 971 1074 1123 1040 956 996 1035 982 929 930 930 874 819 880 941 910 878 884 889 860 886 1021 1100 977 854 821 843 834 826 882 938 831 725
340 725 706 742 692 642 656 669 594 519 590 717 704 599 571 636 673 656 688 720 693 667 702 737 677 562 516 526 500 475 485 494 499 505 600 639 614
336 614 588 631 619 508 397 446 495 451 352 384 508 540 480 449 473 439 350 356 417 444 471 544 617 561 505 475 444 396 291 261 323 361 344 402
331 402 460 460 459 493 527 505 428 425 514 527 485 469 508 478 356 303 343 380 325 269 268 233 199 245 347 346 252 199 238 257 220 195 263 332 307 281 310
327 310 301 293 338 382 371 305 250 287 324 270 199 184 132 80 115 151 187 223 247 271 239 208 259 309 305 300 294 289 228 167 201 235 217 199 239 333 360 294
322 294 288 336 315 202 185 297 383 376 336 295 200 104 74 137 150 71 48 118 167 161 197 326 385 315 254 286 296 250 250 361 383 294 179 176 195
318 195 215 209 203 204 205 157 219 274 330 323 317 262 207 181 265 288 310 346 383 433 372 363 465 554 642 703 765 766 657 593 641 688 625 543 572 601 520 366
313 366 324 341 359 393 427 438 339 240 252 350 337 341 345 411 366 296 337 364 391 402 413 487 449 380 311 298 285 254 335 471 496 472 447 471 495 541
$$ packed form
344I40J5k0L6J03M9q3q4M0L9n3n3J%n6n5O1O1l1l2ONk9K6J35P9j23j23l3K2rqN6N6j07j06
340G25j9L6n0n0J4J3p5p5P1J27j3j05k8O5L7j7L2L2k7k6L5L5o0j15m6J0k6k5J0RNOR5L9k5
336F14k6M3j2j11j11M9M9m4r9L2J24L2o0l1K4l4q9OO1K7K7P3P3n6n6l0l1m8j05l0O2L8j7N8
331D02N8%jL4L4k2p7lQ9J3m2j6L9l0j22n3M0L7n5n6jl5l4M6J02jr4n3L9J9l7k5O8O9k5k6K9
327C10rqM5M4j1o6n5L7L7n4p1j5n2n2L5L6L6L6K4K4l2l1N1N0mnono1o1L4L4j8j8M0R4K7o6
322B94oM8k1j13j7J12Q6pm0m1r5r6l0O3J3p9k3P0M9oL6J29N9p0o1L2J0m6%J11K2q9j15lJ9
318A95K0ooJJm8O2N5N6pon5n5k6Q4K3K2L6L7N0o1rJ02Q9Q8O1O2Jj09o4M8M7o3q2K9K9q1j54
313C66m2J7J8L4L4J1r9r9J2R8j3MMO6m5p0M1K7K7J1J1P4l8o9o9j3j3l1Q1J36K5k4k5K4K4M6
$$ plain form
309 541 586 644 701 794 1072 1405 1739 1918 1986 1840 1508 1126 854 786 718 637 556 530 505 439 373 314 255 158 172 215 259 248 236 317 398
305 398 384 369 355 341 313 285 257 229 206 184 217 250 235 220 204 189 127 65 96 126 87 49 65 82 106 130 160 190 239 380 521 569 554 540
301 540 575 610 608 606 569 440 288 229 272 261 186 112 71 -24 -123 -131 -64 -53 -87 -28 61 95 44 -7 29 66 72 78 66 -1 -75 -57 -2 -2 -60 -25 43
296 43 56 -8 -18 26 16 -21 -3 69 87 -2 -37 22 82 14 -53 -84 -171 -280 -296 -202 -108 -88 -67 7 83 13 -55 -69 -84 -97 -110 -68 -25 16 57
292 57 99 141 132 123 114 105 25 -55 -43 -31 -68 -106 -51 3 -48 -99 -95 -91 -140 -189 -109 -29 -90 -152 -158 -163 -138 -113 -88 -62 -104 -145 -131 -117 -146 -175 -148 -121 -152 -183
287 -183 -121 -59 -119 -179 -109 -39 -69 -100 -130 -161 -206 -252 -168 -84 -93 -102 11 125 112 5 -24 1 -20 -41 -59 -77 -94 -110 -72 -33 -91 -148 -113 -78 -100
283 -100 -122 -88 -55 -44 -33 -22 -11 -54 -98 -86 -74 -121 -169 -124 -79 -111 -142 -118 -94 -140 -185 -175 -166 -96 -26 -48 -71 -127 -184 -186 -187 -258 -329 -270 -212 -280 -349
278 -349 -288 -227 -259 -292 -232 -172 -188 -204 -221 -237 -261 -285 -220 -155 -180 -261 -274 -194 -146 -154 -129 -103 -148 -248 -281 -220 -204 -243 -245 -247 -257 -266 -275 -284 -322 -360 -305 -251
$$ packed form
309E41M5N8N7R3K78L33L34J79O8j46l32l82k72o8o8q1q1k6k5o6o6n9n9r7J4M3M4j1j2Q1Q1
305C98j4j5j4j4k8k8k8k8k3k2L3L3j5j5j6j5o2o2L1L0l9l8J6J7K4K4L0L0M9J41J41M8j5j4
301E40L5L5kkl7j29j52n9M3j1p5p4m1r5r9qO7J1l4N9Q9L4n1n1L6L7OOj2o7p4J8N5%n8L5O8
296D3J3o4j0M4j0l7J8P2J8q9l5N9O0o8o7l1q7j09j6R4R4K0K1P4P6p0o8j4j5j3j3M2M3M1M1
292E7M2M2rrrrq0q0J2J2l7l8N5N4n1n1MMm9m9Q0Q0o1o2onK5K5K5K6m2m1J4J4k9k9K7K7l1l1
287a83O2O2o0o0P0P0l0l1l0l1m5m6Q4Q4rrJ13J14j3j07k9K5k1k1j8j8j7j6L8L9n8n7L5L5k2
283a00k2L4L3J1J1J1J1m3m4J2J2m7m8M5M5l2l1K4K4m6m5J0RP0P0k2k3n6n7kjp1p1N9N8o8o9
278c49O1O1l2l3O0O0j6j6j7j6k4k4O5O5k5q1j3Q0M8qK5K6m5j00l3O1J6l9kkj0rrrl8l8N5N4
$$ plain form
274 -251 -226 -201 -177 -152 -124 -96 -123 -150 -245 -340 -358 -283 -221 -158 -90 -22 -49 -76 -102 -129 -156 -183 -117 3 22 -51 -101 -96 -163 -230 -222 -122 -105 -181 -230
269 -230 -224 -214 -204 -191 -178 -158 -138 -118 -98 -149 -201 -197 -137 -116 -188 -260 -239 -176 -169 -181 -192 -273 -353 -359 -273 -226 -235 -241 -192 -173 -209 -192 -120 -79 -130 -182 -141 -132 -179
265 -179 -189 -199 -259 -319 -344 -277 -240 -295 -348 -309 -254 -255 -254 -198 -164 -186 -173 -160 -148 -135 -126 -116 -158 -256 -322 -296 -252 -264 -270 -221 -203 -185 -163 -142 -120 -98 -77
260 -77 -55 -85 -114 -144 -174 -217 -261 -286 -255 -235 -307 -355 -347 -328 -309 -323 -282 -255 -320 -381 -350 -317 -284 -251 -217 -186 -248 -315 -289 -203 -208 -323 -437 -393 -349 -361
256 -361 -372 -415 -458 -408 -358 -339 -319 -299 -280 -220 -160 -155 -150 -194 -237 -226 -214 -248 -282 -261 -240 -216 -192 -223 -254 -251 -247 -244 -240 -246 -252 -258 -264 -270 -276 -282 -288 -258 -229 -200 -170 -167 -165
251 -165 -162 -159 -230 -301 -280 -258 -257 -255 -253 -251 -241 -230 -220 -209 -228 -246 -264 -283 -305 -328 -298 -269 -247 -281 -340 -306 -284 -318 -349 -325 -299 -328 -326 -324 -340 -412 -420 -336 -269 -332
246 -332 -444 -427 -320 -214 -230 -245 -229 -213 -197 -181 -213 -245 -259 -217 -184 -242 -301 -268 -231 -251 -320 -333 -305 -277 -301 -324 -311 -298 -290 -282 -277 -364 -455 -453 -354 -311
241 -311 -323 -335 -343 -352 -364 -376 -324 -328 -390 -398 -387 -433 -478 -468 -430 -447 -486 -432 -316 -256 -326 -396 -445 -494 -487 -425 -321 -308 -368 -372 -335 -353 -392 -431 -446 -462 -459 -401
$$ packed form
274b51K5K5K4K5K8K8k7k7r5r5j8P5O2O3O8O8k7k7k6k7k7k7O6J20J9p3n0No7o7QJ00J7p6m9
269b30OJ0J0J3J3K0K0K0K0n1n2MO0K1p2p2K1O3Pj2j1q1q0oQ6M7roM9J9l6J7P2M1n1n2M1Rm7
265a79j0j0o0o0k5O7L7n5n3L9N5jJN6L4k2J3J3J2J3RJ0m2r8o6K6M4j2oM9J8J8K2K1K2K2K1
260g7K2l0k9l0l0m3m4k5L1K0p2m8QJ9J9j4M1K7o5o1L1L3L3L3L4L1o2o7K6Q6nj15j14M4M4j2
256c61j1m3m3N0N0J9K0K0J9O0O0NNm4m3J1J2l4l4K1K1K4K4l1l1LMLMooooooooL0K9K9L0LK
251a65LLp1p1K1K2JKKKJ0J1J0J1j9j8j8j9k2k3L0K9K2l4n9L4K2l4l1K4K6k9KKj6p2qQ4O7o3
246c32j12J7J07J06j6j5J6J6J6J6l2l2j4M2L3n8n9L3L7k0o9j3K8K8k4k3J3J3QQNq7r1KR9M3
241c11j2j2qrj2j2N2mo2qJ1m6m5J0L8j7l9N4J16O0p0p0m9m9PO2J04J3o0mL7j8l9l9j5j6LN8
$$ plain form
237 -401 -323 -338 -408 -385 -302 -275 -338 -346 -314 -338 -414 -434 -365 -295 -318 -341 -315 -344 -433 -466 -449 -488 -548 -515 -389 -318 -377 -436 -381 -327 -331 -335 -263 -246 -323 -401
232 -401 -393 -330 -301 -272 -297 -377 -458 -482 -401 -319 -293 -267 -230 -249 -328 -408 -401 -394 -443 -492 -458 -425 -447 -469 -440 -411 -382 -353 -347 -342 -336 -330 -264 -198 -224 -251 -218 -185 -241
227 -241 -297 -297 -241 -220 -199 -186 -228 -274 -264 -214 -220 -283 -346 -291 -236 -279 -378 -386 -394 -406 -418 -388 -358 -457 -557 -495 -434 -428 -422 -409 -396 -439 -481 -488 -494 -501 -508 -421 -335 -340
223 -340 -346 -301 -256 -267 -277 -323 -368 -413 -458 -429 -401 -372 -343 -242 -141 -155 -261 -313 -364 -422 -479 -439 -397 -412 -426 -427 -428 -428 -429 -410 -392 -428 -465 -443 -421 -449
218 -449 -476 -455 -340 -278 -308 -370 -376 -363 -350 -324 -297 -326 -355 -321 -286 -252 -217 -231 -244 -313 -382 -352 -322 -292 -261 -197 -133 -178 -315 -395 -383 -373 -363 -338 -312
214 -312 -342 -427 -480 -441 -401 -361 -367 -373 -430 -488 -434 -324 -317 -402 -437 -380 -346 -367 -362 -301 -244 -242 -302 -362 -426 -489 -434 -378 -378 -379 -356 -334 -311 -289 -286 -283 -332 -381 -342
209 -342 -248 -212 -286 -301 -260 -277 -351 -400 -395 -385 -432 -456 -369 -286 -314 -340 -367 -401 -434 -432 -430 -428 -425 -413 -401 -444 -541 -587 -522 -405 -398 -413 -427 -410 -449 -495 -431 -401
204 -401 -427 -423 -419 -418 -417 -402 -388 -373 -359 -366 -374 -381 -389 -411 -432 -361 -290 -297 -303 -358 -413 -462 -401 -335 -381 -483 -529 -521 -512 -493 -473 -453 -433 -437 -441 -444 -448 -438 -427 -417 -407 -427 -446
$$ packed form
237d01P8j5p0K3Q3K7o3qL2k4p6k0O9P0k3k3K6k9q9l3J7l9o0L3J26P1n9n9N5N4mmP2J7p7p8
232d01QO3K9K9k5q0q1k4Q1Q2K6K6L7j9p9q0PPm9m9L4L3k2k2K9K9K9K9ONOOO6O6k6k7L3L3n6
227b41n6%N6K1K1J3m2m6J0N0oo3o3N5N5m3r9qqj2j2L0L0r9j00O2O1OOJ3J3m3m2poppQ7Q6n
223c40oM5M5j1j0m6m5m5m5K9K8K9K9J01J01j4j06n2n1n8n7M0M2j5j4jj%jJ9J8l6l7K2K2k8
218d49k7K1J15O2l0o2oJ3J3K6K7k9k9L4L5L4L5j4j3o9o9L0L0L0L1O4O4m5j37q0J2J0J0K5K6
214c12l0q5n3L9M0M0oon7n8N4J10Pq5l5N7L4k1NO1N7Ko0o0o4o3N5N6%jK3K2K3K2LLm9m9L9
209c42R4L6p4j5M1j7p4m9NJ0m7k4Q7Q3k8k6k7l4l3KKKLJ2J2m3r7m6O5J17Pj5j4J7l9m6O4L0
204d01k6MMJJJ5J4J5J4pqpqk2k1P1P1pon5n5m9O1O6m6j02m6QRJ9K0K0K0mmlmJ0J1J0J0k0j9
$$ plain form
199 -446 -428 -465 -540 -504 -465 -536 -563 -479 -399 -429 -454 -423 -430 -437 -461 -484 -508 -532 -495 -458 -422 -385 -397 -410 -422 -434 -472 -511 -542 -574 -558 -431 -355 -391 -467 -488
195 -488 -423 -414 -489 -565 -552 -538 -498 -458 -474 -489 -509 -528 -542 -556 -561 -474 -388 -393 -418 -442 -469 -496 -491 -430 -349 -359 -412 -464 -522 -580 -538 -495 -453 -410 -372 -333 -350
190 -350 -423 -490 -464 -436 -500 -538 -484 -380 -369 -452 -536 -533 -529 -519 -509 -498 -488 -440 -391 -343 -295 -355 -416 -471 -526 -583 -548 -475 -457 -525 -538 -493 -447 -465 -482 -444
186 -444 -406 -425 -444 -463 -481 -516 -551 -494 -437 -450 -464 -478 -491 -476 -461 -445 -430 -379 -328 -277 -227 -273 -319 -365 -411 -427 -443 -459 -476 -538 -600 -533 -466 -462 -457 -397
181 -397 -338 -437 -537 -507 -477 -455 -433 -466 -499 -535 -570 -550 -530 -555 -580 -549 -518 -526 -535 -593 -651 -727 -710 -615 -521 -533 -545 -557 -569 -585 -602 -526 -450 -464 -479 -493
177 -493 -507 -540 -574 -552 -529 -506 -483 -459 -436 -420 -405 -389 -373 -463 -553 -513 -473 -455 -438 -421 -403 -454 -505 -500 -496 -469 -443 -472 -502 -504 -507 -454 -402 -444 -486 -528 -570
173 -570 -557 -545 -533 -520 -526 -532 -537 -543 -553 -563 -518 -472 -518 -563 -553 -543 -530 -516 -503 -489 -535 -581 -498 -414 -399 -384 -424 -465 -523 -581 -547 -512 -501 -490 -479 -468 -454
168 -454 -440 -427 -413 -468 -524 -487 -450 -440 -429 -474 -519 -523 -528 -532 -537 -590 -642 -640 -637 -632 -628 -493 -359 -406 -452 -499 -545 -564 -583 -546 -510 -508 -506 -505 -503 -495 -486 -478 -469 -486 -502 -463
$$ packed form
199d46J8l7p5L6L9p1k7Q4Q0l0k5L1ppk4k3k4k4L7L7L6L7j2j3j2j2l8l9l1l2J6J27P6l6p6k1
195d88O5Rp5p6J3J4M0M0j6j5k0j9j4j4nQ7Q6nk5k4k7k7NO1Q1j0n3n2n8n8M2M3M2M3L8L9j7
190c50p3o7K6K8o4l8N4J04J1q3q4LMJ0J0J1J0M8M9M8M8o0o1n5n5n7L5P3J8o8j3M5M6j8j7L8
186d44L8j9j9j9j8l5l5N7N7j3j4j4j3J5J5J6J5N1N1N1N0m6m6m6m6j6j6j6j7o2o2O7O7MNO0
181c97N9r9j00L0L0K2K2l3l3l6l5K0K0k5k5L1L1qrn8n8p6J7R5R4j2j2j2j2j6j7P6P6j4j5j4
177d93j4l3l4K2K3K3K3K4K3J6J5J6J6r0r0M0M0J8J7J7J8n1n1NMK7K6k9l0klN3N2m2m2m2m2
173e70J3J2J2J3oonoj0j0M5M6m6m5J0J0J3J4J3J4m6m6Q3Q4J5J5m0m1n8n8L4L5J1J1J1J1J4
168d54J4J3J4n5n6L7L7J0J1m5m5mnmnn3n2KLNMJ35J34m7m6m7m6j9j9L7L6KKJKQRQRj7j6L9
$$ plain form
163 -463 -425 -455 -485 -516 -546 -567 -587 -552 -516 -554 -591 -573 -555 -566 -576 -531 -486 -550 -613 -584 -555 -580 -605 -574 -543 -514 -486 -457 -429 -425 -421 -417 -413 -409 -405 -401 -397 -422 -448
158 -448 -473 -498 -454 -410 -422 -434 -497 -561 -533 -504 -511 -518 -477 -436 -435 -545 -592 -640 -594 -547 -501 -455 -470 -486 -501 -516 -562 -609 -525 -442 -407 -372 -337 -302 -300 -298 -297 -295
153 -295 -343 -391 -439 -487 -507 -526 -489 -453 -428 -403 -384 -366 -361 -466 -509 -552 -538 -524 -510 -496 -482 -468 -455 -441 -456 -471 -487 -502 -504 -505 -507 -508 -521 -534 -547 -560 -495
149 -495 -429 -364 -298 -318 -338 -358 -378 -394 -410 -427 -443 -517 -591 -609 -628 -611 -595 -579 -563 -589 -614 -555 -495 -500 -617 -677 -627 -633 -639 -638 -637 -633 -628 -624 -619 -581 -543 -512 -481
144 -481 -413 -456 -506 -445 -387 -440 -423 -407 -420 -434 -448 -461 -479 -497 -515 -533 -516 -499 -575 -650 -605 -560 -508 -568 -654 -741 -706 -559 -429 -484 -557 -630 -579 -527
140 -527 -476 -424 -436 -448 -459 -471 -497 -522 -548 -574 -560 -546 -532 -518 -518 -518 -517 -517 -534 -550 -566 -583 -576 -569 -563 -556 -552 -549 -545 -541 -589 -638 -594 -549 -527 -504 -482 -459 -427 -394 -416
135 -416 -439 -524 -608 -670 -621 -576 -642 -695 -747 -736 -724 -769 -813 -741 -669 -653 -637 -679 -721 -740 -648 -563 -589 -638 -687 -639 -591 -599 -607 -633 -659 -599 -540 -443 -456 -531
131 -531 -550 -508 -466 -476 -486 -434 -382 -386 -389 -434 -479 -524 -569 -546 -524 -501 -478 -492 -505 -501 -441 -375 -420 -528 -636 -606 -575 -545 -515 -491 -468 -445 -422 -449 -477 -504
$$ packed form
163d63L8l0l0l1l0k1k0L5L6l8l7J8J8j1j0M5M5o4o3K9K9k5k5L1L1K9K8K9K8MMMMMMMMk5k6
158d48k5k5M4M4j2j2o3o4K8K9ppM1M1Jj10m7m8M6M7M6M6j5j6j5j5m6m7Q4Q3L5L5L5L5KKJK
153b95m8m8m8m8k0j9L7L6K5K5J9J8Nj05m3m3J4J4J4J4J4J4J3J4j5j5j6j5kjkjj3j3j3j3O5
149d95O6O5O6k0k0k0k0j6j6j7j6p4p4j8j9J7J6J6J6k6k5N9O0nj17o0N0ooJJMNMNL8L8L1L1
144d81O8m3n0O1N8n3J7J6j3j4j4j3j8j8j8j8J7J7p6p5M5M5N2o0q6q7L5J47J30n5p3p3N1N2
140e27N1N2j2j2j1j2k6k5k6k6J4J4J4J4%%J%j7j6j6j7PPOPMLMMm8m9M4M5K2K3K2K3L2L3k2
135d16k3q5q4o2M9M5o6n3n2J1J2m5m4P2P2J6J6m2m2j9R2Q5k6m9m9M8M8qqk6k6O0N9R7j3p5
131e31j9M2M2j0j0N2N2mlm5m5m5m5K3K2K3K3j4j3MO0O6m5j08j08L0L1L0L0K4K3K3K3k7k8k7
$$ plain form
126 -504 -532 -542 -553 -563 -573 -533 -492 -451 -411 -439 -468 -496 -524 -474 -424 -373 -323 -356 -389 -422 -455 -456 -456 -460 -464 -495 -580 -701 -710 -675 -696 -679 -662 -627 -592 -596 -543 -514
122 -514 -596 -678 -649 -549 -504 -588 -671 -665 -658 -651 -645 -637 -628 -620 -612 -618 -624 -630 -635 -606 -577 -549 -520 -486 -452 -511 -570 -571 -572 -518 -464 -451 -438 -481 -524 -488 -453 -473 -493 -476 -460 -498
116 -498 -537 -637 -736 -669 -603 -549 -494 -533 -571 -570 -568 -567 -565 -575 -585 -595 -605 -588 -570 -645 -720 -689 -658 -627 -595 -555 -514 -566 -617 -594 -571 -547 -524 -495 -466 -437 -407
112 -407 -420 -432 -445 -457 -476 -495 -515 -534 -508 -482 -456 -430 -424 -419 -506 -594 -556 -518 -536 -554 -569 -585 -600 -615 -593 -570 -547 -524 -514 -504 -494 -483 -518 -553 -588 -623
107 -623 -568 -513 -513 -513 -451 -389 -456 -523 -525 -527 -530 -532 -528 -525 -521 -517 -523 -529 -535 -541 -547 -552 -558 -564 -560 -556 -552 -548 -544 -540 -536 -532 -559 -586 -613 -640 -564 -488 -505 -521 -573 -625 -677 -729 -727 -725 -723 -721 -709 -698
101 -698 -686 -675 -646 -617 -588 -560 -510 -460 -503 -546 -535 -523 -561 -600 -640 -589 -533 -478 -437 -396 -355 -313 -320 -328 -427 -583 -677 -678 -606 -533 -531 -528 -618 -708 -721 -735 -693
97 -693 -651 -646 -640 -690 -740 -733 -725 -717 -709 -659 -608 -558 -508 -499 -490 -481 -472 -489 -506 -524 -541 -600 -658 -625 -591 -588 -584 -637 -689 -653 -618 -582 -547 -574 -600 -627 -654 -642 -629 -672 -715 -622
92 -622 -529 -528 -528 -520 -512 -505 -497 -529 -561 -592 -624 -605 -586 -567 -548 -546 -545 -543 -542 -582 -623 -657 -691 -693 -602 -532 -517 -526 -534 -546 -558 -563 -567 -572 -577 -599 -621 -606 -647 -631 -522 -417 -404
$$ packed form
126e04k8j0j1j0j0M0M1M1M0k8k9k8k8N0N0N1N0l3l3l3l3j%mml1q5j21rL5k1J7J7L5L5mN3K9
122e14q2q2K9J00M5q4q3OPPOQRQQooonK9K9K8K9L4L4n9n9jjN4N4J3J3m3m3L6L5k0k0J7J6l8
116d98l9j00r9O7O6N4N5l9l8JKJKj0j0j0j0J7J8p5p5L1L1L1L2M0M1n2n1K3K3K4K3K9K9K9L0
112d07j3j2j3j2j9j9k0j9K6K6K6K6ONq7q8L8L8j8j8j5j6j5j5K2K3K3K3J0J0J0J1l5l5l5l5
107f23N5N5%%O2O2o7o7kklkMLMMooooonooMMMMMMMMk7k7k7k7P6P6j7j6n2n2n2n2KKKKJ2J1
101f98J2J1K9K9K9K8N0N0m3m3J1J2l8l9m0N1N6N5M1M1M1M2pqr9j56r4jP2P3KLr0r0j3j4M2
97f93M2NOn0n0PQQQN0N1N0N0RRRRj7j7j8j7n9n8L3L4LMn3n2L6L5L6L5k7k6k7k7J2J3m3m3R3
92f22R3J%QQPQl2l2l1l2J9J9J9J9KJKJm0m1l4l4kR1P0J5rqj2j2nmnnk2k2J5m1J6J09J05J3
$$ plain form
86 -404 -445 -487 -534 -581 -534 -487 -495 -559 -594 -538 -506 -529 -575 -621 -670 -720 -691 -661 -632 -603 -611 -618 -626 -633 -634 -635 -635 -636 -637 -639 -640 -642 -672 -703 -727 -752 -788 -731 -671 -611 -537 -463
81 -463 -426 -481 -522 -508 -500 -547 -624 -702 -653 -604 -596 -588 -579 -571 -587 -603 -619 -635 -640 -645 -650 -655 -637 -619 -601 -582 -584 -586 -587 -589 -641 -693 -746 -798 -771 -743 -715 -688 -615 -542 -473 -496
76 -496 -559 -622 -598 -575 -575 -576 -632 -688 -647 -605 -564 -523 -493 -463 -526 -589 -637 -684 -732 -780 -795 -810 -789 -822 -838 -761 -708 -710 -690 -669 -652 -635 -618 -600 -582 -564 -533
72 -533 -501 -470 -438 -464 -489 -515 -540 -642 -744 -717 -689 -660 -630 -656 -682 -674 -666 -659 -651 -614 -576 -573 -662 -729 -703 -642 -581 -567 -553 -540 -526 -539 -551 -564 -577 -560 -542
67 -542 -525 -508 -532 -556 -577 -598 -583 -512 -410 -419 -441 -463 -491 -520 -496 -472 -447 -423 -435 -446 -475 -560 -657 -644 -572 -557 -616 -675 -646 -616 -575 -534 -547 -616 -659 -591
63 -591 -520 -559 -652 -634 -562 -545 -591 -636 -630 -623 -658 -693 -636 -578 -629 -680 -676 -671 -713 -754 -740 -726 -716 -706 -697 -687 -676 -665 -654 -642 -617 -592 -567 -542 -556 -569 -583 -597
58 -597 -625 -652 -680 -708 -692 -677 -662 -647 -699 -751 -748 -744 -775 -807 -746 -685 -686 -687 -689 -690 -665 -639 -614 -589 -624 -659 -638 -617 -602 -586 -663 -740 -720 -700 -680 -659 -637 -614 -592
53 -592 -569 -557 -545 -533 -521 -552 -582 -558 -533 -615 -696 -685 -675 -668 -662 -656 -650 -641 -633 -624 -615 -710 -805 -734 -662 -609 -556 -503 -450 -541 -632 -631 -629 -629 -628 -628 -628 -608 -589 -569 -549 -531 -512
$$ packed form
86d04m1m2m7m7M7M7qo4l5N6L2k3m6m6m9n0K9L0K9K9qpqpjj%jjkjkl0l1k4k5l6N7O0O0P4P4
81d63L7n5m1J4Qm7p7p8M9M9QQRQj6j6j6j6nnnnJ8J8J8J9kkjkn2n2n3n2K7K8K8K7P3P3O9k3
76d96o3o3K4K3%jn6n6M1M2M1M1L0L0o3o3m8m7m8m8j5j5K1l3j6P7N3kK0K1J7J7J7J8J8J8L1
72e33L2L1L2k6k5k6k5j02j02K7K8K9L0k6k6QQPQL7L8Lq9o7K6O1O1J4J4J3J4j3j2j3j3J7J8
67e42J7J7k4k4k1k1J5P1J02rk2k2k8k9K4K4K5K4j2j1k9q5r7J3P2J5n9n9K9L0M1M1j3o9m3O8
63e91P1l9r3J8P2J7m6m5OPl5l5N7N8n1n1MNm2m1J4J4J0J0RJ0J1J1J1J2K5K5K5K5j4j3j4j4
58e97k8k7k8k8J6J5J5J5n2n2LMl1l2O1O1jjkjK5K6K5K5l5l5K1K1J5J6p7p7K0K0K0K1K2K3K2
53e92K3J2J2J2J2l1l0K4K5q2q1J1J0POOORQRRr5r5P1P2N3N3N3N3r1r1JK%J%%K0J9K0K0J8J9
$$ plain form
48 -512 -494 -475 -481 -486 -398 -311 -249 -187 -125 -63 -72 -81 -183 -284 -394 -504 -521 -538 -565 -591 -525 -459 -472 -484 -497 -509 -538 -566 -594 -622 -581 -540 -498 -457 -484 -510
44 -510 -537 -563 -566 -570 -573 -576 -587 -597 -607 -618 -674 -731 -695 -604 -588 -666 -718 -716 -736 -757 -774 -791 -770 -750 -643 -536 -513 -583 -632 -625 -617 -610 -598 -587 -572 -558 -543 -528 -562
39 -562 -595 -576 -558 -621 -740 -793 -753 -712 -763 -842 -867 -813 -758 -701 -643 -623 -602 -582 -562 -574 -586 -598 -610 -610 -610 -610 -610 -624 -638 -652 -666 -644 -623 -602 -580 -619 -658
34 -658 -696 -735 -722 -708 -698 -689 -636 -639 -666 -601 -501 -457 -505 -553 -608 -662 -716 -770 -723 -676 -721 -766 -789 -811 -741 -671 -660 -648 -637 -626 -593 -560 -620 -679 -667 -655
30 -655 -698 -741 -780 -818 -801 -784 -697 -610 -578 -547 -611 -675 -650 -625 -635 -699 -785 -778 -724 -670 -615 -561 -566 -663 -760 -764 -720 -676 -626 -577 -572 -568 -564 -560 -588 -616 -645 -673 -674 -676
25 -676 -677 -678 -644 -609 -575 -540 -546 -551 -649 -747 -754 -762 -714 -666 -697 -727 -757 -787 -776 -764 -753 -649 -487 -381 -421 -553 -670 -694 -647 -600 -622 -645 -612 -580 -501 -422
21 -422 -435 -449 -535 -622 -654 -685 -677 -669 -717 -765 -764 -763 -707 -651 -650 -648 -702 -756 -707 -659 -610 -562 -601 -640 -680 -719 -752 -784 -762 -739 -729 -718 -801 -883 -905 -926 -819 -711
16 -711 -668 -625 -582 -539 -543 -548 -552 -556 -603 -649 -695 -741 -699 -658 -616 -575 -603 -630 -658 -686 -686 -686 -686 -686 -686 -686 -686 -686 -671 -657 -642 -628 -613 -599 -584 -569 -608 -646 -685 -723 -738 -753
$$ packed form
48e12J8J9onQ8Q7O2O2O2O2rrj02j01j10j10j7j7k7k6O6O6j3j2j3j2k9k8k8k8M1M1M2M1k7k6
44e10k7k6lmllj1j0j0j1n6n7L6R1J6p8n2Kk0k1j7j7K1K0J07J07K3p0m9PQPJ2J1J5J4J5J5l4
39e62l3J9J8o3j19n3M0M1n1p9k5N4N5N7N8K0K1K0K0j2j2j2j2%%%%j4j4j4j4K2K1K1K2l9l9
34f58l8l9J3J4J0RN3lk7O5J00M4m8m8n5n4n4n4M7M7m5m5k3k2P0P0J1J2J1J1L3L3o0n9J2J2
30f55m3m3l9l8J7J7Q7Q7L2L1o4o4K5K5j0o4q6PN4N4N5N4nr7r7mM4M4N0M9NMMMk8k8k9k8jk
25f76jjL4L5L4L5onr8r8pqM8M8l1l0l0l0J1J2J1J04J62J06m0j32j17k4M7M7k2k3L3L2P9P9
21d22j3j4q6q7l2l1QQm8m8JJN6N6JKn4n4M9M8M9M8l9l9m0l9l3l2K2K3J0J1q3q2k2k1J07J08
16g11M3M3M3M3mnmmm7m6m6m6M2M1M2M1k8k7k8k8%%%%%%%%J5J4J5J4J5J4J5J5l9l8l9l8j5j5
$$ plain form
11 -753 -769 -784 -772 -759 -747 -735 -715 -694 -674 -654 -612 -570 -620 -671 -661 -651 -642 -632 -581 -531 -572 -614 -633 -652 -670 -689 -666 -643 -712 -781 -739 -696 -598 -499 -457 -414
6 -414 -464 -513 -568 -622 -676 -731 -717 -704 -690 -677 -714 -751 -789 -826 -821 -817 -812 -807 -719 -631 -672 -714 -706 -698 -746 -793 -721 -648 -631 -614 -595 -577 -614 -651 -632 -614 -650 -687 -678 -668
2 -668 -711 -753 -726 -643 -627 -703 -742 -689 -638 -587 -578 -568 -614 -661 -692 -723 -754 -785 -769 -753 -737 -720 -705 -690 -675 -660 -696 -732 -768 -804 -800 -797 -794 -790 -764 -738 -711 -685 -670
-3 -670 -655 -640 -625 -652 -679 -706 -732 -758 -784 -809 -835 -817 -800 -783 -766 -705 -644 -655 -758 -815 -780 -678 -632 -695 -757 -730 -703 -723 -742 -762 -781 -775 -770 -764 -758 -767 -775 -783
-8 -783 -791 -746 -701 -656 -611 -645 -678 -712 -746 -781 -816 -852 -887 -853 -819 -785 -751 -739 -727 -715 -703 -733 -762 -792 -822 -833 -845 -857 -869 -830 -790 -751 -712 -758 -804 -850
-12 -850 -896 -900 -904 -816 -728 -681 -634 -642 -651 -642 -633 -680 -727 -721 -714 -708 -702 -705 -708 -711 -715 -686 -658 -722 -786 -798 -810 -822 -834 -826 -818 -810 -801 -793 -785 -777 -769 -725 -681 -638 -594 -657 -719 -782 -845 -823
-18 -823 -801 -780 -758 -740 -722 -703 -685 -669 -653 -693 -733 -686 -639 -684 -729 -743 -756 -714 -671 -600 -529 -551 -572 -585 -598 -612 -625 -644 -663 -682 -701 -678 -655 -631 -608
-22 -608 -645 -682 -718 -755 -766 -777 -789 -800 -788 -776 -764 -752 -775 -799 -823 -847 -821 -794 -767 -740 -727 -714 -701 -688 -674 -660 -732 -805 -818 -740 -682 -679 -700 -720 -744 -769
$$ packed form
11g53j6j5J2J3J2J2K0K1K0K0M2M2n0n1J0J0RJ0N1N0m1m2j9j9j8j9K3K3o9o9M2M3R8R9M2M3
6d14n0m9n5n4n4n5J4J3J4J3l7l7l8l7NMNNQ8Q8m1m2QQm8m7P2P3J7J7J9J8l7l7J9J8l6l7RJ0
2f68m3m2K7Q3J6p6l9N3N1N1RJ0m6m7l1l1l1l1J6J6J6J7J5J5J5J5l6l6l6l6MLLMK6K6K7K6J5
-3f70J5J5J5k7k7k7k6k6k6k5k6J8J7J7J7O1O1j1j03n7L5J02M6o3o2K7K7k0j9k0j9ONOOrqq
-8g83qM5M5M5M5l4l3l4l4l5l5l6l5L4L4L4L4J2J2J2J2l0k9l0l0j1j2j2j2L9M0L9L9m6m6m6
-12h50m6mmQ8Q8M7M7qrRRm7m7OPOOlllmK9K8o4o4j2j2j2j2QQQRQQQQM4M4M3M4o3o2o3o3K2
-18h23K2K1K2J8J8J9J8J6J6m0m0M7M7m5m5j4j3M2M3P1P1k2k1j3j3j4j3j9j9j9j9K3K3K4K3
-22f08l7l7l6l7j1j1j2j1J2J2J2J2k3k4k4k4K6K7K7K7J3J3J3J3J4J4p2p3j3P8N8Lk1k0k4k5
$$ plain form
-27 -769 -783 -797 -718 -640 -608 -577 -602 -626 -630 -634 -689 -745 -752 -704 -721 -832 -897 -870 -808 -746 -768 -791 -813 -836 -821 -805 -790 -774 -773 -771 -770 -768 -737 -705 -674 -642 -628 -614
-31 -614 -692 -770 -772 -774 -776 -778 -762 -747 -787 -826 -829 -831 -741 -651 -558 -464 -448 -524 -639 -754 -782 -810 -724 -637 -588 -631 -693 -700 -688 -676 -684 -692 -700 -708 -713 -718 -723 -729 -701 -674 -647 -620
-36 -620 -628 -635 -643 -650 -690 -730 -764 -798 -807 -722 -659 -651 -669 -688 -710 -732 -771 -809 -755 -701 -668 -635 -658 -680 -666 -653 -639 -626 -643 -659 -639 -674 -730 -693 -654 -708 -782 -764
-41 -764 -680 -652 -698 -744 -701 -658 -661 -664 -667 -671 -667 -663 -659 -655 -645 -635 -625 -616 -676 -736 -704 -672 -661 -649 -694 -738 -742 -746 -750 -755 -776 -798 -819 -841 -835 -830 -824 -818 -798 -779 -759 -739 -716 -692
-46 -692 -668 -645 -724 -803 -790 -776 -764 -752 -739 -727 -735 -743 -752 -760 -814 -868 -830 -791 -732 -673 -669 -665 -699 -733 -766 -800 -823 -846 -863 -879 -892 -794 -727 -715 -729 -743 -761 -778
-51 -778 -735 -693 -639 -697 -794 -836 -786 -736 -751 -765 -724 -683 -674 -664 -654 -644 -713 -782 -759 -735 -691 -647 -658 -669 -692 -715 -737 -760 -823 -887 -790 -694 -640 -698 -748 -799
-55 -799 -801 -803 -805 -807 -760 -713 -667 -620 -652 -684 -716 -748 -768 -788 -808 -828 -782 -736 -690 -644 -727 -810 -800 -791 -770 -749 -783 -817 -790 -763 -736 -709 -708 -708 -707 -706 -689 -671 -653 -635
-60 -635 -658 -682 -706 -730 -721 -713 -705 -697 -675 -653 -631 -609 -634 -658 -682 -706 -806 -905 -912 -919 -860 -801 -743 -684 -661 -638 -615 -592 -636 -681 -725 -769 -772 -775 -778 -780 -761 -742 -723 -704
$$ packed form
-27g69j4j4P9P8L2L1k5k4mmn5n6pM8j7j11o5K7O2O2k2k3k2k3J5J6J5J6JKJKL1L2L1L2J4J4
-31f14p8p8kkkkJ6J5m0l9lkR0R0R3R4J6p6j15j15k8k8Q6Q7M9m3o2pJ2J2qqqqnnnoK8K7K7K7
-36f20qpqpm0m0l4l4rQ5O3Qj8j9k2k2l9l8N4N4L3L3k3k2J4J3J4J3j7j6K0l5n6L7L9n4p4J8
-41g64Q4K8m6m6M3M3lllmMMMMJ0J0J0Ro0o0L2L2J1J2m5m4mmmnk1k2k1k2ONOOK0J9K0K0K3K4
-46f92K4K3p9p9J3J4J2J2J3J2qqrqn4n4L8L9N9N9MMl4l4l3l4k3k3j7j6j3R8O7J2j4j4j8j7
-51g78M3M2N4n8r7m2N0N0j5j4M1M1RJ0J0J0o9o9K3K4M4M4j1j1k3k3k2k3o3o4R7R6N4n8n0n1
-55g99kkkkM7M7M6M7l2l2l2l2k0k0k0k0M6M6M6M6q3q3J0RK1K1l4l4K7K7K7K7J%JJJ7J8J8J8
-60f35k3k4k4k4RQQQK2K2K2K2k5k4k4k4j00r9ppN9N9N8N9K3K3K3K3m4m5m4m4lllkJ9J9J9J9
$$ plain form
-65 -704 -685 -666 -647 -627 -649 -671 -692 -714 -794 -875 -826 -777 -729 -681 -634 -586 -655 -723 -792 -861 -830 -799 -768 -737 -729 -721 -713 -705 -717 -730 -743 -755 -742 -729 -661 -593 -656
-70 -656 -719 -690 -661 -732 -803 -782 -761 -790 -819 -848 -876 -858 -840 -821 -803 -800 -796 -793 -790 -779 -768 -756 -745 -814 -884 -893 -791 -707 -734 -814 -840 -837 -834 -828 -821 -829 -836 -788 -741 -762
-75 -762 -784 -806 -828 -759 -690 -620 -551 -541 -532 -522 -513 -551 -589 -626 -664 -716 -767 -763 -759 -754 -750 -801 -853 -874 -895 -916 -937 -885 -833 -837 -840 -842 -845 -791 -738 -739 -740 -796 -853 -842 -830
-80 -830 -819 -808 -811 -814 -816 -819 -823 -827 -775 -723 -741 -758 -832 -905 -858 -812 -766 -720 -746 -773 -744 -715 -739 -763 -731 -699 -692 -684 -677 -669 -728 -787 -790 -793 -817 -841 -810 -778 -785 -793 -800 -808 -794
-85 -794 -781 -823 -865 -831 -796 -762 -728 -685 -643 -656 -669 -725 -781 -782 -782 -766 -751 -735 -719 -736 -754 -771 -788 -773 -758 -742 -727 -722 -717 -711 -706 -746 -785 -770 -754 -748 -742 -736 -730 -759
-90 -759 -788 -724 -661 -653 -646 -639 -632 -639 -646 -653 -659 -728 -797 -810 -823 -817 -810 -804 -797 -802 -807 -813 -818 -803 -789 -774 -760 -714 -669 -679 -689 -688 -686 -685 -683 -709 -735 -743 -695 -633 -663 -729 -739 -658 -634 -735
-95 -735 -837 -893 -857 -817 -778 -772 -767 -761 -756 -757 -759 -763 -768 -795 -878 -925 -881 -816 -752 -737 -722 -712 -701 -746 -791 -791 -791 -846 -902 -868 -834 -800 -766 -759 -751 -744 -736 -746 -755 -764 -773 -782 -792 -801
-101 -801 -810 -836 -862 -888 -914 -857 -801 -745 -689 -720 -750 -726 -701 -676 -651 -682 -713 -709 -705 -702 -698 -721 -744 -767 -790 -777 -765 -756 -747 -758 -824 -915 -913 -821 -785 -803 -822 -803 -784
$$ packed form
-65g04J9J9J9K0k2k2k1k2q0q1M9M9M8M8M7M8o9o8o9o9L1L1L1L1QQQQj2j3j3j2J3J3O8O8o3
-70f56o3K9K9p1p1K1K1k9k9k9k8J8J8J9J8LMLLJ1J1J2J1o9p0rJ02Q4k7q0k6LLOPqpM8M7k1
-75g62k2k2k2O9O9P0O9J0RJ0Rl8l8l7l8n2n1MMNMn1n2k1k1k1k1N2N2mlklN4N3jjn6n7J1J2
-80h30J1J1llklmmN2N2j8j7p4p3M7M6M6M6k6k7K9K9k4k4L2L2PQPQn9n9llk4k4L1L2pqpqJ4
-85g94J3m2m2L4L5L4L4M3M2j3j3n6n6j%J6J5J6J6j7j8j7j7J5J5J6J5NNONm0l9J5J6OOOOk9
-90g59k9O4O3QPPPpppoo9o9j3j3OPOPnnonJ5J4J5J4M6M5j0j0JKJKk6k6qM8O2l0o6j0Q1K4j01
-95g35j02n6L6M0L9ONONjkmnk7q3m7M4O5O4J5J5J0J1m5m5%%n5n6L4L4L4L4PQPQj0rrrrj0r
-101h01rk6k6k6k6N7N6N6N6l1l0K4K5K5K5l1l1MMLMk3k3k3k3J3J2RRj1o6r1KR2L6j8j9J9J9
$$ plain form
-106 -784 -799 -759 -755 -806 -854 -846 -826 -805 -781 -757 -736 -714 -748 -782 -783 -785 -875 -966 -956 -890 -855 -821 -830 -839 -845 -851 -865 -823 -812 -801 -787 -773 -759 -745 -772 -798 -825 -851 -833
-110 -833 -814 -796 -778 -695 -613 -592 -626 -739 -852 -944 -981 -958 -934 -908 -881 -837 -793 -749 -705 -728 -751 -774 -798 -835 -872 -909 -946 -922 -899 -875 -851 -861 -870 -859
-114 -859 -793 -717 -697 -735 -773 -759 -745 -731 -717 -704 -691 -677 -664 -701 -739 -776 -813 -835 -856 -874 -892 -876 -804 -787 -826 -903 -979 -998 -961 -896 -830 -817 -803 -770 -736
-119 -736 -759 -781 -789 -798 -806 -814 -773 -731 -690 -648 -634 -620 -662 -704 -666 -629 -684 -795 -875 -862 -849 -836 -815 -794 -773 -752 -728 -704 -680 -655 -687 -718 -750 -781 -771 -761
-123 -761 -751 -741 -775 -809 -842 -876 -865 -854 -879 -850 -826 -896 -941 -930 -888 -845 -799 -752 -772 -792 -813 -833 -853 -873 -893 -913 -867 -822 -724 -719 -803 -887 -921 -955 -986
-127 -986 -1016 -1012 -915 -808 -793 -813 -778 -710 -735 -834 -933 -899 -865 -886 -908 -869 -831 -849 -866 -828 -790 -807 -825 -796 -767 -794 -820 -888 -957 -932 -908 -862 -816 -826 -836
-132 -836 -808 -781 -754 -727 -765 -804 -843 -882 -851 -821 -790 -760 -809 -859 -908 -958 -924 -890 -912 -934 -845 -756 -759 -818 -816 -722 -684 -738 -784 -775 -767 -815 -831 -792 -787 -782 -782 -782 -782
-136 -782 -783 -803 -822 -842 -862 -816 -770 -779 -844 -867 -797 -752 -763 -769 -776 -786 -796 -810 -823 -802 -836 -852 -813 -773 -789 -824 -804 -819 -833 -831 -828 -826 -824 -844 -865 -882 -899 -920 -884
$$ packed form
-106g84j5M0Mn1m8QK0K1K4K4K1K2l4l4jkr0r1J0O6L5L4rrooj4M2J1J1J4J4J4J4k7k6k7k6J8
-110h33J9J8J8Q3Q2K1l4j13j13r2l7K3K4K6K7M4M4M4M4k3k3k3k4l7l7l7l7K4K3K4K4j0rJ1
-114h59O6P6K0l8l8J4J4J4J4J3J3J4J3l7l8l7l7k2k1j8j8J6P2J7l9p7p6j9L7O5O6J3J4L3L4
-119g36k3k2qrqqM1M2M1M2J4J4m2m2L8L7n5j11q0J3J3J3K1K1K1K1K4K4K4K5l2l1l2l1J0J0
-123g61J0J0l4l4l3l4J1J1k5K9K4p0m5J1M2M3M6M7k0k0k1k0k0k0k0k0M6M5R8Nq4q4l4l4l1
-127i86l0MR7J07J5k0L5O8k5r9r9L4L4k1k2L9L8j8j7L8L8j7j8K9K9k7k6o8o9K5K4M6M6j0j0
-132h36K8K7K7K7l8l9l9l9L1L0L1L0m9n0m9n0L4L4k2k2Q9Q9ln9KR4L8n4m6RQm8j6L9NN%%%
-136g82jk0j9k0k0M6M6ro5k3P0M5j1opj0j0j4j3K1l4j6L9M0j6l5K0j5j4KLKKk0k1j7j7k1L6
$$ plain form
-141 -884 -877 -869 -851 -777 -704 -686 -734 -783 -831 -880 -881 -826 -807 -787 -804 -877 -919 -961 -946 -931 -913 -894 -905 -860 -794 -821 -843 -865 -893 -921 -916 -912 -877 -896 -912 -927 -942
-146 -942 -958 -981 -949 -856 -763 -782 -801 -765 -728 -727 -726 -756 -731 -734 -736 -735 -734 -752 -769 -818 -812 -795 -778 -757 -737 -754 -770 -752 -790 -804 -763 -756 -750 -730 -710 -659 -664 -731 -797 -844
-151 -844 -834 -781 -729 -765 -801 -796 -790 -785 -779 -816 -852 -850 -903 -957 -900 -839 -889 -951 -902 -799 -751 -793 -836 -826 -816 -871 -927 -889 -852 -831 -809 -788 -767 -767 -767 -767 -767 -790 -813
-155 -813 -836 -859 -867 -874 -882 -890 -898 -906 -914 -922 -916 -909 -902 -895 -889 -882 -875 -868 -870 -872 -873 -875 -871 -867 -863 -858 -882 -905 -835 -766 -756 -745 -791 -836 -844 -852 -805 -757 -811 -864 -825 -785 -784 -783 -781 -780 -773 -765 -758 -751 -737 -723
-162 -723 -710 -696 -724 -751 -779 -807 -790 -774 -757 -740 -789 -839 -795 -752 -762 -772 -782 -791 -819 -846 -873 -900 -881 -861 -842 -823 -835 -848 -861 -874 -814 -753 -693 -632 -669
-166 -669 -705 -742 -779 -776 -773 -770 -767 -787 -807 -827 -847 -835 -823 -811 -800 -838 -877 -916 -955 -939 -922 -905 -888 -872 -855 -838 -822 -829 -836 -843 -851 -838 -826 -814 -801 -850 -899 -856 -812
-171 -812 -757 -702 -702 -703 -746 -790 -834 -877 -870 -863 -856 -849 -838 -827 -760 -693 -632 -571 -640 -709 -766 -824 -826 -828 -850 -872 -893 -915 -966 -1018 -976 -935 -892 -848 -805 -761 -775 -788 -749
-176 -749 -711 -773 -890 -963 -906 -825 -837 -912 -932 -876 -819 -852 -885 -901 -917 -878 -838 -867 -896 -888 -787 -694 -657 -712 -767 -758 -750 -797 -844 -887 -929 -843 -756 -717 -678
$$ packed form
-141h84PQJ8P4P3J8m8m9m8m9jN5J9K0j7p3m2m2J5J5J8J9j1M5O6k7k2k2k8k8NML5j9j6j5j5
-146i42j6k3L2R3R3j9j9L6L7JJl0K5lkJJj8j7m9OJ7J7K1K0j7j6J8l8j4M1POK0K0N1no7o6m7
-151h44J0N3N2l6l6NONOl7l6Kn3n4N7O1n0o2M9J03M8m2m3J0J0n5n6L8L7K1K2K1K1%%%%k3k3
-155h13k3k3qpqqqqqqOPPPOPPPkkjkMMMNk4k3P0O9J0J1m6m5qqM7M8n4n3L9M0JJKJPQPPJ4J4
-162g23J3J4k8k7k8k8J7J6J7J7m9n0M4M3j0j0j0rk8k7k7k7J9K0J9J9j2j3j3j3O0O1O0O1l7
-166f69l6l7l7LLLLk0k0k0k0J2J2J2J1l8l9l9l9J6J7J7J7J6J7J7J6pppqJ3J2J2J3m9m9M3M4
-171h12N5N5%jm3m4m4m3PPPPJ1J1O7O7O1O1o9o9n7n8kkk2k2k1k2n1n2M2M1M3M4M3M4j4j3L9
-176g49L8o2j17p3N7Q1j2p5k0N6N7l3l3j6j6L9M0k9k9QJ01R3L7n5n5RQm7m7m3m2Q6Q7L9L9
$$ plain form
-180 -678 -731 -784 -835 -885 -936 -987 -946 -905 -864 -823 -829 -835 -841 -846 -852 -858 -864 -869 -859 -849 -839 -829 -833 -836 -837 -837 -822 -751 -660 -661 -700 -740 -785 -830 -871 -912 -897 -883 -910 -937 -875
-185 -875 -813 -817 -876 -904 -932 -935 -938 -851 -765 -727 -744 -785 -827 -829 -832 -834 -836 -892 -948 -946 -889 -829 -825 -821 -762 -740 -773 -772 -771 -773 -775 -781 -787 -760 -788 -789 -790 -753 -771 -847 -923 -931 -883 -815
-190 -815 -840 -899 -958 -930 -902 -867 -832 -797 -762 -781 -800 -819 -838 -877 -916 -955 -994 -963 -933 -902 -872 -854 -836 -818 -800 -796 -792 -792 -791 -786 -836 -886 -880 -868 -856 -840 -824 -828
-195 -828 -833 -837 -841 -796 -751 -726 -757 -820 -827 -742 -658 -648 -693 -707 -721 -739 -757 -775 -792 -810 -828 -846 -864 -872 -880 -889 -897 -842 -787 -732 -676 -775 -873 -916 -958 -946 -933 -847 -706
-200 -706 -624 -652 -757 -806 -817 -828 -835 -843 -801 -759 -828 -897 -955 -1012 -1014 -1016 -1032 -1048 -1009 -970 -958 -946 -935 -923 -902 -881 -860 -838 -859 -879 -900 -920 -915 -910 -905 -900 -908 -917 -926 -935
-205 -935 -938 -942 -945 -949 -952 -956 -959 -963 -944 -924 -905 -885 -904 -923 -886 -850 -809 -769 -840 -911 -925 -939 -842 -745 -697 -648 -711 -773 -780 -787 -794 -801 -827 -854 -880 -907 -846 -784 -723 -662 -695
-210 -695 -728 -762 -795 -770 -746 -721 -697 -772 -847 -811 -776 -736 -697 -769 -840 -855 -869 -828 -787 -742 -698 -709 -719 -747 -774 -857 -940 -935 -930 -925 -920 -894 -868 -843 -817 -833 -849
-214 -849 -865 -881 -879 -876 -874 -871 -853 -834 -816 -797 -762 -726 -802 -878 -914 -951 -987 -1024 -977 -930 -883 -836 -813 -789 -765 -742 -761 -780 -799 -818 -814 -810 -806 -801 -788 -775 -762 -749 -831
$$ packed form
-180f78n3n3n1n0n1n1M1M1M1M1ooonooonJ0J0J0J0mlj%J5P1R1jl9m0m5m5m1m1J5J4k7k7O2
-185h75O2mn9k8k8llQ7Q6L8j7m1m2klkkn6n6KN7O0MMN9K2l3JJkkooK7k8jjL7j8p6p6qM8O8
-190h15k5n9n9K8K8L5L5L5L5j9j9j9j9l9l9l9l9L1L0L1L0J8J8J8J8MM%JNn0n0OJ2J2J6J6m
-195h28nmmM5M5K5l1o3pQ5Q4J0m5j4j4j8j8j8j7j8j8j8j8qqrqN5N5N5N6r9r8m3m2J2J3Q6J41
-200g06Q2k8j05m9j1j1pqM2M2o9o9n8n7kkj6j6L9L9J2J2J1J2K1K1K1K2k1k0k1k0NNNNqrrr
-205i35lmlmlmlmJ9K0J9K0j9j9L7L6M1M0p1p1j4j4R7R7M8M9o3o2ppppk6k7k6k7O1O2O1O1l3
-210f95l3l4l3K5K4K5K4p5p5L6L5M0L9p2p1j5j4M1M1M5M4j1j0k8k7q3q3NNNNK6K6K5K6j6j6
-214h49j6j6KLKLJ8J9J8J9L5L6p6p6l6l7l6l7M7M7M7M7K3K4K4K3j9j9j9j9MMMNJ3J3J3J3q2
$$ plain form
-219 -831 -913 -884 -854 -889 -924 -963 -1001 -1002 -1058 -1145 -1121 -1032 -944 -960 -975 -952 -928 -905 -881 -886 -891 -897 -902 -865 -829 -793 -756 -776 -796 -815 -835 -855 -874 -894 -914 -924 -934
-223 -934 -944 -955 -965 -975 -986 -996 -958 -919 -881 -843 -736 -630 -639 -759 -818 -765 -696 -681 -747 -812 -826 -839 -914 -988 -951 -914 -930 -945 -905 -864 -823 -781 -795 -809
-228 -809 -839 -869 -881 -838 -802 -876 -950 -913 -913 -969 -1018 -1011 -923 -836 -837 -838 -833 -827 -766 -705 -691 -676 -662 -647 -661 -676 -690 -704 -689 -673 -657 -641 -719 -796 -782 -767 -759 -751 -744
-232 -744 -736 -745 -755 -765 -774 -812 -850 -887 -925 -912 -899 -830 -762 -725 -688 -744 -800 -769 -738 -762 -787 -802 -817 -832 -847 -920 -993 -1029 -972 -841 -766 -782 -799 -792 -784 -777 -769 -758
-237 -758 -748 -737 -726 -766 -805 -845 -885 -884 -882 -880 -878 -900 -921 -943 -964 -921 -878 -835 -792 -836 -881 -926 -970 -959 -947 -936 -925 -862 -800 -738 -676 -702 -729 -755 -781 -766 -751
-241 -751 -735 -720 -736 -751 -766 -782 -811 -840 -869 -899 -882 -866 -850 -834 -860 -885 -911 -936 -943 -951 -958 -965 -986 -1007 -1029 -1050 -1029 -1008 -987 -966 -945 -924 -903 -882 -882 -881 -881 -880 -853
-246 -853 -826 -799 -772 -766 -761 -847 -934 -955 -976 -941 -907 -920 -933 -891 -849 -836 -822 -865 -907 -881 -856 -831 -805 -806 -807 -808 -809 -838 -867 -896 -925 -921 -918 -914 -911 -924 -937 -950 -964 -908
-251 -908 -851 -795 -739 -758 -776 -795 -813 -774 -734 -750 -767 -765 -763 -854 -945 -972 -998 -969 -939 -918 -897 -931 -966 -892 -819 -802 -784 -805 -826 -848 -869 -880 -890 -901 -912 -928
$$ packed form
-219h31q2K9L0l5l5l9l8jn6q7K4Q9Q8j6j5K3K4K3K4nnonL7L6L6L7k0k0j9k0k0j9k0k0j0j0
-223i34j0j1j0j0j1j0L8L9L8L8J07J06rj20n9N3O9J5o6o5j4j3p5p4L7L7j6j5M0M1M1M2j4j4
-228h09l0l0j2M3L6p4p4L7%n6m9PQ8Q7jjNOO1O1J4J5J4J5j4j5j4j4J5J6J6J6p8p7J4J5QQP
-232g44Qrj0j0rl8l8l7l8J3J3O9O8L7L7n6n6L1L1k4k5j5j5j5j5p3p3l6N7J31P5j6j7PQPQJ1
-237g58J0J1J1m0l9m0m0JKKKk2k1k2k1M3M3M3M3m4m5m5m4J1J2J1J1O3O2O2O2k6k7k6k6J5J5
-241g51J6J5j6j5j5j6k9k9k9l0J7J6J6J6k6k5k6k5pqppk1k1k2k1K1K1K1K1K1K1K1K1%J%JK7
-246h53K7K7K7ONq6q7k1k1L5L4j3j3M2M2J3J4m3m2K6K5K5K6jjjjk9k9k9k9MLMLj3j3j3j4N6
-251i08N7N6N6j9j8j9j8L9M0j6j7KKr1r1k7k6K9L0K1K1l4l5P4P3J7J8k1k1k2k1j1j0j1j1j6
$$ plain form
-256 -928 -945 -955 -966 -965 -871 -778 -777 -788 -799 -816 -833 -850 -866 -883 -900 -873 -846 -820 -793 -835 -878 -920 -963 -921 -878 -836 -793 -867 -940 -957 -975 -907 -839 -864 -889 -894
-260 -894 -899 -904 -909 -880 -851 -878 -905 -948 -991 -1034 -1077 -1069 -1061 -997 -934 -947 -959 -917 -874 -881 -888 -896 -903 -907 -910 -914 -918 -896 -874 -852 -829 -855 -880 -905 -930 -948 -966 -928 -891 -853 -816
-265 -816 -834 -852 -879 -907 -934 -962 -995 -1028 -1006 -984 -949 -914 -934 -954 -895 -835 -831 -827 -837 -846 -856 -865 -892 -918 -945 -972 -951 -930 -909 -888 -862 -837 -867 -897 -953 -1010 -974
-269 -974 -938 -934 -930 -927 -923 -946 -970 -993 -1016 -964 -912 -861 -809 -875 -941 -914 -888 -856 -823 -884 -944 -994 -1043 -1000 -958 -941 -925 -964 -1004 -979 -955 -930 -905 -884 -863 -842 -821
-274 -821 -849 -877 -905 -933 -898 -862 -882 -902 -882 -862 -841 -821 -855 -890 -924 -958 -941 -923 -906 -889 -855 -820 -786 -751 -739 -726 -806 -886 -913 -939 -911 -882 -887 -892 -897 -902 -917
-279 -917 -932 -948 -963 -945 -926 -908 -890 -889 -888 -888 -887 -867 -847 -883 -919 -926 -932 -884 -835 -885 -935 -892 -850 -856 -862 -868 -874 -859 -844 -829 -814 -810 -805 -801 -796 -799 -802 -749 -697 -744 -792 -840 -888
-284 -888 -887 -886 -885 -885 -901 -918 -879 -840 -871 -902 -933 -964 -937 -910 -883 -856 -904 -951 -942 -934 -997 -1060 -994 -928 -946 -965 -983 -1001 -948 -894 -896 -898 -906 -913 -921 -928 -916 -904 -892 -880 -867
-289 -867 -853 -840 -827 -901 -976 -958 -940 -983 -1026 -977 -928 -916 -905 -894 -883 -803 -723 -735 -747 -783 -819 -854 -890 -892 -894 -841 -787 -826 -864 -902 -940 -963 -987 -1010 -1034 -1090
$$ packed form
-256i28j7j0j1JR4R3Jj1j1j7j7j7j6j7j7K7K7K6K7m2m3m2m3M2M3M2M3p4p3j7j8O8O8k5k5n
-260h94nnnK9K9k7k7m3m3m3m3QQO4O3j3j2M2M3ppqpmlmmK2K2K2K3k6k5k5k5j8j8L8L7L8L7
-265h16j8j8k7k8k7k8l3l3K2K2L5L5k0k0N9O0MMj0rj0rk7k6k7k7K1K1K1K1K6K5l0l0n6n7L6
-269i74L6MMLMk3k4k3k3N2N2N1N2o6o6K7K6L2L3o1o0n0m9M3M2J7J6l9m0K5K4K5K5K1K1K1K1
-274h21k8k8k8k8L5L6k0k0K0K0K1K0l4l5l4l4J7J8J7J7L4L5L4L5J2J3q0q0k7k6K8K9nnnnj5
-279i17j5j6j5J8J9J8J8JJ%JK0K0l6l6poM8M9n0n0M3M2ooooJ5J5J5J5MNMNllN3N2m7m8m8m8
-284h88JJJ%j6j7L9L9l1l1l1l1K7K7K7K7m8m7RQo3o3O6O6j8j9j8j8N3N4kkqpqpJ2J2J2J2J3
-289h67J4J3J3p4p5J8J8m3m3M9M9J2J1J1J1Q0Q0j2j2l6l6l5l6kkN3N4l9l8l8l8k3k4k3k4n6
$$ plain form
-293 -1090 -1146 -1109 -1073 -1009 -945 -936 -927 -914 -901 -888 -874 -906 -939 -971 -1003 -1015 -1028 -985 -942 -937 -933 -928 -924 -943 -963 -928 -892 -913 -933 -898 -864 -902 -940 -978 -1016 -944 -872
-298 -872 -856 -840 -880 -921 -906 -891 -914 -938 -906 -873 -892 -911 -930 -949 -936 -924 -911 -899 -959 -1019 -950 -881 -874 -867 -860 -853 -838 -823 -808 -793 -823 -854 -885 -915 -946 -977 -1007
-302 -1007 -1038 -994 -949 -905 -860 -854 -847 -841 -835 -893 -951 -954 -957 -946 -935 -924 -913 -919 -926 -878 -829 -875 -921 -967 -1014 -917 -820 -779 -737 -786 -835 -884 -933 -926 -920 -859 -797 -858 -919
-307 -919 -925 -930 -955 -979 -1004 -1029 -1085 -1141 -1136 -1021 -889 -868 -944 -1020 -1033 -1046 -1060 -1073 -1047 -1020 -994 -968 -972 -977 -926 -876 -872 -868 -864 -860 -891 -922 -1008 -1094 -1071 -1048 -1024 -1001
-312 -1001 -982 -962 -942 -922 -933 -943 -954 -965 -1026 -1087 -1093 -1099 -1106 -1112 -1064 -1015 -979 -944 -909 -874 -891 -907 -923 -940 -911 -882 -854 -825 -884 -942 -946 -949 -955 -960 -910 -860 -873 -885
-316 -885 -898 -910 -930 -949 -969 -988 -1020 -1051 -1027 -1003 -952 -901 -906 -911 -859 -807 -848 -888 -922 -956 -989 -1023 -986 -950 -913 -876 -902 -927 -897 -868 -809 -750 -821 -892 -940 -989
-321 -989 -982 -976 -958 -940 -923 -905 -913 -920 -928 -936 -961 -986 -956 -925 -925 -924 -869 -813 -839 -866 -893 -919 -943 -968 -994 -928 -849 -863 -948 -1033 -1027 -1022 -1017 -1012 -959 -906 -908 -910 -945 -980 -959 -938
-326 -938 -928 -917 -907 -896 -863 -829 -888 -947 -960 -972 -984 -996 -1004 -1011 -1019 -1027 -989 -952 -970 -988 -988 -989 -990 -990 -960 -931 -901 -871 -893 -914 -935 -956 -956 -956 -956 -956 -960 -963 -967 -971 -946 -921 -952
$$ packed form
-293a090n6L7L6O4O4RRJ3J3J3J4l2l3l2l2j2j3M3M3NMNMj9k0L5L6k1k0L5L4l8l8l8l8P2P2
-298h72J6J6m0m1J5J5k3k4L2L3j9j9j9j9J3J2J3J2o0o0O9O9PPPPJ5J5J5J5l0l1l1l0l1l1l0
-302a007l1M4M5M4M5OPOOn8n8llJ1J1J1J1opM8M9m6m6m6m7R7R7M1M2m9m9m9m9POO1O2o1o1
-307i19onk5k4k5k5n6n6NJ15J32K1p6p6j3j3j4j3K6K7K6K6mnN1N0MMMMl1l1q6q6K3K3K4K3
-312a001J9K0K0K0j1j0j1j1o1o1oopoM8M9L6L5L5L5j7j6j6j7K9K9K8K9n9n8mlonN0N0j3j2
-316h85j3j2k0j9k0j9l2l1K4K4N1N1nnN2N2m1m0l4l4l3l4L7L6L7L7k6k5L0K9N9N9p1p1m8m9
-321i89POJ8J8J7J8qpqqk5k5L0L1%JN5N6k6k7k7k6k4k5k6O6P9j4q5q5ONNNN3N3kkl5l5K1K1
-326i38J0J1J0J1L3L4n9n9j3j2j2j2qpqqL8L7j8j8%jj%L0K9L0L0k2k1k1k1%%%%mlmmK5K5l1
$$ plain form
-331 -952 -983 -934 -885 -892 -899 -976 -1052 -1074 -1095 -1021 -946 -964 -982 -995 -1008 -1021 -1034 -1005 -975 -896 -816 -773 -822 -976 -1075 -1077 -1025 -1000 -975 -995 -1016 -1037 -1058 -972 -885 -891
-336 -891 -952 -1001 -957 -876 -796 -796 -796 -796 -796 -821 -846 -926 -1007 -1012 -1017 -967 -917 -911 -905 -954 -1003 -1013 -1023 -977 -932 -863 -795 -819 -843 -875 -907 -883 -860 -886 -912 -938 -965 -977 -989
-340 -989 -1002 -1014 -985 -956 -982 -1009 -968 -927 -887 -846 -800 -753 -799 -845 -890 -935 -980 -1025 -983 -941 -900 -858 -797 -735 -766 -797 -836 -875 -914 -953 -960 -966 -973 -979 -939 -898 -913
-345 -913 -928 -916 -903 -890 -878 -841 -803 -822 -840 -872 -904 -881 -857 -886 -916 -945 -974 -1002 -1030 -1002 -975 -926 -878 -885 -892 -885 -877 -924 -972 -985 -999 -1012 -1025 -973 -920 -960 -1000
-349 -1000 -915 -829 -837 -844 -871 -898 -925 -951 -974 -997 -965 -932 -903 -874 -901 -927 -887 -846 -861 -877 -918 -960 -946 -933 -948 -963 -979 -994 -990 -985 -926 -866 -824 -782 -796 -809
-354 -809 -820 -830 -895 -961 -1023 -1085 -1036 -987 -866 -745 -736 -726 -764 -802 -896 -989 -1039 -1089 -1083 -1078 -1108 -1138 -1168 -1198 -1155 -1112 -1069 -1027 -1037 -1048 -1059 -1069 -1018 -966 -1025
-358 -1025 -1084 -1100 -1115 -1130 -1146 -1093 -1040 -987 -934 -931 -928 -980 -1032 -1082 -1133 -1073 -1013 -977 -940 -903 -866 -920 -973 -1027 -1080 -1064 -1048 -1032 -1016 -977 -938 -899 -860 -905 -949
-362 -949 -993 -1038 -1031 -1025 -1018 -1012 -1043 -1074 -1105 -1136 -1116 -1097 -1077 -1057 -1036 -1015 -993 -972 -983 -994 -1005 -1016 -980 -944 -908 -871 -904 -937 -970 -1003 -984 -966 -947 -928 -978 -1028 -1079
$$ packed form
-331i52l1M9M9ppp7p6k2k1P4P5j8j8j3j3j3j3K9L0P9Q0M3m9j54r9kN2K5K5k0k1k1k1Q6Q7o
-336h91o1m9M4Q1Q0%%%%k5k5q0q1nnN0N0OOm9m9j0j0M6M5O9O8k4k4l2l2K4K3k6k6k6k7j2j2
-340i89j3j2K9K9k6k7M1M1M0M1M6M7m6m6m5m5m5m5M2M2M1M2O1O2l1l1l9l9l9l9popoM0M1j5
-345i13j5J2J3J3J2L7L8j9j8l2l2K3K4k9l0k9k9k8k8K8K7M9M8ppPQm7m8j3j4j3j3N2N3m0m0
-349a000Q5Q6qpk7k7k7k6k3k3L2L3K9K9k7k6M0M1j5j6m1m2J4J3j5j5j6j5MNN9O0M2M2j4j3
-354h09j1j0o5o6o2o2M9M9J21J21RJ0l8l8r4r3n0n0ONl0l0l0l0M3M3M3M2j0j1j1j0N1N2n9
-358a025n9j6j5j5j6N3N3N3N3LLn2n2n0n1O0O0L6L7L7L7n4n3n4n3J6J6J6J6L9L9L9L9m5m4
-362i49m4m5POPOl1l1l1l1K0J9K0K0K1K1K2K1j1j1j1j1L6L6L6L7l3l3l3l3J9J8J9J9n0n0n1
$$ plain form
-367 -1079 -1129 -1106 -1082 -1058 -1035 -1001 -967 -988 -1010 -942 -874 -917 -960 -967 -974 -982 -989 -982 -975 -969 -962 -955 -949 -942 -935 -938 -941 -944 -947 -949 -952 -955 -958 -944 -930 -917 -903 -890 -876 -862 -849 -864 -880 -895
-372 -895 -911 -894 -877 -861 -844 -892 -940 -989 -1037 -1026 -1016 -949 -883 -867 -852 -947 -1042 -1092 -1142 -1081 -1020 -1029 -1038 -1047 -1056 -1044 -1032 -1020 -1007 -994 -981 -968 -955 -942 -929 -916 -903
-377 -903 -940 -978 -1015 -1052 -1002 -952 -901 -851 -885 -920 -954 -989 -954 -919 -884 -849 -846 -843 -840 -836 -958 -1080 -1072 -972 -916 -916 -935 -953 -956 -958 -961 -963 -978 -993 -1008 -1023 -1021 -1019 -1016 -1014
-382 -1014 -1056 -1097 -1083 -1070 -998 -926 -966 -1005 -1010 -1016 -966 -916 -934 -952 -971 -989 -929 -869 -862 -948 -1030 -1020 -957 -893 -922 -950 -923 -897 -900 -903 -906 -909 -853 -798 -834 -871 -901 -931
-386 -931 -905 -879 -899 -918 -937 -956 -949 -941 -934 -926 -926 -926 -926 -926 -888 -850 -904 -958 -960 -962 -963 -965 -959 -952 -946 -939 -937 -936 -934 -932 -892 -852 -904 -957 -962 -968 -974 -979 -977 -974 -972 -969 -947 -925 -903 -881 -873 -865 -857 -849 -873
-392 -873 -896 -920 -943 -935 -926 -917 -909 -930 -952 -974 -995 -957 -919 -880 -842 -845 -848 -852 -855 -858 -861 -864 -868 -867 -865 -864 -863 -810 -757 -796 -836 -865 -894 -923 -952 -933 -914 -894 -875 -907 -939 -915 -892
-398 -892 -951 -1011 -978 -945 -967 -988 -1009 -1031 -1047 -1062 -1078 -1094 -1053 -1013 -973 -933 -934 -936 -937 -939 -929 -919 -908 -898 -888 -878 -868 -858 -848 -839 -829 -820 -895 -969 -952 -934 -909 -883
-402 -883 -858 -832 -889 -946 -1002 -1059 -1037 -1015 -992 -970 -971 -972 -973 -974 -987 -1001 -1014 -1027 -1041 -1054 -1068 -1081 -1080 -1078 -1077 -1076 -1083 -1089 -1096 -1103 -1141 -1179 -1124 -1069 -997 -925 -945 -966 -1011 -1056 -1046
$$ packed form
-367a079n0K3K4K4K3L4L4k1k2O8O8m3m3ppqpPPOPPOPPllllklllJ4J4J3J4J3J4J4J3j5j6j5
-372h95j6J7J7J6J7m8m8m9m8J1J0O7O6J6J5r5r5n0n0O1O1rrrrJ2J2J2J3J3J3J3J3J3J3J3J3
-377i03l7l8l7l7N0N0N1N0l4l5l4l5L5L5L5L5LLLMj22j22QJ00N6%j9j8lklkj5j5j5j5KKLK
-382a014m2m1J4J3P2P2m0l9noN0N0j8j8j9j8O0O0Pq6q2J0O3O4k9k8K7K6llllN6N5l6l7l0l0
-386i31K6K6k0j9j9j9PQPQ%%%%L8L8n4n4kkjkOPOPKJKKM0M0n2n3noonKLKLK2K2K2K2QQQQk4
-392h73k3k4k3QRRQk1k2k2k1L8L8L9L8llmllllmJKJJN3N3l9m0k9k9k9k9J9J9K0J9l2l2K4K3
-398h92n9o0L3L3k2k1k1k2j6j5j6j6M1M0M0M0jkjkJ0J0J1J0J0J0J0J0J0RJ0Rp5p4J7J8K5K6
-402h83K5K6n7n7n6n7K2K2K3K2jjjjj3j4j3j3j4j3j4j3JKJJpoppl8l8N5N5P2P2k0k1m5m5J0
$$ plain form
-407 -1046 -1036 -1061 -1087 -1057 -1027 -1000 -973 -946 -919 -972 -1026 -988 -949 -954 -959 -964 -969 -994 -1018 -950 -883 -933 -984 -979 -974 -944 -913 -883 -853 -823 -794 -764 -735 -747 -759 -771 -783
-412 -783 -817 -850 -884 -917 -909 -901 -893 -885 -870 -855 -840 -825 -860 -896 -932 -968 -948 -928 -908 -889 -916 -944 -972 -999 -936 -872 -901 -929 -920 -911 -901 -892 -883 -874 -865 -857 -889 -922 -955 -988
-417 -988 -1006 -1023 -1041 -1059 -1053 -1048 -1043 -1037 -1021 -1006 -990 -974 -944 -915 -885 -855 -853 -850 -847 -844 -876 -908 -940 -972 -1001 -1029 -947 -864 -854 -845 -891 -936 -990 -1044 -1098 -1152 -1131 -1109 -1088
-422 -1088 -1067 -1042 -1018 -993 -969 -995 -1022 -1048 -1075 -1065 -1056 -1046 -1037 -1028 -1018 -1009 -1000 -991 -983 -975 -967 -978 -990 -1001 -1013 -1033 -1053 -1018 -982 -909 -835 -873 -910 -973 -1036 -987 -939 -974 -1009
-426 -1009 -992 -975 -996 -1074 -1120 -1074 -924 -831 -854 -932 -981 -1029 -1026 -1022 -1020 -1017 -1015 -1013 -1001 -990 -978 -967 -978 -990 -1001 -1013 -1012 -1010 -1009 -1007 -985 -963 -941 -919 -966 -1013 -1006 -905 -780
-431 -780 -711 -755 -855 -944 -977 -935 -892 -892 -892 -948 -1003 -1004 -1004 -1060 -1116 -1117 -1119 -1065 -1011 -1017 -1023 -918 -812 -798 -783 -823 -864 -937 -1011 -974 -937 -911 -886 -860 -835 -899 -963
-436 -963 -971 -980 -1018 -1057 -1022 -931 -922 -1006 -1086 -1074 -1062 -1050 -1032 -1014 -1022 -1030 -1039 -1047 -1032 -1017 -1002 -987 -955 -924 -892 -861 -889 -918 -946 -975 -988 -1000 -1013 -1026 -1019 -1012 -1005 -998 -970 -942
-441 -942 -969 -997 -1059 -1122 -1073 -1024 -975 -926 -932 -938 -941 -944 -891 -838 -834 -830 -882 -933 -980 -1027 -963 -899 -915 -931 -948 -964 -950 -936 -922 -909 -917 -926 -935 -943 -949 -954 -959 -964 -1019 -1073 -1127 -1088
$$ packed form
-407a046J0k5k6L0L0K7K7K7K7n3n4L8L9nnnnk5k4O8O7n0n1NNL0L1L0L0L0K9L0K9j2j2j2j2
-412g83l4l3l4l3QQQQJ5J5J5J5l5l6l6l6K0K0K0J9k7k8k8k7O3O4k9k8RRJ0RRRRQl2l3l3l3
-417i88j8j7j8j8ONNOJ6J5J6J6L0K9L0L0KLLLl2l2l2l2k9k8Q2Q3J0Rm6m5n4n4n4n4K1K2K1
-422a088K1K5K4K5K4k6k7k6k7J0RJ0RRJ0RRRQQQj1j2j1j2k0k0L5L6P3P4l8l7o3o3M9M8l5l5
-426a009J7J7k1p8m6M6J50R3k3p8m9m8LMKLKKJ2J1J2J1j1j2j1j2JKJKK2K2K2K2m7m7PJ01J25
-431g80O9m4j00q9l3M2M3%%n6n5j%n6n6jkN4N4ooJ05J06J4J5m0m1p3p4L7L7K6K5K6K5o4o4
-436i63qrl8l9L5R1Rq4q0J2J2J2J8J8qqrqJ5J5J5J5L2L1L2L1k8k9k8k9j3j2j3j3PPPPK8K8
-441i42k7k8o2o3M9M9M9M9oollN3N3MMn2n1m7m7O4O4j6j6j7j6J4J4J4J3qrrqonnnn5n4n4L9
$$ plain form
-446 -1088 -998 -963 -1002 -1041 -1030 -1019 -1007 -996 -1006 -1015 -1025 -1034 -1006 -977 -949 -920 -933 -946 -959 -972 -948 -925 -901 -877 -922 -968 -1013 -1059 -1003 -947 -890 -834 -863 -893 -922
-450 -922 -951 -1052 -1152 -1068 -984 -848 -713 -763 -812 -848 -884 -919 -955 -945 -934 -924 -913 -958 -1003 -938 -872 -882 -892 -903 -913 -927 -941 -955 -969 -997 -1024 -1052 -1080
-454 -1080 -1025 -971 -916 -862 -858 -855 -851 -847 -876 -904 -933 -961 -990 -1018 -1047 -1075 -1038 -1001 -963 -926 -930 -935 -939 -943 -943 -942 -942 -941 -917 -894 -870 -846 -852 -857 -863 -868 -922 -976 -919 -862 -875 -888
-459 -888 -901 -913 -951 -990 -1028 -1066 -1061 -1056 -1051 -1046 -1041 -1036 -1031 -1026 -1009 -991 -973 -956 -938 -920 -903 -885 -893 -901 -909 -917 -902 -887 -872 -857 -907 -957 -1007 -1057 -1037 -1018 -999 -979 -990 -1001 -1012
-464 -1012 -1023 -1011 -999 -986 -974 -975 -975 -976 -976 -991 -1005 -1020 -1034 -1073 -1112 -1151 -1191 -1114 -1038 -961 -885 -922 -959 -997 -1034 -1021 -1007 -994 -980 -954 -927 -901 -874 -926 -978 -1031
-469 -1031 -1083 -1098 -1113 -1128 -1143 -1098 -1053 -1008 -963 -954 -944 -935 -926 -947 -967 -988 -1009 -982 -956 -1040 -1124 -1132 -1140 -1149 -1157 -1167 -1177 -1187 -1197 -1156 -1115 -1075 -1034 -1031 -1028 -1024 -1021 -995 -969 -942
-473 -942 -916 -948 -981 -1013 -1045 -1027 -1008 -990 -971 -970 -970 -969 -968 -954 -939 -925 -910 -964 -1018 -1072 -1126 -1126 -1127 -1127 -1128 -1061 -995 -1039 -1083 -1065 -1047 -1029 -1010 -1001 -993 -984 -975 -943 -911 -879 -847
-478 -847 -911 -975 -1040 -1104 -1105 -1106 -1107 -1108 -1042 -976 -1003 -1029 -1010 -990 -970 -951 -903 -855 -900 -945 -979 -1013 -1048 -1082 -1064 -1046 -1028 -1010 -1015 -1020 -1025 -1030 -1043 -1055 -1068 -1080 -1033 -985 -937
$$ packed form
-446a088R0L5l9l9J1J1J2J1j0rj0rK8K9K8K9j3j3j3j3K4K3K4K4m5m6m5m6N6N6N7N6k9l0k9
-450i22k9j01j00Q4Q4J36J35n0m9l6l6l5l6J0J1J0J1m5m5O5O6j0j0j1j0j4j4j4j4k8k7k8k8
-454a080N5N4N5N4MLMMk9k8k9k8k9k8k9k8L7L7L8L7mnmm%J%JK4K3K4K4ononn4n4N7N7j3j3
-459h88j3j2l8l9l8l8NNNNNNNNJ7J8J8J7J8J8J7J8qqqqJ5J5J5J5n0n0n0n0K0J9J9K0j1j1j1
-464a012j1J2J2J3J2j%j%j5j4j5j4l9l9l9m0P7P6P7P6l7l7l8l7J3J4J3J4K6K7K6K7n2n2n3
-469a031n2j5j5j5j5M5M5M5M5RJ0RRk1k0k1k1K7K6q4q4qqrqj0j0j0j0M1M1M0M1LLMLK6K6K7
-473i42K6l2l3l2l2J8J9J8J9J%JJJ4J5J4J5n4n4n4n4%j%jO7O6m4m4J8J8J8J9RQRRL2L2L2L2
-478h47o4o4o5o4jjjjO6O6k7k6J9K0K0J9M8M8m5m5l4l4l5l4J8J8J8J8nnnnj3j2j3j2M7M8M8
$$ plain form
-483 -937 -890 -907 -923 -940 -957 -987 -1018 -1048 -1079 -1070 -1062 -1053 -1045 -997 -950 -957 -965 -1021 -1077 -1003 -930 -965 -1000 -1035 -1070 -1076 -1082 -1088 -1094 -1077 -1059 -1042 -1025 -1035 -1045 -1055 -1065 -1033 -1001 -970
-488 -970 -938 -948 -959 -969 -980 -977 -973 -970 -966 -998 -1030 -1062 -1094 -1107 -1119 -1131 -1144 -1172 -1201 -1137 -1073 -1029 -985 -940 -896 -906 -915 -925 -935 -903 -871 -839 -808 -824 -840 -856 -872
-493 -872 -902 -932 -962 -992 -972 -952 -933 -913 -1030 -1146 -1134 -1121 -1081 -1040 -1056 -1071 -1047 -1023 -999 -975 -980 -985 -990 -994 -986 -977 -968 -959 -974 -989 -1004 -1019 -965 -911 -857 -802 -856 -910
-497 -910 -964 -1017 -1029 -1042 -1054 -1066 -1062 -1058 -1055 -1051 -1053 -1055 -1057 -1059 -991 -922 -946 -971 -997 -1023 -1044 -1065 -1102 -1046 -951 -855 -847 -839 -831 -823 -858 -892 -926 -961 -963 -965 -967 -969 -976 -983 -990 -998 -982 -966 -950
-503 -950 -934 -963 -993 -1022 -1051 -1036 -1020 -1004 -988 -1039 -1089 -1083 -1078 -1029 -979 -1023 -1066 -1046 -1027 -1008 -988 -1016 -1044 -980 -916 -904 -893 -937 -981 -966 -950 -934 -918 -952 -987 -1021
-507 -1021 -1056 -1049 -1042 -1035 -1027 -1053 -1079 -1105 -1131 -1157 -1182 -1208 -1234 -1188 -1142 -1059 -1032 -1028 -933 -865 -852 -912 -1028 -1116 -1204 -1161 -1118 -1075 -1032 -1015 -997 -979 -961 -944 -926 -908
-512 -908 -890 -915 -940 -965 -989 -984 -979 -974 -968 -1009 -1049 -979 -909 -876 -844 -886 -983 -1067 -1058 -993 -929 -928 -928 -927 -926 -934 -943 -951 -959 -954 -948 -943 -937 -947 -958 -968 -978 -949 -920 -1002 -1084 -1071 -1057
-517 -1057 -1044 -1031 -1038 -1045 -1053 -1060 -1069 -1078 -1087 -1096 -1073 -1050 -1027 -1003 -1019 -1035 -1050 -1066 -1058 -1051 -1043 -1036 -1075 -1114 -1154 -1193 -1209 -1225 -1238 -1251 -1215 -1124 -1009 -987 -1055 -1068 -1007 -947 -1009 -1072
$$ packed form
-483i37M7j7j6j7j7l0l1l0l1RQRQM8M7pqn6n6P4P3l5l5l5l5ooooJ7J8J7J7j0j0j0j0L2L2L1
-488i70L2j0j1j0j1LMLMl2l2l2l2j3j2j2j3k8k9O4O4M4M4M5M4j0rj0j0L2L2L2L1j6j6j6j6
-493h72l0l0l0l0K0K0J9K0j17j16J2J3M0M1j6j5K4K4K4K4nnnmQRRRj5j5j5j5N4N4N4N5n4n4
-497i10n4n3j2j3j2j2MMLMkkkkO8O9k4k5k6k6k1k1l7N6R5R6QQQQl5l4l4l5kkkkpppqJ6J6J6
-503i50J6k9l0k9k9J5J6J6J6n1n0ONM9N0m4m3K0J9J9K0k8k8O4O4J2J1m4m4J5J6J6J6l4l5l4
-507a021l5PPPQk6k6k6k6k6k5k6k6M6M6Q3K7MR5O8J3o0j16q8q8M3M3M3M3J7J8J8J8J7J8J8
-512i08J8k5k5k5k4NNNOm1m0P0P0L3L2m2r7q4RO5O4J%JJqrqqNONOj0j1j0j0K9K9q2q2J3J4
-517a057J3J3ppqprrrrK3K3K3K4j6j6j5j6QPQPl9l9m0l9j6j6j3j3L6R1J15K2o8j3O1O0o2o3
$$ plain form
-522 -1072 -1024 -976 -969 -963 -956 -950 -994 -1038 -1077 -1115 -1114 -1021 -949 -932 -968 -1004 -933 -862 -885 -909 -932 -955 -987 -1018 -1049 -1080 -1063 -1046 -1028 -1011 -1067 -1123 -1068 -1013 -991 -968 -946
-526 -946 -923 -1010 -1096 -1128 -1066 -1028 -1045 -1026 -1006 -1024 -1043 -1061 -1080 -1084 -1089 -1094 -1098 -1083 -1067 -1052 -1036 -970 -903 -948 -992 -1117 -1241 -1180 -1120 -1092 -1063 -1035 -1007 -1004 -1001 -998 -995 -1008
-531 -1008 -1022 -1035 -1048 -1121 -1195 -1157 -1119 -1084 -1049 -1013 -978 -992 -1006 -1020 -1034 -981 -928 -876 -823 -907 -992 -966 -940 -970 -999 -1028 -1058 -1123 -1188 -1142 -1095 -1126 -1156 -1186
-535 -1186 -1216 -1180 -1145 -1109 -1073 -1060 -1047 -1034 -1021 -1034 -1048 -1061 -1074 -1055 -1035 -1016 -997 -971 -946 -921 -896 -958 -1021 -1083 -1146 -1143 -1140 -1138 -1135 -1063 -992 -1031 -1070 -1118 -1167 -1109
-539 -1109 -1050 -1024 -1053 -1107 -1068 -1035 -1059 -1045 -1032 -1057 -1083 -1161 -1146 -1086 -1026 -960 -894 -910 -926 -942 -958 -928 -898 -923 -948 -987 -1026 -1013 -1000 -1016 -1088 -1160 -1177 -1142
-544 -1142 -1108 -1070 -1032 -967 -903 -899 -951 -1041 -1131 -1163 -1140 -1115 -1090 -1117 -1144 -1114 -1085 -1055 -1025 -1000 -975 -999 -1023 -1001 -887 -776 -757 -835 -969 -1073 -1085 -1032 -978
-548 -978 -974 -970 -967 -964 -1017 -1069 -1056 -1043 -1029 -1016 -997 -977 -1009 -1042 -1085 -1074 -1038 -1002 -988 -973 -1011 -1048 -1069 -1033 -1029 -1025 -1037 -1048 -1028 -1064 -1140 -1217 -1235 -1198 -1133 -1068 -968
-552 -968 -924 -1019 -1115 -1140 -1072 -1021 -1024 -1046 -1069 -1076 -1083 -1034 -986 -946 -906 -921 -936 -967 -999 -1030 -1061 -1082 -1103 -1089 -1131 -1216 -1245 -1148 -1051 -1014 -1069 -1104 -1083 -1060 -1037 -1010
$$ packed form
-522a072M8M8POPOm4m4l9l8JR3P2J7l6l6P1P1k3k4k3k3l2l1l1l1J7J7J8J7n6n6N5N5K2K3K2
-526i46K3q7q6l2O2L8j7J9K0j8j9j8j9mnnmJ5J6J5J6O6O7m5m4j25j24O1O0K8K9K8K8LLLLj3
-531a008j4j3j3p3p4L8L8L5L5L6L5j4j4j4j4N3N3N2N3q4q5K6K6l0k9k9l0o5o5M6M7l1l0l0
-535a186l0L6L5L6L6J3J3J3J3j3j4j3j3J9K0J9J9K6K5K5K5o2o3o2o3LLKLP2P1l9l9m8m9N8
-539a109N9K6k9n4L9L3k4J4J3k5k6p8J5O0O0O6O6j6j6j6j6L0L0k5k5l9l9J3J3j6p2p2j7L5
-544a142L4L8L8O5O4Mn2r0r0l2K3K5K5k7k7L0K9L0L0K5K5k4k4K2J14J11J9p8j34j04j2N3N4
-548i78MMLLn3n2J3J3J4J3J9K0l2l3m3J1L6L6J4J5l8l7k1L6MMj2j1K0l6p6p7j8L7O5O5J00
-552i68M4r5r6k5O8N1lk2k3ppM9M8M0M0j5j5l1l2l1l1k1k1J4m2q5k9R7R7L7n5l5K1K3K3K7
$$ plain form
-557 -1010 -983 -971 -959 -1003 -1046 -1053 -1060 -1066 -1073 -1107 -1142 -1084 -1026 -1049 -1072 -1095 -1118 -1031 -944 -949 -955 -1051 -1148 -1152 -1157 -1125 -1093 -1117 -1140 -1091 -1042 -997 -951 -995 -1095 -1164 -1140 -1021
-561 -1021 -957 -985 -1013 -1030 -1046 -1063 -1079 -1062 -1045 -1028 -1011 -995 -978 -961 -944 -957 -969 -981 -993 -1021 -1050 -1023 -995 -1031 -1066 -1046 -1025 -1025 -1025 -1025 -1024 -984 -943 -994 -1046 -1095
-566 -1095 -1143 -1068 -993 -934 -967 -1041 -1115 -1102 -1090 -1078 -1066 -1064 -1062 -1005 -947 -1006 -1065 -1069 -1072 -1149 -1225 -1246 -1267 -1209 -1152 -1094 -1037 -1073 -1109 -1145 -1181 -1152 -1123 -1093 -1064 -1034
-570 -1034 -1005 -976 -946 -963 -980 -997 -1014 -1034 -1054 -1074 -1095 -1075 -1054 -1090 -1125 -1100 -1076 -1051 -1026 -1008 -991 -1029 -1067 -1082 -1096 -1056 -1015 -1044 -1073 -1102 -1131 -1097 -1062 -1028
-574 -1028 -993 -1020 -1047 -1136 -1115 -1105 -1095 -1078 -1061 -1070 -1078 -1086 -1094 -1103 -1111 -1119 -1128 -1115 -1102 -1089 -1077 -1078 -1079 -1080 -1081 -1064 -1048 -1031 -1014 -1012 -1009 -1006 -1003 -1016 -1029 -1042 -1055 -1085 -1115 -1145 -1176 -1130
-579 -1130 -1084 -1093 -1103 -1040 -976 -973 -1081 -1181 -1170 -1100 -1029 -1011 -994 -1031 -1069 -1087 -1104 -1066 -1028 -1058 -1087 -1116 -1145 -1087 -1030 -972 -914 -954 -993 -1033 -1072 -1060 -1047 -1034
-583 -1034 -1022 -983 -943 -904 -865 -921 -977 -977 -978 -954 -930 -998 -1067 -1114 -1161 -1153 -1144 -1107 -1070 -1125 -1180 -1160 -1141 -1121 -1101 -1116 -1131 -1054 -976 -971 -967 -962 -957 -908 -860 -903 -947 -988
-588 -988 -1029 -1070 -1110 -1097 -1084 -1070 -1057 -1085 -1114 -1142 -1171 -1139 -1108 -1076 -1045 -1050 -1055 -1091 -1071 -1060 -1049 -1034 -1019 -1002 -986 -972 -959 -981 -1057 -1138 -1163 -1141 -1175 -1205 -1180 -1060
$$ packed form
-557a010K7J2J2m4m3ppopl4l5N8N8k3k3k3k3Q7Q7nor6r7mnL2L2k4k3M9M9M5M6m4j00o9K4J19
-561a021O4k8k8j7j6j7j6J7J7J7J7J6J7J7J7j3j2j2j2k8k9K7K8l6l5K0K1%%%JM0M1n1n2m9
-566a095m8P5P5N9l3p4p4J3J2J2J2KKN7N8n9n9mlp7p6k1k1N8N7N8N7l6l6l6l6K9K9L0K9L0
-570a034K9K9L0j7j7j7j7k0k0k0k1K0K1l6l5K5K4K5K5J8J7l8l8j5j4M0M1k9k9k9k9L4L5L4
-574a028L5k7k7q9K1J0J0J7J7rqqqrqqrJ3J3J3J2jjjjJ7J6J7J7KLLLj3j3j3j3l0l0l0l1M6
-579a130M6rj0O3O4Lj08j00J1P0P1J8J7l7l8j8j7L8L8l0k9k9k9N8N7N8N8m0l9m0l9J2J3J3
-583a034J2L9M0L9L9n6n6%jK4K4o8o9m7m7QRL7L7n5n5K0J9K0K0j5j5P7P8NMNNM9M8m3m4m1
-588i88m1m1m0J3J3J4J3k8k9k8k9L2L1L2L1nnl6K0J1J1J5J5J7J6J4J3k2p6q1k5K2l4l0K5J20
$$ plain form
-593 -1060 -940 -946 -953 -922 -891 -915 -939 -915 -891 -923 -954 -946 -938 -1018 -1099 -1103 -1050 -1050 -1106 -1106 -1050 -998 -1001 -1024 -1047 -1070 -1093 -1098 -1047 -996 -1000 -1003 -1005 -1014 -1023 -1039 -1109 -1149 -1189 -1191 -1192 -1194
-598 -1194 -1195 -1166 -1137 -1108 -1079 -1092 -1104 -1117 -1129 -1100 -1070 -1041 -1011 -1041 -1072 -1102 -1133 -1110 -1087 -1064 -1041 -1018 -995 -972 -949 -972 -996 -1019 -1042 -1051 -1061 -1070 -1079 -1102 -1125 -1147
-602 -1147 -1170 -1136 -1102 -1037 -1027 -1032 -1036 -1045 -1053 -1061 -1069 -1078 -1086 -1107 -1127 -1148 -1169 -1171 -1173 -1206 -1184 -1052 -920 -848 -887 -966 -988 -994 -999 -1036 -1073 -1054 -1035 -999 -963 -982 -1002 -1000 -999 -997 -996
-607 -996 -1021 -1046 -1071 -1096 -1075 -1054 -1033 -1012 -1042 -1072 -1101 -1131 -1108 -1084 -1060 -1037 -947 -858 -861 -864 -872 -880 -888 -896 -909 -923 -937 -950 -939 -928 -916 -905 -898 -891 -977 -1063 -1106 -1149 -1137
-612 -1137 -1125 -1099 -1072 -1046 -1020 -1055 -1091 -1126 -1161 -1164 -1167 -1169 -1172 -1152 -1132 -1111 -1091 -1103 -1115 -1127 -1139 -1140 -1142 -1143 -1144 -1128 -1112 -1096 -1079 -1123 -1167 -1155 -1143 -1087 -1032 -1068 -1105 -1098 -1091
-617 -1091 -1084 -1076 -1075 -1074 -1072 -1071 -1100 -1130 -1159 -1189 -1195 -1202 -1208 -1214 -1165 -1115 -1065 -1015 -1025 -1036 -1046 -1056 -1103 -1149 -1196 -1243 -1220 -1197 -1175 -1152 -1144 -1137 -1129 -1121 -1128 -1134 -1140 -1146 -1141 -1135 -1129 -1124 -1118 -1112 -1107 -1101 -1086
-622 -1086 -1071 -1056 -1041 -1059 -1076 -1094 -1111 -1108 -1106 -1103 -1101 -1112 -1123 -1135 -1146 -1133 -1120 -1106 -1093 -1094 -1094 -1095 -1096 -1078 -1060 -1042 -1024 -1029 -1035 -1040 -1045 -1015 -984 -954 -924 -944 -965 -985 -1005 -1016
-627 -1016 -1027 -1038 -1049 -1057 -1064 -1072 -1079 -1126 -1172 -1164 -1155 -1187 -1220 -1161 -1101 -1107 -1113 -1118 -1124 -1101 -1078 -1055 -1032 -1033 -1035 -1036 -1037 -1052 -1067 -1082 -1097 -1104 -1111 -1118 -1126 -1096 -1066 -1092 -1117 -1147 -1176 -1113 -1050
$$ packed form
-593a060J20opL1L1k4k4K4K4l2l1QQq0q1mN3%n6%N6N2lk3k3k3k3nN1N1mlkrrj6p0m0m0kjk
-598a194jK9K9K9K9j3j2j3j2K9L0K9L0l0l1l0l1K3K3K3K3K3K3K3K3k3k4k3k3rj0rrk3k3k2
-602a147k3L4L4O5J0nmrqqqrqk1k0k1k1kkl3K2J32J32P2l9p9k2onl7l7J9J9L6L6j9k0KJKJ
-607i96k5k5k5k5K1K1K1K1l0l0k9l0K3K4K4K3R0Q9llqqqqj3j4j4j3J1J1J2J1PPq6q6m3m3J2
-612a137J2K6K7K6K6l5l6l5l5llklK0K0K1K0j2j2j2j2jkjjJ6J6J6J7m4m4J2J2N6N5l6l7PP
-617a091PQJJKJk9l0k9l0opooM9N0N0N0j0j1j0j0m7m6m7m7K3K3K2K3QPQQpoooNOONOONOJ5
-622a086J5J5J5j8j7j8j7LKLKj1j1j2j1J3J3J4J3j%jjJ8J8J8J8nonnL0L1L0L0k0k1k0k0j1
-627a016j1j1j1qpqpm7m6QRl2l3N9O0oonoK3K3K3K3jkjjj5j5j5j5pppqL0L0k6k5l0k9O3O3
$$ plain form
-632 -1050 -1005 -959 -1006 -1053 -1033 -1014 -994 -974 -947 -919 -891 -864 -901 -938 -975 -1012 -1049 -1086 -1123 -1160 -1147 -1133 -1119 -1105 -1105 -1106 -1106 -1106 -1100 -1094 -1088 -1082 -1077 -1071 -1065 -1059 -1064 -1070 -1075 -1080 -1085 -1090 -1095 -1101
-638 -1101 -1101 -1101 -1101 -1101 -1072 -1043 -1103 -1163 -1190 -1162 -1130 -1153 -1176 -1144 -1112 -1136 -1200 -1208 -1159 -1109 -1108 -1108 -1107 -1106 -1130 -1153 -1177 -1201 -1190 -1179 -1133 -1143 -1196 -1194 -1133 -1073 -1113 -1153 -1136
-643 -1136 -1063 -1007 -1006 -1026 -1047 -1082 -1117 -1100 -1084 -1055 -1082 -1130 -1178 -1215 -1197 -1154 -1112 -1100 -1088 -1076 -1065 -1082 -1099 -1116 -1133 -1088 -1043 -1001 -960 -993 -1082 -1140 -1198 -1206 -1215 -1254
-647 -1254 -1238 -1184 -1130 -1073 -1016 -1011 -1007 -1003 -998 -994 -990 -985 -981 -982 -983 -1016 -992 -959 -925 -892 -858 -888 -973 -1059 -1088 -1044 -1000 -1010 -1076 -1089 -1047 -1009 -1026 -1098 -1171 -1186 -1145 -1084 -1024
-652 -1024 -1015 -1006 -1048 -1090 -1040 -990 -990 -991 -906 -821 -809 -908 -1013 -1008 -925 -954 -1042 -1130 -1130 -1129 -1129 -1128 -1122 -1116 -1110 -1104 -1097 -1091 -1085 -1079 -1082 -1084 -1087 -1090 -1069 -1049 -1029 -1008 -1015 -1023 -1030 -1037 -1039 -1040 -1042 -1043 -1124 -1205
-658 -1205 -1193 -1181 -1189 -1196 -1204 -1212 -1188 -1165 -1141 -1117 -1144 -1172 -1199 -1226 -1200 -1174 -1148 -1122 -1120 -1117 -1114 -1111 -1077 -1042 -1008 -973 -998 -1024 -1050 -1075 -1067 -1058 -1050 -1041 -1047 -1052 -1058 -1063 -1075 -1087 -1099 -1110
-663 -1110 -1090 -1069 -1049 -1028 -1076 -1123 -1171 -1218 -1187 -1156 -1125 -1094 -1108 -1121 -1134 -1148 -1101 -1055 -1008 -961 -967 -972 -978 -983 -1012 -1040 -1069 -1098 -1058 -1018 -979 -939 -951 -962 -973 -984
-667 -984 -997 -1010 -1023 -1036 -1059 -1082 -1013 -944 -949 -955 -960 -965 -1034 -1103 -1117 -1130 -1127 -1124 -1068 -1013 -1052 -1146 -1148 -1040 -914 -898 -974 -995 -926 -858 -915 -973 -1042 -1111 -1088 -1064 -1075
$$ packed form
-632a050M5M6m7m7K0J9K0K0K7K8K8K7l7l7l7l7l7l7l7l7J3J4J4J4%j%%OOOONOOOnonnnnno
-638a101%%%%K9K9o0o0k7K8L2k3k3L2L2k4o4qM9N0J%JJk4k3k4k4J1J1M6j0n3KO1O0m0m0J7
-643a136P3N6Jk0k1l5l5J7J6K9k7m8m8l7J8M3M2J2J2J2J1j7j7j7j7M5M5M2M1l3q9n8n8qrl9
-647a254J6N4N4N7N7NMMNMMNMjjl3K4L3L4L3L4l0q5q6k9M4M4j0o6j3M2L8j7p2p3j5M1O1O0
-652a024RRm2m2N0N0%jQ5Q5J2r9j05NQ3k9q8q8%J%JOOOOPOOOlkllK1K0K0K1pqppkjkjq1q1
-658a205J2J2qpqqK4K3K4K4k7k8k7k7K6K6K6K6KLLLL4L5L4L5k5k6k6k5QRQRononj2j2j2j1
-663a110K0K1K0K1m8m7m8m7L1L1L1L1j4j3j3j4M7M6M7M7ononk9k8k9k9M0M0L9M0j2j1j1j1
-667i84j3j3j3j3k3k3O9O9nonno9o9j4j3LLN6N5l9r4kJ08J26J6p6k1O9O8n7n8o9o9K3K4j1
$$ plain form
-672 -1075 -1085 -1095 -1105 -1158 -1212 -1209 -1207 -1175 -1143 -1110 -1078 -1017 -955 -1024 -1092 -1118 -1145 -1116 -1087 -1120 -1152 -1184 -1217 -1204 -1191 -1179 -1166 -1179 -1193 -1207 -1220 -1228 -1236 -1244 -1252 -1254 -1256 -1172
-676 -1172 -1088 -1010 -1043 -1100 -1102 -1103 -1104 -1106 -1107 -1123 -1194 -1297 -1289 -1198 -1107 -1139 -1171 -1212 -1253 -1238 -1224 -1148 -1072 -1004 -935 -916 -1008 -1158 -1252 -1239 -1171 -1131 -1090 -1079 -1067 -1056
-681 -1056 -1044 -1019 -994 -1025 -1055 -1000 -945 -945 -945 -979 -1014 -1048 -1083 -1053 -1024 -1051 -1077 -1129 -1182 -1179 -1175 -1165 -1155 -1093 -1031 -1005 -1034 -1121 -1208 -1202 -1141 -1080 -1074 -1131 -1189 -1161 -1133
-685 -1133 -1128 -1178 -1229 -1224 -1160 -1096 -1089 -1138 -1164 -1190 -1164 -1138 -1095 -1051 -1097 -1143 -1153 -1109 -1061 -1068 -1071 -1018 -947 -969 -1050 -1131 -1091 -1052 -1047 -1097 -1147 -1142 -1150 -1157 -1161 -1166 -1159 -1152 -1145 -1138 -1131 -1124 -1117
-691 -1117 -1110 -1125 -1139 -1153 -1168 -1179 -1190 -1232 -1218 -1176 -1134 -1088 -1042 -1016 -990 -1020 -1049 -1048 -1048 -1047 -1046 -1105 -1165 -1220 -1276 -1299 -1267 -1211 -1154 -1111 -1069 -1026 -983 -998 -1013 -1028 -1042
-695 -1042 -1054 -1065 -1076 -1088 -1120 -1153 -1134 -1115 -1093 -1126 -1162 -1143 -1104 -1120 -1133 -1090 -1088 -1086 -1080 -1074 -1052 -1030 -1101 -1171 -1176 -1181 -1185 -1190 -1160 -1130 -1100 -1070 -1097 -1124 -1151 -1177 -1136 -1096
-700 -1096 -1147 -1199 -1212 -1226 -1239 -1252 -1183 -1113 -1049 -986 -985 -1077 -1170 -1169 -1127 -1084 -1129 -1173 -1123 -1074 -1117 -1160 -1189 -1219 -1193 -1167 -1127 -1087 -1047 -1007 -983 -959 -936 -912 -930
-704 -930 -948 -965 -983 -1031 -1079 -1126 -1174 -1153 -1131 -1109 -1088 -1097 -1107 -1117 -1126 -1113 -1099 -1086 -1072 -1079 -1086 -1093 -1100 -1124 -1148 -1172 -1196 -1192 -1187 -1090 -993 -950 -907 -957 -1006 -973 -940 -962 -985
$$ packed form
-672a075j0j0j0n3n4LKL2L2L3L2O1O2o9o8k6k7K9K9l3l2l2l3J3J3J2J3j3j4j4j3qqqqkkQ4
-676a172Q4P8l3n7kjjkjj6p1j03QR1R1l2l2m1m1J5J4P6P6O8O9J9r2j50r4J3O8M0M1J1J2J1
-681a056J2K5K5l1l0N5N5%%l4l5l4l5L0K9k7k6n2n3LMJ0J0O2O2K6k9q7q7OO1O1On7n8K8K8
-685a133Nn0n1NO4O4Pm9k6k6K6K6M3M4m6m6j0M4M8plN3P1k2q1q1M0L9Nn0n0NqpmnPPPPPPP
-691a117Pj5j4j4j5j1j1m2J4M2M2M6M6K6K6l0k9J%JJn9o0n5n6k3L2N6N7M3M2M3M3j5j5j5j4
-695a042j2j1j1j2l2l3J9J9K2l3l6J9L9j6j3M3KKOOK2K2p1p0nnmnL0L0L0L0k7k7k7k6M1M0
-700a096n1n2j3j4j3j3O9P0O4O3Jr2r3JM2M3m5m4N0M9m3m3k9l0K6K6M0M0M0M0K4K4K3K4j8
-704i30j8j7j8m8m8m7m8K1K2K2K1rj0j0rJ3J4J3J4ppppk4k4k4k4MNR7R7M3M3n0m9L3L3k2k3
$$ plain form
-709 -985 -995 -1006 -1017 -1028 -1037 -1047 -1057 -1066 -1099 -1132 -1164 -1197 -1134 -1070 -1007 -943 -986 -1029 -1072 -1114 -1106 -1098 -1090 -1082 -1080 -1078 -1076 -1073 -1018 -963 -1000 -1037 -1022 -1008 -993 -978 -964 -950 -936 -922
-714 -922 -959 -996 -1033 -1070 -1095 -1119 -1144 -1169 -1194 -1218 -1237 -1256 -1236 -1123 -1034 -1001 -1015 -1084 -1182 -1279 -1306 -1333 -1268 -1203 -1139 -1075 -1066 -1057 -1060 -1062 -1064 -1067 -1081 -1095 -1109 -1122 -1145
-718 -1145 -1168 -1098 -1028 -1052 -1076 -1099 -1123 -1099 -1074 -1050 -1025 -1057 -1089 -1122 -1154 -1105 -1055 -1099 -1142 -1133 -1125 -1116 -1107 -1113 -1118 -1124 -1129 -1121 -1112 -1104 -1095 -1101 -1108 -1114 -1120 -1079 -1037 -1000 -962 -1024 -1143 -1193
-723 -1193 -1150 -1048 -1001 -1009 -1018 -1025 -1033 -1096 -1160 -1183 -1207 -1231 -1255 -1223 -1191 -1159 -1127 -1073 -1019 -999 -1072 -1205 -1246 -1215 -1184 -1182 -1180 -1123 -1065 -1048 -1031 -1069 -1107 -1139 -1172 -1111
-728 -1111 -1051 -1063 -1074 -1085 -1097 -1152 -1207 -1226 -1151 -1097 -1098 -1118 -1138 -1104 -1071 -1126 -1182 -1190 -1142 -1126 -1109 -1109 -1109 -1108 -1108 -1114 -1121 -1127 -1133 -1140 -1146 -1149 -1152 -1155 -1102 -1049 -1052 -1080 -1108 -1139 -1171 -1138
-733 -1138 -1104 -1071 -1037 -1051 -1065 -1058 -996 -958 -976 -1052 -1128 -1150 -1173 -1140 -1107 -1123 -1138 -1154 -1170 -1159 -1148 -1140 -1133 -1145 -1212 -1279 -1291 -1222 -1153 -1084 -1015 -1040 -1119 -1168 -1217 -1208
-737 -1208 -1200 -1192 -1184 -1189 -1194 -1199 -1204 -1209 -1214 -1219 -1224 -1226 -1229 -1231 -1233 -1259 -1284 -1304 -1324 -1337 -1258 -1175 -1185 -1235 -1228 -1167 -1105 -1110 -1116 -1122 -1127 -1127 -1127 -1127 -1127 -1136 -1145 -1154 -1164 -1155 -1147 -1136 -1124 -1170 -1161 -1128 -1094 -1140 -1187
-743 -1187 -1175 -1108 -1039 -1026 -1034 -1042 -1036 -1030 -1079 -1128 -1119 -1110 -1100 -1091 -1108 -1126 -1143 -1160 -1168 -1177 -1185 -1193 -1153 -1112 -1128 -1143 -1118 -1093 -1161 -1229 -1256 -1283 -1255 -1227 -1205 -1182 -1160 -1138 -1154 -1169
$$ packed form
-709i85j0j1j1j1rj0j0rl3l3l2l3O3O4O3O4m3m3m3m2QQQQKKKLN5N5l7l7J5J4J5J5J4J4J4J4
-714i22l7l7l7l7k5k4k5k5k5k4j9j9K0J13Q9L3j4o9r8r7k7k7O5O5O4O4RRlkklj4j4j4j3k3
-718a145k3P0P0k4k4k3k4K4K5K4K5l2l2l3l2M9N0m4m3RQRRononQRQRopooM1M2L7L8o2j19n0
-723a193M3J02M7qrpqo3o4k3k4k4k4L2L2L2L2N4N4K0p3j33m1L1L1KKN7N8J7J7l8l8l2l3O1
-728a111O0j2j1j1j2n5n5j9P5N4jk0k0L4L3n5n6qM8J6J7%%J%opoopolllN3N3lk8k8l1l2L3
-733a138L4L3L4j4j4PO2L8j8p6p6k2k3L3L3j6j5j6j6J1J1QPj2o7o7j2O9O9O9O9k5p9m9m9R
-737a208QQQnnnnnnnnklkkk6k5k0k0j3P9Q3j0n0PO1O2noon%%%%rrrj0RQJ1J2m6RL3L4m6m7
-743a187J2O7O9J3qqOOm9m9RRJ0Rj7j8j7j7qrqqM0M1j6j5K5K5o8o8k7k7K8K8K2K3K2K2j6j5
$$ plain form
-748 -1169 -1185 -1201 -1185 -1169 -1152 -1136 -1152 -1168 -1184 -1200 -1194 -1188 -1182 -1176 -1166 -1156 -1147 -1137 -1141 -1145 -1094 -1042 -1125 -1207 -1197 -1187 -1161 -1136 -1110 -1084 -1094 -1104 -1114 -1124 -1142 -1160 -1178 -1196
-753 -1196 -1214 -1232 -1250 -1268 -1235 -1202 -1169 -1136 -1135 -1134 -1134 -1133 -1132 -1131 -1130 -1128 -1113 -1098 -1083 -1068 -1082 -1096 -1111 -1125 -1139 -1153 -1167 -1181 -1152 -1122 -1093 -1063 -1057 -1050 -1044 -1038 -1057 -1077 -1097 -1116
-758 -1116 -1113 -1110 -1106 -1103 -1114 -1126 -1137 -1148 -1160 -1171 -1182 -1194 -1168 -1143 -1118 -1093 -1061 -1028 -1089 -1149 -1158 -1167 -1084 -1001 -998 -996 -994 -991 -1015 -1039 -1063 -1087 -1134 -1181 -1228 -1275 -1267 -1260 -1252 -1244 -1236 -1228
-763 -1228 -1220 -1213 -1224 -1235 -1246 -1258 -1321 -1384 -1355 -1326 -1302 -1279 -1256 -1233 -1227 -1221 -1160 -1099 -1060 -1021 -1074 -1128 -1125 -1123 -1121 -1119 -1135 -1150 -1166 -1182 -1165 -1148 -1131 -1114 -1135 -1156 -1177 -1198
-767 -1198 -1196 -1194 -1191 -1189 -1223 -1258 -1292 -1326 -1263 -1200 -1137 -1075 -1054 -1034 -1014 -994 -997 -1000 -1003 -1006 -1044 -1082 -1119 -1157 -1135 -1112 -1090 -1068 -1070 -1072 -1075 -1077 -1112 -1147 -1181 -1216 -1203 -1190 -1176 -1163
-772 -1163 -1150 -1137 -1124 -1110 -1108 -1105 -1102 -1099 -1102 -1105 -1108 -1111 -1068 -1024 -1003 -1094 -1210 -1216 -1162 -1108 -1162 -1215 -1209 -1091 -1015 -1050 -1108 -1166 -1189 -1212 -1179 -1146 -1074 -1002 -1059 -1116 -1139 -1162
-777 -1162 -1130 -1097 -1189 -1280 -1279 -1277 -1252 -1226 -1201 -1175 -1144 -1113 -1082 -1050 -1072 -1094 -1116 -1138 -1128 -1118 -1107 -1097 -1118 -1139 -1161 -1182 -1189 -1196 -1204 -1211 -1187 -1163 -1139 -1115 -1174 -1234 -1200
-782 -1200 -1167 -1087 -1007 -1057 -1106 -1113 -1120 -1126 -1133 -1156 -1179 -1117 -1054 -1029 -1115 -1193 -1272 -1259 -1245 -1232 -1219 -1209 -1199 -1189 -1180 -1163 -1147 -1130 -1113 -1097 -1080 -1064 -1047 -1043 -1039 -1036 -1032 -1069 -1107
$$ packed form
-748a169j6j6J6J6J7J6j6j6j6j6OOOOJ0J0RJ0mmN1N2q3q2J0J0K6K5K6K6j0j0j0j0j8j8j8j8
-753a196j8j8j8j8L3L3L3L3JJ%JJJJKJ5J5J5J5j4j4j5j4j4j4j4j4K9L0K9L0OPOOj9k0k0j9
-758a116LLMLj1j2j1j1j2j1j1j2K6K5K5K5L2L3o1o0rrQ3Q3LKKLk4k4k4k4m7m7m7m7QPQQQQ
-763a228QPj1j1j1j2o3o3K9K9K4K3K3K3OOO1O1L9L9n3n4LKKKj6j5j6j6J7J7J7J7k1k1k1k1
-767a198KKLKl4l5l4l4O3O3O3O2K1K0K0K0lllll8l8l7l8K2K3K2K2kklkl5l5l4l5J3J3J4J3
-772a163J3J3J3J4KLLLllllM3M4K1r1j16oN4N4n4n3OJ18P6l5n8n8k3k3L3L3P2P2n7n7k3k3
-777a162L2L3r2r1JKK5K6K5K6L1L1L1L2k2k2k2k2J0J0J1J0k1k1k2k1ppqpK4K4K4K4n9o0L4
-782a200L3Q0Q0n0m9ppopk3k3O2O3K5q6p8p9J3J4J3J3J0J0J0RJ7J6J7J7J6J7J6J7MMLMl7l8
$$ plain form
-786 -1107 -1145 -1183 -1165 -1148 -1130 -1113 -1146 -1180 -1213 -1247 -1230 -1212 -1195 -1178 -1161 -1144 -1127 -1109 -1137 -1165 -1193 -1221 -1236 -1250 -1208 -1167 -1151 -1136 -1213 -1289 -1263 -1237 -1156 -1074
-790 -1074 -1074 -1073 -1073 -1072 -1082 -1092 -1102 -1111 -1084 -1057 -968 -989 -1021 -1053 -1092 -1130 -1124 -1118 -1168 -1217 -1301 -1384 -1337 -1291 -1175 -1059 -1036 -1013 -1082 -1151 -1220 -1290 -1290 -1289 -1289 -1289 -1257 -1224 -1192
-795 -1192 -1160 -1176 -1192 -1208 -1224 -1217 -1210 -1203 -1196 -1169 -1143 -1116 -1090 -1105 -1120 -1135 -1150 -1152 -1154 -1155 -1157 -1145 -1133 -1121 -1109 -1110 -1111 -1113 -1114 -1129 -1145 -1160 -1175 -1158 -1140 -1123 -1105 -1111 -1117 -1178 -1239
-800 -1239 -1275 -1311 -1254 -1198 -1197 -1196 -1195 -1194 -1176 -1158 -1140 -1122 -1170 -1218 -1173 -1129 -1160 -1191 -1223 -1254 -1235 -1216 -1196 -1177 -1118 -1059 -1093 -1127 -1123 -1118 -1114 -1109 -1137 -1165 -1192 -1220 -1187 -1155
-805 -1155 -1122 -1090 -1086 -1083 -1080 -1076 -1073 -1070 -1066 -1063 -1052 -1041 -1030 -1019 -1022 -1025 -1028 -1031 -1059 -1087 -1115 -1143 -1148 -1153 -1157 -1162 -1160 -1158 -1156 -1154 -1181 -1208 -1235 -1262 -1258 -1255 -1196 -1138 -1061 -983 -1036 -1088 -1069 -1049 -1030
-810 -1030 -1010 -996 -981 -1057 -1189 -1272 -1243 -1190 -1193 -1236 -1223 -1190 -1157 -1178 -1200 -1221 -1243 -1238 -1233 -1228 -1222 -1188 -1154 -1120 -1087 -1118 -1150 -1182 -1214 -1221 -1228 -1179 -1130 -1084 -1038 -1084 -1130
-815 -1130 -1140 -1149 -1159 -1169 -1170 -1172 -1174 -1175 -1157 -1139 -1120 -1102 -1098 -1093 -1089 -1084 -1099 -1115 -1130 -1145 -1154 -1164 -1173 -1183 -1215 -1246 -1186 -1125 -1082 -1038 -1051 -1063 -1101 -1140 -1123 -1106 -1151 -1196 -1190 -1183 -1200
-820 -1200 -1273 -1324 -1265 -1183 -1156 -1129 -1046 -959 -982 -1032 -1082 -1087 -1092 -1097 -1102 -1121 -1141 -1161 -1181 -1187 -1192 -1198 -1204 -1190 -1176 -1161 -1147 -1094 -1042 -1082 -1122 -1135 -1147 -1160 -1172 -1191 -1209 -1227
$$ packed form
-786a107l8l8J8J7J8J7l3l4l3l4J7J8J7J7J7J7J7J8k8k8k8k8j5j4M2M1J6J5p7p6K6K6Q1Q2
-790a074%J%Jj0j0j0rK7K7Q9k1l2l2l9l8OOn0m9q4q3M7M6J16J16K3K3o9o9o9p0%J%%L2L3L2
-795a192L2j6j6j6j6PPPPK7K6K7K6j5j5j5j5kkjkJ2J2J2J2jjkjj5j6j5j5J7J8J7J8ooo1o1
-800a239l6l6N7N6JJJJJ8J8J8J8m8m8M5M4l1l1l2l1J9J9K0J9N9N9l4l4MNMNk8k8k7k8L3L2
-805a155L3L2MLLMLLMLJ1J1J1J1llllk8k8k8k8nnmnKKKKk7k7k7k7MLN9N8P7P8n3n2J9K0J9
-810a030K0J4J5p6j32q3K9N3lm3J3L3L3k1k2k1k2NNNOL4L4L4L3l1l2l2l2ppM9M9M6M6m6m6
-815a130j0rj0j0jkkjJ8J8J9J8MNMNj5j6j5j5rj0rj0l2l1O0O1M3M4j3j2l8l9J7J7m5m5OPj7
-820a200p3n1N9Q2K7K7Q3Q7k3n0n0nnnnj9k0k0k0onooJ4J4J5J4N3N2m0m0j3j2j3j2j9j8j8
$$ plain form
-825 -1227 -1246 -1249 -1251 -1254 -1257 -1260 -1263 -1265 -1268 -1231 -1194 -1157 -1119 -1161 -1202 -1244 -1285 -1240 -1195 -1156 -1117 -1117 -1210 -1302 -1302 -1261 -1219 -1172 -1124 -1156 -1187 -1213 -1238 -1244 -1158 -1072 -1079 -1088 -1096 -1111 -1125
-830 -1125 -1149 -1172 -1196 -1219 -1210 -1201 -1192 -1183 -1153 -1124 -1094 -1064 -1072 -1081 -1089 -1098 -1106 -1114 -1104 -1039 -965 -984 -1076 -1169 -1140 -1111 -1137 -1163 -1091 -1019 -1040 -1060 -1128 -1197 -1265 -1333 -1301 -1268 -1236
-834 -1236 -1204 -1190 -1177 -1164 -1151 -1216 -1281 -1347 -1412 -1364 -1316 -1269 -1221 -1245 -1269 -1237 -1205 -1121 -1037 -1082 -1128 -1142 -1156 -1114 -1073 -1065 -1058 -1050 -1042 -1036 -1029 -1078 -1127 -1180 -1232 -1191 -1151
-839 -1151 -1153 -1154 -1155 -1157 -1159 -1161 -1163 -1165 -1167 -1169 -1171 -1173 -1182 -1190 -1199 -1207 -1216 -1224 -1232 -1241 -1224 -1206 -1189 -1171 -1212 -1252 -1237 -1222 -1287 -1353 -1388 -1313 -1247 -1180 -1163 -1145 -1089 -1034 -1107 -1181 -1231 -1280 -1274 -1268 -1252
-844 -1252 -1236 -1220 -1204 -1184 -1165 -1145 -1125 -1114 -1103 -1092 -1081 -1050 -1019 -1081 -1142 -1123 -1104 -1085 -1066 -1113 -1160 -1200 -1240 -1243 -1135 -1027 -1030 -1062 -1094 -1133 -1172 -1245 -1317 -1261
-849 -1261 -1205 -1126 -1048 -1025 -1002 -1055 -1108 -1106 -1103 -1122 -1140 -1159 -1177 -1163 -1148 -1134 -1120 -1147 -1174 -1201 -1228 -1238 -1247 -1257 -1266 -1234 -1202 -1170 -1138 -1141 -1143 -1142 -1141 -1142 -1087 -1052 -1129 -1200 -1216
$$ packed form
-825a227j9lkllllklL7L7L7L8m2m1m2m1M5M5L9L9%r3r2%M1M2M7M8l2l1k6k5oQ6Q6prqj5j4
-830a125k4k3k4k3RRRRL0K9L0L0qrqrqqJ0O5P4j9r2r3K9K9k6k6P2P2k1k0o8o9o8o8L2L3L2
-834a236L2J4J3J3J3o5o5o6o5M8M8M7M8k4k4L2L2Q4Q4m5m6j4j4M2M1QPQQOPm9m9n3n2M1M0
-839a151kjjkkkkkkkkkrqrqrqqrJ7J8J7J8m1m0J5J5o5o6l5P5O6O7J7J8N6N5p3p4n0m9OOJ6
-844a252J6J6J6K0J9K0K0J1J1J1J1L1L1o2o1J9J9J9J9m7m7m0m0lJ08J08ll2l2l9l9p3p2N6
-849a261N6P9P8K3K3n3n3KLj9j8j9j8J4J5J4J4k7k7k7k7j0rj0rL2L2L2L2lkJJjN5L5p7p1j6
$$ [...]
-1606I39
##$OBSERVED INTEGRALS=	(X Y Z)
(2.9280951894089373155, 3.1057470615122930724, 1)
(7.1993537715509736685, 7.2653387526179358247, 1.0018551829577022616)
(7.0090124800116697656, 7.1029141838377238827, 1.0005060931252551804)
(6.7806029301644992202, 6.8542015628930306193, 0.94715763264927932408)
(5.1106753323929829946, 5.2147285717678029116, 0.96875296380043274258)
(2.5873873474068340705, 2.6602593033663177735, 1.0250466129955704275)
(2.3856299171010895144, 2.4696501946812432493, 1.0817148447914952669)
(2.3331512323989196389, 2.3619737224425954025, 2.9284583337558425242)
(2.0174633933356211912, 2.2162298105236253321, 3.1305042122353561318)
(1.7199935432621940024, 1.750719405289889341, 2.9126762389598459535)
(1.6471215873027067467, 1.680022731597849095, 2.8008370151603743103)
(1.4665731591045738647, 1.5693552462414641635, 1.071250004363354158)
(1.0913369679699043147, 1.1313077796342501102, 3.0062191618750886413)
(1.2058111972943239554, 1.2474134706592521216, 6.0279055672770160967)
(1.2474134706592521216, 1.4263304371567984141, 1.917306981282673739)
(0.89964021815110561953, 0.95375036455385919787, 0.28167445591558010198)
##END=	
##END=	
##END=	
