##TITLE=	Feb07-2020.90.fid
AH001
##JCAMP-DX=	6.0	$$ MestReNova 14.1.0-24037
##DATA TYPE=	LINK
##BLOCK_ID=	1
##BLOCKS=	1    
##ORIGIN=	Mestrelab Research S.L.
##OWNER=	ah1319
##$MNOVA/LINK_BLOCK_TYPE=	ITEM	$$ NMR Spectrum
##$MNOVA/ITEM/POLYGON=	(XY..XY)
5380.23,5835
8781.23,5835
8781.23,8208
5380.23,8208
5380.23,5835
##$MNOVA/ITEM/Z=	0
##$MNOVA/ITEM/ANGLE=	0
##TITLE=	Feb07-2020.90.fid
##JCAMP-DX=	6.0	$$ MestReNova 14.1.0-24037
##BLOCK_ID=	2
##DATA TYPE=	NMR SPECTRUM
##DATA CLASS=	XYDATA
##NUMDIM=	1
##ORIGIN=	Bruker BioSpin GmbH
##OWNER=	nmrsu
##.OBSERVE FREQUENCY=	400.05240029999998796
##.OBSERVE NUCLEUS=	^1H
##.SOLVENT NAME=	CDCl3
##.PULSE SEQUENCE=	zg30
##LONGDATE=	2020/02/07 15:06:00.000
##.ACQUISITIONMODE=	SIMULTANEOUS (DQD)
##$ORIGINAL FORMAT=	Bruker XWIN-NMR
##$MNOVA/SCALES_VERSION=	8
##$PARAMETER FILE=	(acqus, ASCII, //ch-nmrserv2.ch.ic.ac.uk/Av400D/ug1/nmr/Feb07-2020/90/acqus, 0)
$$ ##TITLE= Parameter file, TOPSPIN		Version 3.2
$$ ##JCAMPDX= 5.0
$$ ##DATATYPE= Parameter Values
$$ ##NPOINTS= 11	$$ modification sequence number
$$ ##ORIGIN= Bruker BioSpin GmbH
$$ ##OWNER= nmrsu
$$ $$ 2020-02-07 15:06:09.468 +0000  nmrsu@nmrpc
$$ $$ /opt/topspin/data/ug1/nmr/Feb07-2020/90/acqus
$$ $$ process /opt/topspin3.2/prog/mod/shimcntl
$$ ##$ACQT0= -2.04831932773109
$$ ##$AMP= (0..31)
$$ 100 100 100 100 100 100 100 100 100 100 100 100 100 100 100 100 100 100
$$ 100 100 100 100 100 100 100 100 100 100 100 100 100 100
$$ ##$AMPCOIL= (0..19)
$$ -1 0 0 0 0 0 0 0 0 0 0 0 0 0 0 0 0 0 0 0
$$ ##$ANAVPT= -1
$$ ##$AQSEQ= 0
$$ ##$AQ_mod= 3
$$ ##$AUNM= <au_zg>
$$ ##$AUTOPOS= <38 >
$$ ##$BF1= 400.05
$$ ##$BF2= 400.05
$$ ##$BF3= 400.05
$$ ##$BF4= 400.05
$$ ##$BF5= 400.05
$$ ##$BF6= 400.05
$$ ##$BF7= 400.05
$$ ##$BF8= 400.05
$$ ##$BYTORDA= 0
$$ ##$CAGPARS= (0..11)
$$ 0 0 0 0 0 0 0 0 0 0 0 0
$$ ##$CFDGTYP= 0
$$ ##$CFRGTYP= 9
$$ ##$CHEMSTR= <none>
$$ ##$CNST= (0..63)
$$ 1 1 1 1 1 1 1 1 1 1 1 1 1 1 1 1 1 1 1 1 1 1 1 1 1 1 1 1 1 1 1 1 1 1 1 1
$$ 1 1 1 1 1 1 1 1 1 1 1 1 1 1 1 1 1 1 1 1 1 1 1 1 1 1 1 1
$$ ##$CPDPRG= (0..8)
$$ <> <> <> <> <> <> <> <> <>
$$ ##$D= (0..63)
$$ 0 1 0 0 0 0 0 0 0 0 0 0 0 0 0 0 0.0002 0 0 0 0 0 0 0 0 0 0 0 0 0 0 0 0
$$ 0 0 0 0 0 0 0 0 0 0 0 0 0 0 0 0 0 0 0 0 0 0 0 0 0 0 0 0 0 0 0
$$ ##$DATE= 1581087968
$$ ##$DE= 6.5
$$ ##$DECBNUC= <off>
$$ ##$DECIM= 2496
$$ ##$DECNUC= <off>
$$ ##$DECSTAT= 4
$$ ##$DIGMOD= 1
$$ ##$DIGTYP= 12
$$ ##$DQDMODE= 0
$$ ##$DR= 22
$$ ##$DS= 4
$$ ##$DSPFIRM= 0
$$ ##$DSPFVS= 20
$$ ##$DTYPA= 0
$$ ##$EXP= <proton>
$$ ##$F1LIST= <>
$$ ##$F2LIST= <>
$$ ##$F3LIST= <>
$$ ##$FCUCHAN= (0..9)
$$ 0 2 0 0 0 0 0 0 0 0
$$ ##$FL1= 90
$$ ##$FL2= 90
$$ ##$FL3= 90
$$ ##$FL4= 90
$$ ##$FOV= 20
$$ ##$FQ1LIST= <>
$$ ##$FQ2LIST= <>
$$ ##$FQ3LIST= <>
$$ ##$FQ4LIST= <>
$$ ##$FQ5LIST= <>
$$ ##$FQ6LIST= <>
$$ ##$FQ7LIST= <>
$$ ##$FQ8LIST= <>
$$ ##$FRQLO3= 15959.0749999881
$$ ##$FRQLO3N= 2
$$ ##$FS= (0..7)
$$ 83 83 83 83 83 83 83 83
$$ ##$FTLPGN= 0
$$ ##$FW= 125000
$$ ##$FnMODE= 0
$$ ##$FnTYPE= 0
$$ ##$GPNAM= (0..31)
$$ [...]
$$ 130000 130000 130000 130000 130000 130000 130000 130000 130000 130000 130000
$$ 130000 130000 130000 130000 130000 130000 130000 130000 130000 130000 130000
$$ 130000 130000 130000 130000 130000 130000 130000 0 0 0 0 0 0 0 0 0 0 0
$$ 0 0 0 0 0 0 0 0 0 0 0 0 0
$$ ##$ShimPowMaxUC= (0..63)
$$ 130000 130000 130000 130000 130000 130000 130000 130000 130000 130000 130000
$$ 130000 130000 130000 130000 130000 130000 130000 130000 130000 130000 130000
$$ 130000 130000 130000 130000 130000 130000 130000 130000 130000 130000 130000
$$ 130000 130000 130000 130000 130000 130000 130000 0 0 0 0 0 0 0 0 0 0 0
$$ 0 0 0 0 0 0 0 0 0 0 0 0 0
$$ ##$ShimPowMaxUG= (0..63)
$$ 524287 524287 524287 524287 524287 524287 524287 524287 524287 524287 524287
$$ 524287 524287 524287 524287 524287 524287 524287 524287 524287 524287 524287
$$ 524287 524287 524287 524287 524287 524287 524287 524287 524287 524287 524287
$$ 524287 524287 524287 524287 524287 524287 0 0 0 0 0 0 0 0 0 0 0 0 0 0 0
$$ 0 0 0 0 0 0 0 0 0 0
$$ ##$ShimPowRcbType= 3
$$ ##$ShimPowRes= (0..63)
$$ 1e-20 1e-20 1e-20 1e-20 1e-20 1e-20 1e-20 1e-20 1e-20 1e-20 1e-20 1e-20
$$ 1e-20 1e-20 1e-20 1e-20 1e-20 1e-20 1e-20 1e-20 1e-20 1e-20 1e-20 1e-20
$$ 1e-20 1e-20 1e-20 1e-20 1e-20 1e-20 1e-20 1e-20 1e-20 1e-20 1e-20 1e-20
$$ 1e-20 1e-20 1e-20 1e-20 0 0 0 0 0 0 0 0 0 0 0 0 0 0 0 0 0 0 0 0 0 0 0 0
$$ ##$ShimPowRng0= (0..63)
$$ 1 1 1 1 1 1 1 1 1 1 1 1 1 1 1 1 1 1 1 1 1 1 1 1 1 1 1 1 1 1 1 1 1 1 1 1
$$ 1 1 1 1 0 0 0 0 0 0 0 0 0 0 0 0 0 0 0 0 0 0 0 0 0 0 0 0
$$ ##$ShimPowRng1= (0..63)
$$ 1 1 1 1 1 1 1 1 1 1 1 1 1 1 1 1 1 1 1 1 1 1 1 1 1 1 1 1 1 1 1 1 1 1 1 1
$$ 1 1 1 1 0 0 0 0 0 0 0 0 0 0 0 0 0 0 0 0 0 0 0 0 0 0 0 0
$$ ##$ShimPowRng2= (0..63)
$$ 1 1 1 1 1 1 1 1 1 1 1 1 1 1 1 1 1 1 1 1 1 1 1 1 1 1 1 1 1 1 1 1 1 1 1 1
$$ 1 1 1 1 0 0 0 0 0 0 0 0 0 0 0 0 0 0 0 0 0 0 0 0 0 0 0 0
$$ ##$ShimPowRng3= (0..63)
$$ 1 1 1 1 1 1 1 1 1 1 1 1 1 1 1 1 1 1 1 1 1 1 1 1 1 1 1 1 1 1 1 1 1 1 1 1
$$ 1 1 1 1 0 0 0 0 0 0 0 0 0 0 0 0 0 0 0 0 0 0 0 0 0 0 0 0
$$ ##$ShimSysFunc= (0..63)
$$ 1 2 3 4 5 6 7 8 9 10 0 37 38 35 16 15 14 13 12 11 28 27 26 25 24 23 36
$$ 22 30 29 20 21 34 33 32 31 17 18 19 0 0 0 0 0 0 0 0 0 0 0 0 0 0 0 0 0 0
$$ 0 0 0 0 0 0 0
$$ ##$ShimSysMatrix= 0
$$ ##$ShimSysType= 4
$$ ##$TFXNUM= 0
$$ ##$TRIPLO2= 0
$$ ##$VTU= 2
$$ ##$VTUETH= <149.236.99.20>
$$ ##$VTUTY= <no>
$$ ##$WBREFAM= (0..15)
$$ 136.7 118.7 100 100 100 100 100 100 100 100 100 100 100 100 100 100
$$ ##$WBREFLM= (0..15)
$$ 0 0 0 0 0 0 0 0 0 0 0 0 0 0 0 0
$$ ##$WBREFPH= (0..15)
$$ 77.55 -71.28 0 0 0 0 0 0 0 0 0 0 0 0 0 0
$$ ##$WBSGU= (0..15)
$$ 0 0 0 0 0 0 0 0 0 0 0 0 0 0 0 0
$$ ##$XFAC= 2
$$ ##END=
$$ 
##$DECIM=	2496
##$DSPFVS=	20
##XUNITS=	HZ
##YUNITS=	ARBITRARY UNITS
##FIRSTX=	6406.710256386850233
##LASTX=	-1606.1102564336499654
##DELTAX=	-0.12226780365942625795
##XFACTOR=	1
##YFACTOR=	0.0036524083410581355096
##FIRSTY=	6.9441704750061035156
##MINY=	-2.2219066619873046875
##MAXY=	28390.697265625
##NPOINTS=	65536
##XYDATA=	(X++(Y..Y))
$$ [...]
1638A373L5L6qr6r1r1RQl5l6k0k0J9J9n2j41j41n2N5N4O1O0l6l6l6l6J5J4J03J03O0O0O0O0
1634A277O8O8O8O9k5k5K0K0l1l1j79j79j27j27l8l7%%M5M4J7J7J6J7j2j3j2j2por6r5J4J5
1630G23N9O0l7l6l6l6qpqpM1M1M1M1O0O0N9O0m1m1m1m1l0l0l0l0p2p3p2p2K1K0K1K0RQRRk7
1625E87k7k6k7l5l5N4N4N0N1NOk2k2K3K3L6L6n2n2l3l3J2J1j3j3j4j3k3k2O6O6R4R4NNK5K5
1620H66o4o4l1l1l0l1J4J5J4J4J7J7J7J7o4o5k0k1P8P8j1j1j9j9K5K5N2N2k2k2O6O7K2K2Q4
1616A037Q4Q4Q4r9r9L4L5J23J23N0M9M9N0M9M9N0N1J83J84K62K62L94M82O59R55J291J468
1613G943J351J174J271J806K322K412J713L48j125k252k730k730k303j886j483j187r09o13
1611C122m35l45k64j74j15j15r1r1r1r1J3J3J3J2q7q7j32j31j8j8Q6Q6K7K6m7m8q0q0l6l5
$$ plain form
1638 1373 1408 1444 1436 1340 1249 1158 1167 1175 1140 1104 1084 1064 1083 1102 1050 909 768 716 771 825 886 946 910 874 838 802 817 831 934 1037 1097 1157 1217 1277
1634 1277 1345 1413 1481 1550 1525 1500 1520 1540 1509 1478 1299 1120 993 866 828 791 791 791 836 880 897 914 930 947 935 922 910 898 891 885 789 694 708 723
1630 723 782 842 805 769 733 697 689 682 674 667 708 749 790 831 891 951 1010 1070 1029 988 947 906 876 846 816 786 714 641 569 497 518 538 559 579 588 596 605 614 587
1625 587 560 534 507 472 437 491 545 595 646 651 657 635 613 636 659 695 731 679 627 594 561 573 584 571 558 544 531 508 486 552 618 712 806 811 816 841 866
1620 866 802 738 707 676 646 615 629 644 658 672 689 706 723 740 676 611 591 570 648 726 715 704 685 666 691 716 768 820 798 776 842 909 931 953 1037
1616 1037 1121 1205 1289 1190 1091 1125 1160 1283 1406 1456 1505 1554 1604 1653 1702 1752 1803 1986 2170 2432 2694 3088 3570 4229 5184 6475 7943
1613 7943 9294 10468 11739 13545 15867 18279 19992 20340 19215 16963 14233 11503 9200 7314 5831 4644 3735 3122
1611 3122 2687 2342 2078 1904 1789 1674 1583 1492 1401 1310 1323 1336 1349 1361 1274 1187 1055 924 906 888 974 1060 1087 1113 1066 1018 938 858 822 787
1607G87J5J6J6J6j04j03K9L0O9P0l5l4o3o2J2J2N0N1k3k4j8j7j8j8J7J7J7J7OOOOl4l4l5l4
1603F09N6N6N6N5J5J4l0l0N4N3m4m5oQ3Q3pj2j3j8j8l2l2k6k6o4K4P9P8J10J10J16J16O6J55
1598A585J80J79J18J18J21k6k07k96k64j15n5n4j14j14p7J2L6L6NMm0m0K2K3O7O8L5L6l9l8
1595A166o5o5k0k0JJM5M6kkM2M3m5m4m5m4J6J6O0O1J56J57J81K69L33L33K77K77L72N80O86
1591D766N38K39j47m30o37o72o71m57l08k21k20k16j28o0o1n5n5MMLMJ3J4J4J4N5N4N5N4J4
1587A507J3J3J3n9n9n9n9m8m8M2M1J%JJK7K8J76J76J88J88L31L31L83K95K23L71N91O79M54
1584E741O7l76o43p16p16n58m09l31k41j30m2LKn4n5n5n4m1m0m0m0P4P5P4P5m3m3m3m3j0j0
1580A378j0rOPPPKKM6M7R9R9J0RO9O8O8O9O9P0J58J59J56J57K45K46N2N2r6r6k72k71j82j83
$$ plain form
1607 787 802 818 834 850 746 643 672 702 771 841 806 772 709 647 659 671 721 772 749 725 707 690 672 654 671 688 705 722 728 734 740 746 712 678 643 609
1603 609 665 721 777 832 847 861 831 801 855 908 864 819 813 896 979 972 960 947 929 911 879 847 821 795 731 755 834 912 1022 1132 1248 1364 1430 1585
1598 1585 1765 1944 2062 2180 2301 2275 2068 1772 1508 1393 1338 1284 1170 1056 979 991 1027 1063 1068 1072 1032 992 1014 1037 1104 1172 1207 1243 1204 1166
1595 1166 1101 1036 1016 996 997 998 1043 1089 1087 1085 1127 1170 1125 1081 1036 992 1008 1024 1084 1145 1301 1458 1639 1908 2241 2574 2851 3128 3500 4080 4766
1591 4766 5304 5543 5396 4966 4329 3657 2986 2529 2221 2000 1780 1564 1436 1376 1315 1260 1205 1209 1213 1216 1220 1233 1247 1261 1275 1330 1384 1439 1493 1507
1587 1507 1520 1533 1546 1487 1428 1369 1310 1262 1214 1256 1297 1298 1298 1299 1300 1327 1355 1531 1707 1895 2083 2414 2745 3128 3423 3646 4017 4608 5287 5741
1584 5741 5808 5432 4789 4073 3357 2799 2390 2059 1818 1688 1646 1649 1651 1597 1542 1487 1433 1392 1352 1312 1272 1346 1421 1495 1570 1527 1484 1441 1398 1388 1378
1580 1378 1368 1359 1365 1372 1379 1386 1388 1390 1436 1483 1582 1681 1691 1700 1769 1837 1905 1974 2043 2113 2271 2430 2586 2743 2988 3234 3286 3338 3242 3146 2874 2603 2421 2238
1576B238q8q8j33j33q4q3NNrj0P9P9J26J25Q1Q1m5m5j%m1m0M9M8P5P5L1L1l2l1l2l1l3l2l3
1571B104l2O2O2J51J51N4N3N3N4k9k8k8k9k4k4J5J04P4P4Q0P9J36J37J36J36O0O0O6O6O4J54
1568C991K46K46J79R0qql3l3l3l3l3l2J2J2O9O8k1k0P1P1P1P1Q1Q2J70J71N7N8N7N8J66J66
1564F009J66J65Q9Q8Q8Q8J5J6J6J5K5K5J73J74J51J52J51J51J48J48K40L30L22K34K00K00
1561I579J96J95K35K34J40N1N1J40J95J94K01K00K16K17K17K17J96J96J97J96J27J27J67K55
1558A3939K97K96L07L95M71O19P53Q42Q02P13N25L78L33L33M72M72M46M46L57L57L21L21M69
1555B4664M69O53O53P04P03P23Q11J014J161J282J429J685K012K225K373K654K981L274L659
1552E5129M184M748N060N060M681M414M660N579O829P510P165O244N815O438P609Q291P928
$$ plain form
1576 2238 2150 2062 1929 1796 1712 1629 1634 1639 1630 1620 1699 1778 1904 2029 2110 2191 2146 2101 2100 2100 2059 2019 2068 2116 2191 2266 2297 2328 2296 2265 2233 2202 2169 2137 2104
1571 2104 2072 2134 2196 2347 2498 2552 2605 2658 2712 2683 2655 2627 2598 2574 2550 2565 2669 2743 2817 2897 2976 3112 3249 3385 3521 3581 3641 3707 3773 3837 3991
1568 3991 4237 4483 4662 4752 4744 4736 4703 4670 4637 4604 4571 4539 4551 4563 4632 4700 4679 4659 4730 4801 4872 4943 5024 5106 5276 5447 5504 5562 5619 5677 5843 6009
1564 6009 6175 6340 6429 6517 6605 6693 6708 6724 6740 6755 6780 6805 6978 7152 7303 7455 7606 7757 7905 8053 8293 8623 8945 9179 9379 9579
1561 9579 9775 9970 10205 10439 10579 10630 10681 10821 11016 11210 11411 11611 11827 12044 12261 12478 12674 12870 13067 13263 13390 13517 13684 13939
1558 13939 14236 14532 14839 15234 15705 16324 17077 17919 18721 19434 19959 20337 20670 21003 21475 21947 22393 22839 23196 23553 23874 24195 24664
1555 24664 25133 25786 26439 27143 27846 28569 29380 30394 31555 32837 34266 35951 37963 40188 42561 45215 48196 51470 55129
1552 55129 59313 64061 69121 74181 78862 83276 87936 93515 100344 107854 115019 121263 127078 133516 141125 149416 157344
1550A57344O890O189O515P950R937J2172J4752J8244K3730L2159M4289O1584Q8718J31435
1549F21908J88105K41728K67319K57400K40526K64243L47957M48786M80427L75476J38270
1547C872145j54826m04309n43667n64218n01583m04109l07892k29100j69725j25866r2872
1546C73978o7458m8001l3974k4459j8143j3777j0840r066p790o679n997n974o538p144p706
1544A00432q102q101p572o535n333m236l629l628m293m857m811m069k947j848j009n64n57
1542B8341p05o98m30p1P7L1k95p11j036j026q77o53m45l23l22n54q81r01o34l24j76j64j64
1539A7059k44k44l32l33o0o1P5J63R2n7l39o06q80j028j046r56p94p05o78n90n31m41l70k80
1536F814k37k36j69j70q0q1r4r3r4r4l5l5J72J72L50L50M03M03M83O30P27P27M40nn36q63
$$ plain form
1550 157344 164234 170423 176938 184888 194825 206997 221749 239993 263723 295882 340171 401755 490473 621908
1549 621908 810013 1051741 1319060 1576460 1816986 2081229 2429186 2877972 3358399 3733875 3872145
1547 3872145 3717319 3313010 2769343 2205125 1703542 1299433 991541 762441 592716 466850 373978
1546 373978 306520 258519 224545 200086 181943 168166 157326 148260 140470 133791 127794 121820 115282 108138 100432
1544 100432 92330 84229 76657 70122 64789 60553 56924 53296 49003 44146 39335 35266 32319 30471 29462 28898 28341
1542 28341 27636 26938 26508 26437 26514 26545 26250 25539 24503 23477 22600 21947 21502 21179 20857 20303 19422 18521 17887 17563 17387 17223 17059
1539 17059 16815 16571 16239 15906 15846 15785 15860 16023 16115 16058 15719 15113 14233 13205 12159 11203 10409 9704 9026 8436 7905 7464 7094 6814
1536 6814 6577 6341 6172 6002 5922 5841 5747 5654 5560 5466 5431 5396 5568 5740 6090 6440 6843 7246 7729 8359 9086 9813 10253 10248 9712 8849
1533H849r26p18n45l95k32q3J7J06K51N17Q46J112J168J167J088J177J619K302K613K109Q57
1531B2899p15j980k542k391j946j471j026o13j09K95N03L66k0n77j023j234j235j036q29o30
1528D686l62j65p5MLN4N3q1q0k89k88k53k52j64j64q7q7j31j31j6j5j6j5m7m7r1r2q8q7O0
1524A737O1j8j7K7K7Q6Q5Q6Q5m1m2m1m2j04j05j04j05j10j10L8L8O6O6O6O6n5n4n5n4J8J9
1521A514J8J9p6p6p6p6q0q0QRk3k3k3k3K3K2K3K2j0j0r8r9K5K6P0P1J3J4J4J3m6m7m6m7k0
1516I25k1k1k0L5L5L5L5j3j4j3j3LLLLk5k5k4k5l0l1N9N9L3L2L3L3l5l6N4N4l8l7l7l7k9k9
1512H81k9k9j6j5P3P3k3k3k3k3M4M4m5m5NNNOj2j1j2j1OPOPj6j5P3P3M1M1m8m8n3n4L5L6K2
1507I32K3K2K3m3m2m3m2k5k6k5k5ppopJ5J5J5J5L6L7L6L6j2j3JM6O6k3j13j13m5M3K4k1j8
$$ plain form
1533 8849 7923 7205 6660 6265 6033 5950 5967 6073 6324 6841 7687 8799 9967 11134 12222 13399 15018 17320 19933 22042 22899
1531 22899 22184 20204 17662 15271 13325 11854 10828 10215 10106 10401 10904 11270 11250 10673 9650 8416 7181 6145 5316 4686
1528 4686 4324 4159 4084 4088 4091 4145 4198 4117 4037 3748 3460 3207 2955 2791 2627 2540 2453 2322 2191 2175 2160 2144 2129 2082 2035 1944 1852 1764 1677 1737
1524 1737 1798 1780 1763 1790 1817 1903 1988 2074 2159 2118 2076 2035 1993 1889 1784 1680 1575 1465 1355 1393 1431 1497 1563 1629 1695 1640 1586 1531 1477 1495 1514
1521 1514 1532 1551 1475 1399 1323 1247 1167 1087 1095 1104 1081 1058 1035 1012 1035 1057 1080 1102 1092 1082 984 885 910 936 1006 1077 1090 1104 1118 1131 1085 1038 992 945 925
1516 925 904 883 863 898 933 968 1003 990 976 963 950 953 956 959 962 937 912 888 863 833 802 861 920 953 985 1018 1051 1016 980 1034 1088 1050 1013 976 939 910 881
1512 881 852 823 807 792 865 938 915 892 869 846 890 934 889 844 849 854 859 865 853 842 830 819 825 832 838 845 829 814 887 960 1001 1042 994 946 893 839 874 910 932
1507 932 955 977 1000 957 915 872 830 805 779 754 729 722 715 709 702 717 732 747 762 798 835 871 907 895 882 883 929 995 972 859 746 701 744 768 747 729
1503G29P0M5JrL6L3j2k9k9J3J2q1q1QQK4K3K4K4l9m0l9l9j3j3j3j4N4N3N3N3J2J2J3J2L8L8
1498I37L8L8J%%%l6l6QRJ8J9J08J07J0RRRj8j9P1P0mnQ4Q5Q6Q6Q6Q6L0L0J15J16P5L1R4J84
1494B531J57J56K07K06K03K03K87K86K24J35J79K68L33L32N27P94R56J164J553K176K869L492
1491A9238M126M867N513N958O281O489O384N762M557K689L27k193m502o193p171p557p408
1489C7167o786n929m951l984l123k386j822j374r89p02n55l71k23j23j23j13j14j43j42j43
1486C071j43j61j62j61j61j21j21j70q2m6m7m1m1O3O2N7N6O9k0k1O9J76J77J42J43K57L46
1483C190M00O07R04J112J174J173J342J609J830J918J787J401P82p7r79j779k253k402k195
1481I544j809j408j083p78o30n31m41l36k48j43j44p3p3j18j18p5p4l1l0n1n0j40j39n9n9
$$ plain form
1503 729 799 844 845 836 872 905 893 864 835 848 860 779 698 706 714 738 761 785 809 770 730 691 652 639 626 613 599 653 706 759 812 824 836 849 861 899 937
1498 937 975 1013 1014 1014 1014 1014 978 942 950 959 977 996 1104 1211 1221 1230 1239 1248 1230 1211 1282 1352 1348 1343 1427 1512 1598 1684 1770 1856 1886 1916 2031 2147 2222 2253 2347 2531
1494 2531 2688 2844 3051 3257 3460 3663 3950 4236 4460 4595 4774 5042 5375 5707 6234 7028 7984 9148 10701 12877 15746 19238
1491 19238 23364 28231 33744 39702 45983 52472 58856 64618 69175 71864 72191 69998 65496 59303 52132 44575 37167
1489 37167 30381 24452 19501 15517 12394 10008 8186 6812 5823 5121 4566 4195 3972 3849 3726 3613 3499 3356 3214 3071
1486 3071 2928 2767 2605 2444 2283 2162 2041 1871 1789 1743 1696 1655 1614 1677 1739 1796 1852 1921 1901 1880 1949 2125 2302 2444 2587 2844 3190
1483 3190 3590 4197 5101 6213 7387 8560 9902 11511 13341 15259 17046 18447 19229 19152 18173 16394 14141 11739 9544
1481 9544 7735 6327 5244 4466 3836 3305 2864 2528 2280 2137 1993 1920 1847 1729 1611 1536 1462 1431 1401 1350 1300 1160 1021 962 903
1478I03L0L0L9L9j09j09n6n6n1n0qQ2M3m6r1lN5J1o1o1K5K5J1J2J2J2J7J7J7J8LLLLOOOOm1
1473F92m2LMlkr2r1k1k1K4K4J9J9J9J9J2J3J2J3M8M7M8M8Q3Q3M4m5p6p6QQm1m1q6q6l9m0N
1468D93Nl3l3l3l3k4k5N9N9K3o5m0ML5L5L7L8ononL2L3L2L3j5j5n9n9o9o8K0K0O5O4J7J8n
1464E24n0p5J5O6O6L6n3r1m7J1J2NMMNJ0J0J0J0J2J2J1J2L1L0L0L1m8m8m8m9QPl7l7l0k9M4
1459C74M4L7L7o7o7opO7O8N9N9m4m5J1J1J0J1j5j5j5j5P0P1o3o3klRq1r4nM3M3JKm4m3qqq
1454C09pl2l1M3M3k2k3K1K2L2L2m3m2MLLMkjjjJ6J7J7J7rj0rrrrrrJ0J0RJ0RRJ0RK5K5K5K5
1449D81n5n4K0K0noM4J31R0%p8p8k7k8k7k8qqrqJ3J2l3l2m4m5O0N9L2L1L2L1m0m1m1m1ppq
1444B98pK3K3K1K0k3o8n1L8J08O3m0m0N8N8J3J3m8m8q7q7j9P1J15K6n5n6J4J3lkp7p6K8K8
$$ plain form
1478 903 933 963 1002 1041 932 823 767 711 660 610 602 684 727 681 590 587 642 653 592 531 556 581 592 604 616 628 645 662 679 697 700 703 706 709 715 721 727 733 692
1473 692 650 653 657 654 652 560 469 448 427 451 475 494 513 532 551 563 576 588 601 649 696 744 792 875 958 1002 957 881 805 813 821 780 739 653 567 528 488 493
1468 493 498 465 432 399 366 342 317 376 435 458 393 353 357 392 427 464 502 496 491 485 480 512 545 577 610 595 580 521 462 393 325 345 365 430 494 511 529 524
1464 524 474 399 414 480 546 582 529 438 391 402 414 419 423 427 432 442 452 462 472 484 496 507 519 550 580 610 641 593 545 497 448 456 463 426 389 359 330 374
1459 374 418 455 492 425 358 352 345 412 480 539 598 554 509 520 531 541 552 537 522 507 492 562 633 570 507 505 502 511 430 336 331 374 417 418 420 376 333 325 317 309
1454 309 302 270 239 282 325 303 280 301 323 355 387 344 302 306 309 312 316 314 313 312 311 327 344 361 378 369 359 350 341 332 323 314 305 315 325 334 344 353 362 372 381 406 431 456 481
1449 481 426 372 392 412 407 401 445 576 666 666 588 510 483 455 428 400 392 384 375 367 380 392 359 327 283 238 298 357 389 420 452 483 443 402 361 320 313 306 298
1444 298 291 314 337 358 378 355 287 236 274 382 445 405 365 423 481 494 507 459 411 324 237 218 289 404 430 375 319 333 346 343 341 264 188 216 244
1439B44K8K8klklJ0J0RJ0kjMMJ5J04P9L4j9k0k2k2ONo7j13n3L5L5n4m2LM6M6RJ0J0J0n7n7
1435B55j2j3N7N7L5n3n7j2KKk5k4K0K1K0K0K0K1j%%%k1k0K4K4k4k5M7M8J0l5o2K7O2J7n6n5
1430B94J6J7J6J7J0J0J0J0k8k8k9k8K7K8K7K7jjj%j2j2j2j2j5j4j4j4M2M1M2M1K1K1J7J8j1
1425E20n7J2Q5J16M1o1o0j0j0rj0pqpqn7n8n3n3l9L6Q2Q2m0m1m1m1onooK8K8K8K7k5k5k5k5
1421B92popoJ0J1J1J0qpqqJ4J4J4J4nnmnl7l7l8l7LMLLK8K8P3kl5J0k1k0l3l3N6N6J7J7J7
1415C36J7lkl2J3Qo6o4J1K5K6L0L1P5P6L1m3n5j0m0m0ONONK3K2K2K3L6L6oq0j06l1P1P1m7
1411C80m7m7m7K1K1K0K1K1K0K1K1m9n0m9m9K2K1K1K2k8k8k7k8M3M2M3M3M7M7M7M7m4m3m4m4
1406C67M7M7m2m2QQQQJ7J7J6J7N0N0N0N0k5k5k6k5j01j02j2j2rrrqj5j4j5j4J9J9J9K0J9J9
$$ plain form
1439 244 272 300 298 295 293 290 300 310 319 329 327 326 330 334 349 453 532 566 547 527 505 483 489 494 427 314 261 296 331 277 235 238 284 330 339 349 359 369 312 255
1435 255 243 230 287 344 379 326 269 257 259 261 236 212 232 253 273 293 313 334 333 333 333 333 312 292 316 340 316 291 338 386 396 361 299 326 388 405 349 294
1430 294 310 327 343 360 370 380 390 400 372 344 315 287 314 342 369 396 395 394 393 393 381 369 357 345 330 316 302 288 330 371 413 454 475 496 513 531 520
1425 520 463 475 560 676 717 656 596 586 576 567 557 550 542 535 527 470 412 359 306 267 303 385 467 427 386 345 304 298 293 287 281 309 337 365 392 367 342 317 292
1421 292 285 279 272 266 276 287 298 308 300 293 285 277 291 305 319 333 328 323 319 314 277 240 202 165 168 172 175 178 206 234 307 305 270 280 259 239 206 173 229 285 302 319 336
1415 336 353 350 348 316 329 337 271 207 218 243 269 299 330 405 481 512 469 414 404 364 324 330 335 341 346 369 391 413 436 472 508 502 422 316 285 356 427 380
1411 380 333 286 239 260 281 301 322 343 363 384 405 356 306 257 208 230 251 272 294 266 238 211 183 226 268 311 354 401 448 495 542 498 455 411 367
1406 367 414 461 419 377 385 393 401 409 426 443 459 476 526 576 626 676 651 626 600 575 474 372 360 348 339 330 321 313 298 284 269 255 274 293 312 332 351 370
1402C70J9J9JJJJm9m9M0M0qqrqk9k9k6k6j2L2N3k1m4K9J14L9o5o6P8P8jkQ8Q7J2J3J2J2m7
1397F40m7m7m7j9j9O9P0O8O8O8O8R0Q9Q5Q5M7k9l2M1K5m9mln6n6n6n6n5n6n9n8k9p3r5k1j9
1393E28r4q8j5J5J5p0o9M0L9M0M0QQQQJ5J4J5J4mmmmj6j5j5j6mnmmpol6QL0m4m5L0K5j9j4
1387B98L0J5J5J8J8L4L3n5n5NOOON1N1N0N1j2j2j2j3l3l4l4l4k2k3k3k2NOONL5L6m8m9o9J9
1383B49N9N8j0j0j0j0MMLMm6m6L8L7Kq6l7l6L3L4L4L4L4L3L4L3K3K2K3K2P5P5P4P5m2m2j31
1378F10j31l1l0l0l1j5j6P4P3j2j2j2j2ppopl7l7l8l7M8M8M7M8MMNMm4m5m4m4rj0rrM6M6M7
1373C82M6J1J2J2J2K4K5K5K4K4K4o6o5j6j5j5j6QPQPk7k8k8k7ppQ2Q3L2L2L2L2k2k2k2k2J8
1369E57J9J9J8R8R8R7R8R6R6R6R5M6M5J38K26K29J40J26J70K23K23J37J37K18K17K18K18R9
$$ plain form
1402 370 389 408 409 410 411 412 363 314 354 394 386 378 369 361 332 303 277 251 239 271 324 303 259 288 402 441 376 310 388 466 465 463 551 638 650 663 675 687 640
1397 640 593 546 499 480 461 530 600 668 736 804 872 962 1051 1136 1221 1268 1239 1207 1248 1273 1224 1220 1217 1161 1105 1049 993 938 882 823 765 736 663 568 547 528
1393 528 434 346 331 346 361 291 222 262 301 341 381 389 397 405 413 428 442 457 471 467 463 459 455 439 424 409 393 389 384 380 376 369 363 327 335 365 321 276 306 331 312 298
1387 298 328 343 358 376 394 428 461 406 351 356 362 368 374 425 476 526 577 565 553 541 528 495 461 427 393 371 348 325 303 308 314 320 325 360 396 348 299 230 249
1383 249 308 366 356 346 336 326 330 334 337 341 295 249 287 324 326 240 203 167 200 234 268 302 336 369 403 436 459 481 504 526 601 676 750 825 783 741 610
1378 610 479 448 418 388 357 342 326 400 473 461 449 437 425 418 411 405 398 361 324 286 249 297 345 392 440 444 448 453 457 413 368 324 280 271 261 252 243 289 335 382
1373 382 428 439 451 463 475 499 524 549 573 597 621 555 490 474 459 444 428 436 443 451 458 431 403 375 348 341 334 416 499 531 563 595 627 605 583 561 539 557
1369 557 576 595 613 711 809 906 1004 1100 1196 1292 1387 1433 1478 1616 1842 2071 2211 2337 2507 2730 2953 3090 3227 3445 3662 3880 4098 4197
1365D197J00R5R4Q9jl9l9q0q1j70j69j00j00j45j44j58j58j58j57j87j86j87j86j45j45j45
1362A695j45m5m5m5m5J9K0J9K0rqL1J19J31J31J95K40K43J54O5O4J19K08K00J99J37R2O1J51
1359C971J86R8NNK2K3o6o7q4q4j28j29j20j20j20j20k18k17k18k17j40j39j40j40j05j06j05
1355A527j05j24j24j24j24q5q5q5q5%%%Jm4m4j3n8o7K2Q3L8m7m8L3L3j7j06o2K8QQl2l1k5
1351B46k6O4O3O1O0k9k8NMN0M9l7l6PQJ2J3p7p6m5m4J%K5K6K5K5KKJKK1K2k4k3K7K8o2o1M6
1346C27M6JKM9M9l9m0m6m5m5m6nnL9L9N9N9l0l1k3k4O6O5L0K9j5j5L6L7n2n3m7m7M3M2k2k2
1342C66o6o6J7J7O2O2LLMLn7n7n7n7K7K6K7K7N1N0l8l8KKLKl0k9k9l0K5K4K4K4M3M3M3M3k2
1337D47k1k1k1K7K7K7K7J9K0J9J9QRo6o6j3j3L2L2OOo9o8m7m7lkK3K4K3K4%JJ%j0j1j0j0j6
$$ plain form
1365 4197 4297 4392 4486 4575 4574 4535 4496 4416 4335 4165 3996 3896 3796 3651 3507 3349 3191 3033 2876 2689 2503 2316 2130 1985 1840 1695
1362 1695 1550 1505 1460 1415 1370 1389 1409 1428 1448 1439 1431 1462 1581 1712 1843 2038 2278 2521 2675 2740 2804 2923 3131 3331 3530 3667 3759 3820 3971
1359 3971 4157 4255 4260 4265 4287 4310 4244 4177 4093 4009 3881 3752 3632 3512 3392 3272 3054 2837 2619 2402 2262 2123 1983 1843 1738 1632 1527
1355 1527 1422 1298 1174 1050 926 841 756 671 586 586 586 586 587 543 499 486 428 361 383 466 504 457 409 442 475 458 352 290 318 326 334 302 271 246
1351 246 220 284 347 408 468 439 411 416 420 470 519 482 446 453 461 473 486 409 333 288 244 245 245 270 296 321 346 348 350 351 353 374 396 372 349 376 404 342 281 327
1346 327 373 374 376 425 474 435 395 349 304 259 213 208 203 242 281 340 399 369 338 315 291 357 422 452 481 466 451 487 524 472 419 372 325 368 410 388 366
1342 366 300 234 251 268 330 392 395 398 402 405 348 291 234 177 204 230 257 284 335 385 347 309 311 313 316 318 288 259 230 200 225 249 273 297 340 383 426 469 447
1337 447 426 405 384 411 438 465 492 511 531 550 569 577 586 520 454 441 428 460 492 498 504 435 367 320 273 270 268 291 315 338 362 362 363 364 364 354 343 333 323 307
1332C07j5j5j5J8J8J8J8J3J3J3J3k3k3k3k3k1k2N3N3O7O6K3K2l8l7L6L7l4l4P0P0M6M7q8q7
1328E23q4q3j0rK0K0k4k4l1l1J4J4LLLMo4o4M1M0j4j4j4j4J9J8J9J8L2L2L3L2rqn3n3p5p6
1323A34jjO5O4K1K0M2M2M2M2k7k7k6k7l8l9L6L5l9m0L5L5L2L3j2j2mlJ1N6M3l1q6m1ml%jL7
1318C63L6pqK5K6m9m9oooommP0P0%%%%m8m8K3K3Ol9n5J9N6N6m3m4OPOO%JJ%n2n2N2N1j8j7
1313C42K6K7J9J9n5n6p1p1MLM2M2M2M2n2n3PQ1P7L2j2j3k2k3o7o7LKm2m3mmM0M0K7K7K7K7
1308C43K9L0K9L0K1K2K1K1k9l0k9l0l7l7L7L7opn1n1k9k9M5Q9Q5J0m9m8J3J3J3J4JJJKk1k1
1303D03k1k1K3K3R6R7N5N5N5N5K6K6K6K6Q1Q1Q1Q1Q6Q6J3J2K7K8q6j75j08j08j13j14k9k9
1300G38k9k9j8j8j8j8J1J2J2J2poppJ9J9J9J8L0L0L0L0R9J00R9J00J18J18J29M0NR4K08K07
$$ plain form
1332 307 292 277 262 280 298 316 334 347 360 373 386 363 340 317 294 273 251 304 357 424 490 513 535 497 460 496 533 499 465 535 605 651 698 610 523
1328 523 439 356 346 337 357 377 353 329 298 267 281 295 298 301 304 308 244 180 221 261 247 233 219 205 224 242 261 279 311 343 376 408 399 391 338 285 210 134
1323 134 133 132 197 261 282 302 344 386 428 470 443 416 390 363 325 286 322 357 318 278 313 348 380 413 401 389 385 382 393 449 492 461 375 334 330 327 327 326 363
1318 363 399 392 384 409 435 386 337 331 325 319 313 309 305 375 445 445 445 445 445 397 349 372 395 401 362 307 326 382 438 395 351 357 364 370 376 376 377 378 378 326 274 326 377 359 342
1313 342 368 395 414 433 378 322 251 180 184 187 229 271 313 355 303 250 257 338 415 447 435 422 400 377 310 243 246 248 206 163 159 155 195 235 262 289 316 343
1308 343 372 402 431 461 482 504 525 546 517 487 458 428 391 354 391 428 422 415 364 313 284 255 300 389 474 484 435 387 400 413 426 440 441 442 443 445 424 403
1303 403 382 361 384 407 503 600 655 710 765 820 846 872 898 924 1005 1086 1167 1248 1334 1420 1433 1445 1472 1500 1414 1239 1131 1023 910 796 767 738
1300 738 709 680 662 644 626 608 619 631 643 655 648 642 635 628 647 666 685 703 733 763 793 823 922 1022 1121 1221 1339 1457 1586 1626 1631 1725 1933 2140
1295B140K61L50M34M33M60M60N29N29N54M66L37J90m6j93l28m16m59n47o02o01n41m51l59
1293B600k70j84j83j34j34m4m4m4m5q5q5P3P2L3n7opR4R3R4R3L9L9Q3Q3J22J21J51K40K90
1289B998L80M80O27P47Q35R14J061J229J377J453J453J313J104Q29N02J43l02o84j010j269
1287A4180j418j534j535j470j262j057q49o99n51m14l24k41j51j22j22j05j05K9K8L6L7qr
1284B334l6l6J8J07O7O7O7J56J88J88J50K38L85M74N55O45Q47J055J240J448J619J827J903
1281A5506J903J838J630J328Q84M03j01o60j165j627j895k058k147k102j954j746j419j081
1279E537p55n61m73l49k59j95j95k24j36k2k2p1p1p7J3LLRRL7L7L7L7R3R3J22K11K71L60L81
1275C843M71N71P79R38J027J140J289J428J427J414J325J156Q89M88M3m43q28j126j392j560
$$ plain form
1295 2140 2401 2751 3185 3618 4078 4538 5067 5596 6150 6616 6953 7143 7097 6904 6576 6160 5701 5154 4552 3951 3410 2959 2600
1293 2600 2330 2146 1963 1829 1695 1651 1607 1563 1518 1433 1348 1421 1493 1526 1469 1463 1456 1550 1643 1737 1830 1869 1908 1991 2074 2196 2317 2468 2708 2998
1289 2998 3378 3858 4485 5232 6067 6981 8042 9271 10648 12101 13554 14867 15971 16800 17302 17445 17143 16459 15449 14180
1287 14180 12762 11228 9693 8223 6961 5904 5055 4356 3805 3391 3067 2826 2675 2553 2431 2326 2221 2250 2278 2314 2351 2343 2334
1284 2334 2298 2262 2280 2387 2454 2521 2588 2744 2932 3120 3270 3508 3893 4367 4922 5567 6414 7469 8709 10157 11776 13603 15506
1281 15506 17409 19247 20877 22205 23089 23492 23391 22731 21566 19939 18044 15986 13839 11737 9783 8037 6618 5537
1279 5537 4782 4221 3748 3399 3140 2945 2750 2526 2390 2368 2346 2275 2204 2127 2140 2143 2146 2155 2164 2201 2238 2275 2312 2405 2498 2620 2831 3102 3462 3843
1275 3843 4314 4885 5664 6602 7629 8769 10058 11486 12913 14327 15652 16808 17697 18185 18228 17785 16957 15831 14439 12879
1273A2879j708j714j566j322j114q99p51n73m25k83j94j46j47r7r6n3n2j18j17k8k9k5k6J9
1270A415J9j0j0m8m9J6J06N5N5L1L1J30K18K46K46L50M39N43N43O32O33N45M56M00M01K63
1266G656mj95k84l58m47n60o49o55o55o22n33m36m37l07j58q6q7j60j60p7J2OPk7k8J7J8n1
1263G40n0n1n0j4j4L1L1N6N6J6p2p3p4J0J0L6L6J24J25J14J14K5K5J03J04J04J03M0L9nnm4
1259A590m5j34j34j02j02j02j02j49j50j10k2k4k3K6K6M1M1m8m9klM1M2rj0n4n3k5k4J9K0
1255C70l3l4l4l4k2k1k2k2K7K6K7K6M8M9M8M9j5j5j4j5k1k1k1k1lklklklkK3K3K4K3J3J4J3
1251D18J3o2o2o2o1llM2M2R5R5n4n3k1k0O8O9J6J5k8k9nmmmqppp%J%%nnnoMLq5q6L0K9P4P4
1245C92KLm2m1o0n9o0n9ppL7L7Q4Q3noMLM8M8j6j6j6j6k3k3k3k2K5K5m8m9P0P0nmm8m8llP
$$ plain form
1273 12879 11171 9457 7891 6569 5455 4556 3805 3232 2807 2524 2330 2184 2037 1940 1844 1791 1739 1621 1504 1476 1447 1422 1396 1415
1270 1415 1434 1424 1414 1366 1317 1333 1439 1494 1549 1580 1611 1741 1959 2205 2451 2801 3240 3783 4326 4958 5591 6136 6592 6992 7393 7656
1266 7656 7652 7457 7173 6815 6368 5808 5159 4504 3849 3227 2694 2258 1821 1514 1356 1270 1183 1023 863 786 798 804 811 784 756 773 791 740
1263 740 690 639 589 575 561 592 623 679 735 751 679 606 532 542 552 588 624 748 873 987 1101 1126 1151 1254 1358 1462 1565 1605 1644 1639 1634 1590
1259 1590 1545 1411 1277 1175 1073 971 869 720 570 460 438 414 391 417 443 484 525 477 428 426 423 464 506 497 487 433 380 355 331 350 370
1255 370 337 303 269 235 213 192 170 148 175 201 228 254 302 351 399 448 433 418 404 389 368 347 326 305 302 300 297 295 292 290 287 285 308 331 355 378 391 405 418
1251 418 431 369 307 245 184 181 178 220 262 357 452 398 345 324 304 372 441 457 472 444 415 410 406 402 398 390 383 376 369 369 370 370 370 365 360 355 349 353 356 271 185 215 244 318 392
1245 392 394 397 355 314 254 195 135 76 69 62 99 136 220 303 298 292 296 299 347 395 379 363 347 331 308 285 262 240 265 290 242 193 263 333 328 324 276 228 225 222 229
1240B29PPPl1l1l1l1lkllM6M6M5M6l4l5l4l4K2K1K2K2j4j4j3j4j9k0N0M9Q0rl4l3P4P4K0o8
1235C57kkk6j15p2J7N5l3q1q0j2j1O3O4O4O4j1j0j1j1K0K0K0K0n0n1K4K3N3N2QQn6n5l1N8
1231B70M3M3p9q0n7L1N6N6N0N0k4k5mmm9m8lkklJ6J5J5J6P4P3mr3n1L7j2j2k3O6O2q7j11q
1226A92Q3L8m8m9ppl5l5J0J0LLM8M8L1L1L2L1n1n1K3K3K2K2k2k3RRl2l3O8J12P4l0o5k1qp
1222C98oonor5r5RJ0J2J2J3J2ppn1n2m2m2L1L2O3O2j1j2NONNM2M2M1M2l4l4l4l4J4J4J4J4
1217C25POPPj3j3j3j3P6P7j3q6j28q2mM0K4K4m7m8l6l6R7R8N5N5j9j9k5k4k5k5NMMMk2k2N3
1212B55N2J9K0k5k5O3O3J8J9l4l3l4l3J9J9K0J9%J%%L4L4L3L4l6l6l2l1m0L4L7l7n3rL6L5
1207D06m4m4m4m4K3K4K3K3n1n1N3N2J9J9n5n5p1p1O2O3ooooL3L3L3L3j1j2n5n6m1m2L2L3P9
$$ plain form
1240 229 236 243 250 219 188 157 126 123 121 118 115 161 207 252 298 264 229 195 161 183 204 226 248 234 220 207 193 174 154 204 253 333 324 290 257 331 405 425 357
1235 357 355 353 327 212 140 157 212 179 98 18 6 -5 58 122 186 250 239 229 218 207 227 247 267 287 237 186 210 233 286 338 346 354 298 243 212 270
1231 270 313 356 277 197 140 171 227 283 333 383 359 334 330 326 277 229 226 224 222 219 235 250 265 281 355 428 424 331 280 317 305 293 270 336 398 311 200 192
1226 192 275 313 265 216 209 202 167 132 142 152 155 158 206 254 285 316 348 379 328 277 300 323 345 367 345 322 331 340 308 275 343 455 529 499 434 413 405 398
1222 398 392 386 381 375 280 185 194 204 216 228 241 253 246 239 188 136 94 52 83 115 178 240 229 217 222 228 233 238 280 322 363 405 371 337 303 269 283 297 311 325
1217 325 332 338 345 352 339 326 313 300 376 453 440 354 226 144 140 180 204 228 181 133 97 61 158 256 311 366 347 328 303 279 254 229 234 238 242 246 224 202 255
1212 255 307 326 346 321 296 359 422 440 459 425 392 358 325 344 363 383 402 402 403 403 403 437 471 504 538 502 466 434 403 363 397 434 397 344 335 371 406
1207 406 362 318 274 230 253 277 300 323 272 221 274 326 345 364 309 254 183 112 174 237 231 225 219 213 246 279 312 345 334 322 267 211 170 128 160 193 272
1203B72P9L4L4n1n1K4K3J4J5l0l0K0K1K1K1k0k1K4K4N7N6j7j8o0o1l0M3O8K3k1k2J%m4m3l8
1198C17l7PPL8L9L9L8k6k6k7k6M5M5k9k9l8l9OPK5K6K5K6j2j1R2R3L5L6L6L5N9N9j6j5O4O5
1194I33J3p6q5m2K7K6J9p0j20p5jkJJl0k9l0l0k9l0l0l0K1K0K0K0l6l5l3l3L0P5R9J1%Jon
1189D60L4L4L4L4R4R4R5R4O5O5J39J39J49J48M6JJ6J06N8l0j33j32j33j32j27l7l5j24j42
1186H80r8NNk5k6k6k5o0o0M3M4l6l6L6L5j3n7l8N2R2R3R8R9j9j8j9j8J3J2N7N7O5O4J98J98
1181A572J51J51J51J50K07K06J80R0L4j1ONk0o4j23k12k67k67j25j24r1r2rql2j20j21l1M8
1178A234M8M8M9j6j04j05j5N5N5k9k8J4J4J02J03K1K1K2K1L0L1L1L1M2M1M2M2Q3Q3Q4Q3J31
1174B264J31J32J31K8K8K2K2q7j76j26j26j03j03j04j03j29j29j30j29m1m0m1m1J5J5RRk8
$$ plain form
1203 272 351 385 419 368 317 341 364 378 393 363 333 353 374 395 416 396 375 399 423 480 536 519 501 441 380 350 393 461 484 463 441 442 442 398 355 317
1198 317 280 287 294 332 371 410 448 422 396 369 343 388 433 404 375 337 298 304 311 336 362 387 413 401 390 482 575 610 646 682 717 776 835 819 804 868 933
1194 933 946 870 785 743 770 796 815 745 625 550 549 547 548 549 519 490 460 430 401 371 341 311 332 352 372 392 356 321 288 255 285 360 459 470 470 471 465 460
1189 460 494 528 562 596 690 784 879 973 1038 1103 1242 1381 1530 1678 1724 1725 1741 1847 1905 1875 1742 1610 1477 1345 1218 1181 1146 1022 880
1186 880 782 787 792 767 741 715 690 630 570 613 657 621 585 621 656 643 586 548 600 692 785 883 982 963 945 926 908 921 933 990 1047 1112 1176 1374 1572
1181 1572 1723 1874 2025 2175 2382 2588 2768 2858 2892 2881 2887 2892 2872 2808 2685 2473 2206 1939 1814 1690 1599 1507 1498 1490 1458 1338 1217 1186 1234
1178 1234 1282 1330 1379 1363 1259 1154 1139 1194 1249 1220 1192 1206 1220 1322 1425 1446 1467 1489 1510 1540 1571 1602 1633 1675 1716 1758 1800 1883 1966 2050 2133 2264
1174 2264 2395 2527 2658 2686 2714 2736 2758 2671 2495 2369 2243 2140 2037 1933 1830 1701 1572 1442 1313 1272 1232 1191 1150 1165 1180 1189 1198 1170
1171A170j17o8o7NNNNNMMMl3l3J7p2j07j07j4P4L4L4L9M0J9J9J9K0O7O8O7O8J9J9J9K0m4m4
1166A163m4m3n6n5n6n5k9l0k9l0m1m1m1m1J5J5J1J2%m5p0J9N0M9l3l4QQQPj6j6j6j6J2J3J2
1162E65J2j8j8J2l2n4L5P2P1j4j4j4j4L3L3L3L3m4m5m5m4PQPQJ3J3J3J3k8k8O1O1K2K3o4o4
1157F08r3m9K2J11R8N3nmk9k8k9k8POPPllN0l9p2k7Q5Q5L8n1n7L2Q5lr6r5JKKKO4O4Ol9k9
1152F56N9J18P3j6o1o4j9K1K0K4K3M2M2M2M2L8L7L8L8p5p6J4J4nnnnj3j3j3j4K5K5k0k0R6
1148A063R7N7l2l2l2N2N1L0K9L0K9RQRRJ14J15P5j3j8j9O6O5k5k4O4O4L2L2j3j2L4L5L4L5
1143B018KKR0R1J3J3J3J3j5j4O8O9O5k4k4O5K18K18Q2Q1J07J95J90J89J66J66K55K55L03L04
1140E174L57L56M73O20P89R38J044J192J326J326J348J349J322J174Q68N43K27j59o10r96
$$ plain form
1171 1170 1053 985 918 923 928 933 938 943 947 951 955 922 889 906 834 727 620 606 680 714 748 787 827 846 865 884 904 971 1039 1106 1174 1193 1212 1231 1251 1207 1163
1166 1163 1119 1076 1020 965 909 854 825 795 766 736 695 654 613 572 587 602 613 625 625 580 510 529 579 628 595 561 569 577 585 592 576 560 544 528 540 553 565
1162 565 577 559 541 553 521 467 502 574 645 631 617 603 589 622 655 688 721 677 632 587 543 550 558 565 573 586 599 612 625 597 569 630 691 713 736 672 608
1157 608 515 466 488 599 697 750 745 741 712 684 655 627 634 640 647 654 651 648 698 659 587 560 645 730 768 717 660 692 777 774 678 583 584 586 588 590 654 718 724 685 656
1152 656 715 833 906 890 829 765 746 767 787 811 834 876 918 960 1002 1040 1077 1115 1153 1078 1002 1016 1030 1025 1020 1015 1010 997 984 971 957 982 1007 987 967 1063
1148 1063 1160 1217 1185 1153 1121 1173 1224 1254 1283 1313 1342 1351 1359 1368 1377 1491 1606 1681 1668 1650 1631 1697 1762 1737 1713 1777 1841 1873 1905 1892 1880 1914 1949 1983 2018
1143 2018 2020 2022 2112 2203 2216 2229 2242 2255 2240 2226 2294 2363 2428 2404 2380 2445 2663 2881 2963 3044 3151 3346 3536 3725 3891 4057 4312 4567 4870 5174
1140 5174 5531 5887 6360 6980 7769 8707 9751 10943 12269 13595 14943 16292 17614 18788 19656 20199 20426 20267 19657 18661
1137A8661j248j248j255j255j207j118r31p83o12m64l59k69j86l8OOJ5J5J19J19J28J28K91
1134H515M38M50M50M97N85O89O89P08P98R44J092J263J470J830K274K765L327M036M836N697
1132D3353O556P457Q317Q878R026Q670P929O576M648K276l04k818n161p088q423r187r334
1130G1371q994q252p181n965m802l763k933k251j706j261q43n76l93k45j35r0n8L2J91L39
1127B2485N13O62Q40R88J136J344J553J760K072K398K839L402M078M996O208P721R429J1297
1125H5721J3385J5668J8029K0253K2068K3106K2983K1590J8910J4847R453K960m055j0786
1124B74132j6598k1017k3927k5261k5031k3460k0858j7744j4520j1524q915o869n211l937
1122D9260k978k236j684j299j062r13q35o87n41l33j4K52M86O94R39J264J657K043K435K880
$$ plain form
1137 18661 17413 16165 14910 13655 12448 11330 10399 9616 9004 8540 8181 7912 7726 7688 7694 7700 7715 7730 7849 7968 8096 8224 8515
1134 8515 8953 9403 9853 10350 10935 11624 12313 13021 13819 14763 15855 17118 18588 20418 22692 25457 28784 32820 37656 43353
1132 43353 49909 57366 65683 74561 83587 92257 100186 106762 111410 113686 113382 110564 105403 98315 89892 80705 71371
1130 71371 62377 54125 46944 40979 36177 32414 29481 27230 25524 24263 23420 22844 22451 22206 22071 21981 21923 21955 22146 22485
1127 22485 22998 23660 24500 25488 26624 27968 29521 31281 33353 35751 38590 41992 46070 51066 57274 64995 74424 85721
1125 85721 99106 114774 132803 153056 175124 198230 221213 242803 261713 276560 286013 288973 284918 274132
1124 274132 257534 236517 212590 187329 162298 138838 117980 100236 85716 74192 65277 58408 53197 49260
1122 49260 46282 44046 42362 41063 40001 39088 38253 37566 37025 36692 36678 36930 37416 38110 39049 40313 41970 44013 46448 49328
1119D9328L336L959M790N945P452R260J1436J3956J6619J9494K2605K5837K8842L0947L1540
1118B85346L0503K7696K3160J6731Q577q83j0520j9305k6453l1593l4648l5501l4166l1043
1116A67901k6922k2481j8121j4222j0990q391o405m822l665k943k438j953j627j434j344j282
1114C8861j133r81p74m51j25Q3L49O78J064J394J720K072K576L251L992M965O240P857R665
1112H1303J1578J3684J5915J8317K0666K2533K3527K3379K1892J9075J4923R378K690m575
1110B94285j1607j7746k2538k5712k7164k6898k5166k2408j9072j5662j2488r672p429n679
1108D5044m352l374k628k125j803j537j383j383j349j260j118r69p28n80m84l94k92q4J49
1106A9350L57N50Q17J031J358J744K248K867L548M302N102N951O810P716Q516R079R228Q901
$$ plain form
1119 49328 52664 56623 61413 67358 74810 84070 95506 109462 126081 145575 168180 194017 222859 253806 285346
1118 285346 315849 343545 366705 383436 392013 391130 380610 361305 334852 303259 268611 233110 198944 167901
1116 167901 140979 118498 100377 86155 75165 66774 60369 55547 51882 48939 46501 44548 42921 41487 40143 38861
1114 38861 37728 36747 35973 35522 35397 35480 35829 36507 37571 38965 40685 42757 45333 48584 52576 57541 63781 71638 81303
1112 81303 92881 106565 122480 140797 161463 183996 207523 230902 252794 271869 286792 296170 298860 294285
1110 294285 282678 264932 242394 216682 189518 162620 137454 115046 95974 80312 67824 58152 50723 45044
1108 45044 40692 37318 34690 32565 30762 29225 27842 26459 25110 23850 22732 21763 21035 20455 19971 19577 19285 19201 19350
1106 19350 19707 20257 21074 22105 23463 25207 27455 30322 33870 38172 43274 49225 56035 63751 72267 81346 90574 99475
1104I9475Q042O629M702K245n14l360n999q168r739j0681j0948j0540r620q349o955n695m598
1102B5927l652k793k078j575j267r99q00p11p38p39o83n95n55n56m46m46m41m40l10k21j17
1099E765j17o7K2J26J26J74K63L80M69O10P59R28J077J202J290J402J490J498J409J120P93
1096B0719M55O9m21q65j228j496j666j814j801j653j464j256j068q59o79n89m97l48k19k19
1094C101j39j40j39j39r6r6m6j35j63j63p9q0j58j58oQ2N5l4o7o7n0m9n0m9k2k2k2k1j0j1
1090A027j0j0JJJJj2j2j2j3l8l8l8l8l0l0p9RP2P2j1j1m9m8m8m9L2L1K6K6K7o1j2j1L3L3n6
1086F76n6n6n5n6n5Q1Q2qpJ1J0J1J1j9j8j9j9P0P0j9j8l0l0J4J5qpn3n2O1O1K2o7j6j6k2k1
1081D68J3J4J3J4k1k1k0k1NNONL4L4L4L3K1K1o8o8L4L3L4L3l5l5l5l5j0rj0j0K4K4K3K4k8
$$ plain form
1104 99475 107517 114146 118848 121093 120579 117219 111220 103052 93313 82632 71684 61144 51524 43175 36220 30525 25927
1102 25927 22275 19482 17404 15829 14562 13563 12763 12052 11314 10575 9892 9297 8742 8186 7740 7294 6853 6413 6103 5882 5765
1099 5765 5648 5581 5603 5729 5855 6029 6292 6672 7141 7751 8510 9438 10515 11717 13007 14409 15899 17397 18806 19926 20719
1096 20719 21174 21243 20822 19957 18729 17233 15567 13753 11952 10299 8835 7579 6511 5652 4973 4384 3887 3539 3320 3101
1094 3101 2962 2822 2683 2544 2448 2352 2306 2171 2008 1845 1766 1686 1528 1370 1364 1446 1501 1467 1400 1333 1283 1234 1184 1135 1113 1091 1069 1048 1038 1027
1090 1027 1017 1007 1008 1009 1010 1011 999 987 975 962 924 886 848 810 780 750 671 680 752 824 813 802 753 705 657 608 640 671 697 723 750 689 677 666 699 732 676
1086 676 620 564 509 453 398 479 561 553 546 557 567 578 589 570 552 533 514 584 654 635 617 587 557 571 586 578 571 518 466 527 588 610 543 527 511 489 468
1081 468 481 495 508 522 501 480 460 439 444 449 455 460 494 528 562 595 616 637 569 501 535 568 602 635 600 565 530 495 485 476 466 456 480 504 527 551 523
1077E23k8k7k8k8k8k7k8J1J2J1J2J1J2J1J2K3K4K4K3j5j6j5j5L2L2jr0r7rQ5Q4LLLLl5l6l6
1072C95l6K5K5K6K5n0n0onj8j9P1P0k2k2k2k2m3m3KKO0O0k9k9O3O2O3O2JKJJk1k2k2k2J2J2
1067E37J1J2L4L3L4L4O0O0N9O0lkllRQRQo6o5o6o6o6o5o6o6ooooonooL5L6L5L6k0k0k1k0J2
1062D57J2J1J2M2M2kkk2k2O7O7N5N5N4N5J45J44J44J45J01J00J01J01P5P5L0L1r0q9j78j78
1058A538k28k29q0p9m0l9l9l9k5k4k4k5onooqqqpm4m4M5M5m3m2KKO0O0O0O1J4J5J4J5K5K4
1054H82P9J67J86J86J92J91J98J98J54J54J71J72J51Lj11j11j20j21k62k63k18k18j25j26
1051A409n1n1p9p8p8p9n8n8n8n8L1L0j4j3m2m2L2L3k5k4k4k5M3M4M3M3K7K7K7K7M0L9J43J42
1046A323J39J39J40J39J98J98J99J98J70J69N7l3k5k5p5p5j57j58j57j57j79j79j78j79j8
$$ plain form
1077 523 495 468 440 412 384 357 329 340 352 363 375 386 398 409 421 444 468 492 515 500 484 469 454 486 518 517 427 330 321 406 490 493 496 499 502 467 431 395
1072 395 359 384 409 435 460 410 360 354 349 331 312 383 453 431 409 387 365 322 279 281 283 343 403 374 345 408 470 533 595 596 598 599 600 579 557 535 513 525 537
1067 537 548 560 594 627 661 695 755 815 874 934 931 929 926 923 932 940 949 957 891 826 760 694 628 563 497 431 425 419 413 407 401 396 390 384 419 455 490 526 506 486 465 445 457
1062 457 469 480 492 534 576 574 572 550 528 595 662 717 772 826 881 1026 1170 1314 1459 1560 1660 1761 1862 1937 2012 2042 2073 1983 1894 1716 1538
1058 1538 1310 1081 1001 922 882 843 804 765 740 716 692 667 661 656 650 644 636 628 620 613 569 525 570 615 572 530 532 534 594 654 714 775 789 804 818 833 858 882
1054 882 961 1128 1314 1500 1692 1883 2081 2279 2433 2587 2758 2930 3081 3084 2973 2862 2742 2621 2359 2096 1878 1660 1535 1409
1051 1409 1358 1307 1228 1150 1072 993 935 877 819 761 792 822 808 795 753 711 743 776 751 727 703 678 721 765 808 851 878 905 932 959 999 1038 1181 1323
1046 1323 1462 1601 1741 1880 2078 2276 2475 2673 2843 3012 3069 3036 3011 2986 2911 2836 2679 2521 2364 2207 2028 1849 1671 1492 1474
1043A474j8j8j8o5o5o5o6j70j70q7Klkm2m1j4j3L1L1K8K8j6j6l1l0l0l1N0M9M9N0P9P9J53
1039A092J54R4R4J98J97J56J56J51J50J31M2j7j7q7j76k00k00j38j37o3o2j28j27n4n3r0r1
1036I75r0r0QRLLj2j01j01j2ONJ1J1k5k5k5k5n2n2K3K2m1m2m7M2O1O2K3K3%j%%K5K5J00J00
1031G96J7J7J7J7R2R1Q7Q6l8j27p7p7m5m5m6m5l4l4l5l4k8k7k8k8m6m6m6m7L3L3L2L3MMMM
1027D34k9l0j1P8R4Om3m3j2j2j3j2j9j9j8j9j%jj%j%jNNm5M5O9O9n9n9q2q2q3q2N9O0R8R9
1022C44O7k1p5p5j9j9k0j9M6M5M6M6lmllo2o2qQ0Q5Q4J6J6k7k7k6k7RRJ0RK5K5K0J9K3o7o7
1017C90K2L8L7l1l2j3j2n8n7k4k5k4k4M3M3M3M4K0K1K0K1RRJ0RJ2J3J2J2JJJJMMk6J8J2p7
1012D67n1pj2n7q1QP8L5l9l9J3J3J3J3O2O2j1n5j0P9N2Pl5l5l7l8qqO7O6O6O6qqm5m6m5m6
$$ plain form
1043 1474 1456 1438 1420 1355 1290 1225 1159 989 819 732 734 731 729 687 646 632 619 650 681 709 737 721 705 674 644 614 583 633 682 731 781 860 939 1092
1039 1092 1246 1340 1434 1632 1829 1985 2141 2292 2442 2573 2615 2598 2581 2494 2318 2118 1918 1780 1643 1580 1518 1390 1263 1209 1156 1066 975
1036 975 885 795 803 812 815 818 806 705 604 592 598 603 614 625 600 575 550 525 473 421 444 466 425 383 336 378 439 501 524 547 547 546 546 546 571 596 696 796
1031 796 813 830 847 864 956 1047 1134 1220 1182 1055 978 901 856 811 765 720 686 652 617 583 555 528 500 472 426 380 334 287 320 353 385 418 422 426 430 434
1027 434 405 375 364 442 536 542 499 456 444 432 419 407 388 369 351 332 331 331 330 329 329 328 328 327 332 337 292 337 406 475 416 357 275 193 110 28 87 147 245 344
1022 344 411 390 315 240 221 202 182 163 209 254 300 346 343 339 336 333 271 209 201 281 366 450 466 482 455 428 402 375 384 393 403 412 437 462 482 501 524 457 390
1017 390 412 450 487 456 424 411 399 341 284 260 235 211 187 230 273 316 360 380 401 421 442 451 460 470 479 491 504 516 528 529 530 531 532 536 540 514 532 544 467
1012 467 416 409 397 340 259 267 345 380 341 302 315 328 341 354 416 478 467 412 402 481 533 540 505 470 433 395 387 379 446 512 578 644 636 628 583 537 492 446
1008D46rj0rrooooooooK2K1K2K1M2M1M1M1J02J02kjrqn2n3l3l3J2J2q8q9r4mO2O2ooK3K2k2
1003E09k2J4J3J3J3L0K9K9K9K1K2K2K1J3J2o2o2J8J7k7k7NMNMj9j9j9k0qqqqjjjjL6L7L7L7
998F77K1K1k3k3k7k6M8M8Q8Q7J4J3J2J2J1J2R3R3R3R3R2R3R3R3N8N8N8N8J06J06J66K54M15
994B987N03N56O44P54R61J195J521J837J986J900J693J472J383J360J213Q86K63m93j115j512
991A9994j661j729j818j888j889j853j705j471j146q48o41m74l25k54k10j65j20r8r8m5m4
989A512m5m5o0o0j35j35q2q2l8l8k7k7k7k7k3k4k4k4KLKKJ9J9J9J9N7N8j3j4K1O5M8m0n6j1
984G89LLK7K7Rq0n2L7Q1L7j1j0L1L2K0K0k4k5p9p9l5l4j2j1O3O2P9P8P9P8N0N0M9N0J24J23
980A549J24J23R0R0J6J6N1N0k4k5r4r4r5r4l1l1l0l1k8k8k8k8J2J3N6N7K7K7p1p1j6P4N1O
$$ plain form
1008 446 437 427 418 409 403 397 391 385 379 373 367 361 383 404 426 447 489 530 571 612 714 816 814 813 804 796 744 691 658 625 637 649 561 472 378 374 436 498 492 486 509 531 509
1003 509 487 501 514 527 540 570 599 628 657 678 700 722 743 756 768 706 644 662 679 652 625 630 634 639 643 624 605 586 566 558 550 542 534 533 532 531 530 566 603 640 677
998 677 698 719 696 673 646 620 668 716 804 891 905 918 930 942 953 965 1058 1151 1244 1337 1429 1522 1615 1708 1766 1824 1882 1940 2046 2152 2318 2572 2987
994 2987 3490 4046 4690 5444 6405 7600 9121 10958 12944 14844 16537 18009 19392 20752 21965 22851 23114 22621 21506 19994
991 19994 18333 16604 14786 12898 11009 9156 7451 5980 4834 3986 3345 2871 2546 2292 2082 1917 1797 1699 1601 1556 1512
989 1512 1467 1422 1362 1302 1167 1032 950 868 830 792 765 738 711 684 661 637 613 589 591 594 596 598 617 636 655 674 731 789 776 762 783 848 896 856 800 789
984 789 792 795 822 849 858 778 726 763 844 881 870 860 891 923 943 963 939 914 835 756 721 687 675 664 727 789 868 946 1025 1103 1153 1203 1252 1302 1426 1549
980 1549 1673 1796 1886 1976 1992 2008 2059 2109 2085 2060 1966 1872 1777 1683 1652 1621 1591 1560 1532 1504 1476 1448 1460 1473 1529 1586 1613 1640 1569 1498 1482 1556 1607 1613
976A613lM1L8on6n6J6J5J7J8k7k8j2j2j3j2Q9R0M6JnQ4J01N6k4k3J8J8P2P2P3P2j3j3O0J04
971B411J06J6l2l2K9P3N6l3o6k2N2N1J9J9K0J9l5l4l2l1NN0P5j4r0r0j40j40j32j33k9k8j1
967A877j0j0j0k0j9k0j9q1q0l6l6L6L7l8l8m5m5m6m5N1N0N0N0K3K2K2K2O3O3O3O4mmmlK9L0
963A939L0L0P1P2P2P2L1L1L1L1k6k7k0k1M4J33J08O3O5O4J06J06L4L5l4l4lQ5J35R0Q6Q5Q3
959C567Q3L7L7L7L7JKj7j06r1lP0K6m3m3jjK8K7K8K7M0M0J13J14R9J00J44J44KKKKj5j6j19
954D354j19q9r0q9r0j04j05l0l0o5o5J3J2jM3R9J88J80J35O3J9M5J35K49K94K93K93L40L40
951F218K91K91J86J87Q7Q7M2M2J7J7k7p1m4M4J25J26J08J09J54J53J16J17J55J55J24L6j9
947H826j9J0Rl9j28j06j7JJj5j6L5L5jQ8K01K01J33J33J78J78R0R0R0R0K05K06K11J23Q1Q1
$$ plain form
976 1613 1610 1651 1689 1683 1627 1571 1587 1602 1619 1637 1610 1582 1570 1558 1545 1533 1622 1712 1758 1759 1754 1838 1939 1995 1971 1948 1966 1984 2056 2128 2201 2273 2260 2247 2307 2411
971 2411 2517 2533 2501 2469 2498 2571 2627 2594 2528 2506 2558 2609 2628 2647 2667 2686 2651 2617 2585 2554 2559 2609 2684 2670 2580 2490 2350 2210 2078 1945 1916 1888 1877
967 1877 1867 1857 1847 1827 1808 1788 1769 1688 1608 1572 1536 1572 1609 1571 1533 1488 1443 1397 1352 1403 1453 1503 1553 1576 1598 1620 1642 1705 1768 1831 1895 1891 1887 1883 1880 1909 1939
963 1939 1969 1999 2070 2142 2214 2286 2317 2348 2379 2410 2384 2357 2337 2316 2360 2493 2601 2664 2729 2793 2899 3005 3039 3074 3040 3006 3003 3088 3223 3313 3399 3484 3567
959 3567 3650 3687 3724 3761 3798 3799 3801 3784 3678 3587 3584 3654 3680 3637 3594 3593 3592 3620 3647 3675 3702 3742 3782 3895 4009 4108 4208 4352 4496 4498 4500 4502 4504 4489 4473 4354
954 4354 4235 4146 4056 3967 3877 3773 3668 3638 3608 3543 3478 3491 3503 3502 3545 3644 3832 4012 4147 4210 4229 4274 4409 4658 4952 5245 5538 5878 6218
951 6218 6509 6800 6986 7173 7260 7347 7389 7431 7448 7465 7438 7367 7323 7367 7492 7618 7726 7835 7989 8142 8258 8375 8530 8685 8809 8845 8826
947 8826 8807 8817 8826 8787 8659 8553 8536 8537 8538 8523 8507 8542 8577 8576 8664 8865 9066 9199 9332 9510 9688 9778 9868 9958 10048 10253 10459 10670 10793 10874 10955
944A0955K09K09J27J28K31K31J99K00K53L41L34L33L40L39K92K92M20M20L95L05L51L50K74
941A7528J85K35K35J59J60J60J60J46J47K36L24M03M91O49P38P15P15P27P27P97Q86Q76P88
938B8187O03M55M58M58M53M53M53M52M27M27N07O55P31P32P71Q60R16J005J087J175J330J537
935D4132J719J926K079K227K504K831L117L324L531L680L892M158M544M930N200N467N834
933A05095O457P275Q193R121J0040J1059J2156J3258J4295J5199J6236J7657J9643K2238K5826
931C13748L1131L9464N2717P2319R6807J21271J41581J60827J90336K40127L04244L57653
930B122225L71993L40116K85021K41637K25337K17005J78963Q8843l9338j65044k51357k89938
928C325463l00479l09347l27708l46717l49724l27274k82858k28264j75224j30771r6883p1943
$$ plain form
944 10955 11164 11373 11500 11628 11859 12090 12289 12489 12742 13083 13417 13750 14090 14429 14721 15013 15433 15853 16248 16553 16904 17254 17528
941 17528 17713 17948 18183 18342 18502 18662 18822 18968 19115 19351 19675 20078 20569 21218 21956 22671 23386 24113 24840 25637 26523 27399 28187
938 28187 28790 29245 29703 30161 30614 31067 31520 31972 32399 32826 33333 33988 34719 35451 36222 37082 37998 39003 40090 41265 42595 44132
935 44132 45851 47777 49856 52083 54587 57418 60535 63859 67390 71070 74962 79120 83664 88594 93794 99261 105095
933 105095 111552 118827 127020 136141 146181 157240 169396 182654 196949 212148 228384 246041 265684 287922 313748
931 313748 344879 384343 437060 509379 606186 727457 869038 1029865 1220201 1460328 1764572 2122225
930 2122225 2494218 2834334 3119355 3360992 3586329 3803334 3982297 4071140 4031802 3866758 3615401 3325463
928 3325463 3024984 2715637 2387929 2041212 1691488 1364214 1081356 853092 677868 547097 450214 378271
927C78271n3517l9727k9740k3186j9197j6736j4985j3591j2680j2293j2242j2331j2109j1486
925I4451j0461r364q368p448o528n550m487l507k606j865j260q75o28n40m23l33k67k66l50
923B9325m39n80o69o69o69p15p16o62n72n25n25m65l77l04l05k43r6M6J34J83K72L74M62N52
920B2817N51N63N63O66O67O88O89P40R48J271J834K668L824N145O480P732R185J1456J4866
918I3353J8792K1668K2132K0263J7539J5671J4826J3728J0362L987m200j1703j6489j8476
916B01453j9126j9808k0835k1457k0870j8823j5717j2307r229o826n070l794k874k252j766
914B0699j440j255j167j057r09q22q22q13q13p64p64o51n61m71m70m12l22l14l14k54j66j18
911F020j18j12j13j86j87j09k0qr7r1lR2R2R7R8O3O4J9J9M5M5L9M0L9n1j63j63j09j08j53
$$ plain form
927 378271 324754 285027 255287 232101 212904 196168 181183 167592 154912 142619 130377 118046 105937 94451
925 94451 83990 74626 66258 58810 52282 46732 42245 38738 36132 34267 33007 32132 31504 30964 30541 30208 29941 29675 29325
923 29325 28886 28306 27637 26968 26299 25584 24868 24206 23634 23109 22584 22119 21742 21438 21133 20890 20794 20840 20974 21157 21429 21803 22265 22817
920 22817 23368 23931 24494 25160 25827 26515 27204 27944 28892 30163 31997 34665 38489 43634 50114 57846 67031 78487 93353
918 93353 112145 133813 155945 176208 193747 209418 224244 237972 248334 252321 248121 236418 219929 201453
916 201453 182327 162519 141684 120227 99357 80534 64817 52510 43281 36455 31385 27591 24717 22465 20699
914 20699 19259 18004 16837 15780 14871 14049 13227 12414 11601 10837 10073 9422 8861 8390 7920 7508 7186 6872 6558 6304 6138 6020
911 6020 5902 5790 5677 5491 5304 5195 5175 5167 5070 4979 4976 5068 5160 5257 5355 5418 5482 5501 5520 5565 5610 5649 5689 5728 5677 5514 5351 5242 5134 4981
908D981j53j16j16j2j2j8j7j22j21n1n0r5r4j53j52j28l9M8M8%q8j11j10m1m2m8m8j04j5K0
904C041p0j17j18n6n5l2N7J32J31N4l6l5l6lkkr0q5q5l6l6l6l7K1K0n4n3j07j07n4L6O2O1
900B273l6l7k9k9J6J6K6K5K1K0O6k2p6p6j0j1j0j0R6R6QPN2N2l7l7K7K8K8K8J38J38J18J64
896C023K64L54N18R62J469J735J439R35Q87J629K818L441K781R13j367k997l578l371k729
894I126k047j406r61p38n91m03k54j81j81j33j34q9q9NNNNJ7J7p2p3rj0j0j0J3J3p0p0mQ6
890A757M3m5k4K1J8k7j0L4OOl2l2l1l2j8j8j8j8k9k9k8k9Q8Q8Q8Q8L6L6n3n3n7n7L1L2O0N9
885A851q8q9l6l6l6l7mnmnkkkkJ8J9j30j30p1p0p0p0j6j7j00j00K8J16L2n6m5M3M1m8k0K5
881H82K1k3j4L1O4J09J16P1m4m4R4J82J72K3o5o4p4p4k8k9k8k9L5L4L4L5K3K3j3j02o1j6j7
$$ plain form
908 4981 4828 4712 4596 4584 4572 4554 4537 4415 4294 4243 4193 4098 4004 3851 3699 3571 3532 3580 3628 3628 3540 3429 3319 3278 3236 3188 3140 3036 3021 3041
904 3041 2971 2854 2736 2680 2625 2593 2650 2782 2913 2967 2931 2896 2860 2857 2855 2853 2763 2678 2593 2557 2521 2485 2448 2469 2489 2435 2382 2275 2168 2114 2150 2212 2273
900 2273 2237 2200 2171 2142 2158 2174 2200 2225 2246 2266 2332 2310 2234 2158 2148 2137 2127 2117 2213 2309 2317 2324 2376 2428 2391 2354 2381 2409 2437 2465 2603 2741 2859 3023
896 3023 3287 3641 4159 5121 6590 8325 9764 10699 11586 13215 16033 19474 22255 23168 21801 18804 15226 11855 9126
894 9126 7079 5673 4712 3974 3383 2980 2726 2545 2364 2231 2097 2008 1919 1924 1929 1934 1939 1956 1973 1901 1828 1819 1809 1799 1789 1802 1815 1745 1675 1671 1757
890 1757 1800 1755 1731 1752 1770 1743 1733 1767 1773 1779 1747 1715 1684 1652 1634 1616 1598 1580 1551 1522 1494 1465 1553 1641 1729 1817 1853 1889 1836 1783 1726 1669 1700 1732 1792 1851
885 1851 1763 1674 1638 1602 1566 1529 1525 1520 1516 1511 1509 1507 1505 1503 1521 1540 1410 1280 1209 1139 1069 999 983 966 866 766 794 910 942 886 841 884 925 877 857 882
881 882 903 880 866 897 961 1070 1186 1257 1213 1169 1263 1445 1617 1640 1575 1511 1437 1363 1335 1306 1278 1249 1284 1318 1352 1387 1410 1433 1420 1318 1257 1241 1224
877A224o1r1kL5L4ooooQQl3l4N8J02M2m8n8j3j6o1m9oJ2J1P0O9L7n3l6N2M2M1rj0mlJ7J07
872A358N7N6M9M8PPN0R4L7n3j56o8L5J23J27J26L4n5q6q6n2L7N0N1J1J2N9N9K5o3l6N4J15
868B026P0L3P8J39J38J85J84J93J94L41M91N42N88P18R26J139J405J705J973J946J739J595
865A8348J448J343J196Q79L16m66j149j461j549j622j770j904j904j868j721j479j094q27
863D716o78n07l59k65k64j58o9j10j10j17L2M3m6j15j16j6j7m2m2KLKKKKK3K4K3K3l3l2l3
859A768l3j4j4j4j5j0j0rj0m6m7m6m6m9n0K4K4P3P3P2P3J41J42O7q1j51o2j2j3J2J00J00J2
855A949k8k7J7p2n5n4K0K0M4J32J93J92J59K47K48J59R6R6R0R0L2L1L7n1r2r2k3k3RQK0p0
851C302m8M1M5m5j3J36K32J44R3J38J53n5k28j83n9n8n9n8M5M5M1M0M3M3oL9P3j7l3J15J90
$$ plain form
877 1224 1163 1072 1070 1105 1139 1133 1127 1121 1115 1123 1131 1098 1064 1122 1224 1266 1218 1160 1147 1131 1070 1021 1015 1027 1038 1108 1177 1214 1161 1125 1177 1219 1260 1251 1241 1237 1234 1251 1358
872 1358 1415 1471 1520 1568 1575 1582 1632 1726 1763 1710 1554 1486 1521 1644 1771 1897 1931 1876 1790 1704 1652 1689 1739 1790 1801 1813 1872 1931 1956 1893 1857 1911 2026
868 2026 2096 2129 2207 2346 2484 2669 2853 3046 3240 3581 4072 4614 5202 5920 6846 7985 9390 11095 13068 15014 16753 18348
865 18348 19796 21139 22335 23214 23530 23064 21915 20454 18905 17283 15513 13609 11705 9837 8116 6637 5543 4716
863 4716 4038 3531 3172 2907 2643 2485 2416 2306 2196 2079 2111 2154 2108 1993 1877 1861 1844 1802 1760 1762 1765 1767 1769 1771 1773 1796 1820 1843 1866 1833 1801 1768
859 1768 1735 1721 1707 1693 1678 1668 1658 1649 1639 1593 1546 1500 1454 1405 1355 1379 1403 1476 1549 1621 1694 1835 1977 2044 1963 1812 1750 1738 1725 1737 1837 1937 1949
855 1949 1921 1894 1911 1839 1784 1730 1750 1770 1814 1946 2139 2331 2490 2737 2985 3144 3240 3336 3426 3516 3548 3579 3616 3565 3473 3381 3358 3335 3344 3352 3372 3302
851 3302 3254 3295 3340 3295 3282 3418 3650 3794 3887 4025 4178 4123 3895 3712 3653 3595 3536 3478 3523 3568 3609 3649 3692 3735 3729 3768 3841 3824 3791 3906 4096
848D096J45Q9J78J81R2M0J29K30J41LM9J44N6q1l6O7O7l0k9J33J34Q2Q2J12O9mQ6J69J69J58
844F721K03K32J44L7J25K29J83Q1Q1J34M4l6N4J63J63O9J12J88R9J1J00K25J36p9j23m6%J0
840I260J58K74J27l8J11M04M93M52N41O53N64L62M07N94N49L38L37M39L95K29L18N15M71K53
838A8206K98N20M75K54K99O23P13N24N68R34J142J131J339J670J671J385J475K091K595K793
835D0706L059L330L063K296K089K518K607K122K270L891N758O576O190N039L171J397J396
833I7478L507O028P640R746J3516J7222J9940K4952L5331M9357O7850J05245J76423K62748
831H96983L05291K60661J71372J55507K93268N18672O45501N22760J68450k48523n48207o57365
830B484370o14123m97196l68466k60493j84559j35895j01611p2758m9614l4697k5979j9545
$$ plain form
848 4096 4241 4330 4508 4689 4781 4821 4950 5180 5321 5324 5373 5517 5573 5492 5456 5523 5590 5560 5531 5664 5798 5880 5962 6074 6143 6139 6225 6394 6563 6721
844 6721 6924 7156 7300 7337 7462 7691 7874 7955 8036 8170 8214 8178 8232 8395 8558 8627 8739 8927 9026 9037 9137 9362 9498 9419 9296 9250 9250 9260
840 9260 9418 9692 9819 9781 9892 10296 10789 11241 11782 12435 12999 13361 13768 14362 14911 15249 15586 16025 16420 16649 16967 17482 17953 18206
838 18206 18504 19024 19499 19753 20052 20675 21388 21912 22480 23414 24556 25687 27026 28696 30367 31752 33227 35318 37913 40706
835 40706 43765 47095 50158 52454 54543 57061 59668 61790 64060 67951 73709 80285 86475 91514 94685 96082 97478
833 97478 100985 107013 114653 124399 137915 155137 175077 200029 235360 284717 352567 457812 634235 896983
831 896983 1202274 1462935 1634307 1789814 2083082 2601754 3247255 3770015 3938465 3689942 3141735 2484370
830 2484370 1870247 1373051 1004585 744092 559533 423638 322027 249269 199655 164958 138979 119434
828A19434j4496j1798j0311q206n608m095l730l522l181l182k693j241Q3l61k341m149n105
826C5498n610n768n028l484k090j123q6Q84J210P83K80O6j41m96n84m04m05m54m55j82j82
824A2229m94m93l91l91m65m66j44j45l96l97k13k12k48k48P0K18J35J35M07M08J97M8L38O05
821A0087N42J57j87m53p08p96o85o84o81o80l76k27k61k60j36m6j71j71m1m1j49k37j57o8
818C571j19j18m7M1n6j46o2K8M6M6J26J26l3j82j73k5J6J6K1K2J6J6Oq2j90j89j01j2n6n6
814B450J9J07O4k6QPo6o6j5P4K5K4j5j5j5j5jjjjL1L1P5P6J43J43P8P9K08L57M23M23L44J36
810E088r3k42k06k06k83k84k05j17j86k74j92j03n5n6o0o1j00r9j1P8j2j02j8J89L66L65J99
807C320rj83k73j75j76j81j82j40j41j34j35q2Pl8l8jQ7Q1Q2k4k3r2r3m6K8L1L1J7J7p1p2
$$ plain form
828 119434 104938 93140 82829 74623 69015 64920 61190 57668 54487 51305 48612 47371 47454 47093 44752 40603 35498
826 35498 29888 24120 19092 15608 13518 12395 12309 13193 14403 15186 15466 15532 15391 14895 14311 13907 13502 13048 12593 12411 12229
824 12229 11735 11242 10851 10460 9995 9529 9385 9240 8844 8447 8234 8022 7774 7526 7596 7814 7949 8084 8491 8899 9096 9144 9482 10087
821 10087 10629 10786 10599 10146 9438 8642 7957 7273 6592 5912 5536 5309 5048 4788 4652 4606 4435 4264 4223 4182 4033 3796 3639 3571
818 3571 3452 3334 3287 3328 3272 3126 3064 3092 3138 3184 3310 3436 3403 3221 3048 3023 3039 3055 3076 3098 3114 3130 3136 3054 2864 2675 2574 2562 2506 2450
814 2450 2469 2576 2640 2614 2622 2629 2563 2497 2482 2556 2581 2605 2590 2575 2560 2545 2544 2543 2542 2541 2572 2603 2678 2754 2897 3040 3118 3197 3405 3762 4185 4608 4952 5088
810 5088 4995 4753 4547 4341 4058 3774 3569 3452 3266 2992 2800 2697 2642 2586 2526 2465 2365 2266 2255 2333 2321 2219 2201 2390 2756 3121 3320
807 3320 3311 3128 2855 2680 2504 2323 2141 2001 1860 1726 1591 1509 1516 1478 1440 1439 1526 1607 1689 1665 1642 1550 1457 1411 1439 1470 1501 1518 1535 1464 1392
803A392nno5j09p8mnmM1M1j9o3j9N4J4o0o7L6Q8M3j7j7k0k0J3J3m6r1p1LOOL4P9R6K1j1j1
798A173j00r9rO6M9NlkonK5K5n9n9k1N4M0mj4L2M8k7k0K4K2k3j0L4L6rj9N6N7j7m2L2j1q5
794A134j02LN3QK3K3k1k1o0j5Po8j45p1L2L1M5M5M5M5%j%j%jKLJM7O5qo2j8j9o4n2pon0o5
789G55QN3N3J1J2J1J1nnK6j8m8M1M4m5p8J0P0K4m2m1LLK1O6M9m0n2rOOk3k2Rl6l3N6L0j3j1
784H57L4L1j4k4k4Lm1j20l2O4O4K0K0O5O5n4n5R4R4mmQ0Q0K1o7m3Kj0rppN7N8K2o7j14o9K4
779I90O8L4L5L8L7m6m7m6m7j0j0L4L4k2k2L6Q0N3l6p2p3L7L7L7L7J3J2J3J3L0K9L0L0j1j0
775A305n4n5m3m3M6M6J8J8k7k6M2M1M2M1n2n2L7L7l1l0l0l1m8m7K6K6K0K0K0K1OOPOLKLLP4
770A347P4P5P4j02j02L2L1l2l2l2l3K4K3K4K3K9K9K9K9MNMMM0L9J14J14K38K39M37N26P12
$$ plain form
803 1392 1387 1382 1317 1208 1130 1126 1121 1117 1158 1199 1180 1117 1098 1152 1166 1106 1039 1075 1163 1206 1189 1172 1152 1132 1145 1158 1112 1021 950 953 959 965 999 1078 1174 1195 1184 1173
798 1173 1073 974 965 1031 1080 1085 1082 1080 1074 1069 1094 1119 1060 1001 980 1034 1074 1070 1056 1088 1136 1109 1089 1113 1135 1112 1102 1136 1172 1163 1144 1200 1257 1240 1198 1230 1219 1134
794 1134 1032 1035 1088 1096 1119 1142 1121 1100 1040 1025 1032 964 819 748 780 811 856 901 946 991 991 990 990 989 989 988 990 993 994 1041 1106 1098 1036 1018 999 935 883 876 870 820 755
789 755 763 816 869 880 892 903 914 909 904 930 912 864 905 949 904 826 836 906 930 888 847 850 853 874 940 989 949 897 888 894 900 877 855 864 828 795 851 881 868 857
784 857 891 922 908 884 860 863 822 702 670 734 798 818 838 903 968 914 859 953 1047 1043 1039 1119 1199 1220 1153 1110 1112 1102 1093 1086 1079 1136 1194 1216 1149 1035 966 990
779 990 1058 1092 1127 1165 1202 1156 1109 1063 1016 1006 996 1030 1064 1042 1020 1056 1136 1189 1153 1081 1008 1045 1082 1119 1156 1169 1181 1194 1207 1237 1266 1296 1326 1315 1305
775 1305 1251 1196 1153 1110 1156 1202 1220 1238 1211 1185 1227 1268 1310 1351 1299 1247 1284 1321 1290 1260 1230 1199 1151 1104 1130 1156 1176 1196 1216 1237 1243 1249 1256 1262 1265 1267 1270 1273 1347
770 1347 1421 1496 1570 1468 1366 1398 1429 1397 1365 1333 1300 1324 1347 1371 1394 1423 1452 1481 1510 1514 1519 1523 1527 1567 1606 1720 1834 2072 2311 2748 3274 3986
766C986J126J549J638J271Q55J170K178L305L395K043k70k364l491l601l068k318j664j161
764D579q64p03n24k85j96j79j80p0p0j03j04k9k9j6j7j6j6LLMLl6l6j09j10n6n6J8J8n1n0
760G23pojjm5m6L0L1P5P5j02j02O2O1P8P9n6n5q0p9nn%%%JOPOPj6j7N8N7j4j4j5j4k1k0k1
755F14k1PPPPl3l4l4l3L3L3L3L3K2K1K2K2k6k6k6k6p1p2J4Q8R1j3j06o1L5Q0K9m4n2K3J02
751F45N8l8q2j1L4K0K0K3K3k8k8k8k8n5n4n5n5mmmlM5M5k9k9k3k3K1K1L1L0L1L1n2n2k2N2
746D23M5%L0L0OOONk0k0k1k0k0k1k0k0L8L8L8L9K7K7K2K3J2o3o5RN0Ol8l9l3l3J1J1pqpqO3
741E02O3O3O2J26J26J26J25J04J04J00R9M1l3l6L8R4M9MNL3L3p1j15p2LKKk7k6j01j01j60
737A162j61n7n7j3j2j3j2o2o2o1o2RRl6l6n9n9J4J5o9p0j0O4R1M8KLj5j5j4j5L7L7L7L7m8
$$ plain form
766 3986 5112 6661 8299 9570 10425 11595 13773 17078 20473 22516 22246 19882 16391 12790 9722 7404 5740 4579
764 4579 3715 3012 2488 2203 2007 1828 1648 1578 1508 1405 1301 1272 1243 1227 1210 1194 1178 1181 1184 1188 1191 1155 1119 1010 900 844 788 806 824 773 723
760 723 716 710 709 708 663 617 647 678 753 828 726 624 686 747 825 904 848 793 713 634 629 624 624 624 624 625 631 638 644 651 635 618 676 733 719 705 690 676 655 635 614
755 614 593 600 607 614 621 588 554 520 487 520 553 586 619 641 662 684 706 680 654 628 602 531 459 473 561 652 639 533 472 507 587 616 572 520 543 645
751 645 703 665 583 572 606 626 646 669 692 664 636 608 580 525 471 416 361 357 353 349 346 391 436 407 378 355 332 353 374 405 435 466 497 445 393 371 423
746 423 468 468 498 528 534 540 546 551 531 511 490 470 450 429 409 389 427 465 503 542 569 596 618 641 653 590 525 534 584 590 552 513 480 447 458 469 462 454 447 439 502
741 502 565 628 690 816 942 1068 1193 1297 1401 1501 1600 1641 1608 1572 1610 1704 1753 1757 1762 1795 1828 1757 1642 1570 1573 1575 1577 1550 1524 1423 1322 1162
737 1162 1001 944 887 874 862 849 837 775 713 652 590 599 608 572 536 477 418 432 447 378 308 298 362 453 501 503 506 491 476 462 447 484 521 558 595 547
733E47m8m9m8K0K1K0K0J7J8J7J7RQl6l7l4l4L9M0qqrqQPQPL9L9L9L9jkkkl2l3l3l3J6J5J3
728E66J2lm7o4J0J3J4J8J9l6l6l6l6K7K7K7K7J9J9J9J9N8N9m5m5M5M5M5M5j5j5L0K9J6J6N6
723I02J00P3p5j17p3qrnnK8K7p5p6K4K3K7K6M3Q6M1m9l3J2j9j9l1l2l2l2J3J2J3J2L5L5m0
719H02l9q3q2K1K1L0L0K9L0M6M5n8n8k8k7M6M7M0L9Q4Q4M5M4n4n4k8O1L6qp9p9K2K2MLm1m0
714H73l3l3l2l3M1M0l3l4j9k0N4N5k8k8j4L0K7o3p9l4L9L9lkk9k8k9k8RRRRM2M3M2M3l8l8
710G26l7l8M5M5M5M5N4N5J0J0J0J0m8r3p8J1M8M7k1k2k1k1J6J5J6J6k3k4k3k3n6n6L3J22Q3
705H78o4r0m5QQJ1J0l1l1l1l1M4M4j%O9O9k0k0k0k0O9O9N7N8l1l1L3L3n6n6K2K1O5O6O7O7
701A190k2k2J5J5Jm3l4N6P2K7k0j9L6Q0P6j3k9J5M7M6m0l9RRRRL4L4j1j0l6l6N3N4N0N1l9
$$ plain form
733 547 499 450 402 422 443 463 483 500 518 535 552 561 569 533 496 462 428 467 507 499 491 482 474 482 489 497 504 543 582 621 660 659 657 655 653 621 588 555 522 538 553 566
728 566 578 575 528 464 474 487 501 519 538 502 466 430 394 421 448 475 502 521 540 559 578 636 695 650 605 650 695 740 785 770 755 785 814 830 846 902
723 902 1002 1075 1000 883 810 802 793 788 783 811 838 763 687 711 734 761 787 830 916 957 908 875 887 868 849 818 786 754 722 735 747 760 772 807 842 802
719 802 763 680 598 619 640 670 700 729 759 805 850 792 734 706 679 725 772 812 851 935 1019 1064 1108 1054 1000 972 1033 1069 1061 982 903 925 947 951 954 913 873
714 873 840 807 775 742 783 823 790 756 737 717 771 826 798 770 756 786 813 750 671 637 676 715 712 710 681 653 624 596 605 614 623 632 674 717 759 802 764 726
710 726 689 651 696 741 786 831 885 940 950 960 970 980 932 839 761 772 820 867 846 824 803 782 798 813 829 845 822 798 775 752 696 640 673 795 878
705 878 814 724 679 687 695 706 716 685 654 623 592 636 680 679 679 748 817 797 777 757 737 806 875 932 990 959 928 961 994 938 882 904 925 990 1056 1123 1190
701 1190 1168 1146 1161 1176 1177 1134 1100 1156 1228 1255 1235 1216 1252 1332 1408 1395 1366 1381 1428 1474 1434 1395 1404 1413 1422 1431 1465 1499 1488 1478 1442 1406 1459 1513 1563 1614 1575
696A575l8LMMLmnnml0k9p4p3m9m9M1M0J5J4o9p0m0L4K0k4qL7RRl6l6l6l7M9N0M9M9M2M2m7
692A326m7J5J5J04J04K5K5j9k0J0RJ0RR7R7j0q4n2n1n4n3K3O8M3l1n6j1M4M4k4r8n6J7N8J2
687A489m4m4M1Q5O0j4m4JO0O0J7J6k5k5K4O8Q6J1l7l6M8M8K4K4o3o3PN2K6m7m0O%m3p2p2J5
683A599J5J1J2l3l3RRRRm0l9m0l9n9n8n8n8K5K6K5K5m5m6m5m5l6l6l7l6jjjjJ6J6m3q7o2K7
678H54k6k5l4l4l2l1N1R6L5n5m2Kmm9n0n0L6L6k3k3k3k3j7j8j7j8POPOk3k3O6O6M6M7m2m3
673F36k4k4O6O5N5N5l3l4j9j8j9j9j0j0j0j0RQRQK3K2K0J9R9N4o9j59j04M5M4M5L1L2L1L2
669H46j0j1j0j0o0o0K9K9J0J0J0J0J5J6J05J04P5P4j4j5p7p8J2J1P6P5j4j4j3j4P5P5J30J30
665A517R1Kj1j1P2P3P6P6j3j3M3M3M3M2j9k0k0k0qrqrL3L2L3L2%jjjn9n9n9o0lmr3r2m2m2
$$ plain form
696 1575 1537 1540 1544 1548 1551 1547 1542 1537 1533 1503 1474 1400 1327 1278 1229 1270 1310 1325 1339 1270 1200 1160 1194 1214 1190 1182 1219 1228 1237 1201 1165 1129 1092 1141 1191 1240 1289 1331 1373 1326
692 1326 1279 1294 1309 1413 1517 1542 1567 1548 1528 1538 1547 1557 1566 1663 1760 1750 1666 1614 1563 1509 1456 1479 1547 1590 1559 1503 1492 1536 1580 1556 1458 1402 1419 1477 1489
687 1489 1445 1401 1442 1527 1587 1573 1529 1530 1590 1650 1667 1683 1658 1633 1657 1725 1811 1822 1785 1749 1797 1845 1869 1893 1830 1767 1774 1826 1852 1805 1765 1771 1771 1728 1656 1584 1599
683 1599 1614 1625 1637 1604 1571 1580 1589 1598 1607 1567 1528 1488 1449 1390 1332 1274 1216 1241 1267 1292 1317 1272 1226 1181 1136 1100 1064 1027 991 990 989 988 987 1003 1019 976 889 827 854
678 854 828 803 769 735 703 672 723 819 854 799 757 759 755 706 656 606 642 678 655 632 609 586 569 551 534 516 523 529 536 542 519 496 562 628 674 721 679 636
673 636 612 588 654 719 774 829 796 762 743 725 706 687 677 667 657 647 656 664 673 681 704 726 746 765 864 918 849 690 586 631 675 720 751 783 814 846
669 846 836 825 815 805 745 685 714 743 753 763 773 783 798 814 919 1023 1098 1172 1158 1143 1066 988 1000 1011 1087 1162 1148 1134 1121 1107 1182 1257 1387 1517
665 1517 1608 1610 1599 1588 1660 1733 1809 1885 1872 1859 1902 1945 1988 2030 2011 1991 1971 1951 1943 1934 1926 1917 1950 1982 2015 2047 2047 2046 2045 2044 1985 1926 1867 1807 1804 1800 1707 1615 1573 1531
660A531M7M7P7P7P7P6K3K2K8K8j7P2J12J11%%%jP8P8J28L8M9M8M3M3M3M3M3M3K4K4K5K4Q0
656C164P9Q0Q0Q3Q3Q2Q3M2M2M2M2P0P0P6P5J25K15J64J65J94J95K00K00K37L26L65L65K87
652G231K87K87K88L09L09M14N02N54O43P46P47P99P98R95J144J325J532J829K156K529K916
650B8340L526M269N225O323P616R129J0634J1850J2439J2587J2815J3555J4357J3793J0475
648A76933M337l325j0531j5656j8175j8388j7052j5025j2861j0799q990p333n879m775l974
646B8507l355k792k306j979j703j436j258j109j036r46q04o55n71n70n22m33l87l86k93k92
643E674k48k49j59j60r1r2m8m7q2q1q2q1n5n5j44j43r9r8r8r8j52j51j52j52m0m0m1m0q8q8
640B520q9q8j5j4j5j5M4M4Nq4k6k6J3J3q6q6m1m2K0J9k6k5l6l5l0j19j44j44LR2N0l9k7k8
$$ plain form
660 1531 1578 1625 1702 1779 1856 1932 1955 1977 2005 2033 2016 2088 2200 2311 2311 2311 2311 2310 2388 2466 2594 2632 2681 2729 2772 2815 2858 2901 2944 2987 3011 3035 3060 3084 3164
656 3164 3243 3323 3403 3486 3569 3651 3734 3776 3818 3860 3902 3972 4042 4118 4193 4318 4533 4697 4862 5056 5251 5451 5651 5888 6214 6579 6944 7231
652 7231 7518 7805 8093 8402 8711 9125 9627 10181 10824 11570 12317 13116 13914 14909 16053 17378 18910 20739 22895 25424 28340
650 28340 31866 36135 41360 47683 55299 64428 75062 86912 99351 111938 124753 138308 152665 166458 176933
648 176933 181270 177945 167414 151758 133583 115195 98143 83118 70257 59458 50468 43135 37256 32481 28507
646 28507 25152 22360 20054 18075 16372 14936 13678 12569 11533 10587 9783 9128 8557 7987 7465 7032 6645 6259 5966 5674
643 5674 5426 5177 5018 4858 4767 4675 4627 4580 4498 4417 4335 4254 4199 4144 4000 3857 3758 3660 3562 3464 3312 3161 3009 2857 2817 2777 2736 2696 2608 2520
640 2520 2431 2343 2328 2314 2299 2284 2328 2372 2377 2293 2267 2241 2254 2267 2181 2095 2054 2012 2032 2051 2025 2000 1964 1929 1899 1780 1636 1492 1495 1587 1637 1598 1571 1543
636A543l6l5q0q0qqL7L7O6O7K2K2Q3Q3Q4Q3J1J0J1J1NNN5l3m6m6n2n1k6k6k5k6j0j0o0K9N7
631A663N6O3O2M2M1M2M2M1M2M2M1l0l0l0l0MLLMJ7J8J7J7j5j6j6j6j15j15j15j15J0J0J0J0
627A657p0o9k6k5l0k9N9N9rrqrP5P4P5P5l9l8l9l9l8l9l8l9k0j9k0j9o1o0o0o1l7l7l7l7m9
622I64n0n0n0o1o1K8K7K2K1O6O6OOQ9Q9N4l6j5K9L7n2k7J8L4j0p2p1l9l9M9N0onrqL9nl5N3
618A046R0%n8j3J2J1l0l0Q4Q5M0M1nnnnm9m9L9M0mmm8m8l0l0N9N9LKm2m2p2p3l4N6N8N8k6
613A081k5p0p0J9K0j2j1K1J11J50O1r1r2l2l2l3l2n8n9n8n8p5p4l6N4J3J4k6k5K5K6o3o4N7
609E56N7J3J3j2j1j2j1J%q2q3n1L8P7P8o6o6k6O2L3L3L9L9RRq0q0llllqqrqK7K7K7K7J6J7
604E73p2p3K1K1O5O5MMm1m0k6k5k5k6M6M6m3m3n0m9L9M0L2L2L2L2K2K2K3K2M1M1m8m8NNp9
$$ plain form
636 1543 1507 1472 1392 1312 1304 1296 1333 1370 1436 1503 1525 1547 1630 1713 1797 1880 1891 1901 1912 1923 1928 1933 1988 1955 1909 1863 1811 1760 1734 1708 1683 1657 1647 1637 1577 1606 1663
631 1663 1719 1782 1844 1886 1927 1969 2011 2052 2094 2136 2177 2147 2117 2087 2057 2061 2064 2067 2071 2088 2106 2123 2140 2125 2109 2093 2077 1962 1847 1732 1617 1627 1637 1647 1657
627 1657 1587 1518 1492 1467 1437 1408 1467 1526 1517 1508 1500 1491 1566 1640 1715 1790 1751 1713 1674 1635 1597 1558 1520 1481 1461 1442 1422 1403 1342 1282 1222 1161 1124 1087 1050 1013 964
622 964 914 864 814 753 692 720 747 769 790 856 922 928 934 1023 1112 1166 1130 1115 1144 1181 1129 1102 1120 1154 1144 1072 1001 962 923 972 1022 1016 1011 1002 994 1033 1028 993 1046
618 1046 1136 1136 1078 1065 1077 1088 1058 1028 1112 1197 1237 1278 1273 1268 1263 1258 1209 1160 1199 1239 1235 1231 1183 1135 1105 1075 1134 1193 1196 1198 1156 1114 1042 969 935 991 1049 1107 1081
613 1081 1056 986 916 935 955 943 932 953 1064 1214 1275 1184 1092 1060 1028 995 963 905 846 788 730 655 581 545 599 612 626 600 575 600 626 563 499 556
609 556 613 626 639 627 616 604 593 594 594 512 429 378 416 493 571 505 439 413 475 508 541 580 619 628 637 557 477 474 471 468 465 457 449 440 432 459 486 513 540 556 573
604 573 501 428 449 470 535 600 604 608 567 527 501 476 451 425 471 517 474 431 381 332 371 411 443 475 507 539 561 583 606 628 669 710 662 614 619 624 545
599E45p8k1O8O2O2o2o1j8j7L4L3n5n5P0O9K6K5j9j9P0O9J6J5l0k9j9j9j03j02K5J14O4O4O4
595G88O4O4O4o6o6o6o6J4J4J4J3L2L1n8n7m4m4JJJ7J7J7J7l4l3N6N6J5J5l0k9K5K5K6K5k2
591G96k2J1J00R1Ll2l1J15J16K2o6l3N6Q9R0RJ0M3J31J71Q2onQ4J72J82R3J11K60L78L78J63
587C561J63L78P64R76P69J37n45r15r16p39n31m35k86j73k5M0L9nr4j18j18j24j23r8r7n3
583A432n2n0n0K4K4Q1Q2Lq5m8M2J19J20K4K5K4K4O5O4J38J38J26J26J20K09K83K83M24O32
580D347Q57Q57M44J18M40J359K109J900P08p46j709j976j802j416j013o86n56m67k98j50j17
577B203j17j07j08p6p7p6p7m8m7m8m8M8M7k7k6j5j5L0L0Q3Q2QQM6M7N1N2M7J36J60J60K16
573B542K17K74K74L77N86P30P30M28J01L7L04O71P61L64k59q12j079j038q90o33m25l02k12
$$ plain form
599 545 467 446 514 576 638 576 515 497 480 514 547 492 437 507 576 602 627 608 589 659 728 744 759 729 700 681 662 559 457 482 596 660 724 788
595 788 852 916 980 914 848 782 716 730 744 758 771 803 834 776 719 675 631 632 633 650 667 684 701 667 634 690 746 761 776 746 717 742 767 793 818 796
591 796 774 785 885 976 979 947 916 1031 1147 1169 1103 1070 1126 1215 1305 1314 1324 1367 1498 1669 1751 1745 1740 1824 1996 2178 2271 2382 2642 3020 3398 3561
587 3561 3724 4102 4866 5842 6611 6748 6203 5288 4372 3633 3102 2667 2381 2208 2183 2223 2262 2257 2163 2045 1927 1803 1680 1582 1485 1432
583 1432 1380 1330 1280 1304 1328 1409 1491 1494 1409 1361 1403 1522 1642 1666 1691 1715 1739 1804 1868 2006 2144 2270 2396 2516 2725 3008 3291 3715 4347
580 4347 5204 6061 6505 6623 7063 8422 10531 12431 13139 12393 10684 8708 6906 5490 4477 3791 3235 2768 2470 2320 2203
577 2203 2086 1979 1871 1795 1718 1642 1565 1517 1470 1422 1374 1422 1469 1442 1416 1401 1386 1416 1446 1529 1611 1619 1627 1673 1720 1771 1823 1870 2006 2166 2326 2542
573 2542 2759 3033 3307 3684 4270 5000 5730 6158 6259 6296 6600 7271 8032 8396 8137 7325 6246 5208 4318 3685 3260 2958 2746
571B746j81j81j51o2mnJJM6M5n2n3o9J9K5o4o2K7K7o2j22l3M5M5p7p7k4O6O4O4K0J09J66J65
566B402J27J26J78J78K47K47K10J20l1j20j60j60j20j21r8r9r8r9j10j10j10j10j7j8j7j7
563B220j8j7j7j7P2P2l2l2rqn4n3r5r6QQM3M3kkl5l5q6MJ52J53J57J58J53J53P6K23M53N41
559D081L11p4k77l65l33l34j94j06k2k1L8L8L9L8M8M7N4N3J4J03J28J27Q3Q3L8L8K8K7K7K7
555C744k1k2k1k2noM4m5n7n8j9j8l5l4M9J37J21J21K9K8J14K02J38M9M4J92L74M63K80m7l47
552E372m95m72l84k73k74j52o2l9l8q3q3K1K1M8M8MLM7M7M7M7M5M4M4M4K7K6P7j3j04j04j10
548C326j10l8l9OOj4j5R0Q9O0N9O0O0L5L6L6L5J05J05L6L6Q3J72J67J67N9N9J03J03O6O6R1
544E100J79J76J76J08J07J01J01N7N7J09J09J10J09l1l0k5k5K9J17J18K8l5l5Rq0r8r8K9L0
$$ plain form
571 2746 2565 2384 2233 2171 2167 2162 2163 2164 2210 2255 2203 2150 2081 2100 2125 2061 1999 2026 2053 1991 1869 1836 1881 1926 1849 1772 1748 1814 1878 1942 1962 2071 2237 2402
566 2402 2529 2655 2833 3011 3258 3505 3715 3835 3804 3684 3524 3364 3244 3123 3025 2926 2828 2729 2619 2509 2399 2289 2272 2254 2237 2220
563 2220 2202 2185 2168 2151 2223 2295 2263 2231 2222 2214 2160 2107 2012 1916 1924 1932 1975 2018 2016 2014 1979 1944 1858 1862 2014 2167 2324 2482 2635 2788 2864 3087 3540 4081
559 4081 4392 4318 4041 3676 3343 3009 2815 2709 2687 2666 2704 2742 2781 2819 2867 2914 2968 3021 3035 3138 3266 3393 3476 3559 3597 3635 3663 3690 3717 3744
555 3744 3723 3701 3680 3658 3653 3647 3691 3646 3589 3531 3512 3494 3459 3425 3474 3611 3732 3853 3882 3910 4024 4226 4364 4413 4457 4649 5023 5486 5766 5719 5372
552 5372 4877 4405 4021 3748 3474 3322 3260 3221 3183 3100 3017 3038 3059 3107 3155 3159 3162 3209 3256 3303 3350 3395 3439 3483 3527 3554 3580 3657 3644 3540 3436 3326
548 3326 3216 3178 3139 3145 3151 3137 3122 3212 3301 3361 3420 3480 3540 3575 3611 3647 3682 3787 3892 3928 3964 4047 4219 4386 4553 4612 4671 4774 4877 4943 5009 5100
544 5100 5279 5455 5631 5739 5846 5947 6048 6105 6162 6271 6380 6490 6599 6568 6538 6513 6488 6517 6634 6752 6780 6745 6710 6719 6639 6541 6443 6472 6502
540F502QQQ3Q2J54J55Q0Q0P7P6L2L2J6J6O0O0J2J2J16J16J32J32K07K06K57K58L07K18J70
537I664J69K67K68K20K20K21K20J52J52J53J52L7L7L8L7o5o5o5o5qpl2j21j51j51m4M6N5N4
533A1388K1K2%Q9K41L29K81K81K42K42K83K84K84K84K13K13K23K23K75M24M98M97L78K88K65
530A7768K64L57L57L57L57L81L80M93N82P27P27O48N60N60N60P02Q51J124J272J098P12L56
527C1193K68K01J11K37N63Q79Q80Q89J156J555J762J930K376K895L280M001N573O874O785
525G3408O537Q761J3083J6790K2358L8935O7970Q9410P6831L5049J1999N3783J44091K04854
523H63859J68720M6098q8161j67131j79871j55110j20213q6495n9032m1862l3041k5597j6608
522A05556r699p107o069l811j765j265p61R63K119R63p86r76l53o29j192m84P90J088O42J021
$$ plain form
540 6502 6510 6518 6601 6683 6837 6992 7072 7152 7229 7305 7337 7369 7385 7401 7461 7521 7533 7545 7661 7777 7909 8041 8248 8454 8711 8969 9276 9494 9664
537 9664 9833 10100 10368 10588 10808 11029 11249 11401 11553 11706 11858 11895 11932 11970 12007 11942 11877 11812 11747 11739 11732 11700 11579 11428 11277 11233 11279 11334 11388
533 11388 11409 11431 11431 11520 11761 12090 12371 12652 12894 13136 13419 13703 13987 14271 14484 14697 14920 15143 15418 15842 16340 16837 17215 17503 17768
530 17768 18032 18389 18746 19103 19460 19841 20221 20714 21296 22023 22750 23398 23958 24518 25078 25780 26631 27755 29027 30125 30837 31193
527 31193 31461 31662 31773 32010 32573 33452 34332 35221 36377 37932 39694 41624 44000 46895 50175 54176 59749 66623 73408
525 73408 79945 88706 101789 118579 140937 179872 247842 337252 414083 449132 461131 514914 659005 863859
523 863859 1032579 1078677 990516 823385 643514 488404 368191 281696 222664 180802 147761 122164 105556
522 105556 95857 88750 82681 78870 77105 75840 75079 76042 78161 79124 78338 77362 77009 76380 75188 74704 75494 76582 77224 78245
519G8245J999K222J836K348L800M739M946O034Q852J1424J1424J0392J3091K0636K7960L4955
517B44903N6811J07424J64687J71196J00649K0039M4920K05903L80598L97045K05328p6771
516B022732k87941l61228l34747k70334k00319j38042r5072p2828n8326m1105k5121j7170
515A20499j4471j0739o497m993m608k105O53P4k446k943j429q48j293m36J551K477K625L821
512G8892N570N632M180L639M795O649J0533J8957K9484L3677K6767J7275K1455M5027P2220
510C84752P8779N8643L2841K3736K4837J0100k1654k8385K9219J27050J84580J42085K0108
509A066691j04767j72742j79059j51823j15853q2295n6584m1142l2631k5155j7177j1271q572
507F7620p059n191l505k645j763m87J94j32m88m3O47R13J028J711K929L849M141M053L815
$$ plain form
519 78245 80244 82466 84302 86650 90450 95189 100135 106169 115021 126445 137869 148261 161352 181988 209948 244903
517 244903 301714 409138 573825 745021 845670 865709 910629 1116532 1497130 1894175 2099503 2022732
516 2022732 1734791 1373563 1038816 768482 568163 430121 335049 262221 203895 162790 137669 120499
515 120499 106028 95289 88792 83799 79191 77086 77739 77813 75367 72424 70995 70147 68854 68418 69969 72446 75071 78892
512 78892 84462 90094 94274 97913 102708 109357 119890 138847 168331 202008 228775 246050 267505 312532 384752
510 384752 463531 522174 555015 578751 603588 613688 592034 563649 592868 719918 904498 1046583 1066691
509 1066691 961924 789182 610123 458300 342447 260152 203568 162426 129795 104640 87463 76192 67620
507 67620 60561 55370 51865 49220 47457 46970 47164 47032 46544 46501 47148 48061 49089 50800 53729 57578 61719 65772 69587
505F9587L430L426N413J1465K0687K7237K4776J5250J1424K4602M9482O4366N1050J2775k9365
503C65605n5994o2667n6336m4977l3317k3737j7329j3148r711o775m937m077l303k265j594
501B5438j446j434j286j308j456j459j251j188j337j273j007p54o66n14k47k21m29n65m16
499G181k97k96k22p5rr8j69k1R5Nr8qQ9Q9N1J39J26q1j79l0R5J84K18L07L12K23J08J07J11
495G857J11K93M41K56k49o90o90n65n64n40l92k53j64r2kM1j06j90j01j6j04j40n1M2M2O3
492D237O3J9J9p8p7J2J2o1o0n2n1m5J03J79R1j3P6J45N6m4m4L0L0m1M9J26k2j69j70j5j6p6
488D213p7j51j51j54j53p4p4p4J5Q9%p1p1L3L3k1O8J12K4j8j9P7j3o1K8J36J36j4j4J05J93
485D052K31L20L57J49PJ56N07N96L80N3j63l12l56l56k56k56l10k21j58j58k54j06L3L3j43
$$ plain form
505 69587 73017 76443 81856 93321 114008 141245 166021 181271 192695 217297 266779 331145 382195 394970 365605
503 365605 309611 246944 190608 145631 112314 88577 71248 58100 48389 41614 36677 32600 29297 27032 25438
501 25438 23992 22558 21272 19964 18508 17049 15798 14610 13273 12000 10993 10239 9573 9059 8812 8591 8162 7597 7181
499 7181 6884 6588 6366 6291 6282 6184 6015 5994 6089 6094 5996 5988 6077 6166 6217 6356 6482 6401 6222 6192 6287 6471 6689 6996 7308 7531 7639 7746 7857
495 7857 7968 8261 8702 8958 8709 8019 7329 6764 6200 5660 5268 5015 4851 4759 4757 4798 4692 4502 4401 4385 4281 4141 4090 4132 4174 4237
492 4237 4300 4319 4338 4260 4183 4195 4207 4146 4086 4034 3983 3938 4041 4220 4311 4298 4374 4519 4575 4531 4487 4517 4547 4506 4555 4681 4659 4490 4320 4305 4289 4213
488 4213 4136 3985 3834 3680 3527 3453 3379 3305 3320 3409 3409 3338 3267 3300 3333 3312 3380 3492 3516 3498 3479 3556 3543 3482 3510 3646 3782 3768 3754 3859 4052
485 4052 4283 4603 4960 5109 5116 5272 5779 6375 6755 6808 6645 6333 5977 5621 5365 5109 4799 4578 4420 4262 4008 3902 3935 3968 3825
481C825j43P9Q0k0k0K5K5j10j11L2J22j6j5O4O4M8M7R2R2k0k1N4N4n4n4rj0m8m9R4J83J29
478D409J29K09K09J19J18J82K70K97M45N37L89k8k95l47l48l78l79k60j71j42n4R5R4l6l7
475E027L7L7j40j39K7J16J7p3MJ52J69J68J78J77J7J6J45J44R0JN2N1p7p8J19K08J32M2J23
471F742K11J46J47J91J91j8j06P9K86L33L33L37L36J70K1R5R5k1j69j68k1M1M2J88K76J32
468I889M2J37J37k8j18L3K41J57O8J75L24L11K23L48M97M27K19J87K75J86R6J47J47P5j3J11
465A4293K59K33J45K97N04M30K23K24L73L43L44M56O05O09N19N86O75N50K83K37K37J44nJ50
462B2714L57L58K70L17M66M40L51M14O21N77L69M17O84Q21P31O52O52P97J063J444J533J135
459C7183M53J70K59L27L28O15J000J204J116J100J249J241J151J385J830J910J583J191R23
$$ plain form
481 3825 3682 3761 3841 3821 3801 3826 3851 3741 3630 3662 3784 3768 3753 3817 3881 3929 3976 4068 4160 4140 4119 4173 4227 4173 4119 4110 4100 4052 4003 4097 4280 4409
478 4409 4538 4747 4956 5075 5193 5375 5645 5942 6387 6924 7313 7285 6990 6643 6295 5917 5538 5278 5107 4965 4911 5006 5100 5064 5027
475 5027 5064 5101 4961 4822 4849 4965 4982 4909 4913 5065 5234 5402 5580 5757 5774 5790 5935 6079 6169 6170 6222 6273 6196 6118 6237 6445 6577 6619 6742
471 6742 6953 7099 7246 7437 7628 7610 7504 7583 7869 8202 8535 8872 9208 9378 9399 9494 9589 9568 9399 9231 9210 9251 9293 9481 9757 9889
468 9889 9931 10068 10205 10177 10059 10092 10333 10490 10558 10733 11057 11368 11591 11939 12436 12863 13082 13269 13544 13730 13826 13973 14120 14195 14182 14293
465 14293 14552 14785 14930 15227 15731 16161 16384 16608 16981 17324 17668 18124 18729 19338 19857 20443 21118 21668 21951 22188 22425 22569 22564 22714
462 22714 23071 23429 23699 24016 24482 24922 25273 25687 26308 26885 27254 27671 28355 29176 29907 30559 31211 32008 33071 34515 36048 37183
459 37183 37636 37806 38065 38392 38720 39335 40335 41539 42655 43755 45004 46245 47396 48781 50611 52521 54104 55295 56218
457E6218O76M69N72R58J310J518J677J944K230K497K915L359L524L524L655M101M567N012
454A00726N623O128O153N531M849M522M655N099N966P360R092J0900J2557J4010J5524J7333
453B36028J9657K2831K6581K9814L1915L4021L7734M2687M7623N5423P1689R7754J32429J84946
451A071132K71082L77572M41370M04212L06186K87593M47797P00720Q13556O15494J56523
449E893237l46979o97820q34911q06413o88063n41243m08541l09542k38816j81605j32883
448G06421r6460p1699n2267l5157k2947j7283j5481j5214j6200j7654j7734j6163j4476j3023
446B84663j0432o489k825N1L433P615J0888J2697J5095J9335K4255K8495L3136L8800M3900
445E02617M8675N8623P8582J07157J46034K10082L08090M04433M27535L52828K70832L23963
$$ plain form
457 56218 56894 57363 57935 58893 60203 61721 63398 65342 67572 70069 72984 76343 79867 83391 87046 91147 95714 100726
454 100726 106349 112477 118630 124161 129010 133532 138187 143286 149252 156612 165704 176604 189161 203171 218695 236028
453 236028 255685 278516 305097 334911 366826 400847 438581 481268 528891 584314 656003 753757 886186 1071132
451 1071132 1342214 1719786 2161156 2565368 2871554 3159147 3606944 4307664 5121220 5736714 5893237
449 5893237 5546258 4848438 4013527 3207114 2519051 1977808 1569267 1259725 1020909 839304 706421
448 706421 609961 538262 485995 450838 427891 410608 395127 379913 363713 346059 328325 312162 297686 284663
446 284663 274231 267742 264917 264968 268401 276016 286904 299601 314696 334031 358286 386781 419917 458717 502617
445 502617 551292 609915 688497 795654 941688 1151770 1459860 1864293 2291828 2644656 2915488 3239451
443C239451N41953P61853P53106M31585o6345n13575p67684q23723p49440o14999m72807l56202
442A363173k73376k11681j59103j16111q6249o5359m7359l2469k4017k1044k0125k0047k1203
440B65030k2256k1634k0321j9876j9454j7586j5094j3464j2102r997p865p124p135o453n170
438E9499m133l079j507kL23q3k92n10j073j597j449j027j174j453j245q66r56j289j141p89
436C6157q77j180j091p48p48q31o23k99l87o39n49k65k66m94k86M7M7k66j77J54K44k2k29
433B6672m53q39j180j179q73q72j127j039p40o52p38n31j97j97l75l74r8rk04k04n0m9k87
430A4405k87K1J69J73K61K83P5l35m83k65k65m21m20k63j74k06k06P6P6l8j26n1k29m61m61
427A0848k50k49l19l18j36M1LLK07K07J18J17J81J81o6k44k18k18m00l99k37k36k65k65n4
$$ plain form
443 3239451 3781404 4543257 5296363 5727948 5661603 5148028 4380344 3556621 2807181 2192182 1719375 1363173
442 1363173 1089797 878116 719013 602902 516653 451294 403935 371466 347449 326405 306280 286233 265030
440 265030 242774 221140 200819 180943 161489 143903 128809 115345 103243 93246 85381 78257 71122 64669 59499
438 59499 55366 52287 50780 50778 51101 51018 50726 50216 49143 47546 46097 45070 43896 42443 41198 40332 39376 38087 36946 36157
436 36157 35280 34100 33009 32261 31513 30682 30059 29760 29373 28734 28185 27920 27654 27160 26874 26921 26968 26702 26525 26679 26923 26901 26672
433 26672 26219 25380 24200 23021 22148 21276 20149 19110 18370 17718 16980 16449 16252 16055 15680 15306 15208 15199 14995 14791 14741 14692 14405
430 14405 14118 14139 14308 14481 14742 15025 15100 14765 14282 14017 13752 13331 12911 12648 12474 12268 12062 12138 12214 12176 12050 11999 11770 11309 10848
427 10848 10598 10349 10030 9712 9576 9617 9620 9623 9830 10037 10155 10272 10453 10634 10568 10324 10106 9888 9488 9089 8852 8616 8351 8086 8032
424H032J24M2M3R8R8r6r7J14K93K40K40K39J50j03l99m02m01m21m22k58k59k50k51j58K0l5
421F181l4k4k3j93j92q9q8p3p3L1L1N1N1R5R6N5N6N5N6l6l7L8L8j34j33k08k08k24k25N8N7
417D955J9K0J9J9j08j09o4o4K0J9J24J23q0q0q5q5j97k85j48K9k1j10r9j0k7k7k1k1j8j9J15
413C784J15POP6P5J12K3K9K9k2k2k2k2r1r0m5m6j24j23j6P3J4p4p5J5%q8p7p8o5o6RQk0k0
409C189k1k0p1p1m7M3K5K5P0P0N0l8J1J1J4J4m2M8N6l2K3K3J4J5l5N3M2M2LLJ0J1L4J24J62
405C808J61J58J58m1j89j56o7o9o8o3o2j28j28j77q9q9q9q9q9n4j43j03j5m1j30n6L3N7l2
401B208k6O3N7N7PR6O6k4k3O5J16K7j8P1Q5mk3k2j6j6N8J47J24k3n9L0J23J23N5N5M2M2L4
397C497L3M0j08j58j58j51j50m7m7K6K6K6K6J24J23N0M9J18J18J5J4j80j80j80j81l7l8l8
$$ plain form
424 8032 8156 8198 8241 8339 8437 8341 8244 8358 8651 8891 9131 9370 9520 9417 9018 8616 8215 7794 7372 7114 6855 6605 6354 6196 6216 6181
421 6181 6147 6123 6100 5907 5715 5626 5538 5465 5392 5423 5454 5505 5556 5651 5747 5802 5858 5913 5969 5933 5896 5934 5972 5838 5705 5497 5289 5065 4840 4898 4955
417 4955 4974 4994 5013 5032 4924 4815 4751 4687 4707 4726 4850 4973 4893 4813 4728 4643 4446 4161 4013 4042 4021 3911 3812 3802 3775 3748 3727 3706 3688 3669 3784
413 3784 3899 3906 3912 3988 4063 4175 4198 4227 4256 4234 4212 4190 4168 4077 3987 3942 3896 3772 3649 3633 3706 3720 3646 3571 3586 3586 3498 3421 3343 3278 3212 3221 3229 3209 3189
409 3189 3168 3148 3077 3006 2959 3002 3027 3052 3122 3192 3242 3204 3215 3226 3240 3254 3212 3260 3316 3284 3307 3330 3344 3359 3324 3377 3419 3461 3464 3467 3477 3488 3522 3646 3808
405 3808 3969 4127 4285 4244 4055 3899 3832 3763 3695 3632 3570 3442 3314 3137 3048 2959 2870 2781 2692 2638 2495 2392 2377 2336 2206 2150 2183 2240 2208
401 2208 2182 2245 2302 2359 2366 2462 2528 2504 2481 2546 2662 2689 2671 2742 2827 2823 2800 2778 2762 2746 2804 2951 3075 3052 2993 3023 3146 3269 3324 3379 3421 3463 3497
397 3497 3530 3570 3462 3304 3146 2995 2845 2798 2751 2777 2803 2829 2855 2979 3102 3152 3201 3319 3437 3452 3466 3286 3106 2926 2745 2708 2670 2632
394B632l8nmnnO1O1O1O0M5M5L6L6N7r1j66j7J60J60OOk5k5P9P9J21J20P6P6L0L1L0L0J27J28
389C972o5o6r3r3P0P0K44K44L48L48M13M14M33N82O41O42N00N00O15Q22J050J377J612J760
386A6340J874K142K573K841K654J854M22j210k622l363l499l231k787k224j744j357j073q06
384F784n94m45l70k81j33j33n4n4L0L0K9L0m0m1m1m1k0k1r5r5K2K2O6O7K08K09K14K14L36
381E803M24N56P05Q47J054J287J553J825J825J815J904K226K611K770K326J101n30k093l073
378B4936l415l327k970k407j826j380j091q84o53m46k59j69j02j02j02j3O0O0P1P2J72K61
376F486L60M48N54O43P17Q06R10R99J051J199J274J066O74J69k10m78p00p00o56o56n38m48
373A2970l28k38k83k83k24k25j51j51j86j86k30k30j62j62j62j62p5p4p0o9M2J30J55J55K44
$$ plain form
394 2632 2594 2589 2585 2580 2575 2636 2697 2758 2818 2863 2908 2944 2980 3037 2946 2780 2763 2923 3083 3089 3095 3070 3045 3124 3203 3324 3444 3520 3596 3626 3657 3687 3717 3844 3972
389 3972 3907 3841 3748 3655 3725 3795 4039 4283 4631 4979 5392 5806 6239 6821 7462 8104 8604 9104 9719 10541 11591 12968 14580 16340
386 16340 18214 20356 22929 25770 28424 30278 30700 29490 26868 23505 20006 16775 13988 11764 10020 8663 7590 6784
384 6784 6190 5745 5375 5094 4961 4828 4774 4720 4750 4780 4809 4839 4799 4758 4717 4676 4656 4635 4540 4445 4467 4489 4555 4622 4830 5039 5253 5467 5803
381 5803 6227 6783 7488 8335 9389 10676 12229 14054 15879 17694 19598 21824 24435 27205 29531 30632 30102 28009 24936
378 24936 21521 18194 15224 12817 10991 9611 8520 7636 6983 6537 6278 6109 6007 5905 5803 5790 5850 5910 5981 6053 6225 6486
376 6486 6846 7294 7848 8491 9208 10014 10924 11923 12974 14173 15447 16513 17187 17356 17146 16668 15968 15268 14612 13956 13418 12970
373 12970 12642 12404 12121 11838 11614 11389 11238 11087 10901 10715 10485 10255 10093 9931 9769 9607 9532 9458 9388 9319 9361 9491 9646 9801 10045
370A0045K45J40J41J77J77K65K64M18O26P79R87J489K230K764K675K030J764K549M180N170
368C9115M251J564j550l869m847m759m076l212k529k163j896j607j400j204r96p79n72n09
365H962m20k48j00q4j72j76j76j36j37n3n4n3n3k2k2J7J06J36J35J36K25M13M13L88L87N08
362I920P15Q43J051J516K080K563K564K291K083K400L320M076L690J974l69k409l625m087
360C0596m087l642l020k414j909j506j120p83n75l42p6J36L43N58Q85J422K163L055L500L252
358B6436K689K851M186N880O384M557Q50l193o071p156o830n885m788l766k848k139j575j152
355H430q26o13m64l57l56l03l03k03k02j97k87l10l11l11l11k76j88j48j49q7q6q7q6j15j16
352A738k6k6O7O6P3j7l4l4NMJ6J6k8k9j2j2j2j2k9k8k9k9M3M4J0p9j18k9O3O3O4O3k5k6l7
$$ plain form
370 10045 10290 10430 10571 10748 10925 11190 11454 11872 12498 13277 14264 15753 17983 20747 23422 25452 27216 29765 33945 39115
368 39115 43366 44930 43380 39511 34664 29905 25829 22617 20088 17925 16029 14422 13022 11818 10822 10043 9471 8962
365 8962 8542 8294 8194 8110 7938 7762 7586 7450 7313 7260 7206 7153 7100 7078 7056 7073 7179 7315 7450 7586 7811 8224 8637 9025 9412 9920
362 9920 10635 11478 12529 14045 16125 18688 21252 23543 25626 28026 31346 35422 39112 41086 40717 38308 34683 30596
360 30596 26509 22867 19847 17433 15524 14018 12898 12115 11540 11198 11122 11258 11601 12159 13044 14466 16629 19684 23184 26436
358 26436 29125 31976 36162 42042 48426 52983 53833 50640 44569 37413 30583 24698 19910 16144 13296 11157 9582 8430
355 8430 7604 6991 6527 6170 5814 5511 5208 5005 4803 4606 4319 4009 3698 3387 3076 2800 2612 2464 2315 2228 2142 2055 1969 1854 1738
352 1738 1712 1686 1753 1819 1892 1875 1841 1807 1812 1816 1832 1848 1820 1791 1779 1767 1755 1743 1714 1686 1657 1628 1671 1715 1725 1646 1528 1499 1562 1625 1689 1752 1727 1701 1664
348A664l8l7l7l2l2l2l2qpqqk6k6k1k1k0O8J8J8kkkkN1N2J02J2l1l2l8l7j06j05j7j7J7J6
343A242k7k8o7o7k2k2N0N0N0N0J8J9J9J9ppppJ0RJ0Rm0m1M9M8J25J24J25J24J80J79J35J35
339B437K13K14J49Jj41j41k43l32k56j66j27j28j45n6M3M2o8o7k3k3l9l9M5M4M4m5p9p8qQ1
336A109L1L1k3k2k2k3j1j1j2j1N0N0N0N0L9L8L9L9M9M9N8N9J51K99L55K65J81J81L00M48M81
332D267M81L01L5k44m51o08o09n43l94k61j72j34j33q3q3r4r3nmmmmmM1M0m8m9p5p5p5p6K7
328H67K7K7K6L2L1L2L1j1j2j1j1m9m9M0M0k3k3J25J25J11J11J11J10R5R4R4R4J79J79K20J31
324B743l6j84k55k54k15k14j26j25j10j10k1k1k4k5K0J9J%%%j3j4j4j4k5k5k5k5rj0j0rm3
320H27m3m4m3MMMLmnmnK4K4O5O6n2r7l6N4N4J0mmQQl6l7K4K4K4K4l4l4l5l4J0J0J1J0J0J1
$$ plain form
348 1664 1626 1589 1552 1520 1488 1456 1424 1416 1409 1401 1393 1367 1341 1320 1299 1279 1347 1365 1383 1381 1379 1377 1375 1426 1478 1580 1592 1561 1529 1491 1454 1348 1243 1226 1209 1226 1242
343 1242 1215 1187 1120 1053 1031 1009 1059 1109 1159 1209 1227 1246 1265 1284 1277 1270 1263 1256 1266 1275 1285 1294 1254 1213 1262 1310 1435 1559 1684 1808 1988 2167 2302 2437
339 2437 2650 2864 3013 3014 2873 2732 2489 2157 1901 1735 1608 1480 1335 1279 1322 1364 1296 1229 1206 1183 1144 1105 1150 1194 1238 1193 1114 1036 1028 1109
336 1109 1140 1171 1148 1126 1104 1081 1070 1059 1047 1036 1086 1136 1186 1236 1275 1313 1352 1391 1440 1489 1547 1606 1757 2056 2411 2676 2857 3038 3338 3786 4267
332 4267 4748 5049 5084 4840 4389 3781 3172 2629 2235 1974 1802 1668 1535 1452 1369 1275 1182 1177 1173 1169 1165 1161 1157 1198 1238 1190 1141 1066 991 916 840 867
328 867 894 921 947 979 1010 1042 1073 1062 1050 1039 1028 979 930 970 1010 987 964 1089 1214 1325 1436 1547 1657 1752 1846 1940 2034 2213 2392 2612 2743
324 2743 2707 2523 2268 2014 1799 1585 1459 1334 1224 1114 1093 1072 1048 1023 1043 1062 1063 1063 1063 1063 1050 1036 1022 1008 983 958 933 908 899 889 879 870 827
320 827 784 740 697 701 705 709 712 708 703 699 694 718 742 807 873 821 724 688 742 796 806 802 798 806 814 778 741 765 789 813 837 803 769 734 700 710 720 731 741 751 762
315G62J0J0L7L7L7L6m8m9m8m9J8J8J7J8j9j9J2l2k4O4M0nj3L1L1j3k5K0M8m2r3nJ11O6o7j11
311G61k6K0o0n9O1J05J7p2p2J7Pl7l3J3L2L1j0j0r1r2MR3Q2L8K4K4j5j6j5j5J1J1J1J1N0N0
306H50l9l9j7j6j6j7J9J9J9J9L9L9L9M0J3J3J4J3o4o3o4o4qqqqRRJ0Rj20j20j6j6K1K0K1K0
302E52J6J6J6J5MMLMQQRQk7k7M7M7m2m3L1L2L5L6o8o8m5m5N9N9J8J7J8J7j7j8N7N6llllJ3
297G93J3J2J3l0l0l1l0j1j2j2j1RJ0J0RK1K1K1K0%j%j%jM4M4O7O8o7o6l7l6l7l7%j%jm2m2
292F39m3m2m0m1O3O3O6O6K1K1l5l6RRJ0Rl6l5k6k6J9J8j6j5K8K9nonom4m5K5K5L1m3m3L0O5
287F58O4nononoL8L8L8L9n2n2n2n2n4n4rj0OOP6P5L6l9m1m1J5J6N5N5k0r5p8l4J0J0J3J2L9
282E83L9L8L9J6J6J7J6n4n4n5n4K8K8K9K8k3k3k3k3M5M6%Jj3j3O1O1o0n9j6j5j9j9K6K6M6
$$ plain form
315 762 772 782 819 856 893 929 881 832 784 735 753 771 788 806 787 768 780 748 724 788 828 823 810 841 872 859 834 854 902 860 767 762 873 939 872 761
311 761 735 755 695 636 697 802 819 747 675 692 699 662 629 642 674 705 695 685 594 502 506 599 681 719 743 767 752 736 721 706 717 728 739 750 800 850
306 850 811 772 755 739 723 706 725 744 763 782 821 860 899 939 952 965 979 992 928 865 801 737 729 721 713 705 714 723 733 742 622 502 486 470 491 511 532 552
302 552 568 584 600 615 619 623 626 630 638 646 655 663 636 609 656 703 661 618 649 681 716 752 684 616 571 526 585 644 662 679 697 714 697 679 736 792 789 786 783 780 793
297 793 806 818 831 801 771 740 710 699 687 675 664 673 683 693 702 723 744 765 785 785 784 784 783 783 782 826 870 937 1005 938 872 835 799 762 725 725 724 724 723 681 639
292 639 596 554 514 473 536 599 665 731 752 773 738 702 711 720 730 739 703 668 642 616 635 653 637 622 650 679 674 668 663 657 613 568 593 618 649 606 563 593 658
287 658 722 717 711 706 700 695 689 727 765 803 842 790 738 686 634 580 526 517 507 513 519 595 670 706 667 626 585 600 616 671 726 706 611 533 499 509 519 532 544 583
282 583 622 660 699 715 731 748 764 710 656 601 547 575 603 632 660 637 614 591 568 613 659 659 660 647 634 695 756 696 637 621 606 587 568 594 620 666
278F66M6n8n7m9n0K5K5j0j0j0rl6l6L8L8J4J4J3J4N2N1k2k2o1o0j6j6J2J3J3J3mmRN4N3n1
273E82j06l1K8K8L1L0Jm3o0J5J00J00J6J6PQl7l7L0L0n9n9l6l7QQK0K0K1K0LKq0q1OR5R8R
268F66p1k6O1J05M5m3q1q0j2j3j2j2J1J1N6N5L3L2n6n7j1j1j2j1M6M6M6M6o6o7o6o6L4L3L4
264E87L4j9j8j9j8o9o9l2N6J21P6j3L2N7l2o9o8L9L9ool4l4l5l4K2K3K2K2qpP6P6K9n9j23
260E39p9RRJ2J2J3J2J3J3L9L9n0n1M1M1j8o2n1L7N3J0j7j7k0k0J1J0NOM4m5j06o1P4J18Jq9
255D75n3qrn3n1L8N4J0o9o9J7J7O8O8K3K4k6k7J9J8j0rj0j0ooooK1K2K2K1L9L9n0n0L4L3j1
250E23j1M9M8MMn7n7n8n7M0M0m8m9J2J2J3J2J5J5J5J5j5j6j5j6llM2M1N2N2r1r1k2O7M2kk1
246D81k1o2o3l0N8J20P5lm7n0omlq5q4j3P7R6N2oorrJ9K0K0K0k7k6k6k7L7L7L6L7J1J2J1J2
$$ plain form
278 666 712 654 597 548 498 523 548 538 528 518 509 473 437 475 513 527 541 554 568 620 671 649 627 566 506 490 474 486 499 512 525 521 517 526 580 633 582
273 582 476 445 473 501 532 562 563 520 460 475 575 675 691 707 714 722 685 648 678 708 649 590 554 517 525 533 553 573 594 614 617 619 539 458 464 559 657 666
268 666 595 569 630 735 780 737 656 576 564 551 539 527 538 549 605 660 693 725 669 612 601 590 578 567 613 659 705 751 685 618 552 486 520 553 587
264 587 621 602 584 565 547 478 409 377 433 554 630 617 649 706 674 605 537 576 615 609 603 569 535 500 466 488 511 533 555 547 540 616 692 721 662 539
260 539 460 469 478 490 502 515 527 540 553 592 631 581 530 571 612 594 532 481 518 571 581 564 547 527 507 518 528 533 539 583 538 432 371 445 563 564 475
255 475 422 414 405 352 301 339 393 403 334 265 282 299 367 435 458 482 456 429 448 466 456 447 437 427 421 415 409 403 424 446 468 489 528 567 517 467 501 534 523
250 523 512 561 609 613 617 560 503 445 388 428 468 420 371 383 395 408 420 435 450 465 480 465 449 434 418 415 412 454 495 547 599 508 417 395 462 504 502 481
246 481 460 398 335 305 363 483 558 555 508 458 452 448 445 360 276 263 340 436 488 482 476 467 458 477 497 517 537 510 484 458 431 468 505 541 578 589 601 612 624
241F24J1J1J2J1j8j8j8j8j1j0n0m9j13k4O0O0j2j3j2j3K7K8K7K7jkp5p6K1K2K1K2ONOOJ0J1
236D95J0J1K9K9K9L0k3k2k3k3j7j8j8j8m9m9K6K5P4P4jj%%%jn3n3m7m8kQ7Q6ko2o3O6O5NM
231E52NMJ3J3J3J2n4n5n5n4k9k9M6M5K9K8j5j6j2j2j2j2llllJKJKl8l8L6L6K1K0K0K1j4j5
227D48j4j5k1k2N2N3Q2Q2k2k2l2l2l2l2POl7l8l6l6L8L8k7k7k6k7L6L6L7L6l2l1J2J3M1M0
222D96k9k9PQ1R7oj26j25m4L1N3QL8L8J8J7J8J8j7j6j7j6k0j9j9j9K4K4k1k0K7K7m8r2l4M0
218C45M1l5%M3J5J4J2J3J2J2KJJKk3k2k2k3MMLMRQJ2J2NM9Q3k0j03j02nnj6j5j5j5L5L5L5
213C90L6J6J7J7J6l3l3l4l3P4P4L0L0l8l8L6L7kkm6m6J3J4J4J3k2k3k3k2nnnnj4j4j5j4j8
208C37j8J20J19L0j48j47L0P2P2o5o5N3N2l6l6j6j5K9K9j5j5j4j5j5j5P4P4J3J3J3J2l9l9
$$ plain form
241 624 635 646 658 669 651 633 615 597 586 576 526 477 364 340 400 460 448 435 423 410 437 465 492 519 518 516 441 365 386 408 429 451 457 462 468 474 484 495
236 495 505 516 545 574 603 633 610 588 565 542 525 507 489 471 422 373 399 424 498 572 571 570 570 570 570 569 516 463 416 368 366 453 539 537 475 412 478 543 548 552
231 552 557 561 574 587 600 612 558 503 448 394 365 336 382 427 456 484 469 453 441 429 417 405 402 399 396 393 394 396 397 399 361 323 359 395 416 436 456 477 463 448
227 448 434 419 398 376 428 481 563 645 623 601 569 537 505 473 480 486 449 411 375 339 377 415 388 361 335 308 344 380 417 453 421 390 402 415 456 496
222 496 467 438 445 526 623 617 491 366 322 353 406 414 452 490 508 525 543 561 544 528 511 495 475 456 437 418 442 466 445 425 452 479 431 339 305 345
218 345 386 351 351 394 409 423 435 448 460 472 474 475 476 478 455 433 411 388 392 396 399 403 412 420 432 444 449 498 581 561 458 356 351 346 330 315 300 285 320 355 390
213 390 426 442 459 476 492 459 426 392 359 433 507 537 567 529 491 527 564 562 560 514 468 481 495 509 522 500 477 454 432 427 422 417 412 398 384 369 355 337
208 337 319 439 558 588 440 293 323 395 467 402 337 390 442 406 370 354 339 368 397 382 367 353 338 323 308 382 456 469 482 495 507 468 429
204D29l9l9L1L2L1L1j8j8j9j8J5J5J5J5OOPOj8j8j8j8O0O1k9k9l7l7QPj1j0j1j0LLLMk5k4
199C42k4k4L8L9L9L8j6j6j7j6k8k7k8k7M8M8M9M8o0o0K9K9M9M8MMl1l2J4J3OOOPj02j03j3
195B80j3N9N9l0l0%%%jQPPPj9j9j9j9K0J9K0J9oopoK0K0K0K0K1K1k3k3M3M3%p4r8k5P4P5J3
190D57l2n1K2O3J8m1m1kkkkJ1J1J1J1rj0j0j0J7J6J6J6n1n2n1n2j4j4P4P5L7L7k2o6r5k0Q1
185C24Q1l6q0j2O2M1l4n7j2O3O2O5O6j6j5j5j6K1K1J8J7J7k9m5K9O5O6j9j9l9m0l9l9lmll
180D43k9k9k9k9J5J5J5J5L4L4L3L4k4k5k4k4RRRRnmmnj6j6j7j6N6N7m7m8o3o3M1M1lmj4P4
175D05P7j3l1l1J8J8k6k7K8K7K7K8j6j5j6j5L2L3L3L2p7p7p1p2l7N1N8l2o4K6M3M4l3l3l3
171B61l3kkkkM6M6M6M6J6J5J6J6m0m0m0m0K1K0K1K1K1K1K1K1NNNNk4k4k3k4n8n7J6J7J5J6
$$ plain form
204 429 390 351 382 414 445 476 458 440 421 403 418 433 448 463 469 475 482 488 470 452 434 416 476 537 508 479 442 405 413 420 409 399 388 378 381 384 387 391 366 342
199 342 318 294 332 371 410 448 432 416 399 383 355 328 300 273 321 369 418 466 406 346 375 404 453 501 505 509 478 446 460 473 479 485 491 498 396 293 280
195 280 267 326 385 355 325 325 325 325 324 332 339 346 353 334 315 296 277 297 316 336 355 349 343 336 330 350 370 390 410 431 452 429 406 449 492 492 418 320 295 369 444 457
190 457 425 374 396 459 477 436 395 393 391 389 387 398 409 420 431 422 412 402 392 409 425 441 457 406 354 303 251 237 223 297 372 409 446 424 358 263 243 324
185 324 405 369 289 277 339 380 346 289 277 340 402 467 533 517 502 487 471 492 513 531 548 565 536 491 520 585 651 632 613 574 534 495 456 453 449 446 443
180 443 414 385 356 327 342 357 372 387 421 455 488 522 498 473 449 425 434 443 452 461 456 452 448 443 427 411 394 378 434 491 444 396 333 270 311 352 349 345 331 405
175 405 482 469 438 407 425 443 417 390 418 445 472 500 484 469 453 438 470 503 536 568 491 414 343 271 234 285 343 311 247 273 316 360 327 294 261
171 261 228 226 224 222 220 266 312 358 404 420 435 451 467 427 387 347 307 328 348 369 390 411 432 453 474 479 484 489 494 470 446 423 399 341 284 300 317 332 348
166C48J6J5l2l1l2l2k5k6k5k5k2k1P7P7O2k7n1n1K7K7K8K7J2J2J1J2J5J5m0M8R3Mp4p4j2j2
162C14L3L2jjjjqpqqOPOOl4l3J1J1M9M9k6k5K6K7m8m8J5J5O0N9l4l3J0J1M5M5q9q9J7J6J6
157C92J6j1j0j1j1l0l0l0l0O2O2O3O2m3m4m3m4k5k5k5k5L7L8L8L8N8N8m6m5nmM0M0j9k0o3
153C65o4j1j1L4L3K9K9m5m5MMMMJ8J8J8J8J4J4J4J4M5M6%Jn9n9M5M4K1K1k4k4J0J1r4r3m9
148C00m9m9m9M4M4M4M3LLLLj3j2j3j3k4k4k4k3K9L0L0L0P8P8K7o2r4n1K3K3L4L4j0j0J%JJ
143C86l8l9L2L3n5r9n2L6P8L4m0l9M8M8M9M8k1k2k1k1J2J2J3J2rrq3q3K7K8K7K8llllJ3J3
139C34J4J3k0k0k0k0L9M0M0L9J1J1n7n8j7P2M7Kn1n1K0K0j1j0K8K8L7n2p7p6M0L9M0M0j3j3
134C88j3j3KKKKm6m6n1L7Q6Q5j9j08p2k7j4j3J0J1k9k8jQ9Q8%k1k1k6k7PPPPj7j7j7j8J7J6
$$ plain form
166 348 364 379 347 316 284 252 227 201 176 151 129 108 185 262 324 297 246 195 222 249 277 304 316 328 339 351 366 381 341 389 482 486 412 338 326 314
162 314 347 379 378 377 376 375 367 360 352 344 350 357 363 369 335 302 313 324 373 422 396 371 397 424 376 328 343 358 418 477 443 410 420 431 476 521 432 343 360 376 392
157 392 408 397 387 376 365 335 305 275 245 307 369 432 494 451 407 364 320 295 270 245 220 257 295 333 371 429 487 441 396 391 387 427 467 448 428 365
153 365 301 290 279 313 346 375 404 359 314 318 322 326 330 348 366 384 402 416 430 444 458 503 549 549 550 491 432 477 521 542 563 539 515 525 536 442 349 300
148 300 251 202 153 197 241 285 328 331 334 337 340 327 315 302 289 265 241 217 194 223 253 283 313 391 469 496 434 340 289 312 335 369 403 393 383 384 384 385 386
143 386 348 309 341 374 319 220 168 204 282 316 276 237 285 333 382 430 409 387 366 345 357 369 382 394 385 376 293 210 237 265 292 320 317 314 311 308 321 334
139 334 348 361 341 321 301 281 320 360 400 439 450 461 404 346 329 401 448 450 399 348 368 388 377 367 395 423 460 408 331 255 295 334 374 414 401 388
134 388 375 362 364 366 368 370 324 278 227 264 350 435 416 308 236 209 195 182 192 203 174 146 145 234 322 322 301 280 254 227 234 241 248 255 238 221 204 186 203 219
129B19J6J6K7K8K7K7k1k1K4K3r5r6OJ11J01N8J0l5o7o8k5k6K3K4K3K3K9K8m6m5m9m8N5N5Q
125C19PM8M7J3o1m4%J4J4n8n7L2L3L2L3k4k3k4k3L6L6l9l8n7n7M7M7K8K7j7j7L9L8L8L9J7
121D45J6J7J7k6k7k6k7L1L1j4j3m3m3N6N6Ro5r3m9J9J8K2K1ppqpj2j1j2j2K2K2K1K2J2J2J2
116C79J2l5l4l5l4K0K1o4o3n7L1O5O4M0n0n0L9Q8Q7MMk5k6k6k5j3j3j3j2j4j3j3j3j9j9j9
112A69j8k7k7O2O3M0M0M0M0M5M5m4m4m2m2m2m2J3J2J3J2j3j4j3j4L3L3L3L3j5j6j5j5k5k5
107B33k5k5jjjjl2l2PR6J44J44N2l8j6j5k2k1p8p9p9p8K3K3K3K3K3K3K3K3kklkRRQRMMMML0
102C88L0L0L0k9l0k9k9o1o0n8n8N8J02M4m4o6K4pn1L9L9L7L7j2j1j2j1j9j8j9j8K2K2K3K2
98C05ononJ9J9k6M7O2j2q0l5P5P5k4r9o0J4l2l2J9J9J8J9j5j6j5j6L3L3L2L3LKLLk4k3k3k3
$$ plain form
129 219 235 251 278 306 333 360 339 318 342 365 270 174 180 291 392 450 460 425 358 290 265 239 262 286 309 332 361 389 343 298 249 201 256 311 319
125 319 326 374 421 434 373 329 329 343 357 299 242 274 307 339 372 348 325 301 278 314 350 311 273 216 159 206 253 281 308 291 274 313 351 389 428 445
121 445 461 478 495 469 442 416 389 420 451 437 424 381 338 394 450 459 394 301 252 271 289 311 332 325 318 310 303 291 280 268 256 278 300 321 343 355 367 379
116 379 391 356 322 287 253 273 294 230 167 110 141 206 270 310 260 210 249 337 424 428 432 407 381 355 330 317 304 291 279 265 252 239 226 207 188 169
112 169 151 124 97 159 222 262 302 342 382 427 472 428 384 342 300 258 216 229 241 254 266 253 239 226 212 245 278 311 344 329 313 298 283 258 233
107 233 208 183 182 181 180 179 147 115 122 218 362 506 558 520 504 489 467 446 368 289 210 132 155 178 201 224 247 270 293 316 314 312 309 307 316 325 333 342 346 350 354 358 388
102 388 418 448 478 449 419 390 361 300 240 182 124 182 284 328 284 218 242 235 184 223 262 299 336 324 313 301 290 271 253 234 216 238 260 283 305
98 305 299 294 288 283 302 321 295 342 404 392 312 277 352 427 403 304 244 258 226 194 213 232 250 269 254 238 223 207 240 273 305 338 341 343 346 349 325 302 279 256
93B56qqpqJ1J1J1J2L2L2L3L2p3p3J6J5J0RRJ0k0k1k0k0m5m5M1M2J7k7m7K8O9K4q9q9j3O2M5
88B14%PQMML8L8L8L7k2k3k3k3L5L6k2o7RJ12J09Op8p8MNk0k0k0k0K5K4K5K5p6p6J3J2j1j1
83B38j1j1L3L4L3L3J3J3J3J3l3l3N2N3l5q0k1O8j0r8o8k4KKMNM6M7m2m2J4J4J3J4j9j9O4O4
79C39J9p0m8l%m4j7j6K1K2K1K1%%j%M2M3L7L6M7m1q1q1NNMNk6k6k6k6M4M4M5M4k4k5k5k4j
74B39%j%N0N1o8j11m0N0K4k0m7mQ3L9k5k5k7k8QQPQPQQPK2K2K2K2j8j9j9j8j7j6j6j6L9M0
69B29L9M0OOOOJ8J7J7J7k2k1k2k2J1J2J1J2popopopoj4j4j3j4n3n2L6L7qppqN4N4N4N3j8j8
63C70j8j8J6J5J5J6l6l6l5l6K5K6o4o3L5L5L5L5o8o9l0O0N4N5k9k9QRQQn2n2j02j3O0N9O5
59B59O5j3j2j2j2j8j7j01j01L7J26J26L7k8k8l4l3J2J2J2J2M5M6r8r7r8rL0L0M7M6M7M7no
$$ plain form
93 256 248 240 233 225 236 247 258 270 302 334 367 399 326 253 269 284 294 303 312 322 302 281 261 241 196 151 192 234 251 224 177 205 274 298 209 120 107 169 214
88 214 214 221 229 233 237 275 313 351 388 366 343 320 297 332 368 346 279 288 400 509 515 437 359 363 368 348 328 308 288 313 337 362 387 311 235 248 260 249 238
83 238 227 216 249 283 316 349 362 375 388 401 368 335 387 440 405 325 304 372 362 264 196 172 174 176 180 185 231 278 236 194 208 222 235 249 230 211 275 339
79 339 358 288 240 237 237 193 176 160 181 203 224 245 245 245 244 244 286 329 366 402 449 408 327 246 251 256 260 265 239 213 187 161 205 249 294 338 314 289 264 240 239
74 239 239 238 238 288 339 271 160 120 170 194 174 127 123 206 245 220 195 168 140 148 156 163 171 178 186 194 201 223 245 267 289 271 252 233 215 198 182 166 150 189 229
69 229 268 308 314 320 326 332 350 367 384 401 379 358 336 314 325 337 348 360 353 347 340 334 327 321 314 308 294 280 267 253 200 148 184 221 213 206 199 191 245 299 353 406 388 370
63 370 352 334 350 365 380 396 360 324 289 253 278 304 240 177 212 247 282 317 249 180 150 210 264 319 290 261 269 278 286 294 242 190 88 75 135 194 259
59 259 324 311 299 287 275 257 240 139 38 75 201 327 364 336 308 274 241 253 265 277 289 334 380 282 185 87 78 108 138 185 231 278 325 320 314
54C14nnJ3J3J3J4j0j0j0j0N9N8K0o9p4p4J0J0J0J0RJ0J0J1J0J0o6o5K3K3LLLLj7j8j7j8%J
50A95%%J9J8J9J9J1J1J1J1l0l0l0k9l5l4l5l4L1L0L0L1M7M6m2m3j1j0j1j1L7L8L8L8J2J1J2
45C30J2L7L7L7L7k6k6k6k5l7l7l6l7MMNMm1m0m0m0L9L9M0L9N4N5l5l5MMNMJ8J8J9J8j08j07
40A67j9j9O4O5k5k5lklkkkkkL1L1L2L1OPOOj8j8j7j8J9J9o9p0jjjjk0k0k0k0L5L6L5L6j3j2
35B01j3j2N2N2N3N2L1L2n8n7MLMMOOPOj9k0j9k0j0rj0j0J6J6J7J6m1m1m1m2L0K9L0K9n1n1
30A72n0n1lkllR0R0Q9R0j8j8j8j8m7m8m7m8K1K1K1K1P0P0p9p8L6L6L7L6q2q1PPl2l2l1l2O2
25A55O3O2O3j5j6j5j5K2K1K2K2o4o3o4o3K7K8K7K8J6J6J7J6k3k4k3k4M7M7M7M7l4l4l3l4j0
21B39j1j1j0L6L7rqk2k2O7O7j4j4j3j4K0K0J9K0RQq0q0r9r9j0j0J3J3J3J3R0Q9JJn6n6j2j1
$$ plain form
54 314 309 304 317 330 343 357 347 337 327 317 376 434 454 385 311 237 247 257 267 277 286 296 306 317 327 337 271 206 229 252 255 258 261 264 247 229 212 194 194 195
50 195 195 195 214 232 251 270 281 292 303 314 284 254 224 195 160 126 91 57 88 118 148 179 226 272 230 187 176 166 155 144 181 219 257 295 307 318 330
45 330 342 379 416 453 490 464 438 412 387 350 313 277 240 244 248 253 257 216 176 136 96 135 174 214 253 307 362 327 292 296 300 305 309 327 345 364 382 274 167
40 167 148 129 193 258 233 208 205 203 200 198 196 194 192 190 221 252 284 315 321 328 334 340 322 304 287 269 288 307 238 168 167 166 165 164 144 124 104 84 119 155 190 226 213 201
35 201 188 176 228 280 333 385 416 448 390 333 337 340 344 348 354 360 367 373 354 334 315 295 285 276 266 256 272 288 305 321 280 239 198 156 186 215 245 274 223 172
30 172 122 71 68 66 63 60 150 240 329 419 401 383 365 347 300 252 205 157 178 199 220 241 311 381 302 224 260 296 333 369 287 206 213 220 188 156 125 93 155
25 155 218 280 343 328 312 297 282 304 325 347 369 305 242 178 115 142 170 197 225 241 257 274 290 267 243 220 196 243 290 337 384 350 316 283 249 239
21 239 228 217 207 243 280 271 263 241 219 286 353 339 325 312 298 318 338 357 377 386 394 314 234 135 36 26 16 29 42 55 68 158 247 248 249 193 137 125 114
16A14J1J2J2J1K4K4J13J13k1k2o6o6m1m1M8M9k2k1k2k1L5L5n3n4l5l5N3N4J3J3J3J3L4L3n5
12B52n6j1j1P9P8K1K2k3k3j0j1j0j0k5k4k4k4L6L6L6L6k4k4k5k4k2k2K2K2K1K1o7o8J2J1J2
7A79J2J7J8J7J7rrrrJ2J2J2J3o6o6k1k1O1O2k8k7M0M1Pq2q3PR8R9O1O0J6J6n0n0n0n0NMNN
2B66L8L8L8L8m3m3m3m3j7j7j7j7K1K0K1K0lkllK0J9O4O3J9J8p1p0o0n9n3n4j9P0J31Q6l0p4
-2B49j7P3L7qk2k2J2J3J2J2j1j1j2j1j1j2P2P2P8j0n0m9j0j0n5n4kjkkllllonK4j9m3M7K2
-7B56k3l4J1P2P2m5m5m5m5O7O6O6O7q5q4MNppr0r0l3N5NNQQQQj0j1L4L4m9n0M0L9l1l1J1J0
-12A36J3l2o0K9R6N1l6q0l0O0R6R5POl8l8j7j6O6O7l1j19j20l1K0J9K5K5J3J3J2J3k8k8k8
-17A30k8L9L9L9L9j7j6j7j6L6L7L4L4k4o8r6pK9j6n5j0P0P1j6j6l5l6l6l5RRQRM8M7l6l6K
$$ plain form
16 114 125 137 149 160 184 208 321 434 413 391 325 259 218 177 225 274 252 231 209 188 223 258 205 151 116 81 134 188 201 214 227 240 274 307 252
12 252 196 185 174 253 331 352 374 351 328 318 307 297 287 262 238 214 190 226 262 298 334 310 286 261 237 215 193 215 237 258 279 212 144 156 167 179
7 179 191 208 226 243 260 251 242 233 224 236 248 260 273 207 141 120 99 160 222 194 167 207 248 255 173 90 97 195 294 355 415 431 447 397 347 297 247 252 256 261 266
2 266 304 342 380 418 375 332 289 246 229 212 195 178 199 219 240 260 257 255 252 249 269 288 352 415 434 452 381 311 251 192 139 85 66 136 267 353 323 249
-2 249 232 305 342 334 312 290 302 315 327 339 328 317 305 294 283 271 343 415 493 483 433 384 374 364 309 255 253 252 250 248 245 242 239 236 230 225 249 230 187 234 256
-7 256 233 199 210 282 354 309 264 219 174 241 307 373 440 355 271 275 280 273 266 176 86 53 108 113 118 126 134 142 150 140 129 163 197 148 98 138 177 146 115 126 136
-12 136 149 117 57 86 182 233 197 117 87 147 243 338 345 351 313 275 258 242 308 375 344 225 105 74 94 113 138 163 176 189 201 214 186 158 130
-17 130 102 141 180 219 258 241 225 208 192 228 265 299 333 309 241 145 138 167 151 96 86 156 227 211 195 160 124 88 53 62 71 79 88 136 183 147 111 113
-21A13R1O8K5j2L4N8l1j05o0L0P4L1j3l0l0J2J2N1N1N1l8p4p4j1L4N8l0o5o5J9J8k8k9J6J6
-26A67O5O5k4k5k6k7k7k7mmnmO0O0J5J5o6o7K2K2J0J0J0J0k2k3k2k3k0k0O9P0J3J3l1l1j%
-30A97j%PPPPj6j6K8K8R8R8n1n0p5p4l0l0nmmmQ2Q2ppj6j6j6j5MNMNOPPOm9m9M0M0K8K7o2
-36B23o2k4k5k4k5L2L3L3L2J4J4J4J4l8l8l8l8J9J9K0J9O8O7k1k2o9p0J9K0QQQQLLKLllll
-41A97j4j4j4j4klkkRRRRqppqK8K8K8K8M3M4j6o1n4K0O5O5J7J7k8k7q8q8JJL0K9L0K9k8k8
-46B23k8k8J2J2J1J2poppK4K3K4K4k7k6k7k6n1n0oO8J14O9lp7m0L4J3l2o1o1K5K5%%%%L0K9
-51B02k9p4k5N0P5L0j8j9K3K3j5j5L0L0RQl6l6n4n4Q9Q9K5n0l3J1k3k4K3K4K5K6o4o4j0j0
-55A39L5L4O5O5k4k4nonononnL3L4n6n5LLm2m1Q2Q3opppnmKM7P8j2m9L9L4n5q6q6llL8L8o
$$ plain form
-21 113 204 272 297 285 319 377 346 241 181 211 285 316 303 273 243 255 267 318 369 420 382 308 234 223 257 315 285 220 155 174 192 164 135 151 167
-26 167 232 297 273 248 222 195 168 141 137 133 128 124 184 244 259 274 208 141 163 185 195 205 215 225 203 180 158 135 115 95 164 234 247 260 229 198 197 197
-30 197 196 196 203 210 217 224 208 192 220 248 346 444 393 343 268 194 164 134 129 125 121 117 199 281 274 267 251 235 219 204 208 213 217 222 228 235 242 248 199 150 190 230 258 285 223
-36 223 161 137 112 88 63 95 128 161 193 207 221 235 249 211 173 135 97 116 135 155 174 242 309 288 266 197 127 146 166 174 182 190 198 201 204 206 209 206 203 200 197
-41 197 183 169 155 141 139 136 134 132 141 150 159 168 160 153 146 138 166 194 222 250 293 337 321 260 206 226 291 356 373 390 362 335 247 159 160 161 191 220 250 279 251 223
-46 223 195 167 179 191 202 214 207 201 194 187 211 234 258 282 255 229 202 176 125 75 69 137 251 320 317 240 200 234 247 215 154 93 118 143 143 143 143 143 173 202
-51 202 173 99 74 124 199 229 211 192 215 238 223 208 238 268 277 285 249 213 159 105 194 283 308 258 225 236 213 189 212 236 261 287 223 159 149 139
-55 139 174 208 273 338 314 290 285 279 274 268 263 257 252 247 280 314 258 203 206 209 167 126 208 291 285 278 271 264 259 255 257 304 382 370 321 360 394 339 253 167 164 161 199 237 231
-61B31pk5k6J9J9l7l8M9M8J8k7j3P6K7o2j01j2J00J00m3m3llllK9K9K9K9j9j9j9j9o4o3o4
-65I0o3O3O4O3O3j2j3n7n7l8l9N1N0J1J0N6N5M1M1Oq4r9n5L3P7K5o4j06j6N1N1J2J2oopoQ
-70B05QPQQQQQk5k5k5k5O1O0O0O1k3k3k3k3L2L1n7n7o1o1J4J3PPPPl2l1l2l1L8L9L9L9opo
-75B02poppoj3j3j4j3M2M3L7L6K1o8p4J6P1j7l4J1M8Mp3p2l1l0M3M4L7L8ppj5j5j6j5J9J8
-80A70n0n0K2J10M2m7j42n2N5N6KLKLm1m0j9P0O2J8M2M2M2m7r7n2MMN1N1N6N6p7p8J2J2J1
-84B06J2j3j3rj0PN2L6n4q0l5QQK2K2K2K3MNMNj4j4j4j4j6j5j5j6J3J2N7N7mlK2R6J18J4q6
-89D00q6n0n0n0n0k3k3N1N1J06J06KKn7n8j2j3l5l6RJ0J6J7k8k8M4M5o0n9QPQPj7j7j7j7K3
-94A26K4K4K3l2l2l2l3KJJJK1K2K1K2JJm3m4O0O0j4j4k3k4k3k4K0K0J9K0K0K0J9K0j0j0rj0
$$ plain form
-61 231 224 199 173 192 211 174 136 185 233 251 224 211 287 314 252 151 139 239 339 296 253 250 247 244 241 270 299 328 357 338 319 300 281 217 154 90
-65 90 27 90 154 217 280 268 255 198 141 103 64 115 165 176 186 242 297 338 379 385 301 202 147 180 257 282 218 112 96 147 198 210 222 216 210 203 197 205
-70 205 213 220 228 236 244 252 260 235 210 185 160 221 281 341 402 379 356 333 310 342 373 316 259 198 137 151 164 171 178 185 192 160 129 97 66 104 143 182 221 215 208 202
-75 202 195 189 182 175 169 156 143 129 116 158 201 238 274 295 227 153 169 240 223 189 200 248 252 179 107 76 46 89 133 170 208 201 194 179 164 148 133 152 170
-80 170 120 70 92 202 244 197 55 3 58 114 116 119 121 124 83 43 24 94 156 174 216 258 300 253 156 104 108 112 163 214 270 326 249 171 183 195 206
-84 206 218 205 192 183 173 180 232 268 214 134 99 107 115 137 159 181 204 208 213 217 222 208 194 180 166 150 135 120 104 117 129 186 243 239 236 258 354 472 486 400
-89 400 314 264 214 164 114 91 68 119 170 276 382 384 386 329 271 259 246 211 175 184 194 210 227 199 171 215 260 200 141 149 156 164 171 154 137 120 103 126
-94 126 150 174 197 165 133 101 68 70 71 72 73 94 116 137 159 160 161 118 74 134 194 180 166 143 119 96 72 92 112 131 151 171 191 210 230 220 210 201 191
-98A91n1n2K3K3jjjjL8L8pn1o7OO4O3l1p5k0N4O6K2k2k3%jp4p5J0J0J0J0J7J6J7J6jkjkPP
-104A49PPr7r6j9O8R2Lp0k6Q3Q4J2J1jjjjk1k1k1k1J3J2J2J2POOPl5l4l5l4J3J4J3J4M4M4
-108A99k9l0K6K7K6K7N5N6j9j9m4m5%Jj1j1j1j1kkjkk2k2M6M7K4o6q9q9K1K2K2K2PPPQMMN
-113A38MJ2J1l3l3O2O3l9l9K5O8mr3r6qR2Kr3r1m4M4J05J06O1k9k2K3O2J7m8m8ooJ6J6k9k8
-118A38l7l7PQrj0rrlkO6O7J6n8q5m2L0K9L2L2K4K5K4K5l1l1l1l1MMMMK2K2K1K2o7o6j0O5
-123A23Q6J2m5m6pqL7L6J7J6n5n5K8P3J8n6p7l3J2J2N3N4J1J2j5K9M6k8j11j12n3K0O1O2L6
-127A53l7n8j4L1L1L9L8ooj0rrrPOPOj5j6j6j6j6j6j6j6L6L5L5L6l5l5l6l5J4J4J3J4m2m2
-132Em1m2N6N5N6N6K3K3K3K3nnnnqrn3n3k8k9M6M5j0rj0j0J7J7J7J6m6m6K8K9K4K4k0k0k9
$$ plain form
-98 191 140 88 111 134 133 132 131 130 168 206 199 148 81 87 151 214 183 108 88 142 208 230 208 185 185 184 110 35 45 55 65 75 92 108 125 141 140 138 137 135 142 149
-104 149 156 163 66 -30 -49 19 111 114 44 18 101 185 197 208 207 206 205 204 183 162 141 120 133 145 157 169 176 182 188 195 160 126 91 57 70 84 97 111 155 199
-108 199 170 140 166 193 219 246 301 357 338 319 275 230 230 231 220 209 198 187 185 183 182 180 158 136 182 229 253 187 98 9 30 52 74 96 103 110 117 125 129 133 138
-113 138 142 154 165 132 99 161 224 185 146 171 239 235 142 46 38 130 132 39 -52 -96 -52 53 159 220 191 169 192 254 271 223 175 169 163 179 195 166 138
-118 138 101 64 71 79 70 60 51 42 39 37 103 170 186 128 43 1 31 60 92 124 148 173 197 222 191 160 129 98 102 106 110 114 136 158 179 201 134 68 58 123
-123 123 209 221 176 130 123 115 152 188 205 221 166 111 139 212 230 174 97 64 76 88 141 195 206 218 203 232 278 250 139 27 -26 -6 55 117 153
-127 153 116 58 44 75 106 145 183 177 171 161 152 143 134 141 147 154 160 145 129 113 97 81 65 49 33 69 104 139 175 140 105 69 34 48 62 75 89 47 5
-132 5 -36 -78 -22 33 89 145 168 191 214 237 232 227 222 217 209 200 147 94 66 37 83 128 118 109 99 89 106 123 140 156 110 64 92 121 145 169 149 129 100
-137A00l0M0L9J2p7l8N1Q6lp6l1J2J3J5J5J11J11K7o2q0q1l5N4N5Ro4o3J8J8J9J8L0L1L0L1
-141C05l4l4l3l4%%%jJ6J6J6J7LLo6o5NR4lr3j35m8L3P6L4j0k7k7L9L8L9L9j2j3j3j2l1l1
-146E1l1l0M1M2M2M2K8K8J5l1m3M5J17K7r4r5JJpn1l4N4N7J2o2o1m1m0R1R3L1L1m2m3m6m6
-150E2K8K8M2M1l2l2qpqpk1k1N4N3lmmlJ2J2J2J2k6k7k6k6k7k6k7k5QPQRK6K7K7K6j0j0j0
-155I4j0JJ%JnnnnJ4J3J4J3K9L0K9L0n3n4K1K2jjj%k8k8M1M1Q3pr0r1j5j5L0K9j2j2j2j2M4
-160A18M4M4M3j8j8o3o2o0n9M3M4N0N0k4k5M8M7R1R2mlmll5l4l4l4rrqrj4j3j3j4j6j6Q1Q2
-165B76N2l6o1o1k5k5k4k5O3O3M5m4q0J0Q7Q8n6n5j1j1J6J6Q4Q4k1j10j11k1opjjjj%j%JJ
-170I1%K0J9J9J9k7k8k8k8M0M0M0M0n4n3l3N7Q0L5qro3o4o3o3mnn7L2O5K2k2k1JJJKO2O2j1
$$ plain form
-137 100 70 110 149 161 84 46 97 183 180 104 73 85 98 113 128 239 350 377 315 235 154 119 173 228 237 173 110 128 146 165 183 213 244 274 305
-141 305 271 237 204 170 170 170 170 169 185 201 217 234 237 240 174 109 114 208 205 112 -23 -71 -38 38 72 62 35 8 47 85 124 163 151 138 125 113 82 51
-146 51 20 -10 31 73 115 157 185 213 228 197 154 199 316 343 249 154 155 156 149 98 64 118 175 187 125 64 23 -17 74 167 198 229 187 144 98 52
-150 52 80 108 150 191 159 127 119 112 104 97 76 55 109 162 159 155 151 148 160 172 184 196 170 143 117 91 64 38 11 -14 -6 1 9 18 44 71 98 124 114 104 94
-155 94 84 85 86 86 87 82 77 72 67 81 94 108 121 150 180 209 239 186 132 153 175 174 173 172 172 144 116 157 198 281 274 184 93 78 63 93 122 110 98 86 74 118
-160 118 162 206 249 231 213 150 88 28 -31 12 56 106 156 132 107 155 202 293 385 381 378 374 371 336 302 268 234 225 216 208 199 185 172 159 145 129 113 194 276
-165 276 328 292 231 170 145 120 96 71 134 197 242 198 118 128 215 303 247 192 181 170 186 202 286 370 349 239 128 107 101 94 93 92 91 90 90 89 89 90 91
-170 91 91 111 130 149 168 141 113 85 57 97 137 177 217 163 110 77 134 214 249 241 232 169 105 42 -21 -25 -30 -87 -55 10 32 10 -11 -10 -9 -8 -6 56 118 107
-175A07j1%%%%N9O0j5j4j6j7K8K9QQRQN1N0n4n4n8n9M6M5K2K2n2n2j4j5j4j5L1L1j4j3K3K3
-179A73p9j23m9M0N5J2QPNNM8M8M9M8l7l7l7l7P4P4k9l0j6j6k9p5k5O4J10O6QROOk3k3k3k3
-184B04mmmmM3M3l0p5o1K8M4%l4l5j5P3P5L0o7o6nQ4Q4ml2l2l7l7k6k6k6k6qqqpJ8J8J8J8
-189I9MLMML7L7L4L5k9p4r8j0L8L8M3M3l1l2l2l2K4K4K1K1k7p1r5pP3P5NOj7j8j7j8L4L4L3
-194A61L4rrrrN1N1k2k3m0m0m0l9K6K6K6K6k0k0j9k0p8p7K5K6NONNK5K6K5K6j4j4L1L0k9l0
-198G5M4M5l2l2M1Q6J5p5m6kRJ0K6P1Q4nn6n6l4l3QQj8o3J0R9J10K0n7n7rrn3n4KLM6M7m0
-203A28l9NNL3L3L4L3j9k0j9k0j2j3j2j3QQl7l7l0l0O7O8M6m2m6M4P0K6j8j8N6N6m8m7p3p4
-208E3k8k8M9N0NONNNNk1k1N4N3n0n1n0m9j0ro0L0N9O1K1K2N7N8Mq5j02j00mlO2O0m2m1o8
$$ plain form
-175 107 96 96 96 96 96 155 215 200 186 170 153 181 210 218 226 235 243 294 344 290 236 178 119 165 210 232 254 202 150 136 121 107 92 123 154 140 127 150 173
-179 173 94 -29 -78 -38 17 29 37 44 49 54 102 150 199 247 210 173 136 99 173 247 218 188 172 156 127 52 27 91 201 267 275 284 290 296 273 250 227 204
-184 204 200 196 192 188 231 274 244 169 108 136 180 180 146 111 96 169 244 274 207 141 136 220 304 300 268 236 199 162 136 110 84 58 50 42 34 27 45 63 81 99
-189 99 103 106 110 114 151 188 222 257 228 154 56 46 84 122 165 208 177 145 113 81 105 129 150 171 144 73 -22 -29 44 119 124 130 113 95 78 60 94 128 161
-194 161 195 186 177 168 159 210 261 239 216 176 136 96 57 83 109 135 161 141 121 102 82 4 -73 -48 -22 -17 -11 -6 -1 24 50 75 101 87 73 104 134 105 75
-198 75 119 164 132 100 141 227 242 167 121 119 128 138 164 235 319 314 258 202 168 135 143 151 133 70 80 179 289 309 252 195 186 177 124 70 72 75 121 168 128
-203 128 89 94 99 132 165 199 232 213 193 174 154 142 129 117 104 112 120 83 46 16 -14 53 121 167 125 79 123 193 219 201 183 239 295 247 200 127 53
-208 53 25 -3 46 96 101 107 112 117 122 127 106 85 139 192 142 91 41 -8 -18 -27 -87 -57 2 63 84 106 163 221 225 140 38 -62 -66 -69 -7 53 11 -30 -98
-213i8o7O6O6N9O0j5j4L2L2L1L2ooooqrqqj7j7j6j7J8J8O2O3J1J2o3o3k8k9J6J6K2K2K3K2
-217A82K8K8m6m7o5o6L8L8%%m4m5J3J3J3J3KJJKm0l8j9P0N5J1l3l3J1J0J1J0OOONnnonJ4J5
-222A05J4J5L5L6L0L0j9j07o4K6N7N8j2j1nnnnm4m5K9L0M4M3l0l0k5k5k5k4j0rj0rJ3J4J4
-227G4J3LLm1m1O6O6qqj9j8j9j9M5M4l0k9J5J5J5J5l4l3k7k8jQ8M6m3n1oL8L8O8O9K4K4o9
-232B45o9o9o8K2K3K3K3K2K3K3K3m5m4m5m4M1M0M1M1K5K6K5K5o0o0n4n5j5P4M9Nk1k1k3k3
-236A03k3k3k2k3M0M1M0M0k1k1k1k2m1m2LLl3l5M0L9P4P5N1l8m6m5K0K0j6o1j6P2P1j7l6l6
-240I4KKKKKKm2m2N9O0m3q8k6O1J08O4Q9Q9L8n2j03j4K7o2j05o1M3M2m8m8LR2N3Qnorrj0r
-245A60j3j2j2j2j0j0rj0J6J7j5L1N4l5n1oM5M5k6k6l2l2M2M3J9J9n5n4K7K8K8K8j7j7j8j7
$$ plain form
-213 -98 -165 -99 -33 26 86 71 57 89 121 152 184 178 172 166 160 152 143 135 127 110 93 77 60 78 96 158 221 232 244 181 118 90 61 77 93 115 137 160 182
-217 182 210 238 192 145 80 14 52 90 90 90 46 1 14 27 40 53 55 56 57 59 19 -19 -38 32 87 98 65 32 43 53 64 74 80 86 92 97 92 87 81 76 90 105
-222 105 119 134 169 205 235 265 246 139 75 101 158 216 204 193 188 183 178 173 129 84 113 143 187 230 200 170 145 120 95 71 61 52 42 33 46 60 74
-227 74 87 90 93 52 11 77 143 135 127 108 90 71 52 97 141 111 82 97 112 127 142 108 75 48 20 19 107 153 110 59 53 91 129 197 266 290 314 245
-232 245 176 107 39 61 84 107 130 152 175 198 221 176 132 87 43 84 124 165 206 231 257 282 307 247 187 133 78 63 137 186 191 170 149 126 103
-236 103 80 57 35 12 52 93 133 173 152 131 110 88 47 5 8 11 -22 -57 -17 22 96 171 222 184 138 93 113 133 117 56 40 112 183 166 130 94
-240 94 96 98 100 102 104 106 64 22 81 141 98 10 -16 45 153 217 306 395 433 381 278 264 291 229 124 63 106 148 100 52 55 147 200 208 203 197 188 179 169 160
-245 160 147 135 123 111 101 91 82 72 88 105 90 121 175 140 89 83 128 173 147 121 89 57 99 142 161 180 125 71 98 126 154 182 165 148 130 113
-250A13m3m2l5l7pQ1Q2pooj1j1m3m2MNO6J11L9n1j40n0N7J02L0j4j4L1k4o8m0l9LLKKN1N0
-254A02POo6o4QPJ9J9J5J6k4o8MR2J42N4k9p4o2o2k0k0P6P7k8k7l1l1J4J4J8J8J9J8N1N2k3
-259B19k3l1l1P3P2k0k1o6o5q0q0k6O2J38J38Oq3o3K6J5J5rrj0roopoj9j9k0j9jj%jJ4J4J4
-264G5J3k6k6k6k5n4n3P9P9J5J6J6J5J2J1J2J1J%%Jqpqqk6k6k6k6L0K9L0K9K6K6m8m9l0l0
-268B4J5J4k9k9M3M4O7O7l2l1j3P6P6j3k9k9l4l5m4m4R0R0J8J9n5n5j6j7j6j6opoom8m7K5
-273A1K6K3K2K2K2q6q5l2N6L8L8Q0P9N7r1j32m4M8M8k2k1K1K1K0K1q1q0m8K6P7P9k1k0J5J6
-277A03J6J6l8l8l8l7O3O5Oo7n1K0K0K0JKJJJ6J5J5J5j0j0j0j0l7l6l5l6O4O4O5O4KJJKJ3
-282B18J3J4J3k7k6k7k6o9o8L6Q0J3o1m4%k0o3o1j7J9J8K1K1K3K2K3K3M7M6k5k6KM6O6ro6
$$ plain form
-250 113 70 28 -7 -44 -51 30 112 105 99 93 82 71 28 -14 -10 -5 61 172 211 160 20 -30 27 129 159 145 131 162 138 70 30 -9 -6 -3 -1 1 52 102
-254 102 109 115 49 -15 -7 0 19 38 53 69 45 -23 -19 73 215 269 240 166 104 42 22 2 78 155 127 100 69 38 52 66 84 102 121 139 190 242 219
-259 219 196 165 134 207 279 259 238 172 107 27 -53 -79 -17 121 259 265 182 119 145 160 175 166 157 147 138 132 126 119 113 94 75 55 36 35 34 34 33 47 61 75
-264 75 88 62 36 10 -15 -69 -122 -43 36 51 67 83 98 110 121 133 144 145 145 145 146 138 131 123 115 89 63 37 11 41 70 100 129 155 181 133 84 54 24
-268 24 39 53 24 -5 38 82 149 216 184 153 140 216 292 279 250 221 187 152 108 64 154 244 262 281 226 171 155 138 122 106 100 93 87 81 33 -14 11
-273 11 37 60 82 104 126 40 -45 -77 -21 17 55 135 214 271 180 48 4 52 100 78 57 78 99 119 140 59 -21 -69 -43 34 113 92 72 87 103
-277 103 119 135 97 59 21 -16 47 112 118 51 0 20 40 60 61 63 64 65 81 96 111 126 116 106 96 86 49 13 -22 -58 6 70 135 199 201 202 203 205 218
-282 218 231 245 258 231 205 178 152 83 15 51 131 144 83 39 39 19 -44 -105 -122 -103 -85 -64 -43 -20 2 25 48 95 141 116 90 92 138 204 195 129
-286A29k2K3K3l1l2QROo7r2m8J4N8L5l7n7j3O1O1K5K6j8j9l3l1P0J16R4J9l9m0m3m3JJ%%J
-291A15%n6n5M5M6J9k4n3L7L8omM1N3Qn3n3n6n5k3O5P9rm3m4L0K9j6j5L4L4j1j1J8J7J7J7
-296A55l4l3N5N6NNONl8l8l6l5qL7O5k5o6k3qqk3k1O6O7j1j1L4L4j3j4j3j4o4o4K1K1rn4M
-300b7R2R5Pj3L1K1o8j09k1O4O4k0j9p1p0J9J8L1L2L3L2J7J8p2p1M3M3M3M3k6k6k5k6J8J7
-305A17J7J7jjjjj7j6j6j7j3j4j3j4j5j3K8L0m8m7M0M1J4J4l0l0k3k5j0L5K6m7p2k8P6P5p
-309A1qj3L0M7k7r2r3NP8L2m3m1L3M7LL1L3J5J6J5J5jjjjM4M3m5m5l0k9J5J5M1M1j08j06M
-314g0Ll6l6J3Q6O9K5N3N2M9N0k9l0k9k9MMNMppppMNMMnonononnonnnK8K8K8K9k6k5k5k5n
-320I0nnnq4q6J7R0Q3Rl4l3K7K7K7K7L7L6n3n2q2q0PQJ4J4J3J3N6N6m8r0m5M5J5k6JKjjOO
$$ plain form
-286 129 107 130 153 122 90 98 107 113 46 -46 -94 -80 -22 13 -24 -81 -94 -33 28 53 79 61 42 9 -22 48 164 258 277 238 198 155 112 113 114 114 114 115
-291 115 115 59 4 49 95 114 90 37 74 112 106 102 143 196 204 151 98 42 -13 -36 29 108 99 56 12 42 71 55 40 74 108 97 86 104 121 138 155
-296 155 121 88 143 199 204 209 215 220 182 144 108 73 65 102 167 142 76 53 45 37 14 -7 59 126 115 104 138 172 159 145 132 118 54 -10 11 32 23 -31 -27
-300 -27 65 160 167 154 185 206 138 29 8 72 136 116 97 26 -44 -25 -7 24 56 89 121 138 156 84 13 56 99 142 185 159 133 108 82 100 117
-305 117 134 151 150 149 148 147 130 114 98 81 68 54 41 27 12 -1 27 57 9 -38 2 43 57 71 41 11 -12 -37 -47 -12 14 -33 -105 -133 -57 18 11
-309 11 3 -10 20 67 40 -52 -145 -140 -62 -30 -73 -114 -81 -34 -31 0 33 48 64 79 94 93 92 91 90 134 177 132 87 57 28 43 58 99 140 32 -74 -70
-314 -70 -67 -103 -139 -126 -40 29 54 107 159 208 258 229 199 170 141 145 149 154 158 151 144 137 130 134 139 143 147 142 136 131 125 120 114 109 104 98 93 88 83 111 139 167 196 170 145 120 95 90
-320 90 85 80 75 -9 -95 -78 12 95 104 70 37 64 91 118 145 182 218 165 113 31 -49 -42 -34 -20 -6 7 20 76 132 84 -6 -51 -6 9 -17 -16 -14 -15 -16 -10 -4
-325dMOl6l6L7Q0O3k5m6m6l8l7l8l7N0N0N1M9j7j8j6j7M4M6M5M6m7m6m7m6KKJKL1L3L2L2J0
-329A19RRJ0K8K8m6m6j6j6j6j7k8k7P5P5jkjjl3l3l3l3L0L0K5K5kr1r0jJ16J18P0k0k2k3k8
-334A41k8RRQRk8k8J6J7K2K2n3n2JJJJlmmlj4j5j4j3qqqqk0k1P6P8N4l5rL4N7N7m4m5n6n6
-339C6n6n6k0k1k0k0N1N1N1M9M9M8n6n6k2k2K2K2%%%%K9K9P3P4onq0p9l6l5L7L8PPOPK0J9
-344A35n4n4K8K8K8K8n4n5n3n4L6L7L6L7QPo7o6nmR8R9k0j9K5K5MMp0p0J5J5J5J5J%J%K7K6
-349A33K7K6k8k8k8k8J3J3J2J3PPPPPPPPj9j9k0j9k5k6k6k6O8O7l6l6llM1M2qpppnmnmmll
-355H4lk2k2k7O1O2O1pqk5k6k6k6L8L7L8L7n5n5n5n5J8J9J8J9M6M6jr1q5LP5P6L3n5m9n0k
-359B6kklj9k1k1k1O8O9nnj2j1j2j2j0qj0j0N6N7k1j09o8K1R8R9L4L4m0m1n5n4J7J9j7j5j7
$$ plain form
-325 -4 0 6 -30 -66 -29 51 114 89 43 -3 -41 -78 -116 -153 -103 -53 -2 47 30 12 -4 -21 23 69 114 160 113 67 20 -26 -24 -22 -21 -19 12 45 77 109 119
-329 119 128 137 147 175 203 157 111 95 79 63 46 18 -9 66 141 140 138 137 136 103 70 37 4 34 64 89 114 112 21 -69 -70 46 164 234 214 192 169 141
-334 141 113 122 131 139 148 120 92 108 125 147 169 116 64 65 66 67 68 65 61 57 54 40 25 11 -2 -10 -18 -26 -34 -54 -75 1 79 133 98 89 123 180 237 193 148 92 36
-339 36 -20 -76 -96 -117 -137 -157 -106 -55 -4 45 94 142 86 30 8 -14 8 30 30 30 30 30 59 88 161 235 229 224 144 65 29 -6 31 69 76 83 89 96 116 135
-344 135 81 27 55 83 111 139 85 30 -23 -77 -41 -4 32 69 77 84 17 -49 -54 -58 40 139 119 100 125 150 154 158 88 18 33 48 63 78 79 79 80 80 107 133
-349 133 160 186 158 130 102 74 87 100 112 125 132 139 146 153 160 167 174 181 162 143 123 104 79 53 27 1 69 136 100 64 61 58 99 141 133 126 119 112 107 103 98 94 90 87 84
-355 84 81 59 37 10 71 133 194 187 179 154 128 102 76 114 151 189 226 171 116 61 6 24 43 61 80 126 172 171 80 -5 -2 73 149 182 127 78 28 26
-359 26 24 22 19 0 -21 -42 -63 5 74 69 64 52 41 29 17 7 -1 -11 -21 35 92 71 -38 -106 -85 13 112 146 180 140 99 44 -10 7 26 9 -6 -23
-364b3j6K4K4K5K5OOOOl2l3l2l3L1K9L0L0PPPPl4l3l4l3M0M1R2Km3m3m9m7K7K7j6j7n2n2K3
-369a00K2L1L2L0L1mnnnL4L3L3L3jjkjp4p3K9L0J5J5J5J6K4K4n0m9%%j5n9m6K7N5N7M4M5%
-374A85%l3l3J2J1l9l9L4L5j1j1j0j1lkp7p6rrL6L6K3K5K4K4lmmmO4O4j0j1m6m6m6m5QPJ0
-379A6J1L7Q3M8n6p4L1O5K0q1q1OQ0O9K5m9m9m3m3l9m0RN2P1ko4k0N3N4ppppj0rrrrj0qrQ
-384dOQPL1L0L1L1n4n3K0K1L0L0j5j4k7k7k6k6J8J8J9J9k2k2k2k1k3k3N1N0J6J7J6J7nnnn
-388H7k6k7k6k6L8L9M0L9n1n0poJ7J7J7J8j1j0j0j1k4k4K0K1J6J6J6J6j4j5j4j4j1j1j1j0
-393HJ7J7N6N6Pq1p7p5J7J6J7J7L1L3L3L3j3j3n7n6MMMLL1L1r6r7j1P8P1P2J1J1J1J1rj0r
-398I6rJKKJRQQQl2l3l3l1NPOPN6N7k2j10q4MN3N1J0RJ0J0LMLMm7m6N6N8L1L1j3j3J3J3J2
$$ plain form
-364 -23 -39 -15 9 34 59 65 71 77 83 51 18 -14 -47 -16 13 43 73 80 87 94 101 67 34 0 -33 7 48 140 142 99 56 7 -40 -13 14 -2 -19 -71 -123 -100
-369 -100 -78 -47 -15 15 46 42 37 32 27 61 94 127 160 159 158 156 155 81 8 37 67 82 97 112 128 152 176 126 77 77 77 62 3 -43 -16 39 96 140 185 185
-374 185 185 152 119 131 142 103 64 98 133 122 111 101 90 87 85 8 -68 -77 -86 -50 -14 9 34 58 82 79 75 71 67 131 195 185 174 128 82 36 -9 -1 6 16
-379 16 27 64 147 195 139 65 96 161 181 100 19 25 105 174 199 150 101 58 15 -24 -64 -55 -3 68 66 2 -18 35 89 82 75 68 61 51 42 33 24 15 5 -3 -12 -4
-384 -4 2 10 17 48 78 109 140 86 33 53 74 104 134 119 105 78 51 25 -1 17 35 54 73 51 29 7 -14 -37 -60 -9 41 57 74 90 107 102 97 92 87
-388 87 61 34 8 -18 20 59 99 138 87 37 30 24 41 58 75 93 82 72 62 51 27 3 23 44 60 76 92 108 94 79 65 51 40 29 18 8
-393 8 25 42 98 154 161 80 3 -72 -55 -39 -22 -5 26 59 92 125 112 99 42 -14 -10 -6 -2 1 32 63 -33 -130 -141 -63 8 80 91 102 113 124 115 105 96
-398 96 87 88 90 92 93 102 110 118 126 94 61 28 -3 2 9 15 22 78 135 113 3 -81 -77 -24 27 37 46 56 66 69 73 76 80 33 -13 43 101 132 163 150 137 150 163 175
-403A75J3m9m9n0m8K3K4k1j9RJ1J0J0l1l0J3J2J5J5l0k8J6J6J7J7J7J7J9K0JM6P1j8o9o9K9
-407A05K9n7n7j3j1j9j8K6K5L5L4P9P9j4j5k0k0l8j27q1PM7M7QRLLLLk5k5k4k5LLM6M7L4L3
-412A19j1j1opopk1k1o3j09o0K9P5L1o2o3L8L9M9M9NNk8k8M6Q8M3m7j8K6M1M2%jm5m6m1m0
-417a6J8R3R0J6m9r5m1L3K5K6L0L0j1j2n6n6n2n3N1N0J9J9k5k5j1j1L2P7L9l6k1K4L7l8p9
-421B2nO5O5l3l4nmnnm5m5J4Q7R0M5l0k9o3o2l4L8M9k6m8lN3N4m6m7j0rj0j0L5L6L7L6LMm1
-426H4m1P1P2J3o0k9M6K4k0J1J1on1n8J7M6M6m2m2m2m2n6n7n3n2L6J10J09L5o1o0ONM0mk2
-430a6N0J11O6j0n4k1K3K1k4q1q0n1K3P3P4NMk8k8k8k9J6J5J5J6j2j2j2j2jjj%j6j6j6j6O1
-435HO1O2O2ooooK5K4K5K4r0r0j6j7ONNNNNNMNNNNj8j7j8j7RRJ0RK7K7p7p6n1n1N3N3QQRQ
$$ plain form
-403 175 188 139 90 40 -8 15 39 18 -1 8 19 29 39 8 -22 -9 3 18 33 3 -25 -9 7 24 41 58 75 94 114 115 161 232 214 145 76 105
-407 105 134 77 20 7 -4 -23 -41 -15 10 45 79 158 237 223 208 188 168 130 3 -78 -71 -24 23 31 40 43 46 49 52 27 2 -22 -47 -44 -41 5 52 86 119
-412 119 108 97 91 84 78 71 50 29 -34 -143 -203 -174 -99 -68 -130 -193 -155 -116 -67 -18 -13 -8 -36 -64 -18 70 113 66 48 74 115 157 157 156 111 65 24 -16
-417 -16 2 95 185 201 152 57 16 49 74 100 130 160 149 137 81 25 -27 -80 -29 21 40 59 34 9 -2 -13 19 96 135 99 78 102 139 101 22
-421 22 17 82 147 114 80 75 71 66 61 16 -29 -15 72 162 207 177 148 85 23 -11 27 76 50 2 -1 52 106 60 13 3 -6 -16 -26 9 45 82 118 121 125 84
-426 84 43 114 186 199 139 110 156 180 160 171 182 176 125 67 84 130 176 134 92 50 8 -48 -105 -158 -210 -174 -64 45 80 19 -41 -35 -30 10 6 -16
-430 -16 34 145 211 201 147 126 149 170 146 65 -15 -66 -43 30 104 109 113 85 57 29 0 16 31 46 62 50 38 26 14 13 12 11 11 -5 -21 -37 -53 8
-435 8 69 131 193 187 181 175 169 194 218 243 267 177 87 71 54 60 65 70 75 80 85 90 94 99 104 109 114 96 79 61 44 53 62 72 81 108 135 58 -18 -69 -120 -67 -14 -6 2 11 19
-441A9O0O0j5j4l1l0J4J4N2N2k2k2rqrqK8K8K7K8J0J0RJ0o5o6o5o4K5K6m7m8k6k6J07J08j0
-445A02j0rj0k4k5k4k3O8O9nnk6k7k6k5L8M0M0L9l1l1l1l1j8j7j8j8LLMLj2j1L3L1M7M7m2
-450F8m2%%j%J3J3J3J3OOOOLKq4q3L1P4J6p1j34m6K0O4O3J9KLJ3J3l0l1j0j0L5L5j2j1j2j1
-455e1N4N6N5N6kkr0r0k7k7k8k7K3K3K3K3PPOPj6j7j6j7mnM0L9P8P7m1q5k3O6L8oj1j1j4j3
-460E5L0L1L1L0l2l3l2l3MMLMk9l0k9k9OOOPJ9J8J9J9O4O3k5k6llM1M1jkm1m1r1lL6L6j2j1
-465F7L2L3j3j2j3j3j6j5j6j6mnnmMMMNj0rk1O8P7j2m6m5QPQPJ6J6p3p2N7N5K4o6p6J2R7R9
-470A38K7o3j2j2N1N0l8l8m3m4M0M0M4m4q3q2M5M4M5M5k8k7k7k7M8M8LLJ5J4p5p3j5j4j5j4
-475g4P5P7j3j3MMNMm9m7m3m3K4J13O9k0p8p9MNKLKKJ2J2N5N6J11J12m0j30p8J1N0l9k2k1
$$ plain form
-441 19 79 139 124 110 79 49 63 77 129 181 159 137 128 120 111 103 131 159 186 214 224 234 243 253 188 122 57 -7 18 44 -3 -51 -77 -103 4 112 102
-445 102 92 83 73 49 24 0 -23 45 114 109 104 78 51 25 0 38 78 118 157 126 95 64 33 15 -2 -20 -38 -35 -32 -28 -25 -37 -48 -15 16 63 110 68
-450 68 26 26 26 25 25 38 51 64 77 83 89 95 101 104 106 22 -61 -30 44 60 -11 -145 -191 -171 -107 -44 -25 -23 -20 -7 6 -24 -55 -65 -75 -40 -5 -17 -28 -40 -51
-455 -51 3 59 114 170 168 166 76 -14 -41 -68 -96 -123 -100 -77 -54 -31 -24 -17 -11 -4 -20 -37 -53 -70 -74 -79 -39 0 78 155 114 29 6 72 110 104 93 82 68 55
-460 55 85 116 147 177 145 112 80 47 51 55 58 62 33 3 -26 -55 -49 -43 -37 -30 -11 7 26 45 109 172 147 121 118 115 156 197 196 194 153 112 21 18 54 90 78 67
-465 67 99 132 119 107 94 81 65 50 34 18 14 9 4 0 4 8 12 17 7 -2 -23 45 122 110 64 19 27 34 42 49 65 81 8 -64 -7 48 72 6 -70 -58 39 138
-470 138 165 102 90 78 129 179 141 103 60 16 56 96 140 96 13 -69 -24 20 65 110 82 55 28 1 49 97 100 103 118 132 57 -16 -31 -45 -60 -74
-475 -74 1 78 65 52 56 60 65 69 20 -27 -70 -113 -89 24 93 73 -5 -84 -80 -75 -73 -70 -68 -66 -54 -42 13 69 180 292 252 122 44 55 105 66 44 23
-479B3k6k7LMMLJ5J4J4J5LLLLOON0N0j5j6j04j04m4m4M5M4M9M7l7l8L7Q1K0o8k8J5J1l4k7
-484d4k8k4k5M1J29J72Q3j05j50r0kL3L1ooJ2J2J1J2p1p1J7J7J8J7o6o6j1P7P8j2m0m0M3M4
-488a0N1N1QPk9l0Jm4m8M0R9N7l2l2M9M9Mq4o0j5J7J6k5k5j7j8P0P1n5n5LM8K5o4o1K8L2L3
-493E5L8L9m4m3m1l9N1R6P5j5r4j38q1RM9M9N4N5L0L0n9n9k2k3K1K1K1K2K1K2l9l9l7l9L1
-497b3L1L1L1k4k4k3k5opopO8P0k0k0K7K6K6K6l2l2l2l2onL9L9l4l3K5P0L4n4k7J8J1J1J4
-502A25J5j4j4j4j4m0m0l9m0J0J0J0J0k2k1k2k2J04J03O5k4K3K2j6j06j02j4P7P8l8l8OOk7
-506ck7J7J6N0N0l8l9o6o8K2K2O6O7k2k2n6n6j3j2m5m5J4N8N6l4m9oO5O5O7O8k7k7k6k6j6
-510b0j5j6j6KJKJL5L4L5L5J3J4J4J3LKKLm2m3m2m1opooN9N9L0m5r7n3NQ0Q5M2l2p7n4K0M8
$$ plain form
-479 23 -3 -30 -27 -23 -19 -16 -1 13 27 42 45 48 51 54 60 66 116 166 151 135 31 -73 -117 -161 -116 -72 -23 24 -13 -51 -14 67 87 19 -9 6 17 -17 -44
-484 -44 -72 -96 -121 -80 49 221 304 199 49 -41 -43 -10 21 15 9 21 33 44 56 -15 -86 -69 -52 -34 -17 -83 -149 -160 -83 -5 -17 -57 -97 -54 -10
-488 -10 41 92 100 107 78 48 49 5 -43 -3 96 153 121 89 138 187 191 107 47 32 49 65 40 15 -2 -20 50 121 66 11 14 62 87 23 -38 -10 22 55
-493 55 93 132 88 45 4 -35 16 112 187 172 78 -60 -141 -132 -83 -34 20 75 105 135 76 17 -5 -28 -7 14 35 57 78 100 61 22 -15 -54 -23
-497 -23 8 39 70 46 22 -1 -26 -32 -39 -45 -52 16 86 66 46 73 99 125 151 119 87 55 23 17 12 51 90 56 23 48 118 152 98 71 89 100 111 125
-502 125 140 126 112 98 84 44 4 -35 -75 -65 -55 -45 -35 -57 -78 -100 -122 -18 85 150 126 149 171 155 49 -53 -67 10 88 50 12 18 24 -3
-506 -3 -30 -13 3 53 103 65 26 -40 -108 -86 -64 2 69 47 25 -31 -87 -100 -112 -157 -202 -188 -130 -74 -108 -157 -163 -98 -33 34 102 75 48 22 -4 -20
-510 -20 -35 -51 -67 -65 -64 -62 -61 -26 8 43 78 91 105 119 132 135 137 139 142 100 57 15 -26 -32 -39 -45 -51 8 67 97 52 -45 -98 -93 -13 72 114 82 5 -49 -29 19
-515A9M9K2K3K2K3n8n8n7n9L1L0L0L0lllljjjjK5K5K4K5n1n1n1n1J9J9J9J8kmooj2n7lP0R0
-521G1J8j1j1j2j3j2j3J5J6l0k8P0P1lmk0k1k0k1J6J6J5J6OPOOk7k7k7k7k5k6k7k6J9J9J9
-525b5K0K7K8j6j7N1N0k4k3MNNNk2k1k1k1n8n9J5J5O5O4O0O0O6rr7r8j2L2k1r4n7J7J5J6K2
-530e3K3K2K2p6p6K7K7O6O6K3K2m8m8mmO0O1j3j4l6l6QRooL9L9k4k5k4k3RRl3l5k6k5P8P7
-535E2LMm0m0j9j9K3K2j6o1l6L9O5K2k4k3O2O3m1m0j4j5N9O0nmm9m7K2K3K3K3m2m1m1m2O6
-539b8O4Po7n1pRQK4K4K3K4o2o3J1J2J5J5J6J5rrqrK5K5j8j9o7o6QQM7M8R1R2rrq3q2k1k1
-544i7k2k1M0M1mmP0P1l3l3n4n6J9J9nnn0m9K5K6K5K6k8k7M7M7j5j4j4j5klJ01J01KLKKn3
-549F3n4n2n3onnnL4L4L4L3k0k2k1k2QQQPQQQQJ9K1K0K1mmm8m7l6l6O8O7JJm2m3O7O8oon2
$$ plain form
-515 19 68 90 113 135 158 100 42 -15 -74 -43 -13 17 47 44 41 38 35 34 33 32 31 56 81 105 130 79 28 -23 -74 -55 -36 -17 1 -1 -5 -11 -17 -29 -86 -89 -19 71
-521 71 89 78 67 55 42 30 17 32 48 18 -10 60 131 128 124 104 83 63 42 58 74 89 105 111 118 124 130 103 76 49 22 -3 -29 -56 -82 -63 -44 -25
-525 -25 -5 22 50 34 17 68 118 94 71 75 80 85 90 68 47 26 5 -53 -112 -97 -82 -17 47 107 167 233 224 127 29 17 49 28 -66 -123 -106 -91 -75 -53
-530 -53 -30 -8 14 -62 -138 -111 -84 -18 48 71 93 45 -3 -7 -11 49 110 97 83 47 11 19 28 22 16 55 94 70 45 21 -2 7 16 -17 -52 -78 -103 -25 52
-535 52 55 59 19 -21 -40 -59 -36 -14 -30 -91 -127 -88 -23 -1 -25 -48 14 77 36 -4 -18 -33 26 86 81 77 28 -19 3 26 49 72 30 -11 -52 -94 -28
-539 -28 36 43 -24 -75 -82 -73 -65 -41 -17 6 30 -32 -95 -84 -72 -57 -42 -26 -11 -20 -29 -37 -46 -21 4 -14 -33 -100 -166 -158 -150 -103 -55 36 128 119 110 27 -55 -76 -97
-544 -97 -119 -140 -100 -59 -63 -67 3 74 41 8 -46 -102 -83 -64 -69 -74 -124 -173 -148 -122 -97 -71 -99 -126 -79 -32 -47 -61 -75 -90 -92 -95 6 107 109 112 114 116 63
-549 63 9 -43 -96 -102 -107 -112 -117 -83 -49 -15 18 -2 -24 -45 -67 -59 -51 -43 -36 -28 -20 -12 -4 15 36 56 77 73 69 21 -26 -62 -98 -30 37 38 39 -3 -46 21 89 83 77 25
-554B5n1qqllM1M1j5j4j3j5L5L6L6L6j9k0j9k0J7J7J6J7J7J7J6J7o7o8o6o8OOONooL9L8P4
-559F9P4J%L1L0o7o8k6O3O6k3n1nL3j1o9o9KKmmM3J33R3Lj5j5j3j2n8n7J9J9k6k6M2M2klm3
-564I8m3m4m2qrqrk7k7M7M7M8N0MNk9k8k8k9j2j2j3j2J3J4J3J4K0J9J8J7pn1p7J1L6L6M0M1
-569G6m4m4m4m4M7M7M6M7k3k4k3k2ooooJ2J3J1J3j7j5j9k0l6q2l5N5J24P8OPj2j1j1j2RRR
-574D7RQRRRn2n0n1n1J2J3J3J3L8L8o4o5M9M8NMNMrn5m2L2O1O0m1m1m2m1J1J1J1J1JKJKL4
-579c4L4L5L5m4m3m4m4K7K7K6K6mnnnnonnJ7J7J6J7l9m1L4L3K2K3n2n0K6K5j7j8l1l0P4P2
-584E9O0O0m5m4nnnnm5m4m4m5j7j6J3l1l0M5R9N4LK%%k3k3P5P5K7m7n0m9j4j4N5N6k3r6n6
-588i3J9M5Jj4j3K3K3n2n1k3k3N0N1K6K6j8j9N2N3k1k2klllJ1J1J1J1J0RJ0Rkllkp0p0j1O4
$$ plain form
-554 25 -26 -34 -42 -45 -48 -7 34 19 5 -8 -23 12 48 84 120 101 81 62 42 59 76 92 109 126 143 159 176 109 41 -25 -93 -87 -81 -75 -70 -76 -82 -43 -5 69
-559 69 143 144 144 175 205 138 70 44 107 173 150 99 94 127 116 47 -22 -20 -18 -22 -26 17 150 243 246 231 216 203 191 133 76 95 114 88 62 104 146 144 141 98
-564 98 55 11 -31 -39 -48 -56 -65 -92 -119 -72 -25 23 73 77 82 53 25 -3 -32 -44 -56 -69 -81 -68 -54 -41 -27 -7 12 30 47 40 -11 -88 -77 -41 -5 35 76
-569 76 32 -12 -56 -100 -53 -6 40 87 64 40 17 -5 -11 -17 -23 -29 -17 -4 7 20 3 -12 -31 -51 -87 -169 -204 -149 -25 53 59 66 54 43 32 20 29 38 47
-574 47 56 64 73 82 91 39 -11 -62 -113 -101 -88 -75 -62 -24 14 -50 -115 -66 -18 -13 -9 -4 0 -9 -64 -106 -74 -13 47 6 -35 -77 -118 -107 -96 -85 -74 -73 -71 -70 -68 -34
-579 -34 0 35 70 26 -17 -61 -105 -78 -51 -25 1 -3 -8 -13 -18 -23 -29 -34 -39 -22 -5 11 28 -11 -52 -18 15 37 60 8 -42 -16 9 -8 -26 -57 -87 -13 59
-584 59 119 179 134 90 85 80 75 70 25 -19 -63 -108 -125 -141 -128 -159 -189 -144 -45 9 12 14 14 14 -9 -32 43 118 145 98 48 -1 -15 -29 26 82 59 -37 -93
-588 -93 -74 -29 -28 -42 -55 -32 -9 -61 -112 -135 -158 -108 -57 -31 -5 -23 -42 10 63 42 20 18 15 12 9 20 31 42 53 63 72 82 91 89 86 83 81 11 -59 -70 -6
-593fP2K9j5j6K6K5m9m8l3l4J1J0J5J4N9N9n1n2k0N1L9nk1k0%%p3p4J7J8J7J8j6j6j6j5k9
-598a29k8M6M6K3K4K2K4K1K2n2r6p7lN3Pp3p3kkM3M3Q8Q7L2L2L2L2j8j8k1k1qn2k7M6O3J8
-602A04k7k6l2l0l2l1J1J2J2J2llllM4M5M5M5j9j9j9j9j9j9j9j8K1K3K3K3j8j8j8j7J8J9J9
-607F4J9j3j3j2j3O0N9k9k9m3m2m1m3L4L5L3L4JJ%JNONNNNONk4k4k4k4JKKKJ1J1J1J1qqpq
-612B9j6j5j6j6KKLKJ5J3J4J5M6M6m0m1n8j6J5p3q0J0P5J18N6J2M0M0oor4r4m7m8M2M1M8M9
-617F7M9M9n2n1n2n1M8M8l7l7LM7j0r8j14k4J28J27qqpqk3k4O3O5N5N6l4l3k1k0k1k0n8n9
-621f5L0L0k6k5k6k5J5J6J5J6n2n1L8L7M4M4j5n8j9O9M3jKM6O5k4r4j38k3O5K4k1RJ0j0j0
-626f5rj0qqqqQRRQk4k3O5O4RJ0J0Rq0q1PQppQ1Q1JKkkn5j01l9M9N1PL7L6OPOPJ7J6J7J7o
$$ plain form
-593 -6 66 95 80 64 90 115 66 18 -15 -49 -38 -28 -13 1 60 119 68 16 -4 47 86 81 60 40 40 40 -33 -107 -90 -72 -55 -37 -53 -69 -85 -100 -129
-598 -129 -157 -111 -65 -42 -18 4 28 49 71 19 -77 -154 -157 -104 -97 -170 -243 -245 -247 -204 -161 -73 14 46 78 110 142 124 106 85 64 56 4 -23 23 86 104
-602 104 77 51 19 -11 -43 -74 -63 -51 -39 -27 -30 -33 -36 -39 5 50 95 140 121 102 83 64 45 26 7 -11 10 33 56 79 61 43 25 8 26 45 64
-607 64 83 70 57 45 32 92 151 122 93 50 8 -33 -76 -42 -7 26 60 61 62 62 63 68 74 79 84 89 94 100 105 81 57 33 9 10 12 14 16 27 38 49 60 52 44 37 29
-612 29 13 -2 -18 -34 -32 -30 -27 -25 -10 3 17 32 78 124 84 43 -15 -31 -16 -89 -169 -159 -84 34 90 102 142 182 176 170 76 -18 -65 -113 -71 -30 18 67
-617 67 116 165 113 62 10 -41 7 55 18 -19 -16 31 21 -77 -191 -215 -87 40 32 24 17 9 -14 -38 25 90 145 201 167 134 113 93 72 52 -6 -65
-621 -65 -35 -5 -31 -56 -82 -107 -92 -76 -61 -45 -97 -148 -110 -73 -29 15 0 -58 -77 -8 35 34 36 82 147 123 29 -109 -132 -67 -43 -64 -55 -45 -55 -65
-626 -65 -74 -84 -92 -100 -108 -116 -108 -99 -90 -82 -106 -129 -64 0 9 19 29 38 -42 -123 -116 -108 -115 -122 -41 40 41 43 41 39 -16 -117 -156 -107 -56 -49 -12 24 30 37 43 50 67 83 100 117 111
-632A11nr5r3m2m3M7M7qqN1R4M8m2j8K5K0o9m3%L3j0l8N0J36M6p7j21n8j3m1m1J9J9J9J9K8
-636e3K8K7K8j2j3j2j2jjjjpppqQ2Q2k2k1m9m7mmM2M3l1l0l8l9O5O5K1K2n2n2k3k3k2k3J1
-641i9J1J1J1J2J1J1J1jkjjm1m0MMj6j7KR1P5j4l1l3J3J4J3J2llljK1K1K2K2m1m1m0m2K9L0
-646a9K8K9mnmmk7k8k8k8k9k8k8k8N7N7N7N6J7J6J6J7J0J0J1J0j8j8p4J5O5k4j01j02LKM8
-650g3M7K1K1k2k3m6m6jkMLMLMMLMl8l7PPR6R5qqJJKJM7M8k7k6m2m1m2m2m5m4K9L0j9j8K5
-656a43K6L9L9L9L8k4k3k4k4PQl8l7M8M7k7k7L0L1K9L1m1m0m1m1K2K2K2K3rqqrJ8J8J7J7k1
-660a4k1k2k2MNMMN4N2N3N4j0rj0rl8l7l8l7J4J3J2J4j1j0L3L4M7M8k7k6k3k3o6o7l8l9PO
-665a39L4L4L4L4j9j9j9j8K8K8K7K8j6j5j5j6J0J0l5l4j7j7N7N6L0L0p2p4QQQQj1j1j2j1J9
$$ plain form
-632 111 106 11 -82 -124 -167 -120 -73 -81 -89 -38 56 104 62 44 69 89 20 -23 -23 10 0 -38 12 148 194 117 -4 -62 -75 -116 -157 -138 -119 -100 -81 -53
-636 -53 -25 2 30 18 5 -7 -19 -20 -21 -22 -23 -30 -37 -44 -52 30 112 90 69 20 -27 -31 -35 7 50 19 -11 -49 -88 -23 42 63 85 33 -19 -42 -65 -87 -110 -99
-641 -99 -88 -77 -66 -54 -43 -32 -21 -22 -24 -25 -26 -67 -107 -103 -99 -115 -132 -130 -39 36 22 -9 -42 -29 -15 -2 10 7 4 1 0 21 42 64 86 45 4 -36 -78 -49 -19
-646 -19 9 38 34 29 25 21 -6 -34 -62 -90 -119 -147 -175 -203 -146 -89 -32 24 41 57 73 90 100 110 121 131 113 95 21 36 101 77 -24 -126 -123 -121 -73
-650 -73 -26 -5 16 -6 -29 -75 -121 -122 -124 -120 -117 -113 -110 -106 -102 -99 -95 -133 -170 -163 -156 -60 35 27 19 20 21 23 24 71 119 92 66 24 -17 -59 -101 -146 -190 -161 -131 -150 -168 -143
-656 -143 -117 -78 -39 0 38 14 -9 -33 -57 -50 -42 -80 -117 -69 -22 -49 -76 -46 -15 14 45 4 -36 -77 -118 -96 -74 -52 -29 -38 -46 -54 -63 -45 -27 -10 7 -14
-660 -14 -35 -57 -79 -75 -70 -66 -62 -8 44 97 151 141 132 122 113 75 38 0 -37 -23 -10 2 16 5 -5 28 62 109 157 130 104 81 58 -8 -75 -113 -152 -145 -139
-665 -139 -105 -71 -37 -3 -22 -41 -60 -78 -50 -22 5 33 17 2 -13 -29 -19 -9 -44 -78 -95 -112 -55 1 31 61 -11 -85 -77 -69 -61 -53 -64 -75 -87 -98 -79
-670g9J9K0J9JKP4P6m0l9l9l9k5k5M9M8L2L2j2j2K3K3K3K3k8k8J7J6J3J2o1o2j7j6j7j7M8
-674A4N0M9M9j8j7o2o2N6N6m8m7l3l4M1L9m1m2m2m2J02J01K8K7lkm8m7jjjjl6l8l7l7K5K6
-679g7R9R9j1j1n5n5k6k6k6k6K5K5K4K5k3k4k3k4L6L5L6L4RJ0RJ0k0k0j9j9jjkjk2k3k3k2
-683a04J1J0J1J1K3K4K3K4NNl9l9p2p3KKj0j0L5L5LLM7M7Q3Q3k0k1j8j9j8j9n9o0j10k1Q0
-688a45Q1Q5Q6m4m4m2m4J5J4J5J5K1K2k2k1M9N1lr1n0m9M9M8L3L4m0l9qqqqj7j7K7K7L4L4
-692D0o8o9J2J3J2J2L2L1L2L2m5m4m5m5Q5Q5L2n7k4k3k9l0m1m2LLL7L7o2o2p6J3L6L7N2N2
-697g4PQL7L6L8L7j9j9j9j9M0L9n8n8n5L3j0j1J0R9R9J1m5m4n0m9K0K0K0K1m4m3l8l9j6P3
-701f2J46N8n8n8J0J1K9K8K9K9p3p4p3p4PPQ1Q0J5J6J5J5j0rq4q3m6m6N8N8K2K1q3q3p0p0
$$ plain form
-670 -79 -60 -40 -21 -20 -18 56 132 92 53 14 -25 -50 -75 -26 22 54 86 74 62 85 108 131 154 126 98 115 131 144 156 95 33 16 0 -17 -34 14
-674 14 64 113 162 144 127 65 3 59 115 67 20 -13 -47 -6 33 -8 -50 -92 -134 -32 69 97 124 121 119 71 24 23 22 21 20 -16 -54 -91 -128 -103 -77
-679 -77 22 121 110 99 44 -11 -37 -63 -89 -115 -90 -65 -41 -16 -39 -63 -86 -110 -74 -39 -3 31 40 50 59 69 49 29 10 -9 -10 -11 -13 -14 -36 -59 -82 -104
-683 -104 -93 -83 -72 -61 -38 -14 9 33 38 43 4 -35 -107 -180 -178 -176 -186 -196 -161 -126 -123 -120 -73 -26 57 140 120 99 81 62 44 25 -34 -94 -204 -225 -145
-688 -145 -64 21 107 63 19 -23 -67 -52 -38 -23 -8 13 35 13 -8 41 92 89 -2 -52 -101 -52 -4 29 63 23 -16 -24 -32 -40 -48 -65 -82 -55 -28 6 40
-692 40 -28 -97 -85 -72 -60 -48 -16 15 47 79 34 -10 -55 -100 -15 70 102 45 21 -2 -31 -61 -102 -144 -141 -138 -101 -64 -126 -188 -264 -251 -215 -178 -126 -74
-697 -74 -67 -59 -22 14 52 89 70 51 32 13 53 92 34 -24 -79 -46 -56 -67 -57 42 141 152 107 63 13 -36 -16 4 24 45 1 -42 -80 -119 -135 -62
-701 -62 84 142 84 26 36 47 76 104 133 162 89 15 -58 -132 -125 -118 -37 43 58 74 89 104 94 85 1 -82 -128 -174 -116 -58 -36 -15 -98 -181 -251 -321
-706c21O3O4L7L8L7L8klkkP1P2or4p0J9L7L6m7m8lmN1M9k3k3k4k4N1M9J2J1l3l2n4n4N1N0
-710c3J2J2l2l2K8K8K7K8K4K5m9m9QPn9o1l4N6N5l4rrj4j5K1K0K1K0K6K4K5K5o8p0m8M1Q9
-715FM5n6n8J3J3J2J3j4j4j4j4K2K2K2K1m7m9m8m8M9M9M9M8L3L3L4L3m4m3%Jm7m7K6K7nnm
-719A4nk5k6k6k6MNMNK3K3Mq4j52o3P7J67J17K8j9k0k4k4k4k5J0J0J0RK5K4K4K5rqrrLLKL
-724D1qrqqJ2J2J2J2k2k1k0k2k5k6k6k6L7L8L1L1L1n8l3J1PPRJ0mmlmM3M5M4M5oorrl4q0j03
-730i6j5P1P1j2q5p6l1M3M2M9M7J6n7j09j08j3R1Q7J2j8o3q2q2j2R1J20P5LMk3k3k3k3N8N7
-734a4j7j7k9k9J6J6K6K6j8j8j6j5j6j5N9N9m4m4qppqk0k0N4N4QPQQJ1J0o2o3J9K0J9K0J0
-739c7J0J1J0j5j6j5j6K3K4K2K4RRJ0Rk9k9m4q9r8k3L5L5M7M6M6M5K2K1k3k3l0l0P3P3KJJ
$$ plain form
-706 -321 -258 -194 -157 -119 -82 -44 -46 -49 -51 -53 18 90 84 -10 -80 -61 -24 12 -35 -83 -86 -90 -39 10 -13 -36 -60 -84 -33 16 28 39 6 -26 -80 -134 -83 -33
-710 -33 -21 -9 -41 -73 -45 -17 10 38 62 87 38 -11 -3 4 -55 -116 -150 -94 -39 -73 -82 -91 -105 -120 -99 -79 -58 -38 -12 12 37 62 -6 -76 -124 -83 6
-715 6 51 -5 -63 -50 -37 -25 -12 -26 -40 -54 -68 -46 -24 -2 19 -28 -77 -125 -173 -124 -75 -26 22 55 88 122 155 111 68 68 69 22 -25 1 28 23 18 14
-719 14 9 -16 -42 -68 -94 -90 -85 -81 -76 -53 -30 -26 -110 -262 -325 -248 -81 36 64 45 25 1 -23 -47 -72 -62 -52 -42 -33 -8 16 40 65 56 48 39 30 33 36 38 41
-724 41 33 24 16 8 20 32 44 56 34 13 -7 -29 -54 -80 -106 -132 -95 -57 -26 5 36 -22 -55 -44 -37 -30 -21 -11 -15 -19 -22 -26 17 62 106 151 145 139 130 121 87 7 -96
-730 -96 -111 -40 31 19 -66 -142 -173 -130 -88 -39 8 24 -33 -142 -250 -263 -172 -85 -73 -91 -154 -236 -318 -330 -239 -119 -44 -41 -37 -60 -83 -106 -129 -71 -14
-734 -14 -31 -48 -77 -106 -90 -74 -48 -22 -40 -58 -74 -89 -105 -120 -61 -2 -46 -90 -98 -105 -112 -120 -140 -160 -106 -52 -44 -37 -29 -21 -10 0 -62 -125 -106 -86 -67 -47 -37
-739 -37 -27 -16 -6 -21 -37 -52 -68 -45 -21 1 25 34 43 53 62 33 4 -40 -129 -227 -250 -215 -180 -133 -87 -41 4 26 47 24 1 -29 -59 14 87 89 90 91
-743I1Kl7l8l6l7j2j1j1j1QRQRJ1J1J4J4j2L1Qo4m9K5P7L4l4l5l8l8k5k4N0N0k0k0K4K4l5
-748h7l5RJ0l7l7QN2L3m2k2K3L9L8L7L6L3m1k4J9k4k4k2k2J1J2J1J2L6L6L7L7k2k2k1k2m7
-752b2m9K6K5Q0Q2PPm7m7m7m6mlmlnmnnn5n4J9J9M8M8MLJ5J5J3J5l3l4l3l4K9L0K9K8J6J6
-757D0J6J6NNNNk3k3k3k3k0k1K4K2M9M9n5n3nnmnk7k7k7k7K1K1K2K1J9J8J8J9qppoKLLLj5
-763ej6j5j6k6k6k6k6K9L0K9L0j4j4j4j4k5k5k5k5P3P3L4n5p3p4J0J0O2O1k8k7llklk2k1K2
-767a60K3P1P0L2n6l0l0J0RK2K2k2k2pqppL0L1K9L1MMLMr0r0PR7P0P1j2j2o0o0o0o0J1J2J1
-772a19J2O1O1J12K2n7n7o2o2K8K8K8K8r2r3mmJ1J2J1J1J1J2p8p7K1K0K1K1LLMLk7k6O2O3
-777h9O2O2k6k6k6k7k1k2J2Q7Q6J2q1q0LMPON2N0l0k9p5p5m0m0M8M9j0j0rj0K4K5K4K4N7N6
$$ plain form
-743 91 93 56 18 -18 -55 -67 -78 -89 -100 -92 -83 -75 -66 -55 -44 -30 -16 -28 3 11 -53 -102 -77 0 34 0 -35 -73 -111 -136 -160 -110 -60 -80 -100 -76 -52 -87
-748 -87 -122 -113 -103 -140 -177 -169 -117 -84 -126 -148 -125 -86 -48 -11 25 58 17 -7 12 -12 -36 -58 -80 -69 -57 -46 -34 2 38 75 112 90 68 47 25 -22
-752 -22 -71 -45 -20 60 142 149 156 109 62 15 -31 -35 -38 -42 -45 -50 -54 -59 -64 -119 -173 -154 -135 -87 -39 -35 -32 -17 -2 11 26 -7 -41 -74 -108 -79 -49 -20 8 24 40
-757 40 56 72 77 82 87 92 69 46 23 0 -20 -41 -17 5 54 103 48 -5 -10 -15 -19 -24 -51 -78 -105 -132 -111 -90 -68 -47 -28 -10 8 27 19 12 5 -1 1 4 7 10 -5
-763 -5 -21 -36 -52 -78 -104 -130 -156 -127 -97 -68 -38 -52 -66 -80 -94 -119 -144 -169 -194 -121 -48 -14 -69 -142 -216 -206 -196 -134 -73 -101 -128 -131 -134 -136 -139 -161 -182 -160
-767 -160 -137 -66 4 36 -20 -50 -80 -70 -61 -39 -17 -39 -61 -68 -76 -83 -90 -60 -29 0 31 35 39 42 46 -44 -134 -127 -30 40 111 99 87 27 -33 -93 -153 -142 -130 -119
-772 -119 -107 -46 15 127 149 92 35 -27 -89 -61 -33 -5 23 -69 -162 -166 -170 -159 -147 -136 -125 -114 -102 -180 -257 -236 -216 -195 -174 -171 -168 -164 -161 -188 -214 -152 -89
-777 -89 -27 35 9 -17 -43 -70 -91 -113 -101 -14 72 84 3 -77 -74 -70 -63 -57 -5 45 15 -14 -89 -164 -204 -244 -196 -147 -157 -167 -176 -186 -162 -137 -113 -89 -32 24
-781B4J4n9o0J4Q0L8l9l8m2m1n8n8L0L1N9N8N3N4Ro6o5QJ3J3J8J7l3l3J1J1L3L3n5n5K7K8
-786b6j7j7l4l3J1J1K8K8K4K4m4j18m9N6P0K5l2l1Q2Q1ppl3l5l4l4p5p4J5J5O4O3K0J9PQP
-790d2Pn6n7j5O0R1J5k5k6OPl8l8n4n5j0j0N3N2N3N3j0rn4n4L7L7l8l7K8K7K8K7J2J1J1J1
-795bK3K4m9n0n3n2K1K1j8j9N6N6JJKJQ5Q5J2J1q0q0ppL1L3L2L2k5k4k5k4k3k5k4k5mmlml5
-800a35l4l5l4Q6Q6J2J2rj0rrK7K7K6K8JJKJj2j3j1j3PONOj2j3j4j3J5J6J4J6poq0q1k2k3
-805b01Q2Q1J%m4m4L0L0j4j5l4l4O9P0qpqpM9M8k5k4M0M1n7n7o9K0P4P2mmm9m7k0j9N6N4m0
-810a4m0MMk0j9k0k0J7J7J8J7K7K8p1p1o1K7K2K2JKJKo7o6QQM5M4%JmmlmJ5J6J5J5K6K7K6
-815b9K7j9j9j8j9l9l9O5O5N2N3RRLLm2m1q9r0oQ3P8P7n0m8J6J5J7J6J3J2J3J3J0J0q8q6p1
$$ plain form
-781 24 38 -21 -81 -67 13 51 12 -26 -68 -109 -167 -225 -195 -164 -105 -47 6 60 69 3 -62 -54 -41 -28 -10 7 -26 -59 -48 -37 -4 29 -26 -81 -54 -26
-786 -26 -43 -60 -94 -127 -116 -105 -77 -49 -25 -1 -45 -163 -212 -156 -86 -61 -93 -124 -42 39 32 25 -8 -43 -77 -111 -186 -260 -245 -230 -166 -103 -83 -64 -57 -49 -42
-790 -42 -35 -91 -148 -163 -103 -12 3 -22 -48 -42 -35 -73 -111 -165 -220 -230 -240 -187 -135 -82 -29 -39 -48 -102 -156 -119 -82 -120 -157 -129 -102 -74 -47 -35 -24 -13 -2
-795 -2 21 45 -4 -54 -107 -159 -138 -117 -135 -154 -98 -42 -41 -40 -38 -37 48 133 145 156 76 -4 -11 -18 13 46 78 110 85 61 36 12 -11 -36 -60 -85 -89 -93 -96 -100 -135
-800 -135 -169 -204 -238 -152 -66 -54 -42 -51 -61 -70 -79 -52 -25 1 29 30 31 33 34 22 9 -2 -15 -8 -2 3 9 -3 -16 -30 -43 -28 -12 2 18 11 5 -75 -156 -178 -201
-805 -201 -119 -38 -37 -37 -81 -125 -95 -65 -79 -94 -128 -162 -93 -23 -31 -38 -46 -53 -4 44 19 -5 35 76 19 -38 -107 -87 -13 59 55 51 2 -45 -65 -84 -28 26 -14
-810 -14 -54 -50 -46 -66 -85 -105 -125 -108 -91 -73 -56 -29 -1 -72 -143 -204 -177 -155 -133 -132 -130 -129 -127 -194 -260 -252 -244 -199 -155 -155 -154 -158 -162 -165 -169 -154 -138 -123 -108 -82 -55 -29
-815 -29 -2 -21 -40 -58 -77 -116 -155 -90 -25 27 80 89 98 101 104 62 21 -68 -158 -164 -81 -3 74 24 -24 -8 7 24 40 53 65 78 91 101 111 23 -63 -134
-819a34J9M3M3l9l9NOLMm1m0J5J6Q9Q9K3K3q1q0l1l1M3M3nnnnj2j3j2j2K1K1K1K1K2K1K1K2
-824D9k6k6J7J8ONM5M4Nq4p8p9K8K8K7K7klm6m8k8k9J6J6OPOPj0j0j0j0M9M8MMj5j6j5j6l2
-829a21l2J2J2J5J4J5J4J2J1l3l2JJM6M5k2k3k3k3K0K1K0K0k6k6M3M1O7k3m6m6l0l0O8O7O8
-834I7k2p5p4%%%%j1j2n5n6L2L3L2L2mnnnK4K4K4K4l2l2J2J3k7k7J8J8K4K4K2K4k5k3k5k5
-838f3MMm1m1k4k4N0N0KKLKJKm3m3nmM0M0J2J2J3J2j9j9j9j9J5J4J4J5K2K3K2K2j5j6j4j6
-843b9n1n1pok4k5o8o9Q0Q0k4k4mnM1M0OOOOk4k5N0M9J5J6l0k9POPPo4o4M0M0J3J2o2o2L4
-848a86L4L3L4J%%Jl6l5L8L9j5j4j4j5L9L8L9L7j7j6j7j7m9m9m9m9opL8L8Q4Q3L8L9m5m4m6
-853g3m5O6O6qol7l6l7l6K3K3K3K3llmlK4K4K2K4%%J%L5L6l9l9OONOn9o1j6j6k3k2N1N2MM
$$ plain form
-819 -134 -115 -72 -29 -68 -107 -102 -96 -93 -89 -130 -170 -155 -139 -50 39 62 85 4 -76 -107 -138 -95 -52 -57 -62 -67 -72 -84 -97 -109 -121 -100 -79 -58 -37 -15 6 27 49
-824 49 23 -3 14 32 38 43 88 132 137 53 -25 -104 -76 -48 -21 6 4 1 -45 -93 -121 -150 -134 -118 -112 -105 -99 -92 -102 -112 -122 -132 -83 -35 -31 -27 -42 -58 -73 -89 -121
-829 -121 -153 -141 -129 -114 -100 -85 -71 -59 -48 -81 -113 -112 -111 -65 -20 -42 -65 -88 -111 -91 -70 -50 -30 -56 -82 -39 2 69 46 0 -46 -76 -106 -38 29 97
-834 97 75 0 -74 -74 -74 -74 -74 -85 -97 -152 -208 -176 -143 -111 -79 -83 -88 -93 -98 -74 -50 -26 -2 -34 -66 -54 -41 -68 -95 -77 -59 -35 -11 11 35 10 -13 -38 -63
-838 -63 -59 -55 -96 -137 -161 -185 -135 -85 -83 -81 -78 -76 -75 -73 -116 -159 -164 -168 -128 -88 -76 -64 -51 -39 -58 -77 -96 -115 -100 -86 -72 -57 -35 -12 10 32 17 1 -13 -29
-843 -29 -80 -131 -138 -144 -168 -193 -261 -330 -250 -170 -194 -218 -222 -227 -186 -146 -140 -134 -128 -122 -146 -171 -121 -72 -57 -41 -71 -100 -93 -87 -80 -73 -137 -201 -161 -121 -108 -96 -158 -220 -186
-848 -186 -152 -119 -85 -84 -84 -84 -83 -119 -154 -116 -77 -92 -106 -120 -135 -96 -58 -19 18 1 -15 -32 -49 -98 -147 -196 -245 -251 -258 -220 -182 -98 -15 23 62 17 -27 -73
-853 -73 -118 -52 14 6 0 -37 -73 -110 -146 -123 -100 -77 -54 -57 -60 -64 -67 -43 -19 3 27 27 27 28 28 63 99 60 21 27 33 38 44 -15 -76 -92 -108 -131 -153 -102 -50 -46 -42
-858d2m0m1J5J6J5J5k6k6k6k5M4M5M0L8kp6p7lJ4J4J9J8qqqqJ8J9J9J9O4O6l9l8K1K1n2n3
-863e8j7j7j7j7j0j0j1j0K3K2K3K2J2J1J2J1k3k3k3k4mnnmJ6J7J7J6K2K1k3o8n8J6P6P5J5
-867@J6k7k8j8j8j9j8p1p1L3L3L6L6rrMMNMK5K5K4K5l5l5l6l5j5j5K9L0m0m0L4L4llm7m8P9
-872a64Q0P9P8l0l1p4p5R2R0J8J8n8n7n8n8L0L0L0L1k8k8k7k8nmnmK2K3k2k2o8o8PPM4M5%
-877a90%lmlmMNMMRRRRl6l5L8L8lmllrrrrM7M6M7M7MLLMj03j05K9K9J5J4J5J5kllkJ2J3J2
-883e8J2KJJJjjjjPOl8l8O4O3l9l9m3m2KKj5j4j5j5j2j2j2j2O6O6O5O5l0l1l2l1k9l0J5J6
-888a37Q4Q4J0J1rqKq5j24l6P2P2j2j2j2j2kkkjLLMLl0k9M4M4MMm0m0k8k7J7J7Q2Q2k5j15
-893a46o4K5P3P2k0k0K4K4M8M9NNn2n2n2n3ppppK6K5K6K5L4L3l4l5LR0P0K4QN3P5j4j12j12
$$ plain form
-858 -42 -82 -123 -108 -92 -77 -62 -88 -114 -140 -165 -121 -76 -36 2 0 -76 -153 -156 -142 -128 -109 -91 -99 -107 -115 -123 -105 -86 -67 -48 16 82 43 5 26 47 -5 -58
-863 -58 -75 -92 -109 -126 -136 -146 -157 -167 -144 -122 -99 -77 -65 -54 -42 -31 -54 -77 -100 -124 -128 -133 -138 -142 -126 -109 -92 -76 -54 -33 -56 -124 -182 -166 -90 -15 0
-867 0 16 -11 -39 -57 -75 -94 -112 -183 -254 -221 -188 -152 -116 -125 -134 -130 -126 -121 -117 -92 -67 -43 -18 -53 -88 -124 -159 -174 -189 -160 -130 -170 -210 -176 -142 -145 -148 -195 -243 -164
-872 -164 -84 -5 73 43 12 -62 -137 -45 45 63 81 23 -34 -92 -150 -120 -90 -60 -29 -57 -85 -112 -140 -145 -149 -154 -158 -136 -113 -135 -157 -225 -293 -286 -279 -235 -190 -190
-877 -190 -190 -193 -197 -200 -204 -200 -195 -191 -187 -178 -169 -160 -151 -187 -222 -184 -146 -149 -153 -156 -159 -168 -177 -186 -195 -148 -102 -55 -8 -4 -1 2 6 -97 -202 -173 -144 -129 -115 -100 -85 -87 -90 -93 -95 -83 -70 -58
-883 -58 -46 -44 -43 -42 -41 -42 -43 -44 -45 -38 -32 -70 -108 -44 19 -20 -59 -102 -144 -142 -140 -155 -169 -184 -199 -211 -223 -235 -247 -181 -115 -50 15 -15 -46 -78 -109 -138 -168 -153 -137
-888 -137 -53 31 41 52 43 35 37 -48 -172 -208 -136 -64 -76 -88 -100 -112 -114 -116 -118 -119 -116 -113 -109 -106 -136 -165 -121 -77 -73 -69 -109 -149 -177 -204 -187 -170 -88 -6 -31 -146
-893 -146 -210 -185 -112 -40 -60 -80 -56 -32 16 65 70 75 23 -29 -81 -134 -141 -148 -155 -162 -136 -111 -85 -60 -26 7 -27 -62 -59 31 101 125 133 186 261 247 135 23
-897B3j4j3k4k3j0L4Nq3n6j1J9K0K2K2L1L1m4m3l5l5k9k9K6J15O5O5K2K3k2k2r7r9k4k4j4
-902b28j4j4j4J3J3N7J47J24k3j20j22o7K1M1mm3m4K8K8M4M3j%M9M9K8o1r3m7L2J21Q3M1l
-906F4mn1n0n2n1%j%%MNNNJ6J5J6J6J8J7J2J2Qp9n5j0%jLLK1K1K1K1n2n2n2n2jjjjP3P4jj
-911a18m7m7klM1M0M1M0JJm4m4K5K4m9n0O0O0J5J5K8K7j6j7J0RJ0J0n5n5l4N6Q9M6l1j19o6
-916a49K3O7K3k7k7M5M5PRo4o6j9j9j9j9L6L5L6L5k7k8k7k8J3J2J2J2KKm3m2QRR8R6j8j7k1
-920c5k1j4n9q3NM4M3m0m0J4J4J1J2m2q6k2O7J33J31M0m9n6n7j8j9QPPQL0L1K5K4N0l8p7p7
-925a29%%J%J5J5J5J5lmmll6l5l6l5O2O3k6k6K4K5K5K4j2j2j3j2M4M4m4m5ooooJ9J8J9J9M2
-930a0M2j6n9k3O6Q1L8l7l7l9l9m9m9n7L1N5J1m3m2M2J31Q6kk7k7k7k7m0M8M8l9m8m8n4n3
$$ plain form
-897 23 9 -4 -28 -51 -61 -27 -22 -105 -161 -172 -153 -133 -111 -89 -58 -27 -71 -114 -149 -184 -213 -242 -216 -101 -36 29 51 74 52 30 -67 -166 -190 -214 -228
-902 -228 -242 -256 -270 -257 -244 -187 -40 84 61 -59 -181 -248 -227 -186 -190 -233 -277 -249 -221 -177 -134 -135 -135 -86 -37 -9 -70 -163 -210 -178 -57 26 67 64
-906 64 60 9 -41 -93 -144 -144 -145 -145 -145 -141 -136 -131 -126 -110 -95 -79 -63 -45 -28 -16 -4 4 -75 -130 -140 -140 -141 -138 -135 -114 -93 -72 -51 -103 -155 -207 -259 -260 -261 -262 -263 -190 -116 -117 -118
-911 -118 -165 -212 -214 -217 -176 -136 -95 -55 -54 -53 -97 -141 -116 -92 -141 -191 -131 -71 -56 -41 -13 14 -2 -19 -9 0 10 20 -35 -90 -124 -68 21 67 36 -83 -149
-916 -149 -126 -59 -36 -63 -90 -45 0 7 16 -48 -114 -133 -152 -171 -190 -154 -119 -83 -48 -75 -103 -130 -158 -145 -133 -121 -109 -107 -105 -148 -190 -182 -173 -75 21 3 -14 -35
-920 -35 -56 -70 -129 -212 -207 -163 -120 -160 -200 -186 -172 -161 -149 -191 -277 -299 -232 -99 32 72 23 -33 -90 -108 -127 -119 -112 -105 -97 -67 -36 -11 13 63 25 -52 -129
-925 -129 -129 -129 -128 -128 -113 -98 -83 -68 -71 -75 -79 -82 -118 -153 -189 -224 -162 -99 -125 -151 -127 -102 -77 -53 -65 -77 -90 -102 -58 -14 -58 -103 -109 -115 -121 -127 -108 -90 -71 -52 -10
-930 -10 32 16 -43 -66 0 81 119 82 45 6 -33 -82 -131 -188 -157 -102 -91 -134 -176 -134 -3 83 81 54 27 0 -27 -67 -19 29 -10 -58 -106 -160 -213
-934b13K2K2K2K3LMLMj1j1j0j1M6M5KJo6o6K3K3L7L7n2n2jjQ2Q2N9l0o8o9n1n2opN3N3K0o9
-939a80o3K6N9N9k6k5J9J9O7O6p5p6k9O0O0k8m6m6L7L8OONOJ5J5J5J5j9j9j8j9poppNMNMO
-944g9POPj2j2j2j2kjkkN2N1l8l7j4j4L0L1k6k6k6k5RJ0RJ0n2n1L7L8K3K4K3K4mnmm%j%%Q
-950f2QRQJ1J2l3l3n7n6L3L3P0P0p6p8J%%%K8K7K7K7MMMMm0m0MMP0P0L1n8o7o8J5J6j0j0r
-955a07j0M7M7N2l5j08j07j5P4K9K9n5n5rrL5L5M1M1M2M0m0m2m1m1K5K5K5K5POPOnnnmL2L1
-959Hn0n1r8qL1L1J8J8J01J00L9n1q9q9rrL6L5l2l3l2l3mnM0L9O9O7k0k0k1k1k2k1N6N6J7
-964D3p0n8n7K5K6M1M0lmppopl1l0l1l0K5K5K5K5mmmmmmmmQQQPJ3J2l2l2m4m5M4M5J7J7p1
-969a43p2m3m3R9J00M7m1o1j6J8J8K1K1K6K6j8j8L2L1n7n7j9j8K6K6p0o9l3N6M9Nn3n3L7L7
$$ plain form
-934 -213 -191 -169 -147 -124 -121 -117 -114 -110 -121 -132 -142 -153 -107 -62 -60 -59 -125 -191 -168 -145 -108 -71 -123 -175 -176 -177 -95 -13 46 16 -52 -121 -172 -224 -230 -237 -184 -131 -111 -180
-939 -180 -243 -217 -158 -99 -125 -150 -131 -112 -45 21 -54 -130 -159 -99 -39 -67 -113 -159 -122 -84 -78 -72 -67 -61 -46 -31 -16 -1 -20 -39 -57 -76 -83 -89 -96 -103 -98 -94 -89 -85 -79
-944 -79 -72 -66 -59 -71 -83 -95 -107 -109 -110 -112 -114 -62 -11 -49 -86 -100 -114 -84 -53 -79 -105 -131 -156 -147 -137 -128 -118 -170 -221 -184 -146 -123 -99 -76 -52 -56 -61 -65 -69 -69 -70 -70 -70 -62
-950 -62 -54 -45 -37 -26 -14 -47 -80 -137 -193 -160 -127 -57 13 -63 -141 -140 -140 -140 -140 -112 -85 -58 -31 -27 -23 -19 -15 -55 -95 -91 -87 -17 53 84 26 -41 -109 -94 -78 -88 -98 -107
-955 -107 -117 -70 -23 29 -6 -114 -221 -236 -162 -133 -104 -159 -214 -223 -232 -197 -162 -121 -80 -38 2 -38 -80 -121 -162 -137 -112 -87 -62 -55 -49 -42 -36 -41 -46 -51 -55 -23 8
-959 8 -42 -93 -191 -199 -168 -137 -119 -101 0 100 139 88 -1 -90 -99 -108 -72 -37 -69 -102 -134 -167 -171 -176 -136 -97 -28 39 19 -1 -22 -43 -65 -86 -30 26 43
-964 43 -27 -85 -142 -117 -91 -50 -10 -13 -17 -24 -31 -37 -44 -75 -105 -136 -166 -141 -116 -91 -66 -70 -74 -78 -82 -86 -90 -94 -98 -90 -82 -74 -67 -54 -42 -74 -106 -150 -195 -151 -106 -89 -72 -143
-969 -143 -215 -258 -301 -202 -102 -55 -96 -157 -173 -155 -137 -116 -95 -69 -43 -61 -79 -47 -16 -73 -130 -149 -167 -141 -115 -185 -254 -287 -231 -182 -177 -230 -283 -246 -209
-974b09qpJ2J2J3J2mlmlJ5J5J5J6M7M7M7M7j0j0j0j0q3q4NNm9m8j3P7N8J3J3N8M7m0j4L1k0
-978b4k0j8j8%%M5M3K2K2o6o7n4n3L6L5k5k5k6k5M3M3M3M3n0n1n0n0NNNNK8K8K8K8n4n4l5
-983b58N4O0k9m7m7P5P5Q1qm7m7M6M6L6n2r7qL3L2opN5N5L0n7l7l7KKO2O2j2j1RJ1J1J0l5
-988El3l5l5k9k8k9k9pppqO9O9M5m4k3k3k8k9K2K2K1K2K6K7K6K6p1p2KLL8L9L8L8l4l6l5l6
-992a40L2L2L2L3n2n2k7O1R6R8J9o9o6o8k8k8J6J6J6J6l9m0l9l9KKJKjjjjO8O7K0p0n3L6N4
-997i5N4KLm3m2o9p0L4L4J4J4J3J4klllkllkK6K6K6K7ppqpJ0RRJ0kkkjPQQPk6k5k6k6J2J3
-1003i9J2J2k1k1k1k1J2J2O2k7o1o1L7L7K2K2K2K2K9K8K8K8l2l1l3l2L0L1L0L0k6k6k7k6m3
-1007a02m2K6K6%q9q9%M1M2M7M7j9j8j9j8%%%%K5K5K5K5K0K0K1J9j1rq5q4j7j7j7j7K2K2K2
$$ plain form
-974 -209 -217 -224 -212 -200 -187 -175 -179 -182 -186 -189 -174 -159 -144 -128 -81 -34 13 60 50 40 30 20 -63 -147 -142 -137 -186 -234 -247 -170 -112 -99 -86 -28 19 -21 -35 -4 -24
-978 -24 -44 -62 -80 -80 -80 -35 8 30 52 -14 -81 -135 -188 -152 -117 -142 -167 -193 -218 -175 -132 -89 -46 -96 -147 -197 -247 -242 -237 -232 -227 -199 -171 -143 -115 -169 -223 -258
-983 -258 -204 -144 -173 -220 -267 -192 -117 -36 -44 -91 -138 -92 -46 -10 -62 -159 -167 -134 -102 -108 -115 -60 -5 25 -32 -69 -106 -104 -102 -40 22 10 -1 8 19 30 40 5
-988 5 -28 -63 -98 -127 -155 -184 -213 -220 -227 -234 -242 -173 -104 -59 -103 -126 -149 -177 -206 -184 -162 -141 -119 -93 -66 -40 -14 -85 -157 -155 -152 -114 -75 -37 1 -33 -69 -104 -140
-992 -140 -108 -76 -44 -11 -63 -115 -142 -81 15 113 132 63 -3 -71 -99 -127 -111 -95 -79 -63 -102 -142 -181 -220 -218 -216 -215 -213 -214 -215 -216 -217 -149 -82 -62 -132 -185 -149 -95
-997 -95 -41 -39 -36 -79 -121 -190 -260 -226 -192 -178 -164 -151 -137 -139 -142 -145 -148 -150 -153 -156 -158 -132 -106 -80 -53 -60 -67 -75 -82 -72 -63 -54 -44 -46 -48 -50 -51 -44 -36 -28 -21 -47 -72 -98 -124 -112 -99
-1003 -99 -87 -75 -96 -117 -138 -159 -147 -135 -73 -100 -161 -222 -185 -148 -126 -104 -82 -60 -31 -3 25 53 21 -10 -43 -75 -45 -14 16 46 20 -6 -33 -59 -102
-1007 -102 -144 -118 -92 -92 -181 -270 -270 -229 -187 -140 -93 -112 -130 -149 -167 -167 -167 -167 -167 -142 -117 -92 -67 -47 -27 -6 13 2 -7 -92 -176 -193 -210 -227 -244 -222 -200 -178
-1012a78K3M2M1klm6m5M3M4m6m6M1M1pn2l5N4O0J5m3m4k6k6J8J8K1K1k4k3L9L9noj4j5j4j5
-1016a55m8m7P0J15L0n8n9L0Q5L9j7j8MLLLj4j4j5j4o9o9K6J15R3N0K9L0j1j00j01j4M5Jn8
-1021a10n7j0j1j0j0J8J8J9J8j%%%J9K0K0K0RQRRppppk5k6k5k6LLLKK2K1K1K2jkjjk7k7k7
-1026a41k7llllm8m7M1M1ooP7P7P0j7j1j2%%m4m4lmlmrj0j0rk1k1k0k1POPPL1L1L1L1l7l6
-1031a66N3N3N8N8l1l0p1p2J7J8MNMMN4N3l4l4mlmlkkkkj7j7O7O6N0l8p6p7J4J4J4J4J1J2
-1036d2J1J2ppppl1l0l1l0o2o2k3O5O3O3k1k1L5L5L5L4j5j5j5j5j8j8j8j8L4L3j1j1j1j2P1
-1041f7P1J18K9p0o9ONl7l9J7J6J7J5J4J4J4J4k0k1L0n8k0k0k6k6j3j3j3j3NMN0M9QQp6p5
-1045a72m0N0%jQQPQL7L7Q7kq2q2O0O0j8j8j8j8j6j7j6j7K4K4K5K4j7j6j7j6n6n5L3L4K0K1
$$ plain form
-1012 -178 -155 -113 -72 -74 -77 -123 -168 -125 -81 -127 -173 -132 -91 -98 -150 -185 -131 -71 -56 -99 -143 -169 -195 -177 -159 -138 -117 -141 -164 -125 -86 -91 -97 -111 -126 -140 -155
-1016 -155 -203 -250 -180 -65 -35 -93 -152 -122 -37 2 -15 -33 -29 -26 -23 -20 -34 -48 -63 -77 -146 -215 -189 -74 19 69 98 128 117 17 -84 -98 -53 -52 -110
-1021 -110 -167 -177 -188 -198 -208 -190 -172 -153 -135 -136 -136 -136 -136 -117 -97 -77 -57 -48 -40 -31 -22 -29 -36 -43 -50 -75 -101 -126 -152 -149 -146 -143 -141 -119 -98 -77 -55 -56 -58 -59 -60 -87 -114 -141
-1026 -141 -168 -171 -174 -177 -180 -228 -275 -234 -193 -199 -205 -128 -51 19 2 -9 -21 -21 -21 -65 -109 -112 -116 -119 -123 -132 -142 -152 -161 -182 -203 -223 -244 -237 -231 -224 -217 -186 -155 -124 -93 -130 -166
-1031 -166 -113 -60 -2 56 25 -5 -76 -148 -131 -113 -109 -104 -100 -96 -42 11 -23 -57 -61 -64 -68 -71 -73 -75 -77 -79 -96 -113 -46 20 70 32 -44 -121 -107 -93 -79 -65 -54 -42
-1036 -42 -31 -19 -26 -33 -40 -47 -78 -108 -139 -169 -231 -293 -316 -251 -188 -125 -146 -167 -132 -97 -62 -28 -43 -58 -73 -88 -106 -124 -142 -160 -126 -93 -104 -115 -126 -138 -67
-1041 -67 4 122 151 81 12 18 23 -14 -53 -36 -20 -3 12 26 40 54 68 48 27 57 -1 -21 -41 -67 -93 -106 -119 -132 -145 -140 -136 -86 -37 -29 -21 -97 -172
-1045 -172 -212 -162 -162 -163 -155 -147 -140 -132 -95 -58 29 27 -55 -137 -77 -17 -35 -53 -71 -89 -105 -122 -138 -155 -131 -107 -82 -58 -75 -91 -108 -124 -180 -235 -202 -168 -148 -127
-1050a27K0K1K1K0K1K0j3j3j4j3PPPPK8K7o0o1l2l2N7N7l3l2J2J2M3M3m6m7n1n2L7L8M3M2
$$ plain form
-1050 -127 -107 -86 -65 -45 -24 -4 -17 -30 -44 -57 -50 -43 -36 -29 -1 26 -34 -95 -127 -159 -102 -45 -78 -110 -98 -86 -43 0 -46 -93 -144 -196 -159 -121 -78 -36
$$ [...]
##$OBSERVED INTEGRALS=	(X Y Z)
(7.174181643016125598, 7.2048559227677495542, 1.0176415166126735468)
(7.0178660015682385875, 7.054506202955250771, 1.0006330274045891482)
(6.7856496258902847529, 6.8072455061779955088, 0.96179089202453171836)
(3.8576659923581972933, 3.8823327917068963799, 2.1080446885631913823)
(2.3133324444950917886, 2.3310936538309969812, 3.0523210729462926238)
(2.2868795795267238269, 2.2931148976978397158, 0.14729472934471307677)
(1.0940140817979457921, 1.1387651691504478979, 6.5226726556832508308)
(7.2814910804222003904, 7.2866432262440508083, 0.14724578654275399803)
(2.7529186789527710921, 2.8308357702740960526, 1)
(7.3326061955563615058, 7.4230511265015923783, 4.1399510919872541947)
##END=	
##END=	
