##TITLE=	(1) Feb07-2020.10.fid
DK19

(2) Feb07-2020.10.fid
DK19
##JCAMP-DX=	6.0	$$ MestReNova 14.1.0-24037
##DATA TYPE=	LINK
##BLOCK_ID=	1
##BLOCKS=	2    
##ORIGIN=	Mestrelab Research S.L.
##OWNER=	dr219
##$MNOVA/LINK_BLOCK_TYPE=	PAGE
##TITLE=	Feb07-2020.10.fid
DK19
##JCAMP-DX=	6.0	$$ MestReNova 14.1.0-24037
##DATA TYPE=	LINK
##BLOCK_ID=	2
##BLOCKS=	2    
##ORIGIN=	Mestrelab Research S.L.
##OWNER=	dr219
##$MNOVA/LINK_BLOCK_TYPE=	ITEM	$$ NMR Spectrum
##$MNOVA/ITEM/POLYGON=	(XY..XY)
5321,5835
8722,5835
8722,8208
5321,8208
5321,5835
##$MNOVA/ITEM/Z=	0
##$MNOVA/ITEM/ANGLE=	0
##TITLE=	Feb07-2020.10.fid
##JCAMP-DX=	6.0	$$ MestReNova 14.1.0-24037
##BLOCK_ID=	3
##DATA TYPE=	NMR SPECTRUM
##DATA CLASS=	XYDATA
##NUMDIM=	1
##ORIGIN=	Bruker BioSpin GmbH
##OWNER=	nmrsu
##.OBSERVE FREQUENCY=	400.05240029999998796
##.OBSERVE NUCLEUS=	^1H
##.SOLVENT NAME=	CDCl3
##.PULSE SEQUENCE=	zg30
##LONGDATE=	2020/02/07 14:34:00.000
##.ACQUISITIONMODE=	SIMULTANEOUS (DQD)
##$ORIGINAL FORMAT=	Bruker XWIN-NMR
##$MNOVA/SCALES_VERSION=	8
##$PARAMETER FILE=	(acqus, ASCII, //ch-nmrserv2.ch.ic.ac.uk/Av400D/ug1/nmr/Feb07-2020/10/acqus, 0)
$$ ##TITLE= Parameter file, TOPSPIN		Version 3.2
$$ ##JCAMPDX= 5.0
$$ ##DATATYPE= Parameter Values
$$ ##NPOINTS= 11	$$ modification sequence number
$$ ##ORIGIN= Bruker BioSpin GmbH
$$ ##OWNER= nmrsu
$$ $$ 2020-02-07 14:34:39.595 +0000  nmrsu@nmrpc
$$ $$ /opt/topspin/data/ug1/nmr/Feb07-2020/10/acqus
$$ $$ process /opt/topspin3.2/prog/mod/shimcntl
$$ ##$ACQT0= -2.04831932773109
$$ ##$AMP= (0..31)
$$ 100 100 100 100 100 100 100 100 100 100 100 100 100 100 100 100 100 100
$$ 100 100 100 100 100 100 100 100 100 100 100 100 100 100
$$ ##$AMPCOIL= (0..19)
$$ -1 0 0 0 0 0 0 0 0 0 0 0 0 0 0 0 0 0 0 0
$$ ##$ANAVPT= -1
$$ ##$AQSEQ= 0
$$ ##$AQ_mod= 3
$$ ##$AUNM= <au_zg>
$$ ##$AUTOPOS= <30 >
$$ ##$BF1= 400.05
$$ ##$BF2= 400.05
$$ ##$BF3= 400.05
$$ ##$BF4= 400.05
$$ ##$BF5= 400.05
$$ ##$BF6= 400.05
$$ ##$BF7= 400.05
$$ ##$BF8= 400.05
$$ ##$BYTORDA= 0
$$ ##$CAGPARS= (0..11)
$$ 0 0 0 0 0 0 0 0 0 0 0 0
$$ ##$CFDGTYP= 0
$$ ##$CFRGTYP= 9
$$ ##$CHEMSTR= <none>
$$ ##$CNST= (0..63)
$$ 1 1 1 1 1 1 1 1 1 1 1 1 1 1 1 1 1 1 1 1 1 1 1 1 1 1 1 1 1 1 1 1 1 1 1 1
$$ 1 1 1 1 1 1 1 1 1 1 1 1 1 1 1 1 1 1 1 1 1 1 1 1 1 1 1 1
$$ ##$CPDPRG= (0..8)
$$ <> <> <> <> <> <> <> <> <>
$$ ##$D= (0..63)
$$ 0 1 0 0 0 0 0 0 0 0 0 0 0 0 0 0 0.0002 0 0 0 0 0 0 0 0 0 0 0 0 0 0 0 0
$$ 0 0 0 0 0 0 0 0 0 0 0 0 0 0 0 0 0 0 0 0 0 0 0 0 0 0 0 0 0 0 0
$$ ##$DATE= 1581086078
$$ ##$DE= 6.5
$$ ##$DECBNUC= <off>
$$ ##$DECIM= 2496
$$ ##$DECNUC= <off>
$$ ##$DECSTAT= 4
$$ ##$DIGMOD= 1
$$ ##$DIGTYP= 12
$$ ##$DQDMODE= 0
$$ ##$DR= 22
$$ ##$DS= 4
$$ ##$DSPFIRM= 0
$$ ##$DSPFVS= 20
$$ ##$DTYPA= 0
$$ ##$EXP= <proton>
$$ ##$F1LIST= <>
$$ ##$F2LIST= <>
$$ ##$F3LIST= <>
$$ ##$FCUCHAN= (0..9)
$$ 0 2 0 0 0 0 0 0 0 0
$$ ##$FL1= 90
$$ ##$FL2= 90
$$ ##$FL3= 90
$$ ##$FL4= 90
$$ ##$FOV= 20
$$ ##$FQ1LIST= <>
$$ ##$FQ2LIST= <>
$$ ##$FQ3LIST= <>
$$ ##$FQ4LIST= <>
$$ ##$FQ5LIST= <>
$$ ##$FQ6LIST= <>
$$ ##$FQ7LIST= <>
$$ [...]
$$ 130000 130000 130000 130000 130000 130000 130000 130000 130000 130000 130000
$$ 130000 130000 130000 130000 130000 130000 130000 130000 130000 130000 130000
$$ 130000 130000 130000 130000 130000 130000 130000 0 0 0 0 0 0 0 0 0 0 0
$$ 0 0 0 0 0 0 0 0 0 0 0 0 0
$$ ##$ShimPowMaxUC= (0..63)
$$ 130000 130000 130000 130000 130000 130000 130000 130000 130000 130000 130000
$$ 130000 130000 130000 130000 130000 130000 130000 130000 130000 130000 130000
$$ 130000 130000 130000 130000 130000 130000 130000 130000 130000 130000 130000
$$ 130000 130000 130000 130000 130000 130000 130000 0 0 0 0 0 0 0 0 0 0 0
$$ 0 0 0 0 0 0 0 0 0 0 0 0 0
$$ ##$ShimPowMaxUG= (0..63)
$$ 524287 524287 524287 524287 524287 524287 524287 524287 524287 524287 524287
$$ 524287 524287 524287 524287 524287 524287 524287 524287 524287 524287 524287
$$ 524287 524287 524287 524287 524287 524287 524287 524287 524287 524287 524287
$$ 524287 524287 524287 524287 524287 524287 0 0 0 0 0 0 0 0 0 0 0 0 0 0 0
$$ 0 0 0 0 0 0 0 0 0 0
$$ ##$ShimPowRcbType= 3
$$ ##$ShimPowRes= (0..63)
$$ 1e-20 1e-20 1e-20 1e-20 1e-20 1e-20 1e-20 1e-20 1e-20 1e-20 1e-20 1e-20
$$ 1e-20 1e-20 1e-20 1e-20 1e-20 1e-20 1e-20 1e-20 1e-20 1e-20 1e-20 1e-20
$$ 1e-20 1e-20 1e-20 1e-20 1e-20 1e-20 1e-20 1e-20 1e-20 1e-20 1e-20 1e-20
$$ 1e-20 1e-20 1e-20 1e-20 0 0 0 0 0 0 0 0 0 0 0 0 0 0 0 0 0 0 0 0 0 0 0 0
$$ ##$ShimPowRng0= (0..63)
$$ 1 1 1 1 1 1 1 1 1 1 1 1 1 1 1 1 1 1 1 1 1 1 1 1 1 1 1 1 1 1 1 1 1 1 1 1
$$ 1 1 1 1 0 0 0 0 0 0 0 0 0 0 0 0 0 0 0 0 0 0 0 0 0 0 0 0
$$ ##$ShimPowRng1= (0..63)
$$ 1 1 1 1 1 1 1 1 1 1 1 1 1 1 1 1 1 1 1 1 1 1 1 1 1 1 1 1 1 1 1 1 1 1 1 1
$$ 1 1 1 1 0 0 0 0 0 0 0 0 0 0 0 0 0 0 0 0 0 0 0 0 0 0 0 0
$$ ##$ShimPowRng2= (0..63)
$$ 1 1 1 1 1 1 1 1 1 1 1 1 1 1 1 1 1 1 1 1 1 1 1 1 1 1 1 1 1 1 1 1 1 1 1 1
$$ 1 1 1 1 0 0 0 0 0 0 0 0 0 0 0 0 0 0 0 0 0 0 0 0 0 0 0 0
$$ ##$ShimPowRng3= (0..63)
$$ 1 1 1 1 1 1 1 1 1 1 1 1 1 1 1 1 1 1 1 1 1 1 1 1 1 1 1 1 1 1 1 1 1 1 1 1
$$ 1 1 1 1 0 0 0 0 0 0 0 0 0 0 0 0 0 0 0 0 0 0 0 0 0 0 0 0
$$ ##$ShimSysFunc= (0..63)
$$ 1 2 3 4 5 6 7 8 9 10 0 37 38 35 16 15 14 13 12 11 28 27 26 25 24 23 36
$$ 22 30 29 20 21 34 33 32 31 17 18 19 0 0 0 0 0 0 0 0 0 0 0 0 0 0 0 0 0 0
$$ 0 0 0 0 0 0 0
$$ ##$ShimSysMatrix= 0
$$ ##$ShimSysType= 4
$$ ##$TFXNUM= 0
$$ ##$TRIPLO2= 0
$$ ##$VTU= 2
$$ ##$VTUETH= <149.236.99.20>
$$ ##$VTUTY= <no>
$$ ##$WBREFAM= (0..15)
$$ 136.7 118.7 100 100 100 100 100 100 100 100 100 100 100 100 100 100
$$ ##$WBREFLM= (0..15)
$$ 0 0 0 0 0 0 0 0 0 0 0 0 0 0 0 0
$$ ##$WBREFPH= (0..15)
$$ 77.55 -71.28 0 0 0 0 0 0 0 0 0 0 0 0 0 0
$$ ##$WBSGU= (0..15)
$$ 0 0 0 0 0 0 0 0 0 0 0 0 0 0 0 0
$$ ##$XFAC= 2
$$ ##END=
$$ 
##$DECIM=	2496
##$DSPFVS=	20
##XUNITS=	HZ
##YUNITS=	ARBITRARY UNITS
##FIRSTX=	6406.710256386850233
##LASTX=	-1606.1102564336499654
##DELTAX=	-0.12226780365942625795
##XFACTOR=	1
##YFACTOR=	0.0028912489153243288269
##FIRSTY=	7.1900587081909179688
##MINY=	-2.4201662540435791016
##MAXY=	29227.580078125
##NPOINTS=	65536
##XYDATA=	(X++(Y..Y))
$$ [...]
1557B4103M77M76N73N73O67O67P70P71Q36R51J034J093J163J279J372J488J675J792J887K004
1555D5651K136K251K353K468K727K920L108L378L773M352M862N442O160O893P452P877Q342
1553A22145Q920R499R923J0208J0479J0642J0758J0968J1392J1826J2405J3496J5462J8524
1551B86647K2959K9522L9588N4297P4774J02183J37471J80414K28660K77778L22322L57258
1549B113873L77814L79094L56686L08885K38270J50889N3973m5926j42304k28179k96480l42301
1548B924294l64167l64122l45957l14247k73327k28134j83744j44253j11819q6260o6706n2336
1546C89222m2116l4903k9466k5286k2085j9624j7580j5734j4229j2953j1756j0586r467q543
1545A14894p811p243o740o361o092n855n662n378n030m664m240l791l212k672k170j732j385
$$ plain form
1557 24103 24580 25056 25629 26202 26869 27536 28306 29077 29913 30864 31898 32991 34154 35433 36805 38293 39968 41760 43647 45651
1555 45651 47787 50038 52391 54859 57586 60506 63614 66992 70765 75117 79979 85421 91581 98474 105926 113803 122145
1553 122145 131065 140564 150487 160695 171174 181816 192574 203542 214934 226760 239165 252661 268123 286647
1551 286647 309606 339128 378716 433013 507787 609970 747441 927855 1156515 1434293 1756615 2113873
1549 2113873 2491687 2870781 3227467 3536352 3774622 3925511 3979484 3933558 3791254 3563075 3266595 2924294
1548 2924294 2560127 2196005 1850048 1535801 1262474 1034340 850596 706343 594524 508264 441558 389222
1546 389222 347106 312203 282737 257451 235366 215742 198162 182428 168199 155246 143490 132904 123437 114894
1545 114894 107083 99840 93100 86739 80647 74792 69130 63752 58722 54058 49818 46027 42815 40143 37973 36241 34856
1543C4856j128j013r29q73q85j078j166j166j113j113j112r97r07p92p61o46m82m24m14l57
1540A7500k90k89k54k55k84m77o54p11o56n40m80m22l04j89j73k30k88k87k06k05k06k05k49
1537I646k50j91j92k03k02j74j74q0p9k2k1p1p0p0p1q9q9j47j47k12k12k13k12k49k50j91
1534E765j92j87j87j79j80j70n3k9q6j41j41rrn8n9n8n8n7n7j07j08p3M3P2J4l0K8N0N0k6
1531C768k7L1L2LMO1O2R9J00R9J00R2R1O3O3p8p9j36j36k07k08k08k08k43k43j08j08n7n6
1527B566k8k8r2r3l4l5J4J4j5j6k7k7L8p8j46j46K1K0QQQPL0K9Q8Q7O8O8O9O8L2L2L2L2L4
1523B608L4nj01j03m6q4q4j10j10n2n2l2l2l1l2ONOOq0q0k2k2J9J8J9J8k0k0p8j36j25k8M8
1519A302M9pppoo7o6L0L0KJJJj41j41L3L2m5m6N0J09M2n5l0K9M1M2M5M6llllj7j8j7j8KKK
$$ plain form
1543 34856 33728 32715 31786 30913 30028 28950 27784 26618 25505 24392 23280 22283 21376 20584 19823 19177 18695 18271 17857 17500
1540 17500 17210 16921 16667 16412 16128 15651 14997 14286 13630 13090 12610 12188 11884 11695 11522 11292 11004 10717 10511 10306 10100 9895 9646
1537 9646 9396 9205 9013 8810 8608 8434 8260 8180 8101 8079 8058 7987 7917 7847 7776 7687 7598 7451 7304 7092 6880 6667 6455 6206 5956 5765
1534 5765 5573 5386 5199 5020 4840 4670 4617 4588 4502 4361 4220 4211 4202 4144 4085 4027 3969 3912 3855 3748 3640 3567 3610 3682 3696 3666 3694 3744 3794 3768
1531 3768 3741 3772 3804 3807 3811 3872 3934 4033 4133 4232 4332 4424 4515 4578 4641 4563 4484 4348 4212 4005 3797 3589 3381 3138 2895 2787 2679 2622 2566
1527 2566 2538 2510 2418 2325 2291 2256 2270 2284 2269 2253 2226 2199 2237 2159 2013 1867 1888 1908 1916 1924 1932 1939 1969 1998 2086 2173 2241 2309 2378 2446 2478 2510 2542 2574 2608
1523 2608 2642 2637 2536 2433 2387 2303 2219 2109 1999 1947 1895 1863 1831 1800 1768 1774 1779 1785 1791 1711 1631 1609 1587 1606 1624 1643 1661 1641 1621 1543 1407 1282 1254 1302
1519 1302 1351 1344 1337 1330 1324 1257 1191 1221 1251 1253 1254 1255 1256 1115 974 1007 1039 994 948 998 1107 1149 1094 1064 1093 1134 1176 1221 1267 1264 1261 1258 1255 1238 1220 1203 1185 1187 1189 1191
1514A191Ko4o4poQQQPn4n5LLJ7J7J7J6mlmmk3k2k2k3n9n8L8L7j8j9L9L9n0n0QQM2M3J00J00
1509A142j7j7j7j7m2m2J2J2p8j37p6M0Nn3j7j7l5r3p1M4L7k1l9l9k7k7O9P0popoK3K4K3K4
1504F17N2N3N2N2n6n6KJp7p8J8J9K7K7K7K7O8O7J0J0j1j0j1j1l4l5l5l5k0k0k1k0J6J6J6J6
1500F63j04j05lJ13J7r8m1P5M3p3j24qJ3J2K0K0K5K5l3l3%j%jL9M0L9L9M1M1M1M1p7p7N6J15
1495G40P3m2m6P0Q2l4j9k0PPLLJ5m3p9L7O7Rj6J00J57J58O8O8M4M5M4M5J3J3J4J3K57K57J85
1491B295qj58k74k79k79j43j43O3O2k4j41n5J37J36K1l7l7L9L9L9L9j5j4Q2Q2R0R0R0R1J47
1488A935J46J47J47K00K00J99K00K15K14K14K15K26K27K60M53O50P65R58J228J592K093K638
1485A5122L217L854M432N016N440N500N076M242L123J778L50j004k045k774l274l540l540
$$ plain form
1514 1191 1193 1129 1065 1058 1052 1060 1068 1076 1083 1029 974 977 980 997 1014 1031 1047 1043 1040 1036 1032 1009 987 965 942 883 825 863 900 882 863 902 941 891 841 849 857 899 942 1042 1142
1509 1142 1125 1108 1091 1074 1032 990 1002 1014 936 799 723 763 768 715 698 681 646 553 482 526 563 542 503 464 437 410 479 549 542 536 529 523 546 570 593 617
1504 617 669 722 774 826 770 714 716 717 640 562 580 599 626 653 680 707 775 842 852 862 851 841 830 819 785 750 715 680 660 640 619 599 615 631 647 663
1500 663 559 454 451 564 581 483 442 517 560 487 363 355 368 380 400 420 445 470 437 404 404 403 403 402 441 481 520 559 600 641 682 723 646 569 625 740
1495 740 813 771 725 795 877 843 824 804 811 818 821 824 839 796 717 754 821 830 814 914 1071 1229 1297 1365 1409 1454 1498 1543 1556 1569 1583 1596 1853 2110 2295
1491 2295 2287 2129 1855 1576 1297 1154 1011 1074 1136 1112 971 916 1053 1189 1210 1173 1136 1175 1214 1253 1292 1277 1263 1345 1427 1517 1607 1697 1788 1935
1488 1935 2081 2228 2375 2575 2775 2974 3174 3389 3603 3817 4032 4258 4485 4745 5198 5848 6613 7571 8799 10391 12484 15122
1485 15122 18339 22193 26625 31641 37081 42581 47657 51899 55022 56800 57150 56146 54101 51327 48053 44513 40973
1483D0973l664l663l765l649l374l027k709k439k168j820j508j237r96q81p10n16l79l78k70
1480C820k70l12l13k54k54j97j97j98j97r8r8r8r9j06j06m9m9m1m1m1m2rj0o7o7j1j0j1j0
1477E65m3m3m6m6Ln5q0J7O0Kj8j7j2j3p0p0M5M5j2j2j8j7j7j7J7J7J7J7M4M3n2n3l9l9N8N7
1472B18J8J8p9p8N1N1N1N1j5j4j4j4J6J5O8O8K4p3p5K0Q1K4p3p3j5j5j5j5j6j6j6j6NNMNJ0
1468A71J0m8m8nmnmL1L1k7k7N3N3onl0k9l0l0J6J6J6J6J8J9l9l9M3M3L7L7M7m9q5k7L5L6n8
1463A33n7MMNML1L0k7k7J8J9J8J9k2k1p9p9M5M5n1n0K4K2K4K4K3K4K4K4l0k9q7q7O6O5QQO7
1459A32O7k9k9n1n1n0n1NONOJ6J5J5J5K8K7l0l0LLO1O0N1N2m6m5J09J10N1N2J5J6q1q1n2n3
1454B41j41j40o1N6j0j0J3J4m5m4J2J3J2J2J7J6J7J6M6M6m9m9j4j5j4j4L0L1k8k7j5j5M3M3
$$ plain form
1483 40973 37309 33646 29881 26232 22858 19831 17122 14683 12515 10695 9187 7950 6954 6073 5363 4847 4468 4090 3820
1480 3820 3550 3238 2925 2671 2417 2220 2023 1825 1628 1530 1432 1334 1235 1129 1023 974 925 884 843 802 760 751 741 674 607 596 586 575 565
1477 565 522 479 433 387 390 335 255 272 332 334 316 299 287 274 204 134 179 224 212 200 182 165 148 131 148 165 182 199 243 286 234 181 142 103 161 218
1472 218 236 254 175 97 148 199 250 301 286 272 258 244 260 275 343 411 435 362 287 307 388 412 339 266 251 236 221 206 190 174 158 142 147 152 156 161 171
1468 171 181 133 85 80 76 71 67 98 129 102 75 128 181 175 170 140 111 81 51 67 83 99 115 133 152 113 74 117 160 197 234 281 232 147 120 155 191 133
1463 133 76 80 84 89 93 124 154 127 100 118 137 155 174 152 131 52 -27 18 63 12 -38 -14 8 32 56 79 103 127 151 121 92 5 -82 -16 49 57 65 132
1459 132 199 170 141 90 39 -11 -62 -57 -51 -46 -40 -24 -9 6 21 49 76 46 16 19 22 83 143 194 246 200 155 264 374 425 477 492 508 427 346 294 241
1454 241 100 -40 -101 -45 -55 -65 -52 -38 -83 -127 -115 -102 -90 -78 -61 -45 -28 -12 34 80 31 -18 -32 -47 -61 -75 -45 -14 -42 -69 -84 -99 -56 -13
1450a3ONn2n2J5J4J5J5M8M8M9M8N8N7l8l9k8k8k8k8l2l1l1l2OOONm2m3J5J5O2O1o6o6k6P0
1445e1J05M9M5M5j6j7l8l9l8l8l4l5K3K3L3L4k4k4K4K4l4l2m4m3J8J8M3R9O7k8o7rM7j1p4
1441Aj5M3M5ppopL2L2k6k6k5k5k5k5rqrqJ9K0l9l8k3k2L5L5P1O9o4o4L6L7k1k1k0k0L8L9J9
1436A1K0l7l8K4K3K5K4l3l1l3l2QQQRL7L6j7j6K4Q3N1m6o7j0j2o8l6K3K3l5RO6L6n9k7J07
1432E8Q3j2p4j7M2M2k4k5k4k4N5N4N4N4o8o9o8o8oonoL2L1L2L2KKj7p4o1L5L6L4rrL0k9m9
1427c6M5P9K1m5m5m8m9rj0rj0J5J4J5J4M9M8M9M9l9l9l3l2m6N1Q6K9j10j10j8j7J6J7J6J7
1423g5MNMNl5l4O2O2lln4n5%R6R6%l9l7J2J3L6L5L6L5l7l6l7l7o1o2L5L4M6M6M7M7n5n5LL
1418D7l3l2l3l3qpo6o5J1J0J1J0kklkJ8J8J8J8k3k4P3P3O4O4l1l2o5o6L0L1MMMLm5m5l8l8
$$ plain form
1450 -13 -7 -2 -54 -106 -91 -77 -62 -47 1 49 98 146 204 261 223 184 156 128 100 72 40 9 -22 -54 -48 -42 -36 -31 -73 -116 -101 -86 -24 37 -29 -95 -121 -51
1445 -51 54 103 148 193 177 160 122 83 45 7 -27 -62 -39 -16 17 51 27 3 27 51 17 -15 -59 -102 -84 -66 -23 76 143 115 48 39 86 75 1
1441 1 -14 29 74 67 60 54 47 79 111 85 59 34 9 -16 -41 -50 -58 -67 -75 -56 -36 -75 -113 -136 -158 -123 -88 -17 52 -12 -76 -40 -3 -24 -45 -65 -85 -47 -8 11
1436 11 31 -6 -44 -20 3 28 52 19 -12 -45 -77 -69 -61 -53 -44 -7 29 12 -4 20 103 154 108 41 31 19 -49 -85 -62 -39 -74 -65 1 37 -22 -49 58
1432 58 141 129 55 38 80 122 98 73 49 25 80 134 188 242 174 105 37 -31 -37 -43 -48 -54 -22 9 41 73 75 77 60 -14 -75 -40 -4 30 21 12 42 13 -36
1427 -36 9 88 109 64 19 -29 -78 -87 -97 -106 -116 -101 -87 -72 -58 -9 39 88 137 98 59 26 -6 -52 -1 85 114 4 -106 -124 -141 -125 -108 -92 -75
1423 -75 -71 -66 -62 -57 -92 -126 -64 -2 -5 -8 -62 -117 -117 -21 75 75 36 -1 11 24 60 95 131 166 129 93 56 19 -42 -104 -69 -35 11 57 104 151 96 41 44 47
1418 47 14 -18 -51 -84 -92 -99 -165 -230 -219 -209 -198 -188 -190 -192 -195 -197 -179 -161 -143 -125 -148 -172 -99 -26 38 102 71 39 -26 -92 -62 -31 -27 -23 -19 -16 -61 -106 -144 -182
1413a82m4P2O5O4mmnml3l3K4K5j9j9j9j9k0k0P6P6L3L4k4k2p0o9K6K7j7j8M0M0l7l7K1K1j
1408g6%R5R6l0l1K7K8L3L3L4L3q0q0q0p9J1J1O7O9l6l7l5l6mmlmL5L5n5n4j34j8N2N2k8k7
1404b20O8O9J8J8m0l9j7j7j0rn5O0J30J30m1m1m0m0o1o1P4P5poN1N1o9o9j2j1L1L2L2L1m4
1399c9m5m6m5M5M4j4j4k3k3L5L5p4p3O1O2kkN7N6n4n3MNl5l5l5l5l6l6K2K1L5L5R3R3k4k4
1395f4q2q2%J%%J8J7J7J7o4o5L1L2k1k2L7L6k1k1k1k1M2M2L8L8m7j05l4O2P5J7lln9n9L3L4
1390b07m0r8k3P3L6L6M2M3k1k0k1k0J7J8P5P6p2p1j4j4opopk1k1L7L7K0K0J6J7Pm9k0P6M9
1386f3m8p9k0rqnmK6K6K7K6KLKKl3l3l4l3P5P5J8J7n0m9QRJ9J9K0J9n6n6KKl0l1l0l0J3J4
1381b77J0J0L1k8n2M3R8L9j6M1N9Jr8r9l3l4K4K5J7J7J7J7LLLLJ%n7n7m1m1R5R4M8M8M3M2
$$ plain form
1413 -182 -226 -154 -89 -25 -29 -33 -38 -42 -75 -108 -84 -59 -78 -97 -116 -135 -155 -175 -99 -23 10 44 20 -2 -72 -141 -115 -88 -105 -123 -83 -43 -80 -117 -96 -75 -76
1408 -76 -76 19 115 85 54 81 109 142 175 209 242 162 82 2 -77 -66 -55 12 81 45 8 -27 -63 -67 -71 -74 -78 -43 -8 -63 -117 -251 -269 -217 -165 -193 -220
1404 -220 -152 -83 -65 -47 -87 -126 -143 -160 -170 -179 -234 -174 -44 86 45 4 -36 -76 -137 -198 -124 -49 -56 -62 -11 40 -29 -98 -110 -121 -90 -58 -26 5 -39
1399 -39 -84 -130 -175 -130 -86 -100 -114 -137 -160 -125 -90 -164 -237 -176 -114 -116 -118 -61 -5 -59 -112 -108 -103 -138 -173 -208 -243 -279 -315 -293 -272 -237 -202 -109 -16 -40 -64
1395 -64 -146 -228 -228 -227 -227 -227 -209 -192 -175 -158 -222 -287 -256 -224 -245 -267 -230 -194 -215 -236 -257 -278 -236 -194 -156 -118 -165 -270 -304 -242 -167 -150 -153 -156 -215 -274 -241 -207
1390 -207 -247 -345 -368 -295 -259 -223 -181 -138 -159 -179 -200 -220 -203 -185 -110 -34 -106 -177 -191 -205 -211 -218 -224 -231 -252 -273 -236 -199 -179 -159 -143 -126 -119 -168 -188 -112 -63
1386 -63 -111 -190 -210 -219 -227 -232 -236 -210 -184 -157 -131 -129 -126 -124 -122 -155 -188 -222 -255 -180 -105 -87 -70 -120 -169 -161 -152 -133 -114 -94 -75 -131 -187 -185 -183 -213 -244 -274 -304 -291 -277
1381 -277 -267 -257 -226 -254 -306 -263 -165 -126 -142 -101 -42 -41 -139 -238 -271 -305 -281 -256 -239 -222 -205 -188 -185 -182 -179 -176 -175 -175 -232 -289 -330 -371 -276 -182 -134 -86 -43 -1
1376aJ4q1q6J1M4j5o6qK6K7L0L0ONn1n2N6N5N6N5k9k9l0k9rrqr%jR1Q9L7n8l7K0j1j2qqMM
1371A3LML3L3k5k5j6j6p3p4n3n4NMJ5J5J5J6j8j8M1R8K1p5n4MJ9l9n8L9O1O0l0k9m5m4N2N2
1366a43J9J8J9J9K5K5K4K5lkm0J5L9n7o0L6M2n1j21o4L5L4k0k0M6M7j2j1m9m9RRMMMML4L4
1362a32k4k4M6M5n1n1j8j8j9j8O1O1LLk5k5L3L4M5M5j3j3n6n6KKQRm8m9J1J1J2J1J3J3RRm6
1357b00j05n4Q0J21O3l0l1m4m4m4m4qqo6L0J28P0k6k7oonoN4N4N5N4J5J4m3m4J6J6q1q1O2
1353a71O2NMj3j3j2j3k1k1k1k1llllP9P9j7j7ppo4o4O1O2LMNNNNK5K6l3l2J0J1J1J1L1L0k7
1347e2k8L0K9k9k8o0o0L6L7P2P2k3k4K0J9l7l8n5n4n5n5K7K7K7K8M1M2n5n5rrM9M9J3J3m5
1343a40m5j6j5M2M2Q2Q0n2n3k6k6k6k6J4J4J10J09O3O4p2p1j4j4j3j3j0rj0rMNNNJ6J4J6J6
$$ plain form
1376 -1 13 -68 -154 -143 -99 -114 -180 -188 -162 -135 -105 -75 -69 -64 -115 -167 -111 -56 0 55 26 -3 -33 -62 -71 -80 -88 -97 -97 -98 -7 82 119 61 24 44 33 21 13 5 9 13
1371 13 16 20 53 86 61 36 20 4 -69 -143 -196 -250 -245 -241 -226 -211 -196 -180 -198 -216 -175 -77 -56 -131 -185 -181 -162 -201 -259 -220 -159 -99 -129 -158 -203 -247 -195 -143
1366 -143 -124 -106 -87 -68 -43 -18 6 31 28 26 -14 1 40 -17 -77 -41 1 -50 -171 -235 -200 -166 -186 -206 -160 -113 -125 -136 -185 -234 -225 -216 -212 -208 -204 -200 -166 -132
1362 -132 -156 -180 -134 -89 -140 -191 -209 -227 -246 -264 -203 -142 -139 -136 -161 -186 -153 -119 -74 -29 -42 -55 -111 -167 -165 -163 -155 -146 -194 -243 -232 -221 -209 -198 -185 -172 -163 -154 -200
1357 -200 -305 -359 -279 -158 -95 -125 -156 -200 -244 -288 -332 -340 -348 -414 -384 -256 -186 -212 -239 -245 -251 -256 -262 -208 -154 -99 -45 -30 -16 -59 -103 -87 -71 -152 -233 -171
1353 -171 -109 -104 -100 -113 -126 -138 -151 -172 -193 -214 -235 -238 -241 -244 -247 -168 -89 -106 -123 -130 -137 -201 -265 -204 -142 -139 -135 -130 -125 -120 -115 -90 -64 -97 -129 -119 -108 -97 -86 -55 -25 -52
1347 -52 -80 -50 -21 -50 -78 -138 -198 -162 -125 -53 19 -4 -28 -8 11 -26 -64 -119 -173 -228 -283 -256 -229 -202 -174 -133 -91 -146 -201 -210 -219 -170 -121 -108 -95 -140
1343 -140 -185 -201 -216 -174 -132 -50 30 -22 -75 -101 -127 -153 -179 -165 -151 -41 68 131 195 123 52 38 24 11 -2 -12 -21 -31 -40 -36 -31 -26 -21 -5 9 25 41
1338D1nno2o2l7l7l8l7L2L1k6k6k0k0p8p8J00R9l5l6J2J3J2J2N5N4m1m2M7M8j0j0RRJ0RM6
1334f6M6M5M6L0L1r9r8j9P7P7k0r1r3klL5L6j00j00LKLLL8L9k0j9O1O2l5l5j2j1j02j01JR7
1329b94R7JK4K4p8p8m8m8RJ0O0O0l3l3K6Q4N1m4m6J3k6k6J8J8J7J8j5j5j5j5L8L8L8L8m9n0
1325b31m3m3k2P5P5k2m1m1m1m1l2O4O7k9o5oN1N1K9K9k9k8L4L4k4k4m8m8m8m8PPPPK5K6l3
1320c99l3J%MMK5Q2J04Ql6l6l8l8qM9P5k1r2l3K4K4J6J7J7J7MMMMn8n9n8n9L9L8L8L8K4K4
1316b84K4K4rrrqL7L7o0n9n8n9L8L8j6j6j7j6P4P4%r7m9M7K4l4l8J9j6j6M9N0N0N0l9l9m0
1311c53l9k5k5k4k5N9O0O0N9j2j3j2j3l8l9%n8m3N3Q6K7k2k2k6k5L0L1L1L1oooollklk1k2
1306c65L6L6m7m7J1J1N5N4llnmnmm7m7M9N0J9J9K0J9onooj3j3j3j3j5j5ppl1Q4O3n2j08QP1
$$ plain form
1338 41 36 31 -31 -93 -130 -167 -205 -242 -210 -179 -205 -231 -251 -271 -349 -427 -327 -228 -263 -299 -287 -274 -262 -250 -195 -141 -182 -224 -177 -129 -139 -149 -140 -131 -121 -112 -66
1334 -66 -20 25 71 101 132 33 -65 -84 -7 70 50 -41 -134 -136 -139 -104 -68 -168 -268 -265 -263 -260 -257 -219 -180 -200 -219 -158 -96 -131 -166 -178 -189 -291 -392 -391 -294
1329 -294 -197 -196 -172 -148 -226 -304 -352 -400 -391 -381 -321 -261 -294 -327 -301 -217 -166 -210 -256 -243 -269 -295 -277 -259 -242 -224 -239 -254 -269 -284 -246 -208 -170 -132 -181 -231
1325 -231 -274 -317 -339 -264 -189 -211 -252 -293 -334 -375 -407 -343 -276 -305 -370 -376 -325 -274 -245 -216 -245 -273 -239 -205 -229 -253 -301 -349 -397 -445 -438 -431 -424 -417 -392 -366 -399
1320 -399 -432 -431 -431 -427 -423 -398 -316 -212 -204 -240 -276 -314 -352 -360 -311 -236 -257 -349 -382 -358 -334 -318 -301 -284 -267 -263 -259 -255 -251 -309 -368 -426 -485 -446 -408 -370 -332 -308 -284
1316 -284 -260 -236 -245 -254 -263 -271 -234 -197 -257 -316 -374 -433 -395 -357 -373 -389 -406 -422 -348 -274 -274 -371 -420 -373 -349 -383 -421 -402 -418 -434 -385 -335 -285 -235 -274 -313 -353
1311 -353 -392 -417 -442 -466 -491 -432 -372 -312 -253 -265 -278 -290 -303 -341 -380 -380 -438 -481 -428 -342 -315 -337 -359 -385 -410 -380 -349 -318 -287 -293 -299 -305 -311 -314 -317 -319 -322 -343 -365
1306 -365 -329 -293 -340 -387 -376 -365 -310 -256 -259 -262 -267 -271 -276 -280 -327 -374 -325 -275 -256 -237 -217 -198 -204 -209 -215 -221 -234 -247 -260 -273 -288 -303 -310 -317 -348 -264 -201 -253 -361 -353 -282
1301b82P1o1o1P4P4j8j8j8j7n3n3M4M3l3l3K5K5K2K2K3K2mnnnO2O1O2O1m5m5J3J3OOJ02J02
1297A77RJ0k0k0q9q8l1l1l0l0K8K8j1j0m0m0ONk4k4l7l7l7l7l2l2O4O4jjR6R6PPPPp2p3K3
1292b13K4Q7Q7J16J16L6L6R4R4J64J64J06J06J07J07P6m0j12j12j18j19j79j78j50j50r5r5
1289d1JJlmK6K5l5l6ppk5k5k5k5p3p3J00J01K1K1K1K1l7l8K1K0m8m8M8M8LKO1N9R1R0J87J87
1284F05K20K19K20K19J49J50M0p5j90j90j68j68j81j81j53j52j51j51n4n3j5j5M3M2n5n6K
1281i9Kk3k3OOm6m5N0N1RRRRqqo6o6k9k8O7O8MMJ01R9K0K0P8P7J82J81J81J82N2N1P4P4mj19
1276A102j50j51k05k05j09j08n3n3NNr9j00o9M6OOM2M2o3o2l8P7O2n3l9l9p1p0q1L4L8k0l9
1272d12l8K8K7J25J24M6M7j2j1j6j7j6j6J12J10J12J12J0J1J1J0k3k3k3k3n5n6l7K0rj24j13
$$ plain form
1301 -282 -211 -272 -333 -259 -185 -203 -221 -239 -256 -309 -362 -318 -275 -308 -341 -316 -291 -269 -247 -224 -202 -206 -211 -216 -221 -159 -98 -36 25 -20 -65 -52 -39 -33 -27 75 177
1297 177 186 196 176 156 67 -21 -52 -83 -113 -143 -115 -87 -98 -108 -148 -188 -182 -177 -201 -225 -262 -299 -336 -373 -405 -437 -373 -309 -310 -311 -215 -119 -112 -105 -98 -91 -163 -236 -213
1292 -213 -189 -102 -15 101 217 253 289 383 477 641 805 911 1017 1124 1231 1307 1267 1155 1043 925 806 627 449 299 149 54 -41
1289 -41 -40 -39 -42 -46 -20 5 -30 -66 -73 -80 -105 -130 -155 -180 -253 -326 -226 -125 -104 -83 -62 -41 -78 -116 -95 -75 -123 -171 -123 -75 -72 -70 -9 50 141 231 418 605
1284 605 825 1044 1264 1483 1632 1782 1822 1747 1557 1367 1199 1031 850 669 516 364 213 62 8 -45 -60 -75 -32 10 -45 -101 -99
1281 -99 -97 -120 -143 -137 -131 -177 -222 -172 -121 -112 -103 -94 -85 -93 -101 -167 -233 -262 -290 -223 -155 -151 -147 -46 53 73 93 171 248 430 611 792 974 1026 1077 1151 1225 1221 1102
1276 1102 952 801 596 391 282 174 121 68 73 78 -21 -121 -190 -144 -138 -132 -90 -48 -111 -173 -211 -134 -72 -125 -164 -203 -274 -344 -425 -391 -353 -373 -412
1272 -412 -450 -422 -395 -270 -146 -100 -53 -65 -76 -92 -109 -125 -141 -29 81 193 305 315 326 337 347 324 301 278 255 200 144 107 127 118 -6 -119
1268a19j14l4l4O2O2m6m6J1J2RRRRmnmmm1m2m2m1m1m2N5N5N4N4M7M6pj24j23qqrkjmlR1J50
1263b13N7n9k7L2J3m5m4J3K2l6n8n8k9k9K9K8K7K6K6K7mmmmmmlm%j%%l6l7K2K1L5L6k3k2o5
1258c99o5L2L2J8J8J8J8nooom0m0k2L6M3p2o9M7K2K3K7K6oo4m6P0J21Nn5LL9j9m1m1M0M1j8
1253c41j8k2k2k3k2nmnnM6M6n0n1N4N3mmn9n8n9n8Q6Q6j0o7o3N2Q0Q0NMNMo5o6P0O9LKjkl8
1248c77r7p1M5M9N0N7N7k1k1k2k1mmlmqpqpN2N3noK8K7K7K8qqj2j2qo5m8O8O9m6o8j0J1m6
1243c96j00m3QRJ2J1L6L6L7L6M5M6n0n1j6j7j7j7j2j3M2M2K0l8o0L7O2O1J0J0l4l4l3l4K7
1239c78K6l2l1O6O6l0l1L0K9k8k9K5K4l3l4M5M5n2n2rj0rj0O2O3p3p3LLLMj8j7j8j7l2l2l1
1234e85l2M1M1M1M2P9Q0n5n5J8J8l9m0l3l4K5K4JKJKJ9K0J9K0J2J2k6L1M0n6q9l1Q5Q5pqJ3
$$ plain form
1268 -119 -233 -267 -301 -239 -177 -223 -269 -258 -246 -237 -228 -219 -210 -214 -219 -223 -227 -268 -310 -352 -393 -434 -476 -421 -366 -312 -258 -211 -165 -172 -296 -419 -427 -435 -444 -446 -447 -451 -454 -363 -213
1263 -213 -156 -215 -242 -210 -197 -242 -286 -273 -251 -287 -345 -403 -432 -461 -432 -404 -377 -351 -325 -298 -302 -306 -310 -314 -318 -322 -325 -329 -329 -330 -330 -330 -366 -403 -381 -360 -325 -289 -312 -334 -399
1258 -399 -464 -432 -400 -382 -364 -346 -328 -333 -339 -345 -351 -391 -431 -453 -417 -374 -446 -515 -468 -446 -423 -396 -370 -376 -440 -486 -416 -295 -290 -345 -342 -303 -322 -363 -404 -364 -323 -341
1253 -341 -359 -381 -403 -426 -448 -453 -457 -462 -467 -421 -375 -425 -476 -422 -369 -373 -377 -436 -494 -553 -611 -525 -439 -449 -516 -579 -527 -447 -367 -362 -358 -353 -349 -414 -480 -410 -341 -338 -336 -337 -339 -377
1248 -377 -474 -545 -500 -451 -401 -344 -287 -308 -329 -351 -372 -376 -380 -383 -387 -395 -402 -410 -417 -365 -312 -317 -323 -295 -268 -241 -213 -221 -229 -241 -253 -261 -326 -374 -306 -237 -283 -351 -361 -350 -396
1243 -396 -496 -539 -531 -522 -510 -499 -463 -427 -390 -354 -309 -263 -313 -364 -380 -397 -414 -431 -443 -456 -414 -372 -352 -390 -450 -413 -351 -290 -280 -270 -304 -338 -371 -405 -378
1239 -378 -352 -384 -415 -349 -283 -313 -344 -314 -285 -313 -342 -317 -293 -326 -360 -315 -270 -322 -374 -383 -393 -402 -412 -350 -287 -360 -433 -430 -427 -424 -420 -438 -455 -473 -490 -522 -554 -585
1234 -585 -617 -576 -535 -494 -452 -373 -293 -348 -403 -385 -367 -406 -446 -479 -513 -488 -464 -463 -461 -460 -458 -439 -419 -400 -380 -368 -356 -382 -351 -311 -367 -456 -487 -402 -317 -324 -332 -319
1230c19J3m5m5qqpqN7N8l9l9j8j9j8j8j0j0j0j0klklN2N2m4m5onooK4K3K3K4O2O3p2p2L3L4
1225c79o2o3N1N1N2N1J5J5m3m3K3K3K2K3k5k6k5k5R8R8p6p5KJKJo7o8j0rR7R8JJJ4J4q2q3
1220d08m1m1J6J7N3N4q2q2N6N6JKR6J54N6o1n6JJ9J9K3K3K3K3mnj01j01m3m4N3N3O9O9o6o7
1216b66L2L2L1L2OPn2n1M8M8m8m8lmk1q0p0M6J13J12J0Rm8m8P8P7P7P7L7L6L7L7K16K16P6
1211G51l9o7M8M2p5p9q0q8q7r2r2l4l4K8K8o9o7LLMML5L6L5L6J3J4m4j02n2M3M4n3r9m1J6
1207a11J6J0J0J0J1M6M6K7l1k1P4J53J52K14K15J18J19J79J79J80J79J43J43O3l4j02j01k43
1204A644k42k13k12k07k06j68p1k9l0k4k4k5k4j9j8j5j5k3L5O0l7o4oN2N2J6J7J7J7M8M9m5
1200B90j03n9P7J31J32L1L0k1k1N8J55K35K36K87K87K88K87K54K53J17j7r6r5k32l66l75k40
$$ plain form
1230 -319 -306 -351 -396 -404 -412 -419 -427 -370 -312 -351 -390 -408 -427 -445 -463 -473 -483 -493 -503 -505 -508 -510 -513 -461 -409 -453 -498 -504 -509 -515 -521 -497 -474 -451 -427 -365 -302 -374 -446 -413 -379
1225 -379 -441 -504 -453 -402 -350 -299 -284 -269 -312 -355 -332 -309 -287 -264 -289 -315 -340 -365 -267 -169 -245 -320 -318 -317 -315 -314 -381 -449 -459 -468 -371 -273 -272 -271 -257 -243 -325 -408
1220 -408 -449 -490 -474 -457 -404 -350 -432 -514 -458 -402 -401 -399 -303 -149 -93 -154 -210 -209 -190 -171 -148 -125 -102 -79 -83 -88 -189 -290 -333 -377 -324 -271 -202 -133 -199 -266
1216 -266 -234 -202 -171 -139 -133 -126 -178 -229 -181 -133 -181 -229 -232 -236 -257 -337 -407 -361 -248 -136 -126 -117 -165 -213 -135 -58 19 96 133 169 206 243 459 675 751
1211 751 712 645 693 735 660 581 501 413 326 234 142 108 74 102 130 61 -6 -3 0 4 8 43 79 114 150 163 177 133 31 -21 22 66 13 -86 -127 -111
1207 -111 -95 -85 -75 -65 -54 -8 38 65 34 13 87 240 392 606 821 939 1058 1237 1416 1596 1775 1918 2061 2124 2090 1988 1887 1644
1204 1644 1402 1189 977 770 564 396 325 296 266 242 218 193 169 150 132 117 102 79 114 174 137 73 67 119 171 187 204 221 238 286 335 290
1200 290 187 128 205 336 468 499 529 508 487 545 700 935 1171 1458 1745 2033 2320 2574 2827 2944 2927 2831 2736 2504 2138 1763 1523
1196A523j90k47k75j78j34j34j04pK8k9p9q0k5k6M1M1j7j7j5j5j5j6pqN0N0MNNNj1j1K7l0
1192A09r0OQ3Q3P9Q0J76J75K49K49K49K48J40J41R8Jj11j12j76j75k06k05k00k00k10j15p2
1189B94p2j09j10n0n2j1j2j2j2n5n5KLrj0rj0l2l2O4O4N3N2l7l8kR5P3J6kknommN3N4O8O9
1184B08O9O9Q0Q1Q1Q1J4J4p9p9j11n2k5j21j50n3j8j6m5m5J3J3j4j4j4j3n7n8M0L9l2l1l2
1180b57l2j%Kr5q3J3Q5K7KO0Q4j2j19k2Q5K7m1m2N2N1o8o9O7O7M0M1M0M0j8j9j5j6k3L4N6
1176e9m0r9r8qrJ4J4J3J4j7j8M1M1n7n7PPm6N1J70J70j6j5j4j6m7m8J0J1p3p3K3K4K4K5Q2
1171f9Q2j3j2j3j3m7m8J1J0M4M4M3M4nnN2N3k4k3k3k4L5L4L5L4q1q1N3N4QQO6O5o2o2L5L4
1167B39qqN0N0k5k6k6k6l4l4K4K4mmN4N4JJN9N8J0RJ06J06K9L0K9L0m2m1J6J6l2l3J03J02
$$ plain form
1196 1523 1333 1086 811 633 499 365 261 254 282 253 174 94 69 43 84 125 108 91 76 61 46 30 23 15 65 115 119 124 129 134 123 112 139 109
1192 109 19 25 108 191 270 350 526 701 950 1199 1448 1696 1836 1977 2075 2076 1965 1853 1677 1502 1296 1091 891 691 481 366 294
1189 294 222 113 3 -47 -99 -110 -122 -134 -146 -201 -256 -254 -251 -260 -270 -279 -289 -321 -353 -289 -225 -172 -120 -157 -195 -197 -102 -29 -13 -15 -17 -22 -28 -32 -36 17 71 139 208
1184 208 277 346 426 507 588 669 683 697 618 539 428 376 351 230 80 27 9 -7 -52 -97 -84 -71 -85 -99 -113 -126 -183 -241 -201 -162 -194 -225 -257
1180 -257 -289 -290 -290 -288 -383 -466 -453 -368 -341 -339 -279 -195 -207 -326 -348 -263 -236 -277 -319 -267 -216 -284 -353 -286 -219 -179 -138 -98 -58 -76 -95 -110 -126 -149 -115 -59
1176 -59 -99 -198 -296 -304 -313 -299 -285 -272 -258 -275 -293 -252 -211 -268 -325 -318 -311 -357 -306 -136 34 18 3 -11 -27 -74 -122 -112 -101 -174 -247 -224 -200 -176 -151 -69
1171 -69 13 0 -12 -25 -38 -85 -133 -122 -112 -68 -24 19 63 58 53 105 158 134 111 88 64 99 133 168 202 121 40 93 147 155 163 229 294 232 170 205 239
1167 239 231 223 273 323 298 272 246 220 186 152 176 200 196 192 246 300 301 302 361 419 429 438 544 650 679 709 738 768 726 685 701 717 685 652 755 857
1162H57qqM9M9l7l7K6J41J09pO6O5N6N7kkj9k0P7P6N3N3nmj0j0M8M8k4k4J15K31J53L7J10
1158B259J09J51J50K08K09J49J49K07K07K41K41L38L37L04L04N30Q01R59J153J432J857K162
1155A4457K355K515K630K495K147J574R18R9o35j246j748k088k281k204k011j746j553j273
1153A2405j004q02o88m72l57k12k13r6J9Q9Q9J93J93K24K24M10N25N62N62O78P94Q49Q49R26
1150A5747J042J132J133J304J496J663K010K593L403M461N811P615R735J2034J4233J5940
1148A01352J6749J6268J4533J1775P958L107k021o761j0501j3254j4835j5226j4570j3109
1147H1465j1297r238p272n690m494l531k721k159j811j432j084q11o96n16l24j41q4P9M26
1144B8669P20R13J135J405J723J992K128K321K468K660K931L277L784M439N534P192R468J2592
$$ plain form
1162 857 849 841 890 939 902 865 891 1032 1141 1134 1200 1265 1321 1378 1376 1374 1355 1335 1412 1488 1541 1594 1589 1585 1575 1565 1613 1661 1637 1613 1728 1959 2112 2149 2259
1158 2259 2368 2519 2669 2877 3086 3235 3384 3591 3798 4039 4280 4618 4955 5259 5563 6093 6894 7853 9006 10438 12295 14457
1155 14457 16812 19327 21957 24452 26599 28173 29091 29190 28555 27309 25561 23473 21192 18988 16977 15231 13678 12405
1153 12405 11401 10599 9911 9439 9082 8870 8657 8561 8580 8669 8758 8951 9144 9368 9592 10002 10527 11089 11651 12329 13123 13972 14821 15747
1150 15747 16789 17921 19054 20358 21854 23517 25527 28120 31523 35984 41795 49410 59145 71179 85412 101352
1148 101352 118101 134369 148902 160677 168635 171742 169721 162960 152459 139205 124370 109144 94574 81465
1147 81465 70168 60930 53658 47968 43474 39943 37222 35063 33252 31820 30736 29925 29229 28713 28389 28248 28164 28243 28669
1144 28669 29389 30302 31437 32842 34565 36557 38685 41006 43474 46134 49065 52342 56126 60565 66099 73291 82759 95351
1142I5351J6709K1839K7799L3931L9302M2656M3189M0605L4994K6316J4843J460j1965k3728
1140D03301l2606l8351m0974m0705l7840l3098k7345k1677j6832j3090j0159p962o307n112
1139G1243m206l473k941k593k285j938j663j393j026o03k36J11N88J090J584J931K297K721
1136E9208L058L327L579L925M537N348O605Q418J1059J4644J9548K5833L3429M1875N0041
1135B94434N6173N8819N7393N1848M2246K8444J1128p828k5683m0262n0404n6097n7602n5249
1133C07360m9734m2084l3792k6384k0406j5793j2284r671p781o383n341m592m091l700l276
1131F2048k944k673k418j994j555j208p65k64K84P08J069J494J831K101K299K646L060L639
1129F7358M449N644P396R748J2935J7138K2468K8523L4828M0189M3482M3907M1193L5369K6431
$$ plain form
1142 95351 112060 133899 161698 195629 234931 277587 320776 361381 396375 422691 437534 438994 427029 403301
1140 403301 370695 332344 291370 250665 212825 179727 152382 130705 113873 100783 90624 82662 76355 71243
1139 71243 67037 63564 60623 58030 55745 53807 52144 50751 49725 49122 48886 48997 49585 50675 52259 54190 56487 59208
1136 59208 62266 65593 69172 73097 77634 82982 89587 98005 109064 123708 143256 169089 202518 244393 294434
1135 294434 350607 409426 466819 518667 560913 589357 600485 592657 566974 526712 476308 420211 362609 307360
1133 307360 257626 215542 181750 155366 134960 119167 106883 97212 89431 83048 77707 73115 69024 65324 62048
1131 62048 59104 56431 54013 52019 50464 49256 48491 48227 48511 49219 50288 51782 53613 55714 58013 60659 63719 67358
1129 67358 71807 77451 84847 94595 107530 124668 147136 175659 210487 250676 294158 338065 379258 414627 441058
1127D41058J4515N97j3556k5993l5364m1342m3926m3511m0388l5239k9030k3057j7928j3884
1125I2952j0760q463o804n570m606l872l447l134k864k635k519k379k033j726j457j240r70
1123B8473o11l41r5R8L19M34O13Q05J037J230J462J962K604L413M537O041P967J0165J2580
1121H2693J4933J6609J7265J6692J4956J2068P787K523k991q202j2560j5659j7318j7655j6846
1119I4295j5172j2897j0487q289o538n035l940l208k687k262j850j580j482j290j136j078
1117A5364j132j074q50q50o72o73m16m16l20l19j95j95o0o0J31J30J96J96L67M84N77Q48J203
1114A2264J550J825K172K451K645K630K437K084J505O67j43r97j730k311k658k894k894k733
1112A5870k309j846j577j360j090p88n95n77m63l29l30l22l23k52k53k53k52j19j20j77j77
$$ plain form
1127 441058 455573 456170 442614 416621 381257 339915 295989 252478 212090 176851 147821 124764 106836 92952
1125 92952 82192 73729 66925 61355 56749 52877 49430 46296 43432 40797 38278 35899 33866 32140 30683 29443 28473
1123 28473 27862 27521 27426 27524 27843 28277 28890 29695 30732 31962 33424 35386 37990 41403 45940 51981 59948 70113 82693
1121 82693 97626 114235 131500 148192 163148 175216 183003 185526 182535 174333 161773 146114 128796 111141 94295
1119 94295 79123 66226 55739 47450 40912 35877 31937 28729 26042 23780 21930 20350 18868 17578 16442 15364
1117 15364 14232 13158 12308 11458 10786 10113 9697 9281 8961 8642 8447 8252 8192 8132 8263 8393 8589 8785 9152 9636 10213 11061 12264
1114 12264 13814 15639 17811 20262 22907 25537 27974 30058 31563 32230 32087 31090 29360 27049 24391 21497 18603 15870
1112 15870 13561 11715 10138 8778 7688 6900 6305 5728 5265 4936 4606 4284 3961 3709 3456 3203 2951 2832 2712 2535 2358
1110B358rqj05j05k6k6k6k6L0L1L1L0J01J01J02J01J78J78J21J20m0m1j75j75o1o1j96j96
1106B206j43j43j43j43q3q3q2q3jkn9n9k7k6k7k7J0RRRR5R5L7L7O7O8O7O8J17J17N9N9P5P6
1102B149j37j37j41j42j42j41j04j04j04j03m7m8m7m7L4L4o3o2m8m8r9r9o4N1K2l6pN2K5r0
1098C07m5J3On3m7m7n2n1L3L2J4m4l3Q3M7j1j5j4j8j8n4n4MML9M0j8j8MMMMj0rrj0j1j3j3
1094b9j3M3M4j3j4j4j4j5j5K1J9K0K0J4J5J4J4L0K9o7o7KKj6p3J3J28J28J3k4L3N9n7r6r7
1089C7qpNMn2n3K1K0K1K0j2j3o3o4qJ07P4J7K5K5p5p4j2j3rrM8J06J1j03r8J8L6k2j5j5j5
1085a45j5N8J15N9n6l5P9M7j1J0J26Q9L2L7L8L8L7j1M7P9l7r4r5j01j02p3p3j6j5KLn4n6l9
1081a32l9J9J9J3J3J3J2j5j6o6o6k7Q9J54R4poj1j0O2O2NMNMJ2J2J2J27J21J20J66J65J66
$$ plain form
1110 2358 2349 2341 2236 2131 2105 2079 2053 2027 2057 2088 2119 2149 2250 2351 2453 2554 2732 2910 3031 3151 3111 3070 2895 2720 2659 2598 2402 2206
1106 2206 2063 1920 1777 1634 1551 1468 1386 1303 1302 1300 1241 1182 1155 1129 1102 1075 1085 1094 1103 1112 1207 1302 1339 1376 1443 1511 1578 1646 1763 1880 1939 1998 2073 2149
1102 2149 2012 1875 1734 1592 1450 1309 1205 1101 997 894 847 799 752 705 739 773 710 648 600 552 453 354 290 341 363 327 320 372 397 307
1098 307 262 275 281 228 181 134 82 31 64 96 110 66 33 116 163 152 137 123 105 87 33 -21 -17 -13 26 66 48 30 34 38 42 46 36 27 18 8 -3 -16 -29
1094 -29 -42 1 45 32 18 4 -10 -25 -40 -19 0 20 40 54 69 83 97 127 156 89 22 24 26 10 -63 -50 78 206 219 195 228 287 230 134 37
1089 37 29 22 27 31 -21 -74 -53 -33 -12 8 -4 -17 -80 -144 -152 -45 29 46 71 96 21 -53 -65 -78 -87 -96 -48 58 69 -34 -132 -114 -78 -100 -115 -130 -145
1085 -145 -160 -102 13 72 16 -19 60 107 96 106 232 321 353 390 428 466 503 492 539 618 581 487 392 291 189 116 43 27 12 14 17 -37 -93 -132
1081 -132 -171 -152 -133 -120 -107 -94 -82 -97 -113 -179 -245 -272 -183 -29 65 58 52 41 31 93 155 160 164 169 173 185 197 209 336 457 577 743 908 1074
1076A074J65J70J71J67J66R8M0p1j87k05j47j72k88k20j04pj23j72n6M4j5n9j%n9q3k4mlO
1073A01NK0r6r3K2P6l9r3l6K1K1rrN2N3Q0J39J21Nl6P8J49J49J27K43L13L12K74K75K16K16
1069B657J35J36P0j23k88k87k32l46m41l83k78k20j59j00l4l3n4n3m6m7o2N3J18N8l2l0l6
1066e7l5o6o5L1L1k0k0L7L8m3m2N3N4M9N0M8N0PQJ42J43J28J28J86J86J85J85J85J85R3R3
1062A947L1j61k66k09j20j78k41j83j22j23j81j82L1L1n2n0PPq5q5N0N0p0p0j2j3l7l8N9N9
1058b06k7k7k7k8J7J6J13J12L5L4L5L5k1k2L6L7Q3Q4J45J45P8J36K22J07ro6m1m1j52j52r4
1054E57r4j61j62j03j03n0n0PQj4j4M5M4k1k1P6P4m2m4J5J4p8p9k0k1j7j6j7j7l2l2J02J03
1050a63L6L6o1o0n2n3M5M4L3L3L3L4K1K1K1K1L2L2J29J30J5J6m2m2q0q0q0p9q3q4N1N2p7p6
$$ plain form
1076 1074 1239 1409 1580 1747 1913 2011 2051 1980 1793 1588 1441 1269 981 761 657 650 527 355 299 343 328 269 268 268 209 126 102 98 95 101
1073 101 106 126 30 -63 -41 35 -4 -97 -133 -112 -91 -100 -109 -57 -4 76 215 336 341 305 383 532 681 808 1051 1364 1676 1950 2225 2441 2657
1069 2657 2792 2928 2998 2875 2587 2300 2068 1722 1281 898 620 400 241 141 107 74 20 -33 -79 -126 -188 -135 -17 41 9 -21 -57
1066 -57 -92 -158 -223 -192 -161 -181 -201 -164 -126 -169 -211 -158 -104 -55 -5 43 93 100 108 250 393 521 649 835 1021 1206 1391 1576 1761 1854 1947
1062 1947 1978 1817 1551 1342 1222 1044 803 620 498 375 194 12 43 74 22 -28 -21 -14 -99 -184 -134 -84 -154 -224 -236 -249 -286 -324 -265 -206
1058 -206 -233 -260 -287 -315 -298 -282 -169 -57 -22 12 47 82 61 39 75 112 195 279 424 569 647 783 1005 1112 1103 1037 996 955 803 651 557
1054 557 463 302 140 37 -66 -116 -166 -159 -151 -165 -179 -134 -90 -111 -132 -56 18 -24 -68 -53 -39 -117 -196 -216 -237 -254 -270 -287 -304 -336 -368 -266 -163
1050 -163 -127 -91 -152 -212 -264 -317 -272 -228 -195 -162 -129 -95 -74 -53 -32 -11 21 53 182 312 327 343 301 259 179 99 19 -60 -143 -227 -176 -124 -201 -277
1046b77j8j9O1O2J19J18l9l8N7N8o5o4O3O3l5j31n5Kn2j10l6O1Kn6j7j8n1n1K5J23Q4K7N9
1042a48N9J8p8j14n7j4j5M6M7llN5J13O8k8o7o7l3l3O4O3o7o7o8o7l5l5K3K3n7n8L9L9L1L0
1038c96L1L0o6o5O9O9qqJ0O7m6j62j00J5P3P3P3P3N4o1k9K9j1j0N5J72Q0l4n3Nl7l7j5M2L7
1034h1p9m4J5K2K2K6K5l7l7l7l7ppM4M3L6q0n1PN1qqN1O0LL8L9qqqrJ9J8J8J7kkR4R4M3M2
1029B77L9L9no3m0P5J01M3pN0R0R1J51J52J22J22J22J22J39J39J39J39J03J02K13M07M91O08
1025C961Q24J172J506J853K159K507K697K696K661K545K211J786J241N86j56q89j473j897
1023B5990k278k549k654k539k430k315k069j721j425j155q05m58l83l84l72k57k34k92k28
1021A442j13j29k45k38j22l9l8q9q9l5l4m9O6Q8k7n2n2m4m5n9N7Q5l1n5JM1p5j29j3K5K7L0
$$ plain form
1046 -277 -295 -314 -253 -191 -72 46 7 -31 26 84 19 -45 18 81 46 -85 -140 -138 -190 -300 -336 -275 -273 -329 -346 -364 -415 -466 -441 -318 -234 -207 -148
1042 -148 -89 -71 -149 -263 -320 -334 -349 -303 -256 -259 -262 -207 -94 -26 -54 -121 -188 -221 -254 -190 -127 -194 -261 -329 -396 -431 -466 -443 -420 -477 -535 -496 -457 -426 -396
1038 -396 -365 -335 -401 -466 -397 -328 -336 -344 -334 -267 -313 -475 -575 -560 -487 -414 -341 -268 -214 -275 -304 -275 -286 -296 -241 -69 11 -23 -76 -71 -108 -145 -160 -118 -81
1034 -81 -160 -204 -189 -167 -145 -119 -94 -131 -168 -205 -242 -249 -256 -212 -169 -133 -213 -264 -257 -206 -214 -222 -171 -111 -108 -70 -31 -39 -47 -55 -64 -45 -27 -9 8 6 4 98 192 235 277
1029 277 316 355 350 287 247 322 423 466 459 509 599 690 841 993 1115 1237 1359 1481 1620 1759 1898 2037 2140 2242 2455 2862 3353 3961
1025 3961 4785 5957 7463 9316 11475 13982 16679 19375 22036 24581 26792 28578 29819 30405 30249 29360 27887 25990
1023 25990 23712 21163 18509 15970 13540 11225 9156 7435 6010 4855 4050 3592 3209 2825 2453 2196 1962 1670 1442
1021 1442 1329 1200 955 717 595 556 518 429 340 305 271 222 288 376 349 297 245 201 156 97 154 239 208 153 154 195 120 -9 -22 3 30 60
1017F0L1M6j2n1O4J04j2l6l6k7k8lJ12J33J7p9L6Q3l2j28p0J1J0m3m4K3K2j12j11LLLMn6n6
1012a71M1M1poo5o4K4K3P5P4P2m3j7L9M8o6o7M9N9Ln0OK8k7q7k8O9J2q6q7KLKKL6L5k2k2M2
1008a30M3j5j5mmlmM7M6m9n0J9J9J9K0L3L3R1R1k7k7k7k7J26J26rrR3R3m2m3K5K4l4l4j7j7
1003C61j7j7M2M1j6j6L6L6k2k2R5R5kjN9N8N9N8N8N7%jN6N5kkN1N0m5m6J16J17J9K0J38J38
999A606Q0Q0R3R4J51J51J97J97J53J54L03N34P13R44J339J879K449K988L232L000K632K517
996B5486K663K663K203J046k85j597k347k346k161k276k722l108k964k578k076j536j133p47
994F185o29n13l61l61l53l53k25k24k82k83r4r4k29k29j62j62o5o6j5j5p3p3M4M3n2n3NMN
990A320NM5M6M6M5J84J84K42K42L61L61K46J30M8o7j83j83j63j64k91k92k21j06j13j13j0
$$ plain form
1017 60 91 137 125 74 138 242 230 194 158 131 103 100 212 345 362 283 319 402 370 242 172 183 193 150 106 129 151 39 -72 -69 -66 -63 -59 -115 -171
1012 -171 -130 -89 -96 -102 -167 -231 -207 -184 -109 -35 37 -6 -23 16 64 -2 -69 -20 39 42 -8 -2 26 -1 -88 -116 -47 -35 -121 -208 -206 -203 -201 -199 -163 -128 -150 -172 -130
1008 -130 -87 -102 -117 -121 -125 -128 -132 -85 -39 -88 -138 -119 -100 -81 -61 -28 5 96 187 160 133 106 79 205 331 322 313 406 499 457 414 439 463 429 395 378 361
1003 361 344 327 369 410 394 378 414 450 428 406 501 596 594 593 652 710 769 827 885 942 942 941 997 1052 1050 1048 1099 1149 1104 1058 1174 1291 1310 1330 1468 1606
999 1606 1686 1766 1859 1953 2104 2255 2452 2649 2802 2956 3259 3793 4506 5450 6789 8668 11117 14105 17337 20337 22969 25486
996 25486 28149 30812 33015 34061 33776 32179 29832 27486 25325 23049 20327 17219 14255 11677 9601 8065 6932 6185
994 6185 5556 5043 4682 4321 3968 3615 3390 3166 2884 2601 2507 2413 2184 1955 1793 1631 1566 1500 1485 1470 1397 1324 1368 1411 1359 1306 1311 1315 1320
990 1320 1325 1370 1416 1462 1507 1691 1875 2117 2359 2720 3081 3327 3457 3505 3438 3255 3072 2909 2745 2454 2162 1941 1835 1722 1609 1599
987A599j0j1j0N2N2KJP1J86J79J78K28K27J31J30J46J45Q7Q8J16J16N9N8J52J51J51J51J84
984D609J84M8M9J05J06Q1l5RJ25J49J48K49K49K48K49L43L42L12J95J90J89J12lj6j7j20j20
980G980j41j41j41j40j08j07j1j1Q5Q4Q4Q4J57J56J56J56K79K79J83J82J81J80J22J22J89
977I859J88J31J31J81J82J82J82L08L08K00Q4J04J03L8L9R6R6PPK5J41J72J72J87J88J88J88
974A3687K71K71K21K21L38M55M62L46L79M95N50N50M83L67K97K97M10M10M17M18N51O66O02
971B3164O01P05P04P04P04P62P62O92N77N89N89N25N24N72N73N80N79P98R14Q60Q60R47J140
968C9425J290J289J473J589J632J633J895K087K160K160K338K454K463K463K690K960L087
966G5088L203L408L677M006M506N121N777O327P059Q211R560J0829J2024J3366J4794J6056
$$ plain form
987 1599 1589 1578 1568 1620 1672 1674 1675 1746 1932 2111 2289 2517 2744 2875 3005 3151 3296 3383 3471 3587 3703 3762 3820 3972 4123 4274 4425 4609
984 4609 4793 4841 4890 4995 5101 5182 5147 5156 5281 5430 5578 5827 6076 6324 6573 6916 7258 7570 7765 7955 8144 8256 8253 8237 8220 8100 7980
980 7980 7839 7698 7557 7417 7309 7202 7191 7180 7265 7349 7433 7517 7674 7830 7986 8142 8421 8700 8883 9065 9246 9426 9548 9670 9859
977 9859 10047 10178 10309 10490 10672 10854 11036 11344 11652 11852 11936 12040 12143 12181 12220 12316 12412 12419 12426 12451 12592 12764 12936 13123 13311 13499 13687
974 13687 13958 14229 14450 14671 15009 15464 15926 16272 16651 17146 17696 18246 18729 19096 19393 19690 20100 20510 20927 21345 21896 22562 23164
971 23164 23765 24470 25174 25878 26582 27344 28106 28798 29375 29964 30553 31078 31602 32174 32747 33327 33906 34704 35618 36478 37338 38285 39425
968 39425 40715 42004 43477 45066 46698 48331 50226 52313 54473 56633 58971 61425 63888 66351 69041 72001 75088
966 75088 78291 81699 85376 89382 93888 99009 104786 111113 118172 126383 135943 146772 158796 172162 186956 203012
964B03012J7253J8379J9344K0120K1084K2381K4116K6652L0779L7372M7362O2792Q6742J21119
963G58507J66125K21308K84826L51135M10641M54809M80379M87563M75647M42654L88082L12820
961E234496K17060J02568k2424j43379k48009l31788l95074m37899m60383m64422m52275m23554
960B174917l78163l21094k61665k07289j60741j22666r3857p4066o0761n0927m3406l7896
958C62386l3847l0322k7276k4936k2969k1050j9083j7420j5761j3948j2136j0656r461q240
957I5281o969n958n226m565l909l339k837k465k196j957j763j547j431j383j267j055r40r02
954D5572p86n74l05j42J27O23J125J656K389L247M056M575M845M874M758M401L899L253K289
952H9882R23n82j926l045m007m663n110n381n479n364m901m323l735l079k457j956j556j209
$$ plain form
964 203012 220265 238644 257988 278108 299192 321573 345689 372341 403120 440492 487854 550646 637388 758507
963 758507 924632 1145940 1430766 1781901 2192542 2647351 3127730 3615293 4090940 4533594 4921676 5234496
961 5234496 5451556 5554124 5531700 5388321 5140312 4808524 4413450 3975551 3515168 3050746 2598471 2174917
960 2174917 1796754 1475660 1213995 1006706 845965 723299 629442 555376 494615 443688 400282 362386
958 362386 328539 298217 270941 246005 223036 201986 182903 165483 149722 135774 123638 112982 103521 95281
957 95281 88312 82354 77128 72563 68654 65315 62478 60013 57817 55860 54097 52550 51119 49736 48469 47414 46474 45572
954 45572 44786 44212 43907 43765 43892 44515 45640 47296 49685 52932 56988 61563 66408 71282 76040 80441 84340 87593 89882
952 89882 90805 90223 88297 85252 81245 76582 71472 66091 60612 55248 50347 46024 42289 39210 36753 34797 33241 32032
950C2032r92p99p46o29m98l81k96k96k89k88k43k42j07j08k06k06k06k06j89j89k51l67m60
947B3838l44j66j66j15j15j8j9m5m4O3J79J66J66L47L47L50L51L50L50L76L76N18N18N51O68
944B8482Q99J091J237J238J249J249J240J239J326J134P77M31K47K47J46J46J45J46n1n2J30
941D2696L22L71L72N30O47O72O72Q27R42J022J021J210J403J445J445J641J911K132K248K373
939F5902K374K302K303K518K787K954K953L072L342L847M503N255N988O681P801R405J1219
937A45206J2970J4629J6291J7951J9572K0845K1775K2200K2370K2795K3700K4820K6291K9262
935D40677L4878M3940N7723P8587J10303J58703K32328L36263M58213N60298N97707N58254
934C667874M82969M36729M46247M65414M09581K31213l1000k75547m14804m38907m13826m18568
$$ plain form
950 32032 31040 30241 29495 28866 28368 27987 27691 27395 27106 26818 26575 26333 26226 26118 25912 25706 25500 25294 25105 24916 24665 24298 23838
947 23838 23494 23328 23162 23047 22932 22914 22895 22850 22806 22869 23048 23214 23380 23727 24074 24424 24775 25125 25475 25851 26227 26745 27263 27814 28482
944 28482 29381 30472 31709 32947 34196 35445 36685 37924 39250 40384 41161 41592 41839 42086 42232 42378 42523 42669 42618 42566 42696
941 42696 43018 43389 43761 44291 44938 45610 46282 47109 48051 49073 50094 51304 52707 54152 55597 57238 59149 61281 63529 65902
939 65902 68276 70578 72881 75399 78186 81140 84093 87165 90507 94354 98857 104112 110100 116781 124582 133987 145206
937 145206 158176 172805 189096 207047 226619 247464 269239 291439 313809 336604 360304 385124 411415 440677
935 440677 475555 519495 577218 655805 766108 924811 1157139 1493402 1951615 2511913 3109620 3667874
934 3667874 4150843 4587572 5033819 5499233 5908814 6140027 6109027 5833480 5418676 4979769 4565943 4147375
932D147375m78163n51245n75795n25081m22515l12332k24342j63755j23303r5806p6705o2783
931E35550n2133m4382l9189l5372l1780k8194k5300k3411k2360k1627k0535j8569j5998j3724
929A42976j2237j1119r924q573p306o187n387m963m839m493l870l292k906k636k439k246k092
927D8467j823j374j028j017j134j097j097j037r20p74p73r44r44q73p58p88p88p81p81r07
925B8829r07p61o44p41p41o69m76l57l58j99q3j28j28J01L70N34O49R26J274J484J485J506
922C0966J506J314J315J309J117L99m87j175j522j681j681j695j811j997j997j816j469j124
920A9471q55n74m60m76n91n27m11n05n05n05l89m44m44m05k90k81k81j34j8k2j38j37k2l1
917A1026j48j47l1Lj12j75j75q4q5J2J2kkM8M9K5r0PJ22K07K07K14K14K32K33K90M06L48J56
$$ plain form
932 4147375 3669212 3117967 2542172 2017091 1594576 1282244 1057902 894147 770844 675038 598333 535550
931 535550 483417 439035 399846 364474 332694 304500 279200 255789 233429 211802 191267 172698 156700 142976
929 142976 130739 119620 109696 101123 93817 87630 82243 77280 72441 67948 64078 60786 57880 55244 52805 50559 48467
927 48467 46644 45270 44242 43225 42091 40994 39897 38860 37940 37166 36393 35449 34505 33632 32874 32086 31298 30517 29736 28829
925 28829 27922 27161 26517 25776 25035 24366 23890 23533 23175 22976 22893 22765 22637 22738 23108 23642 24291 25217 26491 27975 29460 30966
922 30966 32472 33786 35101 36410 37527 37926 37439 36264 34742 33061 31380 29685 27874 25877 23880 22064 20595 19471
920 19471 18616 18042 17582 17106 16515 15988 15577 15072 14567 14062 13673 13229 12785 12380 12090 11809 11528 11394 11376 11354 11216 11079 11057 11026
917 11026 10878 10731 10700 10703 10591 10416 10241 10157 10072 10084 10096 10094 10092 10140 10189 10214 10124 10131 10253 10460 10667 10881 11095 11327 11560 11850 12256 12604 12760
913A2760Rj07j91j91j48j47k60l75m33l17l71l72l79k63k88m03l97k81k22k21k22j06j12j11
910F852j19kPj07j32j32q5q5q5q5J4J4PJ22O8O7P5P5J57J58K3K3M6M6j2j1q6q5q5q6j41j42
906F274j56m1q0j96j89p3m3m3l6l6K4K5l4l3o0n9o7M9K6K6o3o3l0l0l0l1QPPPm1m1j06RJ7
902D898J7l4l4K3K2l5l6J3J3M4J60J58J58O9O9Q8Q8J46J46J43J43J75K90L96L96N19P89J059
899I883J329J638K061K400K514K633K633K609K340J931J508R19J87o18j197j661k161k484
896B6464k599k574k516k401k132j835j565j330r82p13n98m94l78k74k74k67k67k08k08j49
894D700j50q1q1n6N9R7k0j14n7M1M0n2n2r8r8j56j56j04j03j61j62o3o4m5J2O2n3j08QJ02
890C087J01o4o5k7k7n6n7R3R2O3O3Q3Q3K4K5J9K0l9l9M3M3n4n3K3K4p3p3nno2o3M9M8K0K0
$$ plain form
913 12760 12769 12662 12471 12280 12132 11985 11725 11350 10917 10600 10229 9857 9478 9215 8927 8524 8127 7846 7624 7403 7181 7075 6963 6852
910 6852 6733 6731 6738 6631 6499 6367 6282 6197 6112 6027 6041 6055 6062 6184 6252 6319 6394 6469 6626 6784 6807 6830 6876 6922 6910 6899 6813 6728 6643 6557 6416 6274
906 6274 6118 6077 5997 5801 5612 5539 5496 5453 5417 5381 5405 5430 5396 5363 5303 5244 5177 5226 5252 5278 5215 5152 5122 5092 5062 5031 5039 5046 5053 5060 5019 4978 4872 4881 4898
902 4898 4915 4881 4847 4870 4892 4857 4821 4834 4847 4891 5051 5209 5367 5436 5505 5593 5681 5827 5973 6116 6259 6434 6724 7120 7516 8035 8824 9883
899 9883 11212 12850 14911 17311 19825 22458 25091 27700 30040 31971 33479 34398 34585 33967 32770 31109 28948 26464
896 26464 23865 21291 18775 16374 14242 12407 10842 9512 8530 7817 7219 6725 6347 6073 5799 5532 5265 5057 4849 4700
894 4700 4550 4469 4388 4332 4391 4488 4468 4354 4297 4338 4378 4326 4274 4176 4078 3922 3766 3662 3559 3398 3236 3173 3109 3064 3076 3138 3085 2977 2985 3087
890 3087 3188 3124 3059 3032 3005 2949 2892 2985 3077 3140 3203 3286 3369 3393 3418 3437 3457 3418 3379 3422 3465 3411 3358 3381 3405 3332 3259 3254 3249 3187 3124 3173 3221 3241 3261
886C261R8R8M0M0K2K3j13j12k3k3q0q1J1J1M3J58L56L56Pl41l88k73j42q4n6n6n3n3J9K0p8
882B607p7k6k6LLL3L4k4k4K4K5l4l3k9k9q6q7Q4Q3R0k5k6k7l3l4N1N2poJ5J5J5J5k6k7K4K4
878B511M5p1j03j02O7O7RRR7R7l8l8k0j9j9k0Q7Q7K9K9j6j6j6j5K7K7kkJ6J5m3m2J8J8J9J8
873B710N1N1Q2J98L05L05J8r7m3P2N8N8J46J45J17J16J13J13K55K55L73M88O31R77J499K078
870A1074K694L119L256K986K593K478K604K605J836N63q38j956k512k513k344k459k839l185
868A7162l040k463j936j436j055p86o43o44m05k12k56k57k83j86j47k04j94j36p5p6n3n3j05
865B517j05p5K1K5K6j0ro7o8l3l4j24j24m9M7pj04n7Jjn9k4L3j9p7l7R7P6k0n8jko1qN1N0
861A711pm5J4J4m5q4k6L4L4K4K5l4l4l1l2K7K7L8L9j6j6N4J12M1n5o6qJ1J1K9K9k8k9J4J3
$$ plain form
886 3261 3359 3457 3497 3537 3559 3582 3469 3357 3334 3311 3231 3150 3161 3172 3215 3373 3729 4085 4092 3751 3363 3090 2948 2864 2808 2752 2699 2646 2665 2685 2607
882 2607 2530 2504 2478 2481 2484 2517 2551 2527 2503 2527 2552 2518 2485 2456 2427 2341 2254 2338 2421 2511 2486 2460 2433 2400 2366 2417 2469 2462 2456 2471 2486 2501 2516 2490 2463 2487 2511
878 2511 2556 2485 2382 2280 2347 2414 2423 2432 2529 2626 2588 2550 2530 2511 2492 2472 2559 2646 2675 2704 2688 2672 2656 2641 2668 2695 2693 2691 2707 2722 2679 2637 2655 2673 2692 2710
873 2710 2761 2812 2894 3092 3397 3702 3720 3623 3580 3652 3710 3768 3914 4059 4176 4292 4405 4518 4773 5028 5401 5889 6520 7497 8996 11074
870 11074 13768 16887 20143 23129 25722 28200 30804 33409 35245 35808 34970 33014 30502 27989 25645 23186 20347 17162
868 17162 14122 11659 9723 8287 7232 6446 5803 5159 4754 4542 4286 4029 3746 3560 3413 3209 3015 2879 2804 2728 2675 2622 2517
865 2517 2412 2337 2358 2383 2409 2399 2390 2323 2255 2222 2188 2064 1940 1891 1938 1931 1827 1770 1771 1770 1711 1687 1720 1701 1624 1587 1684 1760 1740 1682 1681 1679 1618 1610 1661 1711
861 1711 1704 1659 1673 1687 1642 1558 1532 1566 1600 1624 1649 1615 1581 1550 1518 1545 1572 1610 1649 1633 1617 1671 1783 1824 1769 1703 1695 1706 1717 1746 1775 1747 1718 1732 1745
856A745m1m0OO4L2o5m9RRm9l9N7O0l7p0K7N7kKJkkj2j1o8o9k2k2k2k2K4K5K4K4l6l6K2K2K6
852A520K6l2l2k6k6j8j9K5J40N1o5j10NK9L0k8k7k0k0mJ11J11mm7m6m7m6k0R6L1L0K6K5K5
848A644K5J1J1J1J1m6m6l9l9o8M8M8o7l4l3l4l3l2Q3Q4l2j05j04O2O2POPOp0p0O5O5L3L2R1
843A560R0M6M6n1n0p2p3j4j4nnR2R2m1m1J7J7k2k1L6L7ppppR2R2R2R1n1n2j40j41o0N6j0r
839A556m4m4N2N2k5k6L2L3J00R9K16L31M64N79M88J41l14n83n11l96k27j12j04j05j27j2j9
835A494j9q1q1N5N4L5L4L5L5l4l3l4l4o2o3P2P3k9k8L0K9m1m2N5N5j1j1j1j1j00j00m3m2N4
831A200N4N4N3j30j31k6R0J14N5jjk1k2P5P5p2p3K4K4RQRQk3k3M7J63R6R7J61J62J75J75J17
827B522J17RRl1K6k6j42k08k08j59j59J1J1n3j12n5O1Q0l5k5k5k1p8j15JJ4m4m0J8N9Kk0k0
$$ plain form
856 1745 1704 1664 1670 1734 1766 1701 1652 1661 1670 1621 1582 1639 1699 1662 1592 1619 1676 1674 1676 1677 1675 1673 1661 1650 1582 1513 1491 1469 1447 1425 1449 1474 1498 1522 1486 1450 1472 1494 1520
852 1520 1546 1514 1482 1456 1430 1412 1393 1418 1558 1609 1544 1434 1439 1468 1498 1470 1443 1423 1403 1399 1510 1621 1617 1570 1524 1477 1431 1411 1507 1538 1568 1594 1619 1644
848 1644 1669 1680 1691 1702 1713 1667 1621 1582 1543 1475 1523 1571 1504 1470 1437 1403 1370 1338 1421 1505 1473 1368 1264 1326 1388 1395 1401 1408 1414 1344 1274 1339 1404 1437 1469 1560
843 1560 1650 1696 1742 1691 1641 1569 1496 1482 1468 1463 1458 1550 1642 1601 1560 1577 1594 1572 1551 1587 1624 1617 1610 1603 1596 1688 1780 1872 1963 1912 1860 1720 1579 1519 1575 1565 1556
839 1556 1512 1468 1520 1572 1547 1521 1553 1586 1686 1785 2001 2332 2796 3375 3863 4004 3690 3107 2596 2200 1973 1861 1757 1652 1525 1513 1494
835 1494 1475 1394 1313 1368 1422 1457 1491 1526 1561 1527 1494 1460 1426 1364 1301 1373 1446 1417 1389 1419 1448 1407 1365 1420 1475 1464 1453 1442 1431 1331 1231 1188 1146 1200
831 1200 1254 1308 1361 1231 1100 1074 1164 1278 1333 1332 1331 1310 1288 1363 1438 1366 1293 1317 1341 1350 1358 1367 1375 1352 1329 1376 1539 1635 1732 1893 2055 2230 2405 2522
827 2522 2639 2648 2657 2626 2652 2626 2484 2276 2068 1909 1750 1761 1772 1719 1607 1552 1613 1693 1658 1633 1608 1587 1509 1394 1395 1409 1365 1325 1343 1402 1404 1384 1364
823A364RRNONn2r2K4Rj06j00J7R5R6M5M4Q5Q5j2j2k0j9p8p7K1K1l6l7OOJ02J02R1R2L3L4J38
818A903J37J38J38J82J81Q5Q4l3l3m1m1nj22j52j53j04j03k00k00o3o4o4o4k8k8j52l5P9P8
815A320j7j8J00j7j51l6P3P3n5n5J43J44QQQ5Q6j27j27P7P7n8n8J06J06o8o8J39J40l4l5J47
811A908J46o5o6K05K04J9J9K55O2l43l43J62K78j53j54J89J89j01j00L85L85j67j67L95N11
808C653q0j96M56N73j64j63P12R05L7L7J492J994R79J480M539O892Q342J5555L0133L8040
806A15216K3133r300l4317l5204k0747r525o907n866k636p46j894k627j117p6q93j472n36
804D486J20o40j141l02K76k73o97n1L73j83o08m9L76o4m88l9L85J1l36M0L87Ok64N4M01M7
800A827l78j46J24j48l40n6K14m7l16PK76M1l06n1K20M3k26n3K17N1k18m5K25L9k30j9K52
$$ plain form
823 1364 1373 1382 1387 1393 1398 1346 1254 1278 1287 1181 1081 1098 1193 1289 1334 1378 1463 1548 1536 1524 1504 1485 1407 1330 1351 1372 1336 1299 1305 1311 1413 1515 1606 1698 1731 1765 1903
818 1903 2040 2178 2316 2498 2679 2764 2848 2815 2782 2741 2700 2695 2573 2421 2268 2164 2061 1861 1661 1598 1534 1470 1406 1378 1350 1198 1163 1242 1320
815 1320 1303 1285 1385 1368 1217 1181 1254 1327 1272 1217 1360 1504 1512 1520 1605 1691 1564 1437 1514 1591 1533 1475 1581 1687 1619 1551 1690 1830 1796 1761 1908
811 1908 2054 1989 1923 2128 2332 2351 2370 2625 2687 2344 2001 2163 2441 2288 2134 2323 2512 2411 2311 2696 3081 2914 2747 3142 3653
808 3653 3573 3377 3833 4406 4242 4079 4791 5696 5733 5770 7262 9256 10235 11715 16254 23146 31488 47043 77176 115216
806 115216 138349 129049 94732 59528 38781 29256 22349 16483 13847 13101 11207 8580 7463 7387 6494 5022 4486
804 4486 4606 3966 2825 2523 2799 2526 1829 1778 2151 1968 1360 1311 1687 1623 1135 1096 1481 1492 1156 1196 1583 1589 1325 1379 1780 1827
800 1827 1449 1303 1427 1279 939 883 1097 1050 734 741 1017 1058 752 701 921 964 738 685 902 953 735 690 915 954 724 705 957
797I57R0j80m0J53K0k50q1J89L5k36r1J02K3j71MJ96Pj86k2K48O6k04j07J63J37j32q5J09
794G14O2j31l5J58L8j54n8J35N5j38q9J81Q4j85j22J47J30o4n9J35M6j46q9J05K3j69p8J16
790F12P6j94j02J68J71r8j09Q5J24o9k6R0R7r5m3J51J08q4m0P5J4j80j26O7N7j35m4J49Q6
787G85j84j30J39J62j08j18P6Q1j12j59J10J82q9j36N6J88nr2K4N0o6n7J36J25o9j60L3J18
783G80Kq9K7N5o0j04Q9J09pn0J42J72k2l6Q0Q7j06j64K9R8j8j8R7J07q7j48M3R0j03k26l3
779G36N9N9kJ15J63M6jJ92K88R6l9J53L17J23j9j8M0j51k51j35r8k13k14r7j2j28j85p0P7
776H31l8l9P8J32J6q0L6J07rj06J1J02j4j16P8J55L9n8N9J76j7j86p0L9p7k04q9J9J8r5K1
772G19J17Jj63m8J12mj29j4R9j7n7n8M0p5j31O2J33n9j99oK13R8p4p3J69N3j04j04J06J06
$$ plain form
797 957 1047 867 827 980 1000 750 669 858 893 657 566 668 691 520 524 720 727 541 519 767 833 629 522 685 822 690 605 714
794 714 776 645 610 768 806 652 594 729 784 646 557 738 822 637 515 662 792 728 669 804 850 704 615 720 743 574 496 612
790 612 688 494 392 560 731 633 524 609 733 664 638 728 825 730 687 838 946 862 822 897 911 731 605 672 729 594 550 699 785
787 785 601 471 610 772 664 546 622 703 591 432 542 724 635 499 555 743 738 646 670 720 654 597 733 858 789 629 662 780
783 780 782 693 720 775 715 611 700 809 802 752 894 1066 1044 1008 1088 1175 1069 905 934 1032 1014 996 1093 1200 1113 965 1008 1098 995 769 736
779 736 795 854 852 967 1130 1176 1175 1367 1655 1751 1712 1865 2182 2305 2286 2268 2308 2157 1906 1771 1673 1460 1246 1149 1137 1009 824 754 831
776 831 793 754 832 964 980 900 936 1043 1034 928 939 1041 1027 911 989 1144 1183 1125 1184 1360 1343 1157 1087 1126 1049 845 756 775 793 698 719
772 719 836 837 674 626 738 734 605 591 690 673 616 558 598 523 392 454 587 528 329 323 536 634 560 487 656 709 605 501 607 713
768G13j16j17J01J01O5O4J53L7q1q1R4R5QQJ25J25m6m7P8l8j70n5J20Nk09r4Q3Q4j70j70R8
765G63R7j24j24L1L1p5p5J8J8o8o9J12J12p1p1N7N7o8o9Q5Q4r8r9J00J00m5m5J01J01m4m3
761F79N9N9k7k7J09J09KLM4M4o1o2P3P3j49j49R6R7m9m8L9L8j25j26P7P6q8q7pqppQ0Q0j80
757F30j80M1M1o5o4O8O9p6p5R6R7m8m8K1K2j03j04R7R6r9r8O4J80M0p7P0J27n6j14J2J28m6
753F46j03M5J62L6p9l9K0n0m9O7O6r4r3N6J15m8j64k6R1J9r6NO3j5j30mN3l7r5M0R8n0j65
749B45n9N7O5QM7M8q2q1P6P6o8o8M1M2j03j60L1J46Nj10K9J46K0r5K6J42R0k6K1P9n3j68m9
745C18O7L1k6Q0J38k8j43j7R9k1j37mJ88K9j63j15P8L0q6j2J03Kj13rJ84Q3j10r8R4M7o9n9
741C61N6K5l4j7R9Oj10l1Q4pj23n9J35M3j50q9J04P5j18o6J27J37K1pJ10N6n9NJ97K01Q6O5
$$ plain form
768 713 597 480 581 682 747 811 964 1001 920 839 933 1028 1036 1044 1169 1294 1248 1201 1279 1241 1071 1016 1136 1141 932 838 921 1005 835 665 763
765 763 860 736 612 643 674 599 524 542 560 492 423 535 647 576 505 562 619 551 482 567 651 553 454 554 654 609 564 665 766 722 679
761 679 738 797 770 743 852 961 963 966 1010 1054 993 931 1004 1077 928 779 875 972 923 875 914 952 827 701 778 854 766 679 672 664 657 650 730 810 630
757 630 450 491 532 467 403 471 540 464 389 485 582 534 486 507 529 426 322 419 515 416 318 382 562 602 525 595 722 666 552 564 692 646
753 646 543 588 750 786 707 668 688 638 589 656 722 628 535 591 706 658 494 468 559 578 482 487 550 535 405 401 454 417 322 362 460 410 245
749 245 186 243 308 316 363 411 329 248 324 400 332 264 305 347 244 84 115 261 266 156 185 331 351 256 282 424 514 488 509 588 535 367 318
745 318 385 416 390 470 608 580 437 420 519 498 361 357 545 574 411 296 374 404 318 306 409 411 298 289 473 556 446 348 442 489 420 361
741 361 417 442 408 391 490 496 386 355 439 432 309 250 385 428 278 189 293 368 250 184 311 448 469 462 572 628 569 574 771 972 1058 1123
737A123Pj70l63k28M1Q5l1qJ07j8k11r1J01J26o7l7Q0K6j66r6R8J50m2r3K2P6m0mJ11N4o2
733D80j15JpoM5J60M2j50q7J06N8n8n3O2N2j40m7J47J46m6j09Q3R4k3p0M5M5p0q8K8Q6l0m6
729E35O9P0m6j26j0K4r2o9J23J76O1k2R4Q0j13j27j2Q1l6o6M9P8l8j4J01N4j40j48M5J75j7
725G39o9M8J00j5j41k5J10ol3Q3J12mj34j9Q0K2J2P1M8o7o8M8K3r2r0J04K31L8j38j38m7j06
721F77r0J02J59M4k7R0O5n1j20P3J31o2j19mR3j00j85p0O6Rp5M1J39Q2J3J3L3j59j97nJ95
717G61P9n3OR5k0n3O2J64l0j87p1J03M6n5O1J62M5n1O5J58M2q2k4J05j0j33j6J11nj20j20
714A035k4k3j11OJ47L2n7N9J48L2j78j78m9n0r1r1N1N1m1P6J36K1j18o0P1J3q6k8J07N0m8
710H02J1J29L2r5l8R5L7o7j0Q6K9l9J9J37M1j22o5J03M5j53j53J7J8p5p5O3O4q0k2Q1Q0k0
$$ plain form
737 1123 1130 960 597 369 410 495 464 456 563 545 334 243 344 470 403 366 446 472 306 210 308 458 416 323 345 421 381 377 488 542 480
733 480 365 366 359 353 398 558 600 450 363 469 527 469 416 478 530 390 343 490 636 590 481 564 658 635 565 610 655 585 497 525 611 581 535
729 535 604 674 628 502 492 516 424 355 478 654 715 693 787 867 754 627 615 696 660 594 643 721 683 669 770 824 684 536 581 756 739
725 739 670 718 818 803 662 637 747 741 708 791 903 899 765 746 826 848 860 931 979 912 844 892 915 823 733 837 1068 1106 968 830 783 677
721 677 587 689 848 892 865 955 1020 969 849 922 1053 991 872 868 961 861 676 606 672 681 606 647 786 868 881 894 927 768 571 566 761
717 761 840 787 793 888 868 815 877 1041 1011 824 753 856 902 847 908 1070 1115 1064 1129 1287 1329 1247 1223 1328 1318 1185 1169 1280 1275 1155 1035
714 1035 1011 988 877 883 1030 1062 1005 1064 1212 1244 1066 888 839 789 698 607 658 709 668 744 880 901 783 723 794 807 721 693 800 850 802
710 802 813 942 974 879 841 936 973 906 896 982 1011 972 991 1128 1169 1047 982 1085 1130 977 824 841 859 784 709 772 836 756 734 815 895 875
706H75k0J09N1r3r4L6k3j40q2K3K3q8QJ27J28OOJ36P7o8o7Q3j3j76j19J28J28l6r3L5L6j24
702G79j25N0M9m8m8J19O1j37j38L2L2r3r3M5M6j22o4J54J53p6p6R4R3r6j55J9P7r0q9Q4Q4
698E21n3j11N9J17l5r3Q1J39l5r2M7J04j2j1Q5Q5j16j73N1J48k7q6Q8J45k3j20KN9o5o4R0
694G05J86j2j28OJ22k5j41m4P1K8q8J0O8l9m0R2R2p0j85j9R6n5j71l6Q0j2j27NO4m3j01L7
691C26J52j3j30o8M8n7j15K6J42nj20o3N4j5j30NJ21N7n8P1J28%j16k4R3qj22N0J67pj23l1
687B35J62L0q6k3R3jj17k0R5nj21k9J64L2q4RK01O5j27j22P1L3q2m5J3k0j36m3P3J4j02L3
683A60J49K4r1nJ88J15p8l0Q6pj23l6J57P5j17j14Q0N1o4kJ14M2p3j5J00J6j00j4J80R8r4
679F72m6P0K2r5m6J47J22p1p2J22Q0j12j08Q5Q5l0p4J19J04q8q8J05P2j21o3J30J20p4o8J24
$$ plain form
706 875 855 964 1015 922 828 864 841 701 619 642 665 577 585 712 840 846 852 988 1065 997 930 1013 1000 824 705 833 961 925 832 867 903 779
702 779 654 704 753 705 657 776 837 700 562 594 626 533 440 485 531 409 345 499 652 576 500 594 687 591 436 455 532 442 353 437 521
698 521 468 357 416 533 498 405 486 625 590 498 545 649 637 626 711 796 680 507 558 706 679 593 681 826 803 683 685 744 679 615 705
694 705 891 879 751 757 879 854 713 669 740 768 680 690 758 719 679 771 863 793 608 589 685 630 459 423 503 491 364 369 433 390 289 326
691 326 478 465 335 267 315 258 143 169 311 306 186 123 177 162 32 37 158 215 157 228 356 356 240 216 309 301 179 229 396 389 266 235
687 235 397 427 341 318 411 410 293 273 368 363 242 213 377 409 325 334 535 600 473 351 422 455 373 328 341 321 185 142 215 229 127 160
683 160 309 333 242 237 425 540 462 432 518 511 388 352 509 584 467 353 433 484 420 418 532 574 501 486 586 602 502 488 668 766 672
679 672 626 696 718 623 577 724 846 775 703 825 905 793 685 770 855 825 751 870 974 886 798 903 975 854 791 921 1041 967 899 1023
675A023J75N9JJ17O2j32r2K3L7j55j56L8J80O5o8j1L8j9n6N9Q2l3K4J40Q3l2l3Q3R5k1k6R0
671A640P9j14j18P4J35n7j05J0L0q5j33O0R1j01r6R6R6j9n8J35J28J2J1J28J31o1j97mJ27
668A835J1J2J27J60l2m6O9J31J6l2J61J50m4k06r2o7j83j68K4M8o9j11Q1J03q9j42N0J41K5
664A863p6J17K00Pn1J42K22K9o3N3J51m1j38N6J27J2q0L6J05j1p3M2J13q1k15k3J42K6j03
661B488J1Q2l4j69n3J15%j38q1K7l0r3l4K7q9j93jR7j9j87p2M6p0j19P5J55l8j34N9K44N1
657A923j89j31M0M1r3l4Q7k8j28j2J57M0j33j7R7j8j89p3J17O0p2j4J04M7r2l4J06j0j48l3
653A371Q1l5j80J4J84qk08r1J12N4q0k3J49L2j79o4J37P9r1l3J90J33q3q2R5R5j16j17J3J4
650A363q3q3J13J14r9r8K9K9j05j06J01J01l4l4R6R6p8p7Q3Q2r1r1N4N4j47l0J76J76RJ0J37
$$ plain form
675 1023 1198 1257 1258 1375 1437 1305 1213 1236 1273 1118 962 1000 1180 1245 1177 1166 1204 1185 1129 1188 1270 1237 1261 1401 1484 1452 1419 1502 1597 1576 1550 1640
671 1640 1719 1605 1487 1561 1696 1639 1534 1544 1574 1489 1356 1416 1507 1406 1310 1406 1502 1483 1425 1560 1688 1700 1711 1839 1970 1909 1712 1708 1835
668 1835 1846 1858 1985 2145 2113 2067 2136 2267 2283 2251 2412 2562 2518 2312 2220 2153 1970 1802 1826 1874 1805 1694 1775 1878 1789 1647 1697 1838 1863
664 1863 1787 1904 2104 2111 2060 2202 2424 2453 2390 2443 2594 2553 2415 2471 2598 2610 2530 2566 2671 2660 2587 2629 2742 2661 2446 2423 2565 2591 2488
661 2488 2499 2581 2547 2378 2325 2440 2440 2302 2221 2248 2218 2125 2091 2118 2029 1836 1835 1932 1913 1726 1654 1700 1630 1511 1586 1741 1703 1569 1628 1872 1923
657 1923 1734 1603 1643 1684 1591 1557 1644 1616 1488 1476 1633 1673 1540 1523 1620 1602 1413 1340 1457 1517 1445 1431 1535 1582 1490 1456 1562 1552 1404 1371
653 1371 1452 1417 1237 1251 1435 1427 1219 1128 1240 1294 1214 1191 1340 1372 1193 1129 1266 1345 1254 1221 1411 1544 1461 1379 1474 1569 1453 1336 1349 1363
650 1363 1280 1197 1310 1424 1325 1227 1256 1285 1180 1074 1175 1276 1242 1208 1304 1400 1322 1245 1328 1410 1319 1228 1282 1336 1189 1159 1335 1511 1520 1530 1667
646A667J38j52j52%%n9n8R2R1q2q2J56J56r4r4J08J08o5o5J40J41l3l3Q3Q3r0r1J72J72p9
642B078p8J53J52k0k1J18J18n6n5J06J06j76j76P2J88R1k4R9R8nmK02K03m8m8J11J11o2o2
639C171J68J69nnK12K12%%K49K48M4M3J91L06J01j4J43K59R7R8L17M32K33L9J50K66J38J38
635G400L24M39K34J19K97M13K51K52M44N60M05M06N69O84M80L64O27P42O13M96P74R68P93
632A8654O78Q72J065Q91O99Q23R39Q94Q36R53R52P36N44O65P82M90K20K78K77k7k97k20j62
630C1542m19o89n99m82o52r21q70o77q17j009r02p10p72r65r27q11q49r06p27o11p38q53p01
627A3935n07n46o62m79k85l83m97l77j84k27l43k77j60k82m74l23n3j59l52l82k66k67l82
624F068k59o6j67k84j68n3j45k60j18P4r4k87j79J4m4k36j29O5o6k59j57J12J22p0L6J51p
$$ plain form
646 1667 1805 1653 1501 1501 1501 1442 1384 1476 1567 1485 1403 1559 1715 1621 1527 1635 1743 1678 1613 1753 1894 1861 1828 1911 1994 1904 1813 1985 2157 2078
642 2078 2000 2153 2305 2285 2264 2382 2500 2444 2389 2495 2601 2425 2249 2321 2509 2600 2576 2675 2773 2768 2764 2966 3169 3121 3073 3184 3295 3233 3171
639 3171 3339 3508 3503 3498 3710 3922 3922 3922 4171 4419 4463 4506 4697 5003 5104 5090 5233 5492 5589 5687 6004 6436 6669 6708 6858 7124 7262 7400
635 7400 7724 8163 8397 8516 8813 9226 9477 9729 10173 10733 11138 11544 12113 12797 13277 13641 14268 15010 15623 16119 16893 17861 18654
632 18654 19332 20204 21269 22160 22859 23682 24621 25515 26351 27304 28256 28992 29536 30201 30983 31473 31693 31971 32248 32221 31924 31704 31542
630 31542 31123 30434 29835 29353 28701 27780 26910 26233 25416 24407 23505 22795 22023 21058 20131 19320 18471 17565 16838 16227 15489 14636 13935
627 13935 13428 12882 12220 11741 11456 11073 10576 10199 10015 9788 9445 9168 9008 8726 8252 7929 7876 7717 7365 6983 6717 6450 6068
624 6068 5809 5743 5576 5292 5124 5071 4926 4666 4548 4622 4528 4241 4062 4076 4032 3796 3667 3732 3666 3407 3250 3362 3484 3414 3450 3601 3594
621C594k78j30J39Q2j89q7J83Q2j89k25l3r1k84k21M8J0j83k01O9L0j62j20J49J50j20j21
617A902P1O7j26j68K5P8j15j01J4Mj88j02J69J20k27k41L0J50m3j19P4P3j19j43M9N5j39j52
614H98J18K09J6r2J01J01r2r5R9J95Kl7J55J07j63j85Q5J72k2o2J31J16j54k45n3L4q2j10
611A147Q4J31j38k08j4P2m4j06Q7R6r6j42J29J92p9k31L8J64k9j35N7J54l8j69K4J58l3j46
607I25M8J05q8j36N8J92jj35N9J93Jj16P6K02Q6K0J36J83rj33O0J56l7j95kR8r4k56J3K54
604A663O2j21oL8j54k62p0J00j6j72K2J17Lj07Q7K56O4j29p1K0r6k13k0J53L8q8J05K40M7
600A490k21j04O8m6j99oJ63M7r1K6K08J6j10Q3K47J31j8R7L14J22q3L3J68k5l19k03N4N5j8
596A879R7K11J8j43M9J46m7k55o2K17J02j27j2J62M6j75n9J23o9l09j16J69J12m7P0K85J69
$$ plain form
621 3594 3316 3186 3325 3407 3218 3131 3314 3396 3207 2982 2949 2858 2574 2353 2401 2411 2228 2027 2096 2126 1964 1844 1993 2143 2023 1902
617 1902 1973 2040 1914 1746 1771 1849 1734 1633 1647 1651 1463 1361 1530 1650 1423 1182 1212 1362 1319 1200 1274 1347 1228 1085 1134 1189 1050 898
614 898 1016 1225 1241 1149 1250 1351 1259 1164 1263 1458 1460 1423 1578 1685 1522 1337 1422 1594 1572 1510 1641 1757 1603 1358 1305 1339 1257 1147
611 1147 1231 1362 1224 1016 1002 1074 1030 924 1011 1107 1011 869 998 1190 1111 880 918 1082 1053 918 975 1129 1091 922 946 1104 1071 925
607 925 973 1078 990 854 912 1104 1103 968 1027 1220 1221 1105 1181 1383 1469 1489 1625 1808 1799 1666 1726 1882 1845 1650 1648 1746 1652 1396 1409 1663
604 1663 1725 1604 1598 1636 1482 1220 1150 1250 1234 1062 1084 1201 1204 1097 1184 1440 1504 1375 1304 1324 1228 1015 995 1148 1186 1098 1203 1443 1490
600 1490 1269 1165 1233 1187 988 982 1145 1192 1101 1127 1335 1351 1241 1324 1571 1702 1684 1781 2095 2217 2134 2167 2335 2310 1991 1788 1842 1897 1879
596 1879 1976 2187 2205 2062 2111 2257 2210 1955 1893 2110 2212 2085 2073 2235 2281 2106 2047 2170 2101 1792 1676 1845 1957 1910 1980 2265 2434
593B434j27j1K05J3l03j88J34P6k01k00Qm9k53j38J92J35r7r7J13N5j35k0K66J50j41j42J41
590A820J41p1p0J42J42j06j06J44J44o1o1K29K28K9K8L17L18k2k1J13J13j76j76J52J52j12
587C230j12j6j5k27k27J53K11LJ18M06M06m3l14j61j62l47l48k0k0k41k41K2J38p5p6J05J06
583B253j63j62J27J27j15j14J28J29j46k62K8J43o8o8J94L10M5p0N9O0j86j85O6O5j06j05
580A984J06J06k32k33O1J77m5j60J3J28j43k59nJ87K8K7K45K45P2m5J82J83j22l14j10j09
577A967l17l17J1K04p6j92O4J80r2k07L1L1k10l25O2K56%j93K4K17l6j52J28L20P4j97m7O8
574A276m5j60Q5K01k3k16L0K22O6j27J3J29j17l09J3K06k2k16qK61R8r5J22L14O2j32M2K35
570A905K9j65MJ98n4l24q2K64R6j75l5K36L7k32q8J05k9k22r7J73N0k19q0J90J18p5K1K15
$$ plain form
593 2434 2307 2296 2501 2514 2211 2023 2157 2233 2032 1832 1840 1791 1538 1400 1592 1727 1630 1533 1646 1701 1566 1546 1812 1962 1821 1679 1820
590 1820 1961 1890 1820 1962 2104 1998 1892 2036 2180 2119 2058 2287 2515 2544 2572 2889 3207 3185 3164 3277 3390 3214 3038 3190 3342 3230
587 3230 3118 3102 3087 2860 2633 2786 2997 3000 3118 3524 3930 3887 3573 3412 3250 2903 2555 2535 2515 2274 2033 2055 2193 2118 2042 2147 2253
583 2253 2090 1928 2055 2182 2067 1953 2081 2210 2064 1802 1830 1973 1905 1837 2031 2341 2386 2316 2375 2435 2249 2064 2130 2195 2089 1984
580 1984 2090 2196 1964 1731 1792 1969 1924 1764 1777 1905 1762 1503 1498 1685 1713 1740 1985 2230 2302 2257 2439 2622 2500 2186 2076 1967
577 1967 1650 1333 1344 1548 1472 1280 1344 1524 1432 1225 1256 1287 1077 752 814 1070 1070 877 901 1118 1082 930 1058 1378 1452 1255 1208 1276
574 1276 1231 1071 1156 1357 1334 1118 1148 1370 1436 1309 1322 1451 1334 1025 1038 1244 1222 1006 998 1259 1357 1262 1384 1698 1760 1628 1670 1905
570 1905 1934 1769 1773 1971 1917 1593 1511 1775 1871 1696 1661 1897 1934 1702 1614 1719 1690 1468 1371 1544 1594 1375 1295 1485 1603 1528 1549 1764
567A764L8k32r6J73O9j24P9M26K83J4N2J68m6k38p5J95O7j25M3L14J30j40K4L71K58q9N1L20
563C674K33j13n2K96K43N1J51L44J70j00J6M40L97N0J18M65M29J60J93M63L07L7J28L98K57
560H755r0o1K87K87J8M2L90M31K39L98P45O32K07Q7L57L30O0J85O86R57P64O86Q02P06M35
557A8335L96N90M73k7j75R5L32L31N08P77P73N02M45N61L01j24L6N37P06M36M46P16P06L59
554B8035L39O86Q44P28Q85J386J461J230J160J545J573J340J254J640J765J379J310J540J739
552E1839J623J613J728J548J161J140J679J983J982J924J925J377Q37R46J794K259K144K093
550H1595K093J700N44m94j187j650j882j332m83l30j023j542j156o02m86k57J29K89k51n30
547G3145j44K62M94Q51J545J954J722J337J336J421J421J874K877L923M463N258O262P032
$$ plain form
567 1764 1802 1570 1474 1647 1716 1592 1671 2097 2380 2394 2446 2614 2568 2330 2255 2450 2517 2392 2435 2749 2879 2739 2763 3134 3392 3303 3354 3674
563 3674 3907 3794 3742 4038 4281 4332 4483 4827 4997 4897 4913 5353 5750 5800 5918 6383 6812 6972 7165 7628 7935 7972 8100 8498 8755
560 8755 8665 8604 8891 9178 9196 9238 9628 10059 10298 10696 11441 12073 12280 12367 12724 13054 13114 13299 13985 14942 15706 16392 17194 17900 18335
557 18335 18731 19321 19794 19767 19592 19687 20019 20350 20858 21635 22408 22910 23355 23916 24217 24093 24129 24666 25372 25808 26254 26970 27676 28035
554 28035 28374 29060 29904 30632 31517 32903 34364 35594 36754 38299 39872 41212 42466 44106 45871 47250 48560 50100 51839
552 51839 53462 55075 56803 58351 59512 60652 62331 64314 66296 68220 70145 71522 72359 73305 75099 77358 79502 81595
550 81595 83688 85388 85932 85438 84251 82601 80719 79387 78904 78574 77551 76009 74853 74251 73765 73508 73637 73926 73675 73145
547 73145 73001 73263 73757 74608 76153 78107 79829 81166 82502 83923 85344 87218 90095 94018 98481 103739 110001 117033
545A17033P033O487N331L409J480R30K088L746M903O098P256P078N459L848L000J788j41j798
543A85028k185k077k618l150k918k502k617k890k889k637k404j957j262j530k995m037l651
541A40709k303j300k78J187J966J580P90J021K199L048L390L390K843J840J228J922L715N642
539A72589P619Q776Q212O130M705M705M247J973m33m34J305K500K797L684N500O465N558L669
536B49567K068J490K179L914N359N552M843L802J876j248m126n167m826m942n501n076l588
534B46176k237j182O31L264N308O147O725P995R577J0752J1486J1362J0629J0760J3112J6828
532C67333J8873J7701J4347J1055Q703O953N372L668K550L460O970J1622J5055J6144J4717
531E24523J0954N594J018j76J843M658N863N285L766K726L665P560J3523J9346K3150K4500
$$ plain form
545 117033 124066 130553 135884 139293 140773 141703 143791 147537 152440 158538 165794 172872 178331 182179 185179 186967 186826 185028
543 185028 182843 180766 178148 174998 172080 169578 166961 164071 161182 158545 156141 154184 152922 151392 148397 144360 140709
541 140709 138406 137106 136828 138015 139981 141561 142351 143372 145571 148619 152009 155399 158242 160082 161310 163232 166947 172589
539 172589 180208 188984 197196 203326 208031 212736 216983 218956 218523 218089 219394 221894 224691 228375 233875 240340 245898 249567
536 249567 251635 253125 255304 259218 264577 270129 274972 278774 280650 279402 275276 270109 265283 260341 254840 249764 246176
534 246176 243939 242757 243388 246652 251960 258107 264832 272827 282404 293156 304642 316004 326633 337393 350505 367333
532 367333 386206 403907 418254 429309 438012 444965 450337 454005 456555 460015 466985 478607 493662 509806 524523
531 524523 535477 541071 542089 541913 543756 548414 554277 559562 563328 566054 569719 577279 590802 610148 633298 657798
529F57798K3299K0484J7742J5928J2872N892l957j2326j6166j6667j6797j7067j5849j2494
527F42692r038q613j3150k1364k9193l2857l0830k4313j5771q558n823q176j3169j7682k0527
525C83628k2262k2865k2132k0869j9905j8854j6733j3986j1787j0329q748p494p494q348q348
523A63474o982n248l572j682k9j45k135m180n047m855m050k623j353j160k013k591k393k123
521A11293k127j935j761k340l058k403l95J262J407M44o98j738k307k037j645k224l262l262
519H3214j937q95p10n94l73q74k181k836k221j258m52Q20L500P242J1223J3730J2251N964
517A23613k203p794r569r916j0094r054o642m753m406m213l200k468k771k964k192j460j768
515C8146k039j534j188j660j930j318q17j192j540j194r25j392j584p49r3m25o95j37L64p4
$$ plain form
529 657798 681097 701581 719323 735251 748123 754015 750058 737732 721566 704899 688102 671035 655186 642692
527 642692 633654 625041 611891 590527 561334 528477 497647 473334 457563 449005 443182 435006 421837 404155 383628
525 383628 361366 338501 316369 295500 275595 256741 240008 226022 214235 203906 195158 187664 180170 171822 163474
523 163474 156492 151244 147672 145990 145961 145816 143681 139501 134454 129599 125549 122926 121573 120413 118400 115809 113416 111293
521 111293 109166 107231 105470 103130 100072 97669 97274 98536 99943 100387 99689 97951 95644 93607 91962 89738 86476 83214
519 83214 81277 80382 79672 79078 78705 77831 75650 72814 70593 69335 68883 69703 73203 80445 91668 105398 117649 123613
517 123613 121410 113616 104047 94131 84037 74983 68341 63588 59182 54969 51769 49301 46530 43566 41374 39914 38146
515 38146 36107 34573 33385 31725 29795 28477 27660 26468 24928 23734 22809 21417 19833 19084 18991 18566 17871 17734 18098 18024
512A8024m98o0L65L7l11J98P00M59K65Q52J661J946K524M346P085J0174J2836J2920Q254O0
510H1837o843r540r540r370q714o561m286l538l346k314j196j196j543q15P2k13r45o68q9
507A1192l15q17l30K49l55j164q21j2k00q56n18K15pn86k47M09Q5n70k66L90J09o23l26M07
504E043K24m33k32M24J05o27l51L82J99m57k90L65J19n36l03M29J89o22m51K81K38m18j55
502C123O54M47k86j13O97N18k92k87L69K67l11m1P69O09k00jQ08N01o96r67k34j61q17o41
499C715K46J73n59m30M57M62m26m32L77L77m32m30M57N53l34m11L99M52l58m14L97M45m43
496C841n08L78M22n43o75K13L76l57l69N96P11j76k12R06J220N64P18J836J764m9j341r93
493H322n94r40o29M89P21l97j015l59l6p68r24M1L30m80p43J44N54l33o95J93N58l28o49K39
$$ plain form
512 18024 17526 17466 17831 17868 17557 17755 18455 18914 19179 20031 21692 23638 26162 30508 37593 47767 60603 73523 81777 81837
510 81837 74994 65454 55914 46544 37830 31269 26983 23445 20099 17785 16589 15393 13850 13035 13107 12894 11949 11281 11192
507 11192 10877 10060 9730 9979 9624 8460 7639 7627 7427 6571 6053 6268 6261 5675 5428 5837 5922 5352 5086 5476 5585 4962 4636 5043
504 5043 5267 4834 4602 5026 5131 4504 4153 4535 4734 4277 3987 4352 4471 3935 3632 4061 4250 3628 3177 3458 3696 3278 3123
502 3123 3777 4224 3938 3825 4522 5040 4748 4461 4830 5097 4786 4745 5514 6123 5923 5922 6730 7231 6535 5568 5334 5173 4356 3715
499 3715 3961 4134 3575 3145 3602 4064 3638 3206 3583 3960 3528 3098 3555 4108 3774 3363 3762 4214 3856 3442 3839 4284 3841
496 3841 3333 3711 4133 3590 2915 3128 3504 3147 2778 3374 4085 3909 3697 4603 5823 6387 7105 8941 10705 10656 9315 8322
493 8322 7728 6788 6159 6648 7369 6972 5957 5598 5562 4794 3870 3911 4241 3761 3018 3162 3716 3383 2688 2881 3439 3111 2462 2701
490B701O72j38n57K52O67j42n33M31R03J6n23K09N07l79q97j1N35j99o32J78O79k08o01L63
487C293J101M45J07J071J780J124N58Q28L55j380k202j007k4o79j140r8O53j56p73J14P26
485D696k37r88k3P96r1q57L0P53k11j006m3Q55l3r40n4Q39J05p18R1J003J92p87K3R63J53
482D511p85n1R26J17q27j72P11j00j020j33R51K96o16J94J119J55r77j68R89L34p42O9J206
479E987M73o30J02J201L92q76k21J033L01q96j62J110N31p23j44J013K80r88k56J032K99j075
476G783m20R83M05q73j40J369P90o77j75J252O73o60J51J890J466k62j46P98k42k015j281
474A0669O42M49j058m78J131O30j139p14J039P70o89l4J750J325n42j96J559J136p60m13J376
471A6453R51r84p14J152Q81j038o91J434J320n20k51J665J241j015r57J057Q65j212r41J376
$$ plain form
490 2701 3373 3235 2678 2930 3597 3455 2922 3353 4256 4272 3749 3958 4465 4086 3189 3178 3713 3514 2882 3060 3739 3531 2930 3293
487 3293 4394 4839 4946 6017 7797 8921 9479 10307 10662 9282 7080 6073 6049 5370 4230 4132 4785 4629 3856 3970 4696
485 4696 4459 3471 3448 4244 4153 3296 3326 4079 3868 2862 2819 3674 3641 2701 2647 3486 3591 2873 2964 3967 4159 3372 3395 4358 4511
482 4511 3726 3675 4601 4718 3891 3719 4430 4330 3310 3177 4128 4424 3808 4002 5121 5276 4299 4131 5120 5454 4712 4781 5987
479 5987 6460 5830 5932 7133 7525 6649 6428 7461 7762 6866 6704 7814 8345 7622 7478 8491 8771 7783 7527 8559 8858 7783
476 7783 7363 8346 8751 7878 7738 9107 9897 9220 9045 10297 10970 10310 10461 12351 13817 13555 13409 14207 13965 11950 10669
474 10669 11311 11760 10702 10224 11355 11985 10846 10132 11171 11941 11252 11218 12968 14293 13751 13555 15114 16250 15490 15077 16453
471 16453 17404 16420 15706 16858 17739 16701 16010 17444 18764 18244 17993 19658 20899 19884 18927 19984 20849 19637 18696 20072
469B0072J319r04r04J332J332p08l60K153K270m1l88J397Q19j866j807R80J558n81n81J802
466B6894J687j092j285J375J721p87q45J990K260m69p39K153K654j22m69K375K722k86o34
464C9103K583L083k42j129J841K342q50j427J859K593n53j055K671L713L07m25L218M183O02
461F2417k08L532M189k52j678K448M183P46R1M671O097J727L01M981O794K446P12M857N667
459A13721L73n13O260R461M677L173R653J2776P565N676J2270J5394R905Q942J8284K4185
457B61802K0688K2345L4875M1701L5859L4972M6441N0798L9609L4943M8841O1684O5837Q7472
455H87867J37160J87025K32921L23590M89862P12657J006625J418238J820487J816514J076034
454A0108980k02388j345039j807559j622486j202231q54281o14284m29576l02269k39243k01333
$$ plain form
469 20072 21391 20487 19583 20915 22247 21539 21179 23332 25602 25561 25173 26570 27389 25523 23716 24696 26254 25673 25092 26894
466 26894 28581 27489 26204 27579 29300 28513 27668 29658 31918 31449 30710 32863 35517 35395 34926 37301 40023 39737 39103
464 39103 41686 44769 44527 43398 45239 47581 46731 45304 47163 49756 49203 48148 50819 54532 54839 54414 57632 61815 62417
461 62417 62209 65741 69930 69678 68000 70448 74631 75377 75468 80139 86236 87963 88264 93245 100039 102485 103197 108054 113721
459 113721 114094 113581 119841 129302 133979 137152 146805 159581 167146 172822 185092 200486 210391 219333 237617 261802
457 261802 282490 304835 339710 381411 417270 452242 498683 549481 589090 624033 672874 734558 800395 887867
455 887867 1025027 1212052 1444973 1768563 2258425 2971082 3977707 5395945 7216432 9032946 10108980
454 10108980 9906592 8561553 6753994 5131508 3929277 3074996 2460712 2031136 1728867 1489624 1288291
453A288291j56400j17178r7790q2787n9575m1874m1357m7567m8044m4844m1873l6282k8332
451D44388k3512k1400j6888j0437n925k145L755R342J3084J8636K6158K9733K9850L3624L9062
449E67325L6367K9078L1922M5150N6344O9957J02753J49456J94297K56734L77518N63136Q07915
448C287952J152656J587116J857965J549904N30954p54897j617269j748358j406471j009213
447C430339p28568n21198l57253k63278k24211j85007j35372j06120r6902p7468m8428l8868
445F47666n0477n6598n0004m7120m9705m3565l0878k7623l1672k7067j5303j2089j6832j5217
443A73516p310o203j1408j0255l275k740q486q953m133m413r079p575r03p8n054n143r1M83
441G8900l798l696J047J260l330l674P61J348k777l536k6j7l989m080M6P79k808l168M19Q81
$$ plain form
453 1288291 1131891 1014713 916923 834136 774561 732687 691330 643763 595719 550875 509002 472720 444388
451 444388 420876 399476 382588 372151 366226 364081 367836 377178 390262 408898 435056 464789 494639 528263 567325
449 567325 603692 632770 664692 709842 766186 836143 938896 1088352 1282649 1539383 1916901 2480037 3287952
448 3287952 4440608 6027724 7885689 9435593 9966547 9211650 7594381 5846023 4439552 3430339
447 3430339 2701771 2180573 1823320 1560042 1335831 1150824 1015452 909332 812430 734962 686534 647666
445 647666 597189 540591 490587 443467 393762 350197 319319 291696 260024 232957 217654 205565 188733 173516
443 173516 166206 160003 148595 138340 135065 132325 123839 114886 110753 106340 97261 89686 88783 88705 83651 78508 78417 78900
441 78900 75102 71406 72453 73713 70383 66709 67470 68818 66041 62505 62479 62462 58473 54393 54439 55218 52410 49242 49661 50542
439E0542k628l171J85O77k756l217L70J407j409j753J448K146o69r27K041K182j636k912k50
436C9670N88j996k607K09Q88j927k751r1R03j372j793R47J915m38j090J339J845j125k467
434C0647k70P04j416k299k4Q83j316k242m4R87r79j907N9R37j107k032J2J096o39j357P64
431B0457J781k63j443K92J406m07j554K7R38p21j599K13J269l89j383L53J438j44j259L21
429A9333J262l97j638k11Q11o16j576Q3J388J94p81P24J678j35j689o47N05o91j737m64P46
426A6142l73j410j38J068n1j181o3J041j54j372k53Q75j67j232j13J101O0j005J14J314J96
424A4399j058k47Q17j46j281k40Q93p2j242k79R99J89r73q5J085J99j137m04Q06P3j067k57
421A0972J026K92j004l48P55K3j133m00Q44K66q19q7J052K41j114o13O69J68r41k85R58L80
$$ plain form
439 50542 47914 44743 44928 45605 42849 39632 40002 41409 40000 38247 39695 41841 41172 40245 42286 44468 42832 39920 39670
436 39670 40258 38262 35655 35864 36752 34825 32074 31983 32886 31514 29721 30668 32583 32145 31055 32394 34239 33114 30647
434 30647 30377 31081 29665 27366 27342 28225 26909 24667 24623 25610 24631 22724 22783 23720 22613 20581 20593 21689 21050 19693 20457
431 20457 22238 21975 20532 20824 22230 21823 20269 20296 21234 20513 18914 19127 20396 20007 18624 18977 20415 20271 19012 19333
429 19333 20595 20198 18560 18349 19160 18544 16968 17051 18439 18633 17852 18576 20254 20119 18430 17783 18288 17597 15860 15396 16142
426 16142 15769 14359 14221 15289 15238 14057 13994 15035 14881 13509 13256 14131 13964 12732 12619 13720 13780 12775 12889 14203 14399
424 14399 13341 13094 13911 13765 12484 12244 13137 13065 11823 11544 12543 12732 11759 11674 12759 12958 11821 11417 12223 12296 11229 10972
421 10972 11998 12290 11286 10938 11693 11716 10583 10183 11027 11293 10474 10387 11439 11680 10566 9953 10622 10790 9849 9564 10522 10902
419A0902r47n23O48K25q82l81P23K22q60l58Q46M23p81l56Q50M24q41n72N65K19q27m81O58
416H896L10p94m46O57L10q32m08Q36N65n77k31J001P31n01n01O25L55q23p08M63L48o43m50
413H183O88N72n21l28R55J070M56J343L225L225J085p28j318k051k859k203n88j64q66o74
410H502L82L83o23o23M37M38m67m67N55N55n66n65L79L79p11p11L23M39n61n62M42N56l49
408G565l49P58Q73k41m33M99M99m98o90L19N12n25p17L45O93pqJ430K239J943J943K123P74
405A9047j822k940j937j127j513j398j87L14m44p15J63N10l44o13K93O40k42n12L84P31j99
402H089o23J68N91k26n74K99O46j96n42K48N96k57o04K54O79j20n43K13O38j51m98L60P85
399I232j63o64J31N56k58o83K14P16q3n83K02P80Jn01K81Q59P8n78J45O47q1o60Q3P38K5n53
$$ plain form
419 10902 9955 9432 10080 10305 9423 9042 9765 9987 9127 8769 9615 10038 9257 8901 9751 10175 9334 8762 9327 9546 8719 8238 8896
416 8896 9206 8412 7966 8623 8933 8101 7693 8529 9094 8517 8286 9287 10018 9517 9016 9641 9996 9173 8465 8928 9276 8633 8183
413 8183 8871 9443 8922 8594 9549 10619 11075 12418 15643 18868 19953 19225 17907 15856 12997 10794 10206 10042 9176 8502
410 8502 8884 9267 8644 8021 8458 8896 8429 7962 8517 9072 8506 7941 8320 8699 7988 7277 7600 8039 7478 6916 7358 7914 7565
408 7565 7216 7974 8847 8606 8173 8672 9171 8673 7983 8302 8814 8289 7572 7917 8610 8603 8595 10025 12264 14207 16150 18273 19047
405 19047 17225 14285 12348 11221 9708 8310 8123 8437 7993 7278 7441 7951 7607 6994 7287 7927 7685 7173 7557 8288 8089
402 8089 7466 7634 8225 7999 7425 7724 8370 8174 7632 7880 8476 8219 7615 7869 8548 8428 7885 8098 8736 8585 8087 8447 9232
399 9232 9069 8405 8536 9092 8834 8151 8365 9081 8998 8415 8617 9397 9398 8897 9178 10037 10115 9537 9682 10329 10248 9588 9671 10409 10434 9881
396I881J21P77J13m66K43R76M12j67L35P58l1o11J28P82J85l93L44J077L74l59K82R37K97
393A5995m36R4P50K57l20L01J034M92k41K55R11M00j78M57J345J039O92J728L155L545L968
391C5243N776P589P404N359K776n80m581p165o731n073m328l903k458r53r21j267n06M58J55
389B6294n78m8P62K60m73Q2R68O29j04M94J458J128M73J066K029J702R69J408K141J475M33
386D2568R59K078J966J388K121L470L430K774L247M133L662L005M148O269P231P886J0277
384A10612J3401J4533J3416J2012J0509Q501Q385J3587K3498L5081M6611N6716O0457N2223
382D79542L2593Q129j4125k9695l5751l2732k5984k0780j7117j2498q218p296q416p716n518
380B94418n026n991n649m222m612o117n494l528l783n596n369l172k636l369j672K069M018
$$ plain form
396 9881 10002 10779 10892 10426 10669 11645 12057 11890 12225 12983 12952 12341 12469 13251 13436 13043 13387 14464 14838 14479 14761 15698 15995
393 15995 15559 15653 16403 16660 16340 16641 17675 18167 17926 18181 19092 19492 19314 19771 21116 22155 22847 24575 27730 31275 35243
391 35243 41019 48608 56012 61371 64147 63567 58986 51821 45090 40017 35689 31786 29328 28375 27454 26187 25681 26139 26294
389 26294 25716 25668 26430 26690 26217 26299 27267 27896 27792 28286 29744 30872 31345 32411 34440 36142 37111 38519 40660 42135 42568
386 42568 43527 45605 47571 48959 51080 54550 57980 60754 64001 68134 71796 74801 78949 85218 92449 100335 110612
384 110612 124013 138546 151962 163974 174483 182984 191369 204956 228454 263535 310146 366862 427319 479542
382 479542 512135 520264 506139 476444 440693 407961 381977 361197 344080 331582 323364 316068 307652 299936 294418
380 294418 289392 283401 277752 273530 268918 262801 257307 253779 249996 244400 239031 235859 233223 229854 228182 230251 234269
378B34269L902M900O481M996J719J496L772L965K460L734P088P899Q400J4893K5113L1796
376C66883L8467N5668Q2471J11511J51736K15658K71464K43993R7249j00729k32817k47855
375A053699j93131j38343j05291q0337n8471m7368m5709m2468l4485k7533k3561j8911j3088
373B25003r381q109o519m862n541p663q067o794o202o395n637m365m269m692l565j290L2L78
371A32062J293K950M129M631M954M955M147L800N107P382R560J2068J5886K0399K4188K7311
369B84822L0992L6584M5059N5048O0659N3525L0463j663l1200n1138o1161o3436n9735n1906
367B76913m2539l3630k6046k0376j6977j4933j2959j0684q828p478o214m864l818k930j998
366F2639j343j374j875k264k264k098j906j420j150j475k209k666k666k298j950j665j472
$$ plain form
378 234269 238171 243071 249552 254548 256267 257763 261535 265500 267960 271694 278782 286681 295081 309974 335087 366883
376 366883 405350 461018 543489 655000 806736 1022394 1293858 1537851 1635100 1534371 1301554 1053699
375 1053699 860568 722225 616934 536597 478126 430758 385049 342581 308096 280563 257002 238091 225003
373 225003 215622 207513 200994 196132 190591 182928 174861 168067 161865 155470 149833 145468 141199 136507 132942 131652 131684 132062
371 132062 133355 136305 140434 145065 150019 154974 159121 162921 168028 175410 184970 197038 212924 233323 257511 284822
369 284822 315814 352398 397457 452505 513164 566689 597152 595489 564289 513151 451990 388554 328819 276913
367 276913 234374 200744 174698 154322 137345 122412 109453 98769 89941 82463 76249 71385 67567 64637 62639
366 62639 61296 59922 58047 55783 53519 51421 49515 48095 46945 45470 43261 40595 37929 35631 33681 32016 30544
364C0544j395j279r59o88n71n71k91r9L9J54K90J9n49j051j096r03q24q23n83m67n89n90m73
361A7245m73n31n30l76l75l75l75k71k71l94k78k4k4l06l05j26j26k15k14M1J58R2R3L28L28
358A2696J93J93L39L39Rk61k16k15m66m66j87Q4J46M16Q56Q57L00n11q93j009r56p63m26k32
355I827k64k63n0O7r5r5J20J20j05k20j14j13k18k18q8q8k54k54l0Q5j14j15M8M7j69k85j30
351G032j3q6q7J14J14l3j49J4J4j98j98NJ21m9j65M5J03j09j68N2J67q0j95k9Q6j25k41m8
348E894O9o7j82K7J43l1j46M1J56n6j71J4J30j21k37l2Q4q6k00j2J81J38K2J46K61J6j78n8
345E745N8j55k70q4J09o4j81n5J38Qj85l1J62n0k43o2J30K5r1QJ24jj95pJ85Q9j04K7K20J81
341E431O6J77M48M62M62N89N89R3m86o00m85n04o19m10j39j24j82n2O5n8k51q8J04M7j47m9
$$ plain form
364 30544 29149 27870 26911 26223 25652 25081 24790 24691 24730 24884 25174 25193 24644 23593 22497 21594 20770 19947 19364 18897 18308 17718 17245
361 17245 16772 16241 15711 15335 14960 14585 14210 13939 13668 13274 12996 12972 12948 12642 12337 12211 12085 11870 11656 11697 11855 11947 12040 12368 12696
358 12696 12889 13082 13421 13760 13769 13508 13292 13077 12611 12145 11958 12042 12188 12604 13460 14317 14617 14106 13213 12204 11248 10485 10059 9827
355 9827 9563 9300 9250 9317 9222 9127 9247 9367 9262 9042 8928 8815 8597 8379 8291 8203 7949 7695 7665 7750 7636 7521 7569 7616 7447 7162 7032
351 7032 7019 6933 6846 6960 7074 7041 6892 6906 6920 6722 6524 6529 6650 6601 6436 6481 6584 6475 6307 6359 6526 6446 6251 6222 6308 6183 5942 5894
348 5894 5963 5896 5714 5741 5884 5853 5707 5748 5904 5848 5677 5691 5821 5700 5463 5431 5515 5429 5229 5217 5398 5536 5558 5704 5965 5981 5803 5745
345 5745 5803 5648 5378 5294 5403 5339 5158 5103 5241 5249 5064 5033 5195 5145 4902 4840 4970 4995 4904 4912 5036 5035 4840 4833 5018 5107 5003 5030 5250 5431
341 5431 5497 5674 6122 6584 7046 7635 8224 8317 7831 7231 6746 6242 5623 5213 5074 4950 4768 4716 4781 4723 4472 4384 4488 4535 4388 4339
338D339J44Rj83j18P5K7q9j8R8p1j86k1J73M7j46p0K01J52m1k5R1%j93p1J23qk00q1J89J51
334D298m2L0L00L30K72M52Q75J145J260J371J023J03r38j344j228j035r19o10k63k33l50k07
331D290O2K4j69q3J09k1k13j47J23K3j71j05Q9Q8j04r3J00Mj90j04Q8Q8j05n4J39Q2j12j13
328C525Q0Q1j13j06Q6Q7j06p6J17J21p1o1K08K23J07J81M51N34M18M39M97J59m20o59m66l49
325D887m07l38o9m6k38k16k3j8k11j21J49J63k9q6J06R7j72j81Q9J37n6j14P8P8j14j52M1
321C234J32J7l0J62J19j50j17J54K45N3k5K45L71K55K86M78L92M5j32j5l1l00l40p0N5j38
318D895k39m6N5j37k66LR6r7j97lJ32o2j99oQ5l0j75J7J19p4j78J4J11q2j73J9J49L4j11Q3
315C737J83rj35N8J88P3l1J62L02J86R2L62O10O11Q34J489J931J430L11q08j400j593j295
$$ plain form
338 4339 4483 4492 4309 4191 4266 4293 4204 4186 4284 4213 4027 4006 4179 4226 4080 4010 4211 4363 4322 4297 4388 4388 4195 4124 4247 4239 4039 3958 4147 4298
334 4298 4256 4286 4586 4916 5188 5640 6515 7660 8920 10291 11314 11417 10479 9135 7907 6872 5953 5343 5080 4847 4497 4290
331 4290 4352 4376 4207 4124 4233 4212 3999 3852 3975 3998 3827 3722 3811 3899 3795 3702 3802 3806 3616 3512 3600 3688 3583 3529 3668 3750 3638 3525
328 3525 3605 3686 3573 3467 3553 3640 3534 3458 3575 3696 3625 3564 3772 3995 4102 4283 4734 5268 5686 6125 6622 6781 6361 5702 5236 4887
325 4887 4480 4142 4073 4027 3789 3573 3550 3532 3321 3200 3349 3512 3483 3397 3503 3600 3428 3247 3336 3473 3417 3303 3381 3459 3345 3193 3234
321 3234 3366 3383 3353 3515 3634 3484 3367 3521 3766 3819 3794 4039 4410 4665 4951 5429 5821 5866 5734 5719 5688 5388 5048 4978 5033 4895
318 4895 4656 4610 4665 4528 4262 4265 4361 4264 4067 4064 4196 4134 3935 3929 4014 3984 3809 3826 3945 3871 3693 3707 3818 3736 3563 3582 3731 3765 3654 3737
315 3737 3920 3911 3776 3834 4022 4095 4064 4226 4528 4714 4806 5168 5778 6389 7223 8712 10643 12073 12384 11576 10176 8583 7288
312G288p92m78m77m91k99j18k34l10j17j1k03k79qJ55l7k05q8R0j03k31l8J64M9j65m9J64
309C177M7j60m4J30J3j16jJ34J9j31j5J32J32KJ18K27L4j31j4K48K48J66L59N27M12L10L10
305F133K91j33n99n99m02m02m71k79n2n2k80j64K9K8j75o0J21Nj67n2J70J11j18j19Q2K4j77
302B693o0J47R0j15n7J40K3j79j22P8J9j68j11J33J33j41j41J19J19r0q9P4P4q2q3J20J20
299B644j21j22J01J00r3r4R0R0q1q0J03J03j93j93R1K07m5j61K6J42K4l5J50J50k8k8J15J73
295C035L5q0O5J80K6l2N6N6j32j33k6k7q5q6j8j8j22j22O1O1j63j63L9M0j27j27P6P5q8q8
292B168P5P6j8j8O9P0j21j20M4M4j38j37Q5Q4n3n3J30J31o8o9N8N7r2r2R1R1j22j21M2R9n7
288B135j73PJ22m4j60j2J04oo4L1Q8o0o0Q7J45m7j62j8R8m5j03O2J19k2j38M2J58Nj11L4J50
$$ plain form
312 7288 6496 6018 5541 5050 4751 4633 4399 4089 3972 3961 3758 3479 3471 3626 3589 3384 3296 3386 3283 3052 3014 3178 3227 3062 3013 3177
309 3177 3224 3064 3020 3150 3163 3047 3046 3180 3199 3068 3053 3185 3317 3319 3437 3664 3698 3567 3553 3801 4049 4215 4574 5101 5513 5823 6133
305 6133 6424 6291 5692 5093 4691 4289 3818 3539 3487 3435 3155 2991 3020 3048 2873 2813 2934 2939 2772 2720 2890 3001 2883 2764 2846 2870 2693
302 2693 2633 2780 2870 2755 2698 2838 2861 2682 2560 2638 2657 2489 2378 2511 2644 2503 2362 2481 2600 2510 2421 2495 2569 2487 2404 2524 2644
299 2644 2523 2401 2502 2602 2509 2415 2505 2595 2514 2434 2537 2640 2447 2254 2345 2552 2507 2346 2372 2514 2538 2503 2653 2803 2775 2747 2862 3035
295 3035 3070 2990 3055 3235 3261 3229 3285 3341 3209 3076 3050 3023 2938 2852 2834 2816 2694 2572 2633 2694 2531 2368 2407 2447 2320 2193 2269 2344 2256 2168
292 2168 2243 2319 2301 2283 2352 2422 2301 2181 2225 2269 2131 1994 2079 2163 2110 2057 2187 2318 2250 2181 2239 2296 2204 2112 2203 2294 2172 2051 2093 2192 2135
288 2135 1962 1969 2091 2047 1887 1875 1979 1973 1909 1940 2028 1968 1908 1995 2140 2093 1931 1913 2011 1966 1863 1925 2044 2022 1884 1926 2084 2089 1978 2012 2162
284B162n3j69m3P2Qj08N1J67K0j73k4R2K7q8J8J33J5j00OJ21k4j39NJ21m9j65k5J68L5q0k7
280A954Q9J1j04j7R8n4j69J3J30oj21m0J54N3o2J0J26J5j01m9O7J3m4O3J78%j93q2L4l3j49
276A784j3J79K7j66j03J67J15p8p3M3M7o8k0R5L3q2l5Q1K6r0o1N5J0j05L5J50O9j23r5R8O3
273A965n3m8O8Qj08j2J81Q1j13o4N2J3j02r2J00P3j21p2M4R2k4k9Q8K0j72q0J12R2j01j01
269A697R2P4j18p0M5P4m1m6O9R1j01n9N7L7p9p9L7k7j43n6J37J61l2l2J61J87on8N7qk01j48
265A672M5Q8j06j01R2R5k1p5M2N8n8n8N8Q8k7k8Q8J03j2j8R9K8j64j12Q2J14p8j37N7P4j18
261A770j18P4J32o2j19P4J40n3j50M4J15p8j26j0Q7k8j21nN9Jl1Q5O5n0j08PN4o2n2J41J34
257A809n8j11MQ1j11j17P7J45m7j35j8Q7k9j30O3J66M9m8J0O3n2j14JQ3l3q2J11J74j8j44
$$ plain form
284 2162 2109 1940 1897 1969 1977 1869 1920 2087 2107 1934 1910 2002 2029 1941 1959 2092 2107 2007 2013 2134 2110 1971 1976 2097 2048 1883 1858 2026 2061 1981 1954
280 1954 2043 2054 1950 1933 2031 1977 1808 1821 1951 1945 1824 1784 1938 1991 1929 1939 2065 2080 1979 1930 1997 2010 1966 2029 2207 2207 2014 1932 1966 1933 1784
276 1784 1771 1950 1977 1811 1708 1875 1990 1912 1839 1882 1929 1861 1841 1936 1969 1887 1852 1933 1959 1869 1808 1863 1873 1768 1803 1953 2022 1899 1804 1902 1965
273 1965 1912 1864 1932 1940 1832 1820 2001 2082 1969 1905 1957 1970 1868 1776 1876 1949 1828 1756 1800 1892 1868 1839 1927 1947 1775 1695 1807 1899 1798 1697
269 1697 1789 1863 1745 1675 1720 1794 1753 1707 1776 1867 1766 1707 1764 1801 1722 1643 1680 1653 1510 1454 1591 1752 1720 1688 1849 2036 2030 1972 2029 2021 1820 1672
265 1672 1717 1805 1699 1598 1690 1785 1764 1689 1731 1789 1731 1673 1731 1819 1792 1764 1852 1955 1943 1925 2024 2052 1888 1776 1858 1972 1894 1757 1814 1888 1770
261 1770 1652 1726 1858 1796 1677 1751 1891 1838 1688 1732 1847 1769 1643 1633 1720 1692 1571 1566 1625 1626 1595 1680 1745 1695 1587 1594 1648 1586 1534 1675 1809
257 1809 1751 1640 1644 1725 1614 1497 1574 1719 1672 1537 1519 1606 1577 1447 1510 1676 1725 1677 1687 1750 1698 1584 1585 1668 1635 1553 1664 1838 1820 1676
254A676k9J08qj43k7J20Nj31j5J06j0j06RJ21Mj31j4J33J8q5k7R7j8j21o3%n7r3K2J32J6m6
250A443O9J72k0j81o6M2M2k7Q8J20p2k07j5J97Q0r4l6J37K2j20o2J07M9j22o3M7M8m6m5Q8
246A575Q8m7m7J07J07j43j44M9M8j0j0O8O7k9k8M8M9q6q7N4N3m2m3O7O8o8o7J9J9l8l9R3R4
242A745m9n0Q0l5j42q4Q1K3p4j5R0L3o0kP9P8r2l4J57M1j41j40Q7Q6m8m8R6R7p7p8N8N7l9
238A680l9L0L1o6o5O5O6j46j46P7P7n8n9L5L4L4L4J51J51r9j00m0m0j74j75O4O3OOR6R5j17
234A471j16J26J27q6q5L0L0o7o6Q8Q7j24j24O9P0k7k6J08J08j09k24PJ22j2j29j5J01O1LM2
231A440M2r5j53L7J53N7n9mN5m3m2R0R1m4m4L9M0n7n8K3K2j44j44O4J79J2j03QJ24K3r2J0
227A427O7l2r1L4R1m5j62J1J26O5n0RO8l3r1rM8n0j66rJ08M5o9PO5Ln4J9P7m9m8Q8K03M3j51
$$ plain form
254 1676 1647 1755 1747 1604 1577 1697 1702 1571 1556 1662 1652 1546 1555 1676 1680 1549 1535 1668 1686 1601 1574 1671 1653 1532 1469 1469 1412 1319 1341 1473 1489 1443
250 1443 1512 1684 1664 1483 1417 1459 1501 1474 1562 1682 1610 1403 1388 1585 1665 1571 1535 1672 1694 1574 1512 1619 1668 1546 1483 1530 1578 1532 1487 1575
246 1575 1663 1616 1569 1676 1783 1640 1496 1545 1593 1583 1573 1641 1708 1679 1651 1699 1748 1662 1575 1629 1682 1640 1597 1664 1732 1664 1597 1616 1635 1597 1558 1651 1745
242 1745 1696 1646 1726 1691 1549 1465 1546 1569 1495 1480 1570 1603 1543 1541 1620 1698 1606 1572 1729 1770 1629 1489 1576 1662 1614 1566 1662 1759 1682 1604 1662 1719 1680
238 1680 1641 1671 1702 1636 1571 1636 1702 1556 1410 1487 1564 1506 1447 1482 1516 1550 1584 1735 1886 1787 1687 1647 1607 1433 1258 1322 1385 1391 1397 1493 1588 1471
234 1471 1355 1481 1608 1522 1437 1467 1497 1430 1364 1452 1539 1415 1291 1360 1430 1403 1377 1485 1593 1484 1260 1267 1389 1377 1248 1233 1334 1395 1398 1440
231 1440 1482 1387 1234 1271 1424 1481 1422 1418 1473 1430 1388 1478 1569 1525 1481 1520 1560 1503 1445 1468 1490 1346 1202 1266 1445 1457 1354 1362 1486 1509 1417 1427
227 1427 1494 1462 1371 1405 1496 1451 1289 1300 1426 1491 1441 1450 1518 1485 1394 1385 1433 1383 1217 1208 1316 1361 1292 1299 1364 1367 1313 1332 1409 1360 1312 1400 1603 1646 1495
222A495j12Ll3r2N2J68kj18m1P5P1m4pN0m5j04k2R4l1r0M3J58P1j23l2Q4K6j67p7M0Kn6K2
218A258J38M5p0l7P8P8l7k3R3lj20q0L4Ln6L2J48K2j72o3N3M8o8k5R0L2q4j9R7L8p7oJ10N7
214A514j36n2O4N6o0n0Pj8j33j2J04N6j37o9J24P7m0j7R9Pj08r0J02N9n6j10POj10J0J26J11
210A331q2n4O1N6n9l3Q3Q3l3l1Q5K6q9q1L5M0p6r7R6R6r7j15%N9n7n6J37J37n5o1N5N1o6q4
206A205L2J24Rp5j8j8p5j9R7R1j02j59L5Q2l3r4K2J54L7j4M4P6m0o3N2N2o3r6K0P7l8m6P0
202A326P0m5j15KN9n7j08PL3k5k6Q9L5q0r3K3Q1l5p8L8J34J8o0N5J14lp9L6R5k2j36k0P6m0
198A269j02J3J03j3j09j09K2K3L6R3P6m0j27j2Q8L0q3k4P5J8n8N7J15%j04m6M7j2m2J6J07
194A307j0r1l4N6kRRRRm4J4M2n5p2K3Q2j5r3MR7Jj22o4L3L2j7j7P9K2k4P3R4m0j39q0N6N6
$$ plain form
222 1495 1383 1386 1353 1261 1313 1481 1479 1361 1320 1395 1466 1422 1415 1465 1420 1316 1294 1388 1357 1267 1310 1468 1539 1416 1384 1468 1494 1327 1250 1290 1292 1236 1258
218 1258 1396 1441 1371 1334 1412 1490 1453 1430 1523 1520 1400 1320 1354 1357 1301 1333 1481 1503 1331 1268 1321 1369 1301 1276 1366 1398 1314 1295 1392 1430 1353 1347 1457 1514
214 1514 1378 1326 1390 1446 1386 1336 1343 1325 1192 1180 1284 1340 1203 1134 1258 1335 1295 1278 1377 1384 1276 1186 1288 1347 1291 1181 1188 1194 1084 1094 1220 1331
210 1331 1249 1195 1256 1312 1253 1220 1303 1386 1353 1322 1407 1433 1344 1263 1298 1338 1262 1165 1261 1357 1260 1145 1145 1204 1147 1091 1228 1365 1310 1249 1304 1355 1289 1205
206 1205 1237 1361 1370 1295 1277 1259 1184 1165 1262 1353 1251 1092 1127 1209 1176 1082 1104 1258 1295 1281 1325 1401 1361 1298 1350 1402 1339 1243 1263 1340 1302 1256 1326
202 1326 1396 1351 1236 1238 1297 1240 1132 1139 1172 1147 1121 1210 1245 1165 1072 1095 1176 1141 1063 1101 1235 1253 1193 1248 1362 1359 1280 1316 1411 1389 1253 1233 1309 1269
198 1269 1167 1180 1283 1270 1161 1052 1074 1097 1133 1226 1302 1262 1135 1123 1211 1241 1158 1134 1209 1227 1169 1226 1341 1341 1237 1191 1238 1226 1184 1200 1307
194 1307 1297 1206 1172 1228 1226 1235 1244 1253 1262 1218 1232 1274 1219 1147 1170 1252 1237 1144 1148 1245 1246 1124 1060 1093 1125 1108 1091 1170 1192 1168 1241 1335 1295 1156 1076 1132 1188
190A188j9L9O7k9m8M9J04Qj08n1M7j2j37m1J14J13LLO1l6j17o0P3J5r0l1O5Po3mJ13J7j29
186A111p1O3Or7jJ12N4j04m6R2R2p9p8N7N6klR7R8p1j4J08J2j69j11O3O2j00j00L5L4p7p8
182I51N8N7l7l6N9O0k7k7L0L1o4o3P1P2l1l0J04J05j01j00L1L0r4j53jR6J1J1J44J45J6j00
178A218r2l5k8L0R2L3r1r1M0M1k5k5P1P2r1r1M4M3j8j9L9L9m0l9N7N7o8o8j1j0n5n6J18J18
173A159mlmml1l2O5O4p6p6R0R0r8k14m4P2M4j4N4N5J6J7P5P4q2q2N2J10Oj08m4J4l4l3J01
169A175J01n5j13K1J36L9p6j1M6o4j22k2R2K5r1n1Oj1j1Q5Q5p0j27M5J61J4j02m0P5Qn0J1
165A109O9m2j00lN4m2r9mN5m7j05oJ09Q1l4O0N9j9j35pJ09M2p4j6J00J2j03oJ09N9n7k9Q8
161A187J9r6o4N2K6l3K6Q3J2j03m9O6M7o8m0P7L2q2n4O1L4q3j04J2J%K6Q4M4p2j8R8M9o6l8
$$ plain form
190 1188 1169 1208 1275 1246 1198 1247 1351 1359 1251 1200 1247 1235 1098 1057 1171 1284 1287 1290 1351 1315 1198 1138 1211 1226 1136 1105 1170 1177 1114 1110 1223 1240 1111
186 1111 1040 1103 1109 1012 1011 1123 1177 1073 1027 1119 1211 1132 1054 1111 1167 1165 1162 1259 1357 1286 1272 1380 1392 1223 1112 1175 1237 1137 1037 1072 1106 1029 951
182 951 1009 1066 1029 993 1052 1112 1085 1058 1088 1119 1055 992 1063 1135 1104 1074 1178 1283 1182 1082 1113 1143 1049 896 895 991 1002 1013 1157 1302 1318 1218
178 1218 1126 1091 1063 1093 1185 1218 1127 1036 1076 1117 1092 1067 1138 1210 1119 1028 1072 1115 1097 1078 1117 1156 1116 1077 1134 1191 1123 1055 1044 1034 979 923 1041 1159
173 1159 1155 1152 1148 1144 1113 1081 1146 1210 1134 1058 1148 1238 1140 926 882 954 998 984 1038 1093 1109 1126 1201 1275 1193 1111 1163 1273 1279 1171 1127 1141 1107 1074 1175
169 1175 1276 1221 1108 1129 1265 1304 1228 1217 1263 1199 1077 1055 1147 1172 1081 1030 1036 1025 1014 1099 1184 1114 987 1032 1193 1207 1105 1065 1140 1148 1098 1109
165 1109 1178 1136 1036 1033 1087 1045 946 942 997 950 845 839 948 1029 995 1055 1114 1095 960 953 1062 1104 1030 1014 1114 1126 1023 1017 1126 1185 1128 1099 1187
161 1187 1206 1110 1046 1098 1124 1091 1117 1200 1212 1109 1060 1126 1173 1105 1065 1142 1174 1092 1038 1099 1133 1050 946 958 959 959 985 1069 1113 1041 1023 1121 1170 1104 1066
157A066P8N5o2o1N5K4r1l4Q3L7p9m6P0Jn8JN9l9j54j05Q8J04j2pJ08M6p0p0M6K3r2p9J15J13
153A113ln6N9P6m1l3K5K3l5l8J9K0r5m1P4Q0l5o0N5L7k0m6J2%n8l7P9O9m7j8R7N9n7j12Nj1
148A059o8m3P3P4m1r2K4L3L3L0Q7J8r8j02J4O9m6k3R4J03q9j04J2R5k0j13LL5k3k3L6K4r1
144I40l7P9P5m0r8J7P2m3j02J5J15%j31j6Q0K2l6K2R0k6q7k8N7N6O1O0J4J5m3m4j8j8j7j8
140I88JKK4K4l8j53j07Q6R1k5p7L8Q2l3r2K5J55M0o2nM5p1j29j3J31P2RRP9l7j37k1N6kr5
136H60l7O7Qm9QJ06M8j2j2J7J6m1m2L3L2k6k6noooL4L4o2o3K0K0L8R6M8o7j25rJ14N7l9l8
131I85j0j0j7j7P3m3j42k7R1L3k3k3LMn4n4P2P3k5L2R9j7j15n8P6P6j7j7O3O3l6l7j3p1j37
127G80k0J26O9k6k7L9L9n7n7J04J04QQJ7J8p9p9M0M1j34j33P2P1k4k5J09J09j02j03J3J3m5
$$ plain form
157 1066 1144 1199 1137 1076 1131 1155 1064 1030 1113 1150 1071 1025 1095 1096 1038 1039 1098 1059 905 800 888 992 980 973 1081 1127 1057 987 1033 1056 964 885 1000 1113
153 1113 1110 1054 1113 1189 1148 1115 1140 1163 1128 1090 1109 1129 1034 993 1067 1147 1112 1052 1107 1144 1124 1078 1090 1090 1032 995 1074 1143 1096 1078 1175 1234 1177 1065 1070 1059
148 1059 991 948 1021 1095 1054 962 986 1019 1052 1082 1169 1187 1089 987 1001 1070 1024 1001 1095 1198 1109 1005 1017 1112 1092 979 982 1017 994 971 1007 1031 940
144 940 903 982 1057 1017 919 936 1008 965 863 878 993 993 862 846 926 948 912 934 1024 998 911 883 940 996 1057 1117 1131 1146 1103 1059 1041 1023 1006 988
140 988 989 991 1015 1039 1001 848 741 827 918 893 816 854 936 903 811 836 991 1031 969 964 1009 938 809 796 927 999 1008 1017 1096 1059 922 901 957 955 860
136 860 823 890 898 849 857 963 1011 999 987 1004 1020 979 937 970 1002 976 950 945 939 933 927 961 995 933 870 890 910 948 1044 1092 1025 900 891 1005 1062 1023 985
131 985 975 965 948 931 1004 961 819 792 883 916 893 870 873 877 823 769 841 914 889 921 1020 1003 888 830 906 982 965 948 1011 1074 1038 1001 988 917 780
127 780 760 886 955 929 902 941 980 923 866 970 1074 1082 1090 1107 1125 1046 967 1007 1048 914 781 853 924 900 875 984 1093 991 888 901 914 869
123H69m5llN4N5O7O7l0k9N7N7l8l9M7M8q7q7ppo4o5L2L2o5o5N3N2m4m4J3J2j7j7J13J13k3
119I62k2ooo4o3R4R4m0m1Q7Q7m8m8N7N7l9m0j4j5p2p2L5L4L5L4L4L3k5k4M0M0n6n6QPQPK6
114A028K6j42j42K8J25M5j3M7M7j5j4J9J9l9l8qqo6o6llo1o1J20J21n4j11NJ02Qq9J1J08N1
110I77pM8M8n2j10LR9K0l8K2Q0Nr1j6M1j9p7K3Q0Nr1o0kn9j18k9O6Rq7k1L7kkJ00R9M2M1K3
105I87K2l5l5k9l0k9k9Q9Q9J4q2k5P1J4q3k4P3M1n5n4Ll5l5N4N4m2m2J6J7l7l8%N8K7o8k6
101G96P1M7j1l4K3j2j3M4M4j4j4j0j0o4o4pN2nj21l3Q3Q0l7NO2N5kj1j0o5o4K9J46R1k5m0
97I62J8J5m4j8M0j5p2l7P9K5r2m9O6L7p8j4J01M3p2j08PL0k9k4L3k1p8o4N2M9j0j5M3j2j28
92F20n1J43R9j7mJ11R7r6q3L3J21Oj01m2M7j1k7k6KKj2M5N3o3n9kJ7J6K5K4On1m4P1P5m1m7
$$ plain form
123 869 824 821 818 872 927 994 1061 1031 1002 1059 1116 1078 1039 1086 1134 1047 960 953 946 882 817 849 881 816 751 804 856 812 768 781 793 776 759 872 985 962
119 962 940 934 928 864 801 895 989 949 908 995 1082 1034 986 1043 1100 1061 1021 1007 992 920 848 883 917 952 986 1020 1053 1028 1004 1044 1084 1028 972 980 987 995 1002 1028
114 1028 1054 912 770 798 923 968 955 1002 1049 1034 1020 1039 1058 1019 981 973 965 899 833 830 827 766 705 825 946 892 781 786 888 896 807 818 926 977
110 977 970 1018 1066 1014 904 907 1006 1026 988 1010 1090 1095 1004 988 1029 1010 933 956 1036 1041 950 890 888 829 711 682 748 757 670 649 686 684 682 782 881 923 964 987
105 987 1009 974 939 910 880 851 822 911 1000 1014 932 907 978 992 909 885 958 999 944 890 893 858 823 877 931 889 847 863 880 843 805 805 863 890 822 796
101 796 867 914 903 869 892 880 867 911 955 941 927 917 907 843 779 772 824 819 698 665 748 828 791 796 858 913 911 900 890 825 761 790 936 1027 1002 962
97 962 980 995 951 933 973 958 886 849 928 953 861 812 878 915 837 823 924 967 895 787 794 824 795 771 804 783 705 641 693 742 732 717 760 748 620
92 620 569 712 811 794 790 901 998 902 819 852 973 979 878 836 883 872 845 819 821 823 811 856 909 846 787 785 802 818 843 867 873 822 778 849 924 883 836
88H36O8J1j05j24pR3R4%%j7p6j0J07J06rq1k4k3q1o7M8N1o4n3O2J56L9k8L0L5q1j39mJ09N2
84I04o1o1q7q7p7K0J04M6nmK0K1QPN6N5POj7j6K5J22M6q9j20J5P7j9q8RL5k3n7M0J27L0n8
79I11%Q1K3o1o0j5j6o4o4LMJ1J2N0qm4N2J00Mr4l6J2J2k4k4K4K4j7j6N0N1m9m9J9J9k4k3K5
74G99K4m3m4K4K3K2K1mml1K7P7j9n8n9k5q4q5J1R6L7j5M3J25O8m1m2l9l9m3N3Q5j0n9jO4O
70H60p1j4L8L7j7j7N0N1m7m8j2j2l3O4J32L5p0p0J1J1j8j8N0qp7J9J00M2p9q0k9k9o0L8J06
66H35M8o7rP5J7r2r2M9N0l6l6L1L2o4o3J00J00m8m8j9j9j6j7L2L1o8o9J15J14m0m1j2j2k0
61G41k0M8M8m7m7J17J17MMNMj12j12N2N2o5o4Q0Q0J0J1L9L9p2p3N3J11L5o2j1M7k1p9p2p2
57G68l8l9J25J25M5M5M4M5q7q8P7P7ppM2M2n6n6N0N0j7j8L1L1RRP7P6M0M0Q8Q7QQJ29J30N2
$$ plain form
88 836 904 915 810 686 679 772 866 866 866 849 773 763 870 976 967 886 862 839 758 691 739 790 726 673 735 891 930 902 932 967 886 747 743 852 904
84 904 843 782 695 608 531 551 655 701 696 692 712 733 741 748 804 859 866 872 855 839 864 986 1032 943 823 838 915 896 808 817 852 829 772 812 939 969 911
79 911 911 992 1015 954 894 879 863 799 735 738 742 753 765 815 807 763 815 915 919 825 789 801 813 789 765 789 813 796 780 830 881 832 783 802 821 797 774 799
74 799 823 780 736 760 783 805 826 822 818 787 814 891 872 814 755 730 646 561 572 668 705 690 733 858 926 885 843 804 765 722 775 860 850 791 790 854 860
70 860 789 775 813 850 833 816 866 917 870 822 810 798 765 829 961 996 926 856 867 878 860 842 892 884 807 826 926 968 889 809 780 751 691 729 835
66 835 883 816 807 882 899 807 715 764 814 778 742 773 805 741 678 778 878 830 782 763 744 728 711 743 774 706 637 752 866 826 785 773 761 741
61 741 721 769 817 770 723 840 957 961 965 970 974 862 750 802 854 789 725 805 885 895 906 945 984 912 839 892 1003 1038 976 965 1012 991 912 840 768
57 768 730 691 816 941 986 1031 1075 1120 1033 945 1022 1099 1092 1085 1127 1169 1113 1057 1107 1157 1140 1122 1153 1184 1193 1202 1279 1355 1395 1435 1523 1610 1618 1626 1755 1885 1937
53A937oN0J67J17Kj06j63k43k43j49j50j20j20J4P2j7j33p5M1J1m8m0J8nnN7N6j3j4j3j4o6
49G99o7j0M8j3j30p1M4M5j3rM8M0j7J8J8l5l5O1O1k1k0k1k1q5q4J1J2N3N3N2N3l2l2K5K6k
44G49kN5N6m2m3J2J2m3j00m0P5L4k4L4R2Mj12j9R6L3q3p9L6Pn0PO5N4o2o2N4P4J6jkm0m0l9
40F82m0J9K0J9K0M8M9M5M5n9j17r4K0M2j7rM9N5N6N2N3N7n9n2n2p3p3j6j5M3M3L9L9m7j05
35F67m9O7Q3l2n1Qj1j1M9J08K8q7q8K9M4j4K2K3o4j21o1N4N4nmN3K9q6l2Q3J13kk7L0N0o6
31G83l4K4J0m8m8J0L1k8k7L1N4lK9L0%n7m0P7J4j02r9J8O3Ok7Q9Q0l5o0n9m4m4k6L2L3q3q2
26D68L3M3j5j4M3N1o4o4N2P8K1l3K4K7l1o7M9M4p0o7M8N6kn7KN7%n9%Q1K3jkM3j4n1O5J20
22H17O1l4l3o7o6j2j2L4k4o4N2R5k1q1k3K8l1o3N3R0L1k6L1L9p7p7L8J19O1l5l5K7K7l1l0
$$ plain form
53 1937 1931 1981 2148 2265 2267 2161 1998 1755 1512 1363 1213 1093 973 987 1059 1042 909 834 875 886 838 798 816 811 806 863 919 906 892 879 865 799
49 799 732 722 770 757 627 556 600 645 632 623 671 711 694 712 730 695 660 721 782 761 741 720 699 614 530 541 553 606 659 711 764 732 700 725 751 749
44 749 747 802 858 816 773 785 797 754 654 614 689 723 699 733 825 829 717 698 794 827 744 665 701 708 658 665 730 784 722 660 714 788 804 803 801 761 721 682
40 682 642 661 681 700 720 768 817 862 907 848 731 637 657 699 682 673 722 777 833 885 938 995 936 884 832 759 686 670 655 698 741 780 819 772 667
35 667 618 685 768 736 685 693 682 671 720 828 856 769 681 710 754 740 762 785 721 600 539 593 647 642 638 691 720 634 602 685 798 796 769 799 849 783
31 783 749 773 783 735 687 697 728 700 673 704 758 755 784 814 814 757 717 794 808 706 607 625 688 694 667 756 836 801 741 682 638 594 568 600 633 550 468
26 468 501 544 529 515 558 609 545 481 533 611 632 599 623 650 619 552 601 645 575 508 556 612 610 553 555 612 612 553 553 634 657 656 654 697 683 632 697 817
22 817 878 844 811 744 678 666 654 688 664 600 652 747 726 645 622 650 619 556 609 699 730 704 735 774 697 620 658 777 838 803 768 795 822 791 761
17G61%%J%M4M4j4j4k7k8k7k7J6J6m5m6Mn5r0K5Q2K5l1l2O3O2N5N5J1j05j13LO2n4n5O2J14
13G42jj33j7J09N0m4m5P1P1o4o3qqqpN8N9l8l8J0J0m7m8O1O1l5l6L4L4o3o2L6L6k1k2L7L8
8G09o0n9R2R1m4m3J8J8J8J8P9Q0n6n5J5J5q1q1K4K3K4K4OPn1n2L2L2k6k6O2O1l4l5l3l3r1
4E88r1L2L2L2L2m8m7m8m7O1O2LMM1M1n5n6P4P3k3k3J1J1q6q5j6j6M3M2R7R8l8l7M7M7n0m9
-1F56N4N4m3j00k0P7N5lK1P9L9n7n3n3n9n9j%%%NNNNk3k3k2k3L1L1k7k7R3R2m2m3PPn0n1K2
-6E59K1p4p5M8M8m8m8O5O5l2l1L0L0k7k7J4J5J5J4L9L8r7r6M9M9rrO1O0l3l2L4R1K5p3o4N2
-10F47j9k0J2J2J2J2J1J0m7m8L7L7r8r8J1J2J1J1Q7Q7j0rN9N8JJk2k2k2k2K1K1p6p5j3j2p1
-15D86p0L9M0M0L9N1N1qpJ8J9m0m0O6O5o9j26k4R2Nn3K7J42J1j04k2R5R0k5l7K1l7r5l3Q2
$$ plain form
17 761 761 761 762 762 806 850 836 822 795 767 740 713 729 745 700 654 658 603 513 538 620 645 614 582 645 707 762 817 828 723 610 613 675 621 566 628 742
13 742 741 608 591 700 750 706 661 732 803 739 676 668 660 652 645 703 762 724 686 696 706 659 611 672 733 698 662 696 730 667 605 641 677 656 634 671 709
8 709 649 590 682 773 729 686 704 722 740 758 837 917 861 806 821 836 755 674 698 721 745 769 775 782 731 679 711 743 717 691 753 814 780 745 712 679 588
4 588 497 529 561 593 625 577 530 482 435 496 558 561 565 606 647 592 536 610 683 660 637 648 659 573 488 472 456 499 541 638 736 698 661 708 755 705 656
-1 656 710 764 721 621 601 678 733 730 751 830 869 812 759 706 647 588 587 587 587 587 592 597 602 607 584 561 539 516 547 578 551 524 617 709 667 624 631 638 588 537 559
-6 559 580 506 431 479 527 479 431 496 561 529 498 528 558 531 504 518 533 548 562 601 639 542 446 495 544 535 526 587 647 614 582 616 707 732 659 595 647
-10 647 628 608 620 632 644 656 667 677 630 582 619 656 558 460 471 483 494 505 592 679 669 660 719 777 778 779 757 735 713 691 712 733 657 582 569 557 486
-15 486 416 455 495 535 574 625 676 668 661 679 698 658 618 684 749 680 554 530 622 627 574 601 743 754 650 628 723 813 788 751 772 735 640 607 689
-19F89Q2l3p4j5j9p7m1J7K0l7l3Q3M7j1J7J6m3j02L9J54J43m9j28j1J1J2%N9M0p5q3L4N1p
-23F76j4j4p5p5k2k1j5j4J5J30Q0l6m3P4L7k1j6M2K1r6o2N4N4o2r5K1M3j5k1L7L8k1lN5L4
-27F70q2n3O3L1k8k0R6R5k0n9jno3m6J2M8o8j25rN2pn2NK7K7K8K7K7K7POPPl4l4k7k7k3R2
-32E71R6j9%N9nj21j21nN9Jm2P4P8l7k4R3Q8k7j21o4L2L1k6k7J4m5q6K9R0k5j34j8Q3Q4J2
-36E47J2J6J5k4L4P0m6r0l1K5l2p9L7R7L9J0RJ0J0j7M1K3r3r6J9J15N7m2m2m5m5k3k2L9L9
-41E37k7L1P1m6p6M0O4O3o5o5qpj9j9M0L9k8k9L0L0n6n5P9Q0PPL6L7j1j0J8J8k8k9K9K9qq
-45F91qqo5o4ppl6l6O0O0m7m6J0J1MMMMm8m8Q7Q7lkn4n3r4K1N3N2j5j6M3M2m7m7J1J1k1k0
-50D63L7L8k7k6j9j9o9M7J17J17j1j1j0j1m3m3J6J5k6k6k6k6l6l6O0O0onJ29J29o1o1l2l2
$$ plain form
-19 689 771 738 664 649 630 553 512 529 549 512 479 562 609 598 615 631 588 486 525 679 822 773 645 634 645 657 657 716 756 681 598 632 683 676
-23 676 662 648 573 498 476 455 440 426 441 571 651 615 572 646 683 662 646 688 709 613 551 605 659 597 502 523 566 551 530 567 605 584 581 636 670
-27 670 588 535 598 629 601 581 677 772 752 693 692 687 624 578 590 638 570 445 436 488 481 429 434 461 488 516 543 570 597 604 610 617 624 590 556 529 502 479 571
-32 571 667 648 648 707 702 581 460 455 514 515 473 547 625 588 564 657 745 718 597 533 565 596 570 543 557 512 426 455 545 520 386 368 451 535 547
-36 547 559 575 590 566 600 670 624 534 503 528 496 417 454 551 590 600 609 619 629 612 653 676 583 487 506 621 678 636 594 549 504 481 459 498 537
-41 537 510 541 612 566 490 530 594 657 592 527 519 512 493 474 514 553 525 496 526 556 500 445 524 604 611 618 654 691 680 670 688 706 678 649 678 707 699 691
-45 691 683 675 610 546 539 532 496 460 520 580 533 487 497 508 512 516 520 524 476 428 515 602 599 597 543 490 396 417 470 522 507 491 534 576 529 482 493 504 483 463
-50 463 500 538 511 485 466 447 378 425 542 659 648 637 627 616 573 530 546 561 535 509 483 457 421 385 445 505 499 494 623 752 691 630 598 566
-54E66j04j04P0O9L6L6L5L6k6k6L2L2l4l4K4K3n3n3M3M3l4l5O3O2m2m3j3j3o1o1mlj7j7M1
-59D34M0noR1R1m5m6m5m5k0k0P7P6J9J9J8J9r2r2l4l5M4M3P3P2l4l3O2O3m3m3J5J5q2q2k4
-63D45k5jkN5N6kkK7K7%%R2R3m4j01m5P1J0j05o6qk2k1J1J1l4l5K4K4l3l3K6K5rqM9N0J9K0
-68E39P3P4p7j35l9P6O6n0l6l5j9j9P8P8J%N9N8n8n9jN6Qj08n0O6J8m1j2M6k0j36m3P2M8o9
-72D09r0K6J01J00N1N0KLLKm0m0J7J8l3l3K5K5QQQQn6n6jkKn7L9J54O8m8m8O8P9l7n9%no4
-77F05r2K4L5L5j6j6l9m0J8J8l5l4l5l5o8o8L2J49O2n4n3O2J01j4l9J9N4o1k5L3N5N6JKn1
-81E86n1n4n4m9j06m6P0N2poN2M1p5l9J9K0K1M2R9Q6l1n8n8k1k2L6L6J1J2RQM8rm6P0L7k0
-86F03j7M1J9m0ppn8j17o0N6L8p7j20P2J50L5n5KJ5J5k0L7O3l3o9j2Jn6n3NL5L4L7L8J9J9
$$ plain form
-54 566 462 358 428 497 533 569 604 640 614 588 620 652 618 584 608 631 578 525 568 611 577 542 605 667 625 582 569 556 495 434 430 427 410 393 434
-59 434 474 469 463 554 645 600 554 509 464 444 424 501 577 596 615 633 652 560 468 434 399 443 486 559 631 597 564 626 689 646 603 618 633 551 469 445
-63 445 420 419 417 472 528 526 524 551 578 578 578 670 763 719 618 573 644 654 549 483 475 453 432 443 454 420 385 409 433 400 367 393 418 409 401 450 500 519 539
-68 539 612 686 609 474 435 511 577 527 491 456 437 418 496 574 575 575 634 692 634 575 574 630 638 530 480 546 564 523 511 557 537 401 358 430 478 409
-72 409 319 345 446 546 597 647 649 652 655 657 617 577 594 612 579 546 571 596 604 612 620 628 572 516 515 513 515 458 497 651 719 671 623 691 770 733 674 674 669 605
-77 605 513 537 572 607 591 575 536 496 514 532 497 463 428 393 325 257 289 438 500 446 393 455 556 542 503 522 576 515 490 523 578 634 635 637 586
-81 586 535 481 427 378 272 226 296 348 341 335 387 428 353 314 333 353 374 416 515 601 570 512 454 433 411 447 483 494 506 515 523 571 562 516 586 623 603
-86 603 586 627 646 606 599 592 534 417 357 413 451 374 254 326 476 511 456 458 473 488 468 505 568 535 466 454 455 399 346 351 386 420 457 495 514 533
-90E33l8l9k5k4k7P0R4kp5j6O7J0m8J0K9k8m9n0K8K9K9K8m8m7m8m7N1N1poj0j0M7M8JJl8K0
-95D64K2p4p5K2P7J8J8P6N5m1r9lQ0K3l6l5l7l6l7l7j2j3j2j3Q0Q0K2K2J5J5m3m3l7l6l7l7
-99B96M8M8m9m9K5K5K5K5J8J9J9J9j0j0j0rK7K8j1M7K2p4p4K3O7Rm9m8J9K0L9R6P1k5r6l8
-104D83L2L2k2k2Q0Q0r4r4opK3K3nnqq%n7q5J1Q3j3q7q8M1M0M1M1L4L5k3k4Q1Q0j6j6n8n8
-108D44n8L8P2J3m4J3N5m2j69p4J02J59J04M7J7m1j02m4M1M2r0r0N8N8%Jm1m1m1m0N7N6l9
-112D21m0R9R9LLk2k1q0p9L2L3k6k5M2M2j6j6O9O9o6o6K2K2K2K2N1N1q4q4K1K1l7l7J6J6m2
-117D35m2K3K4noL1L0k7k7R2R2m3m3m3m3p2p2N6N7m0m0M7M7j1o9k3P3M8j1jjl4l3N7N7l9l9
-121D05P2P1J4J3k5k5p6p7K3J19K8o7l2O5N9l8m5m5n0n1K5K6N5N4M1M0r4r5N4N4K4K5M4M3
$$ plain form
-90 533 495 456 431 407 380 450 544 542 467 451 518 528 480 490 519 491 442 392 420 449 478 506 458 411 363 316 367 418 411 405 395 385 432 480 481 482 444 464
-95 464 486 412 337 359 436 454 472 548 603 562 463 460 540 563 527 492 455 419 382 345 333 320 308 295 375 455 477 499 514 529 486 443 406 370 333 296
-99 296 344 392 343 294 319 344 369 394 412 431 450 469 459 449 439 430 457 485 474 521 543 469 395 418 485 494 445 397 416 436 475 571 642 617 521 483
-104 483 515 547 525 503 583 663 569 475 469 462 485 508 503 498 490 482 482 425 340 351 434 421 334 246 287 327 368 409 443 478 455 431 512 592 576 560 502 444
-108 444 386 424 496 509 465 478 533 491 322 248 350 509 613 660 677 636 534 490 531 573 483 393 451 509 509 510 469 428 387 347 404 460 421
-112 421 381 480 579 582 585 563 542 462 383 415 448 422 397 439 481 465 449 518 587 521 455 477 499 521 543 594 645 561 477 498 519 482 445 461 477 435
-117 435 393 416 440 435 429 460 490 463 436 528 620 577 534 491 448 376 304 360 417 377 337 384 431 420 351 328 401 449 438 437 436 402 369 426 483 444 405
-121 405 477 548 562 575 550 525 449 372 395 514 542 475 443 508 567 529 484 439 389 338 363 389 444 498 539 579 485 390 444 498 522 547 591 634
-126F34l1j27n5M1J7m1m0J7J4J4K2Q1M5n2p8p7k6k5R1R2J5q2m3J4NNmnn8n9L8R5K7p0k3P4
-130D45M6j2J9K0mo1m1N7N9Kn3n3L9M0L7L8n9n8K4K5l3l3QQm7m6K9Q6N4m3m0J8j8j15o8K9
-134B99K7K6K5K6k9k9J5P2N1o4m3J4J2m7L3R1L1q5p7L8N9Kl5K2J9l9l3l3l6l7M6M6M6M7K0
-139D80K1pj23o5pqo5l9P7R9M1M1M2k0k0k2k1J9m0l3Q2Q3l4j20o2ooO6O5O6O5j4j4j4j4m8
-143D45m8r8r9N7J73J18Lj00m2k4k3J6J6J5J6j1j2K9l0q0L5O1Lm1J8L9L9j1j0j0j1m4m5m1
-147C03m1qN0Q5l0k9K9K6l3j8M0L6k1J8J8J4J5%%%%m4m3m3m4M8M9M8M8rj0rrK7K6k9q8m2P4
-152D04P8l8q2L3J28P1%Jlkm9m9M8M8l3l3l3l3o7o6O7J25Q6k9r6r6j9k0K0l8k0R5R5k1p6j8
-156C78L6k2k7L0Q5K7l8l8l9l8l3K4O4n1j6J01R7j9p9k1O9J0k8k8l1l2l6l6K2K1l9m0J8J8
$$ plain form
-126 634 603 476 421 462 479 438 398 415 429 443 465 546 591 539 461 384 358 333 424 516 531 449 406 420 425 430 426 421 363 304 342 437 464 394 371 445
-130 445 491 479 498 518 514 453 412 469 528 530 477 424 463 503 540 578 519 461 485 510 477 444 452 460 413 367 396 482 536 493 453 471 453 338 270 299
-134 299 326 352 377 403 374 345 360 432 483 419 376 390 402 355 388 479 510 425 348 386 445 447 412 434 453 414 381 348 312 275 321 367 413 460 480
-139 480 501 494 371 306 299 291 226 187 264 363 404 445 487 467 447 425 404 423 383 350 432 515 481 361 299 293 287 353 418 484 549 535 521 507 493 445
-143 445 397 299 200 257 430 548 551 451 409 385 362 378 394 409 425 414 402 431 401 321 356 417 420 379 397 436 475 464 454 444 433 389 344 303
-147 303 262 254 304 389 359 330 359 385 352 334 374 410 389 407 425 439 454 454 454 454 454 410 367 324 280 328 377 425 473 464 454 445 436 463 489 460 372 330 404
-152 404 482 444 362 395 523 594 594 595 592 590 541 492 540 588 555 522 489 456 389 323 390 515 601 572 476 380 361 341 361 323 303 398 493 472 396 378
-156 378 414 392 365 395 480 507 469 431 392 354 321 345 409 358 342 443 540 521 442 421 490 500 472 444 413 381 345 309 331 352 313 273 291 309
-161C09J7J6P5P4k7k7L1L1j7j8M1M0n7n8L9M0k3k2k2k3nnN2N2LLLLq2q3J4J4p5p5O0O1JJN9
-165D20N8k2k2k3k2JKKJm9n0M3M3ro6l1l0OO5R0R0nnN3N2l3l3k9k9k6L2R0L2o5o6nN3L2L2
-170E77L6L5m8m9m6m5l9J8J9l9j07j08K4K4nnmnj1j0M8M7j6j6Q0Q0r2r2OO5N5lk1k2k6L2R0
-175D27L1n0n0MMj4j4P6J8r1r1P5P5l2r0J8J14L4o2l4K3J4J4J7J8n3n2NOj2j1Q1Q2j2o9o9
-179C30j1NNO7O7r1r1QO6K4l3l0K8JJO0N9Jn6n7KKLO4O4j6j6KO0L3q3n0QQn1m7J1M7M8qpn1
-184C76n1M5M5pqN0N0l4l4K5K4o9o9o8o9j1j1Q4J42O9m8j4M3no3n9kl6l7K5K6MMMMn1n0MM
-189B32mo2L3J48R5k2m3J5M0j8n5O1P5m1o6o5KKKKj%jjk4k4L4L4L4L5L5L5m0m0m0m0m2m1N5
-194B99N5J7J7J6J7N7N6m0m0o1o2lmk5k5K9K9j3p0j4J01Q2l5q8K7N2mo2o2qrqrL6L5J26J25
$$ plain form
-161 309 326 342 417 491 464 437 468 499 482 464 505 545 488 430 469 509 486 464 442 419 414 409 461 513 516 519 522 525 443 360 374 388 313 238 298 359 360 361 420
-165 420 478 456 434 411 389 390 392 394 395 346 296 339 382 373 307 276 246 252 317 407 497 492 487 540 592 559 526 497 468 442 474 564 596 531 465 460 513 545 577
-170 577 613 648 600 551 505 460 421 439 458 419 312 204 228 252 247 242 238 233 222 212 260 307 291 275 355 435 343 251 257 322 377 374 353 331 305 337 427
-175 427 458 408 358 362 366 352 338 414 432 341 250 325 400 368 278 296 410 444 382 348 371 385 399 416 434 381 329 334 340 328 317 398 480 468 399 330
-179 330 319 324 329 396 463 372 281 289 355 379 346 316 344 345 346 406 465 466 410 353 355 357 360 424 488 472 456 458 518 551 468 418 426 434 383 336 347 394 442 434 427 376
-184 376 325 370 415 408 400 450 500 466 432 457 481 412 343 275 206 195 184 268 410 479 431 417 460 455 392 333 331 295 258 283 309 313 317 321 325 274 224 228 232
-189 232 228 166 199 347 442 420 377 392 432 414 359 420 495 454 388 323 325 327 329 331 330 330 329 328 304 280 314 348 382 417 452 487 447 407 367 327 285 244 299
-194 299 354 371 388 404 421 478 534 494 454 393 331 328 324 299 274 303 332 319 249 235 336 418 383 295 322 374 370 308 246 238 229 221 212 248 283 409 534
-198E34M4n2JKk1k2k1k1n5n5j9P7N6m1j7M0M5j3j4M5Rm8j2j2k1k1L2L1rj04n3M3J4q3j02L2
-203A89J12N4L7L6PPn1n1RRRQONNOl4l4l3l4LKO1O0N5N4ppj4p2r3KK4K3K9K9l3l3l4l3J6J6
-208C10J7J6KKKJK7K6K0K0Jr5m4N3O6l0o4oK7l2n5M1L6o1j12j6N7N8ONL4L3k4k4K8K9K8K9
-212D11rrrrj3j2j3j3L2L1k6k7K1K0J7J7J1m6p9L7O3O4J2J3k2k1k2k1LMn4n4O5O6PQJ3J2N
-217D73NLj13j17jJ17N9l6l6K8K7K8K8JJr5r5L1L1L2L1L9M0n7n7N5N5m1m1n3n3MNM7M8j1j0
-222C72j1j2j1j2L5L4k3k3RRRJ0k2k1k1k2N5N5ppl2r0j22oO7O6k2k2K5K5K5K5P1P0o4o4jj
-226C46%jL7L6n9o0M8M8q7q7LLMLM9M8rrP5P4J6J6llj00r9N5N6kkmnmmL5L5k2k3PPn0n1K5
-232C42K5l3l2LMMMM8M8j25j25k7k7L2L1M8M8m8m9k1k2P4P5Q7Q6m8m8J8J8m0l9K4K4K4K5Q
$$ plain form
-198 534 578 526 527 529 508 486 465 444 389 334 315 392 448 407 390 430 475 462 448 493 502 454 442 430 409 388 420 451 442 338 285 328 342 259 157 189
-203 189 301 355 392 428 435 442 391 340 349 358 367 375 381 386 391 397 363 329 296 262 265 267 328 388 443 497 490 483 469 397 304 306 330 353 382 411 378 345 311 278 294 310
-208 310 327 343 345 347 349 350 377 403 423 443 444 349 305 358 424 394 330 324 351 319 264 305 341 280 168 152 209 267 273 278 312 345 321 297 325 354 382 411
-212 411 402 393 384 375 362 350 337 324 356 387 361 334 355 375 392 409 420 374 295 332 395 459 471 484 462 441 419 398 401 405 351 297 362 428 435 443 456 468 473
-217 473 478 481 368 251 250 367 426 390 354 382 409 437 465 466 467 372 277 308 339 371 402 441 481 424 367 422 477 436 395 342 289 293 298 345 393 382 372
-222 372 361 349 338 326 361 395 372 349 358 367 376 386 364 343 322 300 355 410 403 396 364 274 152 146 213 279 257 235 260 285 310 335 406 476 412 348 347 346
-226 346 346 345 382 418 359 299 347 395 308 221 224 227 231 234 283 331 322 313 388 462 478 494 491 488 388 289 344 400 398 396 392 387 383 379 414 449 427 404 411 418 368 317 342
-232 342 367 334 302 305 309 313 317 365 413 288 163 136 109 141 172 220 268 220 171 150 128 202 277 364 450 402 354 372 390 350 311 335 359 383 408 416
-236D16Qn0n0j8j7j7j8j0j1j1j1O2O2LMN7N7j%J7J7m0m1m0l9m0m0O2O1MLk0k1k0k0Q3Q3j3
-241D51j3q7q6q6q7K9K8K8K8NNNNL4L4k4k4L2L2k6k6J4J4J4J3L9L9j9j9k4k4k3k4K8K9k9k9
-245B56M7M6M7M7K3K2K3K3MNr2r2k7k8k7k7K7K7k8k7O2J19M9m8k4L5nmM0M0n6j14n3M4J9m0
-250C13L7L6k5k5k3k3p4p5j8P8K4K5N9N9JJONOOJJn7n7L1L0L1L1l2l2k6k6k0P6P9Q0M1M1n2
-254E33n1j2M7J4q3p7k0j%K3K4K4K3j8j9p0p1J4J10M2r3q5J1L9j9l9l8l7l6MJ01P9K2L6L7
-259D14lj00j05j0K7K7P5P4J6m1m2N3N1m7k8k8On2o8M8P0J2k7k6l0l0k9k9K9K9L4L5M6p0o2
-263B19mN3N3O5O5L8p8n2OOn2l0Q5Q5l1p0j3ONM4M3N1o5n5n5o3o3J%M1j8o1N5N8n7j13MJ37
-268B40P9j2j1M3M3PPPPr5r6M0M0K3K3o7o6l7P9P1P1M0M0k3j38n2O5J18Lr0l2K6l2r1K4Q5
$$ plain form
-236 416 424 374 324 306 289 272 254 244 233 222 211 273 335 338 342 399 456 455 455 472 489 449 408 368 329 289 249 311 372 376 379 359 338 318 298 381 464 451
-241 451 438 351 265 179 92 121 149 177 205 210 215 220 225 259 293 269 245 277 309 283 257 271 285 299 312 351 390 371 352 328 304 281 257 285 314 285 256
-245 256 303 349 396 443 466 488 511 534 538 543 451 359 332 304 277 250 277 304 276 249 311 430 479 431 407 442 437 433 473 513 457 343 290 334 353 313
-250 313 350 386 361 336 313 290 216 141 123 201 225 250 309 368 369 370 376 381 387 393 394 395 338 281 312 342 373 404 372 340 314 288 268 344 423 503 544 585 533
-254 533 482 470 517 531 448 371 351 350 350 373 397 421 444 426 407 337 266 280 390 432 339 254 265 304 285 246 208 171 135 139 240 319 341 377 414
-259 414 411 311 206 196 223 250 325 399 415 374 332 385 436 389 361 333 339 287 219 267 337 349 322 296 266 236 207 178 207 236 270 305 351 281 219
-263 219 215 268 321 386 451 489 411 359 365 371 319 289 374 459 428 358 345 351 356 400 443 494 429 374 319 256 193 194 194 235 217 156 211 269 212 99 103 240
-268 240 319 307 296 339 382 389 396 403 410 315 219 259 299 322 345 278 212 175 254 325 396 436 476 453 315 263 328 446 449 359 327 353 321 230 254 339
-272C39K7m1m2J2J3ononq1q0N5N4k4k5k5k5P7P7J9K0MNNNQQK2r3o3N3J03j3l1l2J9J9o3o3
-277B21%Jk6P0J28L2o1o0L1L0n9n8LLK5Q4J05Rp5p5J5J5l3l3l3l3j6j5Q0Q1ooopj00j00P3
-281B04P3%j%jJ7J6J7J6o5o6qpLLO1O1n9o0L7L7N1N2pom2m3N4N4r2r2l5l4M4M4M4M4k1k1L7
-286C09L7QQQQo7o8rj0J1J1O8O9m7m6J1J1j1j0M7M7n9n8L7L8JKJKk4k3k4k3j5j5j5j5n8n8
-291G9P7P6JJJJK5K5K6K5mmN4N4p3p3j6j5pppoj1j1M6M7j9k0P7P7l4l5O2O2q0q0J6J6n6n6
-296B34JKRRRRK7K8K8K7r2r1o4N1L5k2j6M2P5P5K0K1q8q8RRJ1J1m6m7NMO3O2LKO0O0m0m0N5
-301D22J13K3r2k3k4n6n7KJjjjjm4m4N3N2opJ2P0L4q1m9Rno3n9kKKOOJ0RJ0Rn5n6KKM2M2M2
-306B48M2j9j8j9j8QQO6O6q3q4J3J4l3l3K5K5j7j7M1M2QRQQooo5o4K1K2K1K1nonoj6j7j6j6
$$ plain form
-272 339 366 325 283 295 308 302 297 291 286 205 125 180 234 210 185 160 135 212 289 308 328 332 337 342 347 355 363 385 292 229 282 385 372 341 309 328 347 284 221
-277 221 221 222 196 266 394 426 365 305 336 366 307 249 252 255 280 364 469 478 403 328 343 358 325 292 259 226 210 195 275 356 350 344 338 331 231 131 204
-281 204 277 277 276 276 275 292 308 325 341 276 210 202 195 198 201 262 323 264 204 241 278 329 381 374 368 326 283 337 391 299 207 172 138 182 226 270 314 293 272 309
-286 309 346 354 362 370 378 311 243 234 224 235 246 314 383 336 290 301 312 301 291 338 385 326 268 305 343 344 346 347 349 325 302 278 255 240 225 210 195 137 79
-291 79 156 232 233 234 235 236 261 286 312 337 333 329 383 437 364 291 275 260 253 246 239 233 222 211 257 304 285 265 342 419 385 350 412 474 394 314 330 346 290 234
-296 234 235 237 246 255 264 273 300 328 356 383 291 200 136 187 222 200 184 226 301 376 396 417 329 241 250 259 270 281 235 188 193 197 260 322 325 327 387 447 407 367 422
-301 422 535 558 466 443 419 363 306 308 309 308 307 306 305 261 217 270 322 316 309 321 391 425 344 295 304 299 236 177 175 177 179 185 191 201 210 220 229 174 118 120 122 164 206 248
-306 248 290 271 253 234 216 224 232 298 364 281 197 210 224 191 158 183 208 191 174 215 257 265 274 282 290 284 278 213 149 170 192 213 234 229 223 218 212 196 179 163 147
-311A47k0j9L8L9L3L4nN3J7q0n4MK4K5M7J05M8m8q4k6j7p4p1j3K0K0J9K0j6p4oR1Q9pp7j8
-316A64LMPOk0k0k0k0O1O2O2O2l0l0l3l3Nn2p8J8P0J2J3P0K5p1o7K9Q0Q1j0j0m8m7J0J1j1
-320B55j2QO6M7n0n2M4L2o5j16k0K2K2j1M8P6k0n9n9k8k9k8k9P6P7J8J8L1L0k7k8k2k3k2k3
-324A47K7K7K7K6JJJKK5K5K5K5jjjjmlm3J4Q2l4r4l6Q6Q7L2L3j1j2j07j08RRRJ0n5n4MLN7
-329B29N7kjL4L4L0L0n7j14r3K3J20O1l3l3jjjjk3k3k3k3L7L7k0k1Q2Q2j5j5k6k7k6k7J3J2
-334B75J3J2PPOPn8n8NJ21P2m3j1M8M5p0p4M1J32J7q5q5k2k3k2k3%jn9n8N8N8J9P6J25Rr6
-338C65r6M6M5n0n1M0M0j8j9k9l0l0l0L5L6L5L5J2J3m6m5J6J6m2m1k3k2q0q0P9P9K1K1M0L9
-343B81j8j9j0j0j0j0M6M6n0n1j6j7j7j6J15J15J9J9k4k5q2q2k6k5k5k5J26J25m8m8N1N0m5
$$ plain form
-311 147 127 108 146 185 218 252 247 300 317 237 183 187 211 236 283 388 436 388 304 278 261 187 116 103 123 143 162 182 166 92 86 177 266 259 182 164
-316 164 167 171 178 184 164 144 124 104 165 227 289 351 321 291 258 225 230 178 100 118 188 200 213 283 308 237 170 199 279 360 350 340 292 245 255 266 255
-320 255 243 251 317 364 314 262 306 338 273 157 137 159 181 170 218 294 274 215 156 128 99 71 42 118 195 213 231 262 292 265 237 215 192 170 147
-324 147 174 201 228 254 255 256 257 259 284 309 334 359 358 357 356 355 351 348 305 319 401 367 273 237 323 410 442 475 464 452 345 237 246 255 264 274 219 165 169 172 229
-329 229 286 284 283 317 351 381 411 354 240 147 170 290 351 318 285 284 283 282 281 258 235 212 189 226 263 243 222 304 386 371 356 330 303 277 250 263 275
-334 275 288 300 307 314 320 327 269 211 216 337 409 366 355 403 448 378 304 345 477 494 409 324 302 279 257 234 234 233 174 116 174 232 251 327 452 461 365
-338 365 269 315 360 310 259 299 339 321 302 273 243 213 183 218 254 289 324 336 349 303 258 274 290 248 207 184 162 82 2 81 160 181 202 242 281
-343 281 263 244 234 224 214 204 250 296 246 195 179 162 145 129 244 359 378 397 373 348 266 184 158 133 108 83 209 334 286 238 289 339 294
-347B94m6L7L7n9n9j4j3j0j0J5P3M1n6n0QK7K7nonnj0j0j0j0M0M1j7j7L8L8n9n8M8M9rrk1
-351B45k0J8m0p0K7K6K6m6m6J2J2K2K3K3K2N9N9KJl9l8l9l8OOOOL9L8j9j9%%%%j0rj0j0N9
-356B84N8l8l8KKKJm5m5m4m5N0N0pqMMMML5L5L5L6O6O7o9o8m9m9m9m9J0J0m3m4N7J15M5n3
-361B33m8Rk9k9M1M1M1M1j4j4j4j3j4j4j4j3j4j5j4j4L3L3L3L3M3M3n3n3poo4o5N7N6kn9R
-366A64J06Q0K3J0ROPj9j8l7r5k3P4M8j0m9m9MNQ2Q2n3n3l6l6l6l6K2K1K2K2ooook6k7p8p8
-370DP5J71P9j8j3M5j3p1m4N2N2m4o1ml5l6J0J06P6n8q4J3J3q3j29NR5L7j0M8M8j1j0M8M4
-375B97j4q6q6POLLm8m9l4O1R8M0jjnmjjjjM3M2M2M3j7j7j7j7k8k7k8k8j9k0L8L8n4n5M2M2
-380A86Q6Q6N0m7m1N4M9m8q4q4l3l2oooo%jR6R6k9k8K9L0LMn4n5K9K9K9K9LMO2O1l3l4q5q6
$$ plain form
-347 294 248 285 322 263 204 190 177 167 157 172 245 286 230 180 188 215 242 237 231 226 221 211 201 191 181 221 262 245 228 266 304 245 187 235 284 275 266 245
-351 245 225 243 203 133 160 186 212 166 120 132 144 166 189 212 234 293 352 354 355 316 278 239 201 207 213 219 225 264 302 283 264 264 264 264 264 254 245 235 225 284
-356 284 342 304 266 268 270 272 273 228 183 139 94 144 194 187 179 183 187 191 195 230 265 300 336 402 469 400 332 283 234 185 136 146 156 113 69 126 241 286 233
-361 233 185 194 165 136 177 218 259 300 286 272 258 245 231 217 203 190 176 161 147 133 166 199 232 265 308 351 298 245 238 232 168 103 160 216 214 155 164
-366 164 270 350 373 383 392 398 405 386 368 331 236 213 287 335 325 276 227 231 236 318 400 347 294 258 222 186 150 172 193 215 237 231 225 219 213 187 160 82 4
-370 4 79 250 329 311 298 343 330 259 215 267 319 275 214 210 175 139 149 255 331 273 189 202 215 132 3 8 103 140 130 178 226 215 205 253 297
-375 297 283 197 111 118 124 127 130 82 33 -1 60 158 198 197 196 191 187 186 185 184 183 226 268 310 353 336 319 302 285 257 230 202 174 155 135 173 211 157 102 144 186
-380 186 272 358 408 361 320 374 423 375 291 207 174 142 136 130 124 118 118 117 213 309 280 252 281 311 314 318 264 209 238 267 296 325 328 332 394 455 422 388 303 217
-385B17q4J2N4N4jkjjN3N3K8l0p6p6k2k1l2l1K6K6L0L0k8k8QQPQO1O1K2p4j48r0POK0K0K0
-389H6J9PPJ0J0kN6O0KlN5N1pk1k1J2m7p2j4M6M7J9K0K0J9k7k8k7k7m6m5J2J3rronL5R4O0
-394C44l5o0kno2q8l0K8l0p5j9J14J15L0k7k8L1M1M1m8m8l0K8L1k6j6M3L8j9J4J3J0J0%%k1
-399B62q0q6k9O4Ok1k2L3L3ooQ5K6m0m1m1m1k6L1R6R5J4J3l7l7r0K6N7N7n8n9%jl2l2K6K6
-403A65m3m4J5J4j0j1j1j1noN3N2J2J1P0O9k2k1k2k2j4j5j4j5j5j6M3M2m2m2R3R3j4j5j4j5
-408B73r9r9k9Q6J4J4K1K0l3l3l4l3K9K8K8K9J7J8J8J7RJ0O7O7j03j03m5m5%JR8R7j0j0j0
-412B75j0LLm8m8l7P9J36K1j19j19M8M7k6k6L2L2mmmmm8m8Q6Q7j2j1M7M6N2N1m5m5j35j34
-416A18%%MMLMj3j4M4M4k2k2k2k3K2K2K1K2K7K8K7K8r9r8kkOPO4O4%%N1N1j3j29j29j3rrN7
$$ plain form
-385 217 133 145 199 253 252 250 249 248 301 354 382 352 276 200 178 157 125 94 120 146 176 206 178 150 158 166 173 181 242 303 325 251 103 13 20 26 46 66 86
-389 86 105 112 119 129 139 137 193 253 255 252 307 358 351 330 309 321 274 202 188 234 281 300 320 340 359 332 304 277 250 204 159 171 184 175 166 160 155 190 284 344
-394 344 309 249 247 242 180 92 62 90 60 -15 -34 80 195 225 198 170 201 242 283 235 187 157 185 216 190 174 217 255 236 250 263 273 283 283 283 262
-399 262 182 96 67 131 137 116 94 127 160 154 148 233 259 219 178 137 96 70 101 197 292 306 319 282 245 155 181 238 295 237 178 178 177 145 113 139 165
-403 165 122 78 93 107 97 86 75 64 59 53 106 158 170 181 251 320 298 277 255 233 219 204 190 175 160 144 187 229 187 145 238 331 317 302 288 273
-408 273 174 75 46 132 146 160 181 201 168 135 101 68 97 125 153 182 199 217 235 252 261 271 338 405 302 199 154 109 109 110 208 305 295 285 275
-412 275 265 268 271 223 175 138 217 353 374 255 136 184 231 205 179 211 243 239 235 231 227 179 131 217 304 292 281 328 374 426 477 432 387 252 118
-416 118 118 118 122 126 129 133 120 106 150 194 172 150 128 105 127 149 170 192 219 247 274 302 203 105 103 101 107 114 178 242 242 242 293 344 331 202 73 60 51 42 99
-421I9N6opj0j0j2p0m8O6O1LM3M3j3j4j3j3k1k0k1k0K9K9K9K9K9K9K9L0j5j5j5j4o2o2l4Q2
-426A71K7l2NNj8p6k0R7R2k4j2j3j6p4j7R8J06j0o6rK1K0l4l4KJKJm9m9NNKn5q7K7L8L8L8
-430A06L9M3p2k1R4J63M7n4n4p7p8j9j9K8K9K9K9j7j6j7j6J3J2m5m6j1j2M3M3Qn0p2K5O0O0
-435A75NMm4j03l4O2Q4j3m6J1L3k5k1L6M1M1L8L9rj05j05rO0O0l0l1opook1k0jN6P1k5n8%
-439I1P8P7K3K3k6k7k6k6M4M5n2n2o6o7K7K6L4k4n0M7P1J4M5M6Kr5r5KM6M7onJ5J6RJ0K6p0
-444A77p4K3P7J9l9l9J6J6m1m2O2O1MMnnmnJ4J3m4m4J8J9J8J8K1K0l7l8J0RJ0Rj4j3j4j4M8
-449B14M7m9m8k4k3k3k4K8K7M7J04O5l2j03m5K9K9o5o4K8K7K7K8j5j5M3M3J2J2m6m6K0J9j9
-453B08L8O5l1j09j09j3j4p0p1K3K3K3K3L0L0L1L0N3N3mnJ0RJ0J0RRn0m9K7K7l1l1O0N9KJ
$$ plain form
-421 99 155 149 142 132 122 110 40 -8 58 119 122 165 208 195 181 168 155 134 114 93 73 102 131 160 189 218 247 276 306 291 276 261 247 185 123 89 171
-426 171 198 166 171 176 158 82 62 159 251 227 215 202 186 112 95 193 299 289 223 214 235 255 221 187 189 190 192 193 144 95 100 105 107 52 -35 -8 30 68 106
-430 106 145 188 116 95 189 352 399 345 291 214 136 117 98 126 155 184 213 196 180 163 147 160 172 127 81 70 58 101 144 152 102 30 55 115 175
-435 175 180 184 140 37 3 65 149 136 90 101 134 109 88 124 165 206 244 283 274 169 64 55 115 175 145 114 108 101 95 89 68 48 47 103 174 149 91 91
-439 91 169 246 269 292 266 239 213 187 231 276 224 172 106 39 66 92 126 102 52 99 170 184 229 275 277 182 87 89 135 182 176 171 186 202 211 221 247 177
-444 177 103 126 203 222 183 144 160 176 135 93 155 216 220 224 219 214 210 205 219 232 188 144 162 181 199 217 238 258 221 183 193 202 212 221 207 194 180 166 214
-449 214 261 212 164 140 117 94 70 98 125 172 276 341 309 206 161 190 219 154 90 118 145 172 200 185 170 213 256 268 280 234 188 208 227 208
-453 208 246 311 280 171 62 49 35 -35 -106 -83 -60 -37 -14 16 46 77 107 160 213 209 204 214 223 233 243 252 261 211 162 189 216 185 154 214 273 275 276
-457B76J%n7n8j4j4p2K5J26P0o6o6qpo6o5M8M8M8M8klklK8K8K7K8L6L6k1k2l2l1l1l2K1K1
-462B43j07j08J2J09N1m5k0k0k6k6J1J0J0J0N4N3mnqqo6o6j5j6M3M2L1L0L1L0pqppM6M7j21
-467A73j20l0O6J2J2M0M0j8j8JJJKQ9Q9L1L1m4m4j01j02M0M1j7p6j1Q5Q1j6k3k4l0l0K4K4
-471A79K4K5J1J2p8p8j4Q3L2o6l2O4L9j8OO4Nn2o2oJ7J7kkjkK0K0l8l7j9j8j9j9M1M1M0M1
-475B18k2k2k2k2pqpqK1K1K1K1OPOPj%jjm0m0m1m0k2k2L7L6N0N1ppJKKKn1n1n1n0N3N4J13
-481A86J12K2K1j13j13o6o4K9L1O0O0l7l7j9j9L9L9%jjjQ5Q4m7m8J1O9M6o9q0k2mnK9K8k8
-485A77q7n0O6L0k9m1m2J3J2%%MLM0R8M0p4q2L3N2oppM7M7K8K8k9l0l7l7l6l7M0M0L9M0K6
-490B72K5K6K5k9k9k8k9nnmnk8k8k8k8N7N8j%l6l5Nn4k1R5R5k1o4oM5j4m0l9N2N3n3n4n4n3
$$ plain form
-457 276 277 277 220 162 148 134 62 87 213 283 217 151 143 136 70 5 53 101 149 197 195 192 190 187 215 243 270 298 334 370 349 327 295 264 233 201 222 243
-462 243 136 28 40 149 200 155 135 115 89 63 74 84 94 104 158 211 207 202 194 186 120 54 39 23 66 108 139 169 200 230 223 215 208 201 247 294 173
-467 173 53 23 89 101 113 153 193 175 157 158 159 160 162 251 340 371 402 358 314 213 111 151 192 175 99 88 173 254 238 215 191 161 131 155 179
-471 179 203 228 239 251 173 95 81 164 196 130 98 162 201 183 189 253 258 206 144 138 155 172 170 168 167 165 185 205 167 130 111 93 74 55 96 137 177 218
-475 218 196 174 152 130 123 115 108 100 121 142 163 184 190 197 203 210 209 209 208 207 167 127 86 46 24 2 39 75 125 176 169 162 163 165 167 169 118 67 16 -34 19 73 186
-481 186 298 320 341 228 115 49 -15 14 45 105 165 128 91 72 53 92 131 131 130 129 128 213 297 250 202 213 282 328 259 179 157 153 148 177 205 177
-485 177 90 40 106 136 107 66 24 37 49 49 49 53 56 96 194 234 160 78 111 163 157 150 143 190 237 265 293 264 234 197 160 124 87 127 167 206 246 272
-490 272 297 323 348 319 290 262 233 228 223 219 214 186 158 130 102 159 217 216 216 180 145 150 96 75 170 265 244 180 174 219 205 165 126 178 231 178 124 70 17
-495A7j4j3j4j4L1L0L2L1rqrqm8m6J0J0KJKKK5K6L0L0M6J05P2k5j13n5M1M1qqo0o0o5L1J13
-499A51J12jjn9n9K5K5K5K5m9m9J0RK0K0l8l7m2m1N5N5l1l1l2l1o2o4L3L2J03J03K9o8p7J9
-504G9Q8K9llppp9p9J7J7K4K4K4K3mmmmJJJJo0o1L6L6j8j8j8j8kjN7N6m3m4m3m3J9J9J8J9
-509B6ooR1R1KLKLjjjjk7k8q5q4K8K9n9o0L2J46N8n7j14JK4K5j7j6L9M1rqrrJ6J5J5J6O4O4
-514B33P2m5n5n5mno6o5L1L0P8P8j9j8k8k7k8k8L3L3L2L3m2m2J6J6j7j7M2M1r8r7k7Q8O7O8
-518B08k1k2MNO9m6r1r1kjJ2J3P1P0n7n7J%L4L4R1R1m2m2J5J6m8m8m8m7p4p4K2K2J7J6J5J6
-523C1l3l5K4K2JJ%Jl9l9N7N7P1P2P9l6q8q7M0M1J8J8P6P6K1K0p6p5j28j27l1l1M9M8J05J06
-527B09QPO2O2o7j23q8QM5M5ppj7j8j8j8n5n4M1M1j8j8M1M0ooN2N2o6o6rqo3o3L2L3P1P3P2
$$ plain form
-495 17 3 -10 -24 -38 -7 23 55 86 77 69 60 52 4 -42 -32 -22 -20 -19 -17 -15 10 36 66 96 142 247 319 294 181 126 167 208 200 192 132 72 7 38 151
-499 151 263 262 261 202 143 168 193 218 243 194 145 155 164 184 204 166 129 87 46 101 156 125 94 62 31 -31 -95 -62 -30 73 176 205 137 60 79
-504 79 167 196 193 190 183 176 97 18 35 52 76 100 124 147 143 139 135 131 132 133 134 135 75 14 50 86 68 50 32 14 12 11 68 124 81 37 -6 -49 -30 -11 7 26
-509 26 20 14 105 196 198 201 203 206 205 204 203 202 175 147 62 -22 6 35 -24 -84 -52 94 152 95 -19 -18 6 31 14 -2 37 78 69 61 52 43 59 74 89 105 169 233
-514 233 305 260 205 150 146 141 75 10 41 71 149 227 208 190 162 135 107 79 112 145 177 210 168 126 142 158 141 124 166 207 109 12 -15 73 140 208
-518 208 187 165 169 174 243 197 106 15 13 12 24 37 108 178 121 64 65 65 99 133 224 315 273 231 246 262 214 166 118 71 -3 -77 -55 -33 -16 0 15 31
-523 31 -2 -37 -13 9 10 11 11 12 -27 -66 -9 48 119 191 270 234 146 59 99 140 158 176 252 328 349 369 293 218 90 -37 -68 -99 -50 -2 103 209
-527 209 217 224 286 348 281 158 70 78 123 168 161 154 137 119 101 83 28 -26 15 56 38 20 61 101 95 89 141 193 127 61 52 44 -19 -82 -50 -17 54 127 199
-532A99P3j07j06K9K8m2m3J2J2M2j5J7J14R9M1j6j7m3m3m2m3p9p8J6J8K5K4K5K5J0J0m7m8
-536E0J3J2RRk5q3m8M9N0N2j%n1n0Q3Q3k6k7L1L2J4J4J5J4LMLLj1j1j1j1l0l1l0l1M8M8M8
-541B10M8K6K7l2l1l0k9l3l2l6r2o8M8Q0Q0L0L0nmmmK8K8k9l0mmN4N4m4m5m5m5ooopoooom8
-546@m8m9m8M3M3M3M2L4L5L0L1n4j10q6K9RQJ5J6O1O3NMK2K3l6l6j1j2M6M7N7N7l9l9p9p9
-551C7J8J8M8M8M8M8k8k8k8k8qqrqqqqrllllk1k1L6L7%j%jm4m4J4J4NNNNJ5J6m2m2m6m6J6
-556f5J31J37K2p6j9N9Jr8r7%%N6N8N9O0l7l7p7p7j6M0N6kk4k4m3m4p7j9L2L1R0Q8L1k7k8
-560F4L1J7J7K1K0l6l6K2P9P4k3r8m0k2p9p5j9RQL3R1R5L7k3k3K4K3l4l4qpqqJ4J4k3L6N3
-565A86mo2nM4j4l5l6K4K4K3K4J1J1QPL2k6r0r0K0J9K0K0J4J3J0J1Nn2n2NP7P6j6j6J0RRJ0
$$ plain form
-532 199 272 165 59 88 116 74 31 43 55 97 82 99 213 312 353 337 320 277 234 192 149 70 -8 8 26 51 75 100 125 135 145 98 50
-536 50 63 75 84 93 68 -15 -63 -14 36 88 87 87 36 -14 69 152 126 99 130 162 176 190 205 219 222 226 229 232 221 210 199 188 158 127 97 66 114 162 210
-541 210 258 284 311 279 248 218 189 156 124 88 -4 -72 -24 56 136 166 196 191 187 183 179 207 235 206 176 172 168 222 276 232 187 142 97 91 85 79 72 66 60 54 48 0
-546 0 -48 -97 -145 -102 -59 -16 26 60 95 125 156 102 -8 -94 -65 -56 -48 -33 -17 44 107 112 116 138 161 125 89 78 66 112 159 216 273 234 195 116 37
-551 37 55 73 121 169 217 265 237 209 181 153 145 137 128 120 112 104 96 87 84 81 78 75 54 33 69 106 106 105 105 104 60 16 30 44 49 54 59 64 79 95 53 11 -35 -81 -65
-556 -65 66 203 225 149 130 189 190 92 -5 -5 -5 51 109 168 228 191 154 77 0 -16 24 80 78 54 30 -13 -57 -134 -153 -121 -90 0 88 119 92 64
-560 64 95 112 129 150 170 134 98 120 199 273 250 152 112 90 11 -64 -83 -74 -66 -33 58 153 190 167 144 168 191 157 123 115 108 100 92 106 120 97 133 186
-565 186 182 120 115 159 145 110 74 98 122 145 169 180 191 199 206 238 212 122 32 52 71 91 111 125 138 148 159 164 112 60 65 142 218 202 186 196 205 214 224
-570B24j1j1j2j1m4m4p7j8j3j3m2J6J00J01l1l0L0L1L1L1j0j0j0j0L6L7k1k1j5j5j5j5n1n2
-574C5n0n1N7N6p7p7Q3Q3K6K6K4K4K4K4n6n6LKJJJJK1K2p5p4%%n4n4R0J46P6k0k3L5L3k5p9
-579A23k0KJo0n9L5L6M9M8rj0LMn5n5K4K4K3K4L3L3k5k5l0l0l0l0M5M4j4j3O2O3l4l4n7n6
-583C0KJL9M0j9j9ppppO4O4l3l2OOn2n1k5k5k5k5L9L9L8L9nmmnK7K6K7K7k3k3k3k3K2K2p5
-588C9p4L8L9L8L9ONn2n3M7M7j2j1LKLLpoppK2K2l5r2l5O1R5L7k9k9l2l2NNNNK6K5K6K5M0
-593A95M0n7n6o8o6rj0L3L4L4L4L8L8L8L8k8k8k8k8q6q6J0J0L1L1k6k6K4K4K4K4ppppL3L2
-598A35k5k5L7L6k1k1K9L0k8k9k3k4k3k4K7K7K7K7lmo1o1M7M8M7M7MMn4n4lmllM0M0j4j5o
-603A24N1P2k4j02j02K7K7N1N2opJ4J5m4m4J0RRJ0k8k8k8k8K1K2K1K2k8k8k8k8m0m1J7J6M6
$$ plain form
-570 224 213 202 190 179 135 91 14 -4 -17 -30 -72 -56 44 145 114 84 114 145 176 207 197 187 177 167 203 240 219 198 183 168 153 138 87 35
-574 35 -15 -66 -9 47 -30 -107 -24 59 85 111 135 159 183 207 151 95 98 100 101 102 103 104 125 147 72 -2 -2 -2 -56 -110 -20 126 202 182 159 194 227 202 123
-579 123 103 105 106 46 -13 22 58 107 155 146 136 139 143 88 33 57 81 104 128 161 194 169 144 114 84 54 24 69 113 99 86 148 211 177 143 86 30
-583 30 32 33 72 112 93 74 67 60 53 46 110 174 141 109 115 121 69 18 -7 -32 -57 -82 -43 -4 34 73 68 64 60 55 82 108 135 162 139 116 93 70 92 114 39
-588 39 -35 3 42 80 119 125 130 78 25 72 119 107 96 99 101 104 107 100 94 87 80 102 124 89 -3 -38 23 118 155 126 97 65 33 38 43 48 53 79 104 130 155 195
-593 195 235 178 122 54 -12 -21 -31 2 36 70 104 142 180 218 256 228 200 172 144 58 -28 -18 -8 23 54 28 2 26 50 74 98 91 84 77 70 103 135
-598 135 110 85 122 158 137 116 145 175 147 118 95 71 48 24 51 78 105 132 129 125 64 3 50 98 145 192 196 200 146 92 89 85 82 79 119 159 145 130 124
-603 124 175 247 223 121 19 46 73 124 176 170 163 177 192 148 104 114 123 132 142 114 86 58 30 51 73 94 116 88 60 32 4 -36 -77 -60 -44 2
-607BM7j0j1L7L7k0k0L2L3L2L3o7o6o6o6J2J2J2J2k1k0P4P6K1K0l7l8l5l4l5l5M7M6j0j1J1
-612fJ0J2J1K6K6l2l3m2m3l7l7LR9P7J9K9K9K5K5onnnl6l6K5K6k3L5O0l6q6k7O8O9J1J1J1
-616B12J0j9j9j9j9K8K7K8K8n5n6LKP0P0o5o4k9k9k2k3l0O7P0k6j23o3L2L2N1N2N1N2m7m7
-621A30m7m6j3j3j2j3K8K9L0K9llN5N5m7m7m7m7p5p6N9N9RQRJ0LLMLOPOPq1q1l9N7J10J12
-625A38K0K1jkk2p9j05rO7O7M5M5j3j3l5l5K3K3J2J1J1J1l0l0k6k6K0P7M8m9p9J7R2R2n8n7
-630A71%Jlkllj9k0j9k0k6k6L2L2J7J7J8J7o4o3onJ1J1O9P0l7l6l6l7nnnnj8j8L8M0j9j9j8
-635Gj8p0p0O4O5RRQRl8m0N7N5m1m0m1m1KKKKJ6J6J12J13MNn4n3mlK5K6o4o2ookll1l1j0j1
-640a31M7M7J2J2m6m7K8K7K7K7llK5K5j9k0L8L9JJN8N9m9m9k0k0rqM9M9p3p3j4j5m5m5N1N1
$$ plain form
-607 2 49 39 28 65 102 82 62 94 127 159 192 125 59 -7 -73 -61 -49 -37 -25 -46 -66 8 84 105 125 88 50 15 -19 -54 -89 -42 4 -6 -17 -6
-612 -6 4 16 27 53 79 47 14 -28 -71 -108 -145 -142 -43 34 53 82 111 136 161 155 150 145 140 104 68 93 119 96 131 191 155 69 42 110 179 190 201 212
-616 212 222 203 184 165 146 174 201 229 257 202 146 149 151 221 291 226 162 133 104 82 59 29 96 166 140 17 -46 -14 18 69 121 172 224 177 130
-621 130 83 37 24 11 -1 -14 14 43 73 102 99 96 151 206 159 112 65 18 -57 -133 -74 -15 -6 2 11 21 24 27 31 34 40 47 53 60 -21 -102 -141 -84 26 138
-625 138 158 179 178 176 154 75 -30 -39 28 95 140 185 172 159 124 89 112 135 147 158 169 180 150 120 94 68 88 165 213 164 85 102 194 286 228 171
-630 171 171 172 169 167 164 161 142 122 103 83 57 31 63 95 112 129 147 164 100 37 31 26 37 48 117 187 150 114 78 41 36 31 26 21 3 -15 23 63 44 25 7
-635 7 -11 -81 -151 -87 -22 -13 -4 4 13 -25 -65 -8 47 6 -34 -75 -116 -114 -112 -110 -108 -92 -76 36 149 153 158 104 51 47 44 69 95 31 -31 -37 -43 -45 -48 -79 -110 -120 -131
-640 -131 -84 -37 -25 -13 -59 -106 -78 -51 -24 3 0 -3 22 47 28 8 46 85 86 87 145 204 155 106 86 66 57 49 98 147 74 1 -13 -28 -73 -118 -67 -16
-645a6L0L0L0L0K4K3K4K3n4n4k6k5nmQ5Q5M7o9mmN0N0qqLLk6k6l4l4l4l4k3k3L5L5n0n0OQ
-650A0m3m3J4J5l3l3lmJ7J7j3j2NNJ01J00KJJKJ3J4J4J3j04j04pql8l8N8N9M2M4j3j4l6l5
-654c4K3K1L1L0k7k7k6k7O4O6J5m3k1R5P6J7l9l9m8m8POl1q8o3N2P3P4j6j5L2L2L1L2k2k3
-659A40L5L6n2n1M5M5j2j2j1j2m0l9l9l9OOOPOOPOLLKLk7k8L0Q7M4p1r2l4n3n3o1N6J28P0
-664E1J3J4rrJ6J7j5p2p9L6O1Mn1n2K2K3ooL5L4OO%JJ%J0RJ0J0K8K9k9k9k4k4k4k3M6M7K2
-669I9l6k9l0l3l3k9k8L0K9llllQQQQOON9N9L7k2m7m7J3J3J0J0m7j03p2K5Q7L0k8k9opJ5P2
-674fJ25O8QQM1M1n2n2l3K4K4l3q1q1J1J2l7l7j6M1L9j7j8L9J5m1ook4k4k4k4K9K9K5K6K6
-678A9k9l1K7J4J5J9J9k2k2k1k2RJ0k7L1Q8L2k9k8j1j0M3M4K0l7m1J7N2nn9jnojkK7K8o4n
$$ plain form
-645 -16 14 44 74 104 128 151 175 198 144 90 64 39 34 30 115 200 247 178 174 170 220 270 262 254 257 260 234 208 174 140 106 72 49 26 61 96 46 -4 2 10
-650 10 -33 -76 -62 -47 -80 -113 -116 -120 -103 -86 -99 -111 -106 -101 0 100 102 103 104 106 119 133 147 160 56 -48 -55 -63 -101 -139 -81 -22 20 64 51 37 1 -34
-654 -34 -11 10 41 71 44 17 -9 -36 28 94 109 66 45 140 216 233 194 155 107 59 66 72 41 -47 -110 -58 15 89 73 58 90 122 153 185 163 140
-659 140 175 211 159 108 153 198 186 174 163 151 111 72 33 -6 0 6 12 19 25 31 38 44 47 50 52 55 28 0 30 117 161 90 -2 -36 -89 -142 -203 -147 -19 51
-664 51 64 78 69 60 76 93 78 6 -73 -37 24 28 -23 -75 -53 -30 -36 -42 -7 27 33 39 39 40 41 41 51 60 70 80 108 137 108 79 55 31 7 -16 30 77 99
-669 99 63 34 4 -29 -62 -91 -119 -89 -60 -63 -66 -69 -72 -64 -56 -48 -40 -34 -28 31 90 127 105 58 11 24 37 47 57 10 -93 -165 -140 -53 -23 -51 -80 -86 -93 -78 -6
-674 -6 119 187 195 203 244 285 233 181 148 172 196 163 82 1 12 24 -13 -50 -66 -25 14 -3 -21 18 33 -8 -14 -20 -44 -68 -92 -116 -87 -58 -33 -7 19
-678 19 -10 -41 -14 0 15 34 53 31 9 -12 -34 -25 -15 -42 -11 77 109 80 52 41 31 74 118 138 101 60 77 129 124 65 64 59 53 52 50 77 105 41 36
-683C6Q4Q3K9K9RRm9m9n0m9n0m8OONON4N5mlj8j8j7j8K6K6l1l2ooopklmlO4O6l1l1QQQQj1
-688G9j1j2j1K0K1p7p5j5j4M3M3L6L7k1k1J0J1q5q7k1k1L7L7J6J7J6J6N2N2m4m3k4k4L5L3
-693EJ16J16k0j9l1l1l1l1j4j4j3j4J1J0J1J1J1J2J1J2M7M8m9m9p3p3K2K2O7O7RJ0ppppP6
-697B04P7n9n9q2q1k5k4K6K5K6K6k2k3k1k2Q1Q3K4K5l6l6l5l6O6O5QQj4j3j3j3O7O8k9k9j0
-702A97ro8o7k3k3k2k3P5P5k1k1%j%jrrrrj3j3j2j3K5K5l1l3k6k7P0O9N6N5m1m1N8N9l7l8
-706A24PPPPM2M2r3r3q4q5M9N0M4M5j3j3K8K7o9o7J5J5J5J5j1j1j2j1L4L5k2k3pqqqm2m1m2
-711a55m2MMO2O3P9Q0j7j6m1m1J7J5l6l6K1K1K8K9o7o7O2O2NNO1O1LLk7k7k4k3K3Q1J0q7p6
-716A7j7L9M0j7j7j6j7N4N5m2m3opo3o4RRRRM4M3n2n3k9k8k9k9R1R0L2k5j3Q2Q3j3l2K6K1
$$ plain form
-683 36 120 203 232 261 270 279 230 181 131 82 32 -16 -10 -4 1 7 61 116 112 109 91 73 56 38 64 90 59 27 21 15 9 2 0 -3 -7 -10 54 120 89 58 66 74 82 90 79
-688 79 68 56 45 65 86 9 -66 -81 -95 -52 -9 27 64 43 22 32 43 -42 -129 -150 -171 -134 -97 -81 -64 -48 -32 20 72 28 -15 -39 -63 -28 5
-693 5 121 237 217 198 167 136 105 74 60 46 33 19 30 40 51 62 73 85 96 108 155 203 154 105 32 -41 -19 3 70 137 146 156 149 142 135 128 204
-697 204 281 222 163 81 0 -25 -49 -23 2 28 54 32 9 -12 -34 47 130 154 179 143 107 72 36 102 167 175 183 169 156 143 130 197 265 236 207 197
-702 197 188 120 53 30 7 -15 -38 37 112 91 70 70 69 69 68 59 50 41 32 19 6 -6 -19 6 31 0 -33 -59 -86 -16 53 109 164 123 82 140 199 162 124
-706 124 131 138 145 152 194 236 143 50 -34 -119 -70 -20 24 69 56 43 71 98 29 -38 -23 -8 7 22 11 0 -12 -23 11 46 24 1 -6 -14 -22 -30 -72 -113 -155
-711 -155 -197 -193 -189 -127 -64 15 95 78 62 21 -20 -3 12 -24 -60 -39 -18 10 39 -28 -95 -33 29 34 39 100 161 164 167 140 113 89 66 89 170 180 93 17
-716 17 0 39 79 62 45 29 12 66 121 79 36 30 23 -40 -104 -95 -86 -77 -68 -24 19 -33 -86 -115 -143 -172 -201 -110 -20 12 -13 -26 56 139 126 94 120 141
-720A41l8l8l7J6J7J4J5m3m3K7K6K7K7nononnonj0j0j0j0NMNMk8k7k5k5J8P6R8Kl1l1l7l6
-725@OOPOk6k7k8k7P7P7J9K0k0k0j9k0j6j5j7j6L2L1L2L1qqo5o5ooL2k5KR8R5jq0p8J0J1M7
-730D6M8ook4L4Mr2j11j5N9O0L0L1L0L1J2J1J2J1p7p7J9J9JJn1n0k5P0J06M9j5j5j9j8o5o5
-735d7L2L0j3j1M5M5J4J4J4J4n9n8n8n8KLR8R8mnnnm0m0J7J8RRRRj7j7j7j6J3J3J3J4k8k8
-740GO8O8L3L2k6k5k0k1k0k0J6J6J6J6n6n6M1M1k8k8k8k7K5K6K7K6m3m2m1m3j6j6M1M2noN2
-744B6N2l7l8K1K0kklkm8m8M8M7j%%jl7l8N7N8opo4o4J4J5J5J5K1K2K2K2j6j7M1M1k0k1L8
-749A23L7QPn1n1j11j12j6j5K0K1K1K0LKLKJ1J1J1J0l6l6K2K1J3J3J3J3K6K8K7K8L2L3k5k5
-754A01k5k5L3L3k5k5k6k5j4j4M3M3OOn2n1J4J4P2P2n8n9n7n9Q4Q5j2j1k6k6L2L1k4k5k5k4
$$ plain form
-720 141 103 65 28 44 61 75 90 47 4 31 57 84 111 106 100 95 89 84 79 73 68 58 48 38 28 33 37 42 46 18 -9 -34 -59 -41 35 133 135 104 73 36 0
-725 0 6 12 19 25 -1 -28 -56 -83 -6 71 90 110 90 70 51 31 15 0 -17 -33 -1 30 62 93 85 77 12 -53 -59 -65 -33 -58 -56 42 137 136 56 -22 -12 -1 46
-730 46 94 88 82 58 92 96 4 -107 -122 -63 -3 27 58 88 119 131 142 154 165 88 11 30 49 50 51 0 -50 -75 -5 101 150 135 120 101 83 18 -47
-735 -47 -15 15 2 -9 36 81 95 109 123 137 78 20 -38 -96 -94 -91 7 105 101 96 91 86 46 6 23 41 50 59 68 77 60 43 26 10 23 36 49 63 35 7
-740 7 75 143 176 208 182 157 137 116 96 76 92 108 124 140 84 28 69 110 82 54 26 -1 24 50 77 103 60 18 -23 -66 -82 -98 -57 -15 -20 -26 26
-744 26 78 41 3 24 44 42 40 37 35 -13 -61 -13 34 33 33 33 32 -5 -43 14 72 66 59 -5 -69 -55 -40 -25 -10 11 33 55 77 61 44 85 126 106 85 123
-749 123 160 168 175 124 73 -38 -150 -166 -181 -161 -140 -119 -99 -96 -94 -91 -89 -78 -67 -56 -46 -82 -118 -96 -75 -62 -49 -36 -23 3 31 58 86 118 151 126 101
-754 101 76 51 84 117 92 67 41 16 2 -12 31 74 80 86 34 -17 -3 11 83 155 97 38 -19 -78 6 91 79 68 42 16 48 79 55 30 5 -19
-758a9n6n7M0M0k9k9K9K8k8k8L0K9p7p8J9J9k6k6k6k6P0O9J2J1j6j5M2M1J4J3O9P1r3r1LM
-763f7k3k3k3k3qpqqM1M1j8j7n1n1Q4Q3M7M5M7M6q4q2N1N0j1j0j0j1L6L5L6L5o0n9kkqrpq
-767a3k9k9k8k9L7L7L7L6j6j5j6j6kjkkJ3J3J3J2MNMNK2K3l6l4J5J7J6J7l5l3l4l4n2n1M4
-772a37M5Q6Q5Q5Q6o3o4ooM4M4M3M4l2l3l2l3k5k5k5k6j5j5j6j4j1j0M6M8k7k7L1L2k2k2k2
-777A1k1J9K0K0K0j0j0j0j0jjN6N7j9j9j9j9J9J9J9J9J5J4q2q2l2l3K4K5OOOPN3N3nmm8m8
-781A5RJ0JJJJLLLMm8m7M8M8M0M1n7n6o0o1L1L2L5k2n1M6J08J2o3o2K0J8l8l8n5n5LLO5O6
-786d6QQL3L4o1o2q2q1k4k4R6R6L7L8M0M0j8j8lmo0o1L0L0L1K9J7J7J7J7p6p7J9J9LLN4N5
-791G4M7n0q6k8L7L7M1M1k0j9j9j9j9j8O9P1L2q4n2PJJNNj0j0j0j0j3j2j3j3L1K9L0L1rrr
$$ plain form
-758 -19 -75 -132 -92 -52 -81 -110 -81 -53 -81 -109 -79 -50 -127 -205 -186 -167 -193 -219 -245 -271 -201 -132 -120 -109 -125 -140 -98 -57 -43 -30 39 110 17 -74 -71 -67
-763 -67 -90 -113 -136 -159 -167 -174 -182 -190 -149 -108 -126 -143 -194 -245 -161 -78 -31 14 61 107 23 -59 -8 42 31 21 11 0 36 71 107 142 82 23 21 19 11 2 -5 -13
-767 -13 -42 -71 -99 -128 -91 -54 -17 19 3 -12 -28 -44 -46 -47 -49 -51 -38 -25 -12 0 4 9 13 18 40 63 27 -7 8 25 41 58 23 -10 -44 -78 -130 -181 -137
-772 -137 -92 -6 79 164 250 187 123 117 111 155 199 242 286 254 221 189 156 131 106 81 55 40 25 9 -5 -16 -26 20 68 41 14 45 77 55 33 11
-777 11 -10 9 29 49 69 59 49 39 29 28 27 83 140 121 102 83 64 83 102 121 140 155 169 87 5 -27 -60 -36 -11 -5 1 7 14 67 120 115 111 63 15
-781 15 24 34 35 36 37 38 41 44 47 51 3 -44 4 52 92 133 76 20 -40 -101 -70 -38 -3 -25 -76 -30 78 90 27 -35 -15 3 -35 -73 -128 -183 -180 -177 -112 -46
-786 -46 -38 -30 3 37 -24 -86 -168 -249 -273 -297 -201 -105 -68 -30 10 50 32 14 11 7 -53 -114 -84 -54 -23 6 23 40 57 74 -2 -79 -60 -41 -38 -35 19 74
-791 74 121 71 -15 -43 -6 31 72 113 93 74 55 36 17 -1 68 139 171 87 35 42 43 44 49 54 44 34 24 14 1 -11 -24 -37 -6 23 53 84 75 66 57
-796E7qJ7J8p9p7mlR2R2k9l0l0k9L6L8L7L8j2j2j2j2LLr3r2j2j3M5M6J4J4m2m3j6j5j6j5Q0
-800f4P9j5p2o2N3M3M2oopoK1K1K1K1j6j6j6j5J5J6m0m1L2L2L3L3%jn9n8K1K1K1K1q7q7l0
-805a58l0L1L1L0L1j9j8j9j9%J%JJ4J5J5J5MLMMJ8J8J8J7J0J0J0J0k2k2K8K8nj19j21mJ07
-810h3J06k0j9OOO3O4ppqpm1m0m7O6P4P3n4n4m6m6J2J0J0J1J0J0J1J1m8m6J6J5q0q1J5J6J5
-814a14J5N0M9M8M9QQn0n0L0L0k8k8ppopM5M7j2j2l4l4l5l4nmnmK2K2K1K2QOQPJKJKmlo1o1
-820a04K3K3l4l5Q0P8K2K2m3m2m3m3rrrrN9O0l7l7k3k4L4L5Q5Q7m9m9J1J0m6m7kjjjJ3J3J4
-825b8J3L1L2o3o5K4K3K4K2mmllLNn3n3J4J5J4J5K9K8K9K9m3m2J4J5J5J5m3m2KLLKl5l4l5
-829a31l5L7L7L7L7N3N4m3m3M0L9j8j9opopk4k6k5k6M7M6j1j0j2j2p0p0K6K6l1l2R3R2l9l9
$$ plain form
-796 57 49 66 84 5 -72 -76 -79 13 105 76 46 16 -13 23 61 98 136 124 112 100 88 91 94 1 -91 -103 -116 -71 -25 -11 3 -39 -82 -98 -113 -129 -144 -64
-800 -64 15 0 -72 -134 -81 -38 4 -2 -8 -15 -21 0 21 42 63 47 31 15 0 15 31 -9 -50 -18 14 47 80 80 79 20 -38 -17 4 25 46 -41 -128 -158
-805 -158 -188 -157 -126 -96 -65 -84 -102 -121 -140 -140 -139 -139 -138 -124 -109 -94 -79 -75 -72 -68 -64 -46 -28 -10 7 17 27 37 47 25 3 31 59 54 -65 -186 -190 -83
-810 -83 23 3 -16 -10 -4 59 123 116 109 101 94 53 13 -34 32 106 179 125 71 25 -21 -9 1 11 22 32 42 53 64 16 -30 -14 1 -79 -160 -145 -129 -114
-814 -114 -99 -49 0 48 97 105 113 63 13 43 73 45 17 10 3 -3 -10 35 82 70 58 24 -10 -45 -79 -84 -88 -93 -97 -75 -53 -32 -10 -2 4 12 19 20 22 23 25 21 18 -43 -104
-820 -104 -81 -58 -92 -127 -47 31 53 75 32 -10 -53 -96 -105 -114 -123 -132 -73 -13 -50 -87 -110 -134 -100 -65 20 107 58 9 20 30 -16 -63 -65 -66 -67 -68 -55 -42 -28
-825 -28 -15 16 48 -15 -80 -56 -33 -9 13 9 5 2 -1 2 7 -46 -99 -85 -70 -56 -41 -12 16 45 74 31 -11 3 18 33 48 5 -37 -35 -32 -29 -27 -62 -96 -131
-829 -131 -166 -129 -92 -55 -18 35 89 46 3 43 82 64 45 39 32 26 19 -5 -31 -56 -82 -35 11 0 -10 -22 -34 -104 -174 -148 -122 -153 -185 -92 0 -39 -78
-834g8J5P2Nr1k4P2M8j0lN4K1p6p6J9N0qk1k0k4k4J4J4J4J4K5K4K5K4j4j5p2p3J3J3J3J2O
-839f2NOORRRRm5m6J3J2L0L1l0q8l7K0j1j2KO1Q6Q5K0K0K0K1j4j3j4j3qpo5o4N2N1qo5l3K5
-844c3K5l3l5K3j0j0j0M7N0poN1M7j0k1k0k1k0k2L3L5k3norj0L8L7J6m2o1nJ7J7L4L4O6Rq6
-848G4q6q4q4k2P5N4nj1j1j1j2l3K5N1N0K0K0K0K1K0K1N3nn1n1n4n4j1j1qpk0L8M1j6KN9Q1
-853G8j5j02m6J3J2j%LKm2J6M1M1m2m2N5N3j9j8k0j9l2l1K7K6J7J6J7J5LMn4n4OOO4O3MLM
-858E2Ml1l1k5k5l0O6J24K7q3q3POj0j0j0j0RQRRJ2J3J1J3m9n0PQL8L7L8L8ppppk2k1k1k1
-863b4K1J9K1K1l2l1l2l2j1j1K7l0q7RJ25J24J4J3J3J3r0r0l2l3mlmlrqM9M9J0J0J0J0j1j0
-867b9j1j0QQQQn7n7M0L9k9l0K9K8M9M8M8M9p1p0j3j3K4K3l3l4l4l5K3K3k7k8k7k7K0K1K1
$$ plain form
-834 -78 -63 9 14 -77 -101 -29 19 9 6 60 81 5 -71 -52 -2 -10 -31 -51 -75 -99 -85 -71 -57 -43 -18 6 31 55 41 26 -46 -119 -106 -93 -80 -68 -62
-839 -62 -57 -51 -45 -36 -27 -18 -9 -54 -100 -87 -75 -45 -14 -44 -132 -169 -149 -160 -172 -170 -109 -23 62 82 102 122 143 129 116 102 89 81 74 9 -55 -3 48 40 -25 -58 -33
-844 -33 -8 -41 -76 -53 -63 -73 -83 -36 14 7 1 52 99 89 68 48 27 7 -15 18 53 30 25 19 10 0 38 75 91 49 -12 -17 0 17 51 85 151 160 74
-848 74 -12 -96 -180 -202 -127 -73 -78 -89 -100 -111 -123 -156 -131 -80 -30 -10 10 30 51 71 92 145 140 89 38 -16 -70 -81 -92 -100 -107 -127 -89 -48 -64 -62 -3 78
-853 78 63 -39 -85 -72 -60 -61 -61 -58 -56 -98 -82 -41 0 -42 -84 -29 24 5 -13 -33 -52 -84 -115 -88 -62 -45 -29 -12 3 6 10 -44 -98 -92 -86 -22 41 45 48 52
-858 52 56 25 -6 -31 -56 -86 -20 104 131 48 -35 -28 -22 -32 -42 -52 -62 -53 -45 -36 -27 -15 -2 9 22 -27 -77 -70 -62 -24 13 51 89 82 75 68 61 39 18 -3 -24
-863 -24 -3 16 37 58 26 -5 -37 -69 -80 -91 -64 -94 -181 -172 -47 77 91 104 117 130 40 -50 -82 -115 -119 -122 -126 -129 -138 -146 -97 -48 -38 -28 -18 -8 -19 -29
-867 -29 -40 -50 -42 -34 -26 -18 -75 -132 -92 -53 -82 -112 -83 -55 -6 42 90 139 68 -2 -15 -28 -4 19 -14 -48 -82 -117 -94 -71 -98 -126 -153 -180 -160 -139 -118
-872a18K1j9j9j9j9PPO5O5RQm9n0L5L5L7n9p5K1R4L5m7RO9P0o9o8O1O3n5j12m4N3M8m7m6N2
-877e1O0Mj5j6LKKLl7l7K1K1J6J7J5J6jkN0N0J3q3o1mk8k7k3k4J0J0J0J1JKKKn2n3M4M4K2
-882f3K1K2K0j1j2j2j3KKN9N9n8n8%jRJ0RRL5L7k1k1r4r5KJO2O2MMn3n3NNM8M7M6M8p2p3K4
-887e8K3L5L6k3k1lkllo0n9o0n9J7J8J7J8K8K9Q6Q5opopJ2J1J2J2m9m7m8m9KJJJ%%n8n8k4
-892b66k4L3L4M5M5M5M5k7k7L1L0J6J7J5J6m2m3m3m2J6J6J6J7qqqqJ8J9J8J8k6k5k5k6M5M5
-896d8M5M3o4o4O4O3L1o5o7K7K1l7l5K3P2J5m4m6k8k9k8k8L8L8L9L8qrqrK1K2l7l6k0k0j9
-901a49k0l5l5O2J19Q6rj0rj8j8l0Q5J08N0m5m5m0l9l9m0l7l7K0K1J9J9J9J9l0l0l0l1L7L7
-905g5L7L7J1J1J2J2o5o6L0Q6P7l9k9k8k7k8k8k8J6J5J5J6k4k4L3L4J5J5m1m2L3L4k4k4MN
$$ plain form
-872 -118 -97 -116 -135 -154 -173 -166 -159 -94 -29 -20 -12 -61 -111 -76 -41 -4 -63 -138 -117 -23 12 -35 -26 43 113 44 -24 37 100 45 -67 -111 -58 -10 -57 -103 -51
-877 -51 9 13 -2 -18 -15 -13 -11 -8 -45 -82 -61 -40 -24 -7 8 24 23 21 71 121 134 51 -10 -14 -42 -69 -92 -116 -106 -96 -86 -75 -74 -72 -70 -68 -120 -173 -129 -85 -63
-882 -63 -42 -20 0 -11 -23 -35 -48 -46 -44 15 74 16 -42 -42 -43 -34 -24 -15 -6 29 66 45 24 -70 -165 -163 -162 -100 -38 -34 -30 -83 -136 -131 -126 -78 -31 15 63 -9 -82 -58
-887 -58 -35 0 36 13 -8 -11 -13 -16 -19 -79 -138 -198 -257 -240 -222 -205 -187 -159 -130 -44 41 35 28 22 15 27 38 50 62 13 -34 -82 -131 -129 -128 -127 -126 -126 -126 -184 -242 -266
-892 -266 -290 -257 -223 -178 -133 -88 -43 -70 -97 -66 -36 -20 -3 12 28 -14 -57 -100 -142 -126 -110 -94 -77 -85 -93 -101 -109 -91 -72 -54 -36 -62 -87 -112 -138 -93 -48
-896 -48 -3 40 -24 -88 -24 39 70 5 -62 -35 -14 -51 -86 -63 9 24 -20 -66 -94 -123 -151 -179 -141 -103 -64 -26 -34 -43 -51 -60 -39 -17 -54 -90 -110 -130 -149
-901 -149 -169 -204 -239 -177 -58 28 19 9 0 -18 -36 -66 19 127 177 132 87 47 8 -31 -71 -108 -145 -125 -104 -85 -66 -47 -28 -58 -88 -118 -149 -112 -75
-905 -75 -38 -1 10 21 33 45 -20 -86 -56 30 107 68 39 11 -16 -44 -72 -100 -84 -69 -54 -38 -62 -86 -53 -19 -4 11 -30 -72 -39 -5 -29 -53 -49 -44
$$ [...]
##$OBSERVED INTEGRALS=	(X Y Z)
(2.7544302173601091788, 2.9037220495548670129, 1)
(7.310405096407006198, 7.3644590356499337602, 1.9301364834082583855)
(7.2614991513776896426, 7.310405096407006198, 0.15258904511826354433)
(7.1508172757850285706, 7.2614991513776896426, 3.000819348381038143)
(7.0015254435902676278, 7.0658753712604225328, 0.99758868447856363648)
(6.7801616924049401547, 6.859955602715927192, 0.95234946198219960767)
(3.8277870108982781083, 3.899858929888851744, 2.0877775782789647074)
(2.3683306513391868542, 2.4481245616501787765, 3.1172707948873226158)
(2.2962587323486154389, 2.360608660018770788, 3.1176513687548799147)
(1.2537899040921225424, 1.40565573339368588, 2.00283193311617147)
(1.08133209793610785, 1.1611260082470997723, 6.3481431117062809832)
(0.88313432071203457063, 0.98609420498428135282, 1.5072128663097457135)
##END=	
##TITLE=	Feb07-2020.10.fid
##JCAMP-DX=	6.0	$$ MestReNova 14.1.0-24037
##BLOCK_ID=	7
##DATA TYPE=	NMR PEAK TABLE
##DATA CLASS=	PEAK TABLE
##CROSS REFERENCE=	NMR SPECTRUM: BLOCK_ID=6                                     
##.OBSERVE FREQUENCY=	400.05240029999998796
##.OBSERVE NUCLEUS=	^1H
##NPOINTS=	228
##FIRSTX=	0.13055700280248186407
##LASTX=	10.010046918027004637
##XFACTOR=	1
##YFACTOR=	1
##FIRSTY=	3.6589656142947579731
##XUNITS=	PPM
##YUNITS=	ARBITRARY UNITS
##PEAK TABLE=	(XYW..XYW)
0.13055700280248186407,3.6589656142947579731,0.0042599018323310807593
0.73595921421940169171,2.9369426174702129018,0.0054211830836111531487
0.76285476908011862207,10.458916966056969855,0.0026993578196543711704
0.78058138478377259162,26.762342979047851088,0.0024450504418832897692
0.79764989762325955169,7.3264516979619056514,0.0038640591603652796326
0.8130634331187913677,9.9673395186466198226,0.0023584120182074050365
0.83148991282388939883,21.964934180158369514,0.0020880952091835484029
0.8497223546895852353,11.278044655068402591,0.0023373317332788311022
0.86187931197639122693,1.8280715828820106594,0.0015781735498114259769
0.88877685091792979488,14.680931195369115727,0.001928112728324550898
0.89242430892487578653,8.6838904196802353397,0.0029480460031386774254
0.90479438904303044477,16.494990376730893189,0.0029741348900165103832
0.91078032081405702058,26.47780041585932409,0.0032959915462248126281
0.92059135276102765921,1634.0087064936433308,0.0040068861017531721622
0.93154715420010236748,79.963067519465653277,0.0029233332928569680242
0.93795862089040649145,4639.3161839769918515,0.0025858981429043108834
0.94404554299442422494,158.95418919027588345,0.0030482904104042569601
0.95024273260535552232,682.74976145837467811,0.010603524157847581816
0.95492403323256469516,1066.1593799810532346,0.0026993578196543711704
0.95839953032727120963,142.86025865821764569,0.0029233332928569680242
0.97557415752396470232,139.39302969738906768,0.0026993578196543711704
0.98401906443118536405,5.2141387238432708173,0.0095627742553450953422
1.0121215701852421809,32.040500633508514738,0.0019549348614391033954
$$ [...]
Compound,None,,1,0.083139074514036404029,0,0
Compound,None,,1,0.73276721820179857581,0,0
Compound,None,,1,0.27182041298398912366,0,0
Compound,None,,1,0.44755704226844300608,0,0
Impurity,Artifact|Weak,,1,-0.60000000000000008882,0,0
Artifact,Artifact|Weak,,1,-0.1788364065561179328,0,0
Impurity,Artifact|Weak,,1,1.0593373808449655371,0,0
Impurity,Artifact|Weak,,1,1.2421594380208560437,0,0
Compound,Artifact|Impurity|Weak|13C Sat.,,1,0.60000000000000008882,0,0
Impurity,Artifact|Weak,,1,1.2577515518875752587,0,0
Compound,None,,1,-0.35720996616773031951,0,0
Compound,None,,1,-0.11055826192548873221,0,0
Compound,None,,1,-0.79081206941483361827,0,0
Compound,None,,1,-0.049412799741375953988,0,0
Compound,None,,1,0.29365043866096629532,0,0
Compound,None,,1,0.4043639426187534136,0,0
Compound,None,,1,-0.27667435622246111526,0,0
Compound,None,,1,-0.43631674202701203891,0,0
Compound,None,,1,-0.58188288886696559743,0,0
Compound,None,,1,-0.14923614887492830938,0,0
Compound,None,,1,0.12783655849302960616,0,0
Compound,None,,1,0.11621998619938876673,0,0
Artifact,Artifact|Weak,,1,-1,0,0
Impurity,Artifact|Weak,,1,0.2000000000000000111,0,0
Impurity,Artifact|Weak,,1,-0.60000000000000008882,0,0
Artifact,Artifact|Weak,,1,1.1157912961265952223,0,0
Impurity,Artifact|Weak,,1,0.0041049800445944126248,0,0
Artifact,Artifact|Weak,,1,0.42184191788677688484,0,0
Compound,Artifact|Impurity|Weak|13C Sat.,,1,0.46837562430583029593,0,0
Compound,Artifact|Impurity|Weak|13C Sat.,,1,-0.47311680983243359355,0,0
Impurity,Artifact|Weak,,1,0.22414360623234519387,0,0
Artifact,Artifact|Weak,,1,0.76849704612904601309,0,0
Compound,None,,1,1.2432111839435853184,0,0
Compound,None,,1,0.74302503662814656238,0,0
Compound,None,,1,0.33953447450537072028,0,0
Compound,None,,1,-1,0,0
Compound,None,,1,1.2766761336991401254,0,0
Compound,None,,1,1.402863727285383888,0,0
Compound,None,,1,1.999999999999999778,0,0
Compound,None,,1,-0.080354713328020188623,0,0
Compound,None,,1,-0.36168146150275104489,0,0
Compound,Artifact|Weak,,1,-0.57476100043079891844,0,0
Artifact,Artifact|Weak,,1,-1,0,0
Solvent,None,,1,0.17471615875507917615,0,0
Artifact,Artifact|Weak,,1,1.4246066417854037489,0,0
Artifact,Artifact|Weak,,1,1.5999999999999998668,0,0
Artifact,Artifact|Weak,,1,0.020556978572607392114,0,0
Compound,None,,1,1.1999999999999999556,0,0
Compound,None,,1,0.59254815344904354646,0,0
Compound,None,,1,1.3999999999999999112,0,0
Compound,None,,1,1.3324266586293644909,0,0
Compound,None,,1,0.7859995555586583027,0,0
Compound,None,,1,0.29156831946186179128,0,0
Artifact,Artifact|Weak,,1,0.2000000000000000111,0,0
Compound,Artifact|Impurity|Weak|13C Sat.,,1,0.80000000000000004441,0,0
Artifact,Artifact|Weak,,1,0.280712742508686941,0,0
Compound,Artifact|Impurity|Weak|13C Sat.,,1,1.2391728410259406079,0,0
Compound,Artifact|Impurity|Weak|13C Sat.,,1,0,0,0
Solvent,Artifact|Impurity|Weak|13C Sat.,,1,-0.36947515000452219036,0,0
Artifact,Artifact|Weak,,1,-0.23726262202649589517,0,0
##END=	
##END=	
##END=	
