##TITLE=	Jan31-2020.170.fid
CKS25
##JCAMP-DX=	6.0	$$ MestReNova 14.1.0-24037
##DATA TYPE=	LINK
##BLOCK_ID=	1
##BLOCKS=	2    
##ORIGIN=	Mestrelab Research S.L.
##OWNER=	cks119
##$MNOVA/LINK_BLOCK_TYPE=	ITEM	$$ NMR Spectrum
##$MNOVA/ITEM/POLYGON=	(XY..XY)
5321,5835
8722,5835
8722,8208
5321,8208
5321,5835
##$MNOVA/ITEM/Z=	0
##$MNOVA/ITEM/ANGLE=	0
##TITLE=	Jan31-2020.170.fid
##JCAMP-DX=	6.0	$$ MestReNova 14.1.0-24037
##BLOCK_ID=	2
##DATA TYPE=	NMR SPECTRUM
##DATA CLASS=	XYDATA
##NUMDIM=	1
##ORIGIN=	Bruker BioSpin GmbH
##OWNER=	nmrsu
##.OBSERVE FREQUENCY=	400.05240029999998796
##.OBSERVE NUCLEUS=	^1H
##.SOLVENT NAME=	CDCl3
##.PULSE SEQUENCE=	zg30
##LONGDATE=	2020/01/31 16:49:00.000
##.ACQUISITIONMODE=	SIMULTANEOUS (DQD)
##$ORIGINAL FORMAT=	Bruker XWIN-NMR
##$MNOVA/SCALES_VERSION=	8
##$PARAMETER FILE=	(acqus, ASCII, //ch-nmrserv2.ch.ic.ac.uk/Av400D/ug1/nmr/Jan31-2020/170/acqus, 0)
$$ ##TITLE= Parameter file, TOPSPIN		Version 3.2
$$ ##JCAMPDX= 5.0
$$ ##DATATYPE= Parameter Values
$$ ##NPOINTS= 11	$$ modification sequence number
$$ ##ORIGIN= Bruker BioSpin GmbH
$$ ##OWNER= nmrsu
$$ $$ 2020-01-31 16:49:01.483 +0000  nmrsu@nmrpc
$$ $$ /opt/topspin/data/ug1/nmr/Jan31-2020/170/acqus
$$ $$ process /opt/topspin3.2/prog/mod/shimcntl
$$ ##$ACQT0= -2.04831932773109
$$ ##$AMP= (0..31)
$$ 100 100 100 100 100 100 100 100 100 100 100 100 100 100 100 100 100 100
$$ 100 100 100 100 100 100 100 100 100 100 100 100 100 100
$$ ##$AMPCOIL= (0..19)
$$ -1 0 0 0 0 0 0 0 0 0 0 0 0 0 0 0 0 0 0 0
$$ ##$ANAVPT= -1
$$ ##$AQSEQ= 0
$$ ##$AQ_mod= 3
$$ ##$AUNM= <au_zg>
$$ ##$AUTOPOS= <17 >
$$ ##$BF1= 400.05
$$ ##$BF2= 400.05
$$ ##$BF3= 400.05
$$ ##$BF4= 400.05
$$ ##$BF5= 400.05
$$ ##$BF6= 400.05
$$ ##$BF7= 400.05
$$ ##$BF8= 400.05
$$ ##$BYTORDA= 0
$$ ##$CAGPARS= (0..11)
$$ 0 0 0 0 0 0 0 0 0 0 0 0
$$ ##$CFDGTYP= 0
$$ ##$CFRGTYP= 9
$$ ##$CHEMSTR= <none>
$$ ##$CNST= (0..63)
$$ 1 1 1 1 1 1 1 1 1 1 1 1 1 1 1 1 1 1 1 1 1 1 1 1 1 1 1 1 1 1 1 1 1 1 1 1
$$ 1 1 1 1 1 1 1 1 1 1 1 1 1 1 1 1 1 1 1 1 1 1 1 1 1 1 1 1
$$ ##$CPDPRG= (0..8)
$$ <> <> <> <> <> <> <> <> <>
$$ ##$D= (0..63)
$$ 0 1 0 0 0 0 0 0 0 0 0 0 0 0 0 0 0.0002 0 0 0 0 0 0 0 0 0 0 0 0 0 0 0 0
$$ 0 0 0 0 0 0 0 0 0 0 0 0 0 0 0 0 0 0 0 0 0 0 0 0 0 0 0 0 0 0 0
$$ ##$DATE= 1580489340
$$ ##$DE= 6.5
$$ ##$DECBNUC= <off>
$$ ##$DECIM= 2496
$$ ##$DECNUC= <off>
$$ ##$DECSTAT= 4
$$ ##$DIGMOD= 1
$$ ##$DIGTYP= 12
$$ ##$DQDMODE= 0
$$ ##$DR= 22
$$ ##$DS= 4
$$ ##$DSPFIRM= 0
$$ ##$DSPFVS= 20
$$ ##$DTYPA= 0
$$ ##$EXP= <proton>
$$ ##$F1LIST= <>
$$ ##$F2LIST= <>
$$ ##$F3LIST= <>
$$ ##$FCUCHAN= (0..9)
$$ 0 2 0 0 0 0 0 0 0 0
$$ ##$FL1= 90
$$ ##$FL2= 90
$$ ##$FL3= 90
$$ ##$FL4= 90
$$ ##$FOV= 20
$$ ##$FQ1LIST= <>
$$ ##$FQ2LIST= <>
$$ ##$FQ3LIST= <>
$$ ##$FQ4LIST= <>
$$ ##$FQ5LIST= <>
$$ ##$FQ6LIST= <>
$$ ##$FQ7LIST= <>
$$ ##$FQ8LIST= <>
$$ ##$FRQLO3= 15959.0749999881
$$ ##$FRQLO3N= 2
$$ ##$FS= (0..7)
$$ 83 83 83 83 83 83 83 83
$$ ##$FTLPGN= 0
$$ ##$FW= 125000
$$ ##$FnMODE= 0
$$ ##$FnTYPE= 0
$$ ##$GPNAM= (0..31)
$$ [...]
$$ 130000 130000 130000 130000 130000 130000 130000 130000 130000 130000 130000
$$ 130000 130000 130000 130000 130000 130000 130000 130000 130000 130000 130000
$$ 130000 130000 130000 130000 130000 130000 130000 0 0 0 0 0 0 0 0 0 0 0
$$ 0 0 0 0 0 0 0 0 0 0 0 0 0
$$ ##$ShimPowMaxUC= (0..63)
$$ 130000 130000 130000 130000 130000 130000 130000 130000 130000 130000 130000
$$ 130000 130000 130000 130000 130000 130000 130000 130000 130000 130000 130000
$$ 130000 130000 130000 130000 130000 130000 130000 130000 130000 130000 130000
$$ 130000 130000 130000 130000 130000 130000 130000 0 0 0 0 0 0 0 0 0 0 0
$$ 0 0 0 0 0 0 0 0 0 0 0 0 0
$$ ##$ShimPowMaxUG= (0..63)
$$ 524287 524287 524287 524287 524287 524287 524287 524287 524287 524287 524287
$$ 524287 524287 524287 524287 524287 524287 524287 524287 524287 524287 524287
$$ 524287 524287 524287 524287 524287 524287 524287 524287 524287 524287 524287
$$ 524287 524287 524287 524287 524287 524287 0 0 0 0 0 0 0 0 0 0 0 0 0 0 0
$$ 0 0 0 0 0 0 0 0 0 0
$$ ##$ShimPowRcbType= 3
$$ ##$ShimPowRes= (0..63)
$$ 1e-20 1e-20 1e-20 1e-20 1e-20 1e-20 1e-20 1e-20 1e-20 1e-20 1e-20 1e-20
$$ 1e-20 1e-20 1e-20 1e-20 1e-20 1e-20 1e-20 1e-20 1e-20 1e-20 1e-20 1e-20
$$ 1e-20 1e-20 1e-20 1e-20 1e-20 1e-20 1e-20 1e-20 1e-20 1e-20 1e-20 1e-20
$$ 1e-20 1e-20 1e-20 1e-20 0 0 0 0 0 0 0 0 0 0 0 0 0 0 0 0 0 0 0 0 0 0 0 0
$$ ##$ShimPowRng0= (0..63)
$$ 1 1 1 1 1 1 1 1 1 1 1 1 1 1 1 1 1 1 1 1 1 1 1 1 1 1 1 1 1 1 1 1 1 1 1 1
$$ 1 1 1 1 0 0 0 0 0 0 0 0 0 0 0 0 0 0 0 0 0 0 0 0 0 0 0 0
$$ ##$ShimPowRng1= (0..63)
$$ 1 1 1 1 1 1 1 1 1 1 1 1 1 1 1 1 1 1 1 1 1 1 1 1 1 1 1 1 1 1 1 1 1 1 1 1
$$ 1 1 1 1 0 0 0 0 0 0 0 0 0 0 0 0 0 0 0 0 0 0 0 0 0 0 0 0
$$ ##$ShimPowRng2= (0..63)
$$ 1 1 1 1 1 1 1 1 1 1 1 1 1 1 1 1 1 1 1 1 1 1 1 1 1 1 1 1 1 1 1 1 1 1 1 1
$$ 1 1 1 1 0 0 0 0 0 0 0 0 0 0 0 0 0 0 0 0 0 0 0 0 0 0 0 0
$$ ##$ShimPowRng3= (0..63)
$$ 1 1 1 1 1 1 1 1 1 1 1 1 1 1 1 1 1 1 1 1 1 1 1 1 1 1 1 1 1 1 1 1 1 1 1 1
$$ 1 1 1 1 0 0 0 0 0 0 0 0 0 0 0 0 0 0 0 0 0 0 0 0 0 0 0 0
$$ ##$ShimSysFunc= (0..63)
$$ 1 2 3 4 5 6 7 8 9 10 0 37 38 35 16 15 14 13 12 11 28 27 26 25 24 23 36
$$ 22 30 29 20 21 34 33 32 31 17 18 19 0 0 0 0 0 0 0 0 0 0 0 0 0 0 0 0 0 0
$$ 0 0 0 0 0 0 0
$$ ##$ShimSysMatrix= 0
$$ ##$ShimSysType= 4
$$ ##$TFXNUM= 0
$$ ##$TRIPLO2= 0
$$ ##$VTU= 2
$$ ##$VTUETH= <149.236.99.20>
$$ ##$VTUTY= <no>
$$ ##$WBREFAM= (0..15)
$$ 136.7 118.7 100 100 100 100 100 100 100 100 100 100 100 100 100 100
$$ ##$WBREFLM= (0..15)
$$ 0 0 0 0 0 0 0 0 0 0 0 0 0 0 0 0
$$ ##$WBREFPH= (0..15)
$$ 77.55 -71.28 0 0 0 0 0 0 0 0 0 0 0 0 0 0
$$ ##$WBSGU= (0..15)
$$ 0 0 0 0 0 0 0 0 0 0 0 0 0 0 0 0
$$ ##$XFAC= 2
$$ ##END=
$$ 
##$DECIM=	2496
##$DSPFVS=	20
##XUNITS=	HZ
##YUNITS=	ARBITRARY UNITS
##FIRSTX=	6406.710256386850233
##LASTX=	-1606.1102564336499654
##DELTAX=	-0.12226780365942625795
##XFACTOR=	1
##YFACTOR=	0.0038842529401070238423
##FIRSTY=	9.5806732177734375
##MINY=	-2.00812530517578125
##MAXY=	14571.7197265625
##NPOINTS=	65536
##XYDATA=	(X++(Y..Y))
$$ [...]
1803C22R3J04J05n2j39j16K7O6j9n2L4P1j4j07j07lQ3M9N0N5N5m5m5K2K1J7o9o9J7L6L5M1
1799D66M0J7J6J2J1P5j1o3o2o0o0r8r7j3P3O8O8L2L2o3o3l2N4J6o9j02j6L6L7l7M9R6R6k7
1795D21j14p0J5N9N9pqL5L5Q3lm1m0K5K6j2j1L2L1n5n5j2j3l7l8m2M3M0M0LLn0n0n0n0R2R3
1791C77O9j6n1n0J6J5K2K1K1K2l5l5QQqqL4L5rrrrqqL6L5j4j4j4j5K5K5K5K5M4M5k7k7n5n5
1786D32J7J6J2J1l2l2q4q4o2K5L7L7M3M3j2j1j2j1k1k2k1k1o0o0J6J01R1Oj2j3l6l7j8O7J03
1781C96J7n8n8K5K5j8j7RRRRk3k2j7j7n0L7O0N9j09j10l8J05R6J0l3l2M1M2jkl4l5p7p7L3
1777A54L3L3L3ONl7l8O3O4K0K1J9J8Jq5j20l5O9P0M2M2M3M2j8j8j8j9l0l1p4p3K5K5O8O8k0
1773C48k0k0j9PPPPJ0J0RJ0k6k6J7J6N1N1k1k1m0m0m0l9j4j4K9K9P2P2k9k8m4m5m4m4L2L2
$$ plain form
1803 322 415 519 624 572 433 317 344 410 391 339 373 444 430 323 216 213 296 345 395 450 505 460 415 437 458 475 406 337 354 390 425 466
1799 466 506 523 539 551 562 637 626 563 501 441 381 283 186 173 246 314 382 414 446 383 320 288 342 358 289 187 171 207 244 207 256 352 448 421
1795 421 307 237 252 311 370 363 355 390 425 508 505 464 424 449 475 463 452 484 515 460 405 393 380 343 305 263 306 346 386 389 392 342 292 242 192 284 377
1791 377 446 430 379 329 345 360 382 403 424 446 411 376 384 392 384 376 410 445 436 427 418 409 401 393 429 464 450 436 422 407 432 457 482 507 551 596 569 542 487 432
1786 432 449 465 477 488 456 424 340 256 194 219 256 293 336 379 367 356 344 333 312 290 269 248 188 128 144 245 336 342 330 317 281 244 226 293 396
1781 396 413 355 297 322 347 329 312 321 330 339 348 325 303 286 269 219 256 316 375 266 156 118 223 319 329 296 264 305 347 346 344 310 275 198 121 154
1777 154 187 220 253 259 264 227 189 252 316 336 357 376 394 395 310 190 155 224 294 336 378 421 463 445 427 409 390 360 329 255 182 207 232 300 368 348
1773 348 328 308 289 296 303 310 317 327 337 346 356 330 304 321 337 388 439 418 397 357 317 277 238 224 210 239 268 340 412 383 355 311 266 222 178 210 242
1768B42L2L2J2J2J1J2L4L5qrj3j2L0L0JKp1p0j4j5K8K8K6K5j7j8j5j6j5j6K7K7K8K7kjM1M2
1763D72J4J5n7n7K0K1k2k2l9l9l8l9K0K0J9K0K9K9K9K9k4k4k4k3m4m3Q5Q5j2j2n5n5%%m2m3
1759A93RQRQP9P9L6L6J6J6J7J6j6j6q7q8J7J6J6J6o4o5k1k2O8O8K5K5K1K2K1K1m2m2K9L0k1
1755D33k1o4o4J6J6J6J6nmO7O7O2O3rrm7m7j18j19N7N7N7N7n6n7n6n7M8M7NMK9K9j5j4p5p5
1750B34l2l2J1J0N4N3O2O1j0j0poppn9n8P0P0J0RRJ0j%j%n7n6n7n6P8P9P9P8l2l3J1J0j4j3
1745D50j4j4jjjjj5j6N7N6N5N6m5m4l8l7l8l7PPPQJ8J7J8J8J2J2J1J2l9m0l9l9JKM4M4P8P7
1740F08j7j03l9l9m5m5J5J4J5J4j6j6j7j6K3K3K3K3l0l0l0l0klklK2K1N9N9O7j9j08j08k0
1736B48O7J8J8J5J4J5J4NNNNpqqpPOR3R2JJq4q5o1o1K5K5L1L0j3j2m1m1KLo1o0K5K6O2O1k4
$$ plain form
1768 242 274 306 318 330 341 353 387 422 414 405 392 380 410 440 441 443 372 302 288 273 301 329 355 380 363 345 330 314 299 283 310 337 365 392 390 389 430 472
1763 472 486 501 444 387 407 428 406 384 345 306 268 229 249 269 288 308 337 366 395 424 400 376 352 329 285 242 327 412 400 388 333 278 278 278 236 193
1759 193 202 210 219 227 306 385 421 457 473 489 506 522 506 490 403 315 332 348 364 380 316 251 230 208 276 344 369 394 415 437 458 479 437 395 424 454 433
1755 433 412 348 284 300 316 332 348 343 339 406 473 535 598 589 580 533 486 368 249 306 363 420 477 421 364 308 251 299 346 351 355 384 413 398 384 309 234
1750 234 202 170 181 191 245 298 360 421 411 401 394 388 381 374 315 257 327 397 407 416 425 435 434 434 433 433 376 320 263 207 285 364 443 521 489 456 467 477 463 450
1745 450 436 422 421 420 419 418 403 387 444 500 555 611 566 522 484 447 409 372 379 386 393 401 419 436 454 472 484 496 507 519 480 440 401 362 363 365 409 453 531 608
1740 608 591 488 449 410 365 320 335 349 364 378 362 346 329 313 336 359 382 405 375 345 315 285 283 280 278 275 297 318 377 436 503 484 376 268 248
1736 248 315 333 351 366 380 395 409 414 419 424 429 422 414 406 399 406 412 505 597 598 599 515 430 369 308 333 358 389 419 406 394 353 312 314 317 256 196 221 247 309 370 346
1731C46k4k6k7J6J7%%%%K1K1J5J6J8o8o7J8J02J02l9j25p4J2M4M4J0J0l3l3J9J9k4k5LLM6
1726C37M5llm6m7k8k8N7N8nmmnj5j5P1P0l5l5l6l5K1K1K1K1N7N7J4J4j03j03M0M0k9k9l0k9
1722B77klklN2N1N1N2J2J3p3p3j6j6K7K6l5l5QQJJM3M4lkllM4M3M4M4J1J2J1J2n4n3n4n3J4
1717D18J5J4J4m7m7m8m7L5L5L5L5L6L6L5L6l9m0l9m0j4j5j4j4j5j4j5j4LLLLLLLLM3M2M2M2
1712D75o8o8J8J8m0m0J1R8M2M3k3k4m0m1j8O8Q6Q5j0rk8k8k8k8p4p4llJJ%Jl6l6j2P3O1O1
1707D11l4l3J4J3J4J4J3J2l0l0k4k4J9J9M7M8k4k4k7k8k7k8j4j5j4j5K1K0K0K1l3l3J0J0N3
1703C22N2RRn9o0j7j6O7O8M9l6o6K1R6R5J4J3QQl1j17j17l1N1N0J3J3oooom3m3N8N7K7K7j6
1699D51j6l9l9L2L3J8J9k4k5m4m5kkJ1J1J0J1J6J7J6J6j6j5K7K7K1K1n1n1k9k8J4J4l9l8M
$$ plain form
1731 346 322 296 269 285 302 302 302 302 302 323 344 359 375 393 325 258 276 378 480 441 316 242 254 298 342 352 362 329 296 315 334 310 285 288 291 337
1726 337 382 379 376 330 283 255 227 284 342 337 333 329 324 309 294 365 435 400 365 329 294 315 336 357 378 435 492 506 520 417 314 354 394 365 336 306 277
1722 277 275 272 270 267 319 370 421 473 485 498 425 352 336 320 347 373 338 303 311 319 320 321 364 408 405 403 400 397 441 484 528 572 583 595 606 618 564 511 457 404 418
1717 418 433 447 461 414 367 319 272 307 342 377 412 448 484 519 555 516 476 437 397 383 368 354 340 325 311 296 282 285 288 291 294 297 300 303 306 349 391 433 475
1712 475 407 339 357 375 335 295 306 404 446 489 466 442 402 361 343 411 497 582 572 563 535 507 479 451 377 303 300 297 298 299 299 300 264 228 216 289 350 411
1707 411 377 344 358 371 385 399 412 424 394 364 340 316 335 354 401 449 425 401 374 346 319 291 277 262 248 233 254 274 294 315 282 249 259 269 322
1703 322 374 383 392 333 273 256 240 307 375 424 388 322 343 439 534 548 561 569 577 546 429 312 281 332 382 395 408 402 396 390 384 341 298 356 413 440 467 451
1699 451 435 396 357 389 422 440 459 435 410 366 321 319 317 328 339 349 360 376 393 409 425 409 394 421 448 469 490 439 388 359 331 345 359 320 282 286
1694B86MK5K5K4K5J7J6k6k6L9M0lmk2k2k2k2P3P4n6n5m1m2m1m1Q1Q0RRj2j1j2j2JJ%Jj0j0
1689C40j0j0K8K9K8K8l5l5QQK3K4K3K3l0l0l1l0k5k5M7M6k8k9k8k9O8O8K6K5l8l7l7l8k9k8
1685B60J4J4M7M7k4k5m5m5N5N6k4k4k3k4J8J8J7J8J3J3J3J3L1L2m1m0K7K6j6j6m2m3JJN2N1
1681D05k0j9m2m1M5M5O0O1k5k5q7q7m4m4R3R2PPK4K4K3K4J8J8J9J8m5m5m5m5j3j3j3j3K0J9
1676C56J9J9noook2k3k2k3K9K8n7n8L5L4P7P7j5j4j5j5R0R0n4n3L4L3rrj0j0rj0L5L5pqn8
1671D67n7K8K8l3l3l4l3LMLMk2k1k2k2k2k2k3k2L1L0P4P3L1L1n5n5K2K3k0k0j9j9K3K4QQQ
1667C69PL9L9L8L9k4k4k4k4m5m6M0M1j9j8K4K4o2o2j9j9L9L9P7P6J1p5k7k7N6N6k9l0n5n5
1662C30L0L1p4p4J2J2O3O4K0K0mmmmj8j9j8j8P3P4L6n0l3l3NMj5j5P1P0K8K8j5j6l4l4M7M6
$$ plain form
1694 286 290 315 340 364 389 406 422 396 370 409 449 446 442 420 398 376 354 427 501 445 390 349 307 266 225 306 386 395 404 392 381 369 357 358 359 359 360 350 340
1689 340 330 320 348 377 405 433 398 363 371 379 402 426 449 472 442 412 381 351 326 301 348 394 366 337 309 280 348 416 442 467 429 392 355 317 288 260
1685 260 274 288 335 382 358 333 288 243 298 354 330 306 283 259 277 295 312 330 343 356 369 382 413 445 404 364 391 417 401 385 343 300 301 302 354 405
1681 405 385 366 324 283 328 373 433 494 469 444 357 270 226 182 275 367 374 381 405 429 452 476 494 512 531 549 504 459 414 369 356 343 330 317 337 356
1676 356 375 394 389 383 377 371 349 326 304 281 310 338 281 223 258 292 369 446 431 417 402 387 477 567 513 460 494 527 518 509 499 489 480 470 505 540 533 525 467
1671 467 410 438 466 433 400 366 333 336 340 343 347 325 304 282 260 238 216 193 171 202 232 306 379 410 441 386 331 353 376 356 336 317 298 321 345 353 361 369
1667 369 376 415 454 492 531 507 483 459 435 390 344 384 425 406 388 412 436 374 312 293 274 313 352 429 505 516 441 414 387 443 499 470 440 385 330
1662 330 360 391 317 243 255 267 330 394 414 434 430 426 422 418 400 381 363 345 418 492 528 478 445 412 417 421 406 391 462 532 560 588 573 557 523 489 536 582
1658E82Mq2l4l4qrrrK0J9J9J9mmmmo6o5P8P8k3k2k3k2n8n8k6O0P1j5L3L4R4Qq7q6L0L1j2j3
1653D03kklknnQ1Q1J7J6o9o9l1l0J2J2p7p7J2R8J47O2l2j17j10k5O6O5j4j5K9K8j7j7j8j7
1649C75L2L2L2L2m1m1m1m1K3K3o2o2j4j4P3P2L5L4qqk9k9J4J4k6k6J7J7OOOOj6j6j7j6ppo
1644C22plmQ3Q2N2N1r2r3j5j5K8K8j4j4n7n7MMMMP1P2j4j4J3J3N5N6o6o6k4k3P0P0j6j6n8
1639D14n8K8K8L0L1j2j2J0J1J0J1J3J3J3J4O6O6j9k0m6m7lmn8n9j5j6LKKLJ9J9K0J9k2k1k2
1634D11k2J4J4j29j29lkMLK7J13O5O5L1L1L1L1l8l9l8l8QQQQJ3J2J3J3l4l4l4l3J3J4J3J4
1630D04j9j8j9j9mmnmk2k2k3k2j5j5j5j5N3N3N3N3K3K4K4K4ONOOj6j6j5j6NMNNl6l6PPo2o3
1625B66K3K3j7j8k8N7J01J6o9o9l8M8M8l8k6k6N5N5k4k4N6N6M9l7o9p0qP7K9K9K9K9K9K9J2
$$ plain form
1658 582 586 504 470 436 428 419 410 401 421 440 459 478 474 470 466 462 396 331 409 487 464 442 419 397 339 281 255 315 386 371 404 438 532 540 453 367 397 428 416 403
1653 403 401 399 396 394 389 384 465 546 563 579 510 441 410 380 392 404 327 250 262 360 507 569 537 420 310 285 351 416 402 387 416 444 427 410 392 375
1649 375 407 439 471 503 462 421 380 339 362 385 323 261 247 233 306 378 413 447 439 431 402 373 387 401 375 349 366 383 389 395 401 407 391 375 358 342 335 328 322
1644 322 315 312 308 391 473 525 576 484 391 376 361 389 417 403 389 332 275 279 283 287 291 362 434 420 406 419 432 487 543 477 411 387 364 434 504 488 472 414
1639 414 356 384 412 442 473 461 449 459 470 480 491 504 517 530 544 610 676 657 637 591 544 541 537 479 420 405 389 392 394 396 399 418 437 457 476 454 433 411
1634 411 389 403 417 288 159 156 154 158 161 188 301 366 431 462 493 524 555 517 478 440 402 410 418 426 434 447 459 472 485 451 417 383 350 363 377 390 404
1630 404 385 367 348 329 325 321 316 312 290 268 245 223 208 193 178 163 216 269 322 375 398 422 446 470 476 481 487 493 477 461 446 430 435 439 444 449 413 377 384 391 329 266
1625 266 289 312 295 277 249 306 407 423 354 285 247 295 343 305 279 253 308 363 339 315 371 427 476 439 370 300 292 369 398 427 456 485 514 543 555
1621E55J2J1J2j12j11p4J1R4R4O1k4p4p5OOk1k2k1k2L1L1L1L2M4M4n6n5J8J9J8J8POOOOOP
1616E25Ok7k6k6k7j5j6j5j6K6K5K5K6k2k1k1k1J8J8J8J8m0m0m0m0Q0Q0RRJ5J5Q2Q1K8n7q1
1611E53q1r7r7m5M1M8M8j9j8LLK1J07J19L3m1m2L1L0m0m1l7l7l7l7M1M1M1M1m0m0m0m1L0K9
1607D30P3P2O3O3m0j27j24l8QRooooM8M9L0n5o4K2J1J1j8j8Q3Q2pqn1n1o6o6L4L5L1L2L1L2
1603D92N7N8Nq0p6p5M7M8n1n1K1K1l0l0J3J3P8P8P8P8k7k6r9r8J7J7J8J7JKJKl8l8l8l8J2
1598C79J2J2J2K7K7K7K7o3o2RRM4M4M4M4lllln0n0m9n0mmmmL8L9L8L8JJM3M4L5L5l7l6j6j6
1593E72j5j6l4l3l4l3n0m9K2K3K1K1K2K1k1k1k1k1P1P2n7n6LMM7M7mlmlOPOPmnmmJ6J7J7J6
1588E46m1m2m1m2j1j0L2L2PQn9n9l8M8Q5Q6l9l9pP9J15K9o0o0PQl5l5ppL6L6rqrqL0L1L1L0
$$ plain form
1621 555 567 578 590 478 367 293 304 398 492 553 529 455 380 386 392 371 349 328 306 337 368 399 431 475 519 463 408 426 445 463 481 488 494 500 506 512 518 525
1616 525 531 504 478 452 425 410 394 379 363 389 414 439 465 443 422 401 380 398 416 434 452 412 372 332 292 372 452 461 470 485 500 582 663 691 634 553
1611 553 472 375 278 233 274 322 370 351 333 336 339 360 467 586 619 578 536 567 597 557 516 479 442 405 368 409 450 491 532 492 452 412 371 401 430
1607 430 503 575 638 701 661 534 410 372 380 389 383 377 371 365 413 462 492 437 373 395 406 417 399 381 464 546 539 531 480 429 363 297 331 366 397 429 460 492
1603 492 549 607 612 532 456 381 428 476 425 374 395 416 386 356 369 382 460 538 616 694 667 641 542 444 461 478 496 513 514 516 517 519 481 443 405 367 379
1598 379 391 403 415 442 469 496 523 460 398 407 416 460 504 548 592 589 586 583 580 530 480 431 381 377 373 369 365 403 442 480 518 519 520 563 607 642 677 640 604 588 572
1593 572 557 541 507 474 440 407 357 308 330 353 374 395 417 438 417 396 375 354 425 497 440 384 387 391 438 485 481 478 474 471 477 484 490 497 493 488 484 480 496 513 530 546
1588 546 505 463 422 380 369 359 391 423 430 438 379 320 282 330 415 501 462 423 416 495 610 639 579 519 526 534 499 464 457 450 486 522 513 505 496 488 518 549 580 610
1583F10n8n9n9n9J7J7J6J7NOOOMLMLm1m1m1m1J06J07O9j7r4r4j3j3J8J9J9J8L0K9L0K9m4m5
1578D69L7L6l1j17j16l1L1L1P4P4Q9Mr2r1k3k4k3k4pqppM7M8M8M7k1k1J6J7N1l5p2p3k1k2
1574B53k1k2Q3Q3M5m0qpL0L0MMMNn2n2L3L4L3L4L3L4n1n1n1n0L3L3L4L3k0k0k0k1j2j3j3j2
1569C39K7K6K7K7n7n8n7n7M7M7M6M7klkkk1k2K2K2k5k5O1O1k3k2k2k3P1P1j5j5n8n9K7K7n9
1565C68n9j7j6J6J6J6J6JJm2m2JKQ8Q7l6l6l6l6rqqrN9N9J6J6jjq7q7K9K8K8K9k3k3O3O3o9
1560C57o9k6k6N8N7k9k9%%%%K7K7K7K6K5K5K5K5ppppppopm6m6m6m6O1O0O1O0l3l4j14j14J3
1555B21R9N5l0p1p1l4l4O3O3O3O3n3n2n3n3O3O3O2O3k0j9k0k0NNNNQ5Q4J3J3n1n2m6m7nQ1
1550D43L2L3mlm1m1p6J0L3L4OOP7P8L3L3J04J04J05J04K4o3q4q5r0r0r5r5ONk1k1o3o4m0m0
$$ plain form
1583 610 552 493 434 375 392 409 425 442 447 453 459 465 469 472 476 479 438 397 356 315 421 528 597 580 486 392 379 366 384 403 422 440 470 499 529 558 514 469
1578 469 506 542 511 394 278 247 278 309 383 457 546 550 458 367 344 320 297 273 266 258 251 244 291 339 387 434 413 392 408 425 476 441 369 296 275 253
1574 253 232 210 293 376 421 381 373 366 396 426 430 434 438 443 391 339 372 406 439 473 506 540 489 438 387 337 370 403 437 470 450 430 410 389 377 364 351 339
1569 339 366 392 419 446 389 331 274 217 264 311 357 404 402 399 397 395 374 352 374 396 371 346 407 468 445 423 401 378 449 520 505 490 432 373 400 427 368
1565 368 309 292 276 292 308 324 340 341 342 300 258 259 261 349 436 400 364 328 292 283 275 267 258 317 376 392 408 407 406 319 232 261 289 317 346 323 300 363 426 357
1560 357 288 262 236 294 351 322 293 293 293 293 293 320 347 374 400 425 450 475 500 493 486 479 472 465 458 452 445 399 353 307 261 322 382 443 503 470 436 322 208 221
1555 221 320 375 345 274 203 169 135 198 261 324 387 334 282 229 176 239 302 364 427 407 388 368 348 353 358 363 368 453 537 550 563 512 460 414 367 362 443
1550 443 475 508 504 501 460 419 343 353 386 420 426 432 509 587 620 653 757 861 966 1070 1094 1031 947 862 772 682 587 492 498 503 482 461 398 334 294 254
1546B54O1O0k3k4k4k3L8L9L8L9m8m9m8m8MMM8M7M5M6M5M6NNl8l8m1m1LKK0J9k3k3j2j3L1L0
1541D13l1l1R2R2O8j9m2m2Q8Q8J37J36J62K47M17O75Q56R42P16L15k78p94q95q10o11m40k78
1538A173j93j35j35q7q7m3m3K9K8J4J3N7N6j9j9j9j9k7k7k8k7j3j3j2j3L8L8L8L8PPl6l7N
1534E09Mr6r7m7m8N3N3O4O4l6l6K3K2K2K2k3k4k3k3P1P2P2P1L6L6o5o4l9l9q1q2o4o4o4o4
1530A15K6K5K5K5N4N4J1J1m6m7K5K5j2j2j2j1Q1Q2J1J0L9L9o1o2J8J7J8J7l3l4J0Ropn0m9
1525C05K6K5j7j7rrR1R2l9l8l8l9j3j3n1n0J2R9N9q3j15j14L4L4N9N9N9N9J0J1J0J0J0J1J0
1521D40J0j2j3j3j2K6K7j6j7j0j1O1O1k5k4J9J9m7m8m7m8k2k2k3k2kjP0P0M9N0k2k2o0o1J2
1517C14J1K1K0k3k2kkP0O9j1j1n3n4n9o0M1M1L6L6l6l6M8M9k3k3L8L8L7L8j7j7j7j7K2K2K2
$$ plain form
1546 254 315 375 352 328 304 281 319 358 396 435 387 338 290 242 246 250 298 345 390 436 481 527 532 537 499 461 420 379 382 384 404 423 400 377 365 352 383 413
1541 413 382 351 443 535 603 584 542 500 588 676 813 949 1111 1358 1775 2450 3306 4248 4964 5279 5001 4207 3312 2502 1891 1451 1173
1538 1173 980 845 710 623 536 493 450 479 507 521 534 591 647 628 609 590 571 544 517 489 462 449 436 424 411 449 487 525 563 570 577 541 504 509
1534 509 513 417 320 273 225 278 331 395 459 423 387 410 432 454 476 453 429 406 383 454 526 598 669 705 741 676 612 573 534 453 371 307 243 179 115
1530 115 141 166 191 216 270 324 335 346 300 253 278 303 291 279 267 256 337 419 430 440 479 518 457 395 413 430 448 465 432 398 408 417 411 404 354 305
1525 305 331 356 339 322 313 304 395 487 448 410 372 333 320 307 256 206 218 317 376 293 178 64 98 132 191 250 309 368 378 389 399 409 419 430 440
1521 440 450 438 425 412 400 426 453 437 420 410 399 460 521 496 472 491 510 463 415 368 320 298 276 253 231 229 228 298 368 417 467 445 423 363 302 314
1517 314 325 346 366 343 321 319 317 387 456 445 434 381 327 268 208 249 290 326 362 326 290 338 387 364 341 379 417 454 492 475 458 441 424 446 468 490
1512D90K2k8k8k9k8K6K5K5K6p2p3p2p2M6M6M6M6N9N9N9N8l3l3l4l3PQP9P9K9L0j28j27n8n8
1508C59M3M2L7L7L8L7p0o9o9p0j5j6j6j6L5L4L5L4j9j9k0j9nonnK6K7K7K7j3j3j2j3n1n2M9
1503B94M9L1L1L0L1lkm5m6l5l5L7L6K6K6j7j7N5N6J3J3RJ0RRk9l0l0k9K9K8m3m3poppPPOP
1498D18OPOPj2j1j1j2K3K2K3K2n9o0o0o0P7P6P7P6j8j8K4K5q4q4j3j2j7j7j7j7P1P1k9k9R
1494D00RJ0Rrj0rj0J6J5J6J5j4j5j4j5L9L9l2l3p6p7l4l4K0K0K0K0J8J9j1L2R1Nr6r6%Q5Q9
1489D02Km8ol0k9j7O9J16P4RRPOk4k5k4k4k6k5J7O0L9m6l8l8J2J2o0n9m1m0L1L1k8k9k9k9
1485A81N2N1R5R4O3O3qrm7m7N3N4LL%Jl7q0j01j6L8Q0M3jo7o7k7k7L8L8nmL2L1L2L2j7j8K6
1480E25K6l3l3J1J0LKm1m0J9J9K0J9j6j5j6j5L2L2L2L3J2J3l0l1n3n4j0j1M5M5k7k6k6k7J7
$$ plain form
1512 490 512 484 456 427 399 425 450 475 501 429 356 284 212 258 304 350 396 455 514 573 631 598 565 531 498 505 513 592 671 700 730 602 475 417 359
1508 359 402 444 481 518 556 593 523 454 385 315 300 284 268 252 287 321 356 390 371 352 332 313 308 302 297 292 318 345 372 399 386 373 361 348 297 245 294
1503 294 343 374 405 435 466 463 461 416 370 335 300 337 373 399 425 408 391 446 502 515 528 537 547 556 565 536 506 476 447 476 504 461 418 411 405 398 391 398 405 411 418
1498 418 424 431 437 444 432 421 410 398 421 443 466 488 429 369 309 249 326 402 479 555 537 519 543 568 484 400 387 375 358 341 324 307 378 449 420 391 400
1494 400 409 419 428 419 409 400 390 406 421 437 452 438 423 409 394 433 472 440 407 331 254 220 186 206 226 246 266 284 303 292 324 415 420 324 228 228 313 402
1489 402 404 356 350 320 291 274 343 459 533 542 551 558 564 540 515 491 467 441 416 433 493 532 486 448 410 422 434 374 315 274 234 265 296 268 239 210 181
1485 181 233 284 379 473 536 599 591 582 535 488 541 595 598 601 601 602 565 485 384 368 406 486 529 528 461 394 367 340 378 416 411 407 439 470 502 534 517 499 525
1480 525 551 518 485 496 506 509 511 470 430 449 468 488 507 491 476 460 445 477 509 541 574 586 599 569 538 485 431 421 410 455 500 473 447 421 394 411
1476D11J7RQRRn4n4j1j1J4J4k9k9K6K6K5K6L1L1L1L1K4K3j9k0L9L8l3l3j08j08l6l7L5L5p
1471C23qK7K8m4m4K6K6K6K6J9K0J9J9N1N0m9n0j2j2j3j2j5j4K8K8M0M0l1l2p7p7K4K3J2J2
1467C77J2J2k5k6k5k5M0M1l1l0K7K7K8K7l9m0m0l9Q1Q1L8L8k8k9k8k9M3M2jjn1n2qrL3L3j0
1462D14j1M3M2%jp0p0L0L0J1J1l2l2n0n0N0N1j9j9o2o2l0l0M2M2M7M8k4k4j1j1R0Q9m7m7m7
1458B91m8Q9Q9J7J8mmmmj1j1j1j0L1L2j1j1J6J7k7k6p3p3kkl8l8L3L3M8M8M8M8K7K6K7K6q7
1453D69q8J3J2ppppj5j6N6N6kkM1M1l5l5j07j07lkM0M0n5n4j1j2N2N2N2N3O6O6non4n5j2j1
1449C94N9O0j2j1K5K4m6m7RRRQm1m1L0L1n4n4n3n4N2N2N2N1J%P1P2r7r8m5M0J4J3k4k4k0k1
1444C34N1N1POo5o6m4m5N5N6M2M2L6L7J2p4p5J2K5K4j3j3j3j4RR6P7P7m7m6n0m9K3K2k4k3
$$ plain form
1476 411 428 437 445 454 463 409 355 344 333 347 361 332 303 329 355 380 406 437 468 499 530 554 577 558 538 577 615 582 549 441 333 297 260 295 330 323
1471 323 315 342 370 326 282 308 334 360 386 405 425 444 463 514 564 515 465 453 441 428 416 401 387 415 443 483 523 492 460 383 306 330 353 365 377
1467 377 389 401 376 350 325 300 340 381 350 320 347 374 402 429 390 350 310 271 352 433 471 509 481 452 424 395 438 480 479 478 427 375 367 358 391 424 414
1462 414 403 446 488 488 487 417 347 377 407 418 429 397 365 315 265 315 366 347 328 266 204 174 144 186 228 275 323 299 275 264 253 343 432 385 338 291
1458 291 243 332 421 438 456 452 448 444 440 429 418 407 397 428 460 449 438 454 471 444 418 345 272 270 268 230 192 225 258 306 354 402 450 477 503 530 556 469
1453 469 381 394 406 399 392 385 378 363 347 403 459 457 455 496 537 502 467 360 253 250 248 288 328 273 219 208 196 248 300 352 405 471 537 532 526 472 417 405 394
1449 394 453 513 501 490 515 539 493 446 455 464 473 481 440 399 429 460 406 352 299 245 297 349 401 452 453 453 524 596 499 401 356 396 410 423 399 375 355 334
1444 334 385 436 443 449 384 318 274 229 284 340 382 424 460 497 509 435 360 372 397 421 408 395 382 368 377 473 550 627 580 534 484 435 458 480 456 433
1439D33k4k4J4J4J4J3L4L3o6o7k1k1k1k1qqqqN9N9m1m1J7J6J7J7K1K1K1K1J4J4J4J4L0L0p1
1435D90p0p0p0L0L0L5L5L6L5k7k8k7k7J6J7J6J7Q5Q6j9j04q4KK1K0l9l9L3L3m8m9M7M6K3o3
1431C89j4j5k0k1lQ3Q6%j8j7OOl6l7j8j8j8j7L5L6L6L6qqL5L5NNo7o7J5J6J5J6j8j9N3N4k4
1426D99k3k4k3n9n9J2J3%%%%oopoN3N2N2N3J2J2J2J2n7n8j0P5Nq0p8QP4L1o9o8J0RJ0RR7R7
1421E74pr3j14k9J4k9o9o8N8N8K7K7K4K4Pl6PR2M6m0j06k0L5L5klM0L9l2l2J0J0J1J0k0j9
1416D29j9k0j8j8j9j8OPl6l6O1O1qqK6O8K6n9j35m8N5N5MNMMj5j5N1N1Q9Lk0k1k4k4k4k4m6
1412C50m6K5K5L5L5rqJ9K0k4k3KKKKL9L9mmJ3J3k9l0m3m4jjO4O4J3p4n4n3J5J02J15K9p0o9
1407D37p5J0O3O3L0L0j3j3K1K1p9p9J6J7k9j16o8J7L4L5K5K5j9j8%JM9l7o8o7K7K7l7l7L4
$$ plain form
1439 433 409 385 399 413 427 440 474 507 441 374 353 332 311 290 282 274 266 258 317 376 335 294 311 327 344 361 382 403 424 445 459 473 487 501 531 561 490
1435 490 420 350 280 310 340 375 410 446 481 454 426 399 372 388 405 421 438 523 609 590 486 402 404 425 445 406 367 400 433 385 336 383 429 452 389
1431 389 375 360 340 319 316 399 485 485 467 450 456 462 426 389 371 353 335 318 353 389 425 461 453 445 480 515 520 525 458 391 406 422 437 453 435 416 469 523 499
1426 499 476 452 429 370 311 323 336 336 336 336 336 330 324 317 311 364 416 468 521 533 545 557 569 512 454 444 519 524 444 366 374 448 479 410 342 352 361 371 380 477 574
1421 574 567 474 360 331 345 316 247 179 237 295 322 349 373 397 404 368 375 467 513 473 367 347 382 417 415 412 452 491 459 427 437 447 458 468 448 429
1416 429 410 390 372 354 335 317 323 330 294 258 319 380 372 364 390 458 484 425 290 242 297 352 356 361 365 369 354 339 390 441 530 533 513 492 468 444 420 396 350
1412 350 304 329 354 389 424 415 407 426 446 422 399 401 403 405 407 446 485 481 477 490 503 474 444 401 357 356 355 419 483 496 422 368 315 330 432 547 576 506 437
1407 437 362 372 435 498 528 558 545 532 553 574 495 416 432 449 420 304 236 253 287 322 347 372 353 335 335 336 385 348 280 213 240 267 230 193 227
1403B27L5N6N6N6N5m8m9K3K2m7m7nQ1R5m8r1r2J3J3J3J3ooooJ8J9J3J3L6m9r3pN2N2p1p2P1
1398B89P2mq9o9J6O3O3M4M5k8k7j5j4j0rk4O1N6N6N4N4Kq4r5r6K8K8nnnnO1O1j0j1K5K4P3
1393E70j3o8o8jkO4O3M6m0l0N5J22L6o2o1o7o7m6m7K5K6j0rL4L4MLMLk8k8k7k8llM0M0rj0
1389D42K8K8Qp8k9l0M0M0M0M0l7l7m8L8M9l6n5n4M2M2jjj9j9K5K4J2J3n9n9LMLMj0j0j6P1
1384C98J12J11L7m9k1k1o9o9q6q7J4J4M8M8n3n2k7k8M5M4P1P1mr0q4JP2K9m6m6K3K2K2K1K1
1380C92K1NNONK7K8j5j5L3L3rj0J2J2J2J3l3l3J0N2M6m1q5m2L3L4l2l3J3N5J3p2p5J1j4n6
1375C06m4M2J14J14L1n6n0n0k8k8k8k8MLP5P5O0N9o6o7k0K2Qp7q1NN1N1j6j6K7K7m6m7m4m4
1371B38K5O8R2Pq1q0J5J5K4K5j9j8K3K3O5O6J1J1J1J1p6p7nnn9o0pP8L4L4mmnonoK6K7K6K6
$$ plain form
1403 227 262 318 374 430 485 437 388 411 433 386 339 334 415 510 462 371 279 292 305 318 331 325 319 313 307 325 344 357 370 406 357 264 257 309 361 290 218 289
1398 289 361 357 268 199 215 278 341 385 430 402 375 360 346 336 327 303 364 420 476 530 584 586 502 407 311 339 367 362 357 352 347 408 469 459 448 473 497 570
1393 570 557 489 421 420 418 482 545 591 551 521 576 698 734 672 611 544 477 431 384 409 435 425 416 450 484 488 491 495 498 470 442 415 387 384 381 421 461 452 442
1389 442 470 498 506 428 399 369 409 449 489 529 492 455 407 445 494 458 403 349 391 433 432 431 412 393 418 442 454 467 408 349 352 356 359 363 353 343 327 398
1384 398 510 621 658 609 588 567 498 429 343 256 270 284 332 380 327 275 248 220 265 309 380 451 447 357 273 274 346 375 329 283 306 328 350 371 392
1380 392 413 418 423 429 434 461 489 474 459 492 525 516 506 518 530 542 555 522 489 499 551 597 556 471 429 462 496 464 431 444 499 512 440 365 376 362 306
1375 306 262 304 418 532 563 507 457 407 379 351 323 295 299 302 377 452 512 571 505 438 418 440 448 371 290 295 346 397 381 365 392 419 373 326 282 238
1371 238 263 331 423 430 349 269 284 299 323 348 329 311 334 357 422 488 499 510 521 532 456 379 374 369 310 250 243 321 355 389 385 381 376 370 365 359 385 412 438 464
1366D64L6L6o4o4l7l7l8l7M6M6M6M6K3K3K3K3n6n7n6n7K8K8P2P1l6l5L6L6J4J3k9l0m5m6K6
1362D12K7Q0Q0QQp5p6K5K4l1l1J2J2qrrqkkm5m4L3L3l9l8J8J8O1O1%%%%o4o4o4o4P4P4L1L0
1357D48n5n5j2j2QPQPK3K3K4K3p0p0L0L1R5R5r0r1J2J2J3J2l2l2J1J1j6j6j6j6J2J1l2l1m
1352B66mm6m7N8N8J5J4J3J2N5N5l5l5l5l5L5L6L5L6j6j6j6j6n3n3j2L2L5n1n1L5O3K1PPN4
1348D21N3J1J0j2j2j2j2L8L7l3l4rrrrN6N5j3j3j9K4Rp8p5l2L8L9LL%%k2o4m8L8R6N4j7j6
1343D37l4l3l4l3O9P0K0o5n4j0L1L2K5K5j7j8j8j7K5K5N0M9k2k2m0m0m0m0l2l3O7O8J7J8J7
1339D43J7M0M0l2l2K5K5m5q9l6N0K3j9o0n9j7j6P2J16M0m6l0l0L6L7PQQQJ3J4J4J4K3K3k0
1334E65k0j3j3L0L0j0j0j1j0l9m0q2q2n5n4J03J03M3M3k9k8m3m3%Jn3n2M8M8K4K4K4K4n1n0
$$ plain form
1366 464 500 536 472 408 371 334 296 259 305 351 397 443 466 489 512 535 479 422 366 309 337 365 437 508 472 437 473 509 523 536 507 477 432 386 412
1362 412 439 519 599 607 615 540 464 489 513 482 451 463 475 467 458 449 441 439 437 392 348 381 414 375 337 355 373 434 495 495 495 495 495 431 367 303 239 313 387 418 448
1357 448 393 338 326 314 322 329 337 344 367 390 414 437 367 297 327 358 453 548 458 367 379 391 404 416 384 352 363 374 358 342 326 310 322 333 301 270 266
1352 266 262 216 169 227 285 300 314 327 339 394 449 414 379 344 309 344 380 415 451 435 419 403 387 334 281 269 301 336 285 234 269 332 353 360 367 421
1348 421 474 485 495 483 471 459 447 485 522 489 455 446 437 428 419 475 530 517 504 485 509 518 440 365 333 371 410 413 416 416 416 394 330 282 320 416 470 453 437
1343 437 403 370 336 303 372 442 462 397 343 333 364 396 421 446 429 411 393 376 401 426 476 525 503 481 441 401 361 321 289 256 323 391 408 426 443
1339 443 460 500 540 508 476 501 526 481 392 356 406 429 410 350 291 274 258 330 446 486 440 410 380 416 453 460 468 476 484 497 511 525 539 562 585 565
1334 565 545 532 519 549 579 569 559 548 538 499 459 377 295 240 186 289 392 435 478 449 421 378 335 335 336 283 231 279 327 351 375 399 423 372 322
1330C22K1K2LLM7M6m9m9m9m9Q5Q4J3J2n4n5P4P4j0rq1q1KJKJM6M6MLPPPPj3j4K9L0L8L9l4
1325E28l3p4p5K6K6L6L5qpL4L3rrj3j3n6n6MLP5P4m3m4%jn5n5j2j2L5L5L6L5O1O0j1j1k1k2
1320D96k2k1k7k6k6k6LLLLM4M4K1o5o9o9K6K6J2J3J3J2M0L9n5n5k3O3O3k3j4j5N3N2k6k6J7
1316D58J8p7p8n4L2J0J0k8k8R1R2R2R1K5K4p0p1q0OK9K9l7l8l7l7K4K4K4K4J0J1J1J0p0p1
1311C69KJk9k8l9M7M7l9k9k8O4O4K1K1N1N2N1N1q1q2o4K1Q6%m7m6L3L4J1p5o9p0N5N4L9L8
1307D86nmK2K2k0k1L0L0o6o5o3K2M6M5QRl5l5L9L8mmq6q6J5J4J7J7J7J6Q1Q0RQr6r7MLM9M8
1302D88n2n1ppL7L6L5L6l6l6L8L8L8L8q7q7m4m4MNMMJ3J3k9l0K9K8K9K9m4m4K8K7J7J7N9O0
1297E52n0n0m9n0LLLLM6M5n4n4J6J7k7k6m9m8Q0Q0qqpqmmmmO7O6mnj8j8K4K5OOo6o6NNNNN1
$$ plain form
1330 322 343 365 368 371 418 464 415 366 317 268 353 437 450 462 408 353 427 501 491 482 401 320 322 323 325 326 372 418 422 425 432 439 446 453 440 426 455 485 523 562 528
1325 528 495 421 346 372 398 434 469 461 454 488 521 512 503 490 477 421 365 369 372 447 521 478 434 434 433 378 323 311 299 334 369 405 440 501 561 550 539 518 496
1320 496 474 453 426 400 374 348 351 354 357 360 404 448 469 404 335 266 292 318 330 343 356 368 408 447 392 337 314 377 440 417 403 388 441 493 467 441 458
1316 458 476 399 321 267 299 309 319 291 263 354 446 538 629 654 678 608 537 457 463 492 521 484 446 409 372 396 420 444 468 478 489 500 510 440 369
1311 369 371 372 343 315 276 323 370 331 302 274 338 402 423 444 495 547 598 649 568 486 422 443 529 529 482 436 469 503 514 439 370 300 355 409 448 486
1307 486 481 477 499 521 501 480 510 540 474 409 346 368 414 459 467 476 441 406 445 483 479 475 389 303 318 332 349 366 383 399 480 560 569 577 481 384 388 391 440 488
1302 488 436 385 378 371 408 444 479 515 479 443 481 519 557 595 508 421 377 333 337 342 346 350 363 376 347 317 346 374 403 432 388 344 372 399 416 433 492 552
1297 552 502 452 403 353 356 359 362 365 411 456 402 348 364 381 354 328 279 231 311 391 383 375 368 360 356 352 348 344 411 477 473 468 450 432 456 481 487 493 427 361 366 371 376 381 432
1292D32N0k1k1J1J2l2l2%J%%j6j5j6j6n9o0J3J2K6K5K6K6K6K6K6K6M2M1l0l0K0K1K1K1n4n3
1287D49M6M7J4J4k9k9l1l1l1l1J6J5J6J5m5m5m6m5NNNNRJ0RJ0rqN9N8K8n9n8K8L3L4l3l3M
1283C71NMNK1K2k2k1RQRRR3R2K1K0nnn2j37j12k5N0N0MMMMM0M0J7o9p2p2ooONM8M9KJm1m1
1277C27j09j10%Q6J07J07J12J12j2j2j3j2k9k8j1P6P9pn3n4j5j6j6j6J5J5J5J5rj0L4L4K8
1273F30K9K8K9n4n4n3n4M2M2%jk8k7L8L9k1j07j07k1N6N7rj0k6k7M5M5j7j8K9J15O3k4o9p0
1269D90J7J6J7J7M2M3jjK4K3K3K4L3L3L2L3j3j4j9j9l1j16j17l1N1N0J3J3l2l2l2l3K4K3m8
1265E02m9k3k4k4k4Q3Q3Qp9m1M4O3O2l0l0l0l0L4L3j0j0k2k2k2k3J2J2N4N5O7O7O7O7N1N0
1260I21QPK3K3k0k0o8o7K7K8qr3r4p%jo6o7%%j%QQr2r2K7K6P0P0j8j7o1o1o6o7O2O2%%%%M9
$$ plain form
1292 432 482 461 440 451 463 431 399 399 400 400 400 384 369 353 337 278 218 231 243 269 294 320 346 372 398 424 450 492 533 503 473 493 514 535 556 502 449
1287 449 495 542 556 570 541 512 481 450 419 388 404 419 435 450 405 360 314 269 274 279 284 289 298 308 317 327 318 310 369 427 455 396 338 366 399 433 400 367 371
1283 371 376 380 385 406 428 406 385 394 402 411 420 513 605 626 646 641 636 584 447 335 310 360 410 414 418 422 426 466 506 523 454 382 310 304 298 304 309 357 406 408 409 368 327
1277 327 218 108 108 194 301 408 520 632 620 608 595 583 554 526 515 591 670 663 610 556 541 525 509 493 508 523 538 553 544 534 568 602 630
1273 630 659 687 716 662 608 555 501 543 585 585 584 556 529 567 606 585 478 371 350 406 463 454 444 418 391 436 481 464 446 475 590 653 629 560 490
1269 490 507 523 540 557 599 642 641 640 664 687 710 734 767 800 832 865 852 838 819 800 769 653 536 505 556 606 619 632 600 568 536 503 527 550 502
1265 502 453 430 406 382 358 441 524 532 453 412 456 519 581 551 521 491 461 495 528 518 508 486 464 442 419 431 443 497 552 619 686 753 820 871 921
1260 921 929 936 959 982 962 942 874 807 834 862 854 761 667 660 660 659 593 526 526 526 525 525 533 541 449 357 384 410 480 550 532 515 454 393 327 260 322 384 384 384 384 384 433
1255D33M8k3k3K3K3K3K3mmmmL3L4P7P6P9P8n0n0m6m5m6m5j9j8j9j8l2l2J1J1NNNMl1l2l2l2
1250C82k3k3P8P7J5J6k8k7M0M1klo2o2j9j8N3N4J0J1j8j8j8j8j0j0O1O2NNl8l8K7K6m5m5J2
1246D50J1o0o0j8j7N3N4QPQQM5M4k7k7m5m5kkR1R1M8M8mmj04j04n0n1N0N0M8M8k4k4j7j6j7
1241D44j6K5K5K6K5K1K1k1o4m5M1O1O1QPo4o3o4o4L6L6L2L2rqj4L0N7l0m7nL4j0q0q0M5Q8
1237D71M8l8j1L2P1P1K7n8p9QM9Pp0o9kM1rr6n3L4O6K3j9j9OOl5l4M2Q5J09K3m3m4n0m9L9
1232D80L8lm6m6M1O1O0l9l9l9l9qqL5L5K2K2L0n5q9m6N7J43P7rk4J8Pl6j9O6Q8Jj26j26q0
1228D04OK9K9N3N4N3N4L3L3j0j0o4o4m0M5J7J8K3K3J9K0n2n1J8J8J8J7O0N9J7J6N0N1K7n9
1224I14n2n3n2n3m4M1O5O5L2L3j0j1q9q9l7M9K9K8rrM5M5Q2Q2R5Qm3m3K8K9L3L4Q1J67J66
$$ plain form
1255 433 481 458 435 458 481 504 527 523 519 515 511 544 578 655 731 810 888 838 788 742 697 651 606 587 569 550 532 500 468 479 490 495 500 505 509 478 446 414 382
1250 382 359 336 414 491 506 522 494 467 507 548 546 543 481 419 400 382 435 489 499 510 492 474 456 438 428 418 479 541 546 551 513 475 502 528 483 438 450
1246 450 461 401 341 323 306 359 413 421 428 436 444 489 533 506 479 434 389 387 385 476 567 615 663 659 655 551 447 397 346 396 446 494 542 518 494 477 461 444
1241 444 428 453 478 504 529 550 571 550 486 441 482 543 604 612 619 555 492 428 364 400 436 468 500 491 483 469 499 556 526 479 474 508 498 418 338 383 471
1237 471 519 481 470 502 573 644 671 613 534 542 591 598 528 459 457 498 489 393 340 374 440 463 444 425 431 437 402 368 410 495 604 627 584 540 490 441 480
1232 480 518 515 469 423 464 525 585 546 507 468 429 421 413 448 483 505 527 557 502 413 367 424 567 644 635 611 629 636 600 581 647 735 736 610 484 404
1228 404 410 439 468 521 575 628 682 715 748 738 728 664 600 560 605 622 640 663 686 705 725 673 622 640 658 676 693 753 812 829 845 895 946 973 914
1224 914 862 809 757 704 660 701 766 831 863 896 886 875 786 697 660 709 738 766 757 748 793 838 920 1002 1097 1105 1062 1019 1047 1076 1109 1143 1224 1391 1557
1219A557Q1L6L6Q8J73K66L52M09M09M03M04L75K89K37J50N4q9k26l11l43l44k78k78l41l41
1216B768k86j43l8l8k6k7k7k7q2q3n9K7N2N2N7N7P3P4K5J11K04K04J38J39J67J68K39K40K68
1213D227K69K97L83M64N49P10R69J322J637J866K181K502K644K571K257J888J373N91k68j087
1210B7345j602k037k438k546k460k175j889j536j251j035q64o51m78l07k21j84r7r8r8n3n3
1208E272M7M7O3O3J34J35J74J75K75K75L73L74N30N31N44N44P29Q14R27J213J573K088K737
1205A9637L480M425N398O175O690O869O583N722M406K696N77j618l508n031o005o599o771
1203D3126o334n704m885m027l074k330j777j377j038p53n38m53l73k88k36k36k31k31j44j44
1200H953P1P0J12J12J44L16L87L88M98M98P12P12P62R34J211J497J848K363L100M073N218
$$ plain form
1219 1557 1638 1674 1710 1798 1971 2237 2589 2998 3407 3810 4214 4589 4878 5115 5265 5319 5230 5004 4693 4350 4006 3728 3450 3109 2768
1216 2768 2482 2339 2301 2263 2237 2210 2183 2156 2074 1991 1932 1959 2011 2063 2120 2177 2250 2324 2349 2460 2664 2868 3006 3145 3312 3480 3719 3959 4227
1213 4227 4496 4793 5176 5640 6189 6899 7868 9190 10827 12693 14874 17376 20020 22591 24848 26736 28109 28700 28432 27345
1210 27345 25743 23706 21268 18722 16262 14087 12198 10662 9411 8376 7512 6861 6383 6076 5855 5671 5574 5476 5378 5325 5272
1208 5272 5319 5366 5429 5492 5626 5761 5935 6110 6385 6660 7033 7407 7937 8468 9012 9556 10285 11099 12026 13239 14812 16900 19637
1205 19637 23117 27542 32940 39115 45805 52674 59257 64979 69385 72081 72658 71040 67532 62501 56496 49897 43126
1203 43126 36792 31088 26203 22176 19102 16772 14995 13618 12580 11827 11289 10836 10463 10175 9939 9703 9472 9241 9097 8953
1200 8953 9024 9094 9206 9318 9462 9778 10165 10553 11051 11549 12261 12973 13735 14669 15880 17377 19225 21588 24688 28761 33979
1198C3979O535P774Q863R394R308Q542P110N012K436n17l436n948p837q998r514r320q575
1196D4808p522o206m933l845k968k252j684j256r24p24n58m71l47l47l85l84l27l28j98j98
1193H951j24j24O2O3K37K38L15L14L75M60N84P27Q36R80J183J555K044K702L468M356N241
1191C4443O071O737O994O768N937M642K896P64j499l644n334o472p073p124o808o141n311
1189B5846m374l428k663k004j525j153q64o64n30m44m16m15l09l10k71k71k72k71k09k09n1
1186E193n2llmlJ36J36K13K13K08K94L89N89P70R69J242J556J905K221K467K667K662K461
1183B6226K004J402O75r9r11j684k288k718k863k863k642k328j965j593j211q96o82n39m52
1181D573l66k96k10k03k03j97j98k12k13j12j13j7j7j46j47q9r0j9j8j5j5j5j5Q6Q6Q6Q6J25
$$ plain form
1198 33979 40514 48288 57151 66545 75853 84395 91505 96517 98953 98436 95000 89052 81215 72217 62703 53383 44808
1196 44808 37286 31080 26147 22302 19334 17082 15398 14142 13218 12494 11936 11465 11118 10771 10386 10002 9675 9347 9149 8951
1193 8951 8827 8703 8765 8828 9065 9303 9618 9932 10307 10767 11351 12078 12914 13894 15077 16632 18676 21378 24846 29202 34443
1191 34443 40514 47251 54245 61013 66950 71592 74488 75252 73753 70109 64775 58303 51230 44106 37298 31157 25846
1189 25846 21472 18044 15381 13377 11852 10699 9835 9171 8641 8197 7781 7366 7057 6747 6476 6205 5933 5662 5453 5244 5193
1186 5193 5141 5138 5135 5131 5128 5264 5400 5613 5826 6034 6328 6717 7306 8076 9045 10287 11843 13748 15969 18436 21103 23765 26226
1183 26226 28230 29632 30307 30208 29297 27613 25325 22607 19744 16881 14239 11911 9946 8353 7142 6246 5564 5025 4573
1181 4573 4207 3911 3701 3498 3295 3098 2900 2688 2475 2363 2250 2233 2216 2070 1923 1834 1744 1725 1707 1692 1677 1662 1647 1733 1819 1905 1991 2116
1177B116J26J26J26L34L33M05M05L92L93K87K87J67Q1m6k18l72l73m26m26m09m08l37l36k20
1175B007k20j48j49r4r5r4r5l2l2l3l2k8k8k7k8l9l8L3L4L5L5qql3l3l3l3lmllJ2J2J2J3n6
1170G64n6j2j3N8N8j3j3j01j00k8k9k3k3k3k3M3M2M3M2k3k2k3k3QQl6l5l4l3O6O6L0L0m2m2
1166D88J2J2J3J2k2k3K0K1N7N7m3m3J6J5k8k7jjjjL6L6L6L6rqqqrqqqj6j7j6j6J3J4J3J4M8
1161F48M8NNk1k1r2r3l8l8O2O2J9J9k3k4l4l4L8L7LLLLm5m5Q4Q4ONo6o6jj%jK7K7K7K7l4l3
1156E32l4l4m4m5m4m5k4k5k4k5J37J36k1k1k5k4M6M7K5K5j7j8n3n2J9J9M2M2j%rrL5L4QPQ
1151E68P%%J%j1j0j1j1L4L4L3L4j4j3j4j4o0o1L9M0n2n2n1n2kjm5m5N0M9Pl6K3J09J09K3k1
1147E84K2O2K0j3L0P5P5k1k1o4o4n0m9J9K0m1q3l9M7P9L6l5l4K4K3K4K3l1l0l1l1j2j1L2L1
$$ plain form
1177 2116 2242 2368 2494 2828 3161 3566 3971 4363 4756 5043 5330 5497 5578 5532 5314 4942 4569 4143 3717 3308 2900 2563 2227 2007
1175 2007 1787 1639 1490 1396 1301 1207 1112 1080 1048 1015 983 955 927 900 872 833 795 828 862 897 932 924 916 883 850 817 784 781 777 774 771 783 795 807 820 764
1170 764 708 696 683 741 799 786 773 672 572 544 515 492 469 446 423 466 508 551 593 570 548 525 502 510 518 482 447 413 380 446 512 542 572 530 488
1166 488 500 512 525 537 515 492 512 533 590 647 604 561 577 592 564 537 536 535 534 533 569 605 641 677 668 660 652 644 635 627 619 611 595 578 562 546 559 573 586 600 648
1161 648 696 701 706 685 664 572 479 441 403 465 527 546 565 542 518 484 450 488 525 528 531 534 537 492 447 531 615 621 626 560 494 493 492 492 491 518 545 572 599 565 532
1156 532 498 464 420 375 331 286 262 237 213 188 325 461 440 419 394 370 416 463 488 513 496 478 425 373 392 411 453 495 494 494 485 476 511 545 553 560 568
1151 568 575 575 575 576 576 565 555 544 533 567 601 634 668 654 641 627 613 553 492 531 571 519 467 416 364 362 361 316 271 321 370 377 341 364 473 582 605 584
1147 584 606 668 688 675 705 780 855 834 813 749 685 635 586 605 625 584 501 462 509 588 624 589 555 579 602 626 649 618 588 557 526 514 503 535 566
1142E66J0J0l3l3j7j7j7j7J9J8J8J9k9k9M1Q5P0j5l6l7K3K3K3K3L7L7L7L6j9k0j9k0M6M5L
1138H31Kr7r6p4J2O1O0l4l5j5j6k9p2n4L2N2N2ppL7L6j2j2L1L1J3J3l0l0PQl6l6K0K1j7j7
1134E93j7O9P2j5n9j7Q2Q3K9K9K9K9L2L2j2j1K4K3m8m8q4q4J7J6O5O5l5l5r8r8k6k6onm8m8
1129D69k3k3J9K0lmL9L9K6K6K6K6J7J8k6k6m1m2L0L0LLKLO1O1l9l9O6O7P2j3OO%Jj5j6j5j5
1124G96r4r4OPonL2L2Nq2q1MO6O5q1q1m4M2Q9Q8J3p4p4J2J3J2J7J8J5J4q5q6k1k2P8P8O0O0
1120F92j1j2L5L4rrj8j8j9j8K5K6m6m6p8p7k5O1J00J01n1n1l6l7l6l6P9Q0Q4jk2k3J6J5JJ
1115F71p1p0J2J2l1l0O7O8K1o5q6%M2m3r4rO7O7k0j9j9j9L8L8mnJKJKJ9J9K0J9p9p9l6l6K4
1110C95K5R6R7L3L4L4L3J25J25J25J25Q8Q9M0M0p4j60j12j12r4r4j00j4m0m0l4l4J3J3J3J3
$$ plain form
1142 566 576 586 553 520 503 486 469 452 471 489 507 526 497 468 509 594 664 649 613 576 599 622 645 668 705 742 779 815 796 776 757 737 783 828 831
1138 831 833 736 640 566 578 639 699 665 630 615 599 570 498 444 476 528 580 573 566 603 639 627 615 646 677 690 703 673 643 650 658 622 586 606 627 610 593
1134 593 576 645 717 702 643 626 708 791 820 849 878 907 939 971 959 948 972 995 947 899 815 731 748 764 829 894 859 824 726 628 602 576 570 565 517 469
1129 469 446 423 442 462 459 455 494 533 559 585 611 637 654 672 646 620 579 537 567 597 600 603 605 608 669 730 691 652 718 785 857 844 850 856 856 857 842 826 811 796
1124 796 702 608 614 621 615 610 642 674 679 597 516 520 586 651 570 489 445 487 576 664 677 603 529 541 554 566 583 601 616 630 545 459 438 416 494 572 632 692
1120 692 681 669 704 738 729 720 702 684 665 647 672 698 652 606 528 451 426 487 587 688 637 586 550 513 477 441 520 600 684 683 661 638 654 669 670 671
1115 671 600 530 542 554 523 493 560 628 649 584 498 498 540 497 403 394 461 528 508 489 470 451 489 527 523 518 519 521 522 524 543 562 582 601 522 443 407 371 395
1110 395 420 516 613 646 680 714 747 872 997 1122 1247 1335 1424 1464 1504 1430 1270 1158 1046 952 858 758 744 704 664 630 596 609 622 635 648
1107F48j6j6o0n9J5J4RJ0Q5jq1q1J4J5k3k3%Q6Q1Q1nnm9m8L3L2L3L2M9M8M9M8N7N7R9J00R8
1102A326R8R8R8J35J36J12K7r7r7j01j02j05j04j43j42j52o5M3M3m3m2m3m2l4l3l3l3l3l3
1099F39l3l3K9K9L0K9NMl8l9J1J0l2l2k7k6k6k6j7j7K7K6J01J01K1o5m5m4m5m5N3J39J33J33
1094I30K05K04J81R5J2J2m5j31j25j24j25j25q5%nnl9l9l9l9q9q8M1M0k6k5l1N5M7M7m8m8
1091E88K1K0K1K1M1M2l1l0m7m7q4q5o7J9P2P1P0P1nr0q4KJ9K0N2N2J00J5n5n6n5n5j23l6P2
1086D39P3M7M8M7M8l7l8j9O6R9J4o5j52r7j1L5L5J6J6J6J6l9m0L2L2l8l8L4L4L8L8L8L8q7
1082F38q8j3P3N5l0j9k0j0j1N6N5L2n5m9m9JJp0p1J3J2Q3Q4L9L9mmM1M1j1r6p4p3ppO8O9K2
1077F61o4o2K4J8J9m6M1O3O4l4l4L8L8%J%JJ%J%n2n3M8M7P6P7K7K8n6j43j42n6L9L9KJJ0J1
$$ plain form
1107 648 632 616 556 497 512 526 535 545 630 629 548 467 481 496 473 450 450 536 617 698 693 688 639 591 624 656 689 721 770 818 867 915 972 1029 1128 1228 1326
1102 1326 1424 1522 1620 1755 1891 2003 2030 1933 1836 1735 1633 1528 1424 1281 1139 987 922 965 1008 965 923 880 838 804 771 738 705 672 639
1099 639 606 573 602 631 661 690 695 699 661 622 633 643 611 579 552 526 500 474 457 440 467 493 594 695 716 651 606 562 517 472 525 664 797 930
1094 930 1135 1339 1520 1615 1627 1639 1594 1463 1338 1214 1089 964 879 879 874 869 830 791 752 713 624 536 577 617 591 566 535 590 637 684 636 588
1091 588 609 629 650 671 712 754 723 693 646 599 515 430 363 382 454 525 595 666 661 571 487 489 508 528 580 632 732 747 692 636 581 526 403 367 439
1086 439 512 559 607 654 702 665 627 608 674 773 787 722 570 473 462 497 532 548 564 580 596 557 517 549 581 543 505 539 573 611 649 687 725 638
1082 638 550 537 610 665 635 616 596 586 575 631 686 718 663 614 565 566 567 497 426 439 451 534 618 657 696 692 688 729 770 759 663 589 516 509 502 570 639 661
1077 661 597 535 559 577 596 550 591 654 718 684 650 688 726 726 727 727 728 729 729 730 730 678 625 673 720 796 873 900 928 872 729 587 531 570 609 611 612 622 633
1073F33N3N3M8M7NNRJ0K1o6r2pM1M0p1p1MR1P5j1k9k9mmmmj2j2n4n5j5j5N7N7O0N9O0N9m4
1068H88m5KQ7N9k8p4p5j2j2L1L1o6o5j4P2Q1Q1J5J5l5l5L6L6n5n5l1N4L6L6P9P9Q1on7n8J
1063A077J%Jl4l4L7L8qpj3j2M8l7o0o0L4L3P2P1P5j1o3o3rrmmN4J41J35M9j5j01o4K3Q1Q2
1059A444m2m3L0L0j4j3J5J5Q6Q7J17J17L6n0p2p2K2K2O4O3O9j7o2o2MMJ0J0N2N3N8N9J5J6
1055B051O5O5O5O4L9L9lmQ4Q5jkm0m0K08K08J34j0j6j5Q9Q9Q9Q9R4R5R4R4J33J33J33J33J43
1051D384J44J44J43J76J75J76J75K44K43L30L29L30L30N30N30M68M68M67M68N52N52O03O88
1048A2649Q67J068J203J347J488J632J885K258K798L571M716O290Q445J1335J5164J9658K4070
1046A20444K7019K6511K0985J0480k889j5280k3438k6205k4744k1091j6940j3240j0176p725
$$ plain form
1073 633 686 739 787 834 839 844 853 863 884 818 726 719 760 800 729 658 662 753 828 817 788 759 755 751 747 743 731 719 665 610 595 580 637 694 754 813 873 932 888
1068 888 843 845 932 991 963 889 814 802 790 821 852 786 721 707 779 860 941 956 971 936 901 937 973 918 863 832 886 922 958 1037 1116 1197 1191 1134 1076 1077
1063 1077 1078 1078 1079 1045 1011 1048 1086 1078 1071 1058 1046 1094 1057 997 937 971 1004 1076 1147 1222 1211 1148 1085 1076 1067 1063 1059 1113 1254 1389 1438 1423 1322 1258 1281 1362 1444
1059 1444 1402 1359 1389 1419 1405 1392 1407 1422 1508 1595 1712 1829 1865 1815 1743 1671 1693 1715 1779 1842 1911 1894 1832 1770 1774 1778 1788 1798 1850 1903 1961 2020 2035 2051
1055 2051 2116 2181 2246 2310 2349 2388 2385 2381 2465 2550 2549 2547 2507 2467 2675 2883 3017 3007 2991 2976 3065 3154 3243 3332 3426 3521 3615 3709 3842 3975 4108 4241 4384
1051 4384 4528 4672 4815 4991 5166 5342 5517 5761 6004 6334 6663 6993 7323 7853 8383 8851 9319 9786 10254 10806 11358 11961 12649
1048 12649 13516 14584 15787 17134 18622 20254 22139 24397 27195 30766 35482 41772 50217 61552 76716 96374 120444
1046 120444 147463 173974 194959 205439 202550 187270 163832 137627 112883 91792 74852 61612 51436 43711
1044D3711n865m494l435k655k054j633j261r64q21p67o81n31l88k58n7J65L65M36N80P46Q90
1042B1029R81R81J078J279J443J443J291J147J124J323J710K140K590L134L724M383N167O226
1039F2193P721R868J2813J6850K2191K8346L4356L8563L9154L4832K5550J2697j452j4647
1038C29035k4977l1246l3389l2330k9722k6715k3578k0229j6699j3407j0612q294o294m662
1036D6881l356k296j634j433j615k045k443k528k324j952j515j201r72p71n27l83k74j31n5
1034A9426n5l7l7J33K76L81N25O99Q43R72J114J344J716K192K792L549M665O283Q429J1331
1031F6541J5139J9911K5093K9160K9932K5208J4417l68j5110k5669l0107k9203k5167k0226
1029G9551j5674j2003r226p097n466m140l195k513j968j530j272j125j126j067j067r39p95
$$ plain form
1044 43711 37846 33352 29917 27262 25208 23575 22314 21350 20529 19762 19081 18550 18162 17904 17847 18012 18377 18813 19393 20139 21029
1042 21029 22010 22991 24069 25348 26791 28234 29525 30672 31796 33119 34829 36969 39559 42693 46417 50800 55967 62193
1039 62193 69914 79782 92595 109445 131636 159982 194338 232901 272055 306887 332437 345134 343682 329035
1038 329035 304058 272812 239423 207093 177371 150656 127078 106849 90150 76743 66131 57837 51543 46881
1036 46881 43525 41229 39595 38162 36547 34502 32059 29531 27207 25255 23740 22539 21567 20796 20269 19886 19612 19481 19426
1034 19426 19371 19334 19297 19430 19706 20087 20612 21311 22154 23126 24240 25584 27300 29492 32284 35833 40498 46781 55210 66541
1031 66541 81680 101591 126684 155844 185776 210984 225401 225033 209923 184254 154147 124944 99777 79551
1029 79551 63877 51874 42648 35551 30085 25945 22750 20237 18269 16739 15467 14342 13216 12149 11082 10143 9348
1027I348p00n57m19l32k90k90k46k47k26l12l98l11j65j64k45k45j62j63j62j63j72j72j72
1025C035j72j03j04j04j04q4q4q4q4l4l5l4l5m7m7mmL5L5pql0l0l1l0o0n9j7j7k2k2o6o5n8
1020A420n8O6O5P6j1r1r1p5p5K5K5L9L9mnN3N3m7m7K9K9Oq0n3n3r6r7m9L7Q0oLKklj0j1j0
1016A073j1p5p5N4N4J8J8k5k5K7K7o8o7p5J1OOlmmmN5N5O1k6o1o1n8n7j8J26J69K5j31j32
1012H05l2N4M9M8N4N4l7l7POp3p4k1O5L0L1L0L1M5m0QQOOl6l7llm6m7L7L6L6L6k5k6k5k6o8
1007H26o7k5k5L0L1K4K5M2m4o8o7Q3Q4j7j7J1J1N4N4k5k6k5k6rj0rrJ5J6n6n6M3M3M2M3ON
1002I07l7l7J2J3J2J2lkklO0O1O5k0k8k8L8L9l4l3J0J0MNN6J43J09J09J20J20K01K87L96N39
998C101N94N08L79L79M51M50L65J65r9k99m99n00m68m69n06n06m77l92k73j88j59j59j30m4
$$ plain form
1027 9348 8648 8091 7672 7340 7050 6760 6514 6267 6041 5729 5331 5020 4855 4691 4446 4201 4039 3876 3714 3551 3379 3207 3035
1025 3035 2863 2760 2656 2552 2448 2364 2280 2196 2112 2078 2043 2009 1974 1927 1880 1876 1872 1907 1942 1935 1927 1897 1867 1836 1806 1746 1687 1670 1653 1631 1609 1543 1478 1420
1020 1420 1362 1428 1493 1569 1558 1467 1376 1301 1226 1251 1276 1315 1354 1350 1345 1398 1451 1404 1357 1386 1415 1421 1341 1288 1235 1139 1042 993 1030 1110 1104 1107 1109 1107 1104 1094 1083 1073
1016 1073 1062 987 912 966 1020 1038 1056 1031 1006 1033 1060 992 925 850 861 867 873 870 866 862 858 913 968 1029 1003 942 881 823 766 748 874 1043 1068 937 805
1012 805 773 827 876 924 978 1032 995 958 965 971 898 824 803 868 898 929 959 990 1035 995 1003 1011 1017 1023 987 950 947 944 898 851 888 924 960 996 971 945 920 894 826
1007 826 759 734 709 739 770 794 819 861 817 749 682 765 849 832 815 826 837 891 945 920 894 869 843 834 824 815 806 821 837 781 725 768 811 853 896 902 907
1002 907 870 833 845 858 870 882 879 877 875 872 932 993 1058 1038 1010 982 1020 1059 1025 992 1002 1012 1016 1021 1077 1220 1329 1438 1558 1678 1879 2166 2562 3101
998 3101 3695 4203 4582 4961 5412 5862 6227 6392 6293 5994 5495 4995 4527 4058 3552 3046 2569 2177 1904 1716 1557 1398 1268 1224
995A224OPJ2J1K8K7p2p3o3o2o3o3k2k2k2k2ONOOj9k0K4K3L9L9qr3q7jM5M6l0l0k9l0mnmn%
990G05%J%m0l9L3L2j6j7JQ7R9J3l3l4o0o1n4n5P8J65J16J16M4M4k8k7m1m0m1m0l2l1M0M0K2
986I47K2K2K2l0l0O5O5jq8q7jQ5Q5J9J9J3J4l0l0J2J2O1k5m3m3noM3M2N3l3o6K0O7O7O3O3
981A363J07J06M2M2J37J37L9m8j27j28o8o8l0l0p7j62j63p7k0k1j5j5M2M3R2Nk7k6J1J1J2
977A087J1l2l2J9J8K4K4kQ4J27M0j47j47p2J4P8P7P8P7J32M7l5l4j2j2O5O5J13J99K51K51
974B356K18K18J13l1j30j29j39j38j50j49j06j07j14j14j14j15p5p5l1l2%JJ%o4o3L1L1qr3
970I92r4pppm4m4n6n5mQ3N1N2j4j4Q5Q5R1Mk3k4L7L7Nq0p5p5N9O0N9N9J49J50J49J49J01J02
966A936P9qj07j06j12j13j30j29q8q7k1k2k2k1jkM2M2N8N7j4j4qqklq2LJ07J07L2n4n4L1R0
$$ plain form
995 1224 1230 1237 1249 1260 1288 1315 1243 1170 1107 1045 982 919 897 875 853 831 837 842 848 854 835 815 839 862 901 940 932 839 752 751 796 842 812 782 753 723 719 714 710 705 705
990 705 705 706 706 666 627 660 692 676 659 660 747 846 859 826 792 732 671 617 562 640 805 921 1037 1081 1125 1097 1070 1029 989 948 908 876 845 885 925 947
986 947 969 991 1013 983 953 1018 1083 1082 994 907 906 991 1076 1095 1114 1127 1141 1111 1081 1093 1105 1166 1141 1098 1055 1050 1044 1087 1129 1182 1149 1083 1103 1170 1237 1300 1363
981 1363 1470 1576 1618 1660 1797 1934 1973 1925 1798 1670 1602 1534 1504 1474 1397 1235 1072 995 975 954 939 924 966 1009 1101 1106 1079 1053 1064 1075 1087
977 1087 1098 1066 1034 1053 1071 1095 1119 1117 1201 1328 1368 1221 1074 1002 1016 1094 1171 1249 1326 1458 1505 1470 1436 1424 1412 1477 1542 1655 1854 2105 2356
974 2356 2574 2792 2905 2874 2744 2615 2476 2338 2188 2039 1933 1826 1712 1598 1484 1369 1294 1219 1188 1156 1156 1157 1158 1158 1094 1031 1062 1093 1085 992
970 992 898 891 884 877 833 789 733 678 674 757 808 860 846 832 917 1002 1093 1097 1074 1050 1087 1124 1129 1049 974 899 958 1018 1077 1136 1285 1435 1584 1733 1834 1936
966 1936 2015 2007 1900 1794 1682 1569 1439 1310 1222 1135 1114 1092 1070 1049 1048 1046 1088 1130 1188 1245 1231 1217 1209 1201 1199 1196 1114 1117 1224 1331 1363 1309 1255 1286 1376
961A376Q9J%kQ4J45K31L06L05L92L92M14L28J65l5k71m14m26m27l33k48j52j53j03j02j7j6
958A529p2p3l4N1J12J12L1L1O6O6J10J09M3M4J30J29Q4Q4Q4Q4J6J6J6J6k8k8J5J5M3M3r2r1
954B661n3R0J53J53P7P6J97L40M15M15N31O74P34N33K90J47m0k97n37o22n78m91l97l97l55
951C719k70j66q0p9q0j54j55m1M5M0L9RQQQJ0J1J1J1Q8Q9Q8Q9j8j7o5K0Q2Q1Q6Q7K5K6K6K5
947C606J29J28J29J28O6O6P1P1M8J34K43L29M36N23N52N53M77K78J6j85k75k76k45j59p6J1
944F778J19K05J77J77K68K68K54K54J68J68J18J18L2L2P1P1J66K51K29K28K34K34L51L50L51
940A1672L51M27M28M33M33N25O10O62P48Q80R66J018J018J108J251J471J728K044K301K562
938C2636K763L020L278L475L561L657L743L882M198M669N384O480Q225J0909J5003K1236L0711
$$ plain form
961 1376 1465 1466 1466 1464 1548 1693 1924 2230 2535 2927 3319 3733 4061 4226 4191 3920 3506 3080 2653 2320 2072 1920 1767 1664 1562 1545 1529
958 1529 1457 1384 1350 1401 1513 1625 1656 1687 1753 1819 1929 2038 2081 2125 2255 2384 2468 2552 2636 2720 2736 2752 2768 2784 2756 2728 2743 2758 2801 2844 2752 2661
954 2661 2608 2698 2851 3004 3081 3157 3354 3694 4109 4524 5055 5729 6463 6996 7286 7433 7393 7096 6559 5937 5359 4868 4471 4074 3719
951 3719 3449 3283 3203 3124 3044 2890 2735 2694 2739 2779 2818 2827 2835 2843 2851 2861 2872 2883 2894 2982 3071 3159 3248 3230 3213 3148 3168 3250 3331 3417 3504 3529 3555 3581 3606
947 3606 3735 3863 3992 4120 4186 4252 4323 4394 4442 4576 4819 5148 5584 6107 6659 7212 7689 7967 7983 7798 7523 7247 7002 6843 6767 6778
944 6778 6897 7102 7279 7456 7724 7992 8246 8500 8668 8836 8954 9072 9104 9136 9207 9278 9444 9695 9924 10152 10386 10620 10971 11321 11672
940 11672 12023 12450 12878 13311 13744 14269 14879 15541 16289 17169 18135 19153 20171 21279 22530 24001 25729 27773 30074 32636
938 32636 35399 38419 41697 45172 48733 52390 56133 60015 64213 68882 74266 80746 88971 99880 114883 136119 166830
936A66830M4337O1541P9268R2579R7187R3151Q5662Q0824P9458P4849N7781K5291j5357n0938
934I72463p1849p8691p9864q3613r1382r7479r5578q4101o6928m9610l5570k5465j8387j3378
933H0568r818p327n631m572l960l474l111k853k732k731k793k792k772k630k413k155j908
930A6896j708j479j279j074r30p39n39m07m06l89l88k79j93j93k79k63k63j82j82j40j40j40
928E304j40j52j52j47j47j31m4m5j30j98j99o0o1j11j11k5k5j16j15p8Pl8l9J0J0J6J6J0J1
924C120m2j27q0p9p1p1p2p1q8q8r3qO3O2j8j9l0l0o8o8m5M2P3P4J1p5o9o9l2l2l1l2m1m1K
920A857JJ2J2R7R8N8N9N8N9LLLKl2l3l3l3p9p9q5q5p3j59j59p3J3J3J8J9k5k4k4k4L6L7L7
916A475L6o9o8o9o9n2n1K8K9J6p1o5o5K5K5o1o0j1j1j1j1N1N2N2N1L6L5L6L5j12j12k6k6M2
$$ plain form
936 166830 211167 272708 351976 444555 541742 634893 720555 801379 880837 955686 1013467 1038758 1023401 972463
934 972463 900614 821923 742059 658446 567064 469585 374007 289906 222978 173368 137798 112333 93946 80568
933 80568 70750 63423 57792 53220 49260 45786 42675 39822 37090 34359 31566 28774 26002 23372 20959 18804 16896
930 16896 15188 13709 12430 11356 10426 9687 9148 8741 8335 7946 7558 7279 7086 6893 6614 6351 6088 5906 5724 5584 5444 5304
928 5304 5164 5012 4860 4713 4566 4435 4391 4346 4216 4018 3819 3759 3698 3587 3476 3451 3426 3310 3195 3117 3124 3086 3047 3057 3067 3083 3099 3109 3120
924 3120 3078 2951 2871 2792 2721 2650 2578 2507 2419 2331 2238 2230 2293 2355 2337 2318 2288 2258 2190 2122 2077 2119 2192 2266 2277 2202 2133 2064 2032 2000 1969 1937 1896 1855 1857
920 1857 1858 1870 1882 1979 2077 2135 2194 2252 2311 2314 2317 2320 2322 2290 2257 2224 2191 2112 2033 1948 1863 1790 1631 1472 1399 1412 1425 1443 1462 1437 1413 1389 1365 1401 1438 1475
916 1475 1511 1442 1374 1305 1236 1184 1133 1161 1190 1206 1135 1070 1005 1030 1055 994 934 923 912 901 890 941 993 1045 1096 1132 1167 1203 1238 1126 1014 988 962 1004
911A004M3j%q0q0NOK7K8K7K7q1q1q1q1K6K6j6j7P0O9p3p3JJJJO0O0O0O0j4j4j4j5J8J8o8o7
907G82q1q0O3O2nnnoJ8J8J8J8j5j4j4j5K2K2K2K2J9J9K0J9QQl5l5n4n3L2L2m1m1M5M5K6K6
902H67j7j7jjkjm1m0m1m1k5k5J7J8P1P1j4j5K5K5j8j8o5o6K1K0M3M2M3M2k2k3k3k3l7l7L4
897G26L4lllmj0j1K7K7J7o9o9J8%Jm3M4J14J15j0rklklr1r1l9M7OOM9M9K6n9o5K2N8k7m5m4
892F81K2K2K2K2K2K1J6J7Mq1j24l9JJm2M4J19J18J4p1m1m0lkm8m7nmQRo3o3J9J9O2O2N3N3
888G58j9j8m7m6rrK2o5o4K2M3M4POP7P6NNK2K2n0n0L0L0L0K9J0J1l3l3J4J4J4J5O7O8l2l2
883I34M6M7M7M6j0j1j6P0Q1Q1Q7Q7K4K4k4k4J29M4J1J55K17K16J84L85O14O15P88J390K445
880H682M248P261J0381J0363M953l810j0251j0859p338l904k443j895j237o75n90o27l69j23
$$ plain form
911 1004 1047 1046 1046 966 886 891 897 924 952 979 1006 925 844 763 682 708 734 718 701 771 840 767 694 695 696 697 698 758 818 878 938 924 910 896 881 899 917 849 782
907 782 701 621 684 746 741 736 731 725 743 761 779 797 782 768 754 739 761 783 805 827 846 865 885 904 912 920 885 850 796 743 775 807 766 725 770 815 841 867
902 867 850 833 832 831 829 828 787 747 706 665 640 615 632 650 721 792 778 763 788 813 795 777 712 646 667 687 730 772 815 857 835 812 789 766 729 692 726
897 726 760 757 754 751 747 737 726 753 780 797 728 659 677 677 678 635 679 793 908 898 889 887 884 882 879 788 697 658 705 711 717 766 815 841 782 717 739 797 770 725 681
892 681 703 725 747 769 791 812 828 845 849 768 644 605 606 607 565 609 728 846 860 789 748 708 705 703 655 608 603 599 607 616 553 490 509 528 590 652 705 758
888 758 739 721 674 628 619 610 632 567 503 525 568 612 619 625 702 778 783 788 810 832 782 732 762 792 822 851 861 872 839 806 820 834 848 863 930 998 966 934
883 934 980 1027 1074 1120 1110 1099 1083 1153 1234 1315 1402 1489 1513 1537 1513 1489 1618 1662 1673 1828 2045 2261 2445 2830 3444 4059 4847 6237 8682
880 8682 12930 20191 30572 40935 45888 42078 31827 20968 13630 9726 7283 5388 4151 3476 2886 2259 1890 1767
877A767k08k89j47J1J1k6k6L2n5j13L0J21L6j05j04rj0jkkkm5m6klppR4R3l1l1l1l1j4j3N8
873H93N8j6j7Q4Q4K9K9K15K15L72L72N01N02N14N14M42M43L39L38K57N6j30k74l43m30n21
870D526n21n27n27m06m06k78k78j70j70j3j3j8j9j9j9p7p6l4l4M2M2l0k9p9p8l6l6NNNNpq
866G22qpj0rL3L4J1J2J2J2qqL4L5p5p5l3l2qpR2R3j9j9j4j4k8N7N3N2j2j2Q8Q8K2K3K2K3l4
861A086l4j00j00p8QQ8Q9llM0M0RJ0P6P6l2j18p0p0p4p5k7N8L1n5p2p2lkklj7j7K0K0l6j22
856D66p9PN3N4p0p0j0rL4L4O5O5K2K2k9k9k9k9k6k6J6J7K4K4K9n7p8p8J7J6l3l3O8O7N3N3
852E21m7m8m7m7K4K4L4L5L4L4L2L2P5P5m8m9m8m9L6L5qqq2q3P4P5K2K1K2K2j0j1q2q2qqrq
847D45rrL4L4l1l1J2J3m2m1JKk6k6J7J7K6K5K5K5N0N0PPN0N1m9n0l7l8OOj0j0rj0j4j4N8N8
$$ plain form
877 1767 1559 1270 1123 1134 1145 1119 1093 1125 1070 957 987 1108 1144 1039 935 926 916 915 913 911 909 864 818 816 813 806 799 893 986 955 924 893 862 848 835 893
873 893 951 935 918 1002 1086 1115 1144 1359 1574 1946 2318 2819 3321 3835 4349 4791 5234 5573 5911 6168 6224 6094 5820 5477 5047 4526
870 4526 4005 3478 2951 2545 2139 1861 1583 1413 1243 1230 1217 1199 1180 1161 1142 1065 989 955 921 963 1005 975 946 867 789 753 717 722 727 732 737 730 722
866 722 714 707 697 688 721 755 766 778 790 802 794 786 820 855 780 705 672 640 632 625 717 810 791 772 758 744 716 773 826 878 866 854 942 1030 1052 1075 1097 1120 1086
861 1086 1052 952 852 774 782 870 959 956 953 993 1033 1042 1052 1128 1204 1172 1054 984 914 840 765 738 796 827 772 700 628 625 623 621 618 601 584 604 624 588 466
856 466 387 394 447 501 431 361 351 342 376 410 475 540 562 584 555 526 497 468 442 416 432 449 473 497 526 469 391 313 330 346 313 280 348 415 468 521
852 521 474 426 379 332 356 380 414 449 483 517 549 581 656 731 683 634 586 537 573 608 600 592 510 427 501 576 598 619 641 663 653 642 560 478 470 462 453 445
847 445 436 427 461 495 464 433 445 458 416 375 376 378 352 326 343 360 386 411 436 461 511 561 568 575 625 676 627 577 540 502 508 514 504 494 485 475 461 447 505 563
843E63l8l8L4L3K1K1n0n1j9j9j9j9n7n6J6J5M9M8ONNOM8M8LLl9m0j0j0O2O1l9m0L2L2J6J7
838F00J7J6JKM4M4m4m3K7K8k5k5k5k5l8l7NOL1L2j2j1k2k1J02J01K7n9n9K7K4K4K4K4M2m4
833G58l9l8l3l2J3J00O3k2m1m1k6k6k6k5M0M0lkQRQRJ9K0J9J9j1j2K6K6L9m6m1m1N7N8J4J5
829H55LMMML8L9L8L9k2k2k3k2j5j5j4j5%%M4M3K7K7K7K7KJJ9J05O4k3m0m0NOl8l7llllL6L6
824A155opJ5J4J4J5N6N7o7o7n8K9M6M6L4n2m7m7M9N0OPmmR5R6O8O8o0o1m8m9nn%%m2m3j1j1
819A226j2j1n4n4J7J7jjm5m4L8L9nnj9j9N3N3L8L9o2o1M3M3M3M3m7m7K4K5L5L6l7l6j1j1j1
814A219j2l3l4J0Rn4n3M6M7J4J5k9k8NOl7l7L8L8L8L9j0rj0rR8R8N5N5P3P2k7k7K3K2k0k0
810A571j91j91j20j20j4j4n7n7n5n4M6M5J4J4N6N7J3J4k9k9k3k3k3k3n0n0K2K2k3k3k3k3J1
$$ plain form
843 563 525 487 521 554 575 596 546 495 476 457 438 419 362 306 322 337 386 434 440 445 450 456 504 552 555 558 519 479 469 459 521 582 543 503 535 567 583 600
838 600 617 633 634 636 680 724 680 637 664 692 667 642 617 592 554 517 522 528 559 591 579 568 546 525 627 728 755 696 637 664 688 712 736 760 802 758
833 758 719 681 648 616 629 729 792 770 729 688 662 636 610 585 625 665 662 660 668 677 685 694 713 733 752 771 760 748 774 800 839 793 752 711 768 826 840 855
829 855 858 862 866 870 908 947 985 1024 1002 980 957 935 920 905 891 876 876 876 920 963 990 1017 1044 1071 1073 1074 1093 1198 1262 1239 1199 1159 1164 1170 1132 1095 1092 1089 1086 1083 1119 1155
824 1155 1149 1142 1157 1171 1185 1200 1256 1313 1246 1179 1121 1150 1196 1242 1276 1224 1177 1130 1179 1229 1235 1242 1238 1234 1329 1425 1493 1561 1501 1440 1392 1343 1338 1333 1333 1333 1291 1248 1237 1226
819 1226 1214 1203 1149 1095 1112 1129 1128 1127 1082 1038 1076 1115 1110 1105 1086 1067 1120 1173 1211 1250 1188 1127 1170 1213 1256 1299 1252 1205 1229 1254 1289 1325 1288 1252 1241 1230 1219
814 1219 1207 1174 1140 1150 1159 1105 1052 1098 1145 1159 1174 1145 1117 1122 1128 1091 1054 1092 1130 1168 1207 1197 1188 1178 1169 1267 1365 1420 1475 1548 1620 1593 1566 1589 1611 1591 1571
810 1571 1380 1189 1069 949 935 921 864 807 752 698 744 789 803 817 873 930 943 957 928 899 876 853 830 807 757 707 729 751 728 705 682 659 670
806F70J1o0o1q2q3J8J7Q4Q5j6j6j8j9N3N3lmllK0K1k2k2JJp1p1N7N6J3J4k2k1LP5J12J2q5
801F94q5J0J1J0J0O3O3K0K0M4M3n8j00l8L3J7k6qL4N0k1m7mJ0J0j9j9N2N2L9L9mml3l3l3l3
797G59k2k2o1o0J2Q4O6K2k7p0m6K6M8M7k0j9k7k7p0p0m3m4Q6Q5P5P6MMmmmlJ8J9k5k4l8l7
792F64NOL8L7nnP6P7NNK3K3O3O3m9r2n6M5J35R3Oo5o4o3k5J8K9m2r9r9j2j3j2j2L0L0l6l7
787F85L7J23Q0oo2o2o8o7K2K3Mq1p0J6O3O3L3L2P6P5%jl8l8J2R9R8J3j7j7J06J06J19J19j0
783A467j0n3n3j0j1k6k6p0o9k7k8k7k7p5p4llNNr5r5rrL4L5M4M4k8k8M0L9L9M0L4L4rrK1K1
778A028K2K1n6n6l4N3R0R0k8k8j8O8K1K0l2l1k6k6oQ0L1L1QQPQK2K2K7n8j20j19k5k5j8j8
774I33K4K5POPPK0K0K0K0J8J7J8J7%j%jLKLKNNONj1j0L2L3n7n7J5J4k1k2k2k2n9n9o0n9ll
$$ plain form
806 670 681 621 560 478 395 413 430 514 599 583 567 549 530 583 636 633 629 626 623 643 664 642 620 621 622 551 480 537 593 606 620 598 577 580 655 767 779 694
801 694 609 619 630 640 650 713 776 796 816 860 903 845 745 707 740 757 731 723 757 807 786 739 735 745 755 736 717 769 821 860 899 895 891 858 825 792 759
797 759 737 715 654 594 606 690 756 778 751 681 635 661 709 756 736 717 690 663 593 523 480 436 522 607 682 758 762 766 762 758 754 751 769 788 763 739 701 664
792 664 669 675 713 750 745 740 816 893 898 903 926 949 1012 1075 1026 934 878 923 1058 1151 1157 1092 1028 965 940 958 987 945 846 747 735 722 710 698 728 758 722 685
787 685 722 845 925 919 857 795 727 660 682 705 709 628 558 574 637 700 733 765 841 916 916 915 877 839 851 950 1048 1061 1044 1027 1133 1239 1358 1477 1467
783 1467 1457 1404 1351 1341 1330 1304 1278 1208 1139 1112 1084 1057 1030 955 881 878 875 880 885 790 695 686 677 711 746 790 834 806 778 818 857 896 936 970 1004 995 986 1007 1028
778 1028 1050 1071 1015 959 925 978 1068 1158 1130 1102 1084 1152 1173 1193 1161 1130 1104 1078 1072 1152 1183 1214 1222 1230 1237 1245 1267 1289 1316 1258 1138 1019 994 969 951 933
774 933 957 982 989 995 1002 1009 1029 1049 1069 1089 1107 1124 1142 1159 1159 1158 1158 1157 1160 1162 1165 1167 1172 1177 1183 1188 1177 1167 1199 1232 1175 1118 1133 1147 1126 1104 1082 1060 1001 942 882 823 820 817
768H17m6m6L7L6P9Q0j4j4j3j4P5P5n4n4k6k6J7J7jkm5m4N7N7N8N7M2M2NMP7J62J29j5p2J4
764A451J43J42P4P4L2L1o6o5j09j08m3m3q6q6l4l4p7p6j14j14j4j3m3m2L0K9JKM4M4j3j3L0
760I34L0L0L0j3j3k3k4J9K0M4M5KJppO4O4J05J05NMM4M4Q7Q7P7P6J20J19K7K6j02j02q4q4
756A750m1m1l5l5j35j35k0k1k0k1n1n0qqk5k5k4k5K7K7K7K8m5m4jjK8K9K8K9J4J4J4J5P3P3
751A365k7k6j%M2M3M3M3M4M3j1j0R0Q9O2O2j0ro4o3L7L7J2J3N5N6n6n6n5n6j1j1j1j1o1o0
747A527j7j7PPN0M9k5k6M6M6j0j0j09j10j2j2J17J17M7M7MNj7j7K6K6NNo7o7M1M0J12J13K3
743A944K4K4K3P1P0kjM1M0kkO7O8M4m2j15j15o8J7Q3Q4K2K2oP9J03J03R0R0J33J33N2N3J4
738C141J5o2K4J61J62J06J06J49J49J89J90K32K33K91K92M20M20L83L84M40N26N59O44P73
$$ plain form
768 817 771 725 762 798 877 957 943 929 916 902 977 1052 998 944 918 892 909 926 925 923 878 834 891 948 1006 1063 1105 1147 1152 1156 1233 1395 1524 1509 1437 1451
764 1451 1594 1736 1810 1884 1916 1947 1881 1816 1707 1599 1556 1513 1427 1341 1307 1273 1196 1120 1006 892 878 865 822 780 810 839 840 842 886 930 917 904 934
760 934 964 994 1024 1011 998 975 951 970 990 1034 1079 1081 1082 1075 1068 1132 1196 1301 1406 1411 1415 1459 1503 1590 1677 1754 1830 1950 2069 2096 2122 2020 1918 1834 1750
756 1750 1709 1668 1633 1598 1463 1328 1308 1287 1267 1246 1195 1145 1137 1129 1104 1079 1055 1030 1057 1084 1111 1139 1094 1050 1049 1048 1076 1105 1133 1162 1176 1190 1204 1219 1292 1365
751 1365 1338 1312 1311 1311 1353 1396 1439 1482 1526 1569 1558 1548 1638 1727 1789 1851 1841 1832 1768 1705 1742 1779 1791 1804 1859 1915 1859 1803 1748 1692 1681 1670 1659 1648 1587 1527
747 1527 1510 1493 1500 1507 1557 1606 1581 1555 1601 1647 1637 1627 1518 1408 1396 1384 1501 1618 1665 1712 1716 1721 1704 1687 1713 1739 1744 1749 1682 1615 1656 1696 1808 1921 1944
743 1944 1968 1992 2015 2086 2156 2154 2153 2194 2234 2232 2230 2297 2365 2409 2367 2252 2137 2069 2086 2169 2253 2275 2297 2291 2370 2473 2576 2666 2756 2889 3022 3074 3127 3141
738 3141 3156 3094 3118 3279 3441 3547 3653 3802 3951 4140 4330 4562 4795 5086 5378 5798 6218 6601 6985 7425 7951 8510 9154 9927
736I927J031J292J550J932K420K938L367L611L468K776J660L68q06j773k375k614k529k347
733B3896k089j781j409j141r40q83p98o89n47m30k87j81j81j44n8J6J03J65J65K45L32L95
731A3759L96N28P28R05R92J043J186J365J565J718J862J951J950J907J906J999K199K467K781
728D3207L211L640M031M345M724N039N294N380N304M990M305L245J818J86j504l136m409n125
726H4545n352n152m772m229l715l286k946k746k524k266k030j830j639j497j417j331j223
724C6590j079r22q36o96n54l17j17L3J77L91P06J005J262J502J818K096K296K284K284K317
722E0240K461K716L031L562M221M954N613O232O833P284P599P673P586P240O466N313L852
720A42876K168L06j543l346n024o484p621q165q143p657o893n948n047m274l723l409l197
$$ plain form
736 9927 10958 12250 13800 15732 18152 21090 24457 28068 31536 34312 35972 36340 35534 33761 31386 28772 26243 23896
733 23896 21807 20026 18617 17476 16536 15653 14855 14166 13619 13189 12902 12721 12540 12396 12338 12354 12457 12622 12787 13032 13364 13759
731 13759 14155 14683 15411 16316 17308 18351 19537 20902 22467 24185 26047 27998 29948 31855 33761 35760 37959 40426 43207
728 43207 46418 50058 54089 58434 63158 68197 73491 78871 84175 89165 93470 96715 98533 98719 97215 94079 89670 84545
726 84545 79193 74041 69269 65040 61325 58039 55093 52347 49823 47557 45527 43697 42058 40561 39144 37813 36590
724 36590 35511 34589 33753 33057 32503 32186 32069 32102 32279 32670 33376 34381 35643 37145 38963 41059 43355 45639 47923 50240
722 50240 52701 55417 58448 62010 66231 71185 76798 83030 89863 97147 104746 112419 120005 127245 133711 139024 142876
720 142876 145044 145350 143807 140461 135437 128953 121332 113167 105024 97367 90474 84526 79479 75205 71482 68073 64876
717F4876l055k909k824k723k523k299k156k021j934j804j660j557j471j325j124r96q52o48
715C0995l91p3K43N66Q23R51R51Q73J017J237J437J710K140K741L399L981M639N426O199O837
713G5701P152O984O268N042L698K566J736J189O46j53j498l422n568p454q513q642p926o763
711F1043n589m693l978l380k893k615k414k107j849j683j596j529j529j527j527j474j330
709A9330j257j171j042q99p62o75o10o10n45m59l68k25j40n4P3J59J69J70L09M52N35N36P22
706A3638R81J295J668K108K651L269L870M435M808M682L852K367L92j775l750n020n392n108
704B8971m507l766l050k401j915j525j152q88o88o05n19m75l89l60l60l94l95l22l23j79j79
701D579j36j37k00k01j57j58m5m5q9q8J5J4J5J5J0Rr0r1p7p7nnpoJ22J23NONNo8o8j11j11
$$ plain form
717 64876 61821 58912 56088 53365 50842 48543 46387 44366 42432 40628 38968 37411 35940 34615 33491 32495 31643 30995
715 30995 30604 30531 30774 31340 32163 33114 34065 34938 35955 37192 38629 40339 42479 45220 48619 52600 57239 62665 68864 75701
713 75701 82853 89837 96105 101147 104845 107411 109147 110336 110982 110829 109331 105909 100341 92887 84374 75732 67806 61043
711 61043 55454 50761 46783 43403 40510 37895 35481 33374 31525 29842 28246 26717 25188 23661 22134 20660 19330
709 19330 18073 16902 15860 14961 14199 13524 12914 12304 11759 11300 10932 10707 10567 10513 10586 10745 10914 11084 11393 11845 12380 12916 13638
706 13638 14619 15914 17582 19690 22341 25610 29480 33915 38723 43405 47257 49624 50016 48241 44491 39471 34079 28971
704 28971 24464 20698 17648 15247 13332 11807 10655 9767 9079 8474 7955 7480 7091 6731 6371 5977 5582 5260 4937 4758 4579
701 4579 4443 4306 4106 3905 3748 3590 3545 3500 3411 3323 3338 3352 3367 3382 3392 3401 3311 3220 3143 3066 3061 3056 3049 3043 3165 3288 3293 3299 3304 3309 3241 3173 3062 2951
697B951j47j46m5m6K3K4j9j9o3o2L8L8K4K3p7p6m1m0m0m0J0J0O3J35J30K9l7OM3%p3p4lmm
693B491lM9N0OPl0l0j02j02j34j33r1r1j9j8j9j8N4N4J2J1n0m9n0m9L4L4rrl8l9L4L3l3l4
688A719J0N3np6p6nK9j3n2rJ0J1J3J3P9P8L5L6ONo1o1jP1P3P4jjj01j01j36j35o4o3K0K1k3
684A372k3j6j7K6K6K5K4K5K4j7j6j7j7P4P3k6p0m2K9L0K9m5m5m5m4lkkkO3O3qrL8L7L7L8K8
679A595K9K8K9l4l4j06j05j4j3N8N8%jM2M3M0M1l2l1k4k5J8J8J10J11L9L9O2O2M0M1O1O1J9
675B225J8KJKJj9j9K4K4nnp7p7l4l5j05j06N7N7L5L6q4q4j2j3Q0Q1QRr3r4k1k2L2L2j1j1M8
670A845M8NNO7O6nnQQJ09J08J08J07J08J08O3O2M1M1O3O2K0J9M3M3k8k9n1n1n1n1J1J1r0q9
666B729j14j14M3M4N3N3N3N4N5N6m5m4K7K8j5j5K4K4j05j04j9j9N2N3k0k0q7q6PR2J16J16
$$ plain form
697 2951 2804 2658 2613 2567 2590 2614 2595 2576 2513 2451 2489 2527 2551 2574 2497 2421 2380 2340 2300 2260 2270 2280 2343 2478 2608 2637 2600 2606 2649 2649 2576 2502 2499 2495 2491
693 2491 2488 2537 2587 2593 2600 2570 2540 2438 2336 2202 2069 1978 1887 1868 1850 1831 1813 1867 1921 1933 1944 1894 1845 1795 1746 1780 1814 1805 1796 1758 1719 1753 1786 1753 1719
688 1719 1729 1782 1777 1701 1625 1620 1649 1636 1584 1575 1585 1596 1609 1622 1701 1779 1814 1850 1856 1861 1800 1739 1738 1809 1882 1956 1955 1954 1853 1752 1616 1481 1417 1354 1374 1395 1372
684 1372 1349 1333 1316 1342 1368 1393 1417 1442 1466 1449 1433 1416 1399 1473 1546 1520 1450 1408 1437 1467 1496 1451 1406 1361 1317 1314 1312 1310 1308 1371 1434 1426 1417 1455 1492 1529 1567 1595
679 1595 1624 1652 1681 1647 1613 1507 1402 1388 1375 1433 1491 1491 1490 1532 1575 1615 1656 1624 1593 1569 1544 1562 1580 1690 1801 1840 1879 1941 2003 2043 2084 2145 2206 2225
675 2225 2243 2245 2246 2248 2249 2230 2211 2235 2259 2254 2249 2172 2095 2061 2026 1921 1815 1872 1929 1964 2000 1916 1832 1820 1807 1887 1968 1976 1985 1892 1798 1777 1755 1787 1819 1808 1797 1845
670 1845 1893 1898 1903 1970 2036 2031 2026 2034 2042 2151 2259 2367 2474 2582 2690 2753 2815 2856 2897 2960 3022 3042 3061 3104 3147 3119 3090 3039 2988 2937 2886 2897 2908 2818 2729
666 2729 2615 2501 2544 2588 2641 2694 2747 2801 2856 2912 2867 2823 2850 2878 2863 2848 2872 2896 2791 2687 2668 2649 2701 2754 2734 2714 2627 2541 2548 2640 2756 2872
662B872M2M1J13J13J35J35R1R2J41J41R0Lkkl0j17j19j19n3n3j3j2j3j3j34j35j40n4L7L7
658C074j%on%%Q8J75J35rk0k0M2M2LLQ4J69J44J44M0m6j29j29r2r1r3r4r3r4l4l5L2L2J3p2
654C157p3J4J09J09L4n2m8m8j1j1P9P9k1k2J0J1l3l3k9k9m7j32j30m5K8n9j08k3J10J09N8
650B953N8J24J24R5J0J5J5O3O4qqJJm1m2m4m4k2k2k0j9q5q6n2L3L1L1O7J09L6m9q3l9k1j06
646C039j54j54p9PPOJ2J2j2j2j2j2j8j8j8j8M7M7Nl7j3P3R0M6j3j4j6j6nonnJ7J7M7M%Q5O2
641B986J9K4O7M6M5P8J63J64P7j1j1j9j9j23j66j19l3M6M6m9m9m3m2J%N2N1N2N2n0n0K1O4
637C270M1m4m2M4P1P2j8j8P4J60J62P7Q1J24J43N7J6J5J1J0j%P0P1P3P2J44J45J21J22J22
633E245J21J11J11J82K24J95J09O1J8QR4J72J71J17J16J59J59K15K16K15K15K09K08J65J65
$$ plain form
662 2872 2914 2955 3068 3181 3316 3451 3542 3634 3775 3916 4006 4009 4007 4005 3975 3858 3739 3620 3567 3514 3501 3489 3476 3463 3329 3194 3054 3000 3037 3074
658 3074 3073 3073 3067 3062 3062 3062 3150 3325 3460 3451 3431 3411 3453 3495 3498 3501 3585 3754 3898 4042 4082 4036 3907 3778 3686 3595 3502 3408 3315 3221 3187 3152 3184 3216 3229 3157
654 3157 3084 3098 3207 3316 3350 3298 3250 3202 3191 3180 3259 3338 3317 3295 3305 3316 3283 3250 3221 3192 3145 3013 2883 2838 2866 2807 2699 2676 2786 2895 2953
650 2953 3011 3135 3259 3354 3364 3379 3394 3457 3521 3513 3505 3506 3507 3466 3424 3380 3336 3314 3292 3272 3253 3168 3082 3030 3063 3094 3125 3192 3301 3337 3288 3205 3166 3145 3039
646 3039 2885 2731 2652 2659 2666 2672 2684 2696 2684 2672 2660 2648 2630 2612 2594 2576 2623 2670 2675 2638 2625 2698 2788 2834 2821 2807 2791 2775 2770 2764 2759 2754 2771 2788 2835 2839 2839 2924 2986
641 2986 3005 3029 3096 3142 3187 3265 3428 3592 3669 3658 3647 3628 3609 3486 3320 3201 3168 3214 3260 3211 3162 3119 3077 3078 3078 3130 3181 3233 3285 3235 3185 3206 3270
637 3270 3311 3267 3225 3269 3340 3412 3394 3376 3450 3610 3772 3849 3930 4054 4197 4254 4270 4285 4296 4306 4305 4305 4375 4446 4519 4591 4735 4880 5001 5123 5245
633 5245 5366 5477 5588 5770 5994 6189 6298 6359 6377 6385 6479 6651 6822 6939 7055 7214 7373 7588 7804 8019 8234 8443 8651 8816 8981
630H981J90J89L47L47L64L64M64M64M26M27N84N84O20O19O74Q16R67J053J045J132J245J389
628B3291J518J603J645J788J963K163K320K406K509K652K787K872K794K651K387K073J664
626F1086J121N52m9o76j276j729k102k400k658k781k781k717k717k645k502k300k100j928
623B9398j785j598j456j398j312j240j098j011r26q21p36o48n62n61n62n96n96o58o58n13
621A0663l69l21l21m19m18m19m19k80k80j23j23j43j43k15k15m1m1KKM9M8R2R1j06j07o3o4
618F317r1r1j63j63q8q8q8q8p6p6p5p6m1m1N9N9R0Q9J8J8M7M6M7M6k6k5J1J2p6j61j85j85
614D956j54j53LML5L4L4L4k1k1k1k1o4o4k1k2R3R3P4j1l5N2R8R8ppL6L6M7M6M7M6Q0P9L2L1
609E466n2j37j61j60q5q4q5q5q1q1j0j0L7L7Q0Q0M9M9M4M4L3n4r1nJ03J89P4o9j75q9L9M0
$$ plain form
630 8981 9171 9360 9707 10054 10418 10782 11246 11710 12136 12563 13147 13731 14351 14970 15644 16460 17427 18480 19525 20657 21902 23291
628 23291 24809 26412 28057 29845 31808 33971 36291 38697 41206 43858 46645 49517 52311 54962 57349 59422 61086
626 61086 62207 62759 62710 62034 60758 59029 56927 54527 51869 49088 46307 43590 40873 38228 35726 33426 31326 29398
623 29398 27613 26015 24559 23161 21849 20609 19511 18500 17574 16753 16017 15369 14807 14246 13684 13088 12492 11834 11176 10663
621 10663 10294 9973 9652 9233 8815 8396 7977 7697 7417 7294 7171 7028 6885 6670 6455 6414 6373 6375 6377 6426 6474 6566 6657 6551 6444 6381 6317
618 6317 6226 6135 5972 5809 5721 5633 5545 5457 5381 5305 5230 5154 5113 5072 5131 5190 5280 5369 5387 5405 5452 5498 5545 5591 5565 5540 5551 5563 5487 5326 5141 4956
614 4956 4802 4649 4652 4656 4691 4725 4759 4793 4772 4751 4730 4709 4645 4581 4560 4538 4631 4724 4798 4787 4752 4804 4902 5000 4993 4986 5022 5058 5105 5151 5198 5244 5324 5403 5435 5466
609 5466 5414 5277 5116 4956 4871 4787 4702 4617 4536 4455 4445 4435 4472 4509 4589 4669 4718 4767 4811 4855 4888 4834 4743 4738 4841 5030 5104 5035 4860 4771 4810 4850
605D850K0K0K1K0qpqpm1m1l5l6o1K4J34J33O5O5O5O6J00J00J00J00O1O1O1O2Q6Q6Q7Q6O4O4
601F357O4O4j1j1j1j1QQQQp3p3n1L6Q1Q1Q7Q6J0RJ10J10R2R2R2R2J06J05J54J54J70K56L08
597H507L09K22K22K99M43N33N33O60P46Q41R84J149J235J213J012Q13O69N08L08J68J68J87
594B1729J86K58K58L32L31K83J40k1k1p3p3j28j27j28j27k28k28r0ml3l4M9J92L01L02M45
591B3491N88O76O76P08P94Q13Q14Q68J070J274J360J396J395J490J489J489J489J500J500
589D4880J500J500J446J445J368J369J237J151R99P99N43L43J54J1j85l85m90m91l75k90l02
586E6227k17p3J27L78N21N22M36K68J25N1l6j01k45l84l83l88l87l47k62k14k15k06o4J29
583E5262L28M94O93R19J234J542J800K029K172K274K359K401K401K351K266K152J952J752
$$ plain form
605 4850 4870 4890 4911 4931 4923 4916 4908 4901 4860 4819 4784 4748 4687 4711 4845 4978 5043 5108 5173 5239 5339 5439 5539 5639 5700 5761 5822 5884 5970 6056 6143 6229 6293 6357
601 6357 6421 6485 6474 6463 6452 6441 6449 6457 6465 6473 6400 6327 6276 6312 6393 6474 6561 6647 6657 6666 6776 6886 6978 7070 7162 7254 7360 7465 7619 7773 7943 8199 8507
597 8507 8816 9038 9260 9559 10002 10535 11068 11728 12474 13315 14299 15448 16683 17896 18908 19721 20390 20898 21206 21374 21542 21729
594 21729 21915 22173 22431 22763 23094 23377 23517 23496 23475 23402 23329 23201 23074 22946 22819 22591 22363 22273 22269 22236 22202 22251 22443 22744 23046 23491
591 23491 24079 24755 25431 26139 26933 27746 28560 29428 30498 31772 33132 34528 35923 37413 38902 40391 41880 43380 44880
589 44880 46380 47880 49326 50771 52139 53508 54745 55896 56895 57694 58237 58580 58734 58745 58560 58175 57685 57194 56819 56529 56227
586 56227 56010 55937 56064 56442 56963 57485 57921 58189 58314 58365 58329 58228 57983 57599 57216 56828 56441 56094 55832 55618 55403 55197 55133 55262
583 55262 55590 56084 56777 57696 58930 60472 62272 64301 66473 68747 71106 73507 75908 78259 80525 82677 84629 86381
581H6381J495J268J012P49M92L53K68J95J95J32M6j74m89q14j130j453j711j941j942j757
579H1175j499j197r96p39m81k08o4PPJ54J54J47O1n2j38k90m34n02n01n81n80n81n80n58n58
576G1166m87l43k40r6J18K61K91K05J07J07m1k40k71k71k10k10lL13O11Q11R44J087J032Q89
573G5530P12P11O33M90L65L64L21K36O9j7r6j81l29m71o20q20j099j414j629j886k167k310
570F6392k315k314k225k225k085j885j672j472j364j221r67p67o74n88m98l55k76j90p9J21
568D3341K57L43M02M88N67N67P23R23J164J251J304J390J402J317J119R76Q05N47L04J03j9
565E9274j06k80m81o38p82q66r51j053j052j015r29p84o99o21m78m65m65n37n37n97n12l00
562D5126j00M6M5J73L16L52K65J28J28J70K56L59M46N33N32N44N44O37P24P70Q56R67R66J067
$$ plain form
581 86381 87876 89144 90156 90905 91397 91750 92018 92213 92408 92540 92586 92412 91923 91109 89979 88526 86815 84874 82932 81175
579 81175 79676 78479 77483 76744 76263 76055 75991 75998 76005 76159 76313 76460 76521 76469 76331 76041 75607 75105 74604 74023 73443 72862 72282 71724 71166
576 71166 70679 70336 70096 70000 70118 70379 70670 70875 70982 71089 71048 70808 70537 70266 70056 69846 69843 70156 70767 71578 72522 73609 74641 75530
573 75530 76242 76953 77586 78076 78441 78805 79126 79362 79431 79414 79318 79137 78808 78337 77717 76897 75798 74384 72755 70869 68702 66392
570 66392 64077 61763 59538 57313 55228 53343 51671 50199 48835 47614 46647 45880 45206 44618 44120 43765 43489 43299 43220 43341
568 43341 43598 43941 44343 44831 45398 45965 46688 47611 48775 50026 51330 52720 54122 55439 56558 57534 58339 58886 59190 59293 59274
565 59274 59168 58888 58407 57769 56987 56121 55170 54117 53065 52050 51121 50337 49638 49017 48539 48074 47609 47072 46535 45938 45426 45126
562 45126 45026 45072 45117 45290 45606 45958 46223 46351 46479 46649 46905 47264 47710 48243 48775 49319 49863 50500 51224 51994 52850 53817 54783 55850
559E5850J153J184J184J227J312J390J391J385J471J510J423J228J084R63P05N18M32M68M69
557G6347M16L31K48J06k9k9j03k47l09l09l16l17m03m03m25m25m30l44k74k73k01n7J15K01
554G2870L12N13P35Q22Q81R67J166J166J166J167J118J032R03P60P74P74R65R66J020J021
552I1098J071J271J598J912K106K191K052J680J179P49M78K77K20K20K98K99R8J3R4K38L13
549A09455L98N31O74Q39J097J373J574J492J177P91M75L79N22Q86J316J741K114K196J881
547A30911J476J162J068R25O46K74Rp7J24P25J416J846J945J944J869J669J393J393J772K430
544A54920L040L355L427L169K654K052J620J362J301J387J677K049K292K493K738K997L272
542A95805L529L748L891M069M328M654M912N163N592O101O416O337N908N384M954M951N438
$$ plain form
559 55850 57003 58187 59371 60598 61910 63300 64691 66076 67547 69057 70480 71708 72792 73755 74460 74978 75410 75878 76347
557 76347 76763 77094 77342 77448 77419 77390 77287 77040 76731 76422 76106 75789 75386 74983 74558 74133 73703 73359 73085 72812 72611 72554 72669 72870
554 72870 73182 73695 74430 75252 76133 77100 78266 79432 80598 81765 82883 83915 84818 85578 86352 87126 88091 89057 90077 91098
552 91098 92169 93440 95038 96950 99056 101247 103299 104979 106158 106907 107385 107662 107882 108102 108400 108699 108797 108810 108904 109142 109455
549 109455 109853 110384 111058 111897 112994 114367 115941 117433 118610 119401 119876 120255 120777 121663 122979 124720 126834 129030 130911
547 130911 132387 133549 134617 135542 136188 136462 136471 136394 136518 137243 138659 140505 142450 144394 146263 147932 149325 150718 152490 154920
544 154920 157960 161315 164742 167911 170565 172617 174237 175599 176900 178287 179964 182013 184305 186798 189536 192533 195805
542 195805 199334 203082 206973 211042 215370 220024 224936 230099 235691 241792 248208 254545 260453 265837 270791 275742 281180
540B81180O145O346N837N065M852N282O072O731P046O902O098M580K473R7j946l006k908k251
538C44595j876k192k926l327l135k277j302o72m37n23o66o65m13L31J502K703L520L920L899
536C40059L612L369L541M496O042P938R942J2094J4211J5937J7139J7131J5357J1975Q140
534D90983N618N618P725J0989J4266J6614J7272J6069J3557J0523P338M075Q86j575l078l822
532F13058m445n074n683n854n909o079o302n901m928l955m084n515p218p848o818m241j110
530E22094J810L716M461M336M335N227P231R227J0086R434P889O737O908Q876J2598J7183
528F42148K0674K1484J9709J6871J4524J2656J0194P116M884M997P117R567J1456J3174J4949
526H31520J5536J3875J0641Q407Q780J1357J4254J6029J6269J4723J1216O236R07l501o005
$$ plain form
540 281180 287325 293671 299508 304573 309425 314707 320779 327510 334556 341458 347556 352136 354609 354706 352760 349754 346846 344595
538 344595 342719 340527 337601 334274 331139 328862 327560 326888 326451 325928 325262 324597 324184 324515 326017 328720 332240 336160 340059
536 340059 343671 347040 350581 355077 361119 369057 378999 391093 405304 421241 438380 455511 470868 482843 490983
534 490983 496601 502219 509944 520933 535199 551813 569085 585154 598711 609234 616572 620647 621533 619958 616880 613058
532 613058 608613 603539 597856 592002 586093 580014 573712 567811 562883 558928 554844 549329 542111 534263 527445 523204 522094
530 522094 523904 527620 532081 536417 540752 545979 553210 562437 572523 581957 589846 596583 603491 612367 624965 642148
528 642148 662822 684306 704015 720886 735410 748066 758260 765376 770260 775257 782374 791941 803397 816571 831520
526 831520 847056 860931 871572 879979 888759 900116 914370 930399 946668 961391 972607 978843 979750 976249 970244
524I70244o979p024o738n700l582k93L657P936J2345J6270J9075K1108K3569K6865K9556L0448
522A130757K9934K9997L2546L7485M2666M5013M2523L6211K9370K4273K0522J6970J4135J4419
521A546821J9198K7368L6041M2170M3515L9110L0323K0754J4314J3365J7115K2615K6365K7124
519A926198K6579K8329L4885M6399O0855P5071Q5747R1091R2091R1573R1373R0493Q6284P7633
517B904601O7300O0359O0359O6423P4981Q3496R1883R8823R8566Q3910N2221Q563l7724p7867
515C635894j06579j23390j32522j40619j52270j66879j80420j88721j89837j83970j72778
514A897909j58891j44435j30258j16261j02609r0043p9044o9741o2245n6949n3446n0555m7030
513G36402m2192l6082k9469k3544j9679j8606j9837k1944k3060k1855j8734j5201j2767j1775
$$ plain form
524 970244 963265 956241 949503 943803 940221 939928 943585 951521 963866 980136 999211 1020319 1043888 1070753 1100309 1130757
522 1130757 1160691 1190688 1223234 1260719 1303385 1348398 1390921 1427132 1456502 1480775 1501297 1518267 1532402 1546821
521 1546821 1566019 1593387 1629428 1671598 1715113 1754223 1784546 1805300 1819614 1832979 1850094 1872709 1899074 1926198
519 1926198 1952777 1981106 2015991 2062390 2123245 2198316 2284063 2375154 2467245 2558818 2650191 2740684 2826968 2904601
517 2904601 2971901 3032260 3092619 3159042 3234023 3317519 3409402 3508225 3606791 3690701 3742922 3751485 3713761 3635894
515 3635894 3529315 3405925 3273403 3132784 2980514 2813635 2633215 2444494 2254657 2070687 1897909
514 1897909 1739018 1594583 1464325 1348064 1245455 1155412 1076368 1006627 944382 887433 833987 783432 736402
513 736402 694210 658128 628659 605115 585436 566830 546993 525049 501989 480134 461400 446199 433432 421657
511D21657j1774j1952j1809j1080j0022r352r553j0050r621p510m332j537n93j963m625o740
509B99144p455p291p606q625r397r004p429n515m055l655m484o158q019r404r833r486q827
507A72901q087p085n581l548j505J84J382J984J572K84j290k463k985l129l185l328l522l836
505A28763m126m327m288m086l723l466l393l480l420l220l182l182l153k952k897l097l297
503F9474l097k643k271j953j697j460j317j193j051j064j063r87p30n11n97p35p35p54q98
500D4718j100j243j386j529j510j195r39r39r25p24m53m53m31k32j1P4Q2K25L35J36j72l71
498C1957n73p72p96n38k57k57l59k16l9l8j55j55r4j80j94PJ24j8q4J15L18L18K27L69M46
494B9156J88j9J82M44M44M37P52J109J024O98O98P85O43N03P04J034J035J071J442J889K088
$$ plain form
511 421657 409883 397931 386122 375042 365020 355668 346115 336065 326444 318934 314602 313065 312472 310509 305884 299144
509 299144 291689 284398 276792 268167 258770 249766 242337 236822 232767 229112 224628 218470 210451 201047 191214 181728 172901
507 172901 164814 157729 152148 148600 147095 147279 148661 150645 152217 152501 151211 148748 145763 142634 139449 136121 132599 128763
505 128763 124637 120310 116022 111936 108213 104747 101354 97874 94454 91234 88052 84870 81717 78765 75868 72771 69474
503 69474 66377 63734 61463 59510 57813 56353 55036 53843 52792 51728 50665 49678 48948 48437 47840 47105 46370 45616 44718
500 44718 43618 42375 40989 39460 37950 36755 35816 34877 33952 33228 32775 32322 31891 31659 31648 31722 31804 32029 32364 32500 32328 31957
498 31957 31384 30612 29816 29278 29021 28764 28405 28189 28150 28112 27957 27802 27708 27528 27334 27341 27465 27447 27363 27478 27796 28114 28341 28710 29156
494 29156 29344 29325 29507 29951 30395 30832 31584 32693 33717 34415 35113 35898 36541 37044 37748 38782 39817 40888 42330 44219 46307
492D6307K403L233M045M361M618N277N968O168O332O934P298O983O883P998J0056J2719J6849
490A64432K3405L2125M3661O1388Q9698J31652J87558K47777K82500K48629J25625n1337k05028
488A382085k74444k58614k02125j47134j07220p8337n6830m2432l2846k4974j8120j3111r483
487A16415o191l813l269l930m588m818m819m581l922l149k606k044j156j87O42J445K160K644
484G4233L075L675M334M849N450O226O771O926P241Q471J0619J3809J8704K5685L5102M8650
482B83820O9689J02044J48502K06952K60796K73087K05159N5979j19123k42538k74398k35982
481G33987j76641j28046r3666o7913m9449l7760k9429k1821j5724j1874q754n620l816m170
479G9304n228n598n598n765n507m609l894l801l544k749k148k174k175j733j361j392j393
$$ plain form
492 46307 48710 51943 55988 60349 64967 70244 76212 82380 88712 95646 102944 109927 116810 124808 134864 147583 164432
490 164432 187837 219962 263623 325011 414709 546361 733919 981696 1264196 1512825 1638450 1587113 1382085
488 1382085 1107641 849027 646902 499768 392548 314211 257381 214949 182103 157129 139009 125898 116415
487 116415 110224 106411 103142 99212 94624 89806 84987 80406 76484 73335 70729 68685 67529 67342 67984 69429 71589 74233
484 74233 77308 80983 85317 90166 95616 101842 108613 115539 122780 131251 141870 155679 174383 200068 235170 283820
482 283820 353509 455553 604055 811007 1071803 1344890 1550049 1606028 1486905 1244367 969969 733987
481 733987 557346 429300 335634 267721 218272 180512 151083 129262 113538 101664 92910 87290 83474 79304
479 79304 74076 68478 62880 57115 51608 46999 43105 39304 35760 33011 30863 28689 26514 24781 23420 22028 20635
477B0635r20o05p14o28k04N4j88l88j89j88m91o91m78k78l55l55j47o2k29k30m3R9p6p5Q8
474A3342J74j15l74l76l75n70n69l68k24l00l00j63p7j88j88N8K02P4j1J50K37K9j72j25l9
471I732m6j32j3P3K4o1K2K3p7p8P1J57L7m9J16K59J27M1J60K47J20q1j4j5j23k66j29J4ON
467A0150J29K72K35K34L48L47J61j53l55m41m71m72k58n8m5j32j08k2o5j50q8jppN6J42R4
464I335R4Q6Q5j8j04k8N8l1l0L8J81J72J72J98J98J52O5R7J83K00K01J73J72J72J73K05K06
461A2405j1k12k09k10j74j74j13k7L4J19K36K35Q2j19j19j18j32j31j26j26j26j26r9r9j71
458A0489j71j0j0m8m7QR5n4j97j71q5j33j33n7Q6J26L9M7M8QQN2J96J87J87K28K29J89j2l6
454A1058N0O0O0j6j5j66l67m33k89j68j68m2m3K9K9J6J5k7k8O0O1O0O0M3M3k8j72j92j06j21
$$ plain form
477 20635 19715 19110 18396 17768 17564 17618 17430 17042 16853 16665 16174 15483 15005 14727 14372 14017 13870 13808 13579 13349 13306 13405 13329 13254 13342
474 13342 13516 13401 13027 12651 12276 11706 11137 10769 10545 10245 9945 9782 9705 9517 9329 9387 9589 9663 9652 9802 10039 10068 9896 9771 9732
471 9732 9686 9554 9541 9614 9638 9577 9599 9622 9545 9467 9538 9695 9732 9683 9799 10058 10185 10226 10386 10633 10753 10672 10658 10643 10520 10254 10125 10139 10145 10150
467 10150 10279 10551 10786 11020 11368 11715 11876 11723 11368 10927 10456 9984 9726 9668 9623 9491 9383 9361 9296 9146 9058 9057 9050 9043 9099 9241 9335
464 9335 9429 9515 9600 9582 9478 9450 9508 9477 9447 9485 9666 9838 10010 10208 10406 10558 10623 10720 10903 11103 11304 11477 11649 11821 11994 12199 12405
461 12405 12394 12182 11973 11763 11589 11415 11302 11275 11309 11428 11664 11899 11981 11862 11743 11625 11493 11362 11236 11110 10984 10858 10759 10660 10489
458 10489 10318 10308 10298 10250 10203 10211 10306 10252 10055 9884 9799 9666 9533 9476 9562 9688 9727 9774 9822 9830 9838 9890 10086 10273 10460 10688 10917 11106 11094 11058
454 11058 11108 11168 11228 11212 11197 11031 10664 10231 9942 9774 9606 9564 9521 9550 9579 9595 9610 9583 9555 9615 9676 9736 9796 9839 9882 9854 9682 9490 9384 9263
450I263j21q9q8j89j89k14k14j42j43p0p1j43j42j63j63noj4j4p7p7j9J25J15J16P1P1n8n8
447G292k7k8R3R3J9j23k83m26l79k36j40j39l7l7L9M0R2J79J67K5p1p0j23j22q9q9J1J1K7
443E669K6K6K6M8M8q1q1r5r4ONJ1J0o1o1r5r4j37j38j40j40j40j40n8n9j5j6nmO7O7Q3Q3J5
439D536j86k60j75j06j07k7k7J6J6R5R5R5R4J9J9L3j10j55o9J17J16R0Q9Q9Q9P6P6L3L3m2
436D562m2m2m2L2L2J09J10J44K29J71K8K2J66K05K05J57J56K91K91L42M28M11K69J20L4l2
432H356j76k11k11r1r1p4p4l1l2n3n4n3n4l0l0l1l0L9L9Q2Q2L9L8r1r0j30j30n8n9j6j6Q3
428F842Q4J04J03J03J04J02J03J79J79K37L22M52O25R78J494K060K460K546K032O83q63j878
426A9051j877j388q72l55J61O57O58L23j92p95j311j563j478j208r21p01n30m22m22l76l77
$$ plain form
450 9263 9142 9053 8965 8776 8587 8373 8159 8017 7874 7804 7733 7590 7448 7285 7122 7117 7111 7097 7083 7006 6929 6910 7035 7150 7266 7337 7408 7350 7292
447 7292 7265 7237 7330 7423 7442 7319 7036 6610 6231 5995 5855 5716 5679 5642 5681 5721 5813 5992 6159 6184 6113 6043 5920 5798 5709 5620 5631 5642 5669
443 5669 5695 5721 5747 5795 5843 5762 5681 5586 5492 5498 5503 5514 5524 5463 5402 5307 5213 5076 4938 4798 4658 4518 4378 4320 4261 4246 4230 4225 4221 4288 4355 4438 4521 4536
439 4536 4350 4090 3915 3809 3702 3675 3648 3664 3680 3775 3870 3965 4059 4078 4097 4130 4020 3865 3796 3913 4029 4119 4208 4297 4386 4462 4538 4571 4604 4562
436 4562 4520 4478 4436 4468 4500 4609 4719 4863 5092 5263 5291 5313 5479 5684 5889 6046 6202 6493 6784 7126 7554 7965 8234 8354 8388 8356
432 8356 8180 7969 7758 7667 7576 7502 7428 7397 7365 7312 7258 7205 7151 7121 7091 7060 7030 7069 7108 7190 7272 7311 7349 7258 7168 7038 6908 6850 6791 6775 6759 6842
428 6842 6926 7030 7133 7236 7340 7442 7545 7724 7903 8140 8462 8914 9539 10517 12011 14071 16531 19077 21109 21792 20929 19051
426 19051 17174 15786 14914 14559 14720 15377 16035 16358 16166 15371 14060 12497 11019 9811 8890 8189 7659 7237 6815 6439 6062
423F062j62j62r0r0j9j9l9m0LLj33j33mmL3L3P6P6N4N4J12K7m8J24K50L37L30M17M44M45L41
419H278L41K81J08k4k4J43K28K65M38O87P73N89J89k56p70j110j196j168j081r06o20l46k61
417D558k20j35m9m9j38j38j37j38o4o3k1k0p7p6K4K4k7k7k8k7q7q8M2M1p4p4K6K5POl7l7n3
413B869n3J9J9llM0M0n6n6M5M4J3J3J3J3j5j4n8n8r7r8KKL4L3P7P7j2j3j2j2m7m7K4K4J3J2
408B772N6N5m4m4N7N6m1m0Q8Q9k3k3M9M9k8k8M4M3J0Ro2o2J4J5K01K00R4R4N1N1o0o0j7j7
404C548r6r5O1O2O0O0J03J03N1N1J22J23J60J60K85K85L67P68J451K309L294L809L422J648
401B2111r24l042l679l164k368j623j071o69m27l42k64k64j01j02jjK9L0J58J58j5j5j4j5
398D385n0n0J37J36N6N7N6N7LKLLl0l1J31K17J40N5O9J55K61M05O40R56J441K158L055L542
$$ plain form
423 6062 5900 5738 5648 5558 5539 5520 5481 5441 5444 5447 5314 5181 5177 5173 5206 5239 5315 5391 5445 5499 5611 5638 5590 5714 5964 6301 6631 7048 7492 7937 8278
419 8278 8619 8900 9008 8984 8960 9103 9331 9596 10034 10721 11494 12083 12272 12016 11246 10136 8940 7772 6691 5785 5165 4819 4558
417 4558 4338 4203 4154 4105 3967 3829 3692 3554 3490 3427 3406 3386 3309 3233 3257 3281 3254 3227 3199 3172 3085 2997 3039 3080 3006 2932 2958 2983 2990 2996 2959 2922 2869
413 2869 2816 2835 2854 2851 2848 2888 2928 2872 2816 2861 2905 2918 2931 2944 2957 2942 2928 2870 2812 2715 2617 2619 2621 2655 2688 2765 2842 2830 2817 2805 2793 2746 2699 2723 2747 2760 2772
408 2772 2828 2883 2839 2795 2852 2908 2867 2827 2915 3004 2981 2958 3007 3056 3028 3000 3044 3087 3097 3106 3044 2982 2996 3011 3212 3412 3506 3600 3651 3702 3642 3582 3565 3548
404 3548 3452 3357 3418 3480 3540 3600 3703 3806 3857 3908 4030 4153 4313 4473 4758 5043 5410 6178 7629 9938 13232 17041 20463 22111
401 22111 21187 18145 14466 11302 8934 7311 6240 5571 5144 4802 4538 4274 4173 4071 4070 4069 4098 4128 4286 4444 4429 4414 4400 4385
398 4385 4335 4285 4422 4558 4614 4671 4727 4784 4787 4789 4792 4795 4765 4734 4865 5082 5222 5277 5346 5501 5762 6167 6807 7763 9204 11362 14417 17959
395A7959L093J633l70k232l200l115k360j587j057o85m54l11l24l24j23J9R3R2K01K01J13
392G262J13J13J13Q6Q7K16K15J76J75K98K99J32M7J32J32%q6RR4N9k7P9J64J45J45K46K45
389A0669J26M1J37K80K90K89K94K93K26J40J17J17P4P5J80L23L16L15L91L92L30K44K50K50
386A6159K52K52K75L61L58L59M98O41O10O10O13O13M25L39L87N30N93P37R33J020Q49O49N38
383B8601L94J19k3R6K39K46K46L52M95M13K69K07K07K03K88N13O55N93N07N51N52L91J90K22
380C6526L66L66L65M69M70L95L09M35N78N61N62Q12J070J124J124J266J409J262J119J222
378E1810J366J316J229J477J791J942K085K468K897L150L350L712M026L932L617L416L102
375I6686K611K354K784L556M200M802N749O809P497P755P815P673P434P693Q951J0698J2194
$$ plain form
395 17959 21052 22685 22315 20083 16883 13768 11408 9821 8764 8079 7625 7314 6990 6666 6543 6562 6655 6747 6948 7149 7262
392 7262 7375 7488 7601 7687 7774 7990 8205 8381 8556 8854 9153 9285 9332 9464 9596 9596 9510 9519 9613 9672 9645 9724 9888 10033 10178 10424 10669
389 10669 10795 10836 10973 11253 11543 11832 12126 12419 12645 12785 12902 13019 13093 13168 13348 13671 13987 14302 14693 15085 15415 15659 15909 16159
386 16159 16411 16663 16938 17299 17657 18016 18514 19155 19765 20375 20988 21601 22026 22365 22752 23282 23875 24612 25545 26565 27414 28063 28601
383 28601 28995 29114 29091 29187 29426 29672 29918 30270 30765 31178 31447 31654 31861 32064 32352 32865 33520 34113 34620 35171 35723 36114 36304 36526
380 36526 36892 37258 37623 38092 38562 38957 39266 39701 40279 40840 41402 42214 43284 44408 45532 46798 48207 49469 50588 51810
378 51810 53176 54492 55721 57198 58989 60931 63016 65484 68381 71531 74881 78593 82619 86551 90168 93584 96686
375 96686 99297 101651 104435 107991 112191 116993 122742 129551 137048 144803 152618 160291 167725 175418 184369 195067 207261
373B07261J3653J5518J7436J8722J9724K1731K5653L2027M2189N7886P9155J03531J25945
372G80431J38977J34540J08005O2920J0866l3934o1345o8930o1638m7698l3594k2173j4354
370H92073j1292j3179j7387k0146k0346j9358j8527j7723j6949j6611j6354j5391j4218j3949
369F60643j4150j3284j1137q767o276k376K748P211R815J0707J0105P889N513N223P026R040
367F79930J0613J3011J6818K2199L0929M4754O2588Q3426J11422J54047K17424L06435M19392
365B172988N23123N39325L89768Q3074k55171m69462m98355m03148k83149j87826j15822o4124
364A431221m6248o7030j05835j33831j37331j20556r4538o9061m9503l6507k8331k3923k2928
362D95599k3557k2753k0176j7428j5539j3764j1874j0880j0365q657n508k539m20J999N262
$$ plain form
373 207261 220914 236432 253868 272590 292314 314045 339698 371725 413914 471800 550955 654486 780431
372 780431 919408 1053948 1161953 1224873 1235739 1201805 1140460 1071530 1009892 962194 928600 906427 892073
370 892073 880781 867602 850215 830069 809723 790365 771838 754115 737166 720555 704201 688810 674592 660643
369 660643 646493 633209 622072 613305 607029 604653 607401 614612 624427 635134 645239 653128 658641 663864 670890 679930
367 679930 690543 703554 720372 742571 773500 818254 880842 964268 1075690 1229737 1447161 1753596 2172988
365 2172988 2696111 3235436 3625204 3708278 3453107 2983645 2485290 2082142 1798993 1611167 1495345 1431221
364 1431221 1384973 1317943 1212108 1078277 940946 820390 725852 656791 607288 570781 542450 518527 495599
362 495599 472042 449289 429113 411685 396146 382382 370508 359628 349263 340606 335098 332559 332139 334138 339400
360C39400Q382J0501J1585J2100J2136J2651J5106J9628K5518L2561M1144N0705N9672O8202
358G19291P9030R4774J14304J30048J29642J02791M9705j5961p4905j14236j31830j31831
357I50822j19096r8543p6212n8178m7636m4259m5589m7823m7751m4258l8869l3088k7287k1619
355B00614j6538j2473r384p037o040o126o278n648m455l597l653m511o230p889q527p782o537
353G7909n678n023m279l649l248k811k068j352r51m90K53J048J220P18k54j650l082l847l560
351C9206k838k323j987j471j122j122j256j169j058j059j005p47n20n19o06o05m59n44n70
348A8226l69j63j64j98n4K4K4JK58N68O54P29R87J112Q54M39O7k96p83j138j138j004q61n76
346A7199J39J177K007K317K003P11j265k874l304k710j937j405j034o40m39l74k30j55j55
$$ plain form
360 339400 347782 358283 369868 381968 394104 406755 421861 441489 467007 499568 540712 591417 651089 719291
358 719291 798321 893095 1007399 1137447 1267089 1369880 1419585 1403624 1328719 1214483 1082653 950822
357 950822 831726 733183 656971 598793 551157 506898 461309 413486 365735 321477 282608 249520 222233 200614
355 200614 184076 171603 162219 155182 149142 143016 136738 131090 126635 123038 119385 114874 108644 100755 92228 84446 77909
353 77909 72231 67208 62929 59280 56032 53221 51153 49801 48850 48360 48613 49661 50881 51599 51345 49695 46613 42766 39206
351 39206 36368 34045 32058 30587 29465 28343 27087 25918 24860 23801 22796 22049 21529 21010 20404 19799 19340 18796 18226
348 18226 17857 17694 17530 17332 17278 17302 17326 17327 17585 18153 18807 19536 20523 21635 22489 22928 22995 22699 21916 20778 19640 18636 17775 17199
346 17199 17338 18515 20522 22839 24842 25553 24288 21414 18110 15400 13463 12058 11024 10384 9945 9571 9341 9186 9031
343I031k99k99r4r3j09k2K0o6k44k45n0m9j47j46llr2r2q7j73l01l00j54o8r3r4N5N5j41j42
340E555n6n6q0q1j60j61j77r2MMp5p4J1J1q4q4m2m1o8o8o9o8j37j37n1n2j33j33l8M8J5J6
336C447K1K1p2p2P1P1llllo3o3L8L7n0n0n1n0p1p2N7N8m9m8m8m9n3n4M7M7j67j68J9J9l2l3
331B626Q8Q7Pj36j48o1m2m2ONo4o5o5o5j2j3L0L0K4K4K3K4k6k6k7k6o4o4O5O5KJM5M4o6o5
327B119o6o6j0j0L3L3j0j1j0j0n7n8M3M3n8n8J3J3K2K3n0m9j00j00L0K9l5l4QRLLLLj6j7j6
322A589j6J4J3J3J4j9j9N3N3k8k8k8k7o4o4L6L6l3l2L9L8l5l4QQo6o5OOj5j5N7N6m2m2k4O2
318A405K8n9m7m8k1k1P9Q0l4l3J3R9L7n0K2J08M0m6q9lJ9o8n6n7n7n6j1P6J33M7k8k8QQQ0
313A470Q0rqrrppR4R3KKK0J05K2o5o0K7J02J02J08J08K9K9K9K9K9K9J01J00J32J32J86L28
$$ plain form
343 9031 8732 8433 8339 8246 8137 8115 8135 8069 7825 7580 7530 7481 7334 7188 7185 7182 7090 6998 6911 6738 6437 6137 5983 5915 5822 5728 5783 5838 5697 5555
340 5555 5499 5443 5363 5282 5122 4961 4784 4692 4696 4700 4625 4551 4562 4573 4489 4405 4363 4322 4254 4186 4117 4049 3912 3775 3724 3672 3539 3406 3368 3416 3431 3447
336 3447 3468 3489 3417 3345 3416 3487 3484 3481 3478 3475 3412 3349 3387 3424 3374 3324 3273 3223 3152 3080 3137 3195 3146 3098 3050 3001 2948 2894 2941 2988 2821 2653 2672 2691 2659 2626
331 2626 2714 2801 2808 2672 2524 2463 2421 2379 2385 2390 2326 2261 2196 2131 2119 2106 2136 2166 2190 2214 2237 2261 2235 2209 2182 2156 2092 2028 2093 2158 2160 2161 2206 2250 2184 2119
327 2119 2053 1987 1977 1967 2000 2033 2023 2012 2002 1992 1935 1877 1920 1963 1905 1847 1860 1873 1895 1918 1868 1819 1719 1619 1649 1678 1643 1609 1617 1626 1629 1632 1635 1638 1622 1605 1589
322 1589 1573 1587 1600 1613 1627 1608 1589 1642 1695 1667 1639 1611 1584 1520 1456 1492 1528 1495 1463 1502 1540 1505 1471 1479 1487 1421 1356 1362 1368 1353 1338 1395 1451 1409 1367 1343 1405
318 1405 1433 1374 1327 1279 1258 1237 1316 1396 1362 1329 1342 1441 1478 1428 1450 1558 1598 1552 1463 1460 1479 1411 1355 1298 1241 1185 1174 1250 1383 1430 1402 1374 1382 1390 1470
313 1470 1550 1541 1533 1524 1515 1508 1501 1595 1688 1690 1692 1712 1817 1839 1774 1714 1741 1843 1945 2053 2161 2190 2219 2248 2277 2306 2335 2436 2536 2668 2800 2986 3314
309C314L84M70O92R50J063R20O48K76r0m06m81l95k97k12p7p7j20k64k74j88k10k09k48k47
307D922j40j41j41j41j04j04o1o1p4p5q0OJ5J5k3k2k5k4P6P5L0K9P2P2J05J04J85K71K41K41
303E243L57N58P45Q89J257J916K794L568L621K447K33k029l282l195k434j718j185q13m87
301H485l44l94n95p28q14o97n53m06l20k22j36k06k05j85m3K3o3m8m9l2l2q0N%jm4M2M8M8
297B454N3N4Q1Q0L3J19J53J53J21J20K19L04L99N42O90Q33J019J162J091P77J86m72j000j257
294G914j283j025p48m91l20j76j76k63l34l35k44k44k38k39j93j07KKj3j3j8j9%q5l8l7k5
291A254k5k5k5k7k8k8k8JJm2m2m7m7k9N7Q2nn0n1M1M1n9n9P4P4K2o4k7k6l2l1m2m2L0L0J4
286H40J4k9k9J7J8J7J8j9j8j9j9J7J6J6J7J8J8n3n4N2N2N2N3m3m2K4K3Nq0q1NK5K5k4O3R1
$$ plain form
309 3314 3698 4168 4860 5810 6873 7793 8441 8717 8627 8221 7740 7345 7048 6836 6759 6682 6562 6298 6024 5836 5626 5417 5169 4922
307 4922 4782 4641 4500 4359 4255 4151 4090 4029 3955 3880 3800 3806 3821 3836 3813 3791 3766 3742 3818 3893 3923 3952 4024 4096 4201 4305 4490 4761 5002 5243
303 5243 5600 6158 6903 7792 9049 10965 13759 17327 20948 23395 23628 21599 18317 15122 12688 10970 9785 8972 8485
301 8485 8141 7747 7152 6424 5610 4913 4360 3954 3634 3412 3276 3070 2865 2680 2637 2660 2597 2549 2500 2468 2436 2356 2361 2361 2360 2316 2358 2406 2454
297 2454 2507 2561 2642 2722 2755 2874 3027 3180 3301 3421 3640 3944 4343 4885 5575 6408 7427 8589 9680 10457 10643 10171 9171 7914
294 7914 6631 5606 4858 4367 4047 3871 3695 3432 3098 2763 2519 2275 2037 1798 1605 1498 1500 1502 1489 1476 1458 1439 1439 1354 1316 1279 1254
291 1254 1229 1204 1179 1152 1124 1096 1068 1069 1070 1028 986 939 892 863 920 1002 997 947 896 937 978 919 860 934 1008 1030 966 939 913 881 850 808 766 796 826 840
286 840 854 825 796 813 831 848 866 847 829 810 791 808 824 840 857 875 893 840 786 838 890 942 995 952 910 934 957 962 882 801 806 831 856 832 895 986
282I86Np0p0L7L6l5l6llllpopok4k5k4k5j3j4j3j4m9m9lQ3J17L2p3p2K3K4k0j9j6j5j5j5j8
277E78j8j8j8ooooK6K6K7K6NNNOL0L0L0L1J1J2J2J1j3j3j4j3j1j2j1j2J7J7k5k6m5m4K7K7
272F42M0M0lmK8K8j01j02j8j8N4N4k8k8k7k8k9l0k9k9Q8Q8j2j1o2o2j9j9o2o2o2o1J14J14
268C84J58J57M5M4n6n6l1l1M0M1L4L4l8l7Q1Q1j9j9MMMMJ2J2q8q8KLm0m1J7J7J7J7N7N6N7
264H38N7j2j1j1j2m8m9m8m9j2j1j2j2M6M7LMk6k5k5k5R5R6nmKLM5M5l0l1l0l1j4j5j4j5N4
259G58N4j9j8l8l9l8l9K0J9K0K0onm8m9N4N3J0J0n0n1pqM0L9l2l2L8L8l4l3J3J4k7k6O0J03
254G64N6l0J0J1o6o6k0k0l3p6l1N5N8k8p2J4O0O1Q6Q7m2m3k8k9o6o7k1O4O7j9o0j7k0o3n1
250D25rJ3J2L9J25J24L9n8n8PQl2l2l3l2J0J1J0J0j6j7K7K6J0Rl3l4M9M9k3k2MNl5l6l2J0
$$ plain form
282 986 991 921 851 888 924 889 853 850 847 844 841 834 828 821 815 791 766 742 717 704 690 677 663 614 565 562 645 762 794 721 649 672 696 676 657 641 626 611 596 578
277 578 560 542 524 518 512 506 500 526 552 579 605 610 615 620 626 656 686 716 747 758 770 782 793 780 767 753 740 729 717 706 694 711 728 703 677 632 588 615 642
272 642 682 722 719 715 743 771 670 568 550 532 586 640 612 584 557 529 500 470 441 412 500 588 576 565 503 441 422 403 341 279 217 156 270 384
268 384 542 699 744 788 732 676 645 614 654 695 729 763 725 688 769 850 831 812 816 820 824 828 840 852 764 676 678 681 641 600 617 634 651 668 725 781 838
264 838 895 883 872 861 849 801 752 704 655 643 632 620 608 654 701 704 708 682 657 632 607 702 798 793 789 791 794 839 884 854 823 793 762 748 733 719 704 758
259 758 812 793 775 737 698 660 621 641 660 680 700 694 689 641 592 646 699 709 719 669 618 611 603 643 682 650 618 656 694 660 627 640 654 627 601 661 764
254 764 820 790 800 811 745 679 659 639 606 530 499 554 612 584 512 526 586 647 733 820 778 735 707 678 612 545 524 588 655 636 576 559 539 476 425
250 425 416 429 441 480 605 729 768 710 652 659 667 635 603 570 538 548 559 569 579 563 546 573 599 609 618 585 551 600 649 626 604 608 613 578 542 510 520
246E20mq9o2K3R6N4k1K2O3J9m1m2N6N6KKj%m2q5j06k0L3P5L8nk9k8J1J2kkkjM1M2l0l0L1L2
241E86J4p2p1J5L2L3N1N0L0n6m2JM3M2L9L8l3l4J5J5Jm1m4M3O1J9nL9K2o3j07k0N4N5m6m6
236F18m6m7j4j5K8K8K1K0p9q0j2j2L0L1N8N9N8N9j5j5n7j00o4K2M2M2nnj9o2n0L6N5J2j0L4
232E46L6pk9N8P4L0o2o2POL3L3P0P0k3j10o1o1k1k1K2K2J3J3N6N6popoL9L9M7l9p7l4L4L4
227G05k1o5k2O3O8j9o2o3QN2Rp7p6J1K8K8JKM4M4p4p4n0L5M3M2m7m7pP9J03J02n2n3n2n2q
223E46pO4O5k3k2k2k3k8k7k8k8MNJ0Rl3N3N8k8o1K5P1P2k6k6k7k6m2m2K9L0N8N8N7N8q4q4
218E85j3j3l9l8k1O5P5j1n8n7kkkkl3l3L8L8J2J2l2l1jjP0P1N0N0k2k2k5k5M6M6l7l8m2M3
214F01K9K9l8l7M9M9K6o1l4l4L2L2m6m6m6m6M2M2M2M1K9K8o6o7k9N7N7k8o4o4L5J20J04J7
$$ plain form
246 520 516 427 365 388 484 538 517 539 602 621 580 538 594 650 652 654 653 653 611 526 420 400 433 508 546 541 512 484 495 507 505 503 501 500 541 583 553 523 554 586
241 586 600 528 457 472 504 537 588 638 668 612 570 571 614 656 695 733 700 666 681 696 697 656 612 655 716 735 730 769 791 728 621 601 655 710 664 618
236 618 572 525 511 496 524 552 573 593 514 434 422 410 440 471 529 588 646 705 690 675 618 518 454 476 518 560 555 550 531 469 419 455 510 522 512 546
232 546 582 575 546 604 678 708 646 584 591 597 630 663 733 803 780 670 609 548 527 506 528 550 563 576 632 688 681 675 668 662 701 740 787 748 671 637 671 705
227 705 684 619 597 660 728 709 647 584 592 644 653 576 500 511 539 567 568 570 614 658 584 510 460 495 538 580 533 486 479 558 661 763 711 658 606 554 546
223 546 539 603 668 645 623 601 578 550 523 495 467 471 476 486 495 462 515 573 545 484 509 580 652 626 600 573 547 505 463 492 522 580 638 695 753 669 585
218 585 572 559 520 482 461 526 601 590 532 475 473 471 469 467 434 401 439 477 489 501 469 438 437 436 506 577 627 677 655 633 608 583 629 675 638 600 558 601
214 601 630 659 621 584 633 682 708 647 613 579 611 643 597 551 505 459 501 543 585 626 655 683 617 550 521 578 635 607 543 479 514 634 738 755
209G55k9k8j5j5n8n8J4J4J4J3ppM2m5m4m3P4P4J0p7k8k9LLm0m0QQQ0Q0l7l7POklm5m5nnnn
204D53J4J4N8N7n8n9J4J3N1N1k1k0q5q5l4N3O1O2nnl2l2J1J1K8K7j6j6o3o3L7L7ooooL3L3
200E00L2L3RRRRk8k9J5J4OPl7l6m5m4kkJJJ%KKM4M5n8n9m0M6L7m8m9L8J34M9k6k7M0M0llk9
194E58l0k9k9P6P5N3l4n2n3r6r5J5J01O4k2l0N6R3Qo0o0k3k3l7l8L4L4mnm7m8KKL1j2m8L8
190C65N6J4l5RQ2Q2n7n6J2J2j4n7J3J00Q2lj7K6OOLLm7j33j33m7mmM3M4K7K7lM1N8k8p7p7
185C19L0L1L0L0K1K0m5m6k7N9P8L5l6l7l8l9K4K5K5K4j1j1j0j1rqqqj6j5K7K8k7k6k6k7j5
181C10j5K8K8l6l5Q7Q8j7j04j2J31J06K0n2n1k1k1K2O4P0j7l6l7J7J7J7J7p5p5pJ36J04l9
177F12j27m1N0M9j7j6nmnmj3j3N9N9J9J9k4k5qqn1n1p1p1k8k8R6R7J01J6n3n2n8n8o7o6J5
$$ plain form
209 755 726 698 683 668 610 552 566 580 594 607 600 593 635 590 546 503 577 651 661 584 556 527 530 533 493 453 461 469 549 629 592 555 562 568 566 563 518 473 468 463 458 453
204 453 467 481 539 596 538 479 493 506 557 608 587 567 482 397 363 416 477 539 534 529 497 465 476 487 515 542 526 510 447 384 421 458 452 446 440 434 467 500
200 500 532 565 574 583 592 601 573 544 559 573 579 586 549 513 468 424 422 420 421 422 423 423 425 427 471 516 458 399 359 405 442 394 345 383 517 566 540 513 553 593 590 587 558
194 558 528 499 470 546 621 674 640 588 535 439 344 359 460 524 502 472 528 621 629 569 509 486 463 426 388 422 456 452 447 400 352 354 356 387 375 327 365
190 365 421 435 400 409 491 573 516 460 472 484 470 413 426 526 608 605 588 614 620 626 629 632 585 452 319 272 268 264 307 351 378 405 402 443 501 473 396 319
185 319 349 380 410 440 461 481 436 390 363 422 500 535 499 462 424 385 409 434 459 483 472 461 451 440 431 423 415 407 391 376 403 431 404 378 352 325 310
181 310 295 323 351 315 280 367 455 438 334 322 453 559 579 527 476 455 434 456 520 590 573 537 500 517 534 551 568 493 418 411 547 651 612
177 612 485 444 494 543 526 510 505 501 496 492 479 466 525 584 603 622 598 573 565 557 506 455 384 313 285 257 353 450 551 567 514 462 404 346 279 213 228
172B28J00Q7Q7pqo5o5m2M4K7K6l9m0l0l0J3J3J9J8l0N6O4O4l0l1N4N5J1J2l0l0M2M2p8p9l2
168C96N4Q8Km5m4K0K1k3k2o7o7QR3P7rn6n6K7K8j6j5L3L4L3L4Q7Q8j3j3k1k1k1k1n8n9n8n9
163C59O2O2J5p0p3J2L1L0l1l1O4O4J5p0mQ1R4Pr6r6p9p9l6l7Q0Q0Q0Q0K6K5m6m6n2n3nQ0N7
159E00k9r5rN4N5o9o9J3J2l0l0K3K4K4K4J4J5J5J5M6M6n4n4J5J5k8k9o6o5j4P1O5O5l0l1R3
154E02R2j7j03j4j4k0j9M8M9ONK9K9j4j4jjkjL5L6J2p4p0p0mmQ2Q1Q6Jm3m2m8m8k3k3k3k3
150C78j9j9K4K4j3j3j4j3K7K7j5j6J3J3J3J3k8k8M3M4RJ0l3l4K5K6K5K5k6k6o9o9J6J6N8N9
145D53nnnmk9k8J5J4J3J3n9n8KLKLK8K9P1P2M3M4n7n7o9p0KLL4L5o5o5O0O1O1O1k0k0o3o3
140C80J2J2N5N5m5m5m5m5qpqpL4L4P6P7K1K0K0K1r1r0r1r0J6J6J5J6L6L6l6l5O8O9klo0n9
$$ plain form
172 228 328 415 502 495 487 422 357 315 359 386 412 373 333 303 273 286 299 318 336 306 362 426 490 460 429 483 538 549 561 531 501 543 585 507 428 396
168 396 450 538 540 495 451 471 492 469 447 380 313 321 414 491 482 426 370 397 425 409 394 427 461 494 528 615 703 690 677 656 635 614 593 535 476 418 359
163 359 421 483 498 428 355 367 398 428 397 366 430 494 509 439 435 516 610 617 521 425 346 267 231 194 274 354 434 514 540 565 519 473 421 368 363 443 500
159 500 471 376 367 421 476 407 338 351 363 333 303 326 350 374 398 412 427 442 457 503 549 495 441 456 471 443 414 348 283 269 340 405 470 440 409 502
154 502 594 577 474 460 446 426 407 455 504 510 515 544 573 559 545 544 543 541 540 575 611 623 549 479 409 405 401 483 564 650 651 608 566 518 470 447 424 401 378
150 378 359 340 364 388 375 362 348 335 362 389 374 358 371 384 397 410 382 354 397 441 450 460 427 393 418 444 469 494 468 442 373 304 320 336 394 453
145 453 448 443 438 434 405 377 392 406 419 432 373 315 317 320 322 325 353 382 453 525 568 612 555 498 429 359 361 364 398 433 368 303 363 424 485 546 526 506 443 380
140 380 392 404 459 514 469 424 379 334 326 319 311 304 338 372 448 525 546 566 586 607 516 426 335 245 261 277 292 308 344 380 344 309 377 446 444 441 381 322
136C22M0M1J2J1J2J2OOOOk2k3K1K0RRo3o2N8N8J5J6n0n0m9n0l3l4O7O7NNNOj6j5K7K8N4N5
131E32J1J2m9m8m9m8K7K7P0P1p2p2p2p2L7L7L7L7PPM9N0k6k7M6M5K0K0n1n2m1m2L0L0m4m4
126C93m5m4J5J4n7n7K0K0K0K0K3K3k0k0JKJKJ7J8k5k6o4o3L6L6N4N3m6m7L4L3L4L4k3k3k3
122C20k2K9K9j4j4N9N8j3j3p1p1K9K9j0rj0j0P1P2%%j0j0L3L3n2n2n3n2NNP6P6J4J4k9l0j8
117C89j8j8j8M8M7k4k4j2j2L1L2QRRRp6p5K5K4pqn0n1J9J8J9J8J1J2J1J1M7M7k4k4K0K0K0
112D63K1l8l8L4L4m9m9K2K2J4J4k9l0J1J0l3l3K5K5j7j8j9j9j8j9M3M3Q6Q6j8j7o1o1K3K4
108D34K3K4N9N9m1m1l3l2l3l3L6L7L6L6o3o4o3o4lkm6m6J4J4k9k9LLP4P5K4K4j8j9M0M1lk
104C92l6l5O5O5j2j2j2j2j6j7j6j7L7L8ooJ6J6k7k6K5K5j8j8o2o2L9L8j8j8j8j8QPN0N1k4
$$ plain form
136 322 362 403 415 426 438 450 456 462 468 474 452 429 450 470 479 488 425 363 421 479 494 510 460 410 361 311 278 244 311 378 383 388 393 399 383 368 395 423 477 532
131 532 543 555 506 458 409 361 388 415 485 556 484 412 340 268 305 342 379 416 423 430 479 529 503 476 522 567 587 607 556 504 463 421 451 481 437 393
126 393 348 304 319 333 276 219 239 259 279 299 322 345 325 305 306 308 309 311 328 346 321 295 231 168 204 240 294 347 301 254 288 321 355 389 366 343 320
122 320 298 327 356 342 328 387 445 432 419 348 277 306 335 325 316 306 296 367 439 439 439 429 419 452 485 433 381 328 276 281 286 362 438 452 466 437 407 389
117 389 371 353 335 383 430 406 382 370 358 389 421 429 438 447 456 380 305 330 354 347 339 289 238 257 275 294 312 323 335 346 357 404 451 427 403 423 443 463
112 463 484 446 408 442 476 427 378 400 422 436 450 421 391 402 412 379 346 371 396 379 361 342 323 305 286 329 372 458 544 526 509 448 387 410 434
108 434 457 481 540 599 558 517 484 452 419 386 422 459 495 531 468 404 341 277 274 272 226 180 194 208 179 150 153 156 230 305 329 353 335 316 356 397 394 392
104 392 356 321 386 451 439 427 415 403 387 370 354 337 374 412 406 400 416 432 405 379 404 429 411 393 331 269 308 346 328 310 292 274 282 289 339 390 366
99C66k4P6P6K5K6m6m6J5J6N8N9o6o6o6o6K2K2K1K2m8m8nnpppok7k7M5M5L2L3L2L3K4K5m7m6
94D13k5k4k4k5qpqq%JM3M3J0J1J0J0k9l0k9k9N4N4J1J1JKm2m2k8k8J4J5M1M2M1M2k1k1k1k1
89C99k6k5k6k5m0m0O0O0O8O8l2l2p6p6N3N3J2J3J2J3q9q9J2J2J8J9k4k4OPOPQQRQm7m7K4K5
84B62K3K4K3K4j0rj0rq0p9N0M9J6J6K9P2J7o8o6K1J2J3J5J6k3o6k4O2Q4lj00j00PR4R4Qj2
80C72j1N4R7O7j8p0j12r3n1K5O8R5N2Km0q7q6j7j8K8K8K9K8K6K6m5m5m8m8N3N2N9O0j3j2o9
76C38o8L1L2k3k4k3k4p1p0MR0R9J3noJ5J5n7n7j1j0O2O1k1k1%Q5N8J6KKJ3J3l1l0k8k9k8k8
71B84ppn0n0K1K1K1K1L6L6pom1m0L1L1J4J5N3N2R5Qr2r2l3J09J09l3j45j45k4k5J2J2J12J12
66D08l9m0k1O4L7m9l9l8LMLMM5M4M5M5n5n5J7J7m6m6m6m6JKM4M4k4k3k4k4rrk0O6M3m4l7M8
$$ plain form
99 366 342 418 494 519 545 499 453 468 484 542 601 535 469 403 337 359 381 402 424 376 328 323 318 311 304 297 291 264 237 282 327 359 392 424 457 481 506 459 413
94 413 388 364 340 315 307 300 292 284 284 285 328 371 381 392 402 412 383 353 324 295 349 403 414 425 426 428 386 344 316 288 302 317 358 400 441 483 462 441 420 399
89 399 373 348 322 297 257 217 277 337 405 473 441 409 333 257 310 363 375 388 400 413 324 235 247 259 277 296 272 248 254 261 267 274 282 290 299 307 260 213 237 262
84 262 285 309 332 356 346 337 327 318 238 159 209 258 274 290 319 391 408 340 274 295 307 320 335 351 328 262 238 300 384 381 281 181 188 282 376 384 372
80 372 361 415 512 579 561 491 379 286 235 260 328 423 475 477 437 350 264 247 229 257 285 314 342 368 394 349 304 256 208 261 313 372 432 419 407 338
76 338 270 301 333 310 286 263 239 168 98 102 192 291 304 299 293 308 323 266 209 198 188 250 311 290 269 269 354 412 428 430 432 445 458 427 397 369 340 312 284
71 284 277 270 220 170 191 212 233 254 290 326 319 313 272 232 263 294 308 323 376 428 523 531 439 347 314 423 532 499 354 209 185 160 172 184 296 408
66 408 369 329 308 372 409 360 321 283 286 290 293 297 342 386 431 476 421 366 383 400 354 308 262 216 217 219 263 307 283 260 236 212 203 194 174 240 283 239 202 250
62B50O0O0ooj1j0J2R9J07J07Lq3r5r5n8n8J9J8O2O1NMo7o8o4o4L7L6L4L3l7l8J4J5J4J4lm
57B97llRRl3l4P1P1J9o6o2o3MMj4j5j5j5R1R1O7j9n6n7RRrrL4L4M2M3q6q6RQN1N2K9L0j3j3
52D12o9o9KLjjM2M2O0O0j1j1K0K1K1K1l6l6l6l6K4K5j8j9m0m0L1L2l9l8MNP0O9K7K6k8k9p2
47C88p2n4n5J7J8O8O8mlm6m6m6m6M6M6M6M6L0L0L1L0o0n9n9n9K6K7K6K7j7j8j7j7L2L3m0l9
42B78j2j2j3j2nmm8m8L0L1J01J02POl6l7N3N3j8j9K0K0O3O3Q9R0J8J8q7q8j30j31K9K8K9K9
38D57lmllq9q9M0M0K5K4j8j8LMLLnnnnJKJJo4o5L6L6P2P3k8k7L5L5qqK1K1K1K1k0k0k0j9J
33D50Kr8r9J2J1l2l1J5J5k8k8m3m2K9K9M7M6M6M6n1n2M8M9k1k2k1k1j8j7N4N5J4J4J4J4k4
28C62k3k4k4MMMMN2N2j9k0o2o3O7O6MMMLoom9m9N4N4J0J1p7p6l4l4P2P2K9K9j4j5j5j4J3J4
$$ plain form
62 250 310 370 364 358 347 337 349 448 555 662 665 582 487 392 334 276 295 313 375 436 441 445 378 310 246 182 219 255 289 322 285 247 261 276 290 304 301 297
57 297 294 291 300 309 276 242 313 384 403 337 275 212 216 220 206 191 176 161 252 343 410 391 335 278 287 296 287 278 312 346 388 431 345 259 268 276 327 379 408 438 425 412
52 412 343 274 276 279 278 277 319 361 421 481 470 459 479 500 521 542 506 470 434 398 422 447 429 410 370 330 361 393 354 316 320 325 395 464 491 517 489 460 388
47 388 316 262 207 224 242 310 378 374 371 325 279 233 187 233 279 325 371 401 431 462 492 432 373 314 255 281 308 334 361 344 326 309 292 324 357 317 278
42 278 266 254 241 229 224 220 172 124 154 185 286 388 395 401 365 328 381 434 416 397 417 437 500 563 652 742 760 778 691 603 473 342 371 399 428 457
38 457 454 450 447 444 355 266 306 346 371 395 377 359 362 366 369 372 367 362 357 352 353 355 356 357 293 228 264 300 372 445 417 390 425 460 452 444 465 486 507 528 508 488 468 449 450
33 450 452 354 255 267 278 246 215 230 245 217 189 146 104 133 162 209 255 301 347 296 244 292 341 320 298 277 256 238 221 275 330 344 358 372 386 362
28 362 339 315 291 295 299 303 307 359 411 392 372 310 247 314 380 384 388 392 395 389 383 334 285 339 393 403 414 337 261 227 193 265 337 366 395 381 366 351 337 350 364
23C64l0k9q7q8J3J3P7P8n1n2o6o7ONN1N1N1N2K1K2n0m9M5M6n4n4m6m5N5N5N3N3j9j8j6j6j6
19B58j5K6K6m5m6j4j4J15J15L3L3l9l9k2k3k3k2J9K0J9J9k7k7k7k7M0M0L9M0pon0n0n7n8J4
14B18J4J08J09k0k0p1p0JJK5K6K5K5J7J8k6k6l1l1l1l1M4M5k8k7L1L0L1L1o5o4o5o4L9L9M0
10B47L9rrqrN6N7j5j5QQRQK0K0k3k3J4J5k9k8k6k6k6k6q4q5J5J5J07J08PPl8l8ONJ6J7J7J6
5C20l5l6QPMLMMQ4Q5J3J3k2k2k2k2k0j9j9j9j1j0n3n4j9k0K3K4P1P2K8K9kkm6m5PPP8P8K4
0D88K4m8m8k1k1k1k1j9j8j9j9qqqqJ8J8J7J8j7j7K6K6l1l1k9k8ON0P4j3o3o4L0P3Qp8p5J1
-5A54R6R6K9L0POo5o5k8k8k8k7J8J9O1O2rj0rrMNMMK8K7K8K7k6k6k7k6J7J7J6J7jjjkk4k5
-10C35k5k4l3l3L9L9opooJ2J1J2J2L9M0l1l2k6k7M6M5k6k7k6k7n1n2K0K1K5K6K6K6j6j6j6
$$ plain form
23 364 334 305 218 130 143 156 233 311 260 208 142 75 81 86 137 188 239 291 312 334 284 235 280 326 272 218 172 127 182 237 290 343 324 306 290 274 258
19 258 243 269 295 250 204 190 176 291 406 439 472 433 394 372 349 326 304 323 343 362 381 354 327 300 273 313 353 392 432 425 419 369 319 262 204 218
14 218 232 340 449 429 409 338 268 269 270 295 321 346 371 388 406 380 354 323 292 261 230 274 319 291 264 295 325 356 387 322 258 193 129 168 207 247
10 247 286 277 268 260 251 307 364 349 334 342 350 359 367 387 407 384 361 375 390 361 333 307 281 255 229 145 60 75 90 197 305 312 319 281 243 249 254 270 287 304 320
5 320 285 249 257 264 268 271 275 279 363 448 461 474 452 430 408 386 366 347 328 309 298 288 235 181 162 142 165 189 260 332 360 389 387 385 339 294 301 308 386 464 488
0 488 512 464 416 395 374 353 332 313 295 276 257 249 241 233 225 243 261 278 296 279 262 288 314 283 252 223 195 201 251 325 312 249 185 215 288 296 218 143 154
-5 154 250 346 375 405 412 418 353 288 260 232 204 177 195 214 275 337 328 318 309 300 304 309 313 317 345 372 400 427 401 375 348 322 339 356 372 389 388 387 386 384 360 335
-10 335 310 286 253 220 259 298 292 285 279 273 285 296 308 320 359 399 368 336 310 283 329 374 348 321 295 268 217 165 185 206 231 257 283 309 293 277 261
-15B61j6JJJJN5N5m6m5O6O6K3K3n5n5n6n5L4L5L4L5J7J7J6J7k7k7k8k7J2J2J3J2QRQRn4n4
-19B96J7J8k7k6J6J7o9o8KLL0L0L0K9j2j2j3j2LKLLm3m3K8K9J4J3J4J3k8k9k8k9N9O0N9N9
-24D08jkkjm7m7m8m7K1K1K1K0l0l1l0l1L4L4P7P7p1p0K9L0%%m3m2J5J5J5J5j2j3j2j3OONO
-29B62m6m5K6K6m9n0m9n0L8L7L7L8K9K9K9L0p0o9LKM0M1l2l1J0RN3N3K7K6m4m5L0L1L0L0j7
-34C69j8j7j8l9l9O1O1MMo8o7m5m6N5N5K2K3K2K2m7m6m7m6k4k3k4k3M5M4M5M5K0K0K1K0nm
-38C12nnJ4J3J3J3j9j9j9j9j7j8j7j8llM0L9m9m9N1N0MLMLL9L9l2l3ppK2k1l2M0R7R7jjkj
-43D96l9l9m0l9l3l4RRl4l5L7L7m3m3J%RRRRm6m6K5K5RRJ0Rk3k4qL4K9m3r3n0M1Q4Q7M4nn
-48C09pqK5K5K4K5m3m3m2m3noO7O6j6j6jM2K0n2m9K3L9M0k8k8j1j2L2L1l0l1l0l0j6j5n8J4
$$ plain form
-15 261 245 246 247 248 249 304 359 313 268 334 400 423 446 391 336 280 225 259 294 328 363 380 397 413 430 403 376 348 321 333 345 358 370 378 387 395 404 350 296
-19 296 313 331 304 278 294 311 242 174 176 179 209 239 269 298 286 274 261 249 252 254 257 260 217 174 202 231 245 258 272 285 257 228 200 171 230 290 349 408
-24 408 407 405 403 402 355 308 260 213 234 255 276 296 266 235 205 174 208 242 319 396 325 255 284 314 314 314 271 229 244 259 274 289 277 264 252 239 245 251 256 262
-29 262 216 171 197 223 174 124 75 25 63 100 137 175 204 233 262 292 222 153 156 158 198 239 207 176 186 195 248 301 328 354 310 265 295 326 356 386 369
-34 369 351 334 316 277 238 299 360 364 368 300 233 188 142 197 252 274 297 319 341 294 248 201 155 131 108 84 61 106 150 195 240 260 280 301 321 316 312
-38 312 307 302 316 329 342 355 336 317 298 279 262 244 227 209 206 203 243 282 233 184 235 285 289 292 296 299 338 377 345 312 305 298 320 299 267 307 404 501 500 499 497 496
-43 496 457 418 378 339 306 272 281 290 256 221 258 295 252 209 210 210 219 228 237 246 200 154 179 204 213 222 232 241 218 194 186 220 249 206 113 63 104 188 275 319 314 309
-48 309 302 294 319 344 368 393 350 307 265 222 217 211 278 344 328 312 311 353 373 321 272 295 334 374 346 318 307 295 327 358 328 297 267 237 221 206 148 162
-53A62N9J5k2K0P3P2J9n2l3L8O0J8n1n0j1j0l0l0J2N6J6n5n7J4O1j0o2j8L4L3l5l6L5L5L5
-57C05L4K2K1n0n0j5j4N7N7O6O6M2m3q8q7j8O8P3j2l1l0k5k4J5J6k6o8n2L3O1J7J8O0P0j7
-62D51q9m7N7N8m0m1%jjjMLLLm6m6m6m6J7J6Q2Q2O1k5m3jMMl6l6J1J0J0J1o7o7o7o7J1J1J1
-67A07J1P8P9PPm0m1j9O6O0J8n3n3M2M2M2M2K5K6j8j8J9J9n2n3p9p9ppJ8J9k5k4MNMMK7K6
-71B29K7K6j1j1j1j1O5O6onOPl6l6K4K4m8m7j2j2j1j2LMM6M7j8j7o1o0PQN0N1L3L3rj0LKK
-76C19KonL7L8M6M7p7p7m0M6M6m0p8p7M6M6L2L2L2L2n3n3n8K8K1K2p4p3j4j4j4j5qqqqN3N3
-81A78N2N3k3k3k3k3K8K8P1P0k0k1k0k1j0j0j0rK8K8j5j5k0k0k0k0K5K5m6m6PPQPN1N2k1k0
-86B62k0j9j9k0L5L5L5L5N0M9n0n1l5l5p2p2k7O0J11J11j1j0j1j1NMl8l9L5L5l6l7PQl6l6
$$ plain form
-53 162 221 236 214 234 307 379 398 346 313 351 411 429 378 328 317 307 277 247 259 315 331 276 219 233 294 284 222 204 238 271 236 200 235 270 305
-57 305 339 361 382 332 282 267 253 310 367 433 499 541 498 410 323 305 373 446 434 403 373 348 324 339 355 329 261 209 242 303 320 338 398 468 451
-62 451 362 315 372 430 390 349 349 348 347 346 350 353 356 359 313 267 221 175 192 208 290 372 433 408 365 364 368 372 336 300 311 321 331 342 275 208 141 74 85 96 107
-67 107 118 196 275 282 289 249 208 189 255 315 333 280 227 269 311 353 395 420 446 428 410 429 448 396 343 264 185 178 171 189 208 183 159 163 168 172 176 203 229
-71 229 256 282 271 260 249 238 303 369 363 358 364 371 335 299 323 347 299 252 240 228 217 205 208 212 258 305 287 270 209 149 156 164 214 265 298 331 322 312 315 317 319
-76 319 321 315 310 347 385 431 478 401 324 284 330 376 336 258 181 227 273 305 337 369 401 348 295 237 265 286 308 234 161 147 133 119 104 96 88 80 72 125 178
-81 178 230 283 260 237 214 191 219 247 318 388 368 347 327 306 296 286 276 267 295 323 308 293 273 253 233 213 238 263 217 171 178 185 193 200 251 303 282 262
-86 262 242 223 204 184 219 254 289 324 374 423 373 322 287 252 180 108 81 141 252 363 352 342 331 320 325 329 291 252 287 322 286 249 256 264 228 192
-90A92K2K1K2K2kkjkK6K5j7j7qrn1n1kkK7j6lQ2R8N5K2K2k1k1k0K3J0p7r2pJ1J1m5m4K7K7
-95B35K3K3j9k0OPRRL7P9O4k2j25q2J7N9%q5n9j5K7K8j3j3k5k4M6Q9N0l5p7l5PN0P6rm9n0
-100A84J7J6K2K3J9K0j7n9m0M5R1R1nmk7k8k7k7k2k2k3k2k5k6J7J8OOM9M9j2j1j2j2MLMLN2
-104C18N2k0k0KKl6l6r3qP4P3J6J6k7k7rqL5L5m8m8m7m8RRQRL3L2L2L3K3K3m8m8k7k7M5M5
-109B99%%%%oonoj8j8K5K5O6O6l5l4j5j5j4j5m6m6m6m6N2N2N1N2N9N9m1m1l3l4RRk0k0k0k0
-114B24J4J4J4J4m6m5JQ7P3j2q8q7L7L8K0o6l7M9L7L8n8n9j6j6j2j2j3j2P1P1J19L3q8q9k2
-118A76k2l2l1J2J2N5N6J3J2oppoj3j3n6n6K5K5R7R7P1P0k9k9m2m2m2m2J6J5J5J6J9K0n2n2
-123B43M8M7MNK6K5m5m6l0l0J4J3J4J4N7N7l6l5l5l6n3n4J7J8L8L9nnK5K5j8j9o2o2RJ0jj
$$ plain form
-90 192 214 235 257 279 277 275 274 272 298 323 306 289 281 272 221 170 168 166 193 177 174 256 354 409 431 453 432 411 391 414 424 347 255 248 259 270 225 181 208 235
-95 235 258 281 262 242 248 255 264 273 310 389 453 431 306 224 241 300 300 215 156 141 168 196 183 170 145 121 167 256 306 271 194 159 166 216 292 283 234 184
-100 184 201 217 239 262 281 301 284 225 185 230 321 412 407 403 376 348 321 294 272 250 227 205 180 154 171 189 195 201 250 299 287 276 264 252 256 259 263 266 318
-104 318 370 350 330 332 334 298 262 169 161 235 308 324 340 313 286 277 269 304 339 291 243 196 148 157 166 174 183 216 248 280 313 336 359 311 263 236 209 254 299
-109 299 299 299 299 299 293 287 282 276 258 240 265 290 356 422 387 353 338 323 309 294 248 202 156 110 162 214 265 317 376 435 394 353 320 286 295 304 284 264 244 224
-114 224 238 252 266 280 234 189 190 277 350 338 250 163 200 238 258 192 155 204 241 279 221 162 146 130 118 106 93 81 152 223 342 375 287 198 176
-118 176 154 122 91 103 115 170 226 239 251 245 238 231 225 212 199 143 87 112 137 234 331 402 472 443 414 372 330 288 246 262 277 292 308 327 347 295 243
-123 243 291 338 342 347 373 398 353 307 277 247 261 274 288 302 359 416 380 345 310 274 221 167 184 202 240 279 274 269 294 319 301 282 220 158 167 177 176 175
-128A75jjPOOPm0l9MLj9j8Q1Q1J9J8k4k4j6j6K8K7j1j2L1L1j5j5j6j5K4K3K4K4nmmmj2j1n5
-133B42n5R5R5l4l5n6n6M4M3L3L4j0j0m2m2L0L0n4n3J8J8O3O3O2O3J8J8n3n4k5k5k5k5j9j9
-137B77j9j8KLKLL4L5L5L4m2m3m3m2M7M6M7M7l1l1l2l1lmlmJ0Ro2o2NNrr6l2J11J54J1p7R
-142B42J09J10p8p8l1N5N2l3k2k2k2k3K1K1k0k0j9k0l9l9k1O4R7J1o4o4%j%jM5M5M5M6o2o1
-146B23o1o1PPPPJ6J7J7J7K7K8K7K8J8J8J8J9k4k4k4k4p4p4lkj8j7K5K5J6J7N9N9l6l6PQK8
-151B67K8j5j4k8k8M3M4RRRJ0j4j3n6n6M5M4k7k7p5p5K5K5LLM6M6K8K9m2m3M2M2M1M2l8l8
-155B91l8l8j9k0k0j9L7L6L7L7M7M8k4k4m9m8r1r1k9k7R9J00N5N5j7j7l1l0l0l1j7j6j7j7
-160H2K7K8K8K8kkjkM7M8k5k4NONNrrrrJ8J8q2q3ONM9M8qpqqJ5J6J15J16oon0m9o2o3o3o3
$$ plain form
-128 175 174 173 180 186 192 199 159 120 124 127 108 90 171 252 271 289 265 241 225 209 237 264 253 241 272 303 288 273 257 242 266 289 313 337 332 328 324 320 308 297 242
-133 242 187 282 377 343 308 252 196 240 283 316 350 340 330 288 246 276 306 252 199 217 235 298 361 423 486 504 522 469 415 390 365 340 315 296 277
-137 277 258 240 242 245 247 250 284 319 354 388 346 303 260 218 265 311 358 405 374 343 311 280 277 273 270 266 276 285 223 161 166 171 162 66 34 145 299 310 233 242
-142 242 351 461 383 305 274 329 381 348 326 304 282 259 280 301 281 261 242 222 183 144 123 187 284 295 231 167 167 166 166 165 210 255 300 346 284 223
-146 223 162 101 108 115 122 129 145 162 179 196 223 251 278 306 324 342 360 379 355 331 307 283 209 135 132 130 112 95 120 145 161 178 237 296 260 224 231 239 267
-151 267 295 280 266 238 210 253 297 306 315 324 334 320 307 251 195 240 284 257 230 155 80 105 130 133 136 182 228 256 285 243 200 242 284 325 367 329 291
-155 291 253 215 196 176 156 137 174 210 247 284 331 379 355 331 282 234 143 52 23 -4 95 195 250 305 288 271 240 210 180 149 132 116 99 82
-160 82 109 137 165 193 191 189 188 186 233 281 256 232 237 243 248 253 244 235 226 217 235 253 171 88 94 99 148 196 188 181 173 165 180 196 311 427 421 415 365 316 254 191 128 65
-165F5J7J7J7J7N5N5N5N5j9j9k0j9p5p5M9M8kq9n1L5Q7Jp5p4M7M6k5k5L1L1L1L1j1j1L2L1
-169B63k3k4o6o7K9K8K8K9K1K1K1K1l9l8l9l9N7N6Nq2m0m0klj4j5rj0J7J03J20J21K3o3j10
-174B40j09k9N7J09J08qrn1n1k5k4J8J8OOM9M9n2n1qrl6l6J1R6J01J6j12j12k4O3J4J4K2K3
-178B74k1k1o9o8OR2R8J3l4l4J5J6J5J5k3k3K0K0K5K5j7j8l9m0m0m0M4M4JKmlp5p5n9n8M0
-182DM1O0O1J7J8n4n4j1j1jjjjLLl5l4m4M0O3O4j7j8j7j7pqpqL5L4L5L4l9l9MMO5O5K2K2O5
-188C35O5J3p3p7p7j1j1n2n2j0rqqO4O4N8N9N8N8j1j1j2j1n8n8j5j5k2k2K1K1L4L5L4L4l1
-192B99l0OPpr2n5L0P1j4r0r0ppopJ9J9N7N6N4l2k6k7K5K6m7m6RRJ0RM1M2M2M1l7l7j9O7O4
-197C27k1q7jP0P0n3n3KJm1m2L3L3L8m7l4l4l9l9j9j8N3N3Q5Q5J4J4K7K7j9j05n5L2K6o0m6
$$ plain form
-165 65 82 99 116 133 188 243 298 353 334 315 295 276 201 126 175 223 221 132 81 116 203 204 129 55 102 148 123 98 129 160 191 222 211 200 232 263
-169 263 240 216 150 83 112 140 168 197 218 239 260 281 242 204 165 126 183 239 244 162 122 82 80 77 63 48 39 29 46 149 269 390 413 350 240
-174 240 131 102 159 268 376 368 359 308 257 232 208 226 244 250 256 305 354 302 251 243 234 198 162 173 269 370 386 274 162 138 201 215 229 251 274
-178 274 253 232 163 95 101 193 291 304 270 236 251 267 282 297 274 251 271 291 316 341 324 306 267 227 187 147 191 235 236 238 234 231 156 81 22 -36 4
-182 4 45 105 166 183 201 147 93 82 71 70 69 68 67 70 73 38 4 -40 0 63 127 110 92 75 58 51 43 36 28 63 97 132 166 127 88 92 96 161 226 248 270 335
-188 335 400 413 340 263 186 175 164 112 60 50 41 33 25 89 153 211 270 328 386 375 364 352 341 283 225 210 195 173 151 172 193 227 262 296 330 299
-192 299 269 275 282 275 183 128 158 229 215 125 35 28 21 15 8 27 46 103 159 213 181 155 128 153 179 132 86 95 104 114 123 164 206 248 289 252 215 196 263 327
-197 327 306 219 218 288 358 305 252 254 255 214 172 205 238 276 229 195 161 122 83 64 46 99 152 237 322 336 350 377 404 385 280 225 257 283 223 177
-201A77m7K0K0j5j4Q1Q0M6m1QQJ8J7q3q3n4n3M7M6N2N1QRj3j2n5n5kkkkj8j8K5K5PPQPr7r8
-206CJ2R8P7P7j7j8l7l7NOm3m2J0R5N5N5l9m0j3j3j3j3j09j07l4N2Qp7l0N7M7M7M7M8O7j8
-211A66k3O2J04J7k9k8qqq0p9L8L9J5p0l5l6KLK4K5K5K4PPl7l6L2L2L1L2n9o0J2J2N8N7J5
-215B51J5m8m9Q1Q1j7j7o0o0N3N4N3N3J2J1o0o1l6l6OPN9O0m1m1J5J4J4J4j1j2n5n4k3k3K0
-220A69K1N6N6j6j6K0J9k3k3o5o5PPL0L0j3j3L6L5qpj2j3q4q3KLP5P4jjjjQ0Q0k0j9l1l1J3
-224B67J2j3j3L1L0ppn0n0m2m3K9K9m2m3JJJ8J7J8J8K4K4j9j9k7k8k8k8P6P5n3n4J7J6J6J7
-229A70R5R5J5p2k0k0j5j01p7RQ4Q4qqn1n1J0J0J1J0L8L8J4p1p4p4K1K1P9P9P9P9K0K0p5p4
-233B90m2M4L9L9o4o3k0k0M3M3J%j6j5j6j6nnnnN3N2L0n7o0o1L4L3j4j4k0O7R9R9n2n3j9j8
$$ plain form
-201 177 130 150 170 155 141 222 302 348 307 315 323 341 358 275 192 138 85 132 178 230 281 289 298 285 273 218 163 161 159 157 155 137 119 144 169 176 183 191 198 101 3
-206 3 15 113 190 267 250 232 195 158 163 169 126 84 94 189 244 299 260 220 207 194 181 168 59 -48 -82 -30 -22 -99 -129 -72 -25 22 69 117 184 166
-211 166 143 205 309 326 297 269 261 253 173 94 132 171 186 116 81 45 47 50 74 99 124 148 155 162 125 89 121 153 184 216 157 97 109 121 179 236 251
-215 251 266 218 169 250 331 314 297 237 177 230 284 337 390 402 413 353 292 256 220 226 233 292 352 311 270 285 299 313 327 316 304 249 195 172 149 169
-220 169 190 246 302 286 270 290 309 286 263 198 133 140 147 177 207 194 181 217 252 244 237 225 212 128 45 47 50 125 199 198 197 196 195 275 355 335 316 285 254 267
-224 267 279 266 253 284 314 307 300 250 200 158 115 144 173 131 88 89 90 108 125 143 161 185 209 190 171 144 116 88 60 136 211 158 104 121 137 153 170
-229 170 265 360 375 303 283 263 248 147 70 79 163 247 239 231 180 129 139 149 160 170 208 246 260 189 115 41 62 83 162 241 320 399 419 439 364 290
-233 290 248 292 331 370 306 243 223 203 246 289 290 290 274 259 243 227 222 217 212 207 260 312 342 285 225 164 198 231 217 203 183 250 349 448 396 343 324 306
-238C06j9j9P9P9K7n9r1r0n3n3JJP2P3O4O5n9n9l0N5QPk4k4j8j8JQ7N0l7q3LJ02J01l9j25
-242B81j63p7K5J11O7O8m3m2K4K4L8m7p1p0O3O4j2r7n4L2K1K1L8L8Q1Q1j2j1j2j2L0L0m5j31
-247B38r3pJ2J1k1k1k1k1K1K2K1K2QQQQN6N6O2k4p2p1K3K3J9J9k3k4K4K5Pq0j03j7N7N8K2
-251B32K2m4m4j00j5L8L8n0n0K1K2Q0Q0L7L7j4j4j4j4o3o4k1k2qqrqRRQ1Q1n4n3n9K8O5O5
-256B17J19L4q6q6j9k0l0l1J3J3J7J7k6k6klkkj9j8j9j8O8O9P5j2m8m9j1j0m4m5K8K7M7M6
-260A64n4n4M2M2M2M2m3m2JJk0k0j9k0L7L7L6L7K0K0J9K0j21j20QQqqqqN4N3N4N4ppppl3l4
-265A51L8L8L3L2l9l9rj0rj0n1n1rql9l7MML7L8L8L8j5j6K7K7j8j9j9j9QQl5l5L7L7L7L7J2
-270A94J2J1J2j02j02N6N5O2O1l8l9n6n6M4M3L5L5qqn4n3J8J8mlm7m6m4m5Q3Q4RRRRK5K6K6
$$ plain form
-238 306 287 268 347 426 453 394 303 213 160 107 108 109 181 254 318 383 324 265 235 290 298 305 281 257 239 221 222 309 359 322 239 242 344 445 406 281
-242 281 118 41 66 177 244 312 269 227 251 275 313 266 195 125 188 252 240 143 89 121 142 163 201 239 320 401 389 378 366 354 384 414 369 238
-247 238 145 138 150 161 140 119 98 77 98 120 141 163 171 179 187 195 251 307 369 345 273 202 225 248 267 286 263 239 263 288 295 215 112 95 152 210 232
-251 232 254 210 166 66 51 89 127 77 27 48 70 150 230 267 304 290 276 262 248 185 121 100 78 70 62 53 45 54 63 144 225 171 118 59 87 152 217
-256 217 336 370 284 198 179 159 129 98 111 124 141 158 132 106 104 101 99 97 78 60 41 23 91 160 235 223 175 126 115 105 61 16 44 71 118 164
-260 164 110 56 98 140 182 224 181 139 140 141 121 101 82 62 99 136 172 209 229 249 268 288 167 47 55 63 55 47 39 31 85 138 192 246 239 232 225 218 185 151
-265 151 189 227 260 292 253 214 205 195 186 176 125 74 65 57 18 -19 -15 -11 26 64 102 140 125 109 136 163 145 126 107 88 96 104 69 34 71 108 145 182 194
-270 194 206 217 229 127 25 81 136 198 259 221 182 126 70 114 157 192 227 219 211 157 104 122 140 136 133 86 40 -4 -49 34 118 127 136 145 154 179 205 231
-274B31K6rrrrl6l7L6L5N2N1m8m9j0j0rj0j4j3j4j3l8l8MNOOM9M8RRo3o3PPM9N0k4k5M7M8
-279B25K0K0k3k2o0o0J2J2Q5Q5M3M2n1n1qql5l5l5l5K9K9K9L0l5l4QRk8k9k8k8O2O2J9J9n9
-284A76n9j6j6P3P3JJkkjkk8k9k8k9LLM5M6NMNNJ9J9q0q1l3l2L9L9J2J1J2J2M5M4n5n5j7j6
-289A11N5N5J6J7n5n5RJ0RRJ8J8J8J8k1k1K2K2j8j7j8j7j3j2L0L0OOPOjj%j%j%jl0l1l0l0
-294A19P9P9K7n9p0o9lmK5K4K5K4M0M0q4q4n6L0K4K5m2m1JKM3M2k8k9L7L7M8l8p0J7L4L5j0
-299A70rj0j0qpqqK3K4k0k0K6K5K5K5k3k3K0J9n8n8j1P4M9l7k6k7O7O7K4K4k2k1o4o4l0l0
-303F8J3J3O0O1O6j9r0q9K8K9%q5m3M3R9R9k5k4n7n6j0P6J23L8l8l7L9M0M0M0K8K8j29j30
-307A99m4m5K7K8m1m1L1L0l1l2M0M0M7M6MLl4l5l4l5M6M5k6k7k3k2K0K0N0N0M9N0k6k6o8o9
$$ plain form
-274 231 257 248 239 230 221 185 148 184 219 271 322 274 225 215 205 196 186 172 159 145 132 94 56 60 65 71 77 126 174 183 192 129 66 73 80 129 179 155 130 177 225
-279 225 245 265 242 220 160 100 112 124 209 294 337 379 328 277 269 261 226 191 156 121 150 179 208 238 203 169 177 186 158 129 101 73 135 197 216 235 176
-284 176 117 101 85 158 231 232 233 231 229 228 226 198 169 141 112 115 118 163 209 214 218 223 228 247 266 186 105 72 40 79 118 130 141 153 165 210 254 199 144 127 111
-289 111 166 221 237 254 199 144 153 163 172 181 199 217 235 253 232 211 233 255 237 220 202 185 172 160 190 220 226 232 239 245 244 243 243 242 242 241 241 240 210 179 149 119
-294 119 198 277 304 245 175 106 103 99 124 148 173 197 237 277 193 109 53 83 107 132 90 49 50 52 95 137 109 80 117 154 202 164 94 111 145 180 170
-299 170 161 151 141 133 126 118 110 133 157 137 117 143 168 193 218 195 172 192 211 153 95 84 158 207 170 144 117 184 251 275 299 277 256 192 128 98 68
-303 68 81 94 154 215 281 262 172 83 111 140 140 55 12 55 154 253 228 204 147 91 81 157 280 318 280 243 282 322 362 402 430 458 329 199
-307 199 155 110 137 165 124 83 114 144 113 81 121 161 208 254 258 261 227 192 158 123 169 214 188 161 138 116 136 156 206 256 305 355 329 303 235 166
-312A66J9J9k4k4MNNNL4L5rqm8m8Q1Q1mnp7p6P2P3J%n2n3j0j0k1k0K2K3J7J7k6k6l1l1J2J2
-317A00P7P6NNJ9J9k4k4m3m3N7N7n1n2n2n1L1L2m0m0k1k1N0N1O5O5l6l5l3l4J0J0M9M9k3k3
-321A81ooO5O5K1K1n1n1p6p5K5K5M6M6n0m9j4P2P2j4o8o8P0P0M3M3%jk0k1k1k1QPQPl9l9l9
-326A66l9K3K3K3K3O3O3k2k3o3o4k0k1m2m2JJN8N7N2N2N0l6p3p3j6j6K7K7M2M1jkN0N0l5l6
-330B68k0j9K3K3j5j6j02j01j2j1qrK9P2R6J0l6l6m1m1M0M1M0M0kkm5m5M5M5j1n5J8J03J00
-335C66J5j31j31m7L9N9k8q0l8K3O6Q3Q2J02J6p9p8onnok6k6O0O0opm9m9k7k7N9N9POp9p9
-339I3J8J8k4k5Q5Q5jjn1n0ppJ0J0l3l3j6j7j7j6L9M0M0M0l6l5l6l5L2L3L3L2OONOQPR4R3
-344C93j8j7j03j04k8k8k8k9N7N7J4J4m8m8L7L8j3j3j4j3K7K7K7K8J4J5J4J5m5m5M0M1M9M9
$$ plain form
-312 166 185 204 180 156 160 165 170 175 209 244 235 227 179 131 212 293 289 284 207 131 203 276 277 277 225 172 162 152 131 111 133 156 173 190 164 138 107 76 88 100
-317 100 177 253 258 263 282 301 277 253 210 167 224 281 230 178 126 75 106 138 98 58 37 16 66 117 182 247 211 176 143 109 119 129 178 227 204 181
-321 181 175 169 234 299 320 341 290 239 163 88 113 138 184 230 180 131 117 189 261 247 179 111 181 251 294 337 337 336 316 295 274 253 261 268 276 283 244 205 166
-326 166 127 150 173 196 219 282 345 323 300 237 173 153 132 90 48 49 50 108 165 217 269 319 283 210 137 121 105 132 159 201 242 241 239 289 339 304 268
-330 268 248 229 252 275 260 244 142 41 29 18 10 1 30 102 198 208 172 136 95 54 94 135 175 215 213 211 166 121 166 211 200 145 163 266 366
-335 366 381 250 119 72 111 170 142 62 24 47 113 196 278 380 396 317 239 233 228 223 217 191 165 225 285 279 272 223 174 147 120 179 238 245 251 172 93
-339 93 111 129 105 80 165 250 249 248 197 147 140 133 143 153 120 87 71 54 37 21 60 100 140 180 144 109 73 38 70 103 136 168 174 180 185 191 199 206 300 393
-344 393 375 358 255 151 123 95 67 38 95 152 166 180 132 84 121 159 146 133 119 106 133 160 187 215 229 244 258 273 228 183 223 264 313 362
-348C62NOj1j2j1j1k5k5k5k4k1k1k1k1j0j0j0j0j2j2j2j2K0K0K0K0j2j3j3j2L1L1L2L1J2J3
-352B37l1l0l7l6M9M9o4o3o4o3j4j5P1P1k8k7J6J5%j%jjjL9L9j2n5p8PP2P2L6L5k8k7k7k8
-357G7O8O7M7l9m2%J4J4j0rL3L4l2l2l1l2KLM5M5j3j3n0n1j5P1J15K8o7o6K8K8J8J9n4n3k2
-362A25k2k1k2M2M2P9Q0M2m4r1r0k5O1O6j9j8O8O6k1p5l2O2O2p8j64j19l5N4N4J7J7M4M4M4
-366A93M4k5k5k5k5QQN0R3O6k0m1m1J9J9J9J9n6n5j3j3M4M3n5r9o7J9km6n0L3P9L6j6j5K5
-370A28K5KKLKm8m9Q0Q0k9l0J3J3j1j1n4n3M5M6M5M5%%m3m3j1j1L2L2j6j5j6j6J0RRRn6n6
-375F2J6J6O1O1l9l9L1L0J03J02o3o2RRMLl9m0m0m1m0m1N4N5j8j7k4k3J9J9K1K0n2n1l6l5
-379el6l6P9Q1L8L7L3L2L3L2k2k1K1K1J7J7k7k6m0m0O1O0%Jm3m2j8j8j8j8l0k9J3J4L2L2j1
$$ plain form
-348 362 367 373 362 350 339 328 303 278 253 229 208 187 166 145 135 125 115 105 93 81 69 57 77 97 117 137 125 112 99 87 118 149 181 212 224 237
-352 237 206 176 139 103 152 201 137 74 10 -53 -67 -82 -11 60 32 5 21 36 36 35 35 34 33 32 71 110 98 43 -35 -28 44 116 152 187 159 132 105 77
-357 77 145 212 259 220 178 178 192 206 196 187 220 254 222 190 159 127 129 132 177 222 209 196 146 95 80 151 266 294 227 161 189 217 235 254 200 147 125
-362 125 103 82 60 102 144 223 303 345 301 210 120 95 156 222 203 185 253 319 298 223 191 253 315 237 73 -46 -81 -27 27 44 61 105 149 193
-366 193 237 212 187 162 137 145 153 203 296 362 342 301 260 279 298 317 336 280 225 212 199 243 286 231 132 65 84 82 36 -14 19 98 134 118 103 128
-370 128 153 155 157 160 162 114 65 145 225 196 166 179 192 181 170 116 63 108 154 199 244 244 244 201 158 147 136 168 200 184 169 153 137 147 156 165 174 118 62
-375 62 78 94 155 216 177 138 169 199 302 404 341 279 288 297 301 304 265 225 185 144 104 63 117 172 154 137 113 90 109 128 149 169 117 66 30 -5
-379 -5 -41 -77 2 83 121 158 191 223 256 288 266 245 266 287 304 321 294 268 228 188 249 309 309 310 267 225 207 189 171 153 123 94 107 121 153 185 174
-384A74j1k2k1P8P9L7L7o4o3n4n4J7J7mnm7m7j1j1L3L2j6j6j6j6M1M0M0M1k8k7k8k7j4j5N8
-388A07N7k3k4k3k4M5M4M5M4l5l6PPL5L5qqj4j4K9K9p6p5l3l3L3L2L3L2OOl7l8LLLLj3j3L0
-393A41L0qqqqKLLLN1N2QRl5l4l4l5M4M3n7n6k6k5k6k5K8K7K8K8JJm2m2J26J26N5N4o0o1o1
-398B12o1M5M4n6n7kklkJ8J9k5k4M1M2jkOONOl7l6POP3P3JJl8l8l9l8k0j9k0k0KLKLJ1J1Q3
-403A80Q2K0K0k3k3RRQRl3l3l4l3lmmlm7m6N3N4M6M7k6k5k2k1K1K1m7m8N3N2J5J5k8k8N8N7
-408B98p1p2m1m2L0K9j2j3j3j3O2O1j0j0K9K9j5j4nonnm6m5m5m6RQQQLKLKo3o5L6L5MKLLj
-414FjjjJ2J2J2J2J8J8J8J9j3j3Q8Q7l0k9l0l0j1j2j1j2J3J4J3J4M0L9M0M0o1o1J0J0POOP
-418B45l9l8MNKKKKL0L0m2m2mnL8L9p8p7noJ6J5J6J5K9K9j4j4j8j9K4K4L0K9m1m2k3k4K0K0
$$ plain form
-384 174 163 141 120 198 277 314 351 287 224 170 116 133 150 146 141 94 47 36 25 58 90 74 58 42 26 67 107 147 188 160 133 105 78 64 49 107
-388 107 164 141 117 94 70 115 159 204 248 213 177 184 191 226 261 253 245 231 217 246 275 199 124 91 58 91 123 156 188 194 200 163 125 128 131 134 137 124 111 141
-393 141 171 163 155 147 139 141 144 147 150 201 253 261 270 235 201 167 132 176 219 162 106 80 55 29 4 32 59 87 115 116 117 75 33 159 285 340 394 334 273 212
-398 212 151 196 240 184 127 125 123 120 118 136 155 130 106 147 189 188 186 192 198 203 209 172 136 143 149 222 295 296 297 259 221 182 144 124 105 85 65 67 70 72 75 86 97 180
-403 180 262 282 302 279 256 265 274 282 291 258 225 191 158 155 151 147 144 97 51 104 158 204 251 225 200 178 157 178 199 152 104 157 209 224 239 211 183 241 298
-408 298 227 155 114 72 102 131 119 106 93 80 142 203 193 183 212 241 226 212 207 201 196 191 145 100 55 9 18 26 34 42 45 47 50 52 -11 -76 -40 -5 -1 1 4 7 6
-414 6 5 4 3 15 27 39 51 69 87 105 124 111 98 186 273 243 214 184 154 143 131 120 108 121 135 148 162 202 241 281 321 260 199 209 219 226 232 238 245
-418 245 206 168 172 177 179 181 183 185 215 245 203 161 157 152 190 229 151 74 69 63 79 94 110 125 154 183 169 155 137 118 142 166 196 225 184 142 119 95 115 135
-423A35j3j3j3j4K6K5m6m6k4k2J04J05L2L3o8o8o8o8LK%jj%lmnmK5K6O9O8j5j5j6j5M7M7n2
-428A53n3M0M0M0M0J6J5k7k7n0n0opL7L8l4l4ppn1n0k9k9O9P0L4L3P7P7m1m0m0m0nonnL0L0
-433A96L0L0mnL3L2Mq2l3l4j8j9j8j8ooonO7O8qr3j03j6K9K9J0J0J0J0K7K7K7K7KLM6M6JK
-438B92KJj27j27q3N8O6k0j1P5J09J09p2p2j8j7j8j8rj0L4L3MNl8l9j7j6K6K6M5M4n5n5K8
-442A35K9K9K9l0k9k9k9L9L8mmNOl8l8m3m3k0O7J01J01Lq3l3N3J0p6r9j2L4L4mnL9L9J7J8
-446B07J8J7LKLKPQPQn8n8J3J4ONONn1n1n1n0K8K7K8K8ONONn6n7o1K4Q3Q4J8J7K0K0n2n2k7
-452A06k7M5M5OOl6l7J6J6k7k6j7j6j6j7J6J6J6J6kjM1M1O9P0n5n4k2O3K1o5o3o3LKj2j3N8
-456A03N9OOOOJ4J5q1q0j3P4J16L1n9n9o4o4M2M3M2M2l2l1l2l2j4j4j4j4K4K4K4K4kjjjk7
$$ plain form
-423 135 122 109 96 82 108 133 87 41 17 -5 99 204 236 269 201 133 65 -3 0 2 2 1 0 0 -3 -7 -12 -16 9 35 104 172 157 142 126 111 158 205 153
-428 153 100 140 180 220 260 276 291 264 237 187 137 131 124 161 199 165 131 124 117 66 16 -13 -42 27 97 131 164 241 318 277 237 197 157 152 146 141 136 166 196
-433 196 226 256 252 247 280 312 316 234 201 167 149 130 112 94 88 82 76 71 138 206 198 105 2 -14 15 44 54 64 74 84 111 138 165 192 194 197 243 289 290 292
-438 292 294 295 168 41 -42 16 82 62 51 126 235 344 272 200 182 165 147 129 120 110 144 177 181 186 148 109 92 76 102 128 173 217 162 107 135
-442 135 164 193 222 192 163 134 105 144 182 178 174 179 185 147 109 66 23 3 70 171 272 275 192 159 212 222 146 47 35 69 103 99 94 133 172 189 207
-446 207 225 242 245 247 250 252 259 267 274 282 224 166 179 193 199 204 210 215 164 113 62 12 40 67 95 123 129 134 140 145 89 32 -29 -5 78 162 180 197 217 237 185 133 106
-452 106 79 124 169 175 181 145 108 124 140 113 87 70 54 38 21 37 53 69 85 83 82 123 164 233 303 248 194 172 235 256 191 128 65 68 70 58 45 103
-456 103 162 168 174 180 186 200 215 134 54 41 115 231 262 203 144 80 16 58 101 143 185 153 122 90 58 44 30 16 2 26 50 74 98 96 95 94 93 66
-461F6k7k7k6R6R6Q2o1j24l8L4L3j0j0L3L2j9j9j9j9J2J3l1l1m5m6K5K5M0M0l1l1K5K5K5K6
-465A14K4K4j9j9k9l0M3M2k2k1k2k1kkO9P0m2m2KJrj0j0rK5K5K6K5n4n3n3n3L2L0L2L1O6O6
-470B25ooj07j07o5o5O2O1O0O2K4K5j8j9n8n9J3J2J2J2Q4Q3J3J3J3J3L3L3l9l9l1l1l1l1p9
-474F2p7ppQ1Q3L9L9m2m3m3m3nonnRRl4l3l0l1R7R8K4K4m8m8lkllL9L9L9L9lkll%%%%j7j7
-480A58K6K6J5J4n7n7OPl4l3J0N3L7m9m4%M1M1m0m0LLM2M2k9p1r0mM3M5k6k5J7J7J5J4J5J4
-484A05O4O3K1K1k9k9J5J4j6j6n9n8K1K2K2K2MNNNm9m9m9m9L6L6L6L6j7j8K5K5M5M4k8k7r0
-489A09r0o6J9M8M9J1J2K1K2K1K2o1o0J0N3L6n0n2L3J17L0m5m5%%%%N7N8j5j4k8k9m2q5q2
-493c6LN1N2K6K7j6j6n0m8K1K2M6M6n4n5J9J9J9J8L4L4rrL2L2j1j1m3m3%%J1J2N5N5J8J8J8
$$ plain form
-461 66 39 12 -14 82 178 260 199 75 37 71 104 94 84 117 149 130 111 92 73 85 98 67 36 -9 -55 -30 -5 35 75 44 13 38 63 88 114
-465 114 138 162 143 124 95 65 108 150 128 107 85 64 62 60 129 199 157 115 117 118 109 99 89 80 105 130 156 181 127 74 21 -32 0 30 62 93 159 225
-470 225 219 213 106 -1 -66 -131 -69 -8 52 114 138 163 145 126 68 9 22 34 46 58 142 225 238 251 264 277 310 343 304 265 234 203 172 141 62
-474 62 -15 -22 -29 52 135 174 213 171 128 85 42 37 31 26 21 30 39 5 -28 -58 -89 8 106 130 154 106 58 55 53 50 47 86 125 164 203 200 198 195 192 192 192 192 192 175 158
-480 158 184 210 225 239 182 125 131 138 104 71 81 134 171 122 78 78 119 160 120 80 83 86 128 170 141 70 -20 -24 19 64 38 13 30 47 62 76 91 105
-484 105 169 232 253 274 245 216 231 245 229 213 154 96 117 139 161 183 187 192 197 202 153 104 55 6 42 78 114 150 133 115 140 165 210 254 226 199 109
-489 109 19 -47 -28 20 69 80 92 113 135 156 178 117 57 67 120 156 106 54 87 204 234 189 144 144 144 144 144 201 259 244 230 202 173 131 46 -36
-493 -36 -33 18 70 96 123 107 91 41 -7 14 36 82 128 74 19 38 57 76 94 128 162 153 144 176 208 197 186 143 100 100 100 111 123 178 233 251 269 287
-498B87J8q3q3m0m0L0K9L0L0n8n8l5N2P1P2k3k3n4n4M7M6L0L1j3j3J1J1l2l2J9J9m8m7KQ9
-502A88Q8Kp1p1mnK9L0K9K9l2l2p0p0o8J7O8O9nnonOOl6l7j3j3j2j2M1M1M2M1j8j7K5K6l6
-507A39l6j9O8M8l8k7k7N0N1n0n0LMMMJ0J1J0J0k8k9k9k9J0J0J1J0ONOOl0l0P1P0MLLMlkl
-512B01km6m7m6m6N9O0j2j2L4L4L5L4L6L6l6l6q5q5m2m1RJ0N2N3j8j8j8j8jjP0P0K1K1p9q0
-517F6L5L4l7l7P8P7O3q0j36n0K1K1K0K0K1K0lkm6m5J2J3N6N5J8J8k5k5k8k8M3M3N9N9p0p0
-521A70p7p7nnO4O4qpPQQPm1m2JKQ0Q0k1k0j7j7j7j7n5n6n4n6L2L2L2L1k1k1K0K1l4l5QQM4
-526A6M6KLJ6J6N9O0J0J1l2l2p1p1N8N8poppM9M9M9M9p6p7p6p6L2L2L3L2rj0j0ro0n9J1J1
-531GR4R4K2K3rqqqONNOo4o3o3o3j8j9Q0Q2N3N4J0J0o7o8NMlklkNOo6o5N7N9j3j2j7j6K6K7
$$ plain form
-498 287 305 222 139 99 59 89 118 148 178 120 62 27 79 150 222 199 176 122 68 115 161 191 222 209 196 207 218 186 154 173 192 144 97 99 188
-502 188 276 278 207 136 132 127 156 186 215 244 212 180 110 40 -28 -11 57 126 121 116 110 105 111 117 81 44 31 18 6 -6 35 76 118 159 141 124 149 175 139
-507 139 103 84 152 200 162 135 108 158 209 159 109 112 116 120 124 134 145 155 165 137 108 79 50 60 70 81 91 97 102 108 114 84 54 125 195 199 202 205 209 206 204 201
-512 201 199 153 106 60 14 73 133 121 109 143 177 212 246 282 318 282 246 161 76 34 -7 2 12 64 117 99 81 63 45 44 43 113 183 204 225 146 66
-517 66 101 135 98 61 139 216 279 199 63 13 34 55 75 95 116 136 133 131 85 40 52 65 121 176 194 212 187 162 134 106 149 192 251 310 240 170
-521 170 93 16 11 6 70 134 126 119 126 134 142 149 108 66 67 69 149 229 208 188 171 154 137 120 65 9 -45 -101 -69 -37 -5 26 5 -16 4 25 -9 -44 -36 -28 16
-526 16 62 64 67 83 99 158 218 228 239 207 175 104 33 91 149 142 136 129 122 171 220 269 318 242 165 89 13 45 77 110 142 133 123 113 104 44 -15 -4 7
-531 7 101 195 217 240 231 223 215 207 213 218 223 229 165 102 39 -24 -42 -61 19 101 154 208 218 228 161 93 98 102 99 97 94 92 97 103 37 -28 29 88 75 63 46 30 56 83
-536H3k0k0K3K3n3n1J8K0l1l2M0L9O2O2O3O2l9l8q2q1m3m2K8K8k8k9R9J00R7R6l2l2p9p9l6
-540I6l5L4L4rrnmL9L9J4J5J4J5p0p0k7k8ppqpRRl2l4K3K2K2K3K1K1O9j6n4n4L5L5o1j45k7
-545a20J16J07K3n0m9M7M6M7M7m4m4m4m3k2k0k1k2J6J5J5J5N5N6J3J3l1l1p3p3K8K8j4j5q
-549c7qO2O3pqppm4m2K9K7K1K1J6J5O0k7o9J6O2O2l3l3l8l8L4L4l7l7l6l6J4J3J4J4K3K4K3
-554A03K4M3M3noK8n9q2q2L5L6L5L5m5m5n0L6O0O1o3o2j8j7j7j7L0L1L1L1J8J9n3n3j5j4j5
-559a9j6L2L0j1j2L1L0m1m0L8L8k8k8kQ4Q4kl4l4L2L2nnonl7l7POK4K4K4K4P4P3N0l5j6j6
-563C08k2k1q0q0K1K0l0l1l6N0O3O3j3r8p6p4j0j0J1J0J1J0O2O3llL2J18P4j1q7q7m9n0K8
-568G3K8K8K9l3l3l2l3j6j5N5N5j1j2L2L1N7N6J3J3p7p7K3K3JKJKJKmmM1m5r1r1J1R9R2R3
$$ plain form
-536 83 63 43 66 89 36 -15 3 23 -8 -40 0 39 101 163 226 288 249 211 129 48 5 -37 -9 19 -9 -38 61 161 258 354 322 290 211 132 96
-540 96 61 95 129 120 111 106 102 141 180 194 209 223 238 168 98 71 43 36 29 21 14 23 32 0 -34 -11 11 33 56 77 98 167 151 97 43 78 113 52 -93 -120
-545 -120 -4 103 126 76 27 74 120 167 214 170 126 82 39 17 -3 -24 -46 -30 -15 0 15 70 126 139 152 121 90 17 -56 -28 0 -14 -29 -37
-549 -37 -45 17 80 73 65 58 51 7 -35 -6 21 42 63 79 94 154 127 58 74 136 198 165 132 94 56 90 124 87 50 14 -22 -8 5 19 33 56 80 103
-554 103 127 170 213 208 202 230 171 89 7 42 78 113 148 103 58 8 44 104 165 102 40 22 5 -12 -29 1 32 63 94 112 131 78 25 10 -4 -19
-559 -19 -35 -3 27 16 4 35 65 24 -16 22 60 32 4 2 86 170 168 134 100 132 164 159 154 148 143 106 69 76 82 106 130 154 178 252 325 375 340 324 308
-563 308 286 265 185 105 126 146 116 85 49 99 162 225 212 114 38 -36 -46 -56 -45 -35 -24 -14 48 111 108 105 137 255 329 318 231 144 95 45 73
-568 73 101 129 158 125 92 60 27 11 -4 51 106 95 83 115 146 203 259 272 285 208 131 154 177 178 180 181 183 184 186 182 178 219 174 83 -8 3 102 194 287
-572B87j7j7j7j7k9l0l0k9m9m9monnnnJ7J5J6J7P2P3k7k8nmnnq4q3o1K5P9P8j6j5O1O1l3l4
-577H7m5M1R3R2J6J6k8k7mmp1p0l7M8M3M3j6j6j6j6on%%n6L1J06J05J9o7o1o2PPP3P3P4j2
-582C55o4o4k6k7k7k6N6N7J0p6r0mM2M3j0rK8K8K2o5n9n9MNMNO5O5pollklj2j2p8p7k5O0N5
-587G0N5n4n5j1j1K4K5K5K5K0J9k3k4mlmmN4N3j7j8pqppnoL7L8RJ0l3l4k6k6o4o3j1P4N3J1
-592G7lM0O4k1n1qO2O3L2L1L2L2k2k3j7j7j6P0P1j6n9n8j9j8pL6pr2j20l4P0P0m9m9K3K2j4
-596G5j4j4j4j8j7KQ8Q5M2k8k9n5n5J7J7K1K1n0n1J8J8J8J8ppqpj1j0N5N6J3p3j11k7N4R8
-601A10N7l0n9n9k1k1JKM4M4OPOOP6P7K4o1q2q2j6j6qoN7N9L0n6p5l1L5L7L9L9k9k9p2p1N
-606f3NMNJ4J5N1N2K5o1j02j8Q7Q9M2m4J2J3OPllm1m0k6O0P9P8l4j19j19l3L3L2lmK2K2K3
$$ plain form
-572 287 270 253 236 219 190 160 130 101 52 3 -1 -7 -12 -17 -22 -27 -10 5 21 38 110 183 156 128 123 119 114 109 25 -58 -119 -94 -15 63 47 32 93 154 121 87
-577 87 42 83 176 268 284 300 272 245 241 237 166 96 59 107 150 193 177 161 145 129 123 118 118 118 62 93 199 304 323 256 195 133 140 147 220 293 367 355
-582 355 291 227 201 174 147 121 177 234 244 168 78 74 116 159 149 140 168 196 218 153 94 35 39 44 48 53 118 183 176 170 167 164 162 159 147 135 57 -20 -45 15 70
-587 70 125 71 16 5 -6 18 43 68 93 113 132 109 85 81 78 74 70 124 177 160 142 135 127 120 113 108 102 139 177 186 196 163 129 103 77 13 -50 -61 13 66 77
-592 77 74 114 178 157 106 98 160 223 255 286 318 350 328 305 288 271 255 325 396 380 321 263 244 226 219 255 248 156 36 2 72 142 93 44 67 89 75
-596 75 61 47 33 15 -2 0 88 173 215 187 158 103 48 65 82 103 124 74 23 41 59 77 95 88 81 73 66 55 45 100 156 169 96 -15 -42 12 110
-601 110 167 137 78 19 -2 -23 -22 -20 24 68 74 81 87 93 169 246 270 209 127 45 29 13 5 -1 56 115 145 89 14 -17 18 55 94 133 104 75 3 -68 -63
-606 -63 -58 -54 -49 -35 -20 31 83 108 47 -55 -73 14 103 145 101 113 126 132 139 136 133 92 52 26 86 165 243 209 90 -29 -62 -29 3 0 -4 18 40 63
-610F3K3QRl5l4k4k2J8J9nnnoj4j6K6K7k3k2j7j7K2J07J08K3n7n6O2O2j0r7r6j0kjMMm6m7
-615h2n2L3P3P2P9P8jkm4m4j3j2N9N9jkkjl1l1l1l1M2M3l3j19r0nM1M1J2J4J3J3Q0P9Nq1p4
-620E4J3Q2Q2j5j02n9K7P5P5K9n7r3r3KKj4j3j4j4J0J0J1RJ3J4Q0Q0M5m0o0j6O3O4rr5o9J7
-624I4L1j2n1n0J7O0L1n5n5L1P2K9m1q3l5M9K6j7k9J3Q7Q7j5j5j6j5opopk0k0o3o2m4m5N6
-629h6N6M6M8MNK4K4K5K4J9K0J9J9m6m5m6m6MMM7M7n4n5j2j2K2K3K3K2m3m2m2m3l0l0l1l0
-633a68Q1Q1L6L8m4m3K7K8kkkjJ9J9O2O2o4o4k1k1j7j6%Q6R3Qj0j0M1M2n9n9l0l1M2M1L5L4
-638B11q9q8r9j4O7O6P6P5k4k4J6J7k1k1o4K3P4P4l2l2OOQp8p3p2K0K2k1k0LLM5M5M1M0kl
-643A61j6j7n4n4n2L3K8K8o5o6L4L4KLKKMMP1P0Lq3m0M6M8M8J1J0q7q8o3K2O0O1O6O6NMo7
$$ plain form
-610 63 86 94 103 68 34 10 -12 6 25 20 15 10 4 -10 -26 0 27 4 -18 -35 -52 -30 77 185 208 151 95 157 219 209 112 16 6 4 3 7 11 -35 -82
-615 -82 -134 -101 -28 44 123 201 200 198 154 110 97 85 144 203 202 200 198 197 166 135 104 73 115 158 125 6 -84 -89 -48 -7 5 19 32 45 125 204 209 128 54
-620 54 67 149 231 216 114 55 82 157 232 261 204 111 18 20 22 8 -5 -19 -33 -23 -13 -2 7 20 34 114 194 239 199 139 123 186 250 241 146 77 94
-624 94 125 113 62 12 29 89 120 65 10 41 113 142 101 18 -17 32 58 41 12 25 112 199 184 169 153 138 132 125 119 112 92 72 9 -53 -97 -142 -86
-629 -86 -30 16 64 68 73 97 121 146 170 189 209 228 247 201 156 110 64 68 72 119 166 112 57 45 33 55 78 101 123 80 38 -4 -47 -77 -107 -138 -168
-633 -168 -87 -6 30 68 24 -19 8 36 34 32 30 29 48 67 129 191 127 63 42 21 4 -12 -12 74 167 175 165 155 196 238 179 120 90 59 101 142 177 211
-638 211 122 34 -65 -79 -12 54 130 205 181 157 173 190 169 148 84 107 181 255 223 191 197 203 211 133 60 -12 8 30 9 -11 -8 -5 40 85 126 166 164 161
-643 161 145 128 74 20 -32 1 29 57 -8 -74 -40 -6 -4 -1 1 3 7 11 82 152 155 72 32 78 126 174 185 195 108 20 -43 -21 39 100 166 232 237 241 174
-648A74o7o8o8LLK8K9j4j4J6J6J5J6j6j6N1N0O1k5p8p7N2N1RRp1o9k8k7P2P4O8O8K4o1j09
-652H1o6K4K4m4m4k5k4k3k2N5R7P6j0p7j19p8QQ4Q3J8J8K6K7j7j7l9l9K5K6M1m5o3k1M8M7
-656C5m8r1k1O5M0kj5K7K9j3l6M8O5K2j0j0L0L0J3J3l1l0k7k6o4o4m2M3R4R6PQl5l6l2l2R
-661IJ1M0L9lljkjjq5q4M8J33J31M5kjk6k5o9o8k2k1k1k1L9L9%jKM5O9j6n4n5j0P6Q1L8o0
-666A93j03n6K9K2K1K4K4O6O7l4l4l5l4m4m4jjN9N8p1p1opppJ1J0J0J0J5J6J5J5n9n7j5j6
-670c7N5N6J3J3j03j03N4N3Q1Q0m8m7m8m7K3K3K0K1k3k2K7K6K7K7M3M2k9k9o5o6k2k2N9O0
-674I2l9m0l1l2M0L8jjkjn5n6M4M4P0P0K8K7KLm1m0l3l3J0J0m3m3q6q7M8M8R0R0J3J3J2J3
-679A41n1n1rq%%j%K0K0K0K0K7K7m5m4n4n2M5M7L7L7l5l5J9J9J9J9J2J3N0N0Oq0j23l7J2J1
$$ plain form
-648 174 107 39 -29 -26 -23 5 34 20 6 22 38 53 69 53 37 88 138 199 174 96 19 71 122 131 140 69 0 -28 -55 17 91 159 227 251 190 81
-652 81 15 39 63 19 -25 -50 -74 -97 -119 -64 33 109 99 22 -97 -175 -167 -83 0 18 36 62 89 72 55 16 -23 2 28 69 24 -39 -60 -12 35
-656 35 -13 -104 -125 -60 -20 -22 -37 -10 19 6 -30 18 83 105 95 85 115 145 158 171 140 110 83 57 -7 -71 -113 -70 24 120 127 135 100 64 32 0 9
-661 9 20 60 99 96 93 92 90 89 88 3 -81 -33 100 231 276 274 273 247 222 153 85 63 42 21 0 39 78 78 77 79 124 193 177 123 68 58 134 215 253 193
-666 193 90 34 63 85 106 130 154 220 287 253 219 184 150 106 62 61 60 119 177 106 35 29 22 15 8 19 29 39 49 64 80 95 110 51 -6 -21 -37
-670 -37 18 74 87 100 -3 -106 -52 1 82 162 114 67 19 -28 -5 18 38 59 36 14 41 67 94 121 164 206 177 148 83 17 -5 -27 32 92
-674 92 53 13 -18 -50 -10 28 27 26 24 23 -32 -88 -44 0 70 140 168 195 197 200 159 119 86 53 63 73 30 -13 -99 -186 -138 -90 0 90 103 116 128 141
-679 141 90 39 30 22 22 22 21 21 41 61 81 101 128 155 110 66 12 -40 5 52 89 126 91 56 75 94 113 132 144 157 207 257 263 183 60 23 35 46
-684D6J7J6LLKLqqqqk1k2k1k2K5K4K5K5K1K2K2K1j0j1j0j1k4k5k4k5L3L2J5p1q2MK1K1k1k1
-688e2P3P4J4p2p0J4nnm9L8J27J28K4o1k9k9l4l3J5J5J6J5l8l9l2l2K8J15J14K9k2k2k7k7
-693A61o0o0M1M1j6j6j6j6k0k1j9k1J3J1QPQ2mn6n5J5J5J6J5k6k6J5J6K8K8m3m3Q8Q9O5k0
-697B16n3n4n8n8l8l9L7J22Q3lp7p8L0K9L0L0L5L5qpl7l7l7l7LKLKM1M1l1l1l7l6l7l7J7J7
-702e7J6J7KJKJL4L5l6l6L8L9nmM2M2M1M2m8m7m8m8N2N1K8n7j9j8J9J9jkkkO8O8l2l2j5j5
-707A33j0rp0J5J0J0k9l0k9k9j9j9K4K4M6M6M6M7m6m6q2q3l0N5J02J02M0m6m1m1P4P5K8n8
-711A60j16l1M5M5QQQQn5n5n4n5K3K3j9k0K2K2K3K1j2j3j4j3L1L0L0L1J0J1l3l3m3m4N4N6
-715E9N3N3j8j9J4J5J4J5l7l6L5L5jj%jq6q6j3j5j8j7j3j3OR1J36R3l9q2o1o0l9m0O0J01N5
$$ plain form
-684 46 63 79 82 85 87 90 82 74 66 58 37 15 -6 -28 -3 21 46 71 92 114 136 157 147 136 126 115 91 66 42 17 50 82 97 26 -56 -52 -31 -10 -31 -52
-688 -52 21 95 109 37 -33 -19 -24 -29 -78 -40 87 215 239 178 149 120 86 53 68 83 99 114 76 37 5 -27 1 116 230 259 237 215 188 161
-693 161 101 41 82 123 107 91 75 59 39 18 -1 -22 -9 2 10 17 99 95 39 -16 -1 14 30 45 19 -7 8 24 52 80 37 -6 82 171 236 216
-697 216 163 109 51 -7 -45 -84 -47 75 158 155 78 0 30 59 89 119 154 189 181 174 137 100 63 26 29 31 34 36 77 118 87 56 19 -17 -54 -91 -74 -57
-702 -57 -41 -24 -22 -21 -19 -18 16 51 15 -21 17 56 51 47 89 131 172 214 166 119 71 23 75 126 154 97 78 60 79 98 97 95 93 91 159 227 195 163 148 133
-707 133 123 114 44 59 69 79 50 20 -9 -38 -57 -76 -52 -28 18 64 110 157 111 65 -17 -100 -130 -75 27 129 169 123 82 41 115 190 218 160
-711 160 44 13 58 103 111 119 127 135 80 25 -29 -84 -61 -38 -57 -77 -55 -33 -10 11 -1 -14 -28 -41 -10 20 50 81 91 102 69 36 -7 -51 3 59
-715 59 112 165 147 128 142 157 171 186 149 113 148 183 182 181 181 180 94 8 -5 -20 -38 -55 -68 -81 -75 16 152 245 206 124 63 3 -36 -76 -16 85 140
-720A40l2j0L2L4n2o9k5N6N6j3j3MNMMm6m7mmONM8M8rj0j0j0n7n6P0J14L5n2n1L4K6j8l0l1
-724G2n0n0n8K7N7J4k7k8j4j5K9K9N0N1RQJ7J8k3k3KM5L0n7n5j2L0L0pqL4P8M3m2j13p1K7
-729D7P0Kq4p7QK1k1l8l7M6M5M1M2%jMMMMk9k9N7N7l1l1l1l0K8K8K8K8MLLLm4m4kjl0l0j17
-734a30j16j5j4K8K9M9M9N0M9K6K7K7K8j6j5j5j5J7J7J7J7J0RJ0J0jjjjj7j8j8j8M9M8M9M8
-739B52l6l7N0M9m5m5m5m6opporj0rrM0M0llN4N4l3l2q3q2O0O0j9j9o2o2K4K3K3K3O9P0j7
-743A59j7LMLMK7K6n9n9l9l8M7M7M5M5m2m1l8l9NMk8k8o6o6L9J25Q2lo1n9J8K0j2j2P3P3k3
-748A19k4k3k3j3j2j3j1kkjknnnoLLkQ3O7O8j2j3jjjjk2k3k2k2o2o1o1o2J5J6K0K1Q5J70O5
-753B22p7j65q0POL5L6P8P8p4p3l6M9K3K4K9K9l3l3l2l2M2M2M3M2JKJJl8l8l8l8k0k1k2k1
$$ plain form
-720 140 108 98 130 164 112 43 18 74 130 117 104 108 113 117 121 75 28 24 20 26 31 79 127 118 108 98 88 31 -25 45 159 194 142 91 125 151 133 103 72
-724 72 22 -28 -86 -59 -2 12 -15 -43 -57 -72 -43 -14 36 87 96 104 121 139 116 93 95 140 170 113 58 46 76 106 99 91 125 203 246 204 91 20 47
-729 47 117 119 35 -42 -34 -13 -34 -72 -109 -63 -18 23 65 65 64 68 72 76 80 51 22 79 136 105 74 43 13 41 69 97 125 129 132 135 138 94 50 48 47 17 -13 -130
-734 -130 -246 -261 -275 -247 -218 -169 -120 -70 -21 5 32 59 87 71 56 41 26 43 60 77 94 104 113 123 133 132 131 130 129 112 94 76 58 107 155 204 252
-739 252 216 179 229 278 233 188 143 97 91 84 77 71 62 52 43 34 74 114 111 108 162 216 183 151 68 -14 46 106 87 68 6 -56 -32 -9 14 37 106 176 159
-743 159 142 145 149 152 156 183 209 150 91 52 14 61 108 153 198 156 115 77 38 43 47 19 -9 -75 -141 -102 23 105 102 41 -18 0 20 8 -4 69 142 119
-748 119 95 72 49 36 24 11 0 -2 -4 -5 -7 -12 -17 -22 -28 -25 -22 -24 59 126 194 182 169 168 167 166 165 143 120 98 76 14 -47 -108 -170 -155 -139 -119 -98 -13 157 222
-753 222 145 -20 -100 -93 -87 -52 -16 62 140 66 -7 -43 6 29 53 82 111 78 45 13 -19 23 65 108 150 151 153 154 155 117 79 41 3 -17 -38 -60 -81
-758h1J8J8J8J8L0L0L1L0j8j9j9j8k8k6p0p1k2k2O4O4O1O1J8J8ooonJ0J0J1J0jjjjn8n6M2
-762B7M2k0k0k0j9k3k4M9M7L0L0m1m2K7K6K7K6RRo3o3J5J6J5J6m3m2%%l0l1J2J3N7N9j3j2
-767D6KLo7o9j8j9Q2Q1l0k8j01j00P8P8OPn4n3j0j1mmO7O7J5J4J5J4M7M8q1q0n0n0ppP0P1
-772c2k9k9N4N4N5N4lmp5p4j1j1N9O0opppl4l3RRj0rrrP4P6LMl9l8l8l8L1L0L2L1J2J1l1l1
-777D4l8l6OOL6L7l5l3J5J7J7J6jjjjJ2J3l0l1oonoJ7J8J9J8l5l5L5L6o0o0J1J1K9K8j4j3
-782fk6k6M6M4m1m2L0K8Q5Q4J3J3k3k2o5o5j8j8j9j9j0j1j1j1L2L1L1L2L6L7oor0r0J0RN2
-786a2N1N1N2QRl5l4L2L3o8o8L5L5qqk3k2K0K1j6j5K8K7LLo9o8m1m2KKj6j6j7j6N6N5N6N4
-791C9M0M0klJ9J8J9J9n7n6J5J5L2L2L2L2l1l2l1l2j7j7j8j7QQQPNMMMk0k1o3o4j6j5N5N6
$$ plain form
-758 -81 -63 -45 -27 -9 21 51 82 112 94 75 56 38 10 -16 -86 -157 -179 -201 -137 -73 -12 49 67 85 79 73 67 62 72 82 93 103 102 101 100 99 41 -15 27
-762 27 69 49 29 9 -10 -33 -57 -8 39 69 99 58 16 43 69 96 122 131 140 77 14 29 45 60 76 33 -9 -9 -9 -39 -70 -58 -45 12 71 58 46
-767 46 48 51 -16 -85 -103 -122 -40 41 11 -17 -118 -218 -140 -62 -56 -49 -103 -156 -166 -177 -181 -185 -118 -51 -36 -22 -7 7 54 102 21 -59 -109 -159 -166 -173 -103 -32
-772 -32 -61 -90 -36 18 73 127 124 120 45 -29 -40 -51 8 68 62 55 48 41 7 -26 -17 -8 -18 -27 -36 -45 29 105 108 112 73 35 -3 -41 -10 20 52 83 95 106 75 44
-777 44 6 -30 -24 -18 18 55 20 -13 2 19 36 52 51 50 49 48 60 73 43 12 6 0 -5 -11 6 24 43 61 26 -9 26 62 2 -58 -47 -36 -7 21 7 -6
-782 -6 -32 -58 -12 32 -9 -51 -21 7 92 176 189 202 179 157 92 27 9 -9 -28 -47 -57 -68 -79 -90 -58 -27 4 36 72 109 103 97 7 -83 -73 -64 -12
-786 -12 39 90 142 150 159 124 90 122 155 87 19 54 89 81 73 50 28 48 69 53 38 66 93 96 99 30 -38 -79 -121 -119 -117 -133 -149 -166 -182 -126 -71 -15 39
-791 39 79 119 117 114 133 151 170 189 132 76 91 106 138 170 202 234 203 171 140 108 91 74 56 39 47 55 63 70 75 79 83 87 67 46 -17 -81 -97 -112 -57 -1
-796al6l5PQL3L3o1o1l9M7R8R8J6J6J1J0mr1q9nQQJ4J4kkjkQ5Q7J5J4m8m9onL5L6l6l6J5J6
-801A15k7k7j5j5K9K8M1M2l0l0MLMMl8l8NMm3m1k5N9Q9Lm2JK8j5n7j5O2J8p8p7K4J08M5LJ6
-806A22N9j3j00o0K6L9lrrrrM5Q8M3m2p2l0j6j5m7m7mnL5L4L5L5j3j2j3j2j8j7Q2Q2j8j8o1
-810E3o0k2k2N0M9J9K0O3O3j8j8j7j8m0m0m0l9j5j5j5j5M3M3M3M4k4k5k4k4rj0rj0QPQPQ7
-815G8Q7m1m1r9r9K9L0Q0Q2J0J0L0L1m1m1K1K0K1K1l3l3l3l3l5l5L5L6M1M1lko4o4k0k1Q8
-819E3Q8j2j2J0Rl3l4j5j5j6j5J3J3J4J3mnmnk9k8l0k9P4P4P5P4k2k2k2k2LLKLj1j1j2j1n
-824I7nO6O7k0k0k0k0l5l5O5O6J6J7k6k6m3m4jjM5M6n5n4J5J5k8k8N1N1QRn1n1qqK1K2k1k1
-829E6n3n1J9J9J3J4J4J4J8J9J8J9k2k1k1k2m5m7m6m6L4L4L3L4L3L4L4L4l3l4l3l3OOP7P7
$$ plain form
-796 -1 -37 -72 -65 -57 -24 9 -52 -113 -152 -105 -7 91 107 123 134 144 140 49 -40 -45 -37 -29 -15 -1 -3 -5 -6 -8 77 164 179 193 145 96 90 85 120 156 120 84 99 115
-801 115 88 61 46 31 60 88 129 171 141 111 115 118 122 126 88 50 55 59 16 -25 -50 9 98 101 59 60 88 73 16 1 63 81 3 -74 -50 58 103 106 122
-806 122 181 168 68 8 34 73 70 61 52 43 34 79 167 210 168 96 66 50 35 -12 -59 -63 -68 -33 1 36 71 58 46 33 21 3 -14 68 150 132 114 53
-810 53 -7 -29 -51 -1 48 67 87 150 213 195 177 160 142 102 62 22 -17 -32 -47 -62 -77 -34 9 52 96 72 47 23 -1 -10 -20 -29 -39 -31 -24 -16 -9 78
-815 78 165 124 83 -16 -115 -86 -56 24 106 116 126 156 187 146 105 126 146 167 188 155 122 89 56 21 -14 21 57 98 139 136 134 70 6 -14 -35 53
-819 53 141 129 117 127 136 103 69 54 39 23 8 21 34 48 61 57 52 48 43 14 -14 -44 -73 1 75 150 224 202 180 158 136 139 142 144 147 136 125 113 102 97
-824 97 92 158 225 205 185 165 145 110 75 140 206 222 239 213 187 144 100 99 98 143 189 134 80 95 110 82 54 105 156 164 173 122 71 63 55 76 98 77 56
-829 56 3 -48 -29 -10 3 17 31 45 63 82 100 119 97 76 55 33 -12 -59 -105 -151 -117 -83 -50 -16 17 51 85 119 86 52 19 -14 -8 -2 75 152
-834A52l1l2p4p4k8k7M3M4L3L5rqJ7J8J7J8l3l2p5p5o0o0O8O9L1L1P3P3l5l5PQN2N2p7p6p7
-838g7p7Q1P9l0l1J2J1J6J5J4J5POOPpqppN3N3J0J0J3J4n8n8J7J8J8J8nnmnj5j5j6j5J7J7
-843H7J7J7jkjjk6k6k6k6PPPPPPPPj2j3j3j2m4m5kkP9Q0m9m8k2k2P7P8KKm1m1K2K1K2K2j0
-848I7j0rj0L1L2P4P5j02j02l0l1L5L5L5L5M0M1q9q8qqL5L4rj0j0j0m0l8m0l9kjkjJ6J6J7
-853d1J6qqqqN3N2N3N3k1k1k2k1k1k1k1k0KLKLL3L5l7l6k0k0K3K3M7M8NNonm9m7j3j3N8N9
-858H6MMr1r0l7M8J19L5m9m7J8J7k8k8k9k8K3K3J8J7lr0r0lJ5J6K1K2l8l8RR4J33M9k7k7M4
-862G2M5n5n6m0m1JKM0L9M0M1K3K3p1p0r4qO7O6N2l3n7n7K6K6m5m5j2j1ook4O1N6N4m6m7k4
-867a14O2Q7Q9J9o7q3KM8M9l5l4QRL8L9L8L9n5n6n5n4K2K2K3K3lkklj3j3j3j3j5j7K7K5L1
$$ plain form
-834 152 121 89 15 -59 -87 -114 -71 -27 6 41 32 24 41 59 76 94 61 29 -46 -121 -181 -241 -173 -104 -73 -42 31 104 69 34 41 49 101 153 76 0 -77
-838 -77 -154 -73 6 -24 -55 -43 -32 -16 -1 13 28 35 41 47 54 47 39 32 25 78 131 141 151 164 178 120 62 79 97 115 133 128 123 119 114 99 84 68 53 70 87
-843 87 104 121 120 118 117 116 90 64 38 12 19 26 33 40 47 54 61 68 56 43 30 18 -26 -71 -73 -75 4 84 35 -13 -35 -57 20 98 100 102 61 20 42 63 85 107 97
-848 97 87 78 68 99 131 205 280 178 76 46 15 50 85 120 155 195 236 147 59 51 43 78 112 103 93 83 73 33 -5 -45 -84 -86 -87 -89 -90 -74 -58 -41
-853 -41 -25 -33 -41 -49 -57 -4 48 101 154 133 112 90 69 48 27 6 -14 -12 -9 -7 -4 29 64 27 -9 -29 -49 -26 -3 44 92 97 102 96 91 42 -5 -18 -31 27 86
-858 86 90 94 3 -87 -124 -76 43 78 29 -18 0 17 -11 -39 -68 -96 -73 -50 -32 -15 -18 -108 -198 -201 -186 -170 -149 -127 -165 -203 -194 -100 33 82 55 28 72
-862 72 117 62 6 -34 -75 -74 -72 -32 7 47 88 111 134 63 -7 -101 -109 -42 24 76 43 -14 -71 -45 -19 -64 -109 -121 -132 -138 -144 -168 -107 -51 3 -43 -90 -114
-867 -114 -52 35 124 143 76 -7 -5 43 92 57 23 31 40 78 117 155 194 139 83 28 -26 -4 18 41 64 61 59 57 54 41 28 15 2 -13 -30 -3 22 53
-872E3L1m0m1k3k5J9J8K8K9j4j4rj0m7m8K2R3R3K2k1k1k5k5j3j2N9N9j3j4j3j3kklkJ3J3J4
-876A16J3LLm0m0k7k6M2M3m7q8l6L5N9J8k6k4J2J1J3J2lllkK0K1K1K1m7m7m6m8QQQQP8Q0j8
-881H2j8KM5K1n0p0k7M4M4K2K2K2K1m7m7m7m6NNMNNMNNj3j4j4j4k9k9M2M3M7M9M4M4j8q9q8
-886b8j8L4L2L2L3N4l2p0o9K2K1K1K2j1j0j1j0m8m8L8L7LKm0m0kjjkn1n2qrJ17J17Q0or2r1
$$ plain form
-872 53 84 44 3 -20 -45 -26 -8 20 49 35 21 12 2 -45 -93 -71 22 115 137 116 95 70 45 32 20 79 138 125 111 98 85 83 81 78 76 89 102 116
-876 116 129 132 135 95 55 28 2 44 87 40 -48 -84 -49 10 28 2 -22 -10 1 14 26 23 20 17 15 35 56 77 98 51 4 -42 -90 -82 -74 -66 -58 20 100 82
-881 82 64 66 111 132 82 12 -15 29 73 95 117 139 160 113 66 19 -27 -22 -17 -13 -8 -3 1 6 11 -2 -16 -30 -44 -73 -102 -60 -17 30 79 123 167 149 60 -28
-886 -28 -46 -12 20 52 85 139 107 37 -32 -10 11 32 54 43 33 22 12 -36 -84 -46 -9 -6 -4 -44 -84 -86 -87 -88 -90 -141 -193 -201 -210 -93 24 104 98 6 -85
$$ [...]
-1606I54
##$OBSERVED INTEGRALS=	(X Y Z)
(2.8582972904121692892, 3.102280218658008959, 1.0266426989307071427)
(1.1166744728275148635, 1.2386659369504340322, 6.4929066387759641898)
(2.4897273349769677431, 2.7077546325583559117, 2.1168235423662484784)
(2.25872222206335449, 2.409264879917170088, 3.0490210373891826201)
(1.6331915230500881897, 1.9187034603590491511, 2.2636891156561906868)
(1.2127103062859827531, 1.4852444282627175198, 53.607761074606884222)
(0.78963352645543471997, 1.0076608240368212233, 22.301523867903142673)
##END=	
##TITLE=	Jan31-2020.170.fid
##JCAMP-DX=	6.0	$$ MestReNova 14.1.0-24037
##BLOCK_ID=	3
##DATA TYPE=	NMR PEAK TABLE
##DATA CLASS=	PEAK TABLE
##CROSS REFERENCE=	NMR SPECTRUM: BLOCK_ID=2                                     
##.OBSERVE FREQUENCY=	400.05240029999998796
##.OBSERVE NUCLEUS=	^1H
##NPOINTS=	1
##FIRSTX=	2.3359986731130377713
##LASTX=	2.3359986731130377713
##XFACTOR=	1
##YFACTOR=	1
##FIRSTY=	3942.9719862454330723
##XUNITS=	PPM
##YUNITS=	ARBITRARY UNITS
##PEAK TABLE=	(XYW..XYW)
2.3359986731130377713,3942.9719862454330723,0.0042238472406743148707
##$MNOVA/PEAK_DATA_TABLE=	(T,F,A,ST,SP,APT,APC)
$$ Complementary to PEAK TABLE
$$ T: Type
$$ F: Flags
$$ A: Annotation
$$ ST: Shape Type
$$ SP: Shape Parameter
$$ APT: Attached Peaks Type
$$ APC: Attached Peaks Count
Compound,None,,0,0,0,0
##END=	
##END=	
