##TITLE=	Feb27-2020.770.1
AM2
##JCAMP-DX=	6.0	$$ MestReNova 14.1.0-24037
##DATA TYPE=	LINK
##BLOCK_ID=	1
##BLOCKS=	1    
##ORIGIN=	Mestrelab Research S.L.
##OWNER=	AJ Martin
##$MNOVA/LINK_BLOCK_TYPE=	ITEM	$$ NMR Spectrum
##$MNOVA/ITEM/POLYGON=	(XY..XY)
5321,5835
8722,5835
8722,8208
5321,8208
5321,5835
##$MNOVA/ITEM/Z=	0
##$MNOVA/ITEM/ANGLE=	0
##TITLE=	Feb27-2020.770.1
##JCAMP-DX=	6.0	$$ MestReNova 14.1.0-24037
##BLOCK_ID=	2
##DATA TYPE=	NMR SPECTRUM
##DATA CLASS=	XYDATA
##NUMDIM=	1
##ORIGIN=	Bruker BioSpin GmbH
##OWNER=	nmrsu
##.OBSERVE FREQUENCY=	400.05240029999998796
##.OBSERVE NUCLEUS=	^1H
##.SOLVENT NAME=	CDCl3
##.PULSE SEQUENCE=	zg30
##LONGDATE=	2020/02/27 19:04:00.000
##.ACQUISITIONMODE=	SIMULTANEOUS
##$ORIGINAL FORMAT=	Bruker XWIN-NMR
##$MNOVA/SCALES_VERSION=	8
##$PARAMETER FILE=	(acqus, ASCII, c:/Users/AJ%20Martin/AppData/Local/Temp/DYpNgihMTeuBq6kceESKMw/770/acqus, 0)
$$ ##TITLE= Parameter file, TOPSPIN		Version 3.2
$$ ##JCAMPDX= 5.0
$$ ##DATATYPE= Parameter Values
$$ ##NPOINTS= 1	$$ modification sequence number
$$ ##ORIGIN= Bruker BioSpin GmbH
$$ ##OWNER= nmrsu
$$ $$ 2020-02-27 19:05:19.810 +0000  nmrsu@nmrpc
$$ $$ /opt/topspin/data/ug1/nmr/Feb27-2020/770/acqus
$$ $$ process /opt/topspin3.2/prog/mod/dirdata
$$ ##$ACQT0= -2.04831932773109
$$ ##$AMP= (0..31)
$$ 100 100 100 100 100 100 100 100 100 100 100 100 100 100 100 100 100 100
$$ 100 100 100 100 100 100 100 100 100 100 100 100 100 100
$$ ##$AMPCOIL= (0..19)
$$ -1 0 0 0 0 0 0 0 0 0 0 0 0 0 0 0 0 0 0 0
$$ ##$ANAVPT= -1
$$ ##$AQSEQ= 0
$$ ##$AQ_mod= 3
$$ ##$AUNM= <au_zg>
$$ ##$AUTOPOS= <17 >
$$ ##$BF1= 400.05
$$ ##$BF2= 400.05
$$ ##$BF3= 400.05
$$ ##$BF4= 400.05
$$ ##$BF5= 400.05
$$ ##$BF6= 400.05
$$ ##$BF7= 400.05
$$ ##$BF8= 400.05
$$ ##$BYTORDA= 0
$$ ##$CAGPARS= (0..11)
$$ 0 0 0 0 0 0 0 0 0 0 0 0
$$ ##$CFDGTYP= 0
$$ ##$CFRGTYP= 9
$$ ##$CHEMSTR= <none>
$$ ##$CNST= (0..63)
$$ 1 1 1 1 1 1 1 1 1 1 1 1 1 1 1 1 1 1 1 1 1 1 1 1 1 1 1 1 1 1 1 1 1 1 1 1
$$ 1 1 1 1 1 1 1 1 1 1 1 1 1 1 1 1 1 1 1 1 1 1 1 1 1 1 1 1
$$ ##$CPDPRG= (0..8)
$$ <> <> <> <> <> <> <> <> <>
$$ ##$D= (0..63)
$$ 0 1 0 0 0 0 0 0 0 0 0 0 0 0 0 0 0.0002 0 0 0 0 0 0 0 0 0 0 0 0 0 0 0 0
$$ 0 0 0 0 0 0 0 0 0 0 0 0 0 0 0 0 0 0 0 0 0 0 0 0 0 0 0 0 0 0 0
$$ ##$DATE= 1582830294
$$ ##$DE= 6.5
$$ ##$DECBNUC= <off>
$$ ##$DECIM= 2496
$$ ##$DECNUC= <off>
$$ ##$DECSTAT= 4
$$ ##$DIGMOD= 1
$$ ##$DIGTYP= 12
$$ ##$DQDMODE= 0
$$ ##$DR= 22
$$ ##$DS= 4
$$ ##$DSPFIRM= 0
$$ ##$DSPFVS= 20
$$ ##$DTYPA= 0
$$ ##$EXP= <proton>
$$ ##$F1LIST= <>
$$ ##$F2LIST= <>
$$ ##$F3LIST= <>
$$ ##$FCUCHAN= (0..9)
$$ 0 2 0 0 0 0 0 0 0 0
$$ ##$FL1= 90
$$ ##$FL2= 90
$$ ##$FL3= 90
$$ ##$FL4= 90
$$ ##$FOV= 20
$$ ##$FQ1LIST= <>
$$ ##$FQ2LIST= <>
$$ ##$FQ3LIST= <>
$$ ##$FQ4LIST= <>
$$ ##$FQ5LIST= <>
$$ ##$FQ6LIST= <>
$$ ##$FQ7LIST= <>
$$ ##$FQ8LIST= <>
$$ ##$FRQLO3= 15959.0749999881
$$ ##$FRQLO3N= 2
$$ ##$FS= (0..7)
$$ 83 83 83 83 83 83 83 83
$$ ##$FTLPGN= 0
$$ ##$FW= 125000
$$ ##$FnMODE= 0
$$ ##$FnTYPE= 0
$$ ##$GPNAM= (0..31)
$$ [...]
$$ 130000 130000 130000 130000 130000 130000 130000 130000 130000 130000 130000
$$ 130000 130000 130000 130000 130000 130000 130000 130000 130000 130000 130000
$$ 130000 130000 130000 130000 130000 130000 130000 0 0 0 0 0 0 0 0 0 0 0
$$ 0 0 0 0 0 0 0 0 0 0 0 0 0
$$ ##$ShimPowMaxUC= (0..63)
$$ 130000 130000 130000 130000 130000 130000 130000 130000 130000 130000 130000
$$ 130000 130000 130000 130000 130000 130000 130000 130000 130000 130000 130000
$$ 130000 130000 130000 130000 130000 130000 130000 130000 130000 130000 130000
$$ 130000 130000 130000 130000 130000 130000 130000 0 0 0 0 0 0 0 0 0 0 0
$$ 0 0 0 0 0 0 0 0 0 0 0 0 0
$$ ##$ShimPowMaxUG= (0..63)
$$ 524287 524287 524287 524287 524287 524287 524287 524287 524287 524287 524287
$$ 524287 524287 524287 524287 524287 524287 524287 524287 524287 524287 524287
$$ 524287 524287 524287 524287 524287 524287 524287 524287 524287 524287 524287
$$ 524287 524287 524287 524287 524287 524287 0 0 0 0 0 0 0 0 0 0 0 0 0 0 0
$$ 0 0 0 0 0 0 0 0 0 0
$$ ##$ShimPowRcbType= 3
$$ ##$ShimPowRes= (0..63)
$$ 1e-20 1e-20 1e-20 1e-20 1e-20 1e-20 1e-20 1e-20 1e-20 1e-20 1e-20 1e-20
$$ 1e-20 1e-20 1e-20 1e-20 1e-20 1e-20 1e-20 1e-20 1e-20 1e-20 1e-20 1e-20
$$ 1e-20 1e-20 1e-20 1e-20 1e-20 1e-20 1e-20 1e-20 1e-20 1e-20 1e-20 1e-20
$$ 1e-20 1e-20 1e-20 1e-20 0 0 0 0 0 0 0 0 0 0 0 0 0 0 0 0 0 0 0 0 0 0 0 0
$$ ##$ShimPowRng0= (0..63)
$$ 1 1 1 1 1 1 1 1 1 1 1 1 1 1 1 1 1 1 1 1 1 1 1 1 1 1 1 1 1 1 1 1 1 1 1 1
$$ 1 1 1 1 0 0 0 0 0 0 0 0 0 0 0 0 0 0 0 0 0 0 0 0 0 0 0 0
$$ ##$ShimPowRng1= (0..63)
$$ 1 1 1 1 1 1 1 1 1 1 1 1 1 1 1 1 1 1 1 1 1 1 1 1 1 1 1 1 1 1 1 1 1 1 1 1
$$ 1 1 1 1 0 0 0 0 0 0 0 0 0 0 0 0 0 0 0 0 0 0 0 0 0 0 0 0
$$ ##$ShimPowRng2= (0..63)
$$ 1 1 1 1 1 1 1 1 1 1 1 1 1 1 1 1 1 1 1 1 1 1 1 1 1 1 1 1 1 1 1 1 1 1 1 1
$$ 1 1 1 1 0 0 0 0 0 0 0 0 0 0 0 0 0 0 0 0 0 0 0 0 0 0 0 0
$$ ##$ShimPowRng3= (0..63)
$$ 1 1 1 1 1 1 1 1 1 1 1 1 1 1 1 1 1 1 1 1 1 1 1 1 1 1 1 1 1 1 1 1 1 1 1 1
$$ 1 1 1 1 0 0 0 0 0 0 0 0 0 0 0 0 0 0 0 0 0 0 0 0 0 0 0 0
$$ ##$ShimSysFunc= (0..63)
$$ 1 2 3 4 5 6 7 8 9 10 0 37 38 35 16 15 14 13 12 11 28 27 26 25 24 23 36
$$ 22 30 29 20 21 34 33 32 31 17 18 19 0 0 0 0 0 0 0 0 0 0 0 0 0 0 0 0 0 0
$$ 0 0 0 0 0 0 0
$$ ##$ShimSysMatrix= 0
$$ ##$ShimSysType= 4
$$ ##$TFXNUM= 0
$$ ##$TRIPLO2= 0
$$ ##$VTU= 2
$$ ##$VTUETH= <149.236.99.20>
$$ ##$VTUTY= <no>
$$ ##$WBREFAM= (0..15)
$$ 136.7 118.7 100 100 100 100 100 100 100 100 100 100 100 100 100 100
$$ ##$WBREFLM= (0..15)
$$ 0 0 0 0 0 0 0 0 0 0 0 0 0 0 0 0
$$ ##$WBREFPH= (0..15)
$$ 77.55 -71.28 0 0 0 0 0 0 0 0 0 0 0 0 0 0
$$ ##$WBSGU= (0..15)
$$ 0 0 0 0 0 0 0 0 0 0 0 0 0 0 0 0
$$ ##$XFAC= 2
$$ ##END=
##$DECIM=	2496
##$DSPFVS=	20
##XUNITS=	HZ
##YUNITS=	ARBITRARY UNITS
##FIRSTX=	6406.710256386850233
##LASTX=	-1606.1102564336499654
##DELTAX=	-0.12226780365942625795
##XFACTOR=	1
##YFACTOR=	0.0026064474422886818247
##FIRSTY=	9.8169755935668945312
##MINY=	-5.7967405319213867188
##MAXY=	23279.1953125
##NPOINTS=	65536
##XYDATA=	(X++(Y..Y))
$$ [...]
1542a075k4k3k7LO3Q2L6j2rJ1J1QK1J1m5r6q2k9PK0K7Qm4p3l1L3L1j6k0K2K7k8m2K8Q0K0p0
1538a197n4N3J04M0k5LO4M4m0q5n7rO%j4m9p4m2K1J8p0j18l3R5J15L9RP5J22O4k5l9jLl7m9
1533a143j5J0oj6J2M9M2Kk1rOMQL7O2K7n7j17r4k0M1P0P5M8j5q1r2m3QJ5j5m9m7JN9N7j4q0
1529a301o0PL3Mj2jj3m7l1L4N0k4q0k9O8R0K9k6m5n6o7m6QN3P7Q7P1K1k3j3K6L5J2l%kJK8
1524a145M7J2m1m0PL0OqQJ6j4k7jK6J7j6l1l6l4pK7L0mk2NK7Jl7l0K1O3O3K1l3o8n3rJ5Jk3
1519a236l0l2l0%N1O7J6l8l2J6L1rn3n5k5J2K1Kk4l3j5J1L9P2R7O5ll9pL7K5l2p0o5m3j6J2
1515a313J7%lK5M5Rl5l5rk5o0l5L9O6Rm0j7K1oo1n1L3R0O2ol4QP0P7J0o1n0L6J09R8K6l0n2
1510a073m7k2K2N0J6n4q5l6K6L7lk9KM3L4k9p5m8K9O6L1k5m2k4j7l2l4j1J8L0J9LLJ6J8j1
$$ y = [-1075, -1099, -1122, -1149, -1146, -1083, -1001, -965, -977, -986, -975, -964, -956, -935, -924, -969, -1065, -1147, -1176, -1169, -1149, -1122, -1114, -1158, -1231, -1262, -1229, -1198, -1214, -1234, -1212, -1185, -1213, -1255, -1227, -1147, -1127, -1197, -1251, -1198, -1094, -1054, -1079, -1076, -1012, -968, -1008, -1093, -1150, -1159, -1153, -1153, -1167, -1216, -1290, -1332, -1311, -1293, -1363, -1481, -1514, -1419, -1304, -1265, -1256, -1181, -1059, -995, -1020, -1059, -1060, -1057, -1094, -1143, -1158, -1148, -1154, -1170, -1158, -1109, -1067, -1065, -1086, -1095, -1089, -1085, -1077, -1040, -978, -951, -1008, -1125, -1219, -1239, -1198, -1128, -1053, -1005, -1020, -1101, -1193, -1236, -1228, -1213, -1228, -1277, -1324, -1323, -1264, -1207, -1221, -1301, -1361, -1354, -1321, -1317, -1329, -1330, -1343, -1390, -1421, -1387, -1337, -1361, -1441, -1470, -1402, -1312, -1283, -1309, -1354, -1410, -1477, -1523, -1515, -1462, -1385, -1298, -1227, -1206, -1229, -1242, -1216, -1181, -1169, -1172, -1172, -1174, -1173, -1145, -1098, -1086, -1127, -1167, -1160, -1130, -1124, -1132, -1124, -1108, -1122, -1149, -1150, -1124, -1107, -1123, -1154, -1190, -1224, -1231, -1204, -1174, -1178, -1200, -1195, -1168, -1167, -1204, -1234, -1213, -1150, -1087, -1066, -1099, -1167, -1220, -1229, -1214, -1213, -1236, -1266, -1298, -1328, -1328, -1277, -1210, -1194, -1232, -1264, -1248, -1217, -1226, -1279, -1334, -1359, -1347, -1326, -1324, -1348, -1381, -1396, -1385, -1346, -1274, -1177, -1112, -1115, -1154, -1161, -1124, -1099, -1131, -1201, -1266, -1309, -1325, -1313, -1296, -1296, -1299, -1274, -1229, -1220, -1255, -1290, -1299, -1324, -1384, -1419, -1380, -1314, -1305, -1345, -1362, -1341, -1347, -1408, -1459, -1426, -1336, -1274, -1280, -1314, -1306, -1236, -1159, -1149, -1210, -1260, -1224, -1115, -1017, -991, -1021, -1073, -1120, -1142, -1120, -1070, -1054, -1108, -1193, -1229, -1203, -1166, -1169, -1198, -1196, -1153, -1119, -1148, -1223, -1271, -1242, -1176, -1145, -1170, -1212, -1236, -1253, -1285, -1319, -1330, -1312, -1282, -1263, -1260, -1257, -1241, -1223, -1234]
1506a234m9l7K3O4K4n2p1mP4Q8M0k8p6p8k5M2O1J7k8k4J6L7L4K9L4L7L1K4Ppj0ok9p1p2j1
1501a230M2J6m4m6J8O9O1L3J2mj8JK7lq3j13m5L6K8m3p1l1K3O7R2P8Jp7o8J0M9K3nK2N2L6
1497a085LMJ7Oj2JK8K8nk8l1k9j9K0O8P8J9p0j18q8qM4K6l2n5j9K5L7M5P3P6Oq0q0NO3K4l1
1492a094j6M2N5J6lK2K9j9n9m8j2pj8J3O2O0j1o3k4N4P6J8n5p7l7K3N5L2k5n6k7J7J9kJK8
1488a031K7krJ5J7k3m0PN0J7n0o0j1K7L0K9J7k5o4j8Q8J34P1j1k3Kj1m7m0nOoMM0N3L1K2K5
1483g64J6JK4Q1J05O2Oj5kL1J02J86K02J36Q1J32K57L66M50N32O09O78P78R35J140J481K155
1480I765L097L730L358J942K53q77j270j298j322j431j612j844k031k024j811j506j214r48
1478B957p13n43m25l21k35j97j72j14o0q4j36r8J9O0k8j09q5k4j9k9NL5%m5k3J7j7r6j06l8
$$ y = [-1234, -1283, -1320, -1297, -1233, -1209, -1261, -1332, -1336, -1262, -1174, -1134, -1162, -1238, -1316, -1341, -1299, -1238, -1221, -1249, -1273, -1257, -1220, -1186, -1157, -1123, -1086, -1055, -1031, -1024, -1031, -1041, -1047, -1076, -1147, -1219, -1230, -1188, -1172, -1216, -1262, -1244, -1175, -1114, -1081, -1069, -1073, -1091, -1090, -1063, -1066, -1149, -1262, -1307, -1271, -1243, -1286, -1357, -1388, -1365, -1298, -1206, -1128, -1127, -1204, -1272, -1262, -1213, -1190, -1195, -1173, -1121, -1085, -1082, -1078, -1061, -1055, -1067, -1066, -1038, -1010, -1015, -1043, -1074, -1103, -1122, -1102, -1034, -956, -937, -1007, -1125, -1213, -1221, -1177, -1151, -1183, -1238, -1257, -1232, -1195, -1150, -1077, -1001, -995, -1075, -1155, -1150, -1087, -1063, -1094, -1110, -1068, -1013, -997, -1000, -978, -949, -968, -1027, -1075, -1087, -1094, -1112, -1099, -1037, -977, -988, -1051, -1075, -1021, -945, -927, -982, -1059, -1096, -1073, -1018, -986, -1011, -1067, -1094, -1077, -1058, -1060, -1059, -1031, -1004, -1006, -1015, -1000, -983, -1006, -1046, -1039, -989, -972, -1022, -1082, -1093, -1066, -1036, -1007, -990, -1015, -1079, -1097, -1009, -875, -804, -815, -838, -836, -847, -894, -934, -939, -933, -939, -935, -895, -842, -811, -789, -764, -748, -747, -723, -642, -537, -475, -469, -484, -486, -455, -353, -167, 35, 171, 252, 384, 641, 1007, 1457, 1989, 2598, 3276, 4054, 4989, 6129, 7610, 9765, 12862, 16592, 19950, 21892, 22145, 21268, 19998, 18700, 17378, 15947, 14335, 12491, 10460, 8436, 6625, 5119, 3905, 2957, 2244, 1701, 1276, 955, 720, 523, 351, 237, 177, 93, -43, -141, -122, -62, -90, -199, -284, -308, -327, -356, -351, -316, -316, -361, -384, -367, -384, -480, -586, -624]
1474f24J6J2j2j6j5qN%m6q4m9L1O2K6k0k4j6j2%Rj7n3l3M5R4N1k6n1k2Njj6j7kJ3J4rl6l9
1469h65k0lorJ9O0O9K3l9o5l0J8K2j2l3k0j%m%j3n1o6l7J4M2N0N2K6j6k6J0K7j1m3%O0M9j9
1464h48n5m4l9l5NO4P4M4K3jo4j14o1M5O4MkP0P7l0j05n5J5j0o1k6L5K0k6J7J04J05No3l6
1460i04J2J4loj0k7m6m4k7OL6K4l0o4m1j4l7o9l1M6O4K0MN5R0N1k3n2l2jJ2J4K0M1N6M5J1
1456h40%K6L3j7o5l9L3L6m6j12q2J3O9M4l4q3n4K6Q2P1K4j3l5l8JO5P3Om1PP4N2j4rM4K3p2
1451g92j05l4J4k1m9QO9M3k4m0j6kOK5J4m0p5m0Okj9J8O4L0n4q9m2K3N2N6M9K9J7K5K0l0q0
1447i86o8nL5L9N0P0N0pl8j2J8Ll4l8nK8K9j2p1j01p9k7J4K8L1J6j9m0oM9M5k6o9j5Q1J01
1442i71K9m3l3K5M6Ll9k3K9N4L3Plk6p0q5k3O7Q7K7l1k8MOqJ5O3O2j7j05j13m4J7K5Omj7m3
$$ y = [-624, -608, -596, -608, -624, -639, -647, -642, -642, -688, -772, -821, -790, -728, -702, -722, -746, -762, -774, -774, -765, -782, -835, -868, -823, -729, -678, -704, -755, -777, -772, -773, -789, -806, -808, -795, -781, -790, -826, -865, -885, -888, -894, -903, -884, -824, -755, -732, -771, -836, -866, -848, -826, -838, -871, -891, -892, -892, -896, -896, -909, -960, -1026, -1063, -1049, -1007, -957, -905, -879, -895, -921, -911, -884, -895, -938, -938, -878, -829, -848, -903, -947, -986, -1021, -1016, -952, -878, -834, -811, -812, -876, -990, -1051, -1006, -942, -938, -940, -870, -793, -823, -928, -983, -968, -978, -1039, -1065, -1030, -1010, -1036, -1019, -915, -810, -805, -868, -904, -892, -878, -881, -887, -897, -924, -970, -1014, -1041, -1035, -999, -975, -1005, -1069, -1110, -1124, -1161, -1230, -1261, -1215, -1151, -1131, -1127, -1072, -982, -931, -954, -1006, -1038, -1039, -1027, -1013, -993, -952, -896, -851, -840, -840, -814, -781, -798, -863, -902, -869, -833, -879, -991, -1073, -1060, -991, -947, -981, -1064, -1118, -1092, -1010, -939, -915, -928, -963, -1001, -1000, -935, -862, -856, -897, -890, -816, -764, -778, -787, -743, -720, -792, -897, -931, -917, -938, -987, -979, -910, -867, -891, -931, -947, -949, -943, -918, -904, -944, -1019, -1059, -1053, -1055, -1074, -1056, -992, -962, -1016, -1105, -1147, -1124, -1072, -1016, -967, -938, -921, -896, -876, -906, -986, -1054, -1059, -1024, -985, -935, -865, -815, -822, -860, -872, -854, -851, -885, -923, -928, -900, -871, -883, -954, -1055, -1134, -1161, -1147, -1119, -1088, -1072, -1091, -1131, -1137, -1088, -1043, -1069, -1138, -1153, -1072, -971, -942, -985, -1018, -993, -947, -944, -983, -1006, -977, -923, -890, -883, -886, -912, -982, -1067, -1090, -1023, -936, -909, -940, -968, -964, -958, -966, -951, -888, -826, -843, -948, -1061, -1105, -1088, -1063, -1057, -1061, -1078, -1121]
1438a121m0K4R8Q7j1q7p1qK9L8N1N3J9k8k7K0N7M7J1k1k7oL1M9J9k9m0mL2L8L3L0K1ql9m5
1433h25k8k4m7o3k7M4R1O5Mk6oK3L4L4K7qo1p3k0M1L4j6m2k8j8l1l6pK5M0L1J0j3j3K9P5O7
1429g38Jn5m8qKk8m4j7K8M2J3j3pJ0Lj8j0J2%m7o0nN5N0J8J5K2j9p8p3jM3J5l1k0J5L5M0N5
1424h46N4J3l7l5NK4rm4l4JRj9k6J9O9M6l2o9j2O0N8ll6j4J7K2Oj3l1l1NM4L4j4m1k1J2K7
1419h42L4L0j1n8m6L6Q8M8l1n5pL3J9j7k2K3O7M7m5j33j17lR8R7J9m7n3j5L4N8L8PkOj4n3
1415g89n4JM2K1k2j3L2N7M9K7qo5j10r1j6O3J05R2K3o2r0l0M5N0Kj7J0K1mk0OL2J5k2m1l9
1410h00l1j9ML3N2M9J8l2o4m5RL8J0k8k2K1N8N6J5l2n0j5L0K6l3q5o7nK7J1j1NK7J2j0J5P6
1406g57Q5Rp0m9L9P9K5l0j2L8L9j0m4l3j4j7l4n5o1l0L1O1L5j7l2j1rk8l0KM3P6J01Q7Kr2
$$ y = [-1121, -1161, -1137, -1039, -952, -963, -1050, -1121, -1129, -1100, -1062, -1011, -958, -939, -967, -994, -974, -917, -870, -859, -880, -907, -913, -882, -833, -814, -843, -883, -887, -855, -817, -784, -754, -733, -741, -780, -825, -853, -877, -924, -987, -1014, -970, -879, -814, -810, -836, -842, -819, -785, -751, -724, -732, -793, -866, -886, -845, -811, -827, -869, -897, -915, -946, -982, -989, -964, -924, -893, -883, -896, -909, -880, -805, -738, -737, -792, -840, -848, -846, -874, -918, -935, -907, -865, -852, -865, -872, -862, -859, -877, -887, -875, -875, -922, -982, -987, -932, -882, -864, -849, -827, -846, -924, -997, -998, -955, -940, -971, -991, -976, -941, -901, -846, -792, -779, -816, -851, -846, -822, -831, -875, -909, -908, -899, -918, -944, -925, -856, -810, -842, -911, -923, -863, -805, -808, -844, -858, -841, -819, -813, -826, -857, -888, -883, -839, -805, -819, -860, -881, -869, -842, -808, -778, -789, -847, -893, -857, -769, -721, -752, -807, -814, -781, -762, -779, -801, -778, -711, -664, -709, -842, -959, -962, -864, -767, -748, -795, -848, -863, -829, -771, -733, -726, -728, -722, -736, -789, -843, -842, -800, -779, -801, -814, -782, -725, -676, -649, -657, -722, -832, -923, -939, -876, -771, -679, -656, -718, -808, -838, -793, -743, -741, -758, -748, -727, -731, -751, -745, -713, -698, -720, -761, -800, -831, -850, -846, -813, -761, -712, -694, -726, -790, -835, -826, -788, -778, -806, -828, -807, -749, -693, -678, -710, -760, -775, -745, -719, -752, -837, -904, -909, -882, -871, -882, -877, -850, -838, -848, -833, -757, -672, -663, -733, -782, -743, -664, -639, -669, -681, -643, -604, -614, -658, -691, -705, -722, -756, -811, -872, -902, -871, -810, -775, -792, -824, -835, -844, -872, -902, -900, -857, -781, -680, -593, -591, -683]
1401f83q7L2J30R1l0r7o4j9j8k9jM0M2Jk3lK9K5kj8j0oj6k1j0oj7k7j1J0J3QRJk0j7L6Q2N2
1397f34l6p9l2M3O7K7l1o8o1j1N6R2Q3N3K9J2j5l9m4j7J4J2l1p3m6L3O2Nn8l4K1Mn6l6O1Q1
1392f46l6j43q6O0J24Q0L0L3L7Ml2l8l4k9k1j3j2jK7L4nl9mO9Q3J5m4l6j3j2j3J3K1k6p2n4
1388g79LK8J2JJ7L3K9K8M0M8M0K5ll6o2m8j0J0jj5j2j0k3k8LN6Q6O9K7lppl9q0o5K1R4O3l7
1383e32q1k4M8M8J8K6M8J8l4k9K4K5m7r8o1J7N2M5L7M0M0M5M4J9k8l0J5K8m0j14r6l1j4m4
1379f66l3J8L0j0j1N9J09P0nk0J8M1J9k0m4m8j9K9O4N8K9Pj4l5m0j6Jpk2k0qpnKnk4j7K4L8
1374d80qn6l5K1J8n0p8j5P2R5N0QJ0L7N0K9Lqnk3o8r4o5JN2P7R0Q6M9j1m6m4j7J0K4op6j23
1370e26p7L7J02N9j5k2L2P1N4K6L1M3J8m9j07r6l4J9J9j6k4J7O9P9L3k9o1m3QN6P4O0L3Qk2
$$ y = [-683, -770, -738, -608, -517, -547, -644, -708, -727, -745, -774, -775, -735, -693, -692, -715, -718, -689, -664, -666, -684, -694, -700, -716, -737, -747, -753, -770, -797, -808, -798, -785, -777, -768, -767, -787, -804, -768, -686, -634, -670, -749, -781, -738, -671, -644, -675, -743, -804, -815, -759, -667, -584, -531, -502, -490, -505, -544, -588, -605, -591, -579, -610, -683, -729, -696, -634, -629, -687, -721, -700, -696, -752, -788, -727, -646, -682, -825, -911, -851, -727, -647, -617, -584, -547, -543, -575, -613, -647, -676, -697, -710, -722, -723, -696, -662, -667, -706, -710, -641, -558, -543, -587, -623, -636, -648, -661, -648, -627, -653, -725, -779, -776, -748, -736, -735, -718, -685, -656, -628, -588, -540, -500, -475, -478, -514, -576, -624, -634, -624, -625, -640, -652, -662, -685, -713, -710, -654, -568, -499, -472, -475, -482, -489, -528, -608, -673, -652, -558, -495, -532, -613, -637, -589, -541, -523, -497, -449, -431, -465, -494, -470, -445, -492, -590, -651, -634, -582, -537, -500, -460, -420, -375, -331, -312, -340, -370, -355, -327, -367, -481, -577, -608, -622, -666, -699, -681, -651, -661, -672, -613, -504, -434, -439, -459, -441, -400, -381, -401, -445, -493, -512, -483, -419, -361, -332, -325, -339, -374, -414, -430, -429, -436, -458, -478, -486, -493, -498, -496, -501, -525, -542, -518, -480, -488, -544, -579, -558, -540, -590, -668, -683, -611, -516, -466, -458, -448, -411, -361, -332, -329, -337, -342, -365, -433, -527, -592, -591, -539, -462, -372, -286, -237, -248, -294, -338, -355, -345, -321, -327, -403, -526, -603, -566, -464, -405, -420, -442, -410, -339, -285, -259, -228, -185, -167, -216, -323, -419, -453, -434, -415, -431, -455, -438, -369, -290, -257, -286, -347, -390, -382, -326, -252, -192, -159, -151, -173]
1365a73m7n1k1J3Ql8p5m6L6R0O8Qj3J4K6j1n4m6lK2J5PJ5K2J7J2Lj5k3%K8Mp1j19p3K5Q1N8
1361c07J1rj4l5n8n1k8k2k1K1R9J37R1K6ORj6m0j8J9%m8l5K4J8o3q4K2J25Q9k8o3nL1Nj5p
1356b34k5o0m6K6O4J9l0pN2O6K3k6m3m0k4oJ1L3O2P1L3k8o8o4l3MM0L9j3o0l1M5P5L6jL%m0
1351a77o4l8j0j2KO3J04O8%j6Oml2j5L8N1Km3k5L1O4N3J3k9m2l0l1o6r1m6M9J03P8J4j7qP
1347e0Jk8n4m6KN1O1K7j4m1m4k1K4N5M3J3J1L7M3J6nJ8N0M0k0o8n6PO5P1L0%K5P9R8N2j1l0
1342D31RN2N0J6qmMLJ3L3K9j7o9o9l1kkk0m7q1q4k6M4M6j9n8k2L0M6M2M9L7kk2OK8ro1n0J1
1337B76M0K1jQK9M2N2O7P2O6M7J7lJ2L9Nq6j17j7J13J21Ro7l5L1L9K1K3L3J0l1m4j6J6J2m0
1333G64r9j19r1n0k3RL9K0n8j13p7RM3J9NJ3Nj0J6O6O4Rj2J9L8J1MK9L2mMP7J14N7nJ8P1N3
$$ y = [-173, -220, -271, -292, -279, -271, -309, -384, -430, -394, -304, -236, -228, -241, -227, -201, -212, -266, -312, -315, -293, -278, -271, -256, -234, -217, -205, -202, -217, -240, -240, -212, -208, -279, -398, -471, -446, -365, -307, -296, -305, -319, -354, -412, -463, -491, -513, -534, -513, -414, -277, -186, -160, -154, -145, -161, -201, -219, -200, -200, -248, -283, -259, -241, -304, -388, -366, -241, -152, -180, -243, -248, -217, -212, -227, -234, -259, -319, -365, -339, -275, -256, -286, -293, -241, -175, -152, -178, -221, -261, -285, -291, -280, -247, -185, -114, -81, -109, -177, -241, -274, -270, -230, -191, -204, -264, -295, -250, -175, -139, -140, -137, -137, -177, -241, -279, -289, -301, -299, -236, -132, -64, -64, -80, -74, -78, -110, -125, -87, -36, -34, -77, -102, -71, -7, 46, 59, 30, -12, -42, -73, -139, -230, -276, -227, -124, -46, -32, -49, -57, -50, -49, -77, -131, -177, -175, -124, -63, -36, -50, -91, -135, -156, -132, -77, -34, -21, -10, 27, 70, 86, 81, 99, 149, 189, 169, 101, 45, 52, 117, 188, 218, 218, 243, 322, 420, 472, 461, 431, 440, 492, 542, 558, 550, 546, 550, 553, 566, 599, 628, 611, 542, 473, 442, 440, 438, 418, 371, 290, 206, 180, 224, 270, 251, 193, 171, 201, 247, 289, 338, 375, 373, 351, 357, 385, 376, 315, 265, 276, 316, 337, 336, 344, 373, 415, 467, 534, 606, 672, 719, 736, 733, 745, 784, 789, 703, 586, 569, 682, 803, 812, 745, 710, 741, 780, 801, 824, 857, 867, 836, 792, 776, 792, 804, 764, 665, 546, 455, 405, 382, 391, 430, 450, 392, 279, 202, 211, 254, 273, 278, 291, 296, 286, 302, 368, 432, 441, 429, 448, 486, 497, 501, 530, 562, 558, 562, 639, 753, 810, 805, 823, 894, 947]
1328I47%j4j4n8r4m0M9M9l3o3j1J3m2p9k4M1K3m3o8n5o5p3k2N6P3J1n1n6k9oK6O6P0K9OL3
1324E52M8mp1n4J9L5j8m7JN1K9j3lL9N2N0O9P8K8m3o4m7n5q4o6j6ll6m6j0J1%RM5L7k1l6K3
1319D39O2J6l1PP4O3j3n9m3LM4N4Ro2p3NN8J3m7mO5K3q2o9Q5J79Q7o8j08l2K8J0l5n3l3KJ9
1315E33Kj6JL0J1n6o9J7J13J08K5k5rJ0j3l8j5K3Qo3j12q4j3M1N0L8J4mPO2J11R3J6n2o9p1
1310F04o8l5L3P7N9J9M%j9k6J2O4Q0O0K4l1p8o3lNq4j37n2P1O7k9n5QK8k7m5K9P7L3k6k4k
1306E50JL3J03J12J2p6n5Kk1p8n9J8M8K4J7L5J7j5KM7K9l9m6L5R7N6k6n2j7J7K6J3Koj5k2
1301G69k6JM5M7l1j14r4PP2N1K6O2J07Q4J6j6J0M4M3J9kJ0N2Q2N9J2J0N5P5L0qJ5M4Np0q9
1297A402n1m7q7p8J3P8L1o3q3k9Lj9k9mOk1j8M6R7O8jj2L8O2J5m3m7QP5J13J17J00Q8O9K2
$$ y = [947, 947, 933, 919, 861, 767, 727, 776, 825, 792, 729, 718, 731, 689, 610, 586, 627, 650, 607, 539, 484, 419, 346, 324, 380, 453, 464, 413, 357, 328, 322, 348, 414, 484, 513, 519, 552, 600, 596, 525, 471, 490, 525, 507, 460, 461, 512, 541, 528, 525, 564, 616, 666, 735, 813, 841, 798, 734, 687, 632, 548, 482, 466, 463, 427, 381, 371, 382, 382, 391, 436, 473, 452, 416, 439, 501, 517, 486, 493, 567, 630, 617, 558, 515, 518, 562, 616, 625, 563, 490, 495, 553, 566, 519, 515, 580, 603, 521, 452, 537, 716, 803, 735, 627, 595, 623, 633, 598, 545, 512, 514, 533, 535, 519, 520, 550, 561, 505, 436, 453, 566, 674, 699, 674, 665, 675, 662, 624, 609, 632, 640, 577, 465, 381, 368, 409, 459, 497, 511, 507, 514, 576, 687, 780, 796, 744, 675, 604, 536, 501, 534, 611, 670, 689, 693, 693, 674, 648, 660, 724, 804, 864, 888, 857, 779, 716, 713, 718, 634, 497, 445, 516, 583, 554, 499, 507, 535, 508, 463, 492, 569, 602, 576, 552, 550, 551, 584, 687, 799, 811, 735, 680, 682, 661, 583, 524, 542, 590, 614, 631, 666, 683, 668, 670, 717, 746, 707, 661, 696, 793, 849, 823, 771, 754, 771, 797, 810, 812, 806, 791, 769, 743, 744, 789, 836, 805, 691, 597, 604, 676, 727, 753, 815, 922, 1006, 1022, 1006, 1016, 1060, 1103, 1122, 1120, 1130, 1182, 1264, 1323, 1335, 1345, 1400, 1475, 1505, 1497, 1512, 1556, 1561, 1491, 1402, 1351, 1304, 1217, 1139, 1152, 1230, 1261, 1198, 1115, 1086, 1089, 1070, 1041, 1037, 1043, 1022, 1004, 1050, 1147, 1215, 1214, 1202, 1240, 1302, 1317, 1274, 1227, 1235, 1310, 1423, 1540, 1640, 1728, 1797, 1819]
1293A819l4k2Q5K12K63K51K59K90K78K26K11K49K59J96J24J02P1l1j56k14k13k36k88l05k59
1290C137k06j81j62j29r0p2p0q1r7r6n3J8N3K7l3n6k2M0N5Jo4n2N3J46J51J00P8J04J34J47
1286B780J67J99K23K48L09L99M71N10N61O41P22P56P34O53N07L30J80O8n6k11l45m10m56n57
1283H423o83p35o69n55m84m63m35l73k98k36j81j29r6r0r4o3mL5J8k5m4j7K2M1L2K8N8J12
1280C095J44J20P4Q0J49K28K81L34M25N25O02O66P59Q70R47R68R54R18Q40O92M83K32l0k62
1277A4094m45n88p15q19q78q78q32p67p02o51n92n21m55m20l75k68j23p0j60k72k49j04K9
1274C239P3O9N9K1m0o5k8J9J7NL0Q8J28J44J58J87K34K97L76M48N04N54O16O99P78Q17P83
1271A0210O83N65M47K87N9j60k79l10l59m73n95o74p12p18o76o11n83n77n15l79k59k35k56
$$ y = [1819, 1785, 1763, 1848, 2060, 2323, 2574, 2833, 3123, 3401, 3627, 3838, 4087, 4346, 4542, 4666, 4768, 4839, 4808, 4652, 4438, 4225, 3989, 3701, 3396, 3137, 2931, 2750, 2588, 2459, 2369, 2297, 2227, 2146, 2049, 1953, 1900, 1918, 1971, 1998, 1965, 1909, 1887, 1927, 1982, 1983, 1919, 1867, 1920, 2066, 2217, 2317, 2395, 2499, 2633, 2780, 2947, 3146, 3369, 3617, 3926, 4325, 4796, 5306, 5867, 6508, 7230, 7986, 8720, 9373, 9880, 10210, 10390, 10458, 10402, 10191, 9846, 9436, 8980, 8423, 7740, 7005, 6336, 5781, 5297, 4834, 4399, 4026, 3728, 3492, 3311, 3182, 3086, 2996, 2902, 2839, 2835, 2870, 2888, 2863, 2819, 2802, 2824, 2865, 2897, 2925, 2983, 3095, 3239, 3359, 3433, 3513, 3662, 3890, 4171, 4505, 4930, 5455, 6057, 6723, 7482, 8352, 9299, 10267, 11221, 12139, 12979, 13671, 14154, 14386, 14356, 14094, 13649, 13061, 12346, 11527, 10649, 9771, 8939, 8172, 7470, 6819, 6227, 5706, 5251, 4831, 4456, 4188, 4065, 3995, 3835, 3563, 3314, 3210, 3239, 3312, 3381, 3440, 3461, 3421, 3356, 3328, 3347, 3364, 3369, 3399, 3487, 3615, 3759, 3917, 4104, 4338, 4635, 5011, 5459, 5963, 6517, 7133, 7832, 8610, 9427, 10210, 10893, 11458, 11905, 12192, 12251, 12091, 11812, 11502, 11143, 10670, 10075, 9401, 8689, 7971, 7295, 6684, 6101, 5524, 5009, 4630, 4371, 4136, 3880]
1268C880k31j59r0m9k3j5l8o0n7l7k2nK7L5J0j5j4pj0J0O9J14J06Q7J19J79K02J96K31L11
1264D744L73L87L81L82L68L22K55J81R5Rp3j57k39k84k78k55k53k62k62k84l53m13l75k44
1261C765j29j05j44j72j60j21p2m0k7j7QK1Kl5m7l7k4j2J0K8K1QK6O3O6L8K0K8K5J5L2P2J01
1257C207J09J33J76J92J64J29J19J08Q3O2M4J3l9p5r0j16j45j37j05j21j83k01j28n7o9j19
1254B954j25r4q8p4JP6M6m8o2M5J33R3qn4l2ML2M8L1l5p0j3P5Q0no7k7N9J11J13Q3K9j5KQ4
1250C282J43J09L1PM2O2K8k5n9p6p5n9n1q5j22r4j6J6l4q1n5jOj0J4O2O3J7j5k0k5k6J9R0
1246C062J12P2M4O6Q2M5rl9m9n6l0M0R4O9j2o3n0j4JLJ2K8K6ol5j3N2R0N5pjN8P0j2r1p4j5
1241C505j6n6l2O9J19M5o2r2o0m6m6kO8O2k7q1j8Q6J07N8K3L0K6J3L6P3L2p3j16l9N1O6N9
$$ y = [3880, 3649, 3490, 3400, 3351, 3328, 3313, 3275, 3215, 3158, 3121, 3099, 3094, 3121, 3156, 3166, 3151, 3137, 3130, 3120, 3130, 3199, 3313, 3419, 3506, 3625, 3804, 4006, 4202, 4433, 4744, 5117, 5504, 5885, 6267, 6635, 6957, 7212, 7393, 7488, 7497, 7424, 7267, 7028, 6744, 6466, 6211, 5958, 5696, 5434, 5150, 4797, 4384, 4009, 3765, 3636, 3531, 3387, 3215, 3055, 2934, 2862, 2822, 2795, 2778, 2786, 2807, 2809, 2774, 2727, 2690, 2666, 2654, 2664, 2692, 2713, 2721, 2747, 2810, 2876, 2914, 2934, 2962, 2987, 3002, 3034, 3106, 3207, 3316, 3449, 3625, 3817, 3981, 4110, 4229, 4337, 4420, 4482, 4526, 4539, 4500, 4425, 4335, 4219, 4074, 3937, 3832, 3711, 3528, 3327, 3199, 3142, 3073, 2954, 2829, 2735, 2647, 2573, 2574, 2650, 2696, 2648, 2586, 2631, 2764, 2857, 2849, 2795, 2763, 2767, 2799, 2847, 2878, 2843, 2773, 2760, 2835, 2915, 2910, 2843, 2816, 2875, 2986, 3099, 3182, 3211, 3196, 3198, 3282, 3425, 3534, 3565, 3572, 3614, 3676, 3704, 3679, 3620, 3544, 3469, 3410, 3359, 3274, 3152, 3058, 3042, 3058, 3024, 2943, 2888, 2887, 2893, 2883, 2897, 2959, 3022, 3039, 3024, 3004, 2979, 2953, 2972, 3062, 3174, 3246, 3290, 3356, 3438, 3483, 3474, 3435, 3386, 3330, 3300, 3340, 3434, 3503, 3491, 3428, 3378, 3364, 3365, 3368, 3380, 3408, 3434, 3428, 3393, 3380, 3432, 3522, 3577, 3570, 3569, 3627, 3697, 3685, 3594, 3520, 3505, 3489, 3433, 3401, 3470, 3589, 3634, 3572, 3480, 3420, 3374, 3328, 3326, 3394, 3456, 3429, 3348, 3330, 3416, 3523, 3581, 3604, 3634, 3660, 3673, 3709, 3782, 3814, 3741, 3625, 3586, 3637, 3703, 3762]
1237C762J00J35P5k1k7M7P3K4mJ9K3k3m0ML2Lj3L4P8M8mj1j1n9j03o3L1Q7P9N3J2o0j18r5
1233D067qM7M5L4M0K1k1l2OM0L7L1M8O2M2J1%%qj3lK2M1N6N8L7KrJ0K5PqK4P9Q4Qq2r4j5O7
1228D758P3Qn3o0k2K3O3Q5P1K1k2l3k1j5j4mPQJ3K5J9j3j5M6J12J12N0PPK1L2O6J01Q7M1L7
1224E621R6J32R8O2R1J45J49J04P7Q3R7J22J86K69L11L24L71M61N20N14M98N27N80N75M94
1220A2507L81K69J62N2n9j74k98l99m29l93l54l56l74l49k96k58k49k33j90j33p8j4M5P0O7
1217H917O8Q7R6R6J25J95K65K84K74K66K84L41M41N54O15O24O69Q03R74J132J333J649K046
1215B2138K427K790L175L524L700L645L418L049K496J770R94K57m57j151j732k147k457k725
1212D2714k895k884k746k606k479k269j938j583j288j060q57o84n32l75k30j51j53j40k6J36
$$ y = [3762, 3862, 3997, 4072, 4051, 4024, 4071, 4144, 4168, 4164, 4183, 4206, 4183, 4143, 4147, 4179, 4182, 4169, 4203, 4281, 4329, 4325, 4314, 4303, 4244, 4141, 4078, 4109, 4196, 4275, 4328, 4340, 4280, 4162, 4067, 4059, 4106, 4151, 4185, 4225, 4246, 4225, 4193, 4199, 4239, 4276, 4307, 4355, 4417, 4459, 4470, 4470, 4470, 4462, 4449, 4446, 4468, 4509, 4565, 4623, 4660, 4662, 4653, 4663, 4688, 4695, 4687, 4711, 4790, 4874, 4882, 4800, 4706, 4691, 4758, 4831, 4839, 4786, 4726, 4704, 4727, 4790, 4875, 4946, 4967, 4945, 4912, 4891, 4876, 4862, 4858, 4865, 4873, 4886, 4911, 4930, 4917, 4902, 4948, 5060, 5172, 5222, 5229, 5236, 5257, 5289, 5355, 5456, 5543, 5584, 5621, 5717, 5849, 5947, 6009, 6100, 6245, 6394, 6498, 6575, 6658, 6755, 6877, 7063, 7332, 7643, 7967, 8338, 8799, 9319, 9833, 10331, 10858, 11438, 12013, 12507, 12888, 13157, 13319, 13371, 13312, 13138, 12840, 12441, 12012, 11619, 11265, 10909, 10535, 10186, 9890, 9632, 9383, 9150, 8960, 8827, 8749, 8735, 8780, 8850, 8917, 8985, 9072, 9168, 9264, 9389, 9584, 9849, 10133, 10407, 10673, 10957, 11298, 11739, 12293, 12908, 13532, 14201, 15004, 15978, 17110, 18443, 20092, 22138, 24565, 27355, 30530, 34054, 37754, 41399, 44817, 47866, 50362, 52132, 53126, 53383, 52926, 51775, 50043, 47896, 45439, 42714, 39819, 36935, 34189, 31583, 29104, 26835, 24897, 23314, 22026, 20966, 20109, 19425, 18893, 18518, 18288, 18137, 17984, 17844, 17818, 17954]
1210A7954K39K80L57N13O57P01P04P93R96J220J411J604J854K171K557L074L768M611N548
1208E1012O550P575Q486R117R364R186Q533P353N689L711J622m25k332m044n509o655p392
1206A01841p717p747p613p336o855o189n470m783m106l422k772k200j702j294j012q63p42
1203C0018n65l63k16j24l1Q5K09L41N09P15R16J092J263J463J732K086K522L027L652M465
1201E2796N490O671P972R368J0750J1877J2523J2620J2145J1005R098O533L631P08k071m642
1199A66474o896q695r937j0637j0891j0826j0513r965r208q308p327o284n211m217l418k805
1197D1336k300j872j562j367j186r53p28n86n19m31k69p5R4K29L48M74O25Q10J045J326J643
1195C6082J992K401K922L606M460N427O433P420Q326R028R357R196Q531P414N856L872J612
$$ y = [17954, 18193, 18473, 18830, 19343, 20000, 20701, 21405, 22198, 23194, 24414, 25825, 27429, 29283, 31454, 34011, 37085, 40853, 45464, 51012, 57562, 65137, 73623, 82740, 92104, 101290, 109823, 117176, 122865, 126576, 128198, 127773, 125441, 121397, 115888, 109233, 101841, 94124, 86377, 78764, 71428, 64573, 58384, 52914, 48131, 44025, 40603, 37831, 35631, 33929, 32635, 31623, 30760, 30018, 29453, 29090, 28874, 28750, 28719, 28804, 29013, 29354, 29863, 30578, 31494, 32586, 33849, 35312, 37044, 39130, 41652, 44679, 48331, 52796, 58286, 64957, 72929, 82297, 93047, 104924, 117447, 130067, 142212, 153217, 162315, 168848, 172479, 173187, 171116, 166474, 159578, 150883, 140946, 130309, 119418, 108592, 98079, 88114, 78906, 70598, 63271, 56987, 51776, 47559, 44141, 41336, 39036, 37164, 35602, 34235, 33049, 32096, 31368, 30782, 30263, 29832, 29563, 29488, 29582, 29811, 30159, 30633, 31258, 32068, 33113, 34439, 36082, 38074, 40475, 43397, 47003, 51463, 56890, 63323, 70743, 79069, 88097, 97454, 106650, 115181, 122595, 128451, 132323, 133935]
1192A33935o48k691m479o030p249q007q346q441q362q027p416o681n966n266m523l780l115
1190C4908k542k046j670j431j242j036q64q12q11p31n78m59l99l10j66n9m2m5K6J75L48N13
1188B0727O50P74R59J235J545J828K137K564L043L391L515L503L402L111K549J796R88J67
1186E7884o74j481k162k690l078l313l401l399l362l260l033k695k325j975j667j417j221
1183A6731j035q39o74n75n22m68m15l85l64l23k71k37k22k10k03j93j55q8l9m1o7n3LP1J33
1180I559J88K38K80L37M11M73N02N17N24M91M10L16K21P9j21k92l59l80m47n48n91n67n62
1178A0679o05o29n74m65l59k86k44k38k53k56k35k00j67j42j23j07p6m9m5n8n2k2k3o6r2n4
1174E259oJOM3M7m8j57j49n2j2n8p0rK4k1n4oL3k5j02q7jM8M3K6Pm6r8p4QO1N2L6L5Qo5j28
$$ y = [133935, 133287, 130596, 126117, 120087, 112838, 104831, 96485, 88044, 79682, 71655, 64239, 57558, 51592, 46326, 41803, 38023, 34908, 32366, 30320, 28650, 27219, 25977, 24941, 24077, 23265, 22454, 21723, 21145, 20686, 20287, 19977, 19811, 19752, 19710, 19665, 19691, 19866, 20214, 20727, 21377, 22151, 23110, 24345, 25890, 27718, 29855, 32419, 35462, 38853, 42368, 45871, 49273, 52384, 54933, 56729, 57717, 57884, 57210, 55729, 53567, 50877, 47799, 44486, 41085, 37686, 34324, 31064, 28031, 25336, 23011, 21036, 19369, 17952, 16731, 15696, 14857, 14183, 13608, 13086, 12618, 12203, 11818, 11454, 11131, 10860, 10623, 10401, 10191, 9988, 9795, 9640, 9552, 9513, 9472, 9405, 9352, 9355, 9426, 9559, 9747, 9985, 10265, 10602, 11013, 11486, 11988, 12505, 13029, 13520, 13930, 14246, 14467, 14546, 14425, 14133, 13774, 13394, 12947, 12399, 11808, 11241, 10679, 10074, 9445, 8871, 8406, 8047, 7761, 7517, 7279, 7026, 6770, 6535, 6335, 6168, 6026, 5903, 5796, 5720, 5671, 5626, 5568, 5516, 5494, 5471, 5405, 5313, 5259, 5253, 5254, 5260, 5303, 5350, 5302, 5145, 4996, 4944, 4932, 4874, 4804, 4795, 4819, 4798, 4744, 4738, 4771, 4746, 4644, 4557, 4556, 4604, 4647, 4673, 4680, 4634, 4536, 4462, 4470, 4531, 4583, 4619, 4654, 4662, 4597, 4469]
1170D469j24n9K0O5O0J2l1j4N2R6O9Nl3k4J0L2J4m2q5o3OL5j6p5o4LL8K5J2K3J7k7n1JP1P1
1165D498jn3l8pj7n1o7n0k9j8j8l0k7J2N8M1n0j18p3L5Q2L7j1JM1L6j3n8n1J1Q1R1J5p4q3
1161D102j4L7J8k8k0J8L1jl4l6rM1P9O5jn4l7J3K5mk6j5oj5k3k1k6m6n4l5qKLql2m8k2N0R5
1156C956O0rl2J3N6M2mk4j0Nrk1jM6P7N9J7qjJk3m3k1L8O9M8K1K0K2j2n3m5MK5pl5rL5L3j1
1152D269l5k0j1m0p7p3l3mrk5k9k4j5KL1N9P0N9M1J9kqJ7N5O1L1%nlj8j8NJ0l3p4m7J8L0j4
1147D160m0j6Jj4lN1Q1M8Pjj1n6o7mN3J7n0m0L2M4j3n0l1l1o3n5J3N8L7L2R6J45Q5l8j00n5
1142D222K1O7P3P3Q5R6P0kn1j7M4J9q6j30m4O0M6n3j10q7n1k6NL7J8l8o3j8M0N7L0koK9P9
1138D387Q9J6r4j32o3K8M4nm0k8pj2j6K6R2J30J22J01R0P1L9K8N4P7O6N2P9J12R6L3mjKj6
$$ y = [4469, 4345, 4286, 4306, 4371, 4431, 4443, 4412, 4398, 4450, 4546, 4615, 4620, 4587, 4563, 4573, 4605, 4619, 4577, 4492, 4429, 4435, 4470, 4454, 4379, 4315, 4318, 4356, 4381, 4393, 4416, 4433, 4406, 4355, 4356, 4427, 4498, 4497, 4444, 4406, 4399, 4382, 4331, 4264, 4214, 4185, 4167, 4149, 4119, 4092, 4104, 4162, 4203, 4153, 4035, 3962, 3997, 4079, 4116, 4105, 4106, 4147, 4183, 4170, 4112, 4061, 4072, 4153, 4244, 4259, 4185, 4102, 4088, 4125, 4143, 4115, 4095, 4113, 4144, 4143, 4109, 4073, 4064, 4105, 4184, 4249, 4248, 4194, 4157, 4170, 4195, 4191, 4165, 4150, 4144, 4129, 4106, 4085, 4059, 4013, 3959, 3924, 3916, 3918, 3921, 3913, 3881, 3833, 3811, 3861, 3956, 4016, 4007, 3975, 3988, 4044, 4086, 4082, 4058, 4048, 4053, 4044, 4023, 4022, 4068, 4145, 4204, 4221, 4213, 4212, 4213, 4190, 4147, 4126, 4164, 4233, 4281, 4302, 4322, 4344, 4332, 4279, 4234, 4238, 4263, 4256, 4221, 4212, 4247, 4280, 4269, 4234, 4214, 4203, 4163, 4086, 4013, 3980, 3976, 3967, 3942, 3913, 3889, 3874, 3876, 3907, 3966, 4036, 4095, 4136, 4155, 4153, 4145, 4162, 4217, 4278, 4309, 4309, 4304, 4301, 4283, 4265, 4270, 4280, 4247, 4173, 4126, 4144, 4174, 4160, 4120, 4104, 4105, 4091, 4088, 4139, 4220, 4268, 4275, 4274, 4263, 4207, 4140, 4136, 4189, 4206, 4156, 4116, 4148, 4192, 4179, 4129, 4098, 4067, 4004, 3949, 3962, 4020, 4057, 4089, 4185, 4330, 4415, 4377, 4277, 4222, 4243, 4310, 4383, 4456, 4541, 4637, 4707, 4705, 4654, 4637, 4681, 4700, 4614, 4484, 4440, 4500, 4546, 4493, 4383, 4296, 4245, 4219, 4224, 4261, 4279, 4241, 4178, 4160, 4200, 4257, 4287, 4285, 4279, 4308, 4387, 4476, 4492, 4398, 4266, 4203, 4231, 4275, 4270, 4230, 4202, 4195, 4183, 4167, 4193, 4285, 4415, 4537, 4638, 4728, 4799, 4838, 4866, 4920, 4997, 5063, 5115, 5194, 5306, 5402, 5435, 5431, 5430, 5432, 5416]
1134E416k8k4k8l7k5pj3j6M9J52J81R7Kj6L7R7J56K04J97J40J02J16J05L1j7M3J28R7l8j34
1130F967j16n7l6o1r5j06o5J2N5L0j1PO1P2L7K7O2P2K5k0j5L1Q9J39J56J23P5N7N7L0j4k6
1126G562qlj2J1M6K6n2j08j03j08j64k05j59p2l6p5j33j56j26p1k5j7l1m2n3q3j04o5J0L6
1123E680rn9n7k9j5pK2N1N1K5nk1kN2R4P4J4qJ1Om7p5m8l2p6j14p0j0k3j03j30n4M9Q1K0n5
1118E181o1J3Q6P4Kl7k1oj8qL4L7k1l9M8J38R8l7j13p7j1J4J5J8J6OJ3K4J5lLK5L0K6L0K2
1114E516j9m2OP9P7Qk2K4O6N4L4O5J03J00Q2J12J70J96J78J56J25N4m4j07r3n9o4j17j51j24
1110F363p1m9o6p1l3Olm9o9m6j6j6k2ON6Q3O4J3j8lL8N1Rl7m0oJ2J0K7O5Q1N1J5K4N3N6M0
1106F508O3J30J76J57J15J14J61K01K04J98J94J80J53J41J30N5q1j68j27n3q7k04k34j35n5
$$ y = [5416, 5388, 5364, 5336, 5299, 5274, 5267, 5254, 5238, 5287, 5439, 5620, 5717, 5719, 5703, 5740, 5837, 5993, 6197, 6394, 6534, 6636, 6752, 6857, 6888, 6871, 6914, 7042, 7139, 7101, 6967, 6851, 6794, 6758, 6697, 6602, 6496, 6431, 6443, 6498, 6528, 6517, 6524, 6585, 6657, 6694, 6721, 6783, 6855, 6880, 6860, 6845, 6876, 6965, 7104, 7260, 7383, 7458, 7515, 7572, 7602, 7588, 7562, 7554, 7551, 7539, 7550, 7596, 7622, 7570, 7462, 7359, 7251, 7087, 6882, 6723, 6651, 6615, 6540, 6407, 6251, 6125, 6054, 6029, 6012, 5981, 5939, 5886, 5803, 5699, 5634, 5644, 5680, 5671, 5612, 5555, 5526, 5511, 5504, 5526, 5577, 5628, 5653, 5648, 5627, 5625, 5677, 5771, 5845, 5859, 5851, 5862, 5868, 5821, 5746, 5698, 5666, 5590, 5476, 5406, 5396, 5373, 5270, 5140, 5086, 5135, 5216, 5236, 5181, 5120, 5133, 5219, 5293, 5295, 5258, 5237, 5231, 5213, 5205, 5239, 5276, 5255, 5216, 5264, 5402, 5500, 5463, 5350, 5273, 5262, 5276, 5291, 5309, 5325, 5331, 5344, 5368, 5383, 5380, 5383, 5408, 5438, 5464, 5494, 5516, 5497, 5455, 5461, 5540, 5617, 5625, 5603, 5627, 5693, 5747, 5781, 5846, 5949, 6049, 6131, 6243, 6413, 6609, 6787, 6943, 7068, 7122, 7078, 6971, 6878, 6819, 6755, 6638, 6487, 6363, 6292, 6243, 6177, 6106, 6073, 6079, 6076, 6027, 5958, 5912, 5896, 5880, 5858, 5864, 5920, 6003, 6067, 6080, 6062, 6059, 6097, 6148, 6157, 6120, 6080, 6074, 6086, 6096, 6123, 6188, 6269, 6320, 6335, 6359, 6412, 6468, 6508, 6571, 6701, 6877, 7034, 7149, 7263, 7424, 7625, 7829, 8027, 8221, 8401, 8554, 8695, 8825, 8880, 8799, 8631, 8504, 8451, 8364, 8160, 7926, 7791, 7736]
1103G736j00j77j47n9m2r9j25o7jJ4ol4n3l7K5P8N5k0n9l8k4l6l0J7M6K7J0M0N8lq8q2K6J21
1098F926J01J1k6K9J19J59J39J03P3N7O9J12J39J17O6M9O0J5r5j81j76j36j36j46j08n9p0
1095G211j08r4l8j1k1KN0M2k1m0L0R3O8J2RN3P3N1Mm9q8o5J9Q2N6j4k8K8R6J13Q2M0J2Jj4
1091G636m2n2j7L1M1J8J5M2N2J7j5j2nk8n4p1r8j45j70j23o3n2q7j01p3l9l2l9l2J6J06J84
1087F808J77Q2LJ5P1Q0L8K7O4Q6N7K9O6J38J56P8l2p2k1M4L8%K2J06J46P8l0o6k5K6M0L4J7
1083H280LJ5N7P2L0j9LP8J10N6l9r6j03q9q2r3r9o7JM1Ko1n0L4R8Q1L9M4O3L2k7j2R9K01J89
1079H791Q8Jj8PL7O8J02J05O6J5j5k4k2lK2K2OK7R4J27O8rnM7L6l5m3L4Q1K8l2jO9Q2M6K3
1074I885J3k1l8J3P9O2k0o3j2N9P0L1J0L2O0N7K7K9P8J13P3MJ0Q4J10M1k7k2RN%M5Q7O4L4
$$ y = [7736, 7636, 7459, 7312, 7253, 7211, 7112, 6987, 6920, 6919, 6933, 6927, 6893, 6840, 6803, 6828, 6906, 6961, 6941, 6882, 6844, 6820, 6784, 6754, 6771, 6817, 6844, 6854, 6894, 6952, 6949, 6861, 6779, 6805, 6926, 7027, 7038, 7012, 7041, 7160, 7319, 7458, 7561, 7634, 7691, 7760, 7872, 8011, 8128, 8194, 8243, 8303, 8318, 8223, 8042, 7866, 7730, 7594, 7448, 7340, 7281, 7211, 7103, 7009, 6971, 6960, 6939, 6941, 6991, 7033, 7012, 6972, 7002, 7095, 7163, 7175, 7184, 7237, 7310, 7361, 7365, 7316, 7228, 7163, 7182, 7264, 7320, 7306, 7278, 7306, 7402, 7515, 7597, 7637, 7649, 7650, 7636, 7594, 7542, 7525, 7556, 7597, 7615, 7630, 7672, 7724, 7741, 7726, 7714, 7709, 7681, 7627, 7556, 7458, 7313, 7143, 7020, 6957, 6905, 6818, 6717, 6644, 6605, 6573, 6534, 6502, 6518, 6624, 6808, 6985, 7067, 7070, 7085, 7156, 7236, 7274, 7301, 7365, 7451, 7508, 7537, 7603, 7741, 7897, 7975, 7943, 7871, 7850, 7894, 7932, 7932, 7954, 8060, 8206, 8284, 8254, 8188, 8163, 8189, 8229, 8263, 8280, 8283, 8298, 8355, 8427, 8457, 8438, 8441, 8519, 8629, 8685, 8646, 8550, 8447, 8358, 8276, 8183, 8084, 8017, 8018, 8059, 8061, 8000, 7950, 7984, 8082, 8163, 8202, 8246, 8309, 8341, 8314, 8302, 8401, 8602, 8791, 8879, 8880, 8862, 8869, 8906, 8974, 9076, 9181, 9247, 9262, 9247, 9223, 9201, 9198, 9220, 9242, 9248, 9275, 9369, 9496, 9564, 9555, 9550, 9597, 9633, 9598, 9555, 9589, 9670, 9698, 9666, 9665, 9734, 9816, 9862, 9885, 9898, 9877, 9839, 9852, 9931, 9993, 9973, 9910, 9898, 9957, 10027, 10058, 10068, 10100, 10160, 10217, 10244, 10273, 10351, 10464, 10537, 10541, 10551, 10635, 10745, 10786, 10759, 10737, 10746, 10751, 10751, 10796, 10883, 10947, 10981]
1070A0981M7O1Pm8j1O8P2J6J3P1R7N4K3K2Km1l4K9O0J4m6o5n0oP4J33Q5k0n4J3N4J4pO0J21
1066A1809P7j5l5J5M8M2L1M6N9O9P4N5Ok1J3Q0J19J12Q0M8K8K9N2P3Q8R3Q1M4J6L0O7Q2Q9
1062A3484J17J24O5k2m5pPpL1J16J48R9O1P9Q2M1M4J04J19M9K4J10J66O8p1p0L7R6Q9J08J34
1058A5380Q1nJ4J20J59Q0J2L5R1J15J46J90J90J15M5M9J17K03K75K90K23J33J18J78K08J75
1055A8737J54J98K42K39K28K52K88K96L04L22L07K47K09K42L00L15L10L62M60N43O00O70P61
1052B6586Q28Q46Q54Q94R75J076J188J320J498J745K055K403K773L174L631M187M898N804
1050F6735O884Q107R536J1325J3621J6473J9918K3908K7944L0695L0305K5548J6989O938j936
1048C12990q195j2053j4543j6508j8255j9740k0743k0946k0136j8403j6109j3619j1183q981
$$ y = [10981, 11028, 11089, 11096, 11048, 11037, 11105, 11177, 11193, 11206, 11277, 11374, 11428, 11451, 11473, 11475, 11434, 11400, 11429, 11489, 11503, 11457, 11392, 11342, 11336, 11410, 11543, 11628, 11608, 11554, 11567, 11621, 11635, 11628, 11688, 11809, 11886, 11871, 11836, 11851, 11899, 11941, 11972, 12018, 12077, 12146, 12220, 12275, 12281, 12260, 12273, 12353, 12472, 12584, 12664, 12712, 12740, 12769, 12821, 12894, 12982, 13075, 13156, 13200, 13216, 13246, 13313, 13395, 13484, 13601, 13725, 13790, 13768, 13723, 13716, 13723, 13716, 13747, 13863, 14011, 14110, 14171, 14250, 14332, 14373, 14417, 14521, 14640, 14689, 14713, 14823, 14989, 15057, 14986, 14916, 14953, 15049, 15138, 15246, 15380, 15461, 15456, 15470, 15590, 15749, 15829, 15841, 15876, 15967, 16082, 16228, 16418, 16608, 16723, 16768, 16817, 16934, 17137, 17412, 17702, 17925, 18058, 18176, 18354, 18562, 18737, 18891, 19089, 19331, 19570, 19798, 20050, 20338, 20634, 20938, 21260, 21567, 21814, 22023, 22265, 22565, 22880, 23190, 23552, 24012, 24555, 25155, 25825, 26586, 27414, 28260, 29114, 30008, 30983, 32059, 33247, 34567, 36065, 37810, 39865, 42268, 45041, 48215, 51846, 56033, 60931, 66735, 73619, 81726, 91262, 102587, 116208, 132681, 152599, 176507, 204451, 235146, 265451, 290999, 307988, 314926, 312990, 304795, 292742, 278199, 261691, 243436, 223696, 202953, 182007, 161871, 143468, 127359, 113740, 102557, 93576]
1046I3576p144n704m580l684k962k356j824j377j033p35l89j0L09N54Q08J126J449J735K002
1044F9761K257K451K574K732L047L565M261N110O080P130Q284R622J1227J3154J5473J8312
1042A85040K1806K6093L1279L7139M2751M6580M7189M3943L7111K7531J6371N061n071j3389
1040E49434k0119k5863l0852l4757l7093l7701l6806l4776l1891k8396k4600k0850j7396j4357
1038A53977j1820r861q452p419o558n785n104m512l985l519l125k800k519k251j970j666j371
1036G1260j118q87o17l10j6K59N84J003J464J954K544L306M197N161O262P617R275J1239J3594
1034A36771J6501K0097K4410K9056L2759L3358K9007J9817Q269k305r848j4372j7104j9191
1032B87225k1113k2811k3998k4348k3636k1871j9314j6377j3468j0869q700o988n703m780
$$ y = [93576, 86432, 80728, 76148, 72464, 69502, 67146, 65322, 63945, 62912, 62177, 61788, 61778, 62087, 62641, 63449, 64575, 66024, 67759, 69761, 72018, 74469, 77043, 79775, 82822, 86387, 90648, 95758, 101838, 108968, 117252, 126874, 138101, 151255, 166728, 185040, 206846, 232939, 264218, 301357, 344108, 390688, 437877, 481820, 518931, 546462, 562833, 567894, 562823, 549434, 529315, 503452, 472600, 437843, 400750, 363049, 326243, 291467, 259576, 231180, 206580, 185730, 168334, 153977, 142157, 132296, 123844, 116425, 109867, 104082, 98978, 94466, 90481, 86962, 83837, 81037, 78518, 76267, 74297, 72631, 71260, 70142, 69255, 68638, 68328, 68312, 68571, 69155, 70158, 71622, 73576, 76120, 79426, 83623, 88784, 95046, 102663, 111938, 123177, 136771, 153272, 173369, 197779, 226835, 259594, 292952, 321959, 341776, 350045, 347740, 337892, 323520, 306416, 287225, 266112, 243301, 219303, 194955, 171319, 149448, 130134, 113757, 100289, 89420, 80720, 73732, 68029, 63249]
1031F3249m101l539l041k633k328k084j846j608j418j283j178j082j007r58r20q68q12p78
1028C1765p75p90q09q21q03p47o72o06n73n63n67n59n09m08k97k37k41k59k51k27k27k50k65
1026B0309k54k37k34k45k40k03j50j29j55k01k16j91j45j14j25j69k08j97j42j06j15j18o7
1023A6348j0k4q9j26j17j26j56j42n4K7L5j1m1n1n3m8k6k4m9p2o0m8p0j14j36j48j75j86j49
1019A4105q1n1p1j01r9p3n6n8p3p5m8j6olK4M9J6n9q7n4l7q1j00k9M8J3p7r1j5K9ml7j9Qj2
1015A2779l6k9r%KJ5Rk0m5m3l0l1k8KL9N2L7ml6k6K3M4j4r8j12n2rm3j00j16q6m6LM4K5n9
1011A2002j24r3j0K7rm6l4j1k5o6p3l4J0K2K6N2P3M6nj4L0N3J1l3j4L4L0k8o3m1q%j7l2l3
1006A1603%N1N9%n2j9M3K7n5q3j8M5L6J2K3L8Nl8l6qmj9j6K3P1J12J19P9K7K7P5J05Q9Q4J25
$$ y = [63249, 59148, 55609, 52568, 49935, 47607, 45523, 43677, 42069, 40651, 39368, 38190, 37108, 36101, 35143, 34223, 33355, 32543, 31765, 30990, 30200, 29391, 28570, 27767, 27020, 26348, 25742, 25169, 24606, 24039, 23480, 22971, 22563, 22266, 22029, 21788, 21529, 21278, 21051, 20824, 20574, 20309, 20055, 19818, 19584, 19339, 19099, 18896, 18746, 18617, 18462, 18261, 18045, 17854, 17709, 17595, 17470, 17301, 17093, 16896, 16754, 16648, 16533, 16415, 16348, 16338, 16314, 16225, 16099, 15982, 15856, 15700, 15558, 15504, 15531, 15566, 15555, 15514, 15463, 15410, 15362, 15336, 15312, 15263, 15191, 15131, 15083, 15013, 14899, 14763, 14615, 14440, 14254, 14105, 14024, 13973, 13902, 13801, 13702, 13629, 13573, 13515, 13442, 13367, 13319, 13303, 13297, 13294, 13318, 13367, 13383, 13324, 13237, 13183, 13146, 13065, 12965, 12936, 12984, 12997, 12920, 12829, 12814, 12843, 12839, 12802, 12783, 12791, 12779, 12743, 12714, 12705, 12705, 12707, 12722, 12731, 12711, 12666, 12623, 12593, 12562, 12534, 12536, 12575, 12627, 12664, 12660, 12624, 12598, 12621, 12665, 12651, 12553, 12441, 12389, 12380, 12337, 12237, 12121, 12035, 11989, 11992, 12036, 12061, 12002, 11878, 11785, 11775, 11802, 11793, 11747, 11713, 11702, 11677, 11611, 11538, 11504, 11514, 11536, 11562, 11614, 11687, 11733, 11728, 11714, 11744, 11797, 11808, 11775, 11761, 11795, 11825, 11797, 11734, 11693, 11685, 11685, 11668, 11636, 11603, 11603, 11654, 11713, 11713, 11661, 11642, 11685, 11712, 11657, 11574, 11556, 11601, 11637, 11649, 11672, 11710, 11715, 11677, 11641, 11633, 11629, 11610, 11594, 11617, 11688, 11800, 11919, 11998, 12025, 12052, 12127, 12232, 12321, 12405, 12530]
1002A2530J66J59J39J51J81K00K30L00L89M54N13N87O57O86O80O64O25N61N05M49L04L9k17
999B0952l09k82l25n14p10p59o86o26o39o41n45l95l21l67m26l48j57nJ1l6n2m9p6r6l1Q3
996A2651J28O3k7n0j2K5L9M2O8J09J27R1K2j0L2R6J14Q7O7N2J8l1n5n3o3q6r1p8r0j33j63
992A2889j48j19j21j50j50r5j9J5j2m6k4L0M5J3MN4R1O4J6K1N2M3K0M8J31J68J22N6L5N5Q1
988A3169R0P0L1J1M6J12J29P8J7K0Q4J43J29N4j2nN3P9N1L3L9qj57l07l50l38l88n07n70n40
985A1256m89m51l76k61j66j11k0J27K38K43K02J97K25K33K20K14K07J91J73J46Q3J7K2R3J21
982A2334O1J5P0J64J89J52J14Q2L0JM2J00R4M8M7P7N9jpN4R6O5L0K6Mp3j14l8Q8J15K8l6K2
978A3938J42J92J51J08J31J83J90J60J58K07K59K70K53K19J56P9L7M9N6J1o1j06j27j56j78
$$ y = [12530, 12696, 12855, 12994, 13145, 13326, 13526, 13756, 14056, 14445, 14899, 15412, 15999, 16656, 17342, 18022, 18686, 19311, 19872, 20377, 20826, 21130, 21169, 20952, 20643, 20361, 20036, 19522, 18812, 18053, 17367, 16741, 16102, 15461, 14916, 14521, 14200, 13833, 13407, 13059, 12902, 12897, 12908, 12872, 12820, 12771, 12695, 12599, 12568, 12651, 12779, 12842, 12815, 12765, 12753, 12778, 12817, 12859, 12927, 13036, 13163, 13254, 13276, 13266, 13298, 13394, 13508, 13595, 13662, 13714, 13732, 13701, 13646, 13593, 13530, 13444, 13353, 13275, 13185, 13052, 12889, 12741, 12622, 12501, 12351, 12201, 12106, 12087, 12102, 12090, 12044, 12020, 12050, 12095, 12108, 12112, 12166, 12257, 12321, 12337, 12358, 12410, 12453, 12473, 12521, 12652, 12820, 12942, 12998, 13033, 13088, 13169, 13259, 13329, 13360, 13371, 13417, 13529, 13658, 13736, 13753, 13773, 13857, 14000, 14129, 14183, 14171, 14166, 14219, 14298, 14349, 14382, 14421, 14413, 14256, 13949, 13599, 13261, 12873, 12366, 11796, 11256, 10767, 10316, 9940, 9679, 9513, 9402, 9382, 9509, 9747, 9990, 10192, 10389, 10614, 10847, 11067, 11281, 11488, 11679, 11852, 11998, 12081, 12098, 12120, 12213, 12334, 12395, 12410, 12480, 12644, 12833, 12985, 13099, 13181, 13211, 13212, 13254, 13354, 13448, 13496, 13543, 13620, 13679, 13678, 13671, 13725, 13821, 13886, 13916, 13942, 13946, 13873, 13759, 13721, 13809, 13924, 13952, 13916, 13938, 14080, 14272, 14423, 14531, 14662, 14845, 15035, 15195, 15353, 15560, 15819, 16089, 16342, 16561, 16717, 16796, 16833, 16882, 16938, 16949, 16888, 16782, 16655, 16499, 16321]
975A6321j64j38j53j81j46m0M0M1PLOj6l8mN6O8J7k1oJ6qn4m7K6P7M9k1n1k6jlON0Q7O2J1
970A5825RO8J12R0M4L2O8J12J59K13K44K19J55J31J74K13J66M4m2l4J8J7n9j42j69j32p5l8
967A7422l7n4p0p1n5l2j9k9n4o6k5L7L8m1j21j05k4K2om5l6ppk9l2j1J8L8M0J8ojL3M4Ql4
962A6701k7K7O9P0N6O7Q6R1O8M3L2L8M5O9J17J63J51Q6L6P0J46J72J33R6J10J39J28R3R0J48
959A9313K25K42J57L1j7N5J51J47O8K8N5N4om5nL6Nm9k6M6Q3O9O0P0O1L8M8J03J54J76J77
955B1504J55R9M9N7J01R9L9lJ4L0qn7m4J8N3L6OojJ0N1J19J67J61J26J38K10K64K30J45J14
951B3876J80K56K51J83J36J56K10K36K01J27O9O7J14J52J50J38J53J79J79J43J18J21J48J85
948B7728K24K69L03L19L20L15L37M05M93N34N05M67M78N17N21M68L79K91K29K19K44K65K57
$$ y = [16321, 16157, 16019, 15866, 15685, 15539, 15499, 15539, 15580, 15587, 15590, 15596, 15580, 15542, 15538, 15594, 15662, 15679, 15658, 15652, 15668, 15660, 15606, 15559, 15585, 15662, 15711, 15690, 15639, 15613, 15612, 15609, 15615, 15665, 15752, 15814, 15825, 15834, 15902, 16014, 16104, 16148, 16180, 16248, 16360, 16519, 16732, 16976, 17195, 17350, 17481, 17655, 17868, 18034, 18078, 18036, 18002, 18020, 18037, 17978, 17836, 17667, 17535, 17460, 17422, 17385, 17331, 17261, 17190, 17135, 17103, 17084, 17055, 17001, 16935, 16910, 16947, 16985, 16944, 16823, 16718, 16694, 16716, 16710, 16665, 16629, 16622, 16615, 16586, 16554, 16543, 16561, 16599, 16639, 16657, 16651, 16650, 16683, 16727, 16735, 16701, 16674, 16701, 16770, 16840, 16896, 16963, 17049, 17140, 17208, 17251, 17283, 17321, 17366, 17435, 17552, 17715, 17866, 17952, 17988, 18058, 18204, 18376, 18509, 18605, 18715, 18854, 18982, 19075, 19165, 19313, 19538, 19780, 19937, 19968, 19951, 20006, 20157, 20304, 20372, 20400, 20455, 20509, 20503, 20458, 20453, 20489, 20494, 20445, 20419, 20465, 20548, 20617, 20677, 20747, 20808, 20846, 20894, 20997, 21151, 21327, 21504, 21659, 21758, 21807, 21864, 21965, 22064, 22103, 22100, 22114, 22144, 22136, 22079, 22035, 22053, 22106, 22142, 22148, 22142, 22141, 22151, 22202, 22321, 22488, 22649, 22775, 22913, 23123, 23387, 23617, 23762, 23876, 24056, 24312, 24563, 24746, 24882, 25038, 25248, 25484, 25685, 25812, 25881, 25948, 26062, 26214, 26364, 26502, 26655, 26834, 27013, 27156, 27274, 27395, 27543, 27728, 27952, 28221, 28524, 28843, 29163, 29478, 29815, 30220, 30713, 31247, 31752, 32219, 32697, 33214, 33735, 34203, 34582, 34873, 35102, 35321, 35565, 35830, 36087]
945C6087K45K36K09J63J57K17K81K84K67L04L84M51M93N60O43O85O74O66O96P30P46P67Q26
943D6771R18J024J125J195J241J320J483J667J770J798J881K129K522K958L368L739M115M568
940H5592N135N750O351O992P800Q826J0027J1438J3233J5543J8375K1813K6149L1704L8711
939C13439M7737O0024P6524R5811J13302J23829J26132J24641J25553J30083J31630J20526
937A589231R2687N4047J6410j1676l0758m8060o9669r4866j17281j30764j33825j29309j21023
935H65144j11304j00948r0168p9100o7873n6734m6166l6731k8813k2510j7745j4312j1933
934A80807j0326r271q579q065p600p141o694o267n876n524n185m825m450m095l761l427l132
932G6589k920k755k559k327k118j938j758j598j504j440j316j169j106j119j065r06p91q13
$$ y = [36087, 36332, 36568, 36777, 36940, 37097, 37314, 37595, 37879, 38146, 38450, 38834, 39285, 39778, 40338, 40981, 41666, 42340, 43006, 43702, 44432, 45178, 45945, 46771, 47689, 48713, 49838, 51033, 52274, 53594, 55077, 56744, 58514, 60312, 62193, 64322, 66844, 69802, 73170, 76909, 81024, 85592, 90727, 96477, 102828, 109820, 117620, 126446, 136473, 147911, 161144, 176687, 195062, 216875, 243024, 274728, 313439, 361176, 421200, 497724, 593535, 706837, 830666, 956798, 1081439, 1206992, 1337075, 1468705, 1589231, 1681918, 1735965, 1752375, 1740699, 1709941, 1661881, 1592212, 1497346, 1380065, 1249301, 1115476, 986167, 865144, 753840, 652892, 562724, 483624, 415751, 359017, 312851, 276120, 247307, 224797, 207052, 192740, 180807, 170481, 161210, 152631, 144566, 136966, 129825, 123131, 116864, 110988, 105464, 100279, 95454, 91004, 86909, 83148, 79721, 76589, 73669, 70914, 68355, 66028, 63910, 61972, 60214, 58616, 57112, 55672, 54356, 53187, 52081, 50962, 49897, 48991, 48200, 47387]
930D7387q67q30p56p52p94p89p34o98o90o72o37o06n73n41n28n27m94m23l82l65k92j40j8
927C4279pn1p5j23k40l60m11m40n06n56n27m81m95n34n29m96m89m68l90l17l16l21k49j60
924B5738j67k31k40k05k13k30j56k6J7l4l6O0J42J43J27J56J98K34L01L80M10M12M90O68Q28
921B8766R09J006J207J476J744K024K355K732L176L796M690N823P005P973Q524Q722Q896R323
919A10147R777R586Q239N920L380J291k34j616l332n436p474q876r428r347q998q609q218
917G6772p734p059o178n241m423l763l197k706k313j983j638j313j109j020r21p76o78o51
914B4069o04n01m44m73m90m33l78l92l91l05k06j76j82j61j49j87k18j80j20r3o7j9k6j34
911A7740k29k01j12r3j31j18n6l0o3j01j29j57j61j13p5j07j56j38q8q3j03p3k9p4j78k02
$$ y = [47387, 46520, 45690, 44934, 44182, 43388, 42599, 41865, 41167, 40477, 39805, 39168, 38562, 37989, 37448, 36920, 36393, 35899, 35476, 35094, 34729, 34437, 34297, 34279, 34272, 34221, 34146, 34023, 33783, 33423, 33012, 32572, 32066, 31510, 30983, 30502, 30007, 29473, 28944, 28448, 27959, 27491, 27101, 26784, 26468, 26147, 25898, 25738, 25571, 25340, 25100, 24895, 24682, 24452, 24296, 24270, 24287, 24253, 24217, 24277, 24419, 24562, 24689, 24845, 25043, 25277, 25578, 25958, 26368, 26780, 27270, 27938, 28766, 29675, 30681, 31888, 33364, 35108, 37132, 39487, 42219, 45395, 49191, 53881, 59704, 66709, 74682, 83206, 91928, 100824, 110147, 119924, 129510, 137749, 143669, 147049, 148340, 148106, 146490, 143158, 137722, 130248, 121372, 111944, 102597, 93599, 84990, 76772, 69038, 61979, 55801, 50560, 46137, 42374, 39177, 36471, 34158, 32175, 30537, 29224, 28115, 27095, 26174, 25398, 24720, 24069, 23465, 22964, 22520, 22047, 21557, 21124, 20746, 20354, 19963, 19658, 19452, 19276, 19094, 18933, 18784, 18597, 18379, 18199, 18079, 17986, 17919, 17900, 17874, 17740, 17511, 17310, 17198, 17105, 16974, 16856, 16800, 16770, 16707, 16606, 16477, 16320, 16159, 16046, 15971, 15864, 15708, 15570, 15482, 15399, 15296, 15223, 15194, 15120, 14942, 14740]
908A4740j24o3q1j01p0m8p3q7m8j4m3q8q8o0p1j04j01m8J5M9L9lm9n9k4K9N3J8o6j40j30k9
904A3131O9P5kp4p9m5j6j4k5k3nKl3q8r9m9pj5l1qL0K9j2m4n2l7RO1N1l1r7o2Mj6r1r8j3L6
900A2331rn4j0O7O8j3p3n4J0N2L3j6m0j3K5L2Jk0k0qqj9l4l3rJ5Kl7m1MJ9m0j07r8l4%KK5
895A1896N3K9l2n2j8QNJ4L0ko6p9k1K0om1j3M3N6L6M2J02J64J65Q4k1o3pQ1J12Q2O0Q6J41
891A2888J94K32K33J87J40J45J81J82J37J17J16O0r5k61l41l37l27l62m32m98n24m86m08l29
888A0412k68k08j64j54j61j31m7M1P3M4jk2JL8L6nj6L9R7O8j3m5k2k0n2m7RN0K6l%Rpj9j0
884I528NJ8N8R9O8k1n8jO1M2j7k3QMl9n3j4M2P2P5N6L0Qqk8m1l0jJ0j6m4o5o8m5jJ0m2r6p3
879I410kJ9r%O2P5J1l8j0L1K3J3M1O2N0N8J16J37O3j5MO8N9j3m2kL9M1L3M8P3R5J18J37J67
$$ y = [14740, 14616, 14553, 14472, 14371, 14301, 14253, 14180, 14093, 14045, 14031, 13988, 13900, 13812, 13752, 13681, 13577, 13476, 13428, 13443, 13492, 13531, 13528, 13479, 13420, 13396, 13425, 13478, 13496, 13430, 13290, 13160, 13131, 13200, 13275, 13273, 13199, 13120, 13075, 13059, 13045, 13020, 12997, 12992, 12994, 12961, 12873, 12774, 12725, 12718, 12703, 12672, 12664, 12694, 12723, 12711, 12667, 12615, 12578, 12587, 12648, 12699, 12668, 12571, 12509, 12513, 12497, 12406, 12308, 12295, 12331, 12322, 12268, 12258, 12325, 12393, 12380, 12307, 12253, 12263, 12315, 12348, 12332, 12292, 12279, 12304, 12336, 12337, 12317, 12297, 12289, 12281, 12262, 12228, 12195, 12186, 12201, 12203, 12166, 12125, 12129, 12148, 12108, 12001, 11903, 11869, 11869, 11871, 11896, 11949, 11978, 11946, 11894, 11876, 11884, 11889, 11903, 11933, 11931, 11865, 11786, 11765, 11785, 11779, 11738, 11725, 11768, 11824, 11860, 11902, 12004, 12168, 12333, 12417, 12396, 12333, 12326, 12407, 12519, 12601, 12661, 12747, 12888, 13082, 13314, 13547, 13734, 13874, 14019, 14200, 14382, 14519, 14636, 14752, 14812, 14717, 14456, 14115, 13778, 13451, 13089, 12657, 12159, 11635, 11149, 10741, 10412, 10144, 9936, 9772, 9618, 9457, 9326, 9279, 9320, 9393, 9437, 9436, 9414, 9415, 9453, 9489, 9484, 9468, 9507, 9604, 9672, 9659, 9614, 9592, 9572, 9520, 9473, 9482, 9532, 9558, 9555, 9555, 9564, 9557, 9538, 9528, 9533, 9551, 9609, 9708, 9776, 9755, 9697, 9696, 9757, 9799, 9782, 9759, 9767, 9771, 9732, 9679, 9665, 9707, 9779, 9854, 9910, 9940, 9948, 9940, 9912, 9871, 9841, 9840, 9850, 9834, 9790, 9725, 9657, 9612, 9611, 9621, 9579, 9483, 9410, 9408, 9427, 9418, 9418, 9480, 9555, 9566, 9528, 9518, 9549, 9572, 9585, 9626, 9688, 9738, 9796, 9912, 10049, 10112, 10097, 10101, 10169, 10228, 10215, 10173, 10171, 10210, 10251, 10284, 10332, 10405, 10500, 10618, 10755, 10922]
875A0922K32L15L69M10N07O60P53P21O70P02P55P03N31L36J68K7p5j46k47m23n94o61o57o77
872A5301p13o83n78m67l97l41k81k36k00j59j23j07r0p8j07j68j67o2M2M7Koj2q0j30n3P7
868A0231Q9j3n8J6R3R6R4J32J37O5k1n1n3n4l7j3l3p4o4mLp3j28q7j9moJ5J9k8o2l2Ok1p6
864I985p6l1mj5l7n7p3n2K2R1R9P0O7P0L5l1o1l1L2Q2Q2J1p8j01k9N6P0K7kj5n6j09j11m6
860I784Kk3p9q7n7n9r6q6K5J43J45L8m1k0J7k0q9q9j9L3K2j0k5k4j4pk4n8n6qL2K6J8N7J02
856I453P6K5L1Q4Q7L5lKQJ8P5J37J05j6j02q3k8kjpl8p4n2J5L9nl5j6%j8j5K0K4k2n3l9l3
851I592m8k3L5K7m5n5N3J29O9l5n1qjrK8N3rr6r2k1J1nqKj8l4J7Q5P5%l9k1j5l5k9RK9J0J
846I528K0L6K7j0n2p5l2N0P3No3n1j9k8l3L4J09Q1j7o4n0m5l7L3J20J03Jn9l3oj3JL0j0j04
$$ y = [10922, 11154, 11469, 11838, 12248, 12755, 13415, 14168, 14889, 15559, 16261, 17016, 17719, 18250, 18586, 18754, 18781, 18706, 18560, 18313, 17890, 17296, 16635, 15978, 15301, 14588, 13905, 13327, 12860, 12463, 12122, 11841, 11605, 11405, 11246, 11123, 11016, 10926, 10848, 10741, 10573, 10406, 10344, 10386, 10433, 10435, 10429, 10417, 10337, 10207, 10154, 10231, 10320, 10307, 10249, 10265, 10358, 10454, 10548, 10680, 10817, 10882, 10861, 10810, 10757, 10703, 10666, 10653, 10620, 10546, 10482, 10478, 10481, 10408, 10280, 10193, 10174, 10170, 10164, 10179, 10198, 10170, 10108, 10076, 10082, 10061, 9985, 9909, 9878, 9874, 9859, 9822, 9765, 9692, 9640, 9662, 9753, 9852, 9922, 9989, 10059, 10094, 10063, 10002, 9971, 10003, 10085, 10167, 10178, 10100, 9999, 9970, 10026, 10096, 10123, 10121, 10106, 10050, 9941, 9830, 9784, 9786, 9763, 9684, 9597, 9540, 9481, 9385, 9299, 9324, 9467, 9612, 9650, 9609, 9589, 9606, 9586, 9497, 9408, 9389, 9422, 9444, 9434, 9409, 9385, 9371, 9364, 9340, 9282, 9226, 9218, 9250, 9276, 9294, 9351, 9453, 9529, 9554, 9585, 9669, 9756, 9791, 9788, 9790, 9798, 9816, 9891, 10028, 10133, 10117, 10015, 9932, 9904, 9902, 9901, 9894, 9856, 9782, 9730, 9745, 9784, 9779, 9744, 9728, 9728, 9710, 9695, 9715, 9739, 9717, 9664, 9625, 9592, 9544, 9521, 9556, 9583, 9538, 9483, 9536, 9665, 9734, 9699, 9648, 9640, 9639, 9630, 9658, 9711, 9702, 9606, 9514, 9493, 9504, 9499, 9491, 9493, 9475, 9441, 9458, 9543, 9618, 9618, 9579, 9558, 9543, 9508, 9479, 9488, 9517, 9527, 9528, 9548, 9584, 9611, 9601, 9549, 9474, 9442, 9492, 9565, 9570, 9507, 9456, 9437, 9409, 9376, 9410, 9519, 9600, 9583, 9519, 9469, 9424, 9387, 9420, 9540, 9643, 9644, 9585, 9552, 9546, 9533, 9534, 9564, 9554, 9450]
842I450j18j8O3L3j1L4J09J00L2QM3O2L4MJ1M7P8Q6O2K3%oj8m5n8m7l6l6k3K3P7Q8M7j0l6
838A0052j8jj6l5rL1J6n1n9L6J22R2j1p5q2p6m3M2J06N2n1n5L5N8m2j20o3M6P9N8N5O6M0m
834A0175j0Qj0n5p5m0K4O8N7ro7m0N6J12N3n7r9m8L2O4L6k0n6n3j6L7Q8J08O6rm0NN9M5j4
829A0375l6j6jj0nJ1%k3pL8M4J8K6P2P9J3m9m7k5l4n0l7j7j5j5J0M9P2O7K9l6p3m2K4M3J7
825A0449K7P8Q1Ko6n1J6N9P6Q3N6pm3qL8K0m8r0q7n8j6L3O8O1J4l9o1k3M1O9M3L9Q6R3j6j32
821A0787r1N6J07J4n6kO3M1kJ1J8l9p3pO7L2m0l2K9K7k4l1J3L4L2O7J15J02L3qj3l8o8n0J2
816A1086L7Kl2k9j4OM5P6O1K3K1M3M5J4rk3m7p2n5pK6L8M8N6M3J6QJ1MjRJ3JjJ2nm5l5L7Q0
811A1486L4oN1J23R4J5J0N7L0n5o3L9J10O4j6m2l8m9n6k2J3Mm2p6o6qO4Q9L8l2m1ON3O8O1
$$ y = [9450, 9332, 9314, 9377, 9410, 9399, 9433, 9542, 9642, 9674, 9682, 9725, 9787, 9821, 9825, 9836, 9883, 9961, 10047, 10109, 10132, 10132, 10126, 10108, 10063, 10005, 9958, 9922, 9886, 9863, 9886, 9963, 10051, 10098, 10088, 10052, 10034, 10033, 10017, 9982, 9973, 10004, 10020, 9969, 9910, 9946, 10068, 10160, 10149, 10074, 9992, 9916, 9873, 9915, 10021, 10073, 10022, 9967, 10002, 10060, 10018, 9898, 9835, 9881, 9960, 10018, 10073, 10139, 10179, 10175, 10165, 10173, 10163, 10108, 10033, 9993, 10017, 10085, 10142, 10133, 10066, 10026, 10082, 10194, 10247, 10190, 10091, 10043, 10075, 10139, 10175, 10155, 10099, 10046, 10030, 10067, 10155, 10263, 10329, 10320, 10280, 10285, 10344, 10389, 10375, 10339, 10323, 10322, 10312, 10307, 10318, 10318, 10295, 10288, 10326, 10370, 10388, 10414, 10486, 10565, 10578, 10529, 10482, 10457, 10423, 10373, 10336, 10319, 10304, 10289, 10299, 10348, 10420, 10487, 10516, 10480, 10407, 10365, 10389, 10432, 10449, 10476, 10554, 10635, 10637, 10571, 10520, 10536, 10595, 10671, 10754, 10810, 10803, 10760, 10752, 10790, 10810, 10762, 10672, 10585, 10527, 10511, 10544, 10612, 10673, 10687, 10648, 10587, 10564, 10605, 10674, 10717, 10756, 10842, 10935, 10919, 10787, 10696, 10752, 10859, 10873, 10817, 10815, 10878, 10919, 10917, 10928, 10946, 10907, 10834, 10827, 10894, 10926, 10886, 10854, 10883, 10910, 10886, 10855, 10868, 10902, 10934, 11001, 11116, 11218, 11251, 11243, 11230, 11192, 11124, 11074, 11086, 11123, 11125, 11093, 11064, 11050, 11056, 11101, 11177, 11238, 11261, 11282, 11325, 11370, 11384, 11375, 11352, 11305, 11233, 11178, 11171, 11197, 11235, 11283, 11339, 11382, 11398, 11406, 11417, 11421, 11420, 11429, 11442, 11443, 11442, 11454, 11449, 11404, 11369, 11406, 11486, 11520, 11514, 11565, 11688, 11782, 11797, 11807, 11864, 11894, 11839, 11776, 11815, 11925, 11989, 11973, 11931, 11893, 11844, 11788, 11766, 11779, 11783, 11741, 11665, 11599, 11591, 11655, 11744, 11782, 11750, 11709, 11715, 11768, 11836, 11897]
807A1897L6qj6M6J09R4J8l2l7m1l6lK3om0%Q0P4k3p9l1M0N3L6L9N3L9J6PJ0Jk5n8p1j8Q7J30
803A2364P1NL6J01O5n2j03n0nk9n0j0L8N4O1P1M2j4j9M1Q5N5Oj2j0nK4O4O3J6j1nqk1qJ4m
798A2860l5kO1M1m8p3QP2L4k0j6P%J5P7J09N6j9m3m7n8k0Q8J64J23K7k0j3JK8P0R2O4K9K1
794A3633J9J7N6J31J50R7O3Q5Q0Mm7j0L5jn1l7j2l1m6nJ1o2j15l2Q7P8l6r5m9J3M7P3N6m1
790A4065j41j17OQ0N8L6O3R0N9Rk0j6J8O4O4ln9k4N8J04J01R9Q9L6qL2J24J59J17O6L3QOO0
785A5316J15R7L3RRl2j02j21p1k7pPNl6o6j3N7L8m0o4j5Ml0l2RJ7k5l4J1L0J6M3J03P8l8r0
781A5154lQ7N0m5m0M8R9P6M1L3J9JMK4L2K4K4K5J4J2N2J14J48J27P8L6J5J1%k2m2n3q0j26
777A5937j43r0j4J0k0l2QM8K8l2o3k9M1Q7O7Qk2jRl1p2n0J4M4M0L9M1K5K6P6J12M5p6j16l7
$$ y = [11897, 11933, 11925, 11909, 11955, 12064, 12158, 12176, 12144, 12107, 12066, 12030, 12027, 12050, 12044, 12004, 12004, 12084, 12158, 12135, 12056, 12025, 12065, 12118, 12154, 12193, 12246, 12285, 12301, 12308, 12318, 12319, 12294, 12236, 12165, 12147, 12234, 12364, 12435, 12440, 12476, 12577, 12642, 12590, 12487, 12437, 12432, 12403, 12353, 12343, 12381, 12435, 12496, 12567, 12609, 12595, 12576, 12617, 12702, 12757, 12763, 12751, 12741, 12736, 12760, 12824, 12887, 12903, 12892, 12887, 12879, 12858, 12850, 12864, 12860, 12825, 12823, 12884, 12925, 12877, 12804, 12812, 12884, 12918, 12898, 12882, 12889, 12889, 12904, 12981, 13090, 13146, 13127, 13084, 13037, 12979, 12959, 13047, 13211, 13334, 13361, 13341, 13328, 13329, 13357, 13427, 13519, 13583, 13612, 13633, 13652, 13669, 13725, 13856, 14006, 14103, 14166, 14251, 14331, 14335, 14288, 14278, 14313, 14312, 14261, 14224, 14212, 14181, 14135, 14130, 14141, 14079, 13964, 13932, 14019, 14097, 14061, 13966, 13917, 13930, 13977, 14050, 14106, 14065, 13924, 13807, 13813, 13893, 13951, 13987, 14050, 14140, 14199, 14208, 14188, 14172, 14190, 14254, 14318, 14315, 14256, 14232, 14290, 14394, 14495, 14594, 14683, 14719, 14711, 14743, 14867, 15026, 15143, 15209, 15242, 15250, 15256, 15316, 15431, 15528, 15561, 15570, 15579, 15547, 15445, 15324, 15253, 15226, 15219, 15226, 15231, 15195, 15129, 15116, 15173, 15211, 15171, 15107, 15092, 15096, 15066, 15034, 15043, 15060, 15035, 15001, 15012, 15042, 15058, 15101, 15204, 15282, 15244, 15154, 15151, 15238, 15288, 15243, 15203, 15251, 15350, 15426, 15467, 15500, 15519, 15520, 15524, 15548, 15580, 15604, 15628, 15653, 15667, 15679, 15731, 15845, 15993, 16120, 16198, 16234, 16249, 16260, 16260, 16238, 16196, 16143, 16063, 15937, 15794, 15704, 15690, 15700, 15680, 15648, 15656, 15704, 15732, 15700, 15637, 15608, 15649, 15736, 15803, 15811, 15789, 15788, 15797, 15766, 15694, 15644, 15658, 15702, 15742, 15781, 15822, 15847, 15873, 15949, 16061, 16106, 16030, 15914, 15877]
773A5877O5R8P9O1N0M2L0qo8q7k3O4Q2L9J4K9L1J8L1N3K2l9n4k7l6p5o6qNl0k3M3O2lm7jO0
768A6260N3J8L3O4N7K2MQJ8K2J9oj3L5R1N9k9m0N4J23Q4L2O8J31J18L8k3k5kK7N1M6K3K0L5
764A7475L3J1LNk0n4l4K1L5N%J8j5q1p3J9Q1O8O5R0N0m1l3J04J76P5l2J5J02P2lL5J26Q8m1
760A8345o7M8J42J14L8jLL1P7Q7L1k9nP2J10J03J10J17O1k8n6k6KLJ7L5J4k4j8J5J3j8j5L9
755A9340R0J12J22J14O5J4OL9O0N7M0Pl2k0N8J13P3MjM1N9N6P3Q2L1l4l9ML3O1J01J10M4q
751B0875M0J19J11L4J7P0R7P3N0L6km2k0L0L1LK5Q2Q4M2M7R6J11O9M4L9Rk2J4Q4R4N1N5R9
747B2545R9M0J5K6po5l3Q9J55J09O4J01J44J18O8N2M7N0Q9J40J11Jo0j1O1P9R9J69K15J58
743B4668N8J9N6J00J16J10J01J11J50J89J79J40J25J33J21J10J52K12K20K00K32K94K91K30
$$ y = [15877, 15942, 16040, 16119, 16180, 16230, 16272, 16302, 16294, 16226, 16139, 16116, 16180, 16262, 16301, 16315, 16344, 16375, 16393, 16424, 16477, 16499, 16460, 16406, 16379, 16343, 16268, 16202, 16194, 16199, 16169, 16146, 16189, 16251, 16248, 16201, 16200, 16260, 16313, 16331, 16364, 16428, 16485, 16507, 16511, 16519, 16537, 16559, 16578, 16572, 16559, 16594, 16685, 16744, 16715, 16675, 16729, 16852, 16936, 16968, 17036, 17167, 17285, 17323, 17300, 17275, 17273, 17300, 17351, 17397, 17420, 17440, 17475, 17508, 17519, 17522, 17527, 17507, 17453, 17419, 17440, 17475, 17480, 17480, 17498, 17483, 17402, 17329, 17348, 17429, 17497, 17562, 17652, 17702, 17661, 17628, 17732, 17908, 17983, 17951, 17966, 18068, 18140, 18137, 18172, 18298, 18386, 18345, 18278, 18326, 18468, 18582, 18620, 18619, 18622, 18653, 18730, 18817, 18848, 18819, 18814, 18886, 18996, 19099, 19209, 19326, 19387, 19359, 19303, 19277, 19279, 19282, 19299, 19334, 19348, 19324, 19306, 19321, 19334, 19316, 19301, 19340, 19430, 19542, 19664, 19778, 19843, 19857, 19863, 19902, 19962, 20019, 20059, 20066, 20034, 20014, 20072, 20185, 20258, 20262, 20261, 20302, 20361, 20417, 20490, 20572, 20603, 20569, 20530, 20534, 20567, 20628, 20729, 20839, 20883, 20875, 20915, 21034, 21145, 21179, 21196, 21266, 21363, 21436, 21486, 21522, 21520, 21478, 21458, 21488, 21519, 21522, 21547, 21629, 21713, 21755, 21802, 21898, 22009, 22078, 22122, 22161, 22170, 22148, 22162, 22246, 22340, 22391, 22446, 22545, 22644, 22684, 22699, 22725, 22718, 22653, 22620, 22709, 22864, 22973, 23037, 23138, 23282, 23400, 23468, 23520, 23567, 23617, 23706, 23846, 23957, 23958, 23898, 23887, 23948, 24027, 24126, 24295, 24510, 24668, 24726, 24745, 24801, 24901, 25017, 25127, 25228, 25339, 25489, 25678, 25857, 25997, 26122, 26255, 26376, 26486, 26638, 26850, 27070, 27270, 27502, 27796, 28087, 28317]
740B8317K30L12L62L39L37M26N31N86O31P02P76Q52R67J109J202J267J422J698J993K267K615
738D8941L087L603M061M412M542M299L690K882J975R57o7q32j235j503j857k234k464k545
736F9712k561k497k306k052j842j634j372j110r21p52n29l04j66p7N0K00L26M61O55Q64J034
733E5179J226J485J732J885K045K340K713L008L206L396L596L768L947M216M575M976N429
731A08722N951O462O878P249P656Q039Q285Q368Q297P965P212O029M551K879J067p24k283
729B02603l502m420n109n617o022o340o490o405o175n911n590n138m614m169l826l494l145
727A16636k841k586k304j989j704j451j171q38m82p9M06R11J334J705K155K710L230L625L930
725A21197M237M583M994N494O089O766P531Q382R250J0054J0752J1318J1705J1883J1860J1566
$$ y = [28317, 28547, 28859, 29221, 29560, 29897, 30323, 30854, 31440, 32071, 32773, 33549, 34401, 35368, 36477, 37679, 38946, 40368, 42066, 44059, 46326, 48941, 52028, 55631, 59692, 64104, 68646, 72945, 76635, 79517, 81492, 82449, 82382, 81550, 80315, 78812, 76955, 74721, 72257, 69712, 67151, 64654, 62348, 60296, 58454, 56820, 55448, 54338, 53417, 52665, 52136, 51832, 51666, 51589, 51639, 51839, 52165, 52626, 53281, 54145, 55179, 56405, 57890, 59622, 61507, 63552, 65892, 68605, 71613, 74819, 78215, 81811, 85579, 89526, 93742, 98317, 103293, 108722, 114673, 121135, 128013, 135262, 142918, 150957, 159242, 167610, 175907, 183872, 191084, 197113, 201664, 204543, 205610, 204886, 202603, 199101, 194681, 189572, 183955, 177933, 171593, 165103, 158698, 152523, 146612, 141022, 135884, 131270, 127101, 123275, 119781, 116636, 113795, 111209, 108905, 106916, 105212, 103761, 102590, 101752, 101270, 101191, 101597, 102508, 103842, 105547, 107702, 110412, 113642, 117267, 121197, 125434, 130017, 135011, 140505, 146594, 153360, 160891, 169273, 178523, 188577, 199329, 210647, 222352, 234235, 246095, 257661]
723B57661J0831R568P935O122M133J880n45k903n042o911q410r418r979j0259j0332j0166
721B24165r814r425r051q601q036p452o920o412n910n472n131m837m542m247l956l653l363
719A17343l107k847k524k145j752j334q77m36m9L37P56J116J366J659K170K833L446M014M689
716A24658N503O330P150Q068R033R774J0065R896R334Q458P441O502N648M655L326J604n30
714B36915l031n574p634q907r521r764r795r688r521r311q969q467p882p251o514n718n055
712A04313m624m311l986l678l431l200k975k822k730k567k294k060j958j872j687j456j286
710E7376j141r62p83o37m44j78M5J62K89N41Q43J075J301J653K104K548L000L565M228M862
708G9447N354N590N387M587L203J461l18j820k869l540m042m479m771m875m891m871m702m279
$$ y = [257661, 268492, 278060, 285995, 292117, 296250, 298130, 297585, 294682, 289640, 282729, 274319, 264901, 254922, 244663, 234331, 224165, 214351, 204926, 195875, 187274, 179238, 171786, 164866, 158454, 152544, 147072, 141941, 137104, 132562, 128315, 124359, 120706, 117343, 114236, 111389, 108865, 106720, 104968, 103634, 102757, 102321, 102272, 102609, 103365, 104481, 105847, 107506, 109676, 112509, 115955, 119969, 124658, 130161, 136491, 143641, 151709, 160742, 170516, 180581, 190477, 199811, 208269, 215710, 222212, 227860, 232515, 235841, 237445, 236915, 233884, 228310, 220676, 211769, 202248, 192484, 182689, 173001, 163480, 154169, 145200, 136733, 128851, 121600, 115086, 109368, 104313, 99689, 95378, 91392, 87714, 84283, 81083, 78108, 75286, 72556, 69989, 67695, 65635, 63677, 61805, 60118, 58662, 57376, 56235, 55273, 54490, 53853, 53409, 53231, 53276, 53438, 53727, 54268, 55111, 56186, 57487, 59140, 61244, 63792, 66792, 70357, 74585, 79447, 84801, 90391, 95778, 100365, 103568, 105029, 104711, 102891, 100022, 96482, 92440, 87961, 83190, 78315, 73424, 68553, 63851, 59572]
705E9572l722l205k761k331j923j581j296j069r55r56r47q49p36o83o26n10m30m63n11m47
703C3571l32k93l11k76j99j65j87k16k50k85k48j23m7j11k15k08j43j36j68j49j16j47j78
700B9068j09j8m4j32j27k9J2k5l8j2m0j20j37n8J4J6j0m3r6j33r3k8l3p4n2J6K1l4m4J6N0
696B7684J8j2j1k7o7p6n3n2p4n0J2L8Rr%j6n3o0k7j2l7o2o0l5J6P5P1k2j09r8m3l6m4kM8K4
692B6848k8JO8N6k4n1j0Pj3LL9J6l8j5N7N5k8n0K6O6Pm3nM7L3j1j2J9K1j1m6n0j2M0L2l2n7
687B6905JM3j1o9k2N8N4J2M9J13Q2oj3K9rr4o3O7J07L3PP2P3l9j01k9N5N5L5N5M5k8q8j01
683B7277j11j21n7M8P1J5J0O6O0k6n4J0N0L5N9J10O7n0n8N4P4m5r7QP6ln7L6J16M1l9J4Q3
679B7662K5m1J7Q3J1p4LJ32J05j5k5P8J15N2MRK1O0J44J77P5m0MJ42J68O9qlQJ3P0J47J39
$$ y = [59572, 55850, 52645, 49884, 47553, 45630, 44049, 42753, 41684, 40729, 39773, 38826, 37977, 37241, 36558, 35932, 35422, 34992, 34529, 34018, 33571, 33239, 32946, 32635, 32359, 32160, 31995, 31808, 31592, 31342, 31057, 30809, 30686, 30639, 30528, 30313, 30105, 29962, 29826, 29658, 29509, 29393, 29246, 29068, 28959, 28941, 28897, 28765, 28638, 28609, 28621, 28596, 28558, 28546, 28506, 28386, 28249, 28191, 28205, 28221, 28211, 28168, 28072, 27939, 27846, 27818, 27785, 27711, 27659, 27675, 27696, 27662, 27618, 27634, 27684, 27702, 27690, 27679, 27652, 27585, 27509, 27456, 27404, 27330, 27280, 27292, 27330, 27339, 27330, 27330, 27314, 27261, 27201, 27174, 27162, 27125, 27063, 27003, 26968, 26984, 27059, 27130, 27108, 26999, 26901, 26858, 26822, 26778, 26776, 26824, 26848, 26820, 26821, 26889, 26945, 26921, 26870, 26860, 26867, 26854, 26857, 26896, 26912, 26874, 26859, 26916, 26971, 26943, 26893, 26919, 26985, 26992, 26949, 26944, 26991, 27024, 27013, 27001, 27020, 27041, 27030, 26984, 26934, 26922, 26962, 26994, 26962, 26905, 26906, 26949, 26938, 26869, 26847, 26905, 26959, 26971, 27020, 27133, 27215, 27209, 27196, 27225, 27216, 27122, 27059, 27126, 27233, 27266, 27273, 27345, 27418, 27379, 27278, 27249, 27304, 27359, 27394, 27449, 27494, 27466, 27378, 27277, 27166, 27045, 26988, 27036, 27107, 27122, 27132, 27198, 27258, 27232, 27178, 27188, 27238, 27273, 27332, 27442, 27509, 27459, 27401, 27455, 27529, 27484, 27387, 27395, 27471, 27468, 27411, 27447, 27563, 27604, 27565, 27579, 27662, 27687, 27646, 27663, 27746, 27757, 27683, 27686, 27818, 27923, 27908, 27883, 27961, 28076, 28128, 28132, 28141, 28162, 28222, 28366, 28543, 28618, 28578, 28582, 28724, 28892, 28961, 28953, 28950, 28958, 28971, 29041, 29188, 29327]
675B9327M8nK6P3R5R8O7j7r8q7j6K2%l8n4l9J9R7J12L7l0j5M3O0M9N0L5mj7L0O4M3MkLJ5P0
671C0065J19M9r1j08M2J45O3l2L7J57J36K5KP6J25J20J03O4KJ0J18J89J36Q4J32J63M8o8j7
667C1894J01Q8j6k8L6M0j4qL3J6j0N6J35R1j0%P6O6pj0K8j5q4k7R3R4nl3J8J1m5j3P9P3qK
663C2697J00J06Ok5N2Q2K2RQ6J21O0J0M1Q3J02J27J29P0L2J24K40K00N8K3R5R9J0j7L8M9L
659C4832L1J07P5m2m7O7J14M4K6R6J06K0qO1P0j8n3MJ5n4o2J8L7l2k7O7Q7jk8M2N5oJ8J25
655C5739J07n5r6N7J58P9J6J03J78J15M4O3O2j4j1J00J26Om8O2J22J9m3N3J05qo8P9K14J16
651C7380m5l8N4N4L3J04J56P1qN4J11J6p8MJ31R6rj9Rn0j05l8M8K2j3N7J29Q3K7O7R1J4j6
647C8392Q4J36K8l7Q1J73O5m5N5J90J48N8R7J22j6j01O1K37J46k6K5J54R6k5P0K29J56j8L4
$$ y = [29327, 29375, 29370, 29396, 29469, 29564, 29662, 29729, 29712, 29614, 29527, 29511, 29533, 29533, 29495, 29441, 29402, 29421, 29518, 29630, 29667, 29637, 29622, 29665, 29725, 29774, 29824, 29859, 29855, 29838, 29868, 29932, 29975, 29979, 29977, 29980, 29995, 30065, 30184, 30233, 30142, 30034, 30076, 30221, 30284, 30252, 30289, 30446, 30582, 30607, 30609, 30685, 30810, 30930, 31033, 31097, 31099, 31109, 31227, 31416, 31552, 31636, 31768, 31931, 31979, 31911, 31894, 31995, 32083, 32067, 32039, 32075, 32115, 32101, 32093, 32126, 32142, 32132, 32188, 32323, 32414, 32404, 32404, 32480, 32546, 32539, 32529, 32557, 32542, 32458, 32431, 32524, 32618, 32613, 32580, 32598, 32609, 32564, 32551, 32630, 32703, 32695, 32697, 32797, 32903, 32909, 32884, 32936, 33018, 33040, 33049, 33135, 33256, 33316, 33326, 33367, 33450, 33552, 33679, 33808, 33878, 33910, 34034, 34274, 34474, 34532, 34555, 34650, 34749, 34759, 34742, 34780, 34829, 34832, 34863, 34970, 35045, 35003, 34956, 35023, 35137, 35181, 35207, 35303, 35409, 35429, 35421, 35482, 35552, 35534, 35481, 35485, 35500, 35446, 35384, 35402, 35439, 35407, 35380, 35447, 35534, 35533, 35505, 35547, 35602, 35596, 35614, 35739, 35846, 35791, 35695, 35752, 35910, 35989, 36005, 36108, 36286, 36401, 36445, 36508, 36570, 36556, 36545, 36645, 36771, 36777, 36729, 36791, 36913, 36932, 36889, 36942, 37047, 37039, 36971, 37050, 37264, 37380, 37335, 37297, 37351, 37405, 37438, 37542, 37698, 37769, 37761, 37815, 37926, 37942, 37864, 37868, 37999, 38095, 38086, 38067, 38076, 38026, 37921, 37883, 37931, 37953, 37940, 37997, 38126, 38209, 38236, 38303, 38394, 38408, 38392, 38476, 38612, 38640, 38603, 38684, 38857, 38922, 38877, 38932, 39122, 39270, 39328, 39425, 39547, 39531, 39430, 39491, 39728, 39874, 39848, 39873, 40027, 40123, 40098, 40168, 40397, 40553, 40535, 40569]
643D0569K15J96L8M7J85J75N2P7K04J76M2M1J23O6m4K9J74J40N0J68L32K19j3J3K01J74NO1
640D3715K66K58J10J78L66K88P1J60M57M84L02L89O80O65M02M45P81Q69P36R38J416J574J499
637E7049J883K681L176L493M471N984P084Q056J0230J3518J6719K0899K8781L8444M1175L0004
635B93647R179r002j6621j5958j3333j1732j1069j1700j4213j7382j9099j8809j7371j5178
634A11359j2128q884o561n261m224l189k573k386k109j611j277j210j085q34p48q48p90n30
631E5111m07n18n51l61k18k90l77l01k10k50l22k99k45k26j88j13r2j44j62j14j02j56j64
629D9301p0K2K3j7n0j01j48j06J6Q4L3l5l8l5r4j43r9k4j1m4l5QJ7j9k4J3M6N1N3N1K0k6l0
625D8589K2O4M8KoL0O1N4K8K2M3O6N5J7j2J4O5R2O7M8O7Q7O9L6L8N7N0L1M6R6J30J22J00P6
$$ y = [40569, 40784, 40980, 41018, 41065, 41250, 41425, 41477, 41554, 41758, 41934, 41976, 42017, 42140, 42206, 42162, 42191, 42365, 42505, 42555, 42723, 43055, 43274, 43261, 43274, 43475, 43649, 43654, 43715, 43981, 44239, 44349, 44527, 44893, 45181, 45252, 45412, 45869, 46353, 46655, 47044, 47724, 48389, 48791, 49236, 50017, 50886, 51622, 52560, 53976, 55550, 57049, 58932, 61613, 64789, 68282, 72753, 78737, 85821, 93877, 104107, 117625, 134344, 155243, 184024, 222468, 263643, 293647, 302826, 293824, 277203, 261245, 247912, 236180, 225111, 213411, 199198, 181816, 162717, 143908, 126537, 111359, 99231, 90347, 83786, 78525, 74301, 71112, 68539, 66153, 64044, 62433, 61156, 59946, 58861, 58027, 57279, 56431, 55641, 55111, 54704, 54186, 53635, 53274, 53056, 52766, 52389, 52088, 51878, 51628, 51306, 51007, 50762, 50536, 50348, 50235, 50143, 49999, 49837, 49723, 49621, 49465, 49301, 49231, 49253, 49276, 49259, 49209, 49108, 48960, 48854, 48870, 48954, 48987, 48952, 48914, 48879, 48785, 48642, 48543, 48519, 48508, 48464, 48429, 48437, 48454, 48435, 48411, 48424, 48470, 48521, 48574, 48625, 48645, 48619, 48589, 48611, 48675, 48723, 48725, 48719, 48749, 48810, 48864, 48892, 48914, 48957, 49023, 49078, 49095, 49083, 49097, 49162, 49254, 49321, 49369, 49436, 49523, 49592, 49628, 49666, 49723, 49773, 49804, 49850, 49946, 50076, 50198, 50298, 50374]
620E0374L9K4O6J34J42R3O9R8J09P4N4R2J29J15R6J06J01N0J6N9J17J11O1N6R6J22J10Q8P1
617E2872O7J07J78J96J16Ok1M7J12J22Q9N4M1N7P9Q6P6O1L0j8k5O0J68J67P9N7J45K09J72
613E5389J45K22L12K96K37K51L08L02K54K47K64K22J48J21J47J63J63J62J32N8K4J05K07K00
610F0079J05N1O6P4O0P6J18J27R6P3O7P2J07J70J90J24N5O8R6N4K0R8K10K03R0L6Q8J30J06
607F2909Q8J29J83J89J59J11P2Q9J69K18J67P7O4J21J63J82K18K33J84J37J77K52K49J91J88
604F6919K37K33J63J10J14J41K00K87L15K27J32J58K41K55K22K45K77K22J49K11L40L62K88
601G2048K82L56L68L21L57M60M65L89M24N88O74O12O09P82R78J056J110J243J380J442J508
598H7452J647J761J736J609J464J299J113R70Q80P88O86O46O46N77M49M01M45M36L27K65L21
$$ y = [50374, 50413, 50437, 50503, 50637, 50779, 50872, 50941, 51039, 51148, 51222, 51276, 51368, 51497, 51612, 51708, 51814, 51915, 51965, 51981, 52040, 52157, 52268, 52329, 52385, 52481, 52603, 52713, 52801, 52872, 52939, 53046, 53224, 53420, 53536, 53542, 53521, 53568, 53680, 53802, 53891, 53945, 53986, 54043, 54122, 54208, 54284, 54345, 54375, 54357, 54332, 54392, 54560, 54727, 54806, 54863, 55008, 55217, 55389, 55534, 55756, 56068, 56364, 56601, 56852, 57160, 57462, 57716, 57963, 58227, 58449, 58597, 58718, 58865, 59028, 59191, 59353, 59485, 59543, 59567, 59672, 59879, 60079, 60184, 60235, 60301, 60375, 60435, 60511, 60629, 60756, 60852, 60925, 60992, 61064, 61171, 61341, 61531, 61655, 61710, 61778, 61874, 61928, 61948, 62046, 62256, 62459, 62549, 62585, 62673, 62803, 62909, 62997, 63126, 63309, 63498, 63657, 63768, 63840, 63929, 64098, 64316, 64483, 64560, 64624, 64745, 64908, 65090, 65308, 65541, 65725, 65862, 66039, 66291, 66540, 66731, 66919, 67156, 67389, 67552, 67662, 67776, 67917, 68117, 68404, 68719, 68946, 69078, 69236, 69477, 69732, 69954, 70199, 70476, 70698, 70847, 71058, 71398, 71760, 72048, 72330, 72686, 73054, 73375, 73732, 74192, 74657, 75046, 75470, 76058, 76732, 77344, 77953, 78735, 79713, 80769, 81879, 83122, 84502, 85944, 87452, 89099, 90860, 92596, 94205, 95669, 96968, 98081, 99051, 99931, 100719, 101405, 102051, 102697, 103274, 103723, 104124, 104569, 105005, 105332, 105597, 105918]
596A05918L79L37K63K07J38Q6J64L19L51K57K80N16P20P21O90Q48J094J228J290J427J619
593A18852J755J880K098K359K533K632K740K842K880K915L018L117L108L016K946K913K875
591A64479K835K776K625K380K144J955J700J335R87P57N49K78N7J0N0L3%O2J73K35K82L93
588A86095N24N60N28N10M95M33L46K64J30o2j77j19qJ0nP6K27L49M72P04J028J358J682K033
586A97453K375K678L013L411L763L982M150M336M443M361M201M102M007L773L427L098K780
583B59353K411K042J753J478J122P49M54J63k22o33r57j272j686k075k230k181k129k107j993
581B52040j777j588j452j272j031q14o29m21k25j22r4p6r6j97k73k29j56k07l26l52l07l17
578B40079l59l14k04j43r7M6K31K96K44K12J95R2n0o3O4J83K83M75P50R68J097J237J367J383
$$ y = [105918, 106297, 106634, 106897, 107104, 107242, 107328, 107492, 107811, 108162, 108419, 108699, 109215, 109935, 110656, 111346, 112194, 113288, 114516, 115806, 117233, 118852, 120607, 122487, 124585, 126944, 129477, 132109, 134849, 137691, 140571, 143486, 146504, 149621, 152729, 155745, 158691, 161604, 164479, 167314, 170090, 172715, 175095, 177239, 179194, 180894, 182229, 183216, 183973, 184522, 184800, 184857, 184867, 184917, 184950, 184950, 185012, 185185, 185420, 185702, 186095, 186619, 187179, 187707, 188217, 188712, 189145, 189491, 189755, 189885, 189823, 189646, 189527, 189519, 189529, 189524, 189600, 189827, 190176, 190648, 191352, 192380, 193738, 195420, 197453, 199828, 202506, 205519, 208930, 212693, 216675, 220825, 225161, 229604, 233965, 238166, 242268, 246275, 250048, 253475, 256573, 259353, 261764, 263806, 265559, 267037, 268159, 268908, 269362, 269525, 269303, 268670, 267713, 266441, 264755, 262680, 260450, 258269, 256140, 254033, 252040, 250263, 248675, 247223, 245951, 244920, 244106, 243477, 243056, 242831, 242709, 242615, 242539, 242443, 242246, 241973, 241744, 241588, 241381, 241055, 240703, 240396, 240079, 239720, 239406, 239202, 239059, 238962, 239008, 239239, 239535, 239779, 239991, 240186, 240278, 240228, 240165, 240229, 240412, 240695, 241170, 241920, 242888, 243985, 245222, 246589, 247972]
576B47972J306J294J342J297J145J030R76Q46O04L76K06qk92n50p76j077j472j845k184k584
573B47606l023l334l466l550l659l699l628l515l392l185k904k657k456k205j896j643j456
571A97938j215q90o07m30k69m6K01M23O38Q52J042J242J493J732J885K000K147K245K191K064
569B14636J993J905J650J318J107R81P17L05n6l35o60j022j229j293j436j709j913j954j995
566B11010k135k249k258k272k364k445k463k474k454k281j971j655j331q73l38M0K32M47P66
564A82932J023J174J405J748J974J975J964K116K299K360K368K427K502K540K595K674K692
562B18768K684K778K917K907K758K704K786K777K610K496K506K417K166J990J982J882J548
560B60676J245J176J136Q83N38L22K01O0k7k0q6k95m35l56k42k75l12j92n3o4p6R1L17M20
$$ y = [247972, 249278, 250572, 251914, 253211, 254356, 255386, 256362, 257208, 257812, 258188, 258394, 258386, 258094, 257544, 256768, 255691, 254219, 252374, 250190, 247606, 244583, 241249, 237783, 234233, 230574, 226875, 223247, 219732, 216340, 213155, 210251, 207594, 205138, 202933, 201037, 199394, 197938, 196723, 195833, 195226, 194796, 194527, 194481, 194682, 195105, 195743, 196595, 197637, 198879, 200372, 202104, 203989, 205989, 208136, 210381, 212572, 214636, 216629, 218534, 220184, 221502, 222609, 223590, 224307, 224612, 224556, 224221, 223561, 222539, 221310, 220017, 218581, 216872, 214959, 213005, 211010, 208875, 206626, 204368, 202096, 199732, 197287, 194824, 192350, 189896, 187615, 185644, 183989, 182658, 181785, 181447, 181487, 181719, 182166, 182932, 183955, 185129, 186534, 188282, 190256, 192231, 194195, 196311, 198610, 200970, 203338, 205765, 208267, 210807, 213402, 216076, 218768, 221452, 224230, 227147, 230054, 232812, 235516, 238302, 241079, 243689, 246185, 248691, 251108, 253274, 255264, 257246, 259128, 260676, 261921, 263097, 264233, 265116, 265654, 265976, 266177, 266237, 266210, 266190, 266104, 265809, 265374, 265018, 264776, 264501, 264189, 263997, 263944, 263880, 263804, 263895, 264212, 264632]
557B64632N13P56J033J163J234J408J589J614J580J646J732J684J602J648J742J737J719J838
555B90870K008K082K142K321K490K429K168J876J601J317J114J057R95Q03N98N24M76L39K27
552C17437K57L07K50K27L85N74O01N67O44P50P48P46Q56R11P74O51P50Q85P69N19M22M21L00
549C30751J32J66L26L47K59K99M82O08O57P63R04R76J051J266J533J733J998K459K879K933
547C52522K697K457K232J875J521J397J385J161P72N17M40L18J55J77L75N20N88P52J038J297
545C74196J562J975K425K694K854L147L538L786L916M127M398M537M591M767M991N022M916
543D37442M940N087N126N059N084N132M954M591M314M130L804L334K916K530J990J383R74
540E02790P12L39q4k77k95m77q56j165j341j499j475j012l50l0o3K4L71O49P85J110J668K063
$$ y = [264632, 265145, 265901, 266934, 268097, 269331, 270739, 272328, 273942, 275522, 277168, 278900, 280584, 282186, 283834, 285576, 287313, 289032, 290870, 292878, 294960, 297102, 299423, 301913, 304342, 306510, 308386, 309987, 311304, 312418, 313475, 314470, 315273, 315871, 316395, 316871, 317210, 317437, 317694, 318001, 318251, 318478, 318863, 319437, 320038, 320605, 321249, 321999, 322747, 323493, 324349, 325260, 326034, 326685, 327435, 328320, 329089, 329608, 330030, 330451, 330751, 330883, 331049, 331375, 331722, 331981, 332280, 332762, 333370, 334027, 334790, 335694, 336670, 337721, 338987, 340520, 342253, 344251, 346710, 349589, 352522, 355219, 357676, 359908, 361783, 363304, 364701, 366086, 367247, 368019, 368536, 368976, 369294, 369449, 369626, 370001, 370521, 371109, 371861, 372899, 374196, 375758, 377733, 380158, 382852, 385706, 388853, 392391, 396177, 400093, 404220, 408618, 413155, 417746, 422513, 427504, 432526, 437442, 442382, 447469, 452595, 457654, 462738, 467870, 472824, 477415, 481729, 485859, 489663, 492997, 495913, 498443, 500433, 501816, 502790, 503502, 503841, 503757, 503480, 503185, 502708, 501852, 500687, 499346, 497847, 496372, 495360, 495010, 494980, 494917, 494941, 495312, 495961, 496746, 497856, 499524, 501587]
538E01587K159K298K632K882K923L023L307L506L523L645L985M270M359M472M704M822M774
536E62871M856N160N398N441N533N758N829N632N421N303N025M521M080L810L423K810K289
534F43160K014J734J323J058J081J107R65Q74R69J074J189J637K450L149L464L704M119M498
531F79569M698M995N557O074O298O457O770P050P164P330P697Q024Q164Q339Q641Q792Q662
529H00281Q555Q617Q565Q280Q167Q482Q911R146R384R834J0293J0572J0878J1334J1671J1733
527I54703J1791J1984J2022J1761J1525J1496J1355J0930J0567J0477J0323R882R520R498
526A107834R485R213R029R241R540R619R746J0194J0671J0885J1114J1666J2306J2784J3359
524A266686J4280J5248J6001J6803J7864J8817J9352J9747K0279K0687K0844K1252K2263K3486
$$ y = [501587, 503746, 506044, 508676, 511558, 514481, 517504, 520811, 524317, 527840, 531485, 535470, 539740, 544099, 548571, 553275, 558097, 562871, 567727, 572887, 578285, 583726, 589259, 595017, 600846, 606478, 611899, 617202, 622227, 626748, 630828, 634638, 638061, 640871, 643160, 645174, 646908, 648231, 649289, 650370, 651477, 652442, 653316, 654285, 655359, 656548, 658185, 660635, 663784, 667248, 670952, 675071, 679569, 684267, 689262, 694819, 700893, 707191, 713648, 720418, 727468, 734632, 741962, 749659, 757683, 765847, 774186, 782827, 791619, 800281, 808836, 817453, 826018, 834298, 842465, 850947, 859858, 869004, 878388, 888222, 898515, 909087, 919965, 931299, 942970, 954703, 966494, 978478, 990500, 1002261, 1013786, 1025282, 1036637, 1047567, 1058134, 1068611, 1078934, 1088816, 1098336, 1107834, 1117319, 1126532, 1135561, 1144802, 1154342, 1163961, 1173707, 1183901, 1194572, 1205457, 1216571, 1228237, 1240543, 1253327, 1266686, 1280966, 1296214, 1312215, 1329018, 1346882, 1365699, 1385051, 1404798, 1425077, 1445764, 1466608, 1487860, 1510123, 1533609]
522A533609K4566K5914K7945L0289L2508L4935L8052M1625M5226M9074N3565N8535O3716O9409
520B128968P5985Q3253R0999R9652J09655J20822J32931J46394J61588J78175J95829K14972
519C739223K36073K58924K83253L09447L37767L67552L97672M26762M51943M67559M65385
518G741560M35559L68709K61630J23930k2395j53700k56739l31386l84549m23701m54111m77711
516F427096m92920m96746m87717m66423m34446l94435l50682l07704k68069k32569k01788
515B293597j76020j54357j35546j19405j06125r4871q4605p5567o8307o2065n5807n0029m5646
513A065247m2030l8080l4284l1607k9367k6447k3550k1730j9925j6812j3572j1254p079J636
511G51146J0417J0428k39j3057j9232j8989j8157j9630k2080k4213k5955k6592k5127k2183
$$ y = [1533609, 1558175, 1584089, 1612034, 1642323, 1674831, 1709766, 1747818, 1789443, 1834669, 1883743, 1937308, 1995843, 2059559, 2128968, 2204953, 2288206, 2379205, 2478857, 2588512, 2709334, 2842265, 2988659, 3150247, 3328422, 3524251, 3739223, 3975296, 4234220, 4517473, 4826920, 5164687, 5532239, 5929911, 6356673, 6808616, 7276175, 7741560, 8177119, 8545828, 8807458, 8931388, 8908993, 8755293, 8498554, 8167168, 7782619, 7358918, 6904807, 6427096, 5934176, 5437430, 4949713, 4483290, 4048844, 3654409, 3303727, 2996023, 2727954, 2495385, 2293597, 2117577, 1963220, 1827674, 1708269, 1602144, 1507273, 1422668, 1347101, 1278794, 1216729, 1160922, 1110893, 1065247, 1023217, 985137, 950853, 919246, 889879, 863432, 839882, 818152, 798227, 781415, 767843, 756589, 749510, 751146, 761563, 771991, 771752, 758695, 739463, 720474, 702317, 682687, 660607, 636394, 610439, 583847, 558720, 536537]
510E36537j9338j7061j4932j3056j1741j0610r353q476q208p764o723n950o084o400o176n870
508C78795n911n748n083m656m823m792m174l749l854l660k866k392k534k316j467j015j132
506C18623o45N59J154J203K371M548N861P363J2935K1718K5377J7665L513o473q503p558q477
504C91234j0876j2892j4652j6393j6864j5325j2841j0564q591o996o156n709m876l856l390
502B41253l191k474j640j663k251k365k093k223k498k164j649j843k311k084j533j589j866
500B05816j466q52r64j288q47j99l73q11m39J64q7n65j15N85L22k18K55J036P46R2N21J326
497B02639R54J02M75J564J637R37Q35R66K69l38M60J465R34MO88K062K173J998L470N343N418
494B34055M986O458Q535Q739Q663J1171J4585J5665J6101J9518K4468K7678L1572M0229N0845
$$ y = [536537, 517199, 500138, 485206, 472150, 460409, 449799, 440446, 431970, 423762, 415998, 409275, 403325, 397241, 390841, 384665, 378795, 372884, 367136, 362053, 357397, 352574, 347782, 343608, 339859, 336005, 332345, 329479, 327087, 324553, 322237, 320770, 319755, 318623, 317978, 318537, 319691, 320894, 323265, 327813, 333674, 341037, 353972, 375690, 401067, 418732, 422245, 415772, 407269, 399711, 391234, 380358, 367466, 352814, 336421, 319557, 304232, 291391, 280827, 272236, 265240, 259084, 253375, 248499, 244643, 241253, 238062, 235588, 233948, 232285, 230034, 227669, 225576, 223353, 220855, 218691, 217042, 215199, 212888, 210804, 209271, 207682, 205816, 204350, 203498, 202534, 201246, 200399, 200200, 199827, 199016, 198577, 198741, 198654, 198089, 197974, 198559, 198881, 198663, 198918, 199954, 200700, 200792, 201313, 202639, 203593, 203695, 204170, 205734, 207371, 208308, 209143, 210109, 210378, 210040, 210500, 211965, 212899, 212903, 213591, 215653, 217826, 219824, 223294, 228637, 234055, 239041, 245499, 254034, 262773, 271436, 282607, 297192, 312857, 328958, 348476, 372944, 400622, 432194, 472423, 523268]
493E23268N8921O8818Q7636J12551J39447J79942K45417L08537L07916K11848O3401n7866
491B249836j11128j15566j08547j08075j15557j30149j48143j60430j60622j50535j33904
490H07180j11469q5574o2662m6996l6672k8616k2843j9589j6934j3759j1338j0264r151p447
488C23866o216n484m018j970o21L05J957L726M549N576Q169J0922J2286J3973J7832K2290
486D07142K6092L1886M1232N0759N9191P2216R3333J18152J48022J97271K65801L10608K74069
485B095774J50728N193q9726j17900j13190j08283j11300j20753j36632j53818j61867j56709
483I81517j43197j24937j01310p5387n4848m2626l4359k6884k1974k0214j8334j4947j2719
481B89781j2766j2412j0401r051r437r275p444o044o173n976m556l762m417m639l555k997
$$ y = [523268, 582189, 651007, 738643, 851194, 990641, 1170583, 1416000, 1724537, 2032453, 2244301, 2307702, 2249836, 2138708, 2023142, 1914595, 1806520, 1690963, 1560814, 1412671, 1252241, 1091619, 941084, 807180, 695711, 610137, 547475, 500479, 463807, 435191, 412348, 392759, 375825, 362066, 350728, 340464, 331313, 323866, 317650, 312166, 308148, 306178, 305557, 305862, 307819, 311545, 316094, 321670, 329839, 340761, 353047, 367020, 384852, 407142, 433234, 465120, 506352, 557111, 616302, 688518, 781851, 900003, 1048025, 1245296, 1511097, 1821705, 2095774, 2246502, 2251695, 2161969, 2044069, 1930879, 1822596, 1711296, 1590543, 1453911, 1300093, 1138226, 981517, 838320, 713383, 612073, 536686, 481838, 439212, 404853, 377969, 355995, 335781, 317447, 302500, 289781, 277015, 264603, 254202, 245151, 235714, 226439, 218995, 212951, 206778, 200802, 196246, 192484, 188067, 183428, 179873, 176876]
480A76876l852m314l344k546k975l236k409j814k283k536j800j338j871k135j413r72j555
477A36483j938j323q37j243j505r44o13j148j460q71m76j015j458j034o59j050j324q24m53
475A16308q94j263q51m73q07j071o13k12n13p69l50Kl46o66l22Nk97n59j99J07k19m82q2L01
472A05735L3k59M5L67J10j58J15L57L5k58M7L64J18j27J68M19N9l39k00j16o95j338j360j267
469A01855j707k203k110j856k061k295j965j526j616j818j479r73r29j012o46k04k89n37l29
467G6300K4p0l15j37J73N1k19q4J68Kk74j08K06Q6j92l8K98K39l7rJ28r0l81k30P3n6l76k99
464G4833k2j20m38m11j78k61n15m08r3j16l69l33q9j16l28k53Qj4k44k21qj6j63p7J15J5k04
460F9974j04J62J19j38j45M4K7j17m0J14l0k59j37J46R0j60j06J41P4k07j95N4K6k45k55N
$$ y = [176876, 173024, 168710, 165366, 162820, 159845, 156609, 154200, 152386, 150103, 147567, 145767, 144429, 142558, 140423, 139010, 138038, 136483, 134545, 133222, 132385, 131142, 129637, 128693, 128080, 126932, 125472, 124601, 124125, 123110, 121652, 120618, 119959, 118909, 117585, 116761, 116308, 115414, 114151, 113300, 112827, 112020, 110949, 110336, 110124, 109611, 108842, 108492, 108494, 108148, 107482, 107160, 107165, 106868, 106309, 106110, 106217, 105998, 105516, 105434, 105735, 105768, 105509, 105554, 105921, 106031, 105873, 105988, 106345, 106380, 106122, 106169, 106533, 106651, 106524, 106692, 107111, 107170, 106831, 106631, 106515, 105820, 104482, 103122, 101855, 100148, 97945, 95835, 93979, 91918, 89623, 87658, 86132, 84516, 82698, 81219, 80246, 79317, 78305, 77659, 77455, 77166, 76629, 76300, 76324, 76254, 75939, 75802, 75975, 76026, 75807, 75723, 75891, 75893, 75619, 75511, 75717, 75803, 75611, 75573, 75871, 76110, 76073, 76064, 76192, 76102, 75721, 75491, 75564, 75508, 75132, 74833, 74811, 74691, 74253, 73842, 73664, 73403, 72888, 72480, 72387, 72271, 71902, 71569, 71480, 71364, 71036, 70783, 70791, 70777, 70533, 70312, 70304, 70288, 70125, 70048, 70163, 70178, 69974, 69870, 70032, 70151, 70013, 69868, 69912, 69939, 69822, 69782, 69896, 69866, 69607, 69470, 69616, 69706, 69546, 69440, 69581, 69655, 69448, 69253, 69307, 69333, 69088, 68833, 68838]
457F8838O6j25j68n3j31l43l08j16j92m54m29j45q0k59k69r2r7k56j92K3m8l19l03k0K8j92
454F4364k07L8Q6j40k07l0j6k32k83r2n9k49k83q9m9k32k65p9l8k05k26m1j7k00k06KPk47
450F0805l10o8L8j64k89j31j0j03j43k1j5j89k13j6M8j25j91k6L5j14j44M9J20o2j63m8k1
447E8529j92k43p9m4k51l40j58n4j98k75j21m5j83k17OJ47L0l4J19J83Lo6J66L57K59J45J81
444E7625L3m72r03q72o52o30o99o24n47o37p00n52l97m10l76j29P5K0p1J8Q6l9j14N2K01Q8
441D9374o6rP0n6j92j13mr2k02j09J9n1j54q0J9o5j62n7Q6M8k4P3K02J57P8J68L17L52L64
437D9891M00K31k36o41o87n90o41o97n48l94m96o54n45l02k35k58j18Q8J06J%N2qp6K5J63
434D3831J19j0j1M0j4o6K1Q3n1j99j23K0op9OJ01j0j69j23kn3j48n1Q7Lj53q3Q3M2j09n2J38
$$ y = [68838, 68904, 68779, 68611, 68558, 68427, 68084, 67776, 67660, 67468, 67014, 66585, 66440, 66360, 66101, 65832, 65740, 65643, 65387, 65195, 65218, 65170, 64851, 64548, 64528, 64556, 64364, 64157, 64195, 64281, 64141, 63934, 63904, 63888, 63656, 63373, 63281, 63222, 62973, 62690, 62601, 62552, 62320, 62055, 61976, 61938, 61733, 61507, 61466, 61449, 61249, 61043, 61045, 61052, 60805, 60495, 60427, 60465, 60301, 60012, 59881, 59871, 59768, 59625, 59604, 59589, 59400, 59187, 59171, 59219, 59094, 58903, 58877, 58912, 58798, 58654, 58703, 58823, 58761, 58598, 58550, 58529, 58337, 58094, 58015, 57971, 57720, 57380, 57222, 57168, 56970, 56695, 56574, 56529, 56346, 56129, 56135, 56282, 56312, 56278, 56397, 56580, 56583, 56517, 56683, 57040, 57299, 57444, 57625, 57658, 57186, 56283, 55411, 54759, 54129, 53430, 52806, 52259, 51622, 50922, 50370, 49973, 49563, 49187, 49058, 49133, 49153, 49082, 49100, 49186, 49147, 49033, 49085, 49286, 49374, 49308, 49299, 49369, 49313, 49121, 49008, 49004, 48912, 48710, 48601, 48620, 48569, 48415, 48335, 48354, 48289, 48127, 48070, 48156, 48204, 48180, 48253, 48455, 48612, 48690, 48858, 49175, 49527, 49891, 50291, 50522, 50286, 49645, 48958, 48368, 47727, 47030, 46482, 46088, 45592, 44938, 44393, 44091, 43856, 43598, 43480, 43568, 43674, 43675, 43675, 43727, 43719, 43643, 43668, 43831, 43950, 43940, 43929, 43969, 43955, 43889, 43910, 43993, 43942, 43743, 43620, 43640, 43634, 43555, 43561, 43662, 43652, 43483, 43360, 43358, 43305, 43157, 43106, 43193, 43196, 43043, 42960, 43043, 43085, 42976, 42924, 43062]
430D3062J43NRJ38J43O3J49L32L44K33K96N30O71P24R47J326J569J563J410J071M51k14n56
427E4409n98o63q25q82q54r55j136j130r30q02p81o56m35l46m01l51j74j12k09k30j15n8j17
424D1649j28n6n6j26r6J5J6p8o2N4O1n2n4R1J78J55J94L17L58L12L68N41O37O45P72J065J302
421D8022J359J302J104O66J09k73m29n59p24p79p34p81r21r57q68q17q05o65m57l97m52l65
418D1579j44q0k13k63j39q1j78k15r5k7r0r8J7N7m2q2K1O3m6j12m4Jn3m8O5Q0n0j04j3%j47
415C9519k10o7K3j35l48l71k70k21j94j12m8n6m8J0Po6n3P9J46P8L9R5R9Lj9Q3J03l6j13j6
411C7901Q0L9JN0M7o7j17nP9K0k9L8P1k0o7L1Q7mp3MO9Nl7N3J02Nn5L5Q4m5j56q8j3j19k39
407C7667j54J0M4J1M5O5m5j34l9J18J33O4N3N2k3n0O2J65J05OM3J20P3j0J0M2l4j15n9J7l4
$$ y = [43062, 43205, 43210, 43219, 43357, 43500, 43563, 43712, 44044, 44388, 44621, 44917, 45447, 46118, 46842, 47789, 49115, 50684, 52247, 53657, 54728, 55179, 54965, 54409, 53811, 53148, 52323, 51441, 50587, 49632, 48496, 47366, 46436, 45634, 44853, 44197, 43762, 43416, 43015, 42664, 42490, 42378, 42169, 41939, 41824, 41766, 41649, 41521, 41465, 41409, 41283, 41187, 41202, 41218, 41140, 41078, 41132, 41193, 41141, 41087, 41178, 41356, 41511, 41705, 42022, 42380, 42692, 43060, 43601, 44238, 44883, 45655, 46720, 48022, 49381, 50683, 51787, 52453, 52562, 52289, 51860, 51301, 50577, 49798, 49064, 48283, 47362, 46405, 45537, 44720, 43915, 43250, 42793, 42396, 41944, 41579, 41435, 41355, 41142, 40879, 40740, 40659, 40481, 40266, 40171, 40144, 40054, 39956, 39973, 40030, 39988, 39906, 39927, 39990, 39944, 39832, 39788, 39789, 39736, 39688, 39753, 39833, 39783, 39679, 39666, 39666, 39519, 39309, 39242, 39265, 39130, 38782, 38411, 38141, 37920, 37726, 37614, 37566, 37510, 37462, 37472, 37479, 37413, 37360, 37439, 37585, 37663, 37702, 37797, 37896, 37899, 37880, 37963, 38066, 38030, 37917, 37901, 37981, 38020, 38021, 38071, 38118, 38051, 37934, 37929, 38008, 38028, 37999, 38037, 38108, 38088, 38021, 38052, 38139, 38135, 38062, 38066, 38135, 38140, 38103, 38156, 38258, 38263, 38208, 38243, 38327, 38282, 38126, 38038, 38025, 37906, 37667, 37513, 37523, 37567, 37578, 37623, 37688, 37643, 37509, 37470, 37588, 37721, 37785, 37838, 37890, 37867, 37817, 37879, 38044, 38149, 38155, 38198, 38318, 38391, 38381, 38391, 38433, 38399, 38284, 38225, 38242, 38208]
403C8208j00j4R9N0p7o5N3R1L9J0qp8j30p5rk1k4O4J20M4k1M7J10K7n4J5Q6k0j50p7Q3Q4n
399C8302M5J79J52j4q9k1L5L5O7J17R1K8L1M9j7q5k9O0K4p5q1j6%KP8J36N6n7m4M0L5KP1J68
395C9275J36L4J0K3m3j14o4K4J0j0R0J77O7r7o4Q5Q3m4m9Q2J28M5NM2L2j9J1J09J41J36J82
391D0423K08R2l9J0J46J21l4q5qNn7l4O4P1oK2J53J91J05O4J02R5M0O8J58J55O2M5J10J25
387D2372O7N2Q3O0L6J23K32J84L5kP2Q0J3K4J09J21Q0J19J98J77J05J35K15J71P9J50L24L67
384D5781K95L21M21L57J28nM2Q8O8R8J61J09j1oR6Q9j2K7K01K62J65J42K57L18K52K23K97
380E0164L26K78K90L72L65K80K91M01M28L58L64M58M69L88L76M41M44M08M94O34O21N02N27
378E9679O86P61P60Q77J080J133J067J153J400J573J641J813K099K283K353K493K682K773
$$ y = [38208, 38108, 38094, 38193, 38243, 38166, 38101, 38154, 38245, 38284, 38294, 38286, 38208, 38078, 38003, 37994, 37973, 37949, 38013, 38133, 38177, 38156, 38203, 38313, 38340, 38286, 38301, 38387, 38367, 38217, 38140, 38223, 38307, 38302, 38347, 38526, 38678, 38664, 38575, 38554, 38589, 38624, 38691, 38808, 38899, 38927, 38958, 39007, 38990, 38905, 38876, 38936, 38960, 38885, 38804, 38788, 38788, 38790, 38868, 39004, 39060, 39003, 38959, 38999, 39034, 39036, 39107, 39275, 39411, 39445, 39455, 39478, 39435, 39321, 39257, 39281, 39291, 39281, 39371, 39548, 39615, 39518, 39454, 39539, 39622, 39578, 39529, 39611, 39739, 39784, 39789, 39831, 39863, 39844, 39855, 39964, 40105, 40241, 40423, 40631, 40723, 40684, 40694, 40840, 40961, 40927, 40842, 40834, 40839, 40782, 40748, 40812, 40883, 40877, 40899, 41052, 41243, 41348, 41412, 41514, 41609, 41649, 41717, 41875, 42030, 42092, 42137, 42247, 42372, 42439, 42491, 42574, 42634, 42670, 42793, 43025, 43209, 43244, 43242, 43314, 43394, 43407, 43431, 43540, 43661, 43741, 43860, 44058, 44235, 44340, 44475, 44690, 44861, 44940, 45090, 45414, 45781, 46076, 46397, 46818, 47175, 47303, 47298, 47340, 47428, 47496, 47594, 47755, 47864, 47853, 47847, 47943, 48032, 48020, 48047, 48248, 48510, 48675, 48817, 49074, 49392, 49644, 49867, 50164, 50490, 50768, 51058, 51430, 51795, 52075, 52366, 52767, 53195, 53553, 53917, 54375, 54844, 55232, 55608, 56049, 56493, 56901, 57395, 58029, 58650, 59152, 59679, 60365, 61126, 61886, 62763, 63843, 64976, 66043, 67196, 68596, 70169, 71810, 73623, 75722, 78005, 80358, 82851, 85533, 88306]
375H8306K898L312L897M329M679N280O066O649P010P535Q344R256J0366J1994J4075J6209
374B10205J8355K0699K2769K3444K1984J8621J4060R135M838J854j37k029m122n997p454q721
372C37504r712j0002r639r150q684p974p135o614o313n739n007m686m633m180l406l025k951
369B28654k418j445q30n47K39J463K187K484L428N059O377P625J0152J3491J5253J4784J4285
367C20241J5354J7328K0194K5523L3146M1122N1189O8241Q9152R7332P7341L4374q206l1815
366H50516l7291l6383l6753l9230m3440m9244n4464n6172n4005m9528m3392l5678k7863k1853
364B65220j7640j4041j1017r319q519p490o259n636n416m714l666l130l026k547j691j157
362A59952r13l04O21J227J546K167L051L664M100M944O070O799P146P798Q961J0268J1738
$$ y = [88306, 91204, 94516, 98413, 102742, 107421, 112701, 118767, 125416, 132426, 139961, 148305, 157561, 167927, 179921, 193996, 210205, 228560, 249259, 272028, 295472, 317456, 336077, 350137, 359272, 364110, 365964, 365827, 363798, 359676, 353679, 346225, 337504, 327792, 317790, 308151, 299001, 290317, 282343, 275208, 268594, 262281, 256542, 251535, 246849, 242216, 238036, 234630, 231605, 228654, 226236, 224791, 223961, 223414, 223653, 225116, 227303, 229787, 233215, 238274, 244651, 252276, 262428, 275919, 291172, 305956, 320241, 335595, 352923, 373117, 398640, 431786, 472908, 524097, 592338, 681490, 778822, 856163, 890537, 882331, 850516, 813225, 776842, 740089, 700859, 657419, 608175, 553711, 497539, 443534, 394006, 350614, 314936, 287073, 265220, 247580, 233539, 222522, 213203, 204684, 197194, 190935, 185299, 179883, 175169, 171503, 168373, 165347, 162800, 161109, 159952, 159039, 158735, 159356, 160583, 162129, 164296, 167347, 171011, 175111, 180055, 186125, 192924, 200070, 207868, 216829, 227097, 238835]
360B38835J3818J6514J9447K2537K5444K6479K3511J6353P250j199p852j2709j6052j8357
358C54019k0258k1977k3193k3681k3529k2711k1040j8703j6258j3977j1722r558p844o629
357A12939n575m592l950l677l404k997k727k708k664k437k227k159k062j855j697j636j521
354F5051j347j293j342j274j101j061j142j074q36p15p76p61n89n00n87o33n47n14n97o02
352D7760m73l95m39m31l36l24m16m10k98k97m22m23k66k14l44m01k73j88k78l44k66k21l11
349C9990l53k51j87k72l21k07r1j27j93j72j45j77j66p5o8j91k51j55p1j23j81j23o8j14j52
346C5756j06r8k09k86k17j16j20j61j39j08j32j47j23j35k12k43j71r2o9m3qo0j75k05j23
343C2258q4j28j24n1o1j76k28j60j17j52j24QN8l7r4k4K1m2p4kJ0j08j66n9L0m8j40r4rk4
$$ y = [238835, 252653, 269167, 288614, 311151, 336595, 363074, 386585, 402938, 410188, 408989, 401137, 388428, 372376, 354019, 333761, 311784, 288591, 264910, 241381, 218670, 197630, 178927, 162669, 148692, 136970, 127412, 119568, 112939, 107364, 102772, 98822, 95145, 91741, 88744, 86017, 83309, 80645, 78208, 75981, 73822, 71760, 69905, 68208, 66572, 65051, 63704, 62411, 61069, 59795, 58694, 57633, 56491, 55417, 54581, 53866, 53090, 52329, 51740, 51240, 50653, 50020, 49473, 48959, 48362, 47760, 47287, 46892, 46453, 46022, 45686, 45362, 44946, 44536, 44238, 43941, 43519, 43096, 42830, 42616, 42272, 41871, 41598, 41410, 41132, 40788, 40522, 40301, 39990, 39637, 39386, 39199, 38927, 38606, 38399, 38308, 38181, 37988, 37816, 37671, 37494, 37328, 37253, 37185, 36994, 36743, 36588, 36517, 36394, 36213, 36090, 36022, 35908, 35756, 35650, 35552, 35343, 35057, 34840, 34724, 34604, 34443, 34304, 34196, 34064, 33917, 33794, 33659, 33447, 33204, 33033, 32941, 32872, 32829, 32821, 32761, 32586, 32381, 32258, 32174, 32046, 31922, 31871, 31810, 31634, 31406, 31246, 31129, 30977, 30853, 30861, 30919, 30882, 30788, 30764, 30785, 30743, 30669, 30667, 30677, 30569, 30403, 30344, 30374, 30326, 30186, 30092, 30083, 30059]
339C0059o0l0l6j40j95r7mn3j21q4m6j12j55o2K4n1j59j19j9k4q4p8n9j09j23j9N6l3j47j01
336B7819lm4j33q2M0J3j33j78r2k6l0qL8J2n4m0L2L5m8j02q7o5n7l9k8m0k7K8L5m7r8k9L1
332B6593l4j11m3P1L6j13j82j32q3o6j9L0j0r3q8oL5J4J1K6lm0j1K7j5q4n6K0Nq5j11m8j2
328B5423k5kN7M9k8o2k5kl6o1m8l8l4J3Q4J09P8M9M0K7J4Pk6q9j16o8l2q9j63j51q4n6o3m1
324B4611k1n8r5o9l2m9m9K8P5j0j10o1M7K4r2r6J5O3%l0RLo7o2M4R9L0m3j7M8P1N6L3J1J6
319B4322Q7J47J04K2M1J23R0q7k40k70k69k95k63j51p8j26k01k06j76j73j54o5L4N9J4l3n7
316B2199o9p9r3r1m1N2J05P0J8K4L3j7o0oO9L2p0q5j7oo0m6M6Q3L2J5Q4J28Q7L4J8j1l2L6
312B2382J59J79O2l1k2j5n5m8N2J00K9l4K2Q9M1n1n3PK2qk2l7q9j31j07o2o0p9p2p5j24j61
$$ y = [30059, 29999, 29969, 29933, 29793, 29598, 29501, 29497, 29444, 29323, 29239, 29193, 29081, 28926, 28864, 28888, 28837, 28678, 28559, 28540, 28516, 28432, 28354, 28295, 28186, 28063, 28044, 28100, 28067, 27920, 27819, 27816, 27772, 27639, 27557, 27597, 27610, 27477, 27299, 27207, 27181, 27151, 27143, 27181, 27193, 27139, 27099, 27131, 27166, 27118, 27016, 26929, 26864, 26807, 26768, 26740, 26700, 26673, 26701, 26736, 26689, 26591, 26562, 26593, 26559, 26448, 26405, 26476, 26512, 26399, 26217, 26085, 26002, 25936, 25917, 25947, 25937, 25844, 25756, 25750, 25785, 25799, 25810, 25836, 25833, 25793, 25782, 25809, 25794, 25710, 25654, 25674, 25679, 25594, 25483, 25435, 25423, 25398, 25396, 25453, 25502, 25474, 25412, 25387, 25385, 25349, 25288, 25240, 25202, 25168, 25181, 25265, 25374, 25452, 25501, 25541, 25568, 25582, 25589, 25563, 25474, 25358, 25290, 25258, 25169, 25006, 24855, 24771, 24715, 24652, 24611, 24590, 24532, 24437, 24368, 24336, 24287, 24238, 24266, 24341, 24331, 24221, 24160, 24207, 24231, 24139, 24043, 24058, 24121, 24121, 24091, 24100, 24103, 24036, 23974, 24018, 24117, 24147, 24104, 24087, 24135, 24206, 24262, 24295, 24306, 24322, 24409, 24556, 24660, 24682, 24723, 24846, 24936, 24849, 24609, 24339, 24070, 23775, 23512, 23361, 23283, 23157, 22956, 22750, 22574, 22401, 22247, 22182, 22216, 22275, 22289, 22256, 22199, 22130, 22051, 21958, 21867, 21826, 21878, 21983, 22053, 22071, 22095, 22128, 22111, 22051, 22045, 22114, 22146, 22076, 21991, 21974, 21968, 21908, 21862, 21908, 21991, 22023, 22038, 22122, 22250, 22337, 22371, 22389, 22378, 22346, 22382, 22541, 22720, 22782, 22751, 22729, 22714, 22659, 22611, 22663, 22763, 22792, 22758, 22780, 22869, 22910, 22859, 22806, 22813, 22835, 22827, 22805, 22768, 22679, 22548, 22441, 22379, 22319, 22240, 22168, 22093, 21969, 21808]
308B1808j13k7J0orQJl9p3o5k1K4L7lm8n1k0RL3N1K5m2m7O9J83J46K7QR6J37J00J15K00K42
304B2765K44L67N92O45L84K8j49j67j99k59k63k38k61l09l07k82l03l27k81j93j43j24r9p2
301B1049p3o6l7l6q6j09n1J6K4M%j9p9j09o6j4j8k2K3N7K6j5kNl0m0K6P8N0L0Q6J37Q4K3Q5
296B0931K12K51J98J53J07kj25j50j02j14j88k10j40r9j59k56k81k14r8jK3j6n3m4l0m0m0
293A9513NL9J3k6k2kj2j9%no6j09p3k1k8n3l1lm0q7n6J9M9L0K3K7Oj3Jpp3j09m2N0M6l4p7
289A8813o3n3m1NM3J2l3j4K6Ql3j0L7Mp5q2k0Ml9o0l4j4l1m6m1k1J5O3N5k6q3m0J8Jl4KM6
284A8259Mn1NJ11J00k5r6o7k7j3K1N2Jp4m9M2M8m3q1pQ1J04Q4L1p4j57j11RN3Pj5%m3j17q9
280A7873M0J06N0jK5L8j4n5n5p9j29j05mM1M%N1L7o9j04jR0N8j3k9n5j19j21qP9M5pL6J01
$$ y = [21808, 21695, 21668, 21678, 21672, 21663, 21671, 21672, 21633, 21560, 21495, 21474, 21498, 21535, 21532, 21484, 21433, 21413, 21422, 21455, 21506, 21531, 21489, 21442, 21511, 21694, 21840, 21867, 21875, 21971, 22108, 22208, 22323, 22523, 22765, 23009, 23376, 23968, 24613, 24997, 25025, 24876, 24709, 24510, 24251, 23988, 23750, 23489, 23180, 22873, 22591, 22288, 21961, 21680, 21487, 21344, 21220, 21121, 21049, 20976, 20910, 20873, 20837, 20751, 20642, 20591, 20607, 20631, 20635, 20635, 20616, 20537, 20428, 20362, 20348, 20330, 20308, 20331, 20388, 20414, 20399, 20397, 20402, 20372, 20332, 20358, 20436, 20486, 20516, 20602, 20739, 20823, 20846, 20931, 21143, 21394, 21592, 21745, 21852, 21850, 21725, 21575, 21473, 21359, 21171, 20961, 20821, 20722, 20563, 20307, 20026, 19812, 19714, 19713, 19736, 19720, 19667, 19623, 19593, 19553, 19513, 19518, 19557, 19570, 19544, 19522, 19520, 19508, 19489, 19489, 19484, 19418, 19309, 19236, 19215, 19187, 19134, 19103, 19100, 19060, 18973, 18917, 18936, 18985, 19015, 19038, 19065, 19071, 19058, 19059, 19052, 18979, 18870, 18828, 18878, 18924, 18890, 18813, 18750, 18697, 18656, 18661, 18704, 18716, 18683, 18669, 18695, 18703, 18670, 18660, 18697, 18701, 18626, 18544, 18524, 18528, 18489, 18429, 18395, 18381, 18350, 18304, 18263, 18242, 18257, 18320, 18375, 18349, 18266, 18226, 18244, 18245, 18211, 18213, 18259, 18263, 18212, 18217, 18328, 18428, 18403, 18307, 18240, 18213, 18200, 18221, 18273, 18274, 18200, 18151, 18193, 18241, 18198, 18117, 18110, 18191, 18295, 18379, 18410, 18336, 18179, 18068, 18077, 18130, 18137, 18122, 18122, 18079, 17962, 17873, 17913, 18019, 18069, 18068, 18093, 18131, 18117, 18062, 18007, 17928, 17799, 17694, 17690, 17731, 17735, 17735, 17786, 17823, 17754, 17650, 17649, 17739, 17797, 17784, 17755, 17700, 17581, 17460, 17452, 17531, 17576, 17569, 17605, 17706]
276A7706P2ql9l3l8k5J7J8n0p7PR3O0l0o9n7n4n2k3k6o8n7M7J12L4p2n2L1L9k5k7L3N3Jm3
271A7398m3l3m4n8n9l8K5Q8P7J4mM6N6j5m9K7R8L7q1j11o5l8l2LM2K6j2j0Rnj7J1J0p0j43
267A7040r7QL9LqJ1j4o9o5jM6M9L8K0k9n9k5K7K0j6j0K3Lm9m1J6L6pm6k8J7L9J8k2m1KN4K8
263A6910n3p1MM2k2p5k1L3k6j14q9JJ3k4J3Q3O3k6m7J2K4j9k2K5J4n8p5qM0K3NK3L2J7J3M
258A6644n7j15p4K6N4LJO0N6l7j04p5l1l0j9K3L2jRO0M2p5j37m8P0Q0J5j7j2k8m7k8pl6o8
254A6129l7M1P4M1j0l7l4k3k5m2n5k7J4Pl8m8NN7N4J8pk1j7J5O5O3pp8p8j6M3N9L2%mJ7J3
249A6143l4p0n2j6k1l3j2J5pm9l2J4mp6r2qQ4J03N7j1o7q7o2l1k8mP6J31P2l0m9oj6p1o0K3
245A5690N4jl5lJ0k2j5N0O7Pl9k9m6j01p7N6J46Q2l1n8l1l8m8j3Nn4j20r5j9J9K4L9N0K8J6
$$ y = [17706, 17778, 17770, 17731, 17698, 17660, 17635, 17652, 17670, 17620, 17543, 17550, 17643, 17703, 17673, 17604, 17547, 17493, 17441, 17418, 17392, 17324, 17267, 17314, 17426, 17460, 17388, 17336, 17367, 17406, 17381, 17354, 17387, 17440, 17441, 17398, 17355, 17322, 17278, 17220, 17161, 17123, 17148, 17236, 17313, 17327, 17323, 17369, 17425, 17410, 17361, 17388, 17486, 17523, 17442, 17331, 17266, 17228, 17196, 17199, 17241, 17267, 17255, 17245, 17254, 17249, 17232, 17243, 17253, 17183, 17040, 16943, 16951, 16990, 16993, 16985, 16996, 16982, 16913, 16848, 16847, 16893, 16942, 16980, 17000, 16971, 16912, 16887, 16914, 16934, 16918, 16908, 16931, 16934, 16885, 16844, 16860, 16896, 16889, 16843, 16815, 16832, 16871, 16889, 16867, 16826, 16828, 16882, 16910, 16857, 16786, 16790, 16832, 16810, 16735, 16714, 16747, 16721, 16607, 16518, 16519, 16532, 16508, 16521, 16604, 16667, 16641, 16594, 16606, 16630, 16611, 16589, 16614, 16628, 16570, 16495, 16487, 16527, 16550, 16555, 16578, 16610, 16627, 16640, 16644, 16587, 16472, 16398, 16424, 16478, 16481, 16482, 16542, 16598, 16561, 16457, 16382, 16351, 16321, 16302, 16325, 16357, 16356, 16365, 16425, 16467, 16392, 16255, 16207, 16277, 16357, 16372, 16355, 16343, 16315, 16268, 16240, 16233, 16197, 16129, 16092, 16133, 16207, 16248, 16238, 16201, 16167, 16144, 16119, 16077, 16022, 15995, 16009, 16016, 15978, 15930, 15935, 15992, 16046, 16064, 16057, 16036, 16019, 16034, 16099, 16162, 16155, 16077, 15999, 15983, 16026, 16085, 16117, 16117, 16113, 16130, 16143, 16109, 16039, 15987, 15971, 15950, 15917, 15905, 15920, 15913, 15864, 15832, 15846, 15842, 15766, 15674, 15666, 15750, 15853, 15910, 15899, 15832, 15745, 15683, 15652, 15624, 15620, 15696, 15827, 15899, 15869, 15820, 15814, 15798, 15727, 15667, 15690, 15744, 15743, 15708, 15705, 15715, 15693, 15678, 15728, 15795, 15802, 15763, 15734, 15688, 15587, 15510, 15566, 15712, 15794, 15763, 15705, 15674, 15636, 15588, 15575, 15580, 15526, 15406, 15311, 15292, 15311, 15335, 15374, 15424, 15452, 15468]
241A5468M2M2k5q2n0K0K7j9n1n5n5k9M2Q7M0m0n8j8J2Qpk0l4j3M1O7J9m3n1k0OP%j9l2rL2
236A5230K8k3l9nNk5k9J5J7m9o5K2R7N0l5m3npk9j4Ll1p0m2J3K6J5K0J4j7nO3Q0j4r7m7M8
232A5055M6k9n5m1m9m8J2O6L6KM9Q1k5j60j27L0R1J4l4QK1l5n1J6O0K2j8k2l8p4n0L9P6J8
227A4886l8k0K1L1K6K4j1o2o1oJ0m0p3m4oKJ0L8M6J8jKj2m3l7J2M0K5J1J2j0n8p4l1M2R5J00
223A4824K2j00j47o0L9K3n7m9M3Q1L8J1K1no7p8m0m9q2k6R8J25J1o4KR1Q0K0rm4j12j37n9
219A4344L5M9K4K8M1L3K1K9J4m1o2l2k1o3q2l7nl4o2l3jj4j3L6O8L2j2jK4J3o%ol7l5K6O6
214A4286M1NQJl4k9M0O4qo8l9Qjj0M8R0L5m5n4l0n6q3l2L6J3n2m4J5L9J9J6J4l9r2p0rJj8
210A3966J4O7O1mm1n0p2r1n1PJ3j4ON4N0PML3K5k1k8JPnJ2L7nq4r0%P7O2qo3o5k2L5L9j6n6
$$ y = [15468, 15510, 15552, 15527, 15445, 15395, 15415, 15442, 15423, 15372, 15317, 15262, 15233, 15275, 15362, 15402, 15362, 15304, 15286, 15298, 15306, 15299, 15279, 15245, 15232, 15273, 15340, 15359, 15316, 15265, 15245, 15251, 15258, 15258, 15239, 15207, 15198, 15230, 15258, 15235, 15196, 15191, 15196, 15171, 15142, 15157, 15174, 15125, 15060, 15082, 15179, 15229, 15194, 15151, 15146, 15139, 15110, 15096, 15099, 15068, 14998, 14956, 14969, 14995, 15010, 15030, 15044, 15027, 15022, 15085, 15165, 15151, 15054, 15007, 15055, 15101, 15072, 15017, 14976, 14927, 14879, 14891, 14957, 14993, 14995, 15044, 15125, 15100, 14940, 14813, 14843, 14934, 14948, 14914, 14922, 14943, 14908, 14857, 14873, 14933, 14955, 14937, 14915, 14877, 14803, 14753, 14792, 14868, 14886, 14848, 14828, 14849, 14880, 14906, 14930, 14919, 14857, 14796, 14790, 14800, 14760, 14687, 14643, 14637, 14639, 14649, 14687, 14733, 14751, 14750, 14752, 14740, 14697, 14660, 14672, 14712, 14737, 14748, 14760, 14750, 14692, 14618, 14587, 14629, 14724, 14824, 14846, 14746, 14599, 14539, 14578, 14601, 14544, 14495, 14538, 14619, 14657, 14668, 14689, 14684, 14617, 14539, 14499, 14450, 14368, 14342, 14440, 14565, 14576, 14512, 14514, 14605, 14685, 14705, 14696, 14652, 14540, 14403, 14344, 14379, 14428, 14452, 14480, 14521, 14554, 14575, 14604, 14618, 14577, 14515, 14483, 14462, 14399, 14317, 14280, 14275, 14241, 14179, 14146, 14145, 14131, 14118, 14154, 14222, 14254, 14242, 14241, 14265, 14278, 14272, 14272, 14266, 14229, 14194, 14220, 14286, 14327, 14332, 14340, 14341, 14307, 14278, 14318, 14382, 14374, 14306, 14267, 14275, 14274, 14264, 14312, 14402, 14437, 14392, 14338, 14308, 14252, 14169, 14137, 14173, 14186, 14134, 14090, 14105, 14144, 14163, 14179, 14193, 14154, 14062, 13992, 13983, 13984, 13966, 13980, 14047, 14108, 14104, 14063, 14013, 13941, 13850, 13799, 13806, 13819, 13805, 13811, 13865, 13915, 13922, 13926, 13959, 13984, 13963, 13935, 13936, 13943, 13938, 13950, 13987, 13982, 13898, 13808, 13808, 13885, 13947, 13939, 13876, 13811, 13789, 13824, 13863, 13847, 13791]
205A3791k7J0j5n0pP0O9Oj2L4O1K8pj5j6k4k2l5p9r4k2O8O8Nj0J8jo4p2j0K3%lL3L5j5l0R
200A3698K4qj3L6N5Jm1pM3L1k7o8p4m7LL1j5r9j15l9L7N6N2N1K3l0l8kPl4l6K6O8K3l1j3L1
196A3559J7l3m2lK1Nrj5k4m5o8p0m0K2O0L1l5m1L1Q6M6m3p0j5M9M4k3q0n4K7O2Pn1l6Nlk3
191A3249K4Q5M3p5j18m0L2J0m0l7lK0L6K6l6q7k8Q9R7k7r0J8J30O8q7j28m4K6K1J6L9M3J4
187A3246qk0m7p5p2n3l8jO7R0J8p2n7M2R5N6Lj4k9o1p1l8jJ2K4L7J9l5p0m8OK3mk1J6P3P7
183A3069K2k3j6%j7l0J0N3K5l4l1K2J5n7q2j5M2K9J6M8N2j5o9m2j9o6j01k8O5M6k7j0Q4J05
178A3021K0o0o6n2n1k4K8L5k0o9o2l0kL4O3L6l2n3JN2K9m1o9m0lJ9M0P0Q4N0k7r2r9n8k7k3
174A2582k0PL6L9K7J3lmK5N4L8j2k4jjl6l3J8K8l8p8k8K9J3k7%M4K3k5l3l3q2j13m1O0P0K1
$$ y = [13791, 13764, 13774, 13759, 13709, 13702, 13772, 13841, 13847, 13835, 13869, 13930, 13958, 13951, 13936, 13920, 13896, 13874, 13839, 13760, 13666, 13644, 13712, 13780, 13785, 13775, 13793, 13792, 13728, 13656, 13646, 13669, 13669, 13666, 13699, 13734, 13719, 13689, 13698, 13722, 13714, 13701, 13737, 13792, 13793, 13752, 13745, 13788, 13819, 13792, 13724, 13650, 13603, 13606, 13637, 13622, 13523, 13408, 13369, 13406, 13462, 13514, 13565, 13588, 13558, 13520, 13518, 13525, 13491, 13455, 13481, 13549, 13572, 13541, 13528, 13559, 13576, 13543, 13501, 13498, 13519, 13524, 13515, 13500, 13476, 13431, 13363, 13293, 13253, 13275, 13335, 13366, 13331, 13290, 13321, 13407, 13453, 13410, 13340, 13325, 13374, 13418, 13395, 13315, 13261, 13288, 13350, 13357, 13306, 13270, 13275, 13272, 13249, 13273, 13358, 13401, 13326, 13208, 13168, 13200, 13210, 13170, 13133, 13130, 13150, 13186, 13212, 13176, 13089, 13061, 13150, 13247, 13220, 13130, 13148, 13278, 13346, 13259, 13131, 13087, 13113, 13134, 13150, 13189, 13232, 13246, 13238, 13218, 13171, 13096, 13024, 12971, 12933, 12932, 12999, 13089, 13107, 13035, 12978, 13020, 13115, 13171, 13174, 13160, 13131, 13070, 12999, 12961, 12960, 12972, 12996, 13033, 13052, 13017, 12947, 12899, 12905, 12928, 12924, 12903, 12919, 12992, 13069, 13091, 13068, 13052, 13052, 13035, 13005, 13015, 13068, 13093, 13059, 13028, 13050, 13065, 13008, 12926, 12911, 12953, 12982, 12998, 13046, 13098, 13083, 13014, 12972, 12953, 12887, 12786, 12758, 12823, 12869, 12842, 12832, 12916, 13021, 13041, 12981, 12915, 12863, 12812, 12788, 12816, 12851, 12831, 12762, 12700, 12670, 12668, 12702, 12765, 12801, 12769, 12716, 12717, 12769, 12798, 12757, 12688, 12648, 12645, 12664, 12704, 12774, 12858, 12908, 12881, 12789, 12690, 12632, 12605, 12582, 12562, 12569, 12605, 12644, 12671, 12684, 12681, 12677, 12702, 12756, 12794, 12782, 12758, 12757, 12756, 12720, 12687, 12705, 12733, 12695, 12617, 12589, 12618, 12631, 12604, 12604, 12648, 12671, 12646, 12613, 12580, 12498, 12385, 12344, 12404, 12474, 12495]
169A2495K4O1J8p5p7J7O3J1k4K1N2Ln0l0Nrl3oM6N5K4j0l7n7o5n7n7n5k5L4O9M9Lm2n8j8O3
165A2328R5K0q0p7J6P6N0Prk6n4m2LQl5m6j3Pj0KN4O0ll9QM8Mn8n3j9k5n4k8M2Q7P2K0l4m7
160A2255kO0M9l0q2l9K8K2l5n8k1L0M1Rm3o2j9L6K6l6n3PO6O0K0kj2k0rQj2n3k8O0J04L7n1
156A2251o6k3J0K4K6j0o4n6J4M0k8p8k6L0j9q6k6J09J36L1l9LN2J6o0q0l0L8P3O0%o7r6o8
151A1991j2L8M6mp4p4kL8j7o9lJ20J51O9j0l4o1j10j09l3L3K6k2l8k1NL0M8L8JoL6P3M6k2
147A2068n3l9k3m1o1l9K5Q2R7O3Mn7q8o9j0K8Nn0o3k0J5Nk8l1KM7N9K2m0m3K7P4Lj07j08R
143A1665Q0L1l5k1J0j0l1RM7J4l4mN6M2j9l7kRk1l9l3l1k3jNk6l9J6P7O3Ml0n0q8r3j2P7O3
138A1589qj4L7L8j9l6pj4n4k3P4J14N7POj4q1j02l9J1j7m5j2K4km7l3OJ6J2K1J6k6n8m1lJ8
$$ y = [12495, 12519, 12580, 12598, 12523, 12446, 12463, 12526, 12537, 12513, 12534, 12586, 12589, 12539, 12509, 12514, 12505, 12472, 12466, 12512, 12567, 12591, 12581, 12544, 12487, 12422, 12365, 12308, 12253, 12228, 12262, 12331, 12380, 12383, 12341, 12283, 12265, 12328, 12423, 12443, 12363, 12286, 12302, 12378, 12428, 12435, 12426, 12400, 12346, 12304, 12307, 12315, 12280, 12234, 12221, 12228, 12218, 12220, 12274, 12334, 12331, 12292, 12300, 12348, 12352, 12294, 12241, 12222, 12197, 12143, 12115, 12157, 12244, 12316, 12336, 12302, 12255, 12253, 12313, 12362, 12332, 12250, 12211, 12239, 12261, 12226, 12168, 12147, 12177, 12218, 12227, 12184, 12122, 12103, 12139, 12165, 12129, 12076, 12083, 12149, 12209, 12229, 12227, 12215, 12195, 12186, 12194, 12182, 12129, 12101, 12161, 12265, 12302, 12251, 12185, 12162, 12172, 12196, 12222, 12212, 12148, 12092, 12106, 12146, 12118, 12040, 12014, 12044, 12025, 11939, 11913, 12022, 12158, 12189, 12150, 12153, 12205, 12221, 12161, 12081, 12051, 12089, 12162, 12222, 12222, 12155, 12059, 11991, 11979, 12017, 12063, 12059, 11985, 11911, 11909, 11947, 11930, 11861, 11858, 11978, 12129, 12198, 12188, 12154, 12093, 11983, 11874, 11841, 11874, 11900, 11878, 11840, 11819, 11824, 11854, 11902, 11940, 11941, 11935, 11971, 12044, 12090, 12068, 12015, 11976, 11953, 11912, 11851, 11812, 11837, 11919, 12016, 12079, 12083, 12026, 11938, 11869, 11859, 11887, 11892, 11842, 11779, 11759, 11774, 11779, 11751, 11720, 11722, 11769, 11828, 11850, 11810, 11767, 11794, 11868, 11871, 11764, 11656, 11665, 11745, 11776, 11741, 11720, 11730, 11720, 11689, 11698, 11745, 11759, 11725, 11721, 11777, 11819, 11800, 11763, 11761, 11770, 11749, 11710, 11677, 11646, 11623, 11622, 11627, 11601, 11562, 11578, 11655, 11718, 11722, 11692, 11642, 11554, 11461, 11449, 11526, 11589, 11581, 11567, 11604, 11642, 11623, 11587, 11580, 11566, 11512, 11489, 11563, 11677, 11734, 11741, 11747, 11733, 11652, 11550, 11511, 11522, 11505, 11460, 11448, 11472, 11470, 11423, 11390, 11396, 11412, 11424, 11445, 11461, 11435, 11377, 11336, 11333, 11351]
134A1351M2P1N4j6n8k3K9J8j9nN1O7Ro4p6j9M4M5j7o2l2K1J7k3k0J7ko9p3J3O3Mo8l8L4L9
129A1305j2k3L3O9M5ol4l2j3rj7jN1Q5L4m1l2M4N7k9r1l2P1J00N4Ml2n7m0Mnp1q6lN3j3r9
125A1231o5L1M8qj3L9N1J7K8Q0O7k2p8m5nj1qM4O8mj18j66j30p0k4J6N6P9P0L5J2K8O5O1p
120A1352p5q2m5j4qj5l6o8o3nN1M7K6L6N6K3k3j2L4L7j4l9j9j9n1m8JK4j3m3j8J7K0J1K2J3
116A1060l3o2k3N4P7L2j2j1J0no3j01o9J2O3N2K6L2M0J3j4jK1oo2o2MN1K9k4l9k5k4l8n2m3
112A0807j1L0M8L0ql2l3k1PL8K4k5l8K7Q9N8k1l9JMm6n8MN2L8J4Rk7r6j06j9N5J9m3j1R5J33
107A0948O4k0m4l5m4o5o3l2J0M1O0O8O4M8K1Pll4q9j13n6K9M8j8p7p0k9NL3N4L9k0n0oN7N1
103A0779ml5k5j2j4oJ8J9j0l4j8K2M3J4m2p9o0%M8N1K7J0j2m6o6l6L0O4L3k6n4l9JL5M9M4
$$ y = [11351, 11393, 11464, 11518, 11502, 11444, 11421, 11450, 11468, 11449, 11444, 11495, 11562, 11571, 11507, 11431, 11412, 11456, 11501, 11484, 11422, 11390, 11411, 11428, 11405, 11385, 11402, 11400, 11331, 11258, 11271, 11334, 11338, 11270, 11232, 11266, 11305, 11293, 11270, 11303, 11372, 11417, 11411, 11377, 11345, 11332, 11323, 11306, 11305, 11356, 11441, 11475, 11434, 11402, 11446, 11503, 11474, 11383, 11351, 11422, 11522, 11576, 11580, 11548, 11491, 11451, 11455, 11450, 11379, 11293, 11290, 11343, 11330, 11231, 11166, 11197, 11245, 11237, 11224, 11263, 11314, 11331, 11359, 11439, 11506, 11484, 11406, 11361, 11356, 11345, 11337, 11381, 11449, 11445, 11327, 11161, 11031, 10961, 10937, 10953, 11009, 11088, 11158, 11193, 11205, 11233, 11298, 11359, 11352, 11277, 11195, 11150, 11136, 11128, 11113, 11077, 11009, 10946, 10941, 10992, 11039, 11065, 11101, 11157, 11180, 11157, 11145, 11179, 11216, 11202, 11163, 11144, 11125, 11074, 11026, 11027, 11051, 11038, 10995, 10977, 10994, 11014, 11025, 11047, 11060, 11027, 10965, 10942, 10996, 11073, 11105, 11093, 11082, 11092, 11087, 11024, 10923, 10854, 10866, 10929, 10981, 11007, 11039, 11079, 11092, 11078, 11077, 11098, 11092, 11030, 10968, 10972, 11023, 11052, 11028, 10989, 10964, 10940, 10902, 10850, 10807, 10796, 10826, 10874, 10904, 10896, 10864, 10831, 10810, 10817, 10855, 10879, 10854, 10816, 10843, 10932, 10990, 10969, 10930, 10931, 10935, 10889, 10831, 10835, 10887, 10925, 10939, 10948, 10921, 10825, 10719, 10700, 10755, 10774, 10731, 10720, 10815, 10948, 11012, 10992, 10948, 10913, 10869, 10804, 10741, 10709, 10719, 10760, 10820, 10888, 10952, 11000, 11021, 11028, 11025, 10991, 10902, 10789, 10733, 10762, 10810, 10792, 10715, 10645, 10616, 10621, 10654, 10708, 10747, 10727, 10677, 10671, 10728, 10779, 10775, 10740, 10715, 10703, 10689, 10683, 10701, 10720, 10710, 10676, 10658, 10680, 10723, 10737, 10695, 10616, 10556, 10556, 10604, 10655, 10682, 10692, 10680, 10634, 10568, 10532, 10562, 10626, 10659, 10633, 10579, 10540, 10541, 10576, 10625, 10669]
98A0669J9nj1%J7K1Rk4n8o3j9M4N2nm8j9K5mp3o4L0O7j8j08o7M9R0K9l6n6n4l0K8Q0O4J1J
94A0543K7K0j2mK1j0q1p5PM3mk4M0P1Mo3k0N1K8m6n6rkl1k0K7K0l7o4k1K5K7J1OONJ1J2kq
89A0416K6N8K7n1q7n2qj7n4n9%P3Q6J7n4l1O0R5K2o1n2PQm6o4l2j0j8lM9Q5O2K9J8J1j0k7
84A0413k9k5j9kJ4Rj0pRom4m2J6O1K4o0j04o9KN0M6K0KJ2L0L3Rl2n3l9KJ4j8n0j6O1R8O5P
80A0372l0n3n4oN7M7l4o8rK9l8j09n2O7Q9Mo6p2p0o4oP0O0k0m0K4M6j5m4K4P7J5o9m5M4P1
75A0132J4l3l6k6j5J3K6j5n9k4O0P3j5r1m1P4J09J7r1r6pO2M6Ll%m9j17r1L6J30R7qn8k7K5
71A0015L9J9j6m9n5j5L7M7Rl3l8lL8M9On2o2j1M2L2k5n7k3L9P2N3nn5n8j0M4N7K1j2lL0L1
66A0098j7o0n4j3Orj3J0K1rl9k0J1Ll6m1jL4K9J8L8P1P7K1p3j40j14k0M0J2l7l3NJk5mN5P3
$$ y = [10669, 10688, 10683, 10672, 10672, 10689, 10710, 10719, 10695, 10637, 10574, 10555, 10599, 10651, 10646, 10598, 10579, 10604, 10600, 10527, 10463, 10493, 10560, 10542, 10434, 10367, 10416, 10506, 10535, 10499, 10443, 10389, 10359, 10387, 10467, 10531, 10542, 10543, 10570, 10590, 10578, 10574, 10595, 10585, 10504, 10429, 10436, 10479, 10475, 10451, 10491, 10562, 10566, 10503, 10483, 10534, 10562, 10516, 10460, 10451, 10449, 10418, 10398, 10425, 10445, 10408, 10344, 10323, 10348, 10375, 10386, 10392, 10398, 10403, 10414, 10426, 10424, 10416, 10442, 10500, 10527, 10476, 10389, 10337, 10329, 10312, 10258, 10199, 10199, 10272, 10358, 10375, 10321, 10290, 10350, 10445, 10467, 10406, 10354, 10361, 10369, 10323, 10259, 10227, 10217, 10199, 10196, 10245, 10330, 10392, 10421, 10439, 10450, 10440, 10413, 10384, 10359, 10340, 10338, 10352, 10361, 10351, 10344, 10353, 10347, 10303, 10261, 10277, 10338, 10362, 10302, 10198, 10129, 10131, 10181, 10227, 10247, 10249, 10261, 10291, 10324, 10333, 10301, 10248, 10209, 10211, 10225, 10207, 10157, 10141, 10202, 10300, 10365, 10372, 10342, 10289, 10235, 10229, 10286, 10333, 10299, 10231, 10222, 10251, 10213, 10104, 10052, 10119, 10208, 10212, 10146, 10074, 10004, 9940, 9934, 10004, 10064, 10044, 10004, 10028, 10074, 10059, 10015, 10039, 10116, 10131, 10062, 10017, 10061, 10132, 10146, 10113, 10077, 10051, 10036, 10049, 10075, 10060, 10001, 9977, 10037, 10110, 10095, 10004, 9963, 10037, 10146, 10163, 10072, 9976, 9969, 10031, 10077, 10080, 10077, 10077, 10028, 9911, 9820, 9856, 9986, 10083, 10075, 10017, 9990, 10015, 10054, 10073, 10057, 10008, 9953, 9938, 9975, 10022, 10031, 9998, 9960, 9957, 9995, 10044, 10050, 9998, 9936, 9925, 9967, 9999, 9974, 9917, 9894, 9933, 10005, 10058, 10053, 9998, 9940, 9930, 9974, 10031, 10052, 10040, 10037, 10067, 10098, 10081, 10021, 9967, 9954, 9960, 9951, 9938, 9948, 9969, 9960, 9921, 9901, 9912, 9915, 9879, 9838, 9837, 9871, 9900, 9918, 9956, 10027, 10104, 10125, 10052, 9912, 9798, 9778, 9818, 9830, 9793, 9760, 9765, 9766, 9741, 9737, 9792, 9865]
62I865L6QQj3m6l3K4L3k4n4%O2N1Jk1k3m2n1k2K1J9ooJ4J8kj4oJ2K0J3j4l4l0j2j1j4J2M8
57I787L6j2l4j0J0lj3ok0m8k7K9M1j1l5J3M1Lk3J8N8J7k9pK9j4q2p7j9jqK9O4K2n2n3rj7o0
52I527j6J02J37L7p0p1oL2M0L7J9LK0M8Nr8j43p7KRj3J5M4J6k9mP3R7L6n1q2m9QM1J5m0o5
48I549k6L2M2Ml9o1n8k6K0N6N6M8O8Q9N5m7j41j47o5K4N2K6j%K8O8R5O7lo2m9QL7K1jj8o5
43I636j08o4N7J31P4k3l7K1M7J1l6o0o1l4RJ5l6p9n5j0j2k9MN5N4K3K8M4Jn8l2M8P0Nn1n8
39I490n7n0RP9N2n5r1j9K9l6j01o4J0J9qJ2M0J5k6kP2R5M5j7l6j6J3J8k3p2o3kK6j3m7k5P
34I208j1l3kN0N5J3j7k7k6kM4O7M1RRLl5o6n2k2j0QN2P7M9N%Prj5J9L1k0p3n1PJ0l2l7plk7
29I187j2M0O4L5j5n0o6m8JL3J0k6pM3M8PoL0N4K7j4l6m7n6n1l6j2J2L0K8J9L7O3L8m5r0l9
$$ y = [9865, 9901, 9909, 9917, 9904, 9858, 9825, 9849, 9882, 9858, 9804, 9804, 9866, 9917, 9918, 9897, 9874, 9832, 9781, 9759, 9780, 9799, 9793, 9787, 9801, 9819, 9817, 9803, 9797, 9809, 9829, 9842, 9828, 9794, 9764, 9752, 9741, 9727, 9739, 9787, 9823, 9811, 9777, 9767, 9777, 9774, 9761, 9755, 9735, 9687, 9660, 9689, 9730, 9719, 9684, 9697, 9738, 9741, 9718, 9736, 9794, 9811, 9782, 9775, 9804, 9790, 9708, 9631, 9612, 9611, 9603, 9632, 9696, 9718, 9666, 9613, 9604, 9587, 9527, 9511, 9613, 9750, 9787, 9717, 9646, 9640, 9672, 9712, 9749, 9768, 9771, 9791, 9839, 9844, 9746, 9603, 9526, 9528, 9537, 9524, 9539, 9583, 9599, 9570, 9566, 9639, 9736, 9772, 9721, 9639, 9590, 9598, 9639, 9654, 9614, 9549, 9523, 9555, 9597, 9601, 9562, 9501, 9443, 9417, 9437, 9493, 9549, 9597, 9665, 9754, 9809, 9762, 9621, 9474, 9409, 9433, 9485, 9511, 9510, 9510, 9538, 9606, 9701, 9768, 9765, 9703, 9654, 9662, 9699, 9720, 9719, 9701, 9636, 9528, 9464, 9521, 9652, 9726, 9703, 9666, 9687, 9734, 9745, 9709, 9649, 9588, 9554, 9563, 9578, 9542, 9463, 9408, 9398, 9386, 9357, 9361, 9416, 9470, 9493, 9521, 9565, 9566, 9508, 9476, 9524, 9594, 9599, 9548, 9490, 9433, 9383, 9392, 9471, 9523, 9468, 9377, 9358, 9387, 9351, 9250, 9186, 9196, 9215, 9207, 9219, 9259, 9274, 9248, 9246, 9318, 9413, 9458, 9441, 9405, 9389, 9402, 9420, 9397, 9325, 9262, 9260, 9286, 9273, 9226, 9201, 9208, 9197, 9164, 9162, 9212, 9267, 9280, 9263, 9236, 9210, 9208, 9252, 9319, 9360, 9369, 9378, 9381, 9346, 9280, 9228, 9206, 9196, 9204, 9256, 9333, 9382, 9387, 9387, 9394, 9385, 9370, 9389, 9420, 9400, 9327, 9276, 9283, 9293, 9261, 9224, 9217, 9214, 9187, 9175, 9215, 9279, 9314, 9299, 9249, 9183, 9135, 9136, 9169, 9179, 9153, 9146, 9189, 9237, 9244, 9238, 9268, 9322, 9349, 9335, 9299, 9252, 9196, 9145, 9109, 9097, 9109, 9139, 9167, 9186, 9223, 9286, 9324, 9279, 9189, 9150]
24I150K2Pn1n9k7j3k0j2j5n9p3MR7Q3Jj1N4Q3M3J2Jn2j20q3M4R8J7o3l4K5J4k1J7P7O6Mj8
20I188PJ7j4n2p9q5n6MM0K8J1L0M3Jo0n9OO7P1K7j2nK8L2j9p4p1l2l6n8j5Q7J29M9n4o6j3
15I005J8J5K4L5J9j2j8lJ0J3Jm1r6r3j5M9L0k7m1j4rl0l3oJ7K3K6K6K6L0L2Ln3o9k7J2knN1
11H871J00N6l5n4nJ1m2q5n6J2N7N8K8qj0K1K3l3p8k3R2J24M6l7l2J5L1J1j7l8o0m9J1O8P3
6I046K8k6m9m4k8k4l6l5j7mk0l2NO5P1J2m9n4j7J8M2M6J9k7m8j9K7L9Qm2o6n1rK8L9L7K7r
2H851o7r1l8L4L4k6m6QM5Mo3o5k3JLM0R9R8Pq7p9J3P8N3j5m0j2J0j3m1l2rk0m9l2K5N2Ln4
-3H556l7L2O6K9j5nM3N8K0l6m9k6JNlJJ2J4%j3j6j3qj1l0n2m6KN3N0nl7mN5O1lp3p4j5M2M2
-8H571Oj8pK4L9K2j8n0l6J4M4J0m5m4J0N2M5K9L7K7j9n5j8M4L8l8r1n7J1M3L6J9Mk2n2n4l5
$$ y = [9150, 9172, 9179, 9128, 9069, 9042, 9029, 9009, 8997, 8982, 8923, 8850, 8854, 8951, 9034, 9035, 9024, 9078, 9161, 9204, 9216, 9217, 9165, 9045, 8962, 9006, 9104, 9121, 9058, 9024, 9049, 9063, 9042, 9059, 9136, 9202, 9206, 9188, 9195, 9212, 9198, 9146, 9067, 8982, 8926, 8930, 8970, 8998, 9009, 9039, 9082, 9083, 9023, 8964, 8970, 9037, 9108, 9135, 9123, 9118, 9146, 9178, 9159, 9085, 9014, 8982, 8946, 8888, 8873, 8960, 9089, 9138, 9084, 9018, 9005, 9023, 9038, 9062, 9097, 9116, 9104, 9086, 9083, 9093, 9106, 9107, 9066, 8970, 8877, 8862, 8911, 8941, 8914, 8873, 8859, 8850, 8820, 8787, 8781, 8798, 8821, 8847, 8873, 8899, 8929, 8961, 8964, 8911, 8842, 8815, 8827, 8825, 8820, 8871, 8971, 9027, 8992, 8938, 8933, 8944, 8902, 8817, 8761, 8773, 8830, 8888, 8916, 8908, 8898, 8919, 8942, 8909, 8831, 8808, 8900, 9024, 9070, 9033, 9001, 9016, 9047, 9058, 9041, 9003, 8943, 8894, 8905, 8973, 9046, 9074, 9048, 8999, 8955, 8927, 8903, 8867, 8832, 8815, 8811, 8791, 8759, 8764, 8829, 8900, 8912, 8863, 8809, 8792, 8810, 8852, 8898, 8917, 8890, 8842, 8823, 8850, 8889, 8897, 8855, 8789, 8738, 8729, 8757, 8796, 8833, 8860, 8851, 8784, 8693, 8655, 8689, 8723, 8697, 8651, 8659, 8704, 8708, 8645, 8580, 8557, 8558, 8561, 8601, 8700, 8798, 8805, 8718, 8639, 8652, 8730, 8783, 8768, 8728, 8716, 8726, 8713, 8672, 8640, 8631, 8611, 8562, 8530, 8555, 8607, 8610, 8556, 8519, 8551, 8617, 8646, 8631, 8626, 8669, 8727, 8747, 8711, 8662, 8636, 8637, 8642, 8639, 8640, 8652, 8666, 8666, 8653, 8637, 8624, 8616, 8605, 8575, 8523, 8477, 8479, 8532, 8582, 8577, 8540, 8536, 8591, 8652, 8649, 8576, 8502, 8487, 8529, 8571, 8577, 8559, 8552, 8576, 8615, 8637, 8619, 8569, 8533, 8547, 8591, 8601, 8556, 8512, 8522, 8574, 8619, 8648, 8685, 8712, 8693, 8638, 8620, 8664, 8702, 8664, 8573, 8516, 8527, 8570, 8606, 8625, 8629, 8607, 8555, 8501, 8466]
-13H466k1k3j8J3M9N0J4k1k6pPK4N5Q1N8j3p5q6o0k4J7M8L2l0p6m4L9R6Q8M0j1m1l9rJ0kj4
-17H547LL0K3jrmj3l0k5LJ7jk4l3k5rJ8K9Ml3k6K1N1L0ql0l9l6j2K5K2l0o5k4M6N0k5o6OJ18
-22H475J32K4o5m9rm7j02m1J02J33mj32q7M6Q4J3m0l0qlJ7L8J7j7nK0j4p9p6qJ6j8j6N4Q5
-26H406J6n7m2Kql7j2M0N0K4J8K8J4qlNk3n8n4j4J3K0L1L2Jn2p4n2jN1Q2O4Pk9k0jJOL4M7
-31H447Pm9o1j7M9Q9P0j6r9r8j7K6j0l5K2Q8O4j8o0n0m5m0LM4J2o2q1l1QQJ1L3K4pj3J2Qk1
-36H195%P5J03L1n2n8j3kl1m1l0l4n0l1K9P5O4J5qJ2K6j3q0r4k9L6L4j0k1J6L8K9K0L1L1O
-40H269k0l0l8m1j1L4M5J4oJ1K8Lm3o8o3n1m4l2nL3O7O6K3k0j5K1K4j6n2l6PL6L4Ll6m5lN5
-45H098O5K2j1JQl0o6m5K2O2L4l2p6o2j2J1j4l6J1P3O3qk9L6Q1K2n9l7N1O2j9p3l8Ok1p0o1
$$ y = [8466, 8445, 8422, 8404, 8417, 8466, 8516, 8530, 8509, 8483, 8476, 8483, 8507, 8562, 8643, 8701, 8688, 8613, 8527, 8467, 8443, 8460, 8508, 8540, 8510, 8434, 8390, 8429, 8525, 8613, 8653, 8642, 8601, 8562, 8553, 8563, 8561, 8547, 8550, 8580, 8603, 8602, 8593, 8589, 8576, 8546, 8521, 8524, 8541, 8540, 8516, 8483, 8458, 8449, 8467, 8496, 8500, 8467, 8441, 8462, 8513, 8543, 8535, 8505, 8466, 8430, 8418, 8443, 8465, 8435, 8370, 8346, 8392, 8442, 8417, 8351, 8357, 8475, 8607, 8631, 8566, 8517, 8508, 8461, 8359, 8318, 8420, 8553, 8549, 8417, 8330, 8376, 8460, 8473, 8433, 8403, 8395, 8392, 8409, 8447, 8464, 8447, 8442, 8462, 8448, 8369, 8293, 8285, 8301, 8283, 8267, 8321, 8406, 8422, 8365, 8323, 8325, 8317, 8280, 8268, 8308, 8358, 8382, 8400, 8428, 8442, 8434, 8431, 8436, 8413, 8355, 8301, 8287, 8300, 8320, 8351, 8383, 8384, 8332, 8258, 8206, 8205, 8256, 8338, 8402, 8409, 8380, 8360, 8359, 8360, 8366, 8400, 8447, 8454, 8405, 8344, 8327, 8376, 8465, 8535, 8519, 8420, 8322, 8305, 8331, 8321, 8286, 8308, 8396, 8460, 8442, 8382, 8332, 8287, 8247, 8250, 8294, 8306, 8244, 8163, 8132, 8140, 8148, 8159, 8192, 8216, 8209, 8196, 8208, 8216, 8195, 8195, 8270, 8373, 8404, 8352, 8294, 8281, 8279, 8248, 8207, 8177, 8143, 8093, 8062, 8091, 8166, 8230, 8245, 8237, 8249, 8275, 8262, 8182, 8088, 8059, 8095, 8129, 8119, 8098, 8114, 8152, 8181, 8201, 8232, 8263, 8269, 8249, 8219, 8181, 8140, 8129, 8163, 8208, 8222, 8216, 8227, 8255, 8258, 8215, 8147, 8084, 8033, 7989, 7957, 7952, 7985, 8052, 8118, 8141, 8121, 8106, 8127, 8151, 8135, 8083, 8047, 8054, 8090, 8124, 8127, 8091, 8046, 8043, 8098, 8163, 8185, 8174, 8175, 8183, 8153, 8087, 8042, 8064, 8126, 8160, 8128, 8052, 7990, 7978, 7989, 7975, 7939, 7950, 8023, 8086, 8078, 8049, 8085, 8166, 8188, 8129, 8092, 8143, 8205, 8186, 8113, 8075, 8081, 8060, 7990, 7929]
-49G929mL2L9N8P6M2l9q3n0JOj0J9Q0Q8J3p0q5m1KK0J9J3KlJ0K2Qk1l4j0L3N9L2l3q9q6m2
-54G903k4m0k0N9J18P9j5o3m4k9m0l5KJ9qk7qJ8K0J4L2M8K6k3n8n3j3L7O9O2K9nl1m8n6l6
-58G859OM0M7J9k6n4l1K5M2%l5kN8O0Ql5n2p2p7k9M3O0K8J6L4J8l9n0J3N3J2n1o1l2j9j0O
-63G772Mk1k1J9N1L1J2K6L5J7J6L9Qj03j75r9M4R9N2QQkl3m6l2m1n4pQ8J20L5p5r5j7O9Q8
-67G820L7k9n7l9oJ7K5Pm1p9l8O8J20N5m4p3m7l8n1k2M0O7N2K9Pl8p4m1M2Q0L6l0n5l3PL9
-72G713L0k1n5j9M3N3J3orm9j08r7KR6J13P8L7jl2l4k2l1m4j3M4N1pm3rL3L1K0L0J5m3o5M
-76G698P9M6p7j49j02rL5J9lJJ6RolK1K5mj9L0R8Q6nq5q0k9J3L8M7L3jk1j4j7l2j5M1O6K5
-81G755k4j7K6L6Ok5m4n3l1K7P6N2l7j04r6l4K6N9P2O5K7l3o1k1L1J4n3o1K6Q7J7j00j01l
$$ y = [7929, 7925, 7957, 7996, 8054, 8130, 8172, 8133, 8050, 8000, 8001, 8007, 7997, 8016, 8096, 8184, 8197, 8127, 8042, 8001, 8003, 8023, 8042, 8055, 8057, 8054, 8064, 8086, 8094, 8073, 8039, 8029, 8062, 8121, 8153, 8120, 8031, 7945, 7903, 7879, 7839, 7819, 7878, 7996, 8075, 8060, 7997, 7953, 7924, 7884, 7849, 7851, 7870, 7862, 7835, 7827, 7845, 7865, 7879, 7911, 7959, 7985, 7962, 7904, 7851, 7838, 7875, 7944, 8006, 8035, 8030, 7999, 7951, 7895, 7859, 7865, 7905, 7952, 7971, 7945, 7891, 7860, 7885, 7927, 7927, 7892, 7890, 7948, 8008, 8016, 7981, 7929, 7857, 7780, 7751, 7794, 7854, 7882, 7898, 7932, 7950, 7911, 7861, 7874, 7927, 7939, 7888, 7827, 7795, 7776, 7766, 7772, 7776, 7755, 7734, 7753, 7804, 7835, 7847, 7873, 7908, 7925, 7941, 7980, 7988, 7885, 7710, 7611, 7655, 7754, 7806, 7814, 7822, 7820, 7787, 7741, 7709, 7668, 7614, 7607, 7695, 7815, 7850, 7775, 7680, 7663, 7732, 7820, 7857, 7828, 7771, 7732, 7726, 7743, 7768, 7775, 7734, 7655, 7617, 7685, 7805, 7860, 7816, 7743, 7696, 7658, 7607, 7585, 7625, 7692, 7744, 7773, 7780, 7742, 7668, 7627, 7669, 7749, 7785, 7755, 7700, 7667, 7674, 7713, 7743, 7722, 7667, 7648, 7691, 7744, 7757, 7751, 7742, 7693, 7585, 7488, 7490, 7586, 7699, 7777, 7814, 7813, 7781, 7747, 7725, 7694, 7650, 7637, 7681, 7732, 7725, 7682, 7673, 7706, 7737, 7757, 7787, 7802, 7759, 7694, 7698, 7777, 7823, 7746, 7597, 7495, 7486, 7521, 7540, 7537, 7538, 7554, 7563, 7557, 7554, 7575, 7600, 7596, 7577, 7607, 7705, 7791, 7786, 7701, 7621, 7592, 7605, 7643, 7690, 7723, 7722, 7701, 7687, 7670, 7638, 7623, 7664, 7730, 7755, 7731, 7714, 7740, 7776, 7782, 7757, 7713, 7660, 7629, 7656, 7732, 7784, 7747, 7643, 7547, 7513, 7539, 7598, 7670, 7735, 7762, 7729, 7668, 7647, 7678, 7692, 7639, 7578, 7604, 7691, 7708, 7608, 7507, 7504]
-85G504N4K1oJ5J7j7rN4O7no6m3pl3o6l1J5Lj5L8Q5L8m6m5J8K7k0k2K8K7k5k6M6O6j3p7m3
-90G508J8%o3o5qL4K9Qkj3j9rRJ0OJ7M4N1L3Mk9p2r6o2L4J13J01K7j3J0J5n2j23q4L5R9N9
-94G554j%J6pl8j4L0L4Poql8q2r9r0q2n7J3Q6Q6J7m0l1J8O5Q4O9L4K9N2M8k1p7m3K8K6m9p8
-99G435l1J6K2K8N0K8o2j24p6K8Q6P2K1m0p7m6M2Q9K3r0j13j8P7P4po0k0M8M3n2j17n9O4J11
-103G365M4l2l4pk1n0j8N9J00O2mk6lK1J2k8n1l7jJ0nj3JK1L0K5K2K3L3L6Nn8r3n1J9K5l3
-107G348o6l9j4l0l7ON4M7jl0k3nJ4M3N1J8l0l1J3M4J2o2j01n7L9R1O3J8L4P1L4p4j26n8M2
-112G258N9Qk9k2ML7N8K3p6j43r4J7O3J4l2pN1P1N9N4O4N6Qn9r3o7j0J1j5l9l1k1m3n5j4N0
-116G115N5Qj0K9N5J0o8r8o0QM8M2J5pKK5K8J3%MK0K6J7pk8l3k0j6j7%M1O4K5l9o9m4qPNj
$$ y = [7504, 7558, 7579, 7573, 7588, 7605, 7588, 7579, 7633, 7700, 7695, 7629, 7586, 7579, 7546, 7480, 7449, 7464, 7467, 7452, 7490, 7575, 7613, 7567, 7522, 7540, 7567, 7547, 7525, 7553, 7580, 7555, 7529, 7575, 7641, 7628, 7551, 7508, 7526, 7526, 7463, 7398, 7390, 7424, 7453, 7461, 7459, 7446, 7427, 7418, 7427, 7437, 7443, 7460, 7504, 7555, 7588, 7592, 7563, 7491, 7395, 7333, 7367, 7480, 7581, 7608, 7595, 7605, 7620, 7568, 7445, 7361, 7396, 7495, 7554, 7553, 7553, 7569, 7562, 7524, 7510, 7540, 7574, 7581, 7575, 7567, 7529, 7447, 7348, 7258, 7176, 7119, 7132, 7218, 7304, 7321, 7281, 7250, 7268, 7333, 7417, 7486, 7520, 7549, 7601, 7649, 7628, 7551, 7508, 7536, 7562, 7513, 7435, 7404, 7420, 7442, 7470, 7520, 7548, 7486, 7362, 7286, 7314, 7400, 7472, 7493, 7453, 7376, 7330, 7372, 7461, 7484, 7394, 7281, 7263, 7340, 7414, 7407, 7347, 7327, 7375, 7418, 7366, 7249, 7190, 7254, 7365, 7409, 7377, 7343, 7336, 7315, 7265, 7247, 7306, 7406, 7468, 7464, 7438, 7435, 7456, 7468, 7440, 7389, 7352, 7351, 7361, 7356, 7343, 7344, 7365, 7395, 7420, 7442, 7465, 7498, 7534, 7539, 7481, 7388, 7337, 7356, 7381, 7348, 7282, 7243, 7229, 7199, 7162, 7168, 7222, 7269, 7268, 7238, 7215, 7210, 7224, 7267, 7318, 7336, 7306, 7275, 7288, 7332, 7344, 7282, 7181, 7124, 7163, 7254, 7317, 7335, 7369, 7440, 7474, 7400, 7274, 7216, 7258, 7317, 7325, 7296, 7274, 7278, 7315, 7373, 7396, 7320, 7177, 7083, 7100, 7163, 7177, 7145, 7138, 7189, 7260, 7319, 7373, 7437, 7493, 7501, 7442, 7349, 7282, 7272, 7283, 7268, 7229, 7198, 7177, 7134, 7079, 7065, 7115, 7170, 7178, 7168, 7197, 7252, 7262, 7194, 7096, 7036, 7044, 7092, 7134, 7149, 7142, 7144, 7169, 7197, 7210, 7210, 7214, 7234, 7260, 7277, 7270, 7242, 7209, 7189, 7173, 7156, 7156, 7197, 7261, 7286, 7247, 7178, 7134, 7126, 7133, 7138, 7137]
-121G137j1j6pJ4L7O1Q5O5j8j11j23m7K8L1%%J8J0k1k2J4L1on2n9l1j1j0kK2M1M5L8K5kl0
-125G123l5j3K0M0L9Qn0r5p3QO2L3j8j2L6N3K6%qk3m9m7j8oj4MM8O3J7k6j5K8N2M0J6j2l1
-130G171j9PJ0k3m8m8m5m8k2K6M4J3j2j2l0p2n7L0R1L8m9n2RL0j1l6j9%LJ0Qj5j4N3J28J18
-134G157M2RK7mj01j54r1QK8l1p6n1J1N8M8km1l2LK7M0N3L2j5l1K6P1J7o5m1O0P1m4j29p3
-139F807K5L9MJ3L6j7j05j21m4M0O5O4O9O1J9k4k5J2M6M9K4%rj7m0m8k6PQj4qJ1j2o8q3j7
-143F721O2P9M6J6mj7j1J9L8K6NQJ8J2%lk0o4r0m7M1R2P1J7rPL3L5Qj9k9k1j6rPJ7Jk8m1l2
-148F919k1qJ5K7Kl5l2lMqQM3L3k1n2l4j8k3%N7O6mo7m4J7K3k0l5j4J0K7M7L8pk6J8O7L6n1
-153F934r5o2mK2J3k3o9q3m5J1K7K3L3M0K3RL8Q7Q5K7k1k8l7o5q5o2qL7M7J7j8k5j1qj6LM2
$$ y = [7137, 7126, 7110, 7103, 7117, 7154, 7215, 7300, 7365, 7347, 7236, 7113, 7066, 7094, 7125, 7125, 7125, 7143, 7153, 7132, 7110, 7124, 7155, 7149, 7097, 7038, 7007, 6996, 6986, 6984, 7006, 7047, 7092, 7130, 7155, 7153, 7123, 7088, 7075, 7095, 7135, 7174, 7182, 7132, 7037, 6964, 6972, 7034, 7067, 7049, 7037, 7073, 7126, 7152, 7152, 7144, 7121, 7072, 7025, 7007, 7001, 6987, 6991, 7039, 7102, 7119, 7093, 7078, 7106, 7158, 7198, 7214, 7202, 7171, 7152, 7159, 7169, 7146, 7098, 7050, 7005, 6957, 6935, 6961, 7005, 7018, 7006, 6994, 6964, 6892, 6835, 6865, 6956, 6994, 6945, 6893, 6902, 6932, 6921, 6885, 6866, 6866, 6869, 6879, 6887, 6872, 6858, 6911, 7039, 7157, 7199, 7208, 7235, 7231, 7130, 6976, 6885, 6893, 6921, 6890, 6814, 6763, 6774, 6832, 6880, 6878, 6837, 6805, 6808, 6835, 6875, 6928, 6960, 6945, 6914, 6940, 7011, 7028, 6963, 6922, 6982, 7053, 7009, 6880, 6807, 6832, 6871, 6875, 6888, 6924, 6907, 6802, 6681, 6637, 6677, 6742, 6806, 6875, 6936, 6955, 6931, 6906, 6918, 6964, 7013, 7037, 7037, 7028, 7011, 6971, 6923, 6897, 6904, 6912, 6898, 6890, 6901, 6889, 6821, 6738, 6721, 6783, 6862, 6908, 6924, 6920, 6903, 6892, 6911, 6949, 6975, 6980, 6988, 7006, 7018, 7018, 7015, 6995, 6931, 6841, 6794, 6835, 6927, 6998, 7015, 7006, 7013, 7046, 7081, 7089, 7070, 7041, 7020, 7004, 6995, 7002, 7019, 7020, 6992, 6951, 6919, 6898, 6890, 6905, 6932, 6934, 6899, 6867, 6864, 6868, 6860, 6868, 6911, 6944, 6923, 6871, 6837, 6819, 6796, 6796, 6853, 6919, 6915, 6848, 6804, 6821, 6844, 6824, 6789, 6775, 6785, 6812, 6859, 6897, 6890, 6864, 6882, 6949, 6985, 6934, 6839, 6777, 6773, 6795, 6808, 6785, 6716, 6633, 6588, 6599, 6626, 6649, 6682, 6722, 6745, 6754, 6792, 6879, 6964, 6991, 6970, 6942, 6905, 6840, 6755, 6693, 6685, 6722, 6769, 6786, 6768, 6743, 6732, 6724, 6708, 6711, 6753]
-157F753M3ql4jK7nm0pL9Rn5m6K4O1L8J9K5ln6n4J6M8k1j09j01kQ5R7M9j0m5n5m7k2K5N7K8
-162F722m7p7j5O7O5Jl7k4njJ3K6%l6k1L9P1M1lk3k8l2l0k5k9k2J5M2K7ojJ7pl9j9K0Ol6l1
-167F578Qqo3m9M9J02N8lj3j4l6k3L6N5kl6K5R6O9k2q6q7n5JN6N3j4o8n8l2l9l9OM1J5l2l1
-171F438KJ9K5L9L5NkK8L8rm1lM3K3j8oL5L4kj3LNKKk1p8r6k8M5M1nJM3M6J9K7M4Rn7p1l2
-176F569j0j7KL3K7nML9L0j7l0rk1o6o4j1J0k3m0nJ9RJ0L3L0j5l3jK5J9K2L9J4n7p6j1N7L4
-181F514l4o1m3j9J1N6O5J1m9m7pjj8LN1O5J8l5l2J7O9Q0M3j3n1m9rL7N4J7n4q0k3O0P0Lm9
-185F570k9J7L5L2L2K9Ll8p8j06q5lP6O3k1o2k0L7M1M3Q0R5K2q4j14o2kJ3LjMJ5J9rn9q0m6
-190F330J3M8N6L9on2l5M2Q5L3m4m1K1M8J2l0m3m0l0J1N7O1J8k0l5l0j7QJ0k8o6l7L7O8L8
$$ y = [6753, 6796, 6788, 6754, 6753, 6780, 6775, 6735, 6728, 6767, 6776, 6721, 6675, 6699, 6760, 6798, 6817, 6842, 6839, 6783, 6729, 6745, 6793, 6772, 6663, 6562, 6560, 6645, 6742, 6791, 6781, 6736, 6681, 6634, 6612, 6637, 6694, 6722, 6675, 6598, 6583, 6650, 6715, 6716, 6679, 6655, 6650, 6649, 6662, 6688, 6688, 6652, 6631, 6670, 6741, 6782, 6779, 6756, 6728, 6696, 6666, 6641, 6612, 6590, 6605, 6647, 6674, 6668, 6667, 6684, 6677, 6638, 6619, 6639, 6645, 6609, 6578, 6586, 6578, 6515, 6466, 6515, 6617, 6675, 6672, 6659, 6645, 6609, 6586, 6622, 6677, 6675, 6639, 6664, 6760, 6829, 6807, 6721, 6634, 6579, 6580, 6636, 6689, 6675, 6607, 6549, 6517, 6478, 6439, 6445, 6486, 6501, 6469, 6438, 6440, 6459, 6484, 6523, 6558, 6563, 6561, 6589, 6627, 6618, 6577, 6574, 6617, 6640, 6622, 6616, 6651, 6685, 6683, 6670, 6673, 6678, 6680, 6682, 6661, 6583, 6487, 6459, 6504, 6545, 6540, 6541, 6584, 6630, 6649, 6676, 6720, 6729, 6672, 6601, 6569, 6559, 6542, 6544, 6577, 6604, 6599, 6603, 6642, 6672, 6655, 6625, 6616, 6595, 6529, 6465, 6454, 6464, 6441, 6401, 6396, 6415, 6424, 6434, 6467, 6497, 6482, 6449, 6448, 6473, 6492, 6514, 6553, 6567, 6510, 6434, 6423, 6480, 6514, 6480, 6419, 6376, 6357, 6368, 6424, 6489, 6500, 6451, 6404, 6397, 6396, 6378, 6381, 6432, 6497, 6515, 6480, 6448, 6465, 6534, 6614, 6657, 6644, 6593, 6544, 6535, 6572, 6626, 6643, 6589, 6509, 6486, 6546, 6616, 6619, 6570, 6541, 6558, 6593, 6625, 6657, 6686, 6689, 6651, 6573, 6467, 6382, 6379, 6455, 6518, 6497, 6435, 6415, 6452, 6493, 6536, 6616, 6711, 6733, 6649, 6535, 6473, 6471, 6484, 6487, 6486, 6490, 6505, 6524, 6515, 6456, 6376, 6330, 6343, 6391, 6447, 6486, 6480, 6428, 6393, 6435, 6520, 6553, 6509, 6468, 6489, 6537, 6549, 6519, 6476, 6436, 6406, 6417, 6474, 6535, 6553, 6533, 6498, 6468, 6451, 6459, 6469, 6441, 6375, 6338, 6375, 6443, 6481]
-194F481OONj9l0j7j4m8o1nO6N5l3q7k2J03J50N2r1j32m0O6N9l1q3n2oJlJ8L4Pk9j6M5Q9P4
-199F498K8lj1nJkj4k7j6J8L8J3n1j00r9n9k5j0j1%L7Q7J10P3%m1j3L1J7m4p3l0K7K4m0p5
-203F253l2N7J07O5l2r7q1j9J7J2MJ4K0nl3k7JK3L8M6M0Km1m4j5Mk4m9k2N6J02O3k3o6l5R
-207F288J8J0K3M4K6k1n6n7m4j9J2L5K9J1PKl5p5p2l1ooJ0L1Mn4n2K8R3Q5N3M7L3k7p0m0R
-212F233J9J5L5L6j6n8rO1L1o5r2j9L2kl3J3P3O2Kl3l3l4m7l7j0QLpqmKJj2k9l5lN6R7P9J9
-217F291j4J8N4K0o5q8j4M9J7n8p1j6K5K5J8J7%j1J5M4K4k5k9PJ8j3k7j5l2q1q1MQ6P1kl4
-221F127j1J1kk3j8PL1K9lm6o8n6k8QM4O7N8K4j0l6n3m6pJ8%j4K6Q0N4l9r4m9J8M5N1O2M1
-226F198l5r3p2qK5K4L3N4M1rm6l5MK3nn1o3j6M3N9L5K8L9L3pl7l1j7kK0L8J2m3n6j0L1K3
$$ y = [6481, 6487, 6493, 6498, 6479, 6449, 6432, 6418, 6370, 6309, 6304, 6370, 6425, 6392, 6305, 6283, 6386, 6536, 6588, 6497, 6365, 6325, 6391, 6450, 6419, 6336, 6284, 6278, 6279, 6276, 6294, 6328, 6335, 6306, 6290, 6335, 6424, 6498, 6526, 6523, 6512, 6507, 6508, 6506, 6492, 6465, 6449, 6467, 6505, 6518, 6467, 6367, 6268, 6209, 6184, 6174, 6163, 6163, 6200, 6287, 6397, 6470, 6470, 6429, 6416, 6447, 6464, 6420, 6347, 6317, 6344, 6368, 6328, 6253, 6221, 6278, 6385, 6450, 6418, 6321, 6240, 6221, 6238, 6250, 6254, 6268, 6288, 6283, 6250, 6223, 6224, 6247, 6285, 6331, 6371, 6373, 6332, 6288, 6273, 6277, 6253, 6204, 6182, 6238, 6340, 6403, 6380, 6314, 6279, 6288, 6306, 6316, 6339, 6383, 6409, 6388, 6332, 6275, 6231, 6212, 6224, 6259, 6288, 6299, 6306, 6308, 6273, 6198, 6126, 6095, 6089, 6083, 6093, 6124, 6128, 6074, 6022, 6050, 6143, 6228, 6281, 6328, 6361, 6334, 6264, 6224, 6233, 6252, 6267, 6302, 6338, 6322, 6264, 6255, 6316, 6347, 6282, 6190, 6171, 6203, 6201, 6168, 6181, 6254, 6316, 6318, 6285, 6252, 6218, 6171, 6134, 6124, 6132, 6135, 6128, 6120, 6116, 6118, 6119, 6107, 6078, 6043, 6040, 6096, 6193, 6272, 6291, 6277, 6295, 6349, 6369, 6304, 6216, 6202, 6251, 6268, 6210, 6139, 6123, 6148, 6173, 6191, 6208, 6208, 6197, 6212, 6256, 6280, 6255, 6226, 6233, 6251, 6238, 6211, 6196, 6164, 6083, 6002, 6006, 6092, 6163, 6161, 6127, 6116, 6127, 6125, 6102, 6084, 6091, 6122, 6151, 6148, 6102, 6034, 5978, 5950, 5958, 6002, 6069, 6127, 6151, 6141, 6105, 6052, 6006, 5999, 6017, 6017, 6003, 6029, 6109, 6163, 6124, 6030, 5981, 5999, 6044, 6095, 6157, 6198, 6163, 6070, 5998, 5990, 6015, 6039, 6072, 6126, 6167, 6158, 6112, 6077, 6081, 6104, 6099, 6048, 5985, 5969, 6012, 6071, 6106, 6134, 6173, 6206, 6199, 6162, 6131, 6114, 6112, 6132, 6170, 6182, 6139, 6083, 6073, 6104, 6127]
-230F127ok3m4p7n8K7R3O7Jk8k2l3n1n0l4k8kN6R4N1k3m1JL1K3QPPNRPj5l3k3LPKJ3J9ROK8
-235F110K7j8m1J9R2O8k9p0k1K4J0k2k5k8m6n5k7jjNL1N2L2%k0l2m7n4l9j4J3L4M5L3J5R%
-240F029j8k9kL1J9k4m5k4JMQK2K1jk3l0k2%L1L4j2n8m0K5N3K4k0m1m0nN7Q2J2q5p8K6Q4K5
-245E991o2o7j8Qlj3j4j7oJ1nm3l0N2J19R5K9kqm2p6m3L9P5L5j5j2K5M2J3m1p6o3j7K3K6J0
-249E920pk3l2j3K4N0M1J9Nj0k5j7Lll4l4J7O3O2K9on2j01r5k1L5J0n2n2MM2L3J3ok1j5K7
-254E778O0L3k4n5n0l7NQ3J23N9m2n2K3N9Mn3m7l6o5o0L3J28J09j1r6p0mK2LpPJ1j9n4m8j1
-258E699J4J1OK1L1J7kJ0K1PpJ4M5L6J0J7M1J8l8m9ML6mn5n2j8j3m0n3m8k6J0N0M7nl5J0P6
-263E806O9mn3l1J5J3l3n8k8M2P3K4n6p6j3N0L8j6k6K1N8L0k8n5l4JJ2j3m4l5J7N5K1n9r4
$$ y = [6127, 6121, 6098, 6054, 5977, 5919, 5946, 6039, 6106, 6107, 6079, 6057, 6024, 5973, 5923, 5889, 5861, 5859, 5915, 6009, 6060, 6037, 5996, 5997, 6028, 6051, 6059, 6066, 6073, 6078, 6087, 6094, 6079, 6046, 6023, 6026, 6033, 6035, 6048, 6067, 6076, 6082, 6110, 6137, 6119, 6078, 6097, 6189, 6257, 6228, 6158, 6137, 6161, 6171, 6149, 6124, 6096, 6050, 5995, 5968, 5967, 5966, 5971, 6002, 6054, 6086, 6086, 6066, 6034, 5987, 5933, 5894, 5880, 5893, 5927, 5972, 6005, 6020, 6029, 6029, 6011, 5982, 5980, 6011, 6030, 6006, 5961, 5937, 5938, 5942, 5950, 5972, 5993, 5992, 5969, 5939, 5917, 5917, 5948, 5982, 5970, 5912, 5872, 5897, 5950, 5974, 5954, 5913, 5873, 5868, 5925, 6007, 6019, 5934, 5856, 5882, 5966, 5991, 5929, 5862, 5844, 5852, 5849, 5836, 5822, 5805, 5799, 5810, 5805, 5762, 5732, 5784, 5903, 5998, 6027, 6025, 6017, 5975, 5899, 5856, 5895, 5970, 6005, 5990, 5978, 6003, 6045, 6058, 6017, 5941, 5878, 5861, 5884, 5910, 5920, 5913, 5890, 5858, 5845, 5869, 5919, 5960, 5979, 5984, 5974, 5949, 5932, 5935, 5932, 5898, 5864, 5881, 5944, 6006, 6035, 6029, 5977, 5876, 5781, 5760, 5795, 5805, 5753, 5701, 5705, 5747, 5780, 5793, 5787, 5766, 5751, 5778, 5838, 5871, 5847, 5792, 5742, 5705, 5710, 5793, 5916, 5975, 5933, 5881, 5904, 5963, 5967, 5914, 5867, 5831, 5766, 5706, 5739, 5867, 5976, 5965, 5869, 5799, 5795, 5817, 5820, 5813, 5820, 5831, 5812, 5758, 5710, 5699, 5713, 5724, 5730, 5751, 5782, 5799, 5797, 5807, 5828, 5835, 5828, 5842, 5887, 5923, 5933, 5950, 5991, 6009, 5971, 5922, 5926, 5962, 5958, 5903, 5851, 5833, 5820, 5780, 5727, 5679, 5653, 5663, 5713, 5760, 5755, 5720, 5730, 5806, 5875, 5871, 5818, 5787, 5802, 5815, 5782, 5724, 5696, 5738, 5811, 5835, 5779, 5703, 5690, 5740, 5778, 5762, 5736, 5757, 5815, 5845, 5817, 5762, 5728, 5729, 5741, 5728, 5684, 5649, 5666, 5721, 5742, 5683, 5589]
-267E589m2M9R4O7Ll5k3K6N8N0K0MLj3m0m3qJ8mm2m8j5J3J0j0k0kM6R9J02M2l7p3n7l8l5j7
-271E691K2N2N6N5N6J9m8q8o3l1n0q3n3J5L7RJ5O8P7Pn0k6J2j7o3l4M2M6m1j00m8N3R9O3N
-276E704k5k1kRNJJ0K0Mk4k1K7P6O8Om7l9J7N9L8k1n3k9RJ5pk2k6k9k7j4jkML7N9K1n9j05
-280E615p6j9Pnj2J2O0Q7N7k5r5j03n2PL6K9Lj4QN5O6J4m8m5jK3J6J2K2Qk5k8mLk0k1J6L6
-285E599J1j4mJ0oj0K6O3K9n1r0m6M3R9Q9J6n7o6j9J9Jk8k8k6n2o2lQ3R6K0n3l6L3N9J0o1
-290E594q5n3oJ7L2O2Q6N6k6q4p0j6J5K1K3Qm6r3p7jN4M7Ok1k5j6LK0K2J7K8N0O4N1K7Nj7
-294E672l9l6nL4L8mn9q3n6pK7L6L7L5K2Krj5l4n3m1KK7Jl5k8J0L9L7J0k3l7j0M0N0Ql2k4
-299E497Jpk8j4K0K6J0J5K7Km3l8K6N2%o2n2J1L6j0p1p8k8K1L8L7M9O6N4J5j1MJ3j4n0l9L
$$ y = [5589, 5547, 5596, 5690, 5757, 5760, 5725, 5702, 5728, 5786, 5836, 5856, 5860, 5863, 5850, 5810, 5767, 5759, 5777, 5773, 5731, 5683, 5668, 5681, 5691, 5681, 5661, 5659, 5705, 5804, 5906, 5948, 5911, 5838, 5781, 5743, 5708, 5691, 5713, 5765, 5821, 5876, 5932, 5951, 5903, 5815, 5752, 5721, 5671, 5588, 5535, 5550, 5587, 5596, 5611, 5679, 5756, 5763, 5713, 5687, 5699, 5682, 5619, 5585, 5627, 5673, 5632, 5532, 5484, 5537, 5636, 5699, 5704, 5679, 5658, 5656, 5665, 5670, 5671, 5681, 5701, 5705, 5681, 5660, 5687, 5763, 5831, 5837, 5790, 5751, 5768, 5827, 5865, 5844, 5791, 5762, 5771, 5786, 5779, 5757, 5731, 5702, 5675, 5661, 5660, 5658, 5662, 5699, 5758, 5779, 5720, 5615, 5539, 5520, 5527, 5522, 5510, 5522, 5582, 5669, 5726, 5701, 5606, 5503, 5451, 5458, 5494, 5523, 5526, 5512, 5520, 5575, 5641, 5655, 5607, 5562, 5561, 5584, 5600, 5612, 5634, 5642, 5617, 5589, 5585, 5588, 5568, 5547, 5563, 5599, 5610, 5596, 5592, 5602, 5596, 5586, 5612, 5675, 5704, 5653, 5563, 5517, 5560, 5659, 5748, 5764, 5707, 5641, 5622, 5641, 5642, 5614, 5586, 5560, 5508, 5446, 5443, 5526, 5622, 5642, 5589, 5553, 5586, 5645, 5655, 5594, 5509, 5456, 5450, 5467, 5499, 5561, 5647, 5703, 5677, 5593, 5523, 5507, 5522, 5543, 5566, 5574, 5528, 5435, 5358, 5357, 5411, 5458, 5464, 5443, 5418, 5402, 5405, 5425, 5447, 5464, 5492, 5542, 5606, 5657, 5684, 5689, 5672, 5633, 5597, 5592, 5626, 5664, 5660, 5601, 5518, 5462, 5455, 5482, 5518, 5555, 5590, 5612, 5614, 5605, 5590, 5556, 5503, 5462, 5464, 5491, 5492, 5457, 5429, 5439, 5478, 5515, 5525, 5502, 5465, 5455, 5495, 5545, 5553, 5521, 5497, 5498, 5491, 5463, 5449, 5469, 5495, 5505, 5520, 5547, 5549, 5506, 5468, 5494, 5546, 5546, 5484, 5432, 5443, 5479, 5469, 5398, 5320, 5292, 5313, 5351, 5388, 5437, 5503, 5557, 5572, 5561, 5565, 5578, 5564, 5514, 5475, 5478]
-303E478K5J1kj3l3l5J0O4M6m1j06q0mM5K6l1p9o3L0J27J35M0o5j12r7n7j1J3ql7j9M0N3%
-307E250m3k0K8M5M2N0L8j1o0n4k5j3j0J9N0M5J4LJ3J2NPQjJ2M5M3k7q4m9L2M7ol4j0om6m8
-312E261J9P2L4m0n8j5K4M3N2M4Lm1m4k0no%J3RjQL5L8%m4n7m6k2MK7L7M1M8M6J3m1o7l6R
-317E337K1RJ2K8J8k0l2J2N3J5o6q3%Q8P7ll8OM3Po0o4j0K9K9L1N8N2j9r9r7k6K8K1KJ1J1
-321E381k8n8k1N0N9%m2j9K3K2lnJ4J6ok7m8p9r7n8K9J06J29J01N5Kl1j6K9M9J0m7o4l6j4
-326E376j6j5OK4J0j5j5MRj4m4n5n0l3j7qj5j1K1N4L9j4l8kL0Pk8lO2P9K4l2k9mQJ1K7L4N
-330E372l4m0lM1L8k2r6r6jR7Q5Kk5K9M2n0j37q9L6R0N5K5L9K6l8p8n1j4l0n7l5K2N1L3j0
-335E177m6n4j3N6R7Q0K7k1m7n2l0jOj3j9J0L6K1lkJ1Jj5ML9J9m6o4J3R3O3n8j36r2RO6N4
$$ y = [5478, 5503, 5514, 5512, 5499, 5466, 5431, 5441, 5505, 5551, 5510, 5404, 5324, 5320, 5365, 5391, 5360, 5281, 5218, 5248, 5375, 5510, 5550, 5485, 5373, 5276, 5219, 5208, 5221, 5213, 5176, 5157, 5197, 5250, 5250, 5207, 5187, 5215, 5260, 5302, 5352, 5390, 5379, 5319, 5265, 5240, 5227, 5217, 5236, 5286, 5331, 5345, 5348, 5361, 5373, 5378, 5385, 5393, 5392, 5404, 5449, 5492, 5465, 5381, 5332, 5364, 5411, 5405, 5371, 5361, 5355, 5309, 5261, 5280, 5352, 5386, 5346, 5288, 5273, 5297, 5340, 5392, 5436, 5439, 5398, 5354, 5334, 5329, 5323, 5323, 5336, 5345, 5344, 5352, 5387, 5425, 5425, 5381, 5324, 5278, 5256, 5260, 5287, 5324, 5365, 5413, 5459, 5472, 5431, 5364, 5328, 5337, 5358, 5367, 5379, 5407, 5425, 5405, 5373, 5385, 5438, 5453, 5387, 5304, 5304, 5392, 5469, 5466, 5428, 5434, 5477, 5484, 5424, 5360, 5350, 5379, 5408, 5439, 5497, 5549, 5530, 5431, 5334, 5308, 5336, 5357, 5359, 5370, 5381, 5353, 5295, 5274, 5324, 5383, 5383, 5341, 5322, 5345, 5367, 5364, 5359, 5373, 5389, 5383, 5356, 5308, 5229, 5132, 5074, 5103, 5209, 5338, 5439, 5494, 5496, 5465, 5449, 5478, 5527, 5537, 5490, 5426, 5390, 5376, 5360, 5345, 5351, 5375, 5385, 5370, 5355, 5359, 5368, 5354, 5310, 5255, 5205, 5172, 5155, 5147, 5132, 5121, 5142, 5196, 5235, 5221, 5183, 5181, 5211, 5218, 5190, 5187, 5249, 5328, 5352, 5320, 5291, 5287, 5295, 5306, 5333, 5367, 5372, 5338, 5298, 5295, 5336, 5374, 5352, 5256, 5160, 5159, 5256, 5341, 5343, 5318, 5347, 5389, 5339, 5202, 5113, 5149, 5239, 5294, 5319, 5358, 5384, 5346, 5268, 5217, 5203, 5173, 5116, 5081, 5103, 5154, 5187, 5177, 5131, 5077, 5064, 5120, 5217, 5297, 5324, 5303, 5256, 5204, 5174, 5173, 5179, 5166, 5147, 5157, 5193, 5214, 5211, 5209, 5220, 5221, 5206, 5210, 5249, 5268, 5222, 5158, 5171, 5264, 5327, 5269, 5133, 5041, 5050, 5116, 5170]
-339E170K4J1OMJ1J9Lk6l1j8j8l6k6K0M4%n6m8J2L6lm3l5qkkK4N9N0jl5mN7P2J0o7q8n2j7
-344E016j1rJkk3j2M6Q4M6k2l3J8N0L7J0%j3l3l5k2j9k2lK9K5j5k6J1L4J0%L1M1k4r1n9L4
-348E049P4L1j3j5qk3k8MM0L6J2mqj3k3l2l6k9NO0R2Q0M3Ql3p5q9n8j4LJ3M8Q5P0Ol1nJ5l0
-353E207r5q6mN4M5J2QNk9n9m1mom1m9k0pk8n1l5J5P7J17J08L9k7l5MK0mj2K2M2J6k8n3n6
-358E021n1k7rk8o6n1K6Q0O1K9O1J12J00K1m4p0p5m6L1R6O7k2o0pM3J4m8o4l7pMKj4l3l3j0
-362D966j4n0o1kP6R2L1k6l2oJ0J0Nj3m9o4j5O7J09P7J5j4j0j3l0l1pJ8K3J7Ok2n2o5m5qL3
-367D926O1M6l8j31j35k5R3J24Q5L7Ll2n2l6j7j4%O0R8M6n0p2nN0L2nk0l1m4k3L5N7ko9m9
-371D903L5Q3N2j3o0o2k7K8N8N2K7J3Qlk0k6l3m9n8l7nRkj3pLrl2k2M1J13J20N1m0q8q7o6
$$ y = [5170, 5194, 5205, 5211, 5215, 5226, 5245, 5248, 5222, 5191, 5173, 5155, 5119, 5093, 5113, 5157, 5157, 5101, 5053, 5065, 5101, 5098, 5055, 5020, 5012, 5010, 5008, 5032, 5091, 5141, 5140, 5105, 5101, 5158, 5230, 5240, 5173, 5085, 5033, 5016, 5005, 4996, 4997, 4995, 4972, 4960, 5006, 5090, 5136, 5114, 5081, 5099, 5149, 5186, 5196, 5196, 5183, 5150, 5115, 5093, 5074, 5052, 5049, 5078, 5103, 5088, 5062, 5073, 5107, 5117, 5117, 5148, 5189, 5165, 5074, 5015, 5049, 5123, 5154, 5141, 5126, 5118, 5095, 5067, 5071, 5111, 5147, 5159, 5155, 5147, 5134, 5111, 5079, 5043, 5014, 5019, 5079, 5171, 5251, 5294, 5302, 5269, 5194, 5105, 5047, 5033, 5036, 5049, 5097, 5182, 5252, 5258, 5227, 5222, 5237, 5207, 5112, 5026, 5022, 5076, 5121, 5133, 5141, 5146, 5117, 5058, 5017, 5013, 5007, 4966, 4917, 4897, 4890, 4862, 4811, 4776, 4791, 4868, 4985, 5093, 5132, 5105, 5070, 5074, 5094, 5090, 5078, 5100, 5142, 5158, 5130, 5077, 5021, 4970, 4943, 4934, 4906, 4840, 4789, 4815, 4895, 4956, 4985, 5046, 5158, 5258, 5279, 5235, 5165, 5090, 5044, 5075, 5171, 5238, 5216, 5156, 5149, 5192, 5206, 5158, 5094, 5057, 5050, 5054, 5056, 5042, 5009, 4976, 4966, 4952, 4902, 4841, 4839, 4915, 5007, 5038, 5012, 4980, 4974, 4984, 4994, 4999, 4986, 4937, 4873, 4858, 4925, 5034, 5111, 5126, 5112, 5102, 5089, 5059, 5028, 5021, 5039, 5062, 5079, 5085, 5063, 5011, 4946, 4901, 4893, 4926, 4987, 5033, 4995, 4864, 4729, 4704, 4797, 4921, 5006, 5043, 5046, 5014, 4962, 4926, 4909, 4895, 4895, 4955, 5053, 5099, 5049, 4977, 4972, 5022, 5054, 5049, 5029, 4998, 4954, 4931, 4966, 5023, 5021, 4952, 4903, 4938, 5021, 5073, 5060, 5000, 4938, 4911, 4939, 4997, 5049, 5076, 5089, 5097, 5094, 5074, 5048, 5015, 4966, 4908, 4871, 4866, 4875, 4873, 4860, 4853, 4856, 4847, 4815, 4793, 4834, 4947, 5067, 5118, 5078, 4990, 4903, 4837]
-375D837l1J5M4L8K0K0J8j0k9LM5K3n5j02p3k0J0L4N9N5J6qQRm4q7n6J9N3L5J5K6L5K8Kk4
-380D928m8n3l8k2qK4P4R8O0j9p7q1l7K6O4M1j0j9QJo3j00m8K0J3l3k3M5P7M1jJJ9K3J8Oj2
-384D895j9KK1po5q1m2JJ2PKjJ5O3R4N1l9o3NO5L6m5p4l5J2L7M1L1Pl1n8o5m9pK9J2m7p5l2
-389D603L2M6L8O1R1M7o5j33q1J0L5PQN4N7j7p5l6N2P0J4k8j4Lj1j6J8L6Nl4k7MMpRL0jn2
-394D737m4J7M8J4l1l7l6m9n2qN1Q7R8R4P4M8L2K0k7r2j01l5K6K0k3k4MOk8m9k7J3M0L4Nk3
-398D782k6j2j2k2jN3P7L5k8m7l3l0j7K4N6K1m1m1K4M6k3r2n8L3P0K3k3j2K1J0l9o3k4M1Q0
-403D752P0J4n0q1m1M0Q1M6qj7Lqm5l9J0L4km0k7OJ8K4M8N2K1j7k8m9q7p3K1R9N3n3o0L8R0
-407D795L2m0m1k1m4o4k5K6J7j1J6P0N6k2o1k3J9Rk5k0K1N3M5Ql5m7j6K9K6k7o9m2K9P0M4
$$ y = [4837, 4806, 4821, 4865, 4903, 4923, 4943, 4961, 4951, 4922, 4925, 4970, 4993, 4938, 4836, 4763, 4743, 4753, 4787, 4846, 4901, 4917, 4909, 4917, 4926, 4882, 4795, 4739, 4758, 4811, 4846, 4861, 4887, 4922, 4950, 4952, 4928, 4880, 4827, 4789, 4767, 4759, 4783, 4857, 4955, 5015, 4996, 4919, 4838, 4801, 4827, 4891, 4932, 4922, 4903, 4911, 4912, 4849, 4749, 4701, 4721, 4734, 4701, 4678, 4723, 4800, 4841, 4840, 4841, 4860, 4883, 4901, 4907, 4895, 4876, 4878, 4899, 4892, 4827, 4746, 4704, 4705, 4717, 4724, 4726, 4725, 4740, 4803, 4897, 4948, 4909, 4846, 4851, 4916, 4952, 4907, 4833, 4798, 4810, 4847, 4888, 4919, 4926, 4895, 4837, 4772, 4723, 4716, 4745, 4757, 4710, 4635, 4603, 4635, 4681, 4719, 4780, 4871, 4918, 4853, 4720, 4639, 4649, 4684, 4691, 4699, 4753, 4810, 4793, 4718, 4682, 4734, 4804, 4818, 4790, 4776, 4779, 4768, 4752, 4770, 4806, 4811, 4777, 4750, 4754, 4758, 4751, 4760, 4790, 4789, 4737, 4693, 4710, 4758, 4772, 4741, 4704, 4668, 4619, 4567, 4559, 4610, 4697, 4795, 4889, 4963, 5011, 5043, 5063, 5036, 4944, 4843, 4808, 4834, 4854, 4831, 4807, 4811, 4817, 4789, 4740, 4713, 4726, 4766, 4800, 4805, 4782, 4756, 4744, 4732, 4710, 4709, 4762, 4839, 4874, 4846, 4799, 4766, 4736, 4719, 4743, 4799, 4820, 4779, 4738, 4762, 4808, 4785, 4693, 4635, 4668, 4738, 4761, 4738, 4726, 4747, 4757, 4718, 4655, 4631, 4672, 4752, 4822, 4836, 4786, 4705, 4664, 4704, 4785, 4831, 4823, 4806, 4809, 4801, 4756, 4717, 4727, 4761, 4759, 4719, 4692, 4698, 4716, 4740, 4788, 4840, 4861, 4844, 4816, 4767, 4680, 4607, 4628, 4727, 4780, 4727, 4667, 4705, 4795, 4827, 4787, 4746, 4725, 4681, 4617, 4592, 4618, 4635, 4624, 4640, 4710, 4766, 4744, 4683, 4660, 4679, 4688, 4663, 4643, 4664, 4717, 4762, 4770, 4735, 4688, 4672, 4701, 4727, 4700, 4631, 4589, 4618, 4688, 4732]
-411D732j5n6n0j5J6J3rj3K1M7K7k1l1QL8J5j4%K5j1q8r3QR6O1n0r4l9Rj7n4k2M2M9jk4J1
-416D501M6K0l2m3J2P6Q9M7%j0KKk0l0j0Oj0m5n9n0l7k9OO3R0M8k2n5l0QJ6MlPK6L1Mm0n6
-421D523k1L2M5K1QK7M5L4J9K8L6J0k7l0nJ1J8K3J7k5o6n0nj5p6r1j2P7Q5M2J4jl5n7k7K0
-425D592K0j8k4jNj3j2mm1r6q0J4P8M6j4j8J5K6K7M9O2M3L9O1M1p1j75j34J4J05P2J1jKj8
-429D602k3ljk5j8L3M4k3o2MR0P3j8n8l5k5m8l6J3J3m3n6J8Q5N6ppL3L1j9m2k5pqPL7L7RM
-434D600M6P2K4o0r2l9K5K4l0n7j4L8K4l5m4PM7L1J4M3O5J6o0q3o0m7l5J8P3M9k6m7LL1PM
-438D532M8M1o7j56j12nK8oj0K4J0m9m2O1J43J03nm2K3Q2M1p3j37q5K6Q7O2J8Kql3m2qJ7j5
-443D453n7k5N5Q1L1pJ0J9k7o0rP4Q9K3l6m6l3l8n1n4n5n6l6J3O5Q0M3nk0JK7K3ok4mL6M6
$$ y = [4732, 4717, 4661, 4611, 4596, 4612, 4625, 4616, 4603, 4624, 4671, 4698, 4677, 4646, 4654, 4692, 4707, 4693, 4693, 4718, 4707, 4619, 4526, 4534, 4630, 4691, 4641, 4547, 4508, 4517, 4500, 4446, 4424, 4466, 4515, 4514, 4490, 4501, 4547, 4567, 4535, 4492, 4504, 4580, 4669, 4716, 4716, 4706, 4708, 4710, 4690, 4660, 4650, 4656, 4646, 4601, 4542, 4492, 4455, 4426, 4432, 4495, 4585, 4633, 4611, 4556, 4526, 4534, 4550, 4554, 4551, 4558, 4584, 4615, 4619, 4579, 4523, 4502, 4534, 4579, 4600, 4608, 4635, 4680, 4714, 4733, 4761, 4797, 4807, 4780, 4750, 4745, 4756, 4774, 4797, 4814, 4789, 4723, 4673, 4668, 4653, 4577, 4486, 4474, 4551, 4636, 4678, 4692, 4691, 4656, 4599, 4572, 4592, 4612, 4594, 4570, 4569, 4574, 4561, 4549, 4545, 4504, 4408, 4328, 4342, 4420, 4466, 4452, 4434, 4449, 4475, 4502, 4551, 4613, 4656, 4695, 4756, 4797, 4726, 4551, 4417, 4431, 4536, 4608, 4619, 4618, 4620, 4602, 4579, 4576, 4575, 4550, 4532, 4565, 4609, 4586, 4524, 4528, 4618, 4691, 4673, 4615, 4580, 4555, 4507, 4471, 4484, 4497, 4454, 4398, 4416, 4501, 4557, 4550, 4543, 4576, 4607, 4588, 4546, 4521, 4514, 4506, 4513, 4550, 4587, 4596, 4600, 4646, 4718, 4742, 4682, 4590, 4551, 4576, 4600, 4570, 4513, 4499, 4537, 4561, 4526, 4482, 4489, 4536, 4567, 4581, 4624, 4689, 4705, 4645, 4562, 4502, 4455, 4420, 4438, 4511, 4560, 4534, 4487, 4490, 4521, 4528, 4532, 4580, 4621, 4554, 4398, 4286, 4281, 4309, 4303, 4293, 4317, 4327, 4278, 4236, 4297, 4440, 4543, 4538, 4496, 4519, 4601, 4642, 4569, 4432, 4347, 4373, 4460, 4522, 4540, 4542, 4534, 4501, 4459, 4451, 4468, 4453, 4396, 4371, 4426, 4507, 4538, 4531, 4541, 4560, 4533, 4473, 4464, 4538, 4627, 4650, 4614, 4568, 4535, 4497, 4446, 4392, 4337, 4281, 4245, 4258, 4323, 4403, 4446, 4441, 4421, 4422, 4449, 4472, 4466, 4442, 4438, 4474, 4520]
-447D520oq7j14n9J9M3K1K1O3Q9O6L5K1pp0j10p3j5nl0k3K7O5O5N0K7j7m9k6K4J9l8o3j4N0
-452D419N7J4k9m5k4K0L9Jm7l3J5J2n0o7NP7N8ol4k4j6oK3L9Qk5j4J2pl6mO6Q5L2j7k4k4n5
-456D395q0o4k1NPLQK2L6L8L0J5j5o6j05p7NN5K5l0k0L6N1Ml4k0J5K3J4J7K7J4nNN4R6O2k5
-461D500q1m8RMm4m3J9N1Rl0JL6no2m4J9K4k3l5J1N2N1N0N7L6j2l8k9k0k9k6j2k2m4k5K2L7
-465D316J6K5N8K7p2j24o0K4K2j4J8Q6P8j7q7n9RL0jl5l4oJ8Ol2n3l5NK9K5J7J8K6L0J6j8
-470D252m9l6PL6J8nNL9N2K5j5l8l4lK9L6Jl6l6lJ8lm1m8j5Qj4m0KR0J30O3l2n6k2mj6j3J
-475D253j7n6l9L2O5J3n5o5m2k3LN3P5L2l1l8mRLJ7N2O0L1kk1l0j8J6L4Kl9k2L6N5J2k3NN0
-479D383L8j2l6j8j4n8r5o2RK1m6r6m7N9J18R9N3J7j0j0K9N6J5n7o7k2j5n3l9N5J12M2n6o8
$$ y = [4520, 4514, 4427, 4313, 4254, 4273, 4316, 4337, 4358, 4421, 4510, 4576, 4611, 4632, 4625, 4555, 4445, 4372, 4357, 4352, 4322, 4299, 4326, 4391, 4456, 4506, 4533, 4516, 4467, 4441, 4465, 4484, 4446, 4383, 4369, 4419, 4476, 4490, 4461, 4416, 4392, 4412, 4451, 4452, 4405, 4372, 4387, 4399, 4349, 4282, 4287, 4364, 4422, 4416, 4382, 4358, 4342, 4336, 4359, 4398, 4406, 4381, 4367, 4379, 4372, 4336, 4332, 4398, 4483, 4515, 4498, 4474, 4450, 4395, 4315, 4251, 4230, 4235, 4242, 4245, 4253, 4275, 4311, 4349, 4379, 4394, 4379, 4313, 4208, 4131, 4136, 4191, 4216, 4186, 4166, 4202, 4253, 4257, 4223, 4203, 4218, 4241, 4255, 4272, 4299, 4313, 4308, 4313, 4367, 4463, 4525, 4500, 4419, 4371, 4380, 4384, 4340, 4297, 4316, 4367, 4376, 4346, 4347, 4383, 4378, 4316, 4272, 4291, 4315, 4292, 4257, 4268, 4320, 4371, 4421, 4478, 4514, 4502, 4464, 4435, 4415, 4386, 4360, 4348, 4326, 4282, 4257, 4279, 4316, 4332, 4357, 4415, 4442, 4370, 4246, 4186, 4210, 4232, 4218, 4236, 4322, 4400, 4383, 4296, 4237, 4246, 4276, 4275, 4240, 4206, 4200, 4218, 4224, 4192, 4139, 4104, 4109, 4138, 4163, 4180, 4198, 4224, 4254, 4270, 4252, 4203, 4167, 4174, 4210, 4228, 4223, 4228, 4267, 4319, 4344, 4329, 4291, 4257, 4254, 4283, 4319, 4320, 4284, 4248, 4245, 4263, 4260, 4219, 4171, 4156, 4164, 4150, 4110, 4112, 4202, 4332, 4395, 4363, 4307, 4285, 4281, 4265, 4252, 4253, 4236, 4180, 4141, 4173, 4238, 4251, 4196, 4131, 4089, 4066, 4069, 4122, 4197, 4229, 4198, 4160, 4156, 4165, 4168, 4185, 4237, 4297, 4328, 4326, 4305, 4275, 4257, 4273, 4307, 4309, 4270, 4248, 4284, 4339, 4351, 4328, 4333, 4383, 4421, 4409, 4373, 4355, 4341, 4283, 4188, 4126, 4135, 4156, 4110, 4014, 3967, 4026, 4144, 4243, 4296, 4313, 4303, 4293, 4322, 4378, 4393, 4336, 4269, 4247, 4232, 4179, 4140, 4195, 4307, 4349, 4293, 4225]
-483D225j7Mj4j6j1l3m5LN2J6o3o6J2N5K0oK5N6M0K0L6M9No7j03q0k3K6L8J4j1nJ4J0lJ0M1
-488D208L9Kk5l3l6l1KK4nl7QQ7P7m2j32r4RP1P4N4J5k8k7K5O3K0n2p3m1j5rOK9J8k5n1l5
-492D040J6N8O7M1J1J3K8Pm9q4n9j9j0j4RL9M0J2qj9k6k5KL6M5K2jrj2j8k7k6mK9L9kn0m0
-497D052J6N3M3K2J7kk4OP9Q6j8j23j11k6J4jJ1O6Q4L5j9l7l4k7oJ3ro0p2j7L6L3nk7j9nO
-502D030J7K6K0RPJ7L8O2O4K8k3n2m5k1ppj6k0kK6K4lj5J7M4K3j7j6J9K4ok4j6pj1nJ0Kj4
-506D180OM7K9m7q9m4J9K0j0rNj9n5k5O3J19Q5Ln7p9o7k8J7K5rm3l8lK1K0J8K4K8J4j3l2m4
-511D032m4k8K1P2Q0L8Jlmm8q2l4P2J12K9r0j15n3OJ0j5k8k9qN4J18J06Jj06j19l7M1N3J5
-515D018j2KL3L7lm8m9j4Mk5m7j2N4O3K0KM8Q7N3j9n3o2q7j11o3M2J15R6M0J1Pmj3nPmk7k9
$$ y = [4225, 4208, 4212, 4198, 4182, 4171, 4138, 4093, 4096, 4148, 4164, 4101, 4035, 4047, 4102, 4122, 4116, 4141, 4197, 4237, 4257, 4293, 4342, 4347, 4280, 4177, 4097, 4074, 4100, 4138, 4152, 4141, 4136, 4150, 4160, 4157, 4167, 4208, 4247, 4249, 4224, 4191, 4155, 4124, 4126, 4150, 4145, 4108, 4116, 4203, 4280, 4238, 4106, 4012, 4021, 4092, 4166, 4220, 4235, 4207, 4180, 4205, 4268, 4288, 4236, 4163, 4122, 4107, 4098, 4104, 4133, 4151, 4126, 4075, 4040, 4056, 4114, 4181, 4222, 4233, 4246, 4274, 4281, 4232, 4148, 4089, 4070, 4060, 4046, 4055, 4094, 4134, 4146, 4138, 4119, 4093, 4068, 4070, 4106, 4151, 4173, 4172, 4163, 4151, 4133, 4106, 4080, 4076, 4105, 4144, 4142, 4092, 4052, 4068, 4121, 4164, 4186, 4203, 4201, 4177, 4183, 4262, 4348, 4330, 4207, 4096, 4070, 4084, 4083, 4094, 4160, 4244, 4279, 4260, 4223, 4189, 4162, 4156, 4169, 4160, 4100, 4028, 4011, 4047, 4080, 4075, 4048, 4029, 4024, 4030, 4047, 4073, 4093, 4102, 4109, 4126, 4164, 4226, 4290, 4318, 4295, 4243, 4198, 4177, 4170, 4163, 4147, 4127, 4125, 4151, 4175, 4172, 4157, 4174, 4218, 4241, 4224, 4208, 4227, 4251, 4245, 4221, 4205, 4198, 4187, 4182, 4192, 4194, 4180, 4186, 4233, 4262, 4215, 4126, 4082, 4101, 4121, 4111, 4102, 4107, 4088, 4033, 4008, 4071, 4190, 4275, 4278, 4221, 4142, 4075, 4047, 4064, 4089, 4080, 4037, 3999, 3996, 4017, 4037, 4055, 4079, 4107, 4121, 4108, 4076, 4032, 3988, 3960, 3981, 4053, 4133, 4171, 4172, 4169, 4165, 4117, 4035, 4001, 4073, 4185, 4214, 4124, 4009, 3956, 3962, 3972, 3957, 3929, 3900, 3892, 3946, 4064, 4170, 4171, 4065, 3946, 3909, 3950, 4003, 4018, 4006, 4008, 4041, 4078, 4075, 4027, 3978, 3964, 3968, 3943, 3896, 3884, 3938, 4001, 4021, 4023, 4071, 4158, 4211, 4192, 4139, 4077, 3990, 3879, 3816, 3858, 3973, 4069, 4109, 4120, 4127, 4123, 4110, 4105, 4112, 4108, 4081, 4052]
-520D052j2QK5K0k0p8q4j0P8R4L7j9l8l0lL8N6K1m3p5o1l8l7l8l7l8l9j2L2O1P6Q2N8j5q3
-524C928o4K6O4rj01q9LO1L3j9l7k0KK4M4M1J4j5pJ9K2j1l9j0N9R3M4m8r3o7j1K7M4M7M8M8
-528D051M3K2j6k8kJ3l1r0o1L9Q5J1q4q0QO5M8Kk9m1m2j1K6J6m1r0q2k9K1M6M7L9K8J5ok8
-533C834l2rJ0PlMJ4LkL5Q8Q7K8j9qJ2j7o3n2ML1%l5k2K1M6L8Nm9j03j13n6K6P8Q4O8L0k9
-537C941o5l6K7M9K1NK2K2j6l3lK4Pj4KK0j2n0m3j0qk2JL6K9j0j2J5J1k0j3K8K2m3q3n0NK9
-542C773L8M5L9K1L1N5M0j0l2j9l0o3m6K0L1m0q0k4K4k7j14j16n4KM8J01J07L2k1M9J42J05
-546D027k7q7m6j3k3OO9N0n8j07k1O4L0n0n5qkk3J1Q0Q9J0p3q7m0K3O5P5L6l7q8p9j3M3L1
-550C772l1o6l7J1L1M2Q2J08M8n6r5l9J7Pk6k4lpl4n1n0k8L4J06J18M1m5o8l9j3%K3M8L2j3
$$ y = [4052, 4040, 4048, 4073, 4093, 4073, 3995, 3911, 3901, 3979, 4073, 4110, 4091, 4053, 4023, 4020, 4058, 4114, 4135, 4092, 4017, 3956, 3918, 3881, 3843, 3806, 3768, 3729, 3717, 3749, 3810, 3886, 3968, 4026, 4011, 3928, 3864, 3890, 3954, 3945, 3844, 3755, 3758, 3819, 3852, 3833, 3796, 3776, 3778, 3802, 3846, 3887, 3901, 3886, 3879, 3898, 3920, 3909, 3870, 3860, 3919, 4012, 4056, 4008, 3915, 3848, 3837, 3864, 3908, 3955, 4003, 4051, 4094, 4116, 4100, 4072, 4070, 4083, 4052, 3962, 3901, 3940, 4025, 4036, 3952, 3872, 3880, 3945, 3993, 3995, 3966, 3925, 3883, 3872, 3898, 3914, 3873, 3783, 3701, 3672, 3693, 3739, 3786, 3825, 3853, 3868, 3862, 3834, 3802, 3793, 3803, 3810, 3807, 3811, 3825, 3828, 3826, 3861, 3949, 4036, 4064, 4045, 4037, 4049, 4032, 3969, 3917, 3921, 3952, 3952, 3917, 3895, 3916, 3962, 4000, 4005, 3956, 3853, 3740, 3684, 3710, 3788, 3872, 3940, 3970, 3941, 3876, 3840, 3867, 3916, 3937, 3942, 3964, 3986, 3970, 3937, 3934, 3958, 3965, 3951, 3953, 3973, 3961, 3911, 3868, 3858, 3850, 3828, 3829, 3865, 3894, 3884, 3872, 3887, 3898, 3878, 3865, 3893, 3915, 3872, 3789, 3739, 3744, 3773, 3811, 3856, 3895, 3916, 3947, 4002, 4042, 4032, 4000, 3981, 3951, 3888, 3842, 3862, 3893, 3853, 3773, 3749, 3773, 3746, 3632, 3516, 3462, 3464, 3512, 3613, 3720, 3752, 3731, 3780, 3922, 4027, 4000, 3913, 3867, 3854, 3831, 3837, 3906, 3956, 3898, 3791, 3770, 3834, 3864, 3814, 3759, 3751, 3749, 3726, 3737, 3817, 3906, 3916, 3843, 3756, 3716, 3739, 3804, 3879, 3915, 3878, 3790, 3711, 3698, 3741, 3772, 3741, 3675, 3638, 3649, 3680, 3722, 3804, 3912, 3960, 3904, 3809, 3770, 3787, 3794, 3768, 3744, 3741, 3734, 3700, 3649, 3599, 3571, 3605, 3711, 3829, 3870, 3825, 3757, 3718, 3705, 3705, 3728, 3776, 3808, 3795]
-554C795m2k4K6N2L1j8l7JM4K5l7o9m5j3j5k6k5l3m6j7M9Q5N5K0K9M6K4jJ9M4No4o4RN8K7
-559C868k5l7j8j9l9l4ML8L5jl8n6m1JN5Q3N2j3m5j0K5oo9o3J6N9K3l4l0npk4lL9O0N7N2L1
-564C881j7m6k4J7J5j5j6lk4o4n0J5N0J2m3m1J4N1L7j4n2l7J6M6K1l4n2j1N1Q0O3K4J0L2M6
-568C938Qm9n7kL0j0o5m8J6N5M1Mm7j07j25p2MK9K5N1Q3M4n3r0l3L6L8Nj5l9p4o7J4R2Q7K7
-572C674kJ7J9j9m2lN9Q5O1J6j6l3m7n5m7k6JK0K5Rk9p0p5l4QPmJ9O3P0K3l4m2jM9P4O0J9
-577C799j5l2m7n9l9J7O2M3j8n1m3l4m2k3L5P7N6j0o5q3p2l7%J1knL4R1J11P3J1k9k2jll0
-581C658m3k6LL0O8R1L8p8j29m7O1N0l3l0O2Q7j7j09o9K2L4qlM0M5jk2rj0l3l6k5l6n4j6O0
-586C515P5Kn0%Q3P6j6q1n9oJ3J0J0jm9q0l8N1Q3L8k5m5n1n2j5N6Q4K5m1k1L7J4p3r9l3K2
$$ y = [3795, 3753, 3729, 3755, 3807, 3838, 3820, 3783, 3784, 3828, 3853, 3816, 3747, 3702, 3689, 3674, 3648, 3623, 3590, 3544, 3527, 3576, 3661, 3716, 3736, 3765, 3811, 3835, 3834, 3853, 3897, 3902, 3838, 3774, 3783, 3841, 3868, 3843, 3806, 3788, 3769, 3730, 3696, 3700, 3738, 3773, 3772, 3734, 3678, 3637, 3638, 3693, 3776, 3828, 3815, 3770, 3760, 3785, 3779, 3710, 3647, 3663, 3722, 3745, 3711, 3681, 3676, 3669, 3645, 3642, 3681, 3741, 3798, 3850, 3881, 3864, 3818, 3794, 3811, 3826, 3811, 3795, 3792, 3768, 3704, 3654, 3669, 3719, 3731, 3688, 3647, 3661, 3712, 3749, 3735, 3683, 3646, 3662, 3708, 3729, 3695, 3643, 3632, 3683, 3763, 3826, 3850, 3860, 3892, 3938, 3946, 3897, 3840, 3838, 3868, 3858, 3793, 3745, 3761, 3816, 3857, 3861, 3814, 3707, 3582, 3510, 3514, 3543, 3568, 3619, 3702, 3746, 3693, 3603, 3570, 3606, 3644, 3649, 3634, 3595, 3521, 3454, 3468, 3560, 3647, 3674, 3672, 3689, 3708, 3689, 3647, 3644, 3703, 3788, 3849, 3865, 3849, 3816, 3769, 3714, 3667, 3641, 3642, 3662, 3687, 3696, 3667, 3597, 3522, 3488, 3496, 3503, 3499, 3518, 3581, 3651, 3674, 3640, 3598, 3597, 3646, 3720, 3780, 3799, 3784, 3752, 3705, 3646, 3607, 3624, 3686, 3729, 3711, 3660, 3617, 3583, 3541, 3518, 3553, 3630, 3686, 3676, 3611, 3528, 3456, 3419, 3419, 3430, 3428, 3423, 3457, 3548, 3659, 3732, 3743, 3714, 3692, 3691, 3688, 3658, 3615, 3589, 3592, 3622, 3690, 3781, 3819, 3741, 3612, 3565, 3626, 3676, 3643, 3613, 3675, 3762, 3745, 3636, 3567, 3589, 3623, 3615, 3612, 3652, 3697, 3696, 3674, 3665, 3655, 3622, 3586, 3561, 3525, 3471, 3455, 3515, 3590, 3592, 3542, 3542, 3625, 3701, 3685, 3604, 3545, 3539, 3552, 3562, 3572, 3571, 3522, 3442, 3404, 3455, 3538, 3576, 3551, 3506, 3455, 3403, 3388, 3444, 3528, 3553, 3512, 3491, 3528, 3542, 3469, 3370, 3337, 3359]
-590C359Pj1L9J12J21O8Ok8l7k0PJ7J0J1K5K3LML2L3ml1j8qn1j08j05l7L6O9M5rm8m8l5m7
-594C382n2JO9P0J1j8mj3n6m5L9R1N6J0J8Rn9q3J5J22R8om7j9j7k7K4J01R7J5m2n3p5r9p1
-599C442j3ql3KP0O5mj2N7Q1J1m8k8j5n6q0l3J1j4l9QO8N0nj3J6K1KRK7J9lJJ1pl0j4K1K8
-604C565Q%J3J8Mk5n3n3mO0O8Pn4o4m8l5JO8J05O7jl7m6n7n8k0K6L1om9o5l3N2J30J12Jr1
-608C537q1k3rj5J9O0M5j4l2J0M5L4Jk2l8m3k5nKNK5M3K7NJ5L8K4j3l1k0j3j0NJ9Qj3kK3N
-613C586n1p9n3j1MkJK5N9Q5O0j8p9o2KL7K8K1K9J3k3l7l1n0q4o7J3P8O0QlL1M8K2k0m1l9
-617C460k4j4j7j1J4L6J0n1q5n1J8N2K6l0n2j8N1R1O5Nk8k2%J7K8K8Oj6j4kj4m8n9m0j5j1
-622C285j0J2L5L8Rk9m8k7K7O9O3K2j2k4k1j6JJ4RpoJ7L6L2Rk9n9n2oL8L4K4M7P1K2p5j08
$$ y = [3359, 3366, 3355, 3394, 3506, 3627, 3695, 3701, 3673, 3636, 3616, 3623, 3640, 3650, 3661, 3686, 3709, 3712, 3716, 3748, 3781, 3777, 3746, 3728, 3720, 3669, 3561, 3456, 3419, 3455, 3524, 3569, 3560, 3512, 3464, 3429, 3382, 3330, 3331, 3400, 3470, 3481, 3463, 3459, 3446, 3390, 3345, 3384, 3475, 3531, 3541, 3559, 3568, 3509, 3426, 3441, 3563, 3661, 3655, 3608, 3589, 3572, 3545, 3569, 3670, 3767, 3782, 3740, 3687, 3612, 3513, 3442, 3429, 3421, 3388, 3390, 3460, 3525, 3521, 3509, 3566, 3647, 3658, 3610, 3582, 3567, 3511, 3431, 3398, 3409, 3395, 3356, 3364, 3432, 3482, 3477, 3464, 3480, 3501, 3503, 3512, 3539, 3558, 3555, 3556, 3567, 3560, 3530, 3516, 3537, 3565, 3573, 3573, 3586, 3604, 3608, 3583, 3530, 3477, 3473, 3533, 3601, 3608, 3554, 3490, 3442, 3407, 3408, 3476, 3581, 3648, 3647, 3610, 3564, 3507, 3449, 3429, 3455, 3486, 3480, 3431, 3366, 3333, 3385, 3515, 3627, 3628, 3537, 3456, 3433, 3424, 3409, 3428, 3488, 3533, 3519, 3487, 3497, 3542, 3576, 3577, 3555, 3517, 3474, 3449, 3444, 3446, 3451, 3476, 3519, 3546, 3551, 3566, 3604, 3628, 3615, 3584, 3564, 3551, 3541, 3546, 3565, 3573, 3560, 3558, 3581, 3586, 3535, 3456, 3403, 3392, 3396, 3394, 3395, 3420, 3479, 3564, 3624, 3606, 3527, 3465, 3467, 3504, 3532, 3553, 3582, 3595, 3572, 3535, 3504, 3454, 3370, 3303, 3316, 3394, 3454, 3462, 3459, 3490, 3538, 3560, 3540, 3499, 3460, 3436, 3422, 3405, 3394, 3408, 3444, 3454, 3403, 3318, 3267, 3285, 3337, 3363, 3333, 3281, 3263, 3314, 3405, 3470, 3475, 3447, 3425, 3425, 3442, 3470, 3498, 3504, 3488, 3474, 3472, 3458, 3410, 3351, 3311, 3296, 3285, 3275, 3287, 3322, 3360, 3369, 3340, 3292, 3265, 3292, 3361, 3424, 3446, 3434, 3410, 3389, 3373, 3374, 3388, 3397, 3390, 3384, 3401, 3437, 3469, 3478, 3449, 3390, 3338, 3332, 3370, 3404, 3428, 3475, 3546, 3568, 3493, 3385]
-626C385l2N6O7K0KL0M1Kn1o3j9L5M4Ll1k2NLj8j6J0K2Pj7l8n0l1J8M9J7l8l0L1O7M4Qj7n2
-631C441p9l3N9Q3%p5n4RJ9omJ1j6o2m9K1N9K1n7j04q6j3O1O4jn0j2O2Q6N9M4O0N7J3k9l2
-635C467pJ3J0rj8lJ5lm5n4j1J5j9n8k6L8M8j0n7n2k2KK0L5L6L4M1M2J5k0k7qJLKj3n1o2j1
-640C251O4Q2N0K1Ok7n2k2K9J1o6j00m7J1J4kQK6K4K1K3Jm0m7kL0J6J4M6M8j9q2o2%K2J4K8
-645C292L9kn0k5N4P6J9k6j5qm8p7m7jol2j9M0Q3P3K9rk5j2J4L0J1k5l8j2K2J8l9j00r7k3
-649C064N8O8Jo9o5J1Q3Q2K2j6J0N2M4j7o1o0k9ON5J10J03Pj07j30n8K1L5K0K8M4M2J1j4k2
-653C329j6mJ2J2j3l7k9OL1L4L3L0J7j7l8k1K9O2N6J4l8o5m3RL9J9k1l6k8k1j6QK5lm5l0M6
-658C290P2Kp0m2L4M3ljN2M2o6j47j00RN7L2lj5j7NM7N6j1p7m7N7J00L0o2q5m2KK6L6K3j1
$$ y = [3385, 3353, 3409, 3476, 3496, 3498, 3528, 3569, 3571, 3520, 3457, 3438, 3473, 3517, 3520, 3489, 3467, 3472, 3475, 3457, 3441, 3451, 3473, 3480, 3463, 3425, 3375, 3344, 3362, 3411, 3428, 3390, 3360, 3391, 3458, 3502, 3510, 3493, 3441, 3362, 3329, 3388, 3471, 3471, 3396, 3342, 3351, 3370, 3364, 3360, 3371, 3355, 3293, 3244, 3265, 3324, 3345, 3288, 3184, 3098, 3085, 3146, 3210, 3209, 3159, 3147, 3209, 3295, 3354, 3398, 3458, 3515, 3528, 3499, 3467, 3460, 3473, 3483, 3474, 3456, 3453, 3468, 3465, 3420, 3366, 3355, 3370, 3351, 3293, 3267, 3305, 3353, 3343, 3286, 3234, 3212, 3214, 3234, 3269, 3305, 3339, 3380, 3422, 3437, 3417, 3390, 3382, 3383, 3386, 3388, 3375, 3324, 3262, 3251, 3315, 3397, 3447, 3468, 3474, 3447, 3395, 3373, 3402, 3413, 3347, 3247, 3200, 3211, 3225, 3223, 3231, 3257, 3281, 3302, 3325, 3326, 3286, 3239, 3237, 3267, 3283, 3297, 3343, 3391, 3372, 3290, 3228, 3228, 3250, 3264, 3292, 3331, 3329, 3279, 3254, 3308, 3384, 3403, 3377, 3362, 3354, 3306, 3229, 3182, 3181, 3175, 3143, 3124, 3164, 3247, 3320, 3349, 3340, 3315, 3303, 3317, 3347, 3358, 3333, 3295, 3283, 3305, 3323, 3284, 3184, 3087, 3064, 3122, 3190, 3191, 3122, 3057, 3068, 3151, 3233, 3255, 3239, 3249, 3301, 3345, 3328, 3267, 3207, 3178, 3184, 3239, 3349, 3452, 3459, 3352, 3222, 3164, 3185, 3220, 3240, 3268, 3312, 3354, 3365, 3351, 3329, 3313, 3309, 3321, 3333, 3320, 3283, 3254, 3260, 3291, 3325, 3358, 3388, 3405, 3388, 3350, 3329, 3358, 3420, 3476, 3490, 3452, 3387, 3344, 3353, 3392, 3411, 3390, 3354, 3326, 3305, 3289, 3297, 3322, 3319, 3274, 3244, 3290, 3362, 3364, 3294, 3252, 3286, 3329, 3326, 3325, 3377, 3419, 3353, 3206, 3106, 3115, 3172, 3204, 3201, 3186, 3169, 3174, 3221, 3277, 3266, 3189, 3142, 3199, 3299, 3329, 3267, 3182, 3140, 3142, 3168, 3204, 3227, 3216]
-662C216l3k1PK0J5J0ll0n5n2k7J0M5N9L8pk9k2k5m9n0lL9K6jJ8N5L7k6l0L8P9K9l6j6M9N1
-667C326j8o7m0RJ7rl3n0o1n4k1K4N2O5N3Jn3m8K0O9L7j7j5K4J6m5p6l3K1L0J4J4K0PmJ0J1
-671C196k0k7K6Q5N3m3r1n5j2j8k6RM7L1lRN8P0J7m5p0n6k7n%j3k1JL7M2jo0q5o6j9K7M6M0
-676C031J6kkJ0K7L9L2Nj8j4PJ3%j3j6k2k2lL3M0no0o7j6N0Q6P2K1l1m7k4nk3m9m1JL8M7M1
-681C129K2oj2J8M6Qo5q5k2N1N7J9NK8M7L3om5o8n3j5Oj9n0k8M9J01Q5K3k9m8m1k5j2qj3j3
-685C064kOol4n0k7RK1ml0j9J8K8jm0m7k1K4N7N6K4%J0K5Nk6j3K2Qn0n5J5O6K1l4j3M0K0l9
-690C028l3L0M0pj4L9N0j8o7j9N3O5M0K1j7q8j24p2mOJ1Q0J42Q3n7j18n7J0jl0jN5O5L6J1
$$ y = [3216, 3183, 3162, 3169, 3189, 3204, 3214, 3211, 3181, 3126, 3074, 3047, 3057, 3102, 3161, 3199, 3192, 3163, 3141, 3116, 3067, 3017, 3014, 3053, 3079, 3078, 3096, 3151, 3188, 3162, 3132, 3170, 3249, 3278, 3242, 3226, 3275, 3326, 3308, 3241, 3201, 3210, 3227, 3218, 3185, 3135, 3074, 3020, 2999, 3023, 3075, 3140, 3193, 3194, 3141, 3093, 3113, 3182, 3219, 3202, 3187, 3211, 3227, 3182, 3106, 3073, 3094, 3124, 3138, 3152, 3172, 3179, 3175, 3185, 3196, 3176, 3149, 3175, 3260, 3313, 3270, 3179, 3124, 3112, 3094, 3068, 3077, 3124, 3155, 3152, 3161, 3219, 3289, 3306, 3261, 3191, 3135, 3108, 3103, 3103, 3090, 3069, 3070, 3107, 3149, 3148, 3088, 3003, 2937, 2918, 2945, 2991, 3031, 3047, 3045, 3043, 3053, 3080, 3119, 3151, 3156, 3138, 3124, 3131, 3144, 3144, 3131, 3115, 3093, 3071, 3068, 3101, 3141, 3136, 3076, 3009, 2993, 3043, 3129, 3201, 3222, 3191, 3144, 3120, 3115, 3092, 3043, 3002, 3003, 3041, 3088, 3129, 3151, 3145, 3133, 3151, 3197, 3205, 3140, 3055, 3033, 3084, 3141, 3160, 3165, 3193, 3240, 3273, 3267, 3222, 3154, 3101, 3086, 3092, 3073, 3023, 2995, 3044, 3145, 3230, 3253, 3224, 3176, 3135, 3110, 3098, 3090, 3077, 3064, 3062, 3068, 3062, 3028, 2978, 2951, 2960, 2981, 2977, 2947, 2928, 2946, 2974, 2973, 2933, 2886, 2865, 2889, 2946, 3002, 3026, 3026, 3036, 3061, 3066, 3040, 3027, 3049, 3057, 3007, 2952, 2967, 3033, 3054, 3020, 3007, 3047, 3067, 3028, 2995, 3025, 3065, 3058, 3044, 3083, 3133, 3115, 3048, 3029, 3082, 3147, 3187, 3208, 3191, 3103, 2979, 2907, 2903, 2909, 2920, 3000, 3142, 3225, 3168, 3050, 2993, 3003, 3002, 2972, 2971, 3026, 3091, 3127, 3138]
$$ [...]
##END=	
##END=	
