##TITLE=	Jan28-2020.60.1.1r
MAH-01
##JCAMP-DX=	6.0	$$ MestReNova 14.1.0-24037
##DATA TYPE=	LINK
##BLOCK_ID=	1
##BLOCKS=	2    
##ORIGIN=	Mestrelab Research S.L.
##OWNER=	mah419
##$MNOVA/LINK_BLOCK_TYPE=	ITEM	$$ NMR Spectrum
##$MNOVA/ITEM/POLYGON=	(XY..XY)
5321,5835
8722,5835
8722,8208
5321,8208
5321,5835
##$MNOVA/ITEM/Z=	0
##$MNOVA/ITEM/ANGLE=	0
##TITLE=	Jan28-2020.60.1.1r
##JCAMP-DX=	6.0	$$ MestReNova 14.1.0-24037
##BLOCK_ID=	2
##DATA TYPE=	NMR SPECTRUM
##DATA CLASS=	XYDATA
##NUMDIM=	1
##ORIGIN=	Bruker BioSpin GmbH
##OWNER=	nmrsu
##.OBSERVE FREQUENCY=	400.05240029848198446
##.OBSERVE NUCLEUS=	^1H
##.SOLVENT NAME=	CDCl3
##.PULSE SEQUENCE=	zg30
##LONGDATE=	2020/01/28 15:36:00.000
##.ACQUISITIONMODE=	SIMULTANEOUS
##$ORIGINAL FORMAT=	Bruker XWIN-NMR
##$MNOVA/SCALES_VERSION=	8
##$PARAMETER FILE=	(acqus, ASCII, //ch-nmrserv3.ch.ic.ac.uk/Av400D/ug1/nmr/Jan28-2020/60/acqus, 0)
$$ ##TITLE= Parameter file, TOPSPIN		Version 3.2
$$ ##JCAMPDX= 5.0
$$ ##DATATYPE= Parameter Values
$$ ##NPOINTS= 11	$$ modification sequence number
$$ ##ORIGIN= Bruker BioSpin GmbH
$$ ##OWNER= nmrsu
$$ $$ 2020-01-28 15:36:47.341 +0000  nmrsu@nmrpc
$$ $$ /opt/topspin/data/ug1/nmr/Jan28-2020/60/acqus
$$ $$ process /opt/topspin3.2/prog/mod/shimcntl
$$ ##$ACQT0= -2.04831932773109
$$ ##$AMP= (0..31)
$$ 100 100 100 100 100 100 100 100 100 100 100 100 100 100 100 100 100 100
$$ 100 100 100 100 100 100 100 100 100 100 100 100 100 100
$$ ##$AMPCOIL= (0..19)
$$ -1 0 0 0 0 0 0 0 0 0 0 0 0 0 0 0 0 0 0 0
$$ ##$ANAVPT= -1
$$ ##$AQSEQ= 0
$$ ##$AQ_mod= 3
$$ ##$AUNM= <au_zg>
$$ ##$AUTOPOS= <25 >
$$ ##$BF1= 400.05
$$ ##$BF2= 400.05
$$ ##$BF3= 400.05
$$ ##$BF4= 400.05
$$ ##$BF5= 400.05
$$ ##$BF6= 400.05
$$ ##$BF7= 400.05
$$ ##$BF8= 400.05
$$ ##$BYTORDA= 0
$$ ##$CAGPARS= (0..11)
$$ 0 0 0 0 0 0 0 0 0 0 0 0
$$ ##$CFDGTYP= 0
$$ ##$CFRGTYP= 9
$$ ##$CHEMSTR= <none>
$$ ##$CNST= (0..63)
$$ 1 1 1 1 1 1 1 1 1 1 1 1 1 1 1 1 1 1 1 1 1 1 1 1 1 1 1 1 1 1 1 1 1 1 1 1
$$ 1 1 1 1 1 1 1 1 1 1 1 1 1 1 1 1 1 1 1 1 1 1 1 1 1 1 1 1
$$ ##$CPDPRG= (0..8)
$$ <> <> <> <> <> <> <> <> <>
$$ ##$D= (0..63)
$$ 0 1 0 0 0 0 0 0 0 0 0 0 0 0 0 0 0.0002 0 0 0 0 0 0 0 0 0 0 0 0 0 0 0 0
$$ 0 0 0 0 0 0 0 0 0 0 0 0 0 0 0 0 0 0 0 0 0 0 0 0 0 0 0 0 0 0 0
$$ ##$DATE= 1580225806
$$ ##$DE= 6.5
$$ ##$DECBNUC= <off>
$$ ##$DECIM= 2496
$$ ##$DECNUC= <off>
$$ ##$DECSTAT= 4
$$ ##$DIGMOD= 1
$$ ##$DIGTYP= 12
$$ ##$DQDMODE= 0
$$ ##$DR= 22
$$ ##$DS= 4
$$ ##$DSPFIRM= 0
$$ ##$DSPFVS= 20
$$ ##$DTYPA= 0
$$ ##$EXP= <proton>
$$ ##$F1LIST= <>
$$ ##$F2LIST= <>
$$ ##$F3LIST= <>
$$ ##$FCUCHAN= (0..9)
$$ 0 2 0 0 0 0 0 0 0 0
$$ ##$FL1= 90
$$ ##$FL2= 90
$$ ##$FL3= 90
$$ ##$FL4= 90
$$ ##$FOV= 20
$$ ##$FQ1LIST= <>
$$ ##$FQ2LIST= <>
$$ ##$FQ3LIST= <>
$$ ##$FQ4LIST= <>
$$ ##$FQ5LIST= <>
$$ ##$FQ6LIST= <>
$$ ##$FQ7LIST= <>
$$ ##$FQ8LIST= <>
$$ ##$FRQLO3= 15959.0749999881
$$ ##$FRQLO3N= 2
$$ ##$FS= (0..7)
$$ 83 83 83 83 83 83 83 83
$$ ##$FTLPGN= 0
$$ ##$FW= 125000
$$ ##$FnMODE= 0
$$ ##$FnTYPE= 0
$$ ##$GPNAM= (0..31)
$$ [...]
$$ 130000 130000 130000 130000 130000 130000 130000 130000 130000 130000 130000
$$ 130000 130000 130000 130000 130000 130000 130000 130000 130000 130000 130000
$$ 130000 130000 130000 130000 130000 130000 130000 0 0 0 0 0 0 0 0 0 0 0
$$ 0 0 0 0 0 0 0 0 0 0 0 0 0
$$ ##$ShimPowMaxUC= (0..63)
$$ 130000 130000 130000 130000 130000 130000 130000 130000 130000 130000 130000
$$ 130000 130000 130000 130000 130000 130000 130000 130000 130000 130000 130000
$$ 130000 130000 130000 130000 130000 130000 130000 130000 130000 130000 130000
$$ 130000 130000 130000 130000 130000 130000 130000 0 0 0 0 0 0 0 0 0 0 0
$$ 0 0 0 0 0 0 0 0 0 0 0 0 0
$$ ##$ShimPowMaxUG= (0..63)
$$ 524287 524287 524287 524287 524287 524287 524287 524287 524287 524287 524287
$$ 524287 524287 524287 524287 524287 524287 524287 524287 524287 524287 524287
$$ 524287 524287 524287 524287 524287 524287 524287 524287 524287 524287 524287
$$ 524287 524287 524287 524287 524287 524287 0 0 0 0 0 0 0 0 0 0 0 0 0 0 0
$$ 0 0 0 0 0 0 0 0 0 0
$$ ##$ShimPowRcbType= 3
$$ ##$ShimPowRes= (0..63)
$$ 1e-20 1e-20 1e-20 1e-20 1e-20 1e-20 1e-20 1e-20 1e-20 1e-20 1e-20 1e-20
$$ 1e-20 1e-20 1e-20 1e-20 1e-20 1e-20 1e-20 1e-20 1e-20 1e-20 1e-20 1e-20
$$ 1e-20 1e-20 1e-20 1e-20 1e-20 1e-20 1e-20 1e-20 1e-20 1e-20 1e-20 1e-20
$$ 1e-20 1e-20 1e-20 1e-20 0 0 0 0 0 0 0 0 0 0 0 0 0 0 0 0 0 0 0 0 0 0 0 0
$$ ##$ShimPowRng0= (0..63)
$$ 1 1 1 1 1 1 1 1 1 1 1 1 1 1 1 1 1 1 1 1 1 1 1 1 1 1 1 1 1 1 1 1 1 1 1 1
$$ 1 1 1 1 0 0 0 0 0 0 0 0 0 0 0 0 0 0 0 0 0 0 0 0 0 0 0 0
$$ ##$ShimPowRng1= (0..63)
$$ 1 1 1 1 1 1 1 1 1 1 1 1 1 1 1 1 1 1 1 1 1 1 1 1 1 1 1 1 1 1 1 1 1 1 1 1
$$ 1 1 1 1 0 0 0 0 0 0 0 0 0 0 0 0 0 0 0 0 0 0 0 0 0 0 0 0
$$ ##$ShimPowRng2= (0..63)
$$ 1 1 1 1 1 1 1 1 1 1 1 1 1 1 1 1 1 1 1 1 1 1 1 1 1 1 1 1 1 1 1 1 1 1 1 1
$$ 1 1 1 1 0 0 0 0 0 0 0 0 0 0 0 0 0 0 0 0 0 0 0 0 0 0 0 0
$$ ##$ShimPowRng3= (0..63)
$$ 1 1 1 1 1 1 1 1 1 1 1 1 1 1 1 1 1 1 1 1 1 1 1 1 1 1 1 1 1 1 1 1 1 1 1 1
$$ 1 1 1 1 0 0 0 0 0 0 0 0 0 0 0 0 0 0 0 0 0 0 0 0 0 0 0 0
$$ ##$ShimSysFunc= (0..63)
$$ 1 2 3 4 5 6 7 8 9 10 0 37 38 35 16 15 14 13 12 11 28 27 26 25 24 23 36
$$ 22 30 29 20 21 34 33 32 31 17 18 19 0 0 0 0 0 0 0 0 0 0 0 0 0 0 0 0 0 0
$$ 0 0 0 0 0 0 0
$$ ##$ShimSysMatrix= 0
$$ ##$ShimSysType= 4
$$ ##$TFXNUM= 0
$$ ##$TRIPLO2= 0
$$ ##$VTU= 2
$$ ##$VTUETH= <149.236.99.20>
$$ ##$VTUTY= <no>
$$ ##$WBREFAM= (0..15)
$$ 136.7 118.7 100 100 100 100 100 100 100 100 100 100 100 100 100 100
$$ ##$WBREFLM= (0..15)
$$ 0 0 0 0 0 0 0 0 0 0 0 0 0 0 0 0
$$ ##$WBREFPH= (0..15)
$$ 77.55 -71.28 0 0 0 0 0 0 0 0 0 0 0 0 0 0
$$ ##$WBSGU= (0..15)
$$ 0 0 0 0 0 0 0 0 0 0 0 0 0 0 0 0
$$ ##$XFAC= 2
$$ ##END=
$$ 
##$DECIM=	2496
##$DSPFVS=	20
##XUNITS=	HZ
##YUNITS=	ARBITRARY UNITS
##FIRSTX=	6406.710256386850233
##LASTX=	-1606.1102564336499654
##DELTAX=	-0.24453933874997710318
##XFACTOR=	1
##YFACTOR=	2.214792305331533484
##FIRSTY=	20494.775390625
##MINY=	-2452.7373046875
##MAXY=	13170868
##NPOINTS=	32768
##XYDATA=	(X++(Y..Y))
$$ [...]
$$ plain form
3881 66 12 -37 -86 -113 -4 93 -36 -224 -186 -90 5 84 -63 -43 -24 -87 -150 -78 -7 -18 -29 118 38 -25 -90 -21 47 -41 -131 -138 -145 -152 -160 -162 -165 -167
3873 -167 -170 -156 -141 -127 -112 -82 -52 -21 8 -13 -35 -58 -80 -86 -93 -31 29 -27 -85 -29 26 22 18 15 11 15 18 21 25 7 -9 -26 -44 10 65 52 38 11 -16 -43
3863 -43 -71 -91 -112 -64 -17 11 39 -45 -130 -206 -283 -246 -209 -223 -237 -182 -128 -97 -65 -102 -139 -135 -131 -59 12 -86 -184 -169 -153 -77 0 -37 -74 -74 -74 -74 -74 -70 -66
3853 -66 -62 -58 -72 -85 -98 -111 -100 -89 -78 -67 -52 -37 -21 -6 -23 -40 10 61 -118 -298 -229 -159 -145 -130 -47 34 9 -15 27 70 -44 -158 -114 -70
3845 -70 -92 -114 -69 -23 -51 -78 -106 -133 -123 -112 -101 -90 -97 -104 -111 -118 -159 -200 -173 -146 -162 -177 -124 -71 -167 -263 -92 -194 -151 -108 -83 -57 -89 -122 -86 -51
3836 -51 9 70 -28 -126 -159 -192 -66 59 -42 -144 -178 -212 -152 -93 -101 -110 -160 -211 -177 -143 -233 -51 -136 -221 -273 -325 -263 -202 -109 -16 -82 -149 -84 -20
3828 -20 -23 -27 -39 -51 -132 -212 -219 -226 -166 -105 -65 -26 -54 -83 -69 -56 109 3 -77 -159 -190 -220 -157 -93 -125 -158 -279 -129 -132 -134 -97 -60 -90 -121 -71 -21
3819 -21 -39 -57 -92 -127 -94 -60 -104 -147 -191 -234 -193 -151 -110 -68 -133 -198 -263 -327 -227 -127 -94 -62 -122 -182 -281 -108 -98 -88 -129 -170 -80 8 -60 -129
$$ packed form
3881F6n4m9m9k7J09R7j29j88L8R6R5P9j47K0J9o3o3P2P1j1j1J47q0o3o5O9O8q8r0pppqklk
3873a67lJ4J5J4J5L0L0L1K9k1k2k3k2opO2O0n6n8N6N5mmlmMLLMj8j6j7j8N4N5j3j4k7k7k7
3863d3k8k0k1M8M7K8K8q4q5p6p7L7L7j4j4N5N4L1L2l7l7MMP2P1r8r8J5J6P6P7l7l7%%%%MM
3853f6MMj4j3j3j3J1J1J1J1J5J5J6J5j7j7N0N1j79j80O9P0J4J5Q3Q1k5k4M2M3j14j14M4M4
3845g0k2k2M5M6k8k7k8k7J0J1J1J1ppppm1m1K7K7j6j5N3N3r6r6J71j02M3M3K5K6l2l3L6L5
3836e1O0O1r8r8l3l3J26J25j01j02l4l4O0N9qrn0n1L4L4r0J82q5q5n2n2O2O1R3R3o6o7O5O4
3828b0lmj2j2q1q0ppO0O1M0L9k8k9J4J3J65j06q0q2l1l0O3O4l2l3j21J50lkL7L7l0l1N0N0
3819b1j8j8l5l5L3L4m4m3m4m3M1M2M1M2o5o5o5o4J00J00L3L2o0o0r9J73J0J0m1m1R0Q8o8o9
$$ plain form
3811 -129 -107 -85 -131 -176 -134 -92 34 -110 -99 -88 -25 36 -10 -56 -103 -150 -73 2 -79 -161 -116 -71 -25 19 -90 -199 -241 -283 -260 -238 -216 -194 -175
3803 -175 -156 -137 -118 -71 -23 -44 -65 -129 -194 -145 -96 -154 -211 -200 -190 -214 -239 -263 -288 -213 -138 -131 -125 -145 -166 -187 -207 -191 -175 -158 -142 -175 -207 -126 -46 -115
3794 -115 -185 -254 -324 -277 -231 -298 -364 -316 -269 -334 -400 -247 -95 -147 -199 -180 -161 -211 -260 -255 -250 -177 -104 -120 -136 -152 -168 -231 -294 -199 -103 -227 -351 -316
3785 -316 -281 -227 -174 -234 -294 -207 -121 -103 -85 -123 -162 -200 -239 -218 -197 -176 -155 -187 -219 -137 -56 -56 -57 -126 -195 -212 -230 -248 -266 -231 -196 -161 -127 -132 -138 -144 -150 -122
3776 -122 -94 -179 -265 -257 -248 -172 -96 -99 -102 -173 -244 -282 -320 -244 -168 -183 -199 -282 -365 -254 -143 -99 -56 -54 -52 -51 -49 -126 -204 -214 -224 -238 -252 -266 -280 -269 -258 -247
3767 -247 -236 -268 -300 -264 -227 -187 -147 -176 -204 -292 -379 -354 -328 -245 -162 -147 -132 -169 -206 -244 -281 -283 -284 -218 -151 -179 -208 -236 -265 -225 -186 -146 -106 -156 -206 -256
3758 -256 -305 -354 -403 -247 -91 -88 -84 -148 -212 -256 -299 -274 -250 -263 -277 -290 -304 -327 -351 -307 -262 -235 -208 -180 -153 -178 -202 -159 -116 -167 -219 -271 -322 -325 -328 -332
3749 -332 -335 -363 -392 -307 -222 -278 -333 -321 -308 -293 -278 -262 -247 -220 -193 -166 -139 -102 -66 -188 -309 -313 -317 -320 -324 -337 -351 -364 -378 -367 -356 -346 -335 -302 -268 -394
$$ packed form
3811a29K2K2m6m5M2M2J26j44J1J1O3O1m6m6m7m7P7P5q1q2M5M5M6M4j09j09m2m2K3K2K2K2J9
3803a75J9J9J9M7M8k1k1o4o5M9M9n8n7J1J0k4k5k4k5P5P5POk0k1k1k0J6J6J7J6l3l2Q1Q0o9
3794a15p0o9p0M7M6o7o6M8M7o5o6J53J52n2n2J9J9n0m9NNP3P3j6j6j6j6o3o3R5R6j24j24L5
3785c16L5N4N3o0o0Q7Q6J8J8l8l9l8l9K1K1K1K1l2l2Q2Q1%jo9o9j7j8j8j8L5L5L5L4noooK8
3776a22K8q5q6QRP6P6llp1p1l8l8P6P6j5j6q3q3J11J11M4M3KKJKp7p8j0j0j4j4j4j4J1J1J1
3767b47J1l2l2L6L7M0M0k9k8q8q7K5K6Q3Q3J5J5l7l7l8l7kjO6O7k8k9k8k9M0L9M0M0n0n0n0
3758b56m9m9m9J56J56LMo4o4m4m3K5K4j3j4j3j4k3k4M4M5K7K7K8K7k5k4M3M3n1n2n2n1llm
3749c32lk8k9Q5Q5n6n5J2J3J5J5J6J5K7K7K7K7L7L6j22j21mmlmj3j4j3j4J1J1J0J1L3L4j26
$$ plain form
3740 -394 -519 -359 -199 -197 -196 -222 -247 -273 -298 -259 -220 -249 -279 -313 -348 -383 -418 -342 -266 -349 -433 -369 -306 -243 -180 -192 -203 -215 -226 -232 -238 -175 -113 -218 -324
3732 -324 -270 -217 -242 -266 -291 -315 -364 -414 -349 -285 -260 -236 -211 -187 -276 -365 -340 -316 -305 -295 -284 -274 -214 -155 -209 -262 -269 -276 -283 -290 -266 -241 -217 -192 -206 -220 -233
3723 -233 -247 -225 -202 -248 -293 -327 -362 -396 -430 -435 -440 -331 -222 -257 -291 -326 -361 -348 -336 -324 -312 -278 -245 -279 -314 -301 -288 -275 -262 -270 -279 -287 -295 -330 -364 -398 -433
3714 -433 -403 -373 -344 -314 -380 -446 -399 -351 -310 -270 -229 -189 -215 -242 -268 -295 -325 -356 -319 -281 -292 -303 -314 -324 -425 -525 -466 -407 -372 -336 -368 -400 -342 -283
3706 -283 -293 -302 -357 -411 -397 -383 -361 -339 -430 -521 -355 -190 -229 -267 -259 -251 -357 -462 -438 -413 -389 -364 -388 -412 -436 -460 -366 -272 -292 -312 -302 -291 -281 -271
3697 -271 -271 -270 -270 -269 -345 -421 -338 -256 -244 -233 -290 -347 -394 -441 -420 -399 -395 -391 -388 -384 -418 -453 -420 -386 -351 -317 -350 -384 -379 -374 -370 -365 -339 -313 -356 -398 -389 -381 -372 -363 -367 -372 -444 -516
3686 -516 -432 -348 -332 -317 -307 -297 -287 -278 -242 -207 -285 -363 -367 -370 -373 -376 -330 -284 -351 -418 -317 -216 -365 -241 -466 -419 -440 -461 -410 -358 -375 -391 -404 -416 -428
3678 -428 -441 -420 -400 -431 -462 -586 -438 -290 -414 -400 -386 -321 -256 -353 -450 -387 -325 -344 -363 -382 -401 -329 -257 -299 -341 -371 -401 -432 -462 -443 -423 -404 -385
$$ packed form
3740c94j25J60J60KJk6k5k6k5L9L9k9l0l4l5l5l5P6P6q3q4O4O3O3O3j2j1j2j1ooO3O2j05j06
3732c24N4N3k5k4k5k4m9n0O5O4K5K4K5K4q9q9K5K4J1J0J1J0O0N9n4n3ppppK4K5K4K5j4j4j3
3723b33j4K2K3m6m5l4l5l4l4nnJ09J09l5l4l5l5J3J2J2J2L4L3l4l5J3J3J3J3qrqql5l4l4l5
3714d33L0L0K9L0o6o6M7M8M1M0M1M0k6k7k6k7l0l1L7L8j1j1j1j0j01j00N9N9L5L6l2l2N8N9
3706b83j0rn5n4J4J4K2K2r1r1J66J65l9l8QQj06j05K4K5K4K5k4k4k4k4R4R4k0k0J0J1J0J0
3697b71%J%Jp6p6Q3Q2J2J1n7n7m7m7K1K1MMLMl4l5L3L4L5L4l3l4NNMNK6K6m3m2RQRRmnp2p2
3686e16Q4Q4J6J5J0J0J0RL6L5p8p8mlllM6M6o7o7J01J01j49J24k25M7k1k1N1N2j7j6j3j2j2
3678d28j3K1K0l1l1j24J48J48j24J4J4O5O5r7r7O3O2j9j9j9j9P2P2m2m2l0l0l1l0J9K0J9J9
$$ plain form
3670 -385 -434 -483 -532 -581 -565 -549 -419 -290 -338 -387 -368 -349 -357 -364 -372 -380 -438 -496 -486 -476 -466 -456 -446 -436 -441 -446 -400 -354 -145 -208 -322 -436 -523 -610 -492
3661 -492 -374 -384 -394 -336 -278 -314 -350 -471 -320 -351 -383 -398 -412 -448 -483 -451 -418 -445 -472 -414 -356 -512 -396 -433 -469 -451 -432 -414 -395 -403 -411 -419 -428 -414
3653 -414 -401 -388 -375 -422 -469 -448 -428 -522 -616 -551 -486 -421 -355 -358 -360 -459 -558 -544 -529 -474 -418 -475 -533 -494 -456 -485 -514 -531 -548 -368 -416 -434 -452 -416 -380
3644 -380 -391 -401 -412 -423 -450 -478 -437 -397 -410 -423 -437 -450 -431 -412 -393 -373 -360 -346 -423 -364 -216 -295 -396 -497 -469 -441 -399 -357 -452 -320 -316 -312 -351 -389
3636 -389 -427 -465 -524 -582 -481 -380 -439 -497 -442 -387 -369 -351 -333 -315 -348 -382 -415 -448 -435 -422 -297 -491 -485 -480 -494 -508 -498 -488 -478 -468 -455 -442 -429 -416
3628 -416 -458 -501 -475 -449 -465 -481 -496 -512 -472 -433 -393 -353 -376 -399 -422 -445 -477 -510 -543 -575 -484 -393 -452 -510 -480 -314 -204 -412 -458 -505 -459 -412 -396
3620 -396 -381 -479 -577 -536 -495 -523 -550 -563 -577 -590 -603 -594 -585 -576 -567 -567 -568 -501 -434 -443 -453 -463 -472 -452 -432 -480 -528 -426 -323 -425 -528 -569 -610 -492 -374 -407
3611 -407 -440 -473 -506 -431 -356 -485 -614 -582 -550 -517 -485 -521 -556 -592 -628 -579 -531 -550 -569 -533 -498 -530 -562 -476 -390 -372 -355 -410 -466 -522 -578 -597 -615 -633
$$ packed form
3670c85m9m9m9m9J6J6J30J29m8m9J9J9qpqqn8n8J0J0J0J0J0J0nnM6M6K09o3j14j14q7q7J18
3661d92J18j0j0N8N8l6l6j21J51l1l2j5j4l6l5L2L3k7k7N8N8j56J16l7l6J8J9J8J9qqqrJ4
3653d14J3J3J3m7m7K1K0r4r4O5O5O5O6lkr9r9J4J5N5N6n7n8L9L8k9k9j7j7J80m8j8j8L6L6
3644c80j1j0j1j1k7k8M1M0j3j3j4j3J9J9J9K0J3J4p7N9J48p9j01j01K8K8M2M2r5J32MMl9l8
3636c89l8l8n9n8J01J01n9n8N5N5J8J8J8J8l3l4l3l3J3J3J25j94ONj4j4J0J0J0J0J3J3J3J3
3628d16m2m3K6K6j6j6j5j6M0L9M0M0k3k3k3k3l2l3l3l2R1R1n9n8L0J66J10k08m6m7M6M7J6
3620c96J5r8r8M1M1k8k7j3j4j3j3RRRR%jO7O7rj0j0rK0K0m8m8J02J03j02j03m1m1J18J18l3
3611d07l3l3l3P5P5j29j29L2L2L3L2l6l5l6l6M9M8j9j9L6L5l2l2Q6Q6J8J7n5n6n6n6j9j8j8
$$ plain form
3603 -633 -652 -619 -586 -553 -521 -553 -586 -618 -651 -644 -637 -629 -622 -648 -673 -698 -724 -720 -715 -711 -707 -563 -420 -436 -451 -491 -531 -502 -474 -557 -639 -563 -487 -575 -663 -593 -522 -592
3593 -592 -661 -572 -482 -474 -465 -524 -584 -566 -548 -530 -513 -475 -437 -513 -589 -577 -566 -555 -543 -535 -526 -517 -509 -558 -607 -588 -569 -529 -489 -517 -545 -474 -404 -447 -490 -486 -482 -478 -474 -555
3584 -555 -636 -648 -661 -586 -511 -549 -587 -583 -579 -575 -570 -580 -590 -600 -610 -539 -468 -511 -553 -539 -525 -511 -496 -477 -457 -551 -645 -606 -566 -527 -488 -449 -411 -441 -471 -497 -524
3574 -524 -551 -578 -535 -493 -563 -634 -574 -514 -522 -531 -508 -485 -462 -439 -494 -549 -604 -659 -609 -559 -508 -458 -466 -474 -482 -490 -525 -560 -527 -494 -531 -567 -536 -504 -591 -677 -649 -622
3565 -622 -583 -544 -574 -603 -631 -660 -620 -580 -538 -495 -520 -546 -596 -646 -583 -520 -614 -709 -644 -579 -564 -548 -532 -517 -477 -437 -466 -494 -563 -632 -633 -634 -560 -486 -571 -655
3556 -655 -656 -657 -658 -658 -624 -589 -622 -655 -682 -709 -622 -536 -541 -547 -552 -558 -571 -585 -531 -476 -477 -478 -479 -480 -489 -498 -508 -517 -566 -615 -665 -714 -684 -654 -625 -595 -544 -493 -511 -528 -574 -621
3546 -621 -667 -714 -709 -704 -700 -695 -607 -519 -545 -570 -541 -511 -549 -587 -648 -708 -700 -692 -612 -532 -656 -780 -714 -648 -581 -515 -548 -581 -614 -647 -563 -478 -598 -718 -656 -595
3537 -595 -601 -607 -594 -581 -568 -555 -600 -645 -576 -508 -585 -662 -580 -498 -532 -567 -448 -602 -616 -630 -661 -692 -684 -675 -667 -658 -651 -643 -636 -629 -615 -602 -657 -712 -774 -836 -784 -732 -645
$$ packed form
3603f33j9L3L3L3L2l2l3l2l3PPQPk6k5k5k6MNMMJ44J43j6j5m0m0K9K8q3q2P6P6q8q8P0P1p0
3593e92o9Q9R0QRn9o0J8J8J8J7L8L8p6p6J2J1J1J2QRRQm9m9J9J9M0M0k8k8P1P0m3m3MMMMq1
3584e55q1j2j3P5P5l8l8MMMNj0j0j0j0P1P1m3m2J4J4J4J5J9K0r4r4L9M0L9L9L9L8l0l0k6k7
3574e24k7k7M3M2p0p1O0O0qrK3K3K3K3n5n5n5n5N0N0N1N0qqqql5l5L3L3l7l6L1L2q7q6K8K7
3565f22L9L9l0k9k8k9M0M0M2M3k5k6n0n0O3O3r4r5O5O5J5J6J6J5M0M0k9k8o9o9jjP4P4q5q4
3556f55jjj%L4L5l3l3k7k7Q7Q6nonoj3j4N4N5jjjjrrj0rm9m9n0m9L0L0K9L0N1N1j8j7m6m7
3546f21m6m7NNMNQ8Q8k6k5K9L0l8l8o1o0QQQ0Q0j24j24O6O6O7O6l3l3l3l3Q4Q5j20j20O2O1
3537e95ooJ3J3J3J3m5m5O9O8p7p7Q2Q2l4l5J19j54j4j4l1l1QRQRPQPPJ4J3n5n5o2o2N2N2Q7
$$ plain form
3528 -645 -558 -584 -610 -603 -596 -588 -581 -599 -618 -636 -654 -737 -820 -654 -487 -518 -549 -579 -610 -603 -596 -588 -581 -585 -589 -661 -733 -745 -757 -656 -554 -582 -609 -637 -664 -633 -602 -638
3518 -638 -675 -712 -749 -718 -687 -670 -653 -637 -620 -595 -570 -459 -621 -590 -559 -562 -565 -537 -781 -804 -827 -788 -749 -728 -706 -583 -733 -730 -726 -717 -708 -716 -724 -591 -731
3510 -731 -718 -704 -719 -734 -680 -627 -639 -650 -662 -674 -714 -753 -679 -606 -617 -628 -418 -480 -519 -558 -614 -670 -761 -853 -848 -843 -616 -662 -714 -765 -831 -896 -650 -676
3502 -676 -712 -748 -597 -445 -453 -460 -581 -702 -754 -807 -745 -684 -694 -704 -713 -723 -698 -673 -648 -623 -687 -751 -594 -709 -681 -652 -641 -630 -655 -680 -706 -731 -707
3494 -707 -682 -771 -860 -752 -644 -649 -654 -593 -531 -629 -726 -724 -722 -720 -719 -706 -693 -680 -667 -688 -710 -731 -752 -732 -712 -693 -673 -653 -633 -682 -730 -690 -649 -677 -705 -737 -769
3484 -769 -733 -697 -723 -750 -777 -804 -785 -766 -680 -593 -638 -683 -728 -772 -853 -933 -900 -867 -834 -801 -654 -507 -647 -787 -768 -749 -783 -816 -889 -689 -778 -866
3477 -866 -734 -601 -644 -688 -731 -774 -799 -824 -781 -738 -642 -546 -654 -763 -786 -809 -815 -821 -953 -811 -824 -836 -856 -877 -829 -782 -764 -746 -797 -847 -838 -829 -819 -810
3468 -810 -827 -844 -861 -878 -882 -887 -874 -861 -1079 -1024 -919 -813 -877 -942 -848 -753 -794 -834 -891 -949 -674 -672 -675 -679 -690 -701 -712 -723 -655 -587 -740 -621 -667 -714
$$ packed form
3528f45Q7k6k6PPQPj8j9j8j8q3q3J66J67l1l1l0l1PPQPmmp2p2j2j2J01J02k8k7k8k7L1L1l6
3518f38l7l7l7L1L1J7J7J6J7K5K5J11j62L1L1llK8k44k3k3L9L9K1K2J23j50LMRRqqJ33j40
3510g31J3J4j5j5N4N3j2j1j2j2m0l9P4P3j1j1K10o2l9l9n6n6r1r2NNK27m6n2n1o6o5K46k6
3502f76l6l6J51J52qpj21j21n2n3O2O1j0j0rj0K5K5K5K5o4o4J57j15K8K9J1J1k5k5k6k5K4
3494g07K5q9q9J08J08nnO1O2r8r7KKKJJ3J3J3J3k1k2k1k1K0K0J9K0K0K0m9m8M0M1k8k8l2l2
3484g69L6L6k6k7k7k7J9J9Q6Q7m5m5m5m4q1q0L3L3L3L3J47J47j40j40J9J9l4l3p3K00q9q8
3477h66J32J33m3m4m3m3k5k5M3M3R6R6j08j09k3k3ooj32J42j3j2k0k1M8M7J8J8n1n0RRJ0R
3468h10j7j7j7j7mnJ3J3k18N5J05J06o4o5R4R5m1m0n7n8K75Klmj1j1j1j1O8O8j53J19m6m7
$$ plain form
3460 -714 -744 -773 -790 -807 -841 -875 -702 -802 -748 -694 -719 -743 -767 -792 -736 -679 -691 -703 -711 -719 -726 -734 -712 -690 -668 -646 -661 -676 -741 -807 -945 -811 -762 -713 -692
3451 -692 -671 -718 -765 -684 -602 -633 -665 -732 -799 -798 -797 -839 -880 -768 -929 -871 -813 -772 -731 -789 -848 -838 -828 -784 -741 -765 -789 -780 -771 -763 -754 -783 -813 -842 -872 -835 -799
3442 -799 -762 -726 -727 -729 -731 -733 -697 -661 -693 -725 -685 -645 -673 -701 -692 -683 -742 -801 -785 -769 -753 -737 -782 -827 -758 -690 -692 -695 -697 -699 -680 -660 -754 -848 -844 -840 -836 -832 -791 -750 -710 -669
3432 -669 -764 -860 -887 -914 -892 -869 -779 -689 -712 -735 -758 -781 -798 -816 -834 -851 -801 -751 -768 -786 -757 -727 -766 -804 -752 -700 -648 -596 -639 -683 -726 -769 -864 -958 -939
3424 -939 -920 -853 -787 -788 -790 -856 -923 -922 -920 -967 -1014 -947 -881 -933 -986 -970 -955 -916 -876 -905 -934 -963 -991 -952 -913 -811 -709 -675 -641 -735 -829 -809 -790 -755 -721 -754
3415 -754 -788 -794 -801 -875 -950 -911 -872 -833 -794 -816 -838 -860 -882 -874 -865 -857 -848 -833 -817 -802 -786 -865 -945 -911 -877 -802 -727 -765 -804 -875 -946 -903 -861 -826 -790 -868 -947 -873
3405 -873 -799 -725 -651 -732 -813 -780 -747 -751 -755 -827 -899 -819 -739 -818 -897 -919 -940 -961 -983 -933 -884 -681 -751 -717 -684 -735 -787 -762 -736 -779 -822 -828 -833 -838 -843 -759 -674
3396 -674 -794 -914 -977 -1039 -897 -756 -754 -753 -667 -853 -821 -789 -775 -760 -779 -799 -818 -838 -824 -810 -728 -646 -673 -700 -841 -982 -896 -810 -883 -956 -916 -876
$$ packed form
3460g14l0k9j7j7l4l4J73j00N4N4k5k4k4k5N6N7j2j2qqpqK2K2K2K2j5j5o5o6j38J34M9M9K1
3451f92K1m7m7Q1Q2l1l2o7o7JJm2m1J12j61N8N8M1M1n8n9J0J0M4M3k4k4RRQRk9l0k9l0L7L6
3442g99L7L6jkkkL6L6l2l2M0M0k8k8RRn9n9J6J6J6J6m5m5O9O8klkkJ9K0r4r4MMMMM1M1M0M1
3432f69r5r6k7k7K2K3R0R0k3k3k3k3j7j8j8j7N0N0j7j8K9L0l9l8N2N2N2N2m3m4m3m3r5r4J9
3424i39J9O7O6jko6o7JKm7m7O7O6n2n3J6J5L9M0k9k9k9k8L9L9J02J02L4L4r4r4K0J9L5L4l3
3415g54l4opp4p5L9L9L9L9k2k2k2k2QRQRJ5J6J5J6p9q0L4L4P5P5l8l9p1p1M3M2L5L6p8p9P4
3405h73P4P4P4q1q1L3L3mmp2p2Q0Q0p9p9k2k1k1k2N0M9K03p0L4L3n1n2K5K6m3m3onnnQ4Q5
3396f74j20j20o3o2J42J41KJQ6j86L2L2J4J5j9k0j9k0J4J4Q2Q2k7k7j41j41Q6Q6p3p3M0M0
$$ plain form
3389 -876 -904 -931 -878 -825 -903 -980 -757 -806 -968 -858 -941 -1024 -976 -928 -852 -776 -768 -760 -836 -911 -919 -927 -863 -800 -850 -900 -838 -776 -827 -878 -865 -853 -857 -861 -783 -977
3380 -977 -904 -831 -805 -779 -753 -726 -759 -791 -824 -856 -812 -768 -945 -850 -790 -730 -858 -985 -930 -874 -887 -899 -938 -977 -1016 -1055 -1009 -963 -1070 -904 -840 -775
3372 -775 -807 -839 -868 -897 -943 -989 -823 -929 -950 -971 -996 -1021 -888 -754 -837 -920 -907 -893 -805 -989 -1019 -1050 -946 -842 -852 -862 -849 -836 -823 -810 -764
3364 -764 -718 -785 -852 -800 -748 -764 -780 -808 -835 -863 -890 -827 -764 -768 -773 -854 -935 -863 -1063 -1045 -1027 -1025 -1024 -917 -809 -860 -911 -869 -827 -852 -878 -880 -882 -884 -886 -854 -822
3355 -822 -858 -894 -908 -923 -937 -952 -846 -739 -838 -936 -872 -808 -858 -907 -901 -896 -958 -1020 -938 -856 -774 -692 -694 -696 -936 -903 -744 -856 -957 -1058 -1004 -951 -880
3347 -880 -809 -978 -875 -658 -714 -758 -802 -796 -789 -827 -866 -904 -943 -894 -844 -795 -746 -808 -870 -864 -859 -874 -890 -752 -887 -843 -799 -772 -744 -744 -744 -744 -744 -827 -909 -878
3338 -878 -848 -885 -922 -891 -860 -872 -884 -895 -907 -870 -834 -797 -761 -885 -1009 -975 -940 -964 -987 -943 -898 -1003 -1107 -1007 -907 -961 -1014 -1013 -1013 -859 -931 -944
3331 -944 -957 -942 -927 -911 -896 -870 -844 -804 -764 -854 -717 -640 -790 -903 -880 -835 -789 -807 -825 -843 -861 -863 -865 -935 -1004 -945 -886 -940 -994 -942 -890 -951 -1012 -960
$$ packed form
3389h76k8k7N3N3p8p7K23m9j62J10q3q3M8M8P6P6QQp6p5qqO4O3n0n0O2O2n1n1J3J2mmP8j94
3380i77P3P3K6K6K6K7l3l2l3l2M4M4j77R5O0O0j28j27N5N6j3j2l9l9l9l9M6M6j07J66O4O5
3372g75l2l2k9k9m6m6J66j06k1k1k5k5J33J34q3q3J3J4Q8j84l0l1J04J04j0j0J3J3J3J3M6
3364g64M6o7o7N2N2j6j6k8k7k8k7O3O3mnq1q1P2k00J8J8KJJ07J08n1n1M2M2k5k6kkkkL2L2
3355h22l6l6j4j5j4j5J06J07r9r8O4O4n0m9ONo2o2Q2Q2Q2Q2kkk40L3J59j12j01j01N4N3P1
3347h80P1j69J03K17n6m4m4OPl8l9l8l9M9N0M9M9o2o2ONj5j6J38j35M4M4K7K8%%%%q3q2L1
3338h78L0l7l7L1L1j2j2j1j2L7L6L7L6j24j24L4L5k4k3M4M5j05j04J00J00n4n3J%J54p2j3
3331i44j3J5J5J6J5K6K6M0M0r0J37P7j50j13K3M5M6j8j8j8j8kkp0o9N9N9n4n4N2N2o1o1N2
$$ plain form
3322 -960 -908 -870 -832 -721 -837 -910 -847 -735 -758 -811 -863 -897 -932 -967 -1002 -852 -702 -712 -721 -735 -749 -763 -777 -787 -797 -935 -846 -865 -885 -890 -896 -901 -906 -912 -917
3314 -917 -902 -886 -871 -855 -835 -816 -796 -776 -731 -685 -844 -1003 -967 -932 -897 -861 -850 -839 -828 -817 -806 -795 -784 -773 -744 -716 -687 -658 -645 -632 -732 -833 -808
3306 -808 -782 -757 -732 -659 -585 -671 -756 -782 -807 -833 -859 -837 -816 -795 -774 -801 -828 -855 -882 -852 -823 -793 -763 -791 -819 -847 -875 -841 -808 -775 -742 -799 -856 -845 -833
3297 -833 -923 -1012 -943 -874 -802 -730 -771 -812 -818 -824 -762 -699 -717 -734 -751 -768 -810 -851 -824 -797 -892 -986 -921 -857 -856 -855 -855 -854 -758 -663 -771 -880 -849 -819 -788 -758 -686
3288 -686 -614 -701 -788 -785 -783 -781 -778 -805 -832 -858 -885 -848 -811 -773 -736 -806 -875 -831 -787 -777 -767 -757 -747 -768 -789 -879 -968 -853 -738 -736 -735 -799 -864 -928 -992 -939 -886
3279 -886 -832 -779 -798 -817 -836 -855 -813 -771 -729 -687 -727 -768 -740 -713 -789 -865 -873 -881 -908 -936 -850 -764 -755 -745 -736 -726 -724 -723 -721 -719 -687 -655 -737 -819 -844 -869 -895 -920 -857
3270 -857 -795 -800 -806 -785 -763 -742 -721 -765 -809 -853 -897 -845 -793 -808 -824 -818 -813 -807 -802 -787 -772 -757 -742 -748 -754 -761 -767 -706 -646 -654 -662 -647 -632 -730 -829 -795 -761 -727 -693 -723 -754
3259 -754 -784 -814 -759 -705 -651 -596 -637 -678 -718 -759 -804 -850 -782 -714 -650 -587 -636 -686 -676 -666 -723 -781 -760 -738 -785 -831 -777 -723 -783 -842 -774 -706 -706 -706 -689 -672
$$ packed form
3322i60N2L8L8J11j16p3O3J12k3n3n2l4l5l5l5J50J50j0rj4j4j4j4j0j0j38Q9j9k0nonnon
3314i17J5J6J5J6K0J9K0K0M5M6j59j59L6L5L5L6J1J1J1J1J1J1J1J1K9K8K9K9J3J3j00j01K5
3306h08K6K5K5P3P4q6q5k6k5k6k6K2K1K1K1k7k7k7k7L0K9L0L0k8k8k8k8L4L3L3L3n7n7J1J2
3297h33r0q9O9O9P2P2m1m1ooO2O3j8j7j7j7m2m1K7K7r5r4O5O4JJ%JR6R5j08j09L1L0L1L0P2
3288f86P2q7q7LKKLk7k7k6k7L7L7L8L7p0o9M4M4J0J0J0J0k1k1r0q9J15J15KJo4o5o4o4N3N3
3279h86N4N3j9j9j9j9M2M2M2M2m0m1K8K7p6p6qqk7k8Q6Q6RJ0RJ0KJKKL2L2q2q2k5k5k6k5O3
3270h57O2noK1K2K1K1m4m4m4m4N2N2j5j6ONONJ5J5J5J5oopoO1O0qqJ5J5r8r9L4L4L4L4l0l1
3259g54l0l0N5N4N4N5m1m1m0m1m5m6O8O8O4O3m9n0J0J0n7n8K1K2m7m6N4N4o0n9O8O8%%J7J7
$$ plain form
3251 -672 -724 -775 -788 -801 -814 -827 -808 -790 -703 -616 -714 -811 -750 -689 -672 -656 -639 -623 -630 -638 -645 -653 -637 -622 -606 -591 -602 -613 -625 -636 -667 -698 -616 -533 -617 -700 -670
3242 -670 -640 -629 -618 -676 -733 -724 -715 -705 -696 -738 -779 -753 -727 -705 -683 -729 -775 -715 -656 -665 -674 -656 -638 -620 -602 -705 -808 -752 -696 -700 -704 -707 -711 -669 -627 -653 -679 -685 -691
3232 -691 -765 -839 -792 -744 -697 -649 -628 -606 -516 -426 -496 -567 -637 -707 -758 -808 -745 -682 -669 -655 -641 -628 -687 -745 -645 -545 -637 -729 -662 -596 -672 -749 -712 -675
3224 -675 -689 -704 -719 -734 -673 -613 -621 -629 -578 -527 -544 -562 -573 -585 -528 -472 -579 -687 -635 -584 -594 -605 -548 -491 -511 -530 -482 -434 -415 -396 -446 -495 -478 -460 -443
3215 -443 -425 -467 -509 -483 -457 -493 -530 -567 -603 -606 -608 -610 -613 -542 -470 -467 -464 -525 -585 -260 -389 -578 -495 -480 -465 -571 -677 -578 -480 -468 -456 -462 -467 -346 -497
3207 -497 -632 -494 -589 -411 -370 -328 -413 -498 -469 -441 -455 -469 -483 -498 -484 -470 -455 -441 -496 -551 -538 -525 -436 -348 -373 -398 -363 -327 -405 -483 -466 -449 -483
3199 -483 -517 -606 -423 -393 -363 -413 -463 -512 -562 -453 -344 -439 -534 -475 -417 -427 -437 -456 -474 -492 -511 -403 -295 -301 -307 -441 -575 -550 -525 -412 -300
3191 -300 -192 -358 -392 -426 -318 -210 -254 -298 -341 -385 -399 -412 -357 -303 -261 -219 -290 -362 -323 -284 -313 -342 -277 -211 -258 -306 -314 -322 -330 -337 -360 -382 -404 -426 -357
$$ packed form
3251f72n2n1j3j3j3j3J9J8Q7Q7r8r7O1O1J7J6J7J6pqpqJ6J5J6J5j1j1j2j1l1l1Q2Q3q4q3L0
3242f70L0J1J1n8n7RRJ0Rm2m1K6K6K2K2m6m6O0N9rrJ8J8J8J8j03j03N6N6mmlmM2M2k6k6oo
3232f91p4p4M7M8M7M8K1K2R0R0p0p1p0p0n1n0O3O3J3J4J4J3n9n8J00J00r2r2O7O6p6p7L7L7
3224f75j4j5j5j5O1O0qqN1N1j7j8j1j2N7N6j07j08N2N1j0j1N7N7k0j9M8M8J9J9n0m9J7J8J7
3215d43J8m2m2K6K6l6l7l7l6lkklP1P2LLo1o0L25j29j89Q3J5J5j06j06R9R8J2J2onJ21j51
3207d97j35J38r5J78M1M2q5q5K9K8j4j4j4j5J4J4J5J4n5n5J3J3Q9Q8k5k5L5L6p8p8J7J7l4
3199d83l4q9J83L0L0n0n0m9n0J09J09r5r5N9N8j0j0j9j8j8j9J08J08ooj34j34K5K5J13J12
3191c00J08j66l4l4J08J08m4m4m3m4j4j3N5N4M2M2p1p2L9L9k9k9O5O6m7m8qqqpk3k2k2k2O9
$$ plain form
3182 -357 -288 -333 -378 -398 -419 -326 -233 -194 -155 -275 -395 -395 -396 -329 -261 -309 -357 -337 -317 -373 -429 -418 -406 -386 -367 -398 -430 -547 -391 -312 -369 -324 -280 -243
3174 -243 -207 -213 -220 -339 -459 -375 -290 -274 -257 -262 -267 -272 -277 -301 -326 -282 -238 -221 -205 -301 -398 -421 -443 -398 -352 -362 -372 -382 -392 -360 -328 -192 -55 -20 -122
3166 -122 -317 -240 -81 -195 -252 -309 -309 -309 -309 -309 -265 -221 -290 -359 -361 -364 -298 -232 -271 -310 -235 -161 -203 -244 -286 -328 -272 -216 -253 -155 -51 -219 -302 -249 -261
3157 -261 -273 -123 -246 -187 -128 -154 -180 -218 -256 -181 -105 -72 -39 -74 -109 -157 -204 -184 -164 -190 -217 -175 -134 -172 -211 -250 -288 -340 -391 -238 -85 -89 -92 -163
3149 -163 -234 -148 -62 23 109 1 -107 -147 -188 -134 -81 -28 24 -86 -197 -195 -193 -191 -189 -119 -49 -88 -127 -166 -205 -190 -175 -160 -145 -59 26 -1 -29 15 60
3140 60 -99 -258 -173 -88 -71 -54 -34 -14 -62 -110 -69 -28 -55 -82 -23 34 24 14 -70 -155 -37 81 119 157 127 97 80 63 45 28 2 -22 19
3132 19 61 64 68 71 75 18 -37 -93 -149 -54 41 23 5 1 -1 -5 -9 -32 -55 34 124 132 140 80 20 41 63 84 106 34 -38 48 135 131 128 124 121 93 65 38 10 58
3122 58 105 153 200 153 105 126 146 148 150 151 153 248 344 280 217 203 190 176 163 194 226 190 154 184 213 243 273 303 332 294 256 238 219 201 183 225 266
$$ packed form
3182c57O9m5m5k0k1R3R3L9L9j20j20%jO7O8m8m8K0K0n6n6J1J2K0J9l1l2j17J56P9n7M5M4L7
3174b43L6opj19j20Q4Q5J6J7nnnnk4k5M4M4J7J6r6r7k3k2M5M6j0j0j0j0L2L2J36J37L5j02
3166a22j95P7J59j14n7n7%%%%M4M4o9o9klO6O6l9l9P5P4m2m1m2m2N6N6l7R8J04j68q3N3j2
3157b61j2J50j23N9N9k6k6l8l8P5P6L3L3l5l5m8m7K0K0k6k7M2M1l8l9l9l8n2n1J53J53mlp1
3149a63p1Q6Q6Q5Q6j08j08m0m1N4N3N3N2j10j11KKKKP0P0l9l9l9l9J5J5J5J5Q6Q5k7k8M4M5
3140F0j59j59Q5Q5J7J7K0K0m8m8M1M1k7k7N9N7j0j0q4q5J18J18L8L8l0l0j7j7j8j7k6k4M1
3132A9M2LMLMn7n5n6n6R5R5j8j8mkmmk3k3Q9R0QQo0o0K1K2K1K2p2p2Q6Q7mlmlk8k8k7k8M8
3122E8M7M8M7m7m8K1K0KKJKR5R6o4o3j4j3j4j3L1L2l6l6L0K9L0L0L0K9l8l8j8j9j8j8M2M1
$$ plain form
3113 266 194 122 146 170 194 217 234 251 268 284 283 282 281 281 280 279 278 277 262 248 233 219 200 181 231 280 271 263 254 245 296 347 329 312 346 380 243 379 451 251
3103 251 289 327 351 376 333 290 268 246 224 202 277 353 360 367 314 262 306 350 463 304 298 292 399 507 473 438 313 461 455 449 494 539 585 630 807
3094 807 984 974 964 918 1145 1286 1428 1268 1108 909 981 970 959 965 971 820 669 585 502 437 372 421 469 570 670 702 734 713 691 737
3087 737 784 1000 1217 1348 1479 1492 1232 1239 1245 1315 1386 1252 1118 997 876 754 633 828 1023 1105 1187 1176 1166 1359 1553 1459 1365 1158
3080 1158 951 949 947 792 910 765 620 651 682 657 633 609 584 627 670 712 755 737 718 717 716 645 846 1172 1499 1631 1490 1316 1142 1159
3073 1159 1449 1472 1495 1287 1079 938 798 685 572 459 346 385 423 462 501 523 545 568 590 517 445 440 435 466 496 527 557 558 559 560 560 561 562 563
3065 563 564 555 546 537 528 487 446 518 590 569 548 526 505 516 527 588 650 699 476 520 563 592 622 520 419 594 497 554 610 568 526 417 307 378
3056 378 450 522 594 643 693 581 605 727 577 418 532 679 553 598 643 589 534 639 743 648 553 572 591 628 665 702 739 617 496
$$ packed form
3113B66p2p2K4K4K4K3J7J7J7J6jjj%jjjjj5j4j5j4j9j9N0M9rqrrN1N1j8j7L4L4j37J36P2k00
3103B51L8L8K4K5m3m3k2k2k2k2P5P6PPn3n2M4M4J13j59ooJ07J08l4l5j25J48ooM5M5M6M5J77
3094H07J77j0j0m6K27J41J42j60j60j99P2j1j1OOj51j51q4q3o5o5M9M8J01J00L2L2k1k2M6
3087G37M7K16K17J31J31J3k60POP0P1j34j34j21j21j22j21J95J95Q2Q2j1j0J93J94r4r4k07
3080A158k07kkj55J18j45j45L1L1k5k4k4k5M3M3M2M3j8j9jjp1K01L26L27J32j41j74j74J7
3073A159K90K3K3k08k08j41j40j13j13j13j13L9L8L9L9K2K2K3K2p3p2nnL1L0L1L0JJJ%JJJ
3065E63Jrrrrm1m1P2P2k1k1k2k1J1J1O1O2M9k23M4M3K9L0j02j01J75r7N7N6m2m2j09j10P1
3056C78P2P2P2M9N0j12K4J22j50j59J14J47j26M5M5n4n5J05J04r5r5J9J9L7L7L7L7j22j21
$$ plain form
3049 496 471 718 674 631 673 714 673 633 705 778 725 671 618 564 669 773 812 716 611 780 803 691 563 572 762 680 645 610 671 732 771
3042 771 811 850 890 912 934 957 979 1105 1230 1243 1255 1196 1137 1078 1020 1097 1175 1094 1013 1034 1054 1075 1096 1069 1041 945 850 900 950 1086 949 917 885
3034 885 949 1013 1191 1369 1479 1588 1630 1672 1645 1619 1609 1600 1704 1808 1787 1767 1587 1408 1370 1332 1362 1393 1325 1258 1258 1259 1299 1339 1226 1386 1374
3026 1374 1362 1367 1372 1459 1547 1855 1892 1769 1647 1712 1776 1810 1843 1627 1411 1459 1506 1486 1466 1407 1348 1290 1231 1266 1301 1268 1235 1169 1103 1361 1618 2197
3018 2197 2504 2441 1925 1617 1580 1628 1405 1407 1410 1345 1280 1186 1364 1390 1415 1416 1416 1416 1416 1361 1306 1319 1332 1329 1325 1321 1318 1370 1421 1513 1332 1339 1347 1406 1465 1478 1492
3009 1492 1505 1519 1589 1659 1576 1766 1942 2119 2244 2370 2327 2284 2240 2197 2262 2327 2170 2286 2323 2359 2396 2433 2583 2461 2350 2239 2070 2173
3002 2173 2395 2163 1942 1994 2085 2177 2128 2351 2420 2490 2713 2936 3000 3065 2989 2914 2685 2729 2848 2967 2853 2740 2891 3042 3124 3207 3002
2996 3002 2797 2592 2387 2379 2371 2294 2218 2283 2347 2252 2158 2126 2095 2268 2440 2389 2338 2354 2371 2371 2371 2303 2235 2296 2357 2419 2480 2411 2342 2387 2432 2442 2453 2350
$$ packed form
3049D96k5K47m4m3M2M1m1m0P2P3n3n4n3n4J05J04L9r6j05J69K3j12j28RJ90q2l5l5O1O1L9
3042G71M0L9M0K2K2K3K2J26J25J3J2n9n9n9n8P7P8q1q1K1K0K1K1k7k8r6r5N0N0J36j37l2l2
3034H85O4O4J78J78J10J09M2M2k7k6j0rJ04J04k1k0j80j79l8l8L0L1o8o7%JM0M0j13J60j2
3026A374j2NNQ7Q8L08L7j23j22O5O4L4L3k16k16M8M7k0k0n9n9n8n9L5L5l3l3o6o6K58K57N79
3018B197L07o3n16l08l7M8k23KLo5o5r4J78K6K5J%%%n5n5J3J3lmmlN2N1R2j81PQN9N9J3J4
3009A492J3J4P0P0q3J90J76J77J25J26m3m3m4m3O5O5j57J16L7L6L7L7J50j22j11j11j69J03
3002B173K22k32k21N2R1R2m9K23O9P0K23K23O4O5p6p5k29M4J19J19j14j13J51J51Q2Q3k05
2996C002k05k05k05qqp7p6O5O4r5r4l2l1J73J72n1n1J6J7%%o8o8O1O1O2O1o9o9M5M5J0J1j03
$$ plain form
2987 2350 2248 2266 2284 2303 2321 2371 2420 2402 2383 2373 2362 2352 2342 2406 2471 2604 2737 2742 2748 2640 2532 2505 2478 2451 2424 2453 2482 2443 2404 2438 2471 2505 2538
2979 2538 2550 2561 2572 2583 2614 2645 2710 3048 3480 3641 3495 3349 3350 3352 3467 3582 3614 3646 3383 3120 3018 2917 2883 2850 2746 2643 2699 2754 2801
2972 2801 2848 2827 2806 2791 2775 2828 2881 3129 3377 3781 4322 4655 4716 4871 5025 5024 5023 5098 5173 5026 5015 4975 4663 4181 3836 3615 3530 3432 3334
2965 3334 3313 3292 3263 3233 3317 3401 3395 3389 3315 3241 3280 3320 3637 3954 4398 4569 4616 4390 4332 4273 4277 4554 4799 4771 4483 4195 4030 3865 3768 3672
2958 3672 3687 3703 3719 3735 3717 3699 3732 3765 3851 3664 3630 3597 3657 3717 3777 3837 3743 3649 3623 3597 3654 3710 3653 3596 3671 3746 3821 3896 3769 3642 3720 3798 3813
2950 3813 3828 3843 3859 3891 3923 3955 3988 3991 3995 4066 4138 4129 4120 4071 4294 4205 4117 4113 4110 4132 4154 4176 4198 4178 4159 3987 4087 4222 4358 4414 4470 4338 4478 4449
2941 4449 4419 4600 4510 4657 4532 4634 4735 4553 4643 4729 4815 4759 4703 4749 4794 4840 4885 4887 4888 4890 4891 4955 5019 5083 5147 5220 5292 5279 5539 5517 5494 5438 5381
2933 5381 5293 5478 5526 5575 5503 5705 5753 5801 5847 5894 5901 5908 5739 6024 6053 6083 6131 6179 5989 6252 6121 6261 6124 6259 6388 6517 6459 6674 6624
$$ packed form
2987B350j02J8J8J9J8N0M9j8j9j0j1j0j0O4O5J33J33NOj08j08k7k7k7k7K9K9l9l9L4L3L4L3
2979B538J2J1J1J1L1L1O5L38M32J61j46j46JKJ15J15L2L2k63k63j02j01l4l3j04j03N6N5M7
2972B801M7k1k1j5j6N3N3K48K48M04N41L33O1J55J54jjP5P5j47j1m0l12m82l45k21q5r8r8
2965C334k1k1k9l0Q4Q4oop4p4L9M0L17L17M44J71M7k26n8n9MK77K45k8k88k88j65j65r7r6
2958C672J5J6J6J6j8j8L3L3Q6j87l4l3O0O0O0O0r4r4k6k6N7N6n7n7P5P5P5P5j27j27P8P8J5
2950C813J5J5J6L2L2L2L3LMP1P2rrm9K23q9q8mlK2K2K2K2k0j9j72J00J35J36N6N6j32J40k9
2941D449l0J81r0J47j25J02J01j82R0Q6Q6n6n6M6M5M6M5KJKJO4O4O4O4P3P2j3K60k2k3n6n7
2933E381q8J85M8M9p2K02M8M8M6M7PPj69K85K9L0M8M8j90K63j31J40j37J35J29J29n8K15n0
$$ plain form
2926 6624 6847 6729 6884 6728 6845 6757 6942 6901 7132 7001 7323 7161 7454 7202 7585 7310 7670 7395 7756 7553 7986 7886 8239 7928
2920 7928 8252 8010 8402 8118 8651 8559 9103 8570 9398 9227 10055 9674 10655 10206 11664 11370 13344 13447 16727 18239 27103 42581
2915 42581 102984 183656 230114 192870 119595 92332 68245 52939 37179 27958 21187 19408 16630 16391 14791
2911 14791 14835 13699 13908 13119 13396 12856 13133 12775 13245 12716 13011 12670 12942 12579 12817 12420 12806 12737 13140 12907 13225 13542 14223
2906 14223 14449 15067 15050 15261 15200 15786 16099 16994 17071 17053 16580 16767 16954 17589 17771 18118 18012 18038 18337 19060 19647 20344 20769 21595
2900 21595 22422 24229 26491 30464 36343 48972 78391 141594 206886 234648 202239 155003 137445 139808 184918
2896 184918 240233 265506 226932 163218 127160 100631 81011 64567 54029 47393 44591 42606 42443 42007 42618
2892 42618 42957 44279 45738 50416 57908 73688 106076 177446 259433 312299 321329 342532 390145 409195 399656
$$ packed form
2926F624K23j18J55j56J17q8J85m1K31j31L22j62K93k52L83k75L60k75L61k03M33j00L53l11
2920G928L24k42L92k84N33r2N44n33Q28j71Q28l81R81m49J458k94J974J03L280J512Q864J5478
2915D2581O0403Q0672M6458l7244p3275k7263k4087j5306j5760r221o771j779k778k39j600
2911A4791M4j136K09p89K77n40K77l58M70n29K95l41K72l63K38l97L86o9M03k33L18L17O81
2906A4223K26O18j7K11o1N86L13Q95P7j8m73J87J87O35J82L47j06K6K99P23N87O97M25Q26
2900B1595Q27J807K262L973N879J2629K9419O3203O5292K7762l2409m7236j7558K363M5110
2896A84918N5315K5273l8574o3714l6058k6529j9620j6444j0538o636k802j985j63m36O11
2892D2618L39J322J459M678P492J5780L2388P1370Q1987N2866R030K1203M7613J9050r539
$$ plain form
2889 399656 411673 434670 426686 418247 425056 401280 310162 224216 171931 133350 105433 83959 70439 62636
2885 62636 58012 54931 53099 51538 50857 50993 52059 53760 57364 64689 81034 120703 205506 291853 325561 277314
2881 277314 212687 188811 192672 253075 324840 355310 300866 215654 164366 126601 98127 75008 59912 50715
2878 50715 45526 41880 39360 36976 34727 32343 30313 28919 28202 27939 27659 27107 25707 24171 22660 21603 20566 19801
2874 19801 18959 18571 18138 17976 17722 17921 17762 18058 17714 17370 16725 16716 16465 16669 16566 16916 17118 17774 17885 17724 16888 16506 16061
2868 16061 16615 16777 16940 16342 15744 14921 14733 14176 14073 13743 13686 13345 13457 13172 13339 13156 13244 12955 13119 12819 12972 12779 13040
2862 13040 12960 13516 13697 14150 13928 13707 13428 13603 13484 13999 14039 14078 13419 13396 12997 13052 12834 12889 12561 12687 12484 12735 12483 12684 12533
2856 12533 12655 12417 12633 12384 12589 12383 12630 12423 12671 12358 12500 12323 12601 12498 12850 12622 12667 12505 12797 12612 12881 12883 13158 13036
$$ packed form
2889C99656J2017K2997p984q439O809k3776r1118q5946n2285l8581k7917k1474j3520p803
2885F2636m624l081j832j561o81J36J066J701L604P325J6345L9669Q4803Q6347L3708m8247
2881B77314o4627k3876L861O0403P1765L0470n4444q5212n1288l7765k8474k3119j5096r197
2878E0715n189l646k520k384k249k384k030j394p17k63k80n52j400j536j511j057j037p65
2874A9801q42l88m33j62k54J99j59K96l44l44o45rk51K04j03L50K02O56J11j61q36l82m45
2868A6061N54J62J63n98n98q23j88n57j03l30n7l41J12k85J67j83Q8k89J64l00J53j93K61
2862A3040q0N56J81M53k22k21k79J75j19N15M0L9o59k3l99N5k18N5l28J26k03K51k52K01j51
2856A2533J22k38K16k49K05k06K47k07K48l13J42j77K78j03L52k28M5j62K92j85K69KK75j22
$$ plain form
2850 13036 13185 12993 13073 12790 12961 12692 12877 12824 13224 13186 13420 13155 13343 13298 13525 13332 13592 13432 13726 13668 13882 13725 14021 13887
2845 13887 14024 13855 14139 14174 14663 14651 14911 14684 14910 14750 15043 15008 15426 15256 15358 15268 15449 15453 15729 15630 15986 16032 16350 16408 16738 16686
2838 16686 16906 16913 17193 17178 17299 17270 17694 17627 18013 18095 18450 18605 18897 19003 19382 19261 19594 19771 20220 20447 20811 21268 21726 21899 22344
2832 22344 22376 22679 22634 23042 23564 24540 25422 26576 27461 28617 29445 30409 31246 32536 33925 36132 38928 42722 46744 53579
2827 53579 67425 103688 180020 284579 377917 394566 343662 271068 241719 277988 356969 434588 436277 358553
2824 358553 258140 189764 145053 111869 90108 76970 70082 66189 63811 62068 61176 61283 61661 63401 66548 71782
2820 71782 77850 89273 113356 178371 310853 490439 642354 660403 564879 434051 376748 413379 518925
2817 518925 630551 644988 538989 390913 282316 211826 157401 121201 97436 84814 75550 70046 64679
$$ packed form
2850A3036J49j92Q0k83J71k69J85n3M00l8K34k65J88m5K27j93K60j60K94n8K14j57K96j34
2845A3887J37j69K84L5M89j2K60k27K26j60K93l5M18j70J02r0J81MK76r9L56M6L18N8L30n2
2838A6686K20PK80j5J21k9M24o7L86Q2L55J55K92J06L79j21L33J77M49K27L64M57M58J73M45
2832B2344L2L03m5M08N22R76Q82J154Q85J156Q28R64Q37J290J389K207K796L794M022O835
2827E3579J3846L6263P6332J04559R3338J6649n0904p2594k9349L6269P8981P7619J689p7724
2824C58553j00413o8376m4711l3184k1761j3138o888l893k378j743q92J07L78J740L147N234
2820G1782O068J1423K4083O5015J32482J79586J51915J8049r5524j30828n7303L6631J05546
2817E18925J11626J4437j05999j48076j08597p0490n4425l6200k3765j2622r264n504n367
$$ plain form
2813 64679 61751 58687 56899 53750 52208 50395 49960 48345 47388 45251 44162 42075 41280 39851 39771 38875 39000 38308 38931
2809 38931 38194 38716 37876 38550 37862 38320 37961 39467 39974 41911 42305 43358 43050 44625 45747 48764 50420 53143 54504 58366
2804 58366 63227 74668 94731 136931 208990 310035 407177 466082 478247 489674 542759 632967 693497 673207
2800 673207 574412 451295 342426 262633 202354 160512 130559 114094 102985 98529 93438 92919 91764 97429
2797 97429 105000 125005 160893 257412 394862 497904 500115 411559 374099 428326 538189 646576 680451
2794 680451 632112 573335 532144 541505 586012 610461 571970 478208 373952 288301 226316 179487 147587 125762
2790 125762 114533 107024 106754 108934 123119 151191 230994 364435 509811 597555 571807 512570 467581 481131
2787 481131 519140 516036 447859 359443 264186 203507 156583 124634 100569 86578 77233 73424 69751 67803 64869
$$ packed form
2813F4679k928l064j788l149j542j813m35j615r57k137j089k087p95j429q0q96J25o92O23
2809C8931p37N22q40O74o88M58l59J506N07J937L94J053l08J575J122L017J656K723J361L862
2804E8366M861J1441K0063M2200P2059J01045R7142N8905J2165J1427N3085R0208O0530k0290
2800F73207r8795j23117j08869p9793o0279m1842k9953j6465j1109m456n091n19j155N665
2797I7429P571K0005L5888R6519J37450J03042K211q8556l7460N4227J09863J08387L3875
2794F80451m8339n8777m1191R361M4507K4449l8491r3762j04256q5651o1985m6829l1900k1825
2790A25762j1229p509k70K180J4185K8072P9803J33441J45376Q7744k5748n9237m4989J3550
2787D81131L8009l104o8177q8416r5257o0679m6924l1949k4065j3991r345l809l673j948k934
$$ plain form
2783 64869 63478 61474 59742 57846 57129 57082 59486 65202 78451 116091 185769 244402 260652 216173 183040 192097
2779 192097 222846 241240 221243 164712 127148 103187 83491 66177 54398 47441 43661 41576 40490 39177 37864
2776 37864 36425 34986 33505 31887 30372 29128 28381 27498 26560 25485 24697 23909 23441 22838 22566 21840 21265 20690 20404 20118
2771 20118 19932 19746 19704 19662 19804 20083 21022 21327 21017 20253 19773 19021 18648 18003 18050 17643 17629 17343 17547 17616 18394 18719 18709 17701
2765 17701 17122 16406 16546 16414 16995 17712 18754 18436 17791 16693 16230 15313 15116 14647 14893 14685 15390 16368 19093 22816 26725
2760 26725 27638 25705 22228 19835 17896 16739 15583 15304 15025 15518 16011 17320 18630 20461 23472 28903 33699 37439
2755 37439 38003 37013 32301 30438 33384 40342 45576 46623 43042 38786 32624 27653 24588 21736 18612 16485 15176 14706
2751 14706 15053 16274 16677 16293 15273 15727 15547 14700 13036 12351 11529 11282 10763 10740 10445 10485 10071 10020 9696 9865 9580 9658 9463
$$ packed form
2783F4869j391k004j732j896p17m7K404N716J3249L7640O9678N8633J6250m4479l3133R057
2779A92097L0749J8394j9997n6531l7564k3961j9696j7314j1779o957l780k085j086j313j313
2776C7864j439j439j481j618j515j244p47q83r38j075p88p88m68o03k72p26n75n75k86k86
2771B0118j86j86m2m2J42K79R39L05l10p64m80p52l73o45M7m07j4k86K04O9P78L25j0j008
2765A7701n79p16J40j32N81P17J042l18o45j098m63r17j97m69K46k08P05R78K725L723L909
2760B6725R13j933l477k393j939j157j156k79k79M93M93J309J310J831L011N431M796L740
2755C7439N64r90m712j863K946O958N234J047l581m256o162m971l065k852l124k127j309m70
2751A4706L47J221M03l84j020M54j80q47j664o85q22k47n19k3k95M0m14n1l24J69k85P8j95
$$ plain form
2745 9463 9717 9517 9856 10195 10919 11372 11829 11471 11163 10583 10927 11272 11880 11853 11571 10653 10124 9323 9026 8730 8827 8652 8970 8653
2740 8653 8680 8436 8276 8116 8294 8018 8066 7841 7972 7831 7945 8059 8722 9112 9514 9280 8865 8450 8716 8982 9606 9414 9062 8439
2734 8439 8053 7668 7629 7317 7458 7326 7194 7063 7021 6980 7093 6932 6832 6731 6767 6530 6486 6442 6535 6355 6320 6286 6388 6218 6241 6263 6422
2727 6422 6308 6361 6413 6432 6450 6397 6072 6037 6001 6023 6044 6066 6088 6021 5955 6042 6128 6344 6832 7366 7899 8135 7917 7954 7991 8136 8281 8081 7607
2720 7607 7122 6636 6269 5902 5727 5552 5445 5338 5293 5247 5269 5291 5260 5229 5266 5303 5289 5275 5414 5553 5661 6041 6778 7787 8555 9049
2714 9049 8960 8870 8872 9146 9411 9041 8395 7613 6856 6371 5741 5566 5356 5147 5133 5119 5264 5409 5469 5529 5430 5332 5196 5061 5010 4960 5203
2707 5203 5718 6571 7288 7364 7167 6928 7143 7249 7355 6982 6472 5705 5391 5001 4883 4767 4652 4667 4683 4621 4560 4385 4210 4142 4074
2701 4074 4074 4074 4107 4139 4036 4205 4298 4664 4970 5277 5074 5007 4907 5078 5213 5212 4837 4462 4214 4102 3883 3936 3697 3595 3561 3663 3573
$$ packed form
2745I463K54k00L39L39P24M53M57l58l08n80L44L45O08k7k82r18n29q01k97k96R7j75L18l17
2740H653K7k44j60j60J78k76M8k25J31j41J14J14O63L90M02k34m15m15K66K66O24j92l52o23
2734H439l86l85l9l12J41j32j32j31m2m1J13j61j00j01L6k37m4m4R3j80l5l4J02j70K3K2J59
2727F422j14N3N2J9J8n3l25l5l6K2K1K2K2o7o6Q7Q6K16M88N34N33K36k18L7L7J45J45k00m74
2720G607m85m86l67l67j75j75j07j07m5m6K2K2l1l1L7L7j4j4J39J39J08L80P37J009P68M94
2714I049q9r0KK74K65l70o46p82p57m85o30j75k10k09j4j4J45J45O0O0r9r8j36j35n1n0K43
2707E203N15Q53P17P6j97k39K15J06J06l73n10p67l14l90j18j16j15J5J6o2o1j75j75o8o8
2701D074%%L3L2j03J69R3L66L06L07k03o7j00J71J35jl75l75k48j12k19N3k39j02l4J02r0
$$ plain form
2694 3573 3483 3408 3605 3562 3520 3434 3485 3382 3550 3384 3355 3393 3432 3229 3299 3162 3297 3227 3294 3232 3305 3166 3299 3045 2927 2900 3145 3129
2688 3129 3248 3171 3367 3177 3260 3198 3135 3277 3282 3151 3292 3080 3005 2997 3126 3035 2944 2868 3064 2996 2928 2945 2962 2902 2842 2849 2857 2872 2887 2748 2882
2680 2882 2951 3019 2946 2872 2902 2932 2894 2856 2856 2856 2589 2594 2669 2744 2768 2792 2787 2781 2640 2770 2603 2708 2524 2612 2651 2691 2679 2667 2634 2601 2636 2671 2554
2672 2554 2436 2370 2576 2573 2571 2432 2565 2473 2381 2373 2366 2349 2332 2229 2399 2319 2239 2425 2611 2508 2406 2371 2336 2269 2201 2293 2385 2396 2407 2418 2429
2664 2429 2379 2329 2194 2332 2227 2122 2210 2297 2127 2228 2244 2261 2338 2416 2334 2253 2232 2211 2190 2169 2181 2193 2137 2080 2074 2067 2128 2189 2190 2190 2122 2054 2042
2656 2042 2030 2018 2006 2063 2120 2064 2008 2081 2155 2115 2075 2050 2026 2001 1977 2031 2086 2027 1968 1973 1978 1983 1988 1950 1912 1874 1836 1911 1986 1903 1819 1879 1938 1838 1738
2648 1738 1783 1828 1804 1781 1808 1836 1903 1697 1632 1567 1797 1755 1769 1783 1780 1777 1763 1749 1803 1856 1831 1806 1780 1755 1764 1772 1781 1790 1788 1786 1699 1612 1762 1639 1721 1802
2639 1802 1882 1690 1719 1748 1679 1610 1655 1700 1706 1712 1719 1725 1721 1718 1714 1710 1716 1722 1865 1734 1854 1701 1684 1668 1667 1666 1819 1699 1643 1587 1656 1724 1776 1556 1471 1387
$$ packed form
2694C573r0p5J97m3m2q6N1j03J68j66k9L8L9k03P0j37J35p0O7o2P3j39J33k54j18k7K45j6
2688C129J19p7J96j90Q3o2o3J42Nj31J41k12p5qJ29r1r1p6J96o8o8J7J7o0o0PQJ5J5j39J34
2680B882O9O8p3p4L0L0l8l8%%k67NP5P5K4K4noj41J30j67J05j84Q8L9M0j2j2l3l3L5L5j17
2672B554j18o6K06lkj39J33r2r2qpj7j7j03J70q0q0J86J86j03j02l5l5o7o8R2R2J1J1J1J1
2664B429n0n0j35J38j05j05Q8Q7j70J01J6J7P7P8q2q1k1k1k1k1J2J2n6n7opO1O1J%o8o8j2
2656B042j2j2j2N7N7n6n6P3P4m0m0k5k4k5k4N4N5n9n9NNNNl8l8l8l8P5P5q3q4O0N9j00j00
2648A738M5M5k4k3K7K8O7k06o5o5K30m2J4J4llj4j4N4N3k5k5k6k5RQRRkkq7q7J50j23Q2Q1
2639A802Q0j92K9K9o9o9M5M5OOPOmlmmOOJ43j31J20j53j7j6jjJ53j20n6n6O9O8N2k20q5q4
$$ plain form
2630 1387 1689 1720 1608 1497 1597 1698 1731 1763 1682 1601 1634 1666 1576 1485 1553 1622 1664 1707 1733 1759 1852 1674 1648 1623 1615 1606 1598 1590 1615 1641 1667 1693 1748
2622 1748 1804 1746 1688 1687 1687 1670 1653 1758 1590 1576 1561 1621 1680 1626 1572 1574 1577 1579 1582 1617 1652 1573 1494 1406 1317 1342 1367 1487 1607 1568 1529 1507 1485 1463 1442
2613 1442 1456 1470 1484 1499 1456 1414 1371 1329 1414 1500 1586 1671 1658 1644 1517 1390 1386 1382 1491 1600 1496 1391 1400 1408 1419 1429 1440 1450 1446 1443 1439 1435 1440 1445 1383 1320
2605 1320 1352 1384 1416 1448 1390 1331 1273 1214 1194 1174 1267 1361 1340 1319 1298 1277 1339 1400 1462 1523 1620 1718 1747 1776 1903 2030 2043 2057 1949 1842 1666 1490
2597 1490 1493 1496 1499 1502 1479 1455 1432 1409 1309 1209 1178 1146 1156 1167 1109 1052 1123 1194 1266 1337 1277 1217 1271 1324 1242 1161 1193 1225 1217 1208 1358 1508 1653 1797
2588 1797 1874 1950 1891 1831 1840 1849 1824 1798 1705 1612 1580 1548 1602 1655 1558 1734 1853 1971 2170 2097 1944 1791 1567 1615 1732 1576 1451 1326 1297 1268
2581 1268 1323 1378 1319 1261 1196 1131 1066 1001 1054 1106 1159 1212 1206 1200 1193 1187 1198 1209 1084 1231 1099 1239 1243 1248 1171 1094 1114 1134 1384 1362 1493 1624 1744
2573 1744 1864 1762 1933 1886 1839 1808 1778 1703 1627 1484 1340 1287 1235 1182 1129 1167 1205 1175 1144 1221 1298 1375 1452 1338 1223 1267 1312 1280 1247 1300 1353
$$ packed form
2630A387L02L1j12j11J00J01L3L2q1q1L3L2r0r1O8O9M2M3K6K6R3j78k6k5qrqqK5K6K6K6N5
2622A748N6n8n8j%j7j7J05j68j4j5O0N9n4n4KLKLL5L5p9p9q8q9K5K5J20J20l9l9k2k2k2k1
2613A442J4J4J4J5m3m2m3m2Q5Q6Q6Q5j3j4j27j27mmJ09J09j04j05RQJ1J0J1J0mlmmNNo2o3
2605A320L2L2L2L2n8n9n8n9k0k0R3R4k1k1k1k1O2O1O2O1R7R8K9K9J27J27J3J4j08j07j76j76
2597A490LLLLk3k4k3k3j00j00l1l2J0J1n8n7P1P1P2P1o0o0N4N3q2q1L2L2qrJ50J50J45J44
2588A797P7P6n9o0RRk5k6r3r3l2l2N4N3r7J76J19J18J99p3j53j53k24M8J17j56j25j25k9k9
2581A268N5N5n9n8o5o5o5o5N3N2N3N3oopoJ1J1j25J47j32J40MNp7p7K0K0K50k2J31J31J20
2573A744J20j02J71m7m7l1l0p5p6j43j44n3n2n3n3L8L8l0l1P7P7P7P7j14j15M4M5l2l3N3N3
$$ plain form
2565 1353 1304 1527 1528 1530 1400 1270 1270 1270 1174 1350 1322 1294 1088 1155 1182 1209 1197 1186 1174 1163 1250 1337 1356 1375 1437 1498 1492 1486 1491 1497 1503 1509 1744 1978 1962 1947
2557 1947 2028 2109 2032 1954 1954 1954 1955 1955 1813 1670 1596 1522 1466 1411 1355 1299 1266 1234 1201 1168 1299 1429 1491 1554 1629 1704 1780 1855 1813 1771 1887 2004 2058
2549 2058 2112 2053 1993 2049 2104 2160 2215 2194 2172 2264 2356 2393 2430 2534 2639 2623 2608 2433 2258 2295 2332 2300 2269 2279 2289 2299 2309 2287 2264 2310 2356 2347 2339
2541 2339 2217 2095 1996 1897 1866 1835 1801 1767 1619 1471 1532 1593 1586 1578 1539 1499 1459 1419 1349 1280 1323 1367 1326 1285 1311 1338 1509 1681 1693 1706 1753 1800
2533 1800 1960 2120 2061 2002 2101 2200 2270 2339 2409 2479 2463 2448 2432 2416 2193 1969 1859 1749 1649 1548 1516 1484 1362 1240 1276 1313 1328 1344 1245
2526 1245 1147 1150 1153 1156 1158 1158 1158 1226 1294 1161 1029 879 1002 1023 1045 1084 1123 1161 1199 1237 1275 1310 1345 1243 1142 1147 1151 1155 1159 1179 1199 1082 966 934 903
2517 903 939 976 974 972 1124 1003 930 857 886 915 1115 1044 1040 1037 1186 1064 1094 1125 1078 1030 983 935 969 1002 1036 1069 992 915 974 1032 1025 1017 1163 1036
2509 1036 1037 1038 1022 1006 1021 1036 1051 1065 1063 1061 1059 1057 1051 1045 1039 1033 1063 1092 1207 1049 972 894 1026 1158 1077 997 1052 1108 1165 1223 1213 1203 1320 1437 1419 1400
$$ packed form
2565A353m9K23JKj30j30%%r6J76k8k8k06O7K7K7j2j1j2j1Q7Q7J9J9O2O1ooNOOOK35K34j6j5
2557A947Q1Q1p7p8%%J%j42j43p4p4n6n5n6n6l3l2l3l3J31J30O2O3P5P5P6P5m2m2J16J17N4
2549B058N4n9o0N6N5N6N5k1k2R2R2L7L7J04J05j6j5j75j75L7L7l2l1J0J0J0J0k2k3M6M6rq
2541B339j22j22r9r9l1l1l4l4j48j48O1O1pql9m0m0m0p0o9M3M4m1m1K6K7J71J72J2J3M7M7
2533A800J60J60n9n9R9R9P0O9P0P0j6j5j6j6k23k24j10j10j00j01l2l2j22j22L6L7J5J6r9
2526A245r8LLLK%%O8O8j33j32j50J23K1K2L9L9L8L8L8L8L5L5j02j01NMMMK0K0j17j16l2l1
2517I03L6L7kkJ52j21p3p3K9K9K00p1mlJ49j22L0L1m7m8m7m8L4L3L4L3p7p7N9N8pqJ46j27
2509A036JJj6j6J5J5J5J4kkkkooooL0K9J15j58p7p8J32J32q1q0N5N6N7N8j0j0J17J17j8j9
$$ plain form
2500 1400 1367 1334 1370 1405 1309 1213 1252 1292 1207 1122 1173 1224 1154 1085 1242 1400 1463 1527 1539 1551 1487 1695 1972 1975 1851 1726 1678 1494 1277 1332 1362
2492 1362 1392 1437 1482 1391 1300 1311 1322 1240 1293 1479 1392 1484 1304 1293 1283 1401 1518 1532 1683 1910 1865 1751 1638 1644 1649 1547 1444 1477 1511 1609
2485 1609 1708 1670 1633 1625 1618 1610 1602 1562 1522 1617 1713 1741 1769 1729 1689 1769 1848 1859 1870 1882 1895 1907 1920 1834 1749 1891 2032 1968 1903 1839 1774 1758 1741 1725 1709
2476 1709 1661 1612 1564 1516 1593 1669 1610 1550 1650 1750 1714 1678 1650 1622 1569 1788 1896 1868 1933 1998 1940 1882 1773 1663 1464 1538 1679 1684 1630 1711 1640
2469 1640 1568 1601 1633 1665 1697 1712 1727 1742 1757 1754 1752 1817 1883 1808 1733 1785 1838 1976 1979 1768 1830 1854 1877 1850 1822 1827 1832 1836 1841 1803 1765 1727 1689 1704 1720 1667 1614
2460 1614 1561 1508 1523 1539 1539 1539 1540 1540 1538 1535 1533 1530 1570 1609 1535 1461 1550 1639 1660 1681 1644 1608 1640 1672 1530 1389 1345 1572 1597 1621 1567 1512 1452 1664 1671 1679 1571
2451 1571 1735 1679 1622 1552 1482 1526 1570 1559 1549 1539 1528 1503 1479 1454 1430 1478 1527 1507 1488 1480 1472 1464 1456 1388 1320 1212 1377 1426 1476 1543 1610 1560 1511 1461 1412
2442 1412 1442 1472 1519 1566 1403 1514 1470 1427 1444 1460 1409 1357 1387 1417 1515 1613 1474 1335 1400 1466 1489 1513 1536 1560 1497 1434 1439 1444 1471 1498 1610 1450
$$ packed form
2500A400l3l3L6L5r6r6L9M0q5q5N1N1p0o9J57J58O3O4J2J2o4K08K77Lj24j25m8j84k17N5L0
2492A362L0M5M5r1r1J1J1q2N3J86q7R2j80j1j0J18J17J4J51K27m5j14j13ONj02j03L3L4R8
2485A609R9l8l7qpqqm0m0R5R6K8K8m0m0Q0P9J1J1J2J3J2J3q6q5J42J41o4o5o4o5j6j7j6j6
2476A709m8m9m8m8P7P6n9o0J00J00l6l6k8k8n3K19J08k8O5O5n8n8j09j10j99P4J41Nn4Q1p1
2469A640p2L3L2L2L2J5J5J5J5lkO5O6p5p5N2N3J38Lk11O2K4K3k7k8NNMNl8l8l8l8J5J6n3n3
2460A614n3n3J5J6%%J%klklM0L9p4p4Q9Q9K1K1l7l6L2L2j42j41m4K27K5K4n4n5o0K12PQj08
2451A571J64n6n7p0p0M4M4j1j0j0j1k5k4k5k4M8M9k0j9qqqqo8o8j08J65M9N0O7O7n0m9n0m9
2442A412L0L0M7M7j63J11m4m3J7J6n1n2L0L0R8R8j39j39O5O6K3K4K3K4o3o3NNK7K7J12j60
$$ plain form
2434 1450 1429 1407 1369 1331 1358 1385 1412 1439 1449 1459 1316 1445 1417 1388 1377 1366 1350 1334 1387 1439 1484 1529 1573 1618 1615 1611 1607 1604 1561 1517 1542 1567 1515 1464 1480
2426 1480 1496 1509 1522 1536 1549 1545 1541 1537 1533 1550 1567 1517 1466 1494 1523 1619 1716 1687 1659 1630 1602 1616 1630 1644 1658 1609 1559 1578 1597 1607 1617 1628 1638 1702 1766 1762 1759
2417 1759 1736 1714 1692 1669 1701 1732 1764 1796 1728 1660 1661 1661 1728 1796 1795 1794 1869 1945 2020 2096 2110 2124 2138 2152 2368 2583 2685 2787 2888 2988 2929 2871 2899
2409 2899 2926 2886 2846 2748 2651 2553 2455 2336 2217 2098 1979 2017 2055 2093 2131 2080 2028 2136 2243 2269 2295 2320 2346 2401 2457 2353 2250 2283 2317 2509
2401 2509 2701 2712 2723 2801 2880 3111 3342 3413 3485 3736 3986 4033 4079 4044 4010 4026 4042 4030 3745 3455 3165 3094 3023 2883 2744 2623 2502 2381
2395 2381 2260 2253 2246 2353 2459 2521 2582 2711 2841 2844 2848 2851 2855 2816 2777 2851 2926 2956 2986 3016 3046 3049 3053 3056 3059 3141 3223 3152 3354 3277 3201 3124 3048 3163 3006
2386 3006 3002 2998 2882 2766 2650 2534 2423 2311 2313 2315 2263 2211 2159 2107 2211 2314 2304 2294 2348 2401 2455 2509 2546 2583 2620 2657 2856 3054 3003 2953 2818
2378 2818 2684 2618 2552 2550 2547 2477 2407 2344 2282 2220 2158 2193 2229 2265 2300 2221 2141 2061 1982 1959 1936 2134 2061 1972 1884 1937 1990 2005 2020 1922 1824 1883 1943 2002
$$ packed form
2434A450k1k2l8l8K7K7K7K7J0J0j43J29k8k9j1j1j6j6N3N2M5M5M4M5lmmlm3m4K5K5n2n1J6
2426A480J6J3J3J4J3mmmmJ7J7n0n1K8K9R6R7k9k8k9k8J4J4J4J4m9n0J9J9J0J0J1J0O4O4ml
2417A759k3k2k2k3L2L1L2L2o8o8J%O7O8jjP5P6P5P6J4J4J4J4K16K15J02J02J01J00n9n8K8
2409B899K7m0m0r8r7r8r8j19j19j19j19L8L8L8L8n1n2J08J07K6K6K5K6N5N6j04j03L3L4J92
2401B509J92J1J1P8P9K31K31P1P2K51K50M7M6l5l4J6J6j2k85k90k90p1p1j40j39j21j21j21
2395B381j21ppJ07J06O2O1J29J30LMLMl9l9P4P5L0L0L0L0LMLLQ2Q2p1K02p7p6p7p6J15j57
2386C006mmj16j16j16j16j11j12KKn2n2n2n2J04J03j0j0N4N3N4N4L7L7L7L7J99J98n1n0j35
2378B818j34o6o6klp0p0o3o2o2o2L5L6L6L5p9q0q0p9k3k3J98p3q9q8N3N3J5J5r8r8N9O0N9
$$ plain form
2370 2002 2061 2034 2007 2048 2089 2193 2297 2288 2279 2286 2292 2298 2305 2199 2094 2056 2019 2022 2026 2029 2033 2014 1995 1976 1957 1909 1860 1925 1989 1970 1951 1931 1912 1921 1930 1939 1949 1917 1886
2361 1886 1923 1960 1976 1993 2078 2163 2145 2126 2108 2089 2068 2047 2025 2004 1979 1954 1935 2189 2168 2148 2212 2277 2184 2091 1941 2063 2205 2075 2115 2156 2165 2175
2353 2175 2185 2194 2194 2194 2194 2194 2241 2288 2177 2065 2170 2276 2222 2169 2135 2101 2134 2168 2188 2207 2227 2247 2217 2188 2159 2130 2184 2238 2293 2347 2320 2293 2334 2375 2339
2344 2339 2303 2336 2368 2379 2389 2400 2410 2334 2258 2250 2242 2205 2169 2200 2231 2267 2303 2338 2374 2365 2356 2415 2474 2495 2515 2536 2557 2512 2466 2515 2427 2285 2416 2453 2490
2336 2490 2431 2372 2381 2391 2450 2508 2567 2626 2617 2607 2666 2725 2715 2706 2696 2687 2638 2590 2609 2629 2563 2498 2546 2594 2650 2705 2608 2783 2795 2806 2835 2864 2817 2770 2723 2676
2327 2676 2797 2919 2873 2828 2877 2790 2610 2702 2855 2735 2786 2837 2852 2868 2883 2898 2897 2895 2961 3028 2984 2940 2964 2988 3038 3087 3069 3050 3057 3063 3138 3212 3131 3049
2319 3049 3035 3022 3013 3004 2969 3071 3231 3118 3091 3199 3136 3073 3132 3191 3187 3182 3177 3172 3230 3287 3344 3402 3346 3290 3301 3313 3339 3364 3458 3551 3463 3375 3401 3426 3518
2310 3518 3610 3634 3658 3540 3422 3463 3503 3530 3557 3652 3746 3813 3879 3741 3603 3679 3754 3626 3497 3573 3648 3724 3799 3785 3771 3758 3744 3828 3912 3996 4080
$$ packed form
2370B002N9k7k7M1M1J04J04rrPOOPj06j05l8l7LMLMj9j9j9j9m8m9O5O4j9j9k0j9RRRJ0l2l1
2361A886L7L7J6J7Q5Q5j8j9j8j9k1k1k2k1k5k5j9K54k1k0O4O5r3r3j50J22J42j30M0M1RJ0
2353B175J0R%%%%M7M7j11j12J05J06n4n3l4l4L3L4K0J9K0K0l0k9k9k9N4N4N5N4k7k7M1M1l6
2344B339l6L3L2J1J0J1J0p6p6qql7l6L1L1L6L6L5L6rrN9N9K1K0K1K1m5m6M9q8j42J31L7L7
2336B490n9n9RJ0N9N8N9N9rj0N9N9j0rj0rm9m8J9K0o6o5M8M8N6N5r7J75J2J1K9K9m7m7m7m7
2327B676J21J22m6m5M9q7j80R2J53j20N1N1J5J6J5J5jkO6O7m4m4K4K4N0M9j8j9POP5P4q1q2
2319C049j4j3rrl5J02J60j13k7J08o3o3N9N9mnnnN8N7N7N8n6n6J1J2K6K5R4R3q8q8K6K5R2
2310C518R2K4K4j18j18M1M0K7K7R5R4O7O6j38j38P6P5j28j29P6P5P6P5j4j4j3j4Q4Q4Q4Q4
$$ plain form
2302 4080 4194 4308 4354 4400 4336 4273 4210 4147 4200 4254 4308 4361 4363 4364 4365 4366 4364 4362 4428 4494 4388 4283 4427 4571 4582 4593 4718 4843 5044 5246 5447 5648
2295 5648 5638 5627 5616 5605 5427 5249 5275 5301 5190 5079 5037 4994 5048 5101 5087 5073 5116 5159 5271 5382 5456 5529 5602 5675 5795 5914 6101 6289 6432
2287 6432 6575 6787 6998 7128 7258 7002 6747 6536 6326 6229 6132 5957 5782 5811 5840 5813 5786 5826 5867 5805 5744 5841 5939 5965 5992 6086 6181 6353
2281 6353 6526 6630 6735 6803 6870 6870 6869 6731 6592 6567 6541 6505 6468 6432 6395 6336 6276 6217 6158 6288 6419 6482 6545 6532 6519 6574 6629 6703 6777 6850 6924 6960
2273 6960 6997 7101 7206 7302 7398 7380 7363 7339 7314 7290 7266 7133 6999 7025 7050 6970 6889 6876 6864 6989 7114 7126 7137 7222 7306 7391 7475 7650 7826 7896
2265 7896 7966 8209 8589 8767 9217 9734 10705 13264 18818 24146 26479 28779 34617 38164 32545 23613 17857 15073 13287
2261 13287 11847 11042 10493 9944 9485 9298 9217 9135 8956 8778 8655 8532 8477 8422 8412 8402 8391 8381 8381 8380 8539 8697 8924 9152 9427 9430 9286
2254 9286 9278 9568 9993 10290 10451 10527 10331 10089 10120 10275 10430 10505 10581 10452 10323 10340 10357 10533 10709 10666 10622 10578 10534 10515 10495 10543 10592 10598 10603 10541
$$ packed form
2302D080J14J14M6M6o4o3o3o3N3N4N4N3KJJJkkO6O6j06j05J44J44J1J1J25J25K01K02K01K01
2295E648j0j1j1j1j78j78K6K6j11j11m2m3N4N3j4j4M3M3J12J11P4P3P3P3J20J19J87J88J43
2287F432J43K12K11J30J30k56k55k11k10r7r7j75j75K9K9k7k7M0M1o2o1R7R8K6K7R4R5J72
2281F353J73J04J05O8O7%jj38j39k5k6l6l7l6l7n9o0n9n9J30J31O3O3j3j3N5N5P4P4P3P4L6
2273F960L7J04J05R6R6j8j7k4k5k4k4j33j34K6K5q0q1j3j2J25J25J2J1Q5Q4Q5Q4J75J76P0
2265G896P0K43L80J78M50N17R71K559N554N328K333K300N838L547n619q932n756k784j786
2261A3287j440q05n49n49m59j87q1q2j79j78j23j23n5n5j0j0j1j0%jJ59J58K27K28K75Lj44
2254I286qK90M25K97J61P6j96k42L1J55J55P5P6j29j29J7J7J76J76m3m4m4m4j9k0M8M9ONo2
$$ plain form
2247 10541 10479 10754 11030 11237 11444 11400 11356 11608 11859 12328 12798 13216 13363 13236 13109 13288 13740 13967 14195 14161 13855 13601 13346 13370
2241 13370 13393 13277 13162 12842 12522 12387 12253 12413 12574 12695 12815 12868 12921 12982 13043 13445 13847 13967 14088 14056 14296 14500 14704 14908 15113
2235 15113 15212 15039 14769 14772 14900 15300 15405 15510 15262 15013 14765 14517 14749 14981 15208 15162 14860 14557 14488 14418 14484 14550 14503 14456 14332 14209
2229 14209 14198 14188 14238 14288 14497 14706 14953 15200 15447 15694 15914 16134 16440 16473 16481 16490 16425 16633 16789 16673 16403 16134 15929 15998 16134 15998
2222 15998 15772 15547 15355 15436 15525 15615 15834 16054 16101 16149 16309 16470 16679 16888 16802 16716 16776 16836 16828 16820 16707 16594 16481 16368 16462 16556 16498 16711
2215 16711 16854 16996 17105 17214 17176 17411 17651 17892 18068 18245 18081 17918 18075 18232 18253 18274 18126 17978 17967 17955 18082 18209 18336 18463
2209 18463 18443 18422 18538 18654 18820 18987 19154 19320 19479 19637 19795 19953 20183 20412 20642 20871 21206 21540 21560 21443 21494 21818 22107 22397
2204 22397 22443 22352 22185 22290 22424 22557 22575 22456 22402 22621 22743 23138 23350 23427 23520 23750 24011 24272 24541 24810 25054 25298 25533 25768 25995
$$ packed form
2247A0541o2K75K76K07K07m4m4K52K51M69M70M18J47j27j27J79M52K27K28l4l06k54k55K4
2241A3370K3j16j15l20l20j35j34J60J61J21J20N3N3O1O1M02M02J20J21l2K40K04K04K04K05
2235A5113R9j73k70LJ28M00J05J05k48k49k48k48K32K32K27m6l02l03o9p0O6O6m7m7j24j23
2229A4209j1j0N0N0K09K09K47K47K47K47K20K20L06L3QRo5K08J56j16k70k69k05O9J36j36
2222A5998k26k25j92Q1Q9R0K19K20M7M8J60J61K09K09q6q6O0O0qqj13j13j13j13R4R4n8K13
2215A6711J43J42J09J09l8K35K40K41J76J77j64j63J57J57K1K1j48j48j1j2J27J27J27J27
2209A8463k0k1J16J16J66J67J67J66J59J58J58J58K30K29K30K29L35L34K0j17N1L24K89K90
2204B2397M6r1j67J05J34J33J8j19n4K19J22L95K12P7R3K30K61K61K69K69K44K44K35K35K27
$$ plain form
2197 25995 26086 26100 26386 26528 26670 26828 26987 27117 27248 27514 27780 28121 28461 28665 28869 29318 29767 30081 30394 30815 31236 31725 32214
2192 32214 32665 33116 33498 33881 34465 35049 35741 36433 37008 38219 39856 41764 44119 47655 53686 64345 80082 96998 108968
2187 108968 112316 111722 117934 134788 155908 170050 167221 151856 137308 128677 123404 117087 108320 98402 90026 84918
2183 84918 82078 80607 80316 82223 86943 93141 99203 105336 114827 133519 162831 194899 217800 224081 225371 239832
2179 239832 268361 298265 308111 292239 263752 237109 224896 227430 239495 254758 270293 281098 283280 284294
2176 284294 299920 336318 377889 401007 390635 362112 341485 333915 331156 323087 305488 282782 260529 243006
2173 243006 231565 227793 230827 236244 241933 250773 261700 272367 286028 316809 370732 428559 466691 480403 505459
2169 505459 572026 663006 738705 750602 703393 635037 570489 536345 540739 566460 594627 610178 596346 564091
$$ packed form
2197B5995R1J4K86J42J42J58J59J30J31K66K66L41L40K04K04M49M49L14L13M21M21M89M89
2192C2214M51M51L82L83N84N84O92O92N75J211J637J908K355L536O031J0659J5737J6916J1970
2187A08968L348n94O212J6854K1120J4142k829j5365j4548q631n273o317q767r918q376n108
2183H4918k840j471k91J907M720O198O062O133R491J8692K9312L2068K2901O281J290J4461
2179B39832K8529K9904R846j5872k8487k6643j2213K534J2065J5263J5535J0805K182J014
2176B84294J5626L6398M1571K3118j0372k8523k0627p570k759q069j7599k2706k2253j7523
2173B43006j1441l772L034N417N689Q840J0927J0667J3661L0781N3923N7827L8132J3712K5056
2169E05459O6567R0980P5699J1897m7209o8356o4548l4144M394K5721K8167J5551j3832l2255
$$ plain form
2165 564091 532310 521857 537428 566886 601897 622659 639915 673599 721836 788679 857098 893117 886503 853841
2162 853841 806840 777174 809736 933509 1103535 1233900 1262406 1124917 936831 786227 681448 630125
2159 630125 615626 626631 638565 661845 708585 747429 769972 777721 750630 718730 689478 649426 618654 604673
2156 604673 615900 637565 641952 619565 566950 513337 467382 430956 408076 399989 403667 406710 400602 394949 397441
2152 397441 403473 402183 381199 356165 347739 347448 340349 314907 282476 259332 244084 232795 222324 212311 206565
2148 206565 211357 232577 271165 316016 355534 376811 390679 417889 447560 471877 467276 425919 384301 360017
2145 360017 347628 333697 309578 277926 250657 229288 209507 193628 183643 179376 176992 173246 168772 169471 177271
2141 177271 188974 200113 206805 213621 221073 222963 219861 216056 217787 223316 221856 207066 187830 172930 165199 163924
$$ packed form
2165E64091l1781j0453J5571K9458L5011K0762J7256L3684M8237O6843O8419L6019o614l2662
2162H53841m7001k9666L2562J23773J70026J30365K8506j37489j88086j50604j04779n1323
2159F30125j4499J1005J1934K3280M6740L8844K2543P749k7091l1900k9252m0052l0772j3981
2156F04673J1227K1665M387k2387n2615n3613m5955l6426k2880q087L678L043o108n653K492
2152C97441O032j290k0984k5034q426k91p099k5442l2431k3144j5248j1289j0471j0013n746
2148B06565M792K1220L8588M4851L9518K1277J3868K7210K9671K4317m601m1357m1618k4284
2145C60017j2389j3931k4119l1652k7269k1369j9781j5879r985m267k384l746m474O99P800
2141A77271J1703J1139O692O816P452J890l102l805J731N529j460j4790j9236j4900p731j275
$$ plain form
2137 163924 166188 167176 165351 160655 153146 152774 166288 183342 192681 182530 160308 147627 146110 146963 142461 127340
2133 127340 107591 92755 82183 73609 65851 59649 55171 52134 50096 48766 48435 49545 52378 57413 63264 67991
2129 67991 69724 69818 73451 81803 91335 96757 93193 83469 75651 72643 72449 71761 67171 59105 51040 44704 39912 36265
2125 36265 33798 31933 30521 29252 28256 27543 26831 26180 25530 24863 24468 24021 23573 23279 22985 22672 22358 22180 22002 21917 21831 21746
2120 21746 21660 21498 21336 21021 20978 20685 20393 20117 19841 19690 19540 19389 19238 19117 18997 18894 18790 18534 18550 18412 18275 18092 17909 17727
2114 17727 17544 17395 17246 17098 16949 16846 16744 16641 16539 16409 16279 16082 15884 15708 15533 15584 15635 15712 15789 16019 15976 16006 16035 16116 16197 16199
2107 16199 16202 15949 15425 15186 14948 14828 14709 14471 14232 14011 13790 13561 13606 13480 13353 13398 13169 13231 13292 13349 13405 13610 14086 14235 14112
2101 14112 14091 14070 14370 14671 14819 14512 14080 13648 13232 13271 13363 13184 12960 12735 12621 12507 12529 12551 12526 12501 12494 12486 12448 12683 12850 12744 12676
$$ packed form
2137A63924K264R88j825m696p509l72J3514J7054R339j0151k2222j2681j517Q53m502j5121
2133A27340j9749j4836j0572q574p758o202m478l037k038j330l31J110K833N035N851M727
2129F7991J733R4L633Q352R532N422l564r724p818l008j94o88m590q066q065o336m792l647
2125C6265k467j865j412j269r96p13p12o51o50o67l95m47m48k94k94l13l14j78j78q5q6q5
2120B1746q6j62j62l15m3k93k92k76k76j51j50j51j51j21j20j03j04k56J6j38j37j83j83j82
2114A7727j83j49j49j48j49j03j02j03j02j30j30j97j98j76j75N1N1P7P7K30m3L0K9Q1Q1K
2107A6199Lk53n24k39k38j20j19k38k39k21k21k29M5j26j27M5k29O2O1N7N6K05M76J49j23
2101A4112k1k1L00L01J48l07m32m32m16L9R2j79k24k25j14j14K2K2k5k5pql8K35J67j06o8
$$ plain form
2095 12676 12607 12385 12163 12234 12306 12530 12483 12292 12101 11910 11719 11612 11777 11857 11938 11776 11615 11681 11747 11996 12245 12346 12175 11949 11995 12018
2088 12018 12314 12483 12380 12209 11766 11496 11498 11517 11535 11539 11270 10995 10721 10635 10549 10667 10785 10715 10645 10506 10368 10466 10564 10662 10760 10661 10562 10463
2082 10463 10363 10460 10556 10805 10782 10616 10450 10267 10084 10227 10369 10308 10246 10155 10064 10177 10290 10258 10227 9991 9756 9836 9917 9998 10078 9867 9655
2075 9655 9376 9096 8961 8827 8822 8818 8609 8672 8582 8492 8384 8276 8281 8286 8300 8314 8396 8477 8670 8862 9049 8964 8809 8653 8685 8717 8936 9155 8960
2068 8960 8493 8271 8049 7787 7798 7839 7425 7284 7143 7188 7234 7211 7188 7068 6947 6895 6842 6831 6819 6876 6932 6928 6924 6919 6915 6774 6634 6607 6581 6581 6581 6513
2060 6513 6445 6475 6504 6466 6428 6315 6203 6295 6387 6375 6363 6193 6022 6053 6083 6046 6009 5856 5703 5618 5534 5452 5370 5356 5343 5296 5250 5272 5293 5284 5274 5152
2052 5152 5029 5081 5133 5208 5147 5037 5155 5391 5401 5070 4966 4970 4974 4883 4792 4942 4866 4789 4713 4623 4532 4537 4542 4478 4415 4444 4474 4390 4306 4320 4333 4279 4225
2044 4225 4182 4139 4096 4053 4108 4163 4218 4273 4199 4124 4063 4003 3889 4003 3989 3976 3967 3959 3883 3807 3825 3844 3863 3882 3865 3848 3832 3815 3741 3668 3663 3657 3789 3922
$$ packed form
2095A2676o9k22k22P1P2K24m7j91j91j91j91j07J65Q0Q1j62j61O6O6K49K49J01j71k26M6K3
2088A2018K96J69j03j71m43k70KJ9J8Mk69k75k74q6q6J18J18p0p0j39j38R8R8R8R8r9r9r9
2082A0463j00R7R6K49k3j66j66j83j83J43J42o1o2r1r1J13J13l2l1k36k35Q0Q1Q1Q0k11k12
2075I655k79k80j35j34nmk09O3r0r0j08j08NNJ4J4Q2Q1J93J92J87q5j55j56L2L2K19K19j95
2068H960m67k22k22k62J1M1m14j41j41M5M6k3k3j20j21n2n3j1j2N7N6mmnmj41j40k7k6%%o8
2060F513o8L0K9l8l8j13j12R2R2j2j2j70j71L1L0l7l7j53j53q5q4q2q2j4j3m7m6K2K1rj0j22
2052E152j23N2N2P5o1j10J18K36J0l31j04MMr1r1J50p6p7p6r0r1NNo4o3K9L0q4q4J4J3n4n4
2044D225m3m3m3m3N5N5N5N5p4p5o1o0j14J14j4j3rqp6p6J8J9J9J9j7j7j6j7p4p3noJ32J33
$$ plain form
2036 3922 3744 3567 3684 3574 3591 3608 3627 3645 3596 3547 3540 3533 3526 3519 3477 3436 3326 3443 3531 3482 3411 3339 3410 3480 3483 3485 3401 3317 3301 3285 3321 3357 3393 3429
2027 3429 3390 3351 3312 3273 3269 3265 3260 3256 3248 3239 3230 3222 3194 3167 3071 2975 3038 3101 3051 3000 3076 3151 3227 3302 3227 3153 3078 3003 2935 2867 2868 2868 2907 2945 2870 2795 2853 2911 2747
2018 2747 2856 2874 2892 2859 2826 2882 2937 2880 2822 2985 3148 3062 2976 2861 2747 2853 2688 2563 2439 2501 2564 2567 2570 2573 2576 2562 2548 2534 2520 2608 2697 2581
2010 2581 2465 2517 2569 2620 2672 2661 2651 2573 2494 2399 2303 2367 2430 2427 2423 2420 2417 2399 2382 2381 2381 2139 2169 2204 2240 2217 2195 2240 2286 2299 2313 2258 2203 2119 2034 2108
2001 2108 2183 2164 2145 2127 2108 2138 2167 2129 2090 2085 2079 2074 2068 2097 2125 2086 2046 2053 2059 2066 2072 2047 2022 1997 1973 1892 1812 1998 1912 1915 1918 1972 2027 1963 1899 1903 1908 1853 1797 1810
1992 1810 1823 1874 1925 1907 1890 1877 1864 1851 1838 1894 1949 1937 1925 1937 1948 1892 1836 1805 1775 1813 1850 1821 1792 1763 1734 1667 1599 1691 1782 1758 1735 1779 1824 1808
1983 1808 1793 1709 1626 1731 1836 1782 1729 1719 1709 1698 1688 1725 1762 1798 1835 1782 1730 1677 1624 1597 1570 1611 1652 1598 1544 1603 1662 1684 1707 1616 1525 1631 1737
1975 1737 1729 1722 1745 1769 1725 1681 1720 1759 1685 1611 1601 1590 1512 1434 1462 1490 1518 1546 1507 1469 1498 1527 1409 1290 1330 1370 1461 1552 1530 1508 1557 1606 1542 1478
$$ packed form
2036C922j78j77J17j10J7J7J9J8m9m9ppppm2m1j10J17Q8m9p1p2P1P0LKq4q4j6j6L6L6L6L6
2027C429l9l9l9l9mmnmqrrqk8k7r6r6O3O3n0n1P6P5P6P5p5p4p5p5o8o8J%L9L8p5p5N8N8j64
2018B747J09J8J8l3l3N6N5n7n8J63J63q6q6j15j14J06j65j25j24O2O3LLLLj4j4j4j4Q8Q9j16
2010B581j16N2N2N1N2j1j0p8p9r5r6O4O3lmllj8j7j%k42L0L5L6k3k2M5M6J3J4n5n5q4q5P4
2001B108P5j9j9j8j9L0K9l8l9nonoK9K8l9m0POPOk5k5k5k4q1q0J86q6LLN4N5o4o4MNn5n6J3
1992A810J3N1N1j8j7j3j3j3j3N6N5j2j2J2J1n6n6l1l0L8L7k9k9k9k9o7o8R2R1k4k3M4M5j6
1983A808j5q4q3J05J05n4n3j0j0j1j0L7L7L6L7n3n2n3n3k7k7M1M1n4n4N9N9K2K3r1r1J06J06
1975A737qpK3K4m4m4L9L9p4p4j0j1p8p8K8K8K8K8l9l8K9K9j18j19M0M0R1R1k2k2M9M9o4o4
$$ plain form
1967 1478 1377 1276 1333 1391 1432 1473 1446 1419 1426 1433 1372 1311 1293 1275 1326 1376 1388 1400 1344 1288 1324 1361 1398 1435 1326 1216 1266 1315 1269 1222 1244 1265 1210
1959 1210 1155 1168 1181 1103 1025 1060 1095 1143 1191 1170 1150 1146 1142 1137 1133 1061 988 1030 1071 1046 1022 997 973 1002 1031 1061 1090 1133 1175 1059 943 981 1018 1055 1092
1950 1092 1056 1021 1099 1177 1089 1001 981 961 990 1019 934 850 838 826 813 801 815 829 910 992 990 988 918 848 879 909 872 835 912 990 863 736 756 777
1942 777 797 817 782 747 780 813 803 793 715 636 609 582 714 845 850 855 792 728 683 639 707 776 723 670 618 565 576 588 599 610 606 601 597 593 546 499 521
1933 521 542 564 586 540 494 524 555 585 616 595 575 537 500 611 450 511 571 577 584 590 597 569 542 514 486 550 614 609 605 555 505 472 440 392 617 620 623
1924 623 586 548 442 336 423 509 437 364 441 517 480 443 427 410 394 378 452 526 487 448 453 459 464 469 432 394 442 218 263 308 337 365 417 470 454
1915 454 438 366 294 352 410 274 410 376 343 527 440 392 344 386 427 401 374 311 247 234 221 391 289 272 255 259 263 267 271 322 373 356 339 283
1907 283 228 376 525 453 380 307 235 232 229 379 256 280 304 311 318 362 407 339 270 265 260 323 387 338 290 309 329 267 206 241 277 389 230 223 217 273
$$ packed form
1967A478j01j01N7N8M1M1k7k7PPo1o1j8j8N1N0J2J2n6n6L6L7L7L7j09j10N0M9m6m7K2K1n5
1959A210n5J3J3p8p8L5L5M8M8k1k0mmnmp2p3M2M1k5k4k5k4K9K9L0K9M3M2j16j16L8L7L7L7
1950A092l6l5P8P8q8q8k0k0K9K9q5q4j2j2j3j2J4J4Q1Q2kkp0p0L1L0l7l7P7P8j27j27K0K1
1942G77K0K0l5l5L3L3j0j0p8p9k7k7J32J31NNo3o4m5m4O8O9n3n3n2n3J1J2J1J1mnmmm7m7K2
1933E21K1K2K2m6m6L0L1L0L1k1k0l8l7J11j61O1O0OPOPk8k7k8k8O4O4nmn0n0l3l2m8K25LL
1924F23l7l8j06j06Q7Q6p2p3P7P6l7l7j6j7j6j6P4P4l9l9NONNl7l8M8k24M5M5K9K8N2N3j6
1915D54j6p2p2N8N8j36J36l4l3J84q7m8m8M2M1k6k7o3o4j3j3J70j02j7j7MMMMN1N1j7j7n6
1907B83n5J48J49p2p3p3p2llJ50j23K4K4PPM4M5o8o9nnO3O4m9m8J9K0o2o1L5L6J12j59poN6
$$ plain form
1898 273 329 299 270 369 196 175 155 79 4 42 79 140 201 194 187 255 323 277 232 205 178 151 124 76 27 47 67 206 345 326 306 211 117 181
1890 181 245 212 180 148 115 165 215 197 179 144 108 90 72 -40 118 260 130 255 107 96 84 183 282 285 288 97 177 218 260 213 166 272
1882 272 106 131 156 164 172 140 108 189 271 200 130 173 216 186 157 127 98 238 379 270 160 196 231 199 166 171 176 181 186 187 187 120 53 89 126 247
1873 247 97 112 127 125 123 166 209 31 125 112 100 20 -60 82 -47 43 135 157 179 201 223 295 368 282 196 137 78 178 277 252 226 86 -52
1865 -52 7 66 -95 14 126 237 207 176 201 226 251 276 202 127 121 115 104 93 151 209 233 258 169 80 153 226 185 145 196 248 78 181 196
1857 196 210 242 274 239 205 170 136 70 4 142 281 267 254 308 362 413 463 513 563 472 382 206 303 300 298 312 326 172 18 68 118 156 193
1849 193 231 268 226 184 142 100 112 124 204 284 405 527 489 452 414 377 254 404 309 214 249 284 230 176 82 260 211 163 284 133 159
1841 159 186 42 170 161 151 159 167 174 182 190 197 199 200 202 204 222 241 259 278 189 101 12 -75 -39 -3 33 69 65 61 57 54 57 60 63 67 -2 -71 -27 16 48 81 114 146
$$ packed form
1898B73N6l0k9R9j73k1k0p6p5L8L7O1O1ppO8O8m6m5k7k7k7k7m8m9K0K0J39J39j9k0r5r4O4
1890A81O4l3l2l2l3N0N0j8j8l5l6j8j8j12J58J42j30J25j48j1j2R9R9LLj91Q0M1M2m7m7J06
1882B72j66K5K5QQl2l2Q1Q2p1p0M3M3l0k9l0k9J40J41j09j10L6L5l2l3NNNNJ%o7o7L6L7J21
1873B47j50J5J5kkM3M3j78R4j3j2q0q0J42j29R0R2K2K2K2K2P2P3q6q6n9n9J00R9k5k6j40j38
1865e2N9N9j61J09J12J11l0l1K5K5K5K5p4p5ooj1j1N8N8K4K5q9q9P3P3m1m0N1N2j70J03J5
1857A96J4L2L2l5l4l5l4o6o6J38J39j4j3N4N4N1N0N0N0r1r0j76R7lkJ4J4j54j54N0N0L8L7
1849A93L8L7m2m2m2m2J2J2Q0Q0J21J22l8l7l8l7j23J50r5r5L5L5n4n4r4J78m9m8J21j51K6
1841A59K7j44J28rj0QQPQQPKJKKJ8J9J8J9q9q8q9q7L6L6L6L6mmmlLLLMo9o9M4M3L2L3L3L2
$$ plain form
1831 146 111 77 -25 -128 -27 74 62 50 18 -12 -44 -75 -26 22 3 -15 56 128 87 45 7 -31 -69 -108 -133 -158 -184 -209 -89 29 -55 -139
1823 -139 -118 -96 -143 -189 -119 -49 -47 -46 -50 -54 -126 -198 -141 -84 -95 -106 -126 -146 -166 -186 -235 -285 -267 -249 -246 -243 -308 -374 -279 -184 -157 -130 -162 -194 -226 -258 -250 -243 -235
1814 -235 -227 -302 -378 -294 -210 -171 -131 -159 -188 -125 -62 -158 -254 -265 -276 -287 -298 -280 -263 -245 -227 -244 -260 -276 -292 -289 -285 -282 -278 -245 -212 -178 -145 -119 -93 -135 -177
1804 -177 -138 -99 -128 -158 -217 -277 -286 -295 -68 -113 -74 -34 -193 -352 -244 -408 -321 -235 -278 -322 -322 -322 -339 -356 -233 -384 -381 -378 -313 -248 -297 -346 -338 -330 -322 -314
1796 -314 -250 -186 -236 -286 -255 -224 -261 -298 -272 -245 -287 -328 -292 -255 -236 -217 -150 -355 -402 -176 -161 -147 -184 -220 -201 -182 -276 -371 -365 -358 -284 -210 -242 -274 -307
1787 -307 -339 -278 -216 -314 -412 -375 -339 -320 -301 -152 -276 -315 -354 -383 -413 -374 -335 -377 -420 -394 -368 -359 -350 -341 -332 -277 -221 -279 -336 -314 -292 -339 -385 -381 -378 -306 -234
1778 -234 -260 -286 -312 -337 -274 -210 -306 -401 -368 -335 -370 -405 -376 -347 -165 -256 -267 -279 -376 -472 -426 -379 -265 -150 -169 -187 -274 -361 -256 -152 -251 -351
1770 -351 -357 -364 -370 -376 -323 -270 -285 -300 -273 -245 -218 -190 -219 -248 -277 -307 -298 -289 -213 -136 -265 -394 -273 -152 -249 -345 -328 -312 -293 -275 -257 -239 -177 -114 -166 -217
$$ packed form
1831A46l5l4j02j03J01J01j2j2l2l0l2l1M9M8j9j8P1P2m1m2l8l8l8l9k5k5k6k5J20J18q4q4
1823a39K1K2m7m6P0P0KJmmp2p2N7N7j1j1k0k0k0k0m9n0J8J8LLo5o6R5R5K7K7l2l2l2l2QPQ
1814b35Qp5p6Q4Q4L9M0k8k9O3O3r6r6j1j1j1j1J8J7J8J8j7j6j6j6LMLML3L3L4L3K6K6m2m2
1804a77L9L9k9l0n9o0rrK27m5L9M0j59j59J08j64Q7Q6m3m4%%j7j7J23j51LLO5O5m9m9QQQQ
1796c14O4O4n0n0L1L1l7l7K6K7m2m1L6L7J9J9O7k05m7K26J5J4l7l6J9J9r4r5OPP4P4l2l2l3
1787c07l2O1O2r8r8L7L6J9J9J49j24l9l9k9l0L9L9m2m3K6K6RRRRN5N6n8n7K2K2m7m6MLP2P2
1778b34k6k6k6k5O3O4r6r5L3L3l5l5K9K9J82r1j1j2r7r6M6M7J14J15j9j8q7q7J05J04r9j00
1770c51opooN3N3j5j5K7K8K7K8k9k9k9l0RRP6P7j29j29J21J21r7r6J7J6J9J8J8J8O2O3n2n1
$$ plain form
1761 -217 -188 -158 -197 -236 -243 -250 -325 -400 -362 -324 -353 -383 -389 -396 -289 -181 -176 -171 -166 -161 -192 -223 -253 -284 -217 -150 -196 -242 -229 -215 -201 -187 -146 -105 -132 -159 -226 -292
1752 -292 -154 -16 -69 -123 -176 -229 -277 -325 -259 -194 -203 -213 -155 -96 -181 -266 -191 -117 -196 -275 -241 -207 -157 -107 -126 -144 -198 -252 -192 -133 -129 -126 -122 -119 -83 -46
1743 -46 -124 -201 -169 -138 -174 -210 -220 -229 -239 -248 -317 -386 -251 -115 -119 -123 -127 -130 -59 11 -30 -73 -90 -106 -55 -4 -28 -52 -76 -101 -176 -251 -168 -84 -95 -105 -116
1734 -116 -127 -187 -248 -195 -141 -133 -125 -48 27 -40 -108 -108 -108 -139 -170 -133 -96 -93 -90 -18 52 35 18 70 121 40 -39 -6 26 42 58 74 90 56 23 -10 -44 2
1725 2 48 94 140 107 74 40 7 11 14 18 21 46 71 96 121 53 -14 -13 -13 -57 -100 14 129 127 126 192 258 221 184 147 109 86 63 108 153 225 297 211 124
1715 124 201 278 241 204 173 143 180 217 149 81 127 173 162 151 208 265 190 116 155 194 207 221 234 248 270 291 313 335 260 184 221 259 281 303 325
1707 325 347 249 150 165 180 267 355 329 302 275 247 288 328 363 398 432 467 497 528 400 271 296 321 413 506 476 445 415 384 416 448 549 649
1699 649 602 555 507 460 494 527 447 368 458 548 639 729 649 569 557 545 620 694 655 616 593 569 613 658 674 690 706 722 681 640 599 558 588 617 715
$$ packed form
1761b17K9L0l9l9ppp5p5L8L8k9l0opJ07J08NNNNl1l1l0l1O7O7m6m6J3J4J4J4M1M1k7k7o7o6
1752b92J38J38n3n4n3n3m8m8O6O5rj0N8N9q5q5P5P4p9p9L4L4N0N0j9j8n4n4O0N9MLMLL6L7
1743d6p8p7L2L1l6l6j0rj0ro9o9J35J36mmmlP1P0m1m3j7j6N1N1k4k4k4k5p5p5Q3Q4j1j0j1
1734a16j1o0o1N3N4QQP7P5o7o8%%l1l1L7L7LLP2P0j7j7N2N1q1p9L3L2J6J6J6J6l4l3l3l4M6
1725BM6M6M6l3l3l4l3MLMLK5K5K5K5o8o7J%m4m3J14J15kjO6O6l7l7l7l8k3k3M5M5P2P2q6q7
1715A24P7P7l7l7l1l0L7L7o8o8M6M6j1j1N7N7p5p4L9L9J3J4J3J4K2K1K2K2p5p6L7L8K2K2K2
1707C25K2r8r9J5J5Q7Q8k6k7k7k8M1M0L5L5L4L5L0L1j28j29K5K5R2R3l0l1l0l1L2L2J01J00
1699F49m7m7m8m7L4L3q0p9R0R0R1R0q0q0j2j2P5P4l9l9k3k4M4M5J6J6J6J6m1m1m1m1L0K9R8
$$ plain form
1690 715 813 727 640 666 693 741 789 724 658 668 679 689 699 819 938 808 678 723 768 700 632 684 736 720 704 756 808 861 913 995 1077 1045 1014
1682 1014 967 921 943 964 989 1013 970 926 897 867 997 1126 1176 1227 1163 1100 1064 1028 1106 1184 1195 1206 1149 1092 1100 1108 1133 1158 980 1074 1191 1308 1288
1674 1288 1540 1780 2020 2465 2638 2594 2279 2098 1917 1849 1782 1551 1592 1549 1505 1501 1496 1491 1486 1502 1519 1467 1415 1509 1602 1627 1653 1760 1868 2162
1667 2162 2729 3867 5005 5644 5466 4477 3488 3061 2633 2373 2113 2057 2001 1917 1833 1817 1800 1741 1682 1736 1791 1818 1846 1873 1900 1875 1849 2101
1660 2101 2353 2825 3751 4954 5886 5850 4998 3992 3440 3002 2563 2403 2242 2127 2011 2100 2189 2116 2043 2191 2067 1992 1916 1982 2049
1654 2049 2166 2284 2242 2201 2325 2449 2760 3071 3451 3559 3407 2982 2857 2731 2589 2447 2388 2328 2268 2208 2276 2344 2298 2252 2225 2198 2239
1647 2239 2280 2351 2423 2381 2340 2413 2486 2445 2405 2452 2499 2546 2593 2594 2596 2484 2372 2445 2517 2590 2663 2645 2627 2609 2591 2625 2659 2625 2592 2685 2779 2714 2649 2675
1639 2675 2700 2879 2786 2751 2715 2822 2928 2941 2954 2881 3081 3283 3486 3791 3823 3556 3288 3100 3184 3077 2970 2993 3016 3059 3101 3296 3219 3213
$$ packed form
1690G15R8q6q7K6K7M8M8o5o6J0J1J0J0J20J19j30j30M5M5o8o8N2N2j6j6N2N2N3N2Q2Q2l2l1
1682A014m7m6K2K1K5K4m3m4k9l0J30J29N0N1o4o3l6l6P8P8J1J1n7n7QQK5K5j78R4J17J17k0
1674A288K52K40K40M45J73m4l15j81j81o8o7k31M1m3m4mnnnJ6J7n2n2R4R3K5K6J07J08K94
1667B162N67J138J138O39j78r89r89m27m28k60k60n6n6q4q4j6j7n9n9N4N5K7K8K7K7k5k6K52
1660B101K52M72R26J203R32l6q52j006n52m38m39j60j61j15j16Q9Q9p3p3J48j24p5p6O6O7
1654B049J17J18m2m1J24J24L11L11L80J08j52m25j25j26j42j42n9o0o0o0O8O8m6m6k7k7M1
1647B239M1P1P2m2m1P3P3m1m0M7M7M7M7JKj12j12P3P2P3P3j8j8j8j8L4L4l4l3R3R4o5o5K6
1639B675K5J79r3l5l6J07J06J3J3p3K00K02K03L05L2k67k68j88Q4j07j07K3K3M3M2J95p7o
$$ plain form
1632 3213 3207 3184 3161 3243 3325 3248 3171 3177 3182 3301 3420 3366 3311 3257 3203 3299 3395 3378 3361 3391 3422 3452 3483 3530 3578 3625 3673 3648 3624 3712 3801 3852 3902 3839 3776
1624 3776 3799 3821 3775 3729 3908 4088 4063 4039 4077 4116 4001 4159 4210 4262 4216 4171 4144 4116 4292 4469 4457 4445 4432 4420 4518 4615 4554 4492 4601 4710
1616 4710 4858 4735 4724 4714 4687 4659 4822 4985 5142 5026 5142 5257 5372 5487 5490 5765 6018 6270 6567 7136 7869 9420 12782 19503
1610 19503 28866 35780 35347 29015 22320 17894 14565 11872 10018 8618 7735 7123 6954 6785 6742 6700 6543 6387 6406 6424 6443
1605 6443 6461 6400 6339 6364 6388 6191 6266 6188 6110 6126 6142 6157 6173 6230 6286 6230 6173 6275 6377 6411 6445 6489 6533 6577 6621 6729 6837 6893 6950 6896 7113
1598 7113 7110 7106 7162 7218 7206 7194 7200 7207 7281 7356 7206 7056 7111 7166 7289 7413 7394 7376 7390 7677 7810 7943 7915 7886 7925 7964 8047 8130 8145 8160 8096 8032 8126
1590 8126 8221 8276 8331 8273 8214 8317 8419 8363 8307 7960 7613 7396 7634 8053 8472 8539 8879 9121 9363 9395 9427 9579 9732 9748 9765 9858 9951 10112
1583 10112 10273 10286 10300 10262 10225 10143 10334 10508 10682 10820 10959 11046 11133 11239 11617 11978 12339 12177 12016 11837 11930 11891 11851 12055 12259 12359
$$ packed form
1632C213ok3k3Q2Q2p7p7ONJ19J19n4n5n4n4R6R6j7j7L0L1L0L1M7M8M7M8k5k4Q8Q9N1N0o3o3
1624C776K3K2m6m6J79J80k5k4L8L9j15J58N1N2m6m5k7k8J76J77j2j2j3j2R8R7o1o2J09J09
1616D710J48j23j1j0k7k8J63J63J57j16J16J15J15J15LK75K53K52K97N69P33J551L362O721
1610A9503R363O914m33o332o695m426l329k693j854j400q83o12j69j69m3m2j57j56J9J8J9
1605F443J8o1o1K5K4j97P5p8p8J6J6J5J6N7N6n6n7J02J02L4L4M4M4M4M4J08J08N6N7n4K17
1598G113lmN6N6j2j2OPP4P5j50j50N5N5J23J24j9j8J4K87J33J33k8k9L9L9Q3Q3J5J5o4o4R4
1590H126R5N5N5n8n9J03J02n6n6l47l47k17K38M19M19O7L40K42K42L2L2J52J53J6J7R3R3J61
1583A0112J61J3J4l8l7q2J91J74J74J38J39Q7Q7J06L78L61L61j62j61j79R3l9m0K04K04J00
$$ plain form
1576 12359 12458 12557 12656 12798 12940 12946 12951 12912 12873 12970 13066 13210 13353 13429 13505 13678 13851 13888 13926 14001 14077 14220 14364 14454 14544 14702 14861 14922 14984 15165
1569 15165 15346 15559 15501 15669 16109 16483 16857 17196 17536 18185 19106 21156 23841 26894 29311 33022 42450 67710 107218 142972
1564 142972 138338 94639 70090 62104 56024 47777 39983 33256 28979 26462 25307 24509 24164 23872 23580 23413 23246 23316
1560 23316 23839 24924 26463 27692 27923 27790 27658 27452 27245 26812 26379 26048 25717 26084 26905 27459 28013 28884 29484 29854 30225 30352
1554 30352 30479 30707 30934 31230 31526 31936 32347 33415 34937 36626 37679 38493 38854 38973 38820 39019 39217 39790 40363 41299 41963
1549 41963 42560 42884 43592 44572 46393 48077 50071 51248 52747 53974 55576 56542 57818 58822 60281 61103 62750 64124 66542
1545 66542 67962 69005 69412 72360 76670 82772 88420 96529 105274 115834 126122 140040 157498 184949 220114 265047
1541 265047 313338 380784 490796 715923 1214320 2342939 4107677 5654132 5946773 4920146 3570875
$$ packed form
1576A2359R9R9R9J42J42ONl9l9R7R6J44J43P6P6J73J73L7L8P5P6J43J44R0R0J58J59O1O2J81
1569A5165J81K13n8J68M40L74L74L39L40O49R21K050K685L053K417L711R428K5260L9508L5754
1564A42972m634m3699k4549p986o080q247p794o727m277k517j155p98l45k92k92j67j67P0
1560B3316N23J085J539J229K31j33j32k06k07m33m33l31l31L67Q21N54N54Q71O00L70L71J27
1554C0352J27K28K27K96K96M10M11J068J522J689J053Q14L61J19j53J99J98N73N73R36O64
1549D1963N97L24P08R80J821J684J994J177J499J227J602R66J276J004J459Q22J647J374K418
1545F6542J420J043M07K948M310O102N648Q109Q745J0560J0288J3918J7458K7451L5165M4933
1541B65047M8291O7446J10012K25127M98397J128619J764738J546455K92641j026627j349271
$$ plain form
1538 3570875 2624012 1955321 1411957 989391 693909 520314 414532 344055 292080 254718 222080 196430
1535 196430 175760 161171 148193 138573 130329 123990 115674 107493 99253 93645 88210 83773 78667 74559 70215 66870
1531 66870 63014 60156 57339 55338 52883 51426 50598 51313 51199 50269 47917 45838 43725 42429 40965 40136 38754 37826 36092
1526 36092 34494 32758 31838 30608 30194 29807 29872 29470 29204 28346 27759 27052 26618 25593 25023 24015 23461 22579 22331 21935 21993 21988
1521 21988 21983 21604 21497 20885 20545 19972 19853 19921 20442 20703 20963 20498 20033 19411 19062 18560 18330 17754 17450 17101 17024 16599 16446 16140
1515 16140 16106 16072 16038 15902 15766 15304 15114 15089 15064 14828 14593 14267 14395 14766 15591 15934 16004 15314 14624 14082 13812 13570 13328 13329 13331 13154
1509 13154 12977 12663 12350 12266 12181 12096 12012 11910 11808 11707 11605 11527 11448 11234 11020 10882 10744 10674 10605 10415 10225 10103 9981 9995 10009 9797
1502 9797 9584 9418 9253 9223 9193 9121 9049 9113 9177 9125 9073 9022 8970 8875 8779 8893 9008 9079 8878 8762 8645 8583 8521 8527 8533 8448 8363 8278 8193 8112 8031
$$ packed form
1538C570875r46863o68691n43364m22566k95482j73595j05782p0477n1975l7362l2638k5650
1535A96430k0670j4589j2978r620q244o339q316q181q240n608n435m437n106m108m344l345
1531F6870l856k858k817k001k455j457q28P15j14r30k352k079k113j296j464q29j382r28j734
1526C6092j598j736r20j230m14l87O5m02k66q58n87p07m34j025n70j008n54q82k48l96N8n
1521B1988nl79j07o12l40n73j19O8N21K61K60m65m65o22l49n02k30n76l04l49p7m25j53l06
1515A6140l4l4l4j36j36m62j90k5k5k36k35l26J28L71Q25L43P0o90o90n42k70k42k42JKj77
1509A3154j77l14l13q4q5q5q4j02j02j01j02p8p9k14k14j38j38p0o9j90j90j22j22J4J4k12
1502I797k13j66j65l0l0p2p2O4O4n2n2n1n2r5r6J14J15P1k01j16j17o2o2OOq5q5q5q5q1q1
$$ plain form
1495 8031 7950 7870 7845 7820 7949 7805 7782 7758 7650 7541 7517 7493 7623 7752 8030 8580 9232 9431 8960 8490 8217 7945 7887 7829 7635 7441
1489 7441 7395 7348 7370 7392 7151 6911 6897 6883 6955 7026 6961 6896 6849 6802 6807 6811 7003 6922 6977 7033 7131 6956 7054 7152 7378 7331 7369 7408 7368 7329 7669 7737
1481 7737 8039 8341 8994 9648 10778 12724 17388 28496 52277 81050 97401 88975 65551 47300 35232 26523 19744
1477 19744 15235 12711 11185 10082 9433 8846 8531 8315 8099 7900 7701 7455 7209 7100 6990 6846 6702 6627 6551 6502 6453 6405 6356
1471 6356 6291 6226 6161 6096 6150 6204 6088 6244 6428 6340 6422 6504 6675 6846 7103 7359 8033 8978 11166 15986 24415 33116 36666 32684
1465 32684 25708 20092 16224 12992 10717 8897 7831 7219 6797 6375 6117 5859 5749 5639 5529 5419 5324 5230 5288 5075 5048 5022
1460 5022 4978 4935 4871 4806 4742 4678 4670 4662 4655 4647 4566 4486 4558 4359 4291 4223 4206 4189 4167 4145 4124 4102 4050 3999 4168 4066 4051 4037 4073 4110 4051 3993 3934 3876 3927
1451 3927 3978 3961 3944 3898 3853 3808 3762 3870 3977 3926 3875 3811 3747 3683 3619 3614 3609 3757 3633 3609 3585 3545 3504 3460 3416 3439 3463 3392 3321 3363 3405 3366 3326
$$ packed form
1495H031q1q0k5k5J29j44k3k4j08j09k4k4J30J29K78N50O52J99m71m70k73k72n8n8j94j94
1489G441m6m7K2K2k41k40j4j4P2P1o5o5m7m7NMJ92q1N5N6R8j75R8R8K26m7L8L9m0l9L40O8
1481G737L02L02O53O54J130J946M664J1108K3781K8773J6351q426k3424j8251j2068q709o779
1477A9744m509k524j526j103o49n87l15k16k16j99j99k46k46j09j10j44j44p5p6m9m9m8m9
1471F356o5o5o5o5N4N4j16J56J84q8Q2Q2J71J71K57K56O74R45K188M820Q429Q701L550l982
1465C2684o976n616l868l232k275j820j066o12m22m22k58k58j10j10j10j10r5r4N8k13k7k6
1460E022m4m3o4o5o4o4qqpqq1q0P2j99o8o8j7j7k2k2k1k2n2n1J69j02j5j4L6L7n9n8n9n8N1
1451C927N1j7j7m6m5m5m6J08J07n1n1o4o4o4o4nnJ48j24k4k4m0m1m4m4K3K4p1p1M2M2l9m0
$$ plain form
1443 3326 3400 3474 3384 3294 3271 3249 3124 2999 3032 3066 3049 3031 3082 3133 3181 3230 3165 3100 3103 3106 3110 3113 3071 3030 2989 2948 2991 3035 3164 3021 2962 2903 2940 2977
1435 2977 2935 2893 2919 2945 2953 2960 2853 2747 2676 2605 2693 2781 2773 2765 2756 2748 2746 2743 2741 2738 2756 2774 2723 2673 2644 2614 2585 2556 2624 2691 2759 2827 2713 2599 2445 2564
1426 2564 2620 2675 2606 2537 2394 2523 2652 2509 2548 2586 2607 2628 2631 2634 2568 2503 2489 2475 2461 2447 2387 2326 2379 2431 2394 2356 2386 2417 2423 2429 2322 2215 2218 2221
1418 2221 2224 2228 2231 2234 2237 2240 2184 2128 2033 2210 2216 2223 2400 2304 2222 2139 2152 2166 2177 2187 2198 2209 2172 2135 2166 2198 2212 2226 2411 2323 2134 2218 2200 2181 2176 2170 2114
1409 2114 2057 2048 2311 2353 2395 2345 2294 2244 2194 2145 2097 2116 2135 2128 2120 2181 2241 2319 2396 2361 2325 2285 2244 2204 2164 2070 1975 1994 2013 2074 2134 2262 2390 2358
1400 2358 2326 2226 2126 2069 2011 2022 2032 1958 1883 1876 1870 1897 1925 2037 2150 1906 1935 1726 1789 1825 1861 1800 1740 1821 1902 1983 2064 2064 2064 1951 1837 1761
1392 1761 1685 1767 1849 1840 1830 1820 1810 1796 1782 1836 1889 1918 1946 1974 2002 1883 1764 1849 1934 1914 1894 1891 1888 1683 1751 1841 1931 1739 1819 1860 1900 1823 1746 1782
1384 1782 1818 1740 1661 1787 1912 1877 1842 1806 1771 1825 1878 1972 1793 1833 1872 1826 1781 1741 1701 1729 1757 1829 1902 1906 1911 1914 1917 1920 1923 1961 1999 1878 1758 1735 1712
$$ packed form
1443C326P4P4r0r0k3k2j25j25L3L4j7j8N1N1M8M9o5o5LLMLm2m1m1m1M3M4J29j43n9n9L7L7
1435B977m2m2K6K6QPj07j06p1p1Q8Q8qqrqklklJ8J8n1n0k9l0k9k9O8O7O8O8j14j14j54J19
1426B564N6N5o9o9j43J29J29j43L9L8K1K1LLo6o5j4j4j4j4o0o1N3N2l7l8L0L1OOj07j07LL
1418B221LMLLLLn6n6r5J77OPJ77r6q2q3J3J4J1J0J1J1l7l7L1L2J4J4J85q8j89Q4j8j9non6
1409B114n7rK63M2M2n0n1n0n0m9m8J9J9pqO1O0P8P7l5l6m0m1m0m0r4r5J9J9O1O0J28J28l2
1400B358l2j00j00n7n8J1J0p4p5poK7K8J12J13k44K9k09O3L6L6o1o0Q1Q1Q1Q1%%j13j14p6
1392A761p6Q2Q2rj0j0j0j4j4N4N3K9K8K8K8j19j19Q5Q5k0k0llk05O8R0R0j92Q0M1M0p7p7L6
1384A782L6p8p9J26J25l5l5l6l5N4N3R4j79M0L9m6m5m0m0K8K8P2P3MNLLLLL8L8j21j20k3k3
$$ plain form
1376 1712 1757 1802 1892 1982 1914 1845 1824 1803 1851 1898 1923 1948 1859 1770 1809 1848 1773 1699 1774 1850 1857 1864 1842 1819 1797 1774 1860 1946 1964 1982 1947 1913 1946 1980 1919
1367 1919 1857 1864 1871 1924 1976 1960 1944 1870 1796 1836 1875 1863 1850 1956 1835 1970 1970 1887 1940 1979 2017 1906 1795 1789 1784 1778 1773 1810 1847 1884 1922 1971 2020 2002 1983
1358 1983 1985 1988 1991 1993 2004 2015 2025 2036 2013 1989 1966 1943 1952 1960 1969 1978 1923 1868 1926 1985 1999 2013 2027 2041 2045 2049 2068 2086 1976 2092 2158 2088 2065 2043 2103 2027 1927 2055
1349 2055 2174 2066 2086 2106 2134 2027 1858 1916 2119 2185 2078 1970 2012 2055 2026 1997 1976 1956 1919 2019 2102 1958 2050 2142 2107 2071 2088 2104 2121 2138
1342 2138 2226 2315 2289 2264 2153 2041 2088 2136 2176 2216 2188 2160 2162 2163 2097 2031 2090 2149 2208 2268 2250 2233 2215 2198 2317 2436 2305 2175 2177 2180 2183 2185 2194 2203 2269
1333 2269 2063 1992 2194 2158 2122 2162 2202 2242 2282 2224 2167 2222 2278 2225 2173 2188 2203 2281 2359 2278 2197 2149 2102 2123 2144 2193 2242 2223 2204 2176 2147 2187 2227
1325 2227 2241 2255 2286 2317 2252 2460 2515 2570 2480 2390 2458 2527 2470 2413 2470 2526 2517 2509 2432 2355 2301 2247 2306 2365 2391 2416 2441 2467 2493 2518 2544 2570 2536 2502 2536
1317 2536 2570 2597 2623 2581 2539 2531 2524 2584 2644 2657 2670 2615 2560 2589 2618 2698 2777 2854 2657 2614 2572 2573 2574 2575 2575 2550 2524 2498 2472 2566 2661 2642 2623 2616 2609 2602 2595 2507 2419
$$ packed form
1376A712M5M5R0R0o8o9k1k1M8M7K5K5q9q9L9L9p5p4P5P6PPk2k3k2k3Q6Q6J8J8l5l4L3L4o1
1367A919o2PPN3N2j6j6p4p4M0L9j2j3J06j21J35%q3N3L9L8j11j11ononL7L7L7L8M9M9j8j9
1358A983KLLKJ1J1J0J1k3k4k3k3RQRRn5n5N8N9J4J4J4J4MMJ9J8j10J16O6p0k3k2O0p6j00J28
1349B055J19j08K0K0K8j07j69N8K03O6j07j08M2M3k9k9k1k0l7J00Q3j44R2R2l5l6J7J6J7J7
1342B138Q8Q9k6k5j11j12M7M8M0M0k8k8KJo6o6N9N9N9O0j8j7j8j7J19J19j31j30KLLKRRO6
1333B269k06p1K02l6l6M0M0M0M0n8n7N5N6n3n2J5J5P8P8q1q1m8m7K1K1M9M9j9j9k8k9M0M0
1325B227J4J4L1L1o5K08N5N5r0r0O8O9n7n7N7N6rqp7p7n4n4N9N9K6K5K5K6K6K5K6K6l4l4L4
1317B536L4K7K6m2m2qpO0O0J3J3n5n5K9K9Q0P9P7j97m3m2JJJ%k5k6k6k6R4R5j9j9ppppq8q8
$$ plain form
1307 2419 2535 2651 2572 2492 2526 2560 2615 2670 2658 2645 2631 2616 2602 2588 2689 2790 2731 2673 2719 2766 2744 2722 2690 2658 2694 2730 2748 2765 2782 2800 2787 2775
1299 2775 2763 2750 2763 2775 2788 2800 2849 2899 2834 2770 2754 2738 2835 2932 2988 3045 3101 3157 3115 3073 2963 2854 2930 3006 2968 2931 2934 2938 3010 3081 3024 2967 2909 2852
1291 2852 2920 2989 2989 2990 3003 3016 3097 3179 3204 3230 3188 3145 3194 3242 3086 2931 3088 3246 3246 3245 3327 3410 3380 3349 3323 3297 3271 3245 3238 3232 3226 3220 3283 3347 3297 3247
1282 3247 3325 3403 3368 3332 3354 3377 3399 3422 3509 3597 3526 3455 3493 3532 3571 3609 3540 3471 3516 3560 3584 3609 3633 3657 3667 3677 3687 3697 3733 3768 3736 3703 3794 3885
1274 3885 3862 3840 3802 3764 3794 3824 3820 3817 3926 4036 4070 4105 4071 4037 4028 4018 4009 3999 4016 4032 4134 3963 4041 4118 4065 4012 4139 4267 4281 4295 4283 4272 4192
1266 4192 4113 4128 4143 4209 4276 4515 4482 4398 4314 4305 4296 4355 4415 4427 4439 4384 4328 4388 4447 4506 4566 4630 4693 4689 4685 4622 4560 4565 4571 4619 4667 4868 4797 4749 4701 4635
1257 4635 4570 4651 4731 4659 4858 4793 4728 4747 4767 4778 4789 4800 4812 4892 4972 5138 5031 5043 5055 5067 5080 4947 5087 5187 5287 5195 5102 5168 5234 5283 5331
1249 5331 5380 5429 5388 5347 5374 5402 5451 5500 5481 5463 5486 5510 5534 5558 5564 5570 5729 5616 5728 5840 5868 5895 5942 5988 6034 6081 6039 5998 5956 5915 5974 6033 6024 6015
$$ packed form
1307B419J16J16p9q0L4L4N5N5j2j3j4j5j4j4J01J01n9n8M6M7k2k2l2l2L6L6J8J7J7J8j3j2
1299B775j2j3J3J2J3J2M9N0o5o4j6j6R7R7N6N7N6N6m2m2j10j09P6P6l8l7LMP2P1n7n7n8n7
1291B852O8O9%JJ3J3Q1Q2K5K6m2m3M9M8j56j55J57J58%jQ2Q3l0l1k6k6k6k6poooO3O4n0n0
1282C247P8P8l5l6K2K3K2K3Q7Q8p1p1L8L9L9L8o9o9M5M4K4K5K4K4J0J0J0J0L6L5l2l3R1R1
1274C885k3k2l8l8L0L0mlJ09J10L4L5l4l4rj0rj0J7J6J02j71P8P7n3n3J27J28J4J4j2j1q0
1266D192p9J5J5O6O7K39l3q4q4rrN9O0J2J2n5n6O0N9N9O0O4O3mmo3o2NOM8M8K01p1m8m8o6
1257D635o5Q1Q0p2J99o5o5J9K0J1J1J1J2Q0Q0J66j07J2J2J2J3j33J40J00J00r2r3O6O6M9M8
1249E331M9M9m1m1K7K8M9M9j9j8K3K4K4K4OOJ59j13J12J12K8K7M7M6M6M7m2m1m2m1N9N9rr
$$ plain form
1241 6015 6014 6013 6013 6012 6050 6089 6195 6302 6281 6259 6397 6535 6579 6623 6668 6712 6694 6676 6726 6776 6756 6736 6716 6696 6708 6721 6784 6848 6911 6701 6622 6815 7000
1233 7000 6730 6802 6873 6931 6988 6978 6967 7076 7185 7090 6994 7083 7172 7193 7214 7281 7349 7501 7382 7388 7393 7365 7336 7522 7435 7434 7432 7393 7354 7474 7594 7586 7578
1225 7578 7667 7756 7942 7856 7855 7853 7885 7917 7897 7878 7809 8012 8063 8113 8180 8248 8315 8382 8344 8306 8336 8365 8432 8499 8565 8632 8652 8671 8623 8575 8648 8722 8795 8869
1217 8869 8866 8863 8928 8993 9038 9083 9197 9310 9340 9370 9401 9431 9447 9463 9411 9359 9449 9539 9629 9719 9864 10009 10001 10266 10382 10497 10767 11036 11414 11792
1209 11792 12114 12163 12333 12775 12979 13183 13365 13548 13594 13641 13623 13605 13224 13116 12955 13066 13195 13051 13162 13273 13436 13598 13938 14277
1203 14277 14481 14684 15170 15656 16005 16355 16647 16940 17097 17253 17129 17005 16745 16484 16139 15793 15295 15069 15013 14957 14918 14880 14920 14961 15002
1197 15002 15042 15382 15722 16062 16402 16572 16741 16911 17081 17077 17074 17070 17066 16764 16461 16090 15719 15503 15286 15297 15307 15418 15530 15505 15480 15365 15249
1191 15249 15270 15291 15459 15628 15660 15692 15899 16107 16450 16793 17025 17256 17420 17583 17729 17875 17886 17896 18055 18214 18236 18259 18184 18108 18032 17957 17974
$$ packed form
1241F015jj%jL8L9J06J07k1k2J38J38M4M4M5M4j8j8N0N0k0k0k0k0J2J3O3O4O3k10p9J93J85
1233G000k70P2P1N8N7j0j1J09J09r5r6Q9Q9K1K1O7O8J52j19ONk8k9J86q7jkl9l9J20J20qq
1225G578Q9Q9J86q6jkL2L2k0j9o9K03N1N0O7O8O7O7l8l8L0K9O7O7O6O7K0J9m8m8P3P4P3P4
1217H869llO5O5M5M5J14J13L0L0L1L0J6J6n2n2R0R0R0R0J45J45qK65J16J15K70K69L78L78
1209A1792L22M9J70M42K04K04J82J83M6M7j8j8l81j08j61J11J29j44J11J11J63J62L40L39
1203A4277K04K03M86M86L49L50K92K93J57J56j24j24k60k61l45l46m98k26n6n6l9l8M0M1M1
1197A5002M0L40L40L40L40J70J69J70J70mlmml02l03l71l71k16k17J1J0J11J12k5k5j15j16
1191A5249K1K1J68J69L2L2K07K08L43L43K32K31J64J63J46J46J1J0J59J59K2K3p5p6p6p5J7
$$ plain form
1184 17974 17992 18010 18028 17995 17961 17928 17894 18031 18168 18304 18441 18664 18887 19110 19334 19577 19820 20063 20306 20628 20950 21045 21140 21213 21285 21290 21294 21228
1177 21228 21161 21163 21164 21048 20932 20816 20700 20701 20702 20771 20840 20840 20841 21052 21263 21661 21786 21997 22208 22345 22482 22687 22892 23049 23207 23347 23759 23878
1170 23878 23997 24065 24132 24235 24337 24372 24406 24483 24560 24637 24714 24840 24966 25228 25491 25757 26023 26221 26420 26700 26979 27395 27811 28051 28291
1164 28291 28600 28908 29331 29754 30177 30601 31017 31433 32093 32753 32948 33415 33939 34463 35197 35658 35972 36286 36698 37382 38049 38716 39395
1159 39395 40073 41098 42122 43483 45297 47463 50083 52853 55623 58195 60766 63069 65371 67656 69941 71968 73722
1154 73722 75120 75519 75033 74093 72575 71057 69680 68304 67268 66867 67057 67520 68606 70328 72520 75530 79481 83886 88761
1150 88761 94090 100463 107835 116941 128497 142299 158915 178916 203546 234529 271774 316891 366818 419978 477222
1146 477222 532729 581248 627748 664173 683615 690624 675397 642109 605150 564106 526601 494633 467033 448417
$$ packed form
1184A7974J8J8J8l3l4l3l4J37J37J36J37K23K23K23K24K43K43K43K43L22L22R5R5P3P2NMo6
1177B1228o7KJj16j16j16j16JJO9O9%JK11K11L98J25K11K11J37J37K05K05J57J58J40M12J19
1170B3878J19O8O7J03J02L5L4P7P7P7P7J26J26K62K63K66K66J98J99K80K79M16M16K40K40
1164B8291L09L08M23M23M23M24M16M16O60O60J95M67N24N24P34M61L14L14M12O84O67O67O79
1159C9395O78J025J024J361J814K166K620K770K770K572K571K303K302K285K285K027J754
1154G3722J398L99m86r40j518j518j377j376j036m01J90M63J086J722K192L010L951M405M875
1150H8761N329O373P372R106J1556J3802J6616K0001K4630L0983L7245M5117M9927N3160N7244
1146D77222N5507M8519M6500L6425J9442P009j5227l3288l6959m1044l7505l1968k7600j8616
$$ plain form
1143 448417 441078 447444 466284 495743 533370 578531 631575 688704 751301 820523 891776 972739 1051468 1111592
1139 1111592 1156933 1165154 1137924 1095900 1026818 941310 858122 774934 697786 628898 567548 516999 479543 457243
1136 457243 449510 454937 468410 489597 521120 558179 601144 648737 691986 732421 760989 773312 770263 740078
1132 740078 683876 614514 539616 469528 409205 357868 313892 277087 246635 220085 197597 179918 166395 155867
1129 155867 148186 142774 139386 138084 139029 142787 149356 157831 168212 180498 193176 206490 219508 229531 235993 236736
1125 236736 232669 224519 212411 197489 180560 162814 145581 130435 118727 109833 103301 98312 93924 90172 87599
1121 87599 87114 88965 92905 98983 106423 114600 123231 130764 136391 138570 135939 129129 119144 108333 98701 89626 80687
1117 80687 71926 63801 57367 52657 49025 46209 44495 43415 42715 42288 42071 41853 40933 39558 38318 37078 36105 35132 34476
$$ packed form
1143D48417p339O366J8840K9459L7627M5161N3044N7129O2597O9222P1253Q0963P8729O0124
1139A111592M5341Q221k7230m2024o9082q5508q3188q3188p7148o8888o1350n0549l7456k2300
1136D57243p733N427J3473K1187L1523L7059M2965M7593M3249M0435K8568J2323l049l0185
1132G40078n6202o9362p4898p0088o0323n1337m3976l6805l0452k6550k2488j7679j3523j0528
1129A55867p681n412l388j302R45L758O569Q475J0381J2286J2678J3314J3018J0023O462P43
1125B36736m067q150j2108j4922j6929j7746j7233j5146j1708q894o532m989m388l752k573
1121H7599m85J851L940O078P440Q177Q631P533N627K179k631o810r985j0811r632r075q939
1117H0687q761q125o434m710l632k816j714j080p00m27k17k18r20j375j240j240r73r73o56
$$ plain form
1113 34476 33821 33166 32511 31874 31237 30714 30190 29822 29453 29197 28942 28799 28656 28512 28369 28127 27884 28000 28115 28662 29482 30591
1107 30591 31428 31769 31293 30300 29036 27811 26586 25730 25146 24611 24348 24109 23869 23547 23225 23153 23080 22914 22748 22514 22280 22091
1102 22091 21903 21844 21786 21724 21934 22178 22694 23384 24073 24672 24454 23716 22979 22367 21754 21306 21131 20802 20473 20379 20284 20190 20095 20040 19986 20084
1096 20084 19910 19836 19761 19670 19579 19517 19456 19394 19333 19359 19384 19342 19300 19198 19096 19198 19300 19332 19364 19395 19427 19438 19448 19459 19469 19430 19391 19351 19312 19273 19234
1088 19234 19195 19156 19162 19169 19176 19183 19224 19265 19306 19347 19447 19547 19647 19747 19840 19933 20252 20572 20872 21172 21404 21636 21897 22159 22285 22410 22670 22930
1081 22930 22872 22814 22602 22390 22177 21965 21911 21858 21889 21921 21826 22004 22255 22507 22930 23353 23623 24166 24694 25222 25631 26040 26204 26368 26379
1075 26379 26389 26233 25804 25409 25014 24641 24541 24288 24035 23887 23739 23664 23862 23918 23974 24274 24574 25016 25458 25763 26069 26229 26390 26323
1069 26323 26257 26243 26229 26061 25894 25893 25620 25414 25481 25451 25422 25409 25397 25508 25620 25664 25708 25988 26269 26686 27103 27522 27942 28225 28509 28829 29149
$$ packed form
1113C4476o55o55o55o37o37n23n24l68l69k56k55j43j43j44j43k42k43J16J15N47Q20J109
1107C0591Q37L41m76r93j264j225j225q56n84n35k63k39k40l22l22p2p3j66j66k34k34j89
1102B2091j88n9n8o2K10K44N16O90O89N99k18p38p37o12o13m48j75l29l29r4r5r4r5n5n4R8
1096B0084j74p4p5r1r1o2o1o2o1K6K5m2m2j02j02J02J02L2L2L1L2J1J0J1J0l9l9m0l9l9l9
1088A9234l9l9OPPPM1M1M1M1J00J00J00J00R3R3L19L20L00L00K32K32K61K62J26J25K60K60
1081B2930n8n8k12k12k13k12n4n3L1L2r5J78K51K52M23M23K70N43N28N28M09M09J64J64J1
1075B6379J0j56m29l95l95l73j00k53k53j48j48p5J98N6N6L00L00M42M42L05L06J60J61o7
1069B6323o6j4j4j68j67jk73k06O7l0k9j3j2J11J12M4M4K80K81M17M17M19M20K83K84L20L20
$$ plain form
1063 29149 29333 29518 29752 29987 30222 30457 30876 31295 31925 32554 33086 33347 33624 33902 34233 34564 34895 35227 35715 36203 36919 37634 38619
1057 38619 39603 40469 41334 42452 43843 45556 47542 50112 53318 56642 59967 63433 67716 73820 82012 92415 105088
1053 105088 122480 150672 201488 294506 447062 635829 784840 817771 721883 573629 441963 339612
1050 339612 262356 206972 170443 147437 132417 122389 115806 112399 112146 114888 119939 126533 133841 141785 150741 162329
1046 162329 178704 201705 234570 285133 370512 521510 762130 1069457 1349001 1482153 1424907 1228712
1043 1228712 995646 776829 590654 449766 351682 287996 246998 217890 193365 171835 155191 143719 136071
1040 136071 130510 126174 122656 120793 121381 124551 129989 138695 152755 178012 225142 313942 466725 669987 845751
1036 845751 903189 809516 639669 483889 362756 271120 204450 160017 131557 112626 98483 87334 78387
$$ packed form
1063B9149J84J85K34K35K35K35M19M19O30O29N32K61K77K78L31L31L31L32M88M88P16P15R85
1057C8619R84Q66Q65J118J391J713J986K570L206L324L325L466M283O104Q192J0403J2673
1053A05088J7392K8192N0816R3018J52556J88767J49011L2931r5888j48254j31666j02351
1050C39612p7256n5384l6529k3006j5020j0028o583l407k53K742N051O594P308P944Q956J1588
1046A62329J6375K3001L2865N0563Q5379J50998K40620L07327K79544J33152n7246j96195
1043A228712k33066k18817j86175j40888r8084o3686m0998k9108k4525k1530j6644j1472p648
1040A36071n561m336l518j863N88L170N438Q706J4060K5257M7130Q8800J52783K03262J75764
1036H45751N7438r3673j69847j55780j21133r1636o6670m4433k8460j8931j4143j1149q947
$$ plain form
1033 78387 71708 66737 62946 59524 56101 52616 49585 46945 44578 42220 40316 38691 37519 36296 35073 33793 32786
1029 32786 31880 30975 30172 29368 28548 28000 27282 26836 26579 26321 25945 25569 25318 25068 24529 24261 23965 23669 23458 23246 23031 22815 22549
1023 22549 22282 21930 21850 21685 21520 21201 20881 20561 20242 20128 20015 19833 19651 19389 19126 19022 18919 18762 18604 18532 18460 18147 18106 17980
1017 17980 17854 17901 17948 17928 17907 17868 17829 17676 17523 17376 17229 17081 16934 16821 16708 16662 16617 16558 16499 16440 16381 16373 16365 16244 16122 16021 15921 15820
1010 15820 15719 15594 15469 15457 15446 15579 15711 15685 15659 15601 15542 15370 15198 15068 14939 14826 14714 14502 14563 14583 14604 14601 14598 14442 14559 14543 14527 14460
1004 14460 14394 14349 14303 14145 13986 14021 14055 14021 13987 14011 14034 13944 13854 13816 13778 13741 13703 13690 13678 13552 13425 13470 13514 13558 13602 13570 13539 13575 13612 13782 13952
996 13952 13917 13883 13841 13800 13775 13750 13513 13548 13543 13538 13462 13386 13309 13233 13275 13316 13415 13241 13014 13059 13048 13037 13090 13144 13045 13218 13253 13288 13339 13391 13470 13548 13627
988 13627 13706 13841 13976 14372 15040 15951 16590 16814 16585 15935 15285 14720 14155 13822 13488 13404 13320 13357 13395 13432 13469 13357 13246 13367 13487
$$ packed form
1033G8387o679m971l791l422l423l485l031k640k367k358j904j625j172j223j223j280j007
1029C2786r06r05q03q04q20n48p18m46k57k58l76l76k51k50n39k68k96k96k11k12k15k16k66
1023B2549k67l52q0j65j65l19l20l20l19j14j13j82j82k62k63j04j03j57j58p2p2l13m1j26
1017A7980j26M7M7k0k1l9l9j53j53j47j47j48j47j13j13m6m5n9n9n9n9qqj21j22j01j00j01
1010A5820j01j25j25j2j1J33J32k6k6n8n9j72j72j30j29j13j12k12O1K0K1llj56J17j6j6o7
1004A4460o6m5m6j58j59L5L4l4l4K4K3r0r0l8l8l7l8j3j2j26j27M5M4M4M4l2l1L6L7J70J70
996A3952l5l4m2m1k5k5k37L5nnp6p6p7p6M2M1R9j74k27M5j1j1N3N4r9J73L5L5N1N2P9P8P9
988A3627P9J35J35L96O68R11O39K24k29o50o50n65n65l33l34q4q4L7L8L7L7j12j11J21J20
$$ plain form
982 13487 13601 13443 13596 13750 13869 13989 14250 14511 15143 16229 17819 19137 19967 19981 19161 18068 17050 16032 15382 14733 14425
977 14425 14117 13968 13819 13744 13669 13594 13518 13460 13402 13344 13285 13295 13304 13426 13549 13732 13916 14230 14544 15160 16048 16941 17381 17231 16627 15819 15011
970 15011 14536 14062 13791 13520 13470 13419 13368 13317 13206 13095 13142 13190 13141 13092 13157 13222 13190 13159 13127 13096 13078 13061 13044 13027 12986 12945 13018 13091 13100 13109 12964 13093
962 13093 13133 13173 13230 13287 13205 13124 13155 13187 13168 13150 13199 13249 13284 13319 13354 13390 13420 13450 13480 13509 13493 13476 13419 13635 13687 13740 13809 13878 14023 14167 14226 14286 14433
954 14433 14308 14115 14194 14172 14149 14075 14001 14051 14100 14082 14064 14136 14209 14281 14354 14373 14391 14410 14428 14423 14417 14429 14440 14276 14383 14650 14644 14712 14780 14831 14881 15005 15129
946 15129 15140 15150 15264 15378 15333 15288 15316 15343 15484 15625 15840 16055 16156 16711 17395 18533 20544 23372 26078 27242 26465 24327 22165
941 22165 20456 19190 18378 17778 17451 17248 17045 16986 16927 16935 16944 17073 17203 17332 17461 17630 17799 18291 18784 19195 20060 21431 23618 26977
935 26977 31335 35421 38146 38689 36963 33814 30665 27426 24823 22894 21783 20986 20462 20085 19708 19348 18988 18878 18767 18614
$$ packed form
982A3487J14j58J53J54J19J20K61K61O32J086J590J318Q30J4q20j093j018j018o50o49l08
977A4425l08j49j49p5p5p5p6n8n8n8n9J0RJ22J23J83J84L14L14O16Q88Q93M40j50o04q08q08
970A5011m75m74k71k71n0n1n1n1j11j11M7M8m9m9O5O5l2l1l2l1j8j7j7j7m1m1P3P3RRj45J29
962A3093M0M0N7N7q2q1L1L2j9j8M9N0L5L5L5L6L0L0L0K9j6j7n7K16N2N3O9O9J45J44N9O0J47
954A4433j25j93P9k2k3p4p4N0M9j8j8P2P3P2P3J9J8J9J8noJ2J1j64J07K67oO8O8N1N0J24J24
946A5129J1J0J14J14m5m5K8K7J41J41K15K15J01N55O84J138K011K828K706J164p77k138k162
941B2165j709j266q12o00l27k03k03n9n9QRJ29J30J29J29J69J69M92M93M11Q65J371K187L359
935B6977M358M086K725N43j726l149l149l239k603j929j111p97n24l77l77l60l60j10j11j53
$$ plain form
930 18614 18462 18422 18383 18533 18683 18936 19642 20581 21792 23230 24940 27253 30020 32094 32263 30370 27660 25177 23329 21784
925 21784 20874 20485 20097 19981 19865 19954 20042 20201 20360 20332 20032 19593 19153 18992 18831 18766 18700 18822 19217 19883 20550 20785 20567 20090 19614
919 19614 19205 19069 19255 19441 19643 19846 20180 20513 21142 22224 23212 23927 24250 23939 23573 23208 22644 22080 21643 21207 20856 20504 20235
913 20235 20239 20248 20257 20257 20258 20463 20667 20960 21253 21630 22008 22173 22610 23036 23735 24314 24893 25568 25790 26222 26381 26370 26359 26210 26060 25950 25567
907 25567 25151 24735 24477 24220 23968 23989 23924 23860 24013 24165 24165 24437 24656 24875 25043 25212 25594 25976 26563 27149 27538 27927 28049 28171 28421
900 28421 28398 28325 28251 28041 27831 27632 27161 26614 26339 26188 26038 25962 25887 25744 25601 25648 25694 25855 26015 26228 26441 26569 26969 27423 27878
894 27878 28252 28355 28271 28187 28290 28393 28349 28304 28328 28352 28377 28402 28240 28078 27964 28123 28378 28633 28511 28390 28382 28373 28320 28267 28372 28477 28699 28921
887 28921 29193 29738 29932 30125 30267 30410 30708 31006 31191 31376 31441 31507 31686 31865 31961 32056 32157 32531 32637 32744 32482 32220 32133 32045 32162
$$ packed form
930A8614j52m0l9J50J50K53P06R39J211J438J710K313K767K074J69j893k710k483j848j545
925B1784r10l89l88j16j16Q9Q8J59J59k8l00m39m40j61j61o5o6J22L95O66O67K35k18m77m76
919A9614m09j36J86J86K02K03L34L33O29J082R88P15L23l11l66l65n64n64m37m36l51l52k69
913B0235MRR%JK05K04K93K93L77L78J65M37M26O99N79N79O75K22M32J59j1j1j49j50j10l83
907B5567m16m16k58k57k52K1o5o4J53J52%K72K19K19J68J69L82L82N87N86L89L89J22J22K50
900B8421k3p3p4k10k10j99m71n47k75j51j50p6p5j43j43M7M6J61J60K13K13J28M00M54M55
894B7878L74J03q4q4J03J03m4m5K4K4K5K5j62j62j14J59K55K55j22j21qrn3n3J05J05K22K22
887B8921K72N45J94J93J42J43K98K98J85J85O5O6J79J79R6R5J01L74J06J07k62k62q7q8J17
$$ plain form
881 32162 32279 32409 32540 32858 33176 33576 34430 35460 36490 37222 37954 38426 39169 39867 39929 39101 38545 38388 38230 38203 38176 38369 38562
876 38562 38755 38948 39111 39274 39233 39192 39525 39859 40487 41115 41920 42724 43386 43776 43996 44216 44413 44337 44426 44516 44701 44887 45508 46130 46684
870 46684 46965 46934 46631 46170 45708 45547 45386 45430 45473 45743 46014 46443 46872 47318 47763 48322 48881 49579 50277 51088 51899 52939 53978
864 53978 55265 56687 58340 60446 63371 68384 76237 88356 104309 121260 136640 145758 148613 149744 149720 147608 145620
860 145620 137915 126776 116997 106278 96919 91071 87674 86182 86234 87153 88889 91351 94267 98060 102671 108960 118426
856 118426 132762 153178 183011 224007 278666 344488 402880 447023 471939 478795 488373 490963 481410 473037 445321
852 445321 405535 371154 335230 305716 287184 275945 269335 266537 266371 268519 271666 276219 282315 290983 304278 326707
848 326707 361569 409962 476598 561941 663348 776582 863586 927539 973430 998379 1023601 1026712 1004138 975301
$$ packed form
881C2162J17J30J31L18L18M00Q54J030J030P32P32M72P43O98O2q28n56j57j58k7k7J93J93
876C8562J93J93J63J63m1m1L33L34O28O28Q05Q04O62L90K20K20J97p6Q9R0J85J86O21O22N54
870D6684K81l1l03m61m62j61j61M4M3K70K71M29M29M46M45N59N59O98O98Q11Q11J040J039
864E3978J287J422J653K106K925N013P853J2119J5953J6951J5380R118K855J131k4k112j988
860A45620p705j1139r779j0719r359n848l397j492N2R19J736K462K916L793M611O289R466
856A18426J4336K0416K9833M0996N4659O5822N8392M4143K4916O856R578K590r553q373k7716
852D45321l9786l4381l5924k9514j8532j1239o610k798j66K148L147M553O096Q668J3295K2429
848C26707L4862M8393O6636Q5343J01407J13234Q7004O3953M5891K4949K5222L111k2574k8837
$$ plain form
845 975301 918238 840721 764928 691327 628345 578614 539138 508137 483580 463731 447785 435398 426913 423455
841 423455 426803 440310 468792 515176 578351 659714 750787 844947 932481 986033 1021161 1040633 1037689 1020719
838 1020719 977884 912200 841706 762106 675698 596460 528386 471392 424654 386618 356477 332436 313386 298885
834 298885 289013 283968 284097 289591 301348 320016 345310 376242 411076 444626 472821 487437 483447 470528 451710
831 451710 428116 401527 369112 333521 299450 265833 233434 206390 184780 167435 153613 142604 133615 126350
827 126350 120443 116260 113462 112025 112125 113586 116272 119776 123071 125367 125724 123993 121046 116918 111691 106327 100842 95220
823 95220 89571 83921 78354 73785 70129 66927 64109 61745 59713 57953 56434 55052 53890 52865 52087 51582 51150 50854
818 50854 50848 50841 50673 50233 49817 49673 49546 49419 48766 47841 46983 46262 45460 44521 43403 42422 41448 40746 40152 39421 38680 38210 37707 37340
$$ packed form
845I75301n7063p7517p5793p3601o2982m9731l9476l1001k4557j9849j5946j2387q485l458
841D23455L348J3507K8482M6384O3175Q1363R1073R4160Q7534N3552L5128J9472k944j6970
838A020719m2835o5684p0494p9600q6408p9238o8074n6994m6738l8036l0141k4041j9050j4501
834B98885r872n045J29N494J1757J8668K5294L0932L4834L3550K8195J4616l990j2919j8818
831D51710k3594k6589l2415l5591l4071l3617l2399k7044k1610j7345j3822j1009q989p265
827A26350n907m183k798j437J00J461K686L504L295K296L57j731k947m128n227n364n485n622
823I5220n649n650n567m569l656l202k818k364k032j760j519j382j162j025p78n05m32k96
818E0854opj68m40m16j44j27j27o53r25q58p21q02r39j118r81r74p02n94p31p41m70n03l67
$$ plain form
813 37340 37083 36826 36692 36557 36392 36228 36205 36182 36018 35581 34883 34639 34545 34452 34171 33618 33070 32795 32477 32296 31884 31471 31181 30891
807 30891 30637 30382 30127 29873 29716 29559 29516 29473 29587 29701 30008 29498 28721 28398 28201 28003 27888 27774 27439 27376 27241 27107 26989 26872
801 26872 26767 26662 26558 26453 26339 26225 26111 25997 26021 26045 26290 26262 26249 26237 26207 26177 26046 25916 25717 25519 25330 25142 25022 24902 24781
795 24781 24660 24623 24587 24463 24611 24605 24600 24703 24806 24908 25011 25310 25610 26022 26435 26840 27244 27733 27951 27877 27803 27696 27588 27498 27135 26857
788 26857 26579 26290 26001 25711 25422 25303 25184 25178 25173 25269 25365 25462 25558 25778 25998 26331 26664 27298 27931 28876 29549 30179 30809 31173 31083 30827
782 30827 30843 30610 30377 29903 29428 28642 28128 27641 27155 26753 26352 26167 25983 25912 25840 25917 25993 26070 26146 26397 26648 27239 27830 28669 29509
776 29509 30081 30654 30974 31022 30900 30506 30194 29882 29501 28849 28341 27833 27325 26818 26321 26097 25857 25616 25436 25256 25212 25168 25194 25220 25313
770 25313 25407 25658 25910 26371 26832 27226 27349 27398 27446 27385 27323 27346 27369 27404 27711 28051 27938 27596 27253 27109 26965 27083 27200 27000 26800 26431
$$ packed form
813C7340k57k57j34j35j65j64k3k3j64m37o98k44r4r3k81n53n48k75l18j81m12m13k90k90
807C0891k54k55k55k54j57j57m3m3J14J14L07n10p77l23j97j98j15j14l35o3j35j34j18j17
801B6872j05j05j04j05j14j14j14j14K4K4K45k8j3j2l0l0j31j30j99j98j89j88j20j20j21
795B4781j21l7l6j24J48onJ03J03J02J03K99L00M12M13M05M04M89K18p4p4j07j08r0l63k78
788B6857k78k89k89k90k89j19j19onR6R6R7R6K20K20L33L33O34O33R45O73O30O30L64r0k56
782C0827J6k33k33m74m75p86n14m87m86m02m01j85j84p1p2P7P6P7P6K51K51N91N91Q39Q40
776B9509N72N73L20M8j22l94l12l12l81o52n08n08n08n07m97k24k40k41j80j80m4m4K6K6R3
770B5313R4K51K52M61M61L94J23M9M8o1o2K3K3L5L07L40j13l42l43j44j44J18J17k00k00l69
$$ plain form
763 26431 26062 25920 25778 25769 25760 25819 25878 25955 26033 26110 26188 26382 26575 26905 27235 27755 28275 28449 28350 28150 27949 28049 28148 28379 28609 28249 27890
757 27890 27667 27444 27358 27272 27279 27286 27293 27300 27468 27637 27669 27701 27835 27969 28103 28237 28430 28622 28832 28769 28826 28882 29058 29233 29323 29413 29503 29592 29691 29789
750 29789 29887 29986 30123 30261 30398 30536 30739 30941 30991 31313 31567 31821 31955 32090 32296 32501 32843 33185 33485 33785 33948 34112 34399 34686
744 34686 34906 35125 35337 35550 35780 36010 36157 36577 36980 37382 37778 38174 38637 39101 39589 40077 40564 41052 41810 42567 43659 44751
738 44751 46044 47609 49578 52000 54820 58276 62412 67728 75636 87810 105577 128154 151396 168194 172922 166486
734 166486 153998 140149 127105 115967 106882 99884 94895 91629 89465 88661 89140 90798 93792 98511 104965 113870 125424
730 125424 139428 155610 173880 194480 217894 245754 279333 319752 365889 411232 444141 454079 439602 409017
727 409017 373621 340755 312880 289737 270314 253066 237179 222347 209240 198549 190308 185028 183288 185783 192724
$$ packed form
763B6431l69j42j42rrN9N9P7P8P7P8J94J93L30L30N20N20J74r9k00k01J00R9K31K30l60l59
757B7890k23k23q6q6PPPPJ68J69L2L2J34J34J34J34J93J92K10o3N7N6J76J75R0R0R0Q9R9R8
750B9789R8R9J37J38J37J38K03K02N0L22K54K54J34J35K06K05L42L42L00L00J63J64K87K87
744C4686K20K19K12K13K30K30J47M20M03M02L96L96M63M64M88M88M87M88P58P57J092J092
738D4751J293J565J969K422K820L456M136N316P908J2174J7767K2577K3242J6798M728o436
734A66486j2488j3849j3044j1138r085o998m989l266k164q04M79J658K994M719O454Q905J1554
730A25424J4004J6182J8270K0600K3414K7860L3579M0419M6137M5343L2909R938j4477l0585
727D09017l5396l2866k7875k3143j9423j7248j5887j4832j3107j0691q241n280j740K495O941
$$ plain form
723 192724 204487 220697 240832 264326 292357 327558 371794 424289 482592 542257 596913 637321 655050 645461
720 645461 610833 558870 501235 448955 406097 371315 341560 315344 291702 269784 249296 230169 213056 198756
716 198756 188110 181728 179821 181817 187375 196290 209160 227565 252993 287043 330376 381422 432991 477208 508113
713 508113 522408 516272 484089 428972 366685 313417 272583 240764 215389 194841 177288 161127 145874 131750
709 131750 119259 108766 100270 93794 88951 85688 83695 82973 83522 85525 89526 97043 109824 130366 159076 192007
705 192007 218948 228080 214160 184153 151423 123819 102567 86965 76264 68793 63682 59366 55956 52785 50159
702 50159 47907 46200 44861 43523 42785 42048 41281 40513 39950 39387 38829 38270 37825 37379 36967 36555 36144 35732 35454 35177 34968 34759
696 34759 34745 34732 34650 34569 34387 34204 34022 33840 33633 33426 33287 33149 33096 33044 32878 32712 32569 32425 32349 32274 32157 32040 31923 31806 31674 31541
$$ packed form
723A92724J1763J6210K0135K3494K8031L5201M4236N2495N8303N9665N4656M0408J7729r589
720F45461l4628n1963n7635n2280m2858l4782k9755k6216k3642k1918k0488j9127j7113j4300
716A98756j0646o382j907J996N558Q915J2870J8405K5428L4050M3333N1046N1569M4217L0905
713E08113J4295o136l2183n5117o2287n3268m0834l1819k5375k0548j7553j6161j5253j4124
709A31750j2491j0493q496o476m843l263j993p22N49K003M001P517J2781K0542K8710L2931
705A92007K6941R132j3920l0007l2730k7604k1252j5602j0701p471n111m316l410l171k626
702E0159k252j707j339j338p38p37p67p68n63n63n58n59m45m46m12m12m11m12k78k77k09k09
696C4759j4j3q2q1j82j83j82j82k07k07j39j38n3n2j66j66j43j44p6p5j17j17j17j17j32j33
$$ plain form
690 31541 31477 31413 31435 31457 31479 31501 31521 31541 31562 31582 31529 31477 31493 31509 31476 31444 31412 31380 31227 31074 30922 30769 30708 30648 30587 30527 30350 30173 30155 30137 30108
682 30108 30079 30164 30248 30279 30309 30453 30597 30558 30520 30594 30669 30691 30713 30667 30621 30662 30703 30743 30784 30939 31093 31179 31265 31418 31570 31722 31874 31911 31949 32054
675 32054 32159 32203 32248 32405 32563 32660 32758 32856 32954 33060 33166 33271 33377 33703 34028 34467 34906 35215 35524 35833 36141 36457 36773 36976 37178
669 37178 37329 37481 37519 37557 37595 37633 37670 37708 37727 37746 37765 37784 37873 37963 38211 38460 38786 39112 39643 40173 40720 41268 41611 41954 42238 42523 42648
662 42648 42774 43001 43229 43298 43367 43216 43065 42801 42537 42422 42307 42191 42076 42036 41997 41844 41690 41838 41985 42337 42689 43267 43846 44424
656 44424 45003 45543 46084 46420 46756 47032 47308 47290 47271 47182 47092 46799 46505 46130 45756 45222 44689 44232 43775 43387 42998 42848 42698 42617 42535
650 42535 42755 42976 43264 43552 43836 44119 44403 44686 44890 45094 45185 45275 45143 45012 44880 44748 44590 44433 44344 44254 44366 44477 44906 45335
644 45335 45964 46593 47548 48503 49830 51294 53157 55474 58730 62803 68521 76870 89881 111151 145796 187430 219511
$$ packed form
690C1541o4o4K2K2K2K2K0K0K1K0n3n2J6J6l3l2l2l2j53j53j52j53o1o0o1o0j77j77j8j8k9
682C0108k9Q5Q4L1L0J44J44l9l8P4P5K2K2m6m6M1M1M0M1J55J54Q6Q6J53J52J52J52L7L8J05
675C2054J05M4M5J57J58R7R8R8R8J06J06J05J06L26L25M39M39L09L09L09L08L16L16K03K02
669C7178J51J52L8L8L8L8L7L8J9J9J9J9Q9R0K48K49L26L26N31N30N47N48L43L43K84K85J25
662D2648J26K27K28O9O9j51j51k64k64j15j15j16j15m0l9j53j54J48J47L52L52N78N79N78
656D4424N79N40N41L36L36K76K76j8j9q9r0k93k94l75l74n34n33m57m57l88l89j50j50q1q2
650D2535K20K21K88K88K84K83K84K83K04K04R1R0j32j31j32j32j58j57q9r0J12J11M29M29
644D5335O29O29R55R55J327J464J863K317L256M073N718Q349J3011K1270L4645M1634L2081
$$ plain form
640 219511 245149 275460 288256 253823 198607 154509 123934 102491 86947 76236 68884 63927 60151 57350 55185
637 55185 53655 52397 51479 50834 50215 49868 49437 49141 48942 48606 48263 48055 47982 47636 47319 46866 46566 46539 46213 45888 45795 45703 45746 45789
631 45789 45820 45851 45949 46048 46314 46580 46983 47385 47981 48578 48947 49317 49597 49878 50023 50167 50167 50167 50166 50166 50057 49948 49974 50001 50076 50151 50226 50301 50359
624 50359 50417 50476 50534 50744 50954 51164 51374 51904 52435 53033 53632 54130 54627 54898 55169 55406 55643 55716 55516 55531 55547 55529 55783 55820 55857 55919
617 55919 55709 55675 55505 55545 55721 56115 56508 57137 57767 58225 58684 59143 59602 60057 60512 60966 61421 61910 62398 62660 62922 62875 62828 62917 63006
611 63006 63093 63179 63492 63805 64059 64313 64566 64820 65020 65220 65737 66254 66976 67698 68556 69414 70385 71356 72554 73753 75141 76529
606 76529 78085 79776 81908 84311 87103 90349 93848 97620 101555 105491 109200 112455 115421 118659 122242 126097 129895
602 129895 133058 135398 136922 138502 140355 142636 145189 147969 151203 155078 159407 164246 169539 175490 182076 189830 198947
$$ packed form
640B19511K5638L0311J2796l4433n5216m4098l0575k1443j5544j0711p352m957l776k801k165
637E5185j530j258r18o45o19l47m31k96j99l36l43k08p3l46l17m53l00k7l26l25r3r2M3M3
631D5789L1L1R8R9K66K66M03M02N96N97L69L70K80K81J45J44%%j%j09j09K6K7P5P5P5P5N8
624E0359N8N9N8K10K10K10K10N30N31N98N99M98M97K71K71K37K37P3k00J5J6j8K54L7L7O2
617E5919k10l4j70M0J76L94L93O29O30M58M59M59M59M55M55M54M55M89M88K62K62m7m7Q9Q9
611F3006Q7Q6L13L13K54K54K53K54K00K00N17N17P22P22Q58Q58R71R71J198J199J388J388
606G6529J556J691K132K403K792L246L499L772L935L936L709L255K966L238L583L855L798
602A29895L163K340J524J580J853K281K553K780L234L875M329M839N293N951O586P754R117
$$ plain form
597 198947 209225 220140 231349 241741 251392 260589 269471 278217 286084 292407 296786 299440 301034 302493 304147 305347
594 305347 305606 305411 305326 305378 305183 304353 302902 302086 302481 305145 310680 319572 331506 345709 360854 375727 389266 401263
589 401263 411671 419810 425329 428761 430984 433208 435085 435238 432726 427399 420716 414032 408171 403671 400525 398739 397654
585 397654 396705 395112 392883 390215 388000 386370 385375 384746 384752 385025 385434 385001 383932 383598 385714 391188 399295 408561 417011 423778
580 423778 429548 435172 440661 444734 445449 441591 433286 421308 407605 393310 379151 365704 352892 341469 331952 324806
576 324806 320291 319232 321530 326903 334907 344658 355406 366994 380125 395100 411073 427341 443336 459207 473897
572 473897 485854 493908 498456 500191 498784 493473 483869 471270 458580 448160 440473 435236 431929 430164 430017 432684
569 432684 438562 447798 460363 477376 499471 527283 559057 591102 620085 645528 670200 697140 726508 755604
$$ packed form
597A98947J0278J0915J1209J0392R651R197Q882Q746P867O323M379K654J594J459J654J200
594C05347K59j95q5N2j95q30j451q16L95K664N535Q892J1934J4203J5145J4873J3539J1997
589D01263J0408Q139N519L432K223K224J877J53k512n327o683o684n861m500l146j786j085
585C97654r49j593k229k668k215j630r95o29OK73M09m33j069l34K116N474Q107R266Q450O767
580D23778N770N624N489M073P15l858q305j1978j3703j4295j4159j3447j2812j1423r517p146
576C24806m515j059K298N373Q004R751J0748J1588J3131J4975J5973J6268J5995J5871J4690
572D73897J1957Q054M548J735j407n311r604j2599j2690j0420p687n237l307j765j47K667
569D32684N878R236J2565J7013K2095K7812L1774L2045K8983K5443K4672K6940K9368K9096
$$ plain form
565 755604 782322 806226 827680 847227 864585 876770 880345 874208 859338 839657 820770 806330 800065 804962 822305
561 822305 852081 891571 936598 981863 1023770 1060186 1090884 1116659 1138894 1157127 1171276 1181035 1189614 1201920
558 1201920 1221396 1251308 1294744 1352825 1426244 1514320 1609930 1696798 1755259 1774604 1760641 1732240 1706471 1686329
555 1686329 1665008 1635302 1596067 1549345 1498538 1445216 1391077 1338787 1288766 1239737 1188803 1135350 1083077 1035924
551 1035924 994125 956580 922756 892728 862426 823957 772328 712011 654144 603175 559013 521193 490542 467719
548 467719 451521 439901 430550 421619 413142 406916 404230 404312 404122 400972 394828 388467 384739 384511 385825 386867 385278 380622
543 380622 374423 367062 357613 347705 337797 329108 321781 314738 308875 306144 307133 311168 315839 318615 318397 316917 317525 323000
539 323000 332922 346139 358903 369874 379847 388622 395491 398808 398768 401825 411326 427429 448706 472328 493863 507263
$$ packed form
565G55604K6718K3904K1454J9547J7358J2185L575o137j4870j9681j8887j4440o265M897J7343
561H22305K9776L9490M5027M5265M1907L6416L0698K5775K2235J8233J4149R759Q579J2306
558A201920J9476K9912M3436N8081P3419Q8076R5610Q6868N8461J9345j3963k8401k5769k0142
555A686329k1321k9706l9235m6722n0807n3322n4139n2290n0021m9029n0934n3453n2273m7153
551A035924m1799l7545l3824l0028l0302l8469n1629o0317n7867n0969m4162l7820l0651k2823
548D67719j6198j1620r351q931q477o226k686Q2j90l150o144o361l728k28J314J042j589m656
543C80622o199p361r449r908r908q689p327p043n863k731R89M035M671K776k18j480O08N475
539C23000R922J3217J2764J0971R973Q775O869L317m0L057R501J6103K1277K3622K1535J3400
$$ plain form
535 507263 504599 482434 444023 401653 368087 346007 333819 331030 335774 343411 351048 355548 356509 354058 351334 352956
531 352956 357391 358468 353101 345669 339418 334794 333347 333851 336442 341484 347706 352998 354931 351557 342828 331961 321093
527 321093 311536 306426 307073 313983 324220 334912 345648 355568 364864 374795 383677 389745 394969 400192 408404 419067
523 419067 429333 437511 444680 452121 459362 465786 477020 494516 514349 529916 537679 537001 525162 508151 490050
519 490050 470044 447938 420660 392372 369620 352803 334443 310842 285880 262818 242569 225780 212168 200210
516 200210 189250 179310 171459 165757 161053 156554 153960 153115 151271 145832 137578 130851 125485 121287 118451 116323 113015
512 113015 109798 106309 102961 100431 97996 95108 91809 88510 85920 83783 82577 82006 81327 80013 78408 76803 75169 73989
507 73989 73773 74193 73637 71175 67203 64047 61413 59051 57160 55723 54491 53711 53030 52621 52388 52155 51715 51003 50443 49884
$$ packed form
535E07263k664k2165l8411m2370l3566k2080j2188k789M744P637P637M500R61k451k724J622
531C52956M435J077n367p432o251m624j447N04K591N042O222N292J933l374q729j0867j0868
527C21093r557n110O47O910J0237J0692J0736R920R296R931Q882O068N224N223Q212J0663
523D19067J0266Q178P169P441P241O424J1234J7496J9833J5567P763o78j1839j7011j8101
519D90050k0006k2106k7278k8288k2752j6817j8360k3601k4962k3062k0249j6789j3612j1958
516B00210j0960r940p851n702m704m499k594q45j844n439q254o727n366m198k836k128l308
512A13015l217l489l348k530k435k888l299l299k590k137j206n71o79j314j605j605j634j180
507G3989k16M20n56k462l972l156k634k362j891j437j232p80o81m09k33k33m40p12n60n59
$$ plain form
503 49884 49454 49025 48777 48801 48839 49150 50005 50587 50402 49218 48016 47088 46301 45514 44908 44575 44101 43628 43399 43169 42917 42665 42884
497 42884 43103 43184 42811 42405 42270 41986 41701 41524 41619 41558 41769 41827 41885 41997 41837 41665 41221 40781 40341 40112 39882 39368 38855 38426 37998
491 37998 37684 37642 37515 37389 37302 37215 37008 36802 36537 36543 36640 36738 36574 36683 36865 37048 37101 37154 37072 36989 36637 36284 35932 35580 35330 35080 34693
484 34693 34307 34026 33744 33446 33420 33241 33062 33053 33044 32823 32875 32842 32809 32763 32717 32745 33045 33097 33149 33082 33015 33079 33144 32982 32820 32728 32637 32410 32182
477 32182 31958 31733 31508 31284 31272 31260 31282 31577 32433 34106 35938 37134 36811 35307 33963 33072 32541 32282 32215 32149 32070 31991 31844 31697
471 31697 31608 31519 31429 31340 31320 31301 31298 31023 30889 30755 30695 30907 31011 31388 32048 33707 36813 40374 42573 41232 37883 35533 34034
466 34034 32807 32082 31629 31539 31449 31246 31043 30976 30909 30751 30593 30815 30765 30624 30483 30326 30168 30156 30144 30161 30177 30103 30483 31503 33341
460 33341 34842 35527 34692 33221 32057 31165 30517 30141 30135 30129 30004 29880 29834 29789 29743 29698 29717 29736 29755 29774 29777 29781 29716 29652 29607 29563 29219 28874 28745
$$ packed form
503D9884m30m29k48K4L8L11Q55N82j85j184j202r28p87p87o06l33m74m73k29k30k52k52K19
497D2884K19Q1l73m06j35k84k85j77R5o1K11N8N8J12j60j72m44m40m40k29k30n14n13m29m28
491C7998l14m2j27j26q7q7k07k06k65OR7R8j64J09J82J83N3N3q2q3l52l53l52l52k50k50l87
484C4693l86k81k82k98k6j79j79rrk21N2l3l3m6m6K8L00N2N2o7o7O4O5j62j62r2r1k27k28
477C2182k24k25k25k24j2j2K2K95Q56J673J832J196l23j504j344q91n31k59o7o6p9p9j47j47
471C1697q9q9r0q9k0j9lk75j34j34o0K12J04L77O60J659L106L561K199j341l349k350j499
466C4034j227p25m53r0r0k03k03o7o7j58j58K22n0j41j41j57j58j2j2J7J6p4L80J020J838
460C3341J501O85q35j471j164q92o48l76ooj25j24m6m5m6m5J9J9J9J9LMo5o4m5m4l44l45j29
$$ plain form
452 28745 28888 29201 29061 29129 29197 29237 29277 29321 29365 29410 29454 29445 29436 29427 29418 29438 29459 29412 29364 29520 29676 29696 29715 29735 29755 29911 30066 29987 29907 29896 29884 30053
445 30053 30221 30254 30286 30243 30201 30294 30388 30657 30926 30878 30829 30676 30523 30778 31033 31004 30976 30947 30919 31140 31362 31584 31806 32016 32226 32210 32193 32280
438 32280 32367 32590 32812 32981 33150 33319 33488 33726 33963 34490 35016 35466 35463 35215 34967 34918 34870 34957 35045 35149 35253 35675 36097 36539 36981
432 36981 37270 37105 36906 36707 36735 36763 37041 37774 38864 39682 39698 39079 38886 38693 38359 38298 38555 38540 38568 38597 38625 38654 38695 39010 39398 39786
425 39786 40270 40754 41239 41723 41862 42001 42367 42733 43062 43391 43584 43777 44199 44621 45270 45919 47067 48215 49193 49717 49837 49686
420 49686 49732 50051 50972 51892 53068 53608 53493 53651 54205 54759 55354 55948 56888 58100 59544 60988 63017 65499 68656 72629 77715
415 77715 83254 89575 96350 105371 117386 135245 166626 236023 402985 704282 1038705 1244503 1159241 852389
411 852389 591188 424318 303643 220419 172863 148348 134995 126641 120918 115751 112127 110856 112218 114544 117142
$$ packed form
452B8745J43L13j40O8O8M0M0M4M4M5M4rrrrK0K1m7m8J56J56K0J9K0K0J56J55p9q0j1j2J69
445C0053J68L3L2m3m2R3R4K69K69m8m9j53j53K55K55k9k8k9k8K21K22K22K22K10K10j6j7Q7
438C2280Q7K23K22J69J69J69J69K38K37N27N26M50lk48k48m9m8Q7Q8J04J04M22M22M42M42
432C6981K89j65j99j99K8K8K78P33J090Q18J6o19j93j93l34o1K57j5K8K9K8K9M1L15L88L88
425C9786M84M84M85M84J39J39L66L66L29L29J93J93M22M22O49O49J148J148R78N24J20j51
420D9686M6L19R21R20J176N40j15J58N54N54N95N94R40J212J444J444K029K482L157L973N086
415G7715N539O321O775R021J2015J7859L1381O9397J66962L01297L34423K05798q5262l06852
411H52389k61201j66870j20675q3224m7556k4515j3353q354n723n167l624j271J362K326K598
$$ plain form
408 117142 121436 128725 137931 148318 158878 172797 191957 223551 286189 436409 817424 1456464 2092877 2409734
404 2409734 2091969 1455554 999877 699305 480051 332587 252697 210834 187781 171535 158494 145725
401 145725 136711 130511 127776 122590 117246 114534 115991 118809 122410 124650 128641 135990 152358 188420 276391 481529
397 481529 794770 1081238 1188261 990792 686536 480388 341634 240907 175213 140103 121713 110856
394 110856 103312 96947 91031 86475 82834 79192 74626 70332 67433 65896 64813 63729 61790 59396 57687 56432 55393
390 55393 54354 53915 53477 53476 53747 54227 54706 54523 53885 53457 53301 53662 54477 55905 57333 58138 57763 57013 56263 55967 55944 56168 56393
385 56393 56306 55947 55894 56113 56633 56880 56777 56675 56691 56708 56684 56661 57273 58157 59635 61385 63634 66518 69771 73660 77957 82526
379 82526 86303 88901 91885 96956 107711 127451 156153 188394 214393 226507 226356 221940 218018 214731 214802 226036
$$ packed form
408A17142M294P289R206J0387J0560J3919J9160L1594O2638J50220L81015O39040O36413L16857
404B409734l17765o36415m55677l00572k19254j47464p9890m1863k3053j6246j3041j2769
401A45725r014o200k735n186n344k712J457K818L601K240L991P349J6368L6062Q7971K05138
397D81529L13241K86468J07023j97469l04256k06148j38754j00727o5694l5110j8390j0857
394A10856p544o365n916m556l641l642m566m294k899j537j083j084j939k394j709j255j039
390E5393j039m39m38jK71M80M79j83o38m28j56L61Q15J428J428Q05l75p50p50k96k3K24K25
385E6393q7l59n3K19N20K47j03j02J6J7k4k3O12Q84J478J750K249K884L253L889M297M569
379H2526L777K598K984N071J0755J9740K8702L2241K5999J2114j51m416l922l287P1J1234
$$ plain form
375 226036 255819 300939 346706 372961 368488 345229 322820 307400 298324 293876 292469 294057 296734 300046 304561
372 304561 309892 319701 343577 399308 479272 547245 572108 516503 440296 394546 371031 373393 412694 518452
368 518452 677303 820237 884122 770562 604453 489225 398592 328952 277192 243844 222023 210360 202600
365 202600 196769 192117 193892 203382 221629 244687 267073 280474 280011 264210 240939 221571 214137 221315 245246
361 245246 284153 329094 362873 362532 323801 269392 216889 174704 143139 120661 103719 92256 84333 78928 74522
358 74522 70798 66439 62664 59162 56294 53427 50985 48543 46578 44613 43311 42009 41119 39956 38719 37483 36486 35489
353 35489 34491 33494 32812 32129 31583 31037 30574 30112 29785 29459 29316 29172 29238 29305 29312 29046 29042 29038 29684 30966 32525 33087 31829 29572
348 29572 27776 26614 25747 24881 24445 24010 23917 23552 23204 22855 22663 22471 22279 22087 21889 21691 21703 21715 21662 21337 21300 21264 21426 21587
$$ packed form
375B26036K9783M5120M5767K6255m473k3259k2409j5420r076m448j407J588K677L312M515
372C04561N331R809K3876N5731P9964O7973K4863n5605p6207m5750k3515K362L9301J05758
368E18452J58851J42934O3885j13560j66109j15228r0633o9640n1760l3348k1821j1663p760
365B02600n831m652J775R490J8247K3058K2386J3401m63j5801k3271j9368p434P178K3931
361B45246L8907M4941L3779l41l8731n4409n2503m2185l1565k2478j6942j1463p923n405m406
358G4522l724m359l775l502k868k867k442k442j965j965j302j302q90j163j237j236r97r97
353C5489r98r97o82o83n46n46m63m62l27l26j43j44O6O7Pk66mmO46J282J559N62j258k257
348B9572j796j162q67q66m36m35r3l65l48l49j92j92j92j92j98j98J2J2n3l25l7l6J62J61
$$ plain form
342 21587 22474 24541 27936 31058 32433 30088 26647 24205 22500 21249 20383 19790 19571 19353 19215 19078 19077 19075 18897 18718 18472
337 18472 18225 18135 18044 17954 17863 17811 17758 17723 17688 17821 18227 19478 21001 22471 22760 21387 19743 18791 17840 17280 16720 16503 16286 16206
331 16206 16125 16021 15916 15812 15708 15668 15629 15590 15551 15479 15408 15336 15265 15232 15199 15183 14894 14913 14932 14882 14833 14686 14811 14783 14755 14692 14630 14431 14232 14190
323 14190 14147 14241 14334 14208 14081 14091 14101 14077 14053 14012 13970 14061 13879 13851 13823 13752 13681 13763 13573 13622 13671 13568 13464 13433 13401 13370 13339 13346 13352 13291 13230 13233 13235
315 13235 13374 13513 13609 13705 13801 13897 13811 13725 13504 13554 13589 13896 14203 14511 14446 14382 14210 14038 13617 13650 13716 13511 13452 13392 13384 13375 13390 13404 13555 13705
308 13705 14135 14565 14972 14744 14136 13982 13777 13572 13531 13763 14743 15724 16328 16116 14985 14126 13632 13138 12643 12421 12217 12013 11912
302 11912 11810 11691 11845 11845 11845 12043 12240 12341 12442 12582 12267 12072 11877 11849 11822 11959 12369 12642 12915 12769 12350 11934 11517 11310 11104
296 11104 10969 10835 10769 10702 10563 10423 10510 10597 10552 10507 10462 10417 10473 10529 10449 10368 10265 10162 10128 10093 10096 10100 10036 9971 9964 9956 9948 9941 9845 9748 9879 10010 9986
$$ packed form
342B1587Q87K067L395L122J375k345l441k442j705j251q66n93k19k18j38j37jkj78j79k46
337A8472k47r0r1r0r1n2n3l5l5J33M06J251J523J470K89j373j644r52r51n60n60k17k17q0
331A6206q1j04j05j04j04m0l9l9l9p2p1p2p1l3l3j6k89J9J9n0m9j47J25k8k8o3o2j99j99m2
323A4190m3R4R3j26j27J0J0k4k4m1m2R1j82k8k8p1p1Q2j90M9M9j03j04l1l2l1l1POo1o1LK
315A3235J39J39R6R6R6R6q6q6k21N0L5L07L07L08o5o4j72j72m21L3O6k05n9o0qrJ5J4J51J50
308A3705M30M30M07k28o08j54k05k05m1K32R80R81O04k12j131q59m94m94m95k22k04k04j01
302A1912j02j19J54%%J98J97J01J01J40l15j95j95k8k7J37M10K73K73j46m19m16m17k07k06
296A1104j35j34o6o7j39j40Q7Q7m5m5m5m5N6N6q0q1j03j03l4l5LMo4o5pqqpr6r7J31J31k4
$$ plain form
288 9986 9962 9870 9778 9886 9995 9967 9939 9959 9978 9861 9744 9663 9582 9501 9420 9357 9293 9365 9437 9411 9385 9359 9333 9239 9144 9169 9194 9329 9192 9055 9190
281 9190 9138 9086 9204 9050 8949 8848 8866 8884 8875 8866 8925 8984 8903 8821 8876 8930 8848 8767 8753 8740 8651 8563 8611 8658 8659 8660 8678 8696 8622 8821 8730 8640 8566 8493
272 8493 8555 8618 8593 8568 8544 8519 8593 8668 8538 8409 8333 8257 8340 8423 8359 8294 8298 8302 8364 8426 8374 8323 8219 8116 8125 8135 8169 8204 8238 8273 8164 8055 8105
264 8105 8155 8180 8205 8162 8119 8074 8030 7985 7940 7907 7874 7954 8034 7978 7922 7934 7946 7909 7872 7835 7798 7827 7857 7818 7779 7875 7972 7909 7846 7774 7701 7628 7556 7534 7512
256 7512 7603 7695 7673 7651 7629 7607 7520 7433 7459 7486 7420 7354 7447 7540 7504 7467 7499 7530 7515 7500 7417 7334 7308 7282 7256 7231 7324 7417 7352 7286 7284 7281 7279 7276 7306 7336 7298
247 7298 7260 7189 7118 7114 7111 7162 7213 7104 6996 6948 6900 6965 7030 7022 7013 7004 6996 7015 7035 7054 7074 6994 6914 6902 6891 6938 6986 6966 6946 6944 6942 6941 6939 6955 6971 6874 6777 6748 6719
237 6719 6690 6661 6676 6691 6774 6857 6850 6844 6769 6695 6799 6904 6850 6796 6746 6696 6759 6822 6784 6745 6706 6667 6684 6700 6649 6597 6507 6418 6487 6557 6537 6517 6497 6476 6436
228 6436 6395 6422 6449 6476 6503 6462 6421 6430 6439 6447 6456 6426 6397 6367 6338 6348 6358 6368 6378 6268 6158 6161 6164 6182 6201 6220 6239 6242 6245 6180 6115 6159 6203 6179 6155 6040 5925
$$ packed form
288I986k4r2r2J08J09k8k8K0J9j17j17q1q1q1q1o3o4P2P2k6k6k6k6r4r5K5K5J35j37j37J35
281I190n2n2J18j54j01j01J8J8rrN9N9q1q2N5N4q2q1j4j3q9q8M8M7JJJ8J8p4J99r1r0p4p3
272H493O2O3k5k5k4k5P4P5j30j29p6p6Q3Q3o4o5MMO2O2n2n1j04j03RJ0L4L5L4L5j09j09N0
264H105N0K5K5m3m3m5m4m5m5l3l3Q0Q0n6n6J2J2l7l7l7l7K9L0l9l9R6R7o3o3p2p3p3p2k2k2
256G512R1R2k2k2k2k2q7q7K6K7o6o6R3R3l6l7L2L1j5j5q3q3k6k6k6k5R3R3o5o6klklL0L0l8
247G298l8p1p1mlN1N1j09j08m8m8O5O5qrrqJ9K0J9K0q0q0j2j1M7M8k0k0kkjkJ6J6r7r7k9k9
237F719k9k9J5J5Q3Q3pop5p4J04J05n4n4n0n0O3O3l8l9l9l9J7J6n1n2r0q9O9P0k0k0k0k1m0
228F436m1K7K7K7K7m1m1RRQRl0k9l0k9J0J0J0J0j10j10LLJ8J9J9J9LLo5o5M4M4k4k4j15j15
$$ plain form
219 5925 5924 5923 5970 6016 5995 5974 5900 5827 5867 5906 5912 5917 5923 5928 5945 5962 5911 5860 5881 5902 5923 5944 5991 6037 5970 5904 5872 5840 5808 5776 5782 5789 5863 5938 5845 5752 5727 5702 5646
210 5646 5590 5665 5739 5567 5667 5773 5878 5839 5801 5762 5723 5688 5653 5619 5584 5584 5583 5582 5582 5561 5540 5519 5499 5481 5463 5513 5563 5495 5427 5472 5517 5537 5556 5576 5596
201 5596 5561 5526 5662 5525 5381 5509 5467 5425 5483 5541 5486 5430 5443 5456 5400 5345 5356 5367 5378 5390 5436 5483 5416 5349 5300 5250 5377 5503 5324 5418 5427 5436
193 5436 5389 5343 5296 5250 5269 5287 5306 5325 5233 5141 5117 5092 5109 5126 5143 5160 5145 5130 5268 5134 5134 5134 5050 4965 4992 5019 5047 5074 5029 4984 5007 5030 5037 5045 5137 5230
185 5230 5029 5100 5018 4936 4977 5019 4992 4965 4943 4920 4898 4875 4897 4919 4941 4963 5005 5047 4975 4904 4981 5058 4977 4895 4939 4982 4758 4807 4848 4888 4877 4867 4771 4675
176 4675 4738 4801 4773 4744 4829 4914 4870 4826 4782 4738 4688 4639 4658 4676 4695 4713 4664 4615 4631 4647 4663 4679 4739 4799 4791 4783 4679 4574 4628 4682 4659 4637 4614 4592 4580
168 4580 4567 4555 4543 4508 4473 4552 4630 4579 4528 4591 4654 4571 4489 4475 4461 4400 4338 4390 4442 4405 4367 4443 4520 4499 4479 4459 4439 4494 4549 4490 4432 4426 4421 4484 4546 4446
159 4446 4346 4314 4281 4265 4248 4231 4215 4267 4320 4305 4290 4331 4372 4300 4227 4232 4236 4240 4244 4211 4177 4144 4110 4233 4355 4274 4192 4149 4106 4176 4247 4279 4311 4343 4375
$$ packed form
219E925jjM7M6k1k1p4p3M0L9ONONJ7J7n1n1K1K1K1K1M7M6o7o6l2l2l2l2OPP4P5r3r3k5k5n6
210E646n6P5P4j72J00J06J05l9l8l9l9l5l5l4l5%jj%k1k1k1k0j8j8N0N0o8o8M5M5K0J9K0K0
201E596l5l5J36j37j44J28m2m2N8N8n5n6J3J3n6n5J1J1J1J2M6M7o7o7m9n0J27J26j79R4RR
193E436m7m6m7m6J9J8J9J9r2r2k4k5J7J7J7J7j5j5J38j34%%q4q5K7K7K8K7m5m5K3K3PQR2R3
185E230k01P1q2q2M1M2k7k7k2k3k2k3K2K2K2K2M2M2p2p1P7P7q1q2M4M3k24M9M1M0j1j0r6r6
176D675O3O3k8k9Q5Q5m4m4m4m4n0m9J9J8J9J8m9m9J6J6J6J6O0O0qqj04j05N4N4k3k2k3k2j2
168D580j3j2j2l5l5P9P8n1n1O3O3q3q2j4j4o1o2N2N2l7l8P6P7k1k0k0k0N5N5n9n8onO3O2j00
159D446j00l2l3j6j7j7j6N2N3j5j5M1M1p2p3NMMMl3l4l3l4J23J22q1q2m3m3P0P1L2L2L2L2
$$ plain form
150 4375 4294 4213 4199 4186 4150 4115 4192 4270 4229 4188 4148 4107 4161 4215 4202 4188 4238 4288 4225 4161 4101 4041 4094 4147 4085 4024 4077 4129 4086 4043 4001 3958 4003 4049 4026
142 4026 4003 3985 3966 3948 3930 3932 3935 3937 3940 3949 3959 3968 3978 4048 4118 3876 3907 3934 3962 4006 4051 3988 3925 3930 3936 3975 4014 3985 3957 3931 3906 3880 3855 3882 3909 3936 3963 3944
133 3944 3926 3907 3888 3852 3817 3781 3745 3751 3756 3761 3767 3779 3791 3804 3816 3808 3801 3906 4012 3974 3937 3899 3862 3838 3815 3809 3803 3648 3765 3729 3693 3621 3548 3544 3540 3577 3614 3651
123 3651 3689 3708 3727 3746 3765 3746 3727 3708 3689 3716 3743 3702 3661 3697 3732 3700 3667 3656 3644 3632 3621 3622 3623 3777 3659 3618 3577 3536 3495 3450 3677 3791 3632
115 3632 3650 3669 3671 3673 3582 3492 3515 3537 3569 3600 3563 3526 3534 3543 3551 3559 3635 3711 3787 3863 3900 3938 3975 4013 3971 3930 3821 3712 3788 3865 3873 3881 3800 3718 3750 3782 3870 3959
106 3959 4047 4136 4212 4287 4363 4439 4458 4477 4496 4515 4473 4431 4389 4348 4282 4216 4149 4083 3971 3858 3904 3950 4081 4212 4343 4474 4451 4428 4472 4517 4508 4499 4376
98 4376 4254 4167 4081 3994 3908 3824 3741 3657 3574 3545 3517 3648 3778 3736 3693 3651 3608 3631 3653 3608 3562 3613 3664 3510 3357 3328 3299 3270 3241 3248 3254 3193 3131 3231
90 3231 3332 3318 3305 3256 3207 3159 3110 3063 3017 3084 3150 3132 3114 3164 3213 3191 3169 3147 3125 3171 3217 3149 3082 3103 3125 3146 3168 3168 3168 3100 3033 3008 2984 3027 3071 3108
$$ packed form
150D375q1q1j4j3l6l5P7P8m1m1m0m1N4N4j3j4N0N0o3o4o0o0N3N3o2o1N3N2m3m3m2m3M5M6k3
142D026k3j8j9j8j8KLKLRJ0RJ0P0P0k42L1K7K8M4M5o3o3NOL9L9k9k8k6k5k6k5K7K7K7K7j9
133C944j8j9j9l6l5l6l6ONNOJ2J2J3J2qpJ05J06l8l7l8l7k4k3ooj55J17l6l6p2p3mmL7L7L7
123C651L8J9J9J9J9j9j9j9j9K7K7m1m1L6L5l2l3j1j2j2j1JJJ54j18m1m1m1m1m5K27J14j59
115C632J8J9KKr1r0K3K2L2L1l7l7QRQQP6P6P6P6L7L8L7L8m2m1j09j09P6P7QQq1q2L2L2Q8Q9
106C959Q8Q9P6P5P6P6J9J9J9J9m2m2m2m1o6o6o7o6j12j13M6M6J31J31J31J31k3k3M4M5rrj23
98D376j22q7q6q7q6q4q3q4q3k9k8J31J30m2m3m2m3K3K2m5m6N1N1j54j53k9k9k9k9POo1o2J00
90C231J01j4j3m9m9m8m9m7m6O7O6j8j8N0M9k2k2k2k2M6M6o8o7K1K2K1K2%%o8o7k5k4M3M4L7
$$ plain form
81 3108 3146 3025 2904 2899 2894 2957 3020 3001 2982 2963 2943 2937 2930 2924 2917 3006 3095 3115 3135 3078 3021 2963 2906 2891 2876 2862 2847 2916 2985 2896 2806 2802 2797 2861 2924 2915 2906 2897 2888 2931
71 2931 2974 2950 2925 2976 3026 2964 2901 2860 2818 2845 2872 2832 2792 2752 2711 2714 2716 2719 2721 2756 2791 2894 2996 2955 2913 2871 2829 2843 2856 2802 2747 2811 2876 2827 2778 2779 2780
62 2780 2780 2781 2689 2598 2620 2642 2717 2791 2798 2804 2751 2698 2759 2819 2832 2844 2744 2643 2647 2651 2655 2659 2665 2671 2677 2683 2650 2618 2654 2689 2682 2674 2667 2659 2690 2721 2752 2782 2744 2705 2666 2627
52 2627 2552 2476 2559 2643 2644 2645 2579 2512 2468 2424 2448 2472 2511 2551 2522 2494 2423 2352 2439 2527 2495 2462 2498 2533 2612 2690 2655 2619 2585 2551 2630 2709 2726 2742 2691 2640
43 2640 2568 2496 2492 2488 2465 2441 2486 2530 2434 2339 2311 2284 2406 2529 2493 2457 2505 2554 2488 2423 2540 2656 2568 2480 2362 2244 2330 2415 2403 2392 2380 2368 2375 2383
35 2383 2323 2263 2291 2318 2346 2374 2423 2473 2409 2345 2306 2267 2297 2326 2304 2281 2259 2236 2286 2335 2317 2299 2325 2352 2310 2269 2283 2297 2242 2188 2233 2278 2322 2367 2389
26 2389 2411 2365 2319 2307 2296 2285 2274 2251 2229 2206 2184 2222 2261 2186 2111 2185 2259 2265 2270 2354 2438 2363 2288 2298 2308 2318 2328 2297 2267 2237 2206 2267 2327 2319 2312 2311 2311 2395
17 2395 2208 2263 2317 2440 2291 2268 2244 2204 2163 2121 2079 2151 2222 2144 2066 2147 2228 2273 2318 2250 2182 2144 2106 2068 2030 2065 2099 2133 2168 2205 2243 2127 2284
$$ packed form
81C108L8j21j21nnO3O3j9j9j9k0opopQ9Q9K0K0n7n7n8n7j5j5j4j5O9O9q9r0mnO4O3rrrrM3
71B931M3k4k5N1N0o2o3m1m2K7K7m0m0m0m1LKLKL5L5J03J02m1m2m2m2J4J3n4n5O4O5m9m9JJ
62B780%Jr2r1K2K2P5P4POn3n3O1O0J3J2j00j01MMMMOOOOl3l2L6L5pqpqL1L1L1L0l8l9l9l9
52B627p5p6Q3Q4JJo6o7m4m4K4K4L9M0k9k8p1p1Q7Q8l2l3L6L5P9P8l5l6l4l4P9P9J7J6n1n1
43B640p2p2mmk3k4M5M4r6r5k8k7J22J23l6l6M8M9o6o5J17J16q8q8j18j18Q6Q5j2j1j2j2PQ
35B383o0o0K8K7K8K8M9N0o4o4l9l9L0K9k2k3k2k3N0M9j8j8K6K7m2m1J4J4n5n4M5M5M4M5K2
26B389K2m6m6j2j1j1j1k3k2k3k2L8L9p5p5P4P4ONQ4Q4p5p5J0J0J0J0l1l0l0l1O1O0qpj%Q4
17B395j87N5N4J23j49k3k4m0m1m2m2P2P1p8p8Q1Q1M5M5o8o8l8l8l8l8L5L4L4L5L7L8j16J57
$$ plain form
9 2284 2262 2240 2167 2094 2122 2150 2064 1978 2009 2039 2070 2100 2069 2037 2005 1973 1976 1978 1980 1983 1993 2004 2015 2026 2052 2079 2099 1848 1891 1934 1960 1986 1938 1890 1996 1829
0 1829 1977 2125 2051 1978 1895 1812 1796 1781 1889 1997 1991 1986 1992 1998 2003 2009 2008 2007 2005 2004 1973 1942 2024 2107 2025 1944 1862 1781 1786 1791 1796 1801 1818 1834 1851 1867 1902 1937 1972 2007 2069
-10 2069 2131 1944 1756 1814 1872 1664 1727 1803 1879 1813 1746 1767 1787 1808 1828 1792 1755 1787 1819 1812 1806 1867 1929 1871 1813 1824 1834 1849 1864 1879 1893 1848 1803 1826
-19 1826 1849 1830 1810 1791 1771 1815 1858 1834 1810 1860 1911 1848 1785 1759 1733 1820 1907 1894 1880 1867 1854 1804 1754 1773 1791 1771 1751 1732 1712 1749 1786 1823 1861 1864 1867 1870
-27 1870 1873 1822 1771 1719 1668 1718 1769 1820 1871 1840 1810 1627 1716 1713 1710 1723 1737 1730 1722 1783 1844 1818 1792 1670 1547 1540 1805 1775 1745 1574 1674 1690 1705 1658 1610
-36 1610 1676 1742 1689 1635 1695 1756 1701 1646 1660 1673 1716 1759 1803 1846 1745 1644 1611 1579 1549 1519 1557 1595 1575 1554 1533 1512 1518 1524 1644 1763 1667 1570 1587 1604
-44 1604 1609 1614 1688 1761 1690 1618 1615 1611 1574 1536 1499 1461 1512 1563 1614 1665 1659 1653 1647 1641 1630 1620 1609 1598 1605 1611 1549 1488 1555 1622 1621 1620 1653 1685 1650 1615 1643 1670 1629 1588 1441
-54 1441 1294 1397 1499 1488 1477 1466 1455 1460 1464 1469 1473 1464 1454 1444 1434 1522 1610 1584 1559 1506 1453 1400 1346 1431 1515 1532 1548 1489 1430 1440 1449 1466 1482 1499 1515 1570
$$ packed form
9B284k2k2p3p3K8K8q6q6L1L0L1L0l1l2l2l2LKKLJ0J1J1J1K6K7K0k51M3M3K6K6m8m8J06j67
0A829J48J48p4p3q3q3j6j5J08J08onOONOjjkjl1l1Q2Q3q2q1q2q1NNNNJ7J6J7J6L5L5L5L5O2
-10B069O2j87j88N8N8k08O3P6P6o6o7K1K0K1K0l6l7L2L2poO1O2n8n8J1J0J5J5J5J4m5m5K3
-19A826K3j9k0j9k0M4M3k4k4N0N1o3o3k6k6Q7Q7j3j4j3j3n0n0J9J8k0k0j9k0L7L7L7L8LLL
-27A870Ln1n1n2n1N0N1N1N1l1l0j83Q9llJ3J4pqO1O1k6k6j22j23pK65l0l0j71J00J6J5m7m8
-36A610O6O6n3n4O0O1n5n5J4J3M3M3M4M3j01j01l3l2l0l0L8L8k0k1k1k1OOJ20J19r6r7J7J7
-44A604NNP4P3p1p2lml7l8l7l8N1N1N1N1ooooj1j0j1j1POo2o1O7O7jjL3L2l5l5K8K7m1m1j47
-54A441j47J03J02j1j1j1j1NMNMrj0j0j0Q8Q8k6k5n3n3n3n4Q5Q4J7J6n9n9J0RJ7J6J7J6N5
$$ plain form
-63 1570 1624 1566 1507 1512 1517 1522 1527 1486 1446 1405 1364 1408 1452 1338 1223 1341 1459 1509 1559 1519 1480 1509 1537 1530 1522 1515 1508 1538 1569 1600 1631 1594 1556 1519 1482 1497 1512
-72 1512 1528 1543 1558 1573 1520 1467 1441 1415 1457 1499 1562 1625 1575 1525 1501 1478 1455 1432 1516 1600 1571 1542 1486 1430 1442 1454 1431 1407 1452 1496 1422 1347 1432 1516 1447
-81 1447 1378 1377 1376 1342 1309 1275 1242 1297 1352 1339 1326 1351 1376 1401 1427 1383 1339 1296 1252 1234 1216 1265 1315 1245 1175 1219 1263 1344 1426 1394 1363 1341 1319 1297 1275 1234
-89 1234 1194 1267 1339 1327 1315 1235 1155 1172 1190 1208 1225 1256 1286 1248 1210 1315 1421 1413 1405 1285 1166 1160 1154 1130 1105 1081 1057 1113 1170 1159 1147 1115 1082 1163 1244
-98 1244 1202 1160 1186 1213 1203 1194 1185 1176 1202 1228 1187 1145 1135 1124 1114 1103 1158 1213 1154 1096 1130 1165 1087 1008 1059 1110 1161 1212 1120 1028 1003 979 983 988 1060 1132 1114
-107 1114 1095 1076 1058 1086 1114 1142 1170 1164 1158 1152 1146 1140 1134 1128 1122 1073 1025 1044 1064 1095 1127 1090 1054 1098 1142 1119 1095 1080 1064 1049 1034 1044 1054 1065 1075 1116 1157 1130
-116 1130 1103 1073 1043 1013 984 1088 1193 1185 1176 1193 1210 1113 1017 997 977 958 938 934 930 994 1058 1008 958 976 993 1011 1029 1047 1065 1059 1053 1047 1041 1007 972 1006 1040
-125 1040 977 915 1012 1109 1087 1064 1042 1020 1039 1059 1079 1098 1057 1016 974 933 937 940 876 811 880 949 950 951 953 955 958 960 877 794 825 856 904 952 1000 1048 921 795
$$ packed form
-63A570N4n8n9NNNNm1m0m1m1M4M4j14j15J18J18N0N0m0l9K9K8pqppL0L1L1L1l7l8l7l7J5J5
-72A512J6J5J5J5n3n3k6k6M2M2O3O3n0n0k4k3k3k3Q4Q4k9k9n6n6J2J2k3k4M5M4p4p5Q5Q4o9
-81A447o9jjl4l3l4l3N5N5j3j3K5K5K5K6m4m4m3m4j8j8M9N0p0p0M4M4Q1Q2l2l1k2k2k2k2m1
-89A234m0P3P2j2j2q0q0J7J8J8J7L1L0l8l8J05J06qqj20j19ook4k5k4k4N6N7j1j2l2l3Q1Q1
-98A244m2m2K6K7j0rrrK6K6m1m2j0j1j0j1N5N5n9n8L4L5p8p9N1N1N1N1r2r2k5k4MNP2P2j8
-107A114j9j9j8K8K8K8K8oooooooom9m8J9K0L1L2l7l6M4M4k3k4j5j6j5j5J0J0J1J0M1M1k7
-116A130k7l0l0l0k9J04J05qrJ7J7r7r6k0k0j9k0mmO4O4n0n0J8J7J8J8J8J8ooool4l5L4L4
-125A040o3o2R7R7k2k3k2k2J9K0K0J9m1m1m2m1MLo4o5O9O9JJKKLKq3q3L1L1M8M8M8M8j27j26
$$ plain form
-135 795 872 950 1019 1087 996 906 947 989 917 845 879 914 949 983 992 1001 960 918 782 920 903 887 939 991 975 959 955 951 929 908 1004 828 874 919 855
-143 855 792 842 892 950 1009 999 990 947 904 793 682 717 752 634 788 868 948 932 916 906 897 888 879 855 831 807 783 759 735 779 823 798 773 816 860
-152 860 776 691 766 840 877 913 881 849 823 797 839 881 905 929 885 841 928 1015 897 779 767 755 856 957 898 839 780 720 795 869 876 882 816 750
-160 750 843 936 922 909 845 781 691 874 903 932 875 818 761 704 703 703 702 702 708 713 736 759 625 763 747 732 758 785 744 702 733 764 795 826 809 792
-169 792 775 758 754 750 746 742 743 744 677 610 657 703 750 796 853 910 899 887 851 814 777 740 764 787 697 607 619 631 643 656 616 576 605 633 738 843 744
-178 744 645 633 621 610 598 626 654 682 710 726 742 690 638 709 781 693 606 651 697 674 652 619 587 622 658 669 679 689 700 683 667 719 770 715 660
-187 660 718 776 754 731 709 686 706 726 677 629 531 433 539 645 666 686 594 501 557 613 601 589 592 595 598 601 583 565 661 756 633 510 591 672 685
-195 685 698 598 498 587 677 652 628 533 438 502 566 584 603 553 504 510 515 521 527 462 398 447 496 522 549 643 737 678 619 559 500 535 571 538 506 523
$$ packed form
-135G95P7P8O9O8r1r0M1M2p2p2L4L5L5L4RRm1m2j36J38j7j6N2N2j6j6mmk2k1R6j76M6M5o4
-143H55o3N0N0N8N9j0rm3m3j11j11L5L5j18J54Q0Q0j6j6j0rrrk4k4k4k4k4k4M4M4k5k5M3M4
-152H60q4q5P5P4L7L6l2l2k6k6M2M2K4K4m4m4Q7Q7j18j18j2j2J01J01n9n9n9o0P5P4POo6o6
-160G50R3R3j4j3o4o4r0J83K9K9n7n7n7n7j%j%ONK3K3j34J38j6j5K6K7m1m2L1L1L1L1j7j7
-169G92j7j7mmmmJJo7o7M7M6M7M6N7N7j1j2l6l7l7l7K4K3r0r0J2J2J2J3m0m0K9K8J05J05r9
-178G44r9j2j2j1j2K8K8K8K8J6J6n2n2P1P2q8q7M5M6k3k2l3l2L5L6J1J0J0J1j7j6N2N1n5n5
-187F60N8N8k2k3k2k3K0K0m9m8r8r8J06J06K1K0r2r3N6N6j2j2LLLLj8j8R6R5j23j23Q1Q1J3
-195F85J3j00j00Q9R0k5k4r5r5O4O4J8J9n0m9ONOOo5o4M9M9K6K7R4R4n9n9o0n9L5L6l3l2J7
$$ plain form
-204 523 541 491 441 451 462 473 484 560 637 600 563 556 549 602 654 667 545 431 543 537 395 456 518 537 556 643 729 646 563 593 623 558 492 495 497
-212 497 512 528 543 558 468 378 455 532 445 494 330 393 576 622 632 506 551 597 520 443 437 431 493 555 576 597 549 502 530 558 586 614 510 406
-221 406 475 544 458 600 546 491 504 516 460 405 422 440 458 476 425 375 438 501 493 485 476 468 462 455 516 577 425 272 350 427 618 491 415 566 580
-229 580 595 623 652 613 573 602 630 536 441 414 388 391 394 465 536 542 547 553 558 496 433 439 445 465 486 506 527 472 417 504 591 610 357 416 474 404 334 422
-239 422 511 498 486 474 462 472 483 340 469 478 487 444 402 439 476 513 550 454 358 376 394 501 608 602 596 476 357 396 436 439 441 376 310 439
-247 439 567 491 416 349 281 373 465 411 358 356 353 608 590 368 418 404 391 394 398 380 362 412 462 501 540 510 481 403 326 361 397 477 556 477 397
-256 397 295 193 295 397 467 537 539 541 460 380 368 355 304 252 314 376 378 380 314 248 331 414 429 443 433 422 479 536 547 558 501 444 347 250 221
-264 221 192 296 400 345 291 222 153 242 332 210 89 216 344 330 316 370 424 311 197 243 288 283 277 272 266 251 236 221 205 270 334 330 326 274
$$ packed form
-204E23J8n0n0J0J1J1J1P6P7l7l7ppN3N2J3j22j14J12oj42O1O2J9J9Q7Q6q3q3L0L0o5o6LK
-212D97J5J6J5J5r0r0P7P7q7M9j64O3J83M6J0j26M5M6p7p7ooO2O2K1K1m8m7K8K8K8K8j04j04
-221D06O9O9q6J42n4n5J3J2n6n5J7J8J8J8n1n0O3O3qqrqopO1O1j52j53P8P7J91j27p6J51J4
-229E80J5K8K9l9m0K9K8r4r5k7k6LLP1P1ONONo2o3OOK0K1K0K1n5n5Q7Q7J9k53N9N8p0p0Q8
-239D22Q9j3j2j2j2J0J1j43J29RRm3m2L7L7L7L7r6r6J8J8J07J07ooj20j19L9M0LKo5o6J29
-247D39J28p6p5o7o8R2R2n4n3klK55j8k22N0j4j3LMj8j8N0N0L9L9l0k9p8p7L5L6Q0P9p9q0
-256C97j02j02J02J02P0P0KKq1q0j2j3n1n2O2O2KKo6o6Q3Q3J5J4j0j1N7N7J1J1n7n7r7r7k9
-264B21k9J04J04n5n4o9o9Q9R0j22j21J27J28j4j4N4N4j13j14M6M5nonoj5j5j5j6O5O4mmn2
$$ plain form
-272 274 221 283 344 332 321 378 435 391 348 304 261 240 219 266 313 308 303 298 293 264 235 274 313 388 464 426 388 399 411 354 298 277 257 236 215 240 265
-281 265 289 314 359 405 337 268 260 251 243 234 292 349 339 329 300 271 242 214 214 215 215 216 200 183 167 150 195 240 285 330 323 315 308 300 291 282 341 400 277 153 233
-291 233 313 400 487 369 252 228 204 180 156 192 228 264 300 295 290 217 143 185 226 267 309 215 122 232 343 399 454 260 66 97 129 160 192
-300 192 247 302 244 186 158 130 169 209 171 132 162 191 182 174 233 292 282 272 262 252 264 275 287 298 265 232 199 166 160 154 148 142 235 329 308 288 265 242
-309 242 219 196 265 334 244 154 183 213 242 271 302 332 295 257 203 149 162 176 149 122 95 67 164 260 197 135 141 148 86 25 67 109 151 193 196 198 133
-318 133 67 74 81 20 -40 28 98 99 100 73 46 87 128 186 245 190 136 115 94 90 87 -25 134 140 147 111 75 107 139 132 125 32 -59 123 33 97 160 103
-327 103 47 -9 -66 67 202 178 153 186 218 251 283 215 146 192 237 115 -5 -13 -22 105 233 248 262 220 178 204 230 176 123 69 16 -1 -18
-335 -18 -188 -86 -31 23 95 167 157 146 204 262 190 119 115 112 81 51 88 126 108 90 72 54 63 73 14 -44 -34 -25 -15 -6 40 88 67 47 31 14 -1
$$ packed form
-272B74n3O2O1j2j1N7N7m4m3m4m3k1k1M7M7nnnnk9k9L9L9P5P6l8l8J1J2n7n6k1k0k1k1K5K5
-281B65K4K5M5M6o8o9qrqrN8N7j0j0k9k9k9k8%J%Jj6j7j6j7M5M5M5M5pqpqrrN9N9j23j24Q0
-291B33Q0Q7Q7j18j17k4k4k4k4L6L6L6L6nnp3p4M2M1M1M2r4r3J10J11N6N5j94j94L1L2L1L2
-300A92N5N5n8n8k8k8L9M0l8l9L0K9rqN9N9j0j0j0j0J2J1J2J1l3l3l3l3ooooR3R4k1k0k3k3
-309B42k3k3O9O9r0r0K9L0K9K9L1L0l7l8n4n4J3J4k7k7k7k8R7R6o3o2OPo2o1M2M2M2M2LKo5
-318A33o6PPo1o0O8P0JJk7k7M1M1N8N9n5n4k1k1mlj12J59OPl6l6L2L2ppr3r1J82r0O4O3n7
-327A03n6n6n7J33J35k4k5L3L2L3L2o8o9M6M5j22j20qrJ27J28J5J4m2m2K6K6n4n3n4n3j7j7
-335a8j70J02N5N4P2P2j0j1N8N8p2p1mll1l0L7L8j8j8j8j8RJ0n9n8J0RJ0RM6M8k1k0j6j7j5
$$ plain form
-344 -1 -17 0 16 34 51 103 154 92 30 132 235 133 31 105 179 139 100 35 -28 -25 -21 38 98 45 -7 -51 -96 -72 -47 32 113 126 138 65 -8
-353 -8 30 70 49 27 176 53 -73 71 160 249 156 64 39 14 15 16 17 18 -75 -169 -150 -131 -92 -53 53 160 159 158 44 -69 39 148 98 49
-361 49 -6 -61 24 111 336 289 145 1 38 75 -1 -78 -58 -37 -17 3 0 -3 145 23 20 17 -2 -22 56 136 102 67 20 -26 39 105 38 -28 -27
-370 -27 -26 -36 -47 10 67 44 21 -1 -24 -37 -50 5 60 26 -6 -125 27 149 271 205 140 110 80 50 20 104 188 114 39 25 12 -1 -15 -40
-378 -40 -66 -92 -118 -89 -59 -98 -136 -108 -79 -50 -22 47 117 28 -60 -101 -143 -71 0 -38 -76 -109 129 69 9 80 150 64 -22 -109 -196 -122 -49 -89 -129
-387 -129 -144 -160 -62 34 36 37 -29 -96 -73 -51 -28 -6 70 147 111 75 24 -26 -76 -127 -72 -18 -32 -45 -65 -84 -104 -123 -108 -93 -146 -199 -174 -149 -125 -100
-395 -100 -76 -53 -29 -6 -45 -83 -54 -25 -79 -133 -119 -105 -46 12 -86 -185 -180 -174 -55 62 71 79 19 -39 -92 -144 -37 68 53 38 22 7 -16 -39 -63
-404 -63 -86 -114 -142 -169 -197 -122 -48 -41 -34 -75 -115 -87 -59 -76 -94 -43 6 -54 -116 -109 -102 -106 -110 -114 -118 -79 -41 -70 -100 -102 -105 -108 -111 -58 -6 -22 -37 -14 8 -82 -172
$$ packed form
-344aj6J7J6J8J7N2N1o2o2J02J03j02j02P4P4m0l9o5o3LMN9O0n3n2m4m5K4K5P9Q1J3J2p3p3
-353hL8M0k1k2J49j23j26J44Q9Q9r3r2k5k5JJJJr3r4J9J9L9L9J06J07jjj14j13J08J09n0m9
-361D9n5n5Q5Q7K25m7j44j44L7L7p6p7K0K1K0K0llJ48j22llj9k0P8Q0l4l5m7m6O5O6o7o6J
-370b7Jj0j1N7N7k3k3k2k3j3j3N5N5l4l2j19J52J22J22o6o5l0l0l0l0Q4Q4p4p5j4j3j3j4k5
-378d0k6k6k6K9L0l9l8K8K9K9K8O9P0q9q8m1m2P2P1l8l8l3K38o0o0P1P0q6q6q7q7P4P3m0m0
-387a29j5j6R8R6KJo6o7K3K2K3K2P6P7l6l6n1n0n0n1N5N4j4j3k0j9k0j9J5J5n3n3K5K5K4K5
-395a00K4K3K4K3l9l8K9K9n4n4J4J4N9N8r8r9NOJ19J17RQo0n8n3n2J07J05j5j5j6j5k3k3k4
-404f3k3k8k8k7k8P5P4PPm1m0K8K8j7j8N1M9o0o2PPmmmmL9L8k9l0klllN3N2j6j5K3K2r0r0
$$ plain form
-414 -172 -163 -154 -145 -136 -121 -106 -91 -75 0 76 -6 -88 -106 -123 -141 -158 -138 -117 -187 -121 -10 -126 -106 -86 -110 -134 -67 -136 -255 -147 -61 23 -47 -119 -191
-423 -191 -263 -223 -184 -144 -105 -82 -60 -37 -15 -17 -19 -21 -23 -46 -70 -93 -117 -90 -63 -231 -173 -158 -142 -112 -83 -79 -76 -141 -206 -174 -143 -111 -80 -47 -14 -49 -84
-432 -84 -121 -157 -179 -202 -301 -174 63 -106 -160 -79 -99 -119 -128 -136 -145 -154 -191 -228 -61 -121 -218 -178 -116 -54 -101 -148 -195 -242 -266 -289 -254 -218 -151 -220 -272
-440 -272 -97 -138 -180 -208 -235 -196 -157 -118 -78 -97 -116 -134 -153 -171 -190 -209 -227 -183 -140 -96 -52 -109 -166 -155 -144 -120 -96 -72 -48 -98 -147 -197 -247 -189
-448 -189 -131 -141 -151 -165 -179 -125 -71 -61 -51 -108 -166 -75 15 -52 -119 -100 -80 -60 -41 -52 -64 -75 -87 -98 -110 -189 -269 -262 -255 -135 -15 -105 -196 -219 -241
-457 -241 -250 -258 -199 -139 -238 -336 -276 -216 -238 -260 -214 -168 -104 -40 -144 -248 -190 -268 -238 17 30 44 -41 -127 -29 69 -36 -142 -236 -330 -220 -109
-465 -109 -183 -257 -218 -178 -104 -31 -116 -201 -193 -186 -179 -172 -139 -107 -142 -178 -217 -257 -155 -280 -382 -258 -275 -292 -294 -296 -230 -163 -160 -157 -154 -151 -187 -224 -246 -268 -353 -210
-474 -210 -278 -345 -278 -437 -401 -365 -310 -255 -306 -356 -382 -272 -97 -149 -332 -288 -273 -257 -167 -76 -190 -304 -204 -105 -119 -133 -105 -78 -164 -251 -226
$$ packed form
-414a72RRRRJ5J5J5J6P5P6q2q2j8j7j8j7K0K1p0O6J11j16K0K0k4k4O7o9j19J08Q6Q4p0p2p2
-423a91p2M0L9M0L9K3K2K3K2kkkkk3k4k3k4K7K7j68N8J5J6L0K9MLo5o5L2L1L2L1L3L3l5l5
-432h4l7l6k2k3r9J27K37j69n4Q1k0k0rqrrl7l7J67o0r7M0O2O2m7m7m7m7k4k3L5L6O7o9n2
-440b72J75m1m2k8k7L9L9L9M0j9j9j8j9j8j9j9j8M4M3M4M4n7n7J1J1K4K4K4K4n0m9n0n0N8
-448a89N8j0j0j4j4N4N4J0J0n7n8R1R0o7o7J9K0K0J9j1j2j1j2j1j2p9q0PPJ20J20r0r1k3k2
-457b41rqN9O0r9r8O0O0k2k2M6M6O4O4j04j04N8p8L0K55J3J4q5q6R8R8j05j06r4r4J10J11
-465a09p4p4L9M0P4P3q5q5QPPPL3L2l5l6l9m0J02j25j02J24j7j7kkO6O7LLLLl6l7k2k2q5J43
-474b10o8o7O7j59L6L6N5N5n1n0k6J10J75n2j83M4J5J6R0R1j14j14J00R9j4j4K8K7q6q7K5
$$ plain form
-482 -226 -200 -175 -150 -244 -338 -183 -27 -95 -163 -231 -298 -246 -193 -208 -224 -267 -311 -287 -262 -225 -188 -151 -114 -217 -320 -355 -390 -290 -191 -159 -127 -156
-490 -156 -184 -144 -104 -76 -47 -87 -127 -93 -60 -140 -220 -208 -196 -183 -171 -246 -321 -327 -334 -278 -222 -167 -111 -65 -18 -85 -152 -222 -292 -294 -296 -261 -227 -192 -157 -162 -167 -173
-499 -173 -178 -162 -146 -198 -250 -221 -192 -231 -270 -282 -294 -238 -182 -237 -291 -278 -264 -332 -401 -310 -219 -231 -242 -254 -266 -244 -223 -202 -181 -234 -286 -226 -165 -216 -268
-507 -268 -206 -144 -148 -153 -157 -162 -258 -353 -336 -318 -354 -390 -313 -236 -235 -235 -234 -234 -226 -218 -211 -203 -214 -224 -235 -245 -227 -209 -191 -173 -199 -225 -252 -278 -207 -137 -180 -223 -265 -307 -281
-517 -281 -255 -278 -302 -311 -321 -415 -282 -345 -408 -361 -313 -266 -218 -181 -145 -176 -208 -154 -100 -160 -220 -249 -279 -217 -292 -401 -283 -301 -319 -269 -219 -237 -255 -213
-526 -213 -171 -198 -224 -224 -224 -224 -224 -259 -295 -217 -139 -221 -304 -319 -334 -360 -386 -344 -302 -267 -232 -265 -298 -294 -290 -354 -418 -343 -268 -281 -294 -110 -244 -343 -307 -317 -328
-535 -328 -330 -333 -279 -226 -241 -256 -282 -308 -265 -223 -289 -356 -355 -353 -348 -343 -338 -333 -284 -235 -186 -137 -187 -236 -286 -335 -226 -117 -166 -216 -244 -271 -367 -463 -413 -362 -312 -262
-544 -262 -159 -57 -158 -259 -263 -267 -270 -274 -282 -290 -298 -306 -340 -373 -339 -305 -251 -197 -212 -226 -229 -232 -167 -102 -185 -268 -238 -207 -281 -356 -362 -368 -284 -199 -227 -256 -276 -296 -203
$$ packed form
-482b26K6K5K5r4r4J55J56o8o8o8o7N2N3j5j6m3m4K4K5L7L7L7L7j03j03l5l5J00R9L2L2k9
-490a56k8M0M0K8K9m0m0L4L3q0q0J2J2J3J2p5p5opN6N6N5N6M6M7o7o7p0p0kkL5L4L5L5nno
-499a73nJ6J6n2n2K9K9l9l9j2j2N6N6n5n4J3J4o8o9R1R1j2j1j2j2K2K1K1K1n3n2O0O1n1n2
-507b68O2O2mnmnr6r5J7J8l6l6P7P7J%J%QQPQj1j0j1j0J8J8J8J8k6k6k7k6P1P0m3m3m2m2K6
-517b81K6k3k4rj0r4J33o3o3M7M8M7M8L7L6l1l2N4N4o0o0k9l0O2p5j09J18j8j8N0N0j8j8M2
-526b13M2k7k6%%%%l5l6P8P8q2q3j5j5k6k6M2M2L5L5l3l3MMo4o4P5P5j3j3J84j34r9L6j0j1
-535c28klN4N3j5j5k6k6M3M2o6o7JKNNNNM9M9M9M9n0m9n0m9J09J09m9n0k8k7r6r6N0N1N0N0
-544b62J03J02j01j01mmlmqqqql4l3L4L4N4N4j5j4llO5O5q3q3L0L1p4p5ooQ4Q5k8k9k0k0R3
$$ plain form
-554 -203 -110 -178 -246 -246 -246 -316 -385 -296 -207 -239 -272 -305 -337 -292 -247 -315 -383 -392 -401 -341 -282 -275 -268 -261 -254 -357 -459 -403 -347 -367 -388 -408 -429 -399 -369 -407 -446 -375
$$ packed form
-554b03R3o8o8%%p0o9Q9Q9l2l3l3l2M5M5o8o8rrO0N9PPPPj03j02N6N6k0k1k0k1L0L0l8l9P1
$$ [...]
-1606F71
##$OBSERVED INTEGRALS=	(X Y Z)
(7.1539223265049560752, 7.3366163507508534991, 1.0032446795354976743)
(6.7545446921069505208, 7.1411762317901263941, 2.8403000336378076973)
(5.1421637106809550133, 5.5287952503641317747, 5.0048281297603205431)
(3.5255340310166842777, 4.1373465773285218461, 3)
(2.7650170463651608799, 3.0454311300914205241, 3.3885192598407956055)
(2.4569864240901027053, 2.7331518095780840127, 2.1120706937067454945)
(1.968386126688286053, 2.3231524295843883898, 4.1621141097549960719)
(1.6985937885577173656, 1.8940339075184444706, 2.167788604013324516)
(1.1696308578922707255, 1.6242415693878757832, 11.345543778910485599)
(0.77875061997081951315, 1.0591647036970801565, 3.8566042116726646505)
##END=	
##TITLE=	Jan28-2020.60.1.1r
##JCAMP-DX=	6.0	$$ MestReNova 14.1.0-24037
##BLOCK_ID=	3
##DATA TYPE=	NMR PEAK TABLE
##DATA CLASS=	PEAK TABLE
##CROSS REFERENCE=	NMR SPECTRUM: BLOCK_ID=2                                     
##.OBSERVE FREQUENCY=	400.05240029848198446
##.OBSERVE NUCLEUS=	^1H
##NPOINTS=	13
##FIRSTX=	1.0104709105364573229
##LASTX=	7.2178723725370144138
##XFACTOR=	1
##YFACTOR=	1
##FIRSTY=	5202722.7545784814283
##XUNITS=	PPM
##YUNITS=	ARBITRARY UNITS
##PEAK TABLE=	(XYW..XYW)
1.0104709105364573229,5202722.7545784814283,0.0029578022626948812998
1.3982897595281975622,1018050.2415711521171,0.0091208342503189491352
1.799600556410285046,1310852.2311041622888,0.0085620968040085003448
2.0952604346152918779,1988408.7085258625448,0.0098321970007491307775
2.11545028347992492,928639.15308429603465,0.0057713947559714321583
2.6083576526092020487,3160621.9140867539681,0.0039890580256868937714
2.846849504346273374,2410021.2895200750791,0.0099863339548046155952
3.8455908696129434965,13832478.545992411673,0.0031076178370608434007
5.4002712323111490278,1991322.1580507364124,0.0039104033983912061048
6.9880397666554054936,832832.12188073596917,0.0024169452045769549732
7.0397017638123546845,1378333.0101035016123,0.0035322957845050489967
7.2034029436087783083,599626.6128282713471,0.00246502255800793834
7.2178723725370144138,681247.294226935599,0.0038496886654500366357
##$MNOVA/PEAK_DATA_TABLE=	(T,F,A,ST,SP,APT,APC)
$$ Complementary to PEAK TABLE
$$ T: Type
$$ F: Flags
$$ A: Annotation
$$ ST: Shape Type
$$ SP: Shape Parameter
$$ APT: Attached Peaks Type
$$ APC: Attached Peaks Count
Compound,None,,0,0,0,0
Compound,None,,0,0,0,0
Compound,None,,0,0,0,0
Compound,None,,0,0,0,0
Compound,None,,0,0,0,0
Compound,None,,0,0,0,0
Compound,None,,0,0,0,0
Compound,None,,0,0,0,0
Compound,None,,0,0,0,0
Compound,None,,0,0,0,0
Compound,None,,0,0,0,0
Compound,None,,0,0,0,0
Compound,None,,0,0,0,0
##END=	
##END=	
