##TITLE=	(1) Jan28-2020.130.fid
RM-319

(2) MestReNova #1
##JCAMP-DX=	6.0	$$ MestReNova 14.1.0-24037
##DATA TYPE=	LINK
##BLOCK_ID=	1
##BLOCKS=	2    
##ORIGIN=	Mestrelab Research S.L.
##OWNER=	rm319
##$MNOVA/LINK_BLOCK_TYPE=	PAGE
##TITLE=	MestReNova #1
##JCAMP-DX=	6.0	$$ MestReNova 14.1.0-24037
##DATA TYPE=	LINK
##BLOCK_ID=	2
##BLOCKS=	1    
##ORIGIN=	Mestrelab Research S.L.
##OWNER=	rm319
##$MNOVA/LINK_BLOCK_TYPE=	ITEM	$$ Molecule
##$MNOVA/ITEM/POLYGON=	(XY..XY)
5813,6004
6497.11,6004
6497.11,6989.12
5813,6989.12
5813,6004
##$MNOVA/ITEM/Z=	9
##$MNOVA/ITEM/ANGLE=	0
##TITLE=	 
##JCAMP-CS=	3.7	$$ MestReNova 14.1.0-24037
##ORIGIN=	Mestrelab Research S.L.
##OWNER=	rm319
##BLOCK_ID=	3
##NAMES=	 
##ATOMLIST=	
$$ AN	AS	NH
	1	C	 
	2	C	1
	3	C	 
	4	C	1
	5	C	1
	6	C	 
	7	O	 
	8	C	 
	9	C	2
	10	C	1
	11	C	2
	12	C	2
	13	C	2
	14	C	2
	15	C	2
	16	O	 
	17	O	 
	18	C	3
	19	C	2
	20	C	 
	21	C	 
	22	H	 
	23	H	 
	24	H	 
##BONDLIST=	
$$ AN1	AN2	BT
	1	2	D
	2	3	S
	3	4	D
	4	5	S
	5	6	D
	6	1	S
	6	7	S
	7	8	S
	8	9	S
	9	10	S
	10	11	S
	11	12	S
	12	13	S
	13	14	S
	14	15	S
	15	10	S
	8	16	D
	1	17	S
	17	18	S
	3	19	S
	19	20	S
	20	21	D
	20	22	S
	21	23	S
	21	24	S
##MAXRASTER=	32768
##XY_RASTER=	
$$ AN	X	Y	Z
	1	-8961	1724	0
	2	-8961	8623	0
	3	-2986	12072	0
	4	2986	8623	0
	5	2986	1724	0
	6	-2986	-1724	0
	7	-2986	-8623	0
	8	2986	-12072	0
	9	2986	-18970	0
	10	8961	-22420	0
	11	14936	-18970	0
	12	20909	-22420	0
	13	20909	-29318	0
	14	14936	-32768	0
	15	8961	-29318	0
	16	8961	-8623	0
	17	-14936	-1724	0
	18	-20909	1724	0
	19	-2986	18970	0
	20	-8961	22420	0
	21	-8961	29318	0
	22	-14936	18970	0
	23	-2986	32768	0
	24	-14936	32768	0
##END=	
##END=	
##TITLE=	Jan28-2020.130.fid
RM-319
##JCAMP-DX=	6.0	$$ MestReNova 14.1.0-24037
##DATA TYPE=	LINK
##BLOCK_ID=	4
##BLOCKS=	1    
##ORIGIN=	Mestrelab Research S.L.
##OWNER=	rm319
##$MNOVA/LINK_BLOCK_TYPE=	ITEM	$$ NMR Spectrum
##$MNOVA/ITEM/POLYGON=	(XY..XY)
5321,5835
8722,5835
8722,8208
5321,8208
5321,5835
##$MNOVA/ITEM/Z=	0
##$MNOVA/ITEM/ANGLE=	0
##TITLE=	Jan28-2020.130.fid
##JCAMP-DX=	6.0	$$ MestReNova 14.1.0-24037
##BLOCK_ID=	5
##DATA TYPE=	NMR SPECTRUM
##DATA CLASS=	XYDATA
##NUMDIM=	1
##ORIGIN=	Bruker BioSpin GmbH
##OWNER=	nmrsu
##.OBSERVE FREQUENCY=	400.05240029999998796
##.OBSERVE NUCLEUS=	^1H
##.SOLVENT NAME=	CDCl3
##.PULSE SEQUENCE=	zg30
##LONGDATE=	2020/01/28 16:05:00.000
##.ACQUISITIONMODE=	SIMULTANEOUS (DQD)
##$ORIGINAL FORMAT=	Bruker XWIN-NMR
##$MNOVA/SCALES_VERSION=	8
##$PARAMETER FILE=	(acqus, ASCII, //ch-nmrserv2.ch.ic.ac.uk/Av400D/ug1/nmr/Jan28-2020/130/acqus, 0)
$$ ##TITLE= Parameter file, TOPSPIN		Version 3.2
$$ ##JCAMPDX= 5.0
$$ ##DATATYPE= Parameter Values
$$ ##NPOINTS= 11	$$ modification sequence number
$$ ##ORIGIN= Bruker BioSpin GmbH
$$ ##OWNER= nmrsu
$$ $$ 2020-01-28 16:05:09.781 +0000  nmrsu@nmrpc
$$ $$ /opt/topspin/data/ug1/nmr/Jan28-2020/130/acqus
$$ $$ process /opt/topspin3.2/prog/mod/shimcntl
$$ ##$ACQT0= -2.04831932773109
$$ ##$AMP= (0..31)
$$ 100 100 100 100 100 100 100 100 100 100 100 100 100 100 100 100 100 100
$$ [...]
$$ 130000 130000 130000 130000 130000 130000 130000 130000 130000 130000 130000
$$ 130000 130000 130000 130000 130000 130000 130000 130000 130000 130000 130000
$$ 130000 130000 130000 130000 130000 130000 130000 0 0 0 0 0 0 0 0 0 0 0
$$ 0 0 0 0 0 0 0 0 0 0 0 0 0
$$ ##$ShimPowMaxUC= (0..63)
$$ 130000 130000 130000 130000 130000 130000 130000 130000 130000 130000 130000
$$ 130000 130000 130000 130000 130000 130000 130000 130000 130000 130000 130000
$$ 130000 130000 130000 130000 130000 130000 130000 130000 130000 130000 130000
$$ 130000 130000 130000 130000 130000 130000 130000 0 0 0 0 0 0 0 0 0 0 0
$$ 0 0 0 0 0 0 0 0 0 0 0 0 0
$$ ##$ShimPowMaxUG= (0..63)
$$ 524287 524287 524287 524287 524287 524287 524287 524287 524287 524287 524287
$$ 524287 524287 524287 524287 524287 524287 524287 524287 524287 524287 524287
$$ 524287 524287 524287 524287 524287 524287 524287 524287 524287 524287 524287
$$ 524287 524287 524287 524287 524287 524287 0 0 0 0 0 0 0 0 0 0 0 0 0 0 0
$$ 0 0 0 0 0 0 0 0 0 0
$$ ##$ShimPowRcbType= 3
$$ ##$ShimPowRes= (0..63)
$$ 1e-20 1e-20 1e-20 1e-20 1e-20 1e-20 1e-20 1e-20 1e-20 1e-20 1e-20 1e-20
$$ 1e-20 1e-20 1e-20 1e-20 1e-20 1e-20 1e-20 1e-20 1e-20 1e-20 1e-20 1e-20
$$ 1e-20 1e-20 1e-20 1e-20 1e-20 1e-20 1e-20 1e-20 1e-20 1e-20 1e-20 1e-20
$$ 1e-20 1e-20 1e-20 1e-20 0 0 0 0 0 0 0 0 0 0 0 0 0 0 0 0 0 0 0 0 0 0 0 0
$$ ##$ShimPowRng0= (0..63)
$$ 1 1 1 1 1 1 1 1 1 1 1 1 1 1 1 1 1 1 1 1 1 1 1 1 1 1 1 1 1 1 1 1 1 1 1 1
$$ 1 1 1 1 0 0 0 0 0 0 0 0 0 0 0 0 0 0 0 0 0 0 0 0 0 0 0 0
$$ ##$ShimPowRng1= (0..63)
$$ 1 1 1 1 1 1 1 1 1 1 1 1 1 1 1 1 1 1 1 1 1 1 1 1 1 1 1 1 1 1 1 1 1 1 1 1
$$ 1 1 1 1 0 0 0 0 0 0 0 0 0 0 0 0 0 0 0 0 0 0 0 0 0 0 0 0
$$ ##$ShimPowRng2= (0..63)
$$ 1 1 1 1 1 1 1 1 1 1 1 1 1 1 1 1 1 1 1 1 1 1 1 1 1 1 1 1 1 1 1 1 1 1 1 1
$$ 1 1 1 1 0 0 0 0 0 0 0 0 0 0 0 0 0 0 0 0 0 0 0 0 0 0 0 0
$$ ##$ShimPowRng3= (0..63)
$$ 1 1 1 1 1 1 1 1 1 1 1 1 1 1 1 1 1 1 1 1 1 1 1 1 1 1 1 1 1 1 1 1 1 1 1 1
$$ 1 1 1 1 0 0 0 0 0 0 0 0 0 0 0 0 0 0 0 0 0 0 0 0 0 0 0 0
$$ ##$ShimSysFunc= (0..63)
$$ 1 2 3 4 5 6 7 8 9 10 0 37 38 35 16 15 14 13 12 11 28 27 26 25 24 23 36
$$ 22 30 29 20 21 34 33 32 31 17 18 19 0 0 0 0 0 0 0 0 0 0 0 0 0 0 0 0 0 0
$$ 0 0 0 0 0 0 0
$$ ##$ShimSysMatrix= 0
$$ ##$ShimSysType= 4
$$ ##$TFXNUM= 0
$$ ##$TRIPLO2= 0
$$ ##$VTU= 2
$$ ##$VTUETH= <149.236.99.20>
$$ ##$VTUTY= <no>
$$ ##$WBREFAM= (0..15)
$$ 136.7 118.7 100 100 100 100 100 100 100 100 100 100 100 100 100 100
$$ ##$WBREFLM= (0..15)
$$ 0 0 0 0 0 0 0 0 0 0 0 0 0 0 0 0
$$ ##$WBREFPH= (0..15)
$$ 77.55 -71.28 0 0 0 0 0 0 0 0 0 0 0 0 0 0
$$ ##$WBSGU= (0..15)
$$ 0 0 0 0 0 0 0 0 0 0 0 0 0 0 0 0
$$ ##$XFAC= 2
$$ ##END=
$$ 
##$DECIM=	2496
##$DSPFVS=	20
##XUNITS=	HZ
##YUNITS=	ARBITRARY UNITS
##FIRSTX=	6406.710256386850233
##LASTX=	-1606.1102564336499654
##DELTAX=	-0.12226780365942625795
##XFACTOR=	1
##YFACTOR=	0.0026121915975463238721
##FIRSTY=	8.6730451583862304688
##MINY=	-8.4885711669921875
##MAXY=	16606.08203125
##NPOINTS=	65536
##XYDATA=	(X++(Y..Y))
$$ [...]
2726A44499J8270K3237K9595L6861M3509M8956N3276N5476N4070M8561M0068K9453J6885M105
2724F46821n649j0775j1308o987K960J6815L0644M1872N0656N5835N4331M4424K7974P265
2723I44878j6174m0017n9962p3561q1665q4995q2424p4393o4251n4209m3485l1954k2491j6123
2721A99174j0639m385J098N953J3184K3132L1818L8481M6973N5253N3361M0022L1044L7711
2719E62180M4456K5189j8726n4138n6128l6157k3005k7088l4804l1329j7402l875J511Q99
2718C31583K499R621J3455K736j9537l5684l4179k3677j9746k5072k9779k7429k1363j6097
2716A07331j1973q188n713m822l899k454j726j834j593p85n43o37k97K51K51q9K51P61P60
2713F5052R31J658K344K344L069N058P460J0227J4745K0811K6037L0259L5566L9884L6928
$$ plain form
2726 144499 162769 186006 215601 252462 295971 344927 398203 453679 507749 556310 596378 625831 642716 646821
2724 646821 641172 630397 619089 612102 615062 631877 662521 704393 755049 810884 865215 909639 937613 944878
2723 944878 928704 888687 828725 755164 673499 588504 506080 431687 367436 313227 269742 237788 215297 199174
2721 199174 188535 184150 185248 191201 204385 227517 259335 297816 344789 400042 453403 493425 524469 562180
2719 562180 606636 631825 613099 558961 502833 466676 443671 416583 381779 350450 333048 329173 330684 331583
2718 331583 334082 343703 357158 359894 340357 304673 270494 246817 227071 201999 172220 144791 123428 107331
2716 107331 95358 87170 81457 76635 72736 70282 68556 66722 65129 64344 63801 63164 62867 63118 63369 63280 63531 64292 65052
2713 65052 65983 67641 69985 72329 75398 80456 87916 98143 112888 133699 159736 189995 225561 265445 302373
2712C02373K7660K3552L0104L3487J6260j6179l8065l4562j8111r953j4369j9145j4244k173
2710B66635P290Q733N967P630J4762J6423J817k2513l6926l2324k1018j9271k6696l1145k7215
2708A12149k0118j5120j1398p662n230m598l926k519j828k264k212j291q90j327j303n76l51
2706B9536r82j164n33j99n39n95j58l0k73r4N37O58K7k87m4l05j033j445j202j094j336j223
2703A8222o89n67q11p34k01p3n10n60j24Q3k57l84m4K8l12l69l0j1k54l48rN9j85k71k9J05
2700A1725k34l32QO8j74k38MP8j66k83m1L7k04l20K1J35j07k40KO9p7j88N5K24P9P6L19L91
2697A0687J49j4J32J07j35k89j42q9l31m40j98m0j86k14o9N2r3j46%P3p3j40OJ27j9j35RQ3
2693H672o3j54qJ19k6p6J68K88J43P8L20O36O36O79O79P29O56O04P49O36K96o6o5o1j34j7
$$ plain form
2712 302373 330033 353585 383689 417176 433436 417257 379192 344630 326519 316566 302197 283052 268808 266635
2710 266635 273925 282658 288625 296255 311017 327440 329257 306744 269818 237494 216476 197205 170509 139364 112149
2708 112149 92031 76911 65513 57851 52621 48023 44097 41578 39750 37486 35274 33983 33093 31766 30463 29887 29536
2706 29536 28554 27390 26857 26658 26119 25524 25366 25336 25063 24969 25506 26164 26191 25904 25860 25555 24522 23077 21875 20781 19445 18222
2703 18222 17533 16966 16155 15421 15220 15147 14637 14077 13953 14036 13779 13395 13351 13379 13067 12698 12668 12657 12403 12055 12046 12105 11920 11649 11620 11725
2700 11725 11491 11159 11167 11235 11061 10823 10827 10905 10739 10456 10415 10452 10248 9928 9949 10084 9977 9737 9739 9808 9731 9543 9598 9822 9901 9977 10296 10687
2697 10687 10836 10822 10954 11061 10926 10637 10495 10406 10075 9635 9437 9397 9211 8997 8928 8980 8887 8741 8741 8814 8741 8601 8607 8734 8715 8580 8589 8672
2693 8672 8609 8455 8447 8566 8540 8464 8632 8920 9063 9141 9461 10097 10733 11412 12091 12820 13476 14080 14829 15465 15761 15695 15630 15569 15435 15418
2690A5418L24O19P64R33J176J316J244J260J406J198M71k41n81q71j309j498j158q14p42n09
2688A8406K18J014J548J866K206K425K084J577J043M79m43j248j685j669j596j332p01l9M95
2685B4648Q60J295J454J211O88J55m03j229j913k254k256k257k114j678j050n16j02M32P88
2683A5759Q60P54R00J058Q17L49J0l25p62j138j212j052r79r79r06o93n73m17j99l6l5j94
2680A1007j93k11l81o46p19n79n79n64n64m23m22l63k42j24j23j93j20k8k8j18j17k8k8j51
2677D063p8J4J5o1o1K1n2j23n1N9j4j10l7P3jj33n9M5k8j75j75N2N1m1m1nnr3r3M0M0o7o7
2673B903O6O6r6r6O2O2n9o0K6K5l2l2P7P6j1j1K6K5j18j17rqq6q6O8O7m7j20j8j9p1p2L8L8
2669B457k3k4Q2Q1k6j00LKn4n4N4N5o0n9MP6J5n9j3j3rqrql1l1OOn6n6L0K9n5n5N4N4l1l1
$$ plain form
2690 15418 15742 16361 17125 18058 19234 20550 21794 23054 24460 25658 26129 25888 25307 24436 23127 21629 20471 19657 18915 18406
2688 18406 18624 19638 21186 23052 25258 27683 29767 31344 32387 32866 32423 31175 29490 27821 26225 24893 24192 24153 24648
2685 24648 25508 26803 28257 29468 30156 30311 29908 28679 26766 24512 22256 19999 17885 16207 15157 14641 14539 14971 15759
2683 15759 16619 17373 18273 19331 20148 20497 20507 20182 19420 18282 17070 16018 15039 14060 13154 12461 11888 11471 11272 11236 11201 11007
2680 11007 10814 10603 10222 9576 8857 8278 7699 7135 6571 6148 5726 5363 5121 4997 4874 4681 4561 4533 4505 4387 4270 4242 4214 4063
2677 4063 3985 3999 4014 3953 3892 3913 3861 3738 3687 3746 3732 3622 3585 3658 3657 3524 3465 3510 3482 3307 3132 3184 3235 3194 3153 3148 3143 3050 2957 2997 3037 2970 2903
2673 2903 2969 3035 2939 2843 2905 2967 2908 2848 2874 2899 2867 2835 2912 2988 2977 2966 2992 3017 2899 2782 2773 2765 2679 2593 2661 2728 2681 2561 2543 2524 2453 2381 2419 2457
2669 2457 2434 2410 2492 2573 2547 2447 2450 2452 2398 2344 2398 2453 2393 2334 2338 2414 2429 2370 2357 2344 2335 2327 2318 2310 2279 2248 2254 2260 2204 2148 2178 2207 2152 2097 2151 2205 2174 2143
2665B143N3N3k9k9l0k9j17j18M8J21PPJ2J1j12j12JP3k8j00j9j8m8m7L8L7k9k8L2L2k6k6L1
2661A754L0k4r7j7N7Qo4mO9Lp0k4k5l2l2P3P2J2o2o2J1ppklj7j7J9J9m9m9L5L6K8K7K8K7p9
2656A565q0ONm6m7j0j0l9l8O5O6K1n3K9J00mp7l2l2m8m8J6Q8J1o3J5J5j0q3k7M7L3m0OOj8
2651A289j9O2O2Qo5nO8jkMLo1o2O1O0K1K1K1K1n3n4O8O9KLK7J00Qj12p0R9R3k9NP7M9k5jJ68
2647A910K28K27K38L59M26L53L22L21L56K35J18M5r8k19k69j96j12j13j0J10J05L1QJ28J77
2644D680J03kj24k27k99l39l40l95l96k26k26j99j99j50k9l2j04j01k9k1r4q9j6rj0nnL8L8
2640A193O2J34Q8l4l0R2J07J07J87J88J66J65J18J90J42K0p7p7q5q5q5q5l3l4L9M0O4O4J6
2637B557Q8R1k9j35k07j97j98j29j29j70j70r8r7r4r3r4r4KKooPj14j19KL4l9l5L7Q6J4n4
$$ plain form
2665 2143 2196 2249 2220 2191 2161 2132 2015 1897 1945 2066 2073 2080 2092 2103 1991 1879 1880 1953 1925 1825 1806 1788 1740 1693 1731 1768 1739 1711 1743 1775 1749 1723 1754
2661 1754 1784 1760 1663 1646 1703 1711 1647 1643 1712 1715 1645 1621 1596 1564 1532 1605 1677 1689 1627 1565 1576 1569 1562 1560 1557 1540 1523 1542 1561 1512 1463 1498 1534 1562 1589 1617 1644 1565
2656 1565 1485 1491 1496 1450 1403 1393 1383 1344 1306 1371 1437 1458 1405 1434 1534 1530 1453 1421 1389 1341 1293 1309 1397 1408 1345 1360 1375 1365 1282 1255 1302 1335 1295 1301 1307 1289
2651 1289 1270 1332 1394 1402 1337 1332 1400 1399 1397 1401 1404 1343 1281 1342 1402 1423 1444 1465 1486 1433 1379 1447 1516 1518 1521 1548 1648 1656 1544 1474 1573 1666 1637 1642 1719 1768 1743 1742 1910
2647 1910 2138 2365 2603 2962 3388 3741 4063 4384 4740 4975 5093 5138 5040 4821 4552 4356 4244 4131 4121 4231 4336 4367 4375 4503 4680
2644 4680 4783 4781 4657 4430 4131 3792 3452 3057 2661 2435 2209 2010 1811 1661 1632 1600 1496 1395 1366 1345 1251 1162 1146 1137 1127 1122 1117 1155 1193
2640 1193 1255 1389 1477 1443 1413 1505 1612 1719 1906 2094 2260 2425 2543 2733 2875 2895 2818 2741 2656 2571 2486 2401 2368 2334 2373 2413 2477 2541 2557
2637 2557 2645 2736 2707 2572 2365 2168 1970 1841 1712 1542 1372 1274 1177 1083 990 896 802 804 806 800 794 801 687 568 570 604 565 530 567 653 667 613
2633F13J9N5N4j3j3K5K5K5K5R4R5J68J67J80J79J72J72J85O4MLl3j55j60l8M2l0j23kJ06J07
2629B012M1M2P9P9m2m1j37j37j37j37r8r9k69k69j45j44p3p2l2l3l3l3L1L0L0L0o0o1o1o1
2625B00K1K1K1K1nmnnQ4Q4l8l7l6l6l6l6j6j6j7j6l4l5L9L8M6M7p5p5L8L9l4l4j9j9j9j9n
2621B8onnK4K4K3K4O2O2o0n9j%%jK3K2J8J8Ro3o8NKp2j39o7P1P1L9L8O8O9n3n3j2j2j2j2K1
2616B1K1n1n1J0J1J1J0j2j2j2j2j7j6o2J1N6j7m9K4Q2Q0q2q4k5k5k5k6O4O3rrj5j4K1K2P3
2611d5P1m8m9k1k0k1k1M3M2M3M2l5l6l6l6K8K7K8K7j5j5n6J7N4N3j4j3O6O8r8r6m2L1rj0J4
2607h2J5J4J5j5j5j4j5N4N2o7o7j9j9j8j9qqqqj5j6j5j6LLKLNMNMM6M5k7k7L1L2L1L2OPj15
2602b04j15o1o1k4k5N5N4J8J8M0M0l3l3j2j2j3j2K6K7K7K6M0M1q1q2j8j8j8j8M5M6k7k8j4
$$ plain form
2633 613 632 687 741 728 715 740 765 790 815 909 1004 1172 1339 1519 1698 1870 2042 2227 2291 2295 2298 2265 2110 1950 1912 1954 1924 1801 1799 1905 2012
2629 2012 2053 2095 2174 2253 2211 2170 2033 1896 1759 1622 1524 1425 1156 887 742 598 525 453 421 388 355 322 353 383 413 443 383 322 261 200
2625 200 221 242 263 284 279 275 270 265 349 433 395 358 322 286 250 214 198 182 165 149 115 80 119 157 203 250 175 100 138 177 143 109 90 71 52 33 28
2621 28 22 17 12 36 60 83 107 169 231 171 112 111 111 111 110 133 155 173 191 200 137 69 74 76 4 -135 -202 -131 -60 -21 17 85 154 101 48 36 24 12 0 21
2616 21 42 -9 -60 -50 -39 -28 -18 -30 -42 -54 -66 -83 -99 -161 -150 -94 -111 -160 -136 -54 26 -56 -140 -165 -190 -215 -241 -177 -114 -123 -132 -147 -161 -140 -118 -45
2611 -45 26 -22 -71 -92 -112 -133 -154 -111 -69 -26 16 -19 -55 -91 -127 -99 -72 -44 -17 -32 -47 -103 -86 -32 21 7 -6 60 128 30 -66 -108 -77 -86 -96 -82
2607 -82 -67 -53 -38 -53 -68 -82 -97 -43 9 -58 -125 -144 -163 -181 -200 -208 -216 -224 -232 -247 -263 -278 -294 -291 -288 -286 -283 -278 -274 -269 -265 -219 -174 -201 -228 -197 -165 -134 -102 -96 -89 -204
2602 -204 -319 -380 -441 -465 -490 -435 -381 -363 -345 -305 -265 -298 -331 -343 -355 -368 -380 -354 -327 -300 -274 -234 -193 -274 -356 -374 -392 -410 -428 -383 -337 -364 -392 -406
2598d06j5j4j5M0M0l3l3RJ0RRK1K0j5j6K8K8m5m5oom2m2L8L9KLkjl8l8KKLKL6L7Ro4n3J9k1
2593e44k2k5M9PPO6O7L9l4k6M8M3l0p5p5l8l8N4J27N4j9m8m8j6j6L0L0m2m3QQQRk3k2r0r1
2588g11qO5K9K8J3Q6Q6J4kkpok0k0q9q8qO4O5rn3n3J5J6J6J7j9k0J5J4j7j7K1R3N8j6m9n0
2583e49J9J8ppm3m3m1m2mnK3K2j4j4J4J4N1N0M5M5J7n5n3K0J0J1J4J5J9n4o6o6KLM3M3k5k5
2579f15l9L5ppmm%JlP0P0kk8k7J3n9o9Nl7l6kP2L0L1J2J2N4k0j6j6k0k1llL4L3M4M3J1o1k8
2574e57k7LMJ5J4J5J4l8l8l8l8MLLLnokjj3N9O0j3j0j1j4j5j7j7j6j7llllRRn9n9J0Q3J7n5
2568g53n9O2R5k7n6n5J0J0k3k4M9M9L7L6M5k7q8j4O1O1j9j8j9j8k2k1N1N1J0J1J0J0L3L2L3
2564d87L3j8j7j8j7n3n4K0J9p1p2KJononj5j5j4j5m2m1L1L2M0M1M0M1J7J8n5n5m5m4K8K9K8
$$ plain form
2598 -406 -421 -435 -450 -410 -370 -403 -436 -427 -417 -408 -399 -378 -358 -373 -389 -361 -333 -378 -423 -429 -435 -477 -519 -481 -442 -440 -437 -439 -440 -478 -516 -514 -512 -509 -507 -471 -434 -425 -489 -542 -523 -544
2593 -544 -566 -591 -542 -535 -528 -462 -395 -356 -390 -416 -368 -325 -355 -430 -505 -543 -581 -527 -400 -346 -365 -413 -461 -477 -493 -463 -433 -475 -518 -510 -502 -494 -485 -508 -530 -620 -711
2588 -711 -719 -654 -625 -597 -584 -498 -412 -398 -400 -402 -409 -415 -435 -455 -544 -632 -640 -576 -511 -520 -573 -626 -611 -595 -579 -562 -581 -601 -586 -572 -589 -606 -585 -492 -434 -450 -499 -549
2583 -549 -530 -512 -519 -526 -569 -612 -653 -695 -699 -704 -681 -659 -673 -687 -673 -659 -608 -558 -513 -468 -451 -506 -559 -539 -529 -518 -504 -489 -470 -524 -590 -656 -654 -651 -608 -565 -590 -615
2579 -615 -654 -619 -626 -633 -637 -641 -641 -640 -643 -573 -503 -505 -533 -560 -547 -606 -675 -670 -707 -743 -745 -673 -643 -612 -600 -588 -534 -554 -570 -586 -606 -627 -630 -633 -599 -566 -522 -479 -468 -529 -557
2574 -557 -584 -581 -577 -562 -548 -533 -519 -557 -595 -633 -671 -667 -664 -661 -658 -663 -669 -671 -672 -685 -626 -566 -579 -589 -600 -614 -629 -646 -663 -679 -696 -699 -702 -705 -708 -699 -690 -749 -808 -798 -715 -698 -753
2568 -753 -812 -750 -655 -682 -738 -793 -783 -773 -796 -820 -771 -722 -685 -649 -604 -631 -719 -733 -672 -611 -630 -648 -667 -685 -707 -728 -677 -626 -616 -605 -595 -585 -552 -520 -487
2564 -487 -454 -472 -489 -507 -524 -577 -631 -611 -592 -663 -735 -733 -732 -738 -743 -749 -754 -769 -784 -798 -813 -855 -896 -865 -833 -793 -752 -712 -671 -654 -636 -691 -746 -791 -835 -807 -778 -750
2560g50K7m1j15l6J33J47P4l4l3kkj4j3rqm1L2O5O4o0n9k4k3k2k3k2k2p4p3R7R6noonk1k1
2555h29k1k1NOP8P8l0k9l0k9J1J2J1J2o6o6N6N6K8K9K9K9K2K3n0n0j2j3j2j2mlP0O9K3K3K4
2551e83K3o4o3RJ0k8k7M5M5K7K6m5m6q6q5L6L6N8N9j4j4k8k7k8k7j4j4j3j4J0J0J0J0l1l1
2546h68M2M2POPOl9l8Q2Q2j5j5j6j5o7o7OOK0K1K1K0j7j7j7j8MLMMl8l7L5L6KLLKJ2J2J1J2
2541g73j9j9QQ1L3m0j9J7j0q2q0pN9O0rrm2m2L0L1LMLLJ1J1J0J1J0J1OOl0j03j01k8K6O3J9
2536h97n4m6K8N4N4j7j6j7j7JJJ%l7l7Q5Q4J1J0J1J1m1m1L2L2j7j7j7j7l5l5L7L8J1J1J1J1
2532h24KKKKn3n2K0K0j%k5J1L4l8m0L3O9ml1l1K6K6K6K6q5q4rO4M2l2qK7N4J7l3l3%jj%L4
2527h48L4l9l8n4n4O8O8nnonQPPPQPPPJ3J2J3J2NMj17j18J8J7N4N3p0o9KLK5K4K4K4k4k4%
$$ plain form
2560 -750 -723 -764 -879 -915 -782 -635 -561 -595 -628 -630 -632 -646 -659 -668 -676 -717 -685 -620 -556 -616 -675 -699 -722 -744 -767 -789 -811 -885 -958 -861 -765 -770 -776 -782 -787 -808 -829
2555 -829 -850 -871 -866 -860 -782 -704 -734 -763 -793 -822 -811 -799 -788 -776 -842 -908 -852 -796 -768 -739 -710 -681 -659 -636 -686 -736 -748 -761 -773 -785 -789 -792 -722 -653 -630 -607 -583
2551 -583 -560 -624 -687 -678 -668 -696 -723 -678 -633 -606 -580 -625 -671 -757 -842 -806 -770 -712 -653 -667 -681 -709 -736 -764 -791 -805 -819 -832 -846 -836 -826 -816 -806 -837 -868
2546 -868 -826 -784 -777 -771 -764 -758 -797 -835 -753 -671 -686 -701 -717 -732 -799 -866 -860 -854 -834 -813 -792 -772 -789 -806 -823 -841 -837 -834 -830 -826 -864 -901 -866 -830 -828 -825 -822 -820 -808 -796 -785 -773
2541 -773 -792 -811 -803 -722 -689 -729 -748 -731 -741 -823 -903 -910 -851 -791 -800 -809 -851 -893 -863 -832 -829 -825 -822 -819 -808 -797 -787 -776 -766 -755 -749 -743 -773 -876 -977 -1005 -979 -916 -897
2536 -897 -951 -997 -969 -915 -861 -878 -894 -911 -928 -927 -926 -925 -925 -962 -999 -914 -830 -819 -809 -798 -787 -828 -869 -837 -805 -822 -839 -856 -873 -908 -943 -906 -868 -857 -846 -835 -824
2532 -824 -822 -820 -818 -816 -869 -921 -901 -881 -882 -882 -907 -896 -862 -900 -940 -907 -838 -842 -873 -904 -878 -852 -826 -800 -885 -969 -978 -914 -872 -904 -912 -885 -831 -814 -847 -880 -880 -881 -882 -882 -848
2527 -848 -814 -853 -891 -945 -999 -931 -863 -868 -873 -879 -884 -876 -869 -862 -855 -847 -840 -833 -826 -813 -801 -788 -776 -771 -767 -884 -1002 -984 -967 -913 -860 -930 -999 -997 -994 -969 -945 -921 -897 -921 -945 -945
2522i45P3Q2l8j28n6N2N2J9K0N9N8j4j4N0M9k3k3k7k6J0Rn8n8J4J5K0K0j6j7NMMML0K9m3m4
2517h52k5k5J1J1L4L3ll%jL6L6mllln4n3n3n3mmL3L3llP0P0L9L9l4l4NMl3l2J2J2M8M8J1J1
2512f86k6k5m7m6O7O7N4o8j13m1J8J8j4j4J1J1J1J1K1K1K2K1m3m2L0L1K9K9m4m4O5O5K8K8
2508e95l1l1l1l1J0Rk6k7l8l8L5L5L2L2L1L2K5K5j2j2LLp0p0K4K5m8m8JKKKj9j9N4N3J6J6
2503f79n7n7l7l7L6L6O5O5K9K9qqrqK0K0K0J9k1k2k1k2j9j9J7J7O9O9n3n2%jL7L6k5k4J1J2
2499e72K4K4K4K4k0k0k0k0l6l5%JN5N5j8j8j7j6n3n3k6k7M6M6L1L0m3m2M9M9k4k4k8k9M5M4
2494e94P5P5P4P5m8m8k1N3Qo4o5RQ7J5j3j3O1O0n3J9J43J44O6oo9p1j07j07%P2%p3q5q5L2
2490d54L1KLl5l4rj0N9N9Q4J1k0k1n5n4k8M6J11L7l8l7lkklN9N8n9n8KP5L3L4M1M1M6M6L3
$$ plain form
2522 -945 -872 -790 -828 -956 -1012 -960 -908 -889 -869 -810 -752 -766 -780 -730 -681 -704 -727 -754 -780 -770 -761 -819 -877 -863 -848 -828 -808 -824 -841 -836 -832 -828 -824 -794 -765 -808 -852
2517 -852 -877 -902 -891 -880 -846 -813 -816 -819 -819 -820 -784 -748 -752 -755 -758 -761 -815 -868 -921 -974 -978 -982 -949 -916 -919 -922 -852 -782 -743 -704 -738 -772 -767 -763 -796 -828 -816 -804 -756 -708 -697 -686
2512 -686 -712 -737 -784 -830 -763 -696 -642 -710 -823 -864 -846 -828 -842 -856 -845 -834 -823 -812 -791 -770 -748 -727 -770 -812 -782 -751 -722 -693 -737 -781 -716 -651 -623 -595
2508 -595 -626 -657 -688 -719 -709 -700 -726 -753 -791 -829 -794 -759 -727 -695 -664 -632 -607 -582 -594 -606 -603 -600 -670 -740 -716 -691 -739 -787 -786 -784 -782 -780 -799 -818 -764 -711 -695 -679
2503 -679 -736 -793 -830 -867 -831 -795 -730 -665 -636 -607 -615 -623 -632 -640 -620 -600 -580 -561 -582 -604 -625 -647 -666 -685 -668 -651 -582 -513 -566 -618 -618 -619 -582 -546 -571 -595 -584 -572
2499 -572 -548 -524 -500 -476 -496 -516 -536 -556 -592 -627 -627 -626 -571 -516 -534 -552 -569 -585 -638 -691 -717 -744 -698 -652 -621 -591 -634 -676 -627 -578 -602 -626 -654 -683 -638 -594
2494 -594 -519 -444 -370 -295 -343 -391 -412 -359 -351 -415 -480 -471 -384 -369 -382 -395 -334 -274 -327 -308 -165 -21 45 39 -30 -101 -208 -315 -315 -243 -243 -316 -401 -486 -454
2490 -454 -423 -421 -418 -453 -487 -496 -506 -447 -388 -304 -293 -313 -334 -389 -443 -471 -425 -314 -277 -315 -352 -355 -357 -359 -362 -303 -245 -304 -362 -360 -285 -252 -218 -177 -136 -90 -44 -11
2485a1J05J89K62K85K13L8j31k17k17j92j91j13j12m0m0j1j1p9p9NP7L6L7JJJJO1O0R2R3J25
2481B38N3p6p7k4k4J3J2k7k8o3o4l0l1r9r8j1O2K1K1R5R5O3rN4N4J64J63J03j9j20j20n7n6
2477A78n7n7l7l6l7l7JKJKOOOOL4L4J07J07L23L23L11L12K28N7j75l93l90k19j11j10r1r2
2473B02n5n5m0m0llkkjjJ8J9J9J9m9m9m9m9L9L9M0L8M9M8J2J2p8p8M3M3M5M5M5M4J7J7j3j2
2469B74K9J50K51K52K92K92L50K77K5k92m70l97k36j63j20m6j6j5q4q4k7k6k7k6M9M8M9M8
2465C57J8J8J9J8J12J12J11J12j4j5j85j84p9p8m2m2j4j4j4j4QPQ0Q0N8N7j5j5M3M3k6k5O4
2461E41J37J33O0No7j04j04m2m2m1m2N1N1J8n3lkkk%P3L9M0L5J56K14K14J56K29K49J28j34
2457A891k54k63k62j78j06p3p4j6j6j6j7J2J1n7n7pO6O5pj8j9j8j8j4N8J32N9m6m6n1n1j6
$$ plain form
2485 -11 94 283 545 830 1043 1081 950 733 516 324 133 20 -92 -132 -172 -183 -194 -273 -352 -347 -270 -234 -197 -196 -195 -194 -193 -132 -72 20 113 238
2481 238 291 215 138 114 90 103 115 88 60 -3 -67 -97 -128 -227 -325 -336 -274 -253 -232 -137 -42 21 12 66 120 284 447 550 531 411 291 234 178
2477 178 121 64 27 -9 -46 -83 -82 -80 -79 -77 -71 -65 -59 -53 -19 15 122 229 552 875 1186 1498 1726 1783 1608 1215 825 606 495 385 294 202
2473 202 147 92 52 12 9 6 4 2 1 0 18 37 56 75 26 -23 -72 -121 -82 -43 -3 35 84 132 144 156 78 0 43 86 131 176 221 265 282 299 286 274
2469 274 303 453 704 956 1248 1540 1890 2167 2192 1900 1430 1033 797 634 514 468 452 437 353 269 242 216 189 163 212 260 309 357
2465 357 375 393 412 430 542 654 765 877 863 848 663 479 400 322 280 238 224 210 196 182 190 197 277 357 415 472 457 442 485 528 502 477 541
2461 541 678 811 871 876 809 705 601 559 517 476 434 485 536 554 501 498 496 494 492 492 565 604 644 679 835 1049 1263 1419 1648 1897 2025 1891
2457 1891 1637 1374 1112 934 828 755 681 665 649 633 616 628 639 582 525 518 584 649 642 624 605 587 569 555 613 745 804 758 712 661 610 594
2453E94j5j6j6K7K7K8K7K7K7L2L2J7R1R0J7O3O3N8N9M8M9Q5J2p7j50j13j14q0p9ppj8j8j7
2449G46j8N2N2N2N2J0RJ0Rk4k4k3k4J8J9J9J8K6K7K6K6J2J3J2J3m9m8K5K4K7K6R9R8j0j1O2
2445A351O2%%p3p2M6M6M6M6M8M8p4p3j7j8N6N6j1j2j1j1opopK4K4K3K4J3J3J4J3O0O0N5N6
2440A786l6j08o3N9J04J04j0rrrrrJKJKM8M9M9M8n9n9J4J3J0J0J0J0J6J6Q9Q8%jj%jjj%N0
2435B194N1k2k2J9J9J9J9M2M3M3M3M2M3M3M3J4J4J4J4M4M4M4M5KKKLrqO0N9qq2q1rN3N4N8
2431B948N8M5M5M4M5P2P2j%J3J3Q7Q6P7P7MNN1N2j7j6j9N4M9N0l7l7L6L5M0M0L9M0K8K8K8
2426D134K9N4N4N4N4O0O0j2j3L9L8P5P5P2P3P2P3J10J10j1j1P6P6M4M3M6J19J19M6noO3O3
2422E873J29J30N6N7M2M3M2M2R3R2R3R2Q6Q5R0R0P5J48J48P5R4R4R4R3J18J90J49J49J72J71
$$ plain form
2453 594 579 563 547 574 601 629 656 683 710 742 774 791 882 972 989 1052 1115 1173 1232 1280 1329 1414 1426 1349 1199 1086 972 892 813 806 799 781 763 746
2449 746 728 780 832 884 936 946 955 965 974 950 926 903 879 897 916 935 953 979 1006 1032 1058 1070 1083 1095 1108 1059 1011 1036 1060 1087 1113 1212 1310 1300 1289 1351
2445 1351 1413 1413 1413 1340 1268 1314 1360 1406 1452 1500 1548 1474 1401 1384 1366 1422 1478 1467 1455 1444 1433 1427 1420 1414 1407 1431 1455 1478 1502 1515 1528 1542 1555 1615 1675 1730 1786
2440 1786 1750 1642 1579 1638 1742 1846 1836 1827 1818 1809 1800 1791 1792 1794 1795 1797 1845 1894 1943 1991 1932 1873 1887 1900 1910 1920 1930 1940 1956 1972 2061 2149 2149 2148 2147 2147 2146 2145 2144 2144 2194
2435 2194 2245 2223 2201 2220 2239 2258 2277 2319 2362 2405 2448 2490 2533 2576 2619 2633 2647 2661 2675 2719 2763 2807 2852 2854 2856 2858 2861 2852 2844 2904 2963 2955 2873 2792 2783 2836 2890 2948
2431 2948 3006 3051 3096 3140 3185 3257 3329 3328 3328 3341 3354 3441 3527 3604 3681 3685 3690 3741 3793 3776 3760 3741 3795 3844 3894 3857 3820 3856 3891 3931 3971 4010 4050 4078 4106 4134
2426 4134 4163 4217 4271 4325 4379 4439 4499 4487 4474 4513 4551 4626 4701 4773 4846 4918 4991 5101 5211 5200 5189 5265 5341 5385 5428 5474 5593 5712 5758 5753 5747 5810 5873
2422 5873 6002 6132 6188 6245 6287 6330 6372 6414 6507 6599 6692 6784 6870 6955 7045 7135 7210 7358 7506 7581 7675 7769 7863 7956 8074 8264 8413 8562 8734 8905
2419H905J42J43K35L57K95J74K68M38M59L86M31O00N61M88O77R92J030J031J463K265K807
2416B4147L463N472R014J2279J4269J6088J7690J5312N267r551k0372k1464j5786j0248p677
2414C7903n978l794k158j916j788q67j11k57l47J86M89l35j255j109l87l87o36l93K17K18
2412A7295j80O2O33M87j3K29R08R09L25N69J363J363N59Q02K032K372J802K433M541N851O433
2409E0775J0267J8636K6644L0568L3916L8623L5566J3427k2144m8326m9734l4333k0406j4959
2407F8520j1998p291l650l193l119j174P19O33L89J445K271J173N7J550N189Q780J1448J4227
2405H5976J7090J7905J3391K155j2161k1899k1899j5194r225p237o218l532j250j236j672
2403C4994l56J246J014L83J494K997K725K288N018R918J3156J4368J6297J8093J4289K498
$$ plain form
2419 8905 9047 9190 9425 9782 10077 10251 10519 10957 11416 11802 12233 12833 13394 13882 14559 15551 16581 17612 19075 21340 24147
2416 24147 27610 33082 42096 54375 68644 84732 102422 117734 123001 113450 93078 71614 55828 45580 37903
2414 37903 31925 28131 25973 24057 22269 21402 21291 21034 20687 20873 21362 21027 19772 18663 18276 17889 17253 16860 17077 17295
2412 17295 17115 17177 17810 18297 18284 18513 19421 20330 20655 21224 22587 23950 24509 25311 27343 29715 31517 33950 38491 44342 50775
2409 50775 61042 79678 106322 136890 170806 209429 244995 258422 236278 187952 138218 103885 83479 68520
2407 68520 56522 49231 45581 42388 39269 38095 38814 39447 39836 41281 43552 44725 44782 46332 51521 60301 71749 85976
2405 85976 103066 120971 134362 136517 124356 102457 80558 65364 56139 48902 42684 39152 37902 36666 34994
2403 34994 34638 35884 36898 37281 38775 41772 44497 46785 51803 61721 74877 89245 105542 123635 137924 140422
2401A40422j1999k1074k1574j6478j0334o403m807l692j727P0L34R2J293L186L346K619L843
2399E7117O513P676R083J6319K9373M0704M6769N2884N9435N1376J4836l7742p3602p3982
2398B06759n1999l2632k4139j8873j1838o669n747n344k772n31n31q66J53L31j755l729l098
2396C6720j567j567k267j442M7J93o10k72P36M93o63n18Q20J160J86J86J538J976R64R65K794
2393C9872L812L085L424O366R132J0392J4904K6229L9573M7899N2800N8434N6349K9721k0697
2391C81295o7289q1409o3615l8819k5316k0124j4205p557m843m842l454m93P23J89N65J876
2389E2682J482m11m20K929P617J1257J4227J7769K0444J8455Q786o791k0815k5813k1190j3766
2387F6442r708q301n922k866j719k253j683L06J198M70N25K223K824J804K377O793J1852J4424
$$ plain form
2401 140422 128423 107349 85775 69297 58963 52560 47753 44061 42334 42404 42738 42830 44123 47309 50655 53274 57117
2399 57117 63630 71306 80389 96708 126081 166785 213554 266438 325873 377249 392085 354343 280741 206759
2398 206759 154760 122128 97989 79116 67278 60609 54862 49518 46746 46215 45684 44818 44971 45302 43547 39818 36720
2396 36720 35153 33586 31319 29877 29924 30117 29507 29235 29971 30464 29801 29283 30103 31263 31449 31635 33173 35149 36113 37078 39872
2393 39872 43684 46769 50193 56559 65691 76083 90987 117216 156789 204688 257488 315922 372271 401992 381295
2391 381295 314006 232597 168982 130163 104847 84723 70518 62961 58118 53276 49822 49329 50052 50241 50806 52682
2389 52682 54164 53753 53333 56262 63879 75136 89363 107132 127576 146031 154817 148026 127211 101398 80208 66442
2387 66442 56734 48433 42511 39645 37926 35673 33990 34296 35494 35964 36489 38712 41536 43340 45717 52510 64362 78786
2385G8786J6137J9291K0565J3335k544j8703k6115k3252j5555r392o559n250l261j077k89
2383C6117p26j89J607K511K073K362M255N468N613Q971J8045K8090L3573L7034M2517M2378
2381B69699K2240j6785n1189n9378m4481k6961j8761j5437j0536n795m485m522k823p40m98
2379B9548r22r7M00j202l288l142j609j173j700j458l69j26p86o40J66K40l91l90M32N77o1
2377A4009j33O57Q02J86J85J068J505J010J253K580L501L786N582R952J4271J6600J8201K0195
2375A15210J8496P651r770k3733k6596k0780j3840r770p392n135l244k403j966j255o25l52
2373A4496k81j05l49r86j521j408r72p44p43o83m40l18l17l12j65j75j74j66j65j68j68j67
2370C969j68l4l4KKo8o8j41j41j04j04j03j04l7l7j10j10q3q2q3q2K0K1n3n2kkkkL9M0q3q2
$$ plain form
2385 78786 94923 114214 134779 148114 145570 126867 100752 77500 61945 52553 45994 40744 37483 36406 36117
2383 36117 35391 35202 36809 39320 41393 43755 48010 53478 59091 68062 86107 114197 147770 184804 227321 269699
2381 269699 291939 275154 223965 164587 120106 93145 74384 58947 48411 42616 38131 33609 30786 30046 29548
2379 29548 28626 28529 28929 27727 24439 21297 19688 18515 16815 15357 14988 14862 14076 13436 13602 13842 13451 13061 13493 14070 14009
2377 14009 13876 14533 15335 15521 15706 16774 18279 19289 20542 23122 26623 30409 35991 45943 60214 76814 95015 115210
2375 115210 133706 141357 131587 107854 81258 60478 46638 36868 29476 24341 21097 18694 16728 15473 14848 14496
2373 14496 14215 14110 13761 12775 11254 9846 8874 8130 7387 6704 6264 5946 5629 5317 5152 4977 4803 4637 4472 4304 4136 3969
2370 3969 3801 3767 3733 3735 3737 3669 3601 3460 3319 3215 3111 3008 2904 2867 2830 2720 2610 2527 2445 2362 2280 2300 2321 2268 2216 2214 2212 2210 2208 2247 2287 2204 2122
2366B122j0j0q3q3l1l2l1l1l9l9l9l9J2J1o2o1JJKJqqpqjjp3p3jjp3p4k7k7k8k7J0J1J0J1
2361A165ppqpk0k1k1k1k1k2N1N2k0k0k0k0k2k2k2k2l8l7L6L5j1j1q5q4o1o2J2J1L1L2L1L2
2357G76m3m3m3m3j7j7j7j7J3J4J3J3m3m2m3m2K4K4K4K4j2j3j2j3K0J9m9m9l3L9M0l3l5l5l9
2352C10m0j3j4j4j3J6J7K1K2l9L4L8l4q4j2O4O4o1o1J1J2j3j2j3j3J7J7J6J7kjkjk2k1k2k1
2348A48P2P2lp6p0LLp0j04l2nmllKKl1M1M1l1o0o0N6N7ppppj9j8N0N0j3q5m4m4J2J3Q0Q1J4
2343fn9j8j8mmmmO5O3j5q9p3p3nnL8L7L8L8QQRQl4l4l4l4J9J9J9J9NONNl1l1M1M2mmmmMMP7
2337a4P6J55J56Nj15j41j40p5p6l9m0mlK2K2n1n0noL1L2l5l5L8L8m8m7m8m8l5l5Q6Q6kkl8
2333c85l9l0l0OOJ9K0n3n3Q9Q9J7J6l1l1R0R0J88J88K17K17J71M9j25k46k69j94p2Jj6q9j21
$$ plain form
2366 2122 2112 2102 2019 1936 1905 1873 1842 1811 1772 1733 1694 1655 1667 1678 1616 1555 1556 1557 1559 1560 1552 1544 1537 1529 1528 1527 1454 1381 1380 1379 1306 1232 1205 1178 1150 1123 1133 1144 1154 1165
2361 1165 1158 1151 1143 1136 1116 1095 1074 1053 1032 1010 1061 1113 1093 1073 1053 1033 1011 989 967 945 907 870 906 941 930 919 834 750 689 627 639 650 681 713 744 776
2357 776 733 690 647 604 587 570 553 536 549 563 576 589 546 504 461 419 443 467 491 515 503 490 478 465 485 504 455 406 373 412 452 419 384 349 310
2352 310 270 257 243 229 216 232 249 270 292 253 287 325 291 207 195 259 323 262 201 212 224 211 199 186 173 190 207 223 240 238 237 235 234 212 191 169 148
2348 148 220 292 289 213 143 146 149 79 -25 -57 -62 -66 -69 -72 -70 -68 -99 -58 -17 -48 -108 -168 -112 -55 -62 -69 -76 -83 -102 -120 -70 -20 -33 -118 -162 -206 -194 -181 -101 -20 -6
2343 -6 -65 -83 -101 -105 -109 -113 -117 -52 11 -4 -93 -166 -239 -244 -249 -211 -174 -136 -98 -90 -82 -73 -65 -99 -133 -167 -201 -182 -163 -144 -125 -120 -114 -109 -104 -135 -166 -125 -83 -87 -91 -95 -99 -95 -91 -14
2337 -14 62 217 373 378 263 122 -18 -93 -169 -208 -248 -252 -255 -233 -211 -262 -312 -317 -323 -292 -260 -295 -330 -292 -254 -302 -349 -397 -445 -480 -515 -429 -343 -345 -347 -385
2333 -385 -424 -454 -484 -478 -472 -453 -433 -486 -539 -450 -361 -344 -328 -359 -390 -300 -210 -22 166 383 600 771 820 695 449 180 -14 -86 -85 -101 -190 -311
2329c11m8N8N9n9n9j1j1j0j1QQJ3J3R1J64J91P0o8o9p5p7m8m8m9m8J2J2k4k4m5m5K8K8LLK
2325c77LL7L8L8L7J06J06J05J06n7n8j30j30r7r7K5K4ppq0q0kkLKl0M2P8P9N2J24K11K86L14
2320F62L14L00J79n0k68m12m12k31j08r9j00j29n7K5K4n3n4j6j7m5m5qrMMo9o9m5m5P6P6N8
2316f19N8j5j5LLo5o6K1R4R4K1j2j2N6N5J2J2Q5Q5R4R5J74K47L33L32K68J46q3l49m13l40
2313B99k23j49j83j82n6J6k4k4poooKKo3o3l5Q5R1R0N1N2J20J20J0o4j44j43q5q5j2j2k7k7
2309f88M6M6OPo2o2k3N1J4J4j1O2R4R4P4P3P8Oj28j27j27j28n0K2j9j9n4n4J8J9L7L7L7L7
2304f80J6J6M8J21J33J33R6J69K02K02Q5q6k50k48k24j51q1qlp6r5r4K2K3j7j7j6j7rrrj0
2300h34lmmmm4m5K8K8l3l2l3l2OPPPj6j6N8N7L9L8L9L9%JP3P3Q5Q5Q1Q0J10L7j00j72j00r9
$$ plain form
2329 -311 -359 -301 -242 -301 -360 -371 -382 -392 -403 -395 -387 -374 -361 -270 -106 85 155 87 18 -57 -134 -182 -230 -279 -327 -315 -303 -327 -351 -396 -441 -413 -385 -382 -379 -377
2325 -377 -374 -337 -299 -261 -224 -118 -12 93 199 142 84 -46 -176 -273 -370 -345 -321 -328 -335 -415 -495 -497 -499 -496 -494 -524 -482 -404 -325 -273 -149 62 348 662
2320 662 976 1276 1455 1405 1137 725 313 82 -26 -125 -225 -354 -411 -386 -362 -415 -469 -485 -502 -547 -592 -600 -609 -605 -601 -670 -739 -784 -829 -753 -677 -619
2316 -619 -561 -576 -591 -588 -585 -650 -716 -695 -601 -507 -486 -498 -510 -454 -399 -387 -375 -290 -205 -111 -16 158 405 738 1070 1338 1484 1401 1052 639 299
2313 299 76 -73 -256 -438 -494 -478 -502 -526 -533 -539 -545 -551 -549 -547 -610 -673 -708 -623 -532 -442 -391 -339 -219 -99 -89 -153 -297 -440 -525 -610 -622 -634 -661 -688
2309 -688 -642 -596 -590 -583 -645 -707 -730 -679 -665 -651 -662 -600 -506 -412 -338 -265 -187 -181 -309 -436 -563 -691 -741 -719 -738 -757 -811 -865 -847 -828 -791 -754 -717 -680
2304 -680 -664 -648 -600 -479 -346 -213 -117 52 254 456 541 455 205 -43 -267 -418 -499 -507 -510 -586 -681 -775 -753 -730 -747 -764 -780 -797 -806 -815 -824 -834
2300 -834 -837 -841 -845 -849 -893 -938 -910 -882 -915 -947 -980 -1012 -1006 -999 -992 -985 -1001 -1017 -959 -902 -863 -825 -786 -747 -747 -746 -673 -600 -515 -430 -349 -269 -159 -122 -222 -394 -494 -593
2296e93j00r9r9k7ONj3j2j3j3J3J2J3J3n6n5O1O1K1n2n1K1M2M2k6k6j2j1j2j2q0p9%P3K5K4
2291a009K4K5k3r6k7M6O5ql5l4K8K9l9m0nO8K7K7j1j1j1j1k7k7M7M6l1l2M2M1k3k3MP7K7m6
2287i46p4p3j6j7j7j6K9K9K9K9M4M5k9k8k8k9jP2K1n2q0p9qqrqJ3J3J2J3nonommmmN5N6j8
2282a114j8K3K2K3K3l7l7l6l7k6k7k7k6LMMLK8K7O9ml6l7P7P6O5ql9l9j8j9N1N0jp3p3%J8
2277a166J8K2K3l9l8j0O2M8k4r3k0j1j1ppPPPPO2O3O3O2j8j8j7j8M5M5k7k7l2l3l2l2ONNN
2273a118J5J4J4J5l1l1l1l1J1J1J1J1%%L7L6K8K8m4m5m6m6K7K7l4l4L9L9n5n4J8J9j8j8j8
2268a254j8L6L6L6L6nnnnk4k4k4R8J06L4l9l9mnmmlllkj%%jnmnnL6L6l6l7n3n3J9K0P4P5m7
2263a075m7k1k2J4J5J2J2J2J2l2l1l1l1j7j6j6j6K3K4K3K3L1L2L1L1O9P0llo4o5j00j01oo
$$ plain form
2296 -593 -693 -792 -891 -918 -912 -907 -920 -932 -945 -958 -945 -933 -920 -907 -963 -1018 -957 -896 -875 -927 -978 -957 -915 -873 -899 -925 -937 -948 -960 -972 -1052 -1131 -1131 -1058 -1033 -1009
2291 -1009 -985 -960 -983 -1079 -1106 -1060 -995 -1003 -1038 -1072 -1044 -1015 -1054 -1094 -1099 -1031 -1004 -977 -988 -999 -1010 -1021 -1048 -1075 -1028 -982 -1013 -1045 -1003 -962 -985 -1008 -1004 -927 -900 -946
2287 -946 -1020 -1093 -1109 -1126 -1143 -1159 -1130 -1101 -1072 -1043 -999 -954 -983 -1011 -1039 -1068 -1069 -997 -976 -1028 -1108 -1187 -1195 -1203 -1212 -1220 -1207 -1194 -1182 -1169 -1174 -1180 -1185 -1191 -1195 -1199 -1203 -1207 -1152 -1096 -1114
2282 -1114 -1132 -1109 -1087 -1064 -1041 -1078 -1115 -1151 -1188 -1214 -1241 -1268 -1294 -1291 -1287 -1283 -1280 -1252 -1225 -1156 -1160 -1196 -1233 -1156 -1080 -1015 -1023 -1062 -1101 -1119 -1138 -1087 -1037 -1038 -1111 -1184 -1184 -1166
2277 -1166 -1148 -1126 -1103 -1142 -1180 -1190 -1128 -1080 -1104 -1197 -1217 -1228 -1239 -1246 -1253 -1246 -1239 -1232 -1225 -1163 -1100 -1037 -975 -993 -1011 -1028 -1046 -1001 -956 -983 -1010 -1042 -1075 -1107 -1139 -1133 -1128 -1123 -1118
2273 -1118 -1103 -1089 -1075 -1060 -1091 -1122 -1153 -1184 -1173 -1162 -1151 -1140 -1140 -1140 -1103 -1067 -1039 -1011 -1055 -1100 -1146 -1192 -1165 -1138 -1172 -1206 -1167 -1128 -1183 -1237 -1219 -1200 -1218 -1236 -1254
2268 -1254 -1272 -1236 -1200 -1164 -1128 -1133 -1138 -1143 -1148 -1172 -1196 -1220 -1122 -1016 -982 -1021 -1060 -1064 -1069 -1073 -1077 -1080 -1083 -1086 -1088 -1089 -1089 -1089 -1090 -1095 -1099 -1104 -1109 -1073 -1037 -1073 -1110 -1163 -1216 -1197 -1177 -1103 -1028 -1075
2263 -1075 -1122 -1143 -1165 -1151 -1136 -1124 -1112 -1100 -1088 -1120 -1151 -1182 -1213 -1230 -1246 -1262 -1278 -1255 -1231 -1208 -1185 -1154 -1122 -1091 -1060 -991 -921 -924 -927 -991 -1056 -1156 -1257 -1263 -1269
2259a269O7O7j4j5q6q7O5O6K9K9m6m5K7K8K0J9j6j7%%%Jk8k8k8k8M9M9k4k4k2k2k3k2mmmm
2254a344N3N2R0Q9NNo7o8J1J1J0J1K8K7m5m5J3J4M9N0M9N0p2p2M8M9k4k4j0j0rj0K7K7m6m6
2250a124RQRQnnnnRRQRk4k5k4k4OPOPMNMMN6N6J9J9K9K8r3r3k1k2J5J5M9N0k4k4K0K1K0K0
2244i89ppklj9N4Q1Q1mp7p7mj7j8j4j3mnmmm3m2m2m2l8l7L0L1P5Kl3Q9J55L4j08j09M4M3k4
2239a067k5OP8L8L7P6P5%p3o9Ml6l7j7N6J5J5K0K0m9m9n5J8N0M9opopj5j6j6j5N8N9j4j4j6
2235i35j7j6j6%J%JjkjjkjjkRRQRN6N6k1r2m4L0R8K5j7j8k2k2nnnnK3K2K2K2j0j0j0j0j8j8
2229i36j8j7L9L9p7p8k1N1N2k1j5j5j9j9J4J5J4J4J0J0RJ0qpJ7j9J1Q5O1K5jkmlQQQQJ7J7
2224g38J7J7%J%Jj9j9Pl0m5K7N8N7nnnnL5L5l7l8k6k7Kl5j1J11Q2J1l0PNl1o4k7K2K3L4L4
$$ plain form
2259 -1269 -1202 -1135 -1149 -1164 -1250 -1337 -1272 -1206 -1177 -1148 -1194 -1239 -1212 -1184 -1164 -1145 -1161 -1178 -1178 -1178 -1178 -1177 -1205 -1233 -1261 -1289 -1240 -1191 -1215 -1239 -1261 -1283 -1306 -1328 -1332 -1336 -1340 -1344
2254 -1344 -1291 -1239 -1149 -1060 -1055 -1050 -1117 -1185 -1174 -1163 -1153 -1142 -1114 -1087 -1132 -1177 -1164 -1150 -1101 -1051 -1002 -952 -1024 -1096 -1048 -999 -1023 -1047 -1057 -1067 -1076 -1086 -1059 -1032 -1078 -1124
2250 -1124 -1115 -1107 -1098 -1090 -1095 -1100 -1105 -1110 -1101 -1092 -1084 -1075 -1099 -1124 -1148 -1172 -1166 -1159 -1153 -1146 -1142 -1137 -1133 -1129 -1073 -1017 -998 -979 -950 -922 -1015 -1108 -1129 -1151 -1136 -1121 -1072 -1022 -1046 -1070 -1050 -1029 -1009 -989
2244 -989 -996 -1003 -1005 -1008 -1027 -973 -892 -811 -815 -892 -969 -973 -990 -1008 -1022 -1035 -1039 -1044 -1048 -1052 -1095 -1137 -1179 -1221 -1259 -1296 -1266 -1235 -1160 -1158 -1191 -1102 -947 -913 -1021 -1130 -1086 -1043 -1067
2239 -1067 -1092 -1086 -1008 -970 -933 -857 -782 -782 -855 -924 -920 -956 -993 -1010 -954 -939 -924 -904 -884 -933 -982 -1037 -1019 -969 -920 -926 -933 -939 -946 -961 -977 -993 -1008 -950 -891 -905 -919 -935
2235 -935 -952 -968 -984 -984 -983 -983 -982 -983 -985 -986 -987 -989 -990 -991 -993 -984 -975 -967 -958 -902 -846 -867 -959 -1003 -973 -875 -850 -867 -885 -907 -929 -934 -939 -944 -949 -926 -904 -882 -860 -870 -880 -890 -900 -918 -936
2229 -936 -954 -971 -932 -893 -970 -1048 -1069 -1018 -966 -987 -1002 -1017 -1036 -1055 -1041 -1026 -1012 -998 -988 -978 -969 -959 -967 -974 -957 -976 -965 -880 -819 -794 -795 -797 -801 -804 -796 -788 -780 -772 -755 -738
2224 -738 -721 -704 -704 -703 -703 -702 -721 -740 -733 -763 -808 -781 -723 -666 -671 -676 -681 -686 -651 -616 -653 -691 -717 -744 -742 -777 -788 -677 -595 -584 -614 -607 -602 -633 -697 -724 -702 -679 -645 -611
2220f11L4L5L5L5o0r8l2M0M2l1jP1O9lJ9N5N1J5PQNNJ0J0J2J2L0O6J9n4o9LN6J9j4N9O1j2
2215a02m0L4J04L0j6K1M1l2m1L0J07J07L1L1L6L5M3J16J25N2J3J57J58J3oO7J47J47R6K41
2211A745K50J05J65L11M52L79M00P39J004J150J690L000M595N323M958M036K759J157k56k55
2209C3707R90K010J674J69j717l706n581o503n830m131k678j951j599j065o54n08m69l24k03
2206A631k04j94j95j33j34j34j34j45j45j10L5J0o4o3J0j1j54j56j0N1k2r4r3k7k7k7k6l9
2203f04l9l9l9L4L5l9l8onnnP1P0n0n1j3j2j3j3POOPL6L7q4q5j3j2O0O0k6k6k6k7M1M1q0q1
2198i20l0l0R0R1LLp1p0J3J4J3J3k6k6M6M7NOONnnnnnnnnM2M1M2M1ononO5O5pqm0m1m1m1j0
2193g72j1O3O2m5m5m5m5L2L2L2L2k2k3k2k3k2k2k2k3K1K0K0K0l8l9l9l8M0M0M1M0RJ0RJ0N4
$$ plain form
2220 -611 -577 -542 -507 -472 -532 -630 -662 -622 -580 -611 -612 -541 -472 -475 -456 -401 -350 -335 -328 -320 -315 -310 -300 -290 -278 -266 -236 -170 -151 -205 -274 -271 -215 -196 -210 -151 -90 -102
2215 -102 -142 -108 -4 26 10 31 72 40 -1 29 136 243 274 305 341 376 419 535 660 712 725 882 1040 1053 1047 1114 1261 1408 1504 1745
2211 1745 1995 2100 2265 2576 3028 3407 3807 4546 5550 6700 8390 11390 15985 21308 26266 30302 33061 34218 33962 33707
2209 33707 34697 36707 38381 38550 36833 33127 27546 21043 15213 11082 8404 6453 4854 3789 3135 2627 2158 1834 1631
2206 1631 1427 1233 1038 905 771 637 503 358 213 103 138 148 84 21 31 20 -134 -290 -300 -249 -271 -365 -458 -485 -512 -539 -565 -604
2203 -604 -643 -682 -721 -687 -652 -691 -729 -735 -740 -745 -750 -679 -609 -659 -710 -723 -735 -748 -761 -754 -748 -742 -735 -699 -662 -746 -831 -844 -856 -796 -736 -762 -788 -814 -841 -800 -759 -839 -920
2198 -920 -950 -980 -890 -799 -796 -793 -864 -934 -921 -907 -894 -881 -907 -933 -887 -840 -835 -829 -823 -818 -823 -828 -833 -838 -843 -848 -853 -858 -816 -775 -733 -692 -698 -703 -709 -714 -649 -584 -591 -599 -639 -680 -721 -762 -772
2193 -772 -783 -720 -658 -703 -748 -793 -838 -806 -774 -742 -710 -732 -755 -777 -800 -822 -844 -866 -889 -868 -848 -828 -808 -846 -885 -924 -962 -922 -882 -841 -801 -792 -782 -773 -763 -709
2188g09N5j8j7n5n5J8J8M9M8k4k5k5k6M8M7k1k1k1k1LLp0p0k8k9k9k9P4P4P4P4J2J2J2J2p6
2184g36p6mmL5L4L4L5m0l9l9m0Q9Q8J5J5M2M3l1l1p7p8nmK1K2K1K2J9J8J9J9M0M1l4j08q9
2180g63j7N9N9POPOk1k0k1k1M8M8K0n2n2K0M8M8RJ0RJ0ooooq3q4M0J13J8n5rj0N1N1N1N1j6
2175d59j5k0k1kp5p6kO7O8M0l3j5j5k0j9J8J9J8J8PPOPJ1J1J1J1k2k2M7M6j3q6m4P6J10L7
2170c24l6l5L2L3L3L2k6k6k5k6J6J7J7J6j6j6j6j6l4l4l4l4K6K6K6K6j5j4N3N3J6n7j6j6L
2166c91KKKK6K5K5K5J1J0N1k2o5o5OQ0J48P7m4m4nO8O7nj7j7k2k2P7P7M6k8j2j1j7j7k7k8
2161c4k8k8j0j0onQQ1Q0Ql0k8L7L9j9j9j8j8M4M5M5M5m2m1L1L2o5o4l1L9O4O3O8O8L5L5Lp0
2157C04p6p5ppN5N6K3m9q4q4j6j5ONP9P8j6j5J6Q8J06J05L0m3k8k8l3l2m0m0m0m0KJKKOOP
$$ plain form
2188 -709 -654 -672 -689 -744 -799 -781 -763 -714 -666 -690 -715 -740 -766 -718 -671 -692 -713 -734 -755 -752 -749 -819 -889 -917 -946 -975 -1004 -930 -856 -782 -708 -696 -684 -672 -660 -736
2184 -736 -812 -816 -820 -785 -751 -717 -682 -722 -761 -800 -840 -751 -663 -648 -633 -591 -548 -579 -610 -687 -765 -770 -774 -753 -731 -710 -688 -669 -651 -632 -613 -573 -532 -566 -674 -763
2180 -763 -780 -721 -662 -655 -649 -642 -636 -657 -677 -698 -719 -671 -623 -603 -655 -707 -687 -639 -591 -582 -572 -563 -553 -559 -565 -571 -577 -660 -744 -704 -591 -573 -628 -637 -647 -596 -545 -494 -443 -459
2175 -459 -474 -494 -515 -517 -592 -668 -670 -603 -535 -495 -528 -543 -558 -578 -597 -579 -560 -542 -524 -517 -510 -504 -497 -486 -475 -464 -453 -475 -497 -450 -404 -417 -503 -547 -471 -361 -324
2170 -324 -360 -395 -363 -330 -297 -265 -291 -317 -342 -368 -352 -335 -318 -302 -318 -334 -350 -366 -400 -434 -468 -502 -476 -450 -424 -398 -413 -427 -374 -321 -305 -362 -378 -394 -391
2166 -391 -389 -387 -385 -359 -334 -309 -284 -273 -263 -212 -234 -299 -364 -358 -278 -130 -53 -97 -141 -146 -78 -11 -16 -33 -50 -72 -94 -17 60 106 78 66 55 38 21 -6 -34
2161 -34 -62 -90 -100 -110 -116 -121 -113 -32 48 56 26 -2 35 74 55 36 18 0 44 89 134 179 137 96 127 159 94 30 -1 38 102 165 233 301 336 371 374 304
2157 304 228 153 146 139 194 250 273 224 140 56 40 25 31 36 115 193 177 162 178 266 372 477 507 464 436 408 375 343 303 263 223 183 185 186 188 190 196 202 209
2152B09On4n3K0J9K1K1K1K1kkm3L0L8L8l1l1o5o5N5N6J4J3J3J4k3k2k3k3N6N7N6N6J0J0J0
2148D27J0mlmmk7k8M5M6n5n5J8J8nonnn0m9K3K4Q1Q2m0m0k1k2k2k1L8L9L8L9k1k0N2N2lml
2143E15mJJJJklklPOQ0P9K6K6m7m7K9K9K9K9Q9R0Q9R0J04J05O5q1j29j30L1L1Q7Q7J60J60
2138A599K34K34K66J93K6j20j63j63j39j38j7j7J68J68K89K89K69K69J30j13l29m74m12k66
2135A783j53p9l9l9M2M1J54J54Oj40k20j47p9p9p4p5j8j8j8j9L7L6L6L6k5k6k6k5O5O5O6O5
2131A287M6M5M6M5Q5Q5J58J58J06J07n9n9p0JR8K43K86K86L21K49J21j22k01j27m9m9m5m4
2128B948K8K8J67K39K64M10N10M37M7m87p29n83l10k38k33j60l4L8k9j03q7q8r1r2m2m2m2
2125A726m2j9j9j9j9K4K3K4K3P3P3P2P3J1J0J1J0M1M1q0q0RRQ2Q2J22J21K43K42K42K41K32
$$ plain form
2152 209 215 161 108 128 147 168 189 210 231 229 227 184 214 252 290 259 228 163 98 153 209 223 236 249 263 240 218 195 172 228 285 341 397 407 417 427
2148 427 437 433 430 426 422 395 367 412 458 403 348 366 384 379 373 368 363 313 264 287 311 392 474 434 394 373 351 329 308 346 385 423 462 441 421 473 525 522 518 515
2143 515 511 512 513 514 515 513 510 508 505 512 518 598 677 703 729 682 635 664 693 722 751 840 930 1019 1109 1213 1318 1383 1302 1173 1043 1074 1105 1192 1279 1439 1599
2138 1599 1833 2067 2333 2526 2552 2432 2269 2106 1967 1829 1812 1795 1963 2131 2420 2709 2978 3247 3377 3264 2935 2461 2049 1783
2135 1783 1630 1551 1512 1473 1515 1556 1710 1864 1870 1730 1510 1363 1284 1205 1131 1056 1038 1020 1002 983 1020 1056 1092 1128 1103 1077 1051 1026 1091 1156 1222 1287
2131 1287 1333 1378 1424 1469 1554 1639 1797 1955 2061 2168 2109 2050 1980 1981 2079 2322 2608 2894 3215 3464 3585 3463 3262 3135 3086 3037 2992 2948
2128 2948 2976 3004 3171 3410 3674 4084 4594 5031 5078 4591 3862 3279 2969 2731 2498 2338 2304 2342 2313 2210 2123 2035 1944 1852 1810 1768 1726
2125 1726 1684 1665 1646 1627 1608 1632 1655 1679 1702 1775 1848 1920 1993 2004 2014 2025 2035 2076 2117 2037 1957 1966 1975 2057 2139 2261 2382 2625 2867 3109 3350 3582
2121C582K32J62J6K5K5M6M7k7J19K73M17N00N00M77K34m4l85n39n40m31k60p8M4J08J81K20
2117D904R8j45l15l70l70l00k28j52j51j89j15n8n8n3n3K1K1K1K1l4l3l4l3k9k9k9k9M2M3
2114B364l1l0kkkkj4j4j4j5Q3Q2l5l4J0Q3P8P8K4K3mp6n0K4J4J4k9k9M4M4M3M4k9k9L2L3M2
2109B718l1n6J7M4M4K2K3K2K2M5M6M5M5j6j7j6j6J4J4J4J4K4K5K5K5j7j6N7N6J3J2J2J2L5
2105C260L5L5L5noonL7L7L6L7L2L1L2L2m8m9j1j2O1O2j2j1o3o2N9N9R8R8k3k3J0J0J0J0L1
2101C811L0L1L1L0L1L1L0J0J1J0J0j5j5K2K1J01J01K9K8K9K9K9K9J0J1J0J0L4L3L3L3p6p5
2097D477llN5N4N5N5N2N3k0k1M8M8k5k4M2M2J16J15l2l2MNO7O7L1L0M0M0l3l3M0M1M1M0P7
2092E509P7NMM6M6M7M6l4l4L9L8R0Q9J7J7Q5Q5J2J2opppR2R2J9J9J05J05L2L2K8K8K8K8qq
$$ plain form
2121 3582 3814 3976 3992 4017 4042 4088 4135 4108 4227 4500 4917 5417 5917 6394 6628 6584 6199 5660 5120 4689 4429 4351 4395 4503 4684 4904
2117 4904 5002 4857 4542 4172 3802 3502 3274 3122 2971 2782 2667 2609 2551 2498 2445 2466 2487 2508 2529 2495 2462 2428 2395 2366 2337 2308 2279 2321 2364
2114 2364 2333 2303 2301 2299 2297 2295 2281 2267 2253 2238 2321 2403 2368 2334 2344 2427 2505 2583 2607 2630 2626 2550 2500 2524 2538 2552 2523 2494 2538 2582 2625 2669 2640 2611 2643 2676 2718
2109 2718 2687 2631 2648 2692 2736 2758 2781 2803 2825 2870 2916 2961 3006 2990 2973 2957 2941 2955 2969 2983 2997 3021 3046 3071 3096 3079 3063 3120 3176 3189 3201 3213 3225 3260
2105 3260 3295 3330 3365 3360 3354 3348 3343 3380 3417 3453 3490 3522 3553 3585 3617 3569 3520 3509 3497 3558 3620 3608 3597 3534 3472 3531 3590 3688 3786 3763 3740 3750 3760 3770 3780 3811
2101 3811 3841 3872 3903 3933 3964 3995 4025 4035 4046 4056 4066 4051 4036 4058 4079 4180 4281 4310 4338 4367 4396 4425 4454 4464 4475 4485 4495 4529 4562 4595 4628 4552 4477
2097 4477 4474 4471 4526 4580 4635 4690 4742 4795 4775 4754 4802 4850 4825 4801 4843 4885 5001 5116 5084 5052 5056 5061 5128 5195 5226 5256 5296 5336 5303 5270 5310 5351 5392 5432 5509
2092 5509 5586 5591 5595 5641 5687 5734 5780 5746 5712 5751 5789 5879 5968 5985 6002 6087 6172 6184 6196 6190 6183 6176 6169 6261 6353 6372 6391 6496 6601 6633 6665 6693 6721 6749 6777 6769 6761
2088F761K8K8J18J19llk1k2k1k1R9R8R9R8M7M7M8M7J30J30N8N8L5L6L6L5N0M9M9N0M5M6M5
2084H398M6P9P8l7l8P0J42P0k%%O9O8J21J21M8M8N8N9N8N9K1K1n2n2J41J41O8O8Q8Q8J5J5
2080A0077P8P7P8P7J25J24N2N1Q6Q5Q5Q5J15J15jjJ12J85J13L9J42J42O4O5J42J42O9O9J26
2076A2718J27J26J26J80J79N8N8K10K09M4M4J79K52J13pK7J00N6N7J41K13J41O9J82J82J02
2073A5886L0J21J95P3JJ44K18R9J00K39K38J10L8K36K36J11J10K56K57Q6Q6K44K43J22J23
2070A9602K98K98J33J33M01M75K08O4K71M16J99N2L22M68K97J52L57N02K43J71M97O42K89
2067B6490J44N22P66M92L47O86Q32L90J46O38R78N71L29Q08J245Q26O81J357J793J254R14
2065D2209J496K030J579J652L185M495M976O772J1236J5360J6883J8194K0437J7769N486r897
$$ plain form
2088 6761 6789 6817 6935 7054 7051 7048 7027 7005 6984 6963 7062 7160 7259 7357 7404 7451 7499 7546 7676 7806 7864 7922 7957 7993 8029 8064 8114 8163 8212 8262 8307 8353 8398
2084 8398 8444 8523 8601 8564 8526 8596 8738 8808 8806 8806 8806 8875 8943 9064 9185 9233 9281 9339 9398 9456 9515 9536 9557 9505 9453 9594 9735 9803 9871 9959 10047 10062 10077
2080 10077 10155 10232 10310 10387 10512 10636 10688 10739 10825 10910 10995 11080 11195 11310 11309 11308 11420 11605 11718 11757 11899 12041 12105 12170 12312 12454 12523 12592 12718
2076 12718 12845 12971 13097 13277 13456 13514 13572 13782 13991 14035 14079 14258 14510 14623 14616 14643 14743 14799 14856 14997 15210 15351 15420 15602 15784 15886
2073 15886 15916 16037 16232 16305 16306 16450 16668 16767 16867 17106 17344 17454 17492 17728 17964 18075 18185 18441 18698 18784 18870 19114 19357 19479 19602
2070 19602 19900 20198 20331 20464 20865 21340 21548 21612 21883 22299 22498 22550 22872 23340 23637 23789 24146 24648 24891 25062 25559 26201 26490
2067 26490 26634 27156 27922 28414 28761 29447 30279 30669 30815 31453 32431 33002 33331 34139 35384 36210 36891 38248 40041 41295 42209
2065 42209 43705 45735 47314 48966 52151 56646 61622 68394 79630 94990 111873 130067 150504 168273 173759 163862
2063A63862j6640j2419n194P75Q985K0874L1652L9950M9657N8925N5516L1786k973l1749m6452
2061C46555m8636m0968k6070r069O606K2440L8794N0530N3491M9309L6935Q019l6576p4908
2059C76452q2333o1085l5802k1737j2566l24J0302J4190J5501J6447R120j0389l0138l5488
2058A52150k7773j9375j5347j1580o679m218m459l702j324n93j709j509mP3j430j479K5K44
2055E1311q73q00P05Q99k18k42J166J475K62J16J523K052J226J190K695L598L453M271P329
2053H1138J1151J5180K0062K5448K9519L0538K6316J3553o013k0425j6737L110K3273L4094
2051B70207M2379N5433O2840M6099M973l4964m7226l1552j1407o216j1427r147N792J8556
2050C54340J4706P80m528L770Q737n676l3238n2017m9112l1982j5690o810j406M755Q547M034
$$ plain form
2063 163862 147222 134803 129609 130384 139369 160243 191895 231845 281502 340427 395943 427729 424756 393007 346555
2061 346555 297919 256951 230881 221812 228418 250858 289652 340182 393673 442982 479917 487936 451360 376452
2059 376452 294119 233034 197232 175495 162929 162605 172907 187097 202598 219045 228165 217776 187638 152150
2058 152150 124377 105002 89655 78075 71396 67178 62719 59017 57693 57100 55391 53882 53878 53951 52521 51042 51067 51311
2055 51311 50438 49638 50343 51242 51024 50782 51948 53423 53685 53801 55324 57376 58602 59792 62487 66085 69538 73809 81138
2053 81138 92289 107469 127531 152979 182498 213036 239352 252905 246892 226467 209730 212840 236113 270207
2051 270207 312586 368019 430859 476958 481931 446967 399741 368189 356782 350566 339139 329992 335784 354340
2050 354340 369046 369826 365298 369068 377805 372129 338891 286874 237762 205780 190090 183280 181874 186629 195176 199210
2048A99210q331j9734k2361j7266j0766o060j589L119O148P846J0145J1553P294k167r690
2046A47351j0320o478k061L615J1623J9594K6047L3788M3347M7754L9456K0076k003k0937
2044C50852l3603l6580k8865j5250j129J4138L2044M7909N6789O1325O3704N3425J9603k5356
2042E59006n1221m5093k7187k2795k9637k6037l084K6164M6983N8449O4224N9693L5382q501
2041F36346n5523q2412p6735m8965k3004j3202j1406k660J2044J6539L096j5009k0104j2438
2039C06567q410j8658l5399m2909l5678k1817j1480o470k054L163N055O2r011j5703j6722
2037I0536j4016j0474p232m757l414l268l515l515l160k433j384n60l97l25J48L92m08j621
2035C0597j937j403r96j142q87j59L66L65O78J405J469O44k55o91j007j637j828j294o82m39
$$ plain form
2048 199210 190879 171145 148784 131518 120752 114692 113103 116222 122370 130216 140361 151914 159208 157041 147351
2046 147351 137031 130553 128492 132107 143730 163324 189371 223159 266506 314260 353716 373792 371789 350852
2044 350852 317249 280669 251804 236554 235425 249563 281607 329516 386305 447630 511334 564759 584362 559006
2042 559006 507785 462692 435505 412710 383073 357036 353952 380116 427099 485548 549772 609465 644847 636346
2041 636346 580823 498411 421676 372711 349707 336505 325099 322439 334483 351022 354118 339109 319005 306567
2039 306567 298157 279499 244100 201191 165513 143696 132216 125746 123692 126855 131910 131972 122961 107258 90536
2037 90536 76520 66046 58814 54057 50643 47375 43860 40345 37185 34752 33368 32808 32411 32086 32234 32626 32218 30597
2035 30597 28660 27257 26261 25119 24232 24073 24439 24804 25482 26887 28356 29000 28745 28054 27047 25410 23582 22288 21606 21167
2032B1167j03O24J334J407J312J386J034k77j954k875k639j912j189n59l7L03N89J025J362
2030A9998J362R70K43n55j282j666j520r32k04N03J037J437J776J825J000o87k094k145j029
2028A8037j53j53m01j58L42M88R4m40o80m37l4l3p89j710j799j071l18j73j41J03L08J63k62
2025A0783n04o39p85o83l68j41k14k81j60l5j57j96p4J6n6j50p8K6r5j87o5N3o8j93j20Kp2
2022E559j72n0M3l0j20m8N2o9k04j31nom2L0N9j11k29o0R9K5j27n4J11L8j10j11POp2p3M9
2018D254M9j01j00k8k8p4p3R6R6j08j08l5l5k3k3N0M9j01j02k9k8o8o9N4N3j10j09O1O1j7
2014C454j7j6j7j33j32L7L7mmmlk8k7k7k8j45j46P3P3k3k3N0N0j1j1K5K5p1p1KLp8p8mnk1
2010B702k2k1k2n3n3J9K0q8q8j5j6ONNNNMQ2Rp4p3onn4n4J9J9j0j0j0j0j06j05J5J6j8j7N6
$$ plain form
2032 21167 21064 21688 23022 24429 25741 27127 28161 27884 25930 23055 20416 18504 17315 16756 16719 17022 17611 18636 19998
2030 19998 21360 22330 22573 22018 20736 19070 17550 16618 16414 16917 17954 19391 21167 22992 23992 23305 21211 19066 18037
2028 18037 17884 17731 17330 17172 17514 18002 18096 17656 16976 16539 16505 16472 15683 13973 12174 11103 10785 10612 10471 10574 10882 11045 10783
2025 10783 10279 9640 8855 8172 7804 7663 7449 7168 7008 6973 6816 6620 6546 6562 6506 6356 6278 6304 6209 6022 5957 6010 5942 5749 5629 5631 5559
2022 5559 5387 5337 5380 5350 5230 5182 5234 5165 4961 4830 4825 4819 4777 4807 4866 4755 4526 4466 4565 4590 4463 4409 4520 4558 4448 4337 4344 4350 4278 4205 4254
2018 4254 4303 4202 4102 4074 4046 3972 3899 3995 4091 3983 3875 3840 3805 3782 3759 3809 3858 3757 3655 3626 3598 3530 3461 3515 3568 3458 3349 3410 3471 3454
2014 3454 3437 3421 3404 3271 3139 3176 3213 3209 3205 3201 3198 3170 3143 3116 3088 2943 2797 2870 2943 2920 2897 2947 2997 2986 2975 3000 3025 2954 2883 2885 2888 2810 2732 2728 2723 2702
2010 2702 2680 2659 2637 2584 2531 2550 2570 2482 2394 2379 2363 2369 2374 2379 2384 2389 2393 2475 2484 2410 2337 2331 2326 2272 2218 2237 2256 2246 2236 2226 2216 2110 2005 2020 2036 2018 2001 2057
2005B057N6J0J0k6k6q8q8L4L4k6k6k6k6n6n6O5O5J%%Jn6n6O6O5m0m1L2L2o1o2J1J1r9r9K3
2001A615R5L6q5n3J9LKLKK7m5mnl6l5%Jl8l9j0O2L7l6NNl1j03l5L8J9n4j8N6J6n6j0j1mmm
1996A325mj7j7J9J9q6q7j0O2O3r%%o1o1l0M4L1L0L5L6n0m9K3K3j0j0K6K7onm2m2l3l3l3l2
1991A036MMP7P7j1j1j1j1L5L4l9l8l9l9L5L4j%%jj06j06J4J5k8k8k8k8L4L4L5L4j4j3j3j4
1987I23NNNMM4M3L9L9Oo8l5J10Q4Q4Q4Q5R7m7q8q7q3q2NJ51K19K19K51L24L00J54l8j10j59
1983B483k31k00j26q1q0J2J58K65K65K23K23J12j30l13l85l17k45j61q8l1l2RJ0R3R4Nj40
1980A392k19k20j07j07l5l5L9L8K1K1j00j00kjkjp8p8M4M3M7M6k6k6j3j3j2j3j7j7j8j7J8
1976D52J8J8J8J8J8J8J8k3k3k3k3K4K4K5K4Q9Q8l2l2J3J3Q6Q6J65J66J56J57K7j18j82l6P6
$$ plain form
2005 2057 2113 2123 2133 2107 2081 1993 1905 1939 1973 1947 1921 1895 1869 1813 1757 1822 1887 1888 1888 1888 1889 1833 1777 1843 1908 1868 1827 1859 1891 1830 1768 1779 1790 1691 1592 1615
2001 1615 1710 1746 1661 1608 1627 1630 1632 1635 1637 1664 1619 1615 1610 1574 1539 1539 1540 1502 1463 1453 1515 1552 1516 1521 1526 1495 1392 1357 1395 1414 1360 1342 1398 1414 1358 1348 1337 1333 1329 1325
1996 1325 1321 1304 1287 1306 1325 1239 1152 1142 1204 1267 1258 1258 1258 1197 1136 1106 1150 1181 1211 1246 1282 1232 1183 1206 1229 1219 1209 1235 1262 1256 1251 1209 1167 1134 1101 1068 1036
1991 1036 1040 1044 1121 1198 1187 1176 1165 1154 1189 1223 1184 1146 1107 1068 1103 1137 1136 1136 1136 1135 1029 923 937 952 924 896 868 840 874 908 943 977 963 950 937 923
1987 923 928 933 938 942 986 1029 1068 1107 1113 1045 1010 1120 1204 1288 1372 1457 1554 1507 1419 1332 1249 1167 1172 1323 1542 1761 2012 2336 2636 2790 2752 2642 2483
1983 2483 2252 2052 1926 1845 1765 1777 1935 2200 2465 2688 2911 3023 2893 2580 2195 1878 1633 1472 1384 1353 1321 1330 1340 1433 1527 1532 1392
1980 1392 1173 953 846 739 704 669 708 746 767 788 688 588 586 585 583 582 504 426 470 513 560 606 580 554 541 528 516 503 486 469 451 434 452
1976 452 470 488 506 524 542 560 578 555 532 509 486 510 534 559 583 672 760 728 696 709 722 808 894 1059 1225 1381 1538 1565 1447 1265 1229 1305
1972A305K22K70K70L04L04J58J3j33k79k52j06p0p1O0O0R4R3k7k8M8M9j22j22j80j80j40N
1968A545R5R5L2L1j31j32j68j68r2r1n2R3J48J47K20K20J67K2j15j15j44j44j44j44O4O4J85
1965A488J85L01L01K05J33m3k86m08l36j95j23p8oR0R0R4R4J05J05o5o6L4L3j36j37j21j20
1962A138M9M9K08K08K72L45K74Ok54l27j68r5j32j33jJ20R3K0j5j5j9k0j40j41k14k13j37
1958G58j37o4o4k5k5o1o1J8J8j03j03m9n0K3K4M4M5j26j24l0l0M2M3j4j3j3j4L1L2m2m1j%
1954a12jjj1j2j2j2l7l6j%j2j2q4q5N7N8N7N7M9M9k3k4J1J1o1o2o8o8N3N3M5M4p7p8O9O9n
1950b12mjjkjo0o0o0o0Q4Q4J2J1mmmnM9M8k5k4J1J1k5k6L0K9m1m1k5J1Jp3p3JJ6k1m5K7N7
1945d15N6l2l2l2l2j0rj0j0OOl0l0O2O3j0j1k8k9k8k8L1L2nmL4L4l9l9K0K1k8o4%P3N2J6K5
$$ plain form
1972 1305 1527 1797 2067 2371 2675 2833 2846 2713 2434 2182 2076 2006 1935 1995 2055 2149 2242 2215 2187 2235 2284 2162 2040 1860 1680 1540 1545
1968 1545 1640 1735 1767 1798 1667 1535 1367 1199 1107 1016 964 1057 1205 1352 1572 1792 1959 1981 1866 1751 1607 1463 1319 1175 1239 1303 1488
1965 1488 1673 1974 2275 2480 2613 2570 2284 1876 1540 1345 1222 1144 1138 1228 1318 1412 1506 1611 1716 1651 1585 1619 1652 1516 1379 1258 1138
1962 1138 1187 1236 1444 1652 1924 2269 2543 2549 2295 1968 1800 1705 1573 1440 1439 1559 1652 1672 1657 1642 1623 1603 1463 1322 1108 895 758
1958 758 621 557 493 468 443 382 321 339 357 254 151 102 52 75 99 143 188 62 -62 -92 -122 -80 -37 -51 -64 -77 -91 -60 -28 -70 -111 -112 -112
1954 -112 -113 -114 -125 -137 -149 -161 -198 -234 -235 -235 -247 -259 -343 -428 -371 -313 -256 -199 -150 -101 -124 -148 -137 -126 -187 -249 -317 -385 -332 -279 -234 -190 -267 -345 -276 -207 -212
1950 -212 -216 -217 -218 -220 -221 -281 -341 -401 -461 -377 -293 -281 -270 -274 -278 -282 -287 -238 -190 -215 -239 -228 -217 -242 -268 -238 -209 -250 -291 -316 -305 -304 -377 -450 -449 -433 -454 -499 -472 -415
1945 -415 -359 -391 -423 -455 -487 -497 -506 -516 -526 -520 -514 -544 -574 -512 -449 -459 -470 -498 -527 -555 -583 -552 -520 -525 -529 -495 -461 -500 -539 -519 -498 -526 -590 -590 -517 -465 -449 -424
1940d24O1Ro4q8n1l7l7k2J6L8l5k8Rj7j6KLLLjkkjP1P2M0l3m3m3j1j1JJp0o9K9O4M9k4n0n0
1935g58J5J6Qk9m9K4O6O6n1n1KJm6q3lP0P0kJ3M9O6pqrj2j3LMNOmL4J9n3o9l3J7J8OM3O6p
1930f00n9k2m3m3k6M6K7qk5J2J2k5j2K4K4j3l3MN3N4l7l6l4l4N3Q9M0l4k7RL0m3j14m1L5L5
1926g62nmnmLLNOj4K3M3l0n7n8J1J0qqqrml%JOP8N8K1qqj1j0k2k2k3k2mmmmJ8J9J8J8j9k0
1920h19k0j9l5l4L8L8klklLKLKj5j6j6j6j6j7j7j7K6K5K6K6j4j4j0rRQ3O2K5L2L1Kp1n7J6
1915g93Q3J1l6l7m1m1o2o3N9N9MLMMRJ0o3o3j7j6j7j6L8L8L9L8k4k4M9M9j5j5j5j5P0P0kl
1911g41n3n3K0K1o8o7OOJ1J2J2J2j0rj0rm8m7P4P4J8J9J8J9J7J7n6n6o4o4RRk4k3N0N0j0r
1906i47j0rnnnnM3M3M2M3M3M3M2M3pqppl0l0M2M3j2j2j2j2r1r1j8j8%%%%ooooq3q3L8L8%%
$$ plain form
1940 -424 -363 -354 -418 -506 -557 -594 -631 -653 -637 -599 -634 -662 -653 -670 -686 -684 -681 -678 -675 -676 -678 -680 -681 -610 -538 -498 -531 -574 -617 -628 -639 -638 -637 -707 -776 -747 -683 -634 -658 -708 -758
1935 -758 -743 -727 -719 -748 -797 -773 -707 -641 -692 -743 -741 -740 -786 -869 -872 -802 -732 -734 -721 -672 -606 -613 -621 -630 -642 -655 -652 -648 -643 -637 -641 -607 -588 -641 -710 -743 -726 -708 -702 -659 -593 -600
1930 -600 -659 -681 -724 -767 -793 -747 -720 -728 -753 -741 -729 -754 -766 -742 -718 -731 -764 -760 -707 -653 -690 -726 -760 -794 -741 -652 -612 -646 -673 -664 -634 -677 -791 -832 -797 -762
1926 -762 -767 -771 -776 -780 -777 -774 -769 -763 -777 -754 -711 -741 -798 -856 -845 -835 -843 -851 -859 -868 -872 -875 -875 -874 -868 -790 -732 -711 -719 -727 -738 -748 -770 -792 -815 -837 -841 -845 -849 -853 -835 -816 -798 -780 -799 -819
1920 -819 -839 -858 -893 -927 -889 -851 -853 -856 -858 -861 -858 -856 -853 -851 -866 -882 -898 -914 -930 -947 -964 -981 -955 -930 -904 -878 -892 -906 -916 -925 -916 -833 -771 -746 -714 -683 -681 -752 -809 -793
1915 -793 -710 -699 -735 -772 -813 -854 -916 -979 -920 -861 -857 -854 -850 -846 -837 -827 -890 -953 -970 -986 -1003 -1019 -981 -943 -904 -866 -890 -914 -865 -816 -831 -846 -861 -876 -806 -736 -738 -741
1911 -741 -794 -847 -827 -806 -874 -941 -935 -929 -918 -906 -894 -882 -892 -901 -911 -920 -968 -1015 -941 -867 -849 -830 -812 -793 -776 -759 -815 -871 -935 -999 -990 -981 -1005 -1028 -978 -928 -938 -947
1906 -947 -957 -966 -971 -976 -981 -986 -943 -900 -858 -815 -772 -729 -687 -644 -651 -659 -666 -673 -703 -733 -691 -648 -660 -672 -684 -696 -787 -878 -896 -914 -914 -914 -914 -914 -920 -926 -932 -938 -1021 -1104 -1066 -1028 -1028 -1028
1901a028%%l5l6l5l6LKP5P6J2J3J3J3m5m4K9K9K0K0j6j6N2N3k1k1k3k3J4J3j0j0O2O3j9k0
1896h76j9j9o3o4J0RN6N6o5o6m1m1nnLLM0M0kjL5L5K0K0j6j6j3j4K2K3j6j7j6j7n5n5J8J8
1892a094L2L2L3L2l7l7l8l7l1l1M1M2%J%Jj6j5j6j5K7K7K6K7opopn2n1K0K1M0L9l3l4m9m9
1887a220K3K4oom2m2N2N2N2N2l7l7%%k4k3M9M9J2J1o0o1j8j8J9J9k3k2k3k2KKLKl6l7L2L1
1882a271k7j00l2M0Q2Qj8j9K3K2K2K3nnnnnnnnK6K6K1K2%p3p3%K8K8L2L3KKKKJ3J3j2K5np8
1877a253p5lJ0J1J5J5J5J5J5J6J8J8J8J8nnnmRJ0n8n9k7M6O2K6j3j2j6j5m9m9K4K3pqM0P6
1873a163M9k4p4l7j8j8j6j6K2K2K2K2k6k7k7k7J6J5J6J6lmlljjjjm5m4rqj1j1J7Q9L4l9l5
1868a352L8lkJKQQQQQPQQm1m2m1m2L8L7L7L8j3j3j3j3j6j5n2n1N9N9j4j3l2l2nO9M6k7n8J4
$$ plain form
1901 -1028 -1028 -1028 -1063 -1099 -1134 -1170 -1167 -1165 -1090 -1014 -1002 -989 -976 -963 -1008 -1052 -1023 -994 -974 -954 -970 -986 -934 -881 -902 -923 -946 -969 -955 -942 -952 -962 -900 -837 -856 -876
1896 -876 -895 -914 -977 -1041 -1031 -1022 -966 -910 -975 -1041 -1082 -1123 -1128 -1133 -1130 -1127 -1087 -1047 -1049 -1050 -1015 -980 -960 -940 -956 -972 -985 -999 -977 -954 -970 -987 -1003 -1020 -1075 -1130 -1112 -1094
1892 -1094 -1062 -1030 -997 -965 -1002 -1039 -1077 -1114 -1145 -1176 -1135 -1093 -1093 -1092 -1092 -1091 -1107 -1122 -1138 -1153 -1126 -1099 -1073 -1046 -1052 -1059 -1065 -1072 -1124 -1175 -1155 -1134 -1094 -1055 -1088 -1122 -1171 -1220
1887 -1220 -1197 -1173 -1179 -1185 -1227 -1269 -1217 -1165 -1113 -1061 -1098 -1135 -1135 -1135 -1159 -1182 -1133 -1084 -1072 -1061 -1121 -1182 -1200 -1218 -1199 -1180 -1203 -1225 -1248 -1270 -1268 -1266 -1263 -1261 -1297 -1334 -1302 -1271
1882 -1271 -1298 -1398 -1430 -1390 -1308 -1300 -1318 -1337 -1314 -1292 -1270 -1247 -1252 -1257 -1262 -1267 -1272 -1277 -1282 -1287 -1261 -1235 -1214 -1192 -1192 -1265 -1338 -1338 -1310 -1282 -1250 -1217 -1215 -1213 -1211 -1209 -1196 -1183 -1195 -1170 -1175 -1253
1877 -1253 -1328 -1331 -1321 -1310 -1295 -1280 -1265 -1250 -1235 -1219 -1201 -1183 -1165 -1147 -1152 -1157 -1162 -1166 -1157 -1147 -1205 -1264 -1291 -1245 -1183 -1157 -1170 -1182 -1198 -1213 -1262 -1311 -1287 -1264 -1271 -1279 -1239 -1163
1873 -1163 -1114 -1138 -1212 -1249 -1267 -1285 -1301 -1317 -1295 -1273 -1251 -1229 -1255 -1282 -1309 -1336 -1320 -1305 -1289 -1273 -1276 -1280 -1283 -1286 -1287 -1288 -1289 -1290 -1335 -1379 -1388 -1396 -1407 -1418 -1401 -1312 -1278 -1317 -1352
1868 -1352 -1314 -1317 -1319 -1318 -1316 -1308 -1300 -1292 -1284 -1276 -1269 -1261 -1253 -1294 -1336 -1377 -1419 -1381 -1344 -1307 -1269 -1282 -1295 -1308 -1321 -1337 -1352 -1404 -1455 -1396 -1337 -1351 -1364 -1396 -1428 -1433 -1364 -1318 -1345 -1403 -1389
1863a389M3M2J1J0K9K9pql6l6l6l7O0O0j3j3L8L8l4l4jjkjj0j0j0j0M5M6J3n9o2o2l1l0j2
1858a480j1K4K5n3n2K0K0O7O7J08L6p4p4L8L8k2r5k6M6N8j4K6K7M2l0j03l1J2J2J2J2R2J8
1854a265o2o2L2L2L2L2rrqrl2l2l7L6O3O2n4n5lmm0m0k6k5J0J0K9K9m4m5J3J3J2J3J3J2J3
1850a405J3k3k2N0N0k1k1k1k1mmmmmlmmL5L5L5L5l1l2l1l2j7j7j7j8L8L7L8L7j4j4j5j4O9
1845a345O8L2L2j0rq3q3j0j0m6m6O6O6ppNNl1l1M5M6k8k7k0j9j9j9l5l5l6l5N4N3N4N4L1L1
1840a349onm6m7K7K6k8k9o5o5j3j4K3K3l1l1M1M2M3M4k9k9MMNMK2K3n1n0poppK5K5m7m8O1
1836a568O1j2j1onooj8j9j9j9J14J13M0M1m7m6m6m7J6J6J6J6ppppL5L4l9l9L3L3L3L3jkkk
1831a354l6l5l6l6PPPPJ1J0J1J0j9k0k0j9K7K7K7K7k8k7k8k7J5J5J5J6k7k8k7k7MMMMMMMM
$$ plain form
1863 -1389 -1346 -1304 -1293 -1283 -1254 -1225 -1232 -1240 -1276 -1312 -1348 -1385 -1325 -1265 -1278 -1291 -1253 -1215 -1249 -1283 -1284 -1285 -1287 -1288 -1298 -1308 -1318 -1328 -1283 -1237 -1224 -1283 -1345 -1407 -1438 -1468 -1480
1858 -1480 -1491 -1467 -1442 -1495 -1547 -1527 -1507 -1440 -1373 -1265 -1229 -1303 -1377 -1339 -1301 -1323 -1418 -1444 -1398 -1340 -1354 -1328 -1301 -1259 -1289 -1392 -1423 -1411 -1399 -1387 -1375 -1283 -1265
1854 -1265 -1327 -1389 -1357 -1325 -1293 -1261 -1270 -1279 -1287 -1296 -1328 -1360 -1397 -1361 -1298 -1236 -1290 -1345 -1348 -1352 -1392 -1432 -1458 -1483 -1473 -1463 -1434 -1405 -1449 -1494 -1481 -1468 -1456 -1443 -1430 -1418 -1405
1850 -1405 -1392 -1415 -1437 -1387 -1337 -1358 -1379 -1400 -1421 -1425 -1429 -1433 -1437 -1441 -1444 -1448 -1452 -1417 -1382 -1347 -1312 -1343 -1375 -1406 -1438 -1455 -1472 -1489 -1507 -1469 -1432 -1394 -1357 -1371 -1385 -1400 -1414 -1345
1845 -1345 -1277 -1245 -1213 -1223 -1232 -1315 -1398 -1408 -1418 -1464 -1510 -1444 -1378 -1385 -1392 -1387 -1382 -1413 -1444 -1399 -1353 -1381 -1408 -1428 -1447 -1466 -1485 -1520 -1555 -1591 -1626 -1572 -1519 -1465 -1411 -1380 -1349
1840 -1349 -1355 -1360 -1406 -1453 -1426 -1400 -1428 -1457 -1522 -1587 -1600 -1614 -1591 -1568 -1599 -1630 -1589 -1547 -1504 -1460 -1489 -1518 -1514 -1510 -1505 -1501 -1479 -1456 -1507 -1557 -1564 -1570 -1577 -1584 -1559 -1534 -1581 -1629 -1568
1836 -1568 -1507 -1519 -1530 -1536 -1541 -1547 -1553 -1571 -1590 -1609 -1628 -1514 -1401 -1361 -1320 -1367 -1413 -1459 -1506 -1490 -1474 -1458 -1442 -1449 -1456 -1463 -1470 -1435 -1401 -1440 -1479 -1446 -1413 -1380 -1347 -1348 -1350 -1352 -1354
1831 -1354 -1390 -1425 -1461 -1497 -1490 -1483 -1476 -1469 -1458 -1448 -1437 -1427 -1446 -1466 -1486 -1505 -1478 -1451 -1424 -1397 -1425 -1452 -1480 -1507 -1492 -1477 -1462 -1446 -1473 -1501 -1528 -1555 -1551 -1547 -1543 -1539 -1535 -1531 -1527 -1523
1826a523J5J6J5J5K5K6m7m7K2K2K2K2nnO8O8kjjkm3m4m4m4L4L3m0m0j6j7j7j7N3N4N4N3M3
1822a295M3p8p8k8k8k8k8L1L1L1L1NNMNl3l4l3l3o2o1J2J1JJJJJ8J9J8J8O0N9j3j4j0j0j0
1817a471j1j4j5j5j5L1L1L1L0j9j9j9k0l5l5L7L8N1N1N1N1k1k2k2k1n2n2n2n2%J%JM3M3M3
1812a449M3klkll7l8l2l3L5J07O7n5q9j7PQllmlK7K8m6j18l8Q4J25N2j5j5j9j9j1j1j1j1j1
1808a515j1j1j1QRQRMLMMQ5Q4J1J2q4q4j2j1L8L8l0l0J2Q6Q1m0j03l0M3M3o4o4RRk9k8k9k8
1803a614OPOPJ4J5J4J5J4J4J5J4POOORQRQl7l8jkj8j8N5N5k5k6J1J1k7k8k7k8M4M3k9k9k6
1798a554k6R5R6m6m5m6m5J5J4Q7Q8l4l3LLk2k3n9n9k5k5k5k4j2j1O2O1l5l5JJL1L1O8O7KJ
1794a458JJM8M9M8M8r0r0n3n4l3l4L9L9LLM0L9j4j5j4j5l2l2M0M1MMMNk3k2N0N1k9l0QPk9
$$ plain form
1826 -1523 -1508 -1492 -1477 -1462 -1437 -1411 -1458 -1505 -1483 -1461 -1439 -1417 -1422 -1427 -1359 -1291 -1293 -1294 -1295 -1297 -1340 -1384 -1428 -1472 -1438 -1405 -1445 -1485 -1501 -1518 -1535 -1552 -1499 -1445 -1391 -1338 -1295
1822 -1295 -1252 -1330 -1408 -1436 -1464 -1492 -1520 -1489 -1458 -1427 -1396 -1391 -1386 -1382 -1377 -1410 -1444 -1477 -1510 -1572 -1633 -1621 -1610 -1609 -1608 -1607 -1606 -1588 -1569 -1551 -1533 -1473 -1414 -1427 -1441 -1451 -1461 -1471
1817 -1471 -1482 -1496 -1511 -1526 -1541 -1510 -1479 -1448 -1418 -1437 -1456 -1475 -1495 -1530 -1565 -1528 -1490 -1439 -1388 -1337 -1286 -1307 -1329 -1351 -1372 -1424 -1476 -1528 -1580 -1580 -1579 -1579 -1578 -1535 -1492 -1449
1812 -1449 -1406 -1408 -1411 -1413 -1416 -1453 -1491 -1523 -1556 -1521 -1414 -1347 -1402 -1491 -1508 -1501 -1493 -1496 -1499 -1503 -1506 -1479 -1451 -1497 -1615 -1653 -1569 -1444 -1392 -1407 -1422 -1441 -1460 -1471 -1482 -1493 -1504 -1515
1808 -1515 -1526 -1537 -1548 -1540 -1531 -1523 -1514 -1510 -1507 -1503 -1499 -1414 -1330 -1319 -1307 -1391 -1475 -1487 -1498 -1460 -1422 -1452 -1482 -1470 -1384 -1303 -1343 -1446 -1476 -1433 -1390 -1454 -1518 -1509 -1500 -1529 -1557 -1586 -1614
1803 -1614 -1608 -1601 -1595 -1588 -1574 -1559 -1545 -1530 -1516 -1502 -1487 -1473 -1466 -1460 -1454 -1448 -1439 -1431 -1422 -1414 -1451 -1489 -1490 -1492 -1510 -1528 -1473 -1418 -1443 -1469 -1458 -1447 -1474 -1502 -1529 -1557 -1513 -1470 -1499 -1528 -1554
1798 -1554 -1580 -1485 -1389 -1435 -1480 -1526 -1571 -1556 -1542 -1455 -1367 -1401 -1434 -1431 -1428 -1450 -1473 -1532 -1591 -1616 -1641 -1666 -1690 -1702 -1713 -1651 -1590 -1625 -1660 -1659 -1658 -1627 -1596 -1528 -1461 -1459 -1458
1794 -1458 -1457 -1456 -1408 -1359 -1311 -1263 -1353 -1443 -1496 -1550 -1583 -1617 -1578 -1539 -1536 -1533 -1493 -1454 -1468 -1483 -1497 -1512 -1544 -1576 -1536 -1495 -1491 -1487 -1483 -1478 -1501 -1523 -1473 -1422 -1451 -1481 -1473 -1466 -1495
1789a495k9l0k9K8K8K7K8J3J2J3J3ononJ0J0J0J0j5j5J7J7J2o1r3r2K0K0K1K0N3N4k0j9k7
1784a511k7RRJJL7L7n2n3K1K0rrqrK8K9K8K8k1k1J6J5m3m4K4K5J0o2l0M2N5j8m4m5N0N1k6
1780a496r8j00k8M8M8%%L6L6ppqpJ5J5J0J0K1n2p9p9m8K6J01J01O0j3rrK0J9n3n4l9m0L3L3
1775a594N0M9J4J3J3J2o0o0M0L9M0M0qpppl1l0l0l1m0m1L2L2J0J1J1J1J0J1J1J1q4q4j1j1
1771a676K7K7K7K7L2L2L1L2j8j8j8j8o1o1J3J2K6K5K6K6k1k2k1k2j2j2O0O0N5N5j8j8L7L7
1767a349L7L6m9m9m9m9NONNPOPOp3p2%Jl6l6L7L7j8j8j8j7L1L2L2L1M2M3l1l1k8k8k9k8RJ0
1762a583J0RnnonnnonL3L2L3L3J9J9n4n4JJ%JK7K6K7K6j6j7j6j7j7j6j7j6l2l1p3JOPJ1J1
1757a668K0K0Q9Q8K2n1j0j0LMLMJ1J1J1J1n7n8J8R1R5K3n3n4l0l0L9L8L0m2jjK2K3J8J8Ro4
$$ plain form
1789 -1495 -1524 -1554 -1583 -1555 -1527 -1500 -1472 -1459 -1447 -1434 -1421 -1427 -1432 -1438 -1443 -1433 -1423 -1413 -1403 -1418 -1433 -1416 -1399 -1387 -1448 -1541 -1633 -1613 -1593 -1572 -1552 -1499 -1445 -1465 -1484 -1511
1784 -1511 -1538 -1529 -1520 -1519 -1518 -1481 -1444 -1496 -1549 -1528 -1508 -1517 -1526 -1534 -1543 -1515 -1486 -1458 -1430 -1451 -1472 -1456 -1441 -1484 -1528 -1504 -1479 -1469 -1531 -1561 -1519 -1464 -1482 -1526 -1571 -1521 -1470 -1496
1780 -1496 -1594 -1694 -1722 -1674 -1626 -1626 -1626 -1590 -1554 -1561 -1568 -1576 -1583 -1568 -1553 -1543 -1533 -1512 -1564 -1643 -1722 -1770 -1744 -1643 -1542 -1482 -1495 -1504 -1513 -1493 -1474 -1527 -1581 -1620 -1660 -1627 -1594
1775 -1594 -1544 -1495 -1481 -1468 -1455 -1443 -1503 -1563 -1523 -1484 -1444 -1404 -1412 -1419 -1426 -1433 -1464 -1494 -1524 -1555 -1595 -1636 -1604 -1572 -1562 -1551 -1540 -1529 -1519 -1508 -1497 -1486 -1570 -1654 -1665 -1676
1771 -1676 -1649 -1622 -1595 -1568 -1536 -1504 -1473 -1441 -1459 -1477 -1495 -1513 -1574 -1635 -1622 -1610 -1584 -1559 -1533 -1507 -1528 -1550 -1571 -1593 -1605 -1617 -1557 -1497 -1442 -1387 -1405 -1423 -1386 -1349
1767 -1349 -1312 -1276 -1325 -1374 -1423 -1472 -1467 -1461 -1456 -1451 -1444 -1438 -1431 -1425 -1498 -1570 -1570 -1569 -1605 -1641 -1604 -1567 -1585 -1603 -1621 -1638 -1607 -1575 -1543 -1512 -1470 -1427 -1458 -1489 -1517 -1545 -1574 -1602 -1593 -1583
1762 -1583 -1573 -1564 -1569 -1574 -1580 -1585 -1590 -1595 -1601 -1606 -1573 -1541 -1508 -1475 -1456 -1437 -1491 -1545 -1544 -1543 -1543 -1542 -1515 -1489 -1462 -1436 -1452 -1469 -1485 -1502 -1519 -1535 -1552 -1568 -1600 -1631 -1704 -1703 -1697 -1690 -1679 -1668
1757 -1668 -1648 -1628 -1539 -1451 -1429 -1480 -1490 -1500 -1497 -1493 -1490 -1486 -1475 -1464 -1453 -1442 -1499 -1557 -1539 -1448 -1353 -1330 -1383 -1437 -1467 -1497 -1458 -1420 -1390 -1432 -1433 -1434 -1412 -1389 -1371 -1353 -1344 -1408
1752a408o4Rl3l3k8k9KKJKK7K6j9N4O5rl5l6l2l2p2%R8R9L0L1k3k3o4Qj8j8j4j4J8J8k7M5
1747a496O5pp6lM4M4p2p2mnmmL9L8l4l4M7M8k5k5J3J3J3J3K7K6K7K6lmmmjjp3p4k8k9J9N6
1742a524M2l1j0K6J8j8KLJ4k2m7K6J39O5n4n5L2J05L2m0o8o7o7o7J0Q3M2M1L7L7l5l6j8j7
1738a422j8j8L0K9j8n5OP9N6J9J6J5J3J4K3K4m9m9k8k8k9k8ppppN5N5j8j7K8K7K8K8K2K1n1
1734a268n1k4k4k4k4j4j5L3P0J9n4n4J8P3L6j1j2L8L8l5l5j3j3j2j3O6O7porqrqJ3J3J2J3
1729a234J7J6n6n6k0j9k0k0O1O1j2j2j3j3rrNP8P7Nk8k9l3l3JJ%JJJ%JK8K8K9K8j4j5j4j4
1724a234j1j2j1j1J1J2n7n6j5N8J8J7Q1Q1Jp3j6j6k0k1l3l2l3l3Q0Q0N2k0o3J0L8L7rrqrk7
1720a253k7k7k7L9L9l4l4L9L9l4l4k3k2j8j8L6J08L5l8J0Rk3r5l4M0L5l8%%nnK5K6K5K6J0
$$ plain form
1752 -1408 -1472 -1463 -1496 -1529 -1557 -1586 -1584 -1582 -1581 -1579 -1552 -1526 -1545 -1491 -1426 -1435 -1470 -1506 -1538 -1570 -1642 -1642 -1544 -1445 -1415 -1384 -1407 -1430 -1494 -1486 -1504 -1522 -1536 -1550 -1532 -1514 -1541 -1496
1747 -1496 -1431 -1438 -1514 -1517 -1473 -1429 -1501 -1573 -1577 -1582 -1586 -1590 -1551 -1513 -1547 -1581 -1534 -1486 -1511 -1536 -1523 -1510 -1497 -1484 -1457 -1431 -1404 -1378 -1381 -1385 -1389 -1393 -1394 -1395 -1468 -1542 -1570 -1599 -1580 -1524
1742 -1524 -1482 -1513 -1523 -1497 -1479 -1497 -1495 -1492 -1478 -1500 -1547 -1521 -1382 -1317 -1371 -1426 -1394 -1289 -1257 -1297 -1365 -1432 -1499 -1566 -1556 -1473 -1431 -1390 -1353 -1316 -1351 -1387 -1405 -1422
1738 -1422 -1440 -1458 -1428 -1399 -1417 -1472 -1466 -1387 -1331 -1312 -1296 -1281 -1268 -1254 -1231 -1207 -1256 -1305 -1333 -1361 -1390 -1418 -1425 -1432 -1439 -1446 -1391 -1336 -1354 -1371 -1343 -1316 -1288 -1260 -1238 -1217 -1268
1734 -1268 -1319 -1343 -1367 -1391 -1415 -1429 -1444 -1411 -1341 -1322 -1376 -1430 -1412 -1339 -1303 -1314 -1326 -1288 -1250 -1285 -1320 -1333 -1346 -1358 -1371 -1305 -1238 -1245 -1251 -1260 -1268 -1277 -1285 -1272 -1259 -1247 -1234
1729 -1234 -1217 -1201 -1257 -1313 -1333 -1352 -1372 -1392 -1331 -1270 -1282 -1294 -1307 -1320 -1329 -1338 -1333 -1255 -1178 -1173 -1201 -1230 -1263 -1296 -1295 -1294 -1294 -1293 -1292 -1291 -1291 -1290 -1262 -1234 -1205 -1177 -1191 -1206 -1220 -1234
1724 -1234 -1245 -1257 -1268 -1279 -1268 -1256 -1313 -1369 -1384 -1326 -1308 -1291 -1210 -1129 -1128 -1201 -1217 -1233 -1253 -1274 -1307 -1339 -1372 -1405 -1325 -1245 -1193 -1213 -1276 -1266 -1228 -1191 -1200 -1209 -1217 -1226 -1253
1720 -1253 -1280 -1307 -1334 -1295 -1256 -1290 -1324 -1285 -1246 -1280 -1314 -1337 -1359 -1377 -1395 -1359 -1251 -1216 -1254 -1244 -1235 -1258 -1353 -1387 -1347 -1312 -1350 -1350 -1350 -1355 -1360 -1335 -1309 -1284 -1258 -1248
1715a248J1N1k1k9l0M0L9P4P5op9l9l9m0l9n3J9R2K0j9j8k3k3lllll3l4l3l3L5L6L8L8Q1J18
1711a084K1n2m7K5k0k0PQPPLLKLqpqqp8p9M3M3L4L4l9l9J2J2J3J2M3M4n3r0j2O1M0MK4O0J0
1706a069o3r1j9QRJ0J0J0J0rrmmO2J35M6p6p4jM6RqK7N0k2m3L1L0m3l8L5L5l8q7j4L6%m8j1
1701a172L9L9K6K6K8K8k7RL4l9r1j8N7N7l6l7l7l6K0K0K0K1KKKKK0K1K1K1l2l1pm3n3K0O9
1697a055L4j3j3j5j6RRRRMNMMK8K8m1m0k2N0N1k2m5m5K3K4j4j3qrKP4J48P4k4k4k9k8JKKJ
1692h81k1k1k1k1RQj8r1k5M8M4k9K6K6K2K2K1K2K2K1kklkJ6J6J6J6k3k2k3k3%Jo6o5k3R9P5
1687h52Lm0L3J02K8j%M0l2p8oP1P1j3j3j3j3m6m6K7K6ONM6k6r2r2K5K5PPM7k5j10j10J5Q7
1682i37J0J0J4J4O6O6L4l8l6l6L2L2o3o4N8N8N6N6N6N5n6n7J7J6n1n1m7m7%P3J08L6m4m4K5
$$ plain form
1715 -1248 -1237 -1186 -1207 -1236 -1266 -1226 -1187 -1113 -1038 -1044 -1123 -1162 -1201 -1241 -1280 -1333 -1314 -1222 -1202 -1221 -1239 -1262 -1285 -1288 -1291 -1294 -1297 -1330 -1364 -1397 -1430 -1395 -1359 -1321 -1283 -1202 -1084
1711 -1084 -1063 -1115 -1162 -1137 -1157 -1177 -1170 -1162 -1155 -1148 -1145 -1142 -1140 -1137 -1145 -1152 -1160 -1168 -1246 -1325 -1282 -1239 -1205 -1171 -1210 -1249 -1237 -1225 -1212 -1200 -1157 -1113 -1166 -1256 -1268 -1207 -1167 -1163 -1139 -1079 -1069
1706 -1069 -1132 -1223 -1242 -1234 -1225 -1215 -1205 -1195 -1185 -1194 -1203 -1207 -1211 -1149 -1014 -968 -1044 -1118 -1119 -1073 -1064 -1072 -1045 -995 -1017 -1060 -1029 -999 -1042 -1080 -1045 -1010 -1048 -1135 -1149 -1113 -1113 -1161 -1172
1701 -1172 -1133 -1094 -1068 -1042 -1014 -986 -1013 -1004 -970 -1009 -1100 -1118 -1061 -1004 -1040 -1077 -1114 -1150 -1130 -1110 -1090 -1069 -1067 -1065 -1063 -1061 -1041 -1020 -999 -978 -1010 -1041 -1048 -1091 -1144 -1124 -1055
1697 -1055 -1021 -1034 -1047 -1062 -1078 -1069 -1060 -1051 -1042 -1038 -1033 -1029 -1025 -997 -969 -1010 -1050 -1072 -1022 -971 -993 -1038 -1083 -1060 -1036 -1050 -1063 -1071 -1080 -1078 -1004 -856 -782 -806 -830 -859 -887 -886 -884 -882 -881
1692 -881 -902 -923 -944 -965 -956 -948 -966 -1057 -1082 -1034 -990 -1019 -993 -967 -945 -923 -902 -880 -858 -837 -839 -841 -844 -846 -830 -814 -798 -782 -805 -827 -850 -873 -873 -872 -938 -1003 -1026 -927 -852
1687 -852 -849 -889 -856 -754 -726 -727 -727 -687 -719 -797 -803 -732 -661 -674 -687 -700 -713 -759 -805 -778 -752 -746 -741 -695 -721 -813 -905 -880 -855 -848 -841 -794 -819 -929 -1039 -1024 -937
1682 -937 -927 -917 -903 -889 -823 -757 -723 -761 -797 -833 -801 -769 -832 -896 -838 -780 -724 -668 -612 -557 -613 -670 -653 -637 -688 -739 -786 -833 -833 -760 -652 -616 -660 -704 -679
1678f79K4OOOOK5K6J03L0k8k8M0M0r1r2n9J3J1J1N2N1m3m4K9K9O8O8M0l2j20m7P7P8l7l7L8
1674d60J12L1m2oO7N5j9K7K7M5M4J18J16N8N9N8N8p5p6p6p5j49j50o9Ll1l1Q7Q8mj25r7k5
1670d57M8M9M9M8mp7p7nJ2J2Q4Q4O5qlmj8j7J9J9n1n0j3j4LMP7P6O6O6K8L0PQR3J66K46L20
1665H81M44M43L78K33j0k53m74m75l53k07k45k45o6o5n3n4J9J9n7n7k6J19O0q6m0L3L1m3m2
1661a91L0O1j2j2O1M8k5k5M8M7k5k4M7M7k5k1N3Q5Q5R0R0J15J14J14J14O6O7N7K03K70K71
1658A823L00L01Q9j53l84m57m43l70k31q5n3n3m4m5KJllqq0j21K3J0J0J8J9L2L3L2L2L4L3
1654B59m0m0r5r4K6K6K9K9O5O5J44J43J43J44K16K16K07K07O1q4j72j72j52j52o4Q1J39J38
1650A273k2k3j42j42j79j78r0r0j7j7l4l4oO7Mo9o4RL4L4L8L9m1m0j6N7L8q3p8M3N0N1J3Q5
$$ plain form
1678 -679 -655 -649 -643 -637 -631 -606 -580 -477 -447 -475 -503 -463 -423 -514 -606 -665 -652 -641 -630 -578 -527 -570 -614 -585 -556 -488 -420 -380 -412 -532 -579 -502 -424 -461 -498 -460
1674 -460 -348 -317 -359 -365 -298 -243 -262 -235 -208 -163 -119 -1 115 173 232 290 348 273 197 121 46 -103 -253 -322 -319 -350 -381 -294 -206 -210 -335 -432 -457
1670 -457 -409 -360 -311 -263 -267 -344 -421 -426 -414 -402 -318 -234 -169 -177 -180 -184 -202 -219 -200 -181 -232 -282 -295 -309 -306 -302 -225 -149 -83 -17 11 41 48 56 149 315 561 881
1665 881 1325 1768 2146 2379 2369 2116 1642 1167 814 607 362 117 51 -14 -67 -121 -102 -83 -140 -197 -223 -104 -44 -130 -170 -137 -106 -149 -191
1661 -191 -161 -100 -112 -124 -63 -15 -40 -65 -17 30 5 -19 28 75 50 29 82 167 252 342 432 547 661 775 889 955 1022 1079 1282 1552 1823
1658 1823 2123 2424 2513 2360 1976 1519 1076 706 475 390 337 284 240 195 197 198 195 192 184 104 -17 6 16 26 44 63 95 128 160 192 226 259
1654 259 219 179 84 -10 16 42 71 100 165 230 374 517 660 804 1020 1236 1443 1650 1711 1627 1455 1283 1131 979 915 996 1135 1273
1650 1273 1251 1228 1086 944 765 587 497 407 390 373 339 305 299 366 370 301 237 246 280 314 352 391 350 310 294 351 389 306 228 271 321 372 385 470
1646D70P6Mk4k4P5P5J02J75J44P0nO8Q0m1j39j38j03j02j43p0L4L5l4l4j4j3n5J8L2L1l6l7
1642D77j4j5j4j5M0M0L6L5pq0j2O0R1J9n0K3K9K8K9K9Lo9p0LL8L8L7L8Q9J7j5j6j0j1n6J7
1638G62N5j8j8N5Q2Rj8j8J9J8J9J8l2l2p3%K0J9k4M9J19jr8r9L7L6L2L2O9nq4q5K1K2K1K2
1633I31O4O5O5O5J0J0ONL9l4POLKKKN0M9N0M9J24J24J48K21K42J20l7j10j18j90j95j23l6
1629A616l7j04j05k2k1o7OM8k4r3j9L9L9k9k9O3O3n3n4O5J37K4K3rrrrO6O5pqNNo7o8R9R9
1625A619J9n4j3j2n8J5J24J24No9j4N8J3J3M5M5p6p7onooK3K2m9n0Q2Q2RRQ2Q3RRK8K9m0m0
1620A972J0Q2M2M2l6l6p6nJ01J01k0r2l3L9poPQPPO6O5j04j05K0J9J9J9M0M0LLM7M8p5p4J09
1616B247J09P2P2M3M3l0l1M9M8k4k5N0N0N0N0K7K6m6m6M0M1l3l2n3n3K1K0J47J46k3k3K8K9
$$ plain form
1646 470 546 550 526 502 577 652 754 929 1073 1143 1138 1206 1286 1245 1106 968 865 763 620 550 584 619 585 551 537 524 469 487 519 550 514 477
1642 477 463 448 434 419 459 499 535 570 563 483 471 531 622 641 591 614 643 671 700 729 732 663 593 596 634 672 709 747 836 853 838 822 812 801 745 762
1638 762 817 799 781 836 918 927 909 891 910 928 947 965 933 901 828 828 848 867 843 892 1011 1010 912 813 850 886 918 950 1019 1014 930 845 866 888 909 931
1633 931 995 1060 1125 1190 1200 1210 1216 1221 1260 1226 1233 1239 1242 1244 1246 1248 1298 1347 1397 1446 1570 1694 1842 2063 2305 2425 2388 2278 2160 1970 1775 1652 1616
1629 1616 1579 1475 1370 1348 1327 1260 1266 1314 1290 1197 1178 1217 1256 1227 1198 1261 1324 1271 1217 1282 1419 1443 1466 1457 1448 1439 1430 1496 1561 1554 1546 1551 1556 1489 1421 1520 1619
1625 1619 1638 1584 1571 1559 1501 1516 1640 1764 1769 1700 1686 1744 1757 1770 1815 1860 1784 1707 1701 1696 1690 1684 1707 1729 1680 1630 1712 1794 1803 1812 1894 1977 1986 1995 2023 2052 2012 1972
1620 1972 1982 2064 2106 2148 2112 2076 2000 1995 2096 2197 2177 2085 2052 2091 2084 2078 2085 2093 2100 2107 2173 2238 2134 2029 2049 2068 2087 2106 2146 2186 2189 2192 2239 2287 2212 2138 2247
1616 2247 2356 2428 2500 2543 2586 2556 2525 2574 2622 2598 2573 2623 2673 2723 2773 2800 2826 2780 2734 2774 2815 2782 2750 2697 2644 2665 2685 2832 2978 2955 2932 2960 2989
1612B989rqnnL1L1M0L9l3l3P0P1klJ56J55j4j5J4J5J4J4Q8Q7l4l3P9Q0PQo8o7ONO3O3O3O4
1607C923L5L6L6L6J29J29m1m1O2O2K6K5K6K5O2O2J64J64M3M2J23J23J59J60J87J87K02K03
1604F349K59N01O33P77J049J582K262L086L978M804N045M221K281m85l281n077n364m540l442
1601A4638k520j822j288r06o64m22k76k69k70j22j21j58j58j74j74j01j01n8n7n8n7pom3m3
1598D763N3N4j9j9P0P0n2n1ooon%%P4P3J8J7J8J8K2K3K2K2RQQRK8K9K9K9PQM4M4L9L9l4l4
1593E415%JP3P3K8K8K7K8m7m8m7m7O5O6O5O6O6O6L0K9m8m7K5K5N6N6K0K0L6L5kjJJJJMNM0
1589F165M0Q3Q3RJ0m2m3L0L0R9R8R9R8j6j7O0O1l2M1M8k5J7J38J40K0kJ20J16nj7N5Q2l9o9
1584G435N2Q9l3o9N3R8K6m7P4J47K5p2JP7P8k9M4Q4J2q3j0P0P0K3R6J04L1k6R5J34J4q3L8
$$ plain form
1612 2989 2980 2972 2967 2962 2993 3024 3064 3103 3070 3037 3107 3178 3176 3173 3329 3484 3470 3455 3469 3484 3498 3512 3600 3687 3653 3620 3699 3779 3786 3794 3726 3659 3665 3670 3733 3796 3859 3923
1607 3923 3958 3994 4030 4066 4195 4324 4283 4242 4304 4366 4392 4417 4443 4468 4530 4592 4756 4920 4963 5005 5128 5251 5410 5570 5757 5944 6146 6349
1604 6349 6608 7109 7742 8519 9568 11150 13412 16498 20476 25280 30325 34546 36827 36342 33061 27984 22620 18080 14638
1601 14638 12118 10296 9008 8102 7438 7016 6740 6471 6201 6079 5958 5800 5642 5468 5294 5193 5092 5034 4977 4919 4862 4855 4849 4806 4763
1598 4763 4816 4870 4851 4832 4902 4972 4920 4869 4863 4857 4851 4846 4846 4846 4920 4993 5011 5028 5046 5064 5086 5109 5131 5153 5162 5170 5178 5187 5215 5244 5273 5302 5309 5317 5361 5405 5444 5483 5449 5415
1593 5415 5415 5416 5489 5562 5590 5618 5645 5673 5626 5578 5531 5484 5549 5615 5680 5746 5812 5878 5908 5937 5889 5842 5867 5892 5948 6004 6024 6044 6080 6115 6113 6112 6113 6114 6115 6116 6120 6125 6165
1589 6165 6205 6288 6371 6380 6390 6348 6305 6335 6365 6464 6562 6661 6759 6743 6726 6786 6847 6815 6856 6904 6879 6896 7034 7174 7194 7192 7312 7428 7423 7406 7461 7543 7504 7435
1584 7435 7487 7576 7543 7474 7527 7625 7651 7604 7678 7825 7850 7778 7779 7856 7934 7905 7949 8033 8045 7962 7952 8022 8092 8115 8211 8315 8346 8320 8415 8549 8563 8480 8518
1580H518J10j0q0M2J33O0o0J3Q8J6m2P9K01P9k5M8J66R3J9R3J56L5p3%J21J21L8L9Q7J4j15
1577I964OJ49P5j9N3J25N3n5J8R8R8k0N3J33J33J9J9J40J40K3K3J04L2q1qJ16J16L1L1J08
1573A1677J09mO9J38J6q9j7J10J09J0Q3J59Q7n8J4J80J07j4j3J51J52J0RJ30J31j0j0J60J59
1569A3555n5n6J15J14kkJ68J68J05J04K74K74O9O9K87K87J08J08J81J81J2J2J34O2q8N8K37
1566A6479K38J24J25K93K94J8J8K37K36l3l2K34K34J01J00K71K71R7R8K19K19M3M3K13K13
1563B0353J70J69M85M85L43L42M64M63K67K67M89M90L94M67Q47J090R99J000J213J286J272
1560C3355J612K457L281M271O067R524J5007K2702L2067L9377L8454K5463L676j8047l1197
1559A88069l3587k8879k2681j8168j5038j1884q646o170m511l202j839j112r40r41o19l77
$$ plain form
1580 8518 8628 8618 8538 8580 8713 8773 8713 8726 8814 8830 8788 8867 9068 9147 9122 9170 9336 9429 9448 9541 9697 9732 9659 9659 9780 9901 9939 9978 10065 10079 9964
1577 9964 9970 10119 10194 10175 10228 10353 10406 10351 10369 10467 10565 10545 10598 10731 10864 10883 10902 11042 11182 11205 11228 11332 11364 11283 11275 11391 11507 11538 11569 11677
1573 11677 11786 11782 11851 11989 12005 11916 11899 12009 12118 12128 12211 12370 12457 12399 12413 12593 12700 12686 12673 12824 12976 12986 12995 13125 13256 13246 13236 13396 13555
1569 13555 13500 13444 13559 13673 13671 13669 13837 14005 14110 14214 14488 14762 14831 14900 15187 15474 15582 15690 15871 16052 16064 16076 16210 16272 16184 16242 16479
1566 16479 16717 16841 16966 17259 17553 17571 17589 17826 18062 18029 17997 18231 18465 18566 18666 18937 19208 19305 19403 19622 19841 19884 19927 20140 20353
1563 20353 20523 20692 21177 21662 22005 22347 22811 23274 23541 23808 24297 24787 25181 25648 26495 27585 28584 29584 30797 32083 33355
1560 33355 34967 37424 40705 44976 51043 60567 75574 98276 130343 169720 208174 233637 237313 219266 188069
1559 188069 154482 125603 102922 84754 69716 57832 49186 43016 38505 35303 33464 32352 31412 30471 29852 29475
1557B9475m64m65j76l1k87m31l07j60l50m23j92m7j41k14K7J49lj25R1K12j5j85j5J54lj24
1553B5950J63L34J05o5J56L26J69M7K35M05K35J6J43K65N9j11J22L40J30q9J14K84O3n8K41
1550B9579N57L93J73L05N22L14J43L77N95L29J4K04M72K38p8R5M11K41K2K40N56L99J80M65
1547C6746Q28P29M61P23J086R62N98P41R58O24O6J4J84k8k95o5L48K51L3L09P70O45K34L39
1544D7261P03N27J64K63O76N67K99M91Q07N25J12L85R44Q51L90M50Q15N88J27L30Q88P77K68
1542E9208M14R71Q69L60N54J209J168P55R83J639J528Q74R26J483J336O31O76J380J414R78
1539G9356J219J946J914J090J022J653J422N97O15J538J698J067J212K232K329J408J286K208
1537A05812K245J227J185K300K791K063K027L046L105K086K122L626M047K931K694M198N024
$$ plain form
1557 29475 29011 28546 28370 28339 28052 27621 27314 27154 26804 26381 26189 26142 26001 25787 25814 25963 25960 25835 25926 26138 26123 25938 25923 26077 26074 25950
1553 25950 26113 26447 26552 26487 26643 26969 27138 27185 27420 27825 28060 28076 28219 28484 28543 28432 28554 28894 29024 28935 29049 29333 29396 29338 29579
1550 29579 30136 30529 30702 31007 31529 31843 31986 32363 32958 33287 33301 33505 33977 34215 34137 34232 34643 34884 34906 35146 35702 36101 36281 36746
1547 36746 37574 38303 38764 39487 40573 41535 42133 42874 43832 44456 44522 44536 44720 44692 44397 44332 44680 44931 44964 45273 46043 46688 46922 47261
1544 47261 47964 48491 48655 48918 49594 50161 50460 50951 51758 52283 52395 52780 53724 54575 54965 55415 56230 56818 56945 57275 58163 58940 59208
1542 59208 59622 60593 61462 61822 62376 63585 64753 65508 66491 68130 69658 70532 71458 72941 74277 74908 75584 76964 78378 79356
1539 79356 80575 82521 84435 85525 86547 88200 89622 90219 90834 92372 94070 95137 96349 98581 100910 102318 103604 105812
1537 105812 108057 109284 110469 112769 115560 117623 119650 122696 125801 127887 130009 133635 137682 140613 143307 147505 152529
1535A52529M392M842O928P890O871O804Q891J0126R203R489J2545J4975J5314J7291K2678
1533C10768K6957K7491K8328L2647L6756L9134M6826O5120Q9225J16448J60837K42506L67238
1532A590281N27131P11202Q91670R97159R25680O13204J00818m62374q90421j059558r74395
1530B970397p52153n31408l80019k83501k06795j42984j01742p8984o0089m1795l1501k9609
1529C29817k8288k4939k3848k5158k3332j7752j3930j3590j2291q748o697p329p222m845l504
1527A08344m523m973l663l074m384m861l356k283l010l528k509j800k527k742j627j014k033
1525E6437k646j724j051j585j949j026l78j009j369o42j81r09j439q09k14p48j265o34m0l79
1522C6440p22r2L64k67r99p57l44p80j242q05k59n02q11l74L8l98q99o56j96m38p59l23Q9
$$ plain form
1535 152529 156921 161763 168691 176581 183452 190256 199147 209273 218476 227965 240510 255485 270799 288090 310768
1533 310768 337725 365216 393544 426191 462947 502081 548907 614027 703252 819700 980537 1223043 1590281
1532 1590281 2117412 2828614 3720284 4717443 5643123 6256327 6357145 5894771 5004350 3944792 2970397
1530 2970397 2218244 1686836 1306817 1023316 816521 673537 571795 492811 432722 390927 359426 329817
1529 329817 301529 276590 252742 227584 204252 186500 172570 158980 146689 137941 131244 123915 116693 111848 108344
1527 108344 103821 98848 95185 92111 87727 82866 79510 77227 74217 70689 68180 66380 63853 61111 59484 58470 56437
1525 56437 53791 52067 51016 49431 47482 46456 46078 45069 43700 43058 42877 41968 40529 39720 39506 38758 37493 36859 36819 36440
1522 36440 35718 35626 35990 35723 34724 33967 33623 32843 31601 30796 30537 30035 29224 28850 28888 28490 27591 26935 26739 26301 25542 25219 25308
1520B5308k50o75l35O5j78n98l55O2k76p02m58j01k47n07j68K51q8n53l10R0n5m64k20J37
1517A9373rm36k90Q6o0l82m3M54L80RRR0l47p87o42k32k32m75l29J1J1k30q4J44kl18j71J83
1513A5681L7l13l13L2j14m27l54m3j16l88l15J2J2k12o7K61J88j74j02K17K17j13j13O0j83
1510A3370o66o65k05n9l73l74l4J12j30j29J46J47k24k23Q7Q8j46k18qpk38k38j3O1j65j64
1507I732N8N9j66j66R6R6j74k47k9M4k09k09O5J38q2j54J12J85op8J36K09k1j43M3M4j64k86
1504H883q8j6k36k36j0O2j05j79N8J79j4j35O2J35r3k14m7P4j09k31q5Q4k4r7L0J03o3j36
1500G552P9Q0j26j26J10K32k7j96r8k5j43j43NJ26m5j66j4N9j18j90J7J86J4j55mJ18p0j92
1497F740lJ66J8j51m9P3n1j73n1O9j6j38o5N6k0j41j9J02mj24lJ18M2p9oJ15M7p3M4J66L6
$$ plain form
1520 25308 25058 24383 24048 24113 23935 23337 22982 23044 22768 22066 21608 21507 21260 20753 20585 20836 20748 20195 19885 19975 19920 19456 19236 19373
1517 19373 19364 18928 18638 18724 18664 18282 18239 18693 19073 19082 19091 19181 18834 18047 17405 17173 16941 16466 16137 16148 16159 15929 15845 15989 15987 15669 15498 15681
1513 15681 15718 15405 15092 15124 15010 14583 14229 14186 14070 13682 13367 13379 13391 13179 13112 13373 13561 13387 13285 13502 13719 13606 13493 13553 13370
1510 13370 12704 12039 11834 11775 11402 11028 10994 11106 10976 10847 10993 11140 10916 10693 10780 10868 10722 10504 10496 10489 10251 10013 10000 10061 9896 9732
1507 9732 9790 9849 9683 9517 9613 9709 9535 9288 9259 9303 9094 8885 8950 9088 9006 8852 8964 9149 9143 9065 9201 9410 9389 9246 9289 9333 9169 8883
1504 8883 8795 8779 8543 8307 8297 8359 8254 8075 8133 8312 8298 8163 8225 8360 8267 8053 8006 8080 7971 7740 7655 7739 7715 7618 7648 7751 7688 7552
1500 7552 7631 7711 7585 7459 7569 7801 7774 7578 7480 7455 7312 7169 7174 7300 7255 7089 7075 7134 7016 6826 6843 7029 7043 6888 6884 7002 6932 6740
1497 6740 6737 6903 6921 6770 6721 6794 6743 6570 6519 6588 6572 6434 6369 6425 6405 6264 6245 6347 6343 6219 6216 6334 6376 6297 6291 6406 6453 6380 6424 6590 6626
1493F626j34l6Q5k1j90j54J6l1j51r1P8N5o8%P2J2j10k7R3kj24m0Q3Nj15n5O6L9q2q3L9kj23
1489E630o6J05Q3l7pO5J3j09j09J3%p3j5J06L4q7K2J44R5k7J0J80K24J51K23K22N7k11k93
1485F343j72j63k84j77qNj16j41K9P7m4l9Q3R0J7J7R0L9q3l2J38J23m7j26nPj14n9J10J59
1482E717j2r0L1Q4l8o8MQ2Qk2J00J11rJ4Q7P9r2j28M2J68R6J7Q9J55Q1J09K31K45P5jJ68K98
1478G631K99K66M37N30M10M18P82J290J702K426M150O742R436J1981J4091J4288J0140J192
1476H8211r216j5907j6368j2604q406n752m173k840j747j195r77o49k85k28l49l35k13k42
1473F725l64l47j78j53j54j34j2l7j58p9R1N1j19j90o8MMl7L6Jj21j49K2P8Op6mkj23j26n
1470D382L3q7j21%J12L9k1k1J1J1k9l0kp4j07J5O1j1j1O2P9m2p9M2R2J9q2j0K7K7nnJ8J8r2
$$ plain form
1493 6626 6492 6456 6541 6520 6330 6176 6192 6161 6010 5919 5997 6052 5984 5984 6056 6068 5958 5931 6024 6022 5898 5858 5941 5946 5831 5776 5842 5881 5799 5716 5755 5753 5630
1489 5630 5564 5669 5752 5715 5708 5773 5786 5677 5568 5581 5581 5508 5493 5599 5633 5546 5568 5712 5807 5780 5790 5970 6194 6345 6568 6790 6847 6636 6343
1485 6343 6171 6008 5724 5547 5539 5544 5428 5287 5316 5393 5349 5310 5393 5483 5500 5517 5607 5646 5563 5531 5669 5792 5745 5619 5614 5621 5507 5448 5558 5717
1482 5717 5705 5615 5646 5730 5692 5624 5628 5710 5718 5696 5796 5907 5898 5912 5999 6078 5986 5858 5900 6068 6164 6181 6270 6425 6506 6615 6846 7091 7166 7165 7333 7631
1478 7631 7930 8196 8633 9163 9573 9991 10773 12063 13765 16191 20341 27083 36519 48500 62591 76879 87019 88211
1476 88211 78995 63088 46720 34116 25710 19958 15785 12945 11198 10003 9026 8377 8092 7864 7515 7180 6967 6725
1473 6725 6361 6014 5836 5683 5529 5395 5383 5346 5188 5109 5200 5251 5132 4942 4874 4878 4882 4845 4881 4882 4761 4612 4634 4712 4718 4642 4638 4636 4513 4387 4382
1470 4382 4415 4328 4207 4207 4319 4358 4337 4316 4327 4338 4309 4279 4277 4203 4096 4111 4172 4161 4150 4212 4291 4249 4170 4212 4304 4323 4241 4231 4258 4285 4280 4275 4293 4311 4219
1465D219r1K8K7J6Q8R5k7q5j1N2k1p7mO6O7K2R5J01k0j21m9O9O9l5l5j%nnM8k5n2P0J40J40
1461D748L8L9O7O7O7O8J12J13P2P2K33J60Q4K28L79L78L88N33R20J259J757K485L403M325
1458B1995M856M856L703J326j674m149n296n149m173l057k138j605j252r13n83m37l74k28
1456E708j73j73j64j63j08j07j69j68k5k5j09j10mmq8q9J3J3p2p2L5L5p4p5Q4Q3p4p5K6K5
1452C901n9o0PQn4n3L6L7m8m8O0O0j%K2K2K2K2J2J3r6r7j1j1j1j1P3P4l5l6j9j8j9j9O1O1
1448C785m8m9M0M1m5m5N7N7K0K1MLl2l3M8M8l7l8ooo7o7J16J17L1L2Q2Q2K1j00j00k7RRM8
1443C971M7o2o2L4L3k7k7N3N2l2l3N0N0l4l5K0J9K0K0L3L4p6p6L9L9L9L9MNn6n6l3l2N2N2
1439D064K4K5l6l6R2R1o6o6O6O7j9j8j7j8j7j7j%j%Q9Q9m4m4O2O2m7m7J3J2J3J3j7j7p0p0
$$ plain form
1465 4219 4128 4156 4183 4199 4287 4382 4355 4270 4259 4311 4290 4213 4209 4275 4342 4364 4459 4560 4540 4419 4370 4439 4508 4473 4438 4437 4437 4432 4427 4475 4450 4398 4468 4608 4748
1461 4748 4786 4825 4892 4959 5026 5094 5206 5319 5391 5463 5696 5856 5940 6168 6547 6925 7313 7846 8766 10025 11782 14267 17670 21995
1458 21995 26851 31707 35410 36736 35062 30913 25617 20468 16295 13238 11100 9495 8243 7330 6747 6310 5936 5708
1456 5708 5535 5362 5198 5035 4927 4820 4651 4483 4458 4433 4324 4214 4210 4206 4118 4029 4042 4055 3983 3911 3946 3981 3907 3832 3916 3999 3925 3850 3876 3901
1452 3901 3842 3782 3789 3797 3743 3690 3726 3763 3715 3667 3727 3787 3786 3786 3808 3830 3852 3874 3886 3899 3803 3706 3695 3684 3673 3662 3735 3809 3774 3738 3719 3701 3682 3663 3724 3785
1448 3785 3737 3688 3728 3769 3724 3679 3736 3793 3813 3834 3838 3841 3809 3776 3824 3872 3835 3797 3791 3785 3718 3651 3767 3884 3915 3947 4029 4111 4132 4032 3932 3905 3914 3923 3971
1443 3971 4018 3956 3894 3928 3961 3934 3907 3960 4012 3980 3947 3997 4047 4013 3978 3998 4017 4037 4057 4090 4124 4048 3972 4011 4050 4089 4128 4132 4137 4081 4025 3992 3960 4012 4064
1439 4064 4088 4113 4077 4041 4133 4224 4158 4092 4158 4225 4206 4188 4171 4153 4136 4119 4118 4118 4117 4117 4206 4295 4251 4207 4269 4331 4284 4237 4250 4262 4275 4288 4271 4254 4184 4114
1435D114J7J39J02j9MLL3L2K1K1q9q8L8L8L8L9M5M6j5j5M0M0M0L9k1k2J5J5Q5Q5%jj7j8j7
1431D767j8M4M4M3M4O2O1O2O1J47J46K32K31K64K65J55J55J98J99J62Q9J40K62K34J61J51
1427H361K24K19J46Q3Q3n5n5n8n8j68j67j52j53j48j48j05l2o5j87k01k00k37k37k00p9j35
1424F276k08j95p4o2o2K2K3P1kjJ22J54Q2J17J90K30K29J69J70Q4Q5J50J50J51J50J56J55
1421H332K16K17J86J87J74N3L4J06P3r7k10j37q7j60k00k00j98j97j41k1k0j42j58j58j66
1418G286j66k45k45j37j36n4n4n5n4k9k9l0k9lklljjL5L5KLO3O3j3j3j4j3K3K4L6l7q0M2J19
1413F285M7K0K1J6J6QRQRj8j7M3M4o8o8M1M1M6M7Q3Q2p8p7N5N6J04J05J9K0m3m2M2M3Q0Q1
1409G060K0K0l8l7K3K3K7K6Q8Q8N2N1N7N6O7J40J13n6j98j25ONl8l9M7M6K1K1J05J06l0l0
$$ plain form
1435 4114 4131 4270 4372 4353 4357 4360 4393 4425 4446 4467 4378 4290 4328 4366 4404 4443 4488 4534 4519 4504 4544 4584 4624 4663 4642 4620 4635 4650 4735 4820 4820 4819 4802 4784 4767
1431 4767 4749 4793 4837 4880 4924 4986 5047 5109 5170 5317 5463 5695 5926 6190 6455 6610 6765 6963 7162 7324 7413 7553 7815 8049 8210 8361
1427 8361 8585 8804 8950 9033 9116 9061 9006 8948 8890 8722 8555 8403 8250 8102 7954 7849 7817 7752 7565 7364 7164 6927 6690 6490 6411 6276
1424 6276 6068 5873 5799 5737 5675 5697 5720 5791 5789 5788 5910 6064 6146 6263 6453 6683 6912 7081 7251 7335 7420 7570 7720 7871 8021 8177 8332
1421 8332 8548 8765 8951 9138 9312 9365 9399 9505 9578 9481 9271 9134 9047 8887 8687 8487 8289 8092 7951 7930 7910 7768 7610 7452 7286
1418 7286 7120 6875 6630 6493 6357 6303 6249 6194 6140 6111 6082 6052 6023 6020 6018 6015 6012 6011 6010 6045 6080 6082 6085 6148 6211 6198 6185 6171 6158 6181 6205 6241 6204 6124 6166 6285
1413 6285 6332 6352 6373 6389 6405 6413 6422 6430 6439 6421 6404 6447 6491 6423 6355 6396 6437 6483 6530 6613 6695 6617 6540 6595 6651 6755 6860 6879 6899 6856 6814 6856 6899 6979 7060
1409 7060 7080 7100 7062 7025 7048 7071 7098 7124 7212 7300 7352 7403 7460 7516 7583 7723 7836 7780 7582 7457 7463 7468 7430 7391 7438 7484 7505 7526 7631 7737 7707 7677
1405G677L0L1j1j1j1j2QPR3R2qqN3N3K0K0K0K0L3L3L3L3R9R9J00R9K8K8J12J13J12J11K7K6
1401I149q4q4N0M9J10J09J46J47n5n4n4n4j5j6j5j5QQR3R3m7m7K6K6L7L8L7L7J9K0R2R1j2
1397I833j2K5K4P0O9O9O9mmO8O9nnJ16J16O6O7J39J39j0j0rj0L7L8J10J10M9M8J22J21M3M3
1393A1591M2M3K4K3K4K3QPJ29J29O9O9L2L2J5J5Q8Q8L0L1J03J03K6K6R9R8O4O3O4O3J11J10
1389A3442J11J10P2P2P2P2M4M5J18J17N9N9J32J32Q1Q1M5M4J8J7J39J39L9L8J12J12Q0Q0J17
1386A5799J16M6M7J19J18M8M8J16J16J01K8O9J91J95J21R8R8J57J57J56J57J29J29J29J29
1382A8617J07J07J43J44J15J15K36K37J98J99J62J62R1R0J71K44K48K47K52K52K26K25K25
1380B2813K25J56J56J88K61K41K41K10K09J63J63J63J63K16K16J48J48J00J72K56L28K69J95
$$ plain form
1405 7677 7707 7738 7727 7716 7705 7693 7701 7708 7801 7893 7885 7877 7930 7983 8003 8023 8043 8063 8096 8129 8162 8195 8294 8393 8493 8592 8620 8648 8760 8873 8985 9096 9123 9149
1401 9149 9065 8981 9031 9080 9190 9299 9445 9592 9537 9483 9429 9375 9360 9344 9329 9314 9322 9330 9423 9516 9469 9422 9448 9474 9511 9549 9586 9623 9642 9662 9754 9845 9833
1397 9833 9821 9846 9870 9940 10009 10078 10147 10143 10139 10207 10276 10271 10266 10382 10498 10564 10631 10770 10909 10899 10889 10880 10870 10907 10945 11055 11165 11214 11262 11384 11505 11548 11591
1393 11591 11633 11676 11700 11723 11747 11770 11778 11785 11914 12043 12112 12181 12213 12245 12260 12275 12363 12451 12481 12512 12615 12718 12744 12770 12869 12967 13031 13094 13158 13221 13332 13442
1389 13442 13553 13663 13735 13807 13879 13951 13995 14040 14158 14275 14334 14393 14525 14657 14738 14819 14864 14908 14926 14943 15082 15221 15260 15298 15410 15522 15602 15682 15799
1386 15799 15915 15961 16008 16127 16245 16293 16341 16457 16573 16674 16702 16771 16962 17157 17278 17376 17474 17631 17788 17944 18101 18230 18359 18488 18617
1382 18617 18724 18831 18974 19118 19233 19348 19584 19821 20019 20218 20380 20542 20633 20723 20894 21138 21386 21633 21885 22137 22363 22588 22813
1380 22813 23038 23194 23350 23538 23799 24040 24281 24491 24700 24863 25026 25189 25352 25568 25784 25932 26080 26180 26352 26608 26936 27205 27400
1377B7400K41K41K57K56K56K56L04L03L03L04L01L01K60L32L46L45L86L86L45L46M18M18M08
1374C4713M08M03M76M38M37N11N10M98M26M66N88O07N35N42O15N81N81O13O86P20O48N84O57
1371D7243P61Q34P98P98Q27Q27R12R84J036J109J227J348J467J540J726J895K009K008K149
1369G1498K319K496K618K767K887K970L091L400L764M116M383M779N385O235P255Q775J0959
1367A49697J4098J8126K2978K8365L3962L8475M0641L9913L7800L6294L5761L3966K9338K4048
1365E83462K2429K6359L2671L6310L5225L1682K8458K5498K0088J0527k307j5166k5038l0423
1363G79775l2065l2138l2566l3198l2080k7858k2787k1283k5391l2233l6825l7262l5782l5344
1362C42963l5673l4459l0117k3567j6991j1605p661m702k252o7J955M042O686J0229J4615
$$ plain form
1377 27400 27641 27882 28139 28395 28651 28907 29211 29514 29817 30121 30422 30723 30983 31315 31661 32006 32392 32778 33123 33469 33887 34305 34713
1374 34713 35121 35524 36000 36438 36875 37386 37896 38394 38820 39286 39874 40481 41016 41558 42173 42754 43335 43948 44634 45354 46002 46586 47243
1371 47243 48004 48838 49636 50434 51261 52088 53000 53984 55020 56129 57356 58704 60171 61711 63437 65332 67341 69349 71498
1369 71498 73817 76313 78931 81698 84585 87555 90646 94046 97810 101926 106309 111088 116473 122708 129963 138738 149697
1367 149697 163795 181921 204899 233264 267226 305701 346342 386255 424055 460349 496110 530076 559414 583462
1365 583462 605891 632250 664921 701231 736456 768138 796596 822094 842182 852709 850402 835236 810198 779775
1363 779775 747710 715572 683006 649808 617728 589870 567083 545800 520409 488176 451351 414089 378307 342963
1362 342963 307290 272831 242714 219147 202156 190551 182890 178188 175936 175869 177824 181866 188552 198781 213396
1360B13396J9612K5139L0816L5414L7402L6554L4273L2799L2266L0445K6030K1067J9951K4494
1358F19658L1337L5097L3690K9699K6544K4132J9133R198m535j8171k7731l2110l2935l3044
1356F79962l4160l5155l3651k8876k3782k2775k7288l4279l8890l9454l8046l7564l7904l6813
1355B11325l2687k6340k0081j5155j1613r110p316n998n077m379l943l597l354l084k841k672
1353E4078k526k399k253k180k035j938j792j728j583j458j457j275j274j161j087r44p98o61
1351B5529o61n30n31m55m54m55m54l93l92l92l92l01l01j80j80j70j70k43k43j85j85j86j85
1348A7891j57j58j57j57m3m2m2m2n3n2n3n2R6R6P0J43L41N83P76J018J190J190J132J132J120
1345B5770J119R85P41N28M55O50R89J203J131R14Q42R00Q28M33j00n45r82j230j230j133j133
$$ plain form
1360 213396 233008 258147 288963 324377 361779 398333 432606 465405 497671 528116 554146 575213 595164 619658
1358 619658 650995 686092 719782 749481 776025 800157 819290 828488 823953 805782 778051 745941 713006 679962
1356 679962 645802 610647 576996 548120 524338 501563 474275 439996 401106 361652 323606 286042 248138 211325
1355 211325 178638 152298 132217 117062 105449 96339 89023 83025 77948 73569 69626 66029 62675 59591 56750 54078
1353 54078 51552 49153 46900 44720 42685 40747 38955 37227 35644 34186 32729 31454 30180 29019 27932 26988 26190 25529
1351 25529 24868 24338 23807 23352 22898 22443 21989 21596 21204 20812 20420 20119 19818 19638 19458 19288 19118 18875 18632 18447 18262 18076 17891
1348 17891 17734 17576 17419 17262 17219 17177 17135 17093 17040 16988 16935 16883 16979 17075 17145 17288 17629 18212 18988 20006 21196 22386 23518 24650 25770
1345 25770 26889 27874 28615 29143 29598 30248 31237 32440 33571 34485 35327 36227 37055 37488 37388 36843 35861 34631 33401 32268 31135
1342C1135j185j184r46o06n54p97j138j381j419j273j236j308j326j180r13o70m58l12k07
1340A3042o1j2j3Q5Q4J88L33N57Q00R87J231J303J157J032J031J106J033P28L89L57O96J042
1337B7095J285J156J010Q62Q61P36K99k56p89j079j223j180j180j168j240j210r68o93o21
1335B1697q69j207j305j305j322j321j345j272j125q82o54n07m34k88j76j04j35j35j72j72
1332F967j72j72q4q5q5q5j15j15j15j15j1j1j1j1r5r4r5r5%%p3p3j4j3j36j35p9p9ooj3j2
1328D762j2j2%%%%m3m2m2m3l0l0l0l1m8m9m8m9J1J0J1J0qqpql6l5l6l6n4n3n4n4k9k8k9k9
1324C791j9k0j9k0jkkkQPQPm6m5m6m5llllo1o0o1o0j8j8j8j8J7J6J7J6j4j3j2j1m6rJ6n7l6
1319C112L6rrk2k2k2k2N0N1k7j01l7jk6k7K4K3K5K6j3K3M9k4r1j8l9p5k3N0K8rn3n3l1o6k0
$$ plain form
1342 31135 29950 28766 27820 27214 26660 25863 24725 23344 21925 20652 19416 18108 16782 15602 14689 14019 13561 13249 13042
1340 13042 12981 12969 12956 13041 13125 13313 13646 14203 15003 15990 17221 18524 19681 20713 21744 22850 23883 24611 25000 25357 26053 27095
1337 27095 28380 29536 30546 31408 32269 33005 33304 33048 32259 31180 29957 28777 27597 26429 25189 23979 23011 22318 21697
1335 21697 20828 19621 18316 17011 15689 14368 13023 11751 10626 9744 9090 8583 8149 7861 7685 7581 7446 7311 7139 6967
1332 6967 6795 6623 6539 6454 6369 6284 6169 6054 5939 5824 5813 5802 5791 5780 5685 5591 5496 5401 5401 5401 5328 5255 5241 5228 5092 4957 4878 4799 4793 4787 4774 4762
1328 4762 4750 4738 4738 4738 4738 4738 4695 4653 4611 4568 4538 4508 4478 4447 4399 4350 4302 4253 4264 4274 4285 4295 4287 4279 4272 4264 4228 4193 4157 4121 4067 4014 3960 3906 3877 3849 3820 3791
1324 3791 3772 3752 3733 3713 3712 3710 3708 3706 3714 3721 3729 3736 3690 3645 3599 3554 3551 3548 3545 3542 3481 3421 3360 3300 3282 3264 3246 3228 3245 3261 3278 3294 3280 3267 3255 3244 3198 3189 3205 3148 3112
1319 3112 3148 3139 3130 3108 3086 3064 3042 3092 3143 3116 3015 2978 2977 2951 2924 2948 2971 2996 3022 3009 3032 3081 3057 2966 2948 2909 2834 2811 2861 2889 2880 2827 2774 2743 2677 2657
1314B657N4J0J0onJ9j7l8L4J2k4rqj1j1l5l4l4l5K0K0K1K0j6j6j5j6l4l4l4l4k2k2k2k2ml
1310B316mmj0rj0rj2j2J3k3j3N9L6%j7j8j7j8jL5N8j5m6j1l5l5pomnj1K5N1k3l1M2J8j7j1
1305B219K6K3j3l7l8L3L3R8R8K3n1m3L0L2m0o0O2J10J10P5P5P9Q0Q1J53K35K34K04K04K03
1301D238K04J30J29O2O1R5J68K00K00J33J33J29J28P3Jl9j12j47j46j51j52j83j83j83j83
1298D605m8m9j45k66k84k12j82j82k28j55j19j19j13m0mmm7K7N8N8K7K7J04J04R3J66K43K42
1295C557K01J29R8R7J00J00J73J73J89J88J89J88J27J26M9M9l1j04j36j37j83j83j37k10k58
1292D354j84j58j57j43j44j03j75k07k07k06k07k39j66q5q5j46j45K4K4l3l3l4l3k7k8k7k8
1289A402l7l6l7l7RQQRl5l4l4l4nmnnn4n5O7O6oppp%jj%o9o8N3N3K7K8K7K7k5k6k5k5k4k4
$$ plain form
1314 2657 2711 2721 2731 2725 2720 2739 2722 2684 2718 2730 2706 2697 2689 2678 2667 2632 2598 2564 2529 2549 2569 2590 2610 2594 2578 2563 2547 2513 2479 2445 2411 2389 2367 2345 2323 2319 2316
1310 2316 2312 2308 2298 2289 2279 2270 2258 2246 2259 2236 2223 2282 2318 2318 2301 2283 2266 2248 2247 2282 2340 2325 2279 2268 2233 2198 2191 2185 2181 2176 2165 2190 2241 2218 2187 2229 2247 2230 2219
1305 2219 2245 2268 2255 2218 2180 2213 2246 2344 2442 2465 2414 2371 2401 2433 2393 2333 2395 2505 2615 2690 2765 2844 2924 3005 3158 3393 3627 3831 4035 4238
1301 4238 4442 4572 4701 4763 4824 4919 5087 5287 5487 5620 5753 5882 6010 6083 6084 6045 5933 5786 5640 5489 5337 5154 4971 4788 4605
1298 4605 4557 4508 4363 4097 3813 3601 3419 3237 3009 2854 2735 2616 2503 2463 2459 2455 2408 2435 2493 2551 2578 2605 2709 2813 2906 3072 3315 3557
1295 3557 3758 3887 3985 4082 4182 4282 4455 4628 4817 5005 5194 5382 5509 5635 5684 5733 5702 5598 5462 5325 5142 4959 4822 4612 4354
1292 4354 4170 4012 3855 3712 3568 3465 3290 3083 2876 2670 2463 2224 2058 1973 1888 1742 1597 1621 1645 1612 1579 1545 1512 1485 1457 1430 1402
1289 1402 1365 1329 1292 1255 1264 1272 1280 1289 1254 1220 1186 1152 1147 1143 1138 1133 1079 1024 1091 1157 1151 1144 1137 1130 1130 1129 1128 1128 1059 991 1044 1097 1124 1152 1179 1206 1181 1155 1130 1105 1081 1057
1283A057M9M9oppok8k8k8k8jjP2P1l6l6l6l6JJJJN5N6j8j7n5n6J8J7J9J9J9J9n3n3K1K0J0
1279A039RJ0Rl8l8l8l8m0l9Q1Q2%J%Jj03j02J8J9K1K2K1K1l3l3l3l4k8k9M4M4LLLLj8j8j8
1274G74j8l1l2Q6Q5J4n9l9kQRJ0J1N0N0N5j8j19j19m3L0j8j7L6P1K5m8o2k6kll7l7j03j02
1270C79k5M8L7Jj0j1LKP6P5N4N4J7J8n6n6n6n6j5j6N7N7m4m5l3LPo7o4RJ3J3O5J02N9j4m4
1265E37m4nnL1L1pqj0rn4r0m0L3L9LK4K4K9m4m6K6J6k1j9J7ll9j6j7qqqqOONOL3L3m0l9K4
1260C35K3K4K4k8k9L9M0J1o1m1mJ9K0K2K1k0k1k1k1JJ%J%JJ%j1j1n2K1M2M2M1M2L1m2p5p4
1255B91J7J7J7J6mmmmqrqrN4N3K2n1n1n0k3M9J5J5j7j7j3j2K4K4nmrrj5q9q8j6M8M8M8M8k3
1250B64r5n9J4M4M4k5k4J9J9J9J9%%%%J5J6k0k1J7J6n6n7qrO0O0M3k9o2o1KLKLonJ8R2M4p7
$$ plain form
1283 1057 1106 1155 1149 1142 1135 1129 1101 1073 1045 1017 1016 1015 1087 1158 1122 1086 1050 1014 1015 1016 1017 1018 1073 1129 1111 1094 1039 983 1001 1018 1037 1056 1075 1094 1041 988 1009 1029 1039
1279 1039 1048 1058 1067 1029 991 953 915 875 836 917 999 999 1000 1000 1001 898 796 814 833 854 876 897 918 885 852 819 785 757 728 772 816 819 822 825 828 810 792 774
1274 774 756 725 693 779 864 878 819 780 778 786 795 805 816 866 916 971 953 834 715 672 702 684 667 703 774 799 751 689 663 661 658 621 584 481 379
1270 379 354 402 439 440 430 419 422 424 500 575 629 683 700 718 662 606 550 494 479 463 520 577 533 488 455 458 465 398 334 343 356 369 434 536 595 581 537
1265 537 493 488 483 514 545 538 530 520 511 457 367 327 360 399 402 426 450 479 435 389 415 431 410 391 408 405 366 350 333 325 317 309 301 307 313 318 324 357 390 350 311 335
1260 335 358 382 406 378 349 388 428 439 378 337 333 352 372 394 415 395 374 353 332 333 334 334 335 335 336 337 337 326 315 263 284 326 368 409 451 482 440 365 291
1255 291 308 325 342 358 354 350 346 342 334 325 317 308 362 415 437 386 335 285 262 311 326 341 324 307 294 282 306 330 325 321 312 303 288 199 111 95 143 191 239 287 264
1250 264 169 110 124 168 212 187 163 182 201 220 239 239 239 239 239 254 270 250 229 246 262 206 149 141 132 192 252 295 266 204 143 145 148 150 153 147 142 160 252 296 219
1245B19m9K3N5j8r3r4M6M5RRK2K3J9J8np8p8nK4K3K8K8K8K8K7K8o6o7o7o6j2j1j2j2L9L9L6
1241H3L5M1l2q5m7nnklJ1J0j3K1N2k0l7%N7K0k9l0j4j2j4j4KK%%k2n9m8K5N7j7o4k8Q0P9O
1236a9o7l1M1J9j8j2K4P3P4JJl5l5l2l3l3l3J0RQPJ7j9qO5M2k9r8k6L7L6MNlkklK9K8m4m5
1231i7lmlmj4j4j4j5J7J6J6J6k8k8k7k8L8L8P0O9N6j6m7m8n1n0k3N0O5po0k3M7k6p6m0O8O9
1226a11lkN1N0J4J2klp4p5j9j9J7J7J3J2o0o0klL4L4Q1Q1m0m0M0M1l2l2J3J4J3J3J8J6n5n6
1222a04PPk9l0n7n6J6J6M0M0NMK5K5m7m8J2J2k4k5P1P0klK5K4m9m8%Jp2p2K3K2N9O0L0L0m2
1217h4m3K3K3j4j4k9l0o5o6j1j0K6K7M4M4k8k8j5j4j4j4J1J2J1J2NMNNMNNNK1K1K1K1k4k3
1212a71k4k3N3N2J7J7o6o7PPm4m5MM0K0n1n2K1Q3M6m9n0J6J7J6J6pqpqOOOOjjm8q5o7Oj2m9
$$ plain form
1245 219 170 193 248 230 137 43 89 134 143 152 174 197 216 234 229 151 73 68 92 115 143 171 199 227 254 282 216 149 82 16 4 -7 -19 -31 8 47 83
1241 83 118 159 127 42 -5 -10 -15 -17 -20 -9 1 -12 9 61 41 4 4 61 81 52 22 8 -4 -18 -32 -30 -28 -28 -28 -50 -109 -157 -132 -75 -92 -156 -184 -104 -25 -19
1236 -19 -86 -117 -76 -57 -75 -87 -63 10 84 85 86 51 16 -16 -49 -82 -115 -105 -96 -88 -81 -64 -83 -91 -26 16 -13 -111 -137 -100 -64 -60 -55 -58 -60 -62 -65 -36 -8 -52 -97
1231 -97 -100 -104 -107 -111 -125 -139 -153 -168 -151 -135 -119 -103 -131 -159 -186 -214 -176 -138 -68 1 57 41 -6 -54 -105 -155 -178 -128 -63 -70 -130 -153 -106 -132 -208 -248 -180 -111
1226 -111 -114 -116 -65 -15 -1 11 9 6 -68 -143 -162 -181 -164 -147 -134 -122 -182 -242 -244 -247 -213 -179 -98 -17 -57 -97 -57 -16 -48 -80 -67 -53 -40 -27 -9 7 -48 -104
1222 -104 -97 -90 -119 -149 -206 -262 -246 -230 -190 -150 -145 -141 -116 -91 -138 -186 -174 -162 -186 -211 -140 -70 -72 -75 -50 -26 -75 -123 -123 -122 -194 -266 -243 -221 -162 -102 -72 -42 -84
1217 -84 -127 -104 -81 -95 -109 -138 -168 -233 -299 -310 -320 -294 -267 -223 -179 -207 -235 -250 -264 -278 -292 -281 -269 -258 -246 -241 -237 -232 -227 -223 -218 -213 -208 -187 -166 -145 -124 -148 -171
1212 -171 -195 -218 -165 -113 -96 -79 -145 -212 -205 -198 -242 -287 -283 -243 -223 -274 -326 -305 -222 -176 -225 -275 -259 -242 -226 -210 -217 -225 -232 -240 -234 -228 -222 -216 -217 -218 -266 -351 -418 -412 -424 -473
1207d73l6L7J8j8J6Q9R1J8j3N9N9j3p8nM3Ol1l2L9L9L5L4l8l9j6j7j7j6k1k1j7j7J0Q3O3K6
1203a53mlL7l5p9m3K8ro3k6M7Q3M0l3o2o2j7j7N1N2J8n5l4KL6L6l4l4J0Rn8n9L0J03Q0M4N2
1198a22J6o2r8l7L6J5k1j8J7M1l2j03l0M6M6L7L7l6l5L5L6l7l8K7K7K7K7m5m4m5m4K2K3K2
1194c10K3mllmm9n0K3K3mnmmOOP9P9%%%Jo4o3J0RM3M3M3M3K7K8m6m5n5n5J8J8j6j6j7j6OO
1189b99POJ1J1J0J1KKKJJ6J6J5J6j00r9K1K2M1M1l2l2k1k2k1k1qpO5O6ooonK5K6K6K5K6K6
1184a49K5K6k8k9k8k8j5j4j5j4L4L4l9l9LKKLnnonNMMMJ0J0J1J0l2l2l2l2K1K2K1K2k6k5k6
1179c51k5K7K6m6m7K5K5K5K5%j%%l7l7L6L6m8m7K5K6PPPPJ7J6J7J7J1J2J2J2J4J3o0o0m1m2
1174c97L2L1NMNMrrrrk5k5k6k5J7J7J7J7qqrqqqrqL5L6L5L5J8J7J7J7k8k7k8k7J5J5J5J5k7
$$ plain form
1207 -473 -509 -472 -454 -472 -456 -367 -276 -258 -271 -212 -153 -166 -244 -249 -206 -200 -231 -263 -224 -185 -150 -116 -154 -193 -209 -226 -243 -259 -280 -301 -318 -335 -325 -242 -179 -153
1203 -153 -157 -160 -123 -158 -237 -280 -252 -261 -324 -350 -303 -220 -180 -213 -275 -337 -354 -371 -320 -268 -250 -305 -339 -337 -301 -265 -299 -333 -323 -314 -372 -431 -401 -298 -218 -174 -122
1198 -122 -106 -168 -266 -303 -267 -252 -273 -291 -274 -233 -265 -368 -398 -352 -306 -269 -232 -268 -303 -268 -232 -269 -307 -280 -253 -226 -199 -244 -288 -333 -377 -355 -332 -310
1194 -310 -287 -291 -294 -297 -301 -350 -400 -377 -354 -358 -363 -367 -371 -365 -359 -280 -201 -201 -201 -201 -200 -264 -327 -317 -308 -265 -222 -179 -136 -109 -81 -127 -172 -227 -282 -264 -246 -262 -278 -295 -311 -305 -299
1189 -299 -292 -286 -275 -264 -254 -243 -241 -239 -237 -236 -220 -204 -189 -173 -273 -372 -351 -329 -288 -247 -279 -311 -332 -354 -375 -396 -404 -411 -346 -280 -286 -292 -298 -303 -278 -252 -226 -201 -175 -149
1184 -149 -124 -98 -126 -155 -183 -211 -226 -240 -255 -269 -235 -201 -240 -279 -276 -274 -272 -269 -274 -279 -285 -290 -285 -281 -277 -273 -263 -253 -242 -232 -264 -296 -328 -360 -339 -317 -296 -274 -300 -325 -351
1179 -351 -376 -349 -323 -369 -416 -391 -366 -341 -316 -316 -317 -317 -317 -354 -391 -355 -319 -367 -414 -389 -363 -356 -349 -342 -335 -318 -302 -285 -268 -257 -245 -233 -221 -207 -194 -254 -314 -355 -397
1174 -397 -365 -334 -329 -325 -320 -316 -325 -334 -343 -352 -377 -402 -428 -453 -436 -419 -402 -385 -393 -401 -410 -418 -426 -434 -443 -451 -416 -380 -345 -310 -292 -275 -258 -241 -269 -296 -324 -351 -336 -321 -306 -291 -318
1169c18k7k7k7l8l7L5L5QQPQPQQPj9k0N3N4L9M0l3l3l4l4L9L9k0k0k0k1J0RQ2Q3l0l0L8L8
1164a33J4n9n9J4nm%%n9n9k7M5J9J8K3K3J6J6J7J6l8l9l8l8qqqropO6O7mlllL8L8l5l5l3l2
1159c22M0M0j%jjk8k9M4M4l3l4jP1j2j2qqp2p1QQ2P7P8N0k3j09j10q2rJ5J5K0J9J5J5J5J5
1154c03jj%jj4j5j4j4m3m3j0O2K2K3K2K3Lp0k9k9MNP2P3M6k7RRM5k9l3M0J13M1p9p9m0L3q
1149b37qo8o8J2Q5L1L0L5L5J8J7J7J7m5m5m4m5rqO2O2m1p7K0R2K2n1m8K4M7J0J3M9K0j7o7
1145a60o7p3p4KP5P1kM4M4qqqqk2k2k2k1j9j8L0O6K0n4n5J7O3j0p8oN1N0N0N1K4m8n1K3J5
1140a38k1k1J5Qo5o5PL0pmL2J4k3k2J3J4k3k4J4K6j0l3M0J03K9m5m6J6J7n7n6qpppJ8J9J9
1136b55J8N7N8N7N7l4l3l4l4K9K9MM0L3m0r0n4N6N6rj0MP6P6Mo4o4MLJ8J7J7J7k1k2k2k1m
$$ plain form
1169 -318 -345 -372 -399 -437 -474 -439 -404 -396 -388 -381 -373 -366 -358 -350 -343 -362 -382 -329 -275 -236 -196 -229 -262 -296 -330 -291 -252 -272 -292 -312 -333 -323 -314 -232 -149 -179 -209 -171 -133
1164 -133 -119 -178 -237 -223 -228 -232 -232 -232 -291 -350 -377 -332 -313 -295 -272 -249 -233 -217 -200 -184 -222 -261 -299 -337 -345 -353 -361 -370 -376 -383 -317 -250 -254 -257 -260 -263 -225 -187 -222 -257 -290 -322
1159 -322 -282 -242 -243 -243 -244 -245 -273 -302 -258 -214 -247 -281 -282 -211 -223 -235 -243 -251 -323 -394 -386 -304 -227 -149 -99 -122 -231 -341 -423 -432 -417 -402 -382 -363 -348 -333 -318 -303
1154 -303 -304 -305 -305 -306 -320 -335 -349 -363 -406 -449 -459 -397 -375 -352 -330 -307 -304 -374 -403 -432 -428 -423 -351 -278 -232 -259 -250 -241 -196 -225 -258 -218 -105 -64 -143 -222 -262 -229 -237
1149 -237 -245 -313 -381 -369 -284 -253 -223 -188 -153 -135 -118 -101 -84 -129 -174 -218 -263 -272 -280 -218 -156 -197 -274 -254 -162 -140 -191 -239 -215 -168 -158 -145 -96 -76 -93 -160
1145 -160 -227 -300 -374 -372 -297 -226 -228 -184 -140 -148 -156 -164 -172 -194 -216 -238 -259 -278 -296 -266 -200 -180 -234 -289 -272 -209 -219 -297 -303 -252 -202 -152 -101 -77 -125 -176 -153 -138
1140 -138 -159 -180 -165 -157 -222 -287 -280 -250 -257 -261 -229 -215 -238 -260 -247 -233 -256 -280 -266 -240 -250 -283 -243 -140 -111 -156 -202 -186 -169 -226 -282 -290 -297 -304 -311 -293 -274 -255
1136 -255 -237 -180 -122 -65 -8 -42 -75 -109 -143 -114 -85 -81 -41 -8 -48 -138 -192 -136 -80 -89 -99 -95 -19 57 61 -3 -67 -63 -60 -42 -25 -8 9 -12 -34 -56 -77 -81
1131h1lmlPPPPM4M2k8k9N9O0j3j2j4j4j5j4k6k7M5M5P3P2m8m9j2j3j2j3k0j9k0k0K0J9J9K0
1126C7k6k5M6M7M5M4k8k8J3J3J2J3M6M5k7k7J3J4J4J3l5l6l5l6j0j0j0rJ4J4n8n8QPRQN0M9
1122A16k2k3j%%%M8M8M8M8r1r1j9j9P2P2m9m9K3K4K3K3N5N5N5N5l6l7l6l6kkkkl2l3l2l2j7
1117A02j6j6j6j7j6j6j5%J%Jj5j5N7N9K4K5m8m8llklJ5J5J4J5J0J1J0J0N7N7j6j6PPo6o6O6
1112A50O6ppM0M1l3l3J9J8J8J8J3J4J3J4j0rrj0rrrj0J4J4J4J4k1k1k1k1L5L5l8l8k7k7k7
1107A54k7K9L0K9K9L0K9L0K9mlmll4l4l4l4N7N7N7N7k2k2k2k2J1J0J1J1%%%%Q5Q5q0q0J2Q6
1102E03M4p7q6j3J2J2K9L0m3m3l3l3k8k9J7R0M9M9llmlmllmK2K1K1K1O2O2j0j1J5J6N6j6k2
1098F60k3k7k7rrrrnnmnk8k8M0M0R0J8o3o3KLLKL2L1No9k8M5%%poO6O7O5O5j1q3p9oP0P0K0
$$ plain form
1131 -81 -84 -88 -91 -84 -77 -70 -63 -19 23 -5 -34 25 85 72 60 46 32 17 3 -23 -50 -5 40 113 185 137 88 76 63 51 38 18 -1 -21 -41 -21 -2 17 37
1126 37 11 -14 32 79 124 168 140 112 125 138 150 163 209 254 227 200 213 227 241 254 219 183 148 112 102 92 82 73 87 101 43 -15 -7 0 9 17 67 116
1122 116 94 71 70 70 70 70 118 166 214 262 171 80 61 42 114 186 137 88 111 135 158 181 236 291 346 401 365 328 292 256 254 252 250 248 216 183 151 119 102
1117 102 86 70 54 37 21 5 -10 -10 -9 -9 -8 -23 -38 19 78 102 127 79 31 28 25 23 20 35 50 64 79 89 100 110 120 177 234 218 202 209 216 150 84 150
1112 150 216 209 202 242 283 250 217 236 254 272 290 303 317 330 344 334 325 316 306 297 288 279 269 283 297 311 325 304 283 262 241 276 311 273 235 208 181 154
1107 154 127 156 186 215 244 274 303 333 362 358 355 351 348 314 280 246 212 269 326 383 440 418 396 374 352 363 373 384 395 395 395 395 395 480 565 485 405 417 503
1102 503 547 470 384 371 383 395 424 454 411 368 335 302 274 245 262 352 401 450 447 444 440 437 433 430 427 423 445 466 487 508 570 632 622 611 626 642 698 682 660
1098 660 637 610 583 574 565 556 547 542 537 533 528 500 472 512 552 642 660 597 534 536 539 542 544 576 607 612 543 515 560 560 560 553 547 613 680 745 810 799 716 637 631 701 771 791
1092G91K0K0K0L1L1m2m2m6m6K6K7PPPQP0P0L9l4o5o4LML3L4Oo7o2J1L8L8l2l2l2l2j9j8N4
1088G62N4O2O2j0j1N7N8j6j5j3j3rrj1O1O1j1k6k5M3M3k8k8k9k8M7M8M7M7qppqmlmmmmlmL0
1083A140L1L1L0L0K9m4m3j5j4j4j4lkK2j4PQ0P8OQQMMJ3J3J4J3P7P7jp3m0lk6k6PM4jp4p6
1078A283M6Q8J6l8jM6M6l4l4L9L8M6M7J9n4n4K0R5R6M2M2l1l0p0p1LK%jj%M0M1M0M1j4j4j4
1073A715j4N5N6N6N5j1j1j1j1rqrqo4o3J0RJ6J6Q3Q4O3j0m2m2KKJKJ6J5J6J5PPPPJ7J7n5n5
1068A926M4M4M5M4L5L6L5L5J4J4n9n9j3j3j3j4llO9P0O6O7O6O7M7M7k6k5m4m4K9K9L2L1L2
1064B608L1jkkkN1N1p1p1K3K4K3K3K1K1lp5m1Q0J21M9l2l2l7l6j1j0O2O2n7n7O4O4N5N5N5
1059C003N6L8L8L9L8mmmmonooQ5Q5Q5Q6M3M3M3M3M8M7M8M8L9L9J12J12O5O5J38J38J17J16
$$ plain form
1092 791 811 831 851 882 913 871 829 783 737 763 790 797 804 811 819 889 959 998 964 899 835 838 842 875 909 915 848 786 797 835 873 841 809 777 745 726 708 762
1088 762 816 878 940 930 919 976 1034 1018 1003 990 977 968 959 948 1009 1070 1059 1033 1008 1051 1094 1066 1038 1009 981 1028 1076 1123 1170 1162 1155 1148 1140 1136 1133 1129 1125 1121 1117 1114 1110 1140
1083 1140 1171 1202 1232 1262 1291 1247 1204 1189 1175 1161 1147 1144 1142 1164 1150 1157 1237 1315 1321 1329 1337 1341 1345 1358 1371 1385 1398 1475 1552 1551 1478 1438 1435 1409 1383 1390 1434 1433 1359 1283
1078 1283 1329 1417 1433 1395 1394 1440 1486 1452 1418 1457 1495 1541 1588 1607 1553 1499 1519 1614 1710 1752 1794 1763 1733 1663 1592 1595 1597 1597 1596 1595 1595 1635 1676 1716 1757 1743 1729 1715
1073 1715 1701 1756 1812 1868 1923 1912 1901 1890 1879 1870 1862 1853 1845 1781 1718 1728 1737 1753 1769 1852 1936 1999 1989 1947 1905 1907 1909 1910 1912 1928 1943 1959 1974 1981 1988 1995 2002 2019 2036 1981 1926
1068 1926 1970 2014 2059 2103 2138 2174 2209 2244 2258 2272 2213 2154 2141 2128 2115 2101 2098 2095 2164 2234 2300 2367 2433 2500 2547 2594 2568 2543 2499 2455 2484 2513 2545 2576 2608
1064 2608 2639 2638 2636 2634 2632 2683 2734 2663 2592 2615 2639 2662 2685 2706 2727 2724 2649 2608 2688 2809 2858 2826 2794 2757 2721 2710 2700 2762 2824 2767 2710 2774 2838 2893 2948 3003
1059 3003 3059 3097 3135 3174 3212 3208 3204 3200 3196 3190 3185 3179 3173 3258 3343 3428 3514 3557 3600 3643 3686 3734 3781 3829 3877 3916 3955 4067 4179 4244 4309 4447 4585 4702 4818
1055D818J57K29K96M17O01P22Q28Q28Q49P76N97J61k99p35r56r55q86p40o19m73l12j67j60
1052D977j60k9k9JJJJlmlmL9L9L9L9RRRRm1m1m1m2N2N1J24J25J10J11L7L8J54J54K36K35L30
1048F533M75N64N63O27O27P33P33N76L32L9l01o10q53q42p70p46o01m45l00j65j65q3q3k6
1045E812k5k6k6K7K7K6K7p7p6mll1l1M1M2k5k5k5k5p0p1p0p1J6J5J6J6j08j08J4J3M1M1l2
1041E245l2J6J6J6J6L5L4L4L5j0j0O2O3K2K2K1K2K3K4K3K3L7L6J10J10J51J50J51J51J06J05
1037F807J06J05k9k9J8N5j5q8r1j8j0q4q3j0K8m5r2n6j9j9j6j6ppO5O6K9L0L0K9J8J9pK9M2
1033F735l1l0M4K9K8L3L3L2L2L2L2L5L4RM6L3l9l5L8J29J64J49J49J69J69M7M8J%M2l2q0q0
1029G965j2j2RRRRj5j5O0J34N1k1k1N2L0m1l8L6R8R7K8K7L3lk4N0J09J09M1M0RRRRP5P6LK
$$ plain form
1055 4818 4975 5204 5500 5917 6518 7240 8068 8896 9745 10521 11118 11279 10980 10245 9289 8334 7448 6708 6089 5616 5304 5137 4977
1052 4977 4817 4788 4759 4760 4761 4762 4763 4760 4756 4753 4749 4788 4827 4866 4905 4914 4923 4932 4941 4900 4859 4818 4776 4828 4879 5003 5128 5238 5349 5386 5424 5578 5732 5968 6203 6533
1048 6533 7008 7572 8135 8762 9389 10122 10855 11431 11763 11802 11501 10891 10038 9196 8426 7680 7079 6634 6334 6169 6004 5921 5838 5812
1045 5812 5787 5761 5735 5762 5789 5815 5842 5765 5689 5685 5682 5651 5620 5661 5703 5678 5653 5628 5603 5533 5462 5392 5321 5337 5352 5368 5384 5276 5168 5182 5195 5236 5277 5245
1041 5245 5213 5229 5245 5261 5277 5312 5346 5380 5415 5405 5395 5457 5520 5542 5564 5585 5607 5630 5654 5677 5700 5737 5773 5883 5993 6144 6294 6445 6596 6702 6807
1037 6807 6913 7018 6989 6960 6978 7033 7018 6930 6839 6821 6811 6727 6644 6634 6662 6617 6525 6469 6450 6431 6415 6399 6392 6385 6450 6516 6545 6575 6605 6634 6652 6671 6664 6693 6735
1033 6735 6704 6674 6718 6747 6775 6808 6841 6873 6905 6937 6969 7004 7038 7047 7093 7126 7087 7052 7090 7219 7383 7532 7681 7850 8019 8066 8114 8115 8115 8157 8125 8045 7965
1029 7965 7953 7941 7950 7959 7968 7977 7962 7947 8007 8141 8192 8171 8150 8202 8232 8191 8153 8189 8287 8384 8412 8439 8472 8469 8445 8495 8604 8713 8754 8794 8803 8812 8821 8830 8905 8981 8984 8986
1024H986L9M0L9L9N3N2N3N3Q9Q9Q9Q9J10J10j1j1M4M4J65J66Q5Q6J3J2N5N5J8J9J4J3N1N0
1020A0798M3M3M3M3P0P1lkK5K6O2O1L0L0O7O6O8O7nnO3O3K6K7R1R2J64J64J24J24N1N2R9R9
1016A2837J73J72O6O6K9L0J36J37J00R9M3M2J15J15J26J26N3N3Q8Q9N2N2M9M8M9M9J02J01
1012A5197O6O5N5N6J28J29J43J43J07J08J19J19M6M6O7O7O7O6J15J14J15J15J52J52J53J52
1009A7862K31K31J58J58J49J48P6P7J46J47J47J47J43J42J43J42K23K23K24K23L14L14L14
1007B2082L14K78K77K78K77K75K74J53J53J50J50P6P7J63J63J62J63K54K53K17K18K56K55
1004B6918J84J83J70J70K92K91L03L02K29K30L02L03L02L03M13M13L41L40L64L63K91K91L27
1001C3625L27L27L27M38M37M38M37N45N45N46N45N77N77O50O49O94O94O21O21O86O87N66M94
$$ plain form
1024 8986 9025 9065 9104 9143 9196 9248 9301 9354 9443 9532 9621 9710 9820 9930 9919 9908 9952 9996 10161 10327 10412 10498 10511 10523 10578 10633 10651 10670 10684 10697 10748 10798
1020 10798 10841 10884 10927 10970 11040 11111 11108 11106 11131 11157 11219 11280 11310 11340 11407 11473 11541 11608 11603 11598 11661 11724 11750 11777 11868 11960 12124 12288 12412 12536 12587 12639 12738 12837
1016 12837 13010 13182 13248 13314 13343 13373 13509 13646 13746 13845 13888 13930 14045 14160 14286 14412 14465 14518 14606 14695 14747 14799 14848 14896 14945 14994 15096 15197
1012 15197 15263 15328 15383 15439 15567 15696 15839 15982 16089 16197 16316 16435 16481 16527 16594 16661 16728 16794 16909 17023 17138 17253 17405 17557 17710 17862
1009 17862 18093 18324 18482 18640 18789 18937 19013 19090 19236 19383 19530 19677 19820 19962 20105 20247 20470 20693 20917 21140 21454 21768 22082
1007 22082 22396 22674 22951 23229 23506 23781 24055 24208 24361 24511 24661 24737 24814 24977 25140 25302 25465 25719 25972 26189 26407 26663 26918
1004 26918 27102 27285 27455 27625 27917 28208 28511 28813 29042 29272 29574 29877 30179 30482 30895 31308 31649 31989 32353 32716 33007 33298 33625
1001 33625 33952 34279 34606 35044 35481 35919 36356 36901 37446 37992 38537 39114 39691 40341 40990 41684 42378 42999 43620 44306 44993 45559 46053
998D6053N27O72P56P56Q26Q25Q26Q25R01R00R01R00J070J069J043J042J073J219J276J347
996F4807J499J644J703J704J906K149K419K565K866L303L649M086M508M946N235N308N277
994A19574N132M892M820N252N979O773P598Q425R154R632J0264J1613J3991J7612K2999L0940
992B94650M2053N7484P9272J08315J42429J76099K01964K11112J91362J32281L6151p5006
990A598166j67836k17551k21579j95033j56940j19787q8779o4944m7620l5039k5772j9010
989B38276j4304j0998q718p380o846o633o197n535m613l564k253q70K45J174J902K485K727
987A68898K679K533K652L185M144N454P014Q421R689J0902J2267J4062J6756K0977K7109L5796
985C52538M7471O2855Q2498J06325J32722J57520J74812J77383J58326J13632M5296l6567
$$ plain form
998 46053 46580 47252 48008 48764 49590 50415 51241 52066 52967 53867 54768 55668 56738 57807 58850 59892 60965 62184 63460 64807
996 64807 66306 67950 69653 71357 73263 75412 77831 80396 83262 86565 90214 94300 98808 103754 108989 114297 119574
994 119574 124706 129598 134418 139670 145649 152422 160020 168445 177599 187231 197495 209108 223099 240711 263710 294650
992 294650 336703 394187 473459 581774 724203 900302 1102266 1313378 1504740 1637021 1673172 1598166
990 1598166 1430330 1212779 991200 796167 639227 519440 430661 365717 318097 283058 257286 238276
989 238276 223972 212974 204256 196876 190030 183397 177200 171665 167052 163488 161235 160365 160610 161784 163686 166171 168898
987 168898 171577 174110 176762 179947 184091 189545 196559 204980 214669 225571 237838 251900 268656 289633 316742 352538
985 352538 400009 462864 545362 651687 784409 941929 1116741 1294124 1452450 1566082 1611378 1574811
983A574811j15452j74411k03013k01411j78192j44951j11411q2829o0640m4288l2437k4041
982B01735j8104j3881j1116r514q851q704q847q847q711q177p421o403n365m444l644l111
980F6595k790k643k741k887l004l005k835k690k487k147j818j576j456j382j276j130j022
978B9706q77q36q36q26q27p55p54n85n85m56m56m56m56l83l84l79l79l24k52j71j71k20k19
975A8119k25k24k58l30l62l63l36l36l04k31j83j83j78j78j58j58k31k31k08k08k09k08j63
972A2654j63j63j63j64j63j58j59j26n4n4j26j84j84j89j88j28j29j28j29n7n7j30j30o3o3
969I402o3o3j8j8j7j8M7M7k6k5l4l3j57k31j58q6j26j27j19m6j4j5k0j9r6j69j42p0p0j43
965G373j19m6q8q7l7L5L6l7k7k7l2l1j8j8K3m9j34j33j38j38m7m7m7m7l6l5l6l6m0m0m0m0
$$ plain form
983 1574811 1459359 1284948 1081935 880524 702332 557381 445970 363141 302501 258213 225776 201735
982 201735 183631 169750 158634 149120 140269 131565 122718 113871 105160 96983 89562 83159 77794 73350 69706 66595
980 66595 63805 61162 58421 55534 52530 49525 46690 44000 41513 39366 37548 35972 34516 33134 31858 30728 29706
978 29706 28829 27993 27157 26331 25504 24749 23995 23410 22825 22369 21913 21457 21001 20618 20234 19855 19476 19152 18900 18729 18558 18338 18119
975 18119 17894 17670 17412 17082 16720 16357 16021 15685 15381 15150 14967 14784 14606 14428 14270 14112 13881 13650 13442 13234 13025 12817 12654
972 12654 12491 12328 12165 12001 11838 11680 11521 11395 11341 11287 11161 10977 10793 10604 10416 10288 10159 10031 9902 9845 9788 9658 9528 9465 9402
969 9402 9339 9276 9258 9240 9223 9205 9252 9299 9273 9248 9214 9181 9024 8793 8635 8549 8423 8296 8177 8131 8117 8102 8082 8063 7967 7798 7656 7586 7516 7373
965 7373 7254 7208 7120 7033 6996 7031 7067 7030 7003 6976 6944 6913 6895 6877 6900 6851 6717 6584 6446 6308 6261 6214 6167 6120 6084 6049 6013 5977 5937 5897 5857 5817
961E817J4J4j7r0n1n1n1n1o0J2J6n6n1K2K2n1q5j2K7K7l4l4KKj05j05o8o8k6k6L5L4n5n6O
957D847NL9L9k1k1ppopj0j1ooj3N8O4rp9pN8N7qqP3P2k6r9o7OKp2q6q6n5n4n5n4j7j6j6j6
952D375m7m6m7m6o2o3o2o2l7l8K3K2k9k8L1L2o2o2m3L0K8K8k8k8m5m5m5m5K2K1K2K1nnnnj8
948C647j8M3M3l0l1L0L0OOp9q0p4p5j4j4j8j7O3O3O3j0n4n4J2J2k4k4q5q5%%k0k0J7J6L5L6
943C296P1P2j1j1j0j1oopoj4j4K2K2K5K4o0o1o0o0K5K5o1o1P3P3L9L9M0L9m2m2p8p8q2q1M
939C027LJJO1O1n5n6j9j9j4j4K3K2qrqrK4K4K4K4J8J8J8J8J2J2k5k4o7o7poJ7J8N4N5%%L2
934C160L3k6r8k1J00J20M8l8l8j5j4j5j5ononN3N3N3N3l9l9K2K2K5K6l5l5n6n5ONj2j2M9M9
929C292ppppM7M8M7M7J16J16M3M3O2O1O1O2Q5Q6K07K07L94L95O62O62R16R15R71Q24N33R5
$$ plain form
961 5817 5831 5845 5828 5738 5687 5636 5585 5534 5474 5486 5502 5446 5395 5417 5439 5388 5303 5291 5318 5345 5311 5277 5279 5281 5176 5071 5003 4935 4909 4883 4918 4952 4897 4841 4847
957 4847 4852 4891 4930 4909 4888 4881 4874 4868 4861 4851 4840 4834 4828 4815 4873 4937 4928 4849 4842 4900 4957 4949 4941 5014 5086 5060 4961 4894 4900 4902 4830 4744 4658 4603 4549 4494 4440 4423 4407 4391 4375
952 4375 4328 4282 4235 4189 4127 4064 4002 3940 3903 3865 3888 3910 3881 3853 3884 3916 3854 3792 3749 3779 3807 3835 3807 3779 3734 3689 3644 3599 3621 3642 3664 3685 3680 3675 3670 3665 3647
948 3647 3629 3672 3715 3685 3654 3684 3714 3720 3726 3647 3567 3493 3418 3404 3390 3372 3355 3418 3481 3544 3534 3480 3426 3438 3450 3426 3402 3317 3232 3232 3232 3212 3192 3209 3225 3260 3296
943 3296 3367 3439 3428 3417 3407 3396 3390 3384 3377 3371 3357 3343 3365 3387 3412 3436 3376 3315 3255 3195 3220 3245 3184 3123 3196 3269 3308 3347 3387 3426 3384 3342 3264 3186 3104 3023 3027
939 3027 3030 3031 3032 3093 3154 3099 3043 3024 3005 2991 2977 3000 3022 3014 3005 2997 2988 3012 3036 3060 3084 3102 3120 3138 3156 3168 3180 3155 3131 3064 2997 2990 2984 3001 3019 3073 3128 3128 3128 3160
934 3160 3193 3167 3069 3048 3148 3268 3316 3278 3240 3225 3211 3196 3181 3175 3170 3164 3159 3212 3265 3318 3371 3332 3293 3315 3337 3362 3388 3353 3318 3262 3207 3213 3218 3206 3194 3243 3292
929 3292 3285 3278 3271 3264 3311 3359 3406 3453 3569 3685 3728 3771 3833 3894 3955 4017 4102 4188 4395 4602 4996 5391 6053 6715 7631 8546 9517 10341 10874 10969
925A0969l75p14j018j019r57p15n06n06l20l21j75j76n4n4j07j08j07j07l7l7L6L6J7J8n5
922C608n5L1L1L1L1mmmmJ5J6J5J6N3N3J26J27J37J38J37J38K75K76M45M45P58P58Q22Q22P70
919A0003O24L73o4m70q10r62r61q62q61n47n46k73k73k00k00r4r4r4r4o9p0o9o9j0j1j0j0
915C277o1o1J2J2k9k9k9l0k5k6k5k6J7J6J7J7o7o7o8o7J6J6J7J6m1m0K8K8K8m5p2M9R1R0k3
911B916k3J8J8R1R1J2J2o1o1J0J1Q3Q3oopojkkjk2k2k2k2k3k2k2k2j1j2j1j1M3M3M3M4rqq
906C095rL3L2m0m0k5k5k5k4j2j1j1j1K5K6K5K6nmnnQ9Q9Q9R0p8p8M4M4O4O5n7n7JJJ%oppp
901C290kkkkj7j6N7N6k2k2k2k3M3M3p4p4J5Q8M8p4j16m3P8P9JJJJO3O3O4O3j8j8j8j8J02J02
897C675O6O5k1k2N1N1J0J0J1J0M2M3M3M2K3K3j3j3L4L4J07J08J43J44k6k6J06J07J06J07N5
$$ plain form
925 10969 10594 9880 8862 7843 6886 6171 5665 5159 4839 4518 4343 4167 4113 4059 3952 3844 3737 3630 3593 3556 3592 3628 3645 3663 3608
922 3608 3553 3584 3615 3646 3677 3673 3669 3665 3661 3676 3692 3707 3723 3776 3829 3955 4082 4219 4357 4494 4632 4907 5183 5628 6073 6831 7589 8411 9233 10003
919 10003 10627 11000 10936 10466 9656 8694 7733 6871 6010 5463 4917 4644 4371 4171 3971 3877 3783 3689 3595 3526 3456 3387 3318 3308 3297 3287 3277
915 3277 3216 3155 3167 3179 3150 3121 3092 3062 3037 3011 2986 2960 2977 2993 3010 3027 2960 2893 2825 2758 2774 2790 2807 2823 2782 2742 2770 2798 2826 2781 2709 2758 2849 2939 2916
911 2916 2893 2911 2929 3020 3111 3123 3135 3074 3013 3023 3034 3117 3200 3194 3188 3181 3175 3174 3172 3170 3169 3147 3125 3103 3081 3058 3036 3014 2992 2981 2969 2958 2947 2990 3033 3076 3120 3111 3103 3095
906 3095 3086 3119 3151 3111 3071 3046 3021 2996 2972 2960 2949 2938 2927 2952 2978 3003 3029 3024 3020 3015 3010 3099 3188 3277 3367 3289 3211 3255 3299 3363 3428 3371 3314 3315 3316 3317 3317 3311 3304 3297 3290
901 3290 3288 3286 3284 3282 3265 3249 3306 3362 3340 3318 3296 3273 3316 3359 3285 3211 3226 3314 3362 3288 3172 3129 3207 3286 3287 3288 3289 3290 3353 3416 3480 3543 3525 3507 3489 3471 3573 3675
897 3675 3741 3806 3785 3763 3814 3865 3875 3885 3896 3906 3948 3991 4034 4076 4099 4122 4109 4096 4130 4164 4271 4379 4522 4666 4640 4614 4720 4827 4933 5040 5095
893E095N5R1R1J73J72K68L41M74P17J028J367J791K227K566K638K284J459L63q50j943k573
890A7834k773k433j946j510j114p76n01l55k82k10j29n7K8K8J4J3n9n9n4n4r0r0l6l5J%no
887E344O7O7J27J26N3N4J40J39J76J77K87K88K88M33N91P36R55J295J631J971K213K359K415
884B1932K173J444M25o93j713k520k859k747k407k037j601j211p75n23k81j49j50r8r7n8n8
881E997j30j31j23j23j23j23j24j23n1n1m8m7j1j1KLL9L9J14J14J62L08M15N61O30O30K93
878H088j43m88m15m8R8O7pK2R4M4k8q2k27l22l96l64k92l00l01j30j30j30j30l2l2l2l3OO
875D363ONK6K6m7m7O0O1O1O0m2m1m2m2JJP3P4o7o6POP1P1n0n1K9K8O5O5m4m5K9K8ooL1L0M0
870D721L9l3l4p8p9m3m2P5P5m6m6M3M2l0l0M6M5M6M6O1O2O1O2K2K2r9r9K5K4Jp2m1Q1N4j9
$$ plain form
893 5095 5150 5241 5332 5505 5677 5945 6286 6760 7477 8505 9872 11663 13890 16456 19094 21378 22837 23200 22350 20407 17834
890 17834 15061 12628 10682 9172 8058 7282 6781 6426 6144 5934 5805 5748 5776 5804 5818 5831 5772 5713 5659 5605 5515 5425 5389 5354 5355 5355 5350 5344
887 5344 5411 5478 5605 5731 5784 5838 5978 6117 6293 6470 6757 7045 7333 7766 8357 9093 10048 11343 12974 14945 17158 19517 21932
884 21932 24105 25549 25974 25281 23568 21048 18189 15442 13035 10998 9397 8186 7411 6888 6607 6458 6308 6210 6113 6055 5997
881 5997 5867 5736 5613 5490 5367 5244 5120 4997 4946 4895 4847 4800 4789 4778 4780 4783 4822 4861 4975 5089 5251 5559 5974 6535 7165 7795 8088
878 8088 7945 7457 7042 6994 7092 7159 7152 7174 7268 7312 7284 7202 6975 6653 6257 5893 5601 5301 5000 4870 4740 4610 4480 4448 4416 4384 4351 4357 4363
875 4363 4369 4374 4400 4426 4379 4332 4392 4453 4514 4574 4532 4491 4449 4407 4408 4409 4482 4556 4489 4423 4430 4436 4507 4578 4528 4477 4506 4534 4599 4664 4620 4575 4604 4632 4626 4620 4651 4681 4721
870 4721 4760 4727 4693 4615 4536 4493 4451 4526 4601 4555 4509 4552 4594 4564 4534 4580 4625 4671 4717 4778 4840 4901 4963 4985 5007 4908 4809 4834 4858 4859 4787 4746 4827 4881 4862
866D862J3Q6Q1Q%jnnM3M3M2M3l0l0R2R1L6L7l7l6o4o4J0RK8K9m4m4O4O4O4O3m7m7P5P4L6L7
861E576L6L7P5P6P6P6L3L4L3L4PQPQJKj20j20l6l6L6L7k3k3N1N0K9K9K9L0K9K9L4L4R7J70
856F445J25LK6K6J9J8k7k6k7k6p0o9o9o9MMMMP5P5J0J0K6J47J52L0l4L8O2O2N3N3N3N3k2k1
852G117k1k2onooo5o5QPM4M3M4M3M8M8M8M8P5P5P5P5R3R3R3R3P6P6J17M4POM2l0j20j21n2
848H019n2p9q0pok8k7k4k3%P3L6L6OQ0J15J16J01J73J73J01J1J0POo8o8o3o4p9oK6K5p9p9
843H282M3M2L1L1L1L1JJNNK0R2J25J24R7R7J33O1j27k00m8J22J14pn0m9k6k6k5k6M1M1M1M1
839I068Q1Q1J3J3nO7J00R9M1M1J14J14Q8Q8J5J5NMNMn4n5k2N0K1K1K6K6J7J6J7J7N0N0J23
835A0354J23J12J13J12J13P2P2P3P2J04J04L2L1j6j6j6j6LKJ23J24Q0Q0Q0Q0J14J13J14J13
$$ plain form
866 4862 4875 4961 5042 5050 5050 5049 5044 5039 5082 5125 5167 5210 5180 5150 5242 5333 5369 5406 5369 5333 5269 5205 5215 5224 5252 5281 5237 5193 5257 5321 5385 5448 5401 5354 5429 5503 5539 5576
861 5576 5612 5649 5724 5800 5876 5952 5985 6019 6052 6086 6093 6101 6108 6116 6117 6119 5999 5879 5843 5807 5843 5880 5857 5834 5885 5935 5964 5993 6022 6052 6081 6110 6144 6178 6275 6445
856 6445 6570 6573 6599 6625 6644 6662 6635 6609 6582 6556 6486 6417 6348 6279 6283 6287 6291 6295 6370 6445 6455 6465 6491 6638 6790 6820 6786 6824 6886 6948 7001 7054 7107 7160 7138 7117
852 7117 7096 7074 7068 7063 7057 7051 6986 6921 6929 6936 6980 7023 7067 7110 7158 7206 7254 7302 7377 7452 7527 7602 7695 7788 7881 7974 8050 8126 8243 8287 8294 8300 8342 8312 8192 8071 8019
848 8019 7967 7888 7808 7801 7795 7767 7740 7716 7693 7693 7766 7802 7838 7844 7924 8039 8155 8256 8429 8602 8703 8714 8724 8731 8737 8669 8601 8538 8474 8395 8389 8415 8440 8361 8282
843 8282 8325 8367 8398 8429 8460 8491 8492 8493 8498 8503 8523 8615 8740 8864 8961 9058 9191 9252 9125 8925 8877 8999 9113 9106 9056 9007 8981 8955 8930 8904 8945 8986 9027 9068
839 9068 9149 9230 9243 9256 9251 9318 9418 9517 9558 9599 9713 9827 9915 10003 10018 10033 10038 10042 10047 10051 9997 9942 9920 9970 9991 10012 10038 10064 10081 10097 10114 10131 10181 10231 10354
835 10354 10477 10589 10702 10814 10927 10999 11071 11144 11216 11320 11424 11456 11487 11471 11455 11439 11423 11426 11428 11551 11675 11755 11835 11915 11995 12109 12222 12336 12449
831A2449J26J25N2N2N1N1N1N1Q6Q5Q6Q6P9Q0K89K89K51J06r5k40k52k52r2r1j13j13m0m0o1
828A3056o1J1J2k4k4R7R7N2N1N2N2OOOPMNo8o8M1M1M2M1P9Q0P9P9K8K7K8K8RJ0RJ0J02J02
823A4104J01J02Q4Q3Q4Q4M0M0M1M0O3O4O3O3K4K5R7R8J1J0J33J32qqO4O5J22J22J22J22R0
819A6277R0R0R0Q8Q8Q9Q8j5j5J06J07Q0Q1Q0Q1O1O1O2O1O6O6O5O6M2M1J15J14P4P3P4P3K0
816A8539K0K0K0L8L8L8L8O9O9O9O9L1L1L1L1J1J1Q4Q4K7K8R6R6J12L8J25K46J81O0K2R4J16
812B0582J15J20J20J46J46J46J45J92J92J93J92J90J91K39L60L68K95L75M48M37M37N42P61
809B6932Q66R38J157J472J667J836K130K398K170J564R76N63L2n74n74K26J335K330L349M149
806E4942L482N95l093m912l961j704j82K30K40L61O07J019J765K712L408L773L843L478K576
$$ plain form
831 12449 12575 12700 12752 12804 12855 12906 12957 13008 13094 13179 13265 13351 13430 13510 13799 14088 14339 14445 14350 14110 13858 13606 13514 13423 13310 13197 13157 13117 13056
828 13056 12995 13006 13018 12994 12970 13067 13164 13216 13267 13319 13371 13377 13383 13389 13396 13400 13405 13337 13269 13310 13351 13393 13434 13513 13593 13672 13751 13779 13806 13834 13862 13871 13881 13890 13900 14002 14104
823 14104 14205 14307 14391 14474 14558 14642 14682 14722 14763 14803 14866 14930 14993 15056 15080 15105 15202 15300 15311 15321 15454 15586 15578 15570 15634 15699 15821 15943 16065 16187 16277
819 16277 16367 16457 16547 16635 16723 16812 16900 16885 16870 16976 17083 17163 17244 17324 17405 17466 17527 17589 17650 17716 17782 17847 17913 17955 17996 18111 18225 18299 18372 18446 18519 18539
816 18539 18559 18579 18599 18637 18675 18713 18751 18820 18889 18958 19027 19058 19089 19120 19151 19162 19173 19257 19341 19368 19396 19492 19588 19700 19738 19863 20109 20290 20350 20372 20466 20582
812 20582 20697 20817 20937 21083 21229 21375 21520 21712 21904 22097 22289 22479 22670 22909 23269 23637 23932 24307 24755 25192 25629 26171 26932
809 26932 27798 28736 29893 31365 33032 34868 36998 39396 41566 43130 44106 44669 44701 44127 43553 43779 45114 47444 50793 54942
806 54942 58424 59019 55926 51014 47053 45349 45167 45397 45637 45998 46605 47624 49389 52101 55509 59282 63125 66603 69179
804F9179J194l75j783l000l825m022l779l288k657k051j421q62n22j38K03N30P72R56J393
802D6504J945K576L230L959M800N528N847N774N169L858J983k98k506m204n213n553n213m485
800F3701l553k632j807j079n64l0M44Q80J335J772K348L076L938M957O146P359Q482R209R409
797A13391Q876P514N427K964L93j970l959n567o683p286p528p335o703n706m589l437k321
795G5481j372l52O06J430K305L226M367N676P038Q446R688J0611J0902J0465R404P705N518
793A71144K947P8k883n918q685j0722j1742j1565j0449q732o937n184l679k345j132k9Q93
791H5060J864K883L859M976O195P602Q990J0204J1163J1696J1568J0550Q263M914P17l894
789A86610q109j1458j3307j3551j2446j0554q405o318m535k933j545l31P91J907K962M176
$$ plain form
804 69179 70373 69998 68215 65215 61390 57368 53589 50301 47644 45593 44172 43310 42788 42650 42853 43383 44155 45111 46504
802 46504 48449 51025 54255 58214 63014 68542 74389 80163 85332 89190 91173 90875 88369 84165 78952 73399 68186 63701
800 63701 60148 57516 55709 54630 54066 54036 54480 55360 56695 58467 60815 63891 67829 72786 78932 86291 94773 103982 113391
797 113391 122267 129781 135208 138172 138565 136595 132636 127069 120386 113100 105572 98237 91534 85828 81239 77802 75481
795 75481 74109 73757 74363 75793 78098 81324 85691 91367 98405 106851 116539 127150 138052 148517 157921 165626 171144
793 171144 174091 174169 171286 165368 156683 145961 134219 122654 112205 103473 96536 91352 87673 85328 84196 84167 85060
791 85060 86924 89807 93666 98642 104837 112439 121429 131633 142796 154492 166060 176610 184873 189787 190504 186610
789 186610 178501 167043 153736 140185 127739 117185 108780 102462 97927 94994 93449 93118 93909 95816 98778 102954
787A02954N576P275R211J1296J3432J5421J6866J7302J6331J3760R319L254l558r818j4574
785B14047j7244j7898j6976j5190j3006j0708q426o268m375k737j427l02Q15J894L107M438
783A09744O040Q115J0395J2743J4829J6112J6112J4352J0616N286o81o420j0933j3778j4797
781A77735j4410j3294j1754j0151q545o943n482m074k856j740p21K98J308K425L613N020O470
779A16899P974R303J0225J0513R882Q062N199J666j974n279p851r532j0259j0157r234p770
777A17667o072m428k923j647o28L97J417K383L402M549N859P357Q764R935J0760J0873R952
775A77617Q053N384K476r6j989l008l217k974k665k423k390k536k548k209j367n7J654L547
773A71252N522P415R307J1102J2716J4123J5336J6258J6491J5861J4265J1500P613L002j334
$$ plain form
787 102954 108530 115805 125016 136312 149744 165165 182031 199333 215664 229424 238743 241997 238439 228621 214047
785 214047 196803 178905 161929 146739 133733 123025 114599 108331 103956 101219 99792 99490 100305 102199 105306 109744
783 109744 115784 123899 134294 147037 161866 177978 194090 208442 219058 224344 223663 217243 206310 192532 177735
781 177735 163325 150031 138277 128126 119581 112638 107156 103082 100226 98486 97765 98063 99371 101796 105409 110429 116899
779 116899 124873 134176 144401 154914 164796 172858 178057 179723 177749 172470 164619 155087 144828 134671 125437 117667
777 117667 111595 107167 104244 102597 101969 102366 103783 106166 109568 114117 119976 127333 136097 146032 156792 167665 177617
775 177617 185670 191054 193530 193434 191445 188437 185220 182246 179581 177158 174768 172232 169684 167475 166108 166051 167705 171252
773 171252 176774 184189 193496 204598 217314 231437 246773 263031 279522 295383 309648 321148 328761 331763 330429
771C30429m197m962m136k378m85R68J696J744J598J781K411L661N360O997Q113Q529Q528Q383
769C74040Q238P980P737P581P340O872N950M555K759R03n03j149r06j59O65J035L08j664m721
767D26861p915j0293j1433j1093r787p990o147m643l745l503l873m406m895n235n477n720
765C20706n963o399o970p600q019q262q195p855p174o542o090o016o233o574o674o335n634
763B04171m615l492k182r67m4M76O22O37N65L93L21L51M24M51M50N50N49N64N64P18R60J224
760B02690J466J911K346K695K839K936L008L109L255L699M426N391O506P371P808P717P183
758B76356O509N781N199M956N254N981O891P522P642P107N931M718L768L137K742K596K511
756C64601K438K202J669R55L2q41j471j606j460j237j164j345j782k301k836l014k675j934
$$ plain form
771 330429 326232 321270 317134 314756 314271 315239 316935 318679 320277 322058 324469 328130 333490 340487 348600 357129 365657 374040
769 374040 382278 390258 397995 405576 412916 419788 425738 430293 433052 433955 433452 432303 431397 431238 431903 432938 433246 431582 426861
767 426861 418946 408653 397220 386127 376340 368350 362203 357560 353815 350312 346439 342033 337138 331903 326426 320706
765 320706 314743 308344 301374 293774 285755 277493 269298 261443 254269 247727 241637 235621 229388 222814 216140 209805 204171
763 204171 199556 196064 193882 192915 192871 193347 193969 194606 195171 195564 195885 196236 196660 197111 197561 198111 198660 199224 199788 200506 201466 202690
760 202690 204156 206067 208413 211108 213947 216883 219891 223000 226255 229954 234380 239771 246277 253648 261456 269173 276356
758 276356 282865 288646 293845 298801 304055 310036 316927 324449 332091 339198 345129 349847 353615 356752 359494 362090 364601
756 364601 367039 369241 370910 371865 371897 371056 369585 367979 366519 365282 364118 362773 360991 358690 355854 352840 350165 348231
754C48231p22N65J680K045J510M12r96k469l780m638n172n445n590n787o029o485p018p594
751B92718q128q583q923r155r398r785j0126j0262j0116r637q910p728o225m841l726k991
750A64184k652k730l168l778m312m834n173n353n207m964m624m278l842l633l706l966m305
747I3659m594m836n062n135m999m661m255l721l182k648k226j790j468j322j173j026r13q41
745C9807p11n65n70n70n86n85m64m64l68l69k91k91k06j33j66l11k79k80k89k89j78j78j79
742C1485j78j01j00j01j01p1p0p1p0n0n0n0n0o8o8o9o8j20j21p2j44j42k0K8K8l1l1R0R1M7
739B9752M8M8M8J7J7K4K4P2J92J93P1kkJ12J12J0J0o2o3j2j2O0O1M5M6M5M6J11J12J11J12
735C1346J22J22J22J23Q2Q2K53K52J91J92J92J91J5J5Q8Q7O1O0J33J33R0R0R0R0J29J30K50
$$ plain form
754 348231 347509 348074 349754 351799 353309 353721 352725 350256 346476 341838 336666 331221 325631 319844 313815 307330 300312 292718
751 292718 284590 276007 267084 257929 248531 238746 228620 218358 208242 198605 189695 181967 175742 170901 167175 164184
750 164184 161532 158802 155634 151856 147544 142710 137537 132184 126977 122013 117389 113111 109269 105636 101930 97964 93659
747 93659 89065 84229 79167 74032 69033 64372 60117 56396 53214 50566 48340 46550 45082 43760 42587 41561 40648 39807
745 39807 39096 38531 37961 37391 36805 36220 35756 35292 34924 34555 34264 33973 33767 33634 33468 33157 32878 32598 32309 32020 31842 31664 31485
742 31485 31307 31206 31106 31005 30904 30833 30763 30692 30622 30572 30522 30472 30422 30354 30286 30217 30149 30029 29908 29836 29692 29550 29530 29558 29586 29555 29524 29614 29705 29752
739 29752 29800 29848 29896 29913 29930 29954 29978 30050 30242 30435 30506 30504 30502 30614 30726 30736 30746 30684 30621 30609 30597 30657 30718 30763 30809 30854 30900 31011 31123 31234 31346
735 31346 31468 31590 31712 31835 31917 31999 32252 32504 32695 32887 33079 33270 33285 33300 33388 33475 33536 33596 33729 33862 33952 34042 34132 34222 34351 34481 34731
732C4731K51K05K04K05K04K02K01K75K74K37K36K37K37K37K36K37K37K38K39J66J65J11J12
729C9677J18J19J38K59L13L12L22L21M43M43L44L45N14N14M13M12M13M13N40N41O14O13O35
726D8776O35O35O34O33O33P22P95Q61J008J130J275J385J627J840K082K279K522K844L183
724G5499L447L884M223M369M305M160L857L419K773K238J748J213P57M17L86M58N95R34J281
721A19963J622J957K298K728L262L833M658N646O763P985R295J0484J1503J2156J2592J2574
719B29319J1847J0415Q425O175L797J437n53k005k831l212l213l155l009k927k587k114j580
717B44229r46k4J170K675M519O507Q443J0141J1385J2307J2986J3228J2786J1864J0274P799
715C69343M515O82k898n760p469q002p742p208p026p365q153q978r507r435q600p192n255
$$ plain form
732 34731 34982 35187 35391 35596 35800 36002 36203 36478 36752 36989 37225 37462 37699 37936 38172 38409 38646 38884 39123 39289 39454 39565 39677
729 39677 39795 39914 40052 40311 40624 40936 41258 41579 42022 42465 42809 43154 43668 44182 44595 45007 45420 45833 46373 46914 47528 48141 48776
726 48776 49411 50046 50680 51313 51946 52668 53463 54324 55332 56462 57737 59122 60749 62589 64671 66950 69472 72316 75499
724 75499 78946 82830 87053 91422 95727 99887 103744 107163 109936 112174 113922 115135 115892 116309 116695 117153 117748 118682 119963
721 119963 121585 123542 125840 128568 131830 135663 140321 145967 152730 160715 170010 180494 191997 204153 216745 229319
719 229319 241166 251581 260006 266181 269978 271415 270862 268857 266026 262814 259601 256446 253437 250510 247923 245809 244229
717 244229 243283 243259 244429 247104 251623 258130 266573 276714 288099 300406 313392 326620 339406 351270 361544 369343
715 369343 373858 374540 371642 365882 358413 350411 342669 335461 328435 321070 312917 303939 294432 284997 276397 269205 263950
713B63950k975o83J405L167M379N026N026M574L943L376K648J486j8j499k711l493l929m091
711B79581m164m239m384m674n013n326n326n086m746m268l637k937k307k006j934j870j797
709B15867j617j083l29M96J217J751K088K088J851J512J496J836K454L377M402N421O372O906
707B56105P094O852O423N988N677N339M881M445L868L140K089R72k3p51j343j684j741j740
705C05591j653j411r28j03R82K389L911N416O726P939R013R741J0120J0265J0035R404Q303
703C95740O896N483L784J753m31k494m289n847p352q790j0100j1092j1432j0910r503p468
701C23948m896k276NJ453K182K422K495K427K282J821R00o70k563m128n244n938o278o306
698C01636o305o550o987p438p779p981p836p096o173n375m937m758m686m684m757m810m737
$$ plain form
713 263950 260975 260292 261697 264864 269243 274269 279295 283869 287812 291188 293836 295322 295304 293805 291094 287601 283672 279581
711 279581 275417 271178 266794 262120 257107 251781 246455 241369 236623 232355 228718 225781 223474 221468 219534 217664 215867
709 215867 214250 213167 212838 213334 214551 216302 218390 220478 222329 223841 225337 227173 229627 233004 237406 242827 249199 256105
707 256105 263199 270051 276474 282462 288139 293478 298359 302804 306672 309812 311901 312873 312850 312099 310756 309072 307331 305591
705 305591 303938 302527 301599 301496 302478 304867 308778 314194 320920 328859 337872 347613 357733 367998 378033 387437 395740
703 395740 402636 408119 411903 413656 413225 410731 406442 400595 393243 384453 374353 363261 351829 340919 331416 323948
701 323948 319052 316776 316781 318234 320416 322838 325333 327760 330042 331863 332763 332093 329530 325402 320158 314220 307942 301636
698 301636 295331 288781 281794 274356 266577 258596 250760 243664 237491 232116 227179 222421 217735 213051 208294 203484 198747
696A98747m607m365l811k986k125j203p4J041J801K044J723R95q8j010j484j337q68l34L3
694A82092L3m47j174j590j444o97K25J353K566L439L682L137J535p75l153m851n288m532l029
692A71082r54J327L232M542N099M760L456J370j136l320m723m869l687j405J420M090O213
690A86497P329O921M738J013l403p427r903j0126q332n572k710k11J585K513K270J105p87
688A65500k924m914o139o382n712m304k387k04J801L305M061M061L062J268q71k763l909m152
685A38397l345k034q07p8K37L82L03j34q14j250j329j184r35o92o16q59j032j032o53k2Q67
683A23370J886K852L581L975M217M209L869L165K243J279N50L93R27J867K789L487L923L940
681A72522L115J593l97k299l900m770m771m152k938j244O50K234L351L945M188L925L197K171
$$ plain form
696 198747 194140 189775 185964 182978 180853 179650 179576 180617 182418 184462 186185 187180 187092 186082 184598 183261 182393 182059 182092
694 182092 182125 181678 180504 178914 177470 176773 176998 178351 180917 184356 188038 191175 192710 191935 188782 183931 178643 174111 171082
692 171082 170128 171455 174687 179229 184328 189088 192544 193914 192778 189458 184735 179866 176179 174774 176194 180284 186497
690 186497 193826 200747 205485 206498 203095 195668 185765 175639 167307 161735 159025 158814 160399 162912 165182 166287 165500
688 165500 162576 157662 151523 145141 139429 135125 132738 132534 134335 137640 141701 145762 148824 150092 149221 146458 142549 138397
685 138397 135052 133018 132211 132133 132370 132752 133055 132921 132107 130857 129528 128344 127409 126717 126101 125242 124210 123178 122525 122503 123370
683 123370 125256 128108 131689 135664 139881 144090 147959 151124 153367 154646 155196 155589 156516 158383 161172 164659 168582 172522
681 172522 175637 177230 176833 174534 170634 165864 161093 156941 154003 152759 153409 155643 158994 162939 167127 171052 174249 176420
678A76420J250M99j31l62P5J118K622M338N843O392N567L534O72k508n469p719q836q735p716
676A66854n908l919k316j296p69m29m57r92j834k757l614m341m433l705k367p66P45K152L135
674A32983L377K705J200r00l278n407o620o782o248n259m047k833k105j863k008k531l355
672H7029l985m227m139m065l860l424k791k257j693r65k63P6J04J04r8o32j244j680j757j831
669D8402j853j610j237r95j040j040j042j187j444j589j452j379j324j179q78q05q37p65n19
667B6227m47n19m46k75k01l23l23j53j52l59l58k50k49l50l49j82l6k01k74o8P8N2N2L7L7
664B0968r7r7j1j2j41j40L5J08L1L1P4P3j41k13j28j29k86k86j72j00k17k18RJ31Kj20j6N6
660A8994j04j78k7M5o1j34K6J49pj28m9P2j8r2M7J19j1j1J53J53p1k41j24kj15j88l3J37K5
$$ plain form
678 176420 177670 178169 178038 177676 177751 178869 181491 185829 191672 198064 203631 207165 207837 205329 199860 192141 183305 174570 166854
676 166854 160946 157027 154711 153415 152646 152217 151760 150768 148934 146177 142563 138222 133789 130084 127717 126951 127696 129848 132983
674 132983 136360 139065 140265 139365 136087 130680 124060 117278 111030 105771 101724 98891 96786 94923 92915 90384 87029
672 87029 83044 78817 74678 70613 66753 63329 60538 58281 56588 55623 55360 55436 55540 55644 55546 54914 53670 51990 50233 48402
669 48402 46549 44939 43702 42707 41667 40627 39585 38398 36954 35365 33913 32534 31210 30031 29153 28348 27511 26746 26227
667 26227 25780 25261 24815 24540 24339 24016 23693 23540 23388 23029 22671 22421 22172 21822 21473 21291 21255 21054 20780 20712 20790 20842 20894 20931 20968
664 20968 20871 20774 20763 20751 20610 20470 20505 20613 20644 20675 20749 20822 20681 20468 20340 20211 19925 19639 19467 19367 19150 18932 18941 19072 19074 18954 18938 18994
660 18994 18890 18712 18685 18730 18669 18535 18561 18710 18703 18575 18526 18598 18580 18488 18535 18654 18643 18632 18785 18938 18867 18626 18502 18500 18385 18197 18164 18301 18326
657A8326r6l4L8r1j65L9K10N4j15J9J41j9j41L6J57Lj19K6J95M4j26O3K82R9j18lJ66L3j37
653A8767k9J88J01o9O7K37Q3q7J08L27J48p1J01L20J67r9M3L09J52j63o7J52rk27mK63R0k25
650B0573o8K48J85q3J26M42K93p1P1M36L05j08mL59K29j84p5L36J86k26q7M47L57p9L1M68
647B4107K92j45j7N18L96j37K1O53N49J6J32Q60O91l8M2P69P81J51L70J194J067K43N43J659
644C4717J642O22J009K417K513J495K280M657N288M657O943J1844J4853J8396L1335N2249
642A96917O1810M4291R478j7261k2119r259J2798L5557M3188K0332k5489o3291p0097n3355
640A63500l5607k6436k0115j2982q365p637o721m052k453k986l041j537p17j543j791p72k22
638B6523j047j356m34J22n09q61k30L0n05p83j52J92l41p24k86M6l89n48j11J69k68n41j04
$$ plain form
657 18326 18230 18196 18234 18143 17978 18017 18227 18281 18166 18185 18326 18307 18166 18202 18359 18362 18243 18269 18464 18508 18382 18445 18727 18826 18708 18705 18871 18904 18767
653 18767 18738 18926 19027 18958 19025 19262 19345 19258 19366 19693 19841 19770 19871 20191 20358 20259 20302 20611 20763 20600 20533 20685 20676 20449 20445 20708 20798 20573
650 20573 20505 20753 20938 20855 20981 21423 21716 21645 21716 22152 22457 22349 22345 22704 22933 22749 22674 23010 23196 22970 22883 23330 23687 23608 23639 24107
647 24107 24399 24254 24237 24755 25151 25014 25035 25688 26237 26253 26385 27245 27936 27898 27940 28709 29490 29641 30011 31205 32272 32515 33058 34717
644 34717 36359 36981 37990 40407 42920 44415 46695 51352 56640 61297 68240 80084 94937 113333 144668 196917
642 196917 258727 303018 312496 295235 273116 263857 276655 312212 355400 375732 350243 286952 216855 163500
640 163500 127893 101457 81342 68360 59995 52358 45637 41585 39132 36146 33105 31568 30851 29308 27517 26745 26523
638 26523 25476 24120 23686 23808 23299 22438 22208 22238 21733 20950 20798 20990 20649 19925 19639 19685 19296 18748 18637 18806 18538 17997 17893
635A7893J98j43l90n1K02j38m41j01J54j86m35r5K01m2k41JK01m2k96n4J07j35l42r9J95m8
632A5873k52j0J85l4k39k0J96k2k46p6J35l5j95K3J97K7j51J8K37O8j33j2J57L5j10J08K84
629A6008O5j78n6J89O8j32n9J60Q8p3%J21%k23j51K8K8j01j01R5R4m3m3J45P2m4P7K62J89
625A6485PQL9M0p4p4J12L8j03J9K09J36n3n3M0q0j87j14N6N7p3p3J07J06l0R1K20R8j53j53
621A6648J28J29p7p8M6M6o4o3J08J08K3K3J40J41j14j14O2O2p2p2J03J03poj7j7j02j02P1
618A7036P2o3o2J64J64N4N5J87J86N3N3P1P0o2o3k2k3j92j91J01J02j6j5K11K85J20m9L7L7
614A8300p5j97j01j01j74j74M4J66P0kQ9J62M5M4J42J43M8p2QJ29R9K6Q1J55N5o5m8m7r1r2
611A8567m2m2j15j15P2P2OPJ52K73K01P9J19J19N9o3l2l2j12j12K3K3j4j3P3P4JJN6N6N6N6
$$ plain form
635 17893 18091 17948 17558 17507 17709 17571 17130 17029 17183 16997 16562 16467 16668 16626 16385 16386 16587 16545 16249 16195 16302 16167 15825 15726 15921 15873
632 15873 15621 15611 15796 15762 15523 15503 15699 15677 15431 15355 15490 15455 15260 15283 15480 15507 15356 15374 15611 15679 15546 15534 15691 15726 15616 15724 16008
629 16008 16073 15895 15839 16028 16096 15964 15905 16065 16153 16080 16080 16201 16201 15978 15827 15855 15883 15782 15681 15776 15870 15827 15784 15929 16001 15957 16034 16296 16485
625 16485 16492 16500 16539 16579 16505 16431 16543 16581 16478 16497 16706 16842 16789 16736 16776 16696 16509 16395 16451 16508 16435 16362 16469 16575 16545 16636 16856 16954 16801 16648
621 16648 16776 16905 16828 16750 16796 16842 16778 16715 16823 16931 16954 16977 17117 17258 17144 17030 17092 17154 17082 17010 17113 17216 17209 17203 17186 17169 17067 16965 17036
618 17036 17108 17045 16983 17147 17311 17365 17420 17607 17793 17846 17899 17970 18040 17978 17915 17893 17870 17678 17487 17588 17690 17674 17659 17870 18155 18275 18226 18263 18300
614 18300 18225 18028 17927 17826 17652 17478 17522 17688 17758 17756 17845 18007 18052 18096 18238 18381 18429 18357 18365 18494 18593 18619 18700 18855 18910 18845 18797 18750 18659 18567
611 18567 18525 18483 18368 18253 18325 18397 18403 18410 18562 18835 19036 19115 19234 19353 19412 19349 19317 19285 19173 19061 19084 19107 19093 19080 19153 19227 19228 19229 19285 19341 19397 19453
607A9453J32J31R5R5J16J16O2n8j0j0r0j63j17Ol1l2L7L7J3o0pJ14Q1m0K8J50J20M6N9J32
603B0405N9j4L0J03N7o4l0M2oj28k03j31j06j06nonoK5K5K5K5m3m2P8P9R3R4K1K1O2O3O3O2
599B0537Q8Q7J24J24J50J49Q1Q0J62K34J96P5N3J74J83J10J85L06L11K38K00K01J42K2l6l5
596B4141m3m3p2p2JJJ16J17P0n0l0R2R3R4J11J84J44K2K7J00R7K4rO3M4j25k06j34j00j73
592B4484j87o6P9Q0RJ0Q2Q2L9L9J60J61K17K17J86J85J73K45K78J56P3J45K19K18J13J12L9
589B7548M0o1o1j24j23n1J20K34J62R4R4J7J7k5k5M8M8J06J06J43J42M5M5k8k8q2q1qrL3L2
585B8368J10J10L8J11J16M2l6L7P3%p5kN9j4p6lJ10J09J01J01J06J06J42K15K59K59J33J33
582C0632J74J01J3J3N8J30J74K47K10K11K04K05K49J78J29K02K62K61J37O4O1j1j43j43j47
$$ plain form
607 19453 19585 19716 19811 19906 20022 20138 20200 20142 20132 20122 20032 19869 19752 19758 19727 19695 19732 19769 19782 19722 19715 19829 19910 19870 19898 20048 20168 20214 20273 20405
603 20405 20464 20450 20480 20583 20640 20576 20546 20588 20582 20454 20251 20120 20014 19908 19903 19897 19892 19886 19911 19936 19961 19986 19943 19901 19979 20058 20151 20245 20266 20287 20349 20412 20475 20537
599 20537 20625 20712 20836 20960 21110 21259 21340 21420 21582 21816 22012 22087 22140 22314 22497 22607 22792 23098 23409 23647 23847 24048 24190 24212 24176 24141
596 24141 24098 24055 23983 23911 23912 23913 24029 24146 24216 24166 24136 24228 24321 24415 24526 24710 24854 24876 24903 25003 25100 25124 25115 25178 25222 25097 24891 24757 24657 24484
592 24484 24297 24231 24310 24390 24399 24409 24491 24573 24612 24651 24811 24972 25189 25406 25592 25777 25950 26195 26473 26629 26702 26847 27066 27284 27397 27509 27548
589 27548 27588 27527 27466 27342 27219 27168 27288 27522 27684 27778 27872 27889 27906 27881 27856 27904 27952 28058 28164 28307 28449 28494 28539 28511 28483 28401 28320 28312 28303 28336 28368
585 28368 28478 28588 28626 28737 28853 28895 28859 28896 28969 28969 28894 28892 28951 28937 28861 28858 28968 29077 29178 29279 29385 29491 29633 29848 30107 30366 30499 30632
582 30632 30806 30907 30920 30933 30991 31121 31295 31542 31752 31963 32167 32372 32621 32799 32928 33130 33392 33653 33790 33854 33915 33904 33761 33618 33471
579C3471j47j26j25q9q9j57j57o5o4k7R5J84J84P6P6J36J37J30J30J31J30Q0Q0Q0Q0N4N5J39
575C4402J39J06J06J66J67J47J48J52J52J14J86L04L03K32K31L60L60L09K36K17K16J02J03
572C8958J03J02P1P1J11L9o1o1k2N1O0O1J50J50J83J83J92J20P9J52K33J60M3M2J24J23O2
569D1479O2R9R9J03J03K36K37K05K06K66K66J40J40K98K98K18K18L27L26K98K99M31M32L57
566D7143L58M68M67M72M73M72M72K88K89L48L49M37M38N95N95O91O90Q73Q73Q43Q44J093J335
563F0906J488J634J968K307K543K882L294L828M191M530M960N396N580N507N090M168K622
561A22894P30j169k673l705m141m117l680l205k672j980j252n11L14J127K049K959L978M954
559A09900N876O492P026P480P723P644P207O382M975K832J63k512m793o291p018p019o775
$$ plain form
579 33471 33324 33198 33073 32984 32895 32738 32581 32516 32452 32425 32520 32704 32888 32964 33040 33176 33313 33443 33573 33704 33834 33914 33994 34074 34154 34208 34263 34402
575 34402 34541 34647 34753 34919 35086 35233 35381 35533 35685 35799 35985 36289 36592 36824 37055 37415 37775 38084 38320 38537 38753 38855 38958
572 38958 39061 39163 39234 39305 39416 39455 39394 39333 39311 39362 39422 39483 39633 39783 39966 40149 40341 40461 40540 40692 40925 41085 41128 41170 41294 41417 41479
569 41479 41541 41640 41739 41842 41945 42181 42418 42623 42829 43095 43361 43501 43641 43939 44237 44455 44673 45000 45326 45624 45923 46354 46786 47143
566 47143 47501 47969 48436 48908 49381 49853 50325 50613 50902 51250 51599 52036 52474 53069 53664 54355 55045 55918 56791 57634 58478 59571 60906
563 60906 62394 64028 65996 68303 70846 73728 77022 80850 85041 89571 94531 99927 105507 111014 116104 120272 122894
561 122894 123624 122455 119782 116077 111936 107819 104139 100934 98262 96282 95030 94519 94833 95960 98009 100968 104946 109900
559 109900 115776 122268 129294 136774 144497 152141 159348 165730 170705 173537 173700 171188 166395 160104 153086 146067 139292
557A39292o392n956n385m755m036l211k278j355n30J97R01J532J982K225K407K406K386K385
555A21815K313J973J221K99o55j383j878j951j740j497j369j368j271j271j357j212q74m38
553A09357k34q8K33N72P61R07J137J379J643J886K347K784L211L648M394N122N790O421P197
550A58467Q217R268J0579J2284J4175J5756J6871J7333J6992J5446J2777R290N261J023k521
548C21218m849n965o514o757o430n701m873l853k338k50J933M117O549R315J2126J4699J7058
546C39485J9436K1498K3002K3543K2523J9440J4151P448L14o118j1019j3676j4500j4296j3858
544D17373j3271j2348j1311j0195q733p132n554m049k467p68O30J552K571M076N556O672P267
542C69869P509O888M995K017j041l257m472m738m398m053m198m744n666o773p985q537q101
$$ plain form
557 139292 132900 126944 121559 116804 112768 109557 107279 105924 105394 105591 106492 108024 110006 112231 114638 117044 119430 121815
555 121815 124128 126101 127322 127621 126966 125583 123705 121754 120014 118517 117148 115780 114509 113238 111881 110669 109795 109357
553 109357 109123 109035 109268 109840 110601 111508 112645 114024 115667 117553 119900 122684 125895 129543 133937 139059 144849 151270 158467
550 158467 166684 175952 186531 198815 212990 228746 245617 262950 279942 295388 308165 317455 322716 323739 321218
548 321218 316369 310404 303890 297133 290703 285002 280129 276276 273938 273688 275621 279738 286287 295602 307728 322427 339485
546 339485 358921 380419 403421 426964 449487 468927 483078 490526 490840 484722 473703 460027 445527 431231 417373
544 417373 404102 391754 380443 370248 361515 354383 348829 344780 342313 341545 342175 343727 346298 350374 355930 362602 369869
542 369869 377378 384266 389261 391278 390237 386980 382508 377770 373372 369319 365121 360377 354711 347938 339953 331416 323315
540C23315o876n856n374n375n270m736l903k786j807j175p21j88M24J152K159L469M649N571
538B96672O262O990P820Q742R973J2060J4749J7710K0652K3709K6327K8026K8572K8037K6161
536E62462K2520J7608J3095J0030Q040O063L782J514p67k896m498m937m501l851l124j986
534F18554r4K448N116P861J0820J4072J7226J9795K1299K1578K0559J8020J3215O221j980
532G94710r695j5955k0605k3856k5589k5589k4373k2384j9718j5981j1335o433k328O32L107
531E74608N873R127J2669J6158J9214K1192K0658J6860J1183N688J272l169q069j1833j2366
529F79065j0068p398n725m220k194m96p30k332l284k168L55K733M001L855K490K10k878o323
527F44893r065j0084r720q992q206o605l785m36K675N830R615J3254J5627J7130J9030K1698
$$ plain form
540 323315 316439 310583 305209 299834 294564 289828 285925 283139 281332 280157 279436 279248 279672 280824 282983 286452 291101 296672
538 296672 302934 309924 317744 326486 336459 348519 363268 380978 401630 425339 451666 479692 508264 536301 562462
536 562462 584982 602590 615685 625715 633755 639818 643600 645114 644347 641451 636953 632016 627515 623664 620540 618554
534 618554 618460 620908 626024 633885 644705 658777 676003 695798 717097 738675 759234 777254 790469 796690 794710
532 794710 785015 769060 748455 724599 699010 673421 649048 626664 606946 590965 579630 573197 570869 571501 574608
531 574608 580481 589608 602277 618435 637649 658841 679499 696359 707542 713230 714502 711333 703264 691431 679065
529 679065 668997 661599 655874 651654 649460 648964 648234 645902 642618 640450 640805 643538 647539 651394 653884 654094 651216 644893
527 644893 635828 625744 616024 607032 598826 592221 588436 588000 590675 596505 606120 619374 635001 652131 671161 692859
525F92859K4286K6081K7373K8780L0839L3800L7057L8561L5759K9208K2056J6864J2728Q118
523A064369L806K398M945J0041J5306J8946J9756J7477J3084Q572O018O454R827J4341J7561
521A232901J8484J8702K0692K5302L1464L7688M2492M4246M1384L3716K3089J1634P16j0136
519A572374k1734l3183m1286m3143l9697l5276l2800l0781k7336k4472k6558l4056m2936m8465
518A090651m8902m4201l5223k5226j9160k0058k6511l4661m1697m6350m7854m6414m3357m0087
516E70950l6545l2129k7228k3043j9791j6968j4880j3795j3358j2581j1077r015o637m164
514C29739k271j829k847m549o344p285o751m984l576l599m520n087n087m920m775m311l681
$$ plain form
525 692859 717145 743226 770599 799379 830218 864018 901075 939636 975395 1004603 1026659 1043523 1056251 1064369
523 1064369 1068175 1070573 1075518 1085559 1100865 1119811 1139567 1157044 1170128 1178700 1184718 1191172 1200999 1215340 1232901
521 1232901 1251385 1270087 1290779 1316081 1347545 1385233 1427725 1471971 1513355 1547071 1570160 1581794 1582510 1572374
519 1572374 1550640 1517457 1476171 1433028 1393331 1358055 1325255 1294474 1267138 1242666 1216108 1182052 1139116 1090651
518 1090651 1041749 997548 962325 937099 917939 897881 871370 836709 795012 748662 700808 654394 611037 570950
516 570950 534405 502276 475048 452005 432214 415246 400366 386571 373213 360632 349555 340540 333903 329739
514 329739 327468 325639 322792 318243 311899 304614 297863 292879 289303 285704 281184 276097 271010 266090 261315 257004 253323
$$ [...]
-1606I33
##$OBSERVED INTEGRALS=	(X Y Z)
(6.638106635273599565, 6.8708600239997812409, 2.0075623469352055217)
(6.8784498084147678298, 7.0302454967144516473, 1)
(5.8916918575830425908, 6.0830115328971965383, 0.89512967957534994579)
(5.0314415189402845741, 5.2551066069874030617, 1.9556606517774610676)
(3.3406074755496026896, 3.4910479337769042552, 2.0307852277529243601)
(2.4251364700578905698, 2.5242639037735523644, 1.9328779327941705279)
(3.7289537746944971808, 3.8910562839471691809, 2.972264848692076189)
(1.5364881819245326255, 2.079939759706876945, 6.9639149059733300717)
(0.76912522445504472035, 1.0443496286538289652, 4.0934977673200672044)
(1.059510294986811596, 1.3942111594149937392, 10.214205400157950976)
##END=	
##END=	
##END=	
