##TITLE=	(1) Jan28-2020.20.fid
SH-001

(2) Jan28-2020.20.fid
SH-001
##JCAMP-DX=	6.0	$$ MestReNova 14.1.0-24037
##DATA TYPE=	LINK
##BLOCK_ID=	1
##BLOCKS=	2    
##ORIGIN=	Mestrelab Research S.L.
##OWNER=	sh419
##$MNOVA/LINK_BLOCK_TYPE=	PAGE
##TITLE=	Jan28-2020.20.fid
SH-001
##JCAMP-DX=	6.0	$$ MestReNova 14.1.0-24037
##DATA TYPE=	LINK
##BLOCK_ID=	2
##BLOCKS=	1    
##ORIGIN=	Mestrelab Research S.L.
##OWNER=	sh419
##$MNOVA/LINK_BLOCK_TYPE=	ITEM	$$ NMR Spectrum
##$MNOVA/ITEM/POLYGON=	(XY..XY)
5321,5835
8722,5835
8722,8208
5321,8208
5321,5835
##$MNOVA/ITEM/Z=	0
##$MNOVA/ITEM/ANGLE=	0
##TITLE=	Jan28-2020.20.fid
##JCAMP-DX=	6.0	$$ MestReNova 14.1.0-24037
##BLOCK_ID=	3
##DATA TYPE=	NMR SPECTRUM
##DATA CLASS=	XYDATA
##NUMDIM=	1
##ORIGIN=	Bruker BioSpin GmbH
##OWNER=	nmrsu
##.OBSERVE FREQUENCY=	400.05240029999998796
##.OBSERVE NUCLEUS=	^1H
##.SOLVENT NAME=	CDCl3
##.PULSE SEQUENCE=	zg30
##LONGDATE=	2020/01/28 15:20:00.000
##.ACQUISITIONMODE=	SIMULTANEOUS (DQD)
##$ORIGINAL FORMAT=	Bruker XWIN-NMR
##$MNOVA/SCALES_VERSION=	8
##$PARAMETER FILE=	(acqus, ASCII, //ch-nmrserv2.ch.ic.ac.uk/Av400D/ug1/nmr/Jan28-2020/20/acqus, 0)
$$ ##TITLE= Parameter file, TOPSPIN		Version 3.2
$$ ##JCAMPDX= 5.0
$$ ##DATATYPE= Parameter Values
$$ ##NPOINTS= 11	$$ modification sequence number
$$ ##ORIGIN= Bruker BioSpin GmbH
$$ ##OWNER= nmrsu
$$ $$ 2020-01-28 15:20:18.200 +0000  nmrsu@nmrpc
$$ $$ /opt/topspin/data/ug1/nmr/Jan28-2020/20/acqus
$$ $$ process /opt/topspin3.2/prog/mod/shimcntl
$$ ##$ACQT0= -2.04831932773109
$$ ##$AMP= (0..31)
$$ 100 100 100 100 100 100 100 100 100 100 100 100 100 100 100 100 100 100
$$ 100 100 100 100 100 100 100 100 100 100 100 100 100 100
$$ ##$AMPCOIL= (0..19)
$$ -1 0 0 0 0 0 0 0 0 0 0 0 0 0 0 0 0 0 0 0
$$ ##$ANAVPT= -1
$$ ##$AQSEQ= 0
$$ ##$AQ_mod= 3
$$ ##$AUNM= <au_zg>
$$ ##$AUTOPOS= <21 >
$$ ##$BF1= 400.05
$$ ##$BF2= 400.05
$$ ##$BF3= 400.05
$$ ##$BF4= 400.05
$$ ##$BF5= 400.05
$$ ##$BF6= 400.05
$$ ##$BF7= 400.05
$$ ##$BF8= 400.05
$$ ##$BYTORDA= 0
$$ ##$CAGPARS= (0..11)
$$ 0 0 0 0 0 0 0 0 0 0 0 0
$$ ##$CFDGTYP= 0
$$ ##$CFRGTYP= 9
$$ ##$CHEMSTR= <none>
$$ ##$CNST= (0..63)
$$ 1 1 1 1 1 1 1 1 1 1 1 1 1 1 1 1 1 1 1 1 1 1 1 1 1 1 1 1 1 1 1 1 1 1 1 1
$$ 1 1 1 1 1 1 1 1 1 1 1 1 1 1 1 1 1 1 1 1 1 1 1 1 1 1 1 1
$$ ##$CPDPRG= (0..8)
$$ <> <> <> <> <> <> <> <> <>
$$ ##$D= (0..63)
$$ 0 1 0 0 0 0 0 0 0 0 0 0 0 0 0 0 0.0002 0 0 0 0 0 0 0 0 0 0 0 0 0 0 0 0
$$ 0 0 0 0 0 0 0 0 0 0 0 0 0 0 0 0 0 0 0 0 0 0 0 0 0 0 0 0 0 0 0
$$ ##$DATE= 1580224817
$$ ##$DE= 6.5
$$ ##$DECBNUC= <off>
$$ ##$DECIM= 2496
$$ ##$DECNUC= <off>
$$ ##$DECSTAT= 4
$$ ##$DIGMOD= 1
$$ ##$DIGTYP= 12
$$ ##$DQDMODE= 0
$$ ##$DR= 22
$$ ##$DS= 4
$$ ##$DSPFIRM= 0
$$ ##$DSPFVS= 20
$$ ##$DTYPA= 0
$$ ##$EXP= <proton>
$$ ##$F1LIST= <>
$$ ##$F2LIST= <>
$$ ##$F3LIST= <>
$$ ##$FCUCHAN= (0..9)
$$ 0 2 0 0 0 0 0 0 0 0
$$ ##$FL1= 90
$$ ##$FL2= 90
$$ ##$FL3= 90
$$ ##$FL4= 90
$$ ##$FOV= 20
$$ ##$FQ1LIST= <>
$$ ##$FQ2LIST= <>
$$ ##$FQ3LIST= <>
$$ ##$FQ4LIST= <>
$$ ##$FQ5LIST= <>
$$ ##$FQ6LIST= <>
$$ ##$FQ7LIST= <>
$$ [...]
$$ 130000 130000 130000 130000 130000 130000 130000 130000 130000 130000 130000
$$ 130000 130000 130000 130000 130000 130000 130000 130000 130000 130000 130000
$$ 130000 130000 130000 130000 130000 130000 130000 0 0 0 0 0 0 0 0 0 0 0
$$ 0 0 0 0 0 0 0 0 0 0 0 0 0
$$ ##$ShimPowMaxUC= (0..63)
$$ 130000 130000 130000 130000 130000 130000 130000 130000 130000 130000 130000
$$ 130000 130000 130000 130000 130000 130000 130000 130000 130000 130000 130000
$$ 130000 130000 130000 130000 130000 130000 130000 130000 130000 130000 130000
$$ 130000 130000 130000 130000 130000 130000 130000 0 0 0 0 0 0 0 0 0 0 0
$$ 0 0 0 0 0 0 0 0 0 0 0 0 0
$$ ##$ShimPowMaxUG= (0..63)
$$ 524287 524287 524287 524287 524287 524287 524287 524287 524287 524287 524287
$$ 524287 524287 524287 524287 524287 524287 524287 524287 524287 524287 524287
$$ 524287 524287 524287 524287 524287 524287 524287 524287 524287 524287 524287
$$ 524287 524287 524287 524287 524287 524287 0 0 0 0 0 0 0 0 0 0 0 0 0 0 0
$$ 0 0 0 0 0 0 0 0 0 0
$$ ##$ShimPowRcbType= 3
$$ ##$ShimPowRes= (0..63)
$$ 1e-20 1e-20 1e-20 1e-20 1e-20 1e-20 1e-20 1e-20 1e-20 1e-20 1e-20 1e-20
$$ 1e-20 1e-20 1e-20 1e-20 1e-20 1e-20 1e-20 1e-20 1e-20 1e-20 1e-20 1e-20
$$ 1e-20 1e-20 1e-20 1e-20 1e-20 1e-20 1e-20 1e-20 1e-20 1e-20 1e-20 1e-20
$$ 1e-20 1e-20 1e-20 1e-20 0 0 0 0 0 0 0 0 0 0 0 0 0 0 0 0 0 0 0 0 0 0 0 0
$$ ##$ShimPowRng0= (0..63)
$$ 1 1 1 1 1 1 1 1 1 1 1 1 1 1 1 1 1 1 1 1 1 1 1 1 1 1 1 1 1 1 1 1 1 1 1 1
$$ 1 1 1 1 0 0 0 0 0 0 0 0 0 0 0 0 0 0 0 0 0 0 0 0 0 0 0 0
$$ ##$ShimPowRng1= (0..63)
$$ 1 1 1 1 1 1 1 1 1 1 1 1 1 1 1 1 1 1 1 1 1 1 1 1 1 1 1 1 1 1 1 1 1 1 1 1
$$ 1 1 1 1 0 0 0 0 0 0 0 0 0 0 0 0 0 0 0 0 0 0 0 0 0 0 0 0
$$ ##$ShimPowRng2= (0..63)
$$ 1 1 1 1 1 1 1 1 1 1 1 1 1 1 1 1 1 1 1 1 1 1 1 1 1 1 1 1 1 1 1 1 1 1 1 1
$$ 1 1 1 1 0 0 0 0 0 0 0 0 0 0 0 0 0 0 0 0 0 0 0 0 0 0 0 0
$$ ##$ShimPowRng3= (0..63)
$$ 1 1 1 1 1 1 1 1 1 1 1 1 1 1 1 1 1 1 1 1 1 1 1 1 1 1 1 1 1 1 1 1 1 1 1 1
$$ 1 1 1 1 0 0 0 0 0 0 0 0 0 0 0 0 0 0 0 0 0 0 0 0 0 0 0 0
$$ ##$ShimSysFunc= (0..63)
$$ 1 2 3 4 5 6 7 8 9 10 0 37 38 35 16 15 14 13 12 11 28 27 26 25 24 23 36
$$ 22 30 29 20 21 34 33 32 31 17 18 19 0 0 0 0 0 0 0 0 0 0 0 0 0 0 0 0 0 0
$$ 0 0 0 0 0 0 0
$$ ##$ShimSysMatrix= 0
$$ ##$ShimSysType= 4
$$ ##$TFXNUM= 0
$$ ##$TRIPLO2= 0
$$ ##$VTU= 2
$$ ##$VTUETH= <149.236.99.20>
$$ ##$VTUTY= <no>
$$ ##$WBREFAM= (0..15)
$$ 136.7 118.7 100 100 100 100 100 100 100 100 100 100 100 100 100 100
$$ ##$WBREFLM= (0..15)
$$ 0 0 0 0 0 0 0 0 0 0 0 0 0 0 0 0
$$ ##$WBREFPH= (0..15)
$$ 77.55 -71.28 0 0 0 0 0 0 0 0 0 0 0 0 0 0
$$ ##$WBSGU= (0..15)
$$ 0 0 0 0 0 0 0 0 0 0 0 0 0 0 0 0
$$ ##$XFAC= 2
$$ ##END=
$$ 
##$DECIM=	2496
##$DSPFVS=	20
##XUNITS=	HZ
##YUNITS=	ARBITRARY UNITS
##FIRSTX=	6406.710256386850233
##LASTX=	-1606.1102564336499654
##DELTAX=	-0.12226780365942625795
##XFACTOR=	1
##YFACTOR=	0.004273490083700219079
##FIRSTY=	8.0835905075073242188
##MINY=	-9.430263519287109375
##MAXY=	7465.255859375
##NPOINTS=	65536
##XYDATA=	(X++(Y..Y))
$$ [...]
2370 839 899 990 1001 892 824 883 983 992 921 894 948 951 955 912 870 766 662 629 677 719 762 800 837 808 779 757 735 754 772 835 897 960 1022 1051
2366 1051 1080 1016 951 959 967 936 904 932 960 954 947 931 995 1059 1043 952 860 831 801 867 933 977 942 875 808 859 991 1109 1148 1116 1084 1020 956 959 962 983
2361 983 1004 958 913 898 882 806 729 759 869 979 1008 987 966 941 915 905 896 922 947 959 890 805 720 759 879 906 852 812 772 793 814 882 949 1000
2357 1000 970 949 1008 1062 1036 999 962 986 1011 958 904 873 921 935 948 900 851 905 958 944 931 921 912 902 893 838 784 845 905 944 903 840 778 759 740
2353 740 721 702 691 681 737 793 822 852 881 911 931 951 931 912 983 1054 1032 1010 975 940 904 869 870 870 870 871 867 863 859 855 935 1015 1073 1052 1013 975 931 888 858
2348 858 829 866 903 909 915 920 926 965 1004 1022 960 893 826 870 913 959 924 894 864 947 1029 1045 1061 1063 1065 1066 1068 1051 1035 1018 1001 914 826 778 731 748 764 798 911
2344 911 1034 1078 1003 927 888 929 970 930 911 892 956 1021 1045 989 912 834 868 902 937 971 1059 1147 1160 1094 1040 987 870 753 674 729 802 876 936
2339 936 997 1021 911 797 816 898 981 966 952 1005 1057 1013 969 964 960 961 962 924 885 842 800 838 876 916 957 998 1038 1041 1043 1046 1048 1047 1046 1045 1044 985 926 867 807 738
2335 738 669 786 904 877 850 864 877 924 970 1017 1064 1016 969 921 874 894 913 933 953 916 878 841 804 866 928 989 1051 1023 994 966 937 955 972 990
2330 990 1007 1023 1039 1055 1070 1151 1232 1126 1021 999 977 956 934 930 927 963 999 945 890 916 941 938 936 933 930 910 890 829 769 832 896 825 755 816 877 938 999
2326 999 1036 1073 1029 986 983 980 977 974 1012 1051 1009 968 988 1008 1028 1048 1050 1053 1055 1058 1098 1139 1180 1221 1227 1232 1158 1084 1045 1005 1046 1087 1033 979 1006 1032 1057 1083 1068 1053
2321 1053 1008 963 918 873 856 838 901 963 947 932 996 1060 1075 1090 1025 961 960 960 1000 1040 1075 1110 1105 1100 1094 1089 1083 1078 1055 1032 1009 986 981 977 902 828 728 789 893
2316 893 997 970 944 997 1050 1053 1055 1017 980 953 926 900 873 896 920 943 966 948 930 952 974 921 868 895 922 878 835 831 827 832 837 881 926 879 832 865 898
2312 898 933 969 924 879 910 940 970 1000 1011 1021 1031 1041 999 956 1037 1119 1209 1139 1026 912 915 917 959 1001 981 961 941 920 860 799 819 838 958 1078
2308 1078 1064 1050 1012 974 936 898 897 897 897 896 893 891 928 965 997 1028 979 931 854 778 835 892 859 826 793 760 790 820 850 880 909 939 969 999 997 995 993 991 945
2303 945 898 892 886 921 955 909 864 856 848 840 831 846 861 876 891 876 861 845 830 819 807 796 785 726 668 797 926 956 987 938 888 860 831 763 694 690 686 762
2298 762 838 870 902 894 885 933 981 988 996 994 991 1029 1067 1033 999 1004 1010 1001 992 1063 1134 1132 1129 1126 1123 1052 981 990 999 1043 1088 1053 1017 990 963 936 909 889 869 983 1096 1119
2293 1119 1142 1084 1027 1043 1059 1110 1161 1118 994 916 971 1072 1092 1085 1079 1082 1086 961 836 800 844 887 851 846 842 832 823 867 911 955 999 1012 1025 1037 1050 1013
2289 1013 977 1021 1065 1099 1133 1167 1200 1132 1064 1031 1077 1059 1041 1028 1015 1058 1102 1070 1039 960 962 1047 1133 1095 976 933 970 1005 960 885 811 822 834 921
2284 921 1008 1007 925 844 842 934 1026 1043 1060 991 921 846 852 850 848 892 935 1006 1077 1068 1058 1012 965 959 952 975 998 1020 1043 1040 1038 1035 1032 1020 1007 994 982 1018 1054 1085 1116
2279 1116 1126 1057 992 927 987 1047 1027 1007 969 931 974 1016 1065 1113 1081 1049 1010 971 1012 1052 1074 1096 1078 1059 1059 1059 1019 979 908 837 903 1049 1112 1095 1043
2275 1043 1071 1113 1154 1160 1166 1178 1189 1133 1078 1070 1062 1013 965 974 982 951 919 907 894 975 1056 1095 1135 1080 1026 1013 1000 1054 1108 1123 1139 1114 1090 1017 945 966 988
2271 988 1001 1015 962 909 948 988 1027 1066 1054 1042 1071 1099 1047 995 982 1050 1140 1096 985 875 902 930 998 1066 1044 1021 1039 1057 1074 1092 1015 939 940 941 981
2266 981 1022 1062 1102 1048 995 1032 1068 1038 1008 1007 1006 965 923 905 886 961 1036 1023 1010 998 985 986 986 920 854 851 848 844 841 874 908 941 974 1004 1034 1024 1014 997 979
2262 979 1028 1077 1094 1110 1087 1063 1011 959 974 989 1018 1048 962 876 949 1102 1143 1050 953 936 986 1036 1007 979 990 1002 912 823 776 810 874 858 807 836
2257 836 920 1005 1027 1050 1044 1039 1033 1027 1024 1020 1017 1013 1051 1089 1087 1085 1151 1216 1215 1214 1169 1125 1120 1116 1188 1259 1283 1226 1206 1186 1161 1136 1117 1097 1078 1058 1047 1036 1092 1148 1135 1122
2252 1122 1099 1156 1230 1224 1148 1072 1075 1079 1047 1015 964 992 1042 1092 1144 1196 1207 1219 1230 1241 1252 1263 1291 1320 1389 1458 1419 1380 1385 1470 1551 1551 1482 1413 1380 1346 1353
2248 1353 1360 1367 1375 1382 1390 1401 1413 1331 1249 1210 1171 1175 1259 1372 1404 1319 1233 1173 1193 1257 1320 1407 1414 1346 1277 1308 1339 1299 1180 1142 1184 1217 1249 1233 1217 1116
2243 1116 1015 961 1040 1134 1148 1112 1156 1216 1277 1259 1241 1263 1286 1307 1329 1311 1293 1330 1367 1364 1361 1340 1320 1419 1519 1459 1398 1338 1277 1317 1357 1398 1438 1403
2239 1403 1368 1293 1218 1203 1188 1267 1345 1379 1412 1446 1479 1425 1371 1318 1264 1273 1283 1292 1302 1319 1336 1353 1370 1374 1377 1314 1251 1210 1169 1221 1273 1250 1227 1244 1261 1284
2235 1284 1308 1238 1169 1180 1191 1202 1213 1287 1361 1368 1375 1339 1304 1335 1366 1327 1287 1367 1448 1460 1472 1444 1416 1486 1556 1559 1563 1494 1426 1478 1529 1513 1496 1440 1383 1407
2230 1407 1431 1361 1291 1316 1342 1327 1313 1292 1271 1249 1228 1269 1311 1352 1393 1370 1347 1324 1301 1268 1236 1297 1359 1371 1383 1301 1220 1166 1111 1177 1242 1320 1397 1328
2226 1328 1258 1236 1214 1232 1250 1289 1328 1327 1326 1303 1280 1258 1235 1214 1193 1172 1150 1193 1235 1184 1133 1112 1091 1110 1129 1148 1168 1187 1207 1164 1121 1145 1168 1179 1190
2222 1190 1134 1078 1061 1043 1092 1141 1120 1099 1144 1190 1173 1157 1074 991 972 953 1000 1047 1047 1047 1087 1127 1085 1044 1002 960 1009 1057 1106 1154 1089 1023 1025 1026 1077 1127
2218 1127 1031 935 945 956 1034 1111 1089 1067 1086 1104 1087 1071 1054 1038 1061 1083 1106 1129 1095 1061 1027 993 963 932 941 951 1016 1081 1080 1078 1054 1029 1004 979 1024 1069
2213 1069 1114 1159 1146 1133 1054 974 1005 1036 991 947 980 1093 1131 1089 1054 1099 1173 1248 1228 1208 1187 1167 1167 1168 1168 1169 1184 1199 1215 1230 1172 1113 1135 1156 1156 1155 1114
2209 1114 1073 1076 1080 1083 1086 1137 1188 1159 1130 1105 1081 1132 1183 1186 1110 993 956 1005 1053 1107 1160 1262 1363 1330 1298 1317 1336 1275 1134 1077 1153 1240 1246 1186 1206
2204 1206 1257 1307 1252 1198 1224 1250 1299 1347 1316 1285 1250 1215 1260 1306 1351 1397 1354 1232 1132 1033 1008 984 1018 1052 1086 1119 1127 1135 1183 1231 1175 1119 1146 1254
2200 1254 1340 1347 1275 1203 1183 1244 1260 1275 1298 1320 1267 1214 1137 1140 1226 1312 1292 1191 1090 1070 1143 1216 1265 1233 1233 1313 1417 1389 1266 1142 1197 1252 1247 1242
2196 1242 1237 1232 1282 1331 1301 1271 1360 1450 1459 1469 1447 1425 1403 1381 1431 1481 1530 1580 1558 1537 1515 1494 1549 1604 1659 1714 1702 1689 1677 1665 1686 1707 1647 1588 1570 1552
2192 1552 1614 1675 1691 1707 1683 1659 1637 1615 1673 1731 1792 1852 1873 1894 1947 2000 2013 2026 2089 2152 2230 2148 2028 1989 2081 2173 2243 2314 2344 2375 2416 2457 2459 2460 2515
2187 2515 2571 2706 2842 2992 3142 3343 3543 3677 3972 4483 5075 5642 6289 7137 8144 9224 10036 10488 10460 9963 9199 8387 7655
2185 7655 7062 6629 6462 6562 6735 6827 6835 6762 6612 6382 6058 5734 5390 5046 4742 4437 4268 4099 4064 4028 4038 4047 4017 3987 4049 4112 4307
2181 4307 4503 4732 4960 5193 5426 5628 5910 6356 6937 7573 8075 8364 8360 8097 7701 7291 7014 6860 6786 6750 6714 6656 6518 6239 5959
2178 5959 5657 5356 5094 4913 4789 4745 4749 4834 4978 5123 5233 5343 5429 5514 5680 5846 6120 6395 6670 6944 7155 7367 7543 7639 7677 7715
2175 7715 7882 8049 8256 8463 8758 9133 9576 10019 10467 10915 11311 11707 12028 12349 12684 13099 13550 14000 14427 14854 15491 16315 17375
2172 17375 18783 20701 23126 26109 29812 34522 40594 48271 57416 67305 76474 83467 87658 89664 90896 92542 94802
2170 94802 96865 97460 95810 92212 87823 84101 82190 82760 85803 90580 95628 99368 100936 100769 100039 99922 100863 102792 105117
2168 105117 106775 106589 104080 100103 96367 94426 95127 98707 105035 113276 122077 130470 138943 149538 164750 185690 210126
2166 210126 231684 242325 237338 218659 193668 170038 151650 138465 128544 119983 111663 103530 96515 91821 89987
2164 89987 90955 94145 98322 101683 102776 101494 99117 97231 96546 97035 98138 98817 97708 94203 88964 83741 80040 78563
2162 78563 79462 82464 86560 90045 91262 89700 86349 82992 81050 80541 80112 77798 72255 63717 53763 44200 36052 29545
2159 29545 24400 20385 17251 14838 12986 11617 10595 9723 8931 8286 7775 7306 6917 6673 6429 6150 5790 5471 5231 5056
2157 5056 4881 4741 4681 4577 4394 4180 3967 3888 3810 3731 3653 3577 3500 3424 3348 3301 3255 3209 3162 3191 3219 3247 3276 3241 3207 3128 3129 3182 3235 3333 3432 3571
2153 3571 3710 3924 4138 4368 4518 4580 4641 4633 4626 4762 5084 5587 6223 6882 7408 7633 7404 6759 6033 5449 5053 4840 4627 4423 4219
2150 4219 3976 3732 3567 3402 3370 3339 3291 3244 3330 3416 3545 3675 3804 3933 4163 4392 4754 5195 5633 5910 6095 6281 6405 6529 6414
2147 6414 6219 6045 6031 6235 6707 7535 8523 9472 10153 10314 9888 9043 8038 7005 6051 5252 4612 4125 3718 3364 3091 2882 2674
2144 2674 2470 2267 2091 1915 1819 1723 1706 1688 1671 1653 1611 1570 1528 1486 1428 1370 1311 1253 1250 1247 1244 1242 1264 1286 1175 1063 1075 1087 1099 1110 1212 1314
2140 1314 1282 1251 1192 1134 1075 1017 1027 1036 1046 1056 1051 1047 1042 1037 1087 1138 1108 1078 1071 1064 1057 1050 1073 1096 1119 1142 1110 1079 1127 1176 1136 1096 1056 1017 1007 998 989 980 1011 1042
2135 1042 992 943 1033 1124 1134 1144 1118 1091 1065 1038 999 960 921 881 964 1046 1049 1051 1057 1063 1069 1075 1045 1016 987 958 960 963 966 969 948 928 912 896 883 950 1052 1021 901
2131 901 861 902 942 947 952 1090 1228 1273 1318 1283 1248 1211 1173 1216 1259 1182 1105 1028 951 952 952 953 953 959 965 970 976 919 862 885 908 893 877 942 1007 1091 1176 1073
2126 1073 971 978 986 993 1001 996 992 987 982 1012 1043 993 943 936 930 923 916 915 913 911 910 944 978 1013 1047 1031 1016 1000 984 967 950 933 916 899 882 865 848 866 884 903 921 984
2121 984 1047 977 907 945 983 1021 1058 1040 1021 1002 983 999 1015 951 887 916 944 893 841 831 821 851 881 851 822 886 950 945 939 893 847 857 868 918 968 925
2116 925 883 841 798 795 792 789 786 869 952 1034 1117 1070 1022 975 928 955 981 1008 1035 1102 1168 1142 1115 1104 1092 1041 989 887 785 802 820 864 908 952 996 985
2112 985 973 961 949 914 880 845 811 806 802 797 793 826 859 892 925 948 971 954 937 888 840 859 877 946 1016 1085 1154 1134 1114 1001 888 905 923 980 1038 1055
2108 1055 1072 1049 1026 1034 1041 1116 1190 1209 1228 1247 1266 1339 1412 1391 1371 1396 1421 1407 1392 1405 1419 1339 1259 1156 1052 1095 1138 1222 1305 1241 1178 1201 1225 1182
2103 1182 1139 1167 1196 1224 1253 1271 1289 1307 1326 1254 1182 1110 1038 1056 1074 1092 1110 1118 1125 1133 1141 1152 1163 1173 1184 1195 1206 1216 1227 1249 1270 1291 1313 1311 1309 1307 1305 1316
2099 1316 1328 1339 1350 1368 1385 1402 1419 1434 1448 1395 1343 1335 1327 1358 1390 1325 1261 1289 1318 1380 1442 1437 1432 1376 1321 1198 1076 1076 1077 1077 1077 1059 1041 1117 1193 1182 1170
2094 1170 1159 1148 1069 991 952 913 995 1076 1064 1052 1027 1002 977 952 884 817 843 868 872 875 972 1068 1152 1235 1225 1215 1185 1155 1192 1229 1243 1257 1271 1286 1236
2090 1236 1187 1204 1221 1251 1281 1244 1207 1187 1168 1188 1209 1215 1222 1228 1234 1191 1148 1038 928 907 887 981 1075 1138 1120 1081 1042 1023 1003 949 895 832 850 937 1025
2086 1025 1026 948 869 871 973 1075 1111 1068 1001 1015 1098 1182 1181 1180 1179 1179 1204 1229 1294 1359 1323 1287 1267 1328 1377 1346 1298 1251 1243 1236 1268 1301 1306 1312 1313 1314 1327 1259 1237
2081 1237 1215 1217 1220 1223 1226 1240 1255 1269 1284 1241 1198 1155 1112 1071 1029 1076 1123 1117 1031 906 860 902 944 951 957 1036 1115 1177 1158 1079 1079 1115 1070 999 928 972 1016 967
2076 967 918 939 1040 1147 1173 1156 1139 1093 1046 1070 1174 1226 1197 1152 1106 1077 1048 1018 989 1008 1027 1046 1065 1101 1137 1106 1075 988 901 809 797 844 891
2072 891 899 827 775 804 902 1000 1003 1005 941 877 862 847 926 1004 944 884 824 764 798 833 827 821 898 975 986 996 945 894 883 871 927 982 970 959 945 931 983
2068 983 1036 1038 1040 1042 1044 962 880 917 955 988 1022 988 954 913 872 871 870 878 886 895 903 930 957 985 1012 1021 1031 1040 1050 1009 968 928 887 915 943 971 999 986 973 960 947
2063 947 995 1044 1025 1007 978 949 959 970 894 818 836 987 1127 1188 1156 1123 1158 1194 1162 1131 1138 1145 1152 1159 1131 1103 1075 1048 1043 1039 1034 1030 1074 1117 1161 1205 1172 1139
2058 1139 1106 1073 1084 1095 1107 1118 1065 1011 1077 1144 1081 1018 995 972 982 993 1003 1013 1003 993 1057 1122 1165 1128 1136 1144 1175 1205 1155 1105 1070 1035 1000 965 949
2054 949 933 917 900 819 738 692 725 822 919 938 877 865 934 953 972 964 957 950 942 930 918 905 893 905 916 928 939 921 902 839 855 930 1005 1004 1004 1003 1003 1003 1002 958
2049 958 914 906 977 1040 1103 1091 1079 1026 973 921 868 872 876 881 885 843 801 789 858 933 928 844 761 768 856 944 952 977 1001 1021 1040 995 950 985 1019 1019 1019 1019 1019 1027 1035 1044
2044 1044 1052 1055 1059 1062 1065 1043 1021 999 977 908 840 899 959 979 918 933 1027 1102 1096 1061 1026 1015 1004 993 982 958 934 990 1045 1061 1076 1091 1106 1141 1177 1132 1087
2039 1087 1035 984 932 881 896 911 927 942 1040 1137 1155 1173 1125 1078 1031 983 948 913 878 842 859 875 892 908 933 957 901 846 859 871 884 897 904 911 917 924
2035 924 941 958 975 992 889 786 764 741 737 733 728 724 743 763 782 801 844 886 849 811 891 970 970 969 985 1001 1017 1033 1032 1031 1030 1029 1011 993 975 958 929 901 873
2030 873 845 880 916 951 986 957 927 898 869 930 990 971 952 880 808 870 932 919 905 892 879 905 931 957 983 1006 1029 918 808 840 873 985 1098
2026 1098 1122 1146 1037 927 889 850 811 772 842 913 903 894 874 855 876 897 896 895 855 814 863 912 961 1010 1068 1126 1144 1163 1098 1032 1061 1089 1115 1141 1073
2022 1073 1006 976 946 916 886 911 936 961 986 1018 1049 1041 1033 1047 1061 1075 1089 1077 1065 1053 1041 986 930 915 900 970 1039 1042 1045 1007 968 970 971 982 994 965 936
2017 936 983 1029 1076 1122 1086 1049 1013 976 958 940 962 984 956 928 966 1005 1033 1062 1024 986 964 941 986 1030 1050 1069 996 922 971 1020 976 931 991 1051 991
2013 991 931 951 970 990 1009 1005 1000 955 910 846 782 785 788 823 858 853 848 850 852 854 855 877 899 881 863 925 987 1050 1112 1056 1000 945 889 963 1038 1019 1000 958 917 969
2008 969 1021 1035 1050 971 892 857 822 854 886 912 939 965 991 925 859 793 726 781 837 892 947 967 987 914 840 859 877 936 995 966 937 908 879 950 1021
2004 1021 1051 1082 1088 1094 1099 1105 1061 1017 1013 1009 1078 1147 1123 1099 1044 990 935 881 855 830 925 1020 995 971 1041 1110 1025 940 948 957 963 970 977 984 997 1010 1023 1035 1002 968
1999 968 934 901 911 920 890 860 879 899 878 858 897 935 974 1013 980 946 953 960 1035 1111 1067 1023 917 810 824 838 903 967 1032 1097 1036 975 954 933 933 932
1995 932 932 932 924 916 908 900 949 997 1046 1095 1110 1126 1142 1158 1146 1133 1081 1028 1081 1134 1067 1000 1030 1061 1091 1122 1086 1051 948 846 841 837 952 1068 1013 957 862
1990 862 767 775 782 749 717 769 822 874 927 957 987 897 807 778 748 759 770 778 785 886 987 976 965 887 810 743 676 756 836 845 854 863 872 955 1038 1055 1071 1065
1985 1065 1058 1012 965 1000 1035 1071 1106 1056 1006 957 907 930 953 976 999 989 980 1011 1042 1008 975 1008 1042 1082 1122 1095 1069 1030 991 952 913 996 1079 1095 1111
1981 1111 1025 939 946 953 953 953 993 1033 1047 1060 1074 1087 1025 963 901 839 876 914 951 988 1008 1027 980 932 961 989 978 966 950 934 1012 1089 1074 1059 1044 1029
1977 1029 1018 1008 1090 1173 1209 1246 1163 1079 1040 1001 1002 1003 989 975 1028 1081 1085 1088 1026 963 1009 1056 1102 1149 1073 998 989 981 1028 1075 1029 983 1032 1080 1088 1097 1059 1020
1972 1020 982 944 936 928 919 911 946 982 1017 1052 990 929 867 805 801 796 791 786 806 825 845 865 846 827 849 870 947 1024 1008 991 958 925 1012 1099 1103 1107 1045 982 1011
1967 1011 1039 1027 1016 974 932 890 848 853 859 865 870 857 843 829 816 859 902 905 908 927 946 1031 1117 1081 1046 1077 1108 1085 1061 1038 1014 961 908 922 936 910 883
1963 883 923 963 990 1018 979 939 985 1031 1122 1133 1121 1109 1092 1075 1054 1032 1010 988 1003 1018 1033 1048 1040 1032 1025 1017 959 901 844 786 790 794 798 803 854 906 878 849 827
1958 827 805 823 841 881 921 887 852 864 955 972 908 840 852 943 955 947 1019 1090 1082 1006 1011 1147 1283 1250 1138 1035 932 890 927 1000 1072 1053 1035 981
1954 981 927 884 920 991 1063 1022 981 981 980 960 940 920 900 883 865 976 1087 1135 1103 1035 968 936 905 948 992 988 903 779 735 799 863 927 991 1021 971
1950 971 920 950 1029 1107 1111 1115 1130 1145 1080 1015 977 939 977 1014 1034 974 915 935 983 1030 1083 1135 1058 980 903 825 855 885 914 944 966 989 1051 1113 1057 1000
1945 1000 1024 1047 1067 1088 1068 1048 997 947 896 845 947 1049 1071 1093 1041 988 935 883 963 1044 1125 1205 1234 1263 1212 1161 1095 1030 1004 979 983 988 993 997 949
1941 949 901 859 816 850 965 1035 972 842 793 832 951 1027 1103 1144 1185 1171 1157 1063 969 966 962 999 1035 1053 1070 1007 865 779 827 928 1029 1018 1008
1937 1008 997 987 952 917 882 847 793 738 684 630 720 810 859 909 880 850 901 951 981 1012 1042 1072 1003 934 945 957 969 982 954 927 927 927 927 927 962 998
1932 998 1034 1069 1062 1055 1008 961 870 780 769 758 794 830 906 982 1000 1018 1036 1054 1077 1101 1124 1147 1139 1131 1163 1195 1091 987 972 956 922 808 735 741 790 840
1928 840 894 949 956 963 965 966 938 830 783 817 895 893 848 803 786 769 747 805 885 965 1002 959 884 808 798 869 946 943 851 840 929 1019 1065 1031 1014 996 974
1924 974 952 923 895 867 839 913 988 1063 1138 1153 1169 1117 1066 1024 982 940 897 890 883 876 869 918 968 951 934 964 994 1025 1055 1086 1116 1192 1187 1178 1168 1153 1139 1098
1919 1098 1057 1016 975 911 848 789 731 672 693 789 886 933 980 961 941 882 822 857 891 893 895 858 820 836 852 908 964 927 889 873 938 980 1023 977 931
1915 931 909 887 905 924 954 984 1015 1045 1021 997 973 949 926 903 880 857 914 970 1026 1082 1061 1039 1057 1076 1137 1199 1114 1029 1015 1002 988 974 1008 1042 1076
1910 1076 1110 1116 1121 1126 1131 1093 1055 1017 979 984 989 995 1000 994 987 914 841 913 985 964 942 925 908 891 874 871 869 960 1051 1027 1002 977 952 950 947 944 942 949 956 897 838 884 930
1905 930 909 889 887 886 885 883 890 896 943 989 919 849 845 842 863 885 907 928 915 901 888 874 969 1064 1013 961 929 897 959 1020 1026 1032 1038 1044 1038 1033 1027 1021 981 941 995 1048 1073
1900 1073 1097 1121 1145 1105 1065 1025 985 969 952 935 918 974 1029 1085 1140 1157 1174 1111 1048 1030 1011 993 974 1012 1050 1008 966 973 980 987 994 1064 1134 1124 1115 1075 1035
1895 1035 994 954 973 991 1009 1028 982 935 889 843 828 814 879 944 965 986 1006 1027 1074 1122 1089 1056 1039 1022 1005 988 966 944 922 899 888 877 865 854
1891 854 918 982 965 949 1004 1060 1115 1171 1143 1115 1087 1059 1099 1138 1045 951 933 914 901 887 904 1000 1126 1119 1047 975 1028 1081 1072 1062 1053 1043 1078 1114 1149 1185
1887 1185 1185 1185 1185 1185 1148 1112 1075 1038 990 942 894 846 794 743 825 907 982 1058 1054 1049 1068 1087 1106 1125 1073 1021 968 916 890 864 919 973 1048 1122 1116 1111 1078 1046
1882 1046 1014 981 949 917 885 853 865 876 888 899 906 913 921 928 952 976 920 864 954 1045 1056 1067 1050 1032 1015 997 1018 1040 981 922 898 875 851 827 800 773
1878 773 746 719 816 914 879 843 820 796 773 750 815 880 945 1009 1026 1043 1060 1077 1058 1038 1018 999 931 863 796 728 777 826 875 924 941 957 973 990 983
1873 983 976 969 962 968 975 982 988 1035 1082 1049 1015 965 914 944 973 937 902 946 991 1010 1029 1048 1067 1009 951 974 996 953 910 866 823 888 953 1019 1084 1056 1028 1000
1869 1000 972 989 1006 947 889 898 986 1074 1082 1052 1022 987 952 965 978 992 1005 1004 1002 1028 1014 990 1047 1064 1001 891 822 859 896 932 967 1043 1119 1131 1143 1075
1864 1075 1006 916 826 869 912 977 1041 1026 1011 1011 1012 1012 1013 980 948 956 964 1020 1075 1051 1026 1057 1088 1118 1149 1142 1135 1088 1040 1047 1053 1007 920 858 876 927 977 1002 1027
1860 1027 977 926 903 959 980 922 929 1016 1101 1106 1028 990 1030 1029 978 967 1011 1054 1059 1063 1067 1071 1029 986 944 901 880 859 919 978 971 963 1031 1098 1101 1024 970 955 973
1855 973 991 1009 1027 993 920 898 957 1038 1038 989 979 1048 1156 1190 1092 993 974 1036 1097 1083 1070 1096 1123 1167 1212 1177 1141 1131 1120 1070 1019 965 910 935 961
1851 961 955 949 944 938 920 902 924 945 906 867 908 949 1022 1095 1089 1082 1064 1047 1029 1012 1032 1053 1074 1095 1087 1079 1072 1064 1019 974 969 964 1000 1037 994 950 853 756 793 830 865
1846 865 900 896 891 1004 1117 1043 969 970 971 1052 1133 1047 961 875 789 867 945 1023 1101 1087 1074 1060 1046 1013 981 1028 1075 1146 1217 1208 1198 1226 1253 1280 1308 1274
1841 1274 1240 1167 1093 1041 989 1017 1045 1083 1122 1161 1200 1215 1230 1166 1101 1087 1073 1099 1126 1084 1042 1080 1119 1071 1023 976 928 942 957 971 985 1007 1030 972
1837 972 914 898 881 864 847 759 670 769 867 936 1006 995 984 1080 1176 1192 1208 1137 1066 1075 1084 1100 1116 1131 1147 1128 1109 1091 1072 1053 1034 1015 996 986 976 966
1833 966 956 969 982 996 1009 1019 1029 1040 1050 1040 1030 1100 1170 1219 1267 1235 1204 1140 1077 1093 1110 1101 1092 1084 1075 1061 1047 1033 1020 1021 1023 1025 1027 1017 1007 997 987 935 882
1828 882 910 937 970 1003 1035 1068 1124 1181 1237 1294 1162 1030 978 926 936 945 955 964 1029 1094 1078 1063 1000 938 955 973 1047 1121 1116 1110 1064 1019 1054 1088 1078 1067
1823 1067 1057 1047 951 854 838 822 886 950 1014 1079 1082 1086 1010 933 939 944 950 955 982 1009 1037 1064 1081 1098 1115 1132 1114 1097 1079 1062 1033 1003 974 945 917 890 942
1819 942 995 945 896 882 947 952 956 966 975 973 971 924 957 1011 1065 1044 1024 976 929 836 824 896 968 1091 1133 1072 1011 949 888 865 922 1063 1203 1238 1194 1114
1814 1114 1034 959 884 889 894 930 967 1003 1040 975 910 925 939 961 983 1004 1026 1060 1093 1047 1000 969 938 906 875 924 973 1022 1071 1045 1019 1023 1107 1178 1169 1130
1810 1130 1091 1061 1030 999 969 975 982 988 995 1006 1018 1029 1041 1107 1174 1160 1147 1108 1070 1031 993 970 946 923 900 969 1037 1076 1034 978 1003 1105 1208 1216 1143 1071
1806 1071 1079 1076 1073 1070 1067 1096 1045 964 1016 1134 1252 1191 1131 1014 897 860 823 852 882 911 940 963 986 934 881 892 982 1102 1089 986 883 905 927
1802 927 974 1022 1069 1117 1116 1115 1114 1113 1096 1079 1062 1044 1057 1070 1083 1096 1055 1013 972 931 938 945 952 959 1031 1103 1041 979 1009 1039 1070 1100 1037 975 912 849 864 878 892
1797 892 906 956 1005 1055 1104 1098 1093 1087 1082 1118 1155 1112 1068 1025 981 1018 1055 1041 1028 1014 1000 1007 1013 1020 1026 962 898 915 931 945 960 975 989 990 991 986 982 1006 950 859 902
1792 902 1054 1126 1117 1109 1146 1183 1140 1096 1077 1058 1039 1020 1001 982 963 944 1012 1080 1068 1056 1055 1053 1131 1209 1158 1106 1055 1003 1027 1051 1074 1098 1103 1107 1112 1116 1123 1129 1055
1787 1055 982 987 992 997 1002 985 969 952 935 949 963 976 990 969 948 926 905 936 967 917 868 856 843 911 978 994 1010 1026 1042 1070 1098 992 886 962 1037
1783 1037 1032 1027 1016 1004 993 981 956 932 907 882 901 919 938 957 977 998 1019 1039 1077 1114 1071 1029 1074 1119 1085 1050 1024 998 971 945 1041 1137 1100 1063 1059 1055
1778 1055 1052 1048 1073 1097 1042 987 1065 1143 1141 1140 1086 1032 978 924 926 929 932 934 939 944 1029 1114 1106 1097 1089 1080 1115 1149 1103 1057 1059 1061 1063 1065 1002 940 918 895 1012 1129 1188 1113
1773 1113 1022 931 912 893 856 819 863 906 963 1020 1037 1055 961 867 856 926 1068 1130 1060 989 964 1020 1035 1050 1058 1147 1265 1384 1400 1336 1277 1218 1190
1769 1190 1163 1136 1108 1109 1109 1109 1109 1095 1081 1067 1052 1068 1084 1100 1116 1103 1091 1079 1066 1091 1115 1139 1164 1147 1131 1114 1098 1084 1070 1056 1042 1000 959 958 956 1036 1116
1765 1116 1115 1115 1107 1100 1066 952 825 831 890 950 940 931 1050 1169 1190 1131 1077 1024 978 932 966 1000 1037 1074 1031 987 943 899 935 971 1021 1070 1115 1159 1177
1760 1177 1115 1094 1072 1118 1085 1016 948 981 1015 1048 1082 1126 1169 1133 1096 1120 1143 1166 1190 1249 1308 1234 1160 1119 1079 1078 1078 1135 1192 1169 1146 1099 1053 1006 959
1756 959 977 996 1014 1032 992 952 912 871 974 1076 1045 1015 965 915 825 736 752 768 864 961 950 939 928 917 990 1063 950 836 847 858 882 826 811
1752 811 930 1014 1018 987 956 960 964 971 977 957 857 796 868 994 1120 1060 1000 980 959 1076 1193 1176 1159 1087 1014 1075 1135 1188 1241 1161 1080 1053 1026 999
1748 999 972 1003 1034 1065 1095 1076 1057 1038 1019 1033 1047 1061 1075 1110 1146 1102 1057 1039 1020 1002 983 951 919 968 1016 987 958 929 900 1044 1188 1229 1137 1002
1744 1002 1000 1093 1107 1041 976 986 996 992 988 984 980 924 868 817 767 778 870 961 973 960 948 935 922 903 964 1064 1085 995 906 993 1081 1085 1008 892 856 906
1739 906 956 971 985 971 956 982 1007 1050 1093 1176 1259 1282 1305 1248 1190 1158 1126 1134 1141 1130 1119 1108 1097 1060 1023 1066 1109 1105 1101 1096 1092 998 904 893 962 1071 1099
1735 1099 1045 990 986 982 938 894 923 951 980 1009 1018 1028 1037 1047 1043 1039 1086 1052 990 1009 1057 1105 1083 1061 1039 1017 988 958 929 899 920 941 973 923 884 924 994
1730 994 1064 1075 1085 1020 955 900 925 1031 1056 984 911 1016 1120 1107 1014 921 908 900 893 885 957 1024 1091 1082 1074 1052 1029 1007 985 1055 1124 1194 1263 1212 1160 1108
1726 1108 1056 1088 1120 1151 1183 1144 1106 1067 1028 1074 1119 1125 1130 1020 911 988 1065 1123 1181 1199 1217 1131 1045 1000 954 961 969 1057 1144 1128 1112 1096 1080 1069 1058
1722 1058 1047 1036 1051 1065 1080 1094 1064 1033 1003 972 963 954 1024 1095 1019 942 946 950 974 998 1021 1045 1053 1060 1068 1076 1038 1000 1002 1004 1070 1136 1122 1108 1043 977 991 1005 1042
1717 1042 1079 1035 992 1014 1037 1019 1001 1024 1047 1070 1093 1100 1108 1115 1123 1101 1078 1056 1033 1062 1091 1121 1150 1122 1095 1067 1040 1022 1003 985 966 1011 1056 1101 1146 1142 1138
1712 1138 1133 1129 1128 1127 1201 1276 1331 1306 1198 1090 1064 1119 1168 1218 1200 1181 1243 1305 1324 1343 1283 1222 1167 1112 1138 1163 1121 1078 1076 1074 996 919 921 923 955 986 1018
1708 1018 1050 996 942 971 1081 1198 1236 1191 1145 1052 959 950 1020 1051 1001 992 1062 1155 1168 1185 1203 1246 1209 1136 1064 1021 977 1014 1050 1074 1098 1042 986 1017
1704 1017 1047 1118 1188 1208 1227 1247 1267 1221 1175 1129 1083 1077 1070 1063 1057 1089 1122 1145 1247 1379 1431 1343 1174 1022 950 1015 1080 1145 1209 1194 1179 1172 1166 1160 1153 1137
1699 1137 1121 1104 1088 1025 963 980 998 993 989 985 981 982 983 985 986 975 964 953 942 976 1010 1010 1009 991 1053 1144 1236 1194 1071 949 906 949 992 1039 1087 1111 1135 1158
1695 1158 1182 1184 1185 1146 1107 1054 1000 1027 1053 1064 1074 1085 1095 1010 925 924 1002 1034 986 943 979 968 957 950 944 921 898 875 852 901 950 994 1038 1077 1036 1040 1045 1037
1690 1037 1029 1021 1013 1015 1017 1019 1021 1021 1020 1020 1020 983 947 906 944 1053 1161 1141 1120 1168 1215 1222 1230 1229 1229 1238 1168 1097 1107 1107 1106 1085 1063 1082 1101 1022 944 901 938 952 965 984
1685 984 1003 1025 1048 991 934 974 1014 1064 1035 952 950 1031 1112 1092 1072 1082 1172 1253 1253 1169 1086 1037 988 1067 1147 1180 1134 1092 1051 1019 987 955 923 929 935 890 926
1680 926 1014 1022 952 881 899 997 1095 1113 1030 947 893 920 958 997 1040 1084 1032 980 963 1026 1034 1042 1054 1067 1016 965 944 1003 1102 1120 1056 991 1009 1027 1044 1062
1676 1062 997 931 945 960 1027 1094 1161 1228 1190 1152 1113 1075 1063 1050 988 1005 1081 1077 989 901 913 925 937 949 952 956 914 953 1021 1089 1081 1074 1121 1167 1133 1099 1086
1671 1086 1074 1061 1048 1042 1036 1030 1024 1041 1059 997 934 1020 1106 1157 1128 1126 1123 1115 1107 1051 995 939 883 915 947 974 1000 1104 1128 1068 1008 988 1048 1063 1077 1122 1167 1132
1667 1132 1097 1058 1020 1061 1103 1164 1226 1207 1189 1073 957 900 976 1054 1132 1138 1144 1210 1276 1263 1249 1219 1188 1158 1128 1082 1037 991 946 951 955 960 964 986 1007 1029
1662 1029 1050 1042 1033 1024 1016 1002 988 974 960 957 955 953 950 1041 1132 1143 1153 1201 1248 1162 1076 1069 1061 1053 1046 1005 964 843 722 759 797 835 872 930 988 1045 1103 1173 1244
1658 1244 1235 1225 1144 1063 1062 1060 1063 1065 1148 1231 1191 1152 1113 1074 1110 1146 1102 1058 1096 1134 1171 1209 1165 1121 1077 1033 1029 1026 941 857 916 975 954 933 995 1057 1119 1181
1653 1181 1182 1182 1183 1183 1167 1150 1134 1118 1105 1092 1080 1067 1018 968 919 869 881 892 903 915 926 938 949 960 964 968 971 975 1068 1161 1120 1080 1040 1000 1026 1053 1077 1100
1648 1100 1030 960 956 952 948 944 986 1028 1003 978 1003 1027 1017 1007 979 1032 1084 1056 1028 999 1032 1065 1038 1012 985 958 1013 1067 1029 990 985 980 975 969 933 897 928 959
1644 959 968 978 948 918 858 799 761 803 931 1058 1116 1093 1021 949 938 928 941 954 1028 1103 1109 1034 995 1035 1089 1063 975 968 1017 1066 1026 987 1016 1045 1034
1639 1034 1022 1062 1101 1100 1099 1149 1198 1172 1066 1012 958 965 972 1077 1181 1191 1202 1237 1271 1235 1120 979 918 928 937 1052 1168 1216 1131 1043 1035 1013 992 1012
1635 1012 1031 1037 964 936 1041 1152 1182 1148 1113 1078 1044 1018 1073 1194 1236 1187 1139 1153 1166 1092 1018 1011 1003 1051 1099 1147 1195 1242 1289 1293 1216 1140 1144 1165 1186
1631 1186 1168 1150 1133 1115 1076 1038 999 960 982 1004 1027 1049 1090 1131 1177 1143 1089 1034 1041 1048 1029 1010 1085 1160 1112 1065 1040 1094 1163 1232 1239 1246 1248 1250 1164 1078 1039
1626 1039 1081 1144 1208 1253 1298 1246 1115 1008 982 999 1016 1013 1010 1007 1004 1034 1063 1093 1122 1179 1235 1221 1127 1013 979 1016 1052 1095 1138 1186 1153 1100 1046 1027 1009
1622 1009 1095 1180 1244 1228 1213 1198 1178 1157 1115 1072 1069 1067 1041 1016 1057 1099 1115 1132 1108 1084 1051 1017 1051 1084 1107 1131 1154 1177 1185 1193 1201 1209 1165 1121 1077 1034 1011
1618 1011 988 1046 1103 1149 1194 1160 1125 1116 1107 1177 1248 1211 1174 1177 1180 1219 1257 1215 1173 1189 1206 1182 1159 1091 1022 1039 1056 1086 1197 1302 1274 1149 1104 1139 1175
1613 1175 1214 1254 1373 1493 1389 1285 1261 1237 1222 1207 1232 1258 1241 1224 1340 1457 1564 1671 1739 1806 1907 2009 2078 2148 2208 2401 2733 3145
1610 3145 3709 4567 5789 7305 8797 9782 9891 9013 7502 5992 4773 3849 3143 2624 2321 2097 1905 1713 1566 1419 1414 1409
1607 1409 1443 1478 1418 1357 1430 1502 1456 1409 1443 1477 1396 1315 1368 1420 1488 1556 1615 1674 1749 1691 1520 1350 1267 1184 1235 1285 1291 1296 1342 1388 1391 1394 1397 1400 1444 1488
1603 1488 1451 1415 1404 1394 1463 1532 1463 1393 1363 1334 1345 1356 1447 1538 1473 1407 1342 1276 1242 1209 1308 1408 1431 1455 1550 1645 1664 1550 1466 1462 1467 1472 1443 1413 1298
1599 1298 1183 1201 1220 1263 1307 1310 1314 1363 1412 1462 1511 1484 1457 1510 1564 1435 1306 1311 1316 1368 1421 1394 1367 1285 1203 1201 1198 1229 1260 1291 1322 1317 1312 1306 1301 1305 1309 1353 1396
1594 1396 1334 1272 1290 1308 1261 1215 1248 1281 1335 1388 1308 1228 1139 1050 1094 1138 1141 1144 1146 1149 1142 1135 1208 1281 1287 1292 1258 1223 1181 1139 1177 1215 1174 1133 1092 1051 1045 1038 1112
1589 1112 1185 1141 1097 1133 1169 1174 1179 1224 1269 1292 1314 1337 1359 1311 1264 1296 1328 1324 1319 1315 1311 1235 1160 1168 1257 1249 1161 1154 1226 1253 1200 1156 1246 1352 1378 1373 1367 1363 1279 1195
1584 1195 1192 1190 1187 1190 1193 1202 1211 1220 1229 1215 1201 1228 1254 1240 1227 1288 1350 1368 1307 1246 1265 1300 1335 1325 1395 1438 1401 1408 1416 1426 1356 1320 1365 1438 1430 1393 1355 1380 1404 1423
1579 1423 1443 1459 1395 1375 1356 1375 1394 1413 1432 1453 1475 1491 1507 1476 1365 1264 1297 1381 1466 1480 1493 1438 1384 1329 1275 1276 1277 1279 1280 1294 1308 1283 1257 1234 1210
1575 1210 1267 1324 1254 1184 1198 1292 1342 1312 1282 1333 1326 1240 1233 1307 1346 1304 1263 1301 1389 1397 1449 1502 1519 1455 1394 1465 1539 1479 1377 1355 1355 1356 1356 1436 1463 1490 1441
1570 1441 1393 1416 1439 1462 1484 1441 1397 1354 1310 1337 1363 1390 1416 1432 1448 1464 1480 1518 1556 1635 1713 1878 2043 2324 2606 2791 2710 2432 2154 1989
1567 1989 1823 1702 1740 1718 1696 1595 1653 1770 1886 2013 2140 2478 2815 3186 3397 3260 2856 2421 2147 2015 1883 1750 1778 1806 1834
1564 1834 1733 1791 1894 1837 1800 1763 1780 1796 1752 1869 2014 2000 1952 1904 1929 1953 1845 1736 1791 1847 1862 1878 1930 1983 1902 1822 1837 1852 1937 2023 2165
1560 2165 2146 2085 2023 2047 2070 2004 2097 2309 2521 2556 2590 2625 2660 2605 2710 2816 2922 2851 2781 2792 2803 2734 2665 2693 2721 2669 2617 2625 2633 2621 2770 2911
1556 2911 2892 2750 2769 2833 2898 2786 2674 2783 2891 2861 2832 2792 2672 2567 2649 2852 2975 2971 3048 3233 3337 3305 3273 3269 3264 3126 2988 3019 3049
1552 3049 2946 2843 3080 3317 3542 3768 3994 4034 3963 4025 4251 4344 4280 4216 4260 4304 4269 4233 4410 4587 4471 4354 4424 4494 4485 4475 4661 4848
1549 4848 4901 4954 5158 5361 5324 5287 5337 5388 5251 5115 5241 5367 5378 5522 5908 6293 6340 6387 6613 6839 6878 6918 7229 7540 7611 7682 7873
1546 7873 8064 7908 7752 7955 8157 8226 8295 8648 9000 9113 9225 9575 9925 9888 9985 10767 12109 13662 15615 18313 21358 24086
1543 24086 26361 28194 29148 29043 28485 28244 28135 27790 27578 28093 28956 29621 30474 32034 33835 35159 36563 39004 42059 44948
1541 44948 48290 53353 59724 66090 72456 79851 87806 95408 104318 117472 135377 157184 186303 230464 295283 385230
1539 385230 515370 713860 995994 1326554 1612651 1746875 1673192 1422963 1093467 786774 557638 405666
1537 405666 304350 232338 180877 144761 117667 95664 79053 68193 60696 54234 48574 43942 39230 33768 28679
1535 28679 25089 22408 19569 16890 15116 13715 11976 10238 9190 8303 6942 5313 4092 3031 1668 145 -938
1533 -938 -1647 -2206 -2072 -669 1533 3539 5172 6677 7916 8533 8669 8699 8648 8349 7971 7862 7753 7339 6765 6421 6237 5816
1531 5816 5235 4851 4627 4256 3885 3770 3816 3814 3651 3623 3675 3509 3343 3438 3694 3813 3931 4307 4842 5284 5566 5835 5837 5373 4536 3827
1527 3827 3385 2988 2672 2680 2849 2819 2629 2520 2570 2486 2241 2130 2179 2244 2149 2100 2130 2074 1857 1822 1948 2052 1995 1914 1912 1965 2018 2209 2401
1524 2401 2504 2607 2564 2520 2274 2028 1929 1963 1917 1790 1781 1905 1922 1806 1760 1847 1956 1985 2001 2017 1914 1812 1824 1837 1767 1617 1579 1674 1659
1520 1659 1565 1556 1682 1723 1578 1503 1562 1591 1487 1356 1412 1502 1512 1467 1502 1590 1678 1763 1849 1837 1692 1510 1408 1325 1242 1258 1274 1291 1308 1392 1475
1516 1475 1471 1466 1528 1590 1621 1651 1637 1622 1593 1483 1456 1561 1652 1610 1579 1548 1501 1374 1305 1369 1397 1344 1336 1407 1470 1452 1440 1428 1383 1258 1215 1305 1392 1346
1512 1346 1299 1386 1458 1396 1365 1413 1470 1395 1260 1206 1170 1134 1103 1072 1087 1102 1181 1339 1490 1454 1337 1299 1303 1306 1355 1403 1530 1657 1772 1888 1940
1509 1940 1806 1635 1598 1565 1531 1413 1295 1290 1286 1282 1278 1296 1314 1319 1404 1448 1359 1229 1233 1330 1346 1269 1192 1168 1143 1159 1174 1152 1130 1107 1085 1054 1022 1028 1166
1504 1166 1302 1304 1192 1161 1185 1130 1074 1099 1171 1163 1041 998 1068 1138 1244 1351 1421 1357 1229 1182 1166 1149 1138 1126 1168 1209 1130 1051 1082 1113 1051 989
1500 989 1029 1070 1110 1151 1208 1265 1229 1192 1163 1134 1105 1076 1041 1006 1037 1069 1160 1251 1248 1246 1231 1215 1200 1185 1224 1263 1208 1153 1161 1169 1177 1185 1120 1055 990 925 972 1019
1496 1019 1026 1033 987 941 906 1003 1114 1092 961 911 953 995 1003 1010 1077 1144 1145 1146 1177 1208 1119 1030 1003 977 910 844 882 921 959 998 984 970 956 942 976 1010
1491 1010 1044 1079 1076 1073 1071 1068 1087 1106 1125 1144 1169 1193 1070 947 915 882 943 1004 1076 1149 1128 1107 1025 942 927 911 992 1073 1034 995 1008 1021 968 915 922 930
1487 930 937 944 1018 1092 1073 1053 1124 1194 1198 1202 1216 1231 1245 1259 1246 1233 1220 1207 1180 1153 1126 1099 1062 1025 987 950 942 934 925 917 912 907 969 1030 1066 1101 1097 1092 1096 1099 1102 1105 1201
1482 1201 1297 1353 1409 1379 1349 1252 1155 1276 1397 1371 1346 1324 1302 1281 1259 1289 1320 1283 1247 1256 1265 1314 1362 1410 1457 1504 1552 1662 1773 1817 1861 1987 2113
1478 2113 2249 2386 2538 2850 3290 3998 5059 6680 8886 11387 13430 14112 13046 10726 8149 6080 4622 3617 2906
1475 2906 2435 2124 1894 1694 1574 1555 1537 1556 1494 1411 1328 1312 1297 1322 1347 1336 1326 1249 1172 1186 1200 1174 1148 1148 1148 1148 1148 1157 1166 1135 1104 1039 974 979 1064
1471 1064 1201 1257 1190 1123 1153 1183 1125 1066 1113 1239 1307 1242 1155 1148 1235 1321 1343 1364 1363 1283 1227 1172 1205 1238 1188 1138 1084 1109 1217 1325 1389 1374 1390
1467 1390 1406 1417 1428 1428 1429 1479 1608 1817 2026 2206 2467 2912 3544 4404 5558 7086 8614 9649 9750 8898 7485 5938 4578
1464 4578 3619 3007 2588 2250 1981 1846 1761 1677 1644 1611 1538 1465 1353 1242 1176 1109 1102 1175 1208 1161 1056 952 944 1016 1053 1090 1052 1013 1006 999 992 984
1460 984 991 998 1005 1012 1037 1061 1046 1030 999 969 1019 1068 1100 1132 1164 1196 1169 1142 1115 1089 1074 1060 1045 1031 1018 1006 1033 1060 1110 1160 1130 1100 1049 998 947 896 935
1456 935 974 933 892 929 965 1002 1039 1071 1102 1134 1166 1164 1163 1161 1160 1142 1123 1105 1087 1064 1041 1018 996 1002 1008 1054 1101 1138 1176 1134 1091 1078 1064 1051 1038 975 912 929
1451 929 947 1022 1098 1040 982 906 830 941 1051 1082 1113 1063 1014 938 862 866 870 892 913 975 1036 1001 965 930 894 920 945 970 996 1035 1075 1034 994 975 956
1447 956 938 919 959 999 1039 1079 1071 1064 1061 1059 1012 1046 1075 1104 1123 1143 1133 1042 976 990 1079 1088 1057 1026 1070 1114 1048 983 997 1011 1056 1100 1145 1189 1155 1121 1086
1442 1086 1052 1001 950 980 1009 945 881 897 914 931 948 925 902 961 1019 1047 996 947 979 1046 1032 940 848 887 1007 1081 1075 1078 1082 1092 1101 1071 1041 985 930 955
1438 955 979 978 976 975 973 991 1010 1028 1047 1006 965 1000 1034 1062 1010 928 845 817 869 956 1043 1092 1141 1110 1078 1023 967 992 1016 1038 1060 1042 1025 1038 1051 1035 938
1433 938 835 813 922 1032 1060 1008 1002 995 1039 1082 1050 1019 938 938 1021 1104 1049 915 820 806 848 891 938 986 1024 1063 1021 979 978 976 974 972 941 911 886 860
1429 860 911 1042 1204 1231 1134 1036 1014 1072 1141 1131 1091 1050 970 890 946 1083 1165 1166 1138 1110 1101 1092 1113 1214 1260 1226 1158 1169 1214 1260 1230 1201 1183 1165
1425 1165 1067 969 1016 1063 1110 1158 1185 1213 1160 1108 1126 1144 1083 1021 1025 1029 1044 978 937 976 1005 1035 1017 999 987 974 937 981 1059 1137 1068 999 930 861 831
1421 831 800 850 899 1003 1106 1130 1153 1086 1020 1033 1046 1063 1080 1017 954 915 877 968 1058 1084 1030 1021 1012 1009 1006 1003 1000 1001 1002 1038 1074 1121 1087 1019 951 991 1031 1071
1416 1071 1111 1097 1083 994 905 891 956 1062 1088 1071 1054 1071 1089 1063 1037 1012 986 1030 1075 1079 1083 1020 958 1028 1099 1154 1209 1223 1238 1157 1076 1035 994 1005 1015
1412 1015 1066 1117 1079 1041 1044 1046 1086 1126 1086 1045 1073 1100 1168 1235 1140 1045 1029 1014 1031 1047 1063 1080 1057 1034 1051 1068 1086 1104 1041 979 1009 1039 990 940 967
1407 967 995 1022 1050 1070 1090 1030 969 1042 1114 1226 1339 1440 1542 1713 1885 1843 1640 1394 1148 1137 1125 1074 1022 1014 1006 1078 1150 1166 1183 1160 1136
1404 1136 1157 1177 1197 1217 1191 1165 1140 1114 1082 1049 1017 985 980 976 971 966 1007 1048 1049 1049 1011 973 1014 1056 1078 1099 1121 1143 1156 1168 1181 1194 1216 1239 1302 1364 1424
1399 1424 1485 1617 1748 1933 1984 1896 1675 1470 1345 1300 1254 1193 1131 1109 1088 1047 1006 965 924 991 1058 1045 1031 1041 1050 1100 1149 1108 1068 1027 986 971
1395 971 957 1075 1194 1221 1249 1197 1144 1075 1006 1017 1028 1014 1001 1014 1107 1141 1043 899 835 920 1006 963 919 903 886 1003 1120 1251 1381 1431 1482
1391 1482 1363 1245 1167 1089 1081 1074 1026 979 1012 1044 997 949 952 956 959 962 939 915 972 1028 1035 1042 1049 1056 1073 1090 1107 1124 1058 992 1005 1019 1068 1117 1032 948 965 982
1387 982 919 856 865 875 964 1054 1050 1046 1002 959 875 791 840 890 978 1065 1113 1161 1114 1067 1021 974 962 950 1017 1085 1094 1103 1033 962 898 835 851 868 868 869 949 1030
1382 1030 1068 1106 1184 1262 1213 1163 1114 1065 1052 1039 1026 1014 1047 1080 1113 1146 1091 1036 1021 1005 1045 1085 1045 1004 974 943 952 962 998 1034 1030 1026 979 932 965 1078
1378 1078 1210 1209 1102 994 952 910 948 986 969 952 935 918 995 1071 1015 958 947 935 923 912 913 914 915 916 961 1005 1050 1094 1073 1053 1032 1011 985 959 934
1373 934 908 978 1049 1040 1030 984 938 892 846 929 1011 1014 1017 995 973 951 929 973 1018 1062 1107 1058 1009 1041 1072 1085 1097 1030 962 996 1030 1065 1099 1128 1156 1105
1369 1105 1054 986 918 930 942 961 979 998 1016 1087 1158 1149 1140 1109 1077 1085 1094 1166 1239 1178 1117 1098 1079 1059 1040 1042 1044 1047 1049 1006 963 920 877 905 932 959 986 1000
1364 1000 1014 1029 1043 1080 1118 1155 1193 1217 1242 1266 1291 1211 1131 1092 1052 1138 1225 1232 1238 1146 1054 1003 951 1024 1097 1170 1243 1164 1084 1085 1086 1073 1060 1047 1035 1032 1029
1360 1029 1026 1024 1077 1130 1103 1077 1063 1050 1036 1023 914 805 883 961 1022 1083 1104 1125 1089 1052 1056 1059 1115 1171 1147 1123 1090 1056 1063 1070 1200 1330 1274 1217 1190
1355 1190 1163 1176 1189 1100 1011 1056 1101 1147 1193 1199 1204 1222 1240 1217 1195 1126 1056 1121 1185 1189 1192 1195 1199 1138 1077 1016 956 1005 1054 1104 1153 1143 1132 1122 1111 1091 1071
1351 1071 1050 1030 1023 1016 1009 1001 984 967 950 933 968 1003 1038 1073 1109 1145 1052 960 880 881 877 873 920 966 1058 1070 993 916 869 902 936 969 968 967 978 989 1080 1171 1227
1346 1227 1283 1259 1235 1231 1226 1181 1137 1097 1058 1018 978 980 981 943 904 868 832 876 920 975 1029 1003 978 949 920 971 1022 1096 1170 1160 1071 1021 1052 1112 1173 1126
1342 1126 1079 1107 1134 1144 1073 1048 1022 1035 1048 1060 1073 1017 962 936 990 1078 1086 1064 1042 1078 1114 1070 1027 968 910 886 943 1069 1195 1139 1083 1066 1049 1072
1338 1072 1096 1113 1130 1068 1005 990 975 959 944 1012 1081 1114 1067 1040 1013 1062 1110 1118 1126 1054 982 908 833 891 950 1002 1054 973 891 821 750 813 876 935 995
1333 995 975 954 943 932 1001 1070 1136 1203 1189 1175 1158 1140 1162 1185 1165 1146 1086 1027 1049 1072 1094 1117 1073 1030 987 943 932 920 908 897 932 968 1004 1040 1087
1329 1087 1134 1140 1147 1066 985 1038 1090 1152 1213 1195 1176 1094 1012 1011 1009 947 885 903 921 894 867 840 814 839 864 969 1074 1042 1011 1112 1214 1253 1291 1330
1325 1330 1368 1375 1383 1351 1318 1324 1331 1257 1183 1116 1048 1113 1179 1216 1252 1209 1165 1150 1135 1160 1185 1168 1151 1094 1037 1087 1136 1106 1076 1022 968 913 859 859 858 937 1017
1320 1017 1020 1023 1027 1030 1038 1046 1055 1063 1054 1044 1035 1025 1006 987 967 948 953 957 962 967 1015 1063 1111 1159 1141 1122 1104 1085 1036 988 939 891 971 1051 1131 1212 1178 1144 1150 1156 1030 903
1315 903 857 811 797 782 848 914 925 936 987 1038 1037 1035 1074 1112 1120 1128 1097 1065 992 919 926 934 928 923 958 993 987 981 975 969 979 989 999 1009 1019 1029 1039 1049 1006 963 920
1310 920 877 859 841 903 965 952 938 925 911 948 985 941 898 926 954 982 1010 1021 1032 1002 973 999 1025 970 916 933 949 966 983 889 796 783 769 864 959
1306 959 974 989 961 932 984 1035 1053 1072 1090 1108 1092 1076 1060 1044 1028 1011 995 979 946 912 879 846 856 866 876 886 890 895 900 904 899 894 813 733 807 961 1035
1301 1035 1028 988 948 942 937 1009 1081 1124 1086 1009 1013 1047 1081 1070 1058 1087 1116 1074 1032 1070 1108 1042 976 1038 1100 1107 1035 1037 1119 1133 1066 1000 1013 1084 1075 1036 997 991
1297 991 986 1015 1044 1096 1068 960 932 1017 1103 1060 1017 1017 1017 1016 1016 1007 998 1029 1060 1070 1080 1010 940 953 966 1024 1003 946 889 910 1012 1069 1047 994 941 973 1006
1292 1006 1038 1070 1055 1040 1026 1011 1006 1001 996 991 1007 1023 1038 1054 1065 1076 1081 1087 1086 1005 893 782 771 840 863 887 970 1054 1057 1060 1040 1021 1041 1062 986 911 916 921 913
1287 913 905 937 969 946 923 939 956 974 991 1009 1026 1027 1028 989 949 913 876 919 963 1013 1064 1034 1005 1020 1034 1009 984 975 966 1090 1214 1203 1191 1100 1008 1012 1015
1283 1015 1018 1022 1050 1079 1027 976 1053 1130 1128 1125 1045 964 924 884 938 992 966 940 878 816 834 852 851 849 928 1006 1082 1157 1099 1041 988 934 961 988 962 936 951
1278 951 965 965 965 965 966 1023 1081 1059 1036 1031 1026 1020 1015 1016 1016 977 937 887 838 868 898 913 928 943 959 957 956 994 1033 944 856 848 840 866 893 879 865 912 958 965 971 967 963 959
1273 959 955 999 1042 1086 1129 1104 1078 1052 1027 1011 995 980 964 958 953 947 942 986 1031 1075 1120 1089 1059 1028 998 962 926 958 989 963 937 952 966 979 992 1005 1017
1269 1017 1015 1013 1011 1008 971 934 937 939 957 974 1058 1141 1150 1159 1075 990 968 946 990 1035 1013 991 969 947 978 1009 1040 1071 1006 941 876 811 939 1066 1175 1151 1044
1264 1044 937 941 946 1003 1060 1024 988 963 938 954 969 1026 1082 1099 1116 1091 1067 1043 1019 1056 1094 1038 902 840 911 1048 1186 1156 1126 1097 1067 1070 1072 1075 1078
1260 1078 1074 1071 1067 1064 1043 1023 1043 1062 1001 940 972 1004 1022 1040 1058 1075 999 923 941 958 994 1031 1027 1024 1063 1101 1020 939 942 946 909 873 873 874 914 954 946 938 930 922 934
1255 934 946 958 971 946 922 937 953 981 1009 970 932 1052 1171 1198 1224 1230 1236 1175 1114 1090 1066 1042 1018 1042 1066 1091 1115 1122 1130 1137 1145 1149 1152 1156 1159 1119 1079 1039 999
1250 999 1008 1017 1026 1035 971 906 935 964 1069 1173 1104 1035 1028 1021 1053 1086 1110 1135 1119 1103 1055 1008 960 913 950 987 1023 1060 1116 1171 1186 1201 1210 1218 1159 1101 1018 934
1245 934 944 954 1007 1059 1152 1245 1231 1217 1136 1055 1034 1014 1033 1052 1068 1083 1099 1115 1117 1119 1121 1123 1103 1084 1064 1045 988 931 1003 1075 1148 1141 1098 1056 1024 992 955
1241 955 998 1049 1099 1075 1050 1107 1164 1137 1030 977 1003 1030 977 894 891 923 955 966 1057 1188 1240 1148 1056 1048 1119 1104 1088 1077 1066 1067 1068 1069 1070 1044 1017 1031 1044
1236 1044 1063 1082 1025 969 929 970 1045 1121 1075 1028 1022 1016 1002 987 1013 1039 1010 981 1081 1181 1212 1163 1119 1075 1063 1050 1038 1026 982 939 975 1012 1037 1061
1232 1061 1085 1110 1084 1059 1033 1007 1064 1121 1098 1075 1072 1069 1066 1062 1030 999 1047 1095 1138 1181 1144 1107 1028 950 1004 1139 1271 1270 1162 1055 1009 963 958 952 1056
1228 1056 1159 1228 1217 1167 1117 1062 1007 978 948 1046 1145 1189 1153 1082 1010 1018 1025 1032 1039 1092 1144 1196 1249 1216 1183 1150 1117 1053 988 959 1009 1026 1043 1060 1078 1121
1223 1121 1084 1048 1091 1139 1188 1161 1135 1085 1036 987 937 909 880 892 903 967 1030 960 890 865 840 855 870 961 1053 1114 1095 1021 1026 1062 1097 999 900 837 854
1219 854 855 857 864 870 925 979 1034 1088 1055 1022 989 956 957 959 1000 1042 1006 970 964 1038 1081 1044 976 909 897 885 828 851 928 1006 1008 1011 1010 1009 1008 1007 1015 1023 955 888 884 960 991
1214 991 1022 1016 1010 1003 997 1017 1037 1103 1088 1004 920 960 999 1035 990 985 981 958 855 792 809 915 1021 1053 1084 1082 1080 1079 1077 1107 1137 1167 1198 1199 1200 1201 1203 1161 1119 1077
1209 1077 1035 1007 979 952 924 940 956 972 988 952 917 881 846 813 780 827 874 918 961 964 967 1028 1090 1071 1053 1075 1098 1160 1223 1170 1118 1025 933 949 966
1205 966 983 999 1014 1028 1042 1056 1034 1012 990 968 1028 1088 1068 1047 1023 999 975 950 984 1018 1053 1087 1058 1029 1001 972 957 941 1006 1071 1100 1130 1079 1029 1028
1200 1028 1027 1027 1026 1019 1011 1003 995 982 969 956 944 949 954 1040 1125 1173 1221 1136 1050 1029 1007 1026 1044 1040 1036 992 948 935 922 948 975 974 973 973 972 987 1002 977 952 928 904 959
1195 959 1015 1033 1051 1069 1087 1155 1223 1210 1198 1155 1112 1068 1025 1034 1042 1051 1059 1072 1085 1098 1112 1155 1198 1241 1284 1286 1288 1290 1292 1237 1182 1127 1072 1076 1081 1082 1084 1068 1012 934 936
1190 936 982 1029 974 879 881 962 1044 1045 1004 1003 1055 1107 1124 1142 1079 1016 1006 995 1011 988 938 968 1035 1023 960 897 909 921 927 933 940 946 950 955 960 964 934 903 956 1089
1185 1089 1195 1221 1163 1106 1112 1119 1086 1052 1034 1016 998 980 967 955 942 929 965 1001 1000 999 1027 1096 1112 1048 1034 1099 1162 1145 1090 1074 1059 1003 937 951 1020 1049
1181 1049 1010 971 970 969 929 889 889 889 872 854 917 979 1046 1113 1184 1176 1103 1029 1066 1102 1118 1054 1035 1016 1028 1040 1011 983 969 954 1028 1102 1140 1098 1056 1094 1156
1176 1156 1217 1208 1119 1045 971 1007 1044 1060 997 978 960 967 975 982 989 964 938 912 886 985 1084 1135 1105 1042 979 1031 1083 1070 1057 1133 1208 1256 1224 1096 967 878
1172 878 869 956 1044 1062 1000 984 967 965 964 917 950 1029 1108 1125 1142 1171 1200 1162 1124 1077 1031 984 938 984 1030 1076 1122 1129 1135 1141 1148 1181 1214 1207 1200 1254 1308 1269 1229
1167 1229 1205 1180 1121 1061 975 969 1011 1054 1047 1040 1068 1096 1106 1036 965 975 1040 1104 1106 1109 1194 1279 1321 1283 1243 1282 1317 1271 1203 1135 1128 1121 1054 986 879 771 743
1163 743 715 754 792 819 845 911 977 998 1019 1041 1062 1086 1109 1133 1157 1130 1104 1077 1051 1006 961 956 951 935 918 968 1018 1053 1088 1083 1079 1072 1065 1019 972 906 840 815
1158 815 789 855 922 988 1055 1040 1026 1012 997 1013 1029 1045 1061 1094 1127 1159 1192 1191 1190 1189 1187 1120 1053 986 919 979 1038 960 881 847 947 1065 1183 1173 1164 1154
1154 1154 1145 1118 1091 1064 1037 1035 1034 1033 1032 1047 1063 1012 960 975 990 1045 1100 1056 1012 929 845 808 771 775 778 832 886 940 994 994 994 1088 1182 1144 1106 1108 1110 1099 1088 1077
1149 1077 1066 1052 1039 1025 1012 1055 1099 1062 1026 994 962 1011 1059 1001 943 965 987 924 861 877 894 876 858 840 822 838 855 952 1049 1020 991 1042 1093 1061
1145 1061 1028 996 964 957 950 943 936 1007 1078 1015 953 988 1023 1098 1173 1172 1172 1171 1170 1111 1052 1073 1094 1080 1066 1052 1038 1066 1094 1122 1151 1142 1133 1125 1116 1081 1046 1011 976 934
1140 934 893 931 969 1048 1128 1127 1126 1085 1044 1003 962 983 1004 1025 1045 1073 1102 1090 1078 1099 1120 1061 1003 1054 1105 1023 940 935 930 965 999 1031 1062 1054 1045 1114 1183 1172
1135 1172 1161 1155 1149 1183 1217 1150 1083 1150 1216 1322 1428 1534 1639 1694 1749 1724 1699 1652 1605 1478 1351 1313 1274 1265 1336 1435 1454 1341 1228 1183 1219 1249
1131 1249 1279 1309 1339 1338 1258 1169 1160 1181 1202 1195 1188 1256 1324 1419 1433 1365 1296 1335 1455 1530 1604 1655 1707 1678 1649 1578 1508 1362 1216 1156 1175 1229 1283 1308 1332
1127 1332 1281 1231 1199 1248 1251 1255 1244 1233 1263 1292 1213 1134 1184 1233 1260 1207 1154 1180 1179 1178 1182 1186 1211 1237 1182 1128 1123 1117 1112 1107 1100 1092 1124 1157 1149 1141 1059 976 906 916 961
1122 961 1006 1000 994 1063 1132 1127 1043 919 874 954 1033 1077 1121 1130 1138 1106 1075 1142 1209 1148 1086 1037 1069 1100 1051 1040 1030 1014 998 1025 1052 1119 1185 1180 1174 1088 1002 909
1117 909 816 811 886 974 1062 1021 981 935 889 924 958 995 1032 1069 1106 1175 1243 1232 1221 1129 1037 1025 1013 1048 1084 1079 1075 1038 1001 1045 1088 1134 1180 1145 1111 1122
1113 1122 1132 1223 1313 1254 1195 1177 1158 1181 1204 1227 1251 1335 1419 1503 1587 1712 1836 1881 1926 1974 2022 1937 1852 1770 1687 1605 1522 1489 1456 1343 1230 1205
1109 1205 1180 1195 1211 1249 1288 1286 1285 1226 1167 1188 1210 1164 1119 1073 1028 1074 1120 1125 1131 1115 1098 1161 1225 1255 1286 1316 1346 1289 1232 1255 1278 1295 1313 1370 1428 1425 1422
1104 1422 1500 1577 1608 1640 1711 1782 1949 2115 2322 2528 2702 2876 2809 2743 2624 2505 2386 2267 2112 1957 1802 1647 1522 1398 1281 1165
1101 1165 1132 1232 1333 1300 1176 1051 1105 1159 1187 1216 1245 1273 1314 1354 1395 1435 1410 1384 1359 1334 1272 1210 1148 1086 1130 1174 1218 1261 1238 1216 1273 1330
1097 1330 1284 1238 1272 1386 1471 1423 1369 1396 1504 1612 1725 1838 1941 2043 2066 2089 2023 1958 1852 1746 1593 1440 1420 1400 1379 1358 1337 1316 1402
1094 1402 1488 1440 1392 1374 1355 1336 1317 1327 1336 1346 1355 1326 1297 1267 1238 1322 1407 1411 1415 1322 1229 1216 1203 1230 1257 1324 1391 1371 1352 1372 1393 1412 1432 1451 1471 1376
1089 1376 1281 1226 1172 1189 1207 1145 1083 1094 1106 1118 1130 1131 1133 1135 1137 1206 1276 1265 1255 1253 1252 1210 1169 1182 1194 1287 1379 1303 1226 1230 1233 1240 1248 1255 1262 1254 1247 1314 1381 1439 1417
1084 1417 1359 1302 1255 1207 1195 1263 1394 1526 1622 1639 1612 1505 1393 1361 1421 1480 1465 1450 1463 1476 1489 1502 1516 1529 1542 1556 1581 1606 1631 1656 1749 1842
1080 1842 1856 1869 1908 1947 1952 1956 1904 1932 2043 2155 2142 2049 1956 1943 1999 2055 2036 2017 2005 1993 2057 2120 2142 2084 2031 1978 1953 1928 1863 1798 1760 1722 1685 1647
1076 1647 1652 1656 1661 1666 1685 1704 1643 1582 1613 1645 1716 1788 1833 1878 1918 1958 1982 1927 1877 1827 1868 1908 1821 1733 1732 1811 1855 1819 1726 1713 1730 1747 1651 1554 1538 1522 1533
1072 1533 1545 1517 1488 1433 1378 1363 1348 1414 1481 1459 1356 1293 1231 1243 1255 1368 1481 1540 1466 1357 1327 1324 1321 1300 1278 1296 1314 1245 1176 1240 1304 1414 1524
1068 1524 1554 1584 1522 1460 1448 1569 1682 1661 1591 1520 1546 1572 1518 1464 1472 1480 1488 1496 1552 1607 1583 1558 1607 1656 1665 1673 1657 1641 1584 1528 1522 1516 1590 1664 1693 1723 1752
1063 1752 1781 1679 1578 1521 1464 1505 1626 1702 1645 1578 1591 1681 1691 1639 1667 1778 1890 1850 1810 1903 1996 2023 2050 2076 2103 2138 2172 2207 2242 2219 2196 2213
1059 2213 2230 2286 2343 2319 2295 2177 2059 2128 2197 2220 2242 2265 2287 2364 2441 2437 2434 2497 2561 2584 2608 2677 2745 2774 2802 2846 2889 3013 3136 3207 3278 3349 3420
1055 3420 3397 3374 3271 3168 3158 3148 3177 3207 3281 3354 3428 3501 3587 3673 3679 3685 3730 3776 3954 4133 4375 4617 4992 5368 5780 6193 6525 6857 7120
1052 7120 7382 7511 7640 7750 7861 8158 8456 8843 9230 9578 9925 10248 10570 10863 11155 11521 12047 12791 13803 14919 16115 17496
1049 17496 19037 20711 22544 24697 27438 31083 35741 41767 49662 60166 73925 91608 113507 139141 166109 189394
1047 189394 202804 202065 187289 163157 135877 110355 88837 71762 58691 48812 41336 35607 31320 28082 25751
1045 25751 24101 22932 22167 21563 21147 20812 20490 20167 19840 19673 19662 19652 19758 20025 20566 21268 21969 22671 23432 24194 25035 25877 26779
1042 26779 27680 28596 29671 31140 32982 35325 38149 41512 45462 50113 55564 61993 69863 79922 93023 110085 132111
1040 132111 160142 194845 234966 276849 315115 343933 357891 353860 332661 299559 261690 224621 190662 160065
1039 160065 132928 109687 90636 75589 63998 55235 48675 43769 40190 37731 36140 34923 33688 32081 29999 27650
1037 27650 25428 23579 22030 20855 19993 19399 18971 18543 18236 17928 17588 17087 16646 16366 16265 16325 16627 17304 18307 19577 20977
1034 20977 22537 24251 26232 28523 31296 34728 39068 44813 52426 62347 75311 92095 113523 139595 168816 197049
1032 197049 217650 224051 213639 189503 158694 128079 101468 80063 63517 51073 41673 34442 28866 24598 21344
1030 21344 18794 16725 15124 13896 12761 11705 10769 9913 9098 8282 7520 6918 6401 5965 5590 5375 5256 5136 4930 4564 4113
1028 4113 3663 3248 2913 2616 2480 2445 2410 2450 2491 2719 2946 3090 3234 3192 3149 3012 2875 2871 2868 2879 2891 2822 2753 2713 2673 2633 2592 2457 2322
1024 2322 2267 2211 2140 2068 2076 2085 2080 2076 2032 1988 1949 1911 1952 1994 1922 1850 1858 1866 1874 1881 1929 1976 1908 1839 1771 1703 1763 1822 1749 1675 1642 1609 1655 1702 1672 1642 1613 1583
1020 1583 1530 1477 1504 1531 1553 1574 1596 1618 1572 1525 1559 1592 1616 1639 1583 1526 1479 1433 1466 1500 1561 1623 1604 1586 1522 1458 1435 1411 1406 1400 1355 1309 1288 1266 1285
1015 1285 1304 1373 1442 1377 1312 1303 1293 1324 1354 1352 1349 1346 1344 1319 1293 1268 1243 1206 1170 1213 1257 1268 1279 1210 1141 1218 1295 1331 1368 1328 1287 1326 1366 1357 1348 1340 1331 1352 1373
1011 1373 1395 1416 1379 1341 1384 1506 1611 1582 1499 1417 1397 1378 1279 1179 1197 1214 1152 1089 1100 1111 1202 1292 1332 1371 1410 1449 1308 1168 1161 1153 1165 1178 1149
1007 1149 1121 1159 1196 1153 1109 1087 1065 1123 1181 1145 1110 1074 1038 1064 1091 1117 1143 1123 1102 1082 1062 1061 1060 1059 1058 1032 1006 1019 1033 1135 1236 1258 1279 1336 1393
1002 1393 1370 1347 1315 1282 1210 1138 1097 1056 1094 1133 1125 1116 1107 1099 1131 1163 1195 1227 1256 1286 1275 1265 1206 1148 1170 1192 1156 1121 1165 1209 1161 1113 1145 1177 1159 1141
998 1141 1123 1105 1103 1101 1098 1096 1094 1091 1089 1087 1077 1067 1058 1048 1096 1144 1152 1160 1069 979 969 959 1013 1068 1123 1178 1119 1060 1041 1022 1075 1128 1047 966 980 994 1049 1103 1128 1153
993 1153 1098 1043 1029 1015 1000 986 1044 1101 1159 1216 1201 1186 1171 1156 1166 1177 1188 1199 1238 1278 1250 1223 1257 1290 1257 1224 1181 1138 1134 1131 1165 1198 1231 1265 1240 1215
989 1215 1189 1164 1139 1114 1089 1064 1097 1131 1164 1198 1201 1204 1208 1211 1219 1227 1235 1243 1200 1158 1116 1074 1113 1153 1193 1232 1168 1105 1041 977 1032 1087 1142 1197 1185 1172 1160 1147 1189
984 1189 1231 1207 1182 1233 1284 1296 1307 1356 1404 1546 1689 1859 2030 2048 1934 1781 1628 1587 1546 1553 1561 1448 1335 1224 1113 1095 1078 1121 1164 1141
980 1141 1117 1099 1080 1062 1043 1065 1086 1108 1129 1077 1025 1092 1160 1155 1149 1144 1138 1149 1161 1239 1317 1331 1345 1394 1443 1372 1222 1130 1172 1268 1284 1269 1334 1417 1499 1525
976 1525 1551 1703 1934 2155 2376 2581 2707 2722 2657 2579 2500 2422 2264 2080 1895 1772 1650 1520 1390 1254 1199 1198 1196 1199 1202 1185 1167 1150 1132 1159
972 1159 1186 1212 1239 1229 1219 1209 1199 1133 1067 1000 934 951 969 986 1003 1009 1014 1020 1026 998 970 1058 1145 1214 1203 1197 1191 1213 1236 1191 1147 1189 1231 1313 1396 1560 1725
968 1725 1868 1931 1916 1900 1880 1860 1764 1668 1526 1465 1430 1395 1365 1334 1304 1274 1243 1213 1211 1209 1202 1195 1229 1184 1042 899 864 909 976 1043 1008 973 1005 1036 1099
963 1099 1162 1177 1112 1045 979 1001 1023 1050 1076 1103 1129 1182 1234 1211 1109 974 839 819 799 775 751 749 827 910 993 1081 1169 1191 1212 1234 1255 1244 1233 1101
959 1101 970 1015 1060 1064 1069 1080 1090 1141 1191 1337 1484 1457 1430 1354 1278 1202 1126 1136 1146 1156 1166 1131 1095 1059 1024 1005 986 967 948 995 1042 1089 1136 1142 1148
955 1148 1154 1160 1191 1222 1292 1363 1373 1383 1299 1216 1169 1122 1168 1215 1279 1342 1313 1283 1288 1293 1298 1303 1304 1306 1307 1309 1337 1365 1433 1501 1505 1509 1606 1703 1776 1849 1828 1808 1755 1703 1718
950 1718 1732 1632 1532 1391 1251 1157 1062 1035 1007 1038 1069 1101 1132 1150 1169 1188 1207 1216 1225 1234 1243 1235 1228 1220 1213 1201 1189 1178 1166 1095 1023 1018 1013 1095 1176 1164 1152 1077
945 1077 1002 1015 1028 1062 1015 908 880 944 1088 1191 1295 1306 1316 1282 1327 1405 1482 1471 1459 1550 1640 1681 1643 1550 1458 1400 1342 1302 1262 1222 1182 1181 1181 1180
941 1180 1179 1131 1084 1037 989 957 924 980 1036 1107 1098 1094 1090 1196 1301 1336 1291 1303 1396 1443 1491 1549 1688 1901 2114 2301 2488 2576 2531 2385 2239 2050
937 2050 1860 1708 1636 1524 1413 1324 1315 1329 1342 1295 1249 1203 1156 1157 1158 1159 1160 1143 1125 1107 1089 1140 1191 1225 1178 1129 1160 1234 1308 1335 1362 1388 1415 1374 1333
933 1333 1314 1375 1455 1535 1581 1626 1661 1695 1669 1642 1725 1888 2073 2258 2305 2351 2442 2667 3000 3333 3518 3569 3523 3396 3209 2942 2711 2560 2399
929 2399 2238 2012 1787 1641 1495 1437 1379 1321 1263 1256 1249 1243 1236 1239 1242 1246 1249 1224 1200 1181 1161 1169 1258 1306 1274 1221 1167 1189 1211 1187 1164 1140 1117 1095 1073 1091 1109
925 1109 1097 1086 1155 1224 1304 1385 1386 1386 1422 1457 1498 1539 1592 1726 1948 2170 2325 2481 2551 2621 2595 2488 2245 2001 1765 1610 1542 1475 1424 1373 1361
921 1361 1350 1288 1226 1204 1182 1139 1096 1044 1071 1171 1192 1129 1066 1087 1107 1052 998 973 1029 1084 1060 1022 985 948 911 941 1050 1160 1190 1195 1200 1245 1210 1175
917 1175 1140 1105 1070 1004 1019 1068 1118 1095 1072 1089 1106 1105 1104 1103 1102 1099 1095 1016 938 933 1009 1085 1080 1091 1102 1107 1113 1105 1097 1089 1081 1012 944 915 886 876 866 936 1006 1010 1015 1019 1023 1035
911 1035 1047 1059 1071 1064 1057 1130 1203 1146 1090 1073 1056 1050 1043 1076 1110 1126 1142 1159 1175 1176 1178 1219 1260 1253 1246 1159 1072 1075 1078 1161 1244 1203 1162 1081 1000 970 940 990 1040 1091
906 1091 1143 1061 979 985 991 1076 1162 1123 1084 1085 1085 1105 1125 1145 1165 1130 1094 1058 1022 988 954 919 885 975 1065 1022 978 930 881 913 944 924 904 1018 1131 1176
902 1176 1221 1186 1150 1154 1158 1162 1166 1095 1024 1033 1042 1006 969 1013 1056 1079 1102 1124 1147 1123 1099 1115 1131 1086 1041 1129 1218 1238 1258 1278 1298 1257 1215 1174 1132 1106 1079 1053
897 1053 1027 1026 1024 1090 1155 1115 1075 1129 1182 1213 1243 1233 1223 1182 1141 1139 1138 1140 1142 1211 1280 1269 1258 1180 1103 1063 1024 1025 1025 1052 1079 1145 1212 1227 1243 1166 1088 1097 1107
893 1107 1116 1126 1128 1130 1172 1214 1114 1015 982 949 897 845 913 981 1029 1077 1125 1173 1186 1198 1170 1142 1074 1006 1005 1004 1055 1105 1089 1073 1070 1067 1130 1194 1204 1214 1131 1047
888 1047 992 936 974 1012 1026 1039 1053 1067 1040 1014 1055 1095 1151 1207 1143 1080 1071 1063 1095 1127 1145 1163 1115 1067 1049 1030 1052 1074 1037 1001 1057 1114 1129 1143 1118 1092
884 1092 1129 1165 1108 1051 1032 1013 1061 1109 1132 1155 1218 1281 1241 1201 1227 1254 1229 1204 1273 1341 1333 1325 1357 1469 1537 1470 1444 1551 1675 1719 1704 1770 1820 1871
879 1871 2020 2169 2395 2621 3237 4414 5560 5826 4991 3756 2843 2331 1999 1748 1643 1672 1615 1477 1434 1471 1467 1462 1485 1641 1813
876 1813 1904 1967 2110 2297 2484 2602 2720 2870 3020 3041 2928 2718 2507 2294 2082 1909 1737 1591 1446 1393 1341 1346 1352 1357 1363 1385 1408 1391 1374
873 1374 1384 1395 1311 1228 1204 1179 1194 1210 1160 1110 1061 1011 1040 1070 1099 1128 1176 1224 1231 1239 1275 1312 1281 1251 1315 1379 1403 1427 1419 1412 1405 1398 1409 1420 1431 1442 1498 1553
868 1553 1568 1583 1529 1475 1488 1501 1580 1659 1671 1683 1747 1810 1806 1803 1887 1972 1976 1981 1963 1945 1927 1909 1906 1903 1900 1898 1963 2029 2014 2000 1979 1957 1936 1915 1889 1862 1836 1810 1810
863 1810 1810 1811 1811 1834 1858 1882 1905 1901 1896 1891 1886 1892 1897 1902 1908 1922 1937 1952 1967 1991 2016 2041 2065 2076 2086 2096 2106 2111 2117 2122 2127 2155 2184 2132 2080 2050 2020 1990 1960 1963 1967 1970 1973 1958
858 1958 1943 1928 1912 1869 1825 1861 1898 1884 1870 1856 1843 1856 1869 1802 1735 1670 1604 1672 1741 1754 1767 1700 1634 1602 1570 1672 1773 1793 1814 1834 1854 1757 1660 1697
854 1697 1734 1691 1648 1606 1563 1586 1609 1631 1654 1607 1561 1515 1468 1484 1499 1515 1530 1479 1429 1458 1487 1506 1525 1464 1404 1366 1329 1292 1254 1276 1297 1318 1339 1313 1288
850 1288 1262 1237 1281 1325 1370 1414 1473 1532 1591 1650 1584 1518 1452 1386 1329 1273 1394 1516 1558 1467 1405 1424 1446 1467 1414 1361 1370 1378 1387 1396 1388 1380 1373 1365 1340 1316 1292 1267
845 1267 1252 1236 1221 1205 1276 1348 1339 1250 1193 1270 1312 1274 1241 1208 1250 1292 1322 1352 1302 1251 1263 1274 1366 1457 1436 1416 1395 1374 1389 1403 1418 1432 1412 1391 1371
841 1371 1351 1405 1460 1435 1410 1403 1397 1390 1383 1394 1404 1414 1424 1382 1339 1377 1414 1390 1366 1422 1478 1504 1530 1422 1315 1311 1307 1303 1298 1272 1246 1220 1194 1251 1309 1366 1423 1436
836 1436 1448 1461 1473 1457 1442 1426 1410 1489 1567 1616 1585 1549 1592 1711 1750 1749 1748 1742 1736 1703 1670 1637 1605 1578 1551 1604 1657 1696 1734 1772 1810 1802 1794 1786 1778 1805 1832 1854
831 1854 1876 1964 1971 1896 1820 1819 1899 1933 1968 1972 1977 1982 1987 1976 1966 1956 1946 2038 2131 2144 2157 2178 2199 2220 2241 2274 2308 2341 2375 2385 2395 2410 2426 2468 2590 2712 2755
827 2755 2743 2732 2716 2700 2698 2697 2650 2683 2755 2827 2904 2981 3067 3153 3239 3325 3369 3414 3378 3262 3206 3283 3466 3650 3740 3831 3916 4001 4060 4040 3984 3928 3962 3997
823 3997 4031 4065 4099 4132 4166 4199 4256 4313 4370 4427 4479 4531 4538 4625 4820 5016 5128 5160 5229 5299 5363 5428 5502 5577 5651 5726 5811 5897 5902 5908 6015 6122 6229
819 6229 6336 6429 6522 6615 6708 6860 7011 7163 7314 7469 7624 7700 7775 7978 8182 8305 8429 8439 8448 8378 8308 8474 8641 8732 8824 8919 9095 9246
815 9246 9236 9212 9348 9570 9793 10049 10306 10696 11086 11506 11927 12267 12607 12922 13238 13633 14029 14443 14856 15275 15694 16317 17020 17751
812 17751 18749 20468 22774 24731 25461 25230 24919 25145 25745 26502 27339 28410 29643 30875 32108 33308 34347 35263 36179 37165
810 37165 38151 39142 40134 41312 42490 43496 44502 45509 46515 47527 48539 49648 50917 52241 53565 55032 56500 58078
808 58078 59656 61389 63282 65264 67326 69506 71953 74627 77462 80481 83659 86901 90143 93298 96293 99255 102216
806 102216 105278 108340 111292 113870 116078 117912 119445 120712 121875 123038 124402 125925 127528 128972 130205 131438 132564
804 132564 133610 134519 135295 135954 136613 137332 138052 138909 139767 140754 141820 142908 143863 144575 145153 145683 146213 146873 147826 149178 150824
801 150824 152700 154709 156803 158977 161194 163412 165714 168017 170199 172381 174483 176585 178601 180618 182532 184258 185652
799 185652 186700 187503 188120 188460 188400 187902 186951 185568 183785 181661 179297 176754 174131 171497 168864 166194 163524 160821 158197
797 158197 155690 153369 151276 149422 147741 146193 144819 143578 142536 141734 141034 140333 139484 138448 137200 135819 134397 133108
794 133108 132155 131548 131159 130771 130364 129957 129515 129074 128790 128639 128472 128172 127671 126930 125933 124642 123045 121262 119391 117519 115698
792 115698 113876 111898 109626 107083 104459 101977 99895 98246 96945 95697 94102 91936 89210 86064 82785 79558 76466
790 76466 73465 70599 67755 64832 61826 58900 56227 53848 51697 49786 48194 47055 46365 46048 46083 46492 47364 48610 49926
787 49926 51242 52214 52598 52429 51886 51276 50667 50020 49000 47490 45392 42888 40223 37719 35588 33798 32274 30800 29166
785 29166 27328 25330 23252 21174 19200 17386 15876 14633 13624 12775 12033 11451 10975 10500 10007 9514 9065 8775 8567 8360
783 8360 8162 7964 7738 7512 7366 7220 7107 6995 6882 6769 6760 6751 6661 6572 6551 6530 6589 6648 6582 6516 6530 6544 6525 6505 6406 6307 6193 6079 6045 6011
779 6011 5950 5889 5829 5768 5737 5706 5675 5644 5603 5562 5521 5480 5375 5270 5166 5061 4881 4702 4655 4609 4465 4321 4177 4033 3904 3775 3726 3677 3683
775 3683 3689 3616 3542 3514 3486 3498 3510 3618 3725 3752 3779 3701 3622 3623 3625 3685 3744 3724 3704 3625 3546 3548 3549 3493 3436 3379 3323 3361 3400 3438 3477 3460 3444 3427 3410 3393
771 3393 3377 3360 3343 3236 3129 3022 2915 2865 2814 2764 2714 2662 2609 2557 2505 2476 2447 2419 2390 2337 2284 2231 2179 2136 2093 2050 2007 1996 1984 1973 1961 1933 1905
767 1905 1877 1849 1851 1853 1855 1857 1849 1841 1900 1959 1951 1942 1894 1846 1893 1941 1989 2036 2068 2100 2011 1923 1960 1998 2075 2153 2185 2216 2315 2413 2324 2235 2185 2136 2140 2144 2148 2151 2175 2199 2102
762 2102 2006 1973 1939 1905 1872 1837 1801 1766 1731 1646 1562 1571 1580 1626 1672 1599 1525 1514 1503 1585 1667 1637 1606 1670 1733 1717 1702 1686 1670 1609 1548 1506 1625 1768 1751
758 1751 1661 1570 1592 1613 1746 1879 1999 1985 1907 1910 1967 2025 2021 2017 2108 2200 2198 2196 2192 2188 2185 2181 2130 2079 2028 1977 1901 1825 1816 1806 1842 1878 1847 1816 1751 1685 1620 1555
753 1555 1464 1373 1403 1432 1529 1626 1576 1526 1538 1549 1600 1652 1586 1520 1493 1467 1484 1500 1516 1532 1574 1616 1658 1700 1696 1692 1688 1684 1809 1935 1995 2054 2097 2140 2117 2094
749 2094 2080 2067 2054 2040 2048 2056 2064 2072 2044 2016 1988 1960 1955 1950 2057 2163 2217 2136 1985 1833 1838 1842 1847 1852 1900 1947 1928 1909 1919 1930 2007 2085 2139 2193 2154 2114 2140 2165
744 2165 2231 2297 2277 2257 2238 2218 2256 2294 2333 2371 2440 2510 2513 2516 2565 2614 2570 2525 2539 2554 2568 2582 2578 2575 2571 2568 2661 2754 2848 2941 2928 2915 2902 2889 2876 2863 2849 2836
739 2836 2850 2863 2876 2890 2903 2916 2930 2943 2957 2970 2984 2998 3050 3102 3154 3206 3134 3063 3124 3186 3298 3410 3483 3555 3579 3603 3627 3651 3734 3816 3898 3981 4043 4104
735 4104 4126 4148 4177 4207 4316 4425 4511 4597 4682 4768 4899 5029 5080 5130 5204 5278 5431 5585 5803 6022 6241 6459 6755 7050 7426 7801 8313
732 8313 8826 9436 10127 10891 11815 12881 14214 15877 18021 20591 23535 26902 30429 33742 36254 37456 37216 35652 33287
730 33287 30470 27652 25045 22812 21009 19472 18176 17147 16284 15581 15010 14520 14049 13738 13546 13514 13433 13352 13282 13211 13235 13260 13327
727 13327 13555 13921 14287 14658 15189 15868 16628 17459 18451 19701 21111 22654 24358 26249 28299 30355 32411 34540 36749 39073
724 39073 41664 44574 47750 51281 55185 59576 64448 69796 75624 81784 88023 93808 98365 101042 101423 99370 95234 89530
722 89530 83132 76754 70963 65913 61664 58109 55141 52758 50749 49036 47483 45991 44499 42937 41374 39812 38250
720 38250 36794 35499 34379 33419 32534 31809 31213 30697 30306 30182 30283 30651 31313 32242 33491 35006 36809 38985 41572 44425
718 44425 47332 50079 52842 55765 59062 62947 67361 72256 77705 83741 90228 97088 104175 111529 119059 126430 133167
716 133167 138569 142224 143796 143267 140869 136740 130956 123618 115158 106348 97805 90056 83321 77720 73134 69301 66055
713 66055 63310 60831 58426 56021 53579 51137 48743 46510 44406 42383 40418 38533 36731 35010 33409 31968 30682
711 30682 29556 28570 27852 27472 27467 27748 28296 29205 30381 31731 33160 34648 36216 37951 39953 42362 45146 48316 51966 56154
709 56154 60930 66459 72789 79913 87410 94527 100524 104963 107961 109812 110862 111318 110867 108854 104546 97644 88767 78969
707 78969 69545 61355 54714 49446 45300 41915 39117 36680 34510 32601 30853 29293 27813 26392 24971 23461 21951
705 21951 20506 19062 17822 16582 15437 14371 13326 12442 11702 11121 10617 10114 9695 9436 9233 9191 9281 9531 9751 9970 10204
702 10204 10599 11068 11617 12312 13166 14149 15399 17022 19125 21875 25213 29288 34056 39112 43901 47663 49664 49302 46539
700 46539 41833 36219 30591 25551 21259 17767 15029 12986 11435 10257 9300 8503 7940 7537 7110 6602 6125 5808 5516 5224
697 5224 4923 4621 4440 4258 4083 3907 3732 3556 3470 3385 3232 3080 2932 2785 2784 2783 2718 2652 2586 2520 2509 2497 2526 2554 2619 2685 2653 2542 2454
694 2454 2447 2456 2466 2488 2511 2579 2567 2493 2420 2382 2344 2374 2404 2417 2351 2319 2367 2432 2497 2443 2388 2373 2358 2390 2422 2384 2266 2184 2183 2172 2161 2111 2061 2077 2094 2092
689 2092 2090 2133 2096 2001 1906 1882 1937 2040 2143 2175 2128 2077 2027 1971 1915 1900 1884 1869 1854 1859 1865 1871 1876 1851 1826 1868 1909 1903 1897 1897 1896 1922 2028 2134 2160 2032 1905
685 1905 1821 1817 1843 1869 1857 1765 1694 1703 1728 1754 1767 1780 1793 1807 1754 1701 1649 1596 1572 1548 1528 1509 1502 1575 1607 1640 1629 1698 1768 1757 1723 1689 1743 1797 1719 1642
680 1642 1604 1566 1503 1441 1471 1502 1541 1579 1530 1480 1445 1489 1534 1498 1518 1537 1645 1753 1728 1703 1718 1733 1649 1564 1573 1581 1617 1652 1648 1643 1554 1465 1442 1420 1462 1503
676 1503 1545 1587 1644 1700 1664 1627 1598 1569 1607 1644 1607 1570 1573 1576 1615 1654 1733 1812 1810 1808 1806 1804 1782 1759 1737 1715 1671 1627 1704 1780 1755 1731 1773 1815 1788 1761 1801 1840
671 1840 1808 1775 1782 1789 1783 1776 1769 1763 1744 1725 1772 1820 1770 1720 1763 1807 1809 1812 1814 1817 1852 1887 1882 1877 1865 1853 1841 1830 1806 1781 1877 1973 2073 2173 2180 2186 2170 2153 2177 2200 2174
666 2174 2147 2268 2388 2415 2442 2429 2415 2452 2489 2433 2376 2401 2426 2491 2556 2544 2533 2561 2589 2547 2504 2528 2553 2575 2598 2553 2509 2445 2382 2412 2442 2466 2491 2526
662 2526 2481 2364 2328 2415 2502 2490 2479 2534 2589 2642 2694 2814 2933 2929 2925 2988 3050 3087 3124 3121 3118 3100 3083 3065 3048 3005 2961 3060 3159 3206 3172 3144 3116 3125 3133 3142 3150
658 3150 3195 3239 3323 3408 3435 3463 3553 3642 3627 3532 3482 3433 3374 3315 3297 3278 3262 3246 3297 3347 3362 3376 3321 3185 2968 2832 2822 2892 2892 2811 2781 2750 2739 2729
654 2729 2812 2894 2966 3038 3105 3172 3093 2934 2930 3112 3229 3160 3065 3103 3170 3237 3272 3307 3368 3429 3548 3667 3757 3713 3651 3589 3578 3566 3555 3543 3483 3422 3431
649 3431 3521 3563 3526 3528 3611 3677 3663 3530 3397 3280 3242 3301 3360 3339 3238 3182 3125 3110 3094 3079 3064 3033 3003 3012 3022 2957 2893 2898 2984 3034 3003 3023 3043 3003
645 3003 2962 2965 3048 3119 3110 3110 3111 3105 3099 3163 3307 3365 3343 3371 3399 3325 3250 3246 3322 3370 3338 3370 3482 3526 3436 3414 3471 3509 3414 3309 3284 3272 3179 3092 3085 3088 3092 3162
641 3162 3232 3227 3142 3118 3175 3165 3076 3046 3150 3247 3209 3202 3275 3273 3138 3063 3175 3284 3260 3205 3231 3252 3192 3199 3287 3355 3344 3369 3474 3523 3439 3390 3421 3419 3416
636 3416 3483 3682 3837 3858 3909 4040 4100 4027 4060 4280 4451 4382 4342 4490 4601 4525 4452 4567 4659 4619 4588 4744 4885 4840 4854 5162 5533 5718
633 5718 5876 6221 6614 6927 7397 8107 8758 9117 9530 10183 10660 10656 10544 10699 11010 11055 11106 11531 11971 12145 12324 12985 13770 14288 14873
630 14873 15939 17198 18189 19314 21133 23184 24968 27112 30377 34326 38435 43758 51590 61814 74440 92237 118414
628 118414 152006 188427 225095 262457 299512 331176 352445 361063 353948 325961 276744 217012 162824 122781
626 122781 94861 73934 58306 47748 40406 34078 28763 25102 22459 19816 17344 15778 14623 13201 11729 10844
624 10844 10333 9555 8664 8147 7771 7127 6368 5876 5551 5066 4509 4220 4104 3828 3488 3416 3490 3404 3387 3636 4128 4459 4715 5051
621 5051 5394 5470 5463 5535 5513 5223 4919 4881 4924 4806 4521 4396 4372 4269 4068 4027 3991 3795 3611 3587 3687 3706 3669 3712 3805 3738 3644 3711 3845
618 3845 3818 3816 3974 4227 4213 4043 3954 3974 3913 3705 3576 3576 3577 3548 3600 3687 3640 3555 3551 3622 3614 3597 3660 3767 3793 3774 3888 4100 4232 4269 4305 4342 4378
614 4378 4302 4306 4385 4331 4170 4089 4142 4195 4136 4078 4207 4336 4319 4303 4215 4127 4090 4186 4278 4182 4016 3929 3969 3929 3816 3784 3835 3886 3867 3849 3911 3973 3986
610 3986 3998 4091 4184 4208 4232 4297 4361 4318 4274 4271 4268 4252 4237 4266 4296 4319 4423 4521 4487 4371 4335 4380 4424 4489 4555 4700 4845 4863 4881 4819 4757 4676 4596 4702
605 4702 4808 4812 4815 4819 4822 4852 4882 4912 4942 4902 4863 4903 4944 4894 4844 4795 4745 4729 4713 4778 4842 4821 4800 4859 4919 4891 4864 5077 5290 5280 5270 5340 5411 5458 5506
601 5506 5594 5682 5798 5914 5990 6066 6172 6278 6384 6490 6602 6715 6841 6886 6936 7120 7402 7604 7651 7699 7874 8050 8193 8336 8612 8888
598 8888 9210 9532 9894 10256 10701 11147 11779 12411 13097 13783 14503 15224 15747 16189 16565 16808 16988 17168 17526 17884 18232 18579 19059
595 19059 19540 19879 20218 20476 20735 20827 20918 21010 21102 21187 21272 21357 21442 21493 21544 21729 21913 22049 22186 22402 22618 22990 23362 23974 24586 25289
592 25289 25993 26809 27757 28754 29750 30888 32027 33192 34356 35441 36526 37711 38896 40219 41542 42835 44208 45606 46871
590 46871 47925 48900 49899 50898 51702 52319 52861 53270 53432 53353 53153 52873 52578 52283 52129 52163 52372 52769 53315 53941 54541 55061 55407
587 55407 55513 55299 54898 54400 53902 53302 52703 52183 51663 51241 50818 50546 50461 50564 50907 51404 52034 52723 53492 54481 55631 56892 58154
584 58154 59478 60963 62549 64295 66164 68194 70253 72313 74410 76428 78262 79830 81209 82427 83344 83888 84156 84263
582 84263 84232 84120 83941 83602 83157 82631 82197 81763 81145 80152 78846 77380 75787 74194 72752 71576 70529 69749 69250 69019 68971
579 68971 69003 69087 69171 69150 69128 69096 69065 68912 68598 68178 67758 67214 66510 65715 64919 64122 63405 62863 62481 62289 62364 62656 63215 63981 64746 65369
576 65369 65831 66019 66047 66000 65793 65504 65135 64854 64734 64842 65111 65561 66172 66868 67643 68419 69115 69606 69938 70041 69877 69487 68936 68317
573 68317 67617 66844 66070 65490 65071 64732 64314 63896 63558 63162 62605 61917 61069 60056 58669 56965 54994 52900 50806 48908 47171
571 47171 45621 44230 43175 42387 41754 41202 40664 40287 40028 39769 39568 39527 39611 39775 40092 40596 41190 41784 42395 43139 43948 44756 45578
568 45578 46400 47331 48343 49385 50427 51416 52325 53102 53746 54155 54376 54553 54730 54863 54864 54659 54320 53802 53150 52490 51963 51478 50993
565 50993 50471 50030 49652 49274 48860 48527 48384 48322 48219 48116 48130 48144 48157 48171 48284 48397 48475 48473 48484 48496 48502 48508 48559 48611 48667 48723 48873 49103 49434
561 49434 49846 50383 50999 51799 52840 54124 55594 57259 59270 61685 64500 67532 70697 73840 76795 79473 81805 83764
559 83764 85323 86530 87444 88279 89114 90055 91128 92350 93759 95294 96750 98021 99160 100231 101223 102226 103309 104502 105829
557 105829 107183 108456 109586 110529 111286 111909 112383 112723 113030 113416 113903 114470 115176 116069 117164 118339 119512 120685 122000 123448
554 123448 125151 127253 129863 132980 136566 140500 144556 148373 151698 154462 156746 158629 160275 161841 163483 165206 166960
552 166960 168848 170957 173252 175700 178282 181038 183927 186861 189875 192949 195890 198386 200161 201312 201956 202258 202374 202540
550 202540 202840 203303 203953 204909 206159 207582 208925 210111 211057 211661 211918 211986 212054 212365 212969 213912 215202 216780 218652 220958 223878
548 223878 227372 231320 235524 239727 243814 247553 250961 254182 257487 261139 265182 269571 274144 278797 283491 288186 292639
546 292639 296637 300024 302636 304523 305850 306961 308073 309215 310544 312342 314700 317508 320664 324290 328583 333589 339102
543 339102 344962 350902 356473 361324 365238 368270 370514 372090 373236 374249 375282 376554 378348 380968 384534 388873 393625
541 393625 398376 402566 405607 407123 406904 404984 401597 397115 391700 385171 377335 368355 358654 348816 339433 331143 324428
539 324428 319285 315395 312614 310873 310027 309475 308409 306142 302350 297144 291012 284480 277873 271427 265480 260440 256479 253212
537 253212 250194 247096 244010 241192 238763 236709 234816 232843 230632 228260 225937 223880 222150 220900 220006 219485 219242 219158
535 219158 219136 219114 219161 219690 220887 222885 225770 229456 233841 238814 244274 249895 254973 258610 260732 262160 263943 266739 270678
533 270678 275845 281941 288117 293465 297584 300493 302282 302756 302002 300409 298657 297084 295778 294606 293594 292772 291950 290914
530 290914 289612 288366 287387 286513 285051 282456 278846 274719 270859 267712 265474 264208 263530 263012 262333 261652 261557 262544 264651
528 264651 267238 269559 271306 272679 274287 276696 280693 286772 294486 302468 309509 315428 320983 326271 330691 333883 336649
526 336649 340322 345436 351672 358607 366451 375216 383902 391094 396097 399788 403478 408081 413698 419906 426274 432278 437161
524 437161 440135 440921 440023 438217 436064 433644 431193 429117 427927 427859 429129 432054 436701 442788 449682 457270 466200 476890
522 476890 489123 502050 514953 527856 541675 557468 575546 594532 612147 626933 639357 650446 660491 669095
520 669095 676752 685210 696379 711445 730548 752800 776343 798552 817270 831879 843545 854411 866598 881080
518 881080 897344 914302 931640 950526 973092 1001263 1036159 1077621 1124024 1172935 1222308 1271306 1320061 1367908
517 1367908 1412120 1448804 1475303 1491500 1499249 1499793 1492971 1478942 1459816 1438609 1416457 1391370 1360551 1323167
515 1323167 1280899 1237296 1196576 1162421 1136130 1115230 1095231 1072082 1043649 1009505 969936 925937 878774 829636
513 829636 779757 730572 683816 640743 601573 566193 534340 505530 478788 453380 429314 406902 386672 368951
511 368951 353791 340927 329463 318160 306163 293045 279419 266381 255064 245616 237368 229708 222224 214901 207704
510 207704 200881 194790 189393 183976 178186 172462 167646 164330 162243 160678 158740 155720 151900 148027 144527 140927 136740
508 136740 132127 127781 124283 121585 119531 117744 115763 112982 109174 104779 100244 95870 91785 87967 84510 81533 79373
505 79373 78014 77374 77215 77364 77433 76986 75739 74058 72376 70784 69191 67525 65938 64402 62706 60929 59232 57683 56295
503 56295 54900 53505 51996 50487 48982 47636 46387 45139 43863 42588 41125 39503 37900 36564 35495 34586 33804 33182
501 33182 32650 31958 30977 29996 29107 28378 27697 27097 26541 25986 25414 24842 24350 23859 23130 22402 21753 21105 20545 19986 19507 19028 18627
498 18627 18226 17906 17585 17284 16983 16682 16381 16046 15712 15377 15043 14750 14457 14243 14030 13776 13521 13346 13171 12980 12788 12677 12566
495 12566 12413 12260 12187 12114 11979 11845 11721 11596 11514 11591 11902 12213 12270 11954 11297 10640 10120 9760 9505 9330 9209 9088 8972 8857 8639
492 8639 8421 8204 7986 7886 7786 7686 7586 7529 7472 7416 7359 7222 7084 6947 6810 6721 6632 6548 6464 6378 6372 6402 6431 6384 6337 6289 6242 6139 6036
489 6036 5938 5840 5828 5897 5890 5804 5726 5729 5814 5900 5981 6062 6217 6373 6550 6646 6584 6282 5893 5637 5585 5533 5423 5314 5204 5095 5022 4949 4956 4963 4890 4816
485 4816 4748 4680 4695 4790 4840 4890 4867 4844 4866 4809 4771 4733 4690 4648 4576 4505 4514 4523 4487 4451 4415 4379 4344 4309 4318 4248 4147 4047 4075 4103 4120 4137 4199 4181 4111
481 4111 4042 4149 4256 4282 4228 4219 4210 4208 4205 4203 4200 4221 4242 4257 4273 4295 4237 4144 4051 4048 4045 4042 4040 4022 4004 3991 3978 3950 4001 4008 4014 4026 4037 4049 4061 4022 3984 3946 3907 3913
476 3913 3918 3968 3938 3843 3749 3730 3710 3701 3692 3682 3673 3635 3597 3745 3894 3943 3991 4040 4089 4120 4151 4102 4053 3994 3935 3875 3816 3714 3612 3644 3675 3748 3822 3895 3968
471 3968 3950 3932 3914 3897 3915 3934 3953 3972 3942 3912 3882 3853 3779 3706 3820 3933 4035 4138 4107 4075 4041 4007 4052 4098 4025 3953 4067 4182 4213 4244 4275 4306
467 4306 4316 4327 4337 4348 4327 4306 4418 4531 4617 4704 4790 4877 4950 5023 4963 4902 4771 4640 4509 4378 4280 4182 4218 4253 4237 4221 4205 4189 4211 4233 4256 4278
464 4278 4376 4474 4572 4669 4645 4622 4598 4574 4615 4657 4618 4580 4548 4516 4618 4719 4771 4822 4874 4925 4926 4928 5063 5198 5250 5303 5356 5408 5412 5415 5419 5422 5349 5276 5252 5307
459 5307 5295 5283 5276 5269 5238 5207 5131 5134 5117 5099 5086 5073 5022 4971 4876 4860 4848 4837 4785 4814 4869 4924 4890 4857 4809 4760 4827 4894 4895 4817 4739 4741 4790 4839 4894 4948 4927
455 4927 4906 4885 4865 4927 4990 5052 5115 5106 5098 5089 5081 5096 5111 5126 5141 5089 5037 4985 4933 4803 4672 4609 4678 4747 4736 4711 4686 4699 4711 4724 4737 4680 4623 4610 4677 4696
450 4696 4635 4539 4523 4551 4578 4517 4456 4337 4218 4167 4115 4076 4037 3999 3960 3898 3835 3794 3833 3865 3897 3841 3785 3739 3693 3714 3734 3709 3684 3774 3864 3903 3863 3828
446 3828 3793 3842 3892 3920 3868 3733 3597 3527 3537 3495 3373 3295 3298 3286 3275 3268 3261 3253 3245 3238 3230 3190 3150 3109 3069 3095 3121 3107 3094 3039 2984 2996 3008 3037 3065 3161 3257
442 3257 3223 3189 3155 3122 3052 2982 2978 3055 3122 3055 2930 2885 2812 2739 2671 2603 2619 2635 2651 2667 2652 2637 2621 2606 2614 2622 2631 2639 2615 2592 2569 2545 2500 2454 2501 2549 2627
437 2627 2705 2775 2844 2840 2702 2564 2559 2563 2567 2579 2591 2713 2836 2838 2840 2784 2728 2765 2802 2729 2656 2650 2644 2709 2774 2907 3039 3043 3047 3119 3190 3252 3314 3376 3438 3532 3627
432 3627 3788 3949 4088 4226 4298 4369 4286 4203 4119 4036 4027 4018 4009 4000 4017 4034 4051 4068 4040 4013 4025 4037 4054 4072 4022 3973 3999 4026 4053 4080 4057 4035 4008 3980 3949
428 3949 3838 3758 3837 3951 3985 4024 4064 4145 4066 3992 3998 4065 4131 4202 4273 4487 4700 4921 5301 5850 6665 7691 8717 9291 9065 8241 7257
425 7257 6497 5897 5410 5084 4882 4841 4864 5048 5306 5485 5505 5365 5168 4810 4413 4095 3923 3832 3700 3569 3398 3227 3096 2965 2914
422 2914 2864 2893 2922 2948 2975 2961 2947 3007 3067 3087 3106 3089 3072 3050 3028 2995 2882 2804 2886 3049 3211 3250 3289 3448 3607 3686 3766 3784 3803 3742 3681 3569
418 3569 3457 3425 3393 3303 3213 3082 2952 2932 2912 2932 2952 2929 2905 2802 2698 2589 2480 2290 2101 2028 1954 1961 1967 1988 2009 1950 1891 1894 1897 1941 1984 1959
414 1959 1934 1949 1964 1981 1999 1883 1767 1747 1727 1747 1767 1771 1775 1739 1702 1721 1740 1759 1778 1790 1802 1814 1827 1872 1917 1829 1741 1770 1798 1746 1695 1694 1693 1652 1611 1731
410 1731 1850 1836 1822 1799 1776 1753 1730 1789 1849 1828 1807 1846 1884 1790 1695 1713 1731 1789 1847 1838 1829 1739 1650 1748 1846 1865 1883 1887 1891 1855 1820 1825 1830 1836 1841 1907 1974 1853
405 1853 1733 1781 1830 1798 1767 1827 1887 1947 2007 2078 2150 2140 2131 2131 2130 2129 2129 2127 2124 2122 2120 2155 2189 2224 2258 2276 2293 2310 2327 2549 2771 2920 3229 3816 4670 5991
401 5991 8006 10287 11873 11912 10509 8489 6629 5163 4177 3652 3393 3202 3010 2820 2629 2519 2408 2407 2405 2403 2401 2535 2669 2670 2670
397 2670 2688 2706 2596 2486 2446 2487 2448 2409 2467 2606 2632 2659 2709 2759 2743 2726 2793 2860 2838 2817 2928 3119 3237 3355 3626 4084 4648 5398 6645
394 6645 8454 10399 11783 12029 11073 9330 7453 5999 5051 4436 4060 3871 3682 3467 3333 3328 3402 3397 3391 3515 3639 3715 3710 3810 3910
391 3910 3966 4021 4162 4303 4320 4258 4292 4406 4470 4534 4672 4810 4798 4706 4715 4805 4827 4770 4761 4832 4903 4894 4960 5105 5245 5306 5321 5336 5386 5437 5603 5770
387 5770 5794 5819 5883 6027 6126 6225 6398 6572 6623 6593 6716 6919 7028 7058 7179 7380 7495 7611 7784 8036 8181 8191 8318 8578 8848 9117
384 9117 9401 9684 9820 9877 10085 10427 10630 10833 11183 11666 12011 12170 12374 12659 12848 12902 12969 13115 13197 13198 13375 13711 13901 13931 13970 14089
381 14089 14142 14114 14157 14360 14523 14606 14859 15272 15543 15654 15772 16049 16326 16444 16618 16952 17139 17167 17275 17543 17773 17923 18244 18832 19386
378 19386 19860 20455 21211 21838 22198 22605 23278 23985 24532 25205 26145 27204 28342 29758 31440 33044 34488 36015 37809 39478
375 39478 40880 42252 43704 44987 46004 47191 48752 50530 52307 54412 56997 59842 62688 65748 68968 72011 74895
373 74895 78222 82349 86964 91846 97527 104329 111798 119534 127902 137605 149016 163042 181489 206822 240975 284683
371 284683 336674 391815 441391 476181 490398 484278 463413 436515 411453 392316 379630 373297 373703 380140 390061
369 390061 400675 410315 417340 419307 414922 405695 394066 381470 368607 356778 346603 337272 327860 319151 312097 306317
367 306317 301123 297377 296033 296357 297375 299244 301914 303783 303784 303386 304429 306469 308509 311778 317448 324577 333147 346690
365 346690 368187 396462 431623 480070 549173 642090 767621 944380 1171475 1391311 1506473 1456946 1276483
364 1276483 1059710 880247 752678 661993 600526 568363 560194 570546 602623 656852 712800 736133 706702
362 706702 634623 547780 469424 408049 361460 324398 293155 266609 244493 225924 210076 197125 187003 178729
360 178729 171362 165383 161592 159586 158274 157516 157878 159148 160792 162823 165654 169150 173339 178790 186215 195649 207058
358 207058 221263 239150 260551 284673 311645 343047 381291 428023 480612 529946 562785 569308 549202 509934
356 509934 460675 409013 360821 320689 291084 272209 263336 263056 268388 274627 277143 272560 259671 239469 214970
355 214970 189778 166097 144924 126974 112601 101012 90972 81966 74294 67914 62441 57660 53680 50182 46605
353 46605 42936 39854 37424 35154 32868 30849 29118 27388 25762 24511 23744 23058 22333 21876 21782 21688 21439 21111 20647 19702
350 19702 18384 17226 16450 15861 15301 14927 14795 14476 13874 13271 12947 12623 12166 11709 11445 11181 10873 10644 10509 10375 10115 9935
348 9935 9839 9663 9358 9133 9060 8987 8794 8681 8672 8662 8625 8773 9076 9245 9101 8956 8863 8771 8539 8308 8161 7933 7554 7308 7313 7504 7835
344 7835 8407 9044 9227 8737 7900 7139 6512 5958 5537 5344 5232 5117 5083 5159 5235 5177 5120 5122 5044 4882 4799 4843 4807 4634 4462 4394 4326 4209
341 4209 4171 4295 4340 4247 4154 4120 4085 3918 3750 3798 3846 3713 3579 3591 3683 3735 3707 3649 3592 3480 3447 3464 3400 3261 3202 3255 3308 3179 3050 3121
337 3121 3192 3076 2960 2959 2958 2877 2796 2768 2740 2661 2663 2815 2888 2672 2456 2417 2511 2490 2469 2569 2669 2681 2613 2628 2644 2526 2408 2416 2503 2465 2428 2471
333 2471 2514 2477 2440 2473 2506 2459 2412 2461 2510 2372 2154 2068 2115 2133 2070 2061 2132 2153 2174 2253 2332 2225 2117 2127 2136 2063 1909 1850 1872 1848 1824 1829 1913 1923
329 1923 1852 1832 1891 1901 1910 1919 1928 1936 1945 2034 2122 2078 2033 1992 1951 1835 1720 1747 1855 1883 1830 1840 1849 1774 1698 1710 1721 1652 1583 1681 1779 1724 1535 1464 1580
325 1580 1633 1606 1572 1618 1618 1619 1685 1831 1881 1799 1787 1909 1978 1860 1699 1619 1615 1611 1616 1621 1586 1551 1548 1546 1468 1390 1370 1430 1489 1469 1463 1458 1452 1447 1438 1510 1587 1583 1530 1556
320 1556 1583 1529 1488 1527 1515 1504 1443 1383 1362 1341 1465 1589 1660 1597 1521 1526 1557 1589 1656 1723 1657 1510 1406 1436 1476 1435 1423 1491 1554 1537 1509 1481 1448
316 1448 1415 1460 1505 1549 1594 1580 1567 1473 1379 1405 1431 1457 1484 1551 1618 1631 1512 1433 1435 1428 1421 1432 1523 1643 1631 1558 1485 1404 1322 1384 1447 1509 1571 1522 1473
312 1473 1424 1376 1435 1495 1555 1614 1575 1535 1576 1617 1622 1628 1594 1559 1642 1724 1766 1809 1805 1802 1838 1875 1996 2118 2239 2361 2601 2842 3211 3581 3978 4296
308 4296 4363 4243 4083 3922 3759 3595 3469 3477 3504 3450 3412 3508 3643 3699 3613 3447 3321 3195 3167 3138 3030 2922 2863 2805 2787 2769 2836 2904 2892
304 2892 2879 2765 2650 2616 2581 2668 2756 2715 2673 2665 2737 2814 2810 2833 2935 2993 3050 3152 3334 3579 3824 4205 4827 5698 6810 8197 9585 10231
301 10231 9730 8385 7040 6067 5387 4872 4490 4249 4087 4074 4301 4682 4982 5086 4949 4613 4143 3666 3323 3075 2827 2532 2318
298 2318 2286 2253 2210 2168 2109 1969 1863 1837 1899 1881 1837 1792 1815 1837 1813 1869 2000 2131 2173 2216 2304 2391 2412 2512 2657 2722 2743 2843 3128 3494
294 3494 3798 4103 4487 4872 5080 4994 4690 4199 3688 3258 3006 2834 2721 2607 2627 2727 2865 3003 3048 2959 2735 2511 2345 2180 1982
291 1982 1784 1635 1486 1455 1558 1697 1756 1633 1509 1448 1386 1341 1296 1344 1393 1359 1325 1379 1434 1448 1383 1277 1252 1317 1383 1459 1455 1423 1391 1354 1317
287 1317 1288 1259 1297 1334 1287 1239 1258 1278 1266 1254 1242 1229 1238 1247 1256 1265 1245 1226 1206 1186 1183 1180 1178 1175 1218 1261 1304 1347 1310 1272 1301 1330 1289 1248 1207 1167 1138 1109 1079
283 1079 1050 1003 956 1029 1102 1052 1002 1073 1143 1194 1244 1229 1213 1158 1104 1050 995 1039 1082 1126 1169 1145 1121 1217 1313 1268 1223 1178 1133 1106 1078 1051 1023 1000 977
278 977 953 930 957 984 1012 1039 976 914 971 1028 1080 1131 1223 1314 1249 1184 1235 1285 1247 1128 1020 1045 1105 1164 1165 1166 1189 1213 1236 1259 1225 1191 1250 1309 1298
274 1298 1287 1276 1265 1222 1179 1230 1280 1295 1310 1284 1259 1262 1265 1175 1084 1006 928 917 906 951 996 1042 1087 1098 1109 1120 1131 1059 986 994 1002 948 894 920 946 939 933 1006
269 1006 1080 1063 1047 1105 1163 1170 1096 1022 1029 1019 1008 958 988 1005 1022 1044 1066 1060 1054 1048 1042 977 912 935 1038 1072 1105 1144 1182 1181 1179 1178 1177 1195 1214 1152 1091 1029 967
265 967 985 1003 1055 1107 1158 1210 1201 1192 1178 1164 1112 980 928 956 989 1021 1059 1097 1120 1143 1241 1339 1378 1337 1262 1186 1160 1134 1183 1233 1274 1236 1197 1239 1235 1232 1233
260 1233 1235 1234 1234 1233 1233 1222 1212 1196 1181 1177 1093 1009 1005 1032 1060 1013 965 1015 1064 1159 1173 1139 1105 1141 1178 1184 1111 1037 1043 1075 1107 1010 913 902 891 960 1029 1028 1027 1026 1025
255 1025 1055 1084 1114 1143 1156 1169 1182 1195 1165 1136 1107 1078 1072 1066 1060 1054 1054 1054 1054 1054 973 891 868 978 1063 1148 1161 1175 1165 1155 1145 1135 1073 1011 948 886 932 978
251 978 1024 1070 1039 1007 1056 1105 1191 1277 1282 1288 1240 1192 1144 1096 1082 1067 1053 1038 1089 1139 1110 1080 1112 1145 1177 1209 1186 1164 1141 1119 1086 1054 1021 989 1010 1031
246 1031 1052 1073 1046 1019 991 964 986 1008 950 892 799 705 794 883 893 824 849 1008 1160 1179 1094 1010 997 985 972 960 999 1038 1077 1117 1107 1098 1088 1078
242 1078 1119 1159 1200 1240 1210 1180 1150 1120 1165 1210 1251 1291 1238 1106 1048 1071 1125 1099 1043 988 974 959 945 931 964 996 1029 1062 1095 1129 1083 1037 1049 1061
238 1061 998 935 867 879 1024 1170 1262 1221 1174 1128 1160 1192 1144 1096 1124 1153 1182 1211 1215 1220 1225 1229 1154 1079 1132 1185 1230 1194 1124 1054 1016 977 974 1050 1108 1166
233 1166 1223 1281 1257 1153 1049 1025 1060 1095 1130 1165 1206 1168 1094 1021 1023 1026 1028 1031 1038 1046 1003 1041 1116 1110 1075 1040 1076 1113 1021 929 919 988 1008 1028 1006 904 802
229 802 780 835 890 871 851 854 858 906 875 842 810 772 735 756 777 798 819 907 995 1003 1010 1007 1003 1004 1005 991 1057 1122 1108 1061 1013 960 908 934 960 986 1013 1002 992
224 992 981 971 994 1018 1042 1066 1001 936 925 1047 1160 1194 1200 1207 1233 1260 1153 1046 1038 1030 1023 1015 942 870 930 991 1051 1111 1091 1070 1062 1053 1045 1036 1014 992 890 788
219 788 807 825 843 861 930 999 934 869 916 963 1010 1057 1058 1058 1059 1059 1083 1106 1130 1154 1153 1152 1151 1150 1134 1118 1102 1086 1109 1131 1073 1016 1070 1124 1098 1072 1014 955 977
215 977 998 1025 1052 998 945 976 1007 1039 1070 1054 1039 1023 1008 1035 1062 1009 956 991 1027 1062 1097 1062 1027 992 957 952 947 942 937 935 933 931 930 960 989 1019 1049 1095 1142
210 1142 1108 1074 1080 1086 1093 1099 1046 993 940 887 911 934 958 982 1041 1100 1159 1218 1187 1156 1125 1094 1112 1130 1148 1166 1114 1061 1009 957 954 950 946 943 979 1014 1090 1165 1096
205 1096 1026 1037 1048 1036 1024 972 920 956 993 989 986 922 858 928 998 1009 1021 953 884 854 824 834 844 859 873 848 823 879 934 1030 1125 1162 1198 1154 1110 1142
201 1142 1174 1126 1078 1030 983 935 888 938 989 1040 1091 1067 1043 1019 995 1039 1083 1048 1012 1009 1006 1003 1001 1018 1035 1052 1070 1108 1147 1106 1065 1079 1093 1107 1121 1112 1103 1094
196 1094 1084 1090 1096 1102 1108 1128 1148 1034 920 928 936 1025 1113 1198 1283 1265 1113 1007 1035 1104 1094 1052 1010 1003 996 997 997 998 998 1034 1071 1077 1003 926 929 963 997 1005 1014 983 952
191 952 951 950 948 947 916 885 894 902 1012 1122 1197 1191 1172 1153 1129 1104 1071 1038 1084 1131 1120 1110 1059 1009 922 834 827 820 877 933 950 966 1045 1124 1203 1148 1023 977
186 977 1011 1046 1042 1038 1034 1030 995 961 927 893 909 924 945 966 938 989 1041 1012 917 821 855 888 923 958 918 878 847 895 949 922 874 907 969 1032 981 931 921
182 921 911 910 908 907 905 955 1006 1061 1036 976 916 979 1043 1045 966 893 819 797 775 833 891 901 911 922 932 930 929 927 926 988 1049 1111 1173 1120 1067 1013 960 957 954 951 948 929
177 929 911 892 874 872 870 1001 1133 1087 1042 917 791 764 737 790 843 861 879 896 914 952 990 1028 1066 987 909 910 911 911 910 910 909 912 914 917 919 892 864 917 969
172 969 1010 1051 959 866 877 888 979 1070 1034 999 1044 1089 1094 1098 1103 1108 1076 1044 1011 979 1010 1042 1073 1104 1089 1074 1059 1044 1028 1013 998 983 960 937 914 892 975
168 975 1059 1063 1067 1012 957 982 1008 968 928 968 1009 928 848 768 687 785 883 901 919 925 930 1016 1102 1060 1019 978 937 914 891 869 846 866 887 908 928 944 959
163 959 975 991 1038 1085 999 913 989 1066 1143 1220 1143 1066 989 913 870 828 866 904 941 979 937 894 899 904 908 913 911 909 987 1065 1053 1040 1028 1015 963 910 938 965
158 965 947 929 911 893 853 813 853 893 930 968 925 882 839 796 753 710 740 770 800 830 851 871 891 911 911 911 911 910 952 993 1035 1076 1059 1042 1105 1168 1109
154 1109 1050 991 932 914 896 878 860 847 834 821 808 862 916 890 864 940 1016 1092 1168 1110 1052 999 946 952 1038 1153 1135 1044 954 988 1022 981 940 899 858
150 858 861 864 867 870 855 840 825 809 784 758 813 867 902 936 970 1005 1047 1089 1051 1013 929 846 897 947 877 808 822 915 1018 1040 1032 1024 1025 1026 1028 1029 978 926 1004 1081
145 1081 1092 1024 960 897 892 887 1010 1134 1177 1140 1109 1077 991 904 853 881 869 857 840 903 949 915 880 926 957 908 829 750 760 769 739 708 722 736 790
140 790 844 879 915 870 826 804 782 841 899 918 936 954 973 977 981 986 990 957 925 893 860 865 870 875 880 836 793 779 846 958 989 937 885 833 781 770 758 800 842
136 842 895 867 822 856 921 986 955 923 887 931 942 953 964 975 973 891 809 807 884 960 961 963 997 1032 1067 1101 1042 984 955 1006 1060 1033 931 909 968 1026 956
131 956 886 855 823 871 920 933 945 918 890 895 899 828 758 708 739 859 978 964 950 971 992 1030 988 950 913 915 917 920 922 950 978 1006 1035 950 866 816 847
127 847 839 831 855 959 1003 912 777 722 768 815 861 908 984 980 941 902 969 1036 1068 1020 957 893 864 836 868 900 932 964 1009 1053 964 876 867 858 854 850 832 894
122 894 986 1078 1059 960 821 762 755 747 745 742 737 732 727 722 770 818 866 913 846 779 747 794 875 955 961 966 943 921 898 875 843 811 809 887 1013 1059 1022 985 1021 1057
117 1057 1017 978 913 929 974 1020 1088 1076 976 875 830 785 780 774 887 999 991 984 949 915 880 846 832 819 806 792 846 899 912 926 977 1029 988 946 960
113 960 975 989 1003 944 885 920 954 1004 1053 1103 1152 1092 1031 931 831 853 875 964 1053 1073 1092 1019 945 945 944 944 944 927 911 894 878 889 900 911 922 869
108 869 816 830 844 878 911 944 977 950 924 897 870 863 855 915 974 991 1009 1026 1044 1075 1106 1043 981 951 921 892 862 846 831 855 880 934 987 921 855 822
104 822 789 756 723 764 805 846 887 870 854 837 821 887 953 953 872 771 804 877 949 939 928 918 907 814 721 747 774 714 655 715 775 839 902 899 896 859
100 859 821 824 827 817 808 733 657 752 846 848 849 862 875 888 901 910 919 927 936 901 866 831 797 836 875 914 953 948 944 940 935 925 916 906 896 913 931 949 966 935 903 938
94 938 974 946 919 958 997 963 929 935 941 928 916 890 944 1018 959 842 804 888 973 915 858 900 943 892 841 793 746 792 837 883 928 906 885 907 929 951
90 951 972 935 898 861 824 871 919 874 828 931 1034 968 902 878 934 962 856 732 741 814 887 815 742 760 911 1058 1071 941 811 807 803 798 794 853
86 853 912 904 896 860 823 827 831 847 864 881 898 850 802 820 839 825 812 799 786 810 834 857 881 837 792 788 784 857 930 920 830 790 830 824 819 830 922 1013 1025 990
81 990 955 915 875 906 937 928 919 839 760 716 752 858 964 987 929 894 860 860 861 865 870 800 729 731 813 895 897 889 880 872 864 915 1047 1103 1080 990 981 1011 962 874 865
76 865 940 1015 995 975 995 1015 963 911 938 966 1004 1042 1040 1038 1037 1037 1036 1036 977 919 941 963 995 1027 1054 1081 1065 970 914 939 980 1022 988 954 893 832 851 870 865
71 865 860 856 851 859 868 876 885 925 966 878 790 697 684 706 729 741 754 767 780 781 782 783 784 799 814 829 844 854 864 874 884 962 1040 1083 1045 992 939 881 823 894 965
66 965 1041 1037 1042 1047 1018 908 796 765 865 965 1000 954 913 873 909 946 903 859 821 782 819 855 875 814 759 703 734 764 794 825 803 781 760 738 773
62 773 808 798 868 977 1085 1062 959 909 940 961 982 974 966 884 801 777 834 890 866 799 731 738 745 769 793 817 841 931 1020 1026 952 841 811 864 917 897
57 897 878 858 839 845 851 856 862 841 820 803 787 825 942 1059 1096 1067 1037 1002 968 933 898 864 829 859 888 918 947 922 897 871 846 778 710 731 832 882
53 882 933 860 788 732 757 816 876 838 801 764 727 785 843 872 820 770 800 859 919 940 960 897 754 637 600 646 693 746 799 812 825 817 808 840 871 882
49 882 893 904 915 931 947 963 979 968 957 986 1015 951 886 902 918 898 879 819 759 761 763 806 848 828 808 794 779 767 835 938 1041 1007 972 938 904 871
44 871 838 886 933 1005 1076 1019 962 921 960 1039 1038 947 855 892 928 942 957 891 825 789 753 798 842 853 863 874 885 913 940 968 995 984 973 962 951 848
40 848 744 778 891 1005 1039 1043 1047 1083 1119 1115 1111 1130 1148 1242 1335 1313 1210 1107 1084 1056 1028 931 833 753 753 788 824 895 967 959 951 952 952 953 954 857 760 743 726
35 726 709 692 714 737 786 835 883 932 928 923 919 915 901 888 834 781 729 677 705 732 768 803 839 874 896 918 1015 1112 1063 934 845 836 785 735 773 891 916
31 916 861 847 912 983 974 970 966 951 855 794 814 871 849 786 804 843 802 686 651 722 794 791 788 815 841 868 895 911 926 942 958 978 999 1020 1041 1075 1109 1009
26 1009 830 712 728 845 963 1102 1161 1078 996 928 860 793 725 746 767 788 809 851 893 979 986 962 939 950 961 900 839 857 876 917 958 919 880
22 880 861 842 783 724 733 742 817 893 845 797 789 781 825 870 848 825 772 718 731 743 742 740 779 817 828 838 848 858 862 865 869 872 870 867 865 863 822 782 808 835 890 944 999
17 999 1054 1071 1088 1039 989 965 940 916 891 925 958 952 945 862 780 764 748 787 825 903 982 1014 1045 1010 975 986 996 1074 1151 1094 1037 1020 1003 975 948 920 892
12 892 867 842 817 792 808 825 842 858 910 961 920 878 820 763 799 835 882 928 882 835 817 798 780 761 782 803 890 978 1024 1070 996 922 882 843 804 765
8 765 785 804 824 843 863 882 902 921 957 992 1028 1063 1029 994 893 792 812 833 786 740 779 819 819 818 835 851 867 884 898 912 926 939 948 956 964 972 970 968 966 964
3 964 952 941 929 917 895 874 852 830 818 805 793 780 791 802 813 824 831 839 847 854 847 839 792 744 708 673 730 788 789 790 724 658 683 707 692 677 707 738 768 798
-2 798 778 758 804 850 865 880 854 829 792 755 719 682 795 909 876 842 823 805 786 767 776 784 793 802 802 802 803 803 783 764 784 804 820 836 732 628 651 674
-7 674 791 908 882 856 830 804 784 763 743 723 730 737 744 751 801 852 902 953 939 925 912 898 862 826 883 940 953 967 980 993 942 891 840 788 836 883 930
-11 930 978 986 994 1002 1010 1012 1013 975 936 873 811 841 872 906 940 907 874 895 916 870 824 801 778 796 813 895 978 994 1009 983 956 890 824 799 774 816 858 898
-16 898 939 939 939 869 798 848 897 880 863 847 830 879 928 937 946 857 769 774 778 853 928 909 891 903 915 861 806 803 799 795 792 833 874 849 824 810 796 783 769 762 755
-21 755 708 661 752 843 841 839 841 842 843 844 883 921 960 999 988 977 966 955 952 948 945 942 998 1055 1072 1089 984 878 892 907 982 1057 1012 968 945 923 901 879 913
-26 913 947 986 945 892 838 895 951 1004 977 955 933 968 1003 1034 1064 1082 1019 935 851 891 932 933 934 915 896 876 857 862 867 832 797 768 738 775 812 827 842
-30 842 818 793 818 842 800 758 715 673 671 669 674 679 751 823 887 951 894 838 821 805 828 852 877 902 860 819 793 767 808 849 901 952 911 869 867 866 864 862 924
-35 924 987 983 978 902 826 689 551 591 710 741 692 674 736 815 893 927 961 952 862 796 809 858 827 799 772 855 938 982 946 949 953 989 945 858 771 808
-39 808 926 982 958 912 946 1042 1057 945 833 756 812 943 993 950 907 963 1018 994 969 966 964 921 878 853 827 802 776 803 830 857 884 933 982 981 847
-44 847 717 721 775 829 807 785 839 892 926 880 804 728 729 809 849 809 790 772 798 744 680 696 795 895 928 962 915 869 859 848 878 907 912 917 931 866
-48 866 755 725 778 831 875 919 922 926 923 919 881 842 811 860 874 808 731 734 811 809 742 675 736 797 836 876 875 875 806 737 703 750 850 950 1015 1080 1099 1118
-53 1118 1057 996 892 787 763 738 752 766 705 644 602 640 683 646 607 649 720 791 772 753 739 725 702 760 852 945 918 891 864 838 839 841 842 844 835 827 819
-57 819 811 763 715 747 779 724 670 695 721 676 632 667 703 690 677 740 802 847 811 820 829 888 947 1001 1056 1058 980 948 915 891 866 847 827 809 872 934 916
-62 916 846 775 833 891 841 791 824 937 941 864 788 792 821 769 718 747 804 781 762 824 836 848 860 872 877 802 727 732 752 772 792 812 855 818 746 674 720
-66 720 766 731 697 658 619 620 621 694 766 759 752 792 832 832 832 849 867 884 902 930 958 986 1014 1018 1021 1024 1027 986 945 984 1023 1053 1082 1031 980 996 1013 1075 1056 988
-71 988 919 846 772 789 805 822 838 865 891 918 944 952 960 967 975 961 947 1013 1079 1026 974 922 870 762 653 597 675 749 743 710 677 655 634 612 591 621 651
-76 651 681 711 724 737 750 763 784 804 825 845 836 826 817 807 828 850 871 892 930 968 926 884 908 933 927 841 714 666 649 631 665 699 733 767 749 732
-80 732 714 696 712 728 745 761 794 827 859 892 877 861 846 830 877 923 894 865 846 907 967 948 854 759 740 721 702 683 792 902 901 820 740 739 768
-84 768 797 831 864 790 715 721 726 750 773 747 801 888 895 872 849 887 925 963 1001 1022 1043 984 925 947 968 990 1012 938 865 791 718 743 769 795 821 816 812 808
-89 808 803 827 851 874 898 865 832 799 766 764 762 760 759 815 872 795 718 738 758 779 799 767 736 704 673 724 774 825 876 897 917 804 692 683 674 745 816 824
-94 824 832 840 847 870 894 917 940 880 819 759 699 741 784 826 868 846 823 934 1045 1014 983 952 922 889 857 825 792 852 912 972 1031 1038 1044 971 897 803 709
-98 709 696 682 779 875 891 908 826 744 742 740 791 842 894 945 908 870 833 796 822 847 873 899 865 830 796 761 779 796 813 830 863 896 848 801 803 806 809 811
-103 811 878 945 932 919 925 931 937 943 933 924 875 825 853 882 857 793 767 820 912 923 879 836 839 883 951 938 894 849 844 839 837 834 867 939 959 899 811 804 879 955
-108 955 928 900 873 845 784 722 691 739 795 771 734 738 780 823 828 833 878 923 966 1009 973 897 799 781 764 746 736 727 753 820 870 839 775 711 722 733 753
-112 753 774 829 884 880 796 747 778 830 802 737 751 794 797 749 702 738 815 838 782 731 761 802 804 766 728 767 806 754 701 729 756 776 796 776 756 784
-117 784 812 837 863 837 771 759 828 932 997 977 918 865 813 838 863 904 946 908 870 813 757 780 803 792 781 769 758 751 745 739 732 771 809 847 886 861
-121 861 836 811 786 813 839 866 893 863 833 803 773 804 835 866 898 903 909 874 839 759 679 732 785 874 963 972 981 882 783 764 745 814 883 871 860 774 688
-126 688 642 597 643 688 774 860 943 1026 975 924 844 764 764 764 754 744 859 973 995 883 801 799 816 833 856 878 909 939 890 840 827 813 799 786 804
-130 804 822 840 858 897 937 976 1016 976 936 896 856 864 872 839 807 844 881 790 698 754 889 979 936 848 840 859 877 806 735 743 752 772 793 813 833 865 897
-134 897 849 800 878 956 900 844 799 754 803 851 788 726 757 788 860 932 885 837 865 893 828 763 766 769 772 775 836 897 958 1018 975 932 889 846 914 983 958
-139 958 934 979 1025 1004 983 977 971 965 959 937 915 893 871 811 752 759 766 780 795 809 823 859 895 931 967 1016 1064 1019 974 903 832 828 824 878 933 921 910 821 732
-144 732 764 795 852 908 844 780 773 765 757 749 763 778 753 727 651 575 619 662 709 756 710 663 705 747 754 761 822 963 1068 1039 1006 972 931 889 847 805 829
-148 829 854 789 724 726 728 789 850 845 840 830 821 811 802 756 709 730 751 724 697 670 643 647 651 655 659 653 647 641 635 716 797 878 960 931 902 873 844 832 819 807 795 772
-153 772 750 728 705 695 686 676 666 697 728 759 790 783 776 728 681 667 653 733 812 798 784 770 757 730 704 771 838 820 803 745 688 707 726 812 898 883
-158 883 868 893 918 927 935 877 819 755 691 748 804 889 974 938 903 847 791 774 758 798 838 878 917 914 910 840 769 776 782 789 795 858 921 918 914 900 887 873 859 770
-163 770 680 630 580 605 629 720 812 793 775 823 871 876 881 886 891 854 816 779 742 722 701 681 660 709 758 807 855 883 911 872 834 768 702 717 731 648 565
-167 565 616 746 834 789 698 687 755 823 816 809 808 808 807 807 786 766 745 725 772 819 785 752 804 856 833 809 837 944 1010 942 838 867 937 928 781 634
-172 634 670 705 756 808 860 912 917 922 927 932 862 792 802 812 831 849 868 886 895 903 912 920 951 982 933 884 897 909 922 934 896 857 819 781 817 854 810 767 783
-176 783 798 814 830 795 761 807 853 844 836 828 820 781 743 785 827 854 882 909 937 907 878 849 820 764 708 780 853 795 658 570 616 648 680 721 761 802
-181 802 842 803 763 752 741 729 718 787 856 791 727 726 725 725 724 680 636 672 708 751 793 835 877 888 899 909 920 891 861 832 803 847 891 855 820 761 703
-185 703 724 746 781 816 851 886 867 848 828 809 802 794 786 779 846 914 901 889 814 740 746 752 807 862 838 813 770 727 684 640 721 801 801 802 835 869 822 776 804
-190 804 833 861 889 814 739 797 856 859 862 866 869 891 912 854 796 813 831 768 706 722 738 754 770 799 829 778 728 766 804 842 880 871 863 854 845 813 781 749 717
-195 717 744 772 800 828 856 884 832 780 672 564 643 722 786 850 834 818 818 818 818 819 740 662 766 869 909 868 792 716 736 755 774 794 781 768 755
-199 755 743 741 740 739 738 784 830 847 783 701 698 726 754 718 683 722 761 725 608 531 535 560 585 615 645 608 570 621 752 805 857 910 962 936 830 724
-203 724 698 717 735 759 783 796 810 823 837 822 807 792 777 826 874 843 811 863 915 937 879 836 873 945 937 913 889 900 911 868 825 821 818 796 773 826
-208 826 879 927 896 834 772 738 784 865 946 959 972 944 917 943 970 956 942 905 868 837 805 770 815 860 825 772 719 740 762 774 786 799 811 769 727
-212 727 764 802 791 780 804 828 866 823 785 748 776 804 832 859 848 837 901 965 909 772 735 830 885 858 806 753 679 604 613 702 811 840 834 827 889
-216 889 871 764 658 694 730 726 722 727 732 816 901 924 946 964 981 1020 980 904 829 863 898 902 826 793 840 882 844 766 688 733 779 774 690 605 601 676 752
-221 752 752 753 730 708 685 663 685 708 650 593 566 540 593 647 736 824 784 745 718 770 823 796 761 725 765 804 733 662 671 680 686 692 698 703 718 733 748 763 723
-226 723 684 645 605 618 630 683 735 718 700 758 816 882 869 855 842 879 837 799 762 792 821 811 801 811 821 831 841 833 826 818 810 864 918 831 743 694 725
-230 725 751 777 777 776 775 775 797 819 842 864 800 735 714 773 891 929 875 820 801 862 883 824 773 722 706 691 647 602 625 648 686 724 723 721 707 693 719
-235 719 745 744 743 743 742 761 779 798 817 820 824 827 831 748 665 576 568 670 771 834 817 778 819 895 891 808 725 707 769 810 772 738 784 828 872 854 837 842 848 854
-240 854 859 776 693 605 597 662 727 731 734 707 679 652 624 587 551 536 601 715 830 848 787 806 826 841 856 843 831 819 807 763 719 715 711 818 924 934
-244 934 863 787 791 865 939 918 897 876 856 816 776 829 883 892 902 844 787 826 865 903 942 911 880 888 897 846 795 810 826 831 837 842 847 787 726 666 605 640 674
-249 674 709 743 774 806 797 788 762 736 777 818 835 853 870 888 870 852 834 817 782 748 713 679 710 741 772 803 844 885 926 967 910 853 796 739 759 779
-253 779 799 819 817 815 813 812 810 808 806 804 793 782 770 759 729 700 710 721 694 668 708 749 744 739 735 730 764 798 832 865 837 809 742 674 748 823 778 732 663 595 619
-258 619 644 700 756 718 681 758 836 847 857 885 913 875 836 861 887 792 698 718 739 760 780 801 822 843 863 814 765 677 588 544 500 576 652 696 740
-263 740 784 828 766 703 735 766 783 801 751 701 659 616 613 610 652 694 772 849 806 683 619 688 779 791 745 778 892 1007 953 899 835 771 707 643
-267 643 669 695 721 747 817 887 918 948 872 796 868 939 973 1008 896 784 727 670 706 742 800 857 795 732 720 707 695 683 717 751 785 820 804 788
-271 788 772 756 767 779 790 801 812 823 834 845 875 904 933 963 929 895 861 827 827 827 827 826 826 826 826 826 820 815 810 805 774 744 807 870 924 977 937 817 754 824
-276 824 925 947 895 842 852 861 929 997 971 946 870 795 759 724 710 696 749 801 786 771 715 660 611 562 634 705 736 767 757 748 708 667 666 665 710 755
-280 755 760 765 680 595 629 664 723 782 774 766 797 828 899 971 927 884 840 797 786 775 764 753 775 796 818 840 811 783 794 806 833 861 822 782 722 662 669
-285 669 675 703 730 757 784 802 821 773 725 759 794 828 863 828 793 851 910 850 789 796 802 874 947 899 851 883 916 948 981 859 737 735 734 799 864 890
-289 890 915 895 876 896 917 976 1036 948 861 761 660 706 752 790 828 773 717 696 674 746 819 815 811 728 644 643 642 721 800 842 883 925 966 938 909 880
-293 880 852 875 899 842 785 777 768 840 912 945 979 879 778 745 712 758 805 861 917 893 869 933 996 980 963 925 887 889 891 894 897 900 902 841 780 798 817 818
-298 818 820 781 742 743 744 745 746 748 749 830 911 894 876 819 761 774 788 801 815 807 799 791 783 780 777 774 771 747 724 701 677 676 674 672 671 613 556 578 601 634 666 699 732 689
-303 689 647 685 722 753 783 773 763 701 639 657 675 647 618 629 641 678 715 751 788 812 835 779 722 689 656 663 670 757 844 798 752 728 705 721 738 679
-308 679 619 640 661 712 764 816 868 828 788 748 708 709 710 711 712 781 850 839 829 836 844 851 859 832 804 777 749 758 766 775 783 767 750 734 717 713 708 784 859 898 937 896
-313 896 855 839 823 808 792 850 909 887 866 851 835 780 725 723 722 721 720 753 785 818 850 906 962 884 807 793 780 847 914 962 1010 1059 1107 968 829 770
-317 770 711 708 705 742 779 750 720 690 660 677 693 709 725 749 773 797 822 796 770 744 718 739 759 780 801 687 574 594 614 658 702 705 709 689 669 688
-322 688 708 769 829 850 871 853 835 817 799 789 779 770 760 738 716 695 673 625 577 711 845 874 823 772 801 833 866 899 932 921 830 738 727 726 724
-326 724 768 812 879 947 882 816 762 709 784 859 930 922 878 835 874 914 873 833 817 802 867 931 955 978 1002 1025 974 922 825 809 863 917 848 778 741
-330 741 783 825 788 671 555 620 685 676 666 656 647 633 620 606 592 576 559 670 782 874 885 862 839 847 856 789 723 638 633 711 790 856 842 798 753
-335 753 736 799 901 924 813 702 675 727 772 817 826 836 857 878 860 841 774 708 725 822 896 890 855 819 780 742 658 654 735 816 768 720 663 606 590
-339 590 573 653 734 735 736 740 744 749 753 745 737 729 721 727 734 781 827 844 862 799 736 743 750 837 924 889 855 740 625 702 778 855 931 881 831 781 730 755 779 724 668
-344 668 641 613 586 559 596 633 671 708 735 763 790 817 812 806 801 795 806 817 828 839 809 779 749 718 750 781 813 844 911 977 910 844 737 631 659 686
-348 686 713 740 727 714 703 693 682 672 758 844 850 856 871 885 940 994 927 859 832 804 793 782 771 760 743 725 707 690 698 706 754 803 818 833 715 597
-353 597 587 576 646 715 667 618 650 681 725 770 774 778 747 717 686 656 673 690 708 725 716 707 699 690 638 586 667 748 760 772 704 636 696 756 736 716 725 734 742
-358 742 751 755 759 762 766 774 781 789 796 782 768 754 740 767 794 741 688 748 808 827 847 883 919 875 832 828 824 820 816 820 824 788 752 772 792 731 671 643 616 669 721 754
-363 754 787 819 852 828 804 779 755 703 651 640 628 687 747 726 705 754 802 851 899 829 759 769 779 719 660 681 702 697 691 646 601 651 700 710 720 781
-367 781 843 824 806 786 767 747 728 702 677 651 626 578 531 564 597 669 742 814 887 853 820 826 833 845 856 788 720 654 589 656 724 748 773 797 821 804
-371 804 788 691 594 592 589 626 664 721 779 756 733 749 764 819 874 843 812 782 751 722 693 744 795 744 693 722 752 762 772 854 936 977 884 782 759
-376 759 745 731 721 712 787 861 856 851 791 731 751 771 841 911 848 784 827 870 832 795 839 883 848 812 825 839 853 866 859 852 765 678 643 608 614 619 690 762
-380 762 753 744 711 677 723 769 729 688 648 607 624 641 657 674 707 740 774 807 828 849 871 892 886 881 795 710 686 662 718 774 782 790 718 646 672 699 725 752
-385 752 779 805 832 859 873 888 823 758 699 641 716 791 804 817 830 844 782 720 738 756 699 642 666 689 683 678 673 668 769 871 786 701 691 681 671 661
-389 661 692 724 755 786 818 849 880 912 852 793 733 674 691 709 726 743 739 735 730 726 792 858 843 829 854 879 825 770 733 697 661 624 546 468 523 578 595
-394 595 612 629 645 647 649 650 652 729 805 749 692 676 661 646 631 630 630 630 630 669 708 747 786 784 781 779 776 841 906 784 662 669 675 682 689 716 743 770 797 794 791 788 785 750
-399 750 716 681 646 610 574 618 662 678 694 710 727 778 829 881 932 879 825 772 718 768 819 869 919 855 792 728 665 638 612 585 558 598 637 677 716
-404 716 719 722 725 728 723 718 714 709 682 656 710 763 760 757 754 751 737 724 711 698 647 596 678 761 768 775 783 790 807 824 841 857 869 881 813 744 749 753 758 762 743 724 706 687 638
-409 638 590 622 653 690 727 683 640 691 742 713 684 650 616 662 708 692 676 660 644 621 598 575 553 555 558 641 724 750 776 802 828 872 916 826 657
-413 657 574 625 721 736 730 723 792 860 812 763 795 827 774 721 749 776 787 798 808 819 747 676 604 532 584 636 688 739 769 799 829 858 848 838 889 941
-418 941 948 875 807 739 723 706 690 674 695 717 738 760 688 616 592 649 686 724 727 729 717 705 692 680 697 714 731 748 814 880 987 1013 933 774 676
-422 676 659 725 790 856 922 986 970 906 841 848 855 861 868 866 863 861 859 847 835 806 697 633 650 736 823 805 786 856 926 930 854 788 722 663 683 747 811 796 701
-427 701 668 714 807 821 769 717 660 683 749 815 843 790 716 643 651 659 633 606 543 559 624 689 668 647 714 781 839 817 800 783 748 713 633 633 651 670
-431 670 693 717 692 667 682 697 716 735 666 597 564 612 676 741 733 646 558 551 588 625 667 709 751 793 835 877 861 845 828 812 786 759 733 707 691 675
-436 675 659 643 701 759 818 876 830 783 753 803 884 884 814 744 738 732 725 719 725 730 735 741 741 742 778 813 872 851 808 766 745 725 705 685 677 669 662 654 669 684 699 714
-441 714 715 716 716 717 724 731 675 620 608 675 698 721 725 729 734 738 729 720 671 622 593 563 649 735 820 824 759 694 677 741 804 787 776 766 750 734 706 677 649 621 665
-446 665 709 748 787 812 756 678 600 565 530 562 593 720 847 878 828 776 804 875 946 919 892 865 838 815 793 811 829 821 813 880 947 970 913 826 739
-450 739 703 747 826 905 905 905 864 824 808 792 775 759 704 648 673 698 646 594 625 736 793 769 715 662 668 674 680 686 704 722 740 758 716 675 588 582 589 596 608
-455 608 620 697 774 770 767 802 836 836 755 680 605 570 535 526 596 702 808 804 799 795 791 810 829 848 866 906 946 905 865 829 794 838 883 823 764 735 785 807
-459 807 748 614 561 651 742 797 852 810 768 726 683 749 814 799 785 801 817 793 769 713 656 605 554 558 643 727 732 724 717 784 851 799 746 724 781 828
-464 828 796 733 670 662 655 647 639 661 682 704 725 692 658 699 741 756 692 627 643 688 733 709 684 665 726 787 768 723 678 708 738 779 820 822 823 804 784 765
-469 765 746 763 780 717 654 627 599 611 623 545 466 427 389 443 497 551 605 634 664 734 804 756 708 695 763 830 898 890 883 846 809 807 806 823 760 697 714
-473 714 776 838 825 812 858 904 911 917 855 792 735 678 724 851 937 943 882 822 836 851 787 724 655 667 693 720 711 703 675 648 695 742 797 772 712 652 685
-478 685 717 675 633 644 736 752 688 575 542 592 643 668 694 719 744 781 817 853 890 856 822 788 755 685 615 545 475 494 513 572 632 696 760 744
-482 744 729 688 647 601 635 713 790 792 794 823 852 841 829 778 726 630 613 741 869 895 787 698 689 706 723 719 714 710 705 748 791 833 876 776 677 613
-486 613 629 671 714 681 648 671 693 716 738 744 750 676 602 651 701 720 659 598 617 719 821 841 861 841 820 821 821 822 823 826 829 832 835 865 895 844 794 758 722
-491 722 766 810 856 902 953 924 844 764 684 604 613 703 792 802 719 637 584 612 671 730 719 708 687 746 805 784 733 682 627 571 578 585 672 758 788 818
-495 818 808 798 761 723 686 648 695 742 709 676 644 612 625 638 602 647 775 903 930 877 829 781 738 696 693 690 700 711 721 732 756 781 725 669 694
-500 694 720 785 850 851 852 778 704 672 721 800 878 900 841 748 654 658 662 706 750 744 738 807 876 939 922 816 711 728 746 763 781 790 799 808 817 800 783 766 750
-504 750 728 706 684 663 742 821 820 820 809 798 788 777 868 959 1015 992 883 774 695 696 763 830 798 633 508 516 628 740 723 706 719 812 889 885
-509 885 803 721 669 697 761 824 806 789 731 673 621 569 645 721 776 750 685 699 709 719 733 748 737 726 715 704 720 736 753 769 787 805 730 655 651
-513 651 648 738 828 806 783 721 658 687 717 746 775 733 692 743 795 808 820 740 659 673 688 769 850 846 841 797 753 748 744 739 734 745 756 700 644 621 598 615
-517 615 631 709 786 770 754 723 691 660 629 651 673 695 717 725 734 676 618 596 574 646 718 745 773 761 748 744 739 735 731 724 717 710 703 706 709 711 714 723 731 740 748 705 662 712
-523 712 763 777 791 806 820 769 718 667 616 580 544 574 605 636 668 633 597 629 660 652 643 695 746 837 929 851 774 702 630 660 770 836 901 879 856
-527 856 834 811 815 819 885 950 951 872 837 803 821 839 818 796 708 619 553 566 627 688 749 810 838 785 662 540 527 595 667 659 624 669 776 802 731
-531 731 660 699 738 759 700 685 671 678 686 694 701 750 800 782 765 757 749 808 867 836 806 837 869 866 784 701 699 735 771 807 843 885 846 764 682 694 787 879 891
-536 891 858 824 786 747 729 712 694 676 609 541 540 539 530 522 513 505 572 640 707 774 783 792 761 730 752 774 779 704 584 545 650 755 761 686 647 688 734 700
-541 700 667 713 767 740 643 546 575 604 633 662 695 727 760 793 763 732 702 671 672 672 673 673 664 654 645 635 645 656 666 676 686 696 706 716 710 705 699 693 658 622
-546 622 586 551 560 569 578 587 580 572 565 557 545 532 520 507 487 467 487 507 540 573 686 799 808 817 826 835 864 894 844 793 760 727 735 742 750 758 686 614 670 725 648 570
-551 570 560 550 620 690 754 818 802 786 723 659 636 612 600 587 655 722 712 703 693 684 781 878 896 913 854 796 738 679 649 619 669 719 762 804 767 729
-555 729 727 724 802 879 822 766 709 652 630 608 586 564 605 646 687 728 774 819 824 829 755 681 687 693 722 752 701 650 662 674 725 777 745 712 680 648 632 617
-560 617 602 587 551 515 612 709 731 752 734 715 722 730 737 744 699 653 687 721 716 710 704 699 732 766 719 672 658 644 630 616 669 722 734 747 691 635 660 684 745
-565 745 807 828 850 822 794 846 899 829 760 771 782 762 743 764 785 747 708 710 711 716 721 726 731 725 719 713 707 684 661 638 615 615 615 615 616 641 666 691 716 628 540 506
-570 506 605 729 773 791 808 844 880 836 792 785 778 772 765 762 758 715 672 636 601 700 798 823 848 832 817 805 793 741 689 674 658 643 627 673 718 764 809
-574 809 774 740 705 670 652 634 616 598 630 662 688 715 693 591 455 451 524 517 483 449 484 518 473 427 467 506 545 585 645 705 685 665 710 754 758
-579 758 763 807 851 855 860 840 820 800 780 807 835 782 730 671 612 634 655 699 743 746 750 716 681 647 612 552 491 564 638 690 742 714 686 729 771 813 855
-583 855 828 800 772 745 723 701 719 738 675 612 624 636 628 541 463 518 629 739 724 710 589 469 481 494 602 711 739 767 763 759 756 752 670 588
-587 588 587 585 695 804 834 864 834 804 693 583 630 676 688 699 714 808 893 844 719 595 605 694 765 836 832 829 780 731 762 793 803 814 824 835
-591 835 814 794 734 673 672 671 745 819 884 868 770 671 579 567 643 719 693 666 715 764 801 758 721 683 622 562 532 582 679 696 683 670 659 647 591 615
-596 615 635 656 601 547 551 555 634 713 758 724 655 585 598 610 622 635 673 711 750 788 780 772 765 757 790 823 816 809 762 716 745 774 807 761 715 749 877 1005
-600 1005 996 907 838 768 734 700 726 751 817 883 876 870 863 856 856 856 816 776 806 837 739 641 627 693 764 756 729 783 867 950 938 925 912 899 884 869 854 840
-605 840 808 777 826 874 944 1013 948 884 899 914 849 783 792 800 768 736 735 733 691 649 637 625 613 601 629 657 765 874 861 849 797 744 720 695 670 645
-610 645 674 703 731 760 812 865 917 969 871 774 676 579 632 685 699 712 666 620 654 688 707 726 705 684 686 688 690 692 736 780 745 709 733 756 779 803 758
-614 758 713 668 623 625 626 628 629 656 683 709 736 769 803 756 709 691 672 654 635 657 679 700 722 754 785 817 849 853 858 862 867 873 879 805 732 711 690 669 648 638
-619 638 628 658 688 715 742 689 636 616 595 615 634 652 670 648 626 586 546 639 732 756 780 724 668 696 724 712 700 727 754 700 567 466 499 585
-623 585 670 722 774 746 717 679 641 683 724 692 659 706 754 711 668 626 583 575 568 561 553 561 568 576 583 469 354 397 572 735 764 689 615 605 596 587 578 616
-628 616 654 613 571 592 613 594 575 602 630 738 845 817 789 720 652 657 661 706 751 690 629 649 668 622 576 570 564 604 643 683 723 695 667 639 612 654
-632 654 697 740 782 856 931 1000 936 797 658 698 738 758 777 757 737 745 754 723 691 681 670 700 729 757 784 811 838 734 629 658 687 653 620 653
-636 653 685 683 681 679 677 707 736 672 608 605 602 665 729 733 738 783 827 780 733 780 826 848 869 825 780 761 743 725 706 722 737 753 768 714 659 605 550 606 663
-641 663 719 776 755 735 714 694 662 630 598 566 670 774 784 795 776 756 737 718 703 688 673 658 672 686 700 714 700 686 672 659 585 512 586 659
-645 659 673 687 702 716 703 689 676 662 661 661 660 659 625 591 597 604 594 584 508 432 452 472 585 699 735 772 662 552 505 458 532 605 632 659 725 792
-650 792 845 898 884 870 862 854 806 758 791 823 856 888 845 803 760 718 731 744 819 894 925 875 756 636 643 730 777 744 673 602 592 582 586 591 662 733
-654 733 747 762 776 790 775 760 745 729 761 792 730 668 609 549 557 564 585 605 626 646 651 656 661 666 660 655 650 645 669 694 718 743 798 853 788 724 703 682 661 640
-659 640 580 519 553 586 583 579 536 493 472 451 470 489 491 493 494 496 536 577 618 658 646 634 622 610 598 586 573 561 541 520 499 478 494 510 526 542 537 532 527
-664 527 522 558 594 629 665 639 613 653 693 750 807 798 788 734 680 628 577 617 697 738 699 615 611 704 797 825 853 881 909 871 833 796 758 767 776 718 660
-668 660 651 642 770 898 899 741 622 664 712 761 819 877 887 897 813 730 691 652 613 574 560 546 626 705 707 708 710 712 697 683 602 521 576 631 646 661
-673 661 692 723 715 706 641 575 603 631 674 717 640 563 567 571 616 660 703 746 722 698 632 567 622 677 633 589 544 500 544 588 671 755 851 948 924 900 831
-677 831 761 759 756 706 656 699 742 757 771 785 800 747 695 682 670 673 677 680 683 691 700 708 716 723 730 777 823 831 839 846 854 817 780 743 706 672 638 698 758 800 842 764 686
-682 686 652 617 623 628 649 669 729 789 769 748 727 707 663 619 615 611 688 765 802 839 777 716 719 722 707 652 663 755 811 788 724 740 806 792 685 579 556
-687 556 612 646 640 601 562 563 645 734 744 714 724 807 889 905 921 861 761 677 672 740 769 732 694 728 762 729 696 645 593 582 571 617 664 644 624 600
-691 600 577 620 663 719 775 737 699 746 793 795 716 661 646 671 695 732 768 804 840 771 702 672 643 598 553 524 576 671 687 661 675 719 723 637 551 511
-696 511 552 588 624 644 664 595 527 516 585 633 642 650 698 743 749 695 641 622 603 614 585 533 562 630 699 692 686 701 716 731 747 744 742 739 736 779 821 784 746
-700 746 718 690 662 633 610 587 643 700 682 663 725 787 805 823 761 699 729 758 707 656 587 518 582 646 658 670 682 694 747 800 774 747 690 633 656
-705 656 679 690 702 713 724 758 791 745 698 735 772 808 845 839 833 746 660 712 764 736 708 657 606 636 665 644 624 603 582 618 654 689 725 736 747 757
-709 757 768 737 706 756 805 919 1033 960 888 787 687 667 647 628 610 591 572 621 670 639 607 645 682 719 756 734 713 692 670 625 580 536 491
-713 491 521 552 582 613 643 673 704 734 718 701 684 667 696 724 752 781 774 768 681 594 585 575 565 555 539 523 640 757 702 648 593 539 527 516 505
-717 505 494 506 518 530 542 574 605 637 668 643 618 593 567 589 611 633 656 718 780 762 744 785 826 786 747 718 689 659 630 648 665 682 699 565
-722 565 430 429 428 461 493 525 558 600 643 605 567 578 590 601 612 550 487 505 523 595 668 740 813 768 724 760 795 771 746 721 696 727 757 787 818
-726 818 778 739 700 661 633 605 658 710 727 744 761 778 727 676 704 733 747 761 694 628 575 522 469 416 443 469 495 521 549 576 523 470 431 393 448
-730 448 503 548 594 600 605 538 471 550 629 612 595 618 640 727 814 807 800 718 637 595 553 584 615 687 758 746 734 721 709 718 727 736 745 796 847 805 763 784 805
-735 805 825 846 794 743 692 641 650 658 734 809 810 810 811 811 839 867 775 683 687 691 655 619 608 596 678 760 786 812 798 784 716 648 580 512 498 484 537 590 645
-740 645 701 609 518 526 534 547 560 609 739 837 801 709 697 725 753 727 702 676 651 602 554 598 643 663 684 704 725 697 669 601 533 563 593 623 653
-744 653 659 666 672 679 609 540 617 695 706 718 764 811 835 780 702 625 650 675 700 725 695 664 701 737 739 740 741 743 714 685 697 708 725 743 720 697 653 609 658
-749 658 707 652 596 607 618 613 608 619 711 744 698 581 464 416 367 385 404 370 337 400 544 675 726 733 741 708 676 638 601 614 546 479 492 589 685
-753 685 693 701 691 681 631 581 637 693 660 628 632 716 800 804 742 679 732 784 786 788 784 781 789 718 641 644 733 741 658 574 567 639 632 624 601 657 731 804 794 704 574
-758 574 524 573 623 712 802 823 764 665 646 709 772 746 720 734 748 723 697 703 709 725 661 535 488 538 589 566 542 519 496 549 601 574 547 527 508
-762 508 568 629 685 740 716 691 653 615 577 539 519 499 480 460 503 547 590 634 660 687 714 741 721 702 682 663 660 658 655 652 637 621 605 589 582 574 567 559 485
-767 485 410 468 527 606 684 683 681 636 591 545 500 526 552 659 765 707 648 670 692 656 621 586 551 548 544 541 538 564 591 618 644 695 746 797 847 880 912
-772 912 864 817 806 795 784 773 767 761 755 749 743 736 730 723 652 580 642 704 690 677 664 651 636 621 606 591 608 625 642 658 745 832 785 739 685 631 658 684 719
-776 719 753 788 823 878 934 856 778 748 719 769 820 859 899 859 818 771 724 677 630 612 594 575 557 574 591 608 625 581 538 575 612 640 669 697 726
-781 726 730 735 739 744 703 662 622 581 569 556 624 692 645 597 550 503 517 531 545 559 518 477 516 556 632 708 784 861 813 766 719 672 625 577 659 740 698
-785 698 576 503 565 631 696 771 845 821 796 692 588 637 686 655 624 657 689 722 754 779 804 829 854 836 818 799 781 768 755 743 730 680 631
-789 631 581 532 555 579 602 625 594 562 611 659 687 714 742 770 702 635 647 660 701 741 702 662 638 615 591 567 598 628 693 758 792 745 664 582 631
-794 631 681 690 699 663 626 590 553 576 599 621 644 650 656 662 668 659 650 640 631 627 624 660 697 761 824 760 695 681 748 814 800 772 744 716 688 667 726 820 914 861
-798 861 808 755 703 708 712 757 802 789 775 842 908 905 901 898 894 825 756 727 697 656 614 602 670 694 637 580 604 635 587 508 430 463 497 531 564 583 602 620
-803 620 639 580 522 418 395 460 526 557 587 666 745 789 753 741 729 787 845 789 654 563 606 737 787 758 728 703 678 613 548 580 612 565 517
-807 517 565 613 581 549 580 611 601 592 611 629 648 667 703 739 699 660 652 724 791 724 594 543 573 602 608 613 539 464 462 460 591 722 757 792 787 782 783 784
-812 784 744 705 665 625 625 624 674 724 734 744 725 707 728 750 745 740 814 889 850 811 771 732 734 737 739 741 741 741 741 741 686 632 618 603 591 578 645 712 725 738 671
-817 671 604 645 686 726 767 766 765 764 763 739 714 689 665 640 615 591 566 594 623 651 680 686 693 700 707 756 805 775 744 713 683 652 621 553 485 497 509 551 593
-822 593 555 517 541 565 590 614 625 636 646 657 692 727 628 530 573 616 589 562 486 569 643 716 706 696 686 676 695 714 733 752 780 807 835 862 708
-826 708 554 534 514 587 660 653 646 638 629 621 613 628 643 578 512 516 520 524 528 602 676 751 825 728 632 615 599 577 556 614 673 729 785 761 737 756 776 715 654
-831 654 607 559 592 624 617 610 602 595 625 655 684 714 750 787 743 700 610 521 511 502 546 590 634 678 694 710 726 742 728 714 700 686 658 630 601 573 575 577
-835 577 578 580 575 569 564 559 559 559 558 558 565 572 659 746 734 721 708 695 700 706 631 557 604 651 698 745 678 611 544 476 481 485 570 654 629 604 578 553 533 512 492 472 493
-840 493 515 536 558 556 554 553 551 585 619 654 688 724 760 716 672 615 558 501 444 465 486 508 529 571 613 655 697 713 728 664 599 592 586 659 732 666 599 607
-845 607 615 606 517 472 561 682 722 683 644 679 715 670 626 628 630 633 635 657 680 702 724 718 712 706 700 684 668 571 475 473 472 470 469 464 458 453 448 492 537 582 626 608 591
-850 591 573 555 627 699 771 844 794 744 694 644 680 715 750 786 795 804 733 662 667 673 652 551 463 509 608 707 711 716 720 724 690 655 621 587 494 402 442 483
-855 483 537 591 646 700 675 649 624 599 622 644 600 555 589 622 562 502 512 522 599 676 602 527 519 511 594 677 640 603 614 626 570 515 537 558 620 682
-859 682 690 699 747 795 843 891 872 853 824 795 766 737 708 680 651 622 623 625 626 627 621 615 609 603 647 691 735 779 784 788 793 797 775 753 771 789 813 837 794 751 683 614
-865 614 585 557 594 631 668 706 722 739 755 771 792 813 833 854 825 797 768 739 794 849 810 772 752 733 673 614 660 707 713 640 615 724 833 809
-869 809 716 703 757 810 717 624 652 679 675 672 669 666 670 675 679 683 694 705 715 726 759 791 757 722 761 801 747 692 637 581 525 469 486 503 520 537 564 591 578
-873 578 565 548 531 581 630 622 614 606 598 552 506 554 601 525 448 464 481 548 616 643 671 753 836 825 814 730 646 628 611 569 528 553 578 614 649 685 720
-878 720 677 633 710 786 790 795 706 617 613 610 607 604 662 720 712 703 659 614 637 659 716 774 738 702 673 644 614 585 614 643 671 700 656 611 660 708 674 639 644
-883 644 650 612 574 602 631 677 723 676 629 564 500 502 504 502 500 498 496 528 560 593 625 629 633 637 641 645 649 653 658 690 723 755 788 770 753 735 718 693 667 642 617 580
-888 580 543 506 469 479 488 578 668 669 670 671 672 696 720 743 767 755 743 691 638 598 558 598 637 716 795 688 580 565 551 617 682 734 785 757 728 744
-892 744 761 737 713 710 706 702 699 675 652 669 686 603 521 518 516 555 595 500 406 429 452 555 657 648 639 709 780 742 704 707 709 727 745 723 701 600 498 529
-897 529 560 559 558 556 555 622 688 675 662 697 731 641 550 498 578 669 679 666 653 635 617 585 553 601 649 645 641 718 794 719 644 649 655 695 735 735 736 696 656 656
-902 656 657 604 551 578 605 600 595 589 584 577 570 563 556 564 572 580 588 513 439 445 450 564 678 712 746 706 666 706 746 788 831 833 835 786 737 687 638 651 665 758 851 817
-907 817 782 747 713 636 560 617 674 717 759 668 577 541 505 470 434 504 574 564 553 550 547 543 540 497 453 490 527 575 623 672 720 671 621 572 522 511 500
-912 500 569 718 831 810 735 661 662 662 663 663 688 713 737 762 748 734 640 547 560 574 587 601 623 645 747 849 845 842 758 674 640 607 573 539 563 586
-916 586 610 634 652 671 689 708 633 557 487 550 636 722 737 752 744 736 648 560 555 550 546 541 578 615 652 689 708 727 745 764 695 626 638 649 700 752 669 587
-921 587 600 613 626 639 637 635 713 791 810 829 768 707 681 655 669 683 640 598 516 433 460 486 472 458 501 543 546 549 573 598 542 486 527 569 610 651 650
-925 650 650 649 648 654 660 666 672 591 510 509 508 569 629 609 589 645 702 679 655 622 589 636 683 702 721 659 598 617 636 655 675 652 629 607 584 578 572 567 561 564 567 611
-930 611 654 707 759 732 704 668 633 557 481 444 407 450 493 473 454 434 415 493 571 569 568 486 404 455 507 509 511 514 516 476 437 477 518 566 615 583 551 539
-935 539 528 516 504 540 577 613 649 609 569 528 488 510 533 556 578 577 577 576 575 568 560 553 545 577 609 645 602 547 491 511 531 531 532 532 533 470 407 380 432 472 512
-940 512 477 441 447 452 498 543 516 489 537 585 618 570 523 555 629 704 649 595 629 663 667 591 515 520 603 686 659 552 485 498 531 563 521 479 492 506
-944 506 559 612 563 514 500 565 658 750 768 785 808 830 772 715 689 664 638 613 623 633 604 574 560 546 460 374 357 473 559 565 531 497 543 509 452
-949 452 395 467 539 554 570 585 600 649 698 613 528 524 520 516 513 625 738 846 821 711 602 565 527 505 482 540 598 583 569 554 540 547 554 561 568 580
-953 580 593 605 617 602 588 653 719 713 707 621 536 550 564 578 592 608 624 640 656 623 591 558 525 479 433 521 609 671 734 716 698 724 749 695 640 631
-957 631 621 692 763 755 748 741 733 726 719 712 704 667 629 591 553 492 431 450 469 437 405 453 501 598 694 710 727 760 793 826 858 843 828 732 636 549 461 507 553
-962 553 562 571 580 590 618 646 674 702 698 695 691 688 630 572 594 617 649 681 634 586 582 578 574 570 572 573 574 575 571 566 556 547 570 514 427 341 353 446 493 541 513 486 533 581
-968 581 615 570 524 559 630 701 697 693 657 621 539 538 570 602 639 676 688 699 661 702 797 812 696 579 511 524 566 608 651 613 541 468 555 641 600
-972 600 558 531 584 673 761 792 824 727 629 587 625 698 771 793 814 756 697 705 713 721 729 714 698 682 667 656 645 634 624 622 621 619 617 621 624 627 631 657 684 680 597
-977 597 488 460 509 559 619 599 549 499 515 612 663 715 718 722 725 729 707 686 669 653 583 593 638 683 660 637 614 590 554 518 610 702 708 633 558 564 626
-981 626 688 675 662 631 600 524 527 600 672 714 677 659 641 664 606 556 505 530 555 563 571 579 587 532 476 455 514 580 646 761 797 724 652 609 646 722 797
-986 797 795 712 603 574 628 683 664 645 626 607 571 535 580 624 640 656 672 688 669 650 631 613 624 635 647 658 641 624 607 590 644 699 749 798 798
-990 798 717 601 486 441 397 433 469 525 581 631 682 676 590 504 497 608 718 700 682 637 592 547 502 553 604 574 545 551 556 562 567 610 652 739 746 690
-995 690 633 652 671 651 631 611 591 591 591 591 591 545 500 534 569 575 581 588 594 621 648 676 703 595 487 459 432 456 480 505 529 558 588 617 646 651 657 662 667 627
-999 627 587 627 668 670 672 674 677 640 604 568 532 536 539 542 546 549 553 556 560 582 603 625 646 658 670 681 693 696 698 701 704 663 622 581 541 534 527 520 514 528 543 558 573 632 690
-1005 690 616 541 565 588 612 635 676 717 758 799 779 758 737 716 642 568 627 686 662 637 613 589 677 765 719 674 642 610 578 546 576 607 557 507
-1009 507 474 441 488 535 583 632 681 729 778 826 795 763 717 672 626 580 642 704 691 678 581 565 571 577 568 560 551 543 502 461 421 380 348 316 377 438 486
-1014 486 535 544 553 560 567 536 506 541 617 677 658 605 592 592 592 552 512 564 657 728 718 692 705 762 779 754 729 702 675 607 540 480 419 452 486 556 627
-1018 627 657 688 664 640 616 592 575 559 542 526 487 449 410 371 435 498 523 549 571 633 656 599 503 488 589 650 586 482 465 581 664 668 631
-1022 631 595 589 584 617 691 779 787 749 711 727 742 688 553 473 473 512 511 445 379 408 516 572 548 488 467 533 640 705 690 685 681 709 737 676 576 492
-1027 492 489 511 533 520 507 535 563 591 620 626 633 573 513 582 652 721 791 740 688 637 585 584 584 583 582 593 605 617 628 606 585 496 408 443 478 579 681
-1031 681 671 661 651 641 586 530 474 418 451 484 521 559 576 673 800 793 701 608 654 700 660 620 620 700 745 657 555 454 428 403 444 485 488 491 494
-1035 494 497 505 512 519 526 546 565 584 603 592 581 570 560 543 527 511 495 535 576 616 657 619 581 543 505 522 538 554 571 569 567 632 697 688 679 670 661 657 653 649 646 642
-1040 642 638 634 630 641 651 662 672 683 693 704 714 688 661 634 608 611 614 618 621 597 573 549 525 556 587 617 648 695 741 654 567 591 616 641 665 667 669 671 672 616
-1045 616 559 503 446 438 430 502 575 634 694 674 653 640 627 573 520 598 676 715 753 785 816 768 719 677 634 592 549 572 595 617 640 538 435 467
-1050 467 498 517 536 555 574 605 637 628 620 594 569 624 678 691 704 677 650 609 568 528 487 498 509 600 690 651 611 611 612 618 624 630 636 620 604 588 572 580 589
-1054 589 517 445 442 439 476 514 533 551 650 749 701 652 563 474 453 432 491 550 611 671 652 633 672 711 709 708 674 640 646 653 629 606 623 640 728 815 823 831
-1059 831 830 829 748 668 620 573 565 558 575 593 571 548 562 575 589 602 587 571 636 700 746 792 758 724 686 648 650 652 646 640 714 788 806 824 709 594 539
-1063 539 484 563 642 622 602 583 563 586 608 551 494 458 423 521 619 688 758 748 738 747 756 725 694 726 757 789 820 764 708 652 596 523 450 457 464 527
-1068 527 590 613 635 693 750 674 517 409 433 511 589 620 650 681 711 691 671 650 630 654 677 661 644 610 576 622 668 693 717 662 607 511 415
-1072 415 497 579 627 541 445 429 484 539 599 659 642 626 610 594 577 561 545 528 539 550 561 571 537 503 549 595 611 627 643 659 738 817 763 709
-1076 709 709 708 708 707 698 689 685 681 658 714 770 747 664 582 575 568 552 536 519 503 515 527 539 551 554 558 561 564 615 666 677 688 712 736 725 634 553 471 521 651 767
-1081 767 802 754 707 643 579 595 612 624 637 610 582 627 672 638 523 488 587 731 795 744 693 712 731 732 653 574 575 669 764 780 716 662 688 743
-1085 743 799 845 890 853 735 583 512 577 642 683 724 725 726 646 567 567 568 553 539 564 590 549 508 502 576 630 683 702 721 794 866 903 860 757 653
-1090 653 598 676 777 799 692 585 551 597 599 600 593 585 578 570 575 581 596 531 476 501 655 808 786 630 549 602 718 754 711 667 691 715 699 683 614
-1094 614 546 478 410 464 519 573 628 661 695 649 602 601 599 598 596 594 592 589 587 630 672 680 607 555 503 525 548 585 621 618 615 609 603 677 751 750 748 707 666 717 768 814
-1099 814 860 804 667 535 484 490 576 622 668 699 730 686 643 572 581 625 669 671 673 675 676 606 535 504 474 529 585 610 555 477 479 511 544 531 518 585 652
-1103 652 694 735 697 658 649 639 590 540 510 481 456 431 418 486 559 552 452 433 498 562 521 481 520 559 553 546 540 533 542 550 559 567 546 526 505 485 502 520 538
-1108 538 556 573 590 536 481 449 549 700 771 731 690 725 759 731 702 673 645 633 621 610 598 623 648 673 698 713 728 743 758 715 671 628 585
-1112 585 569 554 619 684 686 688 725 763 748 653 633 693 710 646 548 530 569 609 653 698 721 744 726 709 726 743 679 616 641 666 651 636 644 651 659 667 674 682
-1117 682 690 698 632 565 494 503 591 678 735 713 654 596 572 549 479 410 424 518 598 598 568 538 556 575 593 611 618 625 632 639 598 558 557 557 629 701 690 599 505
-1122 505 492 508 524 482 440 481 602 655 628 611 594 568 542 507 551 612 593 499 485 605 724 761 717 670 623 570 518 519 520 601 682 735 788 761
-1126 761 735 723 711 740 768 689 611 568 604 627 650 637 625 587 549 466 462 569 675 697 640 590 540 526 511 488 465 397 410 481 552 549 545 551 556 562
-1130 562 567 551 535 519 503 529 555 581 607 603 599 640 601 532 464 471 478 464 451 513 575 558 461 364 348 423 497 572 647 626 524 392 393 476 558 515
-1135 515 473 492 510 569 628 651 674 617 560 565 570 575 580 564 547 531 514 543 573 602 631 619 606 594 582 661 740 740 739 700 661 622 582 602 622 642 662
-1139 662 624 587 629 672 666 660 614 569 550 532 514 496 532 569 605 641 648 654 661 667 673 680 686 692 681 671 661 650 616 583 549 516 544 572 520 468 452 436 419
-1144 419 403 410 416 420 424 443 422 341 340 452 604 655 625 605 665 723 700 639 618 650 682 677 673 628 584 590 596 602 609 600 592 584 576 629 682 701 639 563 487 489 490 569
-1149 569 689 753 737 677 656 636 576 539 581 661 661 581 502 497 493 530 567 564 562 499 437 454 472 542 612 602 592 535 478 495 513 561 529 461 394 441
-1153 441 488 534 581 609 637 589 542 532 602 637 592 519 527 564 602 535 468 482 495 583 672 725 698 634 569 579 590 528 467 486 504 516 527 589 571
-1158 571 467 444 552 660 649 557 540 603 652 620 633 646 631 535 440 424 436 447 463 479 490 500 511 521 522 522 523 523 512 501 490 479 484 490 495 501 545
-1162 545 589 633 677 694 710 727 743 677 611 586 560 538 516 569 623 699 696 657 618 611 603 555 508 523 539 555 570 577 583 510 436 427 417 483 549 599 570
-1167 570 535 581 638 615 562 509 521 533 505 477 551 625 628 552 536 599 658 637 603 570 537 504 522 621 674 728 710 691 673 655 630 604 578 553 557
-1171 557 561 606 650 628 607 652 697 742 787 739 691 666 640 615 589 515 441 463 566 614 581 532 483 519 555 591 627 670 713 640 568 524 560 551 542
-1175 542 567 593 618 643 592 541 495 449 365 361 432 502 482 461 461 542 603 664 663 662 582 502 492 561 646 651 586 521 521 521 561 601 601 601 601 601 613 625 637 649
-1180 649 661 673 680 687 689 611 503 528 638 748 745 743 734 725 716 707 745 784 729 674 628 581 575 569 647 726 681 557 441 406 392 379 452 605 673 608 481
-1185 481 434 428 421 419 417 481 545 509 473 436 400 467 534 601 668 735 802 848 813 746 679 678 678 647 696 789 882 862 762 707 652 614 577 579 581 531 480 497
-1189 497 513 538 562 546 531 552 573 594 615 627 638 650 662 681 700 719 738 701 664 697 809 900 910 850 790 699 608 633 657 688 640 587 613 687
-1194 687 682 659 636 704 771 719 666 650 633 617 600 613 626 639 652 668 684 696 707 730 672 614 636 686 736 649 562 535 589 683 697 663 629 705 781
-1198 781 838 814 769 724 698 672 646 620 613 606 599 592 548 504 460 416 469 522 575 628 594 561 527 494 476 457 439 420 434 448 542 636 642 648 573 499 554
-1202 554 608 583 557 558 558 599 639 530 422 446 471 496 520 505 490 539 589 638 688 671 655 638 622 620 617 615 612 593 574 555 536 612 687 763 838 727
-1207 727 616 584 553 598 642 606 570 625 681 696 711 727 743 678 614 578 541 504 468 561 655 669 682 706 731 675 619 647 674 661 648 641 633 665 698
-1211 698 664 631 597 564 563 562 561 560 634 708 782 856 805 753 661 569 574 579 504 429 405 382 398 415 469 524 498 473 485 497 509 521 544 567 590 613 613 613
-1216 613 613 613 644 676 708 740 742 744 746 748 769 790 812 833 778 722 667 612 617 621 626 631 635 639 683 728 648 567 567 567 516 466 415 364 437 511 451 391 421 450 519
-1221 519 589 592 595 598 601 590 579 568 557 572 586 601 616 598 580 563 545 528 511 454 397 389 381 454 526 587 648 629 610 577 545 512 480 563 647 730 814
-1225 814 810 807 723 640 581 523 544 566 583 600 578 555 558 561 564 567 617 668 638 609 537 465 473 481 586 691 716 741 615 489 443 397 458 519 580 641
-1230 641 628 615 602 589 557 525 493 461 508 556 563 570 610 649 658 587 549 591 669 666 644 622 720 738 639 541 526 591 610 629 612 596 622 647 672 697
-1234 697 655 613 651 688 721 753 785 817 813 809 799 790 839 808 693 579 525 551 661 771 777 703 588 554 615 676 702 728 685 642 679 716 718 720 681
-1238 681 643 644 644 645 645 623 601 579 557 594 631 668 705 650 596 621 646 649 651 609 646 678 710 707 703 743 783 690 597 504 411 359 306 357 407 462 437 438 440
-1243 440 487 454 382 390 482 574 556 537 514 571 591 611 596 580 627 674 765 777 667 557 525 574 643 632 632 631 628 624 621 618 662 706 670 634 657 679 626
-1248 626 574 562 630 738 766 707 647 583 518 591 664 702 660 577 494 535 576 616 577 503 428 459 490 521 552 539 527 519 512 434 436 526 616 614 612 645
-1252 645 678 699 641 583 605 684 764 813 782 672 562 481 481 521 560 477 393 395 476 517 559 589 700 851 921 824 727 706 684 645 605 521 517 530
-1256 530 542 560 578 598 618 637 657 723 788 721 653 621 588 636 683 689 695 626 557 500 523 629 735 770 726 646 566 560 554 547 541 527 514 575 636 638 559
-1261 559 480 481 516 550 510 469 461 453 485 517 517 517 517 518 490 463 516 569 584 599 535 470 453 436 459 482 464 447 430 412 417 422 427 432 473 515 556 597 591 585 659
-1266 659 733 736 740 703 666 635 603 572 540 598 656 674 692 672 652 553 453 428 403 511 619 688 756 745 733 672 611 631 650 653 656 658 661 686 711 736
-1270 736 761 763 766 768 771 743 714 646 577 696 814 799 784 743 702 701 700 644 587 610 633 631 629 626 624 574 524 554 584 586 588 630 672 659 647 594 541 550 559 569
-1275 569 578 613 648 684 719 758 797 756 715 654 594 574 553 503 453 483 513 562 612 662 712 668 624 621 617 572 528 562 676 754 672 551 431 407
-1279 407 383 440 496 533 570 527 484 421 358 375 392 421 451 400 349 438 527 535 544 582 620 618 615 568 521 554 586 553 519 525 532 511 489 468 447 501 555
-1284 555 610 664 658 652 646 640 665 689 713 738 703 668 593 518 471 424 458 491 517 542 488 433 515 596 602 609 621 713 810 747 617 486 479 472 456 440 504
-1288 504 568 586 604 622 640 672 704 656 607 659 710 722 733 669 604 580 555 530 506 521 537 584 632 600 568 631 693 716 739 719 699 599 499
-1292 499 470 441 545 650 678 706 602 497 519 542 605 668 637 606 641 676 669 661 613 565 604 643 615 587 552 516 573 631 604 578 511 444 511
-1296 511 577 644 710 700 689 745 802 723 645 566 488 517 546 575 604 576 548 520 493 502 511 520 529 525 521 518 514 540 566 593 619 664 709 754 798 753 708 663
-1301 663 618 589 561 532 504 502 500 458 417 426 434 510 586 638 690 702 715 662 610 624 638 641 643 606 568 619 671 655 640 625 611 596 582 535 488 481 474 525
-1306 525 577 561 546 561 576 590 605 582 558 534 511 486 461 475 490 499 508 451 393 433 472 552 631 672 712 686 659 605 550 500 450 466 561 657 672
-1310 672 592 511 421 410 467 524 565 525 506 486 555 624 642 660 639 617 597 577 558 538 516 494 472 450 494 539 584 628 612 596 579 563 558 552 582
-1314 582 611 633 575 501 426 395 444 488 531 556 581 606 630 625 619 654 688 729 770 718 666 640 614 589 563 570 578 586 593 621 648 608 569 505 441 474 587
-1319 587 675 683 621 559 550 540 530 521 587 654 624 514 420 406 483 561 650 660 594 528 491 453 456 459 519 580 619 578 540 502 499 497 513 530 507 483 524
-1323 524 565 606 647 680 713 729 666 540 495 546 597 570 542 514 486 554 622 610 597 531 465 479 492 513 533 594 654 622 590 599 607 627 648 629 609
-1327 609 601 592 584 575 554 533 512 491 543 595 647 699 658 618 657 697 643 589 575 561 584 607 590 572 603 634 585 535 516 497 518 538 580 621 663 705
-1332 705 695 684 674 664 594 524 494 464 528 592 576 560 450 339 272 365 478 591 580 570 630 690 616 543 533 523 593 663 602 541 559 578
-1336 578 584 591 557 523 512 501 409 318 404 490 497 503 497 490 484 478 462 447 471 496 537 579 540 501 448 395 423 450 494 538 582 626 609 592 541 489 399 390 469
-1341 469 548 551 554 512 550 618 685 674 583 471 438 489 540 573 607 561 514 528 543 597 651 661 671 726 701 619 536 582 628 602 575 549 522 482 441
-1345 441 396 430 462 493 454 416 419 503 587 591 444 297 305 447 619 710 714 637 596 556 590 625 600 575 515 456 426 476 561 647 633 619 605 591
-1349 591 611 630 650 670 595 520 519 519 519 438 403 367 404 440 471 502 545 508 391 354 449 545 605 666 754 843 843 763 701 640 578 516 495 555 579 523
-1353 523 460 477 523 570 566 563 604 565 526 487 524 560 532 504 556 608 631 654 637 620 609 598 668 738 709 681 653 625 576 527 478 429 496 564 632
-1358 632 699 690 680 670 660 653 646 639 631 618 604 630 657 611 564 598 632 637 642 718 795 807 685 593 581 661 742 694 646 643 640 677 714 677 640 644 647 553 459
-1362 459 405 351 343 336 454 571 633 561 480 478 520 563 570 577 630 683 736 789 776 762 788 815 812 809 726 643 569 495 501 507 607 706 726 745 673 602 663
-1367 663 725 757 788 740 692 614 535 537 539 529 520 550 580 576 571 526 482 517 553 548 544 502 460 458 457 469 482 454 426 418 409 401 393 447 501 635 769 739 708 672
-1372 672 636 622 528 479 564 680 716 672 628 595 561 568 575 638 700 576 452 388 325 395 465 471 476 353 230 298 445 542 506 421 336 323 310
-1376 310 291 273 335 397 432 467 502 538 561 585 528 472 506 541 495 450 515 579 644 709 652 596 539 483 498 514 609 704 690 676 662 649 609 569
-1380 569 569 570 604 639 540 441 475 509 543 577 495 413 412 410 492 574 575 577 579 581 583 586 549 513 557 601 616 631 566 501 579 658 656 654 533 411 370 328 398
-1385 398 469 459 449 453 458 462 466 465 465 464 463 494 525 555 586 556 526 496 466 484 503 561 620 584 548 579 610 576 542 548 554 574 593 572 552 652 752 732
-1389 732 712 720 729 670 612 582 552 562 572 619 666 713 759 700 642 583 524 509 494 480 465 522 578 542 505 522 540 624 708 745 781 751 721 690 658
-1394 658 626 595 556 518 479 441 465 490 515 540 557 574 592 609 598 586 615 644 643 641 547 452 436 419 403 386 428 469 510 552 571 591 517 443 402
-1398 402 361 467 573 554 535 516 497 440 383 325 268 307 346 385 424 474 524 454 384 395 405 481 558 520 482 444 406 435 465 494 524 545 567
-1402 567 588 610 575 541 507 472 523 574 531 488 470 451 393 334 292 250 301 352 363 374 452 530 591 652 646 641 557 473 456 439 541 643 652 660 633
-1406 633 606 579 552 510 469 495 521 532 543 555 566 598 629 661 692 632 571 578 584 553 523 532 542 586 630 555 479 460 440 461 482 476 469 503 537 507 476
-1411 476 485 494 588 682 656 630 659 687 622 557 528 500 592 683 632 581 570 558 601 643 645 647 664 681 631 581 538 496 520 544 515 486 457 428 480 532
-1415 532 518 503 502 501 541 580 617 655 652 650 610 571 571 572 632 693 665 637 673 789 868 813 717 621 610 599 604 610 553 497 479 542 605 587 527 466 542 618
-1420 618 682 665 601 536 499 463 467 471 536 602 600 599 585 571 597 623 676 729 716 703 649 595 545 496 557 697 752 674 533 472 505 537 500 462 491
-1424 491 520 495 470 440 490 496 503 474 446 476 505 495 485 451 417 383 350 373 397 420 444 450 457 464 471 463 456 449 441 525 610 699 708 643 578 575 571 595 619 582 544
-1429 544 522 580 638 615 530 444 447 450 474 499 523 547 518 489 460 431 394 357 386 415 429 442 394 346 312 357 478 599 610 620 631 642 646 651 650 650
-1434 650 658 587 515 524 565 605 584 563 597 631 545 458 455 452 453 455 491 606 661 635 562 569 593 617 604 591 578 566 570 575 579 584 578 573 567 562 547 532 517 502 544
-1439 544 585 587 589 561 532 571 609 544 479 481 483 460 438 437 516 591 666 680 693 630 566 503 440 465 490 515 540 535 530 458 386 422 458 494 530 541 552 564
-1443 564 575 598 621 577 533 532 531 496 460 484 588 657 646 585 603 664 726 643 559 546 613 642 591 506 500 580 661 706 751 700 649 598 547 537 527
-1448 527 516 506 526 545 565 584 563 542 520 499 562 625 672 639 610 662 770 798 775 671 563 534 584 634 649 663 630 597 644 691 669 648 586
-1452 586 525 520 515 511 506 533 560 631 623 604 584 599 614 574 535 575 615 616 617 607 678 763 768 695 621 567 593 620 566 485 405 399 394 411 429 446 464 456 448 441 433
-1457 433 482 531 580 628 669 709 666 543 459 455 583 710 796 802 773 744 704 664 624 584 553 522 567 611 592 492 428 444 521 517 484 451 525 600
-1461 600 595 589 575 562 588 614 648 683 677 671 634 597 526 454 403 432 497 561 613 664 636 607 522 436 439 522 574 627 605 582 575 567 559 552 513 474 516 557 506
-1466 506 455 443 432 516 600 603 607 629 651 633 615 596 577 518 459 454 448 482 516 561 606 692 777 797 818 759 699 672 645 699 752 733 714 696 677 663
-1470 663 650 636 623 627 631 636 640 620 599 579 558 551 543 616 688 705 723 660 597 647 697 667 636 616 596 575 555 546 536 527 518 503 489 475 460 539 618 617 616 603
-1475 603 590 577 564 598 631 665 698 662 625 589 552 528 504 479 455 506 557 474 391 419 446 473 500 486 472 538 605 577 550 563 575 617 659 514
-1479 514 369 322 275 308 341 396 452 507 563 573 583 633 683 611 538 546 553 618 683 668 653 539 424 443 463 458 454 490 526 501 477 493 509 531 553
-1483 553 576 598 586 574 562 551 575 599 623 647 632 618 604 589 547 505 543 581 597 613 630 646 619 592 566 539 578 618 577 536 569 602 596 589 493
-1488 493 397 435 472 549 625 569 512 493 474 536 597 614 630 647 663 693 722 672 621 652 683 714 745 721 697 673 649 639 629 619 609 549 489 509
-1492 509 529 578 626 594 562 507 452 477 502 552 602 573 543 565 586 567 548 593 638 603 568 586 603 621 638 619 600 581 562 567 571 576 580 584 589 593 597 572
-1496 572 546 521 495 512 529 546 563 505 448 470 492 515 538 561 584 548 513 477 442 466 490 514 538 578 619 659 700 714 728 742 756 698 639 714
-1500 714 789 703 616 569 523 485 448 450 453 431 409 428 446 480 514 588 662 686 710 655 599 609 619 629 639 685 731 697 663 544 424 491 558 616
-1505 616 673 690 708 721 734 667 600 607 613 620 626 566 506 526 545 515 485 455 425 430 435 440 445 482 519 556 593 645 697 669 641 627 614 600 587 578 570 562 553 530
-1510 530 507 484 461 501 541 582 622 660 699 737 775 723 670 658 645 650 655 580 505 521 537 552 568 572 575 579 583 543 503 463 423 463 504 544 584 624 664
-1514 664 704 744 695 646 597 548 556 563 571 579 562 545 528 511 530 550 570 589 606 623 639 656 668 680 611 543 554 565 576 587 661 735 730 724 754 785 815
-1519 815 846 736 626 596 567 568 568 569 570 593 615 638 660 620 580 540 500 539 577 616 654 731 808 804 801 800 798 796 795 770 745 720 695 662 629 676 722 695
-1523 695 668 640 613 691 768 766 763 742 721 780 838 745 652 639 626 611 596 580 565 544 524 503 483 526 568 611 654 642 629 617 605 624 644 583 522
-1527 522 563 605 646 687 708 730 752 773 750 726 703 679 629 578 607 637 621 605 589 574 565 556 548 539 561 582 603 625 597 569 541 513 541 570 599 628
-1532 628 657 686 715 744 696 649 601 553 579 605 630 656 671 687 702 718 713 708 703 699 739 779 739 699 662 625 587 550 603 656 629 602 613 624 634 645
$$ [...]
##$OBSERVED INTEGRALS=	(X Y Z)
(7.1868306335254059647, 7.2397027839712286834, 1)
(6.8965144619865190734, 7.0983899455069359163, 3.1719955581668122235)
##END=	
##END=	
##END=	
