##TITLE=	(1) Feb27-2020.390.fid
PTC01

(2) Feb27-2020.390.fid
PTC01
##JCAMP-DX=	6.0	$$ MestReNova 14.1.0-24037
##DATA TYPE=	LINK
##BLOCK_ID=	1
##BLOCKS=	2    
##ORIGIN=	Mestrelab Research S.L.
##OWNER=	ptc19
##$MNOVA/LINK_BLOCK_TYPE=	PAGE
##TITLE=	Feb27-2020.390.fid
PTC01
##JCAMP-DX=	6.0	$$ MestReNova 14.1.0-24037
##DATA TYPE=	LINK
##BLOCK_ID=	2
##BLOCKS=	2    
##ORIGIN=	Mestrelab Research S.L.
##OWNER=	ptc19
##$MNOVA/LINK_BLOCK_TYPE=	ITEM	$$ NMR Spectrum
##$MNOVA/ITEM/POLYGON=	(XY..XY)
5321,5835
8722,5835
8722,8208
5321,8208
5321,5835
##$MNOVA/ITEM/Z=	0
##$MNOVA/ITEM/ANGLE=	0
##TITLE=	Feb27-2020.390.fid
##JCAMP-DX=	6.0	$$ MestReNova 14.1.0-24037
##BLOCK_ID=	3
##DATA TYPE=	NMR SPECTRUM
##DATA CLASS=	XYDATA
##NUMDIM=	1
##ORIGIN=	Bruker BioSpin GmbH
##OWNER=	nmrsu
##.OBSERVE FREQUENCY=	400.05240029999998796
##.OBSERVE NUCLEUS=	^1H
##.SOLVENT NAME=	CDCl3
##.PULSE SEQUENCE=	zg30
##LONGDATE=	2020/02/27 16:24:00.000
##.ACQUISITIONMODE=	SIMULTANEOUS (DQD)
##$ORIGINAL FORMAT=	Bruker XWIN-NMR
##$MNOVA/SCALES_VERSION=	7
##$PARAMETER FILE=	(acqus, ASCII, //ch-nmrserv3.ch.ic.ac.uk/Av400D/ug1/nmr/Feb27-2020/390/acqus, 0)
$$ ##TITLE= Parameter file, TOPSPIN		Version 3.2
$$ ##JCAMPDX= 5.0
$$ ##DATATYPE= Parameter Values
$$ ##NPOINTS= 11	$$ modification sequence number
$$ ##ORIGIN= Bruker BioSpin GmbH
$$ ##OWNER= nmrsu
$$ $$ 2020-02-27 16:24:06.890 +0000  nmrsu@nmrpc
$$ $$ /opt/topspin/data/ug1/nmr/Feb27-2020/390/acqus
$$ $$ process /opt/topspin3.2/prog/mod/shimcntl
$$ ##$ACQT0= -2.04831932773109
$$ ##$AMP= (0..31)
$$ 100 100 100 100 100 100 100 100 100 100 100 100 100 100 100 100 100 100
$$ 100 100 100 100 100 100 100 100 100 100 100 100 100 100
$$ ##$AMPCOIL= (0..19)
$$ -1 0 0 0 0 0 0 0 0 0 0 0 0 0 0 0 0 0 0 0
$$ ##$ANAVPT= -1
$$ ##$AQSEQ= 0
$$ ##$AQ_mod= 3
$$ ##$AUNM= <au_zg>
$$ ##$AUTOPOS= <39 >
$$ ##$BF1= 400.05
$$ ##$BF2= 400.05
$$ ##$BF3= 400.05
$$ ##$BF4= 400.05
$$ ##$BF5= 400.05
$$ ##$BF6= 400.05
$$ ##$BF7= 400.05
$$ ##$BF8= 400.05
$$ ##$BYTORDA= 0
$$ ##$CAGPARS= (0..11)
$$ 0 0 0 0 0 0 0 0 0 0 0 0
$$ ##$CFDGTYP= 0
$$ ##$CFRGTYP= 9
$$ ##$CHEMSTR= <none>
$$ ##$CNST= (0..63)
$$ 1 1 1 1 1 1 1 1 1 1 1 1 1 1 1 1 1 1 1 1 1 1 1 1 1 1 1 1 1 1 1 1 1 1 1 1
$$ 1 1 1 1 1 1 1 1 1 1 1 1 1 1 1 1 1 1 1 1 1 1 1 1 1 1 1 1
$$ ##$CPDPRG= (0..8)
$$ <> <> <> <> <> <> <> <> <>
$$ ##$D= (0..63)
$$ 0 1 0 0 0 0 0 0 0 0 0 0 0 0 0 0 0.0002 0 0 0 0 0 0 0 0 0 0 0 0 0 0 0 0
$$ 0 0 0 0 0 0 0 0 0 0 0 0 0 0 0 0 0 0 0 0 0 0 0 0 0 0 0 0 0 0 0
$$ ##$DATE= 1582820645
$$ ##$DE= 6.5
$$ ##$DECBNUC= <off>
$$ ##$DECIM= 2496
$$ ##$DECNUC= <off>
$$ ##$DECSTAT= 4
$$ ##$DIGMOD= 1
$$ ##$DIGTYP= 12
$$ ##$DQDMODE= 0
$$ ##$DR= 22
$$ ##$DS= 4
$$ ##$DSPFIRM= 0
$$ ##$DSPFVS= 20
$$ ##$DTYPA= 0
$$ ##$EXP= <proton>
$$ ##$F1LIST= <>
$$ ##$F2LIST= <>
$$ ##$F3LIST= <>
$$ ##$FCUCHAN= (0..9)
$$ 0 2 0 0 0 0 0 0 0 0
$$ ##$FL1= 90
$$ ##$FL2= 90
$$ ##$FL3= 90
$$ ##$FL4= 90
$$ ##$FOV= 20
$$ ##$FQ1LIST= <>
$$ ##$FQ2LIST= <>
$$ ##$FQ3LIST= <>
$$ ##$FQ4LIST= <>
$$ ##$FQ5LIST= <>
$$ ##$FQ6LIST= <>
$$ ##$FQ7LIST= <>
$$ [...]
$$ 130000 130000 130000 130000 130000 130000 130000 130000 130000 130000 130000
$$ 130000 130000 130000 130000 130000 130000 130000 130000 130000 130000 130000
$$ 130000 130000 130000 130000 130000 130000 130000 0 0 0 0 0 0 0 0 0 0 0
$$ 0 0 0 0 0 0 0 0 0 0 0 0 0
$$ ##$ShimPowMaxUC= (0..63)
$$ 130000 130000 130000 130000 130000 130000 130000 130000 130000 130000 130000
$$ 130000 130000 130000 130000 130000 130000 130000 130000 130000 130000 130000
$$ 130000 130000 130000 130000 130000 130000 130000 130000 130000 130000 130000
$$ 130000 130000 130000 130000 130000 130000 130000 0 0 0 0 0 0 0 0 0 0 0
$$ 0 0 0 0 0 0 0 0 0 0 0 0 0
$$ ##$ShimPowMaxUG= (0..63)
$$ 524287 524287 524287 524287 524287 524287 524287 524287 524287 524287 524287
$$ 524287 524287 524287 524287 524287 524287 524287 524287 524287 524287 524287
$$ 524287 524287 524287 524287 524287 524287 524287 524287 524287 524287 524287
$$ 524287 524287 524287 524287 524287 524287 0 0 0 0 0 0 0 0 0 0 0 0 0 0 0
$$ 0 0 0 0 0 0 0 0 0 0
$$ ##$ShimPowRcbType= 3
$$ ##$ShimPowRes= (0..63)
$$ 1e-20 1e-20 1e-20 1e-20 1e-20 1e-20 1e-20 1e-20 1e-20 1e-20 1e-20 1e-20
$$ 1e-20 1e-20 1e-20 1e-20 1e-20 1e-20 1e-20 1e-20 1e-20 1e-20 1e-20 1e-20
$$ 1e-20 1e-20 1e-20 1e-20 1e-20 1e-20 1e-20 1e-20 1e-20 1e-20 1e-20 1e-20
$$ 1e-20 1e-20 1e-20 1e-20 0 0 0 0 0 0 0 0 0 0 0 0 0 0 0 0 0 0 0 0 0 0 0 0
$$ ##$ShimPowRng0= (0..63)
$$ 1 1 1 1 1 1 1 1 1 1 1 1 1 1 1 1 1 1 1 1 1 1 1 1 1 1 1 1 1 1 1 1 1 1 1 1
$$ 1 1 1 1 0 0 0 0 0 0 0 0 0 0 0 0 0 0 0 0 0 0 0 0 0 0 0 0
$$ ##$ShimPowRng1= (0..63)
$$ 1 1 1 1 1 1 1 1 1 1 1 1 1 1 1 1 1 1 1 1 1 1 1 1 1 1 1 1 1 1 1 1 1 1 1 1
$$ 1 1 1 1 0 0 0 0 0 0 0 0 0 0 0 0 0 0 0 0 0 0 0 0 0 0 0 0
$$ ##$ShimPowRng2= (0..63)
$$ 1 1 1 1 1 1 1 1 1 1 1 1 1 1 1 1 1 1 1 1 1 1 1 1 1 1 1 1 1 1 1 1 1 1 1 1
$$ 1 1 1 1 0 0 0 0 0 0 0 0 0 0 0 0 0 0 0 0 0 0 0 0 0 0 0 0
$$ ##$ShimPowRng3= (0..63)
$$ 1 1 1 1 1 1 1 1 1 1 1 1 1 1 1 1 1 1 1 1 1 1 1 1 1 1 1 1 1 1 1 1 1 1 1 1
$$ 1 1 1 1 0 0 0 0 0 0 0 0 0 0 0 0 0 0 0 0 0 0 0 0 0 0 0 0
$$ ##$ShimSysFunc= (0..63)
$$ 1 2 3 4 5 6 7 8 9 10 0 37 38 35 16 15 14 13 12 11 28 27 26 25 24 23 36
$$ 22 30 29 20 21 34 33 32 31 17 18 19 0 0 0 0 0 0 0 0 0 0 0 0 0 0 0 0 0 0
$$ 0 0 0 0 0 0 0
$$ ##$ShimSysMatrix= 0
$$ ##$ShimSysType= 4
$$ ##$TFXNUM= 0
$$ ##$TRIPLO2= 0
$$ ##$VTU= 2
$$ ##$VTUETH= <149.236.99.20>
$$ ##$VTUTY= <no>
$$ ##$WBREFAM= (0..15)
$$ 136.7 118.7 100 100 100 100 100 100 100 100 100 100 100 100 100 100
$$ ##$WBREFLM= (0..15)
$$ 0 0 0 0 0 0 0 0 0 0 0 0 0 0 0 0
$$ ##$WBREFPH= (0..15)
$$ 77.55 -71.28 0 0 0 0 0 0 0 0 0 0 0 0 0 0
$$ ##$WBSGU= (0..15)
$$ 0 0 0 0 0 0 0 0 0 0 0 0 0 0 0 0
$$ ##$XFAC= 2
$$ ##END=
$$ 
##$DECIM=	2496
##$DSPFVS=	20
##XUNITS=	HZ
##YUNITS=	ARBITRARY UNITS
##FIRSTX=	6406.710256386850233
##LASTX=	-1605.9879904956492283
##DELTAX=	-0.12226593800080108598
##XFACTOR=	1
##YFACTOR=	0.0061229735532275673601
##FIRSTY=	7.8400063514709472656
##MINY=	2.3683698177337646484
##MAXY=	6846.84619140625
##NPOINTS=	65536
##XYDATA=	(X++(Y..Y))
$$ [...]
$$ plain form
2815 1440 1567 1780 1992 2105 2218 2178 2138 1934 1731 1527 1324 1225 1127 1113 1100 1125 1151 1176 1201 1229 1256 1233 1209 1182 1155 1078 1000 1123 1246
2812 1246 1283 1321 1212 1102 1078 1054 1139 1223 1257 1290 1237 1185 1132 1079 1096 1113 1182 1250 1329 1409 1500 1592 1804 2220 2990 3965 4529 4343 3599 2854
2808 2854 2250 1850 1568 1388 1334 1280 1232 1184 1198 1211 1225 1239 1234 1228 1267 1307 1339 1268 1175 1134 1148 1161 1172 1182 1228 1170 1060 1001 1058 1166 1226 1235 1231
2804 1231 1227 1219 1212 1260 1308 1305 1302 1348 1394 1441 1487 1533 1579 1625 1671 1688 1705 1738 1822 1892 1860 1770 1679 1662 1646 1572 1600 1733 1867 1891 1914 1925 1987 2026 1963 1818
2800 1818 1673 1572 1472 1389 1307 1307 1307 1301 1244 1238 1333 1438 1441 1424 1458 1530 1551 1515 1479 1433 1336 1210 1186 1203 1220 1192 1165 1212 1260 1253 1246 1246 1194 1114 1136 1199
2795 1199 1261 1211 1161 1210 1259 1256 1254 1272 1291 1354 1417 1486 1453 1358 1263 1245 1227 1257 1286 1333 1328 1289 1352 1486 1519 1427 1336 1375 1414 1452 1491 1566 1641 1596 1552
2791 1552 1582 1612 1590 1569 1537 1505 1472 1440 1503 1565 1628 1690 1650 1610 1570 1530 1560 1591 1570 1549 1609 1668 1643 1617 1581 1544 1508 1472 1488 1505 1521 1538 1588 1639
2787 1639 1570 1501 1581 1661 1689 1718 1714 1709 1705 1700 1805 1909 1894 1879 1909 1939 1972 2005 2124 2295 2347 2297 2278 2361 2412 2412 2433 2505 2552 2599 2678 2859 3040 3221
$$ packed form
2815A440J27K13K12J13J13m0m0k04k03k04k03r9r8j4j3K5K6K5K5K8K7k3k4k7k7p7p8J23J23
2812A246L7L8j09j10k4k4Q5Q4L4L3n3n2n3n3J7J7O9O8P9Q0R1R2K12M16P70R75N64j86p44p45
2808B854o04m00k82j80n4n4m8m8J4J3J4J4noL9M0L2p1r3m1J4J3J1J0M6n8j10n9N7J08O0Rm
2804A231mqpM8M8llM6M6M7M6M6M6M6M6J7J7L3Q4P0l2r0r1j7j6p4K8J33J34K4K3J1O2L9o3j45
2800A818j45j01j00q3q2%%on7oR5J05Lj7L4P2K1l6l6m6r7j26k4J7J7k8k7M7M8pp%n2q0K2O3
2795A199O2n0n0M9M9lkJ8J9O3O3O9l3r5r5j8j8L0K9M7nl9O3J34L3r2r1L9L9L8L9P5P5m5m4
2791A552L0L0k2k1l2l2l3l2O3O2O3O2m0m0m0m0L0L1k1k1O0N9k5k6l6l7l6l6J6J7J6J7N0N1
2787A639o9o9Q0Q0K8K9mnmnJ05J04j5j5L0L0L3L3J19J71N2n0j9Q3N1%K1P2M7M7P9J81J81J81
$$ plain form
2783 3221 3481 3844 4204 4461 4612 4713 4745 4726 4680 4634 4636 4637 4704 4771 4838 4905 5017 5130 5300 5470 5714 6060 6519 7080 7772 8567 9421
2779 9421 10378 11550 12960 14780 17248 20791 25937 33638 45398 62746 85859 112073 135865 150868 152806 141661
2777 141661 121545 98307 76740 59105 45666 35828 28684 23429 19437 16397 14142 12442 11116 10153 9497 8954
2776 8954 8411 7924 7539 7226 6913 6710 6677 6838 6999 7153 7307 7454 7601 7654 7605 7551 7498 7366 7065 6652 6239 6062 6124 6314 6505
2772 6505 6750 7098 7518 7939 8506 9245 10164 11186 12336 13657 15241 17133 19601 23127 28281 35995 47882 65945 91499
2770 91499 123160 155628 180966 191856 185587 165165 137273 108761 83969 64396 49702 38832 30726 24641
2768 24641 20091 16676 14045 12019 10504 9448 8699 8097 7495 7008 6624 6237 5851 5499 5250 5117 4985 4808 4631 4432 4234
2766 4234 4126 4120 4094 3967 3653 3340 3055 2872 2752 2631 2638 2645 2625 2502 2297 2091 1972 1852 1815 1881 1895 1808 1711 1614 1597 1579 1577 1575 1574 1572 1526
$$ packed form
2783C221K60L63L60K57J51J01L2j9m6m6KJO7O7O7O7J12J13J70J70K44L46M59N61O92P95Q54
2779I421R57J172J410J820K468L543N146P701J1760J7348K3113K6214K3792J5003J938j1145
2777A41661k0116k3238k1567j7635j3439r838p144n255l992l040k255j700j326r63o56n43
2776H954n43m87l85l13l13k03l3J61J61J54J54J47J47N3m9n4n3j32l01m13m13j77O2J90J91
2772F505K45L48M20M21N67P39R19J022J150J321J584J892K468L526N154P714J1887J8063K5554
2770I1499L1661L2468K5338J0890o269k0422k7892k8512k4792j9573j4694j0870q106o085
2768B4641m550l415k631k026j515j056p49o02o02m87l84l87l86l52k49j33j32j77j77j99j98
2766D234j08ok6j27l14l13k85j83j20j21PPk0j23k05k06j19j20l7O6J4q7r7r7j7j8kkjkm6
$$ plain form
2762 1526 1480 1485 1490 1466 1442 1419 1395 1412 1430 1447 1464 1472 1480 1488 1495 1449 1404 1409 1414 1394 1374 1354 1333 1315 1297 1330 1363 1418 1472 1476 1479 1467 1455 1444 1432 1417 1402 1387 1372
2757 1372 1342 1311 1281 1250 1292 1334 1376 1417 1412 1406 1400 1395 1436 1477 1467 1457 1441 1424 1363 1302 1318 1436 1554 1569 1563 1557 1545 1533 1470 1408 1396 1385 1374 1363 1351 1340
2753 1340 1321 1303 1335 1367 1388 1409 1378 1347 1336 1325 1399 1473 1572 1672 1721 1769 1857 1945 2034 2122 2180 2239 2377 2514 2545 2474 2341 2208 2068 1928 1788
2749 1788 1648 1599 1550 1501 1452 1426 1400 1374 1348 1285 1222 1279 1335 1346 1358 1369 1381 1367 1353 1339 1325 1337 1349 1447 1544 1547 1549 1473 1397 1269 1243 1347 1452
2745 1452 1425 1398 1372 1345 1413 1481 1600 1719 1754 1789 1739 1689 1653 1617 1632 1647 1608 1569 1530 1491 1397 1303 1363 1423 1455 1488 1470 1452 1350 1248 1239 1332 1447
2741 1447 1510 1496 1481 1494 1608 1726 1741 1685 1680 1720 1708 1639 1570 1582 1595 1611 1627 1643 1658 1594 1529 1583 1688 1738 1685 1642 1599 1627 1656 1736 1816 1808 1799 1791 1782
2737 1782 1757 1733 1828 1922 1980 2037 2095 2152 2160 2167 2174 2182 2120 2058 2002 1947 1919 1993 2089 2135 2114 2093 2154 2216 2151 2086 2106 2126 2159 2192 2225 2259 2230 2202 2180 2158
2732 2158 2142 2229 2378 2526 2557 2589 2704 2871 2954 2934 2889 2845 2867 2889 2997 3104 3160 3216 3358 3499 3657 3814 4023 4232 4455 4679 4988
$$ packed form
2762A526m6NNk4k4k3k4J7J8J7J7QQQPm6m5NNk0k0k0k1j8j8L3L3N5N4MLj2j2j1j2j5j5j5j5
2757A372l0l1l0l1M2M2M2M1noonM1M1j0j0j6j7o1o1J6J18J18J5ooj2j2o3o2j2j1j1j1j2j1
2753A340j9j8L2L2K1K1l1l1j1j1P4P4R9J00M9M8Q8Q8Q9Q8N8N9J38J37L1p1j33j33j40j40j40
2749A788j40m9m9m9m9k6k6k6k6o3o3N7N6J1J2J1J2j4j4j4j4J2J2R8R7LKp6p6j28k6J04J05
2745A452k7k7k6k7O8O8J19J19L5L5n0n0l6l6J5J5l9l9l9l9r4r4O0O0L2L3j8j8j02j02rR3J15
2741A447O3j4j5J3J14J18J5n6nM0j2o9o9J2J3J6J6J6J5o4o5N4J05N0n3m3m3K8K9Q0Q0qrqr
2737A782k5k4R5R4N8N7N8N7QPPQo2o2n6n5k8P4R6M6k1k1O1O2o5o5K0K0L3L3L3L4k9k8k2k2
2732B158j6Q7J49J48L1L2J15J67Q3k0m5m4K2K2J08J07N6N6J42J41J58J57K09K09K23K24L09
$$ plain form
2729 4988 5297 5661 6026 6339 6653 6714 6776 6889 7002 7207 7412 7805 8198 8676 9154 9792 10430 11153 11978 12890 13973 15238 16809
2726 16809 18900 21708 25390 30334 36877 45159 55084 66407 78749 91262 102813 112215 118607 121348 120382 116311
2724 116311 110296 103564 97397 92970 91246 92763 97497 105063 114659 125175 135009 142625 146620 146079 140753 131231 118801
2722 118801 104699 90053 75851 62928 51813 42578 35083 29179 24605 21113 18405 16243 14524 13070 11786 10737
2720 10737 9859 9152 8548 8130 7814 7492 7171 6975 6779 6539 6300 6060 5820 5629 5437 5160 4883 4640 4396 4238 4080 4006 3932
2717 3932 3909 3886 3819 3753 3686 3619 3524 3429 3335 3240 3221 3202 3302 3403 3387 3371 3475 3578 3718 3858 3946 4034 4083 4132 4181 4230 4248 4265 4367 4470
2714 4470 4528 4585 4643 4701 4776 4851 4977 5103 5318 5533 5901 6269 6590 6910 7418 7926 8415 8904 9534 10402 11411 12726 14690 17506
2711 17506 21434 27101 34845 43646 52004 59782 68532 78613 87225 90617 87992 82058 75862 70245 64462 58441 53355
$$ packed form
2729D988L09L64L65L13L14O1O2J13J13K05K05L93L93M78M78O38O38P23Q25R12J083J265J571
2726A6809K091K808L682M944O543Q282R925J1323J2342J2513J1551R402O392K741r66m071
2724A16311o015o732o167m427j724J517M734P566R596J0516R834P616L995n41n326r522j2430
2722A18801j4102j4646j4202j2923j1115r235p495n904m574l492k708k162j719j454j284j049
2720A0737q78p07o04m18l16l22l21j96j96k40k39k40k40j91j92k77k77k43k44j58j58p4p4
2717C932k3k3o7o6o7o7r5r5r4r5j9j9J00J01j6j6J04J03J40J40Q8Q8M9M9M9M9J8J7J02J03
2714D470N8N7N8N8P5P5J26J26K15K15L68L68L21L20N08N08M89M89O30Q68J009J315J964K816
2711A7506L928N667P744Q801Q358P778Q750J0081Q612L392k625n934o196n617n783o021n086
$$ plain form
2709 53355 50623 50685 52622 55174 58033 62027 67487 72512 74024 70879 64903 58575 52623 46308 39413 32757 27022 22387
2707 22387 18741 15989 13953 12293 10939 9967 9302 8740 8177 7857 7537 7337 7136 7148 7160 7171 7183 7285 7388 7406 7423 7595 7767
2704 7767 7969 8342 8991 9742 10506 11646 13470 16078 19659 24638 30945 37422 43298 49277 56579 64325 69550 70103 66758
2701 66758 62150 57818 53588 49045 44502 41257 40229 41351 43531 45795 48503 52584 57586 60985 60598 56667 51337
2699 51337 46214 41091 35344 29289 23732 19231 15721 12995 10977 9403 8091 7085 6374 5834 5369 5006 4722 4438 4174
2697 4174 4011 3945 3878 3736 3594 3514 3536 3569 3601 3562 3522 3482 3545 3693 3739 3621 3502 3429 3355 3134 2914 2744 2574 2408 2242 2137 2135 2088
2694 2088 2041 2000 1959 1942 1925 1856 1788 1809 1830 1850 1871 1835 1798 1761 1724 1673 1622 1718 1814 1906 1897 1894 1890 1910 1930 1899 1868 1781 1694 1608 1521 1577 1632 1688 1744 1725
2689 1725 1706 1773 1839 1859 1878 1813 1747 1715 1684 1737 1791 1828 1864 2014 2164 2252 2239 2164 2088 1996 1904 1811 1719 1671 1624 1576 1528 1472 1416 1439 1462 1451 1338
$$ packed form
2709E3355k732O2J937K552K859L994N460N025J512l145n976o328n952o315o895o656n735m635
2707B2387l646k752k036j660j354r72o65n62n63l20l20k00k01J2J2J1J2J02J03J8J7J72J72
2704G767K02L73O49P51P64J140J824K608L581M979O307O477N876N979P302P746N225N53l345
2701F6758m608m332m230m543m543l245j028J122K180K264K708M081N002L399l87l931n330
2699E1337n123n123n747o055n557m501l510k726k018j574j312j006p11n40m65l63k84k84k64
2697D174j63o6o7j42j42q0K2L3L2l9m0m0O3J48M6j18j19p3p4k21k20j70j70j66j66j05km7
2694B088m7m1m1j7j7o9o8K1K1K0K1l6l7l7l7n1n1R6R6R2rlmK0K0l1l1q7q7q6q7N6N5N6N6j9
2689A725j9O7O6K0J9o5o6l2l1N3N4L7L6J50J50Q8j3p5p6r2r2r3r2m8m7m8m8n6n6K3K3j1j13
$$ plain form
2685 1338 1224 1213 1281 1350 1373 1397 1371 1345 1320 1294 1392 1491 1503 1516 1501 1487 1472 1457 1439 1422 1353 1284 1314 1343 1424 1504 1564 1623 1682 1741 1688 1636 1583 1530
2681 1530 1528 1526 1524 1522 1522 1522 1602 1682 1718 1669 1582 1496 1473 1451 1514 1576 1519 1462 1406 1349 1313 1278 1327 1377 1383 1389 1396 1402 1467 1532 1511 1491 1441 1392 1427 1463 1500 1538 1525
2676 1525 1511 1456 1401 1431 1461 1474 1486 1448 1410 1354 1298 1324 1350 1333 1265 1258 1336 1448 1474 1435 1395 1333 1271 1260 1249 1301 1354 1321 1288 1273 1259 1244 1229 1240
2672 1240 1251 1211 1171 1166 1162 1107 1052 1026 1001 975 950 1044 1139 1183 1227 1255 1284 1261 1238 1236 1233 1231 1228 1245 1262 1247 1147 1070 1079 1148 1166 1147 1128 1191 1255 1254 1253 1252 1252
2667 1252 1261 1270 1279 1288 1297 1306 1316 1325 1350 1375 1400 1425 1462 1499 1417 1334 1339 1344 1348 1353 1371 1390 1409 1427 1357 1286 1216 1145 1125 1104 1169 1234 1267 1300 1333 1366 1337 1308 1279 1250
2662 1250 1273 1296 1267 1239 1244 1250 1256 1261 1317 1373 1343 1263 1216 1255 1322 1339 1270 1201 1215 1228 1251 1273 1243 1214 1202 1189 1228 1266 1246 1226 1206 1186 1236 1285 1249 1213
2658 1213 1238 1263 1288 1313 1275 1237 1199 1161 1153 1145 1137 1129 1173 1217 1261 1305 1262 1220 1177 1135 1118 1101 1136 1170 1251 1332 1362 1392 1354 1316 1277 1239 1247 1256 1264 1273 1231 1189
2653 1189 1195 1202 1175 1097 1028 1079 1223 1315 1288 1210 1188 1217 1213 1210 1228 1246 1217 1187 1175 1215 1222 1145 1087 1030 1087 1144 1160 1176 1192 1209 1195 1181 1166 1152 1214 1276
$$ packed form
2685A338j14j1O8O9K3K4k6k6k5k6R8R9J2J3j5j4j5j5j8j7o9o9L0K9Q1Q0O0N9N9N9n3n2n3n3
2681A530kkkk%%Q0Q0L6m9q7q6k3k2O3O2n7n7n6n7l6l5M9N0OOPOO5O5k1k0n0m9L5L6L7L8j3
2676A525j4n5n5L0L0J3J2l8l8n6n6K6K6j7o8pP8J12K6l9m0o2o2j1j1N2N3l3l3j5j4j5j5J1
2672A240J1m0m0nmn5n5k6k5k6k5R4R5M4M4K8K9k3k3klklJ7J7j5j00p7RO9J8j9j9O3O4jjj%
2667A252RRRRRRJ0RK5K5K5K5L7L7q2q3NNMNJ8J9J9J8p0p1p0p1k0k1O5O5L3L3L3L3k9k9k9k9
2662A250K3K3k9k8NOONN6N6l0q0m7L9O7J7o9o9J4J3K3K2l0k9j2j3L9L8k0k0k0k0N0M9l6l6
2658A213K5K5K5K5l8l8l8l8qqqqM4M4M4M4m3m2m3m2j7j7L5L4Q1Q1L0L0l8l8l9l8QRQRm2m2
2653A189OPk7p8o9N1J44R2k7p8k2K9mlJ8J8k9l0j2M0Pp7n8n7N7N7J6J6J6J7j4j4j5j4O2O2
$$ plain form
2649 1276 1286 1296 1289 1282 1275 1268 1239 1211 1268 1324 1280 1235 1191 1147 1195 1243 1377 1510 1574 1639 1618 1597 1645 1693 1742 1790 1854 1918 1896 1875 1803 1731 1711 1690 1718
2645 1718 1745 1722 1649 1620 1695 1828 1961 1964 1968 1852 1736 1667 1597 1578 1559 1520 1481 1442 1403 1337 1271 1291 1310 1335 1361 1335 1309 1333 1358 1331 1304 1301 1298 1294 1291
2640 1291 1256 1221 1237 1253 1222 1192 1164 1137 1159 1231 1333 1332 1256 1180 1098 1016 1018 1020 1107 1194 1173 1152 1131 1110 1080 1049 1104 1158 1252 1346 1354 1363 1306 1250 1238 1226
2636 1226 1207 1086 967 951 1026 1152 1233 1262 1259 1255 1197 1139 1133 1128 1173 1219 1242 1265 1288 1311 1273 1235 1283 1331 1356 1381 1354 1328 1272 1216 1211 1207 1273 1339 1320 1300
2632 1300 1240 1179 1169 1159 1231 1302 1373 1444 1476 1509 1492 1423 1384 1448 1531 1562 1573 1583 1590 1597 1525 1454 1501 1549 1559 1569 1580 1590 1529 1467 1405 1344 1360 1376 1443
2627 1443 1511 1515 1519 1524 1528 1492 1456 1420 1383 1373 1362 1273 1183 1166 1252 1343 1333 1234 1237 1321 1354 1271 1136 1117 1200 1254 1205 1169 1133 1093 1052 1063 1074 1151 1227 1185
2623 1185 1142 1097 1052 1092 1133 1205 1278 1363 1346 1290 1336 1465 1594 1596 1496 1453 1411 1354 1298 1325 1404 1455 1402 1379 1407 1405 1351 1272 1296 1334 1372 1297 1221 1197
2619 1197 1174 1150 1126 1133 1140 1095 1051 1115 1178 1293 1407 1376 1346 1195 1045 1051 1058 1115 1173 1181 1188 1196 1203 1179 1154 1130 1105 1073 1041 1061 1080 1135 1189 1244 1298 1203
$$ packed form
2649A276J0J0ppppk9k8N7N6m4m5m4m4M8M8J34J33O4O5k1k1M8M8M9M8O4O4k2k1p2p2k0k1K8
2645A718K7k3p3k9P5J33J33LMj16j16o9p0j9j9l9l9l9l9o6o6K0J9K5K6k6k6K4K5k7k7llml
2640A291l5l5J6J6l1l0k8k7K2P2J02jp6p6q2q2KKQ7Q7k1k1k1k1l0l1N5N4R4R4QRn7n6j2j2
2636A226j9j21j19j6P5J26Q1K9lmn8n8onM5M6K3K3K3K3l8l8M8M8K5K5k7k6n6n6nmO6O6j9k0
2632A300o0o1j0j0P2P1P1P1L2L3j7o9l9O4Q3L1J1J0PPp2p1M7M8J0J0J1J0o1o2o2o1J6J6O7
2627A443O8MMNMl6l6l6l7j0j1q9r0j7Q6R1j0r9LQ4L3q3j35j9Q3N4m9l6l6m0m1J1J1P7P6m2
2623A185m3m5m5M0M1P2P3Q5j7n6M6J29J29Kj00m3m2n7n6K7P9N1n3k3K8kn4p9K4L8L8p5p6k4
2619A197k3k4k4PPm5m4O4O3J15J14l1l0j51j50OPN7N8QPQPk4k5k4k5l2l2K0J9N5N4N5N4r5
$$ plain form
2614 1203 1107 1012 916 905 894 968 1042 1069 1096 1123 1151 1180 1209 1239 1268 1222 1176 1079 981 982 983 1035 1087 1115 1142 1170 1198 1196 1194 1191 1189 1215 1242 1216 1191 1154 1116
2610 1116 1129 1142 1140 1137 1134 1131 1153 1175 1196 1218 1203 1188 1173 1158 1204 1249 1210 1170 1199 1228 1257 1286 1217 1148 1130 1112 1098 1083 1068 1054 1058 1063 1067 1072 1154 1236 1233 1230 1237 1243
2605 1243 1250 1257 1230 1203 1176 1149 1160 1172 1183 1195 1212 1230 1247 1265 1273 1281 1289 1297 1225 1153 1132 1111 1068 1025 1067 1109 1032 954 996 1038 1048 1058 1068 1078 1057 1036 1015
2600 1015 994 1020 1046 1072 1098 1086 1074 1062 1050 1065 1080 1095 1110 1108 1107 1055 1003 997 992 986 981 1021 1061 1049 1038 1077 1115 1154 1193 1203 1214 1224 1235 1207 1179 1151 1123
2596 1123 1120 1117 1115 1112 1162 1213 1212 1211 1175 1139 1155 1170 1149 1128 1158 1188 1271 1354 1352 1350 1284 1217 1236 1255 1339 1423 1456 1488 1404 1319 1320 1320 1282 1244 1257 1269 1211 1152 1179
2591 1179 1206 1182 1159 1135 1112 1065 1018 1022 1027 1060 1093 1127 1160 1195 1231 1215 1199 1202 1204 1206 1209 1167 1126 1198 1269 1341 1311 1226 1244 1288 1280 1227 1226 1261 1296 1214 1133 1155
2587 1155 1176 1197 1218 1214 1211 1207 1204 1210 1216 1222 1228 1278 1328 1327 1326 1296 1265 1285 1306 1254 1202 1149 1097 1071 1045 1131 1218 1250 1179 1102 1127 1176 1122 1053 1034 1004 974 938 1004
2582 1004 1109 1163 1133 1103 1112 1121 1146 1222 1282 1240 1139 1038 1054 1070 1035 1000 1045 1090 1135 1180 1213 1245 1193 1140 1177 1214 1200 1186 1179 1172 1168 1164 1195 1276 1305 1231
$$ packed form
2614A203r6r5r6j1j1P4P4K7K7K7K8K9K9L0K9m6m6r7r8JJN2N2K8K7K8K8kklkK6K7k6k5l7l8
2610A116J3J3klllK2K2K1K2j5j5j5j5M6M5l9m0K9K9K9K9o9o9j8j8j4j5j5j4MNMNQ2Q2llPO
2605A243PPk7k7k7k7J1J2J1J2J7J8J7J8QQQQp2p2k1k1m3m3M2M2p7p8M2M2J0J0J0J0k1k1k1
2600A015k1K6K6K6K6j2j2j2j2J5J5J5J5kjn2n2ononM0M0j2j1L9L8L9L9J0J1J0J1k8k8k8k8
2596A123llklN0N1jjl6l6J6J5k1k1L0L0Q3Q3kko6o7J9J9Q4Q4L3L2q4q5J%l8l8J3J2n8n9K7
2591A179K7k4k3k4k3m7m7MNL3L3L4L3L5L6j6j6LKKLm2m1P2P1P2l0q5J8M4qn3jL5L5q2q1K2
2587A155K1K1K1mlmlOOOON0N0jjl0l1K0K1n2n2n3n2k6k6Q6Q7L2p1p7K5M9n4o9j9l0l0l6O6
2582A004J05N4l0l0RRK5P6O0m2j01j01J6J6l5l5M5M5M5M5L3L2n2n3L7L7j4j4ppmmL1Q1K9p4
$$ plain form
2577 1231 1129 1079 1045 1011 963 915 987 1058 1151 1245 1253 1261 1226 1192 1157 1122 1124 1126 1127 1129 1085 1041 1109 1178 1186 1092 998 1006 1041 1077 1068 1059 1093 1127 1161 1196 1217 1238 1208
2573 1208 1179 1206 1234 1262 1290 1242 1194 1195 1195 1193 1141 1117 1178 1278 1327 1256 1185 1178 1171 1164 1157 1170 1182 1143 1104 1115 1126 1137 1148 1155 1163 1171 1179 1157 1136 1115 1094 1120 1145
2568 1145 1120 1094 1054 1013 1058 1102 1147 1192 1090 989 972 1075 1209 1259 1227 1195 1158 1121 1077 1034 990 946 1012 1078 1093 1108 1114 1119 1124 1130 1132 1134 1136 1138 1147 1155 1163 1172
2563 1172 1172 1173 1225 1277 1249 1221 1194 1166 1227 1289 1265 1242 1223 1204 1186 1167 1076 985 1013 1042 1084 1126 1168 1210 1170 1130 1090 1050 1086 1122 1159 1195 1137 1080 1141
2559 1141 1203 1178 1153 1179 1205 1238 1271 1253 1236 1190 1145 1100 1055 1037 1020 1033 1132 1182 1129 966 905 964 1075 1112 1149 1173 1197 1170 1143 1135 1126 1168 1211 1200
2555 1200 1189 1178 1167 1195 1223 1165 1107 1110 1113 1116 1119 1139 1158 1177 1196 1202 1208 1207 1207 1198 1086 956 876 896 967 1041 1063 1085 1107 1074 1041 1021 1002 1067 1133 1190 1247 1219
2550 1219 1191 1161 1132 1023 915 938 1063 1140 1115 1067 1070 1073 1026 960 996 1091 1186 1197 1207 1167 1127 1096 1065 1119 1174 1153 1132 1112 1091 1073 1056 1089 1123 1134
2546 1134 1145 1105 1064 1064 1063 1062 1061 1095 1129 1077 1026 1073 1119 1116 1061 1005 1051 1122 1193 1207 1221 1185 1148 1166 1184 1202 1220 1149 1077 1091 1105 1106 1106 1107 1107 1098 1089 1029 969 1010
$$ packed form
2577A231j02n0l4l4m8m8P2P1R3R4QQl5l4l5l5KKJKm4m4O8O9Qr4r4QL5L6rrL4L4L4L5K1K1l0
2573A208k9K7K8K8K8m8m8J%kn2k4O1J00M9p1p1ppppJ3J2l9l9J1J1J1J1PQQQk2k1k1k1K6K5
2568A145k5k6m0m1M5M4M5M5j02j01j7J03J34N0l2l2l7l7m4m3m4m4O6O6J5J5ONNOKKKKRQQR
2563A172%JN2N2k8k8k7k8O1O2k4k3j9j9j8j9r1r1K8K9M2M2M2M2m0m0m0m0L6L6L7L6n8n7O1
2559A141O2k5k5K6K6L3L3j8j7m6m5m5m5j8j7J3R9N0n3j63o1N9J11L7L7K4K4k7k7qrM2M3j1
2555A200j1j1j1K8K8n8n8LLLLK0J9J9J9OOj%rj12j30q0K0P1P4K2K2K2l3l3k0j9O5O6N7N7k8
2550A219k8l0k9j09j08K3J25P7k5m8LLm7o6L6R5R5J1J0m0m0l1l1N4N5k1k1k0k1j8j7L3L4J1
2546A134J1m0m1%jjjL4L4n2n1M7M6ln5n6M6P1P1J4J4l6l7J8J8J8J8p1p2J4J4J%J%rro0o0M1
$$ plain form
2541 1010 1051 1014 976 964 1054 1087 1120 1120 1120 1120 1121 1172 1223 1281 1237 1161 1085 1121 1158 1166 1174 1183 1191 1077 964 844 826 928 1030 1145 1157 1130 1102 1068 1034
2537 1034 1066 1098 1130 1162 1079 995 997 999 1071 1143 1164 1185 1152 1120 1088 1056 1030 1004 979 953 976 998 970 942 992 1043 1093 1143 1086 1029 966 1005 1132 1260
2533 1260 1308 1357 1355 1353 1267 1180 1141 1102 1063 1024 999 974 1034 1094 1135 1176 1165 1155 1146 1137 1128 1118 1101 1083 1065 1048 1080 1112 1123 1031 882 836 912 989 1037 1085
2528 1085 1132 1180 1169 1158 1198 1238 1250 1262 1222 1183 1199 1214 1145 1076 1030 985 1025 1065 1119 1172 1175 1178 1173 1169 1165 1161 1143 1126 1195 1263 1231 1199 1167 1135 1092 1050 1126
2524 1126 1254 1322 1304 1253 1201 1223 1245 1267 1288 1264 1239 1214 1190 1172 1153 1135 1117 1130 1144 1158 1171 1198 1224 1251 1277 1255 1233 1211 1189 1253 1317 1281 1159
2520 1159 1076 1077 1111 1144 1167 1190 1161 1133 1146 1159 1175 1191 1191 1243 1265 1203 1109 1068 1077 1086 1080 1074 1154 1234 1240 1247 1253 1260 1250 1241 1231 1222 1163 1105 1046 987 1018 1049 1080 1111
2515 1111 1080 1049 1019 988 1018 1047 1077 1107 1068 1030 1076 1123 1102 1081 1112 1142 1195 1247 1248 1250 1199 1149 1124 1099 1156 1213 1185 1157 1155 1154 1101 1048 1012 976 991 1006
2510 1006 999 993 1012 1030 1044 1058 1123 1188 1179 1169 1185 1201 1248 1294 1289 1285 1201 1118 1155 1191 1158 1126 1145 1214 1235 1171 1106 1127 1169 1160 1134 1108 1176 1244 1226 1208 1144
$$ packed form
2541A010M1l7l8j2R0L3L3%%%JN1N1N8m4p6p6L6L7QQRQj14j13j20j8J02J02J15J2k7k8l4l4
2537A034L2L2L2L2q3q4KKP2P2K1K1l3l2l2l2k6k6k5k6K3K2k8k8N0N1N0N0n7n7o3L9J27J28
2533A260M8M9kkq6q7l9l9l9l9k5k5O0O0M1M1j1j0rrrj0j7j8j8j7L2L2J1r2j49m6P6P7M8M8
2528A085M7M8j1j1M0M0J2J2m0l9J6J5o9o9m6m5M0M0N4N3LLnmmmj8j7O9O8l2l2l2l2m3m2P6
2524A126J28O8j8n1n2K2K2K2K1k4k5k5k4j8j9j8j8J3J4J4J3K7K6K7K6k2k2k2k2O4O4l6j22
2520A159q3JL4L3K3K3k9k8J3J3J6J6%N2K2o2r4m1RRooQ0Q0OPOPj0rj0rn9n8n9n9L1L1L1L1
2515A111l1l1l0l1L0K9L0L0l9l8M6M7k1k1L1L0N3N2JKn1n0k5k5N7N7k8k8kjn3n3l6l6J5J5
2510A006poJ9J8J4J4O5O5rj0J6J6M7M6nmq4q3L7L6l3l2J9O9K1o4o5K1M2rk6k6O8O8j8j8o4
$$ plain form
2506 1144 1079 1082 1171 1259 1297 1283 1269 1261 1252 1193 1133 1074 1014 1040 1066 1066 1066 1118 1169 1182 1194 1181 1168 1139 1110 1081 1052 1128 1204 1228 1253 1194 1135 1162 1188 1275 1362
2501 1362 1364 1366 1309 1253 1197 1141 1177 1213 1199 1184 1154 1124 1180 1235 1237 1239 1161 1083 1025 1052 1116 1180 1169 1158 1173 1187 1172 1157 1142 1126 1067 1008 980 1038 1098 1073
2497 1073 1022 1021 1116 1211 1175 1054 1009 1049 1090 1080 1056 1033 1057 1082 1104 1127 1099 1019 1004 1073 1175 1226 1227 1280 1359 1335 1258 1181 1213 1246 1186 1075 1020 1068
2493 1068 1086 1105 1079 1053 1025 997 1055 1112 1111 1110 1108 1107 1061 1016 995 1076 1167 1207 1275 1344 1409 1372 1312 1304 1325 1347 1252 1157 1097 1037 1094 1150 1162 1122 1050 1081 1143
2488 1143 1153 1113 1074 1037 1001 1016 1030 1007 984 962 939 995 1051 1100 1150 1218 1184 1093 1054 1082 1111 1092 1072 1098 1123 1097 1071 1065 1059 1054 1048 1060 1071 998 924 955
2484 955 986 1017 1048 1092 1136 1067 998 944 994 1049 1003 974 1048 1119 1088 1013 988 1015 1041 1020 1000 1064 1179 1223 1164 1137 1162 1187 1213 1191 1168 1145 1121 1098
2480 1098 1075 1093 1112 1131 1150 1181 1213 1244 1276 1230 1185 1139 1093 1084 1075 1146 1216 1170 1039 959 964 1004 1044 1090 1135 1201 1267 1281 1296 1304 1312 1269 1226 1180 1133 1086
2475 1086 1039 993 946 1019 1142 1245 1261 1176 1039 975 996 1052 1107 1081 1055 1030 1004 1076 1149 1170 1191 1186 1181 1176 1172 1101 1030 1112 1246 1320 1308 1228 1148 1129
$$ packed form
2506A144o5LQ9Q8L8j4j4qrn9o0n9o0K6K6%%N2N1J3J2j3j3k9k9k9k9P6P6K4K5n9n9K7K6Q7Q7
2501A362KKn7n6n6n6L6L6j4j5l0l0N6N5KKp8p8n8K7O4O4j1j1J5J4j5j5j5j6n9n9k8N8O0k5
2497A073n1jR5R5l6j21m5M0M1j0k4k3K4K5K2K3k8q0j5O9J02N1JN3P9k4p7p7L2L3o0j11n5M8
2493A068J8J9k6k6k8k8N8N7jjkjm6m5k1Q1R1M0O8O9O5l7o0qK1K2r5r5o0o0N7N6J2m0p2L1O2
2488A143J0m0l9l7l6J5J4k3k3k2k3N6N6M9N0O8l4r1l9K8K9j9k0K6K5k6k6oonoJ2J1p3p4L1
2484I55L1L1L1M4M4o9o9n4N0N5m6k9P4P1l1p5k5K7K6k1k0O4J15M4n9k7K5K5K6k2k3k3k4k3
2480A098k3J8J9J9J9L1L2L1L2m6m5m6m6rrP1P0m6j31q0NM0M0M6M5O6O6J4J5QQm3m3m6m7m7
2475A086m7m6m7P3J23J03J6q5j37o4K1N6N5k6k6k5k6P2P3K1K1nnnmp1p1Q2J34P4j2q0q0j9
$$ plain form
2471 1129 1109 1141 1173 1156 1138 1172 1206 1205 1205 1153 1102 1040 978 1017 1141 1244 1263 1249 1235 1218 1201 1184 1167 1184 1200 1216 1232 1217 1202 1188 1173 1233 1292 1267
2467 1267 1242 1240 1238 1188 1139 1145 1202 1230 1173 1097 1072 1132 1193 1189 1186 1183 1179 1187 1195 1151 1108 1109 1111 1112 1113 1091 1069 1099 1128 1141 1154 1116 1078 1075 1072 1018 963 928 893 977 1061 1084
2462 1084 1106 1077 1049 1057 1066 1125 1185 1242 1299 1350 1402 1355 1224 1092 1045 1103 1160 1138 1115 1096 1077 1108 1140 1154 1169 1132 1095 1108 1121 1134 1147 1125 1102 1029
2458 1029 955 948 942 986 1031 1047 1064 1132 1199 1215 1230 1246 1261 1190 1119 1099 1079 1098 1116 1083 1051 1076 1102 1127 1153 1166 1178 1191 1204 1183 1163 1091 1019 1043 1067
2453 1067 1091 1115 1077 1039 1053 1066 1111 1157 1117 1077 1106 1136 1166 1196 1176 1155 1186 1217 1206 1195 1133 1071 1097 1122 1096 1071 1113 1155 1145 1136 1143 1150 1156 1163 1098 1032 1018
2449 1018 1003 979 955 982 1009 1106 1202 1179 1156 1174 1192 1209 1227 1212 1197 1183 1168 1055 942 915 887 926 964 951 938 954 970 986 1002 1008 1015 941 867 860 937
2445 937 1018 1099 1140 1180 1204 1176 1172 1253 1331 1324 1253 1183 1159 1135 1062 990 969 948 1000 1052 1053 1054 1091 1127 1163 1199 1226 1253 1229 1205 1151 1097 1094 1091 1112 1133 1155 1176
2440 1176 1159 1142 1124 1107 1149 1192 1183 1174 1156 1139 1121 1104 1036 968 1019 1122 1192 1177 1128 1080 1108 1136 1164 1192 1208 1225 1190 1155 1215 1274 1249 1223 1206 1189 1205
$$ packed form
2471A129k0L2L2j7j8L4L4j%n2n1o2o2L9J24J03J9j4j4j7j7j7j7J7J6J6J6j5j5j4j5O0N9k5
2467A267k5kkn0m9ON7K8n7p6k5O0O1mllmQQm4m3JKJJk2k2L0K9J3J3l8l8lln4n5l5l5Q4Q4K3
2462A084K2k9k8QRN9O0N7N7N1N2m7j31j32m7N8N7k2k3j9j9L1L2J4J5l7l7J3J3J3J3k2k3p3
2458A029p4poM4M5J6J7O8O7J6J5J6J5p1p1k0k0J9J8l3l2K5K6K5K6J3J2J3J3k1k0p2p2K4K4
2453A067K4K4l8l8J4J3M5M6m0m0K9L0L0L0k0k1L1L1j1j1o2o2K6K5k6k5M2M2j0rPPOPo5o6j4
2449A018j5k4k4K7K7R7R6k3k3J8J8J7J8j5j5j4j5j13j13k7k8L9L8j3j3J6J6J6J6OPp4p4pP7
2445I37Q1Q1M1M0K4k8mQ1P8pp1p0k4k4p3p2k1k1N2N2JJL7L6L6L6K7K7k4k4n4n4llK1K1K2K1
2440A176j7j7j8j7M2M3rrj8j7j8j7o8o8N1J03P0j5m9m8K8K8K8K8J6J7l5l5O0N9k5k6j7j7J6
$$ plain form
2436 1205 1171 1127 1169 1270 1320 1261 1151 1089 1078 1052 1027 1005 983 1025 1067 1109 1150 1163 1176 1137 1099 1153 1207 1262 1316 1304 1293 1282 1270 1258 1245 1182 1118
2432 1118 1117 1116 1116 1115 1110 1105 1100 1095 1071 1047 1108 1170 1156 1143 1130 1116 1179 1241 1219 1196 1235 1274 1313 1352 1379 1406 1320 1234 1159 1185 1206 1226 1236 1245 1255 1264 1188 1111 1034
2427 1034 957 985 1012 1040 1067 1034 1001 1087 1173 1171 1169 1167 1165 1135 1105 1024 943 955 967 979 991 973 955 937 919 1002 1086 1141 1094 1008 921 948 975 1042 1109 1091
2422 1091 1073 1087 1102 1117 1132 1089 1047 1123 1200 1236 1272 1308 1344 1280 1217 1181 1248 1286 1325 1285 1245 1244 1243 1243 1242 1257 1273 1288 1303 1236 1168 1100 1033 1021 1008 996
2418 996 984 1001 1017 1034 1051 1064 1077 1091 1104 1131 1158 1134 1110 1083 1055 1113 1171 1109 1048 1037 1027 1077 1127 1126 1125 1116 1106 1096 1086 1086 1086 1171 1256 1276 1296 1265 1234
2414 1234 1233 1233 1232 1232 1264 1297 1278 1259 1225 1192 1158 1124 1129 1133 1188 1244 1232 1221 1260 1300 1282 1265 1298 1332 1315 1299 1283 1266 1264 1262 1209 1157 1154 1151 1148 1145 1187 1229 1271 1313
2409 1313 1257 1200 1144 1088 1086 1084 1082 1080 1096 1112 1111 1059 958 942 1061 1230 1345 1339 1285 1231 1239 1248 1256 1264 1255 1247 1238 1229 1192 1154 1168 1182 1112 1043 1092 1142 1188 1233 1278
2404 1278 1323 1292 1261 1229 1198 1226 1255 1233 1210 1207 1204 1201 1197 1165 1133 1152 1171 1205 1239 1273 1307 1208 1109 1096 1083 1083 1082 1133 1183 1178 1172 1167 1161 1159 1157 1155 1152 1149 1146 1143 1141 1142 1143 1093
$$ packed form
2436A205l4m4M2J01N0n9j10o2j1k6k5k2k2M2M2M2M1J3J3l9l8N4N4N5N4j2j1j1j2j2j3o3o4
2432A118jj%jnnnnk4k4O1O2j4j3j3j4O3O2k2k3L9L9L9L9K7K7q6q6p5K6K1K0J0RJ0Rp6p7p7
2427A034p7K8K7K8K7l3l3Q6Q6kkkkl0l0q1q1J2J2J2J2j8j8j8j8Q3Q4N5m7q6q7K7K7O7O7j8
2422A091j8J4J5J5J5m3m2P6P7L6L6L6L6o4o3l6O7L8L9m0m0jj%jJ5J6J5J5o7o8o8o7j2j3j2
2418I96j2J7J6J7J7J3J3J4J3K7K7k4k4k7k8N8N8o2o1j1j0N0N0jjrj0j0j0%%Q5Q5K0K0l1l1
2414A234j%j%L2L3j9j9l4l3l4l4NMN5N6j2j1L9M0j8j7L3L4j7j6j6j7kkn3n2llllM2M2M2M2
2409A313n6n7n6n6kkkkJ6J6jn2j01j6J19J69J15on4n4QRQQrqrrl7l8J4J4p0o9M9N0M6M5M5
2404A278M5l1l1l2l1K8K9k2k3lllml2l2J9J9L4L4L4L4r9r9j3j3%jN1N0nonokkkllllkJJn0
$$ plain form
2398 1093 1043 1064 1085 1055 1025 1027 1029 1030 1032 1069 1105 1141 1178 1136 1095 1053 1012 1052 1092 1179 1267 1238 1158 1096 1137 1211 1233 1206 1178 1180 1182 1184 1187 1132 1077 1073 1070 1024 979
2394 979 989 1102 1217 1229 1186 1142 1142 1141 1192 1242 1262 1283 1252 1221 1224 1227 1179 1131 1071 1011 1003 994 1103 1212 1235 1259 1240 1220 1151 1030 987 1045 1197 1348
2390 1348 1351 1354 1357 1361 1301 1241 1181 1122 1088 1055 1021 988 972 957 993 1028 1015 1002 989 975 981 987 942 897 946 995 1044 1093 1095 1097 1099 1101 1151 1201 1165 1130 1066 1002 1023
2385 1023 1044 1070 1096 1010 923 932 1043 1097 1151 1134 1116 1099 1082 1067 1052 1123 1193 1156 1119 1075 1134 1168 1201 1189 1178 1192 1206 1169 1132 1139 1145 1152 1158 1198 1237 1225
2380 1225 1213 1203 1193 1139 1084 1073 1165 1256 1246 1211 1177 1187 1198 1198 1197 1197 1197 1153 1109 1116 1124 1112 1101 1141 1181 1211 1241 1220 1199 1175 1151 1127 1103 1148 1193 1238 1284
2376 1284 1254 1224 1194 1164 1178 1192 1250 1309 1280 1149 1019 990 1059 1127 1174 1119 1012 904 887 971 1053 1136 1105 1074 988 901 934 967 1000 1034 1017 1000
2372 1000 1059 1119 1173 1226 1227 1125 1023 1023 1129 1235 1286 1235 1202 1168 1180 1191 1183 1175 1218 1261 1293 1325 1272 1219 1256 1293 1279 1265 1180 1096 1096 1097 1152 1208 1144
2368 1144 1080 1088 1096 1105 1113 1072 1030 995 960 1038 1218 1313 1306 1243 1180 1196 1211 1229 1247 1265 1283 1266 1248 1231 1214 1209 1205 1200 1195 1181 1167 1153 1139 1122 1105 1088 1070 1034
$$ packed form
2398A093n0K1K1l0l0KKJKL7L6L6L7m2m1m2m1M0M0Q7Q8k9q0o2M1P4K2k7k8KKKLn5n5mlm6m5
2394I79J0J13J15J2m3m4%jN1N0K0K1l1l1LLm8m8o0o0qrJ09J09K3K4j9k0o9j21m3N8J52J51
2390A348LLLMo0o0o0n9l4l3l4l3j6j5L6L5j3j3j3j4OOm5m5M9M9M9M9KKKKN0N0l6l5o4o4K1
2385A023K1K6K6q6q7RJ11N4N4j7j8j7j7j5j5P1P0l7l7m4N9L4L3j2j1J4J4l7l7POPOM0L9j2
2380A225j2j0j0n4n5j1R2R1j0l5l4J0J1%j%%m4m4PQj2j1M0M0L0L0k1k1k4k4k4k4M5M5M5M6
2376A284l0l0l0l0J4J4N8N9k9j31j30k9O9O8M7n5j07j08j7Q4Q2Q3l1l1q6q7L3L3L3L4j7j7
2372A000N9O0N4N3Jj02j02%J06J06N1n1l3l4J2J1qqM3M3L2L2n3n3L7L7j4j4q5q4%JN5N6o4
2368A144o4QQRQm1m2l5l5P8J80R5po3o3J6J5J8J8J8J8j7j8j7j7nmnnj4j4j4j4j7j7j7j8l6
$$ plain form
2363 1034 998 1013 1028 1039 1050 1060 1071 1102 1132 1077 1022 1100 1179 1229 1178 1122 1067 1090 1114 1110 1107 1155 1203 1167 1131 1094 1058 1054 1050 1045 1041 1013 985 1070 1155 1210 1163
2358 1163 1110 1158 1220 1179 1117 1055 1088 1121 1205 1288 1335 1382 1309 1237 1251 1264 1227 1190 1159 1129 1098 1068 1094 1120 1158 1095 1020 1048 1131 1213 1206 1198 1139 1080 1108
2354 1108 1135 1163 1190 1151 1111 1122 1134 1100 1066 1083 1101 1114 1127 1140 1153 1172 1191 1209 1228 1221 1213 1154 1095 1131 1166 1202 1237 1288 1338 1304 1269 1280 1290 1301 1311
2350 1311 1281 1251 1221 1191 1159 1127 1147 1166 1147 1127 1194 1260 1227 1195 1162 1130 1170 1210 1198 1187 1172 1156 1140 1125 1141 1158 1174 1190 1160 1129 1184 1239 1228 1216
2346 1216 1205 1194 1176 1158 1191 1225 1157 1089 1021 953 960 967 973 980 1088 1196 1253 1310 1274 1238 1202 1166 1115 1064 1014 963 919 875 950 1077 1153 1143 1104 1117 1170
2341 1170 1223 1228 1233 1243 1252 1182 1111 1087 1149 1243 1285 1279 1274 1282 1342 1398 1369 1237 1105 1062 1019 1061 1103 1146 1189 1180 1172 1188 1204 1220 1236 1216 1196 1226 1257 1246 1236
2337 1236 1225 1214 1188 1162 1136 1110 1106 1101 1045 989 1042 1094 1080 981 912 928 1039 1150 1208 1180 1121 1112 1154 1196 1206 1132 1082 1083 1102 1120 1123 1127 1130 1134 1135 1137 1189 1242
2332 1242 1257 1271 1285 1300 1282 1265 1299 1333 1322 1311 1300 1289 1209 1129 1134 1139 1143 1147 1151 1155 1195 1235 1275 1314 1249 1183 1151 1205 1287 1319 1265 1211 1197 1183 1168 1154 1150 1145
$$ packed form
2363A034l6J5J5J1J1J0J1L1L0n5n5P8P9N0n1n6n5K3K4mlM8M8l6l6l7l6mmnmk8k8Q5Q5N5m7
2358A163n3M8O2m1o2o2L3L3Q4Q3M7M7p3p2J4J3l7l7l1l0l1l0K6K6L8o3p5K8Q3Q2pqn9n9K8
2354A108K7K8K7l9m0J1J2l4l4J7J8J3J3J3J3J9J9J8J9pqn9n9L6L5L6L5N1N0l4l5J1J0J1J0
2350A311l0l0l0l0l2l2K0J9j9k0O7O6l3l2l3l2M0M0j2j1j5j6j6j5J6J7J6J6l0l1N5N5j1j2
2346A216j1j1j8j8L3L4o8o8o8o8PPOPJ08J08N7N7l6l6l6l6n1n1n0n1m4m4P5J27P6j0l9J3N3
2341A170N3NNJ0Rp0p1k4O2R4M2onQO0N6k9j32j32m3m3M2M2M3M3rqJ6J6J6J6k0k0L0L1j1j0
2337A236j1j1k6k6k6k6mnn6n6N3N2j4r9o9J6J11J11N8k8n9rM2M2J0p4n0JJ9J8LMLMJKN2N3
2332A242J5J4J4J5j8j7L4L4j1j1j1j1q0q0NNMMMMM0M0M0L9o5o6l2N4Q2L2n4n4j4j4j5j4mn
$$ plain form
2328 1145 1141 1136 1164 1191 1168 1144 1146 1148 1202 1255 1197 1138 1146 1238 1313 1302 1260 1217 1200 1183 1166 1149 1146 1143 1089 1035 1040 1045 1050 1054 1055 1055 1055 1055 1093 1132 1170 1209 1162 1116 1070 1024
2323 1024 1053 1083 1112 1141 1092 1043 1045 1047 1072 1096 1070 1043 1068 1093 1005 917 913 1012 1110 1107 1044 981 963 946 1023 1100 1177 1254 1215 1177 1139 1101 1079 1057 1120 1183
2318 1183 1176 1169 1162 1156 1114 1072 1115 1158 1217 1276 1249 1222 1202 1182 1162 1142 1148 1153 1159 1164 1109 1054 999 944 971 998 1076 1154 1177 1199 1222 1245 1278 1311 1258 1206 1146 1086
2313 1086 1111 1137 1091 1045 1084 1123 1155 1187 1219 1251 1247 1243 1188 1133 1146 1158 1170 1183 1176 1170 1164 1157 1238 1319 1339 1255 1189 1122 1134 1146 1150 1153 1106 1058 1101 1144 1136 1128 1085
2309 1085 1041 1083 1125 1174 1222 1271 1320 1348 1376 1285 1194 1211 1229 1202 1174 1125 1179 1233 1184 1176 1168 1153 1139 1084 1029 1059 1089 1062 1035 1121 1207 1265 1221 1149 1077
2304 1077 1022 967 1059 1151 1235 1218 1172 1126 1181 1235 1347 1357 1307 1256 1285 1314 1287 1259 1232 1205 1211 1218 1174 1129 1124 1119 1113 1108 1094 1080 1067 1053 1012 972 1044 1117 1222
2300 1222 1225 1166 1108 1084 1061 1122 1184 1236 1289 1221 1154 1172 1191 1209 1227 1143 1059 1060 1061 1060 1058 1057 1055 1083 1112 1140 1169 1138 1107 1128 1148 1153 1158 1162 1167 1138 1109 1080 1051 1094
2295 1094 1138 1130 1122 1189 1255 1271 1286 1280 1274 1224 1173 1080 1090 1127 1164 1144 1124 1182 1241 1268 1193 1124 1056 1065 1074 1083 1092 1067 1042 1068 1094 1108 1121 1134 1148 1152 1156 1205 1254
$$ packed form
2328A145mnK8K7k3k4KKN4N3n8n9QR2P5j1m2m3j7j7j7j7lln4n4NNNMJ%%%L8L9L8L9m7m6m6m6
2323A024K9L0K9K9m9m9KKK5K4k6k7K5K5q8q8mR9R8lo3o3j8j7P7P7P7P7l9l8l8l8k2k2O3O3
2318A183pppom2m2M3M3N9N9k7k7k0k0k0k0ONONn5n5n5n5K7K7P8P8K3K2K3K3L3L3n3n2o0o0
2313A086K5K6m6m6L9L9L2L2L2L2mmn5n5J3J2J2J3poopQ1Q1K0q4o6o7J2J2MLm7m8M3M3qqm3
2309A085m4M2M2M9M8M9M9K8K8r1r1J7J8k7k8m9N4N4m9qqj5j4n5n5L0L0k7k7Q6Q6N8m4p2p2
2304A077n5n5R2R2Q4j7m6m6N5N4J12J0n0n1K9K9k7k8k7k7OPm4m5nnonj4j4j3j4m1m0P2P3J05
2300A222Ln9n8k4k3O1O2N2N3o8o7J8J9J8J8q4q4JJjkjkK8K9K8K9l1l1K1K0NNMNk9k9k9k9M3
2295A094M4qqO7O6J6J5oon0n1r3J0L7L7k0k0N8N9K7p5o9o8RRRRk5k5K6K6J4J3J3J4MMM9M9
$$ plain form
2290 1254 1266 1176 1130 1186 1281 1273 1244 1214 1225 1237 1197 1157 1180 1203 1174 1146 1162 1177 1193 1208 1225 1242 1208 1173 1173 1173 1172 1172 1166 1159 1238 1316 1309 1301 1293 1286 1203 1121 1039 957
2285 957 1020 1083 1125 1064 1017 1073 1149 1226 1209 1192 1175 1158 1144 1129 1115 1101 1035 970 1024 1077 1081 1085 1140 1195 1216 1237 1251 1266 1268 1168 1068 1070 1093 1115 1144 1173
2281 1173 1159 1145 1176 1207 1157 1004 813 793 912 1031 1075 1119 1125 1131 1137 1142 1172 1202 1146 1090 1126 1163 1199 1235 1230 1225 1175 1125 1118 1213 1308 1301 1276 1251 1298 1345
2277 1345 1370 1293 1160 1027 1016 1107 1259 1412 1405 1398 1340 1282 1228 1175 1173 1171 1186 1202 1243 1284 1263 1243 1222 1202 1149 1096 1094 1092 1150 1207 1179 1151 1170 1189 1157
2272 1157 1124 1085 1046 1093 1139 1174 1210 1194 1178 1160 1143 1100 1058 1047 1037 1027 1016 1055 1093 1131 1169 1216 1263 1258 1254 1177 1100 1177 1254 1271 1289 1306 1323 1307 1292
2268 1292 1276 1260 1235 1210 1185 1159 1127 1094 1113 1132 1091 1051 1061 1072 1116 1161 1180 1199 1188 1178 1167 1157 1142 1128 1114 1099 1140 1181 1171 1161 1128 1096 1149 1202
2264 1202 1229 1256 1232 1208 1188 1168 1199 1230 1229 1228 1176 1123 1072 1020 1121 1223 1242 1260 1193 1127 1088 1050 1097 1144 1171 1197 1249 1301 1306 1311 1317 1322 1335 1349 1362 1375
2259 1375 1353 1331 1309 1288 1278 1269 1260 1251 1210 1170 1129 1089 1158 1228 1297 1366 1283 1200 1168 1137 1185 1233 1230 1227 1131 1035 1059 1083 1164 1245 1207 1169 1113 1057 1086 1116 1111
$$ packed form
2290A254J2r0m6N6R5qk9l0J1J2m0m0K3K3k9k8J6J5J6J5J7J7l4l5%%j%opP9P8pqqpq3q2q2q2
2285I57O3O3M2o1m7N6P6P7j7j7j7j7j4j5j4j4o6o5N4N3MMN5N5K1K1J4J5Kj00j00KK3K2K9K9
2281A173j4j4L1L1n0j53j91k0J19J19M4M4OOONL0L0n6n6L6L7L6L6nnn0n0pR5R5pk5k5M7M7
2277A345K5p7j33j33j1R1J52J53ppn8n8n4n3kkJ5J6M1M1k1k0k1k0n3n3kkN8N7k8k8J9J9l2
2272A157l3l9l9M7M6L5L6j6j6j8j7m3m2j1j0j0j1L9L8L8L8M7M7nmp7p7P7P7J7J8J7J7j6j5
2268A292j6j6k5k5k5k6l2l3J9J9m1m0J0J1M4M5J9J9j1j0j1j0j5j4j4j5M1M1j0j0l3l2N3N3
2264A202K7K7k4k4k0k0L1L1jjn2n3n1n2J01J02J9J8o7o6l9l8M7M7K7K6N2N2NNONJ3J4J3J3
2259A375k2k2k2k1j0rrrm1m0m1m0O9P0O9O9q3q3l2l1M8M8llr6r6K4K4Q1Q1l8l8n6n6K9L0n
$$ plain form
2255 1111 1107 1102 1097 1141 1185 1229 1273 1225 1177 1215 1252 1286 1320 1269 1217 1180 1144 1132 1121 1124 1128 1217 1306 1332 1358 1298 1238 1192 1145 1218 1291 1359 1426 1374 1322 1258 1194
2250 1194 1129 1065 1031 998 1015 1033 1112 1191 1184 1177 1181 1185 1163 1141 1139 1137 1135 1133 1130 1127 1123 1120 1118 1115 1113 1110 1102 1095 1087 1079 1119 1159 1113 1068 1054 1040 1078 1116 1102 1089 1076 1063 1056 1049 1042 1035
2245 1035 1081 1126 1120 1114 1092 1070 1099 1129 1161 1194 1175 1157 1132 1107 1082 1057 1069 1080 1091 1103 1136 1168 1150 1131 1101 1071 1126 1181 1124 1067 1010 953 1002 1051 1021
2240 1021 992 961 1032 1098 1163 1128 1094 1172 1250 1320 1288 1228 1168 1166 1164 1241 1317 1353 1286 1219 1254 1302 1349 1318 1287 1265 1244 1222 1201 1213 1225 1237 1249 1253 1258 1314
2236 1314 1369 1308 1246 1185 1123 1138 1152 1166 1180 1221 1262 1302 1343 1399 1455 1425 1396 1381 1367 1301 1235 1183 1132 1165 1199 1204 1210 1216 1222 1220 1218 1217 1215 1211 1207 1145 1186 1293 1401
2231 1401 1362 1323 1308 1293 1279 1264 1199 1134 1121 1107 1182 1256 1303 1247 1193 1140 1080 1020 1023 1026 1030 1033 1024 1014 1008 1002 1005 1059 1133 1121 1082 1042 1049 1055 1042 1029 1102 1174 1155
2227 1155 1136 1117 1098 1137 1177 1211 1246 1250 1170 1062 1006 1065 1209 1305 1316 1239 1161 1084 1006 949 978 1078 1178 1255 1331 1323 1314 1246 1178 1162 1145 1136 1127 1066 1006
2222 1006 1056 1106 1157 1207 1133 1060 1072 1084 1136 1189 1241 1293 1284 1274 1311 1347 1364 1295 1226 1242 1267 1293 1323 1353 1362 1370 1297 1223 1209 1246 1303 1274 1165 1056 1061
$$ packed form
2255A111mnnM4M4M4M4m8m8L8L7L4L4n1n2l7l6j2j1LMQ9Q9K6K6o0o0m6m7P3P3O8O7n2n2o4o4
2250A194o5o4l4l3J7J8P9P9ppMMk2k2kkkkllmlklklqpqqM0M0m6m5j4j4L8L8j4j3j3j3pppp
2245A035M6M5ook2k2K9L0L2L3j9j8k5k5k5k5J2J1J1J2L3L2j8j9l0l0N5N5n7n7n7n7M9M9l0
2240A021k9l1P1O6O5l5l4P8P8P0l2o0o0kkP7P6L6o7o7L5M8M7l1l1k2k1k2k1J2J2J2J2MNN6
2236A314N5o1o2o1o2J5J4J4J4M1M1M0M1N6N6l0k9j5j4o6o6n2n1L3L4NOOOkkjkmmo2M1J07J08
2231A401l9l9j5j5j4j5o5o5j3j4P5P4M7n6n4n3o0o0LLMLrj0ooLN4P4j2l9m0POj3j3P3P2j9
2227A155j9j9j9L9M0L4L5Mq0j08n6N9J44R6J1p7p8p7p8n7K9J00J00P7P6qro8o8j6j7rro1o0
2222A006N0N0N1N0p4p3J2J2N2N3N2N2rj0L7L6J7o9o9J6K5K6L0L0RQp3p4j4L7N7k9j09j09N
$$ plain form
2218 1061 1067 1040 1013 1037 1062 1136 1209 1278 1347 1365 1298 1180 1148 1175 1202 1183 1164 1211 1258 1186 1113 1083 1053 1074 1095 1091 1086 1036 985 992 1085 1206 1277 1291 1255
2214 1255 1193 1131 1098 1065 1031 998 1037 1077 1116 1155 1112 1068 1075 1083 1120 1158 1144 1130 1100 1070 1040 1010 976 943 910 876 896 915 934 953 991 1029 1112 1195 1258
2209 1258 1218 1117 1015 1029 1044 1059 1073 1011 950 973 997 1070 1144 1218 1291 1264 1236 1208 1180 1194 1208 1171 1133 1116 1098 1080 1062 1082 1103 1045 986 980 1076 1173
2205 1173 1167 1164 1161 1152 1143 1182 1221 1260 1299 1289 1278 1217 1156 1209 1262 1293 1222 1165 1211 1250 1186 1083 980 962 944 1010 1178 1296 1311 1170 1029 978 1029 1077
2201 1077 1125 1129 1132 1158 1183 1209 1235 1134 1033 993 1057 1149 1241 1221 1200 1202 1204 1205 1207 1178 1148 1170 1192 1172 1152 1132 1112 1116 1120 1123 1127 1150 1172 1144 1116 1069 1023 1027 1032
2196 1032 1000 968 1022 1076 1163 1251 1287 1324 1377 1429 1482 1534 1568 1603 1688 1774 1701 1629 1557 1484 1408 1331 1306 1280 1261 1242 1223 1204 1226 1247 1348 1448 1497
2192 1497 1442 1327 1211 1221 1231 1292 1353 1349 1344 1288 1232 1183 1134 1170 1206 1130 1054 1034 1116 1165 1112 1065 1121 1217 1313 1296 1279 1304 1329 1354 1379 1409 1438 1348
2188 1348 1258 1263 1269 1274 1279 1256 1232 1209 1186 1172 1158 1145 1131 1104 1078 1096 1114 1171 1125 1052 979 980 981 982 984 1044 1105 1166 1226 1206 1186 1165 1145 1181 1216 1252 1288 1271
$$ packed form
2218A061Ok7k7K4K5P4P3O9O9J8o7j18l2K7K7j9j9M7M7p2p3l0l0K1K1mnn0n1PR3J21P1J4l6
2214A255o2o2l3l3l4l3L9M0L9L9m3m4PQL7L8j4j4l0l0l0l0l4l3l3l4K0J9J9J9L8L8Q3Q3O3
2209A258m0j01j02J4J5J5J4o2o1K3K4P3P4P4P3k7k8k8k8J4J4l7l8j7j8j8j8K0K1n8n9oR6R7
2205A173ollrrL9L9L9L9j0j1o1o1N3N3L1p1n7M6L9o4j03j03j8j8O6J68J18J5j41j41n1N1M8
2201A077M8MLK6K5K6K6j01j01m0O4R2R2k0k1KKJKk9l0K2K2k0k0k0k0MMLMK3K2k8k8m7m6MN
2196A032l2l2N4N4Q7Q8L6L7N3N2N3N2L4L5Q5Q6p3p2p2p3p6p7k5k6j9j9j9j9K2K1J01J00M9
2192A497n5j15j16J0J0O1O1mnn6n6m9m9L6L6p6p6k0Q2M9n3m7N6R6R6j7j7K5K5K5K5L0K9r0
2188A348r0NONNk3k4k3k3j4j4j3j4k7k6J8J8N7m6p3p3JJJKO0O1O1O0k0k0k1k0L6L5L6L6j7
$$ plain form
2184 1271 1254 1238 1221 1154 1086 1070 1054 1073 1091 1110 1129 1125 1121 1117 1113 1055 998 1089 1180 1269 1274 1241 1208 1172 1136 1100 1064 1101 1139 1176 1214 1169 1124 1085 1046 978 995
2179 995 1084 1172 1166 1160 1154 1147 1164 1180 1145 1110 1089 1067 1097 1127 1182 1236 1205 1123 1119 1201 1280 1274 1256 1238 1266 1294 1213 1131 1100 1070 1080 1090 1151 1212 1258 1305 1300 1295 1202
2174 1202 1109 1067 1026 1031 1036 1155 1275 1297 1235 1140 1097 1094 1091 1171 1251 1304 1271 1235 1199 1179 1159 1136 1113 1077 990 884 863 906 949 998 1046 1040 1034 1028 1022 1084 1145
2170 1145 1155 1165 1159 1153 1147 1141 1044 946 968 990 1041 1092 1143 1195 1206 1218 1230 1242 1211 1180 1150 1119 1110 1100 1091 1082 1113 1145 1176 1207 1236 1264 1292 1320 1356 1391 1375 1359
2165 1359 1326 1292 1258 1224 1183 1142 1102 1061 1039 1016 1045 1074 1112 1151 1189 1228 1243 1258 1273 1288 1289 1291 1207 1123 1113 1104 1094 1085 1093 1102 1059 1016 1102 1189 1190 1191 1133 1075
2160 1075 1103 1131 1186 1241 1211 1181 1185 1190 1245 1300 1293 1285 1278 1270 1347 1424 1381 1338 1328 1317 1358 1398 1367 1336 1305 1274 1238 1202 1217 1231 1200 1169 1257 1346 1315 1284 1252
2156 1252 1221 1244 1267 1289 1312 1325 1338 1300 1262 1217 1172 1127 1082 1147 1213 1160 1106 1090 1074 1058 1041 1061 1082 1102 1122 1097 1073 1134 1195 1194 1192 1139 1086 1068 1051
2152 1051 1085 1118 1171 1224 1158 1091 1112 1132 1101 1070 1076 1081 1138 1195 1245 1295 1294 1294 1233 1173 1197 1222 1181 1140 1151 1161 1180 1199 1133 1066 1063 1060 1142 1224 1165 1107 1099 1092
$$ packed form
2184A271j7j6j7o7o8j6j6J9J8J9J9mmmmn8n7R1R1Q9Nl3l3l6l6l6l6L7L8L7L8m5m5l9l9o8J7
2179I95Q9Q8ooopJ7J6l5l5k1k2L0L0N5N4l1q2mQ2P9oj8j8K8K8q1q2l1l0J0J0O1O1M6M7nnr3
2174A202r3m2m1NNJ19J20K2o2r5m3llQ0Q0N3l3l6l6k0k0k3k3l6q7j06k1M3M3M9M8ooooO2O1
2170A145J0J0oooor7r8K2K2N1N1N1N2J1J2J2J2l1l1l0l1rj0rrL1L2L1L1K9K8K8K8L6L5j6j6
2165A359l3l4l4l4m1m1m0m1k2k3K9K9L8L9L8L9J5J5J5J5JKq4q4j0rj0rQRm3m3Q6Q7JJn8n8
2160A075K8K8N5N5l0l0MNN5N5pqpqP7P7m3m3j0j1M1M0l1l1l1l1l6l6J5J4l1l1Q8Q9l1l1l2
2156A252l1K3K3K2K3J3J3l8l8m5m5m5m5O5O6n3n4j6j6j6j7K0K1K0K0k5k4O1O1jkn3n3j8j7
2152A051L4L3N3N3o6o7K1K0l1l1ONN7N7N0N0j%o1o0K4K5m1m1J1J0J9J9o6o7llQ2Q2n9n8qp
$$ plain form
2147 1092 1186 1279 1322 1365 1327 1290 1253 1215 1167 1119 1122 1125 1143 1161 1179 1197 1248 1299 1299 1299 1204 1109 1065 1021 1071 1120 1084 1048 1017 985 954 922 939 956 973 990
2143 990 1053 1117 1181 1245 1265 1285 1306 1326 1270 1213 1208 1203 1122 1041 1079 1118 1130 1143 1156 1169 1195 1221 1246 1272 1223 1175 1211 1247 1222 1197 1222 1248 1229 1210 1191 1172
2138 1172 1215 1257 1299 1341 1390 1439 1402 1365 1395 1426 1404 1383 1327 1271 1214 1158 1187 1217 1196 1174 1115 1056 1083 1109 1230 1352 1388 1424 1458 1491 1440 1389 1305
2134 1305 1222 1190 1158 1161 1164 1167 1170 1191 1212 1181 1151 1131 1111 1091 1072 1068 1064 1112 1159 1138 1118 1148 1230 1332 1349 1298 1247 1241 1236 1231 1226 1188 1150 1112 1074 1046 1018 1041 1064
2129 1064 1088 1112 1135 1159 1164 1169 1225 1280 1266 1252 1238 1224 1265 1307 1343 1379 1336 1207 1122 1191 1321 1401 1399 1397 1397 1396 1247 1098 1031 1048 1103 1158 1174 1189 1205
2125 1205 1220 1241 1262 1283 1304 1282 1259 1236 1214 1258 1302 1296 1289 1305 1321 1337 1353 1327 1301 1276 1250 1226 1202 1177 1153 1190 1226 1263 1299 1263 1227 1277 1326 1304 1282
2121 1282 1209 1135 1101 1067 1084 1100 1189 1277 1328 1294 1227 1160 1173 1186 1227 1268 1223 1179 1173 1167 1212 1258 1267 1276 1234 1192 1080 968 976 983 907 830 907 984 1037 1089
2116 1089 1142 1195 1220 1244 1268 1292 1285 1279 1272 1265 1237 1209 1181 1153 1175 1197 1218 1240 1261 1281 1251 1220 1250 1280 1310 1339 1412 1484 1437 1390 1388 1386 1384 1381 1302 1223 1144 1065
$$ packed form
2147A092R4R3M3M3l8l7l7l8m8m8LLJ8J8J8J8N1N1%%r5r5m4m4N0M9l6l6l1l2l1l2J7J7J7J7
2143I90O3O4O4O4K0K0K1K0n6n7nnq1q1L8L9J2J3J3J3K6K6K5K6m9m8L6L6k5k5K5K6j9j9j9j9
2138A172M3M2M2M2M9M9l7l7L0L1k2k1n6n6n7n6K9L0k1k2n9n9K7K6J21J22L6L6L4L3n1n1q4
2134A305q3l2l2LLLLK1K1l1l0k0k0k0j9mmM8M7k1k0L0Q2J02J7n1n1onnnl8l8l8l8k8k8K3K3
2129A064K4K4K3K4NNN6N5j4j4j4j4M1M2L6L6m3j29q5O9J30Q0kk%jj49j49o7J7N5N5J6J5J6
2125A205J5K1K1K1K1k2k3k3k2M4M4opJ6J6J6J6k6k6k5k6k4k4k5k4L7L6L7L6l6l6N0M9k2k2
2121A282p3p4l4l4J7J6Q9Q8N1l4o7o7J3J3M1M1m5m4ooM5M6RRm2m2j12j12QPp6p7P7P7N3N2
2116A089N3N3K5K4K4K4poppk8k8k8k8K2K2K1K2K1K0l0l1L0L0L0K9P3P2m7m7kkklp9p9p9p9
$$ plain form
2112 1065 1102 1139 1227 1314 1351 1388 1305 1222 1173 1123 1074 1024 994 963 984 1005 1102 1199 1296 1393 1338 1284 1229 1175 1133 1091 1100 1110 1103 1096 1090 1083 1134 1186 1237 1289 1250
2107 1250 1212 1174 1136 1132 1128 1123 1119 1199 1279 1308 1337 1262 1186 1111 1036 1059 1082 1054 1026 1093 1161 1228 1296 1296 1296 1296 1297 1304 1311 1318 1326 1286 1246 1207 1167 1165 1163 1161 1159 1204 1249 1294
2102 1294 1339 1281 1222 1164 1105 1073 1040 1092 1145 1196 1248 1180 1112 1167 1222 1226 1229 1181 1133 1085 1037 1041 1046 1050 1054 1068 1083 1097 1112 1029 947 984 1021 1121 1221 1322
2098 1322 1422 1360 1298 1237 1175 1171 1167 1111 1056 1072 1088 1155 1223 1310 1398 1383 1283 1224 1217 1227 1236 1257 1278 1298 1319 1293 1267 1241 1214 1221 1227 1182 1137 1122 1107 1144
2093 1144 1180 1170 1159 1149 1139 1079 1018 1009 1000 1063 1127 1139 1151 1111 1071 1082 1093 1147 1200 1253 1306 1265 1225 1184 1143 1080 1017 1071 1177 1204 1112 1043 1059 1127 1195
2089 1195 1183 1171 1155 1139 1123 1106 1161 1216 1189 1161 1119 1128 1156 1099 1002 905 957 1008 1099 1190 1196 1201 1174 1147 1205 1263 1238 1213 1188 1163 1159 1155 1151 1147 1140 1133 1126 1119 1148 1176
2084 1176 1154 1132 1125 1119 1198 1277 1302 1328 1302 1277 1267 1258 1248 1239 1189 1138 1140 1141 1199 1258 1231 1205 1205 1205 1205 1205 1146 1086 1146 1206 1204 1201 1199 1196 1239 1283 1241 1199 1190 1181 1223 1265
2079 1265 1292 1318 1259 1200 1197 1194 1191 1188 1189 1190 1192 1193 1147 1101 1103 1104 1104 1053 979 990 1101 1160 1134 1108 1136 1165 1142 1119 1154 1189 1223 1258 1306 1354 1350 1347 1344 1341 1338 1335 1317 1300
$$ packed form
2112A065L7L7Q8Q7L7L7q3q3m9n0m9n0l0l1K1K1R7R7R7R7n5n4n5n4m2m2RJ0ppopN1N2N1N2l9
2107A250l8l8l8mmnmQ0Q0K9K9p5p6p5p5K3K3k8k8O7O8O7O8%%%JPPPQm0m0l9m0kkkkM5M5M5
2102A294M5n8n9n8n9l2l3N2N3N1N2o8o8N5N5MLm8m8m8m8MNMMJ4J5J4J5q3q2L7L7J00J00J01
2098A322J00o2o2o1o2mmn6n5J6J6O7O8Q7Q8j5j00n9pJ0RK1K1K0K1k6k6k6k7POm5m5j5j5L7
2093A144L6j0j1j0j0o0o1rrO3O4J2J2m0m0J1J1N4N3N3N3m1m0m1m1o3o3N4J06K7r2o9J6O8O8
2089A195j2j2j6j6j6j7N5N5k7k8m2RK8n7r7r7N2N1R1R1ONk7k7N8N8k5k5k5k5mmmmppppK9K8
2084A176k2k2poP9P9K5K6k6k5j0rj0rn0n1KJN8N9k7k6%%%%n9o0O0O0klklM3M4m2m2rrM2M2
2079A265K7K6n9n9llllJJKJm6m6KJ%n1p4J1J11N9k6k6K8K9k3k3L5L5L4L5M8M8mlllllj8j7
$$ plain form
2074 1300 1285 1270 1292 1365 1375 1299 1210 1172 1151 1130 1130 1129 1132 1135 1159 1235 1329 1339 1259 1180 1180 1181 1202 1224 1167 1110 1091 1175 1230 1233 1180 1128 1075 1022 1104 1237 1317
2069 1317 1295 1223 1203 1227 1201 1086 971 1007 1042 1085 1127 1117 1108 1129 1150 1155 1109 1041 1076 1198 1269 1209 1149 1171 1193 1169 1145 1121 1097 1028 959 1009 1059 1109
2065 1109 1160 1159 1158 1115 1071 1032 992 1048 1155 1240 1222 1167 1112 1170 1228 1232 1235 1188 1140 1130 1120 1111 1101 1075 1049 1109 1169 1221 1273 1274 1274 1263 1251 1239 1227 1196 1165
2061 1165 1134 1103 1118 1134 1150 1166 1144 1121 1099 1076 1076 1077 1077 1077 1156 1235 1195 1155 1181 1208 1235 1262 1225 1188 1150 1113 1077 1042 1092 1142 1234 1326 1332 1339 1301 1263 1224
2056 1224 1186 1214 1241 1269 1297 1228 1160 1143 1126 1122 1118 1199 1281 1291 1301 1260 1219 1257 1296 1334 1373 1315 1258 1201 1143 1216 1289 1311 1333 1303 1272 1242 1212 1206 1200 1194 1188
2052 1188 1172 1156 1141 1125 1234 1342 1400 1458 1415 1372 1336 1300 1255 1312 1363 1414 1349 1285 1221 1157 1129 1102 1159 1217 1231 1245 1311 1376 1309 1241 1168 1196 1247
2048 1247 1298 1236 1174 1179 1183 1188 1193 1245 1298 1401 1505 1464 1423 1433 1444 1451 1458 1414 1369 1362 1355 1348 1341 1226 1111 1058 1107 1184 1261 1259 1257 1214 1171 1180 1189 1205 1221 1185 1150
2043 1150 1177 1204 1230 1257 1216 1174 1133 1091 1105 1119 1133 1147 1157 1168 1178 1188 1198 1208 1218 1228 1235 1242 1249 1256 1213 1170 1179 1187 1194 1201 1208 1214 1250 1286 1236 1187 1167 1147 1247
$$ packed form
2074A300j5j5K2P3J0p6q9l8k1k1%jLLK4P6R4J0q0p9%JK1K2n7n7j9Q4N5Ln3n2n3n3Q2J33Q0
2069A317k2p2k0K4k6j15j15L6L5M3M2j0rK1K1Nm6o8L5J22P1o0o0K2K2k4k4k4k4o9o9N0N0N0
2065A109N1jjm3m4l9m0N6J07Q5j8n5n5N8N8MLm7m8j0j0rj0k6k6O0O0N2N2J%j1j2j2j2l1l1
2061A165l1l1J5J6J6J6k2k3k2k3%J%%P9P9m0m0K6K7K7K7l7l7l8l7l6l5N0N0R2R2OPl8l8l9
2056A224l8K8K7K8K8o9o8j7j7mmQ1Q2J0J0m1m1L8L9L8L9n8n7n7n8P3P3K2K2l0l1l0l0oooo
2052A188j6j6j5j6J09J08N8N8m3m3l6l6m5N7N1N1o5o4o4o4k8k7N7N8J4J4O6O5o7o8p3K8N1
2048A247N1o2o2NMNNN2N3J03J04m1m1J0J1PPm4m5ppppj15j15n3M9P7P7kkm3m3RRJ6J6l6l5
2043A150K7K7K6K7m1m2m1m2J4J4J4J4J0J1J0J0J0J0J0J0PPPPm3m3RQPPPOL6L6n0m9k0k0J00
$$ plain form
2038 1247 1346 1347 1347 1297 1246 1218 1191 1163 1135 1095 1054 1099 1143 1149 1154 1160 1165 1211 1257 1303 1348 1348 1348 1297 1246 1225 1204 1234 1263 1230 1197 1164 1131 1099 1067 1087 1106 1176
2033 1176 1247 1266 1285 1306 1328 1349 1371 1362 1353 1345 1336 1349 1362 1375 1388 1364 1341 1317 1294 1308 1322 1216 1110 1128 1146 1164 1181 1211 1240 1218 1197 1191 1185 1231 1276 1301
2029 1301 1327 1232 1138 1176 1213 1251 1289 1231 1174 1168 1162 1187 1211 1184 1158 1089 1021 1072 1123 1153 1182 1211 1241 1317 1393 1316 1239 1207 1175 1142 1110 1166 1223 1279 1335
2025 1335 1290 1244 1199 1153 1106 1060 1013 967 992 1018 1124 1230 1300 1284 1232 1179 1186 1193 1149 1105 1140 1175 1256 1336 1345 1269 1160 1052 1062 1157 1233 1258 1251 1245 1236
2020 1236 1227 1261 1296 1330 1364 1358 1352 1295 1237 1174 1112 1134 1157 1216 1275 1214 1154 1160 1166 1171 1177 1212 1247 1283 1318 1326 1335 1292 1250 1228 1207 1186 1165 1184 1204 1223 1242 1164 1086
2016 1086 1093 1100 1115 1129 1144 1158 1179 1199 1219 1239 1247 1254 1261 1269 1231 1193 1155 1117 1095 1073 1137 1200 1214 1228 1241 1255 1310 1364 1333 1302 1265 1229 1144 1144 1272 1399 1449
2011 1449 1379 1304 1279 1270 1261 1252 1243 1285 1327 1286 1245 1204 1162 1224 1285 1309 1247 1169 1090 1160 1230 1268 1307 1346 1385 1361 1337 1263 1188 1206 1224 1191 1157 1126 1094 1148
2007 1148 1201 1239 1276 1308 1339 1333 1225 1066 1010 1062 1114 1172 1230 1249 1268 1202 1135 1118 1101 1134 1168 1197 1225 1254 1282 1352 1422 1407 1392 1343 1294 1297 1299 1280 1262
$$ packed form
2038A247R9J%n0n1k8k7k8k8m0m1M5M4ONONM6M6M6M5%%n1n1k1k1L0K9l3l3l3l3l2l2K0J9P0
2033A176P1J9J9K1K2K1K2rrqrJ3J3J3J3k4k3k4k3J4J4j06j06J8J8J8J7L0K9k2k1ooM6M5K5
2029A301K6r5r4L8L7L8L8n8n7ooK5K4k7k6o9o8N1N1L0K9K9L0P6P6p7p7l2l2l3l2N6N7N6N6
2025A335m5m6m5m6m7m6m7m6K5K6J06J06P0j6n2n3PPm4m4L5L5Q1Q0Rp6j09j08J0R5P6K5por
2020A236rL4L5L4L4oon7n8o3o2K2K3N9N9o1o0OONOL5L5L6L5QRm3m2k2k1k1k1J9K0J9J9p8p8
2016A086PPJ5J4J5J4K1K0K0K0QPPQl8l8l8l8k2k2O4O3J4J4J3J4N5N4l1l1l7l6q5%J28J27N0
2011A449p0p5k5rrrrM2M2m1m1m1m2O2O1K4o2p8p9P0P0L8L9L9L9k4k4p4p5J8J8l3l4l1l2N4
2007A148N3L8L7L2L1oj08j59n6N2N2N8N8J9J9o6o7j7j7L3L4K9K8K9K8P0P0j5j5m9m9LKj9j8
$$ plain form
2002 1262 1191 1121 1181 1240 1248 1256 1234 1213 1191 1169 1185 1201 1217 1233 1213 1192 1223 1254 1323 1391 1340 1289 1234 1179 1209 1239 1283 1327 1286 1245 1273 1300 1333 1265 1205
1998 1205 1144 1163 1182 1199 1217 1235 1252 1278 1305 1246 1187 1154 1122 1141 1160 1240 1321 1374 1325 1244 1164 1197 1229 1223 1217 1210 1204 1175 1147 1118 1089 1132 1175 1218 1260 1253 1246
1994 1246 1159 1073 1044 1117 1162 1155 1140 1125 1107 1088 1108 1127 1147 1166 1175 1184 1244 1304 1358 1412 1415 1418 1423 1428 1382 1336 1239 1142 1130 1118 1124 1130 1136 1143 1216 1289 1311 1332 1269 1206
1989 1206 1226 1298 1338 1275 1193 1162 1176 1190 1207 1224 1251 1278 1254 1231 1228 1226 1274 1323 1332 1341 1350 1360 1330 1301 1272 1243 1294 1344 1344 1344 1339 1334 1330 1325 1339 1352 1314 1277 1306 1336
1984 1336 1365 1395 1350 1305 1296 1235 1194 1255 1313 1268 1162 1056 1063 1070 1091 1112 1133 1154 1111 1068 1025 982 1020 1058 1181 1304 1356 1409 1410 1411 1359 1306 1305 1304 1284 1264
1979 1264 1193 1122 1143 1165 1186 1208 1154 1101 1132 1164 1217 1270 1238 1205 1181 1157 1133 1109 1138 1167 1196 1225 1226 1228 1280 1333 1349 1366 1297 1228 1253 1278 1303 1329 1310
1975 1310 1292 1273 1255 1267 1280 1292 1305 1276 1246 1217 1188 1210 1231 1201 1171 1152 1133 1114 1094 1114 1133 1203 1274 1234 1195 1155 1116 1119 1122 1126 1129 1188 1247 1305 1364 1327
1971 1327 1290 1253 1215 1259 1303 1296 1288 1327 1365 1352 1339 1310 1281 1304 1326 1301 1276 1251 1227 1221 1215 1160 1053 963 976 1082 1188 1196 1205 1214 1222 1273 1324 1289 1254 1197 1140
$$ packed form
2002A262p1p0O0N9QQk2k1k2k2J6J6J6J6k0k1L1L1O9O8n1n1n5n5L0L0M4M4m1m1K8K7L3o8o0
1998A205o1J9J9J7J8J8J7K6K7n9n9l3l2J9J9Q0Q1N3m9q1q0L3L2oopok9k8k9k9M3M3M3M2pp
1994A246q7q6k9P3M5pj5j5j8j9K0J9K0J9RRO0O0N4N4LLNNm6m6r7r7j2j2OOOPP3P3K2K1o3o3
1989A206K0P2M0o3q2l1J4J4J7J7K7K7k4k3lkM8M9RRRJ0l0k9k9k9N1N0%%nnmnJ4J3l8l7K9L0
1984A336K9L0m5m5ro1m1O1N8m5j06j06PPK1K1K1K1m3m3m3m3L8L8J23J23N2N3JJn2n3jjk0k0
1979A264p1p1K1K2K1K2n4n3L1L2N3N3l2l3k4k4k4k4K9K9K9K9JKN2N3J6J7o9o9K5K5K5K6j9
1975A310j8j9j8J2J3J2J3k9l0k9k9K2K1l0l0j9j9j9k0K0J9P0P1m0l9m0l9LLMLN9N9N8N9l7
1971A327l7l7l8M4M4pqL9L8j3j3k9k9K3K2k5k5k5k4oon5j07r0J3J06J06QRRQN1N1l5l5n7n7
$$ plain form
1966 1140 1134 1129 1157 1186 1164 1142 1123 1104 1136 1168 1185 1202 1218 1235 1212 1188 1113 1038 1034 1030 1032 1034 1067 1202 1338 1371 1328 1285 1236 1186 1164 1141 1169 1198 1210 1221
1962 1221 1233 1245 1292 1339 1334 1330 1316 1302 1339 1376 1331 1286 1241 1196 1192 1189 1271 1353 1337 1321 1305 1288 1313 1338 1312 1286 1233 1180 1127 1074 1068 1061 1055 1048 1063 1078 1144 1210
1957 1210 1206 1201 1248 1295 1321 1346 1286 1227 1227 1227 1278 1330 1344 1358 1372 1386 1281 1177 1191 1256 1263 1168 1105 1093 1094 1095 1047 1000 997 995 992 990 1011 1032 1104 1177 1205 1234 1211
1952 1211 1189 1170 1151 1183 1215 1156 1098 1090 1083 1085 1087 1090 1092 1127 1162 1198 1233 1265 1296 1327 1359 1420 1482 1458 1434 1385 1336 1335 1334 1316 1246 1148 1153 1216 1280 1264 1249 1255 1261 1267
1948 1267 1273 1145 1017 1012 1110 1220 1228 1186 1196 1297 1399 1418 1437 1407 1378 1297 1216 1178 1141 1154 1167 1187 1207 1227 1247 1229 1211 1193 1175 1242 1308 1323 1339
1944 1339 1327 1316 1305 1294 1243 1193 1193 1194 1281 1369 1337 1306 1332 1358 1384 1409 1353 1297 1240 1184 1169 1154 1139 1124 1095 1066 1088 1110 1165 1220 1223 1227 1274 1321 1283 1244
1939 1244 1226 1208 1190 1172 1149 1126 1188 1250 1242 1235 1228 1220 1216 1211 1206 1201 1232 1264 1244 1224 1158 1092 1092 1177 1248 1233 1220 1207 1220 1233 1194 1156 1172 1188 1153 1118 1127 1136 1144 1153 1254
1934 1254 1354 1389 1338 1274 1295 1343 1340 1254 1167 1129 1091 1086 1081 1128 1174 1185 1197 1208 1219 1235 1250 1317 1384 1375 1366 1357 1348 1365 1382 1398 1415 1348 1281 1265 1249 1251 1252 1254 1256
$$ packed form
1966A140onK8K9k2k2j9j9L2L2J7J7J6J7k3k4p5p5mmKKL3J35J36L3m3m3m9n0k2k3K8K9J2J1
1962A221J2J2M7M7nmj4j4L7L7m5m5m5m5mlQ2Q2j6j6j6j7K5K5k6k6n3n3n3n3opopJ5J5O6O6
1957A210mnM7M7K6K5o0n9%%N1N2J4J4J4J4j05j04J4O5Pr5o3j2JJm8m7lklkK1K1P2P3K8K9k3
1952A211k2j9j9L2L2n9n8qpKKLKL5L5L6L5L2L1L1L2O1O2k4k4m9m9jjj8p0r8NO3O4j6j5OOO
1948A267Oj28j28nR8J10Qm2J0J01J02J9J9l0k9q1q1l8l7J3J3K0K0K0K0j8j8j8j8O7O6J5J6
1944A339j2j1j1j1n1n0%JQ7Q8l2l1K6K6K6K5n6n6n7n6j5j5j5j5k9k9K2K2N5N5LMM7M7l8l9
1939A244j8j8j8j8k3k3O2O2qppqmnnnL1L2k0k0o6o6%Q5P1j5j3j3J3J3l9l8J6J6l5l5RRQRJ01
1934A254J00L5n1o4K1M8lq6q7l8l8nnM7M6J1J2J1J1J6J5O7O7rrrrJ7J7J6J7o7o7j6j6KJKK
$$ plain form
1929 1256 1231 1206 1181 1156 1168 1179 1190 1202 1162 1122 1167 1213 1225 1238 1200 1161 1229 1297 1280 1263 1262 1262 1313 1364 1382 1401 1369 1336 1253 1169 1137 1105 1169 1234 1213
1925 1213 1193 1163 1134 1105 1076 1092 1108 1123 1139 1122 1106 1140 1174 1218 1262 1255 1248 1242 1236 1180 1123 1113 1103 1144 1185 1225 1264 1218 1173 1172 1171 1255 1340 1374 1409 1358 1307
1921 1307 1322 1337 1353 1368 1307 1246 1185 1124 1107 1089 1123 1157 1187 1216 1245 1274 1164 1054 1063 1072 1144 1217 1239 1261 1226 1192 1157 1122 1078 1034 1075 1116 1134 1152
1916 1152 1169 1187 1253 1320 1301 1282 1186 1090 1141 1193 1233 1171 1106 1143 1196 1198 1184 1170 1170 1170 1169 1169 1192 1216 1154 1092 1122 1152 1181 1211 1247 1282 1266 1250 1189 1128 1119
1912 1119 1109 1132 1154 1098 1041 1003 1067 1153 1188 1174 1161 1143 1126 1112 1097 1168 1238 1211 1183 1207 1231 1235 1240 1244 1249 1209 1168 1207 1246 1271 1193 1113 1135 1177 1168 1114 1111
1907 1111 1141 1171 1153 1135 1172 1210 1162 1114 1103 1092 1132 1172 1223 1273 1269 1162 1098 1138 1227 1265 1234 1203 1282 1360 1384 1306 1233 1161 1199 1237 1274 1312 1217 1122
1903 1122 1086 1152 1206 1209 1196 1183 1219 1255 1290 1326 1349 1372 1343 1315 1295 1275 1255 1235 1236 1237 1239 1240 1223 1207 1241 1276 1282 1288 1293 1299 1274 1249 1224 1199 1232 1264 1211 1159 1159
1898 1159 1160 1110 1060 1025 991 1008 1025 1079 1134 1188 1243 1307 1371 1384 1397 1330 1263 1265 1352 1455 1506 1426 1260 1150 1160 1217 1274 1291 1308 1275 1241 1200 1160 1205
$$ packed form
1929A256k5k5k5k5J2J1J1J2m0m0M5M6J2J3l8l9O8O8j7j7j%N1N1J8J9l2l3q3q4l2l2O4O5k1
1925A213k0l0k9k9k9J6J6J5J6j7j6L4L4M4M4ppoon6n7j0j0M1M1M0L9m6m5jjQ4Q5L4L5n1n1
1921A307J5J5J6J5o1o1o1o1j7j8L4L4L0K9K9K9j10j10RRP2P3K2K2l5l4l5l5m4m4M1M1J8J8
1916A152J7J8O6O7j9j9r6r6N1N2M0o2o5L7N3Kj4j4%%j%K3K4o2o2L0L0K9L0L6L5j6j6o1o1r
1912A119j0K3K2n6n7l8O4Q6L5j4j3j8j7j4j5P1P0k7k8K4K4MNMNm0m1L9L9K5p8q0K2M2rn4l
1907A111L0L0j8j8L7L8m8m8j1j1M0M0N1N0mj07o4M0Q9L8l1l1P9P8K4p8p3p2L8L8L7L8r5r5
1903A122l6O6N4Lj3j3L6L6L5L6K3K3k9k8k0k0k0k0JJKJj7j6L4L5OONOk5k5k5k5L3L2n3n2%
1898A159Jn0n0l5l4J7J7N4N5N4N5O4O4J3J3o7o7KQ7J03N1q0j66j10J0N7N7J7J7l3l4m1m0M5
$$ plain form
1894 1205 1249 1285 1320 1355 1390 1323 1257 1241 1225 1202 1179 1105 1030 1027 1024 1107 1189 1208 1226 1193 1161 1215 1270 1273 1277 1281 1286 1290 1295 1325 1356 1336 1316 1246 1177 1193 1209 1222
1890 1222 1234 1247 1259 1274 1288 1303 1318 1279 1240 1149 1059 1084 1109 1134 1159 1170 1181 1140 1099 1040 982 974 967 977 988 1050 1112 1136 1159 1183 1206 1216 1225 1234 1243 1252 1262
1885 1262 1271 1280 1248 1216 1184 1151 1134 1117 1151 1185 1208 1230 1202 1173 1219 1264 1258 1251 1209 1166 1123 1080 1118 1156 1194 1232 1299 1366 1405 1342 1283 1224 1210 1195 1215 1234
1881 1234 1254 1273 1271 1269 1267 1265 1247 1229 1166 1103 1106 1212 1318 1321 1284 1246 1254 1262 1264 1266 1217 1168 1103 1038 1092 1147 1217 1288 1273 1258 1276 1294 1313 1331 1288 1246 1254 1263 1187
1876 1187 1110 1085 1060 1053 1046 1090 1135 1188 1242 1296 1350 1290 1229 1254 1279 1239 1199 1209 1220 1191 1163 1185 1208 1197 1187 1177 1167 1163 1159 1155 1151 1134 1117 1144 1172 1230 1185
1871 1185 1112 1040 1105 1169 1234 1299 1330 1362 1308 1255 1247 1240 1318 1395 1411 1427 1330 1233 1152 1174 1223 1272 1242 1212 1182 1152 1169 1186 1203 1221 1172 1123 1159 1195 1271
1867 1271 1347 1338 1328 1232 1136 1160 1183 1165 1147 1129 1111 1157 1203 1249 1295 1326 1358 1270 1182 1157 1132 1186 1239 1257 1172 1093 1015 1099 1182 1272 1260 1224 1187 1230 1273
1863 1273 1265 1256 1248 1239 1245 1251 1257 1263 1210 1157 1155 1154 1164 1174 1185 1195 1285 1375 1346 1317 1276 1234 1148 1062 1029 1099 1111 1123 1103 1083 1063 1042 1061 1079 1149 1218 1202 1185 1220
$$ packed form
1894A205M4L6L5L5L5o7o6j6j6k3k3p4p5llQ3Q2J9J8l3l2N4N5LMMNMNL0L1k0k0p0o9J6J6J3
1890A222J2J3J2J5J4J5J5l9l9r1r0K5K5K5K5J1J1m1m1n9n8qpJ0J1O2O2K4K3K4K3J0RRRRJ0
1885A262RRl2l2l2l3j7j7L4L4K3K2k8k9M6M5opm2m3m3m3L8L8L8L8O7O7L9o3n9n9j4j5K0J9
1881A234K0J9kkkkj8j8o3o3LJ06J06Ll7l8QQKKm9m9o5o5N4N5P0P1j5j5J8J8J9J8m3m2QRp6
1876A187p7k5k5ppM4M5N3N4N4N4o0o1K5K5m0m0J0J1k9k8K2K3j1j0j0j0mmmmj7j7K7K8N8m5
1871A185p3p2O5O4O5O5L1L2n4n3qpP8P7J6J6r7r7q1K2M9M9l0l0l0l0J7J7J7J8m9m9L6L6P6
1867A271P6rj0r6r6K4K3j8j8j8j8M6M6M6M6L1L2q8q8k5k5N4N3J8q5p9p8Q4Q3R0j2l6l7M3M3
1863A273qrqrOOOOn3n3kjJ0J0J1J0R0R0k9k9m1m2q6q6l3P0J2J2k0k0k0k1J9J8P0O9j6j7L5
$$ plain form
1858 1220 1255 1280 1305 1279 1253 1246 1239 1232 1225 1225 1224 1275 1326 1275 1224 1173 1123 1110 1098 1085 1073 1032 991 1036 1081 1130 1178 1227 1276 1315 1354 1342 1330 1311 1293 1223 1153
1854 1153 1149 1145 1141 1137 1108 1079 1078 1180 1301 1422 1396 1370 1300 1231 1161 1091 1155 1218 1230 1241 1203 1165 1178 1191 1259 1326 1343 1359 1309 1260 1261 1263 1302 1342 1297 1252
1849 1252 1236 1220 1205 1189 1213 1236 1259 1283 1239 1195 1202 1210 1186 1162 1138 1113 1097 1080 1115 1149 1113 1076 1091 1105 1158 1211 1213 1215 1272 1330 1337 1343 1270 1196 1242 1288 1238
1845 1238 1188 1138 1087 1114 1140 1218 1295 1288 1281 1274 1267 1273 1278 1284 1290 1364 1438 1461 1484 1487 1489 1441 1392 1359 1325 1343 1361 1357 1353 1299 1244 1179 1114 1101 1087 1109 1130 1152 1173 1207
1840 1207 1240 1188 1136 1150 1164 1178 1193 1239 1286 1282 1278 1250 1222 1195 1167 1169 1171 1224 1278 1261 1244 1227 1210 1279 1348 1366 1384 1333 1282 1231 1179 1191 1202 1213 1224 1306
1835 1306 1387 1417 1448 1345 1242 1190 1139 1133 1127 1172 1217 1220 1222 1224 1227 1232 1238 1243 1249 1255 1261 1267 1273 1257 1242 1227 1211 1238 1264 1291 1317 1305 1293 1281 1269 1255 1241 1227 1212 1158
1830 1158 1103 1134 1164 1175 1185 1110 1035 1055 1075 1095 1115 1110 1105 1151 1198 1200 1203 1154 1106 1102 1098 1146 1193 1150 1107 1115 1123 1138 1153 1168 1183 1192 1201 1295 1389 1368 1347 1326 1305
1826 1305 1339 1373 1356 1340 1297 1254 1210 1167 1160 1152 1144 1136 1178 1220 1263 1305 1229 1153 1077 1001 1013 1026 1123 1221 1170 1118 1118 1118 1143 1169 1194 1219 1252 1285 1232 1180 1132
$$ packed form
1858A220L5K5K5k6k6pppp%jN1N1n1n1n1n0j3j2j3j2m1m1M5M5M9M8M9M9L9L9j2j2j9j8p0p0
1854A153mmmmk9k9jJ02J21J21k6k6p0o9p0p0O4O3J2J1l8l8J3J3O8O7J7J6n0m9JKL9M0m5m5
1849A252j6j6j5j6K4K3K3K4m4m4PQk4k4k4k5j6j7L5L4l6l7J5J4N3N3KKN7N8POp3p4M6M6n0
1845A238n0n0n1K7K6P8P7ppppONOOP4P4K3K3LKm8m9l3l4J8J8mmn4n5o5o5j3j4K2K1K2K1L4
1840A207L3n2n2J4J4J4J5M6M7mmk8k8k7k8KKN3N4j7j7j7j7O9O9J8J8n1n1n1n2J2J1J1J1Q2
1835A306Q1L0L1j03j03n2n1ooM5M5LKKLNONOOOOOj6j5j5j6K7K6K7K6j2j2j2j2j4j4j4j5n4
1830A158n5L1L0J1J0p5p5K0K0K0K0nnM6M7KLm9m8mmM8M7m3m3QQJ5J5J5J5RRR4R4k1k1k1k1
1826A305L4L4j7j6m3m3m4m3pqqqM2M2M3M2p6p6p6p6J2J3R7R8n1n2%%K5K6K5K5L3L3n3n2m8
$$ plain form
1821 1132 1084 1088 1091 1099 1106 1114 1122 1147 1172 1197 1223 1221 1220 1218 1217 1241 1266 1336 1407 1393 1293 1242 1276 1348 1369 1304 1240 1204 1168 1132 1097 1118 1139 1160 1181 1164 1147 1130 1113
1816 1113 1108 1104 1099 1094 1086 1079 1071 1063 1142 1221 1249 1277 1279 1280 1281 1283 1251 1218 1186 1154 1169 1183 1198 1213 1201 1189 1176 1164 1104 1044 1069 1094 1074 1053 1032 1011 1030 1050 1117 1185
1811 1185 1191 1146 1081 1102 1185 1267 1304 1341 1329 1317 1306 1294 1269 1245 1220 1196 1185 1174 1211 1248 1235 1171 1138 1191 1267 1343 1339 1335 1305 1274 1243 1213 1210 1207 1255 1303 1293
1807 1293 1283 1272 1262 1251 1240 1229 1218 1185 1151 1149 1232 1336 1338 1250 1161 1126 1091 1134 1178 1250 1220 1161 1103 1192 1281 1285 1288 1306 1324 1291 1257 1223 1188 1160 1132 1057
1803 1057 1084 1139 1194 1212 1231 1250 1268 1203 1138 1159 1179 1158 1137 1167 1197 1170 1143 1202 1261 1275 1289 1303 1317 1348 1379 1410 1441 1445 1449 1403 1356 1307 1257 1208 1159
1798 1159 1171 1182 1194 1205 1189 1173 1157 1141 1169 1197 1276 1355 1337 1319 1302 1284 1290 1296 1238 1282 1376 1368 1304 1240 1254 1267 1228 1190 1220 1249 1278 1308 1312 1317 1271 1224 1178
1794 1178 1131 1169 1208 1192 1176 1160 1144 1183 1222 1209 1197 1217 1237 1256 1276 1229 1181 1127 1176 1257 1338 1273 1207 1180 1152 1176 1199 1270 1340 1326 1311 1225 1138 1171
1790 1171 1205 1261 1318 1323 1328 1332 1336 1255 1173 1149 1125 1101 1077 1153 1229 1305 1381 1395 1409 1338 1267 1289 1311 1282 1252 1260 1267 1274 1281 1262 1242 1223 1204 1223 1242 1261 1280 1243
$$ packed form
1821A132m8MLQPQQK5K5K5K6kjkjK4K5P0P1j4j00n1L4P2K1o5o4l6l6l6l5K1K1K1K1j7j7j7j7
1816A113nmnnqpqqP9P9K8K8KJJKl2l3l2l2J5J4J5J5j2j2j3j2o0o0K5K5k0k1k1k1J9K0O7O8
1811A185Om5o5K1Q3Q2L7L7j2j2j1j2k5k4k5k4j1j1L7L7j3o4l3N3P6P6mml0l1l1l0llM8M8j0
1807A293j0j1j0j1j1j1j1l3l4kQ3J04Kq8q9l5l5M3M4P2l0n9n8Q9Q9MLJ8J8l3l4l4l5k8k8p5
1803A057K7N5N5J8J9J9J8o5o5K1K0k1k1L0L0k7k7N9N9J4J4J4J4L1L1L1L1MMm6m7m9n0m9m9
1798A159J2J1J2J1j6j6j6j6K8K8P9P9j8j8j7j8OOn8M4R4qo4o4J4J3l9l8L0K9K9L0MNm6m7m6
1794A178m7L8L9j6j6j6j6L9L9j3j2K0K0J9K0m7m8n4M9Q1Q1o5o6k7k8K4K3P1P0j4j5q6q7L3
1790A171L4N6N7NNMMq1q2k4k4k4k4P6P6P6P6J4J4p1p1K2K2k9l0QPPPj9k0j9j9J9J9J9J9l7
$$ plain form
1785 1243 1207 1170 1134 1124 1114 1156 1197 1168 1139 1110 1080 1142 1203 1179 1155 1216 1277 1218 1159 1114 1069 1110 1150 1144 1138 1133 1127 1140 1152 1164 1177 1159 1140 1122 1104 1150
1781 1150 1195 1156 1116 1075 1034 1044 1055 1131 1207 1198 1189 1166 1142 1204 1266 1296 1326 1356 1385 1356 1327 1298 1268 1272 1276 1280 1283 1284 1284 1335 1387 1342 1298 1305 1311 1297 1283 1269 1256
1776 1256 1245 1234 1223 1212 1192 1171 1151 1130 1170 1210 1250 1291 1216 1141 1151 1162 1215 1267 1200 1134 1097 1061 1050 1039 1022 1006 1074 1143 1150 1156 1163 1170 1099 1028 985 1044
1771 1044 1107 1170 1189 1207 1216 1225 1250 1326 1365 1301 1185 1119 1176 1233 1208 1183 1145 1108 1121 1134 1152 1170 1187 1205 1233 1261 1286 1312 1314 1265 1212 1263 1372 1481
1767 1481 1439 1295 1190 1188 1207 1227 1243 1260 1276 1293 1281 1270 1232 1195 1136 1076 1136 1197 1202 1208 1188 1168 1236 1303 1371 1439 1444 1449 1454 1460 1382 1305 1279 1252 1247 1242 1151 1060
1763 1060 1049 1038 1052 1067 1084 1101 1118 1135 1201 1267 1213 1160 1116 1073 1148 1224 1248 1273 1246 1219 1175 1132 1173 1215 1263 1311 1275 1238 1249 1260 1271 1282 1313 1344
1758 1344 1296 1248 1192 1238 1277 1317 1275 1233 1192 1150 1170 1190 1210 1230 1260 1290 1234 1179 1139 1099 1084 1070 1159 1247 1309 1268 1199 1131 1176 1220 1278 1337 1344 1351 1330
1754 1330 1310 1238 1166 1122 1078 1119 1160 1209 1257 1306 1355 1336 1318 1351 1384 1444 1504 1445 1385 1342 1298 1280 1261 1273 1286 1298 1310 1267 1224 1266 1308 1301 1293 1330 1367
$$ packed form
1785A243l6l7l6j0j0M2M1k9k9k9l0O2O1k4k4O1O1n9n9m5m5M1M0oonoJ3J2J2J3j8j9j8j8M6
1781A150M5l9m0m1m1J0J1P6P6rrk3k4O2O2L0L0L0K9k9k9k9l0MMMLJ%N1N2m5m4POj4j4j4j3
1776A256j1j1j1j1k0k1k0k1M0M0M0M1p5p5J0J1N3N2o7o6l7l6j1j1j7j6O8O9POPPp1p1m3N9
1771A044O3O3J9J8RRK5P6L9o4j16o6N7N7k5k5l8l7J3J3J8J8J7J8K8K8K5K6Km9n3N1J09J09
1767A481m2j44j05kJ9K0J6J7J6J7j2j1l8l7n9o0O0O1NOk0k0O8O7O8O8NNNOp8p7k6k7nnr1r1
1763A060j1j1J4J5J7J7J7J7O6O6n4n3m4m3P5P6K4K5k7k7m4m3M1M2M8M8l6l7J1J1J1J1L1L1
1758A344m8m8n6M6L9M0m2m2m1m2K0K0K0K0L0L0n6n5m0m0j5j4Q9Q8O2m1o9o8M5M4N8N9PPk1
1754A330k0p2p2m4m4M1M1M9M8M9M9j9j8L3L3O0O0n9o0m3m4j8j9J2J3J2J2m3m3M2M2pqL7L7
$$ plain form
1750 1367 1395 1321 1254 1186 1198 1209 1169 1130 1070 1010 1001 992 1012 1032 1052 1072 1010 949 973 998 1023 1048 1118 1188 1250 1209 1174 1140 1138 1137 1084 1031 1091 1150 1209 1268
1745 1268 1255 1241 1201 1162 1179 1195 1160 1126 1174 1223 1246 1268 1297 1326 1276 1226 1184 1244 1332 1420 1370 1321 1323 1325 1320 1315 1309 1304 1340 1376 1327 1278 1246 1214 1182 1150 1127
1741 1127 1105 1202 1299 1284 1269 1305 1341 1351 1361 1320 1279 1264 1248 1181 1115 1096 1077 1110 1142 1167 1192 1217 1242 1301 1361 1335 1309 1264 1219 1293 1367 1321 1274 1227
1737 1227 1181 1180 1179 1178 1177 1237 1296 1356 1416 1278 1140 1088 1036 1084 1131 1179 1227 1221 1216 1210 1205 1177 1148 1206 1263 1299 1336 1288 1239 1303 1366 1311 1255 1213 1171 1214 1257
1732 1257 1292 1327 1362 1397 1390 1384 1377 1371 1313 1255 1198 1140 1101 1062 1022 983 1052 1121 1140 1158 1084 1011 1022 1034 1038 1042 1046 1050 1107 1163 1219 1275 1236 1196 1156 1117 1121 1125 1129 1133
1727 1133 1202 1271 1289 1307 1270 1233 1246 1260 1303 1346 1390 1433 1372 1312 1252 1191 1185 1178 1171 1164 1192 1221 1249 1277 1325 1372 1369 1365 1313 1262 1261 1261 1312 1364 1261 1159 1144
1723 1144 1128 1112 1096 1041 986 1084 1183 1221 1260 1213 1166 1181 1197 1212 1227 1306 1385 1379 1372 1373 1374 1375 1375 1344 1313 1281 1250 1233 1216 1251 1285 1275 1264 1254 1243 1312 1380
1718 1380 1398 1415 1360 1305 1300 1296 1310 1324 1338 1351 1335 1319 1303 1287 1235 1182 1215 1247 1270 1293 1231 1169 1126 1082 1090 1098 1103 1109 1063 1018 1025 1033 1092 1151 1226 1301 1290 1280
$$ packed form
1750A367K8p4o7o8J2J1m0l9o0o0rrK0K0K0K0o2o1K4K5K5K5P0P0O2m1l5l4kjn3n3O0N9N9N9
1745A268j3j4m0l9J7J6l5l4M8M9K3K2K9K9n0n0m2O0Q8Q8n0m9KKnnonL6L6m9m9l2l2l2l2k3
1741A127k2R7R7j5j5L6L6J0J0m1m1j5j6o7o6j9j9L3L2K5K5K5K5N9O0k6k6m5m5P4P4m6m7m7
1737A227m6jjjjO0N9O0O0j38j38n2n2M8M7M8M8ononk8k9N8N7L6L7m8m9O4O3n5n6m2m2M3M3
1732A257L5L5L5L5popon8n8n7n8l9l9m0l9O9O9J9J8p4p3J1J2MMMMN7N6N6N6l9m0m0l9MMMM
1727A133O9O9J8J8l7l7J3J4M3M3M4M3o1o0o0o1opppK8K9K8K8M8M7lmn2n1j%N1N2j03j02j5
1723A144j6j6j6n5n5R8R9L8L9m7m7J5J6J5J5P9P9opJJJ%l1l1l2l1j7j7L5L4j0j1j0j1O9O8
1718A380J8J7n5n5nmJ4J4J4J3j6j6j6j6n2n3L3L2K3K3o2o2m3m4QQNOm6m5PQN9N9P5P5j1j0
$$ plain form
1714 1280 1244 1207 1171 1135 1129 1122 1167 1212 1248 1284 1320 1356 1348 1340 1332 1325 1298 1272 1245 1218 1210 1202 1193 1185 1144 1102 1146 1191 1208 1225 1243 1260 1235 1210 1185 1160 1108 1056 1008
1709 1008 1045 1141 1237 1287 1338 1376 1415 1402 1390 1383 1377 1371 1364 1374 1384 1342 1300 1253 1206 1209 1213 1183 1152 1173 1194 1211 1227 1193 1158 1182 1206 1230 1254 1276 1298 1303 1256 1219
1704 1219 1266 1373 1429 1406 1331 1304 1328 1332 1336 1344 1351 1334 1317 1380 1443 1404 1281 1186 1211 1295 1329 1283 1236 1257 1329 1373 1331 1262 1244 1277 1311 1309 1307 1305 1303 1240 1177
1700 1177 1114 1051 1106 1161 1216 1271 1230 1190 1200 1210 1211 1212 1161 1111 1138 1166 1244 1322 1305 1287 1270 1252 1291 1329 1368 1406 1346 1285 1224 1164 1145 1126 1226 1326
1696 1326 1417 1508 1479 1450 1380 1310 1257 1255 1273 1206 1091 1061 1197 1332 1370 1323 1294 1316 1336 1304 1284 1316 1363 1325 1234 1144 1134 1123 1113 1102 1092 1081 1072 1062
1691 1062 1133 1203 1241 1194 1143 1092 1117 1142 1167 1192 1199 1206 1214 1221 1281 1342 1317 1292 1262 1231 1282 1333 1276 1167 1039 996 1019 1042 1070 1098 1090 1082 1124 1167 1145 1123
1687 1123 1133 1228 1299 1285 1204 1123 1116 1108 1100 1093 1176 1258 1341 1424 1371 1317 1263 1209 1202 1196 1189 1182 1199 1217 1234 1252 1262 1271 1281 1291 1307 1323 1222 1121 1143 1216 1257 1213
1682 1213 1145 1077 1089 1101 1210 1319 1309 1298 1297 1297 1296 1295 1277 1259 1241 1223 1183 1143 1154 1165 1216 1266 1231 1197 1146 1096 1165 1234 1301 1368 1316 1263 1242 1221 1251
$$ packed form
1714A280l6l7l6l6opM5M5L6L6L6L6qqqpk7k6k7k7qqrqm1m2M4M5J7J7J8J7k5k5k5k5n2n2m8
1709A008L7R6R6N0N1L8L9j3j2poopJ0J0m2m2m7m7LMl0l1K1K1J7J6l4l5K4K4K4K4K2K2Nm7l7
1704A219M7J07N6k3p5k7K4MMQPj7j7O3O3l9j23r5K5Q4L4m6m7K1P2M4m2o9j8L3L4kkkko3o3
1700A177o3o3N5N5N5N5m1m0J0J0JJn1n0K7K8P8P8j7j8j7j8L9L8L9L8o0o1o1o0j9j9J00J00
1696A326R1R1k9k9p0p0n3kJ8o7j15l0J36J35L8m7k9K2K0l2k0L2M7l8r1r0j0j1j0j1j0j1rj0
1691A062P1P0L8m7n1n1K5K5K5K5PPQPO0O1k5k5l0l1N1N1n7j09j28m3K3K3K8K8qqM2M3k2k2
1687A123J0R5P1j4q1q1pqqpQ3Q2Q3Q3n3n4n4n4poppJ7J8J7J8J0RJ0J0J6J6j01j01K2P3M1m4
1682A213o8o8J2J2J09J09j0j1j%jjj8j8j8j8m0m0J1J1N1N0l5l4n1n0O9O9O7O7n2n3k1k1L0
$$ plain form
1678 1251 1281 1246 1211 1227 1243 1238 1232 1227 1222 1270 1318 1315 1312 1266 1221 1175 1129 1167 1204 1242 1279 1295 1311 1275 1240 1191 1143 1146 1149 1190 1230 1271 1312 1318 1323 1329 1335 1313 1290 1268
1673 1268 1246 1202 1158 1115 1071 1099 1127 1156 1184 1176 1168 1211 1254 1307 1360 1300 1240 1158 1178 1226 1274 1259 1244 1229 1214 1251 1288 1275 1261 1355 1448 1491 1534 1561 1589
1669 1589 1623 1555 1393 1232 1160 1191 1190 1190 1195 1201 1290 1379 1413 1344 1247 1252 1346 1440 1396 1352 1359 1366 1333 1299 1266 1232 1225 1218 1211 1204 1175 1147 1119 1090 1113 1135 1158 1180 1254
1664 1254 1328 1316 1304 1259 1214 1219 1225 1218 1211 1239 1216 1199 1285 1424 1462 1423 1486 1661 1785 1763 1640 1620 1652 1606 1458 1342 1277 1219 1160 1161 1264 1347 1329
1660 1329 1289 1249 1208 1167 1126 1086 1089 1093 1097 1101 1104 1106 1160 1213 1228 1243 1255 1267 1245 1172 1115 1160 1223 1184 1128 1124 1163 1201 1191 1182 1148 1113 1130 1147 1195 1242 1290 1337
1655 1337 1451 1564 1678 1791 1874 1957 1886 1815 1716 1617 1517 1418 1396 1374 1349 1324 1298 1220 1162 1206 1290 1323 1272 1220 1282 1344 1286 1228 1206 1185 1163 1141
1652 1141 1189 1236 1199 1111 1061 1112 1106 1099 1141 1234 1305 1273 1242 1210 1179 1148 1119 1192 1288 1332 1337 1342 1293 1244 1267 1290 1433 1576 1671 1766 1742 1718 1681 1644 1522
1647 1522 1399 1292 1184 1161 1139 1156 1173 1190 1207 1175 1144 1164 1183 1226 1269 1364 1458 1468 1478 1488 1497 1486 1474 1463 1452 1461 1471 1430 1389 1349 1310 1271 1232 1177
$$ packed form
1678A251L0l5l5J6J6nonnM8M8llm6m5m6m6L8L7L8L7J6J6l6l5m9m8LLM1M0M1M1ONOOk2k3k2
1673A268k2m4m4m3m4K8K8K9K8qqM3M3N3N3o0o0q2K0M8M8j5j5j5j5L7L7j3j4R4R3M3M3K7K8
1669A589L4o8j62j61p2L1j%NOQ9Q9L4o9r7NR4R4m4m4PPl3l4l3l4ppppk9k8k8k9K3K2K3K2P4
1664A254P4j2j2m5m5NOppK8k3j7Q6J39L8l9O3J75J24k2j23k0L2m6j48j16o5n8n9JJ03Q3j8
1660A329m0m0m1m1m1m0LMMMLKN4N3J5J5J2J2k2p3n7M5O3l9n6mL9L8j0rl4l5J7J7M8M7M8M7
1655A337J14J13J14J13Q3Q3p1p1r9r9j00r9k2k2k5k5k6p8n8M4Q4L3n1n2O2O2n8n8k2k1k2k2
1652A141M8M7l7q8n0N1opM2R3P1l2l1l2l1l1k9P3R6M4NNm9m9K3K3J43J43R5R5k4k4l7l7j22
1647A522j23j07j08k3k2J7J7J7J7l2l1K0J9M3M3R5R4J0J0J0Rj1j2j1j1RJ0m1m1m0l9l9l9n5
$$ plain form
1643 1177 1123 1119 1116 1071 1026 1066 1106 1177 1247 1267 1286 1293 1300 1357 1415 1355 1295 1286 1276 1248 1220 1243 1266 1297 1329 1310 1291 1253 1216 1230 1244 1233 1222 1211 1200 1225 1250
1639 1250 1275 1301 1235 1170 1156 1142 1200 1258 1317 1375 1294 1212 1182 1152 1157 1163 1168 1173 1166 1159 1151 1144 1196 1247 1248 1248 1238 1229 1219 1209 1216 1222 1177 1132 1154 1175 1247 1320 1293 1266 1291
1634 1291 1315 1290 1264 1239 1213 1178 1143 1108 1073 1099 1126 1153 1179 1165 1150 1186 1222 1262 1302 1342 1381 1369 1357 1344 1332 1317 1301 1286 1271 1194 1117 1126 1134 1103 1073
1629 1073 1098 1225 1297 1266 1156 1149 1209 1269 1189 1108 1138 1271 1356 1271 1121 971 998 1025 1048 1071 1172 1274 1353 1329 1312 1295 1281 1268 1254 1240 1251
1626 1251 1263 1223 1183 1143 1104 1115 1126 1162 1197 1232 1267 1281 1294 1308 1322 1323 1323 1272 1222 1221 1221 1220 1219 1216 1212 1208 1204 1230 1256 1231 1205 1258 1310 1277 1245 1263 1281 1221 1160
1621 1160 1169 1280 1340 1298 1246 1194 1256 1317 1344 1371 1398 1426 1383 1339 1296 1253 1294 1335 1291 1247 1206 1165 1209 1254 1338 1423 1405 1302 1242 1234 1243 1252 1251 1251 1251 1251 1209
1616 1209 1167 1244 1322 1352 1382 1292 1202 1164 1125 1172 1219 1234 1249 1309 1370 1384 1312 1189 1152 1229 1307 1304 1250 1220 1275 1327 1293 1207 1120 1114 1108 1177 1246 1316 1385
1612 1385 1354 1322 1291 1259 1252 1245 1239 1232 1199 1166 1184 1202 1199 1196 1192 1189 1247 1304 1276 1248 1234 1221 1211 1201 1244 1337 1398 1375 1321 1267 1260 1252 1239 1225 1212 1199 1219 1239 1259
$$ packed form
1643A177n4mlm5m5M0M0P1P0K0J9PPN7N8o0o0rj0k8k8K3K3L1L2j9j9l8l7J4J4j1j1j1j1K5K5
1639A250K5K6o6o5j4j4N8N8N9N8q1q2l0l0NONNppqpN2N1J%j0rj0j0POm5m5K2K1P2P3k7k7K5
1634A291K4k5k6k5k6l5l5l5l5K6K7K7K6j4j5L6L6M0M0M0L9j2j2j3j2j5j6j5j5p7p7RQl1l0
1629A073K5J27P2l1j10pO0O0q0q1L0J33Q5q5j50j50K7K7K3K3J01J02P9k4j7j7j4j3j4j4J1
1626A251J2m0m0m0l9J1J1L6L5L5L5J4J3J4J4J%n1n0j%jjlmmmK6K6k5k6N3N2l3l2J8J8o0o1
1621A160RJ11O0m2n2n2O2O1K7K7K7K8m3m4m3m3M1M1m4m4m1m1M4M5Q4Q5j8j03o0qRRj%%%m2
1616A209m2P7P8L0L0r0r0l8l9M7M7J5J5O0O1J4p2j23l7P7P8ln4l0N5N2l4q6q7ooO9O9P0O9
1612A385l1l2l1l2ppopl3l3J8J8llmlN8N7k8k8j4j3j0j0M3R3O1k3n4n4pqj3j4j3j3K0K0K0
$$ plain form
1607 1259 1279 1262 1245 1229 1212 1211 1211 1210 1210 1194 1178 1213 1248 1288 1329 1318 1307 1262 1216 1256 1296 1272 1249 1226 1203 1135 1067 1099 1216 1317 1332 1315 1298 1315 1332
1603 1332 1349 1365 1444 1523 1420 1317 1342 1470 1598 1623 1650 1677 1698 1719 1758 1798 1925 2053 2163 2325 2598 3043 3746 4689 5687 6514 6890
1600 6890 6685 6037 5151 4305 3630 3147 2767 2415 2114 1919 1775 1682 1642 1660 1679 1570 1461 1403 1345 1354 1362 1371 1380 1375 1371 1383 1446 1476 1404 1312 1271
1596 1271 1252 1233 1217 1201 1245 1290 1248 1207 1209 1211 1212 1214 1229 1244 1372 1499 1551 1499 1358 1267 1211 1155 1096 1139 1247 1355 1316 1277 1264 1251 1238 1226 1228 1230 1232
1592 1232 1234 1236 1238 1292 1345 1364 1382 1401 1419 1405 1390 1376 1361 1347 1333 1318 1304 1284 1264 1244 1224 1220 1216 1212 1208 1183 1158 1181 1204 1235 1214 1161 1211 1283 1304 1274 1245 1254
1587 1254 1263 1221 1179 1146 1114 1133 1151 1202 1253 1218 1184 1242 1299 1272 1244 1209 1174 1139 1104 1186 1267 1298 1328 1370 1411 1401 1391 1349 1307 1266 1224 1260 1296 1332 1368
1583 1368 1349 1330 1311 1292 1320 1349 1292 1236 1244 1251 1259 1267 1344 1421 1412 1404 1454 1503 1504 1506 1472 1489 1529 1484 1409 1385 1413 1440 1473 1506 1488 1470 1464 1458 1453 1447 1462 1476 1525 1522 1513
1578 1513 1589 1699 1809 1778 1748 1660 1573 1407 1156 880 656 518 499 536 573 641 709 828 948 993 1039 1034 1028 1010 991 973 954 974 994 1094
$$ packed form
1607A259K0j7j7j6j7j%j%j6j6L5L5M0M1j1j1m5m6M0M0k4k3k3k3o8o8L2J17J01J5j7j7J7J7
1603A332J7J6P9P9j03j03K5J28J28K5K7K7K1K1L9M0J27J28J10J62K73M45P03R43R98Q27L76
1600F890k05o48q86q46o75m83l80l52l01j95j44r3m0J8J9j09j09n8n8RQRRnmJ2O3L0p2r2m1
1596A271j9j9j6j6M4M5m2m1KKJKJ5J5J28J27N2n2j41r1n6n6n9M3J08J08l9l9j3j3j3j2KKK
1592A232KKKN4N3J9J8J9J8j4j5j4j5j4j4j5j4k0k0k0k0mmmmk5k5K3K3L1k1n3N0P2K1l0k9R
1587A254Rm2m2l3l2J9J8N1N1l5l4N8N7k7k8l5l5l5l5Q2Q1L1L0M2M1j0j0m2m2m1m2L6L6L6L6
1583A368j9j9j9j9K8K9n7n6QPQQP7P7rqN0M9JKl4J7M0m5p5k4K8K7L3L3j8j8oonoJ5J4M9lr
1578A513P6J10J10l1l0q8q7j66k51k76k24j38j9L7L7O8O8J19J20M5M6noj8j9j8j9K0K0J00
$$ plain form
1574 1094 1193 1217 1156 1114 1123 1199 1274 1267 1260 1250 1240 1230 1220 1183 1147 1110 1073 1088 1103 1118 1133 1185 1236 1236 1236 1298 1361 1338 1314 1292 1270 1248 1226 1201 1176 1202 1228
1569 1228 1304 1380 1428 1374 1298 1223 1260 1297 1336 1375 1329 1283 1254 1225 1281 1337 1337 1336 1336 1335 1366 1396 1376 1355 1384 1414 1392 1370 1311 1252 1278 1304 1325 1347 1369 1390
1565 1390 1389 1388 1387 1386 1356 1325 1379 1434 1368 1302 1321 1340 1347 1353 1360 1366 1372 1377 1382 1387 1448 1509 1576 1541 1491 1442 1437 1432 1462 1493 1472 1451 1481 1511 1540 1570 1594 1617 1647 1677 1690
1560 1690 1806 2051 2468 2928 3285 3453 3382 3047 2713 2420 2128 1953 1881 1836 1791 1723 1654 1705 1756 1798 1839 1932 2025 1980 1935 1891 1846 1772 1697
1556 1697 1629 1561 1545 1631 1738 1845 1794 1640 1605 1673 1751 1829 1794 1759 1684 1608 1618 1627 1681 1734 1736 1738 1774 1810 1846 1882 1862 1843 1823 1803 1844 1885 1926 1967
1552 1967 1909 1852 1879 1906 1901 1895 1941 1986 1980 1975 1918 1861 1817 1774 1816 1859 1921 1984 2047 2110 2067 2023 2065 2106 2153 2199 2246 2292 2316 2339 2362 2385 2461 2538 2495 2452
1548 2452 2383 2315 2246 2178 2223 2269 2264 2259 2335 2412 2427 2340 2281 2223 2243 2263 2292 2321 2305 2289 2277 2367 2485 2603 2606 2610 2563 2515 2571 2627 2683 2739 2733 2728 2773 2818
1543 2818 2867 2915 2964 3013 3034 3054 3075 3096 3049 3002 3074 3146 3223 3300 3378 3455 3428 3400 3372 3345 3381 3417 3454 3490 3547 3603 3660 3717 3735 3753 3771 3789 3886 3982
$$ packed form
1574A094R9K4o1m2RP6P5ppj0j0j0j0l7l6l7l7J5J5J5J5N2N1%%O2O3k3k4k2k2k2k2k5k5K6K6
1569A228P6P6M8n4p6p5L7L7L9L9m6m6k9k9N6N6%j%jL1L0k0k1K9L0k2k2n9n9K6K6K1K2K2K1
1565A390jjjjl0l1N4N5o6o6J9J9POPOONNNO1O1O7l5n0m9nnL0L1k1k1L0L0K9L0K4K3L0L0J3
1560A690J16K45M17M60L57J68p1l35l34k93k92j75p2m5m5o8o9N1N1M2M1R3R3m5m5m4m5p4p5
1556A697o8o8j6Q6J07J07n1j54l5O8P8P8l5l5p5p6J0RN4N3KKL6L6L6L6k0j9k0k0M1M1M1M1
1552A967n8n7K7K7noM6M5onn7n7m4m3M2M3O2O3O3O3m3m4M2M1M7M6M7M6K4K3K3K3P6P7m3m3
1548B452o9o8o9o8M5M6nnP6P7J5q7n9n8K0K0K9K9j6j6j2R0J18J18LMm7m8N6N6N6N6onM5M5
1543B818M9M8M9M9K1K0K1K1m7m7P2P2P7P7P8P7k7k8k8k7L6L6L7L6N7N6N7N7J8J8J8J8R7R6
$$ plain form
1539 3982 4078 4174 4145 4115 4171 4227 4301 4374 4500 4625 4652 4678 4791 4903 4929 4955 5033 5110 5222 5335 5669 6003 6230 6457 6683 6910 6965 7020
1536 7020 7160 7300 7435 7569 7755 7941 8057 8172 8288 8403 8434 8465 8495 8526 8437 8349 8375 8641 9319 10441 11898 13355 14430 15062
1533 15062 15350 15468 15486 15674 16131 16690 17254 17920 18880 19942 21007 22242 24005 26349 29074 32448 36755 41710 46558 50962
1531 50962 54973 58609 61998 66103 72157 80770 92036 107293 129220 160527 204837 271423 376519 533093 732397
1529 732397 934054 1078656 1118222 1043740 888784 707215 543146 415013 320415 250199 197620 158538
1527 158538 129246 106538 88709 75097 64794 56795 50398 45170 40521 36116 32155 29089 26876 25175 23781 22590
1525 22590 21296 19631 17728 15986 14484 13105 11828 10779 9833 8710 7587 6684 6224 6208 6567 7236 7906 8115 7880 7412
1523 7412 6945 6456 5967 5615 5366 5015 4664 4351 4140 4003 3967 4023 4079 4046 3910 3881 3852 3772 3692 3652 3714 3718 3722 3678 3634 3539 3444 3454 3465 3386
$$ packed form
1539C982R6R6k9l0N6N6P4P3J26J25K7K6J13J12K6K6P8P7J12J13L34L34K27K27K26K27N5N5
1536G020J40J40J35J34J86J86J16J15J16J15L1L1L0L1q9q8K6K66O78J122J457J457J075O32
1533A5062K88J18J8J88M57N59N64O66R60J062J065J235J763K344K725L374M307M955M848M404
1531E0962M011L636L389M105O054Q613J1266J5257K1927L1307M4310O6586J05096J56574J99304
1529G32397K01657J44602L9566p4482j54956j81569j64069j28133r4598p0216n2579l9082
1527A58538k9292k2708j7829j3612j0303p999o397n228m649m405l961l066k213j701j394j191
1525B2590j294j665j903j742j502j379j277j049r46j123j123r03m60j6L59O69O70K09k35m68
1523G412m67m89m89l52k49l51l51l13k11j37l6N6N6l3j36k9k9q0q0m0O2MMm4m4r5r5J0J1p9
$$ plain form
1519 3386 3204 3096 3090 3071 3052 3000 2949 2846 2743 2709 2676 2643 2609 2603 2596 2589 2583 2515 2448 2380 2313 2282 2251 2175 2099 2142 2288 2348 2306 2354 2402 2389 2273 2175
1515 2175 2180 2211 2139 2082 2127 2216 2204 2130 2056 2129 2202 2169 2136 2104 2071 2064 2058 2026 1995 2019 2043 2016 1989 1980 1972 1964 1955 1903 1851 1884 1917 2007 2096 2100 2103 2062 2021 2005 1989
1510 1989 2011 2034 2005 1976 1983 1990 2022 2055 2095 2134 2148 2163 2116 2069 2142 2215 2261 2306 2202 2097 2051 2056 2045 1932 1775 1720 1755 1790 1798 1807 1764 1722 1747 1773 1773
1506 1773 1772 1758 1743 1764 1734 1660 1688 1776 1863 1836 1808 1730 1651 1657 1663 1643 1623 1540 1457 1409 1310 1242 1277 1405 1533 1549 1565 1529 1494 1500 1506 1563 1620 1624 1628 1607 1585
1501 1585 1585 1584 1635 1685 1720 1756 1705 1655 1620 1585 1534 1432 1345 1360 1398 1384 1332 1332 1384 1437 1457 1478 1498 1519 1527 1536 1493 1450 1421 1393 1483 1574 1631 1689 1695 1701 1664
1497 1664 1628 1591 1554 1542 1530 1546 1563 1611 1710 1790 1768 1691 1665 1689 1713 1695 1676 1658 1639 1602 1564 1612 1660 1703 1746 1703 1661 1607 1554 1526 1498 1519 1541 1562
1493 1562 1584 1607 1631 1661 1588 1514 1439 1477 1516 1508 1500 1492 1484 1457 1430 1488 1546 1530 1514 1498 1482 1477 1473 1520 1566 1586 1606 1574 1543 1467 1392 1368 1344 1392 1440 1488 1536
1488 1536 1588 1639 1605 1571 1492 1413 1453 1493 1508 1522 1537 1551 1531 1511 1491 1470 1557 1643 1736 1726 1654 1582 1555 1528 1578 1627 1592 1556 1497 1438 1465 1491 1539 1587
$$ packed form
1519C386j82j08oj9j9n2n1j03j03l4l3l3l4oppoo8o7o8o7l1l1p6p6M3J46O0m2M8M8j3j16r8
1515B175NL1p2n7M5Q9j2p4p4P3P3l3l3l2l3pol2l1K4K4k7k7rqqrn2n2L3L3R0Q9MLm1m1j6j6
1510A989K2K3k9k9PPL2L3M0L9J4J5m7m7P3P3M6M5j04j05m6Nj1j13j57n5L5L5QRm3m2K5K6%
1506A773jj4j5K1l0p4K8Q8Q7k7k8p8p9OOk0k0q3q3m8r9o8L5J28J28J6J6l6l5OON7N7MMk1k2
1501A585%jN1N0L5L6n1n0l5l5n1j02q7J5L8j4n2%N2N3K0K1K0K1QRm3m3k9k8R0R1N7N8OOl7
1497A664l6l7l7j2j2J6J7M8R9Q0k2p7k6K4K4j8j9j8j9l7l8M8M8M3M3m3m2n4n3k8k8K1K2K1
1493A562K2K3K4L0p3p4p5L8L9qqqqk7k7N8N8j6j6j6j6nmM7M6K0K0l2l1p6p5k4k4M8M8M8M8
1488A536N2N1l4l4p9p9M0M0J5J4J5J4k0k0k0k1Q7Q6R3j0p2p2k7k7N0M9l5l6n9n9K7K6M8M8
$$ plain form
1484 1587 1641 1593 1574 1556 1616 1677 1574 1472 1454 1437 1466 1494 1522 1551 1549 1548 1632 1716 1760 1805 1849 1894 1957 2019 2031 2042 2124 2206 2230 2084 1859 1633 1483
1480 1483 1332 1241 1149 1177 1205 1197 1190 1234 1278 1300 1322 1344 1366 1350 1334 1369 1404 1381 1359 1337 1315 1376 1437 1556 1572 1563 1554 1624 1694 1663 1632 1686 1740 1734 1728 1841
1476 1841 1954 2072 2189 2381 2676 3058 3644 4574 6118 8615 12135 16074 18988 19507 17637 14441 11246 8717 6803 5396
1473 5396 4466 3728 3194 2750 2511 2361 2211 2074 1937 1845 1752 1660 1568 1489 1411 1452 1493 1453 1414 1374 1335 1370 1405 1441 1476 1453 1431 1460 1489 1523
1469 1523 1557 1472 1387 1312 1238 1249 1260 1268 1276 1284 1292 1397 1501 1419 1336 1346 1356 1366 1376 1379 1382 1385 1388 1418 1448 1477 1507 1459 1411 1448 1485 1510 1534 1473 1412 1415 1419 1422 1425
1465 1425 1410 1395 1380 1365 1388 1410 1433 1455 1402 1349 1295 1242 1316 1390 1413 1436 1379 1322 1385 1447 1475 1503 1479 1456 1437 1417 1347 1277 1296 1314 1248 1181 1215 1249
1461 1249 1282 1316 1296 1275 1254 1234 1268 1303 1338 1373 1361 1349 1338 1326 1398 1469 1422 1374 1398 1422 1497 1573 1471 1369 1353 1336 1368 1400 1516 1633 1701 1769
1457 1769 1785 1802 1915 2028 2284 2642 3063 3687 4553 5624 6520 6938 6798 6180 5364 4548 3815 3287 2874 2565 2296 2026 1851
$$ packed form
1484A587N4m8j9j8O0O1j03j02j8j7K9K8K8K9kjQ4Q4M4M5M4M5O3O2J2J1Q2Q2K4j46k25k26j50
1480A483j51r1r2K8K8qpM4M4K2K2K2K2j6j6L5L5k3k2k2k2O1O1J19J6rrP0P0l1l1N4N4ooJ13
1476A841J13J18J17J92K95L82N86R30J544K497L520L939K914N19j870l196l195k529j914j407
1473E396r30p38n34m44k39j50j50j37j37r2r3r2r2p9p8M1M1m0l9m0l9L5L5L6L5k3k2K9K9L4
1469A523L4q5q5p5p4J1J1QQQQJ05J04q2q3J0J0J0J0LLLLL0L0K9L0m8m8L7L7K5K4o1o1LMLL
1465A425j5j5j5j5K3K2K3K2n3n3n4n3P4P4K3K3n7n7O3O2K8K8k4k3j9k0p0p0J9J8o6o7L4L4
1461A249L3L4k0k1k1k0L4L5L5L5j2j2j1j2P2P1m7m8K4K4P5P6j02j02j6j7L2L2J16J17O8O8
1457A769J6J7J13J13K56L58M21O24Q66J071Q96M18j40o18q16q16p33n28m13l09k69k70j75
$$ plain form
1454 1851 1675 1619 1563 1518 1472 1375 1278 1286 1295 1303 1312 1283 1255 1312 1369 1380 1391 1351 1311 1383 1455 1441 1428 1375 1322 1269 1216 1228 1240 1338 1435 1386 1338 1289 1240 1213
1449 1213 1185 1157 1129 1163 1197 1180 1163 1257 1350 1359 1367 1360 1352 1345 1337 1226 1114 1191 1267 1355 1443 1412 1381 1344 1307 1322 1336 1318 1299 1280 1262 1284 1305 1282 1260 1269 1380
1445 1380 1434 1488 1403 1319 1320 1321 1327 1333 1254 1175 1156 1136 1202 1268 1270 1272 1223 1173 1143 1113 1195 1278 1346 1311 1249 1187 1155 1123 1177 1231 1201 1172 1142 1113 1137 1162 1186
1440 1186 1211 1289 1366 1325 1283 1308 1333 1245 1157 1134 1215 1237 1260 1264 1268 1272 1276 1185 1094 1088 1083 1131 1179 1227 1275 1234 1192 1151 1109 1145 1181 1132 1082 1071 1060 1134 1208
1436 1208 1237 1265 1293 1321 1327 1334 1341 1348 1269 1189 1162 1134 1138 1142 1146 1150 1183 1217 1200 1182 1209 1236 1212 1189 1207 1226 1245 1264 1286 1308 1330 1352 1343 1334 1325 1316 1279 1241 1254 1268
1431 1268 1289 1311 1332 1353 1379 1405 1345 1285 1335 1385 1435 1484 1477 1469 1410 1351 1303 1255 1207 1159 1243 1328 1361 1394 1372 1350 1327 1305 1273 1242 1210 1178 1201 1224 1246
1427 1246 1269 1273 1276 1331 1385 1389 1392 1343 1295 1343 1391 1388 1384 1385 1385 1334 1283 1252 1221 1190 1159 1223 1286 1263 1241 1259 1278 1211 1144 1163 1183 1203 1222 1221 1219 1217 1215 1164 1112 1088
1422 1088 1166 1239 1312 1272 1231 1270 1309 1320 1229 1200 1172 1144 1115 1108 1203 1292 1381 1405 1429 1340 1250 1150 1153 1183 1213 1143 1073 1059 1147 1276 1303 1212 1122 1116 1212
$$ packed form
1454A851j76n6n6m5m6r7r7QRQRk9k8N7N7J1J1m0m0P2P2j4j3n3n3n3n3J2J2R8R7m9m8m9m9k7
1449A213k8k8k8L4L4j7j7R4R3RQpqpqj11j12P7P6Q8Q8l1l1l7l7J5J4j8j9j9j8K2K1k3k2RJ11
1445A380N4N4q5q4JJOOp9p9j9k0O6O6KKm9n0l0l0Q2Q3O8l5o2o2l2l2N4N4l0k9l0k9K4K5K4
1440A186K5P8P7m1m2K5K5q8q8k3Q1K2K3MMMMr1r1onM8M8M8M8m1m2m1m2L6L6m9n0j1j1P4P4
1436A208K9K8K8K8OPPPp9q0k7k8MMMML3L4j7j8K7K7k4k3J8J9J9J9K2K2K2K2rrrrl7l8J3J4
1431A268K1K2K1K1K6K6o0o0N0N0N0M9pqn9n9m8m8m8m8Q4Q5L3L3k2k2k3k2l2l1l2l2K3K3K2
1427A246K3MLN5N4MLm9m8M8M8lmJ%n1n1l1l1l1l1O4O3k3k2J8J9o7o7J9K0K0J9jkkkn1n2k4
1422A088P8P3P3m0m1L9L9J1r1k9k8k8k9pR5Q9Q9K4K4q9r0j00LL0L0p0p0j4Q8J29K7r1r0oR6
$$ plain form
1418 1212 1301 1391 1382 1373 1364 1355 1343 1331 1274 1218 1149 1183 1211 1238 1274 1309 1344 1379 1353 1326 1351 1376 1308 1241 1176 1111 1137 1213 1319 1322 1218 1115 1067 1121 1172
1413 1172 1223 1280 1338 1371 1403 1385 1367 1355 1343 1380 1416 1381 1294 1227 1262 1354 1395 1352 1309 1354 1399 1445 1490 1421 1352 1290 1228 1228 1331 1484 1586 1561 1435
1409 1435 1283 1182 1157 1132 1161 1190 1277 1365 1299 1233 1247 1261 1275 1289 1292 1295 1246 1198 1208 1219 1280 1342 1357 1373 1310 1247 1182 1219 1283 1348 1391 1434 1426 1417 1364
1405 1364 1311 1310 1308 1281 1255 1184 1113 1060 1110 1212 1264 1223 1130 1085 1141 1207 1170 1111 1053 1070 1088 1106 1123 1147 1171 1195 1219 1310 1401 1396 1288 1190 1092 1073 1054
1401 1054 1108 1161 1260 1358 1456 1452 1352 1252 1269 1285 1252 1167 1105 1145 1176 1206 1264 1322 1301 1280 1230 1282 1334 1284 1210 1136 1140 1144 1163 1181 1154 1128 1126 1227 1379
1396 1379 1428 1359 1291 1215 1140 1057 975 1011 1048 1090 1132 1174 1216 1199 1182 1166 1149 1182 1215 1198 1180 1132 1085 1043 1002 983 1067 1202 1234 1158 1082 1187 1292
1392 1292 1298 1303 1303 1302 1317 1230 1148 1067 1098 1129 1211 1293 1247 1201 1206 1212 1262 1312 1311 1310 1239 1167 1147 1127 1162 1197 1181 1165 1235 1305 1289 1274 1228 1183 1223 1263 1234 1205
1388 1205 1227 1249 1290 1330 1319 1309 1301 1293 1285 1277 1198 1120 1093 1065 1074 1082 1091 1099 1101 1104 1106 1108 1076 1045 1064 1084 1072 1061 1101 1141 1170 1199 1177 1155 1115 1075 980 988 1127 1317
$$ packed form
1418A212Q9R0rrrrj2j2n7n6o9L4K8K7L6L5L5L5k6k7K5K5o8o7o5o5K6P6J06Lj04j03m8N4N1
1413A172N1N7N8L3L2j8j8j2j2L7L6l5q7o7L5R2M1m3m3M5M5M6M5o9o9o2o2%J03J53J02k5j26
1409A435j52j01k5k5K9K9Q7Q8o6o6J4J4J4J4LLm9m8J0J1O1O2J5J6o3o3o5L7O4O5M3M3qrn3
1405A364n3jkk7k6p1p1n3N0J02N2m1r3m5N6O6l7n9n8J7J8J8J7K4K4K4K4R1R1nj08r8r8j9j9
1401A054N4N3R9R8R8mj00j00J7J6l3q5o2M0L1L0N8N8k1k1n0N2N2n0p4p4MMJ9J8k7k6kJ01J52
1396A379M9o9o8p6p5q3q2L6L7M2M2M2M2j7j7j6j7L3L3j7j8m8m7m2m1j9Q4J35L2p6p6J05J05
1392A292ON%jJ5q7q2q1L1L1Q2Q2m6m6NON0N0jjp1p2k0k0L5L5j6j6P0P0j6j5m6m5M0M0k9k9
1388A205K2K2M1M0j1j0qqqqp9p8k7k8RQRQKLKKl2l1J9K0j2j1M0M0K9K9k2k2m0m0r5QJ39J90
$$ plain form
1383 1317 1434 1380 1314 1351 1377 1300 1195 1090 1098 1106 1169 1233 1296 1359 1313 1267 1341 1414 1441 1469 1445 1421 1378 1334 1340 1397 1389 1279 1121 1066 1141 1216 1212 1208 1233
1379 1233 1258 1282 1307 1293 1278 1248 1166 1070 1077 1170 1263 1255 1145 1067 1039 1039 1089 1193 1297 1321 1242 1140 1090 1095 1099 1106 1114 1102 1091 1080 1068 1021 973 1045 1117 1185
1374 1185 1253 1202 1151 1113 1076 1124 1172 1197 1222 1248 1273 1286 1298 1311 1323 1278 1232 1238 1244 1256 1268 1273 1279 1289 1197 1086 1026 1055 1134 1188 1242 1232 1223 1213 1203 1202 1202
1370 1202 1253 1304 1299 1295 1290 1285 1265 1246 1226 1207 1196 1184 1091 998 1018 1089 1103 1016 1018 1021 1103 1185 1192 1199 1257 1316 1340 1365 1305 1244 1208 1172 1136 1100 1171 1243 1229 1216
1365 1216 1140 1065 1040 1016 1095 1173 1252 1330 1314 1298 1230 1163 1153 1143 1218 1293 1265 1237 1209 1181 1246 1310 1289 1269 1305 1342 1379 1416 1349 1282 1266 1250 1278 1306
1361 1306 1334 1362 1354 1346 1339 1331 1265 1198 1183 1168 1166 1163 1161 1158 1189 1219 1250 1280 1272 1264 1255 1247 1286 1324 1312 1299 1257 1216 1259 1303 1314 1326 1252 1178 1127 1075 1178 1280 1331
1356 1331 1382 1313 1245 1215 1185 1207 1228 1198 1167 1136 1106 1154 1202 1199 1196 1209 1222 1235 1248 1260 1273 1285 1298 1351 1404 1371 1339 1281 1222 1249 1275 1284 1293 1250 1207 1186
1352 1186 1166 1145 1124 1136 1148 1114 1080 1165 1335 1458 1428 1350 1273 1237 1202 1167 1132 1148 1165 1199 1234 1268 1303 1284 1266 1333 1400 1333 1265 1283 1301 1291 1281
$$ packed form
1383A317J17n4o6L7K6p7j05j05QQO3O4O3O3m6m6P4P3K7K8k4k4m3m4ON7qj10j58n5P5P5mmK5
1379A233K5K4K5j4j5l0q2r6PR3R3qj10p8k8%N0J04J04K4p9j02n0NMPQj2j1j1j2m7m8P2P2O8
1374A185O8n1n1l8l7M8M8K5K5K6K5J3J2J3J2m5m6OOJ2J2NOJ0r2j11o0K9P9N4N4j0rj0j0j%
1370A202N1N1nmnnk0j9k0j9j1j2r3r3K0P1J4q7KLQ2Q2PPN8N9K4K5o0o1l6l6l6l6P1P2j4j3
1365A216p6p5k5k4P9P8P9P8j6j6o8o7j0j0P5P5k8k8k8k8O5O4k1k0L6L7L7L7o7o7j6j6K8K8
1361A306K8K8qqpqo6o7j5j5klklL1L0L1L0qqrqL9L8j2j3m2m1M3M4J1J2p4p4n1n2J03J02N1
1356A331N1o9o8l0l0K2K1l0l1l1l0M8M8llJ3J3J3J3J2J3J2J3N3N3l3l2n8n9K7K6RRm3m3k1
1352A186k0k1k1J2J2l4l4Q5J70J23l0p8p7l6l5l5l5J6J7L4L5L4L5j9j8O7O7o7o8J8J8j0j0
$$ plain form
1348 1281 1271 1260 1213 1165 1237 1309 1367 1424 1396 1369 1265 1162 1110 1179 1262 1346 1318 1290 1238 1187 1217 1247 1213 1128 1106 1169 1242 1265 1270 1276 1248 1221 1194 1166
1343 1166 1165 1165 1164 1163 1123 1083 1043 1002 1026 1050 1074 1098 1093 1088 1083 1078 1134 1190 1161 1131 1128 1125 1122 1119 1165 1211 1138 1065 1061 1057 1054 1050 1039 1028 1017 1006 1040 1073 1107 1141 1143 1144 1197
1338 1197 1250 1257 1263 1219 1174 1141 1107 1073 1039 1066 1093 1121 1148 1235 1322 1289 1256 1181 1106 1115 1125 1147 1168 1139 1109 1130 1151 1172 1193 1181 1169 1157 1145 1176 1208 1239
1334 1239 1271 1293 1314 1285 1256 1254 1252 1250 1248 1272 1295 1268 1240 1209 1178 1147 1115 1114 1113 1114 1116 1150 1236 1271 1203 1118 1135 1173 1212 1206 1200 1195 1189 1175 1161 1130 1049 988 1029 1158
1329 1158 1235 1222 1209 1244 1279 1218 1157 1148 1138 1159 1181 1202 1223 1250 1277 1184 1092 1105 1118 1131 1144 1138 1133 1127 1121 1087 1052 1069 1086 1136 1186 1236 1286 1232 1179 1125 1072
1324 1072 1068 1063 1094 1073 1025 1079 1187 1243 1249 1255 1343 1432 1402 1372 1341 1311 1297 1283 1218 1152 1115 1077 1125 1173 1138 1104 1069 1035 1049 1064 1130 1196 1235 1275 1314 1354
1320 1354 1275 1197 1169 1141 1096 1050 1089 1129 1159 1189 1219 1249 1296 1344 1340 1336 1376 1416 1336 1256 1141 1026 1041 1158 1256 1354 1339 1324 1275 1226 1228 1230 1263 1297 1278
1316 1278 1260 1258 1255 1253 1250 1298 1345 1273 1202 1122 1042 1082 1121 1185 1248 1226 1203 1182 1161 1191 1221 1188 1154 1175 1299 1412 1423 1379 1334 1319 1305 1239 1173 1215 1257
$$ packed form
1348A281j0j1m7m8P2P2N8N7k8k7j04j03n2O9Q3Q4k8k8n2n1L0L0l4q5k2O3P3K3NOk8k7k7k8
1343A166j%jjm0m0m0m1K4K4K4K4nnnnN6N6k9l0llllM6M6p3p3mmlmj1j1j1j1L4L3L4L4KJN3
1338A197N3POm4m5l3l4l4l4K7K7K8K7Q7Q7l3l3p5p5RJ0K2K1k9l0K1K1K1K1j2j2j2j2L1L2L1
1334A239L2K2K1k9k9kkkkK4K3k7k8l1l1l1l2jjJKL4Q6L5o8q5J7L8L9oonoj4j4l1q1o1M1J29
1329A158P7j3j3L5L5o1o1rj0K1K2K1K1K7K7r3r2J3J3J3J3onool4l5J7J7N0N0N0N0n4n3n4n3
1324A072mnL1k1m8N4J08N6OOQ8Q9l0l0l1l0j4j4o5o6l7l8M8M8l5l4l5l4J4J5O6O6L9M0L9M0
1320A354p9p8k8k8m5m6L9M0L0L0L0L0M7M8mmM0M0q0q0j15j15J5J17R8R8j5j5m9m9KKL3L4j9
1316A278j8klklM8M7p2p1q0q0M0L9O4O3k2k3k1k1L0L0l3l4K1J24J13J1m4m5j5j4o6o6M2M2
$$ plain form
1311 1257 1248 1239 1287 1335 1333 1330 1310 1289 1320 1351 1349 1347 1293 1240 1227 1214 1201 1187 1221 1255 1238 1220 1192 1165 1137 1109 1080 1051 1108 1164 1203 1242 1196 1149 1186 1222 1259
1307 1259 1296 1258 1219 1181 1142 1177 1211 1245 1279 1277 1275 1272 1270 1287 1304 1270 1236 1202 1169 1186 1203 1139 1074 1061 1047 1110 1172 1235 1298 1308 1319 1278 1237 1240 1242 1194 1145
1302 1145 1226 1308 1338 1368 1302 1236 1221 1206 1234 1263 1292 1320 1273 1225 1228 1232 1216 1200 1184 1168 1222 1275 1277 1280 1324 1368 1360 1353 1336 1319 1251 1183 1140 1096 1138 1179 1170 1160
1298 1160 1150 1141 1198 1256 1194 1132 1176 1221 1180 1139 1131 1123 1167 1210 1234 1258 1282 1306 1317 1328 1339 1350 1370 1389 1357 1325 1243 1161 1130 1099 1151 1203 1203 1204 1198 1192 1187 1181 1178
1293 1178 1176 1174 1171 1250 1329 1356 1384 1379 1375 1319 1264 1224 1184 1230 1276 1284 1292 1300 1308 1338 1368 1314 1259 1150 1041 1052 1062 1158 1254 1265 1276 1235 1195 1206 1217 1215 1213 1211 1210 1226
1288 1226 1242 1258 1275 1252 1230 1208 1186 1215 1244 1273 1302 1312 1323 1334 1344 1309 1273 1289 1304 1258 1212 1165 1119 1125 1131 1085 1040 1020 1000 1100 1200 1176 1152 1128
1284 1128 1104 1187 1271 1269 1268 1162 1057 1037 1016 1078 1140 1202 1264 1256 1248 1155 1062 1089 1117 1144 1171 1179 1187 1196 1204 1201 1199 1247 1296 1328 1360 1341 1322 1252 1182 1197 1212 1209 1207
1279 1207 1256 1305 1343 1381 1266 1151 1109 1066 1144 1221 1297 1373 1398 1423 1395 1368 1341 1313 1313 1312 1311 1310 1295 1280 1265 1250 1270 1290 1310 1330 1352 1373 1344 1314 1334
$$ packed form
1311A257rrM8M8klk0k1L1L1kkn4n3j3j3j3j4L4L4j7j8k8k7k8k8k9k9N7N6L9L9m6m7L7L6L7
1307A259L7l8l9l8l9L5L4L4L4kklkJ7J7l4l4l4l3J7J7o4o5j3j4O3O2O3O3J0J1m1m1LKm8m9
1302A145Q1Q2L0L0o6o6j5j5K8K9K9K8m7m8LMj6j6j6j6N4N3KLM4M4qpj7j7o8o8m3m4M2M1rj0
1298A160j0rN7N8o2o2M4M5m1m1qqM4M3K4K4K4K4J1J1J1J1K0J9l2l2q2q2l1l1N2N2%Joonol
1293A178kklP9P9K7K8nmn6n5m0m0M6M6QQQQL0L0n4n5j09j09J1J0R6R6J1J1m1m0J1J1kkkjJ6
1288A226J6J6J7k3k2k2k2K9K9K9K9J0J1J1J0l5l6J6J5m6m6m7m6OOm6m5k0k0J00J00k4k4k4
1284A128k4Q3Q4kjj06j05k0k1O2O2O2O2qqr3r3K7K8K7K7QQRQlkM8M9L2L2j9j9p0p0J5J5lk
1279A207M9M9L8L8j15j15m2m3P8P7P6P6K5K5k8k7k7k8%jjjj5j5j5j5K0K0K0K0K2K1k9l0K0
$$ plain form
1275 1334 1353 1373 1392 1281 1170 1179 1187 1245 1304 1243 1182 1159 1137 1166 1195 1189 1184 1131 1078 1125 1224 1266 1206 1173 1141 1102 1063 1038 1012 1038 1064 1138 1212 1202 1140
1271 1140 1115 1192 1237 1231 1220 1210 1275 1341 1373 1303 1205 1108 1135 1162 1189 1216 1271 1325 1329 1333 1306 1280 1254 1228 1244 1259 1285 1208 1128 1099 1120 1141 1172 1202 1232 1263
1266 1263 1320 1377 1440 1401 1311 1221 1210 1199 1214 1230 1245 1260 1261 1261 1210 1160 1213 1267 1321 1374 1404 1433 1412 1340 1273 1309 1348 1284 1119 1055 1118 1231 1277 1273 1268
1262 1268 1314 1371 1376 1294 1212 1187 1162 1187 1213 1211 1208 1206 1203 1254 1305 1304 1304 1280 1257 1233 1210 1169 1128 1088 1047 994 940 1006 1072 1101 1130 1158 1187 1179 1172 1164 1156 1163 1169 1175 1181 1236
1257 1236 1291 1291 1188 1148 1211 1318 1323 1243 1162 1228 1295 1269 1243 1216 1190 1238 1285 1281 1278 1208 1138 1154 1169 1197 1225 1253 1281 1293 1305 1231 1158 1131 1104 1128 1152
1252 1152 1141 1131 1121 1111 1156 1200 1245 1290 1250 1211 1171 1132 1127 1123 1204 1284 1258 1233 1258 1283 1246 1209 1172 1135 1142 1150 1158 1165 1252 1338 1340 1341 1252 1162 1124 1086 1075 1063
1248 1063 1137 1211 1264 1317 1284 1252 1285 1318 1299 1281 1212 1143 1158 1174 1189 1203 1269 1334 1309 1284 1259 1234 1219 1204 1138 1072 1099 1127 1155 1182 1204 1226 1134 1043
1244 1043 1023 1105 1215 1325 1347 1369 1313 1256 1197 1240 1308 1376 1345 1262 1198 1237 1293 1297 1252 1206 1261 1315 1344 1272 1195 1169 1162 1156 1179 1253 1355 1356 1225 1094
$$ packed form
1275A334J9K0J9j11j11RQN8N9o1o1k3k2K9K9onn3n3M7R9M2o0l3l2l9l9k5k6K6K6P4P4j0o2
1271A140k5P7M5oj1j0O5O6L2p0r8r7K7K7K7K7N5N4MMk7k6k6k6J6J5K6p7q0k9K1K1L1L0L0L1
1266A263N7N7O3l9r0r0j1j1J5J6J5J5J%n1n0N3N4N4N3L0K9k1p2o7L6L9o4j65o4O3J13M6mn
1262A268M6N7Nq2q2k5k5K5K6klklN1N1j%k4k3k4k3m1m1m0m1n3n4O6O6K9K9K8K9qpqqPOOON5
1257A236N5%j03m0O3J07Nq0q1O6O7k6k6k7k6M8M7mlp0p0J6J5K8K8K8K8J2J2p4p3k7k7K4K4
1252A152j1j0j0j0M5M4M5M5m0l9m0l9nmQ1Q0k6k5K5K5l7l7l7l7PQQPQ7Q6KJq9r0l8l8j1j2
1248A063P4P4N3N3l3l2L3L3j9j8o9o9J5J6J5J4O6O5k5k5k5k5j5j5o6o6K7K8K8K7K2K2r2r1
1244A043k0Q2J10J10K2K2n6n7n9M3O8O8l1q3o4L9N6Mm5m6N5N4K9p2p7k6poK3P4J02Jj31j31
$$ plain form
1240 1094 1053 1114 1128 1141 1160 1180 1162 1145 1127 1109 1116 1123 1130 1137 1113 1090 1067 1044 1059 1074 1088 1103 1071 1038 1091 1145 1231 1318 1319 1320 1220 1120 1105 1090 1059 1028
1235 1028 997 965 1000 1035 1070 1105 1083 1061 1124 1187 1140 1093 1097 1102 1165 1229 1241 1254 1305 1355 1355 1355 1284 1213 1262 1311 1353 1396 1438 1480 1555 1630 1705 1780 1799 1819
1231 1819 1838 1858 1780 1703 1626 1548 1527 1507 1486 1465 1344 1223 1191 1262 1305 1246 1219 1243 1303 1312 1320 1380 1422 1413 1404 1446 1489 1480 1419 1357 1317 1276 1287 1298 1363 1428
1226 1428 1373 1318 1333 1347 1362 1377 1346 1315 1369 1423 1454 1484 1515 1546 1595 1645 1746 1846 1852 1858 1953 2151 2255 2256 2201 2147 2104 2061 2070 2078 2056 2033 2004 1975 1891
1222 1891 1705 1529 1524 1618 1661 1625 1588 1552 1515 1479 1442 1413 1384 1303 1223 1287 1350 1414 1478 1487 1497 1506 1516 1481 1445 1359 1272 1226 1179 1252 1325 1398 1471 1424 1377
1218 1377 1338 1298 1309 1320 1401 1481 1562 1642 1705 1769 1678 1588 1642 1697 1700 1704 1699 1693 1688 1683 1613 1543 1524 1505 1457 1409 1441 1472 1493 1412 1276 1140 1124 1210 1267 1273 1240
1213 1240 1206 1170 1133 1142 1150 1243 1337 1341 1345 1365 1436 1468 1398 1308 1270 1260 1251 1296 1341 1372 1403 1383 1362 1356 1350 1344 1337 1419 1501 1430 1308 1255 1303 1400 1395 1337 1280 1302 1323
1208 1323 1364 1405 1395 1385 1351 1318 1364 1410 1389 1266 1192 1219 1297 1323 1301 1331 1340 1298 1259 1271 1318 1365 1330 1295 1278 1262 1245 1228 1276 1325 1374 1422 1437 1451
$$ packed form
1240A094m1O1J4J3J9K0j8j7j8j8PPPPk4k3k3k3J5J5J4J5l2l3N3N4Q6Q7JJj00j00j5j5l1l1
1235A028l1l2L5L5L5L5k2k2O3O3m7m7MNO3O4J2J3N1N0%%p1p1M9M9M2M3M2M2P5P5P5P5J9K0
1231A819J9K0p8p7p7p8k1k0k1k1j21j21l2P1M3n9k7K4O0RQO0M2rrM2M3ro1o2m0m1J1J1O5O5
1226A428n5n5J5J4J5J5l1l1N4N4L1L0L1L1M9N0J01J00OOR5J98J04Jn5n4m3m3RQk2k3k9k9q4
1222A891j86j76nR4M3l6l7l6l7l6l7k9k9q1q0O4O3O4O4RJ0RJ0l5l6q6q7m6m7P3P3P3P3m7m7
1218A377l9m0J1J1Q1Q0Q1Q0O3O4r1r0N4N5LMnonnp0p0j9j9m8m8L2L1K1q1j36j36j6Q6N7Ol3
1213A240l4l6l7RQR3R4MMK0P1L2p0r0l8j0rM5M5L1L1k0k1ooopQ2Q2p1j22n3M8R7nn8n7K2K1
1208A323M1M1j0j0l4l3M6M6k1j23p4K7P8K6k2L0Rm2l9J2M7M7l5l5j7j6j7j7M8M9M9M8J5J4
$$ plain form
1204 1451 1346 1242 1181 1120 1145 1170 1203 1236 1269 1302 1336 1370 1404 1438 1504 1570 1516 1463 1388 1313 1290 1266 1298 1330 1276 1223 1233 1243 1205 1167 1266 1416 1478
1200 1478 1438 1430 1473 1510 1495 1459 1422 1433 1444 1478 1513 1523 1430 1361 1343 1373 1352 1290 1279 1318 1357 1297 1186 1101 1117 1190 1314 1409 1505 1538 1469 1381 1344 1357
1196 1357 1422 1489 1506 1490 1474 1455 1437 1424 1412 1451 1490 1513 1536 1508 1480 1447 1415 1407 1501 1609 1665 1705 1745 1786 1828 1870 1911 2023 2135 2094 2052 2077 2101
1192 2101 2126 2151 2081 2012 1943 1874 1847 1821 1744 1666 1567 1468 1421 1373 1395 1417 1438 1460 1462 1465 1467 1470 1566 1663 1605 1548 1522 1496 1470 1444 1472 1501 1530 1559 1605 1651
1188 1651 1646 1640 1695 1749 1779 1707 1603 1551 1586 1671 1741 1760 1780 1850 1982 2063 2091 2118 2151 2184 2131 2079 2031 1982 1934 1886 1870 1855 1840 1825 1848 1871 1839 1704
1184 1704 1601 1599 1654 1708 1794 1880 1942 1901 1846 1841 1853 1865 1836 1807 1863 1920 1943 1966 1989 2012 1994 1976 1957 1939 1980 2020 2061 2102 2116 2130 2093 2056 2080 2104 2128
1179 2128 2152 2100 2049 2048 2047 2051 2054 2108 2163 2175 2188 2201 2214 2260 2305 2300 2295 2374 2454 2507 2561 2635 2708 2827 2945 3091 3135 3049 2962 2947 2932 2942 2953 2967 2981 2996
1175 2996 3010 3021 3032 3043 3054 3081 3108 3135 3162 3146 3129 3164 3199 3239 3280 3405 3531 3666 3801 3817 3832 3952 4073 4244 4415 4599 4783 4921 5060
$$ packed form
1204A451j05j04o1o1K5K5L3L3L3L3L4L4L4L4O6O6n4n3p5p5k3k4L2L2n4n3J0J0l8l8R9J50O2
1200A478m0qM3L7j5l6l7J1J1L4L5J0r3o9j8L0k1o2j1L9L9o0j11q5J6P3J24R5R6L3o9q8l7J3
1196A357O5O7J7j6j6j9j8j3j2L9L9K3K3k8k8l3l2qR4J08N6M0M0M1M2M2M1J12J12m1m2K5K4
1192B101K5K5p0o9o9o9k7k6p7p8r9r9m7m8K2K2K1K2KLKLR6R7n8n7k6k6k6k6K8K9K9K9M6M6
1188A651noN5N4L0p2j04n2L5Q5P0J9K0P0J32Q1K8K7L3L3n3n2m8m9m8m8j6j5j5j5K3K3l2j35
1184A704j03kN5N4Q6Q6O2m1n5nJ2J2k9k9N6N7K3K3K3K3j8j8j9j8M1M0M1M1J4J4l7l7K4K4K4
1179B128K4n2n1jjMLN4N5J2J3J3J3M6M5nnP9Q0N3N4P4P3J19J18J46M4q6q7j5j5J0J1J4J4J5
1175B996J4J1J1J1J1K7K7K7K7j6j7L5L5M0M1J25J26J35J35J6J5J20J21J71J71J84J84J38J39
$$ plain form
1171 5060 5289 5620 5944 6268 6598 6928 7315 7702 8158 8716 9312 9908 10654 11570 12685 14039 15684 17910 20822 24314 28193
1169 28193 32243 36350 40457 44278 47520 49928 51551 52678 53566 54372 55009 55434 55757 56158 56560 56699 55985 54084 51193
1166 51193 47669 43770 39585 35093 30553 26389 22899 20125 17988 16295 14998 14077 13441 12975 12636 12469 12474 12582 12847 13283
1164 13283 13986 14860 15871 16882 18086 19290 20409 21527 22453 23379 24294 25209 26232 27493 29127 31341 34485 38687 43848
1162 43848 49794 56315 63349 70847 78788 87114 95678 104328 112739 120560 127391 133019 137318 139947 140632 139248 136193
1160 136193 132108 127307 121794 115700 109477 103425 97356 90843 83868 76653 69433 62212 54887 47664 40946 35082 30283
1157 30283 26610 23845 21729 20080 18874 18070 17640 17486 17638 18104 18809 19590 20371 21233 22095 22812 23222 23308 23155 22985 22816
1155 22816 22608 22400 22442 22927 23938 25530 27835 31130 35730 41728 49101 57601 66833 76509 86526 96713 106628 115416
$$ packed form
1171E060K29L31L24L24L30L30L87L87M56N58N96N96P46R16J115J354J645K226K912L492L879
1169B8193M050M107M107L821L242K408J623J127Q88Q06O37M25L23M01M02J39p14j901k891
1166E1193l524l899m185m492m540m164l490k774k137j693j297r21o36m66l39j67NJ08K65M36
1164A3283P03Q74J011J011J204J204J119J118R26R26R15R15J023J261J634K214L144M202N161
1162D3848N946O521P034P498P941Q326Q564Q650Q411P821O831N628M299K629O85j384l055
1160A36193m085m801n513o094o223o052o069o513o975p215p220p221p325p223o718n864m799
1157C0283l673k765k116j649j206q04m30j54J52M66P05P81P81Q62Q62P17M10Q6j53j70j69
1155B2816k08k08M2M85J011J592K305L295M600N998P373Q500R232R676J0017J0187R915Q788
$$ plain form
1153 115416 122346 127058 129710 130418 129073 125305 118924 110393 100594 90283 79786 69290 59102 49767 41675 34982
1151 34982 29534 25211 21793 19091 16951 15255 13861 12706 11687 10839 10098 9357 8715 8073 7551 7029 6579 6129 5765 5400
1148 5400 5042 4685 4423 4263 4103 3942 3839 3736 3677 3618 3559 3499 3438 3378 3342 3307 3271 3234 3146 3059 2994 2929 2916 2902 2912 2922 2938 2955 3018 3183
1145 3183 3383 3583 3833 4186 4539 4790 4915 5041 5069 4926 4695 4465 4178 3892 3551 3311 3168 3025 2855 2686 2636 2585 2556 2527 2472
1142 2472 2417 2388 2360 2337 2315 2263 2313 2418 2524 2547 2469 2422 2375 2407 2440 2421 2402 2339 2275 2297 2319 2302 2286 2269 2253 2226 2199 2172 2145 2108 2072 2035 1999
1138 1999 1950 1902 1905 1908 1943 1979 2040 2101 2159 2216 2253 2187 2082 2080 2133 2186 2200 2214 2228 2242 2190 2138 2239 2341 2370 2399 2428 2458 2443 2429 2465 2502 2451 2399
1133 2399 2433 2467 2437 2406 2427 2448 2406 2365 2476 2588 2602 2617 2631 2646 2608 2569 2644 2718 2740 2658 2629 2701 2794 2886 2985 3084 3099 3114 3191 3370 3521 3671
1129 3671 3952 4336 4656 4875 5172 5470 5664 5688 5580 5472 5328 5082 4842 4602 4401 4199 4026 3954 3896 3837 3898 3959 4037 4013 3995 3977
$$ packed form
1153A15416O930M712K652P08j345l768o381q531r799j0311j0497j0496j0188r335q092o693
1151C4982n448m323l418k702k140j696j394j155j019q48p41p41o42o42n22n22m50m50l64l65
1148E400l58l57k62j60j60j61j03j03n9n9n9o0o1o0l6l5l6l7q8q7o5o5j3j4J0J0J6J7O3J65
1145C183K00K00K50L53L53K51J25J26K8j43k31k30k87k86l41k40j43j43j70j69n0n1k9k9n5
1142B472n5k9k8k3k2n2N0J05J06K3p8m7m7L2L3j9j9o3o4K2K2j7j6j7j6k7k7k7k7l7l6l7l6
1138A999m9m8LLL5L6O1O1N8N7L7o6j05kN3N3J4J4J4J4n2n2J01J02K9K9K9L0j5j4L6L7n1n2
1133B399L4L4l0l1K1K1m2m1J11J12J4J5J4J5l8l9P5P4K2q2k9P2R3R2R9R9J5J5P7J79J51J50
1129C671K81L84L20K19K97K98J94K4j08j08j44k46k40k40k01k02j73p2n8n9O1O1P8k4j8j8
$$ plain form
1126 3977 4064 4152 4240 4327 4422 4517 4664 4810 4930 5049 5118 5186 5314 5443 5623 5802 5935 6068 6320 6572 6732 6892 7216 7643 8029 8415
1123 8415 8933 9622 10329 11037 11755 12643 13666 14860 16348 18279 20596 23426 27134 32104 38517 46398 55805 66747 78743
1121 78743 90979 102686 113404 122801 130459 135883 138612 138340 135168 129566 122019 112729 101971 90292 78511 67459
1119 67459 57600 49098 41994 36215 31629 28075 25442 23594 22326 21595 21308 21402 21736 22158 22479 22571 22425 22139 21613 20736
1116 20736 19688 18747 18045 17486 17030 16829 16936 17297 17828 18674 19896 21527 23807 27186 31896 37602 44229 52114 61193
1114 61193 70381 78375 85247 91881 98570 104612 110034 116037 123312 130963 137377 142051 145288 146717 145370 141123 135017
1112 135017 128194 120881 113056 105056 97159 89176 80750 72022 63465 55429 48040 41515 36116 31851 28576 26101 24410
1110 24410 23310 22518 21723 20929 20122 19314 18362 17308 16197 15087 14100 13216 12483 11852 11356 11031 10822 10714 10739 10866 11181 11734
$$ packed form
1126C977Q7Q8Q8Q7R5R5J47J46J20J19O9O8J28J29J80J79J33J33K52K52J60J60L24M27L86L86
1123H415N18O89P07P08P18Q88J023J194J488J931K317K830L708M970O413P881R407J0942J1996
1121G8743J2236J1707J0718R397P658N424K729k72l172n602p547r290j0758j1679j1781j1052
1119F7459r859q502p104n779m586l554k633j848j268p31k87R4L34M22L21R2j46k86n26q77
1116B0736j048r41p02n59m56k01J07L61N31Q46J222J631K280L379M710N706O627P885R079
1114F1193R188P994O872O634O689O042N422O003P275P651O414M674L237J429j347m247o106
1112A35017o823p313p825q000p897p983q426q728q557q036p389o525n399m265l275k475j691
1110B4410j100p92p95p94q07q08r52j054j111j110r87q84p33o31m96l25k09j08K5J27L15N53
$$ plain form
1107 11734 12537 13578 15017 17103 19922 23459 27617 32492 37973 43556 48392 52035 54552 56148 56791 56308 55098 53888
1105 53888 53371 53570 53983 54225 54121 53506 52121 49543 45757 41050 35962 30976 26297 22130 18559 15705 13486 11778 10419
1103 10419 9298 8318 7440 6755 6240 5830 5420 5045 4771 4594 4416 4316 4216 4167 4118 4011 3904 3823 3742 3707 3673 3587 3501 3378 3254
1100 3254 3216 3178 3066 2954 2931 3011 3003 2893 2735 2679 2648 2566 2439 2363 2349 2335 2245 2155 2092 2131 2226 2321 2351 2280 2146 2013 1912 1811 1863 1916
1096 1916 1944 1972 2000 2028 2126 2224 2271 2317 2346 2375 2318 2261 2273 2284 2346 2408 2410 2411 2362 2312 2329 2346 2363 2380 2361 2341 2237 2132 2029 1926 1823 1719
1092 1719 1750 1781 1811 1842 1830 1818 1781 1744 1755 1766 1727 1687 1665 1644 1707 1771 1802 1833 1778 1723 1742 1761 1779 1798 1756 1714 1672 1630 1610 1590 1571 1551 1571 1591
1088 1591 1560 1479 1405 1434 1522 1610 1678 1747 1764 1781 1757 1734 1795 1857 1920 1984 1997 2009 2022 2035 1963 1890 1842 1793 1744 1695 1689 1682 1676 1670 1648 1626 1661 1594 1485 1376
1083 1376 1391 1508 1578 1647 1637 1628 1553 1478 1454 1430 1450 1470 1490 1510 1460 1411 1446 1481 1505 1529 1501 1474 1406 1337 1389 1440 1446 1453 1453 1555 1647 1740 1719 1699 1682
$$ packed form
1107A1734Q03J041J439K086K819L537M158M875N481N583M836L643K517J596O43m83j210j210
1105E3888n17J99M13K42j04o15j385k578l786m707n088m986m679m167l571k854k219j708j359
1103A0419j121r80q78o85n15m10m10l75k74j77j78j00j00m9m9j07j07q1q1l5l4q6q6j23j24
1100C254l8l8j12j12k3Q0qj10j58n6l1q2j27p6j4j4r0r0o3L9R5R5L0p1j34j33j01j01N2N3
1096A916K8K8K8K8R8R8M7M6K9K9n7n7J2J1O2O2KJm9n0J7J7J7J7j9k0j04j05j03j03j03j04
1092A719L1L1L0L1j2j2l7l7J1J1l9m0k2k1O3O4L1L1n5n5J9J9J8J9m2m2m2m2k0k0j9k0K0K0
1088A591l1q1p4K9Q8Q8O8O9J7J7k4k3O1O2O3O4J3J2J3J3p2p3m8m9m9m9opook2k2L5o7j09j09
1083A376J5J17P0O9j0rp5p5k4k4K0K0K0K0n0m9L5L5K4K4k8k7o8o9N2N1OP%J02R2R3k1k0j7
$$ plain form
1079 1682 1664 1698 1732 1683 1634 1586 1537 1593 1648 1653 1657 1636 1614 1593 1571 1605 1639 1673 1707 1631 1555 1473 1493 1537 1580 1579 1578 1603 1628 1654 1679 1629 1578 1528 1477 1485 1493
1075 1493 1501 1509 1566 1623 1653 1579 1463 1346 1343 1339 1396 1452 1508 1564 1550 1535 1521 1507 1444 1382 1375 1470 1505 1438 1377 1419 1500 1581 1487 1393 1319 1348 1370 1392 1351 1310
1070 1310 1270 1229 1193 1158 1276 1395 1494 1593 1572 1552 1563 1574 1585 1595 1529 1463 1483 1502 1520 1539 1557 1575 1549 1522 1411 1299 1328 1356 1385 1414 1403 1392
1066 1392 1432 1473 1502 1531 1475 1419 1385 1350 1315 1280 1318 1356 1394 1432 1517 1603 1604 1604 1602 1599 1597 1594 1570 1547 1523 1499 1522 1545 1516 1488 1539 1589 1589 1588 1544 1501 1457 1413
1062 1413 1382 1351 1320 1289 1354 1419 1399 1379 1363 1347 1331 1315 1291 1268 1296 1323 1313 1302 1292 1281 1278 1274 1322 1369 1404 1439 1473 1508 1481 1453 1477 1501 1628 1755
1058 1755 1831 1907 1976 2045 2063 2081 2026 1971 1917 1862 1803 1745 1686 1627 1627 1627 1627 1627 1591 1555 1570 1585 1585 1585 1437 1288 1303 1403 1484 1514 1499 1484 1466 1448 1397 1346
1053 1346 1347 1347 1427 1508 1503 1498 1436 1374 1398 1421 1455 1490 1524 1558 1582 1606 1630 1654 1733 1813 1892 1972 2080 2189 2302 2416 2608 2885 3158 3347 3429 3460
1049 3460 3409 3273 3093 2913 2728 2543 2407 2271 2135 1999 1953 1907 1861 1814 1735 1657 1583 1510 1512 1600 1668 1685 1695 1705 1764 1822 1841 1859 1759 1658
$$ packed form
1079A682j8L4L4m9m9m8m9N6N5NMk1k2k1k2L4L4L4L4p6p6q2K0M4M3jjK5K5K6K5n0n1n0n1QQ
1075A493QQN7N7L0p4j16j17lmN7N6N6N6j4j5j4j4o3o2pR5L5o7o1M2Q1Q1r4r4p4K9K2K2m1m1
1070A310m0m1l6l5J18J19R9R9k1k0J1J1J1J0o6o6K0J9J8J9J8J8k6k7j11j12K9K8K9K9j1j1
1066A392M0M1K9K9n6n6l4l5l5l5L8L8L8L8Q5Q6J%klklk4k3k4k4K3K3k9k8N1N0%jm4m3m4m4
1062A413l1l1l1l1O5O5k0k0j6j6j6j6k4k3K8K7j0j1j0j1lmM8M7L5L5L4L5k7k8K4K4J27J27
1058A755P6P6O9O9J8J8n5n5n4n5n9n8n9n9%%%%l6l6J5J5%%j48j49J5J00Q1L0j5j5j8j8n1n1
1053A346J%Q0Q1nno2o2K4K3L4L5L4L4K4K4K4K4P9Q0P9Q0J08J09J13J14J92K77K73J89Q2L1
1049C460n1j36j80j80j85j85j36j36j36j36m6m6m6m7p9p8p4p3KQ8O8J7J0J0N9N8J9J8j00j01
$$ plain form
1046 1658 1567 1475 1435 1394 1384 1373 1414 1454 1507 1561 1563 1565 1615 1665 1715 1765 1883 2001 2070 2087 2181 2395 2586 2692 2746 2799 2892 2899 2797 2645 2487 2380
1042 2380 2353 2326 2216 2107 2010 1914 1817 1721 1640 1559 1529 1500 1538 1577 1564 1500 1495 1575 1623 1552 1445 1388 1381 1374 1400 1426 1453 1479 1464 1449 1433 1418 1364 1309
1038 1309 1260 1211 1201 1275 1334 1341 1337 1383 1426 1418 1442 1467 1487 1508 1467 1426 1385 1343 1326 1308 1324 1290 1251 1297 1422 1462 1387 1260 1209 1157 1139 1121 1154 1187 1170
1033 1170 1152 1185 1218 1185 1152 1171 1189 1203 1217 1231 1245 1229 1213 1197 1181 1209 1236 1264 1292 1207 1123 1124 1125 1133 1141 1150 1158 1166 1175 1184 1192 1201 1209 1218 1227 1224 1221 1218 1216 1203 1191 1179 1166
1028 1166 1185 1203 1273 1342 1340 1338 1251 1164 1072 980 1008 1036 1080 1125 1170 1215 1195 1176 1156 1137 1139 1140 1142 1144 1170 1196 1221 1247 1225 1203 1266 1329 1310 1291 1272 1252 1285
1023 1285 1318 1351 1384 1360 1335 1310 1285 1302 1318 1335 1352 1324 1295 1319 1342 1365 1388 1411 1434 1351 1268 1302 1335 1343 1299 1237 1259 1346 1432 1438 1444 1414 1384 1354 1324 1287
1019 1287 1251 1300 1349 1362 1376 1338 1301 1284 1267 1335 1403 1349 1296 1290 1285 1262 1188 1175 1247 1359 1387 1348 1309 1296 1283 1269 1256 1284 1313 1392 1472 1477 1482 1436 1389 1319
1015 1319 1248 1331 1414 1440 1467 1488 1509 1537 1481 1387 1293 1288 1283 1279 1274 1270 1266 1263 1259 1263 1268 1272 1276 1307 1338 1368 1399 1461 1522 1533 1543 1535 1527 1520 1512 1492 1473 1453 1434 1466 1499 1583
$$ packed form
1046A658r1r2m0m1j0j1M1M0N3N4KKN0N0N0N0J18J18O9J7R4K14J91J06N4N3R3Pj02j52j58j07
1042B380k7k7j10j09r7r6r7r6q1q1l0k9L8L9j3o4nQ0M8p1j07n7ppK6K6K7K6j5j5j6j5n4n5
1038A309m9m9j0P4N9PmM6M3qK4K5K0K1m1m1m1m2j7j8J6l4l9M6J25M0p5j27n1n2j8j8L3L3j7
1033A170j8L3L3l3l3J9J8J4J4J4J4j6j6j6j6K8K7K8K8q5q4JJQQRQQRRQRQRRlllkj3j2j2j3
1028A166J9J8P0O9kkq7q7r2r2K8K8M4M5M5M5k0j9k0j9KJKKK6K6K5K6k2k2O3O3j9j9j9k0L3
1023A285L3L3L3k4k5k5k5J7J6J7J7k8k9K4K3K3K3K3K3q3q3L4L3Qm4o2K2Q7Q6OOl0l0l0l0l7
1019A287l6M9M9J3J4l8l7j7j7O8O8n4n3onk3p4j3P2J12K8l9l9j3j3j4j3K8K9P9Q0NNm6m7p0
1015A319p1Q3Q3K6K7K1K1K8n6r4r4nnmnmmlmMNMML1L1L0L1O2O1J1J0qqpqk0j9k0j9L2L3Q4
$$ plain form
1010 1583 1667 1652 1637 1623 1608 1582 1555 1614 1673 1686 1700 1628 1556 1496 1435 1461 1486 1517 1549 1580 1612 1619 1626 1632 1639 1650 1660 1670 1681 1666 1652 1638 1624 1622 1621 1705 1789
1005 1789 1817 1844 1786 1728 1647 1565 1603 1640 1691 1741 1672 1603 1599 1595 1676 1758 1808 1858 1909 1959 1947 1934 1973 2012 2026 2039 2052 2066 2025 1985 1996 2006 2035 2064 2093
1001 2093 2122 2102 2081 2061 2041 2052 2064 2127 2189 2198 2206 2300 2393 2387 2380 2373 2367 2394 2420 2447 2474 2483 2492 2500 2509 2523 2537 2602 2668 2723 2779 2783 2788 2827 2867 2855 2843 2860 2877 2894
996 2894 2911 2981 3050 3068 3087 3137 3187 3238 3288 3310 3331 3404 3476 3558 3641 3723 3805 3917 4030 4142 4255 4327 4398 4419 4440 4524 4607 4742 4877 4967 5057 5198
992 5198 5339 5426 5512 5598 5786 6094 6504 6915 7325 7701 8078 8376 8673 8975 9380 9925 10572 11217 11861 12568 13377 14177 14875 15562
989 15562 16249 17072 18066 19260 20625 22130 23636 25242 27018 29107 31708 35030 39273 44618 51566 60967 73949 91892
987 91892 116488 148810 187580 227435 259887 276579 273587 253032 221594 186690 153798 125605 102700 84725
985 84725 70809 60036 51686 45293 40435 36786 34059 32074 30669 29561 28555 27527 26500 25510 24519 23696 23111 22757
$$ packed form
1010A583Q4j5j5j4j5k6k7N9N9J3J4p2p2o0o1K6K5L1L2L1L2PPOPJ1J0J0J1j5j4j4j4kjQ4Q4
1005A789K8K7n8n8q1q2L8L7N1N0o9o9mmQ1Q2N0N0N1N0j2j3L9L9J4J3J3J4m1m0J1J0K9K9K9
1001B093K9k0k1k0k0J1J2O3O2RQR4R3oppoK7K6K7K7RRQRJ4J4O5O6N5N6MNL9M0j2j2J7J7J7
996B894J7P0O9J8J9N0N0N1N0K2K1P3P2Q2Q3Q2Q2J12J13J12J13P2P1K1K1Q4Q3J35J35R0R0J41
992E198J41Q7Q6Q6J88L08M10M11M10L76L77K98K97L02M05N45O47O45O44P07Q09Q00O98O87
989A5562O87Q23R94J194J365J505J506J606J776K089K601L322M243N345O948R401J2982J7943
987I1892K4596L2322L8770L9855L2452J6692k992k0555l1438l4904l2892k8193k2905j7975
985H4725j3916j0773q350o393m858l649k727j985j405j108j006j028j027r90r91q23n85l54
$$ plain form
983 22757 22574 22610 22749 22968 23187 23423 23659 23990 24491 25268 26352 27723 29332 31240 33386 35769 38458 41608 45474 50317
980 50317 56490 64462 74994 88967 107340 130826 159259 191099 222837 249496 265750 267973 255629 231635 200853
979 200853 168309 137915 111815 90661 74031 61119 51206 43646 37856 33396 29993 27512 25598 23854 22133 20515
977 20515 19014 17513 16086 14762 13556 12452 11498 10647 9924 9253 8683 8215 7731 7144 6520 5997 5586 5278 4978 4730 4582
974 4582 4486 4415 4345 4186 4028 3870 3712 3623 3535 3395 3255 3159 3064 2969 2874 2784 2695 2657 2618 2601 2585 2516 2448 2469 2489 2509 2530 2551 2573 2509 2445 2399
970 2399 2353 2354 2356 2214 2021 1946 1973 2047 2019 1968 1969 1982 1892 1782 1724 1765 1805 1849 1892 1826 1760 1693 1627 1636 1644 1652 1661 1711 1761 1759 1758 1753 1747 1678 1710 1792 1772 1667
966 1667 1614 1673 1732 1709 1686 1719 1753 1735 1717 1715 1714 1712 1710 1686 1662 1552 1443 1508 1572 1586 1599 1575 1552 1528 1504 1561 1619 1591 1563 1536 1508 1559 1610 1626 1539 1478
961 1478 1468 1493 1466 1444 1472 1509 1546 1501 1455 1545 1634 1569 1505 1537 1569 1601 1633 1675 1718 1641 1564 1558 1551 1545 1539 1512 1485 1459 1432 1442 1451 1461 1471 1439 1407 1375 1343
$$ packed form
983B2757j83L6J39K19K19K36K36L31N01P77J084J371J609J908K146K383K689L150L866M843
980E0317O173P972J0532J3973J8373K3486K8433L1840L1738K6659J6254K223j2344k3994l0782
979B00853l2544l0394k6100k1154j6630j2912r913p560n790m460l403k481j914j744j721j618
977B0515j501j501j427j324j206j104r54q51p23o71n70m68m84n87o24n23m11l08l00k48j48
974D582r6p1p0j59j58j58j58q9q8j40j40r6r5r5r5r0q9l8l9j7j6o9o8K1K0K0K1K1K2o4o4m6
970B399m6JKj42j93p5K7P4k8n1JJ3r0j10n8M1M0M4M3o6o6o7o6RQQRN0N0kjnoo9L2Q2k0j05
966A667n3N9N9k3k3L3L4j8j8kjkkk4k4j10j09O5O4J4J3k4k3k4k4N7N8k8k8k7k8N1N1J6q7o1
961A478j0K5k7k2K8L7L7m5m6R0Q9o5o4L2L2L2L2M2M3p7p7opook7k7k6k7J0RJ0J0l2l2l2l2
$$ plain form
957 1343 1358 1374 1338 1303 1343 1383 1423 1463 1437 1411 1385 1359 1357 1355 1404 1504 1528 1450 1324 1301 1401 1501 1454 1407 1467 1527 1501 1475 1540 1605 1670 1735 1782 1828
952 1828 1824 1819 1787 1755 1722 1690 1706 1723 1592 1461 1428 1497 1535 1521 1461 1349 1237 1176 1230 1336 1360 1282 1268 1357 1413 1419 1423 1478 1514 1448 1373 1400 1483 1565
948 1565 1571 1577 1532 1486 1459 1432 1360 1288 1284 1383 1501 1567 1560 1502 1469 1436 1417 1398 1379 1360 1457 1553 1530 1506 1486 1466 1395 1324 1282 1241 1284 1328 1387 1445 1418 1392
944 1392 1416 1440 1414 1387 1454 1521 1469 1416 1391 1365 1391 1417 1423 1430 1385 1341 1418 1496 1385 1275 1294 1313 1383 1453 1418 1384 1350 1316 1414 1512 1525 1538 1568 1598 1628
940 1628 1658 1650 1641 1633 1625 1620 1616 1561 1505 1475 1445 1416 1386 1408 1430 1402 1373 1402 1430 1408 1385 1388 1390 1392 1395 1375 1356 1337 1318 1284 1250 1267 1284 1350 1416 1396 1377 1377 1377 1377 1377 1495
934 1495 1612 1610 1608 1561 1515 1468 1421 1511 1601 1690 1780 1902 2024 2210 2396 2718 3244 3781 4318 4976 5737 6304 6393 6164 5731 5276 4617 3933
931 3933 3248 2772 2296 2079 1861 1728 1596 1567 1539 1459 1379 1319 1258 1320 1382 1394 1458 1502 1443 1303 1214 1214 1266 1312 1358 1356 1355 1389 1424 1408 1341 1332 1425
927 1425 1518 1509 1497 1535 1568 1549 1525 1501 1477 1453 1453 1504 1538 1471 1411 1454 1494 1432 1398 1416 1433 1399 1386 1475 1568 1558 1484 1512 1623 1631 1597 1614 1681 1749 1781 1813
$$ packed form
957A343J5J6l6l5M0M0M0M0k6k6k6k6kkM9J00K4p8j26k3J00J00m7m7O0O0k6k6O5O5O5O5M7M6
952A828mnl2l2l3l2J6J7j31j31l3O9L8j4o0j12j12o1N4J06K4p8j4Q9N6OMN5L6o6p5K7Q3Q2
948A565OOm5m6k7k7p2p2mR9J18O6pn8l3l3j9j9j9j9R7R6k3k4k0k0p1p1m2m1M3M4N9N8k7k6
944A392K4K4k6k7O7O7n2n3k5k6K6K6OPm5m4P7P8j11j10J9J9P0P0l5l4l4l4R8R8J3J3L0L0L0
940A628L0qrqqnmn5n6l0l0k9l0K2K2k8k9K9K8k2k3LKKLk0j9j9j9l4l4J7J7O6O6k0j9%%%%J18
934A495J17kkm7m6m7m7R0R0Q9R0J22J22J86J86L22N26N37N37O58P61N67Q9k29m33m55o59o84
931C933o85m76m76k17k18j33j32k9k8q0q0o0o1O2O2J2O4M4n9j40q9%N2M6M6kjL4L5j6o7rR3
927A425R3rj2L8L3j9k4k4k4k4%N1L4o7o0M3M0o2l4J8J7l4j3Q9R3j0p4K8J11Ql4J7O7O8L2L2
$$ plain form
923 1813 1858 1801 1753 1808 1986 2164 2253 2342 2431 2519 2552 2584 2639 2642 2552 2360 2193 2077 2016 1955 1898 1840 1795 1750 1712 1673 1650 1728 1849 1798 1633 1519
919 1519 1521 1574 1645 1666 1633 1601 1608 1616 1627 1638 1586 1584 1561 1435 1239 1042 902 814 809 906 980 1004 1039 1126 1215 1254 1293 1435 1599 1712 1812 1963 2095
915 2095 2125 2178 2334 2483 2530 2457 2383 2282 2078 1879 1782 1679 1575 1504 1535 1563 1422 1260 1268 1388 1405 1297 1292 1342 1392 1401 1409 1475 1439 1304 1169
911 1169 1153 1137 1068 1102 1232 1361 1346 1331 1367 1403 1380 1358 1387 1415 1450 1486 1585 1582 1544 1609 1668 1624 1482 1341 1318 1296 1264 1334 1455 1474 1412 1350 1332
907 1332 1315 1283 1252 1278 1303 1259 1317 1432 1445 1333 1324 1404 1485 1426 1368 1425 1379 1248 1220 1316 1411 1374 1337 1386 1435 1338 1241 1331 1422 1372 1322 1323 1325 1294 1263
903 1263 1386 1509 1398 1287 1330 1373 1360 1348 1336 1323 1220 1117 1202 1287 1303 1320 1422 1524 1515 1506 1548 1591 1560 1529 1651 1773 1763 1752 1741 1730 1670
899 1670 1610 1636 1661 1617 1573 1683 1793 1727 1661 1748 1836 1797 1758 1745 1732 1656 1580 1691 1803 1742 1682 1737 1793 1697 1550 1555 1662 1692 1619 1632 1696 1715
895 1715 1734 1782 1830 1724 1618 1639 1762 1772 1731 1776 1822 1773 1725 1830 1935 1922 1910 1897 1885 1805 1725 1799 1873 1800 1727 1808 1888 1856 1823 1907 1991 1989 1935
$$ packed form
923A813M5n7m8N5J78J78Q9Q9Q9Q8L3L2N5Lr0j92j67j16o1o1n7n8m5m5l8l9k3P8J21n1j65j14
919A519KN3P1K1l3l2PQJ1J1n2kk3j26j96j97j40q8nR7P4K4L5Q7Q9L9L9J42J64J13J00J51J32
915B095L0N3J56J49M7p3p4j01k04j99r7j03j04p1L1K8j41j62QJ20J7j08nN0N0RQO6l6j35j35
911A169j6j6o9L4J30J29j5j5L6L6k3k2K9K8L5L6R9ll8O5N9m4j42j41k3k2l2P0J21J9o2o2j8
907A332j7l2l1K6K5m4N8J15J3j12rQ0Q1n9n8N7m6j31k8R6R5l7l7M9M9r7r7R0R1n0n0JKl1l1
903A263J23J23j11j11M3M3j3j2j2j3j03j03Q5Q5J6J7J02J02rrM2M3l1l1J22J22j0j1j1j1o0
899A670o0K6K5m4m4J10J10o6o6Q7Q8l9l9j3j3p6p6J11J12o1o0N5N6r6j47NJ07L0p3J3O4J9
895A715J9M8M8j06j06K1J23J0m1M5M6m9m8J05J05j3j2j3j2q0q0P4P4p3p3Q1Q0l2l3Q4Q4kn4
$$ plain form
891 1935 2004 2174 2245 2264 2347 2379 2242 2104 2128 2254 2270 2286 2465 2644 2742 2890 3340 3961 4474 4987 5637 6287 6550 6370 6038 5655
888 5655 5115 4523 4121 3822 3470 3119 3000 2984 2841 2597 2504 2583 2571 2509 2609 2812 2850 2785 2836 2989 2938 2717 2714 2881 2925 2798 2768 2840
884 2840 2833 2776 2906 3140 3143 2977 2989 3241 3387 3364 3468 3674 3685 3525 3612 3938 4081 4054 4186 4626 5087 5548 6263 7148 7769 7946 8034
881 8034 8071 7794 7209 6713 6387 5921 5285 4896 4814 4641 4298 4240 4489 4618 4508 4585 4970 5265 5321 5492 5834 5836 5395 5073 5127 5095
878 5095 4824 4745 4974 5073 4934 5004 5449 5722 5619 5670 6096 6445 6420 6513 6982 7272 7186 7284 7758 7966 7732 7672 8124 8369 8102 8002
875 8002 8413 8792 8864 9268 10389 11389 11877 12484 13534 14205 14091 14092 14741 15156 14922 15128 16323 17430 17890 18954 21281 23576
872 23576 25087 27151 30342 32988 34031 35330 38163 40903 42450 45211 51008 57800 64421 74658 91683 113850 142600
870 142600 189844 267415 370986 485917 606391 734200 854604 930626 933602 871181 774319 664733 547480
$$ packed form
891A935O9J70P1J9Q3L2j37j38K4J26J6J6J79J79R8J48M50O21N13N13O50O50K63j80l32l83
888E655n40n92m02k99l52l51j19j6j43k44r3P9j2o2J00K03L8o5N1J53n1k21lJ67M4j27l0P2
884B840pn7J30K34Lj66J2K52J46k3J04K06J1j60Q7L26J43k7J32M40M61M61P15Q85O21J77Q8
881H034L7k77n85m96l26m66o36l89q2j73l43n8K49J29j10P7L85K95N6J71L42Km41l22N4l2
878E095k71p9K29R9j39P0M45K73j03N1M26L49k5R3M69K90q6R8M74K08k34o0M52K45k67j00
875H002M11L79P2M04J121J000M88O07J050O71j14JO49M15k34K06J195J107M60J064K327K295
872B3576J511K064L191K646J043J299K833K740J547K761N797O792O621J0237J7025K2167K8750
870A42600M7244P7571J03571J14931J20474J27809J20404P6022K976o2421r6862j09586j17253
$$ plain form
868 547480 429169 325612 247880 192420 150230 117739 94493 77391 62917 51139 43217 37537 32096 27529
866 27529 25111 23822 22022 20333 19838 19637 18379 16620 15578 14745 13127 11320 10297 9713 8618 7469 7036 6953 6494
864 6494 6016 6255 6737 6707 6381 6430 6504 5999 5229 4903 4815 4352 3769 3562 3507 3146 2772 2841 3039 2793 2391 2433 2747 2755 2562 2676
861 2676 2880 2777 2564 2727 3034 3035 2786 2776 2915 2815 2567 2558 2638 2479 2244 2316 2477 2331 2033 2041 2229 2178 1921 1902 2032 1992 1786
858 1786 1819 2010 1962 1727 1730 1913 1925 1794 1835 1994 1983 1785 1757 1916 1905 1727 1720 1866 1841 1688 1706 1810 1743 1639 1706 1893 1909 1723 1707
854 1707 1874 1871 1740 1712 1867 1920 1792 1765 1829 1790 1682 1745 1927 1939 1680 1523 1560 1597 1536 1577 1772 1865 1816 1768 1828 1786 1684 1684 1804 1821
850 1821 1677 1635 1749 1812 1749 1736 1808 1830 1796 1813 1913 1911 1855 1901 1989 1908 1731 1725 1860 1893 1779 1716 1769 1771 1674 1629 1673 1665 1578 1594 1698 1700 1526
846 1526 1454 1573 1639 1567 1546 1646 1746 1732 1717 1793 1766 1566 1469 1529 1590 1546 1503 1579 1655 1580 1505 1550 1594 1532 1470 1527 1585 1558 1532 1625 1718 1711 1704 1748
$$ packed form
868E47480j18311j03557p7732n5460m2190l2491k3246j7102j4474j1778p922n680n441m567
866B7529k418j289j800j689m95k01j258j759j042q33j618j807j023n84j095j149m33q3m59
864F494m78K39M82l0l26M9P4n05p70l26q8m63n83k07n5l61l74O9J98k46m02M2L14Qj93J14
861B676K04j03k13J63L07Jk49j0J39j00k48rQ0j59k35P2J61j46k98QJ88n1k57j9J30m0k06
858A786L3J91m8k35LJ83J2j31M1J59j1j98k8J59j1j78pJ46k5j53J8J04o7j04O7J87J6j86j6
854A707J67lj31k8J55N3j28k7O4l9j08O3J82J2k59j57L7L7o1M1J95R3m9m8O0m2j02%J20J7
850A821j44m2J14O3o3j3P2K2l4J7J00kn6M6Q8q1j77oJ35L3j14o3N3Kr7m5M4qq7J6J04Kj74
846A526p2J19O6p2k1J00J00j4j5P6k7k00r7O0O1m4m3P6P6p5p5M5M4o2o2N7N8k7k6R3R3ppM4
$$ plain form
842 1748 1792 1698 1604 1664 1723 1687 1651 1654 1554 1397 1341 1408 1423 1297 1223 1304 1384 1318 1252 1305 1358 1350 1341 1452 1562 1461 1359 1349 1339 1294 1352 1500
838 1500 1596 1508 1420 1482 1544 1514 1485 1540 1596 1502 1409 1400 1392 1367 1341 1435 1529 1521 1512 1555 1598 1511 1424 1490 1556 1526 1495 1581 1667 1573 1428 1438 1550 1579 1557 1589
834 1589 1672 1700 1677 1685 1694 1600 1506 1463 1419 1348 1276 1357 1439 1459 1480 1585 1691 1615 1540 1584 1627 1606 1585 1645 1706 1659 1561 1547 1635 1651 1565 1529 1596 1611 1524
830 1524 1500 1477 1434 1391 1434 1477 1480 1483 1538 1592 1632 1672 1854 1984 1897 1706 1660 1716 1703 1587 1585 1635 1605 1472 1424 1479 1488 1445 1493 1643 1748 1750 1781 1863
826 1863 1896 1827 1805 1887 1909 1829 1752 1778 1819 1808 1830 1851 1793 1683 1627 1673 1702 1679 1663 1698 1662 1626 1678 1730 1750 1770 1841 1912 1970 2028 2136 2296 2356
821 2356 2314 2269 2326 2375 2321 2173 1973 1677 1381 1205 1199 1167 1084 1095 1208 1299 1287 1254 1221 1239 1258 1355 1452 1441 1328 1260 1294 1374 1351 1329 1409 1486
818 1486 1460 1448 1435 1475 1514 1554 1593 1577 1562 1546 1530 1561 1592 1623 1654 1637 1620 1603 1585 1612 1638 1710 1781 1758 1634 1509 1486 1476 1467 1463 1460 1430 1400 1460 1622
813 1622 1752 1779 1751 1723 1778 1833 1881 1930 1945 1858 1816 1876 1869 1760 1702 1747 1798 1747 1674 1601 1627 1654 1725 1796 1837 1775 1706 1740 1832 1821 1789 1757 1751 1744 1738 1732
$$ packed form
842A748M4r4r4O0N9l6l6Lj00j57n6O7J5j26p4Q1Q0o6o6N3N3qrJ11J10j01j02j0j0m5N8J48
838A500R6q8q8O2O2l0k9N5N6r4r3rqk5k6R4R4qrM3M3q7q7O6O6l0l1Q6Q6r4j45J0J12K9k2L2
834A589Q3K8k3QRr4r4m3m4p1p2Q1Q2K0K1J05J06p6p5M4M3k1k1O0O1m7r8j4Q8J6q6l6O7J5q7
830A524k4k3m3m3M3M3LLN5N4M0M0J82J30q7j91m6N6j3j16kN0l0j33m8N5Rm3M8J50J05KL1Q2
826A863L3o9k2Q2K2q0p7K6M1j1K2K1n8j10n6M6K9k3j6L5l6l6N2N2K0K0P1P1N8N8J08J60O0
821B356m2m5N7M9n4j48k00k96k96j76ol2q3J1J13R1j2l3l3J8J9R7R7j1j13o8L4Q0k3k2Q0P7
818A486k6j2j3M0L9M0L9j6j5j6j6L1L1L1L1j7j7j7j8K7K6P2P1k3j24j25k3j0rmll0l0O0J62
813A622J30K7k8k8N5N5M8M9J5q7m2O0pj09n8M5N1n1p3p3K6K7P1P1M1o2o9L4R2j1l2l2opoo
$$ plain form
809 1732 1693 1655 1638 1723 1773 1721 1727 1732 1763 1691 1620 1651 1716 1781 1801 1821 1842 1863 1905 2049 2140 2129 2039 2051 2129 2207 2315 2594 2998 3402 3841 4450
805 4450 5194 5939 6524 6802 6716 6322 5724 5125 4518 3911 3403 3065 2927 2891 2894 2897 2861 2824 2815 2909 3135 3360 3648 4038 4403 4665 4828
802 4828 4990 5047 4934 4694 4455 4243 4032 3821 3610 3496 3381 3295 3311 3335 3358 3382 3508 3729 3950 4184 4418 4749 5182 5745 6479
799 6479 7221 7859 8383 8805 9049 8986 8555 7953 7355 6757 6206 5655 5257 4962 4739 4618 4516 4415 4347 4382 4577 4772 5065 5358
796 5358 5750 6243 6850 7558 8441 9425 10473 11419 12075 12286 12101 11609 10855 9931 8987 8214 7549 6884 6351 6056 5930 5804 5726
793 5726 5751 5940 6232 6534 6836 7325 7984 8752 9758 11004 12488 14124 15759 17255 18443 19288 19758 19791 19380 18650 17749 16724
790 16724 15528 14274 13021 11921 10991 10264 9776 9472 9271 9100 9031 9160 9459 9943 10664 11673 12921 14345 15941 17728
788 17728 19515 21167 22650 23916 24876 25448 25508 24975 23863 22275 20448 18572 16696 15065 13741 12688 11737 10978 10526
$$ packed form
809A732l9l8j7Q5N0n2ONL1p2p1L1O5O5K0K0K1K1M2J44R1j1r0J2P8P8J08K79M04M04M39O09
805D450P44P45N85K78q6l94n98n99o07o07n08l38j38l6LLl6l7rR4K26K25K88L90L65K62J63
802D828J62N7j13k40k39k12k11k11k11j14j15q6J6K4K3K4J26K21K21K34K34L31M33N63P34
799F479P42O38N24M22K44o3m31o02n98n98n51n51l98k95k23j21j02j01o8L5J95J95K93K93
796E358L92M93O07P08Q83R84J048R46O56K11j85m92p54r24r44p73o65o65n33k95j26j26p8
793E726K5J89K92L02L02M89O59P68J006J246J484J636J635J496J188Q45M70L3m11p30r01j025
790A6724j196j254j253j100r30p27m88l04k01j71o9J29K99M84P21J009J248J424J596J787
788A7728J787J652J483J266R60N72O0n33j112j588j827j876j876j631j324j053r51p59m52
$$ plain form
785 10526 10347 10339 10391 10612 11052 11662 12425 13428 14705 16222 17915 19779 21761 23742 25563 27078 27967 28003 27135 25551 23605
783 23605 21488 19336 17287 15529 14146 13066 12293 11833 11612 11579 11716 12030 12446 13029 13850 15006 16537 18379 20597 23212
780 23212 26134 29227 32218 34697 36186 36452 35524 33709 31246 28416 25484 22742 20307 18166 16400 14992 13891 13075
778 13075 12566 12298 12201 12266 12502 13003 13676 14575 15848 17612 19820 22377 25174 28027 30504 32198 32833 32456 31226 29342
776 29342 27082 24784 22485 20334 18422 16791 15399 14195 13229 12508 12026 11728 11599 11633 11769 12063 12596 13470 14582 15873
773 15873 17403 19138 20975 22586 23822 24561 24720 24244 23256 21907 20320 18697 17074 15659 14483 13543 12842 12385 12098
771 12098 11968 12010 12300 12761 13350 14110 15179 16554 18099 19813 21712 23611 25247 26508 27322 27760 27784 27502 27094 26583 25981
768 25981 25277 24544 23812 23308 23111 23236 23599 24158 24956 26076 27504 29114 30895 32857 34990 37306 39793 42456 45222 47822
$$ packed form
785A0526j79qN2K21M40O10P63J003J277J517J693J864J982J981J821J515Q89L6q68j584j946
783B3605k117k152k049j758j383j080p73m60k21l3J37L14M16N83Q21J156J531J842K218K615
780B3212K922L093K991K479J489K66r28j815k463k830k932k742k435k141j766j408j101q16
778A3075n09k68r7O5K36N01O73Q99J273J764K208K557K797K853K477J694O35l77j230j884
776B9342k260k298k299k151j912j631j392j204r66p21m82k98j29L4J36K94N33Q74J112J291
773A5873J530J735J837J611J236P39J59m76r88j349j587j623j623j415j176r40p01m57k87
771A2098j30M2K90M61N89P60J069J375J545J714J899J899J636J261Q14M38K4k82m08n11o02
768B5981p04p33p32n04j97J25L63N59P98J120J428J610J781J962K133K316K487K663K766K600
$$ plain form
766 47822 49978 51489 52284 52390 52053 51537 51022 50490 49957 49606 49426 49359 49530 50108 50993 52016 53039 54193 55449 56699 57949
763 57949 59102 60255 61401 62547 63740 64830 65585 65965 66120 66172 66120 66069 66124 66418 66761 66934 66701 65957 64724 63185 61525
761 61525 59864 58419 57213 56331 55620 54906 54193 53419 52544 51596 50545 49505 48466 47328 46019 44701 43383 42009 40635
759 40635 39287 38041 36959 35878 34848 33818 32698 31477 30300 29225 28295 27536 26997 26697 26608 26621 26695 26770 26850 26931 26925 26919 26964
756 26964 27010 27148 27286 27373 27460 27580 27701 27880 28058 28299 28643 29014 29385 29786 30186 30593 31000 31428 31957 32604 33422 34455 35727
753 35727 37091 38454 39745 40934 42021 42937 43773 44609 45566 46694 48036 49479 50782 51846 52723 53498 54124 54647 55203 55862
750 55862 56546 57060 57382 57601 57707 57643 57425 57206 57028 56849 56654 56458 56235 55910 55466 55022 54591 54160 53970 54087 54417 54747 54982
748 54982 55115 55105 54856 54393 53760 53020 52280 51452 50625 49729 48731 47603 46372 45029 43583 42146 40709 39265 37719 36072
$$ packed form
766D7822K156J511P95J06l37n16n15n32n33l51j80o7J71N78Q85J023J023J154J256J250J250
763E7949J153J153J146J146J193J090P55L80J55N2n2n1N5K94L43J73k33p44j233j539j660
761F1525j661j445j206q82p11p14p13p74q75r48j051j040j039j138j309j318j318j374j374
759D0635j348j246j082j081j030j030j120j221j177j075r30p59n39l00q9J3P4P5Q0Q1ooM5
756B6964M6J38J38Q7Q7J20J21J79J78K41L44L71L71M01M00M07M07M28N29O47Q18J033J272
753C5727J364J363J291J189J087R16Q36Q36R57J128J342J443J303J064Q77P75O26N23N56O59
750E5862O84N14L22K19J06o4k18k19j78j79j95j96k23l25m44m44m31m31j90J17L30L30K35
748E4982J33j0k49m63o33p40p40q28q27q96r98j128j231j343j446j437j437j444j546j647
$$ plain form
745 36072 34322 32520 30717 29108 27738 26605 25710 25042 24544 24118 23693 23138 22582 21965 21245 20346 19448 18600 17753 16965 16280
743 16280 15656 15033 14421 13810 13171 12430 11720 11011 10278 9375 8411 7550 6894 6341 5799 5361 5093 4825 4597 4369 4227 4085 3967
740 3967 3849 3731 3614 3443 3273 3154 3035 3020 3004 2988 2973 2939 2904 2870 2836 2759 2682 2656 2631 2536 2442 2467 2492 2465 2439 2413 2387 2364 2341 2318 2295
736 2295 2276 2257 2290 2322 2265 2208 2202 2196 2199 2203 2258 2313 2311 2309 2307 2305 2335 2365 2344 2323 2278 2234 2196 2158 2083 2110 2130 2151 2123 2095 2152 2209 2168 2127 2137 2148 2142 2136 2086 2035
731 2035 1971 2009 2143 2277 2295 2314 2332 2351 2353 2356 2410 2463 2476 2489 2553 2618 2635 2652 2618 2584 2566 2547 2614 2681 2675 2670 2664 2658 2655 2651 2648 2644 2646 2648 2650 2651 2647 2643 2724 2805 2828 2851
726 2851 2875 2898 2850 2802 2804 2807 2862 2917 2921 2925 2932 2938 3030 3122 3150 3178 3206 3233 3290 3346 3403 3459 3432 3406 3498 3591 3687 3784 3829 3874 3977 4080 4268 4456 4577
722 4577 4698 4768 4837 4980 5122 5315 5509 5788 6067 6403 6739 7050 7463 8017 8673 9384 10096 10861 11627 12351 13024 13624 14052 14339
719 14339 14456 14499 14491 14478 14465 14513 14611 14754 15000 15315 15683 16068 16453 16948 17545 18267 19160 20364 21874 23613 25523 27548 29675
$$ packed form
745C6072j750j802j803j609j370j133q95o68m98m26m25n55n56o17p20q99q98q48q47p88o85
743A6280o24o23o12o11o39p41p10p09p33r03r64q61o56n53n42m38k68k68k28k28j42j42j18
740C967j18j18j17j71j70j19j19j5j6j6j5l4l5l4l4p7p7k6k5r5r4K5K5k7k6k6k6k3k3k3k3
736B295j9j9L3L2n7n7ooLMN5N5kkkkL0L0k1k1m5m4l8l8p5K7K0K1k8k8N7N7m1m1J0J1oon0n1
731B035o4L8J34J34J8J9J8J9KLN4N3J3J3O4O5J7J7l4l4j8j9O7O7onoolmlmKKKJmmQ1Q1K3K3
726B851K4K3m8m8KLN5N5MMPOR2R2K8K8K8K7N7N6N7N6k7k6R2R3R6R7M5M5J03J03J88J88J21
722D577J21P0O9J43J42J93J94K79K79L36L36L11M13N54O56P11P12P65P66P24O73O00M28K87
719A4339J17M3qj3j3M8R8J43K46L15L68L85L85M95N97P22Q93J204J510J739J910K025K127
$$ plain form
716 29675 31862 33947 35784 37314 38523 39356 39848 39965 39745 39354 38848 38342 37861 37380 36902 36424 35928 35484 35152 34990 35020 35289
713 35289 35844 36774 38075 39750 41677 43775 45975 48278 50653 52857 54772 56244 57216 57472 57027 56070 54924 53727 52546
711 52546 51365 50232 48997 47636 46172 44612 43000 41398 39967 38841 38159 37878 37972 38390 38979 39674 40472 41320 42067 42662
709 42662 43087 43392 43526 43372 42979 42448 41916 41262 40506 39801 39095 38327 37457 36559 35660 34861 34062 33297 32635 32124 31715 31408 31102
706 31102 30787 30471 30156 29944 29823 29805 29934 30165 30432 30698 30971 31244 31396 31548 31866 32423 33157 34062 35152 36344 37498 38652
703 38652 39802 40952 41926 42729 43498 44268 45037 45635 46057 46308 46435 46392 46206 46019 45810 45498 45169 44840 44665 44660 44836 45183 45768
700 45768 46591 47692 49032 50527 52124 53860 55596 57282 58866 60328 61620 62681 63435 63866 64057 63925 63419 62656 61655
698 61655 60397 58765 56815 54865 53019 51413 50180 49322 48843 48672 48722 48943 49329 49817 50299 50781 51200 51447 51390 51025 50356
$$ packed form
716B9675K187K085J837J530J209Q33M92J17k20l91n06n06m81m81m78m78m96m44l32j62L0K69
713C5289N55R30J301J675J927K098K200K303K375K204J915J472R72K56m45r57j146j197j181
711E2546j181j133j235j361j464j560j612j602j431j126o82k81R4M18N89O95P98Q48P47N95
709D2662M25L05J34j54l93n31n32o54p56p05p06p68q70q98q99p99p99p65o62n11m09l07l06
706C1102l15l16l15k12j21j8J29K31K67K66K73K73J52J52L18N57P34R05J090J192J154J154
703C8652J150J150R74Q03P69P70P69N98M22K51J27m3j86j87k09l12l29l29j75nJ76L47N85
700D5768Q23J101J340J495J597J736J736J686J584J462J292J061P54M31J91j32n06p63j001
698F1655j258j632j950j950j846j606j233q58m79j71N0K21L86M88M82M82M19K47n7l65o69
$$ plain form
695 50356 49517 48629 47740 46826 45810 44725 43641 42505 41268 40013 38758 37648 36709 35889 35069 34251 33330 32382 31433 30498
693 30498 29562 28631 27870 27300 26968 26815 26833 27009 27287 27563 27839 27968 27994 27924 27854 27817 27780 27750 27617 27355 27093 26831 26569 26344 26221
690 26221 26325 26804 27528 28253 28762 28896 28610 27949 27132 26315 25609 25143 24981 25127 25575 26262 27130 27998 28632 28822 28565 28000 27250
687 27250 26500 26004 25882 26152 26798 27822 29154 30453 31308 31370 30647 29333 27712 26074 24742 23858 23485 23466 23754 24179 24502
684 24502 24595 24380 23825 22962 21914 20866 19931 19304 19011 19025 19361 19936 20599 21261 21710 21851 21634 21179 20566 19952 19422 19131 19078
682 19078 19196 19341 19487 19528 19398 19149 18900 18603 18407 18342 18277 18116 17956 17802 17648 17567 17589 17753 18088 18530 19075 19760 20548 21314 21909
679 21909 22379 22678 22829 22981 23146 23481 23936 24391 25006 25724 26414 26864 26944 26785 26373 25723 24946 24170 23576 23154 22934 23021 23477 24104
676 24104 24767 25430 26061 26590 26942 27123 27218 27210 27149 27087 27295 27809 28646 29653 30736 31716 32329 32363 31783 30759 29454 28046 26736
$$ packed form
695E0356q39q88q89r14j016j085j084j136j237j255j255j110r39q20q20q18r21r48r49r35
693C0498r36r31p61n70l32j53J8J76K78K76K76J29K6p0p0l7l7l0j33k62k62k62k62k25j23
690B6221J04M79P24P25N09J34k86o61q17q17p06m66j62J46M48O87Q68Q68O34J90k57n65p50
687B7250p50m96j22K70O46J024J332J299Q55O2p23j314j621j638j332q84l73j9K88M25L23
684B4502R3k15n55q63j048j048r35o27k93J4L36N75O63O62M49J41k17m55o13o14n30k91n3
682A9078J18J45J46M1j30k49k49k97j96o5o5j61j60j54j54q1K2J64L35M42N45O85P88P66N95
679B1909M70K99J51J52J65L35M55M55O15P18O90M50Q0j59m12o50p77p76n94m22k20Q7M56O27
676B4104O63O63O31N29L52J81R5qo1o2K08N14Q37J007J083R80O13L4n80j024j305j408j310
$$ plain form
673 26736 25597 24688 24087 23692 23467 23354 23240 23150 23061 22843 22387 21713 20937 20208 19649 19345 19280 19451 19862 20455 21049 21448 21541 21297
670 21297 20678 19756 18664 17594 16626 15859 15262 14848 14536 14235 13831 13288 12745 12189 11633 11040 10344 9655 9068 8628 8290 7964
667 7964 7637 7507 7548 7675 7801 7734 7564 7298 7032 6688 6343 6027 5813 5629 5446 5184 4922 4702 4483 4264 4045 3824 3602 3443
664 3443 3386 3276 3166 3063 2959 2881 2803 2726 2648 2671 2695 2667 2639 2623 2607 2540 2473 2478 2483 2369 2255 2190 2125 2111 2097 2171 2246 2201 2156 2154 2153 2100 2048 1973
660 1973 1899 1831 1763 1823 1985 2096 2105 2074 2043 2006 1968 1887 1806 1811 1815 1850 1886 1837 1787 1814 1841 1817 1793 1712 1632 1613 1696 1769 1842 1869 1897 1944 1990 1889 1788
656 1788 1685 1686 1714 1742 1712 1683 1654 1624 1693 1762 1779 1797 1762 1728 1693 1658 1650 1642 1634 1626 1612 1597 1582 1568 1600 1632 1613 1594 1592 1589 1536 1482 1506 1531 1555 1579 1591 1602
651 1602 1563 1523 1491 1459 1427 1395 1474 1553 1631 1710 1752 1794 1717 1640 1625 1610 1646 1682 1677 1671 1666 1661 1708 1756 1719 1681 1692 1702 1713 1723 1738 1752 1766 1780 1841 1903 1913
647 1913 1922 1971 2019 2016 2012 1943 1874 1731 1640 1652 1766 1855 1893 1919 1945 1916 1888 1872 1857 1842 1826 1805 1783 1761 1739 1817 1895 1922 1949 1955 1962 1923 1885 1857 1931 2024
$$ packed form
673B6736j139r09o01l95k25j13j14r0q9k18m56o74p76p29n59l04o5J71M11N93N94L99R3k44
670B1297o19r22j092j070r68p67n97m14l12l01m04n43n43n56n56n93o96o89n87m40l38l26
667G964l27j30M1J27J26o7j70k66k66l44l45l16k14j84j83k62k62k20k19k19k19k21k22j59
664C443n7j10j10j03j04p8p8p7p8K3K4k8k8j6j6o7o7NNj14j14o5o5j4j4P4P5m5m5kjn3n2p5
660A973p4o8o8O0J62J11Rl1l1l7l8q1q1NML5L6m9n0K7K7k4k4q1q0j9Q3P3P3K7K8M7M6j01j01
656A788j03JK8K8l0k9k9l0O9O9J7J8l5l4l5l5qqqqj4j5j5j4L2L2j9j9kln3n4K4K5K4K4J2J1
651A602l9m0l2l2l2l2P9P9P8P9M2M2p7p7j5j5L6L6nonnM7M8l7l8J1J0J1J0J5J4J4J4O1O2J0
647A913RM9M8lmo9o9j43r1J2J14Q9L8K6K6k9k8j6j5j5j6k1k2k2k2P8P8K7K7OPl9l8k8P4R3
$$ plain form
642 2024 2066 2093 2069 1991 1914 1950 2090 2150 2108 2036 2066 2112 2107 2098 2088 2079 2069 2110 2203 2212 2118 2052 2088 2169 2148 2068 1988 1986 1985 2014 2043 2078 2113 2143 2275 2359 2341
638 2341 2215 2140 2218 2295 2330 2365 2384 2352 2273 2298 2406 2463 2395 2275 2243 2313 2377 2441 2460 2479 2448 2417 2472 2526 2547 2567 2588 2608 2702 2796 2839 2882 2994
634 2994 3106 3133 3109 3123 3239 3329 3368 3396 3526 3713 3848 3938 4078 4272 4466 4535 4603 4699 4897 5085 5273 5460 5750 6092 6434 6737 7041
630 7041 7431 7925 8548 9171 9821 10471 11224 12078 13008 14039 15184 16431 17804 19177 20608 22038 23451 24865 26201 27367
628 27367 28310 28946 29203 29016 28447 27503 26239 24737 23119 21399 19681 17963 16411 15030 13826 12725 11738 10855 9988 9223
625 9223 8572 8023 7514 7005 6537 6171 5838 5506 5161 4919 4738 4557 4321 4086 3970 3854 3725 3596 3467 3338 3279 3220 3161 3102 3040
622 3040 2978 2916 2854 2813 2772 2686 2600 2464 2430 2486 2542 2586 2528 2415 2302 2278 2356 2384 2309 2205 2102 2111 2121 2057 1993 1935 1878 1817 1858 1990 2121 2160
619 2160 2097 2092 2086 2150 2214 2193 2172 2109 2046 1983 1920 1896 1872 1848 1824 1911 1997 2033 1898 1721 1647 1722 1798 1720 1591 1518 1548 1566 1584 1609 1633 1664 1695 1770
$$ packed form
642B024M2K7k4p8p7L6J40O0m2p2L0M6nrj0rj0M1R3Rr4o6L6Q1k1q0q0kjK9K9L5L5L0J32Q4j8
638B341j26p5P8P7L5L5J9l2p9K5J08N7o8j20l2P0O4O4J9J9l1l1N5N4K1K0K1K0R4R4M3M3J12
634B994J12K7k4J4J16R0L9K8J30J87J35R0J40J94J94O9O8R6J98J88J88J87K90L42L42L03L04
630G041L90M94O23O23O50O50P53Q54R30J031J145J247J373J373J431J430J413J414J336J166
628B7367R43O36K57j87n69r44j264j502j618j720j718j718j552j381j204j101r87q83q67p65
625I223o51n49n09n09m68l66l33l32l45k42j81j81k36k35j16j16j29j29j29j29n9n9n9n9o2
622C040o2o2o2m1m1q6q6j36l4N6N6M4n8j13j13k4P8K8p5j04j03RJ0o4o4n8n7o1M1J32J31L9
619B160o3noO4O4k1k1o3o3o3o3k4k4k4k4Q7Q6L6j35j77p4P5P6p8j29p3L0J8J8K5K4L1L1P5
$$ plain form
614 1770 1846 1874 1801 1755 1762 1770 1778 1676 1575 1507 1541 1603 1665 1663 1661 1608 1555 1516 1477 1489 1502 1545 1588 1581 1523 1515 1609 1785 1859 1777 1695 1658 1621 1593 1565 1589 1612
610 1612 1610 1607 1605 1603 1574 1545 1515 1486 1425 1364 1357 1350 1400 1500 1584 1566 1533 1601 1719 1787 1713 1639 1568 1498 1384 1373 1492 1611 1581 1552 1522 1492 1486 1481 1560 1640
605 1640 1595 1550 1591 1631 1610 1588 1618 1648 1672 1696 1669 1642 1570 1498 1546 1593 1581 1569 1608 1647 1645 1642 1690 1788 1797 1702 1656 1712 1803 1791 1757 1724 1660 1596 1583 1570
601 1570 1526 1483 1439 1395 1406 1417 1479 1541 1601 1661 1636 1611 1570 1530 1490 1449 1456 1462 1520 1577 1579 1580 1582 1583 1575 1567 1559 1551 1528 1506 1483 1461 1427 1394 1412 1430 1490 1549 1557 1565 1477
596 1477 1388 1367 1432 1458 1433 1391 1349 1374 1398 1422 1446 1427 1408 1439 1471 1416 1360 1383 1526 1668 1690 1633 1576 1552 1528 1555 1583 1553 1524 1546 1567 1560 1553 1546 1539 1571
592 1571 1603 1584 1565 1628 1691 1703 1715 1676 1637 1489 1393 1402 1496 1575 1602 1654 1706 1755 1804 1769 1734 1750 1766 1707 1649 1590 1531 1513 1495 1474 1452 1372 1240 1186
587 1186 1252 1327 1351 1331 1363 1428 1493 1510 1527 1563 1600 1585 1570 1514 1457 1452 1447 1509 1572 1583 1594 1559 1523 1462 1401 1333 1266 1319 1371 1354 1338 1373 1407 1396 1385 1374
583 1374 1363 1377 1392 1356 1320 1414 1509 1576 1541 1436 1332 1248 1268 1296 1324 1307 1291 1333 1374 1442 1510 1553 1597 1589 1581 1517 1453 1440 1427 1474 1521 1516 1512 1457 1402 1460
$$ packed form
614A770P6K8p3m6PQQj02j01o8L4O2O2kkn3n3l9l9J2J3M3M3pn8qR4J76P4q2q2l7l7k8k8K4K3
610A612klkkk9k9l0k9o1o1ppN0J00Q4j8l3O8J18O8p4p4p1p0j14j1J19J19l0k9l0l0onP9Q0
605A640m5m5M1M0k1k2L0L0K4K4k7k7p2p2M8M7j2j2L9L9klM8R8Rr5m6N6R1j2l4l3o4o4j3j3
601A570m4m3m4m4J1J1O2O2O0O0k5k5m1m0m0m1PON8N7KJKJqqqqk3k2k3k2l4l3J8J8O0N9QQq8
596A477q9k1O5K6k5m2m2K5K4K4K4j9j9L1L2n5n6K3J43J42K2n7n7k4k4K7K8l0k9K2K1ppppL2
592A571L2j9j9O3O3J2J2l9l9j48r6RR4P9K7N2N2M9M9l5l5J6J6n9n8n9n9j8j8k1k2q0j32n4
587A186O6P5K4k0L2O5O5J7J7L6L7j5j5n6n7nnO2O3J1J1l5l6o1o1o8o7N3N2j7j6L5L4j1j1j1
583A374j1J4J5l6l6R4R5O7l5j05j04q4K0K8K8j7j6M2M1O8O8M3M4qqo4o4j3j3M7M7nmn5n5N8
$$ plain form
579 1460 1518 1516 1412 1365 1319 1320 1321 1323 1324 1356 1387 1412 1437 1450 1360 1271 1284 1310 1337 1370 1403 1406 1409 1361 1313 1358 1402 1396 1389 1432 1475 1466 1458 1521 1585 1563 1541 1492 1443 1375
574 1375 1307 1265 1324 1412 1500 1494 1489 1458 1428 1397 1367 1388 1409 1322 1236 1201 1336 1518 1598 1496 1395 1350 1408 1459 1510 1501 1492 1484 1475 1490 1506 1521 1536 1570 1603 1551
569 1551 1500 1504 1509 1514 1519 1502 1486 1469 1453 1492 1532 1520 1508 1493 1477 1487 1497 1479 1460 1492 1525 1537 1550 1563 1575 1650 1724 1771 1715 1629 1542 1511 1583 1597 1611 1580 1550
565 1550 1614 1678 1743 1807 1880 1953 1940 1928 1885 1842 1825 1808 1817 1825 1834 1843 1812 1781 1750 1719 1784 1849 1863 1876 1960 2043 2101 2159 2178 2197 2295 2392 2463 2431 2406 2380 2400
560 2400 2420 2440 2460 2526 2593 2660 2727 2847 2967 3139 3311 3538 3765 3985 4308 4764 5220 5689 6158 6714 7372 8159 8947 9839 10730 11707
557 11707 12581 13234 13512 13456 13094 12575 11886 11160 10435 9854 9376 8942 8611 8378 8248 8272 8466 8773 9251 9912 10743 11701 12762
554 12762 13838 15016 16316 17615 18934 20082 20848 21103 20859 20240 19396 18314 17094 15873 14720 13669 12629 11692 10876
552 10876 10162 9572 9084 8795 8676 8701 8827 9055 9283 9524 9765 10060 10457 10833 11209 11413 11379 11178 10874 10582 10290 9906 9522 9135
$$ packed form
579A460N8kj04m7m6JJKJL2L1K5K5J3r0q9J3K6K7L3L3LLm8m8M5M4opM3M3rqO3O4k2k2m9m9o8
574A375o8m2N9Q8Q8onl1l0l1l0K1K1q7q6l5J35J82Q0j02j01m5N8N1N1rrqrJ5J6J5J5L4L3n2
569A551n1MNNNj7j6j7j6L9M0j2j2j5j6J0J0j8j9L2L3J2J3J3J2P5P4M7n6q6q7l1P2J4J4l1l0
565A550O4O4O5O4P3P3j3j2m3m3j7j7RQRRl1l1l1l1O5O5J4J3Q4Q3N8N8J9J9R8R7P1l2k5k6K0
560B400K0K0K0O6O7O7O7J20J20J72J72K27K27K20L23M56M56M69M69N56O58P87P88Q92Q91R77
557A1707Q74O53K78n6l62n19o89p26p25n81m78m34l31k33j30K4J94L07M78O61Q31R58J061
554A2762J076J178J300J299J319J148P66K55k44o19q44j082j220j221j153j051j040r37q16
552A0876p14n90m88k89j19K5J26K28K28K41K41K95L97L76L76K04l4k01l04k92k92l84l84l87
$$ plain form
549 9135 8748 8412 8076 7754 7432 7111 6789 6549 6309 6155 6000 5920 5840 5890 6043 6243 6443 6656 6869 7264 7760 8295 8830 9503
546 9503 10346 11306 12369 13631 15133 16915 18937 21182 23666 26404 29141 31776 34103 35891 37031 37503 37396 36836 35969
544 35969 34911 33751 32584 31417 30293 29271 28435 27906 27725 27919 28590 29774 31368 33270 35505 38183 41336 44865 48694
541 48694 52523 56127 59014 60756 61235 60527 58898 56635 54065 51410 48755 46147 43539 41063 38826 36745 34766 33044
539 33044 31699 30660 29860 29189 28756 28546 28574 28777 29219 29891 30734 31538 32104 32209 31802 30956 29735 28345 26956 25672 24559
537 24559 23606 22653 21683 20713 19623 18534 17559 16584 15865 15145 14511 13876 13252 12627 12066 11675 11427 11282 11148 11117 11232 11450 11688
534 11688 11926 12364 12802 13372 14045 14993 16248 17722 19366 21177 23226 25570 28221 31068 34085 37096 39936 42397 44414
532 44414 45975 46956 47264 46787 45613 43927 41941 39954 38092 36604 35614 35135 35079 35398 36083 37281 39109 41450 44255 47503
$$ packed form
549I135l87l36l36l22l22l21l22k40k40j54j55q0q0N0J53K00K00K13K13L95M96N35N35O73
546I503Q43R60J063J262J502J782K022K245K484K738K737K635K327J788J140M72j07n60q67
544C5969j058j160j167j167j124j022q36n29j81J94O71J184J594J902K235K678L153L529L829
541D8694L829L604K887J742M79p08j629k263k570k655k655k608k608k476k237k081j979j722
539C3044j345j039q00o71m33k10K8K03M42O72Q43Q04N66J05m07q46j221j390j389j284j113
537B4559r53r53r70r70j090j089r75r75p19p20o34o35o24o25n61l91k48j45j34l1J15K18K38
534A1688K38M38M38N70O73R48J255J474J644J811K049K344K651K847L017L011K840K461K017
532D4414J561R81L08m77j174j686j986j987j862j488r90m79n6L19O85J198J828K341K805L248
$$ plain form
529 47503 51275 55559 60037 64515 68602 72042 74566 76034 76255 75146 72784 69363 65244 60749 56118 51589 47395 43713
527 43713 40631 38198 36320 35021 34281 34121 34453 35228 36325 37592 38900 40209 41271 41959 42157 41708 40661 39102 37220
525 37220 35098 32864 30630 28431 26335 24415 22666 21112 19659 18266 16976 15828 14850 13988 13228 12604 12083 11630 11177
522 11177 10844 10511 10239 9968 9786 9775 9855 9935 9954 9972 10048 10295 10644 10993 11357 11823 12427 13202 14087 15143 16417 17793 19241 20690
519 20690 22311 23932 25476 26713 27535 27913 27788 27288 26534 25679 24825 23972 23281 22896 22813 23036 23477 24156 25066 26215 27652
517 27652 29395 31316 33338 35315 37292 39127 40790 42260 43354 43804 43334 41923 39727 37093 34355 31789 29598 27837
515 27837 26383 25227 24377 23727 23180 22861 22850 23102 23457 23811 24062 24183 24134 23906 23678 23332 22748 21772 20489 19013 17536 16081
512 16081 14728 13556 12555 11757 11130 10702 10273 9731 9087 8494 8004 7649 7294 7031 6768 6549 6330 6172 6117 6070 6023 5982 5942 5981
$$ packed form
529D7503L772M284M478M478M087L440K524J468K21j109k362l421m119m495m631m529m194l682
527D3713l082k433j878j299p40j60L32P75J097J267J308J309J062O88J98m49j047j559j882
525C7220k122k234k234k199k096j920j749j554j453j393j290j148r78q62p60o24n21m53m53
522A1177l33l33k72k71j82j1Q0Q0J9J8P6K47L49L49L64M66O04P75Q85J056J274J376J448J449
519B0690J621J621J544J237Q22L78j25n00p54q55q54q53o91l85q3K23M41O79R10J149J437
517B7652J743J921K022J977J977J835J663J470J094M50m70j411k196k634k738k566k191j761
515B7837j454j156q50o50n47l19j1K52L55L54K51J21m9k28k28l46n84r76j283j476j477j455
512A6081j353j172j001p98o27m28m29n42o44n93m90l55l55k63k63k19k19j58n5m7m7m1m0L9
$$ plain form
509 5981 6020 6059 6099 6189 6280 6371 6462 6710 6959 7333 7878 8625 9372 9682 9412 8699 7883 7156 6532 6080 5729 5515 5301 5204 5107 5010 4914
506 4914 4877 4840 4804 4767 4689 4611 4629 4749 4972 5195 5424 5653 6033 6412 6805 7095 7351 7709 8242 8946 9867 10959 12146 13334 14421
503 14421 15405 16276 16909 17262 17377 17355 17162 16834 16607 16586 16803 16987 16863 16434 16005 15824 16223 17242 18841 21009 23621 26472
500 26472 29152 31130 31982 31590 30071 27721 24927 22048 19408 17103 15173 13520 12174 11116 10297 9704 9350 9193 9275
498 9275 9558 10011 10718 11800 13223 14886 16458 17655 18213 17917 16837 15246 13488 11832 10429 9264 8400 7774 7330 6886
495 6886 6519 6254 6125 5997 5830 5662 5585 5610 5669 5728 5757 5890 6118 6346 6505 6664 6822 6981 7220 7458 7782 8105 8486 8866 9387
492 9387 10010 10781 11722 12914 14346 16091 18075 20246 22247 23741 24519 24525 23814 22621 21188 19760 18503 17449 16566 15930
490 15930 15601 15491 15551 15777 16243 16941 17947 19345 21255 23708 26741 30325 34351 38576 42562 45699 47574 47880 46582
$$ packed form
509E981L9L9M0R0R1R1R1K48K49L74N45P47P47L10k70p13q16p27o24m52l51k14k14r7r7r7r6
506D914l7l7l6l7p8p8J8J20K23K23K29K29L80L79L93K90K56L58N33P04R21J092J187J188J087
503A4421R84Q71O33L53J15k2j93l28k27k1K17J84j24m29m29j81L99J019J599K168K612K851
500B6472K680J978Q52l92j519k350k794k879k640k305j930j653j346j058q19n93l54j57Q2
498I275K83M53P07J082J423J663J572J197N58k96j080j591j758j656j403j165q64o26m44m44
495F886l67k65j29j28j67j68p7K5N9N9K9J33K28K28J59J59J58J59K39K38L24L23L81L80N21
492I387O23P71R41J192J432J745J984K171K001J494P78Op11j193j433j428j257j054q83o36
490A5930l29j10O0K26M66O98J006J398J910K453L033L584M026M225L986L137J875L06j298
$$ plain form
487 46582 43861 40081 35795 31612 27851 24669 22046 20003 18481 17333 16480 15866 15512 15328 15300 15374 15615 16094 16908 18098
485 18098 19603 21278 22975 24296 24995 24978 24210 22862 21139 19245 17435 15863 14458 13223 12170 11355 10656 10059 9507
483 9507 9057 8607 8157 7717 7278 6992 6706 6546 6386 6345 6305 6249 6194 6395 6595 6782 6968 7309 7649 8024 8398 8780 9161 9605 10151
480 10151 10864 11816 12911 14007 15140 16274 17150 17582 17497 16967 16070 15003 14003 13174 12478 11952 11575 11369 11251 11237 11335 11604
477 11604 12007 12410 12965 13758 14878 16306 18147 20569 23550 26976 30593 33903 36316 37261 36492 34256 31131 27699 24390
474 24390 21457 18957 16968 15389 14117 13073 12199 11556 11083 10766 10619 10591 10734 11041 11519 12155 12961 13943 15163 16474 17682
472 17682 18470 18746 18498 17806 16739 15434 14126 12921 11843 10766 9733 8803 7947 7261 6718 6278 5864 5450 5139 4930 4735
469 4735 4540 4351 4162 4039 3915 3792 3668 3671 3675 3678 3681 3616 3551 3678 3908 4131 4252 4334 4519 4826 5234 5813 6495 7066 7466 7657 7678
$$ packed form
487D6582k721l780m286m183l761l182k623k043j522j148q53o14l54j84k8P4K41M79Q14J190
485A8098J505J675J697J321O99j7p68j348j723j894j810j572j405j235j053q15o99n97n52
483I507m50m50m50m40m39k86k86j60j60m1m0n6n5K01K00J87J86L41L40L75L74L82L81M44N46
480A0151P13R52J095J096J133J134Q76M32q5n30q97j067j000q29o96n26l77k06j18j4R8K69
477A1604M03M03N55P93J120J428J841K422K981L426L617L310K413R45p69k236l125l432l309
474B4390k933k500j989j579j272j044q74o43m73l17j47k8J43L07M78O36Q06R82J220J311J208
472A7682P88K76k48o92j067j305j308j205j078j077j033r30q56o86n43m40m14m14l11k09j95
469D735j95j89j89j23j24j23j24LMLLo5o5J27K30K23J21Q2J85L07M08N79O82N71M00J91K1
$$ plain form
466 7678 7421 6926 6333 5739 5281 4823 4491 4329 4332 4336 4299 4262 4300 4338 4382 4427 4598 4872 5259 5748 6301 6957 7839 9028 10328 11457
463 11457 12190 12548 12488 12054 11282 10272 9245 8320 7522 6896 6462 6131 5815 5499 5287 5246 5262 5278 5302 5327 5379 5533 5794 6055 6425
$$ packed form
466G678k57m95n93n94m58m58l32j62LMl7l7L8L8M4M5J71K74L87M89N53O56Q82J189J300J129
463A1457P33L58o0m34p72j010j027r25p98o26m34l31l16l16k12m1J6J6K4K5N2J54K61K61L70
$$ [...]
-1606I97
##$OBSERVED INTEGRALS=	(X Y Z)
(6.8875238258005087033, 6.9855093115048747521, 1)
(3.7579685816745151961, 3.8812111956815553704, 3.004334416017930387)
(2.8469545968906122546, 2.9431360119769407468, 2.0034068264675308768)
(2.7326191579041418933, 2.8304588732505786552, 1.9996169365799536521)
(2.4026390809313320496, 2.495784980908183126, 2.003698984731788979)
(2.0515011952623272151, 2.2918088785478447633, 3.0037214689328148864)
(6.7836770789224720701, 6.8482708286822919774, 1.0047169866422638318)
(6.7131353676959566457, 6.7836770789224720701, 0.99705301065006746164)
(1.6384079100748631941, 1.9294858386666113859, 5.4846530445588896896)
(0.98424058618247245445, 1.4212364867896167819, 5.5238922175064750775)
##END=	
##TITLE=	Feb27-2020.390.fid
##JCAMP-DX=	6.0	$$ MestReNova 14.1.0-24037
##BLOCK_ID=	7
##DATA TYPE=	NMR PEAK TABLE
##DATA CLASS=	PEAK TABLE
##CROSS REFERENCE=	NMR SPECTRUM: BLOCK_ID=6                                     
##.OBSERVE FREQUENCY=	400.05240029999998796
##.OBSERVE NUCLEUS=	^1H
##NPOINTS=	18
##FIRSTX=	2.1715538927316817563
##LASTX=	6.9432715083834368741
##XFACTOR=	1
##YFACTOR=	1
##FIRSTY=	5757.7892204149493409
##XUNITS=	PPM
##YUNITS=	ARBITRARY UNITS
##PEAK TABLE=	(XYW..XYW)
2.1715538927316817563,5757.7892204149493409,0.0031770305418468468631
2.447196548131506777,1646.1623095841030135,0.003515719418445447178
2.4647104447158287854,1700.8003721919308191,0.0031840159232353467886
2.763085514256835129,347.76383548172134397,0.0048414480922478369054
2.7805245618385989737,898.37919231765090444,0.007254529862559064117
2.7993529941992294496,850.25376570338983129,0.0051342160959565339914
2.8802087340308726304,798.72218832483156348,0.0055889460894490350026
2.8991649813045876627,861.3099270939641201,0.0074796755839301471563
2.9166379487528315551,347.50409116214154892,0.007560331207350604564
3.8203175696519684479,6855.012300536793191,0.0024090501984786075011
6.7483589450943215482,375.3414530250317398,0.0042099356224338801979
6.7531747001809350195,430.72483496926901125,0.0040795194730229630137
6.7683992792366627356,453.65127230620635146,0.0040818817476228740765
6.7732161190544113438,554.88207008861093072,0.0036069421731883943155
6.8058214280708746458,899.78988280658813892,0.0046405535591005917309
6.8104481295151968467,743.63666278262633114,0.0041265861794083143893
6.9232568853343163795,1175.6740983402403344,0.002654782071100680093
6.9432715083834368741,940.5953575844024499,0.0026571755868907919428
##$MNOVA/PEAK_DATA_TABLE=	(T,F,A,ST,SP,APT,APC)
$$ Complementary to PEAK TABLE
$$ T: Type
$$ F: Flags
$$ A: Annotation
$$ ST: Shape Type
$$ SP: Shape Parameter
$$ APT: Attached Peaks Type
$$ APC: Attached Peaks Count
Compound,None,,0,0,0,0
Compound,None,,0,0,0,0
Compound,None,,0,0,0,0
Compound,None,,0,0,0,0
Compound,None,,0,0,0,0
Compound,None,,0,0,0,0
Compound,None,,0,0,0,0
Compound,None,,0,0,0,0
Compound,None,,0,0,0,0
Compound,None,,0,0,0,0
Compound,None,,0,0,0,0
Compound,None,,0,0,0,0
Compound,None,,0,0,0,0
Compound,None,,0,0,0,0
Compound,None,,0,0,0,0
Compound,None,,0,0,0,0
Compound,None,,0,0,0,0
Compound,None,,0,0,0,0
##END=	
##END=	
##END=	
