##TITLE=	Feb27-2020.220.1.1r
AH001
##JCAMP-DX=	6.0	$$ MestReNova 14.1.0-24037
##DATA TYPE=	LINK
##BLOCK_ID=	1
##BLOCKS=	1    
##ORIGIN=	Mestrelab Research S.L.
##OWNER=	ah2319
##$MNOVA/LINK_BLOCK_TYPE=	ITEM	$$ NMR Spectrum
##$MNOVA/ITEM/POLYGON=	(XY..XY)
5321,5835
8722,5835
8722,8208
5321,8208
5321,5835
##$MNOVA/ITEM/Z=	0
##$MNOVA/ITEM/ANGLE=	0
##TITLE=	Feb27-2020.220.1.1r
##JCAMP-DX=	6.0	$$ MestReNova 14.1.0-24037
##BLOCK_ID=	2
##DATA TYPE=	NMR SPECTRUM
##DATA CLASS=	XYDATA
##NUMDIM=	1
##ORIGIN=	Bruker BioSpin GmbH
##OWNER=	nmrsu
##.OBSERVE FREQUENCY=	400.05240029848198446
##.OBSERVE NUCLEUS=	^1H
##.SOLVENT NAME=	CDCl3
##.PULSE SEQUENCE=	zg30
##LONGDATE=	2020/02/27 15:18:00.000
##.ACQUISITIONMODE=	SIMULTANEOUS
##$ORIGINAL FORMAT=	Bruker XWIN-NMR
##$MNOVA/SCALES_VERSION=	8
##$PARAMETER FILE=	(acqus, ASCII, h:/220/acqus, 0)
$$ ##TITLE= Parameter file, TOPSPIN		Version 3.2
$$ ##JCAMPDX= 5.0
$$ ##DATATYPE= Parameter Values
$$ ##NPOINTS= 11	$$ modification sequence number
$$ ##ORIGIN= Bruker BioSpin GmbH
$$ ##OWNER= nmrsu
$$ $$ 2020-02-27 15:18:39.918 +0000  nmrsu@nmrpc
$$ $$ /opt/topspin/data/ug1/nmr/Feb27-2020/220/acqus
$$ $$ process /opt/topspin3.2/prog/mod/shimcntl
$$ ##$ACQT0= -2.04831932773109
$$ ##$AMP= (0..31)
$$ 100 100 100 100 100 100 100 100 100 100 100 100 100 100 100 100 100 100
$$ 100 100 100 100 100 100 100 100 100 100 100 100 100 100
$$ ##$AMPCOIL= (0..19)
$$ -1 0 0 0 0 0 0 0 0 0 0 0 0 0 0 0 0 0 0 0
$$ ##$ANAVPT= -1
$$ ##$AQSEQ= 0
$$ ##$AQ_mod= 3
$$ ##$AUNM= <au_zg>
$$ ##$AUTOPOS= <22 >
$$ ##$BF1= 400.05
$$ ##$BF2= 400.05
$$ ##$BF3= 400.05
$$ ##$BF4= 400.05
$$ ##$BF5= 400.05
$$ ##$BF6= 400.05
$$ ##$BF7= 400.05
$$ ##$BF8= 400.05
$$ ##$BYTORDA= 0
$$ ##$CAGPARS= (0..11)
$$ 0 0 0 0 0 0 0 0 0 0 0 0
$$ ##$CFDGTYP= 0
$$ ##$CFRGTYP= 9
$$ ##$CHEMSTR= <none>
$$ ##$CNST= (0..63)
$$ 1 1 1 1 1 1 1 1 1 1 1 1 1 1 1 1 1 1 1 1 1 1 1 1 1 1 1 1 1 1 1 1 1 1 1 1
$$ 1 1 1 1 1 1 1 1 1 1 1 1 1 1 1 1 1 1 1 1 1 1 1 1 1 1 1 1
$$ ##$CPDPRG= (0..8)
$$ <> <> <> <> <> <> <> <> <>
$$ ##$D= (0..63)
$$ 0 1 0 0 0 0 0 0 0 0 0 0 0 0 0 0 0.0002 0 0 0 0 0 0 0 0 0 0 0 0 0 0 0 0
$$ 0 0 0 0 0 0 0 0 0 0 0 0 0 0 0 0 0 0 0 0 0 0 0 0 0 0 0 0 0 0 0
$$ ##$DATE= 1582816718
$$ ##$DE= 6.5
$$ ##$DECBNUC= <off>
$$ ##$DECIM= 2496
$$ ##$DECNUC= <off>
$$ ##$DECSTAT= 4
$$ ##$DIGMOD= 1
$$ ##$DIGTYP= 12
$$ ##$DQDMODE= 0
$$ ##$DR= 22
$$ ##$DS= 4
$$ ##$DSPFIRM= 0
$$ ##$DSPFVS= 20
$$ ##$DTYPA= 0
$$ ##$EXP= <proton>
$$ ##$F1LIST= <>
$$ ##$F2LIST= <>
$$ ##$F3LIST= <>
$$ ##$FCUCHAN= (0..9)
$$ 0 2 0 0 0 0 0 0 0 0
$$ ##$FL1= 90
$$ ##$FL2= 90
$$ ##$FL3= 90
$$ ##$FL4= 90
$$ ##$FOV= 20
$$ ##$FQ1LIST= <>
$$ ##$FQ2LIST= <>
$$ ##$FQ3LIST= <>
$$ ##$FQ4LIST= <>
$$ ##$FQ5LIST= <>
$$ ##$FQ6LIST= <>
$$ ##$FQ7LIST= <>
$$ ##$FQ8LIST= <>
$$ ##$FRQLO3= 15959.0749999881
$$ ##$FRQLO3N= 2
$$ ##$FS= (0..7)
$$ 83 83 83 83 83 83 83 83
$$ ##$FTLPGN= 0
$$ ##$FW= 125000
$$ ##$FnMODE= 0
$$ ##$FnTYPE= 0
$$ ##$GPNAM= (0..31)
$$ <> <> <> <> <> <> <> <> <> <> <> <> <> <> <> <> <> <> <> <> <> <> <> <>
$$ <> <> <> <> <> <> <> <>
$$ [...]
$$ 130000 130000 130000 130000 130000 130000 130000 130000 130000 130000 130000
$$ 130000 130000 130000 130000 130000 130000 130000 130000 130000 130000 130000
$$ 130000 130000 130000 130000 130000 130000 130000 0 0 0 0 0 0 0 0 0 0 0
$$ 0 0 0 0 0 0 0 0 0 0 0 0 0
$$ ##$ShimPowMaxUC= (0..63)
$$ 130000 130000 130000 130000 130000 130000 130000 130000 130000 130000 130000
$$ 130000 130000 130000 130000 130000 130000 130000 130000 130000 130000 130000
$$ 130000 130000 130000 130000 130000 130000 130000 130000 130000 130000 130000
$$ 130000 130000 130000 130000 130000 130000 130000 0 0 0 0 0 0 0 0 0 0 0
$$ 0 0 0 0 0 0 0 0 0 0 0 0 0
$$ ##$ShimPowMaxUG= (0..63)
$$ 524287 524287 524287 524287 524287 524287 524287 524287 524287 524287 524287
$$ 524287 524287 524287 524287 524287 524287 524287 524287 524287 524287 524287
$$ 524287 524287 524287 524287 524287 524287 524287 524287 524287 524287 524287
$$ 524287 524287 524287 524287 524287 524287 0 0 0 0 0 0 0 0 0 0 0 0 0 0 0
$$ 0 0 0 0 0 0 0 0 0 0
$$ ##$ShimPowRcbType= 3
$$ ##$ShimPowRes= (0..63)
$$ 1e-20 1e-20 1e-20 1e-20 1e-20 1e-20 1e-20 1e-20 1e-20 1e-20 1e-20 1e-20
$$ 1e-20 1e-20 1e-20 1e-20 1e-20 1e-20 1e-20 1e-20 1e-20 1e-20 1e-20 1e-20
$$ 1e-20 1e-20 1e-20 1e-20 1e-20 1e-20 1e-20 1e-20 1e-20 1e-20 1e-20 1e-20
$$ 1e-20 1e-20 1e-20 1e-20 0 0 0 0 0 0 0 0 0 0 0 0 0 0 0 0 0 0 0 0 0 0 0 0
$$ ##$ShimPowRng0= (0..63)
$$ 1 1 1 1 1 1 1 1 1 1 1 1 1 1 1 1 1 1 1 1 1 1 1 1 1 1 1 1 1 1 1 1 1 1 1 1
$$ 1 1 1 1 0 0 0 0 0 0 0 0 0 0 0 0 0 0 0 0 0 0 0 0 0 0 0 0
$$ ##$ShimPowRng1= (0..63)
$$ 1 1 1 1 1 1 1 1 1 1 1 1 1 1 1 1 1 1 1 1 1 1 1 1 1 1 1 1 1 1 1 1 1 1 1 1
$$ 1 1 1 1 0 0 0 0 0 0 0 0 0 0 0 0 0 0 0 0 0 0 0 0 0 0 0 0
$$ ##$ShimPowRng2= (0..63)
$$ 1 1 1 1 1 1 1 1 1 1 1 1 1 1 1 1 1 1 1 1 1 1 1 1 1 1 1 1 1 1 1 1 1 1 1 1
$$ 1 1 1 1 0 0 0 0 0 0 0 0 0 0 0 0 0 0 0 0 0 0 0 0 0 0 0 0
$$ ##$ShimPowRng3= (0..63)
$$ 1 1 1 1 1 1 1 1 1 1 1 1 1 1 1 1 1 1 1 1 1 1 1 1 1 1 1 1 1 1 1 1 1 1 1 1
$$ 1 1 1 1 0 0 0 0 0 0 0 0 0 0 0 0 0 0 0 0 0 0 0 0 0 0 0 0
$$ ##$ShimSysFunc= (0..63)
$$ 1 2 3 4 5 6 7 8 9 10 0 37 38 35 16 15 14 13 12 11 28 27 26 25 24 23 36
$$ 22 30 29 20 21 34 33 32 31 17 18 19 0 0 0 0 0 0 0 0 0 0 0 0 0 0 0 0 0 0
$$ 0 0 0 0 0 0 0
$$ ##$ShimSysMatrix= 0
$$ ##$ShimSysType= 4
$$ ##$TFXNUM= 0
$$ ##$TRIPLO2= 0
$$ ##$VTU= 2
$$ ##$VTUETH= <149.236.99.20>
$$ ##$VTUTY= <no>
$$ ##$WBREFAM= (0..15)
$$ 136.7 118.7 100 100 100 100 100 100 100 100 100 100 100 100 100 100
$$ ##$WBREFLM= (0..15)
$$ 0 0 0 0 0 0 0 0 0 0 0 0 0 0 0 0
$$ ##$WBREFPH= (0..15)
$$ 77.55 -71.28 0 0 0 0 0 0 0 0 0 0 0 0 0 0
$$ ##$WBSGU= (0..15)
$$ 0 0 0 0 0 0 0 0 0 0 0 0 0 0 0 0
$$ ##$XFAC= 2
$$ ##END=
$$ 
##$DECIM=	2496
##$DSPFVS=	20
##XUNITS=	HZ
##YUNITS=	ARBITRARY UNITS
##FIRSTX=	6537.6456707952447687
##LASTX=	-1475.1748420252554297
##DELTAX=	-0.24453933874997710318
##XFACTOR=	1
##YFACTOR=	6.028287608247616447
##FIRSTY=	-1197.1966552734375
##MINY=	-2311.97265625
##MAXY=	17266998
##NPOINTS=	32768
##XYDATA=	(X++(Y..Y))
$$ [...]
$$ plain form
4046 196 116 14 -87 119 63 3 -57 3 64 15 -32 -24 -15 124 1 174 84 126 167 43 -80 -94 -109 -59 -10 39 88 55 22 -11 -44 -34
4038 -34 -23 35 95 100 -155 -111 -67 -68 -68 -69 -70 -99 -128 -92 -55 -110 -165 -23 118 8 -101 -101 -101 -76 -50 -90 -130 -82 -34 14 62 93 123 45 -33 -3
4029 -3 26 -8 -44 7 59 1 -55 4 64 58 53 24 -4 -33 -61 -25 11 -17 -46 -100 -154 -98 -42 -31 -19 -171 -61 54 -90 -236 -119 19 -102
4021 -102 -45 11 -83 82 36 -10 46 103 6 -89 -66 -44 -169 -31 -9 12 -58 -129 -26 75 25 -25 -94 -164 -80 2 113 224 182 140 46
4014 46 -47 11 71 55 39 39 40 -134 -46 -40 -35 -50 -65 -79 -94 -75 -55 -35 -16 -78 -140 -93 -46 -48 -49 -116 -182 -98 -13 6 25 2 -20 103 -33 -59 -85
4005 -85 -127 -169 -179 -190 -90 8 -54 -118 -116 -113 -129 -144 -50 43 -46 -136 -30 75 40 5 -30 -65 -102 -138 -273 -146 17 -80 95 270 130 -9
3997 -9 -40 -71 -40 -9 21 52 -31 -115 -90 -64 -43 -22 -1 19 96 173 -33 -240 -183 -126 -162 -197 -217 25 72 118 -145 -146 -98 -50 -58 -66 -75 -83 -89 -96 -37
3988 -37 20 -13 -47 -81 -115 -14 85 76 67 27 -13 11 37 -20 -77 77 -28 36 102 85 69 38 7 41 76 86 96 106 116 76 36 -19 -76 55
$$ packed form
4046A96q0j02j01K06n6o0o0O0O1m9m7QRJ39j23J73r0M2M1j24j23j4j5N0M9M9M9l3l3l3l3J0
4038c4J1N8O0Nk55M4M4j%jjk9k9L6L7n5n5J42J41j10j09%%K5K6m0m0M8M8M8M8L1L0p8p8L0
4029cK9l4l6N1N2n8n6N9O0onk9k8k9k8L6L6k8k9n4n4N6N6J1J2j52J10J15j44j46J17J38j21
4021a02N7N6r4J65m6m6N6N7r7r5K3K2j25J38K2K1p0p1J03J01n0n0o9p0Q4Q2J11J11m2m2r4
4014D6r3N8O0j6j6%Jj74Q8ONj5j5j4j5J9K0K0J9o2o2M7M7kjo7o6Q4Q5J9J9k3k2J23j36k6k6
4005h5m2m2j0j1J00R8o2o4KLj6j5R4R3q9r0J06J05l5l5l5l5l7l6j35J27J63r7J75J75j40j39
3997il1l1L1L1L0L1q3q4K5K6K1K1K1K0P7P7k06k07N7N7l6l5k0K42M7M6k63jM8M8qqrqopN9
3988c7N7l3l4l4l4J01R9rrm0m0K4K6n7n7J54j05O4O6j7j6l1l1L4L5J0J0J0J0m0m0n5n7J31
$$ plain form
3980 55 -74 8 90 112 133 88 44 64 84 -43 90 9 -72 -28 15 16 16 16 17 61 106 -2 -110 -46 16 15 13 -10 -34 -58 -81 -72 -63 -120 -176 -167 -157
3970 -157 -148 -138 -96 -53 -77 -100 -89 -79 -69 -59 -62 -66 -69 -72 -110 -148 -77 -5 16 38 60 82 117 151 120 89 180 270 120 -29 50 129 12 -105 -105 -105
3962 -105 42 -72 -37 -2 16 34 0 -34 -69 -104 30 166 61 -43 -27 -10 -60 -109 -32 44 71 -163 -104 -45 144 71 64 56 -33 -122 -93 -64
3954 -64 -35 -5 -36 -67 -98 -129 22 174 173 172 119 65 77 88 10 -67 -36 -5 18 42 -86 -215 -138 -60 16 93 0 -92 -16 59 -64 74 66 57
3946 57 93 129 99 69 23 -22 -3 15 13 10 8 5 -71 -149 -161 -173 -208 -243 -168 -94 -40 13 1 -10 -49 -89 -39 -120 -159 62 6 -180 -112 -43 17 78
3937 78 55 32 9 -12 -24 -37 -49 -61 12 86 7 -71 -54 -37 -109 -51 128 45 -94 28 2 -23 32 88 -55 -200 -148 -96 -59 -22 13 50 10
3929 10 -28 -68 -108 -119 -129 -75 -20 20 61 -22 -107 12 -129 -198 -136 -100 -63 -19 25 103 182 260 338 340 342 147 -47 -57 -67 -19 27 143 128 -78
3920 -78 -22 95 81 48 15 -30 -77 -104 0 59 -141 -35 71 6 -58 -148 -107 87 20 29 -92 -108 -123 -81 -40 11 63 49 35 13 -8 -30
$$ packed form
3980E5j29Q2Q2K2K1m5m4K0K0j27J33q1q1M4M3J%%JM4M5j08j08O4O2jkk3k4k4k3RRn7n6RJ0
3970a57RJ0M2M3k4k3J1J0J0J0lmlll8l8P1P2K1K2K2K2L5L4l1l1R1R0j50j49P9P9j17j17%%
3962a05J47j14L5L5J8J8l4l4l5l5J34J36j05j04J6J7n0m9P7P6K7k34N9N9J89p3pqq9q9K9K9
3954f4K9L0l1l1l1l1J51J52jjn3n4J2J1p8p7L1L1K3K4j28j29P7P8P6P7r3r2P6P5j23J38qr
3946E7L6L6l0l0m6m5J9J8klklp6p8j2j2l5l5P5P4N4N3j2j1l9m0N0q1l9K21n6j86O8O9O0O1
3937G8k3k3k3k1j2j3j2j2P3P4p9p8J7J7p2N8J79q3j39J22k6k5N5N6j43j45N2N2L7L7L5L7m0
3929A0l8m0m0j1j0N4N5M0M1q3q5J19j41o9O2L6L7M4M4P8P9P8P8KKj95j94j0j0M8M6J16j5k06
3920g8N6J17j4l3l3m5m7k7J04N9k00J06J06o5o4r0M1J94o7Rj21j6j5M2M1N1N2j4j4k2k1k2
$$ plain form
3913 -30 -52 -64 -75 -87 -99 -11 76 55 34 56 78 100 122 147 172 197 222 200 179 48 -81 -11 58 -67 -194 -125 -55 -51 -47 -5 36 13 -10 10
3904 10 30 -58 -147 -138 -130 -57 16 -24 -66 -107 -149 -8 131 118 106 140 174 99 24 21 18 15 13 97 182 70 -41 -3 34 73 111 -15 -143 -161 -179
3896 -179 -88 2 93 184 95 6 26 46 33 20 8 -4 29 64 33 2 -5 -13 -86 -160 -151 -141 -67 7 4 1 -1 -4 11 28 -21 -70 -168 -266 -212 -157 -143 -129
3886 -129 -115 -101 -119 -136 -88 -40 -35 -31 -92 -153 -157 -161 -165 -169 -148 -127 -105 -84 -92 -100 1 103 70 37 4 -28 -61 -94 -18 57 31 5 -21 -47 -80 -113 -80 -48
3877 -48 -107 -166 -99 -32 -216 -137 -96 -55 -60 -64 -68 -73 -21 30 -71 -172 -71 29 65 100 147 193 60 -73 -152 31 23 -115 -10 -35 -61 44
3869 44 -87 -87 -44 -1 29 60 25 -8 -70 -132 -128 -124 -62 -1 -5 -10 -63 -117 -61 -5 -52 -99 -80 -61 -60 -58 -56 -55 -12 30 7 -15 5 26 47 68 94 121 164
3860 164 207 -41 -28 146 58 -73 -75 -27 -111 -48 14 3 -7 71 150 -57 -133 -18 -165 -47 70 37 3 -29 -63 -22 17 -51 -120 -66 -12
3852 -12 -105 62 78 94 -173 -179 -121 -63 -54 -45 -93 -141 7 155 84 13 -57 -128 -67 -5 -45 -84 -156 -97 34 -94 -48 -2 -37 -73 -47 -22 -209
$$ packed form
3913c0k2j2j1j2j2Q8Q7k1k1K2K2K2K2K5K5K5K5k2k1j31j29P0O9j25j27O9P0MMM2M1k3k3K0
3904A0K0q8q9RQP3P3m0m2m1m2J41J39j3j2L4L4p5p5lllkQ4Q5j12j11L8L7L9L8j26j28j8j8
3896a79R1R0R1R1q9q9K0K0j3j3j2j2L3L5l1l1pqp3p4RJ0P4P4llklJ5J7m9m9r8r8N4N5J4J4
3886a29J4J4j8j7M8M8NMo1o1mmmmK1K1K2K1qqJ01J02l3l3l3l2l3l3P6P5k6k6k6k6l3l3L3L2
3877d8n9n9O7O7j84P9M1M1nmmnN2N1j01j01J01J00L6L5M7M6j33j33p9J83qj38J05k5k6J05
3869D4j31%M3M3L0L1l5l3o2o2MMO2O1mnn3n4N6N6m7m7J9J9JKKJM3M2k3k2K0K1K1K1K6K7M3
3860A64M3k48J3J74q8j31kM8q4O3O2j1j0P8P9k07p6J15j47J18J17l3l4l2l4M1L9o8o9N4N4
3852a2r3J67J6J6k67oN8N8RRm8m8J48J48p1p1p0p1O1O2m0l9p2N9J31j28M6M6l5l6K6K5j87
$$ plain form
3844 -209 -134 22 178 138 98 214 67 68 69 28 -11 -51 -92 -38 15 -39 -94 -100 -107 -96 -86 -283 -219 -105 -253 -89 -187 -7 -89 -24 41 90
3836 90 139 14 -109 -38 33 15 -2 -20 -38 -79 -120 -96 -71 31 135 130 124 115 107 98 89 101 113 60 6 8 10 -124 -259 -250 20 -52 -126 -120 -115 -110 -105 -107 -110
3827 -110 -113 -116 -15 86 -24 -136 88 50 50 51 36 22 24 26 -81 73 -28 -130 -125 -120 -115 -110 -91 -72 -119 -166 -153 -140 -126 -113 -60 -7 -20 -33 -75
3818 -75 -117 -49 17 -17 -52 -22 8 -1 -11 -22 -32 0 32 118 -56 -216 -113 52 86 79 71 -10 -92 -87 -83 -79 -75 -128 -182 -82 17 -35 -88 -140 -193 -130
3809 -130 -66 78 -38 96 231 63 25 107 -73 10 95 80 65 50 35 7 -21 -49 -78 -18 40 34 28 20 11 2 -5 51 109 57 5 8 11 31 50 -183
3801 -183 -155 -138 -121 -29 -199 -238 -146 17 50 55 61 26 -9 -44 -79 -98 -117 -136 -155 -134 -114 -249 -122 25 41 141 -19 -50 -80 -17 44 33
3793 33 23 176 67 -5 183 216 118 70 22 -33 -89 3 95 79 62 105 148 81 14 -95 -205 -119 -33 31 96 103 111 35 90 227 102 -45
3785 -45 -62 -120 83 74 65 72 80 40 0 25 51 -17 -85 -88 -92 -63 -34 -71 -108 40 189 141 93 103 112 56 0 0 -1 62 126 75 25 231 175 90 6 -29
$$ packed form
3844b09P5J56J56m0m0J16j47JJm1l9m0m1N4N3n4n5opJ1J0j97O4J14j48J64r8J80q2O5O5M9
3836I0M9j25j23P1P1j8j7j8j8m1m1K4K5J02J04norqrrJ2J2n3n4KKj34j35RK70p2p4ONNNkl
3827a10llJ01J01j10j12K24l8%Jj5j4KKj07J54j01j02NNNNJ9J9m7m7J3J3J4J3N3N3j3j3m2
3818g5m2O8O6l4l5L0L0rj0j1j0L2L2Q6j74j60J03J65L4pqq1q2NMMMn3n4J00R9n2n3n2n3O3
3809a30O4J44j16J34J35j68l8Q2j80Q3Q5j5j5j5j5k8k8k8k9O0N8ooqrrpN6N8n2n2LLK0J9k33
3801a83K8J7J7R2j70l9R2J63L3NOl5l5l5l5j9j9j9j9K1K0j35J27J47J6J00j60l1l0O3O1j1
3793C3j0J53j09p2J88L3r8m8m8n5n6R2R2j6j7M3M3o7o7j09j10Q6Q6O4O5PQp6N5J37j25j47
3785d5j7n8K03rrPQm0m0K5K6o8o8lmK9K9l7l7J48J49m8m8J0Rn6n6%jO3O4n1n0K06n6q5q4l5
$$ plain form
3776 -29 -64 -85 -106 -127 -148 -180 -212 -90 30 23 16 9 2 -101 -205 -128 -52 85 -39 -98 104 102 100 115 129 156 183 209 236 154 73 57 41 22 2
3767 2 -17 -37 -122 -208 -140 -72 -51 -29 -7 14 40 66 26 -12 113 239 125 11 -6 -25 -38 211 61 -87 -111 -135 -140 -145 -150 -154 -127 -100 -57 -13
3759 -13 -85 105 -63 28 -74 -177 -7 -99 -60 -21 -64 -107 -60 -13 -32 -50 -32 -14 3 22 -12 -46 -14 16 88 159 33 -92 -73 -55 28 112
3751 112 27 -58 9 76 24 -27 -13 0 -9 -19 52 -137 -59 19 80 142 107 72 36 1 -12 -25 -39 -53 -94 -135 -111 -86 -52 -19 52 -137 -186 -234
3743 -234 -173 -112 -134 105 44 -16 -38 -60 25 112 149 186 69 -46 36 120 93 67 51 35 -46 -128 -130 -133 -152 -171 -1 -93 -37 17 32 46 -4 -55
3734 -55 -82 -109 163 175 87 0 109 -42 88 220 35 112 60 9 39 70 102 134 57 -20 -144 -267 -107 52 -2 -57 40 138 193 249
3727 249 211 -87 -78 -69 -77 -84 -83 -82 -81 -81 -131 -181 -122 -63 -67 -71 -75 -79 82 244 122 0 37 74 46 18 112 206 0 56 46 36 43 50 7 -34 -76 -118 -24
3717 -24 70 11 -46 -126 -206 -237 -5 22 50 29 8 -16 -42 -50 -59 -204 -88 28 -116 -64 -12 89 190 131 73 80 87 14 -58 -21 14 -26 -67 -109
$$ packed form
3776b9l5k1k1k1k1l2l2J22J20ppppj03j04P7P6J37j24n9K02kkJ5J4K7K7K6K7q2q1j6j6j9k0
3767Bj9k0q5q6O8O8K1K2K2K1K6K6m0l8J25J26j14j14j7j9j3K49j50j48k4k4nnnmK7K7M3M4
3759a3p2J90j68R1j02j03J70r2L9L9m3m3M7M7j9j8J8J8J7J9l4l4L2L0P2P1j26j25J9J8Q3Q4
3751A12q5q5O7O7n2n1J4J3rj0P1j89P8P8O1O2l5l5l6l5j3j3j4j4m1m1K4K5L4L3P1j89m9m8
3743b34O1O1k2K39o1o0k2k2Q5Q7L7L7j17j15Q2Q4k7k6j6j6q1q2klj9j9J70r2N6N4J5J4n0n1
3734e5k7k7K72J2q8q7J09j51J30J32j85P7n2n1L0L1L2L2p7p7j24j23J60J59n4n5R7R8N5N6
3727B49l8k98RRqpJJJ%n0n0N9N9mmmmJ61J62j22j22L7L7k8k8R4R4k06N6j0j0PPm3m1m2m2R4
3717b4R4n9n7q0q0l1K32K7K8k1k1k4k6qrj45J16J16j44N2N2J01J01n9n8PPp3p2L7L5m0m1m2
$$ plain form
3709 -109 -150 -160 -170 -70 29 67 105 181 -3 -36 -69 -53 -37 -116 -195 -122 -48 8 65 56 47 -95 -239 -170 -101 -212 -61 -74 -87 145 116 81
3701 81 47 9 -28 -65 -103 -73 -42 -11 18 -74 -166 -150 -133 -74 -15 -66 -116 -58 0 -52 -103 -107 -110 -130 -150 25 -59 -106 -154 -25 103 -24 -152 61
3693 61 13 194 113 -8 -130 -116 -101 -152 -203 -144 -85 -109 -132 -90 -48 12 72 -19 -112 9 131 100 69 21 -27 -76 -125 -117 -110 -37 34 -38 -111 -31
3685 -31 48 -30 -110 -97 -84 18 -141 -153 -166 -90 -15 59 134 62 -10 -17 -24 -51 -79 -106 -134 -47 40 127 214 154 94 33 -26 -19 -12 -5 1 11 20 -51 138
3676 138 16 -105 -101 -98 -95 -93 -91 -89 -102 -114 -193 -271 -227 -182 -137 -93 -101 -109 -51 5 -2 -10 -18 -26 -110 -193 -124 -55 -51 -47 -43 -40 -68 -96 -58 -21 -61 -101 -76 -51 -29 -8
3665 -8 -52 -97 -51 -5 40 86 74 63 51 40 0 -40 83 -55 -105 105 -43 -192 -147 -102 -57 -12 30 73 51 28 72 117 52 -12 83 179 210
3657 210 241 201 161 55 -50 -68 -87 -39 7 60 112 -75 -262 -139 -16 -90 -164 -72 19 -42 -103 -114 -125 -136 -147 -130 -114 -97 -81 -66 -52 -120
3649 -120 74 84 95 -25 115 79 43 24 4 18 31 -20 -72 -46 -19 -58 -97 2 103 6 -89 -57 -26 -60 -94 -116 -138 -160 -182 -9 162 -9
$$ packed form
3709a09m1j0j0J00R9L8L8P6j84l3l3J6J6p9p9P3P4N6N7rrj42j44O9O9j11J51j3j3K32k9l5
3701H1l4l8l7l7l8L0L1L1K9r2r2J6J7N9N9n1n0N8N8n2n1mlk0k0J75q4m7m8J29J28j27j28K13
3693F1m8J81q1j21j22J4J5n1n1N9N9k4k3M2M2O0O0r1r3J21J22l1l1m8m8m9m9QPP3P1p2p3Q0
3685c1P9p8q0J3J3J02j59j2j3P6P5P4P5p2p2ppk7k8k7k8Q7Q7Q7Q7o0o0o1n9PPPOJ0Rp1J89
3676A38j22j21MLLKKKj3j2p9p8M4M5M5M4qqN8N6pqqqq4q3O9O9MMMLk8k8L8L7m0m0K5K5K2K1
3665hm4m5M6M6M5M6j2j1j2j1m0m0J23j38n0K10j48j49M5M5M5M5M2M3k2k3M4M5o5o4R5R6L1
3657B10L1m0m0j06j05j8j9M8M6N3N2j87j87J23J23p4p4R2R1o1o1j1j1j1j1J7J6J7J6J5J4o8
3649a20J94J0J1j20J40l6l6j9k0J4J3n1n2K6K7l9l9R9J01r7r5L2L1l4l4k2k2k2k2J73J71j71
$$ plain form
3642 -9 80 92 103 -126 -93 -44 4 85 167 -83 -71 -97 -124 -77 -31 -67 159 152 145 1 -142 -142 -143 -143 -144 -75 -6 13 33 -177 -126 -70 -13 -84 -155 -160
3633 -160 -165 -127 -90 -200 -48 -78 -107 -11 84 4 -75 -46 -17 64 147 16 148 121 95 85 75 44 14 131 -14 -22 -29 -54 -78 -41 -4 -76 -148
3625 -148 -145 -141 -138 -134 -100 -65 -139 -214 -107 -1 -4 -7 -51 -95 -133 89 -27 -144 -135 -126 -154 -183 -102 -21 1 24 47 70 -2 -75 4 84 72 60 47 35
3616 35 65 95 125 155 160 164 169 174 70 -34 14 62 -55 -173 -138 -103 -84 -66 99 3 -30 -63 -113 -163 -189 -214 -174 -134 -163 -193 -113 -33 -48 -63 -77
3607 -77 -92 -86 -81 -141 -202 -122 -43 35 114 -2 -118 -169 -219 -125 -31 -46 -61 -46 -31 147 64 -79 37 -8 -54 -13 27 216 143 54 -33 14 62
3599 62 -13 -89 -165 -241 -153 -65 22 110 110 109 -44 -198 -129 -60 2 -195 -33 128 121 114 7 -99 50 -61 -40 -18 -13 -8 -29 -50 -71 -92 -70 -49
3591 -49 -27 -5 15 37 -7 -51 17 86 105 125 -20 95 48 0 91 -79 -38 3 62 122 72 22 -44 -112 -27 58 87 116 146 175 123 70 99 129
3583 129 -115 -98 -76 -53 -42 -30 -84 -138 -51 34 12 -10 -24 -38 -52 -66 -48 -31 24 -182 -91 0 -35 -70 -70 -71 -72 -72 -18 36 8 -18 87 -67 -76
$$ packed form
3642iQ9J2J1k29L3M9M8Q1Q2k50J2k6k7M7M6l6K26ppj44j43%j%jO9O9J9K0k10N1N6N7p1p1n
3633a60nL8L7j10J52l0k9R6R5q0p9K9K9Q1Q3j31J32k7k6j0j0l1l0J17j45qpk5k4L7L7p2p2
3625a48LMLML4L5p4p5J07J06llm4m4l8K22j16j17RRk8k9Q1Q1K2K3K3K3p2p3P9Q0j2j2j3j2
3616C5L0L0L0L0NMNNj04j04M8M8j17j18L5L5J9J8J65r6l3l3n0n0k6k5M0M0k9l0Q0Q0j5j5j4
3607g7j5ONo0o1Q0P9P8P9j16j16n1n0R4R4j5j5J5J5J78q3j43J16m5m6M1M0J89p3q9q7M7M8
3599F2p5p6p6p6Q8Q8Q7Q8%jj53j54O9O9O2j97J62J61ppj07j06J49j11K1K2NNk1k1k1k1K2K1
3591d9K2K2K0K2m4m4O8O9J9K0j45J15m7m8R1j70M1M1N9O0n0n0o6o8Q5Q5K9K9L0K9n2n3K9L0
3583A29k44J7K2K3J1J2n4n4Q7Q5k2k2j4j4j4j4J8J7N5k06R1R1l5l5%jj%N4N4k8k6J05j54r
$$ plain form
3574 -76 -84 -112 -141 -104 -67 -57 -47 -37 -27 -102 -177 -99 -22 31 84 121 158 209 -1 -102 57 109 160 118 77 20 -35 -92 -148 -27 93 61 29
3566 29 -24 -79 -133 -188 -188 -188 -187 -187 -64 59 -13 -86 -42 2 46 90 36 -17 37 92 44 -2 15 33 -45 -124 -6 110 12 -85 -30 24 -51 -126 -48
3557 -48 28 -10 -50 -24 0 -86 -173 -64 45 44 42 41 40 -48 -136 -28 79 15 -48 -112 -176 -119 -61 -112 -164 -117 -70 -24 22 -50 -124 -132 -139 3 147
3549 147 138 129 55 -17 -25 -33 -18 -3 -53 -103 -82 -62 -41 -20 -32 -44 -56 -68 -145 -221 -232 -243 -177 -112 -111 -111 -97 -82 -68 -54 -53 -52 -51 -51 -16 18 -99 -217 -111
3539 -111 -5 -8 -12 -25 -39 -52 -66 -95 -123 -86 -49 19 88 92 96 64 32 0 -31 -3 25 53 81 18 -44 -26 -7 -130 9 17 25 -187 -137 -126 -115 -128
3531 -128 -140 -152 -164 -219 -273 -159 -44 -192 -78 -46 -14 -47 -81 -98 -115 -209 -41 -21 0 -45 -90 -26 37 -46 -130 -18 94 -1 -96 5 106
3523 106 21 -63 -38 -14 -88 -162 -39 82 14 -54 3 60 -87 27 76 -137 -161 -185 -160 -135 -88 -41 104 -12 -203 -131 -70 -10 -23 -36 -49
3515 -49 -61 -81 -101 -121 -141 -38 65 75 85 -93 -9 36 81 13 -54 -13 28 0 -29 -58 -87 -59 -31 -2 25 30 36 -24 -84 -40 2 46 89 0 -88
$$ packed form
3574g6qk8k9L7L7J0J0J0J0p5p5P8P7N3N3L7L7N1k10j01J59N2N1m2m1n7n5n7n6J21J20l2l2
3566B9n3n5n4n5%%J%J23J23p2p3M4M4M4M4n4n3N4N5m8m6J7J8p8p9J18J16r8r7N5N4p5p5P8
3557d8P6l8m0K6K4q6q7J09J09jkjjq8q8J08J07o4o3o4o4N7N8n1n2M7M7M6M6p2p4qpJ42J44
3549A47rrp4p2qqJ5J5n0n0K1K0K1K1j2j2j2j2p7p6j1j1O6O5J%J4J5J4J4JJJ%L5L4j17j18J06
3539a11J06lmj3j4j3j4k9k8L7L7O8O9MMl2l2l2l1K8K8K8K8o3o2J8J9j23J39QQk12N0J1J1j3
3531a28j2j2j2n5n4J14J15j48J14L2L2l3l4j7j7r4J68K0K1m5m5O4O3q3q4J12J12r5r5J01J01
3523A06q5q4K5K4p4p4J23J21o8o8N7N7j47J14M9k13k4k4K5K5M7M7J45j16j91P2O1O0j3j3j3
3515d9j2k0k0k0k0J03J03J0J0j78Q4M5M5o8o7M1M1k8k9k9k9K8K8K9K7NOo0o0M4M2M4M3q9q8
$$ plain form
3507 -88 19 127 47 -31 -111 -190 -141 -93 -44 3 34 65 46 28 -113 7 -18 -45 -72 -98 -163 33 -7 -49 -73 -98 -69 -39 -9 19 39 58 -14
3499 -14 -87 -250 -150 15 181 -36 7 57 106 99 91 83 75 60 44 28 12 -89 -191 -140 -89 -45 -2 41 84 61 38 -94 -227 -220 -213 -141 -69 -122
3490 -122 -176 -76 22 -52 -127 -137 -147 -122 -98 -8 81 47 12 -5 -23 -105 74 -45 -165 -83 -1 -28 -55 -14 26 2 -21 -96 -171 -66 39 87
3483 87 -126 -84 -41 -84 -127 -104 -81 -101 -120 -140 -159 -36 86 13 -60 -55 -51 225 241 -42 -64 -53 -42 -81 -121 -51 18 35 53 70 87 106 124 34
3474 34 -56 -117 -178 -250 -60 4 -193 -161 -129 -123 -117 -46 25 -27 -80 -67 -55 -48 -40 -33 -26 -52 -78 -38 1 -39 -81 -122 -164 -67 29 -27 -83 -65 -47 -138 -230
3465 -230 -214 -199 -183 -168 -123 -79 -34 10 -92 -195 -188 -182 -92 -3 -67 -130 -71 -12 -18 -25 -28 -30 -143 -255 -135 -15 -48 -81 -2 75 1 -73 -99 -126 -153
3457 -153 -180 -198 -217 -170 -123 -51 20 91 163 97 31 75 119 109 99 24 -51 -49 -47 19 86 35 -14 -64 -115 -106 -98 -89 -80 5 92 69 46 37 27 18 8 -40 -89
3447 -89 -29 30 64 98 66 34 66 97 -24 -146 3 153 106 59 34 9 94 178 27 -124 -35 54 91 128 100 71 30 -10 58 126 115 104
$$ packed form
3507h8J07J08q0p8q0p9M9M8M9M7L1L1j9j8j41J20k5k7k7k6o5J96m0m2k4k5K9L0L0K8K0J9p2
3499a4p3j63J00J65J66k17M3N0M9pqqqj5j6j6j6j01j02N1N1M4M3M3M3k3k3j32j33PPP2P2n3
3490a22n4J00R8p4p5j0j0K5K4R0Q9l4l5j7j8q2J79j19j20Q2Q2k7k7M1M0k4k3p5p5J05J05M8
3483H7k13M2M3m3m3K3K3k0j9k0j9J23J22p3p3NMK76J6k83k2J1J1l9m0P0O9J7J8J7J7J9J8r0
3474C4r0o1o1p2J90O4j97L2L2OOP1P1n2n3J3J2PQPPk6k6M0L9m0m2m1m2R7R6n6n6J8J8r1r2
3465b30J6J5J6J5M5M4M5M4j02j03POR0Q9o4o3N9N9oplkj13j12J20J20l3l3P9P7p4p4k6k7k7
3457a53k7j8j9M7M7P2P1P1P2o6o6M4M4j0j0p5p5KKO6O7n1m9n0n1RQRRQ5Q7k3k3rj0rj0m8m9
3447h9O0N9L4L4l2l2L2L1j21j22J49J50m7m7k5k5Q5Q4j51j51Q9Q9L7L7k8k9m1m0O8O8j1j1
$$ plain form
3439 104 28 -48 -53 -58 1 61 -1 -63 -17 29 28 27 -186 -137 -45 46 1 -42 -130 -219 -197 -176 -64 48 8 -31 -57 -82 -107 -133 -76 -19 -28 -37 -8 20
3431 20 49 78 60 43 25 8 -63 -135 -11 113 -10 -134 -149 -164 -165 -167 -168 -169 -147 -125 60 -16 -131 14 -2 -19 -61 -103 -36 30 -32 -95 54
3422 54 -57 -81 -106 -82 -57 -85 -113 -32 49 87 124 96 69 -31 -132 -79 -27 -68 -110 -87 -63 -78 -93 -108 -124 -129 -135 72 17 -23 -63 -54 -46 -66 -86
3414 -86 -106 -126 -132 -138 -79 -20 2 24 30 36 170 42 62 82 -10 -102 -129 -156 -103 -50 -63 -76 -138 -200 -256 -51 -20 10 -7 -26 -2 21 45 69 122 175
3405 175 163 150 72 -5 -83 -161 -67 26 71 115 -89 -32 25 -49 -92 -5 64 135 145 154 54 -45 -46 -47 -203 -97 -39 -113 -96 -79 -51 -23 21 65
3397 65 -149 -102 -206 -46 133 183 22 123 114 104 111 119 94 69 -36 118 106 93 97 101 46 -9 -64 -120 -141 -162 -282 -139 14 -93 -185 -14
3389 -14 -16 -17 87 60 -205 -210 -173 -137 -84 -31 -117 58 38 149 211 142 120 97 67 36 16 -3 25 54 165 13 -63 -10 15 41 -5 -53 -37 -283
3381 -283 -348 -152 45 -19 -73 -127 -99 -71 -43 -15 -25 -35 44 -5 -179 -91 98 25 14 3 -90 -183 -134 -85 -36 12 -7 -27 -47 -67 -96 -124 -207
$$ packed form
3439A04p6p6nnN9O0o2o2M6M6jjk13M9R2R1m5m3q8q9K2K1J12J12m0l9k6k5k5k6N7N7rrK9K8
3431B0K9K9j8j7j8j7p1p2J24J24j23j24j5j5jkjjK2K2J85p6j15J45j6j7m2m2O7O6o2o3J49
3422E4j11k4k5K4K5k8k8Q1Q1L8L7k8k7j00j01N3N2m1m2K3K4j5j5j5j6noK07n5m0m0RQk0k0
3414h6k0k0ooN9N9K2K2OOJ34j28K0K0r2r2k7k7N3N3j3j3o2o2n6K05L1L0j7j9K4K3K4K4N3N3
3405A75j2j3p8p7p8p8R4R3M5M4k04N7N7p4m3Q7O9P1J0Rj00r9jjj56J06N8p4J7J7K8K8M4M4
3397F5k14M7j04J60J79N0j61J01rj0PQk5k5j05J54j2j3MMn5n5n5n6k1k1j20J43J53j07r2J71
3389a4kjJ04k7k65nL7L6N3N3q6J75k0J11O2o9k2k3l0l1k0j9K8K9J11j52p6N3K5K6m6m8J6k46
3381b83o5J96J97o4n4n4K8K8K8K8j0j0P9m9j74Q8J89p3j1j1r3r3M9M9M9M8j9k0k0k0k9k8q3
$$ plain form
3373 -207 -27 49 -135 57 -12 18 49 64 78 74 69 65 60 49 38 27 15 11 7 -89 -186 -197 54 4 -44 -80 -116 0 116 94 71 -16 -104 -97 -91 -134
3364 -134 -177 -279 -120 -108 -96 -64 -32 0 31 0 -33 -65 -97 -15 65 -5 -77 -78 -80 -82 -83 -105 -127 -149 -171 -133 -94 -122 -149 -60 28 -51 -131 -11 -152
3355 -152 -147 -141 -133 -126 -53 19 23 26 30 33 14 -3 -22 -41 -104 -168 -123 -77 -59 -42 -24 -6 -18 -30 6 43 162 18 23 27 -33 -95 56 -53 -57 -61 -81 -102 -122
3346 -122 -142 -163 -183 -151 -119 -5 -154 -32 89 26 -37 36 -152 -193 -234 -185 -136 59 -5 -74 -143 -32 79 49 20 56 93 22 -48 -9 29
3338 29 -59 -147 -170 -193 -199 -206 -66 -187 -141 -94 -64 -34 -27 -21 -14 -7 24 55 -22 -100 -37 25 22 19 -71 -163 -14 134 96 57 18 -19 -108 -197 -134 -70 43
3329 43 157 74 -8 -9 -10 -175 -77 29 -124 -115 -106 -109 -112 -115 -118 -110 -102 -29 43 79 116 86 57 43 30 -48 -127 -130 -133 -26 80 10 -58 -18 21 -58 -139 -153
3320 -153 -168 -142 -115 -40 34 189 82 -134 -89 -133 -176 -111 -45 95 -26 -148 -7 -85 -163 -11 140 -64 -7 -97 -187 -118 -49 -127 56
3313 56 78 101 75 48 -13 -75 -55 -35 -127 42 0 -42 -103 -164 -99 -33 -123 49 75 100 5 -88 -118 -147 -115 -82 -50 -18 -27 -36 -45 -54 -51 -48 -127 56 -8
$$ packed form
3373b07J80P6j84J92o9L0L1J5J4mnmnj1j1j1j2mmr6r7j1K51n0m8l6l6J16J16k2k3q7q8POm3
3364a34m3j02J59J2J2L2L2L2L1l1l3l2l2Q2Q0p0p2jkkjk2k2k2k2L8L9k8k7Q9Q8p9q0J20j41
3355a52NOQPP3P2MLMLj9j7j9j9o3o4M5M6J8J7J8J8j2j2L6L7J19j44NMo0o2J51j09mmk0k1k0
3346a22k0k1k0L2L2J14j49J22J21o3o3P3j88m1m1M9M9J95o4o9o9J11J11l0k9L6L7p1p0L9L8
3338B9q8q8k3k3opJ40j21M6M7L0L0POPPL1L1p7p8O3O2llr0r2J49J48l8l9l9l7q9q9O3O4J13
3329D3J14q3q2jjj65R8J06j53RRllllQQP3P2L6L7l0k9j4j3p8p9llJ07J06p0o8M0L9p9q1j4
3320a53j5K6K7P5P4J55j07k16M5m4m3O5O6J40j21j22J41p8p8J52J51k04N7r0r0O9O9p8J83
3313E6K2K3k6k7o1o2K0K0r2J69m2m2o1o1O5O6r0J72K6K5r5r3l0k9L2L3L2L2rrrrLLp9J83o4
$$ plain form
3304 -8 -74 -122 -171 -124 -77 -96 -115 -111 -108 -88 -68 -241 -151 -220 -27 138 42 61 79 -67 48 16 -15 -66 -116 -58 0 -41 -84 -126 -169 -50 68
3296 68 61 54 152 -11 -175 -77 -67 -58 -32 -6 -35 -64 -93 -122 -105 -88 -72 -55 -82 -110 -71 -33 7 49 -18 -86 -19 47 -38 -123 -65 -7 49 107 21 -65
3287 -65 -86 -108 -111 -115 -119 -123 -84 -45 31 -154 -80 -6 -58 -110 -105 -99 -28 42 -28 -99 -61 -23 -26 -29 -32 -35 -52 -69 -86 -102 -111 -120 -19 80 72 63 -54 -172 -167 -162 -157 -152
3276 -152 -133 -113 -93 -74 -54 -35 -15 4 13 22 32 41 30 19 90 161 8 117 79 41 49 58 50 42 153 2 -109 -222 -169 -116 -64 -11 -41 -71 -100
3268 -100 -130 -123 -116 -109 -102 -111 -120 -63 -6 -44 -81 -9 62 30 -1 31 65 36 7 43 79 19 -40 -35 -29 -2 24 52 79 44 9 -25 -59 21 102 74 46 11 -23
3258 -23 -74 -125 53 -29 -73 -118 -111 -104 -15 -189 -93 1 -1 -3 129 1 20 39 74 110 63 17 92 -93 -132 -171 -120 -69 -18 32 54 75 -55 -187
3250 -187 -93 0 -102 -205 -118 -31 -9 11 31 51 71 92 -7 -107 -97 -88 -8 70 144 -44 -80 -116 87 29 6 -15 11 37 19 1 -82 -166 -86
3242 -86 -6 8 22 -54 -132 -73 -14 175 102 -2 -107 -213 -56 34 -137 -83 -29 -8 12 112 -49 -146 18 -68 -155 -133 -111 33 -84 -163
$$ packed form
3304ho6m8m9M7M7j9j9MLK0K0j73R0o9J93J65r6J9J8j46J15l2l1n1n0N8N8m1m3m2m3J19J18
3296F8ppR8j63j64R8J0RK6K6k9k9k9k9J7J7J6J7k7k8L9L8M0M2o7o8O7O6q5q5N8N8N6N8q6q6
3287f5k1k2lmmmL9L9P6j85P4P4n2n2NOP1P0p0p1L8L8llllj7j7j7j6rrJ01R9qrj17j18NNNN
3276a52J9K0K0J9K0J9K0J9RRJ0Rj1j1P1P1j53J09l8l8QRqqJ11j51j11j13N3N3N2N3l0l0k9
3268a00l0PPPPrrN7N7l8l7P2P1l2l1L2L4k9k9L6L6o0n9NOK7K6K8K7l5l5l4l4Q0Q1k8k8l5l4
3258b3n1n1J78q2m4m5PPQ9j74R6R4kkJ32j28J9J9L5L6m7m6P5j85l9l9N1N1N1N0K2K1j30j32
3250a87R4R3j02j03Q7Q7K2K0K0K0K0K1r9j00J0RQ0P8P4j88l6l6K03n8k3k1K6K6j8j8q3q4Q0
3242h6Q0J4J4p6p8N9N9J89p3j04j05j06J57R0j71N4N4K1K0J00j61r7J64q6q7K2K2J44j17p9
$$ plain form
3235 -163 -243 -130 -17 -56 -96 -111 -126 -158 -189 -37 -148 101 89 28 -31 22 -185 -4 -86 -145 -204 -129 -53 -43 -33 -48 -62 -77 -92 -70 -49
3227 -49 -27 -5 5 17 29 41 -60 -163 -156 -149 -145 -141 -137 -133 -140 -148 57 0 -32 -66 -50 -34 -67 -100 -68 -36 -52 -69 -86 -102 -79 -56 -33 -10 -54 -98 -142 -186
3218 -186 -45 95 23 -49 35 -141 -78 -15 151 56 0 -57 -25 6 -26 -60 -35 -10 14 39 21 2 -81 -165 -135 -105 -75 -45 -10 24 60 95 -7
3210 -7 -110 -60 -11 -58 -105 -87 -68 31 131 -24 81 50 19 5 -9 10 30 -96 38 -15 -69 -41 -12 -93 -173 -74 25 92 -102 -188 -12 -53
3202 -53 -95 -54 -14 12 38 65 92 106 120 134 148 -1 -150 -191 -232 -143 -54 -31 -7 -39 -70 -52 -34 144 61 -130 -60 8 78 28 -21 -210 -137
3194 -137 -14 107 -11 -130 -124 -118 -246 -113 -127 -141 -69 2 8 15 59 104 39 -24 -6 12 31 50 73 97 -108 -52 -239 11 31 52 83 114
3186 114 156 -63 -179 -33 -52 -70 53 177 60 -56 22 100 -33 93 -29 -153 -151 -149 -146 -142 -139 -135 -183 -230 -228 35 0 -34 29 92 -64 40
3178 40 79 -143 -128 -113 -164 -214 -284 -92 -113 -133 -125 -117 -207 -36 88 -48 -169 -28 56 141 90 39 -143 -325 -206 -88 -192 -35 -24 -14
$$ packed form
3235a63q0J13J13l9m0j5j5l2l1J52j11K49j2o1n9N3k07J81q2n9n9P5P6J0J0j5j4j5j5K2K1
3227d9K2K2J0J2J2J2j01j03PPMMMMpqK05n7l2l4J6J6l3l3L2L2j6j7j7j6K3K3K3K3m4m4m4m4
3218a86J41J40p2p2Q4j76O3O3J66r5n6n7L2L1l2l4K5K5K4K5j8j9q3q4L0L0L0L0L5L4L6L5j02
3210gj03N0M9m7m7J8J9R9J00j55J05l1l1j4j4J9K0j26J34n3n4K8K9q1q0R9R9O7j94q6J76m1
3202e3m2M1M0K6K6K7K7J4J4J4J4j49j49m1m1Q9Q9K3K4l2l1J8J8J78q3j91P0O8P0n0m9j89P3
3194a37J23J21j18j19OOj28J33j4j4P2P1OPM4M5o5o3J8J8J9J9K3K4k05N6j87K50K0K1L1L1
3186A14M2k19j16J46j9j8J23J24j17j16P8P8j33J26j22j24KKLMLMm8m7KK63l5l4O3O3j56J04
3178D0L9k22J5J5n1n0p0J92k1k0QQr0J71J24j36j21J41Q4Q5n1n1j82j82J19J18j04J57J1J0
$$ plain form
3171 -14 26 68 43 19 -84 -188 -182 -176 -117 -58 0 58 37 15 59 103 65 28 -74 84 -59 59 -2 -64 -212 -98 -50 -1 -132 0 131
3163 131 0 52 103 28 -45 -18 7 50 93 -96 -24 9 42 38 33 29 24 -32 -89 -184 -17 -34 -50 -49 -49 20 90 50 11 -53 -119 -75 -31 -41 -52 46
3154 46 144 131 117 30 -56 30 -14 -181 88 154 -41 19 -182 -130 -79 -44 -10 38 86 269 320 431 1504 3209 2727 1255 745 306
3148 306 129 -2 -135 -98 -62 -29 2 35 67 -15 -99 -29 39 26 14 1 -10 0 12 89 167 139 111 -25 -163 -85 -8 -84 -159 -142 -125 -42
3140 -42 40 56 72 38 5 -34 187 409 369 359 349 257 165 281 396 577 758 647 535 423 311 425 538 411 284 173 62
3133 62 104 145 74 2 -11 -156 39 -25 -44 -63 78 -216 -273 -331 -152 -104 47 -63 -37 -143 -81 -20 9 39 69 99 253 408 278 148
3126 148 69 -8 229 205 505 368 203 39 144 -11 -36 -61 90 -19 17 55 -43 -142 -132 -122 -71 -20 8 -224 -73 -183 82 -88
3119 -88 -42 3 -42 -89 -56 -24 29 -178 -6 -96 25 -113 -140 -167 30 -34 82 -63 53 -92 146 123 137 -109 -136 -162 -221 -280 -30
$$ packed form
3171a4M0M2k5k4j03j04OON9N9N8N8k1k2M4M4l8l7j02J58j43J18o1o2j48J14M8M9j31J32J31
3163A31j31N2N1p5p3K7K5M3M3j89P2L3L3mnmnn6n7r5J67j7j6J%O9P0m0l9o4o6M4M4j0j1R8
3154D6R8j3j4q7q6Q6m4j67K69O6j95O0k01N2N1L5L4M8M8J83N1J11J073J705m82j472n10m39
3148C06j77j31j33L7L6L3L1L3L2q2q4P0O8j3j2j3j1J0J2P7P8k8k8j36j38P8P7p6p5J7J7Q3
3140d2Q2J6J6l4l3l9K21K22m0j0j0r2r2J16J15J81J81j11j12j12j12J14J13j27j27j11j11
3133F2M2M1p1p2j3j45J95o4j9j9J41k94n7n8J79M8J51j10K6j06O2O1K9L0L0L0J54J55j30j30
3126A48p9p7K37k4L00j37j65j64J05j55k5k5J51j09L6L8r8r9J0J0N1N1K8k32J51j10K65j70
3119h8M6M5m5m7L3L2N3k07J72r0J21j38k7k7J97o4J16j45J16j45K38k3J4k46k7k6n9n9K50
$$ plain form
3112 -30 -43 42 -134 -56 20 103 -75 56 -73 74 -39 -80 -122 -87 -52 108 7 91 -85 -73 -61 81 -37 -79 -121 76 12 1 -9
3105 -9 -36 -64 -93 -122 -4 -148 -135 -122 21 -96 -73 -51 -7 -225 -217 -208 -167 -126 23 -89 -70 -52 19 -171 -105 -38 -49 -60 37 -125 -276 10
3097 10 215 -16 -23 -30 0 31 58 86 47 9 -37 -84 16 -145 -163 -181 -216 -250 -167 -84 -1 81 115 149 73 -1 -91 -180 -116 -52 -35 -17 65 148
3089 148 62 -22 1 25 49 73 31 -10 -21 -33 36 107 -43 67 47 27 -112 10 1 -7 -115 38 6 237 196 155 -16 74 39 3 94 184
3081 184 149 115 -66 13 13 12 -20 -53 -97 120 38 -43 -68 -93 -255 20 46 71 -313 -85 -162 22 -54 -131 -95 -58 -251 -7 -40 189 14
3073 14 101 -26 108 2 333 -36 29 -46 140 18 334 93 289 230 609 452 907 583 695 392 526 117 319 85 462
3067 462 267 508 226 380 62 356 223 528 399 708 317 713 403 530 155 566 382 636 299 749 343 723 328
3062 328 719 386 1015 858 1312 956 1387 965 1156 712 1055 524 954 428 1039 698 1145 702 1396 920 1406 791 1312
$$ packed form
3112c0j3Q5j76P8P6Q3j78J31j29J47j13m1m2L5L5J60j01Q4j76J2J2J42j18m2m2J97o4j1j0
3105ik7k8k9k9J18j44J3J3J43j17K3K2M4k18QRM1M1J49j12J9J8P1j90O6O7j1j1R7j62j51K86
3097A0K05k31ppL0L1K7K8l9l8m6m7J00j61j8j8l5l4Q3Q3Q3Q2L4L4p6p4r0q9O4O4J7J8Q2Q3
3089A48q6q4K3K4K4K4m2m1j1j2O9P1j50J10k0k0j39J22rqj08J53l2K31m1m1j71R0l5l6R1R0
3081A84l5l4j81P9%jl2l3m4K17q2q1k5k5j62K75K6K5l84K28p7J84p6p7L6L7j93K44l3K29j75
3073A4Q7j27J34j06L31l69O5p5J86j22L16k41J96n9L79j57M55l24J12l03J34m09K02k34L77
3067D62j95K41k82J54l18K94j33L05j29L09l91L96l10J27l75M11j84K54l37M50m06L80l95
3062C28L91l33O29j57M54l56M31m22J91m44L43n31M30n26O11l41M47m43O94m76M86o15N21
$$ plain form
3056 1312 861 1372 772 1483 948 1550 913 1413 820 1713 1103 1631 956 1942 1447 2264 1125 1996 1670 2831 2231 3293
3051 3293 2167 3052 2537 4383 3321 4619 3852 5795 4924 6938 6166 9153 8567 12439 12301 18720 20759 33377 43886
3046 43886 84731 172907 455778 610725 342798 166415 91008 54681 34351 24576 15761 12291 8208 7391
3042 7391 5437 5340 3758 3910 2751 2990 2268 2438 2171 2789 2096 1866 1025 1189 916 1528 1353 1364 763 989 778 1110 831
3037 831 778 595 651 446 471 366 449 269 344 157 166 175 207 239 270 302 298 295 291 287 282 276 178 80 58 298 238 178 210 243 144 308 122 198 279
3028 279 361 146 368 213 320 162 267 93 181 163 144 -4 458 381 304 145 424 318 474 329 622 580 538 376 476 380
3022 380 284 166 310 273 236 -13 172 46 182 -129 170 144 381 -3 47 -37 140 0 123 60 260 66 134 -65 345 363
3016 363 643 440 499 208 354 85 253 83 175 -42 178 4 268 17 28 -4 225 -7 195 33 308 240 171 -98 68
$$ packed form
3056A312m51N11o00P11n35O02o37N00n93Q93o10N28o75R86m95Q17j139Q71l26J161o00J062
3051C293j126Q85n15J846j062J298p67J943q71K014p72K987n86L872j38O419K039J2618J0509
3046D3886M0845Q8176K82871J54947k67927j76383p5407l6327k0330r775q815l470m083q17
3042G391j954r7j582J52j159K39p22J70k67O18o93k30q41J64k73O12j75J1o01K26k11L32k79
3037H31n3j83N6k05K5j05Q3j80P5j87RRL2L2L1L2mlmmnor8r8k2K40o0o0L2L3r9J64j86P6Q1
3028B79Q2k15K22j55J07j58J05j74Q8j8j9j48M62p7p7j59K79j06J56j45K93m2m2j62J00r6
3022C80r6j18J44l7l7k49J85j26J36l11K99k6K37l84N0q4J77j40J23o3K00j94O8j99M10J8
3016C63K80k03N9k91J46k69J68j70R2k17K20j74K64k51J1l2K29k32K02j62K75o8o9k69J66
$$ plain form
3009 68 13 221 -18 178 -84 89 -74 23 -177 57 -198 157 44 193 -160 97 -12 140 52 227 105 246 -28 134 -81
3003 -81 139 -44 34 -113 176 120 65 -202 141 222 304 69 96 -187 -34 -50 195 -105 31 -102 26 -31 173 81 250 103 218
2997 218 -90 37 105 173 14 118 -56 30 -90 51 -167 51 -21 168 253 339 272 468 538 870 1332 2056 2354 2390 1690 1251
2990 1251 873 757 621 485 234 245 185 388 366 345 225 368 363 358 313 268 306 343 331 581 619 656 1041 1425 1662 2162 2615 3068
2984 3068 3520 3973 3829 3422 2922 2422 2115 1807 1407 1007 655 565 524 484 478 473 665 856 890 924 909 894 654 675 746 817 827 837
2977 837 847 857 701 544 387 231 177 124 180 236 198 160 -90 -79 71 222 237 252 353 454 489 524 631 737 991 982 900 818 828
2970 828 839 995 1150 1235 1057 906 754 586 418 371 325 278 232 300 368 305 242 238 233 343 454 531 346 309 271 259 246 233 221 224 228 363
2962 363 235 300 102 184 2 179 356 445 272 282 292 433 311 321 331 570 372 340 308 527 485 357 229 364 237 190 143
$$ packed form
3009F8n5K08k39J96k62J73j63R7k00K34k55L55j13J49l53K57j09J52q8J75j22J41k74J62k15
3003h1K20j83P8j47K89n6n5k67L43Q1Q2k35K7k83J53j6K45l00J36j33J28n7K04r2J69j47J15
2997B18l08J27O8O8j59J04j74Q6j20J41k18K18p2J89Q5Q6o7J96P0L32M62P24K98L6p00m39
2990A251l78j16j36j36k51J1o0K03k2k1j20J43nnm5m5L8L7j2K50L8L7L85L84K37N00M53M53
2984C068M52M53j44m07n00n00l07l08m00m00l52r0m1m0onJ92J91L4L4j5j5k40K1P1P1J0J0
2977H37J0J0j56j57j57j56n4n3N6N6l8l8k50J1J50J51J5J5J01J01L5L5J07J06K54rq2q2J0
2970H28J1J56J55Q5j78j51j52j68j68m7m6m7m6O8O8o3o3mnJ10J11P7j85l7l8j2j3j3j2LMJ35
2962C63j28O5j98Q2j82J77J77Q9j73J0J0J41j22J0J0K39j98l2l2K19m2j28j28J35j27m7m7
$$ plain form
2955 143 212 280 245 211 177 142 156 169 264 97 16 -64 188 178 346 251 550 586 734 618 848 814 775 735 651 568 964 923 893 862 839
2948 839 553 677 539 659 517 719 659 706 753 932 848 826 803 764 726 826 927 809 691 801 911 1103 1033 975 918 1122 1064
2941 1064 1104 1143 1346 1549 2201 3639 4383 2592 1773 1392 1253 1115 1287 1327 1712 1834 1981 1997 2098 1761 1751 1741 1835 1666 1593
2935 1593 1258 1404 1287 1539 1528 1763 1998 2359 2457 2988 3780 6027 10285 16073 18801 15962 10412 6720 5038 4441 4456
2930 4456 5037 5749 6001 5292 4657 4153 3773 3262 3139 3017 3006 2995 3107 3219 3384 3418 3851 4546 6100 7522 8094 7355 6501
2924 6501 6085 6728 8683 13867 22985 30158 29025 21034 13305 8997 6874 5767 5098 4814 4660 4671 4682 4876 4808 4649 4928
2919 4928 5165 5272 5368 5726 5928 6131 6669 7208 7948 8689 9364 9777 9933 9826 9977 10390 11272 12592 14534 17263 21052 27202
2914 27202 40247 70864 130267 187133 201233 170309 111747 67786 46113 34843 29124 26815 25624 25045 24695
$$ packed form
2955A43O9O8l5l4l4l5J4J3R5j67q1q0K52j0J68r5K99L6J48j16K30l4l9m0q4q3L96m1l0l1k3
2948H39k86J24j38J20j42K02o0M7M7J79q4k2k3l9l8J00J01j18j18J10J10J92p0n8n7K04n8
2941A064M0L9K03K03O52J438P44j791q19l81j39j38J72M0L85J22J47J6J01l37j0j0R4j69p3
2935A593l35J46j17K52j1K35K35L61R8N31P92K247M258N788K728k839n550l692j682n97J5
2930D456N81P12K52p09o35n04l80n11j23j22j1j1J12J12J65L4M33O95J554J422N72p39q54
2924F501m16O43J955N184R118P173j133p991p729m308k123j107o69k84j54J1J1J94o8j59K79
2919D928K37J07R6L58K02K03N38N39P40P41O75M13J56j07J51M13Q82J320J942K729L789O150
2914B7202J3045L0617N9403N6866J4100l0924n8562m3961k1673j1270n719k309j191n79l50
$$ plain form
2910 24695 25482 26542 28913 32203 36629 41214 47111 54746 68238 91336 130783 186763 251399 304752 330565 324425
2906 324425 306658 305900 358034 498249 742062 985889 1049533 824424 524566 323543 202688 138943 99939
2903 99939 77894 61706 51299 43952 40828 38142 36936 35730 35469 33896 33678 33460 34531 36390 40308 46762 60365
2899 60365 88569 147863 242914 329239 357251 320231 246229 195339 197516 234882 239288 195354 160949 154149
2895 154149 135721 97274 66259 47548 36269 30864 29917 30981 31433 31053 29187 25387 20974 17966 16794 17611 19739
2891 19739 23269 28110 35869 48436 68538 91875 104415 99382 86103 76058 74887 84994 101456 110836 106633
2887 106633 89228 69907 59766 55782 51799 45400 36816 27440 19375 14195 11551 10169 9050 7832 6614 5718
2883 5718 4822 4451 4080 3840 3600 3178 2757 2554 2351 2251 2151 1985 1820 1702 1584 1696 1545 1491 1700 1605 1641 1708 1774 1630 1486
$$ packed form
2910B4695P87J060K371L290M426M585N897P635J3492K3098L9447N5980O4636N3353K5813o140
2906C24425j7767p58N2134J40215K43813K43827O3644k25109k99858k01023j20855o3745l9004
2903I9939k2045j6188j0407p347l124k686j206j206k61j573k18k18J071J859L918O454J3603
2899F0365K8204N9294R5051Q6325K8012l7020p4002n0890K177L7366M406m3934l4405o800
2895A54149j8428l8447l1015j8711j1279n405r47J064M52l80j866l800m413l008j172Q17K128
2891A9739L530M841P759J2567K0102K3337J2540n033j3279j0045j171J0107J6462R380m203
2887A06633j7405j9321j0141l984l983o399q584r376q065n180k644j382j119j218j218q96
2883E718q96l71l71k40k40m22m21k03k03j00j00j66j65j18j18J12j51n4K09r5L6O7O6j44j44
$$ plain form
2877 1486 1440 1395 1349 1303 1304 1305 1453 1339 1457 1574 1703 1831 1769 2143 2026 1646 1482 1318 1355 1393 1312 1231 1100 970 770 832 877 923
2871 923 960 998 953 909 984 796 609 684 771 859 831 804 713 622 514 669 661 654 515 638 651 664 628 591 690 789 669 549 510 471 564 656
2863 656 664 673 616 560 600 640 680 721 688 656 624 592 560 529 629 728 671 614 622 630 622 614 737 860 1000 1141 1140 876 639 663 655 647 661 675 689 703
2854 703 655 607 558 510 590 671 751 831 808 784 876 967 1067 905 1021 1137 1179 1220 1393 1566 1602 1638 1456 1273 1184 1095 1224 1353 1400 1447
2847 1447 1276 1104 990 876 893 910 873 835 797 760 712 664 615 567 388 209 245 413 512 349 342 335 372 408 445 481 507 532 689 846
2839 846 861 875 759 642 628 614 600 586 597 608 487 366 394 421 317 213 260 308 143 239 332 425 534 643 588 533 479 424 442 461
2832 461 537 613 720 697 878 1321 2149 2539 2429 2057 1580 1234 956 940 1172 1403 1774 2014 2153 2031 1911 1661 1629 1727 1848
2826 1848 1969 2031 1656 1243 961 784 739 693 647 636 625 840 1056 1331 1738 2186 2197 1684 1170 845 651 657 401 432 463 366 269
$$ packed form
2877A486m6m5m6m6JJJ48j14J18J17J29J28o2L74j17l80j64j64L7L8q1q1j31j30k00O2M5M6
2871I23L7L8m5m4P5j88j87P5Q7Q8k8k7r1r1j08J55qpj39J23J3J3l6l7R9R9j20j20l9l9R3R2
2863F56QRn7n6M0M0M0M1l3l2l2l2l2l1J00R9n7n7QQqqJ23J23J40J41jk64k37K4qqJ4J4J4J4
2854G03m8m8m9m8Q0Q1Q0Q0k3k4R2R1J00j62J16J16M2M1J73J73L6L6j82j83q9q9J29J29M7M7
2847A447j71j72j14j14J7J7l7l8l8l7m8m8m9m8j79j79L6J68R9j63ppL7L6L7L6K6K5J57J57
2839H46J5J4j16j17j4j4j4j4J1J1j21j21K8K7j04j04M7M8j65R6R3R3J09J09n5n5n4n5J8J9
2832D61P6P6J07k3J81M43Q28L90j10l72m77l46k78j6K32K31L71K40J39j22j20k50l2R8J21
2826A848J21O2l75m13k82j77m5m6m6j1j1K15K16K75M07M48J1n13n14l25j94Ok56L1L1r7r7
$$ plain form
2819 269 303 336 496 655 797 940 1102 1002 918 834 804 775 1024 1273 1476 1242 961 812 668 524 519 514 506 499 491 484 454 425 510 596 650
2812 650 441 446 451 480 509 670 830 1025 1220 1256 1030 829 628 804 980 1156 1332 1202 1072 819 566 531 497 429 360 423 485 495
2805 495 505 449 393 427 462 365 268 210 151 150 149 233 187 67 209 253 297 156 14 -61 124 220 185 291 134 -38 51 50 -81 -122 -164 -95
2797 -95 -26 -96 94 49 134 244 223 127 163 248 333 269 205 207 209 97 -13 6 25 -17 -60 27 115 74 32 56 80 71 62 119 175 143 111 79 47
2788 47 125 202 214 226 93 -39 63 165 21 140 46 -48 58 164 -7 82 106 130 106 81 203 326 317 308 234 160 151 142 200 257 314 372
2781 372 430 489 416 344 318 292 126 223 124 155 129 103 132 161 198 235 138 173 -41 6 259 75 153 232 245 259 273 287 287 287 369 189 187 186
2772 186 299 413 455 498 409 320 418 517 681 845 816 787 758 730 693 656 685 713 707 700 546 392 445 235 377 388 296 204 235 266 128
2765 128 -8 73 154 106 59 -87 29 195 100 29 89 122 154 129 105 51 -2 9 22 91 161 100 38 88 137 186 235 178 122 -35 -62 219
$$ packed form
2819B69L4L3J60J59J42J43J62j00q4q4l0k9K49K49K03k34k81j49j44j44nnqpqpl0k9Q5Q6N4
2812F50k09NNK9K9J61J60J95J95L6k26k01k01J76J76J76J76j30j30k53k53l5l4o8o9O3O2J0
2805D95J0n6n6L4L5r7r7n8n9jjQ4m6j20J42M4M4j41j42p5J85R6l5J06j57j72Q9jj31m1m2O9
2797i5O9p0J90m5Q5J10k1r6L6Q5Q5o4o4KKj12j10J9J9m2m3Q7Q8m1m2K4K4rrN7N6l2l2l2l2
2788D7P8P7J2J2j33j32J02J02j44J19r4r4J06J06j71Q9K4K4k4k5J22J23rrp4p4rrN8N7N7N8
2781C72N8N9p3p2k6k6j66R7r9L1k6k6K9K9L7L7r7L5k14M7K53j84P8P9J3J4J4J4%%Q2j80kj
2772A86J13J14M2M3q9q9R8R9J64J64k9k9k9k8l7l7K9K8opj54j54N3k10J42J1r2r2L1L1j38
2765A28j36Q1Q1m8m7j46J16J66r5p1O0L3L2k5k4n4n3J1J3O9P0o1o2N0M9M9M9n7n6j57k7K81
$$ plain form
2757 219 64 15 228 271 314 226 400 361 322 605 888 933 978 821 664 599 797 774 881 821 761 742 460 345 492 328 427 354
2750 354 281 77 135 123 110 113 117 137 157 161 165 321 216 126 37 25 12 131 250 186 121 205 26 87 148 62 -23 18 61 119 178 6 96
2742 96 39 -18 -8 0 10 19 81 142 122 101 137 -89 -37 14 3 -7 -18 -29 -47 -65 47 160 112 64 82 99 88 77 132 186 165 143 187 231 122
2733 122 13 35 57 176 295 179 64 207 89 118 147 58 -30 98 228 106 -15 -5 3 18 33 196 97 24 -47 -4 37 26 15
2726 15 4 -6 15 36 58 80 15 -48 18 85 155 226 19 73 66 60 135 210 291 372 234 96 75 54 98 143 198 254 252 250 251 383 467 288 297 438
2717 438 496 293 434 443 609 512 368 485 439 393 315 236 289 342 443 544 579 614 572 531 621 710 755 800 844 889 901 914 926 939 1047
2710 1047 1155 1290 1426 1527 2065 2721 3246 3631 3754 3828 4033 4712 5653 6638 7753 8353 8166 7292 6682 6681 6942 7742 8410 8584
2704 8584 7797 6580 5626 4930 4496 4499 4502 4196 3889 3544 3199 2908 3054 3028 3133 3233 3594 3899 4204 4679 5417 6018 6882 7834
$$ packed form
2757B19j55m9K13M3M3q8J74l9l9K83K83M5M5j57j57o5J98k3J07o0o0j9k82j15J47j64R9p3
2750C54p3k04N8j2j3LMK0K0MMJ56j05r0q9j2j3J19J19o4o5Q4j79O1O1q6q5M1M3N8N9j72R0
2742I6n7n7J0QJ0RO2O1k0k1L6k26N2N1j1j0j1j1j8j8J12J13m8m8J8J7j1j1N5N4k1k2M4M4j09
2733A22j09K2K2J19J19j16j15J43j18K9K9q9q8J28J30j22j21J0QJ5J5J63r9p3p1M3M1j1j1
2726A5j1j0K1K1K2K2o5o3O6O7P0P1k07N4poP5P5Q1Q1j38j38k1k1M4M5N5N6kkJJ32Q4j79RJ41
2717D38N8k03J41RJ66r7j44J17m6m6p8p9N3N3J01J01L5L5m2m1R0Q9M5M5M4M5J2J3J2J3J08
2710A047J08J35J36J01N38O56N25L85J23P4K05O79R41R85J115O00j87q74o10jK61Q00O68J74
2704H584p87j217r54o96m34LLl06l07l45l45k91J46k6J05J00L61L05L05M75P38O01Q64R52
$$ plain form
2698 7834 9224 11269 14451 19616 27491 36787 44247 48041 49824 52601 61236 83090 111850 123552 115758 103210
2694 103210 89526 83393 98679 121140 121656 107409 91151 72730 58767 53863 50796 44537 36966 29636 22743
2691 22743 17042 13176 10731 8898 7626 6617 5749 5319 5042 5027 5001 5412 5724 5423 5041 4921 5178 5434 5708 5718 5780 5579
2685 5579 5815 6489 7643 8535 8433 8068 8009 8561 9201 10103 11350 13033 15416 19461 25894 36261 49590 60908 66429
2681 66429 68540 70870 80281 107758 150710 174942 166914 149275 129275 117449 134736 170868 179285 159781 136168
2677 136168 109075 86965 77935 73540 65324 54223 42641 31672 22702 16617 12816 10502 8590 7115 5898 5117
2673 5117 4555 3993 3589 3186 2859 2531 2335 2139 2029 1919 1596 1535 1485 1435 1401 1368 1289 1210 1132 1053 1072 1091 979 867 881 896 764
2666 764 893 843 792 659 789 972 893 759 625 631 637 643 650 619 588 689 789 746 703 595 486 591 695 669 642 656 670 487 566 508
$$ packed form
2698G834J390K045L182N165P875R296P460L794J783K777Q635K1854K8760J1702p794j2548
2694A03210j3684o133J5286K2461N16j4247j6258j8421j3963m904l067o259p571p330o893
2691B2743n701l866k445j833j272j009q68m30k77j5k6M11L12l01l82j20K57K56K74J0O2k01
2685E579K36O74J154Q92j02l65n9N52O40R02J247J683K383M045O433J0367J3329J1318N521
2681F6429K111K330R411K7477M2952K4232q028j7639k0000j1826J7287L6132Q417j9504k3613
2677A36168k7093k2110r030m395q216j1101j1582j0969q970o085l801k314j912j475j217p81
2673E117n62n62m04m03l27l28j96j96j10j10l23o1n0n0l4l3p9p9p8p9J9J9j12j12J4J5j32
2666G64J29n0n1j33J30J83p9j34j34OOOPl1l1J01J00m3m3j08j09J05J04k6k7J4J4j83P9n8
$$ plain form
2659 508 711 653 594 599 604 608 613 610 607 603 600 565 529 494 459 481 503 377 514 443 371 464 556 358 421 403 385 352 320 287 255 368 482 595 709
2650 709 642 576 525 475 349 486 476 465 477 490 584 417 400 384 483 582 496 411 474 536 373 472 588 442 337 494 553 612 697 782 648
2643 648 515 566 617 668 719 754 789 709 629 542 717 746 774 724 674 755 836 833 830 920 1010 751 930 994 1058 1083 1107 1132 1157 1359 1560 1455
2635 1455 1350 1495 1640 1703 1767 1979 1928 2009 2353 2752 3151 3365 3578 4065 4814 5754 6957 8713 11955 17721 28470 46848
2630 46848 62165 55747 38575 25921 18075 13245 10426 8776 7913 7329 7007 6993 6978 7111 7681 8502 9062 9610 10945
2625 10945 12579 14826 17760 23056 31799 50246 87872 165626 221913 164636 95479 58582 37679 26304 19608
2621 19608 15446 13334 12009 11056 10540 10133 9464 9637 10071 10612 10891 12443 13995 16690 19646 25504 34421 54145 93540
2617 93540 172418 217812 155564 92005 57930 39329 29453 24910 23951 27276 35333 43827 42114 32621 24146 19080
$$ packed form
2659E08K03n8n9NNMNllmll5l6l5l5K2K2j26J37p1p2R3R2j98O3j8j8l3l2l3l2J13J14J13J14
2650G09o7o6n1n0j26J37j0j1J2J3R4j67j7j6R9R9q6q5O3O2j63R9J16j46j05J57N9N9Q5Q5j34
2643F48j33N1N1N1N1L5L5q0q0q7J75K9K8n0n0Q1Q1llR0R0k59J79O4O4K5K4K5K5K02K01j05
2635A455j05J45J45O3O4K12n1Q1L44L99L99K14K13M87P49R40J203J756L242N766J0749J8378
2630D6848J5317o418j7172j2654p846m830k819j650q63n84l22j4j5J33N70Q21N60N48J335
2625A0945J634K247K934N296Q743J8447L7626P7754N6287n7277o9157l6897k0903j1375o696
2621A9608m162k112j325r53n16m07o69J73M34N41K79J552J552K695K956N858Q917J9724L9395
2617I3540P8878M5394o2248o3559l4075j8601r876m543r59L325Q057Q494j713r493q475n066
$$ plain form
2613 19080 16179 13889 12474 12020 12244 13080 14599 17429 21549 28728 41339 58059 64889 54496 41098 31635 26073
2609 26073 24619 27078 35395 55219 98909 142797 115958 68213 42237 27074 19343 14289 11595 9798 8788
2605 8788 7811 7446 6906 6628 6366 6892 7092 7292 7793 8906 10259 12050 15479 21094 32444 55946 105862 148171 113284
2600 113284 64847 39227 24710 16924 12197 9454 7498 6596 5694 5486 5016 4466 4178 4136 4094 4013 4195 4738 5280 6148
2595 6148 7452 9626 13985 22050 34749 42508 34793 22746 14459 9504 6561 4764 3753 3163 2573 2081 1852 1600
2591 1600 1349 1095 1103 1029 955 942 929 850 772 647 522 506 490 601 711 669 626 600 574 548 522 491 460 429 398 383 368 337 306 459 350
2583 350 388 427 480 533 433 334 348 362 377 391 415 439 572 705 602 498 460 422 375 328 264 200 313 164 211 259 440 360 410 460 540
2576 540 357 432 506 474 441 409 377 330 283 302 321 437 553 472 391 317 243 261 280 466 391 353 316 271 226 329 170 242 315 306 297 268 239
$$ packed form
2613A9080k901k290j415m54K24Q36J519K830M120P179J2611J6720O830j0393j3398r463n562
2609B6073j454K459Q317J9824M3690M3888k6839m7745k5976j5163p731n054k694j797j010
2605H788r77l65n40k78k62N26K00K00N01J113J353J791L429N615J1350K3502M9916M2309l4887
2600A13284m8437k5620j4517p786m727k743j956r02r02k08m70n50k88m2m2q1J82N43N42Q68
2595F148J304K174M359Q065J2699P759p715j2047q287m955k943j797j011n90n90m92k29k52
2591A600k51k54Qp4p4j3j3p9p8j25j25j6j6J11J10m2m3k6k6k6k6l1l1l1l1j5j5l1l1J53j09
2583C50L8L9N3N3j00r9J4J4J5J4K4K4J33J33j03j04l8l8m7m7o4o4J13j49M7M8J81q0N0N0Q0
2576E40j83P5P4l2l3l2l2m7m7J9J9J16J16q1q1p4p4J8J9J86p5l8l7m5m5J03j59P2P3rrk9k9
$$ plain form
2568 239 46 115 343 308 285 261 276 290 304 319 319 320 304 289 417 283 215 147 290 171 249 327 341 93 58 23 35 48 258 467 402
2560 402 337 272 207 248 290 205 121 250 117 132 146 132 118 257 395 294 192 156 120 91 62 185 309 358 407 456 505 377 248 316
2553 316 384 340 295 234 173 196 -43 -130 44 145 247 255 263 160 56 133 209 401 331 310 552 973 1132 838 544 316 350 345 341 302
2546 302 264 225 187 223 259 230 201 167 134 210 286 219 153 152 151 251 351 621 890 1075 824 664 505 435 365 360 356 354 352 350 348 325 303 390 476
2537 476 323 169 98 26 -140 -45 54 155 241 328 480 632 556 480 256 295 257 220 248 538 783 1029 831 634 511 387 433 479
2530 479 222 227 194 161 129 96 277 196 246 296 509 723 689 392 309 225 276 326 410 755 953 889 590 290 110 192 126 60 52 44 101
2523 101 158 189 220 202 184 111 301 452 604 364 125 39 -46 102 251 335 419 420 422 315 207 194 181 102 23 14 5 -3 -12 -58 -105 -58 -11
2514 -11 237 224 249 274 234 195 156 116 109 101 202 304 137 -29 175 380 405 429 301 172 32 -107 -33 39 -111 0 45 90 -73
$$ packed form
2568B39j93O9K28l5k3k4J5J4J4J5%Jj6j5J28j34o8o8J43j19P8P8J4k48l5l5J2J3K10K09o5
2560D02o5o5o5M1M2q5q4J29j33J5J4j4j4J39J38j01j02l6l6k9k9J23J24M9M9M9M9j28j29O8
2553C16O8m4m5o1o1K3k39q7J74J01J02QQj03j04P7P6J92p0k1K42M21J59k94k94k28L4nml9
2546C02l8l9l8L6L6k9k9l4l3P6P6o7o6jjJ00J00K70K69J85k51j60j59p0p0nmkkkkk3k2Q7Q6
2537D76j53j54p1p2j66R5R9J01Q6Q7J52J52p6p6k24L9l8l7K8K90K45K46j98j97j23j24M6M6
2530D79k57Nl3l3l2l3J81q1N0N0K13K14l4k97q3q4N1N0Q4L45J98o4k99l00j80Q2o6o6qqN7
2523A01N7L1L1j8j8p3J90J51J52k40k39q6q5J48J49Q4Q4JKj07j08j3j3p9p9rrqrm6m7M7M7
2514a1K48j3K5K5m0l9l9m0pqJ01J02j67j66K04K05K5K4j28j29j40j39P4P2j50J11M5M5j63
$$ plain form
2507 -73 24 187 88 83 78 123 167 98 28 -24 -77 -87 165 308 190 108 26 -71 -169 3 175 108 40 44 48 52 56 -52 -161 -74 13 53 94 86 77
2499 77 -60 63 -107 -16 -88 -160 -107 -54 -90 -127 -55 17 62 108 153 199 136 74 159 -17 -12 -7 128 1 39 77 32 -11 31 74 52 29 64
2491 64 99 -18 -137 -62 11 -23 -57 -73 -89 58 -55 -134 48 67 86 104 122 74 26 55 83 111 140 83 27 -28 -85 -31 22 11 0 -39 -78
2483 -78 -117 -156 -38 78 43 7 21 34 65 95 19 205 31 119 199 279 222 166 116 66 16 -33 46 126 140 155 127 99 136 174 211 249 221
2475 221 193 153 113 139 165 161 157 87 17 18 19 130 240 268 297 347 659 1319 2240 3200 3198 2421 1643 1221 798 656 514 438 362 236 111
2467 111 138 166 270 374 368 363 359 355 351 347 459 571 841 1112 1575 2824 5435 8832 10408 8400 5386 3334 2191 1484 1062
2461 1062 902 925 686 536 518 570 622 865 1239 1883 2790 3243 2910 2218 1658 1346 1297 1386 1737 2536 4297 7492 10075 9839
2455 9839 6893 4036 2491 1706 1183 1096 1008 683 795 810 693 904 1246 2106 3928 6791 9041 8698 5994 3629 2400
$$ packed form
2507g3R7J63r9nnM5M4o9p0n2n3j0K52J43j18q2q2r7r8J72J72o7o8MMMMj08j09Q7Q7M0M1qr
2499G7j37J23j70R1p2p2N3N3l6l7P2P2M5M6M5M6o3o2Q5j76NNJ35j27L8L8m5m3M2M3k2k3L5
2491F4L5j17j19P5P3l4l4j6j6J47j13p9J82J9J9J8J8m8m8K9K8K8K9n7n6n5n7N4N3j1j1l9l9
2483g8l9l9J18J16l5l6J4J3L1L0p6J86j74Q8Q0Q0n7n6n0n0n0m9P9Q0J4J5k8k8L7L8L7L8k8
2475B21k8m0m0K6K6mmp0p0JJJ11J10K8K9N0L12O60R21R60kp77p78m22m23j42j42p6p6j26j25
2467A11K7K8J04J04onmmmmJ12J12K70K71M63J249K611L397J576k008l014k052j143p07m22
2461A062j60K3k39j50j8N2N2K43L74O44R07M53l33o92n60l12m9Q9L51P99J761L195K583k36
2455I839k946k857j545p85n23q7q8l25J12J5j17K11L42Q60J822K863K250l43k704k365j229
$$ plain form
2450 2400 1741 1344 1152 1092 1477 2299 3211 3511 2900 2027 1444 1123 815 507 500 493 580 667 697 858 1132 1668 2993 5455 8246
2444 8246 9201 7293 4423 2537 1613 1172 862 727 593 474 356 231 237 14 54 197 209 130 52 -25 158 260 362 458 553
2438 553 665 776 1497 2480 3064 2687 1844 1263 846 429 286 144 67 -9 20 49 79 109 115 121 127 134 96 59 -60 82 -19 -120 -52
2431 -52 14 16 19 -126 -9 -13 -16 -3 8 65 121 112 103 7 -88 -90 -93 82 -4 -90 85 7 -70 -66 -62 -67 -73 -144 -215 -77 61 46 31 68 106 34 -38 -43 -48
2421 -48 -91 127 126 126 141 157 30 -95 -24 45 71 96 203 48 -66 -182 -117 -52 -51 -49 165 118 34 -48 -39 -29 56 141 31 -79 26 133
2413 133 86 39 17 -4 39 83 175 267 163 59 49 39 29 19 67 116 246 115 125 135 129 123 206 289 219 149 169 189 144 99 97 95 94 92 149 206
2404 206 50 157 32 -91 -47 -2 86 174 66 -41 32 106 115 124 116 108 35 -38 -27 -16 -115 -213 -63 86 85 -45 -170 -32 105 111 -48
2397 -48 53 82 -20 -42 66 93 120 -1 -122 -91 -60 -12 34 82 130 -37 -205 -177 -148 -83 -19 45 110 -40 -191 -102 -12 18 50 82 114
$$ packed form
2450B400o59l97j92o0L85Q22R12L00o11q73n83l21l08l08ppQ7Q7L0J61K74N36J325K462K791
2444H246R55j908k870j886r24m41l10j35j34j19j18j25Ok23M0J43J2p9p8p7J83J02J02R6R5
2438E53J12J11P21R83N84l77q43n81m17m17j43j42p7p6K9K9L0L0OOOPl8l7j19J42j01j01O8
2431e2O6KLj45J17mlJ3J1N7N6rrr6r5klJ75q6q6J75p8p7MMnop1p1J38J38j5j5L7L8p2p2nn
2421d8m3K18j%J5J6j27j25P1O9K6K5J07j55j14j16O5O5JKK14m7q4q2RJ0Q5Q5j10j10J05J07
2413A33m7m7k2k1M3M4R2R2j04j04j0j0j0j0M8M9J30j31J0J0ooQ3Q3p0p0K0K0m5m5kkjkN7N7
2404B06j56J07j25j23M4M5Q8Q8j08j07P3P4RRqqp3p3J1J1r9r8J50J49jj30j25J38J37Oj59
2397d8J01K9j02k2J08K7K7j21j21L1L1M8M6M8M8j67j68K8K9O5O4O4O5j50j51Q9R0L0L2L2L2
$$ plain form
2389 114 163 213 8 -64 244 116 15 45 -26 -98 -52 -7 41 90 140 189 51 -86 -71 -56 -85 -113 -33 47 22 -1 -26 -51 -87 -124 -52 19
2381 19 -4 -29 36 -29 -163 -36 -64 -92 -25 40 106 172 124 75 136 196 59 -78 68 215 151 87 106 -137 -86 -35 -1 33 39 45 51 57 76 96
2373 96 50 4 71 138 97 55 91 127 97 67 106 146 37 191 180 169 64 -39 -79 -119 -50 18 -59 -137 -19 99 109 119 19 -79 -40 -2
2365 -2 36 75 41 7 39 71 -8 -88 -103 -118 -74 -31 11 54 -15 -86 56 -62 -7 48 21 -4 16 37 206 112 128 143 76 9 1 -6 51 108 34
2357 34 -39 38 117 182 247 72 159 375 854 1131 796 500 205 390 313 265 217 5 56 75 94 129 164 145 125 106 87 63 40 16 -6
2349 -6 26 59 27 -5 -14 -23 32 89 35 -17 37 93 45 -2 14 32 85 137 21 -95 59 -47 -7 32 -20 -73 -33 6 221 173 164 155 139 122 106
2341 106 90 45 1 21 42 128 214 103 -7 -12 -18 41 101 90 78 -80 22 16 9 102 194 64 197 182 167 128 89 49 10 1 -7 48 104 85 66
2332 66 48 29 59 89 119 149 82 15 -51 -118 -62 -5 -30 -56 154 103 90 77 22 -31 23 78 -29 -136 12 -100 -73 -45 -33 -22 33 88 78
$$ packed form
2389A14M9N0k05p2L08j28j01L0p1p2M6M5M8M9N0M9j38j37J5J5k9k8Q0Q0k5k3k5k5l6l7P2P1
2381A9k3k5O5o5j34J27k8k8O7O5O6O6m8m9O1O0j37j37J46J47o4o4J9k43N1N1L4L4OOOOJ9K0
2373I6m6m6O7O7m1m2L6L6l0l0L9M0j09J54j1j1j05j03m0m0O9O8p7p8J18J18J0J0j00r8L9L8
2365bL8L9l4l4L2L2p9q0j5j5M4M3M2M3o9p1J42j18N5N5k7k5K0K1J69r4J6J5o7o7qpN7N7p4
2357C4p3P7P9O5O5j75Q7K16M79K77l35k96k95J85p7m8m8k12N1J9J9L5L5j9k0j9j9k4k3k4k2
2349fL2L3l2l2rrN5N7n4n2N4N6m8m7J6J8N3N2j16j16J54j06M0L9n2n3M0L9K15m8rrj6j7j6
2341A06j6m5m4K0K1Q6Q6j11j10noN9O0j1j2j58J02opR3R2j30J33j5j5l9l9m0l9rqN5N6j9j9
2332F6j8j9L0L0L0L0o7o7o6o7N6N7k5k6K10n1j3j3n5n3N4N5j07j07J48j12K7K8J2J1N5N5j0
$$ plain form
2324 78 67 69 71 57 42 163 22 -20 -64 -110 104 63 21 8 -3 -16 -29 -14 0 81 162 36 -89 69 227 116 5 3 2 16 31 46 60
2316 60 48 36 23 11 -1 -13 -42 -71 58 -73 -74 -74 45 -95 -24 47 36 24 13 2 56 111 56 1 -5 -11 128 7 157 308 157 7
2308 7 -14 -37 -54 190 59 -70 -15 39 -76 70 85 100 -46 68 101 134 238 342 380 418 256 93 24 -45 75 -64 -57 -51 -10 30
2301 30 6 -18 -91 -164 -127 -91 -97 -103 -43 15 43 71 99 127 164 201 173 145 88 31 84 136 93 49 72 94 180 266 198 131 86 40 104 168 58 -50
2292 -50 -7 35 15 -4 41 87 71 54 104 153 93 33 120 -53 -17 18 37 57 27 -1 -31 -60 12 85 158 231 200 169 138 107 114 121 128 136 154 172 37
2283 37 -97 -22 52 62 71 78 85 92 99 17 -63 -13 36 45 54 62 71 70 69 68 67 121 175 10 -154 -173 -191 -226 1 83 166 47 -72 -34 3 40 78 69 60 51
2273 51 43 49 55 62 68 115 163 79 -4 -37 -71 59 -72 -95 142 249 95 -46 74 96 119 51 -16 194 142 150 157 82 8 18 28 104 179 151 123
2265 123 95 67 47 27 72 118 47 -23 36 97 102 108 0 -109 -185 1 -24 -50 25 101 63 24 -90 57 -90 23 -13 -50 -5 39 -5 -50
$$ packed form
2324G8j1KKj4j5J21j41m2m4m6K14m1m2j3j1j3j3J5J4Q1Q1j26j25J58J58j11j11kjJ4J5J5J4
2316F0j2j2j3j2j2j2k9k9J29j31j%J19j40P1P1j1j2j1j1N4N5n5n5ooJ39j21J50J51j51j50
2308Gk1k3j7K44j31j29N5N4j15J46J5J5j46J14L3L3J04J04L8L8j62j63o9o9J20j39POM1M0
2301C0k4k4p3p3L7L6ooO0N8K8K8K8K8L7L7k8k8n7n7N3N2m3m4K3K2Q6Q6o8o7m5m6O4O4j10j08
2292e0M3M2k0j9M5M6j6j7N0M9o0o0Q7j73L6L5J9K0l0k8l0k9P2P3P3P3l1l1l1l1PPPQJ8J8j35
2283C7j34P5P4J0RPPPPq2q0N0M9RRQRjjjjN4N4j65j64j9j8l5K27Q2Q3j19j19L8L7L7L8rrr
2273E1qOOPOM7M8q4q3l3l4J30j31k3K37J07j54j41J20K2K3o8o7K10n2QPp5p4J0J0P6P5k8k8
2265A23k8k8k0k0M5M6p1p0N9O1NOj08j09p6J86k5k6P5P6l8l9j14J47j47J13l6l7M5M4m4m5
$$ plain form
2257 -50 35 121 60 -1 2 6 51 96 10 -75 -59 -43 -93 -142 -154 -166 -129 -91 8 -153 -37 79 -9 -98 14 127 266 143 36 -70 -7 54
2249 54 51 48 4 -39 -17 3 10 16 23 29 81 132 53 -26 12 50 89 127 76 24 -174 -111 -110 -109 -91 -74 -59 -44 117 17 -86 -190 -92 5 42 79 34
2240 34 -10 177 103 45 -12 -82 -152 -91 -30 51 133 -47 34 -125 -22 13 50 2 -45 37 120 51 -17 28 74 261 186 128 69 39 9 45 80
2232 80 104 127 150 173 103 32 -38 -109 -76 -42 7 57 -95 15 -22 -59 -32 -5 168 81 86 91 96 101 -44 71 39 8 9 10 11 12 -22 -57 -91 -126 -80
2223 -80 -34 11 56 -8 -73 -73 -72 -72 -71 -87 158 121 83 -3 -89 14 119 5 -108 -157 -207 -147 -88 3 94 -11 -116 -57 1 -4 -10 16 42 3 -35
2214 -35 -57 -80 -20 38 -158 -93 167 166 140 113 136 158 123 88 70 52 -75 58 45 32 65 97 19 -57 -24 9 42 75 -4 -85 -12 60 66 73 14
2206 14 -44 -64 -83 -103 -122 -36 49 26 2 -13 -29 -46 -62 -59 -56 -53 -50 -56 -63 83 229 167 104 42 -20 -97 -175 -55 63 30 -1 119 239 209 180
2197 180 150 120 120 120 120 120 67 14 26 39 30 22 161 38 37 35 99 164 -41 14 32 50 142 233 189 144 85 289 280 270 417 563 442 321 160
$$ packed form
2257e0Q5Q6o1o1LMM5M5q6q5J6J6n0m9j2j2L7L8R9j61J16J16q8q9J12J13J39j23j07j06O3O1
2249E4llm4m3K2K0POPON2N1p9p9L8L8L9L8n1n2j98O3JJJ8J7J5J5J61j00j03j04R8R7L7L7m5
2240C4m4J87p4n8n7p0p0O1O1Q1Q2j80Q1j59J03L5L7m8m7Q2Q3o9o8M5M6J87p5n8n9l0l0L6L5
2232H0K4K3K3K3p0p1p0p1L3L4M9N0j52J10l7l7K7K7J73q7NNNNj45J15l2l1JJJJl4l5l4l5M6
2223h0M6M5M5o4o5%J%Jj6K45l7l8q6q6J03J05j14j13m9n0O0N9R1R1j05j05N9N8noK6K6l9l8
2214c5k2k3O0N8j96O5K60jk6k7K3K2l5l5j8j8j27J33j3j3L3L2p8p6L3L3L3L3p9q1P3P2OPn9
2206A4n8k0j9k0j9Q6Q5k3k4j5j6j7j6LLLLopJ46J46o2o3o2o2p7p8J20J18l3l1J20J20l0k9
2197A80l0l0%%%%n3n3J2J3rqJ39j23jkO4O5k05N5J8J8R2R1m4m5n9K04rj0J47J46j21j21j61
$$ plain form
2189 160 262 310 357 503 386 281 175 20 128 154 179 212 244 211 178 150 121 93 65 -73 -212 -127 -42 143 67 72 78 28 -21 -6 9
2181 9 70 132 194 256 154 52 173 295 414 271 275 279 315 350 369 388 487 323 306 290 192 93 60 28 81 135 254 373 253 134 167
2173 167 200 255 310 348 387 588 527 357 448 440 432 653 612 572 532 476 420 455 490 459 429 403 378 392 142 173 204 219 233 261 290 252 215 189
2165 189 164 138 113 79 46 12 -21 56 134 146 158 79 0 29 59 -9 -78 -142 56 17 -22 48 118 213 45 -39 -125 34 195 87 -19 -182
2157 -182 -82 -64 -46 -11 22 56 90 37 -16 -54 -91 -198 -43 29 102 79 57 34 11 13 15 -48 -112 -59 -6 194 132 121 109 82 54 46 37 28 19 -21
2148 -21 -63 -39 -15 -24 -32 -140 15 133 -10 -137 -3 5 14 -26 -66 -12 40 29 17 58 99 162 -36 53 -118 -93 -68 1 71 -11 -94 -45 2
2140 2 -14 -31 -6 18 108 199 145 91 37 -16 -37 -58 -79 -100 -72 -44 49 143 88 33 28 22 145 5 123 240 189 137 151 166 159 153 81 9 44 79
2132 79 113 148 50 -46 -35 -23 -28 -33 174 120 102 83 48 13 40 68 242 155 133 111 72 34 54 75 -51 84 118 152 137 123 31 -60 1 62
$$ packed form
2189A60J02M8M7J46j17j05j06j55J08K6K5L3L2l3l3k8k9k8k8j38j39Q5Q5J85p6NOn0m9J5J5
2181IO1O2O2O2j02j02J21J22J19j43MML6L5J9J9R9j64j7j6r8r9l3l2N3N4J19J19j20j19L3
2173A67L3N5N5L8L9K01o1j70R1qqK21m1m0m0n6n6L5L5l1l0k6k5J4k50L1L1J5J4K8K9l8l7k6
2165A89k5k6k5l4l3l4l3P7P8J2J2p9p9K9L0o8o9o4J98l9l9P0P0R5j68q4q6J59J61j08j06j63
2157a82J00J8J8L5L3L4L4n3n3l8l7j07J55P2P3k3k2k3k3KKo3o4N3N3K00o2j1j2k7k8qrrrm0
2148b1m2K4K4rqj08J55J18j43j27J34QRm0m0N4N2j1j2M1M1O3j98Q9j71K5K5O9P0q2q3M9M7
2140Bj6j7K5K4R0R1n4n4n4n3k1k1k1k1K8K8R3R4n5n5noJ23j40J18J17n1n2J4J5pop2p2L5L5
2132G9L4L5r8r6J1J2nnK07n4j8j9l5l5K7K8J74q7k2k2l9l8K0K1j26J35L4L4j5j4r2r1O1O1
$$ plain form
2123 62 61 60 58 57 90 123 156 189 162 135 108 81 68 56 191 63 -22 -108 -206 -41 27 96 176 -5 48 102 -12 -128 -90 -52 -31 -10 97 -57
2115 -57 44 145 44 -56 -4 46 5 -35 -11 13 36 58 16 -26 6 38 54 70 203 74 190 45 -89 37 66 95 71 46 21 -3
2108 -3 18 40 61 83 124 165 96 28 -8 -45 42 131 -16 98 131 163 110 56 3 -49 66 182 102 21 18 14 -6 -26 178 120 100 81 106 132
2099 132 157 183 152 121 91 60 41 23 -11 -46 147 79 93 106 91 76 45 14 148 19 38 58 112 167 -18 -204 -51 101 56 12 4 -4
2091 -4 52 109 62 15 33 51 49 47 45 43 -40 -125 -12 100 63 27 100 173 144 115 195 275 263 250 172 93 141 189 188 187 8 92 33 237 227 218 55
2082 55 -106 86 16 -14 -45 46 137 76 15 42 70 97 125 132 139 36 -65 -20 25 70 115 149 183 108 33 13 -7 -27 -48 -104 -160 -63 33 56
2074 56 80 -5 -92 -65 -39 -12 13 74 135 42 -49 -57 -65 -7 50 -15 -82 -39 3 45 87 129 170 141 112 83 54 30 6 48 90 0 -91 -72 -53 -84
2065 -84 -115 -81 -46 20 87 1 -83 5 95 75 55 46 37 94 151 138 125 46 -31 1 34 68 101 30 -40 -111 -182 -105 -29 -18 -7 45 98 -78 7 158
$$ packed form
2123F2jjkjL3L3L3L3k7k7k7k7j3j2J35j28q5q6r8J65O8O9Q0j81N3N4j14j16L8L8K1K1J07j54
2115e7J01J01j01j00N2N0m1m0K4K4K3K2m2m2L2L2J6J6J33j29J16j45j34J26K9K9k4k5k5k4
2108cK1K2K1K2M1M1o9o8l6l7Q7Q9j47J14L3L2n3n4n3n2J15J16q0q1lmk0k0K04n8k0j9K5K6
2099A32K5K6l1l1l0l1j9j8l4l5J93o8J4J3j5j5l1l1J34j29J9K0N4N5j85j86J53J52m5m4qq
2091dN6N7m7m7J8J8kkkkq3q5J13J12l7l6P3P3k9k9Q0Q0j2j3p8p9M8M8jjj79Q4n9K04j0rj63
2082E5j61J92p0l0l1R1R1o1o1K7K8K7K8PPj03j01M5M5M5M5L4L4p5p5k0k0k0k1n6n6R7R6K3
2074E6K4q5q7K7K6K7K5O1O1r3r1qqN8N7o5o7M3M2M2M2M2M1k9k9k9k9k4k4M2M2r0r1J9J9l1
2065h4l1L4L5O6O7q6q4Q8R0k0k0rrN7N7j3j3p9p7L2L3L4L3p1p0p1p1P7P6J1J1N2N3j76Q5J51
$$ plain form
2056 158 47 35 22 72 122 106 90 69 48 43 39 -63 96 108 120 85 51 -48 -148 -72 2 -47 -97 56 -52 -79 -106 -97 -88 68 -37 -45 -54 177
2048 177 146 173 201 277 353 208 63 -119 -40 23 86 13 -59 -39 -19 0 19 -10 -40 -71 -101 -25 50 17 -15 30 75 56 36 52 67 17 -31
2040 -31 -41 -51 -126 -201 -168 -135 -102 -70 22 115 98 81 77 73 19 -33 -218 -140 46 -29 -55 -81 -14 52 -49 -152 -57 37 32 27 21 16 -39 -95 -85 -75
2031 -75 -64 -53 -42 -31 -30 -28 -26 -24 -25 -26 82 190 128 65 68 71 44 16 -10 -37 -40 -43 -46 -49 -80 -112 -34 43 21 0 -21 -43 -54 -65 -75 -86 45 176 111
2022 111 46 -8 -63 -10 43 52 60 -40 -140 -143 -145 -82 -19 52 124 44 -36 -27 -17 -8 0 7 14 21 28 -87 -203 -34 133 93 53 79 104 64 24 50 75
2013 75 30 -15 47 111 56 0 -54 -109 -30 48 19 -10 -107 -204 -60 82 27 -27 26 80 62 44 25 7 -6 -19 75 170 102 33 -34 -102 -93 -84 -141
2004 -141 -197 -145 -92 -39 13 55 97 73 50 40 30 20 11 23 35 -61 -157 -196 -234 -119 -4 -67 -131 -85 -39 -27 -15 77 171 -27 35 -32 -100 -219
1996 -219 -75 -79 -83 -66 -48 -31 -13 -2 8 18 29 100 171 132 94 91 88 69 50 117 -78 -16 44 16 -12 -40 -69 -10 48 75 -160 -253 -83 -77 -71 -50
$$ packed form
2056A58j11j2j3N0N0j6j6k1k1nmj02J59J2J2l5l4r9j00P6P4m9n0J53j08k7k7RRJ56j05qrK31
2048A77l1K7K8P6P6j45j45j82P9O3O3p3p2K0K0J9J9k9l0l1l0P6P5l3l2M5M5j9k0J6J5n0m8
2040c1j0j0p5p5L3L3L3L2R2R3j7j7mmn4n2j85P8J86p5k6k6O7O6j01j03R5R4nnonn5n6J0J0
2031g5J1J1J1J1JKKKjjJ08J08o2o3LLk7k8k6k7lllll1l2P8P7k2k1k1k2j1j1j0j1J31J31o5
2022A11o5n4n5N3N3RQj00j00lkO3O3P1P2q0q0RJ0RQPPPPj15j16J69J67m0m0K6K5m0m0K6K5
2013G5m5m5O2O4n5n6n4n5P9P8k9k9r7r7J44J42n5n4N3N4j8j8j9j8j3j3R4R5o8o9o7o8RRn7
2004a41n6N2N3N3N2M2M2k4k3j0j0j0rJ2J2r6r6l9l8J15J15o3o4M6M6J2J2R2R4j98O2o7o8j19
1996b19J44mmJ7J8J7J8J1J0J0J1P1P1l9l8llj9j9O7j95O2O0k8k8k8k9N9N8K7k35r3J70OOK1
$$ plain form
1987 -50 -30 -9 10 -36 -84 -83 -81 154 129 11 -107 -113 -120 86 30 150 269 176 82 90 97 39 -18 -10 -2 70 144 94 45 61 77 -25 -128 -94 -60
1978 -60 18 -165 -119 -72 -201 -67 -81 -94 -128 -163 -87 -12 82 178 77 -23 29 82 70 58 72 85 99 113 85 58 96 135 71 7 -56 -120 -148
1970 -148 -176 -57 -200 -100 0 -26 -51 -44 -37 -30 -23 -54 -86 -52 -18 -21 -24 -28 -31 -14 2 19 35 -19 -75 -131 -186 7 201 111 21 14 7 0 -6 -15 -25 -34 -44
1961 -44 -64 -85 -40 4 72 140 99 58 -18 -95 -62 -30 37 104 62 20 6 -8 42 93 92 90 23 -42 -107 -171 -82 6 60 113 58 2 30 58 85 113
1952 113 111 109 42 -25 -50 -75 8 93 -12 -119 -28 62 45 27 10 -6 22 52 16 -19 9 39 68 98 100 102 38 -25 -58 -92 -16 58 16 -26 -68 -111
1943 -111 -93 -75 -123 -171 -127 -82 -38 6 -7 -22 -36 -50 -11 27 66 105 67 29 -7 -45 -29 -12 3 19 3 -13 -46 -79 66 -49 -18 12 19 27 18
1935 18 10 220 168 154 140 105 69 34 -1 -55 -109 -9 89 17 -53 -16 21 89 157 115 74 55 37 19 0 -75 -152 -76 0 -45 -91 -71 -51 -148 -245
1926 -245 -57 129 115 101 -59 41 76 111 53 -4 -1 2 -59 -122 -84 -46 72 -70 -150 -230 -85 58 93 128 -76 -281 -105 70 50 29
$$ packed form
1987e0K0K1J9m6m8JKK35k5j18j18opK06n6J20J19r3r4QPn8n7QQP2P4n0m9J6J6j02j03L4L4
1978f0P8j83M6M7j29J34j4j3l4l5P6P5R4R6j01j00N2N3j2j2J4J3J4J4k8k7L8L9o4o4o3o4k8
1970a48k8J19j43J00J00k6k5PPPPl1l2L4L4llmlJ7J6J7J6n4n6n6n5J93J94r0r0ppporj0rj0
1961d4k0k1M5M4O8O8m1m1p6p7L3L2O7O7m2m2j4j4N0N1jko7o5o5o4Q9Q8N4N3n5n6K8K8K7K8
1952A13kko7o7k5k5Q3Q5j05j07R1R0j7j8j7j6K8L0l6l5K8L0K9L0KKo4o3l3l4P6P4m2m2m2m3
1943a11J8J8m8m8M4M5M4M4j3j5j4j4L9L8L9L9l8l8l6l8J6J7J5J6j6j6l3l3J45j15L1L0PQr
1935A8qK10n2j4j4l5l6l5l5n4n4J00R8p2p0L7L7O8O8m2m1j9j8j8j9p5p7P6P6m5m6K0K0r7r7
1926b45J88J86j4j4j60J00L5L5n8n7LLo1o3L8L8J18j42q0q0J45J43L5L5k04k05J76J75k0k1
$$ plain form
1919 29 20 11 2 -6 -60 -114 -103 -92 -126 -160 -145 -130 24 -82 -41 0 11 23 -74 -171 -94 -17 -5 6 0 -6 -12 -19 -13 -7 -1 4 37 69 102 135 75 15 119 -38
1909 -38 -186 -71 -120 -169 -132 -95 -124 -152 -118 -83 -49 -14 -37 -60 -17 25 39 52 38 25 238 13 -177 -106 -34 37 -119 159 93 27 -76
1901 -76 -180 -69 41 -43 -129 -97 -65 -98 -132 -147 -163 -85 -8 122 -9 23 55 -102 1 23 45 51 57 63 69 180 292 207 122 213 304 155
1894 155 6 -35 -77 -9 58 45 32 2 -26 37 -160 -161 99 118 137 172 208 182 156 130 104 106 109 -35 82 103 124 97 69 -12 -95 -128 -161 12
1885 12 -76 -17 41 11 -18 -47 -77 -22 32 86 141 117 93 -13 142 116 90 14 -61 -95 -130 -99 -68 -83 -99 -49 0 28 57 19 -17 -73 -129 -76
1877 -76 -23 -74 -124 124 112 37 -36 172 120 53 -12 -46 -79 10 -161 -76 8 -38 -84 -21 41 -28 -97 -101 -104 -12 79 34 -10 -175 -78 -19 38 26
1869 26 13 1 -10 -9 -8 -7 -7 -10 -13 -16 -19 -12 -6 -65 -123 -91 -58 -26 6 -41 -89 9 -153 -114 -75 -52 -29 -38 -46 -55 -63 9 83 47 11 -30 -73 -49 -26 -75 -124 -64
1858 -64 -4 5 14 24 33 50 66 83 99 65 30 -4 -39 -41 -43 -28 -14 -135 5 146 25 -17 -60 -120 -180 -96 -11 -80 -149 -139 -129 -118 -108 -49 9 -40
$$ packed form
1919B9rrrqn4n4J1J1l4l4J5J5J54j06M1M1J1J2r7r7P7P7J2J1ooopOOONL3L2L3L3o0o0J04j57
1909c8j48J15m9m9L7L7k9k8L4L5L4L5k3k3M3M2J4J3j4j3K13k25j90P1P2P1j56K78o6o6j03
1901g6j04J11J10q4q6L2L2l3l4j5j6P8P7J30j31L2L2j57J03K2K2OOOOJ11J12q5q5R1R1j49
1894A55j49m1m2O8O7j3j3l0k8O3j97jK60J9J9L5L6k6k6k6k6KLj44J17K1K1k7k8q1q3l3l3J73
1885A2q8N9N8l0k9k9l0N5N4N4N5k4k4j06J55k6k6p6p5l4l5L1L1j5j6N0M9K8K9l8l6n6n6N3
1877g6N3n1n0K48j2p5p3K08n2o7o5l4l3Q9j71Q5Q4m6m6O3O2o9o9mlR2R1m5m4j65R7N9N7j2
1869B6j3j2j1JJJ%llllPOn9n8L2L3L2L2m7m8R8j62L9L9K3K3rqrqP2P4l6l6m1m3K4K3m9m9O0
1858f4O0RRJ0RJ7J6J7J6l4l5l4l5kkJ5J4j21J40J41j21m2m3o0o0Q4Q5o9o9J0J0J1J0N9N8m9
$$ plain form
1850 -40 -91 32 155 38 -79 -29 19 -24 -68 -191 -52 -169 -287 -193 -99 32 -97 -84 -71 -74 -77 -28 21 5 -11 -88 -166 -211 6 103 -62
1842 -62 17 -164 -160 -156 -97 222 82 -57 37 133 109 85 -4 -93 -136 -179 -92 -4 -51 -99 -15 68 71 74 -70 46 -21 -89 -124 -160 -350 -278 -59
1834 -59 -101 -273 -182 -107 -294 -217 -140 -78 -17 -77 -136 -80 -25 -19 -276 -255 -233 -137 -40 -9 22 -1 -24 -48 -71 -70 -69 13 -165 -206 -247 -172 -98 -98 -98 -97
1825 -97 -97 -139 -182 -158 -135 -67 0 -61 -124 -76 -27 37 -159 25 210 161 111 138 165 225 23 -98 42 35 -234 -126 -19 5 30 -21 -74 3
1817 3 82 18 -44 -108 -171 -120 -69 -149 -229 -202 -174 -147 -120 -117 -114 -259 -142 -120 -99 -61 -23 -67 -111 -24 62 -28 -119 -78 -38 -63 -88 -113 -138 -93 -48 -3
1808 -3 41 102 163 6 -150 -75 -1 -57 -113 -122 -130 82 32 -115 -133 -36 -70 -43 -15 -152 -26 19 -65 -134 -71 -74 -77 -72 -67 -60 -53 -46 -39 -48 -57 23 -27 -207
1799 -207 -124 -66 -9 -45 -82 -53 -24 3 32 60 88 117 146 45 -56 -45 -34 -170 -44 -49 -54 -43 -32 -10 11 -97 -206 -165 -123 -82 -41 0 43
1791 43 85 127 101 75 49 23 -12 -47 47 143 54 -34 7 50 85 121 91 61 -29 -121 -81 -41 -14 12 38 65 -9 -85 -95 -105 46 198 44 -109
$$ packed form
1850d0n1J23J23j17j17N0M8m3m4j23J39j17j18R4R4J31j29J3J3llM9M9j6j6p7p8m5K17R7j65
1842f2P9j81MMN9L19j40j39R4R6k4k4q9q9m3m3Q7Q8m7m8Q4Q3LLj44J16o7o8l5l6j90P2K19
1834e9m2j72R1P5j87P7P7O2O1o0n9N6N5Ok57K1K2R6R7L1L1k3k3k4k3JJQ2j78m1m1P5P4%%J
1825i7%m2m3K4K3O8O7o1o3M8M9O4j96J84J85m9n0K7K7O0k02j21J40pk69J08J07K4K5n1n3P7
1817CP9o4o2o4o3N1N1q0q0K7K8K7K7LLj45J17K2K1L8L8m4m4Q7Q6r0r1M1M0k5k5k5k5M5M5M5
1808cM4O1O1j57j56P5P4n6n6rqK12n0j47j8R7l4K7K8j37J26M5q4o9O3llNNPPPPrrQ0n0j80
1799b07Q3N8N7l6l7K9K9K7K9K8K8K9K9j01j01J1J1j36J26nnJ1J1K2K1j08j09M1M2M1M1M1M3
1791D3M2M2k6k6k6k6l5l5R4R6q9q8M1M3L5L6l0l0r0r2M0M0K7K6K6K7p4p6j0j0J51J52j54j53
$$ plain form
1783 -109 -8 91 60 29 -32 -95 -100 -105 -62 -150 -263 -113 141 135 52 -30 9 49 89 129 96 63 30 -2 4 10 83 155 112 70 27 -14 53 121 -66
1774 -66 6 36 65 45 25 3 -19 -42 -64 -80 -95 -111 -126 -105 -83 -127 -171 -99 -26 46 118 67 15 -36 -87 -22 43 -38 141 159 177 102 27 -18 -65
1766 -65 -111 -157 -14 129 32 -64 -98 -132 -56 18 17 16 64 112 173 -27 -15 -3 25 53 16 -21 8 38 2 -33 -36 -39 -42 -45 -43 -40 -38 -36 0 34 3 -26 -5
1756 -5 16 -27 -71 -28 14 57 101 63 25 -29 -83 42 -93 -82 -71 -67 -62 -58 -54 -47 -39 32 105 72 40 -30 161 113 65 116 -94 -20 53 111 168 126 84
1747 84 4 186 143 99 138 177 124 71 127 183 165 146 127 108 39 -29 10 50 48 47 112 177 182 188 194 200 223 246 186 390 616 842 1003 1164 1852
1739 1852 2978 4961 9479 14413 14014 9331 5434 3260 2047 1588 1566 1537 1244 887 529 308 86 105 124 84 44 5 -34
1733 -34 11 58 143 -33 22 78 52 26 -23 -73 -57 -42 -12 16 29 41 160 16 20 24 15 6 -83 -174 -33 -155 -277 -137 -89 -42 103 -12 74
1725 74 161 231 302 284 266 313 360 230 99 78 57 70 82 95 108 153 198 134 70 152 234 119 4 114 224 197 170 84 261 284 45
$$ packed form
1783a09J01R9l1l1o1o3nnM3q8j13J50K54oq3q2L9M0M0M0l3l3l3l2OOP3P2m3m2m3m1O7O8j87
1774f6P2L0K9k0k0k2k2k3k2j6j5j6j5K1K2m4m4P2P3P2P2n1n2n1n1O5O5q1J79J8J8p5p5m5m7
1766f5m6m6J43J43r7r6l4l4P6P4jjM8M8O1k00J2J2K8K8l7l7K9L0l6l5llllKLKKL6L4l1k9K1
1756eK1m3m4M3M2M3M4l8l8n4n4J25j35J1J1MNMMPQP1P3l3l2p0J91m8m8N1k10P4P3N8N7m2m2
1747H4q0J82m3m4L9L9n3n3N6N6j8j9j9j9o9o8L9M0kjO5O5NOOOK3K3o0K04K26K26J61J61O88
1739A852J126J983M518M934l99m683l897k174j213m59k2k9k93l57l58k21k22J9J9m0m0l9l9
1733c4M5M7Q5j76N5N6k6k6m9n0J6J5L0K8J3J2J19j44MMrrq9r1J41j22j22J40M8M7J45j15Q6
1725G4Q7P0P1j8j8M7M7j30j31k1k1J3J2J3J3M5M5o4o4Q2Q2j15j15J10J10k7k7q6J77K3k39
$$ plain form
1717 45 93 140 171 202 225 249 305 361 262 163 32 -361 -383 -142 86 316 431 546 569 329 385 441 416 390 387 384 381 378 449 520 394 268
1709 268 297 326 355 385 461 537 504 471 610 749 839 929 968 744 619 493 328 424 586 486 546 607 526 445 597 487 531 836 975
1702 975 1113 1411 1970 2474 2365 2104 2279 2548 2379 2150 1922 2379 3448 4161 3564 2630 1959 1736 1513 1488 1463 1542 1621 1988
1697 1988 2967 4241 4379 3213 2047 1514 1244 1270 1296 1371 1446 1490 1535 1739 1942 2381 2208 2079 2212 2198 2184 2120 2057 2064 2071 1969 1866
1690 1866 1953 2039 2093 2147 2097 2047 1882 1980 2070 2160 2229 2560 3017 3474 3696 3656 3634 3875 4034 3930 3712 3493 3177 3122 3302 3481 3409 3336
1683 3336 3341 3607 3907 4206 4546 4624 4609 4594 4601 4607 4680 4752 4914 5076 5172 5530 5613 5958 6062 6167 6447 6728 6725 6984 7304 7887 8338 8790
1676 8790 9276 9763 10140 10255 10803 11788 12204 12359 12692 13812 14167 13560 13010 13947 15682 17853 19342 20044 20254 21950 25365
1671 25365 29217 31889 34998 38460 43058 47985 54223 61712 73310 89826 111500 133656 161669 208916 294543
$$ packed form
1717D5M8M7L1L1K3K4N6N6r9r9j31l93k2K41K28K30J15J15K3k40N6N6k5k6llllP1P1j26j26
1709B68K9K9K9L0P6P6l3l3J39J39R0R0L9k24j25j26j65R6J62j00O0O1q1q1J52j10M4L05J39
1702I75J38K98N59N04j09k61J75K69j69k29k28M57J069P13n97r34o71k23k23k5k5P9P9L67
1697A988R79J274J38j166j166n33k70K6K6P5P5M4M5K04K03M39j73j29J33j4j4o4o3PPj02j03
1690A866Q7Q6N4N4n0n0j65R8R0R0O9L31M57M57K22m0k2K41J59j04k18k19l16n5J80J79p2p3
1683C336NK66L00K99L40P8j5j5POP3P2J62J62R6L58Q3L45J04J05K80K81lK59L20N83M51M52
1676H790M86M87L77J15N48R85M16J55L33J120L55o07n50R37J735K171J489P02K10J696L415
1671B5365L852K672L109L462M598M927O238P489J1598J6516K1674K2156K8013M7247Q5627
$$ plain form
1667 294543 456959 808474 1612971 2715850 2864328 1931798 1095304 652833 425666 323429 311153
1665 311153 325715 278414 188537 124789 88055 66192 51759 42977 36905 32878 28589 26103 25103 24202 20940
1661 20940 17820 15488 14787 14349 15085 15385 15094 14803 16267 16943 14865 11476 9447 8206 7431 6656 6423 5927 5818 5272
1656 5272 5213 5153 4959 4327 4126 3664 3812 3524 3456 3389 3438 3355 3363 3109 2976 2844 2958 2809 2896 2720 2596 2209 2226 2111 2098 2347 2607
1650 2607 2429 2350 2534 2598 2400 2205 1879 1965 1789 1802 1946 2316 2555 2456 2094 1986 1878 1885 1892 2129 2367 2544 2284 2056 1829 1941
1643 1941 1790 1574 1358 1415 1472 1445 1155 1144 1133 1304 1475 1778 1818 1728 1376 1221 1066 1064 1062 1174 1287 1486 1422 1441 1459 1303 1146 1056
1636 1056 965 933 901 803 705 834 963 964 834 761 950 912 612 694 775 905 1036 938 840 653 596 705 552 473 525 702 748 746 743 751 759
1629 759 636 513 461 409 420 693 775 726 653 579 469 621 691 761 798 835 610 647 535 686 705 724 594 464 298 569 619 538 419
$$ packed form
1667B94543J62416L51515Q04497J102879J48478r32530q36494m42471k27167j02237j2276
1665C11153J4562m7301q9877o3748l6734k1863j4433q782o072m027m289k486j000r01l262
1661B0940l120k332p01m38P36L00k91k91J464O76k078l389k029j241p75p75k33m96j09n46
1656E272n9o0j94o32k01m62J48k88o8o7M9q3Qk54j33j32J14j49Q7j76j24l87J7j15j3K49K60
1650B607j78p9J84O4j98j95l26Q6j76J3J44L70K39r9l62j08j08PPK37K38J77k60k28k27J12
1643A941j51k16k16N7N7k7k90j1j1J71J71L03M0r0l52j55j55kkJ12J13J99o4J9J8j56j57r0
1636A056r1l2l2r8r8J29J29Jj30p3J89l8l00Q2Q1J30J31r8r8j87n7J09j53p9N2J77M6klQQ
1629G59j23j23n2n2J1K73Q2m9p3p4j10J52P0P0L7L7k25L7j12J51J9J9j30j30j66K71N0q1j19
$$ plain form
1622 419 430 482 534 528 522 467 413 489 565 621 676 846 1016 1091 903 497 353 350 347 508 407 341 275 324 373 315 257 330 404 333 263 324 385
1614 385 423 461 434 407 448 489 399 309 250 190 197 203 241 279 317 354 359 364 213 324 386 317 264 343 328 313 306 300 312 325 337 350 474 598 504 409
1605 409 389 368 331 556 431 306 329 352 415 479 542 606 570 535 631 726 642 557 603 650 588 526 464 402 402 403 404 405 437 469 501 534 642 751
1596 751 860 969 1053 1137 1230 1323 1533 1874 2240 3043 4793 8553 13641 14795 10536 6276 3989 2839 2303 2028 1992 1824
1591 1824 1397 970 628 547 451 354 274 194 231 269 306 343 252 161 135 110 112 114 -31 84 161 238 222 206 166 125 240 93 67 173 297
1584 297 422 398 375 352 329 279 229 245 260 179 97 81 65 111 157 102 47 117 319 414 247 84 184 311 307 225 275 242 209 148 87 222
1576 222 357 255 152 247 341 309 277 272 268 0 168 312 194 70 77 103 129 118 107 97 86 44 3 159 314 259 204 59 45 218
1568 218 128 41 -46 52 151 140 129 113 97 81 64 181 297 233 169 49 191 185 48 148 116 150 184 57 -70 25 121 309 234 302 107
$$ packed form
1622D19J1N2N2oon5n4P6P6N6N5J70J70P5j88m06j44llJ61j01o6o6M9M9n8n8P3P4p1p0O1O1
1614C85L8L8k7k7M1M1r0r0n9o0POL8L8L8L7NNj51J11O2o9n3P9j5j5poJ2J3J2J3J24J24r4r5
1605D09k0k1l7K25j25j25K3K3O3O4O3O4l6l5R6R5q4q5M6M7o2o2o2o2%JJJL2L2L2L3J08J09
1596G51J09J09Q4Q4R3R3K10L41L66Q03J750L760N088J154m259m260k287j150n36k75l6j68
1591A824m27m27l42q1r6r7q0q0L7L8L7L7r1r1k6k5KKj45J15P7P7j6j6m0m1J15j47k6J06J24
1584B97J25k4k3k3k3n0n0J6J5q1q2j6j6M6M6n5n5P0K02R5j67j63J00J27mq2N0l3l3o1o1J35
1576B22J35j02j03R5R4l2l2nmk68J68J44j18j24PK6K6j1j1j0j1m2m1J56J55n5n5j45j4J73
1568B18r0q7q7R8R9j1j1j6j6j6j7J17J16o4o4j20J42oj37J00l2L4L4j27j27R5R6J88p5O8j95
$$ plain form
1561 107 100 92 74 318 263 208 152 97 422 484 323 161 192 223 188 153 168 182 131 80 72 63 54 45 -17 -80 9 99 185 271 248 224 175 126 142 159
1552 159 140 121 19 181 154 127 51 -25 55 136 108 80 101 122 127 131 274 155 73 -7 62 133 34 -64 154 111 150 189 119 50 -18 -88 -78
1544 -78 -68 6 82 63 44 25 6 57 108 93 78 155 231 242 253 116 -20 99 -42 23 90 74 58 0 -57 20 99 218 75 -68 51
1536 51 79 108 6 166 194 221 156 91 27 -36 -34 -33 8 50 -16 -84 -79 -74 -69 -64 63 190 17 106 116 126 86 47 24 2 -20 -43 3 50 48 46 -89
1527 -89 36 227 156 90 23 93 163 149 136 123 109 96 82 69 56 -24 -104 71 -13 6 27 32 36 -20 -77 79 -26 -6 13 109 205 287 106
1519 106 73 40 22 4 51 99 12 -73 -50 -27 71 170 161 151 108 65 -43 -152 -66 18 -5 -29 -34 -38 21 82 90 97 105 112 79 46 138 231 -4 22 55
1510 55 87 47 8 -31 -71 -147 -224 -147 -71 107 286 225 163 108 54 0 -55 -38 -22 59 141 70 -1 -72 -143 -152 -161 -105 -49 -46 -43 25 93 27 -38 -39 -40
1501 -40 -16 7 -61 -130 -166 59 56 53 130 -54 -26 2 2 3 4 5 87 170 -3 84 111 139 182 226 217 207 351 494 449 405 469 534 615 696 859 760
$$ packed form
1561A07pqj8K44n5n5n6n5L25O2j61j62L1L1l5l5J5J4n1n1qrrro2o3Q9R0Q6Q6k3k4m9m9J6J7
1552A59j9j9j02J62k7k7p6p6Q0Q1k8k8K1K1NMJ43j19q2q0O9P1r9r8K18m3L9L9p0o9o8p0J0
1544g8J0P4P6j9j9j9j9N1N1j5j5P7P6J1J1j37j36J19j41O5O7j6j6n8n7P7P9J19j43j43J19
1536E1K8K9j02J60K8K7o5o5o4o3KJM1M2o6o8NNNNJ27J27j73Q9J0J0m0l9k3k2k2k3M6M7kkj35
1527h9J25J91p1o6o7P0P0j4j3j3j4j3j4j3j3q0q0J75q4J9K1NMn6n7J56j05K0J9R6R6Q2j81
1519A06l3l3j8j8M7M8q7q5K3K3R8R9rj0m3m3j08j09Q6Q4k3k4nmN9O1QPQPl3l3R2R3k35K6L3
1510E5L2m0l9l9m0p6p7P7P6J78J79o1o2n5n4n4n5J7J6Q1Q2p1p1p1p1rrN6N6LLO8O8o6o5jj
1501d0K4K3o8o9l6K25llP7j84K8K8%JJJQ2Q3j73Q7K7K8M3M4rj0J44J43m5m4O4O5Q1Q1J63r9
$$ plain form
1492 760 754 749 619 488 521 554 478 402 274 146 215 283 186 88 143 198 253 308 429 549 588 626 665 704 745 786 827 868 829 789 750 710 635
1484 635 560 436 311 157 265 242 219 10 63 34 5 36 67 98 129 55 -18 -26 -35 -31 -27 -171 -52 -35 -18 0 16 101 -75 -38 -2 127
1476 127 257 87 179 115 51 4 -42 -45 -47 -50 -53 18 89 23 -41 -207 -110 51 -49 -70 -91 -19 52 -4 -60 -8 43 -15 -75 78 -30 9 48
1468 48 6 -35 26 87 83 80 109 139 59 -20 -3 14 31 48 -68 -184 -192 -199 -83 31 -5 -43 -4 33 71 110 109 107 41 -25 59 144 32 -79 -11
1460 -11 57 60 62 9 -44 -32 -20 1 22 44 65 51 36 -43 -124 -26 70 14 -40 -42 -44 -46 -48 -16 15 -17 -51 -80 -108 -28 51 29 7 -14 -36 -173 -310
1451 -310 -163 -16 -81 -147 -148 -148 -95 -41 11 64 30 -3 28 59 -2 -64 -126 -188 -130 -72 -13 44 60 75 26 -23 -20 -16 -12 -9 -21 -33 -46 -58 -24 10 -21
1442 -21 -52 42 136 122 107 106 105 -4 -114 -60 -7 -62 -118 -20 76 21 -33 -43 -52 -126 -201 -122 -44 -31 -18 54 127 47 -32 -13 4 23 41 51 61 71
1433 71 81 21 -37 -97 -157 -168 -179 -81 16 -38 -92 -82 -71 -58 -45 -33 -20 -3 13 -35 -83 -51 -19 -53 -86 -50 -14 -43 -72 -44 -16 12 40 42 45 -61
$$ packed form
1492G60onj30j31L3L3p6p6j28j28O9O8r7r8N5N5N5N5J21J20L9L8L9L9M1M1M1M1l9m0l9m0p5
1484F35p5j24j25j54J08k3k3k09N3k9k9L1L1L1L1p4p3qrMMj44J19J7J7J8J6Q5j76L7L6J29
1476A27J30j70R2o4o4m7m6lkllP1P1o6o4j66R7J61j00k1k1P2P1n6n6N2N1n8o0J53j08L9L9
1468D8m2m1O1O1mlK9L0q0p9J7J7J7J7j16j16qpJ16J14l6l8L9L7L8L9jko6o6Q4Q5j12j11O8
1460a1O8LKn3n3J2J2K1K1K2K1j4j5p9q1R8R6n6n4kkkkL2L1l2l4k9k8Q0P9k2k2k1k2j37j37
1451c10J47J47o5o6j%N3N4N2N3l4l3L1L1o1o2o2o2N8N8N9N7J6J5m9m9LMMLj2j2j3j2L4L4l1
1442b1l1R4R4j4j5jjj09j10N4N3n5n6R8R6n5n4j0rp4p5P9P8J3J3P2P3q0p9J9J7J9J8J0J0J0
1433G1J0o0n8o0o0j1j1R8R7n4n4J0J1J3J3J2J3J7J6m8m8L2L2l4l3L6L6k9k9K8K8K8K8KLj06
$$ plain form
1424 -61 -168 -81 6 -15 -37 -50 -64 -12 39 -43 -127 -101 -75 -46 -16 13 43 -22 -87 -44 0 -27 -55 -82 -109 -39 30 -51 -134 -49 36 56 75 92 109
1416 109 -26 -163 -88 -14 -6 2 14 27 -69 -165 -154 -143 -132 -120 -94 -69 -108 -148 -114 -80 -46 -12 -48 -84 -55 -25 -16 -7 1 10 -13 -36 -60 -83 -98 -114 -63
1406 -63 -13 74 162 97 31 -1 -35 -69 -102 -52 -3 -182 -99 0 -163 -97 -30 -4 21 48 74 0 -74 14 -158 -295 -171 -57 56 62 68 -138
1399 -138 -83 -134 -185 -257 -67 -25 16 9 2 21 41 -4 -50 2 54 -1 -58 -101 -144 26 -65 -103 -140 79 36 -159 -92 23 139 -66 -11 -53
1391 -53 -96 31 -103 -24 53 44 35 -121 -15 -44 -73 -86 -99 -221 -342 -268 -193 -80 32 -94 -222 -185 -149 -112 -76 -55 -34 -12 8 -110 -228
1383 -228 -106 16 10 4 -66 -138 -103 -68 -32 2 -22 -47 74 -65 7 81 45 9 -165 -78 -73 -68 -13 40 29 18 -19 -56 31 119 -18 106 84
1375 84 61 -12 -86 -242 -136 -97 -58 -68 -78 -40 -1 102 206 106 7 68 130 0 2 85 -93 -162 -101 -64 -27 -9 7 25 43 25 7 -76
1367 -76 -160 -136 -113 -89 -66 -54 -41 -29 -16 -56 -96 -73 80 145 -50 -92 -133 -85 -36 -144 10 41 -59 -135 -80 -98 15 71 -3 33 70 99
$$ packed form
1424f1j07Q7Q7k1k2j3j4N2N1q2q4K6K6K9L0K9L0o5o5M3M4k7k8k7k7P0O9q1q3Q5Q5K0J9J7J7
1416A09j35j37P5P4QQJ2J3r6r6J1J1J1J2K6K5l9m0L4L4L4L4l6l6K9L0RRQRk3k3k4k3j5j6N1
1406f3N0Q7Q8o5o6l2l4l4l3N0M9j79Q3R9j63O6O7K6K5K7K6p4p4Q8j72j37J24J14J13OOk06
1399a38N5n1n1p2J90M2M1ppJ9K0m5m6N2N2n5n7m3m3J70r1l8l7K19m3j95O7J15J16k05N5m2
1391e3m3J27j34P9P7rrj56J06k9k9j3j3j22j21P4P5J13J12j26j28L7L6L7L6K1K1K2K0j18j18
1383b28J22J22oop0p2L5L5L6L4k4k5J21j39P2P4l6l6j74Q7NNN5N3j1j1l7l7Q7Q8j37J24k2
1375H4k3p3p4j56J06L9L9j0j0L8L9J03J04j00r9O1O2j30KQ3j78o9O1L7L7J8J6J8J8j8j8q3
1367g6q4K4K3K4K3J2J3J2J3m0m0K3J53O5j95m2m1M8M9j08J54L1j00p6N5j8J13N6p4L6L7K9
$$ plain form
1360 99 128 -17 -163 -65 -99 -201 -41 -36 -31 -2 26 -53 -133 -124 -116 -41 32 -87 -206 -173 -140 -73 -7 -94 -181 -105 -29 -19 -8 51 110 17 -75 -4
1351 -4 66 -15 -96 -173 -249 -216 -183 -66 49 13 -22 -92 -161 -77 6 69 131 84 37 -44 -127 -56 13 24 35 -18 -73 -12 47 -9 -67 -50 -165 -252
1343 -252 -77 42 32 -41 -115 -64 -13 -72 -130 -110 -89 -3 82 7 -68 8 86 10 -65 -31 2 -13 -30 63 156 114 72 29 -12 34 80 61 42 -4
1335 -4 -50 -97 -143 -88 -32 -129 -226 -248 -270 -226 -182 -99 -16 -42 -68 -75 -82 -154 -226 -113 0 2 6 -92 -191 -180 -170 -162 -154 -146 -138 -53 32 8 -14 14 44 -34 -114
1325 -114 -89 -65 -106 -148 -137 -127 -182 -237 -249 -260 -163 -65 -39 -12 -51 -91 -75 -60 -110 -160 -98 -35 -126 -217 -174 -131 -197 -263 -168 -73 -131 -190 -190 -191 -126 -62
1316 -62 -178 -294 -170 -46 45 136 75 13 -92 -198 -107 -17 -99 -182 -112 -42 -22 -3 15 34 -23 -80 -138 -195 -109 -22 58 -122 -102 -82 -79 -76 -118
1308 -118 -159 -201 -243 -227 -212 -130 -49 -40 -31 -87 -144 -120 -95 -71 -47 -61 -75 19 114 71 29 51 74 97 121 35 -50 -67 -85 6 97 -22 -142 -109 -76
1300 -76 -3 68 -11 -92 -54 -17 20 57 12 -31 -76 -120 -119 -117 -50 16 -63 -144 -28 88 38 -10 87 -77 -69 -61 -86 -111 22 -105 -152 -198 -175 -152 -63
$$ packed form
1360I9K9j45j46R8l4j02J60NNK9K8p9q0RQP5P3j19j19L3L3O7O6q7q7P6P6J0J1N9N9r3r2P1
1351dP0q1q1p7p6L3L3J17J15l6l5p0o9Q4Q3O3O2m7m7q1q3P1O9J1J1n3n5O1N9n6n8J7j15q7
1343b52J75J19j0p3p4N1N1n9n8K0K1Q6Q5p5p5P6P8p6p5L4L3j5j7R3R3m2m2m3m1M6M6j9j9m6
1335dm6m7m6N5N6r7r7k2k2M4M4Q3Q3k6k6ppp2p2J13J13KMr8r9J1J0QQQQQ5Q5k4k2K8L0p8q0
1325a14K5K4m1m2J1J0n5n5j2j1R7R8K6K7l9m0J6J5n0n0O2O3r1r1M3M3o6o6R5R5n8n9%jO5O4
1316f2j16j16J24J24R1R1o1o2j05j06R1R0q2q3P0P0K0J9J8J9n7n7n8n7Q6Q7Q0j80K0K0LLm2
1308a18m1m2m2J6J5Q2Q1RRn6n7K4K5K4K4j4j4R4R5m3m2K2K3K3K4q6q5j7j8R1R1j19j20L3L3
1300g6P3P1p9q1L8L7L7L7m5m3m5m4JKO7O6p9q1J16J16n0m8R7j64QQk5k5J33j27m7m6K3K3Q9
$$ plain form
1291 -63 25 -51 -127 -51 25 -12 -51 -89 -127 -66 -4 40 85 189 30 -143 -56 118 31 -1 -34 -50 -66 -214 -99 -127 107 30 -45 -182 -57
1283 -57 -79 -101 -44 12 -55 -123 49 -39 -210 -118 60 -22 -7 8 21 35 -15 -67 -88 -108 -129 -149 -181 -213 -135 -57 -33 -8 15 40 16 -6 -29 -53
1275 -53 -46 -39 -32 -25 -55 -85 -115 -145 -78 -11 -10 -8 -3 2 -57 -118 -140 -163 -76 10 -1 -13 -25 -36 -52 -68 -84 -99 -87 -74 -61 -48 -46 -44 -108 -171 -64 42 -46
1266 -46 -136 -42 50 -156 -101 -21 58 45 32 -53 -139 -160 -181 -235 -290 -148 -6 -13 -20 120 -1 -17 -33 -66 -99 -68 -36 -5 25 62 99 -16 -132
1258 -132 -67 -2 -2 -3 44 91 73 55 76 97 119 140 164 188 196 203 248 31 70 109 76 43 76 108 54 0 99 198 205 213 259 42 104 166 212 257 138
1249 138 18 95 172 104 35 59 84 235 124 51 -21 -42 -64 -85 -107 -110 -114 -183 -253 -26 200 378 293 281 269 241 212 166 121 -6 128 128
1241 128 127 208 290 499 709 721 734 568 401 372 342 401 198 142 86 132 177 223 268 337 407 296 185 90 258 125 -7 -43 -79 48
1233 48 -85 -171 4 -49 -102 27 158 240 60 57 54 35 15 22 29 35 42 8 -26 179 386 372 359 281 202 175 148 56 -36 23 83 78 72 152 233 324
$$ packed form
1291f3Q8p6p6P6P6l7l9l8l8O1O2M4M5J04j59j73Q7J74q7l2l3j6j6j48J15k8K34p7p5j37J25
1283e7k2k2N7N6o7o8J72q8j71R2J78q2J5J5J3J4n0n2k1k0k1k0l2l2P8P8K4K5K3K5k4k2k3k4
1275e3PPPPl0l0l0l0O7O7JKNNn9o1k2k3Q7Q6j1j2j2j1j6j6j6j5J2J3J3J3KKo4o3J07J06q8
1266d6r0R4R2k06N5Q0P9j3j3q5q6k1k1n4n5J42J42ppJ40j21j6j6l3l3L1L2L1L0L7L7j15j16
1258a32O5O5%jM7M7j8j8K1K1K2K1K4K4QPM5k17L9L9l3l3L3L2n4n4R9R9PQM6k17O2O2M6M5j19
1249A38j20P7P7o8o9K4K5J51j11p3p2k1k2k1k2lmo9p0K27K26J78q5j2j2k8k9m6m5j27J34%
1241A28jQ1Q2K09K10J2J3j66j67k9l0N9k03n6n6M6M5M6M5O9P0j11j11r5J68j33j32l6l6J27
1233D8j33q6J75n3n3J29J31Q2j80llj9k0PPOPl4l4K05K07j4j3p8p9k7k7r2r2N9O0noQ0Q1R1
$$ plain form
1225 324 153 15 139 247 93 -5 -103 -21 60 87 114 -71 5 -16 -38 -44 -50 -48 -46 -209 -109 46 -59 -100 121 168 -45 -96 -146 -133 -119
1217 -119 -106 -92 -84 -77 -52 -28 -180 -70 -41 -13 69 151 103 54 -22 -99 -45 8 40 71 -43 102 48 -5 21 49 19 -10 -56 159 134 108 99 90
1209 90 71 53 166 279 285 291 314 74 42 9 91 173 288 403 299 195 283 371 327 284 295 306 449 591 438 284 349 414 573 731
1201 731 686 642 522 664 773 882 1013 881 897 914 962 1011 1060 1109 1295 1480 1562 1644 2065 2923 3662 3788 3455 3123 2883 2643 2635
1195 2635 2628 2839 3050 3381 3712 4469 5664 7507 9612 11073 11746 12819 15902 21860 31052 39215 39948 33468 25152 18989
1190 18989 15710 14388 14378 15281 16447 18083 21554 28474 41600 61798 80334 82181 66281 46797 32646 24467
1186 24467 20222 18534 18332 18860 19126 19621 21777 27610 37728 47528 48673 40153 29622 22489 18766 17887 19193 22109
1182 22109 24893 26031 26731 30040 39032 55909 77245 88996 81426 63001 46237 35625 30347 28773 29559 31897
$$ packed form
1225C24j71j38J24J08j54r8r8Q2Q1K7K7j85P6k1k2ooKKj63J00J55j05m1K21M7k13n1n0J3J4
1217a19J3J4QPK5K4j52J10K9K8Q2Q2m8m9p6p7N4N3L2L1j14J45n4n3K6K8l0k9m6K15k5k6rr
1209I0j9j8J13J13OOK3k40l2l3Q2Q2J15J15j04j04Q8Q8m4m3J1J1J43J42j53j54O5O5J59J58
1201G31m5m4j20J42J09J09J31j32J6J7M8M9M9M9J86J85Q2Q2M21Q58P39J26l33l32k40k40q
1195B635pK11K11L31L31P57J195J843K105J461O73J073L083N958R192Q163P33o480q316o163
1190A8989l279j322j0R03J166J636L471O920J3126K0198J8536J847j5900j9484j4151q179
1186B4467m245j688k02N28K66M95K156N833J0118R800J145q520j0531p133l723q79J306K916
1182B2109K784J138P00L309Q992J6877K1336J1751p570j8425j6764j0612n278j574P86K338
$$ plain form
1178 31897 34847 39654 49444 69429 105414 150185 174935 158191 116881 79560 55615 41767 34126 30256 28571
1174 28571 28460 29835 33746 42814 59402 80797 92893 84793 64410 45164 32233 24810 21129 19634 19347 19060
1170 19060 18527 18605 20984 27646 38702 49145 50425 41826 31031 23121 18720 16854 16682 17472 18912 20789 24284 31712
1166 31712 45920 67733 87841 90552 74056 52228 35733 25619 19772 16285 14295 13617 14032 15408 18893 25438
1162 25438 35129 44208 45309 37580 27136 18527 12891 9441 7032 5585 4600 3876 3402 3059 2721 2645 2584 2393 2086 1911
1157 1911 1688 1464 1462 1198 1114 1029 928 827 829 831 832 834 793 752 859 703 653 602 536 469 350 231 309 386 340 293 356 418 461 504 438 371
1149 371 373 375 229 346 319 293 283 273 271 269 243 347 386 163 87 143 152 161 186 211 153 225 388 288 160 294 280 267 145 286 197 108 250
1141 250 130 18 37 155 273 175 77 -73 37 1 -34 34 104 108 112 94 76 58 40 91 142 128 113 89 65 106 148 191 233 123 13 115
$$ packed form
1178C1897K950M807R790J9985L5985M4771K4750j6744m1310l7321k3945j3848p641l870j685
1174B8571j11J375L911R068J6588K1395J2096q100k0383j9246j2931p423l681j495k87k87
1170A9060n33P8K379O662J1056J0443J280q599j0795p910m401j866j72P90J440J877L495P428
1166C1712J4208K1813K0108K711j6496k1828j6495j0114n847l487j990o78M15J376L485O545
1162B5438R691R079J101p729j0444q609n636l450k409j447r85p24m74l43l38p6o1j91l07j75
1157A911k23k24kk64q4q5j01j01KKJKm1m1J07j56n0n1o6o7j19j19P8P7m6m7O3O2M3M3o6o7
1149C71KKj46J17k7k6j0j0kkk6J04L9k23p6N6RRK5K5n8P2J63j00j28J34j4j3j22J41q9q9J42
1141B50j20j12J9J18J18r8r8j50J10l6l5O8P0MMj8j8j8j8N1N1j4j5k4k4M1M2M3M2j10j10J02
$$ plain form
1133 115 218 212 205 160 115 179 243 224 205 60 -83 67 -43 -80 14 -33 -81 -12 57 66 75 84 94 89 85 146 207 180 153 126 100 44 -10 -87 97
1125 97 -56 51 127 -58 -73 174 348 391 254 379 430 350 188 157 45 -67 -48 -29 46 -8 318 384 348 312 327 343 249 155 173 191
1117 191 100 9 144 279 218 156 185 213 395 577 510 442 400 226 124 285 208 263 388 382 423 332 460 588 856 861 619 377 271
1110 271 166 148 129 128 126 -21 93 48 267 542 556 449 342 316 291 266 240 216 192 59 -74 -129 -183 -42 99 133 167 201 235 153
1103 153 70 141 211 119 27 -12 78 -34 114 334 423 471 257 108 90 89 87 93 99 68 38 7 -23 45 114 118 121 81 41 -15 -71 133 77 -61
1094 -61 62 174 25 -99 -93 -73 -53 -25 2 -49 -102 -89 -76 -55 -33 -113 -193 -252 -181 -60 -157 -237 -317 -258 -199 -178 -157 51 42 41 39 25 10 -17
1086 -17 -44 -71 -98 -105 -111 -118 -124 -111 -99 14 128 95 -68 -224 -161 -95 -159 -136 -113 -77 -40 -113 -185 -170 -156 -141 -126 -104 -83 -170 -258 -186 -114 -55 2
1078 2 78 -63 -82 -102 -109 -116 -123 -130 -97 -64 -140 -216 -226 -235 -91 -79 -145 7 37 -64 -156 -248 -195 -142 -155 -168 -49 -149 -161 -41 -74 -107 -20 66 44
$$ packed form
1133A15J03opm5m5O4O4j9j9j45j43J50j10l7R4m7m8O9O9RRRJ0nmO1O1k7k7k7k6n6n4p7J84
1125I7j53J07P6j85j5K47J74M3j37J25N1q0j62l1j12j12J9J9P5n4L26O6l6l6J5J6r4r4J8J8
1117A91r1r1J35J35o1o2K9K8J82J82o7o8m2j74j02J61p7N5J25oM1r1J28J28K68Nk42k42j06
1110B71j05j8j9jkj47J14m5K19K75J4j07j07k6k5k5k6k4k4j33j33n5n4J41J41L4L4L4L4q2
1103A53q3P1P0r2r2l9R0j12J48K20Q9M8k14j49j8jkOOl1l0l1l0O8O9MLm0m0n6n6K04n6j38
1094f1J23J12j49j24OK0K0K8K7n1n3J3J3K1K2q0q0n9P1J21r7q0q0N9N9K1K1K08rjkj4j5k7
1086a7k7k7k7popoJ3J2J13J14l3j63j56O3O6o4K3K3L6L7p3p2J5J4J5J5K2K1q7q8P2P2N9N7
1078BP6j41j9k0ppppL3L3p6p6j0rJ44J2o6J52L0j01r2r2N3N3j3j3J19j00j2J20l3l3Q7Q6k2
$$ plain form
1069 44 23 -31 -86 -31 22 -16 -56 -30 -3 -10 -17 -155 -74 50 44 111 179 194 -8 -96 -53 -19 13 121 229 50 -129 -155 -181 -127 -72 -83 -95
1061 -95 -163 -232 -191 -150 -49 52 1 -49 -68 -86 -55 -25 -17 -272 -226 -180 -113 -45 -43 -41 -55 -70 25 120 90 61 32 2 45 88 65 42 61 79 97
1052 97 115 61 7 -145 -35 164 102 34 -33 -203 64 -45 106 -49 56 31 6 -10 -28 20 68 93 118 7 -104 -200 -34 49 134
1045 134 226 318 258 197 178 159 249 339 264 189 311 433 435 437 423 408 622 574 476 379 503 627 598 569 607 645 683 721 632 544 624 705 664
1037 664 885 1221 1820 1967 1328 874 683 716 486 322 420 544 405 365 324 346 367 388 409 367 326 350 374 405 436 402 367 356 345
1030 345 296 509 513 517 537 558 538 519 565 611 610 608 672 736 660 584 645 706 807 645 631 616 577 537 607 677 525 374 506 639 569 498 428
1022 428 358 305 253 266 279 228 176 191 205 182 159 202 245 242 238 235 231 199 167 134 102 84 66 48 31 74 118 161 205 97 -10 -9 -8 23 54 20 -14
1013 -14 -40 -65 -91 -117 -77 -38 -64 -89 -94 -98 -102 -106 36 178 358 276 182 89 88 87 121 156 281 143 60 108 176 243 331 419 545 409 361 313 158
$$ packed form
1069D4k1n4n5N5N3l8m0K6K7ppj38Q1J24oO7O8J5k02q8M3L4L2J08J08j79j79k6k6N4N5j1j2
1061i5o8o9M1M1J01J01n1n0j9j8L1L0Qk55M6M6O7O8KKj4j5R5R5l0k9k9l0M3M3k3k3J9J8J8
1052I7J8n4n4j52J10J99o2o8o7j70K67j09J51j55J05k5k5j6j8M8M8K5K5j11j11r6J66Q3Q5
1045A34R2R2o0o1j9j9R0R0p5p5J22J22KKj4j5K14m8r8r7J24J24k9k9L8L8L8L8q9q8Q0Q1m1
1037F64K21L36N99J47o39m54j91L3k30j64R8J24j39m0m1K2K1K1K1m2m1K4K4L1L1l4l5j1j1
1030C45m9K13MMK0K1k0j9M6M6jkO4O4p6p6O1O1J01j62j4j5l9m0P0P0j52j51J32J33p0p1p0
1022D28p0n3n2J3J3n1n2J5J4k3k3M3M3lmlml2l2l3l2j8j8j8j7M3M4M3M4j08j07JJL1L1l4l4
1013a4k6k5k6k6M0L9k6k5nmmmJ42J42J80q2r4r3jjL4L5J25j38q3M8O8O7Q8Q8J26j36m8m8j55
$$ plain form
1004 158 134 232 68 60 51 113 174 236 297 258 218 244 270 357 444 377 311 311 310 375 440 487 534 516 497 532 567 610 653 637 751 882 750 691 763
996 763 854 946 888 830 1012 1194 1255 1316 1267 1219 1262 1305 1340 1375 1422 1338 1680 1760 1831 2034 2081 2129 2073 2018 2072 2126 2292 2458 2460 2725 3068 3150
988 3150 3321 3624 3687 3751 3828 4168 4455 4743 5047 5351 5845 6338 6766 7194 8036 8878 9638 10398 11328 12696 14550 17016 20272
982 20272 24315 28062 31372 34061 36313 39265 43528 49077 54190 57423 58645 59815 62471 67335 74035 82245 90893
978 90893 98754 105129 110159 114052 117202 119915 121339 121626 121279 119971 117625 115018 113678 115748 120713 125941 129726 132200
974 132200 133500 133488 130340 124657 119323 116175 112361 105661 96437 87825 82666 80742 79583 77811 76171 76193 77608 78587
969 78587 78265 77506 77848 78977 79352 78066 76877 76824 77116 77407 77743 78340 81161 86868 93036 97717 102562 109593 118277 126349
965 126349 132041 135723 138462 141332 143860 143854 141260 137704 135339 133412 131193 130809 133453 137058 138951 139532 140375 142005 144110
$$ packed form
1004A58k4R8j64qrO2O1O2O1l9m0K6K6Q7Q7o7o6%jO5O5M7M7j8j9L5L5M3M3j6J14J31j32n9P2
996G63R1R2n8n8J82J82O1O1m9m8M3M3L5L5M7q4L42Q0P1K03M7M8n6n5N4N4J66J66KK65L43Q2
988C150J71L03O3O4P7L40K87K88L04L04M94M93M28M28Q42Q42P60P60R30J368J854K466L256
982B0272M043L747L310K689K252K952M263N549N113L233J222J170K656M864O700Q210Q648
978I0893P861O375N030L893L150K713J424K87l47j308k346k607j340K070M965N228L785K474
974A32200J300j2l148n683n334l148l814o700r224q612n159j924j159j772j640K2J415R79
969G8587l22p59L42J129L75j286j189n3K92K91L36N97K821N707O168M681M845P031Q684Q072
965A26349N692L682K739K870K528ok594l556k365j927k219l84K644L605J893N81Q43J630K105
$$ plain form
960 144110 143681 138333 129751 119723 110133 101843 93815 86197 79890 74469 69659 65972 63772 63156 62802 60578 56519 52041
956 52041 47694 43676 39395 34461 28915 23397 18666 14908 12461 10815 9606 8288 7406 6634 6124 5893 5662 5658 6091 6878
951 6878 7054 6488 5484 4983 4745 4995 5683 5616 4763 3781 3061 2740 2550 2463 2245 2042 1840 1810 1779 1748 1718 1721 1725 1619 1513 1550 1587
944 1587 1515 1443 1499 1555 1458 1361 1435 1509 1648 1788 1683 1578 1628 1417 1350 1414 1535 1525 1478 1561 1545 1530 1723 1654 1514 1505 1410 1446 1490 1403 1330
936 1330 1257 1192 1127 1078 1292 1292 1293 1230 1167 1214 1260 1225 1190 1307 1425 1436 1447 1349 1251 1232 1213 1128 1044 1075 1106 1203 1300 1247 1193 1205 1217 1243 1269 1360
928 1360 1452 1355 1257 1313 1369 1326 1282 1348 1414 1439 1464 1554 1644 1713 1781 1741 1700 1609 1517 1426 1335 1317 1299 1347 1395 1344 1293 1177 1061 1169 1277 1385
920 1385 1492 1461 1429 1463 1497 1480 1462 1445 1427 1446 1466 1485 1504 1565 1626 1686 1747 1799 1852 1970 2088 2194 2300 2341 2381 2335 2288 2481 2675 2848 3021
913 3021 3041 3062 3139 3217 3229 3241 3364 3487 3545 3603 3714 3824 3935 4046 4276 4505 4801 5096 5250 5404 5712 6019 6202 6384 6823 7263
$$ packed form
960A44110m29n348q582j0028r590q290q028p618o307n421m810l687k200o16l54k224m059m478
956E2041m347m018m281m934n546n518m731l758k447j646j209j318q82p72n10k31k31mM33P87
951F878J76n66j004n01k38K50O88o7q53r82p20l21j90q7k18k03k02l0l1l1l0LMj06j06L7L7
944A587p2p2N6N6r7r7P4P4J39J40j05j05N0k11o7O4J21j0m7Q3j6j5J93o9j40rr5L6M4q7p3
936A330p3o5o5m9K14%Jo3o3M7M6l5l5J17J18J1J1r8r8j9j9q5q4L1L1R7R7n3n4J2J2K6K6R1
928A360R2r7r8N6N6m3m4O6O6K5K5R0R0O9O8m0m1r1r2r1r1j8j8M8M8n1n1j16j16J08J08J08
920A385J07l1l2L4L4j7j8j7j8J9K0J9J9O1O1O0O1N2N3J18J18J06J06M1M0m6m7J93J94J73J73
913C021K0K1P7P8J2J2J23J23N8N8J11J10J11J11K30K29K96K95J54J54L08L07J83J82M39M40
$$ plain form
906 7263 7609 8218 9247 10801 13191 18554 30408 48031 52718 39744 27934 22594 22295 27503 41044 54148 49001
902 49001 33800 23659 18500 15767 14519 14092 14276 14854 15169 15484 16412 17893 19811 22166 25133 29237 34477 40438
898 40438 49809 67017 82214 79926 73005 74569 83565 101958 138798 204439 304788 467328 648840 664878
894 664878 525737 398300 351731 397327 543200 675401 614131 437526 288459 195935 142489 111696 92356
891 92356 79441 71334 67878 68180 72811 81550 94548 112006 139462 189736 289007 464424 643481 650048 512722
888 512722 393492 356518 411078 557238 668514 588965 409663 264341 175059 122735 91830 73012 61101
884 61101 52085 44730 39050 35380 32956 31494 31026 31520 32976 35918 40164 43798 45449 45264 44598 43933 43922 44175 44586 44998
879 44998 46017 48871 53665 59945 66438 73369 81023 88678 93879 96195 96391 94576 91215 87854 85390 84237 84980 87734
$$ packed form
906G263L46O09J029J554K390N363J1854J7623M687j2974j1810n340k99N208J3541J3104n147
902D9001j5201j0141n159k733j248m27J84N78L15L15R28J481J918K355K967M104N240N961
898D0438R371J7208J5197k288o921J564Q996J8393L6840O5641J00349J62540J81512J6038
894F64878j39141j27437m6569M5596J45873J32201o1270j76605j49067r2524n3446l0793j9340
891I2356j2915q107l456L02M631Q739J2998J7458K7456N0274R9271J75417J79057O567j37326
888E12722j19230l6974N4560J46160J11276p9549j79302j45322q9282n2324l0905j8818j1911
884F1101r016p355n680l670k424j462m68M94J456K942M246L634J651j85o66o65j1K53M11M12
879D4998J019K854M794O280O493O931P654P655N201K316J96j815l361l361k464j153P43K754
$$ plain form
875 87734 92346 99143 107197 114814 119367 120685 120981 121278 120591 117543 112851 107197 100810 94860 90844 89538 90845 94337
871 94337 99686 105998 111155 113601 112524 109261 105430 101598 98647 95957 93698 92576 92863 93762 94088 93976 94072 95304 98856
866 98856 103720 109457 116331 123173 129227 134812 139959 141782 138622 133603 130071 129069 129553 130900 133034 136804 141884 146255
862 146255 148789 151023 153869 157283 160260 160068 154893 145073 133243 122280 113678 107857 104221 101704 99187 96436 94121
857 94121 91458 87834 83367 78289 72266 65455 58311 51167 44728 39775 36270 33378 30991 29392 27864 25724 22895
853 22895 20066 17702 16125 15182 14675 14087 13499 12843 11924 11219 10513 10078 9643 9022 8664 8625 9023 9432 9579 9319 8446 7454
848 7454 6898 6521 6405 6388 6371 6462 6552 6495 6701 6751 6801 6648 6496 6541 6587 6256 5924 5694 5726 5463 5462 5656 5849 5944 6038 5960 6143 6237 6330
841 6330 6670 6878 6827 6513 6128 5742 5645 5549 5635 5721 5591 5331 5061 5055 5258 5199 4889 4579 4471 4363 4276 4189 4232 4276 4276 4277 4211 4146 4261
$$ packed form
875H7734M612O797Q054P617M553J318K96K97o87l048m692n654o387n950m016j306J307L492
871I4337N349O312N157K446j077l263l831l832k951k690k259j122K87Q99L26j12R6J232L552
866I8856M864N737O874O842O054N585N147J823l160n019l532j002M84J347K134L770N080M371
862A46255K534K234K846L414K977j92n175r820j1830j0963q602n821l636k517k517k751k315
857I4121k663l624m467n078o023o811p144p144o439m953l505k892k387j599j528k140k829
853B2895k829k364j577r43n07n88n88o56r19p05p06m35m35o21l58l9L98M09J47k60q73r92
848G454n56l77j16j7j7R1R0n7K06N0N0j53j52M5M6l31l32k30L2k63jJ94J93R5R4p8J83R4R3
841F330L40K08n1l14l85l86r7r6Q6Q6j30k60k70oK03n9l10l10j08j08q7q7M3M4%Jo6o5J15
$$ plain form
834 4261 4376 4281 4186 4227 4400 4293 4449 4667 5016 5689 6626 7790 8343 7925 7377 6853 6941 7551 8598 8698 7836 7090 6605 6456
828 6456 6308 6351 6131 5997 6301 6722 7012 7250 7488 7726 7964 8774 9715 11248 13569 15392 16079 16525 17409 19060 21673 24750
823 24750 27565 29877 32190 35043 38683 41881 43593 44169 45006 47194 50867 55557 61209 66811 70578 71503 71116 72888
818 72888 77546 81875 82445 78669 73581 70603 70160 70563 69831 67623 65677 65773 67530 69211 69755 68952 67887 66896 66036 64923
813 64923 62848 60447 58484 57057 56066 54584 52140 50130 49782 51849 55402 58781 60848 62305 64550 67572 70725 72586
809 72586 71912 69967 68984 68744 69291 70010 69417 67224 65030 64487 65605 67264 68136 69192 72084 77097 82371 86804 90975
804 90975 95103 97569 98221 98086 97142 94188 90059 86542 84402 82699 81138 80188 80288 81000 80923 79533 77644 75624 72585
800 72585 68234 63138 58654 54940 52012 49555 47360 45402 43707 42055 40666 39429 38455 37722 37250 37318 37998 39586 42134
$$ packed form
834D261J15r5r5M1J73j07J56K18L49O73R37J164N53m18n48n24Q8O10J047J00q62p46m85j49
828F456j48M3k20j34L04M21K90K38K38K38K38Q10R41J533K321J823O87M46Q84J651K613L077
823B4750K815K312K313K853L640L198J712N76Q37K188L673M690N652N602L767R25l87J772
818G2888M658M329N70l776n088k978m43M03p32k208j946R6J757J681N44q03j065r91q60j113
813F4923k075k401j963j427r91j482k444k010l48K067L553L379K067J457K245L022L153J861
809G2586o74j945r83k40N47P19n93k193k194n43J118J659Q72J056K892N013N274M433M171
804I0975M128K466O52j35r44k954m129l517k140j703j561r50J00P12p7j390j889k020l039
800G2585m351n096m484l714k928k457k195j958j695j652j389j237r74p33m72O8O80J588K548
$$ plain form
795 42134 45705 50412 56584 64241 73496 83363 93076 101654 108417 112819 115419 116532 116099 114180 111988 110407 109919 110568
790 110568 112769 116631 122176 128857 135102 139160 140924 139278 134278 127092 119185 110842 102064 93156 84967 77390 69693
786 69693 61864 54810 49243 45399 42866 41324 40219 39813 40195 41266 42949 44905 47298 50708 55254 60806 66619 72048
782 72048 77039 82030 87284 93061 99102 105251 110264 113850 115949 117087 117612 117962 118049 118524 118737 118738 118738 118933 118997 118990 119421 120691
777 120691 121174 119515 115321 108178 97976 85916 73988 63357 53513 45241 38630 33560 29801 27114 25038 23746
773 23746 22717 22204 21560 21028 20758 20707 20918 21771 22755 24293 26442 29741 33652 38269 42448 45501 47418 48980 49580 49022
768 49022 46977 44274 40959 37841 35685 34934 35320 37531 41228 46180 50868 54465 55351 53510 48959 43758 38557 33293
763 33293 27767 23219 19458 16754 14487 13401 12314 11878 11442 11953 12203 13333 14333 16526 19157 24648 33023 51508
$$ packed form
795D2134L571M707O172P657R255R867R713Q578O763M402K600J113m33j919k192j581m88O49
790A10568K201L862N545O681O245M058J764j646n000p186p907q343q778q908q189p577p697
786F9693p829p054n567l844k533j542j105m06L82J071J683J956K393L410M546N552N813N429
782G2048M991M991N254N777O041O149N013L586K099J138N25L50Q7M75K13J%J95O4pM31J270
777A20691M83j659m194p143j0202j2060j1928j0631r844q272o611n070l759k687k076j292
773B3746j029n13o44n32k70n1K11Q53R84J538K149L299L911M617M179L053J917J562O00n58
768D9022k045k703l315l118k156p51L86K211L697M952M688L597Q86j841m551n201n201n264
763C3293n526m548l761k704k267j086j087m36m36N11K50J130J000K193K631N491Q375J8485
$$ plain form
759 51508 90187 171725 220478 158453 92319 56786 37078 25838 19232 14558 11545 9493 8229 7334 6702 6067
755 6067 5563 5134 4967 4514 4322 4335 4347 4135 3924 3783 3642 3567 3492 3518 3544 3389 3235 3034 3096 3163 3230 3198 3167 2982 2798 2740 2682 2558
748 2558 2435 2441 2447 2469 2492 2317 2404 2410 2415 2363 2311 2325 2338 2242 2145 2049 1953 1981 2009 1911 1813 1911 1747 1796 1845 1915 1985 2054 2124 2341 2558 2491 2424 2331
740 2331 2238 2145 2052 2056 2060 2065 2069 2109 2148 2253 2359 2374 2389 2322 2255 2283 2048 1813 1840 1755 1670 1755 1839 1723 1607 1758 1909 2135 2099 2057 2015 1798
732 1798 1581 1518 1454 1378 1302 1363 1424 1618 1549 1518 1488 1608 1729 1833 1937 2114 2030 2093 2156 2081 2007 2069 2131 2344 2296 2285 2275 2300 2325 2284 2244
724 2244 2175 2106 1927 1749 1696 1643 1591 1538 1589 1640 1692 1743 1784 1825 1713 1602 1596 1591 1586 1581 1580 1578 1790 1740 1786 1833 1928 2024 2203 2382 2408 2434 2564 2694
716 2694 2540 2385 2475 2565 2590 2614 2568 2521 2696 2739 2612 2748 2932 2986 2922 2858 2900 2943 2971 2737 2782 2827 2983 3140 3297 3454 3613 3773
709 3773 4063 4354 4752 5151 5549 5948 6478 7007 7351 7958 8743 9965 11810 14443 17805 21605 26564 32659 37672 38925
$$ packed form
759E1508L8679Q1538M8753o2025o6134l5533j9708j1240o606m674l013k052j264q95o32o35
755F067n04m29j67m53j92J3J2k12k11j41j41p5p5K6K6j55j54k01O2O7O7l2l1j85j84n8n8j24
748B558j23OOK2K3j75Q7ONn2n2J4J3r6r7r6r6K8K8r8r8R8j64M9M9P0P0O9P0K17K17o7o7r3
740B331r3r3r3MMNMM0L9J05J06J5J5o7o7K8k35k35K7q5q5Q5Q4j16j16J51J51K26l6m2m2k17
732A798k17o3o4p6p6O1O1J94o9l1l0J20J21J04J04J77q4O3O3p5p4O2O2K13m8j1j0K5K5m1m0
724B244o9o9j79j78n3n3n2n3N1N1N2N1M1M1j12j11onnnjkK12n0M6M7R5R6J79J79K6K6J30J30
716B694j54j55R0R0K5K4m6m7J75M3j27J36J84N4o4o4M2M3K8k34M5M5J56J57J57J57J59J60
709C773K90K91L98L99L98L99N30N29L44O07P85J222J845K633L362L800M959O095N013J253
$$ plain form
704 38925 37384 34532 31127 27854 25562 24756 25504 27738 31754 37431 43635 48528 50066 47845 43645 39883 37356 35091
700 35091 32125 28897 26390 25195 25180 25602 25510 24457 23462 22905 22785 22402 21984 22003 22664 23456 24140 24386 24340 24732 26276 29306
695 29306 34063 41181 50727 62634 75929 88262 96606 98918 95154 88330 81739 76810 73936 73946 77148 83759 93255
690 93255 104936 117582 128043 132241 128484 118728 106261 94056 83338 74702 69301 67768 69120 71374 72316 70996
687 70996 69065 67578 64955 60092 54267 48869 44607 41940 40585 39639 38956 38251 37983 38802 40758 44266 49260 55433 62742
682 62742 71265 81973 93238 101269 105256 107058 108899 111878 114802 115365 114825 116470 121437 128940 137800 148846 160330
678 160330 166655 165909 160356 151256 142156 136809 133822 132327 132143 130474 126268 120468 114929 111475 108983 104021 94775 85043
673 85043 79071 78420 82228 86936 89284 89583 89882 90552 92184 97035 104770 114275 125265 136048 147443 158888 168321
$$ packed form
704C8925j541k852l405l273k292q06P48K234M016N677O204M893J538k221m200l762k527k265
700C5091k966l228k507j195j5M22r2j053r95n57j20l83m18J9O61P92O84K46m6L92J544L030
695B9306M757P118R546J1907J3295J2333Q344K312l764o824o591m929k874J0L202O611R496
690I3255J1681J2646J0461M198l757r756j2467j2205j0718q636n401j533J352K254R42j320
687G0996j931j487k623m863n825n398m262k667j355r46o83p05k68Q19J956L508M994O173P309
682F2742Q523J0708J1265Q031L987J802J841K979K924N63n40J645M967P503Q860J1046J1484
678A60330O325p46n553r100r100n347k987j495j84j669m206n800n539l454k492m962r246r732
673H5043n972o51L808M708K348K99K99O70J632M851P735R505J0990J0783J1395J1445R433
$$ plain form
669 168321 177153 180653 173005 161074 151366 141659 129760 118124 108482 101550 97664 95789 94559 92717 89654 85104
665 85104 80151 77207 75910 73477 70060 69178 71364 74687 75895 73869 69635 65401 64090 67938 77495 89063 97779
661 97779 102036 101858 95299 82259 67732 56261 48898 45108 44554 47339 53883 61215 63912 58780 48840 39150 32171
657 32171 27580 24651 22655 21446 20505 19565 19006 18710 18063 17415 17058 16962 16852 17179 18139 20062 23146 27018 30496 31264 29884
652 29884 28066 26696 25938 26765 29603 34801 42184 51049 58252 60942 59173 53970 46930 40076 35058 32250 31628 32754
647 32754 34667 36573 37868 38364 37374 34292 29898 26018 23100 21209 19930 19131 18596 17830 16628 14993 13359 12075 11227
643 11227 10375 9959 9852 10182 10928 11935 12817 12561 11366 9909 8605 7738 7395 7315 7609 8515 10240 13277 17013 19788 19634
638 19634 16595 12878 9949 7992 6996 6438 6142 6207 6884 8129 9811 11722 12847 11688 9392 7173 5565 4548 3968
$$ packed form
669A68321Q832L500p648j1931r708r707j1899j1636r642o932l886j875j230j842l063m550
665H5104m953k944j297k433l417q82K186L323J208k026m234m234j311L848R557J1568Q716
661I7779M257j78o559j3040j4527j1471p363l790n54K785O544P332K697n132r940r690o979
657C2171m591k929j996j209r41r40n59k96o47o48l57r6j10L27R60J923L084L872L478P68j380
652B9884j818j370p58Q27K838N198P383Q865P203K690j769n203p040o854n018k808o22J126
647C2754J913J906J295M96r90l082m394l880k918j891j279p99n35p66j202j635j634j284q48
643A1227q52m16j07L30P46J007Q82k56j195j457j304q67l43q0K94R06J725L037L736K775j54
638A9634l039l717k929j957r96n58k96O5O77J245J682J911J125j159k296k219j608j017n80
$$ plain form
633 3968 3508 3049 2887 2725 2481 2499 2445 2392 2437 2219 2195 2170 2129 2088 2164 2240 2382 2524 2528 2531 2437 2605 2617 2368 2217 2065 2041 2017 1993 1969
626 1969 1966 1963 2025 2088 2192 2295 2202 2109 2096 2082 2069 2056 2088 2120 1998 1877 1812 1747 1747 1747 1794 1841 1734 1628 1621 1613 1715 1817 1760 1702 1644 1586 1525 1463
617 1463 1555 1646 1582 1517 1519 1520 1595 1670 1745 1820 1730 1640 1615 1590 1565 1539 1666 1793 1813 1834 1789 1744 1748 1752 1500 1509 1510 1510 1526 1543 1495 1448 1466 1484 1494 1504 1405
608 1405 1306 1283 1261 1092 1184 1159 1135 1061 987 959 931 904 876 994 1113 1122 1131 1218 1304 1238 1171 1122 1073 1025 976 1115 1254 1284 1314 1299 1284 1335 1385
600 1385 1289 1192 1205 1217 1189 1161 1214 1006 874 742 791 839 872 904 870 837 819 801 1040 1016 983 950 966 983 927 872 817 762 796 831 713 595
592 595 684 773 862 951 893 836 844 853 747 641 863 1085 1050 1015 980 945 984 1024 1064 1103 1022 942 795 649 770 891 623 618 652 685 625 566
585 566 671 776 919 800 723 647 406 428 547 666 605 543 556 568 581 593 651 708 700 692 688 684 680 677 693 710 726 743 675 607 605 602 763 924 991
576 991 797 711 624 587 549 562 574 587 599 539 479 573 666 541 416 428 440 577 452 475 498 498 499 499 500 517 533 747 961 806 652 623 594
$$ packed form
633C968m60m59j62j62k44J8n4n3M5k18k4k5m1m1P6P6J42J42MLr4J68J2k49j51j52k4k4k4k4
626A969llO2O3J04J03r3r3j3j4j3j3L2L2j22j21o5o5%%M7M7j07j06pqJ02J02n7n8n8n8o1o2
617A463R2R1o4o5KJP5P5P5P5r0r0k5k5k5k6J27J27K0K1m5m5MMk52RJ%J6J7m8m7J8J8J0J0r9
608A405r9k3k2j69R2k5k4p4p4k8k8k7k8J18J19RRQ7Q6o6o7m9m9m8m9J39J39L0L0j5j5N1N0
600A385r6r7J3J2k8k8N3k08j32j32M9M8L3L2l4l3j8j8K39k4l3l3J6J7n6n5n5n5L4L5j18j18
592E95Q9Q9Q9Q9n8n7QRj06j06K22K22l5l5l5l5L9M0M0L9q1q0j47j46J21J21k68nL4L3o0n9
585E66J05J05J43j19p7p6k41K2J19J19o1o2J3J2J3J2N8N7qqmmmlJ6J7J6J7o8o8klJ61J61O7
576I91j94q6q7l7l8J3J2J3J2o0o0R4R3j25j25J2J2J37j25K3K3%J%JJ7J6K14K14j55j54k9k9
$$ plain form
568 594 550 768 730 692 672 653 617 581 666 488 376 526 523 520 550 581 574 829 784 739 648 557 532 506 517 529 622 715 588 722 710 697 590
560 590 482 588 694 610 788 752 717 802 887 863 838 1003 1167 1223 1278 1143 1009 940 870 870 870 869 869 933 996 995 993 892 792 801 809 878 947 879
552 879 812 675 800 888 975 993 1010 902 794 891 725 707 689 710 730 734 738 789 578 623 669 603 536 666 797 878 959 1188 1154 1115 1076 873
544 873 932 866 799 798 797 805 550 448 608 624 639 671 703 772 841 784 727 881 772 877 1419 1782 1882 1540 1198 1007 1077 1000 923 972 1020
536 1020 1135 1249 1209 1170 1130 1091 927 763 780 796 472 586 634 682 825 706 626 545 615 684 644 604 663 721 583 445 562 679 616
529 616 553 619 946 886 825 782 739 701 925 1109 1292 1383 1474 1478 1483 1203 923 862 801 806 810 816 821 892 962 806 650 735 819 803 786 704 622 718
521 718 815 969 1123 1246 1238 1129 1283 1430 1141 967 1054 957 861 846 831 841 851 861 870 779 687 705 723 751 780 808 837 837 837 919 738 774 809
513 809 782 1017 1126 1104 1173 1241 1148 1055 963 870 779 689 754 688 492 557 532 507 524 541 558 575 578 582 520 457 548 639 731 822 824 826 894 962 937 911
$$ packed form
568E94m4K18l8l8k0j9l6l6Q5j78j12J50llL0L1pK55m5m5r1r1k5k6J1J2R3R3j27J34j2j3j07
560E90j08J06J06q4J78l6l5Q5Q5k4k5J65J64N6N5j35j34o9p0%%j%O4O3jkj01j00RQO9O9o8
552H79o7j37J25Q8Q7J8J7j08j08R7j66j8j8K1K0MMN1k11M5M6o6o7J30J31Q1Q1K29l4l9l9k03
544H73N9o6o7jjQk55j02J60J6J5L2L2O9O9n7n7J54j09J05N42L63J00l42l42j91P0p7p7M9M8
536A020J15J14m0l9m0l9j64j64J7J6l24J14M8M8J43j19q0q1P0O9m0m0N9N8j38j38J17J17o3
529F16o3O6L27o0o1m3m3l8K24J84J83R1R1MNk80k80o1o1NMONP1P0j56j56Q5Q4j6j7q2q2R6
521G18R7J54J54J23qj09J54J47k89j74Q7r7r6j5j5J0J0J0Rr1r2J8J8K8K9K8K9%%Q2j81L6L5
513H09k7K35J09k2O9O8r3r3r2r3r1r0O5o6j96O5k5k5J7J7J7J7LMo2o3R1R1R2R1KKO8O8k5k6
$$ plain form
504 911 995 1079 1054 1029 1274 1650 2207 3026 3667 3872 3437 3001 2823 2645 2667 2688 2470 2251 2177 2103 1974 2108 2239 2108 2050 2255 2236
497 2236 2085 2148 2342 2447 2553 3006 3896 5474 8364 11068 9663 6814 5102 4007 3524 3278 3033 2465 2160 2093 1764 1664
492 1664 1564 1460 1356 1252 1148 1170 1192 1323 1454 1617 1779 1903 2290 2821 3352 4063 4337 3878 3157 2408 1921 1752 1582 1495
486 1495 1407 1131 855 820 784 818 853 903 953 739 787 703 620 437 517 586 655 774 632 571 510 607 704 648 592 601 611 604 597 697 534 518
478 518 503 458 412 520 627 640 652 615 578 427 539 651 501 530 559 489 682 647 612 659 705 722 739 631 522 628 471 462 453 580
471 580 706 609 512 362 475 457 439 177 178 272 365 287 208 267 325 496 406 462 519 428 338 400 462 399 337 274 211 267 323 314 304 307 311 265 219
462 219 22 88 264 177 285 394 453 250 102 216 302 389 462 272 339 406 388 369 284 200 228 256 285 313 357 400 438 213 218 222 276 330
454 330 275 221 276 331 317 303 288 274 230 186 142 97 154 210 200 191 164 137 126 115 -59 27 114 -61 -11 38 121 204 293 120 95 69 86 103
$$ packed form
504I11Q4Q4k5k5K45L76N57Q19O41K05m35m36j78j78K2K1k18k19p4p4j29J34J31j31n8K05j9
497B236j51O3J94J05J06M53Q90J578K890K704j405k849j712j095m83k46k45n68l05o7l29j00
492A664j00j04j04j04j04K2K2J31J31J63J62J24L87N31N31P11K74m59p21p49m87j69j70q7
486A495q8k76k76l5l6L4L5N0N0k14M8q4q3j83Q0O9O9J19j42o1o1R7R7n6n6RJ0ppJ00j63j6
478E18j5m5m6J08J07J3J2l7l7j51J12J12j50K9K9p0J93l5l5M7M6J7J7j08j09J06j57rrJ27
471E80J26r7r7j50J13j8j8k62JR4R3p8p9N9N8J71r0N6N7r1r0O2O2o3o2o3o3N6N6rj0LMm6m6
462B19j97O6J76q7J08J09N9k03j48J14Q6Q7P3j90O7O7j8j9q5q4K8K8K9K8M4M3L8k25NMN4N4
454C30n5n4N5N5j4j4j5j4m4m4m4m5N7N6j0rk7k7j1j1j74Q6Q7j75N0M9Q3Q3Q9j73k5k6J7J7
$$ plain form
446 103 104 104 232 97 110 123 59 -4 -2 0 109 219 220 221 216 212 142 71 192 312 296 280 217 417 316 215 125 34 97 159 116 74 -148 65
438 65 83 102 148 194 218 242 266 291 194 97 110 122 118 115 324 271 306 340 359 377 404 430 391 352 359 365 371 377 334 291 248 205 267 330 195 61 163
429 163 266 302 339 433 527 469 410 257 104 235 366 323 279 236 192 240 288 270 252 192 132 137 142 201 259 208 157 188 218 249 279 277 274 272 269 196
420 196 123 158 194 173 151 130 108 87 67 111 156 120 84 114 143 185 227 160 93 165 237 243 250 242 234 292 349 337 325 313 301 254 208 226 245 189 132
411 132 185 238 167 95 133 171 195 219 134 49 98 146 130 113 202 292 229 166 221 277 179 82 128 174 220 266 137 7 74 141 196 251 306 361
403 361 299 237 175 112 121 130 205 279 195 112 181 250 169 88 117 145 181 217 143 70 110 150 81 11 75 140 204 268 245 222 198 175 184 193 136 79 99
394 99 118 138 157 109 60 121 181 201 221 240 260 328 396 268 140 127 115 168 222 317 412 310 208 155 103 159 216 233 250 202 154 175 196 217
385 217 239 276 313 240 168 190 212 168 125 149 174 134 93 78 63 49 34 102 170 128 87 114 141 167 194 155 116 186 256 237 218 134 50 -37 -125
$$ packed form
446A03J%J28j35J3J3o4o3KKJ09J10JJnmp0p1J21J20j6j6o3K00j01j01r0r1O3O2m3m2k22K13
438F5J8J9M6M6K4K4K4K5r7r7J3J2mlK09n3L5L4J9J8K7K6l9l9POOOm3m3m3m3O2O3j35j34J02
429A63J03L6L7R4R4n8n9j53j53J31J31m3m4m3m4M8M8j8j8o0o0NNN9N8n1n1L1L0L1L0klklp3
420A96p3L5L6k1k2k1k2k1k0M4M5l6l6L0K9M2M2o7o7P2P2OPqqN8N7j2j2j2j2m7m6J8J9n6n7
411A32N3N3p1p2L8L8K4K4q5q5M9M8j6j7Q9R0o3o3N5N6r8r7M6M6M6M6j29j30O7O7N5N5N5N5
403C61o2o2o2o3RRP5P4q4q3O9O9q1q1K9K8L6L6p4p3M0M0o9p0O4O5O4O4k3k3k4k3RRn7n7K0
394I9J9K0J9m8m9O1O0K0K0J9K0O8O8j28j28j3j2N3N4R5R5j02j02n3n2N6N7J7J7m8m8K1K1K1
385B17K2L7L7p3p2K2K2m4m3K4K5m0m1j5j5j4j5O8O8m2m1K7K7K6K7l9l9P0P0j9j9q4q4q7q8
$$ plain form
377 -125 -16 92 51 9 77 145 208 270 223 177 176 176 110 44 87 130 108 85 58 32 5 -21 44 109 108 108 135 162 189 215 163 111 168 225 200 175
368 175 215 256 249 243 236 230 195 159 124 89 90 92 93 95 144 193 -57 -46 -20 5 32 58 216 111 154 197 220 243 157 71 137 204 189 174 284 133 -18
359 -18 92 79 67 218 108 78 49 113 177 196 214 233 252 223 194 166 137 141 145 149 153 167 181 195 209 165 120 75 30 92 153 149 145 209 273 168 62
350 62 189 53 65 77 116 156 129 103 120 138 303 206 202 197 177 156 131 106 146 187 170 153 284 152 218 284 268 252 181 111 106 101 57 13 -30
341 -30 -74 -6 61 129 197 99 1 56 111 80 49 83 118 77 37 61 86 74 62 116 170 173 177 189 201 79 88 154 -40 80 -60 -125 72 141 -51
333 -51 -162 -142 48 109 112 246 107 -31 -9 13 27 42 57 71 96 120 144 168 172 175 179 182 153 124 95 65 81 97 113 128 111 94 77 60 47 34
324 34 21 8 130 252 134 15 11 7 3 -1 127 255 186 118 79 40 67 94 89 85 146 207 154 102 49 -2 73 149 225 301 230 158 153 147 208 270 222
315 222 174 137 100 208 317 324 199 10 82 -3 42 30 17 31 45 2 89 10 193 127 61 69 77 167 257 99 203 159 116 86 56 135 215
$$ packed form
377a25J09J08m1m2O8O8O3O2m7m6j%o6o6M3M3k2k3k7k6k7k6O5O5j%K7K7K7K6n2n2N7N7k5k5
368A75M0M1popol5l6l5l5JKJKM9M9k50J1K6K5K7K6J58j05M3M3K3K3q6q6O6O7j5j5J10j51j51
359a8J10j3j2J51j10l0k9O4O4J9J8J9J9k9k9k8k9MMMMJ4J4J4J4m4m5m5m5O2O1mmO4O4j05j06
350F2J27j36J2J2L9M0k7k6J7J8J65r7mnk0k1k5k5M0M1j7j7J31j32O6O6j6j6p1p0nnm4m4m3
341c0m4O8O7O8O8r8r8N5N5l1l1L4L5m1m0K4K5j2j2N4N4LMJ2J2j22RO6j94J20j40o5J97O9j92
333e1j11K0J90O1LJ34j39j38K2K2J4J5J5J4K5K4K4K4MLMLk9k9k9l0J6J6J6J5j7j7j7j7j3j3
324C4j3j3J22J22j18j19mmmmJ28J28o9o8l9l9K7K7nmO1O1n3n2n3n1P5P6P6P6p1p2noO1O2m8
315B22m8l7l7J08J09Pj25j89P2q5M5j2j3J4J4m3Q7p9J83o6o6QQR0R0j58J04m4m3l0l0P9Q0
$$ plain form
307 215 163 111 60 8 54 101 295 227 112 -3 17 38 75 113 150 187 132 77 88 98 44 -9 -144 -18 63 145 -13 90 41 -7 68 144
299 144 102 60 126 193 115 37 52 67 145 -39 5 50 -98 14 127 -21 29 80 115 150 65 -19 4 28 83 138 128 117 3 -110 -28 54
291 54 78 103 62 22 -6 -35 2 39 39 39 39 39 121 203 175 148 108 68 28 -11 82 176 117 58 63 69 58 48 138 -33 8 49 80 111 142 173 77 -18
282 -18 -5 7 -21 -51 28 107 84 62 39 16 171 326 256 187 -55 -35 76 189 138 87 145 204 161 119 76 33 15 -3 -21 -40 -46 -52 -74 -97
274 -97 96 28 42 56 94 133 105 78 62 46 31 15 23 32 41 50 60 70 31 -7 -119 29 31 33 10 -12 46 104 -57 42 59 77 99 121 143 165 165
264 165 165 148 132 201 8 55 102 272 180 82 -14 7 29 51 74 67 61 164 267 176 85 130 176 194 -49 6 62 126 190 100 11 38 64 173
256 173 19 52 84 100 115 10 -95 82 261 138 15 28 42 226 148 153 157 61 -34 16 -194 -156 -118 -31 55 71 87 103 119 194 269 234
248 234 200 112 24 90 155 143 132 105 77 160 -18 24 -64 -48 -31 -23 -15 37 90 34 -21 50 121 126 131 44 -43 65 174 165 157 39 -78 52 183
$$ packed form
307B15n2n2n1n2M6M7J94o8j15j15K0K1L7L8L7L7n5n5J1J0n4n3j35J26Q1Q2j58J03m9m8P5P6
299A44m2m2O6O7p8p8J5J5P8j84M4M5j48J12J13j48N0N1L5L5q5q4K3K4N5N5j0j1j14j13Q2Q2
291E4K4K5m1m0k8k9L7L7%%%%Q2Q2k8k7m0m0m0l9R3R4n9n9NOj1j0R0j71M1M1L1L1L1L1r6r5
282a8J3J2k8l0P9P9k3k2k3k3J55J55p0o9k42K0J11J13n1n1N8N9m3m2m3m3j8j8j8j9ook2k3
274i7J93o8J4J4L8L9k8k7j6j6j5j6QRRRJ0J0l9l8j12J48KKk3k2N8N8j61R9J7J8K2K2K2K2%
264A65%j7j6O9j93M7M7J70r2r8r6K1K2K2K3poJ03J03r1r1M5M6J8k43N5N6O4O4r0q9K7K6J09
256A73j54L3L2J6J5j05j05J77J79j23j23J3J4J84p8NMr6r5N0k10L8L8Q7Q6J6J6J6J6P5P5l5
248B34l4q8q8O6O5j2j1k7k8Q3j78M2q8J6J7QQN2N3n6n5P1P1NNq7q7J08J09rqj18j17J30J31
$$ plain form
240 183 252 189 15 104 147 189 166 142 119 96 10 -75 -96 -116 -87 -59 -14 30 -100 30 30 -100 -68 93 65 36 97 159 111 63 103 144 119
232 119 93 117 141 56 -29 36 101 13 -74 -86 -99 -112 -124 -95 -66 -103 -139 -110 -81 -52 -23 60 144 163 182 167 151 70 -10 66 142 155 37 -132
223 -132 -39 50 140 154 169 74 -20 -60 -101 39 179 308 175 50 56 98 140 124 108 34 -39 11 63 -43 111 119 127 84 41 -91 -93 127 86
215 86 208 200 154 108 54 0 12 24 35 47 98 150 92 34 -45 -126 -98 -70 4 79 44 9 22 36 49 62 3 -55 82 220 137 55 39 22 26
207 26 30 99 169 123 78 185 293 259 225 257 289 190 90 188 285 200 115 139 164 135 106 77 48 63 79 28 -21 -4 12 -36 -85 9 103 88 73
198 73 54 36 17 -1 87 177 157 138 46 -45 -28 -11 -21 -30 25 81 74 67 60 53 66 79 93 106 4 -96 42 181 90 0 -24 -49 -32 -15 2 19
189 19 107 195 87 -21 29 80 66 52 -39 -130 -25 80 34 -12 -58 -104 -30 44 53 62 -30 -123 -20 82 39 -3 19 41 -1 -44 65 175 237
181 237 298 207 115 103 90 78 66 56 46 36 27 70 114 91 69 75 81 87 93 80 66 -36 -8 49 -155 -206 4 64 -5 13 33 73 112 42 -27 -17
$$ packed form
240A83O9o3j74Q9M3M2k3k4k3k3q6q5k1k0K9K8M5M4j30J30%j30L2J61k8k9O1O2m8m8M0M1k5
232A19k6K4K4q5q5O5O5q8q7j2j3j3j2K9K9l7l6K9K9K9K9Q3Q4J9J9j5j6q1q0P6P6J3j18j69
223a32R3Q9R0J4J5r5r4m0m1J40J40J29j33j25OM2M2j6j6p4p3N0N2j06J54QQm3m3j32kK20m1
215H6J22qm6m6n4n4J2J2J1J2N1N2n8n8p9q1K8K8P4P5l5l5J3J4J3J3n9n8J37J38q3q2j6j7M
207B6MO9P0m6m5J07J08l4l4L2L2r9j00R8R7q5q5K4K5k9k9k9k9J5J6n1m9J7J6m8m9R4R4j5j5
198G3j9j8j9j8Q8R0k0j9r2r1J7J7j0rN5N6ppppJ3J3J4J3j02j00J38J39r1r0k4k5J7J7J7J7
189A9Q8Q8j08j08N0N1j4j4r1r1J05J05m6m6m6m6P4P4RRr2r3J03J02m3m2K2K2m2m3J09J10O2
181B37O1r1r2j2j3j2j2j0j0j0rM3M4k3k2OOOOj3j4j02K8N7k04n1K10O0o9J8K0M0L9p0o9J0
$$ plain form
173 -17 -8 66 141 145 150 154 158 126 93 126 159 148 137 60 -16 -44 -72 36 145 290 173 -17 54 155 125 120 115 98 80 -18 144 89 35 107 178 153
164 153 128 104 79 91 103 181 259 109 -40 6 53 74 95 26 88 240 130 20 42 190 76 142 78 -72 39 135 100 37 -25 -30 -36 31
156 31 98 56 14 -70 -156 -89 -21 -59 -97 17 133 80 27 40 52 81 109 137 166 117 69 -5 137 212 68 -4 53 39 156 265 156 149 143
148 143 57 190 182 43 -8 -59 -59 -58 7 74 56 39 88 136 28 -79 -77 -76 -56 -35 -15 4 -17 -40 -43 -47 -154 44 70 -33 159 221 34 -20
140 -20 -10 0 -47 -94 -40 12 1 -10 -19 -28 28 84 17 -50 -9 32 -70 -174 -80 12 3 -4 95 196 78 -39 -48 -56 42 141 88 34 -51 -138 -115 -92
131 -92 24 142 106 70 -10 -91 -63 -34 -60 -85 -111 -137 -199 -262 -127 6 96 185 29 4 152 -6 -1 134 166 67 115 164 55 -53 -52 -52
123 -52 4 61 105 149 210 53 -54 -31 -32 -32 -24 -16 -17 -17 -127 -236 -101 34 -70 -175 -80 13 0 -15 -82 -148 -62 24 -31 -87 10 107 72 38 69
114 69 100 104 108 46 -15 10 37 -2 -41 6 54 168 282 74 -132 -99 -66 -7 52 45 39 24 9 -5 -21 -59 -97 -26 44 -45 -135 -72 -10 2 14 26
$$ packed form
173a7RP4P5MNMMl2l3L3L3j1j1p7p6k8k8J08J09J45j17j90P1J01l0nnj7j8r8J62n5n4P2P1k5
164A53k5k4k5J2J2P8P8j50j49M6M7K1K1o9O2J52j10j10K2J48j14O6o4j50J11R6l5o3o2noO7
156C1O7m2m2q4q6O7O8l8l8J14J16n3n3J3J2K9K8K8K9m9m8p4J42P5j44p2N7j4J17J09j09po
148A43q6J33qj39n1n1%JO5O7j8j7M9M8j08j07KJK0K1K0J9k1k3lmj07J98K6j03J92O2j87n4
140b0J0J0m7m7N4N2j1j1rrN6N6o7o7M1M1j02j04R4R2rpR9J01j18j17rqR8R9n3n4q5q7K3K3
131i2J16J18l6l6q0q1K8K9k6k5k6k6o2o3J35J33R0Q9j56k5J48j58NJ35L2r9M8M9j09j08J%
123e2N6N7M4M4O1j57j07K3j%QQj%j10j09J35J35j04j05R5R3j3j5o7o6Q6Q6n5n6R7R7l5l4L1
114F9L1MMo2o1K5K7l9l9M7M8J14J14k08k06L3L3N9N9poj5j5j4j6l8l8P1P0q9r0O3O2J2J2J2
$$ plain form
106 26 39 53 67 16 -35 -20 -6 7 22 26 30 -30 -91 -144 -197 -141 -85 -61 -38 -14 8 -10 -29 17 64 32 0 34 68 74 80 21 -37 100 239 137
97 137 34 -1 -38 -9 19 -25 -71 -51 -31 12 56 -8 -72 8 89 105 121 28 -63 -46 -29 -39 -49 -59 -70 17 106 112 118 227 74 -87 13 5 -134
88 -134 -183 -232 -94 44 -57 -159 -19 120 -37 -64 -113 99 34 99 75 51 34 18 30 41 52 64 85 106 127 148 70 -6 69 144 35
81 35 -73 -28 15 27 40 118 197 132 66 1 -63 -93 -124 -88 -53 -80 -106 -67 -27 -21 -15 -74 -134 -49 36 102 37 -44 135 94 53 105 157 39 -77
72 -77 91 -2 24 -79 -136 -61 5 -59 -38 -18 59 138 102 67 32 -3 53 110 166 223 203 183 163 143 114 85 55 26 28 30 2 237 141 176 -9
63 -9 66 235 142 96 49 67 -45 71 -74 -95 14 -75 -165 -167 -170 -107 -44 -22 0 -87 -174 -65 44 88 132 50 -31 -3 23 15 8 66 124 112 100
55 100 23 -54 -34 -14 -85 -24 18 -201 -68 64 22 -19 47 114 12 -89 -82 -75 -36 2 -24 -51 -54 -58 -61 -65 -138 -211 -88 35 3 -29 -61 -93 45
46 45 185 135 86 18 80 217 91 127 163 163 32 -173 -117 23 -97 -313 -91 -22 45 -90 -226 -122 -18 -12 -7 -111 -214 -187 -160 -141
$$ packed form
106B6J3J4J4n1n1J5J4J3J5MMo0o1n3n3N6N6K4K3K4K2j8j9M6M7l2l2L4L4OOn9n8J37J39j02
97A37j03l5l7K9K8m4m6K0K0M3M4o4o4Q0Q1J6J6r3r1J7J7j0j0j0j1Q7Q9OOJ09j53j61J00qj39
88a34m9m9J38J38j01j02J40J39j57k7m9K12o5O5k4k4j7j6J2J1J1J2K1K1K1K1p8p6P5P5j09
81C5j08M5M3J2J3P8P9o5o6o5o4l0l1L6L5k7k6L9M0OOn9o0Q5Q5O6o5q1J79m1m1N2N2j18j16
72g7J68r3K6j03n7P5O6o4K1K0P7P9l6l5l5l5N6N7N6N7k0k0k0k0k9k9l0k9KKk8K35r6L5j85
63iP5J69r3m6m7J8j12J16j45k1J09q9r0klO3O3K2K2q7q7J09J09M4M4q2q1K8K6qpN8N8j2j2
55A00p7p7K0K0p1O1M2k19J33J32m2m1O6O7j02j01PPL9L8k6k7lmlmp3p3J23J23l2l2l2l2J38
46D5J40n0m9o8O2J37j26L6L6%j31k05N6J40j20k16K22O9O7j35j36J04J04ONj04j03K7K7J9
$$ plain form
39 -141 -122 -26 -61 -187 -51 172 134 6 -253 -157 -62 -41 -19 -51 -83 -95 22 134 -16 -175 -71 115 39 -172 -122 -16 88 56 25
32 25 19 14 9 3 -43 -90 -44 0 -189 56 123 58 122 55 -36 3 170 74 41 9 -112 29 170 49 55 61 132 -57 -74 -90 -57 -24 -89 -155 -155 -154
23 -154 -77 0 12 24 19 13 7 2 76 151 70 120 130 -121 66 254 135 17 51 85 116 147 69 -8 -2 2 73 144 59 -24 43 111 65 19 83 146
14 146 103 60 17 -25 -9 6 -68 -11 144 37 20 3 -14 -32 14 62 -29 -121 -147 -174 -69 34 30 25 -16 -57 -99 -141 -94 -47 -65 -84 -58 -31 -70
6 -70 -109 -131 -152 -108 -64 8 81 89 96 73 50 26 3 -5 -15 -25 -34 47 129 -12 -154 -322 -228 -25 -83 -101 -118 1 120 7 -105 -111 13 93 -88
-3 -88 -57 -25 98 91 -54 60 22 -15 -84 109 131 21 2 -16 -32 -48 -48 -47 -152 5 162 58 0 -56 -65 -73 -64 -54 -45 -36 -14 7 29 50 2 -45
-12 -45 -27 -10 -62 -114 -166 -218 -140 -63 52 -93 -50 -7 -78 112 223 72 -53 -48 -2 42 14 -13 118 -12 4 21 29 37 -20 -77 -24 28 16
-20 16 3 -33 -71 -43 -14 -128 -242 -159 -77 -38 0 -71 -141 -137 -133 92 55 -2 71 54 37 16 -3 -24 -45 -42 -40 -37 -34 -64 -94 -124 -154 -67 19 106 194
$$ packed form
39a41J9R6l5j26J36K23l8j28k59R6R5K1K2l2l2j2J17J12j50j59J04J86p6k11N0J06J04l2l1
32B5onnom6m7M6M4j89K45O7o5O4o7r1L9J67r6l3l2j21J41J41j21OOP1j89j7j6L3L3o5o6%J
23a54P7P7J2J2noonP4P5q1N0J0k51J87J88j19j18L4L4L1L1p8p7OMP1P1q5q3O7O8m6m6O4O3
14A46m3m3m3m2J6J5p4N7J55j07j7j7j7j8M6M8r1r2k6k7J05J03mnm1m1m2m2M7M7j8j9K6K7l9
6g0l9k2k1M4M4P2P3QPk3k3k4k3qj0j0rQ1Q2j41j42j68R4K03n8j8j7J19J19j13j12oJ24Q0j81
-3h8L1L2J23pj45J14l8l7o9J93K2j10j9j8j6j6%Jj05J57J57j04n8n6rqRJ0RRK2K1K2K1m8m7
-12d5J8J7n2n2n2n2P8P7J15j45M3M3p1J90J11j51j25NM6M4k8k7J31j30J6J7QQn7n7N3N2j2
-20A6j3l6l8K8K9j14j14Q3Q2L9L8p1p0MMK25l7n7P3j7j7k1j9k1k1LKLLl0l0l0l0Q7Q6Q7Q8
$$ plain form
-29 194 165 136 107 78 -6 -91 -110 -129 -131 -132 -134 -135 -93 -50 -7 34 81 128 109 90 78 65 53 40 -17 -74 -67 -59 24 109 127 146 -59 -264 -16 -30 14
-38 14 59 -58 84 128 172 249 63 4 -55 -65 -76 -75 -75 -156 24 36 48 76 105 61 17 -26 -70 -63 -57 -34 -11 -139 -6 -20 -34 -28 -22 -65 -109 -146
-47 -146 77 170 1 -34 -70 -57 -44 30 104 48 -8 0 6 14 21 -17 -55 -242 -166 -134 -102 -54 -6 -34 -62 -91 -119 -65 -11 41 95 72 49 -104 -258
-55 -258 -108 40 58 76 39 1 29 56 70 85 -32 -149 -68 12 110 -54 -68 -81 -128 87 91 95 50 5 -105 -216 -92 31 -135 -39 -92
-63 -92 -144 -117 -90 -63 -36 -74 -113 -20 71 -33 -138 -129 -119 119 96 2 -92 -30 31 -37 -106 -96 -86 -76 -66 72 212 133 55 -29 -113 -197 -281 -145
-71 -145 -8 -3 2 -16 -35 -54 -73 -88 -103 29 -100 -74 -48 -96 -12 -131 11 -57 3 7 11 24 36 2 -31 -66 -100 -87 -75 -71 -67 52 40 119 -64
-80 -64 -71 -78 -102 -126 -81 -37 -58 -79 -112 -145 -47 50 71 92 -16 -126 -62 1 0 -2 21 45 69 94 56 19 146 10 -114 23 -60 -274 -182 -89
-88 -89 -70 -51 50 151 35 -81 -79 -77 -75 -72 -70 -68 -65 -63 -52 -42 -31 -21 96 213 200 186 77 -31 77 186 89 -8 25 59 -7 -74 -52 -160
$$ packed form
-29A94k9k9k9k9q4q5j9j9kjkjM2M3M3M1M7M7j9j9j2j3j2j3n7n7PQQ3Q5J8J9k05k05K48j4M4
-38A4M5j17J42M4M4P7j86n9n9j0j1J%q1J80J2J2K8K9m4m4m3m4POK3K3j28J33j4j4OOm3m4l7
-47a46K23R3j69l5l6J3J3P4P4n6n6QOQPl8l8j87P6L2L2M8M8k8k8k9k8N4N4N2N4k3k3j53j54
-55b58J50J48J8J8l7l8K8K7J4J5j17j17Q1Q0R8j64j4j3m7K15MMm5m5j10j11J24J23j66R6n3
-63i2n2K7K7K7K7l8l9R3R1j04j05RJ0K38k3r4r4O2O1o8o9J0J0J0J0J38J40p9p8q4q4q4q4J36
-71a45J37NNj8j9j9j9j5j5J32j29K6K6m8Q4j19J42o8O0MMJ3J2l4l3l5l4J3J2MMJ19j2P9j83
-80f4ppk4k4M5M4k1k1l3l3R8R7K1K1j08j10O4O3jkK3K4K4K5l8l7J27j36j24J37q3k14R2R3
-88h9J9J9J01J01j16j16KKKLKKLKJ1J0J1J0J17J17j3j4j09j08J08J09r7r7L3L4o6o7K2j08
$$ plain form
-96 -160 -231 -40 256 116 -66 12 121 99 47 -3 -63 -123 -76 -29 17 64 52 40 28 16 28 39 50 62 82 103 -29 -162 -122 -82 -43 -3
-104 -3 67 137 12 -113 -102 -91 -81 -70 -19 31 -27 -86 10 107 95 83 99 116 132 149 72 -3 73 149 125 101 76 52 -48 -149 -97 -44 -61 -77
-112 -77 -93 -109 -120 -130 -75 -21 -10 0 11 22 -17 -57 -96 -136 -72 -8 55 120 70 21 -27 -77 -80 -84 20 126 56 -12 -16 -20 23 67 111 155 50 -54
-121 -54 -93 -133 -118 -104 -25 54 -61 -176 -139 -102 -73 -44 -15 12 -17 -47 32 111 151 192 123 54 8 -36 26 90 46 2 -41 -85 -53 -20 12 44
-129 44 54 64 -34 -133 -135 -138 -74 -11 53 119 119 119 61 3 -53 -111 -98 -86 -74 -62 -50 -37 -17 2 -59 8 -111 -12 -131 -118 -56 4 2 0 -1 -3 -10 -18 -12 -5
-139 -5 -125 -27 14 55 9 -36 -82 -128 -46 36 -26 -88 -108 3 97 -25 -79 -132 -82 -31 -84 -7 198 186 -28 -24 93 80 -160 -8 62 1
-147 1 -58 11 0 -10 -50 -90 -20 48 21 -5 -53 28 134 21 39 57 23 -9 -65 10 99 -30 45 -10 -40 -71 42 156 90 24 23 154 201
-155 201 29 -84 -67 -8 50 -114 -60 -151 -242 -123 -4 8 21 -31 -84 -143 -202 -152 -101 1 105 55 6 19 31 44 57 -74 -206 -98
$$ packed form
-96a60p1J91K96j40j82P8J09k2n2n0o0o0M7M7M6M7j2j2j2j2J2J1J1J2K0K1j32j33M0M0L9M0
-104cP0P0j25j25J1J1J0J1N1N0n8n9R6R7j2j2J6J7J6J7p7p5P6P6k4k4k5k4j00j01N2N3j7j6
-112g7j6j6j1j0N5N4J1J0J1J1l9m0l9m0O4O4O3O5n0m9m8n0lmJ04J06p0o8mmM3M4M4M4j05j04
-121e4l9m0J5J4P9P9j15j15L7L7K9K9K9K7k9l0P9P9M0M1o9o9m6m4O2O4m4m4m3m4L2L3L2L2
-129D4J0J0r8r9klO4O3O4O6%%n8n8n6n8J3J2J2J2J2J3K0J9o1O7j19R9j19J3O2O0kkjkpqOP
-139ej20R8M1M1m6m5m6m6Q2Q2o2o2k0J11R4j22n4n3N0N1n3P7K05j2k14MJ17j3k40J52P0o1
-147An9O9j1j0m0m0P0O8k7k6m8Q1J06j13J8J8l4l2n6P5Q9j29P5n5l0l1J13J14o6o6jJ31M7
-155B01j72j13J7N9N8j64N4r1r1J19J19J2J3n2n3n9n9N0N1J02J04n0m9J3J2J3J3j31j32J08
$$ plain form
-162 -98 9 39 69 99 128 57 -13 24 62 79 96 113 130 134 137 141 144 38 -67 22 112 10 -92 -41 9 -13 -35 7 51 27 3 -85 -174 -140 -107
-171 -107 -89 -72 71 -46 131 45 16 -12 88 -71 -123 -174 -89 -3 45 94 34 -26 -76 -127 -178 -228 -150 -71 -102 -132 -36 60 90 121 93 64
-179 64 -29 -123 -126 -129 -131 -134 -141 -149 -91 -32 -18 -4 10 24 2 -18 -149 -280 -217 -155 -92 -29 90 210 177 144 103 62 20 -20 -57 -95 -67 -39 -28 -18
-188 -18 -117 -216 -106 2 -40 -84 -102 -119 -71 -23 -46 -69 -91 -114 -38 36 3 -30 -48 -65 -83 -100 -22 55 128 -61 -46 -30 -31 -32 -40 -48 8 66 2 -61
-196 -61 -16 28 -20 -69 -118 -167 -132 -97 -128 -159 -112 -65 -128 -190 -122 -54 -52 -50 -80 -111 -75 -40 -77 -113 -56 0 139 17 58 100 7 176 88 0 -4
-205 -4 -10 -16 -22 -26 -31 29 90 57 24 -73 -172 -170 -168 -117 -66 45 -103 -122 -141 119 117 67 16 60 103 130 157 271 121 -27 85 -18 -122 -56 8
-214 8 -24 -57 -90 -123 -55 12 14 17 8 0 -9 -18 29 78 17 -43 -68 -92 -117 -142 -35 70 67 65 42 19 23 27 -224 -39 -35 -31 -34 -38 -41 -45 -62 -79 -162 -245 -181 -117
-224 -117 -53 10 27 44 62 79 -1 -83 -55 -27 40 107 109 111 48 -13 -10 -7 -70 -132 -129 -126 -69 -12 -20 -28 3 36 69 101 103 105 107 109 22 -63 -41 -18 -49 -80 -111
$$ packed form
-162i8J07L0L0L0K9p1p0L7L8J7J7J7J7MLMLj06j05Q9R0j02j02N1N0k2k2M2M4k4k4q8q9L4L3
-171a07J8J7J43j17J77q6k9k8J00j59n2n1Q5Q6M8M9o0o0n0n1n1n0P8P9l1l0R6R6L0L1k8k9
-179F4r3r4llklpqN8N9J4J4J4J4k2k0j31j31O3O2O3O3J19J20l3l3m1m1m2m0l7l8K8K8J1J0
-188a8r9r9J10J08m2m4j8j7M8M8k3k3k2k3P6P4l3l3j8j7j8j7P8P7P3j89J5J6jjqqN6N8o4o3
-196f1M5M4m8m9m9m9L5L5l1l1M7M7o3o2O8O8KKl0l1L6L5l7l6N7N6J39j22M1M2r3J69q8q8m
-205dooomnO0O1l3l3r7r9KKN1N1J11j48j9j9K60kn0n1M4M3K7K7J14j50j48J12j03j04O6O4
-214Hl2l3l3l3O8O7KLrqrrM7M9o1o0k5k4k5k5J07J05lkk3k3MMk51J85MMlmlmj7j7q3q3O4O4
-224a17O4O3J7J7J8J7q0q2K8K8O7O7KKo3o1LLo3o2LLN7N7qqL1L3L3L2KKKKq7q5K2K3l1l1l1
$$ plain form
-234 -111 -142 -110 -78 19 116 109 101 94 86 156 227 188 149 29 -90 -14 62 27 -7 22 52 12 -27 -1 23 0 -23 -46 -70 -73 -76 -79 -82 0 83 100 117 95
-243 95 73 51 29 -30 -89 -38 11 -67 -146 -45 56 130 -57 -98 -139 -90 -41 7 55 -3 -62 -56 -49 -49 -49 -66 -82 15 -148 -99 -50 -35 -20 -5 9
-252 9 -75 -160 11 -78 16 112 37 -36 -77 -119 -95 -70 -14 42 -10 -62 -8 45 -9 -65 -29 5 -24 -54 -40 -26 -62 -97 -132 95 66 37 4 -28 -61
-260 -61 -94 -195 -295 -155 -15 -72 -128 -76 -23 -44 -66 -87 -108 -110 -112 -49 14 -22 -59 -97 -134 -129 -124 -119 -113 -48 16 81 147 108 69 31 -7 -18 -29 -57
-269 -57 -85 18 -140 -151 -163 -125 -87 -49 -11 -57 -104 -41 20 -12 -44 -159 -11 -4 2 -40 -82 -42 -2 37 77 79 81 17 -46 -17 11 40 68 44 19
-278 19 -4 -29 -37 -45 -53 -61 -12 36 19 3 30 58 -23 -105 -108 -111 33 -83 -68 -52 -53 -53 -38 -22 -55 -89 -174 2 -32 -68 -96 -124 -42 39 72 106 30 -44
-287 -44 -52 -59 -66 -74 -71 -67 -64 -61 -70 -79 -88 -97 -124 -151 -112 -73 -58 -42 -92 -142 -183 -224 -199 -174 -130 -86 -43 0 -1 -4 -6 -9 -48 -88 -62 -36 -23 -11 0 12 8 3 0 -4 3 10
-298 10 -47 -105 -111 -116 -122 -128 -20 87 -1 -89 -81 -73 0 74 -38 -151 -155 -158 -91 -24 -66 -108 -71 -33 -62 -90 -61 -32 -3 25 31 37 43 50 28 7 -13 -34 18
$$ packed form
-234a11l1L2L2R7R7pqpqP0P1l9l9j20j19P6P6l5l4K9L0m0l9K6K4k3k3k3k4llllQ2Q3J7J7k2
-243I5k2k2k2n9n9N1M9p8p9J01J01P4j87m1m1M9M9M8M8n8n9OP%%j7j6R7j63M9M9J5J5J5J4
-252Iq4q5J71q9R4R6p5p3m1m2K4K5N6N6n2n2N4N3n4n6L6L4k9l0J4J4l6l5l5K27k9k9l3l2l3
-260f1l3j01j00J40J40n7n6N2N3k1k2k1k1kkO3O3l6l7l8l7NNNOO5O4O5O6l9l9l8l8j1j1k8
-269e7k8J03j58j1j2L8L8L8L8m6m7O3O1l2l2j15J48POm2m2M0M0L9M0KKo4o3K9K8K9K8k4k5
-278A9k3k5qqqqM9M8j7j6K7K8q1q2llJ44j16J5J6j%J5J6l3l4q5J76l4l6k8k8Q2Q1L3L4p6p4
-287d4qppqLMLLrrrrk7k7L9L9J5J6n0n0m1m1K5K5M4M4M3M3jlkll9m0K6K6J3J2J1J2mnlmPP
-298A0n7n8onooJ08J07q8q8QQP3P4j12j13mlO7O7m2m2L7L8k9k8K9K9K9K8OOOPk2k1k0k1N2
$$ plain form
-308 18 71 125 178 41 -94 -78 -61 -115 -169 -223 -277 -182 -87 -145 -203 -170 -138 -40 57 -27 -112 -131 -150 -82 -14 -54 -95 -46 2 -13 -29 31 92 -42
-316 -42 -178 -85 6 -9 -26 -47 -67 -88 -108 -134 -160 -121 -81 -65 -48 -48 -48 41 -130 -62 5 125 -17 -11 -6 62 131 91 51 -67 -187 -110 -33 -21
-324 -21 -10 39 -172 -179 -186 47 18 -5 -30 -71 -112 -70 -29 -53 -77 -100 -124 -83 -41 -70 -100 -129 -158 -128 -97 -83 -68 -4 -203 -144 -86 -67 -49 -30 -11
-333 -11 -33 -54 -76 -98 -97 -97 -135 88 127 166 155 145 126 108 199 289 127 -34 -44 -53 -86 -118 -151 -183 -153 -124 -176 -228 -57 -149 -93 -37 -61 -85 -109
-341 -109 -133 -46 39 33 27 -90 54 199 81 87 92 -66 37 -42 -123 -34 53 20 -11 -110 -208 -121 -34 -144 -254 -129 -3 -31 -59 0 59 9
-349 9 -40 -38 -36 -33 -31 -46 -61 -77 -92 -37 17 6 -4 -16 -29 -41 -53 -53 -53 -53 -53 -10 32 76 119 127 135 77 19 -19 -58 -31 -5 68 143 108 -145 -168 -59 26
-359 26 -17 105 98 11 -75 -129 -51 9 -147 -113 -79 -59 -38 -28 -18 -8 1 48 95 76 58 -5 -69 -133 -197 -167 -136 -114 -92 22 6 -71 68 97
-367 97 -91 -166 -22 33 -42 43 -1 -52 -103 -53 -3 0 2 4 7 -19 -46 -74 -101 -125 -148 -238 -327 -281 -235 -202 47 -15 -79 -64 -49 -83 -117 -33 50 -115
$$ packed form
-308A8N3N4N3j37j35J6J7n4n4n4n4R5R5n8n8L3L2R8R7q4q5j9j9O8O8m0m1M9M8j5j6O0O1j34
-316d2j36R3R1j5j7k1k0k1k0k6k6L9M0J6J7%%Q9j71O8O7J20j42ONO8O9m0m0j18j20P7P7J2
-324b1J1M9k11ppK33k9k3k5m1m1M2M1k4k4k3k4M1M2k9l0k9k9L0L1J4J5O4j99N9N8J9J8J9J9
-333a1k2k1k2k2J%l8K23L9L9j1j0j9j8R1R0j62j61j0rl3l2l3l2L0K9n2n2J71r2N6N6k4k4k4
-341a09k4Q7Q5ooj17J44J45j18ONj58J03p9q1Q9Q7l3l1r9r8Q7Q7j10j10J25J26k8k8N9N9n0
-349Im9KKLKj5j5j6j5N5N4j1j0j2j3j2j2%%%%M3M2M4M3QQn8n8l8l9K7K6P3P5l5k53k3J09Q5
-359B6m3J22pq7q6n4P8O0j56L4L4K0K1J0J0J0RM7M7j9j8o3o4o4o4L0L1K2K2J14j6p7J39K9
-367I7j88p5J44N5p5Q5m4n1n1N0N0LKKLk6k7k8k7k4k3r0q9M6M6L3K49o2o4J5J5l4l4Q4Q3j65
$$ plain form
-376 -115 -150 8 -51 -1 -82 -111 -10 -137 -264 -187 -109 -126 -143 -160 -176 -135 -94 -118 -142 -162 -182 -203 -223 -171 -119 -67 -15 -40 -64 -89 -113 -113 -113 -113
-385 -113 -113 -92 -71 30 -128 -94 -59 -24 9 -142 -32 -108 77 107 137 74 12 -51 -115 -114 -113 -107 -101 -95 -89 -138 -186 -71 -218 -232 15 -52 -121 -71
-393 -71 -20 193 145 15 148 117 85 54 23 -24 -72 76 -37 -3 30 -76 -183 -284 -124 -148 -171 -179 -186 -23 139 62 -14 -2 9 -88 -185
-400 -185 -138 -90 -43 4 -27 -59 -92 -124 -148 -171 -130 -88 -6 74 -12 -100 29 -103 -88 -73 -27 19 0 -18 13 44 10 -23 -73 -123 -168 49 5
-408 5 -39 41 122 44 -33 -46 -58 42 143 47 -48 -31 -15 0 17 -57 -133 -55 22 -42 -107 -63 -19 -20 -21 -22 -23 32 88 -41 -171 151 -51 -105 101
-417 101 87 73 75 77 61 45 -35 -116 -102 -89 -75 -61 -106 -151 -87 -23 53 130 54 -21 -92 -162 -124 -85 -125 -164 -94 -25 -40 -55 -4 46 -48 -142 -127 -112
-426 -112 -34 43 12 -18 -68 -118 -103 -87 -119 -151 -151 -150 -325 23 12 1 5 9 13 17 21 24 27 31 1 -27 -57 -86 -49 -12 23 60 83 106 64 22 -22 -66 -45
-435 -45 -23 60 144 32 -80 14 108 93 78 -80 -240 -159 -78 -25 27 14 2 -12 -28 -43 -58 -92 -126 -160 -194 -108 -22 -1 18 -44 -107 -208 -47
$$ packed form
-376a15l5J58n9N0q1k9J01j27j27P7P8j7j7j7j6M1M1k4k4k0k0k1k0N2N2N2N2k5k4k5k4%%%
-385a13%K1K1J01j58L4L5L5L3j51J10p6J85L0L0o3o2o3o4JJOOOOm9m8J15j47j4K47o7o9N0
-393g1N1K13m8j30J33l1l2l1l1m7m8J48j13L4L3j06j07j01J60k4k3qpJ63J62p7p6J2J1r7r7
-400a85M7M8M7M7l1l2l3l2k4k3M1M2Q2Q0q6q8J29j32J5J5M6M6j9j8L1L1l4l3n0n0m5K17m4
-408Em4Q0Q1p8p7j3j2J00J01r6r5J7J6J5J7p4p6P8P7o4o5M4M4jjjjN5N6j29j30L22k02n4K06
-417A01j4j4KKj6j6q0q1J4J3J4J4m5m5O4O4P6P7p6p5p1p0L8L9m0l9P0O9j5j5N1N0r4r4J5J5
-426a12P8P7l1l0n0n0J5J6l2l2%Jj75L48j1j1MMMMMLLMl0k8l0k9L7L7L5L7K3K3m2m2m4m4K1
-435d5K2Q3Q4j12j12R4R4j5j5j58j60Q1Q1N3N2j3j2j4j6j5j5l4l4l4l4Q6Q6K1J9o2o3j01J61
$$ plain form
-443 -47 -54 -61 -216 -108 -48 -251 -93 64 14 -35 -84 -134 -90 -47 -69 -91 -65 -39 -78 -118 -106 -93 28 150 151 153 154 156 128 99 70 42 -24 -91 -48
-452 -48 -6 -108 -211 -57 -165 -131 -97 -14 68 -50 -168 -134 -100 2 105 54 4 97 190 87 -16 -25 -35 -28 -21 -95 91 38 -14 -149 -22
-460 -22 104 -30 -64 -98 -83 -68 -72 -75 -14 47 27 7 -11 -31 -103 -174 -49 75 72 70 68 66 -19 -105 -37 29 -54 -139 49 -23 -149 -12 -39 -66 -47
-468 -47 -29 -10 7 -59 -127 -42 43 23 2 -17 -37 -38 -39 -56 -74 -12 -212 -112 -12 46 105 55 4 20 35 34 33 70 -154 -109 67 27 -11 -42 -73
-477 -73 -5 63 178 30 -102 -105 -44 15 -6 -27 16 60 18 -23 43 110 17 -74 32 7 -132 -9 -42 -75 42 161 126 92 -29 -150 -118
-484 -118 -87 -100 -113 -127 -140 -94 -49 78 -56 -2 51 89 126 48 -30 -43 -56 52 160 72 -15 45 106 58 10 11 12 13 14 -7 -28 -50 -72 -45 -19
-493 -19 6 32 58 84 1 -81 -49 -16 16 48 42 35 28 21 -29 -79 -195 -311 -223 -134 -111 -88 -82 -77 -71 -66 -32 1 101 201 140 80 -44 -170 -205 -240
-502 -240 -209 -179 -120 -60 -66 -73 -48 -22 -14 -5 191 126 -47 40 8 -22 -37 -52 -143 -233 -83 66 -41 -149 -61 26 19 12 5 -2 -19 -37 -54 -72 -48 -25
$$ packed form
-443d7ppj55J08O0k03J58J57n0m9m9n0M4M3k2k2K6K6l9m0J2J3J21J22JKJKk8k9k9k8o6o7M3
-452d8M2j02j03J54j08L4L4Q3Q2j18j18L4L4J02J03n1n0R3R3j03j03rj0PPp4J86n3n2j35J27
-460b2J26j34l4l4J5J5mlO1O1k0k0j8k0p2p1J25J24lkkkq5q6O8O6q3q5J88p2j26J37k7k7J9
-468d7J8J9J7o6o8Q5Q5k0k1j9k0jjj7j8O2k00J00J00N8N9n0n1J6J5jjL7k24M5J76m0l8l1l1
-477g3O8O8J15j48j32lO1N9k1k1M3M4m2m1O6O7r3r1J06k5j39J23l3l3J17J19l5l4j21j21L2
-484a18L1j3j3j4j3M6M5J27j34N4N3L8L7p8p8j3j3J08J08q8q7O0O1m8m8JJJJk1k1k2k2K7K6
-493a9K5K6K6K6q3q2L2L3L2L2opppn0n0j16j16Q8Q9K3K3ONONL4L3J00J00o1o0j24j26l5l5
-502b40L1L0N9O0opK5K6QRJ96o5j73Q7l2l0j5j5r1r0J50J49j07j08Q8Q7ppppj7j8j7j8K4K3
$$ plain form
-510 -25 80 -76 -62 -48 -132 45 39 33 -22 -77 -75 -73 -70 -68 -73 -77 -147 -218 -128 -38 -57 -76 -87 -98 -44 10 -32 -75 95 3 -56 -115 -125 -135 -173 -211 67
-520 67 83 -139 -101 -30 41 -3 -49 -1 46 183 57 79 101 22 -55 -24 6 47 87 -35 103 203 40 41 43 32 21 9 -1 -57 -114 -105 -97 -43
-528 -43 10 -17 -45 132 47 -42 -132 -106 -80 -54 -28 0 30 -5 -41 -24 -7 -137 -5 -36 -66 -227 -126 -45 36 -34 -105 127 98 19 -58 41
-536 41 142 193 -16 3 24 28 32 -61 -155 -118 -81 -139 -197 -189 -181 -99 -17 -50 -83 -176 -6 -49 -92 -78 -64 -99 -134 -286 -177 -83 9 -15 -41 -148
-544 -148 6 14 22 -18 -59 -79 -98 13 125 56 -11 -80 -148 -148 -149 -1 -116 -87 -58 -45 -32 -60 -88 30 -112 -131 -151 -203 6 -4 -15 -9 -4 33
-552 33 71 109 147 72 -1 -91 80 47 15 0 -15 -39 -63 -87 -111 -107 -103 -115 -128 -25 -185 -231 -14 153 58 12 -32 -231 -167 114 134 -25
-560 -25 -186 -144 -102 -46 10 -64 -138 -112 -85 -125 -164 -187 -210 -167 -124 -47 29 122 -46 59 165 123 81 129 176 93 9 12 14 -48 -111 -69 -28 12
-568 12 53 36 18 -15 -49 117 21 73 125 54 -16 26 70 159 -13 -39 -65 -22 20 62 105 98 92 85 79 39 0 -39 -78 -84 -90 50 -70 -90 -110 -146
$$ packed form
-510b5J05j56J4J4q4J77oon5n5KKLKnmp0p1R0R0j9j9j1j1N4N4m2m3J70r2n9n9j0j0l8l8K78
-520F7J6k22L8P1P1m4m6M8M7J37j26K2K2p9p7L1L0M1M0j22J38J00j63JKj1j1j2j0n6n7RQN4
-528d3N3k7k8J77q5q9r0K6K6K6K6K8L0l5l6J7J7j30J32l1l0j61J01Q1Q1p0p1K32k9p9p7R9
-536D1J01N1k09J9K1MMr3r4L7L7n8n8QQQ2Q2l3l3r3J70m3m3J4J4l5l5j52J09R4R2k4k6j07
-544a48J54QQm0m1k0j9J11J12o9o7o9o8%jJ48j15K9K9J3J3k8k8J18j42j9k0n2K09j0j1ONL7
-552C3L8L8L8p5p3r0J71l3l2j5j5k4k4k4k4MMj2j3J03j60m6K17J67r5m6m4j99O4K81K0j59
-560b5j61M2M2N6N6p4p4K6K7m0l9k3k3M3M3P7P6R3j68J05J06m2m2M8M7q3q4LKo2o3M2M1M0
-568A2M1j7j8l3l4J66r6N2N2p1p0M2M4Q9j72k6k6M3M2M2M3popom0l9l9l9ooJ40j20k0k0l6
$$ plain form
-577 -146 -182 -191 -200 -78 43 75 107 8 -90 -8 72 -63 -200 -57 85 163 241 107 -26 -29 -32 -21 -11 -49 -87 -193 -36 -26 -17 -27 -38 -49
-585 -49 -60 -96 -131 -167 -202 -134 -66 18 -159 -48 61 40 19 -123 -5 -34 -63 -138 -214 -70 72 143 213 66 -81 -64 -46 36 119 105 91
-593 91 77 63 -17 -99 -66 -32 134 38 -220 -42 8 58 218 115 29 -56 -27 0 -80 -161 -111 -60 -23 14 -13 -40 -26 -11 2 16 -83 -183
-600 -183 -87 9 21 33 45 57 120 182 135 89 30 -28 64 158 126 95 128 162 97 31 32 32 -10 -54 -32 -10 -14 -18 -132 -246 -191 -137 -82 -28 -62 -97
-609 -97 -66 -35 -51 -68 -19 29 30 31 -77 -185 -170 -154 -138 -122 -100 -77 10 98 -8 -115 -69 -23 -65 -107 -84 -60 -59 -57 9 76 -11 -99 -33 31 -26
-618 -26 -84 -76 -68 -3 62 63 63 -81 -225 -129 -33 -34 -34 30 95 -3 -102 -135 -168 -97 -26 -64 -103 -81 -59 -103 -147 -32 81 43 5 -54 -115 -66 -16 63
-627 63 143 70 -2 -29 -57 -85 -113 -102 -92 27 147 33 -80 2 85 119 154 78 3 -15 -34 -118 -203 -142 -81 -168 7 1 -4 71 147 42 -62
-635 -62 -58 -54 37 129 -35 61 100 140 42 -54 -97 -140 29 -61 -71 -80 -171 -262 -128 5 -13 -31 -46 -61 -75 -90 -54 -18 -48 -78 16 111 53 -4 -13
$$ packed form
-577a46l6rrJ22J21L2L2r9r8Q2Q0j35j37J43J42P8P8j34j33llJ1J0l8l8j06J57J0Rj0j1j1
-585d9j1l6l5l6l5O8O8Q4j77J11J09k1k1j42J18k9k9p5p6J44J42P1P0j47j47J7J8Q2Q3j4j4
-593I1j4j4q0q2L3L4J66r6k58J78N0N0J60j03q6q5K9K7q0q1N0N1L7L7k7k7J4J5J3J4r9j00
-600a83R6R6J2J2J2J2O3O2m7m6n9n8R2R4l2l1L3L4o5o6J%m2m4K2K2mmj14j14N5N4N5N4l4l5
-609i7L1L1j6j7M9M8JJj08j08J5J6J6J6K2K3Q7Q8j06j07M6M6m2m2K3K4JKO6O7q7q8O6O4n7
-618b6n8QQO5O5J%j44j44R6R6j%O4O5r8r9l3l3P1P1l8l9K2K2m4m4J15J13l8l8n9o1M9N0P9
-627F3Q0p3p2k7k8k8k8J1J0J19J20j14j13Q2Q3L4L5p6p5j8j9q4q5O1O1q7J75onP5P6j05j04
-635f2MMR1R2j64R6L9M0r8r6m3m3J69r0j0rr1r1J34J33j8j8j5j5j4j5L6L6l0l0R4R5n8n7r
$$ plain form
-643 -13 -22 -31 -40 -37 -35 -32 -30 -7 15 -27 -70 -35 -1 32 66 24 -17 -76 -134 0 -125 -22 80 -148 -115 -120 -125 -151 -178 -242 -45 -106 -168 -121 -73 -8 -204
-652 -204 -187 -171 -120 -69 -18 32 -25 -84 -76 -69 -134 -199 -155 -111 -59 -8 -66 -124 -60 3 1 0 0 0 -15 -31 66 -98 -50 -1 -33 -64 13 91 -18 -129
-661 -129 0 130 60 -9 -13 -18 -48 -78 -109 -139 -98 -56 -80 -105 -46 13 -37 -87 43 173 79 -13 -86 102 94 -175 -113 -52 -7 37 70 103 70
-669 70 37 41 44 129 -47 -38 -29 28 86 4 -76 -4 66 109 152 42 -67 -77 -88 -98 -109 -74 -40 -5 28 -32 -94 -139 -185 -266 -84 31 -115 -35
-677 -35 45 0 -45 -33 -21 -9 2 53 105 9 175 150 125 7 -110 -38 32 -22 -76 26 -133 -183 28 -11 -51 -75 -99 -17 63 145 226 149
-685 149 72 -4 -81 -60 -38 -17 3 -16 -36 -56 -76 -74 -73 -5 61 33 5 42 79 30 -17 0 15 23 31 -107 14 -76 -168 -134 -100 -136 -171 -97 -24 129
-694 129 282 151 20 -10 -41 36 114 120 126 132 138 53 -30 -5 19 -66 -152 -85 -18 -83 -147 -146 -146 -154 -163 -106 -49 4 58 113 167 37 -92 -69 -46 -6
-703 -6 34 9 -15 -24 -32 24 81 25 -30 23 76 60 44 28 12 88 164 43 -76 -49 -22 -61 -100 -108 -115 -123 -131 -76 -21 33 88 16 -56 67 191 150 109
$$ packed form
-643a3rrrLKLKK3K2m2m3L5L4L3L4m2m1n9n8J34j25J03J02k28L3nnk6k7o4J97o1o2M7M8O5j96
-652b04J7J6N1N1N1N0n7n9QPo5o5M4M4N2N1n8n8O4O3kj%%j5j6R7j64M8M9l2l1P7P8j09j11
-661a29J29J30p0o9mnl0l0l1l0M1M2k4k5N9N9n0n0J30J30r4r2p3J88qk69O2O1M5M4L3L3l3
-669G0l3MLQ5j76RRN7N8q2q0P2P0M3M3j10j09j0j1j0j1L5L4L5L3o0o2m5m6q1J82J15j46Q0
-677c5Q0m5m5J2J2J2J1N1N2r6J66k5k5j18j17P2P0n4n4J02j59n0K11l9m0k4k4Q2Q0Q2Q1p7
-685A49p7p6p7K1K2K1K0j9k0k0k0KJO8O6k8k8L7L7m9m7J7J5QQj38J21r0r2L4L4l6l5P4P3J53
-694A29J53j31j31l0l1P7P8OOOOq5q3K5K4q5q6O7O7o5o4J%qrN7N7N3N4N5N4j30j29K3K3M0
-703fM0k5k4rqN6N7n6n5N3N3j6j6j6j6P6P6j21j19K7K7l9l9qpqqN5N5N4N5p2p2J23J24m1m1
$$ plain form
-712 109 2 -104 -129 -155 -71 12 34 56 13 -29 -12 5 23 41 -47 -135 -71 -7 1 10 18 27 86 145 139 133 80 28 41 54 67 81 28 -23 -53 -82 -46
-721 -46 -10 -8 -6 -4 -2 -24 -45 41 129 112 94 11 -71 -41 -10 -45 -80 -95 -109 -15 79 45 11 -22 -56 -97 -138 -26 85 109 134 5 -122 -132 -142
-730 -142 -151 -161 -129 -96 -129 -162 -142 -121 -101 -81 -81 -81 -81 -82 -44 -6 -77 -148 -40 67 65 64 42 21 0 -22 -83 -145 -97 -50 -31 -11 -58 -105 -43 17 -1
-739 -1 -19 71 -55 -82 22 39 -162 -79 2 -42 -86 -131 -176 -69 37 -87 -212 -186 -28 68 -52 46 144 32 51 139 8 82 24 -4
-746 -4 -33 -71 -108 -121 -134 -38 58 -83 -226 -114 -2 -149 -78 -158 -18 146 93 -49 -61 -68 -74 -73 -71 -100 -129 -157 -186 -144 -102 5 113 113 112 2
-754 2 -106 -40 26 92 159 83 8 41 75 -3 -81 36 155 146 137 129 120 20 -80 16 112 43 -26 13 53 80 108 70 32 39 46 54 61 -25 -112 -133 -154
-763 -154 -108 -62 -81 -101 -75 -49 -24 1 -29 -59 -24 10 53 96 30 -36 -13 8 30 53 -65 -183 -105 -27 0 25 -57 -140 -34 71 67 63 17 -28
-772 -28 -9 10 26 43 -49 -141 -92 -43 -59 -75 -99 -123 -148 -172 -130 -87 -44 -2 63 129 85 42 -27 -98 -168 -239 -175 -112 -48 14 44 74 -4 -83 -105
$$ packed form
-712A09j07j06k5k6Q4Q3K2K2m3m2J7J7J8J8q8q8O4O4QRQRN9N9oon3n2J3J3J3J4n3n1l0k9L6
-721d6L6KKKKk2k1Q6Q8j7j8q3q2L0L1l5l5j5j4R4R4l4l4l3l4m1m1J12J11K4K5j29j27j0j0
-730a42rj0L2L3l3l3K0K1K0K0%%%jL8L8p1p1J08J07kjk2k1k1k2o1o2M8M7J9K0m7m7O2O0j8
-739aj8R0j26k7J04J7k01Q3Q1m4m4m5m5J07J06j24j25K6J58R6j20R8R8j12J9Q8j31P4n8k8
-746dk9l8l7j3j3R6R6j41j43J12J12j47P1q0J40J64n3j42j2poJKk9k9k8k9M2M2J07J08%jj10
-754Bj08O6O6O6O7p6p5L3L4p8p8J17J19rrqrj00j00R6R6o9o9L9M0K7K8l8l8PPQPq6q7k1k1
-763a54M6M6j9k0K6K6K5K5l0l0L5L4M3M3o6o6K3K1K2K3j18j18P8P8K7K5q2q3J06J05mmm6m5
-772b8J9J9J6J7r2r2M9M9j6j6k4k4k5k4M2M3M3M2O5O6m4m3o9p1p0p1O4O3O4O2L0L0p8p9k2
$$ plain form
-780 -105 -127 -149 -171 -102 -34 -31 -29 -51 -72 14 101 93 85 77 69 29 -10 -49 -89 -60 -32 -4 24 63 102 5 -92 -217 -80 18 116 107 97 88 79 -21 -122
-789 -122 -113 -105 -14 75 40 4 116 -34 -37 -41 -2 36 -33 -103 3 110 21 -67 -91 -115 13 142 26 -90 -53 -17 1 19 120 -41 -28 -15
-797 -15 -18 -21 -29 -36 -43 -51 -35 -20 -4 10 25 41 56 71 55 39 23 7 18 30 41 52 46 39 33 27 -16 -59 50 159 131 102 220 76 -18 -114 -3 108
-806 108 163 -44 48 140 25 -88 -50 -12 -23 -34 20 75 16 -41 36 114 238 101 111 121 140 159 70 -19 -31 -42 11 65 23 -18 5 29
-814 29 -82 -195 -110 -26 0 24 -97 43 69 95 29 -37 28 94 160 226 186 146 106 67 60 53 111 170 73 -23 32 88 87 86 19 -46 71 190
-822 190 112 34 18 2 -14 -30 -41 -53 1 55 60 65 5 -55 -17 19 56 94 9 -74 -5 62 150 238 85 -67 52 172 52 -67 0 68 26
-831 26 -14 -116 -218 -210 -202 -77 46 62 78 21 -35 -92 -149 -130 -111 -157 -204 -156 -108 -126 -143 -124 -105 -21 63 21 -21 2 25 42 58 75 92 70
-839 70 49 27 6 -84 -176 -157 -139 -53 32 53 74 81 88 96 103 46 -10 -2 6 44 82 10 -60 -17 26 -39 -105 -86 -66 18 103 69 36 2 -31 23 77 66
$$ packed form
-780a05k2k2k2O9O8LKk2k1Q6Q7qqqqm0l9l9m0K9K8K8K8L9L9r7r7j25J37R8R8rj0rrj00j01
-789a22RQR1Q9l5l6J12j50lmL9L8o9p0J06J07q9q8k4k4J28J29j16j16L7L6J8J8J01j61J3J3
-797a5llqppqJ6J5J6J4J5J6J5J5j6j6j6j6J1J2J1J1opoom3m3J09J09k8k9J18j44r4r6J11J11
-806A08N5k07R2R2j15j13L8L8j1j1N4N5n9n7P7P8J24j37J0J0J9J9q9q9j2j1N3N4m2m1K3K4
-814B9j11j13Q5Q4K6K4j21J40K6K6o6o6O5O6O6O6m0m0m0l9ppN8N9r7r6N5N6jjo7o5J17J19
-822A90p8p8j6j6j6j6j1j2N4N4NNo0o0L8L6L7L8q5q3O9O7Q8Q8j53j52J19J20j20j19O7O8m2
-831B6m0j02j02QQJ25J23J6J6n7n6n7n7J9J9m6m7M8M8j8j7J9J9Q4Q4m2m2K3K3J7J6J7J7k2
-839G0k1k2k1r0r2J9J8Q6Q5K1K1PPQPn7n6QQL8L8p2p0M3M3o5o6J9K0Q4Q5l4l3l4l3N4N4j1
$$ plain form
-848 66 55 50 46 42 37 -66 -170 -143 -116 -140 -163 -56 51 -11 -73 -70 -67 -73 -80 -86 -93 -29 33 -34 -101 -106 -111 -264 -154 -116 -77 66 80 -128 -75 -46 -18
-857 -18 26 71 50 29 -23 -77 -56 -36 -150 -133 -206 -17 20 58 -19 -96 -87 -78 -70 -61 16 94 42 -10 -51 -92 -67 -43 4 52 239 164 248 200 79
-866 79 -42 -29 -17 -4 7 -80 -168 -280 -130 -39 -80 2 -176 -294 -150 -23 -26 -52 53 11 -29 -59 -88 12 114 89 63 38 13 -19 -51
-873 -51 -84 -116 -136 -156 -54 48 60 -59 -178 -36 -96 -26 60 -115 26 36 -26 41 -21 46 212 116 -109 -72 13 -31 -136 -111 -35 39
-881 39 57 75 93 111 -25 -163 -82 -1 -43 -86 2 90 33 -24 48 122 85 48 77 105 15 -74 -33 6 57 107 173 240 41 105 21 -61 -65 -69 -73
-889 -73 -77 -98 -118 8 -126 -106 -87 -84 -81 -9 63 4 -53 1 56 45 34 12 -10 -33 -56 122 301 245 189 178 -94 -89 -83 -53 -23 -75 -127 74 14
-898 14 36 58 4 -49 28 106 122 138 6 -124 67 -2 -56 -110 -131 -151 -8 -128 -251 -113 -138 -164 -100 -37 -39 -41 -89 -137 92 60 38 16
-906 16 -22 -60 -30 0 29 59 -60 -180 -82 15 20 24 29 33 -29 -93 -26 41 107 173 -39 10 -79 -169 -111 -53 -28 -2 23 48 -11 -72 14 -160 -157 -154
$$ packed form
-848F6j1nmmnj03j04K7K7k4k3J07J07o2o2LLopopO4O2o7o7nnj53J10L8L9J43J4k08N3K9K8
-857a8M4M5k1k1n2n4K1K0j14J7p3J89L7L8p7p7RRQRP7P8n2n2m1m1K5K4M7M8J87p5Q4m8j21
-866G9j21J3J2J3J1q7q8j12J50R1m1Q2j78j18J44J27lk6J05m2m0l0k9J00J02k5k6k5k5l2l2
-873e1l3l2k0k0J02J02J2j19j19J42o0P0Q6j75J41J0o2O7o2O7J66r6k25L7Q5m4j05K5P6P4
-881C9J8J8J8J8j36j38Q1Q1m2m3Q8Q8n7n7P2P4l7l7K9K8r0q9M1L9N1N0O6O7j99O4q4q2mmm
-889g3mk1k0J26j34K0J9LLP2P2n9n7N4N5j1j1k2k2k3k3J78J79n6n6j1k72NOL0L0n2n2K01o0
-898A4K2K2n4n3P7P8J6J6j32j30J91o9n4n4k1k0J43j20j23J38k5k6O4O3kkm8m8K29l2k2k2
-906A6l8l8L0L0K9L0j19j20R8R7NMNMo2o4O7O7O6O6k12M9q9r0N8N8K5K6K5K5n9o1Q6j74LL
$$ plain form
-914 -154 -101 -49 23 95 59 22 60 99 71 44 9 -24 -58 -92 17 128 85 43 43 43 108 174 203 233 153 74 135 196 191 187 144 101 -73 14 -111
-923 -111 24 94 164 66 -31 -21 -10 0 11 -42 -97 -92 -86 -15 55 9 -37 -18 0 -58 -118 -25 67 103 139 109 80 29 -21 -5 9 -7 -23 -187 -89
-932 -89 -63 -38 -105 -172 -17 138 140 142 52 -38 -80 -122 69 0 -32 -64 -76 -88 -84 -80 -112 117 90 62 -43 -149 0 -110 -54 1 25 48 135
-940 135 -38 42 124 91 59 9 -39 132 43 -52 -147 -42 63 15 -31 -71 -111 -41 27 -14 -56 -33 -10 62 134 142 149 58 -33 55 144 182 -41
-948 -41 34 110 106 101 31 -38 -10 18 46 74 49 24 0 -25 -5 14 33 53 -26 -106 -77 -47 -38 -28 -19 -10 9 28 -18 -65 1 68 26 -16 8 32 -8 -49
-957 -49 -56 -63 77 -44 -82 -121 -66 -12 91 195 59 -76 -54 -32 -10 11 -3 -18 -33 -47 -13 20 120 220 45 -129 -64 0 -84 -169 -145
-965 -145 -121 -58 5 -39 -85 1 88 109 131 111 91 71 52 15 -20 -56 -92 -117 -141 -84 -26 -214 -138 72 284 227 170 64 -41 -83 136 72
-972 72 8 -120 12 -18 -49 73 -65 -56 -48 -10 27 65 102 56 9 71 134 42 -49 12 73 6 -60 -78 -96 158 151 -52 5 -9 -24 25 75 218
$$ packed form
-914a54N3N2P2P2l6l7L8L9k8k7l5l3l4l4J09J11m3m2%%O5O6K9L0q0p9O1O1nmm3m3j74Q7j25
-923a11J35P0P0r8r7J0J1J0J1n3n5NOP1P0m6m6J9J8n8o0R3R2L6L6l0k9n1n0J6J4j6j6j64R8
-932h9K6K5o7o7J55J55KKr0r0m2m2J91o9l2l2j2j2MMl2K29k7k8j05j06J49j10N6N5K4K3Q7
-940A35j73Q0Q2l3l2n0m8J71q9r5r5J05J05m8m6m0m0P0O8m1m2K3K3P2P2QPr1r1Q8Q9L8k23
-948d1P5P6mnp0o9K8K8K8K8k5k5k4k5K0J9J9K0p9q0K9L0RJ0RRJ9J9m6m7O6O7m2m2K4K4m0m1
-957d9ppJ40j21l8l9N5N4J03J04j36j35K2K2K2K1j4j5j5j4L4L3J00J00j75j74O5O4q4q5K4
-965a45K4O3O3m4m6Q6Q7K1K2k0k0k0j9l7l5l6l6k5k4N7N8j88P6K10K12n7n7j06j05m2K19o4
-972G2o4j28J32l0l1J22j38RQL8L7L8L7m6m7O2O3r2r1O1O1o7o6j8j8K54pk03N7j4j5M9N0J43
$$ plain form
-981 218 99 -84 -7 92 192 242 293 165 37 62 87 67 47 -119 -25 4 34 15 -3 4 12 20 28 77 126 170 -48 -41 -34 21 77 80 83 4 -74
-989 -74 150 112 68 25 -21 -69 -83 164 193 -39 -125 -210 -31 -113 -48 16 -16 -50 -17 14 -33 -81 24 129 -19 -168 -164 -160 -74 10 -57 -124
-997 -124 -137 -150 -114 -78 159 134 192 249 149 50 59 69 91 114 136 159 108 56 5 -45 8 62 51 40 94 149 94 39 48 57 66 75 27 -20 -68 -116
-1006 -116 -96 -76 9 95 50 4 68 132 100 68 36 4 53 101 41 -19 -10 -1 -58 -114 -86 -58 -30 -2 -36 -71 -89 -107 -201 -34 51 137 30 -76
-1014 -76 -46 -16 76 -93 9 113 -26 96 137 178 131 84 103 122 98 75 -13 -102 -66 -29 -58 -87 17 121 117 112 84 56 45 33 -98 30
-1022 30 95 -102 -116 -130 -160 -190 -144 -99 -201 -41 -4 32 -110 -253 -122 8 -13 -36 89 214 143 71 75 79 33 -11 -110 53 69 85 99
-1030 99 112 16 -79 -80 -82 -83 -85 -52 -19 12 45 109 173 84 -4 17 38 207 114 20 -73 11 97 55 13 20 27 80 -127 -123 -119 -71 -23 -85 -146 -46 52
-1039 52 0 -53 -15 22 -48 -119 -81 -42 -70 -97 -119 -140 -96 -53 -50 -47 -44 -41 1 43 86 128 48 -32 -3 25 59 94 19 -55 -39 -22 -6 10 -47 -105 -53
$$ packed form
-981B18j19j83P7R9J00N0N1j28j28K5K5k0k0j66R4K9L0j9j8PQQQM9M9M4k18PPN5N6LLp9p8
-989g4K24l8m4m3m6m8j4K47K9k32q6q5J79q2O5O4l2l4L3L1m7m8J05J05j48j49MMQ6Q4o7o7
-997a24j3j3L6L6K37k5N8N7j00r9RJ0K2K3K2K3n1n2n1n0N3N4j1j1N4N5n5n5RRRRm8m7m8m8
-1006a16K0K0Q5Q6m5m6O4O4l2l2l2l2M9M8o0o0RRn7n6K8K8K8K8l4l5j8j8r4J67Q5Q6j07j06
-1014g6L0L0R2j69J02J04j39J22M1M1m7m7J9J9k4k3q8q9L6L7k9k9J04J04mnk8k8j1j2j31J28
-1022C0O5j97j4j4l0l0M6M5j02J60L7L6j42j43J31J30k1k3J25J25p1p2MMm6m4r9J63J6J6J4
-1030I9J3r6r5jkjkL3L3L1L3O4O4q9q8K1K1J69r3r4r3Q4Q6m2m2PPN3k07MMM8M8o2o1J00R8
-1039E2n2n3L8L7p0p1L8L9k8k7k2k1M4M3LLLLM2M2M3M2q0q0K9K8L4L5p5p4J6J7J6J6n7n8N2
$$ plain form
-1048 -53 -2 -82 -162 -88 -15 -19 -23 -27 -31 10 52 95 137 44 -47 -74 -101 -26 49 59 69 57 45 99 153 86 20 19 18 125 232 186 140 119 98 104 -21
-1057 -21 -197 -68 -136 -72 -17 -93 52 66 38 10 39 69 168 267 125 -15 26 68 111 153 134 115 30 -54 23 101 70 39 73 108 63 18
-1065 18 81 -73 -113 -23 50 124 54 -16 -72 -129 -33 63 68 73 77 82 22 -37 -32 -27 -50 -74 -32 9 -72 -154 -39 74 72 71 69 68 129 191 99 8 45 82
-1074 82 119 156 39 -76 -40 -4 12 29 47 64 109 154 47 -60 9 79 83 87 71 55 38 22 2 -17 71 159 67 -25 -8 7 6 5 4 2 -28 -58
-1083 -58 -24 10 31 52 57 61 148 -27 69 167 -22 50 84 119 112 104 -50 56 44 31 132 -27 -138 12 0 -13 -38 -64 20 104 54 4 20
-1091 20 36 21 7 -6 -21 23 67 111 155 151 148 144 140 54 -31 -8 14 8 2 -3 -8 -10 -11 -12 -13 24 62 101 139 39 -60 -51 -41 -80 -118 -91 -64 -29 6 -114
-1101 -114 -103 90 22 43 65 39 12 52 91 60 30 90 18 -31 180 244 178 145 113 72 31 17 4 -9 -23 24 72 10 -51 -74 -97 -120 -143
-1109 -143 -132 -121 0 119 23 -71 132 75 57 39 144 -12 21 -74 -138 -70 107 23 -132 -156 -146 -136 -52 31 34 38 -24 -86 -48 -9 28 67
$$ packed form
-1048e3N1q0q0P4P3mmmmM1M2M3M2r3r1k7k7P5P5J0J0j2j2N4N4o7o6jjJ07J07m6m6k1k1Oj25
-1057b1j76J29o8O4N5p6J45J4k8k8K9L0R9R9j42j40M1M2M3M2j9j9q5q4P7P8l1l1L4L5m5m5
-1065A8O3j54m0R0P3P4p0p0n6n7R6R6NNMNo0n9NNk3k4M2M1q1q2J15J13kjkjO1O2r2r1L7L7
-1074H2L7L7j17j15L6L6J6J7J8J7M5M5j07j07O9P0MMj6j6j7j6k0j9Q8Q8r2r2J7J5jjjkl0l0
-1083e8L4L4K1K1NMQ7j75R6R8j89P2L4L5pqj54J06j2j3J01j59j11J50j2j3k5k6Q4Q4n0n0J6
-1091B0J6j5j4j3j5M4M4M4M4mlmmq6q5K3K2oonnkjjjL7L8L9L8j00r9RJ0l9l8K7K7L5L5j20
-1101a14J1J93o8K1K2k6k7M0L9l1l0O0p2m9K11O4o6l3l2m1m1j4j3j3j4M7M8o2o1k3k3k3k3
-1109a43J1J1J21J19r6r4K03n7j8j8J05j56L3r5o4O8J77q4j55k4J0J0Q4Q3LMo2o2L8L9L7L9
$$ plain form
-1116 67 19 -28 -10 7 -26 -61 -30 0 9 18 84 151 82 -116 -236 -94 -37 18 25 32 -1 -34 -67 -100 -49 1 118 235 185 135 77 19 72 -6
-1125 -6 -142 -16 -116 46 77 109 115 122 39 86 204 60 72 83 106 128 -61 9 44 79 -21 -123 -56 9 10 11 15 19 23 27 -5 -38 -6 26 -20
-1133 -20 -67 -49 -30 51 134 151 168 107 46 -14 -75 -12 50 4 -42 35 112 124 136 151 165 202 107 -8 94 205 185 122 58 52 45 2 -41 4
-1142 4 50 129 -97 -173 -31 36 -27 -38 -180 -151 -121 -157 25 49 73 -32 -139 -77 116 162 -10 67 144 -32 -208 -141 -73 -5 62 102
-1149 102 143 118 93 62 31 1 -29 -59 -89 -10 68 47 27 6 -14 0 14 28 42 15 -11 -125 -108 28 -52 -125 20 93 166 13 -140 -97
-1157 -97 -54 -12 30 58 86 113 141 115 89 63 38 66 95 189 284 146 9 -106 -3 63 0 97 63 68 73 70 66 72 79 85 91 89 86 -25 -137 -115 -93
-1166 -93 -71 -49 63 176 136 96 -10 -116 -26 62 89 115 76 37 -18 -73 -36 0 144 25 -11 -48 18 85 43 0 -100 -202 -64 74
-1173 74 120 166 102 39 36 33 96 159 122 85 48 11 32 52 -36 -124 -175 -225 67 99 87 75 47 19 48 78 107 136 126 116 40 -35 -15 3 39
$$ packed form
-1116F7m8m7J8J7l3l5L1L0RRO6O7o9j98j20J42N7N5PPl3l3l3l3N1N0J17J17n0n0n8n8N3p8
-1125fj36J26j00J62L1L2OPq3M7J18j44J2J1K3K2j89P0L5L5j00j02O7O5JJMMMMl2l3L2L2m6
-1133b0m7J8J9Q1Q3J7J7o1o1o0o1O3O2m6m6P7P7J2J2J5J4L7r5j15J02J11k0o3o4opm3m3M5
-1142DM6P9k26p6J42O7o3j1j42K9L0l6J82K4K4j05j07O2J93M6j72P7P7j76j76O7O8O8O7M0
-1149A02M1k5k5l1l1l0l0l0l0P9P8k1k0k1k0J4J4J4J4k7k6j14J7J36q0p3J45P3P3j53j53M3
-1157i7M3M2M2K8K8K7K8k6k6k6k5K8K9R4R5j38j37j15J03O6o3R7l4NNlmOPOOklj11j12K2K2
-1166i3K2K2J12J13m0m0j06j06R0Q8K7K6l9l9n5n5L7L6J44j19l6l7O6O7m2m3j00j02J38J38
-1173G4M6M6o4o3llO3O3l7l7l7l7K1K0q8q8n1n0K92L2j2j2k8k8K9L0K9K9j0j0p6p5K0J8L6
$$ plain form
-1182 39 75 12 210 212 -47 -3 40 133 226 89 -47 -75 -103 -52 0 50 101 100 98 97 95 56 18 45 72 69 66 63 60 94 128 96 65 62 60 -6 -74 -27
-1191 -27 19 0 -17 -52 -86 -175 -2 133 7 44 82 -11 -105 145 133 118 103 72 41 -43 -129 -61 6 105 205 151 97 161 226 180 135 97
-1199 97 59 20 -17 33 84 26 -31 60 152 135 118 71 25 -21 -68 -15 38 -18 -74 -19 34 171 45 21 -1 -41 -81 45 171 74 -23 -173
-1207 -173 -62 10 84 130 176 112 49 92 135 69 3 81 158 126 94 50 6 11 278 246 213 197 181 165 149 67 -14 -9 -5 0 3 -49 -102 -106 -109 35
-1215 35 -81 -50 -19 -62 -105 -39 26 16 6 -3 -14 47 110 210 48 46 43 90 137 68 -1 126 253 213 172 131 91 78 64 35 5 227 186
-1224 186 -133 -15 -200 -122 -11 99 146 193 87 -18 8 34 45 55 117 -83 -218 -90 -95 -100 -24 52 8 -36 27 92 66 41 15 -10
-1231 -10 -10 -10 -11 -11 -19 -28 28 85 2 -81 32 145 212 279 237 194 67 -59 53 166 57 -50 54 -102 -104 -106 -15 75 36 -3 109 222 202
-1239 202 182 97 11 71 130 80 30 23 16 74 132 144 156 249 81 20 -39 -111 79 47 15 109 203 132 62 -8 -78 -66 -55 -191 -64 67 199
$$ packed form
-1182C9L6o3J98Kk59M4M3R3R3j37j36k8k8N1N2N0N1jkjkl9l8K7K7llllL4L4l2l1lko6o8M7
-1191b7M6j9j7l5l4q9J73J35j26L7L8r3r4K50j2j5j5l1l1q4q6O8O7R9J00n4n4O4O5m6m5l8
-1199I7l8l9l7N0N1n8n7R1R2j7j7m7m6m6m7N3N3n6n6N5N3J37j26k4k2m0m0J26J26r7r7j50
-1207a73J11P2P4M6M6o4o3M3M3o6o6P8P7l2l2m4m4NK67l2l3j6j6j6j6q2q1NMNLn2n3mlJ44
-1215C5j16L1L1m3m3O6O5j0j0rj1O1O3J00j62klM7M7o9o9J27J27m0m1m1m0j3j4k9l0K22m1
-1224A86l19J18j85P8J11J10M7M7j06j05K6K6J1J0O2k00j35J28nnP6P6m4m4O3O5k6k5k6k5
-1231a0%%j%qrN6N7q3q3J13J13O7O7m2m3j27j26J12J13j09j07J04j56kkR1R0l9l9J12J13k0
-1239B02k0q5q6O0N9n0n0ppN8N8J2J2R3j68o1n9p2J90l2l2R4R4p1p0p0p0J2J1j36J27J31J32
$$ plain form
-1247 199 64 -71 -59 -47 -19 9 -157 -61 -47 -33 -47 -60 35 131 78 25 -11 -47 -206 -102 -36 29 -8 -46 -18 8 22 36 50 64 72 79 87
-1255 87 95 39 -17 -73 -130 -24 81 34 -12 46 106 83 60 187 52 64 75 63 50 103 156 116 77 37 -1 11 25 -108 19 -14 -48 -66
-1263 -66 -83 41 167 96 25 39 53 67 81 21 -38 66 -92 -225 -96 20 138 117 95 139 183 144 105 66 26 39 52 64 77 139 202
-1270 202 8 75 109 143 -2 -149 -82 -15 -14 -12 -72 -133 -40 52 43 34 9 -15 123 0 23 47 10 -25 194 152 53 -46 -25 257 206 155 121
-1279 121 86 29 -28 -20 -12 -2 8 -46 -100 8 117 117 116 22 -71 91 -8 -18 -29 -56 -83 7 98 80 62 -9 -82 -45 -8 9 28 47 65 29 -6
-1287 -6 66 140 99 59 19 -20 33 87 75 64 47 30 -52 -134 -64 6 76 147 133 120 107 94 43 -6 25 57 -59 85 83 81 103 125 147 170 75
-1296 75 -19 -48 -77 -23 30 -24 -79 -110 -140 41 -38 -14 10 17 25 30 36 -106 13 87 161 141 122 91 60 -8 184 92 0 -10 -21 -6 7 169
-1304 169 69 -96 -262 -117 28 24 21 18 14 -15 -46 -60 -75 -193 -49 55 161 105 49 103 157 114 72 30 -12 20 53 20 -12 -78 -143 30
$$ packed form
-1247A99j35j35J2J2K8K8j66R6J4J4j4j3R5R6n3n3l6l6j59J04O6O5l7l8K8K6J4J4J4J4QPQ
-1255H7Qn6n6n6n7J06J05m7m6N8O0k3k3J27j35J2J1j2j3N3N3m0l9m0l8J2J4j33J27l3l4j8
-1263f6j7J24J26p1p1J4J4J4J4o0n9J04j58j33J29J16J18k1k2M4M4l9l9l9m0J3J3J2J3O2O3
-1270B02j94O7L4L4j45j47O7O7JKo0o1R3R2rrk5k4J38j23K3K4l7l5K19m2r9r9K1K82n1n1l4
-1279A21l5n7n7QQJ0J0n4n4J08J09%jr4r3J62r9j0j1k7k7R0R1j8j8p1p3L7L7J7J9J9J8l6l5
-1287fP2P4m1m0m0l9N3N4j2j1j7j7q2q2P0P0P0P1j4j3j3j3n1m9L1L2j16J44kkK2K2K2K3r5
-1296G5r4k9k9N4N3n4n5l1l0J81p9K4K4PQNOj42J19P4P4k0j9l1l1o8J92r2r2j0j1J5J3J62
-1304A69j00j65j66J45J45mllmk9l1j4j5j18J44J04J06n6n6N4N4m3m2m2m2L2L3l3l2o6o5J73
$$ plain form
-1312 30 204 128 51 83 116 74 32 56 80 37 -5 16 39 15 -8 -32 -56 -21 13 48 82 68 54 56 58 -94 15 -21 -59 42 143 135 127 197
-1320 197 267 184 101 52 4 64 124 114 103 93 82 83 84 84 85 59 32 142 253 298 81 77 73 92 111 131 150 176 202 91 -19 -103 73 37
-1328 37 2 -3 -9 66 -119 -39 40 -48 -137 -97 -56 -16 24 9 -4 90 185 171 157 144 130 20 -88 -192 -34 -45 -57 -68 -79 123 64 87 110
-1337 110 160 210 64 -82 -26 28 18 9 -17 -43 -21 1 65 -133 -118 -104 -111 -119 -60 -2 66 135 155 175 -10 65 103 140 58 -24 2 29 82 136
-1345 136 36 -62 -65 -67 -70 -72 -51 -30 56 142 184 226 158 90 30 -29 18 67 7 -53 -4 44 -7 -59 -46 -32 86 206 195 184 67 -50 -36 -22
-1353 -22 -22 -22 -22 -22 87 197 176 155 88 20 -47 -114 -91 -69 -46 -24 -5 12 -34 -81 26 133 109 85 57 29 66 103 112 121 64 8 -40 -89 -72 -55
-1362 -55 -68 -82 -30 20 3 -14 33 80 63 46 29 12 35 59 83 107 62 17 37 58 102 146 58 -28 69 166 46 -74 19 112 140 168 108 48
-1370 48 118 189 117 44 37 30 7 -16 26 68 90 112 69 25 88 150 82 13 -87 -188 -158 -128 -149 -170 -125 -81 -24 32 -41 -115 -46 22 91 160 131
$$ packed form
-1312C0J74p6p7L2L3m2m2K4K4m3m2K1K3k4k3k4k4L5L4L5L4j4j4KKj52J09l6l8J01J01qqP0
-1320A97P0q3q3m9m8O0O0j0j1j0j1JJ%Jk6k7J10J11M5k17mmJ9J9K0J9K6K6j11j10q4J76l6
-1328C7l5noP5j85Q0P9q8q9M0M1M0M0j5j3R4R5j4j4j3j4j10j08j04J58j1j2j1j1K02n9K3K3
-1337A10N0N0j46j46N6N4j0rk6k6K2K2O4j98J5J4pqN9N8O8O9K0K0j85P5L8L7q2q2K6K7N3N4
-1345A36j00r8lklkK1K1Q6Q6M2M2o8o8o0n9M7M9o0o0M9M8n1n2J3J4J18J20j1j1j17j17J4J4
-1353b2%%%%J09J10k1k1o7o8o7o7K3K2K3K2J9J7m6m7J07J07k4k4k8k8L7L7RRn7n6m8m9J7J7
-1362e5j3j4N2N0j7j7M7M7j7j7j7j7K3K4K4K4m5m5K0K1M4M4q8q6R7R7j20j20R3R3K8K8o0o0
-1370D8P0P1p2p3ppk3k3M2M2K2K2m3m4O3O2o8o9j00j01L0L0k1k1M5M4N7N6p3p4O9O8O9O9k9
$$ plain form
-1379 131 102 73 44 -6 -57 23 103 -12 -128 -26 75 76 76 76 77 74 72 86 100 9 179 203 226 181 136 90 45 98 150 72 -6 -30 -54 52
-1387 52 159 139 120 100 80 102 123 144 166 143 121 99 76 70 64 59 53 63 73 83 93 -6 -107 -93 -79 114 46 59 72 -21 -116 -79 -43 25 94
-1396 94 31 -30 48 128 76 25 160 294 211 127 13 -100 64 -33 26 87 131 175 151 128 40 -48 48 146 25 -96 -24 46 52 58 51 44 103
-1404 103 162 172 183 63 -56 -7 40 24 7 -1 -9 -18 -27 36 101 99 98 -3 -104 -74 -44 31 106 51 -4 -24 -44 -64 -84 -108 -132 -172 49 -19 -88
-1412 -88 72 -29 -1 25 37 48 70 92 5 -81 -57 -34 -10 13 -6 -26 19 65 96 128 160 192 119 45 81 117 9 -98 -97 -96 9 116 113
-1420 113 110 84 59 33 8 38 69 34 0 64 128 84 39 19 0 -20 -40 -5 29 64 99 51 3 -45 -93 8 110 103 95 31 -33 54 142 90 37
-1429 37 -15 -68 -9 49 109 168 53 -60 -109 -157 -40 77 86 95 50 6 -38 -82 -9 63 136 209 128 48 33 18 -19 -57 -29 -1 29 61 28 -5
-1437 -5 67 140 59 -20 29 79 63 48 -1 -51 8 67 57 47 37 27 -71 -170 -116 -62 51 166 127 89 113 137 162 186 158 130 101 73 102 131
$$ packed form
-1379A31k9k9k9n0n1Q0Q0j15j16J02J01J%%JlkJ4J4r1J70K4K3m5m5m6m5N3N2p8p8k4k4J06
-1387E2J07k0j9k0k0K2K1K1K2k3k2k2k3oonoJ0J0J0J0r9j01J4J4J93o8J3J3r3r5L7L6O8O9
-1396I4o3o1P8Q0n2n1J35J34q3q4j14j13J64r7N9O1M4M4k4k3q8q8R6R8j21j21P2P0OOppN9
-1404A03N9J0J1j20j19M9M7j6j7qqrrO3O5kjj01j01L0L0P5P5n5n5k0k0k0k0k4k4m0K21o8o9
-1412h8J60j01K8K6J2J1K2K2q7q6K4K3K4K3j9k0M5M6L1L2L2L2p3p4L6L6j08j07JJJ05J07l
-1420A13lk6k5k6k5L0L1l5l4O4O4m4m5k0j9k0k0L5L4L5L5m8m8m8m8J01J02pqo4o4Q7Q8n2n3
-1429C7n2n3N9N8O0N9j15j13m9m8J17J17RRm5m4m4m4P3P2P3P3q1q0j5j5l7l8K8K8L0L2l3l3
-1437eP2P3q1p9M9N0j6j5m9n0N9N9j0j0j0j0r8r9N4N4J13J15l9l8K4K4K5K4k8k8k9k8K9K9
$$ plain form
-1446 131 95 58 33 8 48 89 141 194 94 -5 -1 3 7 12 13 15 17 19 -32 -85 -27 29 57 86 48 11 47 82 52 22 62 101 75 50 64 79 94 108
-1455 108 49 -9 -2 3 27 50 74 97 23 -51 26 104 75 45 16 -12 26 65 103 142 90 38 51 64 32 0 34 67 101 135 103 71 80 89 32 -23
-1464 -23 30 84 73 61 24 -13 -50 -87 -15 56 63 69 60 50 106 162 120 79 38 -3 26 56 85 115 160 205 97 -10 54 118 29 -59 -53 -46 -40 -34 -9
-1473 -9 15 41 66 67 69 4 -59 -26 6 6
$$ packed form
-1446A31l6l7k5k5M0M1N2N3j00r9MMMNJKKKn1n3N8N6K8K9l8l7L6L5l0l0M0L9k6k5J4J5J5J4
-1455A08n9n8PNK4K3K4K3p4p4P7P8k9l0k9k8L8L9L8L9n2n2J3J3l2l2L4L3L4L4l2l2RRn7n5
-1464b3N3N4j1j2l7l7l7l7P2P1POrj0N6N6m2m1m1m1K9L0K9L0M5M5j08j07O4O4q9q8OPOOK5
-1473iK4K6K5JKo5o3L3L2%
-1475F
##$OBSERVED INTEGRALS=	(X Y Z)
(3.9294177795253215635, 4.3762389099792091685, 1.0000155372755827887)
(2.8272589910724046369, 3.030810839390285949, 0.31113124238262523935)
(7.5486689362017926896, 7.6653388980425321009, 0.13959550056812261576)
(7.1341182207251332414, 7.3624934651793436657, 0.95682595823598881601)
(6.4465101477488735426, 6.5880035057259398457, 0.30093226553760804576)
(6.650061996066756187, 6.7667319579074938218, 0.31236049427542972312)
(2.3617016561273755926, 2.4745829681552757862, 0.65507186565157360381)
(1.5715324719320700186, 1.7793774274120128798, 1.0219209328554967886)
(2.2065008335709972442, 2.2437017947336026502, 0.90791035441174938736)
##END=	
##END=	
