##TITLE=	Feb27-2020.320.fid
AK1419
##JCAMP-DX=	6.0	$$ MestReNova 14.1.0-24037
##DATA TYPE=	LINK
##BLOCK_ID=	1
##BLOCKS=	1    
##ORIGIN=	Mestrelab Research S.L.
##OWNER=	ak1419
##$MNOVA/LINK_BLOCK_TYPE=	ITEM	$$ NMR Spectrum
##$MNOVA/ITEM/POLYGON=	(XY..XY)
5321,5835
8722,5835
8722,8208
5321,8208
5321,5835
##$MNOVA/ITEM/Z=	0
##$MNOVA/ITEM/ANGLE=	0
##TITLE=	Feb27-2020.320.fid
##JCAMP-DX=	6.0	$$ MestReNova 14.1.0-24037
##BLOCK_ID=	2
##DATA TYPE=	NMR SPECTRUM
##DATA CLASS=	XYDATA
##NUMDIM=	1
##ORIGIN=	Bruker BioSpin GmbH
##OWNER=	nmrsu
##.OBSERVE FREQUENCY=	400.05240029999998796
##.OBSERVE NUCLEUS=	^1H
##.SOLVENT NAME=	CDCl3
##.PULSE SEQUENCE=	zg30
##LONGDATE=	2020/02/27 15:56:00.000
##.ACQUISITIONMODE=	SIMULTANEOUS (DQD)
##$ORIGINAL FORMAT=	Bruker XWIN-NMR
##$MNOVA/SCALES_VERSION=	8
##$PARAMETER FILE=	(acqus, ASCII, //ch-nmrserv2.ch.ic.ac.uk/Av400D/ug1/nmr/Feb27-2020/320/acqus, 0)
$$ ##TITLE= Parameter file, TOPSPIN		Version 3.2
$$ ##JCAMPDX= 5.0
$$ ##DATATYPE= Parameter Values
$$ ##NPOINTS= 11	$$ modification sequence number
$$ ##ORIGIN= Bruker BioSpin GmbH
$$ ##OWNER= nmrsu
$$ $$ 2020-02-27 15:56:59.412 +0000  nmrsu@nmrpc
$$ $$ /opt/topspin/data/ug1/nmr/Feb27-2020/320/acqus
$$ $$ process /opt/topspin3.2/prog/mod/shimcntl
$$ ##$ACQT0= -2.04831932773109
$$ ##$AMP= (0..31)
$$ 100 100 100 100 100 100 100 100 100 100 100 100 100 100 100 100 100 100
$$ 100 100 100 100 100 100 100 100 100 100 100 100 100 100
$$ ##$AMPCOIL= (0..19)
$$ -1 0 0 0 0 0 0 0 0 0 0 0 0 0 0 0 0 0 0 0
$$ ##$ANAVPT= -1
$$ ##$AQSEQ= 0
$$ ##$AQ_mod= 3
$$ ##$AUNM= <au_zg>
$$ ##$AUTOPOS= <32 >
$$ ##$BF1= 400.05
$$ ##$BF2= 400.05
$$ ##$BF3= 400.05
$$ ##$BF4= 400.05
$$ ##$BF5= 400.05
$$ ##$BF6= 400.05
$$ ##$BF7= 400.05
$$ ##$BF8= 400.05
$$ ##$BYTORDA= 0
$$ ##$CAGPARS= (0..11)
$$ 0 0 0 0 0 0 0 0 0 0 0 0
$$ ##$CFDGTYP= 0
$$ ##$CFRGTYP= 9
$$ ##$CHEMSTR= <none>
$$ ##$CNST= (0..63)
$$ 1 1 1 1 1 1 1 1 1 1 1 1 1 1 1 1 1 1 1 1 1 1 1 1 1 1 1 1 1 1 1 1 1 1 1 1
$$ 1 1 1 1 1 1 1 1 1 1 1 1 1 1 1 1 1 1 1 1 1 1 1 1 1 1 1 1
$$ ##$CPDPRG= (0..8)
$$ <> <> <> <> <> <> <> <> <>
$$ ##$D= (0..63)
$$ 0 1 0 0 0 0 0 0 0 0 0 0 0 0 0 0 0.0002 0 0 0 0 0 0 0 0 0 0 0 0 0 0 0 0
$$ 0 0 0 0 0 0 0 0 0 0 0 0 0 0 0 0 0 0 0 0 0 0 0 0 0 0 0 0 0 0 0
$$ ##$DATE= 1582819018
$$ ##$DE= 6.5
$$ ##$DECBNUC= <off>
$$ ##$DECIM= 2496
$$ ##$DECNUC= <off>
$$ ##$DECSTAT= 4
$$ ##$DIGMOD= 1
$$ ##$DIGTYP= 12
$$ ##$DQDMODE= 0
$$ ##$DR= 22
$$ ##$DS= 4
$$ ##$DSPFIRM= 0
$$ ##$DSPFVS= 20
$$ ##$DTYPA= 0
$$ ##$EXP= <proton>
$$ ##$F1LIST= <>
$$ ##$F2LIST= <>
$$ ##$F3LIST= <>
$$ ##$FCUCHAN= (0..9)
$$ 0 2 0 0 0 0 0 0 0 0
$$ ##$FL1= 90
$$ ##$FL2= 90
$$ ##$FL3= 90
$$ ##$FL4= 90
$$ ##$FOV= 20
$$ ##$FQ1LIST= <>
$$ ##$FQ2LIST= <>
$$ ##$FQ3LIST= <>
$$ ##$FQ4LIST= <>
$$ ##$FQ5LIST= <>
$$ ##$FQ6LIST= <>
$$ ##$FQ7LIST= <>
$$ ##$FQ8LIST= <>
$$ ##$FRQLO3= 15959.0749999881
$$ ##$FRQLO3N= 2
$$ ##$FS= (0..7)
$$ 83 83 83 83 83 83 83 83
$$ ##$FTLPGN= 0
$$ ##$FW= 125000
$$ ##$FnMODE= 0
$$ ##$FnTYPE= 0
$$ ##$GPNAM= (0..31)
$$ [...]
$$ 130000 130000 130000 130000 130000 130000 130000 130000 130000 130000 130000
$$ 130000 130000 130000 130000 130000 130000 130000 130000 130000 130000 130000
$$ 130000 130000 130000 130000 130000 130000 130000 0 0 0 0 0 0 0 0 0 0 0
$$ 0 0 0 0 0 0 0 0 0 0 0 0 0
$$ ##$ShimPowMaxUC= (0..63)
$$ 130000 130000 130000 130000 130000 130000 130000 130000 130000 130000 130000
$$ 130000 130000 130000 130000 130000 130000 130000 130000 130000 130000 130000
$$ 130000 130000 130000 130000 130000 130000 130000 130000 130000 130000 130000
$$ 130000 130000 130000 130000 130000 130000 130000 0 0 0 0 0 0 0 0 0 0 0
$$ 0 0 0 0 0 0 0 0 0 0 0 0 0
$$ ##$ShimPowMaxUG= (0..63)
$$ 524287 524287 524287 524287 524287 524287 524287 524287 524287 524287 524287
$$ 524287 524287 524287 524287 524287 524287 524287 524287 524287 524287 524287
$$ 524287 524287 524287 524287 524287 524287 524287 524287 524287 524287 524287
$$ 524287 524287 524287 524287 524287 524287 0 0 0 0 0 0 0 0 0 0 0 0 0 0 0
$$ 0 0 0 0 0 0 0 0 0 0
$$ ##$ShimPowRcbType= 3
$$ ##$ShimPowRes= (0..63)
$$ 1e-20 1e-20 1e-20 1e-20 1e-20 1e-20 1e-20 1e-20 1e-20 1e-20 1e-20 1e-20
$$ 1e-20 1e-20 1e-20 1e-20 1e-20 1e-20 1e-20 1e-20 1e-20 1e-20 1e-20 1e-20
$$ 1e-20 1e-20 1e-20 1e-20 1e-20 1e-20 1e-20 1e-20 1e-20 1e-20 1e-20 1e-20
$$ 1e-20 1e-20 1e-20 1e-20 0 0 0 0 0 0 0 0 0 0 0 0 0 0 0 0 0 0 0 0 0 0 0 0
$$ ##$ShimPowRng0= (0..63)
$$ 1 1 1 1 1 1 1 1 1 1 1 1 1 1 1 1 1 1 1 1 1 1 1 1 1 1 1 1 1 1 1 1 1 1 1 1
$$ 1 1 1 1 0 0 0 0 0 0 0 0 0 0 0 0 0 0 0 0 0 0 0 0 0 0 0 0
$$ ##$ShimPowRng1= (0..63)
$$ 1 1 1 1 1 1 1 1 1 1 1 1 1 1 1 1 1 1 1 1 1 1 1 1 1 1 1 1 1 1 1 1 1 1 1 1
$$ 1 1 1 1 0 0 0 0 0 0 0 0 0 0 0 0 0 0 0 0 0 0 0 0 0 0 0 0
$$ ##$ShimPowRng2= (0..63)
$$ 1 1 1 1 1 1 1 1 1 1 1 1 1 1 1 1 1 1 1 1 1 1 1 1 1 1 1 1 1 1 1 1 1 1 1 1
$$ 1 1 1 1 0 0 0 0 0 0 0 0 0 0 0 0 0 0 0 0 0 0 0 0 0 0 0 0
$$ ##$ShimPowRng3= (0..63)
$$ 1 1 1 1 1 1 1 1 1 1 1 1 1 1 1 1 1 1 1 1 1 1 1 1 1 1 1 1 1 1 1 1 1 1 1 1
$$ 1 1 1 1 0 0 0 0 0 0 0 0 0 0 0 0 0 0 0 0 0 0 0 0 0 0 0 0
$$ ##$ShimSysFunc= (0..63)
$$ 1 2 3 4 5 6 7 8 9 10 0 37 38 35 16 15 14 13 12 11 28 27 26 25 24 23 36
$$ 22 30 29 20 21 34 33 32 31 17 18 19 0 0 0 0 0 0 0 0 0 0 0 0 0 0 0 0 0 0
$$ 0 0 0 0 0 0 0
$$ ##$ShimSysMatrix= 0
$$ ##$ShimSysType= 4
$$ ##$TFXNUM= 0
$$ ##$TRIPLO2= 0
$$ ##$VTU= 2
$$ ##$VTUETH= <149.236.99.20>
$$ ##$VTUTY= <no>
$$ ##$WBREFAM= (0..15)
$$ 136.7 118.7 100 100 100 100 100 100 100 100 100 100 100 100 100 100
$$ ##$WBREFLM= (0..15)
$$ 0 0 0 0 0 0 0 0 0 0 0 0 0 0 0 0
$$ ##$WBREFPH= (0..15)
$$ 77.55 -71.28 0 0 0 0 0 0 0 0 0 0 0 0 0 0
$$ ##$WBSGU= (0..15)
$$ 0 0 0 0 0 0 0 0 0 0 0 0 0 0 0 0
$$ ##$XFAC= 2
$$ ##END=
$$ 
##$DECIM=	2496
##$DSPFVS=	20
##XUNITS=	HZ
##YUNITS=	ARBITRARY UNITS
##FIRSTX=	6406.710256386850233
##LASTX=	-1606.1102564336499654
##DELTAX=	-0.12226780365942625795
##XFACTOR=	1
##YFACTOR=	0.0075573442758002035494
##FIRSTY=	8.7117671966552734375
##MINY=	3.2156877517700195312
##MAXY=	7821.38232421875
##NPOINTS=	65536
##XYDATA=	(X++(Y..Y))
$$ [...]
2315 1278 1182 1087 1065 1043 1099 1155 1211 1267 1231 1195 1296 1396 1437 1384 1304 1225 1185 1144 1103 1062 1053 1044 1082 1120 1141 1161 1181 1202 1212 1223 1186 1149 1190 1231
2310 1231 1272 1313 1288 1262 1237 1211 1172 1133 1172 1212 1238 1265 1338 1412 1373 1334 1343 1351 1367 1382 1318 1254 1184 1114 1124 1133 1143 1153 1205 1256 1328 1304 1255 1206 1205 1203 1123
2306 1123 1042 1087 1132 1161 1142 1112 1161 1236 1264 1261 1259 1253 1248 1206 1165 1171 1177 1184 1191 1198 1205 1209 1212 1216 1219 1184 1149 1193 1237 1250 1262 1275 1288 1286 1284 1240 1195 1168 1220 1330 1393 1341
2301 1341 1242 1198 1234 1279 1276 1258 1240 1253 1265 1230 1195 1220 1244 1239 1155 1030 984 1063 1189 1278 1288 1267 1246 1267 1288 1262 1236 1204 1173 1220 1315 1395 1396 1365 1334
2297 1334 1316 1298 1280 1261 1220 1180 1186 1192 1233 1274 1268 1262 1268 1275 1234 1193 1224 1255 1287 1318 1318 1318 1317 1317 1254 1191 1239 1286 1293 1299 1321 1390 1424 1379 1270 1162 1139 1115 1092
2292 1092 1068 1035 1001 1046 1091 1164 1237 1309 1382 1371 1360 1301 1243 1224 1205 1186 1167 1242 1317 1329 1262 1210 1206 1250 1293 1286 1279 1272 1265 1252 1239 1226 1213 1250 1288 1277 1220
2287 1220 1195 1249 1303 1279 1219 1206 1241 1276 1238 1199 1209 1218 1193 1169 1223 1325 1372 1339 1280 1269 1285 1300 1319 1338 1345 1352 1359 1366 1465 1565 1571 1499 1429 1438 1471 1457 1429
2283 1429 1401 1418 1434 1368 1301 1314 1326 1321 1315 1262 1209 1239 1268 1341 1413 1448 1404 1326 1248 1197 1145 1173 1200 1271 1342 1305 1268 1252 1284 1333 1303 1246 1189 1206 1223
2278 1223 1227 1230 1233 1236 1219 1201 1231 1261 1207 1153 1147 1140 1140 1140 1093 1046 1064 1082 1100 1118 1113 1108 1103 1098 1128 1159 1189 1219 1243 1266 1289 1313 1261 1210 1205 1201 1183 1165 1194 1224 1154
2273 1154 1085 1094 1104 1087 1070 1132 1194 1189 1184 1179 1174 1168 1163 1157 1152 1182 1212 1242 1272 1253 1235 1216 1198 1199 1200 1202 1203 1200 1197 1195 1192 1175 1157 1140 1122 1122 1122 1074 1026 1117 1207 1298 1388 1392
2268 1392 1395 1351 1307 1338 1369 1354 1291 1222 1246 1326 1405 1414 1423 1385 1346 1365 1383 1401 1419 1324 1229 1244 1259 1210 1161 1223 1379 1438 1338 1233 1223 1264 1305 1352
2264 1352 1400 1405 1411 1338 1265 1241 1218 1195 1171 1101 1032 1101 1170 1207 1195 1199 1298 1393 1394 1343 1293 1219 1146 1123 1196 1271 1252 1213 1174 1185 1197 1209 1221 1200 1179 1158
2260 1158 1137 1136 1135 1134 1133 1165 1196 1228 1260 1200 1140 1103 1161 1229 1250 1194 1137 1155 1173 1191 1208 1202 1195 1261 1327 1283 1145 1111 1172 1219 1171 1126 1176 1206 1188 1171 1201
2255 1201 1257 1219 1127 1034 1062 1090 1119 1147 1107 1067 1078 1184 1307 1335 1340 1345 1341 1289 1207 1220 1279 1291 1257 1222 1268 1313 1311 1309 1281 1253 1225 1197 1268 1340 1301 1262
2251 1262 1201 1140 1102 1158 1237 1269 1254 1239 1276 1313 1305 1298 1315 1380 1395 1316 1185 1101 1129 1205 1269 1287 1304 1368 1442 1467 1441 1415 1361 1261 1181 1196 1308 1420
2246 1420 1480 1446 1416 1385 1349 1313 1310 1308 1306 1304 1332 1360 1311 1214 1131 1142 1202 1262 1308 1259 1158 1105 1162 1219 1279 1338 1355 1371 1309 1246 1224 1201 1179 1156 1148 1141 1206
2242 1206 1271 1318 1269 1227 1185 1189 1193 1197 1201 1236 1271 1201 1131 1129 1222 1262 1301 1240 1179 1119 1058 1083 1108 1132 1157 1134 1110 1134 1158 1232 1306 1238 1170 1206 1242 1231 1220
2237 1220 1220 1220 1267 1314 1273 1233 1193 1152 1205 1259 1312 1365 1369 1373 1377 1381 1405 1428 1405 1381 1314 1246 1257 1269 1279 1289 1241 1286 1377 1373 1260 1147 1125 1198 1271 1249 1200
2233 1200 1150 1206 1261 1281 1300 1273 1245 1272 1300 1327 1354 1367 1379 1313 1246 1186 1126 1113 1100 1115 1129 1144 1159 1180 1200 1221 1242 1278 1313 1302 1290 1274 1258 1242
2229 1242 1227 1209 1191 1220 1250 1250 1250 1250 1250 1316 1381 1336 1290 1288 1285 1283 1280 1179 1078 1033 1084 1144 1205 1271 1337 1382 1426 1360 1294 1292 1290 1287 1285 1302 1320 1290 1260 1262 1264 1266 1269
2224 1269 1241 1214 1234 1254 1233 1213 1192 1172 1260 1348 1410 1378 1308 1237 1161 1084 1128 1172 1216 1260 1288 1316 1271 1226 1213 1294 1376 1362 1320 1277 1276 1275 1320 1364 1408
2219 1408 1452 1425 1397 1322 1247 1210 1174 1143 1112 1100 1182 1265 1253 1248 1244 1233 1223 1241 1260 1278 1296 1282 1268 1332 1397 1394 1390 1387 1383 1347 1310 1273 1236 1260 1285 1262 1239
2215 1239 1243 1247 1251 1254 1248 1241 1235 1228 1254 1280 1227 1174 1159 1143 1127 1111 1186 1260 1308 1262 1185 1108 1104 1101 1175 1249 1244 1240 1232 1225 1218 1211 1244 1277 1364 1355 1288 1221 1153 1086 1090 1188 1280
2210 1280 1373 1385 1397 1362 1327 1277 1227 1256 1285 1290 1294 1299 1303 1334 1366 1349 1333 1263 1193 1233 1274 1385 1497 1526 1460 1325 1284 1359 1433 1438 1443 1401 1359 1301 1243 1264
2205 1264 1286 1292 1298 1352 1406 1392 1378 1363 1349 1363 1376 1390 1403 1436 1468 1453 1438 1440 1443 1446 1448 1417 1385 1395 1405 1443 1386 1303 1220 1258 1297 1335 1373 1391 1410 1428 1446
2201 1446 1430 1414 1476 1539 1556 1573 1543 1513 1509 1505 1501 1497 1510 1522 1535 1548 1546 1544 1541 1539 1591 1643 1774 1905 1972 2039 2106 2173 2304 2435 2519 2603 2770 2937 3189
2196 3189 3442 3779 4210 4780 5350 5849 6128 6183 6081 5812 5386 4808 4230 3778 3420 3119 2818 2594 2370 2194 2017 1853 1689
2194 1689 1604 1519 1470 1421 1452 1482 1484 1486 1488 1490 1509 1528 1468 1408 1405 1403 1448 1493 1458 1423 1341 1259 1283 1307 1331 1355 1296 1237 1257 1278 1312 1346 1381 1415 1411 1407 1403 1399 1407 1416
2189 1416 1425 1433 1356 1279 1202 1124 1118 1111 1183 1255 1251 1246 1241 1237 1227 1218 1256 1295 1279 1263 1247 1230 1211 1191 1119 1141 1202 1263 1252 1240 1200 1160 1200 1239 1298 1356 1305 1253 1263
2184 1263 1272 1209 1145 1103 1156 1203 1250 1312 1373 1387 1400 1351 1302 1332 1361 1404 1447 1411 1375 1351 1328 1305 1281 1227 1173 1229 1285 1300 1315 1282 1250 1248 1245 1243 1241 1268 1295
2179 1295 1243 1192 1203 1215 1227 1239 1270 1301 1333 1364 1336 1308 1359 1409 1406 1402 1320 1237 1217 1196 1255 1313 1303 1292 1282 1271 1273 1276 1278 1280 1263 1245 1228 1210 1219 1228 1237 1245 1171
2175 1171 1097 1070 1043 1120 1197 1321 1445 1415 1385 1356 1326 1314 1301 1289 1277 1205 1132 1202 1271 1278 1285 1292 1299 1291 1282 1273 1264 1277 1291 1351 1412 1444 1477 1463 1448 1422 1396
2170 1396 1370 1343 1298 1253 1319 1384 1416 1447 1400 1352 1344 1336 1281 1226 1181 1137 1171 1205 1201 1197 1241 1284 1279 1274 1269 1264 1271 1277 1332 1386 1395 1405 1414 1424 1383 1342 1254 1166 1109 1051
2165 1051 1167 1283 1299 1314 1330 1345 1290 1234 1178 1122 1124 1125 1174 1223 1337 1452 1456 1460 1475 1490 1505 1520 1434 1349 1343 1336 1313 1290 1267 1244 1240 1237 1233 1230 1290 1351 1411
2161 1411 1472 1398 1323 1328 1333 1395 1457 1472 1486 1429 1373 1316 1259 1312 1365 1370 1375 1319 1262 1253 1243 1270 1297 1324 1352 1242 1133 1134 1135 1144 1153 1162 1171 1160 1148 1184 1219 1227 1235 1196
2156 1196 1157 1157 1157 1158 1158 1188 1218 1296 1373 1402 1430 1459 1487 1522 1556 1480 1404 1339 1274 1209 1144 1122 1100 1188 1276 1308 1340 1324 1309 1321 1333 1346 1358 1308 1259 1209
2151 1209 1160 1171 1183 1147 1112 1082 1052 1132 1213 1258 1303 1269 1235 1249 1263 1230 1196 1236 1276 1315 1355 1367 1379 1391 1404 1384 1365 1393 1421 1405 1389 1300 1211 1101
2147 1101 1086 1186 1285 1338 1295 1276 1305 1346 1339 1283 1181 1094 1101 1163 1224 1298 1371 1445 1519 1478 1437 1396 1355 1326 1297 1315 1333 1317 1301 1299 1345 1424 1407 1337 1266
2143 1266 1229 1193 1203 1213 1202 1191 1132 1073 1097 1121 1097 1073 1074 1075 1123 1171 1224 1277 1330 1382 1362 1342 1322 1301 1383 1465 1463 1368 1236 1199 1246 1292 1243 1194 1148
2139 1148 1102 1158 1262 1317 1277 1173 1118 1140 1162 1098 1035 1082 1129 1136 1144 1199 1300 1403 1411 1396 1381 1366 1351 1383 1415 1380 1345 1310 1275 1283 1292 1301 1310 1378 1446 1435
2134 1435 1425 1376 1328 1327 1326 1360 1395 1429 1464 1482 1500 1513 1525 1537 1455 1325 1290 1314 1337 1320 1302 1281 1261 1240 1220 1301 1383 1413 1349 1285 1315 1397 1479 1483 1487 1488
2130 1488 1489 1462 1388 1332 1371 1417 1415 1368 1320 1276 1231 1269 1402 1461 1424 1347 1364 1447 1530 1508 1487 1436 1385 1334 1284 1309 1334 1359 1384 1393 1402 1411 1420 1395 1370 1393 1416
2125 1416 1462 1508 1444 1380 1376 1373 1449 1525 1515 1505 1447 1390 1373 1356 1386 1417 1370 1324 1277 1231 1209 1187 1248 1404 1553 1608 1549 1489 1468 1447 1426 1405 1400 1394 1341
2121 1341 1288 1323 1359 1392 1425 1393 1314 1253 1287 1319 1303 1243 1231 1245 1211 1160 1109 1177 1246 1314 1382 1420 1459 1497 1535 1514 1493 1472 1451 1472 1492 1513 1533 1573
2117 1573 1613 1512 1410 1380 1351 1426 1501 1586 1575 1507 1439 1400 1361 1322 1283 1346 1409 1361 1313 1294 1274 1302 1330 1348 1365 1336 1307 1270 1234 1150 1066 1088 1111
2113 1111 1134 1156 1142 1129 1115 1101 1152 1202 1173 1145 1151 1156 1162 1168 1169 1169 1170 1171 1188 1206 1223 1240 1296 1352 1407 1463 1470 1476 1404 1332 1339 1347 1355 1362 1335 1307 1279 1251 1275 1299 1275
2108 1275 1251 1237 1223 1287 1352 1396 1440 1437 1433 1415 1396 1377 1358 1341 1323 1258 1193 1249 1305 1313 1322 1333 1343 1306 1270 1296 1322 1275 1228 1239 1344 1449 1459 1434 1408
2104 1408 1377 1346 1249 1153 1114 1169 1275 1380 1349 1319 1284 1250 1262 1275 1305 1336 1287 1238 1225 1212 1199 1186 1191 1196 1202 1207 1227 1247 1220 1192 1178 1163 1149 1134 1134 1133
2099 1133 1132 1132 1130 1128 1079 1030 1070 1110 1149 1189 1219 1248 1199 1149 1156 1162 1169 1176 1178 1181 1215 1201 1207 1293 1401 1463 1448 1386 1321 1303 1307 1310 1317 1324 1345 1365 1339 1312 1295 1279 1262
2094 1262 1245 1309 1374 1359 1344 1356 1368 1332 1249 1196 1222 1230 1191 1169 1194 1218 1196 1164 1180 1165 1151 1181 1210 1239 1269 1229 1188 1227 1266 1360 1454 1456 1378 1336 1374
2090 1374 1366 1279 1198 1227 1358 1489 1496 1424 1351 1358 1406 1455 1429 1403 1398 1393 1391 1389 1374 1405 1455 1425 1379 1334 1331 1328 1303 1278 1253 1228 1230 1232 1313 1394 1382 1371 1359 1347 1380
2085 1380 1413 1368 1322 1319 1317 1272 1227 1224 1300 1378 1378 1330 1330 1327 1278 1221 1212 1220 1229 1242 1254 1267 1279 1287 1295 1335 1327 1286 1324 1425 1526 1519 1512 1458 1356 1225 1172 1215 1257
2080 1257 1252 1247 1290 1379 1414 1369 1343 1363 1366 1322 1234 1145 1133 1201 1253 1258 1268 1325 1380 1387 1396 1405 1411 1417 1400 1384 1367 1350 1301 1251 1281 1311 1310 1309 1311 1313 1326 1388 1466 1466 1431
2075 1431 1395 1402 1408 1371 1335 1377 1419 1392 1366 1340 1313 1314 1316 1317 1318 1315 1312 1356 1401 1426 1450 1428 1405 1401 1398 1394 1391 1325 1260 1273 1286 1335 1384 1386 1387 1398 1408 1419 1429 1352 1276
2070 1276 1278 1280 1315 1351 1386 1422 1388 1353 1366 1380 1401 1423 1445 1467 1463 1459 1455 1450 1466 1481 1570 1658 1661 1568 1482 1395 1401 1407 1413 1420 1435 1450 1465 1481 1470 1460 1497 1534 1601 1668
2065 1668 1656 1645 1625 1605 1658 1712 1757 1707 1632 1557 1611 1665 1719 1773 1764 1754 1739 1819 1919 2019 2046 2074 2174 2274 2459 2644 2889 3228 3731 4454
2062 4454 5168 5535 5412 5006 4577 4307 4178 4271 4541 4969 5653 6874 8794 10998 12688 13274 12711 11421 9863 8399 7277
2059 7277 6629 6509 6800 7479 8568 10131 12104 14117 15277 14773 12658 9942 7762 6404 5519 4948 4724 4926 5350 5918
2057 5918 6581 7098 7015 6236 5172 4223 3558 3029 2658 2462 2361 2286 2212 2222 2232 2196 2161 2149 2137 2097 2056 2015 1974 1915 1856 1908 1959 1958 1957 1979
2053 1979 2002 2013 2024 2082 2141 2251 2361 2424 2487 2472 2458 2554 2649 2731 2813 3047 3281 3579 4034 4831 5975 7174 8026 8255 7947 7422 7054
2050 7054 7011 7251 7902 9405 11716 14026 15011 14323 12888 11926 11715 11726 11480 11139 11100 11408 11574 11267 10774 10754 11340 11927 11646
2047 11646 10386 8904 7895 7466 7258 7044 6925 6967 7010 6864 6372 5607 4937 4567 4481 4692 5123 5717 6153 6151 5738 5172 4700
2044 4700 4315 4088 4122 4440 4890 5561 6725 8363 10075 11251 11617 11258 10379 9217 8082 7231 6788 6755 7172 7999 9255
2042 9255 10921 13047 15173 16272 15635 13559 11326 9959 9696 10152 10829 11362 11483 11412 11687 12415 13048 13158 13268 14160 15842
2039 15842 17012 16509 14527 12323 10830 10063 9645 9384 9526 10142 10920 11223 10853 10198 9855 9860 9680 8836 7559 6565 6136 5991
2036 5991 5707 5327 5232 5420 5658 5549 5077 4447 3966 3706 3526 3347 3178 3166 3230 3293 3153 2855 2551 2341 2175 2104 2138 2266 2400
2033 2400 2534 2620 2549 2332 2115 2008 1996 1929 1861 1826 1885 2009 2133 2395 2658 2887 2959 2972 2985 2909 2738 2510 2282 2150 2018 2003 2146
2030 2146 2419 2691 3063 3434 3639 3497 3008 2519 2213 2065 2002 1939 1979 2020 2118 2310 2639 2967 3162 3072 2807 2542 2316 2185 2091
2027 2091 1998 2112 2446 2916 3291 3404 3233 2937 2641 2480 2413 2360 2308 2403 2593 2727 2704 2544 2383 2375 2461 2576 2534 2341 2053 1834
2024 1834 1710 1676 1642 1724 1902 2017 1974 1789 1604 1532 1459 1387 1314 1263 1212 1272 1332 1338 1344 1350 1355 1352 1348 1290 1328 1366 1405 1396 1387 1462 1444 1336 1228 1246 1263
2019 1263 1281 1299 1284 1269 1295 1322 1375 1334 1210 1086 1053 1114 1122 1131 1161 1192 1223 1254 1226 1197 1216 1235 1306 1377 1369 1362 1339 1316 1341 1366 1359 1353 1346 1339 1383 1427 1392
2015 1392 1356 1287 1218 1196 1174 1216 1258 1341 1425 1449 1379 1302 1320 1351 1288 1151 1109 1224 1338 1402 1371 1304 1237 1244 1250 1274 1298 1275 1251 1314 1376 1392 1407 1362
2011 1362 1318 1273 1228 1248 1267 1287 1306 1323 1340 1357 1374 1372 1369 1413 1458 1469 1481 1413 1345 1334 1322 1311 1299 1319 1339 1312 1285 1304 1323 1295 1267 1215 1163 1190 1217
2007 1217 1270 1323 1328 1334 1371 1409 1368 1326 1269 1212 1234 1256 1304 1353 1297 1241 1232 1317 1375 1387 1341 1295 1247 1198 1193 1187 1138 1088 1130 1218 1286 1260 1222 1185 1189 1193 1249 1304
2002 1304 1281 1258 1243 1228 1260 1292 1384 1476 1457 1438 1425 1413 1400 1387 1395 1403 1409 1414 1382 1302 1196 1184 1258 1332 1297 1168 1121 1169 1264 1311 1334 1357 1329 1302 1249
1998 1249 1196 1190 1185 1261 1338 1367 1396 1353 1310 1267 1225 1248 1271 1247 1223 1208 1194 1138 1083 1073 1159 1218 1229 1232 1235 1234 1234 1246 1259 1224 1189 1201 1212 1224 1235 1248 1260
1993 1260 1272 1285 1309 1334 1358 1382 1308 1234 1161 1087 1175 1263 1350 1438 1400 1362 1324 1286 1299 1312 1326 1339 1315 1292 1269 1245 1273 1301 1329 1357 1386 1414 1442 1470
1989 1470 1407 1344 1282 1219 1203 1186 1170 1153 1128 1103 1157 1210 1235 1260 1284 1309 1308 1307 1306 1305 1314 1323 1284 1246 1231 1216 1202 1187 1195 1203 1259 1314 1260 1206 1200 1193 1224 1256 1208
1984 1208 1161 1131 1101 1118 1136 1165 1194 1271 1348 1391 1434 1366 1299 1298 1297 1343 1390 1373 1355 1362 1368 1398 1427 1377 1327 1338 1349 1360 1371 1329 1288 1293 1299 1269 1240 1258 1276
1980 1276 1265 1255 1220 1186 1215 1243 1272 1300 1335 1370 1326 1282 1289 1297 1262 1228 1212 1291 1342 1347 1319 1291 1260 1229 1186 1143 1179 1215 1220 1225 1157 1090 1113 1231 1307 1289
1975 1289 1251 1307 1408 1460 1446 1384 1346 1307 1285 1262 1167 1071 1021 1064 1134 1203 1243 1282 1274 1266 1311 1355 1376 1397 1365 1334 1303 1272 1203 1134 1144 1154 1152 1150 1148 1147 1151
1971 1151 1156 1236 1317 1454 1545 1516 1392 1268 1239 1292 1346 1370 1394 1371 1348 1304 1260 1263 1266 1305 1344 1335 1327 1332 1336 1268 1200 1186 1267 1375 1388 1348 1355 1404 1405 1338 1272
1966 1272 1282 1291 1255 1219 1183 1147 1183 1219 1254 1290 1278 1265 1253 1241 1256 1271 1286 1301 1311 1322 1332 1342 1302 1261 1330 1446 1494 1448 1401 1402 1414 1330 1250 1264 1335
1962 1335 1407 1342 1230 1174 1197 1252 1306 1351 1396 1362 1280 1273 1344 1398 1404 1398 1438 1494 1470 1424 1378 1374 1370 1379 1388 1397 1406 1373 1339 1414 1488 1429 1324 1259 1304 1385 1418 1406
1957 1406 1394 1350 1306 1261 1217 1242 1268 1214 1161 1120 1079 1085 1091 1151 1212 1272 1333 1277 1221 1212 1203 1203 1204 1204 1204 1201 1198 1195 1193 1175 1157 1140 1122 1116 1110 1183 1256 1210 1164 1118 1071
1952 1071 1099 1127 1155 1183 1240 1298 1276 1255 1284 1313 1295 1277 1248 1219 1195 1171 1157 1221 1314 1361 1324 1288 1248 1208 1178 1147 1164 1181 1209 1238 1266 1295 1265 1235
1948 1235 1255 1276 1309 1389 1461 1422 1289 1203 1257 1310 1277 1243 1288 1333 1324 1316 1355 1394 1394 1395 1395 1396 1458 1521 1505 1488 1395 1302 1319 1336 1320 1305 1289 1273 1313 1354 1347
1944 1347 1340 1333 1326 1366 1407 1368 1330 1339 1348 1310 1272 1314 1355 1373 1390 1361 1331 1317 1303 1336 1369 1398 1427 1409 1391 1368 1346 1397 1448 1419 1295 1224 1154 1146 1137 1202 1266
1939 1266 1371 1381 1334 1287 1342 1397 1404 1412 1372 1332 1292 1252 1244 1235 1233 1230 1149 1162 1264 1366 1286 1206 1205 1361 1493 1531 1489 1447 1410 1372 1334 1296 1337 1379 1420
1935 1420 1461 1392 1324 1328 1332 1329 1230 1132 1129 1199 1269 1298 1327 1289 1251 1213 1175 1152 1129 1185 1241 1285 1329 1294 1259 1295 1332 1368 1404 1338 1272 1231 1285 1318 1351 1390
1930 1390 1428 1465 1501 1533 1565 1608 1571 1469 1366 1282 1197 1191 1185 1162 1139 1147 1234 1313 1345 1298 1251 1169 1086 1047 1119 1224 1250 1159 1068 1063 1137 1214 1291 1381 1471
1926 1471 1500 1449 1410 1449 1483 1438 1343 1248 1227 1206 1205 1203 1249 1296 1266 1236 1253 1271 1267 1263 1258 1254 1260 1265 1345 1425 1463 1422 1399 1424 1431 1437 1447 1456 1478 1499 1474 1448 1457 1467
1921 1467 1477 1486 1463 1439 1368 1297 1272 1248 1302 1356 1360 1363 1319 1275 1272 1268 1312 1356 1378 1400 1419 1438 1439 1393 1326 1338 1441 1497 1471 1398 1332 1314 1313 1312 1262 1211 1161 1110
1917 1110 1126 1142 1236 1331 1371 1412 1342 1272 1216 1160 1214 1268 1278 1288 1251 1214 1162 1111 1139 1167 1201 1234 1221 1207 1237 1267 1218 1169 1161 1153 1192 1231 1244 1258 1224
1912 1224 1190 1133 1076 1130 1184 1195 1207 1218 1230 1228 1227 1240 1301 1343 1291 1238 1280 1342 1356 1324 1292 1309 1325 1336 1346 1387 1334 1254 1175 1120 1066 1005 1040 1115 1190
1908 1190 1192 1194 1290 1386 1396 1311 1256 1249 1238 1181 1109 1085 1167 1250 1305 1266 1233 1200 1169 1138 1107 1076 1132 1187 1243 1299 1309 1319 1282 1245 1287 1329 1348 1273 1200 1175
1904 1175 1165 1154 1192 1231 1222 1212 1194 1176 1206 1235 1244 1253 1263 1272 1289 1306 1323 1340 1284 1227 1250 1273 1278 1283 1241 1199 1217 1236 1254 1273 1294 1314 1335 1355 1325 1295 1344
1899 1344 1392 1408 1424 1441 1457 1414 1371 1325 1279 1252 1178 1150 1216 1366 1420 1359 1250 1209 1215 1192 1169 1153 1138 1199 1260 1269 1230 1161 1188 1260 1286 1264 1243 1268
1895 1268 1294 1319 1344 1289 1234 1202 1264 1345 1379 1335 1291 1252 1213 1175 1136 1197 1258 1319 1380 1394 1407 1421 1435 1432 1429 1378 1328 1317 1307 1296 1286 1347 1409 1360 1311
1891 1311 1247 1184 1231 1278 1317 1357 1317 1277 1297 1317 1290 1263 1296 1328 1314 1299 1311 1323 1335 1346 1314 1281 1207 1133 1085 1132 1236 1340 1365 1390 1368 1346 1385
1887 1385 1424 1416 1408 1377 1345 1314 1283 1283 1283 1235 1188 1191 1195 1246 1297 1314 1331 1348 1365 1357 1349 1263 1176 1243 1310 1298 1287 1298 1309 1325 1342 1351 1454 1519 1427 1279 1225 1250
1882 1250 1276 1239 1201 1243 1285 1269 1253 1236 1220 1222 1223 1178 1132 1147 1162 1223 1285 1336 1387 1327 1268 1223 1178 1212 1246 1246 1246 1245 1245 1261 1278 1215 1153 1162 1172 1229 1286 1310
1877 1310 1333 1278 1222 1277 1331 1338 1345 1339 1332 1332 1331 1301 1365 1376 1387 1340 1293 1325 1357 1373 1388 1398 1408 1448 1394 1314 1234 1290 1347 1325 1303 1288 1274 1338 1403 1453 1503
1873 1503 1442 1381 1349 1317 1332 1348 1313 1278 1243 1208 1247 1286 1331 1282 1215 1149 1187 1225 1237 1248 1260 1271 1273 1275 1204 1133 1119 1200 1281 1267 1231 1195 1233 1270 1277 1284
1868 1284 1292 1299 1258 1218 1224 1231 1257 1283 1309 1336 1336 1337 1379 1421 1490 1464 1355 1246 1145 1139 1247 1355 1486 1522 1438 1354 1349 1344 1338 1333 1384 1435 1486 1537 1467 1396 1326
1864 1326 1255 1331 1407 1435 1305 1168 1125 1161 1197 1197 1196 1196 1196 1216 1236 1304 1372 1345 1319 1293 1267 1278 1288 1298 1309 1281 1253 1272 1291 1281 1270 1260 1249 1324 1400
1860 1400 1396 1392 1354 1315 1324 1333 1322 1310 1299 1288 1268 1248 1228 1208 1190 1172 1233 1294 1283 1272 1189 1105 1105 1200 1289 1378 1356 1334 1311 1289 1348 1406 1417 1429 1413 1397 1381
1855 1381 1365 1333 1300 1220 1140 1116 1091 1114 1137 1154 1171 1236 1300 1222 1144 1176 1208 1225 1241 1211 1180 1195 1210 1303 1397 1414 1431 1400 1370 1380 1391 1322 1254 1194
1851 1194 1134 1154 1173 1178 1182 1187 1192 1221 1251 1233 1215 1198 1182 1244 1307 1291 1276 1260 1245 1237 1229 1295 1362 1403 1366 1302 1285 1320 1401 1439 1429 1408 1386 1409 1431 1392 1352
1846 1352 1270 1188 1183 1258 1362 1419 1441 1462 1480 1499 1453 1407 1362 1316 1305 1294 1283 1272 1320 1368 1337 1306 1290 1274 1305 1336 1316 1296 1276 1256 1263 1269 1307 1298 1256 1293
1842 1293 1385 1430 1365 1253 1199 1224 1281 1337 1320 1302 1246 1189 1243 1297 1286 1276 1266 1255 1244 1232 1268 1304 1335 1366 1318 1270 1214 1158 1181 1204 1244 1284 1324 1363
1838 1363 1284 1205 1187 1248 1317 1307 1299 1291 1306 1321 1336 1351 1388 1425 1383 1340 1358 1376 1394 1412 1426 1440 1501 1562 1504 1446 1388 1330 1305 1279 1212 1146 1087 1124 1249
1834 1249 1374 1386 1397 1409 1421 1351 1281 1263 1339 1425 1417 1388 1360 1340 1320 1300 1280 1284 1288 1292 1295 1369 1444 1461 1383 1349 1314 1353 1391 1329 1267 1204 1142 1159 1177 1194
1829 1194 1211 1221 1230 1240 1249 1216 1183 1254 1326 1338 1256 1173 1186 1192 1199 1211 1223 1282 1340 1319 1299 1290 1281 1272 1264 1293 1322 1393 1464 1525 1492 1377 1261 1164 1163 1219 1274 1284
1824 1284 1295 1305 1315 1301 1287 1274 1260 1267 1275 1236 1196 1137 1077 1069 1156 1234 1217 1180 1143 1147 1152 1156 1160 1137 1113 1090 1066 1088 1110 1085 1059 1074 1089 1152 1214 1208 1202 1149 1096
1820 1096 1116 1136 1156 1176 1224 1272 1321 1369 1380 1391 1354 1318 1311 1304 1344 1384 1396 1408 1467 1526 1494 1462 1429 1397 1369 1340 1359 1378 1393 1408 1417 1427 1417 1313 1235
1815 1235 1205 1250 1295 1296 1297 1234 1171 1108 1045 1102 1160 1218 1276 1232 1188 1144 1100 1143 1186 1181 1177 1160 1144 1128 1112 1114 1115 1196 1277 1254 1232 1256 1281 1343 1405 1387 1370
1811 1370 1279 1188 1207 1226 1231 1235 1239 1243 1281 1320 1358 1397 1390 1384 1377 1371 1409 1447 1479 1511 1544 1483 1344 1252 1227 1297 1343 1342 1304 1265 1271 1277 1242 1207 1219 1278 1323 1273 1247
1806 1247 1268 1276 1190 1106 1118 1220 1321 1287 1253 1294 1336 1383 1336 1281 1226 1212 1199 1226 1253 1279 1306 1253 1201 1142 1178 1239 1300 1319 1338 1289 1240 1185 1224 1317
1802 1317 1410 1335 1260 1217 1174 1178 1183 1261 1340 1339 1339 1318 1297 1276 1255 1257 1258 1260 1262 1291 1320 1349 1378 1407 1436 1465 1494 1469 1444 1419 1393 1342 1290 1343 1396 1411 1331 1250
1797 1250 1265 1284 1302 1327 1351 1366 1382 1349 1317 1349 1381 1334 1287 1244 1202 1238 1274 1359 1444 1418 1392 1361 1330 1299 1267 1299 1331 1363 1395 1396 1396 1445 1493 1494 1496 1498 1500
1793 1500 1460 1420 1380 1341 1349 1358 1367 1375 1377 1379 1333 1287 1278 1269 1339 1409 1409 1408 1329 1250 1265 1281 1249 1217 1190 1163 1246 1330 1352 1374 1349 1323 1416 1508 1486 1369 1254 1233
1788 1233 1296 1358 1295 1233 1227 1316 1345 1373 1361 1348 1349 1350 1352 1353 1292 1231 1176 1121 1131 1235 1340 1350 1277 1204 1151 1193 1248 1302 1284 1266 1219 1173 1173 1174 1153 1132 1110
1784 1110 1089 1130 1171 1212 1253 1241 1228 1222 1215 1166 1210 1313 1415 1360 1306 1272 1332 1341 1255 1181 1107 1162 1217 1313 1409 1391 1278 1212 1242 1305 1369 1392 1414 1384
1779 1384 1353 1275 1196 1247 1299 1302 1306 1301 1296 1291 1285 1238 1190 1190 1189 1243 1297 1304 1310 1289 1268 1294 1320 1294 1268 1242 1216 1243 1270 1249 1229 1297 1365 1386 1407 1387 1367 1346 1326
1775 1326 1344 1361 1379 1396 1416 1437 1410 1383 1315 1248 1228 1208 1210 1213 1137 1060 1081 1101 1200 1300 1318 1337 1277 1217 1161 1104 1159 1213 1260 1308 1308 1308 1311 1314 1238 1162 1154
1770 1154 1146 1139 1131 1162 1193 1224 1255 1262 1268 1275 1282 1289 1296 1303 1310 1276 1242 1208 1174 1288 1402 1406 1409 1370 1331 1340 1348 1279 1209 1219 1228 1259 1290 1321 1352 1376 1400 1345 1290 1301 1313
1765 1313 1371 1430 1492 1554 1505 1456 1435 1414 1393 1372 1327 1283 1317 1351 1342 1333 1323 1314 1276 1237 1198 1159 1098 1037 1118 1199 1238 1277 1269 1262 1306 1350 1395 1439 1380 1321 1340
1761 1340 1360 1425 1490 1476 1461 1395 1329 1310 1291 1303 1315 1327 1339 1342 1345 1348 1352 1332 1312 1293 1273 1266 1258 1298 1337 1328 1319 1357 1395 1463 1531 1510 1394 1285 1177 1119 1156
1756 1156 1185 1213 1248 1282 1325 1367 1300 1232 1197 1162 1237 1312 1346 1380 1367 1354 1315 1276 1237 1199 1212 1225 1237 1250 1283 1316 1348 1381 1377 1374 1370 1366 1393 1420 1441 1462
1752 1462 1415 1273 1143 1171 1256 1341 1294 1247 1252 1257 1262 1267 1243 1220 1243 1267 1316 1365 1335 1305 1330 1355 1386 1322 1263 1204 1249 1294 1312 1331 1350 1368 1378 1387 1318 1249
1747 1249 1240 1231 1295 1358 1435 1417 1342 1267 1326 1385 1397 1409 1441 1474 1428 1382 1350 1318 1286 1253 1229 1205 1180 1156 1254 1352 1367 1288 1229 1264 1319 1374 1357 1340 1324
1743 1324 1307 1255 1202 1198 1193 1260 1327 1395 1462 1446 1431 1415 1400 1469 1538 1528 1519 1520 1522 1476 1431 1395 1359 1323 1287 1316 1344 1373 1401 1405 1409 1413 1417 1385 1354 1370 1386 1331 1276
1738 1276 1300 1324 1309 1294 1280 1265 1201 1136 1120 1103 1104 1104 1105 1106 1173 1240 1259 1279 1294 1309 1219 1130 1069 1102 1162 1221 1224 1227 1229 1232 1207 1182 1157 1132 1243 1354 1439
1734 1439 1429 1374 1319 1337 1355 1323 1291 1259 1228 1231 1235 1239 1242 1343 1444 1519 1500 1432 1364 1338 1311 1305 1299 1340 1382 1370 1358 1304 1251 1231 1306 1375 1444 1426 1407 1388
1729 1388 1370 1360 1351 1389 1427 1412 1396 1428 1460 1418 1375 1332 1290 1328 1366 1357 1348 1341 1335 1328 1322 1322 1321 1242 1162 1222 1282 1342 1401 1352 1304 1255 1206 1195 1183 1219 1255 1275 1294
1725 1294 1266 1238 1251 1264 1324 1384 1368 1352 1337 1321 1339 1357 1454 1551 1532 1512 1493 1474 1493 1513 1453 1394 1346 1297 1296 1295 1255 1215 1253 1292 1310 1328 1347 1365 1435
1720 1435 1505 1465 1425 1456 1487 1518 1549 1517 1484 1404 1325 1296 1268 1287 1306 1271 1236 1201 1167 1221 1275 1281 1288 1263 1238 1213 1188 1188 1188 1187 1187 1193 1199 1205 1212 1303 1394 1374 1355
1716 1355 1296 1237 1226 1215 1227 1238 1250 1261 1314 1367 1372 1378 1358 1338 1318 1298 1219 1139 1171 1202 1257 1312 1320 1328 1289 1251 1213 1175 1209 1242 1276 1310 1346 1382 1418 1454
1711 1454 1436 1418 1400 1381 1380 1378 1361 1296 1235 1253 1300 1301 1250 1247 1293 1339 1346 1354 1361 1369 1341 1313 1284 1256 1253 1249 1293 1337 1339 1341 1343 1345 1271 1198 1173 1147 1143 1139 1135 1131 1192 1253 1267
1706 1267 1281 1256 1231 1209 1187 1181 1222 1284 1267 1208 1196 1263 1329 1345 1360 1297 1234 1189 1145 1211 1277 1330 1383 1433 1484 1433 1336 1267 1278 1309 1339 1327 1316 1366 1416
1702 1416 1466 1516 1502 1488 1426 1365 1353 1341 1377 1413 1398 1383 1416 1448 1415 1382 1349 1316 1250 1184 1166 1148 1197 1247 1249 1251 1217 1184 1293 1401 1379 1357 1381 1406
1697 1406 1410 1413 1369 1325 1315 1304 1373 1442 1447 1452 1456 1461 1445 1430 1367 1256 1150 1122 1216 1310 1363 1337 1327 1363 1392 1373 1337 1300 1269 1238 1255 1271 1246 1221 1244 1266
1693 1266 1266 1266 1281 1344 1389 1355 1319 1362 1418 1395 1316 1284 1277 1270 1265 1261 1278 1296 1313 1331 1383 1435 1376 1318 1291 1265 1238 1212 1190 1168 1194 1220 1279 1338 1318 1298 1297 1297
1688 1297 1297 1296 1266 1236 1206 1176 1166 1156 1145 1135 1137 1139 1140 1142 1172 1201 1230 1260 1274 1288 1301 1315 1298 1280 1310 1339 1352 1364 1298 1232 1259 1287 1314 1342 1323 1304 1333
1684 1333 1362 1331 1301 1302 1382 1475 1522 1521 1520 1478 1435 1393 1351 1327 1304 1327 1351 1324 1296 1269 1242 1242 1243 1260 1324 1403 1404 1373 1343 1326 1308 1291 1274 1320 1366 1302 1237
1679 1237 1249 1261 1273 1285 1290 1296 1254 1212 1258 1304 1374 1443 1447 1451 1407 1363 1396 1429 1438 1447 1367 1288 1215 1141 1143 1240 1309 1332 1314 1296 1322 1348 1367 1386 1358 1329 1316 1302
1675 1302 1336 1370 1372 1374 1376 1378 1363 1349 1334 1319 1313 1307 1300 1294 1329 1364 1352 1340 1330 1320 1358 1395 1452 1509 1455 1402 1400 1398 1373 1347 1313 1278 1226 1174 1140 1200 1318 1436
1670 1436 1518 1599 1723 1846 1958 1976 1926 1782 1626 1470 1397 1419 1453 1488 1481 1474 1498 1522 1522 1522 1408 1294 1204 1114 1133 1153 1130 1108 1072 1130 1240 1349
1666 1349 1395 1347 1316 1379 1450 1426 1327 1275 1305 1382 1441 1406 1369 1332 1368 1404 1460 1516 1572 1628 1635 1642 1649 1656 1740 1824 1908 2087 2365 2737 2999 3103 2980
1662 2980 2699 2361 2023 1791 1654 1574 1494 1452 1411 1369 1328 1335 1342 1302 1261 1264 1267 1270 1273 1244 1215 1265 1315 1307 1299 1243 1187 1182 1177 1219 1261 1240 1219 1224 1323 1406 1488
1658 1488 1466 1444 1425 1406 1466 1526 1515 1504 1493 1483 1512 1541 1593 1646 1778 1909 2183 2551 2895 3080 2991 2745 2406 2067 1775 1579 1510 1442 1426
1654 1426 1411 1467 1523 1500 1478 1419 1361 1350 1339 1383 1427 1393 1358 1354 1351 1371 1391 1393 1394 1348 1303 1344 1386 1348 1311 1274 1237 1247 1258 1306 1354 1407 1366 1330 1293 1330
1650 1330 1366 1368 1370 1396 1422 1501 1580 1635 1690 1766 1841 1869 1898 1850 1803 1732 1661 1589 1516 1444 1371 1391 1410 1430 1449 1433 1417 1401 1385 1395 1405 1415 1425 1397 1370
1645 1370 1421 1473 1487 1502 1437 1373 1357 1341 1373 1405 1391 1377 1339 1301 1305 1308 1311 1315 1347 1380 1365 1350 1365 1379 1394 1409 1352 1294 1284 1274 1249 1224 1246 1269 1277 1286 1310
1641 1310 1381 1424 1373 1272 1219 1275 1330 1341 1353 1410 1468 1447 1426 1410 1394 1379 1363 1371 1379 1387 1395 1443 1491 1428 1365 1316 1267 1266 1265 1311 1357 1379 1401 1407 1412 1464 1517 1473
1636 1473 1429 1464 1499 1515 1530 1467 1403 1439 1475 1463 1452 1393 1335 1324 1313 1305 1297 1312 1328 1321 1314 1308 1301 1292 1283 1274 1265 1280 1296 1359 1422 1447 1472 1497 1522 1536 1551 1565 1580
1631 1580 1533 1486 1416 1345 1363 1381 1351 1322 1291 1261 1309 1357 1341 1324 1354 1385 1436 1488 1491 1495 1524 1552 1557 1562 1500 1437 1399 1360 1322 1283 1324 1364 1403 1443 1482 1521
1627 1521 1456 1391 1373 1355 1329 1304 1278 1252 1196 1140 1106 1167 1263 1312 1283 1254 1293 1331 1323 1315 1322 1330 1290 1250 1237 1224 1211 1198 1187 1176 1213 1249 1338 1427 1490 1459
1623 1459 1404 1350 1368 1387 1421 1455 1442 1429 1462 1495 1449 1403 1386 1369 1400 1431 1407 1383 1374 1412 1477 1447 1337 1227 1181 1229 1271 1313 1335 1358 1333 1308 1309 1311 1360
1618 1360 1409 1396 1383 1370 1356 1337 1317 1345 1373 1441 1510 1495 1386 1300 1309 1337 1365 1363 1361 1359 1357 1369 1380 1345 1309 1259 1208 1237 1265 1279 1294 1261 1228 1237 1247 1256 1266
1614 1266 1206 1146 1165 1183 1212 1241 1270 1299 1294 1289 1332 1375 1407 1440 1473 1506 1522 1539 1508 1476 1369 1262 1213 1258 1324 1391 1416 1441 1430 1419 1455 1491 1446 1402
1610 1402 1357 1313 1307 1300 1294 1288 1279 1270 1261 1252 1282 1311 1293 1276 1299 1322 1346 1369 1335 1301 1267 1234 1299 1364 1382 1400 1409 1418 1380 1342 1254 1166 1158 1149 1226 1303 1380 1457 1453 1449 1493
1605 1493 1537 1458 1379 1294 1304 1350 1396 1448 1500 1459 1417 1432 1542 1728 1914 2020 2127 2279 2337 2242 1990 1765 1634 1551 1467 1421 1374 1333 1292 1222
1601 1222 1246 1323 1352 1284 1215 1191 1167 1247 1326 1406 1486 1525 1564 1524 1485 1451 1417 1431 1444 1443 1442 1488 1534 1498 1463 1427 1392 1371 1350 1329 1309 1301 1294 1286 1279 1341 1404
1596 1404 1419 1434 1405 1375 1345 1315 1291 1268 1291 1315 1336 1358 1379 1401 1352 1304 1302 1301 1275 1248 1300 1352 1323 1293 1263 1234 1231 1229 1273 1318 1345 1372 1321 1269 1246 1223
1592 1223 1200 1177 1208 1239 1270 1302 1328 1355 1381 1408 1456 1505 1506 1506 1506 1505 1431 1358 1349 1435 1474 1418 1320 1222 1197 1172 1225 1278 1330 1383 1399 1415 1478 1541 1552 1563 1527
1588 1527 1490 1428 1365 1413 1460 1449 1438 1426 1415 1387 1359 1331 1304 1327 1351 1374 1398 1407 1417 1427 1437 1375 1313 1329 1346 1397 1448 1496 1544 1475 1360 1353 1442 1538 1539
1583 1539 1489 1438 1391 1344 1344 1344 1360 1377 1393 1409 1396 1382 1369 1356 1307 1259 1258 1257 1293 1330 1366 1403 1421 1440 1411 1382 1333 1283 1312 1387 1424 1366 1338 1357 1449 1541
1579 1541 1614 1591 1542 1540 1641 1743 1832 1827 1796 1766 1772 1779 1786 1793 1755 1717 1632 1547 1481 1414 1456 1546 1600 1559 1495 1431 1424 1417 1457 1497 1470 1444 1417 1390 1389 1389 1388 1388 1393 1399
1574 1399 1404 1409 1396 1382 1369 1355 1362 1370 1392 1461 1519 1481 1390 1299 1325 1352 1379 1406 1434 1462 1490 1518 1492 1465 1486 1507 1514 1521 1528 1535 1557 1579 1600 1622 1627 1631 1636 1640 1664 1688
1569 1688 1713 1737 1747 1757 1762 1766 1720 1579 1492 1405 1425 1445 1513 1581 1659 1738 1775 1812 1898 2079 2321 2658 3057 3362 3429 3211 2885 2559 2363 2167
1565 2167 1975 1878 1879 1976 2008 2040 1999 1958 1927 1895 1975 2054 2101 2148 2116 2084 2132 2181 2277 2374 2576 2778 2993 3112 3212 3407 3708 4104 4575 5267
1562 5267 6326 7859 10311 14437 20662 28055 34043 35832 32570 25867 18596 12872 9219 6987 5525 4473 3802 3352
1560 3352 3036 2720 2506 2387 2284 2181 2131 2082 1999 1917 1882 1847 1813 1779 1745 1712 1651 1591 1578 1565 1592 1618 1598 1577 1582 1586 1590 1594 1562 1529 1607 1685 1718
1555 1718 1750 1780 1809 1861 1865 1781 1602 1450 1392 1450 1556 1589 1575 1591 1607 1623 1640 1610 1579 1600 1621 1641 1662 1629 1595 1585 1668 1752 1787 1772 1709 1637 1565
1551 1565 1545 1619 1659 1651 1647 1689 1689 1641 1596 1598 1664 1731 1746 1666 1555 1491 1508 1571 1590 1562 1537 1560 1581 1602 1626 1651 1658 1666 1673 1681 1668 1656 1644 1632 1637 1643 1649 1654 1667 1680
1547 1680 1692 1705 1748 1792 1756 1721 1759 1797 1789 1780 1739 1698 1705 1712 1724 1737 1797 1857 1890 1923 1880 1837 1843 1897 1980 1969 1910 1899 1966 2032 2053 2075 2048 2022 1963 1904 1902
1542 1902 1994 2067 2140 2219 2298 2288 2279 2237 2242 2244 2151 2062 2067 2107 2146 2135 2219 2345 2423 2423 2423 2419 2414 2410 2406 2423 2439 2456 2472 2545 2618 2691 2763 2824 2885 2946 3007 3045 3082
1537 3082 3119 3156 3254 3352 3372 3391 3350 3309 3265 3378 3644 4004 4321 4639 4922 5205 5778 6761 7996 9231 10062 10293 9888 9074 8255
1534 8255 7721 7471 7378 7456 7817 8407 9091 9766 10535 11389 12243 13269 14705 16642 19115 22382 27069 33752 43307 57944
1532 57944 80822 113099 150268 181657 195398 185793 156899 119899 86025 60928 44261 33178 25409 19991
1530 19991 16308 13613 11580 10161 9215 8501 7788 7229 6669 6094 5425 4884 4502 4139 3681 3239 3018 2936 2853 2734 2615 2544
1527 2544 2472 2404 2335 2267 2198 2257 2315 2473 2632 2683 2577 2332 2087 1969 2009 2093 2082 2047 2012 1971 1930 1947 1964 1981 1998 2015 2033 2051 2069 2033 1997
1524 1997 2071 2145 2143 2140 2185 2229 2199 2169 2140 2110 2097 2085 2026 1966 1901 1836 1771 1706 1687 1667 1695 1723 1723 1723 1723 1723 1741 1759 1856 1953 1938 1923 1908 1893 1829 1765 1748
1519 1748 1731 1742 1752 1762 1773 1803 1833 1784 1735 1780 1825 1870 1915 1882 1850 1818 1786 1790 1793 1844 1895 1872 1850 1828 1806 1854 1903 1904 1905 1940 1974 1961 1949 1919 1889 1859
1515 1859 1829 1823 1818 1813 1807 1812 1817 1822 1827 1811 1794 1888 1981 1997 2013 1982 1950 1911 1871 1879 1887 1872 1856 1794 1731 1736 1741 1825 1910 1931 1953 1975 1997 2073 2149 2146 2143 2011 1878 1824
1510 1824 1770 1805 1840 1875 1910 1886 1862 1838 1814 1755 1695 1715 1734 1743 1752 1713 1675 1739 1803 1873 1848 1763 1678 1697 1717 1726 1735 1743 1752 1726 1700 1721 1742 1735 1729 1675 1621 1643
1505 1643 1665 1687 1709 1752 1795 1727 1659 1573 1487 1480 1473 1561 1648 1688 1729 1686 1643 1679 1715 1730 1746 1714 1682 1648 1614 1580 1547 1598 1649 1621 1593 1604 1615 1626 1637
1501 1637 1616 1595 1574 1554 1608 1662 1664 1572 1474 1471 1551 1630 1565 1499 1433 1368 1385 1402 1419 1436 1385 1334 1394 1453 1477 1501 1477 1454 1434 1414 1395 1375 1367 1359 1430 1501
1496 1501 1520 1540 1559 1579 1510 1442 1367 1388 1425 1463 1428 1392 1380 1367 1433 1500 1456 1413 1369 1326 1331 1336 1388 1441 1493 1545 1517 1490 1467 1444 1421 1398 1419 1440 1460
1492 1460 1481 1474 1468 1461 1454 1435 1416 1397 1378 1389 1400 1363 1326 1306 1286 1314 1341 1307 1272 1316 1360 1327 1295 1262 1229 1248 1266 1237 1208 1242 1276 1310 1344 1372 1399 1427
1488 1427 1455 1467 1479 1444 1409 1422 1435 1401 1366 1355 1343 1252 1161 1203 1244 1285 1327 1357 1387 1416 1446 1385 1324 1311 1297 1271 1244 1265 1285 1297 1309 1321 1332 1267
1484 1267 1202 1185 1167 1242 1318 1393 1468 1482 1496 1463 1430 1392 1353 1363 1372 1424 1475 1448 1421 1432 1442 1500 1558 1525 1493 1414 1334 1340 1346 1353 1359 1413 1468 1475 1482 1451 1420 1390
1479 1390 1359 1323 1287 1298 1309 1320 1331 1295 1258 1277 1297 1316 1335 1292 1249 1206 1163 1167 1171 1175 1178 1212 1245 1326 1407 1438 1469 1452 1436 1453 1470 1440 1410 1429 1448 1420
1475 1420 1391 1322 1252 1230 1208 1256 1305 1306 1308 1322 1336 1350 1364 1356 1347 1385 1424 1379 1333 1335 1337 1302 1267 1311 1355 1357 1359 1362 1364 1331 1298 1265 1232 1235 1237 1319 1400 1412 1424 1389
1470 1389 1354 1312 1270 1275 1281 1248 1216 1184 1152 1216 1281 1298 1315 1290 1264 1238 1212 1200 1188 1177 1165 1186 1207 1181 1155 1168 1180 1240 1300 1347 1393 1361 1328 1253 1179
1465 1179 1214 1250 1284 1318 1353 1387 1390 1392 1392 1392 1346 1252 1217 1261 1322 1336 1335 1333 1403 1473 1496 1519 1459 1399 1344 1289 1294 1378 1479 1470 1345 1221 1232 1355 1449 1544
1461 1544 1536 1527 1408 1289 1204 1198 1231 1264 1301 1339 1341 1343 1345 1348 1333 1318 1427 1615 1719 1743 1797 1962 2142 2243 2243 2196 2130 1985 1803 1621 1502 1384
1457 1384 1313 1242 1241 1240 1268 1376 1547 1639 1605 1523 1492 1509 1525 1494 1433 1420 1457 1493 1469 1445 1469 1539 1566 1513 1402 1338 1331 1324 1319 1315 1316 1317 1366 1414 1476 1537 1520
1453 1520 1502 1532 1562 1512 1463 1427 1391 1402 1413 1444 1475 1506 1538 1570 1602 1556 1509 1452 1395 1417 1440 1498 1557 1616 1674 1679 1684 1659 1555 1433 1389 1439 1488 1473
1448 1473 1459 1397 1335 1280 1224 1280 1383 1441 1420 1399 1378 1361 1344 1374 1405 1441 1477 1513 1549 1572 1595 1508 1421 1391 1362 1412 1461 1484 1507 1531 1554 1517 1481 1524
1444 1524 1567 1517 1467 1417 1367 1353 1340 1373 1407 1408 1410 1458 1554 1570 1506 1443 1458 1476 1446 1398 1429 1491 1474 1400 1374 1377 1381 1387 1393 1413 1433 1406 1378 1378 1377 1376 1375 1380 1385 1358
1439 1358 1378 1424 1390 1330 1317 1396 1476 1509 1542 1560 1530 1480 1508 1603 1650 1585 1473 1430 1435 1410 1386 1340 1295 1297 1299 1380 1462 1465 1468 1430 1392 1401 1410 1384 1357 1378 1399
1435 1399 1431 1462 1414 1366 1373 1379 1338 1297 1313 1328 1344 1359 1421 1483 1465 1448 1408 1368 1407 1446 1530 1614 1556 1451 1411 1449 1487 1447 1394 1389 1400 1411 1406 1401 1443 1485
1430 1485 1473 1461 1449 1437 1474 1510 1499 1489 1507 1526 1440 1354 1326 1393 1433 1425 1432 1438 1441 1445 1472 1499 1527 1554 1516 1479 1488 1498 1485 1472 1411 1351 1390 1429 1421 1413 1391 1369
1426 1369 1346 1324 1332 1339 1347 1355 1399 1444 1441 1438 1423 1409 1441 1474 1491 1508 1525 1542 1501 1460 1497 1535 1565 1596 1547 1499 1487 1476 1513 1549 1541 1533 1446 1358 1351 1344 1337 1330 1313 1296
1421 1296 1358 1420 1425 1431 1437 1442 1463 1484 1505 1526 1540 1554 1495 1436 1413 1485 1530 1528 1473 1417 1406 1395 1403 1410 1374 1337 1374 1459 1523 1492 1392 1291 1239 1282 1331 1334 1290
1416 1290 1245 1264 1283 1229 1175 1186 1293 1403 1417 1385 1400 1456 1465 1407 1349 1335 1321 1348 1375 1402 1430 1396 1362 1407 1451 1392 1333 1273 1214 1226 1239 1252 1264 1265
1412 1265 1265 1265 1266 1298 1330 1314 1299 1244 1189 1213 1236 1225 1213 1201 1190 1259 1329 1398 1468 1443 1418 1472 1620 1717 1656 1547 1439 1426 1413 1400 1388 1413 1438 1416
1408 1416 1395 1372 1349 1326 1303 1280 1256 1233 1209 1237 1265 1293 1321 1317 1313 1309 1305 1298 1292 1334 1375 1393 1411 1381 1352 1378 1405 1384 1364 1355 1345 1336 1327 1361 1395 1429 1463 1423 1383
1403 1383 1390 1398 1417 1436 1455 1474 1429 1384 1386 1389 1440 1490 1462 1434 1359 1284 1256 1229 1292 1355 1418 1481 1462 1442 1422 1402 1415 1428 1488 1549 1484 1419 1355 1290 1343 1396
1399 1396 1446 1496 1481 1420 1340 1340 1385 1429 1432 1434 1492 1550 1497 1397 1357 1396 1462 1480 1461 1443 1469 1494 1529 1564 1520 1475 1475 1475 1476 1476 1477 1478 1479 1480 1475 1471 1467 1462 1376 1290 1314
1394 1314 1338 1370 1401 1433 1465 1439 1414 1388 1363 1317 1271 1272 1273 1302 1331 1313 1294 1300 1306 1312 1318 1339 1359 1333 1306 1301 1297 1339 1382 1395 1408 1421 1434 1421 1408 1394 1381 1365
1389 1365 1349 1332 1316 1366 1416 1419 1421 1424 1426 1476 1526 1494 1462 1430 1398 1374 1350 1326 1302 1269 1237 1283 1329 1375 1421 1388 1355 1382 1410 1437 1464 1415 1365 1395 1424 1433 1442
1385 1442 1451 1460 1430 1401 1374 1347 1375 1450 1543 1557 1476 1395 1420 1445 1487 1529 1493 1456 1462 1468 1474 1479 1418 1356 1341 1327 1350 1373 1443 1514 1519 1524 1529 1534 1497 1459 1469 1479 1524
1380 1524 1569 1536 1456 1354 1347 1425 1504 1502 1500 1499 1497 1490 1483 1429 1375 1369 1362 1403 1443 1469 1495 1521 1547 1537 1527 1564 1601 1593 1585 1623 1709 1761 1718 1652 1586 1546 1506 1513 1520 1515 1509
1375 1509 1462 1415 1456 1591 1727 1768 1764 1759 1797 1834 1749 1664 1658 1652 1635 1618 1601 1584 1574 1564 1545 1621 1698 1728 1712 1695 1685 1674 1664 1653 1711 1768 1778 1788 1707
1371 1707 1627 1593 1560 1649 1738 1827 1916 1888 1861 1833 1806 1888 1970 2006 1995 1977 2053 2129 2111 2049 2035 2100 2213 2274 2287 2330 2373 2397 2422 2526 2630 2751
1367 2751 2872 2994 3115 3203 3290 3425 3560 3700 3841 3988 4134 4361 4683 5117 5646 6337 7249 8368 9487 10600 11617 12675
1364 12675 13732 14804 15655 16208 16667 17252 18059 19067 20074 20989 21904 22713 23363 23789 23867 23609 23004 22155 21211 20251 19291 18316
1361 18316 17342 16505 15890 15347 14710 13862 12919 11996 11072 10126 9086 8086 7243 6589 6094 5727 5518 5388 5352 5325 5392 5554 5716
1359 5716 5901 6086 6488 7111 7907 8860 9881 10901 11899 12897 13877 14857 15652 16162 16580 17156 17941 18884 19802 20624 21410 22197
1356 22197 22867 23315 23387 22985 22213 21285 20427 19569 18661 17596 16563 15750 15188 14626 13958 13131 12147 11068 9971 8874 7856
1353 7856 6837 5831 4919 4288 3877 3567 3256 3039 2821 2679 2538 2422 2400 2367 2333 2305 2278 2287 2297 2228 2159 2156 2152 2148 2145 2140 2136 2053 1969 1903 1836
1349 1836 1817 1798 1741 1684 1675 1666 1690 1714 1628 1542 1569 1596 1623 1650 1608 1566 1544 1616 1712 1714 1632 1551 1550 1550 1549 1548 1603 1658 1639 1621 1618 1709 1801 1798 1769 1740 1785 1829 1875
1345 1875 1921 1966 2012 2051 2090 2087 2085 2105 2220 2360 2501 2667 2833 3047 3261 3482 3703 3845 3987 4168 4348 4529 4710 4861 5013 5117
1342 5117 5221 5232 5242 5164 4991 4746 4502 4362 4221 4052 3882 3706 3626 3608 3590 3499 3408 3242 3077 2911 2745 2579 2412 2246 2080 1987
1338 1987 1893 1910 1928 1980 2033 2038 2043 2167 2292 2416 2541 2705 2869 3080 3291 3414 3536 3659 3781 3862 3943 4103 4263 4564 4865 5087 5214
1335 5214 5421 5785 6122 6238 6101 5807 5508 5210 4939 4669 4446 4222 4007 3792 3687 3582 3485 3387 3211 3035 2865 2696 2526 2357
1332 2357 2190 2023 1967 1911 1943 1976 2009 2041 1991 1941 1969 1998 1990 1982 2116 2250 2375 2500 2704 2908 3070 3233 3127 3021 2806 2592 2456 2321
1329 2321 2235 2148 2204 2260 2372 2484 2612 2834 3055 3118 3028 2844 2611 2378 2218 2057 1993 1928 1911 1894 1803 1713 1623 1533 1517 1502 1534 1566 1561 1557
1325 1557 1552 1547 1572 1598 1671 1744 1730 1715 1622 1529 1574 1618 1663 1708 1758 1808 1859 1909 2105 2301 2567 2832 2928 2866 2719 2572 2416 2261 2105 1949
1321 1949 1858 1766 1753 1741 1714 1688 1740 1793 1756 1719 1683 1646 1631 1616 1522 1428 1431 1433 1436 1438 1409 1379 1398 1463 1508 1474 1409 1343 1373 1404 1434 1464 1447 1430 1413 1395
1317 1395 1414 1432 1493 1554 1614 1595 1515 1482 1529 1576 1552 1529 1567 1684 1784 1836 1822 1808 1743 1679 1583 1486 1437 1388 1377 1365 1354 1342 1329 1315 1302 1288 1307
1313 1307 1326 1345 1364 1314 1263 1292 1320 1332 1344 1355 1367 1367 1368 1368 1369 1343 1317 1307 1344 1351 1280 1182 1131 1182 1233 1208 1183 1207 1232 1256 1280 1295 1310 1251 1193 1164 1215
1308 1215 1269 1322 1287 1252 1217 1181 1252 1323 1347 1370 1385 1399 1414 1428 1439 1449 1459 1469 1412 1355 1298 1242 1240 1239 1238 1237 1224 1211 1198 1185 1249 1313 1377 1441 1423 1404
1304 1404 1385 1366 1339 1311 1283 1256 1307 1358 1387 1321 1257 1241 1272 1302 1311 1320 1305 1290 1277 1264 1254 1244 1268 1338 1391 1349 1295 1289 1329 1370 1371 1372 1372 1373 1339 1305 1350 1395
1299 1395 1471 1547 1543 1540 1465 1391 1364 1336 1382 1429 1522 1616 1579 1542 1528 1515 1501 1488 1451 1414 1439 1465 1443 1422 1366 1310 1362 1414 1398 1335 1289 1339 1392 1398 1407 1463
1295 1463 1522 1534 1466 1351 1206 1155 1221 1335 1395 1360 1279 1291 1331 1323 1269 1214 1265 1315 1345 1281 1215 1244 1325 1405 1410 1414 1440 1465 1470 1427 1399 1465 1552 1544 1454
1291 1454 1363 1317 1270 1247 1224 1205 1186 1167 1148 1193 1238 1276 1315 1415 1420 1306 1144 1073 1097 1207 1317 1373 1430 1439 1448 1428 1409 1342 1275 1244 1213 1182 1152
1287 1152 1153 1155 1160 1164 1246 1376 1529 1587 1553 1470 1382 1342 1352 1363 1353 1342 1318 1293 1348 1402 1432 1462 1441 1421 1362 1255 1195 1230 1330 1336 1290 1244 1308 1373 1390
1282 1390 1407 1442 1476 1431 1386 1386 1386 1385 1385 1353 1321 1336 1351 1360 1369 1332 1248 1194 1235 1354 1426 1409 1346 1279 1260 1266 1272 1281 1290 1361 1433 1456 1480 1485 1489 1494 1498 1448 1399 1349 1299
1277 1299 1302 1306 1309 1312 1353 1394 1324 1254 1295 1336 1330 1277 1248 1313 1372 1385 1393 1401 1430 1459 1430 1401 1349 1296 1280 1264 1248 1232 1226 1221 1215 1209 1213 1217 1221 1225 1207 1188 1169 1150 1135 1119
1272 1119 1182 1245 1214 1183 1230 1278 1299 1321 1343 1365 1371 1377 1359 1341 1384 1428 1364 1301 1350 1446 1434 1326 1268 1306 1389 1425 1432 1439 1397 1308 1266 1319 1393 1373 1316 1259
1268 1259 1275 1291 1346 1401 1378 1354 1365 1376 1396 1369 1315 1355 1413 1424 1373 1321 1272 1223 1186 1244 1304 1270 1189 1155 1230 1305 1291 1277 1263 1249 1252 1255 1337 1419 1366
1264 1366 1314 1285 1256 1202 1148 1094 1040 1055 1070 1133 1196 1222 1248 1273 1299 1282 1266 1272 1279 1257 1235 1232 1324 1422 1425 1408 1391 1375 1358 1318 1278 1249 1219 1237 1255 1339
1259 1339 1423 1428 1433 1426 1418 1387 1356 1320 1284 1296 1307 1298 1289 1303 1318 1359 1400 1362 1325 1339 1353 1343 1334 1382 1429 1453 1477 1460 1442 1424 1406 1421 1436 1372 1307 1307 1308 1331 1355
1254 1355 1346 1337 1327 1318 1361 1404 1338 1225 1216 1318 1420 1412 1364 1364 1379 1316 1218 1198 1271 1345 1378 1410 1420 1429 1434 1439 1443 1448 1462 1477 1432 1308 1211 1226 1296 1287 1217 1147
1250 1147 1151 1155 1173 1191 1256 1321 1280 1238 1276 1313 1281 1249 1241 1233 1264 1295 1278 1262 1286 1309 1290 1272 1240 1287 1369 1451 1425 1399 1328 1257 1280 1350 1413 1398 1338 1277
1245 1277 1259 1241 1222 1203 1161 1118 1091 1065 1181 1296 1349 1401 1407 1412 1375 1339 1278 1218 1239 1261 1282 1304 1268 1232 1274 1317 1307 1296 1286 1275 1282 1288 1294 1301 1310 1318 1327 1336
1241 1336 1322 1308 1294 1281 1235 1189 1223 1256 1252 1248 1323 1397 1385 1373 1361 1349 1310 1270 1224 1274 1310 1347 1389 1432 1512 1592 1561 1531 1496 1462 1427 1393 1445 1497 1502 1507
1236 1507 1486 1465 1443 1422 1406 1391 1423 1455 1440 1426 1412 1397 1356 1315 1322 1328 1282 1236 1237 1239 1233 1228 1222 1217 1221 1226 1310 1394 1400 1405 1431 1551 1623 1600 1526 1452 1445 1438 1431 1424 1439 1454
1231 1454 1469 1484 1474 1465 1455 1445 1458 1472 1406 1340 1313 1286 1258 1231 1232 1232 1233 1233 1209 1185 1240 1294 1322 1349 1376 1403 1352 1300 1248 1197 1160 1123 1197 1270 1234 1198 1214
1227 1214 1324 1426 1434 1423 1461 1525 1543 1479 1416 1376 1337 1377 1416 1411 1407 1354 1302 1294 1286 1277 1269 1327 1385 1395 1406 1314 1222 1184 1241 1291 1295 1331 1367 1361 1354 1268 1183 1187 1191
1222 1191 1274 1357 1453 1549 1536 1475 1461 1542 1621 1604 1495 1385 1380 1375 1339 1302 1266 1229 1248 1267 1333 1399 1406 1413 1420 1427 1417 1408 1414 1467 1543 1525 1453 1380 1372 1364 1435 1505
1217 1505 1492 1479 1466 1453 1445 1437 1471 1505 1480 1361 1242 1217 1261 1305 1352 1398 1373 1300 1246 1285 1326 1319 1270 1269 1295 1321 1302 1283 1314 1345 1375 1406 1446 1485 1478 1470
1213 1470 1400 1329 1335 1340 1356 1324 1263 1296 1344 1345 1275 1299 1419 1491 1448 1358 1344 1330 1361 1391 1417 1442 1467 1493 1496 1498 1454 1409 1397 1385 1373 1361 1353 1346 1338 1331 1288 1245
1208 1245 1249 1254 1290 1326 1315 1304 1321 1338 1308 1279 1284 1290 1296 1302 1317 1331 1346 1361 1374 1388 1401 1415 1364 1314 1310 1355 1413 1393 1343 1340 1361 1333 1306 1326 1399 1424 1368 1312
1203 1312 1311 1309 1308 1306 1377 1449 1441 1434 1377 1320 1268 1216 1243 1349 1429 1398 1358 1365 1413 1414 1361 1309 1332 1355 1325 1295 1266 1236 1227 1218 1210 1201 1249 1297 1239 1181 1205 1307 1410
1199 1410 1434 1430 1426 1418 1409 1408 1408 1360 1313 1393 1474 1507 1540 1526 1512 1499 1485 1471 1457 1444 1430 1417 1404 1344 1284 1294 1303 1313 1323 1341 1358 1376 1394 1365 1337 1308 1280 1291
1194 1291 1303 1299 1248 1212 1256 1331 1406 1383 1360 1337 1314 1311 1308 1305 1302 1307 1312 1365 1417 1442 1467 1445 1423 1428 1433 1438 1443 1402 1361 1324 1288 1288 1368 1447 1447 1390 1333 1350 1367 1310 1253
1189 1253 1227 1281 1331 1335 1322 1309 1324 1339 1353 1368 1342 1316 1243 1170 1170 1170 1218 1266 1223 1181 1200 1298 1396 1414 1345 1277 1318 1438 1512 1506 1467 1428 1384 1341 1325 1309
1185 1309 1293 1276 1290 1304 1361 1417 1453 1410 1332 1254 1291 1327 1363 1399 1416 1432 1449 1465 1444 1423 1481 1539 1501 1464 1423 1382 1364 1299 1213 1206 1270 1287 1198 1110 1102
1180 1102 1174 1201 1228 1281 1333 1339 1344 1337 1330 1497 1758 1991 2066 1910 1754 1616 1572 1475 1377 1356 1335 1320 1304 1313 1417 1520 1529 1423 1316 1283 1249 1276
1176 1276 1303 1330 1358 1396 1435 1474 1513 1505 1496 1408 1321 1295 1270 1323 1377 1438 1498 1486 1474 1454 1530 1605 1586 1480 1374 1310 1246 1268 1291 1313 1336 1293 1250 1312
1172 1312 1374 1444 1418 1368 1317 1275 1233 1190 1148 1144 1141 1184 1228 1324 1420 1438 1455 1439 1423 1334 1245 1282 1414 1499 1489 1421 1352 1414 1476 1465 1359 1306 1253 1322
1168 1322 1391 1461 1530 1446 1361 1302 1338 1330 1322 1273 1224 1216 1207 1145 1178 1274 1371 1394 1417 1389 1361 1333 1305 1305 1305 1257 1209 1263 1316 1370 1423 1448 1473 1393 1313 1293 1368
1164 1368 1463 1511 1499 1487 1472 1457 1412 1367 1322 1277 1281 1285 1242 1199 1190 1180 1218 1256 1319 1382 1397 1412 1387 1361 1336 1310 1379 1448 1407 1365 1353 1341 1332 1323 1345 1415 1438
1159 1438 1367 1277 1283 1340 1397 1401 1406 1411 1415 1387 1358 1288 1218 1214 1304 1397 1395 1332 1316 1379 1441 1446 1452 1409 1367 1345 1323 1348 1373 1377 1381 1382 1384 1371 1312 1273 1329 1414 1498 1510 1521
1154 1521 1467 1413 1362 1311 1373 1483 1543 1509 1492 1523 1524 1525 1532 1585 1592 1504 1390 1371 1406 1441 1462 1531 1623 1621 1542 1416 1337 1352 1456 1560 1556 1457 1339 1316
1150 1316 1345 1373 1362 1351 1416 1481 1446 1364 1331 1393 1466 1491 1470 1449 1445 1442 1438 1434 1396 1357 1366 1375 1375 1376 1423 1471 1514 1556 1520 1436 1394 1430 1513 1518 1496 1523 1591 1612 1543
1145 1543 1473 1447 1421 1356 1291 1337 1382 1382 1383 1399 1463 1476 1410 1365 1367 1391 1414 1441 1467 1466 1465 1464 1463 1421 1379 1337 1295 1296 1297 1298 1300 1333 1365 1398 1431 1436 1442 1526 1610 1603 1597 1543
1140 1543 1489 1450 1410 1445 1480 1475 1390 1324 1305 1305 1306 1309 1313 1358 1403 1370 1336 1302 1269 1314 1359 1373 1387 1401 1415 1441 1467 1445 1424 1423 1423 1422 1422 1446 1470 1494 1518 1478 1438
1135 1438 1398 1358 1405 1452 1420 1388 1322 1257 1301 1346 1455 1564 1548 1454 1387 1400 1437 1426 1347 1269 1298 1327 1348 1370 1391 1413 1438 1464 1489 1515 1529 1543 1509
1131 1509 1476 1472 1468 1464 1460 1434 1409 1431 1452 1450 1447 1396 1346 1370 1393 1464 1535 1541 1546 1552 1558 1487 1416 1345 1275 1284 1293 1349 1406 1414 1422 1430 1438 1467 1496 1478 1459 1415 1371 1375 1378 1378 1377 1456
1126 1456 1534 1531 1527 1571 1615 1559 1503 1448 1392 1337 1283 1304 1326 1347 1321 1310 1393 1477 1466 1408 1398 1461 1525 1513 1501 1459 1418 1423 1429 1398 1366 1334 1303 1369 1435 1498
1121 1498 1561 1522 1435 1398 1455 1478 1455 1433 1460 1508 1509 1460 1411 1398 1385 1420 1454 1451 1448 1444 1441 1446 1450 1455 1459 1414 1370 1372 1375 1427 1480 1486 1491 1542 1592 1533 1473 1407 1342 1355 1369
1116 1369 1377 1386 1394 1403 1378 1354 1377 1400 1366 1333 1347 1361 1335 1309 1330 1352 1369 1387 1404 1422 1399 1376 1353 1330 1338 1345 1353 1360 1364 1369 1361 1448 1554 1566 1529 1539 1574 1563 1476
1112 1476 1389 1362 1430 1472 1466 1420 1374 1372 1370 1334 1298 1256 1309 1385 1461 1433 1405 1359 1313 1346 1379 1391 1404 1369 1334 1360 1385 1410 1436 1469 1503 1429 1356 1388 1469 1499
1107 1499 1435 1407 1427 1426 1330 1238 1240 1325 1457 1575 1598 1563 1479 1409 1339 1376 1413 1509 1605 1592 1531 1523 1609 1617 1529 1376 1271 1281 1387 1492 1549 1526 1456
1103 1456 1374 1339 1385 1432 1458 1484 1511 1537 1541 1544 1500 1456 1477 1498 1519 1540 1460 1381 1348 1316 1264 1212 1239 1266 1304 1341 1379 1417 1408 1400 1344 1288 1296 1304 1387 1469 1500
1099 1500 1453 1419 1434 1466 1451 1436 1469 1569 1623 1593 1516 1495 1521 1565 1530 1460 1437 1462 1486 1504 1521 1492 1462 1447 1433 1418 1403 1386 1368 1399 1429 1407 1385 1410
1095 1410 1435 1454 1474 1414 1354 1301 1249 1199 1228 1324 1419 1410 1400 1353 1306 1337 1369 1460 1552 1533 1514 1523 1533 1542 1552 1516 1480 1402 1324 1274 1304 1391 1431 1392 1306 1263
1090 1263 1269 1321 1374 1382 1390 1375 1360 1419 1478 1483 1409 1290 1251 1297 1391 1490 1541 1513 1484 1453 1421 1407 1392 1377 1363 1343 1324 1304 1285 1343 1402 1382 1362 1386 1410 1387
1086 1387 1363 1293 1222 1287 1353 1395 1343 1297 1251 1224 1196 1169 1141 1183 1225 1266 1308 1317 1325 1287 1248 1227 1206 1138 1069 1078 1087 1095 1104 1166 1228 1290 1352 1408 1465 1475 1484 1454
1081 1454 1423 1433 1444 1490 1441 1366 1292 1339 1387 1476 1566 1635 1609 1526 1443 1441 1439 1390 1340 1394 1448 1423 1398 1345 1291 1237 1184 1204 1224 1202 1181 1137 1187 1263 1340
1077 1340 1358 1377 1348 1319 1363 1407 1373 1338 1363 1388 1419 1355 1315 1275 1308 1341 1423 1506 1538 1474 1411 1443 1462 1482 1459 1436 1460 1484 1465 1446 1427 1408 1389 1371
1073 1371 1353 1335 1363 1391 1420 1448 1460 1472 1411 1350 1282 1308 1328 1348 1307 1267 1232 1197 1136 1169 1260 1351 1350 1350 1391 1432 1507 1487 1410 1332 1351 1369 1340 1311 1267
1068 1267 1222 1256 1290 1381 1471 1567 1568 1496 1423 1345 1266 1289 1311 1381 1451 1451 1451 1451 1451 1458 1465 1472 1478 1405 1332 1338 1344 1369 1395 1421 1447 1522 1597 1593 1589 1528 1467 1405 1344 1387 1431
1063 1431 1547 1663 1671 1584 1496 1504 1526 1549 1498 1447 1491 1534 1530 1526 1516 1506 1496 1486 1498 1510 1522 1533 1520 1508 1495 1482 1466 1451 1483 1515 1533 1550 1567 1584 1587 1590
1059 1590 1593 1596 1611 1626 1593 1561 1598 1635 1625 1615 1608 1601 1593 1586 1504 1422 1397 1467 1527 1587 1542 1498 1501 1505 1508 1512 1494 1476 1505 1535 1532 1530 1528 1525 1525 1525 1603 1682 1668 1655 1641 1628
1054 1628 1669 1711 1753 1794 1865 1935 1896 1810 1718 1720 1777 1833 1820 1808 1842 1876 1897 1917 1985 2053 2118 2183 2200 2217 2260 2303 2388 2472 2519 2471 2398 2324 2317 2309 2302 2294 2260
1049 2260 2226 2145 2064 2061 2058 2102 2146 2134 2123 2158 2194 2203 2213 2222 2231 2266 2300 2287 2275 2377 2480 2504 2528 2534 2541 2443 2346 2403 2554 2635 2669 2707 2793 2834 2828 2853 2974
1045 2974 3070 3119 3153 3281 3463 3645 3812 3978 4145 4311 4565 4818 5024 5230 5423 5616 5898 6180 6476 6931 7588 8467 9627 11135
1042 11135 13148 15635 18353 20913 22716 23224 22328 20264 17645 14978 12579 10591 9028 7812 6907 6286 5868 5545 5320
1040 5320 5094 4874 4654 4507 4360 4219 4078 3930 3875 3847 3819 3805 3791 3888 3985 4037 4090 4284 4479 4625 4771 4917 5063 5255 5446 5589
1036 5589 5733 5976 6220 6548 6876 7228 7674 8202 8824 9543 10483 11695 13254 15286 17854 21077 24836 28831 32668 35897
1034 35897 37957 38406 37118 34484 31061 27370 23773 20457 17488 14854 12632 10795 9306 8144 7266 6678 6310 6060
1032 6060 5810 5573 5337 5097 4856 4616 4375 4161 3947 3812 3676 3619 3562 3552 3542 3515 3488 3508 3528 3506 3485 3515 3640 3756 3778 3726 3769 3912
1028 3912 4055 4204 4352 4641 4929 5285 5798 6484 7391 8511 9978 11890 14338 17151 19965 22368 23729 23691 22169 19596
1026 19596 16613 13735 11269 9299 7740 6568 5680 4987 4453 4059 3823 3669 3516 3268 3019 2782 2638 2521 2403 2292 2180
1023 2180 2116 2052 2017 1981 1993 2005 1984 1962 1862 1761 1749 1737 1804 1870 1889 1907 1847 1786 1717 1649 1580 1511 1517 1523 1482 1440 1429 1418 1431 1444 1496 1549 1602 1654
1019 1654 1656 1657 1611 1565 1640 1715 1739 1668 1624 1674 1713 1752 1741 1730 1799 1867 1953 2038 1978 1823 1744 1761 1854 1948 1991 1940 1831 1722 1667 1611 1603 1595 1534 1474 1461
1015 1461 1448 1459 1471 1482 1494 1546 1597 1602 1606 1606 1605 1585 1470 1377 1380 1401 1423 1433 1443 1406 1369 1302 1235 1248 1260 1269 1279 1398 1518 1524 1530 1535 1541 1565 1590 1614 1638 1700
1010 1700 1761 1822 1883 1830 1776 1770 1764 1781 1797 1734 1672 1631 1591 1597 1604 1556 1507 1482 1457 1499 1542 1560 1578 1567 1556 1497 1438 1392 1347 1422 1591 1784 1977 2128
1006 2128 2279 2325 2370 2386 2401 2369 2241 2120 1999 1826 1652 1505 1452 1453 1454 1382 1310 1293 1277 1307 1338 1385 1432 1432 1432 1438 1444 1426 1409 1445 1482 1495 1508 1539
1002 1539 1571 1578 1586 1646 1707 1716 1631 1521 1506 1511 1516 1476 1436 1443 1451 1440 1428 1423 1418 1527 1731 1929 2127 2303 2479 2626 2772 2841 2815 2659 2408 2163 1918
998 1918 1692 1561 1555 1549 1476 1402 1336 1365 1364 1364 1354 1345 1347 1255 1185 1210 1285 1361 1307 1252 1276 1300 1315 1330 1298 1265 1280 1295 1334 1373 1407 1442 1523 1605 1617 1629 1561
993 1561 1494 1417 1339 1341 1342 1360 1378 1372 1367 1370 1374 1377 1381 1369 1357 1392 1428 1403 1378 1400 1423 1476 1528 1471 1413 1364 1315 1346 1376 1392 1409 1425 1442 1488 1534 1580 1627 1595 1564
989 1564 1485 1407 1364 1320 1325 1329 1315 1300 1286 1272 1294 1316 1361 1407 1450 1493 1457 1421 1398 1376 1353 1330 1337 1344 1398 1452 1457 1463 1444 1426 1441 1456 1471 1486 1477 1468 1459 1450 1434 1419
984 1419 1356 1293 1281 1269 1305 1340 1344 1348 1351 1355 1375 1395 1415 1435 1427 1419 1434 1449 1420 1390 1408 1426 1459 1492 1478 1417 1333 1343 1439 1535 1506 1477 1448 1418 1400 1382 1415 1542
979 1542 1622 1606 1508 1410 1393 1375 1437 1499 1554 1610 1556 1501 1516 1530 1497 1465 1452 1440 1475 1511 1460 1409 1438 1466 1420 1374 1328 1282 1292 1302 1335 1369 1468 1568
975 1568 1620 1672 1606 1541 1475 1409 1378 1346 1315 1283 1282 1281 1280 1279 1352 1424 1474 1429 1364 1347 1407 1467 1471 1475 1456 1437 1380 1324 1350 1471 1545 1524 1488 1500 1604 1709
970 1709 1790 1777 1711 1644 1572 1499 1482 1466 1528 1590 1606 1622 1614 1606 1632 1658 1637 1616 1521 1425 1469 1513 1463 1366 1374 1477 1576 1517 1389 1356 1358 1359 1319 1279 1302 1324
966 1324 1346 1369 1387 1405 1423 1441 1456 1471 1463 1454 1471 1487 1456 1426 1452 1479 1458 1437 1361 1284 1255 1226 1316 1405 1472 1538 1579 1619 1581 1543 1512 1480 1528 1575 1625 1674
962 1674 1645 1615 1621 1627 1554 1481 1444 1407 1417 1427 1420 1413 1453 1494 1461 1429 1390 1447 1523 1598 1591 1489 1426 1363 1404 1445 1463 1481 1499 1517 1536 1556 1576 1596 1606 1616 1547
957 1547 1478 1430 1382 1381 1380 1449 1518 1539 1561 1555 1549 1600 1745 1939 2132 2179 2132 2006 1881 1829 1776 1734 1691 1649 1606 1601 1596 1591 1586 1635 1684 1686 1688 1657 1626 1595 1565
953 1565 1521 1477 1433 1390 1465 1541 1537 1534 1509 1483 1457 1432 1423 1414 1453 1492 1479 1466 1412 1358 1405 1546 1650 1596 1512 1523 1581 1640 1578 1516 1533 1550 1577 1604 1584 1564
948 1564 1579 1594 1562 1530 1467 1405 1421 1437 1439 1440 1489 1538 1535 1533 1530 1528 1564 1599 1588 1576 1623 1670 1723 1682 1605 1529 1526 1522 1546 1570 1595 1619 1653 1687 1721 1755 1709 1663 1696
943 1696 1729 1718 1706 1695 1684 1695 1706 1717 1729 1697 1665 1632 1600 1584 1568 1552 1536 1559 1581 1603 1626 1638 1651 1711 1770 1752 1734 1716 1698 1717 1736 1754 1773 1713 1653
939 1653 1640 1628 1571 1515 1569 1623 1703 1783 1815 1848 1802 1757 1822 1887 1927 1967 2008 2048 2112 2176 2192 2208 2200 2192 2184 2175 2113 2051 1989 1927 1874 1821 1815 1809 1822 1834 1847 1859
934 1859 1904 1949 1915 1881 1831 1781 1810 1838 1872 1906 1939 1973 1944 1915 1934 1953 1915 1877 1887 1991 2073 1997 1873 1750 1763 1775 1788 1800 1823 1845 1867 1889 1899
930 1899 1910 1873 1835 1861 1887 1866 1844 1871 1898 1925 1951 1902 1853 1883 1912 1965 2017 1959 1901 1840 1779 1797 1815 1854 1893 1932 1971 1974 1977 1933 1889 1913 1937 2003 2068 2117
926 2117 2072 1969 1866 1874 1882 1889 1897 1869 1841 1814 1786 1831 1876 1927 1884 1766 1648 1614 1674 1751 1829 1834 1838 1868 1897 1853 1809 1807 1901 1941 1981 2011 2041 2024 2007 1934
922 1934 1861 1924 1987 1983 1884 1791 1698 1737 1775 1814 1852 1884 1916 1923 1835 1740 1645 1633 1715 1731 1746 1720 1694 1785 1877 1943 1914 1876 1838 1794 1750 1693 1635 1657 1678 1678
917 1678 1679 1679 1679 1754 1828 1824 1819 1856 1893 1882 1872 1866 1860 1855 1849 1874 1899 1851 1803 1761 1813 1891 1969 1956 1942 1929 1915 1844 1773 1750 1726 1754 1782 1811 1839 1795 1751 1707 1663
912 1663 1722 1781 1840 1899 1936 1974 1964 1954 1929 1904 1926 1948 1918 1888 1858 1828 1877 1927 1929 1932 1933 1934 1935 1937 1942 1947 1953 1958 2008 2058 2028 1999 2001 2004 2006 2008 2059 2111 2115 2119 2137 2155 2173
907 2173 2191 2172 2153 2133 2114 2183 2252 2244 2188 2211 2329 2399 2375 2303 2278 2301 2276 2241 2302 2411 2473 2497 2522 2543 2564 2539 2514 2489 2463 2448 2433 2451 2421 2343
903 2343 2359 2430 2501 2528 2556 2568 2533 2468 2497 2638 2779 2854 2833 2756 2679 2693 2707 2722 2736 2732 2729 2804 2880 2843 2807 2771 2735 2755 2774 2794 2814 2783 2752 2801 2849
899 2849 2829 2809 2788 2768 2799 2830 2861 2893 2817 2742 2714 2686 2736 2785 2831 2877 2855 2785 2771 2837 2900 2885 2808 2731 2685 2639 2637 2635 2594 2505 2475 2523 2590 2609 2582 2554
894 2554 2583 2612 2531 2450 2420 2390 2366 2341 2318 2374 2474 2495 2432 2321 2230 2185 2175 2165 2182 2199 2161 2123 2164 2205 2223 2241 2180 2119 2078 2036 2043 2049 2043 2037 2031 2025 2027
890 2027 2028 2029 2030 2003 1977 1950 1924 1952 1980 2007 2035 2021 2007 1993 1979 1953 1928 1927 1925 1948 1971 1883 1795 1779 1764 1795 1827 1891 1955 1925 1815 1740 1713 1701 1689 1699 1709
885 1709 1719 1728 1773 1817 1786 1754 1734 1761 1782 1724 1648 1572 1570 1568 1562 1556 1550 1544 1554 1563 1549 1536 1536 1536 1584 1632 1620 1608 1596 1584 1569 1555 1588 1621 1633 1644 1680 1715 1699 1683
880 1683 1644 1604 1537 1470 1482 1494 1549 1604 1611 1619 1608 1596 1749 1902 1992 1924 1804 1683 1673 1662 1652 1641 1571 1500 1481 1556 1627 1603 1534 1465 1459 1548 1630 1713
876 1713 1695 1676 1611 1545 1494 1442 1470 1497 1475 1453 1454 1455 1534 1613 1645 1676 1660 1644 1628 1611 1583 1554 1572 1590 1574 1558 1495 1432 1353 1274 1220 1262 1355 1447 1435 1424
872 1424 1426 1428 1431 1433 1457 1480 1479 1479 1517 1556 1600 1550 1490 1430 1443 1456 1474 1491 1460 1430 1377 1323 1348 1373 1376 1379 1519 1658 1681 1609 1567 1525 1505 1486 1490 1494 1476 1458 1440
867 1440 1423 1350 1278 1262 1342 1336 1330 1330 1330 1330 1330 1372 1413 1434 1360 1251 1299 1428 1558 1523 1489 1471 1453 1436 1418 1389 1361 1332 1304 1325 1347 1368 1390 1368 1346 1371
863 1371 1397 1383 1368 1401 1434 1471 1508 1466 1424 1357 1291 1271 1252 1360 1468 1576 1684 1715 1747 1730 1714 1738 1761 1784 1808 1788 1769 1639 1509 1522 1535 1500
859 1500 1466 1433 1399 1413 1427 1365 1303 1240 1178 1211 1244 1355 1467 1434 1402 1369 1337 1316 1296 1386 1476 1492 1508 1477 1446 1444 1442 1393 1344 1362 1381 1351 1322 1313 1304 1248
854 1248 1192 1208 1224 1288 1351 1378 1405 1433 1460 1431 1402 1373 1344 1385 1426 1467 1508 1461 1414 1368 1321 1315 1309 1350 1392 1417 1441 1419 1396 1410 1424 1485 1546 1537 1528 1519 1510 1488
850 1488 1465 1490 1515 1453 1391 1391 1469 1505 1462 1395 1375 1398 1422 1400 1379 1339 1298 1261 1302 1402 1501 1527 1552 1541 1529 1470 1411 1417 1423 1430 1436 1409 1382 1356 1329 1300 1272
845 1272 1290 1309 1325 1341 1309 1277 1278 1279 1280 1281 1278 1275 1320 1365 1303 1241 1240 1318 1361 1324 1260 1244 1276 1260 1227 1272 1357 1395 1385 1376 1406 1435 1386 1337 1345 1352 1316 1279 1295 1359
840 1359 1367 1296 1224 1231 1299 1367 1378 1388 1350 1313 1357 1402 1518 1634 1689 1634 1535 1437 1419 1480 1523 1519 1468 1416 1441 1465 1444 1423 1402 1381 1444 1508 1493 1478 1455
836 1455 1433 1411 1389 1374 1358 1390 1423 1474 1525 1497 1469 1469 1469 1468 1468 1450 1432 1414 1396 1421 1445 1470 1494 1385 1276 1278 1279 1317 1355 1441 1526 1497 1469 1361 1254 1314
832 1314 1374 1387 1400 1417 1434 1499 1563 1691 1819 1773 1727 1685 1644 1713 1782 1861 1940 1908 1876 1927 1978 2185 2392 2721 3271 4277 5882 7905 9706
828 9706 10482 9837 8096 6135 4569 3539 2877 2436 2151 1961 1806 1652 1613 1575 1560 1545 1419 1294 1274 1254 1344 1434 1411 1388 1364 1341
825 1341 1391 1442 1413 1385 1380 1376 1418 1461 1373 1286 1340 1395 1458 1521 1474 1426 1406 1386 1319 1252 1211 1171 1209 1247 1323 1399 1333 1267 1235 1202 1249 1296 1331 1366 1322 1278
821 1278 1300 1322 1296 1271 1251 1232 1354 1477 1491 1505 1472 1439 1410 1381 1399 1417 1460 1503 1468 1432 1361 1291 1331 1371 1415 1459 1497 1534 1587 1545 1451 1358 1282 1301
816 1301 1377 1453 1461 1469 1477 1485 1524 1563 1523 1483 1401 1320 1239 1157 1182 1206 1183 1160 1199 1239 1325 1412 1449 1486 1571 1655 1747 1838 1756 1674 1601 1527 1454 1381 1395 1410 1424
812 1424 1439 1394 1349 1305 1260 1282 1305 1327 1350 1339 1328 1317 1306 1275 1245 1261 1278 1258 1239 1324 1409 1481 1458 1410 1362 1386 1411 1435 1460 1475 1491 1428 1364 1294 1223
808 1223 1200 1177 1203 1229 1302 1376 1424 1472 1409 1346 1323 1300 1235 1171 1101 1125 1207 1289 1245 1201 1204 1207 1282 1358 1355 1351 1304 1258 1258 1259 1235 1211 1234 1257 1381 1505 1518
803 1518 1532 1441 1350 1306 1263 1279 1296 1313 1329 1303 1276 1296 1317 1306 1295 1284 1273 1298 1323 1269 1216 1229 1242 1256 1269 1306 1343 1428 1512 1432 1351 1318 1285 1260 1235
799 1235 1258 1280 1301 1322 1344 1365 1412 1460 1428 1396 1371 1345 1319 1294 1263 1232 1281 1329 1358 1386 1415 1443 1432 1421 1362 1304 1262 1220 1226 1231 1281 1331 1334 1337 1286 1235 1232
794 1232 1229 1317 1404 1413 1422 1375 1328 1359 1391 1373 1355 1338 1320 1287 1255 1222 1190 1174 1158 1142 1126 1215 1305 1394 1484 1538 1591 1503 1414 1354 1294 1234 1174 1176 1178 1180 1182 1183 1185
789 1185 1264 1344 1351 1357 1364 1370 1319 1269 1218 1167 1177 1187 1276 1365 1334 1304 1273 1243 1282 1321 1360 1399 1454 1509 1421 1334 1301 1267 1281 1295 1374 1452 1470 1409 1375 1420 1442
785 1442 1417 1383 1349 1343 1290 1247 1283 1377 1423 1367 1311 1363 1414 1429 1443 1458 1472 1422 1371 1399 1428 1451 1475 1495 1516 1472 1380 1315 1328 1349 1321 1296 1318 1359 1353 1270
781 1270 1188 1217 1325 1433 1463 1470 1478 1480 1483 1420 1358 1343 1328 1283 1238 1196 1233 1339 1445 1463 1402 1353 1384 1440 1448 1395 1342 1334 1326 1317 1307 1298 1289 1275 1261 1295 1328 1355
776 1355 1381 1408 1435 1422 1409 1393 1377 1373 1322 1280 1348 1455 1515 1498 1482 1533 1584 1557 1529 1516 1502 1473 1397 1361 1405 1449 1493 1524 1554 1538 1521 1454 1387 1399 1411
772 1411 1401 1390 1380 1370 1300 1231 1240 1250 1308 1366 1425 1483 1506 1529 1504 1479 1488 1496 1504 1512 1409 1305 1259 1308 1380 1452 1394 1336 1289 1338 1433 1434 1362 1290 1291 1292 1366 1440
767 1440 1467 1493 1414 1335 1335 1334 1334 1334 1286 1239 1292 1344 1287 1229 1181 1133 1165 1196 1273 1351 1403 1361 1348 1336 1318 1300 1267 1233 1247 1260 1257 1254 1355 1457 1501 1451 1407
762 1407 1363 1299 1235 1250 1265 1311 1356 1354 1352 1362 1372 1382 1392 1337 1283 1228 1173 1160 1147 1238 1330 1363 1301 1192 1178 1187 1195 1209 1224 1233 1242 1203 1165 1198 1230 1263 1296
758 1296 1344 1393 1332 1270 1278 1285 1293 1300 1376 1453 1450 1447 1403 1359 1362 1365 1338 1312 1285 1258 1309 1360 1411 1462 1463 1465 1466 1467 1424 1381 1338 1295 1302 1309 1426 1543 1519 1494 1469 1444 1454
753 1454 1463 1393 1324 1261 1198 1246 1294 1349 1404 1412 1419 1430 1441 1452 1463 1354 1245 1126 1165 1298 1431 1495 1558 1607 1655 1657 1658 1603 1548 1492 1437 1464 1491 1470 1449
749 1449 1390 1331 1319 1308 1389 1471 1505 1539 1543 1548 1552 1557 1560 1563 1567 1570 1564 1559 1553 1547 1497 1446 1443 1440 1494 1548 1602 1656 1668 1680 1581 1482 1470 1458 1446 1434 1421 1408 1473 1539 1557 1574
744 1574 1513 1452 1424 1396 1416 1435 1413 1391 1417 1442 1483 1525 1519 1513 1498 1483 1468 1453 1483 1512 1494 1476 1464 1452 1488 1523 1528 1532 1537 1542 1585 1628 1671 1714 1745 1775 1806 1836
739 1836 1800 1763 1727 1690 1676 1662 1653 1645 1578 1606 1717 1828 1830 1738 1698 1659 1698 1736 1775 1814 1825 1836 1847 1858 1871 1884 1850 1815 1749 1682 1663 1644 1632 1619 1717
735 1717 1816 1827 1839 1851 1862 1861 1860 1859 1858 1860 1863 1866 1868 1901 1933 1918 1903 1925 1948 2012 2076 2084 1997 1916 1835 1870 1905 1940 1975 2001 2026 1978 1930 1899 1963 2027 1996 1958 1920
730 1920 1923 1927 1920 1913 2043 2172 2253 2240 2232 2224 2298 2372 2446 2519 2585 2651 2717 2783 2821 2859 3008 3157 3327 3497 3755 4108 4484 4860 5206 5458 5573
726 5573 5531 5366 5201 4862 4522 4240 4052 3928 3805 3634 3558 3519 3479 3342 3204 3131 3153 3122 3090 3028 2966 2982 2999 2985 2971 3004 3037 3096 3154
722 3154 3165 3177 3234 3292 3432 3667 3895 4028 4167 4401 4675 4948 5117 5285 5500 5714 5928 6142 6494 6847 7205 7563 8027 8586 9203
719 9203 9819 10470 11121 11641 12004 12224 12222 11992 11604 11112 10524 9876 9227 8640 8148 7782 7416 7150 6980 6866 6753 6579 6404 6151
716 6151 5898 5764 5629 5494 5359 5247 5135 5023 4910 4829 4747 4744 4742 4825 4909 4992 5076 5217 5358 5609 5860 6151 6443 6734 7025 7368 7710
713 7710 8059 8407 8793 9274 9796 10413 11074 11830 12617 13405 14211 15018 15725 16275 16604 16712 16615 16359 15926 15271 14484 13602 12731 11861
710 11861 11100 10498 10022 9545 9079 8613 8310 8007 7705 7402 7174 6947 6678 6409 6172 6030 5835 5640 5426 5213 5005 4797 4639
707 4639 4575 4505 4436 4392 4349 4417 4484 4629 4773 4997 5220 5387 5553 5647 5741 5969 6292 6646 7000 7387 7869 8503 9137 9800 10462 11168
704 11168 11779 12223 12509 12689 12773 12813 12759 12535 12090 11411 10574 9676 8778 7904 7124 6566 6165 5812 5460 5143 4920 4769 4618 4393
701 4393 4169 4010 3850 3739 3627 3536 3446 3277 3108 2976 2845 2671 2498 2353 2302 2277 2252 2201 2151 2179 2208 2253 2299 2344 2389 2413 2436 2418 2399
698 2399 2455 2605 2813 3021 3230 3440 3792 4144 4567 4991 5462 5838 6111 6289 6328 6147 5704 5102 4522 4037 3616 3196 2839 2576
695 2576 2363 2149 2062 2070 2048 2025 2009 1993 1882 1771 1685 1695 1699 1703 1660 1712 1801 1889 1904 1919 1802 1686 1595 1598 1688 1779 1765 1750 1710 1670 1708 1747 1748 1749 1640
691 1640 1530 1500 1470 1487 1505 1503 1502 1500 1499 1503 1506 1557 1608 1650 1692 1686 1681 1629 1577 1572 1567 1538 1510 1529 1547 1585 1623 1614 1605 1552 1499 1494 1489 1571 1653 1688 1722 1704 1685 1667 1648
686 1648 1626 1603 1581 1558 1616 1673 1652 1630 1670 1710 1750 1790 1748 1705 1662 1619 1598 1577 1635 1693 1683 1674 1665 1655 1678 1701 1797 1893 1882 1776 1671 1660 1746 1832 1813
681 1813 1795 1776 1757 1786 1815 1809 1804 1798 1793 1763 1733 1703 1672 1646 1619 1592 1566 1599 1633 1771 1909 1934 1864 1788 1807 1930 1958 1903 1848 1831 1815 1720 1625 1664 1702
677 1702 1740 1778 1840 1903 1882 1767 1735 1799 1935 1976 1963 1951 1979 2008 2052 2096 2093 2090 2027 1963 1978 1993 2020 2047 2074 2101 2117 2134 2151 2167 2152 2138 2148 2254
673 2254 2333 2411 2417 2423 2478 2533 2541 2548 2538 2527 2412 2297 2284 2365 2446 2433 2346 2259 2214 2169 2213 2258 2308 2264 2222 2180 2211 2242 2256 2269 2203 2138 2126 2114 2181 2248
668 2248 2309 2371 2432 2493 2474 2455 2435 2416 2448 2480 2471 2461 2398 2429 2486 2543 2494 2445 2476 2506 2545 2585 2625 2664 2608 2552 2448 2345 2331 2318 2352 2385 2367 2348
664 2348 2330 2311 2346 2380 2367 2354 2321 2288 2255 2223 2225 2227 2181 2136 2161 2185 2207 2229 2205 2134 2045 2035 2089 2144 2124 2104 2131 2158 2185 2211 2215 2219 2266 2312 2327 2263 2152
660 2152 2120 2203 2286 2310 2256 2228 2248 2283 2318 2308 2298 2288 2277 2279 2281 2236 2190 2141 2092 2042 1993 2001 2009 1970 1931 1889 1847 1852 1857 1861 1865 1822 1778 1778 1777 1776 1775 1870 1965 1997 1950
655 1950 1890 1876 1905 1887 1851 1815 1824 1832 1815 1797 1828 1858 1883 1908 1885 1863 1846 1828 1887 1945 1937 1881 1807 1813 1858 1902 1873 1796 1764 1810 1856 1902 1912 1923 1855 1786 1787
650 1787 1788 1789 1790 1792 1793 1795 1797 1811 1826 1840 1855 1825 1795 1843 1892 1881 1870 1858 1847 1821 1795 1773 1752 1768 1863 1958 1975 1942 1908 1918 1927 1891 1855 1866 1877 1927 1977 1979 1981 1925
645 1925 1868 1816 1765 1671 1657 1767 1877 1927 1899 1867 1836 1828 1820 1812 1804 1791 1778 1812 1846 1949 2053 2093 2054 1970 1934 1913 1892 1827 1762 1808 1853 1929 2005 2034 2063
641 2063 2091 2119 2147 2176 2131 2085 2064 2043 2038 2033 2075 2117 2078 2039 2079 2119 2144 2170 2147 2125 2128 2131 2134 2137 2133 2128 2230 2331 2366 2322 2272 2270 2283 2296 2265 2233 2238 2243 2248 2253
636 2253 2350 2447 2497 2546 2553 2559 2589 2619 2574 2528 2530 2532 2560 2587 2662 2737 2810 2883 2908 2934 2907 2881 2965 3049 3103 3158 3189 3221 3211 3202 3240 3278 3318 3357 3444 3531 3639
632 3639 3748 3809 3870 3938 4005 4146 4287 4369 4358 4369 4476 4640 4804 4997 5190 5433 5675 5917 6160 6394 6629 6858 7182 7572 7963 8359
628 8359 8755 9251 9747 10274 10897 11649 12496 13426 14514 15785 17278 19042 21028 23297 25914 29079 32843 37285 42390 48187
626 48187 54710 61745 68779 74928 79340 81130 79921 75886 69862 62806 55530 48545 42224 36699 31964 27947 24593
624 24593 21809 19436 17315 15478 13950 12705 11669 10728 9894 9219 8602 7985 7409 6832 6376 6015 5746 5477 5215 4952 4775
621 4775 4598 4421 4244 4117 3991 3864 3738 3641 3544 3406 3267 3159 3146 3179 3118 3007 2895 2888 2881 2800 2719 2662 2604 2581 2558 2535 2512 2456 2400 2303
618 2303 2205 2178 2246 2339 2432 2430 2429 2349 2269 2213 2158 2151 2143 2121 2099 2117 2135 2051 1968 1971 1975 1968 1961 1994 2027 2089 2152 2159 2166 2132 2099 2121 2143 2161 2179 2192 2204 2264 2230 2177
613 2177 2125 2104 2083 2062 2041 2047 2053 2019 1986 1920 1854 1844 1833 1891 1949 1952 1955 1930 1905 1879 1854 1902 1950 1943 1935 1889 1843 1909 1975 2002 1935 1866 1796 1799 1801 1803 1805 1809 1814 1867 1921
608 1921 1902 1790 1716 1738 1822 1907 1958 2009 1978 1948 1864 1875 1936 1996 1975 1955 1967 1979 1968 1957 1941 1925 2006 2087 2182 2182 2117 2052 1993 1935 1827 1719 1660 1696
604 1696 1781 1867 1854 1842 1927 2011 2066 2026 1968 1910 1901 1892 1811 1731 1746 1762 1874 1986 2090 2099 2091 2082 2081 2080 2007 1935 1923 1911 1923 1934 1965 1996 1987 1978 2044 2110 2142 2080
599 2080 2043 2006 2018 2031 2014 1997 1980 1963 1921 1878 1922 1966 2012 2058 2104 2149 2182 2214 2191 2168 2209 2250 2314 2379 2320 2261 2178 2096 2102 2109 2155 2201 2225 2248 2289 2331
595 2331 2370 2315 2233 2150 2187 2318 2395 2473 2498 2524 2510 2496 2521 2546 2626 2706 2800 2895 3054 3214 3378 3448 3453 3457 3528 3599 3614 3630 3661 3692 3773 3853 3896 3843
590 3843 3773 3702 3781 3860 3874 3794 3756 3719 3676 3633 3665 3697 3753 3809 3871 3932 3954 3977 3962 3948 3989 4030 4127 4224 4297 4371 4519 4667 4792 4917 5025 5134
587 5134 5266 5398 5596 5795 5969 6144 6318 6492 6608 6628 6699 6865 7049 7138 7212 7286 7427 7567 7676 7691 7617 7496 7413 7425 7517 7609 7608 7512
583 7512 7402 7338 7333 7423 7492 7514 7529 7592 7653 7665 7618 7572 7522 7472 7431 7390 7349 7308 7284 7260 7284 7307 7360 7413 7424 7387 7401 7574 7796 8019 8189 8360
579 8360 8536 8712 8845 9073 9416 9758 10003 10154 10284 10462 10652 10843 11010 11083 11086 11089 11133 11178 11172 11167 11162 11156 11168 11179 11106 11032 10906 10684 10442 10247
576 10247 10104 9961 9820 9680 9591 9502 9460 9419 9482 9545 9554 9468 9422 9424 9419 9367 9328 9289 9225 9065 8922 8826 8745 8663 8565 8467 8423 8378 8409 8534 8707 8785
572 8785 8763 8742 8793 8844 8859 8873 8887 8901 8911 8922 8932 8942 9047 9152 9304 9456 9511 9566 9622 9677 9572 9466 9381 9390 9396 9307 9199 9091 9011 8932 8805
568 8805 8678 8571 8464 8404 8344 8264 8183 8056 7928 7718 7508 7299 7089 6869 6649 6476 6303 6187 6070 5907 5743 5615 5488 5439 5391
565 5391 5310 5229 5226 5224 5252 5281 5309 5337 5343 5350 5404 5458 5537 5617 5697 5777 5840 5903 5919 5935 5952 5969 5938 5908 5818 5729 5639 5549 5521 5493 5466 5438 5283 5129 5001
560 5001 4967 4939 4911 4936 4962 5011 5060 5192 5418 5672 5831 5875 5920 5962 6003 5998 5992 5911 5830 5750 5669 5671 5673 5675 5678 5647 5617 5581 5639 5739 5839 5834 5830 5858 5887 5915
556 5915 5943 5948 5953 5910 5868 5928 5989 6050 6111 6160 6209 6258 6307 6299 6291 6277 6357 6530 6702 6770 6838 7012 7186 7334 7388 7425 7463 7574 7685 7859 8033 8159
552 8159 8286 8385 8484 8541 8599 8622 8740 8883 9027 9112 9198 9236 9274 9317 9361 9405 9448 9507 9565 9576 9587 9601 9615 9675 9736 9797 9858 9872 9886 9829 9773 9764 9755 9740
548 9740 9724 9714 9704 9745 9881 10064 10152 10183 10214 10380 10547 10617 10686 10779 10873 10942 11011 11080 11149 11237 11326 11414 11502 11529 11556 11609 11757 11955 12153 12310 12467
544 12467 12607 12748 12936 13124 13264 13405 13516 13627 13709 13696 13690 13683 13758 13834 13862 13890 13920 13949 13978 14007 14103 14198 14366 14535 14712 14795 14820 14845 14921 14997
541 14997 15146 15294 15377 15365 15406 15447 15538 15629 15585 15540 15557 15669 15812 15956 16103 16345 16613 16881 17094 17306 17629 17952 18242 18531 18773 19015
537 19015 19276 19537 19713 19889 19944 19904 19918 19932 19989 20047 20025 20004 20032 20059 20063 20067 20128 20189 20339 20583 20832 21081 21336 21591 21932 22272 22565 22859
534 22859 23122 23386 23626 23866 24176 24486 24795 25105 25296 25488 25679 25870 26120 26370 26478 26586 26743 26900 27034 27167 27323 27479 27583
531 27583 27593 27566 27633 27841 28048 28254 28365 28450 28535 28689 28843 29003 29068 29060 29052 28990 28929 28794 28659 28450 28242 28153 28158 28140 28027 27877 27728 27715 27701
528 27701 27739 27776 27861 27946 28115 28284 28533 28781 28976 29172 29343 29515 29821 30126 30359 30592 30918 31339 31759 32180 32554 33023 33492 33867
525 33867 34203 34540 34924 35214 35472 35729 36066 36403 36776 37245 37739 38233 38685 39138 39614 40091 40550 41009 41468 41927 42296 42664 43044
522 43044 43330 43597 43958 44448 44938 45576 46435 47414 48173 48436 48352 48287 48444 48768 49250 49872 50588 51386 52183 53018 53948 54936 56018
519 56018 57264 58509 59822 61230 62658 64085 65374 66568 67641 68715 69763 70811 71938 73065 74227 75390 76645
517 76645 77900 79228 80778 82613 84732 87183 89917 92979 96262 99618 103132 106922 111059 115621 120593 126114 132172
515 132172 138778 145921 153687 162117 171275 181222 192112 204234 217628 232064 247088 262775 279961 299704 322639
513 322639 349079 379443 414511 455100 501971 556288 619287 691493 771939 857280 939684 1004943 1034937 1016145
511 1016145 948576 846668 731089 618694 518389 432816 361797 303955 257194 219399 188834 164042 143764
510 143764 127042 113193 101637 91818 83356 75999 69539 63806 58705 54203 50238 46747 43650 40901 38465 36250
508 36250 34245 32460 30836 29369 28083 27019 26243 25751 25657 25722 25454 24460 22862 21170 19738 18527 17407 16444 15664 15042
505 15042 14515 13988 13513 13038 12533 12123 11896 11669 11424 11180 11022 10864 10711 10465 10113 9762 9405 9047 8742 8437 8158 7973 7904
503 7904 7835 7693 7551 7400 7249 7122 6994 6866 6737 6584 6432 6369 6307 6291 6276 6202 6127 6047 6062 6161 6260 6334 6313 6211 6016 5757 5497 5263
499 5263 5029 4842 4655 4478 4302 4072 3937 3907 3878 3806 3735 3760 3784 3785 3786 3788 3789 3838 3887 3834 3781 3681 3580 3379 3179 3035 2986 2986 2986 2881 2777
495 2777 2760 2742 2702 2661 2587 2514 2467 2514 2600 2686 2636 2586 2561 2536 2616 2696 2802 2813 2766 2720 2779 2837 2845 2758 2644 2625 2657 2689 2623 2557 2491 2425 2445 2466
491 2466 2487 2508 2650 2791 2848 2748 2502 2256 2120 2080 2077 2075 1968 1862 1837 1812 1834 1857 1876 1895 1913 1932 2036 2140 2133 2126 2123 2119 2115 2111 2179 2246 2319 2392
487 2392 2461 2624 2854 3179 3635 4092 4455 4598 4419 3957 3420 2977 2676 2469 2294 2119 2005 1891 1783 1675 1641 1702 1788 1875 2057
484 2057 2239 2336 2276 2084 1892 1744 1595 1553 1605 1604 1604 1568 1533 1545 1557 1498 1440 1375 1405 1503 1600 1656 1712 1759 1806 1780 1754 1793 1927 2055 2183 2280
480 2280 2377 2510 2737 3068 3558 4233 5066 5994 6828 7331 7296 6753 5925 5038 4246 3612 3135 2790 2540 2304 2068 1885 1702 1604
477 1604 1506 1455 1404 1433 1462 1412 1362 1366 1369 1372 1376 1404 1432 1434 1342 1276 1210 1191 1173 1157 1237 1310 1383 1395 1406 1418 1429 1440 1451 1540 1630 1683 1736 1748 1759 1837 2009
473 2009 2135 2260 2383 2601 2970 3340 3665 3989 4132 4054 3747 3346 2985 2623 2306 1989 1761 1627 1551 1475 1484 1493 1423 1353 1330 1308 1278
469 1278 1248 1266 1284 1250 1217 1183 1150 1127 1105 1082 1060 1082 1104 1047 990 1015 1039 1064 1088 1093 1098 1103 1108 1019 930 920 910 931 952 972 993 980 968 955 942 885 828
465 828 850 872 903 934 965 997 1031 1065 1146 1227 1391 1555 1792 2029 2207 2290 2284 2278 2215 2152 2135 2119 2038 1957 1901 1941 1997 2053 2067 2082 2017 1951 1965 1979
461 1979 2011 2043 2076 2108 2095 2082 2011 2034 2076 2038 1972 1906 1926 1945 1918 1890 1860 1829 1798 1768 1839 1910 1934 1957 1957 1957 1910 1815 1714 1693 1734 1775 1808 1841 1832 1822
456 1822 1845 1948 2029 2063 2016 1922 1872 1870 1877 1884 1895 1905 1853 1800 1809 1896 1947 1918 1864 1858 1920 1982 1968 1953 2025 2097 2105 2035 1945 1902 1939 1975 1997 2018 2040 2061 2041
452 2041 2020 1999 1978 2017 2055 2046 2037 1946 1854 1842 1829 1900 1970 1962 1953 1920 1888 1902 1917 1934 1951 1922 1844 1783 1800 1849 1898 1926 1953 1980 2008 1958 1909 1907 1905 1936 1966 1918
447 1918 1870 1781 1693 1652 1611 1670 1729 1788 1846 1858 1870 1777 1683 1627 1650 1707 1765 1759 1754 1704 1655 1656 1705 1772 1760 1723 1686 1651 1615 1589 1657 1771 1789 1717 1598
443 1598 1525 1547 1546 1546 1551 1556 1572 1589 1606 1623 1605 1587 1569 1551 1596 1640 1633 1531 1433 1429 1533 1638 1669 1605 1516 1426 1376 1327 1356 1385 1342 1300 1308 1412 1436 1364
438 1364 1299 1329 1434 1539 1564 1494 1442 1437 1447 1458 1404 1351 1344 1384 1420 1362 1286 1257 1294 1331 1261 1190 1152 1113 1153 1193 1217 1240 1216 1192 1148 1105 1108 1112 1125 1139
434 1139 1194 1249 1297 1249 1181 1160 1172 1184 1198 1213 1220 1226 1129 1031 1006 1076 1120 1116 1068 1021 1049 1078 1157 1236 1237 1237 1204 1171 1185 1200 1295 1390 1406 1423 1343 1264 1185
429 1185 1105 1113 1121 1177 1232 1267 1301 1288 1276 1243 1210 1256 1348 1426 1410 1307 1204 1145 1086 1075 1063 1058 1054 1049 1044 1010 976 1052 1128 1183 1239 1215 1192 1204 1215 1212 1161
425 1161 1111 1155 1202 1154 1052 1044 1150 1257 1254 1251 1295 1340 1376 1412 1401 1390 1349 1309 1268 1227 1230 1233 1235 1238 1253 1267 1234 1202 1239 1276 1265 1255 1255 1256 1256 1257 1193 1128 1174
420 1174 1221 1249 1278 1227 1177 1177 1177 1177 1177 1168 1159 1103 1047 1104 1161 1204 1199 1207 1309 1364 1325 1215 1152 1167 1182 1150 1118 1165 1211 1221 1231 1241 1251 1264 1278 1365 1451 1437
415 1437 1328 1245 1210 1223 1235 1250 1265 1285 1305 1325 1345 1283 1220 1157 1094 1121 1147 1173 1199 1196 1193 1237 1281 1298 1315 1284 1254 1234 1213 1193 1172 1146 1119 1092 1066
411 1066 1070 1074 1078 1082 1165 1248 1253 1257 1258 1258 1216 1174 1197 1298 1382 1419 1371 1324 1321 1318 1327 1336 1297 1258 1274 1290 1306 1321 1289 1257 1177 1098 1104 1111 1117 1123 1118 1113 1107 1102 1140 1178 1216 1255
406 1255 1261 1268 1274 1281 1246 1211 1224 1236 1252 1268 1236 1205 1241 1278 1298 1272 1230 1267 1331 1348 1319 1290 1332 1374 1377 1301 1222 1144 1166 1189 1286 1383 1398 1334 1267 1200 1128
401 1128 1055 1017 1058 1147 1237 1253 1268 1251 1234 1217 1201 1269 1337 1345 1273 1195 1195 1225 1255 1225 1195 1213 1230 1227 1224 1268 1312 1289 1266 1244 1221 1198 1176 1153 1130 1177 1224
397 1224 1224 1223 1227 1230 1234 1237 1171 1104 1116 1128 1132 1135 1138 1141 1136 1130 1125 1119 1179 1238 1304 1275 1193 1111 1165 1220 1245 1270 1272 1274 1298 1321 1298 1275 1263 1251 1263 1276 1288 1301 1314 1327 1351
392 1351 1375 1295 1214 1144 1169 1244 1320 1376 1337 1273 1208 1243 1278 1319 1265 1168 1072 1143 1214 1245 1275 1305 1335 1371 1406 1363 1319 1280 1240 1223 1207 1198 1190 1228 1267 1332
387 1332 1397 1351 1305 1285 1264 1243 1222 1305 1389 1453 1422 1369 1410 1471 1532 1548 1564 1532 1501 1511 1521 1635 1750 1823 1802 1787 1772 1758 1745 1653 1561 1487 1414 1420
383 1420 1425 1460 1494 1528 1562 1533 1503 1521 1539 1524 1508 1540 1572 1591 1611 1631 1651 1678 1704 1684 1663 1629 1594 1639 1684 1662 1641 1620 1599 1604 1609 1638 1666 1622 1578 1611
379 1611 1643 1633 1576 1569 1656 1732 1760 1773 1787 1842 1898 1968 2086 2151 2120 2069 2066 2082 2051 1970 1890 1875 1861 1894 1927 1972 2017 1983 1949 2000 2051 2101 2152 2187 2223
374 2223 2279 2335 2323 2264 2223 2276 2348 2373 2378 2429 2511 2545 2558 2619 2719 2820 2923 3027 3155 3284 3365 3447 3568 3690 3812 3933 4119 4305 4491
371 4491 4677 4910 5143 5382 5621 5873 6221 6673 7220 7894 8663 9602 10825 12348 14092 16041 18212 20408 22257 23356 23603
368 23603 23092 22045 20798 19551 18454 17516 16677 15934 15261 14684 14182 13775 13380 13033 12746 12507 12278 12002 11677 11351 11063 10775
365 10775 10629 10483 10376 10270 10157 10139 10163 10187 10273 10455 10608 10761 10866 11067 11301 11534 11823 12334 12961 13589 14325 15345 16685 18310
363 18310 20401 23407 27698 33535 41590 52203 63569 71430 71877 64778 53790 43150 34727 28357 23417 19708 17029
360 17029 14950 13238 11873 10828 9941 9182 8645 8277 8004 7829 7749 7721 7599 7332 7064 6797 6530 6261 6087 6065 6044 5968 5893 5871
358 5871 5849 5895 6037 6236 6435 6658 6882 7184 7487 7760 8032 8404 8870 9383 10054 10903 11972 13290 14956 17077 19608 22338
355 22338 25068 27208 28180 27607 25613 22806 19715 16778 14188 12008 10239 8764 7573 6676 5999 5427 4855 4417 4074
352 4074 3823 3571 3383 3290 3210 3129 3055 2981 2912 2842 2694 2546 2487 2428 2322 2216 2151 2086 2021 1956 1950 1943 1937 1930 1914 1899 1883 1868 1829 1789 1797 1805 1719 1634
348 1634 1658 1683 1724 1764 1726 1688 1621 1554 1487 1420 1410 1399 1436 1473 1508 1543 1499 1455 1452 1448 1444 1441 1444 1447 1451 1454 1443 1433 1422 1412 1407 1403 1445 1488 1424 1359 1368 1378 1319 1181
343 1181 1087 1135 1243 1351 1461 1571 1656 1631 1557 1484 1488 1491 1495 1499 1497 1494 1413 1332 1345 1359 1372 1385 1339 1293 1247 1201 1158 1116 1152 1189 1183 1177 1126 1076 1112 1196 1222
339 1222 1168 1092 1064 1082 1101 1123 1144 1213 1282 1273 1264 1255 1246 1298 1349 1321 1294 1266 1238 1211 1183 1113 1044 1084 1125 1191 1256 1243 1229 1200 1170 1245 1321 1341 1283 1267 1329
334 1329 1431 1454 1384 1267 1190 1192 1257 1323 1318 1314 1262 1210 1192 1175 1202 1229 1222 1167 1094 1100 1141 1182 1122 1062 1078 1172 1218 1186 1102 1017 1038 1060 1077 1094 1111 1128
330 1128 1159 1189 1140 1091 1129 1168 1159 1150 1163 1176 1188 1201 1192 1183 1174 1164 1158 1152 1146 1140 1110 1081 1099 1117 1099 1082 1138 1195 1197 1121 1045 1048 1110 1171 1159 1147 1137 1127 1117 1107
325 1107 1053 1000 1009 1098 1208 1271 1223 1176 1168 1161 1157 1153 1147 1188 1251 1234 1162 1138 1162 1235 1289 1295 1252 1210 1153 1096 1087 1078 1062 1047 1031 1015 983 951 997 1044 1029 1014 1073
320 1073 1132 1126 1041 954 945 989 987 989 1039 1089 1139 1112 1086 1061 1036 1042 1127 1219 1264 1216 1089 978 945 1005 1065 1048 1032 1015 998 966 934 992 1130 1228 1215 1191
316 1191 1214 1275 1256 1175 1093 1063 1033 1019 1052 1106 1082 1000 917 912 986 1086 1138 1144 1101 1083 1064 1093 1122 1072 1022 1048 1074 1148 1221 1180 1139 1098 1058 1059 1060 1061 1062
311 1062 1042 1022 957 892 957 1070 1125 1101 1059 1064 1117 1170 1204 1239 1268 1298 1311 1245 1131 1097 1162 1228 1189 1149 1099 1048 1045 1042 1085 1128 1170 1213 1145 1078 1120
307 1120 1163 1150 1136 1123 1109 1135 1161 1187 1213 1222 1232 1193 1155 1153 1150 1147 1145 1146 1147 1101 1055 1112 1170 1166 1083 1041 1078 1098 1070 1043 1096 1175 1208 1201 1194 1185 1175 1172 1168 1165 1161 1116
302 1116 1071 1073 1075 1023 970 918 866 952 1038 1124 1210 1287 1363 1360 1357 1357 1356 1308 1260 1247 1235 1269 1304 1371 1439 1458 1478 1511 1543 1529 1514 1473 1432 1392 1351 1369 1387 1358
297 1358 1329 1291 1252 1214 1175 1201 1227 1252 1278 1215 1152 1090 1027 943 858 884 911 997 1083 1122 1161 1159 1156 1154 1152 1134 1116 1098 1081 1030 980 1009 1037 1049 1061 1073 1084
293 1084 1032 980 1006 1033 1119 1205 1212 1220 1204 1189 1174 1158 1160 1163 1212 1262 1179 1095 1059 1023 1023 1022 1070 1117 1157 1197 1159 1120 1141 1162 1183 1203 1205 1208 1162 1117 1130 1144 1205
288 1205 1265 1258 1251 1243 1236 1169 1101 1113 1124 1076 1029 1028 1028 1050 1073 1096 1119 1133 1147 1113 1080 1074 1068 1015 962 945 927 910 892 916 941 965 990 1014 1038 984 929 895 860
283 860 937 1013 1073 1133 1146 1159 1094 1029 1043 1057 1026 994 1042 1089 1148 1208 1188 1169 1163 1157 1151 1145 1137 1128 1120 1111 1073 1035 1076 1117 1129 1141 1074 1008 990 973 955 938 970
279 970 1002 1034 1067 1063 1060 1135 1211 1234 1257 1233 1209 1160 1111 1021 931 924 1012 1047 1082 1034 987 986 986 1018 1051 1084 1116 1077 1038 998 959 954 949 944 939 958 976 948 919 946
274 946 974 954 934 993 1053 1118 1088 1007 926 950 974 999 1024 1049 1073 993 913 895 955 1007 980 911 921 1007 1092 1104 1116 1142 1167 1193 1218 1190 1162 1133 1105
269 1105 1139 1174 1253 1332 1262 1145 1100 1165 1256 1299 1265 1231 1159 1086 1037 988 991 994 1021 1048 1077 1105 1086 1019 980 1019 1117 1168 1124 1080 1081 1082 1036 990 991 993 999 1005
265 1005 1034 1064 1127 1190 1205 1220 1265 1310 1308 1305 1262 1218 1199 1179 1166 1153 1140 1127 1124 1122 1144 1165 1196 1227 1180 1132 1104 1075 1094 1113 1141 1169 1197 1225 1270 1314 1406
260 1406 1499 1505 1511 1469 1428 1453 1479 1552 1625 1648 1670 1645 1620 1616 1613 1657 1701 1717 1733 1639 1498 1364 1309 1381 1452 1437 1422 1359 1296 1257 1218 1258 1298 1321 1343 1287
256 1287 1231 1246 1262 1278 1293 1260 1226 1240 1253 1266 1278 1266 1255 1258 1262 1266 1269 1281 1293 1258 1223 1229 1236 1170 1103 1049 1089 1123 1157 1153 1149 1223 1344 1474 1509 1462 1414 1425
251 1425 1483 1521 1463 1322 1181 1182 1279 1395 1463 1485 1507 1469 1431 1346 1260 1252 1243 1188 1132 1099 1066 1112 1158 1147 1135 1124 1112 1171 1229 1177 1125 1090 1054 1066 1078
247 1078 1027 977 1067 1205 1283 1267 1251 1282 1300 1223 1150 1171 1230 1289 1275 1261 1167 1073 1056 1038 1054 1022 1005 1083 1213 1249 1201 1154 1210 1266 1274 1283 1246 1210 1131
243 1131 1053 1072 1185 1229 1115 932 844 871 992 1095 1104 1062 1019 1046 1073 1077 1080 1102 1124 1098 1073 1043 1013 1030 1047 1073 1098 1080 1061 1070 1127 1202 1198 1140 1081
238 1081 1065 1050 1080 1110 1093 1077 1046 1015 1032 1048 1037 1026 1063 1099 1179 1258 1227 1196 1176 1156 1183 1210 1212 1213 1215 1216 1197 1177 1205 1233 1159 1084 1057 1029 1064 1099 1087
234 1087 1074 1088 1101 1114 1127 1137 1148 1158 1168 1137 1106 1075 1043 1058 1072 1039 1006 935 865 904 944 1022 1099 1098 1096 1065 1033 1113 1192 1177 1163 1196 1229 1222 1216 1210 1203 1158
229 1158 1114 1113 1113 1092 1024 994 1075 1166 1178 1133 1134 1139 1097 1009 970 1000 1030 1016 1002 1003 1005 1006 1007 1049 1092 1055 1019 966 913 863 813 905 1043 1120 1119 1123 1127 1174 1220 1192
224 1192 1163 1135 1107 1080 1054 1028 1002 1043 1084 1020 956 902 942 1008 1074 1091 1107 1077 1046 1049 1053 1009 965 1006 1047 1069 995 955 1010 1053 1096 1105 1113 1121 1130 1138 1147 1202 1258
219 1258 1220 1182 1144 1106 1124 1141 1159 1177 1138 1099 1060 1022 1117 1213 1318 1266 1181 1095 1143 1190 1200 1210 1173 1135 1142 1150 1157 1164 1141 1119 1055 991 955 1013 1097 1181
215 1181 1154 1126 1098 1070 1051 1032 1061 1089 1096 1103 1031 959 1017 1075 1133 1191 1210 1230 1249 1269 1203 1136 1117 1098 1068 1037 1006 975 986 997 960 923 970 1016 1063 1109
211 1109 1198 1287 1324 1267 1135 1097 1142 1187 1159 1132 1105 1078 1095 1112 1082 1051 1062 1073 1084 1095 1141 1187 1154 1121 1068 1015 1042 1068 1050 1033 1016 998 1056 1113
207 1113 1124 1134 1118 1101 1085 1069 1015 962 1018 1075 1076 1077 1077 1078 1054 1030 1053 1076 1097 1117 1059 1001 965 930 968 1006 992 899 806 792 913 1034 1081 1129 1153 1176
202 1176 1153 1130 1069 1008 947 886 941 996 1050 1105 1132 1158 1137 1068 1029 1068 1166 1217 1187 1157 1130 1102 1043 1062 1116 1170 1128 1086 1044 1003 1017 1032 1095 1157 1091
198 1091 1025 1006 987 991 994 997 1000 1052 1105 1110 1115 1095 1075 1055 1035 1050 1066 1081 1097 1072 1047 1070 1093 1127 1162 1149 1136 1095 1054 1013 973 929 885 977 1069 1146 1128 1116
193 1116 1104 1141 1179 1169 1158 1098 1038 1056 1075 1072 1070 1068 1066 1118 1169 1085 1000 994 1082 1117 1152 1150 1147 1145 1143 1118 1093 1068 1043 1064 1086 1060 1034 990 947 982 1017 1061 1106
188 1106 1150 1195 1172 1149 1127 1104 1098 1092 1133 1174 1218 1262 1227 1193 1116 1038 1040 1042 1056 1071 1038 1005 1035 1065 1095 1125 1122 1119 1115 1112 1075 1039 1082 1124 1146 1168 1143 1117 1106
184 1106 1096 1038 979 970 960 998 1035 1049 1063 1078 1092 1073 1055 1036 1018 1028 1038 1047 1057 1141 1225 1283 1246 1202 1158 1108 1058 1044 1029 1062 1095 1125 1155 1185 1215 1189
179 1189 1162 1136 1110 1069 1029 994 959 858 851 901 951 940 930 998 1067 1102 1137 1124 1112 1076 1041 1084 1128 1150 1173 1149 1124 1141 1158 1174 1191 1099 1008 1026 1045
175 1045 1038 1031 1023 1016 1025 1033 1042 1051 1092 1134 1128 1123 1171 1220 1269 1317 1296 1274 1253 1232 1198 1165 1132 1098 1137 1176 1214 1253 1221 1189 1158 1126 1081 1036 1064 1092 1085 984 930 971
170 971 1007 1043 1037 1032 1056 1080 1098 1116 1089 968 846 819 919 1020 1075 1035 1025 1110 1190 1174 1118 1062 1079 1097 1076 1056 1083 1111 1157 1204 1204 1204 1220 1236 1173
166 1173 1111 1066 1021 1023 1025 993 960 975 990 1002 1015 981 946 1013 1079 1120 1067 986 906 930 954 1010 1067 1123 1179 1116 1054 1039 1024 1032 1040 1048 1056 1015 974 932 970 1025
161 1025 1032 997 1010 1039 1068 1101 1133 1142 1152 1114 1076 1088 1099 1111 1122 1056 990 972 953 1009 1066 1122 1178 1156 1133 1036 939 926 991 1038 1038 1025 1012 1044 1075 1097
157 1097 1118 1140 1162 1151 1141 1083 1025 995 965 982 999 1026 1053 1081 1108 1099 1091 1125 1159 1162 1087 1008 1009 1061 1067 1025 983 1000 1016 1033 1050 1023 997 970 943 983 1023
152 1023 1015 1008 1069 1131 1082 1033 1024 1015 1006 997 1024 1052 1035 1018 1053 1136 1189 1163 1081 999 990 982 948 914 879 845 912 980 1000 1020 989 958 975 991 998 1005 1012 1018 1061 1103 1145
147 1145 1187 1193 1198 1203 1208 1211 1214 1192 1171 1144 1116 1136 1156 1211 1266 1242 1218 1157 1096 1082 1069 1056 1043 1054 1064 1134 1204 1164 1123 1102 1082 1085 1088 1073 1057 1065 1073 1075 1077 1127 1176
142 1176 1222 1268 1235 1202 1190 1177 1123 1070 981 988 1052 1115 1071 1026 981 936 958 979 1048 1116 1147 1177 1129 1081 1014 947 959 972 994 1015 1013 1012 1028 1044 1061 1077
138 1077 1074 1072 1069 1067 1087 1107 1127 1147 1118 1090 1109 1127 1195 1262 1250 1238 1210 1182 1202 1221 1241 1262 1203 1144 1102 1060 1018 976 996 1016 1036 1056 1078 1099 1121 1142 1149
133 1149 1156 1089 1023 1024 1119 1214 1215 1164 1112 1102 1092 1074 1055 1085 1114 1087 1060 1112 1164 1173 1183 1192 1201 1192 1183 1100 1018 936 950 1020 1091 1109 1127 1145 1164 1206 1249 1297 1251
129 1251 1123 995 982 1063 1124 1185 1325 1465 1523 1487 1425 1362 1354 1346 1338 1330 1288 1245 1191 1231 1310 1295 1197 1099 1083 1067 1051 1034 1039 1043 1127 1210 1295 1380 1386 1392 1380
124 1380 1367 1378 1389 1426 1463 1500 1537 1632 1727 1712 1696 1697 1697 1698 1698 1637 1576 1593 1611 1598 1585 1493 1401 1318 1234 1229 1224 1245 1265 1286 1307 1284 1261 1237 1214 1238 1263 1151
119 1151 1039 999 1054 1103 1153 1253 1354 1407 1460 1487 1515 1584 1653 1666 1584 1483 1382 1373 1460 1469 1478 1453 1427 1449 1470 1437 1404 1323 1243 1187 1132 1100 1068 1019
115 1019 969 967 965 1021 1076 1132 1187 1154 1120 1086 1053 1055 1057 1106 1155 1100 1045 1037 1029 1070 1111 1105 1099 1154 1208 1183 1158 1132 1105 1078 1052 1010 968 926 884 951 1018 1006 993
110 993 991 988 1064 1140 1117 1095 1120 1144 1194 1243 1245 1247 1199 1150 1102 1054 1073 1092 1159 1225 1233 1240 1247 1255 1210 1165 1168 1171 1122 1073 1103 1134 1094 1054 1014 974 983 991 1000 1008 1006 1004 1002 1000
105 1000 1083 1165 1169 1173 1083 993 982 971 1030 1089 1070 1050 1041 1033 1024 1016 1020 1024 981 938 954 969 1033 1096 1098 1101 1104 1107 1143 1179 1168 1157 1102 1047 1040 1033 1049 1066 1082 1098 1032 966
100 966 946 927 935 942 950 958 988 1018 1048 1079 1068 1058 1048 1038 1092 1146 1121 1096 1114 1132 1150 1169 1165 1162 1111 1060 1070 1080 1090 1100 1078 1056 1035 1013 995 976 1068 1160
95 1160 1202 1243 1238 1232 1235 1239 1195 1151 1148 1145 1141 1138 1094 1049 1084 1119 1103 1087 1072 1056 1067 1078 1089 1100 1088 1077 1065 1054 1093 1133 1125 1118 1043 968 941 913 934 955 975 996
90 996 1046 1097 1100 1102 1105 1108 1111 1114 1112 1110 1061 1011 956 900 906 991 1070 1071 1012 1001 1039 1030 939 849 898 948 950 952 957 962 967 971 1034 1097 1081 1065 1081 1096 1064 1032 1052 1073 1093 1113
85 1113 1127 1140 1126 1033 965 1008 1090 1124 1067 1011 999 986 947 907 978 1048 1092 1136 1133 1129 1100 1071 1042 1013 1014 1016 1018 1019 994 970 992 1014 1041 1069 1096 1123 1102 1080
80 1080 1059 1038 1068 1097 1127 1157 1094 1031 1047 1063 1083 1102 1043 983 945 908 949 990 1003 1017 983 949 998 1047 1096 1145 1161 1176 1192 1208 1219 1229 1240 1251 1275
76 1275 1298 1243 1188 1131 1074 1017 959 971 982 950 919 919 997 1057 1070 1026 982 935 888 957 1026 1048 1023 1015 1087 1155 1145 1063 980 1004 1027 1055 1083 1064 1045 1029
72 1029 1014 1046 1078 1084 1089 1142 1195 1181 1166 1073 980 929 877 876 875 915 1001 1106 1131 1081 1031 1056 1080 1071 1063 1054 1046 1028 1011 993 976 1017 1058 1098 1139 1064 989 971 1048
67 1048 1087 1126 1124 1122 1072 1021 971 920 950 979 1009 1038 1018 998 978 958 1000 1042 1036 1031 1025 1019 1013 1007 1030 1052 1028 1003 950 897 922 948 962 976 990 1004 995 986 977 969 935
62 935 901 868 834 863 892 969 1045 1015 985 1033 1082 1082 1082 1081 1081 1121 1161 1195 1230 1228 1132 1036 1035 1099 1163 1122 1081 1113 1145 1157 1074 1005 1031 1102 1173 1225 1183 1114 1046
57 1046 1063 1081 1098 1116 1100 1085 1148 1211 1238 1265 1213 1161 1075 989 1013 1038 1046 1055 1064 1072 1093 1114 1135 1156 1083 1011 938 865 878 891 983 1075 1143 1210 1167 1124 1031
53 1031 939 933 1021 1110 1151 1114 1077 1090 1103 1115 1128 1166 1203 1158 1018 925 927 1008 1090 1194 1251 1220 1095 934 869 854 840 824 808 871 933 926 918 958 998
48 998 1013 1029 1044 1059 1029 998 1015 1032 1042 1052 1062 1072 1082 1092 1102 1113 1132 1151 1094 1037 1008 1027 1075 1028 952 923 1029 1135 1179 1127 1099 1118 1140 1114 1114
44 1114 1115 1088 1013 956 994 1019 996 980 1011 1064 1117 1126 1135 1190 1246 1222 1198 1142 1086 1077 1068 1076 1084 1092 1100 1035 971 985 999 989 978 968 958 993 1028 1063 1098 1097 1097 1096 1096 1096
39 1096 1096 1097 1097 1133 1169 1205 1241 1239 1236 1234 1231 1290 1349 1357 1365 1272 1131 1035 1097 1234 1324 1340 1356 1356 1355 1307 1260 1217 1174 1134 1094 1085 1123 1143 1069 987 953 1029 1104 1096 1087
34 1087 1031 974 950 925 980 1034 1075 1116 1109 1103 1111 1120 1081 1042 1041 1041 1041 1041 1031 1022 1056 1091 1085 1033 953 969 1065 1161 1178 1099 1011 970 1038 1107 1120 1134 1147 1160 1118 1075
29 1075 1080 1085 1084 1083 1034 986 1044 1102 1160 1219 1188 1158 1127 1097 1108 1119 1083 1047 991 935 927 918 942 965 986 1007 1005 955 879 898 990 1082 1070 1058 1017 976 935 894 909
24 909 923 941 959 999 1087 1122 1063 995 928 933 938 986 1034 1082 1129 1187 1244 1250 1162 1100 1132 1180 1180 1155 1131 1104 1076 1043 1010 1055 1101 1102 1103 1104 1104 1084 1063 1089 1116 1110
19 1110 1104 1099 1093 1063 1032 1002 972 1007 1042 1077 1112 1132 1152 1172 1193 1172 1152 1085 1017 1022 1028 1033 1039 1036 1034 1079 1124 1169 1214 1212 1210 1160 1111 1061 1012 1045 1078 1064 1050 1034 1019
14 1019 1009 999 971 1037 1129 1221 1150 1079 1058 1133 1192 1156 1100 1045 1058 1071 1036 1002 1001 1000 1047 1093 1065 1036 1055 1074 1070 1065 1060 1056 1056 1056 1056 1057 1054 1051 1048 1046 1050 1055 1012 970 1023
9 1023 1076 1135 1099 1010 920 903 887 914 941 968 995 1001 1007 1013 1020 1029 1038 1047 1056 1017 977 984 992 997 1003 1056 1109 1128 1148 1168 1187 1151 1114 1078 1041 1032 1022 1013 1004 1003 1003 1049 1096 1118
4 1118 1140 1156 1172 1159 1052 950 849 850 850 899 947 1028 1108 1079 1049 1077 1106 1134 1163 1125 1088 1050 1012 1024 1035 1046 1057 1065 1074 1029 1078 1166 1254 1206 1158 1180
-1 1180 1201 1144 1087 1080 1073 1019 964 991 1017 1044 1070 1098 1126 1154 1181 1166 1150 1087 1024 987 951 993 1035 1067 1099 1052 1006 949 892 913 935 994 1052 1110 1169 1092
-5 1092 1016 987 958 887 816 764 807 851 800 796 887 1026 1069 999 928 989 1050 1063 1077 1102 1128 1106 1084 1083 1082 1154 1226 1235 1150 1017 978 1044 1109 1134 1158 1205
-10 1205 1252 1215 1083 1004 1004 983 915 870 873 896 920 968 1063 1099 1057 1005 1001 1012 1023 996 969 942 915 937 958 1027 1096 1071 1046 977 907 945 1031 1087 1064 1048
-14 1048 1032 1011 990 1010 1029 1049 1068 1071 1074 1077 1079 1060 1040 1023 1006 1036 1114 1166 1138 1072 1053 1077 1053 1006 958 955 952 982 1012 1041 1071 1091 1110 1114 1071 994 996 1061 1126
-19 1126 1101 1075 1050 1025 1042 1060 1077 1094 1102 1110 1118 1126 1052 978 966 1032 1087 1063 1009 955 977 998 1019 1041 1101 1161 1142 1076 1027 1058 1146 1235 1231 1147 1081 1063 1052
-23 1052 1042 1034 1027 1017 1008 1072 1136 1150 1085 973 940 1017 1094 1065 1037 1032 1028 1023 1018 1007 996 985 974 998 1022 1047 1071 1040 1008 977 946 937 928 920 911 955 999 1090 1181 1155
-28 1155 1129 1102 1076 1086 1096 1106 1116 1083 1049 1063 1077 1113 1149 1106 1063 1033 1004 1022 1040 1080 1119 1048 976 1002 1027 1065 1007 886 859 941 1023 1079 1039 1000
-32 1000 1055 1164 1272 1272 1178 1011 939 1013 1087 1116 1144 1126 1107 1128 1148 1169 1190 1143 1097 1050 1004 1021 1039 1056 1074 1026 979 1011 1042 1070 1097 1125 1153 1152
-36 1152 1152 1104 1057 1041 1025 1008 992 967 942 989 1037 1115 1098 1025 951 979 1008 963 919 884 943 996 1049 1013 976 940 904 907 910 913 916 978 1039 996 952 953 1047 1142
-41 1142 1142 1117 1092 1140 1188 1133 1079 1024 969 1042 1115 1077 1040 1061 1083 1104 1126 1085 1045 963 881 907 1029 1185 1184 1135 1087 1138 1190 1133 1076 1020 963 914 865
-45 865 895 925 910 896 882 867 886 904 923 942 960 979 997 1016 1031 1046 1062 1077 1075 1073 1072 1070 1061 1052 1090 1129 1118 1107 1096 1085 1107 1130 1105 1080 1082 1083 1085 1087 1080 1073 1066 1059
-50 1059 1028 996 1044 1091 1056 1021 987 952 1018 1083 1070 1057 1034 1011 988 965 917 870 933 995 1076 1156 1094 1032 1029 1027 1024 1022 1042 1062 1082 1103 1133 1163 1146 1129 1088
-55 1088 1047 1054 1060 1042 1024 1006 988 924 860 874 889 906 923 939 956 995 1033 993 953 924 896 946 997 999 1001 1003 1006 993 980 968 955 983 1011 1039 1067 1043 1020 1044
-60 1044 1068 1038 1008 1025 1043 1010 977 991 1005 1006 1008 1009 1010 1023 1036 1049 1062 1114 1166 1171 1175 1120 1064 1087 1111 1032 954 968 1062 1127 1114 1045 1023 1040 1057 1077 1097 1039
-64 1039 981 970 960 1014 1069 1076 1083 1061 1039 1016 994 982 971 959 948 936 925 913 902 922 942 962 982 975 969 1009 1050 1043 1035 1028 1021 1013 1006 999 991 1012 1033 1006 979 996 1013
-69 1013 1029 1046 1068 1090 1113 1056 964 919 984 1050 1033 1017 1001 985 974 962 998 1034 1088 1143 1118 1093 1059 1025 992 958 959 960 1008 1056 1040 1023 1047 1072 1075 983
-74 983 945 906 953 999 1045 1092 1149 1205 1215 1225 1167 1110 1052 995 988 982 1049 1116 1140 1070 1053 1036 1053 1071 1088 1106 1119 1133 1099 1065 1009 954 924 989 1072 1156
-78 1156 1160 1165 1149 1038 927 911 986 1062 1033 1004 971 937 951 966 1013 1061 1030 998 973 948 970 992 1050 1108 1055 1002 945 888 857 921 1006 1092 1072 1053 1085
-82 1085 1116 1100 1084 1085 1086 1087 1088 1085 1082 1032 981 920 859 877 895 882 869 961 1053 1115 1083 1024 966 972 977 935 893 894 895 944 993 1024 1056 1041 1025 970 915 939 963 929
-87 929 896 909 923 974 1024 1071 1118 1070 973 965 1035 1045 975 889 915 989 1016 1028 1041 1040 1038 1036 1034 1097 1159 1174 1189 1171 1154 1136 1118 1097 1076 1055 1034 1022 1010 998
-92 998 986 1075 1164 1127 1011 956 948 937 880 801 769 819 868 965 1062 1158 1255 1213 1171 1129 1087 1128 1169 1131 1093 1040 986 980 974 955 935 994 1053 1113 1173 1154
-96 1154 1135 1110 1084 1058 1032 1033 1034 1082 1130 1093 1055 1017 980 976 973 970 967 936 906 875 844 899 953 1007 1062 1028 995 961 928 989 1049 1031 1013 977 941 1015 1090 1097
-101 1097 1104 1111 1118 1121 1123 1078 1033 1091 1150 1162 1173 1157 1141 1125 1109 1110 1112 1114 1115 1092 1069 1046 1023 976 930 931 931 947 963 931 899 941 983 947 910 945 980 1038 1097 1065
-106 1065 1034 1003 971 960 948 937 925 945 965 961 958 1036 1115 1115 1115 1111 1107 1055 1004 942 880 897 913 930 946 962 978 1006 1033 1037 1041 999 957 994 1031 1070 1108 1123
-111 1123 1138 1191 1244 1273 1302 1221 1139 1081 1023 984 945 985 1026 1085 1144 1093 1042 1056 1070 1085 1099 1025 951 877 803 857 911 989 1067 1104 1141 1099 1057 1041
-115 1041 1024 1055 1086 1126 1166 1205 1245 1187 1130 1151 1172 1175 1177 1131 1086 1051 1016 957 898 915 932 996 1060 1117 1175 1123 1070 1020 970 999 1028 1018 1008 1021 1035
-119 1035 1022 1009 1019 1030 1080 1131 1102 1073 1027 981 1039 1097 1102 1012 926 886 870 854 840 827 870 912 955 997 1059 1121 1105 1088 1097 1106 1036 966 943 919 944 968
-123 968 1044 1120 1172 1225 1179 1133 1087 1042 1032 1022 1013 1003 931 858 840 916 1030 1096 1085 1074 1043 1011 980 949 942 935 883 832 861 938 965 898 802 754 757 808
-128 808 893 979 991 1004 994 1031 1077 1028 974 1014 1105 1197 1166 1135 1128 1120 1125 1130 1055 981 988 995 1026 1057 1033 1010 1010 1010 1053 1095 1090 1085 1064 1043 1037 1078 1126 1079 952 825
-133 825 806 882 937 897 879 909 929 950 987 1024 1038 1051 1004 958 958 959 1032 1105 1152 1105 1082 1059 1078 1097 1066 1035 963 891 842 889 1019 1101 1066 1030 1039 1048
-137 1048 1030 1012 995 977 917 857 907 958 995 1032 1021 1011 986 962 960 1054 1156 1211 1186 1114 1080 1093 1077 1061 1063 1066 1068 1070 1056 1043 1108 1173 1209 1245 1171 1097
-141 1097 1062 1028 1042 1055 1043 1031 1020 1008 972 937 946 954 951 900 822 840 938 1036 1032 1028 1040 1100 1141 1088 1057 1073 1088 1057 1030 1098 1210 1227 1149 1072 1068 1063 1052
-146 1052 1042 1031 1020 1000 981 1040 1099 1047 995 990 985 943 902 908 914 907 899 892 885 924 963 1002 1041 1060 1079 1099 1118 1074 1031 1031 1032 967 856 822 882 963 949 883 818
-151 818 850 883 915 948 924 900 927 1050 1142 1140 1092 1091 1155 1219 1176 1086 1009 1027 1068 1109 1101 1094 1039 984 980 976 972 969 980 991 1049 1108 1103 1099 990 881 872 957 1016
-156 1016 1027 1022 1017 1008 1000 974 948 969 990 1030 1069 1061 1053 1022 991 961 930 865 801 847 894 918 942 1014 1086 1090 1094 1098 1101 1106 1111 1163 1215 1219 1223 1180 1136 1068 1000 979 958
-161 958 973 987 1002 1017 1015 1013 1011 1009 1019 1029 1039 1049 1105 1161 1170 1179 1126 1074 1021 969 951 933 962 992 925 859 818 872 940 1008 1035 1061 1089 1117 1035 906 831
-165 831 851 920 942 951 961 967 974 956 938 1024 1111 1128 1051 953 903 894 885 926 967 966 965 964 963 1019 1075 1083 1092 1097 1101 1106 1110 1108 1106 1081 1055 1016 976 984 992 1031 1069 1131 1194 1221
-170 1221 1248 1228 1208 1194 1180 1119 1058 1054 1050 1093 1137 1124 1111 1122 1133 1115 1097 1055 1014 1013 1012 1012 1011 1032 1054 1052 1050 996 942 935 928 934 939 897 855 846 838 807 775 713 650
-175 650 762 873 946 1019 1014 1008 990 971 1026 1080 1120 1065 989 960 981 1002 979 909 837 860 904 900 833 813 875 936 926 915 983 1098 1132 1072 1039 1053 1049
-180 1049 998 952 907 906 905 952 999 988 977 980 1031 1027 929 833 832 974 1116 1207 1203 1154 1106 1131 1156 1198 1241 1235 1230 1164 1098 1007 917 921 924 927 930 944 958 972 986
-185 986 1002 1018 986 955 964 973 903 833 734 634 592 644 755 866 936 1005 991 977 943 908 923 985 1074 1068 997 927 929 932 954 976 998 1019 991 962 980 999
-189 999 1047 1095 1119 1143 1177 1211 1242 1273 1193 1065 987 1004 1036 1021 986 997 1049 1053 1034 1062 1130 1152 1060 969 969 970 1012 1054 1121 1094 1010 925 981 1037 1045 1054 1033
-193 1033 1013 993 973 965 957 997 1037 1009 981 930 878 891 904 870 836 874 912 927 941 950 958 943 927 959 990 1043 1095 1045 947 899 945 1002 1011 1006 1000 990 980 923
-198 923 865 912 959 959 959 933 906 927 948 1007 1065 1045 1024 1057 1089 1169 1249 1246 1243 1192 1142 1128 1114 1053 991 989 987 985 983 992 1001 1010 1019 1017 1014 1011 1008 1007 1007 1006 1005 1003 1001 952 903 922
-204 922 942 961 980 953 926 899 872 899 925 952 979 926 872 798 770 830 969 1090 1164 1152 1094 1012 930 957 983 1010 1037 1018 998 979 959 959 958 958 957 945
-208 945 932 920 908 897 887 877 866 894 922 951 979 1061 1144 1192 1161 1123 1085 1042 999 972 945 966 986 1012 1039 991 943 928 991 1058 1045 983 969 1002 1035
-212 1035 988 942 974 1007 1032 1058 1083 1109 1124 1140 1108 1077 1052 1027 1002 977 973 968 964 959 931 902 985 1067 1104 1140 1098 1056 1045 1034 1023 1013 1010 1008 1006 1003 965 928
-217 928 937 947 940 933 974 1015 981 947 912 878 880 881 883 885 827 769 822 875 881 887 941 994 969 943 918 892 891 889 888 887 906 925 897 869 902 935 967 1000 973 945 965
-222 965 985 1026 1067 1061 1054 1016 978 893 808 843 878 834 789 817 845 952 1059 1095 1132 1168 1204 1229 1253 1230 1208 1183 1159 1135 1111 1114 1117 1121 1124 1066 1008 997 986
-227 986 1041 1096 1072 1049 996 943 969 995 1026 1056 1040 1024 1024 1025 1026 1027 1033 1040 1047 1054 1079 1104 1082 1059 1004 950 895 840 879 919 958 998 1063 1128 1051 974 899 823 827
-231 827 831 911 991 992 945 929 991 1077 1116 1078 993 931 948 1030 1065 1052 1040 1049 1058 993 928 958 1067 1156 1197 1166 1088 1033 979 1007 1035 1016 997 1024 1051 1079
-236 1079 1106 1126 1146 1165 1185 1173 1160 1100 1040 1041 1043 1045 1046 980 913 957 1049 1057 986 918 929 969 1010 1008 1006 1041 1076 1111 1146 1174 1202 1151 1100 1059 1017 1023 1029 1001 972
-241 972 944 915 970 1025 1033 1041 997 953 957 961 956 951 946 941 963 986 933 879 904 975 1064 1075 1051 1028 1000 972 914 856 909 962 1055 1148 1131 1114 1122 1130 1091 1052 988 923
-245 923 969 1015 1135 1255 1250 1167 1081 1075 1066 1058 1079 1100 1168 1236 1170 1103 1036 969 940 910 928 946 949 953 956 959 988 1018 1047 1077 1066 1055 997 938 923 908 892 877
-250 877 881 886 893 900 944 1036 1069 1023 985 995 1002 963 923 931 989 1046 1071 1096 1121 1145 1144 1143 1127 1062 1008 1033 1105 1098 1042 1034 1099 1118 998 878 850 901 943 938 961
-255 961 984 970 909 877 924 961 998 961 924 934 944 955 965 960 955 950 946 1005 1064 1045 1025 1019 1013 1007 1001 1023 1044 1066 1088 1094 1101 1186 1272 1222 1173 1171 1168 1109 1050 1039 1027
-260 1027 1027 1028 1028 1028 1011 994 976 959 1012 1065 1070 1076 1095 1114 1134 1153 1148 1142 1090 1037 1001 966 978 989 981 972 1010 1049 1053 1058 1062 1066 1103 1140 1098 1057 962 867 852 836 884
-265 884 933 981 1030 970 909 960 1010 1034 1058 1003 948 940 932 972 1011 1039 1067 1095 1122 1099 1075 1052 1028 1025 1021 1017 1013 1010 1006 1003 1000 939 878 954 1029 1038 952 910 963 1044
-270 1044 1078 1034 990 956 921 962 1003 988 925 909 988 1042 1002 916 876 902 928 957 986 1039 1093 1099 1105 1113 1122 1082 1043 1016 989 961 934 903 871 950 1075 1163
-274 1163 1156 1095 1034 1018 1002 986 970 997 1024 1051 1079 1073 1068 1015 962 1001 1041 1080 1119 1073 1026 1027 1028 1004 980 998 1016 998 885 820 849 922 994 931 867 851
-279 851 835 897 960 1031 1103 1127 1151 1090 1028 1014 999 996 992 989 986 1018 1050 1003 956 949 942 935 928 975 1022 959 895 886 877 826 775 734 788 836 884 880 875 919 962 1036 1109
-284 1109 1136 1162 1115 1069 1022 975 989 1004 1018 1033 1054 1075 1102 1034 966 899 904 909 928 947 966 985 979 974 1015 1057 1087 1117 1100 1082 1076 1069 1063 1057 970 884 887 984 1031
-288 1031 1078 1084 1090 1076 1062 1001 940 889 838 866 894 926 959 1033 1107 1077 953 876 893 923 953 989 1025 1024 1022 973 924 1001 1078 1149 1220 1265 1216 1109 1002
-293 1002 997 993 988 983 995 1007 972 936 978 1021 1016 1011 931 851 821 791 859 975 1041 1013 953 940 999 1059 1115 1077 1045 1013 1008 1002 950 897 941 985 1028 1072 1063 1054 1044
-297 1044 1035 1030 1024 915 805 816 921 1026 1037 1026 1016 1046 1077 1079 1082 1011 940 960 1074 1144 1119 1051 1030 1087 1145 1116 1088 1059 1031 1016 1001 1063 1124 1122 1072
-302 1072 993 1008 1063 1070 1029 941 884 875 916 956 1002 1048 1194 1292 1270 1152 1079 1101 1170 1239 1264 1289 1242 1149 1076 1097 1170 1243 1212 1180 1151 1122 1093 1064
-306 1064 1072 1079 1086 1094 1106 1119 1131 1143 1066 988 1022 1055 1058 1061 1064 1068 1082 1096 1031 967 972 977 1030 1082 1044 1006 968 930 911 893 874 856 886 917 901 884 887 890 940 991
-311 991 977 963 949 935 1008 1080 1048 1015 968 1016 1058 1099 1087 1074 1109 1144 1185 1226 1219 1212 1154 1095 1084 1072 1085 1099 1065 1030 1027 1023 1072 1027 930 832 871 910 941
-315 941 973 957 941 924 907 890 874 832 790 799 903 1039 1081 1015 948 904 954 999 1043 1059 1075 1091 1107 1027 947 950 1047 1135 1129 1072 1014 1079 1144 1215 1191
-319 1191 1120 1050 974 897 808 719 678 636 721 807 893 978 968 958 947 937 945 952 912 872 889 907 971 1035 1026 1016 1007 997 1068 1139 1118 1017 952 966 1036 1059
-324 1059 1040 1022 1048 1074 1087 1100 1034 968 971 973 976 978 1022 1066 1063 1059 1061 1062 1063 1064 1051 1037 1068 1099 1066 986 931 955 1011 988 907 826 840 902 937 893 837 828 866 904
-329 904 871 838 852 866 878 891 903 915 957 998 1040 1081 1074 1067 1013 958 967 976 984 993 952 911 918 924 962 1000 1037 1075 1070 1066 1013 961 953 945 984 1024 1021 1019 1017 1015 1029 1043 1057
-334 1057 1071 1049 1028 1006 985 971 957 943 929 952 974 920 818 761 814 907 953 920 886 897 907 936 965 993 1022 1071 1119 1088 1058 1053 1047 1042 1037 983 929 923
-338 923 916 947 978 1050 1122 1155 1093 1054 1063 1111 1111 1062 1013 1048 1084 1120 1155 1155 1155 1155 1155 1116 1078 1039 1000 1034 1069 1055 1042 1041 1040 1038 1037 1034 1031 981 931 877 824 821 819 874
-344 874 976 1061 1051 966 928 1000 1072 1115 1158 1154 1150 1097 1045 992 939 892 845 908 971 1007 1044 1080 1117 1082 1047 1012 977 972 967 914 862 844 826 855 884 862
-348 862 840 864 936 979 928 876 919 979 991 957 923 921 919 917 915 931 946 962 978 1044 1111 1099 1086 1052 1017 979 941 934 881 800 815 878 942 901 860 893 926
-352 926 958 991 1012 1032 942 853 877 901 925 949 980 1010 987 871 825 858 890 843 792 819 877 934 924 914 886 857 841 905 997 1043 1039 1034 1051 1068 1064 1060
-357 1060 983 905 878 929 1015 1101 1104 1106 1061 1016 1086 1157 1182 1097 944 838 814 837 896 954 968 982 1001 1020 1007 915 835 802 817 831 861 891 877 863
-361 863 856 896 957 939 867 843 835 827 816 805 900 994 1006 939 893 846 861 876 915 954 944 934 1004 1073 1027 981 982 1031 1007 905 862 930 1056 1103 1092 1080
-365 1080 1103 1125 1069 1013 1010 1007 1051 1096 1067 1038 1057 1076 1107 1138 1121 1105 1064 1023 1029 1035 1031 1026 1022 1017 1052 1086 1097 1108 1111 1115 1040 965 974 984 1040 1097 1108 1119 1024 929
-370 929 927 1004 1064 1076 1063 1050 1035 1019 1000 982 963 945 922 900 925 951 999 1046 1047 1047 1099 1151 1124 1096 1078 1060 1041 1023 971 919 914 909 982 1054 1050 1046 1022 1045
-375 1045 1089 1054 973 939 984 1028 983 938 893 848 841 834 851 867 974 1081 1124 1089 1037 1033 1071 1061 1003 945 995 1044 1052 1060 1021 982 936 890 892 894 945 996 1023
-380 1023 1050 1068 1087 1081 1076 1068 1059 1051 1043 1047 1051 1009 966 943 919 901 883 857 910 1025 1092 1096 1100 1102 1103 1081 1058 1060 1061 1055 1049 996 942 917 893 979 1064 1079 1094 1061 1029 1072
-385 1072 1115 1079 1043 970 898 873 847 893 939 984 1030 1051 1072 1093 1114 1082 1051 1020 988 979 969 1004 1039 1008 930 909 966 996 948 905 940 1011 1082 1048 1013
-389 1013 1018 1023 981 891 850 887 925 963 1008 1054 1021 940 884 908 961 966 957 995 1034 1024 985 992 1049 1106 1089 1071 1054 1037 1024 1012 1046 1081 1053 1026 1046 1065 1020
-393 1020 975 978 980 971 961 952 942 973 1004 1035 1066 1038 1009 997 1032 1050 988 927 945 993 994 916 838 842 846 853 861 856 899 962 947 886 872 937 1002 991 980 922 864
-398 864 879 894 909 925 962 998 1035 1072 1028 984 1018 1053 1050 1047 1044 1041 1091 1140 1111 1081 1017 953 996 1040 1016 945 892 934 1004 1027 1035 1043 1053 1064 1074 1084 1109 1134
-403 1134 1114 1095 1106 1164 1204 1150 1091 1080 1066 1005 934 911 938 964 919 875 940 1006 986 966 993 1067 1105 1048 1022 1042 1029 1016 1006 996 995 993 1040 1086 1089 1092
-407 1092 1063 1081 1054 932 819 864 977 994 965 936 987 1038 1011 984 993 1003 966 928 912 896 886 877 894 1007 1120 1138 1056 974 966 957 945 934 922 911
-411 911 948 986 1024 1062 1116 1171 1121 1071 1047 1117 1188 1164 1110 1057 1045 1033 971 909 894 879 881 883 837 791 776 761 793 826 845 864 883 902 947 993 991 989 949
-416 949 909 917 924 916 909 901 894 941 988 957 925 866 806 826 845 897 948 1000 1051 963 876 835 795 835 874 866 858 836 813 869 925 934 944 953 962 937 913 936 959 1023
-421 1023 1086 1150 1214 1164 1114 1017 920 955 990 1072 1154 1113 1073 985 897 893 889 933 976 975 974 972 971 1000 1028 1009 991 950 909 869 828 828 828 875 922 981 1039 1051
-425 1051 1062 1041 1020 999 978 991 1003 1016 1028 925 821 859 897 946 995 1044 1093 1083 1072 1062 1051 1082 1113 1065 1018 1038 1059 1032 1005 994 983 1051 1118
-430 1118 1148 1178 1128 1079 1010 941 919 897 953 1009 954 900 895 891 934 977 1001 1025 1050 1074 1016 957 899 841 883 926 921 916 965 1013 1014 1015 1034 1052 1070 1088 1057
-434 1057 1026 1042 1058 999 941 882 823 806 789 851 912 920 927 935 942 981 1020 1059 1098 1180 1262 1201 1141 1098 1056 1061 1065 1023 981 939 897 910 924 1042 1161 1169 1098
-439 1098 1024 1029 1051 1025 952 879 927 975 1023 1070 1046 1022 951 879 889 900 863 825 827 828 830 831 857 882 955 1028 1067 1105 1096 1087 1072 1058 932 807 745 683 703
-443 703 723 794 914 1003 1014 1013 1012 1005 999 994 988 982 976 931 885 919 953 953 953 1033 1112 1100 1089 1030 971 931 891 931 970 1024 1079 1055 1031 975 918 969 1020 994 920
-448 920 876 912 963 1015 1025 1034 1075 1115 1076 1037 982 927 875 823 882 989 1075 1066 1044 1023 995 967 957 946 935 924 913 901 890 879 812 746 821 897 949
-452 949 1001 1006 1011 1028 1046 1063 1081 1076 1072 1020 968 954 941 886 831 810 884 1007 1083 1048 966 931 990 1101 1166 1120 1075 1049 1024 1001 979 982 1033 1066 1005 937
-457 937 917 975 1032 1026 1020 1014 1008 975 942 954 966 951 888 873 951 1054 1061 986 911 919 927 936 944 932 921 924 975 1050 1030 956 882 927 971 1016 1060 1061 1061 1056 1051 1087 1028
-462 1028 917 854 864 873 886 899 917 936 954 973 1014 1055 959 864 872 975 999 928 868 807 788 769 786 803 772 741 770 800 787 775 795 909 1023
-466 1023 1043 1020 997 968 939 940 941 989 1037 1082 1127 1124 1121 1094 1067 1039 1012 1050 1087 1077 1068 1040 1012 985 957 894 831 878 926 957 989 1021 1052 982 912 889 867
-470 867 905 943 982 1020 1029 1038 1000 961 988 1015 969 922 920 1012 1104 1101 1118 1134 1144 1154 1166 1178 1190 1202 1105 1008 910 813 836 860 896 837 812 882 998 1113
-475 1113 1086 964 889 909 962 1015 1027 1039 1057 1074 1013 951 930 909 967 1025 1027 1029 1030 1032 1003 974 945 916 943 969 995 1021 1055 1088 1073 1059 1048 1036 1024 1012
-479 1012 956 900 894 888 922 1003 1066 1035 982 977 1019 1060 1020 980 945 911 896 976 1076 1130 1101 1072 1119 1212 1264 1220 1154 1088 1044 1001 1030 1060 1072 989 891
-483 891 841 853 959 1069 1084 1022 960 940 919 953 986 1019 1053 1030 1007 984 961 969 977 983 988 978 920 835 845 927 1009 1018 1026 989 951 914 876 926 977 1027 1077
-488 1077 1032 986 1020 1053 1052 1050 1048 1046 1043 1039 1035 1031 1021 1010 921 786 712 733 839 946 982 1018 1054 1090 1075 1061 1047 1032 1020 1008 996 984 976 968 1001 1035 1036 943
-492 943 804 712 701 785 865 946 938 931 920 910 906 855 778 795 857 920 846 772 787 802 818 833 907 981 1009 1036 1073 1109 1099 1089 1107 1126 1145 1163 1139 1114
-497 1114 1089 1064 1074 1083 1073 968 860 847 885 923 911 898 933 969 959 950 941 931 993 1055 1091 1033 959 885 915 945 969 992 1016 1039 1070 1100 1130 1161 1121
-501 1121 1082 1043 1003 935 866 844 822 913 1003 1099 1100 994 888 855 822 839 857 875 892 915 937 960 982 965 947 983 924 839 753 804 855 907 960 1012
-505 1012 1064 1019 974 976 978 974 970 1007 1044 1022 906 858 969 1052 1040 949 858 891 925 958 992 992 992 992 992 992 993 993 993 997 1000 1004 1008 992 976 960 944 928 912 896 880
-510 880 947 1015 971 928 935 941 971 1001 1034 1068 1054 1040 1034 1028 974 920 883 846 887 929 930 931 956 981 1022 1064 1105 1146 1062 978 920 956 983 1011 997 983 982 982 1023
-515 1023 1064 1055 951 847 838 888 937 914 891 884 877 911 946 949 858 743 723 822 921 937 858 810 762 787 812 843 874 905 936 957 978 998 1019 995 970
-519 970 922 875 928 980 923 865 882 898 891 884 877 871 864 858 856 855 933 1011 1010 1009 1008 1007 1015 1023 1078 1134 1070 1007 991 975 1029 1083 1090 1096 1085 1074 1062 1051 1042 1032 1023 1014 948 883
-525 883 897 911 953 995 990 985 1013 1041 990 940 906 873 887 902 870 839 856 872 864 856 895 934 962 990 993 997 1024 1051 1078 1105 1043 981 970 1054 1139 1130 1102 1073
-529 1073 1025 977 929 880 946 1011 1082 1059 1016 974 1037 1099 1082 1066 1002 938 925 912 946 981 1000 1020 992 964 969 974 980 985 974 963 952 941 957 972 964 955 1020
-534 1020 1084 1065 952 871 885 919 953 940 926 912 899 946 994 1041 1088 1094 1099 1129 1158 1071 984 1008 1032 1023 1015 982 950 988 1026 985 944 901 858 919 981 1011
-538 1011 946 888 829 837 844 804 765 820 876 932 988 999 1010 1021 1032 1017 1002 1010 1019 1026 1033 993 953 913 874 913 952 879 805 815 919 1006 998 997 995 1002 914 826 833
-543 833 927 1021 1042 1063 1032 1001 1017 1033 979 925 891 951 1032 1019 954 889 882 875 868 861 877 892 860 829 809 789 817 844 854 864 827 789 848 907 919 930 906
-548 906 882 906 929 880 830 828 826 886 946 959 972 942 911 881 851 921 992 983 975 1004 1033 1062 1091 1100 1109 1046 982 973 1059 1091 1124 1114 1104 1094 1084 1026 968 910
-552 910 851 879 907 934 962 914 865 864 863 836 808 780 753 774 795 815 836 864 892 920 948 895 842 900 958 1004 1051 1019 987 924 862 909 957 954 952 949 947 915
-557 915 883 804 724 728 732 783 834 884 935 985 1036 1062 1088 1066 1045 1051 1057 1016 975 902 830 867 905 986 1067 1069 1071 1095 1118 1095 1071 986 900 863 825 849 873 897
-561 897 921 996 1070 1034 997 1001 1006 962 919 961 1002 965 928 886 844 849 854 886 918 950 982 971 960 949 937 911 885 938 991 980 969 957 946 962 979 995 1011
-566 1011 1025 1040 1007 974 921 869 927 985 997 1010 943 877 922 967 933 899 842 785 839 893 926 958 991 1024 1048 1072 985 899 927 955 936 917 937 957
-570 957 977 998 963 929 894 860 876 893 910 927 948 968 989 1010 990 970 903 836 876 916 956 996 974 952 930 908 906 904 961 924 858 886 992 1098 1083
-574 1083 973 917 861 863 865 914 964 1060 1156 1164 1077 996 916 940 964 927 890 854 817 822 828 912 996 1027 1057 1040 1023 1073 1123 1094 1065 982 900 865 831 859
-579 859 887 868 849 792 735 819 904 963 1021 1000 980 905 830 756 681 742 804 865 927 904 882 907 932 930 929 927 925 961 997 1032 1068 1068 1068 1068 1068 1020 973 926 878
-584 878 903 927 952 976 942 907 951 996 1005 1013 1022 1031 1034 1037 993 948 974 1000 978 956 969 982 947 913 958 1004 1049 1095 1100 1106 1065 1023 999 976 952 928 943 958 1021
-588 1021 1084 1065 1047 1029 1010 1012 1013 967 922 884 846 918 991 979 968 956 945 967 989 964 938 937 937 936 935 1007 1078 1092 1012 937 863 893 923 900 877 848 914
-593 914 970 1027 978 930 912 893 875 857 832 808 783 759 756 754 798 843 879 916 905 894 869 844 820 795 825 856 886 917 959 1001 1044 1086 1062 1037 1013 989
-597 989 1014 1039 953 868 777 687 707 727 843 958 1027 1095 1027 960 892 824 875 926 872 818 841 959 1077 1100 1061 1022 977 932 953 973 993 1014 954
-601 954 895 914 933 964 996 1027 1058 1068 1077 1134 1191 1175 1160 1144 1129 1083 1037 1038 1040 1097 1153 1106 1058 1023 1083 1143 1108 991 875 863 851 888 926 963 1000
-606 1000 982 963 903 843 823 898 1021 1049 959 869 856 938 1020 1007 975 942 973 1003 987 970 966 962 958 954 900 846 839 833 874 916 879 842 850 858 914 969 981 993
-610 993 958 923 928 934 892 850 839 827 895 963 975 988 1000 1013 1074 1135 1170 1111 1015 919 897 874 919 965 1010 1055 1040 1025 931 837 805 773 821 868 940 1012
-615 1012 1005 998 1019 1040 1014 987 941 894 894 895 913 930 947 965 932 899 913 928 954 980 959 938 881 823 766 709 760 812 863 914 947 980 971 962 923 978 1059
-619 1059 1140 1129 1118 1060 1002 934 865 876 887 858 828 846 864 822 780 785 790 803 816 829 842 845 848 851 854 886 918 839 761 770 779 867 955 1012 1070 1048 1026 1016
-624 1016 1005 994 984 988 992 949 906 914 922 931 939 958 978 950 922 913 905 897 888 996 1103 1154 1109 1045 981 990 999 961 924 887 850 818 787 803 819 820 821 822 824 853 881
-629 881 910 939 885 831 856 881 913 945 976 1008 943 878 813 748 786 824 863 901 884 868 803 739 753 767 780 794 797 800 803 806 783 761 880 999 1068 1137
-633 1137 1128 1118 1011 905 824 838 920 1003 1066 1035 926 818 818 913 969 931 874 816 863 910 937 869 851 927 1023 1119 1071 1022 973 924 851 779 785 791
-637 791 771 751 788 919 1023 1127 1094 1062 968 875 807 834 914 994 1032 1071 1006 941 876 811 804 797 837 877 874 871 868 864 934 1004 1048 998 965 932 893 855
-642 855 792 729 714 698 705 712 799 885 879 873 915 957 901 845 846 942 957 972 992 1013 1071 1130 1182 1234 1193 1057 968 974 1006 1039 1030 1021 1001 982 1009 1037 1025 1014
-646 1014 923 832 816 799 862 924 911 897 931 965 948 931 914 898 904 910 915 921 937 953 969 986 919 852 864 876 920 964 960 957 899 841 831 820 841 863 884
-651 884 905 883 860 885 911 924 937 951 964 973 983 1008 1080 1115 1071 1027 984 964 945 1005 1064 1124 1184 1133 1083 993 902 844 864 907 902 879 936 1036 1058
-655 1058 1019 980 946 913 880 847 931 1016 1021 1026 960 894 860 904 949 947 900 900 932 917 829 788 855 970 1026 1003 977 951 921 890 925 959 946 933 921 908
-660 908 896 883 878 874 869 864 815 767 797 827 857 887 838 789 804 820 836 851 843 834 825 816 804 793 782 771 792 814 835 856 866 875 838 800 767 734 780 826 883
-664 883 939 922 904 899 972 1089 1128 1070 965 930 894 879 865 928 1038 1120 1091 1016 942 910 878 846 814 842 869 897 925 955 985 967 950 966 982 925
-669 925 867 856 924 992 981 877 773 712 650 705 760 863 965 971 976 981 986 1010 1034 953 871 886 979 1028 998 931 912 941 969 966 963 881 752 688 703
-673 703 781 859 883 906 977 1048 1083 1117 1104 1091 1080 1069 1057 1046 1029 1012 995 978 968 959 908 856 891 1006 1075 1066 1056 1093 1147 1121 1047 1020 1042 1112 1156
-677 1156 1153 1100 1000 895 869 906 943 948 952 1003 1055 1014 974 934 894 928 962 1039 1115 1163 1132 1067 1002 958 915 875 834 840 892 962 953 875 796 823 849 878
-682 878 907 935 964 965 966 920 874 838 803 878 953 1035 1118 1121 1124 1015 906 907 909 941 973 958 942 964 985 1006 1027 966 905 891 877 857 837 770 703 771 839
-686 839 907 976 969 962 956 949 983 1017 972 926 1000 1073 1036 999 969 940 911 881 920 959 950 942 878 815 830 846 900 954 961 968 970 972 974 977 1023 1070 1006 942 890 837 864
-691 864 890 888 886 884 881 877 873 916 959 1002 1045 1040 1036 1077 1119 1160 1201 1154 1107 1059 1012 944 876 887 898 959 1021 1035 1049 1078 1107 1025 944 914 885 903 921 934 946
-696 946 958 970 981 993 957 920 898 876 932 989 1020 1051 1003 955 884 813 820 828 816 804 840 875 821 767 792 817 854 892 927 961 944 878 834 884 945 1006
-700 1006 1026 1046 1037 1028 1019 1009 974 938 950 961 921 882 889 896 944 992 961 930 942 953 964 975 996 1018 1039 1060 967 875 830 785 831 877 922 968 976 984 919 854
-705 854 863 967 998 934 848 856 948 1039 1040 1040 1117 1194 1158 1075 1041 1102 1105 1061 1021 1027 1049 1023 953 931 988 1045 1054 968 867 861 903 944 885 778 749 814 891
-709 891 873 840 855 871 886 905 923 948 973 997 1022 990 958 927 895 889 883 799 714 754 793 833 873 892 912 884 857 812 768 771 774 862 950 959 968 941 915 936
-714 936 957 991 1025 1012 952 893 927 980 985 885 784 767 844 936 982 981 980 952 924 896 868 904 941 978 1015 997 979 888 796 794 886 981 982 918 902 932
-718 932 962 923 884 845 806 819 832 845 858 856 854 900 945 927 910 892 874 895 915 936 957 945 932 920 908 915 922 930 937 961 984 1008 1031 1011 992 972 952 962
-723 962 972 982 993 959 926 893 860 868 877 885 893 955 1017 1000 982 1008 1035 1013 992 981 970 1034 1099 1071 996 967 1033 1089 1051 993 934 962 990 1018 1046 1060 1075
-728 1075 1089 1103 1052 1002 998 995 976 957 938 918 948 977 870 763 750 831 965 1052 1075 1098 1119 1139 1101 1062 982 901 867 927 933 940 916 892 915 939 906
-732 906 873 918 964 911 859 825 887 1003 1023 993 962 930 899 867 836 850 863 956 1049 1114 1180 1166 1152 1114 1076 1037 999 1031 1062 1047 1031 1037 1044 1009 974
-736 974 950 1020 1091 1066 1042 1017 1033 1050 988 927 944 962 902 842 802 857 937 923 857 791 790 789 835 881 879 876 874 872 867 862 931 999 1062 1031 974 917 958 999 929
-741 929 859 832 804 783 762 815 963 1100 1078 969 859 851 842 780 718 767 815 797 778 753 824 931 1038 983 929 890 945 995 1045 1010 974 1043 1113
-745 1113 1148 1089 1004 919 870 821 819 817 823 829 882 935 903 871 917 1011 1058 1012 962 1007 1101 1101 1049 997 1018 1039 982 924 933 942 952 961 904 847 869 891 940 990
-750 990 961 931 998 1066 1107 1054 952 850 831 906 987 1067 1074 1082 1032 983 933 884 865 846 827 808 825 842 860 877 906 935 916 898 846 795 823 850 874
-754 874 898 874 850 886 921 910 898 942 987 952 917 922 926 930 934 896 858 898 939 1001 1062 1044 1027 1079 1130 1182 1233 1207 1180 1154 1127 1040 952 943 934 890 845 848
-759 848 850 933 1015 1050 1086 1058 1031 1003 976 946 917 935 953 996 1039 1082 1125 1069 1014 958 903 948 994 992 990 987 984 982 979 992 1006 1019 1033 1003 973 943 913 964
-763 964 1015 1066 1116 1100 1084 1020 957 966 975 940 905 883 909 887 771 668 659 791 922 975 934 919 952 953 954 958 961 965 969 973 977 984 991 999 1006 1010 1013 969 925 891 856
-768 856 844 926 1009 1044 1002 959 934 909 884 859 856 853 955 1056 1099 1047 1022 1044 1071 1097 1079 1061 1041 1021 1043 1064 1099 1038 957 924 994 1064 1059 1053 1058 1063 989
-773 989 915 861 806 757 708 726 838 953 973 961 997 1056 1020 960 947 976 957 861 765 807 897 936 880 834 787 768 750 779 807 826 845 911 978 994
-777 994 1010 1068 1126 1143 1082 1017 1031 1062 1047 1031 1063 1083 1024 938 900 910 919 857 796 806 895 985 995 929 863 871 879 914 950 985 1021 985 948 990 1033 1066
-781 1066 1100 1023 946 851 756 804 851 866 881 895 910 916 921 848 775 818 861 905 948 942 936 1008 1081 1055 1029 1004 978 966 954 895 836 777 718 770 822 869
-786 869 917 933 996 1027 979 931 961 1021 1034 1031 1028 1057 1087 1037 987 956 925 894 863 916 969 975 980 1012 1044 998 951 916 881 893 906 931 956 934 912 912 913 913
-790 913 914 951 989 921 853 844 914 984 975 937 899 904 909 960 1011 1014 1018 982 945 956 967 925 884 842 801 799 797 874 951 1013 1075 1027 979 999 1019 960 901 863 825
-795 825 866 907 941 974 1008 1042 1041 1039 1037 1036 1005 974 990 1007 1008 1010 1012 1013 970 927 884 840 843 847 802 758 795 832 870 907 943 979 968 957 929 901 921 941 932 923 961
-800 961 999 1000 1000 1000 1000 952 904 935 966 1000 1035 959 883 909 936 962 989 986 984 981 978 964 949 934 920 912 905 897 889 826 764 811 859 887 916 865 815 853 892 851 810
-805 810 778 745 791 838 905 971 1038 1105 1049 994 985 977 980 983 986 990 1005 1021 958 895 875 855 836 816 793 770 826 882 908 934 960 987 962 937 960 983 948 914
-810 914 879 845 884 924 1036 1148 1212 1182 1094 1006 941 877 859 842 864 886 861 836 840 845 897 950 972 995 907 819 747 675 681 688 787 885 905 924 951 977
-814 977 1003 1029 991 953 915 877 842 806 771 735 783 830 877 925 926 927 928 930 947 965 983 1001 958 916 952 988 1050 1113 1071 1029 1001 1067 1127 1187 1153 1118 1037
-819 1037 955 955 956 1030 1103 1119 1039 987 982 1007 1033 1062 1090 1109 1128 1074 1019 1055 1185 1268 1256 1114 972 850 822 854 886 876 867 884 901 918 935 892
-823 892 849 884 966 1042 1023 982 941 950 959 920 881 833 785 815 845 927 1009 980 951 957 962 968 974 953 933 960 987 979 971 909 942 1035 1129 1092 1055 1027 1094 1161 1133
-828 1133 1093 1054 1008 963 923 884 892 900 898 897 854 811 839 962 1012 967 896 920 963 1007 1020 1033 1099 1070 983 896 913 931 942 954 965 977 907 837 846 856
-832 856 853 850 848 845 908 970 985 1000 967 934 901 868 853 839 824 810 820 830 888 945 949 953 957 960 932 903 874 845 899 952 1005 1058 1006 955 951 947 968 990 964 938
-837 938 917 897 876 855 826 796 814 832 869 906 896 885 830 775 772 863 942 927 923 919 985 1052 975 899 912 925 938 951 945 939 933 927 932 938 944 950 956 963 969 976 984 992 953
-842 953 914 859 804 796 788 802 815 829 843 852 860 869 878 884 891 850 810 752 694 693 787 919 1050 1099 1053 963 873 888 903 937 972 959 946 932 918 984 1049 1004
-847 1004 960 963 966 953 941 928 915 886 857 827 798 860 922 984 1046 1014 982 950 918 867 816 790 859 914 968 981 993 1020 1047 910 772 731 847 976
-851 976 1009 1009 1008 1002 996 954 912 917 923 877 830 784 738 821 904 961 923 874 825 849 872 895 918 941 963 964 965 919 873 862 851 888 924 917 910 903 896 864 833 801 769
-856 769 823 876 930 984 921 858 874 890 891 892 941 989 980 971 962 953 903 854 804 754 724 694 664 634 648 661 674 687 733 779 778 776 787 799 810 821 867 912 879
-861 879 846 794 743 770 797 871 944 939 933 921 909 897 885 832 779 774 768 790 812 882 951 909 867 824 782 742 702 709 716 721 727 759 871 1007 1033 952 871 850
-865 850 830 809 788 828 867 907 946 974 1001 1029 1057 1033 1009 985 961 959 958 957 956 942 928 962 996 973 949 926 902 869 836 881 927 943 959 976 992 1019 1046
-870 1046 995 943 910 878 892 907 950 993 957 922 906 890 874 858 875 892 910 927 920 912 857 803 812 822 832 842 895 948 954 960 977 995 1012 1029 1008 987 965
-874 965 944 920 897 873 849 827 804 828 853 858 863 868 873 869 865 861 857 838 820 801 783 786 789 840 890 963 1037 1062 1088 1061 1033 1006 979 943 907 872 836 817 799 827
-879 827 856 869 882 895 908 902 895 889 882 918 954 943 931 903 875 847 819 844 870 892 915 945 928 882 930 985 993 951 909 895 834 743 746 862 931 888 798
-884 798 768 786 774 762 827 892 903 820 783 794 820 846 887 928 922 916 921 927 980 1033 1050 1067 1037 1007 964 921 983 1044 1032 925 871 817 829 840 851 863
-888 863 857 852 799 746 760 774 788 802 833 864 848 832 780 728 787 845 845 845 845 845 872 900 880 860 914 968 1022 1076 1057 1038 1019 1000 957 913 942 972 1047 1028
-893 1028 958 888 919 1045 1128 1053 924 796 778 854 880 906 891 875 859 842 825 809 876 944 964 984 921 858 842 827 828 829 831 832 861 890 919 948 870
-897 870 792 740 782 817 853 847 841 851 862 826 789 793 797 801 805 860 915 923 931 930 929 975 1022 1013 1004 1042 1081 1009 937 916 990 1014 944 832 815 855 895 893 892 899 906 865
-902 865 825 828 831 882 932 976 1021 987 952 1003 1053 1024 996 932 867 882 897 932 968 956 944 938 932 926 920 968 1016 1017 1018 970 921 920 919 953 986 940 895 916 937 959
-907 959 980 990 1001 1011 1022 971 920 870 819 768 716 744 771 827 883 939 995 989 982 976 970 976 982 989 995 1022 1049 1076 1103 1139 1175 1100 1025 983 941 978 1015 1040 1064
-912 1064 1009 955 909 864 818 772 767 762 804 846 931 1016 1024 1033 1033 1080 1101 1043 980 964 966 889 789 768 839 910 913 915 918 920 905 890 875 860 813 766 797 829 863
-917 863 897 926 955 945 856 766 756 773 790 764 738 796 853 910 967 989 1010 984 958 899 840 782 723 754 785 816 847 884 921 1005 1090 1072 1055 991 926
-921 926 882 838 873 908 895 882 870 857 792 728 743 758 831 905 978 1052 1008 964 920 876 850 823 797 771 820 868 938 960 921 789 700 706 786 865 871
-925 871 877 867 856 845 834 810 787 842 897 1014 1131 1137 1144 1104 1065 953 841 773 799 878 909 923 937 947 958 928 898 948 997 990 983 976 969 989 1009 1030
-930 1030 1050 982 913 892 871 864 857 803 749 791 834 876 919 930 941 951 962 958 954 950 946 900 854 831 903 950 949 934 918 906 894 882 870 889 908 817 726 720
-934 720 714 709 703 739 774 810 845 861 876 850 824 752 775 856 936 925 915 904 893 910 927 897 866 876 886 896 906 921 936 998 1060 978 896 865 929 933 843
-939 843 812 781 812 843 874 905 964 1023 1002 982 968 954 987 1020 997 974 951 928 966 1003 1082 1161 1121 986 898 905 928 951 932 913 910 907 857 807 826 844
-943 844 904 965 934 809 731 747 825 903 939 976 1011 1047 1003 960 915 871 827 782 849 916 879 841 830 914 992 1071 1056 1041 954 866 778 785 817 850 812
-948 812 774 784 794 853 912 971 1031 999 968 936 905 857 810 841 873 925 977 982 987 949 911 914 917 903 794 726 753 849 851 769 688 772 856 865 873 911 996 1003
-952 1003 916 800 779 840 902 904 906 952 998 983 919 871 917 996 980 912 844 895 946 950 953 960 966 925 884 881 878 922 966 948 930 864 799 798 798 845 892 922 951
-957 951 902 853 888 923 911 899 912 925 914 904 897 891 888 885 869 901 962 928 874 867 905 895 858 869 960 1052 1027 1002 1024 1046 1019 993 990 988 992 995 920 845 884
-962 884 923 961 1000 970 940 909 879 919 958 919 879 851 823 819 814 840 866 891 917 892 866 840 815 849 883 896 909 963 1063 1083 1008 867 774 791 807
-966 807 805 803 848 893 933 973 902 832 800 768 783 799 817 835 854 872 837 802 846 890 891 892 894 895 820 745 812 878 878 878 854 829 797 764 732 699 664 629 673
-971 673 716 696 676 707 832 958 990 970 950 952 953 1002 1052 1062 1073 1036 999 915 830 822 814 811 760 724 783 895 911 876 841 829 816 851 885 909 932 932
-975 932 931 899 866 848 878 901 830 764 746 761 776 771 765 843 920 887 854 855 856 810 764 742 719 680 640 686 828 922 921 917 912 925 938 935 931 927 923 904 885 872
-980 872 859 841 917 1040 1069 1023 977 930 884 814 838 919 1000 999 997 1043 1089 1116 1143 1165 1186 1160 1039 916 887 919 903 846 837 884 930 980 1030 997 964
-984 964 931 898 942 986 919 852 828 804 827 850 872 893 867 841 804 768 811 853 849 844 839 835 852 870 887 905 861 817 793 864 948 936 907 926 969 964 915
-989 915 914 977 1039 1058 1076 1067 1057 969 881 902 922 870 817 831 939 1003 973 960 995 997 1000 987 975 962 950 981 1012 995 978 958 937 902 820 751 778 827
-993 827 876 871 867 863 859 875 892 908 925 950 976 922 869 873 878 885 893 866 886 933 885 840 796 792 789 814 838 862 887 876 864 900 936 939 941 944 946 887 828 849 869 859
-998 859 850 840 831 845 859 825 744 693 721 838 956 996 957 936 962 1031 1100 1061 1022 952 881 861 840 887 981 1046 1031 952 872 898 924 929 933 938 942 919 895
-1003 895 872 849 806 763 799 835 807 780 800 868 896 845 794 822 873 877 865 853 861 869 829 790 774 758 816 875 892 831 770 788 885 981 973 964 931 899 866
-1007 866 834 774 714 733 752 804 857 862 867 830 793 756 719 738 757 776 795 812 830 848 866 883 899 995 1091 1095 1100 1104 1109 1048 987 927 866 888 909 883 857
-1012 857 835 813 791 769 777 785 872 960 950 940 931 921 818 715 634 711 816 920 892 864 878 891 905 918 923 927 932 936 965 994 1022 1051 964 876 899 922
-1016 922 951 980 961 943 915 887 906 925 901 878 902 926 998 1071 1064 1057 1003 949 895 841 808 775 789 803 861 919 866 813 838 862 886 910 885 860 835
-1021 835 810 838 866 942 1018 1019 1021 975 929 878 826 822 818 816 815 861 907 992 1078 1021 965 933 902 917 933 920 908 895 882 920 959 918 878 876 874 825 775 845
-1025 845 915 906 897 915 933 951 968 982 995 961 928 942 957 1018 1080 1069 1059 1000 942 887 832 824 816 836 855 875 895 891 887 930 974 941 908 875 841 828 815
-1030 815 849 883 870 857 844 831 848 866 883 901 840 779 718 657 686 716 825 933 997 1062 1079 1096 1072 1048 1025 1001 962 922 930 937 954 970 987 1003
-1034 1003 967 931 895 858 884 910 889 867 843 820 796 772 724 675 737 800 824 849 827 804 791 777 763 750 759 768 825 881 911 941 971 1001 961 921 881
-1038 881 841 876 911 946 982 913 844 776 707 748 788 908 1028 1020 1012 1004 996 1003 1009 969 928 895 862 877 891 924 957 990 1023 1028 1033 990 948 881 814 794 774
-1043 774 869 963 979 994 998 1002 958 914 923 931 923 868 876 963 1047 1053 1009 966 964 963 865 766 775 783 780 729 704 759 866 926 938 950 975 1001 979 957 948 939 930 921 895 870
-1048 870 844 897 986 1028 959 890 905 920 935 950 964 978 947 917 846 823 865 987 1108 1151 1101 1051 990 930 873 816 850 932 956 901 854 855 903 951
-1052 951 923 894 865 837 881 926 923 920 923 926 977 1027 1005 983 960 938 912 886 907 928 939 950 961 972 933 894 902 910 945 980 905 830 749 669 731 840 911
-1057 911 903 896 888 893 898 903 908 934 959 985 1011 1009 1008 1049 1089 1120 1056 986 1011 1080 1053 981 955 1028 1100 1029 863 812 855 918 982 1014 1047 1032 1017 982 948 840
-1061 840 732 709 781 900 924 890 855 863 870 851 832 814 795 772 749 774 798 836 873 908 942 938 887 809 825 960 1095 1058 927 846 859 917 881
-1065 881 783 732 761 837 922 959 945 883 826 817 826 835 861 887 867 800 737 768 854 940 975 1009 996 984 964 945 973 1001 1008 1015 944 872 849 825 802 779 802
-1070 802 825 848 871 920 970 1019 1068 1025 981 891 800 816 832 896 960 971 982 920 859 824 885 918 905 907 909 908 907 876 845 815 784 780 776 724 673 699 725
-1074 725 751 777 789 800 812 823 829 835 842 848 881 913 1000 991 902 814 798 783 848 913 954 995 985 975 1043 1112 1065 1018 971 924 887 851 893 935 951 967 903
-1079 903 840 793 745 834 922 960 902 819 736 736 736 784 831 856 881 882 883 882 881 904 926 946 965 961 957 944 932 896 859 832 804 777 750 809 869 881 893 875
-1084 875 858 846 835 826 913 993 1073 1066 1059 1004 949 931 913 973 1034 1049 1063 1055 1046 1023 999 976 953 918 884 897 909 856 802 707 611 630 744 827 911 921
-1088 921 930 898 866 841 910 1026 1048 1007 966 997 1029 966 903 945 988 1008 950 888 827 777 728 757 786 836 886 936 986 976 965 954 944 921 898 899 900
-1092 900 925 949 926 904 914 924 910 897 889 882 898 914 887 860 880 901 929 956 905 854 828 802 775 749 748 747 826 904 891 879 866 853 884 915 898 882
-1097 882 856 831 805 780 853 927 1024 1122 1154 1186 1108 1029 958 887 895 903 905 907 908 910 933 956 932 861 836 890 971 1005 970 935 944 953 945 936 952 967 928 890 899 908
-1102 908 953 998 964 930 885 839 841 843 856 870 931 992 1021 1051 969 888 871 853 914 975 963 952 897 843 850 936 1048 1113 1070 980 887 841 782 723 718 807
-1106 807 882 862 796 777 786 795 807 818 852 885 871 857 918 978 1039 1099 1130 1161 1114 1019 928 932 985 990 918 846 849 899 892 791 693 689 830 971 1028 991
-1110 991 953 916 872 828 765 701 743 784 799 720 667 662 653 643 684 725 801 877 906 935 926 917 861 805 853 901 902 902 894 886 877 869 848 826 852 878 871 865 855 845
-1115 845 859 825 762 793 923 1006 1004 907 830 799 820 934 1052 1075 987 899 926 1000 993 892 786 729 749 768 848 927 1013 1003 979 955 972 989 963
-1119 963 936 909 883 899 916 977 1038 1041 997 926 949 1001 1054 1001 949 914 879 843 808 841 874 860 845 861 877 846 815 851 887 923 958 905 852 805 758
-1124 758 737 811 888 870 767 710 762 862 896 836 802 816 806 750 696 690 760 831 901 972 1007 996 952 1002 1063 1028 919 857 952 1093 1125 1063 1028
-1128 1028 1041 1006 923 863 897 934 877 757 732 790 847 867 886 859 785 699 709 772 836 857 878 858 837 812 881 970 1060 1048 941 861 828 833 838 741
-1132 741 645 602 653 726 751 775 799 820 841 919 996 1073 1150 1165 1181 1086 944 829 809 843 877 861 845 829 812 786 759 780 800 793 786 852 918 944
-1136 944 875 832 837 868 900 887 874 860 846 833 819 808 797 834 870 866 863 938 1013 1037 1062 1039 1017 962 907 852 797 880 962 934 905 858 811 812 812 829 847
-1140 847 864 881 844 808 882 956 979 1003 948 892 867 841 863 884 913 941 922 904 915 926 938 949 941 933 924 916 880 843 854 865 899 932 918 905 872 839
-1145 839 854 869 823 778 732 687 668 648 708 767 842 916 943 970 917 863 889 914 928 941 908 874 909 943 931 918 883 848 813 777 708 638 648 657 735
-1149 735 812 842 872 854 836 865 894 861 827 794 761 822 882 864 846 866 887 907 927 922 917 911 906 936 966 918 869 807 744 729 714 739 765 790 816 859
-1153 859 902 898 893 877 861 893 924 932 940 949 957 922 886 899 911 878 845 812 779 809 839 870 900 949 999 938 877 918 959 921 883 884 886 868 755 681 703 807
-1158 807 911 940 969 950 932 880 827 943 1059 1154 1155 1098 1042 995 949 949 950 952 954 909 864 810 757 815 872 910 949 940 931 876 821 845 869 845 820 796
-1163 796 772 778 783 789 794 804 814 903 992 1007 1022 989 957 916 876 882 889 879 869 859 848 919 989 949 909 924 939 954 969 919 869 899 928 922 915 909 903 913 924
-1167 924 887 850 866 881 850 818 824 829 914 999 951 903 878 854 842 830 865 901 959 1016 995 974 932 891 897 903 948 993 959 925 953 982 986 991 925 860 818
-1172 818 775 790 804 843 881 885 888 892 896 936 976 968 961 982 1003 977 951 967 983 919 856 806 757 754 752 798 844 867 890 960 1031 1054 1077 972 867 841 815
-1176 815 823 830 791 751 738 725 760 795 847 899 873 846 829 811 841 870 893 916 938 961 1004 1047 1042 1037 979 921 942 963 921 879 837 795 790 786 828 871 894
-1181 894 918 941 965 966 966 888 810 759 708 736 763 886 1008 989 969 1004 1038 1025 1012 958 903 928 952 947 941 888 835 803 771 763 755 776 798 866 935 957
-1185 957 980 955 883 821 838 886 935 953 972 943 867 788 788 883 978 963 948 886 824 811 799 831 863 815 718 683 727 775 822 827 832 833 834 835 836 825 814 803
-1190 803 792 826 860 789 718 707 775 873 924 910 896 880 863 788 713 717 720 784 848 833 818 761 704 742 858 954 1002 972 941 938 934 931 928 896 864 879 894
-1194 894 861 827 873 918 967 1015 984 954 937 921 904 888 874 861 927 993 968 943 942 941 944 946 901 856 839 822 852 930 974 939 873 806 781 756 777 799
-1199 799 816 833 803 772 774 775 777 778 780 781 782 784 783 783 798 860 907 875 811 748 760 773 786 798 839 879 840 802 832 863 894 925 924 924 876 780 740 779 880 982
-1204 982 975 969 962 955 982 1009 989 969 937 905 921 936 945 955 932 957 1025 1013 939 864 913 963 933 903 872 842 858 875 882 888 895 902 947 992 1037 1082 1024 967 909
-1208 909 852 854 855 810 764 834 904 927 950 997 1043 997 872 815 838 840 795 743 738 782 826 826 826 901 975 1018 982 879 777 794 810 827 844 886 928 894
-1213 894 861 864 915 983 972 934 896 900 904 901 897 893 890 924 957 887 816 830 940 1049 1063 997 930 905 880 884 887 890 893 890 887 885 882 845 808 819 830 855 881 953 1026
-1218 1026 1068 1110 1041 972 935 898 908 918 863 807 831 855 770 685 679 673 686 699 759 866 962 962 940 918 917 917 916 915 972 1028 974 920 932 945 957 969 997
-1222 997 1024 972 920 871 822 852 882 917 952 987 1022 964 905 894 883 934 985 988 992 958 924 937 950 941 931 922 912 866 819 826 929 998 1021 997 973 934
-1227 934 895 857 818 870 922 895 868 891 914 937 960 885 809 781 752 781 809 838 867 841 816 837 859 801 744 709 768 794 771 755 786 797 808 743
-1231 743 678 701 723 746 769 818 867 916 965 946 928 910 892 911 931 950 970 938 906 922 938 954 970 907 844 856 868 881 893 892 892 891 891 836 781 774 766
-1236 766 786 807 827 847 886 925 916 908 870 832 930 1028 1095 1068 1047 1025 980 934 889 843 923 1003 1035 1067 1040 1013 939 818 725 727 815 903 917 931 987
-1240 987 1042 1022 907 833 854 899 849 802 849 914 931 904 924 959 946 889 880 919 958 952 947 955 963 968 973 944 869 811 847 926 957 885 812 791 865 912 912 869
-1244 869 826 783 740 852 1011 1090 1073 1027 1029 1045 1061 998 934 918 902 952 1002 1005 1007 989 970 951 932 867 803 739 675 712 749 739 729 724 720 715 711 679 648
-1249 648 696 743 834 925 905 886 874 862 850 839 823 807 792 776 731 686 688 690 781 871 914 957 975 993 1011 1029 990 951 865 779 791 803 816 828 868
-1253 868 909 902 895 866 838 809 780 802 823 892 961 970 980 942 904 888 871 855 838 854 870 886 902 866 830 794 758 795 831 867 903 834 766 776 787 877
-1258 877 968 979 990 924 858 870 883 847 811 822 834 810 787 763 740 778 817 808 800 836 873 862 851 826 800 775 749 777 804 784 764 773 783 792 802 785
-1262 785 768 799 830 833 837 841 845 832 819 806 792 773 754 735 716 706 696 692 687 685 762 899 1035 1081 1016 907 846 838 830 826 821 796 771 745 720 761 802 843
-1267 843 884 806 727 712 776 836 850 816 782 829 877 877 877 876 875 874 873 920 968 968 968 929 891 900 909 958 1008 1010 1013 969 926 883 840 835 830 825 820 855 891 926 961 1003
-1272 1003 1044 1038 1032 973 914 855 795 750 706 708 710 761 812 863 914 908 902 896 890 904 918 853 788 747 706 712 718 775 832 858 805 747 737 695 653 657 660 711 762 721
-1277 721 680 750 819 893 967 930 893 844 795 857 918 931 943 955 968 970 971 973 975 937 898 859 821 805 789 821 852 836 820 805 789 732 676 730 785 836
-1281 836 887 907 974 995 938 857 823 859 943 982 974 937 899 906 912 917 922 927 931 948 964 981 997 978 959 937 915 922 881 822 842 915 987 954 874 820 845 870
-1286 870 895 892 889 886 883 832 781 774 767 767 719 698 757 859 914 917 872 846 821 792 763 832 901 922 944 885 827 769 710 742 774 805 837 877 916 877 790 776
-1290 776 840 884 880 868 856 921 985 976 967 958 950 889 829 801 851 915 931 899 868 883 898 913 928 929 930 931 932 908 884 813 742 767 793 818 844 883 923 889 855
-1295 855 831 900 973 951 873 843 892 988 1069 1101 1080 1011 972 934 893 851 817 782 795 807 856 904 952 1000 918 835 800 765 778 791 852 912 961 1010
-1299 1010 980 950 940 930 920 910 910 910 910 911 836 761 734 706 715 723 778 834 857 880 856 832 826 820 815 809 827 846 864 882 936 990 961 837 752 762 789 769
-1304 769 745 767 793 771 709 742 819 801 703 604 649 789 840 845 876 907 890 778 667 650 704 758 818 878 892 905 919 933 915 897 926 955 981
-1308 981 1006 953 899 881 863 918 973 1016 964 865 860 912 964 912 812 746 775 858 941 950 959 921 882 821 759 698 636 633 629 673 717 705 693 760 826 891
-1312 891 956 878 801 774 746 766 786 777 767 805 843 792 742 717 787 858 930 961 991 1002 1013 945 877 829 781 843 905 907 910 864 819 846 873 852 832 852
-1317 852 873 893 913 918 923 927 932 857 782 818 854 825 795 766 736 715 694 783 918 983 953 842 779 793 807 824 841 856 871 887 902 890 879 887 990
-1321 990 1088 1092 1044 996 918 840 782 818 912 911 858 806 859 912 886 860 872 884 895 907 883 860 836 813 822 831 839 848 908 968 981 994 1031 1068 1027 985 998
-1326 998 1011 1030 954 926 899 912 926 896 866 835 805 784 764 822 881 893 905 918 930 922 915 860 805 786 767 747 728 723 717 759 801 813 824 836 848 776
-1330 776 704 742 780 805 829 895 961 1043 1030 960 889 838 787 730 768 878 988 1025 1061 1022 983 943 904 966 1028 1043 1058 1018 978 891 803 807 810 814 817
-1334 817 784 750 717 684 779 875 945 921 871 821 771 722 710 792 874 862 827 791 797 803 770 738 731 819 905 991 942 892 883 875 867 858 923 987 1051 1115 1144 1173
-1339 1173 1150 1033 902 865 880 895 835 775 762 750 725 699 722 744 733 721 757 793 854 915 928 942 935 929 967 1005 967 883 854 905 923 862 823 832
-1343 832 877 922 922 923 886 849 811 774 823 871 873 826 807 866 923 900 831 761 765 770 742 713 685 657 712 766 821 876 908 940 893 846 838 831 824 816 784 752 796
-1348 796 840 810 733 697 771 898 978 977 927 885 843 845 847 876 904 886 867 879 891 902 914 837 760 730 700 709 718 727 736 722 707 740 772 814 855 896 937
-1352 937 833 728 671 613 624 635 647 658 645 633 668 702 746 790 834 878 844 810 823 837 857 877 851 824 822 819 817 815 774 733 770 854 906 863 803
-1357 803 790 781 773 791 808 809 809 809 809 799 790 757 723 780 837 816 794 752 711 748 786 740 693 725 804 865 832 808 783 803 823 843 863 885 907 882 856 806
-1361 806 756 753 751 818 886 874 863 813 763 714 664 643 622 680 739 752 766 780 794 785 776 767 758 760 761 739 717 735 753 723 694 679 664 673 682 688 693 746 798 831
-1366 831 864 896 929 880 832 862 893 928 964 920 877 832 786 763 835 916 949 873 797 786 774 842 909 915 920 878 836 859 882 905 927 984 1040 987 887
-1371 887 858 924 1032 1045 956 819 724 677 695 713 758 803 781 759 760 761 789 816 843 870 842 815 740 665 739 812 886 960 972 983 948 912 857 801
-1375 801 825 848 919 990 972 860 780 700 756 812 847 881 916 950 913 876 839 802 837 871 858 845 857 868 902 937 967 998 981 964 892 820 827 834 893
-1379 893 951 931 910 847 785 769 754 758 762 846 929 980 1030 1034 1037 984 931 867 896 915 838 761 780 878 881 802 722 800 878 819 761 777 887 997 1013 966
-1383 966 919 913 908 866 823 829 834 849 865 833 801 782 763 823 883 906 929 952 975 947 919 890 862 924 986 969 952 904 857 857 856 916 976 957 938 964 991
-1388 991 938 886 836 785 814 843 917 992 924 856 789 721 701 682 682 683 684 685 712 740 720 700 742 785 827 869 818 766 715 664 661 658 655 652 678 704 683 662
-1393 662 677 691 753 815 816 817 818 819 828 837 846 855 793 732 750 767 837 907 866 826 764 703 751 800 798 796 746 696 681 666 698 730 795 860 877 894 890 886 881 877 835
-1398 835 793 856 919 958 904 902 900 913 927 981 1036 1070 1010 955 900 919 937 877 816 780 744 787 830 859 888 870 851 852 853 807 761 878 996 1024 958
-1402 958 875 792 814 835 818 801 784 767 785 802 772 742 788 834 801 767 734 700 746 791 814 837 780 677 627 656 712 721 727 734 737 741 738 736 765 746 763
-1406 763 859 970 971 881 792 790 867 926 938 903 868 880 893 905 918 871 824 825 826 802 777 753 729 725 721 763 806 777 747 718 688 737 785 786 787 774 760 826
-1411 826 891 923 955 940 924 896 867 949 1030 996 961 926 892 864 835 807 779 797 815 786 757 781 805 829 853 875 897 872 799 762 804 847 889 883 877
$$ [...]
-1606I81
##$OBSERVED INTEGRALS=	(X Y Z)
(7.1805710315323807436, 7.4021545488553783798, 1)
(6.9035916348786292573, 6.996757431934888416, 0.18155869112291356249)
(6.7273320188262424324, 6.830569793942641077, 0.30859918783262241249)
(5.8787678672597563079, 6.0701354504023452563, 0.2643399471185197136)
(5.0402756937534052284, 5.1812833865953136225, 0.37406238466898461548)
(3.8668902497475192703, 3.9525020632586782554, 0.1324669806216732526)
(3.7712064581762234639, 3.8668902497475192703, 0.45364338327549968977)
(3.3582553577106319942, 3.4363131876766899175, 0.30852084772895177478)
(2.494583239053942858, 2.6532168935010904676, 0.39519868620846054785)
(2.0186822757124995853, 2.1143660672837940595, 0.09030892249111556469)
(1.6938609832731015281, 1.8600486212653521978, 0.39089396402989462498)
(1.5276733452808508584, 1.6057311752469090038, 0.38625541800887230881)
(1.2179600199316591436, 1.3589677127735682038, 5.2019843749829188795)
(0.79745493592096716728, 0.97119655745831756644, 0.51689077151762996554)
(7.4978383404266732981, 7.5834501539378340595, 0.063141110274232775668)
(5.4582627832490606679, 5.5615005583654593124, 0.092908545394215225066)
##END=	
##END=	
