##TITLE=	(1) Feb27-2020.230.1.1r
LS001

(2) Feb27-2020.230.1.1r
LS001
##JCAMP-DX=	6.0	$$ MestReNova 14.1.0-24037
##DATA TYPE=	LINK
##BLOCK_ID=	1
##BLOCKS=	2    
##ORIGIN=	Mestrelab Research S.L.
##OWNER=	ls1719
##$MNOVA/LINK_BLOCK_TYPE=	PAGE
##TITLE=	Feb27-2020.230.1.1r
LS001
##JCAMP-DX=	6.0	$$ MestReNova 14.1.0-24037
##DATA TYPE=	LINK
##BLOCK_ID=	2
##BLOCKS=	2    
##ORIGIN=	Mestrelab Research S.L.
##OWNER=	ls1719
##$MNOVA/LINK_BLOCK_TYPE=	ITEM	$$ NMR Spectrum
##$MNOVA/ITEM/POLYGON=	(XY..XY)
5321,5835
8722,5835
8722,8208
5321,8208
5321,5835
##$MNOVA/ITEM/Z=	0
##$MNOVA/ITEM/ANGLE=	0
##TITLE=	Feb27-2020.230.1.1r
##JCAMP-DX=	6.0	$$ MestReNova 14.1.0-24037
##BLOCK_ID=	3
##DATA TYPE=	NMR SPECTRUM
##DATA CLASS=	XYDATA
##NUMDIM=	1
##ORIGIN=	Bruker BioSpin GmbH
##OWNER=	nmrsu
##.OBSERVE FREQUENCY=	400.05240029848198446
##.OBSERVE NUCLEUS=	^1H
##.SOLVENT NAME=	CDCl3
##.PULSE SEQUENCE=	zg30
##LONGDATE=	2020/02/27 15:22:00.000
##.ACQUISITIONMODE=	SIMULTANEOUS
##$ORIGINAL FORMAT=	Bruker XWIN-NMR
##$MNOVA/SCALES_VERSION=	8
##$PARAMETER FILE=	(acqus, ASCII, h:/Synthesis/230/acqus, 0)
$$ ##TITLE= Parameter file, TOPSPIN		Version 3.2
$$ ##JCAMPDX= 5.0
$$ ##DATATYPE= Parameter Values
$$ ##NPOINTS= 11	$$ modification sequence number
$$ ##ORIGIN= Bruker BioSpin GmbH
$$ ##OWNER= nmrsu
$$ $$ 2020-02-27 15:22:35.315 +0000  nmrsu@nmrpc
$$ $$ /opt/topspin/data/ug1/nmr/Feb27-2020/230/acqus
$$ $$ process /opt/topspin3.2/prog/mod/shimcntl
$$ ##$ACQT0= -2.04831932773109
$$ ##$AMP= (0..31)
$$ 100 100 100 100 100 100 100 100 100 100 100 100 100 100 100 100 100 100
$$ 100 100 100 100 100 100 100 100 100 100 100 100 100 100
$$ ##$AMPCOIL= (0..19)
$$ -1 0 0 0 0 0 0 0 0 0 0 0 0 0 0 0 0 0 0 0
$$ ##$ANAVPT= -1
$$ ##$AQSEQ= 0
$$ ##$AQ_mod= 3
$$ ##$AUNM= <au_zg>
$$ ##$AUTOPOS= <23 >
$$ ##$BF1= 400.05
$$ ##$BF2= 400.05
$$ ##$BF3= 400.05
$$ ##$BF4= 400.05
$$ ##$BF5= 400.05
$$ ##$BF6= 400.05
$$ ##$BF7= 400.05
$$ ##$BF8= 400.05
$$ ##$BYTORDA= 0
$$ ##$CAGPARS= (0..11)
$$ 0 0 0 0 0 0 0 0 0 0 0 0
$$ ##$CFDGTYP= 0
$$ ##$CFRGTYP= 9
$$ ##$CHEMSTR= <none>
$$ ##$CNST= (0..63)
$$ 1 1 1 1 1 1 1 1 1 1 1 1 1 1 1 1 1 1 1 1 1 1 1 1 1 1 1 1 1 1 1 1 1 1 1 1
$$ 1 1 1 1 1 1 1 1 1 1 1 1 1 1 1 1 1 1 1 1 1 1 1 1 1 1 1 1
$$ ##$CPDPRG= (0..8)
$$ <> <> <> <> <> <> <> <> <>
$$ ##$D= (0..63)
$$ 0 1 0 0 0 0 0 0 0 0 0 0 0 0 0 0 0.0002 0 0 0 0 0 0 0 0 0 0 0 0 0 0 0 0
$$ 0 0 0 0 0 0 0 0 0 0 0 0 0 0 0 0 0 0 0 0 0 0 0 0 0 0 0 0 0 0 0
$$ ##$DATE= 1582816954
$$ ##$DE= 6.5
$$ ##$DECBNUC= <off>
$$ ##$DECIM= 2496
$$ ##$DECNUC= <off>
$$ ##$DECSTAT= 4
$$ ##$DIGMOD= 1
$$ ##$DIGTYP= 12
$$ ##$DQDMODE= 0
$$ ##$DR= 22
$$ ##$DS= 4
$$ ##$DSPFIRM= 0
$$ ##$DSPFVS= 20
$$ ##$DTYPA= 0
$$ ##$EXP= <proton>
$$ ##$F1LIST= <>
$$ ##$F2LIST= <>
$$ ##$F3LIST= <>
$$ ##$FCUCHAN= (0..9)
$$ 0 2 0 0 0 0 0 0 0 0
$$ ##$FL1= 90
$$ ##$FL2= 90
$$ ##$FL3= 90
$$ ##$FL4= 90
$$ ##$FOV= 20
$$ ##$FQ1LIST= <>
$$ ##$FQ2LIST= <>
$$ ##$FQ3LIST= <>
$$ ##$FQ4LIST= <>
$$ ##$FQ5LIST= <>
$$ ##$FQ6LIST= <>
$$ ##$FQ7LIST= <>
$$ ##$FQ8LIST= <>
$$ [...]
$$ 130000 130000 130000 130000 130000 130000 130000 130000 130000 130000 130000
$$ 130000 130000 130000 130000 130000 130000 130000 130000 130000 130000 130000
$$ 130000 130000 130000 130000 130000 130000 130000 0 0 0 0 0 0 0 0 0 0 0
$$ 0 0 0 0 0 0 0 0 0 0 0 0 0
$$ ##$ShimPowMaxUC= (0..63)
$$ 130000 130000 130000 130000 130000 130000 130000 130000 130000 130000 130000
$$ 130000 130000 130000 130000 130000 130000 130000 130000 130000 130000 130000
$$ 130000 130000 130000 130000 130000 130000 130000 130000 130000 130000 130000
$$ 130000 130000 130000 130000 130000 130000 130000 0 0 0 0 0 0 0 0 0 0 0
$$ 0 0 0 0 0 0 0 0 0 0 0 0 0
$$ ##$ShimPowMaxUG= (0..63)
$$ 524287 524287 524287 524287 524287 524287 524287 524287 524287 524287 524287
$$ 524287 524287 524287 524287 524287 524287 524287 524287 524287 524287 524287
$$ 524287 524287 524287 524287 524287 524287 524287 524287 524287 524287 524287
$$ 524287 524287 524287 524287 524287 524287 0 0 0 0 0 0 0 0 0 0 0 0 0 0 0
$$ 0 0 0 0 0 0 0 0 0 0
$$ ##$ShimPowRcbType= 3
$$ ##$ShimPowRes= (0..63)
$$ 1e-20 1e-20 1e-20 1e-20 1e-20 1e-20 1e-20 1e-20 1e-20 1e-20 1e-20 1e-20
$$ 1e-20 1e-20 1e-20 1e-20 1e-20 1e-20 1e-20 1e-20 1e-20 1e-20 1e-20 1e-20
$$ 1e-20 1e-20 1e-20 1e-20 1e-20 1e-20 1e-20 1e-20 1e-20 1e-20 1e-20 1e-20
$$ 1e-20 1e-20 1e-20 1e-20 0 0 0 0 0 0 0 0 0 0 0 0 0 0 0 0 0 0 0 0 0 0 0 0
$$ ##$ShimPowRng0= (0..63)
$$ 1 1 1 1 1 1 1 1 1 1 1 1 1 1 1 1 1 1 1 1 1 1 1 1 1 1 1 1 1 1 1 1 1 1 1 1
$$ 1 1 1 1 0 0 0 0 0 0 0 0 0 0 0 0 0 0 0 0 0 0 0 0 0 0 0 0
$$ ##$ShimPowRng1= (0..63)
$$ 1 1 1 1 1 1 1 1 1 1 1 1 1 1 1 1 1 1 1 1 1 1 1 1 1 1 1 1 1 1 1 1 1 1 1 1
$$ 1 1 1 1 0 0 0 0 0 0 0 0 0 0 0 0 0 0 0 0 0 0 0 0 0 0 0 0
$$ ##$ShimPowRng2= (0..63)
$$ 1 1 1 1 1 1 1 1 1 1 1 1 1 1 1 1 1 1 1 1 1 1 1 1 1 1 1 1 1 1 1 1 1 1 1 1
$$ 1 1 1 1 0 0 0 0 0 0 0 0 0 0 0 0 0 0 0 0 0 0 0 0 0 0 0 0
$$ ##$ShimPowRng3= (0..63)
$$ 1 1 1 1 1 1 1 1 1 1 1 1 1 1 1 1 1 1 1 1 1 1 1 1 1 1 1 1 1 1 1 1 1 1 1 1
$$ 1 1 1 1 0 0 0 0 0 0 0 0 0 0 0 0 0 0 0 0 0 0 0 0 0 0 0 0
$$ ##$ShimSysFunc= (0..63)
$$ 1 2 3 4 5 6 7 8 9 10 0 37 38 35 16 15 14 13 12 11 28 27 26 25 24 23 36
$$ 22 30 29 20 21 34 33 32 31 17 18 19 0 0 0 0 0 0 0 0 0 0 0 0 0 0 0 0 0 0
$$ 0 0 0 0 0 0 0
$$ ##$ShimSysMatrix= 0
$$ ##$ShimSysType= 4
$$ ##$TFXNUM= 0
$$ ##$TRIPLO2= 0
$$ ##$VTU= 2
$$ ##$VTUETH= <149.236.99.20>
$$ ##$VTUTY= <no>
$$ ##$WBREFAM= (0..15)
$$ 136.7 118.7 100 100 100 100 100 100 100 100 100 100 100 100 100 100
$$ ##$WBREFLM= (0..15)
$$ 0 0 0 0 0 0 0 0 0 0 0 0 0 0 0 0
$$ ##$WBREFPH= (0..15)
$$ 77.55 -71.28 0 0 0 0 0 0 0 0 0 0 0 0 0 0
$$ ##$WBSGU= (0..15)
$$ 0 0 0 0 0 0 0 0 0 0 0 0 0 0 0 0
$$ ##$XFAC= 2
$$ ##END=
$$ 
##$DECIM=	2496
##$DSPFVS=	20
##XUNITS=	HZ
##YUNITS=	ARBITRARY UNITS
##FIRSTX=	6397.0595463773288429
##LASTX=	-1615.7609664431709007
##DELTAX=	-0.24453933874997710318
##XFACTOR=	1
##YFACTOR=	5.3434439898324175289
##FIRSTY=	-1114.46875
##MINY=	-2152.9375
##MAXY=	10524239
##NPOINTS=	32768
##XYDATA=	(X++(Y..Y))
$$ [...]
3531g7N6R7L5j55J1L4ok8q2M7J25J30j91p4J72L2N2L4j03L8Rl1j01k4l1MM6J48q0m8P4l6j09
$$ -77 -21 76 111 -44 -33 1 -5 -33 -115 -68 57 187 -4 -78 94 126 178 212 109 147 156 125 24 0 -31 -27 19 167 87 39 113 77 -32
3523c2K6jm3R7j49j44J15K9L9Q1R2n5j33k5J09R3n7P1n6j87O8j8k8J0q8Q0R8M9j06J62o3j5
$$ -32 -6 -7 -50 47 -102 -246 -131 -102 -63 18 110 55 -78 -103 6 99 42 113 57 -130 -62 -80 -108 -98 -186 -106 -8 41 -65 97 34 19
3515A9r9M7p2r5J7m6l1J0j9J52J7K4k25j9O8J19n2j25J04J30j8k2P1l1L2J2L0k2l1k5j07J5
$$ 19 -80 -33 -105 -200 -183 -229 -260 -250 -269 -117 -100 -76 -301 -320 -252 -133 -185 -310 -206 -76 -94 -116 -45 -76 -44 -32 -2 -24 -55 -80 -187 -172
3508a72N7R1J3J4M4n4l9P8O4j00L3P0r2P0j6Qj01m0JP3N4m2m2M1K9j22J1l1N4L6J03N9j58
$$ -172 -115 -24 -11 3 47 -7 -46 32 96 -4 29 99 7 77 61 69 -32 -72 -71 2 56 14 -28 13 42 -80 -69 -100 -46 -10 93 152 -6
3500fq6l5N8l8p6J5K6R8K6Oko5O7pJ9m3j13n8R0Q7j8j03J39rl9n1Q9j22k2p6l0R8P3l2RL7
$$ -6 -92 -127 -69 -107 -183 -168 -142 -44 -18 -12 -14 -79 -12 -19 0 -43 -156 -214 -124 -37 -55 -158 -19 -28 -67 -118 -29 -151 -173 -249 -279 -181 -108 -140 -131 -94
3491i4k1KQ5P6J71J6j29M7k4o3m0qRJ88oj60j3K0k7l2P5r8J0k8O2R3j8R3j42j89q2J02o9J
$$ -94 -115 -113 -28 48 219 235 106 153 129 66 26 18 27 215 209 49 36 56 29 -3 72 -26 -16 -44 18 111 93 186 44 -145 -227 -125 -194 -193
3482a93K58j1j32O5l1J03N3j13M1R8l9m6j8jl0p0P3j0n6M8P9r8P8M4m9l5j3l7j16jJ15J88
$$ -193 65 54 -78 -13 -44 59 112 -1 40 138 99 53 35 34 4 -66 7 -3 -59 -11 68 -30 48 92 43 8 -5 -42 -158 -159 -44 144
3475A44j45m0L6o2l7L6m6J25j7j32L5n4M4J17j53N9K09p8O4j51r1pL7o1P9N5j7NK2K2k3j26
$$ 144 -1 -41 -5 -67 -104 -68 -114 11 -6 -138 -103 -157 -113 4 -149 -90 119 41 105 -46 -137 -144 -107 -168 -89 -34 -51 -46 -24 -2 -25 -151
3467a51J04O6j0j02p9j2J61O9J35o5j5p6m9m6LJ02j12k7k06Q4Q3J25P1l7j46k4R0Oo7J06J8
$$ -151 -47 19 9 -93 -172 -184 -23 46 181 116 101 25 -24 -70 -67 35 -77 -104 -310 -226 -143 -18 53 16 -130 -154 -64 -58 -125 -19 -1
3459ao2j8K2K1j8J0k7NL8K1J06L6j94L7n7q9j1J08J34j02Oj14K8q7J14L7m9m1J52Pqo4J15
$$ -1 -63 -81 -59 -38 -56 -46 -73 -68 -30 -9 97 133 -61 -24 -81 -170 -181 -73 61 -41 -35 -149 -121 -208 -94 -57 -106 -147 5 12 4 -60 55
3451E5J09J6j12m1Qm1N0o5j08O1N7L5j07j9L8k1JP3o0k7k5M3k0P9o6j3K4J6Q1O8m2l3k4J20
$$ 55 164 180 68 27 35 -6 44 -21 -129 -68 -11 24 -83 -102 -64 -85 -84 -11 -71 -98 -123 -80 -100 -21 -87 -100 -76 -60 21 89 47 14 -10 110
3443A10L2o7j98KL2O2o2nK1L3p5P7Pp3j9n0N2j13j8J21R4K0j20p7J13K17o5M7o2J1n1m0M0
$$ 110 142 75 -123 -121 -89 -27 -89 -94 -73 -40 -115 -38 -31 -104 -123 -173 -121 -234 -252 -131 -37 -17 -137 -214 -101 116 51 98 36 47 -4 -44 -4
3435dm1j12k3O2K2O7r1J31L5k6l2l0J40j03M7OL6p6N2j03j1K0m3O0r1M7J11o4j43O5J09j1
$$ -4 -45 -157 -180 -118 -96 -29 -120 11 46 20 -12 -42 98 -5 42 48 84 8 60 -43 -54 -34 -77 -17 -108 -61 50 -14 -157 -92 17 6
3427Fj32n8J41O8j7M6r5j00Pn0O2R6k5o8J00l5q4K4R9O5N7p5QN3K3o9l8N1J7k31O2Jl1J15
$$ 6 -126 -184 -43 25 8 54 -41 -141 -134 -184 -122 -26 -51 -119 -19 -54 -138 -114 -15 50 107 32 40 93 116 47 9 60 77 -154 -92 -91 -122 -7
3419gN9L4k4j9l1k4J5j03l4N4J33k8r7oJ5p6K6M8J17k2j37k8j0L2r3J18J43Mq1j0k7P0j13
$$ -7 52 86 62 43 12 -12 3 -100 -134 -80 53 25 -72 -78 -63 -139 -113 -65 52 30 -107 -135 -145 -113 -206 -88 55 59 -22 -32 -59 11 -102
3411a02p4R7K10m5p7M2l8q3pj4j4M3j03Q2j7J00J36j42j09L0J8n2p4J67R3p5P3q8J7q0n5j32
$$ -102 -176 -79 131 86 9 51 13 -70 -77 -91 -105 -62 -165 -83 -100 0 136 -6 -115 -85 -67 -119 -193 -26 67 -8 65 -23 -6 -86 -141 -273
3403b73M8L8J35Nn3LQL3Q4q7l0mN1lO1L8o4j02J2N6m5j90N4J67R1j32R3Q8J6q1P8q3J03k8
$$ -273 -225 -187 -52 -47 -100 -97 -89 -56 28 -59 -89 -93 -42 -45 16 54 -10 -112 -100 -44 -89 -279 -225 -58 33 -99 -6 82 98 17 95 12 115 87
3394H7Np0j25M7m4R9J21m3p5j03l1J08O8j15K7r5L0Q9LP6m4k16K9N6R0r2R6Q3J1j44m1K9L7
$$ 87 92 22 -103 -56 -100 -1 120 77 2 -101 -132 -24 44 -71 -44 -139 -109 -20 -17 59 15 -201 -172 -116 -26 -118 -22 61 72 -72 -113 -84 -47
3386d7lj1j56j15K2J81J26P7j01n8j1J7p5o8kj3P0J00q8L4q3J48L5L8j3Mj8qQM1K1J0l5p0
$$ -47 -50 -61 -217 -332 -310 -129 -3 74 -27 -85 -96 -79 -154 -222 -224 -237 -167 -67 -155 -121 -204 -56 -21 17 4 8 -10 -18 -10 31 52 62 27 -43
3378d3m0n4J93j5m5K6R7q2l0L6j10k1Q4J23j39o0l6lJ01M9j45kN2J1M6N8LL6j3R0qr1J6lk4
$$ -43 -83 -137 56 41 -4 22 119 37 7 43 -67 -88 -4 119 -20 -80 -116 -119 -18 31 -114 -116 -64 -53 -7 51 54 90 77 167 159 68 84 81 57
3369E7M3J2Lj52rK8m2J0m4k9k6M6O5lk10kLN1l0K5J62J04k0Q7q7j63J20q1j55J04qJ13n8o4
$$ 57 100 112 115 -37 -46 -18 -60 -50 -94 -123 -149 -103 -38 -41 -251 -253 -250 -199 -229 -204 -42 62 42 129 42 -121 -1 -82 -237 -133 -141 -28 -86 -150
3361a50j5J44O5N0j64p5R1K0N8q8J47k9p4ql5j24J37n1qk3J2M5j6j8N0n6p5J12oo2J9Q4Rl6
$$ -150 -165 -21 44 94 -70 -145 -54 -34 24 -64 83 54 -20 -28 -63 -187 -50 -101 -109 -132 -120 -75 -91 -109 -59 -115 -190 -78 -84 -146 -127 -43 -34 -70
3353g0P4N5j82J38o8O7M1p6k5L5j05O4J50j31n9O5p5L1L7J9q3l8pJ3q8O8O2j2N0N5n8j0Pn2
$$ -70 4 59 -123 15 -53 14 55 -21 -46 -11 -116 -52 98 -33 -92 -27 -102 -71 -34 -15 -98 -136 -143 -130 -218 -150 -88 -100 -50 5 -53 -63 -56 -108
3344a08k5J29O4j36q1J09j7J1L1K7qm4Or3o3J46MR3j13j3Jj9P7j15k1N9L8J21q5J17K9k3k9
$$ -108 -133 -4 60 -76 -157 -48 -65 -54 -23 4 -4 -48 -42 -135 -198 -52 -48 45 -68 -81 -80 -99 -22 -137 -158 -99 -61 60 -25 92 121 98 69
3336F9q3N4k9o6o1j8m3MJ70m4M6k2K9j5o9L2K1NK9j13K1R7Q5K0p%j19kp8q3J31M3q0Qlj12
$$ 69 -14 40 11 -55 -116 -134 -177 -173 -3 -47 -1 -23 6 -9 -78 -46 -25 -20 9 -104 -83 14 99 119 112 112 -7 -9 -87 -170 -39 4 -76 -68 -71 -183
3328a83J87J24q4o2oQ6k2M0j11l8R2j63j0j0RM5J04PK7j34k6MO3O2j8Q5Nj3P1m4j94l8P9k9
$$ -183 4 128 44 -18 -24 62 40 80 -31 -69 23 -140 -150 -160 -151 -106 -2 5 32 -102 -128 -124 -61 1 -17 68 73 60 131 87 -107 -145 -66 -95
3319i5Ll4m3kJ60j5p0j74J54J47p8n1J6Mj7J55Q0l14l3l9J15o4J00R0K2j26r7O3L9j0J66k9
$$ -95 -92 -126 -169 -171 -11 -26 -96 -270 -116 31 -47 -98 -82 -78 -95 60 140 -174 -207 -246 -131 -195 -95 -5 17 -109 -206 -143 -104 -114 52 23
3311B3j46j0M3J9J1p2rr5p4K7M6k0J02K4k0Q6m4J1P6Rk9P8Rj75n4R1j8J06q0k9P1j13j02o
$$ 23 -123 -133 -90 -71 -60 -132 -141 -236 -310 -283 -237 -257 -155 -131 -151 -65 -109 -98 -22 -13 -42 36 45 -130 -184 -93 -111 -5 -85 -114 -43 -156 -258 -264
3303b64J13J49J11o3j9nQ2j7m5Nj14j9J01M5m2J3n5J3o6j00MJ19n7p5Q4O1qJ2j10K2K2J06
$$ -264 -151 -2 109 46 27 22 104 87 42 47 -67 -86 15 60 18 31 -24 -11 -77 -177 -173 -54 -111 -186 -102 -41 -49 -37 -147 -125 -103 3
3295CM0n3Q4L1k9l1jR7j63n0o9R6K6r4O6J8p0n6R2%k9J5r4j3J24M8M8j65q4N8l7R6O8P2r1
$$ 3 43 -10 74 105 76 45 44 141 -22 -72 -141 -45 -19 -113 -47 -29 -99 -155 -63 -63 -92 -77 -171 -184 -60 -12 36 -129 -213 -155 -192 -96 -28 44 -47
3287d7p0O5J5L6l5n6K6l3n6N6R6n4J18Kj28o5n9p1J15J22J0m6RJ21lj29R0q2N2Q3N8j29m8
$$ -47 -117 -52 -37 -1 -36 -92 -66 -99 -155 -99 -3 -57 61 63 -65 -130 -189 -260 -145 -23 -13 -59 -50 71 68 -61 29 -53 -1 82 140 11 -37
3279c7O9L2q1J3j82J08N4k8j39L1J39J36j28KJ0j11K8J49k5Jp5j16k8J37Nko0J1j9j6P1L7
$$ -37 32 64 -17 -4 -186 -78 -24 -52 -191 -160 -21 115 -13 -11 -1 -112 -84 65 40 41 -34 -150 -178 -41 -36 -38 -98 -87 -106 -122 -51 -14
3271a4n4q3p1J95j02M6K5J7jm3m9r8J39J43po9j36Q9N3%K7MRJ11k2l9j4m4L4K6j0r5J1l7N
$$ -14 -68 -151 -222 -27 -129 -83 -58 -41 -42 -85 -134 -232 -93 50 43 -26 -162 -73 -20 -20 7 11 20 131 109 70 56 12 46 72 62 -33 -22 -59 -54
3262e4J26k0R6j10j4J9l1m6J7LP3j25O8n0r5r0J74O3P5n2Q7O7n5J12M1j06j15q4pL2O3p1j12
$$ -54 72 52 148 38 24 43 12 -34 -17 -14 59 -66 2 -48 -143 -233 -59 4 79 27 114 181 126 238 279 173 58 -26 -33 -1 62 -9 -121
3254a21M0j24P7O6j7m6MO0j0o8m7j6L5K9R9Q2j5J2j07k4pJ2J4P0j32l3J39j26j2MK6M9j6M
$$ -121 -81 -205 -128 -62 -79 -125 -121 -61 -71 -139 -186 -202 -167 -138 -39 43 28 40 -67 -91 -98 -86 -72 -2 -134 -167 -28 -154 -166 -162 -136 -87 -103 -99
3246i9L1o3j43n3J28J46O3j22J72L2l8k3q9n7M4N1N8N9q2qk4n1K8Q4L7J27j00j64r5o2O8k06
$$ -99 -68 -131 -274 -327 -199 -53 10 -112 60 92 54 31 -58 -115 -71 -20 38 97 15 7 -17 -68 -40 44 81 208 108 -56 -151 -213 -145 -351
3238c51K1P5J07q7K4K6J05N8K0k5o7j16M2O0J17L0J07r8j79p8J48P0m5N5q0l2N1ro3J33j4
$$ -351 -330 -255 -148 -235 -211 -185 -80 -22 -2 -27 -94 -210 -168 -108 9 39 146 48 -131 -209 -61 9 -36 19 -61 -93 -42 -51 -114 19 5
3231Ej27mj30J47J07k3K3J8n7P7p1j72N9K9l7Pl0R2K9L9L0Rm8QO4N4M4p4J7k8j07l2K7JM2
$$ 5 -122 -126 -256 -109 -2 -25 -2 16 -41 36 -35 -207 -148 -119 -156 -149 -179 -87 -58 -19 11 20 -28 -20 44 98 142 68 85 57 -50 -82 -55 -54 -12
3222a2j53j14p8J83J84j41M8J39j3Jkj75N4N4p2n4OM2N6o3Kq6J09O4L0mJ8j40k8lk0J52k6
$$ -12 -165 -279 -357 -174 10 -131 -83 56 43 44 42 -133 -79 -25 -97 -151 -145 -103 -47 -110 -108 -194 -85 -21 9 5 23 -117 -145 -148 -168 -16 -42
3214d2L5J27N4j4r7j0j71O8RJ16Lj04J40j30k52J18LJ62O0O5n1l2r2jJ30K0l1n9j99R2N1n1
$$ -42 -7 120 174 160 63 53 -118 -50 -41 75 78 -26 114 -16 -268 -150 -147 15 75 140 89 57 -35 -36 94 114 83 24 -175 -83 -32 -83
3206h3n8Q5J46N2l3k7n2K3rR4J9j54q8M2J68Q8m9n3j07lL5L3K4o7n8J9qJ02p3L5Nj5j55n3
$$ -83 -141 -56 90 142 109 82 30 53 44 138 157 3 -85 -43 125 213 164 111 4 1 36 69 93 26 -32 -13 -21 81 8 43 48 33 -122 -175
3198a75mJ88Mj3m0O8k1L2j4p8Q4K9J4j37o5L3k4O1J29R1j33M5r1l5OJ8Q2j6m0P6o2p2m1J5
$$ -175 -179 9 13 0 -40 28 7 39 25 -53 31 60 74 -63 -128 -95 -119 -58 71 162 29 74 -17 -52 -46 -28 54 38 -2 74 12 -60 -101 -86
3189h6jq0J8J59J9Pjj03j48mJ88J8n9P3j7l2r9O1K3n0%m9O5J8k2p4M8OO8L2l7k6Q4oj01m7
$$ -86 -87 -167 -149 10 29 36 35 -68 -216 -220 -32 -14 -73 0 -17 -49 -148 -87 -64 -114 -114 -163 -98 -80 -102 -176 -128 -122 -54 -22 -59 -85 -1 -7 -108 -155
3181a55L8m3M8JJ6K2k3O3K1n7L1L0j6JK7P4L1l5o8o3J44j20J2l4M5K1J3O7p3l5N4Q6j23j11
$$ -155 -117 -160 -112 -111 -95 -73 -96 -33 -12 -69 -38 -8 -24 -23 4 78 109 74 6 -57 87 -33 -21 -55 -10 11 24 91 18 -17 37 123 0 -111
3172a11J25K4p2L1l6o3J29L9K4j57P8l4l7Qo5q2J34M3j3r8J2o5OQ2Q2l6L4j2n6j6J25K9m2
$$ -111 14 38 -34 -3 -39 -102 27 66 90 -67 11 -23 -60 -52 -117 -199 -65 -22 -35 -133 -121 -186 -180 -98 -16 -52 -18 -30 -86 -102 23 52 10
3164A0n3L7m9p7Q6P4k5j42l3JR3J20j48LN7J08k05J04Pj32J26J5q4J30Q4j1l5j65%j5j9l1
$$ 10 -43 -6 -55 -132 -46 28 3 -139 -172 -171 -78 42 -106 -103 -46 62 -143 -39 -32 -164 -38 -23 -107 23 107 96 61 -104 -104 -119 -138 -169
3156a69NM0m9L7K3O6J44q7j09o5R9Q1j34m8K8J27j4Q6J5k3o4j14J7Q1r6Jl8O1j0J44n5Ol8
$$ -169 -164 -124 -173 -136 -113 -47 97 10 -99 -164 -65 16 -118 -166 -138 -11 -25 61 76 53 -11 -125 -108 -27 -123 -122 -160 -99 -109 35 -20 -14 -52
3148e2Rq6M6J4K3l4l5O1J52n5k8O7n4j04k8pJ05j20r9J28M4m3J13p2M7J9P8Pj56M4N9j59L0
$$ -52 -43 -129 -83 -69 -46 -80 -115 -54 98 43 15 82 28 -76 -104 -111 -6 -126 -225 -97 -53 -96 17 -55 -8 11 89 96 -60 -16 43 -116 -86
3140h6q1p1M6R0J2jJ5j4j1l9l7O2J1J29N0k6n2J2n2K8Q1N5j88R7n9L3m0L6K5j0p3P9j0N4j43
$$ -86 -167 -238 -192 -102 -90 -91 -76 -90 -101 -140 -177 -115 -104 25 75 49 -3 9 -43 -15 66 121 -67 30 -29 4 -36 0 25 15 -58 21 11 65 -78
3132g8q7R2L6P3j0o0K4K9j02k5N9L9k3m5M4j42O8Lkm1L2l0K7R0J2J4Nj35l9R3J6J48l2J08
$$ -78 -165 -73 -37 36 26 -34 -10 19 -83 -108 -49 -10 -33 -78 -34 -176 -108 -105 -107 -148 -116 -146 -119 -29 -17 -3 2 -133 -172 -79 -63 85 53 161
3123A61p7o3m8K1Q3r3k0n7m3Km1R1p2J4j6j0K1O9Kj9j05k8K5P0J0J93j9o9L0j70j30J03j09
$$ 161 84 21 -27 -6 77 -16 -36 -93 -136 -134 -175 -84 -156 -142 -158 -168 -147 -78 -76 -95 -200 -228 -203 -133 -123 70 51 -18 12 -158 -288 -185 -294
3115b94O8Q7M1j08L5O7Q1L4R3k3l5j05n8Q7J51j80j47N7QN0M1O5j76K0J10k7N3l2K7j02N9
$$ -294 -226 -139 -98 -206 -171 -104 -23 11 104 81 46 -59 -117 -30 121 -59 -206 -149 -141 -91 -50 15 -161 -141 -31 -58 -5 -37 -10 -112 -53
3108e3k5o3O0J4j43L9L2J31L3j8m3Q9Kp6j69K2k1J03p4MO6p1K2K2QQ6q9J44j1L5j60o8Q6L8
$$ -53 -78 -141 -81 -67 -210 -171 -139 -8 25 7 -36 53 55 -21 -190 -168 -189 -86 -160 -156 -90 -161 -139 -117 -109 -23 -112 32 21 56 -104 -172 -86 -48
3099d8j1N1j4j8m8K4k5K4m5r5j0J0K7O0N7Kj4J00m4q3oJ13j2n3r6k1J26J11j7Lj05pK9J13
$$ -48 -59 -8 -22 -40 -88 -64 -89 -65 -110 -205 -215 -205 -178 -118 -61 -59 -73 27 -17 -100 -106 7 -5 -58 -154 -175 -49 62 45 48 -57 -64 -35 78
3091G8pk8r0om0M9K5J57j66n2p5J44l1O5m0M5M0J33p9j20p8L0p0K9L5j00J4K04J98o3j91r4
$$ 78 71 43 -47 -53 -93 -44 -19 138 -28 -80 -155 -11 -42 23 -17 28 68 201 122 2 -76 -46 -116 -87 -52 -152 -138 66 264 201 10 -84
3083h4P3l6j35J2J60R4o5LP1N1p9l4kn5q2J08p0l9MN6L3Q6j33M7k7J21J25j05j88n7K0%OJ5
$$ -84 -11 -47 -182 -170 -10 84 19 22 93 144 65 31 29 -26 -108 0 -70 -109 -105 -49 -16 70 -63 -16 -43 78 203 98 -90 -147 -127 -127 -121 -106
3075a06J9j5n8O9j7R5m2p1k7O8o9J48r7M2pNL4k2o9N5k5J7j19J57L9O5o8j13R1K4m0j54J40
$$ -106 -87 -102 -160 -91 -108 -13 -55 -126 -153 -85 -154 -6 -103 -61 -68 -63 -29 -51 -120 -65 -90 -73 -192 -35 4 69 1 -112 -21 3 -37 -191 -51
3067e1O3O7O3j79j31J00pJ14j35J31O8m1p9qJ15r1k22K0O3JM5J11j8r1k4O9J19J18r3p2j9
$$ -51 12 79 142 -37 -168 -68 -75 39 -96 35 103 62 -17 -25 90 -1 -223 -203 -140 -139 -94 17 -1 -92 -116 -47 72 190 97 25 6
3059FN6r0N8n5R8m1q5K6O8j4jJ21r9n7JQ7oq2j08ko2q9J00J1k3N0oK7J07L1Pm0M9r0N4j37
$$ 6 62 -28 30 -25 73 32 -53 -27 41 27 26 147 48 -9 -8 79 73 -9 -117 -119 -181 -270 -170 -159 -182 -132 -138 -111 -4 27 34 -6 43 -47 7 -130
3051a30mp9K01J31N9r0j15oO9j4%j30Q9MR9j33L8J1o9j13R5M4lP1l3r3P9k7k2lPnJ27k61N6
$$ -130 -134 -213 -12 119 178 88 -27 -33 36 22 22 -108 -19 -15 84 -49 -11 0 -69 -182 -87 -43 -46 25 -8 -101 -22 -49 -71 -74 -67 -72 55 -206 -150
3042a50O5R5q2N9l1O1j3r3J8P3J30q8K6n6O3j4j58l4k9J35k1l2j63J66j07k0p9N4N9J24j8
$$ -150 -85 10 -72 -13 -44 17 4 -89 -71 2 132 44 70 14 77 63 -95 -129 -158 -23 -44 -76 -239 -73 -180 -200 -279 -225 -166 -42 -60
3034f0M4j99J31J6J37r0qN4J11j37j28NK8Q9J05j8pj23N7p3O6p9rN5K0L9j1j35Q3nO3L1J01
$$ -60 -16 -215 -84 -68 69 -21 -29 25 136 -1 -129 -124 -96 -7 98 80 73 -50 7 -66 0 -79 -88 -33 -13 26 15 -120 -37 -42 21 52 153
3026A53k42j08m1J15M5L7p3R1J14O5j50Q8n9J3r8l5l3K7J14J8j38K6K2J3K%j31J12j98Q8J30
$$ 153 -89 -197 -238 -123 -78 -41 -114 -23 91 156 6 94 35 48 -50 -85 -118 -91 23 41 -97 -71 -49 -36 -34 -34 -165 -53 -251 -163 -33
3019c3j8n0M9j87N8K4M5N1m4P2R4k7m7j31J27k2p4j46O7kK5N4q7R5N9J01ko9PQ6L2m5n4j5
$$ -33 -51 -101 -52 -239 -181 -157 -112 -61 -105 -33 61 34 -13 -144 -17 -39 -113 -259 -192 -194 -169 -115 -202 -107 -48 53 51 -18 -11 75 107 62 8 -7
3010gR6P7k6O3lq0J20L93J096J439o64j363o07k93p7q9k2r9m4N4O1p8m2M8J22m4L7Kl3o7P1
$$ -7 89 166 140 203 200 120 240 633 1729 3168 2504 1141 534 241 164 75 53 -46 -90 -36 25 -53 -95 -47 75 31 68 70 37 -30 41
3003D1K8p4l8o4O5N7k0j56qNK1R3m1r5J76J00j0j7M5j74J7J33l8j95J11LO6q8Q1k7Q6j16L7
$$ 41 69 -5 -43 -107 -42 15 -5 -161 -169 -164 -143 -50 -91 -186 -10 90 80 63 108 -66 -49 84 46 -149 -38 -35 31 -57 24 -3 83 -33 4
2995Dl8L7P8n4n9L1k7MP9L5j99J42j25Q0p5M9j5K0q8M6o1m4k0K1j38K3P9J45o3P8L5J02J5
$$ 4 -34 3 81 27 -32 -1 -28 -24 55 90 -109 33 -92 -12 -87 -38 -53 -33 -121 -75 -136 -180 -200 -179 -317 -294 -215 -70 -133 -55 -20 82 97
2987I7N8o6K5kM1r6J16j55J28J2k7j45J20n6NL0o3r8mJ4J6l8P2NJ7j60K46J4k8r6J11m1m4
$$ 97 155 89 114 112 153 57 173 18 146 158 131 -14 106 50 55 85 22 -76 -80 -66 -50 -88 -16 -11 6 -154 92 106 78 -18 93 52 8
2979HJ0j02q0J86j39Q1P4nq8J01j04j9K2L2m8K20o8n8o8l1j72J74J69O4r2k0j51Nj38J61o3
$$ 8 18 -84 -164 22 -117 -36 38 33 -55 46 -58 -77 -55 -23 -71 149 81 23 -45 -76 -248 -74 95 159 67 47 -104 -99 -237 -76 -139
2971a39Jn6J47q0J6J80O2k28J50M2N7k63ok3P9m6Q1o8K66k83om7Q3j9J75P0mj16P7K2L3j45
$$ -139 -138 -194 -47 -127 -111 69 131 -97 53 95 152 -111 -117 -140 -61 -107 -26 -94 172 -111 -117 -164 -81 -100 75 145 141 25 102 124 157 12
2963A2O3pJ59j52N4k05J64L9J9j38M7M9Q7j71L4l9J38m1Rr7m3k0j5l5J24J7N9p2j6n5O7q7
$$ 12 75 68 227 75 129 -76 88 127 146 8 55 104 191 20 54 15 153 112 121 24 -19 -39 -54 -89 35 52 111 39 23 -32 35 -52
2955e2J42o7N6j21Q1m2J4l9j2p3J02NL9NN5j63J96r4r8M5N8O4j29r0J33RQ0q7j8J1n5j4L7
$$ -52 90 23 79 -42 39 -3 11 -28 -40 -113 -11 -6 33 38 93 -70 126 32 -66 -21 37 101 -28 -118 15 24 104 17 -1 10 -45 -59 -22
2947b2K2m1L9rk4O4k4K0L2j36P5K0j9rnM6j6M2r6j24P8o8k7O6J42k6M7M2P3k10R4j13m1o3
$$ -22 0 -41 -2 -11 -35 29 5 25 57 -79 -4 16 -3 -12 -17 29 13 55 -41 -165 -87 -155 -182 -116 26 0 47 89 162 -48 46 -67 -108 -171
2939a71J20j27J28O5J16j93L7o3J18L4Nj37J17r5M3j12K4q5K51N1M8r7n6l7J96j47K14k25
$$ -171 -51 -178 -50 15 131 -62 -25 -88 30 64 69 -68 49 -46 -3 -115 -91 -176 75 126 174 77 21 -16 180 33 247 22
2932B2J09O2R4j95J66k71J25k08K31j40J05j52Q2p2K66k28K44j32J94k82J64j50J94j61J65
$$ 22 131 193 287 92 258 -13 112 -96 135 -5 100 -52 30 -42 224 -4 240 108 302 20 184 34 228 67 232
2926B32k55K73n5K54k22M28l38J06l30L02j39L68k50J79l17K81l14L45k87L44k80M08k76J96
$$ 232 -23 250 195 449 227 655 317 423 93 395 256 624 374 553 236 517 203 548 261 605 325 733 457 653
2920F53k42K54m09M60j93L88l80K50l44M37l45M21m53N48n94M06k59O29n72N74m20N82l81
$$ 653 411 665 256 716 523 911 531 781 437 874 529 950 497 1045 451 857 598 1227 655 1229 809 1391 1010
2915A010N13n70M65l98O96n29N82n08P54o06O52n24P47n18Q58p14R27m63J086o91J622p56
$$ 1010 1523 953 1418 1020 1716 1187 1769 1261 2015 1409 2061 1537 2284 1766 2624 1910 2837 2374 3460 2769 4391 3635
2909C635J142o74R84q94K035q89J729o84K711n83L762mN504J888J2195J1327M0701R4927K68938
$$ 3635 4777 4103 5087 4193 6228 5339 7068 6384 9095 8512 12274 12270 17774 19662 31857 43184 83885 178812 447750
2905D47750J19322k42421j57033p4049l5500k2921j1237r364k921l813n06k268J27j694k6
$$ 447750 567072 324651 167618 93569 58069 35148 23911 14547 11626 7813 7307 5039 5166 3472 3446
2901C446p63N60j421M76p84k49k57N27n89M27n73K63l22L83m00K41l54J92k58K92l20M4k45
$$ 3446 2683 3243 1822 2298 1514 1265 1008 1535 946 1373 800 1063 741 1124 724 965 611 803 545 837 517 561 316
2895C16L4l19K23k1J09j09R6j02qj4K19j60n5r9K47j48J31QN1r6j01J8Q3j1n9j29K8R6j4k
$$ 316 350 31 254 233 342 233 329 227 219 205 424 264 209 110 357 209 340 348 399 303 202 220 303 292 233 104 132 228 214 212
2888B12L0J22m8n8j24j2J1Rl6K0pq2Q8R6o7N9j33M2m2Pr7R5j4qo3J49MP0k15p5j04R8m2K12
$$ 212 242 364 316 258 134 122 133 142 106 126 119 37 125 221 154 213 80 122 80 87 -10 85 71 63 0 149 153 223 8 -67 -171 -73 -115 97
2880I7j28J03p8J58j56J52k9o7r8J78K7K5k39P9j22Q6q0K14k63J46o6M14j4J5k05O7j85O1
$$ 97 -31 72 -6 152 -4 148 119 52 -46 132 159 184 -55 24 -98 -12 -92 122 -141 5 -61 353 339 354 149 216 31 92
2873I2j36J37j20J61j60J69j60N6r0J56j25K26j69k0j03J47p6K11o5K67q3j49l11J43n4J64
$$ 92 -44 93 -27 134 -26 143 -17 39 -51 105 -20 206 37 17 -86 61 -15 196 131 398 315 166 -145 -2 -56 108
2866A08r1R9p3J46j99J81kJ78l58M5j40K50j52Mj05J83j46K18j24M7o5k9j87K14j63J43P9
$$ 108 17 116 43 189 -10 171 169 347 -11 34 -106 144 -8 -4 -109 74 -72 146 22 69 4 -25 -212 2 -161 -18 61
2860F1L4j45K14j53J4q3K62p8Q4j64Mq8J62j16J42M7J68J64J77j70K15m4J7j99lr0j32k59
$$ 61 95 -50 164 11 25 -58 204 126 210 46 50 -38 124 8 150 197 365 529 706 536 751 707 724 525 522 432 300 41
2853D1P9q5O3p8J20j31J07j17J43l1J14j08K48M9K18J58L31L00K45k13l34j89J33j31R9R3
$$ 41 120 35 98 20 140 9 116 -1 142 111 225 117 365 414 632 790 1121 1421 1666 1453 1119 930 1063 932 1031 1124
2847A124K3k81j77k02j28k02j2r4R8j20M9r7R5j45K14L0k0O3Q8j05M8J29K19K58M94J29j68
$$ 1124 1147 866 689 487 359 157 145 51 149 29 78 -19 76 -69 145 175 155 218 306 201 249 378 597 855 1349 1478 1310
2840A310m46l39j59l9j44p9j14J25K6m1l9L0M2mq4m6j1l2m8R2L6Q7Pk3m8j3p9Q2Jn3KP5NL3
$$ 1310 864 525 366 327 183 104 -10 115 141 100 61 91 133 129 45 -1 -12 -44 -92 0 36 123 130 107 59 46 -33 49 50 -3 -1 74 79 112
2832A12K9r8M5R9N0p9k8ll9j33K0J18m7q6L9N6m1R1l4n1j9l9K4J4k3K7J64j06P8m7p4j7k0
$$ 112 141 43 88 187 237 158 130 127 88 -45 -25 93 46 -40 -1 55 14 105 71 20 1 -38 -14 0 -23 4 168 62 140 93 19 2 -18
2824a8j30J30J05M7j66J1m9J3L0P5l8pj23%J12Q9J9N6p3O1q6l2KK6p1J16j9J04l8k6O4M9n
$$ -18 -148 -18 87 134 -32 -21 -70 -57 -27 48 10 3 -120 -120 -8 81 100 156 83 144 58 26 28 54 -17 99 80 184 146 120 184 233 228
2816B28o7q2K6k35M9N0J16m8o4j12J99L5l3L4k3k0J28o2J5l0j7m5j2n8K15L6M3j06J70k6J2
$$ 228 161 79 105 -130 -81 -31 85 37 -27 -139 60 95 62 96 73 53 181 119 134 104 87 42 30 -28 187 223 266 160 330 304 316
2808C16k3K68L83J63j96l01k79j16rn7m8jp2O8k3J23P0J13R4K30N8P1J1jj00NP3J33j3Q8q2
$$ 316 293 561 944 1107 911 610 331 215 206 149 101 100 28 96 73 196 266 379 473 703 761 832 843 842 742 747 820 953 940 1028 946
2800I46j35k22qK23N37J496N03j444o81n25o5j38r1n6K9k2K1Q5J12O5M2k7J92J25l8J9L77
$$ 946 811 589 581 804 1341 2837 3340 1896 1215 690 625 487 396 340 369 347 368 453 565 630 672 645 837 962 924 943 1320
2794A320J39K14Q3N4o3k7l86o4M8J06J17nk10j16m91r6n2Q9j55r1j77j3m0J72N0J99p2k5K9
$$ 1320 1459 1673 1756 1810 1747 1720 1334 1270 1318 1424 1541 1536 1326 1210 719 623 571 660 505 414 237 224 184 356 406 605 533 508 537
2787E37M0L1J08j82j09r2P8K2LJJ56q0P1NJ99JJ07j46l2K07N4m3J65j0L5J13Q0R1M8r4J20
$$ 537 577 608 716 534 425 333 411 433 436 437 593 513 584 589 788 789 896 750 718 925 979 936 1101 1091 1126 1239 1319 1410 1458 1364 1484
2779A484K2Pk09M0L0J0L5J10J46J35J3M0P3Q6MJ13K39K76L94L78O59Q63Q17P73M84K93K30
$$ 1484 1506 1513 1304 1344 1374 1384 1419 1529 1675 1810 1823 1863 1936 2022 2026 2139 2378 2654 3048 3426 4085 4948 5765 6538 7022 7315 7545
2772G545q9J7M63J002J386J694K184K858M389P656J5155L3267O7658Q8550L5548n2533q0544
$$ 7545 7456 7473 7936 8938 10324 12018 14202 17060 21449 29105 44260 77527 145185 233735 269283 216750 136206
2768A36206n5770l1022j6873r557n251k877j578j333j177o56K17O42L87o3R8l25p79o72J61
$$ 136206 80436 49414 32541 22984 17733 14856 13278 11945 10768 10112 10329 10971 11358 11295 11393 11068 10289 9617 9778
2764I778Q04J808K435L220M116O335J0749K2373M9623R5833J05053J7164q3111r6037o1641
$$ 9778 10582 12390 14825 18045 22161 28496 39245 61618 111241 207074 312127 329291 246180 150143 88502
2760H8502l4543j9357j1299o526l698k165j590j533j025m47k12m55l90l47o24r25p63m81k63
$$ 88502 53959 34602 23303 16777 13079 10914 9324 7791 6766 6319 6107 5652 5262 4915 4291 3366 2603 2122 1859
2755A859j91j67r6q8k17L1J8P8k33r5%J7n2l2j75Q8j07K4j7j59j40J51k9K6k6J20k8n0J7p2
$$ 1859 1668 1501 1405 1317 1100 1131 1149 1227 994 899 899 916 864 832 657 745 638 662 645 486 346 497 468 494 468 588 560 510 527 455
2748D55j3q4rJ40j12j0r4J16L8J02J32j6j19M3j84M8RL6p9p1R4J95m1R4O9K04J17PJ99Pk31
$$ 455 442 358 349 489 377 367 273 389 427 529 661 645 526 569 385 433 442 478 399 328 422 617 576 670 739 943 1060 1067 1266 1273 1042
2740A042k17k2p8j48O5j26j6kOJ5o6LJ21J6Q1m3jl8Lj3K5m0J02J68K51K32L35L6Ol59k95o5
$$ 1042 825 803 725 577 642 516 500 498 504 519 453 456 577 593 674 631 630 592 595 582 607 567 669 837 1088 1320 1655 1691 1697 1338 1043 978
2733I78r6K5M6m9J56J78J49L35L54J29N2k9j01k17Q2J39J94R6j5p8j77k28j78l1J04K76M11
$$ 978 882 907 953 904 1060 1238 1387 1722 2076 2205 2257 2228 2127 1910 1992 2131 2325 2421 2406 2328 2151 1923 1745 1714 1818 2094 2505
2726B505K68K16l72j70j43j23J1J34K06O6J19J64j7O3Q1J39L39J42K68M07L84N77P24Q86J083
$$ 2505 2773 2989 2617 2447 2304 2181 2192 2326 2532 2598 2717 2881 2864 2927 3008 3147 3486 3628 3896 4303 4687 5264 5988 6874 7957
2720G957J139J192Q63N57N31J054J534K087K784L436M662P439J3273K3003L4672M2811L9986
$$ 7957 9096 10288 11151 11708 12239 13293 14827 16914 19698 23134 27796 35235 48508 71511 106183 148994 188980
2716A88980K2255l446k0794k0996n460J6269L3240L3247J2536j9618m4050n0934m4040l1778
$$ 188980 211235 207789 186995 165999 160539 176808 210048 243295 255831 236213 192163 141229 97189 65411
2712F5411k0326j2437p708n351l615k717j611j052n36n45q79q47r84q78n47l73m6k37l33k62
$$ 65411 45085 32648 24940 19589 15974 13257 11646 10594 10058 9513 8634 7787 6803 5925 5378 5005 4959 4722 4389 4127
2707D127j12j37O3j9L48J40K47L19L66k3K40K00L96J65N84L76Q20O41J248J174J858K343L717
$$ 4127 4015 3878 3941 3922 4270 4410 4657 4976 5342 5319 5559 5759 6155 6320 6904 7280 8100 8741 9989 11163 13021 15364 19081
2702A9081O098J2608K3502L1202K8595L1485j03k2957j9654j8800l650R253J2089J7101l851
$$ 19081 25179 37787 61289 92491 121086 152571 152468 129511 109857 91057 87407 96660 108749 125850 121999
2698A21999k3480k1557k3653j7086j0921o018l969j948j593o55m87J16k59L91N61J186J424
$$ 121999 98519 76962 53309 36223 25302 19284 15315 13367 11774 11119 10632 10748 10489 10880 11441 12627 14051
2694A4051L012N462J1305J9398K2524K2734K2823n846j6692j4977j3253M95Q092J1529J4585
$$ 14051 17063 22525 33830 53228 75752 98486 121309 115463 98771 83794 70541 71036 79128 90657 105242
2690A05242q314j9557j8761k0397j3515q336m567k980j555j297p47o33k48j37L59J99k8o04
$$ 105242 96928 77371 58610 38213 24698 16362 11795 8815 7260 5963 5216 4583 4335 4198 4557 4756 4728 4124
2686D124p05n75l35l45k14k89k12k58k0j88j9j26M3r2nj84J15lP0L4o6L7M9j16J13K39J22
$$ 4124 3419 2844 2509 2164 1950 1661 1449 1191 1171 983 964 838 881 789 784 600 715 712 782 816 750 787 836 720 833 1072 1194
2679A194P7K14RN2k5q4r1NL8L3k98j45k95j38km1j99JO8o7K0R0j37p9L2J75M4N4oJ72j4J39
$$ 1194 1271 1485 1494 1546 1521 1437 1346 1351 1389 1422 1124 979 684 546 544 503 304 305 373 306 326 416 279 200 232 407 451 505 499 671 657 796
2672G96r2j63j10k0r0O0L4O5qm5k27n4M4Q3l3n6M2j56j57K8N4N4Q8K48j41l0M5j02N3J00R8
$$ 796 704 541 431 411 321 381 415 480 472 427 200 146 190 273 240 184 226 70 -87 -59 -5 49 137 385 244 214 259 157 210 310 408
2664D08J08p4Q7P4K2k51l2j6O0M5%j15N0n9j97j14J24n2J08J1m1j5j0j6J1j16J7l1j2j2J28
$$ 408 516 442 529 603 625 374 342 326 386 431 431 316 366 307 110 -4 120 68 176 187 146 131 121 105 116 0 17 -14 -26 -38 90
2656I0L9m6j39j27J98J30k19O5M1M2L1N%k6j56KJ44K9j02J12nm2r9O0k2lL7Ok2kn6R3K7j6
$$ 90 129 83 -56 -183 15 145 -74 -9 32 74 105 110 110 84 -72 -70 74 103 1 113 108 66 -33 27 5 2 39 45 23 21 -35 58 85 69
2648F9q2K9n4K35J09jj42j72m9l5J14Q2n7j07Q3oj6P9j74m9J8N1J30Q1n6p4qpj01L6K68m2
$$ 69 -13 16 -38 197 306 305 163 -9 -58 -93 21 103 46 -61 22 16 0 79 -95 -144 -126 -75 55 136 80 6 -2 -9 -110 -74 194 152
2640A52j45M9m6K9J19Q1Nj57N0K15kL58K70N0J27n5j71p4O7qK02K20j04k19k66j29j40j97
$$ 152 7 56 10 39 158 239 244 87 137 352 350 708 978 1028 1155 1100 929 855 922 914 1116 1336 1232 1013 747 618 478 281
2633B81j67j06O4O1P3m2lr3j29J2J65n0r2Oq5O7Q0p0J33o4Q7j3J2J26j09p2N8m9j34M7J3N
$$ 281 114 8 72 133 206 164 161 68 -61 -49 116 66 -26 -20 -105 -38 42 -28 105 41 128 115 127 253 144 72 130 81 -53 -6 7 12
2626A2m9N2L5o1Q8j5m6J1J6Nk5j21M2J0N9j2rR9j6J49K91L4R4N7k4j90N5J1pK7J62K6l0k43
$$ 12 -37 15 50 -11 77 62 16 27 43 48 23 -98 -56 -46 13 1 -8 91 75 224 515 549 643 700 676 486 541 552 545 572 734 760 730 487
2617D87j89q9j38p2J70r7j2Q0k0n7oK7l9j11k8K2P5P9J08Q2J07Q6J24Pp2j11r6R2Q4k3J59
$$ 487 298 209 71 -1 169 72 60 140 120 63 57 84 45 -66 -94 -72 3 82 190 272 379 465 589 596 524 413 317 409 493 470 629
2610F29p1O8k88j44o3j9o8J3j48M6M5j1o4Qn7kj6K18J17j45j41P9j10P0n3P7J8J08N5q1O8
$$ 629 558 626 338 194 131 112 44 57 -91 -45 0 -11 -75 -67 -124 -126 -142 76 193 48 -93 -14 -124 -54 -107 -30 -12 96 151 70 138
2602A38O3K8j28q5k4N2l5j0L1j0r2N5L9qM3o1k9R8O8n3K5K3n1J5K9m9j01q0M1j5K0P0j2P5
$$ 138 201 229 101 16 -8 44 9 -1 30 20 -72 -17 22 14 57 -4 -33 65 133 80 105 128 77 92 121 72 -29 -109 -68 -83 -63 7 -5 70
2594G0N6m2j4j10m4o6L3o3oJ10J6m0m5M5l4P9N4m3K5k1%K3N7qM9j1oj1Po2l1O0K2j71J27O7
$$ 70 126 84 70 -40 -84 -150 -117 -180 -186 -76 -60 -100 -145 -100 -134 -55 -1 -44 -19 -40 -40 -17 40 32 81 70 64 53 60 -2 -33 27 49 -122 5 72
2585G2k1oK2j30q4roP2P2O4l7J8J08l7n5r4P1qK1N0m6m8R3k1oN5m7L8m1j50k0L0o0O2j12K1
$$ 72 51 45 67 -63 -147 -156 -162 -90 -18 46 9 27 135 98 43 -51 20 12 33 83 37 -11 82 61 55 110 63 101 60 -90 -110 -80 -140 -78 -190 -169
2576a69LQ4K3J64R2m0j02r8J00l4l0o8l3R4J3m6k0M9Q2l8j55o4P2J32j3K3Q8J02n7j85q5J92
$$ -169 -166 -82 -59 105 197 157 55 -43 57 23 -7 -75 -108 -14 -1 -47 -67 -18 64 26 -129 -193 -121 11 -2 21 109 211 154 -31 -116 76
2568G6N8q5o2J62j25j2L6q1K7n4JJ38K2q2j84mM9P5J6k9l0k6j56J02K1Q7n6m8P5M7l8L7J8
$$ 76 134 49 -13 149 24 12 48 -33 -6 -60 -59 79 101 19 -165 -169 -120 -45 -29 -58 -88 -114 -270 -168 -147 -60 -116 -164 -89 -42 -80 -43 -25
2560b5p4K3j00L5J24J0O4m5j9O%j14J99p5k4o1M5j2o2P0j4q2J38P5J9r6q9L1j21Q9O6rr4K
$$ -25 -99 -76 -176 -141 -17 -7 57 12 -7 -1 -1 -115 84 9 -15 -76 -31 -43 -105 -35 -49 -131 7 82 101 5 -84 -53 -174 -85 -19 -28 -122 -120
2552a20Q2kM0j16n0P7L4P1o8j2M0j20J2K5j4k5J13q8j41J36J05r4R2K32j04j63J7j10J12r7
$$ -120 -38 -40 0 -116 -166 -89 -55 16 -52 -64 -24 -144 -132 -107 -121 -146 -33 -121 -262 -126 -21 -115 -23 209 105 -58 -41 -151 -39 -136
2545a36p4K56p4m1P3m4R1l5k2k0M5j13N1n7M1n1K1o4onJ4N5K6n0L8n7K7l5QO9Q1j62k7M2J42
$$ -136 -210 46 -28 -69 4 -40 51 16 -6 -26 19 -94 -43 -100 -59 -110 -89 -153 -159 -164 -150 -95 -69 -119 -81 -138 -111 -146 -138 -69 12 -150 -177 -135 7
2536Gq1K7j0m8M7N8R0n9j1NK5M9P5j46r3J0J53M0k1J8j06n6pr3J94k4n6M3k0j28J8J01p4k5
$$ 7 -74 -47 -57 -105 -58 0 90 31 20 25 50 99 174 28 -65 -55 98 138 117 135 29 -27 -34 -127 67 43 -13 30 10 -118 -100 1 -73 -98
2528i8O8N3P0j73J0J61m1n8m6O0o7Q4O8j07p5M3J2p0K8O6J05o0L4M4p7j8L7l0j06Q3K8n6m5
$$ -98 -30 23 93 -80 -70 91 50 -8 -54 6 -61 23 91 -16 -91 -48 -36 -106 -78 -12 93 33 67 111 34 16 53 23 -83 0 28 -28 -73
2520g3j23J17P2q7N5O4p3j43P9J31ln2j4o9Q0l4l7J07O0n5O2m7k0k6Q8O1pNJ1p1j38J9m6P8
$$ -73 -196 -79 -7 -94 -39 25 -48 -191 -112 19 16 -36 -50 -119 -39 -73 -110 -3 57 2 64 17 -3 -29 59 120 113 118 129 58 -80 -61 -107 -29
2511b9M8J08r6j23L8O2N1J3rj28j34q9J20J43n5O7M4j14j32K02J3L5K1n6J63Q1l6OJ9p9k5
$$ -29 19 127 31 -92 -54 8 59 72 63 -65 -199 -288 -168 -25 -80 -13 31 -83 -215 -13 0 35 56 0 163 244 208 214 233 154 129
2504A29oj09Q1M1q9pn6k4O5N9N6J15j73q1J23l1l4j84k2M2J0o6O4J57K6l2N9p1j0p4K5j4J00
$$ 129 123 14 95 136 47 40 -16 -40 25 84 140 255 82 1 124 93 59 -125 -147 -105 -95 -161 -97 60 86 54 113 42 32 -42 -17 -31 69
2496F9l2j03M7j3m1n6j20L2J31J53onq5O2n9M7M1k0k17J18N7K5p8j6j1K6P1Ok6p7rJ92j43
$$ 69 37 -66 -19 -32 -73 -129 -249 -217 -86 67 61 56 -29 33 -26 21 62 42 -175 -57 0 25 -53 -69 -80 -54 17 23 -3 -80 -89 103 -40
2488d0pj41R1M4M8mOK9M6j0Mj4m9k7q4%K9O1J18k00j7J08j36o1J76K5NJ12n1J07j45q8M8j01
$$ -40 -47 -188 -97 -53 -5 -9 -3 26 72 62 66 52 3 -24 -108 -108 -79 -18 100 -100 -117 -9 -145 -206 -30 -5 0 112 61 168 23 -65 -17 -118
2479a18m2K1P6L4N9j08O6J05J10K5j53j52rpR4q4K3J0Q3L1nk5j27J25K9l2p4m8P1J15j55j2
$$ -118 -160 -139 -63 -29 30 -78 -12 93 203 228 75 -77 -86 -93 1 -83 -60 -50 33 64 59 34 -93 32 61 29 -45 -93 -22 93 -62 -74
2471g4M4O1jl5J03r4n4k2r0K1L4J64J51j92l5J9k4rl4Mj4J13o4QO4J9k6p3l5O5K4n9m9R0J0
$$ -74 -30 31 30 -5 98 4 -50 -72 -162 -141 -107 57 208 16 -19 0 -24 -33 -67 -63 -77 36 -28 -20 44 63 37 -36 -71 -6 18 -41 -90 0 10
2463A0L4m8O4j49j40J25k3N0Q0L3pk5p6R0K35mo9p5K0j31J10n7r1m0NJ30PK6o6j16N6K6l7
$$ 10 44 -4 60 -89 -229 -104 -127 -77 3 36 29 4 -72 18 253 249 180 105 125 -6 104 47 -44 -84 -79 51 58 84 18 -98 -42 -16 -53
2455e3k0j0o0N6O3RJ01q4j25N7%QQ3q9M0P3m6r9Q5n8J9N9l4J53q2m6j6J2J82m6j07o3lM3l4
$$ -53 -73 -83 -143 -87 -24 -15 86 2 -123 -66 -66 -58 25 -64 -24 49 3 -96 -11 -69 -50 9 -25 128 46 0 -16 -4 178 132 25 -38 -41 2 -32
2446c2J9k3n5Q6o1m8P1K0Q8j8l5p9M7oJ6pk7J12O5j30k9J53k8j16l8o9K03m8m9L9J12M0o9
$$ -32 -13 -36 -91 -5 -66 -114 -43 -23 65 47 12 -67 -20 -26 -10 -17 -44 68 133 3 -26 127 99 -17 -55 -124 79 31 -18 21 133 173 104
2438A04j21o5J86p6j34P8J1O2ln7l3p3J05M0j44j1M4J09N0K9q2O4Jp1n7R1Jm4N5N3l0m1j0
$$ 104 -17 -82 104 28 -106 -28 -17 45 42 -15 -48 -121 -16 24 -120 -131 -87 22 72 101 19 83 84 13 -44 47 48 4 59 112 82 41 31
2430C1n6m7N0J9l6l9k9J13M3L6j7o3j2QJ22j3j92j06J27R0jj0M8lj05q9R0R1l4j06O1o8R7
$$ 31 -25 -72 -22 -3 -39 -78 -107 6 49 85 68 5 -7 1 123 110 -82 -188 -61 29 28 18 66 63 -42 -131 -41 50 16 -90 -29 -97 0
2422@jk6n5n9j0O6M9M1M9L0r9m3j4op4k7OK17M5l9r0L6k7o4M4P8O4l5n6J51K9o1j85L8N9m9
$$ 0 -1 -27 -82 -141 -151 -85 -36 5 54 84 -15 -58 -72 -78 -152 -179 -173 44 89 50 -40 -4 -31 -95 -51 27 91 56 0 151 180 119 -66 -28 31 -18
2413a8pp1lK2Pnq0m4j9Q1Q1J07Oj12P6K8o5k48L3J33O5J1m7K2N5j07O0Pr4q6Q0R6j1k4M1J08
$$ -18 -25 -96 -99 -77 -70 -75 -155 -199 -218 -137 -56 51 57 -55 21 49 -16 -264 -231 -98 -33 -22 -69 -47 8 -99 -39 -32 -126 -212 -132 -36 -47 -71 -30 78
2404G8k8Omj56L7K19qj32n0m4L7J70m7j6k4p6j01J10R0k5P9o4r1M1j0J1j65K4N5P5m0qMj06
$$ 78 50 56 52 -104 -67 152 144 12 -38 -82 -45 125 78 62 38 -38 -139 -29 61 36 115 51 -40 1 -9 2 -163 -139 -84 -9 -49 -57 -53 -159
2396a59p1P4L5J17l6m9K4lR3P4j04m5mo3J5nN6M9N6n3q3R9Q1L8l6N9K0j22K0L3j46j79O8M1
$$ -159 -230 -156 -121 -4 -40 -89 -65 -68 25 99 -5 -50 -54 -117 -102 -107 -51 -2 54 1 -82 17 98 136 100 159 179 57 77 110 -36 -215 -147 -106
2388a06m7n8P7M3kj6J10N0k8r9j2J1P3K9n8j19j8j1J14o3n4J08L5p7N4pmn5O4j43J1K3P5J24
$$ -106 -153 -211 -134 -91 -93 -109 1 51 23 -76 -88 -77 -4 25 -33 -152 -170 -181 -67 -130 -184 -76 -41 -118 -64 -71 -75 -130 -66 -209 -198 -175 -100 24
2380B4k9o7M2k6K0q1l2Q6J48l6K2J8N9o0P0r2n5oL5n5j5N1O0q6K7q4L6J42M2o1q9r3lj7P7
$$ 24 -5 -72 -30 -56 -36 -117 -149 -63 85 49 71 89 148 88 158 66 11 5 40 -15 -30 21 81 -5 22 -62 -26 116 158 97 8 -85 -88 -105 -28
2371b8K2o2j19Nl2N5K14P1j84r6l4pJ92R4r2Mj6L0L2l8m0q9N8N8o6l7J7J9L2q3M9o2K3O4j72
$$ -28 -6 -68 -187 -182 -214 -159 55 126 -58 -154 -188 -195 -3 91 -1 3 -13 17 49 11 -29 -118 -60 -2 -68 -105 -88 -69 -37 -120 -71 -133 -110 -46 -218
2362b18P5j4Q2m5J9m8j42Q8R3M1oP5O0j85kp0J06J41j11j04O7O9L5Q6m2n9J2O0m6L4o0Qoj03
$$ -218 -143 -157 -75 -120 -101 -149 -291 -203 -110 -69 -75 0 60 -125 -127 -197 -91 50 -61 -165 -98 -29 6 92 50 -9 3 63 17 51 -9 -1 -7 -110
2354a10K6J43k6n5No9L5J48N4M0m0n7m3j25R2K9J2o6M8O2L2K3j17j19N8K8j36O6R7J38j86
$$ -110 -84 59 33 -22 -17 -86 -51 97 151 191 151 94 51 -74 18 47 59 -7 41 103 135 158 41 -78 -20 8 -128 -62 35 173 -13
2347a3M4M6Jr0j5J8o4PO6j53N6L0k1o4O9J35l1k1Q8q7J0k0n3M6j02K5J6j7L4M8J9L1K1j7L4
$$ -13 31 77 78 -12 -27 -9 -73 -66 0 -153 -97 -67 -88 -152 -83 52 21 0 88 1 11 -9 -62 -16 -118 -93 -77 -94 -60 -12 7 38 59 42 76
2338G6M5j00n2l0M4Q3o8N2k7q5M7K5j3J3N9N7O3j05kj73n0N7J08j03M6K6l8r3O1J17P9p1n4
$$ 76 121 21 -31 -61 -17 66 -2 50 23 -62 -15 10 -3 10 69 126 189 84 82 -91 -141 -84 24 -79 -33 -7 -45 -138 -77 40 119 48 -6
2330fo6l1M4j6n8Q4J23k9n2Q0N5p3o5r1o1Q1J53n3j02J59J7j05k6M1o3l0J36p6o6N3P2Pp4
$$ -6 -72 -103 -59 -75 -133 -49 74 45 -7 73 128 55 -10 -101 -162 -81 72 19 -83 76 93 -12 -38 3 -60 -90 46 -30 -96 -43 29 36 -38
2322c8L7P0l8O2j15o3J6K27n3j10O2O7o6N0M1j40N3m0j17M2P8Q9k2l3p5O7Q5mj19Nq4j9R5
$$ -38 -1 69 31 93 -22 -85 -69 158 105 -5 57 124 58 108 149 9 62 22 -95 -53 25 114 92 59 -16 51 136 132 13 18 -66 -85 10
2314A0o0o5j19k8K09p1Q4N0j15J6L5m1L7OJ54L3o2j06P4p7Q4jM7k1o3J6N1j21k7j4n0L0O6
$$ 10 -50 -115 -234 -262 -53 -124 -40 10 -105 -89 -54 -95 -58 -52 102 135 73 -33 41 -36 48 47 94 73 10 26 77 -44 -71 -85 -135 -105 -39
2306c9J01j17JJ22J5M9j44M8J1p2N1j18m7R9M9q7k2nM6Q0op4p0P0k3N4M4n8j26j1O4J05j1
$$ -39 62 -55 -54 68 83 132 -12 36 47 -25 26 -92 -139 -40 9 -78 -100 -105 -59 21 15 -59 -129 -59 -82 -28 16 -42 -168 -179 -115 -10 -21
2298b1j5m6O9M7M8Qj11o7O7l7l9M0n0P5R6o3QJ09J2j15l8o5o4J0J16LK0k8Jj2J13o2q8k4j8
$$ -21 -36 -82 -13 34 82 90 -21 -88 -21 -58 -97 -57 -107 -32 64 1 9 118 130 15 -23 -88 -152 -142 -26 -23 -3 -31 -30 -42 71 9 -79 -103 -121
2289a21J2J97k6j87m1P2J3j5L8J5m9pP5J7n6N6J3Q5L0p3p4Lp0O4Q1Rj08l8KM5Q2m8P7j2n8
$$ -121 -109 88 62 -125 -166 -94 -81 -96 -58 -43 -92 -99 -24 -7 -63 -7 6 91 121 48 -26 -23 -93 -29 52 61 -47 -85 -83 -38 44 -4 73 61 3
2280Cj12J6LO0k3k8K6k8oJ50q3mK2ro3O7Q1N2j04L1K4Qr2P0q8n4R3J08l1j04p1N2o6RJ16M6
$$ 3 -109 -93 -90 -30 -53 -81 -55 -83 -89 61 -22 -26 -4 -13 -76 -9 72 124 20 51 75 83 -9 61 -27 -81 12 120 89 -15 -86 -34 -100 -91 25 71
2272G1n9o7J41K4o7Q3M0j35p0J32N4n2o4rj27j6J1J22j4n6P%j0nl0l4J6J05M4j55J16Pl4q
$$ 71 12 -55 86 110 43 126 166 31 -39 93 147 95 31 22 -105 -121 -110 12 -2 -58 -51 -51 -61 -66 -96 -130 -114 -9 35 -120 -4 3 -31 -39
2263c9j9J7j31N3R2M3lk6k9p9l7J84Q3j14r4l9N0P5l9J3J5ml0L6J9L3j4p4n8K5J19l8k0J1
$$ -39 -58 -41 -172 -119 -27 16 13 -13 -42 -121 -158 26 109 -5 -99 -138 -88 -13 -52 -39 -24 -28 -58 -22 -3 30 16 -58 -116 -91 28 -10 -30 -19
2255a9m6J9PL7Q1m5qL8q8O3JK5j22l6LJ72M0j0j04J30k0j24j7P1k2mP5j15l3O3K9j09lN4O9
$$ -19 -65 -46 -39 -2 79 34 26 64 -24 39 40 65 -57 -93 -90 82 122 112 8 138 118 -6 -23 48 26 22 97 -18 -51 12 41 -68 -71 -17 52
2246E2p7O2O9j10k17L4N2J32J19j4k6q3J03m0k4J61J26j67o1J3P8M7k56j11N6k5L1Ol5p7M4
$$ 52 -25 37 106 -4 -221 -187 -135 -3 116 102 76 -7 96 56 32 193 319 152 91 104 182 229 -27 -138 -82 -107 -76 -70 -105 -182 -138
2239a38M3j2q3rR3PN2l4J2j06o0Q0J00M4m9o2l4J10J03O9L8L7k36M0m2j2L6j1j05N9Q6j3M0
$$ -138 -95 -107 -190 -199 -106 -99 -47 -81 -69 -175 -235 -155 -55 -11 -60 -122 -156 -46 57 126 164 201 -35 5 -37 -49 -13 -24 -129 -70 16 3 43
2231D3N3l2N4p9q5j14n5P7O6N3O1o4o0RR3m6m7J60m0n2N9jn2n8n7m2J07J8K6L6J8jm0JR0m0
$$ 43 96 64 118 39 -46 -160 -215 -138 -72 -19 42 -22 -82 -73 20 -26 -73 87 47 -5 54 53 1 -57 -114 -156 -49 -31 -5 31 49 48 8 9 99 59
2222E9L0K9p8p9k7n2K6N1m0j26J03J45kK3n8Q5K2k16n5K05J6n1P7J9j43j6m5m5KO0N6Q8Ro
$$ 59 89 118 40 -39 -66 -118 -92 -41 -81 -207 -104 41 39 62 4 89 111 -105 -160 45 61 10 87 106 -37 -53 -98 -143 -141 -81 -25 63 72 66
2214F6j0Q5r9L8J6r1J1PlQ7j59o8NL7N3Rj4O8J59Kj09oN9P1j76p4Q8Q2l5n7m7j09p2p1K39
$$ 66 56 141 42 80 96 5 16 23 20 107 -52 -120 -115 -78 -25 -16 -30 38 197 199 90 84 143 214 38 -36 52 134 99 42 -5 -114 -186 -257 -18
2205a8J86j9n7j64J4R2j2j18j34PO9J3j0J24J08j41K4l0K3Q7m4l7m3J18l5J8om0m7pJ71n1
$$ -18 168 149 92 -72 -58 34 22 -96 -230 -223 -154 -141 -151 -27 81 -60 -36 -66 -43 44 0 -37 -80 38 3 21 15 -25 -72 -79 92 41
2197D1r6NJ55L9m8j42j39J3R9O7P9r1R1O6j12j8JK0O5j6j16qJ02M5r6N1N7L0p8j06R3R3K7
$$ 41 -55 -50 105 144 96 -46 -185 -172 -73 -6 73 -18 73 139 27 9 10 30 95 79 -37 -45 57 102 6 57 114 144 66 -40 53 146 173
2189A73m3J7N2J81L96P69M55O5m20o32n96l34j9j1J9N4M6p0p5J04j06l7K3O0L7p7n3J8K6P2
$$ 173 130 147 199 380 776 1545 2000 2065 1645 1013 417 83 64 53 72 126 172 102 27 131 25 -12 11 71 108 31 -22 -4 22 94
2182I4j24m7PJ29k9j9Q0n6p3J84j14MN8LMq4L1m4n3J13j07p7K0L2k8N2P2R7n2n5k1N5p7M9
$$ 94 -30 -77 -70 59 30 11 91 35 -38 146 32 36 94 97 101 17 48 4 -49 64 -43 -120 -100 -68 -96 -44 28 125 73 18 -3 52 -25 24
2174B4M5M2J19r6o1l9rL1Q4K0j40o0K9q2j55J09j2J14j4rn4mm9J20N8J1O6o7n8L2k2o8K5O5
$$ 24 69 111 230 134 73 34 25 56 140 160 20 -40 -11 -93 -248 -139 -151 -37 -51 -60 -114 -118 -167 -47 11 22 88 21 -37 -5 -27 -95 -70 -5
2165el5L8P1m4p8p8J06P1j8m4Q4K2R3n8m5r9l2p1Q5Q3P7n1j3n1L4N8j31Q8O6j9n8R9o0j50
$$ -5 -40 -2 69 25 -53 -131 -25 46 28 -16 68 90 183 125 80 -19 -51 -122 -37 46 123 72 59 8 42 100 -31 57 123 104 46 145 85 -65
2157f5L6m0m5O1KO5J64Pj8j30J2R9k2j18r7Q8R2Qk0Q1jp5K8k5k7k4M2m2o3J26n7l3J17p9m0
$$ -65 -29 -69 -114 -53 -51 14 178 185 167 37 49 148 126 8 -89 -1 91 99 79 160 159 84 112 87 60 36 78 36 -27 99 42 9 126 47 7
2148GL1j20o8k2l2J71mJ6oJM4j6m1j5k6J27Q3n0q3J47n1j2QP1j4q2j75K1Q4L5p3r8q7P3O0
$$ 7 38 -82 -150 -172 -204 -33 -37 -21 -27 -26 18 2 -39 -54 -80 47 130 80 -3 144 93 81 89 160 146 64 -111 -90 -6 29 -44 -142 -229 -156 -96
2140i6p0q5Q1J16J03j14J3j0M6K6l8j3j49R6k8n1P3J24M5j88J37J8J87j01j12R3N5n3n3r6
$$ -96 -166 -251 -170 -54 49 -65 -52 -62 -16 10 -28 -41 -190 -94 -122 -173 -100 24 69 -119 18 36 223 122 10 103 158 105 52 -44
2133d4N5n2P6j10N3k7j3M2P3L8j61J8L4m9j1J5J3j35N4R1q3J58K4o7K3M4r6Q3O5o0J20q1j36
$$ -44 11 -41 35 -75 -22 -49 -62 -20 53 91 -70 -52 -18 -67 -78 -63 -50 -185 -131 -40 -123 35 59 -8 15 59 -37 46 111 51 171 90 -46
2124d6j2n2p0J5J50pl0P1l8p8k4O5K5nP3o6o1po8Q3J2R4lm2n3L4N4jk6rj8m5P3J52q9j9M2
$$ -46 -58 -110 -180 -165 -15 -22 -52 19 -19 -97 -121 -56 -31 -36 37 -29 -90 -97 -165 -82 -70 24 21 -21 -74 -40 14 13 -13 -22 -40 -85 -12 140 51 32 74
2115G4Q4l6nN0r5r9oL7opj22P4M7M0k0M5j5p5O9Ro7p0J2k8J5l4J3O2o4N8J85j5m5N0k9n0L9
$$ 74 158 122 117 167 72 -27 -33 4 -2 -9 -131 -57 -10 30 10 55 40 -35 34 43 -24 -94 -82 -110 -95 -129 -116 -54 -118 -60 125 110 65 115 86 36 75
2106G5k08P5J26J29k7J8j03j48O8r5O6n2J03O5j39j54P9O4jJN2j47k1J08L2N4M1N0q3j2M1
$$ 75 -133 -58 68 197 170 188 85 -63 5 -90 -24 -76 27 92 -47 -201 -122 -58 -59 -58 -6 -153 -174 -66 -34 20 61 111 28 16 57
2099E7JK3m6p9lJ08pO4oNj12r6L3J06N0K9m5J7J15M2n3j85k5j5j2j9J21o6qQn3qJ6l9N0O8
$$ 57 58 81 35 -44 -47 61 54 118 112 117 5 -91 -58 48 98 127 82 99 214 256 203 18 -7 -22 -34 -53 68 2 -6 2 -51 -59 -43 -82 -32 36
2090C6l5L1r0O3n1jq6K9J01Jk7P3p5k0Pj0O9O9k0j9q2m0O9l8j01K7M2N6K8n5j1O7p3PP6R9
$$ 36 1 32 -58 5 -46 -47 -133 -104 -3 -2 -29 44 -31 -51 -44 -54 15 84 64 45 -37 -77 -8 -46 -147 -120 -78 -22 6 -49 -60 7 -66 -59 17 116
2081A16n9j64M0M6K9J19L1om2j74j52J77p6j4M9jj4J16J2Q1o9Mpl4j60j2P4j9j1J81n7M5j16
$$ 116 57 -107 -67 -21 8 127 158 152 110 -64 -216 -39 -115 -129 -80 -81 -95 21 33 114 45 49 42 8 -152 -164 -90 -109 -120 61 4 49 -67
2073f7o2Q1J2NL7M1l8M2K0m7m2P1N7r2K4J4q4q0P2J17j13np1J08O0k5j21K7K7M0R5k8p1j1
$$ -67 -129 -48 -36 -31 6 47 9 51 71 24 -18 53 110 18 42 56 -28 -108 -36 81 -32 -37 -108 0 60 35 -86 -59 -32 8 103 75 4 -7
2065gO3kn4j19J38J72j11n0K1J7j33n1O4O4O2n9M1oM4J7m4l2O6q4j38l1J56R1q2P7J27j09
$$ -7 56 54 0 -119 19 191 80 30 51 68 -65 -116 -52 12 74 15 56 50 94 111 67 35 101 17 -121 -152 4 95 13 90 217 108
2057A08j3j2m9Pq7m6J99j18rL6N2k1R0j3j54j33M0NM0Q5j8J18n3q8j27J96m5p9J41N1j00K4
$$ 108 95 83 34 41 -46 -92 107 -11 -20 16 68 47 137 124 -30 -163 -123 -118 -78 7 -11 107 54 -34 -161 35 -10 -89 52 103 3 27
2049B7l0O3N2p9J0L8j05J7L0%M1P3j34k8m4LJ34L3K5p1L2r4Qm3P2M7o0L0L0j21n0k0L8j75
$$ 27 -3 60 112 33 43 81 -24 -7 23 23 64 137 3 -25 -69 -66 68 101 126 55 87 -7 1 -42 30 77 17 47 77 -44 -94 -114 -76 -251
2041b51j51J54K29N9k71jN5J62K8q4O8M4N7m7l4q8p1M3J91MNJ17p8l6J3ML4n9j28L6O4Q8K1
$$ -251 -402 -248 -19 40 -231 -232 -177 -15 13 -71 -3 41 98 51 17 -71 -142 -99 92 96 101 218 140 104 117 121 155 96 -32 4 68 156 177
2033A77j7k7k2j01rm4K01J5j28O0ko6J3L6j25J69r2j14n3J89J7J5j13o6Q9Pj6K2j3J8M4l2
$$ 177 160 133 111 10 1 -43 158 173 45 105 103 37 50 86 -39 130 38 -76 -129 60 77 92 -21 -87 2 9 -7 15 2 20 64 32
2025C2O1j1m1L0K3K2j30j30J07J2J38l3j43nP6p9rk5J24j4j75%J80k0O9P2j8q4J27O3j97j50
$$ 32 93 82 41 71 94 116 -14 -144 -37 -25 113 80 -63 -68 8 -71 -80 -105 19 5 -170 -170 10 -10 59 131 113 29 156 219 22 -128
2017a28P6O2j5q8K8J43o6q5K3J4P6l2P7l8k8L1L4N2j17M7P8j11j8P1M8j43Lj7M4o8L9m0J22
$$ -128 -52 10 -5 -93 -65 78 12 -73 -50 -36 40 8 85 47 19 50 84 136 19 66 144 33 15 86 134 -9 -6 -23 21 -47 -8 -48 74
2009G4N2K4n3o7o9m1J08k6j11Q9P0L2q7p3k2J38m8m4m4M4K3j4Q5kl8R1M2k0o6M4N1j67o0R0
$$ 74 126 150 97 30 -39 -80 28 2 -109 -20 50 82 -5 -78 -100 38 -10 -54 -98 -54 -31 -45 40 38 0 91 133 113 47 91 142 -25 -85 5
2001Eon9R2O4l5J6M4j52o4O4J0P9mm7q5K7Q9q8M8K03p6k01J04R8j76p2j2O6J2Q6M3m9l0J21
$$ 5 -1 -60 32 96 61 77 121 -31 -95 -31 -21 58 54 7 -78 -51 38 -50 -2 201 125 -76 28 126 -50 -122 -134 -68 -56 30 73 24 -6 115
1992A15j05J7nK6J19J54l6j87N8j7j18P5J36l5j41qo0k1o0J7O3m9N2L9k3L8L9M4k14q3J68
$$ 115 10 27 22 48 167 321 285 98 156 139 21 96 232 197 56 48 -12 -33 -93 -76 -13 -62 -10 29 6 44 83 127 -87 -170 -2
1985bK0l9o2N1R1j0j3J19K7m0n1m3M9k1j17J36l6N9K0K2r2k5m1l8Q6M6n6n8N3R9n1LOm6K1
$$ -2 18 -21 -83 -32 59 49 36 155 182 142 91 48 97 76 -41 95 59 118 138 160 68 43 2 -36 50 96 40 -18 35 134 83 86 92 46 67
1976F7oL1j06m0j4M6J35J20q2rj7l6L0j01j11R6nN2N4k2L9R7o2m7J7j17J5K6k3NJ2J8P2rj9
$$ 67 61 92 -14 -54 -68 -22 113 233 151 142 125 89 119 18 -93 3 -2 50 104 82 121 218 156 109 126 9 24 50 27 32 44 62 134 125 106
1968A06oj5n4N1l5L9l1J40oj25K5k2j12j61N2K87J0j36L8j5m3K4k5J4P9l0NO5o1R5j05j5r7
$$ 106 100 85 31 82 47 86 55 195 189 64 89 67 -45 -206 -154 133 143 7 45 30 -13 11 -14 0 79 49 54 119 58 153 48 33 -64
1960f4L5n7Q6O8qMJ18k31L9m1m3M6J76%j82R9K1l7L5R1mk4M1p5j23L9P7n5P9L4o9M9o9jK6
$$ -64 -29 -86 0 68 60 64 182 -49 -10 -51 -94 -48 128 128 -54 45 66 29 64 155 151 127 168 93 -30 9 86 31 110 144 75 124 55 54 80
1951H0K1L5Lkk38K4J51J9r6LK1j17M7R5q4M6L0Q9l6r0j13P4j09L8J03J0J18P5m6j01km7J2
$$ 80 101 136 139 137 -101 -77 74 93 -3 0 21 -96 -49 46 -38 8 38 127 91 1 -112 -38 -147 -109 -6 4 122 197 151 50 48 1 13
1943A3J1j47PM5P1j07N6J8m4M2L9k0o3P8K06lK8j44J2o2K2j6jk9j10J6J67M7j05pj3J3Pp3
$$ 13 24 -123 -116 -71 0 -107 -51 -33 -77 -35 4 -16 -79 -1 205 202 230 86 98 36 58 42 41 12 -98 -82 85 132 27 20 7 20 27 -46
1935d6O3K1p1n0k9J8JM8J1j28R8m9j14Q8M8O2K9k3l4k5P9J46q8j3j08m5j4k9J13O6j40m6M0
$$ -46 17 38 -33 -83 -112 -94 -93 -45 -34 -162 -64 -113 -227 -139 -91 -29 0 -23 -57 -82 -3 143 55 42 -66 -111 -125 -154 -41 25 -115 -161 -121
1927a21J6j3O5J46p2K2J3oK2j82P4J08P7p9P3L5j93K2J23j03j86N0L6M1l0P8M1J15m8l5P1
$$ -121 -105 -118 -53 93 21 43 56 50 72 -110 -36 72 149 70 143 178 -15 7 130 27 -159 -109 -73 -32 -62 16 57 172 124 89 160
1919A60rn4j33n2NJ08J21Or5m1l9J7R9J8k00m8R8J24j58p6N3J02q0M5R7P8o8j54l2R0M9l8
$$ 160 151 97 -36 -88 -83 25 146 152 57 16 -23 -6 93 111 -89 -137 -39 85 -73 -149 -96 6 -74 -29 68 146 78 -76 -108 -18 31 -7
1911gj16N1M7L9M1O6p1O1p4N5ro3M6Qj73O2J5j4L7M1P4M0jj50K9O3m8n5L4N5lnp2J0j56k8
$$ -7 -123 -72 -25 14 55 121 50 111 37 92 83 20 66 74 -99 -37 -22 -36 1 42 116 156 155 5 34 97 49 -6 28 83 80 75 3 13 -143 -171
1902a71K31J13n5k9k0k6M7o2lL2n4n4j5O9L9N0rp7rL2p2J77l9r5O6KJ8l5p5O4j26OK2N3m8
$$ -171 60 173 118 89 69 43 90 28 25 57 3 -51 -66 3 42 92 83 6 -3 29 -43 134 95 0 66 68 86 51 -24 40 -86 -80 -58 -5 -53
1894e3K2J8j10K0J77o7l7J06p5Nq9M7PN0N2K1N3J8j5lJ12j11j29l7M8j17QM3jo6Ln9M9O4L9
$$ -53 -31 -13 -123 -103 74 7 -30 76 1 6 -83 -36 -29 21 73 94 147 165 150 147 259 148 19 -18 30 -87 -79 -36 -37 -103 -100 -159 -110 -46 -7
1885gM7k4kJ46j6M2j77J12N9j65m4Kl7O6l1K1k2K0P5m4k2k0J83P7r8r3K5k8J1j6j18L9k9Q3
$$ -7 40 16 14 160 144 186 9 121 180 15 -29 -27 -64 2 -29 -8 -30 -10 65 21 -1 -21 162 239 141 48 73 45 56 40 -78 -39 -68 15
1877A5J4Kj13k6K8N6N3Q0l0M3LN2j20o3n1R7K8O4J50j59j35o7QJ14K4M9n9K6J15L6l0j96Q
$$ 15 29 31 -82 -108 -80 -24 29 109 79 122 125 177 57 -6 -57 40 68 132 282 123 -12 -79 -71 43 67 116 57 83 198 234 204 8 16
1869A6J26j8j39P0j3k0j1KJ67l9km2n9q6J19o2OR2o1n4N8J29j81oPM2k5k8J37P0r5J0m9q5
$$ 16 142 124 -15 55 42 22 11 13 180 141 139 97 38 -48 71 9 15 107 46 -8 50 179 -2 -8 -1 41 16 -12 125 195 100 110 61 -24
1861b4R0K11o3P5j49k86K4J19J65M0k14m1O5N9q6J32j1j4r9L2O5p5n1L8N6k4mk0J8K2l4N7
$$ -24 66 277 214 289 140 -146 -122 -3 162 202 -12 -53 12 71 -15 117 106 92 -7 25 90 15 -36 2 58 34 30 10 28 50 16 73
1853G3j23K4j2lJ14L5QJ8q0P5n5q7m5Q3L4N8qJ7j39k6J32K2j6O8J8j41j8rj04j4O4Qr4J03
$$ 73 -50 -26 -38 -41 73 108 116 134 54 129 74 -13 -58 25 59 117 109 126 -13 -39 93 115 99 167 185 44 26 17 -87 -101 -37 -29 -123 -20
1844b0ln8Q0K3lJ58J27j56j08Q6o2J6N4n8k9m8l8J34L4q7n2O4KL8JO4l%n9rr7m6n4L0j1R0
$$ -20 -23 -81 -1 22 19 177 304 148 40 126 64 80 134 76 47 -1 -39 95 129 42 -10 54 56 94 95 159 156 156 97 88 -9 -55 -109 -79 -90 0
1836@o9n1j3lJ32J63l7J6l0j27MJ9j5P2j20Ml6R8R6l4p1N4Q9Jr6K6n4RJ0J9l6N7J8o1j08L0
$$ 0 -69 -120 -133 -136 -4 159 122 138 108 -19 -15 4 -11 61 -59 -55 -91 7 103 69 -2 52 141 142 46 72 18 27 37 56 20 77 95 34 -74 -44
1827d4Q1J00j05p3J29K1j01O2J8L5M9j06o5J7%J95j3j71r7J0N3KQJ07Q4lKj2kl9j34o7J16
$$ -44 37 137 32 -41 88 109 8 70 88 123 172 66 1 18 18 213 200 29 -68 -58 -5 -3 5 112 196 193 195 183 181 142 8 -59 57
1819E7J2j9k1P8O3n0L9m0o7n5m7Q3k5P5n9j8j49K2J41N7lN2m2j00j37K7J18o7P2Q7m8m2O4
$$ 57 69 50 29 107 170 120 159 119 52 -3 -50 33 8 83 24 6 -143 -121 20 77 74 126 84 -16 -153 -126 -8 -75 -3 84 36 -6 58
1811E8k2n0r3j1R5l7j2k2L2M4J22K5q3Q1J94j08j41m2J17O3j24j37J05m3Q1R9j69p4Q1LK3
$$ 58 36 -14 -107 -118 -23 -60 -72 -94 -62 -18 104 129 46 127 321 213 72 30 147 210 86 -51 54 11 92 191 22 -52 29 32 55
1803E5J27m1L2oj93j8j4N8P1K6O1r8j24J6pK2O5j74o3J48j3l7j2Nm5M2k0J22K5j60m6J8N7
$$ 55 182 141 173 167 -26 -44 -58 0 71 97 158 60 -64 -48 -55 -33 32 -142 -205 -57 -70 -107 -119 -114 -159 -117 -137 -15 10 -150 -196 -178 -121
1795a21j5L9K01J1k0O1o4p3J90q4j7K9L5q3k13M3k7m9l5J48J5J75Pj61L3M2R3M8q9M2K9q4
$$ -121 -136 -97 104 115 95 156 92 19 209 125 108 137 172 89 -124 -81 -108 -157 -192 -44 -29 146 153 -8 25 67 160 208 119 161 190 106
1787A06J19o7K4Lr9j09j08k8K1O0N3N5p7k1J17K3O2Nk0nj7N9K4pM8q0m0k21l4J27j06l9J76
$$ 106 225 158 182 185 86 -23 -131 -159 -138 -78 -25 30 -47 -68 49 72 134 139 119 114 97 156 180 173 221 141 101 -120 -154 -27 -133 -172 4
1779DN4N6j1j38p2J4M1J54j02n9MK4J67J05j19L3j41%Q5J92o3J0j05q4l5kJ3J37j35j48j1
$$ 4 58 114 103 -35 -107 -93 -52 102 0 -59 -55 -31 136 241 122 155 14 14 99 291 228 238 133 49 14 12 25 162 27 -121 -132
1772a32J71pP3j1k9Qj6m3O2j2j0o4jK3j6j46J34N9L7l2j35M1l2Q5o7n8P2O0J0l1kj7Q7N8j05
$$ -132 39 32 105 94 65 73 57 14 76 64 54 -10 -11 12 -4 -150 -16 43 80 48 -87 -46 -78 7 -60 -118 -46 14 24 -7 -9 -26 61 119 14
1763A4M3%j32L4j4l5K39Q8j58R0r7p1k0j0mq2JJ36N3p5R2m4qo8k9J98m4j44N8P9k8J7P5J5
$$ 14 57 57 -75 -41 -55 -90 149 237 79 169 72 1 -19 -29 -33 -115 -114 22 75 0 92 48 40 -28 -57 141 97 -47 11 90 62 79 154 169
1755A69n0M5o4j17M9K8P8m3Kj4P7n5L0J38N0j00j21NN9j36L1J64n5o2q2j00m0J6M2J24R5k0
$$ 169 119 164 100 -17 32 60 138 95 97 83 160 105 135 273 323 223 102 107 166 30 61 225 170 108 26 -74 -114 -98 -56 68 163 143
1747A43m1r3N7J65n4j33k1k6o8R7qp9J6J29J18q8m4n6N6M6j43P4K9m5J4k1M1m1O5N2m4p4p0
$$ 143 102 9 66 231 177 44 23 -3 -71 26 18 -61 -45 84 202 114 70 14 70 116 -27 47 76 31 45 24 65 24 89 141 97 23 -47
1739d7k2J12l3K2r8J45o7o1%M9l0j1O9p7J04O3O8k9j05K2l0J01M8j60j5P7j05QM9J71j83M
$$ -47 -69 43 10 32 -66 79 12 -49 -49 0 -30 -41 28 -49 55 118 186 157 52 74 44 145 193 33 18 95 -10 -2 47 218 35 39
1731C9k6j02M5K5k4J25mQ1j2Km0r5M2P9PK1j26O0jl4L4NJ37J6j06n6N4j8p3J17j65k5PK4R1
$$ 39 13 -89 -44 -19 -43 82 78 159 147 149 109 14 56 135 142 163 37 97 96 62 96 101 238 254 148 92 146 128 55 172 7 -18 -11 13 104
1722A04p0J50q1m7o8n3M1o1M7n1m3J06M0L1J7r6M8j2L9P6MmPR1l2m8rp8J77p5J6j33M3oln
$$ 104 34 184 103 56 -12 -65 -24 -85 -38 -89 -132 -26 14 45 62 -34 14 2 41 117 121 117 124 215 183 135 126 48 225 150 166 33 76 70 67 62
1714F2m2oNM6J9l2N2N1j05jO5O4L0J4j16k8j4J29Q0n9N4q6K5o6o7o9J16O4o4l9Q6R5j38j28
$$ 62 20 14 19 65 84 52 104 155 50 49 114 178 208 222 106 78 64 193 273 214 268 182 207 141 74 5 121 185 121 82 168 263 125 -3
1705cJ04J69j88k9J1l2oJ15PL6o8oK2M8J28j05p5L6j12n3Jr9J45j1JP5L2p2p1n8O9L5Q6q9
$$ -3 101 270 82 53 64 32 26 141 148 184 116 110 132 180 308 203 128 164 52 -1 0 -99 46 35 36 111 143 71 0 -58 11 46 132 43
1697D3j1J45j00k6R2n6J8Qk3j71k5K5J3K4J90N8l1o4p0J9m7L2O1l2P1L4o2pM3K5J2jj4j38
$$ 43 32 177 77 51 143 87 105 113 90 -81 -106 -81 -68 -44 146 204 173 109 39 58 11 43 104 72 143 177 115 108 151 176 188 187 173 35
1689C5P5P7J1M5j56l6j8o4j3j05J98L0o6L7j02%P5q4Q1R7M2L6p3J8k4j8N8r8j23L4k2L7O9
$$ 35 110 187 198 243 87 51 33 -31 -44 -149 49 79 13 50 -52 -52 23 -61 20 117 159 195 122 140 116 98 156 58 -65 -31 -53 -16 53
1681E3J06Lo9n2p0L9J38j02M4n9m3O7J23j53l2m1n9J00j7ok9R4j6j29N8MJ46k5o5o0M2m4P5
$$ 53 159 162 93 41 -29 10 148 46 90 31 -12 55 178 25 -7 -48 -107 -7 -24 -30 -59 35 19 -110 -52 -48 98 73 8 -52 -10 -54 21
1673B1M6MJ2J3K3m6M6J33J1n7j40K8q2O6p8M6R6p4r7R1Om3P9rr0q5Q5M5rK1q3L7o3O9J10M2
$$ 21 67 71 83 96 119 73 119 252 263 206 66 94 12 78 0 46 142 68 -29 62 68 25 104 95 5 -80 5 50 41 62 -21 16 -47 22 132 174
1664A74j28J0m4O1p3O3Oq9Q9P2M8M5p5J68J01M7K00M31k5l50k56k42o3J11m8o8M3L5O0M5k3
$$ 174 46 56 12 73 0 63 69 -20 69 141 189 234 159 327 428 475 675 1106 1081 731 475 233 170 281 233 165 208 243 303 348 325
1656C25n9j28N5n1m0M3j43P7R8L0J64J2J67J82O68J050L39p38q16m67l29j07k5n4n1j72N6
$$ 325 266 138 193 142 102 145 2 79 177 207 371 383 550 732 1400 2450 2789 2051 1235 768 439 332 307 253 202 30 86
1650H6J58j29j8J41j05J5Q8j21M4R3L4J1mK4P2L23O65J045P58o20j116o78l82R6l7j33l1L6
$$ 86 244 115 97 238 133 148 236 115 159 252 286 297 293 317 389 712 1377 2422 3180 2560 1444 766 384 480 443 310 279 315
1643C15j22n7k0O1N6jj05Nk9N1j4p9J6m9P4M9J7L01K59K26k8m84j91j36j08J33J00M0o9j03
$$ 315 193 136 116 177 233 232 127 132 103 154 140 61 77 28 102 151 168 469 728 954 926 442 251 115 7 140 240 280 211 108
1635A08pQj7LN7J51m8k9r7j18P5JP6Kj15Q0J55K6Nl0m3l6j16r1N1lJ4k9n5N9RJ5M1K3J0o8
$$ 108 101 109 92 95 152 303 255 226 129 11 86 87 163 165 50 130 285 311 316 286 243 207 91 0 51 48 62 33 -22 37 46 61 102 125 135 67
1627F7o7O8K0P2N2rJ5L3j77k3m7n3Q3O3nq0O6J02k1j4mr4PN0k7N3P0Nq8J0o0m0M3J02k8q2
$$ 67 0 68 88 160 212 203 218 251 74 51 4 -49 34 97 92 12 78 180 159 145 141 47 54 104 77 130 200 205 117 127 67 27 70 172 144 62
1618F2O9M8o4k08KM3J06j6k25M8K57Q3p2QJ06R6j3j69K0o4M2J18k4j77R7qo0L1k6O3k0j26
$$ 62 131 179 115 -93 -91 -48 58 42 -183 -135 122 205 133 141 247 343 330 161 181 117 159 277 253 76 173 165 105 136 110 173 153 27
1610B7Q7k1O0k2K6q7k4RJ61J11J3o8k8r2M5j13M1J08N5j37r6n1K28n2L3p5j41j02K15R6k1
$$ 27 114 93 153 131 157 70 46 55 216 327 340 272 244 152 197 84 125 233 288 151 55 4 232 180 213 138 -3 -105 110 206 185
1602A85K3N8l9j29j34Q9N7M6j73L6P2J52n5J6pq1O6l7m1L6p6R9R3k2m3N9K6Q5J8J4L3k1N1
$$ 185 208 266 227 98 -36 53 110 156 -17 19 91 243 188 204 197 116 182 145 104 140 64 163 256 234 191 250 276 361 379 393 426 405 456
1594D56j12q7K76k9J53K22J20J91N19J280K756L141Q13k422k720j814j021m86l53j88N6n3
$$ 456 344 257 533 504 657 879 999 1190 1709 2989 5745 8886 9699 7277 4557 2743 1722 1236 883 695 751 698
1589F98j11j18j02l9J24j07k9m2N9r0p1n7J52lJ08q2j29O5l4J08J7j75K2N4l9j7J00K4k8j3
$$ 698 587 469 367 328 452 345 316 274 333 243 172 115 267 264 372 290 161 226 192 300 317 142 164 218 179 162 262 286 258 245
1582B45N6j25l0L5MJ50Q5Kq9J9N6m5q0j33Q1n5NN1M5j02K2Q9j60M4OK8m3M7L3P1J9m4nJ6n
$$ 245 301 176 146 181 185 335 420 422 333 352 408 363 283 150 231 176 181 232 277 175 197 286 126 170 176 204 161 208 241 312 331 287 282 298 293
1573B93N4j12p5R4R9l0O9QJ9j04q5p8m3MP3M6K04N3NP8L7nr6o8p2K0Lk5P8j26P4j2K2O2l3
$$ 293 347 235 160 254 353 323 392 400 419 315 230 152 109 113 186 232 436 489 494 572 609 604 508 440 368 388 391 366 444 318 392 380 402 464 431
1564D31k2K9r3p1k6N9J2Q5L3p0mQ7m8l5m1J01J02J57p1k33oL6N1K4PM5p8l9P0J73K2M0q9j5
$$ 431 409 438 345 274 248 307 319 404 437 367 363 450 402 367 326 427 529 686 615 382 376 412 463 487 494 539 461 422 492 665 687 727 638 623
1556F23k9J6j53P4J42J33p7J64n6j12Q6J29k0jp0oJ03J05k01NJ40Q1K3J80K64L71Q24K016
$$ 623 594 610 457 531 673 806 729 893 837 725 811 940 920 919 849 843 946 1051 850 855 995 1076 1099 1279 1543 1914 2738 4754
1549D754L094J002k488k405j333n26n45k43l0K7j97lJ22K01R9R2Lp4j07J8j94J15P2R4j78
$$ 4754 7848 8850 6362 3957 2624 2098 1553 1310 1280 1307 1110 1107 1229 1430 1529 1621 1624 1550 1443 1461 1267 1382 1454 1548 1370
1543A370J9j6J04J5K50O5K07M0j7j20K87K42J57k18M4qK5p5J15l6P9K2J35P4qo0J95P2J78
$$ 1370 1389 1373 1477 1492 1742 1807 2014 2054 2037 1917 2204 2446 2603 2385 2429 2421 2446 2371 2486 2450 2529 2551 2686 2760 2752 2692 2887 2959 3137
1536C137j17MO2K49J25K75p9P5j19J56J04K46J03K05m6J85O5L92K79L84N9L63M4N1J81M79
$$ 3137 3020 3024 3086 3335 3460 3735 3656 3731 3612 3768 3872 4118 4221 4426 4380 4565 4630 5022 5301 5685 5744 6107 6151 6202 6383 6862
1530F862J88K06J93N67K63N82M98Q17J24K72L53O53O42P86P69J335J361J845K134K004J277
$$ 6862 7050 7256 7449 8016 8279 8861 9359 10176 10300 10572 10925 11578 12220 13006 13775 15110 16471 18316 20450 22454 23731
1525B3731J912J395J824L158L877L916N979R593J5103J8192J5015J2922K3512M6339Q9806
$$ 23731 25643 27038 28862 32020 35897 39813 45792 55385 70488 88680 103695 116617 140129 186468 276274
1521B76274J86960M17103O78065L87075l40254o12945m05358k23987j27403p6157m5109k6566
$$ 276274 463234 880337 1558402 1945477 1605223 992278 586920 362933 235530 159373 114264 87698
1518H7698j8279j5120j1042p114n130m659l915l121l074k320j690k014j289l03l28m36l83
$$ 87698 69419 54299 43257 36143 31013 26354 22439 19318 16244 13924 12234 10220 8931 8628 8300 7864 7481
1514G481l42l90m40l03k84m39m28l63k91k19j80k01k38l99j40j11j29l66j65k16j01KL63P9
$$ 7481 7139 6749 6309 6006 5722 5283 4855 4492 4201 3982 3802 3601 3363 2964 2824 2713 2584 2218 2053 1837 1736 1738 2101 2180
1508B180q9j48j49j23J65N6M7j62j88j45M1q0R6n4L1j36K4r4J7o1Qo1j14r7M6k11Q4K6J15
$$ 2180 2091 1943 1794 1671 1836 1892 1939 1777 1589 1444 1485 1405 1501 1447 1478 1342 1366 1272 1289 1228 1236 1175 1061 964 1010 799 883 909 1024
1501A024%K38J57O6k46j05j26Jj13M5p3Jj72o0L6N3p4Nl4n1j9l8k5J1j33J1j0P9p6l8NJ05
$$ 1024 1024 1262 1419 1485 1239 1134 1008 1009 896 941 868 869 697 637 673 726 652 657 623 572 553 515 490 501 368 379 369 448 372 334 339 444
1493D44K7J19q6l7mk33j01J03j9q7J61J84j07R6O0l4ln2l5O0nj1p0Mj05M9O4n4j4J23Lk12
$$ 444 471 590 504 467 463 230 129 232 213 126 287 471 364 460 520 486 483 431 396 456 451 440 370 374 269 318 382 328 314 437 440 228
1485B28o8J42n8M2o0P7l4J27j17j03%m9j7M7N3N6j38O3q0RJ30K42k3r2J1o5M7J50r1j30j11
$$ 228 160 302 244 286 226 303 269 396 279 176 176 127 110 157 210 266 128 191 111 120 250 492 469 377 388 323 370 520 429 299 188
1478A88k8j9p2R8Pq8n9o9J2l9R6J27J0j87L0O7M6m8n0q0mj59J0K20P9J83J55j6QLj38j37k2
$$ 188 160 141 69 167 174 86 27 -42 -30 -69 27 154 164 -23 7 74 120 72 22 -58 -62 -221 -211 9 88 271 426 410 418 421 283 146 124
1470A24N2N6n2J9j64J2P8j9J26NL3n2O4Q4p3o1K2p7J5J1n6r0Q3N9j20J03l7m3n7K0Q2K12K8
$$ 124 176 232 180 199 35 47 125 106 232 237 270 218 282 366 293 232 254 177 192 203 147 57 140 199 79 182 145 102 45 65 147 359 387
1462C87j21n5P1k4l8qK7K1j38J4m9j2n7J57k0l6J30k1j03M5l0n5RJ08l7J20l4o9n5m9M4M1
$$ 387 266 211 282 258 220 212 239 260 122 136 87 75 18 175 155 119 249 228 125 170 140 85 94 202 165 285 251 182 127 78 122 163
1454A63m5J39P8oj97or5J14O9MM4R7k8p1j6K1J77J43J56R9Q4K16K54M08P59J728K953K281
$$ 163 118 257 335 329 132 126 31 145 214 218 262 359 331 260 244 265 442 585 741 840 924 1140 1394 1802 2561 4289 7242 9523
1447I523o91k744k247j369p55m47l91k61p4j23L3L9q5j30o8l6j35N7J31M0j07J1K9m5k3j0
$$ 9523 8832 6088 3841 2472 1717 1270 879 618 544 421 454 493 408 278 210 174 39 96 227 267 160 171 200 155 132 122
1440A22K5m7R3M0K8r2o7o8J36k4j2J28o3l6r9N7o8Q4j32Mj3N5J4Lp1RK0o4Q8Kj48k0J74P4
$$ 122 147 100 193 233 261 169 102 34 170 146 134 262 199 163 64 121 53 137 5 9 -4 51 65 68 -3 6 26 -38 50 52 -96 -116 58 132
1432A32n2J23pn2l6r2KJ67L0oj39l8J31O3j70m8P9K9L9k1K3M2l9o1Q4R6j36r6L3J16j22p8
$$ 132 80 203 196 144 108 16 18 185 215 209 70 32 163 226 56 8 87 116 155 134 157 199 160 99 183 279 143 47 80 196 74 -4
1424dL1R0J9p8Q4r4L2j02j0N3J39k9P4n1j26l6L2M2r0KJ58k1J6p4PN1N0n6ML7j2m2M9M8n9
$$ -4 27 117 136 58 142 48 80 -22 -32 21 160 131 205 154 28 -8 24 66 -24 -22 136 115 131 57 64 115 165 109 113 150 138 96 145 193 134
1416A34L3J41k5j39p1J31J11j19j14k0N7j02j34k0J02J29l6J5P3L3k6nP1k7lP9j51J2l8m4
$$ 134 167 308 283 144 73 204 315 196 82 62 119 17 -117 -137 -35 94 58 73 146 179 153 148 219 192 189 268 117 129 91 47
1408D7Q4P4p5rQ4j10q5J1L5K1m4L6p0N1j13R1M9k3N5M1j38n3m1o1Q2J9O7L4J3K6R5n6N7j3
$$ 47 131 205 130 121 205 95 10 21 56 77 33 69 -1 50 -63 28 77 54 109 150 12 -41 -82 -143 -61 -42 25 59 72 98 193 137 194 181
1400A81j41L8k3j8K17o7r5j2mL3J16k4n6j54O3K15j97M4P2n8rk6J6N4O1j22oK0m5P6k3K4p
$$ 181 40 78 55 37 254 187 92 80 76 109 225 201 145 -9 54 269 72 116 188 130 121 95 111 165 226 104 98 118 73 149 126 150 143
1392A43l2l4J00o7J5j03K3mpP6j59m3J31QJ02N7J3p8n4Qm9P2n3j7l1O5qm6J00o6k9qM9K5M4
$$ 143 111 77 177 110 125 22 45 41 34 110 -49 -92 39 47 149 206 219 141 87 95 46 118 65 48 17 82 74 28 128 62 33 25 74 99 143
1384A43J7q8n5qm2K1J30m3J01p9q5n3j7L4k1M6m4J72m1j6J23ql0r1k6L1Mj4j6M8K8o1J14o
$$ 143 160 72 17 9 -33 -12 118 75 176 97 12 -41 -58 -24 -45 1 -43 129 88 72 195 187 157 66 40 71 75 61 45 93 121 60 174 168
1375A68k6j39j0Q4q2Q6j7K8R4k9o3m8K5J79Ql1j11q1qNk7N7j51K6O7Q3n0j03P3P8M6j24j7
$$ 168 142 3 -7 77 -5 81 64 92 186 157 94 46 71 250 258 227 116 35 27 32 5 62 -89 -63 4 87 37 -66 7 85 131 7 -10
1367a0P6P4k15Q8J37l6k21K7Q0M1Q2J6J8Rn5J9n1nkl8J22L4j16M5L8J19k7Mk8j04j86K3N4
$$ -10 66 140 -75 13 150 114 -107 -80 0 41 123 139 157 166 111 130 79 74 72 34 156 190 74 119 157 276 249 253 225 121 -65 -42 12
1359A2Q5PJ1l6J07Lj02M2P9k8j36j72N7j8L4Q6J83J6j39r3P0o2n9kJ66J09J2n1L6N8j3n5n
$$ 12 97 104 115 79 186 189 87 129 208 180 44 -128 -71 -89 -55 31 214 230 91 -2 68 6 -53 -55 111 220 232 181 217 275 262 207 202
1351B02J2l4k0j47O0M2l3o6j6J86J6j01J9j6N2L6j19K7N3P0m3r3PR4j18NL6k0m5J59R1j32
$$ 202 214 180 160 13 73 115 82 16 0 186 202 101 120 104 156 192 73 100 153 223 180 87 94 188 70 75 111 91 46 205 296 164
1343A64r7k16L1J22MQ9K2o7r4R2K2q9O0J5L9RLj60O4J44k0m4m2J5q4J4O3K08l0K3j68J18J29
$$ 164 67 -149 -118 4 8 97 119 52 -42 50 72 -17 43 58 97 106 109 -51 13 157 137 93 51 66 -18 -4 59 267 237 260 92 210 339
1335C39n8q8j34n6Q4j8j9R0k1j5k4J42po5j23M2q0o3N9Q7N2R3l8n4m6rN3N3J7r7m2p2J03r
$$ 339 281 193 59 3 87 69 50 140 119 104 80 222 215 150 27 69 -11 -74 -15 72 124 217 179 125 79 70 123 176 193 96 54 -18 85 76
1327G6R1R7q0o5j66MJ0J72R0Km8nq1p9J12jQ6j5J00j1p7N9k1o1j9J16qn7n6pp1L7QJ8N1j97
$$ 76 167 264 184 119 -47 -43 -33 139 229 231 183 178 97 18 130 129 215 200 300 289 212 271 250 189 170 286 278 221 165 158 87 124 132 150 201 4
1318DL1R9p4q6N5P5O3N4l5K4l0N1k7Q8PL6j97K6O9m3m8m3O1JK8J45j10l2r6Q2J5j18J6P8N3
$$ 4 35 134 60 -26 29 104 167 221 186 210 180 231 204 292 299 335 138 164 233 190 142 99 160 161 189 334 224 192 96 178 193 75 91 169 222
1309B22M7l3q0k22MJ07j2O1O0J22q9K9n6j33Pj8J64R4p1k0l6k8p8J27K6qM1o9o7l3J66k6p3
$$ 222 269 236 156 -66 -62 45 33 94 154 276 187 216 160 27 34 16 180 274 203 183 147 119 41 168 194 186 227 158 91 58 224 198 125
1301A25J7l2n0LK26m8ll2j95q3K4mk2J18r8o9J42J79L7m1l6P0l7Oj13K0Q8p8L2J03j46k4O4
$$ 125 142 110 60 63 289 241 238 206 11 -72 -48 -52 -74 44 -54 -123 19 198 235 194 158 228 191 197 84 104 192 114 146 249 103 79 143
1293A43k6k0NK0O6p6k2r1J9J91L7l2l3Rp1q2p5q1O0N7J15J04o4J1K2O1j17n2R2n6r5J29j22
$$ 143 117 97 102 122 188 112 90 -1 18 209 246 214 181 190 119 37 -38 -119 -59 -2 113 217 153 164 186 247 130 78 170 114 19 148 26
1285B6q0J28K5R0j49P1P6k3j05m4K1M2j0R3J8j45q7J44O0R2n3oj40J22n6j10oJ11k2J06J6
$$ 26 -54 74 99 189 40 111 187 164 59 15 36 78 68 161 179 34 -53 91 151 243 190 184 44 166 110 0 -6 105 83 189 205
1278B05l4oq6M3Jn2ln8O0K7K7n5R7k3J3Q8k5L0L9m4n7j3J08o0j50P7O3j08l8M5R8j50K3j9
$$ 205 171 165 79 122 123 71 68 10 70 97 124 69 166 143 156 244 219 249 288 244 187 174 282 222 72 149 212 104 66 111 209 59 82 63
1269F3m5R4J9K9rl6ql7O6m1r1N2k3L1P5K3j84p2M5J9L4Oqk8jJ51K5k6N3Q7pm9l9j8j87Q6R6
$$ 63 18 112 131 160 151 115 107 70 136 95 4 56 33 64 139 162 -22 -94 -49 -30 4 10 2 -26 -27 124 149 123 176 263 256 207 168 150 -37 49 145
1260A45k0m0P5K6j2J94j06j47R3ko8NQ8p6r4N7J23n4n5j02J69n5rq5K3J1J27m3mL0m6O1J1
$$ 145 125 85 160 186 174 368 262 115 208 206 138 143 231 155 61 118 241 187 132 30 199 144 135 50 73 84 211 168 164 194 148 209 220
1252B20r2No6J11O5O8q4j46j6j70J11K20Qj11o4Q6lr2l3M3O0L5r0Q3j02J3Nq6J31m8p7K6k8
$$ 220 128 133 67 178 243 311 227 81 65 -105 6 226 234 123 59 145 142 50 17 60 120 155 65 148 46 59 64 -22 109 61 -16 10 -18
1244a8O5k0M7NNl6M9k5J8%j1n8J9o8N3M7q8L4J05k7o6K4J25p6k2J03R1k4n8j12M8Om1j4O8
$$ -18 47 27 74 79 84 48 97 72 90 90 79 21 40 -28 25 72 -16 18 123 96 30 54 179 103 81 184 275 251 193 81 129 135 94 80 148
1236A48N5j21J0R6ql3J38p0j2j84K5J22o1P2l7K6N0KL1k3o6r5M0L1%j3Jl7J38L7k5M7qLkj55
$$ 148 203 82 92 188 180 147 285 215 203 19 44 166 105 177 140 166 216 218 249 226 160 65 105 136 136 123 124 87 225 262 237 284 276 279 277 122
1227A22l6R7mlO6M8j2K4KJ36r1p0j10N6J53M0kP7l4J36Q1J47R2J99p3k23j10k70j28l3K9O8
$$ 122 86 183 179 176 242 290 278 302 304 440 349 279 169 225 378 418 416 493 459 595 676 823 915 1114 1041 818 708 438 310 277 306 374
1219C74r7M8O2j6J39K2q6j08J25J38p3o7L7N6k2J49J57L35K76K39M2Q9j31j32l18k38j01q7
$$ 374 277 325 387 371 510 532 446 338 463 601 528 461 498 554 532 681 838 1173 1449 1688 1730 1819 1688 1556 1238 1000 899 812
1212H12j42k17j73k5J6mJ3J29q4M0JM9l8Rj03j9N4j0J87J58J0J23L01L04l4q6r7k41j89j37
$$ 812 670 453 280 255 271 267 280 409 325 365 366 415 377 386 283 264 318 308 495 653 663 786 1087 1391 1357 1271 1174 933 744 607
1205F07j38N7o3j39O9l5n4o0k6O5Q8MK9n2j14p1J48M2o5P6m7J26Qj13P3o9j6k7P2m4l1M4K5
$$ 607 469 526 463 324 393 358 304 244 218 283 371 375 404 352 238 167 315 357 292 368 321 447 455 342 415 346 330 303 375 331 300 344 369
1197C69O9j04n0jJ12J0j69O0J04j22R3J18l1rm0j2M1O5j0L0n0K08Q4r6q1J68j20K1j00j62
$$ 369 438 334 284 283 395 405 236 296 400 278 371 489 458 449 409 397 438 503 493 523 473 681 765 669 588 756 636 657 557 395
1189C95R3M5m7P6j50R1l2Q5k4J03j2qn0n5R3j23m4J20R7l7J7P4J11K56J51M7Q5r8j70q1q5
$$ 395 488 533 486 562 412 503 471 556 532 635 623 615 565 510 603 480 436 556 653 616 633 707 818 1074 1225 1272 1357 1259 1089 1008 923
1182I23Qj71j35l3L7o2J68Q9j84k3Q9p4J07J10n3p8R6RP9P8J46J39Jn3J86nJ06j60k5m9l9
$$ 923 931 760 625 592 629 567 735 824 640 617 706 632 739 849 796 718 814 823 902 980 1126 1265 1266 1213 1399 1394 1500 1340 1315 1266 1227
1174A227L8J2P4O3q2R9k2K5j6n0J17K23L6Pj46oN8R1pP5O0L5P1J77m2R5L60L15K67J25qK07
$$ 1227 1265 1277 1351 1414 1332 1431 1409 1434 1418 1368 1485 1708 1744 1751 1605 1599 1657 1748 1741 1816 1876 1911 1982 2159 2117 2212 2572 2887 3154 3279 3271 3478
1166C478N4n6L7K4j14K8p1k6K8L09K75K76K92K35K80M35O30P17O90R28J123J140J369J444
$$ 3478 3532 3476 3513 3537 3423 3451 3380 3354 3382 3691 3966 4242 4534 4769 5049 5484 6114 6831 7521 8449 9572 10712 12081 13525
1160A3525K000K801L931O206R642J2835J3921J2809Q351L775K999J945J197L39n585j1682
$$ 13525 15525 18326 22257 28463 38105 50940 64861 77670 86021 89796 92795 94740 95937 96276 90691 79009
1157G9009j4268j5063j2411p901m607k528j187k4J130K467L619L927M112L591K880L821O255
$$ 79009 64741 49678 37267 29366 24759 22231 21044 21020 22150 24617 28236 32163 36275 39866 42746 46567 52822
1152E2822J1120J7687K2230K5305K7912K9372K7298J9136Q931l890j3970j8809k1154k0492
$$ 52822 63942 81629 103859 129164 157076 186448 213746 232882 241813 237923 223953 205144 183990 163498
1149A63498k3216k4720k5043k3391j6862j0324n774l166p60J646K622K908K628P42o19n07
$$ 163498 140282 115562 90519 67128 50266 39942 34168 31002 30242 31888 34510 37418 40046 40788 40169 39662
1145C9662O83L379Q166J5570K5341L1852L3686L2577K3299Q941m507k0643l2594l5956l4730
$$ 39662 40345 43724 51890 67460 92801 124653 158339 190916 214215 223156 218649 198006 165412 129456 94726
1141I4726k8507j9261j2126p628n101l587k674k294j991j551j354j255p36o10l56m64m37k13
$$ 94726 66219 46958 34832 27204 22103 18516 15842 13548 11557 10006 8652 7397 6661 6051 5695 5231 4794 4581
1137D581k49j79k27j63L4J95L53Q62J060J120L70k83j189j146r07p64l87m41p0o5R4J86L2
$$ 4581 4332 4153 3926 3763 3797 3992 4345 5207 6267 7387 7757 7474 6285 5139 4232 3468 3081 2640 2570 2505 2599 2785 2817
1131B817M8l6n0j9j10j97k2j1j50j14n8R2o6r3j59N3M0Q7Q7k0P5J41l3O5O1OQ0K18K64L64
$$ 2817 2865 2829 2779 2760 2650 2453 2431 2420 2270 2156 2098 2190 2124 2031 1872 1925 1965 2052 2139 2119 2194 2335 2302 2367 2428 2434 2514 2732 2996 3360
1124C360Q7l5k27k44q3p2Q9K66J10N2M4N6NK34K63K97Q04J067J090R50M20k16p63r48r86m62
$$ 3360 3447 3412 3185 2941 2858 2786 2875 3141 3251 3303 3347 3403 3408 3642 3905 4202 5006 6073 7163 8113 8533 8317 7554 6606 5620 5158
1118E158j00J30P7K48M50L90N48M26L97M32N98N04P57R23J234J491J993K563L180M274O322
$$ 5158 5058 5188 5265 5513 5963 6353 6901 7327 7724 8156 8754 9258 10015 10938 12172 13663 15656 18219 21399 25673 31995
1113C1995R834J6804K6609L6897M2616L7792K7221J0669r490k5391l6236m0141l4581k5632
$$ 31995 41829 58633 85242 122139 164755 202547 229768 240437 230947 205556 169320 129179 94598 68966
1109F8966j6612r603m696j204R95P08m37j939l732k877j789L55J744M381P904J5911K3385
$$ 68966 52354 42751 38055 36851 37846 38554 38117 36178 32446 29569 27780 28135 29879 34260 42164 58075 81460
1105H1460L1029K9196K2555K1901J9500K6257J6228N141j3777k4235k6456k7159k7525k9321
$$ 81460 112489 141685 164240 186141 205641 231898 248126 253267 239490 215255 188799 161640 134115 104794
1102A04794k5640j9406j1818o452l389k918l224l970l929k839k030r86j71N87J762L689O873
$$ 104794 79154 59748 47930 41478 38089 35171 31947 27977 24048 21209 19179 18193 18022 18609 20371 24060 30933
1097C0933J2003J6259J8775J3228N710j012m180n60R27k125q006j5335j7008j4437j0362o268
$$ 30933 42936 59195 77970 91198 96908 95896 91716 91156 92083 89958 81952 66617 49609 35172 24810 18542
1093A8542m037k668k308j386j015o14n94l36n01l30q5j86l51k41l02j23k98q2k90k13l36j18
$$ 18542 14505 11837 9529 8143 7128 6514 5920 5584 5083 4753 4668 4482 4131 3890 3588 3465 3167 3085 2795 2582 2246 2128
1088B128p2L1r2J58O7L99J65K59J65K69l4j14l58j5k50M9j44j26j34o6k20k64m51r4q1l6j3
$$ 2128 2056 2087 1995 2153 2220 2619 2784 3043 3208 3477 3443 3329 2971 2956 2706 2755 2611 2485 2351 2285 2065 1801 1350 1256 1175 1139 1126
1082A126Ok3J72Kj1L0NrK17R0kJ74Q6j61n5j45p6l4q6k32k4l8MlJ7jQ0j48P3oo3n8L6k01l4
$$ 1126 1132 1109 1281 1283 1272 1302 1307 1298 1515 1605 1603 1777 1863 1702 1647 1502 1426 1392 1306 1074 1050 1012 1016 1013 1030 1029 1109 961 1034 1028 965 907 943 742 708
1073G08O0j30j69J7j00R7o0J22Q1J39j94M7q0J02j44J88J39J57r0J87p4m8n8K8L4K8j78r4
$$ 708 768 638 469 486 386 483 423 545 626 765 571 618 538 640 496 684 823 980 890 1077 1003 955 897 925 959 987 809 715
1066G15j5K36j4N5j64l8p0j08l5J16p1K2j31M1K6L4L9Q5n7J50kL2j31j00L4K00K04J15j90
$$ 715 700 936 922 977 813 775 705 597 562 678 607 629 498 539 565 599 638 723 666 816 814 846 715 615 649 849 1053 1168 978
1059I78Q0k12O2j18N5r9j15q9J23j8M4j1o0j13K01J8L8j1R6J3J14q0J13M9L6j33J8M6J43j9
$$ 978 1058 846 908 790 845 746 631 542 665 647 691 680 620 507 708 726 764 753 849 862 976 896 1009 1058 1094 961 979 1025 1168 1149
1052A149J7j93n4M0O5j1jo2M1j3K01L1K80J84K24J86K51j14j14k38j80j73N8j02O0j0n2J50
$$ 1149 1166 973 919 959 1024 1013 1012 950 991 978 1179 1210 1490 1674 1898 2084 2335 2221 2107 1869 1689 1516 1574 1472 1532 1522 1470 1620
1045A620J20n6r9m9J63P3N5J44J6O1N4m5J63J57K57K51K89L36L74J42J74o9k76j90j11j28
$$ 1620 1740 1684 1585 1536 1699 1772 1827 1971 1987 2048 2102 2057 2220 2377 2634 2885 3174 3510 3884 4026 4200 4131 3855 3665 3554 3426
1038C426j9L2m5J59J48Q8l6K50J88J94M06L80L02L94N31M11M79O49P90J157J387J268J206
$$ 3426 3407 3439 3394 3553 3701 3789 3753 4003 4191 4385 4791 5171 5473 5867 6398 6809 7288 7937 8727 9884 11271 12539 13745
1033A3745J506K101K856L297M319O198R891J6193K6974M2646N3581L5587j1185m4663m5722
$$ 13745 15251 17352 20208 23505 27824 34022 43913 60106 87080 129726 183307 218894 207709 163046 117324
1029A17324l3784k2288j4341q875n787l568k417j614j085k85N56J353J912K225K544K754K816
$$ 117324 83540 61252 46911 38036 32249 28681 26264 24650 23565 23280 23836 25189 27101 29326 31870 34624 37440
1025C7440M025N796Q588J2044J7573K7193M4210O8402Q5466O8015J4055m4117o9686o8569
$$ 37440 41465 47261 55849 67893 85466 112659 156869 225271 310737 378752 392807 348690 279004 210435
1022B10435n7402m2142k8074j7665j0338o161n308n866n147l575k141j333p37o93o13r7J016
$$ 210435 153033 110891 82817 65152 54814 48653 43345 37479 32332 28757 26616 25283 24546 23853 23240 23143 24159
1017B4159J895K840L875N991R479J5334K5316M1640N6788M6733p01m5728n4540m1976k8122
$$ 24159 26054 28894 32769 38760 48239 63573 88889 130529 187317 234050 233349 187621 133081 91105 62983
1014F2983j7841j1861p601n004l526k771k325j993j215q91n22q34p18r22n63p31k57j62k38
$$ 62983 45142 33281 25680 20676 17150 14379 12054 10061 8846 7955 7433 6599 5881 4959 4396 3665 3408 3246 3008
1009C008j86Rk89j72j46Q1j52o3k44m7k28Lj36m5j78jo7R0q7k0p1j42RP5JJ01J3J27o9j23
$$ 3008 2822 2831 2542 2370 2224 2305 2153 2090 1846 1799 1571 1574 1438 1393 1215 1214 1147 1237 1150 1130 1059 917 926 1001 1002 1103 1116 1243 1174 1051
1002A051j85j1q6K4j07k1J9K08m1J96M2L5k36j3pl3j49j09j22J07N9j5j0K61J09K01J6j00
$$ 1051 866 855 769 793 686 665 684 892 851 1047 1089 1124 888 875 868 835 686 577 455 562 621 606 596 857 966 1167 1183 1083
995A083k32j70j83P9j12k8o0J19k8N3R2Lq0P6Qn4j23m7j19J23n9N6qN2q3Q4o0K3m7j9R2K4
$$ 1083 851 681 498 577 465 437 377 496 468 521 613 616 536 612 620 566 443 396 277 400 341 397 389 441 358 442 382 405 358 339 431 455
987D55J1R1j33m1j14J83O4j22N2j2k15J19L7R4J71J07J%k64j76L6J14j74Q5m1n6Q6l4R8KK
$$ 455 466 557 424 383 269 452 516 394 446 434 219 338 375 469 640 747 748 748 484 308 344 458 284 369 328 272 358 324 422 424 426
980D26p6L2Lj00p8m0mK8m5R9n2p8P8N5rR9L3n2l6o0j15O9RM3m8K4J7N9j0L8n0k3rJ15j18J06
$$ 426 350 382 385 285 207 167 163 191 146 245 193 115 193 248 239 338 371 319 283 223 108 177 186 229 181 205 222 281 271 309 259 236 227 342 224 330
971C30m5j1N8j6m6J30p1J0p5L5l3O9j37Pl5K74PR2l4N6J63K67J68l4j30j43j94L8j86p8j3
$$ 330 285 274 332 316 270 400 329 339 264 299 266 335 198 205 170 444 451 543 509 565 728 995 1163 1129 999 856 662 700 514 436 423
963D23J69j35r7M1R5j59J61j00M8L7j7j29O5j28J92O3J56j5K91K78M76J82P6j77o8k02k28
$$ 423 592 457 360 401 496 337 498 398 446 483 466 337 402 274 466 529 685 670 961 1239 1715 1897 1973 1796 1728 1526 1298
957A298l18n3l47j01j42J74r8J32P3J53j33q0j98R4m1k8n2K01n2R0m7K23N1J43j8L16j19q8
$$ 1298 980 927 580 479 337 511 413 545 618 771 638 558 360 454 413 385 333 534 482 572 525 748 799 942 924 1240 1121 1033
950A033p9j4k91p2j18M5j07Op9Q9j10J16j78Q9l6r4q0P4j39P6J58Q1l59K31q9p1q4J22p0K20
$$ 1033 954 940 649 577 459 504 397 403 324 413 303 419 241 330 294 200 120 194 55 131 289 370 11 242 153 82 -2 120 50 270
942B70j94J24j72K16L4JK2J92m7k2k16N9r9K06k65J46k6J07j46R8p4L6r5K29j96O2j61J69
$$ 270 76 200 28 244 278 279 301 493 446 424 208 267 168 374 109 255 229 336 190 288 214 250 155 384 188 250 89 258
936B58j34O1J7J43p4j9k05P0J4J67o7J01o2k5j30P5O7J91k69J22Ll1m8J38o7P7l5k9p6J90
$$ 258 124 185 202 345 271 252 47 117 131 298 231 332 270 245 115 190 257 448 179 301 304 273 225 363 296 373 338 309 233 423
928D23k15R8k4J81o1M9j5j0l1k8o7M6J16J49k4m0K5J64J73L89P11J676K168K275Q57j363k094
$$ 423 208 306 282 463 402 451 436 426 395 367 300 346 462 611 587 547 572 736 909 1298 2009 3685 5853 8128 8985 7622 5528
922E528k049j172q61l74l10nn8p8j38J3k1rk2K0p3k6J48M4q8r1k45P8J08n4k7R3m9J04n4J2
$$ 5528 3479 2307 1446 1072 762 757 699 621 483 496 475 466 444 464 391 365 513 557 469 378 133 211 319 265 238 331 282 386 332 344
914C44r1P5P9P9L3jp0ql8R2r2k5j74jK5J45j2pj90J3L9J58j15P2k9K21K3K50l1M2j70j01j18
$$ 344 253 328 407 486 519 518 448 440 402 494 402 377 203 202 227 372 360 353 163 176 215 373 258 330 301 522 545 795 764 806 636 535 417
906D17K48j24K23j23n2k36J38j96J13j81J62j83O1j16K97m4L4k63K78J1J34j54O7k13K32m0
$$ 417 665 541 764 641 589 353 491 295 408 227 389 206 267 151 448 404 438 175 453 464 598 444 511 298 530 490
900D90L26j50K29k81m7k36L36k33K13l24K16k71J36j25K12j26L39k84J29k52K48k03K26j25
$$ 490 816 666 895 614 567 331 667 434 647 323 539 268 404 279 491 365 704 420 549 297 545 342 568 443
894D43K61k16K55k14K42l69K25k09K10k00L94k67J85k81J90l54K43j35L42j67L10j80M21k57
$$ 443 704 488 743 529 771 402 627 418 628 428 822 555 740 459 649 295 538 403 745 578 888 708 1129 872
888H72J57k38K28m25K12l79M33l76L56j60L79k86M49k74L10m72K78k63K90l22N09l62K89l16
$$ 872 1029 791 1019 594 806 427 860 484 840 680 1059 773 1222 948 1258 786 1064 801 1091 769 1278 916 1205 889
882H89M56l51M81m09L48k14M12l07M00k11M56l51L33l00M97m92L29k97L67k35M71l52L05l54
$$ 889 1345 994 1475 1066 1414 1200 1612 1305 1705 1494 1950 1599 1932 1632 2129 1637 1966 1669 2036 1801 2272 1920 2225 1871
876A871N10j21N53l31L62n05M54l28N22k90N18l14K62m78N51k40O19k27N45l05N07JO21j57
$$ 1871 2381 2260 2813 2482 2844 2339 2793 2465 2987 2697 3215 2901 3163 2685 3236 2996 3615 3388 3933 3628 4135 4136 4757 4600
870D600O54j09O44k93O85l81N79k81Q34K7N97k6P65j90Q29j59Q91R5J121J07J294N20J929
$$ 4600 5254 5145 5789 5496 6181 5800 6379 6098 6932 6959 7556 7530 8295 8105 8934 8775 9666 9761 10882 10989 12283 12803 14732
865A4732J060K354J386J650P97J868J158L271L399N765O112P945N572P280Q303J7037K7099
$$ 14732 15792 18146 19532 21182 21979 23847 25005 28276 31675 37440 43552 51497 57069 64349 72652 89689 116788
861A16788N5241J09318K55565M11487M28653K87299j98209l87049m10692k83923j47958q7832
$$ 116788 172029 281347 536912 948399 1377052 1664351 1466142 1079093 668401 384478 236520 148688
858A48688m8912l1571j6421j0658m346l804k445n641l640m522k205k374J54o94J140l0p00
$$ 148688 99776 68205 51784 41126 36780 32976 30531 24890 21250 16728 14523 12149 12303 11609 12749 12719 12019
854A2019k123j270j611r0j092l8r83K03p09K13q26L89p69L07p40J62o23K78o71L62n34L64
$$ 12019 9896 8626 7015 6925 5833 5795 4812 5015 4306 4519 3693 4082 3313 3620 2880 3042 2419 2697 2026 2388 1854 2218
848B218m64M52l80M39l44N44n85L79j34J016K94J537P80J582J3L40j013p40j810p59j250j16
$$ 2218 1754 2206 1826 2265 1921 2465 1880 2259 2125 3141 3435 4972 5752 7334 7347 7687 6674 5934 4124 3365 2115 1999
843A999o94L64m92M37m54K23n67L21n16M51l66M33k06O32k33K11n62L80l91L04n49K25n35
$$ 1999 1305 1669 1177 1614 1160 1383 816 1137 621 1072 706 1139 933 1565 1332 1543 981 1361 970 1274 725 950 415
837D15K86k81M87m00J54l45M21k82K25m78K98l80L47k40L86k77K72k66K72j85M56k84J80n21
$$ 415 701 420 907 507 661 316 737 455 680 202 500 120 467 227 613 336 608 342 614 429 885 601 781 260
831B60J24l74L73k87L26k63K17j29L35l69K58k49L34k40L31l77K41k73J43l27L75k06K65k69
$$ 260 384 10 383 96 422 159 376 247 582 213 471 222 556 316 647 270 511 238 381 54 429 223 488 219
825B19K59l12K03k39L26k55L04j79K32l00K11j64K32l12L80p6K34l37K36j34K07j30J87j24
$$ 219 478 166 369 130 456 201 505 326 558 258 469 305 537 225 605 529 763 426 662 528 735 605 792 668
820F68L26o7M17L83J326K861N676J957m128m365j986j315m28m17j40k31n5j79J75k61J08j14
$$ 668 994 927 1344 1727 3053 5914 11590 13547 9419 5054 3068 1753 1325 908 768 537 482 303 478 217 325 211
814B11J66o0P9k76J95k29k2lJ20k72KkJ84p9J88j51R9M4J15j57J90j54M8o4J3J21L5j43J16
$$ 211 377 317 396 120 315 86 64 61 181 -91 -89 -91 93 14 202 51 150 194 309 152 342 188 236 172 185 306 341 198 314
807C14J34L1j89O2qRP8m6O1o5j8nM0R5Pk4j48l5K6J8N6J42j10r3J01K3p9k31Q3P1L2J22K4
$$ 314 448 479 290 352 344 353 431 385 446 381 363 358 398 493 500 476 328 293 319 337 393 535 425 332 433 456 377 146 229 300 332 454 478
799D78o0N3J0R9j3m4J2P4J34K19p9L27P68J496K262K306J044j305k061k172j551o10l74k73
$$ 478 418 471 481 580 567 523 535 609 743 962 883 1210 1978 3474 5736 8042 9086 7781 5720 3548 1997 1387 1013 740
793G40k55l5qJ14j36p9j40K9n6J26k2L5j85L1m1J25R9p7j1L8j89O7N0J51j23J21k15J3j01
$$ 740 485 450 442 556 420 341 201 230 174 300 278 313 128 159 118 243 342 265 254 292 103 170 220 371 248 369 154 167 66
786F6J35j1Q1j02R9j22j1n1K05j43K11j28M2j45J31L1P4k42J75q4Q9J8P1M4Q2j76Nq4L7j56
$$ 66 201 190 271 169 268 146 135 84 289 146 357 229 271 126 257 288 362 120 295 211 300 318 389 433 515 339 344 260 297 141
779A41J59r0J29p3J47m2O9p3m3r9J59j51J74o0J40j95K2r2J48j32M2J24J11jL02l10M9r7J13
$$ 141 300 210 339 266 413 371 440 367 324 225 384 233 407 347 487 292 314 222 370 238 280 404 515 514 816 506 555 458 571
772E71QL6p6J67j13K35j2P0k80K03j12l0l21J72o4J29j82L4o0J06j63J37kJ74j02J42o2K1
$$ 571 579 615 539 706 593 828 816 886 606 809 697 667 346 518 454 583 401 435 375 481 318 455 453 627 525 667 605 626
765F26QJ88j13J60J5J68j3K40rP4k46q9j25o5r4j4k01nlJ98K7m4k02O0n7L2m5J22NJ02%K7
$$ 626 634 822 709 869 884 1052 1039 1279 1270 1344 1098 1009 884 819 725 711 510 505 502 700 727 683 481 541 484 516 471 593 598 700 700 727
757G27J3J74j2J51r6J16j41J40j23r1k2k5k00M4n2No2m0J12N3j19j4J4N9j35QL2M9n7Q1R8
$$ 727 740 914 902 1053 957 1073 932 1072 949 858 836 811 611 655 603 608 546 506 618 671 552 538 552 611 476 484 516 565 508 589 687
749F87p0j78O9K0R2k1J17r7K3m4K8j77L7n8NO8j36q7L8N6N8j19L3N7M7l7q8R6J2P1K0P5O4
$$ 687 617 439 508 528 620 599 716 619 642 598 626 449 486 428 433 501 365 278 316 372 430 311 344 401 448 411 323 419 431 502 522 597 661
741F61P5p0MQ8K6m7N7J69j9o6P0j37j6J87K4N1J27o7p5J4K9j3p6p8K34m5KJ36K23j50n3MK0
$$ 661 736 666 670 758 784 737 794 963 944 878 948 811 795 982 1006 1057 1184 1117 1042 1056 1085 1072 996 918 1152 1107 1109 1245 1468 1318 1265 1269 1289
733A289n3J17O1Q5r6k7k39j00k7R2N3Q1l4N1m6L9p4J68j11k1P4J15L8J16j29Q6N0J02J58n
$$ 1289 1236 1353 1414 1499 1403 1376 1137 1037 1010 1102 1155 1236 1202 1253 1207 1246 1172 1340 1229 1208 1282 1397 1435 1551 1422 1508 1558 1660 1818 1813
726A813j31J17k7J94k8P4O1J3n6M6O5J38J7J08Q4P2M1O9j61L12L2J22P1J84M2K58P2K70J65
$$ 1813 1682 1799 1772 1966 1938 2012 2073 2086 2030 2076 2141 2279 2296 2404 2488 2560 2601 2670 2509 2821 2853 2975 3046 3230 3272 3530 3602 3872 4037
719D037K97K83L07K18L57J59O23Q07J025J304J659J832K652M201O015P331O399J789k863n315
$$ 4037 4334 4617 4924 5142 5499 5658 6281 7088 8113 9417 11076 12908 15560 19761 25776 33107 39506 41295 38432 33117
714C3117n144m308l114k338j435r70n20l06J22K37M82N28J285J738K472L050M174M552M882
$$ 33117 27973 23665 20551 18213 16778 15808 15288 14982 15104 15341 15823 16351 17636 19374 21846 24896 29070 33622 38504
709C8504M893N369O769Q687J0441J2532J3611J1853M904m355j1253j2655j0900q142o143m902
$$ 38504 43397 48766 55535 64222 74663 87195 100806 112659 117563 113208 101955 89300 78400 70258 64115 59213
705E9213m297l767l740l230k691j997j374m76P33K264L582M951N687N946O226P854J0435J3501
$$ 59213 54916 51149 47409 44179 41488 39491 38117 37641 38374 40638 44220 49171 54858 60804 67030 74884 85319 98820
701I8820J5524J6572J6309J3653O585j902r541j5457j8145j6181j2611r425p467o402o282
$$ 98820 114344 130916 147225 160878 167463 165561 156020 140563 122418 106237 93626 84201 76734 70332 64050
697F4050o065n318m332l887l347k836j723p21P56J806K625K892M088N610P858J0294J3677
$$ 64050 57985 52667 48335 44448 41101 38265 36542 35821 36577 38383 41008 43900 47988 53598 61456 71750 85427
693H5427J6224J4450Q585L697L55n896j5373j9812j6584j1893q707o616n127m421l897l561
$$ 85427 101651 116101 124686 128383 128738 122842 107469 87657 71073 59180 50473 43857 38730 34309 30412 26851
689B6851l365l077k669k242j764j193p93l26k2L05O60J041J541K403M251O565R398J0223O326
$$ 26851 23486 20409 17740 15498 13734 12541 11748 11422 11400 11705 12365 13406 14947 17350 21601 28166 37564 47787 54113
685E4113k240r364j0724q704o015m108k798j820j354r15p96p00o64m42k94j76j22l13k52r1
$$ 54113 51873 42509 31785 23081 17066 12958 10160 8340 6986 6071 5275 4575 3911 3469 3175 2999 2877 2564 2312 2221
680B221k19j41Lk3p8j18j12J14r8j93j06np5J12Rr9m9P3J27ol1p3j00L6j08m6M7O0j68PO1
$$ 2221 2002 1861 1864 1841 1763 1645 1533 1647 1549 1356 1250 1245 1170 1282 1291 1192 1143 1216 1343 1337 1306 1233 1133 1169 1061 1015 1062 1122 954 961 1022
672A022J03O2o0j06r0j13M9J93K6j98m9o1mM7J08k71m8J71l8l9O0nK9L8O3p4j1k4j9j5J24
$$ 1022 1125 1187 1127 1021 931 818 867 1060 1086 888 839 778 774 821 929 658 610 781 743 704 764 759 788 826 889 815 804 780 761 746 870
665H70k1P5P3j15j54K08r8k4o2R4PP7j00k8o7M2L2k5q6j1M9J58p8J62j44o0O3jr1m0P4j39
$$ 870 849 924 997 882 728 936 838 814 752 846 853 930 830 802 735 777 809 784 698 687 736 894 816 978 834 774 837 836 745 705 779 640
657F40j11J13K7K5J2J8o8O1j05O5k2l8q7J93J8O7j87P2M3K15j21oNM1PO1K03N1k9J36o4J04
$$ 640 529 642 669 694 706 724 656 717 612 677 655 617 530 723 741 808 621 693 736 951 830 824 829 870 877 938 1141 1192 1163 1299 1235 1339
649A339Q1K6k07L8j66j05O1J12j29M8O6J43j8Q2K5Q3J7J8m1j5q6N4l7O2R0J35k00j38n9J02
$$ 1339 1420 1446 1239 1277 1111 1006 1067 1179 1050 1098 1164 1307 1289 1371 1396 1479 1496 1514 1473 1458 1372 1426 1389 1451 1541 1676 1476 1338 1279 1381
642A381j48M1M8N1p3j37k2M8RM2O0kO0J79L5%n2O5L21K87J33R4J88O4K0K0m4%j9n7j81M5P0
$$ 1381 1233 1274 1322 1373 1300 1163 1141 1189 1198 1240 1300 1298 1358 1537 1572 1572 1520 1585 1906 2193 2326 2420 2608 2672 2692 2712 2668 2668 2649 2592 2411 2456 2526
634B526Q6j41NJ00N3J5l4J1Po0P8j29j2j2R7J98K44J18J81J28L17J95K32L11K79J71K90J14
$$ 2526 2612 2471 2476 2576 2629 2644 2610 2621 2628 2568 2646 2517 2505 2493 2590 2788 3032 3150 3331 3459 3776 3971 4203 4514 4793 4964 5254 5368
627E368K99L71N43O05R77J189J561J945K860M239O298R675J4697J9883J8309K714j4102j8904
$$ 5368 5667 6038 6581 7186 8163 9352 10913 12858 15718 19957 26255 35930 50627 70510 88819 91533 77431 58527
622E8527j5798j1406p970n660l918k699j866j360q86q67o90m91m22m16l89l27k96k38j64k08
$$ 58527 42729 31323 23353 17693 13775 11076 9210 7850 6964 6097 5407 4916 4494 4078 3689 3362 3066 2828 2664 2456
617B456k02Oj71k9j07j9k20j1n4lj39Lk6p5r3M3P7k9k0j22n3L4Q1n7K0J5m3l0lp1p5J66m3
$$ 2456 2254 2260 2089 2060 1953 1934 1714 1703 1649 1646 1507 1510 1484 1409 1316 1359 1436 1407 1387 1265 1212 1246 1327 1270 1290 1305 1262 1232 1229 1158 1083 1249 1206
609A206Rj30J39M1j3k34N5q3J16K7N4J01Rj23R4n1n1j5J16n2M7J8R2L2PJ6K42j46j41j6K6
$$ 1206 1215 1085 1224 1265 1252 1018 1073 990 1106 1133 1187 1288 1297 1174 1268 1217 1166 1151 1267 1215 1262 1280 1372 1404 1411 1427 1669 1523 1382 1366 1392
602A392o1P8j5L1R8J2l3M1j9L8J24l1rJ99p2J25j95K2K57K35j07l5j04O8n6J69m4L7J13J5
$$ 1392 1331 1409 1394 1425 1523 1535 1502 1543 1524 1562 1686 1655 1646 1845 1773 1898 1703 1725 1982 2217 2110 2075 1971 2039 1983 2152 2108 2145 2258 2273
594B273n6P1L0m9J96J16j07P0J41O6o8J71j38J29J55K10L3J83k6NrK47M9N8J6P2k3k7j32J45
$$ 2273 2217 2288 2318 2269 2465 2581 2474 2544 2685 2751 2683 2854 2716 2845 3000 3210 3243 3426 3400 3405 3396 3643 3692 3750 3766 3838 3815 3788 3656 3801
587C801J45K80J14oJ25K73K8N9K01J94L27L16K88L12M02N01O41Q94R87J227J436J988K245
$$ 3801 3946 4226 4340 4334 4459 4732 4760 4819 5020 5214 5541 5857 6145 6457 6859 7360 8001 8895 9882 11109 12545 14533 16778
581A6778K184J461P37J80J64K02L74J61p8k42j07P7J52J84O17Q58J057J179J523J749K304
$$ 16778 18962 20423 21160 21340 21504 21706 22080 22241 22163 21921 21814 21891 22043 22227 22844 23702 24759 25938 27461 29210 31514
576C1514K663L370L647L409L091K971L093K938K706K468J701Q60o0m68m75k04m3J42N5Q3k58
$$ 31514 34177 37547 41194 44603 47694 50665 53758 56696 59402 61870 63571 64431 64371 63903 63428 63224 63181 63323 63378 63461 63203
571F3203m59n94p92o28l04kP29J471K315L366M154M777M989N159M615L745K902J872J276M79
$$ 63203 62744 62150 61358 60730 60426 60424 61153 62624 64939 68305 72459 77236 82225 87384 91999 95744 98646 100518 101794 102273
566A02273J74p10j735k762l653l711l128k188j356n89m38n27o16p07q97j165j274j293j150
$$ 102273 102447 101737 100002 97240 93587 89876 86748 84560 83204 82615 82177 81650 81034 80327 79430 78265 76991 75698 74548
562G4548m95o4N97P17M12L15L45O57J181J722J682J266O84m63j014j297j389j680j801j893
$$ 74548 74053 73989 74586 75303 75715 76030 76375 77032 78213 79935 81617 82883 83567 83104 82090 80793 79404 77724 75923 74030
557G4030k477l206l717m235m338m073l540k895k274j739j208p70l17NN48Q45J200J647J737
$$ 74030 71553 68347 64630 60395 56057 51984 48444 45549 43275 41536 40328 39558 39241 39246 39794 40639 41839 43486 45223
552D5223J610J020L01j32q00r98j136j562j738j790j608j053q99n98l49l29q6J78K07K76L98
$$ 45223 46833 47853 48154 48022 47222 46224 45088 43526 41788 39998 38390 37337 36438 35840 35491 35162 35076 35254 35461 35737 36135
547C6135M97J83K14K30K57N63P87P98O50R54J272J299J646J953K247K363K656K660K775K781
$$ 36135 36632 36815 37029 37259 37516 38079 38866 39664 40314 41268 42540 43839 45485 47438 49685 52048 54704 57364 60139 62920
542F2920K665K504K154J893J659J139R99O70O01L90L48L37K09K18K40J08O2q4M05O79J440
$$ 62920 65585 68089 70243 72136 73795 74934 75933 76603 77204 77594 77942 78279 78488 78706 78946 79054 79116 79032 79437 80116 81556
537H1556J622J604J789J856J527J693J668K033K082K296K197K212K153K215K051J652J129
$$ 81556 83178 84782 86571 88427 89954 91647 93315 95348 97430 99726 101923 104135 106288 108503 110554 112206 113335
533A13335Q46R94J262J520J726J686J745J715J710J424J278R44R79J065J575K142L115M049
$$ 113335 114181 115175 116437 117957 119683 121369 123114 124829 126539 127963 129241 130185 131164 132229 133804 135946 139061 143110
528A43110M792N121N016M253K806Q45k00n82k22K34J464K135L377M197M895N291O001O367
$$ 143110 147902 153023 158039 162292 165098 165943 165743 165161 164939 165173 166637 168772 172149 176346 181241 186532 192533 198900
524A98900P141P273P319O967O364N432M420L543L053K917K729K462J837O10r10k249l201l846
$$ 198900 206041 213314 220633 227600 233964 239396 243816 247359 250412 253329 256058 258520 260357 260967 260057 257808 254607 250761
520B50761l872l590k634j881j130l78L73J096J854K502L484M453N539O508P030P066O611N168
$$ 250761 246889 243299 240665 238784 237654 237276 237649 238745 240599 243101 246585 251038 256577 263085 270115 277181 283792 288960
515B88960M081L795M924O510P818Q357Q083P045N808M658M224M236M449N026O249P848R902
$$ 288960 293041 296836 301760 308270 316088 324445 332528 339573 345381 350039 354263 358499 362948 367974 374223 382071 391973
511C91973J2781J4633J5184J8209K1967K5484K8300K9469K8931K6894K5638K6369K8886L2725
$$ 391973 404754 419387 434571 452780 474747 500231 528531 558000 586931 613825 639463 665832 694718 727443
508G27443L7926M4919N3970O5712Q0318R8553J20216J43909J64106J70747J49627R4545J7570
$$ 727443 765369 810288 864258 929970 1010288 1108841 1229057 1372966 1537072 1707819 1857446 1951991 1969561
504A969561n4360j03028j34296j59805j80008j81340j66174j44397j21541j00988q3982p0680
$$ 1969561 1915201 1812173 1677877 1518072 1338064 1156724 990550 846153 724612 623624 539642 468962
501D68962o0180n1604m4005l6949l0916k5971k1768j8591j6202j4072j2114j0101q576o642
$$ 468962 408782 357178 313173 276224 245308 219337 197569 178978 162776 148704 136590 126489 117913 111271
498A11271m464l374o046p263n881m489l100m581n199m343l704l045k732k634k130j840j556
$$ 111271 106807 103433 97387 90124 84243 79754 76654 72073 66874 62531 58827 55782 53050 50416 48286 46446 44890
494D4890j034p83k50L17J894L176j070m691k701m80j979m273l510k573j762j664j229j012
$$ 44890 43856 43073 42823 43140 45034 48210 47140 42449 39748 39268 37289 33016 29506 26933 25171 23507 22278 21266
489B1266p67p97p62o68o60p48o51n89o55p78n72l19N1N68J938L891J705l298l361j980j232
$$ 21266 20499 19702 18940 18272 17612 16864 16213 15624 14969 14191 13619 13300 13351 13919 15857 19748 21453 18155 14794 12814 11582
484A1582j146r54p80m07o20m39m18l65l65j89m06j45k57q7o6k96j70pj81j45j70j72j12P2
$$ 11582 10436 9482 8702 8295 7675 7236 6818 6453 6088 5899 5493 5348 5091 5004 4938 4642 4472 4465 4284 4139 3969 3797 3685 3757
478C757j83n5m3j15j31K5k01r8j61j34o8Kn0j42j16L4J9R0R4O2j50j12r1j2j36K9p1n6N5M8
$$ 3757 3574 3519 3476 3361 3230 3255 3054 2956 2795 2661 2593 2595 2545 2403 2287 2321 2340 2430 2524 2586 2436 2324 2233 2221 2085 2114 2043 1987 2042 2090
471B090j19Kq2J5k2J16J04O5k41Onk3R5j8n6K8N6O4Pm1r7j19P7J2J1K18M8J2J9K5m0P0j33
$$ 2090 1971 1973 1891 1906 1884 2000 2104 2169 1928 1934 1929 1906 2001 1983 1927 1955 2011 2075 2082 2041 1944 1825 1902 1914 1925 2143 2191 2203 2222 2247 2207 2277 2144
463B144Q3J69lj30o6j25j01o1J25j34r9qOo5j20JO2L9n1N8NP1O2o0L8lJ88K07J30l2Q1N3j56
$$ 2144 2227 2396 2393 2263 2197 2072 1971 1910 2035 1901 1802 1794 1800 1735 1615 1616 1678 1717 1666 1724 1729 1800 1862 1802 1840 1837 2025 2232 2362 2330 2411 2464 2308
455B308R5Q8m7j8o4J53K5J31L8L8M8L3k9L9L7J9J38j3kK65R3j7JJ29P4n8l8Q0r9m3PO4N3p9
$$ 2308 2403 2491 2444 2426 2362 2515 2540 2671 2709 2747 2795 2828 2799 2838 2875 2894 3032 3019 3017 3282 3375 3358 3359 3488 3562 3504 3466 3546 3447 3404 3411 3475 3528 3449
447C449R4o0r1N6P2LJ3M7j61j2J11o6OJ02K17P7j26j35m3nj13r7k1l8rj4p2j0j52n2p0N7j36
$$ 3449 3543 3483 3392 3448 3520 3523 3536 3583 3422 3410 3521 3455 3461 3563 3780 3857 3731 3596 3553 3548 3435 3338 3317 3279 3270 3256 3184 3174 3022 2970 2900 2957 2821
439B821nj07j04Nk9Q8j44J22K8M7p8j34mK6r4L8l2j56j31j41k22M2j17j54J9Kn3q0l7L0l9
$$ 2821 2816 2709 2605 2610 2581 2669 2525 2647 2675 2722 2644 2510 2506 2532 2438 2476 2444 2288 2157 2016 1794 1836 1719 1565 1584 1586 1533 1453 1416 1446 1407
431A407j37MM9p0M6O7J8n9r2Q2J00j24R4m8q8m3K4j10L7j17k66n3R7j00R3O1J24j27mk3J2
$$ 1407 1270 1274 1323 1253 1299 1366 1384 1325 1233 1315 1415 1291 1385 1337 1249 1206 1230 1120 1157 1040 774 721 818 718 811 872 996 869 865 842 854
423H54q7p0K1J05kJ03q6L3N8J36n3J06J2J23j7m5L2o3j17K2M9N3n9m3j16J4O9J63n4J64P5
$$ 854 767 697 718 823 821 924 838 871 929 1065 1012 1118 1130 1253 1236 1191 1223 1160 1043 1065 1114 1167 1108 1065 949 963 1032 1195 1141 1305 1380
416A380N1m6J10K71K45L52L59R03M88o18o06o99m26n8o4k33oj30J21j31k6j17k8j96R6n8m5
$$ 1380 1431 1385 1495 1766 2011 2363 2722 3625 4113 3495 2889 2190 1764 1706 1642 1409 1403 1273 1394 1263 1237 1120 1092 896 992 934 889
409H89j03l4Q4R1j45P6K52K20K5J37j94p5j84j31k05P3q9k7k7J32J08k4m0J01j4J95p7o4r7
$$ 889 786 752 836 927 782 858 1110 1330 1355 1492 1298 1223 1039 908 703 776 687 660 633 765 873 849 809 910 896 1091 1014 950 853
402H53j18oM9P5L6j6P5J08L2J7l3r3L7m2l5r0r2j70P0J8K7o4o1m3L0N1M0k1q7o4J54L6n7p7
$$ 853 735 729 778 853 889 873 948 1056 1088 1105 1072 979 1016 974 939 849 757 587 657 675 702 638 577 534 564 615 655 634 547 483 637 673 616 539
394E39m9P8R2n1l8qQ3q4k0j30k8J24J55j23k2J0J4P6J8k5M9J23j09NQ4j1L0R7J0o9k9k2P7
$$ 539 490 568 660 609 571 563 646 562 542 412 384 508 663 540 518 528 542 618 636 611 660 783 674 679 763 752 782 879 889 820 791 769 846
386H46N9N9j08j01J6Q4P6N2l2l7p4O0R5J69K1j45J44Q9L4P3o5J33l6j34P6n7Q6R6m0%J08K4
$$ 846 905 964 856 755 771 855 931 983 951 914 840 900 995 1164 1185 1040 1184 1273 1307 1380 1315 1448 1412 1278 1354 1297 1383 1479 1439 1439 1547 1571
378A571QJ53J88K0nJ67J45J57P7j07N8K78M42O24J143J314Q27m46r47q49o14l26j30p2j2p1
$$ 1571 1579 1732 1920 1940 1935 2102 2247 2404 2481 2374 2432 2710 3152 3776 4919 6233 7060 6614 5667 4818 4204 3878 3748 3676 3664 3593
372C593K59K43J23J25J08r7J48J93K21J12J60K90L97M32R09J148J321Q29l41p75m60m11r8
$$ 3593 3852 4095 4218 4343 4451 4354 4502 4695 4916 5028 5188 5478 5875 6307 7216 8364 9685 10514 10173 9398 8938 8527 8429
366H429N5L74L77M91M13N06O36P67P96Q58R41J163J289J967J842K428K690K768K969L659M343
$$ 8429 8484 8858 9235 9726 10139 10645 11281 12048 12844 13702 14643 15806 17095 19062 20904 23332 26022 28790 31759 35418 39761
361C9761O146Q691J2938J8723K7925L7563L8654J9649n972j8081j8020j5581j2395r741p285
$$ 39761 45907 54598 67536 86259 114184 151747 190401 210050 204078 185997 167977 152396 140001 130260 122975
357A22975o981o383o391n280m561k757k215l46R44L009K824M818O134J0100J5168K6247M3361
$$ 122975 115994 109611 103220 97940 93379 90622 88407 88061 89005 92014 94838 99656 105790 115890 131058 157305 200666
353B00666Q4345J58644J87794m986j67452j39054r2037n8247l9771k5583j7615r932o024m186
$$ 200666 285011 443655 631449 626463 459011 319957 227920 169673 129902 104319 86704 76772 70748 66562
350F6562n332m986m725k309j196O34J132K388K806M089N328P672J0820J6952K5819L9406N0650
$$ 66562 61230 56244 51519 49210 48014 48648 49780 52168 54974 59063 64391 72063 82883 99835 125654 165060 215710
345B15710L6352r326m3977n0355m1090k9683k0209j3778r069o236m000k432j782k471k420
$$ 215710 252062 242736 198759 148404 107314 77631 57422 43644 34575 28339 24339 21907 20125 17654 15234
342A5234k482j607j335j048j102o36n97l83n34k75k33j00m18j58l14k41k97l9j39j04k28k07
$$ 15234 12752 11145 9810 8762 7660 7024 6427 6044 5510 5235 5002 4902 4484 4326 4012 3771 3474 3435 3296 3192 2964 2757
336B757j32L0l05k0q7r4j67J37j36j62j02P6j35J53J48o7j03rr9O0k18j3j84J09M3o0j48M0
$$ 2757 2625 2655 2350 2330 2243 2149 1982 2119 1983 1821 1719 1795 1660 1813 1961 1894 1791 1782 1683 1743 1525 1512 1328 1437 1480 1420 1272 1312
330A312p4k15p5L6j25o2k3K2j62N5L0r6o0k5O9J29P1K6o3j78j30o6O6Po7M9k9Lm6J32jj9%
$$ 1312 1238 1023 948 984 859 797 774 796 634 689 719 623 563 538 607 736 807 833 770 592 462 396 462 469 402 451 422 425 379 511 510 491 491
321D91Jmo5p6k7n1N1k8j02lN0l9L0rJ11QP7jkm0j39P2P5j53k0K6j8o2j13n7R7J4R2P3n7P2
$$ 491 492 488 423 347 320 269 320 292 190 187 237 198 228 219 330 338 415 414 412 372 233 305 380 227 207 233 215 153 40 -17 80 94 186 259 202 274
313B74j52k3rP7L0m3N2J8j09N5k5J70P1j88q1O1K3m9L1N4o3Mj2j91j7l7J0K3N3L8K6Qj1O6
$$ 274 122 99 90 167 197 154 206 224 115 170 145 315 386 198 117 178 201 152 183 237 174 178 166 -25 -42 -79 -69 -46 7 45 71 79 68 134
304A34J44j51r5k9R5Q0q2O0l0k8n8r5K9P4J44q1j4o8k6J10l4O8m7J08K9N2j7nR0O1J47L55
$$ 134 278 127 32 3 98 178 96 156 126 98 40 -55 -26 48 192 111 97 29 3 113 79 147 100 208 237 289 272 267 357 418 565 920
297I20K40M0N2j91o2j62p7j36J6k2P5L4p4q5M0j46R8L1m5J01o1K6J5J18QK48L77P19J031O76
$$ 920 1160 1200 1252 1061 999 837 760 624 640 618 693 727 653 568 608 462 560 591 546 647 586 612 627 745 753 1001 1378 2097 3128 3804
289C804n97q49p97n89k12o9j51l11L4M1q6k8k6jr2K0L1k3J94J16M1p1J7J47J01J28K40M02
$$ 3804 3207 2358 1561 972 760 691 540 229 263 304 218 190 164 163 71 91 122 99 293 409 450 379 396 543 644 772 1012 1414
282A414K15k68m57l75k04M1j50J2j02oK1j9%Q9q4n0J7j2P1O3o1J9j95j29J51j11K10R4j02
$$ 1414 1629 1361 904 529 325 366 216 228 126 120 141 122 122 211 127 77 94 82 153 216 155 174 -21 -150 1 -110 100 194 92
275I2L5l0O5m3j44o1N7n2J40j1m9Q7k6pm3j57J6K07K7M6Lj12q5j6RL4J54j27j14l5R5M2P3
$$ 92 127 97 162 119 -25 -86 -29 -81 59 48 -1 86 60 53 10 -147 -131 76 103 149 152 40 -45 -61 -52 -18 136 9 -105 -140 -45 -3 70
267G0p3j4j10P9J95p6M1j20j2J00n5q6N8j17k8J15K0o7L6Q1J3n0P7rm6lmN7k06o1J33J02l2
$$ 70 -3 -17 -127 -48 147 71 112 -8 -20 80 25 -61 -3 -120 -148 -33 -13 -80 -44 37 50 0 77 68 22 19 15 72 -134 -195 -62 40 8
259HJ10q9M1j3r4j1J04n2J1k1M6L2o6l1p7n2J65J6l0M4J6j4l6ONnq9O1K3L9l0q5J34j14J5
$$ 8 118 29 70 57 -37 -48 56 4 15 -6 40 72 6 -25 -102 -154 11 27 -3 41 57 43 7 13 18 13 -76 -15 8 47 17 -68 66 -48 -33
251c3J80l9p0m0m2k7P8P3k3m4l1Nq1m5J5K6M3qN4R3o0o0j06J15R7M3j61N1K0o2L9k8K4J05
$$ -33 147 108 38 -2 -44 -71 7 80 57 13 -18 -13 -94 -139 -124 -98 -55 -63 -9 84 24 -36 -142 -27 70 113 -48 3 23 -39 0 -28 -4 101
242A01l2L5j5Kp9L1j00j8n6J10k3Q4M3j9q0J0o8OKp9K7Q0L7n5K3lK8Q9M1j44l5L3k9l3p5J05
$$ 101 69 104 89 91 12 43 -57 -75 -131 -21 -44 40 83 64 -16 -6 -74 -68 -66 -145 -118 -38 -1 -56 -33 -36 -8 81 122 -22 -57 -24 -53 -86 -161 -56
233e6m5M8L2O4K7N7j08p1M5j0O7M7l3q4j00qM8J01m8k6N3lJ11L8k18K6M6J3q5J04k4n5j4j48
$$ -56 -101 -53 -21 43 70 127 19 -52 -7 -17 50 97 64 -20 -120 -128 -80 21 -27 -53 0 -3 108 146 -72 -46 0 13 -72 32 8 -47 -61 -209
225b09J05k6j4N3M4l0L6J15p6j07n5m5J47j30R6P2j9o3N9L7P3o9p7l0O8P3o4o8R4K3l9J14
$$ -209 -104 -130 -144 -91 -47 -77 -41 74 -2 -109 -164 -209 -62 -192 -96 -24 -43 -106 -47 -10 63 -6 -83 -113 -45 28 -36 -104 -10 13 -26 88
217H8n8j85mN4J09opl2o5k5lJ22K20j62j50J23L4N4O6j4j59j06J61P7p8p7o2JN1L0K4p0R9
$$ 88 30 -155 -159 -105 4 -2 -9 -41 -106 -131 -134 -12 208 46 -104 19 53 107 173 159 0 -106 55 132 54 -23 -85 -84 -33 -3 21 -49 50
209E0l1K6J8r0K4RJ07N9O4j59n6q2j17J54L8J68Qr7j10J43l9j27O4J6j08P6R3l4j11p1M5L5
$$ 50 19 45 63 -27 -3 6 113 172 236 77 21 -61 -178 -24 14 182 190 93 -17 126 87 -40 24 40 -68 8 101 67 -44 -115 -70 -35
201c5oL6O4J47o4r8P1q0m7n2k8lM1P8J9mj04nm0o8Q7L07q1j00lR8p5K2n0J3N7nj03q7Q3p0
$$ -35 -41 -5 59 206 142 44 115 35 -12 -64 -92 -95 -54 24 43 39 -65 -70 -110 -178 -91 216 135 35 32 130 55 77 27 40 97 92 -11 -98 -15 -85
193h5Q5P3q2K2J59j28q1J10n7p4k01P3J95J12n7J1j11J6j1Jk5Q1m4qO7J2L7RK1M2Qr0J1o9
$$ -85 0 73 -9 13 172 44 -37 73 16 -58 -259 -186 9 121 64 75 -36 -20 -31 -30 -55 26 -18 -26 41 53 90 99 120 162 170 80 91 22
184B2j04J8Q8r0%M1p6r5l2J70J51m3j10M0J6p6j05P2J17m5Q0K8q0m6m2K11j2j30q8KJ4P0O4
$$ 22 -82 -64 24 -66 -66 -25 -101 -196 -228 -58 93 50 -60 -20 -4 -80 -185 -113 4 -41 39 67 -13 -59 -101 110 98 -32 -120 -118 -104 -34 30
176C0Jk46O1J57O4J1p1lO5l5l4j08Jm2O4Q5JN8p7o5n1L7j02mP8K6J7j21L9KM1J65k5m2J06
$$ 30 31 -215 -154 3 67 78 7 4 69 34 0 -108 -107 -149 -85 0 1 59 -18 -83 -134 -97 -199 -203 -125 -99 -82 -203 -164 -162 -121 44 19 -23 83
168H3J25l1j29r1j29J31k8J9N6N5M8L4oj31k0K6J1j64n3J16m2m6k0R8J36j34K1M1L7Q1o6j9
$$ 83 208 177 48 -43 -172 -41 -69 -50 6 61 109 143 137 6 -14 12 23 -141 -194 -78 -120 -166 -186 -88 48 -86 -65 -24 13 94 28 9
160IJ17j26l0kq4JK24O8j81m9n2o1r7J99M6L5r4N3K8j98J59n8j1P4J36MP3n3j02J17Rj51P
$$ 9 126 0 -30 -32 -116 -115 109 177 -4 -53 -105 -166 -263 -64 -18 17 -77 -24 4 -194 -35 -93 -104 -30 106 110 183 130 28 145 154 3 10
152A0R0j08O6k6l5L5j5j0n6l0J12r8J27Q5l52O3J59j3j88K4J1J5N0n6M7Q8M6q1l2J30Q3o6
$$ 10 100 -8 58 32 -3 32 17 7 -49 -79 33 -65 62 147 -205 -142 17 4 -184 -160 -149 -134 -84 -140 -93 -5 41 -40 -72 58 141 75
144G5oj33MP1P5j9j06Q6O6o0j12j07RJ28p6p2j44J77J68j04m4K24L1n9j9k4L1l4K0N1K5q8
$$ 75 69 -64 -60 11 86 67 -39 47 113 53 -59 -166 -157 -29 -105 -177 -321 -144 24 -80 -124 100 131 72 53 29 60 26 46 97 122 34
136C4q5n1m5O4j9N0m1J52l3m8j54K3M8m5r9O6J09J0Q3J16o8K2j70L3pL6o7J0L0j39j17J71
$$ 34 -51 -102 -147 -83 -102 -52 -93 59 26 -22 -176 -153 -105 -150 -249 -183 -74 -64 19 135 67 89 -81 -48 -55 -19 -86 -76 -46 -185 -302 -131
128a31n7j3J47J69q7lmj14P5J25P0L1q8k4j4Mj59n1J68J4n5%lm8O8rmJ02j5J8Q1n3k97j18
$$ -131 -188 -201 -54 115 28 25 21 -93 -18 107 177 208 120 96 82 86 -73 -124 44 58 3 3 0 -48 20 11 7 109 94 112 193 140 -157 -275
120b75J46R8J33N9j22O0m5l6j7P7l1j6j15lK3JqJ52L6J1r0PN5O2m8q6K6p8p2jL8J9Q2j2k0
$$ -275 -129 -31 102 161 39 99 54 18 1 78 47 31 -84 -87 -64 -63 -71 81 117 128 38 45 100 162 114 28 54 -24 -96 -97 -59 -40 42 30 10
111A0p4k1KJ5kR5j1O8j45m2M2k2nJ44J15m2o0J5q7q1J32K5k2J9p8j26J1K9k7L1LJ37p7n4K3
$$ 10 -64 -85 -83 -68 -70 25 14 82 -63 -105 -63 -85 -90 54 169 127 67 82 -5 -86 46 71 49 68 -10 -136 -125 -96 -123 -92 -89 48 -29 -83 -60
103f0R6R7P7j29j08Q5Mk9j59j5J21P6o6J03k8J1r8j7j27J05Q9j17k7P1J10k2n2j39L8K8M7
$$ -60 36 133 210 81 -27 58 62 33 -126 -141 -20 56 -10 93 65 76 -22 -39 -166 -61 28 -89 -116 -45 65 43 -9 -148 -110 -82 -35
95c5m3o0n1N3o2J54J35pq6Q6L4n9j54J7k1Np9q1L4R3K5j03J46J20J04j42n4Om8pP1P4K1K0
$$ -35 -78 -138 -189 -136 -198 -44 91 84 -2 84 118 59 -95 -78 -99 -94 -173 -254 -220 -127 -102 -205 -59 61 165 23 -31 -25 -73 -80 -9 65 86 106
87A06o5m2L4j4j00k3J07L4J3r7qJ70l2q0j14p4M5J01k3J11nq2p4J0j12J79K2L5J5oK0j24Q8
$$ 106 41 -1 33 19 -81 -104 3 37 50 -47 -55 115 83 3 -111 -185 -140 -39 -62 49 44 -38 -112 -102 -214 -35 -13 22 37 31 51 -73 15
79A5L3q0Oq0N1l4P8P3J6N9k4q2M0mj06n5Q8p1J6j56Q5J67Q0j35K6N9j7p9R8k9q9j11L9p6l8
$$ 15 48 -32 -26 -106 -55 -89 -11 62 78 137 113 31 71 67 -39 -94 -6 -77 -61 -217 -132 35 115 -20 6 65 48 -31 67 38 -51 -162 -123 -199 -237
70b37J52R9k2n1K6P6O2q3o2L7On9J13r2m2L1N7P5j2j55Q0j9K3n9k7Q6P9om3lq0Q0j29J41o4
$$ -237 -85 14 -8 -59 -33 43 105 22 -40 -3 3 -56 57 -35 -77 -46 11 86 74 -81 -1 -20 3 -56 -83 3 82 76 33 30 -50 30 -99 42 -22
62b2j55R6J25N9R0q6n0q8j08l9O6J24l3l6m1J07Q1q9NM5j10j8M5N2N6m7j6q8Q5j0N9M8o5q8
$$ -22 -177 -81 44 103 193 107 57 -31 -139 -178 -112 12 -21 -57 -98 9 90 1 6 51 -59 -77 -32 20 76 29 13 -75 10 0 59 107 42 -46
53d6J53k6m6k5l2l4j07pm2K65J58p8j04o2K2%l3p1m6R5K3o1M4N9n1J5p0n5l3P8p0N7R5N9j8
$$ -46 107 81 35 10 -22 -56 -163 -170 -212 53 211 133 29 -33 -11 -11 -44 -115 -161 -66 -43 -104 -60 -1 -52 -37 -107 -162 -195 -117 -187 -130 -35 24 6
45FP0J43j38j37l0Q5j2M4Q4pK3K5j21l9L7m9l2l5m5P8J49k6j57j7ol8O1QJ14RJ19J3Q2m3j42
$$ 6 76 219 81 -56 -86 -1 -13 31 115 108 131 156 35 -4 33 -16 -48 -83 -128 -50 99 73 -84 -101 -107 -145 -84 -76 38 47 166 179 261 218 76
36G6P6n3n9l1O6J41o4p9M3j7krj04l6m9J9K3P6J15J53P4k2K0q4m2j2M9J53J49J30K23L95O01
$$ 76 152 99 40 9 75 216 152 73 116 99 97 88 -16 -52 -101 -82 -59 17 132 285 359 337 357 273 231 219 268 421 570 700 923 1318 1919
28A919J267K614L445o81l504k139j151n02m22m08j89nlj89N0R5n6J77L4j29n9p0p5j6o1L9
$$ 1919 3186 5800 9245 8564 5060 2921 1770 1268 846 438 249 244 241 52 102 197 141 318 352 223 164 94 19 3 -58 -19
22a9k6L5l5K0m6p1Q2J00j1J01lj29l5Q7qn0N7Qo1j28O1j36J30J08l1q7O9q8M8J28M0r7n4K
$$ -19 -45 -10 -45 -25 -71 -142 -60 40 29 130 127 -2 -37 50 42 -8 49 57 -4 -132 -71 -207 -77 31 0 -87 -18 -106 -58 70 110 13 -41 -39
14c9k0o1L4N9O7rr0p5N3N9K3k6O3q4p2M5M7r8N6R0o7q2J14m6K8L3j2K7m1K9lN6j8j4k2j06
$$ -39 -59 -120 -86 -27 40 31 -59 -134 -81 -22 1 -25 38 -46 -118 -73 -26 -124 -68 22 -45 -127 -13 -59 -31 2 -10 17 -24 5 2 58 40 26 4 -102
5a02Ml4j00m8O5o6J46R8J36k5r3j0k2J13j28j7J29L1q2J1j12J2p6M8J70j51N2R5k4R3j45l6
$$ -102 -98 -132 -232 -280 -215 -281 -135 -37 99 74 -19 -29 -51 62 -66 -83 46 77 -5 6 -106 -94 -170 -122 48 -103 -51 44 20 113 -32 -68
-3f8N1j6R4o8N3J9j47j32q2J81K3j9n8O0J01M7o8o6J72k8j7o9l8j11p4J03R9k5j26j2rO4J41
$$ -68 -17 -33 61 -7 46 65 -82 -214 -296 -115 -92 -111 -169 -109 -8 39 -29 -95 77 49 32 -37 -75 -186 -260 -157 -58 -83 -209 -221 -230 -166 -25
-11b5P2J7L7q6j41O2ql3m4J62n8N0O4j3nj0J2O1k4j9q2J5k1j9m8o1N1q0M6R0J21j02j01N8
$$ -25 47 64 101 15 -126 -64 -72 -105 -149 13 -45 5 69 56 51 41 53 114 90 71 -11 4 -17 -36 -84 -145 -94 -174 -128 -38 83 -19 -120 -62
-19f2J18J4K0N6J3o3j16j36N2L2R8N4j08J16k0M6j54p7M3P9O4r2j2j05lK3Q3l8q8O3J74J2
$$ -62 56 70 90 146 159 96 -20 -156 -104 -72 26 80 -28 88 68 114 -40 -117 -74 5 69 -23 -35 -140 -143 -120 -37 -75 -163 -100 74 86
-27H6r2L1M1p2q1l4qm3J79O7o2j5kO2j8j8mP2j04J1j32LJ35q7n9J6Q6N7PL8P6m7K14j84j93
$$ 86 -6 25 66 -6 -87 -121 -129 -172 7 74 12 -3 -5 57 39 21 17 89 -15 -4 -136 -133 2 -85 -144 -128 -42 15 22 60 136 89 303 119 -74
-36g4m9O6O3M6n7P4P0K6r4j20n7K4N8M2o8r7o1O4J20N5l1j48M1J76n2j05L4pJ1l0Nm1J5jN7
$$ -74 -123 -57 6 52 -5 69 139 165 71 -49 -106 -82 -24 18 -50 -147 -208 -144 -24 31 0 -148 -107 69 17 -88 -54 -61 -50 -80 -75 -116 -101 -102 -45
-44d5J57p8j20M5N0k0j53rJ46M0l9j48O9R8lj14k9m5LP0J57PK3j88k9J21j24P3N5n9m5J4l6
$$ -45 112 34 -86 -41 9 -11 -164 -173 -27 13 -26 -174 -105 -7 -10 -124 -153 -198 -195 -125 32 39 62 -126 -155 -34 -158 -85 -30 -89 -134 -120 -156
-52a56J0N9oM1j39K57pk8k4K7j63P0nL6l2R9rm9LL2j1K4N1l7o2L9O7M5p9j25r4l4K25J03o6
$$ -156 -146 -87 -93 -52 -191 66 59 31 7 34 -129 -59 -64 -28 -60 39 30 -19 -16 16 5 29 80 43 -19 20 87 132 53 -72 -166 -200 25 128 62
-61F2j03j0J01J42j15p9O3L0j4n5N1n1r3m6j2R6R0L1n7J7o5j06p9J38Q8K8n9Lm4jL1n0L1p4
$$ 62 -41 -51 50 192 77 -2 61 91 77 22 73 22 -71 -117 -129 -33 57 88 31 48 -17 -123 -202 -64 24 52 -7 -4 -48 -49 -18 -68 -37 -111
-69a11M3M1p0J1L7R1K4j9nn1j36J45P0Qr9l4J85j60r6l9O1N8j10o3K7J37p1m8j00P0P0J43
$$ -111 -68 -27 -97 -86 -49 42 66 47 42 -9 -145 0 70 78 -21 -55 130 -30 -126 -165 -104 -46 -156 -219 -192 -55 -126 -174 -274 -204 -134 9
-77Ik4k1L1l6J11qrn0N1j07o9j9m4L6MJm6O4O8Nm6K7P4J41m9K6m1kp7N6N9k5k3r4N8kq3l4
$$ 9 -15 -36 -5 -41 70 62 53 3 54 -53 -122 -141 -185 -149 -145 -144 -190 -126 -58 -53 -99 -72 2 143 94 120 79 77 0 56 115 90 67 -27 31 29 -54 -88
-86h8N5n0q5l0rJ11J27j12J52R5j53m0p1r1K14J14j46q7L8j6p5n7J37Nl1K04J2r1q4J13o2
$$ -88 -33 -83 -168 -198 -207 -96 31 -81 71 166 13 -27 -98 -189 25 139 -7 -94 -56 -72 -147 -204 -67 -62 -93 111 123 32 -52 61 -1
-94aj7R4l1n5O6j14kn1P9j13n4JJ33M8M9p7J0M9q2J56J4pq3QM0K6r2m1m7k5J4P2M0l3L0K1
$$ -1 -18 76 45 -10 56 -58 -60 -111 -32 -145 -199 -198 -65 -17 32 -45 -35 14 -68 88 102 95 12 20 60 86 -6 -47 -94 -119 -105 -33 7 -26 4 25
-103B5J6p2M0j26j4qJ14n9M5J22M2Oj47k9O6J02j09L6J34j6n0l3N3J04p6J9j03j04n1N1P1
$$ 25 41 -31 9 -117 -131 -139 -25 -84 -39 83 125 131 -16 -45 21 123 14 50 184 168 118 85 138 242 166 185 82 -22 -73 -22 49
-110D9j53J3Q0O5lJ0k6j16j0O0J22k08M0O5m0j00L6j1p0R6O2k6m2Q3k1k6N5Q5j22p3N2J66
$$ 49 -104 -91 -11 54 51 61 35 -81 -91 -31 91 -117 -77 -12 -52 -152 -116 -127 -197 -101 -39 -65 -107 -24 -45 -71 -16 69 -53 -126 -74 92
-118I2k7ljj25q9K0M4Q2J00q0n8O7m4N8L7k0m1k8l3J58O8r1l0l4n0J9j61p7J16J22J3J37K7
$$ 92 65 62 61 -64 -153 -133 -89 -7 93 13 -45 22 -22 36 73 53 12 -16 -49 109 177 86 56 22 -28 -9 -170 -247 -131 -9 4 141 168
-126A68J6o6j59j12O8O8RPL8j67j0J00oK0L1J9o3M2r9O9k1p6J05J04j7j5O2j57j12P9J29L2
$$ 168 184 118 -41 -153 -85 -17 -8 -1 37 -130 -140 -40 -46 -26 5 24 -39 3 -96 -27 -48 -124 -19 85 68 53 115 -42 -154 -75 54 86
-134H6K4o2J2n7J8qo0l8P0J50r8k0J2p4R7mJ16O7j30k5L2r8p9k7L2J0k6J49Rmm7o2q2Kk8N3
$$ 86 110 48 60 3 21 13 -47 -85 -15 135 37 17 29 -45 52 48 164 231 101 76 108 10 -69 -96 -64 -54 -80 69 78 74 27 -35 -117 -115 -143 -90
-143i0L6K7K3j18J11J08k6o6j23Qk4L7M5M8K1n8n1m9L5O4R6q4JJ4n5J33o8j43R2J16n4l6n4
$$ -90 -54 -27 -4 -122 -11 97 71 5 -118 -110 -134 -97 -52 -4 17 -41 -92 -141 -106 -42 54 -30 -29 -15 -70 63 -5 -148 -56 60 6 -30 -84
-151h4Q4L9J24k3j87K6on6Q1O2r6l3qj08Q6J52J9J05Oq7j0r3j06o8M6L4K6lJ8j17M7R8K3n4
$$ -84 0 39 163 140 -47 -21 -27 -83 -2 60 -36 -69 -77 -185 -99 53 72 177 183 96 86 -7 -113 -181 -135 -101 -75 -78 -60 -177 -130 -32 -9 -63
-159f3J14o9k7j16Q5J2q0lJ8LL4l5m3M8J28L4m0m2J41L8j30pJ30k5j05n9pL6on0j0M5M1N0
$$ -63 51 -18 -45 -161 -76 -64 -144 -147 -129 -126 -92 -127 -170 -122 6 40 0 -42 99 137 7 0 130 105 0 -59 -66 -30 -36 -86 -96 -51 -10 40
-168D0n0pK0MK4p3l5Knk1n2J5J19K0J0k5M7N2r4j0j49O1l5P0R0K2n5q7K5lk6N8K6J0K0l1J6
$$ 40 -10 -17 3 7 31 -42 -77 -75 -80 -101 -153 -138 -19 1 11 -14 33 85 -9 -19 -168 -107 -142 -72 18 40 -15 -102 -77 -80 -106 -48 -22 -12 8 -23 -7
-177gm8J06Q0j58K2j12j28J11Q9N4P0L3J88m0k03j25m8J78j17q5N0L6J66j23K0K0j86k4l2
$$ -7 -55 51 131 -27 -5 -117 -245 -134 -45 9 79 112 300 260 57 -68 -116 62 -55 -140 -90 -54 112 -11 9 29 -157 -181 -213
-184b13p2J47J01j8k0J34O5l6L6M4J9k40l6M1N0l0Q1r9J75m6j13J1j3R0J09j56J9l3K9m0m8
$$ -213 -285 -138 -37 -55 -75 59 124 88 124 168 187 -53 -89 -48 2 -28 53 -46 129 83 -30 -19 -32 58 167 11 30 -3 26 -14 -62
-191f2Q8M4lp5m5N8n5k3%ml5j18Q1R4N2Q3j68l8J67n1k1j9L5l0NO3o8N9Jk1q2l8Q0J10p9Q7
$$ -62 26 70 67 -8 -53 5 -50 -73 -73 -77 -112 -230 -149 -55 -3 80 -88 -126 41 -10 -31 -50 -15 -45 -40 23 -45 14 15 -6 -88 -126 -46 64 -15 72
-200G2j10%k7o0J17R3Q2o3l1o0p3k7Q8J05J01O7j92p5k8N4k4o4k7q5nP0P6j4lJ3j03K7J28
$$ 72 -38 -38 -65 -125 -8 85 167 104 73 13 -60 -87 1 106 207 274 82 7 -21 33 9 -55 -82 -167 -172 -102 -26 -40 -43 -30 -133 -106 22
-208B2j15p0J07K08j47qK7j52M0J01m6n9O7J45k6L5j13l2n3J16k7q6J44J1R9j38j41rN4J46
$$ 22 -93 -163 -56 152 5 -3 24 -128 -88 13 -33 -92 -25 120 94 129 16 -16 -69 47 20 -66 78 89 188 50 -91 -100 -46 100
-216A00k1P3r2P2m9j52k8j8l4N1q5J50Q6o5n0jp5J38j8n2O7J4J16K2j73l4j6J32o0L2l8j1
$$ 100 79 152 60 132 83 -69 -97 -115 -149 -98 -183 -33 53 -12 -62 -63 -138 0 -18 -70 -3 11 127 149 -24 -58 -74 58 -2 30 -8 -19
-223a9j1k1K5K8J7n7M8K4J53j35o2K1K5pj17Q8Q8M4o7j8m0k1L2n7r9J92j0l1l8p1k1n5R3j9
$$ -19 -30 -51 -26 2 19 -38 10 34 187 52 -10 11 36 29 -88 0 88 132 65 47 7 -14 18 -39 -138 54 44 13 -25 -96 -117 -172 -79 -98
-232i8P5K2k3N9n9J37j35j04k4p8J38R7j17rN1J36j13n8NR1J52j93j18O3K3p6O7J41kln9k4
$$ -98 -23 -1 -24 35 -24 113 -22 -126 -150 -228 -90 7 -110 -119 -68 68 -45 -103 -98 -7 145 -48 -166 -103 -80 -156 -89 52 50 47 -12 -36
-239c6rN3J88lj99j7j04Q3oJ0L2M5Q5r4q7J16n8K5o0Q5K6p7Q2m7p3N9P3n1p7M4N5l0n4m8k4
$$ -36 -45 8 196 193 -6 -23 -127 -44 -50 -40 -8 37 122 28 -59 57 -1 24 -36 49 75 -2 80 33 -40 19 92 41 -36 8 63 33 -21 -69 -93
-248i3O6N8q4k3J97l0j47N6P3j17j42P9l8N1l9mk9Q8J01%j1l5Pk4oo3j9J7J3l6N8P9Q8k1r3
$$ -93 -27 31 -53 -76 121 91 -56 0 73 -44 -186 -107 -145 -94 -133 -137 -166 -78 23 23 12 -23 -16 -40 -46 -109 -128 -111 -98 -134 -76 3 91 70 -23
-257b3L2j2n9P5j4q4k6O1J18J0r5L8j13k2K06R6j16j53k8n9N6l8J06n3J52Rj16j50K4N4J02
$$ -23 9 -3 -62 13 -1 -85 -111 -50 68 78 -17 21 -92 -114 92 188 72 -81 -109 -168 -112 -150 -44 -97 55 64 -52 -202 -178 -124 -22
-264b2J3LP3J24l1r4PM1j0j57n9Q5k2P1p6O2o4J61k10o0m8O2Qm6QN5J37j1q7OL5J08m2r8J07
$$ -22 -9 -6 67 191 160 66 73 114 104 -53 -112 -27 -49 22 -54 8 -56 105 -105 -165 -213 -151 -143 -189 -181 -126 11 0 -87 -81 -46 62 20 -78 29
-273B9j8k9l4K5O0j14n1J82J4j16K4J5j0O7o4N8k1q4K1j5m4k3J66n8p5J6L8Rj0p7J07k5j09
$$ 29 11 -18 -52 -27 33 -81 -132 50 64 -52 -28 -13 -23 44 -20 38 17 -67 -46 -61 -105 -128 38 -20 -95 -79 -41 -32 -42 -119 -12 -37 -146
-281a46K7J09n4j34P9J46Kj18k0J47K9j01j6J22r7j7N3o8k5J38J56r5j39l8J13o2J87j82p0
$$ -146 -119 -10 -64 -198 -119 27 29 -89 -109 38 67 -34 -50 72 -25 -42 11 -57 -82 56 212 117 -22 -60 53 -9 178 -4 -74
-288g4M9J8j3k9J79j39k6Q7N1j4o8j09pK5o3J99L7j58n2J9J00k3k84L2K00k6K9J05L8j48o7
$$ -74 -25 -7 -20 -49 130 -9 -35 52 103 89 21 -88 -95 -70 -133 66 103 -55 -107 -88 12 -11 -295 -263 -63 -89 -60 45 83 -65 -132
-295a32P7m3l6J09L1rP6N6J6l2n1n0m8J0Q3n7j09J1J68N5j00q9o3NR2K9m7m4j10J6L0p7q7
$$ -132 -55 -98 -134 -25 6 -3 73 129 145 113 62 12 -36 -26 57 0 -109 -98 70 125 25 -64 -127 -122 -30 -1 -48 -92 -202 -186 -156 -233 -320
-304c20R6J25j5J45j4p6P0q9J2K6n9N1k1O2PmL9j56J04N3n3jR4p3k6MjO6j56r3J84J34l0r
$$ -320 -224 -99 -114 31 17 -59 11 -78 -66 -40 -99 -48 -69 -7 0 -4 35 -121 -17 36 -17 -18 76 3 -23 -19 -20 46 -110 -203 -19 115 85 76
-312G6n1j97J62P8j4R3on7o6l8L6r1QK47N3j59jk5p3q3R6O0m5K3l3k2rQl1M6l7l8k8jrq7j0
$$ 76 25 -172 -10 68 54 147 141 84 18 -20 16 -75 -67 180 233 74 73 48 -25 -108 -12 48 3 26 -7 -29 -38 -30 -61 -15 -52 -90 -118 -119 -128 -215 -225
-321b25J08J16k8j25L3R6J49k0o4o3M1l8m0m8j98J19J05P2M5K0j6j41P4n9o2M0J18L2o3l0
$$ -225 -117 -1 -29 -154 -121 -25 124 104 40 -23 18 -20 -60 -108 -306 -187 -82 -10 35 55 39 -102 -28 -87 -149 -109 9 41 -22 -52
-328e2j1j3l4J26o4q2m9J04L2q4J26p6J6n3j33J02O6m0p0r4L3P9J26L9J6j33l5mJ32J4l0J25
$$ -52 -63 -76 -110 16 -48 -130 -179 -75 -43 -127 -1 -77 -61 -114 -247 -145 -79 -119 -189 -283 -250 -171 -45 -6 10 -123 -158 -162 -30 -16 -46 79
-336G9m6j13OQ1J08j22j36k8J48qJ2r5P3N3j2N8n5K2K3j29j08J32j3n2j65L6J96L6Km8m3J03
$$ 79 33 -80 -74 7 115 -7 -143 -171 -23 -31 -19 -114 -41 12 0 58 3 25 48 -81 -189 -57 -70 -122 -287 -251 -55 -19 -17 -65 -108 -5
-344eN4j07K8J3O2m3r6N3Ol5j53K7J02J47m0m7N1kQ2j5o3rj48mK2n9J26q7kPP3n5k4PQR8P8
$$ -5 49 -58 -30 -17 45 2 -94 -41 -35 -70 -223 -196 -94 53 13 -34 17 15 97 82 19 10 -138 -142 -120 -179 -53 -140 -142 -135 -62 -117 -141 -134 -126 -28 50
-353E0L8j73o9O1j05J43r7j18N5J38o6n9P9N0p9L9r9K8Q9J39P9j4j41jk6o7N5P1r2p4J00J45
$$ 50 88 -85 -154 -93 -198 -55 -152 -270 -215 -77 -143 -202 -123 -73 -152 -113 -212 -184 -95 44 123 109 -32 -33 -59 -126 -71 0 -92 -166 -66 79
-361G9J81p3j27l3l5Qq3k6J3R1j2M8P0j04L8j6j40n0j8O2N0j80R1M0J4oK01no8J8k45M1R2
$$ 79 260 187 60 27 -8 0 -83 -109 -96 -5 -17 31 101 -3 35 19 -121 -171 -189 -127 -77 -257 -166 -126 -112 -118 83 78 10 28 -217 -176 -84
-369h4KK6rm9L1LM2J4j0m6j2J95k2j44L6J26j32p3R4P1l0l1l0l2j24j4P0L3k3N1p4QO0L0J62
$$ -84 -82 -56 -65 -114 -83 -80 -38 -24 -34 -80 -92 103 81 -63 -27 99 -33 -106 -12 59 29 -2 -32 -64 -188 -202 -132 -99 -122 -71 -145 -137 -77 -47 115
-377A15Nn0m0p2N3L1j2J5K9o2r6L9j8p4P7O4j21j53P5P5L6l7J29N0m1R0M7q9m8J0n4K5R2M7
$$ 115 120 70 30 -42 11 42 30 45 74 12 -84 -45 -63 -137 -60 4 -117 -270 -195 -120 -84 -121 8 58 17 107 154 65 17 27 -27 -2 90 137
-386A37j00l4q5J68M1l5K0r4n9ql1o4K06R2j4r6l7J32Pj90N6j10K6J15l2q1M1K9L8j8JJ51
$$ 137 37 3 -82 86 127 92 112 18 -41 -49 -80 -144 62 154 140 44 7 139 146 -44 12 -98 -72 43 11 -70 -29 0 38 20 21 172
-394A72j20j04MK0J41q9r2j6J10P9N9j17j65l2J15J24m8j38O6K8k2NJ16p4o4J0K9P9j50M3
$$ 172 52 -52 -48 -28 113 24 -68 -84 26 105 164 47 -118 -150 -35 89 41 -97 -31 -3 -25 -20 96 22 -42 -32 -3 76 -74 -31
-401c1ko4K4M6J8j44L7N3O3J9J8j24l0n8O6K04l7k18oO1J51N0m6PL7n7j4j6n6N5k9j1m7O3
$$ -31 -33 -97 -73 -27 -9 -153 -116 -63 0 19 37 -87 -117 -175 -109 95 58 -160 -166 -105 46 96 50 57 94 37 23 7 -49 6 -23 -34 -81 -18
-409a8k8O5J7k7n0l1P2J13l8j8N4K8M8J7p5r4q3J46p3j02L8j2L8O1J1r1n9j6R5rq8R5J33j48
$$ -18 -46 19 36 9 -41 -72 0 113 75 57 111 139 187 204 129 35 -48 98 25 -77 -39 -51 -13 48 59 -32 -91 -107 -12 -21 -109 -14 119 -29
-418b9l2m8pL8%j71KK06N3K6R6K7j67n6K1o0%O5K1o7M8L6K6m9o2N9L4j2m7m4PO8N2J60j7p1
$$ -29 -61 -109 -116 -78 -78 -249 -247 -41 12 38 134 161 -6 -62 -41 -101 -101 -36 -15 -82 -34 2 28 -21 -83 -24 10 -2 -49 -93 -86 -18 34 194 177 106
-426A06j4j60l8jp7j04J06q5N2J35RJ39l5k2M9M8j77j14J8J03J00K4q3qPM6J9Q3o1L2R5o3
$$ 106 92 -68 -106 -107 -184 -288 -182 -267 -215 -80 -71 68 33 11 60 108 -69 -183 -165 -62 38 62 -21 -29 -22 24 43 126 65 97 192 129
-434A29j05L0Jl3K8q8m4N8M6l1N6m2m4J7l5jn0n7J8N3J02Q6p3j21J5J8N2q3K1oL8N1N2jn2
$$ 129 24 54 55 22 50 -38 -82 -24 22 -9 47 5 -39 -22 -57 -58 -108 -165 -147 -94 8 94 21 -100 -85 -67 -15 -98 -77 -83 -45 6 58 57 5
-443EQj40KP7o4k8M4q0L7n5Q3N8n1o9PK4K6LP9K4M2m6J7J5j32j4P5K8N4n7n6N5M7m3K6l5P6
$$ 5 13 -127 -125 -48 -112 -140 -96 -176 -139 -194 -111 -53 -104 -173 -166 -142 -116 -113 -34 -10 32 -14 3 18 -114 -128 -53 -25 29 -28 -84 -29 18 -25 1 -34 42
-452D2K2mnp9J7O0l2n4K2l2MLR7l9j56Q4N6m5q8m5K4P0k5P4J3l0Km8J72L4Q5j15j23j7J6K1
$$ 42 64 60 55 -24 -7 53 21 -33 -11 -43 -39 -36 61 22 -134 -50 6 -39 -127 -172 -148 -78 -103 -29 -16 -46 -44 -92 80 114 199 84 -39 -56 -40 -19
-461a9K4jn6n1j9KJ52k7m2jqK4l6Q3j27K4J33l7n8Q3Q5j04J3L0q5k0P2L1M6J27j81j54m2j14
$$ -19 5 4 -52 -103 -122 -120 32 5 -37 -38 -46 -22 -58 25 -102 -78 55 18 -40 43 128 24 37 67 -18 -38 34 65 111 238 57 -97 -139 -253
-469b53PK8M2J16JL8o5J01p0j9m5N2K40j3j18j60OJ65qr9RN4l8m7K9K0Mm3m8l2J22K4P3QK0
$$ -253 -246 -218 -176 -60 -59 -21 -86 15 -55 -74 -119 -67 173 160 42 -118 -112 53 45 -54 -45 9 -29 -76 -47 -27 -23 -66 -114 -146 -24 0 73 81 101
-477A01k2j58qk5N1k9K1K4M4q8K7M4M0O4l6JK2J3p9mL7N4r6j27nk1M4j6J0P5L3O1M5j42j58
$$ 101 79 -79 -87 -112 -61 -90 -69 -45 -1 -89 -62 -18 22 86 50 51 73 86 7 3 40 94 -2 -129 -134 -155 -111 -127 -117 -42 -9 52 97 -45 -203
-486b03J03O7l1p1K4M3K2O1m8L2J07J18j03j58k7R2l2J32L5j17j41q6K04M4l3l9J18n2n5k1
$$ -203 -100 -33 -64 -135 -111 -68 -46 15 -33 -1 106 224 121 -37 -64 28 -4 128 163 46 -95 -181 23 67 34 -5 113 61 6 -15
-493a5M4nj42m8J00J62j42j50Q5P8L4lO9j8j27O5KN3k1l7N8ro3o3j0L4L8M3%m4L2O0M6K1j17
$$ -15 29 24 -118 -166 -66 96 -46 -196 -111 -33 1 -2 67 49 -78 -13 -11 42 21 -16 42 33 -30 -93 -103 -69 -31 12 12 -32 0 60 106 127 10
-502A0%j03j22NJ46k3P8J19n5n6l4l6J35p8kk2J2l2Q8K9j10Q8j3K4l6k9rl7j20J83J30j1j74
$$ 10 10 -93 -215 -210 -64 -87 -9 110 55 -1 -35 -71 64 -14 -16 -38 -26 -58 30 59 -51 37 24 48 12 -17 -26 -63 -183 0 130 119 -55
-510e5m0mJ26l7Q3O3j5L0j59m4N1o3M2p0Qk6J59o3o9K9L4j09J12r2J6M1N2N3J33j56m7j51
$$ -55 -95 -99 27 -10 73 136 121 151 -8 -52 -1 -64 -22 -92 -84 -110 49 -14 -83 -54 -20 -129 -17 -109 -93 -52 0 53 186 30 -17 -168
-518a68k6oN9J22o3L6J21m5J9ml4Nl1K5l6J1j02N7l2P3J6l2lJ57O5j18k00k4%J98J2m0N7n
$$ -168 -194 -200 -141 -19 -82 -46 75 30 49 45 11 16 -15 10 -26 -15 -117 -60 -92 -19 -3 -35 -38 119 184 66 -134 -158 -158 40 52 12 69 64
-526F4o3Orj04O0J22j4k7q7J88L0l5j25o6P3Q4mo3m2m3k7k3N2J27K3l5K5J9N8j25n1J9L4N
$$ 64 1 7 -2 -106 -46 76 62 35 -52 136 166 131 6 -60 13 97 93 30 -12 -55 -82 -105 -53 74 97 62 87 106 164 39 -12 7 41 46
-534D6k8l9j6m0O8M0J5L4L4pk2o2K1N8j17p0M3m4J03P3j94n5J83QJ8p9Oj8L2j0LJ06J02oq3
$$ 46 18 -21 -37 -77 -9 31 46 80 114 107 85 23 44 102 -15 -85 -42 -86 17 90 -104 -159 24 32 50 -29 -23 -41 -9 -19 -16 90 192 186 103
-543A03pm1o9j2R3K4l9O2k9j20N4j36p7Q2RK4J7J05J02op9R7K2j61J43l9o4p8m5K0KO7%n0
$$ 103 96 55 -14 -26 67 91 52 114 85 -35 19 -117 -194 -112 -103 -79 -62 43 145 139 60 157 179 18 161 122 58 -20 -65 -45 -43 24 24 -26
-551b6m4J10L8O0r5M9o7k6O6J16J8j86J75o1j88K6j8J28J32j18k44k9K43M8J9q5l2n5k2N0
$$ -26 -70 40 78 138 43 92 25 -1 65 181 199 13 188 127 -61 -35 -53 75 207 89 -155 -184 59 107 126 41 9 -46 -68 -18
-559a8m3J60Oq7O6L5j54r8J44O4Mj29M7K4k1K0O6mj61r4l2KO0r2JJ41M3J9%J08j44l3n0P1
$$ -18 -61 99 105 18 84 119 -35 -133 11 75 79 -50 -3 21 0 20 86 82 -79 -173 -205 -203 -143 -235 -234 -93 -50 -31 -31 77 -67 -100 -150 -79
-567g9L8n0Q4q6O4J60n9M1J04j04o9m7K8n0l8J9J11J21%m4l6p2R2kK0o4o5Jrm0J00L5n9p7
$$ -79 -41 -91 -7 -93 -29 131 72 113 217 113 44 -3 25 -25 -63 -44 67 188 188 144 108 36 128 126 146 82 17 18 9 -31 69 104 45 -32
-575c2Ko9J7O0N5P2k6m4o6j4LJ24j4L8J6o8O1j41o9P2qj13P0k4K1J44K3m3n9p8O8N4m4k2j2
$$ -32 -30 -99 -82 -22 33 105 79 35 -31 -45 -42 82 68 106 122 54 115 -26 -95 -23 -31 -144 -74 -98 -77 67 90 47 -12 -90 -22 32 -12 -34 -46
-584d6rK2Pq2N1k8N0n3M1J0J38p4l3pk02J6J48P1M7j5L7j01j23MN1J7lj18J61J44K3K7j28
$$ -46 -55 -33 -26 -108 -57 -85 -35 -88 -47 -37 101 27 -6 -13 -215 -199 -51 20 67 52 89 -12 -135 -131 -80 -63 -66 -184 -23 121 144 171 43
-592D3Jj46N1nl1MP6P3o6m8q4j08Q2R7N2L7J63o1k8k4r0j8J65j24QJ6L2N4j28k1R9K3p1n9
$$ 43 44 -102 -51 -56 -87 -83 -7 66 0 -48 -132 -240 -158 -61 -9 28 191 130 102 78 -12 -30 135 11 19 35 67 121 -7 -28 71 94 23 -36
-600c6j5j9K5j7l7M5KK3M4J07Mrj20j69M9q9N4R9mJ4m7O3M6j3k2N4J16M4j82o8P8O9ppk2j48
$$ -36 -51 -70 -45 -62 -99 -54 -52 -29 15 122 126 117 -3 -172 -123 -212 -158 -59 -63 -49 -96 -33 13 0 -22 32 148 192 10 -58 20 89 82 75 53 -95
-609i5p9KJ70o0LN7n0J21j2r1M1N2r5MQ8n2n7j5K18J07k08j05M1j7p5j3%m1P2RP4k5R4o8j7
$$ -95 -174 -172 -2 -62 -59 -2 -52 69 57 -34 7 59 -36 -32 56 4 -53 -68 150 257 49 -56 -15 -32 -107 -120 -120 -161 -89 -80 -6 -31 63 -5 -22
-618b2q7K2N4R2j6q9Nl9N4n5L2L6m5J9M1m4j08R0O6l6l1o6J15j4q4J8J68Mk2O1k0j24q5O0
$$ -22 -109 -87 -33 59 43 -46 -41 -80 -26 -81 -49 -13 -58 -39 2 -42 -150 -60 6 -30 -61 -127 -12 -26 -110 -92 76 80 58 119 99 -25 -110 -50
-626e0Q9k2k5j4q4j74o7J03J09M2NK1L4n8K8j7n9P1M1n6Q6j23k3o3Q3Qo6QJ58J85j28j43j7
$$ -50 39 17 -8 -22 -106 -280 -347 -244 -135 -93 -88 -67 -33 -91 -63 -80 -139 -68 -27 -83 3 -120 -143 -206 -123 -115 -181 -173 -15 170 42 -101 -118
-634a18M8L6k2M9R5P4j83LR7L0k4q5k1O7l7n5J47J19j38l2n5o9P2P0J26k3q1q8o0N6j3j4j12
$$ -118 -70 -34 -56 -7 88 162 -21 -18 79 109 85 0 -21 46 9 -46 101 220 82 50 -5 -74 -2 68 194 171 90 2 -58 -2 -15 -29 -141
-642a41J04K08Rr6j10j00P9K7N1K9m3J1p5n5or5M4R7J02q3m8L2r2J7R5p3P0N2mN3k8ko8n2
$$ -141 -37 171 180 84 -26 -126 -47 -20 31 60 17 28 -47 -102 -108 -203 -159 -62 40 -43 -91 -59 -151 -134 -39 -112 -42 10 6 59 31 29 -39 -91
-650i1Q6M2j1j6o4O8j9l0r6L8J14M1l5J0j04J14O7p1M7k1k1mL4K5o2j43q1l0J85Q0o2j00k2
$$ -91 -5 37 26 10 -54 14 -5 -35 -131 -93 21 62 27 37 -67 47 114 43 90 69 48 44 78 103 41 -102 -183 -213 -28 52 -10 -110 -132
-658a32L5J05L9J00n4M1n0P1n1K6O0j5j97J3L5m7M7j0J99K5q8K4m3M5j47n6RK8J06l2k6O2
$$ -132 -97 8 47 147 93 134 84 155 104 130 190 175 -22 -9 26 -21 26 16 215 240 152 176 133 178 31 -25 -16 12 118 86 60 122
-666A22j07q7M3p5O8j06l7J72Q5m0R6jp4n2K7O1q6j7p3K0L7J6j09J02J67j17p9M0lK8N1j8
$$ 122 15 -72 -29 -104 -36 -142 -179 -7 78 38 134 133 59 7 34 95 9 -8 -81 -61 -24 -8 -117 -15 152 35 -44 -4 -7 21 72 54
-674E4j3J3l8Np3kJ01J6mp6K1j31j00N5J81K7Jn0J17k5L4l3j6K1j1N0j84m2J01J00L9k1l6
$$ 54 41 54 16 21 -52 -54 47 63 59 -17 4 -127 -227 -172 9 36 37 -13 104 79 113 80 64 85 74 124 -60 -102 -1 99 138 117 81
-682H1j32l9M8M9J42j58n4J27J5K4K0m5p7Lm2N0k7q8j9M5J0Q8l0p6J30O5n4M1j3Rj14R9kn8
$$ 81 -51 -90 -42 7 149 -9 -63 64 79 103 123 78 1 4 -38 12 -15 -103 -122 -77 -67 21 -9 -85 45 110 56 97 84 93 -21 78 76 18
-690A8k7qm6N8r7J3J2M6P5P9k6l7p2o8L8L7j25l5k3J5J1J72Q7p1j38K5M3Qj5J14L0j28K6M6
$$ 18 -9 -17 -63 -5 -102 -89 -77 -31 44 123 97 60 -12 -80 -42 -5 -130 -165 -188 -173 -162 10 97 26 -112 -87 -44 -36 -51 63 93 -35 -9 37
-699C7M0j9l1J16P4j24m0Nj34j2O4R6l0j54Q5J41j7l6l5m0k1p0P0O3p2o7K2R0R9nj06L5Kk1
$$ 37 77 58 27 143 217 93 53 58 -76 -88 -24 72 42 -112 -27 114 97 61 26 -14 -35 -105 -35 28 -44 -111 -89 1 100 95 -11 24 26 5
-707EL6oo9N8R9r3n9m2N5K8j2l5rKm9Jn2K5Q6pP5Q1m4L8m7o7m3l6J25Lk7n9K2J4j14R2O7M8
$$ 5 41 35 -34 24 123 30 -29 -71 -16 12 0 -35 -44 -42 -91 -90 -142 -117 -31 -38 37 118 74 112 65 -2 -45 -81 44 47 20 -39 -17 -3 -117 -25 42 90
-716I0J6o7r6L1jj7o9J60%P2O5j82Rq5J24l3l8J05j8r8N3l4nk8l8O3j8j9L3NRn0R9j6Lr8M5
$$ 90 106 39 -57 -26 -27 -44 -113 47 47 119 184 2 11 -74 50 17 -21 84 66 -32 21 -13 -18 -46 -84 -21 -39 -58 -25 -20 -11 -61 38 22 25 -73 -28
-725b8l8N7o9k9J02O3O4k4K1m6l1J8R1M8j42l2q3L0O5%NNm6k4J9n5M2J3J45l2j9o2q8O1J0
$$ -28 -66 -9 -78 -107 -5 58 122 98 119 73 42 60 151 199 57 25 -58 -28 37 37 42 47 1 -23 -4 -59 -17 -4 141 109 90 28 -60 1 11
-734A1J7J64l8j36j26j39Q4o7O7J65p5M2k1l3P0J9J9J8O2r0P6m7Q3m0j66K0l7L7Q4P4p4o4
$$ 11 28 192 154 18 -108 -247 -163 -230 -163 2 -73 -31 -52 -85 -15 4 23 41 103 13 89 42 125 85 -81 -61 -98 -61 23 97 23 -41
-742d1J3Op8J4J34k4j83K5P6l9P3j35RJ49k5K7q2lp6J14nO2p4q7n2J74K17J53j40n4j04j64
$$ -41 -28 -22 -100 -86 48 24 -159 -134 -58 -97 -24 -159 -150 -1 -26 1 -81 -84 -160 -46 -51 11 -63 -150 -202 -28 189 342 202 148 44 -120
-750a20rJ5N5j2n0J01J24q7L3l7k8o6N1k2k4J38J3L1O5o1j00R5J7k25L2K9pK1K23p2j0k6k
$$ -120 -129 -114 -59 -71 -121 -20 104 17 50 13 -15 -81 -30 -52 -76 62 75 106 171 110 10 105 122 -103 -71 -42 -49 -28 195 123 113 87 85
-758H5r2r7K8p4l3J16Q3l7QJ1m1j36J6J9r2N5P3M5K1JL8J07j47J3QK2J10N6L2l5j3N4l0j31
$$ 85 -7 -104 -76 -150 -183 -67 16 -21 -13 -2 -43 -179 -163 -144 -236 -181 -108 -63 -42 -41 -3 104 -43 -30 -22 0 110 166 198 163 150 204 174 43
-766D3k8J28p3j28M7O4nLKj10J1J04K8l2M9K8j27J15j56L5p9j8R1M4j72N4Q6RM2l5l3N9M5
$$ 43 15 143 70 -58 -11 53 48 51 53 -57 -46 58 86 54 103 131 4 119 -37 -2 -81 -99 -8 36 -136 -82 4 13 55 20 -13 46 91
-774I1n1J20q2L3r8j19J12n3p7L5L8R6J17o6k64l6l4j0K4J24l1mJ6O9pJ24O3j7j25Mm1L5j3
$$ 91 40 160 78 111 13 -106 6 -47 -124 -89 -51 45 162 96 -168 -204 -238 -248 -224 -100 -131 -135 -119 -50 -57 67 130 113 -12 -8 -49 -14 -27
-782b7m5Q8n7l5J8M9O3p9j01J30J06N0k0j32r2lLL5k1j7kM2p2O9P7l2j6J6q3J3O8M3%L1kj09
$$ -27 -72 16 -41 -76 -58 -9 54 -25 -126 4 110 160 140 8 -84 -87 -84 -49 -70 -87 -89 -47 -119 -50 27 -5 -21 -5 -88 -75 -7 36 36 67 65 -44
-791d4O7k2M4N2p6l5l9L7l3J8Q7k8k8j32o1J29J10QRp0n3P2K1n8o2n0l8K49Pm3Kl6Plj33J4
$$ -44 23 1 45 97 21 -14 -53 -16 -49 -31 56 28 0 -132 -193 -64 46 54 63 -7 -60 12 33 -25 -87 -137 -175 74 81 38 40 4 11 8 -125 -111
-800a11N5O0M4%m7M6j1j20P8j7j7J6o6l4N9j06P0R5J17n6k9J6L1lj06o7P7%Kr8qJ80ll0r4
$$ -111 -56 4 48 48 1 47 36 -84 -6 -23 -40 -24 -90 -124 -65 -171 -101 -6 111 55 26 42 73 70 -36 -103 -26 -26 -24 -122 -130 50 47 17 -77
-808g7n6J10J8m2l6J7O0l3Q0N0J8Rk0L4q8k6km5k8M9j77M0J55J39p5j09K2J37p6l6kM5k5j07
$$ -77 -133 -23 -5 -47 -83 -66 -6 -39 41 91 109 118 98 132 44 18 16 -29 -57 -8 -185 -145 10 149 74 -35 -13 124 48 12 10 55 30 -77
-817g7J03J53j00l8q6O3k9K1J6n6k5K3O9J0Qm3n3J48R0p3j25J2m1p4J16M3n7p4J00n1K4p8
$$ -77 26 179 79 41 -45 18 -11 10 26 -30 -55 -32 37 47 55 12 -41 107 197 124 -1 11 -30 -104 12 55 -2 -76 24 -27 -3 -81
-824h1K7m6J20K9k6l0l6JJ1j3L2N6J4n5l7M2K9Q1L7P6l9p7n5R0m1j39l1O7M4n0p2Q9J3K2k4
$$ -81 -54 -100 20 49 23 -7 -43 -42 -31 -44 -12 44 58 3 -34 8 37 118 155 231 192 115 60 150 109 -30 -61 6 50 0 -72 17 30 52 28
-833B8q6J1KJ35o8q6M9l3l3P5K8l7M5l3Q5o1J3o1l8O1P6p3K2rK7p2j28J39jJ09l2k4N7M6j55
$$ 28 -58 -47 -45 90 22 -64 -15 -48 -81 -6 22 -15 30 -3 82 21 34 -27 -65 -4 72 -1 21 12 39 -33 -161 -22 -23 86 54 30 87 133 -22
-842b2r7J30J4L0j9m9j5M7J21j28N6L3j28qP2j4q1o1N5L4P6n3l5oJ10r6q6J7LM3J09j8OJ8
$$ -22 -119 11 25 55 36 -13 -28 19 140 12 68 101 -27 -35 37 23 -58 -119 -64 -30 46 -7 -42 -48 62 -34 -120 -103 -100 -57 52 34 40 58
-850E8q2K2K1m7l7l7J10M2p5q9J23L1l0P5K5q2j2p1k5N7jJ4m9L4Nj0R1l4R4l5J1R6J5j17j13
$$ 58 -24 -2 19 -28 -65 -102 8 50 -25 -114 9 40 10 85 110 28 16 -55 -80 -23 -24 -10 -59 -25 -20 -30 61 27 121 86 97 193 208 91 -22
-858b2J14n5J14j39N1M1O9o9p5r8K0J42o7L5j4L3L4pn3j54jJ11J07k6q7K2j43J9J92l9K9m1
$$ -22 92 37 151 12 63 104 173 104 29 -69 -49 93 26 61 47 80 114 107 54 -100 -101 10 117 91 4 26 -117 -98 94 55 84 43
-866D3o3L5O1m3j78L2P9j0Rl4J7K4J4Q3n9q2K6J31j31j08J5P6N6O0M2R6j1o0Nj93n7L4N2M1
$$ 43 -20 15 76 33 -145 -113 -34 -44 -35 -69 -52 -28 -14 69 10 -72 -46 85 -46 -154 -139 -63 -7 53 95 191 180 120 125 -68 -125 -91 -39 2
-875Bj5j7N5L4K9q2J43m2k2Jo5j28m7N5J18L3j14o8P0R3J3l7m0k6L4J7J4m3L4J75J4k01l3
$$ 2 -13 -30 25 59 88 6 149 107 85 86 21 -107 -154 -99 19 52 -62 -130 -60 33 46 9 -31 -57 -23 -6 8 -35 -1 174 188 -13 -46
-883d6J66j58q7J97Nm2j2n1j9J53qp2j32m9Q0J13J2j01r3k9P9P3Ok9N3q2j7M2J73K1j09q3
$$ -46 120 -38 -125 72 77 35 23 -28 -47 106 98 26 -106 -155 -75 38 50 -51 -144 -173 -94 -21 -15 -44 9 -73 -90 -48 125 146 37 -46
-890d6j8J23J85M7j80j41J08%j00M8J52L3l3j80k0J19j3m9j6Qm1j59N4j01J11R6n9J18N9l3
$$ -46 -64 59 244 291 111 -30 78 78 -22 26 178 211 178 -2 -22 97 84 35 19 27 -14 -173 -119 -220 -109 -13 -72 46 105 72
-898G2j13k1J9R8j04j5O4j53K6K7K0J14k0j5PK3Q4N8j6j50p7P3n6r2R1Q1M2N2j14r5Q3K6R5
$$ 72 -41 -62 -43 55 -49 -64 0 -153 -127 -100 -80 34 14 -1 6 29 113 171 155 5 -72 1 -55 -147 -56 25 67 119 5 -90 -7 19 114
-906A14o1m8p4J36N8j28j12J74L3J28q5p4K4N9l7k7m0K4k0p1r1O1O2j34p5J47J04L8l9o4l5
$$ 114 53 5 -69 67 125 -3 -115 59 92 220 135 61 85 144 107 80 40 64 44 -27 -118 -57 5 -129 -204 -57 47 85 46 -18 -53
-913e3J8k5L2j33J08J50k5K9j40p6J10J3R8N7j78n4M0O7L0P1j05m4n7l0PL3n2L0Q7J07K2p3
$$ -53 -35 -60 -28 -161 -53 97 72 101 -39 -115 -5 8 106 163 -15 -69 -29 38 68 139 34 -10 -67 -97 -90 -57 -109 -79 8 115 137 64
-921F4l9j63n8m2J77Q2o2j6J41j25PJ05O9o7k4j10K9P1r4O3M3L3j58J2M2J07q0K9lN1Jn0R
$$ 64 25 -138 -196 -238 -61 21 -41 -57 84 -41 -34 71 140 73 49 -61 -32 39 -55 8 51 84 -74 -62 -20 87 7 36 33 84 85 35 44
-929D4KM2O9PJj16J9j75J9NNQ2L2R8J22j07j77j0J40k1J13j28J7Rq3r7k3K8Q3nM7l7j76K29
$$ 44 46 88 157 164 165 49 68 -107 -88 -83 -78 4 36 134 256 149 -28 -38 102 81 194 66 83 92 9 -88 -111 -83 0 -5 42 5 -171 58
-938E8L6p3M2Q7oj20n6j53K7Q3J43L4j19J8J82o0q9J4NmJ6L5o0L6M1j7kJ17o8j83L5jm4l7
$$ 58 94 21 63 150 144 24 -32 -185 -158 -75 68 102 -17 1 183 123 34 48 53 49 65 100 40 76 117 100 98 215 147 -36 -1 -2 -46 -83
-946h3M8J57K0P8n4j12L2q5Q9j1J6m0mn1k7m1jn2j5M7J66nO1k5l7m5R3j27m7P4j7o3Q1J09
$$ -83 -35 122 142 220 166 54 86 1 90 79 95 55 51 0 -27 -68 -69 -121 -136 -89 77 72 133 108 71 26 119 -8 -55 19 2 -61 20 129
-954A29q8k10m8K01Nj1N5J07o2R4k8J1l2J26r6j44Ojj18mR8o5J0J3J6q5J39O0j25l8J33K5
$$ 129 41 -169 -217 -16 -11 -22 33 140 78 172 144 155 123 249 153 9 15 14 -104 -108 -10 -75 -65 -52 -36 -121 18 78 -47 -85 48 73
-962G3j6m2O1r3nN2J04m6M0M1m4j05pk1o4j35Q1J07p0J6M8L9j49J19L9k0j38J55N1j55L5L3
$$ 73 57 15 76 -17 -22 30 134 88 128 169 125 20 13 -8 -72 -207 -126 -19 -89 -73 -25 14 -135 -16 23 3 -135 20 71 -84 -49 -16
-970a6k0L1jJ8P6j36Lj0Lp3J57Mm8j8N3P9k0M7J2R4r9m7p7Q6j8o6PJ11j4m7j04J05j3N0m8
$$ -16 -36 -5 -6 12 88 -48 -45 -55 -52 -125 32 36 -12 -30 23 102 82 129 141 235 136 89 12 98 80 14 21 132 118 71 -33 72 59 109 61
-978F1J9K3m8M5n2o2m2n4J03J63K4j75q4J17K7N2K3l8p6n8L0r3M1O7m6Q5K4l3J2O7P6j06q1
$$ 61 80 103 55 100 48 -14 -56 -110 -7 156 180 5 -79 38 65 117 140 102 26 -32 -2 -95 -54 13 -33 52 76 43 55 122 198 92 11
-987A1j7JJ0p0O2R4KPj3Lm3J9N3%n7J3n9N7J8qJ5N0n6o9n7r6J67k4%J1m4J3m3N7R7M9Km3j87
$$ 11 -6 -5 5 -65 -3 91 93 100 87 90 47 66 119 119 62 75 16 73 91 83 98 148 92 23 -34 -130 37 13 13 24 -20 -7 -50 7 104 153 155 112 -75
-996g5J13J44P3j53Jl0J04l8l4j19J6N0M2K4k08Ro1J73J5MJ03mo6k2kK4j02q2L0j12J07%J3
$$ -75 38 182 255 102 103 73 177 139 105 -14 2 52 94 118 -90 -81 -142 31 46 50 153 149 83 61 59 83 -19 -101 -71 -183 -76 -76 -63
-1004f3P2k5j15J08m7O5R8J13n9q3M6N1jm4m3o2j64M2m9k5M5K13q5j33rN2%PJ75J23l6j38
$$ -63 9 -16 -131 -23 -70 -5 93 206 147 64 110 161 160 116 73 11 -153 -111 -160 -185 -140 73 -12 -145 -154 -102 -102 -95 80 203 167 29
-1012B9m3J2j0j2O7K3k2j58j17k9O7O1K24o8o2M1l5j16j21J51J21K3L5R1m0n8n1K6R4m4kP6
$$ 29 -14 -2 -12 -24 43 66 44 -114 -231 -260 -193 -132 92 24 -38 3 -32 -148 -269 -118 3 26 61 152 112 54 3 29 123 79 77 153
-1020A53j14k6nq1k3J22Mo9j8JO8K2J9qj8n3n3Q8J06J01n4j38r1j8P7p1o3o4J25O7j42k9J60
$$ 153 39 13 8 -73 -96 26 30 -39 -57 -56 12 34 53 45 27 -26 -79 9 115 216 162 24 -67 -85 -8 -79 -142 -206 -81 -14 -156 -185 -25
-1028b5M3O5j47o1J18l0j7O7LM3M5j24m2K3O9K3r4L5R5J6j61mM6j06J0Jj0M9R9J50o7N6k03
$$ -25 18 83 -64 -125 -7 -37 -54 13 16 59 104 -20 -62 -39 30 53 -41 -6 89 105 -56 -60 -14 -120 -110 -109 -119 -70 29 179 112 168 -35
-1036c5j07J18M0p8O1N9k8q8pj21N1m4LL1J82O9j32r5K0J46Q4k8l3l4pq1K7rl1p8O8J21r0
$$ -35 -142 -24 16 -62 -1 58 30 -58 -65 -186 -135 -179 -176 -145 37 106 -26 -121 -101 45 129 101 68 34 27 -54 -27 -36 -67 -145 -77 44 -46
-1044d6m7P0R7K2K9L6o7J3n5n2J22r1n7L3j2M5N0P5r0P5n0M3n8p7M7L2k2J6K9l9j49K7Jm0
$$ -46 -93 -23 74 96 125 161 94 107 52 0 122 31 -26 7 -5 40 90 165 75 150 100 143 85 8 55 87 65 81 110 71 -78 -51 -50 -90
-1052i0l1P7J53j4j28r8K5M4M0J9Lm8K3J41j00J5O9j89J2J38j6j39j7L2nPO9lQ0l3m5M2l3
$$ -90 -121 -44 109 95 -33 -131 -106 -62 -22 -3 0 -48 -25 116 16 31 100 -89 -77 61 45 -94 -111 -79 -84 -77 -8 -11 69 36 -9 33 0
-1060@j4l0r8K0o9J5J51M0on5p1Q1k3R6Q0o3Qk4j06j12K0J30J06nL1l5L0M2r0L0P7Lj97O5
$$ 0 -14 -44 -142 -122 -191 -176 -25 15 9 -46 -117 -36 -59 37 117 54 62 38 -68 -180 -160 -30 76 71 102 67 97 139 49 79 156 159 -38 27
-1069B7L3j0K3m8MK7M7l4p1J44j05o1N9k4mM9o4P5o1R4k8r8Jr4M7M6l9Qr1n2J24J5J02M7k33
$$ 27 60 50 73 25 29 56 103 69 -2 142 37 -24 35 11 7 56 -8 67 6 100 72 -26 -25 -119 -72 -26 -65 -57 -148 -200 -76 -61 41 88 -145
-1077a45M0J43Qm3q5m2J46j68k7oPQ8L1J58r7l1J16R7l5M4l1j45J6N2j79J0j2K8n7P9K3l6
$$ -145 -105 38 46 3 -82 -124 22 -146 -173 -179 -172 -84 -53 105 8 -23 93 190 155 199 168 23 39 91 -88 -78 -90 -62 -119 -40 -17 -53
-1085e3n8j9MJ45q2qk4O9k5p6P8O4n8J5q4J9J6J00N5j99j05N5O8oJ14J28k4p2j61J59P8j51
$$ -53 -111 -130 -126 19 -63 -71 -95 -26 -51 -127 -49 15 -43 -28 -112 -93 -77 23 78 -121 -226 -171 -103 -109 5 133 109 37 -124 35 113 -38
-1093c8M4j2j4N1o2j1pj5K2J62Q3mL2j48q7j2J5oj06j3J11j60Q5J44K6K1j91o8M3K8M1j2R0
$$ -38 6 -6 -20 31 -31 -42 -49 -64 -42 120 203 199 231 83 -4 -16 -1 -7 -113 -126 -15 -175 -90 54 80 101 -90 -158 -115 -87 -46 -58 32
-1101C2kj17p9KL4O0OK0R5m6O0J03j41m9m2j5R1L0l4P6J6J95k2k57j40O9R8N4k5j36lR8q2
$$ 32 30 -87 -166 -164 -130 -70 -64 -44 51 5 65 168 27 -22 -64 -79 12 42 8 84 100 295 273 16 -124 -55 43 97 72 -64 -67 31 -51
-1109e1N6J1N0l3j36LJ17J5J68qr3JNk0k9M5p5j13N3P2R5k8j6mj28o2k6o6J64Lj12L1J2qj1
$$ -51 5 16 66 33 -103 -100 17 32 200 192 99 100 105 85 56 101 26 -87 -34 38 133 105 89 85 -43 -105 -131 -197 -33 -30 -142 -111 -99 -107 -118
-1118a18O4N4M7Pk6P1j21J19j67m6Q6j9k2O0M7J66N9k33k16J27J56l5N3m0m8j68R5M5q4%K7
$$ -118 -54 0 47 54 28 99 -22 97 -70 -116 -30 -49 -71 -11 36 202 261 28 -188 -61 95 60 113 73 25 -143 -48 -3 -87 -87 -60
-1125f0j0J26n7r8J02J34j24k1r5q4J01K0Q2l0K5R7P6L2p9p1q8k1Q8rj25N3nq8K3j1%O5J0
$$ -60 -70 56 -1 -99 3 137 13 -8 -103 -187 -86 -66 16 -14 11 108 184 216 137 66 -22 -43 45 36 -89 -36 -41 -129 -106 -117 -117 -52 -42
-1133d2l3Q7m5l0j8N6K5j4L0N7j00m5jMo4P9o0N6P7O3pn5R4J01O%p5j37P0lKl2j45j7R9J26
$$ -42 -75 12 -33 -63 -81 -25 0 -14 16 73 -27 -72 -73 -69 -133 -54 -114 -58 19 82 75 20 114 215 221 221 146 9 79 76 78 46 -99 -116 -17 109
-1142A09N4j19Q5qp6j8pk3J1k5Q2q5k1N5K6m7P3J01q4j76kkk1K3NQP1J13j3j02P8k8m7L1Q4
$$ 109 163 44 129 121 45 27 20 -3 8 -17 65 -20 -41 14 40 -7 66 167 83 -93 -95 -97 -118 -95 -90 -82 -11 102 89 -13 65 37 -10 21 105
-1151A05q9j64Q0n6P1M6l3J7M5o2J42j07m5J6K6N2O7N2j9n5j03k9R8L2j10K4J29rjM3j10j10
$$ 105 16 -148 -68 -124 -53 -7 -40 -23 22 -40 102 -5 -50 -34 -8 44 111 163 144 89 -14 -43 55 87 -23 1 130 121 120 163 53 -57
-1158e7k1O9Km6M3J55l9q1J4J5l4k3k3J25Ml8Lo9n0R1L3o1MJ03k4n0l6n7OP1P7j1N3N4j5j5
$$ -57 -78 -9 -7 -53 -10 145 106 25 39 54 20 -3 -26 99 103 65 68 -1 -51 40 73 12 16 119 95 45 9 -48 -42 29 106 95 148 202 187 172
-1167A72RPo0r9j76O6K4n9j8K63r0j75P8o4J2R2r4k2J91q0k6M9m9p1N4J34M7J5k5Qk1q7P2
$$ 172 181 188 128 29 -147 -81 -57 -116 -134 129 39 -136 -58 -122 -110 -18 -112 -134 57 -23 -49 0 -49 -120 -66 68 115 130 105 113 92 5 77
-1175G7Q7j75Om7M6p5J01P2mp1k0M7P8j71qK0q8K3m6J6J32%J05N6o4m2K8J0M0j0N2J9j28j9
$$ 77 164 -11 -5 -52 -6 -81 20 92 88 17 -3 44 122 -49 -57 -37 -125 -102 -148 -132 0 0 105 161 97 55 83 93 133 123 175 194 66 47
-1184D7K9pj56MJ88j01r3o3L9J66N3p1kMK6m7Q7pj81J22l8n5O4j5M9l9r7L5J3J18j1m0P7q6
$$ 47 76 69 -87 -83 105 4 -89 -152 -113 53 106 35 33 37 63 16 103 96 -85 37 -1 -56 8 -7 42 3 -94 -59 -46 72 61 21 98 12
-1192A2p2l7l6j60J4J95J53K9k1l7O7J27r8M8n9J3l0j0M7p8j26J28J8J7k5J6j05r6K2QJ7P9
$$ 12 -60 -97 -133 -293 -279 -84 69 98 77 40 107 234 136 184 125 138 108 98 145 67 -59 69 87 104 79 95 -10 -106 -84 -76 -59 20
-1200B0j8m9k5K8J91M9j19j16n8N5K3o6J02M8q0J2j09J36J8pL0l9o4L5L1q8l4P5jl1J08J00
$$ 20 2 -47 -72 -44 147 196 77 -39 -97 -42 -19 -85 17 65 -15 -3 -112 24 42 35 65 26 -38 -3 28 -60 -94 -19 -20 -51 57 157
-1208A57o3O5m1j22O4nN3q2J76l9j21n8N3O6Rj06k9N4r8O2J99n7j15j0J6k2l7o9N0J5p4m0
$$ 157 94 159 118 -4 60 55 108 26 202 163 42 -16 37 103 112 6 -23 31 -67 -5 194 137 22 12 28 6 -31 -100 -50 -35 -109 -149
-1215a49J52N0j39l2J42R4mk4m0O6M4l1j11nJ00M5o6N7k6n8q0M0j9k9l7P8o5jR4R5M2j1k1
$$ -149 3 53 -86 -118 24 118 114 90 50 116 160 129 18 13 113 158 92 149 123 65 -15 25 6 -23 -60 18 -47 -48 46 141 183 172 151
-1224A51k7p8o9J46Rn3K8L0q0j9P3n5j28LL8Op1P8l8j10N6N6P8j6j18l0O5J01J17j57%l5J6
$$ 151 124 46 -23 123 132 79 107 137 57 38 111 56 -72 -69 -31 -25 -96 -18 -56 -166 -110 -54 24 8 -110 -140 -75 26 143 -14 -14 -49 -33
-1232c3k6L7J9l5l9L3MJ1j1n0M9k9%P5o7O3J43Q7o9j64p6M7J05N5n1j19L7J05mo5q7K8O1M1
$$ -33 -59 -22 -3 -38 -77 -44 -40 -29 -40 -90 -41 -70 -70 5 -62 1 144 231 162 -2 -78 -31 74 129 78 -41 -4 101 97 32 -55 -27 34 75
-1240G5q3M6j09l8k6O5Q2j3J3ko8O4O1J1r6L9j52P5J91j37OP3oL1p4j57J3J97J94j75j4m4
$$ 75 -8 38 -71 -109 -135 -70 12 -1 12 10 -58 6 67 78 -18 21 -131 -56 135 -2 4 77 71 102 28 -129 -116 81 275 100 86 42
-1248D2P5m9j75J07ko6lo8J12P8j48k4l3R6N8Q4m5K4q3R6ol2J7J3Q3j60k5j4LjnO1O6Q3Kj23
$$ 42 117 68 -107 0 -2 -68 -71 -139 -27 51 -97 -121 -154 -58 0 84 39 63 -20 76 70 38 55 68 151 -9 -34 -48 -45 -46 -51 10 76 159 161 38
-1257C8O5J01p9kK0j04M1j17l0nkK6o7J2o3qJ74J1Q5j12p7J09K4R8pk11r1O9N8k3l4J4K5l6
$$ 38 103 204 125 123 143 39 80 -37 -67 -72 -74 -48 -115 -103 -166 -174 0 11 96 -16 -93 16 40 138 131 -80 -171 -102 -44 -67 -101 -87 -62 -98
-1265i8m7M6J47k9P4K3o3M3k0k5M5J7N0mq4p2R3J0R8J6j08j0K9K8O9k3j38K7m9j56R4oL1L4
$$ -98 -145 -99 48 19 93 116 53 96 76 51 96 113 163 159 75 3 96 106 204 220 112 102 131 159 228 205 67 94 45 -111 -17 -23 8 42
-1273D2N8j42n1J61%J28Ql2o3j20k3mL7K9jo3j56Q5j3J04K8m2Lj68o3J20J29N5o5k1J36J5
$$ 42 100 -42 -93 68 68 196 204 172 109 -11 -34 -38 -1 28 27 -36 -192 -107 -120 -16 12 -30 -27 -195 -258 -138 -9 46 -19 -40 96 111
-1281A11k4o2p9L4K0J29Q7m2j46o0N4R0K2k1q5o8Q3j68L7K9K4L8P5L1j05j26Q8J57O9j68j38
$$ 111 87 25 -54 -20 0 129 216 174 28 -32 22 112 134 113 28 -40 43 -125 -88 -59 -35 3 78 109 4 -122 -34 123 192 24 -114
-1289a14K36N4M8L2j12j02K6kN4Q2R5m9j21p3N4N3l5m3j84M3O6L7o4knJ49J6o4j1lj35L0q6
$$ -114 122 176 224 256 144 42 68 66 120 202 297 248 127 54 108 161 126 83 -101 -58 8 45 -19 -21 -26 123 139 75 64 61 -74 -44 -130
-1297a30P9J8J85n1m8j20J6j1p1N1M7P3KP3l7j40J28k7q7K8N6L8j03L6q2lJ4P4Q3Mj03J28
$$ -130 -51 -33 152 101 53 -67 -51 -62 -133 -82 -35 38 40 113 76 -64 64 37 -50 -22 34 72 -31 5 -77 -80 -66 8 91 95 -8 120
-1304A20o7k4J07j4L3j6N1q8j17K1N6q1jN4m4Q8jr5J50k8k8Mr8j33O6O8n8J81K6J2n3j7k2
$$ 120 53 29 136 122 155 139 190 102 -15 6 62 -19 -20 34 -10 78 77 -18 132 104 76 80 -18 -151 -85 -17 -75 106 132 144 91 74 52
-1313E2L2K5j5o2l0r4Q0Q%o5oj9jP4j7R2j5l9K9l9l1Q3k3MQ1J3o9j3o3q1M5N3M5l5j21J01
$$ 52 84 109 94 32 2 -92 -12 -4 -4 -69 -75 -94 -95 -21 -38 54 39 0 29 -10 -41 42 19 23 104 117 48 35 -28 -109 -64 -11 34 -1 -122 -21
-1321b1N1rM4jl6k3k0P5L0j8q1k4O4J49j38j04k8p2J47Q9m7l1K7N6j00q4j9l7J39L4q9K3p
$$ -21 30 21 65 64 28 5 -15 60 90 72 -9 -33 31 180 42 -62 -90 -162 -15 74 27 -4 23 79 -21 -105 -124 -161 -22 12 -77 -54 -61
-1329f1q5K4qP3Nm5M7J36K8jJ7Jj33j4M0Kmm2n7n1Qk4PP8P9R5%o1j81L8O6K1Kp5N8P9L0r4
$$ -61 -146 -122 -130 -57 -52 -97 -50 86 114 113 130 131 -2 -16 24 26 22 -20 -77 -128 -120 -144 -137 -59 20 115 115 54 -127 -89 -23 -2 0 -75 -17 62 92 -2
-1339bj22J22L9L5m4q0k9L7J5R2m9j3QLm2J1n3P5o2J3K12n0j48Q1q7q3oN6j2J22O2j36K9Q0
$$ -2 -124 -2 37 72 28 -52 -81 -44 -29 63 14 1 9 12 -30 -19 -72 3 -59 -46 166 116 -32 49 -38 -121 -127 -71 -83 39 101 -35 -6 74
-1347G4N7o9j46r3J33J33l7m8j26M9R6o1J2m3O9P4q4p2ro1J06L6o2Q5M1n2O1n2k04J25K19
$$ 74 131 62 -84 -177 -44 89 52 4 -122 -73 23 -38 -26 -69 0 74 -10 -82 -91 -152 -46 -10 -72 13 54 2 63 11 -193 -68 151
-1355A51j3q9m6k6K9k6J6R5o7j12K2J31J06N4j88k4J57o0p8m5M9L0L0j40QJ27k8J9R0Nm4j09
$$ 151 138 49 3 -23 6 -20 -4 91 24 -88 -66 65 171 225 37 13 170 110 32 -13 36 66 96 -44 -36 91 63 82 172 177 133 24
-1362B4p9p4k0J67L5n1j1L9O1l7R1J08n6j07n5k0J6N2OL7r6QJ6j16k6j7J54K6M7j35m5K07
$$ 24 -55 -129 -149 18 53 2 -9 30 91 54 145 253 197 90 35 15 31 83 89 126 30 38 54 -62 -88 -105 49 75 122 -13 -58 149
-1370A49r9r0OM6J62j41k2R6k1M8Rm6j22L3R7k0p9m2M3k0K7l8r6N1Q6J17Q4m8j89p0p7J0L9
$$ 149 50 -40 -34 12 174 33 11 107 86 134 143 97 -25 8 105 85 6 -36 7 -13 14 -24 -120 -69 17 134 218 170 -19 -89 -166 -156 -117
-1378a17J40j26l3j4L2J45l0P7M0l5N4q4r4n5%N0j57O8J13K6jPk9J6m0j5Q1lMm3k8J46Nm1
$$ -117 23 -103 -136 -150 -118 27 -3 74 114 79 133 49 -45 -100 -100 -50 -207 -139 -26 0 -1 6 -23 -7 -47 -62 19 16 20 -23 -51 95 100 59
-1387E9J38j3j81l3k6nrJ1qm1J6K8J02K3m7j06J02k6j32N1P8M5q9O5n1j25J78J3m7m2R9j1
$$ 59 197 184 3 -30 -56 -61 -70 -59 -67 -108 -92 -64 38 61 14 -92 10 -16 -148 -97 -19 26 -63 2 -49 -174 4 17 -30 -72 27 16
-1394A6j15Q3O0k2k5q5J18j0k2kQ2oJ5K2L7l6m1J76P1j35j21j5P9j01j02pM3N5P6P2k2j48
$$ 16 -99 -16 44 22 -3 -88 30 20 -2 -4 78 72 87 109 146 110 69 245 316 181 60 45 124 23 -79 -86 -43 12 88 160 138 -10
-1402a0j03K3N6O9K3m9J04pr2J1kR8rJl0j65J86J34p5r0r3N7K4j7J56j46n5j10Mlq1K3N5J00
$$ -10 -113 -90 -34 35 58 9 113 106 14 25 23 121 112 113 83 -82 104 238 163 73 -20 37 61 44 200 54 -1 -111 -107 -110 -191 -168 -113 -13
-1411a3kq9k3M8Q1K8J4J03p3J9j42j4P0j37l1L3R9K5j2j4J22J03q1Kj69q2K0M3j13mM6K6K20
$$ -13 -15 -104 -127 -79 2 30 44 147 74 93 -49 -63 7 -130 -161 -128 -29 -4 -16 -30 92 195 114 116 -53 -135 -115 -72 -185 -189 -143 -117 103
-1419A03K03j88k48PJ59M6p8l5k0j3M2J5M1j15k1P5j0k0j52J10P7RJ14k3N2j04Om6j0P8j58
$$ 103 306 118 -130 -123 36 82 4 -31 -51 -64 -22 -7 34 -81 -102 -27 -37 -57 -209 -99 -22 -13 101 78 130 26 32 -14 -24 54 -104
-1426a04n0K6M7J65q3l4J07o2Q0j39NKQ3R8Lk7J2l3j39j37M4J08J20N8n3l2Ol08J79P4mJk1
$$ -104 -154 -128 -81 84 1 -33 74 12 92 -47 -42 -40 43 141 144 117 129 96 -43 -180 -136 -28 92 150 97 65 71 -237 -58 16 12 13 -8
-1434hQ0q3n4rj08J08J33P8l1q8K8Lj45r8M9K14O9p1n2P5P4r7k05N0J40q9L2R5q7n2Q8r4R8
$$ -8 72 -11 -65 -74 -182 -74 59 137 106 18 46 49 -96 -194 -145 69 138 67 15 90 164 67 -138 -88 52 -37 -5 90 3 -49 39 -55 43
-1442D3M2J1rl8o9Q9j7%L8j5p0L7q4n0n1R0P3j35M0Q4P7R6n8j38m9M1Mj20OJ15M6k1k1m9m
$$ 43 85 96 87 49 -20 69 52 52 90 75 5 42 -42 -92 -143 -53 20 -115 -75 9 86 182 124 -14 -63 -22 -18 -138 -132 -17 29 8 -13 -62 -66
-1451f6O0M3K8o2j59O0J76O3n2r6n5kl4K1nN6O5Mm6J3o5j28Q6l8l1M6Q6l6Q7R4j19mK3j4k7
$$ -66 -6 37 65 3 -156 -96 80 143 91 -5 -60 -62 -96 -75 -80 -24 41 45 -1 12 -53 -181 -95 -133 -164 -118 -32 -68 19 113 -6 -10 13 -1 -28
-1460b8rk3qJ84Mj26o7N6J5O5j8P6n0q9p8O0p5KP5R1M4ql2j27k0J7J02P2L5o6L3M9Kq8j77
$$ -28 -37 -60 -68 116 120 -6 -73 -17 -2 63 45 121 71 -18 -96 -36 -111 -109 -34 57 101 93 61 -66 -86 -69 33 105 140 74 107 156 158 70 -107
-1468a07J26m4NL3J2q4N5O8J1j42Pj54j0J50P7n2r0Q4Q5o4L4J7O4j31n0j11N2Q3J0J0l9j4
$$ -107 19 -25 -20 13 25 -59 -4 64 75 -67 -60 -214 -224 -74 3 -49 -139 -55 30 -34 0 17 81 -50 -100 -211 -159 -76 -66 -56 -95 -109
-1476a09J37L2r3j50q7J55J22O0n9j05j8M6Kp2N0J76n7l0l6o1m4L2KJ18n8p8J17K9k7p9J62
$$ -109 28 60 -33 -183 -270 -115 7 67 8 -97 -115 -69 -67 -139 -89 87 30 0 -36 -97 -141 -109 -107 11 -47 -125 -8 21 -6 -85 77
-1483G7k2j07MJ15n6J1j04l6O8K1Q1L8l6K7Nj47l7K6R5m4m1N1j4k2o4J4L6J22N3j19n8R4O9
$$ 77 55 -52 -48 67 11 22 -82 -118 -50 -29 52 90 54 81 86 -61 -98 -72 23 -21 -62 -11 -25 -47 -111 -97 -61 61 114 -5 -63 31 100
-1492A00n0n3M0O1j11O3K4L0o3n0L9n3kN3on0J5j5J8J3o6Q7L1r2k3om9J47O9O0K6n9k20J9
$$ 100 50 -3 37 98 -13 50 74 104 41 -9 30 -23 -25 28 22 -28 -13 -28 -10 3 -63 24 55 -37 -60 -66 -115 32 101 161 187 128 -92 -73
-1500g3MO0j09K8O3j8l0J99r1p4K4j6mO5L2k6RP4j7p5O0J5o8o5O8q4Q6j0n7K3k7K8R1m4J0
$$ -73 -69 -9 -118 -90 -27 -45 -75 124 33 -41 -17 -33 -37 28 60 34 43 117 100 25 85 100 32 -33 35 -49 37 27 -30 -7 -34 -6 85 41 51
-1508E1K7p0m9k5N7J0L4m7q2o6J29L5Lq3p4j9N9L3L2J31N8o0l3o9n2L7j9l0L2j0O8qJ17rJ8
$$ 51 78 8 -41 -66 -9 1 35 -12 -94 -160 -31 4 7 -76 -150 -169 -110 -77 -45 86 144 84 51 -18 -70 -33 -52 -82 -50 -60 8 0 117 108 126
-1517A26O7n7j04L1l5R6Pj06q0K7l7Q0o1o2J07j18R7rj29J1J35j4k3K0M2q4R2o2r1N0j22O8
$$ 126 193 136 32 63 28 124 131 25 -55 -28 -65 15 -46 -108 -1 -119 -22 -31 -160 -149 -14 -28 -51 -31 11 -73 19 -43 -134 -84 -206 -138
-1525a38J79lj40l0j4J13j0J03j03J45m5j13N6n3L8OJ3ml0N3j8n2O5j1M6j32m2J31o9P2RL9
$$ -138 41 38 -102 -132 -146 -33 -43 60 -43 102 57 -56 0 -53 -15 -9 4 0 -30 23 5 -47 18 7 53 -79 -121 10 -59 13 22 61
-1533F1l3J0o7r3J02MP6%P7L7r3J0jO8r2j56O3r0K3K11M0m2L2J7q2k5r3o4O2J0m5O0K3q7J9
$$ 61 28 38 -29 -122 -20 -16 60 60 137 174 81 91 90 158 66 -90 -27 -117 -94 117 157 115 147 164 82 57 -36 -100 -38 -28 -73 -13 10 -77 -58
-1541e8k5m6n2J84%nj2o8R3J17n8n3N4j9m7Oj1K0k4p4pm6K4P8ok3NmJ0R0l7p4O8Op4O2M1j05
$$ -58 -83 -129 -181 3 3 -2 -14 -82 11 128 70 17 71 52 5 11 0 20 -4 -78 -85 -131 -107 -29 -35 -58 -53 -57 -47 43 6 -68 0 6 -68 -6 35 -70
-1550g0M4l6P9o2qL2L0k8k6M2j6k2n5R2J9O5j24Q1L6r8pQ6M9j14J1p0k3ml1J24J07j34n1k7
$$ -70 -26 -62 17 -45 -53 -21 9 -19 -45 -3 -19 -41 -96 -4 15 80 -44 37 73 -25 -32 54 103 -11 0 -70 -93 -97 -128 -4 103 -31 -82 -109
-1559a09j3J5l1N5L9M3J6p5m1Okj4KJ03j3L4O0m9J6k0j12L8m0J8k9k2m6M4M8J07n3N6Ll9j9
$$ -109 -122 -107 -138 -83 -44 -1 15 -60 -101 -95 -97 -111 -109 -6 -19 15 75 26 42 22 -90 -52 -92 -74 -103 -125 -171 -127 -79 28 -25 31 34 -5 -24
-1567b4R4o7p8j36P1J3R1N1oK2k9m8J9L1ON2Q1o1%j8k5N6jK6Qj78m5J2J19L5l6L2j32K5M1
$$ -24 70 3 -75 -211 -140 -127 -36 15 9 31 2 -46 -27 4 10 62 143 82 82 64 39 95 94 120 128 -50 -95 -83 36 71 35 67 -65 -40 1
-1576AKJ5M4k8m7m9p6J04r5q0O0KR2Q7o2rk4r8L5K4J7M6K0K4N5L1K4j7j6m6j5K5n0r0J5j8
$$ 1 3 18 62 34 -13 -62 -138 -34 -129 -209 -149 -147 -55 32 -30 -39 -63 -161 -126 -102 -85 -39 -19 5 60 91 115 98 82 36 21 46 -4 -94 -79 -97
-1585i7o9R3Q2L3Pj42M5O1l9J6P7j0Pq0q2J2oQN0M9pL6l2k7Lq5K3Q5m9L6op1L6M1L1o0o6J5
$$ -97 -166 -73 9 42 49 -93 -48 13 -26 -10 67 57 64 -16 -98 -86 -92 -84 -34 15 8 44 12 -15 -12 -97 -74 11 -38 -2 -8 -79 -43 -2 29 -31 -97 -82
-1594h2J00%j54J09l1j9qN7lr5L8ok6J34L8Pj4k4P4j09J5L5L2K4n9OL7kM3j20m8J9j4L4Pk4
$$ -82 18 18 -136 -27 -58 -77 -85 -28 -31 -126 -88 -94 -120 14 52 59 45 21 95 -14 1 36 68 92 33 39 76 74 117 -3 -51 -32 -46 -12 -5 -29
-1603b9K5n8N8n4K8J7Q6km7k6l3k3P8O5J4Jq3J8k3L5N3j00j3J3j2P2r4q5J46L0j01K2M9j20
$$ -29 -4 -62 -4 -58 -30 -13 73 71 24 -2 -35 -58 20 85 99 100 17 35 12 47 100 0 -13 0 -12 60 -34 -119 27 57 -44 -22 27 -93
-1611i3RQ8M0o5M9M9j07QL1l0k5m7l4r9M8M1JM1k9
$$ -93 -84 4 44 -21 28 77 -30 -22 9 -21 -46 -93 -127 -226 -178 -137 -136 -95 -124
-1616a24
##$OBSERVED INTEGRALS=	(X Y Z)
(6.8725685875070379183, 6.9411988534154769326, 1)
(6.7691398769126358559, 6.8136045562335958437, 1.0181764938613337979)
(6.7372413026171651396, 6.7647900713268924733, 0.56907331603260691288)
(6.6918099998327047473, 6.7372413026171651396, 0.45635164061080174536)
(3.7729894545074285084, 3.8156720461261328659, 3.0412787651245962728)
(2.8379982826371570326, 2.9082992557664573141, 2.0599964191317314821)
(2.7143301474243024529, 2.7966900466013271398, 2.0658355808329984526)
(2.51548615408412779, 2.5914317308953425112, 2.0824851258439247559)
(2.0638780338048423602, 2.2005060836023901949, 2.9978107178832611446)
(1.6533554355813750991, 1.8302057617211895391, 2.1553426636206154399)
(1.1307638391667389488, 1.5030232641581211528, 21.42296254882055706)
(0.82007196420131744929, 0.92037406556810696934, 3.0411294479796833201)
(6.7035933178142022015, 6.7590796494598066602, 1.0066704873701730616)
(1.549266452905995628, 1.5651086736722137349, 0.21232931602803495341)
##END=	
##TITLE=	Feb27-2020.230.1.1r
##JCAMP-DX=	6.0	$$ MestReNova 14.1.0-24037
##BLOCK_ID=	4
##DATA TYPE=	NMR PEAK TABLE
##DATA CLASS=	PEAK TABLE
##CROSS REFERENCE=	NMR SPECTRUM: BLOCK_ID=3                                     
##.OBSERVE FREQUENCY=	400.05240029848198446
##.OBSERVE NUCLEUS=	^1H
##NPOINTS=	134
##FIRSTX=	0.068729746146403522533
##LASTX=	7.5189601648427020208
##XFACTOR=	1
##YFACTOR=	1
##FIRSTY=	49635.620552214604686
##XUNITS=	PPM
##YUNITS=	ARBITRARY UNITS
##PEAK TABLE=	(XYW..XYW)
0.068729746146403522533,49635.620552214604686,0.0022817475674501200809
0.70523913448733976939,7960.741880815490731,0.0027794506667264151124
0.72288769479642078775,19302.425167515011708,0.002619736813452214555
0.73963109016524464234,5778.9747598282010586,0.0051936683682665798004
0.86281694612617976237,1105530.3717507617548,0.0043637737337592769071
0.87392985194951666728,167845.32830098154955,0.014645637827255897009
0.88028055166953433908,3319016.0725859757513,0.0027699929751792071175
0.89669750856884899992,1050986.9414373894688,0.0053070336785806804247
0.9178832943551369361,26309.860547961474367,0.003381865506783874372
0.92829819093067256208,6742.5282600014552372,0.022486692047453547133
0.9343472705239215248,23746.913556873289053,0.0027794506667264151124
1.0170414966052965244,2867.0787502201637835,0.0030293172017188283937
1.0340763329250655111,16291.622323718300322,0.0035751303081276225235
1.1061494218662104583,12370.675940367678777,0.039813365067970479805
1.1557560718085035933,2746.788924184883399,0.0035974442703993691171
1.2131548654540449395,60033.47299647773616,0.0023738430762013087647
1.2280247395466326044,41639.17077064498153,0.0022406279143789265516
1.2306448904490383534,73128.778449713485315,0.0026656854890984415379
1.2610970915855026497,10034875.386143440381,0.0083101476133337001673
1.2709683443456458729,1434627.7448393774685,0.012327871944250445857
1.2828103406705810841,144315.53527325455798,0.0055622588300656798654
1.2856850306769573855,928938.56934286723845,0.038681065541215330084
1.3015354087941850558,278517.33549146162113,0.0099763269276580985451
1.3068805759722981197,481001.88935349881649,0.018821278752399136364
1.3176693140169635221,151893.35566440739785,0.0061391524209686298974
1.3234272749909883338,44460.688896107138135,0.011860214753339398674
1.3302594207816631489,92190.279107088266755,0.015510829480589669038
1.3317376602023132115,106118.77456675648864,0.041089537131933376313
1.3467732469001203466,225852.25630464803544,0.037792870168548112209
1.3778548075821024366,87331.535402409965172,0.0071592846915725519633
1.3905498855167319761,114155.08528582731378,0.0068462455391551206574
1.3954821840675013522,194557.33774358269875,0.0089328675693780903999
1.4005484619767460952,93846.380917716014665,0.011635583103054250587
1.4065949590120523371,168736.86952720014961,0.012886523698962360635
1.4142486528747637564,244269.10432370656054,0.0095190695443457401526
1.4180063191092042718,198929.89863369244267,0.010022998568201572575
1.42765155948241107,116282.25882655233727,0.011719729198200024012
1.4340416393384365357,195359.52992153097875,0.01058424638686586601
1.4508020467344850957,51290.068971991029684,0.0067904917614984815211
1.5569706349202414586,475183.04817527497653,0.0039850337727725792386
1.7113063243679482728,257439.64970686036395,0.0038912309334169807237
1.7301266271151687359,644278.46907333459239,0.0070493523774504867133
1.7492363837061477572,838160.20544823887758,0.0078308203403335292087
1.767574541400313004,577603.94981593557168,0.0069296606521737896117
1.7859592478329182619,188356.64032420501462,0.0045333539929135469038
1.8886063821818068753,2543.7133489995867421,0.0070286956878855008993
1.9063332679528328661,4551.0213079544828361,0.0052360474049285175499
1.9870514967594876676,47672.766363676288165,0.00295662341297868057
2.0439169903824052632,71674.035608966587461,0.0022159062006478370127
2.0973537978487435396,4256.8681725975866357,0.002733708937255724912
2.1110149435134513141,37641.901584590443235,0.0039058961078758946961
2.1341343531865448746,20822.20932001057372,0.0022764210792662908402
2.1477907730158674049,8597150.3033277839422,0.0026201250759994502808
2.1596501611123772868,17701.849440225978469,0.0036946134743368807749
2.2676162488050199961,2638.2392248093992748,0.0026751836116302193762
2.3049264866355660963,47022.656301606009947,0.0030422341762330273006
2.3748346641028645898,4197.5683278212627556,0.0057553922910207194752
2.3935618389030475228,8625.3693634119263152,0.0045741566038138550473
2.4120497161911953476,4920.6097296743728293,0.0028551094540550034373
2.4876528668578790082,4796.7804052861083619,0.0025136610214315778002
2.5368951426335222266,1249989.2775405165739,0.0032886274978386051057
2.5556037594154439319,2102172.9915315117687,0.0040563123959731573268
2.5743110360791372493,1101055.061750310706,0.0038085172909377690807
2.5991861919488750132,10847.43296695816025,0.0059398674331146619071
2.6183514635863649467,6098.4760493676176338,0.0043984517854553555408
2.6478061107202575108,2718.1527490942526128,0.0022276673583777333205
2.6954763623625863644,5378.8663267337669822,0.0064200799475100751509
2.7130081569580837275,12000.076782012052718,0.0063363186259723794716
2.7369947145000801392,433825.89398248458747,0.0034929824179362857842
2.7404365620446453633,392633.57211353286402,0.0036917767560991523838
2.757270327360278106,1354154.2704703402705,0.0060538811421447184108
2.7608071257982675917,228456.77235066168942,0.0025127153152716946022
2.7684777227729786553,80956.707787257764721,0.0035159408536098966935
2.7761732145794164595,1257968.1941108538304,0.0050029788538195089573
2.7890091697214143274,10826.094737808056379,0.0095212213426699009861
2.7970195618385509384,29716.100422014256765,0.0043810828344750651214
2.8092032421208963378,7037.1130416381474788,0.0034224232664514780272
2.8354391048596694347,29602.278101177100325,0.003678679166736576172
2.8564141526355295575,1142150.5004145172425,0.0051193664407020575066
2.8638899413044520692,74726.033607935634791,0.0031080539907408417412
2.8752251886459361252,1291248.2509191273712,0.0066982067966154844665
2.8919716822935703782,362536.18326072173659,0.0039680626169243914114
2.895345494028857658,355341.59751006029546,0.004924679748173054275
2.9567857198913500838,3420.2770411572510056,0.0039428218880851921904
3.0145692646035677775,6379.1174930235429201,0.0038912309334169807237
3.0335186942208722805,8601.8431154365225666,0.0054157471591313871562
3.0518568519150375273,4207.8308231473638443,0.0047227760494627946813
3.6165598408171542033,50774.618517427552433,0.0025955977207946681444
3.7493671290024637166,3721.6590492879645353,0.0029284382072722824585
3.7994772247684496236,5681515.5123935956508,0.0036514872618858443092
3.8115367165161795349,20029.409367215557722,0.0034533132189955135193
3.8169653752244241396,15507.904425161552354,0.049513511008283168924
3.8716447099171658053,42882.707914705148141,0.0022740158561657367216
3.9774268281744977749,52057.906435981232789,0.002619736813452214555
4.0940398289799109222,4456.1075307279652407,0.0020871155498090160872
4.1117802729315826582,16708.768213943247247,0.0021997176076547419674
4.12958087646851979,14958.834311785825776,0.0023598026506915724919
4.1476960234533706284,5875.1090240469511627,0.0025283971961174030695
5.4677734541715459216,12329.674688373126628,0.0024917882337591027754
6.5226588314974280891,2880.0903262850165447,0.0055687905166220998121
6.5437103613845737371,3788.0049576261699258,0.0043662280224203578807
6.5879147235280912653,4724.4787383769617009,0.0075472786157171848492
6.6557522273259248635,3139.4106199769139494,0.0083744776783248164181
6.677770093722576128,3736.9020340498036603,0.0045787878297693113822
6.694314406025952735,7375.5166932960937629,0.0092258881542868400455
6.7145462656730074968,9137.7151498416806135,0.0023863773017347043523
6.7249898380563868372,450080.70409898215439,0.0042533853187484054262
6.7297654285188892587,584543.55471331614535,0.0033551290364646161463
6.745060562131089732,588309.73370183294173,0.0037062133146126730217
6.7498179684910564191,700861.06819338502828,0.00333204014471948258
6.761034191252677239,7677.4223266085027717,0.0074220676169044633511
6.7830471967957590707,1296028.4113831084687,0.0039620912877195053892
6.7878824914253383938,978271.90720034367405,0.0037691800698174760323
6.7977062304396485004,13549.315257223754088,0.0033281002094691760143
6.8130902059047588892,7821.4069413557344888,0.0029392221602570385575
6.81946078510567677,7379.0899484667033903,0.0046142312386706916053
6.8244847919817397397,7195.6889076151910558,0.0046222509926659421237
6.8332172785497720113,6498.2790654735135831,0.0035481676716082139952
6.8514445694359666916,5337.5872844379664457,0.0048901753851108009652
6.8911297903074864024,6175.4946368131386407,0.003617428272779479783
6.9011788096517916458,1852408.7240999948699,0.002589148117600232387
$$ [...]
-1616a19
##$OBSERVED INTEGRALS=	(X Y Z)
(7.184927067555523017, 7.3508160478384585446, 1)
(6.8497636175961265081, 6.9987251509114161152, 1.5703287121461169118)
(6.6967164545133330833, 6.8065553545010857306, 3.1070984798214520417)
##END=	
##END=	
##END=	
