##TITLE=	Feb27-2020.660.1.1r
KC2
##JCAMP-DX=	6.0	$$ MestReNova 14.1.0-24037
##DATA TYPE=	LINK
##BLOCK_ID=	1
##BLOCKS=	2    
##ORIGIN=	Mestrelab Research S.L.
##OWNER=	kct19
##$MNOVA/LINK_BLOCK_TYPE=	ITEM	$$ NMR Spectrum
##$MNOVA/ITEM/POLYGON=	(XY..XY)
5321,5835
8722,5835
8722,8208
5321,8208
5321,5835
##$MNOVA/ITEM/Z=	0
##$MNOVA/ITEM/ANGLE=	0
##TITLE=	Feb27-2020.660.1.1r
##JCAMP-DX=	6.0	$$ MestReNova 14.1.0-24037
##BLOCK_ID=	2
##DATA TYPE=	NMR SPECTRUM
##DATA CLASS=	XYDATA
##NUMDIM=	1
##ORIGIN=	Bruker BioSpin GmbH
##OWNER=	nmrsu
##.OBSERVE FREQUENCY=	400.05240029848198446
##.OBSERVE NUCLEUS=	^1H
##.SOLVENT NAME=	CDCl3
##.PULSE SEQUENCE=	zg30
##LONGDATE=	2020/02/27 18:10:00.000
##.ACQUISITIONMODE=	SIMULTANEOUS
##$ORIGINAL FORMAT=	Bruker XWIN-NMR
##$MNOVA/SCALES_VERSION=	8
##$PARAMETER FILE=	(acqus, ASCII, //ch-nmrserv3.ch.ic.ac.uk/Av400D/ug1/nmr/Feb27-2020/660/acqus, 0)
$$ ##TITLE= Parameter file, TOPSPIN		Version 3.2
$$ ##JCAMPDX= 5.0
$$ ##DATATYPE= Parameter Values
$$ ##NPOINTS= 1	$$ modification sequence number
$$ ##ORIGIN= Bruker BioSpin GmbH
$$ ##OWNER= nmrsu
$$ $$ 2020-02-27 19:02:32.201 +0000  nmrsu@nmrpc
$$ $$ /opt/topspin/data/ug1/nmr/Feb27-2020/660/acqus
$$ $$ process /opt/topspin3.2/prog/mod/dirdata
$$ ##$ACQT0= -2.04831932773109
$$ ##$AMP= (0..31)
$$ 100 100 100 100 100 100 100 100 100 100 100 100 100 100 100 100 100 100
$$ 100 100 100 100 100 100 100 100 100 100 100 100 100 100
$$ ##$AMPCOIL= (0..19)
$$ -1 0 0 0 0 0 0 0 0 0 0 0 0 0 0 0 0 0 0 0
$$ ##$ANAVPT= -1
$$ ##$AQSEQ= 0
$$ ##$AQ_mod= 3
$$ ##$AUNM= <au_zg>
$$ ##$AUTOPOS= <6 >
$$ ##$BF1= 400.05
$$ ##$BF2= 400.05
$$ ##$BF3= 400.05
$$ ##$BF4= 400.05
$$ ##$BF5= 400.05
$$ ##$BF6= 400.05
$$ ##$BF7= 400.05
$$ ##$BF8= 400.05
$$ ##$BYTORDA= 0
$$ ##$CAGPARS= (0..11)
$$ 0 0 0 0 0 0 0 0 0 0 0 0
$$ ##$CFDGTYP= 0
$$ ##$CFRGTYP= 9
$$ ##$CHEMSTR= <none>
$$ ##$CNST= (0..63)
$$ 1 1 1 1 1 1 1 1 1 1 1 1 1 1 1 1 1 1 1 1 1 1 1 1 1 1 1 1 1 1 1 1 1 1 1 1
$$ 1 1 1 1 1 1 1 1 1 1 1 1 1 1 1 1 1 1 1 1 1 1 1 1 1 1 1 1
$$ ##$CPDPRG= (0..8)
$$ <> <> <> <> <> <> <> <> <>
$$ ##$D= (0..63)
$$ 0 1 0 0 0 0 0 0 0 0 0 0 0 0 0 0 0.0002 0 0 0 0 0 0 0 0 0 0 0 0 0 0 0 0
$$ 0 0 0 0 0 0 0 0 0 0 0 0 0 0 0 0 0 0 0 0 0 0 0 0 0 0 0 0 0 0 0
$$ ##$DATE= 1582827015
$$ ##$DE= 6.5
$$ ##$DECBNUC= <off>
$$ ##$DECIM= 2496
$$ ##$DECNUC= <off>
$$ ##$DECSTAT= 4
$$ ##$DIGMOD= 1
$$ ##$DIGTYP= 12
$$ ##$DQDMODE= 0
$$ ##$DR= 22
$$ ##$DS= 4
$$ ##$DSPFIRM= 0
$$ ##$DSPFVS= 20
$$ ##$DTYPA= 0
$$ ##$EXP= <proton>
$$ ##$F1LIST= <>
$$ ##$F2LIST= <>
$$ ##$F3LIST= <>
$$ ##$FCUCHAN= (0..9)
$$ 0 2 0 0 0 0 0 0 0 0
$$ ##$FL1= 90
$$ ##$FL2= 90
$$ ##$FL3= 90
$$ ##$FL4= 90
$$ ##$FOV= 20
$$ ##$FQ1LIST= <>
$$ ##$FQ2LIST= <>
$$ ##$FQ3LIST= <>
$$ ##$FQ4LIST= <>
$$ ##$FQ5LIST= <>
$$ ##$FQ6LIST= <>
$$ ##$FQ7LIST= <>
$$ ##$FQ8LIST= <>
$$ ##$FRQLO3= 15959.0749999881
$$ ##$FRQLO3N= 2
$$ ##$FS= (0..7)
$$ 83 83 83 83 83 83 83 83
$$ ##$FTLPGN= 0
$$ ##$FW= 125000
$$ ##$FnMODE= 0
$$ ##$FnTYPE= 0
$$ ##$GPNAM= (0..31)
$$ [...]
$$ 130000 130000 130000 130000 130000 130000 130000 130000 130000 130000 130000
$$ 130000 130000 130000 130000 130000 130000 130000 130000 130000 130000 130000
$$ 130000 130000 130000 130000 130000 130000 130000 0 0 0 0 0 0 0 0 0 0 0
$$ 0 0 0 0 0 0 0 0 0 0 0 0 0
$$ ##$ShimPowMaxUC= (0..63)
$$ 130000 130000 130000 130000 130000 130000 130000 130000 130000 130000 130000
$$ 130000 130000 130000 130000 130000 130000 130000 130000 130000 130000 130000
$$ 130000 130000 130000 130000 130000 130000 130000 130000 130000 130000 130000
$$ 130000 130000 130000 130000 130000 130000 130000 0 0 0 0 0 0 0 0 0 0 0
$$ 0 0 0 0 0 0 0 0 0 0 0 0 0
$$ ##$ShimPowMaxUG= (0..63)
$$ 524287 524287 524287 524287 524287 524287 524287 524287 524287 524287 524287
$$ 524287 524287 524287 524287 524287 524287 524287 524287 524287 524287 524287
$$ 524287 524287 524287 524287 524287 524287 524287 524287 524287 524287 524287
$$ 524287 524287 524287 524287 524287 524287 0 0 0 0 0 0 0 0 0 0 0 0 0 0 0
$$ 0 0 0 0 0 0 0 0 0 0
$$ ##$ShimPowRcbType= 3
$$ ##$ShimPowRes= (0..63)
$$ 1e-20 1e-20 1e-20 1e-20 1e-20 1e-20 1e-20 1e-20 1e-20 1e-20 1e-20 1e-20
$$ 1e-20 1e-20 1e-20 1e-20 1e-20 1e-20 1e-20 1e-20 1e-20 1e-20 1e-20 1e-20
$$ 1e-20 1e-20 1e-20 1e-20 1e-20 1e-20 1e-20 1e-20 1e-20 1e-20 1e-20 1e-20
$$ 1e-20 1e-20 1e-20 1e-20 0 0 0 0 0 0 0 0 0 0 0 0 0 0 0 0 0 0 0 0 0 0 0 0
$$ ##$ShimPowRng0= (0..63)
$$ 1 1 1 1 1 1 1 1 1 1 1 1 1 1 1 1 1 1 1 1 1 1 1 1 1 1 1 1 1 1 1 1 1 1 1 1
$$ 1 1 1 1 0 0 0 0 0 0 0 0 0 0 0 0 0 0 0 0 0 0 0 0 0 0 0 0
$$ ##$ShimPowRng1= (0..63)
$$ 1 1 1 1 1 1 1 1 1 1 1 1 1 1 1 1 1 1 1 1 1 1 1 1 1 1 1 1 1 1 1 1 1 1 1 1
$$ 1 1 1 1 0 0 0 0 0 0 0 0 0 0 0 0 0 0 0 0 0 0 0 0 0 0 0 0
$$ ##$ShimPowRng2= (0..63)
$$ 1 1 1 1 1 1 1 1 1 1 1 1 1 1 1 1 1 1 1 1 1 1 1 1 1 1 1 1 1 1 1 1 1 1 1 1
$$ 1 1 1 1 0 0 0 0 0 0 0 0 0 0 0 0 0 0 0 0 0 0 0 0 0 0 0 0
$$ ##$ShimPowRng3= (0..63)
$$ 1 1 1 1 1 1 1 1 1 1 1 1 1 1 1 1 1 1 1 1 1 1 1 1 1 1 1 1 1 1 1 1 1 1 1 1
$$ 1 1 1 1 0 0 0 0 0 0 0 0 0 0 0 0 0 0 0 0 0 0 0 0 0 0 0 0
$$ ##$ShimSysFunc= (0..63)
$$ 1 2 3 4 5 6 7 8 9 10 0 37 38 35 16 15 14 13 12 11 28 27 26 25 24 23 36
$$ 22 30 29 20 21 34 33 32 31 17 18 19 0 0 0 0 0 0 0 0 0 0 0 0 0 0 0 0 0 0
$$ 0 0 0 0 0 0 0
$$ ##$ShimSysMatrix= 0
$$ ##$ShimSysType= 4
$$ ##$TFXNUM= 0
$$ ##$TRIPLO2= 0
$$ ##$VTU= 2
$$ ##$VTUETH= <149.236.99.20>
$$ ##$VTUTY= <no>
$$ ##$WBREFAM= (0..15)
$$ 136.7 118.7 100 100 100 100 100 100 100 100 100 100 100 100 100 100
$$ ##$WBREFLM= (0..15)
$$ 0 0 0 0 0 0 0 0 0 0 0 0 0 0 0 0
$$ ##$WBREFPH= (0..15)
$$ 77.55 -71.28 0 0 0 0 0 0 0 0 0 0 0 0 0 0
$$ ##$WBSGU= (0..15)
$$ 0 0 0 0 0 0 0 0 0 0 0 0 0 0 0 0
$$ ##$XFAC= 2
$$ ##END=
$$ 
##$DECIM=	2496
##$DSPFVS=	20
##XUNITS=	HZ
##YUNITS=	ARBITRARY UNITS
##FIRSTX=	6406.710256386850233
##LASTX=	-1606.1102564336499654
##DELTAX=	-0.24453933874997710318
##XFACTOR=	1
##YFACTOR=	3.7303620859065085291
##FIRSTY=	-187.84375
##MINY=	-1574.625
##MAXY=	13589447
##NPOINTS=	32768
##XYDATA=	(X++(Y..Y))
$$ [...]
3401b28J06M6J1l8m5K7L8J14K1K6k7J6r9m0m6o6M2nkP3o0n8J28L2J0l1k7l8N8k9q3N1Q1l3
3393g5l6O8j28k5O4R0P5j46p1o4K8j4k8o5R8O6L9o5P1m8K6Q9nn0K2j8N1Mj33Nn0q0LP0N8J06
3384f8M5k1m2Q6k6j12R3o7m7o8l7m5J45J1j33N2J06l4mm9K0j4N5R8Jl1o0o9n4lJ3K4Q0j2J1
3375a56N7Jj2J49m7r8M8M1j50j8J45N1q4qL3j4k1j7rn3q2M4n0K2N1Q7%j5K9J9JP0n9l8o6o7
3367b16J3o5N6M0O1n4J5q1QK01N9Lj27j50k1j1O6R8N8L3r1j0o0m4j4Q6%m1N6P5k4%O3n4k13
3358b85J18J38n2M5j5M2o3o2r2K4Q7N4mr7l8K6l5P2JJ0lKJ25N0J7o7l8rJ2R2q2n7K7k0j39
3349b16O7K4L2nJ6m5N5m8k9j15L6P2J4o8J04J39ok6OqOj11j16k5Q9K8o5K1M0J5n4p5L3%k8
3341b43J93O3j58n1L4o3J5Q0rp6j0n4O9K2j6J02J5J10o0jJ13n0j28k0j32J5J54L7J5J0n8Q2
$$ plain form
3401 -228 -122 -76 -65 -103 -148 -121 -83 31 52 78 51 67 -32 -72 -118 -184 -142 -147 -149 -76 -136 -194 -66 -34 -24 -55 -82 -120 -62 -91 -174 -123 -42 -75
3393 -75 -111 -43 -171 -196 -132 -42 33 -113 -184 -248 -220 -234 -262 -327 -229 -163 -124 -189 -118 -166 -140 -51 -56 -106 -84 -102 -51 -47 -180 -175 -225 -305 -302 -232 -174 -68
3384 -68 -23 -44 -86 0 -26 -138 -45 -112 -159 -227 -264 -309 -164 -153 -286 -234 -128 -162 -166 -215 -195 -209 -154 -56 -55 -86 -146 -215 -269 -272 -259 -235 -155 -167 -156
3375 -156 -99 -98 -110 39 -8 -106 -58 -17 -167 -185 -40 11 -73 -81 -48 -62 -83 -100 -109 -162 -244 -200 -250 -228 -177 -90 -90 -105 -76 -57 -56 14 -45 -83 -149 -216
3367 -216 -203 -268 -212 -172 -111 -165 -150 -231 -223 -22 37 40 -87 -237 -258 -269 -203 -105 -47 -14 -105 -115 -175 -219 -233 -147 -147 -188 -132 -57 -81 -81 -18 -72 -285
3358 -285 -167 -29 -81 -36 -51 -9 -72 -134 -226 -202 -115 -61 -65 -162 -200 -174 -209 -137 -136 -126 -129 -127 -2 48 65 -2 -40 -49 -37 55 -27 -84 -57 -77 -216
3349 -216 -149 -125 -93 -98 -82 -127 -72 -120 -149 -264 -228 -156 -142 -210 -106 33 27 1 7 -1 5 -106 -222 -247 -158 -130 -195 -174 -134 -119 -173 -248 -215 -215 -243
3341 -243 -50 13 -145 -196 -162 -225 -210 -130 -139 -215 -225 -279 -210 -188 -204 -102 -87 23 -37 -38 75 25 -103 -123 -255 -240 -86 -49 -34 -24 -82 0
3333@m6M3l9o9o6N3q4Ko2r8J13J22P4J02r2j8q2p6M1L4j5j7J82O1o4J04p3p4j71R9P4mj32
3325a78k44Q6J42nm8O5L5M1J5p1j8j3mJ43Q4n3L5n5o0o6O3j10J00J22p4J1M4o6Ln8j4R9L0
3317a9j54O7P5p5j29k5J29q9m0K22M4K2K1n8J8jl3o7O4n0m2P4l9j9j01L4kJ29l3j22J0JJ2
3309a76J25m6Q1j67N0j3o7Q3J4Q5R8J3q3j54m8J17O7r0J3L4q9K9j4p8R6k0N7k3p5n6J3J23
3301a01j6r9K4L0LJ97o1n9ko0o3l8J26Oq1JJ8J45l0o4m5j0j9J14mk9RL7K8K4l7l3j15LJ24
3293g7L2j7J32n0o9r5L9oL7R4J13j58r9j04m6p1Q6J23q0j2j1M7Q6n1rn4R8r7O3j1L0m8p1K2
3284b34J26MO1n0k0M3M4n3j5K0m8n1l7p8M4O1L9n5Kj2P1l4No2N7K8j8O2J4Rj66K5R8m8Q2j5
3275a01l2P6j9o1J24m4n9Qn3o4J0J0J2KrM3j4r1J02n6K3KR7J13kj09m6J0O7k6k2o8J6n9M6
$$ plain form
3333 0 -46 -3 -42 -111 -177 -124 -208 -206 -268 -366 -253 -131 -57 45 -47 -65 -147 -223 -182 -148 -163 -180 2 63 -1 103 30 -44 -215 -116 -42 -46 -178
3325 -178 -422 -336 -194 -199 -247 -182 -147 -106 -91 -162 -180 -193 -197 -54 30 -23 12 -43 -103 -169 -106 -216 -116 6 -68 -57 -13 -79 -76 -134 -148 -49 -19
3317 -19 -173 -106 -31 -106 -235 -260 -131 -220 -260 -38 6 28 49 -9 9 8 -25 -92 -28 -78 -120 -46 -85 -104 -205 -171 -173 -44 -77 -199 -189 -188 -176
3309 -176 -51 -97 -16 -183 -133 -146 -213 -130 -116 -31 67 80 -3 -157 -205 -88 -21 -111 -98 -64 -153 -124 -138 -216 -120 -140 -83 -106 -181 -237 -224 -101
3301 -101 -117 -216 -192 -162 -159 38 -23 -82 -84 -144 -207 -245 -119 -113 -194 -193 -175 -30 -60 -124 -169 -179 -198 -84 -88 -117 -108 -71 -43 -19 -56 -89 -204 -201 -77
3293 -77 -45 -62 70 20 -49 -144 -105 -111 -74 20 133 -25 -124 -228 -274 -345 -259 -136 -216 -228 -239 -192 -106 -157 -166 -220 -122 -219 -156 -167 -137 -185 -256 -234
3284 -234 -108 -104 -43 -93 -113 -70 -26 -79 -94 -74 -122 -173 -210 -288 -244 -183 -144 -199 -197 -209 -138 -172 -167 -229 -172 -144 -162 -100 -86 -77 -243 -218 -120 -168 -86 -101
3275 -101 -133 -57 -76 -137 -13 -57 -116 -108 -161 -225 -215 -205 -193 -191 -200 -157 -171 -262 -160 -216 -193 -191 -94 19 17 -92 -138 -128 -61 -87 -109 -177 -161 -220 -174
3267a74l8k0M7N6K9N8p4n4R1r3l8j7k9j5j2k2J54P4o4j5K6N2o3j5q7o4j6K00Q0k4j31o5J39
3259a24Pp3r0k0N6M9k5R3K8j1N7l5J35q6j15L4N4o3L2Oj15kR5Rl2J50p7k9P5o8p4j1K0Q4J3
3250e3qK7p4k8k0P9l4L9n4j3P5k7Q5m7mpk7j9k3n6N3O9j30j2m8j02J14L9M7l3n3J03O8R5j07
3242h6n9K9M0J8J1K8m6o0NM1n5l4L0l9m5N2l8J41r3j16P2M5J9O9j8q0k6l2N5n5mJ83J7kk9
3233f2l3kp7J8n7QOpJ0n0L9N3K0j08J68j8p7j30q0O5R5J7J20j8mK4q6L5O3N5J8P5k2j27j9
3225h8kRj62p1l0Q8J6R1M8l0p6P9M5O3r5J02n5Q9n2j07k4L3J25J3q1o9p3Q3l9L7k9N3p0k2
3216b01L7N6P0M9l3j9k8n2p1J30o8n3jK8M5L5j06Q9N4r2m8R6L9o9j12P2j4O0l7j5p7P1K5o1
3208b01%O1q6J22n3O0k0RJ6k5n8pj8n1kO4Qn5N5n2L3K7nqn7j01J04P5O1mn5L1M6m3l7K6p2
$$ plain form
3267 -174 -212 -232 -185 -129 -100 -42 -116 -170 -79 -172 -210 -227 -256 -271 -283 -305 -151 -77 -141 -156 -130 -78 -141 -156 -243 -307 -323 -123 -43 -67 -198 -263 -124
3259 -124 -117 -190 -280 -300 -244 -195 -220 -127 -99 -110 -53 -88 47 -39 -154 -120 -66 -129 -97 -91 -206 -208 -113 -104 -136 14 -63 -92 -17 -85 -159 -170 -150 -66 -53
3250 -53 -61 -34 -108 -136 -156 -77 -111 -72 -126 -139 -64 -91 -6 -53 -57 -64 -91 -110 -133 -189 -136 -67 -197 -209 -257 -359 -245 -206 -159 -192 -245 -142 -74 21 -86
3242 -86 -145 -116 -76 -58 -47 -19 -65 -125 -120 -79 -134 -168 -138 -177 -222 -170 -208 -67 -160 -276 -204 -159 -140 -71 -89 -169 -195 -227 -172 -227 -231 -48 -31 -33 -62
3233 -62 -95 -97 -174 -156 -213 -205 -199 -206 -196 -246 -207 -154 -134 -242 -74 -92 -169 -299 -379 -314 -219 -202 -82 -100 -104 -80 -166 -131 -68 -13 5 80 58 -69 -88
3225 -88 -90 -81 -243 -314 -344 -256 -240 -149 -101 -131 -207 -128 -83 -20 -115 -13 -68 21 -31 -138 -162 -129 -4 9 -72 -141 -214 -131 -170 -133 -162 -109 -179 -201
3216 -201 -164 -108 -38 11 -22 -41 -69 -121 -192 -62 -130 -183 -184 -156 -111 -76 -182 -93 -39 -131 -179 -83 -44 -113 -225 -153 -167 -107 -144 -159 -236 -165 -140 -201
3208 -201 -201 -140 -226 -104 -157 -97 -117 -108 -92 -117 -175 -182 -200 -251 -253 -189 -181 -236 -181 -233 -200 -173 -178 -186 -243 -344 -240 -165 -104 -108 -163 -132 -86 -129 -166 -140 -212
3199b12R5m9O6o6OP3l2q7n8O4j10J62O2j28j7pJ01J5j11l1M3M7L3m2K3k6J03K7N4k4m7m0j24
3191b37OJ7R4Op2r4N1M2m6R6J03n3N3O4m7Pj8j10n5N1j9j00Q0O5M8J0j59l0J31n3j4O1N6O
3182f0K4j48K2K4j7K9o0j6R9q6k1J01J2m8k1m5N6J4L0K8j6o4P3M5r8k8J65J3J5j25r9L7N6
3174a09n1O9O6r3n1j16K4J1n3J22N6k0M6k2l0k1k10O9J76Rm2R8p3l2J9j0N6P7l5m0j04RJ2
3166a93M2m5L8r3m0R3J29J1l8n7Nj33N8O6Q1K6K0mK2q4K1j34J23Q7K2j4n1p6j8n6l7JO6N8
3158a04P5k0M2j05Mj07R7K1o0Lp9P1M6k9l3K2J62j67l4J57Rr8K3j06L4J2Q2r8j3r4P6Q9N6
3150f6qo1R2j7o6J26q5j75M1N9M0k4j4P5J8k6q3J13k3jl5m0m6k3k4Q4N6R6N0m8k5p7l6J6J4
3141a23M6o5Ro9R5l2M8OJ5M7m9n0J5K6k1l9L4n1K2P0k6r4j18m9M1J09k5m3P7J07l3M6O6j6
$$ plain form
3199 -212 -117 -166 -100 -166 -160 -87 -119 -206 -264 -200 -310 -148 -86 -214 -231 -238 -137 -122 -233 -264 -221 -174 -141 -183 -160 -186 -83 -56 -2 -26 -73 -113 -237
3191 -237 -231 -214 -120 -114 -186 -280 -229 -187 -233 -137 -34 -87 -34 30 -17 -10 -28 -138 -193 -142 -161 -261 -181 -116 -68 -58 -217 -247 -116 -169 -183 -122 -66 -60
3182 -60 -36 -184 -162 -138 -155 -126 -186 -202 -103 -189 -210 -109 -97 -145 -166 -211 -155 -141 -111 -83 -99 -163 -90 -45 -143 -171 -6 7 22 -103 -202 -165 -109
3174 -109 -160 -91 -25 -118 -169 -285 -261 -250 -303 -181 -125 -145 -99 -121 -151 -172 -382 -313 -137 -128 -170 -72 -145 -177 -158 -168 -112 -35 -70 -110 -214 -205 -193
3166 -193 -151 -196 -158 -251 -291 -198 -69 -58 -96 -153 -148 -281 -223 -157 -76 -50 -30 -34 -12 -96 -75 -209 -86 1 23 9 -42 -118 -136 -192 -229 -228 -162 -104
3158 -104 -29 -49 -7 -112 -108 -215 -118 -97 -157 -154 -233 -162 -116 -145 -178 -156 6 -161 -195 -38 -29 -127 -104 -210 -176 -164 -82 -180 -193 -287 -211 -122 -66
3150 -66 -74 -135 -43 -60 -126 0 -85 -260 -219 -160 -120 -144 -158 -83 -65 -91 -174 -61 -84 -85 -120 -160 -206 -229 -253 -169 -113 -17 33 -15 -40 -117 -153 -137 -123
3141 -123 -77 -142 -133 -202 -107 -139 -91 -85 -70 -23 -72 -122 -107 -81 -102 -141 -107 -158 -136 -66 -92 -186 -304 -353 -312 -203 -228 -271 -194 -87 -120 -74 -8 -24
3133b4Q1k8J7K1j9o4j8j32p2J15o4m1k7Q2o2KM0M0M4j5K0j26K4J1l7r0P8k2N0L4j08j7J2M0
3125b55J05O7n3L1N8L6m8o9rq2o0J03J03M9o9J0j11N6N7N0j43j6m0M6o4RO9L0kJ45m0k50m8
3117c35J16J5P7k0p3j00N2MOj9J44R3q2j62N0j3M3N1M9J8K2k6J9o7m0J1K7o7O0p8K5k03R0
3109c13J58J04J19M4p1p8j34M0n3O0J4p2q7R0o8J0qJ09p4L6j00L2O1R1P2pn1no6j7L8Q0j04
3101a50M8j03okPn5M6n9L1J21N0k14J62J7j09j9j2O4Jl9J10o5J73r8j16M5n1KJ22MR2m8p0
3092a21j29K8%L6N9L4p9j0LQ3l4n0J8j22M6J00jO1j00N2o2J9p2M0M3knR8L9%m2j2o6k6J44
3084c0Ml1n5K3r4q4k0l8Q2N6Q0Mn7KP5n4r2m2K1J22M3q9j2j6M7Q4m1r9OJ0m2K2l3L4Mr9oP8
3075b37K5k2O3j07j4M5k3j4P7k0k4m7O0L1rR1n5P8J2j43m3J39Q0L7r5j12O1N7L4j46K4R6j08
$$ plain form
3133 -24 57 29 46 67 48 -16 -34 -166 -238 -123 -187 -228 -255 -173 -235 -233 -193 -153 -109 -124 -104 -230 -206 -195 -232 -322 -244 -266 -216 -182 -290 -307 -295 -255
3125 -255 -150 -83 -136 -105 -47 -11 -59 -128 -137 -219 -279 -176 -73 -24 -93 -83 -194 -138 -81 -31 -174 -190 -230 -184 -248 -239 -170 -140 -142 3 -37 -287 -335
3117 -335 -219 -204 -127 -147 -220 -320 -268 -264 -258 -277 -133 -40 -122 -284 -234 -247 -204 -153 -104 -86 -64 -90 -71 -138 -178 -167 -140 -207 -147 -225 -200 -403 -313
3109 -313 -155 -51 68 112 41 -37 -171 -131 -184 -124 -110 -182 -269 -179 -247 -237 -245 -136 -210 -174 -274 -242 -181 -90 -18 -25 -76 -81 -147 -164 -126 -46 -150
3101 -150 -102 -205 -211 -213 -206 -261 -215 -274 -243 -122 -72 -286 -124 -107 -216 -235 -247 -183 -182 -221 -111 -176 -3 -101 -217 -172 -223 -221 -99 -95 -3 -51 -121
3092 -121 -250 -222 -222 -186 -127 -93 -172 -182 -179 -96 -130 -180 -162 -284 -238 -138 -139 -78 -178 -126 -188 -169 -241 -201 -158 -160 -165 -67 -28 -28 -70 -82 -148 -174 -30
3084 -30 -26 -57 -112 -89 -183 -267 -287 -325 -243 -187 -107 -103 -160 -158 -83 -137 -229 -271 -250 -128 -85 -174 -186 -202 -155 -71 -112 -211 -205 -195 -237 -215 -248 -214 -210 -309 -315 -237
3075 -237 -212 -234 -171 -278 -292 -247 -270 -284 -207 -227 -251 -298 -238 -207 -216 -125 -180 -102 -90 -233 -276 -137 -57 -20 -115 -227 -166 -109 -75 -221 -197 -101 -209
3067b09j01n6J23O5m7J13j09L7P9K1R2j83Q0J5Jp1q4p7rL2M2L8K2l6L8j4K7M2j6l1PJ4L9r7
3058b13M5lL0k4L9OK7J8q6j6P3k30K2R2O3M2O8k06O2j66J00m4J2J32kj17Q9l4N3ON9RO0r0
3050a24R2r8o8r6O1Rlr2R3j3N1MJ59j21n8M4J39k51J14K9L9p6J0j08J37j6q1j30O4LN9q8Q7
3042b29n6p2m7P0L3J15qLj35j9K23J96k8l7p6J22K5l1ol4j64K4L3%j11J65L0j7j50j03o3P0
3034b77j2Q2j5n9l5P7p8N2O2J9qM8o7Q4n5o2o4M5J31K29j82K0m9j42MJ44J27J3K8J7j21O7
3026B3J2M2q2R0O4lk6N7n4J43j75K7lj8K4M7k5j30k5Km5M1j0J27j9J11N9j69j50M4P7Q0K82
3018D18Q67J671m18j466o08l09j55j29l6j5O7q9j17m7J12O3k1m2J17m4QJ06J36lo7N4m9j0
3011fk0J32P6j00k8j32j3J33k9n7k3Q4m3j3j49J50o5n1r9J6K8o7O4J13j12k0J24J22k43jM4
$$ plain form
3067 -209 -310 -366 -243 -178 -225 -112 -221 -184 -105 -84 8 -175 -95 -80 -79 -150 -234 -311 -320 -288 -246 -208 -186 -222 -184 -198 -171 -129 -145 -176 -169 -155 -116 -213
3058 -213 -168 -171 -141 -165 -126 -120 -93 -75 -161 -177 -104 -334 -312 -220 -157 -115 -47 -253 -191 -357 -257 -301 -289 -157 -159 -276 -187 -221 -168 -162 -103 -94 -34 -124
3050 -124 -32 -130 -198 -294 -233 -224 -227 -319 -226 -239 -188 -184 -25 -146 -204 -160 -21 -272 -158 -129 -90 -166 -156 -264 -127 -143 -224 -354 -290 -287 -228 -316 -229
3042 -229 -285 -357 -404 -334 -301 -186 -194 -191 -326 -345 -122 74 46 9 -67 55 80 49 43 9 -155 -131 -98 -98 -209 -44 -14 -31 -181 -284 -347 -277
3034 -277 -289 -207 -222 -281 -316 -239 -317 -265 -203 -184 -192 -144 -211 -127 -182 -244 -308 -263 -132 97 -85 -65 -114 -256 -252 -108 19 32 60 77 -44 23
3026 23 35 77 -5 85 149 146 120 177 123 266 91 118 115 97 121 168 143 13 -12 -10 -55 -14 -24 103 84 195 254 85 -65 -21 56 136 418
3018 418 1285 2956 2538 1072 464 155 0 -129 -165 -180 -113 -202 -319 -366 -254 -191 -212 -254 -137 -181 -173 -67 69 66 -1 53 4 -6
3011 -6 -26 106 182 82 54 -78 -91 42 13 -44 -67 17 -26 -39 -188 -38 -103 -154 -253 -237 -209 -276 -212 -99 -211 -231 -107 15 -228 -229 -185
3004a85n0r2K09k1K7J12l8j58N7j62K6J62ko2L2j01P5l9J21l0P9j00L7K1M0j42J08m2N2r2
2996a58J48o5jr2N1J2J33r7J18j3j10j28J7m0J84n4k9j93K16n9m2j8l3l2J54m9J18j48P6j42
2989b76O6q0J13r5J84o9R8r7P3j92J2j5K08j50k1r8J42Q5k3j61O2p0J19j25Q3j00M4o1J15
2982b29n3L3q6M2NJ02k11M5Q1J96j35R2p3J17j63J59j80Ml8Ln0J11RM9r4J19j62Q0m4M2l7
2974b66J75l2k6p2J73j32O2k5J34k08oN6J87J3J7j90N7O3K55K58M85M44N11R9j59m12m14n10
2968E37k03k02r5j08L2n4J47o4pp9M9P8j79j32J61nN4L9O0N5l3R4K62K70L81M06N72L34j40
2960B230l45m89m17l87k81j84k37r3RL6O0KMn6pj3O1K8r5l0K2j58o4J11O7O2J29j2j55q1R2
2953a91p0Q2n6n4M7M1J9l3q6J99l6L7j4nj54Q1r4K60j9K1k32J03K6J10j03K32q7Q3j39K34
$$ plain form
3004 -185 -235 -327 -118 -139 -112 0 -38 -196 -139 -301 -275 -113 -115 -177 -145 -246 -171 -210 -89 -119 -40 -140 -103 -82 -42 -184 -76 -118 -66 -158
2996 -158 -10 -75 -76 -168 -117 -105 28 -69 49 36 -74 -202 -185 -225 -41 -95 -124 -317 -101 -160 -202 -220 -253 -285 -131 -180 -62 -210 -134 -276
2989 -276 -210 -290 -177 -272 -88 -157 -59 -156 -83 -275 -263 -278 -70 -220 -241 -339 -197 -112 -135 -296 -234 -304 -185 -310 -227 -327 -283 -344 -229
2982 -229 -282 -249 -335 -293 -288 -186 -397 -352 -271 -75 -210 -118 -191 -74 -237 -78 -258 -254 -292 -289 -339 -228 -219 -170 -264 -145 -307 -227 -271 -229 -266
2974 -266 -91 -123 -149 -221 -48 -180 -118 -143 -9 -217 -223 -167 20 33 50 -140 -83 -20 235 493 978 1422 1933 2032 1873 1461 1047 537
2968 537 334 132 37 -71 -39 -93 54 -10 -17 -96 -47 31 -148 -280 -119 -124 -70 -31 29 84 51 145 407 677 1058 1464 2036 2370 2230
2960 2230 1885 1396 979 592 311 127 -110 -203 -194 -158 -98 -96 -92 -148 -155 -168 -107 -79 -174 -204 -182 -340 -404 -293 -226 -164 -35 -47 -202 -283 -191
2953 -191 -261 -179 -235 -289 -242 -201 -182 -215 -301 -102 -138 -101 -115 -120 -274 -193 -287 -27 -46 -25 -257 -154 -128 -18 -121 111 24 107 -32 202
2946B02J83M37L99P97k7o46q04j64l08J35j59J39k28J65j53J64k63K16j92M0j04K15k40J84
2940a2j77K14j82J03j24K37k14K26r9K68l31K91l10J34k36L75k59K24j41K41j74K34k52L51
2934C87m15K93k58M75l40L25k85K77l50L00m46L57k69L35l26L51m62M22l79L76l64M32l12
2928A24M77m24M13m24N15l84N44n28O19l46M90o50M72m88O16m99N98l51N55o49N86o65P65
2923A366m62O45p53Q69n56Q84n28R08p63Q20p76J246k61J170j422J224q98J431j161J601p32
2917C852K215q81K801o13L759n55N848J469J1056P015L3255O4110K55008J95846k24463j96569
2913A63153q1601l2010j8360q956p835k728l575m12j897p0j433K28j062l0q90L82m06L0j200
2909A328L75k2K61n57J66l72K27j44K10r6K77k22J94j37Q8j43LpL06N6K14m0M2Q0J00j22J48
$$ plain form
2946 202 385 822 1221 2018 1991 1345 541 377 69 204 45 184 -44 121 -32 132 -131 85 -107 -67 -171 44 -196 -12
2940 -12 -189 25 -157 -54 -178 59 -155 71 -28 240 -91 200 -110 24 -212 163 -96 128 -13 228 54 288 36 387
2934 387 -28 265 7 482 142 467 182 459 109 409 -37 320 51 386 60 411 -51 371 -8 368 4 436 124
2928 124 601 177 590 166 681 297 841 313 932 586 1076 426 898 410 1026 527 1125 774 1329 680 1266 601 1366
2923 1366 904 1549 796 1665 1109 1993 1465 2373 1610 2430 1654 2900 2639 3809 2387 3611 2713 4144 2983 4584 3852
2917 3852 6067 5186 7987 7374 11133 10578 16426 17895 28951 35966 69221 133331 388339 584185 359722 163153
2913 163153 81552 49542 31182 22226 14391 11663 8088 7676 5779 5709 4276 4504 3442 3412 2522 2904 2498 2528 1328
2909 1328 1703 1681 1942 1385 1551 1179 1406 1262 1472 1376 1653 1431 1625 1488 1576 1433 1436 1429 1735 1791 2005 1965 2007 2087 2187 2065 2213
2902B213J37Q3L7J81J4Q6R7M6l7r7rj6K10J27L06K78J73P8M11N64R38P78J088P78Q34M20K00
2896I918N3J07J16P48J014J730J984K837L324M887P075J2508K3410M5394P4247R3982Q4729
2891C68063M1546j8622p0386r1723q1191n4754l0638j6985r256n738l730k950j760j333r69
2888A9574r37k49k28J89M23J112J178K139K958M719O839J2100K2898M4984P9588J11051J14399
2884D22737P4614L710o8511j11099j10110q1888m8852k7380j5176r757o190m847l143k312
2880A1796r65p91k73l05K14j71k86j016q70j323q76j211m52n23j17m90R3j81j6k28J18k30
2875A897O8m48N0j72L8l48J98j80M6n8J46q9L4k17K04j30K49k59Qj68J96j19K8j75K30j82
2868H47J92l1Q8j95J15j34M2k69N9k41K51k17J22j30N8j23J26k6J77j11J2j32J33r5O1j73
$$ plain form
2902 2213 2350 2433 2470 2651 2665 2751 2848 2894 2857 2760 2751 2735 2945 3072 3378 3656 3829 3907 4318 4882 5820 6598 7686 8464 9298 9718 9918
2896 9918 9971 10078 10194 10942 11956 13686 15670 18507 21831 26718 33793 46301 69711 115105 189352 283334 368063
2891 368063 409609 390987 320601 228878 147687 92933 62295 45310 36054 30316 26586 23636 21876 20543 19574
2888 19574 18637 18388 18160 18349 18772 19884 21062 23201 26159 30878 37717 49817 72715 117699 197287 308338 422737
2884 422737 497351 501061 432550 321451 211341 129453 80601 53221 38045 28288 22098 17251 14108 11796
2880 11796 10831 10040 9767 9462 9676 9505 9219 8203 7333 6010 5134 3923 3471 2948 2831 2341 2434 2253 2237 2009 2127 1897
2875 1897 1965 1517 1567 1395 1433 1085 1283 1103 1149 1091 1237 1148 1182 965 1169 1039 1288 1029 1037 869 1065 946 974 799 1029 847
2868 847 1039 1008 1096 901 1016 882 924 655 714 473 724 507 629 499 557 434 560 534 711 600 612 480 613 518 579 406
2862D06J14NJ9j07J15k05J26n0K04p7K6m3K29L7J06J40K06j48p1k27j75j32l6o3P9m9R6N4
2855E79M7k19Q1p7N1N2O8p6M1n3O1J05J15j34Q9J45J64J56J03J36OM1m1j81l1p7n4p4J18k1
2848A120J8j74P5K15J75O24J002J395J925J787R50k4j001j865j811j330r86n50k53k44j21
2843I27J4PP9j1q0lJ48J70Q5P2L4K5j5o4K04L56O71J290J938K180J806Q18l59j438j976j962
2836D916j485r44n17l63k2N5Q6j93J25L6N7oM9J13J48J41J26n4L4p7J7p7J56O3N3N4J18O5
2830B674J45J24L51J82K77P0L24L09M34N23P12O72P76P29P90R68J083J460J703J811K599L782
2824B2498O516J1730J8711K3562L3393L8866K5168K5616J3215K64M408n949M696L923m66J289
2820B27440j9428k1518k9804l9995l0543k3967j7479j0959o047l616j814q22j98LQ62J812
$$ plain form
2862 406 520 525 544 437 552 347 473 423 627 550 576 533 762 799 905 1045 1251 1103 1032 805 630 498 462 399 478 429 525 579
2855 579 626 407 488 411 462 514 582 506 547 494 555 660 775 641 730 875 1039 1195 1298 1434 1440 1481 1440 1259 1228 1151 1097 1023 1141 1120
2848 1120 1138 964 1039 1254 1429 2053 3055 4450 6375 8162 9112 9088 8087 6222 4411 3081 2095 1545 1292 1048 927
2843 927 941 948 1027 1016 936 933 1081 1251 1336 1408 1442 1467 1452 1388 1592 1948 2619 3909 5847 8027 9833 10651 10292 8854 6878 4916
2836 4916 3431 2487 1970 1607 1585 1640 1726 1533 1658 1694 1751 1745 1794 1907 2055 2196 2322 2268 2302 2225 2242 2165 2321 2384 2437 2491 2609 2674
2830 2674 2819 2943 3294 3476 3753 3823 4147 4456 4890 5413 6125 6797 7573 8302 9092 10060 11143 12603 14306 16117 18716 22498
2824 22498 29014 40744 59455 83017 116410 155276 180444 206060 219275 219539 223947 217998 222694 226617 226151 227440
2820 227440 208012 186494 156690 116695 86152 62185 44706 33747 27700 24084 22270 21448 21250 21253 22115 23927
2816B3927L672P068J2297J6685K2227L0918K3411J8745J6622O95L320k580o51O273j832K548
2812A83345j0008j8936j9543l2048k7711k0481j5719j0249n865m152l158k637j641j180j20
2809I897R67N46j880j569j154o24n89l02l41l84l50j62m72k76k57k90l47n5j81k1j10J43J85
2803B374K83K08K34p3r2l48k77j30J08m4l5m38k22k96j80j40k2m1O4LN2m8L1j53j4m7Oj7J00
2796H46M8P2J83K34L7r2o2Q7J53K06j07j84j62L8POk75k32r0J8j5lro9mr4k08L3J0Q6m3RJ14
2788E38L48J93o7j23k18o8J88J37j56j28k12j03k6J9K1K9j5M0O6j2j10k4O6P4rj19LN1m1q
2781C34K5P7P6m5j56O6J2K15K86q0k57j06j4p4j23k5n3P3j29R4J19O0R2K8j82j8K2J12j25
2774C04m9LJ30o0J13L2M3j03Qj50J71J21K96J40o7l06j21o7n9j84R0JM6J10O5r0K2n5nk8Q5
$$ plain form
2816 23927 27599 34667 46964 63649 85876 116794 140205 158950 175572 176267 179587 177007 176356 182629 180797 183345
2812 183345 173337 154401 134858 102810 75099 54618 38899 28650 22785 18633 15475 12838 11197 10017 9897
2809 9897 10864 11410 9530 7961 6807 6183 5594 5292 4951 4567 4217 4055 3583 3307 3050 2760 2413 2358 2177 2156 2046 2189 2374
2803 2374 2657 2865 3099 3026 2934 2586 2309 2179 2287 2243 2208 1770 1548 1252 1072 932 910 869 933 936 988 940 971 818 804 757 763 746 846
2796 846 894 966 1149 1383 1420 1328 1266 1353 1506 1712 1605 1421 1259 1297 1304 1310 1035 803 713 731 716 713 704 635 631 537 329 362 372 458 415 424 538
2788 538 886 1079 1012 889 671 603 791 928 772 644 432 329 303 322 343 372 357 397 463 451 341 317 383 457 448 329 332 383 342 334
2781 334 359 436 512 467 311 377 389 604 890 810 553 447 433 359 236 211 158 231 102 196 315 375 467 495 313 295 317 429 304
2774 304 255 258 388 328 441 473 516 413 421 271 442 563 859 999 932 626 505 438 379 195 285 286 332 442 507 417 439 384 379 351 436
2766D36l9J56o0j02M2L4nK9q2O2Q7qj85Q7o1Q9J9r1j22P1J3J03mm8L9K7j43km0l1qJ89KK00
2758F54J50J5K7q1j60j06l9l7N5r3j1J8r1L4O1n4K6J86r8k7kJ69O3n6n3k9MM7MJ37J05J55
2750I73Q3J20RR0k4L6j35J5j10P8N1j9n2p2J2R1j1J11n0l5L3K11J17J00P4K45K11K35J35J21
2743B643J9K26J05J80K1J00M1R0j44o7j25lj12mQ7K70n2J01J02M19K53K27J66L75K53M07M77
2736F055N85L91N94N24O56N40Q10Q26R59J258J714J817K016K502L102L742N156P982J3958
2731E5187K4858L8834M9391O4648P0242M8374K5948J6259R590j2419j4299J1451O665j0379
2728C84350j5497k4492m6966o7478o1077m8835l8669k5544j5045q999n996m422l611l003k382
2724A2334j916j421j287j281r30p07n22n56l31j06j24j56o2j59k48q5n0r3p4j55j18k09n5
$$ plain form
2766 436 397 553 493 391 433 467 462 491 409 471 558 550 365 452 391 480 499 408 286 357 370 473 469 421 460 487 344 342 302 271 263 452 454 654
2758 654 804 819 846 765 605 499 460 423 478 385 374 392 301 335 396 342 368 554 456 429 427 596 659 603 550 521 525 572 576 713 818 973
2750 973 1056 1176 1185 1275 1251 1287 1152 1167 1057 1135 1186 1167 1115 1043 1055 1146 1135 1246 1196 1161 1194 1405 1522 1622 1696 1941 2152 2387 2522 2643
2743 2643 2662 2888 2993 3173 3194 3294 3335 3425 3281 3214 3089 3086 2974 2970 3057 3327 3275 3376 3478 3897 4150 4377 4543 4918 5171 5578 6055
2736 6055 6640 7031 7625 8149 8805 9345 10155 10981 11940 13198 14912 16729 18745 21247 24349 28091 33247 41229 55187
2731 55187 80045 118879 168270 232918 303160 351534 377482 393741 403331 390912 376613 388064 394729 384350
2728 384350 368853 344361 297395 229917 168840 120005 81336 55792 40747 31748 25752 21330 17719 14716 12334
2724 12334 10418 8997 7710 6429 5499 4792 4270 3714 3383 3277 3153 2997 2935 2776 2528 2443 2393 2300 2226 2071 1953 1744 1689
2719A689m9r3O7k7k54jl4%n1j43K9r9r7l5K08j41J4O2M3n2n1l3l4J04mJ6k0k9M6k8Ok6L2J0
2710A025R4jm0j40L5j5o6Q4J00n1R6J85M11M84M76R19O94M31M26k9J79J4J52k1j49n0m22n47
2703D274o44q35n32m89l05k43j42k03kJ4r8q2O1JJ58J73L36M05O16O46M75L38L71J71J80j49
2697D495Q3K4N8j85l83l86n92q12m16n50l57k37p7j18l6j15p4%l2m5L4k5J74n8J6j07o1K0
2690B38P8j9K5q4mQ0k8j55k0N8J35l7j09J1Q8j29R6j8L9m0K7qN9NP3m1m3j04O3n1Q8M2m2Q
2682B81M1j38n6J5J50o3Mj78rR2P9l3l6l2oo3Q0P0N7j9mlj17L4Mq8pM0j4O0J46k0r3Q4o3j03
2673I2K8J15p3n4O1j6o2q4J34P4N9p9m4j4N6K4Q6j0k1jn3M8J5q8j10OQm0K1l1R3P6o1m6ln
2664A01m4P7L4k0KKNj01m4MN1J35RJ6k9o3l7K8Q7l2j59J10J4J06p8m9Q5O0l8l6n9m5j9M7L7
$$ plain form
2719 1689 1640 1547 1614 1587 1333 1332 1298 1298 1247 1104 1133 1034 937 902 1110 969 983 1045 1088 1036 985 952 918 1022 1018 1034 1014 985 1031 1003 1009 983 1015 1025
2710 1025 1119 1118 1078 938 973 958 892 976 1076 1025 1121 1306 1717 2201 2677 3596 4290 4721 5147 5118 5297 5311 5463 5442 5293 5243 4821 4274
2703 4274 3630 2795 2263 1774 1469 1226 1084 881 879 893 795 713 774 775 933 1106 1442 1847 2463 3109 3584 3922 4293 4464 4644 4495
2697 4495 4578 4602 4660 4475 4092 3706 3114 2302 1886 1336 979 742 665 547 511 396 322 322 290 245 279 254 428 370 386 279 218 238
2690 238 316 297 322 238 234 314 286 131 111 169 304 267 158 169 257 128 224 206 245 205 232 224 283 288 361 320 277 173 236 185 273 315 273 281
2682 281 322 184 128 143 293 230 234 56 47 139 218 185 149 117 111 48 128 198 255 236 232 229 112 146 150 62 55 95 81 141 287 267 174 258 195 92
2673 92 120 235 162 108 169 153 91 7 141 215 274 195 151 137 193 217 303 293 272 271 218 266 281 193 83 89 97 57 78 47 140 216 155 109 106 101
2664 101 57 134 168 148 150 152 157 56 12 16 67 202 211 227 198 135 98 126 213 181 22 132 146 252 174 125 210 270 232 196 137 92 73 120 157
2656A57P7l8P4j14J62P7r5j59J9K3o4OQ3m8P5J52J8O0J80J86L27K24M81L40J7N4J19k00L4
2649B227J02M7j37r3j35j90k77l12k95k73k58J9j03Q9j9j09j12p3l3L9q7J60N6J31Nk4ro7
2642B69K3Q6Jj7p8N3K2J44L6J23kL8m2J40J91L53M99Q22J117J402J386J293P58M78K94l00
2635I089k61K52J11k58m80o21j275j497j254j076q53n45k91j69j37q9j53n9r4j2L3n4p8L8
2630B67P4p7j24j2K7J94J36j7j76Ln3J0N3J02j00j9qk7N3J1L3K9N3o4o3L8PM6m7K7l2Ln4N0
2621C43m4J20p6Nk6L7m5j4o6J08lk26o5O0L9n9M6mm5J03n9o7J4N3J39Pk5j5j9N8q3J5J3K8
2613B47p9QlJ32P6p0RM3n7m8J3m5k3j09l5j3OO1j8k9R6pR7O5j3j04o5j1K4P1j3r1R9P0j30
2604A54P0J1j27K9o6k6M0j13p2R0Q5J12q3J4P1K5K5J2n0j24L6k7nO3j3L6Q8J02o2J9j3J4j2
$$ plain form
2656 157 234 196 270 156 318 395 300 141 160 183 119 125 208 160 235 387 405 465 645 831 1158 1382 1863 2203 2220 2274 2393 2193 2227
2649 2227 2329 2376 2239 2146 2011 1821 1544 1232 937 664 406 425 322 411 392 283 171 98 65 104 17 177 233 364 369 345 336 269
2642 269 292 378 379 362 284 337 359 503 539 662 660 698 656 796 987 1340 1839 2661 3778 5180 6566 7859 8617 9095 9389 9089
2635 9089 8828 9080 9191 8933 8453 7832 6557 5060 3806 2730 1877 1332 1041 872 735 646 493 434 340 328 361 307 229 267
2630 267 341 264 140 128 155 349 485 468 292 295 242 252 305 407 307 288 280 253 306 317 350 379 432 368 305 343 350 396 349 376 344 347 293 343
2621 343 299 419 343 348 322 359 314 300 234 342 339 113 48 108 147 88 134 130 85 188 129 62 76 129 268 275 250 235 216 274 191 206 219 247
2613 247 168 176 173 305 381 311 320 363 306 258 271 226 203 94 59 46 52 113 95 66 162 155 252 317 304 200 135 124 148 219 206 115 214 284 154
2604 154 224 235 108 137 71 45 85 -28 -100 -10 75 187 104 118 189 214 239 251 201 77 113 86 81 144 131 167 255 357 295 314 301 315 303
2596C03K2L8L2j92J7j21j78O6N7oQ4K0kj29R4Q2j13j34J07J3m7J3N6K2P6q5j3j28N5R0R6m5
2588A50k6j34K13Nk1K7P7k0l6P4M9r8L7o8N6M8J2j9N8q5j02K1L2K1R4K1oK3J69j58j70p8K
2580A68m6j14p3R0K6l6j7j2P3J1PP1q0k8L4k1O0j1j35oq5N8J7J2k4j1m6Q4qOJ7J9K8K19j6
2572B31m2M2R6RJ13J2r8j32m0j5n6kp9o7O0J6o0j28N7N3M8o5O3Q8m7lQ7j05Qm3L2JP2N4n0
2563A10O3J9k9q2K4l0q7l2L9J78P1j8o0l6J0K4j0k9P2N8L0o8N5O5j12J4R2R4J3p3J5K0R1O1
2555E52j8K0l0N1j38r3n7j3oL6K4L8p1j12k3om0J12j9n4r6l5q2J49k7n5pO9R6j25j6Q1K43
2547C48L2R1JL2K01o1J4O4L4N2q2M5N2M1nOr6J27p2j06r2p1P0mP2R1o1l0m8m7O5m6n3J6OJ04
2538F90k5l8j40L5o4O8j69nJ6J14m0O8r2L3N4o7j80Nqj9R2P1kq2k9R8J03j8o2P8J42L2p9P6
$$ plain form
2596 303 325 363 395 203 220 99 -79 -13 44 38 122 142 140 11 105 187 74 -60 47 60 13 26 82 104 180 95 82 -46 9 99 195 150
2588 150 124 -10 203 208 187 214 291 271 235 309 358 260 297 229 285 333 345 326 384 299 197 218 250 271 365 386 380 403 572 414 244 166 168
2580 168 122 8 -65 25 51 15 -2 -14 59 70 77 148 68 40 74 53 113 102 -33 -39 -124 -66 -49 -37 -61 -72 -118 -34 -42 -36 -19 0 28 247 231
2572 231 189 231 327 336 449 461 363 231 191 176 120 118 39 -28 32 48 -12 -140 -83 -30 18 -47 16 104 57 54 141 36 44 1 33 34 106 160 110
2563 110 173 192 163 81 105 75 -12 -44 -5 173 244 226 166 130 140 164 154 125 197 255 285 217 272 337 225 239 331 425 438 365 380 400 491 552
2555 552 534 554 524 575 437 344 287 274 268 304 328 366 295 183 160 154 114 226 207 153 57 22 -60 89 62 7 0 69 165 40 24 105 348
2547 348 380 471 472 504 705 644 658 722 756 808 726 771 823 864 859 865 769 896 824 718 626 555 625 621 693 784 723 693 645 598 663 617 564 580 586 690
2538 690 665 627 487 522 458 526 357 352 368 482 442 510 418 451 505 438 258 263 255 236 328 399 397 315 286 384 487 469 407 485 627 659 580 656
2530F56j6L7M7m6Q8K9Qj19o5K5j44J55j05m2j32o9j17p4O1n7j57N0N8J04%r7o0J26j4R5K5
2522B50j86j36K51lo1Np0k1rj2M6M0P3j0pq4r7J2l5j0N6J27Q4k1j1p3j24m8J5N9J1q5J68J06
2514B00N1q0m6M9r0l2L3M1O1r4M6Kj08q9LJ6l6o2Q2m5R3p0m2M7Q0N6okk3p6P8n6l2J23p1o3
2505f2O3J49o7q4M9qN9R1kj88Q8J8q4p5J04N5k9n3J9N0j5p7P6o7Q7Jk0M3k8R2R3r7LJ30J8
2497C32k2J22O5K23m6l1m5j02j47j0Ml4K6N6l6j29rN5q1m6N3J5j1K9j2J06Q8j54J06N6n3j64
2489B04J56k1l5L4J49n6J2K2j20j56N6j0L4j73k3O4O4N2j63Q3Q7l7m8o0Q6P3p5P4J07m0J13
2481D53Q6jk6J00N3Lj12P9m4Np5m4j20M2k08J85Kj24k3Q5r3k0l9P5R6k9N8m6N7P2o6Q4l8q9
2473C38J8R8oq6o8O0r1j48j7M8n9p6m9J02K2J05o4L2j28o0J8Q0N0m7O2ML4Q7k3m5J35O6m9
$$ plain form
2530 656 640 677 724 678 766 795 803 684 619 644 500 655 550 508 376 307 190 116 177 120 -37 13 71 175 175 78 18 144 130 225 250
2522 250 64 -72 179 176 115 120 50 29 20 8 54 94 167 157 150 66 -31 -19 -54 -64 -8 119 203 182 171 98 -26 -74 -59 0 11 -74 94 200
2514 200 251 171 125 174 84 52 85 126 187 93 139 141 33 -56 -53 -37 -73 -135 -53 -98 -5 -75 -117 -70 10 66 60 58 35 -41 37 -19 -51 72 1 -62
2505 -62 1 150 83 -1 48 40 99 190 188 0 88 106 22 -53 51 106 77 24 43 93 78 1 77 10 97 98 78 121 93 185 278 181 184 314 332
2497 332 310 432 497 720 674 643 598 496 349 339 343 309 335 391 355 226 217 272 191 145 198 213 202 231 219 325 413 259 365 421 368 204
2489 204 360 339 304 338 487 431 443 465 345 189 245 235 269 96 73 137 201 253 90 173 260 223 175 115 201 274 199 273 380 340 453
2481 453 539 538 512 612 665 668 556 635 591 596 521 477 357 399 191 376 378 254 231 316 223 203 164 239 335 306 364 318 375 447 381 465 427 338
2473 338 356 454 448 362 294 354 263 115 98 146 87 11 -38 64 86 191 127 159 31 -29 -11 69 119 72 134 138 172 259 236 191 326 392 343
2465C43K4Q4P6j27k8J67j73k0J3O5j6o3l7k7J25k9j16n8j0n6J9mq7oq4J2n0q1N3P1N4K0J5
2457F9n3K8Nm1k4N3L9J26K7j70j9R1jl7l4J23M1Rq8K9k9O4j0m0P4j6j03k3j03K8J5k1O0O4
2448A33j16o4P5O5pj0M2k4l4j4JK0j13j33k4J56J9Q2J7N8o0kkM5L4l6oj33lM4m3Mj33K7J06
2440b9J26m4p7L6J08n6j10l4J03o1M7M9j24o1nP3Q9K6j0m4O9o3L1O1J07m2kP3n2k1n6j76K7
2432d2O9PJ52qq3j66J7R0pR2J2M9J0n8Rj05j9M5M3N5lq2L6K4J16m9NM5n8j11nO0J11n3J27
2423C25j52o6J3p1j7O9K4N4m7M8R5m3j02Q4j2J7P6j13J3P6m4j24n5k0M4J36J0L7j28J82P7
2416C86p5j2o9j21m1q0PM7R0k1L9k0J53J7l6J3K2O1J15Lp6J58j22O7J84R7K9r5K0Q3rj3J00
2408I01j80Mk6o5r8o5k6J09N0o4n5K1p1pj9K2JJ00K4O4k3o9J07Kj3M9k2j06L7N3j9N1j32Q2
$$ plain form
2465 343 367 451 527 400 372 539 366 346 359 424 408 345 308 281 406 377 261 203 193 137 156 152 65 59 -25 -13 -63 -144 -91 -20 34 54 69
2457 69 16 44 49 8 -16 37 76 202 229 59 40 131 130 93 59 182 223 232 144 173 144 208 198 158 232 216 113 90 -13 15 30 9 69 133
2448 133 17 -47 28 93 86 76 118 94 60 46 47 67 -46 -179 -203 -47 -28 54 71 129 69 67 65 110 144 108 102 -31 -34 10 -33 -29 -162 -135 -29
2440 -29 97 53 -24 12 120 64 -46 -80 23 -38 9 58 -66 -127 -132 -59 30 56 46 2 71 8 39 100 207 165 163 236 184 163 107 -69 -42
2432 -42 27 34 186 178 95 -71 -54 36 29 121 133 182 192 134 143 38 19 64 107 162 159 77 113 137 253 204 209 254 196 85 80 140 251 198 325
2423 325 173 107 120 49 32 101 125 179 132 180 275 232 130 214 202 219 295 182 195 271 227 103 48 28 72 208 218 255 127 309 386
2416 386 311 299 230 109 68 -12 -5 42 132 111 150 130 283 300 264 277 299 360 475 478 402 560 438 505 689 786 815 720 740 823 814 801 901
2408 901 721 725 699 634 536 471 445 554 604 540 485 506 435 428 409 431 432 532 556 620 597 528 635 637 624 673 651 545 582 635 616 667 535 617
2399F17J75J08P7J37J0o7N3O1J3Ko8Q5j9j15j91o1n8L2p1k7N8j0j44k6o2l0q8N8O5P0N3J3
2391F50K5K2j8o8r8m0J65M2q2j2mj6J37J8n2R6Q0j2l5J01J23N6l7l1k26m3j05j36K7Km6N6
2384E39n4j24o2M2OK2n4L0L8n5N0j7j41n1R4k5l9J36l9QJ03J20O6LL5k2k5m2j22m0n5o2J3
2375B76r4l2J37j2N2O3k62m9l7J13k8o2J9p3j21R5J30mj33J5M1n3K3J48M0m0m6o5J65k6n9
2368A21k1Q8J02N2m2o2m1j1j05M8L7m2L2n0j34M5j3J6Q2Q4M2MK6r2J7j0j25k5O4R6k0j29N4
2360H8%l5r1l6L5Pj10K3O3R0q0o4P9K34qK7o7pk3n5n3N9k7KL2p5p4P1J2P6np1k4K8mN1m4J8
2351D2KrJ7j2O0M5q9N0l2jk2o9kO0O0J1O2n8o0n5j6J00o9K6L7J70JNj05o4q0l4QJ4K2L6n2
2341aL2l4O9K0q6PP5l6j9J0n8o7J55O1p8%R2j42k5q5N7J4j2p3O1M4N8k0R2o6o7nj0N2K5j12
$$ plain form
2399 617 792 900 977 1114 1124 1057 1110 1171 1184 1186 1118 1203 1184 1069 878 817 759 791 720 693 751 741 597 571 509 479 391 449 514 584 637 650
2391 650 675 697 679 611 513 473 638 680 598 586 582 566 703 721 669 765 845 833 798 899 1022 1078 1041 1010 784 741 636 500 527 529 483 539
2384 539 485 361 299 341 347 369 315 345 383 328 378 361 220 169 263 238 199 335 296 304 407 527 593 596 631 609 584 542 420 380 325 263 276
2375 276 182 150 287 275 327 390 128 79 42 155 127 65 84 11 -110 -15 115 111 -22 -7 34 -19 4 152 192 152 106 41 206 180 121
2368 121 100 188 290 342 300 238 197 186 81 129 166 124 156 106 -28 17 4 20 102 186 228 232 258 166 183 173 48 23 87 183 163 34 88
2360 88 88 53 -38 -74 -39 -32 -142 -119 -56 34 -46 -110 -31 203 195 222 155 148 125 70 17 76 49 51 83 8 -66 5 17 93 88 17 -7 21 17 68 24 42
2351 42 44 35 52 40 100 145 56 106 74 73 51 -18 -20 40 100 111 173 115 55 0 -16 84 15 41 78 248 249 254 149 85 5 -29 -21 -7 15 51 -1
2341 -1 31 -3 66 86 0 7 82 46 27 37 -21 -88 67 128 50 50 142 0 -25 -110 -53 -39 -51 -124 -63 -19 39 19 111 45 -22 -27 -37 15 40 -72
2333g2j7j27J20m1M1j7R6o3jp1L0N8r8K2M0L8l3M5M7N7J33j03k2lo1J4qqK6jL1L2o7n2k7q5
2324a47m3m7J34L7m7J7N9M7p7J1M3L6q1j07J4M2O4J83J0j63l4J22k5oj16j7J41ql5j6j3P1
2316D9q9k1O7nl8L0M4j16O3K5o0qj45Q4R9N1r8NO4j8L3R7Rj26M1j5j35J13m0j16M5l8pj4N6
2307a14J12k6K8N1j21P0J6j7J7k3J30j53L9j9O9j40P8M0o8J7K1L6O5j12J40O0N0J28L9l0j39
2300B44L9L1k20Q7p9m0o3J48Q2R1l7lK0j26O1n7j7J12N6L1J1M3R6K8q8J38Mo6o3j3Lj2r9L
2292C45j7J05l1k3L9j7NJ21q2J1o8l5K6J37r4LO0Q6J33L2K6J85M9L9k0R3m6p5j80j02j1j26
2284E68j80j6J06K5k5M9j08M8M1j22k2Q6j0m0J3J20J18J41o9J24K2jJn3j39L7O2m1j15q6l
2276E31J76M2n8j67j15q7Kj28P8M5j14J09M3M7K1P0J3M3m1L1Q9L1P4n0j60K7J3q8m5Lr2p3
$$ plain form
2333 -72 -89 -216 -96 -137 -96 -113 -17 -80 -81 -152 -122 -64 -162 -140 -100 -62 -95 -50 -3 54 187 84 62 59 -2 12 4 -4 22 21 52 84 17 -35 -62 -147
2324 -147 -190 -237 -103 -66 -113 -96 -37 10 -67 -56 -13 23 -58 -165 -151 -109 -45 138 148 -15 -49 73 48 42 -74 -91 50 42 7 -9 -22 49
2316 49 -40 -61 6 1 -37 -7 37 -79 -16 9 -51 -59 -204 -120 -21 30 -68 -63 1 -17 16 113 122 -4 37 22 -113 0 -40 -156 -111 -149 -156 -170 -114
2307 -114 -2 -28 0 51 -70 0 16 -1 16 -7 123 -30 9 -10 59 -81 -3 37 -31 -14 7 43 108 -4 136 196 246 374 413 383 244
2300 244 283 314 94 181 102 62 -1 147 229 320 283 280 300 174 235 178 161 273 329 360 371 414 510 538 450 588 592 526 463 450 453 441 342 345
2292 345 328 433 402 379 418 401 406 527 445 456 388 353 379 516 422 425 485 571 704 736 762 947 996 1035 1015 1108 1062 987 807 705 694 568
2284 568 388 372 478 503 478 527 419 467 508 386 364 450 440 400 413 533 651 792 723 847 869 868 869 816 677 714 776 735 620 534 531
2276 531 707 749 691 524 409 322 324 196 274 319 205 314 357 404 425 495 508 551 510 541 630 661 735 685 525 552 565 477 432 435 343 270
2268B70j3J7J5l3Q7qOr0l1J8j12PJ65J18Jk4n3J64j1j16n6p7r0j09J46J20nM7j02J48J41k3
2261E17m1j6M1l2oJ94K17j25k32Nl5L5M6k7q8j29J2lj14O0J22j66K5O3N3J39j2K39K00K07
2253A149%j36j24J23K54K91K27j51k99k20j05K13J52J51K8k65k21J05R5K9N7K8p4P1j23p4
2247A181K0R7N9J53K4j14n7M9K09N9J78P9j94RM9J04K72L83m3q1k55NL41K90l7j54k15l7o9
2240B305j9KL9j48m7J8p9j84n9K7J17K34K18Kj75j26J19L67L30l3r0k03P1Q2P0k1r8l03j07
2233B309J61K05J51L9j85j58j10j24NJ03L8J99K22k1k16j03j45o6j13J41n2j76p5J5n9J31
2226B116R3L3K2j10N9J30Q7J30o6m5j90J32J52n7J10j2n7M5p7j02k02j88J4p7k2P5l8j20q0
2219A755K12K35J63j24j81k43J25L21K04k02l24j72NQ6l2m8j16j8J29K8J1L2j50p5M6J73J37
$$ plain form
2268 270 257 274 289 256 343 335 341 251 220 238 126 133 298 416 417 393 340 504 493 377 321 244 154 45 191 311 306 353 251 399 540 517
2261 517 476 460 501 469 463 657 874 749 517 522 487 522 568 541 453 324 336 333 219 279 401 235 260 323 376 515 503 742 942 1149
2253 1149 1149 1013 889 1012 1266 1557 1784 1633 1334 1114 1009 1222 1374 1525 1553 1288 1067 1172 1267 1296 1353 1381 1307 1378 1255 1181
2247 1181 1201 1298 1357 1510 1534 1420 1363 1412 1621 1680 1858 1937 1743 1752 1801 1905 2177 2560 2517 2436 2181 2186 2527 2817 2780 2626 2411 2374 2305
2240 2305 2286 2288 2327 2179 2132 2150 2071 1887 1828 1855 1972 2206 2424 2426 2251 2125 2244 2611 2941 2908 2818 2615 2686 2768 2838 2817 2719 2416 2309
2233 2309 2470 2675 2826 2865 2680 2522 2412 2288 2293 2396 2434 2633 2855 2834 2618 2515 2370 2304 2191 2332 2280 2104 2029 2044 1985 2116
2226 2116 2209 2242 2264 2154 2213 2343 2430 2560 2494 2449 2259 2391 2543 2486 2596 2584 2527 2572 2495 2393 2191 2003 2017 1940 1918 1993 1955 1835 1755
2219 1755 1967 2202 2365 2241 2060 1817 1942 2263 2467 2265 1941 1769 1774 1860 1828 1780 1664 1646 1775 1803 1814 1846 1696 1621 1667 1840 1977
2213A977j24j34o1J96M58R9j94k35j17M8Rk01j72j1Pn3MQ3K6N6o4O4J21lPj10k7J38J36kJ21
2205B042J42O4J81J75l6l1m9m5j29m6n7L48K27k54l84j05J20J08P7K1m5j99j14Q1J67P6M4
2198B379R3J53K04N4J8R9J27n2j1J81K5r1K7K5J5m5p9j23J03J35J02N9rq6R5J34R2J50K99
2191D073K27L90L09R7l2%O1L65L17J37K73K29K37O72P73J016J155J438K418M618P992J1683
2186C8448Q844J11m444p23P895J6095J2797k144j3332j2199n300j555j632l365n659m650k076
2182B7111q85j362n94J420M227N668L618M75J620P819J7493K4090J5861j813p732K150J8404
2178A17570K0225P898q225k4040k2548p018O667J0835R687J2031R628k750r229M34K0651L7012
2174A78828K5256p854k9231k1870l596M358q02j0041j4358j2460j1336r168j847O660Q568
$$ plain form
2213 1977 1853 1719 1658 1854 2312 2411 2217 1982 1865 1913 1922 1721 1549 1538 1545 1492 1496 1579 1605 1661 1597 1661 1782 1779 1786 1676 1649 1787 1923 1921 2042
2205 2042 2184 2248 2429 2604 2568 2537 2488 2443 2314 2268 2211 2559 2786 2532 2148 2043 2163 2271 2348 2369 2324 2125 2011 2092 2259 2335 2379
2198 2379 2472 2625 2829 2883 2901 3000 3127 3075 3064 3245 3270 3179 3206 3231 3246 3201 3122 2999 3102 3237 3339 3398 3389 3303 3398 3532 3624 3774 4073
2191 4073 4300 4690 4999 5096 5064 5064 5125 5490 5807 5944 6217 6446 6683 7355 8128 9144 10299 11737 14155 18773 26765 38448
2186 38448 47292 47403 42959 42236 50131 66226 79023 76879 63547 51348 46048 44493 42861 39496 33837 29187 27111
2182 27111 26226 24864 24270 25690 29917 35585 39203 39678 41298 49117 66610 90700 106561 104748 97016 99166 117570
2178 117570 137795 145693 137468 113428 90880 83862 90529 101364 111051 123082 132710 129960 120731 121165 141816 178828
2174 178828 204084 196230 166999 145129 141533 145891 145089 135048 120690 108230 96894 87726 85879 92539 101107
2170A01107O611P302O528j26j070J2741L5824M6920K4875n779l479L2185O8804N3050N903
2166C91396l4750o7322n5919j5342J7621L0908K8775J2747j8723l8465k5776k153K6283N7214
2163C06494N9838N075l1286j3119K5880M1982J5126l17j808k3438m7535k9585K6103R0084
2160D23494J42472J24639j0651j38223j41784q6029l4344O077L7549M3196O286R65J6542j6259
2156C73930l4181j6875Q740j454m2879m9908k5616N428M0171N9614K5461m3290p0273m6244
2153A82624j6744j055J10n848l219J1528K0359R603r957j0109P527J5206o016k8832k4727
2149A40450p178r54q236j5008j5362j1817p507j477N199Q587Q615J1192K2049K8019J6875
2145A73447k094j1627J883J6002K4583P588l0423l3216r352P051Q642o813k4227k3032j2712
$$ plain form
2170 101107 107718 115020 121548 121422 120352 133093 168917 215837 240712 234933 231454 263639 332443 385493 391396
2166 391396 356646 289324 233405 218063 235684 266592 295367 308114 289391 250926 225150 222997 249280 306494
2163 306494 366332 371407 340121 327002 352882 394864 409990 409673 407865 384427 336892 307307 333410 423494
2160 423494 565966 690605 679954 541731 399947 313918 279574 285651 323200 366396 372682 373647 390189 373930
2156 373930 339749 322874 331614 330160 287281 237373 211757 217185 257356 316970 342431 299141 228868 182624
2153 182624 165880 164825 164935 159087 155868 167396 187755 197358 187401 177292 184819 200025 194009 165177 140450
2149 140450 133272 132318 124082 109074 93712 81895 74388 72911 78110 86697 95312 106504 128553 156572 173447
2145 173447 171353 159726 161609 177611 202194 209782 179359 146143 136791 143842 152484 145671 121444 98412 85700
2142H5700o878p078p029k131M794O446J039k906J870J1205J3503L308m804n035m913l883j744
2138H1464J965P008K995r804j4022q614k640J307K575L14J628K290n125p257O91J2408J8312
2133H5495J010j7761j4284k987N543N282n920j4168j1001n708l185l487l408k670j450p73
2129A0528l39J02N23J064K182L746M822K165j383r87K347O791Q267J202p259p792l808M32
2125B2603K819O9m689n605m128k774j649q78n94m78n10l75k85k67q0j53k06j09j14j76r9L1
2120B353j37n6p4J70O7m8p1L6K3Kq6j43j6L8n8%o1R6Q7j50j34J6k5p1p5qM9O4j54o1n3j90
2112A330M4j3k5J1P3nJ5N0j24L1L8R4j40r8J1O5J51K31K67P4nn3l2N7n9n9k19q8j18J0k0P6
2104A570k53j38n0j2n6n6J13Qk0J03L1L3J40J41K30J14r1O2r4N5L29L28j6m23k21k61o0J47
$$ plain form
2142 85700 78822 71744 64715 62584 67378 73824 74863 71957 73827 85032 98535 101843 97039 92004 87091 83208 81464
2138 81464 83429 90437 93432 83628 69606 60992 58352 59659 62234 62548 64176 66466 61341 54084 54775 67183 85495
2133 85495 86505 68744 54460 51473 57016 62298 56378 42210 31209 25501 22316 18829 15421 12751 11301 10528
2129 10528 10189 10291 10814 11878 14060 17806 22628 24793 23410 22423 24770 31561 39828 41030 33771 25979 22171 22603
2125 22603 25422 25491 20802 15197 11069 8295 6646 5768 5174 4696 4186 3811 3526 3259 3179 3026 2820 2711 2597 2421 2322 2353
2120 2353 2216 2160 2086 2256 2323 2275 2204 2240 2263 2265 2179 2036 2020 2058 2000 2000 1939 2035 2122 1972 1838 1854 1829 1758 1683 1675 1724 1788 1634 1573 1520 1330
2112 1330 1374 1361 1336 1347 1420 1415 1430 1480 1356 1387 1425 1519 1379 1281 1292 1357 1508 1739 2006 2080 2075 2022 1990 2047 1988 1929 1710 1622 1504 1514 1494 1570
2104 1570 1317 1179 1129 1117 1061 1005 1118 1126 1106 1209 1240 1273 1413 1554 1784 1898 1807 1869 1775 1830 2159 2487 2471 2048 1827 1566 1506 1653
2097A653Q8j59j28n8L2m7J5J80R6K9N4P0r8L3O4N2j7j20l0j14N1J92N1O4k18j78n9%J0K19
2090A727J61k19j20j3J01K35L12J47k05j53r9P9K29P7j60j26r1j58r4J32J6J40J5q1j52r7
2083A603J5J1O3M4J1j05q8L8K74R4J33j39k89m7J62J30J19P3k44k17j01P8P9MJ35r5j77K5
2077A589R3J11M0j18k6n1J1J5o3K51J32j06j34j41q8o0j28k8K5r6k6q6q9jJ88J9p8j99m8K83
2069A191J92J26J27j86P0O0j29j85L6J68Q7J32k00k95o5r0J51L0N9j20j30p9l6%m4j4J8j4
2062H60M1M2Q2j16Q5Pl7o5p4q8l8Q6J78J5j78N9ok62M0O5Q5P2j18p4J4P8R6L0j10j65K0N6
2055F80O1k2p3j51j00l8N6J42Ok1j23k03R4J7M3K7l8K7N9L7m4L2Q2J39L4k11n7j4k3J38o2
2047D94l0J4M9q9j25o8jK0n6Q1%m3l9l5m5O9P3k1l9j1Q0R8j7Pn4O0n9jN0j38l7J38q5pk8l2
$$ plain form
2097 1653 1741 1582 1454 1396 1428 1381 1396 1576 1672 1701 1755 1825 1727 1760 1824 1876 1859 1739 1709 1595 1646 1838 1889 1953 1735 1557 1498 1498 1508 1727
2090 1727 1888 1669 1549 1536 1637 1872 2184 2331 2126 1973 1874 1953 2182 2259 2099 1973 1882 1724 1630 1762 1778 1918 1933 1852 1700 1603
2083 1603 1618 1629 1692 1736 1747 1642 1554 1592 1866 1960 2093 1954 1665 1618 1780 1910 2029 2102 1858 1641 1540 1618 1697 1701 1836 1741 1564 1589
2077 1589 1682 1793 1833 1715 1689 1638 1649 1664 1601 1852 1984 1878 1744 1603 1515 1455 1327 1299 1324 1228 1202 1116 1027 1026 1214 1233 1155 956 908 1191
2069 1191 1383 1509 1636 1450 1520 1580 1451 1266 1302 1470 1557 1689 1489 1194 1129 1039 1190 1220 1279 1159 1029 950 914 914 870 856 874 860
2062 860 901 943 1025 909 994 1001 964 899 825 737 699 785 963 978 800 859 853 591 631 696 781 853 735 661 675 753 849 879 769 604 624 680
2055 680 741 719 646 495 395 357 413 555 561 540 417 214 308 325 368 395 357 384 443 480 436 468 550 689 723 512 455 441 418 556 494
2047 494 464 478 527 438 313 245 244 264 208 289 289 246 207 172 127 196 269 248 209 198 278 376 359 366 312 372 313 312 362 224 187 325 240 233 205 173
2038A73RJ23p3L8n4O8M2j02M2j2j5l8N2k8k5J23q1o8J8J59Nq5j14j7RP9k4j26J6L2O0l8Jk3
2030A26J27Q7r2l2J00j1Mq2QJ18M0m8m2%O0j08m7j3O1Q9j2q8l9Pk8J02O0k7J8L1nj5q1j82
2022H6M8J20mK8lj7J41k6k8k1p8k1M1l6R2j9J8j2k5q2O4N9n7K4pn6J08J26p7J1K6J6j3n9p3
2013B94j9jN0n4n3J1QJ16O3j3j78N6Q7j0l8Rj09j61n8J74J80N7j14p8m6J6o2R7m8j7J56rr9
2005B07J6K5P5n2K9P6l8l3mp6k0L8J23KK2l0mr3m0M3j4j06m2j00K0N8j01j64J65K03LN1L4
1997B73j22K8r4j04K3L2R6P5K4m3%K2L2oo8l6K4O0L3%j57o4Q7rm8L1K0oN4J6j3j1m0j07P2
1988G4O8K4n0k1l1M4L6N8O3j02O8j05j11QJ50Q5P6j00r6m5O2N7J6J9p1j19Jl0P5M0M%m1j3
1980I3N8N4j9N2Q0k7nQ2j9j10O8O6n4j06r8JJ20O7O0p6j1m3j29P9J01J40n4n9j23P3j9J6O9
$$ plain form
2038 173 182 305 232 270 216 284 326 224 266 254 239 201 253 225 200 323 242 174 192 351 356 271 157 140 149 228 204 78 94 126 186 148 149 126
2030 126 253 340 248 216 316 305 309 227 235 353 393 345 303 303 363 255 208 195 256 345 333 245 206 213 185 287 347 320 338 369 364 349 268 86
2022 86 134 254 250 278 275 258 399 373 345 324 246 225 266 230 322 303 321 309 284 202 266 325 268 292 285 229 337 463 386 397 423 439 426 367 294
2013 294 275 274 324 270 217 228 236 352 415 402 224 280 367 357 319 328 219 58 0 174 354 411 297 219 173 189 127 224 176 159 315 306 207
2005 207 223 248 323 271 300 376 338 305 301 225 205 243 366 368 390 360 356 263 223 266 252 146 104 4 24 82 -19 -183 -18 185 188 239 273
1997 273 151 179 85 -19 4 36 132 207 231 188 188 210 242 236 168 132 156 216 249 249 92 28 115 106 58 89 109 103 157 173 160 149 109 2 74
1988 74 142 166 116 95 64 108 144 202 265 163 231 126 15 23 173 258 334 234 138 93 155 212 228 247 176 57 58 28 103 143 147 147 106 93
1980 93 151 205 186 238 318 291 286 368 349 239 307 373 319 213 115 116 236 303 363 287 276 233 104 183 284 424 370 311 188 261 242 258 327
1972C27o3MQ7m6j6J9Mj09j7K5k3M4O0k7J9J15j54j03J36q8j39O3J91k5J4J3o6M1L5p3K3K2
1964B93j60q2Q3M1%L1J4r5J13P1k9o0r1j2JK6lp3O5R8p1m1ll1J9j8N8kR4K2N1j10p3J25m0
1956B11k3N2j04m2n4m3R7j33MN5LLL0Q8M7n7j52J17J51Nq8m4k9kL5j4K1J6p9NJ7J10j2j17
1947G4J09l7m6M7pJ09l1j8r9J3l8j13M9R4R6j26j2N1J7n8r6J19JK8J9Q1j76JJ29l2o5l0J01
1939A54p4K8Q7k1J7j58n2J2J51p7j03R1O1mO1o8M5m4j05K0O5K5r2N6Qo9Nll0J01J8q9l9N3
1931C0l6o6KQ7R7J9j5pl1m1k2QM0J0Q5j20J0O2%ok6p0K3M2m1j33J15J04l1j8k9J3N6p7M3O6
1922A43kr4k03R9J22m8r5N4l1m3o9rJ32J07j3Qj03m0K7N6J0q4l7K5P1p8P1kM7L6J06j6P9m8
1914A78j67P1oK3p0j38Q2J31j7Ml8k0m3L7L9K4j1q6r6J78Q5q0M2l4j02nN1J26oj3p7j06m8
$$ plain form
1972 327 264 268 355 309 293 312 316 207 190 215 192 236 296 269 288 403 249 146 282 194 55 118 309 284 298 311 245 286 321 248 271 293
1964 293 133 51 134 175 175 206 220 125 238 309 280 220 129 117 118 144 141 68 133 231 160 119 116 85 104 86 144 142 236 258 309 199 126 251 211
1956 211 188 240 136 94 40 -3 94 -39 -35 20 23 26 56 144 191 134 -18 99 250 255 167 123 94 92 127 113 134 150 71 76 93 203 191 74
1947 74 183 146 100 147 140 249 218 200 101 114 76 -37 12 106 202 76 64 115 132 74 -22 97 98 126 145 226 50 51 180 148 83 53 154
1939 154 80 108 195 174 191 33 -19 -7 144 67 -36 55 116 112 173 105 150 106 1 21 86 111 19 75 83 14 19 16 -14 87 105 16 -23 30
1931 30 -6 -72 -70 17 114 133 118 111 80 39 17 25 65 75 160 40 50 112 112 106 80 10 33 75 34 -99 16 120 89 71 42 55 111 34 77 143
1922 143 141 47 -156 -57 65 17 -78 -24 -55 -98 -167 -176 -44 63 50 58 -45 -85 -58 -2 8 -76 -113 -88 -17 -95 -24 -26 21 57 163 147 226 178
1914 178 11 82 76 99 29 -109 -27 104 87 91 53 33 -10 27 66 90 79 -7 -103 75 160 80 122 88 -14 -19 32 158 152 139 62 -44 -92
1906i2M1N8Q1O8k3q0j10J2O2N9r3RP2n6N0N7k1l4r1qK9m3P1N3k6J2L6P1r3K5o3M3M2o5P3J3
1897A39k6n9o6J13J09ok8o0M4j0n0k6K4J13M5J23J8L9o1q1P4O9R3l5R0j3Q0R0K51K67N17N19
1889B296O79P32M23N1j09l08J12L13N70N97J7j08q1J7J02P0L59P02J051Q47O9j006j702j855
1883C838j493r09l77k31o5j11j43j07r4n7ln1j39R0K4j02mN3K4kJ1p6l5J41K8j40J5Kk2kN0
1876A13r2J7j4L5J19m0m3NM1m6Pm9j42m1J36N6K9J95r3q8J5K5mLk1m7K4N6n0j17l3j2P4k3
1867eJ1P9K0j10R0L9n1J7l5k6loM4q%L1K8J5m1P6J1n9k9m0M5K3jO0n1j2j27O1l5L6k6P6K4
1858A21o0K2j2J2l7k5L0rj7k7K5Qj16r4N6M7OJ58N4K1op5O0k6n6P5l6p4J21J87P7j40QO2J7
1850C57l2j50q5r1j5n4J56M6j07J39l6N2p7q1n3M5J69k3mM7j6L0L9q4kO8j06Ok0PN0K2J5k22
$$ plain form
1906 -92 -51 7 88 156 133 53 -57 -45 17 76 -17 -8 64 8 58 115 94 60 -31 -39 -10 -53 18 71 45 57 93 164 71 96 33 76 118 53 126 139
1897 139 113 54 -12 101 210 204 176 116 160 150 100 74 98 211 256 379 397 436 375 294 368 437 530 495 585 572 652 742 993 1260 1777 2296
1889 2296 2975 3707 4130 4181 4072 3764 3876 4189 4759 5356 5373 5265 5184 5201 5303 5373 5732 6434 7485 8332 8401 7395 5693 3838
1883 3838 2345 1436 1059 828 763 652 509 402 308 251 248 197 58 148 172 70 66 119 143 141 152 76 41 182 210 70 85 87 65 63 113
1876 113 21 38 24 59 178 138 95 100 141 95 102 53 -89 -130 6 62 91 286 193 105 120 145 141 144 123 76 100 156 106 -11 -44 -56 18 -5
1867 -5 6 85 105 -5 85 124 73 90 55 29 26 20 64 56 56 87 115 130 89 165 176 117 88 48 93 116 115 175 124 112 -15 46 11 47 21 97 121
1858 121 61 83 71 83 46 21 51 42 25 -2 23 31 -85 -179 -123 -76 -70 88 142 163 157 82 142 116 60 135 99 25 146 333 410 270 278 340 357
1850 357 325 175 90 -1 -16 -70 86 132 25 164 128 180 103 22 -31 14 183 160 156 203 187 217 256 172 170 238 132 138 118 125 175 197 212 -10
1841a0o3J16Q6K9j05j8q6N4%j57J57J26j18RL7k1oo7j6J04Q1m6P2k0q0p4M6m5N4j27j02N3
1834a37J60K2J2N5O9o8j09j53P5R9l2p4L9O9j0j4MOnj1J20K8l1N9n4q2%k1P6P2o4j7Oq2Q0
1825H7n4K3k9m4J29m9qj19J0J06R6J0o1k8l9J02m8K8P1m6l4J02q6m4K7j6OK8m1J15q6k6Qj0
1817H0n5J02j9j17j01MJ00%M0m2L4k8q3N6j6J2p4J07K3l6n6J3K4J49q9j7q1p2M1R5o8k1J77
1809H2Oq3J08j07Q8j0j17P2O9j4K5j20l5j02M0Q5o2J1J08J46pK6j0n9M7o5m4Q9j4n4P8L2j25
1801H4l1N1q1k6p8q6O0j2J53M6j00j04P7L6r6J52J41n9j2L1P4k7N9o5L0o2j08ko7j9N9n5j0
1792d7N8M7%rK9O2m2pP3k4r8l7K9p2l2Q5P3q4J0K8k3J8q4oQ5R1p5j1j0po3K0k4L1P8Pl3ok8
1783BM0Qq0k3p4r7Q1N9O2M9n9JQ7p3O3R8L4l1R6Rj48n5J52m2k33L7N7M3J23j56j45k9J18K8
$$ plain form
1841 -10 -73 43 129 158 53 35 -51 3 3 -154 3 129 11 20 57 36 30 -37 -53 51 132 86 158 138 58 -16 30 -15 39 -88 -190 -137
1834 -137 23 45 57 112 181 113 4 -149 -74 25 -7 -81 -42 27 17 3 7 13 8 -3 117 145 114 173 119 37 37 16 92 164 100 83 89 7 87
1825 87 33 56 27 -17 112 63 55 -64 -54 52 148 158 97 69 30 132 84 112 183 137 103 205 119 75 102 86 92 120 79 194 108 82 90 80
1817 80 25 127 108 -9 -110 -106 -6 -6 34 -8 26 -2 -85 -29 -45 -33 -107 0 23 -13 -69 -56 -32 117 28 11 -70 -142 -101 -6 -74 -95 82
1809 82 88 5 113 6 94 84 -33 39 108 94 119 -1 -36 -138 -98 -13 -75 -64 44 190 183 209 199 140 187 122 78 167 153 99 177 209 84
1801 84 53 104 23 -3 -81 -167 -107 -119 34 80 -20 -124 -47 -11 -107 45 186 127 115 146 220 193 252 187 217 155 47 45 -22 -41 18 -37 -47
1792 -47 11 58 58 49 78 140 98 91 164 140 42 5 34 -38 -70 15 88 4 14 42 19 37 -47 -53 32 123 48 37 27 20 -43 -23 -47 -16 62 69 36 30 2
1783 2 42 50 -30 -53 -127 -224 -143 -84 -22 27 -32 -31 56 -17 46 144 178 147 243 252 104 49 201 159 -74 -37 20 63 186 30 -115 -144 -26 2
1775BjL6N3P1K8r4M6j19m8J00J7p0m6N0j6j7j3O7m5Q1j23o0J89k3O8O4J02q1r3j67r3%J81
1767D6NN4r1Q5k4k9J53j7j00p1NJ4Q4M6n2j38j1J13J06k0j01J20Q6Nq2o3QK0L2l3j05Mm3O2
1758F8L2k0l0N1K5R4n6p0q5LQ1P1r1j5R5L3N5k7Rj27L4K8n2K0R0r9N3J30n2p3p3M6J11p5j00
1750H4nK3J3n2L8k5j4KJ20N8o6M9K8jrmJ21p1l5r0j7m0L6l9J4l4p0K9q0N1K3k5K7K1p5m8J16
1741E3J2m3J48J36o6j29M5P3n7l7O9o2l8k1N6pP9O7j55p7q1J0J25K0q3J21J2j30K3L2M7J6
1733A58n1n0J21N0j68j6L7l9K8m5K5L4m8m0J81o1j79P8O5n5o7J3l3K9k4K8M5J6R1j4o5QOJ5
1725G3J8p9M7nO6J0j47l7J24m2q2M5O9n2M5k3k4J10J0o1j20N9L8L5oN8J2q6J20m2p4OL6j31
1716c0M4k6J07M5l0M9Mr3N7j00L1K5l5q3k1n5K5P7n3j8L1J30n2p1qlJ16J00j44l1m8n0R7N4
$$ plain form
1775 2 1 37 90 161 189 95 141 22 -26 74 91 21 -25 25 9 -8 -21 46 1 82 -41 -101 88 65 133 197 299 218 125 -42 -135 -135 46
1767 46 51 105 14 99 75 46 199 182 82 11 16 30 114 160 108 -30 -41 72 178 158 57 177 263 268 186 123 131 151 183 150 45 49 6 68
1758 68 100 80 50 101 126 220 164 94 9 12 93 164 73 58 153 186 241 214 223 96 130 158 106 126 216 117 170 300 248 175 102 148 259 184 84
1750 84 79 102 115 63 101 76 62 64 184 242 176 225 253 252 243 239 360 289 254 164 147 107 143 104 118 84 14 43 -37 14 37 12 39 60 -15 -63 53
1741 53 65 22 170 306 240 111 156 229 172 135 204 142 104 83 139 132 211 278 123 46 -35 -25 100 120 37 158 170 40 63 95 142 158
1733 158 107 57 178 228 60 44 81 42 70 25 50 84 36 -4 177 116 -63 15 80 25 -42 -29 -62 -33 -57 -29 16 32 123 109 44 52 58 73
1725 73 91 12 59 54 120 130 -17 -54 70 28 -54 -9 60 8 53 30 6 116 126 65 -55 4 42 77 71 129 141 55 175 133 59 65 101 -30
1716 -30 14 -12 95 140 110 159 163 70 127 27 58 83 48 -35 -56 -111 -86 -9 -62 -80 -49 81 29 -42 -50 -53 63 163 19 -12 -60 -110 -13 41
1708D1j3r8O6k3O6mj0O0p4n5J57J3k1n3k4j38O3P9p6N4J7j07P5m2p8NQ3J8J9q7N5P3O7m6L2
1699I4Qr3q0J22N4n0l9o8PL7or7N5RJ10j4j4K4l6Q0k1O8n8ML7N6R2q3j20m0J5o0o0J00j9m6
1691c2J0k9O8J63J2k04n2P8J65m3j94P9N0j4oM5Q1O4k3j71m9Q9m8k0l1L8J13m9r4O2L2Q9L1
1682B10r8O6R3j24n7N1k3M0N9j02J03J2l7Q5l5n8n2k2n0O9j9n7q0M6J31Q5k6j83NJ19m6P0
1675A75M8Q1n6NJ41l6j52R5L34M05j6k36k17j64k1r4n3j58J1P0L5l4P2M7q3N0M3Lj05j39K6
1667G7O2O2J49j27L11M04N99J177N96p29r35o39k65l44j39j47k4k1L9J16O5j4n7o5k0m0Q4
1660A75J07Q4j12l0k9N4L21K42O22J100Q52n95j174p46l17j41j08j5p5o2J1K5o9rNO2P0m9
1654A99p0n7JP1qJ6L7k2L4K86M24L31k43k65k77j15n9qP8J8M6j0j23j2L2R0K7j35P5L8j03
$$ plain form
1708 41 28 -70 -4 -27 39 35 25 85 11 -44 113 126 105 52 28 -110 -47 32 -44 10 27 -80 -5 -47 -125 -120 -37 -19 0 -87 -32 41 108 62 94
1699 94 102 9 -71 51 105 55 16 -52 -45 -8 -14 -111 -56 -47 63 49 35 59 23 103 82 150 92 96 133 189 281 198 78 38 53 -7 -67 33 14 -32
1691 -32 -22 -51 17 180 192 -12 -64 14 179 136 -58 21 71 57 51 96 177 241 218 47 -2 87 39 19 -12 26 139 90 -4 58 90 179 210
1682 210 112 178 271 147 90 141 118 158 217 115 218 230 193 278 243 185 133 111 61 130 111 54 -26 20 151 236 210 27 32 151 105 175
1675 175 223 304 248 253 394 358 206 301 635 1040 1024 788 571 407 386 292 239 81 92 162 197 163 235 282 199 249 292 295 190 51 77
1667 77 139 201 350 223 534 938 1537 2714 3310 2581 1646 1007 742 398 259 112 88 67 106 222 287 273 216 151 131 91 175
1660 175 282 366 254 224 195 249 570 812 1434 2534 3386 2791 1617 871 554 413 305 290 215 153 164 189 120 111 116 178 248 199
1654 199 129 72 73 144 136 152 189 167 201 487 911 1242 999 734 457 342 283 275 353 371 417 407 284 272 304 394 421 286 361 399 296
1646B96n1n7l7Q9j11M5R1rj7M0M0R8j09n8N0K6J6N4m5O3J00q4p9k2J6rp5J20m4M3J16j14Q2
1638D64J0j00K6R4o6r5p3Jm7J34J02L7k5K5K8N5j79J2N1J18K7Q1j39n4J1j33n1o6qR2M4j7
1630C59O0k6r2k9JJ28o5l9j01J3L0N7L6J56N2j36r8k3J3k4l4n4J02J50l0n9j36k4p9j2P1P
1622A74O3Q6O0Kl7n2j21rj8M1n4l2K24q9J6qk9j31p4J83J05P1Llo6n6n3m1p1R0J64n5j41k5
1614A17l1p1n5J11P7J16L9N2o1j73p1N3k6N7P4j2P1j26O5p8m1l2n8J03J01J41J6j81PK3J22
1606C29m6k8j6J1o3L2K4j29k7%Q8N3q3M9J2j9p5q2m9J59j1J36l4k7JJ4P8o3N1Mr3j30k5lo7
1598b9j6lQ7J9O9J8n7l2n5o3J14L3p7oJ03q9J25K6k8l3k3Qj4kj0n2j11O9R5M3Q2o9J6j7r1
1589C0n0K0j6J7O9J4r7L2J24J9j41L3o2M9q8o5o9J61P6M1n6q2j3P8JM0l4r9N1j06PP4jO2M3
$$ plain form
1646 296 245 188 151 240 129 174 265 256 239 279 319 417 308 250 300 326 342 396 351 414 514 430 351 329 345 336 261 381 337 380 496 382 464
1638 464 474 374 400 494 428 333 260 261 214 348 450 487 462 487 515 570 391 403 454 572 599 680 541 487 498 365 314 248 240 332 376 359
1630 359 419 393 301 272 273 401 336 297 196 209 239 296 332 488 540 404 306 283 296 272 238 184 286 436 406 347 211 187 108 96 167 174
1622 174 237 323 383 385 348 296 175 166 148 189 135 103 327 238 254 246 217 86 12 195 300 371 374 371 305 249 196 155 84 174 338 283 142 117
1614 117 86 15 -40 71 148 264 303 355 294 121 50 103 77 134 208 196 267 141 206 128 87 55 -3 100 201 342 358 177 184 207 329
1606 329 283 255 239 250 187 219 243 114 87 87 175 228 145 194 206 187 112 30 -19 140 129 265 231 204 205 219 297 234 285 289 196 66 41 38 -29
1598 -29 -45 -48 39 58 127 145 88 56 1 -62 52 85 8 2 105 16 141 167 139 106 83 91 77 75 65 13 -98 -29 66 109 191 122 138 121 30
1589 30 -20 0 -16 1 70 84 -13 19 143 162 21 54 -8 41 -47 -112 -181 -20 56 97 41 -41 -54 24 25 65 31 -68 -17 -123 -116 -42 -43 19 62
1581F2Jo4O7k8k08M0J24mM4k1n6J02R7p8N4L6J2j14RPj03l8n5j5J07J04Or6Q3j3j90M0L1N1
1572fj03r0J99N4j5m3J1l3J9n4M0n2M7L6qj6K7l2R4J27j04j07N4nj25KJ17p3p1P4J17J65p8
1564A68k6%n9n4K6j3j41l0J82M4M8Mn0r8J3P8Q6M0J9k06%j1J3J07J55o3j9O2J09j4k6J67J01
1556F12J89J56o8n7l5%q4l9o5o3r8L3l1j02j82K3P9k3l1J07j8J74J86K95J67O0J96M97K74
1549B152K8p8j19m2k73l63j78q3j21j6j04k02r6j66j0p6q9L3J1Q3qm8l7jP2L3J04J56J30J70
1542H62J19K63R3Qm3K37O50J967L112J128k320k852j452p03l57j38j29j30J20j0j68j22K5
1536A60N2mk5O5m0j37P0l7J5O3J4n6r9rM1J16O1M7p2j33j22O8R1N9o2R0j17N1K4P5o5J09L2
1528C25j59j16J0K2O5n8p3K9j3j53L0J17J08m5k4O3j12n0L3J64L5RLJ10j8J6j8n4j1K8K1J4
$$ plain form
1581 62 63 -1 66 38 -170 -130 -6 -10 34 13 -43 59 156 78 132 168 180 66 75 82 -21 -59 -114 -129 -22 82 88 -8 75 62 -128 -88 -57 -6
1572 -6 -109 -199 0 54 39 -4 7 -26 -7 -61 -21 -73 -26 10 2 -14 13 -19 75 202 98 -9 45 40 -85 -83 34 -39 -110 -36 81 246 168
1564 168 142 142 83 29 55 42 -99 -129 53 97 145 149 99 1 14 92 178 218 237 31 31 20 33 140 295 232 213 275 384 370 344 511 612
1556 612 801 957 889 832 797 797 713 674 609 546 448 481 450 348 166 189 268 245 214 321 303 477 663 958 1125 1185 1381 1878 2152
1549 2152 2180 2102 1983 1941 1668 1305 1127 1044 923 907 803 601 505 339 329 253 164 197 208 291 283 235 198 197 269 302 406 562 692 862
1542 862 981 1244 1337 1345 1302 1539 2189 4156 7268 8396 6076 3224 1772 1069 712 574 445 315 435 425 257 135 160
1536 160 212 208 183 248 208 71 141 104 119 182 196 140 41 32 73 189 250 297 225 92 -30 38 129 188 126 216 99 150 174 249 184 293 325
1528 325 166 50 60 82 147 89 16 45 32 -121 -91 26 134 89 65 128 16 -34 -1 163 198 207 210 320 302 318 300 246 235 263 284 298
1520B98m6kR4l0PK60M05P14K04n28n06m62j94j56K8J3N9L2j4j23L7k6NJ3J39rj07n0n3on4
1513e8n9J2J38k2j00M5JN1K9nk7Ol7o0O5M9J5R9q3j47n8kP5R9OO4K6n0l8J49j23k08K4j9J44
1504Aj07J16J42p5p7KO8j8P4q6M3K4l9j3Ok9j62O3K4O1L1n5j4J27J22Q1j49n4k8M2N0o8M0
1496A43M2j2m2j48M3P9PJ31n2q3M1JJ1O0o0j0m2n4p4Q2O7P5k7j49J20k8k7J0K4p3mJ14j9J6
1488A62j9L1J44q9j7N4J4O1NOPq2Q5P8Nj2J7J20mJ4K8OMN4j10J20J67N1K20J09K56M94M75
1480B454O67P92J614L196P473J7880K6023M956k1821k0584j0578m806k469j282p88l72o08
1476A747l60k82j76j79J4m3r1r4m9o7O2j27Pp3J9P0k1p0j9q8P0M9J06j09j41R8P6j06j6PJ5
1468B29j3J24J14l5j62M0K0P1n8J4L6qPq1o0l8P1m9o0J27j39M6K9J8l0m3J7J20q1l4L4n9J8
$$ plain form
1520 298 252 250 344 314 321 581 986 1700 1904 1376 870 408 214 58 86 99 158 190 176 53 90 64 69 82 221 212 105 55 2 -4 -58
1513 -58 -117 -105 33 11 -89 -44 -43 8 37 32 5 11 -26 -86 -21 28 43 142 59 -88 -146 -148 -73 26 32 96 122 72 34 183 60 -148 -124 -143 1
1504 1 -106 10 152 77 0 2 70 52 126 40 83 107 68 55 61 32 -130 -67 -43 18 49 -6 -20 107 229 310 161 107 79 121 171 103 143
1496 143 185 173 131 -17 26 105 112 243 191 108 149 150 161 221 161 151 109 55 -19 63 130 205 178 29 149 121 94 104 128 55 51 165 146 162
1488 162 143 174 318 229 212 266 280 341 346 352 359 277 362 440 445 433 450 570 566 580 608 614 618 672 562 682 849 900 1120 1229 1485 1979 2454
1480 2454 3121 3913 5527 8723 16196 34076 60099 65055 43234 22650 12072 7266 4797 3515 2727 2355 1747
1476 1747 1387 1105 929 750 764 721 630 536 487 420 482 355 362 289 308 378 357 287 268 180 250 299 405 296 155 253 329 223 207 214 229
1468 229 216 340 454 419 257 297 317 388 330 344 380 372 379 298 238 200 271 222 162 289 150 196 225 243 213 170 187 307 226 192 226 167 185
1460A85j2j13J03N2L0o1j38j0N6N8j45J5J42l8m5k6N7j2k3J68k7j14k8r7Q6J27L3p1k9M2j1
1452A54l8J03q7n8J75n7j26rK3L6p0J4j6j89J04O8q3J07l1j39MJ90k8j02m2J95O1n7q9N5P4
1445A42p7nm2Jo5N2Q0Q4q3j45o8R7rMo5j6N6j0K2J33lr4j21J01J40O0p9L4l5K1j6p3j1L7m3
1436DN9o7N1M9o1L3k2j6omn4n0N5N5r5pQ6j52P0J9M3JMj09J74K2o8p0L7J23O1j01j01J5ln2
1427g7L2N2M6j07j7J18M0K2o2l4lL7p6O9J18j03l8R1N8q7K4n8J7k9m2K2L3J00k9Pm7o6k6j
1419a6oJ4R4j00R3n0k6k4L2k8O8K3l5p9P5j6J9L7jO4pJ7k1q3qL1q5K1M7M8P7k4m4K7l8j12
1410a6R9k1K6N2K2l9J9Nm7m2k0J17m8r3j2m6Q3l2M7o5n8K3R2R4J1O5J23j1j11j61lL1p9L4
1402C9P2o4p7M3LJ2J39m5J3p0j08m4Q7N9l6N0l1k5j5n0m4m7J23M5j8l8K2j4J74J4k0L1o5o2
$$ plain form
1460 185 173 60 163 215 245 184 46 36 92 150 5 20 162 124 79 53 110 98 75 243 216 102 74 -23 63 190 223 152 123 165 154
1452 154 116 219 132 74 249 192 66 57 80 116 46 60 44 -145 -41 27 -56 51 20 -119 -115 75 47 -55 -97 98 159 102 13 68 142
1445 142 65 60 18 19 -46 6 86 170 87 -58 -126 -29 -38 -34 -99 -115 -59 -69 -47 86 83 -11 -132 -31 109 169 90 124 89 110 94 21 10 47 4
1436 4 63 -4 47 96 35 68 46 30 24 20 -34 -84 -29 26 -69 -76 10 -142 -72 -53 -10 -9 -5 -114 60 82 14 -56 -19 104 165 64 -37 -22 -25 -77
1427 -77 -45 7 53 -54 -71 47 87 109 47 13 10 47 -29 40 158 55 17 108 166 79 103 45 62 33 -9 13 46 146 117 124 77 11 -15 -16
1419 -16 -22 -8 86 -14 79 29 3 -21 11 -17 51 74 39 -40 35 19 38 75 74 138 131 148 127 44 36 67 -18 3 50 98 175 151 107 134 96 -16
1410 -16 83 62 88 140 162 123 142 147 100 58 38 155 107 14 2 -44 39 7 54 -11 -69 -46 46 140 151 216 339 328 217 56 53 84 5 39
1402 39 111 47 -30 13 16 28 167 122 135 65 -43 -87 0 59 23 73 42 17 2 -48 -92 -139 -16 29 11 -27 -5 -19 155 169 149 180 115 53
1394E3nJ5mr4M4O7j37j15J07L7Q1K1l4n1P9J25l5k1R4j09jJ04j03j7O1jNl6p8n2k5K3o6k4
1385i2J01PK2J32Qj7Ml7ljN9R2m6k3j16m6j07M4oL9J32j00J5Q8l2o5K7k6N6PQJ69n7L7k7K8
1377B74N2Mp8R2l6q3j36R1l0j17r2J29N5jJ51j22j80pN1M6o3M9L1K56j49l1J83o7l9p6K7J3
1369A97j32m3L4L3p1Rj2%M2J09j21o4O1J56k4ooqk9K0j14O5P8m0j31N4j1r9k5N2o4P5k0O3
1360B8k4M7k2p1l9M5k5L0Q4l3o1L6Q0l8j13lKR1oL7nm5L4N1q0n8M8P1O0Pj09n2J00l8LM8m8
1351C2J7L9p4n2Q5M7M4J3k13OR1N4P9L9J1p8Q4R4M2M9r1j19N4K3o0j83M6j03M5Q5n8J75j6
1343B07O5J6p1k1J8R1J28J25p6rO5Q6K30K35J91R3k32l69j02j21j05o4n2J0Qj17mO8N1j43
1336B01k4kK2J29K90L70L77J22j65j96k67o8M7K25K80l7k32l55k59o6j26r4P4K0j5N8L9Q1
$$ plain form
1394 53 48 63 59 -35 9 76 -61 -176 -69 -32 49 70 36 -15 64 189 154 133 227 118 117 221 118 101 162 161 166 130 52 0 -25 -2 -68 -92
1385 -92 9 16 38 170 178 161 165 128 125 124 183 275 229 206 90 44 -63 -19 -25 14 146 46 61 149 117 52 79 53 109 116 124 293 236 273 246 274
1377 274 326 330 252 344 308 225 89 180 150 33 -59 70 125 124 275 153 -27 -34 17 63 0 49 80 336 187 156 339 272 233 157 184 197
1369 197 65 22 56 89 18 27 15 15 57 166 45 -19 42 198 174 168 162 154 125 145 31 96 174 134 3 57 46 -53 -78 -26 -90 -15 -35 28
1360 28 4 51 29 -42 -81 -36 -61 -31 53 20 -41 -5 75 37 -76 -79 -77 14 8 45 40 -5 29 80 0 -58 -10 61 121 128 19 -33 67 29 32 80 32
1351 32 49 88 14 -38 47 94 138 151 -62 -56 35 89 168 207 218 140 224 318 360 409 318 199 253 276 216 33 79 -24 21 106 48 223 207
1343 207 272 288 217 196 214 305 433 558 482 473 538 624 854 1089 1280 1373 1141 772 670 549 444 380 328 338 346 229 225 293 344 201
1336 201 177 175 197 326 616 986 1363 1485 1320 1124 857 789 836 1061 1341 1304 1072 717 458 392 266 172 246 266 251 309 348 429
1329D29j40o4P4Q6j2J58K31K77L29n3l91r8j44p1M7J6r3j37m3j01p2m8m3n8J09K3j53J22M7
1322B27N4q7o4K3L9O0J16O8J4Q1r8r0j97m4M3L1K8J24o0j34nQ1KJ6j5O9k4q6l6j5r5j0J77
1314A93N0j25M2m1n6J51N8j70k2O3K6j3m1n8k4n2j6J56K1J28m8k9Jn5Qp0Q6j67L5qM4j7m2
1306Hm1L3N3P2L9K7j28l6l3nk01R1J21m6j1M2rR4j5R7p0J23L9p8k7J18j72o4J26J15j42rM2
1298A53L3j19kK7N6N0P2J02k0j10j19p5J5k3J77k6j29J7n6KN0N9L9N0R3J2m5q6KL5J45J55
1290E34K88L64K38J66l6j11k33l62k69j44j08j6l7j47oJ42N2m8R1No5P9J07QN1J61K27L50
1283A281N70P54P67M94Nm34n86p53o44m79m21j34Q9j46j06J1j7P8O1j37O6J83L2K02l2M5M45
1277A194N11Q19R58J017O74O8l15o91r90r70o61m83k86o9r9o7p0m3p7r3l9J90J38q2J27J06
$$ plain form
1329 429 289 225 299 385 373 531 762 1039 1368 1315 924 826 682 611 658 674 581 444 401 300 228 180 137 79 188 211 58 180 227
1322 227 281 194 130 153 192 252 368 436 450 531 433 343 146 102 145 176 204 328 268 134 129 210 212 228 213 282 258 172 136 121 26 16 193
1314 193 243 118 160 119 63 214 272 102 80 143 169 156 115 57 33 -19 -35 121 142 270 222 193 194 139 147 77 163 -4 31 23 67 50 8
1306 8 -33 0 53 125 164 191 63 27 -6 -11 -212 -121 0 -46 -57 -15 -24 70 55 152 82 205 244 166 139 257 85 21 147 262 120 111 153
1298 153 186 67 65 92 148 198 270 372 352 242 123 48 63 40 217 191 62 79 23 25 75 134 173 223 316 328 283 197 199 234 379 534
1290 534 822 1186 1424 1590 1554 1443 1210 848 579 435 327 311 274 127 121 263 315 267 358 363 298 377 484 492 543 704 931 1281
1283 1281 1851 2605 3372 3866 3871 3437 2851 2098 1454 975 554 420 509 363 257 268 251 329 390 253 319 502 534 736 704 749 1194
1277 1194 1705 2524 3482 4499 5173 5241 4926 4235 3245 2275 1614 1131 845 776 677 610 540 497 420 327 288 478 616 534 661 767
1270G67J42J27M05N75O26O95P42K24r1m34p00o76m55m45k58j52k77k03j00o7j10K5Q5r3n7
1264B95J8P4L6J28K1K11J78L09M48L53J29J86O7j66j85l20m06l46k70p7r0k4k72q9L1o9L9
1257B09K4q6J3J39J0q1K7J14P9M8J26J19J41O2J20N5N8j07j34j24k04j23p0mm4N8J5k8n4J4
1250C72M1M3J51N3R1p9j4ql9P6j02j24Q0J67J24m1K0r8o0J9K9RJ20J25K89J28M6N2l4p3j60
1243A203q9Kk9p8K4J9m4q3r5kj27L7J46P9j2J60p8P3J20N1P0L5Q2K9r0N2Q3K8m4O1j67k7o8
1234A321j05J9kQ7K4M2q0j03q3k24Q2M0q7m3k3l4rO9J41JL6l6J09J02N2M5N9Q8MP1j03j97
1227A263o0j04m5l6j6k8q5J5O7j4M3l7J30J05m2K7J63P4m7J3Q3J38J48L0J71K09J74J81L24
1220B844M94P18J121J583J826J655J076J70p81j523j544j320r34o62l74r1o6n0J09J91K41
$$ plain form
1270 767 909 1036 1441 2016 2642 3337 4079 4303 4212 3778 3078 2402 1947 1502 1244 1092 815 612 512 445 335 360 445 352 295
1264 295 313 387 423 551 572 783 961 1270 1718 2071 2200 2386 2453 2287 2102 1782 1376 1030 760 683 593 569 297 208 239 170 209
1257 209 233 147 160 299 309 228 255 369 448 496 622 741 882 944 1064 1119 1177 1070 936 812 608 485 415 411 367 425 440 412 358 372
1250 372 413 456 607 660 751 672 658 650 611 687 585 461 541 708 832 791 811 713 653 672 701 710 830 955 1244 1372 1418 1470 1436 1363 1203
1243 1203 1114 1116 1087 1009 1033 1052 1008 925 830 828 701 738 884 963 951 1111 1033 1106 1226 1277 1347 1382 1464 1493 1403 1455 1538 1566 1522 1583 1416 1389 1321
1234 1321 1216 1235 1233 1320 1344 1386 1306 1203 1120 896 978 1018 931 888 865 831 822 891 1032 1033 1069 1033 1142 1244 1296 1341 1400 1488 1492 1563 1460 1263
1227 1263 1203 1099 1054 1018 1002 974 889 904 971 957 1000 963 1093 1198 1156 1183 1346 1420 1373 1386 1469 1607 1755 1785 1956 2165 2339 2520 2844
1220 2844 3338 4056 5177 6760 8586 10241 11317 11487 10706 9183 7639 6319 5385 4723 4349 4258 4192 4142 4251 4442 4683
1214D683M60N30O68Q90J013J149J507K096L599O073R039J1637J1660Q528K194m734r625j1100
1210D0267r809p195m502k740j591r71m86k36k7M05O52R36J519J736K139K569L315M789P757
1205C8527J3092K0722K8345L0993K5433J1027p604k2806k9796k8517k1702j3930q321m977
1202C0486k986j708j097p69m78M0P40J281J841K190K682L558N440Q874J5081K4745L5955M2145
1198A68020L7871K1624l173k6907m0466m1861l3534k2461j3471p760m669k936k069j811j321
1194B5076r38m75JM62J074J686K298L715O049J0202J6267K4389L0895L0001K0098K666j6587
1190A56879k9120l2495k7903j9504j1981p006m081k832j864j560j442j313j112o32j73J11
1186A3972N49P54J241K122L443N588Q613J1489J2121Q968K879m636j0499j3018j1954q842
$$ plain form
1214 4683 5143 5673 6341 7231 8244 9393 10900 12996 16595 22668 31707 43344 55004 63532 65726 60992 51367 40267
1210 40267 30458 23263 18761 16021 14430 13459 12973 12737 12710 13115 13767 14703 16222 17958 20097 22666 25981 30770 38527
1205 38527 51619 72341 100686 131679 157112 168139 160535 137729 107933 79416 57714 43784 35463 30486
1202 30486 27500 25792 24695 23926 23448 23488 24228 25509 27350 29540 32222 35780 41220 50094 65175 89920 125875 168020
1198 168020 205891 227515 224342 197435 156969 115108 81574 59113 45642 37882 33213 30277 28208 26397 25076
1194 25076 24138 23663 23664 24126 25200 26886 29184 32899 38948 49150 65417 89806 120701 150702 170800 173466 156879
1190 156879 127759 95264 67361 47857 35876 28870 24789 21957 20093 18533 17091 15778 14666 14034 13861 13972
1186 13972 14521 15275 16516 18638 22081 27669 36282 47771 59892 68860 71739 67103 56604 43586 31632 22790
1182B2790n721l559k189j339j134q16o38n17m07l45j17j52j94M5J29J77M42O88J302J735J987
1177A2167J536P04o58j545k091j990j701j152p23n31m88l37K9q4j29j57k32j40j58J3j15j5
1171B203pJ06P3k5J94J8kQ9N6Qj1j52j68oq7n7P7J34M0K5o5j40j33R5J29m8l7K59R8l7K9J77
1164B835J29J15J19J46j1r5m7R2M6J82K26O5R0J31J13J48J87K53K36K82J94K02K37K09L03
1157F387K82K71M44M09O14P15R35J122J255J262J066R65J020R24Q40R98O76Q24J282N72j13
1152B2750k44q26j123j053p59q69k41J21K71L96Q42J158J434J791K012K195K455K673L003
1148C5986M396N539N689O849R481J1466J2565J6173K3055K5316K4073L0019L2923K5699K2368
1144B91597J9486J3935J0222l480j8413k3569k5726k1576j3453j3585j2447n658J434R036
$$ plain form
1182 22790 17069 13510 11321 9982 8848 8032 7394 6877 6470 6125 6008 5856 5662 5707 5836 6013 6455 7143 8445 10180 12167
1177 12167 13703 14407 13749 12204 10113 8123 6422 5270 4547 4016 3528 3191 3220 3136 3007 2850 2618 2478 2320 2333 2218 2203
1171 2203 2196 2302 2375 2350 2544 2562 2560 2649 2705 2713 2702 2550 2382 2376 2289 2232 2309 2443 2483 2508 2443 2303 2170 2265 2394 2346 2309 2568 2666 2629 2658 2835
1164 2835 2964 3079 3198 3344 3333 3238 3191 3283 3329 3511 3737 3802 3892 4023 4136 4284 4471 4724 4960 5242 5436 5638 5875 6084 6387
1157 6387 6669 6940 7384 7793 8407 9122 10057 11179 12434 13696 14762 15727 16747 17671 18511 19509 20185 21009 22291 22863 22750
1152 22750 22506 21680 20557 19504 18745 17876 17635 17756 18027 18423 19265 20423 21857 23648 25660 27855 30310 32983 35986
1148 35986 40382 45921 51610 58459 67940 79406 91971 108144 131199 156515 180588 210607 243530 269229 291597
1144 291597 311083 325018 335240 331760 313347 289778 264052 242476 229023 215438 202991 197333 198767 207803
1141B07803J4168J3855J9208K6011K8656L3302L5197L2496M0776M5808L9385L3313J0712j6013
1137E64677k6527l7782m7840m5837m1247m0031l4036k9208k5938j7846j1212n997K301O269
1134B09746Q561J2106J4296K0911K8261K8158K5865J8292P765j751j1879k3503l5316m0112
1130B61400m0044l3174k5164k1683j8538j4412j3038j2415j0255o966m231j938r58n82r51
1127E7051q59J306L501M498N895P276P343P853P765O575N190K409l24l206p194j0108j1147
1122H3824j1510j1263r417o779m724k940j560q02p15r61n54K72J666L450L924M191N564N615
1118E7281M099L232N13l890o963p485o319n068m620n101n230m145k686j792j096p95o23m16
1114H896m84m79l31l29k69j81k17k85q7J44K28J68J51l61p40p13m54l86l26k32j37%M4J3p2
$$ plain form
1141 207803 221971 235826 255034 281045 309701 343003 378200 410696 451472 497280 536665 569978 580690 564677
1137 564677 538150 500368 452528 406691 365444 325413 291377 262169 236231 218385 207173 201176 203477 209746
1134 209746 218307 230413 244709 265620 293881 322039 347904 366196 373961 372210 360331 336828 301512 261400
1130 261400 221356 188182 163018 141335 122797 108385 95347 82932 72677 65711 61480 59542 58584 58002 57051
1127 57051 56192 57498 60999 65497 71392 78668 86011 93864 101629 108204 113394 115803 115479 112273 105079 94971 83824
1122 83824 72314 61051 51634 44855 40131 37191 35631 34829 34114 33153 32599 32871 34537 37987 41911 46102 51666 57281
1118 57281 61380 64612 65125 61235 54272 46787 40468 35400 30780 25679 20449 16304 13618 11826 10730 9935 9312 8896
1114 8896 8412 7933 7602 7273 7004 6823 6606 6321 6234 6378 6606 6774 6925 6564 5824 5111 4657 4271 3945 3713 3576 3576 3620 3633 3561
1108C561k91j13M0m8p9j22p0J64J9O1l4Q6L1J76M89N51O36N24N5m29n92o80o40m31l66j90
1101B308q8j63k10r4n7o3k4j01j05J5J10p6K3J31k3J5j3J13RJ39M52N35M60R4m20o26n83l09
1094A449k03k2jn5n0j4q5q7P9P8no8J8M8mj73N2oL0PK2k7l5r0J4m4L8%M7k5K1o5l8p4O8NJ31
1085I36K3M4m6M7n6n6J8M4J21j26J51J60K1J57J16J38P1O1J74J61K07J86J69J30k65j20k0
1079B446n3r0j53j96O5NJ9J20N6J42J27O7K06K52K63R2K54L35O0K01K3o0j48k12l15k81k45
1072B980j91j67n6n6j92J0N1Q3K7O3lJ46K62K13J09M6Q6M4j18r2o6k6j70j41j73q6j62K5J4
1065B460N3o2l7r9L5j4N9Q3J47K7P6O9J26P0J86J40J30K88K47L57K03Qp0l1M0o3j7n6j41R3
1058D307J58J49n1O5L35J29N6K45L33K65K37K67L34M93M39M37M04M42N57R84J151N42P9L52
$$ plain form
1108 3561 3270 3157 3197 3149 3070 2948 2878 3042 3061 3122 3088 3174 3205 3381 3870 4421 5057 5581 5636 5207 4615 3935 3295 2864 2498 2308
1101 2308 2220 2057 1847 1753 1696 1633 1609 1508 1403 1418 1528 1452 1475 1606 1583 1598 1585 1698 1707 1846 2298 2833 3293 3387 2967 2341 1758 1449
1094 1449 1246 1224 1223 1168 1118 1104 1019 932 1011 1089 1084 1016 1034 1082 1078 905 957 951 981 988 1010 983 948 858 872 828 866 866 913 888 909 844 806 732 800 805 936
1085 936 959 1003 957 1004 948 892 910 954 1075 949 1100 1260 1281 1438 1554 1692 1763 1824 1998 2159 2366 2552 2721 2851 2586 2466 2446
1079 2446 2393 2303 2150 1954 2019 2024 2043 2163 2219 2361 2488 2555 2761 3013 3276 3368 3622 3957 4017 4218 4241 4181 4033 3821 3506 3225 2980
1072 2980 2789 2622 2566 2510 2318 2328 2379 2462 2489 2552 2549 2695 2957 3170 3279 3325 3411 3455 3337 3245 3179 3153 2983 2842 2669 2583 2421 2446 2460
1065 2460 2513 2451 2414 2315 2350 2336 2395 2478 2625 2652 2728 2797 2923 2993 3179 3319 3449 3737 3984 4341 4544 4552 4482 4451 4491 4428 4411 4355 4214 4307
1058 4307 4465 4614 4563 4628 4963 5092 5148 5393 5726 5991 6228 6495 6829 7322 7761 8198 8602 9044 9601 10585 11736 12278 12357 12709
1052A2709O59R66J188J678K153K210K303K971M265N726O410P252J0296J6858K9562N3202R1379
1048B51787J25336R3626j9562j07647j10028p5344m5013k6847j5893r765o588n079l790k269
1044D2924n87J240K712L820M874O320O784O094P407J0736J4977J9849K7810M5115P9060J32627
1040D11762J77717J54926N1175o9968j38855j41315j20342r2508o1780l8286k2569j2376p782
1037H9799r730j1575r392n967l694k160j458o40P6J340K690M350N531P797J2445K1655L8243
1033A39310O9452J15923J40004O4711p3990j36835j12428p0621m1745k5300j5669r985o935
1030C5892n702m937l929k551j780j230j420j597j564j116r74j045j082o22l95o02m98l92k10
1025D246j94o7q5l7o7j84j43j52r4j77q3l8l6m9o1k12j27l4OPR4mP8j58j97j05j37p7O5j48
$$ plain form
1052 12709 13368 14334 15522 17200 19353 21563 23866 26837 31102 36828 43238 50490 60786 77644 107206 160408 251787
1048 251787 377123 470749 451187 343540 233512 158168 113155 86308 70415 60650 54062 48983 45193 42924
1044 42924 42337 43577 46289 50109 54983 61303 68087 74181 81588 92324 107301 127150 154960 200075 279135 411762
1040 411762 589479 744405 795580 725612 586757 445442 325100 232592 170812 132526 109957 97581 89799
1037 89799 80069 68494 59102 53135 49441 47281 45823 45183 45259 46599 49289 53639 59170 66967 79412 101067 139310
1033 139310 208762 324685 464689 529400 455410 318575 206147 135526 93781 68481 52812 42827 35892
1030 35892 30190 25253 21324 18773 16993 15763 14343 12746 11182 10066 9092 8047 6965 6343 5948 5346 4848 4456 4246
1025 4246 4052 3985 3900 3863 3796 3612 3469 3317 3223 3046 2963 2925 2889 2840 2779 2567 2440 2406 2412 2419 2513 2509 2587 2429 2232 2127 1990 1913 1978 1830
1018A830J1j54N1L4j18m6Q4q8j5n2j3j80n1J04K1o0%j47P7RO4nkL3Q7q0K9p0J08o2K0J16m1
1010A494k77m1n4L9J37n4o8l7N2rL8n0r6kp6L5k9L9Lj2j4J32o7J5J20R3p7K5m7j21l4Q8P8
1002A223N9J28J14J17K34J87J47L49Q41J449K212K256K093J848O04j255j862k124k262k088
997D270j288o13l19k35l3o5q8m8j17l8J16m9J42J03k0K1o9j02m0o5Ko7j50o2O3n3K9j8j32
990A075J01J43P1l3J76K0mP0P5N7LO1J11J26K7J69j7m7O9j30j00K4J9O2M9J17J93L62N11L25
982C685n4l97m33l63l32l7k2R7qQ4Q7r9n7m6qk4K0J58K04P8moM5Q3J12J46M34N52P59P45K21
975E620l80o92o60n99m74j94k93r0k0mk3Q0q5J19m6J52o8Rl9k7L5m9l2P3QJ88K26L49M31N31
967D046L28k06n82m76l99k17j39N3q2m2K8O4M8l0j16q4o4M1L9N0k2P0r3L6j4J2M6O6J14QR8
$$ plain form
1018 1830 1841 1687 1738 1772 1654 1608 1692 1604 1589 1537 1524 1344 1293 1397 1418 1358 1358 1211 1288 1297 1361 1356 1354 1387 1474 1394 1423 1353 1461 1399 1419 1535 1494
1010 1494 1217 1176 1122 1161 1298 1244 1176 1139 1191 1182 1220 1170 1074 1072 996 1031 1002 1041 1044 1032 1018 1150 1083 1098 1218 1311 1234 1259 1212 1091 1057 1145 1223
1002 1223 1282 1410 1524 1641 1875 2062 2209 2558 3399 4848 7060 9316 11409 13257 13861 12606 10744 8620 6358 4270
997 4270 2982 2369 2050 1815 1782 1717 1629 1581 1464 1426 1542 1493 1635 1738 1718 1739 1670 1568 1528 1463 1465 1398 1248 1186 1249 1196 1225 1207 1075
990 1075 1176 1319 1390 1357 1533 1553 1549 1619 1694 1751 1754 1815 1926 2052 2079 2248 2231 2184 2253 2123 2023 2047 2066 2128 2177 2294 2487 2849 3360 3685
982 3685 3631 3234 2801 2438 2106 2069 2047 2144 2136 2220 2307 2208 2151 2105 2097 2073 2093 2251 2455 2533 2529 2523 2568 2651 2763 2909 3343 3895 4654 5399 5620
975 5620 5240 4548 3888 3289 2815 2621 2328 2238 2218 2214 2191 2271 2186 2305 2259 2411 2343 2352 2313 2286 2321 2272 2240 2313 2321 2509 2735 3084 3515 4046
967 4046 4374 4168 3586 3110 2711 2494 2355 2408 2326 2284 2312 2376 2424 2394 2278 2194 2130 2171 2210 2260 2238 2308 2215 2251 2237 2249 2295 2361 2475 2483 2581
960B581L1J11K26R5J88K0J19R6J67L10J47K43M95L44J98R9j2p3l6o9M9J29K17K07L14K37N1
953F484j01m2k48k1n4K1n6J39K32K44J93L02J07k9K5K53K97L33M32K78L63M68K87J69M31L73
947A0880L58M11L76M96N51O96P28O24N89Q43R20J218J066J099J008Q09Q41P62R02J112J483
942B7772J979K551L296M413M560L295K030K192L761O825J0236J3190J5815J7152J8232J9884
938A57183K5084L8479O9314J39220K80231M30742M29466L68770L51690J26530k25248l50307
935A841154l79179m50252l93591k37728j22284o3004l4025k1338j7733j5866j5217j5489j3981
932F1467j1327r255o855m778l838k943k319j843j663j345j034r35p67l50l76k86k69k48j55
927A0881J75J63L69P51J277J714J207l62k112k640k170j322o38m56k26j18q4J58k7j72K3L4
$$ plain form
960 2581 2612 2723 2949 3044 3232 3252 3371 3467 3634 3944 4091 4334 4829 5173 5371 5470 5458 5385 5349 5280 5329 5458 5675 5882 6196 6433 6484
953 6484 6383 6341 6093 6072 6018 6039 5983 6122 6354 6598 6791 7093 7200 7171 7196 7449 7746 8079 8511 8789 9152 9620 9907 10076 10507 10880
947 10880 11238 11649 12025 12521 13072 13768 14496 15120 15709 16552 17472 18690 19756 20855 21863 22672 23513 24275 25177 26289 27772
942 27772 29751 32302 35598 40011 44571 47866 49896 52088 55849 62674 72910 86100 101915 119067 137299 157183
938 157183 182267 220746 290060 429280 709511 1140253 1569719 1938489 2290179 2416709 2191461 1841154
935 1841154 1461975 1011723 618132 380404 258120 195116 161091 139753 122020 106154 90937 75448 61467
932 61467 50140 40885 34030 29252 25414 22471 20152 18309 16646 15301 14267 13332 12565 12215 11839 11553 11284 11036 10881
927 10881 11056 11219 11588 12339 13616 15330 16537 16175 14063 11423 9253 7931 7293 6837 6611 6493 6409 6567 6540 6368 6391 6425
922F425Q9L68K73J07K15J86J19M43K94Q85J695L812Q035J0605R065Q574P576j52p433q481
917D2700r464j0641p757l926j972r82p23l28k33l07j63r8j83j18l92k57l25l76l56j23j38
912C838K7L3K00O3j15j4J51k7mp3j72P0J84m0J51K47J40K48K36J61M37J04M0l8l27k02r6k92
905D930l06k28j71n4L4P8j4n7J54j5J9o2P2j12p3N5K64P5J21K09L93J46Qj10l9J14p8k22j56
898D975k32j0j39l12k16J8M8J55m5m5j46n9k04L9L8n6m4K08J38K59J12L4m0j77j14L1K8J9
891D263k60j67k34J54O3n2j79lM7J96J01k3j31j22k31j21J12J0n7K14R9O1J65P2Op1j63LK07
884C959J01O9j11j28p9r2r7K5p6J6M2M5J51%kN3K03K58j17j94l2J39N3J60K09J66J35M3M2
877D941M3J58O5P3m6k3J27J31M2J13J55K41K54L39M44J024J792K461K380K175J979N80j168
$$ plain form
922 6425 6514 6882 7155 7262 7477 7663 7782 8225 8519 9404 11099 14911 22946 33551 42616 51190 58766 58614 51181 42700
917 42700 33236 22595 14838 10912 8940 7958 7235 6907 6674 6367 6204 6106 5923 5805 5413 5156 4831 4455 4099 3976 3838
912 3838 3865 3898 4098 4161 4046 4032 4183 4156 4152 4079 3907 3977 4161 4121 4272 4519 4659 4907 5143 5304 5741 5845 5885 5847 5520 5318 5222 4930
905 4930 4624 4396 4225 4171 4205 4283 4269 4212 4366 4351 4370 4308 4380 4268 4195 4250 4514 4589 4710 4919 5312 5458 5466 5356 5317 5431 5353 5131 4975
898 4975 4743 4733 4594 4282 4066 4084 4132 4287 4242 4197 4051 3992 3788 3827 3865 3809 3765 3973 4111 4370 4482 4516 4476 4299 4185 4216 4244 4263
891 4263 4003 3836 3602 3756 3819 3767 3588 3585 3632 3828 3929 3906 3775 3653 3422 3301 3413 3423 3366 3580 3679 3740 3905 3977 3983 3912 3749 3752 3959
884 3959 4060 4129 4018 3890 3811 3719 3622 3647 3571 3587 3629 3674 3825 3825 3823 3876 4079 4337 4220 4026 3994 4133 4186 4346 4555 4721 4856 4899 4941
877 4941 4984 5142 5207 5280 5234 5211 5338 5469 5511 5624 5779 6020 6274 6613 7057 8081 9873 12334 14714 16889 18868 19448 18280
871A8280j775k060k512j928j158o75l70j38j52k5r2J9k41j88l3k08j89K7J6J17K58J13Q4L6
865G206J20J80L0J42J28K17K47L16L19N37N08M79M72O08P89J010J333K397M182O598Q126J1043
860D6987R283K727K05o03k962Q22M17o482n918n361o732n148k631r64j60M00Q50J361J651
855B7742J840K137K835L611M988P627J1558J5251K0545L1808L8559L9562K8908L050K001N393
851B47415j0211j537j523k4562k2975k0763k3171j6104q102l656j387k25J038J659K424L009
847A21329M072N151P615J2176K1522L3499M1343M8538P1616P1813N0282L1185J230Q015J0760
844E40146k1861k3468k4718m9085n1829m8345m2830l0344k0345j4823j1252q631o044l648
840A82923r01J650M920Q641J3869K1300L3028M5049M8199N0769O2277M1289J3268J484j6414
$$ plain form
871 18280 16505 14445 11933 10005 8847 8172 7802 7664 7512 7487 7395 7414 7173 6985 6952 6744 6555 6582 6598 6715 6973 7086 7170 7206
865 7206 7326 7506 7536 7678 7806 8023 8270 8586 8905 9442 9950 10429 10901 11509 12298 13308 14641 17038 21220 27818 35944 46987
860 46987 56270 58997 59202 58599 55637 56459 56876 50394 44476 39115 32383 27235 24604 23640 23480 23880 24730 26091 27742
855 27742 29582 31719 34554 38165 43153 50780 62338 77589 98134 129942 168501 208063 236971 240021 242022 247415
851 247415 237204 235667 234144 209582 186607 165844 142673 126569 118467 114811 113424 113199 114237 115896 118320 121329
847 121329 125401 130552 138167 150343 171865 205364 246707 295245 366861 438674 488956 520141 521371 529386 540146
844 540146 518285 494817 470099 421014 369185 320840 278010 247666 227321 212498 201246 192615 186571 182923
840 182923 182022 183672 188592 197233 211102 232402 265430 310479 358678 409447 471724 513013 526281 527765 511351
837E11351j5222j7712l9465m3153l8154m6938m9200m1810l1981k2836j6614j2649r297p161
833A19159m750k594m10J480M266P393J0704J3803J7215J8583J5258J4292J4301L735m977r454
829B18004j4973j3821j4277k0803k1382j8449j8700j6777j2264q794o650n365m331l377k558
826C5483k095j215n64L56J558K496K748K756K999L179J925j00j086j923k890k956l106l185
821C4380l103l391l755l042k223j598j540j146r10p54n84m54l63k10k20LM7J19J94L72jk59
816A1562m15p1J44J70m75p62o34k83k39l96o74m13l35k60k60k03l30k61j96q8qn7o0Q8O3j45
809E462R1L07jk56l47k98LK27k26m30k28RJ5j44k58l08j55j61j22k7j59j43l1j68l2k6p3R8
803B619N1L1PM8k4l7k20p0l8J15J08p4m7r7L3j23j09n0p1j40o6j82Ql0O3M2J91PL8j24q0p0
$$ plain form
837 511351 496129 478417 438952 395799 357645 310707 261507 219697 187716 164880 148266 135617 126320 119159
833 119159 114409 111815 111405 112885 117151 124544 135248 149051 166266 184849 200107 214399 228700 232435 227458 218004
829 218004 203031 189210 174933 154130 132748 114299 95599 78822 66558 57764 51114 45749 41418 38041 35483
826 35483 33388 32173 31609 31965 33523 36019 38767 41523 44522 47701 49626 49526 48440 46517 43627 40671 37565 34380
821 34380 31277 27886 24131 21089 18866 17268 15728 14582 13672 12918 12334 11880 11517 11307 11087 11090 11137 11256 11450 11822 11821 11562
816 11562 11147 11076 11220 11390 10915 10153 9519 9236 8997 8601 7927 7514 7179 6919 6659 6456 6126 5865 5669 5581 5573 5516 5456 5544 5607 5462
809 5462 5553 5860 5859 5603 5256 4958 4961 5188 4962 4532 4304 4313 4328 4184 3926 3618 3463 3302 3180 3153 2994 2851 2820 2652 2620 2594 2521 2619
803 2619 2670 2701 2708 2756 2732 2695 2475 2405 2367 2482 2590 2516 2469 2372 2405 2282 2173 2123 2052 1912 1846 1664 1672 1642 1705 1747 1938 1945 1983 1859 1779 1709
795A709O2KN3L5J57j5J22Q0R7K5M1l6m2JM5k8j46q7pjO5K2J81j5K34K42J29j7R9Pm3j30q8
787B753j32j0m0J34J58J21J7MJ87N5j67j32p5o6j00r4P4K30K10L01K43M90L42J59rj64j17
780D372r7k24j79k80j53j87j89j15Qj14J31J4K9J11j8j40j78j17Q1M2K53K82K50Q7L22K01
774D192M7j22r6k18r4j55j77j60j44l22l19k33j14m2j0O5k2m0J33Pj7J7J3l5O1RJ45Q7J15
767B571K01J62j54q3j60j24M8O2j77o5K6k5j32j86j18P6p6L5O6M8q3N5p8m2Q9Q1q4q3J06N4
759B010q0M7m8P6j7N9q4K46K04K2p2r8J30M3p4R8p0q4n8k7o2m5J8L2o3K6ml3J33J28k6J63
751B490O0KK3J92K08K0M1l3j32M5M6l2n4M8P8O3K77J00k2m1P1O0M8NO1J05J49n1K7J59J91
744D204J92Q3M2J30J80L30J21K3J58J68K60K73K15K18J79M25L99N52O70Q20J129J497J506
$$ plain form
795 1709 1771 1773 1826 1861 2018 2003 2125 2205 2302 2327 2368 2332 2290 2291 2336 2308 2162 2075 2068 2067 2132 2154 2335 2320 2554 2796 2925 2908 3007 3014 2971 2841 2753
787 2753 2621 2611 2571 2705 2863 2984 3001 3005 3192 3247 3080 2948 2873 2807 2707 2613 2687 2917 3127 3428 3671 4161 4503 4662 4653 4489 4372
780 4372 4275 4051 3872 3592 3439 3252 3063 2948 2956 2842 2973 2987 3016 3127 3109 2969 2791 2674 2755 2797 3050 3332 3582 3669 3991 4192
774 4192 4239 4117 4021 3803 3709 3554 3377 3217 3073 2751 2432 2199 2085 2043 2033 2098 2076 2036 2169 2176 2159 2176 2189 2154 2215 2224 2369 2456 2571
767 2571 2772 2934 2780 2697 2537 2413 2461 2523 2346 2281 2307 2282 2150 1964 1846 1922 1846 1881 1947 1995 1912 1967 1889 1847 1936 2017 1933 1850 1956 2010
759 2010 1930 1977 1929 2005 1988 2047 1963 2209 2413 2435 2363 2265 2395 2438 2364 2462 2392 2308 2250 2223 2161 2116 2134 2166 2103 2129 2125 2092 2225 2353 2327 2490
751 2490 2550 2552 2575 2767 2975 2995 3036 3003 2871 2916 2962 2930 2876 2924 3002 3065 3342 3442 3420 3379 3450 3510 3558 3563 3624 3729 3878 3827 3854 4013 4204
744 4204 4396 4479 4521 4651 4831 5161 5282 5305 5463 5631 5891 6164 6379 6597 6776 7201 7600 8152 8822 9642 10771 12268 13774
738A3774J717K094K586L260N312Q257J1719J3648J0261K254m894p893p580o404m948l863l082
734C6218k292j597j158l41N09J319K109K969L819M946O059P671Q471Q909R897J1614J3942
730A13064J5985J7700J9256J9339J5721P015m032j3288j6789j5658j3767j2626j1434j0043
727A10443q284p066o195m747l139j388N94K424M851O995R468J0986J1861J4050J7802K2234
723A80889K6170K8296K8312K5051J7856O248p142k0153k9041l0262k5266j9630j6650j5411
719A49267j3919j1910r996r352q873q088o279m213j705R28L039M239N241O810J0465J4565
715A20219J9114K3175K5241K3114J6544R656M799l701j8097l1427l3560k6768j9073j4522
712I4714j1285r150p925p629p429o661n499m512l738k805j874j135k47L70J182J942K873M374
$$ plain form
738 13774 15491 17585 20171 23431 28743 37000 48719 62367 72628 74882 69988 62095 54515 48111 43163 39300 36218
734 36218 33926 32329 31171 30830 31339 32658 34767 37736 41555 46501 52560 60231 68702 77611 87508 99122 113064
730 113064 129049 146749 166005 185344 201065 208080 204048 190760 173971 158313 144546 131920 120486 110443
727 110443 102159 95093 88898 84151 81012 79624 80218 82642 87493 94488 103956 114942 126803 140853 158655 180889
723 180889 207059 235355 263667 288718 306574 312822 305680 285527 256486 226224 200958 181328 164678 149267
719 149267 135348 123438 113442 104090 95217 87129 80850 76637 74932 75860 78899 83138 88379 95189 105654 120219
715 120219 139333 162508 187749 210863 227407 237063 241862 238161 220064 188637 155077 128309 109236 94714
712 94714 83429 74279 66354 58725 51296 44635 39136 34624 30886 28081 26207 25072 24825 25195 26377 28319 31192 35566
707C5566O701R573J3603J6884J5664N333j0210k0355j9909j4573r425o106l902k592j938j875
704A2439j529j455j014p41o28o25m39m37l65l16j64j64j50k28j26j01m4j84j92n3j98l6m8
698C202p7j16m6J7o4o4L3k9l4k8n4N4R4N2o4JJ64O8m0l3k6r7j96p9j34j05j2j64j0j0Q5R8
690B386j14j7k7l6O2K79O7n5O2o4o2J25q3P6koJ53m9qk4J15k1k6q8L1j8r4n3q9K1O8j05P0
682B474M5P6J5L8J68o7J0J37j05k8m2L3k4P3L3N3k1M7kJ22N0R1j18K01J34M3J33J99N1O8N2
674C939J59J21M9K44J50J74K01j43R2o9n7k8K60M7Qo4lL8J36R8K02J18O7J74L52J20K42K30
668F857K49o9K21O3J47K8J11J26J18m9lm0P4Oj16l2j11j7J11l7Q6O7J75L5J23J74J59R1K81
661H828K56K74Q7N1r1J40j91j44k12O0m6m4%J04m4M5j71p3j93o0k01K5M7O0j83J03QJ95J35
$$ plain form
707 35566 42267 51840 65443 82327 97991 103324 93114 72759 52850 38277 28852 22746 18844 16252 14314 12439
704 12439 10910 9455 8441 7700 7072 6447 6008 5571 5206 4890 4726 4562 4412 4184 4058 3957 3913 3729 3537 3484 3286 3250 3202
698 3202 3125 3009 2963 2980 2916 2852 2885 2856 2822 2794 2740 2794 2888 2940 2876 2877 3041 3109 3069 3036 3010 2913 2717 2638 2504 2399 2387 2223 2213 2203 2288 2386
690 2386 2272 2255 2228 2192 2254 2533 2600 2545 2607 2543 2481 2606 2523 2599 2597 2591 2744 2695 2687 2663 2778 2757 2731 2643 2674 2656 2562 2509 2420 2441 2509 2404 2474
682 2474 2519 2595 2610 2648 2816 2749 2759 2896 2791 2763 2721 2754 2730 2803 2836 2889 2868 2915 2913 3035 3085 3176 3058 3259 3393 3436 3569 3768 3819 3887 3939
674 3939 4098 4219 4268 4512 4662 4836 5037 4894 4986 4917 4860 4832 5092 5139 5147 5083 5080 5118 5254 5352 5554 5672 5739 5913 6265 6385 6627 6857
668 6857 7106 7037 7258 7321 7468 7496 7607 7733 7851 7802 7799 7759 7833 7839 7723 7691 7580 7563 7674 7637 7723 7790 7965 8000 8123 8297 8456 8547 8828
661 8828 9084 9358 9445 9496 9405 9545 9354 9210 8998 9058 9012 8968 8968 9072 9028 9073 8902 8829 8636 8576 8375 8400 8447 8507 8324 8427 8435 8630 8765
653H765L04J82J50j4O7k70k92j70k29l09j48j45n6o5Q9j62q4j92j12j80j72l45j50q9j36j47
647F090L0j42j7l6l1L3J10L1q4k16k2j73M1l2j8p5R9J50O9m3R8J24J44L7n3l55k6m5L6n5J15
639E784j1o3j01n8J49Q9Q3J13P4J51L8J64J46L58K29L14K46K76K51K56J89N99Q25Q36O83R60
633A2580J072J314J723K359K979M066N713Q814J4007K3501L6753M5014L8931J7449k7892n6747
629A31636m5601k8452j6494j0161o312m341l013k423j577j203o63n08l66o04m05m56k61k63
625H533l64n51j28p8j9k67l7o9r3j83N8q0J96j07M0j63j12R0J2j30N2L0J48L4K3M4K05r7j9
618F968N2J25q3o2j17l5p6J9j61J98p0Q3r2K3o7O4q8j7j8J4j57J19R6K04N0J38L3J62j21R5
610G279JK3n4J59q8L2j80J56J16P5N1J36j28k7m4J97j6K66J88M23Q2J71K61M20P3K04J61K93
$$ plain form
653 8765 9069 9251 9401 9387 9454 9184 8892 8722 8493 8184 8036 7891 7835 7770 7859 7697 7613 7421 7309 7129 6957 6612 6462 6373 6237 6090
647 6090 6120 5978 5961 5925 5894 5927 6037 6068 5984 5768 5746 5573 5614 5582 5564 5489 5588 5738 5807 5764 5862 5986 6130 6167 6114 5759 5733 5688 5724 5669 5784
639 5784 5773 5710 5609 5551 5700 5789 5872 5985 6059 6210 6248 6412 6558 6916 7145 7459 7705 7981 8232 8488 8677 9276 10101 10937 11620 12580
633 12580 13652 14966 16689 19048 22027 26093 31806 40620 54627 78128 114881 159895 198826 216275 188383 131636
629 131636 86035 57583 41089 30928 24616 20275 17262 14839 13262 12059 11396 10888 10522 9918 9513 9057 8796 8533
625 8533 8169 7618 7490 7412 7393 7126 7089 7020 6927 6744 6802 6722 6918 6811 6851 6688 6576 6666 6678 6548 6600 6630 6778 6812 6835 6879 7084 6987 6968
618 6968 7020 7145 7062 7000 6883 6848 6772 6791 6630 6828 6758 6841 6749 6772 6705 6769 6681 6664 6646 6660 6503 6622 6718 6922 6972 7110 7143 7305 7184 7279
610 7279 7280 7303 7249 7408 7320 7352 7172 7328 7444 7519 7570 7706 7578 7551 7507 7704 7688 7954 8142 8565 8647 8818 9079 9499 9572 9776 9937 10230
604A0230K50O17M11O21O60P05N82Q19Q69J194J208J817K079K530K241J764J189R29N44P28
599C1987J251J872K110K462K045J465N40K67j77L66J147K032K616K987L155L317L002L147
594F5591L464M061M300M800N194N707N364N264M520L848K692J985R10o2q58k22Q75J817J075
590A20325L46J12m5o80o98m50K21Q46J772K766M335O192Q168R431J0030R473P944N735L138
585A88961l65k652l138k283j418j414j457p33L04J577J966J519O77K34m59j004j827k495k534
580A73459k285j687p82n2P67J775J909J684K709M666O015N696M422K868J387L11m35j086j933
576A99408k815l583l478j632J246K652J814l85j750j842r69k92Q95K844N208P391Q895R468
571B23075R271Q303P386O610N923L380q71n778q894r429p810n676k853l8K696M582O502Q736
$$ plain form
604 10230 10480 11097 11508 12129 12789 13494 14076 14895 15764 16958 18166 19983 22062 24592 26833 28597 29786 30715 31259 31987
599 31987 33238 35110 37220 39682 41727 43192 43732 43999 43822 44188 45335 47367 49983 52970 56125 59442 62444 65591
594 65591 69055 73116 77416 82216 87410 93117 98481 103745 108265 112113 114805 116790 117700 117638 116780 116558 117433 119250 120325
590 120325 120671 120783 120738 120058 119360 118910 119131 119977 121749 124515 128850 135042 143210 152641 162671 172144 180088 185823 188961
585 188961 188596 185944 182806 180523 179105 177691 176234 175501 175805 177382 179348 180867 181544 181778 181319 180315 178488 175993 173459
580 173459 171174 169487 168705 168653 169420 171195 173104 174788 177497 182163 188178 193874 198296 201164 202551 202862 202427 201341 199408
576 199408 196593 193010 189532 187900 189146 191798 193612 193227 191477 189635 188666 188374 189269 192113 197321 204712 213607 223075
571 223075 232346 240649 248035 254645 260568 263948 263077 257299 248405 238976 231166 225490 222637 222599 225295 229877 236379 245115
567B45115J1472J2858J2882J2430J2204J1378R621P666P364Q459J0885J3145J5125J5948J4321
563D20873Q810L189J70j762l245j889M70J22k455k883r41M262J0086J5307J7766J9808K1689
559E09377J9446J1482N279M346O994R157J1069J2124J6796K4907L3081L3475K7220K1474J7982
555G64209J2512N608k064p620r925r956j2802j8068k2203k0814j2875j365M758K51j3648k7831
551F28167l8939m2574l9356l3145k9560k5638j8522j2119j7616k9080l3438k8827k1912j5923
548B41518j2455r426p790q288r973j0086r334o508l902j633p67j35k597n799o618m465k179
544A39563n51j456j939j878o97K08J802J285p84k426k323l089l134m594m581k737j417k114
539A09138k518j453K184M792N609L100M02r80O52K967P062R978Q588L740J14l02J599q05k611
$$ plain form
567 245115 256587 269445 282327 294757 306961 318339 327960 335626 342990 351449 362334 375479 390604 406552 420873
563 420873 429683 432872 433042 431280 428035 426146 426616 426738 424283 421400 420459 424721 434807 450114 467880 487688 509377
559 509377 528823 540305 545584 549930 556924 566081 577150 589274 606070 630977 664058 697533 724753 746227 764209
555 764209 776721 782329 780265 772645 762720 752764 739962 721894 699691 678877 666002 664637 669395 669646 655998 628167
551 628167 589228 546654 507298 474153 444593 418955 400433 388314 370698 341618 308180 279353 257441 241518
548 241518 229063 219637 211847 203559 193586 183500 174166 167658 163756 162123 161356 161221 158624 152825 146207 141742 139563
544 139563 139012 137556 135617 133739 133042 133250 135052 136337 135553 133127 130804 127715 124581 119987 115406 112669 111252 109138
539 109138 106620 105167 107351 112143 117752 120852 121254 120274 120926 123893 130955 140933 149521 153261 153375 153073 154672 153867 151256
535A51256m66K117N149R433J2355J3965J1684M356j0833k7588l0513k0950j1510m125K288
531A06618O350O054M908L414J030n145o587o70L146k320q565r688p377l767j236k039j793
527H2333J332L679K600N56l971n428m384l754m002k962p15K642L071J987N62j324m052m587
523F3583k787j051l84n49j104j425m56J342L592M365J348j679k172j844j523j264p57l20J12
518E7027m07j319j825r55m10m48m68m01k100l981m051k777j993j065j678j535j096j002R1
513B9607J105k787k710j183N51K82m9r65P28J666O461J5104M0906L3306k8214l7819j9428
509C6561r244m682k642j142m14N83l72n37n32r5J29J253J840J369l25j054j094M4K71K098
504B2015K487N928J2446L4488M1591j5482l9644k1203j0765m542l145m35p66P58n93K42k91
$$ plain form
535 151256 150790 152907 158056 167489 179844 193809 205493 209849 199016 171428 140915 119965 108455 104330 106618
531 106618 112968 119022 123930 127344 128374 123229 116642 115972 119118 116798 108233 98545 91168 87401 86165 84126 82333
527 82333 83665 87344 89944 90500 86529 81101 76717 72963 68961 65999 65284 67926 70997 72984 73546 72222 68170 63583
523 63583 60796 59745 59361 58812 57708 56283 55827 57169 60761 65126 66474 64795 62623 60779 59256 57992 57235 56915 57027
518 57027 56620 55301 53476 52521 52111 51663 51195 50794 48694 44713 40662 37885 35892 34827 33149 31614 30518 29516 29607
513 29607 30712 27925 25215 24032 24583 24865 24816 23851 24579 26245 32706 47810 88716 122022 93808 55989 36561
509 36561 27317 22635 19993 18851 18437 19020 18648 18111 17579 17484 17613 18866 20706 22075 21750 20696 19602 19646 19917 22015
504 22015 24502 30430 42876 77364 118955 103473 63829 42626 31861 27319 24174 23739 22973 23731 23138 23380 23089
500B3089J193P17K674O32N70m70j48j249Q74R9J612M96K039O17K626J109K541R11K955K290
495D5177N319L045L130R95N058L946O827N997J2137J2735J9154K0180K7798K9135L4455L1942
491B67030M8945P7996J47147K72919N68894J065082J167996r1874j153266r67128n46122k84834
488E72785j64856r0976n2721k5815k1614k1890k0979j5461p971J543Q309J1180J6795K2189
485B10518K7608K5349L8063O3635J19682K14780M43439Q77127J239130L83598r70647j081864
482A590418o51469l39752j93804j09611o4917l0901k4359k5510k8538k1586j9085j1778j0528
479E8580o526p059l984n494m231n263p80j382o32k850j258k000k45j122p9j102j29j154np54
474A2531l3j332m1N1J578M24p36j973r10j181k86p06J85q3L61j55N06K35M60k11l62j303m82
$$ plain form
500 23089 24282 24999 27673 28305 28875 28405 28257 27008 27882 27981 29593 30089 32128 32745 35371 36480 39021 39932 42887 45177
495 45177 50496 53541 56671 57666 62724 66670 73497 79494 91631 104366 123520 143700 171498 200633 235088 267030
491 267030 315975 393971 541118 814037 1382931 2448013 3616009 3524135 2370869 1403741 857619 572785
488 572785 407929 316953 264232 238417 216803 194913 173934 158473 150502 152045 160354 171534 188329 210518
485 210518 238126 263475 301538 365173 484855 699635 1143074 2020201 3259331 3642929 2672282 1590418
482 1590418 938949 599197 405393 295782 230865 199964 175605 150095 121557 99971 80886 69108 58580
479 58580 52054 44995 41011 35517 31286 26023 25243 23861 23229 20379 19121 17121 16876 15754 15675 14573 14444 13290 13285 12531
474 12531 12498 11166 11125 11176 12754 13178 12442 10469 9559 8378 8092 7386 7571 7488 7849 7694 8200 8435 8895 8684 8322 7019 6537
468F537n59J8j57J18k75L3k28J07l0M41O38J918K961J664k322k975j591n86m09j03q9K78K92
463E681m9k81L39P39m52j238n23l55j43j05j51j26k7l0o4L6J24K32M56J026J374N52j072j415
457D528q83l72j10j26k38J5lK12K63L64q6k15m75k39k24j25lN5k20M4o7J29j50P5k7K77q6
450B313K4l5J76j92Lj20J17j47J00q9J93k02J14J87K59q9J84j55jk12j5j08J73l1L33R4M92
444C366J89L4m40L2l21J34r0M22L10K29m63l05n71j0l12K83L10K64l4L5l42K5k44K43r5L39
437B988L4L86N00J215L45m90r30l15l83R8j55O94J182J203n02j225j094k55l59J17K6K20J74
432C474L24j43j8j83L43K98M07P8J97l5M21K27j5n94J30J28L45K56O99J099K405L443M512
426A7798L174q92m472m211k930j446p91k51m40n4J5K55K08K91k37q1N4K15n0J88L01M90K72
$$ plain form
468 6537 5978 5996 5839 5957 5682 5715 5487 5594 5564 6005 6643 8561 11522 13186 10864 7889 6298 5712 5303 5200 5111 5389 5681
463 5681 5632 5351 5690 6429 5977 4739 4216 3861 3718 3613 3462 3336 3309 3279 3215 3251 3375 3607 4063 5089 6463 7015 5943 4528
457 4528 3645 3273 3163 3037 2799 2814 2811 3023 3286 3650 3564 3349 2874 2635 2411 2286 2283 2338 2118 2162 2095 2224 2074 2149 2122 2399 2313
450 2313 2337 2302 2478 2286 2289 2169 2286 2139 2239 2150 2343 2141 2255 2442 2701 2612 2796 2641 2640 2428 2413 2305 2478 2447 2780 2874 3366
444 3366 3555 3589 3149 3181 2860 2994 2904 3326 3636 3865 3402 3097 2526 2516 2204 2487 2797 3061 3027 3062 2720 2745 2501 2744 2649 2988
437 2988 3022 3408 3908 5123 5468 4978 4048 3733 3350 3448 3293 3987 5169 6372 5870 4645 3551 3296 2937 3054 3080 3300 3474
432 3474 3798 3655 3637 3454 3797 4095 4502 4580 4777 4742 5163 5390 5375 4781 4911 5039 5384 5640 6339 7438 9843 13286 17798
426 17798 20972 20080 15608 11397 8467 7021 6230 5979 5539 5485 5500 5755 5963 6254 6017 5936 5990 6205 6155 6343 6644 7134 7406
420G406P47Q40J692K844M638M599Q22l821m446l145j322l87M61L10j89o91l38R4R05J178O03
415A2800p2J29M92O98O46J325K014K264L072L449L136L569M357N793R370J6200K9798O8010
411A67050J67639K86918J65847j64028k68102j62745p7010l8475k1002j0176m060j615j754
408C8487k867k838j907k9J774L294K175K075M243N563M133O460Q281J1233J7808L2236O1413
404A91534J50522L84239O05739J99212m56356n01054k67312j23178o3602l4428j8060q905
401E8351n169l466n488n896m875l74J873J26l520j503N44J773R36K912L857O030R109J7604
396G2824L5226Q8136K05697K77271L9016k41731k24536j14899n2633k7795j5516q687m585
393B7788k901j972k610k550j866L38K36k213k989j499p94n81o36Q9j78J26j42j55n00j21j78
$$ plain form
420 7406 8153 8993 10685 13529 18167 22766 23588 19767 15321 12176 10854 10467 10928 11238 11049 10358 10020 10114 11019 12197 12800
415 12800 12728 12857 13349 14047 14693 16018 18032 20296 23368 26817 29953 33522 37879 43672 53042 69242 99040 167050
411 167050 334689 621607 787454 623426 355324 192579 115569 77094 56092 45916 41856 40241 38487
408 38487 35620 32782 30875 30846 32620 35914 38089 40164 44407 49970 54103 60563 68844 80077 97885 130121 191534
404 191534 342056 726295 1332034 1531246 1074890 573836 306524 183346 119744 85316 67256 58351
401 58351 53182 49716 44228 38332 33457 33083 34956 35082 31562 30059 30603 32376 33312 36224 40081 46111 55220 72824
396 72824 108050 196186 401883 679154 718170 476439 251903 137004 84371 56576 41060 32373 27788
393 27788 24887 22915 20305 17755 15889 16227 16463 14250 11261 9762 8968 8387 7751 7840 7662 7788 7646 7491 6991 6870 6692
388F692J24M66Q66P69K92n9J9j26k00n11o3M38M26k90k55l16j36k49j26j5P5j38j57J15N35
382H176R50O36o42m91lN29L75L82N0K28K32O13R52J464J862K367K581J434J60L79K36Q06L680
376B6956Q428J5971K2647K0029O501o675q805o661o477q079p002l630k29J891P54k738l883
372D8998j790J407L804M729M926M929L915M254N904O167N877Q016K1619M6690P7380L9415
368B86240n9063p6316m4613k1600j0108m436l679r50O477O844q298j3402q728l415k25J051
364D5779j730l854k582n99l7P12L133P856J4233J7921J6957J1861L2j5151k3900k2106j4907
360C3618p399k917j3J718K057J32k200l640l106j948p06p09j092j647j711j475q03p57o16
355F786p81o73m56l18l62r2k11kk07k79j99k08j56m7j98j26o6m9j44K7P5Pk7R3K3l6K2O9J06
$$ plain form
388 6692 6816 7282 8148 8917 9209 9150 9169 9043 8843 8332 8269 8707 9133 8843 8588 8272 8136 7887 7761 7746 7821 7683 7526 7641 8176
382 8176 9126 9762 9120 8629 8626 9155 9530 9912 9962 10190 10422 11035 11987 13451 15313 17680 20261 21695 21855 22234 22470 23276 26956
376 26956 35384 51355 74002 94031 100532 93857 85052 78391 71914 63835 56833 53203 52974 54865 55619 52881 48998
372 48998 47208 48615 52419 57148 62074 67003 70918 75172 81076 87243 93120 101136 122755 169445 246825 286240
368 286240 227177 150861 106248 84648 74540 70104 66425 65475 71952 78796 70498 57096 48368 44953 44728 45779
364 45779 44049 40195 37613 37014 36977 37689 40822 48678 62911 80832 97789 109650 109682 94531 70631 48525 33618
360 33618 26219 23302 23289 25007 27064 27196 24996 21356 18250 16302 15596 14887 13795 12148 10437 8962 8159 7402 6786
355 6786 6005 5332 4876 4558 4196 4104 3893 3891 3684 3405 3206 2998 2842 2795 2597 2471 2405 2356 2212 2239 2314 2321 2294 2387 2410 2374 2396 2465 2571
348B571nj8P8L8L93J027J495N65j113j408r68m20j43j64j04k2l3k8M3j52j62K5j06j01q6J31
342A333N0Q7M5Q8j34j2k0Q2K79R79K264L326N77k694k560j363o07l18j58O0q9rj26kk4N3m3
335A064j11n4N6KK6p0P6j45K2M1L6p4J48O27J385J437n4j450j187n78j18k46j96j20P6l4n1
329E08J0K4j05Op8J16o2O2RJ57j52l1q1N4n4J35j14m6j32K62O5M3j28Jo3M6n0J9j12J35r4
321C50K7K1m9J9j8k3O7ml7p6Q4l5P3j34J28r1J25j3Q4rJ03qJ0p2P5n1P0j89l1k8R2l6J11M6
313E81L4K2J67n9m5n9Q9j02L5j36j0j52J60qM6J1RJM4q8J68Q2J39k13p7o7K60Q6K04L32N33
305A987j91n00m64k50n3J0R8k9k4J81p5p2r1k1j7M9Rn7q7m2j8J23Kl0J8R0J8J98J29Mj53k39
297E03j77O4l0Q2n7m4q3n1o2j6rL5p1P0j6On2KK2J5l1PRr8l9J22J6L0k7k4k5Q4l2J0p3m4m2
$$ plain form
348 2571 2566 2548 2626 2664 3057 4084 5579 6144 5031 3623 2655 2235 2092 1928 1824 1802 1769 1741 1784 1632 1470 1495 1389 1288 1202 1333
342 1333 1383 1470 1515 1603 1469 1457 1437 1519 1798 2777 5041 8367 8944 6250 3690 2327 1720 1402 1244 1304 1215 1206 1080 1078 1054 1107 1064
335 1064 953 899 955 957 983 913 989 844 866 907 943 869 1017 1644 3029 4466 4412 2962 1775 1197 1079 833 637 517 593 559 508
329 508 518 542 437 443 365 481 419 481 490 647 495 464 383 437 383 518 404 358 226 488 553 596 468 469 406 452 402 421 309 444 350
321 350 377 398 349 368 350 327 394 390 353 277 361 326 399 265 393 302 427 414 498 489 592 584 594 522 597 546 616 427 396 368 460 424 535 581
313 581 615 637 804 745 700 641 730 628 663 527 517 365 525 517 563 574 583 584 628 540 708 790 929 716 639 572 832 918 1122 1454 1987
305 1987 1796 1296 832 582 529 539 637 608 584 765 690 618 527 506 489 538 547 490 403 361 343 466 468 438 456 546 564 762 891 895 742 503
297 503 326 390 360 442 385 341 258 207 145 129 120 155 84 154 138 144 92 94 116 131 100 107 116 18 -21 101 117 147 120 96 71 155 123 133 60 16 -26
288b6O0N3M7Lj35Q4N6p5j32O2P2J32O9N0l3N4J9J2j15j2j9K6J3q7j29O2okJ5o1k5j10%L4L0
280a4Q0j59L9m9mJ13j5n6n1OJ69k5rOK0L0O7o6L6j51J27P1o8l7r0r6J11J34j9j4j7J4k9l6
271A8R7n4J7J3J42l9l0k6Jk1l1j34P3m7K0R6M3j87JM5J3M8Q6M7N4j28o3k0K4K2K3r1M3l0R9
263A24l1J36j29O1L5P4k4j15q7J4p7Q4k3N4m1J0q6q6PJ03m6j0N5N0M3P8QL7m7q5j01P6j54
255i3l6Q7J19k5k4q8J51q6K6K8L0k9M8kN3j55%K3P4j46J04M1K7q4P9qm8K9q8q0R6k2J05L3
247A39p5k8J0oP7m9rl8J17N3r1r6j06j8K7oL0J01O2l0k3j05J61q4p6n9R1j40Q6J27N9n0J8
238F9J5K3k9j7R7L5j03j1n1N6N2n0n4O9r2Q3pJ1O3J4q5LM9k8n0m1J8R4o3j0N1Jq9J2N5p3j3
229DO7R1n5o0O5q7q6J34O2p5k7l0L5J8N1P9L2j29r6M7L2J14j38qJ0L4k2j1j43M0JR1j13j6
$$ plain form
288 -26 34 87 134 137 2 86 142 67 -65 -3 69 201 270 320 287 341 360 372 257 245 226 252 265 178 49 111 105 103 118 57 32 -78 -78 -44 -14
280 -14 66 -93 -54 -103 -107 6 -9 -65 -116 -110 59 34 25 31 51 81 148 82 118 -33 94 165 97 60 -30 -126 -15 119 100 86 69 83 54 18
271 18 115 61 78 91 233 194 164 138 139 118 87 -47 26 -21 -1 95 138 -49 -48 -3 10 58 144 191 245 117 54 34 58 80 103 12 55 25 124
263 124 93 229 100 161 196 270 246 131 44 58 -19 65 42 96 55 65 -21 -107 -100 3 -43 -53 2 52 95 173 181 218 171 86 -15 61 -93
255 -93 -129 -42 77 52 28 -60 91 5 31 59 89 60 108 106 159 4 4 27 101 -45 59 100 127 43 122 114 66 95 7 -73 23 1 106 139
247 139 64 36 46 40 117 68 59 21 138 191 100 4 -102 -120 -93 -99 -69 32 94 64 41 -64 97 13 -63 -122 -31 -171 -85 42 101 51 69
238 69 84 107 78 61 158 193 90 79 28 84 136 86 32 101 9 92 85 96 159 173 88 91 140 112 62 21 39 133 70 60 111 112 23 35 90 17 4
229 4 71 162 107 47 112 25 -61 73 135 60 33 3 38 56 107 186 218 89 -7 40 72 186 48 40 50 84 62 51 -92 -52 -51 40 -73 -89
221h9R9N1l8n5K2R0K0r4J0k3q5R0r%jLj9m1Nj4oLP3J73k5r9l7O3K8k8J5RJ8j6p5K6J0J39j19
212G4j5R4K2r7r5K0Q9k06O2nm2JK5pL8K0k3L9JJ07r8j21J25J6k0j9J12j07J06r6Q9j23k3j0
203f7K3N1j2m0r6N0J53j14J35J6J2l7K6j02J7O9m6r9k8jL6N8R1r0J12j2q5n2P7m6O3l8l4O9
195E9J22q0j2j43K4M7j8l0P5n1m3J6J02m9l3K01L3n3N4j25o6n0J8K1N1l8j7qL1P2o8K0l1j62
187a31J87P8k7K8P2j50pj89p0M9J4Q2r9pM5L8P3J0J7n6J8R7o2M6n5P4Oo5J30j36n8j6j1K4
178e1L5J23J1j24Q2n1m4j05K6j5N0N4jl0PP4k8o2P7o9L9M3j8p4Q5k8m3Q6k9rN4n6rK1rM1L9
169I2j1k5m1j08L3K5j13k3L0J5M9N1L3j8p0j48L7Qq1J8J98lL3m1n0M4o5M7Q1N3m3qJ5L9n2
161Aj19L2J79R8k7k8j04p0m0j8k3Q7oRl1N9J05l9mJ9j11j5K4J0j4n0j3J15j6O6m2K4j3l2K4
$$ plain form
221 -89 10 61 23 -32 -10 80 100 6 16 -7 -92 -2 -11 -11 -12 -9 -28 -69 -64 -78 -84 -81 -8 165 140 41 4 67 95 67 82 91 109 93 18 44 54 193 74
212 74 59 153 175 78 -17 3 92 -114 -52 -57 -99 -98 -73 -80 -42 -22 -45 -6 -5 102 4 -117 8 24 4 -15 97 -10 96 0 89 -34 -57 -67
203 -67 -44 7 -5 -45 -141 -91 62 -52 83 99 111 74 100 -2 15 84 38 -61 -89 -90 -54 4 95 5 117 105 20 -32 45 -1 62 24 -10 59
195 59 181 101 89 -54 -30 17 -1 -31 44 -7 -50 -34 68 19 -14 187 220 167 221 96 30 -20 -2 19 70 32 15 7 38 110 42 62 31 -131
187 -131 56 134 107 135 207 57 50 -139 -209 -160 -146 -64 -163 -170 -125 -87 -14 -4 13 -43 -25 72 10 56 1 75 81 16 146 10 -48 -64 -75 -51
178 -51 -16 107 118 -6 76 25 -19 -124 -98 -113 -63 -9 -10 -40 -33 41 13 -49 28 -41 -2 41 23 -51 34 6 -37 49 20 11 65 9 0 21 12 53 92
169 92 81 56 15 -93 -60 -35 -148 -171 -141 -126 -77 -26 7 -11 -81 -229 -192 -184 -265 -247 -49 -52 -19 -60 -110 -66 -131 -84 -3 50 7 -1 14 53 1
161 1 -118 -86 93 191 164 136 32 -38 -78 -96 -119 -32 -38 -29 -60 -1 104 65 61 80 -31 -46 -22 -12 -26 -76 -89 26 10 76 34 58 45 13 37
152C7j40p6R3L6p3M4N2N5Q5j1q5l6m9J09m1j5J8Rm5m8m0L5m4K5J27k9j1L3J78j52Kk1l6k0
144c4K5L7k3m9rJ04j5j39K4N6Q6J8j9o0jo3L1r6R3M6oK0J83n9j89n3R2pJ63k07j28j1Q5j0
135a15J8KN9q6J08M0j32m4l0O3J01k9P1ol7R7N4j68j9L4L2k20L9O0J22K2o7Mm0mJ02r8O7O3
127F3on9Q8l4L4j16O4n5K5n6K0qp7M4l6M9pj69O1J5n8M7J38o2l1m7j2J45Q0O6J23j07l7n6
119B9K5L8k0o8O4n8m9J7n3J01J57j30m6k3RJ5Jn7j4P7j7m8Ro1pM0M7r4K5rP5N0L5oN9K2j03
110C2j5N5J28LM1kp8j55O2Q2k2K6K8K5j14j42l4Q9L7k1J18O8J5m8R3q9PQ2M3j6M6L2OP4M4
101E00j2j03j14j31K9L8o5K1J86J8L3m2p9l3M8J93j06l0l3L6o8k1M4p9j18P8m8L7m4o1J2K1
93A07K0J42m4lj15r5J3J35N2j6J8J1r6o3MPj9kL7j27m1J5k7M3K1O1j3k9q9J0NJ7RN1L2M1j05
$$ plain form
152 37 -103 -179 -86 -50 -123 -79 -27 28 113 102 17 -19 -68 41 0 -15 3 12 -33 -81 -121 -86 -130 -105 22 -7 -18 15 193 41 43 22 -14 -34
144 -34 -9 28 5 -44 -53 51 36 -103 -79 -23 63 81 62 2 1 -62 -31 -127 -34 12 6 26 209 150 -39 -92 0 -7 156 -51 -179 -190 -105 -115
135 -115 -97 -95 -36 -122 -14 26 -106 -150 -180 -117 -16 -45 26 20 -17 80 134 -34 -53 -19 13 -207 -168 -108 14 36 -31 -27 -67 -71 31 -67 0 63
127 63 57 -2 86 52 86 -30 34 -21 4 -52 -32 -40 -117 -73 -109 -60 -67 -236 -175 -160 -218 -171 -33 -95 -126 -173 -185 -40 40 106 229 122 85 29
119 29 54 92 72 4 68 10 -39 -22 -75 26 183 53 7 -16 -7 8 9 -48 -62 15 -2 -50 -41 -102 -109 -69 -22 -116 -91 -100 -25 25 60 54 113 135 32
110 32 17 72 200 203 244 242 164 9 71 153 131 157 185 210 96 -46 -80 9 46 25 143 211 226 178 271 182 189 271 314 298 344 376 382 456 500
101 500 488 385 271 140 169 207 142 163 349 367 400 358 279 246 294 487 381 351 318 354 286 265 309 230 112 190 142 179 135 74 86 107
93 107 127 269 225 222 107 12 25 160 212 196 214 225 129 66 70 77 58 56 93 -34 -75 -60 -87 -44 -23 38 25 -4 -93 -83 -78 -61 -52 -1 31 72 -33
84c3J7L6o6j2p1n2J51PK5KL3j6N0p2J3j07l4M4Km0O6k6R5q8K8r4Q0q0J03K1o6q7L0M4O0R2
76E5P3k1L3o4l1m0O1l0J9j9n8Kk9j09N4Q9K7J28j32l5L2n7m3o8m3J08Q9j4n0J15R2p0nq4K4
67am0n5N2M6n9jj24Q7L1Lq4j2L5M3n9J6J90j3n0m3j1O1q9k4rO8J5%p4J10N0kK2m9p9Q6m5K5
58A7m8k3k8Q2P4om5j7q0J19q1LkL2Jk8N4L2q6j07Q2M5M2l6Nopj09P5O1j14k9L5n1m1R6K2k6
48i3mj2M3J53Q8j02N4o9J2j50O8j6N5J9m3K4j7l1P2n0m8nk4J6j33K65J82J9Q0K04J87K38R1
40A073l52l52j33k5k10k4Jn9r4l7J22O9o3N9o1l8n2N9J44k1q4j45P2J25k6R2j1j8m5O7k4L6
33D5k2M1p6R8r5p9J43j69m4L6J19J9j38LJ11n8P6J08j32pl7Q6l9j22N4J14j43L1LP3L9k2r5
24g9J46Pj6j16n4N7Q0M5n3o2Lq1J1J43J2M8J00j37l7O4K8j26q6J22N3J5l5k2mm7O4J3o3j4
$$ plain form
84 -33 -16 20 -46 -58 -129 -181 -30 -23 2 4 37 21 71 -1 12 -95 -129 -85 -83 -123 -57 -83 12 -76 -48 -142 -62 -142 -39 -18 -84 -171 -141 -97 -37 55
76 55 128 107 140 76 45 5 66 36 55 36 -22 -20 -49 -158 -104 -15 12 140 8 -27 5 -52 -95 -163 -206 -98 -9 -23 -73 42 134 64 59 -25 -1
67 -1 -41 -96 -44 2 -57 -58 -182 -95 -64 -61 -145 -157 -122 -79 -138 -122 68 55 5 -38 -49 12 -77 -101 -110 -42 -27 -27 -101 9 59 57 79 30 -49 37 -8 17
58 17 -31 -54 -82 0 74 68 23 6 -74 45 -36 -33 -35 -3 -2 -30 24 56 -30 -137 -55 -10 32 -4 1 -5 -12 -121 -46 15 -99 -128 -93 -144 -185 -89 -67 -93
48 -93 -97 -109 -66 87 175 73 127 58 70 -80 -12 -28 27 46 3 27 10 -21 51 1 -47 -52 -76 -60 -193 72 254 273 353 557 744 982 1073
40 1073 721 369 236 211 1 -23 -22 -81 -175 -212 -90 -21 -84 -25 -86 -124 -176 -117 27 6 -78 -223 -151 -26 -52 40 29 11 -34 33 9 45
33 45 23 64 -12 86 -9 -88 55 -114 -158 -122 -3 16 -122 -119 -8 -66 10 118 -14 -21 -58 28 -11 -133 -79 35 -108 -77 -74 -1 38 16 -79
24 -79 67 74 58 -58 -112 -55 25 70 17 -45 -42 -123 -112 31 43 91 191 54 17 81 109 -17 -103 19 72 87 52 30 26 -21 43 56 -7 -21
16b1L5m7kk4L0J1M5m6M4q6m1O0M3m7N6j03j0O9J36Q4J8m7r0l2L1nm0O3l4n5Ll0M6j02J24n1
7a5p7k3N0k8K3N4n2J9lp8q7l5J12J38N2J3Q2j50q0QN7k5r2Q1J07k31P1Q9J5o0k2N8Q3r8K2
-1b2n0N6J8qM5m0J07j8j2K2m0Pk4m4j7m8J05L3L9N1j0q9j31k6O5P2q5m3%j2p5P2M2L7L4l2
-10b1p9O5O0ll1r5p8Q4L2q2N8R5j2n1L1M6k0j66P3J7O4J35r6j5J27p4j36L8j3j25J34o6Q5
-18a9m3k2Q3pL2J0n8NJ2o5J4m3R4k2j43J25J01q7k0N0L1j1n6k9J5K5n2k9j3N3r8M2M1R1k0
-27a3M1o3K2m7n5m3J48O7N1n5rP2Jj73l0J5O9J8j10n7j6M0p9J01L5n5J2O9K9j18qpm1N6J15
-35a8j70O1J07J7m2j5L2O1oj02l6O3Pn4K1O4o0J0P7Q0r8m5pkO3J8q6J11m8j18N7M8l8J26P5
-44A53j8o8j4p0R4l4n6%M8m8j20J32L2k8J01j16r8jJ09M4J35q4m0j0k6k0m8l4o6L5J51k9j4
$$ plain form
16 -21 14 -33 -35 -59 -29 -18 27 -19 25 -61 -102 -42 1 -46 10 -93 -103 -34 102 186 204 157 67 35 66 61 21 84 50 -5 -2 -32 14 -88 36 -15
7 -15 -92 -115 -65 -93 -70 -16 -68 -49 -52 -130 -217 -252 -140 -2 50 63 145 -5 -85 -77 -20 -45 -137 -56 51 -180 -109 -20 -5 -65 -87 -29 54 -44 -22
-1 -22 -72 -16 2 -6 39 -1 106 88 76 98 58 65 41 -3 -20 -68 37 70 109 160 150 61 -70 -96 -31 41 -44 -87 -87 -99 -174 -102 -60 -23 11 -21
-10 -21 -100 -35 25 22 -9 -104 -182 -98 -66 -148 -90 5 -7 -58 -27 19 -1 -167 -94 -77 -13 122 26 11 138 64 -72 -34 -47 -172 -38 -104 -19
-18 -19 -62 -84 -1 -8 24 34 -24 -19 -7 -72 -58 -101 -7 -29 -172 -47 54 -33 -53 -3 28 17 -39 -68 -53 -28 -80 -109 -122 -69 -167 -125 -84 7 -13
-27 -13 28 -35 -13 -60 -115 -158 -10 57 108 53 44 116 117 -56 -86 -71 -2 16 -94 -151 -167 -127 -206 -105 -70 -125 -113 -44 -15 -133 -141 -148 -189 -133 -18
-35 -18 -188 -127 -20 -3 -45 -60 -28 33 27 -75 -111 -48 -41 -95 -74 -10 -70 -60 17 97 -1 -46 -53 -55 8 26 -60 51 3 -115 -58 -10 -48 78 153
-44 153 135 67 53 -17 77 43 -13 -13 35 -13 -133 -1 31 3 104 -12 -110 -111 -2 42 177 93 53 43 17 -3 -51 -85 -151 -116 35 6 -8
-52ho8n0q6j3Q1j7NJ49m9L1k8J01J4m1JJ6L4M5o1jM5k2p6PL0L5q7l4j51M8Q6q0p5P3O9J44
-61F7K1j03k1M7l9r5r9L8O9J66J15j50o9O0M4n1N9ml1j42J27j2p4o9M1O9k4J9L1K3j15n6J00
-69e8K7R0m0jN3K1r6k0Q4oJJ3MPk3m1r6J16l0pP7o5P1K0J6j12j4n5L9k1j1j18N9J49R2J6o9
-78G2M0q5j21N7J30k1l5m7J8RJ6o3P8p7m1j3O3K5nk7k0n7J04m4m6L1K1n4%R3J4j11N2k4KL5
-87c1m9j2M6O1qm0O6j1n3R7%j49j3J8L2J9Mm5N2p5m3J00J1O0J0o5J0Q2m9m6m3L0q3NK8j11
-95a95J20K6j7l3M0n1L0K2k5O9K9n9O9N7j2L6L3l4k3n0L2o9ll7n2n3L7o9Q4O8M9j22J4Q7j2
-104a4K5K03J3j60j6N7r0O0l8q1J14R4j24j33j00J20N0K7j06Pj8J8R7nK0O5p6P7o5n2J07q9
-112a3j13K8M7O4j9jr6J0k0j00O5K5M4P2K1l5k2L5l9J34j3j56m1k7K6O0q9l5p4M8o3O1oR0
$$ plain form
-52 -8 -76 -126 -212 -225 -144 -161 -156 -7 -56 -25 -53 48 62 21 22 38 72 117 56 55 100 78 2 9 39 74 -13 -47 -198 -150 -64 -144 -219 -146 -77 67
-61 67 88 -15 -36 11 -28 -123 -222 -184 -115 51 166 16 -53 7 51 0 59 55 24 -118 9 -3 -77 -146 -105 -36 -60 -41 -10 13 -102 -158 -58
-69 -58 -31 59 19 18 71 92 -4 -24 60 54 55 68 72 79 56 15 -81 35 5 -2 75 10 81 101 117 5 -9 -64 -25 -46 -57 -175 -116 33 125 141 72
-78 72 112 27 -94 -37 93 72 37 -10 8 17 33 -30 48 -29 -70 -83 -20 5 0 -27 -47 -104 0 -44 -90 -59 -38 -92 -92 1 15 -96 -44 -68 -66 -31
-87 -31 -80 -92 -46 15 7 -33 33 22 -31 66 66 -83 -96 -78 -46 -27 -23 -68 -16 -91 -134 -34 -23 37 47 -18 -8 74 25 -21 -64 -34 -117 -112 -84 -195
-95 -195 -75 -49 -66 -99 -59 -110 -80 -58 -83 -14 15 -44 25 82 70 106 139 105 82 32 64 -5 -8 -45 -97 -150 -113 -182 -98 -30 19 -103 -89 -2 -14
-104 -14 11 214 227 67 51 108 18 78 40 -41 73 167 43 -90 -190 -70 -20 7 -99 -92 -110 -92 5 0 20 85 9 86 21 -31 76 -13
-112 -13 -126 -98 -51 13 -6 -7 -103 -93 -113 -213 -148 -123 -79 -7 14 -21 -43 -8 -47 87 74 -82 -123 -150 -124 -64 -153 -188 -262 -214 -277 -216 -222 -132
-120a32O5m0J47Kr3n4j8J31J5l2k0Q8r0o6Lr6P4O4l0N6nq6J28l3o9J3J39k9l8j4q6kk6K3M
-129a07L8L9p3mO4k2M1O8L5j11q2j3j8PK5L4q5JM8J46k3j1N6p1j4M0K8O6p9q2jQ4P3j47m8
-137i8m8k9M0j61l8J58N3o7J9R4j1oJ6J20J9j25M7O6l4o6m4K7M2J0L8l4p4m8J73l1l3K4Qr2
-145h5O2j5jP4m9J1M4N4j26j14N7l3L3j08R6M8O6j2q3O1n6JL6L6Nk0Rj9J9n2L7Q1n3q5p4P4
-154h1Rj12K9L9O9r3L6m7P7J4p0O8L0j05M2j56Q1J48j8l8J5m2Q7m2n3L1J39J1K7M4k5K8j01
-162D1q4Pl9O3o5N5k9m8J27k7j4ml4l8L5K1j11p7N6O6kP7k4J9q2J2rj3J7R7o5L0k1J20j21
-171f4J42l9m4l4J30n0j16m7j2M9J6j27J09l8N3p0j7L9rk2J11P2j13p7pM8P9J19r8%K6p2J3
-179e0n3Q1m3j05l2j1n1J3R5J03J30j2mj13R2k2nj13q2M8L7j08l4J09%N5Q7Q3J5P2p7m3m0
$$ plain form
-120 -132 -67 -107 40 42 -51 -105 -123 8 23 -9 -29 59 -31 -97 -94 -190 -116 -52 -82 -26 -31 -117 11 -22 -91 -78 61 32 -6 -20 -106 -108 -134 -111 -107
-129 -107 -69 -30 -103 -107 -43 -65 -24 44 79 -32 -114 -127 -145 -138 -113 -79 -164 -163 -115 31 8 -3 53 -18 -32 8 36 102 23 -59 -60 24 97 -50 -98
-137 -98 -146 -175 -135 -296 -334 -176 -123 -190 -171 -77 -88 -94 -78 42 61 -64 -17 49 15 -51 -95 -68 -26 -16 22 -12 -86 -134 39 8 -25 -1 7 -85
-145 -85 -23 -38 -39 35 -14 -3 41 95 -31 -145 -88 -121 -88 -196 -100 -52 14 2 -81 -20 -76 -75 -39 -3 2 -18 -9 -28 -9 -61 -24 57 4 -81 -155 -81
-154 -81 -72 -184 -155 -116 -47 -140 -104 -151 -74 -60 -130 -62 -32 -137 -95 -251 -170 -22 -40 -78 -63 -105 -18 -60 -113 -82 57 68 95 139 114 142 41
-162 41 -43 -36 -75 -12 -77 -22 -51 -99 28 1 -13 -17 -51 -89 -54 -33 -144 -221 -165 -99 -101 -24 -48 -29 -111 -99 -108 -121 -104 -7 -72 -42 -63 57 -64
-171 -64 78 39 -5 -39 91 41 -75 -122 -134 -85 -69 -196 -87 -125 -72 -142 -159 -120 -129 -151 -40 32 -81 -158 -165 -117 -38 81 -17 -17 9 -63 -50
-179 -50 -103 -22 -65 -170 -202 -213 -264 -251 -156 -53 77 65 61 -52 40 18 13 -100 -182 -134 -97 -205 -239 -130 -130 -75 12 95 110 182 105 62 22
-187B2Mp5Kl9mMk7O8m6n8M7L8L8P8k0r0RP1p6r8L4J77r0J33j12k7LK0p3K9m0o6m4J8j5L2J1
-196a62RJ12J6j6k3j65L0J12M7qp4L4R1J1L8Nq7kK4j83O6J17j76j05K00Q5J20r2o7R9n5K8
-204B9O9n0k5m7N1j25j10P3N8J8L7J3M5j3j7l4q2j3J8q5J02l3L4j8L8q8L2J01L0k09N7j3p9
-212b36J26M5J9N1j18O2nLM8K3l9o5j20L3K7P9L5o0K6L7n8M3N0MoK5j15q3L0M2Jl7oJJM0n0
-221a47k1N3J42k5M1m5j37k7j4M3J23J18L1m1l4j76l7L5N6k6%L3R8P3k5n4k1j01l8o6J32o7
-229a24ko8j3R0p5J08Q3Pj06J8m1R6L4qJ9o4o5L1L4K0K4lk9J2k5k6J0j2j8J2p9J60M4j13K7
-237d2nJ0rm4O9o1l0M2N5O4l0m6r2Q5Q9p0kM8J8n1r2M7K3j02j17J23k2J10j0j50N2J85Nr7
-246d7K7m1O1m6j28J69M0p9Ok4Lk5N9o4K0Q7k8K3j32p0J30K3r4j2l6K4Q3R3q2j18M7R0K0m4
$$ plain form
-187 22 26 -49 -47 -86 -90 -86 -113 -45 -91 -149 -102 -64 -26 52 32 -58 -49 22 -54 -152 -118 59 -31 102 -10 -37 -34 -14 -87 -58 -98 -164 -208 -190 -205 -173 -162
-196 -162 -153 -41 -25 -41 -64 -229 -199 -87 -40 -48 -122 -88 3 14 52 57 -30 -32 -8 -191 -125 -8 -184 -289 -89 -4 116 24 -43 56 1 29
-204 29 98 48 23 -24 27 -98 -208 -135 -77 -59 -22 -9 36 23 6 -28 -110 -123 -105 -190 -88 -121 -87 -105 -67 -155 -123 -22 8 -201 -144 -157 -236
-212 -236 -110 -65 -46 5 -113 -51 -56 -53 -5 18 -21 -86 -206 -173 -146 -67 -32 -92 -66 -29 -87 -44 6 10 4 29 -86 -169 -139 -97 -96 -133 -139 -138 -137 -97 -147
-221 -147 -168 -115 27 2 43 -2 -139 -166 -180 -137 -14 104 135 94 60 -116 -153 -118 -62 -88 -88 -55 43 116 91 37 16 -85 -123 -189 -57 -124
-229 -124 -126 -194 -207 -117 -192 -84 -1 6 -100 -82 -123 -27 7 -1 18 -46 -111 -80 -46 -26 -2 -5 -34 -22 -47 -73 -63 -75 -93 -81 -160 0 44 -69 -42
-237 -42 -47 -37 -46 -90 -21 -82 -112 -70 -15 49 19 -27 -119 -34 55 -15 -17 31 49 -2 -94 -47 -24 -126 -243 -120 -142 -32 -42 -192 -140 45 50 -47
-246 -47 -20 -61 0 -46 -174 -5 35 -44 -38 -62 -59 -84 -25 -89 -69 18 -10 13 -119 -189 -59 -36 -130 -142 -178 -154 -71 22 -60 -178 -131 -41 -21 -65
-254f5P2O6o3PM6j11Lj20J5Q8o0J2K39m5k0M9o3K5q2L4j7q9O1J3m9o6j3R4N5k4j06M9N7p0
-262g8O3K6k0r6Q9M9P6l5K9n3j1l4P9r1K1L1nr9J0%o6p7J04P9o8j20M1R6Q4m3qJ5p0j03j5
-271b00J5J07L0Q8K0j2j17j90n4K12N1K8n3N8M3qo0r3n3P8J4q4J26R2j74L9K6ML3Q5j31k7
-279a07K9J83O2j08J2q8m0K7n9n7n6L6R0j0j17J14J0RJ02L1o2l6N2%M6K6j22j26Q3k5K8K5
-287d8o0n6k7j02Q1J57KO2o3M9Nj1K1N4l4r8K0j68O5P3R1j1j10n2P0P8n2J2n6q4K02L9m0r4
-295h5OJ71m4j11j08J9J03LJKJ4K3J5J0p1O4l4k6J9j9P0l6o5o5J0J0k0Ko1j5J17K58q9n8o7
-303e7l9J7o9J65J63p1j05K2m2J0N4l6k8J6o0o6M9J53J9j56l0N2J06j00j41J7P3m2O7N3J46
-311A40L8r1j09q9K6n7J13J3N0q0k8KL2R8Q7p2j17K5j03j1J17m6l4oM5j6l7P0mqJ0j9J01j75
$$ plain form
-254 -65 7 73 10 17 63 -48 -45 -165 -150 -62 -122 -110 129 84 64 113 50 75 -7 27 10 -79 -18 -5 -54 -120 -133 -39 16 -8 -114 -65 -8 -78
-262 -78 -15 11 -9 -105 -16 33 109 74 103 50 39 5 84 -7 14 45 40 -59 -49 -49 -115 -192 -88 -9 -77 -197 -156 -60 24 -19 -27 -12 -82 -185 -200
-271 -200 -185 -78 -48 40 60 48 -69 -259 -313 -101 -50 -22 -75 -17 26 18 -42 -135 -188 -110 -96 -180 -54 38 -136 -97 -71 -67 -34 51 -80 -107
-279 -107 -78 105 167 59 71 -17 -57 -30 -89 -146 -202 -166 -76 -86 -203 -89 -79 -70 32 63 1 -35 17 17 63 89 -33 -159 -76 -101 -73 -48
-287 -48 -108 -164 -191 -293 -212 -55 -53 9 -54 -5 0 -11 10 64 30 -68 -48 -216 -151 -78 13 2 -108 -160 -90 -12 -64 -52 -108 -192 10 49 9 -85
-295 -85 -79 92 48 -63 -171 -152 -49 -46 -45 -43 -29 -6 9 19 -52 12 -22 -48 -29 -48 22 -14 -79 -144 -134 -124 -144 -142 -203 -218 -101 157 68 10 -57
-303 -57 -96 -79 -148 17 180 109 4 26 -16 -6 48 12 -16 0 -60 -126 -77 76 95 -61 -91 -39 67 -33 -174 -157 -84 -126 -59 -6 140
-311 140 178 87 -22 -111 -85 -142 -29 -16 34 -46 -74 -72 -40 58 145 73 -44 -19 -122 -133 -16 -62 -96 -102 -57 -73 -110 -40 -44 -52 -42 -61 40 -135
-319a35R3P9j0N6O9q0o2j25o4M1J09K1M6o4j19P9Q1j2p9pL7R6n7n8L4M8J1j65J31MJ5J3L0
-327E6r1pj1j41N8M6J03N6M0%n2n7n0K3j46J37J78rl3k9k03N6k4K1K0j15O8J19M1q0On4p5
-335a49L4K5k2K8o2K6O0n9l4Q2M6O4j6L3J6j1k4o6K8J6j4MNN2m6k39P1L2L0o0M9n3J40p8%
-344i2P8qN2j08m5J0N4j8J6k4L0N2l9n0K9O5J01L0m0Mj6j02o2M4q7P4R5K18k1n8j48m3l4l4
-352g7k5r3k7Q1R2n3k0JN9MK2J34J5o4j49mJ9Q4J15q0p7L8Q9k2j22P8O5K1j23rJM3K1Rj16
-361g0k2M5l9J29M5j67j1L7J57j1o5k1k2j91K1Q6N7L0l6J3n5P0m7M5n2m7O9j9M7J59p3j62
-369a00N5l6L3J4N4J32r7n5j00m5N7pm1RL5P8q8mP6P0m4l8k6L6J31k4o9J4J27m3j34m4R5Q9
-377A10j9m5r8J3q9O7M1K2k1O7J0Oj77J09Q7m4n6m4k1J3q1J42k4m0Q9n2J8J7o9K9n4L9k0p
$$ plain form
-319 -135 -42 37 27 83 152 72 10 -115 -179 -138 -29 -8 38 -26 -145 -66 15 3 -76 -83 -46 50 -7 -65 -31 17 28 -137 -6 -2 13 26 56
-327 56 -35 -42 -53 -194 -136 -90 13 69 109 109 57 0 -50 -27 -173 -36 142 133 100 71 -132 -76 -100 -79 -59 -174 -106 13 54 -26 -20 -74 -149
-335 -149 -115 -90 -112 -84 -146 -120 -60 -119 -153 -71 -25 39 23 56 72 61 37 -29 -1 15 1 5 10 62 16 -223 -152 -120 -90 -150 -101 -154 -14 -92 -92
-344 -92 -14 -22 30 -78 -123 -113 -59 -77 -61 -85 -55 -3 -42 -92 -63 2 103 133 93 97 81 -21 -83 -39 -126 -52 43 261 240 182 34 -9 -43 -77
-352 -77 -102 -195 -222 -141 -49 -102 -122 -121 -62 -58 -36 98 113 49 -100 -104 -85 -1 114 34 -43 -5 84 62 -60 18 83 104 -19 -28 -27 16 37 46 -70
-361 -70 -92 -47 -86 43 88 -79 -90 -53 104 93 28 7 -15 -206 -185 -99 -42 -12 -48 -35 -90 -20 -67 -22 -74 -121 -52 -71 -24 135 62 -100
-369 -100 -45 -81 -48 -34 20 152 55 0 -100 -145 -88 -95 -136 -127 -92 -14 -102 -106 -30 40 -4 -42 -68 -32 99 75 6 20 147 104 -30 -74 21 110
-377 110 91 46 -52 -39 -128 -61 -20 2 -19 48 58 64 -113 -4 83 39 -17 -61 -82 -69 -150 -8 -32 -72 17 -35 -17 0 -69 -40 -94 -55 -75 -82
-385h2Pj7J5lL6j15j00N3J45L0j39l1R9QN4P6k9K5M4K2p1L2j19r1n5J15j6K6J7L5p8Q0J15
-393H8p8n5R8m1Q6j01j24J4J70n3P0P8k0p7mj5j00J4K4K6j3P3J62j77K3J0J0l5K3l9o4r1m0
-402a58P7R2K9n7j2O7l2j27r0N7J8Q3o2m2k7L9L3p0k1O0J5J3o1K9O4J15r5n0P7P4Rk1Q6N4
-410A66j72j63j7%j9k0Q3nJ20pj33K7k8PM6K9J17K2j52L7K1RP3l4J7j06l7k2K2M4Q3m0n7J
-418h8kO9mRJ6n6N8k0np9j6J50L5j29o8O6m2K7P5o4N1O9p3j58N7J57o3K1K7k4N6j09p7q8J04
-427a18J46J3p4m6p2K8P8M3k4l1oJ13m9rk2L8J9j1o9no1n3j22J23N6J15P5j90o2k3O9J63m1
-435iK2m9m1J20J9jl3k8mo9M2j8N2l0k4KQk9o0m6Q6l0J04l7n6NN7k1NK1m8RP9O5n2l0K7l8
-444c0j03O3K5k8L7JM5J6K8j49K4Q2k9o0p1m3J59p6L2J24L8mp8o2J06m2l4lJ3j6Q2m7J62j7
$$ plain form
-385 -82 -75 -92 -77 -80 -44 -159 -259 -206 -61 -31 -170 -201 -102 -94 -40 36 7 32 76 98 27 59 -60 -151 -206 -91 -107 -81 -64 -29 -107 -27 88
-393 88 10 -45 53 12 98 -3 -127 -113 57 4 74 152 132 55 51 36 -64 -50 -26 0 -13 60 222 45 68 78 88 53 76 37 -27 -118 -158
-402 -158 -81 11 40 -17 -29 38 6 -121 -211 -154 -136 -53 -115 -157 -184 -145 -112 -182 -203 -143 -128 -115 -176 -147 -83 32 -63 -113 -36 38 47 26 112 166
-410 166 -6 -169 -186 -186 -205 -225 -142 -147 -27 -34 -167 -140 -168 -161 -115 -86 31 53 -99 -62 -41 -32 41 7 24 -82 -119 -141 -119 -75 8 -32 -89 -88
-418 -88 -90 -21 -25 -16 0 -56 2 -18 -23 -102 -118 32 67 -62 -130 -64 -106 -79 -4 -68 -17 52 -21 -179 -122 35 -28 -7 20 -4 52 -57 -134 -222 -118
-427 -118 28 41 -33 -79 -151 -123 -45 -2 -26 -57 -63 50 1 -8 -30 8 27 16 -53 -58 -119 -172 -294 -171 -115 0 75 -115 -177 -200 -131 32 -9
-435 -9 13 -36 -77 43 62 61 28 0 -4 -73 -31 -49 3 -27 -51 -49 -41 -70 -130 -176 -90 -120 -16 -53 -109 -104 -47 -68 -63 -42 -90 -81 -2 63 11 -19 8 -30
-444 -30 -133 -70 -45 -73 -36 -35 10 26 54 -95 -71 11 -18 -78 -149 -192 -33 -109 -77 47 85 81 3 -59 47 5 -29 -32 -19 -35 47 0 162 145
-452A45j26q4M2o2L2O0r3Q7L7K1m9k6k0rQ7N6j14KL4kN2j9kJ3R7m3j06RO7n1k2M8oM5j5n6
-461B9k4l2N0M1K1k4j12l7K4L7m1mN4%l4J5O6m3n6k2Q0O4j4n5L6N1p1RJ2k4l9n1n4K6J03M
-470a5L9n5q9J11Ok3K7j3Pm8jPM7J15q7j9n4K7q3K7J29m1r0K3jq5R9N7j67J22K08j16j33P3
-478DM6k3m6l3K2J06k1j09J8M2O2N5j16l2m2k9K1j3K2K8j06q2Q6Q8O1p3l6J13O4pl5M4jr0
-487a2J8p7l4J3k7p2J61M9m4n7n5J10P9m8mQ3n9M8m1m3r2O8N6j6kJ20j46m6n6l6J35j5L0J7
-495EMq4j32J36J27p1j24RM1M6k5l9k4j7L4Q9o5m5O5O0J%O3J4j7m5j06J24oO7k6m0j0m6oo3
-504a06P5k0N1p9o2P8l6M2j15L5k9o1k2P2J09P6p7O6l4J6N0L8k7m1MN0J6j7l7J16j51kj4l
-512c9O5M7k9l1kM9o6KN6L4j14j3l9L7P5j06J05L4j3m4J7qj66l1M0mJ7oJ42m1MJ57PM9M8q0
$$ plain form
-452 145 19 -65 -23 -85 -53 7 -86 1 38 59 10 -16 -36 -45 42 98 -16 -14 20 18 70 51 49 62 159 116 10 19 86 35 13 61 55 100 85 29
-461 29 5 -27 23 64 85 61 -51 -88 -64 -27 -68 -72 -18 -18 -52 -37 29 -14 -70 -92 -12 52 38 -17 19 70 -1 8 20 -4 -43 -94 -148 -122 -19 -15
-470 -15 24 -31 -120 -9 -3 -26 1 -12 -5 -53 -54 -47 0 115 28 9 -45 -18 -101 -74 55 14 -76 -53 -54 -139 -40 17 -150 -28 180 64 -69 4
-478 4 50 27 -19 -52 -30 76 55 -54 -36 6 68 123 7 -25 -67 -96 -75 -88 -66 -38 -144 -226 -140 -52 9 -64 -100 13 77 70 35 79 78 -12
-487 -12 6 -71 -105 -92 -119 -191 -30 19 -25 -82 -137 -27 52 4 0 83 24 72 31 -12 -104 -36 20 4 2 122 -24 -70 -126 -162 -27 -42 -12 5
-495 5 9 -75 -207 -71 56 -15 -139 -130 -89 -43 -68 -107 -131 -148 -114 -25 -90 -135 -70 -10 -9 -9 54 68 51 6 -100 24 18 85 59 19 9 -37 -43 -106
-504 -106 -31 -51 0 -79 -141 -63 -99 -57 -172 -137 -166 -227 -249 -177 -68 8 -69 -3 -37 -21 29 67 40 -1 3 53 69 52 15 131 -20 -22 -36 -39
-512 -39 26 73 44 13 11 60 -6 -4 52 86 -28 -41 -80 -43 32 -74 31 65 52 8 25 17 -149 -180 -140 -144 -127 -133 9 -32 -28 129 136 185 233 153
-521A53j41M3J8K3N5j17j5J1L5L3l2o4o4N8o1L7p0m2J8J3M4m1O6M0L9o4L4n5n3l9P0J75j63
-529e6K6k9L6N5mP8m1j31j8l9K5R6P4K3o0l9nJ0j21K0j37R4J64q3PM2M4qn2k8k9R5Q8m1j20
-537f4J4K5ok8J14J11j64j76Q3j0J45k9k00O3kn0jO2Q0L3Pjn0m3J03k5M5J7m9j10l5J06J5
-546b0N2n3l6L0j00J10M1Or0ln3O4J37Lo8j24R0O9n9m3%q2n6R4M6K2O6K9k4o2pj9j17m1L2
-554a66M5R4o4K8J08pm8O1n5o4M4RN7j19J08rjP0j4p0O4j0l4r7r7kO4l4OR3k7M0p8%J4o3l1
-563a85K4O8M5Q2o2J33R1j11j16l6o2L8K9O2p0JJ3J46o8j5L4K5j13j9J02n1m9L6O1L0p1j1
-571a9K1OJ03J7r4P2k7k8n0M2m4k3ok9k8N0Ql7n6K6J15l5ML2m2k5p3K0K3L2Q3p7j10J37J49
-580A37Pl3o7K1n2JJ5m0n5J54o7l4J30q9k4Q4J77l9j26r0q2O3n9J29J6j30n6P3m2J4knL7L8
$$ plain form
-521 153 12 55 73 96 151 34 19 30 65 98 66 2 -62 -4 -65 -28 -98 -140 -122 -109 -65 -106 -40 0 39 -25 9 -46 -99 -138 -68 107 -56
-529 -56 -30 -59 -23 32 28 106 65 -66 -84 -123 -98 -2 72 95 35 -4 -9 1 -120 -100 -237 -143 21 -62 -55 -13 31 23 -29 -57 -86 9 97 56 -64
-537 -64 -50 -25 -31 -59 55 166 2 -174 -91 -101 44 15 -185 -122 -124 -174 -175 -113 -33 0 7 6 -44 -87 16 -9 36 53 4 -106 -141 -35 -20
-546 -20 32 -21 -57 -27 -127 -17 24 30 -60 -63 -116 -52 85 88 20 -104 -14 55 -4 -47 -47 -129 -185 -91 -45 -23 43 72 48 -14 -21 -40 -157 -198 -166
-554 -166 -121 -27 -91 -63 45 38 -10 51 -4 -68 -24 -15 42 -77 31 22 21 91 77 7 71 61 27 -70 -167 -169 -105 -139 -133 -40 -67 -27 -105 -105 -91 -154 -185
-563 -185 -161 -93 -48 34 -28 105 196 85 -31 -67 -129 -91 -62 0 -70 -69 -56 90 22 7 41 66 -47 -66 36 -15 -64 -28 33 63 -8 -19
-571 -19 2 8 111 128 34 106 79 51 1 43 -1 -24 -30 -59 -87 -37 -29 -66 -122 -96 19 -16 -12 20 -22 -47 -120 -100 -77 -45 38 -39 -149 -12 137
-580 137 144 111 44 65 13 14 29 -11 -66 88 21 -13 117 28 4 88 265 226 100 10 -72 -9 -68 61 77 -53 -109 -36 -78 -64 -66 -71 -34 4
-588DM0q7jl6KJ09l6N3P5r3j5r4l8N9q8j3Q9N8n0p3P7N8j50l5O8K00%o2k5O3N1j41r5l9J25
-596d0M4mk1R8o7j08L6J6N8j09j6O3lL4p5k3O3O1P8m7l7j0K6K0j3mj2o5L6j7l5k9L7K9p8K4
-605i0n5o7J69J52j18q7O4m6Lr0qN5l2JN2K7O7J79j06j24l5r7J86J01j4L6K9j18K2Jo0k2M2
-613A7k4J09Jj13k2Q8l0k6N2r5l5Q5M7q8q2mJ33m9M0M7q4o6P0Q7r0o9J1k09O5J20j7J63M1
-621G3m4j10j0L5r0P8Q6j40J06QL1k1KpJ5rJ02m9k0kq8J9r0L6JK1P4OJ3j26J23L9J3j50O3
-630a2Rj40q1Q1J03l0oJ47K1M8m9m5l8jL5Kq2l0m9n3pm0Qj4J37Q8M3O4l0j26l7J33P6j31k9
-638c5L5J0j07l0K2J04j0M4j7j01j8k6M7j8J06M5o0m5j2n3j0J68K8j1m3j22j8O5p8j4N4P8
-646b2lj7J0p7M4O0R8j08j86J11L7J02n9j03K8j8J2N9J5qN8MO6O2n4j19QP0N2k7j7m4j39k9
$$ plain form
-588 4 44 -43 -44 -80 -78 31 -5 48 123 30 15 -79 -117 -58 -146 -159 -70 -12 -62 -135 -58 0 -150 -185 -117 83 83 21 -4 59 110 -31 -126 -165 -40
-596 -40 4 0 -21 77 10 -98 -62 -46 12 -97 -113 -50 -53 -19 -94 -117 -54 7 85 38 1 -9 17 37 24 20 8 -57 -21 -38 -73 -102 -65 -36 -114 -90
-605 -90 -145 -212 -43 109 -9 -96 -32 -78 -75 -165 -173 -118 -150 -149 -97 -70 -3 176 70 -54 -89 -186 0 101 87 123 152 34 56 57 -3 -25 17
-613 17 -7 102 103 -10 -32 56 26 0 52 -43 -78 7 54 -34 -116 -120 13 -36 4 51 -33 -99 -29 58 -32 -101 -90 -299 -234 -114 -131 32 73
-621 73 29 -81 -91 -56 -146 -68 18 -122 -16 -8 23 2 4 -3 12 3 105 56 36 34 -54 -35 -125 -89 -88 -67 7 13 26 -100 23 62 75 -75 -12
-630 -12 -3 -143 -224 -143 -40 -70 -76 71 92 140 91 46 8 7 42 44 -38 -68 -117 -170 -177 -217 -209 -223 -86 2 45 109 79 -47 -84 49 125 -6 -35
-638 -35 0 10 -97 -127 -105 -1 -11 33 16 -85 -103 -129 -82 -100 6 51 -9 -54 -66 -119 -129 39 67 56 13 -109 -127 -62 -140 -154 -100 -22
-646 -22 -25 -42 -32 -109 -65 -5 93 -15 -201 -90 -53 49 -10 -113 -85 -103 -91 -32 -17 -25 33 37 103 165 111 -8 0 70 122 95 78 34 -105 -134
-655a34P3P4n0M7O7j7M0m0l3P1Lk5N4k3o8j71Q2J47L6r8mK6M6o9O5l7K5M7Pj03j21J2J28o5
-663hl4K05o2l4KQj05k5j6k3j3L8Rj5R2koK5J33N4j16o0q9k0N1kr1J24m2P0k5j5k6R9M3p7
-672D7o0L8nm3j3Q8m6q9J5J69K3r6j90K7nJ41M8N4n6r4N8P6Q6j20M1J3K4o8j16NP7m4n0j19
-680a84J91OL5P4k6q5j27Q1pJ22%j1O6j3k23%Q6l9N1J54p4n6l5q5o5o1J56k3N0j4Q3O9j1j02
-688a7k18J71N1m3n2J47P3l1m8rm9R8j05mj7J37PM8q5q9m0j3o2K6J15k7Q4o7q4M2J02L3m8
-696B6m4n5p0M2O9OJ4M0O8Rp3p3L7M9k7N2K1q8K8m4o4j2M1P3k0l6k3J5l0l3PkJ1R1M4j03n1
-705a05K7K2l2M8J6J07j68p8r4J13J39j5Nj1J2j2Km9K8oo6O8P1K6k0%L4O2K1j5J0q3kq4L4
-714EL0Rm4p5p3nJ5P8n0Q5J00j00jP1K8n4PQ3Q2j30o7JL2Kl4J0m4j9p9m4M8K2L9J40n6o9j3
$$ plain form
-655 -134 -61 13 -37 10 77 60 100 60 27 98 101 76 130 107 39 -132 -50 97 133 35 31 57 103 34 99 62 87 134 141 38 -83 -71 57 -8
-663 -8 -42 163 101 67 69 77 -28 -53 -69 -92 -105 -67 -58 -73 19 17 11 36 169 223 107 47 -42 -62 -11 -13 -104 20 -22 48 23 8 -18 81 124 47
-672 47 -13 25 20 -23 -36 52 6 -83 -68 101 124 28 -162 -135 -140 1 49 103 47 -47 11 87 173 53 94 107 131 63 -53 -48 29 -15 -65 -184
-680 -184 7 13 48 122 96 11 -116 -35 -42 80 80 69 135 122 -101 -101 -15 -54 -3 151 77 21 -14 -99 -164 -225 -69 -92 -42 -56 27 96 85 -17
-688 -17 -235 -64 -13 -56 -108 39 112 81 33 24 -25 73 -32 -36 -53 84 91 139 54 -35 -75 -88 -150 -124 -9 -36 48 -19 -103 -61 41 74 26
-696 26 -18 -73 -143 -101 -32 -26 -12 28 96 105 32 -41 -4 45 18 70 91 3 31 -13 -77 -89 -48 25 5 -31 -54 -39 -69 -102 -95 -97 -86 5 49 -54 -105
-705 -105 -78 -56 -88 -40 -24 83 -85 -163 -257 -144 -5 -20 -15 -26 -14 -26 -24 -73 -45 -51 -117 -49 22 48 28 28 62 124 145 130 140 57 55 -29 5
-714 5 35 44 0 -75 -148 -153 -138 -60 -110 -25 75 -25 -26 45 73 19 26 109 191 61 -6 -5 27 29 -5 5 -39 -58 -137 -181 -133 -111 -72 68 12 -57 -70
-723g0M5K3J50q9l3oK4Q1j33l9n1k8j2l8J03M9m1K7L9m4k4L9m9j0kl7J08o3o0P2J02rrj9N5
-732E1M8j6j31J3M5k3k0l8K0j9J4J4n9M0qP7K6l8j20R7PRn4J01jj9l9M0Q0j44r6J6O0N0o2
-740g9N9o5P4RN0r0k9m8m9J13J08ml8j47K8NQ4L8L6l5n9k8K4r2PM8k1N0J8j0m5Mk0L0N8M1
-749B5nN4l0m7M5K9K9Or3nPkj9j0k1j00Oq0J07R4P6q2K1j4K3j4j3Kp9K4Q4m4p1Q6O8J7r8J1
-758a3Lq7J19PO1po3j10n1K33om8r2J8P4J26r8j29l2Q0J28Ko0M7R2p1j28JLJ37N1j60j45J09
-767ir4R3o0OJ8M8N4N3j00J9Q2m9K1k8j70J42J23j20j4K0j01J4j4l2J8J8O1N6M9k5rp4r4n
-775a03k9K05Krll5J68l7j01j7o8QrL1N2O6r0j8J6J3K7p3n1L6j13RJ20j16J8R4o1l4Jn3P7
-783g7J55p3Ol1k8J1K9l9P6mj1k8K1J2o5rk1M4k4p2M8K6O5l2r4J55j1p9J00M7l7k4o1J01P2
$$ plain form
-723 -70 -25 -2 148 59 26 20 44 125 -8 -47 -98 -126 -138 -176 -73 -24 -65 -38 1 -43 -67 -28 -77 -87 -89 -126 -18 -81 -141 -69 33 24 15 -4 51
-732 51 99 83 -48 -35 10 -13 -33 -71 -51 -70 -56 -42 -101 -61 -69 8 34 -4 -124 -27 -20 -11 -65 36 35 16 -23 17 97 -47 -143 -127 -67 -17 -79
-740 -79 -20 -85 -11 -2 48 -42 -71 -119 -168 -55 53 49 11 -136 -108 -103 -19 19 55 20 -39 -67 -43 -135 -128 -80 -101 -51 -33 -43 -88 -84 -104 -74 -16 25
-749 25 20 74 44 -3 42 71 100 106 13 8 15 13 -6 -16 -37 -137 -131 -211 -104 -10 66 -16 5 -9 14 0 -13 -11 -90 -66 18 -26 -97 -11 57 74 -24 -13
-758 -13 -10 -97 22 29 90 83 20 -90 -141 92 86 38 -54 -36 38 164 66 -63 -95 -15 113 115 55 102 194 123 -5 -4 -1 136 187 27 -118 -9
-767 -9 -103 -10 -70 -64 -46 2 56 109 9 28 110 61 82 54 -116 26 149 29 15 35 -66 -52 -66 -98 -80 -62 -1 55 104 79 70 -4 -98 -103
-775 -103 -132 73 75 66 63 28 196 159 58 41 -27 -19 -28 3 55 121 31 13 29 42 69 -4 -55 -19 -132 -123 -3 -119 -101 -7 -68 -102 -101 -154 -77
-783 -77 78 5 11 -20 -48 -37 -8 -47 29 25 14 -14 7 19 -46 -55 -76 -32 -56 -128 -80 -54 11 -21 -115 40 29 -50 50 97 60 36 -25 76 148
-792A48l3lm8n4J5J9j0n0n9L7OKLr0PQ6K7p4O9J09m6K9L5q7po3k3m2M6J30p5J1Q6m5O1l3o
-801G8r3j28P0l3j6L5N9N8J76ln4K5q0J1n0m8O3l7M5n1n2P8pO8l9q3K0j8q6rJ59J79r5j02
-809D0l7L4j3j00N4K7Q4nq7n1P6oRj0Qj7j09M4m5OR8O4Oq3o5j2L1J12j00j32J02K6l7P1Q0
-818F3P0m9j28o2Q0M7J53M4k05j32N3Q4q1l5J06m0N3N1Oo3n0L5O0J02m1ko1K1n5q0K7j0J22
-826H3j08mp1P9R3l4J30L1m6m5P5J1j15j00J8Q6o9QJ51K7j38o4N0p3K1J3n7Q9n5j39K7M9K0
-834e7J7k5k5J8j08k2M0J91l4Qq8q6Q2J34m9P5l3K3J06o4Jp1n5M4P5r0l0J01j8Qj24m2M7L2
-842a9M2Q6m7n3K5N6J7q4j8J00o7m7p8N3K1j46P3N2K9k5%oNj4P6J37n2j60M7L6k2L0JoN4p
-851H9j2j81J31J06n6%K7m2mQp0j2J05K4L0j09l8j9m3J37n2O2N4j9o7l0m8K5J3p0Q4J38l9
$$ plain form
-792 148 115 112 64 10 25 44 34 -16 -75 -38 -32 -30 -27 -117 -110 -24 3 -71 -2 107 61 90 125 38 31 -32 -55 -97 -51 79 4 15 101 56 117 84 78
-801 78 -15 -143 -73 -106 -122 -87 -28 30 206 203 149 174 94 105 55 7 70 33 78 27 -25 53 46 114 75 -8 12 -6 -92 -101 58 237 142 40
-809 40 3 37 24 -76 -22 5 89 84 -3 -54 22 16 25 15 23 6 -103 -59 -104 -98 0 64 70 -13 -78 -90 -59 53 -47 -179 -77 -51 -88 -17 63
-818 63 133 84 -44 -106 -26 21 174 218 13 -119 -66 18 -63 -98 8 -32 21 72 78 15 -35 0 60 162 121 119 58 79 24 -56 -29 -39 83
-826 83 -25 -29 -100 -21 72 38 168 199 153 108 183 194 79 -21 -3 83 14 22 173 200 62 -2 48 -25 -4 9 -48 41 -14 -153 -126 -77 -57
-834 -57 -40 -65 -90 -72 -180 -202 -162 29 -5 3 -85 -171 -89 45 -4 71 38 61 167 103 104 33 -22 22 97 7 -23 78 60 68 -56 -98 -51 -19
-842 -19 23 109 62 9 34 90 107 23 5 105 38 -9 -87 -34 -13 -159 -86 -34 -5 -30 -30 -36 -31 -45 31 168 116 -44 3 39 17 47 48 42 96 89
-851 89 77 -104 27 133 77 77 104 62 58 66 -4 -16 89 113 143 34 -4 -23 -66 71 19 81 135 116 49 19 -29 -4 9 -61 23 161 122
-859A22k5m1n4O7o5l9JN3Nk2qjp7J18n5k8Q1L5j54rJ18Ok7q4J4J1O0Pn9k0r8L3J66J1J2p2
-868a8J01R4r4k0Jl8j4l7j7L3l5o5Q4J25MJ13l3j10l2j8k0M7n3j0O6J1j18mL1K0N3o2l1J40
-876I4q7L6Pk4j0q4mm6M9R7PJ66k9J7j00p0k5K4J4k6NJ11J3n9N6J21o9j07j70M7nr2J10J06
-885G3P9o6l3n8j25n5P4J08J02p4j09K3M9P9m0j50O3Q9n0J5J8ONk3m3O8q7j7L3j42J02O0L0
-893Dj08O4j1L1P8J8j06j35L7J11Lo1o5k0P9O2L2J00Jj24P3l1m2O3n2qR5q9n5j9n8O9J41k7
-901E0o1p4L0j3q7O3o5N4J78o6J3O8j28r9k2J12M9K5J9j5o8q5N3O4n1k7jK4J71p1o4J3M9k7
-909A1J1mk2N1j30PJ12J9p1j3n0n4J11m6K8N7p2j5k6Q1J9N9j19j1J32L0n5rJ9j71J3R4o8L3
-918d9N7N8J7m0l8k7rQ2O9N7j44l5K5k7l1nJ32R1j31o6M5k4k7L8RK5O4N1L4j81j46J03K3j38
$$ plain form
-859 122 97 56 2 69 4 -35 -34 19 24 2 -6 -7 -84 34 -21 -49 32 67 -87 -96 22 28 1 -83 -69 -58 2 9 -50 -70 -168 -135 31 42 54 -18
-868 -18 83 177 83 63 64 26 12 -25 -42 -9 -44 -109 -25 100 104 217 184 74 42 24 4 51 -2 -12 54 65 -53 -57 -26 -6 47 -15 -46 94
-876 94 7 43 50 26 16 -68 -72 -118 -69 28 35 201 172 189 89 19 -6 18 32 6 11 122 135 76 132 253 184 77 -93 -46 -51 -143 -33 73
-885 73 152 86 53 -5 -130 -185 -111 -3 99 25 -84 -61 -12 67 27 -123 -60 29 -21 -6 12 18 23 0 -43 25 -62 -79 -46 -188 -86 -26 4
-893 4 -104 -40 -51 -20 58 76 -30 -165 -128 -17 -14 -75 -140 -160 -81 -19 13 113 114 -10 63 32 -10 53 1 -7 88 -1 -56 -75 -133 -64 77 50
-901 50 -11 -85 -55 -68 -155 -92 -157 -103 75 9 22 90 -38 -137 -159 -47 2 27 46 31 -37 -122 -69 -5 -56 -83 -84 -60 111 40 -24 -11 38 11
-909 11 22 18 -4 47 -83 -76 36 55 -16 -29 -79 -133 -22 -68 -40 17 -55 -70 -96 -15 4 63 -56 -67 65 95 40 31 50 -121 -108 -14 -82 -49
-918 -49 8 66 83 43 5 -22 -31 51 120 177 33 -2 23 -4 -35 -40 92 183 52 -14 31 7 -20 18 27 52 116 167 201 20 -126 -23 0 -138
-926a38N9O2p9K7P0J02Poj52j9kN4j5k0NO1O1o6KO6n8R2Q1kq1rj05J5l2K4j1N6l7k9m3P0q1
-935g1j0J5L9o8M7m6N1O8j3L6P0n1m9p7K3nj07J07K7r8L7PL8j2L8Rk9r8J53L1j31O9J82K9
-943B11j58P6j1r4K4p0kk7j8N7K6l8L0m8j2qk3N2M2P8l3q1p1K5K6P4j0J5J7p5j8O4J8N5j7
-952G6j77l8J27R9l0m6K1J8j12J7P8p1J72n3j22N7J39n4O8p7j48m0P0O6N4k5nk0N7J34p3q
-960A54j10P4j20m0R4l3j3j04M4P7L8N1L8j38LNp9OPO2Pj10O5p9J78q0j1K5J0n8K3o1%R0K2
-968C7j30Q0k6N9J24l5K6L5r3m4k9j0%N5l2JOP2M0Oq6l0L8N3o9j25K1P2P2K1n1k3j63N9m2
-977a11m8O5mP6J24m7m9o4O8L7L9l3p6l5p6O3J7L0j0q0J00L1r2O1K5q6R8Q0m1m9J4J7P0nj13
-985dj78N7j36K19P9j06L3n5j7Q4r2kJ51L2k8o9J03l9k1J21M8p4Q7p6l6J00P5r2j03j41O5
$$ plain form
-926 -138 -79 -17 -96 -69 1 103 110 104 -48 -67 -69 -15 -30 -50 -45 16 77 11 13 79 21 113 194 192 111 102 -3 12 -20 4 -7 49 12 -17 -60 10 -71
-935 -71 -81 -66 -27 -95 -48 -94 -43 25 12 48 118 67 18 -59 -36 -41 -148 -41 -14 -112 -75 -68 -30 -42 -4 5 -24 -122 31 62 -69 0 182 211
-943 211 53 129 118 24 48 -22 -24 -51 -69 -12 14 -24 6 -42 -54 -62 -85 -33 9 87 54 -27 -98 -73 -47 27 17 32 49 -26 -44 20 38 93 76
-952 76 -101 -139 -12 87 57 11 32 50 -62 -45 33 -38 134 81 -41 16 155 101 169 92 -56 -96 -26 40 94 69 64 44 101 235 162 154
-960 154 44 118 -2 -42 52 19 6 -98 -54 23 61 112 150 12 15 20 -59 -53 -46 16 23 -87 -22 -101 77 -3 -14 11 21 -37 -14 -75 -75 15 37
-968 37 -93 -13 -39 20 144 109 135 170 77 33 4 -6 -6 49 17 18 24 96 136 142 56 26 64 117 48 -77 -56 16 88 109 58 35 -128 -69 -111
-977 -111 -159 -94 -98 -22 102 55 6 -58 10 47 86 53 -23 -58 -134 -71 -54 -24 -34 -114 -14 17 -75 -14 11 -75 23 103 62 13 27 44 114 109 -4
-985 -4 -182 -125 -261 -42 37 -69 -36 -91 -108 -24 -116 -118 33 65 37 -32 71 32 11 132 180 106 193 117 81 181 256 164 61 -80 -15
-993a5M6o9NK4M5M9m1l1M8n5m2Rl8j05J4L1J54O3J4q6l8P6p4O4k5Rl2JJ12j9k5n7l8l3K8n
-1002c6N5J6l3L0j2k0O3J22m1n7Rl5j9L8qm9M1l9n3M8l4J0O0N6q4lo9j15J13L8L1j4M2N3m7
-1010E7L7l4m7q0m4O6P6j69L1K4J59N6p9NO1lJ2q8J09O4j08P1k1p9NJ4ok7L7K6L5j18j5j0
-1019A7J4N6l3j47j0J35n5K0R0m3j35J82OK2K0j33J2L5K6N6q3K8k6j79M4J7k3K7J04M8o3r
-1027B0j0q0M7J02pp9p9o4NR2J25p3p9J07P4N0l2p0j7p3K2m4j9j0L5K0R0no1n2R6k0L5O5q2
-1035B9j0K7O4O4q1J7o0J8n3M8P2o1m2p8mL1O8J14r4o0m6N1%pp4J37J51o0pn7m6L2j10n6L8
-1044d5R7mm1n9n0J02NL6Kn0m7Q9m7m3O7n8P7R7j8l7L3K9l0n3p3jJ12pq9o3O6O0L4j41l3N2
-1052c1rj19l3J50K1Q5K8l8j9j20n8M7Q9m2J19K2j2l9j78J0L3l3q7N2P2J2p9J7R3O8L5j03
$$ plain form
-993 -15 31 -38 -33 -9 36 85 44 13 61 6 -36 -27 -65 -170 -156 -125 29 92 106 20 -18 58 -16 48 23 32 0 1 113 94 69 12 -26 -59 -31 -36
-1002 -36 19 35 2 32 20 0 63 185 144 87 96 61 42 80 72 23 64 25 -28 20 -14 -4 56 112 28 25 -44 -159 -46 -8 23 9 51 104 57
-1010 57 94 60 13 -67 -111 -45 31 -138 -107 -83 76 132 53 58 119 116 128 40 149 213 105 176 155 76 81 95 89 62 99 125 160 42 27 17
-1019 17 31 87 54 -93 -103 32 -23 -3 87 44 -91 91 97 119 139 6 18 53 79 135 52 80 54 -125 -81 -64 -87 -60 44 92 29 20
-1027 20 10 -70 -23 79 72 -7 -86 -150 -145 -53 72 -1 -80 27 101 151 119 49 32 -41 -19 -63 -82 -92 -57 -37 53 48 -13 -65 31 11 46 111 29
-1035 29 19 46 110 174 93 110 50 68 15 63 135 74 32 -46 -50 -19 49 163 69 9 -37 14 14 7 -67 70 221 161 154 97 51 83 -27 -83 -45
-1044 -45 52 48 7 -52 -102 0 5 41 43 -7 -54 35 -12 -55 12 -46 31 128 110 73 106 135 105 52 -21 -22 90 83 -6 -69 -3 57 91 -50 -83 -31
-1052 -31 -40 -159 -192 -42 -21 64 92 54 35 -85 -143 -96 -7 -49 70 92 80 41 -137 -127 -94 -127 -214 -162 -90 -78 -157 -140 -47 21 56 -47
-1060d7k3P1L4M7j6q1R3j07J9j4Mp9Q9J4M7q9j1j45RJ48o7L6J08mJ22o7j11JJ8J19j42P7M7
-1068A00P2qj3j01o9l5L4m6K2Q2K2k2J0o6p0N9j7J42P1j5J5K9Kp0m4q8ROJ36J1j05n8j12N3
-1077f4J06J2J0q5J51q3L1qn3J0M3L0rL7O3N9pj63j08NM4r4K7PJ42k0j2o0K5K1j05K2n7l0
-1085a13P0K7PK2O8m4J4M3K6r0ML3j33N7l9q1M9M9J40k8Q3J3l4p5L1l7j5m0K4QM4Ooj65R8
-1094A6Q7k9n8Pq1m9J50J01p2r0J4l4k9P4l5q6J2j0R6Q8kj36K4J38L8k2l9n3OP1r6N2nJ17
-1102A65j89m8K3J2N9J3k6n1n9J25N9LJr1m8O8JJ4j6K6q6R1Q9J0j38q6N1OO6o9j3K2l1l4J65
-1110H4nP0m4k1K2o0o9r5J15O1J0q4j55O4n1KM3O7J3k7R4K4J6l4j42O4o7L7Q2J9l2k4RQ3J
-1119G0o4M5r6L7l3K5M8L7q3O2j6q7J52M1Q3O1k10j45mR0M3J3%J0K6l9nr%rJ36J3j21j14L4
$$ plain form
-1060 -47 -70 1 35 82 66 -15 78 -29 -10 -24 -20 -99 -10 4 51 -38 -49 -194 -185 -37 -104 -68 40 36 158 91 -20 -19 -1 118 -24 53 100
-1068 100 172 164 151 50 -19 -54 -20 -66 -44 38 60 38 48 -18 -88 -29 -46 96 167 152 167 196 198 128 84 -4 5 11 147 158 53 -5 -117 -64
-1077 -64 42 54 64 -21 130 47 78 70 17 27 70 100 91 128 191 250 243 80 -28 -23 21 -73 -46 -39 103 83 71 11 36 57 -48 -26 -83 -113
-1085 -113 -43 -16 -9 13 81 37 51 94 120 30 34 67 -66 -9 -48 -129 -80 -31 109 81 164 177 143 68 99 62 47 7 31 39 83 89 83 -82 16
-1094 16 103 74 16 23 -58 -107 43 144 72 -18 -4 -38 -67 7 -28 -114 -102 -112 -16 72 70 -66 -42 96 134 112 73 20 26 97 1 53 48 165
-1102 165 -24 -72 -49 -37 22 35 9 -42 -101 24 83 86 87 -4 -52 16 17 31 15 41 -45 46 135 145 7 -79 -28 -22 44 -25 -38 -16 -47 -81 84
-1110 84 79 149 105 84 106 46 -23 -118 -3 58 68 -16 -171 -107 -158 -156 -113 -46 -33 -60 34 58 74 40 -102 -38 -105 -68 14 33 1 -23 -14 69 70
-1119 70 6 51 -45 -8 -41 -16 32 69 -14 48 32 -55 97 138 221 282 72 -73 -77 13 56 69 69 79 105 66 61 52 52 43 179 192 71 -43 -9
-1128il5N6M0J11l5P5o1K8r5n2p2J22J33j53J6J49Jn9q3j59j45J34N3P3j9k3n0N5J9om3pP7
-1136C6Rm8J3M7o0M8l9m3K6qO7m8M8r3J2m1qQ8J8j09M1n3K4J93l0M5j29M1Q0Jn1pJ08j05R6
-1144A69k6r8o4K7l8j5J02N6L1j35r1J70k0n8r3k3oJ18j1N5K2n5n1L6K3lj17P0J3K3K3nJ5
-1152D4po0m3O0Mj5L7LM7M6j72J52J12q6J07j23j13K2m3JK5n1P3M3l2l0%L6M6n3N1m0M6J1
-1161I8k2%q6l8O7J27j25N2M1J1n9M2o1n5J00O3o4j93o4k9N3Q5J34Q0q5J9k8L2k4ml3K5p5
-1169a6o8O4J26L7j1mJ04o0n7m9l3P0k9oJ7o5o1R7m1j23J9Q0l9j2L7O3m0q5J6j1o4J1J09m3
-1177f7qK4L8M9K5j2N6qoq7K7J3R0N2O6q2Q6r5r5kO6m4L3j3o7J11O9j64l6O7j77O6l2J01k5
-1186A9M3o1j5KP7j4l3l4K6M5r5P6N3r2m7P0j5J58p3rO5Qr4k5K7N4qp8m0k6l1J14Q0o5j06
$$ plain form
-1128 -9 -44 12 52 163 128 203 142 170 75 23 -49 73 206 53 69 218 219 160 77 -82 -227 -93 -40 33 14 -9 -59 -4 15 9 -34 -41 36
-1136 36 45 -3 10 57 -3 45 6 -37 -11 -19 48 0 48 -45 -33 -74 -82 6 24 -85 -44 -97 -73 120 90 135 6 47 127 128 77 70 178 73 169
-1144 169 143 45 -19 8 -30 -45 57 113 144 9 -82 88 68 10 -83 -106 -112 6 -5 50 72 17 -34 2 25 22 -95 -25 -12 11 34 29 44
-1152 44 37 -23 -66 -6 -2 -17 20 23 70 116 -56 96 208 122 229 106 -7 15 -28 -27 -2 -53 20 63 31 1 1 37 83 30 81 41 87 98
-1161 98 76 76 -10 -48 19 146 21 73 114 125 66 108 47 -8 92 155 91 -102 -166 -195 -142 -57 77 157 72 91 63 95 71 67 34 59 -16
-1169 -16 -84 -20 106 143 132 128 232 172 115 66 33 103 74 68 85 20 -41 56 15 -108 -89 -9 -48 -60 -23 40 0 -85 -69 -80 -144 -133 -24 -67
-1177 -67 -75 -51 -13 36 61 49 105 97 91 4 31 44 134 186 252 170 256 161 66 64 130 86 119 106 39 150 219 55 19 86 -91 -25 -57 44 19
-1186 19 62 1 -14 -12 65 51 18 -16 10 55 -40 36 89 -3 -50 20 5 163 90 81 146 154 60 35 62 116 108 30 -10 -36 -67 47 127 62 -44
-1194d4nO8J24j02q0M3M3o0k8K02J23k08m6L9N2o6Q1l2q5j9N3j13L7J95L0r7k0K9j77NK3k3
-1202e8n3Q0qL7J15n1p5P7j9N7lk2n1m9J30J25L7j19j22j22M2J5Q0N0p9lj1j0J57j4J7j33
-1210A7pP6j20p8N6J16k9J57k7N6j33n7J21j36k7L1J45n9o4M2k7j7N7N7l1j06mP8K7o7o6j9
-1218c8MN2R1l3l7L3m8k00J06Q7k2p0k7Q5J6O0l3q2J55J8k8j2m2o3q4J76K6n5l4r2QK3R3l9
-1226fJ6Q5j9r1O9l9m2J02k6l9PK9l1J15M3No6m2j07rr1N8Q3J1R9j4j2j79J3K2L0O0l1m3J24
-1234H4m4K6O7o7pk2k2k2O1J1l5NoR9nPJ31p0k14n3Mj37L7J64L6o8l6m4K7k9K30N4j23j5J61
-1243A85p9l5o4k7m6j01J9Q5J8lo3Q9n2R0P8J7l6n9N3j0m2k2j29qO6L3LM4rO4j5MK6r0n9m
-1252g9J7L0l9P3j3p8J50L1k0K4%p3K9q6J5J01j90M7Q9P6M0m2l3J04l2j23L2J06nmK3k5q7
$$ plain form
-1194 -44 -49 19 143 41 -39 4 47 -13 -41 161 284 76 30 69 121 55 136 104 19 0 53 -60 -23 172 202 105 85 114 -63 -58 -35 -58
-1202 -58 -111 -31 -39 -2 113 62 -13 64 45 102 99 77 26 -23 107 232 269 150 28 -94 -52 -37 43 93 14 11 0 -10 147 133 150 17
-1210 17 10 86 -34 -112 -56 60 31 188 161 217 84 27 148 12 -15 16 161 102 38 80 53 36 93 150 119 13 9 87 114 47 -19 -38
-1218 -38 -34 18 109 76 39 72 24 -176 -70 17 -5 -75 -102 -17 -1 59 26 -56 99 117 89 77 35 -28 -112 64 90 35 1 -91 -83 -60 33 -6
-1226 -6 10 95 76 -15 54 15 -27 75 49 10 17 46 15 130 173 178 112 70 -37 -46 -137 -79 4 15 114 100 88 -91 -78 -56 -26 34 3 -40 84
-1234 84 40 66 133 66 59 37 15 -7 54 65 30 35 29 128 123 130 261 191 -23 -76 -72 -209 -172 -8 28 -40 -76 -120 -93 -122 108 162 39 24 185
-1243 185 106 71 7 -20 -66 -167 -148 -63 -45 -48 -111 -22 -74 16 94 111 75 16 69 59 17 -5 -134 -142 -76 -43 -40 4 -5 59 44 48 74 -16 -75 -79
-1252 -79 -62 -32 -71 2 -11 -89 61 92 72 96 96 23 52 -34 -19 82 -108 -61 28 104 144 102 69 173 141 18 50 156 151 147 170 145 58
-1260E8M8k4nJr6k2P3L7l2k8J0Op7M6K5P0M3n1j59l5J13jl7m9J11N7Ll1o2J9l1RP8K5o4m7
-1269a9p8N9P4l9m1K0K7J08n3k0P8k9o6J1m5P8J10q2j04m1m2l0J21O4nj1j54k2L6m1P6k5O8
-1277a7n6n5L1M3M0j2N1P8l9J6J0J5l9m5k1R3k9k3o9p1J19m4L9P9l1o3O8P7m9r1M7K9o5Rm
-1285B1n6j9N5j5J9q6k8R5L5Kj6k9K5J22M1o0j78m4J29K2k2J49q5J03m0k2j07j11J42j17P4
-1293aL1o5K4J5n5j2PP8n4J8m%K04j49q8N6MO4m1Q6M3M8r6j76J6Nj1o0Q0l5M4LJ27p4l4kO
-1302BL5q9m6J09R1r8l6J65m0r3Q1J08o0j69m9L5J39K3o3O3j08rq4nJ43J9n8r5L7J5p4J3J05
-1310Gl1m9k3J7J1q0P6R9n7Q6q1l6R1km3p1M3L4p7l0J39N0J4n4J8Ro0LM0J8R0j10j12J54M9
-1319A32N4k0r8p2kO0j22o3L6J69R3J0njO4k6j77J06l5q6oJ3N1m3pl6Q0p0j19j4KlR7jM1K9
$$ plain form
-1260 58 106 82 77 78 -18 -40 33 70 38 10 20 26 -51 -5 20 90 133 82 -77 -112 1 0 -37 -86 25 82 85 54 -8 11 -20 -11 67 92 28 -19
-1269 -19 -97 -38 36 -3 -44 -24 3 111 58 38 116 87 21 32 -13 65 175 93 -11 -52 -94 -124 -3 61 56 45 -109 -131 -95 -136 -60 -85 -17
-1277 -17 -73 -128 -97 -54 -14 -26 25 103 64 80 90 105 66 21 0 93 64 41 -28 -99 20 -24 15 94 63 0 68 145 96 5 52 81 16 25 21
-1285 21 -35 -54 1 -14 5 -81 -109 -14 21 23 7 -22 3 125 166 106 -72 -116 13 35 13 162 77 180 140 118 11 -100 42 -75 -1
-1293 -1 30 -35 -11 4 -51 -63 -56 22 -32 -14 -18 -18 186 37 -51 5 9 73 32 118 161 209 113 -63 -47 -42 -53 -113 -33 -68 -24 -21 106 32 -2 -4 2
-1302 2 37 -52 -98 11 102 4 -32 133 93 0 81 189 129 -40 -89 -54 85 108 45 108 0 -9 -93 -98 45 64 6 -89 -52 -37 -111 -98 7
-1310 7 -24 -73 -96 -79 -68 -148 -72 27 -30 56 -25 -61 30 28 -15 -86 -43 -9 -86 -116 23 73 87 33 51 60 0 3 43 61 151 41 -71 83 132
-1319 132 186 166 68 -4 -6 54 -68 -131 -95 74 167 177 172 171 235 209 32 138 103 17 11 24 75 32 25 -11 69 -1 -120 -134 -132 -135 -38 -39 2 31
-1327C1j26m2J58M8Lj8r3r8m1Q6J0K3J62Lk6J06j24nj59J8K2O6N4r8q3N4M7n6N3PP2J09K6
-1335A89r1n1J19l1n8K2k0K8j11o5N3L8N2J6o8o2L7qn1j5M2J18M5L0j2J9o6L6O9m8n5K8%O5
-1344A94O1o2j00m1j8mP3n5o7O3L3p2j9K7pj61l2J66L9m7J5P9N5n6m1j09m1P4%J00N7nKj02
-1352ak0K4j06Ol9Mk4K3Q1Jj6qJ11j20L8J29Q8n6o4j26Q1M9oj51L2P9o6O6Q5J9j7p8o2J21
-1360G7k1q0M3M2Q0o9j66N0K17J9q0k8j4j36N0R5j33K0q4J07K4K0m7M5l3j06MJ31J4QLj0l7
-1368Ej11k7L5K4J00q2K7Q2R2rj16J29%n9L4j70j0J32M4r3M7%m5J47j2k27K8J09nO7o0p2Q5
-1376H9l9M2K6j08Oj3o1NR9L4K5k0j34q4m0J67J70N0k18J2O2j14j42R3R3K4K6q1o3P0K8K4
-1384B8j27P8J16j9j26l1L7N0m8L0N4K8j25pM4P6l8l2j9o0P9l4J06k6j21O1O4J9k1J05l9p4
$$ plain form
-1327 31 -95 -137 21 69 72 54 -39 -137 -178 -92 -82 -59 103 106 80 186 62 57 -102 -84 -62 4 58 -40 -123 -69 -22 -78 -25 -18 54 163 189
-1335 189 98 47 166 135 77 99 79 107 -4 -69 -16 22 74 90 22 -40 -3 -11 -62 -77 -35 83 128 158 146 165 99 135 204 156 101 129 129 194
-1344 194 255 193 93 52 34 30 103 48 -19 44 77 5 -14 13 6 -155 -187 -21 18 -29 -14 65 120 64 23 -86 -127 -53 -53 47 104 99 101 -1
-1352 -1 -21 3 -103 -97 -136 -132 -156 -133 -52 -51 -67 -75 36 -84 -46 83 171 115 51 -75 6 55 49 -102 -70 9 -57 9 94 113 96 18 -44 77
-1360 77 56 -24 19 61 141 72 -94 -44 173 192 112 84 70 -66 -16 79 -54 -34 -118 -11 13 33 -14 31 -2 -108 -104 27 41 49 52 42 5
-1368 5 -106 -133 -98 -74 26 -56 -29 53 145 136 20 149 149 90 124 -46 -56 76 120 27 74 74 29 176 164 -63 -35 74 69 136 76 4 89
-1376 89 50 92 118 10 16 3 -58 -53 46 80 105 85 -49 -133 -173 -6 164 214 -4 8 70 -44 -186 -93 0 24 50 -31 -94 -24 4 28
-1384 28 -99 -21 95 76 -50 -81 -44 6 -42 -12 42 70 -55 -62 -18 58 20 -12 -31 -91 -12 -46 60 34 -87 -26 38 57 36 141 102 28
-1392B8R1m0J1J5P0o5j1j3j24k3O7N3O9p2J8j0O0j32MM2o0r9J12O7j0j26m5k2J14P9m8RnJ0
-1400A4Q6r2m5J1j9OJ11l8j26M9q8l7P9N9N4k8PNn6j4o1M5J01R9J03pr3k0k0L8Pm7k5M5J9
-1409A22O7j06o3n2m5N2K7n7N9o0n6J18%n5Q6J4K4l8K5L5nN3k14N9J06q7j46L0J42m9r5K7
-1417h2Q2n3jP7P5L3m3J3n5m6l9R5Q8N5p9k7j33J7l0J9J04j11P3O1p8l1L2O4kj0PQ2P2j0j0
-1425B09j50QoK7r3Q9Q3m2mr7K7p7N4l1K3J04J5q7n5R0m9l0r3J08L6M4N0m8j4k2m7Rm6K1R
-1434A5k1J2O5L9jO3Oj67P7Q5j40l2K6L6mkpo4n8K8P2N6o2Oo1Q7K5M3n1r7J21j1q6J3R0j9
-1443H2jp9J26K7l6Or1K5MJ10j12J7m2l7j05O2J0o2n2L7l0k0J41Q2m4k8Q5n7m2Q8k9n1j9L3
-1451bN7n0L0m1L9j12J27J49j59o9M7Q8l6O3M4op1J2m5j27j3L1l5Q6n9k2J24L3M0M%K3j47
$$ plain form
-1392 28 119 79 90 105 175 110 99 86 -38 -61 6 59 128 56 74 64 124 -8 -4 38 -22 -121 -9 58 48 -78 -123 -145 -31 48 0 9 4 14
-1400 14 100 8 -37 -26 -45 -39 72 34 -92 -43 -131 -168 -89 -30 24 -4 3 8 -48 -62 -123 -78 23 122 225 218 125 105 85 123 130 83 58 103 122
-1409 122 189 83 20 -32 -77 -25 2 -55 4 -56 -112 6 6 -49 37 51 75 37 62 97 92 145 -69 -10 96 9 -137 -107 35 -14 -109 -82
-1417 -82 0 -53 -54 23 98 131 88 101 46 0 -39 56 144 199 120 93 -40 -23 -53 -34 70 -41 32 93 15 -16 16 80 78 68 75 157 229 219 209
-1425 209 59 67 61 88 -5 84 167 125 121 24 51 -26 28 -3 20 124 139 52 -3 87 38 8 -85 23 59 103 153 105 91 69 22 31 -15 6 15
-1434 15 -6 6 71 110 109 172 178 11 88 173 33 1 27 63 59 57 50 -14 -72 -44 28 84 22 28 -33 54 79 122 71 -26 95 84 -2 11 101 82
-1443 82 81 2 128 155 119 125 34 59 63 173 61 78 36 -1 -106 -44 -34 -96 -148 -111 -141 -161 -20 62 18 -10 75 18 -24 64 35 -16 -35 -2
-1451 -2 55 5 35 -6 33 -79 48 197 38 -31 16 104 68 131 175 169 98 110 65 -62 -75 -44 -79 7 -52 -74 50 83 123 127 127 150 3
-1459CRO0Ml6j26M7j3p4JN9J57N6p3o6P1ql8Q2j4o3M9RJ4o0l8oJ39j35L4J09l2j1rj31R0J00
-1468A60m3r7mJ7J5k6j5K8J7KP6q3o9N9J22jj01l8Ll1K8N9K9q7pMo7KJ1k8Q6M9L4K6q6N1P
-1477A02k5l6L3l4L0o7K4O1kK0p1n8J1K4L4M7MoO7q3q7L1j7J13J59j68K3pO2j08pl3J8K6j4
-1486F6q4R9j2N5lj20m7L0lJ5OM7qr6nJ24P4J7j5q7j8K4o0j1J6qj21l4P1J32J16Jm4m2pQ5
-1494A53o8n7l8L1k8n4K3LQ5k6r1J25L9Q6o7k4m4m9qRk4m1l5j7L1O5L7Q4J00r2Q2j5m7k5k6
-1503G7r8o6Q1Mrq5K8N3N6n4L7j01M4J23nJ6m0L5P5mm9P3L7q1j20q6l8O5J24J0m8lKm6J8k9
-1512dlN0J4m6J4L4r3L1M4m4n1L4J15m2k4P0k4L6r2n2M7pK4L5J12j33p8J5L3q1k2K02J4J0
-1520A38j06n5J41N7j8P9O1m3j03k2nm9l8Kl%n4k2O2k7O8j02j8N4n0Q0N2l3R5O3j64J1L0J4
$$ plain form
-1459 3 12 72 76 40 -86 -39 -52 -126 -125 -66 91 147 74 8 79 71 33 115 101 38 87 96 110 50 12 6 145 10 44 153 121 110 101 -30 60 160
-1468 160 117 20 16 33 48 22 7 35 52 54 130 47 -22 37 159 158 57 19 22 -9 19 78 107 20 13 17 -50 -48 -37 -65 21 70 104 130 44 95 102
-1477 102 77 41 74 40 70 3 27 88 86 106 35 -23 -12 12 46 93 97 91 158 75 -12 19 2 115 274 106 129 122 184 76 69 36 54 80 66
-1486 66 -18 81 69 124 121 1 -46 -16 -19 -4 2 49 41 -55 -60 64 138 155 140 53 35 59 -1 -12 4 -4 -125 -159 -88 44 160 161 117 75 68 153
-1494 153 85 28 -10 21 -7 -61 -38 -35 50 24 -67 58 97 183 116 92 48 -1 -9 0 -24 -65 -100 -117 -86 -21 16 100 200 108 190 175 128 103 77
-1503 77 -21 -87 -6 -2 -11 -96 -68 -15 41 -13 24 -77 -33 90 85 101 61 96 171 167 118 191 228 147 27 -59 -97 -32 92 102 54 51 53 7 25 -4
-1512 -4 -7 43 57 11 25 59 -34 -3 41 -3 -54 -20 95 53 29 99 75 111 19 -33 14 7 31 66 178 45 -33 -18 15 -66 -88 114 128 138
-1520 138 32 -23 118 175 157 236 297 254 151 129 124 75 37 39 36 36 -18 -40 22 -5 63 -39 -57 -3 -53 27 79 46 141 204 40 51 81 95
-1528I5r0n3OJ8M5Q1n8RM2Lj07nL8m2J1N4o7O7L1n2P1j6j8j29Q6l6k7k5Mk1l2Q6m0N4q1K4
-1537g4NnJ1m0L9P9m5p2J42MQ0J00r3L0k5l3j14J43K4n4j18O8J16j75J06K4m3n0J32j5j49
-1545bJ04Q8j13OJ19r4k8l4J5j13J1L5L8j01nJ05n4L8J11m0L1j21M1J11j5o7j27n4M5o3O3
-1552g0J21J24p8o3p9P1l6K4J4n9j11R1J15j9r4R4kqK9l4O4n5%n1J5Klom9L5J0k9L8nL3K2
-1561E1j9j04L4J00J0J9l3q5K6k4M1M4j8n0L3Q7m0k7p3N8J31j9LO9p7j15K1M3j29K3M8m0J7
-1569EoO0k6Q0j5n9m3n8J07J5l9M0M5m0o2L9nL3Kl8L3Q9n8r2p0K9nP3QJ0J5l0J3j0m8N6nl1
-1578A2J7l8L6K8j9M8P1m2l5L4j6n5qm7p0J9N2J00K5nO1l0j47J7M0O3L7m8Pm4mL7K1j1l8j9
-1587D9n2L7PM1j3l7N1J8r7l2L7ro3P8l8k6O2Qj1l7k5p8%P7O4K6M7o0j8L4J5k6N1J0o3O1j8
$$ plain form
-1528 95 5 -48 -42 -24 21 102 44 53 95 98 -9 -14 24 -18 -7 47 -20 47 78 26 97 81 63 -66 20 -16 -43 -68 -64 -85 -117 -31 -71 -17 -98 -74
-1537 -74 -69 -74 -63 -103 -64 15 -30 -102 40 44 124 224 131 161 136 103 -11 132 156 102 -16 52 168 -7 99 123 80 30 162 147 -2
-1545 -2 102 190 77 83 202 108 80 46 61 -52 -41 -6 32 -69 -74 31 -23 15 126 86 117 -4 37 148 133 66 -61 -115 -70 -133 -70
-1552 -70 51 175 97 34 -45 26 -10 14 28 -31 -142 -51 64 45 -49 45 43 35 64 30 94 39 39 -12 3 5 2 -4 -53 -18 -8 -37 1 -4 29 51
-1561 51 32 -72 -38 62 72 91 58 -27 -1 -25 16 60 42 -8 25 112 72 45 -28 30 161 142 145 214 137 22 43 86 -43 -20 28 -12 5
-1569 5 -1 59 33 113 98 39 -4 -62 45 60 21 61 106 66 4 43 38 71 73 35 68 157 99 7 -63 -34 -39 34 42 52 67 37 50 40 -8 48 43 12
-1578 12 29 -9 27 55 36 84 155 113 78 112 96 41 33 -14 -84 -65 -13 87 112 107 168 138 -9 8 48 111 148 100 107 63 59 96 117 106 68 49
-1587 49 -3 34 41 82 69 32 83 101 4 -28 9 0 -63 15 -23 -49 13 21 10 -27 -52 -130 -130 -53 11 37 84 24 6 40 55 29 80 90 27 88 70
-1596G0j15P7O9l7j7kL5n6o9N3P2m2oN0p3K8jj3M2N5m4m2m8OQ9p9J9J6K0m8n8jJ04q0n2M3
-1605c5N5kO6J3
$$ plain form
-1596 70 -45 32 101 64 47 45 80 24 -45 8 80 38 32 82 9 37 36 23 65 120 76 34 -14 -8 81 2 21 37 57 9 -49 -50 54 -26 -78 -35
-1605 -35 20 18 84 97
-1606I7
##$OBSERVED INTEGRALS=	(X Y Z)
(7.1847762960007921507, 7.2495201627137859646, 0.97332671917485391599)
(7.0081044424572453977, 7.0775348658484027453, 0.95558324390020743522)
(6.7960342633094477094, 6.8452399205803144966, 0.91059018152710324845)
(5.2883619239542429824, 5.4860726864626760957, 5.2281611213161811591)
(2.9177804404485274681, 3.0663554829411290292, 1.02555144690470601)
(2.7708707464524655606, 2.8828211976635009783, 3.4295463631366458479)
(2.5571644209229704714, 2.6400246061097223382, 2.0336925374937084854)
(2.3158341236485893155, 2.360829872513078076, 2.9585734866037278756)
(2.0139582194973386642, 2.1707126717904627888, 3.9771919622174416453)
(1.7424486092473618903, 1.8620320546799080663, 2.0401528442059730928)
(1.3106273284792906431, 1.5004708310822132411, 9.8262020613424922999)
(1.1836818828144133331, 1.3106273284792906431, 6.6396477393302584247)
(0.96586995551213550293, 1.0476521382294061713, 2.176339311815313593)
(0.86986575137784616363, 0.96586995551213550293, 0.82544098103138185962)
##END=	
##TITLE=	Feb27-2020.660.1.1r
##JCAMP-DX=	6.0	$$ MestReNova 14.1.0-24037
##BLOCK_ID=	3
##DATA TYPE=	NMR PEAK TABLE
##DATA CLASS=	PEAK TABLE
##CROSS REFERENCE=	NMR SPECTRUM: BLOCK_ID=2                                     
##.OBSERVE FREQUENCY=	400.05240029848198446
##.OBSERVE NUCLEUS=	^1H
##NPOINTS=	271
##FIRSTX=	0.10124025721038068526
##LASTX=	7.5430419490195736998
##XFACTOR=	1
##YFACTOR=	1
##FIRSTY=	4131.2325294675774785
##XUNITS=	PPM
##YUNITS=	ARBITRARY UNITS
##PEAK TABLE=	(XYW..XYW)
0.10124025721038068526,4131.2325294675774785,0.0031974668057834039134
0.25059030924191921796,2024.5113346688290221,0.024436180761855056526
0.76284638467100107651,5411.5820935008041488,0.0022509320372140636211
0.82802189605030884767,14834.851386624090082,0.0021831140638750965062
0.84680363564144400801,29740.57258003683819,0.0021733139442597529216
0.86568155647329414482,17303.982444577250135,0.0024905538103932090867
0.89236362581009076589,20568.267571074844454,0.004424544286416353181
0.89605057208996563567,38870.164324425604718,0.0028741816917542549643
0.90288013068236361303,386682.45816095679766,0.0042327930133358613804
0.91008913208492403513,61961.069175197721052,0.0035159885282120243062
0.91389121247013838101,174396.65938399743754,0.0031522432180762240649
0.92009330021215829376,980617.30525217321701,0.0030795686982652841109
0.92448795209154999153,97613.160299147712067,0.0033426093487810828661
0.92665233375353639467,54345.22127379316953,0.0033647141198832621577
0.93231746207647747671,150500.03458408231381,0.010709431172277489308
0.93720911839678255895,278864.62123749987222,0.0030563596894251344148
0.94339683652049188822,35189.742608638909587,0.0039709664431605744619
0.94952389976292361773,7294.2588348501813016,0.0038520760869974138979
0.95308333304127201835,8877.9653396403591614,0.0021205172242078733358
0.96150331570857461294,10365.784730457789919,0.014013512610461039895
0.96621395140825261372,9430.1955828057416511,0.0093909029818329339823
$$ [...]
Compound,None,,1,1.1704476102638461388,0,0
Compound,None,,1,0.60108894683834224182,0,0
Compound,None,,1,-0.34150779144404158627,0,0
Compound,None,,1,0.1613412139205662732,0,0
Compound,None,,1,-0.12208968513382234544,0,0
Compound,None,,1,-0.92898607066384752962,0,0
Compound,None,,1,-0.068528111372773758969,0,0
Compound,None,,1,0.29438779191887920472,0,0
Compound,None,,1,0.24823192663619358944,0,0
Impurity,Artifact|Weak,,1,1.5603360147291540638,0,0
Compound,None,,1,-0.22334998214481932566,0,0
Compound,None,,1,-0.60000000000000008882,0,0
Compound,None,,1,0.62553503049205494424,0,0
Artifact,Artifact|Weak,,1,1.3456188603425909278,0,0
Artifact,Artifact|Weak,,1,0.40000000000000007772,0,0
Artifact,Artifact|Weak,,1,0.72215257783503616906,0,0
Artifact,Artifact|Weak,,1,0,0,0
Compound,Artifact|Impurity|Weak|13C Sat.,,1,1.999999999999999778,0,0
Compound,Artifact|Impurity|Weak|13C Sat.,,1,-0.98276582990704941523,0,0
Impurity,Artifact|Weak,,1,1.5999999999999998668,0,0
Impurity,Artifact|Weak,,1,0.64806904641483142893,0,0
Artifact,Artifact|Weak,,1,1.8299651276865895877,0,0
Impurity,Artifact|Weak,,1,-0.93358777551351179724,0,0
Impurity,Artifact|Weak,,1,-1,0,0
Artifact,Artifact|Weak,,1,0.40000000000000007772,0,0
Artifact,Artifact|Weak,,1,-0.66043593942767409022,0,0
Impurity,Artifact|Weak,,1,-0.64866450744065917711,0,0
Impurity,Artifact|Weak,,1,1.5999999999999998668,0,0
Impurity,Artifact|Weak,,1,1.8266192927931756973,0,0
Impurity,Artifact|Weak,,1,1.999999999999999778,0,0
Impurity,Artifact|Weak,,1,1.999999999999999778,0,0
Impurity,Artifact|Weak,,1,1.3999999999999999112,0,0
Impurity,Artifact|Weak,,1,1.5999999999999998668,0,0
Compound,None,,1,-0.86122264012583027437,0,0
Compound,None,,1,1.9830980256720922572,0,0
Artifact,Artifact|Weak,,1,1.7643715205192760376,0,0
Artifact,Artifact|Weak,,1,1.999999999999999778,0,0
Artifact,Artifact|Weak,,1,0.8145587419249458172,0,0
Compound,Artifact|Impurity|Weak|13C Sat.,,1,0.66327101827031764714,0,0
Solvent,Artifact|Impurity|Weak|13C Sat.,,1,-0.44321915596925953729,0,0
Compound,None,,1,1.7972243857518124255,0,0
Compound,None,,1,1.0133747427434727229,0,0
Compound,None,,1,1.5597003392008590428,0,0
Compound,None,,1,0.77295871059592091701,0,0
Artifact,Artifact|Weak,,1,0.51489752070237770898,0,0
Impurity,Artifact|Weak,,1,0.65614239261856710517,0,0
Impurity,Artifact|Weak,,1,0.53104189675652180291,0,0
Artifact,Artifact|Weak,,1,-0.23886287559615110299,0,0
Artifact,Artifact|Weak,,1,-0.40387422296671404709,0,0
Compound,None,,1,1.2438522291754068316,0,0
Compound,None,,1,0.99659628785224219083,0,0
Artifact,Artifact|Weak,,1,1.491529533205276703,0,0
Solvent,None,,1,0.61444518860999264298,0,0
Artifact,Artifact|Weak,,1,-1,0,0
Artifact,Artifact|Weak,,1,-0.90878752683337293838,0,0
Impurity,Artifact|Weak,,1,0.60000000000000008882,0,0
Compound,Artifact|Impurity|Weak|13C Sat.,,1,0.21899121900692078424,0,0
Impurity,Artifact|Weak,,1,0.45800211777287874737,0,0
Solvent,Artifact|Impurity|Weak|13C Sat.,,1,1.3928435038344417762,0,0
##END=	
##END=	
