##TITLE=	Feb27-2020.650.1.1r
KC1
##JCAMP-DX=	6.0	$$ MestReNova 14.1.0-24037
##DATA TYPE=	LINK
##BLOCK_ID=	1
##BLOCKS=	2    
##ORIGIN=	Mestrelab Research S.L.
##OWNER=	kct19
##$MNOVA/LINK_BLOCK_TYPE=	ITEM	$$ NMR Spectrum
##$MNOVA/ITEM/POLYGON=	(XY..XY)
5321,5835
8722,5835
8722,8208
5321,8208
5321,5835
##$MNOVA/ITEM/Z=	0
##$MNOVA/ITEM/ANGLE=	0
##TITLE=	Feb27-2020.650.1.1r
##JCAMP-DX=	6.0	$$ MestReNova 14.1.0-24037
##BLOCK_ID=	2
##DATA TYPE=	NMR SPECTRUM
##DATA CLASS=	XYDATA
##NUMDIM=	1
##ORIGIN=	Bruker BioSpin GmbH
##OWNER=	nmrsu
##.OBSERVE FREQUENCY=	400.05240029848198446
##.OBSERVE NUCLEUS=	^1H
##.SOLVENT NAME=	CDCl3
##.PULSE SEQUENCE=	zg30
##LONGDATE=	2020/02/27 18:06:00.000
##.ACQUISITIONMODE=	SIMULTANEOUS
##$ORIGINAL FORMAT=	Bruker XWIN-NMR
##$MNOVA/SCALES_VERSION=	8
##$PARAMETER FILE=	(acqus, ASCII, //ch-nmrserv3.ch.ic.ac.uk/Av400D/ug1/nmr/Feb27-2020/650/acqus, 0)
$$ ##TITLE= Parameter file, TOPSPIN		Version 3.2
$$ ##JCAMPDX= 5.0
$$ ##DATATYPE= Parameter Values
$$ ##NPOINTS= 1	$$ modification sequence number
$$ ##ORIGIN= Bruker BioSpin GmbH
$$ ##OWNER= nmrsu
$$ $$ 2020-02-27 19:02:19.246 +0000  nmrsu@nmrpc
$$ $$ /opt/topspin/data/ug1/nmr/Feb27-2020/650/acqus
$$ $$ process /opt/topspin3.2/prog/mod/dirdata
$$ ##$ACQT0= -2.04831932773109
$$ ##$AMP= (0..31)
$$ 100 100 100 100 100 100 100 100 100 100 100 100 100 100 100 100 100 100
$$ 100 100 100 100 100 100 100 100 100 100 100 100 100 100
$$ ##$AMPCOIL= (0..19)
$$ -1 0 0 0 0 0 0 0 0 0 0 0 0 0 0 0 0 0 0 0
$$ ##$ANAVPT= -1
$$ ##$AQSEQ= 0
$$ ##$AQ_mod= 3
$$ ##$AUNM= <au_zg>
$$ ##$AUTOPOS= <5 >
$$ ##$BF1= 400.05
$$ ##$BF2= 400.05
$$ ##$BF3= 400.05
$$ ##$BF4= 400.05
$$ ##$BF5= 400.05
$$ ##$BF6= 400.05
$$ ##$BF7= 400.05
$$ ##$BF8= 400.05
$$ ##$BYTORDA= 0
$$ ##$CAGPARS= (0..11)
$$ 0 0 0 0 0 0 0 0 0 0 0 0
$$ ##$CFDGTYP= 0
$$ ##$CFRGTYP= 9
$$ ##$CHEMSTR= <none>
$$ ##$CNST= (0..63)
$$ 1 1 1 1 1 1 1 1 1 1 1 1 1 1 1 1 1 1 1 1 1 1 1 1 1 1 1 1 1 1 1 1 1 1 1 1
$$ 1 1 1 1 1 1 1 1 1 1 1 1 1 1 1 1 1 1 1 1 1 1 1 1 1 1 1 1
$$ ##$CPDPRG= (0..8)
$$ <> <> <> <> <> <> <> <> <>
$$ ##$D= (0..63)
$$ 0 1 0 0 0 0 0 0 0 0 0 0 0 0 0 0 0.0002 0 0 0 0 0 0 0 0 0 0 0 0 0 0 0 0
$$ 0 0 0 0 0 0 0 0 0 0 0 0 0 0 0 0 0 0 0 0 0 0 0 0 0 0 0 0 0 0 0
$$ ##$DATE= 1582826794
$$ ##$DE= 6.5
$$ ##$DECBNUC= <off>
$$ ##$DECIM= 2496
$$ ##$DECNUC= <off>
$$ ##$DECSTAT= 4
$$ ##$DIGMOD= 1
$$ ##$DIGTYP= 12
$$ ##$DQDMODE= 0
$$ ##$DR= 22
$$ ##$DS= 4
$$ ##$DSPFIRM= 0
$$ ##$DSPFVS= 20
$$ ##$DTYPA= 0
$$ ##$EXP= <proton>
$$ ##$F1LIST= <>
$$ ##$F2LIST= <>
$$ ##$F3LIST= <>
$$ ##$FCUCHAN= (0..9)
$$ 0 2 0 0 0 0 0 0 0 0
$$ ##$FL1= 90
$$ ##$FL2= 90
$$ ##$FL3= 90
$$ ##$FL4= 90
$$ ##$FOV= 20
$$ ##$FQ1LIST= <>
$$ ##$FQ2LIST= <>
$$ ##$FQ3LIST= <>
$$ ##$FQ4LIST= <>
$$ ##$FQ5LIST= <>
$$ ##$FQ6LIST= <>
$$ ##$FQ7LIST= <>
$$ ##$FQ8LIST= <>
$$ ##$FRQLO3= 15959.0749999881
$$ ##$FRQLO3N= 2
$$ ##$FS= (0..7)
$$ 83 83 83 83 83 83 83 83
$$ ##$FTLPGN= 0
$$ ##$FW= 125000
$$ ##$FnMODE= 0
$$ ##$FnTYPE= 0
$$ ##$GPNAM= (0..31)
$$ [...]
$$ 130000 130000 130000 130000 130000 130000 130000 130000 130000 130000 130000
$$ 130000 130000 130000 130000 130000 130000 130000 130000 130000 130000 130000
$$ 130000 130000 130000 130000 130000 130000 130000 0 0 0 0 0 0 0 0 0 0 0
$$ 0 0 0 0 0 0 0 0 0 0 0 0 0
$$ ##$ShimPowMaxUC= (0..63)
$$ 130000 130000 130000 130000 130000 130000 130000 130000 130000 130000 130000
$$ 130000 130000 130000 130000 130000 130000 130000 130000 130000 130000 130000
$$ 130000 130000 130000 130000 130000 130000 130000 130000 130000 130000 130000
$$ 130000 130000 130000 130000 130000 130000 130000 0 0 0 0 0 0 0 0 0 0 0
$$ 0 0 0 0 0 0 0 0 0 0 0 0 0
$$ ##$ShimPowMaxUG= (0..63)
$$ 524287 524287 524287 524287 524287 524287 524287 524287 524287 524287 524287
$$ 524287 524287 524287 524287 524287 524287 524287 524287 524287 524287 524287
$$ 524287 524287 524287 524287 524287 524287 524287 524287 524287 524287 524287
$$ 524287 524287 524287 524287 524287 524287 0 0 0 0 0 0 0 0 0 0 0 0 0 0 0
$$ 0 0 0 0 0 0 0 0 0 0
$$ ##$ShimPowRcbType= 3
$$ ##$ShimPowRes= (0..63)
$$ 1e-20 1e-20 1e-20 1e-20 1e-20 1e-20 1e-20 1e-20 1e-20 1e-20 1e-20 1e-20
$$ 1e-20 1e-20 1e-20 1e-20 1e-20 1e-20 1e-20 1e-20 1e-20 1e-20 1e-20 1e-20
$$ 1e-20 1e-20 1e-20 1e-20 1e-20 1e-20 1e-20 1e-20 1e-20 1e-20 1e-20 1e-20
$$ 1e-20 1e-20 1e-20 1e-20 0 0 0 0 0 0 0 0 0 0 0 0 0 0 0 0 0 0 0 0 0 0 0 0
$$ ##$ShimPowRng0= (0..63)
$$ 1 1 1 1 1 1 1 1 1 1 1 1 1 1 1 1 1 1 1 1 1 1 1 1 1 1 1 1 1 1 1 1 1 1 1 1
$$ 1 1 1 1 0 0 0 0 0 0 0 0 0 0 0 0 0 0 0 0 0 0 0 0 0 0 0 0
$$ ##$ShimPowRng1= (0..63)
$$ 1 1 1 1 1 1 1 1 1 1 1 1 1 1 1 1 1 1 1 1 1 1 1 1 1 1 1 1 1 1 1 1 1 1 1 1
$$ 1 1 1 1 0 0 0 0 0 0 0 0 0 0 0 0 0 0 0 0 0 0 0 0 0 0 0 0
$$ ##$ShimPowRng2= (0..63)
$$ 1 1 1 1 1 1 1 1 1 1 1 1 1 1 1 1 1 1 1 1 1 1 1 1 1 1 1 1 1 1 1 1 1 1 1 1
$$ 1 1 1 1 0 0 0 0 0 0 0 0 0 0 0 0 0 0 0 0 0 0 0 0 0 0 0 0
$$ ##$ShimPowRng3= (0..63)
$$ 1 1 1 1 1 1 1 1 1 1 1 1 1 1 1 1 1 1 1 1 1 1 1 1 1 1 1 1 1 1 1 1 1 1 1 1
$$ 1 1 1 1 0 0 0 0 0 0 0 0 0 0 0 0 0 0 0 0 0 0 0 0 0 0 0 0
$$ ##$ShimSysFunc= (0..63)
$$ 1 2 3 4 5 6 7 8 9 10 0 37 38 35 16 15 14 13 12 11 28 27 26 25 24 23 36
$$ 22 30 29 20 21 34 33 32 31 17 18 19 0 0 0 0 0 0 0 0 0 0 0 0 0 0 0 0 0 0
$$ 0 0 0 0 0 0 0
$$ ##$ShimSysMatrix= 0
$$ ##$ShimSysType= 4
$$ ##$TFXNUM= 0
$$ ##$TRIPLO2= 0
$$ ##$VTU= 2
$$ ##$VTUETH= <149.236.99.20>
$$ ##$VTUTY= <no>
$$ ##$WBREFAM= (0..15)
$$ 136.7 118.7 100 100 100 100 100 100 100 100 100 100 100 100 100 100
$$ ##$WBREFLM= (0..15)
$$ 0 0 0 0 0 0 0 0 0 0 0 0 0 0 0 0
$$ ##$WBREFPH= (0..15)
$$ 77.55 -71.28 0 0 0 0 0 0 0 0 0 0 0 0 0 0
$$ ##$WBSGU= (0..15)
$$ 0 0 0 0 0 0 0 0 0 0 0 0 0 0 0 0
$$ ##$XFAC= 2
$$ ##END=
$$ 
##$DECIM=	2496
##$DSPFVS=	20
##XUNITS=	HZ
##YUNITS=	ARBITRARY UNITS
##FIRSTX=	6406.710256386850233
##LASTX=	-1606.1102564336499654
##DELTAX=	-0.24453933874997710318
##XFACTOR=	1
##YFACTOR=	4.9807209278439961153
##FIRSTY=	28.078125
##MINY=	-1855.875
##MAXY=	8264521
##NPOINTS=	32768
##XYDATA=	(X++(Y..Y))
$$ [...]
3564f4j5J39N2N7M7J2k46O5m1n0k8Q5q3O6O8m4o5q6J6L0p8J06M0J94l0j68L5L7k27j0L7J5
$$ -64 -79 60 112 169 216 228 -18 47 6 -44 -72 13 -70 -4 64 20 -45 -131 -115 -85 -163 -57 -17 177 147 -21 14 51 -176 -186 -149 -134
3556a34Q1l8l0J17l2r1Q0OJ1J33qj74j2K8L7L6l1J2n5Qj8j2J1N4K1M2M2l1j7r1L5j00P0J5
$$ -134 -53 -91 -121 -4 -36 -127 -47 -41 -30 103 95 -79 -91 -63 -26 10 -21 -9 -64 -56 -74 -86 -75 -21 0 42 84 53 36 -55 -20 -120 -50 -35
3548c5n3M0n5J16jM2N7m9O5j09k8J34m0r0mP1l7O3j11N4j6L7K2p4k7l4l4J4K8R4O8j86K4R3
$$ -35 -88 -48 -103 13 12 54 111 62 127 18 -10 124 84 -6 -10 61 24 87 -24 30 14 51 73 -1 -28 -62 -96 -82 -54 40 108 -78 -54 39
3539C9j41p5PJ25J5K6q8j1K5l5q2O0Q8j0pm5L6L7n3o8J41P8o0m0RQ1Ln5jr6n2N0K6L3J33l8
$$ 39 -102 -177 -170 -45 -30 -4 -92 -103 -78 -113 -195 -135 -47 -57 -64 -109 -73 -36 -89 -157 -16 62 2 -38 -29 52 55 0 -1 -97 -149 -99 -73 -40 93 55
3531E5L5j19j23Ok0j8P8J6m3J6R3l5K6n7J6Qm7J61k4j08q6M5J01J10m4j55J20p2nm0k4O0j7
$$ 55 90 -29 -152 -146 -166 -184 -106 -90 -133 -117 -24 -59 -33 -90 -74 -66 -113 48 24 -84 -170 -125 -24 86 42 -113 7 -65 -70 -110 -134 -74 -91
3523i1K4O4RJm7L6J47J8k20l9m1K7O3j4L3K7k9o1J05N8K1Or7L3n1N3j05M3K7N6r1j7M0np4
$$ -91 -67 -3 6 7 -40 -4 143 161 -59 -98 -139 -112 -49 -63 -30 -3 -32 -93 12 70 91 97 0 33 -18 35 -70 -27 0 56 -35 -52 -12 -17 -91
3514i1K6R6M9j20k6l7k2O7m6P5o7P6n4l6J15O8Rn8j52P5Q8l4nK6k6j34O7qK2J3K3K0joJR0
$$ -91 -65 31 80 -40 -66 -103 -125 -58 -104 -29 -96 -20 -74 -110 5 73 82 24 -128 -53 35 1 -4 22 -4 -138 -71 -79 -57 -44 -21 -1 -2 -8 -7 83
3505H3L0n2p7rJ18q5Ro1O7k5L6l4r0mK6j01kQ6l2L5K6O2m5r7r3Q9J11K6r6m4%M3K4RnKK1q4
$$ 83 113 61 -16 -25 93 8 17 -44 23 -2 34 0 -90 -94 -68 -169 -171 -85 -117 -82 -56 6 -39 -136 -229 -140 -29 -3 -99 -143 -143 -100 -76 -67 -72 -70 -49 -133
3496a33J07J9n9P5M7r2kn1j1J76k5o4K3o9nJ7J16j07J0n4J4K6Oj65M6J78m5p2Mj11oK3JP3
$$ -133 -26 -7 -66 9 56 -36 -38 -89 -100 76 51 -13 10 -59 -64 -47 69 -38 -28 -82 -68 -42 -36 -201 -155 23 -22 -94 -90 -201 -207 -184 -183 -110
3488a10j45N8Q3L5J35j02K8O3m8n9JK8Q3m1j05MR1jn4K3J17o4k9L4L5j02PR0o2j3O0ln5O6
$$ -110 -255 -197 -114 -79 56 -46 -18 45 -3 -62 -61 -33 50 9 -96 -92 -1 -2 -56 -33 84 20 -9 25 60 -42 -35 55 -7 -20 40 37 -18 48
3479D8j0O3j10%RN0j30OJ41p1r5N4Q0l7q2L3j15j4J26mk3JL7QOr7J00P6r8l7j1J05O4m2K9
$$ 48 38 101 -9 -9 0 50 -80 -74 67 -4 -99 -45 35 -2 -84 -51 -166 -180 -54 -58 -81 -80 -43 -35 -29 -126 -26 50 -48 -85 -96 9 73 31 60
3471F0q2j2o2q1Q6J65J39N7p5k01J5P9M1n2K6j29r4L4J37o0N5J1k4J20K0r1o0j19kJ28L1O0
$$ 60 -22 -34 -96 -177 -91 74 213 270 195 -6 9 88 129 77 103 -26 -120 -86 51 -9 46 57 33 153 173 82 22 -97 -99 29 60 120
3463A20j55j64O5K9P0j2K2%K5O4j06j4j20J10M8K2q3j16J2J25P2j6n2o9MQJ00J32j03j11M2
$$ 120 -35 -199 -134 -105 -35 -47 -25 -25 0 64 -42 -56 -176 -66 -18 4 -79 -195 -183 -58 14 -2 -54 -123 -119 -111 -11 121 18 -93 -51
3455e1j0n1NP4R2o0j15Mk3Q6L5l7k7M3O9L9q7j01L8P4j27O2P6m3n9N3O2Nn4K1L1o1L0j9p2
$$ -51 -61 -112 -107 -33 59 -1 -116 -112 -135 -49 -14 -51 -78 -35 34 73 -14 -115 -77 -3 -130 -68 8 -35 -94 -41 21 26 -28 -7 24 -37 -7 -26 -98
3447i8J07J0JL6k8L7m7r2J9o2Q2j9k4O9m1q3L7J3J9j09J17L8l0M0M9n0J06Jr9K8o8p3J02k6
$$ -98 9 19 20 56 28 65 18 -74 -55 -117 -35 -54 -78 -9 -50 -133 -96 -83 -64 -173 -56 -18 -48 -8 41 -9 97 98 -1 27 -41 -114 -12 -38
3438c8o7P6J0o6m0N3k5M6l9j4k3q7J80lm8ko2Q0O0k9j1l2P3q1o9J56J16r0n9O1M3k11P4N8
$$ -38 -105 -29 -19 -85 -125 -72 -97 -51 -90 -104 -127 -214 -34 -37 -85 -87 -149 -69 -9 -38 -49 -81 -8 -89 -158 -2 114 24 -35 26 69 -142 -68 -10
3430a0m1m9J36j8j29N6Q5Kp8pK0j08MJ03n2k9K2j0J4j07M2m7Q5R0Ok6K0K3P5R5n3j37O5j04
$$ -10 -51 -100 36 18 -111 -55 30 32 -46 -53 -33 -141 -137 -34 -86 -115 -93 -103 -89 -196 -154 -201 -116 -26 -20 -46 -26 -3 72 167 114 -23 42 -62
3422f2L8J0j21j0N7O2M1M5r5m3R8j0j13N6O3j22qN8o3M9O0q0LO6J5M9k6o8l4O3Mo4Q3J0pj10
$$ -62 -24 -14 -135 -145 -88 -26 15 60 -35 -78 20 10 -103 -47 16 -106 -114 -56 -119 -70 -10 -90 -87 -21 -6 43 17 -51 -85 -22 -18 -82 1 11 4 -106
3413a06n0N6J39n5j53ml7R7K5N8kJk9rM3j2j07r1J42J07q4R1q8R3J12r9p1K0n4n5Q0M0j00
$$ -106 -156 -100 39 -16 -169 -173 -210 -113 -88 -30 -32 -31 -60 -69 -26 -38 -145 -236 -94 13 -71 20 -68 25 137 38 -33 -13 -67 -122 -42 -2 -102
3405a02J17K4j48L9L2o5J05L9R5o9o6rK2p2J26k4j24J27J3p0j0j9k6Oo1J87m7j44K6P4K2r0
$$ -102 15 39 -109 -70 -38 -103 2 41 136 67 1 -8 14 -58 68 44 -80 47 60 -10 -20 -39 -65 -59 -120 67 20 -124 -98 -24 -2 -92
3397i2j8P3n7Nl6R2J54j0j15k6J4j8M5M0L6l4p2L6J07l3n0K6N3p9o3l0J65l0l0q7KJ04J03
$$ -92 -110 -37 -94 -89 -125 -33 121 111 -4 -30 -16 -34 11 51 87 53 -19 17 124 91 41 67 120 41 -22 -52 113 83 53 -34 -32 72 175
3389A75q8j57N2N5j0M7m6N3n4j0k6l5J3q4k0J57O9j0j70lO2J9j5J18N0q0r5p2p4K2rJ64qj0
$$ 175 87 -70 -18 37 27 74 28 81 27 17 -9 -44 -31 -115 -135 22 91 81 -89 -92 -30 -11 -26 92 142 62 -33 -105 -179 -157 -166 -2 -10 -20
3381b0o0K7m5KO3j7J46J6j61J05r1l8%NJ1jN8o5mN2M1J26j76n6J5j9k4P5M3k0J4m7R0j05P3
$$ -20 -80 -53 -98 -96 -33 -50 96 112 -49 56 -35 -73 -73 -68 -57 -58 0 -65 -69 -17 24 150 -26 -82 -67 -86 -110 -35 8 -12 2 -45 45 -60 13
3372A3m0Lj7j9M1m1N5q8M3k5J17L7p0J6O7j71no3O9Q9q6nM4Q9l3qJ6K3o5j52l1J10Pl2j5R2
$$ 13 -27 -24 -41 -60 -19 -60 -5 -93 -50 -75 42 79 9 25 92 -79 -84 -147 -78 11 -75 -80 -36 53 20 12 28 51 -14 -166 -197 -87 -80 -112 -127 -35
3363c5K23o9k22K7k6J7M0j8O3k4N7N6l5k13J0J0J8R4n8o5NK8j9N5RP9P6Qp8k3K9k6mN3M3o3
$$ -35 188 119 -103 -76 -102 -85 -45 -63 0 -24 33 89 54 -159 -149 -139 -121 -27 -85 -150 -145 -117 -136 -81 -72 7 83 91 13 -10 19 -7 -11 42 85 22
3355B2L2P9p0m3q6p8M3j1O8J15Kq8J6pK0PJ11r1p8j3q1j03P0O4P8N2Q8ll9r8j07L3j3L9Nm2
$$ 22 54 133 63 20 -66 -144 -101 -112 -44 71 73 -15 1 -6 14 21 132 41 -37 -50 -131 -234 -164 -100 -22 30 118 115 76 -22 -129 -96 -109 -70 -65 -107
3346a07N2pj5L4mJK9Q6j44K9R5N9n5j49q8J51o2P9O0j61k8J20j4L9p9n3l8J22K3J27N0o9q
$$ -107 -55 -62 -77 -43 -47 -46 -17 69 -75 -46 49 108 53 -96 -184 -33 -95 -16 44 -117 -145 -25 -39 0 -79 -132 -170 -48 -25 102 152 83 75
3338G5K3j39mMK3N8l5j0r3n0oMR6m6j3Q2lj17n6oP6O5L2j1l1l2Q5m0n2P6J69l2K5j57j16Q9
$$ 75 98 -41 -45 -41 -18 40 5 -5 -98 -148 -154 -150 -54 -100 -113 -31 -34 -151 -207 -213 -137 -72 -40 -51 -82 -114 -29 -69 -121 -45 124 92 117 -40 -156 -67
3329f7R7qj24O9N0N8p8j12Q8rR0q2O5o2o5L3J3l9N2l5n2L3N2om6qN6J96No0o6QMj23Q0R0j2
$$ -67 30 22 -102 -33 17 75 -3 -115 -27 -36 54 -28 37 -25 -90 -57 -44 -83 -31 -66 -118 -85 -33 -39 -85 -93 -37 159 164 104 38 46 50 -73 7 97 85
3320H5j25Q7n8L8K1n4o2jm9M2O7q0K4J74j60J1O6%j10m6n2Q0lJ14j16j05Q9J66R3j41m3J09
$$ 85 -40 47 -11 27 48 -6 -68 -69 -118 -76 -9 -89 -65 109 -51 -40 26 26 -84 -130 -182 -102 -105 9 -107 -212 -123 43 136 -5 -48 61
3312F1J30j00j32M6N3j07Q8O8l2j2k48M4O3oM0j6l1j5k8R8K5m3JN6J7p5o0j32L7K01n6K8R
$$ 61 191 91 -41 5 58 -49 39 107 75 63 -185 -141 -78 -84 -44 -60 -91 -106 -134 -36 -11 -54 -53 3 20 -55 -115 -247 -210 -9 -65 -37 -28
3304b8n1O2J3MK3N0l2p2r4n0Q8L4%j1l5MNj11N0Kp5J13N1Nr1K1J29m8K5R5n2K3M9o5l0n1M8
$$ -28 -79 -17 -4 0 23 73 41 -31 -125 -175 -87 -53 -53 -64 -99 -95 -90 -201 -151 -149 -224 -111 -60 -55 -146 -125 4 -44 -19 76 24 47 96 31 1 -50 -2
3295bL6j78K4OK2k2J02j8Q9k7o8J02L3j31q9O4M6J7nN3J3j83nJ36rO2l6j9k7p5O3K6K4k6J7
$$ -2 34 -144 -120 -114 -92 -114 -12 -30 59 32 -36 66 99 -32 -121 -57 -11 6 1 54 67 -116 -121 15 6 68 32 13 -14 -89 -26 0 24 -2 15
3286A5J1n0j43J2M9M1J6J0m2NOK4q8l5J4M9K5J03K8j11j74l3O8J24NQ0M0q4k5l6K6J6l4Q9
$$ 15 26 -24 -167 -155 -106 -65 -49 -39 -81 -76 -70 -46 -134 -169 -155 -106 -81 22 50 -61 -235 -268 -200 -76 -71 9 49 -35 -60 -96 -70 -54 -88 1
3278Ajp2j42l5J27M5L9M9%M6k9m1n6p9PR6R6m0n2pk9k0k2kk6L1J13l3j40J12L6L2J9m9nP4
$$ 1 0 -72 -214 -249 -122 -77 -38 11 11 57 28 -13 -69 -148 -141 -45 51 11 -41 -48 -77 -97 -119 -121 -147 -116 -3 -36 -176 -64 -28 4 23 -26 -31 43
3269D3O2j46j14J40J18K4r8J5j07N9K4Kr6M6M3j42K0J09p6J50n1K1l2j98L5J02p2N4mO9J9
$$ 43 105 -41 -155 -15 103 127 29 44 -63 -4 20 22 -74 -28 15 -127 -107 2 -74 76 25 46 14 -184 -149 -47 -119 -65 -69 0 19
3262A9l3Pk4k1j0K8j4j5j4M6Jl5Q7l6J1k8qm8Q3Q5m6j72J02j6J8Qn9J8L7N3k4m7L6q1J6q2
$$ 19 -14 -7 -31 -52 -62 -34 -48 -63 -77 -31 -30 -65 22 -14 -3 -31 -39 -87 -4 81 35 -137 -35 -51 -33 -25 -84 -66 -29 24 0 -47 -11 -92 -76 -158
3253a58P4j9j1OJ08J1j48L1M3J2O5n5oo1mL2j0O3J45JQ7j27l8j5k5j05k8L9J31Q4j04k5k6
$$ -158 -84 -103 -114 -108 0 11 -137 -106 -63 -51 14 -41 -47 -108 -112 -80 -90 -27 118 119 206 79 41 26 1 -104 -132 -93 38 122 18 -7 -33
3245c3K0L5M2M5l7j24j72K3k3J07L6j03j1J43J71l9k2j81m4J21K1k9n0P5L6j51J2nj9P5L8
$$ -33 -13 22 64 109 72 -52 -224 -201 -224 -117 -81 -184 -195 -52 119 80 58 -123 -167 -46 -25 -54 -104 -29 7 -144 -132 -137 -156 -81 -43
3237d3k7J6j09q7O0K7j4J75j9pPL7Q7N8j14j25n2QJ07oL7p1N0L1K6j3j2j17O1Q5j4OO4r3j46
$$ -43 -70 -54 -163 -250 -190 -163 -177 -2 -21 -28 -21 16 103 161 47 -78 -130 -122 -15 -21 16 -55 -5 26 52 39 27 -90 -29 56 42 48 112 19 -127
3229a27N4k9O4N1Q1OJ5lp7oQ3o8j01m5R2n8j36Q4R3L6l9j17o1NJ85o2j41J64P1j58J29L5j2
$$ -127 -73 -102 -38 13 94 100 115 112 35 29 112 44 -57 -102 -10 -68 -204 -120 -27 9 -30 -147 -208 -203 -18 -80 -221 -57 14 -144 -15 20 8
3221HK2M4j22l0n6J26j9J00LK2r9n6j2J1JL8j13K9j12Q6O5N3J03k6n0l9j8m1j26P3o9J32R3
$$ 8 30 74 -48 -78 -134 -8 -27 73 76 98 -1 -57 -69 -58 -57 -19 -132 -103 -215 -129 -64 -11 92 66 16 -23 -41 -82 -208 -135 -204 -72 21
3213B1n9K0Q1Q7l6j78r2n9J02K4L2l9J18RKj30KnK8N6m5j84J28J1O8J3k1O4K7r9J3j61O4j0
$$ 21 -38 -18 63 150 114 -64 -156 -215 -113 -89 -57 -96 22 31 33 -97 -95 -100 -72 -16 -61 -245 -117 -106 -38 -25 -46 18 45 -54 -41 -202 -138 -148
3204a48om1R4Q0Pl2r4L2J03M9P6j0j73r7K4K0P3P4R4r0o3r5J07n6P9k7o2m7oN0Q3M2j23MJ17
$$ -148 -154 -195 -101 -21 -14 -46 -140 -108 -5 44 120 110 -63 -160 -136 -116 -43 31 125 35 -28 -123 -16 -72 7 -20 -82 -129 -135 -85 -2 40 -83 -79 38
3196C8m2o3O7p7j9N7jn2N7qP1J06j42k6k8j7J0o5R7l4j24J13l4l2P8L3p3R8m2j5O1K9m4k5
$$ 38 -4 -67 0 -77 -96 -39 -40 -92 -35 -43 28 134 -8 -34 -62 -79 -69 -134 -37 -71 -195 -82 -116 -148 -70 -37 -110 -12 -54 -69 -8 21 -23 -48
3187d8o2k1j49K9K86PPn6k7o6N8P4J1j20k1O2Q3l%l4L0j01m8J09K2P7n0j48O8n2o4K6J23l8
$$ -48 -110 -131 -280 -251 35 42 49 -7 -34 -100 -42 32 43 -77 -98 -36 47 44 44 10 40 -61 -109 0 22 99 49 -99 -31 -83 -147 -121 2 -36
3179c6J5N1n2j1o9M5J17m3n4R1j03K0j3k3nlN2K1p0J8Lr0N2j7QqL1l1O4o9O7k6j42j14J32
$$ -36 -21 30 -22 -33 -102 -57 60 17 -37 54 -49 -29 -42 -65 -70 -73 -21 0 -70 -52 -49 -139 -87 -104 -96 -104 -73 -104 -40 -109 -42 -68 -210 -324 -192
3170a92J61k9%O6q0P1j4K6L5j32j32M8J06L1J13J04j90l1m0J10o5p0LjK9L5o2M1k2N6j4n4
$$ -192 -31 -60 -60 6 -74 -3 -17 9 44 -88 -220 -172 -66 -35 78 182 -8 -39 -79 31 -34 -104 -101 -102 -73 -38 -100 -59 -81 -25 -39 -93
3163i3N9k5l0K0M1j7j08n8L6J09m1n3QJ7k4n5M2N6m0R0K5R2j7M7k4l2k8l1J03P1j73q1lK2
$$ -93 -34 -59 -89 -69 -28 -45 -153 -211 -175 -66 -107 -160 -152 -135 -159 -214 -172 -116 -156 -66 -41 51 34 81 57 25 -3 -34 69 140 -33 -114 -117 -95
3154i5n2K2k2M7N2O2l2k7q9J07L5J93p4j27n6r9q0N0K08Jj7l5j17K1p2J43p4M4Mj0N0O9k0
$$ -95 -147 -125 -147 -100 -48 14 -18 -45 -134 -27 8 201 127 0 -56 -155 -235 -185 23 24 7 -28 -145 -124 -196 -53 -127 -83 -79 -89 -39 30 10
3146A0O3q2L9j09q6L0r3mJ14o3J9R0J27k9Rj05L3M5J8m5K9m7q%Q1n3o7MP6n2O1K8r3OO6l2
$$ 10 73 -9 30 -79 -165 -135 -228 -232 -118 -181 -162 -72 55 26 35 -70 -37 8 26 -19 10 -37 -45 -45 36 -17 -84 -80 -4 -56 5 33 -60 -54 12 -20
3137b0J0q7J7n2J19P9qj02NJ5O4M5J25j56j32q6L6L0O2j1k6n0pOO9L5o5o0j12J06J56J08n2
$$ -20 -10 -97 -80 -132 -13 66 58 -44 -39 -24 40 85 210 54 -78 -164 -128 -98 -36 -47 -73 -123 -130 -124 -55 -20 -85 -145 -257 -151 5 113 61
3129F1p5l2K1P1L5qm1k1o4l0q8OM4k6L0M3L8J9j95m4N3N4P4L3n9kJ40n0K1N4o9K5mj64J30
$$ 61 -14 -46 -25 46 81 73 32 11 -53 -83 -171 -165 -121 -147 -117 -74 -36 -17 -212 -256 -203 -149 -75 -42 -101 -103 37 -13 8 62 -7 18 14 -150 -20
3121b0P0Pro9J1lj24r6p5K01L0K4k2Q4j2JO1j34r0M9O6n9MO6n1k6M9n1k6O8K6J17R1j80j24
$$ -20 50 57 48 -21 -10 -13 -137 -233 -308 -107 -77 -53 -75 9 -3 -2 59 -75 -165 -116 -50 -109 -105 -39 -90 -116 -67 -118 -144 -76 -50 67 158 -22 -146
3112a46J55Mo3r1P5k6kJ08j5o0J92j34mm3m4O6R8j8j20j61L7J07j9j74NJ70J39j38k9J7J41
$$ -146 9 13 -50 -141 -66 -92 -94 14 -1 -61 131 -3 -7 -50 -94 -28 70 52 -68 -229 -192 -85 -104 -278 -273 -103 36 -102 -131 -114 27
3105B7kQ3m1oK6km6oj25J38NK1j15J1P8j02j12P7N2J20q1J28j18K6j9M9K7L5j04n1R6O8j11
$$ 27 25 108 67 61 87 85 39 33 -92 46 51 72 -43 -32 46 -56 -168 -91 -39 81 0 128 10 36 17 66 93 128 24 -27 69 137 26
3097B6J7N0k7r8P0j19L8oO8L6R2j08k4J2L0l6R8m6O8r0K4j30K7L1Q7J2N6o5j6j30rl7k2N7
$$ 26 43 93 66 -32 38 -81 -43 -49 19 55 147 39 15 27 57 21 119 73 141 51 75 -55 -28 3 90 102 158 93 77 -53 -62 -99 -121 -64
3088f4o0O2j2l8P2o4j12o4P3P7J33r3M5j04J25J66k91l4K1J32L7l3k9j9L5jmj39l0P0P2N0
$$ -64 -124 -62 -74 -112 -40 -104 -216 -280 -207 -130 3 -90 -45 -149 -24 142 -149 -183 -162 -30 7 -26 -55 -74 -39 -40 -44 -183 -213 -143 -71 -21
3080b1K7m4K6J4L6p1L2m9N1L9O4p9K0r3Oj8K9J32Pj58K7K3Jj2O5O9n8j38k0R2j9rl6k2P1m1
$$ -21 6 -38 -12 2 38 -33 -1 -50 1 40 104 25 45 -48 -42 -60 -31 101 108 -50 -23 0 1 -11 54 123 65 -73 -93 -1 -20 -29 -65 -87 -16 -57
3072e7J15l4p7K5K6k7Jr3n7N3L7Q7L1j37l8Q4Pm1N8p0p9R2j17l1N4J56J2l1o2l4O8L2m2J2
$$ -57 58 24 -53 -28 -2 -29 -28 -121 -178 -125 -88 -1 30 -107 -145 -61 -54 -95 -37 -107 -186 -94 -211 -242 -188 -32 -20 -51 -113 -147 -79 -47 -89 -77
3063g7m9k5J12P8j6r3p5R1m2K8L0lnj45J23Q2Q0p6j14N9k6M4K7j4l8N9j1K7K3M3j08k0llo2
$$ -77 -126 -151 -39 39 23 -70 -145 -54 -96 -68 -38 -41 -46 -191 -68 14 94 18 -96 -37 -63 -19 8 -6 -44 15 4 31 54 97 -11 -31 -34 -37 -99
3055i9P3N2R9j01j18l8J23N9j5m0N4K1Jj50k7l6L9J23k2p8J05PK6r8P0kj12j23K3J18K5j58
$$ -99 -26 26 125 24 -94 -132 -9 50 35 -5 49 70 71 -79 -106 -142 -103 20 -2 -80 25 32 58 -40 30 28 -84 -207 -184 -66 -41 -199
3047a99J48n0k4J9L3O3Q0j87R7Q7N1p5M8n6j32n7P6L4J54j07O3r7l8p8p7l7J77rN6r0J00%
$$ -199 -51 -101 -125 -106 -73 -10 70 -117 -20 67 118 43 91 35 -97 -154 -78 -44 110 3 66 -31 -69 -147 -224 -261 -84 -93 -37 -127 -27 -27
3039b7J00L6M9r9M6j16M7j21k6j34J78R6K2j21r5K7mr6P6m0N3rM7r8K01q1J34n5p5pL8N6J73
$$ -27 73 109 158 59 105 -11 36 -85 -111 -245 -67 29 51 -70 -165 -138 -142 -238 -162 -202 -149 -158 -111 -209 -8 -89 45 -10 -85 -92 -54 2 175
3031A75j50M4j31k5P7J21k8m4j41M5k2J65l0j5j06N7k4R8P2l6n5M1r5m1L1m6p4N5n9J54p6
$$ 175 25 69 -62 -87 -10 111 83 39 -102 -57 -79 86 56 41 -65 -8 -32 66 138 102 47 88 -7 -48 -17 -63 -137 -82 -141 13 -63
3024f3P2n1p0l0J6j02J41M1P0J0k9o2o7J01Q7QJ8m4J34J03J26J22J008J768l99j452p20l22
$$ -63 9 -42 -112 -142 -126 -228 -87 -46 24 34 5 -57 -124 -23 64 72 90 46 180 283 409 531 1539 3307 2908 1456 736 414
3017D14k99p4q5l1j2O2M9Q8K9r7R9n8pj31j2kn5J0J1O3K0K2Ok3K4K8Nn2o3k0J8P8N5J5ml0
$$ 414 115 41 -44 -75 -87 -25 24 112 141 44 143 85 78 -53 -65 -67 -122 -112 -101 -38 -18 4 10 -13 11 39 44 -8 -71 -91 -73 5 60 75 71 41
3008D1pR2K9p2J16Kj99j9J6p7j0J7J22O9N3o0r2m6l7J29q2PK4mj1p0qJ30L1q4p5oNMq9k0Q7
$$ 41 34 126 155 83 199 201 2 -17 -1 -78 -88 -71 51 120 173 113 21 -25 -62 67 -15 -8 16 12 1 -69 -77 53 84 0 -75 -81 -76 -72 -161 -181 -94
2999i4Q9l6N0j26n1R0O5j18O1K4R7l8L4q7Q5j13j0n2J09o5mL3O4o3J85j14jp9N2R2J24j08
$$ -94 -5 -41 9 -117 -168 -78 -13 -131 -70 -46 51 13 47 -40 45 -68 -78 -130 -21 -86 -90 -57 7 -56 129 15 14 -65 -13 79 203 95
2991I5O6q2r8r7J56J1O7j73j0M3J71r5K8k7k6j83J93p6J4J53Q7j39L5k18J01j10J50NP8r4
$$ 95 161 79 -19 -116 40 51 118 -55 -65 -22 149 54 82 55 29 -154 39 -37 -23 130 217 78 113 -105 -4 -114 36 41 119 25
2984B5q4m5N1j09K62k5Q0q2J04j41R3r4Q9r2Q0j61Jn6%j6J81K3r0j04J03m8N8m0J42j75rJ50
$$ 25 -59 -104 -53 -162 100 75 155 73 177 36 129 35 124 32 112 -49 -48 -104 -104 -120 61 84 -6 -110 -7 -55 3 -37 105 -70 -79 71
2976G1l1j07J42r8J20j36J03j36J98p2M3r1L6j17R2n9J24o1m2K3Q6q0N7j68J27J20J50j59
$$ 71 40 -67 75 -23 97 -39 64 -72 126 54 97 6 42 -75 17 -42 82 21 -21 2 88 8 65 -103 24 144 294 135
2969A35L0K1J43RL04J27K04j14j99j64n2k21r1j68J12j43J02n1or0L5k3K00m4J07r5R5q0J09
$$ 135 165 186 329 338 642 769 973 859 660 496 444 223 132 -36 76 -67 35 -16 -22 -112 -77 -100 100 56 163 68 163 83 192
2962A92q2J50K9O4j31J15J11K42L35K13l3Ol80k01k91j12P5p4l7J02j12P0p6L8m0J6r8j9J9
$$ 192 110 260 289 353 222 337 448 690 1025 1238 1205 1211 831 630 339 227 302 228 191 293 181 251 175 213 173 189 91 72 91
2955I1K00ml0o6r1J9O4j45l8M6R1r8O9N1K6m5l8K00N7j10j2R4N0P3J79N89J437K990K3k653
$$ 91 291 287 257 191 100 119 183 38 0 46 137 39 108 159 185 140 102 302 359 249 237 331 381 454 633 1222 2659 5649 5672 3019
2947C019j476o36l11j36lk24j81O4m0p6p2O5JJ76k2K3j74L7j9J66j79K23m7K6j21K05k44J21
$$ 3019 1543 907 596 460 457 233 52 116 76 0 -72 -7 -6 170 148 171 -3 34 15 181 2 225 178 204 83 288 44 165
2941A65l1m6j03O0r5J37J8J77j04J47j46J64j00P3j73J48k13K11j56J66j13K25j88J98k10
$$ 165 134 88 -15 45 -50 87 105 282 178 325 179 343 243 316 143 291 78 289 133 299 186 411 223 421 211
2934B11K40j94K27k20J10k17K65j60J89k75L31j79K35k88K57j90K65l82M17m29L78j92M13
$$ 211 451 257 484 264 374 157 422 262 451 176 507 328 563 275 532 342 607 225 642 213 591 399 812
2929H12l02L07l18M41m53M42l24M61k60M43m45N37l34M35m55M96m65M35n78O40n41N31m73
$$ 812 510 817 499 940 487 929 605 1066 806 1249 804 1341 1007 1442 987 1483 1018 1453 875 1515 974 1505 1032
2923A032O84l91P20n88Q33o23Q07o60Q81p09R66p63Q00p62J385p21Q30j132J783n80J670r69
$$ 1032 1716 1325 2045 1457 2290 1667 2474 1814 2695 1986 2952 2189 2989 2227 3612 2891 3721 2589 4372 3792 5462 4493
2918D493J905j060K369j111L147p64M309l17O585K092J3339R629M1577Q9750L00734J51867
$$ 4493 6398 5338 7707 6596 9743 8979 13288 12971 19556 21648 34987 44616 86193 175943 476677 628544
2914F28544k61383j89342q4972l9837k5097q082p309j605l939J7k316K51k093O40j434Q53
$$ 628544 367161 177819 92847 53010 27913 19831 12522 10917 6978 6995 4679 4930 2837 3477 2043 2896
2910B896j194N27p29O78j313K93n65Q83n62L74n93M44m61M94m82N10k68L43l96K65l21K74
$$ 2896 1702 2229 1500 2178 865 1158 593 1476 914 1288 695 1139 678 1172 690 1200 932 1275 879 1144 823 1097
2905A097l66K94k21K86l33J49k64K94j51J64l14K70n9K46k12J76j61J66k00K12k5J33j21O7
$$ 1097 731 1025 804 1090 757 906 642 936 785 949 635 905 846 1092 880 1056 895 1061 861 1073 1048 1181 1060 1127
2899A127LK14j48J00l3L01P8J00L0K7K73M02L44L91N36M36R6J70L49K03O4K39K56O10P57R69
$$ 1127 1130 1344 1196 1296 1263 1564 1642 1742 1772 1799 2072 2474 2818 3209 3745 4181 4277 4447 4796 4999 5063 5302 5558 6168 6925 7894
2892G894J361J830K982M806R068J7163K9580L9895L9920K4417q67k5788l9064l8034k7654
$$ 7894 9255 11085 14067 18873 27941 45104 74684 114579 154499 178916 178049 152261 113197 75163 47509
2889D7509j6809r097m904k766j838j197j109o98n34k55k23L7K12N29K98P12P57J285J697K854
$$ 47509 30700 21603 16699 13933 12095 10898 9789 9091 8557 8302 8079 8116 8328 8857 9155 9867 10624 11909 13606 16460
2884A6460M677Q728J6647L0872M6007N1908L8883J0653k2307m4991n0228m0301k6039j4798
$$ 16460 21137 29865 46512 77384 123391 175299 214182 224835 202528 157537 107309 67008 40969 26171
2880B6171q360m583k858j964j625j088r13n22l86J10K6J98j63q1n55m89n92l46m17p0k79l0
$$ 26171 17811 13228 10370 8406 6781 5693 4780 4258 3872 3982 4008 4206 4043 3962 3407 2918 2326 1980 1563 1493 1214 1184
2875A184k37M0j32J38j47M9k22J24j87N8k17P5j76M0j63J33k19J59R2J01k62K7j31J25j51
$$ 1184 947 987 855 993 846 895 673 797 610 668 451 526 350 390 227 360 141 300 392 493 231 258 127 252 101
2869A01J36r8J72j73J01o2Nj91K05L4P8j48J94q0L0j09K32j28l6o6J00j53K08r8j1j58L14
$$ 101 237 139 311 138 239 177 182 -9 196 230 308 160 354 274 304 195 427 299 263 197 297 144 352 254 243 85 399
2862C99q6k8m2J71j32J31j63m9j5J45q1J61q6O6o6J61j01J96Q2K20j26j87j76J4o9O6j40q8
$$ 399 313 285 243 414 282 413 250 201 186 331 250 411 325 391 325 486 385 581 663 883 757 570 394 408 339 405 265 177
2856A77j06K8j72J77j6j5N4K10j06k0Q4J48j37l0m8K28m8pL7K40J47J29Q2K2j10J14j36qk0
$$ 177 71 99 -73 104 88 73 127 337 231 211 295 443 306 276 228 456 408 401 438 678 825 954 1036 1058 948 1062 926 918 898
2848H98q3j5N0l6J15M5L40M87J072J565K199J958J302K47r86k063k113j821j097o89l53j87
$$ 898 815 800 850 814 929 974 1314 1801 2873 4438 6637 8595 9897 10144 9158 7095 4982 3161 2064 1375 1022 835
2843H35nj72j26m4kjL0NK41n0m%M8l7N7L60L87O49J351J932K318K186J310r0j473k337k263
$$ 835 830 658 532 488 486 485 515 520 761 711 707 707 755 718 775 1135 1522 2171 3522 5454 7772 9958 11268 11178 9705 7368 5105
2836E105j815j250n10l66k05j34l0n1j17m5L7P7j4J31M7KJ11r2m1j9J02m7J68r7O7P5m8j25
$$ 5105 3290 2040 1530 1164 959 825 795 744 627 582 619 696 682 813 860 862 973 881 840 821 923 876 1044 947 1014 1089 1041 916
2830I16m6Q4K2J56O4J56J09N1L7O4K14K3J96K27K56J73L89L53L32M17M17M66O03P31R71J359
$$ 916 870 954 976 1132 1196 1352 1461 1512 1549 1613 1827 1850 2046 2273 2529 2702 3091 3444 3776 4193 4610 5076 5679 6410 7381 8740
2823H740K100L645O204Q817J1207J6529J5409J0857J1243K923J424M31j904L174M8Q04k470
$$ 8740 10840 14485 20689 29506 40713 57242 72651 83508 94751 97674 99098 99529 97625 100799 100847 101651 99181
2819I9181r639r580j5768j6568j2514r915p075m264k296j338p27j81j72L30P13J195J841L780
$$ 99181 89542 79962 64194 47626 35112 25197 18122 13858 11562 10224 9497 9316 9144 9474 10187 11382 13223 17003
2815A7003O108P959J1178J3462Q899R282N010L77J397k051J418J108l62M59o858p775j0718
$$ 17003 23111 31070 42248 55710 64609 73891 78901 79278 80675 78624 80042 81150 80788 81247 74389 66614 55896
2811E5896j4269j1143q649o323l780j989j018M31k91k324j546o97l53l00l58k91n3k70j48
$$ 55896 41627 30484 21835 15512 11732 9743 8725 9156 8865 6541 4995 4298 3945 3645 3287 2996 2943 2673 2525
2806B525k07j22r2j00j97n8l30j55j73j73n0L6p1l1K8J00Q4K0l5J10j44j48j29k1l5o3j86
$$ 2525 2318 2196 2104 2004 1807 1749 1419 1264 1091 918 868 904 833 802 830 930 1014 1034 999 1109 965 817 688 667 632 569 383
2799C83p4Jn0j43R7p3j6j38J55Rmj19R3J2M2lJ59nj84P8M5p0n7J21O9LR8q8o4p0K9p4j14m
$$ 383 309 310 260 117 214 141 125 -13 142 151 147 28 121 133 175 172 331 326 142 220 265 195 138 259 328 331 429 341 277 207 236 162 48 44
2791D4N6p7J05L9N0n3j15m8l7j61J40M4P1m8R8j7J15o7p5M1j9m8R2p3K1J07q8m0qn6m1m5l4
$$ 44 100 23 128 167 217 164 49 1 -36 -197 -57 -13 58 10 108 91 206 139 64 105 86 38 130 57 78 185 97 57 49 -7 -48 -93 -127
2783a27J16J51k2J8j11J13m6qM4j18N7N3m8J6K3L2j42n3l6M2J19J13P3j84k33O2J78J34m3
$$ -127 -11 140 118 136 25 138 92 84 128 10 67 120 72 88 111 143 1 -52 -88 -46 73 186 259 75 -158 -96 82 216 173
2776A73j64m2K2K8Q0J7M8j1p9j60M7L4n9R3P6J2J24p4n0J5J0j22M6Q5K9ko3q4p8K23O6k8m
$$ 173 9 -33 -11 17 97 114 162 151 72 -88 -41 -7 -66 27 103 115 239 165 115 130 140 18 64 149 178 176 113 29 -49 174 240 212 208
2768B08N7j20k1R3R6j19j9o4M9n3P4o1pP1L5j3k2j24J30n7K4Ln0K0J32k34km7j2L5pj0J52
$$ 208 265 145 124 217 313 194 175 111 160 107 181 120 113 184 219 206 184 60 190 133 157 160 110 130 262 28 26 -21 -33 2 -5 -15 137
2760A37j1l9M2m5j53N6J01K26k4p2j21o2O9J10N1J08j0L2p7m2j19K2L3P5o9n4mK4P5kj16J6
$$ 137 126 87 129 84 -69 -13 88 314 290 218 97 35 104 214 265 373 363 395 318 276 157 179 212 287 218 164 160 184 259 257 141 157
2752A57n5M7J9L5o2J26j8O5m7n3o0KJ00J46o9M0J8R2j05o4j14J43J05q3r7QL8J21nl7M4l1
$$ 157 102 149 168 203 141 267 249 314 267 214 154 156 256 402 333 373 391 483 378 314 200 343 448 365 268 276 314 435 430 393 437 406
2744D06k8M2jK33n6J39J60K36J37K58O9N8L5j9J17J70n6R3Lo4p6j19j64rj73L3l8j4m7J77
$$ 406 378 420 419 652 596 735 895 1131 1268 1526 1595 1653 1688 1669 1786 1956 1900 1993 1996 1932 1856 1737 1573 1564 1391 1424 1386 1372 1325 1502
2737A502M4MJ16J94J14J67J61J96R7J37J38K59K09L33K73L16L65L62N02P57O21Q59R29J346
$$ 1502 1546 1550 1666 1860 1974 2141 2302 2498 2595 2732 2870 3129 3338 3671 3944 4260 4625 4987 5489 6246 6867 7726 8655 10001
2731A0001J611J840K747M531Q077J3890J9189K4469L1345K8068J7054R739P046K83q356r70
$$ 10001 11612 13452 16199 20730 28807 42697 61886 86355 117700 145768 162822 172561 179607 179890 171534 170564
2727A70564N554j246n703p830j4849k6351k9876k4769k0292j5065r339n469l394k133j776
$$ 170564 176118 174872 169169 161339 146490 120139 90263 65494 45202 30137 20798 15329 11935 9802 8026
2723H026j372j129q49p71o90l34k94m18k73j95l0l5j52K1J25m8j6j11l4j5j09P8p3j20Q2Q
$$ 8026 6654 5525 4676 3905 3215 2881 2587 2169 1896 1701 1671 1636 1484 1505 1630 1582 1566 1455 1421 1406 1297 1375 1302 1182 1264 1272
2717A272j55k95j93Ll9J2j80J7k3j15j5J1Jm0q9P1R8P7j01o9J9L1RJ6J24P3m3m3J1O2j25J71
$$ 1272 1117 822 629 632 593 605 425 442 419 304 289 300 301 261 172 243 341 418 317 248 267 298 307 323 447 520 477 434 445 507 382 553
2709E53m0j4J51J51K26L01N80P53Q83N57O30O14kJ21j4K2R4N7j71n76m92n81r51o62n48m84
$$ 553 513 499 650 801 1027 1328 1908 2661 3544 4101 4731 5345 5343 5464 5450 5472 5566 5623 5452 4876 4384 3803 2852 2190 1642 1158
2703A158m20q7k09j0K1N2J9J43R2K18J74J83M35O70Q16O06N01L87Q8J42q6J30r8L2j95n52
$$ 1158 738 651 442 432 453 505 524 667 759 977 1151 1334 1769 2439 3255 3861 4362 4749 4837 4979 4893 5023 4925 4957 4762 4210
2696D210l81p84q94o55l84l20l48q5KM1o2qk08MO5Mj0j8j17j33k9L4KJ15L8p4n4O1J3O0k9
$$ 4210 3829 3045 2151 1496 1112 792 444 359 361 402 340 332 124 128 193 197 187 169 52 -81 -110 -76 -74 41 79 5 -49 12 25 85 56
2689E6r1m4J23q0K1q3j0J52J05q1l2Q5q0r2Q1oN8j38O0J42rj42k5j34P2L7R2Nj8j0m1jJ37
$$ 56 -35 -79 44 -36 -15 -98 -108 44 149 68 36 121 41 -51 30 24 82 -56 4 146 137 -5 -30 -164 -92 -55 37 42 24 14 -27 -28 109
2681A09m5K7n3l8J6pq4%Q5K5j19L9m0N6j0N2lp8R6J03P2Lj23r5k1N5lj4R9N9o1k5l8M5j82
$$ 109 64 91 38 0 16 9 -75 -75 10 35 -84 -45 -85 -29 -39 13 10 -68 28 131 203 206 83 -12 -33 22 19 5 104 163 102 77 39 84 -98
2672i8M8R9j4r5m8J40K6r9R2m3k2M7n6O5M9n0L7n0m5KK5N6O0j57O7R8m2L1q0O7O0m4j4j37
$$ -98 -50 49 35 -60 -108 32 58 -41 51 8 -14 33 -23 42 91 41 78 28 -17 -15 10 66 126 -31 36 134 92 123 43 110 170 126 112 -25
2664b5k8P1n5PK0r9k4J11k3j25J06P6N0N6o1n7N7j07l8P6l8P4K4k7O7N4j63o3Q0Q2o4L1N6
$$ -25 -53 18 -37 -30 -10 -109 -133 -22 -45 -170 -64 12 62 118 57 0 57 -50 -88 -12 -50 24 48 21 88 142 -21 -84 -4 78 14 45 101
2656A01L2l6j12k4M2M7K2n0J0J60q5N0Kj77jQ4N8M3KO0j5j76N2J01L8K6M3J63J52J55J74l2
$$ 101 133 97 -15 -39 3 50 72 22 32 192 107 157 159 -18 -19 65 123 166 168 228 213 37 89 190 228 254 297 460 612 767 941 909
2648I09Q5q4K0J27jk2l4j54k4j81n6o3k3j11p8o4o8R3P0l4M7J49l0o1L8Q9J05QL03M37Q28
$$ 909 994 910 930 1057 1056 1034 1000 846 822 641 585 522 499 388 310 246 178 271 341 307 354 503 473 412 450 539 644 652 955 1392 2220
2640B220R53J273J610J875J304P58M39K4m43R1M8j12m38n62j035j782j631j266j158q14m71
$$ 2220 3173 4446 6056 7931 9235 9993 10432 10456 10013 10104 10152 10040 9602 9040 8005 6223 4592 3326 2168 1354 883
2635H83k42j47j46j6j52n3L7n0m7r4M6l0J64l0m8j25M3K4kJ5j2j12L8N3J50l7n7K1j7j8N2
$$ 883 641 494 348 332 180 127 164 114 67 -27 19 -11 153 123 75 -50 -7 17 15 30 18 -94 -56 -3 147 110 53 74 57 39 91
2628I1j2p0MR9ro6l9J6J1J09M6j15M2Q8k22O0R5l6J7j00k2L2OL7M9J7j25J57L4k1jMp8m1o4
$$ 91 79 9 13 112 103 37 -2 14 25 134 180 65 107 195 -27 33 128 92 109 9 -13 19 25 62 111 128 3 160 194 173 172 176 98 57 -7
2619gJ09l9%j59Q5J30j24r0J45n5O3l1j2k9k2Nj08Q2J24q5j4Q8J61m4j32J7K8O0J9l9p4k64
$$ -7 102 63 63 -96 -11 119 -5 -95 50 -5 58 27 15 -14 -36 -31 -139 -57 67 -18 -32 56 217 173 41 58 86 146 165 126 52 -212
2611b12Q2J67K7N3M0n4j3N5m7j16p1RJ28M7l6j71j5m0Q9M0Q6J5JLp4j09m7R7k8J3j11J03j6
$$ -212 -130 37 64 117 157 103 90 145 98 -18 -89 -80 48 95 59 -112 -127 -167 -78 -38 48 63 64 67 -7 -116 -163 -66 -94 -81 -192 -89 -105
2603a05R7J18p8r6K8m6KN8J2p6r8k4Qm9K28J18n8k8K8J6L6K4M6m8r9l3K02l9j92j35K1R9J2
$$ -105 -8 110 32 -64 -36 -82 -80 -22 -10 -86 -184 -208 -200 -249 -21 97 39 11 39 55 91 115 161 113 14 -19 183 144 -48 -183 -162 -63 -51
2595e1L9LkJ4n0J9on1nkJ8Q7k0J39o8k9o9MrO4Qp5j00J9m3P9L8J9J3kJ3N7j01o5K6Q5rJ12
$$ -51 -12 -9 -11 3 -47 -28 -34 -85 -90 -92 -74 13 -7 132 64 35 -34 -30 -39 25 33 -42 -142 -123 -166 -87 -49 -30 -17 -19 -6 51 -50 -115 -89 -4 -13 99
2586I9J7r5p6P9M3M9R9K1j00m0M9Lr3m8o1M0L8%J00Rp5P3L3l3j18J6j5L4K8n2P3N4j05n3Q9
$$ 99 116 21 -55 24 67 116 215 236 136 96 145 148 55 7 -54 -14 24 24 124 133 58 131 164 131 13 29 14 48 76 24 97 151 46 -7 82
2577H2PpM9Oj18m8N1k8J0m5j7J08Jr8O4jk4pm3NM0J4J9Q7J18j32n2nN7L8J07j85q8K0J19l8
$$ 82 89 82 131 137 19 -29 22 -6 4 -41 -58 50 51 -47 17 16 -8 -15 -58 -53 -13 1 20 107 225 93 41 36 93 131 238 53 -35 -15 104 66
2568F6k8l3Rn2m9l1R5O3l0r5n9m5M2J21K15q9RMo5N0M4p9R8j7j51O0J7p4J46k7q6j64m4o0
$$ 66 38 5 14 -38 -87 -118 -23 40 10 -85 -144 -189 -147 -26 189 100 109 113 48 98 142 63 161 144 -7 53 70 -4 142 115 29 -135 -179 -239
2560b39N3M8Q2Q6n1kJ16L8j5k8l8j68K25N4j60K5Q8j15n1L4qJ50J02j3l7J7p1L8J8OR0Q2q9
$$ -239 -186 -138 -56 30 -21 -23 93 131 116 88 50 -118 107 161 1 26 114 -1 -52 -18 -26 124 226 213 176 193 122 160 178 184 274 356 267
2552B67R7r9O0J9k05j45JJ7k9RNj4mJj4J9kL5J15j7n3r0J5O1J1n4M8K2q7N4N3Ql7R3M8O7o1
$$ 267 364 265 325 344 139 -6 -5 12 -17 -8 -3 -17 -21 -20 -34 -15 -17 18 133 116 63 -27 -12 49 60 6 54 76 -11 43 96 104 67 160 208 275 214
2543B14J07j4m9j4k8n5l8J3K1M1on5N8m2j61R1J7N9J3L5k6P0M5M4k09k2%L5nL5p9J7Jq2j14
$$ 214 321 307 258 244 216 161 123 136 157 198 192 137 195 153 -8 83 100 159 172 207 181 251 296 340 131 109 109 144 139 174 95 112 113 31 -83
2534h3J5J65N6j23qO9o1j0pl6K8N3r5j11J49N1Q2m4j8K2No3J28L0M8Q0r6j16lP8J17J01p1
$$ -83 -68 97 153 30 22 91 30 20 13 -23 5 58 -37 -148 1 52 134 90 72 94 99 36 164 194 242 322 226 110 107 185 302 403 332
2526C32K8n0q5l9o9J07r5j53j43J21J00q4J0O0K0Nj68N1k3n0k4j3NR7J30P5j30nK2l5q7J2
$$ 332 360 310 225 186 117 224 129 -24 -167 -46 54 -30 -20 40 60 65 -103 -52 -75 -125 -149 -162 -157 -60 70 145 15 10 32 -3 -90 -78
2519g8J0Q0Nj30J29j6q5L5j3P1OK1LMj17M5R0P1Qk9m5o2k2J4L6R1o3N8J8m3l1J01op8J0M3
$$ -78 -68 12 17 -113 16 0 -85 -50 -63 8 14 35 38 42 -75 -30 60 131 139 110 65 3 -19 -5 31 122 59 117 135 92 61 162 156 78 88 131
2510A31j58J5O7M5r9J9R4N2q6k8K8Oq3J8o1l6l7J9j6O5J4o2Q3kNO5q3m0J5J26M4j39p6J6J45
$$ 131 -27 -12 55 100 1 20 114 166 80 52 80 86 3 21 -40 -76 -113 -94 -110 -45 -31 -93 -10 -12 -7 58 -25 -65 -50 76 120 -19 -95 -79 66
2501F6Q2p4l5L1r9M4j9J46R2k8j05j01j7q1R4L3L0p4l3P7N7L1l4J32K6j31m6J6j28K8m7J44
$$ 66 148 74 39 70 -29 15 -4 142 234 206 101 0 -17 -98 -4 29 59 -15 -48 29 86 117 83 215 241 110 64 80 -48 -20 -67 77
2493G7J08r6o0L8K7l3Q7j0j13mk7N7l1j2j44J91J11n7n7NK6%j6R7j07J2J0P5Q0q2k06P5J06
$$ 77 185 89 29 67 94 61 148 138 25 21 -6 51 20 8 -136 55 166 109 52 57 83 83 67 164 57 69 79 154 234 152 -54 21 127
2485A27o8N6k7K0q7m8J12J46o9O7l1k31j11K20K5j6o8M5J6l3m1j7N5Om3k5L4J07o9m3J65L8
$$ 127 59 115 88 108 21 -27 85 231 162 229 198 -33 -144 76 101 85 17 62 78 45 4 -13 42 48 5 -20 14 121 52 9 174 212
2477B12j59L7j1k2l3PQ7p3j84m8Q1J0nJ87j10o8R9pJ1l5J23j6j34OQ8L9mo5q4O0J11j8p1n0
$$ 212 53 90 79 57 24 31 118 45 -139 -187 -106 -96 -101 86 -24 -92 7 0 11 -24 99 83 -51 -45 43 82 78 13 -71 -11 100 82 11 -39
2469c9m1J00O3r9M8N9n9k9m2r0J35NO9o4j9K7N4p0K11j08p3m7j74j4J01J09J4o0L3Rk6j3m6
$$ -39 -80 20 83 -16 32 91 32 3 -39 -129 6 11 80 16 -3 24 78 8 219 111 38 -9 -183 -197 -96 13 27 -33 0 9 -17 -30 -76
2461g6O0M7pL6J9k7j1P9k0m4n6P1L9k5m3J2o5K8m7L1l4N6l3m1r9R8J4p3P1rl0k3K0j8j9M6
$$ -76 -16 31 24 60 79 52 41 120 100 56 0 71 110 85 42 54 -11 17 -30 1 -33 23 -10 -51 -150 -52 -38 -111 -40 -49 -79 -102 -82 -100 -119 -73
2452g3J16OJ8m9MJ13MK3o3j07M1mm8J22q7K5k0l2Q9j8J3J00n1R0j07m8P2K8L6P3j6j03j23
$$ -73 43 49 67 18 22 135 139 162 99 -8 33 29 -19 103 16 41 21 -11 78 60 73 173 122 212 105 57 129 157 193 266 250 147 24
2444B4Mp6Q5J43j3L1j36j6QRK2PN9l9P7j9j14j14q7R0J36L5j8j13J03J7o0r0q4J80L7l6k3
$$ 24 28 -48 37 180 167 198 62 46 54 63 85 92 151 112 189 170 56 -58 -145 -55 81 116 98 -15 88 105 45 -45 -129 51 88 52 29
2436B9J0j01K2J24L7LL0Pm2j30m2J66j49o0M0k5Q0J40m4j48P7J63j37Q3J0k1r4m8J55p5r1
$$ 29 39 -62 -40 84 121 124 154 161 119 -11 -53 113 -36 -96 -56 -81 -1 139 95 -53 24 187 50 133 143 122 28 -20 135 60 -31
2429c1q4L3K10J1k6J27j6j13o0J5l3L1M2j09mj8J12K3o8P2j7n7q0L1K8P3j2qO0J31q7mK7k0
$$ -31 -115 -82 128 139 113 240 224 111 51 66 33 64 106 -3 -7 -25 87 110 42 114 97 40 -40 -9 19 92 80 72 132 263 176 172 199 179
2420A79P3L2j38r6k9J32m4n2N4L3pl4j22m3L0K9P8R1m0j1Mo6R1L6K3L8q5j5K1j05j32R1J6
$$ 179 252 284 146 50 21 153 109 57 111 144 137 103 -19 -62 -32 -3 75 166 126 115 119 53 144 180 203 241 156 141 162 57 -75 16 32
2412C2Q9q5O9k7K%j0J28j68n4R6J35J18j19j0o4L2N9J15k2j82P7L3j54R8K2l2R0k3r9J5kM3
$$ 32 121 36 105 78 80 80 70 198 30 -24 72 207 325 206 196 132 164 223 338 316 134 211 244 90 188 210 178 268 245 146 161 159 202
2404B02j16J1j00j07J30N9k2n1R2N9J9J07r3m1r3K8K2Q5j00K2o7O0j2N2j5RJ04j9K4j2j22
$$ 202 86 97 -3 -110 20 79 57 6 98 157 176 283 190 149 56 84 106 191 91 113 46 106 94 146 131 140 244 225 249 237 115
2397A15N2J17J95M6j14k0j08Q7j8l1l9p7p2J6Ol1L3J2L7rn1q9RL7J17k7N0J1oj12p6r1K4P4
$$ 115 167 284 479 525 411 391 283 370 352 321 282 205 133 149 155 124 157 169 206 197 146 57 66 103 220 193 243 254 248 136 60 -31 -7 67
2388F7M6J35J01q5m6M2k6J46J8n8n0m6j9j0M0K3M9n7o9n3M8k2p1k1M2L1p3q7O2L1p2R5l3J8
$$ 67 113 248 349 264 218 260 234 380 398 340 290 244 225 215 255 278 327 270 201 148 196 174 103 82 124 155 82 -5 57 88 16 111 78 96
2380I6J12j0o7N2m2j7j6mM6M4J11mj35k8J01j4j13j01rr6R7J03n0KL8P3j02lo2Rj8Q4O3jp5
$$ 96 208 198 131 183 141 124 108 104 150 194 305 301 166 138 239 225 112 11 2 -94 3 106 56 58 96 169 67 64 2 11 -7 77 140 139 64
2371F4j11jL8M4Q7P2j19q1k9J4M1Nq5P4P2l6l0j88J70R1M6O3o2P9j4m7r6k1L4K3M7o8j12K2
$$ 64 -47 -48 -10 34 121 193 74 -7 -36 -22 19 24 -61 13 85 49 19 -169 1 92 138 201 139 218 204 157 61 40 74 97 144 76 -36 -14
2363a4M2Jm4j19R3J37n6j03k05K0J25M7JO3m4J36K9j42n4L6j1p1J02o8j22K9P0K3p0M9Q0n3
$$ -14 28 29 -15 -134 -41 96 40 -63 -268 -248 -123 -76 -75 -12 -56 80 109 -33 -87 -51 -62 -133 -31 -99 -221 -192 -122 -99 -169 -120 -40 -93
2355i3L0O1L5j02M4RJ1n4p1N8l1R2P9j4n0l1N7n0P0j49J02k6m3J48k9r0N4O5q7j11LOMN5M5
$$ -93 -63 -2 33 -69 -25 -16 -5 -59 -130 -72 -103 -11 68 54 4 -27 30 -20 50 -99 3 -23 -66 82 53 -37 17 82 -5 -116 -113 -107 -103 -48 -3
2347co3Rl5J68j05M2J15nk08j8J32KN1N6j22o8O4n8J4l4m1j4J04L7R8J06l9o3j23o6P0J45
$$ -3 -66 -57 -92 76 -29 13 128 123 -85 -103 29 31 82 138 16 -52 12 -46 -32 -66 -107 -121 -17 20 118 224 185 122 -1 -67 3 148
2339A48k37O7j0K8NK6l9Rr5o4J07o9p9P8m5K02Rk4P2K5j45No3Q5P3j65J17k0j29L8J79J3J9
$$ 148 -89 -22 -32 -4 1 27 -12 -3 -98 -162 -55 -124 -203 -125 -170 32 41 17 89 114 -31 -26 -89 -4 69 -96 21 1 -128 -90 89 102 121
2331A21j01qn6l4J01l5o7m3Q0N4Kn5J01N2L1k9o1l7n8J19p0n2m6k5M0K3j54n0J13Q0P1M6n2
$$ 121 20 12 -44 -78 23 -12 -79 -122 -42 12 14 -41 60 112 143 114 53 16 -42 77 7 -45 -91 -116 -76 -53 -207 -257 -144 -64 7 53 1
2323Al1l9K9Q5j8K6N0N0l0j17O2R2k69l4N7K0j03L7J20n4n4J16l9K2q0L4J7o6K7O3Kl9L3j0
$$ 1 -30 -69 -40 45 27 53 103 153 123 6 68 160 -109 -143 -86 -66 -169 -132 -12 -66 -120 -4 -43 -21 -101 -67 -50 -116 -89 -26 -24 -63 -30 -40
2314d0M1J08p8m1L3Kk0J18M8p6j3j67p2J73k5P5O0j73pJ05J5j51j9R9L9L9L4o9K7M6p4j21
$$ -40 1 109 31 -10 23 25 5 123 171 95 82 -85 -157 16 -9 66 126 -47 -54 51 66 -85 -104 -5 34 73 107 38 65 111 37 -84
2307h4R3j6K8J22k9l9j3j4K4p1M9J5J2N8J14j84J4Pk6n4J04Q8j02j03J46P9m1j41J42k8j11
$$ -84 9 -7 21 143 114 75 62 48 72 1 50 65 77 135 249 65 79 86 60 6 110 198 96 -7 139 218 177 36 178 150 39
2299C9L2j5lJ26Rq9P6R6n4r2o5m9Q5J90k4Qj22Rk9n3M8L5q9R0lJ37jj2J0r0L6Q9k7O0p2p3
$$ 39 71 56 53 179 188 99 175 271 217 125 60 11 96 286 262 270 148 157 128 75 123 158 69 159 156 293 292 280 290 200 236 325 298 358 286 213
2290B13j22k2M4O4l5O5n9nL9p9O1L9r5l2J17PM0rP8R4K1l7l6O6j06N6J53J00q4LK4r2n7l8
$$ 213 91 69 113 177 142 207 148 143 182 103 164 203 108 76 193 200 240 231 309 403 424 387 351 417 311 367 520 620 536 539 563 471 414 376
2282C76KJ0n7j04n5m3J22K9k9J5p3K9J43k5k1J31M2L3n9j07mJ51o0j05J7q1N0Jl6q7j11J64
$$ 376 378 388 331 227 172 129 251 280 251 266 193 222 365 340 319 450 492 525 466 359 355 506 446 341 358 277 327 328 292 205 94 258
2274B58O4l1RL3N4p4j8m3p4L9J07Q7J07l8Mk3j47J56q7o2q6k7K3j1J05j54L8P5n4r6k0J5n1
$$ 258 322 291 300 333 387 313 295 252 178 217 324 411 518 480 484 461 314 470 383 321 235 208 231 220 325 171 209 284 230 134 114 129 78
2266G8J16J13mq5lp2p2l3R7P6rM0n8J38%O4j9r9j20Nn6K2k9L8N6M6l8o7M8L9j5P2N8%Q7N6
$$ 78 194 307 303 218 215 143 71 38 135 211 202 242 184 322 322 386 367 268 148 153 97 119 90 128 184 230 192 125 173 212 197 269 327 327 414 470
2257D70q0k2q8RP8r1l8lk1N3R0Pk0J01O6o0j05kl9OJ33J24M4o3L4Q4P1R7N3j58j62rm0J19
$$ 470 390 368 280 289 367 276 238 235 214 267 357 364 344 445 511 451 346 344 305 311 444 568 612 549 583 667 738 835 888 730 568 559 519 638
2249F38R2rPp0M7KM6l2k6m8M6P2R0O4r7M5P2N5r5opj0N7K0Kop0q6J95QM9J03M8j86n8Q3J61
$$ 638 730 721 728 658 705 707 753 721 695 647 693 765 855 919 822 867 939 994 899 893 886 876 933 953 955 949 879 793 988 996 1045 1148 1196 1010 952 1035 1196
2240A196L25J1j64j08o4k7p5J06J44j09J2n3m8k8N4o9J71M1M2q3j22n2J31J26J82J78m2k03
$$ 1196 1521 1532 1368 1260 1196 1169 1094 1200 1344 1235 1247 1194 1146 1118 1172 1103 1274 1315 1357 1274 1152 1100 1231 1357 1539 1717 1675 1472
2233A472m5O4J45K2j83o2j5p0J09K0o4j48k9K7Q4k9j3l2J26J58K23j01j36j37j34LO8N4j22
$$ 1472 1427 1491 1636 1658 1475 1413 1398 1328 1437 1457 1393 1245 1216 1243 1327 1298 1285 1253 1379 1537 1760 1659 1523 1386 1252 1255 1323 1377 1255
2226A255k5L1j39P2Q2N1K0j50j13p3J49J43L6K8k04p6k2J13o6O3K1j87Km5Ln9k3M9p7p9R1
$$ 1255 1230 1261 1122 1194 1276 1327 1347 1197 1084 1011 1160 1303 1339 1367 1163 1087 1065 1178 1112 1175 1196 1009 1011 966 969 910 887 936 859 780 871
2218H71Mk7J23J44n4r6k16L8J7M4J1rj07Q0J4q3L2j33J8j84K4P3j3PM3K5q4p5m6N5P4N0k1
$$ 871 875 848 971 1115 1061 965 749 787 804 848 859 850 743 823 837 754 786 653 671 487 511 584 571 578 621 646 562 487 441 496 570 620 599
2210E99K01M3l5j85o5J43%Q4j54k7q2rJ0O4J00j33P2Q3j9J30q9j51m2o6J9N9%K0K01K8J55
$$ 599 800 843 808 623 558 701 701 785 631 604 522 513 523 587 687 554 626 709 690 820 731 580 538 472 491 550 550 570 771 799 954
2203I54j16j9j9l0l3m5J49%J04mj8q8j0L0jR8q7j32K8%o2l3J28K7p7M6N0J13K8R1l4R2nm4
$$ 954 838 819 800 770 737 692 841 841 945 941 923 835 825 855 854 952 865 733 761 761 699 666 794 821 744 790 840 953 981 1072 1038 1130 1125 1081
2194A081l2p9P3l5N6M5L5k4o8J07J20J05j40J3K29n4R5P5N6Q8RP4J2K0P4J29R8J93J21P8J73
$$ 1081 1049 970 1043 1008 1064 1109 1144 1120 1052 1159 1279 1384 1244 1257 1486 1432 1527 1602 1658 1746 1755 1829 1841 1861 1935 2064 2162 2355 2476 2554 2727
2187B727K56L64N18N32O87J235K322L960N475L454m70k030J33M225P780N225k392o521m969
$$ 2727 2983 3347 3865 4397 5084 6319 8641 12601 18076 21530 21060 19030 19163 23388 31168 36393 34001 27480 22511
2182B2511j886l99r21k043k805k197j062l18n38l68O50J888K416J304L54J192L964Q249J1299
$$ 22511 20625 20226 19305 17262 14457 12260 11198 10880 10342 9974 10624 12512 14928 16232 16586 17778 21742 29991 41290
2177D1290O604j684l347J788R615J0199K788o064j1592r129k257L090M159M171N414L782j568
$$ 41290 47894 46210 42863 44651 54266 64465 67253 61189 49597 40468 38211 41301 45460 49631 55045 58827 57259
2173E7259l736J127J0460J6736R298n662j2764q409r93J972o96m769o679n779m936l684k70
$$ 57259 53523 54650 65110 81846 91144 85482 72718 64309 63316 65288 64592 59823 53144 47365 42429 38745 38475
2169C8475K818K584J913L220L207K28K34O771J7083K0872R517l078m19J6300L3184K4125l15
$$ 38475 41293 43877 45790 49010 52217 52445 52679 59450 76533 97405 106922 103844 103425 119725 152909 177034 176719
2165A76719j8590k8646k2427o487N381R629J1514Q558n258j6833j3338l393Q866K3024K7988
$$ 176719 158129 129483 107056 100569 105950 115579 127093 135651 130393 113560 100222 96829 105695 128719 156707
2161A56707O729j1763o142J0138J8219Q787J382m2j0038k0430j3181R108L2841N8093O2332
$$ 156707 163436 151673 145531 155669 173888 182675 184057 184015 173977 153547 140366 149474 182315 240408 302740
2158C02740Q923n5391o6854m4916k1161k480J3110J9611O213m11R499j76j5262j1234K547
$$ 302740 311663 256272 189418 144502 123341 120861 133971 153582 159795 159384 168883 168707 153445 142211 144758
2154A44758K865j5080k2409j4446j917J3053K4749J5853j2236k8592k2618j0601j900L68k264
$$ 144758 147623 132543 110134 95688 93771 106824 131573 147426 135190 106598 83980 73379 71479 71847 69583
2150F9583k132L704P924M853k468m814K03O471K076q964j1743n753j751k949n532o413n528
$$ 69583 67451 71155 79079 83932 81464 76650 76853 83324 85400 76436 64693 58940 57189 54240 48708 42295 36767
2146C6767m131j870J050L311M253M925Q846J3715J0421N77n460o09O626J1388N333j1747j5976
$$ 36767 32636 30766 31816 35127 39380 44305 53151 66866 77287 77864 72404 71795 78421 89809 95142 83395 67419
2142F7419o959R10M351n40r552j0899o846l581k828l037j423J600K580R14q27j51L623O238
$$ 67419 60460 61370 65721 65181 55629 44730 37884 34303 31475 28438 27015 28615 31195 32109 31282 31131 34754 40992
2138D0992L736n02k137k856k278o78J004L038J867l646o542m589j644M23J170L0N92J277j626
$$ 40992 44728 44226 42089 39233 36955 36277 37281 40319 42186 38540 31998 27409 25765 26188 27358 27388 27980 29257 27631
2133B7631l270n07M686Q341K065o940o910k589J618K836j504n838n336l056j715j557j471
$$ 27631 24361 23854 28540 36881 38946 32006 25096 22507 24125 26961 25457 19619 14283 11227 9512 7955 6484
2129F484j161p38m17j10mJ91N18Q98J552K234J218l31m99Q76K813L873J057k667l531k189
$$ 6484 5323 4585 4168 4058 4054 4245 4763 5661 7213 9447 10665 10334 9835 10711 13524 17397 18454 15787 12256 10067
2124A0067j41J034J33j785k378k085j218r25l01k48l32j90k22k21l6O9k14j55r7R7n0L3J9
$$ 10067 9926 10960 11093 9308 6930 4845 3627 2702 2401 2153 1821 1631 1409 1188 1152 1221 1007 852 755 852 802 835 854
2118H54O3j5j10q8lO3l4rMj17n0J0n7m8MN5J5j0q3J22Q6L2o9k2j8j20Q8Mp2j6r2j64J62J12
$$ 854 917 902 792 704 701 764 730 721 725 608 558 568 511 463 467 522 537 527 444 566 652 684 615 593 575 455 543 547 475 459 367 203 365 477
2110D77lNK1l5lk1M8mq7p2N2K9J2J41Q7l4lJ2M3k0R6L7p3o9L3Qj05oK0k9m9k3j24oj81P5j06
$$ 477 474 479 500 465 462 441 489 485 398 326 378 407 419 560 647 613 610 622 665 645 741 778 705 636 669 677 572 566 586 557 508 485 361 355 174 249 143
2101A43J05P1N7M5o6L3J88J58O9o6n0l6Q6K3K46l1j16j73j17L8J6o4M3M0k0k70JQ7J03M3j55
$$ 143 248 319 376 421 355 388 576 734 803 737 687 651 737 760 1006 975 859 686 569 607 623 559 602 642 622 352 353 440 543 586 431
2093D31J5J30J07Lrn5Q7l2o2%N8m5N4o2j41r1j38N5Q8L7K05N7O7N8j47Q9J28K0Rj14jL8O1
$$ 431 446 576 683 686 677 622 709 677 615 615 673 628 682 620 479 388 250 305 393 430 635 692 759 817 670 759 887 907 916 802 801 839 900
2085I00m6P7m4j07n0j34J11K8oN7q1k6p6r3KJ53L9j98lO7NQ9K07Mj75j40K9L2R6l7o7J23j00
$$ 900 854 931 887 780 730 596 707 735 729 786 705 679 603 510 512 665 704 506 503 570 575 664 871 875 700 560 589 621 717 680 613 736 636
2077F36j06L7j6K9Q4L1j35k5K01rN0p6l6k3J29o0k0o3K7J27k1j61j78K6m5Q9jp8j4O2j0r5
$$ 636 530 567 551 580 664 695 560 535 736 727 777 701 665 642 771 711 691 628 655 782 761 600 422 448 403 492 491 413 399 461 451 356
2069C56j8J01k1o5N6n8J13J7k2J39O1r1l2rj5R5J30J54k12r4p8r0%J53r5l5J7j0p3j18P9o8
$$ 356 338 439 418 353 409 351 464 481 459 598 659 568 536 527 512 607 737 891 679 585 507 417 417 570 475 440 457 447 374 256 335 267
2061B67MJ5k7M0O6l9R6N2L5j04l2n7m5K6N2Mj18q3J29K3O5N9n4n3j26j5lQ6L9M2p7j11M7M6
$$ 267 271 286 259 299 365 326 422 474 509 405 373 316 271 297 349 353 235 152 281 304 369 428 374 321 195 180 177 263 302 344 267 156 203 249
2053B49Qr0O0l9%N2j7j12p2J38n6j13p2j8K09M5J9k9q8L7Qj5P4P0M3j3j2R6q4J1j03p6J14
$$ 249 257 167 227 188 188 240 223 111 39 177 121 8 -64 -82 127 172 191 162 74 111 119 104 178 248 291 278 266 362 278 289 186 110 224
2045B24K8q5L4n7j53O7lo2L6K5J9O4L1J18J08j00j13N9j5j05j06l2j1M3pK0K3q4m0N7M9K5
$$ 224 252 167 201 144 -9 58 55 -7 29 54 73 137 168 286 394 294 181 240 225 120 14 -18 -29 14 7 27 50 -34 -74 -17 32 57
2037E7j5L6N2j09K7P6km1j65k2j05J14n6J22J18no3p3M4J6M4oo8O6n4k5qQ7j07l9J03L6n4
$$ 57 42 78 130 21 48 124 122 81 -84 -106 -211 -97 -153 -31 87 82 19 -54 -10 6 50 44 -24 42 -12 -37 -45 42 -65 -104 -1 35 -19
2029a9L4O9J07o5j02o4J0L7J0J16L2m2n1J01o0q1q6P8N8n1j8K9j1l9L5M2P9K5q5Oj06o7m8
$$ -19 15 84 191 126 24 -40 -30 7 17 133 165 123 72 173 113 32 -54 24 82 31 13 42 31 -8 27 69 148 173 88 94 -12 -79 -127
2021a27j0O4K6j3J1Q4O6P3n1j5J34j42q0j5P2M9j11q5M4J2m9Q0Q3O4p6N1L6j27J22J7k4j21
$$ -127 -137 -73 -47 -60 -49 35 101 174 123 108 242 100 20 5 77 126 15 -70 -26 -14 -63 17 100 164 88 139 175 48 170 187 163 42
2013D2m5K3P5j00k2R4O6P6j0j02l2P0l3o0m6K3Q0J8m0qj9j9j02j0KK2K9J30P7j79j20J03o
$$ 42 -3 20 95 -5 -27 67 133 209 199 97 65 135 102 42 -4 19 99 117 77 69 50 31 -71 -81 -79 -57 -28 102 179 0 -120 -17 -23
2005b3K0R0J1o3n5%Q7k5J24j42o6M7J7P1k5L0m7P9L5k5O6j71pJ20l3o3M3J26j91r3j29J14
$$ -23 -3 87 98 35 -20 -20 67 42 166 24 -42 5 22 93 68 98 51 130 165 140 206 35 28 148 115 52 95 221 30 -63 -192 -78
1997g8M6M8Q2m1p1p8M3L8L5K2R%m3q7N4Q1k7M2n0k4M9k8K9r7L4o4j7N0J2P7J0j09m6m9l9J47
$$ -78 -32 16 98 57 -14 -92 -49 -11 24 46 55 55 12 -75 -21 60 33 75 25 1 50 22 51 -46 -12 -76 -93 -43 -31 46 56 -53 -99 -148 -187 -40
1989d0K7l2J9Jn2R4J39L4j75J03J04j04j52R5mK16p5j26J37N1k32m3m8mN0P9q4J28k7P3Qk3
$$ -40 -13 -45 -26 -25 -77 17 156 190 15 118 222 118 -34 61 57 273 198 72 209 260 28 -15 -63 -67 -17 62 -22 106 79 152 160 137
1981A37l9o9Q3r4j3K2O4K6j6P3n8Ro2m2K0j9Q3k4j19Q0P3j7NK5k2m1mK0o1M2o8Jm3M9m3r4
$$ 137 98 29 112 18 5 27 91 117 101 174 116 125 63 21 41 22 105 81 -38 42 115 98 103 128 106 65 61 81 20 62 -6 -5 -48 1 -42 -136
1972a36J13J00P4j06NL4j5j9PM9L5o3l9P2n4o0J4O2j01o2O7M6k2P4m3j09J48K3J4l8l2l0j20
$$ -136 -23 77 151 45 50 84 69 50 57 106 141 78 39 111 57 -3 11 73 -28 -90 -23 23 1 75 32 -77 71 94 108 70 38 8 -112
1964a12M0J35N1p6p5J7L4J56Nrj83p1M8Q1J08L1j18L4N2Jn1j09%O0m4J0P6J1q1O4j01k6l1
$$ -112 -72 63 114 38 -37 -20 14 170 175 166 -17 -88 -40 41 149 180 62 96 148 149 98 -11 -11 49 5 15 91 102 21 85 -16 -42 -73
1956g3o7Q3M3R8j32l2o2n7O0J12n6n3J36J18q0p5N8Q6r5o8P9L9j15O8J11Q7m1o5N0j38j8L5
$$ -73 -140 -57 -14 84 -48 -80 -142 -199 -139 -27 -83 -136 0 118 38 -37 21 107 12 -56 23 62 -53 15 126 213 172 107 157 19 1 36
1948C6R0j1q7q9M7J3O3o0%qJ01J10M1j11j56N8l6nO5j70L0Q8N6m5Q2o7M5l7Jj14k7P6J50l2
$$ 36 126 115 28 -61 -14 -1 62 2 2 -6 95 205 246 135 -21 37 1 -4 61 -109 -79 9 65 20 102 35 80 43 44 -70 -97 -21 129 97
1940I7q2j08K9P8n7p4O3q4q7R1J05R1J6Mn3l8J22M2JRm9j5M8o8m9oJ21m1p3p1j8J38%MNr3
$$ 97 15 -93 -64 14 -43 -117 -54 -138 -225 -134 -29 62 78 82 29 -9 113 155 156 165 116 101 149 81 32 26 147 106 33 -38 -56 82 82 86 91 -2
1931blL0R2K6p8l6K9J5j9K7l7o7P4pj7j6K7J04N4o9lo1L9j04L3p0KM0n8R7M1pl2j0l7O2R0
$$ -2 -5 25 117 143 65 29 58 73 54 81 44 -23 51 44 27 11 38 142 196 127 124 63 102 -2 31 -39 -37 3 -55 42 83 76 44 34 -3 59 149
1922A49p2q5M8l7p4K0O8R2j0p9k2J27N0j82L0%o9N4m1N6KL5J0p1K9k0M2o1m9kJ01O9N5j92
$$ 149 77 -8 40 3 -71 -51 17 109 99 20 -2 125 175 -7 23 23 -46 8 -33 23 25 60 70 -1 28 8 50 -11 -60 -62 39 108 163 -29
1914b9%M3P4o2J4RJ4o0k8o0N9Q4m5j19J3j0J7O9m1N1Ko5M8J15m8k4J43l8p2j01k8O1m6MN3
$$ -29 -29 14 88 26 40 49 63 3 -25 -85 -26 58 13 -106 -93 -103 -86 -17 -58 -7 -5 -70 -22 93 45 21 164 126 54 -47 -75 -14 -60 -56 -3
1905cK2mj2O1j08o4N1R3p3r0J10J8m9jN2J38qJ70j7j79n9L4k3n7P8l0J2O2n4j6j1L9n0m5P5
$$ -3 19 15 3 64 -44 -108 -57 36 -37 -127 -17 1 -48 -49 3 141 133 303 286 107 48 82 59 2 80 50 62 124 70 54 43 82 32 -13 62
1896F2r1r9K3Q4L0J0j5r4k9J29K5l2p9K9Q7l6q5L0P1L6O0n0LoK6pr0J2j0n7OQ4j23kQ8L6O3
$$ 62 -29 -128 -105 -21 9 19 4 -90 -119 10 35 3 -76 -47 40 4 -81 -51 20 56 116 66 69 63 89 82 -8 4 -6 -63 -57 27 -96 -98 -10 26 89
1887H9m4j71P8R4K2Q3j19o9l4O2L2lo3R3Oj52L1l5j4P6O8mn0N7k3M0K9P5P4j89qJ8j0L6j8
$$ 89 45 -126 -48 46 68 151 32 -37 -71 -9 23 20 -43 50 56 -96 -65 -100 -114 -38 30 26 -24 33 10 50 79 154 228 39 31 49 39 75 57
1879E7Lo4K2J8O2RJ07K9j54j40P0L2j4m2K8%O0M7L5m8l8nnK4K4m2N8K2NK6qMl5lQJ16J24L4
$$ 57 60 -4 18 36 98 107 214 243 89 -51 19 51 37 -5 23 23 83 130 165 117 79 74 69 93 117 75 133 155 160 186 178 182 147 144 152 268 392 426
1870D26l7N6J46l0J17J27J40P9J16L84N73N52Q33J043J198J352J169J079Q57N25M88N57j15
$$ 426 389 445 591 561 678 805 945 1024 1140 1524 2097 2649 3482 4525 5723 7075 8244 9323 10180 10705 11193 11750 11635
1864A1635j040j897k169j797j246r70o64m18j73r5q5k23k58j38j00J42op9k18o6M5L3M0K9
$$ 11635 10595 8698 6529 4732 3486 2516 1852 1434 1261 1166 1081 858 600 462 362 504 498 419 201 135 180 213 253 282
1858B82j66r6J84m4r0J6J4o4Q4n2N2m2l9N5J5k6k2J21m8p3m6qK0l7k9j8R4K1j1j4J35j25r9
$$ 282 116 20 204 160 70 86 100 36 120 68 120 78 39 94 109 83 61 182 134 61 15 7 27 -10 -39 -57 37 58 47 33 168 43 -56
1850e6O4l9J87k0q8L5n6O8j13rP2rl2M5k2j5m6q9N6J81j06m0P4rN0p1J54j2Qp8K4k9j20J19
$$ -56 8 -31 156 136 48 83 27 95 -18 -27 45 36 4 49 27 12 -34 -123 -67 114 8 -32 42 33 83 12 166 154 162 84 108 79 -41 78
1842G8k8kj3r7K03k8ok7j9m7l6PP6J7j14q3J07O4n1J13K1N2j19N9L0%mp3j5J1q6J15q8n3O3
$$ 78 50 48 35 -62 141 113 107 80 61 14 -22 -15 61 78 -36 -119 -12 52 1 114 135 187 68 127 157 157 153 80 65 76 -10 105 17 -36 27
1833B7m3p1O4J29o0O5n0ql9q4j0J93K7%K4j07q5N5nN4l2j26m9r4J61P2k4oqO3p7k1Q4j14R5
$$ 27 -16 -87 -23 106 46 111 61 53 14 -70 -80 113 140 140 164 57 -28 27 22 76 44 -82 -131 -225 -64 8 -16 -22 -30 33 -44 -65 19 -95 0
1825@N8r1l3L2R5L6n8J3m7M6k0p1q5n0K3O6k2L4J21N5L9j73o4J15j0r2O1N0j08Q8N7J0n8j34
$$ 0 58 -33 -66 -34 61 97 39 52 5 51 31 -40 -125 -175 -152 -86 -108 -74 47 102 141 -32 -96 19 9 -83 -22 28 -80 8 65 75 17 -117
1816a17l0O8l0K1J9Kl6M0m1J17K3K5o1L3o5qJ13m5p8J66Q6n6q9j04L8J7mN2p3l5l5j31N7J03
$$ -117 -147 -79 -109 -88 -69 -67 -103 -63 -104 13 36 61 0 33 -32 -40 73 28 -50 116 202 146 57 -47 -9 8 4 56 -17 -52 -87 -218 -161 -58
1808e8J36p2j22P1L3N9L9k9L3j09n6J30qk5m6k4P4J62n5j47q7J2K7O6J5p9l9O0O0N3k0m2L2
$$ -58 78 6 -116 -45 -12 47 86 57 90 -19 -75 55 47 22 -24 -48 26 188 133 -14 -101 -89 -62 4 19 -60 -99 -39 21 74 54 12 44
1800D4k8q0O1j42Q5K9Oj8K2M3mk9j29Jl3M0J37J29ql1q4n4k1J0k2J33k1j08P1J23R1Pj04o7
$$ 44 16 -64 -3 -145 -60 -31 -25 -43 -21 22 18 -11 -140 -139 -172 -132 5 134 126 95 11 -43 -64 -54 -76 57 36 -72 -1 122 213 220 116 49
1792D9L9O8j00o1N7j16m8m9K4J44R1j07n7L0l6q8l2K5O7J6M8mL3o7J7Q4J5K26j95k7J8J11
$$ 49 88 156 56 -5 52 -64 -112 -161 -137 7 98 -9 -66 -36 -72 -160 -192 -167 -100 -84 -36 -40 -7 -74 -57 27 42 268 73 46 64 175
1784A75j35q7N2J8M5N7oJ44j40j50L1k6Q0j10K6J03j00M5K7j6j62J23K9nn2n2m2J71P7l8p6
$$ 175 40 -47 5 23 68 125 119 263 123 -27 4 -22 58 -52 -26 77 -23 22 49 33 -129 -6 23 18 -34 -86 -128 43 120 82 6
1776Fj9mK7KK8L5m5M3q2%n8N0M2n3J1J96j40l4p8OM5NM0P2M0n4q8M7Q9jP9J6lp5l7Jj5k9Q
$$ 6 -13 -17 10 12 40 75 30 73 -9 -9 -67 -17 25 -28 -17 179 39 5 -73 -67 -22 -17 23 95 135 81 -7 40 129 128 207 223 220 145 108 109 94 65 73
1767G3lQ7r0kj09L4P7P6j93L9R9M5o6l0M7P3p2M4K3j0R3N9K2j79j62QR4k4L7p7M6R4r0K3M7
$$ 73 70 157 67 65 -44 -10 67 143 -50 -11 88 133 67 37 84 157 85 129 152 142 235 294 316 137 -25 -17 77 53 90 13 59 153 63 86 133
1758A33kk7M0k6j12m5N0L2N0j7m7j15j0j5L2J38K3O6J8j4r4p9K01n0j45mM3M1K4O3J08%K8
$$ 133 131 104 144 118 6 -39 11 43 93 76 29 -86 -96 -111 -79 59 82 148 166 152 58 -21 180 130 -15 -19 24 65 89 152 260 260 288
1750B88q2n7p1kK6L0Q7l3j11J14k2K4Lo3j71MJ11kP3p5J02Q8k26o5k1J20P7O2P3j38n9k1O7
$$ 288 206 149 78 76 102 132 219 186 75 189 167 191 194 131 -40 -36 75 73 146 71 173 261 35 -30 -51 69 146 208 281 143 84 63 130
1742A30p9N3L5o7m2KL4lQ0L0r1P1k6j00MJ32K6j6j06Okn0j36j0L6n1qJ28mp3m9kQ0l7o4O8
$$ 130 51 104 139 72 30 32 66 63 143 173 82 153 127 27 31 163 189 173 67 73 71 21 -115 -125 -89 -140 -148 -20 -24 -97 -146 -148 -68 -105 -169 -101
1733a01P1K6l3N4j11KP3K7Onl4k3O7j03j5Q4r6KL3KM1p3m8K28L7q1j01j2N5o1K8J2J7q3M0
$$ -101 -30 -4 -37 17 -94 -92 -19 8 14 9 -25 -48 19 -84 -99 -15 -111 -109 -76 -74 -33 -106 -154 74 111 30 -71 -83 -28 -89 -61 -49 -32 -115 -75
1725g5j3j8J32K0J7j4j9jJ01po1j48N9P2n4j11rR9L0R6k4j65O0O9m7oQ3j61j1kR1L3J4N6q
$$ -75 -88 -106 26 46 63 49 30 29 130 123 62 -86 -27 45 -9 -120 -129 -30 0 96 72 -93 -33 36 -11 -17 66 -95 -106 -108 -17 16 30 86 78
1716G8rn8RJ00J2j30q7J80J16j20j9J02j35m0k3J07o8Qmr6Qj00N9J19M8J95p5r3k3P9n6m5
$$ 78 69 11 20 120 132 2 -85 95 211 91 72 174 39 -1 -24 83 15 23 19 -77 -69 -169 -110 9 57 252 177 84 61 140 84 39
1708C9RO5M5q5pm0K7j4q0P0N5r1l1k1j3M1J34K2o2N3L2p3k9M1p8L3L5j56p1M3K6O9k5P3%r
$$ 39 48 113 158 73 66 26 53 39 -41 29 84 -7 -38 -59 -72 -31 103 125 63 116 148 75 46 87 9 42 77 -79 -150 -107 -81 -12 -37 36 36 27
1699B7J09N5o2n9K0o3l0L5M6j65m1m5J02O9K2Q7l6j48Q1M8j03O6J23j47j46L2J38N0j31R8
$$ 27 136 191 129 70 90 27 -3 32 78 -87 -128 -173 -71 -2 20 107 71 -77 4 52 -51 15 138 -9 -155 -123 15 65 -66 32
1692C2J16j24L1o3n4J13m5l9K5N4j53j05K4k8J08o7M3O8P8Lr7rL6N8J28N1k7Kr9n9J8l2j8
$$ 32 148 24 55 -8 -62 51 6 -33 -8 46 -107 -212 -188 -216 -108 -175 -132 -64 14 17 -80 -89 -53 5 133 184 157 159 60 1 19 -13 -31
1684c1oQ0on2J2N8n8L6j8O2j26Q6M2j55m6J11l9N0L9j07N6J35pj14P4L2pj33l7jO4r8J3K4
$$ -31 -37 43 37 -15 -3 55 -3 33 15 77 -49 37 79 -76 -122 -11 -50 0 39 -68 -12 123 116 2 76 108 101 -32 -69 -70 -6 -104 -91 -67
1676f7m7Q0K8q7PN4L0J9O3O7q9j17m1K7R3M0O3K13J37Oj08j99j02N8j67n3lL0L1Ln4J13M7
$$ -67 -114 -34 -6 -93 -86 -32 -2 17 80 147 58 -59 -100 -73 20 60 123 336 473 479 371 172 70 128 -39 -92 -95 -65 -34 -31 -85 28 75
1668G5q8O6r3LL5p9rKM1M5Q9R4O3L29N14L39k88m75l01j28q7j30N2j7j18Ok9l6J09j1J45o7
$$ 75 -13 53 -40 -37 -2 -81 -90 -88 -47 -2 87 181 244 573 1087 1426 1138 663 362 234 147 17 69 52 -66 -60 -89 -125 -16 -27 118 51
1660E1j27P4J12M6O5J1n2o9L5K24K48M13L57r5l76l38j48r2j68p4p6n5l6K4Q5r5j55O6P6j6
$$ 51 -76 -2 110 156 221 232 180 111 146 370 618 1031 1388 1293 917 579 431 339 171 97 21 -34 -70 -46 39 -56 -211 -145 -69 -85
1652h5L0J9J00J94j05j8J82k3r9O8N2R5J0j78j24l1j28Q2Q3n8K9mL8n2M4R9L3j5n6K8oO8P8
$$ -85 -55 -36 64 258 153 135 317 294 195 263 315 410 420 242 118 87 -41 41 124 66 95 91 129 77 121 220 253 238 182 210 204 272 350
1644C50q8p3O5p9j18MQ4J26m9J5J2J4j3r8Q0k5P5J28J04j7OnPj00k7o4Q4K9M7K27q5r8r8k9
$$ 350 262 189 254 175 57 61 145 271 222 237 249 263 250 152 232 207 282 410 514 497 503 498 505 405 378 314 398 427 474 701 616 518 420 391
1636C91j74L2m2R0L8n0N1J13J04O2O5r9k05J3p4jQ0K66J10j24m2r0j41j06o8M1J7J7R4p1r6
$$ 391 217 249 207 297 335 285 336 449 553 615 680 581 376 389 315 314 394 660 770 646 604 514 373 267 199 240 257 274 368 297 201
1628B01J13P8q1O0o2j16R6l7m0J30L3K6k9l7j08k6l7J05j5r0P6J37L0j78j34JN3rNN8J06j55
$$ 201 314 392 311 371 309 193 289 252 212 342 375 401 372 335 227 201 164 269 254 164 240 377 407 229 95 96 149 140 145 203 309 154
1621A54N5K1q2J32p0j10m5l1Q2J8l7J2k3M1J75n1q2M2K14J67j03k11L4K3j35n2m3qN5Q6K9
$$ 154 209 230 148 280 210 100 55 24 106 124 87 99 76 117 292 241 159 201 415 582 479 268 302 325 190 138 95 87 142 228 257
1613B57r7M8Q1N9r1MM7J09N8n8j15j25j61J31mj4M1K0J6p3l8N7rN6J10L0r8p3N6j6q3P8l6
$$ 257 160 208 289 348 257 261 308 417 475 417 302 177 16 147 143 129 170 190 206 133 95 152 143 199 309 339 241 168 224 208 125 203 167
1605A67r3L9n4J1q3R3l5L6l8N5J56J4M9l5j25j28k9l6L2J25j8J18K9J1j52p9M1j47KJ05L3
$$ 167 74 113 59 70 -13 80 45 81 43 98 254 268 317 282 157 29 0 -36 -4 121 103 221 250 261 109 30 71 -76 -74 31 64
1597F4J03Q9r7p5K2p0J6p5pn8q2n1J03Q2M7M4R1r0O2j3m7j31N9L4p6l5J51P9j21l3m0M3j1
$$ 64 167 256 159 84 106 36 52 -23 -30 -88 -170 -221 -118 -36 11 55 146 56 118 105 58 -73 -14 20 -56 -91 60 139 18 -15 -55 -12 -23
1589b3k4Q8jm5l9N2R6m5j25l9q8J4K9J68O4p9k8N8o6N9k1rN8m8O8O4n5o4mM2m8q1m2J54l4
$$ -23 -47 41 40 -5 -44 8 104 59 -66 -105 -193 -179 -150 18 82 3 -25 33 -33 26 5 -4 54 6 74 138 83 19 15 57 9 -72 -114 40 6
1581Fj39Q4m3p7M6Q3M6m5k1o8P2j3N5%N5n9j36K8kJ48k9r0PL2J16o6k27L4K08mo2k2j03Q8
$$ 6 -133 -49 -92 -169 -123 -40 6 -39 -60 -128 -56 -69 -14 -14 41 -18 -154 -126 -128 20 -9 -99 -92 -60 56 -10 -237 -203 5 1 -61 -83 -186 -98
1572i8P4o4K5R4r6P0K2J2o3q1o7N0j8P8L3l7k6j4l8lM9J8m8KJ07J03o8o0n2n7K5J06N7l2q5
$$ -98 -24 -88 -63 31 -65 5 27 39 -24 -105 -172 -122 -140 -62 -29 -66 -92 -106 -144 -147 -98 -80 -128 -126 -19 84 16 -44 -96 -153 -128 -22 35 3 -82
1564h2j72L5O6J01J34nk9n7m2jK1J61O1r3Kl5o8p6K5j3o6j0J2Lm9J08J12J8j05O8l0L6j8L1
$$ -82 -254 -219 -153 -52 82 77 48 -9 -51 -52 -31 130 191 98 100 65 -3 -79 -54 -67 -133 -143 -131 -128 -177 -69 43 61 -44 24 -6 30 12 43
1556D3q7kN9L3o0M6n5r2K0l7N3p1L1J26J9p6P1k9r2m6P6J51J1j87K27K16r5j33r3M5O8J76
$$ 43 -44 -46 13 46 -14 32 -23 -115 -95 -132 -79 -150 -119 7 26 -50 21 -8 -100 -146 -70 81 92 -95 132 348 253 120 27 72 140 316
1548C16J21J59O44J090K99o97p54m91k89j41Nj66j7nK0J3K0o7j5N0l8n0j7J4m5p7L9K0qn3
$$ 316 437 596 1240 2330 2629 1932 1178 687 398 257 262 96 79 74 94 107 127 60 45 95 57 7 -10 4 -41 -118 -79 -59 -67 -120
1540a20j8n2R1L7j9lJ35N0j21M6pk3j11l2R7N7J29J3j94j65K9J04J04p9l2M7J2j8pk8O6m3
$$ -120 -138 -190 -99 -62 -81 -84 51 101 -20 26 19 -4 -115 -147 -50 7 136 149 -45 -210 -181 -77 27 -52 -84 -37 -25 -43 -50 -78 -12 -55
1533e5k0J3Q6l7M2Q4j03j10K8J08l6n4j2M0J1j27j29J12%P5P5J12K5kMj28J86n3j65n9P0N5
$$ -55 -75 -62 24 -13 29 113 10 -100 -72 36 0 -54 -66 -26 -15 -142 -271 -159 -159 -84 -9 103 128 126 130 2 188 135 -30 -89 -19 36
1525C6m8L4J45r7j19n2J36R5p9n6R2N7j00k29QP9J9L4L4OK4%m7j25jm7lN0J09L0J45q8pJ9
$$ 36 -12 22 167 70 -49 -101 35 130 51 -5 87 144 44 -185 -177 -98 -79 -45 -11 -5 19 19 -28 -153 -154 -201 -204 -154 -45 -15 130 42 35 54
1516E4n0j8j2k4p0O5M1n8K7P7J0L1p3j6k0n4m3J07n6jn6qN6j3n4j23P9J77J2K7j57J10P3o2
$$ 54 4 -14 -26 -50 -120 -55 -14 -72 -45 32 42 73 0 -16 -36 -90 -133 -26 -82 -83 -139 -147 -91 -104 -158 -281 -202 -25 -13 14 -143 -33 40 -22
1508b2PrQ9Mo9l1j30r0J25O1m1j1K7l2%J32L2O1Q6k10K2j25OR2N9LJ15m8N0r5j06J6n0J7M6
$$ -22 -15 -24 65 69 0 -31 -161 -251 -126 -65 -106 -117 -90 -122 -122 10 42 103 189 -21 1 -124 -118 -26 33 36 151 103 153 58 -48 -32 -82 -65 -19
1500a9O0J6m6k6J4J16K0j40o9l4J21l7r3k9K3P7L8mJ29o7J4Mr5M5O9J1o9k3L8r6N9j4Mj02
$$ -19 41 57 11 -15 -1 115 135 -5 -74 -108 13 -24 -117 -146 -123 -46 -8 -12 117 50 64 68 -27 18 87 98 29 6 44 -52 7 -7 -3 -105
1491a05k8m5K33n5r7P0k0J7O8R6o0m0Qr1Q7Ol8P1M3q8L2N9M3P6Qk05k8J92o9mmq5J06k9N6
$$ -105 -133 -178 55 0 -97 -27 -47 -30 38 134 74 34 42 -49 38 44 6 77 120 32 64 123 166 242 250 45 17 209 140 136 132 47 153 124 180
1483A80m7k0L1j2l8J87k02J13N7Q3J94j4J08J36K45K15K19L56P75J371L486Q387J1382J402
$$ 180 133 113 144 132 94 281 79 192 249 332 526 512 620 756 1001 1216 1435 1791 2566 3937 7423 15810 27192 28594
1477B8594r500q524m739k506j171n89l43k42r4q8k09J9q1j53L6p4oL2m3R3j04o4Q1j07j28
$$ 28594 19094 10570 5831 3325 2154 1565 1222 980 886 798 589 608 527 374 410 336 330 362 319 412 308 244 325 218 90
1471I0N1j4Rk7k0l1Q4o7J19m2KK1j5M9M3n0jl1r6R0l5l6LN0O2o7n4n5K2K8l0L9J4q2M2J7O9
$$ 90 141 127 136 109 89 58 142 75 194 152 154 175 160 209 252 202 201 170 74 164 129 93 96 146 208 141 87 32 54 82 52 91 105 23 65 82 151
1462A51J25j24j05q4q4K5K01N0j36m5J21j07n1Q6Rj36j8km4L5M7M8J1R5N7K2k9R3j30N2m0
$$ 151 276 152 47 -37 -121 -96 105 155 19 -26 95 -12 -63 23 32 -104 -122 -124 -168 -133 -86 -38 -27 68 125 147 118 211 81 133 93
1454I3j29Q3j54m3N8OM0o9L4L8k9m1L4n6J07l4j17J46J1K4K3P5O5l3n0j87Q2l7j16R5R8k6
$$ 93 -36 47 -107 -150 -92 -86 -46 -115 -81 -43 -72 -113 -79 -135 -28 -62 -179 -33 -22 2 25 100 165 132 82 -105 -23 -60 -176 -81 17 -9
1446ij99j0K0Q3L8M6P2p1O2l3j5N7K5j16k1J00J4q3j5l1j20N2L8J48J4n2rP7r3J1N8N3j31
$$ -9 -208 -218 -198 -115 -77 -31 41 -30 32 -1 -16 41 66 -50 -71 29 43 -40 -55 -86 -206 -154 -116 32 46 -6 -15 62 -31 -20 38 91 -40
1438d0n2P0J01l1n9ml7j44K2J33L4j5j39n4J28K9O1p8q0N6J8J0M5j15K8O6ko1no6J68O4j42
$$ -40 -92 -22 79 48 -11 -15 -52 -196 -174 -41 -7 -22 -161 -215 -87 -58 3 -75 -155 -99 -81 -71 -26 -141 -113 -47 -49 -110 -115 -181 -13 51 -91
1430i1%l0J1Q5n0O4m4j30O9R3M2q1j9N1RK3j19Q1n4r4O0RL2n1QL5n9M4Q5L0j51N6mm5r6p0
$$ -91 -91 -121 -110 -25 -75 -11 -55 -185 -116 -23 19 -62 -81 -30 -21 2 -117 -36 -90 -184 -124 -115 -83 -134 -126 -91 -150 -106 -21 9 -142 -86 -90 -135 -231 -301
1421c01Q5j0P6Q1R8K7j76N3J8m8j13MR1K6Kj1k7K0l9M7J00k15r1J00j7L4N7l1J91L1n9p0R0
$$ -301 -216 -226 -150 -69 29 56 -120 -67 -49 -97 -210 -206 -115 -89 -87 -98 -125 -105 -144 -97 3 -212 -303 -203 -220 -186 -129 -160 31 62 3 -67 23
1413B3n5l6M3J7m2n7O6m3J33p7q7P8L0n6M7J42P3j84l7q1K0K5O2n1m6m8J41J20K9q2m1Mj02
$$ 23 -32 -68 -25 -8 -50 -107 -41 -84 49 -28 -115 -37 -7 -63 -16 126 199 15 -22 -103 -83 -58 4 -47 -93 -141 0 120 149 67 26 30 -72
1405g2r2nQ4Q2J5m4l7J26K1J38j56m6O3m0L4qMj19K9n8n0O1OO8Q9ORm9q3j5o4L6O2q1n0j02
$$ -72 -164 -169 -85 -3 12 -32 -69 57 78 216 60 14 77 37 71 63 67 -52 -23 -81 -131 -70 -64 4 93 99 108 59 -24 -39 -103 -67 -5 -86 -136 -238
1396b38L5J20P2m9l9N9QO2k2m4Q3j6l1nj10kR7k2M9N9o4j55Q1M8J00p2Ll9l4QR3K0n5R5O8
$$ -238 -203 -83 -11 -60 -99 -40 -32 30 8 -36 47 31 0 -5 -115 -117 -20 -42 7 66 2 -153 -72 -24 76 4 7 -32 -66 -58 35 55 0 95 163
1388A63j47m5J9MJ02j16r2R6L6n5L1KJ1J0q3O7j3P0K5k2j4%M2J7l8l2O5q6N9o0r5P1jO4M0
$$ 163 16 -29 -10 -6 96 -20 -112 -16 20 -35 -4 -2 9 19 -64 3 -10 60 85 63 49 49 91 108 70 38 103 17 76 16 -79 -8 -9 55 95
1379I5J32k16j0J60j11j08J6K7P4K9p5p2q8oL2O2J50m2l7r6N9Q9Rk9m0j0J3o2P0o5L2J7o0
$$ 95 227 11 1 161 50 -58 -42 -15 59 88 13 -59 -147 -153 -121 -59 91 49 12 -84 -25 64 73 44 4 -6 7 -55 15 -50 -18 -1 -61
1371f1n7K5m1O3P4m5n7olN2M5N5r6l9J83j01j8N8j15l9j12KQ8Q2J1q0J22r3j13J86Q9J5qn
$$ -61 -118 -93 -134 -71 3 -42 -99 -105 -108 -56 -11 44 -52 -91 92 -9 -27 31 -84 -123 -235 -233 -145 -63 -52 -132 -10 -103 -216 -30 59 74 66 61
1363F1r2N0j50q8PO2jJ16r4j34K3J02L9n8J6L3m0M6N4j79L2J11L5o9m1J4R1Lm2k0P8N5k9j7
$$ 61 -31 19 -131 -219 -212 -150 -151 -35 -129 -263 -240 -138 -99 -157 -141 -108 -148 -102 -48 -227 -195 -84 -49 -118 -159 -145 -54 -51 -93 -113 -35 20 -9 -26
1355b6m9J6k9RJ5o7J27l8m7M6PKj5M7m2rJ12k3q4j36n2J34J46j61m8O7k4O8R4j3l3m9J6R5
$$ -26 -75 -59 -88 -79 -64 -131 -4 -42 -89 -43 -36 -34 -49 -2 -44 -53 59 36 -48 -184 -236 -102 44 -117 -165 -98 -122 -54 40 27 -6 -55 -39 56
1346E6o7J3j9Q2n3j02k0M5L4K1j18M4J23P3q2r0o0P6N0j3q6R8q3O0p2l5N5o1j3p7O8N3J03
$$ 56 -11 2 -17 65 12 -90 -110 -65 -31 -10 -128 -84 39 112 30 -60 -120 -44 6 -7 -93 5 -78 -18 -90 -125 -70 -131 -144 -221 -153 -100 3
1338Ckp2k4J39l7p2L1m6P6j42P2q1j33J01L8R9j9r7L5J89l8J31p8r9l4J03j44M6P1M2N2L3
$$ 3 1 -71 -95 44 7 -65 -34 -80 -4 -146 -74 -155 -288 -187 -149 -50 -69 -166 -131 58 20 151 73 -26 -60 43 -101 -55 16 58 110 143
1330A43n4M3j4n9R4j6L1O0r8Q7j1j7l0l5n1k0kj30L2R4p0L2j07p5J26N7M0N4o2j17Q7P7q1
$$ 143 89 132 118 59 153 137 168 228 130 217 206 189 159 124 73 53 51 -79 -47 47 -23 9 -98 -173 -47 10 50 104 42 -75 12 89 8
1322HMn7l0K5r6l7J05N0M0M3N1j15L6N8j19O1J3q3J1o5J9P5l8j07j1Q5j7LJ60P3mq3m9l7l2
$$ 8 12 -45 -75 -50 -146 -183 -78 -28 12 55 106 -9 27 85 -34 27 40 -43 -32 -97 -78 -3 -41 -148 -159 -74 -91 -88 72 145 141 58 9 -28 -60
1314f0l2N6k6p3J38O5r0o5K8j9n7L8J13n3j60Q1M9J8Rm0l9k0P9O9jL8N3q9p0J84p3nj56j14
$$ -60 -92 -36 -62 -135 3 68 -22 -87 -59 -78 -135 -97 16 -37 -197 -116 -67 -49 -40 -80 -119 -139 -60 9 8 46 99 10 -60 124 51 46 -110 -224
1305b24J7K01k2m1O8q1n0P9n1p1l6J18KJ3m5o6qm5J7J39L2k3J8j17j0J15%j28N2N6q9nJ19
$$ -224 -207 -6 -28 -69 -1 -82 -132 -53 -104 -175 -211 -93 -91 -78 -123 -189 -197 -242 -225 -86 -54 -77 -59 -176 -186 -71 -71 -199 -147 -91 -180 -185 -66
1297f6Kj3lKR5j7j7Q2J1Q1Ql4j6j72R3%r8N3J4qMK5m9M8J42Q3l9j22l6P7J7J42q1%J85K44
$$ -66 -64 -77 -80 -78 17 0 -17 65 76 157 165 131 115 -57 36 36 -62 -9 5 -3 1 26 -23 25 167 250 211 89 53 130 147 289 208 208 393 637
1289F37L44K80L08K6k81k40l37k99j95j99N5J0K1n7RJ0j12J1J7J05k4J44L9K8J46K55L36O05
$$ 637 981 1261 1569 1595 1314 1074 737 438 243 44 99 109 130 73 82 92 -20 -9 8 113 89 233 272 300 446 701 1037 1642
1282A642R13Q57N67K22l34p39q48p57n62m45j19qqjk4o8j25P8L7j01Q8P2J28Q2M8L13M03Q59
$$ 1642 2555 3412 3979 4201 3867 3128 2280 1523 961 516 397 389 381 380 356 288 163 241 278 177 265 337 465 547 595 908 1311 2170
1275B170J075J229Q99L53j92q13j094j007p52n66k94l23j75o8j26RJ10J0n0l0ql0n5O3K06
$$ 2170 3245 4474 5373 5726 5534 4721 3627 2620 1868 1302 1008 685 510 442 316 325 435 445 395 365 357 327 272 335 541
1269E41K22K34N01Q58Q30P86M22q9o08p78p68n74l57k77k50j23j97j42m5J9m9m1o6q0l7m3
$$ 541 763 997 1498 2356 3186 3972 4394 4305 3697 2919 2151 1577 1220 943 693 570 373 231 186 205 156 115 49 -31 -68 -111
1262a11J54P8J16R3K65L06L70J95K44O2j35l16k89k87j02p9j25mj81q2l2l1Lp2m6m7K4m5j6
$$ -111 43 121 237 330 595 901 1271 1466 1710 1772 1637 1321 1032 745 643 564 439 435 254 172 140 109 112 40 -6 -53 -29 -74 -90
1255i0rP4n1J5M2J65R5K5ML9J36k3j87j4n5J59kr5l4j38j45K4o7Ll9pK5p7M5N8O7m2l4J10
$$ -90 -99 -25 -76 -61 -19 146 241 266 270 309 445 422 235 221 166 325 323 228 194 56 -89 -65 -132 -129 -168 -175 -150 -227 -182 -124 -57 -99 -133 -23
1247b3r3j0J0K7J08j1J64j3j58N4j14k0r3P6J30l1j57R6%n9J9Ml6RLLj58l8J18r2J37m3L4
$$ -23 -116 -126 -116 -89 19 8 172 159 1 55 -59 -79 -172 -96 34 3 -154 -58 -58 -117 -98 -94 -130 -121 -118 -115 -273 -311 -193 -285 -148 -191 -157
1239a57J11j8Q0qq7K6K4Q4j07K9J7m3r7n7N2o8N8N9K2J13r2j10J21K8O2k21M7L7M1j03j7J54
$$ -157 -46 -64 16 8 -79 -53 -29 55 -52 -23 -6 -49 -146 -203 -151 -219 -161 -102 -80 33 -59 -169 -48 -20 42 -179 -132 -95 -54 -157 -174 -20
1231b0m3lj13N9J9J00J7m9Rm8J03L6mj68q7P1K9R2j38j4R2L5J10J9Q2l4j52P4J9lQ2O7q4Q0
$$ -20 -63 -66 -179 -120 -101 -1 16 -33 -24 -72 31 67 63 -105 -192 -121 -92 0 -138 -152 -60 -25 85 104 186 152 0 74 93 90 172 239 155 235
1223B35r7jr7J4K2j9L1k0o5J2J94J48l3Jl8J26J22R8O7R7K09L93N15N83Q60Q65M65M8m06m43
$$ 235 138 137 40 54 76 57 88 68 3 15 209 357 324 325 287 413 535 633 700 797 1006 1399 1914 2497 3357 4222 4687 4735 4329 3886
1215C886o79p26n06l96j04O2J15j04q9R0R1J76K33K80L54M81M37N95R32J618K621L920N065
$$ 3886 3207 2481 1975 1579 1475 1537 1652 1548 1459 1549 1640 1816 2049 2329 2683 3164 3601 4196 5128 6746 9367 13287 18352
1210A8352N217L803J237j514m032m817m340l338k361j375p78m70k10r9r5K02K72M12P89O77
$$ 18352 23569 27372 28609 27095 23063 18246 13906 10568 8207 6832 6054 5584 5374 5275 5180 5382 5654 6066 6855 7532
1205G532R03J088J313K151L421N490Q788J2338J3733J1609N604k506r146j2805j2706r713
$$ 7532 8435 9523 10836 12987 16408 21898 30686 43024 56757 68366 73970 71464 62318 49513 36807 27094
1201B7094o637m254k520j594r58o10l72j68J2K36M56O99J047J197J537K372L847O427J0521
$$ 27094 20457 16203 13683 12089 11131 10521 10149 9981 9993 10229 10685 11384 12431 13628 15165 17537 21384 27811 38332
1196C8332J5381J8521J7030J0419k88j0625j7078j8246j5152j0605o675l980k525j474j037
$$ 38332 53713 72234 89264 99683 99395 88770 71692 53446 38294 27689 21014 17034 14509 13035 11998
1193A1998p45p26n37l25q6L33N69O89R89J468K568M289O974J0626J3415J3373R401K054o299
$$ 11998 11253 10527 9990 9665 9579 9912 10481 11170 12159 13627 16195 20484 27458 38084 51499 64872 74273 76327 70028
1188G0028j2160j4140j2494r074n808l525k395j446q43q59p39n24l71k86o7Q4K66M55N96P36
$$ 70028 57868 43728 31234 22160 16352 12827 10432 8986 8143 7284 6545 6021 5650 5364 5297 5381 5647 6102 6698 7434
1183G434J376K462L753M961N361M261J515j711m311n545n257m091k739j769j056o36n25l32
$$ 7434 8810 11272 15025 19986 25347 29608 31123 29412 25101 19556 14299 10208 7469 5700 4644 4008 3483 3151
1179C151l16l05l76j86n2o6p6Q2K34Q0J81L81N80Q01Q62O31L24j31p16q20r79p42n08m13k63
$$ 3151 2835 2530 2154 1968 1916 1850 1774 1856 2090 2170 2351 2732 3312 4113 4975 5606 5930 5799 5083 4263 3284 2542 2034 1621 1358
1173A358k46j65j90Mo4j45l0J4M3k1P7%l2Pj7N2K3q9O7j1O2o8j27J01L3j10j73P9J38j5j19
$$ 1358 1112 947 757 761 697 552 522 536 579 558 635 635 603 610 593 645 668 579 646 635 697 629 502 603 636 526 353 432 570 555 436
1165D36Nj3r4J00J08n6k4P4n5n3L6J10L2P5M2N0l6k1J4m8k1J03J21J91J39N0J48L0J61O1J1
$$ 436 441 428 334 434 542 486 462 536 481 428 464 574 606 681 723 773 737 716 730 682 661 764 885 1076 1215 1265 1413 1443 1604 1665 1676
1157A676l6J38J53J9L0J58P6k0K46K85L25L01M69N93M94M54N02M93N14L98M06M70K26L52O87
$$ 1676 1640 1778 1931 1950 1980 2138 2214 2194 2440 2725 3050 3351 3820 4413 4907 5361 5863 6356 6870 7268 7674 8144 8370 8722 9409
1151I409L03j10o4k55o17m71l87n24k56m5J95J50L57M88N65Q70R48R76J140J282J252J610
$$ 9409 9712 9602 9538 9283 8666 8195 7808 7284 7028 6983 7178 7328 7685 8173 8738 9608 10556 11532 12672 13954 15206 16816
1146A6816K369K535L040M017M986N344O777R855J1218J0774J3178J4909J2219J0909R690O885
$$ 16816 19185 21720 24760 28777 33763 39107 45884 55739 66957 77731 90909 105818 118037 128946 138636 145521
1142A45521N633P74o926j0157j1724j0935p083o321o296l418m02K960N955O165P950J1185
$$ 145521 151154 151928 145002 134845 123121 112186 105103 98782 92486 89068 88666 91626 97581 103746 111696 122881
1138A22881J2576J4659J6179J4739J7934K0983J8736J7373Q883m478r759j5091k1489k1782
$$ 122881 135457 150116 166295 181034 198968 219951 238687 256060 264943 260465 250706 235615 214126 192344
1135A92344j9887j9448j6868j4325j2623r410o273l877j18K048L430N267N746Q324J1852J2165
$$ 192344 172457 153009 136141 121816 109193 99783 93510 89633 89515 91563 94993 100260 106006 114330 126182 138347
1131A38347J1713R228N006K128k557q828j4432j7976j9058j6532j2600j0534r090p109o065
$$ 138347 150060 159288 164294 166422 163865 155037 140605 122629 103571 87039 74439 63905 54815 47706 41641
1127D1641n724m838l610k697j849j216r01m56j33O41J407J718K113K824L197L192L381K895
$$ 41641 35917 31079 27469 24772 22923 21707 20806 20350 20217 20858 22265 23983 26096 28920 32117 35309 38690 41585
1123D1585K593J845M99m03j847l350m163m508m569m373l400k471j554j155n93n39p01l12N2
$$ 41585 44178 46023 46522 46119 44272 40922 36759 32251 27682 23309 19909 17438 15884 14729 14136 13597 12896 12584 12636
1118A2636M80J072J556J592J969K280J905J503R69n75k062k748k752k347j906j903k144j961
$$ 12636 13116 14188 15744 17336 19305 21585 23490 24993 25962 25387 23325 20577 17825 15478 13572 11669 9525 7564
1114G564j366q55n83m08l19k69k25j89j29r9k9j17l9j44Q0J61J0Q4q0k66k09l47q5k41j55
$$ 7564 6198 5343 4760 4352 4033 3764 3539 3350 3221 3122 3093 2976 2937 2793 2873 3034 3044 3128 3048 2782 2573 2226 2141 1900 1745
1108A745j37o3R0n5nM7k8o7o9Ok3j40KP7J5%J7N0oJ19K44K84K92K5r3k39k67k75j74k50j69
$$ 1745 1608 1545 1635 1580 1575 1622 1594 1527 1458 1464 1441 1301 1303 1380 1395 1395 1412 1462 1456 1575 1819 2103 2395 2420 2327 2088 1821 1546 1372 1122 953
1100I53j4o5k19j00m1N6o1J22Q7j80N9K2m8p0J36Rj43k9P2J74K20K56K05L3j44k31j97j04
$$ 953 939 874 655 555 514 570 509 631 718 538 597 619 571 501 637 646 503 474 546 720 940 1196 1401 1434 1290 1059 862 758
1093G58j94j86J9j21j69J25j2P1K5K5k3m6L9O9l5r0j11m3L7m1J46J10j25o2k8j1N1N3K7JJ6
$$ 758 564 378 397 276 107 232 220 291 316 341 318 272 311 380 345 255 144 101 138 97 243 353 228 166 138 127 178 231 258 259 275
1086B75N2o7j04j14OM7J27L8j0jq3P9o8r1R1P4J5J59L6m3N1O0J49L9PL3J56K04Pp7q5j13O6
$$ 275 327 260 156 42 48 95 222 260 250 249 166 245 177 86 177 251 266 425 461 418 469 529 678 717 724 757 913 1117 1124 1047 962 849 915
1077I15j48l3k4o6kP4O0m5j10O1R8J92M8j6K9R6J58J56Q8O7lM7k73o4R1J4qj49k89m3o9j6
$$ 915 767 734 710 644 642 716 776 731 621 682 780 972 1020 1004 1033 1129 1287 1443 1531 1598 1595 1642 1369 1305 1396 1410 1402 1253 964 921 852 836
1070H36p5j9Q0m5l2Q8O8L9O7J34J4M5m8O4r6K8Q9k3j95N1r3p0r9r1%J5m1j47j22N9J40J06
$$ 836 761 742 822 777 745 833 901 940 1007 1141 1155 1200 1152 1216 1120 1148 1237 1214 1019 1070 977 907 808 717 717 732 691 544 422 481 621 727
1062G27Q3J4Q1j10J04P9JQ5N0O0O8p3J83J27J77N1j79l1mj0l9J2J3N0K3l8MR1k3K5J96J09
$$ 727 810 824 905 795 899 978 979 1064 1114 1174 1242 1169 1352 1479 1656 1707 1528 1497 1493 1483 1444 1456 1469 1519 1542 1504 1508 1599 1576 1601 1797 1906
1054A906O6K39K79R9J77R1J70L15K02J92K31J98J39K98L36K90M39Q33Q96J034Q26Q70J291
$$ 1906 1972 2211 2490 2589 2766 2857 3027 3342 3544 3736 3967 4165 4304 4602 4938 5228 5667 6500 7396 8430 9256 10126 11417
1048A1417J856K605L044L813N864R754J6930L0386M8846N4058K0195k9615m9533m1083k7144
$$ 11417 13273 15878 18922 22735 28599 38353 55283 85669 134515 188573 208768 179153 129620 88537 61393
1045F1393j6990j0155o247l928k494j892j385o42K12P63J491J946K524K895K678K518L489
$$ 61393 44403 34248 28001 24073 21579 19687 18302 17660 17872 18635 20126 22072 24596 27491 30169 32687 36176
1041C6176N339P707J0319J5258K5686M5008O9387P8164N0395j629m6090o1824n8055m8763
$$ 36176 41515 49222 59541 74799 100485 145493 214880 293044 343439 341810 295720 233896 175841 127078
1037A27078l5630k3283j4236q268m605l725m888m684l397k201j259o63l87j03J55P15J395
$$ 127078 91448 68165 53929 45661 41056 37331 32443 27759 24362 22161 20902 20239 19852 19749 19904 20619 22014
1033B2014J949K757M341P123J2285K2094L9361N9310N2845K90m8945n5772m0766k5877j6030
$$ 22014 23963 26720 31061 38184 50469 72563 111924 171234 224079 224369 175424 119652 78886 53009 36979
1029C6979r765n945l843k773k393k031j498j118p18m72o59n53m04m95l79l69n19l74j98q7
$$ 36979 27214 21269 17426 14653 12260 10229 8731 7613 6895 6423 5764 5211 4807 4312 3933 3564 3045 2671 2473 2386
1024B386k27k20l7j91j0m4n0q0j10k8M1K5m4j42m1no4n9k1p6opk6P9N7k5p9j4n4j32r3J4n5
$$ 2386 2159 1939 1902 1711 1701 1657 1607 1527 1417 1389 1430 1455 1411 1269 1228 1223 1159 1100 1079 1003 997 990 964 1043 1100 1075 996 982 928 796 703 717 662
1016F62RL6j64J7K0n5L0J66r2N4k2p5N1l4j03OL2Q4k5m3QJ4Q8j24mO2m5P2N5j4p9J2l9m8R
$$ 662 671 707 543 560 580 525 555 721 629 683 661 586 637 603 500 506 538 622 597 554 562 576 664 540 536 598 553 625 680 666 587 599 560 512 521
1008E21j70n0j7J66o0O5L5mJ94J01L1k42j10o9j04P3l8m8J73J4L3l1L4N2N1j3j93M7n9L3O7
$$ 521 351 301 284 450 390 455 490 486 680 781 812 570 460 391 287 360 322 274 447 461 494 463 497 549 600 587 394 441 382 415 482
1000D82K8Q9j1j17P4l8K34L08N86R85J238Q72P88L62l23p76q35j059r55o15m28j74j0j47J0
$$ 482 510 599 588 471 545 507 741 1049 1635 2620 3858 4730 5518 5880 5557 4781 3946 2887 1932 1317 889 715 705 558 568
994E68j06J1K0k2J2k6j4j34n1O7K0K4n6PK9r7oL6L2N0j22k4p6q6N5pRR2n9j14J01M6p9P2P6
$$ 568 462 473 493 471 483 457 443 309 258 325 345 369 313 320 349 252 246 282 314 364 242 218 142 56 111 104 113 205 146 32 133 179 100 172 248
986B48J5Q5M0N4M3O9m0o9k1L3O5J46L6n8J33J03K57J92J90m4j23j54l00j29k21j4j24j05k1
$$ 248 263 348 388 442 485 554 514 445 424 457 522 668 704 646 779 882 1139 1331 1521 1477 1354 1200 900 771 550 536 412 307 286
978B86M4o3J53l1j43PJ5NJ25K46L2RK8m5J54J79J85L32L39K07J04k97l81k89k63k33q0k5l6
$$ 286 330 267 420 389 246 253 268 273 398 644 676 685 713 668 822 1001 1186 1518 1857 2064 2168 1871 1490 1201 938 705 625 600 564
971E64J8j10j34n5l6J68K1K3j48O8l0j07p6P8J53m1OJ57N8K19K86J35P5j49j87k24j31j10
$$ 564 582 472 338 283 247 415 436 459 311 379 349 242 166 244 397 356 362 519 577 796 1082 1217 1292 1143 956 732 601 491
964D91k30prK0m0p9K0k8J6J01O0M9M2J25j81r9M8%j05j9N6MR4J14j3j2M4J7LJ33l1K3J53J07
$$ 491 261 254 245 265 225 146 166 138 154 255 315 364 406 531 350 251 299 299 194 175 231 235 329 443 430 418 462 479 482 615 584 607 760 867
956H67KK38J07J55j00R3K28J75K97L10L37L14J67M7J47k48m01k88l04j50k89j59j01j79J1
$$ 867 869 1107 1214 1369 1269 1362 1590 1765 2062 2372 2709 3023 3190 3237 3384 3136 2735 2447 2143 1993 1704 1545 1444 1265 1276
950A276Q9J81K7R0J27J04R0Q8J45J25J31K45O9N7R6K28L73J98n6K4L9K2J89K04J93K66M20
$$ 1276 1365 1546 1573 1663 1790 1894 1984 2072 2217 2342 2473 2718 2787 2844 2940 3168 3541 3739 3683 3707 3746 3768 3957 4161 4354 4620 5040
943E040L04M73M37M47N80L73L01K23K32K23K36M92O88R00J217J806J865J643J016Q39J672
$$ 5040 5344 5817 6254 6701 7281 7654 7955 8178 8410 8633 8869 9361 10049 10949 12166 13972 15837 17480 18496 19335 21007
938B1007K924M253N358O378O972P195Q031R910J4828K6069N1814J06992J79242J96256J71444
$$ 21007 23931 28184 33542 39920 46892 54087 62118 72028 86856 112925 164739 271731 450973 647229 818673
935H18673J69332R2481o7562j46015j62852j98634j86925j21333o5940l4627j8170j0756q778
$$ 818673 988005 1080486 1012924 866909 704057 505423 318498 197165 131225 96598 78428 67672 58894
931E8894p881p483p750p023n396m034l168k073j463j402j164q92q36p13n55n34m19l49l13
$$ 58894 51013 43530 35780 28757 23361 19327 16159 14086 12623 11221 10057 9165 8329 7616 7061 6527 6108 5759 5446
927E446j58j35k34r4o6J22L88L89N62Q18O88j9j048j252r87o26m68j69l4q4O8K21K99K15M35
$$ 5446 5288 5153 4919 4825 4759 4881 5269 5658 6220 7038 7726 7707 6659 5407 4420 3794 3326 3157 3123 3039 3107 3328 3627 3842 4277
921D277L66M22N33N89J104K367N589J0080J1447J0348J0520O622l286q796r589j1831j1581
$$ 4277 4643 5065 5598 6187 7291 9658 15247 25327 36774 47122 57642 64264 60978 52182 42593 30762 19181
917A9181p389l873j895j161o48k94j57j73k61l53k51j51l42m1K1m1k4Kj46j62J3j39j69j40
$$ 19181 11792 7919 6024 4863 4215 3921 3764 3591 3330 2977 2726 2575 2233 2192 2213 2172 2148 2150 2004 1842 1855 1716 1547 1407
911A407K2l0j74m4J91R9Q7R7J6r0n4j21M9p1k0K1R4J9n9J25J65J84J30q3M1J46r6p4J7r0j72
$$ 1407 1429 1399 1225 1181 1372 1471 1558 1655 1671 1581 1527 1406 1455 1384 1364 1385 1479 1498 1439 1564 1729 1913 2043 1960 2001 2147 2051 1977 1994 1904 1732
903A732jj9q7O4l4r5K6K4P1l6j28o7M8J51L8k5j7K16K5K4R6M0k3n4m0Q8q2j14K4j13j64q1
$$ 1732 1731 1712 1625 1689 1655 1560 1586 1610 1681 1645 1517 1450 1498 1649 1687 1662 1645 1861 1886 1910 2006 2046 2023 1969 1929 2017 1935 1821 1845 1732 1568 1487
895A487j86L7K5J1qj17j46K7k2q1l2J5J9K03k4K4j7J25O6N2j21J54m0o7q3N0k4m6k5p0j04
$$ 1487 1301 1338 1363 1374 1366 1249 1103 1130 1108 1027 995 1010 1029 1232 1208 1232 1215 1340 1406 1458 1337 1491 1451 1384 1301 1351 1327 1281 1256 1186 1082
888A082j32O0m3k4n9o4J45Qm4o6J12J31J13p6K36J32L1L8j28j46J02Nj12M9N1p2N1p1j0q2
$$ 1082 950 1010 967 943 884 820 965 973 929 863 975 1106 1219 1143 1379 1511 1542 1580 1452 1306 1408 1413 1301 1350 1401 1329 1380 1309 1299 1217
880A217Mj13J04R6K87M59l08l91jL9O9Pj20o8R2N7J18J79L8N6L1J34L7R5k3l2k8J35n3k4Q7
$$ 1217 1221 1108 1212 1308 1595 2054 1746 1355 1354 1393 1462 1469 1349 1281 1373 1430 1548 1727 1765 1821 1852 1986 2023 2118 2095 2063 2035 2170 2117 2093 2180
873B180J25J15N3K61L83P01J061J122Q46R13L88m39o96q77j058p24o00m44j67q3j05n7M5p2
$$ 2180 2305 2420 2473 2734 3117 3818 4879 6001 6847 7760 8148 7709 7013 6136 5078 4354 3754 3310 3143 3060 2955 2898 2943 2871
867B871j8q1j46k02Q1l8p9m2K8N8J54M7m6k3P5R6K9O7K01M2J36K34K31K01L52P8K32L65L94
$$ 2871 2853 2772 2626 2424 2505 2467 2388 2346 2374 2432 2586 2633 2587 2564 2639 2735 2764 2831 3032 3074 3210 3444 3675 3876 4228 4306 4538 4903 5297
860E297P13J010K113K854L806N176L829J056L60l81j312M35k83k948k608k523l102k189j175
$$ 5297 6010 7020 9133 11987 15793 20969 24798 25854 26214 25833 24521 24956 24673 21725 19117 16594 13492 11303 10128
855A0128o43j38K63N06N81O53P80Q67R85J365K196L436N392O878R761J4787J7294J7799J1718
$$ 10128 9485 9347 9610 10116 10697 11350 12130 12997 13982 15347 17543 20979 26371 33249 43010 57797 75091 92890 104608
851A04608J261K641J665m588M37k031j1215r831j0111j0580p179l681j729o36k28M46O98J045
$$ 104608 105869 108510 110175 105587 106024 103993 92778 82947 72836 62256 55077 51396 49667 49031 48803 49249 49947 50992
846E0992J261J643K053L463N525R666J4911J7824K2120L2775L1029K3398J3459Q86O075M276
$$ 50992 52253 53896 55949 59412 64937 74603 89514 107338 129458 162233 193262 216660 230119 231005 237080 241356
842B41356r340q542j2035k2408k3035k2411j9817j4011r540o903m991l890k833j808q45L51
$$ 241356 232016 223474 211439 189031 165996 143585 123768 109757 100217 93314 88323 84433 81600 79792 78947 79298
838G9298J830L498N682R034J4366J9683K0734K3447K8440J8058P843J683o098n000q241j8155
$$ 79298 81128 84626 90308 99342 113708 133391 154125 177572 206012 224070 231913 233596 227498 222498 214257 196102
834A96102j8664j7478k1605k2084j8764j4476j0643p656n700m259l361k266j330n25L95J424
$$ 196102 177438 159960 138355 116271 97507 83031 72388 64732 59032 54773 51412 49146 47816 47291 47686 49110
830D9110K583M146N800P629Q270O944O833O071J343j327l325n878n649o252q828r051q158
$$ 49110 51693 55839 61639 69268 77538 84482 91315 97386 98729 97402 94077 88199 82550 76298 67470 58419 50261
826E0261q334p683n591m003l051k354j793j465j216j040q17k51O6K76Q20J066J155J025J194
$$ 50261 41927 34244 28653 24650 21599 19245 17452 15987 14771 13731 12914 12663 12729 13005 13825 14891 16046 17071 18265
822A8265J021L28k27q14j075j085j078j347j227j325j485j217j059p27o17m60l32k60l46k68
$$ 18265 19286 19614 19387 18573 17498 16413 15335 13988 12761 11436 9951 8734 7675 6948 6331 5871 5539 5279 4933 4665
817D665j55p6q4q1m8OJ28J66l3K6j07j07K50m9k21l11r2j65q0o3k09k44j99m1l1k0p5j08%
$$ 4665 4510 4434 4350 4269 4221 4227 4355 4521 4488 4514 4407 4300 4550 4501 4280 3969 3877 3712 3632 3569 3360 3116 2917 2876 2845 2825 2750 2642 2642
810B642j75m0J24%J56M84N19N69N72J48j81n80o16m43j47l18l68j96Jm6O2q5k22j0r4j77j13
$$ 2642 2467 2427 2551 2551 2707 3191 3710 4279 4851 4999 4818 4238 3622 3179 3032 2714 2346 2150 2151 2105 2167 2082 1860 1850 1756 1579 1466
803A466L4j17K2Q8k6p2P6p9J37J1j30L6R8L9j52l1O1n4K4J8M0j04j38O5j18j46k3l7m0j06
$$ 1466 1500 1383 1405 1493 1467 1395 1471 1392 1529 1540 1410 1446 1544 1583 1431 1400 1461 1407 1431 1449 1489 1385 1247 1312 1194 1048 1025 988 948 842
796H42K7QJ28N1Q5j3J07qo5p7k0M3p7m2Q6J2Q3lK4Lr3j89K6J17Ll6j04M0n6%P1L2J69K10J48
$$ 842 869 877 1005 1056 1141 1128 1235 1227 1162 1085 1065 1108 1031 989 1075 1087 1170 1167 1191 1194 1101 912 938 1055 1058 1022 918 958 902 902 973 1005 1174 1384 1532
787A532N0j11k40JlO3p7ln7k2k5L9kn2o8O0nJ71Q4j25k01O5M9J1k6O1J63J72J95J65Q6J63
$$ 1532 1582 1471 1231 1232 1229 1292 1215 1212 1155 1133 1108 1147 1145 1093 1025 1085 1080 1251 1335 1210 1009 1074 1123 1134 1108 1169 1332 1504 1699 1864 1950 2113
779B113j21L2K8j24j49L4j15j37j62m2o3K7p0o5P4Qpj53J00L0j04K6Q8P6pJ15K10K12J56P7
$$ 2113 1992 2024 2052 1928 1779 1813 1698 1561 1399 1357 1294 1321 1251 1186 1260 1268 1261 1108 1208 1238 1134 1160 1248 1324 1317 1432 1642 1854 2010 2087
772B087o4K6k18j28p5j52r1O2j86l1l9o7p1Pk05m3k6p7K3P9N8k6N8j1NJ89Q9J65K13M1j11
$$ 2087 2023 2049 1831 1703 1628 1476 1385 1447 1261 1230 1191 1124 1053 1060 855 812 786 709 732 811 869 843 901 890 895 1084 1173 1338 1551 1592 1481
764A481lQl5P0M1L5j18k7j59j13Km4j80j57n6j48O4O5j5P7L9p1j2N1P3P0rL6L3PJ10Q3N2Q8
$$ 1481 1478 1486 1451 1521 1562 1597 1479 1452 1293 1180 1182 1138 958 801 745 597 661 726 711 788 827 756 744 795 868 938 929 965 998 1005 1115 1198 1250 1338
756A338K43M7P1j38j91r9l8q5m4Q9p4j01Po2q5J14n9l3M2R8k0o2Q3J37N6J09J33N3L01J41
$$ 1338 1581 1628 1699 1561 1370 1271 1233 1148 1104 1193 1119 1018 1025 963 878 992 933 900 942 1040 1020 958 1041 1178 1234 1343 1476 1529 1830 1971
749A971o6j24j16j41K2r1j70J5Om9qPK21J78Mm1m3jL6l3N8R0K7r1q4J60l8j1J23K7R7P1J14
$$ 1971 1905 1781 1665 1524 1546 1455 1285 1300 1306 1257 1249 1256 1477 1655 1659 1618 1575 1574 1610 1577 1635 1725 1752 1661 1577 1737 1699 1688 1811 1838 1935 2006 2120
741B120K3p9Jm1J71J73l9J87J58K29K91J82K99M75O70P03Q16R31J135J379K260L538N116N843
$$ 2120 2143 2064 2065 2024 2195 2368 2329 2516 2674 2903 3194 3376 3675 4150 4820 5523 6339 7270 8405 9784 12044 15582 20698 26541
735B6541M759J552j647l488l422k877k362j881j336j151q26o52q3N3N23P86J110J551K140
$$ 26541 31300 32852 31205 27717 24295 21418 19056 17175 15839 14688 13862 13210 13127 13180 13703 14489 15599 17150 19290
730A9290K636L260L718M108M351N138O114P002P737Q453Q705P410L745j153n268p187p002
$$ 19290 21926 25186 28904 33012 37363 42501 48615 55617 63354 71807 80512 87922 91667 90514 85246 78059 71057
726G1057o258n771n192m752l769l457k809k308j487o76J14R96J864K860M051M697N399O238
$$ 71057 64799 59028 53836 49084 45315 41858 39049 36741 35254 34578 34692 35688 37552 40412 44463 49160 54559 60797
722F0797P657R668J1579J2538J2523J1492Q749L705k070q310j2519j3374j1397q942p630p032
$$ 60797 68454 78122 89701 102239 114762 126254 135003 138708 136638 128328 115809 102435 91038 82096 74466 67434
718F7434o350n509m479m285m009l723l020k212r71L02J358J840K074L000M544O265Q235J0063
$$ 67434 61084 55575 51096 46811 42802 39079 36059 33847 32876 33178 34536 36376 38450 41450 45994 52259 60494 70557
713G0557J1285J0571P699M796K675q78p248j3290j4502j2057r081o845n391m267l478l557
$$ 70557 81842 92413 100112 104908 107583 106705 99457 86167 71665 59608 50527 43682 38291 34024 30546 26989
709B6989l445k988k576k250j808j331q73n63p1J51M09Q14J335J859K785M203N960P368P241
$$ 26989 23544 20556 17980 15730 13922 12591 11718 11155 11084 11235 11644 12458 13793 15652 18437 22640 28600 35968 43209
705D3209L048l674q359q672o789m554l046j972j256j004q60p07n63o00n38l71j99p4p5j71
$$ 43209 46257 42583 34224 25552 18763 14209 11163 9191 7935 6931 6071 5364 4801 4201 3663 3292 3093 3019 2944 2773
700B773k17j28j07M5J4j03o0j09j73r0J30J34n1r0j38kj2rj29j4l8r6j04l7n4l0J51J45mJ3
$$ 2773 2556 2428 2321 2366 2380 2277 2217 2108 1935 1845 1975 2109 2058 1968 1830 1828 1816 1807 1678 1664 1626 1530 1426 1389 1335 1305 1456 1601 1597 1610
693A610kJ29l3n0l1j65k07j00mN2m6r9j64r8M4O7L9q8N2mo2m2R0l3q1J07Q7n2j9o9K59L5K8
$$ 1610 1608 1737 1704 1654 1623 1458 1251 1151 1147 1199 1153 1054 890 792 836 903 942 854 906 902 840 798 888 855 774 881 968 916 897 828 1087 1122 1150
684A150j42j39j57KoR8m8M9k33M3o1j07q9k8N0l4J04M9p7M6mMj50JLJ65P3J00j01p5J2o2R8
$$ 1150 1008 869 712 714 708 806 758 807 574 617 556 449 360 332 382 348 452 501 424 470 466 470 320 321 324 489 562 662 561 486 498 436 534
676E34J26nRm8o5O3K7p1J30P7pK0K32m1N8j2J06j68O4L8J06O0J93j45J02M3J6Jj24p3m2O0
$$ 534 660 655 664 616 551 614 641 570 700 777 770 790 1022 981 1039 1027 1133 965 1029 1067 1173 1233 1426 1281 1383 1426 1442 1443 1319 1246 1204 1264
669A264J59N9J11J2R1R4N2J38K54J2M5m7J06n9J14L0N8r7P5M0L4RQ7j88j9P1K0l6L1K03K30
$$ 1264 1423 1482 1593 1605 1696 1790 1842 1980 2234 2246 2291 2244 2350 2291 2405 2435 2493 2396 2471 2511 2545 2554 2641 2453 2434 2505 2525 2489 2520 2723 2953
661B953o1K1K06K10J72l9pQ9l8R0P7J65n5N8L3Qk07j29M3J4K1L14K3k6j43j03m5J4j21kn0
$$ 2953 2892 2913 3119 3329 3501 3462 3455 3544 3506 3596 3673 3838 3783 3841 3874 3882 3675 3546 3589 3603 3624 3938 3961 3935 3792 3689 3644 3658 3537 3535 3485
653C485m3n0O8j3J13%J45P7r4JP4j32J7Pl7r4J9oO3j90J1o0j35j83J9Qo9n3J14r2N5O7K9o0
$$ 3485 3442 3392 3460 3447 3560 3560 3705 3782 3688 3689 3763 3631 3648 3655 3618 3524 3543 3537 3600 3410 3421 3361 3226 3043 3062 3070 3001 2948 3062 2970 3025 3092 3121 3061
645C061J02k7Q0R0O2mN0M6K7l5Q7J17K89N1J09J3P5q8Q9jP0J61J29j48M5M1K24J32J68R9K95
$$ 3061 3163 3136 3216 3306 3368 3364 3414 3460 3487 3452 3539 3656 3945 3996 4105 4118 4193 4105 4194 4193 4263 4424 4553 4405 4450 4491 4715 4847 5015 5114 5409
638E409J59K32J09L50J01M73L57P94M37N62M89J039Q28J059J180J560J477K297K463L476M129
$$ 5409 5568 5800 5909 6259 6360 6833 7190 7984 8421 8983 9472 10511 11339 12398 13578 15138 16615 18912 21375 24851 28980
632B8980N769P397J0885J5394K4617L9941P2224J27474J78679Q0117j10782j56186j13144
$$ 28980 34749 42146 53031 68425 93042 132983 205207 332681 511360 591477 480695 324509 211365
629B11365p1802m4836k6888j7252j1048p699n274m186l110k647j978j627j134j196o22o81
$$ 211365 139563 94727 67839 50587 39539 31840 26566 22380 19270 16623 14645 13018 11884 10688 10066 9385
625I385o12p91n89m04m3m80k99o04k41j44j01o8kk50j03j09J08k46j87j40p7j51j0j30pk24
$$ 9385 8773 7982 7393 6989 6946 6466 6167 5563 5322 5178 5077 5009 5007 4757 4654 4545 4653 4407 4220 4080 4003 3852 3842 3712 3705 3481
619C481M4j25M7m6%P3J25o3M0K5rj38l1k06P4K1j3q1Q6n1K2l0j39j24Qj33J76JJj27Rr0J7
$$ 3481 3525 3400 3447 3401 3401 3474 3599 3536 3576 3601 3592 3454 3423 3217 3291 3312 3299 3218 3304 3253 3275 3245 3106 2982 2990 2857 3033 3034 3035 2908 2917 2827 2844
611B844O0J4J37J78o6M1j5O1k2o5k33k17o0J18p5J6L6J78L0j10j8l1q3J85K2R3J03R7J37K7
$$ 2844 2904 2918 3055 3233 3167 3208 3193 3254 3232 3167 2934 2717 2657 2775 2700 2716 2752 2930 2960 2850 2832 2801 2718 2903 2925 3018 3121 3218 3355 3382
604C382j34J05J59K22L2J79J95J90J98K72K71L07K25L03L00L78O07Q06Q67J048Q80Q20P14
$$ 3382 3248 3353 3512 3734 3766 3945 4140 4330 4528 4800 5071 5378 5603 5906 6206 6584 7191 7997 8864 9912 10792 11612 12326
598A2326M35L23K64L27P44R96J041Q82O65K92J62N7K27M71Q46J121J463J523J476J250J326
$$ 12326 12761 13084 13348 13675 14419 15415 16456 17338 18003 18295 18457 18514 18741 19212 20058 21179 22642 24165 25641 26891 28217
593B8217J521J574J898K185K098K332K374K301K224J767J226J008L97k8m23k16M35P27N77
$$ 28217 29738 31312 33210 35395 37493 39825 42199 44500 46724 48491 49717 50725 51122 51094 50671 50455 50890 51617 52194
588E2194L74K31j38k05k50m8J08N13P05J009J633K451L447M255M310M277L776K926J719J61
$$ 52194 52568 52799 52661 52456 52206 52158 52266 52779 53484 54493 56126 58577 62024 66279 70589 74866 78642 81568 83287 83448
583H3448j229j495j132q23o48n70m42l7M25Q45O82M09J54om11o52r44j051r59p92m93j39K29
$$ 83448 82219 80724 79592 78769 78121 77551 77109 77072 77497 78342 79024 79433 79587 79581 79170 78518 77574 76523 75564 74772 74279 74140 74369
578G4369P63P84Q66J157J977K468K530K065J354N22R1k97n25j066j305j459j704r42L40R52
$$ 74369 75132 75916 76782 77939 79916 82384 84914 86979 88333 88855 88946 88649 88124 87058 85753 84294 82590 81648 81988 82940
573H2940R38J01l51o93n51n45p3Q80K166L050M012M291M365L843L426K868K675J415Qj749
$$ 82940 83878 83979 83628 82935 82384 81839 81766 82646 84812 87862 91874 96165 100530 104373 107799 110667 113342 114757 114765 113016
568A13016l374m199l789k974j580o31P63J715K743L522M760N393N603M995N081N212M880L833
$$ 113016 109642 105443 101654 98680 97100 96469 97232 98947 101690 105212 109972 115365 120968 125963 131044 136256 141136 144969
563A44969L419L408M382N443O247O690O672M731K345M11m49j226j022j77J91r00j207o78J219
$$ 144969 148388 151796 156178 161621 167868 174558 181230 185961 188306 188717 188268 187042 186020 185843 186034 185134 183927 183249 184468
559A84468L598O021P443Q493R660R554O476L185J849K340L201M588N063O592R458J3356J4915
$$ 184468 188066 194087 201530 210023 219683 229237 235713 238898 240747 243087 246288 250876 255939 262531 271989 285345 300260
555C00260J3226J0430Q828O772M410J013j798l696l982m945o898r240r041o302j628J978J777
$$ 300260 313486 323916 332744 339516 343926 344939 343141 339445 335463 330518 323620 314380 305339 299037 297409 299387 301164
550C01164l482j0063j5776j8498j8368j5815j3966j2083r322n570o212j1003j4716j3545j0283
$$ 301164 297682 287619 271843 253345 234977 219162 205196 193113 183791 178221 172009 161006 146290 132745 122462
547A22462o718n189l914l313l607m470l742l196j937j200n19K26R34M04j026k024j240j81
$$ 122462 115744 110555 106641 103328 99721 95251 91509 88313 86376 85176 84657 84883 85817 86221 85195 83171 81931 81750
542H1750J280J143J399J301J855K106L186L245J821P31J158R21M19M40J255J529Q24k175l599
$$ 81750 83030 84173 85572 86873 88728 90834 94020 97265 99086 99817 100975 101896 102315 102755 104010 105539 106363 104188 100589
538A00589k306j381n58R66J226N00n12N81K787M927N860N940N592O361Q374J0980Q826L032
$$ 100589 98283 96902 96344 97310 98536 99036 98524 99105 101892 106819 112679 118619 124211 130572 138946 149926 158752 161784
533A61784K631O898J1053J1839R785O231K329j033o862j3448j6410j2980p910o567m830m43
$$ 161784 164415 171313 182366 194205 203990 210221 212550 211517 204655 191207 174797 161817 153907 147340 142510 142067
529A42067L057L861L310M847M087J202K114Q065J1587P304L799N55j227K014M652P286O368
$$ 142067 145124 148985 152295 157142 161229 162431 164545 172610 184197 191501 195300 195855 194628 196642 201294 208580 214948
525B14948M459O408P681M745k075p347r071r116o687j320N904J0455J3927J7448J6674J7700
$$ 214948 219407 225815 233496 238241 236166 228819 219748 210632 203945 202625 208529 218984 232911 250359 267033 284733
521B84733K3846K2628J5257R396M047P411J7248K2044J4151M309M893Q344N267Q264K1622
$$ 284733 308579 331207 346464 355860 359907 367318 384566 406610 420761 425070 429963 438307 443574 451838 473460
518D73460L3523L2426K7458J5310q417k4324k9144k6699j7704k7239m4879m4469k3676j3802
$$ 473460 506983 539409 566867 582177 573760 549436 520292 493593 475889 448650 403771 359302 335626 321824
514C21824k1928l1958l3318l1099k5469j8955j2501r591q509p973m185q78k349n365j883K505
$$ 321824 299896 267938 234620 203521 178052 159097 146596 137005 128496 120523 116338 115460 113111 107746 105863 108368
510A08368R649K8670M6635r604m7493k7713j3032q914o845n212o069l985j891k464m588n633
$$ 108368 118017 146687 193322 183718 136225 108512 95480 86566 79721 74509 68440 64455 62564 60100 55512 49879
506D9879m998m206j485Q76K716J583L47j519j092j781m13J535Q677K3887M9052P603m3441
$$ 49879 44881 40675 39190 40066 42782 44365 44712 43193 42101 40320 39907 41442 50119 74006 123058 130661 87220
502H7220l2420j7526r006n275k350j570n69k81p17p89p23q54p57j19N83J674L90q56j251l61
$$ 87220 54800 37274 28268 22993 20643 19073 18504 18223 17506 16717 15994 15140 14383 14264 14847 16521 16911 16055 14804 14443
497A4443j45j48n83Rj63L79K16N45k8Q23L85O86L73R35P95J693O56R66O32K323J877L220L195
$$ 14443 14298 14150 13567 13576 13413 13792 14008 14553 14525 15348 15733 16419 16792 17727 18522 20215 20871 21837 22469 24792 26669 29889 33084
492C3084N818M954N878O315J0295J1326J4640J3160J7805K6076N0594R0479J87388L81722
$$ 33084 38902 43856 49734 56049 66344 77670 92310 105470 123275 149351 199945 290424 477812 859534
488H59534N81757K18011l92626m73073l02984j73886j02682n6375l0792j2977p625j0195j1459
$$ 859534 1441291 1659302 1266676 793603 490619 316733 214051 157676 126884 113907 106282 96087 84628
485H4628q933o401k805P02L881O679R109J2246J1851J3746K1012M1057P2716J47010L00408
$$ 84628 75695 69294 66489 67191 71072 77751 86860 99106 110957 124703 145715 186772 259488 406498 706906
482G06906N40331L91176k48922m96589l50690k02674j18984o7271l6655j6983q642j1040j4123
$$ 706906 1247237 1638413 1389491 892902 542212 339538 220554 153283 116628 99645 91003 79963 65840
478F5840j2172j0676p657n837l660k911j946j466q69j875j671j158l33p22p88j009n39n21
$$ 65840 53668 42992 35335 29498 25838 22927 20981 19515 18646 16771 15100 13942 13609 12887 12099 11090 10551 10030
474A0030k63n55k91m12k90m24Pk15Q7K77N28J42n02r80n04l19k16k43k08j37K32N6J42N8n6
$$ 10030 9767 9212 8921 8509 8219 7795 7802 7587 7674 7951 8479 8621 8119 7139 6635 6316 6100 5857 5649 5512 5744 5800 5942 6000 5944
468E944j72q6k07k31j43q0L9p9r5Rj17j08l1J11M75R93J415M72r34j268p62m44n9L1K30q4
$$ 5944 5772 5686 5479 5248 5105 5025 5064 4985 4890 4899 4782 4674 4643 4754 5229 6222 7637 8109 7175 5907 5145 4701 4642 4673 4903 4819
461D819J86nj04j64j11k08l17k05l8M8L5r6J12o7q4j73L5p5J15K48O31M67L0n28m55m79q8
$$ 4819 5005 5000 4896 4732 4621 4413 4096 3891 3853 3901 3936 3840 3952 3885 3801 3628 3663 3588 3703 3951 4582 5049 5079 4551 4096 3617 3529
455C529k66L6nJ31j25lj7l1j02M1j10J04m4M7j38J60mm7p9J39r6j11j14J42o9r6j67J16j17
$$ 3529 3263 3299 3294 3425 3300 3297 3280 3249 3147 3188 3078 3182 3138 3185 3047 3207 3203 3156 3077 3216 3120 3009 2895 3037 2968 2872 2705 2821 2704
448B704r8k9J43o4Q2n0K21J62J4l59j39j80Q2j54J40nJ11J24J39J16M62M26K49l74l05m12
$$ 2704 2606 2577 2720 2656 2738 2688 2909 3071 3085 2726 2587 2407 2489 2335 2475 2470 2581 2705 2844 2960 3422 3848 4097 3723 3418 3006
441C006r0j18o8l04J21N1J20j27O9L9J72k02L5j62J10K09N5j68K9j00R8K90L44K56Q79R28
$$ 3006 2916 2798 2730 2426 2547 2598 2718 2591 2660 2699 2871 2669 2704 2542 2652 2861 2916 2748 2777 2677 2775 3065 3409 3665 4544 5472
435E472M24q17p09n84k28r8j48j09K73K76K71p0k8k74lk74J28J59K70O0J6j59o8r9R8K4J59
$$ 5472 5896 5079 4370 3786 3558 3460 3312 3203 3476 3752 4023 3953 3925 3651 3648 3374 3502 3661 3931 3991 4007 3848 3780 3681 3779 3803 3962
428C962K28M82L92K54l92o1q3L20M83J125J804Q27q74p43R0J182J479L97j579j870j485o32
$$ 3962 4190 4672 5064 5318 4926 4865 4782 5102 5585 6710 8514 9341 8467 7724 7814 8996 10475 10872 9293 7423 5938 5306
423E306n77l26l51j69n9O5L8L5o9L4p5p3p4Q0J70L65K13L55L65M77P20J608J883Q57j282j760
$$ 5306 4729 4403 4052 3883 3824 3889 3927 3962 3893 3927 3852 3779 3705 3785 3955 4320 4533 4888 5253 5730 6450 8058 9941 10798 9516 7756
417G756j510q03k81N4k0j32k97l2J53K22J62LJ51K21K88M13K96N55N45J006J331J550J238
$$ 7756 6246 5443 5162 5216 5196 5064 4767 4735 4888 5110 5272 5275 5426 5647 5935 6348 6644 7199 7744 8750 10081 11631 12869
411A2869J524J971K573M034P461J3377L0709P8505J32514O8799p5898j13627p0897l7240k0253
$$ 12869 14393 16364 18937 22971 30432 43809 74518 153023 285537 354336 278438 164811 93914 56674 36421
407C6421j0425m951k202j288j046r58r77q95k18R08J258P33J217K526L054J866K459L164M658
$$ 36421 25996 21045 18843 17555 16509 15551 14574 13679 13461 14369 15627 16360 17577 20103 23157 25023 27482 30646 35304
403C5304Q111J4519K8223O8372J82086K78137P3289k01393k07437j18115o4709l6395j8149
$$ 35304 43415 57934 86157 154529 336615 614752 688041 486648 279211 161096 96387 59992 41843
400D1843r257m478k744j796k466k604k444n89O37L58j388j32J049J450M96N97J084K524M398
$$ 41843 32586 28108 25364 23568 21102 18498 16054 15465 16102 16460 15072 14940 15989 17439 17935 18532 19616 22140 26538
395B6538Q353J7030M2785J00175J24969O621j08068r6035n2109k7255j4924p441l678k063
$$ 26538 34891 51921 94706 194881 319850 326471 218403 122368 70259 43004 28080 20639 16961 14898
392A4898j125j119j313j531r84p5K36o87j091m98N4J33j64l81k44K6J44m3l0r1N1J72P42J064
$$ 14898 13773 12654 11341 9810 8826 8751 8987 8300 7209 6711 6765 6898 6734 6353 6109 6135 6279 6236 6206 6115 6166 6338 7080 8144
386H144J361N22J49j88k57n41k39RK02O8L63M09N07L5j8n3L58L29K41j22j8L91Q39M73L65
$$ 8144 9505 10027 10176 9988 9731 9190 8951 8960 9162 9230 9593 10002 10509 10544 10526 10473 10831 11160 11401 11279 11261 11652 12491 12964 13329
380A3329L03P28J004R16P3j48J28M87N72P59J048J604J939K483J847J994K171K295J738K683
$$ 13329 13632 14360 15364 16280 16353 16205 16333 16820 17392 18151 19199 20803 22742 25225 27072 29066 31237 33532 35270 37953
375C7953M635Q458J2147J3162Q418M001L366O070Q045R633J4951L0405N9614Q9371P8837J7590
$$ 37953 42588 51046 63193 76355 84773 88774 92140 98210 106255 115888 130839 161244 220858 310229 389066 406656
371D06656l8341m8272l6169k1527j3926r877o666m892n397m533m704m508k760N434J8692L6488
$$ 406656 368315 320043 283874 262347 248421 238544 231878 226986 221589 217056 212352 207844 205084 210518 229210 265698
367B65698K9901q256k4242j2416k89J9615M1915Q5477J65769L38119L25500j13360l24132
$$ 265698 295599 287343 263101 250685 250396 270011 311926 397403 563172 901291 1226791 1113431 789299
364G89299k36820j47548r7685o8194m3364k6924j3529n712o142r021q179m965j267K293O365
$$ 789299 552479 404931 307246 239052 195688 168764 155235 149523 143381 134360 126181 121216 119949 122242 128607
360A28607Q080P714M017j157l91P727K0593L4365M6538O9777Q9210M5451l8616q8831r3093
$$ 128607 136687 144401 148418 147261 146870 154597 175190 209555 256093 325870 415080 460531 421915 333084 239991
356B39991p2006m6889k9525k0263j3186q638m776k331j595l014l152k858l118l803k961k477
$$ 239991 167985 121096 91571 71308 58122 49484 44708 42377 40782 37768 34616 31758 28640 24837 21876 19399
352A9399j740j635p56m64J1R1n48j681j274j100o88p96n32n86k38l93j2l51m5k06jj25Q3K72
$$ 19399 17659 16024 15268 14804 14815 14906 14358 12677 11403 10303 9615 8819 8287 7701 7463 7070 7058 6707 6662 6456 6455 6330 6413 6685
347F685L33O7N4l02P8K16M62J78L8j002j227r67l28l95q8k24O3k38L1K7n2k49J40m3m3k54
$$ 6685 7018 7085 7139 6837 6915 7131 7593 7771 7809 6807 5580 4613 4285 3890 3802 3578 3641 3403 3434 3461 3409 3160 3300 3257 3214 2960
340B960m7j8J37q9R6j03K13J22M60Q22J557K0j215j388n81m46j58k41n4m7J47j23L0j33J47
$$ 2960 2913 2895 3032 2943 3039 2936 3149 3271 3731 4553 6110 6130 4915 3527 2946 2500 2342 2101 2047 2000 2147 2024 2054 1921 2068
334B068j63M6j67J30j55J85j80K7l6L4l8L7p6J26J01O58N57%p77m67l64N2j11Q3j52R8p0M
$$ 2068 1905 1951 1784 1914 1759 1944 1764 1791 1755 1789 1751 1788 1712 1838 1939 2597 3154 3154 2377 1910 1546 1598 1487 1570 1418 1516 1446 1450
327A450j34m4q6J86j77J09m2N4m2J67j16Mk13L8k08J28O5N1m4Q8poKJ11j8J05m1rj71j2LL
$$ 1450 1316 1272 1186 1372 1195 1304 1262 1316 1274 1441 1325 1329 1116 1154 946 1074 1139 1190 1146 1234 1227 1221 1223 1334 1316 1421 1380 1371 1200 1188 1191 1194
319A194j69J02N4L5r4J21j71j07j4J13nQ4r3P9l2M3J3J41M0j6p5J08m7P2r9p9j88M2Q2J2j44
$$ 1194 1025 1127 1181 1216 1122 1243 1072 965 951 1064 1059 1143 1050 1129 1097 1140 1153 1294 1334 1318 1243 1351 1304 1376 1277 1198 1010 1052 1134 1146 1002
312A002L6j8J08J7J54O5q4rJ24J8J82R8M69O85N91J39k21k22j61k37k67k77j48j23Nj62J5
$$ 1002 1038 1020 1128 1145 1299 1364 1280 1271 1395 1413 1595 1693 2162 2847 3438 3577 3356 3134 2973 2736 2469 2192 2044 1921 1926 1764 1779
305A779O7l9o3K50M9K21J00o1j01J2R4K04K98P99J509K430N82j781j853j102q06l87l25k44
$$ 1779 1846 1807 1744 1994 2043 2264 2364 2303 2202 2214 2308 2512 2810 3609 5118 7548 8130 6349 4496 3394 2588 2201 1876 1632
299A632n2j11j2j86j26k5J36N8k2LJ33pk0R6Q4n3N1J95M38O41P98J54p30p32n07n80k10k2
$$ 1632 1580 1469 1457 1271 1145 1120 1256 1314 1292 1295 1428 1421 1401 1497 1581 1528 1579 1774 2212 2853 3651 3805 3075 2343 1836 1256 1046 1024
292A024j72j00J02N6J3j10L7j26op5P3Rm8p6J05j10m4P9J3q5m4NL1J0q8n3J02N9J47p7kj20
$$ 1024 852 752 854 910 923 813 850 724 718 643 716 725 677 601 706 596 552 631 644 559 515 520 551 561 473 420 522 581 728 651 649 529
285E29qj7P6k2O4O5L4p2K0j23m3J01P2j24K9j01O0j00O0JL3qP6o1J08r3l5k9M7k7j8m0L6j10
$$ 529 521 504 580 558 622 687 721 649 669 546 503 604 676 552 581 480 540 440 500 501 534 526 602 541 649 556 521 492 539 512 494 454 490 380
276C80N0JL9%K9q3J58j1j59j07J85Mn7K5K34j36l3MJ8j53K1K4J24p0Nl1Q3M1O3r1L8o0l0R0
$$ 380 430 431 470 470 499 416 574 563 404 297 482 486 429 454 688 552 519 523 541 388 409 433 557 487 492 461 544 585 648 557 595 535 505 595
268E95l2n9O8o7l4r5m3L2J56j49M5m9L7M5J05n1J01q2m4r2J09j24K33j21p6k0N6j11l1J79
$$ 595 563 504 572 505 471 376 333 365 521 372 417 368 405 450 555 504 605 523 479 387 496 372 605 484 408 388 444 333 302 481
261D81J14Ppj46r7R2K6J0p7O7J14m1J02q7L7l5k2K7Jp5N6J0J01j7j68J3j20O2J02j93O1J20
$$ 481 595 602 595 449 352 444 470 480 403 470 584 543 645 558 595 560 538 565 566 491 547 557 658 641 473 486 366 428 530 337 398 518
253E18K1p6j1qJ74r4Q1j28r2J39Pn5l9L7R4k5o3q5K6PL1Kq5k7N6q7Q7M5n9M1N9j17K2R8Q7
$$ 518 539 463 452 444 618 524 605 477 385 524 531 476 437 474 568 543 480 395 421 428 459 461 376 349 405 318 405 450 391 432 491 374 396 494 581
244E81j25n6M0j43k6M0M1N7j3n4P8m6q9J70o9K1q9L5J02q7Rn4N8Q1qK4j05j55l5N4j5j7Q5
$$ 581 456 400 440 297 271 311 352 409 396 342 420 374 285 455 386 407 318 353 455 368 377 323 381 462 454 478 373 218 183 237 222 205 290
236B90J34J4k1l1L7p7l0J3N9l5K5L0p9M1l0J4qJ05j49L5k7j8L5L3j5J4jM0n8KK9m2n1K5J05
$$ 290 424 438 417 386 423 346 316 329 388 353 378 408 329 370 340 354 346 451 302 337 310 292 327 360 345 359 358 398 340 342 371 329 278 303 408
228D08k0l7J23qr4O5M5k3mj05j2k1L9oQ2l9nk7N2Ll2l3N8OR3o7j39q7J16L8n3l1J13L0Rl2
$$ 408 388 351 474 466 372 437 482 459 455 350 338 317 356 350 432 393 388 361 413 416 384 351 409 415 508 441 302 215 331 369 316 285 398 428 437 405
219D05Mp4o0p1J50K7J28m7O7j01o2j6P8J6n9r1J0J9K5ro0j00J75n9M6lO2j5on6l9K9lk8j0
$$ 405 409 335 275 204 354 381 509 462 529 428 366 350 428 444 385 294 304 323 348 339 279 179 354 295 341 338 400 385 379 323 284 313 310 282 272
210B72p3O5J26N1k7J9j32J31l5J54J0m8j12l6q3N4kO1j50Q3R0P1l4J13j37j17p9O5M4jm8j1
$$ 272 199 264 390 441 414 433 301 432 397 551 561 513 401 365 282 336 334 395 245 328 418 489 455 568 431 314 235 300 344 343 295 284
203B84m2J29J22j01r8N6L4M4j02j5N9N1M1o4j4N8l6j21j36L8j1K5Q5j8j20O7M0J44o1p9M1
$$ 284 242 371 493 392 294 350 384 428 326 311 370 421 462 398 384 442 406 285 149 187 176 201 286 268 148 215 255 399 338 259 300
195C00l9o0O1l9L1l3N1j06Q0J79M8n8m2o3j8J2M3n1J9J39o0j63O3K9l8N1K1P9J6m0K4Pj17
$$ 300 261 201 262 223 254 221 272 166 246 425 473 415 373 310 292 304 347 296 315 454 394 231 294 323 285 336 357 436 452 412 436 443 326
187C26L5j4j18J06q8RK4j02%J26J94n1m5k1J7l9j76K6m9J25RM6j07N3J0p1J6J04J7p3RO5K3
$$ 326 361 347 229 335 247 256 280 178 178 304 498 447 402 381 398 359 183 209 160 285 294 340 233 286 296 225 241 345 362 289 298 363 386
179C86N9k3n9m3n2J7q9Q9K6M2J1o6j8m9m8N1j2j2q3l5J29J28J4j35N5q0j78Q3J3rJ22J44j02
$$ 386 445 422 363 320 268 285 196 285 311 353 364 298 280 231 183 234 222 210 127 92 221 349 363 228 283 203 25 108 121 112 234 378 276
171B76n2o5rMR2o4K4j07J21l8J07L3O1J1J4lj20r2K3qJj04P3N1o9m2P2l9J24j10M8J20N5j5
$$ 276 224 159 150 154 246 182 206 99 220 182 289 322 383 394 408 405 285 193 216 208 209 105 178 229 160 118 190 151 275 165 213 333 388 373
162C73M7PJ7j23N6j11JM8N5j1p9P3n7Nk4k8J37j41q3pj3J2Q1K1jJ2j7lk5J3L0n3KP8J11j5
$$ 373 420 427 444 321 377 266 267 315 370 359 280 353 296 301 277 249 386 245 162 155 142 154 235 256 255 267 250 247 222 235 265 212 214 292 403 388
154C88Q0r6k0j67q4J11K9kN8Mj4j58Q1M4qn7M9K5m1K2o4L3J78Ln3j66j19l2L9LL5nK0K4jj1
$$ 388 468 372 352 185 101 212 241 239 297 301 287 129 210 254 246 189 238 263 222 244 180 213 391 394 341 175 56 24 63 66 101 96 116 140 139 128
145A28K6o5N4j11J67n1N4k1L6M2O1j49M6R1n6n3J8Q4p9r1K7l2K6P4Rn4P4J01r4j34p7m9N6
$$ 128 154 89 143 32 199 148 202 181 217 259 320 171 217 308 252 199 217 301 222 131 158 126 152 226 235 181 255 356 262 128 51 2 58
137E8o9J7J07R2l0q5m7N3J8J31O4j05kMO2L5p2l9O3K6j2j22n7J16J5j43l8Q8Pm8j2O6P0N2
$$ 58 -11 6 113 205 175 90 43 96 114 245 309 204 202 206 268 303 231 192 255 281 269 147 90 206 221 78 40 128 135 87 75 141 211 263
128B63Nn5j04L9J25l1O7n2l0J20l2j31r1P9N0m6kJ9k5k7K0N2J06nJ5l4j31K9mpj8K2N7J9%
$$ 263 268 213 109 148 273 242 309 257 227 347 315 184 93 172 222 176 174 193 168 141 161 213 319 314 329 295 164 193 189 182 164 186 243 262 262
120B62p5k1n3j04J18K38j5p0L9o9m4j02o3L8J5J7ML0O4p6n9L5k9N4J42q4KN2r5N8M5q0m4q8
$$ 262 187 166 113 9 127 365 350 280 319 250 206 104 41 79 94 111 115 145 209 133 74 109 80 134 276 192 194 246 151 209 254 174 130 42
112D2M1J8pMO4J42J4o7p9Q1j2l6L2lJ01n6o0p4J09J1n7o6m0O3k2O1K9L8K7KPMj7J0l6J76P4
$$ 42 83 101 94 98 162 304 318 251 172 253 241 205 237 234 335 279 219 145 254 265 208 142 102 165 143 204 233 271 298 300 307 311 294 304 268 444 518
102E18m7j27L8j5J04k5J0j4Lj27o1R7nj09l7J1N2q8M8Q3j9J0k3J3Q9n0M8J09%q6j24j07n5
$$ 518 471 344 382 367 471 446 456 442 445 318 257 354 349 240 203 214 266 178 226 309 290 300 277 290 379 329 377 486 486 400 276 169 114
94A14P5L7j08N2M5N0j66o4J46R5J3J15o8rj8P2j29j68J6J70N1q7j37O8m2K7j8j29KK8m6Q9
$$ 114 189 226 118 170 215 265 99 35 181 276 289 404 336 327 309 381 252 84 100 270 321 234 97 165 123 150 132 3 5 33 -13 76
87G6L0L5J6N8m7pk8l2m7R5O8R8n5m9o4m7o8mK5Q3n4K4%R3K6N0k18J07M9l0Pp2n8J69p%q6j2
$$ 76 106 141 157 215 168 161 133 101 54 149 217 315 260 211 147 100 32 28 53 136 82 106 106 199 225 275 57 164 213 183 190 118 60 229 222 222 136 124
77A24k8LJ3RlK5n6J3Nm4j46l5R9N7J6l0mJ7k9j3KJ88Lk3M9M1j0R5j47m5oNp6J09j3l0N2l0
$$ 124 96 99 112 121 118 143 87 100 105 61 -85 -120 -21 36 52 22 18 35 6 -7 -5 183 186 163 212 253 243 338 191 146 140 145 69 178 165 135 187 157
68A57pk1P4O4L0J0j41J9J05j40O9oq0K8J9l4rJ8J08q4o2Q5o4k5o4nrk2O2N1J64q5j27R0o7
$$ 157 150 129 203 267 297 307 166 185 290 150 219 213 133 161 180 146 137 155 263 179 117 202 138 113 49 44 35 13 75 126 290 205 78 168 101
59A01m3J02O2K7o9l5kP0m9R3m3r2R5J4o3m2n5L8K05L7k01m1k9R3j23J26k4Mq9l4J07j09OJ6
$$ 101 58 160 222 249 180 145 143 213 164 257 214 122 217 231 168 126 71 109 314 351 150 109 80 173 50 176 152 156 67 33 140 31 37 53
51E3q5P4k9K8J04o7l8J02j6O6J2j04N7k4%Q2M1l5j75O5Q0kl6NK9r6o7O6P4J70m8l6j67J39
$$ 53 -32 42 13 41 145 78 40 142 126 192 204 100 157 133 133 215 256 221 46 111 191 189 153 158 187 91 24 90 164 334 286 250 83 222
43B22J17j20l5n0j19J97o2L2p9o0J32Q9j34q2rQ9J92M0j42P3r3N1q3k5L7j07q2J11o5J5K6
$$ 222 339 219 184 134 15 212 150 182 103 43 175 264 130 48 39 128 320 360 218 291 198 249 166 141 178 71 -11 100 35 50 76
35G6o5R1mP1l2j34P1Qp1K7J52lk6j4K3l6k7N1K1L8JM4J8j07o6o1O1M2N6j42K7Q1j5q0qo5J10
$$ 76 11 102 98 169 137 3 74 82 11 38 190 187 161 147 170 134 107 158 179 217 218 262 280 173 107 46 107 149 205 63 90 171 156 76 68 3 113
26A13p5O0O2m8p6K1K5M7OLQ9n5l1j0p3L1M5j0m2m4k6QM3K6l2n5R6L3k2O0j23Q1P5r7j19K8
$$ 113 38 98 160 112 36 57 82 129 135 138 227 172 141 131 58 89 134 124 82 38 12 20 63 89 57 2 98 131 109 169 46 127 202 105 -14 14
17A4o3K04jp5j04J12J3q1J15J9k8j17p9M9P6Q3ql2P2J06oj45n9M3o5q7M0P3J28J8Kq7pj04
$$ 14 -49 155 154 79 -25 87 100 19 134 153 125 8 -71 -22 54 137 129 97 169 275 269 124 65 108 43 -44 -4 69 197 215 217 130 123 19
9A9J20K4m8J14p3p3M9o2J7j9NL3J12M8j29k4L8j06R1M5p4QP2J2p0k2L4O0J7rj55L9Q1k0J8
$$ 19 139 163 115 229 156 83 132 70 87 68 73 106 218 266 137 113 151 45 136 181 107 115 187 199 129 107 141 201 218 209 54 93 174 154 172
1A72r1k7k5R4n8Kjo9N6n6j3KN0KJ67l3o5qK7J10q2l4l9k0L2P4lj33K3M9p2jO7Rn0m0K0M2q
$$ 172 81 54 29 123 65 67 66 -3 53 -3 -16 -14 36 38 205 172 107 99 126 236 154 120 81 61 93 167 164 31 54 103 31 30 97 106 56 16 36 78 70
-9G0L3k9l6P6NN5n2j6M1r5m6L2m9J47M1m2M3j1N0l4l5KL5kp7p5R4l3j6l9K3p5R2O4J42j13
$$ 70 103 74 38 114 119 174 122 106 147 52 6 38 -11 136 177 135 178 167 217 183 148 150 185 183 106 31 125 92 76 37 60 -15 77 141 283 170
-18A70j20KJ2O1J5m1R4p3P3k4Lp7J15Kp1No7O5J13j9p4M1l7p6O6q1m8j6Q2J5L0l2j8j19O1
$$ 170 50 52 64 125 140 99 193 120 193 169 172 95 210 212 141 146 79 144 257 238 164 205 168 92 158 77 29 13 95 110 140 108 90 -29 32
-26C2K8n5J61l4p2J35r0p2K5o0KJ8l8P5L4l8l8n4m1J16M5R5o0l7o9l1J17J13k9J40m5J6j12
$$ 32 60 5 166 132 60 195 105 33 58 -2 0 18 -20 55 89 51 13 -41 -82 34 79 174 114 77 8 -23 94 207 178 318 273 289 177
-34A77%q7M6R2j01k30Q0n9L9O4L2Q4Q1k9m5p3l4jj4j0M4J03j22k3J65j9N1M8mO7q1j10p1p0
$$ 177 177 90 136 228 127 -103 -23 -82 -43 21 53 137 218 189 144 71 37 36 22 12 56 159 37 14 179 160 211 259 255 322 241 131 60 -10
-43a0R5M3P4M4j22M1k2j06l1J01P5nn6j13O1O3j4M8l8p0j0k2k1k7M4O8n0n0%J46L5j19M9j5
$$ -10 85 128 202 246 124 165 143 37 6 107 182 177 121 8 69 132 118 166 128 58 48 26 5 -22 22 90 40 -10 -10 136 171 52 101 86
-51H6k0k1l6O5R6j02l4J28r9k5J00m4m5N0qMK9Jo6J41R0j1q2k0m1p9j05M8q0nP4Qn0L9N8j07
$$ 86 66 45 9 74 170 68 34 162 63 38 138 94 49 99 91 95 124 125 59 200 290 279 197 177 136 57 -48 0 -80 -85 -11 -3 -53 -14 44 -63
-60f3L4J22J31k6j7J29R1o3j62n5j1J8k0Q6k6j44n1J55R7nj44%J9J52j3j36j44r9O3O6J3J02
$$ -63 -29 93 224 198 181 310 401 338 176 121 110 128 108 194 168 24 -27 128 225 220 76 76 95 247 234 98 -46 -145 -82 -16 -3 99
-68I9L1J4j08N5p5Q2O7j18q1J29P7P7n6j01j41jO5O1lO5J18oj72L2Mj85K9M6J78p9n0q2j0
$$ 99 130 144 36 91 16 98 165 47 -34 95 172 249 193 92 -49 -50 15 76 73 138 256 250 78 110 114 -71 -42 4 182 103 53 -29 -39
-76c9K09n3j02Q3O9O5pp9K3nn9m5j49O3P9M7l5k1J26k3r3k0J30l2n1k4l2M7N5qj2K4j36n6
$$ -39 170 117 15 98 167 232 225 146 169 164 105 60 -89 -26 53 100 65 44 170 147 54 34 164 132 81 57 25 72 127 119 107 131 -5 -61
-84f1J53l4J0j08J94l9j02P8J12j34pK4K4R7j43o8R7N1j4J01j20r8J8N8j00r0J51l9O5K1p0
$$ -61 92 58 68 -40 154 115 13 91 203 69 62 86 110 207 64 -4 93 144 130 231 111 13 31 89 -11 -101 50 11 76 97 27
-92B7K0R1n7jLl1r4kJ49J44o6j85n1K61Oj21m6k4j8M5l1j33m9Q8K0J30O3m2o2pm4p7K8Q9J55
$$ 27 47 138 81 80 83 52 -42 -44 105 249 183 -2 -53 208 214 93 47 23 5 50 19 -114 -163 -75 -55 75 138 96 34 27 -17 -94 -66 23 178
-100A78J8q9j21M6q1q1k2Q7L1J7J8OL1j47N4J09L1J0R1m1k53n4N7J73J25j8j25r5Q4O9P5l2
$$ 178 196 107 -14 32 -49 -130 -152 -65 -34 -17 1 7 38 -109 -55 54 85 95 186 145 -108 -162 -105 68 193 175 50 -45 39 108 183 151
-108A51n2k00q8R9R1J49q8k8J46rmj25JJ1lK8j10J5O1R4N9r6j9o4q6j3J06M6M6m6j37J44j4
$$ 151 99 -101 -189 -90 1 150 62 34 180 171 167 42 43 54 51 79 -31 -16 45 139 198 102 83 19 -67 -80 26 72 118 72 -65 79 65
-116F5K0o1l1L1P3l5j36K00l2N1l0r0N3J1M9O7r8p1L5R2L2l3j41M6kk2J0l4m8J7J63k55J6
$$ 65 85 24 -7 24 97 62 -74 126 94 145 115 25 78 89 138 205 107 36 71 163 195 162 21 67 65 43 53 19 -29 -12 151 -104 -88
-124h8K01j4m2N1j30jmn6K2JQ3N7R0o9p5K2j54N0R7qm2r4R7J5N9j83l7J39N1nL4J05q5l5K8
$$ -88 113 99 57 108 -22 -23 -27 -83 -61 -60 23 80 170 101 26 48 -106 -56 41 33 -9 -103 -6 9 68 -115 -152 -13 38 33 67 172 87 52 80
-133H0J31l3j9l9q0Qm5o3J13j69K9J3O5R2K5j4J10j50n0mr1l8O8n6Q4J65r5n7j8R4P8nm4Q
$$ 80 211 178 159 120 40 48 3 -60 53 -116 -87 -74 -9 83 108 94 204 54 4 0 -91 -129 -61 -117 -33 132 37 -20 -38 56 134 129 85 93
-141I3k6j04M3J12r4m4Q1L1oj46j5j25J67R2L0J2L0K1K9r6M3j37l1L1n0m0PO9j9J1R2m0J13
$$ 93 67 -37 6 118 24 -20 61 92 86 -60 -75 -200 -33 59 89 101 131 152 181 85 128 -9 -40 -9 -59 -99 -92 -23 -42 -31 61 21 134
-149A34l8QL9j27L1l3j33P0K06p8o0n6J0P5L6j4p7P2L4j09MN8K3l3J0l7j5R7K0j06o7%O3L4
$$ 134 96 104 143 16 47 14 -119 -49 157 79 19 -37 -27 48 84 70 -7 65 99 -10 -6 52 75 42 52 15 0 97 117 11 -56 -56 7 41
-157D1j04%N7O4q2N2j14o6J16Qq9L1N7o0J2L6N2m3O8O7nkj2P7o2j29PJ03m0r3p8P9J6OL5J18
$$ 41 -63 -63 -6 58 -24 28 -86 -152 -36 -28 -117 -86 -29 -89 -77 -41 11 -32 36 103 98 96 84 161 99 -30 -23 80 40 -53 -131 -52 -36 -30 5 123
-166A23l8r3q9Q6J29jj24j0L4j08q8Q0M8j8R1mj70J3P8p4j4P7M4l8J4P6N9n7j08J01L5r1j29
$$ 123 85 -8 -97 -11 118 117 -7 -17 17 -91 -179 -99 -51 -69 22 18 -152 -139 -61 -135 -149 -72 -28 -66 -52 24 83 26 -82 19 54 -37 -166
-174a66Q5M0L9J2P1Q0q1l8J6k0J4J6q3l7o0P9PJ11p9kJ54Q1j01j40j3R0O5p4m7p0o6pN6O9
$$ -166 -81 -41 -2 10 81 161 80 42 58 38 52 68 -15 -52 -112 -33 -26 85 6 4 158 239 138 -2 -15 75 140 66 19 -51 -117 -124 -68 1
-183An7K0%n5J05J22p1j03R4l6K0l9N7k1j41L4J72Pj90P2NQ9k4l3p4M5N5k9K5L8j65J01KP4
$$ 1 -56 -36 -36 -91 14 136 65 -38 56 20 40 1 58 37 -104 -70 102 109 -81 -9 -4 85 61 28 -46 -1 54 25 50 88 -77 24 26 100
-191A00o0j2Mj40m4J01N3J01q4m0P1M5m2O2J2m6k2o6kol7m3J09M2m3jl4n7J7kP8q6m6R7o4
$$ 100 40 28 32 -108 -152 -51 2 103 19 -21 50 95 53 115 127 81 59 -7 -9 -15 -52 -95 14 56 13 12 -22 -79 -62 -64 14 -72 -118 -21 -85
-200h5j0Q4O5k4K8mN5r8nL5q1m8M0P2n1p2njQ5p7N4K9r0m9J33O3o8ML2q9M9M3m0J18Q0j55
$$ -85 -95 -11 54 30 58 54 109 11 6 41 -40 -88 -48 24 -27 -99 -104 -105 -20 -97 -43 -14 -104 -153 -20 43 -25 -21 11 -78 -29 14 -26 92 172 17
-208A7N7l4Jm6jJ0L3o7J9pkJ30%J14o2q3m2p0J79K0k08l9N4K3M0p8j19J22J46j8j7J1l6j7
$$ 17 74 40 41 -5 -6 4 37 -30 -11 -18 -20 110 110 224 162 79 37 -33 146 166 -42 -81 -27 -4 36 -42 -161 -39 107 89 72 83 47 30
-217C0nl1m4M1J9J2K3N1n2nmN2r2OR6J5p7k2k2o2O1J2j0n6j10J4K25R4K6o8Q5l4j04p9K8m0
$$ 30 25 -6 -50 -9 10 22 45 96 44 39 35 87 -5 1 97 112 35 13 -9 -71 -10 2 -8 -64 -174 -160 65 159 185 117 202 168 64 -15 13 -27
-225b7N0J32P7j07j10N4j1j61P5n1l8J69n7L2O4m5Q4o6m6l2j18J31J06l3j29n3O8P4n3J5J54
$$ -27 23 155 232 125 15 69 58 -103 -28 -79 -117 52 -5 27 91 46 130 64 18 -14 -132 -1 105 72 -57 -110 -42 32 -21 -6 148
-233A48n5p0K1J5j91J8N3L3J35j04r4J32R5m8j34J12R2q4q0J34j11K8rN3J0r1R8L4k0j10O3
$$ 148 93 23 44 59 -132 -114 -61 -28 107 3 -91 41 136 88 -46 66 158 74 -6 128 17 45 36 89 99 8 106 140 120 10 73
-241G3M4Q5J3j24p2Q5l5l7Q3j8p7O1k1J8M7L1n7j08jK5j98J08J26p6l5M1j7oK4q1k3QP8J6
$$ 73 117 202 215 91 19 104 69 32 115 97 20 81 60 78 125 156 99 -9 -10 15 -183 -75 51 -25 -60 -19 -36 -42 -18 -99 -122 -114 -36 -20
-249b0k23%P5J10J51p8o4N0k03K4J73K7oK5P1l5q6J21r9p1K2j23n0J13K09J5o2lr9N0j4O9
$$ -20 -243 -243 -168 -58 93 15 -49 1 -202 -178 -5 22 16 41 112 77 -9 112 13 -58 -36 -159 -209 -96 113 128 66 63 -36 14 0 69
-257F9QJ21K3j44o2l0o6J2J05J07m8j75j9L3J2N9J5N6M6J00j02j57l9n8K6J47p5n2R2nN9K1
$$ 69 77 198 221 77 15 -15 -81 -69 36 143 95 -80 -99 -66 -54 5 20 76 122 222 120 -37 -76 -134 -108 39 -36 -88 4 -1 58 79
-265G9N2k2j05R2m6Q3q6l0j15JM0P8j7L6j97p6J24L0m7MJ40M6l3QJ9n4J1o0Mo7K6J52j4n6
$$ 79 131 109 4 96 50 133 47 17 -98 -97 -57 21 4 40 -157 -233 -109 -79 -126 -122 18 64 31 39 58 4 15 -45 -41 -108 -82 70 56 0
-273@K6l0J4Q4q9j6j16L0Q9M5jQJJ06n1o9L5k8K0Pl8p3k9J0q2O8J66K8k20oJ87Po3P3o4q2
$$ 0 26 -4 10 94 5 -11 -127 -97 -8 37 36 44 45 151 100 31 66 38 58 65 27 -46 -75 -65 -147 -79 87 115 -105 -111 76 83 20 93 29 -53
-282e3L6M4l1q2L7JJ52K2k9K9m9k5q6j98J33N3ll9m8N6J00n4J28m3r1J19j08n8M4n1k4J01
$$ -53 -17 27 -4 -86 -49 -48 104 126 97 126 77 52 -34 -232 -99 -46 -49 -88 -136 -80 20 -34 94 51 -40 79 -29 -87 -43 -94 -118 -17
-290a7j59j30J08K10K9oj8Ll9l3Rp6L8O2O1j9N4L8r1K6J0p4j14K3L9L2m8J05j5o4o4j2PM8
$$ -17 -176 -306 -198 12 41 35 17 20 -19 -52 -43 -119 -81 -19 42 23 77 115 24 50 60 -14 -128 -105 -66 -34 -82 23 8 -56 -120 -132 -125 -77
-298g7N2J3q1M3R6N9j36K2l5k4R3p4j7O6N7m7L4l2k6J02n0qK4P1o9r7N1pJ3lJ37m6j23q6j12
$$ -77 -25 -12 -93 -50 46 105 -31 -9 -44 -68 25 -49 -66 0 57 10 44 12 -14 88 38 30 54 125 56 -41 10 3 16 13 150 104 -19 -105 -217
-306b17O5K12k9m2o8J08k8j32r2R5jp2k1M1Q8L3pNL3J24j0j16j0M2j04J6R4l1J0j8P6L0q5
$$ -217 -152 60 31 -11 -79 29 1 -131 -223 -128 -129 -201 -222 -181 -93 -60 -67 -62 -29 95 85 -31 -41 1 -103 -87 7 -24 -14 -32 44 74 -11
-314a1k25r6J40O4R9mJ29j30K2Kk4j05P9Qq1K1L9O2J40k3j17l9r6n8K65J8K8j28j71K2P2J26
$$ -11 -236 -332 -192 -128 -29 -33 96 -34 -12 -10 -34 -139 -60 -52 -133 -112 -73 -11 129 106 -11 -50 -146 -204 61 79 107 -21 -192 -170 -98 28
-322B8j30K4J07J1k7p3mO7j03o6J41Q1K4o6Q0J69o5r0q4k0J5Mll3JK2N2r0j03J0J00K0M9q2
$$ 28 -102 -78 29 40 13 -60 -64 3 -100 -166 -25 56 80 14 94 263 198 108 24 4 19 23 20 -13 -12 10 62 -28 -131 -121 -21 -1 48 -34
-331c4M9O7o4k5o7L3l9M5N8l1n2N7K4N3Jj4k0q4J5lN9M6n1j29J18M2q9j12K5m1J50O9n3pR2
$$ -34 15 82 18 -7 -74 -41 -80 -35 23 -8 -60 -3 21 74 75 61 41 -43 -28 -31 28 74 23 -106 12 54 -35 -147 -122 -163 -13 56 3 -4 88
-339H8q6j23j9R8l9j6N5K4j4O1k3l8p6qo9P2K7K4o0O4N0P3K5q5n4Nk3%J04j7k2rqM0K6K2K9
$$ 88 2 -121 -140 -42 -81 -97 -42 -18 -32 29 6 -32 -108 -116 -185 -113 -86 -62 -122 -58 -8 65 90 5 -49 -44 -67 -67 37 20 -2 -11 -19 21 47 69 98
-348I8Opr8L1j9r1k0R7Q0q5k7Q8J29j55q7k2j7J5Nr7M8J25l2LRkj2l0P9j3m3kp7Q1L2m9L2
$$ 98 104 97 -1 30 11 -80 -100 -3 77 -8 -35 53 182 27 -60 -82 -99 -84 -79 -176 -128 -3 -35 -32 -23 -25 -37 -67 12 -1 -44 -46 -123 -42 -10 -59 -27
-357b7L5j54K2K1O8O9j5M4J02q7j15oJ46ll9J07q9p7Qm8J0N2J2k3P1jp0j64Q2k6r6O1Q4l1
$$ -27 8 -146 -124 -103 -35 34 19 63 165 78 -37 -43 103 100 61 168 79 2 10 -38 -28 24 36 13 84 83 13 -151 -69 -95 -191 -130 -46 -77
-366g7O0q0L0o1Np9J7P5r6J17K25j28r6K3J9M4q8O8Q4JJ0q3k0l7m4J7l2L7P2J17O3q8p8o6
$$ -77 -17 -97 -67 -128 -123 -202 -185 -110 -206 -89 136 8 -88 -65 -46 -2 -90 -22 62 63 73 -10 -30 -67 -111 -94 -126 -89 -17 100 163 75 -3 -69
-374f9L6M0m0k2m0m1NM2J35l8r7l6Lrk8J94Mo9j6K3J60K1k8Ql6j4M7l5L2r2r3lM4k9J02OL9
$$ -69 -33 7 -33 -55 -95 -136 -131 -89 46 8 -89 -125 -122 -131 -159 35 39 -30 -46 -23 137 158 130 138 102 88 135 100 132 40 -53 -56 -12 -41 61 67 106
-383A06P6r4k6p3K1l2rR7J9l0pJ9j95O5j6L3ON7r7N1q6L7Q5j1J9K7L6L4o7o8o3J10j22r6o4
$$ 106 182 88 62 -11 10 -22 -31 66 85 55 48 67 -128 -63 -79 -46 -40 17 -80 -29 -115 -78 7 -4 15 42 78 112 45 -23 -86 24 -98 -194 -258
-391b58J71J9J29M8%k4l4o2O5m5p8O0kM7n3m0O4j2K4p5p1J8N0J9O8kn1RO9J3rj02N0j7L5q
$$ -258 -87 -68 61 109 109 85 51 -11 54 9 -69 -9 -11 36 -17 -57 7 -5 19 -56 -127 -109 -59 -40 28 26 -25 -16 53 66 57 -45 5 -12 23 15
-400A5q9J08P0Q6j59o7M1QL4rR6p8n6j19J2k2O5L8j7o3J42K2Po9PJ39l8M1j86j09M2N7o1O2
$$ 15 -74 34 104 190 31 -36 5 13 47 38 134 56 0 -119 -107 -129 -64 -26 -43 -106 36 58 65 -4 3 142 104 145 -41 -150 -108 -51 -112 -50
-409e0K6l8O1Q0j51n1Q4J81j14j4P7n9m6l1n4n8p0j45J34J63OJ70N1m7q1n4k0K2n5P6PJ5K4
$$ -50 -24 -62 -1 79 -72 -123 -39 142 28 14 91 32 -14 -45 -99 -157 -227 -372 -238 -75 -69 101 152 105 24 -30 -50 -28 -83 -7 0 15 39
-417C9r7p4K8J5O2J8J4j27r2O5N5N1Ok40J15M8N8R0J25j8QRj58p5M4J4M4j22N7K2J9o7j2J15
$$ 39 -58 -132 -104 -89 -27 -9 5 -122 -214 -149 -94 -43 -37 -277 -162 -114 -56 34 159 141 149 158 0 -75 -31 -17 27 -95 -38 -16 3 -64 -76 39
-425C9L1k65L1J17L0K5n3n6Kj15K4L8J41J5O0n2l6J09k3o3N2o4r0R4P2j03j0J6m2n6k4p4M4
$$ 39 70 -195 -164 -47 -17 8 -45 -101 -99 -214 -190 -152 -11 4 64 12 -24 85 62 -1 51 -13 -103 -9 63 -40 -50 -34 -76 -132 -156 -230 -186
-433a86J3J31J1N6K2k9m2k1Q6k2mn4K1L1Q4j34k7L0L9N0j58N7J00m1j40J16r7M0ON9j8J30
$$ -186 -173 -42 -31 25 47 18 -24 -45 41 19 15 -39 -18 13 97 -37 -64 -34 5 55 -103 -46 54 13 -127 -11 -108 -68 -62 -3 -21 109
-441A09J8rN1j02L7m6j06k6l3j7l7K5J30J30p0n5j9j0N8p5O6R8N8n0j1r6K8q8NP4p3o3J22
$$ 109 127 118 169 67 104 58 -48 -74 -107 -124 -161 -136 -6 124 54 -1 -20 -30 28 -47 19 117 175 125 114 18 46 -42 -37 37 -36 -99 23
-449B3m0N1Pj18Nkk4L8j27lQ7k2J17k4o1J48jM5j9mK5j59k5O3J5J09M8j39r3p2j3P7ppJ29
$$ 23 -17 34 41 -77 -72 -74 -98 -60 -187 -190 -103 -125 -8 -32 -93 55 54 99 80 76 101 -58 -83 -20 -5 104 152 13 -80 -152 -165 -88 -95 -102 27
-458B7J30q2n0q5o7l9k9J20L1pJ58j1o5rm5J1r4J93J4k29J16Q2o4K8n9J08j07mK4P6j17j3
$$ 27 157 75 25 -60 -127 -166 -195 -75 -44 -51 107 96 31 22 -23 -12 -106 87 101 -128 -12 70 6 34 -25 83 -24 -28 -4 72 -45 -58
-465e8N8jL0N9p6p0R4Nj43o9Q8j3L4j9q9nj3L6R9O9n6Nl3J03O7k28O3j56J28L5k5N1k9N2j00
$$ -58 0 -1 29 88 12 -58 36 41 -102 -171 -83 -96 -62 -81 -170 -175 -188 -152 -53 16 -40 -35 -68 35 102 -126 -63 -219 -91 -56 -81 -30 -59 -7 -107
-474a07J56P4o9n7O3j3l4q1L2k5n9J00P2L2j62q3J14R7Kl6j19M3r4j09R3K03M4l0p3J7K6L5
$$ -107 49 123 54 -3 60 47 13 -68 -36 -61 -120 -20 52 84 -78 -161 -47 50 52 16 -103 -60 -154 -263 -170 33 77 47 -26 -9 17 52
-482E2j15n1P8Q9r9L8M3Llk1n3L8m5j16MO1M8l3J0R4o9j26m0J00j9J25m2ll1M3p7l2O6rQ9
$$ 52 -63 -114 -36 53 -46 -8 35 38 35 14 -39 -1 -46 -162 -158 -97 -49 -82 -72 22 -47 -173 -213 -113 -132 -7 -49 -52 -83 -40 -117 -149 -83 -92 -3
-490cj46R1J50k1j37j3O1j1n0o7J2L3J5k9k8L6O0m3M7M7M2O0l3N0r0j3Q3kj03q7O4q2N1l1
$$ -3 -149 -58 92 71 -66 -79 -18 -29 -79 -146 -134 -101 -86 -115 -143 -107 -47 -90 -43 4 46 106 73 123 33 20 103 101 -2 -89 -25 -107 -56 -87
-499h7J4o1kQ6J07l4L9j32k0K6J22J12N0j58j30P9%n6m9NP4O8o8o9R5Mm6L3k0K4L7j01K3N6
$$ -87 -73 -134 -136 -50 57 23 62 -70 -90 -64 58 170 220 62 -68 11 11 -45 -94 -89 -15 53 -15 -84 11 15 -31 2 -18 6 43 -58 -35 21
-507B1r3j18J6J33R1J9JJ5k27O8Qj23N2J52m9Nl6q4k2K0J55L2mn9N7l4r8l1L6n6j6Q2Q4j04
$$ 21 -72 -190 -174 -41 50 69 70 85 -142 -74 -66 -189 -137 15 -34 -29 -65 -149 -171 -151 4 36 32 -27 30 -4 -102 -133 -97 -153 -169 -87 -3 -107
-515a07J79N7j49K7JLj0%N8K3N3q2j21jO4l9Q4l3l9Mm9J6L0M0NQ0O4K6K1p2j22O5P9j80Q3
$$ -107 72 129 -20 7 8 11 1 1 59 82 135 53 -68 -69 -5 -44 40 7 -32 -28 -77 -61 -31 9 14 94 158 184 205 133 11 76 155 -25 58
-524E8K6o0M8k6p5K3N3j54J8J24K2%j47%Q1j50o2L9R3K8k8J4K4K8m8r1Q0RK0k0L9j7n5MP6
$$ 58 84 24 72 46 -29 -6 47 -107 -89 35 57 57 -90 -90 -9 -159 -221 -182 -89 -61 -89 -75 -51 -23 -71 -162 -82 -73 -53 -73 -34 -51 -106 -102 -26
-532b6jnq1m7J06K0l8K27Pj53j0M8K4O6J47o9j16k1p0q1m6NJ25J00K3j17l7o5M4mQ3j30o2
$$ -26 -27 -32 -113 -160 -54 -34 -72 155 162 9 -1 47 71 137 284 215 99 78 8 -73 -119 -114 11 111 134 17 -20 -85 -41 -45 38 -92 -154
-540a54R5O1ol5K43l7j09m7Lj1J37o0qk9r7P5m1j13M4pl9k0J00M5n7K4J9l0O0Q4j20l7J22
$$ -154 -59 2 -4 -39 204 167 58 11 14 3 140 80 72 43 -54 21 -20 -133 -89 -96 -135 -155 -55 -10 -67 -43 -24 -54 6 90 -30 -67 55
-548E5Km8j49J09J31p4p7Q1Q5j3o3q9O6k0L8N2j08R7K1j7Rk2r2P7O9j28j51Q2l7J48L1J09
$$ 55 57 9 -140 -31 100 26 -51 30 115 102 39 -50 16 -4 34 86 -22 75 96 79 88 66 -26 51 120 -8 -159 -77 -114 34 65 174
-556A74j30k4r1j6M3n0no1p7K8O7L6k9J44K9q1r0L3k6N1K1N8kP1NpK3m5j27J9R8p6NL8m6m
$$ 174 44 20 -71 -87 -44 -94 -99 -160 -237 -209 -142 -106 -135 9 38 -43 -133 -100 -126 -75 -54 4 2 73 78 71 94 49 -78 -59 39 -37 -32 6 -40 -44
-565d4L3P8l3k39j1J36J50K6j18j56j0J06M3n8r8K1J25N8KJ8J22m5j28l1j5j95N1J80O0j75
$$ -44 -11 67 34 -205 -216 -80 70 96 -22 -178 -188 -82 -39 -97 -195 -174 -49 9 11 29 151 106 -22 -53 -68 -263 -212 -32 28 -147
-572a47l9J74Jj1o6j5R6k6j07J20M3p2o2L5j7RR2R1l9o3JK1n6O4k2l7J5k7p7L7N2K4l3m8l4
$$ -147 -186 -12 -11 -22 -88 -103 -7 -33 -140 -20 23 -49 -111 -76 -93 -84 8 99 60 -3 -2 19 -37 27 5 -32 -17 -44 -121 -84 -32 -8 -41 -89 -123
-581a23R8j2q2O6N1L3k5J11k3l8r2j70K08Q8J5%n5o7Qn8K2K6O5ok04K8PM9l7K1L6r1O9k8r8
$$ -123 -25 -37 -119 -53 -2 31 6 117 94 56 -36 -206 2 90 105 105 50 -17 -9 -67 -45 -19 46 40 -164 -136 -129 -80 -117 -96 -60 -151 -82 -110 -208
-590b08J53L6j0j26o5k4N5r4L1kP4R9n3l9j4N3Kn3L8J42j6m0q7O1N7oj14Q5J05jm5r8J72J6
$$ -208 -55 -19 -29 -155 -220 -244 -189 -283 -252 -254 -180 -81 -134 -173 -187 -134 -132 -185 -147 -5 -21 -61 -148 -87 -30 -36 -150 -65 40 39 -6 -104 68 84
-598H4n3n7P0n8q1j2J15O0q6r4J01q4Jj36R8J6R3k9pl8J08n1j31J30k1J9L7N5o5p7M2J9J26
$$ 84 31 -26 44 -14 -95 -107 8 68 -18 -112 -11 -95 -94 -230 -132 -116 -23 -52 -59 -97 11 -40 -171 -41 -62 -43 -6 49 -16 -93 -51 -32 94
-606I4o7J35p7j04l3K8Q2J36q3j2n2r4q6RN0j8j3P0M6Nj32r5R6j6J0R3J5M0r4j21m7K8J20
$$ 94 27 162 85 -19 -52 -24 58 194 111 99 47 -47 -133 -124 -74 -92 -105 -35 11 16 -116 -211 -115 -131 -121 -28 -13 27 -67 -188 -235 -207 -87
-614h7J19N3j25j6k8K1L6j43j1J47j5P1K4j05n4L8J52J3j69j29R2P2Q0K9j40lk2J4m0N1O8
$$ -87 32 85 -40 -56 -84 -63 -27 -170 -181 -34 -49 22 46 -59 -113 -75 77 90 -79 -208 -116 -44 36 65 -75 -78 -100 -86 -126 -75 -7
-622gj38%J39r2l3M5J29k3n6J5j12K8QK4L2M4j08L3O4l9l2O8j01P7J48j03o8J49Mn6j77k4
$$ -7 -145 -145 -6 -98 -131 -86 43 20 -36 -21 -133 -105 -97 -73 -41 3 -105 -72 -8 -47 -79 -11 -112 -35 113 10 -58 91 95 39 -138 -162
-629a62j5M0J01o4J25p1q4P9O9J9M7j45p9J14PP5M7M3j00j04OJ0j41PQ5P7N8j64k1J09pPO8
$$ -162 -177 -137 -36 -100 25 -46 -130 -51 18 37 84 -61 -140 -26 -19 56 103 146 46 -58 -52 -42 -183 -176 -91 -14 44 -120 -141 -32 -39 -32 36
-637C6j07L8O7K5R1j56jP8Nro3p4J47M7j53L7l9J8j3k4J3J11l8k0L3j04L3J00j00J28L5j26
$$ 36 -71 -33 34 59 150 -6 -7 71 76 67 4 -70 77 124 -29 8 -31 -13 -26 -50 -37 74 36 16 49 -55 -22 78 -22 106 141 15
-645A5O0Pr3m4n4Q9l6n4lQ5ON6J6n0j4l1L5k7oqjL7%K5l9r5j6J12K5J05j83k1J17Q8q9r4M9
$$ 15 75 82 -11 -55 -109 -20 -56 -110 -113 -28 -22 34 50 0 -14 -45 -10 -37 -43 -51 -52 -15 -15 10 -29 -124 -140 -28 -3 102 -81 -102 15 103 14 -80 -31
-654c1l2O1O8N9q5j33j8K8N5qp5j2M5J22k5qJ25J1k5r7kK3K6jj03M4P4O7p5j16J4j23J45J2
$$ -31 -63 -2 66 125 40 -93 -111 -83 -28 -36 -111 -123 -78 44 19 11 136 147 122 25 23 46 72 71 -32 12 86 153 78 -38 -24 -147 -2 10
-663A0o2j4Q8Op1Q9o1p7l3Q3R3j6m3o6l6K4o2n6kL9J22k0J00mk7L4m9o0Qk6J6n8P3K3m1q8
$$ 10 -52 -66 22 28 -43 46 -15 -92 -125 -42 51 35 -8 -74 -110 -86 -148 -204 -206 -167 -45 -65 35 31 4 38 -11 -71 -63 -89 -73 -131 -58 -35 -76 -164
-671a64L1J5K02l9j11k3l5J71J5kk2k9O2q9k8O8l8N9l0p9q8O5J25oL2j02j0LM5L7o6L5m2k8
$$ -164 -133 -118 84 45 -66 -89 -124 47 62 60 38 9 71 -18 -46 22 -16 43 13 -66 -154 -89 36 30 62 -40 -50 -47 -2 35 -31 4 -38 -66
-680f6n1j9oR8%PKJ1m5q4J1J2P8K0R2k7j47K9M1q7LJ5J23%n7j30M4J87P8k5O6j06Jj97j77
$$ -66 -117 -136 -142 -44 -44 -37 -35 -24 -69 -153 -142 -130 -52 -32 60 33 -114 -85 -44 -131 -128 -113 10 10 -47 -177 -133 54 132 107 173 67 68 -129 -306
-688c06R6o1K5J34l6P7J44n2j39K0OL2noK1p5N5J50l6k4m0l2QQ6P8r4l6j23j5J62rP6n7q9
$$ -306 -210 -271 -246 -112 -148 -71 73 21 -118 -98 -92 -60 -65 -71 -50 -125 -70 80 44 20 -20 -52 -44 42 120 26 -10 -133 -148 14 5 81 24 -65
-697f5k4j01P9M2N1M0m0P0J2%l6mk5R2o7l7j09K7Q0O4Lj13mR9J00r7j22L0Q4m8oJ15oj40m6
$$ -65 -89 -190 -111 -69 -18 22 -18 52 64 64 28 24 -1 91 24 -13 -122 -95 -15 49 52 -61 -65 34 134 37 -85 -55 29 -19 -25 90 84 -56 -102
-705a02J03N8k7j14j18O6l2J36%m7l3J87jj30J8M3p5O2n8M2l3j9J0Lm0oJ2N5k9L4k4N8OL8
$$ -102 1 59 32 -82 -200 -134 -166 -30 -30 -77 -110 77 76 -54 -36 7 -68 -6 -64 -22 -55 -74 -64 -61 -101 -107 -95 -40 -69 -35 -59 -1 5 43
-714D3j59m2R9nN8L0l7j3K3N9j2Q4j28J0j30KO7K6J2k7j07ok2N1m4N8n1n4K3P7J00qj92L1
$$ 43 -116 -158 -59 -64 -6 24 -13 -26 -3 56 44 128 0 10 -120 -118 -51 -25 -13 -40 -147 -153 -175 -124 -168 -110 -161 -215 -192 -115 -15 -23 -215 -184
-722a84M0j8J09no5N7O2p6mP1J08m5j8j25KJKO0m7Qr5o0O7J3NP8K1MNO0m0k0RQ6j9o4Qq9Q0
$$ -184 -144 -162 -53 -58 -123 -66 -4 -80 -84 -13 95 50 32 -93 -91 -90 -88 -28 -75 -67 -162 -222 -155 -142 -137 -59 -38 -34 -29 31 -9 -29 -20 66 47 -17 -9 -98 -18
-731a8m7j5M9J14R0j51m7O4O3j59o4J2O4J64j59o7l2N2J07jL6j27M4qnl9O4O1p7m6pJ15j7
$$ -18 -65 -80 -31 83 173 22 -25 39 102 -57 -121 -109 -45 119 -40 -107 -139 -87 20 19 55 -72 -28 -36 -41 -80 -16 45 -32 -78 -85 30 13
-739A3j06Q4M9r9N9l0k3J82k0j0kl4k0k0%N3N5j13j03N5R5m6k8p9q1M0J98k4M3j62n7K2k7
$$ 13 -93 -9 40 -59 0 -30 -53 129 109 99 97 63 43 23 23 76 131 18 -85 -30 65 19 -9 -88 -169 -129 69 45 88 -74 -131 -109 -136
-748a36O6RK3j7m0P2L1l5j4o6L3M9J0N9O7M8rj02j67J1m1Q3Q5m1J5K7j53Q8O3K7N2n9p4Q1
$$ -136 -70 -61 -38 -55 -95 -23 8 -27 -41 -107 -74 -25 -15 44 111 159 150 48 -119 -108 -149 -66 19 -22 -7 20 -133 -45 18 45 97 38 -36 45
-756D5m0Mj1j59j3J20LN2jNP8r1o6n9L2J28k4r6k1O2P2r3k0N0j6L3K6r8N5q3l8J35l3K4k7
$$ 45 5 9 -2 -161 -174 -54 -51 1 0 5 83 -8 -74 -133 -101 27 3 -93 -114 -52 20 -73 -93 -43 -59 -26 0 -98 -43 -126 -164 -29 -62 -38 -65
-764f5k9Q4r3L4M4m8K2N1n0m7n5K9m0J57m9o2J03Ro3mJ00M8j49P2j1k28R4R3Rk9R2j12J0j2
$$ -65 -94 -10 -103 -69 -25 -73 -51 0 -50 -97 -152 -123 -163 -6 -55 -117 -14 -5 -68 -72 28 76 -73 -1 -12 -240 -146 -53 -44 -73 19 -93 -83 -95
-773i5Nr6R1R2Pm1M9l5j7J29L3O5q8m3l1Q7K1J7k4j00lJ9q6R0j9L7j4j30n8oR5p8J50J10o0
$$ -95 -90 -186 -95 -3 4 -37 12 -23 -40 89 122 187 99 56 25 112 133 150 126 26 23 42 -44 46 27 64 50 -80 -138 -144 -49 -127 23 133 73
-781G3o1n1j13R2m4j2j54M3K0m4nJ20k4J01J24m8p6o3J49J13j00n9n2P1o9j20M6m8K8J3j5
$$ 73 12 -39 -152 -60 -104 -116 -270 -227 -207 -251 -256 -136 -160 -59 65 17 -59 -122 27 140 40 -19 -71 0 -69 -189 -143 -191 -163 -150 -165
-789a65O9m0k1jJ23J01N0kQ4k2k11k5%Rj40m7J08J04o3k3Q4n4O2o2L8k7L3j0K1O3L8J5m7p5
$$ -165 -96 -136 -157 -158 -35 66 116 114 198 176 -35 -60 -60 -51 -191 -238 -130 -26 -89 -112 -28 -82 -20 -82 -44 -71 -38 -48 -27 36 74 89 42 -33
-797c3j5M7mN1m4k3L6M0p7kn8M3PKp5J5Rj11k7R6L7P3K7K9l8p9R9P3p6N7K3j2mj52l2Q5o3
$$ -33 -48 -1 -5 46 2 -21 15 55 -22 -24 -82 -39 -32 -30 -105 -90 -81 -192 -219 -123 -86 -13 14 43 5 -74 25 98 22 79 102 90 86 -66 -98 -13 -76
-806g6j26J36J14N4J9r1m2J4k4P0q2p8kk2P2j3m8K4M5L9Q3J4p1q7l2J21Q6J7k5n0k0m5j08
$$ -76 -202 -66 48 102 121 30 -12 2 -22 48 -34 -112 -114 -136 -64 -77 -125 -101 -56 -17 66 80 9 -78 -110 11 97 114 89 39 19 -26 -134
-814a34P5K32k0j29q2j2j06kOO5M9M7k9k2J03M0q9p0j9p7L8J23J1Kq4J06o7p5Lk2j0K4M0J46
$$ -134 -59 173 153 24 -58 -70 -176 -178 -172 -107 -58 -11 -40 -62 41 81 -8 -78 -97 -174 -136 -13 -2 0 -84 22 -45 -120 -117 -139 -149 -125 -85 61
-823F1j3k9N2j7p8RL4L0Q7j90q4N5L1j43K3J70j29M8J41N7L9j21m1k0pr8lN4k0j14P9QJ01
$$ 61 48 19 71 54 -24 -15 19 49 136 -54 -138 -83 -52 -195 -172 -2 -131 -83 58 115 154 33 -8 -28 -35 -133 -136 -82 -102 -216 -137 -129 -28
-831b8M8N3j74k7N8o9N4LN4O8r1J1M7j0m4qJ0K3K9j4o3Q7J9N1Qo0q3j03K0O5J0Q4Q5L1J17
$$ -28 20 73 -101 -128 -70 -139 -85 -82 -28 40 -51 -40 7 -3 -47 -55 -45 -22 7 -7 -70 17 36 87 95 35 -48 -151 -131 -66 -56 28 113 144 261
-839B61j25q4j05J00K2j3m8L1K9n4m2N2P0J40q6j16k4j07M5O5k6Qq9L1l5o2J30O1r9O0J2j36
$$ 261 136 52 -53 47 69 56 8 39 68 14 -28 24 94 234 148 32 8 -99 -54 11 -15 -7 -96 -65 -100 -162 -32 29 -70 -10 2 -134
-847a34J9Q4m6l4J81K5rp1j27K9o9n9R5k0j9J95o8p3M7M0j7M4m0K0p7r0K6J34N1o7L6q9K3
$$ -134 -115 -31 -77 -111 70 95 86 15 -112 -83 -152 -211 -116 -136 -155 40 -28 -101 -54 -14 -31 13 -27 -7 -84 -174 -148 -14 37 -30 6 -83 -60
-855f0J46j32l9k6l2J5J30o4j51L8K8J37l0j1J06m0j51qP9J0O8r0pj06J06p2L6J29m4j7R8
$$ -60 86 -46 -85 -111 -143 -128 2 -62 -213 -175 -147 -10 -40 -51 55 15 -136 -144 -65 -55 13 -77 -84 -190 -84 -156 -120 9 -35 -52 46
-863D6n4n8o6n3J36j1n9o8J1j5M6J90O6o9r8K7k7L2L9j17o1jJ21j1o5K1O2o2J7L5j4p2J5n0
$$ 46 -8 -66 -132 -185 -49 -60 -119 -187 -176 -191 -145 45 111 42 -56 -29 -56 -24 15 -102 -163 -164 -43 -54 -119 -98 -36 -98 -81 -46 -60 -132 -117 -167
-871a67P5P6R2n3r5M5K1pn3j14lJ11K8ln0J19J3q6K8j5LRL0k6M1Q1PMk5n9kq4L0r1K4O1K2
$$ -167 -92 -16 76 23 -72 -27 -6 -13 -66 -180 -183 -72 -44 -47 -97 22 35 -51 -23 -38 -35 -26 4 -22 19 100 107 111 86 27 25 -59 -29 -120 -96 -35 -13
-880a3q6k1R2K0R7o7q8k2j20L6Q7j53J16M0J04l3m5Nn1n7PO1O7J6r1PM9Q9m0MM6N3pq2r6P
$$ -13 -99 -120 -28 -8 89 22 -66 -88 -208 -172 -85 -238 -122 -82 22 -11 -56 -51 -102 -159 -152 -91 -24 -8 -99 -92 -43 46 6 10 56 109 102 20 -76 -69
-889f9J01o6P3M5q9p8J32KJ4L1Pj02o6Q5r7o0L9NK5J30p3j15j3j4J11l6j7M0Q2l8qN0r5r6
$$ -69 32 -34 39 84 -5 -83 49 51 65 96 103 1 -65 20 -77 -137 -98 -93 -68 62 -11 -126 -139 -153 -42 -78 -95 -55 27 -11 -19 31 -64 -160
-897a60K6K0l7K17ML8j6j20j4mM6M8r2j08K8L0J6R6M9L6k14L9m4N0j6r4J17j6k9O4l6Q1m3
$$ -160 -134 -114 -151 66 70 108 92 -28 -42 -46 0 48 -44 -152 -124 -94 -78 18 67 103 -111 -72 -116 -66 -82 -176 -59 -75 -104 -40 -76 5 -38
-905c8n8n7o3J65Q5K4l8j49R4J9n2OQm6K8M4L8K6l6r6R1j6O3p6j23R9l6l1K5Q9J09q1Q8P0
$$ -38 -96 -153 -216 -51 34 58 20 -129 -35 -16 -68 -62 -54 -100 -72 -28 10 36 0 -96 -5 -21 42 -34 -157 -58 -94 -125 -100 -11 98 17 105 175
-914A75o0n8n5r8k1l5n0J56j7l0J37k8J20n3p9p8ml4k3J17J17Lk0r0km8J55p3m1P3r0j52q
$$ 175 115 57 2 -96 -117 -152 -202 -46 -63 -93 44 16 136 83 4 -74 -78 -112 -135 -18 99 102 82 -8 -10 -58 97 24 -17 56 -34 -186 -194
-922a94O2jO6k10QJ76M9r9J21OK3K7l6NJ07Lj78j10R6R8J01M5l0l0j06m2K5J5L9K1l0L5j9
$$ -194 -132 -133 -67 -277 -269 -93 -44 -143 -22 -16 7 34 -2 3 110 113 -65 -175 -79 19 120 165 135 105 -1 -43 -18 -3 36 57 27 62 43
-930D3Q0qk0j17O7rj20M1K6L6OK5mj4k6j45J1J22Q1K3j18O4q5o9J16O0n9q6Q5o9k37R0R5J12
$$ 43 123 115 95 -22 45 36 -84 -43 -17 19 25 50 46 32 6 -139 -128 -6 75 98 -20 44 -41 -110 6 66 7 -79 6 -63 -300 -210 -115 -3
-938cL8M5q9j25Q0J01m8l7m8q4J1R3Q5n2j87J20km7L5O5l5M0Q0n9N3n9l4J9k4J04J29q0r6
$$ -3 35 80 -9 -134 -54 47 -1 -38 -86 -170 -159 -66 19 -33 -220 -100 -102 -149 -114 -49 -84 -44 36 -23 30 -29 -63 -44 -68 36 165 85 -11
-946a1K7Pj01J0l0P9r9LM1m4M6kK8J1JO0j30qJ57j15j20j7J65J46m8k8o3q5J63Q7r0j6K1j6
$$ -11 16 23 -78 -68 -98 -19 -118 -115 -74 -118 -72 -74 -46 -35 -34 26 -104 -112 45 -70 -190 -207 -42 104 56 28 -35 -120 43 130 40 24 45 29
-954B9j0m0p6J11J89j44n9L4j6k24mJ75pr4Q6K3J8j3L4J3o7J1j4j50L1k6O7J16J18p7N2n2
$$ 29 19 -21 -97 14 203 59 0 34 18 -206 -210 -35 -42 -136 -50 -27 -9 -22 12 25 -42 -31 -45 -195 -164 -190 -123 -7 111 34 86 34
-962C4rk0l9l6k1M1N0M9k9q6n9O3R1L6p4k7j1l3J34j54l2j20mQ2J21l6O0J7J3n7j02L4Q7K4
$$ 34 25 5 -34 -70 -91 -50 0 49 20 -66 -125 -62 29 65 -9 -36 -47 -80 54 -100 -132 -252 -256 -174 -53 -89 -29 -12 1 -56 -158 -124 -37 -13
-971a3K3q4l0L5k2M2j5j0j19P5J8j00J85J2n4J6j4M7PK1J09qP7kj40l5N8M1Jp2J5lj09P5J41
$$ -13 10 -74 -104 -69 -91 -49 -64 -74 -193 -118 -100 -200 -15 -3 -57 -41 -55 -8 -1 20 129 121 198 196 56 21 79 120 121 49 64 61 -48 27 168
-979A68K6n4j8r7N6j12M9J35K9j19j64%Q8l7P2l1M9o5r2J3j17J7J53M5J66n6k5K4L2k3k0j42
$$ 168 194 140 122 25 81 -31 18 153 182 63 -101 -101 -13 -50 22 -9 40 -25 -117 -104 -221 -204 -51 -6 160 104 79 103 135 112 92 -50
-987e0OK4m0N8K2p4P6n2jKj8R1m5Mj19Q6m5l4J43J75L1j5j51q8L6Qj36L5J83P4j59m5Q8n7
$$ -50 -44 -20 -60 -2 20 -54 22 -30 -31 -29 -47 44 -1 3 -116 -30 -75 -109 34 209 240 225 74 -14 22 30 -106 -71 112 186 27 -18 70 13
-995A3J9l3n3n2j4J05J28j2ok9R4o5j3k7l0j8l2j2J76n0k5J8q2j69M6P0L9P2r5k5k5O0m4q4
$$ 13 32 -1 -54 -106 -120 -15 113 101 95 66 160 95 82 55 25 7 -25 -37 139 89 64 82 0 -169 -123 -53 -14 58 -37 -62 -87 -27 -71 -155
-1004a55J49L9q1N0K6o4j50Q5M1J2j7J2J8K4N0m0p9nJ19L5p1l7o0J00K4n6L7k6P7J01r8o6
$$ -155 -6 33 -48 2 28 -36 -186 -101 -60 -48 -65 -53 -35 -11 39 -1 -80 -85 34 69 -2 -39 -99 1 25 -31 6 -20 57 158 60 -6
-1011fQ4Qk5j75N6K4J93L0j63R2R3q9l0k7J0J4j41N9O3J8q1p8rl0J20L9J5n8l4L4r3m5kN3
$$ -6 78 86 61 -114 -58 -34 159 189 26 118 211 122 92 65 75 89 -52 7 70 88 7 -71 -80 -110 10 49 64 6 -28 6 -87 -132 -134 -81
-1020h1N9Pn4K8Q1P8j65n3J38J32p0o2l3j19jlM1n6O9J23Q1l0j75j07R4LM2k3r0J59M5mk4
$$ -81 -22 -15 -69 -41 40 118 -47 -100 38 170 100 38 5 -114 -115 -118 -77 -133 -64 59 140 110 -65 -172 -78 -75 -33 -56 -146 13 58 54 30
-1028C0r1O9k5L5j8Pj8k2K4O5l3K5l1j1O0q7j9P2J25j07p6k7m1K8K3pj7Q5q4NL6m5j0J29J9
$$ 30 -61 8 -17 18 0 7 -11 -33 -9 56 23 48 17 6 66 -21 -40 32 157 50 -26 -53 -94 -66 -43 -50 -67 18 -66 -61 -25 -70 -80 49 68
-1036F8N6oj67p9L8%K4J13J02k4oj37k7N9no3O3J5j5N3j38L1L0n1J14m8j8n1n0J67P6m3o4
$$ 68 124 118 -49 -128 -90 -90 -66 47 149 125 119 -18 -45 14 9 -54 9 24 9 62 -76 -45 -15 -66 48 0 -18 -69 -119 48 124 81 17
-1044A7J7k6j47O6N7p2l8N6K3j13J23J8O0r1J4j1%P8j4N2k4Q2Qk5l6r6j19M8K17l0r1N0m6
$$ 17 34 8 -139 -73 -16 -88 -126 -70 -47 -160 -37 -19 41 -50 -36 -47 -47 31 17 69 45 127 135 110 74 -22 -141 -93 124 94 3 53 7
-1052Gk8On0o3J30l5o7M4j11L4J5M6K9k0M3rm5j1Q1J2Q8o6m3M3L0OL9j06o2k4L3K8p2m7J2
$$ 7 -21 -15 -65 -128 2 -33 -100 -56 -167 -133 -118 -72 -43 -63 -20 -29 -74 -85 -4 8 96 30 -13 30 60 66 105 -1 -63 -87 -54 -26 -98 -145 -133
-1061a33M5R4pOL7j0N9q7l7N5j04m6J16k5m2J03K10j65p4nj7N3pn8NmJ21p6L3L2J61O5o9j48
$$ -133 -88 6 -1 5 42 32 91 4 -33 22 -82 -128 -12 -37 -79 24 234 69 -5 -10 -27 26 19 -39 -34 -38 83 7 40 72 233 298 229 81
-1069H1k9K0q8j4M1k6J09jj3j11M2j0q5RQ0j8rp8j5J80L2k4o5j6mO9k2J08r5j16K8k2J30L2
$$ 81 52 72 -16 -30 11 -15 94 93 80 -31 11 1 -84 -75 5 -13 -22 -100 -115 65 97 73 8 -8 -12 57 35 143 48 -68 -40 -62 68 100
-1078A00j8Kl2k2n0j24Q1R3n6j17N0n8k3K13kl9mn5M4o2ol1P3P1j1j08R7J35L4n2n3l6k6r8
$$ 100 82 84 52 30 -20 -144 -63 30 -26 -143 -93 -151 -174 39 37 -2 -6 -61 -17 -79 -85 -116 -43 28 17 -91 6 141 175 123 70 34 8 -90
-1086i0R1j0q2j6J9J2m1L8J42K6M5q3L9k6q1M6N1j06N8J00q4krp5k6L7K9kJ6p2Jn7kK5M9O0
$$ -90 1 -9 -91 -107 -88 -76 -117 -79 63 89 134 51 90 64 -17 29 80 -26 32 132 48 46 37 -38 -64 -27 2 0 16 -56 -55 -112 -114 -89 -40 20
-1095B0o2n1J09J83j19l6j06j3J56q0n6J17N1OL0j11j30L1O8N7j33j6N1M1J33ll4K8j38p1
$$ 20 -42 -93 16 199 80 44 -62 -75 81 1 -55 62 113 119 149 38 -92 -61 7 64 -69 -85 -34 7 140 137 103 131 -7 -78
-1102g8R2m0j83Q3L1N5J22R6q1l8k7n0M2L4j40n2o7R1R9lO4J8qR3qq1j6k6o1J09l6K7n6M6
$$ -78 14 -26 -209 -126 -95 -40 82 178 97 59 32 -18 24 58 -82 -134 -201 -110 -11 -14 50 68 60 153 145 64 48 22 -39 70 34 61 5 51
-1110E1L4k3j00K1R9K2r3p4R2m0o1J86P0rl6m6n6k1o6J7Q2N2n4j16Kl9N1M3l4p8P0M8n1R9
$$ 51 85 62 -38 -17 82 104 11 -63 29 -11 -72 114 184 175 139 93 37 16 -50 -33 49 101 47 -69 -67 -106 -55 -12 -46 -124 -54 -6 -57 42
-1119D2p0ql7R5J4oK7noj52K8J8l6Q1j8K8J01k8M9k8Q9o3j8q3r5lm7J03o%L5k4j00k3J16K7
$$ 42 -28 -36 -73 22 36 30 57 52 46 -106 -78 -60 -96 -15 -33 -5 96 68 117 89 178 115 97 14 -81 -84 -131 -28 -34 -34 1 -23 -123 -146 -30 -3
-1128cRJ1J4j3o6p4M0O9O1j28p3P0l3m0P7O9J23jp7j3O9N2o3l3n7J4K9j0j24N4M3R3j04K0
$$ -3 6 17 31 18 -48 -122 -82 -13 48 -80 -153 -83 -116 -156 -79 -10 113 112 35 22 91 143 80 47 -10 4 33 23 -101 -47 -4 89 -15 5
-1136EO4j3p8N0K0N1l6j29K4R8l9N6p7q5k3K4O6PO6R0j40k12J02L7j2O5K6j18Q8N0J1N6r6
$$ 5 69 56 -22 28 48 99 63 -66 -42 56 17 73 -4 -89 -112 -88 -22 -15 51 141 1 -211 -109 -72 -84 -19 7 -111 -23 27 38 94 -2
-1144bL9L7j58o9M1JO2Ql7O7R4K3j5rO6k9oj8p5j0l4J25L0k3r2j09nJ14ojQ0k7n1L5P0Mk4
$$ -2 37 74 -84 -153 -112 -111 -49 -41 -78 -11 83 106 91 82 148 119 113 95 20 10 -24 101 131 108 16 -93 -98 16 10 9 89 62 11 46 116 120 96
-1153I6L4Nj12J1mr2R5J7Q0m5M3p9j8n9o8M0J5m9L5K7n1j25Q2J12l5J7m3Q5J4M8j7L2n5j51
$$ 96 130 135 23 34 30 -62 33 50 130 85 128 49 31 -28 -96 -56 -41 -90 -55 -28 -79 -204 -122 -10 -45 -28 -71 14 28 76 59 91 36 -115
-1161a15LL2m7P5O3J20j4k0j1L7o5j06L5J41r0pN7j69L8N3m4j6N0J04L9o1o8J32P5j09kj25
$$ -115 -112 -80 -127 -52 11 131 117 97 86 123 58 -48 -13 128 38 31 88 -81 -43 10 -34 -50 0 104 143 82 14 146 221 112 110 -15
-1169a5p4k1M9k1ql6j23J15J48O0j58J53J22j97n9M3LN9N9j01P7Q2j9j31j17K1J26%k3J9m
$$ -15 -89 -110 -61 -82 -90 -126 -249 -134 14 74 -84 69 191 -6 -65 -22 -19 40 99 -2 75 157 138 7 -110 -89 37 37 14 33 29
-1177B9n2j2R9K8j61k5L7J9Ml6Q6N4j1p6N8k0j02p5J09K9ON8J5J2L9n8n4k9l0J54j79q5k8
$$ 29 -23 -35 64 92 -69 -94 -57 -38 -34 -70 16 70 59 -17 41 21 -81 -156 -47 -18 -12 46 61 73 112 54 0 -29 -59 95 -84 -169 -197
-1185a97K9J16l8N9k0p6J48M7J8m6j27qm5P1N9n3J53L0m7m9r3R7M9r7JoQ5j4k6O4q2k5p9K7
$$ -197 -168 -52 -90 -31 -51 -127 21 68 86 40 -87 -95 -140 -69 -10 -63 90 120 73 24 -69 28 77 -20 -19 -25 60 46 20 84 2 -23 -102 -75
-1193g5J40O3j64O2Q7m0j09P6J4o7j24JN5j6P8P0L1l9pp6JJ10M9L6J0r9J8j6q1L4O6r3k3o0
$$ -75 65 128 -36 26 113 73 -36 40 54 -13 -137 -136 -81 -97 -19 51 82 43 36 -40 -39 71 120 156 166 67 85 69 -12 22 88 -5 -28 -88
-1201h8N5K4o6o2Q3l8K5M3K2L2Om3L8RJ10j90n7P2O4J5p3J2N3q9M7J05P9o5rK9N9k9Lj23j8
$$ -88 -33 -9 -75 -137 -54 -92 -67 -24 -2 30 36 -7 31 40 150 -40 -97 -25 39 54 -19 -7 46 -43 4 109 188 123 114 143 202 173 176 53 35
-1210C5r1R2L5p8J23K1k12K6O8M2OOq1j6L1l9j3q5RL1J51p3k7q4J0P3K5%M6M6L4k6m1l3M8
$$ 35 -56 36 71 -7 116 137 -75 -49 19 61 67 73 -8 -24 7 -32 -45 -130 -121 -90 61 -12 -39 -123 -113 -40 -15 -15 31 77 111 85 44 11 59
-1219E9j34l7N4N2J1J8Ln8J20j8k5l5N5N8r2J3M6K7r5MM6o6n7O2J8J8K9j15K0K5K2o4j4R2
$$ 59 -75 -112 -58 -6 5 23 26 -32 88 70 45 10 65 123 31 44 90 117 22 26 72 6 -51 11 29 47 76 -39 -19 6 28 -36 -50 42
-1227D2J02j7j18rO3K1o4L1r6n2j4Q8j6J0L0qLQ4n8k2l0J04o4l1m6J9J1P6m8M3n8J19j07m9
$$ 42 144 127 9 0 63 84 20 51 -45 -97 -111 -23 -39 -29 1 -7 -4 80 22 0 -30 74 10 -21 -67 -48 -37 39 -9 34 -24 95 -12 -61
-1235f1j03o4J68rO5n6L2Q0n5JJ01j6j5kL9L6K6o0K5N2o1j25J16K6p8o1k7r7n4Q5N1J04k19
$$ -61 -164 -228 -60 -69 -4 -60 -28 52 -3 -2 99 83 68 66 105 141 167 107 132 184 123 -2 114 140 62 1 -26 -123 -177 -92 -41 63 -156
-1243a56j08O8K0J46pp7J46n8L0L0Q3o6K9m4k3K3q9pl7Q2q%jO3J21q9j09O4r8L3K1J8P9Rj64
$$ -156 -264 -196 -176 -30 -37 -114 32 -26 4 34 117 51 80 36 13 36 -53 -60 -97 -15 -23 -23 -24 39 160 71 -38 26 -72 -39 -18 0 79 88 -76
-1252g6KjP4K3Q2p9j49k2J41R9p0M9N3K4r2O1Q8p1j15K1n3L8p6l0J77Kk2k3j56J01oj56kK65
$$ -76 -74 -75 -1 22 104 25 -124 -146 -5 94 24 73 126 150 58 119 207 136 21 42 -11 27 -49 -79 98 100 78 55 -101 0 -6 -162 -164 101
-1260A01l8r3P2M4m6j4j4M0K6r5J12j12L2P3K9o4O2j0m9j31JJ74l3j32mK46N2j04j59m3l2
$$ 101 63 -30 42 86 40 26 12 52 78 -17 95 -17 15 88 117 53 115 105 56 -75 -74 100 67 -65 -69 177 229 125 -34 -77 -109
-1268a09K4M9q9K7L0P5LK5o0K8N3r0O6o9l5M6k3K04L4q8l2M3K2p5q5Q2L4m2OP3j5N1%j18N3
$$ -109 -85 -36 -125 -98 -68 7 10 35 -25 3 56 -34 32 -37 -72 -26 -49 155 189 101 69 112 134 59 -26 56 90 48 54 127 112 163 163 45 98
-1276I8K1o3Q4N9j17j08J1Q0q5P4p6N2L3j66%J50P8K7J00o2k6p9m8k9kR0l0k7J56j5pq4pR7
$$ 98 119 56 140 199 82 -26 -15 65 -20 54 -22 30 63 -103 -103 47 125 152 252 190 164 85 37 8 6 96 66 39 195 180 173 89 82 179
-1285A79M8j2j06M6r8J2m7r2m5l6P7P8J2L9j6O6M0m2L8n8j7o3K5K8m6J6q7J9j1q3M5K6j19
$$ 179 227 215 109 155 57 69 22 -70 -115 -151 -74 4 16 55 39 105 145 103 141 83 66 3 28 56 10 26 -61 -42 -53 -136 -91 -65 -184
-1293a84J18P0J4jM5L1K3L3m9o0J69O6j30m8q4j53J03R7N4N3L1K3k4r5o1LO6j6l0K7K3k7n4
$$ -184 -66 4 18 17 62 93 116 149 100 40 209 275 145 97 13 -140 -37 60 114 167 198 221 197 102 41 44 110 94 64 91 114 87 33
-1301C3O0j78nJ04m4K3j31m0J43L6j4m0j1KJ55R7q0p9l1J4L7n4J17L3k3j4p5j11JJ69P9j52
$$ 33 93 -85 -90 14 -30 -7 -138 -178 -35 1 -13 -53 -64 -62 93 190 110 31 0 14 51 -3 114 147 124 110 35 -76 -75 94 173 21
-1309B1m8O9pq1J8l7n6R9J08L7Jj4o1p0j13j5J42m5r6L1Q9K8M6L3j22O9Oj4j2N7J06k8pj26
$$ 21 -27 42 35 -46 -28 -65 -121 -22 86 123 124 110 49 -21 -134 -149 -7 -52 -148 -117 -28 0 46 79 -43 26 32 18 6 63 169 141 134 8
-1317Hk2M5J08n7j28l5J20K0n0m4l0N3R7kl8M1p4j35M1P2m1KK25o3j67K5J24o4j45J03Q5j1
$$ 8 -14 31 139 82 -46 -81 39 59 9 -35 -65 -12 85 83 45 86 12 -123 -82 -10 -51 -49 176 113 -54 -29 95 31 -114 -11 74 63
-1325F3p3J3lm7J37N4j3j54q9Q4P0M8o4L8l8j38Q0J19J3o5k3k1j09OP9p9O0Q3QJ6j2k2M3N4
$$ 63 -10 3 0 -47 90 144 131 -23 -112 -28 42 90 26 64 26 -112 -32 87 100 35 12 -9 -118 -112 -33 -112 -52 31 39 55 43 21 64 118
-1333A18n4j15L4J0j04P3R8J4m3j1J08l3n8O4rp4K6j7p6J96J06n6n8p3n5j28J8J78m0jO5o
$$ 118 64 -51 -17 -7 -111 -38 60 74 31 20 128 95 37 101 92 18 44 27 -49 147 253 197 139 66 11 -117 -99 79 39 38 103 97
-1341I7q1m2p0N2n7O5Ql1P7P7k8LJ07K0j40k20L8N3J42j5m7P9l6r9jJ07j9j00J05j33J27m
$$ 97 16 -26 -96 -44 -101 -36 -28 -59 18 95 67 70 177 197 57 -163 -125 -72 70 55 8 87 51 -48 -49 58 39 -61 44 -89 38 34
-1349C4N9n8n3M4r1J58M4l4o3m2P6k3R0L8r1l8RK4r2J4Jk4l6MMR7M0j5P7N0l4r4R8k9k2op8
$$ 34 93 35 -18 26 -65 93 137 103 40 -2 74 51 141 179 88 50 59 83 -9 5 6 -18 -54 -50 -46 51 91 76 153 203 169 75 173 144 122 116 38
-1358C8o7K2K0n2Nq4J40J52o4L5J08p3r4o3qJ10R7q1r5l9m8KP6RL2K5J27l6j25M7J87l9k29
$$ 38 -29 -7 13 -39 -34 -118 22 174 110 145 253 180 86 23 15 125 222 141 46 7 -41 -39 37 46 78 103 230 194 69 116 303 264 35
-1366C5OJ21p5q6J03jn5l1q0J0%N8J41o4o6m1K0j56M1J89o6nP0MM9j5j50M7k1j04N0K3P3j7
$$ 35 41 162 87 1 104 103 48 17 -63 -53 -53 5 146 82 16 -25 -5 -161 -120 69 3 -2 68 72 121 106 -44 3 -18 -122 -72 -49 24 7
-1374Gj8J13Oq4M0P5j09l0O5m8l3P6jN5MJ40q5j69JM0n5L7j8o2k8j0k3J12J7J6L9N6r2r8J04
$$ 7 -11 102 108 24 64 139 30 0 65 17 -16 60 59 114 118 258 173 4 5 45 -10 27 9 -53 -81 -91 -114 -2 15 31 70 126 34 -64 40
-1383D0M9M5J18j36P1j3J3p1j67N1L0Ml5M0%J3l8l5J39N8q9j24m8k4J0O7J02l1Jo5K2N2l6
$$ 40 89 134 252 116 187 174 187 116 -51 0 30 34 -1 39 39 52 14 -21 118 176 87 -37 -85 -109 -99 -32 70 39 40 -25 -3 49 13
-1391A3O3L8M6j0m5q2L9N9j56j9L0J35k7m8j5J13l0M6j15p0N5K7M8j09J7Q8k8j5p2PM8P6M0
$$ 13 76 114 160 150 105 23 62 121 -35 -54 -24 111 84 36 21 134 104 150 35 -35 20 47 95 -14 3 91 63 48 -24 -17 31 107 147
-1399A47j0n0L0J6rk9N5n4K5oo6jqJ5p0O7rJ38l6j0n3M3O4jj42j48J08R9j09N1K04l5j29O4
$$ 147 137 87 117 133 124 95 150 96 121 115 49 48 40 55 -15 52 43 181 145 135 82 125 189 188 46 -102 6 105 -4 47 251 216 87 151
-1407A51L1j7j07o5j6M0N5J8P6q0K0P4j6o1j42k4M0K4OJ21N9n6p3M6j28K5On8k8QO2O8j03
$$ 151 182 165 58 -7 -23 17 72 90 166 86 106 180 164 103 -39 -63 -23 1 7 128 187 131 58 104 -24 1 7 -51 -79 -71 -9 59 -44
-1415d4L6n8O0k7o2O1O9R0j20M8Pj31K08m2o5Lo3mR0N5p1qP7j6NJ0J00n7j7O4l9lkj3j76l5
$$ -44 -8 -66 -6 -33 -95 -34 35 125 5 53 60 -71 137 95 30 33 -30 -34 56 111 40 32 109 93 98 108 208 151 134 198 159 156 154 141 -35 -70
-1424g0L8Qk0N9J3J7J08m2J9l0j38l7J87Q7Q9l9j00Oj8p0m6RM0n3J2L1R6kj33p6J69J59k8
$$ -70 -32 -24 -44 15 28 45 153 111 130 100 -38 -75 112 199 288 249 149 155 137 67 21 30 70 17 29 60 156 154 21 -55 114 273 245
-1432B45j34%L3J16q1nK0l3l1j09M2M8k4n3O9n0pmN0rj03j10J27J09j53Q1Q7L9q1o4K2l7J7
$$ 245 111 111 144 260 179 174 194 161 130 21 63 111 87 34 103 53 46 42 92 83 -20 -130 -3 106 -47 34 121 160 79 15 37 0 17
-1440A7l2J15j6P0Nj30j14j64J89J31o6m5N7O1K1o6l5jJ48l6o7R2l2j61k3J70OL7r1o1M4Q9
$$ 17 -15 100 84 154 159 29 -85 -249 -60 71 5 -40 17 78 99 33 -2 -3 145 109 42 134 102 -59 -82 88 94 131 40 -21 23 112
-1448A12j98n2M4J81l5o1J8J9M3j6r3M0Q6j2J10rl4l6J47j8k16n7j8L1L2J54L6p0kO2Jm1j53
$$ 112 -86 -138 -94 87 52 -9 9 28 71 55 -38 2 88 76 186 177 143 107 254 236 20 -37 -55 -24 8 162 198 128 126 188 189 148 -5
-1456ePkO3N7k4j93MR5j4N8M6J2O5o7r3J12RJ09p1J8j6l5K8q1p1P3M3o5p4J01j7J28j6j6o0
$$ -5 2 0 63 120 96 -97 -93 2 -12 46 92 104 169 102 9 121 130 239 168 186 170 135 163 82 11 84 127 62 -12 89 72 200 184 168 108
-1465A08N1l3j43r3N4J93Ql6m0Qq2O5j52q8J81J29M4o1Pl9N6k6j33J2l1j1m6o2J95N5m5K5
$$ 108 159 126 -17 -110 -56 137 145 109 69 77 -5 60 -92 -180 1 130 174 113 120 81 137 111 -22 -10 -41 -52 -98 -160 35 90 45 70
-1472G0p5Q5O2k4L2R3l0o3P4j22O7M9p1j45j9N2R9J2m4l6Q8o2j65J78o3%l0jJ79j8j44l9O0
$$ 70 -5 80 142 118 150 243 213 150 224 102 169 218 147 2 -17 35 134 146 102 66 154 92 -73 105 42 42 12 11 190 172 28 -11 49
-1480D9J1J3n6p1%M5R5N4R6o4j7r6p6p3N7J45R3l0KO3rqrj21J2p9N2P9j73J2J96n7L7j8Pk5
$$ 49 60 73 17 -54 -54 -9 86 140 236 172 155 59 -17 -90 -33 112 205 175 177 240 231 223 214 93 105 26 78 157 -16 -4 192 135 172 154 161 136
-1489A36r1M8Kj36p1Q7P6L8n7mM5p7L0QQJ5k3L1O2J5O6p0OO7m9j11J9O5Jj8M0m8k4%N9%j7
$$ 136 45 93 95 -41 -112 -25 51 89 32 28 73 -4 26 34 42 57 34 65 127 142 208 138 144 211 162 51 70 135 136 118 158 110 86 86 145 145 128
-1498A28n1k8j8O6m8p9K3OL7lk7q0K7M8J8k5O5m2K5M0L4K8J5no2On6j3J9P2l0m5N5j00J41
$$ 128 77 49 31 97 49 -30 -7 -1 36 33 6 -74 -47 1 19 -6 59 17 42 82 116 144 159 154 92 98 42 29 48 120 90 45 100 0 141
-1507A41jj52l5qO9K0o1o8K4l1N5J01m5p6O1O6Q5nl3m3M4Rq9RmmK7J01m0jn8j3J55n6oo7k7
$$ 141 140 -12 -47 -55 14 34 -27 -95 -71 -102 -47 54 9 -67 -6 60 145 140 107 64 108 117 28 37 33 29 56 157 117 116 58 45 200 144 138 71 44
-1516D4rj6J36N7m2p3k1k7j16M2N9Kl0j18O9M7K6O0m5l3P5O0J1j12k5J7qJ01k3O5jj05KPP3
$$ 44 35 19 155 212 170 97 76 49 -67 -25 34 36 6 -112 -43 4 30 90 45 12 87 147 158 46 21 38 30 131 108 173 172 67 69 76 149
-1524A49Q5k3Jn9j15N3M1lj48K5J10n7l6M9ML3P0k5k2j18j05K0J59J10K7J4n2J21m3q0j05
$$ 149 234 211 212 153 38 91 132 129 -19 6 116 59 23 72 76 109 179 154 132 14 -91 -71 88 198 225 239 187 308 265 185 80
-1532H0jp6J29J01n0q6j4N8l7om2J12L6j37l9n0o0O4P0K1N2l2l2P5L5m3J9Mn0j09JP1O7Q5
$$ 80 79 3 132 233 183 97 83 141 104 98 56 168 204 67 28 -22 -82 -18 52 73 125 93 61 136 171 128 147 151 101 -8 -7 64 131 216
-1540B16k4n9j63P5j7P6r1q9R0J8K5Q9q6n0N8M1No7M1n3K6K0Q1r0N0j3j16ML9K8M0n1k0k8
$$ 216 192 133 -30 45 28 104 13 -76 14 32 57 146 60 10 68 109 114 47 88 35 61 81 162 72 122 109 -7 -3 36 64 104 53 33 5
-1549EJ02J0l0Q5j08L7Pk3P9MLjL9p3j50oL1O1P5p9M4N3jl5O8L9r0k3M1K7n8r3Q4j4M3l8k4
$$ 5 107 117 87 172 64 101 108 85 164 168 171 170 209 136 -14 -20 11 72 147 68 112 165 164 129 197 236 146 123 164 191 133 40 124 110 153 115 91
-1558I1j7K8J24J5j76pQM8J3N8p8kp0q7N2%J20Qj89j5L7Q7Q1L3N8q3j57m4PK0P2m5n5L7N5
$$ 91 74 102 226 241 65 58 66 114 127 185 107 105 35 -52 0 0 120 128 -61 -76 -39 48 129 162 220 137 -20 -64 -57 -37 35 -10 -65 -28 27
-1566B7M9j8L9n4o9k6NJ24K9j5l6O3k6J6m5o3K5J4o5J26R3l8J4Q7k8r1j01m6J32O1J8j5ON2
$$ 27 76 58 97 43 -26 -52 -47 77 106 91 55 118 92 108 63 0 25 39 -26 100 193 155 169 256 228 137 36 -10 122 183 201 186 192 244
-1575B44j11r2j5k4o5J00L2k3J8oL3N8j13nN9m8M5R0n1q9K8oj0L4MP4N1q2Q1l4k2M3j05o4
$$ 244 133 41 26 2 -63 37 69 46 64 58 91 149 36 31 90 42 87 177 126 37 65 59 49 83 87 161 212 130 211 177 155 198 93 29
-1583B9J6P4Qm8k5J2Q0K7o5q8K7J3l2POQ6K4k0m1PK0ko7K0n4OJ7J0M1n7R7O8q8om2jK3MK6
$$ 29 45 119 127 79 54 66 146 173 108 20 47 60 28 35 41 127 151 131 90 97 117 115 48 68 14 20 37 47 88 31 128 196 108 102 60 59 82 86 112
-1592A12J6o9k6o3L4N3P7l2m1j9j8J72j8q2k5o8J34M2K7o0K6k5k2J2O6m5q0l5O1K4l2o2k3
$$ 112 128 59 33 -30 4 57 134 102 61 42 24 196 178 96 71 3 137 179 206 146 172 147 125 137 203 158 78 43 104 128 96 34 11
-1600A1J15KM3J0nm6JKq7qj6oQ2J35o3p6n3p3k0O5L0K9M3
$$ 11 126 128 171 181 176 130 131 133 46 38 22 16 98 233 170 94 41 -32 -52 13 43 72 115
-1606A15
##$OBSERVED INTEGRALS=	(X Y Z)
(7.1815040391339763914, 7.2465699300112857983, 0.962947434361646315)
(7.0050214069667564587, 7.0741275576097155664, 0.94620948411537686429)
(6.7921027022358142489, 6.8415614751785938097, 0.90163640061261740577)
(5.2846312720141845887, 5.4824579655934631006, 5.1250906230829800236)
(2.9135015368833330207, 3.0623002476152700879, 0.97690296644134400061)
(2.7667051238659028378, 2.8768014905013274962, 3.3509633241406815429)
(2.55375493447226809, 2.636374262855096795, 1.9768462912715423219)
(2.2716243847955182034, 2.3575710567092773573, 3.1057818402478885034)
(2.0296834226901947495, 2.1669856851154594146, 3.8219214225858655354)
(1.738709686748359573, 1.8581873419134262715, 2.0006721692943827406)
(1.4151548298576304141, 1.5151837622969295261, 2.6109295348817758153)
(1.355861451882782065, 1.4151548298576304141, 5.7434845160897012306)
(1.2641706612000280785, 1.355861451882782065, 9.2017055001549348248)
(1.1798678970562344048, 1.2641706612000280785, 6.3762207443823024633)
(0.95425578869231963974, 1.0439736312579499522, 2.2986223683690210073)
(0.8614839814438068899, 0.95425578869231963974, 6.6000653799679458444)
##END=	
##TITLE=	Feb27-2020.650.1.1r
##JCAMP-DX=	6.0	$$ MestReNova 14.1.0-24037
##BLOCK_ID=	3
##DATA TYPE=	NMR PEAK TABLE
##DATA CLASS=	PEAK TABLE
##CROSS REFERENCE=	NMR SPECTRUM: BLOCK_ID=2                                     
##.OBSERVE FREQUENCY=	400.05240029848198446
##.OBSERVE NUCLEUS=	^1H
##NPOINTS=	212
##FIRSTX=	0.73503207606066545132
##LASTX=	7.5430426384606334977
##XFACTOR=	1
##YFACTOR=	1
##FIRSTY=	15414.604838993473095
##XUNITS=	PPM
##YUNITS=	ARBITRARY UNITS
##PEAK TABLE=	(XYW..XYW)
0.73503207606066545132,15414.604838993473095,0.0029741898617958810978
0.75266100372077060499,35303.337389651198464,0.0026197368766501154605
0.76949673259318496221,10885.174401462110836,0.003453038011174746312
0.82443968115092103321,8687.307457502482066,0.002263799158950351078
0.8432364716853095743,20644.720057666745561,0.0024563236224050240611
0.86092677151616991971,17978.134178701780911,0.0030563596894251344148
0.86478878914089951646,9744.8919553691503097,0.0041027980074276179309
0.87687646404045727078,17949.745713018983224,0.0028824036396329238453
0.88398185587605149216,45367.853875842840353,0.0037686350828467054044
0.89251732296593222493,2153162.9899470168166,0.0036676316273101614712
0.89836870294227977318,349541.94584183197003,0.0057919815123546507588
0.90343994471105881772,275585.94546917034313,0.0061137683860297926605
0.91008517936062860443,5843469.7099447362125,0.0029547377427922745519
0.91621626016638724188,841984.6199330475647,0.0029610323684810179942
0.9209295318245481754,607818.58374346140772,0.0066102195149537641694
0.92658587702596917346,1857495.9271163966041,0.0048276592253231392568
0.93348100430612845901,161177.17016474361299,0.0031759835296818854367
0.9387681315775281421,26523.575787517067511,0.0071559460051703101952
0.94632544510052707398,19164.015062560698425,0.0038187166261127855268
$$ [...]
Impurity,None,,1,1.2909993098576109105,0,0
Artifact,Artifact|Weak,,1,-0.6183542896717202364,0,0
Compound,Artifact|Weak,,1,0.30767304369212561399,0,0
Compound,None,,1,-0.10962525637626531483,0,0
Compound,Artifact|Weak,,1,0.42830508603934708267,0,0
Compound,None,,1,-0.42717284080011580505,0,0
Compound,None,,1,0.40172990107601164178,0,0
Compound,None,,1,0.40297963027690747451,0,0
Compound,None,,1,0.18495255845625754865,0,0
Compound,None,,1,1.4016798716309530892,0,0
Compound,None,,1,1.9001133554680893489,0,0
Compound,None,,1,-0.070529539069446547939,0,0
Compound,None,,1,-0.63511228902296601451,0,0
Compound,None,,1,-0.016849224777838678335,0,0
Compound,None,,1,-0.41653083783935407336,0,0
Compound,None,,1,-0.58453642774489311673,0,0
Compound,None,,1,-0.028115074366018594221,0,0
Compound,None,,1,-1,0,0
Compound,None,,1,-0.36703150845079107745,0,0
Compound,None,,1,0.56185042808398744096,0,0
Compound,None,,1,-0.22699438576092179076,0,0
Compound,None,,1,0.24123858239730991415,0,0
Compound,None,,1,0.22540339393690173031,0,0
Compound,None,,1,0.61228285258222869825,0,0
Compound,None,,1,0.22522524359258708215,0,0
Compound,None,,1,1.0354943935542726408,0,0
Compound,None,,1,0.40066360417592178367,0,0
Compound,None,,1,0.52744080715498831147,0,0
Compound,None,,1,-0.24525287976833759496,0,0
Compound,None,,1,-0.30708079943911814613,0,0
Compound,None,,1,-0.46901438322903843403,0,0
Compound,None,,1,0.019418043217082538859,0,0
Compound,None,,1,0.047294184702187463953,0,0
Compound,None,,1,0.31156590604362294217,0,0
Impurity,Artifact|Weak,,1,1.999999999999999778,0,0
Compound,None,,1,-0.37037566177426051173,0,0
Compound,None,,1,0,0,0
Compound,None,,1,0.92396142382491985856,0,0
Artifact,Artifact|Weak,,1,-0.02371882805455590576,0,0
Impurity,Artifact|Weak,,1,1.2976709209096544129,0,0
Impurity,None,,1,1.6870030861863936078,0,0
Impurity,Artifact|Weak,,1,1.4261465539680415748,0,0
Impurity,Artifact|Weak,,1,1.8796256805395097356,0,0
Impurity,Artifact|Weak,,1,1.999999999999999778,0,0
Compound,None,,1,0.055088810407370070177,0,0
Compound,None,,1,1.4119330116224053651,0,0
Impurity,Artifact|Weak,,1,1.7999999999999998224,0,0
Solvent,Artifact|Impurity|Weak|13C Sat.,,1,1.999999999999999778,0,0
Compound,None,,1,1.3221292804108752961,0,0
Compound,None,,1,0.72948179932059975528,0,0
Compound,None,,1,1.2931328468367375706,0,0
Compound,None,,1,1.2588620626996622764,0,0
Impurity,None,,1,1,0,0
Impurity,None,,1,0.89425906028697510486,0,0
Artifact,Artifact|Weak,,1,-0.84981872102614508524,0,0
Artifact,Artifact|Weak,,1,1.6907591520681588548,0,0
Compound,None,,1,1.1120779782610026309,0,0
Compound,None,,1,0.093539313267363366489,0,0
Solvent,None,,1,0.87567146229261105805,0,0
Artifact,Artifact|Weak,,1,1.2442246777056695795,0,0
Impurity,Artifact|Weak,,1,0.21501345216768741331,0,0
Impurity,Artifact|Weak,,1,-0.22022226023214028223,0,0
Impurity,Artifact|Weak,,1,-0.079941016716855162194,0,0
Solvent,Artifact|Impurity|Weak|13C Sat.,,1,0.79721513808373833943,0,0
##END=	
##END=	
