##TITLE=	Jan17-2020.70.1.1r
AR-1; A. R.
##JCAMP-DX=	6.0	$$ MestReNova 14.1.0-24037
##DATA TYPE=	LINK
##BLOCK_ID=	1
##BLOCKS=	1    
##ORIGIN=	Mestrelab Research S.L.
##OWNER=	ar419
##$MNOVA/LINK_BLOCK_TYPE=	ITEM	$$ NMR Spectrum
##$MNOVA/ITEM/POLYGON=	(XY..XY)
5321,5835
8722,5835
8722,8208
5321,8208
5321,5835
##$MNOVA/ITEM/Z=	0
##$MNOVA/ITEM/ANGLE=	0
##TITLE=	Jan17-2020.70.1.1r
##JCAMP-DX=	6.0	$$ MestReNova 14.1.0-24037
##BLOCK_ID=	2
##DATA TYPE=	NMR SPECTRUM
##DATA CLASS=	XYDATA
##NUMDIM=	1
##ORIGIN=	
##OWNER=	ar419
##.OBSERVE FREQUENCY=	400.05240029848198446
##.OBSERVE NUCLEUS=	^1H
##.SOLVENT NAME=	
##.PULSE SEQUENCE=	
##LONGDATE=	2020/01/17 15:56:00.000
##.ACQUISITIONMODE=	SIMULTANEOUS
##$ORIGINAL FORMAT=	Bruker XWIN-NMR
##$MNOVA/SCALES_VERSION=	8
##$PARAMETER FILE=	(auditp.txt, ASCII, //icnas3.cc.ic.ac.uk/ar419/pdata/1/auditp.txt, 0)
$$ ##TITLE= Audit trail, TOPSPIN		Version 3.2
$$ ##JCAMPDX= 5.01
$$ ##ORIGIN= Bruker BioSpin GmbH
$$ ##OWNER= nmrsu
$$ $$ /opt/topspin/data/ug1/nmr/Jan17-2020/70/pdata/1/auditp.txt
$$ ##AUDIT TRAIL=  $$ (NUMBER, WHEN, WHO, WHERE, PROCESS, VERSION, WHAT)
$$ (   1,<2020-01-17 15:56:38.777 +0000>,<nmrsu>,<nmrpc>,<go>,<TOPSPIN 3.2>,
$$       <created by zg
$$ 	started at 2020-01-17 15:55:36.117 +0000,
$$ 	POWCHK enabled, PULCHK disabled,
$$        configuration hash MD5:
$$        8A 91 E6 C4 64 AA B7 18 DA B6 E1 A8 9A 5E 4B 87
$$        data hash MD5: 32K
$$        EF C9 7E 45 9B BE 46 A4 A0 D1 ED 4A 72 83 39 91>)
$$ (   2,<2020-01-17 15:56:39.631 +0000>,<nmrsu>,<nmrpc>,<audit>,<TOPSPIN 3.2>,
$$       <user comment:
$$        ICON-NMR User ID: ug1
$$        data hash MD5: 32K
$$        EF C9 7E 45 9B BE 46 A4 A0 D1 ED 4A 72 83 39 91>)
$$ (   3,<2020-01-17 15:56:39.641 +0000>,<nmrsu>,<nmrpc>,<audit>,<TOPSPIN 3.2>,
$$       <user comment:
$$        ICON-NMR User ID: ug1
$$        data hash MD5: 32K
$$        EF C9 7E 45 9B BE 46 A4 A0 D1 ED 4A 72 83 39 91>)
$$ (   4,<2020-01-17 15:56:40.103 +0000>,<nmrsu>,<nmrpc>,<proc1d>,<TOPSPIN 3.2>,
$$       <Start of raw data processing
$$        ef LB = 0.3 FT_mod = 6 PKNL = 1 SI = 32K 
$$        data hash MD5: 32K
$$        29 FB E7 A3 49 D6 32 B7 65 3D D3 FF E6 D8 1B 5F>)
$$ (   5,<2020-01-17 15:56:40.149 +0000>,<nmrsu>,<nmrpc>,<proc1d>,<TOPSPIN 3.2>,
$$       <apks 
$$        data hash MD5: 32K
$$        86 58 B0 6B 6A 4F 37 4A CD C2 A3 57 3B DC 14 B8>)
$$ (   6,<2020-01-17 15:56:40.166 +0000>,<nmrsu>,<nmrpc>,<proc1d>,<TOPSPIN 3.2>,
$$       <abs ABSG = 5 
$$        data hash MD5: 32K
$$        93 42 43 BA 62 3F EF D3 89 39 47 E6 AB 68 9C F0>)
$$ ##END=
$$ 
$$ $$ hash MD5
$$ $$ 40 01 E7 F7 2E 9A 4C 7F 91 42 1F B9 A5 7F EC 11
$$ 
##$PARAMETER FILE=	(datafile, ASCII, //icnas3.cc.ic.ac.uk/ar419/pdata/1/1r, 0)
$$ 
##$PARAMETER FILE=	(intrng, ASCII, //icnas3.cc.ic.ac.uk/ar419/pdata/1/intrng, 0)
$$ P 0
$$ 7.481063   6.590467
$$ 5.869189   5.001209
$$ 3.480411   0.543339
$$ 
##$PARAMETER FILE=	(parm.txt, ASCII, //icnas3.cc.ic.ac.uk/ar419/pdata/1/parm.txt, 0)
$$ 
$$ [...]
$$     74     24694.8      367.926       0.9197         0.59
$$     75     24705.4      365.326       0.9132         0.88
$$ 
##$PARAMETER FILE=	(procs, ASCII, //icnas3.cc.ic.ac.uk/ar419/pdata/1/procs, 0)
$$ ##TITLE= Parameter file, TOPSPIN		Version 3.2
$$ ##JCAMPDX= 5.0
$$ ##DATATYPE= Parameter Values
$$ ##NPOINTS= 9	$$ modification sequence number
$$ ##ORIGIN= Bruker BioSpin GmbH
$$ ##OWNER= nmrsu
$$ $$ 2020-01-17 15:56:40.191 +0000  nmrsu@nmrpc
$$ $$ /opt/topspin/data/ug1/nmr/Jan17-2020/70/pdata/1/procs
$$ $$ process /opt/topspin3.2/prog/mod/peak
$$ ##$ABSF1= 16.01477
$$ ##$ABSF2= -4.014776
$$ ##$ABSG= 5
$$ ##$ABSL= 3
$$ ##$ALPHA= 0
$$ ##$AQORDER= 0
$$ ##$ASSFAC= 0
$$ ##$ASSFACI= 0
$$ ##$ASSFACX= 0
$$ ##$ASSWID= 0
$$ ##$AUNMP= <proc_1dIC3>
$$ ##$AXLEFT= 0
$$ ##$AXNAME= <>
$$ ##$AXNUC= <1H>
$$ ##$AXRIGHT= 0
$$ ##$AXTYPE= 0
$$ ##$AXUNIT= <>
$$ ##$AZFE= 0.1
$$ ##$AZFW= 0.1
$$ ##$BCFW= 0
$$ ##$BC_mod= 0
$$ ##$BYTORDP= 0
$$ ##$COROFFS= 0
$$ ##$CY= 15
$$ ##$DATMOD= 1
$$ ##$DC= 0
$$ ##$DFILT= <>
$$ ##$DTYPP= 0
$$ ##$ERETIC= no
$$ ##$F1P= 10
$$ ##$F2P= -1
$$ ##$FCOR= 0.5
$$ ##$FTSIZE= 32768
$$ ##$FT_mod= 6
$$ ##$GAMMA= 0
$$ ##$GB= 0
$$ ##$INTBC= 1
$$ ##$INTSCL= 1
$$ ##$ISEN= 128
$$ ##$LB= 0.3
$$ ##$LEV0= 0
$$ ##$LPBIN= 0
$$ ##$MAXI= 10000
$$ ##$MC2= 0
$$ ##$MEAN= 0
$$ ##$ME_mod= 0
$$ ##$MI= 0.4
$$ ##$MddCEXP= no
$$ ##$MddCT_SP= no
$$ ##$MddF180= no
$$ ##$MddLAMBDA= 0
$$ ##$MddMEMORY= 0
$$ ##$MddMERGE= 0
$$ ##$MddNCOMP= 0
$$ ##$MddNITER= 0
$$ ##$MddNOISE= 0
$$ ##$MddPHASE= 0
$$ ##$MddSEED= 0
$$ ##$MddSRSIZE= 0
$$ ##$Mdd_CsALG= 0
$$ ##$Mdd_CsLAMBDA= 0
$$ ##$Mdd_CsNITER= 0
$$ ##$Mdd_CsNORM= 0
$$ ##$Mdd_CsZF= 0
$$ ##$Mdd_mod= 0
$$ ##$NCOEF= 0
$$ ##$NC_proc= -5
$$ ##$NLEV= 6
$$ ##$NOISF1= 0
$$ ##$NOISF2= 0
$$ ##$NSP= 0
$$ ##$NTH_PI= 0
$$ ##$NZP= 0
$$ ##$OFFSET= 16.01477
$$ ##$PC= 1
$$ ##$PHC0= -59.51571
$$ ##$PHC1= -21.63688
$$ ##$PH_mod= 1
$$ ##$PKNL= yes
$$ ##$PPARMOD= 0
$$ ##$PPDIAG= 0
$$ ##$PPIPTYP= 0
$$ ##$PPMPNUM= 2147483647
$$ ##$PPRESOL= 1
$$ ##$PSCAL= 4
$$ ##$PSIGN= 0
$$ ##$PYNMP= <proc.py>
$$ ##$REVERSE= no
$$ ##$SF= 400.05
$$ ##$SI= 32768
$$ ##$SIGF1= 0
$$ ##$SIGF2= 0
$$ ##$SINO= 0
$$ ##$SIOLD= 32768
$$ ##$SPECTYP= <>
$$ ##$SREGLST= <1H.CDCl3>
$$ ##$SSB= 0
$$ ##$STSI= 32768
$$ ##$STSR= 0
$$ ##$SW_p= 8012.8205128205
$$ ##$SYMM= 0
$$ ##$S_DEV= 0
$$ ##$TDeff= 32768
$$ ##$TDoff= 0
$$ ##$TI= <1H
$$ 
$$ >
$$ ##$TILT= no
$$ ##$TM1= 0
$$ ##$TM2= 0
$$ ##$TOPLEV= 0
$$ ##$USERP1= <>
$$ ##$USERP2= <>
$$ ##$USERP3= <>
$$ ##$USERP4= <>
$$ ##$USERP5= <>
$$ ##$WDW= 1
$$ ##$XDIM= 0
$$ ##$YMAX_p= 437894742
$$ ##$YMIN_p= -17788
$$ ##END=
$$ 
##$PARAMETER FILE=	(title, ASCII, //icnas3.cc.ic.ac.uk/ar419/pdata/1/title, 0)
$$ AR-1; A. R.
$$ 
##$DECIM=	
##$DSPFVS=	
##XUNITS=	HZ
##YUNITS=	ARBITRARY UNITS
##FIRSTX=	6414.5896662844643288
##LASTX=	-1598.2308465360358696
##DELTAX=	-0.24453933874997710318
##XFACTOR=	1
##YFACTOR=	1.4112349075778010121
##FIRSTY=	7397.7724609375
##MINY=	-3383.51220703125
##MAXY=	13681696
##NPOINTS=	32768
##XYDATA=	(X++(Y..Y))
$$ [...]
2665B845Q05N00K71K49N7k04PK84q5j64l76o25r21r41q27n25n96j98k18j88j43N0m8j3j07
2658a111P5k3m2n2k9j46J29q6J75M2m1j80N4o7J17o8P1q1J42o4oM4L5j06p8m2m7n7K39lQ6
2651a120j37Q9N2M5k03N6jJ67j07jj18N6q3J4p3J18k3M7m5K19J7N1j84P7n2jj9j2q6J18o9
2643a208J02J9M4P2J31p7J29j36N8k0Q1RK61m2M8P8R7K6K5l0M2L8Q8K9J36J61L22K79K42K83
2636A287M82M74P90J006J763K907M709O162P004Q150O387K983J633Q68j111k067J104M83k076
2631D2938k949m014o967q264o456n204l856k076j062p25n60l05l92k50q3q1j22p4j72r9J3
2626g60L5o5Oj6J13j7Jo2J1P1J28o2m6p6j71q7K4j25N0j18q7J03N0L0O2j61K7m3o6l6l1n9
2618a377p4Q1M2k9M8Q5j2N3k4nj28NJ2O6P1o8r0m0PO9P9J55J52L4J8K81J95j0l6J16K8r6k39
$$ plain form
2665 2845 3650 4150 4421 4670 4727 4523 4530 4814 4729 4565 4189 3564 2643 1702 875 350 -246 -444 -662 -850 -993 -943 -991 -1004 -1111
2658 -1111 -1036 -1059 -1101 -1153 -1182 -1328 -1199 -1285 -1110 -1068 -1109 -1289 -1235 -1302 -1185 -1253 -1182 -1263 -1121 -1185 -1191 -1147 -1112 -1218 -1296 -1338 -1385 -1442 -1203 -1206 -1120
2651 -1120 -1257 -1168 -1116 -1071 -1274 -1218 -1219 -1052 -1159 -1160 -1278 -1222 -1305 -1291 -1364 -1246 -1269 -1222 -1267 -1048 -1031 -980 -1164 -1087 -1139 -1140 -1159 -1171 -1257 -1139 -1208
2643 -1208 -1106 -1087 -1043 -971 -840 -917 -788 -924 -866 -886 -805 -796 -535 -577 -529 -451 -354 -328 -303 -333 -291 -253 -165 -136 0 161 483 762 1004 1287
2636 1287 1769 2243 3033 4039 5802 8709 13418 19580 26584 34734 41121 44104 45737 46605 45494 43427 44531 45014 42938
2631 42938 39989 35975 29008 20744 14288 9084 5228 3152 2090 1365 805 500 108 -142 -225 -306 -428 -502 -674 -773 -760
2626 -760 -725 -790 -784 -800 -687 -704 -703 -765 -754 -683 -555 -617 -663 -739 -910 -997 -973 -1098 -1048 -1166 -1253 -1150 -1100 -1070 -1008 -1169 -1142 -1185 -1251 -1287 -1318 -1377
2618 -1377 -1451 -1370 -1328 -1357 -1309 -1224 -1236 -1183 -1207 -1212 -1340 -1335 -1323 -1257 -1186 -1254 -1344 -1384 -1377 -1308 -1229 -1074 -922 -888 -870 -589 -394 -404 -440 -324 -296 -392 -631
2610f31j35j06p1j01j50k02J0n0O8%L2Nq6j33J50M8N8p1N2L2O7j82jo1mm5L0O3j8j0J83P3
2602a186J03J14J64L5K29R3J55N1L5j24Rk4jl6o7j95j03j14J48j53R6J49J43J31K8o8J82k11
2596d17m2j39j23k10j27k35L9m8M1j21N9q1K2j98q6J59O3r3M7k8N7j35J8q6J0J05L8J6J09
2589a386j49J6N3K03m3K00J53J84J16K09O1J64j8J32r2n8j58j42k55K4k36j86j45l4k18Q4
2582a521J09L4j73JK5K72j28k4K2l5k2Q1j29lj98R0M7Q3m9J10o7K5k8J9j21L7Q6n6K0o5o8
2575a626K65p7M4N2J23n5O6Q0J77J5r3P2J17K07J81o0P6J06J96K0o2R3J24L4j18k62p2j6r6
2567d89l05j15j3j60k69P7k5M4R1n8j7K1n8J40J3jm5O2jJ3J07j8J50J79M8L2l4R2J17J55L9
2560b28l4J78K77K16oR8O0J60O0j3j35k60OP4j35O8M0j7r5J69P4O6l9R0m0lk56j58j61j01
$$ plain form
2610 -631 -766 -872 -943 -1044 -1194 -1396 -1386 -1436 -1368 -1368 -1336 -1331 -1417 -1550 -1400 -1352 -1294 -1365 -1313 -1281 -1214 -1396 -1397 -1458 -1462 -1507 -1477 -1414 -1432 -1442 -1259 -1186
2602 -1186 -1083 -969 -805 -770 -541 -448 -293 -242 -207 -331 -322 -346 -347 -383 -450 -645 -748 -862 -714 -867 -771 -622 -479 -348 -320 -388 -206 -417
2596 -417 -459 -598 -721 -931 -1058 -1293 -1254 -1302 -1261 -1382 -1323 -1404 -1382 -1580 -1666 -1507 -1444 -1537 -1490 -1518 -1461 -1596 -1578 -1664 -1654 -1549 -1511 -1495 -1386
2589 -1386 -1535 -1519 -1466 -1263 -1306 -1106 -953 -769 -653 -444 -383 -219 -237 -105 -197 -255 -413 -555 -810 -786 -1022 -1208 -1353 -1387 -1605 -1521
2582 -1521 -1412 -1378 -1551 -1550 -1525 -1253 -1381 -1405 -1383 -1418 -1440 -1359 -1488 -1491 -1689 -1599 -1552 -1469 -1518 -1408 -1475 -1450 -1478 -1459 -1580 -1543 -1457 -1513 -1493 -1558 -1626
2575 -1626 -1361 -1438 -1394 -1342 -1219 -1274 -1208 -1128 -951 -936 -1029 -957 -840 -633 -452 -512 -436 -330 -134 -114 -176 -83 41 75 -43 -305 -377 -393 -489
2567 -489 -794 -909 -922 -1082 -1351 -1274 -1299 -1255 -1164 -1222 -1239 -1218 -1276 -1136 -1123 -1124 -1169 -1107 -1108 -1095 -988 -1006 -856 -677 -629 -597 -631 -539 -422 -267 -228
2560 -228 -262 -84 193 409 403 501 561 721 781 768 633 373 379 453 318 386 426 409 314 483 557 623 584 674 634 631 375 217 56 -45
2553d5k30j32k66j10j79o7O2p3j95K7j20Lj4K5L6M5j55J11J34K22j39j22J50L68J39K02j30
2546d53p6J79K62K8L8j12K27J68J99J7l6p%j76k17j41Pj86j76k00j98j43j34n9k6k09m2MR4
2539a368j90N8l3L6o5L8m9J39K4p9k7J19p2M3Q7qj55N1j45J41QPj03K3K5J0j90J85O1r1L0
2531a490L5q6L7m5O5m7J15j81N9l4L1p4O6n5P7j0j35q8J34l2P0R7J25k85j6p6P2N3o9m0K8
2524a699J3L8KQ8j71M0m7l1L6m5j01J30J9J40q0L0k8L1q5M2Qk1K0J13j02r3l7J21LL2K6j28
2516a736M3L5n0J4P9J6j0O0J0Pr7J07k8Lp4M0k2m6P7M4j9J13n5j1k6M4N1p9p4P4q4o4k7Q8
2508a597l4rL4n8O2O5q1l8N8J08r4P2K8j27P9n2r2KJ89oo7N3R2j2Mm4p3P0l0q0N5j54N9j37
2499a755r5J36L1L0J06P2L8J7p2j31J54P4O6k4j00k40P5J39k8l3N8QK1r3l9j7NJ70P6q1O4
$$ plain form
2553 -45 -275 -407 -673 -783 -962 -1029 -967 -1040 -1235 -1208 -1328 -1325 -1339 -1314 -1278 -1233 -1388 -1277 -1143 -921 -1060 -1182 -1032 -664 -525 -323 -453
2546 -453 -529 -350 -88 -60 -22 -134 93 261 460 477 441 434 434 258 41 -100 -93 -279 -455 -655 -853 -996 -1130 -1189 -1215 -1424 -1466 -1462 -1368
2539 -1368 -1558 -1500 -1533 -1497 -1562 -1524 -1573 -1434 -1410 -1489 -1516 -1397 -1469 -1426 -1339 -1347 -1502 -1451 -1596 -1455 -1447 -1440 -1543 -1520 -1495 -1485 -1675 -1490 -1429 -1520 -1490
2531 -1490 -1455 -1541 -1504 -1549 -1484 -1531 -1416 -1597 -1538 -1572 -1541 -1615 -1549 -1604 -1527 -1537 -1672 -1760 -1626 -1658 -1588 -1491 -1366 -1651 -1667 -1743 -1671 -1618 -1687 -1727 -1699
2524 -1699 -1686 -1648 -1646 -1558 -1729 -1689 -1736 -1767 -1731 -1776 -1877 -1747 -1728 -1588 -1668 -1638 -1666 -1635 -1720 -1678 -1670 -1691 -1671 -1558 -1660 -1753 -1790 -1669 -1666 -1634 -1608 -1736
2516 -1736 -1693 -1658 -1708 -1694 -1615 -1599 -1609 -1549 -1539 -1532 -1629 -1522 -1550 -1547 -1621 -1581 -1603 -1649 -1572 -1528 -1547 -1434 -1489 -1500 -1526 -1482 -1431 -1510 -1584 -1510 -1594 -1658 -1685 -1597
2508 -1597 -1631 -1640 -1606 -1664 -1602 -1537 -1618 -1656 -1598 -1490 -1584 -1512 -1484 -1611 -1532 -1584 -1676 -1674 -1485 -1491 -1558 -1505 -1413 -1425 -1421 -1465 -1538 -1468 -1498 -1578 -1523 -1677 -1618 -1755
2499 -1755 -1850 -1714 -1683 -1653 -1547 -1475 -1437 -1420 -1492 -1623 -1469 -1395 -1329 -1353 -1453 -1693 -1618 -1479 -1507 -1540 -1482 -1474 -1453 -1546 -1585 -1602 -1597 -1427 -1351 -1432 -1368
2492a368j14j58%O9q1O1l4P4k06n7J36J21j12J09k4l8K8J7L6J78j13q0j16N7NK0m3Np7P0q0
2484a715J29j9M2r4nQ9M5j05J6n4J19J5rj2N9n7m8o8J31M6J03j54l6N8J56j20q4j19J1j8L7
2477a661J5J06j01J07n3N7r5o5R2M9j45R0JQ4j70M5J5K7p1p7lK6l1N4K0O0K0l8k8Q3q2mpJ41
2468a539M2J00j22qM9m3NR0q0P9k15k3J6K8jJ94rJj15J02j30JMnm8Q6LR5k6P1j31m6o1KM2
2460a592Ko8J38k3n4q6N1N7J8P8Q5J4r8r7J32J2r6l4P6j35l0N9P2j43J01l5J58j35mJ8m5p5
2452a679J8m7l6O4rj01R5M4m5o0J16j2R0k4p6K1m2oj6r7Q9J23J2nj62J0jR2m9N1Q8R9lO0k8
2443a426j8K1r2K1J4mn6j9J73jn0p2RQm5k7J04o5N5n8j8J0M1K1j7p0J23o7M3j46J16P8p4j01
2435a589J30J8J09K3O6j32k3N4P4l8KL9P1m0Q2r3J7K5Mn4L7K8J9K4P2r3k7j52l3j25O9N4L6
$$ plain form
2492 -1368 -1482 -1640 -1640 -1571 -1652 -1591 -1625 -1551 -1757 -1814 -1678 -1557 -1669 -1560 -1584 -1622 -1594 -1577 -1541 -1363 -1476 -1556 -1672 -1615 -1610 -1590 -1633 -1628 -1705 -1635 -1715
2484 -1715 -1586 -1605 -1563 -1657 -1662 -1573 -1528 -1633 -1617 -1671 -1552 -1537 -1546 -1558 -1499 -1556 -1604 -1672 -1541 -1495 -1392 -1546 -1582 -1524 -1368 -1488 -1572 -1691 -1680 -1698 -1661
2477 -1661 -1646 -1540 -1641 -1534 -1587 -1530 -1625 -1690 -1598 -1549 -1694 -1604 -1603 -1519 -1689 -1644 -1629 -1602 -1673 -1750 -1753 -1727 -1758 -1704 -1684 -1624 -1604 -1642 -1670 -1587 -1669 -1673 -1680 -1539
2468 -1539 -1497 -1397 -1519 -1527 -1478 -1521 -1516 -1426 -1506 -1427 -1642 -1665 -1649 -1621 -1622 -1428 -1437 -1436 -1551 -1449 -1579 -1578 -1574 -1579 -1627 -1541 -1538 -1443 -1469 -1398 -1529 -1575 -1636 -1634 -1592
2460 -1592 -1590 -1658 -1520 -1543 -1597 -1683 -1632 -1575 -1557 -1479 -1394 -1380 -1478 -1575 -1443 -1431 -1527 -1561 -1485 -1620 -1650 -1591 -1519 -1662 -1561 -1596 -1438 -1573 -1577 -1559 -1604 -1679
2452 -1679 -1661 -1708 -1744 -1680 -1689 -1790 -1695 -1651 -1696 -1756 -1640 -1652 -1562 -1586 -1662 -1641 -1683 -1689 -1705 -1802 -1713 -1590 -1578 -1583 -1745 -1735 -1736 -1644 -1693 -1642 -1554 -1455 -1458 -1398 -1426
2443 -1426 -1444 -1423 -1515 -1494 -1480 -1484 -1540 -1559 -1386 -1387 -1437 -1509 -1500 -1492 -1537 -1564 -1460 -1525 -1470 -1528 -1546 -1536 -1495 -1474 -1491 -1561 -1438 -1505 -1462 -1608 -1492 -1414 -1488 -1589
2435 -1589 -1459 -1441 -1332 -1309 -1243 -1375 -1398 -1344 -1270 -1308 -1306 -1267 -1196 -1236 -1154 -1247 -1230 -1205 -1201 -1255 -1218 -1190 -1171 -1147 -1075 -1168 -1195 -1347 -1380 -1505 -1436 -1382 -1346
2427a346m0m5l8J11P0R3k2K68J83K33Q1J75p3J48J66L07K13P4j77J16n9J39l9o7k36q4k35
2420h4j72k70q4j23lj11P8K8K9j17J88qn3N8N0mL6PL2m4M9j06q2N2L04jK53J99K75J16K72
2413G64K54L34K53N04Q2M3j13k30k51k22j11j55k98j87k93j53k33M0l6l6p6l6L7M9Q3L7o0
2406a0Q1Oo9J3K22P1q4j17j22n9j19k1J74q3Q2J95J40N7J47J04M9K9%j14J4j91r7n4j3j53
2399G8N8Qq5P0j34k11j66k05ol6j13L2k3q2L5J16J35M6k2j61j09l0J10P4L0J0N1Q5J77R4Q4
2391i0n9r4j70j93j5o0n3k22K0K4j75j11k0R6L0Jj10j8J18n2j98q3K7k1j27m0n8j6l4o5O6
2384a702N9J02kr7P7K17j04m5J33J1O0J53J08o8m3lp4k29Q5N0j00J7j48r8j29j5q2J03nj09
2376a878q7J41n5rk3J9q1rM9pO0P6QN6J1n9m4J20j71R8n0J54q8J1pP4j45L7mK0j26J56J5k0
$$ plain form
2427 -1346 -1386 -1431 -1469 -1358 -1288 -1195 -1217 -949 -766 -533 -452 -277 -350 -202 -36 271 484 558 381 497 438 577 538 471 235 151 -84
2420 -84 -256 -526 -610 -733 -736 -847 -769 -741 -712 -829 -641 -649 -702 -644 -594 -598 -562 -555 -523 -567 -518 -624 -706 -654 -350 -351 -98 101 376 492 764
2413 764 1018 1352 1605 2109 2191 2234 2121 1891 1640 1418 1307 1152 854 667 374 221 -12 28 -8 -44 -120 -156 -119 -70 13 50 -10
2406 -10 71 77 8 21 243 314 230 113 -9 -68 -187 -208 -34 -117 -35 160 300 357 504 608 657 686 686 572 586 395 298 244 231 78
2399 78 136 144 59 129 -5 -216 -382 -587 -593 -629 -742 -710 -733 -815 -780 -664 -529 -483 -505 -666 -775 -805 -695 -621 -591 -581 -530 -445 -268 -174 -90
2391 -90 -149 -243 -413 -606 -621 -681 -734 -956 -936 -912 -1087 -1198 -1218 -1122 -1092 -1091 -1201 -1219 -1101 -1153 -1351 -1434 -1407 -1428 -1555 -1595 -1653 -1669 -1703 -1768 -1702
2384 -1702 -1643 -1541 -1543 -1640 -1563 -1346 -1450 -1495 -1362 -1351 -1291 -1138 -1030 -1098 -1141 -1144 -1218 -1447 -1362 -1312 -1412 -1395 -1543 -1641 -1770 -1785 -1867 -1764 -1769 -1878
2376 -1878 -1965 -1824 -1879 -1888 -1911 -1892 -1973 -1982 -1933 -1940 -1880 -1804 -1796 -1740 -1729 -1788 -1832 -1712 -1883 -1785 -1835 -1681 -1769 -1758 -1765 -1691 -1836 -1799 -1803 -1783 -1909 -1753 -1738 -1758
2368a758K1kr7J14k7l9K9L3J2m4q0M8k1O1p4R9O7O3p4Q3L4j42o6P6p2Pj05P2L5K64j53k6o1
2360a723Q3J4o0j86N9qQ0r7Km6N0J03k4j31J8p6J60r3n7k1J54NO1q6Mn2J55j17ln7Q3j22O0
2352a868m8J05k6j1j12O2J04L8ko0m5j8rKj09J30k0L3R7R2k06K6P2m9MJ04q4M6p0J05K9K1
2344a667j98l2J3o0l5J00J3M6Q8J16j15J7p6K7lL3r5m3j2J8MJ10o2mL5J10jr3j66m8J04Q3
2336a793j12Jk3l4P8M2M0J3k1j5j12J28k5PL1%N1j20NJ66l4RPK7r9j9q7M0J30r6jjJ5o0Jo
2327a867NM7j11m1P1J23J3K6Kl8j1r2P1m2J03J9pj52o1P7P1o4k0L8L0j54J39J06O9Mk2p2P7
2319a663qPn3Oj09L4P7R9o1N0o4Pj1J50M8n5l2N7Q7L00O9J06J66J34l3j65k02O8q8m9j81J20
2311a189j06r8r6J85Q7J27n0j8m8N6p6j5J3K00K23L75K10J47J82K82l9n0k27j69k04j02k82
$$ plain form
2368 -1758 -1737 -1739 -1836 -1722 -1749 -1788 -1759 -1726 -1714 -1758 -1838 -1790 -1811 -1750 -1824 -1725 -1658 -1595 -1669 -1586 -1552 -1694 -1760 -1684 -1756 -1749 -1854 -1782 -1747 -1483 -1636 -1662 -1723
2360 -1723 -1640 -1626 -1686 -1872 -1813 -1821 -1741 -1838 -1836 -1882 -1832 -1729 -1753 -1884 -1866 -1942 -1782 -1875 -1932 -1953 -1799 -1794 -1733 -1819 -1815 -1867 -1712 -1829 -1832 -1889 -1806 -1928 -1868
2352 -1868 -1916 -1811 -1837 -1848 -1960 -1898 -1794 -1756 -1758 -1818 -1863 -1881 -1890 -1888 -1997 -1867 -1887 -1854 -1757 -1665 -1871 -1845 -1773 -1822 -1818 -1714 -1798 -1752 -1822 -1717 -1688 -1667
2344 -1667 -1865 -1897 -1884 -1944 -1979 -1879 -1866 -1820 -1732 -1616 -1731 -1714 -1790 -1763 -1766 -1733 -1828 -1871 -1883 -1865 -1861 -1751 -1813 -1817 -1782 -1672 -1673 -1766 -1932 -1980 -1876 -1793
2336 -1793 -1905 -1904 -1927 -1961 -1883 -1841 -1801 -1788 -1809 -1824 -1936 -1808 -1833 -1826 -1795 -1795 -1744 -1864 -1859 -1693 -1727 -1718 -1711 -1684 -1783 -1802 -1889 -1849 -1719 -1815 -1816 -1817 -1802 -1862 -1861 -1867
2327 -1867 -1862 -1815 -1926 -1967 -1896 -1773 -1760 -1734 -1732 -1770 -1781 -1873 -1802 -1844 -1741 -1722 -1729 -1881 -1942 -1865 -1794 -1858 -1878 -1840 -1810 -1964 -1825 -1719 -1650 -1646 -1668 -1740 -1663
2319 -1663 -1671 -1664 -1717 -1711 -1820 -1786 -1709 -1610 -1671 -1621 -1685 -1678 -1689 -1539 -1491 -1546 -1578 -1521 -1434 -1134 -1065 -959 -793 -659 -692 -857 -1059 -991 -1079 -1128 -1309 -1189
2311 -1189 -1295 -1393 -1489 -1304 -1217 -1090 -1140 -1158 -1206 -1150 -1226 -1241 -1228 -1028 -805 -430 -220 -73 109 391 352 302 75 -94 -298 -400 -682
2305f82j55N3J20k46Q7l6J72l0K3QN0j53Q7MO4L3M00jK41J99K81J64K66P8R5j50n4j86k39
2298D93l45j83m39opl3o2J0j65J77mR0PK2m2jn1J04K9J17K43K44Q4L36J51K6j53j27k97j31
2290H7l06j54j62J8k17q4rl4P2O6J12N6j90M9o9M6n6J23J39%N8K94K12J72J19k2j14Q8lk65
2283B6k68j95k18j31j17l4P0J8j16o4n6J28m1O8O1o6J03K4N0l8n9J73p4Pj0mm3r2O0J2p3R4
2275h05P3J36K68R3k06n3p0J06K83L62R8k84m30j92jO9J95j3j13j94j66n0k7l2J35J72J03
2269e43J80%J21M03M72L83M2j48j05J12N54Q85O29n19q64m67k4M53O38L43m04m88m74j14K75
2263A340N39K95P9k71m17l61J1K22M56K63J0l65k33LM35N50P37L44m38o03k0M96R68J139M14
2256E593o37p87m20L53P95J035K78m61r21p62n13K49K00O1m50o03n69p8O0M86L75M65n2l90
$$ plain form
2305 -682 -837 -784 -664 -910 -823 -859 -687 -717 -694 -686 -636 -789 -702 -698 -634 -601 -201 -202 39 238 519 683 949 1027 1122 972 918 732 493
2298 493 148 -35 -474 -480 -487 -520 -582 -572 -737 -560 -564 -474 -467 -445 -487 -488 -539 -435 -406 -289 -46 198 282 618 769 795 642 515 218 87
2290 87 -219 -373 -535 -517 -734 -818 -827 -861 -789 -723 -611 -555 -745 -696 -765 -719 -775 -652 -513 -513 -455 -161 51 223 342 320 206 294 291 26
2283 26 -242 -437 -655 -786 -903 -937 -867 -849 -965 -1029 -1085 -957 -998 -930 -869 -935 -832 -808 -758 -796 -855 -682 -756 -749 -759 -763 -806 -898 -838 -826 -899 -805
2275 -805 -732 -596 -328 -235 -441 -494 -564 -458 -175 187 285 1 -429 -621 -622 -553 -358 -371 -484 -678 -844 -894 -921 -953 -818 -646 -543
2269 -543 -363 -363 -242 161 633 1016 1058 910 805 917 1471 2356 2985 2466 1602 1135 1111 1564 2202 2545 2141 1653 1179 1065 1340
2263 1340 1879 2174 2253 1982 1565 1204 1215 1437 1893 2156 2166 1801 1568 1571 2006 2556 3293 3637 3199 2596 2576 3072 4040 5179 5593
2256 5593 4956 4169 3749 4102 4897 5932 6210 5749 4828 4066 3553 3802 4002 4063 3613 3010 2441 2363 2423 2909 3284 3749 3697 3307
2251C307l79K78O68J049N94k02p43m06n5P14P12O37l37p61p74pL77P45L37m32j034m93l65
2245C430O3J31M71L05K41m64p17o28o4K58M36j5l26n43j55k6N74L71J73l61m05pO49P76Q11
2239D978K3o09o62N5J50K63j40k32n3K41k84l72n94j84j91J36p8j34l90j71j60K25K70M96
2233B583J32l6j25J87L48M82P8j67m71k33k68n2k79j98k16N7j64j58n7J24M7J86O3K40j98
2227A905jQ9K97L59N50k4l87n22j19oK54rJk67j15k55L3J67K87J39j26k85L0K5K03J03Q8k5
2220B389k8N8K8J3L50K45K53mQ1J41L28Q7j36o0L89N82L62l65n74q5K32J61j27j99j61J7K49
2213D226k5j53J26j5R3J23J56K62K86R0P9R8J78L94L12m9q4L7K08J13J10J46L07J08J14N4
2207G294L00K77N23M04L66J94L64K86N71M74O70J40L72K53O43P96J081R18J199J164J930K401
$$ plain form
2251 3307 2928 3206 3874 4923 5517 5315 4572 4166 4111 4825 5537 6174 5837 5076 4302 4295 4672 5417 5754 5322 4288 3795 3430
2245 3430 3493 3624 4095 4400 4641 4177 3460 2832 2768 3026 3462 3447 3121 2578 2423 2397 2971 3342 3515 3154 2749 2742 3391 4167 4978
2239 4978 5001 4392 3730 3785 3935 4198 4058 3826 3773 4014 3730 3358 2764 2580 2389 2525 2447 2313 1923 1752 1592 1817 2087 2583
2233 2583 2715 2679 2554 2741 3089 3571 3649 3482 3011 2778 2510 2458 2179 1981 1765 1822 1658 1500 1443 1567 1614 1800 1863 2103 1905
2227 1905 1904 1993 2290 2649 3199 3175 2788 2266 2147 2141 2395 2386 2387 2120 2005 1750 1783 1950 2237 2376 2250 1965 1995 2020 2223 2326 2414 2389
2220 2389 2361 2419 2447 2460 2810 3055 3308 3304 3385 3526 3854 3941 3805 3745 4134 4716 5078 4713 4139 4054 4286 4447 4320 4121 3960 3977 4226
2213 4226 4201 4048 4174 4159 4252 4375 4531 4793 5079 5169 5248 5346 5524 5918 6230 6181 6097 6134 6342 6455 6565 6711 7018 7126 7240 7294
2207 7294 7594 7871 8394 8798 9164 9358 9722 10008 10579 11053 11723 11863 12235 12488 13131 13927 15008 15926 17125 18289 20219 22620
2202B2620L452L948N642P965J3410J9850K5275K1510J0783P49R85J3912K7205J9168M891r005
2198A92360k7923k8561j8563j0132j573l536j0332j0374n744m057l32N464J1523J2344Q162
2194A08726L789J1194K6471M2769M7874L2766J5610J1674J0181K6249J3248J311J4990k0501
2191C46351n6043l4874O737L3440M0746L3517J8018p005j4287R229M8447P1163M3585m603
2187E34421m7024n8556l1076j5326j7531j4963j8575k5487l3664k7109p924J8569L9962L9616
2184C35333J8315K732n485J1159M8399R0290J03747O8089L1526M8420R1222J34166N3759K529
2180A034201k6751j50636j54149l7069Q3394J48694R0347n3953j28637q5348J1807Q8915J31824
2177I52639Q8885l4027p4737l2611L5894P5633L7067Q176K0764J3558n8866q1254K9485K09936
$$ plain form
2202 22620 26072 30020 35662 43627 57037 76887 102162 123672 134455 135204 136189 150101 177306 196474 201365 192360
2198 192360 164437 135876 117313 107181 105608 102072 91740 81366 75622 71565 71233 76697 88220 100564 108726
2194 108726 112515 123709 150180 192949 240823 273589 289199 300873 311054 337303 350551 351862 366852 346351
2191 346351 290308 255434 262171 295611 336357 369874 387892 380887 366600 375829 424276 495439 539024 534421
2187 534421 487397 428841 397765 382439 364908 349945 331370 305883 272219 245110 237186 255755 295717 335333
2184 335333 353648 356380 350895 362054 410453 500743 604490 672579 704105 752525 843747 977913 1031672 1034201
2180 1034201 1007450 856814 702665 665596 748990 897684 988031 934078 805441 720093 731900 820815 952639
2177 952639 1041524 1007497 932760 900149 936043 1011676 1048743 1056919 1077683 1091241 1032375 951121 980606 1190542
2174A190542L40043L77678Q9206l88618m16825j96430n1502K7160R8462R6703j2332o8574
2171A085513j35947r8928j9179J6226j851l2856p1285r4553k7357N1422J19912R7964r563
2168H79518j13847j62495j09049m3117o919J0082M547J2774M5377N2433n798l9713O116K5094
2164E55003l3531p9605o4324k4050K237j6367m6700m5727l3999j5568K811J6432J7859K4210
2161B58681L4177N0326M8560K3505L7553J5849j9751J646L4673N8794J8745q2742p7144j1352
2157C91520j494j0320k1803n5636n3382l7679k6980j4395l023J0618K2211J7051k794M48K2558
2154B36900K5771K49j6060m403N720o717j8317j3396M124K1430J0525k6458l7252k6209r779
2150A46128Q024J3777L896J173Q73j4392j2756J3827L4930M1060o350n0992l0719n426M391
$$ plain form
2174 1190542 1530585 1908263 1997469 1608851 1192026 995596 944094 971254 1069716 1166419 1154087 1085513
2171 1085513 949566 850638 831459 847685 845834 812978 741693 647140 619783 671205 791117 889081 879518
2168 879518 765671 603176 494127 451010 444091 454173 458720 471494 516871 569304 563506 523793 529909 555003
2164 555003 521472 441867 377543 353493 355730 339363 292663 246936 212937 197369 200180 216612 234471 258681
2161 258681 292858 343184 391744 415249 452802 468651 448900 450546 485219 544013 562758 480016 402872 391520
2157 391520 390026 379706 357903 302267 248885 211206 184226 169831 166808 177426 199637 216688 213894 214342 236900
2154 236900 262671 262920 246860 242457 248177 241460 223143 209747 213871 235301 245826 219368 182116 155907 146128
2150 146128 154152 167929 171825 172998 173871 159479 146723 160550 195480 236540 230190 179198 148479 143053 147444
2146A47444N284j7870l6497k4529j5121j2663j0110n714l274j428q21NO67K566M398P564J1347
2142E1248J2269M255m016j80J0029J8951J8885k985k3474j9584p649K510O257k798j5030j5381
2138C3307j0456o249l618k143j436q55q14r55p00m20o57n18m22k77k79j52l69q2j10j74o4
2133B557J4q1J27O4R2L7J65P2k3j93k01l19j81k77j43m0J81J2K1pJ91j8m8q8m4j39j18p6j68
2126A369j39Mk10q3j4n1k0K1M8M5n2P9j95p5k5J17J85L22M43L12K47K40K7K21Q0j4j74k85
2119B423n01m03j15N1j58j44j30k97l18j15j28K3O1k8M1J80J6K73N19N77L85K14Nr5J69O83
2113C188O13Q9n23q15o52j97QL12P3k66k64j54k15N1K15K95J81J01j5l5k1J60P8J0j29n0r3
2106A945K6J09J70K4k53l96k27J3K40M46L27R5M1k8K05J07M21L57K04p1o4J98J49k65k04k99
$$ plain form
2146 147444 152728 134858 98361 73832 58711 46048 35938 30224 26950 25522 24701 24706 25373 27939 32337 39901 51248
2142 51248 63517 67772 63756 63576 73605 92556 111441 108456 84982 65398 57749 60259 66516 63718 48688 33307
2138 33307 22851 16602 12984 10841 9405 8550 7736 6781 6081 5661 5004 4486 4064 3787 3508 3356 2987 2905 2795 2621 2557
2133 2557 2571 2490 2617 2681 2773 2810 2975 3047 3024 2831 2630 2311 2130 1853 1710 1670 1851 1863 1884 1877 2068 2050 2002 1914 1870 1731 1613 1537 1369
2126 1369 1230 1234 1024 941 927 876 856 877 925 970 918 997 802 727 702 819 1004 1326 1769 2081 2328 2568 2595 2816 2896 2882 2708 2423
2119 2423 1922 1519 1404 1455 1297 1153 1023 726 408 293 165 188 249 221 262 442 458 731 1250 1827 2212 2426 2431 2336 2505 3188
2113 3188 3801 3890 3367 2552 1900 1703 1711 2023 2096 1830 1566 1412 1197 1248 1463 1758 1939 2040 2025 1990 1969 2129 2207 2217 2088 2038 1945
2106 1945 1971 2080 2250 2274 2021 1625 1398 1411 1651 2097 2424 2519 2560 2532 2737 2844 3265 3622 3826 3755 3691 3889 4038 3773 3569 3270
2100C270l73l27Q5K18O1j69n54n44p4J51J54J55K38n0n9o1J20K81J91l7l0L3O8K26K09N6k59
2093B979l88j75j98O2N8l4n1p7j25JP7M51J58j64q7m9k24n1Q7J58J77O0m49n39k78l1J47J31
2086A626l2l53l87j12l3J12K2n1p8o1J62K32M86L56j70q7rq5j89o1K8L34N42J23n96p67m44
2080E08j31J65L77Q8l47m53j74n4J3K79J05j9q6MQ8R9N1n2m5J3r2k92j85n5K54L02M7l26k98
2073b16j15L7Q7K51K51j42l76j23j9K54L86K18j80m27l09j2M6P6n4k22l05k08p5k5J3Q5J62
2066i42k3l9L0j8kO1K66J99q2k62o6P0K07K39N9k36m48j35J6RQ2n3j98j96j6J25Pn4j26O3
2059a463J42O5Q5m5j69o7j6k4P6Q7k0n6J7J9r6l6J95L8J87q8j57Jq2J9j50o1L7q1l7n4J64
2051a570k1j19p6n3J13j3R9j32J3p8%l1l2J4J8R0L9J8jm8J4J3o7j4Q9r6j48K1J65o3L1O9J
$$ plain form
2100 3270 2897 2570 2655 2873 2934 2765 2211 1667 1593 1744 1898 2053 2291 2241 2182 2121 2241 2522 2713 2676 2646 2679 2747 2973 3182 3238 2979
2093 2979 2591 2416 2218 2280 2338 2304 2253 2176 2051 2052 2129 2580 2738 2574 2487 2438 2214 2163 2250 2408 2585 2645 2196 1657 1379 1348 1495 1626
2086 1626 1594 1241 854 742 709 821 843 792 714 653 815 1047 1533 1889 1719 1632 1623 1538 1349 1288 1316 1650 2192 2315 1719 952 508
2080 508 377 542 919 1007 660 207 33 -21 -8 271 376 357 271 275 363 462 513 461 416 429 337 45 -140 -195 59 361 408 82 -216
2073 -216 -331 -294 -207 44 295 153 -223 -346 -365 -111 275 493 313 -114 -423 -435 -389 -313 -367 -589 -894 -1102 -1177 -1202 -1189 -1104 -942
2066 -942 -965 -1004 -974 -992 -994 -933 -667 -468 -550 -812 -878 -808 -601 -362 -303 -539 -987 -1122 -1106 -1097 -1015 -1068 -1266 -1462 -1478 -1353 -1346 -1400 -1526 -1463
2059 -1463 -1321 -1256 -1171 -1216 -1385 -1452 -1468 -1492 -1416 -1329 -1349 -1405 -1388 -1369 -1465 -1501 -1306 -1268 -1081 -1169 -1326 -1325 -1407 -1388 -1538 -1599 -1562 -1643 -1680 -1734 -1570
2051 -1570 -1591 -1710 -1786 -1839 -1726 -1739 -1640 -1772 -1759 -1837 -1837 -1868 -1900 -1886 -1868 -1778 -1739 -1721 -1722 -1770 -1756 -1743 -1810 -1824 -1735 -1831 -1979 -1958 -1793 -1856 -1825 -1756 -1755
2043a755rO6k2r7q3R7R7M4N7Qj54K1j22O3J11n0k6N7k1MqN5Oj34m5J39Pj24k2J36Q3j2RJ37
2035a487Q5L5p0o7p2Rj05j12k1j0k3K6Q7L0n7J3l2j2m3L3O4m0o0N0J27J92J89j44l05j63l3
2027a916K7J21O6r0k9J6J07K1q2R3J1j21Pn1N8JL4k9J34L1J76K5j03j10jp8q5r5l4m2lmm6
2019a991LK36n2k4P0P3j5p0M3Q6%k6r5j5J03L3j58m8n9j5M5J40rl2m8l4o8l8J3O7N9M2m7j8
2011a849j3Q9o7l4M6J32N1j39j36J07pj6J2j3J8q0p2J18M8N6L7l8N5J4j72n1J86o8n1N4m7
2003a830o0R3L4K5N9J8p7J1J00J0J16j42q6M3N8j04r6J32rl8j7pK0oO3J8M1J04O4p7n4K8l
1995a569j00%%pJ27l6L5Q0j32L6Kp7j02J03N2J9J08l2N8L9j17K3q3L5P3K4j00Q6N4N7N7Pj
1987a281mp6K3J27n7k2jO9N5m0o0J25pM7J04Oj18K9J16P9J3j1q3J12J14J11J58R9JJ1m4P0
$$ plain form
2043 -1755 -1764 -1698 -1720 -1817 -1900 -1803 -1706 -1662 -1605 -1597 -1751 -1730 -1852 -1789 -1678 -1728 -1754 -1697 -1718 -1714 -1722 -1667 -1661 -1795 -1840 -1701 -1694 -1818 -1840 -1704 -1621 -1633 -1624 -1487
2035 -1487 -1402 -1367 -1437 -1504 -1576 -1567 -1672 -1784 -1805 -1815 -1838 -1812 -1725 -1695 -1752 -1739 -1771 -1783 -1826 -1793 -1729 -1769 -1829 -1779 -1652 -1460 -1271 -1415 -1720 -1883 -1916
2027 -1916 -1889 -1768 -1702 -1792 -1821 -1805 -1698 -1677 -1759 -1666 -1655 -1776 -1769 -1820 -1762 -1761 -1727 -1756 -1622 -1591 -1415 -1390 -1493 -1603 -1604 -1682 -1767 -1862 -1896 -1938 -1941 -1945 -1991
2019 -1991 -1988 -1752 -1804 -1828 -1758 -1685 -1700 -1770 -1727 -1641 -1641 -1667 -1762 -1777 -1674 -1641 -1799 -1847 -1906 -1921 -1876 -1736 -1745 -1777 -1825 -1859 -1927 -1965 -1952 -1885 -1826 -1784 -1831 -1849
2011 -1849 -1862 -1773 -1840 -1874 -1828 -1696 -1645 -1784 -1920 -1813 -1820 -1836 -1824 -1837 -1819 -1899 -1971 -1853 -1805 -1749 -1712 -1750 -1695 -1681 -1853 -1904 -1718 -1786 -1837 -1783 -1830
2003 -1830 -1890 -1797 -1763 -1738 -1679 -1661 -1738 -1727 -1627 -1617 -1501 -1643 -1729 -1686 -1628 -1732 -1828 -1696 -1705 -1743 -1760 -1767 -1747 -1753 -1690 -1672 -1631 -1527 -1463 -1540 -1594 -1566 -1569
1995 -1569 -1669 -1669 -1669 -1676 -1549 -1585 -1550 -1470 -1602 -1566 -1564 -1641 -1743 -1640 -1588 -1569 -1461 -1493 -1435 -1396 -1513 -1490 -1573 -1538 -1465 -1441 -1541 -1455 -1401 -1344 -1287 -1280 -1281
1987 -1281 -1285 -1361 -1338 -1211 -1268 -1290 -1291 -1222 -1167 -1207 -1267 -1142 -1149 -1102 -998 -992 -1110 -1081 -965 -886 -873 -884 -967 -855 -741 -630 -472 -373 -372 -361 -405 -335
1979c35K19J65J30J47K50K41K64M60L27M95P05Q08J029J225J417J933K812L826N325Q005J0971
1974D0419J3337J2044N267m007j1689j4543j2223q468n567l739k641j831j420r95q93q99n98
1970A554l75k97l07k46j77k41k12m2k53j11j53j28j4P0P1M4K3j7r7j52j35N1j79j53j54L9
1964a591J17m7lj5k5o1N3l7j49L4o2L7p3N6L1L3p5P7M3mp7l6o0o5J6J3O4%j54J18l6M3j17
1956a952Q0j8oM8J16Jj10M1O5j05O1o1R1n5RJ17o3j22J16m0o4j55o6l1O0J33N0o5R7n6l0o
1948a920p4p0J11o5j4J02N9j02o9J14P1j68J3l1jL7N6N4j12N8J27l9l0j35N3mJ1L2J7o8N9
1940a928NM3n1j17M9M9l6m8MJ1j8P9k4pj30j6Q3R5J6R1k9p3j9K8o5l7N4Kj55N3O9n1R3L6j2
1932a956o3K0M7%l4j9Q4m0j03P0l1K3m2m4pN3m9M9O0o2N7k3j9j5j67JR9N6N8r6j1l2O0JM3
$$ plain form
1979 -335 -116 49 179 326 576 817 1081 1541 1868 2363 3068 3876 4905 6130 7547 9480 12292 16118 21443 29448 40419
1974 40419 53756 65800 71067 67060 55371 40828 28605 20137 14570 10831 8190 6359 4939 3944 3051 2152 1554
1970 1554 1179 882 575 329 152 -89 -301 -343 -596 -707 -860 -988 -1002 -932 -861 -817 -794 -811 -908 -1060 -1195 -1144 -1323 -1476 -1630 -1591
1964 -1591 -1474 -1521 -1524 -1539 -1564 -1625 -1572 -1609 -1758 -1724 -1786 -1749 -1822 -1766 -1735 -1702 -1777 -1700 -1657 -1661 -1738 -1774 -1834 -1899 -1883 -1870 -1806 -1806 -1960 -1842 -1878 -1835 -1952
1956 -1952 -1872 -1890 -1896 -1848 -1732 -1731 -1841 -1800 -1735 -1840 -1779 -1840 -1749 -1804 -1795 -1678 -1741 -1863 -1747 -1787 -1851 -2006 -2072 -2103 -2043 -1910 -1860 -1925 -1828 -1884 -1914 -1920
1948 -1920 -1994 -2064 -1953 -2018 -2032 -1930 -1871 -1973 -2042 -1928 -1857 -2025 -2012 -2043 -2044 -2007 -1951 -1897 -2009 -1951 -1824 -1863 -1893 -2028 -1975 -1979 -1968 -1936 -1919 -1987 -1928
1940 -1928 -1923 -1880 -1931 -2048 -1999 -1950 -1986 -2034 -2030 -2019 -2037 -1958 -1982 -1989 -2119 -2135 -2052 -1957 -1941 -1850 -1879 -1952 -1971 -1943 -2008 -2045 -1991 -1989 -2144 -2091 -2022 -2073 -1980 -1944 -1956
1932 -1956 -2019 -1999 -1952 -1952 -1986 -2005 -1921 -1961 -2064 -1994 -2025 -2002 -2044 -2088 -2095 -2042 -2091 -2042 -1982 -2044 -1987 -2010 -2029 -2044 -2211 -2210 -2111 -2055 -1997 -2093 -2104 -2136 -2076 -2075 -2032
1923b032jp3P6l4N5J8M2R9p0p6l6p5O5j10p3N4R4m1Q1n1j7L3J29j6j30l2R9K9j6MN7L6o3o3
1915b038l3O3O4o0N6j03k1M4K3l1N7o1P9L7Oj47L4Q4l5K1j2j03K7r6K0p0R3K0JM6rn5J07M5
1907a947K5l2n3m8L3P9N9r0Q1r4o1j12kM4j3L5M0q1l1M4Q1%m9N6J30o4j08j10J59j17oN5l6
1898b133O4m4p7J52q3lP6L6j7P1j4j8o4J27N0j29j25j1K0J34j1j10o0jl1P3n5j6K6J19l0P2
1891b012j17J8nj1M3M4M0O6j80O7p1K7J0M8o7orN1P8k3j42K1R1j14o8J14J2N0J0q7n2m0J6
1883b198J16K4k0pJ67j03o7n2N9o7K0Q6K4L3J2n7m1j4p3j1Q8m1j50pJ42Q6jn2K0j4O7J48j51
1874b034j13R0m2J3O5kL6rpj2n5NK6n4k7k1L6Q2nL5J0k3j5q4LP9M1J15L3o9J10k6P4N3K7R
1866a656j9l6o1k0L7l1l7j02j07q6J19kn3k2L6Jll8n5OJ96J23L7o7l8m2M7N5J16Lj22J6p2
$$ plain form
1923 -2032 -2033 -2106 -2030 -2064 -2009 -1991 -1949 -1850 -1920 -1996 -2032 -2107 -2042 -2152 -2225 -2171 -2077 -2118 -2037 -2088 -2105 -2072 -1943 -1959 -2089 -2121 -2022 -1993 -2009 -2005 -1948 -1912 -1975 -2038
1915 -2038 -2071 -2008 -1944 -2004 -1948 -2051 -2072 -2028 -2005 -2036 -1979 -2040 -1961 -1924 -1918 -2065 -2031 -1947 -1982 -1961 -1973 -2076 -2049 -2145 -2125 -2195 -2102 -2082 -2081 -2035 -2044 -2099 -1992 -1947
1907 -1947 -1922 -1954 -2007 -2055 -2022 -1943 -1884 -1974 -1893 -1987 -2048 -2160 -2162 -2118 -2131 -2096 -2056 -2137 -2168 -2124 -2043 -2043 -2092 -2036 -1906 -1970 -2078 -2188 -2029 -2146 -2152 -2097 -2133
1898 -2133 -2069 -2113 -2190 -2038 -2121 -2124 -2048 -2012 -2029 -1958 -1972 -1990 -2054 -1927 -1877 -2006 -2131 -2142 -2122 -1988 -1999 -2109 -2169 -2170 -2201 -2128 -2183 -2199 -2173 -2054 -2084 -2012
1891 -2012 -2129 -2111 -2116 -2127 -2084 -2040 -2000 -1934 -2114 -2047 -2118 -2091 -2081 -2033 -2100 -2106 -2115 -2064 -1986 -2009 -2151 -2130 -2039 -2153 -2221 -2107 -2095 -2045 -2035 -2122 -2174 -2214 -2198
1883 -2198 -2082 -2058 -2078 -2085 -1918 -2021 -2088 -2140 -2081 -2148 -2128 -2042 -2018 -1985 -1973 -2030 -2071 -2085 -2158 -2169 -2081 -2122 -2272 -2279 -2137 -2051 -2052 -2104 -2084 -2098 -2031 -1883 -2034
1874 -2034 -2147 -2057 -2099 -2086 -2021 -2023 -1987 -1996 -2003 -2015 -2070 -2065 -2039 -2093 -2120 -2141 -2105 -2023 -2028 -1993 -1983 -2006 -2021 -2105 -2102 -2023 -1982 -1867 -1834 -1903 -1793 -1819 -1745 -1692 -1665 -1656
1866 -1656 -1675 -1711 -1772 -1792 -1755 -1786 -1823 -1925 -2032 -2118 -1999 -2001 -2054 -2076 -2040 -2039 -2042 -2080 -2135 -2129 -1933 -1810 -1773 -1840 -1878 -1920 -1873 -1818 -1702 -1699 -1821 -1805 -1877
1858a877j18L8m3k2mK7r2j03j6M0M7ML8J10n5j48m7k6M0J06K1K2q9N0j6R3q3JK2r9K4M7l3
1850b141L7nn7n7R9P0K9o7R5j48J10o8k3k0m1L2K4m0L2l2J17L8nq4m9k1PJ9n8r2J16P5k5q3
1841b216M9o1O4j1N3K2M0p5K5r1K5Q6J04j11R8m6n0P5J8ko3Q1q7m7Q6J2p1L2n3m5R5L5j36
1833b165l0J20j10Q6Rj1o9O1r1%N5R5Q6N1j62n8o9j6p9P6Q5Q2k7K2o1N8q5M8M3Q5j12n1J3
1825b121K2k0L5lL6j34J9j0Q0l4l5l7N8P9j7n4P6j0m6j27j2k9Q8P7k3N0Q3j55j0N7R5k8n8
1817b108k6M3k1m2K7P7p9N7K4j8q5M4Nk8%J3m2m3J3oM6kOj05OJ18n5J2K0J07or2P7N1j15r2
1808b219K7l8J48J27l3q2k4q6J26J10o3n8k9p4N7JO7r5k2K0P1l0On7J4j01J63L6o7k2N4n9
1800b132Qp8PMO4R3n0l9j17p9O8J05O4n3L6p4Po9o3q8J29O4N3N1K5j17o5M5O4l8k7J7j2K1
$$ plain form
1858 -1877 -1995 -1957 -2000 -2022 -2026 -1999 -2091 -2194 -2210 -2170 -2123 -2119 -2081 -1971 -2026 -2174 -2221 -2247 -2207 -2101 -2080 -2058 -2147 -2097 -2113 -2020 -2103 -2102 -2080 -2179 -2155 -2108 -2141
1850 -2141 -2104 -2109 -2166 -2223 -2124 -2054 -2025 -2092 -1997 -2145 -2035 -2103 -2126 -2146 -2187 -2155 -2131 -2171 -2139 -2171 -2054 -2016 -2021 -2105 -2154 -2175 -2168 -2149 -2207 -2299 -2183 -2108 -2133 -2216
1841 -2216 -2167 -2228 -2164 -2175 -2122 -2100 -2060 -2135 -2110 -2201 -2176 -2090 -1986 -2097 -1999 -2045 -2095 -2020 -2002 -2004 -2067 -1986 -2073 -2120 -2034 -2022 -2093 -2061 -2114 -2159 -2064 -2029 -2165
1833 -2165 -2195 -2075 -2185 -2099 -2090 -2101 -2170 -2109 -2200 -2200 -2145 -2050 -1964 -1913 -2075 -2133 -2202 -2218 -2297 -2221 -2136 -2054 -2081 -2059 -2120 -2062 -2147 -2099 -2056 -1971 -2083 -2134 -2121
1825 -2121 -2099 -2119 -2084 -2087 -2051 -2185 -2166 -2176 -2096 -2130 -2165 -2202 -2144 -2065 -2082 -2136 -2060 -2070 -2116 -2243 -2255 -2284 -2196 -2119 -2142 -2092 -2009 -2164 -2174 -2117 -2022 -2050 -2108
1817 -2108 -2134 -2091 -2112 -2154 -2127 -2050 -2129 -2072 -2048 -2066 -2151 -2107 -2102 -2130 -2130 -2117 -2159 -2202 -2189 -2195 -2149 -2151 -2145 -2250 -2244 -2126 -2181 -2169 -2149 -2042 -2048 -2140 -2063 -2012 -2127 -2219
1808 -2219 -2192 -2230 -2082 -1955 -1988 -2070 -2094 -2180 -2054 -1944 -2007 -2065 -2094 -2168 -2111 -2110 -2043 -2138 -2160 -2140 -2069 -2099 -2093 -2150 -2136 -2237 -2074 -2038 -2105 -2127 -2073 -2132
1800 -2132 -2124 -2202 -2195 -2191 -2127 -2034 -2084 -2123 -2240 -2319 -2251 -2146 -2082 -2135 -2099 -2173 -2166 -2235 -2298 -2386 -2257 -2193 -2140 -2089 -2064 -2181 -2246 -2201 -2137 -2175 -2202 -2185 -2197 -2176
1792b176l9K7J52qrK5J03r4j7l1rk30J3O7L6q6L8l9P1p7J61m7r6j6oJ52L8q4O2j01N3q3O1
1784b189n7LJ6K02l7p6n7L8L4Q6j6k8l5O9K8l3p6J12j01N7n7J4j36P3L6m7J6l4Kk5j4k4O5
1776b191Oj12N3QQ3k2q3L7Q7l8K8JR3j25m8%J07L7M0q1M4q3K9K3p1j9J18q2Lo4q1J24O2j23
1768b240N3k2O6j4r8L8J01j00P4J58l0k13M3j43R4Q7kn8M9k1M8K8j1N5m5p2R4lp2p7mp5J15
1760b197O1J06r6j67R5R6j00K3N4j6n8o7K7N3J50o8N0k4o9kn5K9P6m1L4j31J15jn5m7K7O4
1752b134L4j61J0J78o9L9K7j21M1K7J3l9P7q9J5N6p4l7M2N2O9j13M1O3M0m4r3J13r5m3J34
1744b041n0n2o1M3J23N0P3k2j68o1K2p6m3R1o1P0q2o9q3O3O2P8pJ07M4J2k3j02N1l1q1N6l1
1736b199Q2j1q9J8J9k5O4j50J11l3J07K7k3k8Om9m9l5P4qO9mM6j3R3n9j8j19j9p7K7M2J07
$$ plain form
1792 -2176 -2215 -2188 -2036 -2044 -2053 -2028 -1925 -2019 -2036 -2067 -2076 -2306 -2293 -2226 -2190 -2276 -2238 -2277 -2206 -2283 -2122 -2169 -2265 -2281 -2287 -2135 -2097 -2181 -2119 -2220 -2167 -2250 -2189
1784 -2189 -2246 -2243 -2227 -2025 -2062 -2138 -2195 -2157 -2123 -2037 -2053 -2081 -2116 -2047 -2019 -2052 -2128 -2016 -2117 -2060 -2117 -2103 -2239 -2166 -2130 -2177 -2161 -2195 -2193 -2218 -2232 -2256 -2191
1776 -2191 -2185 -2297 -2244 -2236 -2153 -2175 -2258 -2221 -2134 -2172 -2144 -2143 -2050 -2175 -2223 -2223 -2116 -2079 -2039 -2120 -2076 -2159 -2130 -2107 -2178 -2197 -2079 -2161 -2158 -2222 -2303 -2179 -2117 -2240
1768 -2240 -2187 -2209 -2143 -2157 -2255 -2217 -2116 -2216 -2142 -1984 -2014 -2227 -2184 -2327 -2233 -2146 -2148 -2206 -2157 -2178 -2130 -2102 -2113 -2058 -2103 -2175 -2081 -2084 -2156 -2233 -2237 -2312 -2197
1760 -2197 -2136 -2030 -2126 -2293 -2198 -2102 -2202 -2179 -2125 -2141 -2199 -2266 -2239 -2186 -2036 -2104 -2054 -2078 -2147 -2149 -2204 -2175 -2099 -2140 -2106 -2237 -2122 -2123 -2178 -2225 -2198 -2134
1752 -2134 -2100 -2261 -2251 -2073 -2142 -2103 -2076 -2197 -2156 -2129 -2116 -2155 -2078 -2167 -2152 -2096 -2170 -2207 -2165 -2113 -2044 -2157 -2116 -2053 -2013 -2057 -2150 -2037 -2132 -2175 -2041
1744 -2041 -2091 -2143 -2204 -2161 -2038 -1988 -1915 -1937 -2105 -2166 -2144 -2220 -2263 -2172 -2233 -2163 -2245 -2314 -2397 -2334 -2272 -2194 -2201 -2094 -2050 -2038 -2061 -2163 -2112 -2143 -2224 -2168 -2199
1736 -2199 -2117 -2128 -2217 -2199 -2180 -2205 -2141 -2291 -2180 -2213 -2106 -2079 -2102 -2130 -2124 -2173 -2222 -2257 -2183 -2191 -2122 -2126 -2080 -2093 -2000 -2059 -2077 -2196 -2215 -2292 -2265 -2223 -2116
1728b116p0l4n9J26J8m3l6J00n0P4p5P3r8k3LJ45L9j49j25R0M7n0o4Q1M7Rl9N9k8J5n1k0k8
1720b232J72L2n0j75m0M1Q3kN2P2j9o8O3K3J7q0j2J1r1LJ05r0PR9K9q8N6k7j03l2K5OK8m5
1712b230J02J2M8k5P9m5nM1l6o2M4O6O0j33m7P2p1J8J70j58K2N9K6J8Jpo4K1o5j31O1KK9l2
1703b160J4p4J85q4m0M1q1J36n4k8J21M3L4q7n8N0j7M5O2l3Q0m5q2M8m7rJ5M9O2j3Q1q7q4
1695b017N7M8j7n2j02J06o8L7K9q6P8j7J03n6P9P1j48k9Q4O6j29K5K7M6m4k1M3l4N2O0J63
1688a646m6j16K31J76O7M06O97J019M12p62p88j59K89N39j07q09n70k10j61l3q6n7k4M0m8
1682a746OR0Q1N4L4J01L33L01L80J132J988K747K102j774k885r02Q84J630K39k209k274j109
1676g97m32k62M7j98k2M1P8q8J04K5R3L5K00N5K54M80R91J891K724K403r43l228j370N22J714
$$ plain form
1728 -2116 -2186 -2220 -2279 -2153 -2135 -2178 -2214 -2114 -2164 -2090 -2165 -2092 -2190 -2213 -2210 -2065 -2026 -2175 -2300 -2210 -2163 -2213 -2277 -2196 -2149 -2140 -2179 -2120 -2148 -2133 -2184 -2204 -2232
1720 -2232 -2060 -2028 -2078 -2253 -2293 -2252 -2169 -2171 -2119 -2047 -2066 -2134 -2071 -2048 -2031 -2111 -2123 -2112 -2203 -2200 -2095 -2185 -2178 -2079 -2050 -2138 -2082 -2109 -2212 -2244 -2219 -2213 -2185 -2230
1712 -2230 -2128 -2116 -2068 -2093 -2014 -2059 -2064 -2023 -2059 -2121 -2077 -2011 -1951 -2084 -2131 -2059 -2130 -2112 -1942 -2100 -2078 -2019 -1993 -1975 -1974 -1981 -2045 -2024 -2089 -2220 -2159 -2157 -2128 -2160
1703 -2160 -2146 -2220 -2035 -2119 -2159 -2118 -2199 -2063 -2117 -2145 -2024 -1981 -1947 -2034 -2092 -2042 -2059 -2014 -1952 -1985 -1905 -1950 -2032 -1984 -2031 -2040 -2025 -1976 -1914 -1927 -1846 -1933 -2017
1695 -2017 -1960 -1912 -1929 -1981 -2083 -1977 -2045 -2008 -1979 -2065 -1987 -2004 -1901 -1957 -1878 -1807 -1955 -1984 -1900 -1834 -1963 -1938 -1911 -1865 -1909 -1930 -1887 -1921 -1869 -1809 -1646
1688 -1646 -1692 -1808 -1577 -1401 -1334 -928 -231 788 1200 438 -350 -509 -220 319 212 -597 -1167 -1377 -1538 -1571 -1657 -1714 -1738 -1698 -1746
1682 -1746 -1740 -1650 -1569 -1515 -1481 -1380 -1047 -746 -366 766 2754 5501 7603 5829 2944 2042 2926 4556 4795 2586 312 -797
1676 -797 -1229 -1491 -1444 -1642 -1664 -1623 -1545 -1633 -1529 -1504 -1411 -1376 -1176 -1121 -867 -387 604 2495 5219 7622 6679 3451 2081 2603 4317
1670D317Q08j792k466j298o02j90j71q3j55k2n9k7o5L9M4N0j3P8L5K47J95O07P28Q50j29q46
1664H0n04k0M58L79o01p96m60p9k03k2m8K2p3J9l0L3j47%l2o3K4J52J0R0m4j30j72L4J56P4
1656a893j42J0M7O0n8j24k3O8n7l6O4J83r3l3o0N0j09K2l0N4L2N5K6o4q1O9M5J2j08j05N1
1649b168R3rj4j1J2l7j6k0N3K8J01j9n9j03QQ2N5p2j8l3k5K9K6J09N7r1Pq0J2lQ0l3j01j23
1640b283J94J01o9l2oL6j49P2J09P6j13q4K5rO4m7j7o4q0K9l9q4O3J05q6k5L2P9l0N3j2k1
1633b212K4Mp5M3J3M7N1n0N1k5J0l3o5L1LR0o5k6Qp6L6L7n9N9q8J7K5R4m2KN9o9j43K9P7P9
1624b139k9j6p5J51l1j01o4J29P0P5RO9m0K2j13m2n6l7P9j6j59Q2L0J10j09N2J9k0m2K8MP1
1616b089L4J11n8L1q5Q8J5m7n9M1op8m6ml1J9j7Q6l7k1K2O8P1K0j64M8M1K0jN6m2lm4K2K2
$$ plain form
1670 4317 5125 3333 867 -431 -1033 -1223 -1394 -1477 -1632 -1654 -1713 -1740 -1805 -1766 -1722 -1672 -1685 -1607 -1572 -1325 -1130 -523 205 1055 926 80
1664 80 -424 -444 14 393 -208 -1004 -1464 -1543 -1746 -1768 -1816 -1794 -1867 -1848 -1878 -1845 -1992 -1992 -2024 -2087 -2063 -1911 -1901 -1811 -1855 -1985 -2157 -2123 -1967 -1893
1656 -1893 -2035 -2025 -1978 -1918 -1976 -2100 -2123 -2055 -2112 -2148 -2084 -1901 -1994 -2027 -2087 -2037 -2146 -2124 -2154 -2100 -2068 -2013 -1987 -2051 -2132 -2063 -2018 -2006 -2114 -2219 -2168
1649 -2168 -2075 -2084 -2098 -2109 -2097 -2134 -2150 -2170 -2117 -2089 -1988 -2007 -2066 -2169 -2161 -2079 -2024 -2096 -2114 -2147 -2172 -2143 -2117 -2008 -1951 -2042 -2035 -2115 -2103 -2106 -2026 -2059 -2160 -2283
1640 -2283 -2089 -1988 -2057 -2089 -2095 -2059 -2208 -2136 -2027 -1951 -2064 -2148 -2123 -2132 -2068 -2115 -2132 -2196 -2276 -2247 -2286 -2370 -2307 -2202 -2288 -2313 -2281 -2202 -2232 -2179 -2191 -2212
1633 -2212 -2188 -2184 -2259 -2216 -2203 -2156 -2105 -2155 -2104 -2129 -2119 -2152 -2217 -2186 -2183 -2093 -2158 -2184 -2176 -2252 -2216 -2179 -2238 -2179 -2267 -2250 -2225 -2131 -2173 -2171 -2112 -2181 -2324 -2295 -2218 -2139
1624 -2139 -2168 -2184 -2259 -2108 -2139 -2240 -2304 -2175 -2105 -2030 -2021 -1952 -1992 -1970 -2083 -2125 -2181 -2218 -2139 -2155 -2314 -2232 -2202 -2092 -2201 -2149 -2130 -2150 -2192 -2164 -2160 -2089
1616 -2089 -2055 -1944 -2002 -1971 -2056 -1968 -1953 -2000 -2059 -2018 -2024 -2102 -2148 -2152 -2183 -2164 -2181 -2095 -2132 -2153 -2131 -2063 -1992 -1972 -2136 -2088 -2047 -2027 -2028 -1972 -2014 -2017 -2061 -2039 -2017
1607b017Rj25P0m6J02O4K9j46J05q9J18L1k2q9N9l1p%j27%L4l1L4J1J13l4q2j33J52Ll4Ok4
1599b097j7l5N6R4rM7pO7j4j5J9L6o3M7m2lJ0n0j83K2p6M5L4R9p7M7J0L6j29R0Q6p6p4K2o2
1591b162N1p8O0J3M6NK00j34j31QrJ5j3n5j6JJ8p1M0l2m4l9P1N2O5M2n6m0N0n0p5M3M1q4L7
1582b231Q7M8M5j19R6Q9j71q1O1P4k9N6nm5Jl1pj8K6m6L1j0m2m2k0%j0J53O5O7j06p3j8r0
1574b295P9jN8J09O6j00j28r2Rp4J20r0J50J63p3m1j7l8P4L9No1Q7l7j47j2M5L1k4k3N4L2
1566b132J7j2l2j0lk8J7n9J73O6M3Q3N5L04M07q8l16l58j86j05K3NL0O3j07j68P3lJ29l4K4
1559b129j0J33q6R6q7r2n4R4o6O5q4p6RP3L6R9Q8N0j71J9JJ7j5o8j54J29J19M6L6J9j34j06
1551b203o3R4o2J81lP8l7R4n8Jp6k0j5N1p6J07Q2J83k2PK21L75N46J228J687J621o43k064
$$ plain form
1607 -2017 -2008 -2133 -2063 -2109 -2007 -1943 -1914 -2060 -1955 -2044 -1926 -1895 -1917 -2006 -1947 -1978 -1985 -1985 -2112 -2112 -2078 -2109 -2075 -2064 -1951 -1985 -2067 -2200 -2048 -2045 -2079 -2073 -2097
1599 -2097 -2114 -2149 -2093 -1999 -2008 -1961 -1968 -1901 -1915 -1930 -1911 -1875 -1938 -1891 -1933 -1936 -1926 -1976 -2159 -2137 -2213 -2168 -2134 -2035 -2112 -2065 -2055 -2019 -2148 -2058 -1972 -2048 -2122 -2100 -2162
1591 -2162 -2111 -2189 -2129 -2116 -2070 -2065 -1865 -1999 -2130 -2122 -2131 -2116 -2129 -2184 -2200 -2199 -2181 -2252 -2212 -2244 -2288 -2327 -2256 -2204 -2139 -2097 -2153 -2193 -2143 -2193 -2268 -2225 -2184 -2268 -2231
1582 -2231 -2144 -2096 -2051 -2170 -2074 -1985 -2156 -2237 -2176 -2102 -2131 -2075 -2080 -2125 -2124 -2155 -2162 -2180 -2154 -2200 -2169 -2179 -2221 -2263 -2283 -2283 -2293 -2140 -2075 -2008 -2114 -2187 -2205 -2295
1574 -2295 -2216 -2217 -2159 -2050 -1984 -2084 -2212 -2304 -2295 -2369 -2249 -2339 -2189 -2026 -2099 -2140 -2157 -2195 -2121 -2082 -2077 -2138 -2051 -2088 -2235 -2247 -2202 -2171 -2195 -2218 -2164 -2132
1566 -2132 -2115 -2127 -2159 -2169 -2172 -2200 -2183 -2242 -2069 -2003 -1960 -1877 -1822 -1518 -1111 -1199 -1515 -1873 -2059 -2164 -2141 -2136 -2106 -2043 -2150 -2318 -2245 -2248 -2119 -2153 -2129
1559 -2129 -2139 -2006 -2092 -1996 -2083 -2175 -2229 -2135 -2201 -2136 -2220 -2296 -2287 -2214 -2178 -2079 -1991 -1941 -2112 -2093 -2092 -2075 -2090 -2158 -2312 -2183 -2064 -2018 -1982 -1963 -2097 -2203
1551 -2203 -2266 -2172 -2234 -2053 -2056 -1978 -2015 -1921 -1979 -1978 -2054 -2074 -2089 -2038 -2114 -2007 -1925 -1742 -1764 -1757 -1536 -1161 -615 613 2300 3921 3278 1214
1544A214j640o90m64j49k00PRj7m5k5n0qj91N3o5J06J0J2LN0p8J3j4J2Q3O5j73q8k0ON8M5
1536b171o7J23o6pPmL8jo1J2O3p9N6N9k0r5OOrJ3L2J10L5qq3%M3O3j03q6J5N9J10J4j4Qj8
1527b020K2j24k0N1L0pl9j25m8R3L7j8J3p9k6O0K4J44o4q4P6kr4j29J11R8m3qL1K2No0r9M3
1519b229m8Q4J59J24r6J6k6M9N5l6j22j02p7K26M4p9j8pj12J04K3ql4L2R5O9j70k4L6N9l5
1511b048J35Qro8L0k5O2mk6k9q5p3J34K6L3RM6L2nj3N0L2J0j06L9k1P7o2kJNQJ20qN3M9L8
1502a587m8m0rJ15Q9K2n2J8KJ46j20K3M5J9J00J59N2J09j01N7P4j4j6J41O2m7L6N2J45K56
1495c12j1J57M74L65K00L82N32N20J037J194J590J930K505L999Q841J9570L8680N9348N1510
1490A92511l3482p7669m4165j8758p342m116j701j331p77j226o04o53j42m07q1j42K06k22
$$ plain form
1544 1214 -426 -1116 -1580 -1729 -1929 -1922 -1913 -1930 -1975 -2000 -2050 -2058 -2249 -2196 -2261 -2155 -2145 -2133 -2130 -2080 -2158 -2145 -2159 -2147 -2064 -1999 -2172 -2260 -2280 -2274 -2216 -2171
1536 -2171 -2238 -2115 -2181 -2188 -2181 -2185 -2147 -2148 -2209 -2197 -2134 -2213 -2157 -2098 -2118 -2213 -2207 -2201 -2210 -2197 -2165 -2055 -2020 -2028 -2111 -2111 -2068 -2005 -2108 -2194 -2179 -2120 -2010 -1996 -2010 -2002 -2020
1527 -2020 -1998 -2122 -2142 -2091 -2061 -2068 -2107 -2232 -2280 -2187 -2150 -2168 -2155 -2234 -2260 -2200 -2176 -2032 -2096 -2180 -2104 -2106 -2200 -2329 -2218 -2120 -2163 -2171 -2140 -2118 -2113 -2173 -2272 -2229
1519 -2229 -2277 -2193 -2034 -1910 -2006 -1990 -2016 -1967 -1912 -1948 -2070 -2172 -2249 -2023 -1979 -2058 -2076 -2083 -2195 -2091 -2068 -2076 -2110 -2078 -1983 -1914 -2084 -2108 -2072 -2013 -2048
1511 -2048 -1913 -1905 -1914 -1982 -1952 -1977 -1915 -1919 -1945 -1974 -2059 -2132 -1998 -1972 -1939 -1930 -1884 -1852 -1857 -1870 -1820 -1788 -1778 -1884 -1845 -1866 -1789 -1851 -1853 -1852 -1847 -1839 -1719 -1727 -1674 -1625 -1587
1502 -1587 -1635 -1675 -1684 -1569 -1480 -1458 -1510 -1492 -1490 -1344 -1464 -1441 -1396 -1377 -1277 -1118 -1066 -957 -1058 -1001 -927 -941 -957 -816 -754 -801 -765 -713 -568 -312
1495 -312 -323 -166 308 673 873 1255 1787 2307 3344 4538 6128 8058 10563 14562 23403 42973 81653 141001 192511
1490 192511 159029 81360 37195 18437 11095 6979 5278 3947 3170 1944 1340 687 545 138 57 -85 121 -101
1486a01k8j92J67k22lj76J7j33R7j39m8r1J71j47n3m0J54j50J08j48qj5P9j45J97O6o5o5m8
1479i61j98R4n5N2m9O9j15J56j10k8j21J01n4p3K5P6j28L0m3M6kj06j13Q3j46k3jl4J5L4j40
1471a719J01l6N4l9M2m1O9q5R1n2L1j3j26q7J58k2J4j30L4jmm4j1J04q7m0Ml3k5O7k9Oj3j2
1463a874M6Q3m2j27o4l4R1j00P7L2k1op9R8K5l6k6qk1k0Mn4k5O1Q4j09n7P4p5J00lj02r3N7
1454b144M8l2k4J89oj14j4R5p4L5r5m1J20n6p7J14M4Rk2K8q9P4o1L3O2l8l5kk4K1nM1lq4m8
1446b175j7m9R3L4RJ31O2p8N9o0o1L1M8j78L2PL5n1M3m8J79j17j2o3K7o5P7M8R4n9L2m2k7
1438b061j0N8m4L4j17Q3k7P3m5J52j78k8O9%po3m6N1r6P9p5K3n1J15j15J30J4M9p8J31R4q1
1430a967j17O8o3K0n1O9j21O6L6N2p5J01j74lL4O6lo8q8Q5j1Jo7P7LJ16l9o5J4O3n7K7p1K7
$$ plain form
1486 -101 -129 -321 -154 -376 -379 -555 -538 -671 -574 -713 -761 -852 -681 -828 -881 -921 -767 -917 -809 -957 -965 -980 -901 -1046 -849 -783 -848 -913 -961
1479 -961 -1159 -1065 -1120 -1068 -1117 -1048 -1163 -1007 -1117 -1145 -1266 -1165 -1219 -1292 -1267 -1191 -1319 -1289 -1332 -1286 -1288 -1394 -1507 -1424 -1570 -1593 -1594 -1628 -1613 -1579 -1719
1471 -1719 -1618 -1654 -1600 -1639 -1597 -1638 -1569 -1654 -1563 -1615 -1584 -1597 -1723 -1810 -1652 -1674 -1660 -1790 -1756 -1757 -1761 -1805 -1816 -1712 -1799 -1839 -1835 -1868 -1893 -1826 -1855 -1849 -1862 -1874
1463 -1874 -1828 -1745 -1787 -1914 -1978 -2012 -1921 -2021 -1944 -1912 -1933 -1939 -2018 -1920 -1895 -1931 -1957 -1965 -1986 -2006 -2002 -2056 -2081 -2020 -1936 -2045 -2102 -2028 -2103 -2003 -2006 -2108 -2201 -2144
1454 -2144 -2096 -2128 -2152 -1963 -1969 -2083 -2097 -2002 -2076 -2041 -2136 -2177 -2057 -2113 -2190 -2076 -2032 -2023 -2045 -2017 -2106 -2032 -2093 -2060 -1998 -2036 -2071 -2073 -2097 -2076 -2081 -2040 -2043 -2127 -2175
1446 -2175 -2192 -2241 -2148 -2114 -2105 -1974 -1912 -1990 -1931 -1991 -2052 -2021 -1973 -2151 -2119 -2112 -2077 -2128 -2085 -2133 -1954 -2071 -2083 -2146 -2119 -2184 -2107 -2059 -1965 -2024 -1992 -2034 -2061
1438 -2061 -2071 -2013 -2057 -2023 -2140 -2057 -2084 -2011 -2056 -1904 -2082 -2110 -2041 -2041 -2048 -2111 -2157 -2106 -2202 -2123 -2198 -2175 -2226 -2111 -2226 -2096 -2082 -2033 -2111 -1980 -1886 -1967
1430 -1967 -2084 -2016 -2079 -2059 -2110 -2041 -2162 -2096 -2060 -2008 -2083 -1982 -2156 -2159 -2125 -2059 -2062 -2130 -2218 -2133 -2144 -2143 -2210 -2133 -2130 -2014 -2053 -2118 -2104 -2041 -2098 -2071 -2142 -2115
1422b115rOj9L7l6J53q0O8j9O6m4P5j16J3p9O3N0l8n4J38M1K63L52J54l94l02j55L7j62q4
1414b190j1L7p7J64Q9n8l6j20L0N5o9P3l4J50k54K5J80L1k6nl1l8K3Q9r0L1k0k0mK3nl2n3
1406b173M0l9n5O9O2n1L2N1nN4L5k4j05q0K5PJl6%R5P5m0p1N1j06r4L7J5J75M8N7Rl6j09J3
1398b073j1p7l9J08K4kJ8j18O9l6j4p3R0p8K1n3J44kj2q3L3Q3L1p6n1m4J90l3j40l9J94k8
1390b077M6j44L9k4J33l0Q2m4Kn2P0n8j7k0RQJ03m1R1j7Kp9k1J3no4Q8n5L5n5J1J2M1qLM2
1381a981J2o3P2m4J27j00Q5k6J28J14L8K3J92Q8k7Q9P0j45j34n7l5j23K2j58nn6L3j12M8j1
1374a936j1j23K24J17N8M0R2k6Q6l6J39J00J26j25p3j66On1R1k00Lj47R7r4r2m6M2j08O2j04
1366b055O2l6Q2k3Q9j14p1mM2L3J17P2kk01N7%K7l8L4j13P4l2Qo5J38N7J02r1l2L8N0l2N2
$$ plain form
1422 -2115 -2124 -2118 -2137 -2100 -2136 -1983 -2063 -1995 -2014 -1948 -1992 -1917 -2033 -2020 -2099 -2036 -1986 -2024 -2078 -1940 -1899 -1636 -1284 -1130 -1524 -1826 -1981 -1944 -2106 -2190
1414 -2190 -2201 -2164 -2241 -2077 -1988 -2046 -2082 -2202 -2172 -2117 -2186 -2113 -2147 -1997 -2251 -2226 -2046 -2015 -2041 -2046 -2077 -2115 -2092 -2003 -2093 -2062 -2082 -2102 -2106 -2083 -2088 -2120 -2173
1406 -2173 -2133 -2172 -2227 -2158 -2096 -2147 -2115 -2064 -2069 -2015 -1980 -2004 -2109 -2189 -2164 -2157 -2156 -2192 -2192 -2097 -2022 -2062 -2133 -2082 -2188 -2282 -2245 -2230 -2055 -2007 -1950 -1941 -1977 -2086 -2073
1398 -2073 -2084 -2161 -2200 -2092 -2068 -2070 -2052 -2170 -2101 -2137 -2151 -2224 -2134 -2212 -2191 -2244 -2100 -2102 -2114 -2197 -2164 -2081 -2050 -2126 -2177 -2221 -2031 -2064 -2204 -2243 -2049 -2077
1390 -2077 -2031 -2175 -2136 -2160 -2027 -2057 -1975 -2019 -2017 -2069 -1999 -2057 -2074 -2094 -2085 -2077 -1974 -2015 -1924 -1941 -1939 -2018 -2039 -2026 -2031 -2095 -2007 -2062 -2027 -2082 -2071 -2059 -2018 -2026 -2023 -1981
1381 -1981 -1969 -2032 -1960 -2004 -1877 -1977 -1892 -1918 -1790 -1676 -1638 -1615 -1423 -1335 -1362 -1273 -1203 -1348 -1482 -1539 -1574 -1697 -1675 -1833 -1838 -1894 -1861 -1973 -1925 -1936
1374 -1936 -1947 -2070 -1846 -1729 -1671 -1631 -1539 -1565 -1479 -1515 -1376 -1276 -1150 -1275 -1348 -1514 -1508 -1559 -1468 -1668 -1665 -1812 -1715 -1809 -1901 -1947 -1905 -2013 -1951 -2055
1366 -2055 -1993 -2029 -1947 -1970 -1881 -1995 -2066 -2070 -2028 -1995 -1878 -1806 -1808 -2009 -1952 -1952 -1925 -1963 -1929 -2042 -1968 -2000 -1992 -2057 -1919 -1862 -1760 -1851 -1883 -1845 -1795 -1827 -1775
1358a775j78K1k6J38p7p2K6Q0M2K0NQ8j10o9kj1p5N5L3J10o2n9Q6J38l4N2J7k7n6l6o1j7L2
1350a804j3M5j7n0M7P8J1Q5N1q1L2j42q4K1O1J03R3l2N1K1q1jO9r7k7P1j38N8lO4J28O0n8
1342a479j44m0j14o8M1q8J5l7L0N8j1m7L2P0Q4m5K5L4J32J7j3J27l1r5L6j07N4RO1m2j67j56
1334a859j2j49J43j6p4R1J30R5P9j3Q0l2l5j1j45P5J11M1K06J09j5j81o4j49o4M6j28r3R5
1327a739K0J89o4K1L1J23l4m1j73J00k47K2k5k6k4J47OJ4J18K3m6J17j45J0j81r3J4j8K6N6
1320a819j55K3k5J20l5M3n7R6j13R9n3M9r7K1K0L3O8mJ19J67j6J4j93j2q3R2J1K3n7R5r3K8
1312a691J1K15N7K75J20K88N2Q6j65n6l02l8j28j18l4M0j04J04j14Rm1K03j5J19Q1J58P8J30
1305g80K16M12O47J254J287J462R64L86n57j247j592j235r11n23l19p7l8j3j05J23m0K8J66
$$ plain form
1358 -1775 -1953 -1932 -1958 -1820 -1897 -1969 -1943 -1863 -1821 -1801 -1796 -1708 -1818 -1887 -1889 -1900 -1975 -1920 -1887 -1777 -1839 -1898 -1812 -1674 -1708 -1656 -1639 -1666 -1722 -1758 -1819 -1836 -1804
1350 -1804 -1817 -1772 -1789 -1839 -1792 -1714 -1703 -1618 -1567 -1648 -1616 -1758 -1842 -1821 -1760 -1657 -1564 -1596 -1545 -1524 -1605 -1606 -1537 -1634 -1661 -1590 -1728 -1670 -1673 -1609 -1481 -1421 -1479
1342 -1479 -1623 -1663 -1777 -1845 -1804 -1892 -1877 -1914 -1884 -1826 -1837 -1884 -1852 -1782 -1698 -1743 -1718 -1684 -1552 -1535 -1548 -1421 -1452 -1547 -1511 -1618 -1564 -1555 -1494 -1536 -1703 -1859
1334 -1859 -1871 -2020 -1877 -1893 -1967 -1876 -1746 -1651 -1572 -1585 -1505 -1537 -1572 -1583 -1728 -1653 -1542 -1501 -1295 -1186 -1201 -1382 -1446 -1595 -1659 -1613 -1741 -1834 -1739
1327 -1739 -1719 -1530 -1594 -1573 -1542 -1419 -1453 -1494 -1667 -1567 -1814 -1792 -1817 -1843 -1867 -1720 -1714 -1700 -1582 -1559 -1605 -1488 -1633 -1623 -1804 -1897 -1883 -1901 -1875 -1819
1320 -1819 -1974 -1951 -1976 -1856 -1891 -1848 -1905 -1809 -1922 -1823 -1876 -1827 -1924 -1903 -1883 -1850 -1782 -1786 -1667 -1500 -1516 -1502 -1695 -1707 -1790 -1698 -1687 -1664 -1721 -1626 -1719 -1691
1312 -1691 -1680 -1465 -1408 -1133 -1013 -725 -673 -587 -752 -808 -1110 -1148 -1276 -1394 -1428 -1388 -1492 -1388 -1502 -1493 -1534 -1331 -1346 -1227 -1146 -988 -910 -780
1305 -780 -564 -152 495 1749 3036 4498 5462 5848 5291 4044 2452 1217 306 -217 -536 -613 -651 -664 -769 -646 -686 -658 -492
1300d92K31P6K73K79L78N36J108J546K684L465L635K816J191j026k858l899l634k745j627
1295A937q38n04k23r8j65l8J9j1L8K15K09L67L57N72O55J241J960L287M618N159M493K223
1290B5473r47l712n315n179m117k576j453q43l57k09k08j57k34k00J05L47J54R7K75L44N54
1284A842P61J370K403L594M123L807K313l4k403m046m456l643k523j536o99m20l66q8j55r9
1280b55p5k6j63Q7J11L6J27L61L53O28J043J639K016J903J258M86p22j754k197k031j531q10
1274D84n61j17k14k29k19q6o0O8o8Q1j1j27j18K89J17K01K61N14M02N92O10M10j33k42p21
1268A123o36n88l68m38j1j35j8p4K8j43j4L8O5r4L0q5Q6k0J65J9J02PK43K6K84N7o0j84j18
1261g13k43k5j18l1o1P3j77Q3J5nn6O3m0J07nj1j22M8j17J04l9P3R4J28ok9M9M9j57m5m5R7
$$ plain form
1300 -492 -261 -185 88 367 745 1281 2389 3935 6619 10084 13719 16535 17726 16700 13842 9943 6309 3564 1937
1295 1937 1099 595 372 274 109 71 90 79 117 332 541 908 1265 1837 2492 3733 5693 8980 13598 18757 23250 25473
1290 25473 24526 20814 15499 10320 6203 3627 2174 1331 974 765 557 400 166 -34 71 418 572 669 944 1288 1842
1284 1842 2603 3973 6376 9970 14093 17900 20213 20179 17776 13730 9274 5631 3108 1572 873 453 87 -1 -156 -255
1280 -255 -330 -356 -519 -432 -321 -285 -158 203 556 1184 2227 3866 5882 7785 9043 9529 8807 7053 4856 2825 1294 484
1274 484 -77 -194 -408 -637 -856 -942 -1002 -934 -1002 -921 -932 -1059 -1177 -888 -771 -570 -309 205 607 1199 1809 2219 2086 1844 1123
1268 1123 487 -101 -469 -907 -918 -1053 -1071 -1145 -1117 -1260 -1274 -1236 -1171 -1265 -1235 -1320 -1234 -1254 -1089 -1070 -968 -961 -718 -692 -408 -351 -411 -595 -713
1261 -713 -956 -981 -1099 -1130 -1191 -1118 -1295 -1212 -1197 -1202 -1258 -1195 -1235 -1128 -1133 -1144 -1266 -1218 -1335 -1231 -1270 -1197 -1103 -975 -981 -1010 -961 -912 -1069 -1114 -1159 -1062
1253a062k7J66j60M4LJ07l5L9m6P4K3J7qk6j12O8N1J15j47k1L0J38J3J9m9J19O9J56N1o4k8
1246d83R3j4R3j11N4K6J32P5P2q8L7K3L22NQ2N5p4p2j6rP7k3J73RJ76J08M2J07K12P4M3J10
1238A310K29R3K22L00L17L32L94M09P74O51Q24Q79J490K182L177M272M929M489K537k22k576
1233B7012m200m492l569k464j527p82k44J52K40O30Q27J149J438J507J944K569L025L558M674
1228C1447O961J1248J7492K5054L0743K9947K0326L832j4551k7247l0924k7229j9326j1973
1224D5800o799l550j891n24J57Q53J658K412L369M623N829O924P978J0569J5333K4383L9098
1220A56222N8685P6738Q1337O2705K3241k6520o6966q4123p8668n8597l6571k0978j1616o365
1217F8524l494k187j049j85J391L108M579O226Q126R726J2420J7857K8118M5437P0624R7276
$$ plain form
1253 -1062 -1089 -923 -1083 -1039 -1036 -929 -964 -925 -971 -897 -874 -857 -865 -891 -1003 -935 -884 -769 -916 -937 -907 -769 -756 -737 -786 -667 -598 -442 -391 -455 -483
1246 -483 -390 -404 -311 -422 -368 -342 -210 -135 -63 -151 -114 -91 231 236 318 373 299 227 211 202 279 256 429 438 614 722 764 871 1083 1157 1200 1310
1238 1310 1539 1632 1854 2154 2471 2803 3197 3606 4380 5031 5855 6734 8224 10406 13583 17855 22784 27273 29810 29588 27012
1233 27012 22812 18320 14751 12287 10760 9978 9734 9886 10126 10756 11583 12732 14170 15677 17621 20190 23215 26773 31447
1228 31447 38408 49656 67148 92202 122945 152892 173218 177050 162499 135252 104328 77099 57773 45800
1224 45800 39001 35451 33560 33036 33193 34046 35704 38116 41485 46108 51937 58861 66839 77408 92741 117124 156222
1220 156222 214907 291645 372982 435687 458928 432408 365442 281319 202651 144054 107483 86505 74889 68524
1217 68524 65030 62843 61794 61609 63000 66108 70687 76913 85039 94765 107185 125042 153160 198597 269221 366497
1213C66497J11130R5344M8975j7974q1052j14514j14819r0973n8661l3925j8972j0936o445
1210G3675m625l571k817j406p8J725L107M688O083Q107J1582J8512K9610M6930O7431Q1740
1206C40693P6560M7848P03n0068q3372r0165p6061n1636l0683j7306j0050o257m650l852l365
1202C8339k493j821n61L65J262K019K995M188O733J0463J6812K4289L0909L0794K1892M959
1198A91144j4970l0392l5914l2394k3581j4959q695n171l250k552j857j801j537j313q28o13
1194A1317L2r2L02P34J201J480K746L735M658M837L940J475j559m408n581n673m538l317j945
1190I344j386p53p63o62o43m37n19k24m11j94j42J44K0J59P1J67K17J85m6l9qRL3J82j6J17
1183D405r5n7j45j9j5J7l3J38n8K3p8K35J49J80J02K59N0Q2L3J20K91L17J65K20K86L15K76
$$ plain form
1213 366497 477627 572971 621946 603972 522920 408406 293587 202614 143953 110028 91056 80120 73675
1210 73675 69050 65479 62662 61256 61178 62903 66010 70698 76781 84888 96470 114982 144592 191522 258953 340693
1206 340693 417253 465101 465804 415736 332364 242199 166138 114502 83819 66513 56463 50206 45556 41704 38339
1202 38339 35846 34025 33464 33829 35091 37110 40105 44293 51026 61489 78301 102590 133499 164293 186185 191144
1198 191144 176174 145782 109868 77474 53893 38934 30239 25068 21818 19266 17409 15608 14071 12758 11930 11317
1194 11317 11349 11257 11559 12293 13494 14974 17720 21455 26113 30950 34890 36365 34806 30398 24817 19144 14606 11289 9344
1190 9344 7958 7205 6442 5780 5137 4700 4181 3957 3546 3352 3210 3354 3374 3533 3604 3771 3988 4173 4127 4088 4080 4089 4122 4304 4288 4405
1183 4405 4310 4253 4108 4089 4074 4091 4058 4196 4138 4161 4083 4318 4467 4647 4749 5008 5058 5140 5173 5293 5584 5901 6066 6286 6572 6887 7163
1177G163K96K92L79L98M36M47L81L80L96M56N25M24O86Q28O93Q98N98O89Q01Q17R40J021J217
1171B1161J442J860K266K574L443L435K826K961L252L078L009K554K862K949K940K640J405
1167F6657m05j403k131k905l079k524j780m43N14J130J371K277L003L967N299O786P319P868
1163I1521R571J1637J4096J7654J9012K2532K9531L5679L8600M9955O5833P7451P3607Q0078
1159F36757R3181P9586N3187M6588L9061Q269k4462n5118p3214o4520n5681m1545l2147k7461
1156E82481j0087J3578L2742M1632M6148O5057Q2933Q9291R7250J05372J04876J06145J18799
1153A476217J07931N1928L819n4807j20141j19097j22127j32692j05356j00177q9822p5786
1150G19890p1666m3025j9427p365J1060K5652K9252L3519M9268O4179P2246P8913N5023L4258
$$ plain form
1177 7163 7459 7751 8130 8528 8964 9411 9792 10172 10568 11024 11549 11973 12659 13487 14180 15078 15676 16365 17166 17983 18923 19944 21161
1171 21161 22603 24463 26729 29303 32746 36181 39007 41968 45220 48298 51307 53861 56723 59672 62612 65252 66657
1167 66657 66252 64849 62718 59813 56734 54210 52430 51987 52501 53631 55002 57279 60282 64249 69548 76334 83653 91521
1163 91521 101092 112729 126825 144479 163491 186023 215554 251233 289833 339788 405621 483072 556679 636757
1159 636757 729938 809524 862711 909299 948360 956629 932167 877049 803835 739315 683634 642089 609942 582481
1156 582481 572394 585972 618714 660346 706494 771551 854484 943775 1041025 1146397 1251273 1357418 1476217
1153 1476217 1584148 1636076 1639895 1585088 1464947 1345850 1223723 1091031 985675 885498 795676 719890
1150 719890 648224 605199 585772 578407 589467 615119 644371 677890 727158 791337 863583 942496 997519 1031777
1146A031777R445m0093n3956p1987j08838j02447r6681q7757o8954n6441m8301m0442l4204
1143B31121l1007k5493j7084j0188o529k869M76L946P744J0900J2000J4522J7181J8266K0112
1139B43098J8485J3584J0973K814m777j0569k0827k7250k6949k7873k5430k0915j6259r896
1136I8209m883l996k548j336p58K58K502M883Q210R855J1349J5006J3579P159M042m090j5339
1132A42102j9050j6970j4195j1736j1924j3528j2554q406n316l313k340j855j619j270r36
1128A7090n45p21p77r32n88n80l85k88j01l26k18o7J87N74O01M50j00j282j518j329q53o79
1123G613o82m07l03l61k36l46j86j93R4m3R3k41k29k59j7oJ21O3L43N54Q67J266J751J830
1117A1086J134k60j323k048j921j524j055q04m67k90k77j98j99k29j47m7rl5j07j05ll0J1
$$ plain form
1146 1031777 1041222 1001129 947173 875186 766348 663901 567220 479463 410509 354068 305767 265325 231121
1143 231121 200114 174621 157537 147349 140820 137951 138427 142373 150117 161017 173017 187539 204720 222986 243098
1139 243098 261583 275167 286140 288954 284177 273608 252781 225531 198582 170709 145279 124364 108105 98209
1136 98209 93326 89330 86782 85446 84688 84946 87448 92331 100541 110396 121745 136751 150330 157489 161531 157441 142102
1132 142102 123052 106082 91887 80151 68227 54699 42145 33739 28423 25110 22770 20915 19296 18026 17090
1128 17090 16545 15824 15047 14115 13527 12947 12562 12274 12173 11847 11629 11562 11749 12323 12924 13374 13274 11992 10474 9145 8292 7613
1123 7613 6931 6524 6221 5860 5624 5278 5092 4899 4993 4950 5043 4802 4573 4314 4297 4291 4412 4475 4818 5372 6239 7505 9256 11086
1117 11086 12220 11960 10637 8589 6668 5144 4089 3285 2818 2528 2251 2053 1854 1625 1478 1431 1422 1387 1280 1175 1172 1142 1153
1111A153j75R7L04L87M82Q60J255J456R43m53j567j646j105o08m39l98j12m4q6o4L5K4L7j3
1105C23j27j68k0Q6m4o8lNJ64r1Q0j15Pp8M1J11j7Rj23J5J19Kj02l3Mj7R6J20Q1J21J56N6
1098E90J07J28K18K30M61M42L02J91O27N16L19L76M59M4Q1p9l42l95k75n47k23j76L5J3J36
1091C238J23L00K35N62L88N60N08N72N63O49L69L44K54J15m16j43o07q59p29n55n87l56m91
1086D037k40j46J23J28K04J99L49L35M72L06J72JJ35J61P8j77j17k11j52j81l28m43k43l44
1080D118k52o9j60j40M1k9K06J17J41n3R9K19K91L18L60J04L46L01K61K68J96J71L29J84L79
1074G746K36K27J75J13Q2K46J98L06J72L71K62M54M17L66L95M21M16M56N72O66P03O64O36
1068A6300Q93P58P81Q43J021J074J178J198J507J852K149K149L030M239N525O266O537O407
$$ plain form
1111 1153 978 1075 1379 1766 2248 3108 4363 5819 6762 6309 4742 3096 1991 1383 944 546 434 390 304 240 275 299 336 323
1105 323 196 28 8 94 50 -18 -21 -16 148 57 137 22 29 -49 -8 103 86 95 -28 -13 106 108 6 -27 -23 -40 56 176 257 378 534 590
1098 590 697 825 1043 1273 1734 2176 2478 2669 3296 3812 4131 4507 4966 5010 5091 5012 4670 4275 4000 3453 3230 3054 3089 3102 3238
1091 3238 3361 3661 3896 4458 4846 5406 5914 6486 7049 7698 8067 8411 8665 8780 8364 8221 7614 6755 6026 5471 4884 4528 4037
1086 4037 3797 3651 3774 3902 4106 4305 4654 4989 5461 5767 5939 5940 6075 6236 6314 6137 6020 5809 5657 5476 5148 4705 4462 4118
1080 4118 3866 3797 3637 3497 3538 3509 3715 3832 3973 3920 4019 4238 4529 4847 5207 5311 5657 5958 6219 6487 6683 6854 7183 7367 7746
1074 7746 7982 8209 8384 8497 8579 8825 9023 9329 9501 9872 10134 10588 11005 11371 11766 12187 12603 13059 13631 14297 15000 15664 16300
1068 16300 17193 17951 18732 19575 20596 21670 22848 24046 25553 27405 29554 31703 34733 38972 44497 50763 57300 63707
1064F3707P116R443J3219J7464K1284K7075M0270O7133J15299J91215K75111K97736J39933
1061A286005j68256l30700k73355j68224r5310n5166l2725k0086j2875r505o239k534K372
1057A13402P076J1185J4176J6397J8434J8267J7602K5230L7030N2033P1435J06157J74415
1054F82839K83573M09179M58406L01521j9850l08669m19630l72553k96586k09809j28664p5598
1051C04159m2255k3943j8593k6745k8460j9630j0463n173k076j193k81J626N794J0310J5286
1048A58363K0279L0803N0716Q8239J51871K45585L26128K89994J1367l16986l71906k55599
1045D28854j47740q3696m9783l0684j9849j5128j3202j1436q533n610l449k476k885l426l085
1041B7872k857k456k034k429k397k117j616j339j053q28n89n06l64l59k92m90k95m77l21m77
$$ plain form
1064 63707 70823 80266 93485 110949 132233 159308 199578 266711 382010 573225 848336 1146072 1286005
1061 1286005 1117749 787049 513694 345470 250160 194994 162269 142183 129308 119803 113564 111030 113402
1057 113402 120478 131663 145839 162236 180670 198937 216539 241769 278799 330832 402267 508424 682839
1054 682839 966412 1375591 1833997 2135518 2115668 1806999 1387369 1014816 718230 508421 379757 304159
1051 304159 261904 237961 219368 192623 164163 144533 134070 128897 126821 125628 125347 126973 132767 143077 158363
1048 158363 178642 209445 260161 348400 500271 745856 1071984 1361978 1373345 1056359 684453 428854
1045 428854 281114 197418 147635 116951 97102 81974 68772 57336 48803 43193 39744 37268 34383 30957 27872
1041 27872 25015 22559 20525 18096 15699 13582 11966 10627 9574 8746 8157 7651 7287 6928 6636 6146 5851 5374 5053 4576
1036D576k68k45j88k15Q0j90r6j72J02r5j7J38J13j11j9m94k06l38j08l82j40j95Pj61K8j78
1030A226J48p2J66k01J10k08l7j09L5p4J88q2N0J0L35k2J90J1J16j97l2k32k96j49N9k25k4
1023F84j12J5j55P4q5J15j69L0p0J26j56J43m5J09j81O1k0K92q4K84OJ86j23o8j10O2j23O
1016F92k48J39J4J31jK62J27K69Q7L00L22O26N71R93J451K998M703O412O033M916L687P8m623
1011B9939n724n861o201m746k381j218m00m60j94k48j50n2q0k27j81l71k79l11j5j08N5k12
1005E75j18j31oj34%j02Q7M3J70J45K25J91N02M31R5M5l8j33J75m2J95j1J32j34r8j39M0L8
999B003N5l1K0n5P5K45N38P64J153J115N02o62j260j284o74n41k31j22Kj4J18J62K15K63L05
992B661K23M8q0q0j25J1M1J06K80M17O50R57J596K066K528J801K03j324j690j881j603j414
$$ plain form
1036 4576 4308 4063 3875 3660 3740 3550 3454 3282 3384 3289 3272 3410 3523 3412 3393 2899 2693 2355 2247 1865 1725 1530 1537 1376 1404 1226
1030 1226 1374 1302 1468 1267 1377 1169 1132 1023 1058 984 1172 1090 1140 1150 1485 1463 1653 1664 1780 1583 1551 1319 1023 874 933 708 684
1023 684 572 587 432 506 421 536 367 397 327 453 297 440 395 504 323 384 364 656 572 856 862 1048 925 857 747 809 686 692
1016 692 444 583 597 728 727 989 1116 1385 1472 1772 2094 2720 3291 4284 5735 8733 13436 19848 25881 30797 34484 34562 29939
1011 29939 24215 18354 12153 7407 5026 3808 3408 2948 2754 2506 2356 2304 2224 1997 1816 1445 1166 855 840 732 787 575
1005 575 457 326 320 186 186 84 171 214 384 529 754 945 1447 1878 1973 2018 1980 1847 2022 1980 2175 2164 2296 2162 2064 1925 1965 2003
999 2003 2058 2027 2047 1992 2067 2312 2850 3614 4767 5882 6384 5722 4462 3178 2504 1963 1732 1610 1612 1598 1716 1878 2093 2356 2661
992 2661 2884 2932 2852 2772 2647 2658 2699 2805 3085 3502 4152 5109 6705 8771 11299 13100 13303 11979 10289 8408 6805 5391
987E391r49p74n23k91j85j98r2j49j87j90j39P7K11J02Q6R8L33J74J88J61L11O46J194J476
981F771J333K57j079j647j214r40m74m73j37j11Op1P2J0n9M2K96o1Q8p0R3N8J35K3M6K80K15
975C389j34K05J03L71K11M31L58L04K21M62L37M97J38M41J31M66N00R05R23J078Q17P77L38
969A3269L45n0J78M91J362J697K371K762K992J981R18k80j509k544k337k401j787j090l21
964A6047m8N65N64Q61N57N94M80P89O93R42P99P27O57J038Q19J022P96J109J193J318J249
959C2771J626J673J858J829K213K450L066L321L520L542L561K646K367K025J770J939K827
955G5004L598N715Q411J0199R866P944N892P677J4632K3132L0904L8409M5561N1823N5167
951C93934N9434P1388R9681J63787L01012N50914R09179J205650J081794Q05564O41393j0856
$$ plain form
987 5391 4442 3668 3145 2854 2669 2471 2379 2230 2043 1853 1714 1791 2002 2104 2190 2288 2621 2795 2983 3144 3455 4101 5295 6771
981 6771 8104 8361 7282 5635 4421 3481 3007 2534 2397 2286 2292 2221 2293 2303 2244 2286 2582 2521 2609 2539 2632 2690 2825 2848 2894 3174 3389
975 3389 3255 3460 3563 3934 4145 4576 4934 5238 5459 5921 6258 6755 6893 7334 7465 7931 8431 9336 10259 11337 12154 12931 13269
969 13269 13614 13564 13742 14233 15595 17292 19663 22425 25417 27398 28316 28036 26527 23983 21646 19245 17458 16368 16047
964 16047 15999 16564 17128 17989 18546 19140 19620 20409 21102 22044 22843 23570 24227 25265 26084 27106 27902 29011 30204 31522 32771
959 32771 34397 36070 37928 39757 41970 44420 47486 50807 54327 57869 61430 64076 66443 68468 70238 72177 75004
955 75004 78602 84317 92728 102927 112793 120737 126629 134306 148938 172070 202974 241383 286944 338767 393934
951 393934 453368 524756 624437 788224 1089236 1640150 2549329 3754979 4836773 5642337 6283730 6272874
948F272874q39149j013422j019869j161183r21266m92243k37019j19582o9357n1968m6848
946C00968m1349l8670l8048l1741k3703j7531j3039j0504q629p265p722p454o081n296n086
942C8850m023k999k246j554q67k10O75J320J504R26J372L278M481K096l540p471o806m547
938B0239k563j715j309j105n99n01l93o2J07O8j91n20m49m74k74q1RJ74L15P32J221J249K54
932A4132j018j773j304o79o9J84M44N63O17J003J325J580K154K349K479K275K034K028K087
927C0411L367P434J4941K8595M6397N2652M3330L7066J8486k3907m7514m6471n0467m6260
924F8060k6772j1463n301k295j476j102r88p06r35m29j85k28k84n0n86j30r93j243q88q52
919A1154j097q14r24l46k97N3j15L22J01K53LL82J43M07J07L81K50M49M52N51K98M93l49j58
$$ plain form
948 6272874 5433725 4420303 3400434 2239251 1317985 825742 588723 469141 399784 347816 300968
946 300968 259619 220949 182901 151160 127457 109926 96887 86383 77754 70489 62767 55313 49232 43936 38850
942 38850 34827 31828 29582 28028 27161 26951 27626 28946 30450 31376 32748 36026 40507 42603 39063 31592 24786 20239
938 20239 17676 15961 14652 13547 12948 12447 12054 11992 12099 12167 11976 11456 11007 10533 10259 10178 10187 10361 10676 11408 12629 13878 14132
932 14132 13114 11341 10037 9358 9289 9473 9917 10480 11097 12100 13425 15005 17159 19508 21987 24262 26296 28324 30411
927 30411 33778 41212 56153 84748 131145 183797 227127 264193 282679 258772 211258 164787 114320 68060
924 68060 41288 29825 24524 22229 20753 19651 18663 17957 17022 16593 16408 16180 15896 15846 15260 15130 14137 12894 12006 11154
919 11154 10057 9243 8319 7973 7676 7729 7614 7936 8037 8290 8293 8675 8818 9225 9332 9713 9963 10412 10864 11415 11713 12206 11857 11699
913A1699m83k93o07n98o88k73n83n62q41n99m02K41K5M27K3R0j06L97l7J79KK76M9J97J45
907G678N41K64K76k91k94m86J92P8K37m06j47j79J60j67l52n35J09K34N80k4j13n76k25l00
901F254J17k8N2j31K10K42R16O31P30pj20m47q1Q1O94L9Rm26l05m31k57n49j78j11L51J04
895G359J53k90P4k68K24Q9K99J22L99L38O41O45P99M18K63j69K45K31P64M72L89k2p0j61K14
889A3158l1L55O5K21K27L03L84R66J162K092K786M457O214P457O007M800K737j740n641n734
884D0245n968n879l888j685j129o97o07n95p13n64p03k52j24J82L30M29M66L89N05N06N17
879B0765Q15P97R03P86R13P13R75J303J834J977K386K437L176M248P153J1143J8294K3848
874A04466K7453K9989J2791k209j996o833o501L931j5060k1988j3763j8335j5665p437k392
$$ plain form
913 11699 11216 10923 10316 9718 9030 8757 8174 7612 6771 6172 5770 6011 6036 6463 6486 6576 6470 6867 6830 7009 7011 7287 7336 7533 7678
907 7678 8219 8483 8759 8468 8174 7688 7880 7958 8195 7789 7642 7463 7623 7456 7104 6569 6678 6912 7492 7468 7355 6779 6554 6254
901 6254 6371 6343 6395 6264 6474 6716 7632 8263 8993 8986 8866 8419 8338 8419 9113 9152 9161 8735 8430 7999 7742 7193 7015 6904 7255 7359
895 7359 7512 7222 7296 7028 7252 7341 7640 7762 8161 8499 9140 9785 10584 11002 11265 11096 11341 11572 12336 12808 13197 13175 13105 12944 13158
889 13158 13127 13482 13547 13768 13995 14298 14682 15648 16810 18902 21688 26145 32359 39816 45823 50623 53360 51620 45979 40245
884 40245 34277 28398 24510 22825 21696 20999 20392 19797 19084 18520 17817 17565 17441 17623 17953 18382 18848 19237 19742 20248 20765
879 20765 21580 22377 23280 24066 24979 25692 26667 27970 29804 31781 34167 36604 39780 44028 51181 62324 80618 104466
874 104466 131919 161908 174699 172490 170494 163661 157160 161091 146031 124043 110280 91945 76280 68843 66451
871F6451Q10K367L837N041O018P101Q813J0038J2591J6550K4097L4696M9360O3701R0917J18766
867E21154J09214Q9102K5163k2522J0785k1902m0701J400n9141q4630n4974o7141n0673k3385
863C31749q951j679L552N920R412J0712J3846J7360K4358L5210N4277Q0770J14404J44074
860H35014J53974J78656K05886J22717P0576n143n8249q447p6389j23079p7695j32859j57021
857I27941j23439j14058q1423m8814l0729j8302q077N46R036J6426K4279L4552M7458O3720
853F99116Q3742J08014J29204J34778J07927J09929R0491k1249n3170p9752r1622n9681j04620
850A053107j36647j04160j08729j21108r6619p0841m7114k9613j9192j1202m455J091P020
847C11538J3432K0535K6601L1172L3066L4591L3551L3431K9065J8468J3674j2656m8704m4065
$$ plain form
871 66451 67261 69628 73465 78506 84524 91625 100438 110476 123067 139617 163714 198410 247770 311471 402388 521154
867 521154 630368 719470 744633 722111 732896 710994 670293 671693 612552 527922 472948 405807 355134 331749
863 331749 322798 321119 324671 330591 340003 350715 364561 381921 406279 441489 495766 576536 690940 835014
860 835014 988988 1167644 1373530 1496247 1566823 1561680 1503431 1494984 1418595 1295516 1217821 1084962 927941
857 927941 804502 690444 609021 560207 529478 511176 503099 503645 512681 529107 553386 587938 635396 699116
853 699116 782858 890872 1020076 1154854 1262781 1372710 1463201 1441952 1388782 1309030 1217408 1157727 1053107
850 1053107 916460 812300 703571 582463 485844 415003 367889 338276 319084 307882 303427 304518 311538
847 311538 324970 345505 372106 403278 436344 470935 504486 537917 566982 585450 599124 586468 537764 493699
843D93699m4100m5615l9939m8475n0909l5864k9950k8373j5706r373k0337k1287j1832o193
840H5746k998n68J897L876M931O086O886P392P068L602k655n396o486p384o936q162r454p950
836F9495p775p469o533n249m075l058k594j758j759j653j313o66m77L9Q0L75J34j6l82j29
831B5217kK08n87j184r07k21Kl86j957j744q39k37k86r84j393r22p53l85n88n21m38l48j59
825A0586ll4K75J43k1m61k72j07K04j48p34o58K8L86L55n04j078n71j75l37k42p69n61l09
819D993l05l75l84k67m5l13j26j97j25PK8j8o5J27K94K29j9j45K51K00M36M29J234J395L110
813A0349j186m264j359q41k38k88m4k52j1PK55n1O4q4K1k77J76Q2P7j01J80o3K08k5L41J45
807B821L55J02K11p6l0j79j54k62m3j16K04J28L45L00N93M58O04Ol1m9K03j63J37k48j63j85
$$ plain form
843 493699 449599 403984 364045 315570 264661 228797 198847 170474 154768 145395 125058 103771 91939 85746
840 85746 82748 82180 84077 87953 92884 98970 105856 113248 120316 123918 121263 115867 109381 101997 95061 86899 77445 69495
836 69495 61720 54251 47718 42469 38394 35336 32742 30984 29225 27572 26259 25593 25116 25155 25235 25610 25744 25728 25346 25217
831 25217 25215 25423 24836 23652 22745 22524 22526 22140 20183 18439 17600 17363 17077 16093 14700 13778 13025 12640 12052 11531 11093 10745 10586
825 10586 10583 10549 10824 10967 10946 10485 10213 10106 10310 10162 9428 8770 8798 9184 9539 9035 7957 7386 7211 6874 6632 5863 5302 4993
819 4993 4688 4313 3929 3662 3617 3304 3178 2981 2856 2863 2891 2873 2808 2935 3229 3458 3439 3294 3545 3745 4181 4610 5844 7239 10349
813 10349 9163 4899 3540 2699 2461 2173 2129 1877 1866 1873 2128 2077 2141 2057 2078 1801 1977 2059 2136 2035 2215 2152 2360 2335 2676 2821
807 2821 3176 3278 3489 3413 3383 3204 3050 2788 2745 2629 2833 2961 3306 3606 4199 4657 5261 5267 5236 5187 5390 5227 5364 5116 4953 4768
800D768N0j42K99K44M88L02J41k26p1l16K6l13J16l3L26K82O82N47R30P23O28J86m0n59j02
794H936l47m00n66m88q62l41n77j12j57L09m5K14l4Pk23P4j99M0O0N22M00O11K45M96J57M02
788H122l47k37m61k69n14k89p08m30o57m16o83k82l45l4OK75k6K34j92L4k74M3J9M24J35J46
782C274p6K48k9J16k32n4k30p3l49P8k85j70j53J72l31j46l18n3k04Q6p0J78p4K40r3J63m5
775A570Q2j18J01p8O8m4J70N7K16j19J23J07J47l8O1j53J36r8J40q3K07n4j7m6R4PJ27J7J37
768B719j9R2O2J33O7J09L7J85J15M2J37K96J73K24J22J68j5N9RJ88K00o5J11J66L7K44K50
761E846K58J33J56L13K13J36K01K53K27J92K41K35L28M46M27L91M23L96L93M52M43M82M18
756A3003N18N28Q14R77J184J381J583J806K278K685L636M065M681N603O782Q612J2777J9212
$$ plain form
800 4768 4818 4676 4975 5219 5707 6009 6150 5924 5853 5537 5563 5250 5366 5333 5659 5941 6623 7170 8100 8823 9451 9637 9597 9038 8936
794 8936 8589 8189 7623 7135 6273 5932 5355 5243 5086 5395 5350 5564 5530 5537 5314 5388 5189 5229 5289 5811 6211 6822 7067 7563 7720 8122
788 8122 7775 7538 7077 6808 6294 6005 5297 4867 4210 3794 3111 2829 2484 2450 2456 2731 2705 2939 2747 2781 2507 2550 2569 2993 3128 3274
782 3274 3198 3446 3417 3533 3301 3247 3017 2944 2595 2673 2388 2218 2065 2237 1906 1760 1442 1389 1185 1271 1201 1379 1305 1545 1452 1615 1570
775 1570 1652 1534 1635 1557 1625 1581 1751 1808 2024 1905 2028 2135 2282 2244 2305 2152 2288 2190 2330 2247 2454 2400 2383 2337 2431 2438 2565 2582 2719
768 2719 2700 2792 2854 2987 3054 3163 3200 3385 3500 3542 3679 3975 4148 4372 4494 4662 4647 4706 4715 4903 5103 5038 5149 5315 5352 5596 5846
761 5846 6104 6237 6393 6706 6919 7055 7256 7509 7736 7928 8169 8404 8732 9178 9605 9996 10419 10815 11208 11660 12103 12585 13003
756 13003 13521 14049 14863 15840 17024 18405 19988 21794 24072 26757 30393 34458 39139 44742 51524 60136 72913 92125
751I2125K7767L4076L2185J6400n275j9699k2585j9679j5302j1797q739o874m896l175j195
748H3337P76L123N194P819J0174J3286J5848J9597K3153K5486K6770L0504L5683M1612M6331
744C88693M9897N1070M6402K8607M52k8300m5066m6497m0286l5602l2282k9119k4283k0333
741B63353j7436j4221r143m299J083N930J2083J7734K4410L0002L4097L7432M5402N6502O7868
737E50797P5152P6220O8567N3235K6193q411m3345p0891q3867p6552o0312m7250m2363l9145
733C78028l4821k8898k5527k4081k2404j7982j2739n760Q74P420J1924J5170J8137K5684L6257
730C21282M8284N8733O6106O4605N2922L1481J2928n106l4434p2604r3672q3531n9342m2683
726B64969l2984k7044k2212k0555k0154j9134j5667j2760r985q028n117l012n79R05L045M940
$$ plain form
751 92125 119892 153968 186153 202553 197278 177579 154994 135315 120013 108216 99477 92603 87707 84532 83337
748 83337 84113 87236 92430 100249 110423 123709 139557 159154 182307 207793 234563 265067 300750 342362 388693
744 388693 438590 489660 536062 564669 565121 536821 491755 445258 404972 369370 337088 307969 283686 263353
741 263353 245917 231696 222553 218254 219337 225267 237350 255084 279494 309496 343593 381025 426427 482929 550797
737 550797 625949 702169 770736 823971 850164 841753 798408 727517 643650 567098 506786 459536 417173 378028
733 378028 343207 314309 288782 264701 242297 224315 211576 205816 206690 214110 226034 241204 259341 285025 321282
730 321282 369566 428299 494405 559010 611932 643413 656341 651235 616801 544197 450525 366994 307652 264969
726 264969 231985 204941 182729 162174 142020 122886 107219 94459 84474 76446 71329 68317 67738 68643 71688 76628
722G6628P786J1116J6416K3381L2880M0831M1899K4819j1276m7645n7999m6967l0676j8963
719F2230j1527p689n378m845m002m084l280k807j820j636j015r46m98q60n53p49k01o00l74
714I366n52j57n23l78m91j80l91j69l73j99l62J16k14q1l3K25j82j85k09j8L8K24P5K32p3
708E506j21k11K7j77k18k53k25k31k22k79j83l61p5j04j3nJ8l2J9q2M5J0K0M9J4Q6K12J64
701C378m4l4N9K03J97pq5j0K41l9j42P6j22k29k44j83k77j86j46j90l22L4l5k14q4J67r0p5
695A597P3K58m8J2o2Q8j7K43N6J47QK36jR1O8K82o9J44Q9L53R0L59k8K05L8J89J45M29j15
687D860K61P5L19j1K69J94K93k06K47Q2K35p4L56J42M64K70O73L01O26L73J025N73P03O8L01
681A2419L5J53k06L54m9K29j97M83j64K49P3J57l09O4k55K98K4N13J86N74O6N51Q4N21K13
$$ plain form
722 76628 84414 95530 111946 135327 168207 209038 250937 275756 264480 216835 158836 111869 81193 62230
719 62230 50703 43014 37636 32791 28789 24705 21425 18618 16798 15162 14147 13201 12703 11843 11290 10541 10340 9740 9366
714 9366 8814 8657 8134 7756 7265 7085 6694 6525 6152 5953 5591 5707 5493 5412 5379 5604 5422 5237 5028 5010 5048 5272 5347 5579 5506
708 5506 5385 5174 5201 5024 4806 4553 4328 4097 3875 3596 3413 3052 2977 2873 2860 2855 2873 2841 2860 2778 2823 2833 2853 2902 2916 3002 3214 3378
701 3378 3334 3300 3359 3562 3759 3752 3667 3657 3898 3859 3717 3793 3671 3442 3198 3015 2738 2552 2406 2216 1894 1928 1893 1679 1595 1762 1672 1597
695 1597 1670 1928 1880 1892 1830 1918 1901 2144 2200 2347 2355 2591 2590 2681 2749 3031 2962 3106 3195 3548 3638 3997 3969 4174 4212 4401 4546 4975 4860
687 4860 5121 5196 5515 5504 5773 5967 6260 6054 6301 6383 6618 6544 6900 7042 7506 7776 8449 8750 9376 9749 10774 11347 12050 12118 12419
681 12419 12454 12607 12401 12755 12706 12935 12738 13221 13057 13306 13379 13536 13227 13291 13036 13334 13358 13871 14057 14631 14697 15248 15332 15853 16066
675A6066P90N63Q56J60K19m35q2n81m0m61J90j97L04RM82k91J11o06l61o19j15m38J03n5L49
669A5921L8N68J96Q20N81Q39L45P80m0Q5n61l64p98m80r15l05o10o4n21j17m36r5p74l65p55
663A2973k60q10m52o08O5n30n5m72J22j92J91j46K36k44L7o09j21m29J4l79J31k59J93k16
657H180J92J24N20qP9l06j67n23k8m79Kj28K3l35O0j05L74j46J47p0J56r1J64O1L05k2N19
651H498J08K22J21M37N01R15O32O80M10M33J08N10P33J019J371J718J833K761L772N753Q604
645D1139J3334J9835K4657K0656j188k4757k7017j9197j1808p341m588l035j776j052m73j44
642A7245ll21m89m74m50m23l72j70l59m33k45k44k87j95k02j9P3N26N85N58O4K62P9j43m62
635A4101m27k54J54M9L70L67N09K88L09j55k51m88J56J9K30K7L68N2J26m77o8k91J58k46P2
$$ plain form
675 16066 16856 17419 18275 18435 18654 18219 18137 17556 17516 17055 17245 17048 17352 17361 17843 17552 17663 17057 16696 16077 15962 15524 15627 15572 15921
669 15921 15959 16527 16723 17543 18124 18963 19308 20088 20048 20133 19572 19208 18410 17930 17015 16710 16100 16036 15515 15398 14962 14867 14093 13728 12973
663 12973 12713 11903 11451 10843 10908 10378 10323 9851 9973 9781 9972 9826 10062 9818 9855 9246 9125 8696 8710 8331 8462 8203 8396 8180
657 8180 8372 8496 9016 9008 9087 8781 8614 8091 8063 7584 7586 7458 7481 7146 7206 7101 7475 7329 7476 7406 7562 7471 7635 7696 8001 7979 8498
651 8498 8606 8828 8949 9386 9887 10802 11434 12114 12524 12957 13065 13575 14308 15327 16698 18416 20249 23010 26782 32535 41139
645 41139 54473 74308 98965 119621 118433 93676 66659 47462 35654 28313 23725 20690 18914 17862 17389 17245
642 17245 17242 16921 16432 15958 15508 15085 14713 14543 14184 13751 13506 13262 12975 12780 12578 12559 12632 13158 13743 14301 14365 14627 14706 14563 14101
635 14101 13674 13420 13574 13623 13993 14360 14869 15157 15466 15311 15060 14572 14728 14747 14977 15004 15372 15424 15550 15073 15005 14714 14872 14626 14698
629A4698k00M27J2K88j31L34M3L76l0M90J07N95MK66l15K84j00K62j66K47m32K83l60K22j44
623A7060P08J81O61p4L62l00L98j80N11R8Q25K35Q02J90P93J76Q67L07R79N54J362R07J812
618B9234J383J972J046J931J552K680K323L592L574N007N234O649N691N143L154K898J650
613H4713K740L272N134N548O747N531M455J679R66k86J305K453N886P136R091Q554Q963Q051
609A71938R328R261J0947J1297J3138J3950J5924J5330J4955J2361J0672P446N882K467L09
605C25205k442j061J007M338L333J787j00L01j195j173j399M50J672M878P452J2875J7377
601C73305K2826K5650K7421K5265K2005J5282Q162j372p520q824n008l430k275k618p03J009
597D89175M511N014L428J23n71j165j682m346n917p165n628m431j856M63L709O042Q194Q073
$$ plain form
629 14698 14498 14925 14937 15225 15094 15428 15471 15847 15817 16307 16414 17009 17013 17279 16964 17248 17148 17410 17244 17491 17059 17342 16982 17204 17060
623 17060 17768 17949 18610 18536 18898 18598 18996 18816 19327 19425 20250 20485 21287 21477 22270 22446 23313 23620 24599 25153 26515 27422 29234
618 29234 30617 32589 33635 35566 37118 39798 42121 45713 49287 54294 59528 66177 71868 77011 80165 83063 84713
613 84713 87453 90725 95859 101407 108154 113685 118140 119819 120785 120499 121804 124257 130143 137279 146370 154924 163887 171938
609 171938 181266 190527 201474 212771 225909 239859 255783 271113 286068 298429 309101 316547 322429 324896 325205
605 325205 322763 321702 322709 327047 330380 332167 332067 332368 331173 330000 328601 329051 330723 335601 343053 355928 373305
601 373305 396131 421781 449202 474467 496472 511754 519916 518544 511024 502200 497192 493762 491487 488869 488166 489175
597 489175 493686 498700 502128 502251 501680 500515 498833 494487 488570 481405 475777 471346 469490 469953 473662 479704 487898 495971
593D95971R500J1016J1126R015P894N838M680L034L057K256j459q560j1410r642l007M518
589E33827Q635N055j531n699m484j815J974P564J5277K1351K3695K2769K1738J9549J7003
585F84908J5688J5737J1591L70j5372k5995k6227j9502j3584q402j937N184J2586J9263K5499
582F79807L1757L7287M0409M0379L7314L1551K3494J7841J9421K6084L1589L5106L7209L9258
578A128506L6108K5159R036j801p323j0581j0781n056j352k224j939M133J5933L3163M7160
575A258141N5641N9322O1390N0098K6687P753P787J6989K5065K7463L2692M5811O8552Q8995
571A832386R6719Q5274O8674N1014K9911M205j7255l1987l4784l3662l9507n3671n8850n3351
568A845116l5344j4444k055j1719l5243p2698j02918j13455j02771q8354p6449o7421n2203
$$ plain form
593 495971 505471 516487 527613 536628 544522 550360 555040 558074 561131 563387 561928 553368 541958 532316 529309 533827
589 533827 542462 547517 545986 540287 535803 533988 535962 543526 558803 580154 603849 626618 648356 667905 684908
585 684908 700596 716333 727924 728294 712922 686927 660700 641198 627614 619212 617275 622459 635045 654308 679807
582 679807 711564 748851 789260 829639 866953 898504 921998 939839 959260 985344 1016933 1052039 1089248 1128506
578 1128506 1164614 1189773 1198809 1197008 1189685 1179104 1168323 1163267 1161915 1159691 1157752 1161885 1177818 1210981 1258141
575 1258141 1313782 1373104 1434494 1484592 1511279 1519032 1526819 1543808 1568873 1596336 1629028 1674839 1743391 1832386
571 1832386 1929105 2014379 2083053 2134067 2163978 2168183 2150928 2118941 2084157 2050495 2010988 1957317 1898467 1845116
568 1845116 1809772 1795328 1793273 1781554 1746311 1673613 1570695 1457240 1354469 1266115 1189666 1122245 1070042
564A070042l9599m7380p6979r0035p8408n6763m3684l3665k5792j9299k2545k4530k6717k2791
561D61855j7863q798n576j646l52P28q895j6000j4822o503j975l48l292k023j467K837L014
557C78874K887l224k790l475k748p907p882r489l065j183l679q471m477K717R905R915Q281
553C54189j70j187R24J1129J8721K7204K0130J4056P628J0240J4031J1417o71J137J0979K6817
549E26574L4299L6860L1284K2017n73l4804p6798q0410n4649k5406p784M528J1145J7723J5640
545D19646R775J071n785j0662L382J1169N297q555j5114j1250o214k664M066M413J4987J1489
541D25051P809O693P72j1574j5640j8633j5899j2018J568J2290K0026J6681J8041J3804J1154
538D60125J5874K7090J7274J3063O203M768J3980K5719K0058R896R924J4560l295J122J7290
$$ plain form
564 1070042 1030443 983063 906084 816049 737641 680878 637194 603529 577737 558438 535893 511363 484646 461855
561 461855 443992 435194 429618 427972 427620 428348 419453 403453 388631 382128 380153 379805 376513 374490 373023 375860 378874
557 378874 381761 378537 375747 372272 369524 361617 353735 344246 341181 339998 336319 327848 323371 326088 335993 345908 354189
553 354189 354019 352832 353756 364885 383606 410810 430940 444996 452624 462864 476895 488312 487641 488778 499757 526574
549 526574 560873 597733 629017 651034 650461 615657 538859 458449 403800 378394 370610 375138 386283 404006 419646
545 419646 429421 430492 424707 414045 417427 428596 433893 425338 410224 398974 392760 390096 394162 398575 413562 425051
541 425051 432860 439553 440325 428751 413111 394478 378579 366561 368129 380419 400445 417126 435167 448971 460125
538 460125 475999 503089 520363 533426 539629 544397 558377 584096 604154 614050 623974 638534 635239 636361 653651
534F53651L6019L5775K7505J2794j8036m0641l4891l4167k5603l3989n2924n2690k5708j8215
530D28880l1296m1482l7824l4320k8881k6773k0194j5039j2084r622J62M412q574j3706m703
527A48956k089n42j963K90j3754j1890l677K394k289k153l424l823l884R11n05j84l013J802
522A01163j086M736O509K0223L0223P6321J16633J78334K5442k23496j39568o0322k0458r694
519A04960r14l054K27j2049r562o123p28j752P28j44M046K837M494K280N031M244P841J4138
515A16500K8660O3124J09868J65261R5152j87123j60063p0797l1748j6056l671k510N558P96
511A12951L488j412N188R2O706P34P560N117J6827Q346J6278J7666L1853K6389M1908M2702
507C42393O5192O5409Q9509R2533J20342J23270J96931L22596O17744J143287J969694K544376
$$ plain form
534 653651 689670 725445 752950 765744 747708 707067 672176 638009 612406 578417 525493 472803 447095 428880
530 428880 397584 356102 318278 283958 255077 228304 208110 193071 180987 171365 171527 175939 167365 153659 148956
527 148956 146867 146325 144362 144652 130898 119008 115331 117725 115436 113283 109859 106036 102152 103063 102558 102374 99361 101163
522 101163 100077 104813 111322 131545 161768 238089 354722 533056 558498 335002 195434 135112 114654 104960
519 104960 104046 100992 101219 89170 79608 73485 72757 71005 71733 71589 75635 78472 82966 85246 90277 94521 102362 116500
515 116500 145160 208284 318152 483413 578565 391442 231379 160582 128834 112778 109107 106597 112155 112951
511 112951 116439 115027 120215 120307 127013 127747 135307 140424 157251 165597 181875 199541 231394 257783 299691 342393
507 342393 407585 472994 562503 655036 775378 898648 1095579 1418175 2035919 3179206 5148900 7693276
504G693276K001563j367533l252985k142090j131594n64418l26034j69580r5185l9005n3427
502E52988n3114m2082k4700q838J1266L4928M9871O7944P2765R3589J03522J59991K48326
498A266456M85803Q93301J671661K339818K427912j39461l060785k527860j368684o85386
496A302775l88063k05046j30003n5657o3091o6829p6706n0744n0654k6778k7341r158j4444
493A38261n236j6879m670r741n041j4318m655j0370k394q343r89o104R12m392Q90n123O70
489D2478m562N19l759J284k694L146k67M079l290k988o009k3k777J085k038J644j780J585
484B5633j688O18k909M81j841J184j438J075j958J54k469L99q56J292j317J053k59K457K615
480B2226P835N401k251r432m098k916M1q19R16n61J01j677qj104J33j037M7q91J12j201j96
$$ plain form
504 7693276 9694839 8327306 5074321 2932231 1800637 1236219 910185 740605 645420 606415 552988
502 552988 499874 457792 433092 424254 435520 470448 520319 588263 661028 754617 858139 1018130 1266456
498 1266456 1752259 2645560 4317221 6657039 9084951 8945490 5884705 3356845 1988161 1302775
496 1302775 914712 709666 579663 524006 460915 394086 317380 266636 215982 189204 161863 152705 138261
493 138261 133025 116146 111476 101735 96694 82376 77721 67351 64957 56614 55625 49521 50433 46041 46931 41808 42478
489 42478 37916 38435 34676 35960 33266 36412 36145 40224 36934 33946 27937 27914 25137 26222 24184 25828 24048 25633
484 25633 23945 24563 21654 22135 20294 21478 20040 21115 19157 19311 16842 17241 16385 17677 16360 17413 17154 19611 22226
480 22226 30061 35462 33211 23779 19681 16765 16806 15987 16903 16342 16443 14766 14758 13654 13787 12750 12797 11906 12018 10817 10621
474A0621p71M43m31M01o2J094M10M21J43K107K903K748k376m108k913r46n26j1j25P5o5on01
469H525k82k60j07J3j72l08q1l5j74l3j91J61J41o6o34k21j86K38j1J05m86j40n91m7l49K72
463E081j11L69j31J46m22K7n98L17j32L43m53L50l44L82j7O16k71K90k85O31K3J175L00O37
457G923j272j097j512J09l29Q96K1N57o86J48p30N32k51N76n55M85m77P47k82R93k67O64n22
451E671O07k47J184K25J029p24nj209L72j49Q03j64J144J73Q44j276p8r88L83q60O27l84J032
445H010MJ305J85J742l43j19j016N06k87J143K93J564J079L033K411K219J332O093Q771J1662
440D9587N391n598j3502r730o752k822k390l70j069N87m55J006j69J030j36P84o03R07p0J596
436A7222N98J870R15K784K930O265Q344J2225Q358j453j1306r987q240l850k327O54O59K137
$$ plain form
474 10621 9850 10293 9862 10263 10201 11295 11705 12126 12269 14376 17279 20027 17651 13543 10630 9684 9158 9147 9022 9097 9032 9026 8525
469 8525 8243 7983 7876 7889 7717 7409 7328 7293 7119 7086 6895 7056 7197 7131 6497 6276 6090 6328 6317 6422 5936 5796 5205 5158 4809 5081
463 5081 4970 5339 5208 5354 4932 4959 4361 4678 4546 4889 4436 4786 4442 4824 4807 5423 5152 5442 5157 5788 5811 6986 7286 7923
457 7923 6651 5554 4042 4151 3822 4718 4739 5296 4610 4758 4028 4560 4309 4885 4330 4815 4338 5085 4803 5796 5529 6193 5671
451 5671 6278 6031 7215 7440 8469 7745 7740 6531 6903 6754 7557 7393 8537 8710 9554 8278 8200 7212 7595 6735 7362 6978 8010
445 8010 8014 9319 9504 11246 10903 10784 9768 10274 9987 11130 11423 12987 14066 17099 19510 21729 23061 29154 37925 49587
440 49587 54978 49380 35878 26148 19396 16574 14184 13814 12745 13332 12877 13883 13714 14744 14608 15392 14789 15696 15626 17222
436 17222 17820 19690 20605 23389 26319 32584 40928 53153 61511 60058 48752 38765 30525 26675 24348 25002 25661 27798
431B7798Q81K71k425n29q49P60N79L245J314K119K463N050L713N736O097R769J0684J1053
427H7729R598J6077K0080K9482M9451R7079K04833M05358O43619N98646k08840q31452n72365
424E49295k40527j05842n3783k7969j4414p375l884k329o182n701J874Q451R384O768Q251
420A16017J4977J9735J8552K0019K7883L5326N1986J01251J99439M58710Q77521J367788J018611
417D327815q72057j658758r20316l90639j69435r0645m4006k4764j0934j1118r972j7360j1991
414I5820l761O741o75o031j995M969P224J2111J0017R020J2041K5933N4652J14145K53370
410E93581M60376O62198L81443n48753p73590l89463j65215p2922m0220j9825j0290n172m812
407F7336o294p496n217j812j147n005n469k318j727m55J386J67k858j977j031j116j924j100
$$ plain form
431 27798 28679 28950 26525 25996 25147 25907 26486 29731 31045 33164 35627 40677 44390 50126 56223 65992 76676 87729
427 87729 97327 113404 133484 162966 212417 309496 514329 919687 1563306 2161952 1953112 1121660 549295
424 549295 308768 202926 149143 121174 106760 99385 95501 93172 86990 81289 83163 91614 100998 107766 116017
420 116017 130994 150729 169281 189300 217183 252509 304495 405746 605185 1063895 1941416 3309204 4327815
417 4327815 3455758 1797000 876684 486045 316610 225965 181959 157195 146261 135143 125171 107811 95820
414 95820 92059 98800 98125 92094 90099 95068 102292 114403 124420 133440 145481 171414 226066 340211 593581
410 593581 1053957 1716155 2097598 1548845 775255 385792 220577 147655 107435 87610 77320 72148 67336
407 67336 61042 53546 48329 46517 45370 40365 34896 32578 30851 30396 31782 31949 29091 27114 26083 24967 23043 21943
402B1943l73N70J260K192K041O98o84k04r11N09J303K817J424O07p61p75p68J08N21J735m
397C3248j326j873l62Q84K750K111%j586N4J12O89K92J597J891L124L326M446M284N161N537
392F4359P391P536O475L443M739R496K2850L9697N7564N5573K9083q609j9845j1615l631k143
388B62363K868K0952N4310Q7919R8356M7344l3448o9828m7971k3493m548k043L979L394M131
385D04285N916J1457R125J7496M5674J06854J50657J52686o9410k11073j20517m4986k896
382D55268M0332Q1358J70170K67818L72737J59452m11116l90044k06663j11215o9014n4284
379C04799m0900j9513p454Q36m804l54Q649K5292L5183L8454L0286J1666k0852m5293m6849
375B69146k4736K748L0640N0534P0055Q6817P6014j5240j00826j21066r7594o1946l4921k4562
$$ plain form
402 21943 21570 22140 23400 25592 27633 28331 27647 27443 26532 27041 28344 31161 32585 33192 32431 31656 30888 30996 31517 33252 33248
397 33248 31922 30049 29687 30571 33321 35432 35432 33846 33900 34012 34701 34993 36590 38481 41605 44931 49377 53661 58822 64359
392 64359 71750 79286 85761 89204 93943 103439 126289 165986 223550 279123 308206 299597 279752 268137 264506 262363
388 262363 265231 286183 340493 428412 526768 574112 540664 470836 422865 399372 394824 392781 396760 400154 404285
385 404285 410201 421658 430783 448279 493953 600807 751464 904150 834740 623667 503150 458164 455268
382 455268 495600 576958 747128 1014946 1387683 1547135 1136019 745975 539312 428097 359083 304799
379 304799 263899 244386 236932 237768 232964 232610 241259 266551 301734 340188 370474 382140 361288 315995 269146
375 269146 244410 247158 277798 328332 398387 485204 561218 545978 445152 324086 226492 164546 129625 105063
372A05063j7848j2459p825n058k212l079l288l077j866n289o599m910l372k822j335p35N24
367B3813O76l23l062l015k102j048r87q34q76l35m38j68m04j9j09L9K2M59M56R44O71M90m64
362A3386m62L59K334M907M586l192p770m163j687o51n91m13l85k55k10j93m17k8M8J09l44
357D968k47k84j79j23J20r6K19M4K38M13J350K438N139P633M777o425q720m579j667q63m05
351C751n31o4l52k5j37L15j66n2l74J7m50J1k44K18j57K10j96L07m0N04L46J545K363L899
346A0698J416l471m080j747j087k01o81P6l41K19k37K63j94J62l06J62l12K13l49K46k66L71
340E54k67K39m49R2l61K78l24L28k83L53j46K33l77J86k89K62k60K49l63K76k50L87l25L45
334H8k70L66l00L14l83L54j13K31n23K24l10J79l13L50l46L57k73L65k54K30k28K64k31L56
$$ plain form
372 105063 87215 74756 66931 61873 59661 56582 53294 50217 48351 43062 36463 31553 28181 25359 24024 23289 23813
367 23813 24489 24166 21104 18089 15987 14939 13952 13118 12242 11907 11469 11301 10897 10878 10769 10808 10830 11289 11745 12689 13360 13850 13386
362 13386 12924 13283 15617 20524 25110 21918 14148 9985 8298 7647 7056 6643 6258 6003 5793 5600 5183 5155 5203 5312 4968
357 4968 4721 4437 4258 4135 4255 4159 4378 4422 4660 5073 6423 8861 14000 21633 26410 19985 11265 6686 5019 4156 3751
351 3751 3220 3156 2804 2779 2642 2957 2791 2739 2365 2382 1932 1943 1699 1917 1760 1970 1774 2081 2041 2545 2891 4436 6799 10698
346 10698 12114 8643 4563 2816 1729 1528 847 923 582 801 564 827 633 795 489 651 339 552 203 449 183 554
340 554 287 526 77 169 -192 86 -238 90 -193 160 14 247 -130 56 -233 29 -231 18 -345 -69 -319 68 -257 88
334 88 -182 184 -116 198 -185 169 56 287 -236 -12 -322 -143 -456 -106 -452 -95 -368 -3 -257 -27 -255 9 -222 134
328A34k88L16k26M02j27P08P2K99l22J54l49K27k05M86J43O67L06O02o84r9m93Q9m66J90m38
322A098J98k89K99k66L01q3N14K52J089O43N93j260p44p49J90j04M56M66J724J939K386j553
317G100k783j859p01q72j04n27M2k89K50j60K10j02J87q0N12J55N88o8k4o50k17k58K59m5
311E64N67M57Q56L39k46j154o67p93j70l47P2j62L1j41J66j80R4n7J17k16J69j26m1j88J03
305i53p2N5m2N3o6K02k90J44L6J03j16J15j54P2oJ79O7j5m8N6P3K74J60O4l1o8k00p9p5l6
298e98j50r7j30k1r8jK1n4k9o0k3J2J20P0n4n1rk1P9j11j6Ql7j16J15N5M2l2J5j20N3oJ57
290a087j05mj50J67r7O2q1J14p0J26k69L7J0J07j00J76q6R5j44J10p3K19o6M6o9J05p2J59
283i40j84k8j48K17p1K27k81J09p5J01k04J47j15K40j47N9k22K18k28J21o9K61k10J95j04
$$ plain form
328 134 -154 162 -64 338 211 919 991 1290 968 1122 773 1000 795 1281 1424 2091 2397 2999 2315 2216 1723 1812 1346 1536 1098
322 1098 1296 1007 1306 1040 1341 1258 1772 2024 3113 3756 4349 3089 2345 1596 1786 1682 2138 2604 4328 6267 8653 7100
317 7100 4317 2458 1757 885 781 254 296 7 257 97 307 205 392 312 824 979 1567 1499 1475 825 608 350 609 564
311 564 1131 1588 2444 2783 2537 1383 716 -77 -247 -594 -522 -684 -653 -794 -628 -808 -714 -771 -654 -870 -701 -827 -868 -1056 -953
305 -953 -1025 -970 -1012 -959 -1025 -823 -1113 -969 -933 -830 -946 -831 -985 -913 -919 -740 -673 -688 -736 -680 -607 -333 -173 -109 -140 -208 -408 -487 -562 -598
298 -598 -748 -845 -975 -996 -1094 -1095 -1074 -1128 -1157 -1217 -1240 -1228 -1108 -1038 -1092 -1143 -1152 -1173 -1094 -1205 -1221 -1213 -1250 -1366 -1251 -1196 -1154 -1186 -1171 -1291 -1238 -1244 -1087
290 -1087 -1192 -1196 -1346 -1179 -1276 -1214 -1295 -1181 -1251 -1125 -1394 -1357 -1347 -1240 -1340 -1164 -1250 -1155 -1299 -1189 -1262 -1043 -1109 -1063 -1132 -1027 -1099 -940
283 -940 -1124 -1152 -1300 -1083 -1154 -927 -1208 -1099 -1174 -1073 -1277 -1130 -1245 -1005 -1152 -1093 -1315 -1097 -1325 -1204 -1273 -1012 -1222 -1027 -1131
277a131J02j80K67j84Mj43L15k10J15k71J99j93J02j72K13k29K56o9J13k19K02j41K40l04
271a318K01k30J70j34J63j93J6j70K22k48K91k32J13r1K30k69J35p6J09p8L01l99J33j68J20
265a402j30L39j55K70k15P5j63K78k35J03j49J65k51K10j19J63j81J59k33K52o5K71j95R8
259a110k16J71j60J26j58R9k29K42j22J13r5J75j00K73k38J32l05J49MM9k58J88o8J05j26
253a359J30l6K22j71J61j3J59j87J7j23Q4j71J49j63R0j53M4q9J32r1J78q8K06j19R2l5R5
246a039nQ6k18j07n9Q7j7J25jNl7lM1J4j63J22l4rj06N1PL9j18N7l5l1o8R7M0M4k8q1R8N4
238a192p2jj75J33j8K7o9P5J5O5o1j28l8%k9o6P9M0J18p7l1q3MQ5K5j8o1j1R7n9L2j59QO6
229a479J94j57M3k7J06j41k1L0R0K7J32j29mj03J54k40N6p9J04K5J13q6qj60J39j9Oj79K09
$$ plain form
277 -1131 -1029 -1209 -942 -1126 -1122 -1265 -950 -1160 -1045 -1316 -1117 -1310 -1208 -1380 -1167 -1396 -1140 -1209 -1096 -1315 -1113 -1254 -1014 -1318
271 -1318 -1117 -1347 -1177 -1311 -1148 -1341 -1325 -1495 -1273 -1521 -1230 -1462 -1349 -1440 -1210 -1479 -1344 -1420 -1311 -1389 -1088 -1487 -1354 -1522 -1402
265 -1402 -1532 -1193 -1348 -1078 -1293 -1218 -1381 -1103 -1338 -1235 -1384 -1219 -1470 -1260 -1379 -1216 -1397 -1238 -1471 -1219 -1284 -1013 -1208 -1110
259 -1110 -1326 -1155 -1315 -1189 -1347 -1248 -1477 -1235 -1357 -1244 -1339 -1164 -1264 -991 -1229 -1097 -1402 -1253 -1249 -1200 -1458 -1270 -1338 -1233 -1359
253 -1359 -1229 -1265 -1043 -1214 -1053 -1066 -907 -1094 -1077 -1200 -1116 -1287 -1138 -1301 -1211 -1364 -1320 -1409 -1277 -1368 -1190 -1278 -1072 -1191 -1099 -1134 -1039
246 -1039 -1044 -958 -1176 -1283 -1342 -1255 -1272 -1147 -1148 -1143 -1180 -1183 -1142 -1128 -1291 -1169 -1203 -1212 -1318 -1267 -1260 -1221 -1339 -1282 -1317 -1348 -1416 -1319 -1279 -1235 -1263 -1344 -1246 -1192
238 -1192 -1264 -1265 -1440 -1307 -1325 -1298 -1367 -1292 -1277 -1212 -1273 -1401 -1439 -1439 -1468 -1534 -1455 -1415 -1297 -1374 -1405 -1488 -1484 -1399 -1374 -1392 -1453 -1464 -1367 -1426 -1394 -1553 -1545 -1479
229 -1479 -1285 -1442 -1399 -1426 -1320 -1461 -1482 -1452 -1362 -1335 -1203 -1332 -1336 -1439 -1285 -1525 -1469 -1548 -1444 -1419 -1306 -1392 -1400 -1560 -1421 -1440 -1434 -1613 -1404
222a404p5J39p8P0j06J14o0J61k28J66l9K7j86J44q9J17k24K76n1moM9k70J12j10J89j04J81
216a289k87P8M1J56k70J90j54J61j09J83j32J54j46J35j95K07k27R2j73J10j39J57OJ70j70
209a451J80j59J12k12K26j84J98j58J5j16J09l6K32j87J62j41P0j26J25o0J37k29K18k60r
203a544k9K16r4J10m9J78l61J40j39K50j58R7j38J46j47J49j36K23j94J05r4J12o3N0q1Qj46
197a589J63j21J27o8J84j27J12j99K05j81K12j20N3j09M8k7J59j56j04l3O0j80J73j05Q4O5
190a474J24r2L2r6J52j02M2j48Q0j2J21m4k4m2R9k4l1j31O8l0K12j19J38n0lK6J4p6l3RJ45
183a269j30J0q1j01L1N5o7M6R4k9Lr1p9J53p3K4R0l9J01Q8k8j29l6P1n8k8N1J1P1j48k4J40
175a371Kl2jJ1O9j2o3j03o8k0J97k4j7LL2q0N9k2l8J04m1j38J14p8R1n6K1nJ3K1O4j27p4j05
$$ plain form
222 -1404 -1479 -1340 -1418 -1348 -1454 -1340 -1400 -1239 -1467 -1301 -1340 -1313 -1499 -1355 -1444 -1327 -1551 -1275 -1326 -1330 -1336 -1287 -1557 -1445 -1555 -1366 -1470 -1289
216 -1289 -1576 -1498 -1457 -1301 -1571 -1381 -1535 -1374 -1483 -1300 -1432 -1278 -1424 -1289 -1484 -1277 -1504 -1412 -1585 -1475 -1614 -1457 -1451 -1281 -1451
209 -1451 -1271 -1430 -1318 -1530 -1304 -1488 -1290 -1448 -1433 -1549 -1440 -1476 -1244 -1431 -1269 -1410 -1340 -1466 -1341 -1401 -1264 -1493 -1275 -1535 -1544
203 -1544 -1573 -1357 -1451 -1341 -1390 -1212 -1573 -1433 -1572 -1322 -1480 -1383 -1521 -1375 -1522 -1373 -1509 -1286 -1480 -1375 -1469 -1357 -1420 -1370 -1451 -1443 -1589
197 -1589 -1426 -1547 -1420 -1488 -1304 -1431 -1319 -1518 -1313 -1494 -1282 -1402 -1349 -1458 -1410 -1437 -1278 -1434 -1538 -1571 -1511 -1691 -1518 -1623 -1539 -1474
190 -1474 -1350 -1442 -1410 -1506 -1354 -1456 -1414 -1562 -1482 -1494 -1373 -1417 -1441 -1483 -1384 -1408 -1439 -1570 -1502 -1532 -1320 -1439 -1301 -1351 -1354 -1328 -1314 -1390 -1423 -1414 -1269
183 -1269 -1399 -1389 -1470 -1571 -1540 -1485 -1552 -1506 -1412 -1441 -1438 -1529 -1608 -1455 -1528 -1504 -1414 -1453 -1352 -1264 -1292 -1421 -1457 -1386 -1444 -1472 -1421 -1410 -1339 -1487 -1511 -1371
175 -1371 -1369 -1401 -1402 -1391 -1322 -1334 -1397 -1500 -1568 -1588 -1391 -1415 -1432 -1429 -1397 -1477 -1418 -1440 -1478 -1374 -1415 -1553 -1439 -1517 -1426 -1482 -1461 -1466 -1453 -1432 -1368 -1495 -1569 -1674
167a674J41n6L3p5J33j9R4j59O4M8J63j40L1j80J84j05L0j23O1r2J95j6Q7q7J55r7P8n9N2
160a333pJ53j50p4l6K35j60J8j64J56o1J54j53J13p7J72j46Jj11R2j92Q1J4J14k18K07j36
153a508J75p9Ro0J33k10Pj08K62p9J09j37J01j65J01j21R0j63J30j37J33L2R8k01J82r8O3
146a441j32J01p6K04k03J13j11J46j91J65l0J52j71K52j65M3o8p0KJ58k30J17n5Q0j64Q3K1
140a470J5o3J58k58O7M5L1j40J40k06J79l8J16n1N4j27R1n8L3k5J11j3J08k43Q0j54J37NN0
133a426K0J9j07J99p0K0p7j4j34J19l1J47k14P1j12J85j3P5k7koQ5l8n1j0M9l7J2o8N2k0R0
125a314p4P4J9P5r1J02O4J82K09J81n3p3j41j99J01J61J9P1j42j55o3r0m0J85J67L80K18J20
118a07Q5R1J51J38J51m1j35k68k40NQ0j8p5l43k58p9mJ60J94K36J36J85J59k7N6J15K31o1
$$ plain form
167 -1674 -1533 -1589 -1556 -1631 -1498 -1517 -1423 -1582 -1518 -1470 -1307 -1447 -1416 -1596 -1412 -1517 -1487 -1610 -1549 -1641 -1446 -1462 -1375 -1462 -1307 -1404 -1326 -1385 -1333
160 -1333 -1340 -1187 -1337 -1411 -1447 -1212 -1372 -1354 -1518 -1362 -1423 -1269 -1422 -1309 -1386 -1214 -1360 -1359 -1470 -1378 -1570 -1489 -1475 -1361 -1579 -1372 -1508
153 -1508 -1333 -1412 -1403 -1463 -1330 -1540 -1533 -1641 -1379 -1458 -1349 -1486 -1385 -1550 -1449 -1570 -1480 -1643 -1513 -1650 -1517 -1485 -1387 -1588 -1406 -1504 -1441
146 -1441 -1573 -1472 -1548 -1344 -1547 -1434 -1545 -1399 -1590 -1425 -1455 -1303 -1474 -1222 -1387 -1344 -1412 -1482 -1480 -1322 -1552 -1435 -1490 -1410 -1574 -1491 -1470
140 -1470 -1455 -1518 -1360 -1618 -1551 -1506 -1475 -1615 -1475 -1681 -1502 -1540 -1424 -1475 -1421 -1548 -1457 -1515 -1482 -1507 -1396 -1409 -1301 -1544 -1464 -1618 -1481 -1476 -1426
133 -1426 -1406 -1387 -1494 -1295 -1365 -1345 -1422 -1436 -1570 -1451 -1482 -1335 -1549 -1478 -1590 -1405 -1418 -1343 -1370 -1372 -1378 -1293 -1331 -1382 -1392 -1343 -1380 -1368 -1436 -1384 -1404 -1314
125 -1314 -1388 -1314 -1295 -1220 -1311 -1209 -1145 -963 -754 -573 -626 -699 -840 -1039 -938 -777 -758 -687 -829 -984 -1047 -1137 -1177 -992 -825 -445 -227 -107
118 -107 -22 69 220 358 509 468 333 65 -175 -170 -90 -108 -183 -526 -784 -863 -867 -707 -513 -277 -141 44 203 176 232 347 578 517
111E17J1m35l11k56q7Pj6k93q8q9M0j19k8L1K35P0J34o6P8j75K0r6J67j72nk27oj50l1m5K5
104a360k41R6K5J28j13K4q2mo9K07j00L7r5J42p4J64q5J09j41K8o6J90j30J3K9Q7r5O0q7O2
96a341j27L0L2J29j75J15l4K8j65K03k05K8j87J66o9J46j2J53j19N7j50K05o6J39j17O3j19
90a392R2j10M3j25O1l6N0m9J59j65M3j9J9k24J52L6R4k3J23j71J3j18K30k1R3j26J42p1M4
82a256j23Rn2nj44J00j06K00p6O2p6K17j66N6j22J29J4O8j52J59q0Jq7J23p7J02p3k9j58J04
75a438k2M7q6n2K0K15j02RRQ0j45M8q2N4j09J58P8N8k44k5p4J18J35M1j11q0m7Q6m0J05j27
68a523L8J5lQ0P6o7J90q0o9l0n0j42P8K6M1kJ3mj1NP0l7k06Q0j3K0J07p6p2P9j5L4O1k2m9
59a458%Q8j4M1K5M5O7J67Q4l8l9k40j5j31k8M5N1j04n4k2J04l9MQ3P0J0R9j40n3M8N6K9r8
$$ plain form
111 517 528 93 -218 -474 -561 -554 -570 -863 -951 -1040 -1000 -1119 -1147 -1116 -881 -811 -677 -743 -665 -840 -820 -916 -749 -921 -926 -1153 -1159 -1309 -1340 -1385 -1360
104 -1360 -1601 -1505 -1480 -1352 -1465 -1441 -1523 -1527 -1596 -1389 -1489 -1452 -1547 -1405 -1479 -1315 -1400 -1291 -1432 -1404 -1470 -1280 -1410 -1397 -1368 -1281 -1376 -1316 -1403 -1341
96 -1341 -1468 -1438 -1406 -1277 -1452 -1337 -1371 -1343 -1508 -1305 -1510 -1482 -1669 -1503 -1572 -1426 -1438 -1285 -1404 -1347 -1497 -1292 -1358 -1219 -1336 -1273 -1392
90 -1392 -1300 -1410 -1367 -1492 -1431 -1467 -1417 -1466 -1307 -1472 -1429 -1448 -1429 -1653 -1501 -1465 -1371 -1394 -1271 -1442 -1429 -1547 -1317 -1338 -1245 -1371 -1229 -1300 -1256
82 -1256 -1379 -1370 -1422 -1427 -1571 -1471 -1577 -1377 -1453 -1391 -1467 -1250 -1416 -1360 -1482 -1353 -1339 -1271 -1423 -1264 -1344 -1343 -1430 -1307 -1384 -1282 -1355 -1384 -1542 -1438
75 -1438 -1460 -1413 -1499 -1551 -1531 -1316 -1418 -1409 -1400 -1320 -1465 -1417 -1499 -1445 -1554 -1396 -1318 -1260 -1504 -1529 -1603 -1485 -1350 -1309 -1420 -1500 -1547 -1461 -1501 -1396 -1523
68 -1523 -1485 -1470 -1473 -1393 -1317 -1384 -1194 -1274 -1343 -1373 -1423 -1565 -1487 -1461 -1420 -1422 -1409 -1413 -1424 -1419 -1349 -1386 -1592 -1512 -1525 -1505 -1398 -1474 -1546 -1467 -1482 -1448 -1387 -1409 -1458
59 -1458 -1458 -1370 -1384 -1343 -1318 -1273 -1206 -1039 -955 -993 -1032 -1272 -1287 -1418 -1446 -1401 -1350 -1454 -1508 -1530 -1426 -1465 -1461 -1378 -1308 -1298 -1199 -1339 -1392 -1344 -1288 -1259 -1357
51a357r1npJ14m1O0n4m7q1k3L7J08j7Mr8O8m7o5m8J39n6J00j6J23o9J1j74N0K0M9j98%k4J67
43a468j2N9j91Q9m4P3Q2J07r3N4n2J02j72Mk8J36r8J60l4J2l5M9j68k6j67K27k2J27j43Lq8
35a557N2o0J71n2J25j59J76p7J54j87J3j10P6j82J86j0J33j11J40j21j6p6J83o5kj43P8j56
28a597J74j52K07J5J10j56J23n6p3j76J17l8%n0K36o3l8j28J07n8K7nN3j36N4j36J04j6K24
21a327n1QL8K2j40j1j55K01q0J11j14N5j4N1l2J07p4K7o7O3j68N2L2R2k0J06q6K4j33O3j03
14a523K4RJ55j6j23j45R1L8J39J11mj98K0p1P2Q0K5j11M7k2m0j26J13L5l5J1j9l8Om2k0J11
6a446K3l7J05m0M4l5p4J31p2l8q2N3J8pK6N5J06ml8p4J0o5M5Mm9NJ2J1o2kk2K9o1n3P8%k8
-3a534J3N3NN5J56l5q8r2J32O0j00j03L6J0J21q3n4n6J06j9O6J5p0n4L5j9J4J7k9o7J13o3
$$ plain form
51 -1357 -1448 -1453 -1460 -1346 -1387 -1327 -1381 -1428 -1509 -1532 -1495 -1387 -1404 -1400 -1498 -1430 -1477 -1542 -1590 -1451 -1507 -1407 -1423 -1300 -1369 -1358 -1532 -1482 -1462 -1413 -1611 -1611 -1635 -1468
43 -1468 -1480 -1421 -1612 -1523 -1567 -1494 -1412 -1305 -1398 -1344 -1396 -1294 -1466 -1462 -1490 -1354 -1452 -1292 -1326 -1314 -1349 -1300 -1468 -1494 -1661 -1434 -1456 -1329 -1472 -1469 -1557
35 -1557 -1505 -1565 -1394 -1446 -1321 -1480 -1304 -1381 -1227 -1414 -1401 -1511 -1435 -1617 -1431 -1441 -1308 -1419 -1279 -1400 -1416 -1492 -1309 -1374 -1376 -1519 -1441 -1597
28 -1597 -1423 -1575 -1368 -1353 -1243 -1399 -1276 -1332 -1405 -1581 -1464 -1502 -1502 -1552 -1316 -1379 -1417 -1545 -1438 -1496 -1469 -1474 -1421 -1557 -1503 -1639 -1535 -1551 -1327
21 -1327 -1378 -1370 -1332 -1310 -1450 -1461 -1616 -1415 -1495 -1384 -1498 -1443 -1457 -1406 -1438 -1331 -1405 -1378 -1445 -1382 -1550 -1498 -1466 -1374 -1394 -1288 -1374 -1350 -1483 -1420 -1523
14 -1523 -1499 -1490 -1335 -1351 -1474 -1619 -1528 -1490 -1351 -1240 -1244 -1442 -1422 -1493 -1421 -1341 -1316 -1427 -1380 -1402 -1442 -1568 -1455 -1420 -1455 -1444 -1463 -1501 -1495 -1537 -1557 -1446
6 -1446 -1423 -1460 -1355 -1395 -1351 -1386 -1460 -1329 -1401 -1439 -1521 -1468 -1450 -1457 -1431 -1376 -1270 -1274 -1312 -1386 -1376 -1441 -1396 -1392 -1441 -1436 -1424 -1413 -1475 -1477 -1499 -1470 -1531 -1584 -1506 -1506 -1534
-3 -1534 -1521 -1468 -1463 -1408 -1252 -1287 -1375 -1467 -1335 -1275 -1375 -1478 -1442 -1432 -1311 -1394 -1448 -1504 -1398 -1417 -1351 -1336 -1406 -1460 -1425 -1444 -1430 -1413 -1442 -1509 -1396 -1459
-11a459J52LQ5n9mj14P8j22n4L2J32j08p5o4K07l8N5j64J01j29O3N1J30K1N4j55j3n2P6j46
-19a516Q4j0J61j26K02m9j8j56K06J0m6l4oj50J62l6J4n2%j36J20r5J17j8J49jL3j58M2l3
-26a340J6p6J15o8O6k47R8j3R0O2J1p7K2r5J17n5O3r9N2j38Q8q6J96j24Mo5J33n1M5m8J27
-33a277k12rj3J57m0J67j19L7j03J27q0J07j16j3r0QM5J52j02J8o3k7j45K29l2L1j22R3m4
-41a436Mj0J06o9L0l5L3j3O8l0j8j54N9KQ3kN9J7P6j21m1o9R3j09N8j04J11k2j3l2K7o9jj3
-49a535J53o4P4k6K4l0J0q9P3RK48P0m2j31j00P1m5k9m7k6N6P1k6P1R6j19k1pl8k0O4R9M8
-57a158K1N6n5m9j3m9m5nQ2N8k4K5L1j03j6j31K9J29K1R5J23j07j38J40R3j25j03j17J00l8
-64a273P2o6n0kN3L8L1j21n3p1K14N3M9k3L6k25jJ1Po4O6n3O5j01J32k9J05p4L4p5M6j16J37
$$ plain form
-11 -1459 -1307 -1304 -1219 -1278 -1282 -1396 -1318 -1440 -1494 -1462 -1330 -1438 -1513 -1577 -1370 -1408 -1353 -1517 -1416 -1545 -1482 -1431 -1301 -1280 -1226 -1381 -1394 -1446 -1370 -1516
-19 -1516 -1432 -1442 -1281 -1407 -1205 -1254 -1272 -1428 -1222 -1212 -1258 -1292 -1298 -1448 -1286 -1322 -1308 -1360 -1360 -1496 -1376 -1471 -1354 -1372 -1223 -1224 -1191 -1349 -1307 -1340
-26 -1340 -1324 -1400 -1285 -1353 -1287 -1534 -1436 -1449 -1359 -1297 -1286 -1363 -1341 -1436 -1319 -1374 -1311 -1410 -1358 -1496 -1408 -1494 -1298 -1422 -1418 -1483 -1350 -1401 -1356 -1404 -1277
-33 -1277 -1489 -1498 -1511 -1354 -1394 -1227 -1346 -1309 -1412 -1285 -1365 -1258 -1374 -1387 -1477 -1469 -1424 -1272 -1374 -1356 -1419 -1446 -1591 -1362 -1394 -1363 -1485 -1392 -1436
-41 -1436 -1432 -1442 -1336 -1405 -1375 -1410 -1377 -1390 -1322 -1352 -1370 -1524 -1465 -1463 -1380 -1382 -1323 -1306 -1230 -1351 -1392 -1461 -1368 -1477 -1419 -1523 -1412 -1434 -1447 -1479 -1452 -1521 -1522 -1535
-49 -1535 -1382 -1446 -1372 -1398 -1374 -1404 -1394 -1483 -1410 -1401 -1153 -1083 -1125 -1256 -1356 -1285 -1330 -1359 -1406 -1432 -1376 -1305 -1331 -1260 -1164 -1283 -1304 -1311 -1349 -1369 -1305 -1206 -1158
-57 -1158 -1137 -1081 -1136 -1185 -1198 -1247 -1292 -1297 -1215 -1157 -1181 -1156 -1125 -1228 -1244 -1375 -1346 -1217 -1196 -1101 -978 -1085 -1223 -1083 -990 -1115 -1218 -1335 -1235 -1273
-64 -1273 -1201 -1267 -1317 -1319 -1266 -1228 -1197 -1318 -1371 -1442 -1228 -1175 -1126 -1149 -1113 -1338 -1339 -1328 -1321 -1385 -1319 -1372 -1307 -1408 -1276 -1305 -1200 -1274 -1240 -1315 -1269 -1385 -1248
-72a248P8K1q6L3m1j00j15M9p2O3m5J20j4j5j41K36j1m2j11l7rJ64j34L9mP4k3P2j67N1p1
-80a486J71j09O5q8J65o0m1m2J35p0R6j00N7O0J5j86M2o6P4j19K02l1j3j41Nk7J87o2r2j06
-87a565L21Nl5r7M2l8L7q5O0m9K2j78J58j02R0K1O9N0P0j33l1j62J30Q7J87k06n6p3m9L2J11
-95a367k1P1n0J06j06J11N5J0p6K5q1kp8NN7P1j02N6p2Q9r1N3J2j4qR4j83R8M1J7n0J0j09
-103a429N1kL5k3J4L7N3j00R9Nl1K5r7p9O7k8P2j8k3O6N3j89P0P5Q9q4k9j05Q8P8K7j03j2
-111a348J52J9j31Rom1l9LK6l7l5Q7k1M9l1p4l8J02L3o8R8L9k3K3k3K7p6P3J8m6M2no2O6l2
-120a270l9Jm9n4M0Q6n9Koj1q7K6N6J33ko4Q9l6q2N6j5j3JJ83n9n9j40K26j9j80n1K62n5j73
-128a362n6J35n3Rj2Q2j9NJ6P3j35K3p5K7j03M4J5J30j8M9j43J31J2o7j49J31n0m8NN9q0J53
$$ plain form
-72 -1248 -1170 -1149 -1235 -1202 -1243 -1343 -1458 -1409 -1481 -1418 -1463 -1343 -1357 -1372 -1513 -1277 -1288 -1330 -1441 -1478 -1487 -1323 -1457 -1418 -1422 -1348 -1371 -1299 -1466 -1415 -1486
-80 -1486 -1315 -1424 -1359 -1447 -1282 -1342 -1383 -1425 -1290 -1360 -1264 -1364 -1307 -1247 -1232 -1418 -1376 -1442 -1368 -1487 -1285 -1316 -1329 -1470 -1465 -1492 -1305 -1367 -1459 -1565
-87 -1565 -1244 -1239 -1274 -1371 -1329 -1367 -1330 -1415 -1355 -1404 -1382 -1560 -1402 -1504 -1414 -1393 -1324 -1274 -1204 -1337 -1368 -1530 -1400 -1313 -1126 -1332 -1388 -1461 -1510 -1478 -1367
-95 -1367 -1388 -1317 -1367 -1261 -1367 -1256 -1201 -1191 -1267 -1242 -1323 -1325 -1403 -1398 -1341 -1270 -1372 -1316 -1388 -1299 -1390 -1337 -1325 -1339 -1347 -1253 -1436 -1338 -1297 -1280 -1330 -1320 -1429
-103 -1429 -1378 -1380 -1345 -1368 -1354 -1317 -1264 -1364 -1265 -1260 -1291 -1266 -1363 -1442 -1375 -1403 -1331 -1349 -1372 -1306 -1253 -1442 -1372 -1297 -1208 -1292 -1321 -1426 -1338 -1260 -1233 -1336 -1348
-111 -1348 -1196 -1177 -1308 -1299 -1305 -1346 -1385 -1382 -1356 -1393 -1428 -1341 -1362 -1313 -1344 -1418 -1456 -1354 -1321 -1389 -1291 -1252 -1275 -1252 -1275 -1248 -1324 -1251 -1233 -1279 -1237 -1242 -1304 -1238 -1270
-120 -1270 -1309 -1308 -1357 -1411 -1371 -1285 -1344 -1342 -1348 -1359 -1446 -1420 -1364 -1231 -1233 -1297 -1208 -1244 -1326 -1270 -1285 -1298 -1297 -1114 -1173 -1232 -1372 -1146 -1165 -1345 -1396 -1134 -1189 -1362
-128 -1362 -1418 -1283 -1336 -1327 -1339 -1257 -1276 -1271 -1255 -1182 -1317 -1294 -1369 -1342 -1445 -1401 -1386 -1256 -1274 -1225 -1368 -1237 -1225 -1292 -1441 -1310 -1360 -1408 -1403 -1344 -1424 -1271
-136a271oJ4L0K2r5k0l6M3p0K15j08P8j26J2k4P2PJ8r3R5j22O1k6J14q8M9q7l2oJ13m0J09
-143a198j00j3o1J07k8J53j83J11o7Q9kR1n0Nk25J8j5J68l4J80j61m2j45P6j39R0j4N7q5J33
-151a284j9M2J2J3j39N2qO7MN1k7N7k8n1j32J25o7j0m0M2p4J75j14L8m8R5p6M0knO4jj08J9
-159a337j0J9ql5j03Q5p0R2K5J20p1J8L4o1mJ54j06k1O8OpN5l2j2l9p3l6M3mM9j72J27N9N1
-167a196NM4p3m4J00M3r9M5n3n1l9R6k8L7r0P6J20k6p0o3J8n9o9Q2k3O2j2Rn0Kp5KJ78m5L5
-176a211o5lq9J8O1l0RP5p3j6N9jQ3Q2j51q9n5J26o2J14N2R7p0No2Nj1L3r7P7l2M7j53N3J21
-185a153l4j62Q9K6k3l6R6l7ko7ql4p0K7P6N9J68p8k3j10j5L8J13l3l4K1Q9j44j65JJ84L5
-192a206P9j65KJ9J63K1j0r1N7j20Q6j8O9j4n0q4J27r8Nj02P6J03J00j46L1N3p3p6J49j24
$$ plain form
-136 -1271 -1277 -1263 -1233 -1211 -1306 -1326 -1362 -1319 -1389 -1174 -1282 -1204 -1330 -1318 -1342 -1270 -1263 -1245 -1338 -1243 -1365 -1304 -1330 -1216 -1304 -1255 -1342 -1374 -1380 -1267 -1307 -1198
-143 -1198 -1298 -1311 -1372 -1265 -1293 -1140 -1323 -1212 -1279 -1190 -1192 -1101 -1151 -1146 -1371 -1353 -1368 -1200 -1234 -1054 -1215 -1257 -1402 -1326 -1465 -1375 -1389 -1332 -1417 -1284
-151 -1284 -1303 -1261 -1249 -1236 -1375 -1323 -1331 -1264 -1260 -1209 -1236 -1179 -1207 -1258 -1390 -1265 -1332 -1342 -1382 -1340 -1414 -1239 -1353 -1315 -1363 -1268 -1344 -1304 -1306 -1311 -1247 -1248 -1356 -1337
-159 -1337 -1347 -1328 -1336 -1371 -1474 -1389 -1459 -1367 -1342 -1222 -1293 -1275 -1241 -1302 -1306 -1152 -1258 -1279 -1211 -1205 -1212 -1157 -1189 -1201 -1240 -1313 -1349 -1306 -1310 -1261 -1433 -1306 -1247 -1196
-167 -1196 -1191 -1147 -1220 -1264 -1164 -1121 -1220 -1175 -1228 -1279 -1318 -1222 -1250 -1213 -1303 -1227 -1107 -1133 -1203 -1266 -1248 -1307 -1376 -1294 -1317 -1255 -1267 -1258 -1308 -1306 -1381 -1379 -1201 -1246 -1211
-176 -1211 -1276 -1279 -1368 -1350 -1289 -1319 -1310 -1235 -1308 -1324 -1265 -1266 -1183 -1101 -1252 -1341 -1396 -1270 -1332 -1218 -1166 -1069 -1139 -1134 -1196 -1191 -1202 -1169 -1266 -1189 -1221 -1174 -1327 -1274 -1153
-185 -1153 -1187 -1349 -1260 -1234 -1257 -1293 -1197 -1234 -1236 -1303 -1311 -1345 -1415 -1388 -1312 -1253 -1085 -1163 -1186 -1296 -1311 -1273 -1160 -1193 -1227 -1206 -1117 -1261 -1426 -1425 -1241 -1206
-192 -1206 -1127 -1292 -1290 -1271 -1108 -1087 -1097 -1188 -1131 -1251 -1165 -1183 -1114 -1128 -1178 -1262 -1135 -1233 -1228 -1330 -1254 -1151 -1051 -1197 -1166 -1113 -1186 -1262 -1113 -1237
-200a237M0o8J4j8J33j05Q2j15J01J7L0l6j2j65N2O9O6j35J39n5K4N3N8p4Or3J06o3M9j42
-207a279R9K7l5j19l9l4J83NJ04r8N7r4Pp3K1n4J57j19LK0J9l0J30m9K5j52K5n2J19n9R6o4
-215a253Q9r4O7n4R6k8j3k0R8j23R2n8N1l8j20N1J35k6N4r7J7p0J3L4P3o2L2j0q4p2P4N6j1
-223a201j46J11N0j1PM8nj0r3Qp1J09M4n8n6LQ1m3K3N0j02oP0N7j17L9J18q2l2M8m6p1L5L2
-231a217K5j3m5OJ05pK8J27o0o2n6p7N8M5oL4j1j63O6p0LK1o6J12J75l8p4N5J41k5m1j18m8
-239a196M1j1m5P7l5J2p0N8M1Q5j25p0N9K6l6j3K1J48p9p9p2J47l9N3K4m7o5k9OJ21j12o6
-247a270j26L6o5J70j3J10M0M9j48Q5l4K7j7L4m5J2k5K4J20oj75N1o5J25K3k1Lk6l4J19r0
-255a132M7qMr6J1p2j0J07J02j22J24j57J2O0J46j07L8m0j8n3K6j37Q2M5N5j26J06k9O5q8
$$ plain form
-200 -1237 -1197 -1265 -1251 -1269 -1136 -1241 -1159 -1274 -1173 -1156 -1126 -1162 -1174 -1339 -1287 -1218 -1152 -1287 -1148 -1203 -1179 -1126 -1068 -1142 -1136 -1229 -1123 -1186 -1137 -1279
-207 -1279 -1180 -1153 -1188 -1307 -1346 -1380 -1197 -1192 -1088 -1186 -1129 -1223 -1216 -1289 -1268 -1322 -1165 -1284 -1281 -1261 -1242 -1272 -1142 -1191 -1166 -1318 -1293 -1345 -1226 -1285 -1189 -1253
-215 -1253 -1164 -1258 -1191 -1245 -1149 -1177 -1190 -1210 -1112 -1235 -1143 -1201 -1150 -1188 -1308 -1257 -1122 -1148 -1094 -1191 -1174 -1244 -1231 -1197 -1124 -1186 -1154 -1164 -1248 -1320 -1246 -1190 -1201
-223 -1201 -1347 -1236 -1186 -1197 -1190 -1142 -1147 -1157 -1250 -1242 -1313 -1204 -1160 -1218 -1274 -1271 -1190 -1233 -1210 -1160 -1262 -1268 -1198 -1141 -1258 -1219 -1101 -1183 -1215 -1167 -1213 -1284 -1249 -1217
-231 -1217 -1192 -1205 -1250 -1244 -1139 -1146 -1118 -991 -1051 -1113 -1169 -1246 -1188 -1143 -1149 -1115 -1126 -1289 -1223 -1293 -1290 -1269 -1335 -1223 -1048 -1086 -1160 -1105 -964 -989 -1030 -1148 -1196
-239 -1196 -1155 -1166 -1211 -1134 -1169 -1157 -1227 -1169 -1128 -1043 -1168 -1238 -1179 -1153 -1189 -1202 -1181 -1033 -1112 -1191 -1263 -1116 -1155 -1102 -1078 -1125 -1190 -1219 -1213 -1092 -1204 -1270
-247 -1270 -1396 -1360 -1425 -1255 -1268 -1158 -1118 -1069 -1217 -1132 -1166 -1139 -1156 -1122 -1167 -1155 -1180 -1156 -1036 -1042 -1217 -1166 -1231 -1106 -1083 -1104 -1101 -1127 -1161 -1042 -1132
-255 -1132 -1085 -1093 -1089 -1185 -1174 -1246 -1256 -1149 -1047 -1169 -1045 -1202 -1190 -1130 -984 -1091 -1053 -1093 -1111 -1164 -1138 -1275 -1193 -1148 -1093 -1219 -1113 -1142 -1077 -1165
-262a165J9q0O7p9J69M0Q5j09Rj74Q6K2N2m2P1j32L9r4J04MR7j35j1p0Oj16J81o3l0J6J47
-270a086m1n3n0J2J07R9o4P6P1l7j12pP4l5q2L7N7P1j44Q4l2q6l3J32k2j7L8R9r9m2m2%l7
-278a164M0N7pr7M8l6Nn8K8j7L4J37J2j04O5o3J0r5l1nJ11k2qP8J8o9K2m3n4k5R3p7pJ76n3
-286a101K1R5p7j5j1Lj3P1j1m7J0J0j5J9Qr8J1J0K2j05j7j2rR9KOK8n8O9m3L7k2NlN2nJ8k6
-296a092j07P4r7Jk0O4J9J4P9p2M7n8N1n2o5P4j8m1l4J45Q1n4J14l3o4j64K5j6OJ4J37L3k6
-304a035M8j42J4M7n7O2K2O2m3l6k8L7r3O9o5M0%k0r5O5L9O4j61J0N3J18j3p6j0P5QQ1k3N7
-312i26j16l1L1j2m3mq5J29o8P7j3L2J4l9n9K3j41P8l0O4j6M2r4J47k8j5q1J08k1nn2J09r9
-320a124l5Mkj26R5n9K7JJ69M8j9j85J23LK2K1O6j47m5Q2J00r7l4p7L6l5J61l9n2j38J38n7
$$ plain form
-262 -1165 -1146 -1226 -1159 -1238 -1069 -1029 -944 -1053 -1044 -1218 -1132 -1110 -1058 -1100 -1029 -1161 -1122 -1216 -1112 -1108 -1011 -1146 -1157 -1227 -1221 -1337 -1156 -1219 -1249 -1233 -1086
-270 -1086 -1127 -1180 -1230 -1218 -1111 -1012 -1076 -1000 -929 -966 -1078 -1085 -1011 -1046 -1128 -1091 -1034 -963 -1107 -1023 -1055 -1141 -1174 -1042 -1064 -1081 -1043 -944 -1043 -1085 -1127 -1127 -1164
-278 -1164 -1124 -1067 -1074 -1171 -1123 -1159 -1154 -1212 -1184 -1201 -1167 -1030 -1018 -1122 -1057 -1120 -1110 -1205 -1236 -1241 -1130 -1152 -1160 -1082 -1064 -1133 -1111 -1154 -1208 -1233 -1140 -1217 -1224 -1048 -1101
-286 -1101 -1080 -985 -1062 -1077 -1088 -1085 -1098 -1027 -1038 -1085 -1075 -1065 -1080 -1061 -1053 -1151 -1140 -1130 -1108 -1213 -1230 -1242 -1251 -1152 -1150 -1144 -1116 -1174 -1105 -1148 -1111 -1133 -1128 -1131 -1079 -1084 -1066 -1092
-296 -1092 -1199 -1125 -1222 -1221 -1241 -1177 -1158 -1144 -1065 -1137 -1090 -1148 -1097 -1149 -1214 -1140 -1158 -1199 -1233 -1088 -1007 -1061 -947 -980 -1044 -1208 -1183 -1199 -1193 -1179 -1042 -1009 -1035
-304 -1035 -987 -1129 -1115 -1068 -1125 -1063 -1041 -979 -1022 -1058 -1086 -1049 -1142 -1073 -1138 -1098 -1098 -1118 -1213 -1148 -1109 -1045 -1206 -1196 -1143 -1025 -1038 -1114 -1124 -1049 -1041 -960 -983 -926
-312 -926 -1042 -1073 -1042 -1054 -1097 -1101 -1186 -1057 -1125 -1048 -1061 -1029 -1015 -1054 -1113 -1090 -1231 -1153 -1183 -1119 -1135 -1093 -1187 -1040 -1068 -1083 -1164 -1056 -1077 -1082 -1134 -1025 -1124
-320 -1124 -1159 -1155 -1157 -1283 -1188 -1247 -1220 -1219 -1050 -1002 -1021 -1206 -1083 -1080 -1058 -1037 -971 -1118 -1163 -1081 -981 -1078 -1112 -1189 -1153 -1188 -1027 -1066 -1118 -1256 -1118 -1175
-328a175J38p0L7n2J03r0J70J2p6j09Rl9R5L4J25j31mJ4J26j23L1j51J34n1k0M2Q8p8p9Mj7
-335a103J1O1o8l4J8J06q4J0o1n0L9O4j2N6o9RK5J8k9O0Q7J5j16j5pl1ql3n3J01N9R0j20l0
-344a094M5M8M0l6o0L2P7n1l9lRl2o9L6k2O7O0L6Kq9j25M0N9M8P1j4j06r4J03J5R9o6l2M4
-352a001M2m3n2Oj9J15l7m3l1n8O4R8j0j5m3n4n3k3K25L1j23J01k8q0O5o3L6l4j02n5N7r8
-360a225O2QN2j3J24R3j9o1K0o7j38m7J0n1J21qJ65j37n5L2M0m3J4O1J19P8p3j24Pj14Q2k3
-368a110l0k3O3j2J8n9J18l7J49p0P0N1m5P3q8j91R9L2L0j19K6l8q7j10J67P9J20j05O1m7
-375a015Rm7j6j67J36L7J26J3q1j3R6k3K2j19l8N5jm8P9k8j1K5J26p7J4r2K3j38J12o2Q5m0
-383a058L3J1P8o7N7kM7j47O0OR3j74R4j5j3n5K2r9O7k7M2LJ04M9L6j17P6L8j22j36R3Q8n9
$$ plain form
-328 -1175 -1037 -1107 -1070 -1122 -1019 -1109 -939 -927 -1003 -1112 -1103 -1142 -1047 -1013 -888 -1019 -1023 -1009 -883 -1006 -975 -1126 -992 -1043 -1063 -1021 -933 -1011 -1090 -1086 -1103
-335 -1103 -1092 -1031 -1099 -1133 -1115 -1009 -1093 -1083 -1144 -1194 -1155 -1091 -1103 -1047 -1116 -1107 -1082 -1064 -1093 -1033 -946 -931 -1047 -1062 -1069 -1100 -1108 -1141 -1194 -1093 -1034 -944 -1064 -1094
-344 -1094 -1049 -1001 -961 -997 -1057 -1025 -948 -999 -1038 -1041 -1032 -1064 -1133 -1097 -1119 -1052 -992 -956 -954 -1043 -1168 -1128 -1069 -1021 -950 -964 -1070 -1164 -1061 -1046 -947 -1013 -1045 -1001
-352 -1001 -959 -1002 -1054 -1048 -1067 -952 -989 -1032 -1063 -1121 -1057 -959 -969 -984 -1027 -1081 -1134 -1157 -932 -901 -1024 -923 -951 -1031 -966 -1029 -993 -1027 -1129 -1184 -1127 -1225
-360 -1225 -1163 -1155 -1103 -1116 -992 -899 -918 -979 -959 -1026 -1164 -1211 -1201 -1252 -1131 -1139 -974 -1111 -1166 -1134 -1094 -1137 -1123 -1062 -943 -865 -938 -1062 -1055 -1169 -1087 -1110
-368 -1110 -1140 -1163 -1100 -1112 -1094 -1153 -1035 -1072 -923 -993 -923 -872 -917 -844 -932 -1123 -1024 -992 -962 -1081 -1055 -1093 -1180 -1290 -1123 -1044 -924 -1029 -968 -1015
-375 -1015 -1006 -1053 -1069 -1236 -1100 -1063 -937 -924 -1005 -1018 -922 -945 -923 -1042 -1080 -1025 -1026 -1074 -995 -1023 -1034 -1009 -883 -960 -946 -1038 -1015 -1153 -1041 -1103 -1018 -1058
-383 -1058 -1025 -1014 -936 -1003 -946 -948 -901 -1048 -988 -982 -889 -1063 -969 -984 -997 -1052 -1030 -1129 -1062 -1089 -1047 -1044 -940 -891 -855 -972 -896 -858 -980 -1116 -1023 -935 -994
-391i94JQ9nQ8j06j2p4R5l8K1r0N8pj10o6J66l9P8P7%q4O5j2L0j32OjO2o9K4O0P4j90P1m0
-399a004L7K1p9nP6j79R6J38K4n9p0l1J41l9N4llp5n2J6J5P6m1J7%J34m2m5j9j12L4o5o3L2
-408a075J06l4p7J19P0M0ln7n2P8K9q0n3o1o4J68J37j2q1j27J0J93j31o9J4P5j0KlM9LM8j9
-416h67kk7l8n4rn3J30L8j37P4M3p4Ql2NMJ77n7j9p8O8l4n5J2K6m6N8Q3J1j77N1MK00j31k3
-424i21r4J6j8J36N7P2j28l0l6o3JN6o2K3l3j2j01J05jJ31OL3L6kj22M6O9j15n3Lj34NN8K26
-433h46l5N1j8k9j40n3O2L1p4J17n3J18n2L7q1M1l6R9l0p9L8P1n7P9j02%j54N0O3O7N3P9j31
-441i14j2r9J99k5M7j13j2o6K1oN2N5M1q4M2j4j03L2O0r0k3M3L8j58Q7m7P4l7J20l3L5m9J9
-449i20m5R5j8L1j90J88j25m2J22l6j3n6k7N4O8N5n6PK1M8j12o6L9R4K8O7j07o1O8J07j13
$$ plain form
-391 -994 -993 -904 -909 -821 -927 -939 -1013 -918 -956 -935 -1025 -967 -974 -1084 -1150 -984 -1023 -945 -868 -868 -952 -887 -899 -869 -1001 -995 -996 -934 -1003 -979 -919 -845 -1035 -964 -1004
-399 -1004 -967 -946 -1025 -1030 -954 -1133 -1037 -899 -875 -934 -1004 -1035 -894 -933 -879 -882 -885 -960 -1012 -996 -981 -905 -946 -929 -929 -795 -837 -882 -901 -1013 -979 -1044 -1107 -1075
-408 -1075 -969 -1003 -1080 -961 -891 -851 -854 -911 -963 -885 -856 -936 -989 -1050 -1114 -946 -809 -821 -902 -1029 -1019 -826 -957 -1026 -1012 -937 -947 -945 -948 -899 -896 -848 -867
-416 -867 -869 -896 -934 -988 -997 -1050 -920 -882 -1019 -945 -902 -976 -968 -1000 -995 -991 -814 -871 -890 -968 -900 -934 -989 -977 -951 -997 -939 -856 -845 -1022 -971 -967 -767 -898 -921
-424 -921 -1015 -999 -1017 -881 -824 -752 -880 -910 -946 -1009 -1008 -952 -1014 -991 -1024 -1036 -1137 -1032 -1033 -902 -896 -863 -827 -829 -951 -905 -836 -951 -1004 -1001 -1135 -1130 -1072 -846
-433 -846 -881 -830 -848 -877 -1017 -1070 -1008 -977 -1051 -934 -987 -869 -921 -884 -965 -924 -960 -861 -891 -970 -932 -861 -918 -839 -941 -941 -1095 -1045 -982 -915 -862 -783 -914
-441 -914 -926 -1025 -826 -851 -804 -917 -929 -995 -974 -980 -928 -873 -832 -916 -874 -888 -991 -959 -899 -989 -1012 -969 -931 -1089 -1002 -1049 -975 -1012 -892 -925 -890 -939 -920
-449 -920 -965 -870 -888 -857 -1047 -859 -984 -1026 -904 -940 -953 -1009 -1036 -982 -914 -859 -915 -908 -887 -839 -951 -1017 -978 -884 -856 -789 -896 -957 -889 -782 -895
-456h95k5P2j3j4L5O0m3n4M0j58J46q5Q0j5L4J7p3q8J27Q1n5j32K7L6N9j22J04L6j06lp6J18
-464h85L1j8K0M6n4n5nM6k0mL1r7N0P1m0k4M3K5p8N0r4q5M6p2L4J62J46q0q9k3R0J8p4j9m2
-473i49R2p4J08n0O9m3N3j39M2Q6L5p0o2J09Nj67Lk8M3N8L3O6J0n7j8lR1k1n9k1j0Pl6Lnl3
-482i32L4M7jp4n3n5P6pJ22q7M4q6L5N6R8j19J0l6J35m0p8j28K4j9J0M9J02k4K2r1L4k1L6
-490i17LM5p3P7pL3n2J00M4O2K6J6q5M4r2J11j91k6j45J41J1J21j67r4l2J70%m5m1o2j08J23
-498a010J59L8k0Q4j08N3LN1k16K6J3J44j02Mk0O1j6O4r4m7M8L5o8Q3%l4k9P4j3o3qR7n1n9
-506i21j9K9RR2r1m6K8Q4pK2P6k1o1J4j50J39K1L7r0m0O8jn5M4J3P3p2Q1l7j8nJ4j1L6j24
-514h89N7p6m5j2l7N9J01j09J7Ro4PR6N8M2j0j5k8p5M7J26r8L3Rj00Q6O1j10O6j33QQ8K7l4
$$ plain form
-456 -895 -920 -848 -861 -875 -840 -780 -823 -877 -837 -995 -849 -934 -854 -869 -835 -818 -891 -979 -852 -771 -826 -958 -931 -895 -836 -958 -854 -818 -924 -927 -1003 -885
-464 -885 -854 -872 -852 -806 -860 -915 -920 -874 -894 -898 -867 -964 -914 -843 -883 -907 -864 -839 -917 -867 -961 -1046 -1000 -1072 -1038 -876 -730 -810 -899 -922 -832 -814 -888 -907 -949
-473 -949 -857 -931 -823 -873 -804 -847 -794 -933 -891 -805 -770 -840 -902 -793 -788 -955 -952 -980 -937 -879 -846 -780 -770 -827 -845 -848 -757 -778 -837 -858 -868 -861 -897 -894 -899 -932
-482 -932 -898 -851 -852 -926 -979 -1034 -958 -965 -843 -930 -886 -972 -937 -881 -783 -902 -892 -928 -793 -833 -911 -1039 -1015 -1034 -1024 -975 -873 -897 -875 -966 -932 -953 -917
-490 -917 -914 -869 -942 -865 -872 -839 -891 -791 -747 -685 -659 -643 -728 -684 -776 -665 -856 -882 -1027 -886 -875 -754 -921 -1015 -1047 -877 -877 -922 -963 -1025 -1133 -1010
-498 -1010 -851 -813 -833 -749 -857 -804 -801 -750 -966 -940 -927 -783 -885 -881 -901 -840 -856 -792 -886 -933 -885 -850 -918 -835 -835 -869 -898 -824 -837 -900 -908 -811 -862 -921
-506 -921 -940 -911 -902 -810 -901 -947 -919 -835 -842 -820 -744 -765 -826 -812 -962 -823 -802 -765 -855 -895 -827 -828 -883 -839 -826 -753 -825 -744 -781 -799 -804 -790 -801 -765 -889
-514 -889 -832 -908 -953 -965 -1002 -943 -842 -951 -934 -925 -989 -982 -886 -828 -786 -796 -811 -839 -914 -867 -741 -839 -806 -797 -897 -811 -750 -860 -794 -927 -919 -831 -804 -838
-523h38j53K6J29Ol7r6JR3J8J15j12k3n8J0r5j3R0l7j3L2Q8M5Ql2j0J9jr9rP7L3J58j01M5
-531g34o2k5Pk0r3r2J7K06P4m4N0o7j05j4j0J00k8Rj7k8j1Kj1q8Q8J48l6O9o0mj34J24J6N8
-539g15k0j62K3J11n1R7O7n2j56m5O2PJ9R9k7j35M0J48j36j45P8J25j09L9P7N1n2Q3j51O7
-547g63o4L5N7P8r0m9n4k0O2L0n5P2j3Q6j08j8j3QNQ6r8K9j00N9k6K4q5k5P4J32j53k9J2P8
-555h36l3J19p5J8j3j16J0R6r3J13k1K3j8k5r5P1N1J59%j16m1R3p2M4l0L6o3J09l8N2l7m8
-563g76oJ24m7L3q3N7o9K1o6L4Jn9Oj4n3J00o0O6kN9K0M5j9J1N5k5j18K6L5M5m8r8j91J41
-571h55R7l6j41J1n7K03J7RjK1m5j3j5M4N9R3n3J12j40o5l1k1r8O8Q3K3m6J10j09j16N2qJ8
-579h30M8R3N2L4O5j13o2k4J40l0j66j34R3J10m7M2oL6J01j5l5j7n6K8p6n7K1J26o7k5l9J00
$$ plain form
-523 -838 -991 -965 -836 -830 -867 -963 -962 -869 -851 -736 -848 -871 -929 -919 -1014 -1027 -937 -974 -987 -955 -867 -822 -814 -846 -856 -837 -838 -937 -946 -869 -836 -678 -779 -734
-531 -734 -796 -821 -814 -834 -927 -1019 -1002 -796 -722 -766 -716 -783 -888 -902 -912 -812 -840 -831 -848 -876 -887 -885 -896 -984 -896 -748 -784 -715 -775 -779 -913 -789 -773 -715
-539 -715 -735 -897 -874 -763 -814 -717 -650 -702 -858 -903 -841 -834 -815 -716 -743 -878 -838 -690 -826 -971 -893 -768 -877 -838 -761 -710 -762 -679 -830 -763
-547 -763 -827 -792 -735 -657 -747 -796 -850 -870 -808 -778 -833 -761 -774 -688 -796 -814 -827 -819 -814 -728 -826 -797 -897 -838 -864 -840 -925 -950 -876 -744 -897 -926 -914 -836
-555 -836 -869 -750 -825 -807 -820 -936 -926 -830 -923 -810 -831 -808 -826 -851 -946 -875 -824 -665 -665 -781 -822 -729 -801 -757 -787 -751 -814 -705 -743 -691 -728 -776
-563 -776 -782 -658 -705 -672 -755 -698 -767 -746 -812 -778 -777 -836 -830 -844 -897 -797 -857 -791 -793 -734 -714 -669 -688 -677 -622 -647 -765 -739 -704 -659 -707 -805 -996 -855
-571 -855 -758 -794 -935 -924 -981 -778 -761 -752 -753 -732 -777 -790 -805 -761 -702 -609 -662 -550 -690 -755 -786 -807 -905 -837 -754 -731 -777 -667 -776 -892 -840 -848 -830
-579 -830 -782 -689 -637 -603 -538 -651 -713 -737 -597 -627 -793 -927 -834 -724 -771 -729 -735 -699 -598 -613 -648 -665 -721 -693 -769 -826 -805 -679 -746 -771 -810 -710
-587g10jj01J1J47j6q3j57%R5J07j30J02J25l2j26J1K4Nq1lJ7q6n3rk4J69Q7n6K8L4r0J91
-595f05J8q3L6O4j04M2M7J18n4m9j39k0j5o2k1J58k9O4q8L7n4J3J09j3j20R5n9M1Ok1m3o4
-603g95N9M4j34L6m2j6J6J35l5O4n8P2Q2op3n7l2P6q7J55K5kj82j0N3L8Mp9j6O6O2J7k6J4
-611f32j58Q4oR7o3k5l8j2k1O8o0J9p4J32N2K0l1N0j34J03n4r0j4j7lJ05N2J9n8J28j19n9
-619g39j2Q3n8M3j86J4Q2M5p9R0M8K6j40L7L9Q1L9k9q1P0m1m4Ro1Km5l7R2J4m3rR0Rp5q1J76
-628f71O4m8j90P6N9l7nk2R5l5j11J66o3l2K3k1l3N1N7OQ2N8N2j15o3RO6L0j0n0j14K2l4p6
-636h14K7J10k0j6N4qj49N8o1J45J6K7k6K3l6Pko8M6L8P7p4n4K6J4l9q9J23L1m0rl2L7m9K
-645g25q3mP5J79L1j88K7J04K2j05l9M8l5l3n7lL3Qj7%J5J7LR9P1L8r4Jl6L0m0p0P4K0L6j3
$$ plain form
-587 -710 -711 -812 -801 -654 -670 -753 -910 -910 -815 -708 -838 -736 -611 -643 -769 -758 -734 -729 -810 -813 -796 -882 -935 -944 -968 -799 -712 -768 -740 -706 -796 -605
-595 -605 -587 -670 -634 -570 -674 -632 -585 -467 -521 -570 -709 -729 -744 -806 -827 -669 -698 -634 -722 -685 -739 -726 -617 -630 -750 -655 -714 -673 -667 -688 -731 -795
-603 -795 -736 -692 -826 -790 -832 -848 -832 -697 -732 -668 -726 -654 -572 -578 -651 -708 -740 -664 -751 -596 -571 -573 -755 -765 -712 -674 -670 -749 -765 -699 -637 -620 -646 -632
-611 -632 -790 -706 -712 -615 -678 -703 -741 -753 -774 -706 -766 -747 -821 -689 -637 -617 -648 -598 -732 -629 -683 -773 -787 -804 -807 -702 -650 -631 -689 -561 -680 -739
-619 -739 -751 -668 -726 -683 -869 -855 -773 -728 -807 -717 -669 -643 -783 -746 -707 -626 -587 -616 -697 -627 -668 -712 -703 -764 -762 -807 -844 -752 -738 -781 -790 -700 -691 -766 -847 -671
-628 -671 -607 -655 -845 -769 -710 -747 -752 -774 -679 -714 -825 -659 -722 -754 -731 -752 -785 -734 -677 -671 -589 -531 -479 -594 -657 -648 -582 -552 -562 -612 -726 -704 -738 -814
-636 -814 -787 -677 -697 -713 -659 -667 -816 -758 -819 -674 -658 -631 -657 -634 -670 -663 -665 -733 -687 -649 -572 -646 -700 -674 -660 -699 -788 -665 -634 -674 -683 -715 -678 -727 -725
-645 -725 -808 -812 -737 -558 -527 -715 -688 -584 -562 -667 -706 -658 -693 -726 -783 -786 -753 -745 -762 -762 -747 -730 -727 -628 -557 -519 -613 -612 -648 -618 -658 -728 -654 -634 -598 -611
-653f11n2l6k8Q4k1Q0j2m1rn7L5j4mJ90j13j06Qm7N9P1k1M1q9m5J53KrJ29l4l1r8l4p1k6M5
-662g12k5P5Q1p1k5L8j7oJ06o2j5j01J02l3ln1J05n9R3l2l1j53O4n8J71m2M6r7J22n3KJ6M1
-670e84r4O8n0L7N8Q4l5j08o0P9M4mj36n5M1J27n3k0P3J13j5j0o9L8q7q%J7rL8j01P3m5m9
-678g02L3K6j6L9o4nP5J15j23M7l9J02j24n9J06l0r3m4n3J30l1K1M9J16k00r6P5L1m7J45o7
-686f83L2j0J11K3J18o4k9o8l0r2R4J3o4l5m7L2J9o3O0L8P2j08O0J12r0n3P5l1L4r8N8Q1J13
-694d20k02l0j1p5M9L5N9k8L9R4n2p0p9J3N9L9O2N8P7j75lJ4K7L0r9l8j05j3J32M5j28l1J42
-702e85j4j0J1P3n7j4K8o0K4L5N3p6r1O5pj9K4R6L8j56n6M0n8L2OrK0M4RJ3j05R1K7L7j5l4
-711f00Pj1q5R1k8k4lQ6P8M7m8o5j56m5K6L5J00J06j04J1Q8n9m6J5L1K5j6m2qJ11j1j05k2
$$ plain form
-653 -611 -663 -699 -727 -643 -664 -584 -596 -637 -646 -703 -668 -682 -686 -496 -609 -715 -707 -754 -695 -624 -645 -604 -693 -738 -585 -583 -592 -463 -497 -528 -626 -660 -731 -757 -712
-662 -712 -737 -662 -581 -652 -677 -639 -656 -662 -556 -618 -633 -734 -632 -665 -668 -719 -614 -673 -580 -612 -643 -796 -732 -790 -619 -661 -615 -712 -590 -643 -641 -625 -584
-670 -584 -678 -610 -660 -623 -565 -481 -516 -624 -684 -605 -561 -565 -701 -756 -715 -588 -641 -661 -588 -475 -490 -500 -569 -531 -618 -626 -626 -609 -618 -580 -681 -608 -653 -702
-678 -702 -669 -643 -659 -620 -684 -689 -614 -499 -622 -575 -614 -512 -636 -695 -589 -619 -712 -756 -809 -679 -710 -689 -640 -524 -724 -820 -745 -714 -761 -616 -683
-686 -683 -651 -661 -550 -527 -409 -473 -502 -570 -600 -692 -598 -585 -649 -684 -731 -699 -680 -743 -683 -645 -573 -681 -621 -509 -599 -652 -577 -608 -574 -672 -614 -533 -420
-694 -420 -622 -652 -663 -738 -689 -654 -595 -623 -584 -490 -542 -612 -691 -678 -619 -580 -518 -460 -383 -558 -561 -547 -520 -490 -589 -627 -732 -745 -613 -568 -696 -727 -585
-702 -585 -599 -609 -598 -525 -582 -596 -568 -628 -604 -569 -516 -592 -683 -618 -625 -644 -620 -524 -486 -642 -698 -658 -716 -684 -678 -687 -667 -623 -614 -601 -706 -615 -588 -551 -566 -600
-711 -600 -593 -604 -689 -598 -626 -650 -653 -567 -489 -442 -490 -555 -711 -756 -730 -695 -595 -489 -593 -582 -494 -553 -599 -584 -553 -528 -544 -586 -594 -483 -494 -599 -621
-719f21nN0Q7j66Q8L9jp1O1J38j05j01K4j32Q1N0o1n1N0j2J26N3M7j61L6p6q5kP8n1J04p0
-727f59Q6k5L9q5O4n0K7pL2M4j1j7O8n4l9k0P8n7L2l1R5k0j1j01N0K6j50k9R7L4K3j27o1O
-735g53J17J01M7o1M5L3L0p0P5n1k8n0n9nJ41qj9o0P4o5p6J02O1j68P8L2N6r6J2J2K9j57N9
-743f22k4J54n1J07r9j8l8Q0J09j66J7OJ3j1j03J17J11m7r2K9j05J23m2L7J3J1m5J04q9rj1
-751e41L4l7k5m2Q9k5J5m4nn3N9PJ11K7Q2j54j39M4j6J0J7o9O7PJ3m1o2O6j5l0K6J33N4j07
-759e44rQ0j24k5J14J13j3p9K4l2l7j8j1O7lL6J5kr5p7Q8L0L8Qo6Pl6Jo8P6J1r9P4K56r8p7
-768d75o9OP6Pr4n2r3J9M0J86K9l9j02O0JlJ0j8K5N4j87n5J3M9L5rJ01Q1k8j5o1p2r4jM3R3
-777e39r1J24l9J8o7n3OJ32On5m7j2J06J4j30J9L8J00l0KM4P8j12N5j21j6o4J03L7P4p5R9
$$ plain form
-719 -621 -626 -576 -489 -655 -567 -528 -529 -600 -539 -401 -506 -607 -583 -715 -634 -584 -645 -696 -646 -658 -532 -479 -432 -593 -557 -633 -718 -720 -642 -693 -589 -659
-727 -659 -573 -598 -559 -644 -580 -630 -603 -610 -578 -534 -545 -562 -494 -548 -587 -607 -529 -586 -554 -585 -490 -510 -521 -622 -572 -546 -696 -725 -628 -594 -571 -698 -759 -753
-735 -753 -636 -535 -488 -549 -504 -471 -441 -511 -436 -487 -515 -565 -624 -629 -488 -496 -515 -575 -501 -566 -642 -540 -479 -647 -569 -537 -481 -577 -565 -553 -524 -681 -622
-743 -622 -646 -492 -543 -436 -535 -553 -591 -511 -402 -568 -551 -545 -532 -543 -646 -529 -418 -465 -557 -528 -633 -510 -552 -515 -502 -491 -536 -432 -521 -530 -541
-751 -541 -507 -544 -569 -611 -522 -547 -532 -576 -581 -634 -575 -568 -457 -430 -348 -502 -641 -597 -613 -603 -586 -655 -588 -581 -568 -609 -671 -605 -620 -650 -624 -491 -437 -544
-759 -544 -553 -473 -597 -622 -508 -395 -408 -487 -463 -495 -532 -550 -561 -494 -497 -461 -446 -448 -543 -620 -532 -502 -464 -456 -522 -515 -551 -550 -618 -542 -531 -630 -556 -300 -398 -475
-768 -475 -544 -538 -462 -455 -549 -601 -694 -675 -635 -449 -420 -459 -561 -501 -500 -503 -493 -511 -486 -432 -619 -674 -661 -612 -577 -586 -485 -404 -432 -447 -508 -580 -674 -675 -632 -539
-777 -539 -630 -506 -545 -527 -594 -647 -641 -509 -503 -558 -605 -617 -511 -497 -627 -608 -570 -470 -500 -498 -454 -376 -488 -433 -554 -570 -634 -531 -494 -420 -495 -396
-784c96j07R2o3k2q8K5m7J7P4J54q8l8M6L7r0j4L8j2%N9j12L2oRj17P0J28L0j21L8j13J5p
-792e77o8k6P0L2O4N4Mp1J2l9Qj24l9l4J88k1L2m4R7K8Q6j23L6K2o5O2l6m0j4j08Q0K3J96
-801c35R7j27q0n0L4K9m4l5j67M8JK8M6P9m5J13M5p2j43L5k3O2q6JN2Q0J6n1m8j5n4Q9J14
-809d06K9r8o3m1q6p9J67O0j5L7j0JO4q8n6O7p2Q5J5K0L0k1J9r0N5n2J9m3Q4N0q9O6K2j22
-817e41pQ4R3r8pj1L0m6J5k4oj9%O6L1pn1N5N2q8k4Q2n4l7lL5k3R8m0q9P3Q0k2rj04M8J11
-826c57l0j11R9Ol4m2Kr0N1k4J30q8Q5m4k8K8mn0p9K1P7L8l2O4J44q9Nj04J01k5r9mk5M6R7
-835c65j34pm3R3n4O7O4k4K1l9q1k6jJ18r9Q0J01r6p4J20N1Q2o9j24K9L0n7K8j14n6p4Q9L7
-843e27J08p4O5m0J16r5j05J3N8k7M4m3k2O6K7r3RJ0j5n5J28N1ML2R7l5m4r4J2k02N5J28Q3
$$ plain form
-784 -396 -503 -411 -474 -496 -584 -559 -606 -589 -515 -361 -449 -487 -441 -404 -494 -508 -470 -482 -482 -423 -535 -503 -509 -500 -617 -547 -419 -389 -510 -472 -585 -570 -577
-792 -577 -645 -671 -601 -569 -505 -451 -447 -518 -506 -545 -537 -661 -700 -734 -546 -567 -535 -579 -482 -454 -368 -491 -455 -433 -498 -436 -472 -512 -526 -634 -554 -531 -335
-801 -335 -238 -365 -445 -495 -461 -432 -476 -511 -678 -630 -629 -601 -555 -476 -521 -408 -363 -435 -578 -543 -566 -504 -590 -589 -537 -457 -441 -492 -540 -555 -609 -520 -406
-809 -406 -377 -475 -538 -579 -665 -744 -577 -517 -532 -495 -505 -504 -440 -528 -584 -517 -589 -504 -489 -469 -439 -460 -441 -531 -476 -528 -509 -552 -468 -418 -507 -441 -419 -541
-817 -541 -548 -464 -371 -469 -476 -487 -457 -503 -488 -512 -518 -537 -537 -471 -440 -447 -498 -443 -391 -479 -503 -421 -475 -512 -515 -480 -503 -405 -445 -534 -461 -381 -403 -412 -516 -468 -357
-826 -357 -387 -498 -399 -393 -427 -469 -467 -557 -506 -530 -400 -488 -403 -447 -475 -447 -451 -501 -580 -559 -482 -444 -476 -412 -268 -357 -352 -456 -355 -380 -479 -483 -508 -462 -365
-835 -365 -499 -506 -549 -456 -510 -443 -379 -403 -382 -421 -502 -528 -529 -411 -510 -430 -329 -425 -499 -379 -328 -246 -315 -439 -410 -380 -437 -409 -523 -579 -653 -564 -527
-843 -527 -419 -493 -428 -468 -352 -447 -552 -539 -481 -508 -464 -507 -529 -463 -436 -529 -520 -510 -525 -580 -452 -401 -397 -365 -268 -303 -347 -441 -429 -631 -576 -448 -365
-851c65k8Jo3P6PJ1ok7p7jO4J2o7j8kP1n0M3j1m2k1O9l1K6p3O6N2o7j27M4Q0J2l3J29n0P8
-859c18K5p7j5P5j73n7Q5k3Q1R0j92M4O5J3ol1p8J0K7n1O0Rl9N0J8j0j07P0m8M1O1pn7r1k9
-868e85P3M0jN8jj9KM1l3m1J30j13m9oJ27j7p2J3J27k8M5p6o9L4Q6%m0o5P3l5L4PM8j24o0
-877d96jORK5p4o3J49q0N3Q4N2N1q5l8l8m6kl8J5K3RL1N9mp3k0Q4k4L7Q9j4l4lp1J0R2o9m4
-886d39J68O7l0Q3j72j01qM0M2l6j66oK4O2O9K7l3r5M3J0J27j33k9o2M4n6R0qM0J8rK1N0n3
-894d11N0m5j7J8J32m3J1j01L2m6M8N5m6k7Q2k6Q2n5j92j47J21j8M7l2K6k2P8m5J2N3M7K6
-902c53j2M8J16j34m0j4J09j34J1o7J09l7r9p4Q8K2J09K7K0r7P2L9K5j20P0m3mM7M7q2Oj10
-910d55J21kq1q3L6P1J6j50M1Q0N8r6o2O3J48Rk6j01M7m4J09j28j03O2jKJ07l0j6k8R4l1j63
$$ plain form
-851 -365 -393 -392 -455 -379 -372 -361 -367 -394 -471 -472 -408 -396 -463 -481 -483 -412 -462 -419 -430 -472 -493 -424 -455 -429 -502 -436 -384 -451 -578 -534 -454 -442 -475 -346 -396 -318
-859 -318 -293 -370 -385 -310 -483 -540 -455 -478 -397 -307 -499 -455 -390 -377 -383 -414 -492 -482 -455 -506 -446 -437 -476 -426 -408 -418 -525 -455 -503 -462 -401 -408 -465 -556 -585
-868 -585 -512 -472 -473 -415 -416 -435 -433 -392 -425 -466 -336 -449 -498 -504 -377 -394 -466 -453 -326 -354 -309 -385 -454 -420 -334 -334 -374 -439 -366 -401 -367 -360 -312 -436 -496
-877 -496 -497 -491 -482 -457 -531 -594 -445 -525 -472 -388 -336 -285 -370 -408 -446 -492 -494 -532 -517 -494 -485 -454 -395 -399 -472 -492 -408 -432 -395 -306 -320 -354 -357 -428 -418 -326 -395 -439
-886 -439 -271 -204 -234 -151 -323 -424 -432 -392 -350 -386 -552 -558 -534 -472 -403 -376 -409 -504 -461 -451 -324 -457 -486 -548 -504 -560 -470 -478 -438 -420 -429 -408 -358 -411
-894 -411 -361 -406 -423 -405 -273 -316 -305 -406 -374 -420 -372 -317 -363 -390 -308 -334 -252 -307 -499 -646 -525 -543 -496 -528 -502 -524 -446 -491 -479 -426 -379 -353
-902 -353 -365 -317 -201 -335 -375 -389 -280 -414 -403 -470 -361 -398 -497 -571 -483 -461 -352 -325 -305 -402 -330 -291 -266 -386 -316 -359 -363 -316 -269 -351 -345 -455
-910 -455 -334 -336 -417 -500 -464 -393 -377 -527 -486 -406 -348 -444 -506 -443 -295 -286 -312 -413 -366 -410 -301 -429 -532 -470 -471 -469 -362 -392 -408 -436 -342 -373 -536
-918e36J14J56q9j44m4R6N4J8o6k1O7Q5r3M2o8k7J27rj18J8O7Rm6J01o1J4J3L6K2Qo5K8p0
-926c82L2KM2m4k8p8J22J05%q1j10o1Q2K7L6lQ4m5Rj09l2n5J00j3l5P4J2j52J00m2J7J23%
-934c03r2Pk9l9N9L2j27M8R2p8O9PM1K0%P7JJ5j0r7N3k1J8k0m2J4Q3m8n2l4J9l6Q4j0R4Q6
-943a19j37o4R8K9l8j6J4Kq1J3L4o0lq0J27L0Pm4Q2m8o9J14J9j95M7Rmj52J09o1R2Q1M7Kj09
-951c24p1O4mM8j11M7N0r3l9R0J8R0j19J2K3ol5J80kk6r9m9q0O7o0L9k3J3O0J4q3qoK04m0
-960b59nj11l0m3J62QK5n8qp6k2P5j1N4kK9J01q9l1m4M9p0J49j10o7J28m6k7j0j16J10N9l8
-968c24o9J17M3P5j11p8qJ0o1N1n0J77r0Qk8K2qQ1p4n3L0l9oM9P6O9j10J4KQm0lr4J54j7K6
-977b51k9j6K2j7l0M4m9j7J08m2q1k1K4l8n1J59l2NJ8o1Q4J09r0r3PR5r5m7P4J01o9L5nj4
$$ plain form
-918 -536 -422 -266 -355 -499 -543 -447 -393 -375 -441 -462 -395 -310 -403 -361 -429 -456 -329 -338 -456 -438 -371 -362 -408 -307 -368 -354 -341 -305 -283 -275 -340 -312 -382
-926 -382 -350 -348 -306 -350 -378 -456 -334 -229 -229 -310 -420 -481 -399 -372 -336 -339 -255 -300 -291 -400 -432 -487 -387 -400 -435 -361 -349 -501 -401 -443 -426 -303 -303
-934 -303 -395 -388 -417 -456 -397 -365 -492 -444 -352 -430 -361 -354 -313 -293 -293 -216 -215 -200 -210 -307 -254 -275 -257 -277 -319 -305 -222 -270 -322 -356 -337 -373 -289 -299 -205 -119
-943 -119 -256 -320 -222 -193 -231 -247 -233 -231 -312 -299 -265 -325 -328 -408 -281 -251 -244 -288 -206 -254 -323 -209 -190 -385 -338 -329 -333 -485 -376 -437 -345 -264 -217 -215 -324
-951 -324 -395 -331 -335 -287 -398 -351 -301 -394 -433 -343 -325 -235 -354 -342 -319 -325 -360 -180 -182 -208 -307 -356 -436 -369 -429 -390 -413 -400 -340 -326 -409 -417 -423 -219 -259
-960 -259 -264 -375 -405 -448 -286 -278 -253 -311 -319 -395 -417 -342 -353 -299 -301 -272 -171 -260 -291 -335 -286 -356 -207 -317 -384 -256 -302 -329 -339 -455 -345 -286 -324
-968 -324 -393 -276 -233 -158 -269 -347 -355 -345 -406 -355 -405 -228 -318 -310 -338 -316 -324 -243 -317 -370 -340 -379 -385 -336 -260 -191 -301 -287 -285 -277 -317 -320 -414 -260 -277 -251
-977 -251 -280 -296 -274 -291 -321 -277 -326 -343 -235 -277 -358 -379 -355 -393 -444 -285 -317 -312 -294 -355 -271 -162 -252 -345 -338 -243 -338 -385 -311 -210 -279 -244 -249 -263
-985b63m3K8J06n8K7l5j12K4p1lQ0J34q4m0M6Q1q4o2n1K2M0O1lNL1l2k1l6j6j6Q4L3l0N1M3
-994a64N%j03j10LJ21J03r1Q5j21j21P5k2n6R0q1l5l4R0J77j7j41j7Q5L0M0k1K6L1O9j96L3
-1002b67lP3ok7JK9j24M%O5o1K2L3O8r7k2k3J34J3q1J5N3o1j25J74P9p6K4j23K09rm8m8r2
-1010b97k7J42r0m8N2Pj04m8N6J20k7Pn3l1Q3N2j32L8P3lLL7j0j1l2L3l0mr1P8r4L4k5P8J32
-1018a32j2j22NpP3L1R7j03o5n9L6J7Q2n9k2kM8j07N6R0m6j43R5l5N4oJ0N0l2MQ2p0K4j03
-1027b71m5l8J35kP4j20P1k1K1m1n9K9K4K4ol2N2K5L8j1n0qr5m8QmJ14N6K5M1nrK0o5P4j05
-1036b04L6j23Qm4K3j3m1L2P3r8J10M1O4j21L4m5JK7R0k0o6k1M5l3p1Q5kr6J34K3n1M6K7n5
-1044b05O0q1J3K7m5o9L5J8J65N2j52L6M6m9q2O0L3m9Ok9k3o9R6P9p3j06o0M0qJ64P2l3m6
$$ plain form
-985 -263 -306 -278 -172 -230 -203 -238 -350 -326 -397 -400 -320 -186 -270 -310 -264 -183 -267 -329 -380 -358 -318 -257 -260 -255 -224 -256 -277 -313 -329 -345 -261 -228 -258 -207 -164
-994 -164 -159 -159 -262 -372 -369 -248 -145 -236 -151 -272 -393 -318 -340 -396 -306 -387 -422 -456 -366 -189 -206 -347 -364 -279 -249 -209 -230 -204 -173 -104 -300 -267
-1002 -267 -270 -197 -203 -230 -229 -200 -324 -320 -320 -255 -316 -294 -261 -193 -290 -312 -335 -201 -188 -269 -254 -201 -262 -387 -213 -134 -210 -186 -309 -100 -109 -157 -205 -297
-1010 -297 -324 -182 -272 -320 -268 -261 -365 -413 -357 -237 -264 -257 -310 -341 -258 -206 -338 -300 -227 -230 -227 -190 -200 -211 -243 -210 -240 -244 -335 -257 -351 -317 -342 -264 -132
-1018 -132 -144 -266 -261 -268 -195 -164 -67 -170 -235 -294 -258 -241 -159 -218 -240 -242 -194 -301 -245 -155 -201 -344 -249 -284 -230 -236 -226 -176 -208 -204 -122 -192 -168 -271
-1027 -271 -316 -354 -219 -221 -147 -267 -196 -217 -196 -237 -296 -267 -243 -219 -225 -257 -205 -180 -142 -153 -203 -211 -306 -354 -346 -350 -236 -180 -155 -114 -119 -128 -108 -173 -99 -204
-1036 -204 -168 -291 -283 -327 -304 -317 -358 -326 -253 -351 -241 -200 -136 -257 -223 -268 -267 -240 -150 -170 -236 -257 -212 -245 -316 -231 -233 -329 -195 -172 -223 -177 -150 -205
-1044 -205 -145 -226 -213 -186 -231 -300 -265 -247 -82 -30 -182 -146 -100 -149 -231 -171 -138 -187 -181 -210 -233 -302 -206 -127 -200 -306 -366 -326 -334 -170 -98 -131 -177
-1052a77j24n7J57o5rOL9k0J31J06j78K3rn0j0ql3m6N6l1N0L0J7j20L7K38l2j39r6K6J23N
-1060a60n5L7J09MO1j73j00O5k0J8J29l1o1o2N7O9K7l9l8j20J45j20j4M6L9l2m7ll2O4J68
-1067f9N5n1m1J20m0o4K2O4q0p5p2J11N6mq1Jj08O2oJ08o9Nr4p8O0J34K5j57n6J62K3n5m3
-1075b35O5M6n0k8j9j42K6O4J09r8J03j1J12n4Kj8j69p5P7P0o2l2O1p1Q4J3R4m2n8Q5n1m8
-1083b52k3j6L5R4Jq3J2J3J07Jqj95J6P4m1M5K4%J58j31K0j09K9J00Q2j12j11k0L9MO9n7j17
-1091c52N7J08N1k5j33J0L8L8j10R7J2K4j0n1OJ06k0jk2J33k5p1j05p6K5J27m4j7K9qq5K3
-1099b71J5O8l9M1k1j0M0K4j09Q2Op2J21M4r7Qp1K0q0m5O8J17j7l8p9qK1P3J17l8n1N2K4j17
-1107b22N9Q0q2p5l1O8m0n4O0J03J7R9j35j30J6O9k9N8P2p6JQk6p5K7K7k9k8j0n2J33K0Lj15
$$ plain form
-1052 -177 -301 -358 -201 -266 -275 -269 -230 -250 -119 -13 -191 -168 -177 -227 -237 -245 -278 -324 -268 -299 -249 -219 -202 -322 -285 -47 -79 -218 -314 -288 -165 -160
-1060 -160 -215 -178 -69 -65 -4 -177 -277 -212 -232 -214 -85 -116 -177 -239 -182 -113 -86 -125 -163 -283 -138 -258 -272 -226 -187 -219 -266 -269 -301 -237 -69
-1067 -69 -14 -65 -106 14 -26 -90 -68 -4 -84 -159 -231 -120 -64 -68 -149 -148 -256 -194 -200 -92 -161 -156 -250 -328 -268 -134 -109 -266 -322 -160 -137 -192 -235
-1075 -235 -170 -124 -174 -202 -221 -363 -337 -273 -164 -262 -159 -170 -58 -112 -110 -128 -297 -372 -295 -225 -287 -319 -258 -329 -245 -232 -138 -180 -238 -153 -204 -252
-1083 -252 -275 -291 -256 -162 -161 -244 -232 -219 -112 -111 -119 -314 -298 -224 -265 -220 -196 -196 -38 -169 -149 -258 -229 -129 -47 -159 -270 -290 -251 -247 -178 -235 -352
-1091 -352 -295 -187 -136 -161 -294 -284 -246 -208 -318 -221 -209 -185 -195 -246 -240 -134 -154 -155 -177 -44 -69 -140 -245 -321 -296 -169 -213 -230 -201 -209 -294 -271
-1099 -271 -256 -188 -227 -186 -207 -217 -177 -153 -262 -180 -174 -246 -125 -81 -178 -170 -241 -221 -301 -346 -278 -161 -178 -216 -295 -303 -282 -209 -92 -130 -181 -129 -105 -222
-1107 -222 -163 -83 -165 -240 -271 -203 -243 -297 -237 -134 -117 -18 -153 -283 -267 -198 -227 -169 -97 -173 -172 -164 -190 -265 -238 -211 -240 -268 -278 -330 -197 -177 -174 -289
-1116b89K1l2P5P3j9NM3o1o0P3nm9J8L0L1J4Q1m2ok2k3j29N0K8P5K4Q8l7j65k6n6L6L7O0j
-1124a60k3K9k6p0M8K06Pq3j74LJ02Q6K0j6p1p7j5k8O4L9j07N0r0L5J03L2K6m6o0K1l2J25
-1132h2J5P4j42Ml3Q1Pn7l0K7m7R6j42m4j5J25j6L2RN2j49K0N7N8MJ0m0N6kk8j93j2N7j5R
-1141b54N9J19J2o0K2P6l3m6M2n4J2q6K9l4L6o4Q0N5J6j42R8o7M3j5OJ3M9jo1K3qK5M1oN3
-1149b2q7j9l2Ol1P9o6Rl7L4M7KJ6N1m4j3j5o8J2kj30N4l5PJ6L8K6J15l2k3n0n6J47j16PJ09
-1158a03n3O7NL2N2%j20n2J0n9l0J20M6j5j43J09j8p7L4L9p2Q2j1P0Q3J5qp3m6J5pJ16L3r8
-1166e7j5m2%O2j44L2m2j0K8K5rJ5J11O1q1j2n7K1k2O0J02n6p2j1Q2j9p7r1N7J8J4Oj21n7
-1175c01J17K7K2K4l9m2Q4P2l6q2P9j5k2n6P4No2j7p6K5Q9K9r5q1P1J09J9r4J12j27r8JO5
$$ plain form
-1116 -289 -268 -300 -225 -152 -171 -166 -123 -184 -244 -171 -176 -225 -207 -177 -146 -132 -51 -93 -99 -121 -144 -273 -223 -195 -120 -96 -8 -45 -210 -236 -292 -256 -219 -159 -160
-1124 -160 -183 -154 -180 -250 -202 4 11 -72 -246 -243 -141 -55 -35 -51 -122 -199 -214 -242 -178 -139 -246 -196 -286 -251 -148 -116 -90 -136 -196 -175 -207 -82
-1132 -82 -67 7 -135 -131 -164 -83 -76 -133 -163 -136 -183 -87 -229 -273 -288 -163 -179 -147 -138 -86 -235 -215 -158 -100 -96 -86 -126 -70 -72 -100 -293 -305 -248 -263 -254
-1141 -254 -195 -76 -64 -124 -102 -26 -59 -105 -63 -117 -105 -191 -162 -196 -160 -224 -144 -89 -73 -215 -117 -184 -141 -156 -150 -137 -88 -89 -150 -127 -135 -110 -69 -75 -22
-1149 -22 -109 -128 -160 -154 -185 -106 -172 -163 -200 -166 -119 -117 -101 -50 -94 -107 -122 -190 -178 -180 -310 -256 -291 -284 -268 -230 -204 -89 -121 -144 -194 -250 -103 -219 -212 -103
-1158 -103 -156 -89 -84 -52 0 0 -120 -172 -162 -221 -251 -131 -85 -100 -243 -134 -152 -229 -195 -156 -228 -146 -157 -87 -4 11 3 -70 -116 -101 -108 8 41 -57
-1166 -57 -72 -114 -114 -52 -196 -164 -206 -216 -188 -163 -172 -157 -46 15 -66 -78 -135 -114 -136 -76 26 -30 -102 -113 -31 -50 -127 -218 -161 -143 -129 -123 -244 -301
-1175 -301 -184 -157 -135 -111 -150 -192 -108 -36 -72 -154 -75 -90 -112 -168 -94 -89 -151 -168 -244 -219 -130 -101 -196 -277 -206 -97 -78 -172 -60 -187 -285 -284 -219
-1183b19N0P0Nq4j11J47O5OJ3l7l1O5q4k1oO3n1M5MJ10N0Kj39K6m2j28OL9Q3J6r5l3J3M8j54
-1191c09K2J1L0K6j7j8k6lQ6M8J87j10J3l3p6N7k1K5J7L1Q6k12PnO7K8Q5j8M8r1r2j13J81
-1199h9K5L3K3j15o5O5q3N2n1m5R2O3m0P9N0o3j36Q1m4n9Q8N8N7M7r4rk3P6j53L5p1l8J01
-1207a53N7j34K4P2M3mjk6K2J1P0k2l2K2K1K0Nl4Q4j24K2k0q0o4J23J10M4j55oQ0o5o8N7L3
-1216f8o2l3J1J4L7l9J5n0K6q9N7n7J34Q8l7j13Q2R8M0o8j53K9Oj11K1%J97p5j31J0L0jj8
-1224b10K0LJ98r4q5L5k6m5o7R3n9N0PP2L2q9LJ53k7m3N3M0L3nn6m0m0k1K6rk2Q4K3L5p7j04
-1233a59R5r3M9Q2l9kl6o8R8Jp2n3J04j2K2M9L7Rj20k8Q6L2k1R0K4j09M2qr8j00N0q7J46k5
-1241a14o1J9J03l7P8N8j42k5N5J9p4m1rN4K4rJ29p4J4n8Jl4J3Q8Q6j41J29p2m9o2kq8P9j
$$ plain form
-1183 -219 -169 -99 -94 -178 -289 -142 -77 -71 -58 -95 -126 -61 -145 -166 -172 -109 -160 -115 -111 -1 49 51 -88 -62 -104 -232 -226 -187 -104 -88 -183 -216 -203 -155 -309
-1191 -309 -287 -276 -246 -220 -237 -255 -281 -284 -198 -150 37 -73 -60 -93 -169 -112 -133 -108 -91 -60 26 -186 -179 -184 -117 -89 -4 -22 26 -65 -157 -270 -89
-1199 -89 -64 -31 -8 -123 -188 -123 -206 -154 -205 -250 -158 -95 -135 -56 -6 -69 -205 -124 -168 -227 -139 -81 -24 23 -71 -80 -103 -27 -180 -145 -216 -254 -153
-1207 -153 -96 -230 -206 -134 -91 -95 -96 -122 -100 -89 -19 -41 -73 -51 -30 -10 -5 -39 45 -79 -57 -77 -157 -221 -98 12 56 -99 -105 -25 -90 -158 -101 -68
-1216 -68 -130 -163 -152 -138 -101 -140 -125 -175 -149 -238 -181 -238 -104 -16 -53 -166 -84 14 54 -14 -167 -138 -132 -243 -222 -222 -25 -100 -231 -221 -191 -192 -210
-1224 -210 -190 -187 11 -83 -168 -133 -159 -204 -271 -178 -237 -187 -180 -108 -76 -165 -162 -9 -36 -79 -26 14 47 42 -14 -54 -94 -115 -89 -98 -120 -36 -13 22 -55 -159
-1233 -159 -64 -157 -108 -26 -65 -67 -103 -171 -73 -72 -144 -197 -93 -105 -83 -34 3 12 -108 -136 -50 -18 -39 51 75 -34 8 0 -98 -198 -148 -235 -89 -114
-1241 -114 -175 -156 -53 -90 -12 46 -96 -121 -66 -47 -121 -162 -171 -117 -93 -102 27 -47 -33 -91 -90 -124 -111 -23 63 -78 51 -21 -70 -132 -134 -222 -143 -144
-1249a44J6m5O6J4O2j24j2l1k4K3J44J15k5p7k6l8N5o6jmK6m5J4pN5p1O0O6P2j60n6L2P7j8
-1258g7j6J7m3Q7O1k19Q1jJ61k4p5L7P4r4o2l7O1O3r7n5l5m4J28q9n5j5J04N7J12q1L2j02
-1265a46M1K3R2l9kl0KK4K5p9O2m6K9p1M9J5R7l2m8m7K2j0lJ5N5m6j2Kl0J25K4j04L5J7L7
-1274D6L2o6o2l8J9o9J3O8p7j5J40kL5j3o7J1N4p7l0P6K0j8j37mK3L4M7Q1l6J6j24N5M9o7
-1282h3J12r9j07mO7nP9Ol4o9N6j3o4Q8J19J7qj27q7R6M4K7l8l0N1j1m3Rm9k5R9N9m7j06p4
-1291a94R8J4j8j24RM2J28j1n3p8l5L4l5QJ46o4q4J30K4M2r2M5mj17l4O2N3J63Ll2k09l4l
-1299b20J24J50L7l4j16J25N1k9J1j44p1P8N2n7P8j45K4k7o9k3J15J47m4r1K2m5N2o6j2n3
-1306a80P1L5j6j1L6k1O7roj4j2K6J01j2j2p9o9o1R7J5N3jM9m7Kj13MJ0J18r8M2l8N3Km1n3
$$ plain form
-1249 -144 -128 -173 -107 -93 -31 -155 -167 -198 -222 -199 -55 60 35 -42 -68 -106 -51 -117 -118 -122 -96 -141 -127 -134 -79 -150 -90 -24 48 -112 -168 -136 -59 -77
-1258 -77 -93 -76 -119 -32 29 -190 -109 -110 51 27 -48 -11 63 -31 -93 -130 -69 -6 -103 -158 -193 -237 -109 -198 -253 -268 -164 -107 5 -76 -44 -146
-1265 -146 -105 -82 10 -29 -31 -61 -59 -35 -10 -89 -27 -73 -44 -115 -66 -51 46 14 -34 -81 -59 -69 -72 -57 -2 -48 -60 -58 -88 37 61 -43 -8 9 46
-1274 46 78 12 -50 -88 -69 -138 -125 -57 -134 -149 -9 -11 24 11 -56 -45 9 -68 -98 -22 -2 -20 -157 -161 -138 -104 -57 24 -12 4 -120 -65 -16 -83
-1282 -83 29 -70 -177 -181 -114 -119 -40 -34 -68 -137 -81 -94 -158 -70 49 66 58 -69 -156 -60 -16 11 -27 -57 -6 -17 -60 -51 -100 -125 -26 33 -14 -120 -194
-1291 -194 -96 -82 -100 -224 -215 -173 -45 -56 -109 -187 -222 -188 -223 -215 -69 -133 -217 -87 -63 -21 -113 -68 -72 -189 -223 -161 -108 55 58 26 -183 -217 -220
-1299 -220 -96 54 91 57 -59 66 117 88 99 -45 -116 -38 14 -43 35 -110 -86 -113 -182 -205 -90 57 13 -78 -56 -101 -49 -115 -127 -180
-1306 -180 -109 -74 -90 -101 -65 -86 -19 -28 -34 -48 -60 -34 67 55 43 -36 -105 -166 -69 -54 -1 -2 47 0 2 -111 -107 -97 21 -77 -35 -73 -20 -18 -59 -112
-1315a12O0m2J1L3J0Q3O4q5j09k8J84l3q7oL3n2L5nQ4m2N3n2j0l4Q2o9KN0l8j18n8J01J37
-1323D2l1l2k4RR0oj32J51Mq2k1J4LK3K4nj46J00O9N8r2n4M9J2j40nM5J17Mn9o2l9j1Q8O2
-1332B3L6q3J09K3q2L7jj2m0q4Kl0n1kJ31r5P0ok6L5O0r4K4m7O6j6r9m9M6P4j08p3P7P0N8
-1340e7Q0J5l5j4j55J18J0mK4K9O7j7r9ql9P3J01j31M7K8M5m5l6j30L4Q3j7m3M4J1O0j28Q7
-1348bO4l2j3J8o1N0m4j12L3p0m0N6L3N7M4o9j11R%J27L4p4P1Nom7mK2p3l2R8L4o9MlJ05J4
-1357A6K9k2m1mn9q6K1M4J55n7JJ7K3j7J0p3l2p6P3K2k3j8K4m8K5m1O1r4l9R6m7K4L1R3K2
-1366A0o9N1N4O1k05P2l0O9M3o4p0j5nR4k1k0r5k2J38P3K0J4L9o8p4O4K5J34p4j43m8k0j8
-1374a00K3l6N6j0J13j17p1Q3J49J5l2k58P6L1K4K6K74j84j6k07J6M4k6J6R8K6J4o2J25RJ2
$$ plain form
-1315 -112 -52 -94 -83 -50 -40 43 107 22 -87 -115 69 36 -51 -57 -24 -76 -41 -46 38 -4 49 -3 -13 -47 35 -34 -32 18 -20 -138 -196 -95 42
-1323 42 11 -21 -45 -36 54 48 -84 67 71 -11 -32 -18 -15 8 32 27 -119 -19 50 108 16 -38 11 23 -117 -122 -77 40 44 -15 -77 -116 -127 -39 23
-1332 23 59 -24 85 108 26 63 62 50 10 -74 -72 -102 -153 -155 -24 -119 -49 -55 -81 -46 14 -80 -56 -103 -37 -53 -152 -201 -155 -81 -189 -262 -185 -115 -57
-1340 -57 23 38 3 -11 -166 -48 -38 -42 -18 11 78 61 -38 -46 -85 -12 89 -42 5 33 78 33 -3 -133 -99 -16 -33 -76 -32 -21 39 -89 -2
-1348 -2 62 30 17 35 -26 24 -20 -132 -99 -169 -209 -153 -120 -63 -19 -88 -199 -190 -190 -63 -29 -103 -32 -27 -33 -80 -84 -62 -135 -167 -69 -35 -104 -100 -103 2 16
-1357 16 45 23 -18 -22 -81 -167 -146 -102 53 -4 -3 14 37 20 30 -43 -75 -151 -78 -56 -79 -97 -73 -121 -96 -137 -76 -170 -209 -113 -160 -136 -105 -12 10
-1366 10 -59 -8 46 107 -98 -26 -56 13 56 -8 -78 -93 -98 -4 -25 -45 -140 -162 -24 49 69 83 122 54 -20 44 69 203 129 -14 -62 -82 -100
-1374 -100 -77 -113 -57 -67 46 -71 -142 -59 90 105 73 -185 -109 -78 -54 -28 246 62 46 -161 -145 -101 -127 -111 -13 13 27 -35 90 99 111
-1382A11r3j07J0P5L4n5l5J80j0ln9j09j7r0m3O3J71M5m7j2j08Pj3J43K7n9j50m1pL7J8R4
-1389d3k3KJ13k3q7l1Q6L9p1m0rj7r9K3l8J5R4MP4rlO3j23l8M4L5Q0L0j19j34O1J62K5J3m3
-1398A3L8p1r7K4L8o8nJ5J79k2j16m0K4n4pO8Q4n4k2qK6j6PO2P0k9q1M4j33r1J0k9O3P8m5
-1407a45Q2R5n3K0Q3p7j42n8J11n8L7j4P1L4o7N2k9r1Qj4%m7K8N0n6K3J38M0P3l1L3j14r7
-1415a15%Q7Jp3J9j20P7M5M7N0j44r1J8J25n5L1pk6k6N6l5M7q0P0m0J8o5J9p8J90mj25j34
-1423c18R8N1N8K2p3qQ2L0K9Np2j02J11r7M4J05J27m6j15J12J6o9L1o0K9M2l6k8K8ko1j03
-1430a70K2r8P0L2P8J9M8p4%k1M6m2K9k4P3m1M0J3L8p2M2O3l4p3n2j73J02lP6n5L6j0K0o5
-1439a60R4l4m3JJ62p0j7J19m6q5P5nRj04j4M0M4j10KJ1L0k8P2Rm9pJ08o3Q1jn2N1N4m6n2
$$ plain form
-1382 111 18 -89 -79 -4 30 -25 -60 120 110 107 48 -61 -78 -168 -211 -148 23 68 21 9 -99 -92 -105 38 65 6 -144 -185 -192 -155 -137 -43
-1389 -43 -66 -64 49 26 -61 -92 -6 33 -38 -78 -87 -104 -203 -180 -218 -203 -109 -105 -31 -40 -43 20 -103 -141 -97 -62 18 48 -71 -205 -144 18 43 56 13
-1398 13 51 -20 -117 -93 -55 -123 -128 -113 66 44 -72 -112 -88 -142 -149 -81 3 -51 -73 -81 -55 -71 -64 -2 68 39 -42 2 -131 -222 -212 -241 -178 -100 -145
-1407 -145 -63 32 -21 -1 82 5 -137 -195 -84 -142 -105 -119 -48 -14 -81 -29 -58 -149 -141 -155 -155 -202 -174 -124 -180 -157 -19 21 94 63 96 -18 -115
-1415 -115 -115 -28 -27 -100 -81 -201 -124 -79 -32 18 -126 -217 -199 -74 -129 -98 -105 -131 -157 -101 -136 -89 -169 -99 -139 -121 -186 -167 -245 -55 -59 -184 -318
-1423 -318 -220 -169 -111 -89 -162 -170 -88 -58 -29 -24 -96 -198 -87 -184 -140 -35 92 46 -69 43 59 -10 21 -39 -10 32 -4 -32 -4 -6 -67 -170
-1430 -170 -148 -246 -176 -144 -66 -47 1 -73 -73 -94 -48 -90 -61 -85 -12 -53 -13 0 38 -34 8 71 37 -36 -88 -261 -159 -162 -86 -141 -105 -115 -95 -160
-1439 -160 -66 -100 -143 -142 20 -50 -67 52 6 -79 -4 -9 0 -104 -118 -78 -34 -144 -142 -131 -101 -129 -57 -48 -97 -104 4 -59 22 21 -31 20 74 28 -24
-1447b4n3o4K0L9L2pm5k6j4K5M8kj9n3M7M3l9o3L4J45J9j43KO2m2J9P7n5m2o2j0R1M2rN3o8
-1456d2O2p4r1o2M7L7j10J45N5m6j05J39Oj20L0K5N1jJ37n2j15j29O6J34N2r8Mm9J6Q8Mq6
-1464h2O8r5j6J87o0N1l8k3J6L5l0j13N8K8K8P9m7j36n1N6K4oM6j12l3jJ01J7M4j32QJ0K6
-1472i3O0K3nk6q5OL9K9R6k9m1N8Qj19l1J9q0J5K3P0K3l4m3L3oj8j36J01L4L5m3k1Q9Jj8L6
-1481c0L0Qj37j05k8J03J12N9L5M0j41qJ57J04j90k7l4j21J32J23k7M9L4j61l9K5p1k5M8Q6
-1488A%M5p0j14M4nj50Q4R9J4P7n3j62L0M1N4No5p7J19o7n7J29N7r2K9n8O9j8Nk2K7J29J2
-1497F0o5j31oJ55m1On2K0L3Mo8K5l6K8rp5LM3MQ8K9J08p7nN0q6j05l8j7J30K7k9n4J00j2
-1505Gn3RQ3k9l1r5P9l4J57K3p1j17P1k2M8k5p0o5L1m9K2J3QQP8q4K0N1J3J3J2l3m0k1J06
$$ plain form
-1447 -24 -77 -141 -121 -82 -50 -57 -102 -128 -142 -117 -69 -71 -90 -143 -96 -53 -92 -155 -121 24 43 -100 -98 -36 -78 -59 18 -37 -79 -141 -151 -60 -18 -27 26 -42
-1456 -42 20 -54 -145 -207 -160 -123 -233 -88 -33 -79 -184 -45 -39 -159 -129 -104 -53 -54 83 31 -84 -213 -147 -13 39 -59 -55 -104 -88 0 4 -82
-1464 -82 -14 -109 -125 62 2 53 15 -8 8 43 13 -100 -42 -14 14 93 46 -90 -141 -85 -61 -67 -21 -133 -166 -167 -66 -49 -5 -137 -129 -119 -93
-1472 -93 -33 -10 -15 -41 -126 -120 -81 -52 44 15 -26 32 40 -79 -110 -91 -171 -156 -133 -63 -40 -74 -117 -84 -90 -108 -244 -143 -109 -74 -117 -138 -49 -48 -66 -30
-1481 -30 0 8 -129 -234 -262 -159 -47 12 47 87 -54 -62 95 199 9 -18 -52 -173 -41 82 55 104 138 -23 -62 -37 -108 -133 -85 1
-1488 1 1 46 -24 -138 -94 -99 -249 -165 -66 -52 25 -28 -190 -160 -119 -65 -60 -125 -202 -83 -150 -207 -78 -21 -113 -84 -142 -73 -91 -86 -108 -81 48 60
-1497 60 -5 -136 -142 13 -28 -22 -74 -54 -21 -17 -85 -60 -96 -68 -77 -152 -149 -106 -102 -14 15 123 46 41 91 5 -100 -138 -155 -25 2 -27 -81 19 7
-1505 7 -46 -37 46 17 -14 -109 -30 -64 93 116 45 -72 -1 -23 25 0 -70 -135 -104 -153 -131 -118 -110 -102 -24 -108 -88 -37 -24 -11 1 -32 -72 -93 13
-1514A3o4m6J6R6L0Q2l5Jkj01j42M2O5%lJ6K2k5o5L2o9J3Q8m7k3nk2J2J04J7k3o8JP7J2j04
-1522a05k4k4O5J3M8L0l1l4QL8j4m3Q1N1o3J4l0o7k1L0J3n2M5N7J9p3l1NP5Ojn2q0J16o2R
-1531h4j6j07Q4k7J6n6Q6rk4n8J0K9J4L4M4K0%l5J7K0J6k9P3Pr9l6K1j5J10n8M4l6O9k5l5
-1540c5R3o4j00mN0J14r1k9qO0l3j08p3J13Q2j9n8P8J1J9PJ06j47m3J15oj04Ol0PK5J23k5
-1548C2o3n9R4j05K8Lk5l9R2J0Pq0P3o8%o7Ql2J83k8kq8L3k4J4MO8J14l7j42K2QN9l6M6o5
-1557f2N8oNj5k7m4N0j00O6PP2k6n0J6L0Ok7m0O4n3q1J02L5N9j0m6n0j2Q8JL6j5Rj28j4K2
-1565h0K8P0J9n5L8p3J2K1J8rR5l1n2q6q9O8K7N6L8o5k9qO3n5M1m5K4K8L0N2j4l2M1L5rj3
-1574E9j10PM4l4L4l1L9m0m4R0o1M7m1m8R7O8m4Jn9m6m6M6N2o5l5J02N9n2M3p0p7K1K5QM5
$$ plain form
-1514 13 -51 -97 -81 15 45 127 92 93 91 -10 -152 -110 -45 -45 -48 -32 -10 -35 -100 -68 -137 -124 -36 -83 -106 -111 -133 -121 -17 0 -23 -91 -90 -13 -1 -105
-1522 -105 -129 -153 -88 -75 -27 3 -28 -62 -54 -16 -30 -73 8 59 -4 10 -20 -87 -108 -78 -65 -117 -72 -15 4 -69 -100 -95 -20 -14 -15 -67 -147 -31 -93 -84
-1531 -84 -100 -207 -123 -150 -134 -190 -104 -113 -137 -195 -185 -156 -142 -108 -64 -44 -44 -79 -62 -42 -26 -55 18 25 -74 -110 -89 -104 6 -52 -8 -44 25 0 -35
-1540 -35 58 -6 -106 -110 -60 54 -37 -66 -74 -14 -47 -155 -228 -115 -33 -52 -110 -32 -21 -2 5 111 -36 -79 36 30 -74 -68 -98 -91 -66 57 32
-1548 32 -31 -90 4 -101 -73 -70 -95 -134 -42 -32 -25 -105 -32 -100 -100 -167 -159 -191 -8 -36 -38 -126 -93 -117 -103 -99 -31 83 46 -96 -74 -66 -7 -43 3 -62
-1557 -62 -4 -10 -5 -20 -47 -91 -41 -141 -75 -68 4 -22 -72 -56 -26 -20 -47 -87 -23 -76 -157 -55 -20 39 29 -17 -67 -79 9 10 46 31 40 -88 -102 -80
-1565 -80 -52 18 37 -18 20 -53 -41 -20 -2 -11 84 53 1 -85 -174 -106 -79 -23 15 -50 -79 -87 -24 -79 -38 -83 -59 -31 -1 51 37 5 46 81 72 59
-1574 59 -51 -44 0 -34 0 -31 8 -32 -76 14 -47 0 -41 -89 8 76 32 33 -26 -72 -118 -72 -20 -85 -120 -18 41 -11 32 -38 -115 -94 -69 -61 -16
-1583a6K5qk8n5j0j0j9L3N9O0m3p3L8k8L4K0qm3M6l1Rk3m6K1R2l1%KJ6k4M0m0l7O4N5j07l5
-1592a01K9j7L2L5m5Pj8P9N6m5n9P0j01n8N9O4Pj5j08k8k1N4L6J10k8J3
$$ plain form
-1583 -16 9 1 -27 -82 -92 -102 -121 -88 -29 31 -12 -85 -47 -75 -41 -21 -29 -72 -26 -57 -48 -71 -117 -96 -4 -35 -35 -33 -17 -41 -1 -41 -78 -14 41 -66 -101
-1592 -101 -72 -89 -57 -22 -67 -60 -78 1 57 12 -47 23 -78 -136 -77 -13 -6 -21 -129 -157 -178 -124 -88 22 -6 7
-1598G
##$OBSERVED INTEGRALS=	(X Y Z)
(7.2177055043989621907, 7.3260841548272432888, 1.0354636588319907631)
(7.0390715170493400876, 7.1088599861022885307, 0.9204828400111982889)
(6.8323002277647617575, 6.8816389739881147491, 0.88189584446399027495)
(5.3240932166283192473, 5.5209144851855853631, 5.1319726270718373229)
(2.973173868448236945, 3.0871988152290619212, 0.95305173135623655334)
(2.8078327353096153018, 2.9169143846183311908, 3.3545880186198386852)
(2.5913216253590523053, 2.6738263764343863649, 1.9381409652909711294)
(2.3487520449685024282, 2.3937477947192307148, 2.8515560818259961806)
(2.0680838325254478072, 2.2062586379020889815, 3.8296036448183539136)
(1.7785049439843294561, 1.8978736715043080796, 1.9517833206180141836)
(1.3107627150201026645, 1.5563748516179738424, 11.001750552950122497)
(1.2203080991352337481, 1.3107627150201026645, 6.1951069422277766918)
(1.0014591083582153885, 1.0832127328705449809, 2.1865578661226097168)
(0.9102784311819729357, 1.0014591083582153885, 1.7680459057910615783)
(7.2997370632198093077, 7.3069658078622667929, 0.075506067319780295621)
(7.2574767099254433589, 7.2624812254471429185, 0.32253029149181028368)
(7.236717238131721075, 7.2454288021880151049, 0.449893498029037886)
(7.130695650042342848, 7.1401486238055591471, 0.016041414245978345698)
(7.1136432267832159226, 7.1164235131841575566, 0.011435357378891468708)
(7.0791676754114947201, 7.0889913540281677129, 0.39792287616156335472)
(7.0582228511910445334, 7.0693439967948226155, 0.35484973105625383649)
(6.8376534633827281695, 6.8715729574742585584, 0.86778264240328217838)
##END=	
##END=	
