##TITLE=	Jan17-2020.60.fid
10-C1; L. Y.
##JCAMP-DX=	6.0	$$ MestReNova 14.1.0-24037
##DATA TYPE=	LINK
##BLOCK_ID=	1
##BLOCKS=	1    
##ORIGIN=	Mestrelab Research S.L.
##OWNER=	yl5119
##$MNOVA/LINK_BLOCK_TYPE=	ITEM	$$ NMR Spectrum
##$MNOVA/ITEM/POLYGON=	(XY..XY)
5321,5835
8722,5835
8722,8208
5321,8208
5321,5835
##$MNOVA/ITEM/Z=	0
##$MNOVA/ITEM/ANGLE=	0
##TITLE=	Jan17-2020.60.fid
##JCAMP-DX=	6.0	$$ MestReNova 14.1.0-24037
##BLOCK_ID=	2
##DATA TYPE=	NMR SPECTRUM
##DATA CLASS=	XYDATA
##NUMDIM=	1
##ORIGIN=	Bruker BioSpin GmbH
##OWNER=	nmrsu
##.OBSERVE FREQUENCY=	400.05240029999998796
##.OBSERVE NUCLEUS=	^1H
##.SOLVENT NAME=	CDCl3
##.PULSE SEQUENCE=	zg30
##LONGDATE=	2020/01/17 15:52:00.000
##.ACQUISITIONMODE=	SIMULTANEOUS (DQD)
##$ORIGINAL FORMAT=	Bruker XWIN-NMR
##$MNOVA/SCALES_VERSION=	8
##$PARAMETER FILE=	(acqus, ASCII, //icnas1.cc.ic.ac.uk/yl5119/Desktop/60/acqus, 0)
$$ ##TITLE= Parameter file, TOPSPIN		Version 3.2
$$ ##JCAMPDX= 5.0
$$ ##DATATYPE= Parameter Values
$$ ##NPOINTS= 11	$$ modification sequence number
$$ ##ORIGIN= Bruker BioSpin GmbH
$$ ##OWNER= nmrsu
$$ $$ 2020-01-17 15:52:44.580 +0000  nmrsu@nmrpc
$$ $$ /opt/topspin/data/ug1/nmr/Jan17-2020/60/acqus
$$ $$ process /opt/topspin3.2/prog/mod/shimcntl
$$ ##$ACQT0= -2.04831932773109
$$ ##$AMP= (0..31)
$$ 100 100 100 100 100 100 100 100 100 100 100 100 100 100 100 100 100 100
$$ 100 100 100 100 100 100 100 100 100 100 100 100 100 100
$$ ##$AMPCOIL= (0..19)
$$ -1 0 0 0 0 0 0 0 0 0 0 0 0 0 0 0 0 0 0 0
$$ ##$ANAVPT= -1
$$ ##$AQSEQ= 0
$$ ##$AQ_mod= 3
$$ ##$AUNM= <au_zg>
$$ ##$AUTOPOS= <35 >
$$ ##$BF1= 400.05
$$ ##$BF2= 400.05
$$ ##$BF3= 400.05
$$ ##$BF4= 400.05
$$ ##$BF5= 400.05
$$ ##$BF6= 400.05
$$ ##$BF7= 400.05
$$ ##$BF8= 400.05
$$ ##$BYTORDA= 0
$$ ##$CAGPARS= (0..11)
$$ 0 0 0 0 0 0 0 0 0 0 0 0
$$ ##$CFDGTYP= 0
$$ ##$CFRGTYP= 9
$$ ##$CHEMSTR= <none>
$$ ##$CNST= (0..63)
$$ 1 1 1 1 1 1 1 1 1 1 1 1 1 1 1 1 1 1 1 1 1 1 1 1 1 1 1 1 1 1 1 1 1 1 1 1
$$ 1 1 1 1 1 1 1 1 1 1 1 1 1 1 1 1 1 1 1 1 1 1 1 1 1 1 1 1
$$ ##$CPDPRG= (0..8)
$$ <> <> <> <> <> <> <> <> <>
$$ ##$D= (0..63)
$$ 0 1 0 0 0 0 0 0 0 0 0 0 0 0 0 0 0.0002 0 0 0 0 0 0 0 0 0 0 0 0 0 0 0 0
$$ 0 0 0 0 0 0 0 0 0 0 0 0 0 0 0 0 0 0 0 0 0 0 0 0 0 0 0 0 0 0 0
$$ ##$DATE= 1579276363
$$ ##$DE= 6.5
$$ ##$DECBNUC= <off>
$$ ##$DECIM= 2496
$$ ##$DECNUC= <off>
$$ ##$DECSTAT= 4
$$ ##$DIGMOD= 1
$$ ##$DIGTYP= 12
$$ ##$DQDMODE= 0
$$ ##$DR= 22
$$ ##$DS= 4
$$ ##$DSPFIRM= 0
$$ ##$DSPFVS= 20
$$ ##$DTYPA= 0
$$ ##$EXP= <proton>
$$ ##$F1LIST= <>
$$ ##$F2LIST= <>
$$ ##$F3LIST= <>
$$ ##$FCUCHAN= (0..9)
$$ 0 2 0 0 0 0 0 0 0 0
$$ ##$FL1= 90
$$ ##$FL2= 90
$$ ##$FL3= 90
$$ ##$FL4= 90
$$ ##$FOV= 20
$$ ##$FQ1LIST= <>
$$ ##$FQ2LIST= <>
$$ ##$FQ3LIST= <>
$$ ##$FQ4LIST= <>
$$ ##$FQ5LIST= <>
$$ ##$FQ6LIST= <>
$$ ##$FQ7LIST= <>
$$ ##$FQ8LIST= <>
$$ ##$FRQLO3= 15959.0749999881
$$ ##$FRQLO3N= 2
$$ ##$FS= (0..7)
$$ 83 83 83 83 83 83 83 83
$$ ##$FTLPGN= 0
$$ ##$FW= 125000
$$ ##$FnMODE= 0
$$ ##$FnTYPE= 0
$$ ##$GPNAM= (0..31)
$$ [...]
$$ 130000 130000 130000 130000 130000 130000 130000 130000 130000 130000 130000
$$ 130000 130000 130000 130000 130000 130000 130000 130000 130000 130000 130000
$$ 130000 130000 130000 130000 130000 130000 130000 0 0 0 0 0 0 0 0 0 0 0
$$ 0 0 0 0 0 0 0 0 0 0 0 0 0
$$ ##$ShimPowMaxUC= (0..63)
$$ 130000 130000 130000 130000 130000 130000 130000 130000 130000 130000 130000
$$ 130000 130000 130000 130000 130000 130000 130000 130000 130000 130000 130000
$$ 130000 130000 130000 130000 130000 130000 130000 130000 130000 130000 130000
$$ 130000 130000 130000 130000 130000 130000 130000 0 0 0 0 0 0 0 0 0 0 0
$$ 0 0 0 0 0 0 0 0 0 0 0 0 0
$$ ##$ShimPowMaxUG= (0..63)
$$ 524287 524287 524287 524287 524287 524287 524287 524287 524287 524287 524287
$$ 524287 524287 524287 524287 524287 524287 524287 524287 524287 524287 524287
$$ 524287 524287 524287 524287 524287 524287 524287 524287 524287 524287 524287
$$ 524287 524287 524287 524287 524287 524287 0 0 0 0 0 0 0 0 0 0 0 0 0 0 0
$$ 0 0 0 0 0 0 0 0 0 0
$$ ##$ShimPowRcbType= 3
$$ ##$ShimPowRes= (0..63)
$$ 1e-20 1e-20 1e-20 1e-20 1e-20 1e-20 1e-20 1e-20 1e-20 1e-20 1e-20 1e-20
$$ 1e-20 1e-20 1e-20 1e-20 1e-20 1e-20 1e-20 1e-20 1e-20 1e-20 1e-20 1e-20
$$ 1e-20 1e-20 1e-20 1e-20 1e-20 1e-20 1e-20 1e-20 1e-20 1e-20 1e-20 1e-20
$$ 1e-20 1e-20 1e-20 1e-20 0 0 0 0 0 0 0 0 0 0 0 0 0 0 0 0 0 0 0 0 0 0 0 0
$$ ##$ShimPowRng0= (0..63)
$$ 1 1 1 1 1 1 1 1 1 1 1 1 1 1 1 1 1 1 1 1 1 1 1 1 1 1 1 1 1 1 1 1 1 1 1 1
$$ 1 1 1 1 0 0 0 0 0 0 0 0 0 0 0 0 0 0 0 0 0 0 0 0 0 0 0 0
$$ ##$ShimPowRng1= (0..63)
$$ 1 1 1 1 1 1 1 1 1 1 1 1 1 1 1 1 1 1 1 1 1 1 1 1 1 1 1 1 1 1 1 1 1 1 1 1
$$ 1 1 1 1 0 0 0 0 0 0 0 0 0 0 0 0 0 0 0 0 0 0 0 0 0 0 0 0
$$ ##$ShimPowRng2= (0..63)
$$ 1 1 1 1 1 1 1 1 1 1 1 1 1 1 1 1 1 1 1 1 1 1 1 1 1 1 1 1 1 1 1 1 1 1 1 1
$$ 1 1 1 1 0 0 0 0 0 0 0 0 0 0 0 0 0 0 0 0 0 0 0 0 0 0 0 0
$$ ##$ShimPowRng3= (0..63)
$$ 1 1 1 1 1 1 1 1 1 1 1 1 1 1 1 1 1 1 1 1 1 1 1 1 1 1 1 1 1 1 1 1 1 1 1 1
$$ 1 1 1 1 0 0 0 0 0 0 0 0 0 0 0 0 0 0 0 0 0 0 0 0 0 0 0 0
$$ ##$ShimSysFunc= (0..63)
$$ 1 2 3 4 5 6 7 8 9 10 0 37 38 35 16 15 14 13 12 11 28 27 26 25 24 23 36
$$ 22 30 29 20 21 34 33 32 31 17 18 19 0 0 0 0 0 0 0 0 0 0 0 0 0 0 0 0 0 0
$$ 0 0 0 0 0 0 0
$$ ##$ShimSysMatrix= 0
$$ ##$ShimSysType= 4
$$ ##$TFXNUM= 0
$$ ##$TRIPLO2= 0
$$ ##$VTU= 2
$$ ##$VTUETH= <149.236.99.20>
$$ ##$VTUTY= <no>
$$ ##$WBREFAM= (0..15)
$$ 136.7 118.7 100 100 100 100 100 100 100 100 100 100 100 100 100 100
$$ ##$WBREFLM= (0..15)
$$ 0 0 0 0 0 0 0 0 0 0 0 0 0 0 0 0
$$ ##$WBREFPH= (0..15)
$$ 77.55 -71.28 0 0 0 0 0 0 0 0 0 0 0 0 0 0
$$ ##$WBSGU= (0..15)
$$ 0 0 0 0 0 0 0 0 0 0 0 0 0 0 0 0
$$ ##$XFAC= 2
$$ ##END=
$$ 
##$DECIM=	2496
##$DSPFVS=	20
##XUNITS=	HZ
##YUNITS=	ARBITRARY UNITS
##FIRSTX=	6406.710256386850233
##LASTX=	-1606.1102564336499654
##DELTAX=	-0.12226780365942625795
##XFACTOR=	1
##YFACTOR=	0.0034783886866848485325
##FIRSTY=	8.7960338592529296875
##MINY=	-2.7833905220031738281
##MAXY=	26117.24609375
##NPOINTS=	65536
##XYDATA=	(X++(Y..Y))
$$ [...]
$$ plain form
1495 506 489 515 541 537 533 528 524 455 387 418 449 448 446 445 443 427 411 395 379 320 261 274 286 298 310 321 333 360 386 413 439 440 442 443 445 433 421 409 397 432 466
1490 466 501 535 547 558 569 581 574 568 561 554 531 508 485 462 438 414 462 510 511 512 514 515 521 527 532 538 474 410 346 281 272 262 253 243 330 417 404 392 396 400 404 408 398 388
1484 388 379 369 413 457 502 546 548 551 553 556 470 383 455 526 522 519 515 511 574 636 598 560 562 564 566 568 515 462 510 557 500 443 429 558 701 759 716 673 611 549
1480 549 588 626 697 768 738 708 765 822 921 1021 1047 1074 1161 1334 1581 1972 2695 3906 5689 8074 10653 12572 12916 11456 8988
1477 8988 6520 4657 3395 2578 2075 1783 1492 1272 1138 1048 959 870 866 849 832 778 723 659 594 481 454 473 491 472 453 528 603 603 517
1473 517 438 445 442 438 400 361 394 427 409 391 373 355 319 283 313 343 384 339 293 334 357 380 360 426 477 528 485 442 400 358 317 275 226 176 173 256 319
1468 319 297 279 348 442 536 506 476 388 300 258 303 364 339 297 254 306 358 405 452 450 361 321 281 294 307 320 332 374 415 413 411 342 273 227 268 323
1464 323 379 397 414 453 491 487 482 446 410 326 327 325 323 326 329 393 457 420 384 380 376 409 443 436 343 250 243 306 368 430 492 569 561 515 468 436 403 408 413 473 447 384
$$ packed form
1495E06j7K6K6mmnmo9o8L1L1jkjkj6j6j6j6n9n9J3J2J2J2J1J2K7K6K7K6JKJKj2j2j2j2L5L4
1490D66L5L4J2J1J1J2poppk3k3k3k3k4k4M8M8JJKJOONOo4o4o4o5rj0rj0Q7Q7j3j2MMMMj0j0
1484C88rj0M4M4M5M4KLKLq6q7P2P1mlmmO3O2l8l8KKKKn3n3M8M7n7n7j4J29J43N8m3m3o2o2
1480E49L9L8P1P1l0l0N7N7R9J00K6K7Q7J73K47L91P23J211J783K385K579J919L44j460k468
1477H988k468j863j262q17n03k92k91k20j34r0q9q9mj7j7n4n5o4o5j13k7J9J8j9j9P5P5%q6
1473E17p9Plml8l9L3L3j8j8j8j8l6l6L0L0M1m5m6M1K3K3k0O6N1N1m3m3m2m2m1m2m9n0lQ3O3
1468C19k2j8O9R4R4l0l0q8q8m2M5O1k5m2m3N2N2M7M7kq9m0m0J3J3J3J2M2M1kko9o9m6M1N5
1464C23N6J8J7L9L8mnl6l6q4JkkLLO4O4l7l6mmL3L4pr3r3pO3O2O2O2P7qm6m7l2l3NNO0k6o3
$$ plain form
1459 384 321 371 422 386 351 414 478 455 433 454 474 495 515 492 468 445 421 463 505 504 503 490 478 380 282 281 280 278 277 332 387 399 411 478 545 526 507 494
1454 494 481 468 455 509 563 666 682 587 492 386 366 425 485 464 443 421 399 377 356 304 253 197 226 291 357 342 326 322 318 351 384 432 394 271
1450 271 233 277 320 364 408 483 472 314 157 123 174 264 353 481 608 589 484 435 472 498 524 518 512 425 338 288 324 355 385 433 481 486 491 507
1446 507 524 457 391 411 474 519 478 400 322 238 155 218 282 302 323 372 421 384 347 330 313 339 365 387 409 344 280 322 364 350 293 279 352 422 406
1442 406 360 314 348 383 437 491 465 439 471 590 625 574 528 525 516 464 421 378 375 372 393 415 350 285 305 325 346 366 362 359 356 353 360 367 374 381 406 431 371 310
1437 310 371 432 410 388 389 432 419 320 309 384 456 443 426 451 474 455 446 480 538 510 461 455 505 555 533 510 487 464 494 524 511 498 451 404 443 482
1432 482 532 582 545 509 478 447 459 471 453 435 417 400 413 426 439 452 411 370 335 299 297 380 416 451 445 439 433 427 435 443 452 460 440 421 402 382 405 429 409
1428 409 389 371 352 405 458 520 582 515 448 493 538 565 506 473 527 526 526 501 476 452 427 423 419 415 411 416 420 358 296 298 386 475 477 439 401 367 333 317 445
$$ packed form
1459C84o3N0N1l6l5O3O4k3k2K1K0K1K0k3k4k3k4M2M2jjj3j2r8r8jjkjN5N5J2J2O7O7j9j9j3
1454D94j3j3j3N4N4J03J6r5r5j06k0N9O0k1k1k2k2k2k1n2n1n6K9O5O6j5j6mmL3L3M8l8j23
1450B71l8M4M3M4M4P5j1j58j57l4N1R0Q9J28J27j9j05m9L7K6K6ooq7q7n0L6L1L0M8M8NNJ6
1446E07J7o7o6K0O3M5m1p8p8q4q3O3O4K0K1M9M9l7l7j7j7K6K6K2K2o5o4M2M2j4n7j4P3P0j6
1442D06m6m6L4L5N4N4k6k6L2J19L5n1m6lrn2m3m3llK1K2o5o5K0K0K1K0mlllPPPPK5K5o0o1
1437C10O1O1k2k2JM3j3r9j1P5P2j3j7K5K3j9rL4N8k8m9oN0N0k2k3k3k3L0L0j3j3m7m7L9L9
1432D82N0N0l7l6l1l1J2J2j8j8j8j7J3J3J3J3m1m1l5l6kQ3L6L5ooooQQRQk0j9j9k0K3K4k0
1428D09k0j8j9N3N3O2O2o7o7M5M5K7n9l3N4j%k5k5k4k5mmmmNMo2o2KQ8Q9Kl8l8l4l4j6J28
$$ plain form
1423 445 573 557 486 415 412 409 371 419 519 619 631 643 584 525 431 338 374 410 409 408 341 273 276 366 455 458 387 315 368 420 458 496 462 428 411 393
1418 393 418 443 460 476 535 594 517 440 463 487 489 492 532 573 614 569 530 490 490 490 489 489 496 504 512 519 487 455 423 390 440 489 438 387 379 372 364 356 367 378 389 400
1413 400 406 412 418 423 423 422 422 421 424 426 495 564 600 550 425 299 286 359 395 344 327 397 398 314 224 278 403 528 526 523 520 518 527 537 528 434 353 357 380 403 398 393 430
1408 430 468 418 368 390 411 392 373 426 479 476 473 404 335 254 258 343 428 472 515 516 517 440 363 386 410 462 514 523 532 505 478 494 510 517 524 531 538 503 467 431
1403 431 396 373 351 400 450 466 483 500 516 538 559 580 601 545 490 440 389 368 432 496 475 460 445 430 415 395 462 528 509 479 448 456 463 415 367 419
1399 419 471 445 419 393 366 330 294 344 394 383 372 361 350 314 278 328 378 412 445 478 512 504 496 489 481 426 372 317 262 326 389 452 516 522 528 534 540 472 405
1394 405 423 442 422 402 382 362 406 450 495 539 480 421 448 475 479 483 486 490 476 462 449 435 387 339 435 530 522 513 505 496 508 519 530 541 543 545 546 548 550 551 553 554 505
1389 505 456 406 357 390 423 456 489 516 543 571 598 595 592 589 586 498 410 465 520 471 422 459 497 467 437 407 377 372 367 362 357 451 545 552 560 542 525 507 490 391
$$ packed form
1423D45J28j6p1p1lll8M8J00J00J2J2n9n9r4r3L6L6jjo7o8LR0Q9Lp1p2N3N2L8L8l4l4j7j8
1418C93K5K5J7J6N9N9p7p7K3K4KLM0M1M1m5l9m0%%j%PQQPl2l2l2l3N0M9n1n1qpqqJ1J1J1J1
1413D00OOON%j%jLKO9O9L6n0j25j26j3P3L6n1j7P0Jq4r0N4J25J25kllkRJ0rr4q1MK3K3nnL7
1408D30L8n0n0K2K1j9j9N3N3llo9o9q1MQ5Q5M4M3JJp7p7K3K4N2N2RRk7k7J6J6PPPPl5l6l6
1403D31l5k3k2M9N0J6J7J7J6K2K1K1K1n6n5n0n1k1O4O4k1j5j5j5j5k0O7O6j9l0l1QPm8m8N2
1399D19N2k6k6k6k7l6l6N0N0j1j1j1j1l6l6N0N0L4L3L3L4qqpqn5n4n5n5O4O3O3O4OOOOo8o7
1394D05J8J9k0k0k0k0M4M4M5M4n9n9K7K7MMLMj4j4j3j4m8m8R6R5qrqrJ2J1J1J1KKJKKJKJm9
1389E05m9n0m9L3L3L3L3K7K7K8K7llllq8q8N5N5m9m9L7L8l0l0l0l0nnnnR4R4PQj8j7j8j7r9
$$ plain form
1384 391 291 335 379 419 460 500 540 552 563 489 415 310 206 301 397 482 566 564 562 505 448 476 505 495 485 474 464 406 347 432 516 530 543 471
1380 471 398 416 433 450 467 455 444 432 420 439 458 477 496 439 382 412 441 440 438 437 436 413 391 368 346 393 441 488 535 567 598 543 489 471 454 523 592
1375 592 473 354 321 287 344 400 456 513 496 479 463 446 501 556 525 494 431 369 392 415 361 307 339 372 376 381 385 390 400 410 420 430 427 423 420 417 424 432 439
1370 439 447 428 410 392 373 344 315 286 257 280 303 326 349 347 345 343 340 347 353 359 366 374 383 392 401 423 444 423 401 296 192 179 252 311 326 344 406 465 481 525
1365 525 568 533 498 506 514 551 589 540 492 430 368 391 415 426 436 403 371 334 298 347 396 436 477 474 471 459 447 435 423 448 472 497 522 522 523 523 523 535 547
1361 547 516 485 460 434 495 555 523 491 460 428 444 460 554 647 653 515 410 390 417 444 446 492 532 486 491 496 449 401 397 392 371 351 386 465 516 482 447
1356 447 498 546 551 556 604 621 553 482 497 532 481 430 465 517 484 394 348 407 466 484 503 414 326 327 413 540 582 564 589 624 617 567 559 549 497 460 509
1352 509 556 517 421 369 354 339 278 304 333 362 396 431 429 426 421 417 435 410 398 473 527 496 382 353 373 351 333 359 427 496 538 622 713 717 679 727 809
$$ packed form
1384C91j00M4M4M0M1M0M0J2J1p4p4j05j04R5R6Q5Q4kkn7n7K8K9j0j0j1j0n8n9Q5Q4J4J3p2
1380D71p3J8J7J7J7j2j1j2j2J9J9J9J9n7n7L0K9jkjjk3k2k3k2M7M8M7M7L2L1n5n4j8j7O9O9
1375E92j19j19l3l4N7N6N6N7j7j7j6j7N5N5l1l1o3o2K3K3n4n4L2L3MNMNJ0J0J0J0lmllPQP
1370D39Qj9j8j8j9k9k9k9k9K3K3K3K3kkklPOOPQRRRK2K1k1k2j05j04j3P3N9J5J8O2N9J6M4
1365E25M3l5l5QQL7L8m9m8o2o2K3K4J1J0l3l2l7l6M9M9M0M1llj2j2j2j2K5K4K5K5%J%%J2J2
1361E47l1l1k5k6O1O0l2l2l1l2J6J6R4R3Oj38j05k0K7K7KM6M0m6NNm7m8mnk1k0L5P9N1l4l5
1356D47N1M8NNM8J7o8p1J5L5n1n1L5N2l3r0m6N9N9J8J9q9q8JQ6J27M2j8K5L5pn0qj0n2l7M9
1352E09M7l9r6n2j5j5o1K6K9K9L4L5klnmJ8k5j2P5N4l1j14k9K0k2j8K6O8O9M2Q4R1Ml8M8Q2
$$ plain form
1347 809 848 826 804 723 557 401 389 465 542 541 540 599 659 632 606 618 631 644 657 747 836 783 729 661 593 569 544 565 585 563 541 531 520 467 414
1343 414 406 399 392 384 443 502 518 534 607 680 609 539 531 523 472 421 444 467 489 512 605 697 646 596 622 649 633 616 641 666 605 544 511 478 488 498 542 586
1338 586 587 588 564 539 515 490 497 504 511 517 548 578 522 467 459 451 443 434 475 515 454 394 425 457 488 519 569 620 599 578 548 517 487 457 520 582 596 610 682 668
1333 668 603 537 656 775 790 719 659 686 702 717 683 649 614 580 616 652 689 725 687 650 612 575 617 659 630 600 577 553 530 506 551 595 568 541
1329 541 507 473 439 405 444 483 522 562 512 463 408 439 513 586 536 485 490 494 542 589 584 580 532 485 493 502 439 376 440 504 525 546 548 550 509 468 450 432 458
1324 458 483 560 638 615 592 650 707 661 529 433 423 459 495 501 507 469 432 495 557 548 539 503 467 502 538 587 635 584 532 596 659 622 584 596 607 576
1320 576 545 557 569 535 415 372 415 430 403 424 488 510 488 488 532 530 443 408 460 484 466 496 570 627 598 543 573 622 670 626 582 496 409 443 477
1316 477 468 459 460 460 461 461 470 478 487 495 502 509 516 522 553 584 515 446 418 389 367 344 351 443 539 548 524 544 560 534 523 554 608 575 531 486 437 387 394 400 407 414 437 459 416
$$ packed form
1347H09L9k2k2q1j66j56j2P6P7jjN9O0k7k6J2J3J3J3R0Q9n3n4o8o8k4k5K1K0k2k2j0j1n3n3
1343D14qppqN9N9J6J6P3P3p1p0qqn1n1K3K3K2K3R3R2n1n0K6K7j6j7K5K5o1o1l3l3J0J0M4M4
1338E86JJk4k5k4k5PPPOL1L0n6n5qqqrM1M0o1o0L1L2L1L1N0N1k1k1l0l1l0l0O3O2J4J4P2j4
1333F68o5o6J19J19J5p1o0K7J6J5l4l4l5l4L6L6L7L6l8l7l8l7M2M2k9l0k3k4k3k4M5M4k7k7
1329E41l4l4l4l4L9L9L9M0n0m9n5L1P4P3n0n1NMM8M7nmm8m7QRo3o3O4O4K1K1KKm1m1j8j8K6
1324D58K5P7P8k3k3N8N7m6j32r6j0L6L6OOl8l7O3O2rrl6l6L5L6M9M8n1n2O4O3l7l8J2J1l1
1320E76l1J2J2l4j20m3M3J5k7K1O4K2k2%M4kq7l5N2K4j8L0P4N7k9n5L0M9M8m4m4q6q7L4L4
1316D77rrJ%J%RQRQPPPOL1L1o9o9k8k9k2k3PR2R6Rk4K0J6k6j1L1N4l3m4m5m9n0POPPK3K2m3
$$ plain form
1310 416 372 420 554 564 488 453 504 555 520 464 495 567 596 590 584 576 567 504 440 449 457 558 660 683 621 579 580 537 409 254 242 305 368 451 577
1306 577 662 660 623 671 676 596 479 448 492 536 533 530 527 524 557 589 669 664 611 559 506 454 444 521 597 588 580 572 607 556 484 412 434 457 436 414 465 515 574
1301 574 634 618 516 428 426 499 572 600 628 590 552 497 528 640 751 729 707 686 664 693 722 676 544 469 479 565 651 673 695 699 617 544 556 586
1297 586 616 606 595 585 574 573 571 569 568 507 447 458 468 530 592 703 727 682 638 593 548 495 528 567 520 421 409 443 477 434 392 422 451 443 435 499 563
1292 563 550 538 525 513 479 445 512 578 631 684 666 647 606 565 567 569 598 627 704 696 663 630 598 565 505 530 579 628 600 571 543 515 531 546 562 578
1288 578 555 532 515 497 490 568 646 639 608 577 584 591 512 432 482 532 568 603 638 674 607 541 574 608 592 576 561 545 480 415 421 428 421 414 449 485 424 364 378
1283 378 478 630 695 656 618 578 539 542 546 521 497 473 448 444 440 437 433 472 512 552 592 578 564 550 536 498 459 420 382 433 484 535 586 604 622 639 657
1279 657 609 560 555 550 508 466 496 526 569 611 611 610 539 468 526 584 611 638 623 607 588 570 594 619 592 566 582 599 575 551 528 504 537 569 602 635 594
$$ packed form
1310D16m4M8J34J0p6l5N1N1l5n6L1P2K9ooqro3o4RQJ01J02K3o2m2Jm3j28j55j2O3O3Q3J26
1306E77Q5kl7M8Nq0j17l1M4M4llllL3L2Q0nn3n2n3n2j0P7P6rqqL5n1p2p2K2K3k1k2N1N0N9
1301E74O0j6j02q8kP3P3K8K8l8l8n5L1J12J11k2k2k1k2K9K9m6j32p5J0Q6Q6K2K2Mq2p3J2L0
1297E86L0j0j1j0j1jkkjo1o0J1J0O2O2J11K4m5m4m5m5n3L3L9m7r9j2L4L4m3m2L0K9qqO4O4
1292E63j3j2j3j2l4l4O7O6N3N3j8j9m1m1KKK9K9P7ql3l3l2l3o0K5M9M9k8k9k8k8J6J5J6J6
1288E78k3k3j7j8pP8P8pl1l1PPp9q0N0N0L6L5L5L6o7o6L3L4j6j6j5j6o5o5OPppL5L6o1o0J4
1283C78J00J52O5l9l8m0l9LMk5k4k4k5mmlmL9M0M0M0j4j4j4j4l8l9l9l8N1N1N1N1J8J8J7J8
1279F57m8m9nnm2m2L0L0M3M2%jp1p1N8N8K7K7j5j6j9j8K4K5k7k6J6J7k4k4k3k4L3L2L3L3m1
$$ plain form
1274 594 553 517 482 429 463 577 691 644 598 552 506 512 519 525 532 505 479 538 597 583 569 555 541 557 572 588 604 596 588 580 573 508 443 522 600 559 517 476
1270 476 434 449 464 479 494 515 535 555 576 516 457 483 509 548 587 626 665 662 659 656 653 661 669 677 684 686 687 688 690 664 639 613 588 574 561 634 706 743 780 817 854
1265 854 741 629 660 776 778 637 534 516 494 471 454 437 473 510 546 583 593 603 614 624 634 645 655 665 654 642 631 619 639 660 681 701 680
1261 680 659 638 617 619 622 624 626 575 524 558 593 579 566 552 538 525 512 499 486 520 554 587 621 639 658 725 707 566 425 394 506 600 607 586 565 569
1256 569 573 658 742 725 623 520 503 550 598 651 704 707 710 628 545 577 609 640 672 625 578 617 656 634 612 589 567 541 515 524 619 657 652 675 697 600
1252 600 460 350 383 507 630 676 723 661 599 623 647 633 620 604 587 548 465 439 498 561 537 514 576 662 663 631 600 548 495 500 547 561 490 421
1248 421 438 509 580 570 560 594 628 662 696 685 675 664 653 650 648 642 637 656 632 581 616 684 709 678 646 655 664 673 682 725 768 725 682 678 674 756 839 827 816 805
1243 805 793 744 695 732 769 740 711 714 802 866 844 870 896 894 806 680 698 737 690 652 699 723 746 770 793 817 754 692 716 700 684 673 663 785 907
$$ packed form
1274E94m1l6l5n3L4J14J14m7m6m6m6OPOPk7k6N9N9j4j4j4j4J6J5J6J6qqqpo5o5P9P8m1m2m1
1270D76m2J5J5J5J5K1K0K0K1o0n9K6K6L9L9L9L9llllQQQPKJJKk6k5k6k5j4j3P3P2L7L7L7L7
1265H54j13j12L1J16Kj41j03j8k2k3j7j7L6L7L6L7J0J0J1J0J0J1J0J0j1j2j1j2K0K1K1K0k1
1261F80k1k1k1KLKKn1n1L4L5j4j3j4j4j3j3j3j3L4L4L3L4J8J9O7j8j41j41l1J12R4Pk1k1M
1256E69MQ5Q4j7j02j03j7M7M8N3N3LLq2q3L2L2L1L2m7m7L9L9k2k2k3k2k6k6RR5L8nK3K2r7
1252F00j40j10L3J24J23M6M7o2o2K4K4j4j3j6j7l9q3k6N9O3k4k3O2Q6Jl2l1n2n3NM7J4p1o9
1248D21J7P1P1j0j0L4L4L4L4j1j0j1j1lkonJ9k4n1L5O8K5l1l2RRRRM3M3m3m3mmQ2Q3j2j1j1
1243H05j2m9m9L7L7k9k9LQ8O4k2K6K6kq8j26J8L9m7l8M7K4K3K4K3K4o3o2K4j6j6j1j0J22J22
$$ plain form
1238 907 1023 1140 1199 1172 1193 1214 1212 1210 1208 1206 1204 1202 1194 1187 1143 1013 926 925 958 992 945 898 872 847 864 881 808 735 690 731 820 767 665 648 704 759 772
1234 772 784 794 718 642 652 673 695 668 727 811 809 807 891 993 1008 943 963 1097 1230 1326 1422 1641 1859 2029 2199 2377 2468 2407 2347 2236 2126
1230 2126 2015 1905 1761 1617 1474 1330 1267 1205 1099 994 1005 1017 943 869 780 692 689 687 743 800 851 902 988 988 950 913 890 868 835 887 985 996
1226 996 923 850 845 925 957 989 1027 1065 1141 1303 1490 1677 1784 1890 2015 2140 2346 2552 2780 2923 2966 3009 2991 2886 2630 2373 2126 1878
1223 1878 1668 1544 1473 1402 1336 1270 1228 1186 1101 1016 1011 1006 915 824 880 937 907 878 897 916 934 953 1015 1077 1052 1028 1029 1030 1031 1032 1075 1119 1077 1035 1083 1130
1218 1130 1178 1225 1311 1396 1400 1405 1481 1643 1836 2030 2133 2150 2209 2269 2294 2232 2076 1920 1839 1758 1677 1596 1482 1368 1206 1130 1102 1074 1051 1029 1031
1215 1031 1033 1035 1037 1128 1220 1159 1013 973 933 887 842 863 885 864 843 906 969 947 924 931 938 945 952 1002 1052 1016 980 1074 1169 1183 1197 1251 1391 1451 1424 1347 1355
1210 1355 1353 1350 1314 1277 1241 1204 1187 1169 1065 962 972 983 993 1004 995 986 977 968 1052 1137 1083 1030 1027 1110 1106 1017 1009 1000 991 983 969 1041 1113 1099 1091 1083 1069 1056 1037 1018
$$ packed form
1238I07J16J17N9k7K1K1kkkkkkqpm4j30q7jL3L4m7m7k6k5J7J7p3p3m5M1Q9n3j02j7N6N5J3
1234G72J2J0p6p6J0K1K2k7N9Q4kkQ4J02J5o5K0J34J33R6R6K19K18J70J70J78R1o1o0j11j10
1230B126j11j10j44j44j43j44o3o2j06j05J1J2p4p4q9q8lkN6N7N1N1Q6%l8l7k3k2l3N2R8J1
1226I96p3p3nQ0L2L2L8L8P6J62J87J87J07J06J25J25K06K06K28J43M3M3j8j05k56k57k47k48
1223A878k10j24p1p1o6o6m2m2q5q5nnr1r1N6N7l0k9J9J9J8J9O2O2k5k4JJJJM3M4m2m2M8M7
1218A130M8M7Q6Q5MNP6J62J93J94J03J7N9O0K5o2j56j56q1q1q1q1j14j14j62p6k8k8k3k2K
1215A031KKKR1R2o1j46m0m0m6m5K1K2k1k1O3O3k2k3PPPPN0N0l6l6R4R5J4J4N4J40O0k7p7Q
1210A355kll6l7l6l7j7j8j04j03J0J1J0J1rrrrQ4Q5n4n3lQ3mq9qrrqj4P2P2j4qqj4j3j9j9
$$ plain form
1205 1018 999 981 973 966 959 952 996 1040 1084 1128 1106 1085 1020 956 1010 1065 1039 1013 1029 1132 1234 1251 1262 1274 1279 1285 1272 1258 1244 1230 1236 1242 1248 1254 1256 1258 1179 1101 1099 1184
1200 1184 1268 1267 1260 1253 1241 1228 1241 1254 1267 1280 1265 1250 1241 1232 1211 1276 1292 1309 1337 1365 1398 1345 1292 1238 1265 1292 1316 1340 1363 1387 1427 1467 1421 1375 1392 1410 1390
1196 1390 1283 1229 1175 1159 1142 1204 1266 1370 1475 1511 1547 1439 1332 1356 1381 1363 1345 1407 1469 1488 1508 1465 1423 1524 1625 1669 1714 1715 1717 1731 1746 1717
1192 1717 1689 1705 1721 1737 1753 1737 1721 1790 1860 1897 1934 1886 1837 1903 1969 2035 2101 2145 2189 2148 2020 1940 2003 2065 2128 2154 2180 2163 2146 2152 2158 2251 2343 2338 2332 2327
1187 2327 2321 2344 2366 2389 2411 2466 2521 2576 2630 2663 2695 2727 2760 2817 2874 2932 2989 3071 3152 3234 3315 3420 3525 3629 3734 3911 4088 4350 4613 4768
1184 4768 4924 5088 5252 5528 5948 6397 6933 7639 8602 9841 11224 12754 14428 16202 17890 19382 20558 21351 21714 21685 21283
1181 21283 20494 19333 17953 16487 15012 13536 12169 10945 9934 9181 8661 8285 7939 7679 7620 7560 7506 7452 7503 7555 7692 7829
1179 7829 8045 8261 8563 8864 9313 9761 10296 10830 11486 12142 12893 13644 14424 15346 16443 17683 19148 20928 23106 25885 29556
$$ packed form
1205A018j9j8qpppM4M4M4M4k2k1o5o4N4N5k6k6J6J03J02J7J1J2NOj3j4j4j4OOOOKKp9p8kQ5
1200A184Q4jppj2j3J3J3J3J3j5j5rrk1O5J6J7K8K8L3n3n3n4K7K7K4K4K3K4M0M0m6m6J7J8k0
1196A390j07n4n4j6j7O2O2J04J05L6L6j08j07K4K5j8j8O2O2J9K0m3m2J01J01M4M5JKJ4J5k9
1192A717k8J6J6J6J6j6j6O9P0L7L7m8m9O6O6O6O6M4M4m1j28q0O3O2O3K6K6j7j7OOR3R2non
1187B327oK3K2K3K2N5N5N5N4L3L2L2L3N7N7N8N7Q2Q1Q2Q1J05J05J04J05J77J77K62K63J55
1184D768J56J64J64K76M20M49N36P06R63J239J383J530J674J774J688J492J176P93L63k9m02
1181B1283p89j161j380j466j475j476j367j224j011p53n20l76l46k60n9o0n4n4N1N2J37J37
1179G829K16K16L02L01M49M48N35N34O56O56P51P51P80R22J097J240J465J780K178K779L671
$$ plain form
1176 29556 34402 40518 47924 56590 66373 76824 87275 97065 105680 112475 116778 118152 116518 112130 105423 97052 87621
1174 87621 77762 67903 58668 50492 43554 37905 33469 30094 27552 25555 23990 22798 21910 21165 20609 20310 20145 19980 19925
1172 19925 20069 20384 20785 21304 22081 23054 24114 25318 26722 28323 30067 31894 33921 36178 38692 41681 45443 50214 56333
1169 56333 64266 74634 88071 104974 125485 149233 175275 202149 228353 252465 272922 287908 295921 296170 288765
1167 288765 274456 254639 231013 205325 179092 153653 130305 109972 93105 79682 69267 61327 55191 50347
1166 50347 46562 43666 41371 39456 37855 36531 35464 34577 33948 33524 33299 33250 33459 34060 35034 36220 37694 39380 41238
1163 41238 43354 45756 48488 51621 55229 59583 65068 71985 80965 92866 108556 128772 153872 183727 217521 253664
1161 253664 290208 324976 355884 380662 397138 403474 398988 384134 360563 330519 296386 260248 224031 189819
$$ packed form
1176B9556M846O116P406Q666R783J0451J0451R790Q615O795M303J374j634m388o707q371r431
1174H7621r859r859r235q176o938n649m436l375k542j997j565j192q88p45n56k99j65j65n5
1172A9925J44L15M01N19P77R73J060J204J404J601J744J827K027K257K514K989L762M771O119
1169E6333P933J0368J3437J6903K0511K3748K6042K6874K6204K4112K0457J4986Q013K49p405
1167B88765j4309j9817k3626k5688k6233k5439k3348k0333j6867j3423j0415p940o136m844
1166E0347l785k896k295j915j601j324j067q87o29m24k25m9K09O01R74J186J474J686J858
1163D1238K116K402K732L133L608M354N485O917Q980J1901J5690K0216K5100K9855L3794L6143
1161B53664L6544L4768L0908K4778J6476O336m486j4854k3571l0044l4133l6138l6217l4212
$$ plain form
1160 189819 159166 133039 111714 94914 81961 72044 64337 58407 53758 50083 46992 44416 42178 40225 38463 36874
1158 36874 35556 34410 33483 32842 32566 32577 32852 33414 34284 35440 36786 38304 40043 42070 44403 47252 50803 55328 61142
1155 61142 68847 79029 92362 109231 129937 154282 181205 209313 237020 262665 284585 300927 310108 311189
1154 311189 304077 289350 268607 243653 216235 187920 160235 134599 112113 93294 78199 66463 57419 50462
1152 50462 45051 40858 37524 34713 32303 30282 28547 26917 25372 23969 22738 21613 20659 19906 19325 18967 18781 18790 18970
1150 18970 19264 19644 20157 20843 21651 22631 23841 25336 27344 30097 33788 38681 44877 52619 62015 72843 84578 96599
1147 96599 108226 118765 127437 133531 136402 135664 131328 123955 114312 103122 91024 78755 66915 56164 46809 39001
1146 39001 32869 28169 24513 21602 19263 17440 15961 14768 13723 12849 12072 11295 10614 9934 9346 8759 8315 7871 7523 7175
$$ packed form
1160A89819l0653k6127k1325j6800j2953r917p707n930m649l675l091k576k238j953j762j589
1158C6874j318j146r27o41k76J1K75N62Q70J156J346J518J739K027K333K849L551M525N814
1155F1142P705J0182J3333J6869K0706K4345K6923K8108K7707K5645K1920J6342R181J081
1154C11189p112j4727k0743k4954k7418k8315k7685k5636k2486j8819j5095j1736r044o957
1152E0462n411m193l334k811k410k021j735j630j545j403j231j125r54p53n81l58j86RJ80
1150A8970K94L80N13O86Q08R80J210J495K008K753L691M893O196P742R396J0828J1735J2021
1147I6599J1627J0539Q672O094K871p38m336p373r643j1190j2098j2269j1840j0751r355p808
1146C9001o132m700l656k911k339j823j479j193j045q74p77p77o81o80n88n87m44m44l48l48
$$ plain form
1143 7175 7085 6995 6873 6751 6829 6907 6991 7075 7262 7622 8020 8419 9008 9883 11069 12657 14718 17180 19982 23070 26305 29540
1140 29540 32485 34915 36710 37647 37686 36751 34907 32319 29233 25861 22525 19360 16402 13730 11523 9832 8560 7575
1138 7575 6794 6185 5682 5180 4792 4576 4372 4168 3932 3696 3462 3228 3037 2846 2806 2767 2727 2687 2620 2552 2571 2589 2634 2679 2723 2768 2764 2761
1135 2761 2804 3018 3295 3571 4019 4640 5489 6338 7302 8438 9586 10733 11763 12620 13156 13290 13068 12560 11786 10754 9534
1132 9534 8314 7166 6018 5027 4237 3666 3295 3025 2754 2529 2303 2172 2127 2056 1985 1919 1853 1771 1689 1608 1526 1527 1529 1531 1533 1502 1472 1442 1411
1129 1411 1382 1353 1276 1285 1395 1505 1620 1736 1818 1900 1977 2140 2434 2728 3114 3500 3936 4372 4878 5384 5707 5772 5707 5556 5340 4980
1125 4980 4547 4114 3670 3140 2616 2177 1857 1623 1489 1356 1281 1206 1217 1228 1204 1180 1156 1132 1097 1062 1027 992 916 840 850 946 1033 978 922
1122 922 867 851 836 809 869 948 941 945 949 955 960 966 972 992 1013 1066 1205 1349 1407 1465 1609 1769 1843 1770 1698 1625 1553 1481 1408 1328 1248 1124 1001 985 969
$$ packed form
1143G175r0r0j22j22P8P8Q4Q4J87L60L98L99N89Q75J186J588K061K462K802L088L235L235
1140B9540K945K430J795R37L9r35j844k588l086l372l336l165k958k672k207j691j272r85
1138G575p81o09n03n02l88k16k04k04k36k36k34k34j91j91m0l9m0m0o7o8J9J8M5M5M4M5ml
1135B761M3K14K77K76M48O21Q49Q49R64J136J148J147J030Q57N36J34k22n08p74j032j220
1132I534j220j148j148r91p90n71l71k70k71k25k26j31m5p1p1o6o6q2q2q1q2JKKKl1l0l0l1
1129A411k9k9p7RJ10J10J15J16Q2Q2P7J63K94K94L86L86M36M36N06N06L23O5o5j51k16l60
1125D980m33m33m44n30n24m39l20k34j34j33p5p5J1J1k4k4k4k4l5l5l5l5p6p6J0R6Q7n5n6
1122I22n5j6j5k7O0P9pMMONOOK0K1N3J39J44N8N8J44J60P4p3p2p3p2p2p3q0q0j24j23j6j6
$$ plain form
1118 969 1033 1098 1066 947 824 786 843 815 796 778 813 848 811 774 836 898 859 821 768 715 734 753 703 654 651 734 793 766 739 798 846 808 732 742
1113 742 771 801 763 726 716 705 770 921 1054 1100 1124 1147 1198 1162 1026 976 1030 1085 1145 1205 1197 1188 1169 1235 1307 1292 1234 1262 1386 1424 1329 1235 1166 1096
1109 1096 1045 1079 1132 1098 998 985 1018 1050 1017 984 966 948 839 816 850 884 824 763 714 665 634 689 774 774 735 783 854 925 901 877 944 1010 1072 1133
1105 1133 1279 1340 1292 1243 1349 1454 1517 1579 1680 1781 1881 1982 2071 2160 2177 2194 2288 2382 2318 2254 2174 2095 1886 1677 1548 1419 1333 1246 1230
1102 1230 1214 1154 1095 1116 1136 1085 1034 1026 1018 1053 1088 1122 1156 1147 1138 1166 1195 1152 1109 1134 1160 1114 1068 1118 1169 1176 1184 1237 1290 1299 1309 1379 1449 1519 1588 1699 1810
1097 1810 2021 2232 2469 2705 2813 2921 2974 3026 2949 2872 2732 2593 2410 2228 2046 1865 1726 1587 1495 1403 1239 1076 1131 1187 1143 1098
1094 1098 1127 1156 1142 1128 1150 1173 1152 1131 1095 1059 1023 987 1002 1016 959 902 923 943 921 899 931 964 1040 1116 1216 1316 1416 1516 1649 1783 1874
1090 1874 1965 2126 2288 2349 2410 2531 2653 2616 2580 2456 2332 2165 1998 1916 1835 1681 1528 1483 1438 1350 1262 1220 1177 1135 1092 1146 1199 1181 1162
$$ packed form
1118I69O4O5l2j19j23l8N7k8j9j8L5L5l7l7O2O2l9l8n3n3J9J9n0m9lQ3N9k7k7N9M8l8p6J0
1113G42K9L0l8l7j0j1O5J51J33M6K4K3N1l6j36n0N4N5O0O0qrj9O6P2j5n8K8J24L8r5r4o9p0
1109A096n1L4N3l4j00j3L3L2l3l3j8j8j09k3L4L4o0o1m9m9l1N5Q5%l9M8P1P1k4k4O7O6O2O1
1105A133J46O1m8m9J06J05O3O2J01J01J00J01Q9Q9J7J7R4R4o4o4q0p9k09k09j29j29q6q7j6
1102A230j6o0n9K1K0n1n1qqL5L5L4L4rrK8K9m3m3K5K6m6m6N0N1PQN3N3RJ0P0P0P0O9J11J11
1097A810K11K11K37K36J08J08N3N2p7p7j40j39j83j82j82j81j39j39r2r2j64j63N5N6m4m5
1094A098K9K9j4j4K2K3k1k1l6l6l6l6J5J4n7n7K1K0k2k2L2L3P6P6J00J00J00J00J33J34R1
1090A874R1J61J62O1O1J21J22l7l6j24j24j67j67q2q1j54j53m5m5q8q8m2m3m2m3N4N3j8j9
$$ plain form
1087 1162 1173 1184 1152 1120 1118 1116 1077 1038 1038 1124 1168 1125 1037 950 929 908 959 1011 991 971 1011 1050 1071 1006 996 1071 1164 1256 1336 1415 1495 1574 1633 1691 1650 1608
1082 1608 1568 1528 1488 1448 1426 1405 1260 1115 1051 1073 1046 1019 1083 1148 1140 1133 1115 1098 1038 977 993 1009 931 852 834 902 970 952 947 943 933 923 931 939 947 955 955 956
1078 956 956 956 940 923 907 890 973 1056 1092 1042 1038 1121 1198 1190 1250 1311 1349 1301 1198 1181 1182 1183 1208 1233 1183 1048 957 953 995 1038 1036 1034 1031 1029 1071 1113 1108 1017 957 983
1073 983 1026 1070 1085 1101 1074 1047 1028 1009 990 972 1015 1058 1083 1022 1013 1091 1152 1070 956 842 848 853 918 982 974 967 1013 1060 1117 1088 1065 1127 1147 1081 1010 1024
1068 1024 985 946 921 897 877 858 838 905 977 963 942 1007 1067 1041 1075 1109 1137 1166 1184 1202 1202 1116 1022 1013 999 985 975 1052 1166 1137 1057 1063 1089 1115 1074
1064 1074 1118 1158 1197 1211 1225 1245 1265 1275 1372 1469 1479 1513 1547 1624 1701 1710 1805 1923 2041 2094 2148 2282 2416 2651 3030 3597 4250 5089 6186
1060 6186 7528 8870 9991 10625 10623 9962 8865 7681 6598 5601 4759 4117 3655 3278 2977 2761 2609 2456 2337 2303 2313 2237 2172
1058 2172 2108 2081 2054 1957 1861 1769 1678 1591 1589 1616 1643 1664 1771 1883 1909 1864 1906 2013 2035 2030 2026 2087 2149 2210 2272 2434 2595 2834 3073 3546 4106
$$ packed form
1087A162J1J1l2l2kkl9l9%Q6M4m3q8q7k1k1N1N2k0k0M0L9K1o5j0P5R3R2Q0P9Q0P9N9N8m1m2
1082A608m0m0m0m0k2k1j45j45o4K2k7k7O4O5qpj8j7o0o1J6J6p8p9j8O8O8j8nmj0j0QQQQ%J
1078I56%%j6j7j6j7Q3Q3L6n0mQ3P7qO0O1L8m8j03j7JJK5K5n0j35r1mM2M3kklkM2M2nr1o0K6
1073I83M3M4J5J6k7k7j9j9j9j8M3M3K5o1rP8O1q2j14j14ONO5O4qpM6M7N7k9k3O2K0o6p1J4
1068A024l9l9k5k4k0j9k0O7P2j4k1O5O0k6L4L4K8K9J8J8%q6r4rj4j4j0P7J14k9q0OK6K6m1
1064A074M4M0L9J4J4K0K0J0R7R7J0L4L4P7P7RR5J18J18N3N4J34J34K35L79N67O53Q39J097
1060F186J342J342J121O34ko61j097j184j083r97q42o42m62l77l01k16j52j53j19l4J0p6o5
1058B172o4k7k7r7r6r2r1q7kK7K7K1J07J12K6m5M2J07K2nmO1O2O1O2J62J61K39K39M73N60
$$ plain form
1054 4106 4746 5557 6501 7532 8516 9500 10195 10376 9954 9132 8080 6857 5733 4781 4108 3608 3125 2814 2603 2392 2230 2067
1051 2067 2005 1943 1855 1766 1779 1791 1724 1657 1591 1524 1412 1300 1316 1333 1319 1305 1334 1363 1314 1264 1258 1251 1146 1042 1066 1090 1047 1003 1031 1059 1059 1059 1102 1145
1047 1145 1097 1049 1073 1096 1001 906 940 974 881 788 738 687 625 562 571 580 670 760 951 1142 1308 1473 1639 1805 1767 1729 1791 1853 1833 1813 1793 1773
1043 1773 1672 1571 1541 1511 1465 1419 1473 1527 1586 1644 1775 1905 1862 1820 1777 1734 1646 1558 1599 1639 1590 1540 1562 1585 1582 1580 1578 1576 1576 1576 1532 1489 1416 1344 1228
1039 1228 1112 974 835 834 920 980 1040 1206 1371 1520 1668 1774 1879 1885 1891 1897 1903 1852 1801 1792 1784 1751 1718 1756 1794 1806 1818 1830 1842 1796 1750 1775 1800
1035 1800 1814 1828 1884 1940 1906 1871 1936 2002 1939 1877 1857 1837 1832 1827 1922 2017 1985 1954 1969 2070 2072 1989 1911 1918 1917 1916 1920 1924 1905 1885 1938 1990 1948 1906 1911 2001 2083 2079 2056
1030 2056 2034 2017 2001 2027 2054 2033 2012 2038 2149 2214 2192 2225 2257 2266 2275 2327 2379 2425 2471 2517 2564 2551 2539 2570 2601 2558 2514 2514 2514 2465 2417 2363 2395 2413 2432 2499
1026 2499 2566 2586 2606 2627 2647 2657 2666 2676 2686 2636 2587 2638 2689 2648 2607 2638 2755 2816 2733 2616 2586 2592 2599 2611 2623 2587 2552 2602 2652 2679 2706 2819 2931 3001
$$ packed form
1054D106O40Q11R44J031R84R84O95J81m22q22j052j223j124r52o73n00m83l11k11k11j62j63
1051B067o2o2q8q9J3J2o7o7o6o7j12j12J6J7j4j4K9K9m9n0opj05j04K4K4m3m4K8K8%%M3M3
1047A145m8m8K4K3r5r5L4L4r3r3n0n1o2o3RRR0R0J91J91J66J65J66J66l8l8O2O2k0k0k0k0
1043A773j01j01l0l0m6m6N4N4N9N8J31J30m3m2m3m3q8q8M1M0m9n0K2K3lkkk%%m4m3p3p2j16
1039A228j16j38j39jQ6O0O0J66J65J49J48J06J05OOOOn1n1rql3l3L8L8J2J2J2J2m6m6K5K5
1035A800J4J4N6N6l4l5O5O6o3o2k0k0nnR5R5l2l1J5J01Kq3p8PjjMMj9k0N3N2m2m2NR0Q2mk3
1030B056k2j7j6K6K7k1k1K6J11O5k2L3L2RRN2N2M6M6M6M7j3j2L1L1m3m4%%m9m8n4L2J8J9O7
1026B499O7K0K0K1K0J0RJ0J0n0m9N1N1m1m1L1J17O1q3j17l0OPJ2J2l6l5N0N0K7K7J13J12P0
$$ plain form
1021 3001 3071 3140 3210 3248 3286 3324 3362 3341 3321 3386 3451 3475 3499 3523 3547 3648 3749 3764 3779 3753 3728 3788 3848 3885 3922 3959 3996 3963 3930 3983 4036 3992 3949
1017 3949 3985 4022 4101 4093 4047 4145 4258 4284 4368 4451 4559 4667 4766 4865 4907 4805 4698 4735 4839 4856 4878 4985 5158 5246 5330 5500 5718 5793 5811 5829
1014 5829 5880 5932 6070 6207 6418 6629 6840 7051 7280 7508 7728 7948 8001 7911 7762 7699 7672 7559 7451 7429 7486 7542 7690 7924 8089 8112
1011 8112 8163 8300 8379 8315 8252 8331 8469 8522 8542 8705 8914 8979 8994 9095 9274 9368 9324 9366 9499 9632 9771 9910 10151 10391 10546 10701 10928
1007 10928 11155 11295 11436 11625 11815 12004 12193 12378 12563 12834 13104 13522 13940 14357 14775 15239 15703 15910 16116 16370 16625 16960 17295
1004 17295 17570 17758 17979 18371 18803 19149 19506 19948 20464 20979 21489 22171 23043 23915 24780 25644 26501 27072 27379 27687 28009 28416 28992
1002 28992 29855 31043 32318 33684 35222 37098 39261 41717 44689 48229 52057 55988 59919 63658 66997 70296 74225
1000 74225 79415 86037 94056 103392 113576 123931 134042 144326 155653 168985 185826 208568 240007 283535 344544
$$ packed form
1021C001P0O9P0L8L8L8L8k1k0O5O5K4K4K4K4J01J01J5J5k6k5O0O0L7L7L7L7l3l3N3N3m4m3
1017C949L6L7P9qm6R8J13K6Q4Q3J08J08R9R9M2j02j07L7J04J7K2J07J73Q8Q4J70K18P5J8J8
1014E829N1N2J38J37K11K11K11K11K29K28K20K20N3r0j49o3k7j13j08k2N7N6J48K34J65K3
1011H112N1J37P9o4o3P9J38N3K0J63K09O5J5J01J79R4m4M2J33J33J39J39K41K40J55J55K27
1007A0928K27J40J41J89J90J89J89J85J85K71K70M18M18M17M18M64M64K07K06K54K55L35L35
1004A7295K75J88K21L92M32L46L57M42N16N15N10O82Q72Q72Q65Q64Q57N71L07L08L22M07N76
1002B8992Q63J188J275J366J538J876K163K456K972L540L828L931L931L739L339L299L929
1000G4225N190O622Q019R336J0184J0355J0111J0284J1327J3332J6841K2742L1439M3528O1009
$$ plain form
998 344544 431734 556589 730887 961988 1242416 1538173 1788269 1925789 1912005 1757351 1512693 1239942
996 1239942 985924 773976 609178 486375 396284 329654 279695 241904 212992 190387 172421 157922 145887
995 145887 135277 125641 116886 108991 102012 96122 91721 88981 87692 87834 89423 91986 94832 97277 99214 100864 102583
993 102583 105048 109145 115363 123483 132921 143125 153415 163432 173764 186037 202464 225479 257804 303108 366374
991 366374 454456 575796 738346 945210 1188865 1447044 1682976 1852537 1918133 1863448 1700984 1467165
989 1467165 1207762 962194 754056 590575 467751 376982 309784 259458 221220 191777 168936 151051 136603
988 136603 124304 113269 103064 93358 84023 75169 67202 60367 54763 50334 47079 44776 43075 41561 39960 38008
986 38008 35627 32893 30158 27594 25231 23127 21338 19755 18258 16775 15378 14189 13086 12043 11202 10658 10373 10099
$$ packed form
998C44544Q7190J24855J74298K31101K80428K95757K50096J37520j3784j54654k44658k72751
996A239942k54018k11948j64798j22803r0091o6630m9959l7791k8912k2605j7966j4499j2035
995A45887j0610r636q755p895o979n890m401k740j289J42J589K563K846K445J937J650J719
993A02583K465M097O218Q120R438J0204J0290J0017J0332J2273J6427K3015L2325M5304O3266
991C66374Q8082J21340J62550K06864K43655K58179K35932J69561O5596n4685j62464k33819
989A467165k59403k45568k08138j63481j22824r0769o7198n0326l8238k9443k2841j7885j4448
988A36603j2299j1035j0205r706r335q854p967o835n604m429l255k303j701j514j601j952
986C8008k381k734k735k564k363k104j789j583j497j483j397j189j103j043q41n44k85k74
$$ plain form
984 10099 9824 9575 9325 9119 8912 8637 8362 8045 7727 7468 7209 6988 6852 6879 6906 6938 6970 7059 7149 7138 7041 6863 6599 6293 5986 5801
980 5801 5616 5388 5160 4962 4763 4608 4452 4351 4249 4099 4035 4013 3991 3974 3957 3994 4031 3916 3715 3581 3446 3307 3167 3133 3099 3059 3020
977 3020 2967 2829 2690 2638 2600 2562 2529 2496 2515 2534 2553 2571 2661 2750 2693 2550 2471 2478 2479 2480 2537 2680 2812 2944 3013 2996 2884 2772 2691 2611 2530 2449
973 2449 2376 2303 2229 2156 2114 2073 2032 1991 1998 2006 2014 2022 2057 2093 2042 1992 1964 1937 1866 1796 1826 1857 1802 1746 1833 1920 1969 1933 1914 1895 1909 1922 1918 1829 1697 1650 1678
969 1678 1706 1696 1686 1809 1932 2017 2016 2049 2081 2022 1964 1921 1878 1750 1621 1587 1553 1520 1486 1575 1664 1663 1577 1541 1590 1634 1593 1559 1525 1485 1446 1550 1653
965 1653 1668 1596 1584 1659 1680 1700 1694 1688 1592 1411 1311 1297 1315 1333 1355 1378 1357 1337 1298 1260 1221 1183 1122 1061 1000 939 989 1039 945 852 838 824 853 882 977
960 977 1071 1022 973 1036 1098 1074 1051 1111 1171 1188 1205 1252 1300 1261 1223 1233 1244 1297 1351 1383 1415 1404 1393 1562 1731 1814 1897 1966 2035 2060 2086 2091 2097 1959 1821
956 1821 1777 1733 1603 1473 1403 1332 1271 1210 1222 1377 1537 1555 1489 1509 1525 1456 1366 1363 1360 1270 1172 1159 1179 1199 1176 1152 1129 1106 1192 1277 1363 1449 1433 1418
$$ packed form
984A0099k75k49k50k06k07k75k75l17l18k59k59k21j36K7K7L2L2Q9R0j1r7j78k64l06l07j85
980E801j85k28k28j98j99j55j56j01j02j50o4k2k2j7j7L7L7j15k01j34j35j39j40l4l4m0l9
977C020n3j38j39n2l8l8l3l3J9J9J9J8R0Q9n7j43p9PJJN7J43J32J32O9j7j12j12q1q0q1q1
973B449p3p3p4p3m2m1m1m1PQQQL5L6n1n0k8k7p1p0L0L1n5n6Q7Q7M9l6j9j9J4J3mq9j32m7K8
969A678K8j0j0J23J23Q5jL3L2n9n8m3m3j28j29l4l4l3l4Q9Q9jq6l6M9M4m1l4l4m0l9J04J03
965A653J5p2j2P5K1K0oor6j81j00j4J8J8K2K3k1k0l9l8l9l8o1o1o1o1N0N0r4r3j4j4K9K9R5
960I77R4m9m9O3O2k4k3O0O0J7J7M7M8l9l8J0J1N3N4L2L2j1j1J69J69Q3Q3O9O9K5K6NOj38j38
956A821m4m4j30j30p0p1o1o1J2J55J60J8o6K0J6o9r0llr0r8j3K0K0k3k4k3k3Q6Q5Q6Q6j6j5
$$ plain form
952 1418 1445 1473 1526 1579 1489 1399 1363 1327 1290 1254 1227 1201 1217 1234 1239 1245 1222 1113 1058 1145 1247 1263 1291 1462 1690 1918 2077 2237 2253 2269 2209 2149
948 2149 2061 1886 1710 1676 1657 1552 1454 1499 1556 1526 1464 1489 1509 1442 1396 1350 1356 1276 1169 1205 1298 1391 1448 1506 1483 1459 1348 1323 1340 1358 1311 1350 1394
944 1394 1353 1232 1197 1243 1203 1137 1072 1087 1103 1149 1196 1296 1311 1300 1375 1492 1608 1758 2052 2345 2495 2487 2480 2431 2296 2131 2052 2062 2072 2000 1928
940 1928 1942 1955 1941 1926 1911 1897 1869 1841 1855 1870 1900 1930 2046 2161 2205 2249 2204 2073 1967 1948 1972 1910 1764 1705 1735 1765 1751 1736 1728 1719 1613 1592 1667
936 1667 1741 1759 1776 1757 1737 1734 1817 1900 1897 1891 1886 1961 2036 2107 2178 2291 2405 2520 2635 2755 2876 2986 3183 3490 3798 4279 5019 6077 7279
933 7279 8550 9822 10837 11308 11156 10574 9688 8659 7558 6601 5880 5359 4973 4731 4631 4530 4449 4511 4715 5004 5355 5906
930 5906 6743 7896 9459 11452 13846 16384 18910 21236 23204 24570 25314 25571 25302 24431 22959 21057 18794 16272 13672
928 13672 11387 9560 8163 7070 6293 5820 5490 5172 4941 4874 4950 5099 5448 6037 6769 7639 8652 9827 10915 11631 11859
$$ packed form
952A418K7K8N3N3r0r0l6l6l7l6k7k6J6J7NOk3j09n5Q7J02J6K8J71K28K28J59J60J6J6o0o0
948B149q8j75j76l4j9j05r8M5N7l0o2K5K0o7m6m6Oq0j07L6R3R3N7N8k3k4j11k5J7J8m7L9M4
944A394m1j21l5M6m0o6o5J5J6M6M7J00J5j1P5J17J16J50K94K93J50qpm9j35j65p9J0J0p2p2
940A928J4J3j4j5j5j4k8k8J4J5L0L0J16J15M4M4m5j31j06j9K4o2j46n9L0L0j4j5qrj06k1P5
936A667P4J8J7j9k0lQ3Q3lonP5P5P1P1J13J14J15J15J20J21J10J97L07L08M81P40J058J202
933G279J271J272J015M71j52n82q86j029j101r57p21n21l86k42j00j01q1O2K04K89L51N51
930E906Q37J153J563J993K394K538K526K326J968J366P44K57k69q71j472j902k263k522k600
928A3672k285j827j397j093p77m73l30l18k31o7P6J49L49N89P32Q70J013J175J088P16K28
$$ plain form
925 11859 11633 10920 9855 8647 7457 6353 5376 4657 4168 3821 3438 3141 2962 2782 2613 2443 2431 2419 2355 2291 2270 2249 2170 2090
922 2090 2082 2074 2061 2047 2106 2164 2068 1971 1947 1922 1816 1710 1627 1630 1668 1706 1749 1792 1724 1656 1660 1664 1666 1669 1677 1686 1601 1603 1657 1711 1622 1532 1572 1612 1594 1577 1631 1685 1644
917 1644 1604 1607 1609 1581 1554 1569 1584 1528 1473 1460 1448 1405 1363 1321 1279 1162 1046 972 898 666 434 254 160 59 -41 -31 -21 -13 80 350 705 953
913 953 1200 1525 1849 2104 2358 2602 2846 2914 2810 2755 2785 2807 2830 2857 2885 2807 2728 2721 2715 2740 2765 2834 2902 2949 2996 3042 3089 3026 2963 3000 3037 3001
909 3001 2965 3000 3036 3084 3133 3181 3229 3228 3227 3227 3226 3237 3247 3258 3269 3197 3125 3239 3353 3402 3451 3457 3463 3479 3495 3583 3670 3661 3652 3715 3777 3801 3825 3921 4017 4231 4444
905 4444 4836 5313 5728 5858 5829 5629 5299 4882 4563 4417 4361 4304 4330 4356 4381 4405 4472 4539 4509 4479 4549 4620 4661 4703 4745 4786 4884 4981 5079 5176
901 5176 5175 5173 5171 5169 5110 5052 5065 5077 5133 5189 5345 5502 5609 5717 5825 5932 6034 6135 6194 6252 6359 6466 6730 6995 7346 7697 8138 8579 9064
898 9064 9377 9701 10025 10340 10656 10972 11288 11804 12321 12980 13640 14333 15027 15900 16944 18066 19474 21426 24238 28117 33886
$$ packed form
925A1859k26p13j065j208j190j104r77p19m89l47l83k97j79j80j69j70j2j2o4o4k1k1p9q0
922B090qqj3j4N9N8r6r7k4k5j06j06q3LL8L8M3M3o8o8MMKLQRq5KN4N4q9r0M0M0j8j7N4N4m1
917A644m0LKk8k7J5J5n6n5j3j2m3m2m2m2j17j16p4p4k32k32j80r4j01j00J0J0QR3K70L55K48
913I53K47L25L24K55K54K44K44O8j04n5L0K2K3K7K8p8p9poK5K5O9O8M7M7M6M7o3o3L7L7l6
909C001l6L5L6M8M9M8M8jj%jJ1J0J1J1p2p2J14J14M9M9OOJ6J6Q8Q7rrO3O2K4K4R6R6K14K13
905D444L92M77M15J30k9k00l30m17l19j46n6n7K6K6K5K4O7O7l0l0P0P1M1M2M2M1R8R7R8R7
901E176jkkkn9n8J3J2N6N6J56J57J07J08J08J07J02J01N9N8J07J07K64K65L51L51M41M41M85
898I064L13L24L24L15L16L16L16N16N17O59O60O93O94Q73J044J122J408J952K812L879N769
$$ plain form
895 33886 42535 54792 70640 89066 108816 128280 145542 159310 169024 174899 177144 175779 170504 161162 147716
893 147716 130661 111450 91838 73647 58149 45996 37222 31069 26693 23605 21492 20006 18806 17759 16712 15634
891 15634 14470 13349 12400 11597 10880 10230 9751 9345 8940 8688 8436 8238 8040 7826 7784 7772 7674 7581 7575 7587 7514 7408 7302 7276 7250 7310
888 7310 7370 7411 7452 7537 7621 7681 7740 7800 7860 7989 8118 8160 8203 8222 8242 8342 8442 8623 8718 8908 9270 9795 10321 10814 11308 11810 12313 12654
885 12654 12995 13205 13128 12831 12448 11993 11538 11182 10997 11010 11022 11088 11154 11220 11286 11298 11481 11706 11930 12164 12399 12768 13137 13463 13789 14136
882 14136 14483 14738 14993 15187 15294 15354 15415 15498 15438 15258 15078 15061 15045 15023 15087 15188 15289 15400 15655 15999 16344 16692 17039 17466 17807 18101
878 18101 18395 18777 19016 19134 19253 19371 19488 19463 19438 19423 19409 19395 19466 19616 19851 20133 20501 20879 21170 21461 21839 22279 22633 22845 23058
875 23058 23444 23916 24340 24764 25287 25810 26285 26846 27552 28258 28932 29605 30361 31202 32081 32960 33785 34610 35387 36250 37161 38072 38997
$$ packed form
895C3886Q649J2257J5848J8426J9750J9464J7262J3768R714N875K245j365n275r342j3446
893A47716j7055j9211j9612j8191j5498j2153q774o153m376l088k113j486j200j047j047j078
891A5634j164j121r49q03p17o50m79m06m05k52k52j98j98k14m2j2r8r3oJ2p3j06j06k6k6O0
888G310O0M1M1Q5Q4O0N9O0O0J29J29M2M3J9K0J00J00J81R5J90L62N25N26M93M94N02N03L41
885A2654L41K10p7k97l83m55m55l56j85J3J2O6O6O6O6J2J83K25K24K34K35L69L69L26L26L47
882A4136L47K55K55J94J07O0O1Q3o0j80j80j7j6k2O4J01J01J11K55L44L45L48L47M27L41K94
878A8101K94L82K39J18J19J18J17k5k5j5j4j4P1J50K35K82L68L78K91K91L78M40L54K12K13
875B3058L86M72M24M24N23N23M75N61P06P06O74O73P56Q41Q79Q79Q25Q25P77Q63R11R11R25
$$ plain form
873 38997 39923 40951 42123 43474 45025 46748 48472 50059 51646 53177 54622 56066 57597 59275 60952 62689 64511 66518
870 66518 68782 71418 74599 78463 83044 88341 94526 101723 109980 119398 130047 141931 154990 169234 184538 200756
868 200756 217690 235158 253227 272138 292510 315263 341711 373632 413832 466342 537041 635237 775800 978012
867 978012 1259487 1626736 2068176 2553375 3039547 3482418 3847202 4115236 4282724 4352885 4327542 4203229
865 4203229 3975163 3645069 3229097 2759471 2278903 1829536 1443018 1134315 901752 731796 607043
864 607043 512861 440049 383087 337754 300849 270419 245138 223581 204537 187269 171539 157011 143292 130548
862 130548 118849 108123 98236 89094 80878 73521 66974 61286 56554 52452 48680 45194 42137 39366 36681 34168 31933
860 31933 29870 27833 25882 24278 22959 21881 20975 20340 19792 19168 18459 17804 17150 16409 15669 15088 14593 14049 13678 13544 13582
$$ packed form
873C8997R26J028J172J351J551J723J724J587J587J531J445J444J531J678J677J737J822K007
870F6518K264K636L181L864M581N297O185P197Q257R418J0649J1884J3059J4244J5304J6218
868B00756J6934J7468J8069J8911K0372K2753K6448L1921M0200N2510P0699R8196J40563K02212
867I78012K81475L67249M41440M85199M86172M42871L64784K68034J67488P0161k5343j24313
865D203229k28066l30094m15972m69626m80568m49367l86518l08703k32563j69956j24753
864F07043r4182p2812n6962m5333l6905l0430k5281k1557j9044j7268j5730j4528j3719j2744
862A30548j1699j0726r887r142q216p357o547n688m732m102l772l486l057k771k685k513k235
860C1933k063k037j951j604j319j078r06o35n48o24p09o55o54p41p40n81m95n44l71j34L8
$$ plain form
857 13582 13494 13233 13105 13063 12956 12850 12821 12707 12365 11851 11443 11035 10473 9911 9469 9027 8645 8176 7794 7583 7414 7244 7252 7259 7124
854 7124 6988 6901 6814 6727 6640 6568 6497 6283 6069 5937 5805 5673 5541 5486 5431 5233 5035 4844 4653 4462 4271 4217 4163 4083 3916 3821 3897 3958
851 3958 4019 4189 4359 4449 4539 4718 4984 5143 5160 5204 5335 5403 5327 5293 5259 5105 4807 4478 4292 4160 4028 3887 3746 3610 3474 3355
848 3355 3322 3247 3171 3143 3202 3212 3222 3267 3313 3329 3260 3255 3394 3494 3509 3542 3576 3603 3631 3639 3648 3566 3399 3326 3339 3293 3103 2928 2753 2578 2403 2277
844 2277 2295 2318 2197 2059 2006 1988 1970 2023 2163 2340 2374 2336 2384 2461 2538 2592 2647 2615 2584 2595 2606 2580 2468 2389 2311 2235 2160 2192 2368 2463 2414 2357
840 2357 2385 2410 2349 2272 2281 2290 2213 2145 2163 2181 2113 2081 2135 2221 2164 2063 2048 2029 1924 1831 1823 1818 1728 1680 1775 1870 1822 1791 1845 1895 1860 1735 1697 1697 1696 1658
836 1658 1706 1711 1715 1720 1811 1905 1912 1933 1997 2083 2082 2055 2071 2087 2060 2041 2108 2150 2150 2143 2180 2243 2220 2194 2255 2315 2289 2228 2253 2278 2217 2188 2245 2302 2273 2277 2368 2434 2457
831 2457 2506 2642 2781 2833 2832 2917 3068 3133 3178 3222 3291 3316 3338 3446 3492 3395 3287 3322 3422 3435 3394 3439 3488 3451 3420 3532 3684 3749 3748 3832 3986
$$ packed form
857A3582q8k61j28m2j07j06k9j14l42n14m08m08n62n62m42m42l82m69l82k11j69j70QPj35
854G124j36q7q7q7q7p2p1k14k14j32j32j32j32n5n5j98j98j91j91j91j91n4n4q0j67r5P6O1
851C958O1J70J70R0R0J79K66J59J7M4J31O8p6l4l4j54k98l29j86j32j32j41j41j36j36j19
848C355l3p5p6k8N9J0J0M5M6J6o9nJ39J00J5L3L4K7K8QRq2j67p3J3m6j90j75j75j75j75j26
844B277J8K3j21j38n3j8j8N3J40J77L4l8M8P7P7N4N5l2l1J1J1k6j12p9p8p6p5L2J76R5m9n7
840B357K8K5o1p7RRp7o8J8J8o8l2N4Q6n7j01j5j9j05r3qnr0m8R5R5m8l1N4N0l5j25l8%jl8
836A658M8NMNR1R4PK1O4Q6jk7J6J6k7j9O7M2%pL7O3k3k6O1O0k6o1K5K5o1k9N7N7k9MR1O6K3
831B457M9J36J39N2jQ5J51O5M5M4O9K5K2J08M6r7j08L5J00J3m1M5M9l7l1J12J52O5jQ4J54
$$ plain form
827 3986 4053 4062 4115 4191 4182 4132 4168 4204 4154 4053 4037 4126 4172 4168 4250 4335 4334 4255 4262 4338 4328 4228 4171 4214 4257 4215 4174 4184 4107 3951 3837 3770 3704 3639 3659
823 3659 3685 3625 3499 3458 3522 3585 3611 3637 3645 3567 3478 3475 3508 3398 3225 3195 3321 3403 3410 3504 3695 3800 3765 3731 3734 3737 3668 3599 3631 3662 3630 3598 3667 3735
819 3735 3828 3921 4025 4129 4283 4608 4990 5287 5509 5817 6191 6480 6656 6831 6930 7029 6962 6896 6865 6663 6404 6316 6307 6298 6230 6162 6280 6399
815 6399 6440 6481 6605 6728 6780 7004 7337 7584 7673 7763 8090 8418 8739 9061 9588 10202 10820 11611 12704 14084 15592 17501 19840
812 19840 22351 24670 26588 27826 28090 27283 25732 23913 22093 20223 18640 17512 16669 15974 15565 15593 15908 16348 16959 18065
810 18065 19686 21787 25090 30585 37970 44921 48949 49805 49687 50818 53380 55993 57174 56507 54178 50374 45482 40329
808 40329 35692 31785 28509 25911 24172 23042 22199 21540 21283 21441 21885 22555 23626 25276 27443 30220 33970 38924 44967
805 44967 51836 59106 65976 71298 74090 73960 71180 66280 60061 53557 47582 42581 38493 35379 33253 31872 31063 30769
$$ packed form
827C986O7RN3P6rn0L6L6n0j01j6Q9M6mQ2Q5jp9PP6j0j00n7M3M3m2m1J0p7j56j14o7o6o5K0
823C659K6o0j26m1O4O3K6K6Qp8q9lL3j10j73l0J26Q2PR4J91J05l5l4LLo9o9L2L1l2l2O9O8
819C735R3R3J04J04J54L25L82K97K22L08L74K89J76J75R9R9o7o6l1k02k59q8rro8o8J18J19
815F399M1M1J24J23N2K24L33K47Q9R0L27L28L21L22N27O14O18P91J093J380J508J909K339
812A9840K511K319J918J238K64q07j551j819j820j870j583j128q43o95m09K8L15M40O11J106
810A8065J621K101L303N495P385O951M028Q56j18J131K562K613J181o67k329l804m892n153
808D0329m637l907l276k598j739j130q43o59k57J58M44O70J071J650K167K777L750M954O043
805D4967O869P270O870N322K792j30k780m900o219o504n975n001m088l114k126j381q09k94
$$ plain form
803 30769 30977 31701 32825 34465 36756 39792 43921 49596 57104 66732 78335 91484 105306 118498 129677 138050 143078
801 143078 144497 142506 137593 130438 121508 111167 100081 89081 78826 69873 62695 57287 53425 50705 49074 48589
799 48589 49078 50335 52565 56035 61052 67701 76012 86027 97360 109242 120953 131768 141037 148246 153222 155497
797 155497 154278 149082 140047 128298 115116 101874 89720 79429 71142 64694 60021 56924 55030 54092 54128 55303 57567
795 57567 60880 65396 71352 78969 88109 98680 110684 123890 137626 150961 162570 170684 173874 171393 163412 151020
793 151020 135859 120067 105400 92853 82623 74741 69015 65065 62452 61042 60793 61632 63487 66546 71038 77190
791 77190 85234 95512 108483 124146 142198 162140 182748 201810 216556 224485 224371 216409 202094 183941 164521
789 164521 145616 128188 112880 99942 89354 80859 74371 69729 66635 64680 63699 63886 65276 67822 71801 77777
$$ packed form
803C0769K08P24J124J640K291L036M129N675P508R628J1603J3149J3822J3192J1179Q373N028
801A43078J419j991m913p155q930j0341j1086j1000j0255q953p178n408l862k720j631m85
799D8589M89J257K230L470N017O649Q311J0015J1333J1882J1711J0815R269P209M976K275
797A55497j219n196r035j1749j3182j3242j2154j0291q287o448m673l097j894r38L6J175K264
795E7567L313M516N956P617R140J0571J2004J3206J3736J3335J1609Q114L190k481p981j2392
793A51020j5161j5792j4667j2547j0230p882n726l950k613j410k49Q39J855L059M492O152
791G7190Q044J0278J2971J5663J8052J9942K0608J9062J4746P929j14p962j4315j8153j9420
789A64521j8905j7428j5308j2938j0588q495o488m642l094j955r81J87J390K546L979N976
$$ plain form
787 77777 86217 97471 111761 128852 147604 165783 181040 191320 195470 193143 185259 173552 159725 145109 130579
786 130579 116806 104237 92926 83162 75202 69018 64253 60690 58331 57060 56814 57542 59531 62952 67959 74742 83437
783 83437 94138 106218 118700 130473 140126 146567 149399 148822 145208 138747 129593 118556 106659 94855 84026 74857
782 74857 67580 61955 57763 54817 52960 52051 52002 52820 54611 57531 61770 67705 75645 85471 96844 109049 121168 131934
779 131934 140122 144920 145766 142708 136270 127598 117494 106529 95162 84283 74607 66252 59214 53480 49064 45633
777 45633 42948 41050 39897 39303 39109 39439 40513 42336 45133 49247 55138 62940 72290 82542 92278 99579 102697 101039
775 101039 95199 86430 76343 66564 58103 51186 45587 41292 38199 35955 34227 33071 32431 32237 32329 32793 33773 35251
773 35251 37015 39073 41417 43707 45711 47430 49063 50487 51509 52014 52004 51529 50653 49608 48564 47498 46604 46172 46599
$$ packed form
787G7777Q440J1254J4290J7091J8752J8179J5257J0280M150k327p884j1707j3827j4616j4530
786A30579j3773j2569j1311r764p960o184m765l563k359j271k46P28J989L421N007O783Q695
783H3437J0701J2080J2482J1773R653O441K832n77l614o461r154j1037j1897j1804j0829r169
782G4857p277n625m192k946j857r09m9Q18J791K920M239N935P940R826J1373J2205J2119J0766
779A31934Q188M798Q46l058o438q672j0104j0965j1367j0879r676q355p038n734m416l431
777D5633k685j898j153n94j94L30J074J823K797M114N891P802R350J0252R736P301L118j658
775A01039n840q769j0087r779q461o917n599m295l093k244j728j156o40j94R2M64R80J478
773C5251J764K058K344K290K004J719J633J424J022N05j0m75q76j045j044j066q94m32M27
$$ plain form
771 46599 47794 49620 52154 55662 60091 65149 70591 76205 81875 87545 93755 101055 109815 119893 130407 140063 147257
769 147257 151185 152607 153169 154151 156220 159479 163483 167523 170818 173086 174494 175477 176459 178175 181438 186878 194552 204267
766 204267 215300 226261 235675 242797 247915 252078 256414 262017 269281 277452 285450 292661 299012 304878 310571 316593 323246
764 323246 330279 337025 342510 345991 346529 343686 337829 330311 322821 316763 313291 312740 314498 317345 319891 321119 320434 317743
762 317743 313826 309995 307289 306131 306249 307227 308316 308774 308420 307435 306252 305069 303943 302817 300986 297494 291684 283526
760 283526 273323 261917 250447 240065 231434 224465 218827 213820 208639 202599 195664 188556 181947 176311 172015 169380
758 169380 168166 167811 167857 168076 168322 168396 168271 168233 168486 168738 169014 169291 169419 169146 168383 167333 166316 165471 165020 165314 166398 168113
755 168113 170235 172757 175528 178214 180746 183279 186050 189337 193565 199226 206454 214656 223152 231475 239223 245996 251616
$$ packed form
771D6599J195J826K534L508M429N058N442N614N670N670O210P300Q760J0078J0514R656P194
769A47257L928J422N62R82K069L259M004M040L295K268J408R83R82J716L263N440P674R715
766B04267J1033J0961R414P122N118M163M336N603P264Q171P998P211O351N866N693O022O653
764C23246P033O746N485L481N38k843n857p518p490o058l472n51J758K847K546J228o85k691
762C17743l917l831k706j158J18R78J089M58l54r85j183j183j126j126j831l492n810q158
760B83526j0203j1406j1470j0382q631o969n638n007n181o040o935p108o609n636m296k635
758A69380j214l55M6K19K46P4j25l8K53K52K76K77J28k73p63j050j017q45m51K94J084J715
755A68113K122K522K771K686K532K533K771L287M228N661P228Q202Q496Q323P748O773N620
$$ plain form
753 251616 256492 261366 266870 273543 281764 291117 300556 309020 315937 321334 325299 328239 330894 333883 337273 340937 344515
751 344515 347457 349196 349555 348826 347595 346364 345423 344998 344954 344738 343706 341586 338334 334452 330842 328664 328751 330959 334677
749 334677 338911 342539 344507 344182 341738 337648 332468 326724 321065 315725 310470 304872 298759 291959 284414 276175 267535
747 267535 258730 249639 240004 229738 218980 207706 196125 184945 174917 166437 159804 155061 152011 149934 148072 145924
745 145924 143210 139522 134795 129324 123498 117499 111608 106233 101568 97419 93548 89762 86019 81989 77338 72172 66731
743 66731 61005 55082 49246 43889 39161 34887 31243 28336 26060 24105 22323 20865 19692 18628 17563 16654 15745 14979
740 14979 14214 13644 13075 12506 11937 11621 11305 10946 10587 10393 10200 9920 9641 9452 9262 9073 8884 8858 8833 8664 8495 8531 8567 8459
738 8459 8352 8277 8201 8083 7964 8054 8144 8153 8163 8264 8450 8548 8473 8531 8674 8721 8683 8659 8635 8605 8576 8687 8798 8766 8734 8822 8911 8956 9001 9144 9286
$$ packed form
753B51616M876M874N504O673Q221R353R439Q464O917N397L965K940K655K989L390L664L578
751C44515K942J739L59p29j231j231r41m25m4k16j032k120l252l882l610k178Q7K208L718
749C34677M234L628J968l25k444m090n180n744n659n340n255n598o113o800p545q239q640
747B67535q805r091r635j0266j0758j1274j1581j1180j0028q480o633m743l050k077j862k148
745A45924k714l688m727n471n826n999n891n375m665m149l871l786l743m030m651n166n441
743F6731n726n923n836n357m728m274l644k907k276j955j782j458j173j064j065r09r09p66
740A4979p65n70n69n69n69l16l16l59l59j94j93k80k79j89j90j89j89k6k5j69j69L6L6j08
738H459j07p5p6j18j19R0R0RJ0J01J86R8p5N8J43M7l8k4k4l0k9J11J11l2l2Q8Q9M5M5J43J42
$$ plain form
734 9286 9229 9086 9073 9232 9385 9453 9584 9802 9934 9980 10154 10414 10631 10762 10990 11305 11566 11826 12187 12547 12757 12795 12881 13139 13387
731 13387 13634 13946 14430 14903 15376 15942 16508 16817 16953 17118 17570 18137 18875 19894 21086 22293 23329 24357 25472 26648 27909
728 27909 29423 31338 33663 36389 39695 43402 47317 51403 55722 60328 64719 68709 72198 75171 77507 79098 80081 80547
726 80547 80549 80378 80456 80935 81758 82867 84386 86307 88383 90545 93034 96153 99947 104601 110669 118398 127753 138541 150808
724 150808 164279 178509 192910 206893 219673 230161 237727 242203 243758 242704 239760 235972 232098 228309 224519 220844
722 220844 217340 213940 210712 207953 205824 204411 203972 205325 209026 215212 223633 233959 245946 259114 273257 288178
720 288178 303614 318779 332396 343214 349963 351657 348481 341840 333538 325042 317176 310027 303164 295477 286244 275506
718 275506 263908 252182 241086 231558 224494 220223 218759 220022 223404 227986 232854 237768 242681 247671 252575 257018
$$ packed form
734I286n7j43j3J59J53O8J31K18J32M6J74K60K17J31K28L15K61K60L61L60K10L8Q6K58K48
731A3387K47L12M84M73M73N66N66L09J36J65M52N67P38J019J192J207J036J028J115J176J261
728B7909J514J915K325K726L306L707L915M086M319M606M391L990L489K973K336J591R83M66
726H0547Kj71P8M79Q23J109J519J921K076K162K489L119L794M654O068P729R355J0788J2267
724A50808J3471J4230J4401J3983J2780J0488P566M476J555j054k944l788l874l789l790l675
722B20844l504l400l228k759k129j413m39J353L701O186Q421J0326J1987J3168J4143J4921
720B88178J5436J5165J3617J0818O749J694l176o641q302q496p866p149o863p687r233j0738
718B75506j1598j1726j1096r528p064m271j464J263L382M582M868M914M913M990M904M443
$$ plain form
716 257018 260258 261663 261177 259345 256768 253711 250024 245958 241605 236715 231194 225176 218987 212852 206804 201141 196223
714 196223 191966 188453 185691 183444 181118 178277 175115 172240 170210 169268 169512 170959 173193 175828 178550 181100 183098 184351
711 184351 185154 186357 188413 191557 196175 202455 209953 217736 225312 232602 239512 245907 251875 257556 262880 267459 271053
709 271053 273444 274410 273943 272439 270534 268678 266823 264816 262808 260641 258561 257210 257292 259044 262344 267211 273740 281859
707 281859 291295 301730 312909 324317 335439 346085 356330 365916 374184 380586 384639 386042 384752 381157 375900 369074
705 369074 360358 349677 337334 324056 310778 298811 289537 283589 281021 281405 283794 287107 290592 294172 298038 302062
703 302062 305341 307271 307424 305537 301529 295970 289895 284124 278755 273638 268521 262813 256131 248780 241601 235524 230765
701 230765 227117 223869 219741 213608 205534 196486 187652 179908 173957 170356 169254 170043 171981 174435 176731 178168 178658 178517
$$ packed form
716B57018L240J405m86j832k577l057l687m066m353m890n521o018o189o135o048n663m918
714A96223m257l513k762k247k326k841l162k875k030r42K44J447K234K635K722K550J998J253
711A84351Q03J203K056L144M618O280P498P783P576P290O910O395N968N681N324M579L594
709B71053K391R66m67j504j905j856j855k007k008k167k080j351Q2J752L300M867O529Q119
707B81859R436J0435J1179J1408J1122J0646J0245R586Q268O402M053J403j290l595n257o826
705C69074q716j0681j2343j3278j3278j1967r274n948k568L84K389L313L485L580L866M024
703C02062L279J930J53j887m008n559o075n771n369n117n117n708o682p351p179o077m759
701B30765l648l248m128o133q074r048q834p744n951l601j102P89J938K454K296J437M90j41
$$ plain form
699 178517 178076 177463 176835 176494 176017 174681 171955 168026 163661 159467 156122 154324 154481 156643 160622 165805 170636 173004 171326
697 171326 165809 157901 149362 141877 136740 134561 135305 138803 144650 152129 159693 165595 168461 167462 162624 155194 147248 140756
694 140756 137071 136944 141000 149037 159881 171380 180646 184783 181989 172645 159578 146174 134890 127175 123529 123799
693 123799 126992 131831 136843 140587 141752 139560 134216 126752 118315 110241 103830 99910 98683 100217 104329 110353 116892
690 116892 122168 124981 124635 121253 116016 110608 106503 104059 103050 103129 104068 105294 106226 106413 105733 104309 102546 101184 100638
688 100638 100379 99887 98765 97113 95174 93476 92637 93116 94683 97210 100597 104851 109736 114901 120153 125030 128589 130166
686 130166 130082 129439 129198 129914 132292 136561 142377 148962 155146 159605 161027 158965 154097 147753 141008 134715 129853 127434
684 127434 127707 130394 134971 140838 147105 152638 156854 159472 160430 159961 158518 156745 155145 154640 156599 161787 169897 179432
$$ packed form
699A78517m41o13o28l41m77j336k726l929m365m194l345j798J57K162L979N183M831K368j678
697A71326n517p908q539p485n137k179P44L498N847P479P564N902K866r99m838p430p946o492
694A40756l685j27M056Q037J0844J1499R266M137k794r344j3067j3404j1284p715l646K70
693A23799L193M839N012L744J165k192n344p464q437q074o411l920j227J534M112O024O539
690A16892N276K813l46l382n237n408m105k444j009P9R39J226R32J87o80j424j763j362n46
688A00638k59m92j122j652j939j698q39M79J567K527L387M254M885N165N252M877L559J577
686A30166q4o43k41P16K378M269N816O585O184M459J422k062m868o344o745o293m862k419
684A27434K73K687M577N867O267N533M216K618R58m69j443j773j600n05J959N188Q110R535
$$ plain form
682 179432 188566 195659 199143 198047 192654 183938 173332 162552 153320 146795 142847 140579 139515 139309 139505 139670 139319 138188
679 138188 135739 131472 125773 119573 113888 109414 106946 106977 109471 113785 119188 124676 128732 129793 127359 121967 114685 106543
677 106543 98688 92208 87503 84548 83025 82327 81544 79736 76496 72298 67585 62625 57665 53016 48769 44910 41681 39347
675 39347 37988 37414 37470 38106 38914 39263 38866 37817 36139 33891 31358 29153 27350 25924 24785 24097 23580 22829 21791 20595
672 20595 19228 17585 15770 14152 12820 11523 10226 9201 8462 7855 7247 6856 6636 6276 5831 5528 5398 5180 4875 4766
670 4766 4829 4817 4632 4491 4522 4472 4250 4128 4179 4175 4000 3921 3928 3812 3609 3511 3584 3554 3352 3279 3378 3348 3147 3011 3160 3258 3183 3116 3221 3372
666 3372 3351 3379 3492 3525 3387 3314 3414 3423 3260 3140 3192 3181 2999 2917 3006 3073 2969 2912 2942 2843 2573 2419 2551 2570 2417 2314 2382 2401 2249
663 2249 2167 2258 2335 2241 2103 2138 2203 2096 1990 2055 2198 2168 2139 2281 2368 2283 2269 2427 2570 2542 2506 2642 2743 2559 2439 2490 2510 2358 2205
$$ packed form
682A79432R134P093L484j096n393q716j0606j0780r232o525l948k268j064k06J96J65l51j131
679A38188k449m267n699o200n685m474k468L1K494M314N403N488M056J061k434n392p282q142
677A06543p855o480m705k955j523o98p83j808l240m198m713m960m960m649m247l859l229k334
675C9347j359n74N6O36Q08L49l97j049j678k248k533k205j803j426j139o88n17p51j038j196
672B0595j367j643j815j618j332j297j297j025p39o07o08l91k20l60m45l03j30k18l05j09
670D766O3j2j85j41L1n0k22j22N1mj75p9Pj16k03r8P3l0k02p3R9l0k01j36J49R8p5o7J05J51
666C372k1K8J13L3j38p3J00Rj63j20N2j1j82q2Q9O7j04n7L0r9k70j54J32J9j53j03O8J9j52
663B249q2R1P7r4j38L5O5j07j06O5J43l0k9J42Q7q5j4J58J43k8l6J36J01j84j20N1K0j52j53
$$ plain form
659 2205 2225 2308 2220 2131 2214 2333 2279 2225 2343 2486 2458 2357 2429 2508 2416 2323 2403 2531 2488 2445 2573 2692 2638 2578 2689 2884 2793 2614 2606 2627
656 2627 2561 2519 2648 2853 2886 2848 2981 3180 3206 3081 3128 3221 3229 3242 3340 3471 3517 3508 3671 3756 3668 3537 3579 3650 3549 3381 3386 3508 3545 3538 3617
652 3617 3675 3561 3413 3551 3740 3643 3459 3447 3566 3513 3389 3436 3540 3473 3333 3366 3443 3349 3183 3188 3356 3352 3296 3326 3369 3241 3107 3145 3259
648 3259 3201 3007 3100 3338 3405 3260 3201 3279 3271 3184 3241 3451 3518 3421 3409 3494 3492 3402 3397 3481 3423 3278 3277 3359 3355 3265 3261 3346 3288 3223 3302 3446 3389 3297 3462
644 3462 3728 3793 3636 3622 3684 3545 3234 3181 3432 3598 3513 3513 3691 3726 3593 3545 3692 3754 3664 3573 3672 3685 3607 3615 3791 3881 3819 3757 3769 3695 3580
640 3580 3608 3785 3818 3651 3628 3765 3759 3536 3399 3522 3645 3630 3701 3850 3857 3720 3727 3941 4069 4000 4017 4232 4361 4294 4314 4594 4875 5040
637 5040 5405 6094 6640 6735 6515 6219 5837 5371 5105 5123 5141 5080 5105 5334 5562 5566 5714 6081 6362 6442 6522 6810 7098 7195 7377 7812 8246
633 8246 8495 8829 9424 10019 10428 10922 11732 12542 13238 14078 15268 16544 17797 19307 21376 23731 26292 29369 33219 37699
$$ packed form
659B205K0Q3q8q9Q3J19n4n4J18J43k8j01P2P9r2r3Q0J28m3m3J28J19n4o0J11J95r1j79qK1
656B627o6m2J29K05L3l8J33J99K6j25M7R3QJ3R8J31M6rJ63Q5q8j31M2P1j01j68NJ22L7pP9
652C617N8j14j48J38J89r7j84j2J19n3j24M7J04o7j40L3P7r4j66NJ68mn6L0M3j28j34L8J14
648C259n8j94R3K38O7j45n9P8qq7N7K10O7r7j2Q5kr0nQ4n8j45jQ2mr0mQ5n8o5P9J44n7r2J65
644C462K66O5j57j4O2j39l11n3K51J66q5%J78L5j33m8J47O2r0r1R9J3p8QJ76R0o2o2J2p4j15
640C580K8J77L3j67k3J37ok23j37J23J23j5P1J49Pj37PK14J28o9J7K15J29o7K0K80K81J65
637E040L65O89N46R5k20k96l82m66k66J8J8o1K5K29K28MJ48L67K81Q0Q0K88K88R7J82M35M34
633H246K49L34N95N95M09M94Q10Q10O96Q40J190J276J253J510K069K355K561L077L850M480
$$ plain form
631 37699 42845 48965 56503 65243 74707 84457 93673 100770 104215 103591 99213 91798 82586 73087 64265 56302 49141 42955
629 42955 37888 33567 29682 26313 23649 21386 19209 17319 15850 14554 13230 12078 11276 10561 9673 8957 8582 8294 7835
626 7835 7376 7217 7230 6994 6672 6546 6421 6090 5759 5650 5541 5232 4922 4814 4705 4453 4201 4222 4242 4005 3767 3760 3753 3603 3453 3620
623 3620 3786 3697 3522 3613 3875 3946 3932 4105 4364 4360 4270 4416 4562 4432 4130 3961 3878 3594 3224 3164 3275 3192 2937 2905 3045 2989 2846
620 2846 2891 3022 2948 2703 2692 2853 2871 2717 2747 2949 3003 2884 2950 3102 3044 2814 2792 2942 2843 2658 2679 2872 2870 2695 2725 2927 2871 2643
617 2643 2680 2889 2955 2849 2844 3012 3036 2888 2959 3201 3301 3228 3356 3656 3648 3354 3241 3300 3216 2960 2910 3146 3276 3233 3424 3786 3899 3724
613 3724 3698 3845 3848 3564 3485 3577 3526 3189 3054 3091 3034 2806 2785 2937 2945 2781 2803 2996 2996 2824 2885 3233 3444 3369 3506 3929 4254 4293 4276
610 4276 4345 4269 3906 3700 3780 3775 3482 3298 3401 3453 3219 3085 3123 3082 2755 2530 2592 2590 2415 2323 2516 2717 2631 2576 2807 2967 2954 2977 3172
$$ packed form
631C7699N146O120P538Q740R464R750R216P097L445o24m378p415r212r499q822p963p161o186
629D2955n067m321l885l369k664k263k177j890j469j296j324j152q02p15q88p16l75k88m59
626G835m59j59J3k36l22j26j25l31l31j09j09l09l10j08j09k52k52K1K0k37k38ppj50j50J67
623C620J66q9j75R1K62P1j4J73K59mr0J46J46j30l02j69q3k84l70o0J11q3k55l2J40n6j43
620B846M5J31p4k45j1J61J8j54L0K02N4j19O6J52n8k30k2J50r9j85K1J93kj75L0K02n6k28
617B643L7K09O6j06nJ68K4j48P1K42J00p3J28L00qk94j13N9q4k56n0K36J30m3J91L62J13j75
613C724k6J47Lk84p9R2n1l37j35L7n7k28k1J52Qj64K2J93%j72O1L48K11p5J37M23L25L9j7
610D276O9p6l63k06Q0nk93j84J03N2k34j34L8m1l27k25O2kj75r2J93K01q6n5K31J60j3K3J95
$$ plain form
606 3172 3180 2902 2728 2841 2867 2607 2363 2405 2382 2188 2046 2190 2255 2034 1916 2085 2111 1850 1716 1869 1978 1801 1632 1749 1910 1783
603 1783 1595 1692 1804 1744 1698 1824 1936 1761 1695 1916 2172 2142 2124 2278 2389 2327 2366 2692 2939 2899 2870 3127 3449 3369 3209 3336 3384
600 3384 3030 2650 2670 2819 2682 2523 2650 2820 2703 2526 2634 2829 2737 2649 2847 3124 3229 3253 3563 3838 3825 3701 3864 4019 3888
597 3888 3690 3665 3625 3298 2995 3093 3270 3160 2887 2900 2992 2912 2759 2892 3032 2886 2702 2805 3050 3010 2960 3197 3577 3555 3330 3276 3351
593 3351 3254 3074 3065 3127 2903 2606 2595 2727 2573 2360 2433 2592 2465 2231 2283 2479 2388 2119 2137 2290 2272 2143 2300 2572 2443 2131 2105
590 2105 2329 2268 2036 2091 2346 2315 2097 2166 2436 2419 2203 2273 2544 2528 2391 2540 2890 2953 2774 2882 3133 3097 2786 2761 2930 2927 2710
587 2710 2779 3056 3047 2848 2935 3223 3225 2950 2961 3216 3299 3086 3045 3319 3421 3301 3353 3619 3714 3530 3519 3736 3667 3354 3327 3587 3675 3491
583 3491 3478 3638 3511 3200 3175 3502 3542 3296 3221 3476 3559 3356 3439 3816 4021 3814 3780 3988 4025 3813 3772 4004 4063 3821 3750 4037 4152
$$ packed form
606C172Qk78j74J13K6k60k44M2k3j94j42J44O5k21j18J69K6k61j34J53J09j77j69J17J61j27
603A783j88R7J12o0m6J26J12j75o6K21K56l0j8J54J11o2L9L26K47m0k9K57L22q0j60J27M8
600C384l54l80K0J49j37j59J27J70j17j77J08J95r2q8J98K77J05K4L10K75j3j24J63J55j31
597C888j98k5m0l27l03R8J77j10k73J3R2q0j53J33J40j46j84J03K45m0n0K37L80k2k25n4P5
593C351r7j80rO2k24k97j1J32j54k13P3J59j27k34N2J96r1k69J8J53j8j29J57K72j29l12k6
590B105K24o1k32N5K55l1k18O9K70j7k16P0K71j6j37J49L50O3j79J08K51l6l11k5J69lk17
587B710O9K77rj99Q7K88Kk75J1K55Q3k13m1K74J02j20N2K66R5j84j1K17o9l13k7K60Q8j84
583C491j3J60j27l11k5L27M0k46p5K55Q3k03Q3L77K05k07l4K08L7k12m1K32N9k42p1K87J15
$$ plain form
580 4152 3868 3756 4043 4330 4269 4295 4595 4722 4516 4482 4728 4889 4744 4770 5132 5321 5288 5426 5969 6512 6760 7179 8079 8978 9797
577 9797 10902 12340 13377 13445 12998 12386 11373 10038 8990 8468 7946 7204 6634 6536 6438 6032 5797 5940 5998 5718 5611 5899 6101
574 6101 5894 5773 6070 6368 6182 5996 6312 6627 6623 6618 6943 7267 7223 7179 7522 7864 7852 7839 8281 8723 8882 9213 10061 10996 11720 12731
571 12731 14711 17435 20707 25068 30562 35970 39522 40382 38733 34965 29902 25126 21567 18982 16786 15220 14456 13979
569 13979 13265 12723 12764 12978 12857 12736 13144 13725 13981 14238 14978 15890 16532 17346 18712 20364 21737 23281 25642 28519 31471
566 31471 34824 39108 44022 49136 54767 61399 68662 75540 81330 85608 87308 85900 82373 78179 73813 69294 65175
564 65175 62359 60976 60665 61901 65350 70346 75294 79039 81431 82390 82381 82888 85156 89200 94134 100041 107288 115279 122810
562 122810 129024 133175 134175 131146 124966 117565 109763 101639 93515 86132 79379 72573 66054 60666 56367 52617 49612
$$ packed form
580D152k84j12K87K87o1K6L00J27k06l4K46J61j45K6L62J89l3J38N43N43K48M19R00Q99Q19
577I797J105J438J037O8m47o12j013j335j048n22n22p42n70r8r8m06k35J43N8k80j07K88K02
574F101k07j21K97K98j86j86L16L15mnL25L24m4m4L43L42j2j3M42M42J59L31Q48R35P24J011
571A2731J980K724L272M361N494N408L552Q60j649l768n063m776l559k585k196j566p64m77
569A3979p14n42M1K14j21j21M08N81K56K57P40R12O42Q14J366J652J373J544K361K877K952
566C1471L353M284M914N114N631O632P263O878N790M278J700j408l527m194m366m519m119
564F5175k816j383l11J236L449M996M948L745K392R59rN07K268M044M934N907P247P991P531
562A22810O214M151J000l029o180p401p802q124q124p383o753o806o519n388m299l750l005
$$ plain form
560 49612 48025 47756 48098 48956 50649 52744 54532 56235 58634 61663 64417 66541 68028 68312 66553 63361 60166 57487
557 57487 54826 52165 49958 48038 45522 42490 39750 37411 34869 32240 30408 29551 29076 29002 29795 31218 32234 32735 33691
555 33691 35162 36562 37961 40195 43289 46561 50005 54531 60259 66592 73555 82123 92580 104248 117004 131669
553 131669 148225 165459 182694 199797 215352 226805 232702 233656 231116 225791 218689 211079 203182 194417 184907 176099
551 176099 168837 162976 158890 157784 160402 166015 174207 185256 199113 214917 232727 253959 279145 306725 334019
549 334019 358333 376518 385478 384528 376072 362976 347056 329590 312088 294987 277686 260098 243348 228260 214356
548 214356 201540 190930 183013 176965 172120 168872 167400 166898 167027 168795 172798 178022 183532 189021 193421 194378 190579
545 190579 183250 174374 164969 155735 147768 141578 135941 129788 123427 117239 110818 103995 97767 92742 88052 82961 78157
$$ packed form
560D9612j587k69L42Q58J693K095J788J703K399L029K754K124J487K84j759l192l195k679
557E7487k661k661k207j920k516l032k740k339k542k629j832q57m75p4P93J423J016N01R56
555C3691J471J400J399K234L094L272L444M526N728O333O963Q568J0457J1668J2756J4665
553A31669J6556J7234J7235J7103J5555J1453N897R54k540n325p102p610p897q765r510q808
551A76099p262n861m086j106K618N613Q192J1049J3857J5804J7810K1232K5186K7580K7294
549C34019K4314J8185Q960r50q456j3096j5920j7466j7502j7101j7301j7588j6750j5088j3904
548B14356j2816j0610p917o048m845l248j472n02J29J768M003N224N510N489M400R57l799
545A90579p329q876r405r234p967o190n637o153o361o188o421o823o228n025m690n091m804
$$ plain form
543 78157 74211 70510 66521 63124 61044 59526 58008 57115 57539 58521 59416 60882 63552 66807 70062 74130 79744 86372
541 86372 93516 102221 113389 126549 140912 156893 174766 193379 211477 229224 246455 261510 273071 281531 287070
539 287070 287896 282248 271184 257199 241949 226614 213243 203595 197276 193421 192573 195678 202341 211697 224454 241394
537 241394 261975 285363 312025 342066 373301 402532 428196 449563 464986 472790 472909 465753 450425 426676 397041
536 397041 365171 333240 302283 274119 250481 231120 215139 203089 195909 192992 192997 196028 202553 211189 219826 228294
534 228294 237049 244456 248253 247990 244576 237908 227516 214581 201245 187741 173378 159129 146542 135302 123890
532 123890 112696 103049 94591 86133 78162 72196 67685 63175 58890 56152 54615 52563 50239 49003 48572 47396 45747
530 45747 45187 45466 45230 44715 45517 47265 48382 49098 51131 54397 57490 60655 65711 72494 79450 86741 95809 106305 116286
$$ packed form
543G8157l946l701l989l397k080j518j518q93M24R82Q95J466K670L255L255M068N614O628
541H6372P144Q705J1168J3160J4363J5981J7873J8613J8098J7747J7231J5055J1561Q460N539
539B87070Q26n648j1064j3985j5250j5335j3371r648o319l855q48L105O663R356J2757J6940
537B41394K0581K3388K6662L0041L1235K9231K5664K1367J5423P804J19p156j5328k3749k9635
536C97041l1870l1931l0957k8164k3638j9361j5981j2050p180k917NL031O525Q636Q637Q468
534B28294Q755P407L797k63l414o668j0392j2935j3336j3504j4363j4249j2587j1240j1412
532A23890j1194r647q458q458p971n966m511m510m285k738j537k052k324j236m31j176j649
530D5747n60K79k36n15Q02J748J117P16K033L266L093L165N056O783O956P291R068J0496R981
$$ plain form
527 116286 125644 135518 145058 151563 154000 153286 149614 142447 133404 125565 119810 114686 110507 109250 110811 112887 115250
525 115250 119847 127129 135613 145172 157423 171769 185256 196909 208276 219643 229462 237383 244331 248697 246589 236962
523 236962 222694 206249 188144 170081 155169 144196 134998 127097 122462 121349 121326 121803 124744 130266 135388 138618
521 138618 141448 144188 145037 143988 143569 143977 142037 136200 128703 120889 111643 101180 92378 86300 80510 74152 69455 67096
519 67096 64651 61262 59421 59737 59651 58112 57547 58879 59352 58034 57576 59155 59989 59019 59022 61301 62949 62679 63382 66391 68770
517 68770 68979 69818 72503 73871 72682 72352 74927 77214 77261 77937 80688 82351 81213 80706 82852 84482 83592 83675 86807 89309
514 89309 88851 89138 92696 96168 97100 98776 102810 104839 102450 100232 101715 103714 104044 106723 113503 119195 120758 123525
512 123525 131155 138786 142895 148551 159313 169989 177243 187076 203813 221983 238026 258825 288823 320941 350231
$$ packed form
527A16286R358R874R540O505K437p14l672p167r043p839n755n124m179j257J561K076K363
525A15250M597P282Q484R559J2251J4346J3487J1653J1367J1367R819P921O948M366k108r627
523B36962j4268j6445j8105j8063j4912j0973r198p901m635j113k3M77K941N522N122L230
521A38618K830K740Q49j049m19M08j940n837p497p814r246j0463q802o078n790o358m697k359
519F7096k445l389j841L16q6j539n65J332M73j318m58J579Q34r70LK279J648k70P03L009K379
517F8770K09Q39K685J368j189l30K575K287M7O76K751J663j138n07K146J630q90Q3L132K502
514H9309m58K87L558L472R32J676M034K029k389k218J483J999L30K679O780N692J563K767
512A23525P630P631M109N656J0762J0676P254R833J6737J8170J6043K0799K9998L2118K9290
$$ plain form
510 350231 383703 424866 464024 495418 529162 573024 620381 670581 741462 845748 978393 1148535 1399169
509 1399169 1780555 2345442 3190353 4405304 5863355 7090696 7508432 6903471 5621655 4255450 3188546
507 3188546 2460746 1959885 1606892 1365086 1192200 1049990 928690 829462 743010 661743 592678 543637
506 543637 509663 481119 454237 427771 399643 371726 348679 330888 315446 303301 297516 297430 301183 311246 330073
504 330073 355475 385747 423500 468529 517332 574785 652008 741548 808960 824180 792842 747124 717376 722403
502 722403 770861 860052 986818 1170933 1453612 1879689 2516518 3471940 4780775 6194623 7166159 7203913
501 7203913 6296551 4928400 3657292 2731132 2097502 1643250 1318675 1093958 923487 780803 671289
499 671289 594947 532817 476244 436006 415304 399833 380524 363198 351315 339432 327148 320937 319138 311615
$$ packed form
510C50231L3472M1163L9158L1394L3744M3862M7357N0200P0881J04286J32645J70142K50634
509A399169L81386N64887Q44911J214951J458051J227341M17736o04961j281816j366205j066904
507C188546p27800n00861l52993k41806j72886j42210j21300r9228q6452q1267o9065m9041
506E43637l3974k8544k6882k6466k8128k7917k3047j7791j5442j2145n785q6L753J0063J8827
504C30073K5402L0272L7753M5029M8803N7453P7223Q9540O7412J5220l1338m5718k9748N027
502G22403M8458Q9191J26766J84115K82679M26077O36829R55422J308835J413848R71536L7754
501G203913r07362j368151j271108r26160o33630m54252l24575k24717j70471j42684j09514
499F71289p6342o2130n6573m0238k0702j5471j9309j7326j1883j1883j2284o211j799p523
$$ plain form
498 311615 295786 278990 263741 245821 226468 213281 207943 205622 206452 217322 243489 287506 350141 418535 459716
496 459716 445968 387247 323319 282824 265409 261573 270183 290079 312338 329384 341524 348107 342505 322065 293489
494 293489 263482 232500 201347 175458 157417 143157 130101 121134 117380 114566 110206 107514 108202 108876 107659 108083
492 108083 112574 118464 124183 132580 144586 155733 161896 163934 162477 155091 141574 126665 114219 102952 91684
490 91684 82941 78036 74002 68650 64121 61827 59211 54475 49982 47609 45222 41288 38113 37401 36990 35147 33905 34898
488 34898 36152 35744 35623 37392 39333 39728 40387 43052 45938 47506 49576 53880 58792 62846 67672 74963 83325 91057
486 91057 99082 107738 113687 114079 110052 104134 96770 88088 80458 75751 72558 69078 66487 66245 66826 66547 66584 68282 70503
483 70503 72094 74731 80633 89154 99337 112857 131706 154872 179700 204435 226248 239354 239341 227219 207362
$$ packed form
498C11615j5829j6796j5249j7920j9353j3187n338k321Q30J0870K6167M4017O2635O8394M1181
496D59716j3748n8721o3928m0495j7415l836Q610J9896K2259J7046J2140O583n602k0440k8576
494B93489l0007l0982l1153k5889j8041j4260j3056q967l754k814m360k692O88O74j217M24
492A08083M491N890N719Q397J2006J1147O163K038j457p386j3517j4909j2446j1267j1268
490I1684q743m905m034n352m529k294k616m736m493k373k387l934l175p12m11j843j242R93
488C4898J254m08j21J769J941L95O59K665K886J568K070M304M912M054M826P291Q362P732
486I1057Q025Q656N949L92m027n918p364q682p630m707l193l480k591k42N81k79L7J698K221
483G0503J591K637N902Q521J0183J3520J8849K3166K4828K4735K1813J3106j3j2122j9857
$$ plain form
482 207362 183394 158108 135287 117564 103934 92194 82612 76181 71574 67053 63161 61274 60468 59262 58573 59889
480 59889 62653 65504 69257 75473 83504 91621 99507 107107 112256 112649 108904 103038 95614 86414 76896 68924 62238 55551
477 55551 49334 44893 41568 37727 33836 31033 28886 26109 23238 21685 20990 19780 18369 18046 18297 17802 16828 16828 17456 17339
475 17339 16749 16905 17484 17319 16789 17232 18453 19272 19951 21948 25235 28521 32054 36562 41274 44095 44575 43737 41617 37721
473 37721 33120 29722 27642 25563 23572 22785 23008 22830 22301 22516 23475 23917 23945 24831 26549 28094 29740 32818 37547 42907
470 42907 49125 57120 66253 74069 79071 81150 79944 74899 67201 59503 52922 46971 41776 38356 36540 35010 33477
468 33477 33032 33704 34376 34794 35957 38151 40517 42862 46296 51097 56528 62633 70513 80294 90705 100854 111004 120675
466 120675 128685 135033 141382 148501 155792 162839 169887 176202 180168 180980 179442 176034 170162 162181 153684 145581 137478
$$ packed form
482B07362k3968k5286k2821j7723j3630j1740r582o431m607m521l892j887q06j206o89J316
480E9889K764K851L753O216Q031Q117P886P600N149L93l745n866p424r200r518p972o686o687
477E5551o217m441l325l841l891k803k147k777k871j553o95j210j411l23K51m95r74%O28j17
475A7339n90J56N79j65n30M43J221Q19O79J997L287L286L533M508M712K821M80q38k120l896
473C7721m601l398k080k079j991p87K23j78n29K15R59M42K8Q86J718J545J646L078M729N360
470D2907O218P995R133P816N002K079j206n045p698p698o581n951n195l420j816j530j533
468C3477m45O72O72M18J163K194K366K345L434M801N431O105P880R781J0411J0149J0150R671
466A20675Q010O348O349P119P291P047P048O315L966Q12j538l408n872p981q497q103q103
$$ plain form
464 137478 129450 122740 118041 114544 112129 111605 113350 116299 119706 124087 129453 134647 139285 144325 150328 156331 161593
462 161593 165996 168909 168787 165255 159718 153648 147062 140003 133117 126536 119095 110366 101236 92596 84357 76440 69727
460 69727 64440 59440 54339 49984 47037 44606 42082 40188 39301 38702 37760 37220 37573 38011 37892 37858 38552 39246 39464 39682 40575
457 40575 41553 42024 42667 43997 45498 46677 48257 50869 53997 57103 60725 65557 71133 77024 84004 92689 102691 113452
455 113452 125645 139818 155423 171894 189684 209223 229736 250041 269717 288506 305061 318322 328661 336882
453 336882 343326 348152 352462 356672 359908 361203 361066 360102 357820 353737 348565 343476 338388 332909 327601 323135 319185 315364
451 315364 312517 311697 312882 315529 319722 325659 332340 338592 344329 350114 355498 359522 361884 362624 360671 354816 345122 332296
449 332296 316778 298867 279868 261417 243711 226428 209659 193852 178445 162720 146994 132347 118902 106356
$$ packed form
464A37478q028o710m699l497k415n24J745K949L407M381N366N194M638N040O003O003N262
462A61593M403K913j22l532n537o070o586p059o886o581p441q729r130q640q239p917o713
460F9727n287n000n101m355k947k431k524j894q87n99r42n40L53M38j19l4O94O94K18K18Q93
457D0575R78M71O43J330J501J179J580K612L128L106L622M832N576N891O980Q685J0002J0761
455A13452J2193J4173J5605J6471J7790J9539K0513K0305J9676J8789J6555J3261J0339Q221
453C36882O444M826M310M210L236J295j37r64k282m083n172n089n088n479n308m466l950l821
451C15364k847q20J185K647M193N937O681O252N737N785N384M024K362P40j953n855r694j2826
449C32296j5518j7911j8999j8451j7706j7283j6769j5807j5407j5725j5726j4647j3445j2546
$$ plain form
447 106356 95128 85882 78412 72030 66623 62640 59631 56902 54459 52957 52085 51241 50569 50621 51188 51813 52724 54680 57725
445 57725 61408 66064 72081 78614 83657 86236 86566 85350 83388 82171 83067 86082 90559 96468 104398 114218 125371 137956
442 137956 152438 168582 185414 202647 220548 238621 255928 272375 288371 303394 316081 325618 332067 335021
441 335021 333814 328769 321336 312356 302029 290958 280118 269908 260335 251966 246139 243463 243480 245960 250994 258148 266376
439 266376 275234 284855 294991 304777 313818 322459 330585 337300 342469 346423 348945 348596 344408 336381 324974 310853 295070
437 295070 278947 262652 245312 226769 207935 189617 171901 155273 140439 127496 115691 104631 94542 85427
435 85427 76784 68543 61375 55526 50321 45516 41709 38991 36727 34463 32615 31397 30211 28853 27738 27139 26568 25826
433 25826 25445 25580 25571 25162 24820 24766 24575 24098 23814 24045 24388 24731 25486 26986 28787 30588 32969 36324 40155 44273 49159
$$ packed form
447A06356j1228r246p470o382n407l983l009k729k443j502q72q44o72N2N67O25R11J956L045
445E7725L683M656O017O533N043K579L30j216j962j217Q96L015M477N909P930R820J1153J2585
442A37956J4482J6144J6832J7233J7901J8073J7307J6447J5996J5023J2687R537O449K954
441C35021j207n045p433q980j0327j1071j0840j0210r573q369n827k676J7K480N034P154Q228
439B66376Q858R621J0136R786R041Q641Q126O715N169L954K522l49m188q027j1407j4121j5783
437B95070j6123j6295j7340j8543j8834j8318j7716j6628j4834j2943j1805j1060j0089r115
435H5427q643q241p168n849n205m805l807k718k264k264j848j218j186j358j115n99n71p42
433B5826l81J35rm09l42n4j91m77k84K31L43L43P55J500J801J801K381L355L831M118M886
$$ plain form
430 49159 55133 61556 67806 74013 80221 85778 90476 94718 98874 102530 105326 107503 109164 109738 108880 107146 104812 101444
428 101444 96730 91208 85370 79103 72521 66523 61930 58593 56258 55446 56610 59375 63199 68233 74557 81535 88371
426 88371 94990 101408 106988 111108 113778 115044 114399 111433 106732 101029 94556 87424 80214 73491 67036 60496 54163 48374
424 48374 42891 37409 32443 28422 25055 21774 18833 16608 14921 13235 11735 10778 10092 9262 8490 8091 7795 7241 6629
421 6629 6333 6194 5798 5403 5323 5319 5056 4749 4814 4979 4772 4376 4239 4170 3842 3450 3372 3402 3116 2772 2800 2932 2691 2307 2296 2481
418 2481 2408 2130 2052 2164 2075 1949 2138 2410 2309 2038 2082 2327 2313 2131 2150 2304 2143 1841 1797 1939 1823 1575 1641 1891 1882 1639 1654
415 1654 1855 1798 1580 1619 1791 1705 1449 1508 1775 1784 1553 1523 1707 1691 1464 1494 1765 1835 1646 1659 1854 1848 1617 1529 1631 1532 1222 1112
411 1112 1213 1171 947 923 1139 1211 1046 1023 1133 1099 928 957 1151 1087 850 813 995 919 628 595 827 859 636 615 858 958 780
$$ packed form
430D9159N974O423O250O207O208N557M698M242M156L656K796K177J661N74q58j734k334l368
428A01444m714n522n838o267o582n998m593l337k335q12J164K765L824N034O324O978O836
426H8371O619O418N580M120K670J266o45k966m701n703o473p132p210o723o455o540o333n789
424D8374n483n482m966m021l367l281k941k225j687j686j500r57o86q30p72l99k96n54o12
421F629k96j39l96l95q0mk63l07O5J65k07l96j37o9l28l92p8L0k86l44K8J32k41l84j1J85
418B481p3k78p8J12q9j26J89K72j01k71M4K45j4j82J9J54j61l02m4J42j16k48O6K50rk43J5
415A654K01n7k18L9J72q6k56N9K67Rk31l0J84j6k27L0K71P0j89J3J95ok31q8J02r9l10j10
411A112J01m2k24k4K16P2j65k3J10l4j71K9J94o4k37l7J82p6k91l3K32L2k23k1K43J00j78
$$ plain form
408 780 746 983 1078 961 988 1230 1271 1049 912 1023 991 786 781 1070 1216 1104 1078 1328 1435 1291 1290 1501 1626 1493 1503 1728 1810 1581
405 1581 1437 1562 1601 1394 1274 1454 1549 1447 1432 1686 1854 1740 1668 1840 1969 1853 1823 2039 2169 2071 2060 2258 2370 2198 2025 2093
402 2093 2161 2053 1987 2084 2095 1899 1846 2033 2133 1926 1804 1958 2070 1915 1847 2023 2157 2048 1939 2065 2048 1722 1395 1389 1382 1177 972
398 972 1040 1107 889 672 755 838 702 566 673 781 619 457 553 649 498 348 407 552 481 409 544 678 537 395 512 628 492
395 492 355 485 701 668 635 803 971 893 729 765 888 860 832 1062 1292 1274 1170 1319 1553 1530 1421 1517 1700 1715 1730 2003 2276
392 2276 2317 2271 2420 2656 2638 2535 2638 2826 2821 2817 3009 3201 3170 2996 2988 2981 2807 2633 2602 2571 2395 2218 2357 2496 2400 2304 2412 2607 2567
388 2567 2442 2517 2678 2624 2485 2599 2800 2742 2542 2513 2570 2413 2112 1986 1947 1667 1300 1214 1270 1133 853 776 844 702 474 439 606
385 606 593 436 373 453 402 264 326 475 420 221 244 468 510 409 455 644 698 607 693 864 849 691 730 911 922 790 823 1056 1136
$$ packed form
408G80l4K37R5j17K7K42M1k22j37J11l2k05nK89J46j12k6K50J07j44jK11J25j33J0K25Q2k29
405A581j44J25L9k07j20J80R5j02j5K54J68j14p2J72J29j16l0K16J30r8j1J98J12j72j73O8
402B093O8j08o6R7J1j96n3J87J00k07j22J54J12j55o8J76J34j09j09J26j7l26l27opk05k05
398I72O8O7k18k17Q3Q3j36j36J07J08j62j62R6R6j51j50N9J45p1p2J35J34j41j42J17J16j36
395D92j37J30K16l3l3J68J68p8j64L6J23k8k8K30K30j8j04J49K34k3j09R6J83J5J5K73K73
392B276M1m6J49K36j8j03J03J88nmJ92J92l1j74qpj74j74l1l1j76j77J39J39r6r6J08J95m0
388B567j25P5J61n4j39J14K01n8k00k9N7j57l01j26l9k80l67q6N6j37k80p7O8j42k28l5J67
385F06j3j57o3Q0n1j38O2J49n5j99K3K24M2j01M6J89N4r1Q6J71j5j58L9J81J1j32L3K33Q0
$$ plain form
381 1136 1016 1007 1084 992 756 743 930 929 785 834 1141 1266 1191 1263 1535 1738 1741 1819 2040 2074 1907 1881 2054 2064 1874 1823 1972 2016 1802
378 1802 1732 1919 1978 1837 1735 1776 1766 1612 1626 1841 1950 1916 2018 2377 2638 2699 2824 3035 3079 2865 2733 2859 2948 2894 2898 3102 3202
374 3202 3101 3040 3180 3232 3027 2804 2724 2551 2234 2024 2015 1964 1711 1545 1579 1597 1415 1319 1424 1491 1357 1224 1291 1277 1063 934 1007 1020
371 1020 832 731 830 922 814 755 955 1097 982 866 1008 1165 1064 998 1133 1240 1146 1055 1165 1307 1305 1310 1458 1621 1698 1885 2330
368 2330 2887 3402 3981 4603 4904 4604 4075 3689 3459 3186 2986 3044 3100 2899 2623 2490 2299 1908 1668 1799 1954 1794 1512 1431
365 1431 1437 1300 1134 1168 1314 1316 1201 1285 1391 1297 1170 1301 1522 1543 1456 1513 1634 1555 1461 1510 1572 1434 1217 1257 1406 1354 1166 1179 1308
361 1308 1293 1168 1243 1424 1519 1539 1702 1905 1908 1739 1713 1760 1607 1311 1215 1272 1186 1018 993 1020 905 714 724 888 910 788 810 914 818
358 818 582 547 694 756 624 578 691 717 654 677 802 784 658 617 678 697 684 757 871 785 648 712 880 847 706 709 833 813 650 631
$$ packed form
381A136j20rP7r2k36j3J87jj44M9L07J25p5P2K72K03LP8K21L4j67k6J73J0j90n1J49M4k14
378A802p0J87N9j41j02M1j0j54J4K15J09l4J02L59K61O1J25K11M4k14j32J26Q9n4MK04J00
374C202j01o1J40N2k05k23q0j73l17k10rn1k53j66L4J8j82r6J05O7j34j33O7j4k14j29P3J3
371A020j88j01R9R2j08n9K00J42j15j16J42J57j01o6J35J07r4r1J10J42kNJ48J63P7J87M45
368B330N57N15N79O22L01l00n29l86k30k73k00N8N6k01k76j33j91l91k40J31J55j60k82q1
365A431Oj37j66L4J46Kj15Q4J06r4j27J31K21K1q7N7J21p9r4M9O2j38k17M0J49n2j88J3J29
361A308j5j25P5J81R5K0J63K03Lj69k6M7j53k96r6N7q6j68k5K7j15j91J0J64K2j22K2J04r6
358H18k36l5J47O2j32m6J13K6o3K3J25j8j26m1O1J9j3P3J14q6j37O4J68l3j41LJ24k0j63j9
$$ plain form
354 631 745 717 581 532 621 625 508 533 695 713 535 499 651 717 610 546 636 640 555 556 671 700 586 557 618 593 521 536 615 552 350 292
350 292 362 432 425 419 514 609 504 484 610 593 486 523 724 782 624 551 623 696 630 650 814 834 683 532 565 598 546 493 620 746 672
346 672 598 649 699 663 627 685 742 599 456 502 548 445 342 383 337 168 142 306 385 319 254 352 450 290 130 175 220 121 22 131 240
342 240 206 172 213 255 95 -63 10 83 -43 -170 -44 80 62 44 102 159 16 -126 -44 37 -23 -85 36 157 21 -114 -5 103
339 103 12 -78 16 111 6 -99 -25 48 37 25 65 105 60 14 -31 -76 -122 -167 -115 -62 -209 -357 -307 -256 -349 -442 -302 -163 -223 -284 -202 -119
335 -119 -180 -241 -195 -149 -189 -230 -178 -127 -233 -339 -235 -131 -239 -347 -283 -175 -225 -360 -327 -208 -271 -376 -290 -117 -95 -217 -252 -201 -223
332 -223 -289 -240 -149 -160 -214 -158 -101 -176 -251 -212 -174 -263 -396 -390 -299 -334 -413 -353 -294 -417 -541 -481 -334 -369 -489 -449 -324 -381 -524 -539 -412 -391
328 -391 -456 -401 -304 -393 -568 -486 -260 -242 -424 -496 -425 -393 -447 -434 -335 -364 -480 -483 -399 -387 -461 -424 -301 -300 -442 -456 -327 -302 -421 -486 -466 -452
$$ packed form
354F31J14k8j36m9Q9Mj17K5J62J8j78l6J52O6j07o4R0Mq5JJ15K9j14k9O1k5p2J5P9o3k02n8
350B92P0P0poR5R5j05k0J26j7j07L7K01N8j58p3P2P3o6K0J64K0j51j51L3L3n2n3J27J26p4
346F72p4N1N0l6l6N8N7j43j43M6M6j03j03M1m6j69k6J64P9o6o5R8R8j60j60M5M5r9r9J09J09
342B40l4l4M1M2j60j58P3P3j26j27J26J24j8j8N8N7j43j42Q2Q1o0o2J21J21j36j35J09J08
339A03r1r0R4R5j05j05P4P3j1j2M0M0m5m6m5m5m6m5N2N3j47j48N0N1r3r3J40J39o0o1Q2Q3
335a19o1o1M6M6m0m1N2N1j06j06J04J04j08j08O4J08n0j35L3J19o3j05Q6J73K2j22l5N1k2
332b23o6M9R1j1n4N6N7p5p5L9L8q9j33OR1l5p9O0N9j23j24O0J47l5j20M0J25n7j43j5J27K1
328c91o5N5R7q9j75Q2K26J8j82p2P1L2n4J3R9k9j16lQ4J2p4L7J23Jj42j4J29K5j19o5K0J4
$$ plain form
324 -452 -523 -509 -451 -468 -527 -467 -364 -391 -504 -479 -367 -355 -430 -425 -335 -345 -441 -464 -401 -435 -555 -556 -415 -402 -475 -451 -284 -271 -401 -460 -375 -362 -492
320 -492 -541 -447 -424 -545 -604 -521 -438 -497 -531 -422 -317 -354 -416 -392 -439 -528 -518 -422 -395 -453 -435 -331 -327 -409 -409 -323 -302 -424 -455 -342 -355 -511 -588
316 -588 -466 -418 -513 -540 -423 -350 -419 -526 -490 -485 -567 -615 -519 -423 -471 -477 -397 -385 -516 -570 -480 -390 -444 -492 -397 -302 -351 -458 -421 -384 -491 -559 -483
312 -483 -401 -404 -438 -387 -404 -506 -580 -510 -429 -435 -431 -342 -345 -492 -564 -494 -462 -574 -660 -546 -395 -388 -461 -447 -462 -519 -514 -422 -418 -557 -584 -411 -274 -394
308 -394 -538 -481 -392 -446 -528 -467 -362 -401 -522 -499 -440 -468 -517 -481 -445 -494 -529 -477 -458 -582 -730 -677 -557 -579 -672 -622 -508 -480 -484 -403 -290 -319
304 -319 -436 -466 -425 -470 -555 -496 -366 -378 -449 -435 -387 -483 -600 -573 -479 -470 -506 -399 -288 -321 -425 -387 -280 -316 -431 -461 -393 -412 -478 -459 -436 -498
300 -498 -623 -604 -518 -517 -587 -571 -512 -539 -560 -495 -397 -443 -530 -531 -457 -526 -647 -625 -481 -423 -443 -377 -275 -317 -433 -406 -343 -365 -483 -514 -499 -570 -667
296 -667 -622 -450 -421 -513 -562 -515 -553 -643 -590 -443 -381 -426 -428 -334 -284 -268 -252 -274 -440 -630 -621 -470 -404 -423 -442 -452 -548 -634 -577 -448 -462 -558 -569
$$ packed form
324d52p1J4N8j7n9O0J03k7j13K5J12J2p5NR0j0r6k3O3l4j20jJ41J3p3K4J67J3j30n9Q5J3j30
320d92m9R4K3j21n9Q3Q3n9l4J09J05l7o2K4m7q9J0R6K7n8J8J04Mq2%Q6K1j22l1J13j3j56p7
316e88J22M8r5k7J17P3o9j07L6Nq2m8R6R6m8oQ0J2j31n4R0R0n4m8R5R5m9j07L7L7j07o8P6
312d83Q2ll4N1j7j02p4P0Q1oMQ9lj47p2P0L2j12q6J14J51Pp3J4j5n7NR2Mj39k7J73J37j20
308c94j44N7Q9n4q2O1J05l9j21K3N9k8m9L6L6m9l5N2J9j24j48N3J20k2r3N0J14K8mQ1J13k9
304c19j17l0M1m5q5N9J30j2p1J4M8r6j17K7R4Rl6J07J11l3j04L8J07l6j15l0O8j9o6J9K3o2
300d98j25J9Q6Jp0J6N9k7k1O5R8m6q7jP4o9j21K2J44N8k0O6J02m2j16K7O3k2j18l1J5p1r7
296f67M5J72K9r2m9M7l8r0N3J47O2m5kR4N0J6J6k2j66j90RJ51O6j9j9j0r6q6N7J29j4r6j1
$$ plain form
292 -569 -483 -483 -564 -560 -455 -437 -484 -446 -329 -355 -528 -558 -406 -397 -586 -690 -608 -525 -547 -568 -432 -297 -340 -383 -354 -326 -380 -435 -416 -441 -484 -441 -271
288 -271 -188 -229 -270 -260 -335 -497 -516 -387 -343 -428 -512 -468 -424 -455 -400 -297 -280 -413 -460 -376 -335 -436 -494 -421 -348 -371 -394 -345 -338 -430 -435 -366 -383 -492
283 -492 -516 -358 -287 -416 -545 -545 -545 -618 -604 -461 -405 -514 -624 -525 -425 -489 -552 -459 -323 -347 -458 -471 -485 -528 -529 -406 -368 -511 -653 -634 -530
280 -530 -571 -613 -548 -484 -465 -445 -335 -310 -431 -552 -521 -490 -579 -667 -541 -416 -437 -458 -407 -357 -397 -437 -319 -202 -221 -240 -259 -278 -379 -480 -394
276 -394 -308 -440 -572 -518 -421 -485 -634 -600 -481 -459 -523 -463 -360 -397 -521 -541 -475 -550 -625 -563 -414 -433 -539 -544 -463 -466 -554 -574 -452 -395 -424 -468
272 -468 -512 -576 -641 -605 -569 -598 -626 -583 -540 -606 -671 -580 -445 -490 -621 -658 -551 -518 -571 -566 -562 -629 -696 -631 -479 -402 -411 -367 -322 -394 -467 -468 -469 -576 -684
268 -684 -663 -498 -424 -435 -431 -428 -485 -543 -473 -359 -394 -514 -508 -416 -428 -526 -552 -493 -496 -585 -574 -477 -492 -593 -569 -459 -430 -545 -588 -487 -441 -481 -491 -458
263 -458 -511 -607 -577 -460 -489 -662 -705 -605 -567 -614 -614 -529 -529 -615 -607 -457 -386 -458 -527 -453 -409 -451 -421 -305 -269 -375 -410 -359 -344 -472 -568 -578 -601
$$ packed form
292e69Q6%q1MJ05J8m7L8J17k6j73l0J52Rj89j04Q2Q3k2k1J36J35m3m3K9K8n4n5J9k5m3M3J70
288b71Q3m1m1J0p5j62j9J29M4q5q4M4M4l1N5J03J7j33m7Q4M1j01n8P3P3k3k3M9Pr2nO9j7j09
283d92k4J58P1j29j29%%p3J4J43N6j09j10R9J00o4o3R3J36k4j11j3j4m3jJ23L8j43j42J9J04
280e30m1m2O5O4J9K0J10K5j21j21L1L1q9q8J26J25k1k1N1N0m0m0J18J17j9j9j9j9j01j01Q6
276c94Q6j32j32N4R7o4j49L4J19K2o4O0J03l7j24k0O6p5p5O2J49j9j06nQ1lq8k0J22N7k9m4
272d68m4o4o5L6L6k9k8M3M3o6o5R1J35m5j31l7J07L3n3NMo7o7O5J52P7rM4M5p2p3jjj07j08
268f84K1J65P4j1MLn7n8P0J14l5j20OR2j2r8k6N9lq9J1R7j5j01K4J10K9j15m3J01M6m0j0L3
263d58n3r6L0J17k9j73m3J00L8m7%Q5%q6QJ50P1p2o9P4M4m2L0J16L6j06l5N1J5j28r6j0k3
$$ plain form
259 -601 -710 -779 -705 -632 -646 -632 -574 -557 -626 -605 -440 -392 -486 -581 -533 -462 -534 -570 -521 -455 -475 -499 -437 -430 -566 -606 -503 -379 -398 -425 -366 -319 -358
255 -358 -401 -357 -318 -422 -494 -480 -451 -509 -566 -538 -473 -493 -517 -455 -383 -454 -528 -459 -417 -518 -615 -570 -502 -520 -537 -469 -380 -434 -534 -491 -415 -482 -585
251 -585 -602 -540 -564 -628 -606 -584 -605 -554 -417 -354 -435 -519 -460 -369 -422 -475 -385 -315 -389 -431 -387 -342 -440 -541 -500 -399 -442 -547 -566 -538 -553 -593 -546
247 -546 -498 -537 -575 -527 -464 -487 -514 -455 -416 -520 -588 -455 -327 -341 -445 -463 -452 -527 -635 -599 -497 -482 -541 -458 -285 -256 -347 -395 -350 -306 -331 -313
243 -313 -278 -329 -423 -432 -422 -455 -510 -479 -464 -493 -506 -433 -311 -332 -421 -424 -364 -390 -416 -356 -266 -262 -330 -312 -256 -285 -386 -401 -316 -317 -413 -423 -325 -228 -283 -338
239 -338 -367 -396 -425 -454 -436 -418 -442 -467 -465 -463 -514 -480 -382 -370 -353 -336 -301 -352 -412 -385 -306 -370 -525 -594 -583 -573 -603 -491 -343 -338 -455 -486 -408 -416 -547
235 -547 -592 -513 -435 -428 -421 -293 -252 -320 -389 -336 -284 -280 -276 -221 -252 -335 -418 -416 -415 -468 -434 -353 -358 -487 -529 -484 -438 -487 -537 -490 -444 -526 -609 -587 -565 -548 -531 -430
230 -430 -414 -479 -544 -488 -432 -425 -418 -310 -289 -377 -464 -389 -314 -339 -364 -290 -216 -351 -487 -516 -459 -456 -453 -401 -434 -516 -513 -407 -387 -471 -555 -501 -446 -463 -480 -474
$$ packed form
259f01j09o9P4P3j4J4N8J7o9K1J65M8r4r5M8P1p2l6M9O6k0k4O2Pj36m0J03J24j9k7N9M7l9
255c58m3M4L9j04p2J4K9n8n7K8O5k0k4O2P2p1p4O9M2j01r7M5O8j8j7O8Q9n4j00M3P6o7j03
251e85j7O2k4o4K2K2k1N1J37O3q1q4N9R1n3n3R0P0p4m2M4M5r8j01M1J01m3j05j9K8j5m0M7
247e46M8l9l8M8O3k3k7N9L9j04o8J33J28j4j04j8J1p5j08L6J02J5n9Q3J73K9r1m8M5M4k5J8
243c13L5n1r4rJ0l3n5L1J5k9j3P3J22k1q9lO0k6k6O0R0Mo8J8N6k9j01j5Q5jr6j0R8R7n5n5
239c38k9k9k9k9J8J8k4k5KKn1L4R8J2J7J7L5n1o0K7P9o4j55o9J1J0l0J12J48Nj17l1P8qj31
235e47m5P9P8PPJ28M1o8o9N3N2MMN5l1q3q3KJn3L4Q1nj29m2M5M6m9n0M7M6q2q3K2K2J7J7J01
230d30J6o5o5N6N6PPJ08K1q8q7P5P5k5k5P4P4j35j36k9N7LLN2l3q2LJ06K0q4q4N4N5j7j7O
$$ plain form
226 -474 -467 -461 -455 -351 -247 -272 -297 -242 -188 -291 -395 -411 -428 -492 -471 -342 -212 -235 -258 -274 -290 -378 -466 -427 -387 -419 -452 -383 -315 -405 -494 -410 -326 -343
222 -343 -359 -291 -224 -285 -346 -350 -354 -400 -447 -440 -433 -469 -505 -459 -413 -438 -463 -421 -378 -435 -493 -426 -359 -420 -482 -434 -385 -441 -582 -638 -608 -632 -656 -551 -447 -423
217 -423 -486 -486 -487 -530 -574 -535 -410 -376 -343 -265 -188 -162 -222 -289 -355 -427 -499 -466 -433 -471 -509 -495 -480 -509 -537 -411 -284 -295 -392 -406 -420 -440 -459 -411 -363
213 -363 -416 -469 -470 -472 -516 -561 -495 -429 -434 -440 -410 -380 -450 -520 -507 -494 -548 -602 -540 -392 -396 -487 -498 -423 -354 -371 -350 -329 -313 -298 -292 -287 -382 -477 -386 -296 -335 -373
208 -373 -333 -293 -325 -356 -320 -283 -376 -468 -443 -417 -463 -509 -474 -440 -477 -514 -481 -448 -458 -468 -452 -436 -492 -633 -666 -556 -478 -487 -504 -435 -371 -393 -380 -367 -425
204 -425 -484 -449 -329 -276 -367 -404 -440 -486 -532 -438 -343 -348 -354 -283 -211 -240 -269 -297 -325 -353 -381 -337 -293 -292 -291 -309 -327 -359 -477 -500 -380 -303 -370 -412 -369 -335
200 -335 -387 -403 -420 -441 -463 -411 -359 -350 -341 -274 -207 -211 -216 -272 -329 -385 -442 -416 -390 -364 -338 -294 -250 -307 -363 -339 -315 -334 -439 -478 -374 -310 -389 -435 -338 -277
195 -277 -302 -355 -323 -330 -423 -487 -408 -329 -393 -443 -407 -339 -414 -491 -425 -320 -358 -454 -464 -455 -445 -443 -354 -304 -339 -406 -388 -369 -437 -489 -455 -421 -473 -472 -384 -297 -295
$$ packed form
226d74POOJ04J04k5k5N5N4j03j04j6j7o4K1J29J30k3k3j6j6q8q8L9M0l2l3O9O8r0q9Q4Q4j7
222c43j6O8O7o1o1mmm6m7PPl6l6M6M6k5k5M2M3n7n8O7O7o1o2M8M9n6j41n6L0k4k4J05J04K4
217d23o3%jm3m4L9J25L4L3P8P7K6o0o7o6p2p2L3L3l8l8J4J5k9k8J26J27j1r7j4j4k0j9M8M8
213c63n3n3jkm4m5O6O6noL0L0p0p0J3J3n4n4O2J48mr1j1P5O9j7K1K1J6J5ONr5r5R1R0l9l8
208c73M0M0l2l1L6L7r3r2K5K6m6m6L5L4l7l7L3L3j0j0J6J6n6j41l3J10P8rj7O9O4k2J3J3n8
204d25n9L5J20N3r1l7l6m6m6R4R5noP1P2k9k9k8k8k8k8M4M4JJj8j8l2j18k3J20P7o7m2M3L4
200c35n2j6j7k1k2N2N2RRO7O7mnn6n7n6n7K6K6K6K6M4M4n7n6K4K4j9j05l9J04O4p9m6R7O1
195b77k5n3L2pr3o4P9P9o4n0L6O8p5p7O6J05l8r6j0RJ0KQ9N0l5o7J8J9o8n2L4L4n2JQ8Q7K
$$ plain form
191 -295 -311 -241 -176 -198 -235 -272 -272 -272 -240 -208 -219 -316 -399 -339 -317 -440 -539 -495 -384 -415 -494 -487 -412 -423 -483 -457 -428 -484 -573 -518 -372 -312 -300 -287 -226
186 -226 -251 -350 -363 -382 -401 -456 -425 -352 -364 -396 -428 -412 -481 -524 -481 -438 -480 -552 -537 -476 -415 -405 -395 -371 -433 -530 -485 -371 -343 -392 -355 -280 -291 -402
182 -402 -513 -471 -429 -422 -414 -352 -377 -453 -442 -414 -386 -381 -376 -299 -222 -235 -248 -299 -349 -437 -439 -418 -397 -349 -301 -235 -313 -457 -458 -371 -371 -443 -516 -491 -466 -466 -422 -309
178 -309 -282 -307 -290 -248 -293 -399 -420 -395 -414 -470 -483 -451 -461 -494 -440 -289 -224 -247 -269 -268 -309 -412 -429 -398 -411 -498 -543 -486 -428 -429 -430 -378 -411 -492 -488 -434
173 -434 -381 -399 -374 -319 -351 -467 -498 -426 -397 -465 -490 -415 -383 -416 -406 -328 -337 -468 -556 -513 -470 -467 -420 -307 -279 -381 -482 -460 -439 -491 -543 -467 -391 -392
169 -392 -394 -396 -398 -442 -486 -487 -488 -553 -618 -583 -548 -550 -552 -454 -357 -408 -460 -440 -420 -453 -485 -389 -293 -278 -263 -247 -232 -328 -424 -391 -357 -383 -409 -433 -456 -457 -415 -343 -357
164 -357 -505 -567 -496 -426 -463 -499 -465 -430 -419 -408 -397 -386 -472 -559 -516 -474 -481 -488 -452 -416 -463 -510 -457 -404 -399 -394 -337 -367 -494 -577 -506 -436 -498 -603 -579 -470
160 -470 -411 -438 -412 -385 -402 -419 -365 -311 -315 -319 -279 -240 -322 -403 -384 -364 -406 -448 -390 -331 -401 -471 -438 -318 -310 -387 -435 -440 -492 -544 -519 -407 -360 -398 -425 -452
$$ packed form
191b95j6P0O5k2l7l7%%L2L2j1r7q3O0K2j23r9M4J11l1p9PP5j1o0K6K9n6q9N5J46O0J2J3O1
186b26k5r9j3j9j9n5L1P3j2l2l2J6o9m3M3M3m2p2J5O1O1J0J0K4o2r7M5J14K8m9L7P5j1j11
182d02j11M2M2PQO2k5p6J1K8K8NNP7P7j3j3n1n0q8kK1K1M8M8O6p8j44jQ7%p2p3K5K5%M4J13
178c09K7k5J7M2m5j06k1K5j9n6j3L2j0l3N4J51O5k3k2Jm1j03j7L1j3q7m5N7N8jjN2l3q1MN4
173d34N3j8K5N5l2j16l1P2K9o8k5P5L2l3J0P8rj31q8M3M3LM7J13K8j02j01K2K1n2n2P6P6j
169c92kkkm4m4jjo5o5L5L5kkR8R7n1n2K0K0l3l2R6R6J5J5J6J5r6r6L3L4k6k6k4k3jM2P2j4
164c57j48o2P1P0l7l6L4L5J1J1J1J1q6q7M3M2ppL6L6m7m7N3N3NNN7l0j27q3P1P0o2j05K4J09
160d70N9k7K6K7j7j7N4N4mmM0L9q2q1J9K0m2m2N8N9p0p0L3J20Qp7m8nn2n2K5J12M7l8k7k7
$$ plain form
155 -452 -499 -545 -440 -334 -395 -542 -537 -445 -475 -590 -637 -541 -448 -442 -408 -330 -308 -372 -395 -333 -318 -389 -430 -428 -468 -507 -473 -438 -417 -395 -331 -267 -281 -295 -243
151 -243 -190 -258 -412 -442 -386 -386 -471 -482 -407 -377 -391 -333 -232 -219 -292 -340 -346 -367 -432 -428 -380 -392 -490 -519 -461 -425 -474 -480 -401 -383 -452 -518 -498 -439 -424 -384
147 -384 -344 -357 -456 -489 -436 -376 -403 -419 -434 -479 -525 -469 -328 -269 -352 -403 -369 -362 -441 -448 -369 -293 -303 -331 -359 -422 -486 -506 -527 -570 -614 -611 -522 -467 -498 -489 -395
142 -395 -295 -338 -396 -453 -487 -521 -484 -360 -268 -320 -383 -359 -370 -467 -521 -489 -419 -435 -469 -504 -525 -546 -549 -466 -404 -428 -452 -390 -281 -259 -282 -306 -385 -463
138 -463 -524 -498 -424 -435 -435 -435 -417 -399 -380 -362 -400 -438 -429 -334 -291 -333 -376 -332 -302 -358 -360 -362 -384 -407 -429 -452 -466 -480 -451 -422 -415 -408 -339 -270 -255 -384 -475 -423
133 -423 -336 -336 -332 -242 -213 -269 -326 -297 -276 -340 -405 -384 -386 -474 -551 -485 -368 -337 -402 -382 -334 -372 -451 -443 -417 -434 -472 -424 -375 -369 -387 -319 -234 -235 -310 -341 -346 -393
129 -393 -468 -456 -423 -476 -526 -491 -450 -453 -452 -409 -384 -401 -419 -393 -375 -400 -427 -411 -403 -482 -557 -547 -454 -362 -337 -269 -195 -208 -295 -295 -224 -239 -300 -362 -387 -413 -425
124 -425 -394 -340 -372 -404 -349 -234 -162 -167 -171 -127 -170 -294 -417 -419 -420 -422 -424 -411 -399 -441 -396 -352 -393 -475 -471 -409 -391 -415 -438 -418 -398 -388 -293 -205 -204 -250 -253 -230
$$ packed form
155d52m7m6J05J06o1j47NR2l0j15m7R6R3OL4P8K2o4k3O2J5p1m1Km0l9L4L5K1K2O4O4j4j4N2
151b43N3o8j54l0N6%q5j1P5L0j4N8J01J3p3m8ok1o5MM8j2r8k9N8L6m9oP9J8o9o6K0N9J5M0
147c84M0j3r9l3N3O0k7j6j5m5m6N6J41N9q3n1L4Pp9pP9P6j0k8k8o3o4k0k1m3m4LQ9N5l1RR4
142c95J00m3n8n7l4l4L7J24R2n2o3K4j1r7n4L2P0j6l4l5k1k1lQ3O2k4k4O2J09K2k3k4p9p8
138d63o1K6P4j1%%J8J8J9J8l8l8RR5M3m2m3M4L0n6kkk2k3k2k3j4j4K9K9PPO9O9J5j29r1N2
133d23Q7%MR0K9n6n7K9K1o4o5K1kq8p7O6J17L1o5K0M8l8p9QK6j7l8M8M9Oj8O8Q5jp5l1nm7
129c93p5J2L3n3n0L5M1lJM3K5j7j8K6J8k5k7J6Qp9p5J0R3R2K5O8P4j3q7%P1j5o1o2k5k6j2
124d25L1N4l2l2N5J15P2nmM4m3j24j23kjkkJ3J2m2M5M4m1q2MO2J8k4k3K0K0J0R5Q8Jm6lK3
$$ plain form
120 -230 -293 -431 -426 -317 -252 -282 -313 -305 -297 -331 -366 -338 -309 -381 -452 -459 -466 -474 -481 -454 -427 -403 -379 -348 -359 -398 -351 -280 -253 -267 -282 -266 -251 -335 -419 -446 -472 -481
115 -481 -403 -316 -315 -360 -405 -359 -313 -273 -232 -200 -253 -378 -417 -365 -314 -357 -400 -401 -403 -477 -550 -517 -484 -414 -343 -290 -323 -405 -401 -333 -351 -416 -481 -445 -410 -417 -425 -396
110 -396 -367 -409 -452 -395 -339 -355 -371 -372 -373 -446 -518 -479 -440 -455 -383 -218 -139 -301 -463 -483 -417 -394 -457 -467 -477 -530 -583 -635 -600 -519 -438 -335 -318 -325 -331
106 -331 -238 -145 -162 -264 -316 -368 -425 -483 -500 -517 -468 -418 -341 -350 -411 -472 -435 -399 -405 -411 -382 -354 -325 -296 -271 -247 -265 -284 -242 -200 -287 -374 -350 -326 -403 -479
102 -479 -402 -326 -321 -315 -296 -277 -329 -381 -355 -329 -398 -467 -474 -395 -364 -333 -325 -317 -352 -387 -351 -315 -351 -387 -377 -368 -430 -492 -429 -366 -346 -325 -341 -357 -415 -474 -518 -562
97 -562 -535 -508 -433 -359 -385 -411 -363 -316 -340 -364 -337 -309 -325 -341 -348 -354 -461 -568 -490 -412 -434 -456 -440 -425 -366 -308 -287 -267 -347 -427 -364 -301 -281 -261 -252 -243 -355
92 -355 -466 -511 -413 -347 -367 -414 -460 -512 -564 -531 -497 -507 -517 -490 -462 -435 -408 -314 -219 -254 -288 -298 -308 -361 -413 -391 -369 -384 -399 -376 -267 -198 -272 -330 -387
88 -387 -382 -377 -333 -288 -344 -400 -373 -346 -363 -379 -348 -316 -328 -340 -402 -463 -453 -444 -372 -301 -329 -358 -331 -305 -349 -480 -514 -404 -257 -253 -297 -340 -293 -245 -226 -206
$$ packed form
120b30o3j38NJ09O5l0l1QQl4l5K8K9p2p1ppqpK7K7K4K4L1j1l9M7P1K7j4j5J6J5q4q4k7k6r
115d81P8Q7Jm5m5M6M6M0M1L2n3j25l9N2N1m3m3jkp4p3L3L3P0P1N3l3q2MO8j8o5o5L6L5pqK9
110c96K9m2m3N7N6j6j6jjp3p2L9L9j5P2J65P9j62j62k0O6K3o3j0j0n3n3n2L5Q1Q1J03J7po
106c31R3R3j7j02n2n2n7n8j7j7M9N0P7ro1o1L7L6ooK9K8K9K9K5K4j8j9M2M2q7q7K4K4p7p6
102d79P7P6NOJ9J9n2n2K6K6o9o9pP9L1L1QQl5l5L6L6l6l6J0Ro2o2O3O3K0K1j6j6n8n9m4m4
97e62K7K7P5P4k6k6M8M7k4k4K7K8j6j6poj07j07P8P8k2k2J6J5N9N8K1K0q0q0O3O3K0K0RRj12
92c55j11m5R8O6k0m7m6n2n2L3L4j0j0K7K8K7K7R4R5l5l4j0j0n3n2K2K2j5j5K3J09O9p4n8n7
88c87NNM4M5n6n6K7K7j7j6L1L2j2j2o2o1J0RP2P1k8k9K7K6m4j31l4J10J47Mm4m3M7M8J9K0
$$ plain form
84 -206 -325 -443 -458 -387 -353 -406 -424 -356 -317 -322 -324 -326 -387 -491 -560 -542 -466 -433 -402 -371 -386 -401 -389 -376 -407 -438 -406 -375 -400 -469 -437 -320 -254 -331 -376
79 -376 -336 -326 -359 -377 -352 -324 -339 -355 -286 -214 -228 -300 -286 -298 -354 -353 -309 -268 -270 -279 -287 -299 -310 -310 -311 -368 -468 -472 -390 -348 -392 -429 -379 -329 -365 -420 -389 -358 -413
75 -413 -489 -479 -409 -383 -380 -335 -265 -281 -293 -262 -234 -248 -273 -255 -214 -258 -321 -342 -339 -421 -487 -467 -388 -352 -345 -296 -262 -315 -425 -450 -443 -435 -441 -447 -453 -459 -454 -449 -443 -438 -422 -407
70 -407 -388 -370 -367 -322 -249 -263 -322 -337 -296 -255 -242 -228 -271 -357 -383 -324 -305 -372 -396 -335 -273 -298 -357 -331 -304 -363 -395 -341 -287 -319 -362 -319 -278 -323 -357 -348 -314
65 -314 -367 -431 -409 -328 -291 -274 -214 -171 -214 -314 -329 -285 -284 -319 -312 -278 -329 -416 -417 -417 -504 -589 -588 -473 -402 -405 -409 -369 -330 -376 -379 -353 -413 -536 -573 -488 -359 -290
60 -290 -220 -183 -231 -301 -328 -275 -264 -331 -398 -382 -365 -381 -397 -327 -257 -291 -325 -273 -221 -234 -247 -303 -360 -411 -461 -510 -558 -520 -439 -415 -477 -559 -556 -439 -364 -357
56 -357 -350 -346 -342 -356 -370 -355 -383 -420 -371 -279 -273 -349 -382 -331 -324 -415 -464 -395 -327 -324 -320 -317 -313 -306 -299 -292 -285 -347 -410 -386 -363 -382 -401 -421 -440 -442 -443 -359 -275 -359 -443 -384 -325
51 -325 -282 -239 -196 -153 -252 -351 -408 -464 -465 -465 -380 -294 -278 -261 -244 -228 -325 -422 -375 -329 -338 -348 -357 -366 -355 -344 -333 -323 -345 -367 -346 -325 -378 -431 -340 -250 -313 -375
$$ packed form
84b06j19j18j5P1L4n3j8O8L9nkko1j04o9J8P6L3L1L1j5j5J2J3l1l1L2L1k5o9L2J17O6p7m5
79c76M0J0l3j8K5K8j5j6O9P2j4p2J4j2n6JM4M1krqj2j1%jn7j00mQ2M2m4l7N0N0l6n5L1L1n5
75d13p6J0P0K6LM5P0j6j2L1K8j4k5J8M1m4o3k1Lq2o6K0P9L6PM9L4n3j10k5PQooooNNONJ6J5
70d07J9J8LM5P3j4n9j5M1M1J3J4m3q6k6N9J9o7k4O1O2k5n9K6K7n9l2N4N4l2m3M3M1m5l4RL4
65c14n3o4K2Q1L7J7O0M3m3j00j5M4Jl5PL4n1q7j%q7q5JJ15P1lmM0L9m6lK6o0j23l7Q5J29O9
60b90P0L7m8p0k7N3J1o7o7J6J7j6j6P0P0l4l4N2N2j3j3n6n7n1n0m9m8L8Q1K4o2q2LJ17P5P
56c57PMMj4j4J5k8l7M9R2Op6l3N1Pr1m9O9O8LMLMPPPPo2o3K4K3j9j9k0j9kjQ4Q4q4q4N9N9
51c25M3M3M3M3r9r9n7n6j%Q5Q6J6J7J7J6r7r7M7M6rj0rrJ1J1J1J0k2k2K1K1n3n3R1R0o3o2
$$ plain form
46 -375 -352 -329 -404 -480 -355 -230 -172 -114 -99 -85 -144 -204 -177 -151 -156 -161 -80 0 35 70 105 140 259 378 640 903 1192 1482 1840 2198 2360
42 2360 2236 1898 1473 1012 637 418 285 124 -37 -106 -176 -225 -274 -281 -287 -328 -369 -325 -280 -293 -307 -320 -334 -339 -345 -264 -184 -196 -209 -265 -321 -351 -381
38 -381 -325 -269 -322 -375 -342 -310 -352 -395 -351 -308 -374 -441 -422 -403 -416 -429 -356 -283 -309 -334 -274 -214 -271 -329 -344 -359 -361 -363 -322 -281 -341 -400 -374 -347 -409 -470 -442
34 -442 -329 -284 -325 -275 -224 -219 -300 -301 -216 -135 -140 -177 -214 -310 -407 -366 -324 -337 -435 -496 -470 -461 -537 -570 -518 -469 -505 -537 -483 -437 -392 -341 -291 -310 -329 -397 -378
29 -378 -383 -387 -386 -385 -353 -322 -290 -259 -339 -419 -413 -407 -456 -506 -417 -329 -326 -408 -413 -333 -284 -378 -477 -491 -493 -496 -412 -329 -291 -339 -387 -349 -349 -350 -317 -198 -168 -282 -395 -365
24 -365 -328 -376 -421 -379 -308 -323 -382 -354 -291 -314 -418 -436 -370 -304 -275 -246 -261 -275 -289 -304 -315 -325 -336 -347 -384 -422 -413 -318 -277 -321 -339 -314 -291 -311 -352 -308
20 -308 -238 -167 -192 -216 -297 -378 -355 -247 -212 -264 -312 -275 -241 -249 -274 -299 -324 -393 -448 -417 -352 -374 -409 -401 -407 -412 -401 -348 -331 -400 -472 -457 -387 -402 -434 -422 -396
15 -396 -414 -455 -411 -341 -313 -330 -348 -369 -434 -456 -393 -296 -285 -350 -414 -416 -417 -376 -335 -303 -272 -243 -214 -213 -255 -259 -176 -136 -240 -378 -429 -378 -327 -313 -300 -265 -230
$$ packed form
46c75K3K3p5p6J25J25N8N8J5J4n9o0K7K6nnQ1Q0L5L5L5L5J19J19K62K63K89K90L58L58J62
42B360j24l38m25m61l75k19j33j61j61o9p0m9m9pom1m1M4M5j3j4j3j4noQ1Q0j2j3n6n6l0l0
38c81N6N6n3n3L3L2m2m3M4M3o6o7J9J9j3j3P3P3k6k5O0O0n7n8j5j5kkM1M1o0n9K6K7o2o1K8
34d42J13M5m1N0N1Nq1jQ5Q1nl7l7r6r7M1M2j3r8o1K6Rp6l3N2M9l6l2N4M6M5N1N0j9j9o8J9
29c78nmJJL2L1L2L1q0q0OOm9n0Q9Q8Lq2nQ0M9r4r9j4klQ4Q3L8m8m8L8%jL3J19L0j14j13L0
24c65L7m8m5M2P1j5n9K8O3k3j04j8O6O6K9K9j5j4j4j5j1j0j1j1l7l8RR5M1m4j8K5K3k0m1M4
20c08P0P1k5k4q1q1K3J08L5n2m8L7L4qk5k5k5o9n5L1O5k2l5QonJ1N3J7o9p2J5P0j5l2J2K6
15c96j8m1M4P0K8j7j8k1o5k2O3R7J1o5o4kjM1M1L2L1K9K9Jm2mQ3M0j04j38n1N1N1J4J3L5L5
$$ plain form
11 -230 -295 -360 -419 -478 -437 -396 -340 -284 -300 -316 -390 -464 -518 -485 -457 -472 -443 -328 -213 -242 -307 -286 -231 -219 -252 -285 -312 -383 -481 -492 -476 -503 -511 -434 -310
7 -310 -273 -284 -251 -203 -241 -324 -364 -398 -432 -463 -495 -484 -473 -468 -463 -426 -475 -530 -499 -428 -443 -553 -577 -471 -365 -305 -331 -400 -468 -495 -436 -399 -447 -495 -458 -366
2 -366 -359 -400 -440 -394 -348 -345 -342 -292 -242 -241 -239 -202 -251 -351 -452 -450 -449 -447 -445 -424 -403 -388 -372 -329 -371 -419 -381 -313 -332 -425 -519 -526 -534 -590 -560 -507 -453 -466 -479 -441 -402
-3 -402 -407 -412 -349 -286 -272 -258 -191 -211 -282 -354 -309 -264 -319 -375 -415 -455 -495 -535 -499 -462 -469 -475 -422 -369 -416 -462 -411 -360 -352 -343 -360 -377 -404 -346 -272 -284 -342 -401 -404
-8 -404 -406 -501 -509 -393 -277 -314 -350 -316 -281 -290 -299 -313 -327 -342 -356 -330 -305 -379 -453 -403 -353 -345 -338 -309 -280 -332 -384 -344 -218 -179 -225 -300 -375 -455 -536 -495 -455
-12 -455 -415 -374 -298 -222 -289 -356 -346 -336 -407 -477 -522 -481 -445 -409 -366 -323 -417 -512 -558 -517 -439 -361 -312 -262 -298 -334 -293 -251 -347 -444 -457 -384 -354 -410 -402 -394
-17 -394 -392 -390 -390 -390 -390 -389 -338 -287 -279 -271 -278 -284 -372 -459 -479 -414 -348 -368 -380 -392 -403 -415 -429 -356 -284 -297 -336 -374 -337 -300 -233 -252 -308 -364 -373 -383 -392 -401 -316 -230 -239 -334
-22 -334 -362 -390 -417 -445 -467 -404 -340 -362 -360 -357 -360 -363 -366 -368 -413 -458 -429 -399 -451 -502 -431 -273 -159 -131 -178 -226 -236 -246 -243 -239 -279 -319 -292 -265 -375 -486 -455
$$ packed form
11b30o5o5n9n9M1M1N6N6j6j6p4p4n4L3K8j5K9J15J15k9o5K1N5J2l3l3k7p1r8j1J6k7qP7J24
7c10L7j1L3M8l8q3m0l4l4l1l2J1J1NNL7m9n5L1P1j5j10k4J06J06O0k6o9o8k7N9L7m8m8L7R2
2c66Pm1m0M6M6LLN0N0JKL7m9j00j01KJKKK1K1J5J6M3m2m8L8O8j9r3r4pqn6L0N3N4j3j3L8L9
-3d02nnO3O3J4J4O7k0p1p2M5M5n5n6m0m0m0m0L6L7poN3N3m7m6N1N1QRj7j7k7N8P4j2n8n9l
-8d04kr5qJ16J16l7l6L4L5rrj4j4j5j4K6K5p4p4N0N0QPK9K9n2n2M0J26L9m6p5p5q0q1M1M0
-12d55M0M1P6P6o7o7J0J0p1p0m5M1L6L6M3M3r4r5m6M1P8P8M9N0l6l6M1M2r6r7j3P3L0n6QQ
-17c94KK%%%JN1N1QQpoq8q7k0O5O6k0j2j2j1j2j4P3P2j3l9l8L7L7O7j9n6n6rj0rrQ5Q6rr5
-22c34k8k8k7k8k2O3O4k2KLlllkm5m5K9L0n2n1P1J58J14K8m7m8j0j0LMm0m0K7K7j10j11L1
$$ plain form
-26 -455 -337 -306 -360 -332 -303 -313 -408 -465 -436 -418 -399 -363 -326 -370 -414 -413 -325 -318 -397 -421 -360 -303 -333 -373 -413 -453 -494 -437 -295 -238 -267 -299 -331 -326 -320 -273
-31 -273 -226 -211 -282 -327 -286 -245 -290 -390 -405 -387 -369 -378 -386 -351 -316 -286 -256 -312 -367 -348 -329 -304 -365 -375 -385 -400 -415 -401 -387 -324 -347 -421 -495 -488 -481 -395 -308
-35 -308 -259 -296 -320 -343 -329 -315 -298 -281 -264 -247 -231 -214 -197 -180 -233 -286 -334 -381 -442 -418 -355 -293 -292 -290 -332 -373 -352 -332 -354 -376 -359 -342 -325 -308 -290 -273
-39 -273 -255 -238 -196 -155 -203 -336 -406 -389 -383 -378 -359 -341 -323 -304 -242 -180 -164 -234 -302 -285 -267 -336 -378 -335 -225 -201 -279 -358 -370 -381 -390 -398 -406 -415 -436 -458 -480
-44 -480 -502 -489 -476 -463 -451 -407 -364 -368 -457 -523 -502 -464 -426 -394 -363 -284 -290 -348 -406 -469 -533 -508 -484 -502 -521 -460 -400 -357 -400 -450 -415 -342 -354 -363 -372 -343 -314
-49 -314 -317 -321 -324 -327 -311 -295 -279 -264 -280 -296 -312 -329 -343 -358 -372 -387 -360 -334 -259 -269 -289 -309 -334 -359 -373 -387 -402 -416 -418 -420 -374 -414 -458 -501 -501 -502 -523 -458 -369
-53 -369 -281 -300 -319 -338 -357 -347 -337 -327 -317 -325 -333 -341 -349 -359 -369 -378 -388 -377 -367 -356 -345 -233 -122 -139 -243 -305 -224 -142 -205 -310 -329 -332 -379 -411 -356 -254
-58 -254 -195 -179 -119 -78 -123 -238 -309 -339 -369 -393 -417 -369 -322 -309 -297 -273 -336 -383 -345 -306 -354 -471 -502 -460 -461 -492 -481 -401 -364 -418 -472 -457 -442 -458 -474
$$ packed form
-26d55J18L1n4K8K9j0r5n7K9J8J9L6L7m4m4JQ8Pp9k4O1N7l0m0m0m0m1N7J42N7k9l2l2NOM7
-31b73M7J5p1m5M1M1m5j00j5J8J8rqL5L5L0L0n6n5J9J9K5o1j0j0j5j5J4J4O3k3p4p4PPQ6Q7
-35c08M9l7k4k3J4J4J7J7J7J7J6J7J7J7n3n3m8m7o1K4O3O2JKm2m1K1K0k2k2J7J7J7J7J8J7
-39b73J8J7M2M1m8j33p0J7ONJ9J8J8J9O2O2J6p0o8J7J8o9m2M3J10K4p8p9j2j1rqqrk1k2k2
-44d80k2J3J3J3J2M4M3mq9o6K1L8L8L2L1P9on8n8o3o4K5K4j8j9O1O0M3m3n0L5P3j2rrK9K9
-49c14lmllJ6J6J6J5j6j6j6j7j4j5j4j5K7K6P5j0k0k0k5k5j4j4j5j4kkM6m0m4m3%jk1O5Q9
-53c69Q8j9j9j9j9J0J0J0J0qqqqj0j0rj0J1J0J1J1J12J11j7j04o2Q1Q2o3j05j9lm7l2N5J02
-58b54N9J6O0M1m5j15p1l0l0k4k4M8M7J3J2K4o3m7L8L9m8j17l1M2jl1J1Q0L7n4n4J5J5j6j6
$$ plain form
-62 -474 -442 -410 -391 -286 -149 -155 -284 -412 -392 -372 -434 -497 -487 -478 -457 -436 -415 -394 -422 -451 -479 -507 -481 -455 -430 -404 -410 -416 -423 -429 -422 -414 -406 -399 -348 -296 -245 -193
-67 -193 -212 -232 -294 -356 -426 -496 -466 -436 -484 -532 -479 -427 -412 -396 -380 -365 -323 -281 -310 -340 -383 -426 -368 -311 -319 -327 -291 -256 -286 -315 -344 -373 -382 -390 -398 -406 -404 -402 -399 -397
-72 -397 -407 -417 -427 -438 -401 -365 -329 -293 -285 -278 -270 -263 -255 -248 -240 -233 -256 -279 -248 -303 -392 -395 -308 -222 -257 -293 -328 -363 -420 -477 -448 -419 -403 -387 -370 -354 -329 -304 -225 -232
-76 -232 -369 -421 -383 -345 -305 -265 -225 -185 -259 -332 -316 -213 -224 -321 -363 -406 -417 -428 -439 -450 -436 -422 -360 -383 -493 -602 -565 -442 -411 -381 -346 -310 -353
-80 -353 -396 -439 -482 -498 -514 -444 -374 -401 -427 -448 -469 -496 -436 -291 -231 -336 -440 -407 -374 -405 -437 -436 -349 -331 -398 -412 -426 -422 -418 -414 -410 -339 -269 -198 -128 -113
-85 -113 -98 -83 -68 -141 -214 -201 -188 -229 -269 -310 -351 -443 -535 -431 -328 -361 -480 -493 -363 -293 -309 -274 -238 -218 -285 -303 -321 -318 -316 -313 -310 -302 -294 -289 -284 -312 -383
-89 -383 -398 -327 -304 -367 -401 -392 -390 -389 -385 -381 -463 -544 -534 -438 -357 -319 -254 -190 -257 -368 -420 -385 -402 -461 -458 -370 -307 -329 -328 -283 -251 -305 -362 -332 -285 -324 -360 -310
-94 -310 -292 -317 -315 -313 -344 -417 -434 -365 -327 -375 -420 -379 -349 -362 -370 -334 -306 -277 -251 -225 -228 -316 -405 -408 -393 -378 -358 -339 -364 -390 -359 -286 -250 -300 -327 -310 -320 -373
$$ packed form
-62d74L2L2J9J05J37oj29j28K0K0o2o3J0RK1K1K1K1k8k9k8k8K6K6K5K6oopoPQQPN1N2N1N2
-67a93j9k0o2o2p0p0L0L0m8m8N3N2J5J6J6J5M2M2k9l0m3m3N8N7qqL6L5l0k9k9k9rqqqKKLK
-72c97j0j0j0j1L7L6L6L6QPQPQPQPk3k3L1n5q9lQ7Q6l5l6l5l5n7n7K9K9J6J6J7J6K5K5P9p
-76b32j37n2L8L8M0M0M0M0p4p3J6J03j1r7m2m3j1j1j1j1J4J4O2k3j10j09L7J23L1L0L5L6m3
-80c53m3m3m3j6j6P0P0k7k6k1k1k7O0J45O0j05j04L3L3l1l2JQ7J8o7j4j4MMMMP1P0P1P0J5
-85a13J5J5J5p3p3J3J3m1m0m1m1r2r2J04J03l3j19j3J30P0j6L5L6K0o7j8j8LKLLQQNNk8p1
-89c83j5P1K3o3l4RKJMMq2q1J0R6Q1L8O5O4o7j11n2L5j7n9LQ8O3k2JM5L2n4n7L0M7l9l6N0
-94c10J8k5KKl1p3j7O9L8m8m5M1L0j3qL6K8K9K6K6lq8q9lJ5J5K0J9k5k6L1P3L6n0k7J7j0n3
$$ plain form
-99 -373 -450 -442 -391 -383 -373 -320 -232 -187 -201 -214 -265 -315 -365 -416 -389 -362 -335 -309 -313 -317 -324 -331 -374 -461 -488 -430 -408 -429 -447 -422 -381 -384 -388 -350 -347 -429 -508 -502 -452 -402
-104 -402 -355 -308 -224 -283 -410 -450 -451 -452 -404 -356 -350 -345 -382 -419 -434 -449 -417 -300 -277 -339 -402 -378 -381 -469 -490 -425 -347 -412 -488 -478 -404 -417 -524 -546 -485 -423
-108 -423 -362 -301 -193 -172 -231 -289 -295 -301 -307 -313 -353 -392 -431 -470 -442 -415 -387 -360 -364 -369 -373 -378 -373 -368 -364 -359 -343 -328 -318 -308 -307 -393 -483 -488 -415 -428 -484 -454 -401 -434 -467
-113 -467 -414 -322 -315 -384 -453 -453 -454 -454 -455 -388 -322 -384 -446 -454 -462 -427 -392 -354 -317 -322 -327 -342 -358 -427 -410 -352 -381 -447 -428 -388 -348 -374 -400 -331 -263 -242 -222 -155 -174
-118 -174 -245 -316 -338 -361 -383 -406 -423 -441 -506 -486 -401 -317 -270 -222 -199 -175 -280 -386 -386 -387 -387 -388 -359 -331 -374 -417 -462 -506 -593 -680 -596 -511 -499 -486 -438 -391
-122 -391 -343 -295 -291 -286 -324 -363 -337 -311 -356 -402 -453 -504 -555 -607 -488 -369 -350 -332 -304 -276 -249 -221 -222 -223 -267 -311 -333 -356 -379 -401 -338 -275 -312 -348 -352 -355 -359
-127 -359 -362 -318 -274 -330 -386 -355 -323 -334 -345 -345 -345 -344 -344 -299 -253 -308 -363 -370 -376 -383 -389 -320 -251 -310 -370 -445 -520 -465 -411 -333 -255 -249 -242 -305 -367 -430 -492 -400 -309 -317 -325
-132 -325 -300 -274 -291 -308 -304 -299 -294 -290 -332 -374 -416 -457 -358 -258 -230 -202 -200 -197 -238 -279 -315 -352 -288 -224 -222 -220 -318 -416 -391 -366 -426 -487 -452 -417 -425 -433 -411 -388 -409
$$ packed form
-99c73p7QN1QJ0N3Q8M5j4j3n1n0n0n1K7K7K7K6mmppm3q7k7N8K2k1j8K5M1lmL8Lq2p9ON0N0
-104d02M7M7Q4n9j27m0jjM8M8ONl7l7j5j5L2J17K3o2o3K4lq8k1O5P8o5p6J0P4j3j07k2O1O2
-108d23O1O1J08K1n9n8oooom0l9l9l9K8K7K8K7mnmnNNMNJ6J5J0J0Jq6r0nP3j3n6L0N3l3l3
-113d67N3R2Po9o9%j%jO7O6o2o2qqL5L5L8L7nnj5j6o9J7N8k9o6J9M0M0k6k6O9O8K1K0O7j9
-118a74p1p1k2k3k2k3j7j8o5K0Q5Q4M7M8K3K4j05j06%j%jK9K8m3m3m5m4q7q7Q4Q5J2J3M8M7
-122c91M8M8MNl8l9K6K6m5m6n1n1n1n2J19J19J9J8K8K8K7K8jjm4m4k2k3k3k2O3O3l7l6mlm
-127c59lM4M4n6n6L1L2j1j1%%J%M5M6n5n5popoO9O9n9o0p5p5N5N4P8P8OPo3o2o3o2R2R1qq
-132c25K5K6j7j7MNNMm2m2m2m1R9J00K8K8KLm1m1l6l7O4O4KKr8r8K5K5o0o1L5L5qqK2K3k1
$$ plain form
-136 -409 -429 -368 -306 -330 -354 -311 -268 -311 -354 -331 -308 -317 -412 -485 -471 -426 -381 -341 -301 -347 -393 -356 -320 -369 -419 -367 -315 -258 -287 -283 -278 -279 -280 -334 -388 -400 -411
-141 -411 -341 -272 -291 -397 -443 -404 -375 -346 -348 -349 -351 -353 -305 -257 -209 -162 -205 -248 -291 -334 -292 -250 -245 -327 -365 -403 -403 -403 -438 -473 -509 -544 -494 -443 -479 -515 -475 -435
-146 -435 -396 -356 -268 -179 -128 -163 -160 -156 -201 -246 -246 -247 -248 -249 -268 -288 -307 -327 -233 -140 -84 -115 -231 -347 -431 -429 -407 -386 -359 -333 -276 -220 -302 -383 -425 -381 -380 -465
-150 -465 -485 -505 -488 -470 -387 -304 -258 -299 -342 -385 -433 -481 -412 -342 -305 -354 -399 -359 -329 -299 -261 -223 -228 -234 -244 -255 -266 -276 -296 -315 -335 -355 -306 -258 -241 -311
-155 -311 -354 -311 -322 -332 -255 -178 -139 -186 -286 -386 -405 -424 -372 -320 -300 -366 -408 -364 -326 -373 -405 -437 -432 -426 -379 -331 -369 -493 -588 -539 -437 -420 -444 -382
-159 -382 -325 -354 -396 -437 -398 -359 -332 -304 -357 -410 -419 -342 -302 -349 -405 -376 -257 -138 -116 -95 -116 -138 -203 -268 -290 -313 -298 -284 -258 -319 -417 -429 -409 -389
-163 -389 -415 -440 -460 -481 -450 -334 -218 -188 -215 -242 -275 -307 -338 -370 -396 -422 -433 -359 -285 -297 -261 -226 -196 -166 -226 -285 -339 -393 -398 -318 -261 -247 -293 -340
-167 -340 -383 -427 -471 -429 -381 -420 -510 -515 -444 -374 -375 -377 -392 -450 -516 -497 -458 -462 -478 -451 -424 -440 -488 -494 -431 -411 -469 -526 -514 -503 -502 -501 -495 -489 -485 -396 -307 -304 -337 -370
$$ packed form
-136d09k0O1O2k4k4M3M3m3m3K3K3rr5p3J4M5M5M0M0m6m6L7L6m9n0N2N2N7k9MNjjn4n4j2j1
-141d11P0O9j9j06m6L9K9K9kjkkM8M8M8M7m3m3m3m3M2M2Nq2l8l8%%l5l5l6l5N0N1l6l6M0M0
-146d35L9M0Q8Q9N1l5LMm5m5%jjjj9k0j9k0R4R3N6l1j16j16q4KK2K1K7K6N7N6q2q1m2M4Jq5
-150d65k0k0J7J8Q3Q3M6m1m3m3m8m8O9P0L7m9m5M0L0L0L8L8noj0j1j1j0k0j9k0k0M9M8J7p0
-155c11m3M3j1j0P7P7L9m7j00j00j9j9N2N2K0o6m2M4L8m7l2l2NOM7M8l8j24r5M9J02J7k4O2
-159c82N7k9m2m1L9L9K7K8n3n3rP7M0m7n6K9J19J19K2K1k1k2o5o5k2k3J5J4K6o1r8j2K0K0
-163c89k6k5k0k1L1J16J16L0k7k7l3l2l1l2k6k6j1P4P4j2L6L5L0L0o0n9n4n4nQ0N7J4m6m7
-167c40m3m4m4M2M8l9r0nP1P0jkj5n8o6J9L9mj6K7K7j6m8oO3K0n8n7J2J1JJOOMQ9Q9Ll3l3
$$ plain form
-172 -370 -408 -446 -429 -412 -396 -379 -362 -345 -329 -312 -289 -266 -244 -221 -265 -310 -354 -398 -470 -543 -486 -429 -361 -292 -299 -392 -445 -411 -284 -242 -298 -354 -345 -335 -363
-176 -363 -391 -319 -247 -252 -256 -261 -266 -285 -303 -322 -340 -341 -341 -342 -342 -345 -348 -350 -353 -375 -397 -377 -356 -395 -434 -401 -369 -363 -357 -309 -260 -257 -253 -316 -379 -422 -380 -289 -242 -242 -243 -246 -248 -222 -195
-182 -195 -169 -142 -190 -238 -286 -334 -343 -351 -360 -369 -359 -349 -339 -330 -441 -552 -506 -459 -467 -475 -484 -492 -472 -452 -433 -413 -434 -455 -476 -497 -535 -573 -511 -449 -436 -422 -409 -395
-186 -395 -365 -334 -304 -273 -258 -243 -228 -213 -195 -178 -160 -142 -187 -232 -234 -236 -275 -313 -280 -247 -297 -346 -352 -359 -324 -289 -255 -220 -236 -252 -268 -284 -300 -316 -332 -348 -362
-191 -362 -376 -390 -404 -389 -374 -402 -430 -458 -485 -441 -397 -354 -311 -310 -310 -282 -255 -227 -199 -300 -402 -374 -346 -330 -315 -299 -283 -365 -447 -429 -411 -423 -436 -377 -319
-195 -319 -360 -401 -400 -398 -428 -458 -417 -375 -365 -355 -344 -334 -378 -421 -365 -308 -262 -215 -168 -121 -126 -131 -136 -141 -180 -218 -257 -296 -360 -425 -403 -382 -346 -310 -277 -244 -320 -438
-200 -438 -444 -363 -331 -384 -411 -395 -361 -370 -381 -350 -358 -452 -462 -387 -399 -496 -586 -589 -533 -434 -305 -262 -322 -383 -415 -360 -321 -326 -328 -286 -247 -251 -258 -221 -232 -328 -341 -267
-205 -267 -212 -243 -247 -208 -201 -237 -246 -256 -285 -315 -345 -375 -341 -307 -303 -256 -224 -279 -307 -291 -306 -320 -332 -343 -344 -345 -346 -347 -321 -294 -297 -256 -219 -267 -315 -277 -209 -185 -217
$$ packed form
-172c70l8l8J7J7J6J7J7J7J6J7K3K3K2K3m4m5m4m4p2p3N7N7O8O9pr3n3L4J27M2n6n6RJ0k8
-176c63k8P2P2nmnnj9j8j9j8j%j%llklk2k2K0K1l9l9L3L2OOM8M9LMo3o3m3M2R1M7%jlkK6K7
-182a95K6K7m8m8m8m8rqrrJ0J0J0Rj11j11M6M7qqrqK0K0J9K0k1k1k1k1l8l8O2O2J3J4J3J4
-186c95L0L1L0L1J5J5J5J5J8J7J8J8m5m5kkl9l8L3L3n0m9opL5L5L4L5j6j6j6j6j6j6j6j6j4
-191c62j4j4j4J5J5k8k8k8k7M4M4M3M3J%K8K7K8K8j01j02K8K8J6J5J6J6q2q2J8J8j2j3N9N8
-195c19m1m1JKl0l0M1M2J0J0J1J0m4m3N6N7M6M7M7M7nnnnl9l8l9l9o4o5K2K1L6L6L3L3p6j18
-200d38oQ1L2n3k7J6L4rj1L1qr4j0P5j2r7r0lN6R9J29M3o0o1l2N5L9nkM2L9mpL7j1r6j3P4
-205b67N5l1mL9Pl6rj0k9l0l0l0L4L4MM7L2n5k8J6j5j4j2j1jjjjK6K7lM1L7m8m8L8O8K4l2
$$ plain form
-209 -217 -248 -248 -247 -246 -245 -327 -409 -378 -304 -265 -313 -363 -327 -300 -359 -415 -386 -358 -374 -387 -357 -329 -345 -384 -338 -271 -247 -279 -312 -336 -360 -384 -409 -359 -309 -294 -365
-214 -365 -446 -484 -465 -446 -462 -477 -412 -347 -359 -457 -474 -406 -373 -427 -475 -437 -408 -379 -350 -322 -317 -399 -457 -471 -462 -452 -440 -427 -402 -376 -351 -325 -355 -385 -415 -444
-218 -444 -462 -480 -441 -360 -344 -413 -486 -472 -465 -544 -618 -605 -557 -509 -455 -402 -385 -369 -352 -336 -347 -358 -317 -232 -214 -339 -428 -432 -347 -261 -313 -366 -360 -353 -347 -341 -341 -341
-223 -341 -371 -358 -345 -419 -492 -480 -450 -464 -448 -432 -445 -458 -471 -483 -464 -445 -425 -406 -387 -369 -350 -331 -324 -316 -308 -300 -337 -374 -411 -447 -438 -428 -418 -409 -431 -454 -479 -505
-228 -505 -511 -561 -637 -628 -577 -569 -556 -500 -431 -362 -291 -220 -265 -311 -357 -402 -385 -368 -351 -334 -319 -305 -376 -447 -423 -399 -376 -352 -366 -380 -394 -408 -378 -348 -361 -374
-232 -374 -317 -260 -289 -318 -295 -271 -291 -311 -347 -382 -417 -453 -466 -479 -492 -505 -480 -456 -431 -407 -400 -393 -387 -380 -365 -350 -336 -321 -278 -236 -279 -323 -305 -288 -313 -339 -289
-236 -289 -239 -276 -312 -305 -298 -334 -370 -357 -343 -416 -489 -431 -374 -316 -259 -212 -165 -204 -243 -267 -291 -315 -339 -348 -358 -367 -377 -353 -329 -391 -453 -391 -330 -268 -206 -218 -230
-241 -230 -242 -254 -282 -310 -338 -366 -323 -279 -322 -364 -337 -310 -325 -341 -343 -345 -390 -434 -380 -325 -314 -302 -294 -287 -279 -272 -299 -326 -354 -381 -378 -375 -372 -369 -363 -357 -351 -345 -353 -360 -324 -288 -212
$$ packed form
-209b17l1%JJJq2q2L1P4L9m8n0L6K7n9n6K9K8j6j3L0K8j6l9M6O7K4l2l3k4k4k4k5N0N0J5p1
-214c65q1l8J9J9j6j5O5O5j2r8j7O8L3n4m8L8K9K9K9K8Nq2n8j4RJ0J2J3K5K6K5K6l0l0l0k9
-218d44j8j8L9Q1J6o9p3J4Pp9p4J3M8M8N4N3J7J6J7J6j1j1M1Q5J8j25q9mQ5Q6n2n3OPOO%%
-223c41l0J3J3p4p3J2L0j4J6J6j3j3j3j2J9J9K0J9J9J8J9J9PQQQl7l7l7l6RJ0J0Rk2k3k5k6
-228e05on0p6RN1QJ3N6O9O9P1P1m5m6m6m5J7J7J7J7J5J4p1p1K4K4K3K4j4j4j4j4L0L0j3j3
-232c74N7N7k9k9K3K4k0k0l6l5l5l6j3j3j3j3K5K4K5K4PPOPJ5J5J4J5M3M2m3m4J8J7k5k6N0
-236b89N0l7l6PPl6l6J3J4p3p3N8N7N8N7M7M7l9l9k4k4k4k4rj0rj0K4K4o2o2O2O1O2O2j2j2
-241b30j2j2k8k8k8k8M3M4m3m2K7K7j5j6kkm5m4N4N5J1J2QPQPk7k7k8k7LLLLOOOOqpL6L6P6
$$ plain form
-246 -212 -136 -260 -385 -420 -455 -404 -353 -312 -271 -316 -361 -391 -421 -408 -396 -364 -332 -387 -441 -429 -417 -405 -393 -392 -392 -435 -477 -415 -353 -377 -401 -400 -399 -398 -397 -365 -333
-251 -333 -343 -354 -293 -231 -312 -394 -407 -420 -433 -446 -389 -332 -362 -391 -413 -435 -370 -306 -280 -253 -270 -286 -336 -385 -392 -398 -402 -406 -409 -413 -383 -354 -367 -380 -326 -272 -304 -336
-255 -336 -299 -263 -313 -362 -333 -304 -361 -418 -427 -437 -360 -284 -283 -283 -326 -368 -345 -321 -298 -274 -172 -71 -113 -154 -181 -207 -234 -261 -326 -391 -413 -435 -388 -341 -380
-260 -380 -419 -468 -517 -560 -604 -616 -543 -470 -482 -479 -475 -391 -307 -315 -324 -332 -340 -343 -346 -349 -352 -326 -300 -274 -248 -297 -347 -396 -445 -440 -435 -431 -426 -421 -416 -412 -407 -405 -402 -400 -397 -395 -393 -439 -399 -286
-265 -286 -173 -140 -108 -171 -233 -344 -369 -289 -209 -262 -314 -275 -151 -132 -256 -352 -361 -343 -324 -317 -311 -305 -299 -303 -307 -311 -315 -319 -323 -327 -331 -331 -331 -330 -330 -348 -366 -383 -401 -395 -390 -384 -379
-271 -379 -434 -489 -545 -600 -589 -578 -567 -555 -496 -436 -463 -489 -456 -422 -389 -356 -358 -361 -363 -365 -289 -213 -174 -221 -247 -273 -304 -335 -324 -312 -301 -290 -284 -278 -272 -267 -231 -194 -191
-275 -191 -273 -330 -301 -277 -340 -370 -400 -430 -460 -427 -309 -271 -319 -364 -324 -287 -335 -396 -414 -432 -493 -558 -537 -457 -421 -392 -363 -337 -311 -340 -369 -393 -417 -453
-280 -453 -403 -374 -388 -378 -324 -274 -266 -299 -333 -369 -405 -413 -420 -428 -435 -445 -454 -377 -301 -296 -291 -286 -281 -283 -285 -287 -289 -379 -468 -471 -474 -410 -345 -366 -387 -370 -352 -335 -318 -306 -294 -282 -269
$$ packed form
-246b12P6j24j25l5l5N1N1M1M1m5m5l0l0J3J2L2L2n5n4J2J2J2J2J%m3m2O2O2k4k4JJJJL2L2
-251c33j0j1O1O2q1q2j3j3j3j3N7N7l0k9k2k2O5O4K6K7j7j6n0m9pommlmL0K9j3j3N4N4l2l2
-255c36L7L6n0m9K9K9n7n7rj0P7P6J%m3m2K3K4K3K4J02J01m2m1k7k6k7k7o5o5k2k2M7M7l9
-260c80l9m9m9m3m4j2P3P3j2LMQ4Q4qrqqllllK6K6K6K6m9n0m9m9NNMNNNMNKLKLKKm6M0J13
-265b86J13L3L2o3o2j11k5Q0Q0n3n2L9J24J9j24r6rJ8J9POOOmmmmmmmm%%J%j8j8j7j8ONON
-271c79n5n5n6n5J1J1J1J2N9O0k7k6L3L4L3L3klkkP6P6L9m7k6k6l1l1J1J2J1J1OOONL6L7L
-275a91q2n7K9K4o3l0l0l0l0L3J18L8m8m5M0L7m8o1j8j8o1o5K1Q0L6K9K9K6K6k9k9k4k4l6
-280d53N0K9j4J0N4N0Ql3l4l6l6qpqpj0rP7P6NNNNkkkkr0q9llO4O5k1k1J7J8J7J7J2J2J2J3
$$ plain form
-285 -269 -337 -405 -473 -541 -498 -455 -412 -368 -345 -321 -297 -273 -296 -319 -342 -364 -393 -421 -449 -477 -444 -411 -379 -346 -361 -376 -386 -395 -398 -314 -231 -233 -276 -318 -367 -415
-289 -415 -312 -210 -197 -270 -339 -321 -330 -383 -423 -421 -416 -454 -463 -386 -336 -330 -333 -336 -336 -336 -371 -321 -264 -294 -357 -334 -265 -195 -211 -228 -244 -261 -301 -340 -380 -420 -425 -431 -394
-294 -394 -356 -324 -292 -303 -314 -313 -311 -310 -308 -334 -360 -315 -269 -296 -323 -388 -453 -517 -496 -403 -396 -436 -476 -450 -424 -441 -457 -374 -291 -247 -203 -232 -260 -299 -339 -379 -419
-298 -419 -494 -570 -537 -418 -351 -285 -317 -435 -559 -597 -588 -580 -498 -416 -329 -328 -372 -417 -395 -373 -461 -548 -536 -523 -560 -598 -507 -415 -347 -279 -311 -344 -429 -515 -530
-303 -530 -544 -561 -578 -552 -526 -529 -532 -535 -537 -556 -574 -520 -467 -450 -433 -454 -475 -502 -443 -384 -411 -523 -635 -623 -612 -594 -576 -458 -340 -276 -213 -221 -229 -295 -360 -354
-307 -354 -348 -366 -384 -330 -276 -279 -282 -284 -287 -334 -381 -357 -332 -351 -371 -318 -266 -335 -405 -403 -401 -425 -450 -403 -357 -341 -325 -382 -438 -471 -505 -467 -429 -461 -492 -524 -555 -554 -553
-312 -553 -481 -408 -410 -412 -414 -416 -358 -300 -313 -327 -373 -420 -395 -370 -398 -426 -382 -338 -361 -383 -406 -428 -491 -554 -459 -364 -327 -289 -295 -300 -346 -392 -337 -283 -308 -333 -357 -382
-317 -382 -356 -330 -346 -363 -351 -339 -284 -229 -305 -381 -356 -331 -401 -471 -441 -410 -346 -282 -289 -296 -315 -333 -280 -227 -176 -125 -118 -110 -125 -139 -153 -168 -246 -324 -330 -336 -393 -450
$$ packed form
-285b69o8o8o8o8M3M3M3M4K3K4K4K4k3k3k3k2k9k8k8k8L3L3L2L3j5j5j0rlQ4Q3km3m2m9m8
-289d15J03J02J3p3o9J8rn3m0KNl8rP7N0Oll%%l5N0N7l0o3K3O9P0j6j7j6j7m0l9m0m0noL7
-294c94L8L2L2j1j1JKJKk6k6M5M6k7k7o5o5o4K1R3Pm0m0K6K6j7j6Q3Q3M4M4k9k8l9m0m0m0
-298d19p5p6L3J19O7O6l2j18j24l8RQQ2Q2Q7Jm4m5K2K2q8q7J2J3l7l8R1R2O8O8l2l3q5q6j5
-303e30j4j7j7K6K6lllkj9j8N4N3J7J7k1k1k7N9N9k7j12j12J2J1J8J8J18J18O4O3qqo6o5O
-307c54Oj8j8N4N4llklm7m7K4K5j9k0N3N2o9p0KKk4k5M7M6J6J6n7n6l3l4L8L8l2l1l2l1JJ
-312e53P2P3kkkkN8N8j3j4m6m7K5K5k8k8M4M4k3k2k3k2o3o3R5R5L7L8onm6m6N5N4k5k5k4k5
-317c82K6K6j6j7J2J2N5N5p6p6K5K5p0p0L0L1O4O4ppj9j8N3N3N1N1PQj5j4j4j5p8p8oon7n7
$$ plain form
-321 -450 -436 -421 -335 -249 -291 -334 -356 -378 -357 -337 -329 -322 -314 -307 -358 -410 -386 -276 -223 -255 -363 -471 -505 -539 -501 -463 -417 -370 -283 -196 -247 -341 -364 -301 -267
-325 -267 -319 -343 -325 -326 -369 -413 -413 -411 -452 -517 -496 -451 -450 -443 -393 -355 -317 -276 -235 -262 -288 -272 -214 -198 -269 -342 -329 -317 -391 -435 -436 -406 -376 -373 -327 -291 -340 -429
-330 -429 -433 -376 -320 -330 -340 -349 -357 -323 -289 -290 -291 -292 -292 -328 -365 -359 -310 -314 -404 -467 -487 -481 -475 -466 -458 -482 -505 -529 -553 -531 -510 -488 -467 -420 -374 -327 -281 -279 -278 -279 -281 -285 -332 -403
-336 -403 -388 -370 -351 -328 -304 -320 -335 -351 -367 -357 -348 -368 -345 -309 -360 -413 -380 -319 -344 -416 -487 -478 -469 -417 -365 -369 -374 -379 -383 -410 -437 -464 -491 -455 -418 -382 -345 -308
-340 -308 -272 -307 -342 -390 -438 -386 -334 -295 -257 -347 -437 -424 -411 -398 -384 -369 -353 -337 -321 -343 -366 -388 -411 -394 -377 -360 -343 -379 -415 -451 -487 -476 -465 -455 -444
-344 -444 -451 -457 -464 -470 -438 -406 -375 -343 -254 -166 -207 -247 -315 -382 -407 -431 -458 -485 -512 -539 -459 -379 -371 -363 -326 -289 -324 -358 -382 -406 -430 -453 -460 -467 -473 -480 -424 -368 -384 -399
-349 -399 -375 -350 -368 -387 -354 -321 -389 -456 -422 -388 -353 -319 -313 -308 -302 -297 -279 -262 -316 -371 -319 -266 -257 -248 -299 -350 -358 -366 -382 -399 -416 -433 -435 -436 -438 -440 -431 -421 -412 -403 -378 -353
-354 -353 -328 -303 -302 -302 -302 -302 -312 -322 -331 -341 -304 -267 -231 -194 -245 -297 -396 -410 -375 -341 -306 -272 -273 -360 -399 -438 -397 -356 -315 -274 -289 -304 -281 -259 -199 -226 -275 -325
$$ packed form
-321d50J4J5Q6Q6m2m3k2k2K1K0QPQPn1n2K4J10N3l2j08j08l4l4L8L8M6M7Q7Q7n1r4k3O3L4
-325b67n2k4J8jm3m4%Km1o5K1M5JPN0L8L8M1M1k7k6J6N8J6p1p3J3J2p4m4jL0L0LM6L6m9q9
-330d29mN7N6j0j0rqL4L4jjj%l6l7OM9mr0o3k0OORQk4k3k4k4K2K1K2K1M7M6M7M6KJjkmm7p1
-336d03J5J8J9K3K4j6j5j6j6J0Rk0K3L6n1n3L3O1k5p2p1RRN2N2mnnmk7k7k7k7L6L7L6L7L7
-340c08L6l5l5m8m8N2N2L9L8r0r0J3J3J3J4J5J6J6J6k2k3k2k3J7J7J7J7l6l6l6l6J1J1J0J1
-344d44popoL2L2L1L2Q9Q8m1m0o8o7k5k4k7k7k7k7Q0Q0QQL7L7l5l4k4k4k4k3ppopN6N6j6j5
-349c99K4K5j8j9L3L3o8o7L4L4L5L4ONONJ8J7n4n5N2N3RRn1n1qqj6j7j7j7kjkkRJ0RRK5K5
-354c53K5K5J%%%j0j0rj0L7L7L6L7n1n2r9j4L5L4L5L4jq7l9l9M1M1M1M1j5j5K3K2O0k7m9n0
$$ plain form
-359 -325 -293 -261 -272 -283 -306 -329 -396 -462 -402 -342 -325 -308 -364 -420 -475 -531 -521 -511 -464 -417 -333 -335 -469 -603 -608 -527 -483 -525 -556 -500 -456 -411 -407 -403 -399 -396 -465
-364 -465 -535 -552 -484 -447 -410 -422 -348 -248 -235 -297 -359 -388 -417 -446 -475 -430 -385 -339 -294 -302 -311 -319 -328 -318 -309 -371 -433 -462 -492 -478 -465 -401 -337 -374 -410 -452 -493
-368 -493 -462 -432 -402 -371 -384 -396 -346 -297 -399 -502 -560 -531 -480 -428 -366 -303 -340 -377 -369 -361 -396 -430 -410 -389 -368 -347 -312 -277 -342 -407 -388 -369 -350 -331 -301
-372 -301 -270 -311 -352 -322 -293 -334 -376 -330 -285 -282 -279 -224 -169 -186 -202 -266 -329 -320 -312 -321 -329 -295 -261 -268 -276 -284 -291 -294 -297 -371 -445 -449 -452 -413 -374 -358 -342 -426 -510 -477 -445 -483
-378 -483 -522 -496 -469 -443 -417 -357 -298 -310 -322 -322 -321 -363 -405 -407 -409 -411 -413 -378 -344 -381 -418 -393 -368 -387 -405 -365 -325 -329 -332 -358 -383 -452 -521 -508 -495 -482 -469 -510 -551
-382 -551 -520 -490 -464 -438 -412 -386 -395 -403 -412 -421 -399 -377 -355 -333 -311 -289 -267 -244 -294 -344 -394 -443 -404 -364 -324 -284 -325 -365 -405 -445 -461 -476 -448 -421 -389 -357 -397
-387 -397 -437 -427 -418 -406 -394 -377 -317 -301 -372 -480 -546 -538 -488 -456 -467 -495 -522 -466 -410 -397 -384 -360 -337 -357 -377 -365 -352 -340 -327 -371 -415 -454 -493 -496 -412 -327
-391 -327 -327 -339 -309 -281 -296 -344 -348 -353 -400 -427 -411 -419 -427 -444 -418 -363 -393 -416 -352 -317 -326 -312 -299 -277 -341 -433 -439 -399 -359 -335 -310 -328 -389 -430 -385 -340 -381 -435
$$ packed form
-359c25L2L2j1j1k3k3o7o6O0O0J7J7n6n6n5n6J0J0M7M7Q4kj34j34nQ1M4m2l1N6M4M5MMMLo9
-364d65p0j7O8L7L7j2P4J00J3o2o2k9k9k9k9M5M5M6M5qrqrJ0Ro2o2k9l0J4J3O4O4l7l6m2m1
-368d93L1L0L0L1j3j2N0M9j02j03n8K9N1N2O2O3l7l7QQl5l4K0K1K1K1L5L5o5o5J9J9J9J9L0
-372c01L1m1m1L0K9m1m2M6M5LLN5N5j7j6o4o3RQrqL4L4pqqpllp4p4mlL9L9J6J6q4q4L3L2l8
-378d83l9K6K7K6K6O0N9j2j2%Jm2m2kkkkL5L4l7l7K5K5j9j8M0M0mlk6k5o9o9J3J3J3J3m1m1
-382e51L1L0K6K6K6K6rqrrK2K2K2K2K2K2K2K3n0n0n0m9L9M0M0M0m1m0m0m0j6j5K8K7L2L2m0
-387c97m0J0RJ2J2J7O0J6p1j08o6QN0L2j1k8k7N6N6J3J3K4K3k0k0J2J3J2J3m4m4l9l9lQ4Q5
-391c27%j2L0K8j5m8mnm7k7J6qqj7K6N5l0k3O4L5rJ4J3K2o4r2oM0M0K4K5j8o1m1M5M5m1n4
$$ plain form
-396 -435 -446 -387 -328 -331 -335 -339 -343 -289 -236 -231 -313 -366 -376 -362 -435 -473 -426 -409 -434 -439 -443 -420 -441 -465 -404 -343 -368 -393 -374 -359 -386 -394 -359 -299 -326 -387 -406 -383 -360
-401 -360 -359 -358 -358 -357 -279 -201 -192 -325 -472 -476 -440 -405 -439 -473 -464 -455 -445 -434 -424 -413 -410 -408 -405 -402 -450 -499 -475 -452 -438 -423 -409 -395 -369 -344 -319 -294 -355 -416 -377 -338
-406 -338 -331 -324 -360 -396 -375 -354 -334 -313 -327 -342 -356 -370 -375 -380 -385 -390 -392 -394 -396 -398 -389 -380 -328 -276 -350 -425 -400 -375 -382 -390 -397 -405 -449 -493 -542 -506 -412 -319 -320 -321 -305 -289 -340 -390
-411 -390 -452 -428 -404 -466 -511 -556 -506 -456 -358 -259 -235 -298 -406 -428 -404 -379 -364 -349 -335 -320 -318 -317 -334 -436 -512 -503 -446 -390 -350 -310 -288 -351 -447 -457 -449 -440
-415 -440 -474 -508 -442 -376 -362 -348 -286 -310 -374 -438 -436 -434 -493 -552 -510 -469 -469 -469 -469 -469 -481 -493 -506 -518 -543 -568 -522 -475 -494 -514 -490 -466 -449 -431 -414 -397 -384 -372
-420 -372 -317 -262 -223 -183 -144 -105 -233 -361 -360 -359 -350 -342 -261 -180 -242 -303 -321 -339 -378 -418 -415 -411 -389 -366 -272 -177 -203 -229 -254 -280 -329 -378 -428 -477 -516 -554 -550
-425 -550 -546 -532 -517 -460 -403 -453 -502 -509 -515 -467 -419 -371 -322 -379 -436 -392 -348 -321 -294 -339 -384 -417 -450 -440 -430 -400 -369 -339 -309 -389 -470 -393 -316 -320 -324 -329 -333 -357
-429 -357 -381 -405 -429 -431 -433 -392 -350 -383 -415 -447 -479 -495 -511 -455 -399 -424 -448 -473 -498 -514 -530 -446 -362 -390 -419 -404 -390 -388 -387 -385 -384 -404 -424 -401 -378 -396 -413 -431
$$ packed form
-396d35j1N9N9lmmmN4N3Nq2n3j0J4p3l8M7J7k5nmK3k1k4O1O1k5k5J9J5k7qL5O0k7o1j9K3K3
-401c60JJ%JP8P8Rj33j47mL6L5l4l4RRJ0J1J0J1LKLLm8m9K4K3J4J5J4J4K6K5K5K5o1o1L9L9
-406c38PPl6l6K1K1K0K1j4j5j4j4nnnnkkkkRRN2N2p4p5K5K5pqpqm4m4m9L6R4R3jjJ6J6n1n0
-411c90o2K4K4o2m5m5N0N0R8R9K4o3j08k2K4K5J5J5J4J5KJj7j02p6RN7N6M0M0K2o3r6j0QR
-415d40l4l4O6O6J4J4O2k4o4o4KKn9n9M2M1%%%%j2j2j3j2k5k5M6M7j9k0K4K4J7J8J7J7J3J2
-420c72N5N5L9M0L9L9j28j28JJRQQ1Q1o2o1j8j8l9m0LMK2K3R4R5k6k6k5k6m9m9n0m9l9l8M
-425e50MJ4J5N7N7n0m9poM8M8M8M9n7n7M4M4K7K7m5m5l3l3J0J0L0L1L0L0q0q1P7P7mmnmk4
-429c57k4k4k4kkM1M2l3l2l2l2j6j6N6N6k5k4k5k5j6j6Q4Q4k8k9J5J4KJKJk0k0K3K3j8j7j8
$$ plain form
-434 -431 -448 -458 -467 -353 -239 -273 -393 -397 -257 -143 -173 -290 -321 -313 -305 -292 -278 -308 -337 -367 -396 -390 -385 -422 -459 -444 -430 -343 -257 -256 -255 -253 -252 -328 -404 -456 -423
-438 -423 -394 -365 -331 -298 -353 -409 -470 -445 -427 -410 -387 -364 -348 -332 -272 -213 -279 -345 -394 -356 -314 -358 -392 -425 -426 -426 -427 -427 -405 -382 -359 -337 -380 -423 -342 -262 -243
-443 -243 -310 -372 -434 -460 -486 -418 -349 -345 -426 -440 -369 -309 -335 -361 -301 -187 -158 -234 -309 -359 -409 -365 -320 -283 -332 -382 -345 -268 -192 -210 -228 -270 -311 -353 -395
-447 -395 -399 -404 -366 -328 -353 -379 -404 -430 -420 -411 -401 -392 -345 -298 -337 -376 -359 -342 -325 -308 -369 -431 -412 -393 -368 -429 -489 -464 -408 -352 -377 -402 -427 -452 -391 -330 -323
-452 -323 -316 -309 -302 -316 -329 -342 -356 -369 -383 -396 -410 -421 -432 -491 -465 -464 -462 -509 -470 -430 -476 -516 -470 -396 -322 -328 -334 -289 -243 -283 -324 -348 -372 -396 -420 -473 -526 -493
-456 -493 -459 -442 -425 -408 -391 -427 -464 -500 -536 -490 -444 -398 -351 -348 -344 -346 -348 -333 -405 -482 -473 -390 -393 -428 -464 -445 -427 -408 -390 -373 -356 -339 -322 -407 -492 -491 -490 -491 -493 -499
-461 -499 -506 -514 -609 -658 -565 -461 -500 -584 -583 -518 -454 -470 -486 -465 -445 -424 -403 -420 -437 -503 -482 -381 -279 -258 -237 -209 -181 -239 -297 -355 -413 -472 -530 -520 -511
-465 -511 -501 -491 -523 -554 -548 -456 -395 -333 -352 -371 -404 -438 -471 -504 -459 -414 -374 -333 -243 -238 -270 -303 -325 -347 -417 -401 -355 -308 -342 -377 -368 -359 -350 -342 -305 -269 -313 -357
$$ packed form
-434d31j7j0rJ14J14l4j20mJ40J14l0j17l1QQJ3J4l0k9l0k9ONl7l7J5J4Q7Q6JJKJp6p6n2L3
-438d23K9K9L4L3n5n6o1K5J8J7K3K3J6J6O0N9o6o6m9L8M2m4l4l3j%j%K2K3K3K2m3m3Q1Q0J9
-443b43o7o2o2k6k6O8O9Mq1j4P1O0k6k6O0J14K9p6p5n0n0M4M5L7m9n0L7P7P6j8j8m2m1m2m2
-447c95mnL8L8k5k6k5k6J0RJ0RM7M7l9l9J7J7J7J7o1o2J9J9K5o1o0K5N6N6k5k5k5k5O1O1P
-452c23PPPj4j3j3j4j3j4j3j4j1j1n9K6JKm7L9M0m6m0M6P4P4ooM5M6m0m1k4k4k4k4n3n3L3
-456d93L4J7J7J7J7l6l7l6l6M6M6M6M7LMkkJ5p2p7RQ3ll5l6J9J8J9J8J7J7J7J7q5q5JJjko
-461d99pqr5m9R3J04l9q4JO5O4j6j6K1K0K1K1j7j7o6K1J01J02K1K1K8K8n8n8n8n8n9n8J0R
-465e11J0J0l2l1OR2O1O2j9j9l3l4l3l3M5M5M0M1R0Nl2l3k2k2p0J6M6M7l4l5RRRQL7L6m4m4
$$ plain form
-470 -357 -411 -378 -308 -237 -230 -222 -215 -207 -234 -261 -287 -314 -303 -293 -282 -271 -327 -383 -358 -333 -322 -396 -476 -470 -383 -382 -414 -445 -454 -462 -471 -479 -468 -457 -499 -455 -358 -346 -367 -387
-475 -387 -340 -292 -330 -369 -385 -402 -504 -607 -567 -528 -495 -461 -312 -250 -339 -428 -455 -482 -509 -535 -465 -394 -409 -424 -411 -398 -384 -371 -272 -173 -217 -262 -279
-479 -279 -297 -400 -504 -437 -370 -389 -408 -371 -334 -377 -421 -424 -342 -303 -349 -330 -310 -291 -357 -355 -353 -356 -359 -365 -371 -377 -383 -410 -438 -465 -493 -491 -489 -487 -485 -410 -335 -255 -261 -328 -395
-484 -395 -373 -265 -200 -135 -151 -166 -214 -261 -309 -357 -369 -382 -395 -407 -398 -388 -378 -368 -368 -368 -410 -453 -444 -434 -511 -588 -586 -584 -625 -666 -632 -599 -566 -532 -478 -424 -456
-489 -456 -488 -471 -455 -438 -422 -437 -451 -466 -481 -440 -398 -394 -476 -502 -527 -515 -503 -429 -355 -287 -218 -200 -269 -423 -491 -418 -345 -413 -567 -584 -516 -452 -475 -462
-493 -462 -449 -441 -433 -389 -344 -332 -406 -437 -382 -380 -379 -374 -369 -396 -509 -554 -513 -440 -367 -370 -373 -377 -380 -381 -382 -383 -383 -357 -331 -347 -364 -323 -283 -323 -363 -393 -337 -286 -236 -235 -233 -232 -231
-498 -231 -227 -224 -221 -218 -239 -261 -283 -305 -326 -347 -368 -390 -365 -341 -349 -442 -509 -490 -476 -462 -476 -405 -339 -274 -296 -319 -341 -364 -410 -455 -415 -375 -338 -301 -307 -313 -279 -245
-503 -245 -348 -452 -422 -307 -294 -424 -492 -416 -339 -347 -324 -302 -274 -332 -401 -384 -334 -285 -250 -215 -179 -144 -222 -299 -371 -444 -504 -478 -495 -512 -492 -387 -330
$$ packed form
-470c57n4L3P0P1PQPQk7k7k6k7J1J0J1J1n6n6K5K5J1p4q0OQ7Jl2l1rqrqJ1J1m2M4R7J2k1k0
-475c87M7M8l8l9j6j7j02j03M0L9L3L4J49O2q9q9k7k7k7k6P0P1j5j5J3J3J4J3R9R9m4m5j7
-479b79j8j03j04O7O7j9j9L7L7m3m4lQ2L9m6J9K0J9o6KKllooook7k8k7k8KKKKP5P5Q0oo7o7
-484c95K2J08O5O5j6j5m8m7m8m8j2j3j3j2RJ0J0J0%%m2m3RJ0p7p7KKm1m1L4L3L3L4N4N4l2
-489d56l2J7J6J7J6j5j4j5j5M1M2Mq2k6k5J2J2P4P4O8O9J8o9j54o8P3P3o8j54j7O8O4k3J3
-493d62J3QQM4M5J2p4l1N5KJNNk7j13m5M1P3P3llmljjj%K6K6j6j7M1M0m0m0l0N6N1N0JKJJ
-498b31MLLLk1k2k2k2k1k1k1k2K5K4qr3o7J9J4J4j4P1O6O5k2k3k2k3m6m5M0M0L7L7ooL4L4
-503b45j03j04L0J15J3j30o8P6P7qK3K2K8n8o9J7N0M9L5L5L6L5p8p7p2p3o0K6j7j7K0J05N7
$$ plain form
-507 -330 -273 -264 -256 -243 -315 -403 -491 -498 -505 -486 -468 -449 -431 -418 -405 -343 -368 -426 -484 -461 -439 -418 -397 -376 -356 -352 -349 -346 -342 -401 -459 -512 -565 -614 -577 -488 -399 -353 -308
-511 -308 -310 -397 -473 -464 -412 -445 -518 -505 -417 -329 -413 -498 -511 -524 -520 -516 -441 -365 -381 -398 -414 -431 -447 -464 -480 -496 -446 -396 -418 -439 -476 -513 -478 -443 -462 -481 -457
-516 -457 -433 -411 -388 -366 -344 -369 -394 -419 -444 -469 -494 -519 -544 -543 -543 -542 -541 -497 -452 -408 -363 -422 -482 -469 -457 -443 -429 -457 -486 -494 -502 -510 -517 -503 -488 -474 -459 -459 -459 -459
-521 -459 -458 -447 -436 -426 -415 -412 -409 -407 -404 -401 -399 -391 -382 -397 -325 -301 -278 -309 -341 -373 -405 -410 -414 -419 -423 -410 -396 -383 -369 -369 -369 -369 -370 -363 -357 -351 -345 -307 -270 -250 -317 -410 -417 -378 -339 -362
-526 -362 -385 -408 -431 -406 -381 -408 -506 -583 -530 -402 -316 -317 -317 -320 -323 -309 -294 -280 -265 -254 -242 -230 -219 -327 -435 -414 -394 -375 -356 -337 -318 -260 -202 -216 -230
-531 -230 -301 -373 -345 -316 -280 -244 -251 -258 -288 -319 -349 -379 -390 -401 -412 -423 -450 -478 -406 -333 -347 -361 -374 -388 -370 -352 -334 -316 -356 -395 -434 -474 -521 -568 -544 -520
-535 -520 -509 -498 -487 -477 -528 -580 -532 -483 -516 -548 -581 -613 -557 -501 -445 -388 -380 -372 -364 -356 -384 -411 -368 -324 -373 -423 -401 -380 -380 -381 -381 -382 -377 -372 -324 -276 -263 -250 -308 -367
-540 -367 -468 -569 -513 -456 -468 -480 -491 -503 -511 -519 -527 -535 -496 -458 -419 -381 -365 -349 -333 -317 -370 -422 -474 -526 -464 -402 -340 -278 -271 -265 -259 -252 -337 -421 -420 -418 -403 -388 -411
$$ packed form
-507c30N7RQJ3p2q8q8ppJ9J8J9J8J3J3O2k5n8n8K3K2K1K1K1K0MLLMn9n8n3n3m9L7Q9Q9M6M5
-511c08kq7p6RN2l3p3J3Q8Q8q4q5j3j3MMP5P6j6j7j6j7j6j7j6j6N0N0k2k1l7l7L5L5j9j9K4
-516d57K4K2K3K2K2k5k5k5k5k5k5k5k5J%JJM4M5M4M5n9o0J3J2J4J4k8k9qqqpJ4J5J4J5%%%
-521d59JJ1J1J0J1LLKLLKQRj5P2K4K3l1l2l2l2nmnmJ3J4J3J4%%%jPOOOL8L7K0o7r3pL9L9k3
-526c62k3k3k3K5K5k7r8p7N3J28Q6j%llJ4J5J4J5J1J2J2J1j08j08K1K0J9J9J9J9N8N8j4j4
-531b30p1p2K8K9L6L6ppl0l1l0l0j1j1j1j1k7k8P2P3j4j4j3j4J8J8J8J8m0l9l9m0m7m7K4K4
-535e20J1J1J1J0n1n2M8M9l3l2l3l2N6N6N6N7QQQQk8k7M3M4m9n0K2K1%j%jNNM8M8J3J3n8n9
-540c67j01j01N6N7j2j2j1j2qqqqL9L8L9L8J6J6J6J6n3n2n2n2O2O2O2O2POOPq5q4JKJ5J5k3
$$ plain form
-545 -411 -434 -485 -450 -377 -304 -379 -453 -532 -526 -474 -422 -365 -308 -302 -297 -281 -350 -449 -462 -386 -309 -373 -437 -412 -300 -251 -287 -355 -423 -422 -421 -376 -332 -409 -487 -570 -568
-549 -568 -536 -505 -468 -431 -512 -593 -580 -480 -445 -409 -292 -174 -96 -160 -279 -312 -308 -305 -296 -288 -301 -314 -327 -340 -398 -457 -430 -402 -412 -423 -390 -357 -385 -413 -446
-554 -446 -393 -342 -290 -319 -347 -416 -485 -416 -348 -310 -358 -406 -368 -310 -252 -275 -298 -348 -398 -362 -327 -368 -409 -370 -330 -299 -354 -361 -368 -373 -379 -396 -326 -228 -215 -235 -255
-558 -255 -343 -431 -486 -456 -375 -381 -376 -370 -325 -279 -320 -360 -332 -305 -278 -250 -287 -324 -329 -248 -172 -182 -225 -267 -325 -382 -397 -411 -422 -432 -442 -452 -420 -388 -356 -324 -316
-563 -316 -308 -300 -292 -268 -245 -264 -284 -395 -506 -527 -462 -398 -419 -478 -451 -402 -354 -306 -257 -204 -237 -308 -378 -380 -381 -383 -384 -360 -337 -399 -461 -431 -401 -370 -340 -395 -451
-567 -451 -474 -412 -337 -349 -392 -436 -445 -453 -462 -471 -452 -434 -458 -483 -535 -588 -551 -427 -325 -309 -382 -455 -495 -535 -489 -443 -446 -450 -496 -542 -554 -565 -576 -588 -618 -649 -594
-572 -594 -538 -566 -594 -590 -500 -445 -477 -546 -530 -459 -389 -356 -324 -311 -298 -286 -273 -331 -389 -447 -505 -458 -411 -363 -316 -290 -263 -308 -353 -367 -380 -394 -408 -437 -467
-576 -467 -497 -526 -541 -556 -528 -414 -292 -313 -406 -499 -445 -391 -380 -369 -333 -297 -260 -224 -275 -326 -376 -427 -438 -450 -461 -472 -493 -515 -536 -557 -517 -477 -438 -398
$$ packed form
-545d11k3n1L5P3P3p5p4p9ON2N2N7N7ONJ6o9r9j3P6P7o4o4K5J12M9l6o8o8JJM5M4p7p8q3K
-549e68L2L1L7L7q1q1J3J00L5L6J17J18P8o4j19l3MLRQj3j3j3j3n8n9K7K8j0j1L3L3k8k8l3
-554d46N3N1N2k9k8o9o9O9O8L8m8m8L8N8N8k3k3n0n0L6L5m1m1L9M0L1n5ppnoj7P0R8J3k0k0
-558b55q8q8n5L0Q1oNOM5M6m1m0K8K7K7K8l7l7nQ1P6j0m3m2n8n7j5j4j1j0j0j0L2L2L2L2Q
-563c16QQQK4K3j9k0j11j11k1O5O4k1n9K7M9M8M8M9N3l3p1p0kjkjK4K3o2o2L0L0L1L0n5n6
-567d51k3O2P5j2m3m4rqrrJ9J8k4k5n2n3L7J24J02J6p3p3m0m0M6M6lmm6m6j2j1j1j2l0l1N5
-572e94N6k8k8MR0N5l2o9J6P1P0L3L2J3J3J2J3n8n8n8n8M7M7M8M7K6K7m5m5j4j3j4j4k9l0
-576d67l0k9j5j5K8J14J22k1r3r3N4N4J1J1L6L6L7L6n1n1n0n1j1j2j1j1k1k2k1k1M0M0L9M0
$$ plain form
-580 -398 -383 -368 -353 -338 -350 -363 -375 -388 -328 -268 -365 -462 -486 -510 -462 -415 -421 -428 -434 -441 -456 -471 -487 -502 -487 -473 -501 -529 -458 -387 -416 -445 -528 -612 -566 -521 -486
-585 -486 -451 -488 -525 -458 -391 -395 -400 -404 -409 -342 -275 -319 -364 -336 -309 -277 -246 -286 -325 -358 -391 -424 -457 -465 -473 -481 -489 -445 -401 -400 -399 -333 -268 -274 -280 -274 -268 -263 -257 -299 -341 -282 -224
-590 -224 -207 -190 -245 -300 -284 -268 -295 -322 -305 -287 -270 -253 -325 -397 -398 -398 -405 -411 -417 -423 -405 -387 -441 -495 -497 -499 -429 -359 -320 -281 -370 -460 -456 -452 -404 -357 -397 -438 -521 -605
-595 -605 -681 -758 -677 -596 -540 -484 -471 -458 -409 -359 -381 -403 -328 -254 -337 -419 -469 -518 -524 -531 -456 -380 -377 -373 -353 -333 -313 -293 -326 -358 -320 -281 -230 -179 -258 -336 -359
-599 -359 -381 -361 -341 -361 -381 -358 -335 -314 -293 -315 -337 -416 -495 -474 -453 -343 -233 -252 -271 -294 -318 -341 -365 -293 -222 -251 -280 -278 -276 -273 -271 -284 -297 -382 -467 -474
-604 -474 -481 -417 -353 -313 -272 -390 -507 -498 -489 -481 -472 -544 -617 -604 -590 -525 -459 -479 -500 -525 -551 -576 -602 -545 -487 -516 -544 -535 -526 -517 -507 -474 -440 -406 -372 -351 -330 -395
-608 -395 -459 -459 -459 -459 -458 -451 -444 -436 -429 -403 -377 -438 -498 -451 -403 -442 -481 -447 -414 -381 -347 -325 -302 -365 -429 -440 -451 -462 -473 -472 -470 -383 -296 -245 -195 -288 -380 -393 -405 -417
-613 -417 -429 -357 -285 -299 -312 -387 -462 -450 -439 -491 -543 -595 -647 -640 -632 -625 -618 -560 -502 -444 -385 -381 -376 -372 -367 -396 -424 -453 -481 -473 -466 -373 -279 -260 -241 -308 -375 -355 -336 -317
$$ packed form
-580c98J5J5J5J5j2j3j2j3O0O0r7r7k4k4M8M7opopj5j5j6j5J5J4k8k8P1P1k9k9q3q4M6M5L5
-585d86L5l7l7O7O7mnmnO7O7m4m5K8K7L2L1m0l9l3l3l3l3qqqqM4M4JJO6O5ooOONOm2m2N9N8
-590b24J7J7n5n5J6J6k7k7J7J8J7J7p2p2j%poooJ8J8n4n4kkP0P0L9L9q9r0MMM8M7m0m1q3q4
-595f05p6p7Q1Q1N6N6J3J3M9N0k2k2P5P4q3q2n0m9opP5P6LMK0K0K0K0l3l2L8L9N1N1p9p8k3
-599c59k2K0K0k0k0K3K3K1K1k2k2p9p9K1K1J10J10j9j9k3k4k3k4P2P1k9k9KKLKj3j3q5q5p
-604d74pO4O4M0M1j18j17RRQRp2p3J3J4O5O6k0k1k5k6k5k6N7N8k9k8RRRJ0L3L4L4L4K1K1o5
-608c95o4%%%JPPQPK6K6o1o0M7M8l9l9L4L3L3L4K2K3o3o4j1j1j1j1JKQ7Q7N1N0r3r2j3j2j2
-613d17j2P2P2j4j3p5p5J2J1n2n2n2n2PQPPN8N8N8N9MNMNk9k8k9k8QPR3R4J9J9o7o7K0J9J9
$$ plain form
-618 -317 -298 -340 -383 -425 -467 -420 -372 -325 -278 -274 -270 -266 -262 -210 -158 -243 -329 -367 -320 -269 -305 -345 -342 -369 -395 -433 -471 -479 -530 -533 -450 -394 -381 -416 -451 -489 -527 -505
-623 -505 -482 -459 -436 -444 -451 -459 -466 -426 -385 -344 -303 -285 -266 -327 -389 -431 -387 -341 -380 -420 -417 -438 -459 -477 -409 -336 -349 -364 -293 -249 -248 -257 -224 -169 -200 -238 -276 -319
-627 -319 -362 -353 -344 -336 -327 -374 -421 -382 -343 -344 -344 -345 -345 -284 -223 -252 -367 -473 -494 -401 -351 -361 -371 -384 -397 -420 -444 -467 -491 -511 -532 -467 -401 -384 -367 -350 -333 -361
-632 -361 -388 -386 -427 -441 -369 -324 -321 -350 -379 -407 -436 -421 -363 -278 -279 -348 -374 -343 -313 -328 -343 -358 -373 -398 -423 -448 -472 -451 -429 -407 -385 -388 -390 -393 -395 -367 -339 -397
-637 -397 -455 -477 -498 -520 -542 -537 -531 -526 -521 -520 -520 -519 -519 -500 -482 -463 -445 -423 -401 -378 -356 -379 -402 -424 -447 -424 -402 -465 -528 -544 -561 -491 -422 -391 -359 -328 -297 -285 -274
-642 -274 -262 -250 -269 -289 -308 -327 -384 -441 -412 -383 -367 -351 -336 -320 -353 -385 -418 -451 -442 -433 -424 -414 -448 -482 -430 -378 -331 -284 -322 -361 -373 -384 -396 -408 -441 -474
-646 -474 -420 -367 -363 -358 -353 -348 -354 -359 -365 -370 -357 -345 -332 -320 -306 -292 -278 -264 -282 -301 -319 -338 -329 -321 -312 -303 -417 -530 -500 -470 -370 -271 -314 -358 -351 -345 -338 -331 -326 -320 -314 -309 -283
-651 -283 -258 -233 -207 -303 -398 -350 -302 -360 -418 -475 -533 -503 -473 -442 -412 -441 -470 -413 -356 -346 -336 -326 -316 -296 -275 -255 -234 -280 -326 -286 -247 -303 -360 -331 -302
$$ packed form
-618c17J9m2m3m2m2M7M8M7M7MMMMN2N2q5q6l8M7N1l6m0Lk7k6l8l8qn1lQ3N6J3l5l5l8l8K2
-623e05K3K3K3qpqpM0M1M1M1J8J9o1o2m2M4M6l9m0Lk1k1j8O8P3j3j5P1M4JrL3N5l1l8l8m3
-627c19m3RRQRm7m7L9L9j%j%O1O1k9j15j06k1R3N0j0j0j3j3k3k4k3k4k0k1O5O6J7J7J7J7k8
-632c61k7Km1j4P2M5Lk9k9k8k9J5N8Q5jo9k6L1L0j5j5j5j5k5k5k5k4K1K2K2K2lklkK8K8n8
-637c97n8k2k1k2k2NONNJ%J%J9J8J9J8K2K2K3K2k3k3k2k3K3K2o3o3j6j7P0O9L1L2L1L1J2J1
-642b74J2J2j9k0j9j9n7n7K9K9J6J6J5J6l3l2l3l3RRRJ0l4l4N2N2M7M7l8l9j2j1j2j2l3l3
-646d74N4N3MNNNononJ3J2J3J2J4J4J4J4j8j9j8j9RQRRj14j13L0L0J00R9m3m4POPPNOONK6
-651b83K5K5K6r6r5M8M8n8n8n7n8L0L0L1L0k9k9N7N7J0J0J0J0K0K1K0K1m6m6M0L9n6n7K9K9
$$ plain form
-655 -302 -359 -416 -472 -529 -554 -578 -517 -455 -465 -474 -483 -492 -496 -500 -504 -508 -496 -484 -472 -460 -492 -525 -558 -590 -514 -437 -446 -455 -434 -413 -391 -370 -420 -470 -520 -569 -481 -393 -305
-660 -305 -217 -304 -391 -392 -393 -410 -427 -444 -461 -457 -452 -447 -442 -462 -482 -502 -522 -505 -488 -471 -453 -447 -440 -434 -427 -426 -425 -423 -422 -474 -527 -493 -459 -425 -390 -441 -492 -458 -423 -388 -354 -368
-665 -368 -383 -397 -412 -457 -502 -461 -420 -406 -392 -379 -365 -412 -459 -421 -382 -384 -385 -387 -389 -446 -503 -408 -314 -242 -256 -293 -330 -364 -398 -389 -380 -443 -506 -445 -385 -346 -393 -391
-670 -391 -390 -397 -405 -412 -420 -449 -479 -437 -395 -381 -367 -354 -340 -420 -500 -505 -424 -328 -318 -355 -391 -403 -415 -383 -352 -397 -442 -412 -296 -221 -233 -290 -348 -339 -331 -365 -400 -478
-675 -478 -556 -583 -523 -514 -505 -539 -488 -429 -369 -310 -251 -215 -264 -336 -409 -364 -320 -275 -230 -264 -298 -331 -365 -352 -339 -369 -399 -442 -484 -455 -425 -428 -431 -434 -436 -428 -419 -410 -402 -328
-680 -328 -255 -205 -242 -283 -325 -301 -277 -315 -353 -391 -430 -388 -346 -304 -262 -337 -412 -414 -417 -427 -436 -398 -275 -187 -184 -228 -273 -315 -357 -399 -441 -460 -478 -497 -516 -543
-684 -543 -570 -526 -481 -481 -482 -482 -482 -410 -339 -339 -339 -426 -513 -499 -486 -444 -402 -403 -405 -427 -450 -429 -409 -327 -244 -319 -394 -391 -388 -385 -382 -424 -465 -435 -405 -456 -506 -485 -464 -416 -367
-689 -367 -319 -270 -321 -372 -423 -474 -453 -432 -411 -390 -401 -412 -423 -435 -407 -379 -351 -323 -328 -332 -337 -341 -329 -316 -303 -291 -332 -373 -414 -455 -447 -439 -431 -422 -439 -456 -473 -490 -495
$$ packed form
-655c02n7n7n6n7k5k4O1O2j0rrrmmmmJ2J2J2J2l2l3l3l2P6P7rrK1K1K2K1n0n0n0m9Q8Q8Q8
-660c05Q8q7q7jjj7j7j7j7MNNNk0k0k0k0J7J7J7J8OPOPJJKJn2n3L4L4L4L5n1n1L4L5L5L4j4
-665c68j5j4j5m5m5M1M1J4J4J3J4m7m7L8L9kjkkn7n7R5R4P2j4l7l7l4l4RRo3o3O1O0L9m7K
-670c91Jpqpqk9l0M2M2J4J4J3J4q0q0nQ1R6J0l7l6j2j2L2L1m5m5L0J16P5j2n7n8RQl4l5p8
-675d78p8k7O0RRl4N1N9O0N9N9L6m9p2p3M5M4M5M5l4l4l3l4J3J3l0l0m3m2K9L0lllkQRRQP4
-680c28P3N0l7m1m2K4K4l8l8l8l9M2M2M2M2p5p5klj0rL8J23Q8Lm4m5m2m2m2m2j9j8j9j9k7
-684e43k7M4M5%j%%P2P1%%q7q7J4J3M2M2jkk2k3K1K0Q2Q3p5p5LLLLm2m1L0L0n1n0K1K1M8M9
-689c67M8M9n1n1n1n1K1K1K1K1j1j1j1j2K8K8K8K8nmnmJ2J3J3J2m1m1m1m1QQQRj7j7j7j7n
$$ plain form
-694 -495 -500 -505 -511 -462 -413 -365 -316 -372 -427 -483 -538 -520 -501 -482 -463 -371 -278 -314 -350 -393 -436 -406 -377 -338 -299 -360 -421 -425 -429 -390 -350 -385 -419 -410 -402 -425 -449 -472
-698 -472 -496 -493 -490 -487 -484 -470 -457 -443 -430 -419 -408 -398 -387 -366 -344 -323 -301 -340 -379 -418 -457 -440 -422 -505 -588 -589 -589 -590 -590 -536 -482 -499 -517 -461 -405 -421 -437 -460 -483
-703 -483 -434 -386 -372 -359 -388 -418 -447 -476 -463 -449 -410 -370 -402 -434 -463 -492 -450 -408 -429 -451 -472 -494 -443 -392 -413 -434 -472 -510 -505 -501 -473 -445 -460 -475 -439 -403
-708 -403 -439 -475 -432 -388 -387 -387 -412 -438 -464 -490 -436 -382 -399 -417 -405 -392 -452 -511 -492 -474 -498 -522 -516 -510 -504 -498 -482 -465 -448 -431 -484 -537 -548 -558 -483 -408 -433 -458
-712 -458 -518 -579 -538 -498 -472 -445 -418 -391 -398 -404 -482 -560 -514 -467 -521 -575 -492 -409 -398 -386 -402 -417 -433 -448 -444 -440 -436 -432 -408 -385 -404 -423 -342 -261 -252 -242 -250 -257 -365
-717 -365 -473 -467 -460 -454 -447 -417 -388 -358 -328 -375 -422 -397 -373 -346 -318 -391 -464 -492 -520 -476 -432 -427 -421 -416 -410 -379 -347 -358 -369 -375 -382 -460 -538 -460 -382 -405 -427 -427 -427 -427 -427
-722 -427 -349 -272 -266 -261 -273 -285 -297 -310 -273 -236 -271 -307 -313 -319 -426 -533 -493 -454 -415 -375 -374 -373 -373 -372 -392 -413 -434 -454 -381 -307 -306 -304 -349 -394 -439 -484 -472 -461 -449
-727 -449 -438 -448 -459 -469 -479 -493 -507 -478 -449 -407 -365 -395 -425 -452 -480 -435 -391 -354 -316 -279 -241 -285 -328 -371 -414 -383 -352 -364 -376 -438 -501 -493 -484 -462 -440 -460
$$ packed form
-694d95nnoM9M9M8M9n6n5n6n5J8J9J9J9R2R3l6l6m3m3L0K9L9L9o1o1mmL9M0l5l4RQk3k4k3
-698d72k4LLLLJ4J3J4J3J1J1J0J1K1K2K1K2l9l9l9l9J7J8q3q3j%j%N4N4j7j8N6N6j6j6k3k3
-703d83M9M8J4J3k9l0k9k9J3J4L9M0l2l2k9k9M2M2k1k2k1k2N1N1k1k1l8l8NMK8K8j5j5L6L6
-708d03l6l6M3M4J%k5k6k6k6N4N4j7j8J2J3o0n9J9J8k4k4OOOOJ6J7J7J7n3n3j1j0P5P5k5k5
-712d58o0o1M1M0K6K7K7K7pop8p8M6M7n4n4Q3Q3J1J2j6j5j6j5MMMMK4K3j9j9Q1Q1RJ0qpj08
-717c65j08OPOPL0K9L0L0m7m7K5K4K7K8p3p3k8k8M4M4NONOL1L2j1j1opp8p8P8P8k3k2%%%%
-722d27P8P7ONj2j2j2j3L7L7l5l6ooj07j07M0L9L9M0JJ%Jk0k1k1k0P3P4JKm5m5m5m5J2J1J2
-727d49J1j0j1j0j0j4j4K9K9M2M2l0l0k7k8M5M4L7L8L7L8m4m3m3m3L1L1j2j2o2o3QRK2K2k0
$$ plain form
-731 -460 -481 -455 -430 -447 -464 -473 -482 -419 -356 -362 -368 -374 -380 -361 -341 -451 -560 -540 -521 -502 -482 -511 -540 -525 -511 -444 -377 -382 -386 -382 -379 -418 -457 -452 -446 -441 -435 -414 -393 -372 -351
-736 -351 -334 -318 -301 -284 -265 -246 -298 -351 -387 -423 -416 -410 -437 -464 -492 -519 -512 -504 -497 -489 -500 -510 -520 -530 -508 -486 -464 -442 -404 -365 -326 -287 -310 -332 -354 -376 -369 -362 -354
-741 -354 -347 -422 -497 -572 -647 -599 -550 -502 -454 -473 -492 -510 -529 -483 -436 -490 -544 -579 -614 -577 -541 -485 -430 -446 -548 -573 -454 -373 -377 -444 -512 -484 -456 -424 -392
-745 -392 -360 -328 -317 -307 -296 -285 -271 -256 -342 -428 -498 -567 -508 -449 -479 -508 -437 -367 -394 -422 -450 -478 -476 -475 -401 -328 -305 -282 -330 -379 -483 -587 -590 -594 -548 -503
-750 -503 -529 -555 -524 -493 -505 -516 -540 -563 -515 -467 -471 -476 -380 -285 -320 -355 -390 -425 -412 -398 -385 -372 -390 -409 -384 -360 -427 -493 -460 -427 -419 -411 -404 -396 -397 -397 -326 -255 -218
-754 -218 -180 -244 -307 -381 -456 -459 -462 -463 -464 -465 -466 -419 -373 -427 -480 -494 -508 -450 -392 -380 -369 -357 -346 -376 -406 -436 -466 -457 -448 -481 -515 -521 -527 -462 -396 -387 -378 -441 -503 -501 -498 -496
-760 -496 -494 -466 -439 -411 -384 -401 -418 -363 -309 -335 -361 -315 -270 -313 -356 -398 -441 -411 -382 -352 -322 -374 -426 -478 -530 -532 -534 -450 -366 -336 -307 -363 -419 -457 -494 -532
-764 -532 -569 -520 -471 -464 -458 -501 -544 -501 -458 -448 -439 -429 -419 -434 -448 -463 -477 -535 -592 -607 -621 -494 -367 -383 -400 -433 -466 -456 -447 -477 -508 -452 -397 -317 -237 -243
$$ packed form
-731d60k1K6K5j7j7rrO3O3ooooJ9K0j10j09K0J9J9K0k9k9J5J4O7O7nmMLl9l9NONOK1K1K1K1
-736c51J7J6J7J7J9J9n2n3l6l6POk7k7k8k7PQPQj1j0j0j0K2K2K2K2L8L9L9L9k3k2k2k2PPQ
-741c54Pp5p5p5p5M8M9M8M8j9j9j8j9M6M7n4n4l5l5L7L6N6N5j6j02k5J19Q1mo7o8K8K8L2L2
-745c92L2L2J1J0J1J1J4J5q6q6p0o9N9N9l0k9P1P0k7k8k8k8KJP4P3K3K3m8m9j04j04lmM6M5
-750e03k6k6L1L1j2j1k4k3M8M8mnR6R5l5l5l5l5J3J4J3J3j8j9K5K4o7o6L3L3QQPQj%P1P1L7
-754b18L8o4o3p4p5lljjjjM7M6n4n3j4j4N8N8J2J1J2J1l0l0l0l0RRl3l4ooO5O6RRo3o2KLK
-760d96KK8K7K8K7j7j7N5N4k6k6M6M5m3m3m2m3L0K9L0L0n2n2n2n2kkQ4Q4L0K9n6n6l8l7l8
-764e32l7M9M9POm3m3M3M3J0RJ0J0j5j4j5j4n8n7j5j4J27J27j6j7l3l3J0Rl0l1N6N5Q0Q0o
$$ plain form
-768 -243 -249 -278 -307 -337 -366 -368 -371 -287 -204 -244 -284 -281 -278 -339 -399 -417 -435 -399 -363 -284 -205 -266 -327 -346 -364 -356 -347 -339 -330 -321 -312 -388 -465 -557 -648 -654 -660 -625 -589 -511 -432
-773 -432 -416 -401 -385 -369 -390 -411 -389 -368 -418 -469 -434 -398 -386 -373 -360 -347 -361 -375 -389 -404 -424 -445 -466 -487 -468 -449 -431 -412 -405 -399 -392 -385 -426 -468 -424 -379 -369
-778 -369 -360 -350 -340 -321 -301 -324 -348 -403 -458 -427 -396 -374 -352 -330 -308 -362 -416 -427 -437 -375 -312 -335 -359 -386 -414 -399 -384 -461 -538 -472 -406 -437 -467 -498 -529
-782 -529 -519 -508 -498 -487 -477 -468 -458 -448 -457 -466 -432 -398 -419 -440 -375 -310 -265 -220 -260 -301 -336 -371 -363 -356 -361 -367 -373 -378 -436 -494 -466 -438 -410 -382 -354 -327 -287 -248 -294
-787 -294 -341 -392 -444 -453 -462 -458 -455 -408 -362 -384 -406 -385 -365 -367 -369 -457 -545 -560 -575 -504 -433 -435 -438 -397 -357 -368 -379 -389 -400 -420 -439 -459 -479 -400 -322 -386 -451 -428 -406
-792 -406 -383 -361 -395 -430 -379 -328 -376 -424 -472 -520 -550 -579 -537 -494 -495 -496 -497 -498 -448 -398 -391 -383 -429 -475 -449 -423 -411 -398 -343 -288 -274 -261 -247 -234 -305 -376 -375 -374 -388
-796 -388 -402 -415 -429 -405 -380 -399 -417 -441 -465 -417 -369 -380 -390 -400 -411 -382 -353 -395 -437 -411 -384 -430 -475 -499 -522 -446 -370 -381 -392 -361 -329 -352 -375 -441 -507
-801 -507 -514 -521 -485 -449 -388 -327 -338 -348 -377 -406 -434 -463 -472 -481 -490 -499 -431 -362 -293 -224 -256 -288 -392 -496 -481 -466 -495 -523 -499 -475 -451 -426 -454 -482 -509 -537 -546
$$ packed form
-768b43ok9k9l0k9klQ4Q3m0m0LLo1o0j8j8L6L6P9P9o1o1j9j8QRQRRRp6p7r2r1ooL5L6P8P9
-773d32J6J5J6J6k1k1K2K1n0n1L5L6J2J3J3J3j4j4j4j5k0k1k1k1J9J9J8J9POPPm1m2M4M5J0
-778c69RJ0J0J9K0k3k4n5n5L1L1K2K2K2K2n4n4j1j0O2O3k3k4k7k8J5J5p7p7O6O6l1l0l1l1
-782e29J0J1J0J1J0RJ0J0rrL4L4k1k1O5O5M5M5m0m1l5l5QPnoonn8n8K8K8K8K8K8K7M0L9m6
-787b94m7n1n2rrMLM7M6k2k2K1K0kkq8q8j5j5P1P1klM1M0j1j1j0j1k0j9k0k0P9P8o4o5K3K2
-792d06K3K2l4l5N1N1m8m8m8m8l0k9M2M3jjjjN0N0PQm6m6K6K6J2J3N5N5J4J3J4J3p1p1JJj4
-796c88j4j3j4K4K5j9j8k4k4M8M8j1j0j0j1K9K9m2m2K6K7m6m5k4k3P6P6j1j1L1L2k3k3o6o6
-801e07ppL6L6O1O1j1j0k9k9k8k9rrrrO8O9O9O9l2l2j04j04J5J5k9k8K4K4K4K5k8k8k7k8r
$$ plain form
-805 -546 -556 -494 -431 -423 -414 -406 -397 -451 -506 -488 -471 -440 -410 -379 -348 -358 -367 -377 -386 -363 -341 -318 -295 -325 -355 -390 -425 -428 -517 -595 -530 -427 -325 -314 -303 -285 -266
-810 -266 -247 -228 -255 -283 -382 -481 -535 -588 -599 -609 -564 -519 -517 -515 -478 -441 -404 -367 -314 -261 -251 -241 -289 -337 -342 -261 -199 -280 -376 -471 -485 -499 -513 -527 -446 -365
-814 -365 -355 -346 -342 -339 -336 -332 -359 -387 -414 -441 -423 -405 -431 -456 -419 -382 -417 -451 -405 -359 -413 -468 -447 -426 -448 -470 -466 -462 -415 -368 -394 -419 -445 -470 -422 -373 -424 -476
-819 -476 -524 -571 -547 -523 -425 -328 -302 -276 -292 -308 -367 -426 -421 -416 -369 -321 -321 -321 -322 -322 -291 -260 -329 -398 -333 -267 -245 -223 -270 -318 -466 -614 -659 -704 -707 -709 -648 -587
-823 -587 -597 -607 -595 -583 -571 -559 -541 -523 -510 -497 -458 -506 -553 -514 -376 -237 -293 -349 -323 -296 -308 -405 -418 -431 -450 -468 -472 -475 -479 -482 -480 -479 -477 -475 -457 -440 -422 -405
-828 -405 -419 -434 -449 -464 -432 -401 -370 -339 -347 -356 -364 -372 -385 -397 -410 -422 -405 -388 -414 -440 -416 -392 -401 -495 -585 -589 -503 -418 -372 -326 -280 -234 -239 -244 -292 -340 -428 -515 -517
$$ packed form
-805e46j0O2O3QRQRn4n5J8J7L1L0L1L1j0rj0rK3K2K3K3l0l0l5l5lq9p8O5J03J02J1J1J8J9
-810b66J9J9k7k8r9r9n4n3j1j0M5M5KKL7L7L7L7N3N3J0J0m8m8nQ1O2q1r6r5j4j4j4j4Q1Q1
-814c65J0RMLLMk7k8k7k7J8J8k6k5L7L7l5l4M6M6n4n5K1K1k2k2MMM7M7k6k5k6k5M8M9n1n2
-819d76m8m7K4K4R8R7K6K6j6j6n9n9NNM7M8%%j%L1L1o9o9O5O6K2K2m7m8j48j48m5m5lkO1O1
-823e87j0j0J2J2J2J2J8J8J3J3L9m8m7L9J38J39n6n6K6K7j2r7j3j3j9j8mlmlKJKKJ8J7J8J7
-828d05j4j5j5j5L2L1L1L1qrqqj3j2j3j2J7J7k6k6K4K4rr4r0mQ6Q5M6M6M6M6nnm8m8q8q7k
$$ [...]
-1606I07
##$OBSERVED INTEGRALS=	(X Y Z)
(1.286646318257630206, 1.4407471969403868872, 1)
(1.2460197229685381348, 1.2827937962905611169, 2.7028065847029441038)
(1.1819277666073002564, 1.2442685766198728903, 0.39619901422319930839)
(1.0425365172533513913, 1.1728218055942312148, 0.91248156769187993564)
(1.6645437003001193332, 1.8298519156143513431, 1.355928345884317654)
(1.8424601693247550926, 1.9251142769818712086, 0.89846159324269503355)
(1.928616569679208137, 2.0424410823426080164, 0.44688085477135830459)
(7.1164221057511696245, 7.194308887116679152, 0.41806027407749163372)
(6.9834019847673785009, 7.086667605004796755, 0.44075525427425610303)
(6.8320040839108244768, 6.9120786962135696285, 0.41105553543723488685)
(2.7878740820835261616, 2.9920583766438744178, 0.44938858238117324051)
(2.4194035735091072858, 2.5940163495469215071, 0.89969951379396062574)
(2.1044434317849858296, 2.1879947063407132468, 1.2929874277623638612)
(2.1982034982238110032, 2.2937977876204009853, 0.078266019857734916987)
##END=	
##END=	
