##TITLE=	Cem53.2.fid
the red crystals from the reaction cyclotrisilene and unsaturated west silylene

##JCAMP-DX=	6.0	$$ MestReNova 14.1.0-24037
##DATA TYPE=	LINK
##BLOCK_ID=	1
##BLOCKS=	1    
##ORIGIN=	Mestrelab Research S.L.
##OWNER=	hrzepa
##$MNOVA/LINK_BLOCK_TYPE=	ITEM	$$ NMR Spectrum
##$MNOVA/ITEM/POLYGON=	(XY..XY)
5321,5835
8722,5835
8722,8208
5321,8208
5321,5835
##$MNOVA/ITEM/Z=	0
##$MNOVA/ITEM/ANGLE=	0
##TITLE=	Cem53.2.fid
##JCAMP-DX=	6.0	$$ MestReNova 14.1.0-24037
##BLOCK_ID=	2
##DATA TYPE=	NMR SPECTRUM
##DATA CLASS=	XYDATA
##NUMDIM=	1
##ORIGIN=	Bruker BioSpin GmbH
##OWNER=	nmrsu
##.OBSERVE FREQUENCY=	59.627388000000003387
##.OBSERVE NUCLEUS=	^29Si
##.SOLVENT NAME=	C6D6
##.PULSE SEQUENCE=	zgig
##LONGDATE=	2015/04/03 05:38:00.000
##.ACQUISITIONMODE=	SIMULTANEOUS (DQD)
##$ORIGINAL FORMAT=	Bruker XWIN-NMR
##$MNOVA/SCALES_VERSION=	8
##$PARAMETER FILE=	(acqus, ASCII, /var/folders/f6/rjf_tdyn2v98c5c0wvkgn4s80000gq/T/gFoXV+8fTvycJbfU+YRPrQ/5/2/acqus, 0)
$$ ##TITLE= Parameter file, TOPSPIN		Version 3.0
$$ ##JCAMPDX= 5.0
$$ ##DATATYPE= Parameter Values
$$ ##NPOINTS= 11	$$ modification sequence number
$$ ##ORIGIN= Bruker BioSpin GmbH
$$ ##OWNER= nmrsu
$$ $$ 2015-04-03 05:38:35.046 +0200  nmrsu@CZC049C5SM
$$ $$ C:/Bruker/TopSpin3.0/data/CemY/nmr/Cem53/2/acqus
$$ $$ process C:\Bruker\TopSpin3.0\prog\mod\shimcntl.exe
$$ ##$ACQT0= -6.36618283677107
$$ ##$AMP= (0..31)
$$ 100 100 100 100 100 100 100 100 100 100 100 100 100 100 100 100 100 100
$$ 100 100 100 100 100 100 100 100 100 100 100 100 100 100
$$ ##$ANAVPT= -1
$$ ##$AQSEQ= 0
$$ ##$AQ_mod= 3
$$ ##$AUNM= <au_zg>
$$ ##$AUTOPOS= <7 >
$$ ##$BF1= 59.627388
$$ ##$BF2= 300.13
$$ ##$BF3= 300.13
$$ ##$BF4= 300.13
$$ ##$BF5= 300.13
$$ ##$BF6= 300.13
$$ ##$BF7= 300.13
$$ ##$BF8= 300.13
$$ ##$BYTORDA= 0
$$ ##$CAGPARS= (0..11)
$$ 0 0 0 0 0 0 0 0 0 0 0 0
$$ ##$CFDGTYP= 0
$$ ##$CFRGTYP= 9
$$ ##$CHEMSTR= <none>
$$ ##$CNST= (0..63)
$$ 1 1 145 1 1 1 1 1 1 1 1 1 1 1 1 1 1 1 1 1 1 1 1 1 1 1 1 1 1 1 1 1 1 1 1
$$ 1 1 1 1 1 1 1 1 1 1 1 1 1 1 1 1 1 1 1 1 1 1 1 1 1 1 1 1 1
$$ ##$CPDPRG= <>
$$ ##$CPDPRG1= <>
$$ ##$CPDPRG2= <waltz16>
$$ ##$CPDPRG3= <>
$$ ##$CPDPRG4= <>
$$ ##$CPDPRG5= <>
$$ ##$CPDPRG6= <>
$$ ##$CPDPRG7= <>
$$ ##$CPDPRG8= <>
$$ ##$D= (0..63)
$$ 0 20 0.00345 0 0 0 0 0 0 0 0 0.03 2e-005 3e-006 0 0 0.0002 0 0 0 0 0 0
$$ 0 0 0 0 0 0 0 0 0 0 0 0 0 0 0 0 0 0 0 0 0 0 0 0 0 0 0 0 0 0 0 0 0 0 0 0
$$ 0 0 0 0 0
$$ ##$DATE= 1428032314
$$ ##$DBL= (0..7)
$$ 120 120 120 120 120 120 120 19
$$ ##$DBP= (0..7)
$$ 150 150 150 150 150 150 150 150
$$ ##$DBPNAM0= <>
$$ ##$DBPNAM1= <>
$$ ##$DBPNAM2= <>
$$ ##$DBPNAM3= <>
$$ ##$DBPNAM4= <>
$$ ##$DBPNAM5= <>
$$ ##$DBPNAM6= <>
$$ ##$DBPNAM7= <>
$$ ##$DBPOAL= (0..7)
$$ 0.5 0.5 0.5 0.5 0.5 0.5 0.5 0.5
$$ ##$DBPOFFS= (0..7)
$$ 0 0 0 0 0 0 0 0
$$ ##$DE= 6.5
$$ ##$DECBNUC= <off>
$$ ##$DECIM= 840
$$ ##$DECNUC= <off>
$$ ##$DECSTAT= 4
$$ ##$DIGMOD= 1
$$ ##$DIGTYP= 12
$$ ##$DL= (0..7)
$$ 0 0 120 120 120 21 21 120
$$ ##$DP= (0..7)
$$ 150 150 150 150 150 150 150 150
$$ ##$DP07= 0
$$ [...]
$$ ##$RX22TY= <no>
$$ ##$RXFMAX= (0..7)
$$ 432.5 -1 -1 -1 -1 -1 -1 -1
$$ ##$RXFMIN= (0..7)
$$ 5 -1 -1 -1 -1 -1 -1 -1
$$ ##$RXINTLV= (0..7)
$$ 1 0 0 0 0 0 0 0
$$ ##$RXMSTY= <no>
$$ ##$SCMTY= <no>
$$ ##$SGUC1= (0..15)
$$ 18 19 0 0 0 0 0 0 0 0 0 0 0 0 0 0
$$ ##$SGUC2= (0..15)
$$ 33 256 0 0 0 0 0 0 0 0 0 0 0 0 0 0
$$ ##$SPECTR= 10
$$ ##$SY2FLAG= 0
$$ ##$SYNCTRIG= 11
$$ ##$ShimPowMaxUA= (0..63)
$$ 130000 130000 130000 130000 130000 130000 130000 130000 130000 130000 130000
$$ 130000 130000 130000 130000 130000 130000 130000 130000 130000 0 0 0 0
$$ 0 0 0 0 0 0 0 0 0 0 0 0 0 0 0 0 0 0 0 0 0 0 0 0 0 0 0 0 0 0 0 0 0 0 0 0
$$ 0 0 0 0
$$ ##$ShimPowMaxUC= (0..63)
$$ 130000 130000 130000 130000 130000 130000 130000 130000 130000 130000 130000
$$ 130000 130000 130000 130000 130000 130000 130000 130000 130000 0 0 0 0
$$ 0 0 0 0 0 0 0 0 0 0 0 0 0 0 0 0 0 0 0 0 0 0 0 0 0 0 0 0 0 0 0 0 0 0 0 0
$$ 0 0 0 0
$$ ##$ShimPowMaxUG= (0..63)
$$ 524287 524287 524287 524287 524287 524287 524287 524287 524287 524287 524287
$$ 524287 524287 524287 524287 524287 524287 524287 524287 524287 0 0 0 0
$$ 0 0 0 0 0 0 0 0 0 0 0 0 0 0 0 0 0 0 0 0 0 0 0 0 0 0 0 0 0 0 0 0 0 0 0 0
$$ 0 0 0 0
$$ ##$ShimPowRcbType= 3
$$ ##$ShimPowRes= (0..63)
$$ 1e-020 1e-020 1e-020 1e-020 1e-020 1e-020 1e-020 1e-020 1e-020 1e-020 1e-020
$$ 1e-020 1e-020 1e-020 1e-020 1e-020 1e-020 1e-020 1e-020 1e-020 0 0 0 0
$$ 0 0 0 0 0 0 0 0 0 0 0 0 0 0 0 0 0 0 0 0 0 0 0 0 0 0 0 0 0 0 0 0 0 0 0 0
$$ 0 0 0 0
$$ ##$ShimPowRng0= (0..63)
$$ 1 1 1 1 1 1 1 1 1 1 1 1 1 1 1 1 1 1 1 1 0 0 0 0 0 0 0 0 0 0 0 0 0 0 0 0
$$ 0 0 0 0 0 0 0 0 0 0 0 0 0 0 0 0 0 0 0 0 0 0 0 0 0 0 0 0
$$ ##$ShimPowRng1= (0..63)
$$ 1 1 1 1 1 1 1 1 1 1 1 1 1 1 1 1 1 1 1 1 0 0 0 0 0 0 0 0 0 0 0 0 0 0 0 0
$$ 0 0 0 0 0 0 0 0 0 0 0 0 0 0 0 0 0 0 0 0 0 0 0 0 0 0 0 0
$$ ##$ShimPowRng2= (0..63)
$$ 1 1 1 1 1 1 1 1 1 1 1 1 1 1 1 1 1 1 1 1 0 0 0 0 0 0 0 0 0 0 0 0 0 0 0 0
$$ 0 0 0 0 0 0 0 0 0 0 0 0 0 0 0 0 0 0 0 0 0 0 0 0 0 0 0 0
$$ ##$ShimPowRng3= (0..63)
$$ 1 1 1 1 1 1 1 1 1 1 1 1 1 1 1 1 1 1 1 1 0 0 0 0 0 0 0 0 0 0 0 0 0 0 0 0
$$ 0 0 0 0 0 0 0 0 0 0 0 0 0 0 0 0 0 0 0 0 0 0 0 0 0 0 0 0
$$ ##$ShimSysFunc= (0..63)
$$ 1 2 3 4 5 7 9 11 15 16 8 10 12 14 6 17 13 18 19 20 0 0 0 0 0 0 0 0 0 0
$$ 0 0 0 0 0 0 0 0 0 0 0 0 0 0 0 0 0 0 0 0 0 0 0 0 0 0 0 0 0 0 0 0 0 0
$$ ##$ShimSysMatrix= 0
$$ ##$ShimSysType= 1
$$ ##$TFXNUM= 0
$$ ##$TRIPLO2= 0
$$ ##$VTU= 2
$$ ##$VTUETH= <149.236.99.20>
$$ ##$VTUTY= <no>
$$ ##$WBREFAM= (0..15)
$$ 20.9 49.1 100 100 100 100 100 100 100 100 100 100 100 100 100 100
$$ ##$WBREFLM= (0..15)
$$ 0 0 0 0 0 0 0 0 0 0 0 0 0 0 0 0
$$ ##$WBREFPH= (0..15)
$$ 72.55 -68.79 0 0 0 0 0 0 0 0 0 0 0 0 0 0
$$ ##$XFAC= 2
$$ ##END=
$$ 
##$DECIM=	840
##$DSPFVS=	20
##XUNITS=	HZ
##YUNITS=	ARBITRARY UNITS
##FIRSTX=	11904.763045408797552
##LASTX=	-11904.760764115000711
##DELTAX=	-0.3633100451594384328
##XFACTOR=	1
##YFACTOR=	0.46180985040184480139
##FIRSTY=	42.315399169921875
##MINY=	-274.75653076171875
##MAXY=	2922.515380859375
##NPOINTS=	65536
##XYDATA=	(X++(Y..Y))
$$ [...]
9016d2N6N6J2o8o8J2LKL0K9o0K0Q2JJ2J2o4o3m1L9k9k8k4k3j0rJ0J1Q5Q5J3J3j9r9j71l5K4
9002b46K4qqM8M9J09K8K8n2r8j7N4N3N3N3oq7n2K9Q5Oj6r5m1L9RR%JqqJ7j17j39kJ00J00L3
8988g3m8J4J4Q4J65K2K3L5r9n1n2n8o0J0J1P7P8oom6m5pqL3L3kkk2k1J7J8Jp9o0K1L8L8j%
8974a4l6l6pP5P4pm7m6n7K4K2K2JKM8l0k7k7m1m2q7ol0l1R6R7j6j7K5K4J9K0N4N4J36N4m8
8961A95m8n3n3n6K2L2L1mmj1j1J4o6p3p3j0j1l3l4j3j3K7K7M7M8k3k3llN5N5k2j02m0m0k4
8948b93N8Q2Q1J9J9Q6Q6l6l5m3m1j7r9NNjjO3O2mq5n4Q2O1j9k5j06n2Q4N9k2l6l5M3M4P8P9
8934I2L4m7j7j7n3K5j8j9%jK9n0l8M4RQ9O5j7j14j15l1l0L7L7k4k4r4R4M6l6K2K2lllkJ5J4
8921h2J5J5P4P5K6n5n8n7L2L1n5n7j5j6rrK6K7P7mp2RllM7l4MLL9L7k2k3J8J8l1l1j25j26
$$ plain form
9016 -42 14 70 82 14 -54 -42 -39 -37 -7 22 -38 -18 64 65 77 89 25 -38 -79 -40 -69 -97 -121 -144 -154 -163 -153 -142 -57 28 41 54 35 -64 -235 -270 -246
9002 -246 -222 -230 -238 -190 -141 -32 -4 24 -28 -126 -143 -89 -36 17 70 64 -23 -75 -46 39 45 29 -66 -107 -68 -59 -50 -50 -49 -57 -65 -48 -165 -304 -306 -206 -106 -73
8988 -73 -121 -107 -93 -9 156 178 201 236 137 86 34 -24 -84 -74 -63 14 92 86 80 34 -11 -18 -26 7 40 38 36 14 -7 10 28 29 -50 -110 -89 -51 -13 -14 -14
8974 -14 -50 -86 -93 -18 56 49 2 -44 -101 -77 -55 -33 -32 -30 18 -12 -39 -66 -107 -149 -236 -242 -272 -303 -207 -110 -126 -143 -118 -94 -75 -55 -1 53 189 243 195
8961 195 147 94 41 -15 7 39 70 66 62 51 40 54 -12 -85 -158 -168 -179 -212 -246 -259 -272 -245 -218 -171 -123 -146 -169 -172 -175 -120 -65 -87 -189 -229 -269 -293
8948 -293 -235 -153 -72 -53 -34 52 138 102 67 24 -17 -34 -133 -128 -123 -124 -125 -62 0 -4 -89 -143 -61 0 -19 -44 -150 -202 -118 -59 -81 -117 -152 -109 -65 13 92
8934 92 126 79 62 45 -8 17 -1 -20 -20 -21 8 -42 -80 -36 -27 62 127 110 -4 -119 -150 -180 -143 -106 -130 -154 -248 -154 -108 -144 -122 -100 -103 -106 -109 -111 -96 -82
8921 -82 -67 -52 22 97 123 68 10 -47 -15 16 -39 -96 -111 -127 -136 -145 -119 -92 -15 -19 -91 -82 -85 -88 -41 -75 -71 -68 -29 8 -14 -37 -19 -1 -32 -63 -188 -314
8907c14mnn0L1J14J13N1N1l6l5RJ0LQ3N2q2j01k0l3l4k4k4k4k4M1M0k8k7L1L1L0L1MLM5M4
8894d8l5l5l6l5K4K4K4K4N3N2k2j05k0k1k6k5j5j4j5j4M6M6L3j02n9K1O3O2O8O9O7O8k3k2
8881G2r0r0K0K0K6n6l2l2K5K5K1o0o0K1R2R1P4pm8m7M1J23K0j15j6O4K9n2j22j24l6l6L2L2
8869a95l3l2L5L5Q4Q4J6J5l4l5J6o6%Q1Qp3j0j0N3N3J3J3J00J9q3q2m2m2p3QJ03K1ook2O0
8856b7L6m2l8M2J3J2J1J3P8km6m6n1L0M6M6Np6p5MppL9L9J3J5RJ0l0j09k4k5rj0rj0M4M3M4
8842e1M4J1J2J2J2m6m7K0K1n9n8j3j3m3L9ppJ5J4P7P7J5o5r6M0QQJ6J6POJ1J2l5M6M5l5j9
8828a0j9L6L8N0l1k6k5MNl5l6k3k3k8N4M1M0L0n1p4Ollk0k0%JL7L8L7L7M6M5K4n7o5o4q7M9
8814h2P0o5r6r7N7J39P2j0j6j6k1k0N3N2J3J3m6m5l1l1O4j7o1o2m4L6N7k5L0L0MML2L1P6m
$$ plain form
8907 -314 -318 -323 -373 -342 -228 -115 -64 -13 -49 -84 -75 -65 -62 21 73 -9 -110 -130 -163 -197 -221 -245 -269 -293 -252 -212 -240 -267 -236 -205 -175 -144 -140 -137 -92 -48
8894 -48 -83 -118 -154 -189 -165 -141 -117 -93 -40 12 -10 -115 -135 -156 -182 -207 -222 -236 -251 -265 -219 -173 -140 -242 -301 -280 -217 -155 -87 -18 49 117 94 72
8881 72 -18 -108 -88 -68 -42 -98 -130 -162 -137 -112 -91 -151 -211 -190 -98 -7 67 60 12 -35 6 129 149 34 18 82 111 59 -63 -187 -223 -259 -227 -195
8869 -195 -228 -260 -225 -190 -106 -22 -6 9 -25 -60 -44 -110 -110 -29 -21 -94 -104 -114 -61 -8 5 18 118 137 54 -28 -70 -112 -185 -177 -74 -53 -59 -65 -87 -27
8856 -27 9 -33 -71 -29 -16 -4 7 20 98 96 50 4 -47 -17 29 75 80 4 -71 -67 -74 -81 -42 -3 10 25 34 44 14 -95 -119 -144 -153 -163 -172 -182 -138 -95 -51
8842 -51 -7 4 16 28 40 -6 -53 -33 -12 -71 -129 -142 -155 -198 -159 -166 -173 -158 -144 -67 10 25 -40 -136 -96 -88 -80 -64 -48 -41 -35 -24 -12 -47 -1 44 9 -10
8828 -10 -29 7 45 95 64 38 13 17 22 -13 -49 -72 -95 -123 -69 -28 12 42 -9 -83 -77 -80 -83 -103 -123 -123 -122 -85 -47 -10 27 73 118 142 85 20 -44 -131 -82
8814 -82 -12 -77 -173 -270 -213 -74 -2 -12 -28 -44 -65 -85 -32 20 33 46 0 -45 -76 -107 -43 -60 -121 -183 -227 -191 -134 -159 -129 -99 -95 -91 -59 -28 48 44
8801D4j03j05o8o9O0O0Q1Q0L7L8pqm6j29l7l8n8K4N0N1RR0K5K4oon2K9J2J3J6J8k2k1k1k2
8788e7j8j8j8j8MMj7j7%%m1m0R8R8k3k3llR1R1j9j9K2K2m8m8K0K0nop2p3N2N2r7r7k1k0M7
8773b00M7m2m2m1m2qpL3L3j0j0L0L1P4P5L3L4m9m9M6M5KKo6o5l6l7L2L1M6M7M6M5j6j6j6j6
8760c6k5k5o6o5KKR7R7m3m2m2m2J9K0k2k1N1N0j7j7M6M6k2k1KKJKN0M8RRl6l6n7n7N9N9N8
8746C7O0M8M8j9k0n0m9n0m9J4J5n4n3L4L4L4L4N9N9Q4Lp6p7l7M3Np6k9M9L4L4k9k9l6l8m2
8733h5L9OOJ0J1K0K1m6m7nnmnK2K2o8o7j9O3llKJJJrrQQ8L8m3l9M3N0N0j3j2r9j00m6L5J3
8717a77R4J18L8j2j2pq7q5nL6m5o2J9O4O3P9Q0j4j5l4l4L4L3n6n5r7r7M5M5Q5Q5PQk8k7j26
8704a42m5N7N8P9Q1J05K5o4o4n0Q5L6L7M9l1m8m7j04k1L9m1j1j1n5n6j5j5k7k7O8O8%%K0K1
$$ plain form
8801 44 -59 -164 -232 -301 -241 -181 -100 -20 17 55 48 40 -6 -135 -172 -210 -268 -244 -194 -143 -134 -44 -19 5 -1 -7 -59 -30 -18 -5 11 29 7 -14 -35 -57
8788 -57 -75 -93 -111 -129 -125 -121 -138 -155 -155 -155 -196 -236 -138 -40 -63 -86 -89 -92 -1 90 71 52 74 96 48 0 20 40 35 29 -43 -116 -64 -12 -109 -206 -227 -247 -200
8773 -200 -153 -195 -237 -278 -320 -328 -335 -302 -269 -279 -289 -259 -228 -154 -79 -46 -12 -61 -110 -64 -19 -17 -15 -81 -146 -182 -219 -187 -156 -110 -63 -17 28 12 -4 -20 -36
8760 -36 -61 -86 -152 -217 -215 -213 -116 -19 -62 -104 -146 -188 -169 -149 -171 -192 -141 -91 -108 -125 -79 -33 -55 -76 -74 -72 -71 -69 -19 29 38 47 11 -25 -82 -139 -80 -21 37
8746 37 97 145 193 174 154 104 55 5 -44 -30 -15 -69 -122 -88 -54 -20 14 73 132 216 219 143 66 29 72 77 1 -28 21 55 89 60 31 -5 -43 -85
8733 -85 -46 -40 -34 -24 -13 7 28 -18 -65 -70 -75 -79 -84 -62 -40 -108 -175 -194 -131 -134 -137 -135 -134 -133 -132 -141 -150 -142 -54 -16 -59 -98 -55 -5 45 32 20 -79 -179 -225 -190 -177
8717 -177 -83 35 73 61 49 42 -45 -130 -135 -99 -144 -206 -187 -123 -60 19 99 85 70 36 2 36 69 13 -42 -139 -236 -191 -146 -61 24 31 39 11 -16 -142
8704 -142 -187 -130 -72 7 88 193 218 154 90 40 125 161 198 247 216 168 121 17 -4 35 -6 -17 -28 -83 -139 -154 -169 -196 -223 -155 -87 -87 -87 -67 -46
8692d6nnk5k5Q4Q3l7l7j09j08O6O7M1M2%JN3N5m0m0n1n2J6J5M0L8n4n6j6j6N2N1o8o9k7k8
8679b10L1L1rrQPM9M8J7J7k4k4o2o3N8N9KJj9j8M4M3O4O4j5j4n5n4M1M2k6k5q8q8k0k1M9N0
8665a19K8K9k9k9J1J1j3j3QPj1j2RQO8O7q0q0K8K9O9O8j0j0n0n1O4O3l0l0n8n8O3O2rj1j0
8651b1j1k6k6O9O8J5J5J5J5o4o2MMj5j5n5n5%jM1M0LLKLO4O4llK4K5j24j24J%J40J41oj42
8637Cm2L8M4M5N1N0j28j27l4l4L4L4poQRRRp3p4k7J07Q1P9L9M0Mj31j49j49L9L9jjK1K2K2
8624a56K1N3N3j5j5o4o5j6j5o7O8Q6Q7qqm9m9M0M0k8k8K2K2K2K2N0N1J0J0r2r4JJM2M2JJj5
8610c9j5j5j5m4m4N1N0J9J9J8J8L7L8llr3r5n3n4K3K3K4K3pqppj9j8M8M9oonoJ8J9J8J9m4
8595i2m4llL4L3opM0L9k7k8ONOOk7k7M0M1M4M5p5p6OOPOJ6J6J6J5J4J3J3J4qqm8m7p3p3K2
$$ plain form
8692 -46 -51 -56 -81 -106 -22 61 24 -13 -122 -230 -164 -97 -56 -14 -14 -13 40 95 55 15 -36 -88 -72 -57 -17 21 -33 -89 -105 -121 -69 -18 -86 -155 -182 -210
8679 -210 -179 -148 -157 -166 -158 -151 -102 -54 -37 -20 -44 -68 -130 -193 -135 -76 -74 -73 -92 -110 -66 -23 41 105 90 76 21 -33 8 50 24 -1 -89 -177 -197 -218 -169 -119
8665 -119 -91 -62 -91 -120 -109 -98 -111 -124 -116 -109 -120 -132 -123 -115 -47 20 -60 -140 -112 -83 -14 54 44 34 -16 -67 -3 60 30 0 -58 -116 -53 9 0 -11 -21
8651 -21 -32 -58 -84 -15 53 68 83 98 113 49 -13 -9 -5 -20 -35 -90 -145 -145 -146 -105 -65 -62 -59 -57 -54 10 74 71 68 92 117 -7 -131 -130 -130 10 151 145 3
8637 3 -39 -1 43 88 139 189 61 -66 -100 -134 -100 -66 -73 -79 -71 -62 -53 -44 -117 -191 -218 -111 -30 49 88 128 132 1 -148 -297 -258 -219 -220 -221 -200 -178 -156
8624 -156 -135 -82 -29 -44 -59 -123 -188 -204 -219 -286 -218 -132 -45 -53 -61 -110 -159 -119 -79 -107 -135 -113 -91 -69 -47 3 54 64 74 -18 -112 -111 -110 -68 -26 -25 -24 -39
8610 -39 -54 -69 -84 -128 -172 -121 -71 -52 -33 -15 3 40 78 75 72 -21 -116 -169 -223 -200 -177 -153 -130 -137 -145 -152 -159 -178 -196 -148 -99 -105 -111 -116 -122 -104 -85 -67 -48 -92
8595 -92 -136 -139 -142 -108 -75 -81 -88 -48 -9 -36 -64 -58 -53 -47 -41 -68 -95 -55 -14 30 75 0 -76 -70 -64 -57 -51 -35 -19 -3 12 26 39 52 66 58 50 2 -45 -118 -191 -169
8580a69K2PPJ02J00K4K4m4m4JJo6o6N6N6J6J6J6J6n2n1O7O7k7k8LKKLJ5J5k6k5j13j13j9j9
8567b24O9O9n3n3j5j5N2N2K1K0K1K1j2j1m4m4n8P7Q8OK7K6m4m5m9m9J9J9l5l5L3L3N4N3j3
8554c9j4j4j3j4j4J0J0J0J0k8k7M0M0k1k1pP3L1j03r9L7J02J00l8l8n0m9J7J8J7J7L4j01o7
8542a91O7j6j7K7K7K7K7noL5L4p2p4M9M8J3J3J3J2NNl4l5m2m1N3N3q0q0J4J4R0R0l1l1j9j8
8528g6j9j9K2K1Qp4p6N9j1r3m7L3P0j2LMkjJ6J5J6J6K5K4j6j6L7L8k9l0J8J9J8J9RJ0M9N0
8514G8j9k0j14j14J5J5j7j7l3J01J01l3n5n4o2o3O5O5O5O5p3p2l2l2M5M6M6M6j0rL1L1j5j4
8502d3K6K4M7M6M7M6o2o3k2k2J2J2n5n6K2K2K1K2JKJKm8m9m9n0K4K4K4K4J4J3J4J4k2k2k1
8489h0k2n6n5J20J19R3R2kko3o3k3k2l3l2m7L5L4j00r4R5J45J0r5j5k9k9k5k4RRP7P5l6l7
$$ plain form
8580 -169 -147 -140 -133 -31 69 93 117 73 29 30 31 -35 -101 -45 11 27 43 59 75 23 -28 39 106 79 51 54 56 58 61 76 91 65 40 -73 -186 -205 -224
8567 -224 -155 -86 -139 -192 -207 -222 -170 -118 -97 -77 -56 -35 -47 -58 -102 -146 -204 -127 -39 -33 -6 20 -24 -69 -118 -167 -148 -129 -164 -199 -166 -133 -79 -26 -39
8554 -39 -53 -67 -80 -94 -108 -98 -88 -78 -68 -96 -123 -83 -43 -64 -85 -92 -19 12 -91 -190 -153 -51 49 11 -27 -77 -126 -109 -91 -74 -57 -23 -124 -191
8542 -191 -124 -140 -157 -130 -103 -76 -49 -54 -60 -25 9 -63 -137 -88 -40 -27 -14 -1 11 16 21 -13 -48 -90 -131 -78 -25 -105 -185 -171 -157 -67 23 -8 -39 -58 -76
8528 -76 -95 -114 -92 -71 -63 -137 -213 -154 -165 -258 -305 -272 -202 -214 -211 -207 -209 -210 -194 -179 -163 -147 -122 -98 -114 -130 -93 -55 -84 -114 -96 -77 -59 -40 -31 -21 28 78
8514 78 59 39 -75 -189 -174 -159 -176 -193 -226 -125 -24 -57 -112 -166 -228 -291 -226 -161 -96 -31 -104 -176 -208 -240 -195 -149 -103 -57 -67 -76 -45 -14 -29 -43
8502 -43 -17 7 54 100 147 193 131 68 46 24 36 48 -7 -63 -41 -19 2 24 25 27 28 30 -18 -67 -116 -166 -142 -118 -94 -70 -56 -43 -29 -15 -37 -59 -80
8489 -80 -102 -158 -213 -93 26 119 211 209 207 144 81 58 36 3 -29 -76 -41 -7 -107 -201 -106 39 49 -46 -61 -90 -119 -144 -168 -159 -150 -73 2 -34 -71
8476g1LLL8L8kkJ2J2q1q2J1J2J2J2J6J6n1n2M2M2k6k6K7K7K8K7K3K5m2m4m2m2m3m2J9K0J4
8462a69J4m1j22k5J38R9J7OOL3L3qpN6N6o5o4K6K4K6K5N8N7r0j70j20M1j5j4k9l0L8L9K9L0
8450a18l8l7l7l7N7N8L8L8k9k9MNNMP5P4R8o4j10j11K7K7M7M7ONk5k6k6k6L6L6nnk5k5M2M2
8436bk1k1K0J9qqqqn6n6n6n7J1J1J1J0K6K6O7O6L5L7n8n8n2n2M3M3M7M7m8m8l6l6L2L2Q9Q8
8422G1L1j30j57j58L3J14P3q9p5PJ8R9J7J8qpqqk4k4O6O6J3o8k7N3K7K7l6l6LLM3M4K4K3K4
8409D2K4L3L4L8m2o2o2K3K2Lp7m3L8k4j06M0M0N7N6ook9M9M6M6j9j8K8n4m7m6n2n2j4j3K7
8396a26K7Q1P9o2o3kP9P5P4m3m2m8m7o8j49k7N4P0P1RQK3K4K2K4n5n6J1J2l4l5k9k9MQ6Q4
8382BNM5M6k7k7o6o6k7k6n7n7L4m6m1M1J12J12L1L0j0qj2j3j2j2ooO1O1m3m2j10j11M7M7M8
$$ plain form
8476 -71 -68 -65 -27 11 9 7 19 31 -50 -132 -121 -109 -97 -85 -69 -53 -104 -156 -114 -72 -98 -124 -97 -70 -42 -15 8 33 -9 -53 -95 -137 -180 -222 -203 -183 -169
8462 -169 -155 -196 -318 -343 -205 -106 -89 -83 -77 -44 -11 -19 -26 30 86 21 -43 -17 7 33 58 116 173 83 -87 -207 -166 -181 -195 -224 -254 -216 -177 -148 -118
8450 -118 -156 -193 -230 -267 -210 -152 -114 -76 -105 -134 -130 -125 -120 -116 -41 33 131 67 -43 -154 -127 -100 -53 -6 0 5 -20 -46 -72 -98 -62 -26 -31 -36 -61 -86 -44 -2
8436 -2 -23 -44 -24 -5 -13 -21 -29 -37 -93 -149 -205 -262 -251 -240 -229 -219 -193 -167 -100 -34 1 38 -20 -78 -130 -182 -139 -96 -49 -2 -50 -98 -134 -170 -138 -106 -17 71
8422 71 102 -28 -185 -343 -310 -196 -123 -212 -287 -280 -262 -163 -146 -128 -136 -143 -151 -159 -183 -207 -141 -75 -62 -130 -157 -104 -77 -50 -86 -122 -119 -116 -73 -29 -5 18 42
8409 42 66 99 133 171 129 67 5 28 50 53 -24 -67 -29 -53 -159 -119 -79 -22 34 28 22 -7 42 88 134 115 97 125 71 24 -22 -74 -126 -140 -153 -126
8396 -126 -99 -18 61 -1 -64 -66 13 88 162 119 77 29 -18 -86 -235 -262 -208 -138 -67 -58 -50 -27 -3 19 43 -12 -68 -57 -45 -79 -114 -143 -172 -168 -82 2
8382 2 7 52 98 71 44 -22 -88 -115 -141 -198 -255 -221 -267 -308 -267 -155 -43 -12 18 8 0 -12 -25 -37 -49 -55 -61 0 61 18 -24 -134 -245 -198 -151 -103
8369a03M7L3L2L9j21o5R8O3O4k3k4o3o5K2K2p3p2p4p3M8M8M9M9M9M9n5n5J3J3K1K1k0j9rq
8357a42rqj6j6J06J05L0L0L0L0p7p6l6l6k2k2o2o3L3L4qpJ6J6N7N6m4m3mlmlR1R0J7J7n1m9
8343d3m9m8m8m8ONM7M6J2J3J2J2l9m0N6N5J4J5k6k6l6l5l5l6m0m1N5N4L5L6L6L5m9n0n0n0
8330b45J00R9R9R9rqp7p5L2L4q7q8m3m2kkJ03J04QRL1L1o3J7L4j01k6N6ONJ0J1n2n2M2M2L6
8316C6L8n7n6m4m4N1N0M9M9p2p1l9m0m0l9J4J5J4J5K5K5j6j5o0o1L5L4L0L0P6P5q9j0R3m1
8304d0m9L1k2k2j%%jK9K9l8l9M0M0k8k7PPM8M7k9l0p1p0q6q6L6J17R2m3p6OQ1Q1M1r5m3m3
8290b07J6J6QQQQk7k7O8O8M4M3j04j05L3L3L2L3l5l6p6p6K9K9O9O9J3J3J3J3LLkkK8n0m7m6
8276a40j9j9M9M9K8K8j2j2pokjK0J00L3m8l4l4l4l4KQ3l0k9mmL7L7K3K4m3m2JJPOn2K8M2M0
$$ plain form
8369 -103 -56 -23 9 48 -73 -138 -40 23 87 64 40 -23 -88 -66 -44 -117 -189 -263 -336 -288 -240 -191 -142 -93 -44 -99 -154 -141 -128 -107 -86 -106 -125 -134 -142
8357 -142 -151 -159 -175 -191 -85 20 50 80 110 140 63 -13 -49 -85 -107 -129 -191 -254 -221 -187 -195 -202 -186 -170 -113 -57 -101 -144 -148 -151 -155 -158 -67 23 40 57 6 -43
8343 -43 -92 -140 -188 -236 -230 -225 -178 -132 -120 -107 -95 -83 -122 -162 -106 -51 -37 -22 -48 -74 -110 -145 -180 -216 -256 -297 -242 -188 -153 -117 -81 -46 -95 -145 -195 -245
8330 -245 -145 -46 53 152 143 135 58 -17 15 49 -38 -126 -169 -211 -213 -215 -112 -8 0 9 40 71 8 25 59 -42 -68 -12 -6 -1 9 20 -32 -84 -42 0 36
8316 36 74 17 -39 -83 -127 -76 -26 23 72 0 -71 -110 -150 -190 -229 -215 -200 -186 -171 -146 -121 -137 -152 -212 -273 -238 -204 -174 -144 -68 7 -82 -92 1 -40
8304 -40 -89 -58 -80 -102 -103 -103 -103 -104 -75 -46 -84 -123 -83 -43 -71 -98 -91 -84 -36 11 -18 -48 -119 -189 -275 -361 -325 -208 -116 -159 -235 -229 -148 -67 -26 -121 -164 -207
8290 -207 -191 -175 -167 -159 -151 -143 -170 -197 -129 -61 -17 26 -78 -183 -150 -117 -85 -52 -87 -123 -199 -275 -246 -217 -148 -79 -66 -53 -40 -27 -24 -21 -23 -25 3 -47 -94 -140
8276 -140 -159 -178 -129 -80 -52 -24 -36 -48 -55 -61 -63 -64 -44 56 89 41 7 -27 -61 -95 -93 -10 -40 -69 -73 -77 -40 -3 20 44 1 -41 -40 -39 -32 -26 -78 -50 -8 32
8261C2M3r2n2Q3JKN0N1j8j8n8n7mmmmL0K9L0L0j%p1j53m9L3M4M4L7m3o0o1J1R2Q2n4j10j10
8248b99m2L8O1O1O5O6L9L7L9L9j2j2j7j7J2o8o9J2qqllNNNMjjo3o4k7N4N4k7j9j8M4M4J4J5
8233f5J5J5M0M2JKn1n2n1n2K6K6L2L1k5N7R6J6opn2n1k2k1M6M5m2m2K5K4JKJJ%%j%K4K3k0
8218C1j01r2j2OOO3O3l2l2N3N2L6m4p4QK5K5j0j0j0j0J4J5M8N0K7n5j0rk2k2o3o4QQQQo0o0
8204b38l8M3k6k7l2M9J07K6j3j3k9N2N2k8K3K4p1p0o5J6J19J20m4m3K4K5J6J7n1n1j4j5j4
8192a69j5KJO4O4K0o2j05j05j8O4L5J16R9J7JKNO%JN0l0p5NK2n9o0K2O7j5n8n9o6o6JKmlQ2
8178b21Q3O6o9q5lP2rp5p5K2J02J7J6Q5Q5j0qppn3K9QPk7k8j1j1L0K9KKKJM9N0j7j8q8q9j3
8163a67O9J1J2J7J7J8J9K3n6r1r1OQ8K3K3K8K8j2j3j2j3l7l8P8P8J5o6j6j6LQ4M7q7OPLLj20
$$ plain form
8261 32 75 -17 -69 14 15 17 67 118 100 82 24 -33 -37 -41 -45 -49 -19 10 40 70 69 69 -2 -155 -204 -171 -127 -83 -46 -89 -149 -210 -199 -107 -25 -79 -189 -299
8248 -299 -341 -303 -242 -181 -116 -50 -11 26 65 104 92 80 63 46 58 -10 -79 -67 -75 -83 -86 -89 -84 -79 -74 -70 -71 -72 -135 -199 -226 -172 -118 -145 -164 -182 -138 -94 -80 -65
8233 -65 -50 -35 5 47 48 50 -1 -53 -104 -156 -130 -104 -72 -41 -66 -9 87 103 97 90 38 -13 -35 -56 -10 35 -7 -49 -24 0 1 3 4 5 5 5 4 4 28 51 31
8218 31 -70 -162 -174 -168 -162 -99 -36 -68 -100 -47 5 41 -3 -77 -69 -44 -19 -29 -39 -49 -59 -45 -30 18 68 95 40 30 21 -1 -23 -86 -150 -142 -134 -126 -118 -178 -238
8204 -238 -276 -233 -259 -286 -318 -269 -162 -136 -149 -162 -191 -139 -87 -115 -92 -68 -139 -209 -274 -258 -139 -19 -63 -106 -82 -57 -41 -24 -75 -126 -140 -155 -169
8192 -169 -184 -182 -181 -117 -53 -33 -95 -200 -305 -323 -259 -224 -108 -9 8 9 11 16 22 22 23 73 43 -32 -27 -5 -64 -124 -102 -35 -50 -108 -167 -233 -299 -298 -296 -300 -303 -221
8178 -221 -138 -72 -141 -226 -229 -157 -166 -241 -316 -294 -192 -175 -159 -74 11 1 -7 -14 -21 -74 -45 -37 -30 -57 -85 -96 -107 -77 -48 -46 -44 -42 -41 8 58 41 23 -65 -154 -167
8163 -167 -98 -87 -75 -58 -41 -23 -4 19 -37 -128 -219 -213 -125 -102 -79 -51 -23 -35 -48 -60 -73 -110 -148 -70 8 23 -43 -59 -75 -72 12 59 -28 -22 -15 -12 -9 -129
8149a29l9O0k0j12l0J3J4M2M3M2M3l3l4l3l4K7K7O2O2L0n0m1m1k9N2POJ8J7k3k3j7j7J32J30
8137A22L4L3n6n6r9k0P9jj61q0l7l6K2K2j8j8k4k4l4M6Q0kM9M9k4k5J6J6J4J5n3n4L3L3J23
8124c6J21N2k9p8p7pqppn5n6n0n0L8J20J49J5m5m5q9q9n5K7M9M8N7N7O1j8p8p8j1j1rP2R5
8111b7R3L0L1j0rm9m9m8m9N0M8j6j8n7n8L7L8L2L1P8mk2k2K7n4j27QJ6J6j4r5r5j3M6M6R2
8098a17R2J3J3n3n4n0n1k8N2M4M3j8j9J7J8J7J8P3P5k0j9n9n9j9J15M6l6k6k6m7j28j0j0L7
8085a76J19P7ll5l6N3N3n2n1n2n2J8J8J8J8k3k2k3k3k5k4J6R7R5m0j74r4lP9Q3LJ2J2KKM0
8072i3m1m2M0M5M4RQk1k2k2k2j3j3N0N0Lp7r4r4l4M8KJJ1J1P9P9K4K3m4m3n8n7l5M5M4M4m6
8058b11m6onO2O2K9K8j2j2k7k6J13L3K0K2J6J6l9l8p5p5mP7L2L2rrJ04K3n2n2n8n7N1N2N0
$$ plain form
8149 -129 -168 -108 -128 -240 -270 -257 -243 -201 -158 -116 -73 -106 -140 -173 -207 -180 -153 -91 -29 1 -49 -90 -131 -160 -108 -101 -95 -77 -60 -83 -106 -123 -140 -8 122
8137 122 156 189 133 77 -22 -42 37 36 -125 -205 -242 -278 -256 -234 -252 -270 -294 -318 -352 -306 -226 -228 -179 -130 -154 -179 -163 -147 -133 -118 -171 -225 -192 -159 -36
8124 -36 85 137 108 30 -47 -54 -62 -69 -76 -131 -187 -237 -287 -249 -129 20 35 -10 -55 -144 -233 -288 -261 -212 -164 -107 -50 11 -7 -85 -163 -174 -185 -194 -122 -27
8111 -27 66 96 127 117 108 59 10 -38 -87 -37 11 -5 -23 -80 -138 -101 -63 -31 0 78 74 52 30 57 3 -124 -116 -100 -84 -98 -193 -288 -301 -255 -209 -117
8098 -117 -25 -12 1 -52 -106 -156 -207 -235 -183 -139 -96 -114 -133 -116 -98 -81 -63 10 85 65 46 -13 -72 -91 24 70 34 8 -18 -65 -193 -203 -213 -176
8085 -176 -57 20 17 -18 -54 -1 52 0 -51 -103 -155 -137 -119 -101 -83 -106 -128 -151 -174 -199 -223 -207 -110 -15 -55 -229 -323 -326 -247 -164 -161 -149 -137 -135 -133 -93
8072 -93 -134 -176 -136 -91 -47 -38 -30 -51 -73 -95 -117 -130 -143 -93 -43 -40 -117 -211 -305 -339 -291 -289 -288 -277 -266 -187 -108 -84 -61 -105 -148 -206 -263 -298 -253 -209 -165 -211
8058 -211 -257 -263 -268 -206 -144 -115 -87 -99 -111 -138 -164 -51 -18 2 24 40 56 17 -21 -96 -171 -175 -98 -66 -34 -43 -52 52 75 23 -29 -87 -144 -93 -41 9
8045IN2m9m7m9m8P7P6m3m4j3j2j3j3n0n1j0j0K5K4O5O5M2M0n2n4O7O6k8k7o7o6%JM4M3k4k4
8032i8q0q0j3J23R4J3j8j9j17J8J04K4O3j5p1p1MMq3q2j5J20J31M9p1p1M5M5jjjjP1P1p6j58
8019a63m8Q8N6k4J1R0M6l5j0rN4N3l2l2l2l1P5P6m6m6n4n6j4j5L4L3P3P4pqqql3l4PPn9o0
8005h7j9j9K2K2N7N7N4k7o2P2K8n3n2K7J11k4l8l8q8r0o8J4llklN9k2J3R4P8lj9k0kjQp3k5
7991a25N7R6J6k6N6NNppm8m6j4j3PQj7j7LLJ4J3L3L3p7p8n6K5OPN2N2n4n5j0P1O0k0j6j5L8
7976d1m3LKrj0m1M1K6n5j5O7J4o8n7n7J9J9Q7Q6K0J9m6m8l9l9K8K9klO1N9O3j8k4N8O6j6p8
7962E8LL0K9J5J4j21j20n3n3O2O2N8N6N7k4m6m4n4n4qqk8N4j2j3J0J0P3P1J5o6M6M6k5k5k4
7949ik5m5m6k3N8P3P1L7L7l3l3p2p3ooj22j23K0J01L9m3l5M5L5L5l4l5j8O3R2J1oom8m8n3
$$ plain form
8045 9 61 12 -35 -84 -132 -55 21 -22 -66 -79 -91 -104 -117 -167 -218 -228 -238 -213 -189 -124 -59 -17 23 -29 -83 -16 50 22 -5 -72 -138 -138 -137 -93 -50 -74 -98
8032 -98 -178 -258 -271 -148 -54 -41 -59 -78 -195 -177 -73 -49 14 -1 -72 -143 -139 -135 -218 -300 -315 -195 -64 -15 -86 -157 -112 -67 -68 -69 -70 -71 0 71 -5 -163
8019 -163 -211 -123 -67 -91 -80 10 56 21 11 2 56 109 77 45 13 -18 57 133 87 41 -13 -69 -83 -98 -64 -31 42 116 109 101 93 85 52 18 25 32 -27 -87
8005 -87 -106 -125 -103 -81 -24 33 87 60 -2 70 98 45 -7 20 131 107 69 31 -57 -147 -215 -201 -204 -207 -209 -212 -153 -175 -162 -68 10 7 -12 -32 -34 -35 -27 -100 -125
7991 -125 -68 28 44 18 74 79 84 77 70 22 -24 -38 -51 -44 -36 -53 -70 -67 -64 -50 -37 -4 29 -48 -126 -182 -157 -151 -144 -92 -40 -94 -149 -159 -88 -28 -48 -64 -79 -41
7976 -41 -84 -81 -79 -88 -98 -139 -98 -72 -127 -142 -75 -61 -129 -186 -243 -224 -205 -118 -32 -12 7 -39 -87 -126 -165 -137 -108 -110 -113 -52 7 70 52 28 86 152 136 58
7962 58 61 91 120 135 149 28 -92 -145 -198 -136 -74 -16 40 97 73 27 -17 -71 -125 -133 -141 -169 -115 -127 -140 -130 -120 -47 24 39 -27 19 65 40 15 -9
7949 -9 -34 -79 -125 -148 -90 -17 54 91 128 95 62 -10 -83 -89 -95 -217 -340 -320 -219 -180 -223 -258 -213 -178 -143 -177 -212 -230 -167 -75 -64 -70 -76 -124 -172 -225
7936b25K8J7J6m6m6k3k3P2P2O2O2k4N7j1j1L4L5K5K5L0n1k0k0o0o0r4j3L1L1K5n6m0M0P1j0
7924a00k5N6L2L2n7n8NNMNQPQPj8j8K3K3J3J2k7k8J2J2J2J2kjO0O1N6k6p5p4n4n4l6M4Lp7
7909b18J4J3K6K6O7O6l9m0K7K8M1M2k6k6m2m4lkN0M9N0N1j4j4q2q0L2L3L1L2MMLMp2p3K1K2
7895c9q5q5J0Rk6k5k6k6L6L6P7P6j3j3QPk0k1M8M7J9J8m8m9mnm5m6J4J5N4N5m0l9%JL6L7m
7881e6mk0k0K1K1j2j1l1l2M4M5K4K4j3j3j3j3KJM2M1l5l7j5j6M8M8M9M8RRn9n8p9q0l9l9J10
7867a09J09J6J5k3k2P0P2r4r3n3n4K3K2O4O2L8L9kkk9l0J1J0j2j3j3j1J5J6J6J6n4n2j3j3
7855g8J3J2pqJ%%%L7L6l0l0k5k4k4k4K5K5K5K5llp0p0lkJ8J8O8O8K7K7poJ4J3L3L3pqn8n7
7839b6J0J0Q1Q3j2j1q0p8j2j2RRl2l1J8J9L9L8jjO7O7k8k8k9k8q3q5J0J0R9R8k3k3k1k1K0
$$ plain form
7936 -225 -197 -180 -164 -210 -256 -279 -302 -230 -158 -96 -34 -58 -1 -12 -23 11 46 71 96 126 75 55 35 -25 -85 -179 -192 -161 -130 -105 -161 -201 -161 -90 -100
7924 -100 -125 -69 -37 -5 -62 -120 -115 -110 -106 -101 -93 -86 -78 -71 -89 -107 -84 -61 -48 -36 -63 -91 -79 -67 -55 -43 -45 -46 14 75 131 105 30 -44 -98 -152 -188 -144 -141 -218
7909 -218 -204 -191 -165 -139 -72 -6 -45 -85 -58 -30 11 53 27 1 -41 -85 -88 -90 -40 9 59 110 96 82 0 -80 -48 -15 16 48 52 56 59 63 -9 -82 -61 -39
7895 -39 -124 -209 -199 -190 -216 -241 -267 -293 -257 -221 -144 -68 -81 -94 -86 -79 -99 -120 -72 -25 -6 12 -36 -85 -89 -94 -139 -185 -171 -156 -102 -47 -87 -126 -126 -125 -89 -52 -56
7881 -56 -60 -80 -100 -79 -58 -70 -81 -112 -144 -100 -55 -31 -7 -20 -33 -46 -59 -57 -56 -14 27 -8 -45 -60 -76 -28 20 69 117 126 135 76 18 -61 -141 -180 -219 -109
7867 -109 0 16 31 8 -14 56 128 34 -59 -112 -166 -143 -121 -57 5 43 82 80 78 49 19 30 40 28 15 2 -9 6 22 38 54 0 -52 -65 -78
7855 -78 -65 -53 -60 -68 -67 -67 -67 -67 -30 6 -24 -54 -79 -103 -127 -151 -126 -101 -76 -51 -54 -57 -127 -197 -200 -202 -184 -166 -98 -30 -3 24 17 11 25 38 71 104 97 89 31 -26
7839 -26 -16 -6 75 158 146 135 55 -23 -35 -47 -38 -29 -61 -92 -74 -55 -16 22 21 20 87 154 126 98 69 41 -42 -127 -117 -107 -8 90 67 44 23 2 22
7826B2K0J0J1l0l0M0M0K0J9j0rj03j05K0J9J9J9nnm6m6J01R9p5p6k8k8J2J2k1k1M6M7l7l7
7813a36j6j7O2O2J3o8LLl2M9O5j6n4n4o8J4L5L6J62J63O1k1o1o1p2J0nno6o8J1J1J1J1r4r4
7800b26j8O3P7P7j2j2KKO9O9j05j06j2j2j7j8q3lj2j2K9K8N0l1k0k1M8J30J2o8q9qJ08K7j6
7787a10j6R6R5j8r7m7m8l7M4M9l2k7N3K3K3m6m7k9N1L4m7MMK4K4m4m4L4L3K8K8L6m6j67q6
7775c05N5N6J9K0M7M8M8M6MMj3r2j07k5rrMNO6O7K1o0n5n5k5k4M4M3J13J12l6l5q4q4O5O5
7762f6k6k6M1M2n0n0rrN0M9O9P0qrm9m7p6p5M6M6P3P2k2k2m4m5o5o5m6m6onP2P3L1L2j7j7
7748a34LLl2l1j2j1Q6Q5rr0n5P9Qp2k7N4R0Q9L7r8j23J2M5l6J7J8pqqqlmO4O4j6j5l6l7O3
7734e5O2K2K2k9k8rrk3k3J7J8o7o7%JJ5J4onL6L6L6L6PQn8o0k2k3k2k2q9q8O0O1N0M9L0L0
$$ plain form
7826 22 42 52 63 33 3 43 83 103 122 112 103 0 -105 -85 -66 -47 -28 -33 -38 -84 -130 -29 70 -5 -81 -109 -137 -125 -113 -134 -155 -109 -62 -99 -136
7813 -136 -152 -169 -107 -45 -32 -100 -97 -94 -126 -77 -12 -28 -82 -136 -204 -190 -155 -119 43 206 267 246 185 124 52 62 57 52 -14 -82 -71 -60 -49 -38 -132 -226
7800 -226 -244 -181 -104 -27 -39 -51 -49 -47 22 91 -14 -120 -132 -144 -161 -179 -262 -265 -277 -289 -260 -232 -182 -213 -233 -254 -206 -76 -64 -132 -221 -229 -121 -94 -110
7787 -110 -126 -30 65 47 -50 -97 -145 -182 -138 -89 -121 -148 -95 -72 -49 -95 -142 -171 -120 -86 -133 -129 -125 -101 -77 -121 -165 -131 -98 -70 -42 -6 -52 -219 -305
7775 -305 -250 -194 -175 -155 -108 -60 -12 34 38 42 29 -63 -170 -195 -204 -213 -209 -204 -138 -71 -50 -110 -165 -220 -245 -269 -225 -182 -69 43 7 -28 -112 -196 -131 -66
7762 -66 -92 -118 -77 -35 -85 -135 -144 -153 -103 -54 15 85 77 68 19 -28 -104 -179 -133 -87 -14 58 36 14 -30 -75 -140 -205 -251 -297 -303 -308 -236 -163 -132 -100 -117 -134
7748 -134 -131 -128 -160 -191 -203 -214 -128 -43 -52 -142 -197 -118 -110 -182 -209 -155 -65 24 61 -37 -160 -148 -103 -139 -122 -104 -111 -119 -127 -135 -138 -142 -78 -14 -30 -45 -81 -118 -55
7734 -55 7 29 51 22 -6 -15 -24 -47 -70 -53 -35 -102 -169 -169 -168 -153 -139 -145 -150 -114 -78 -42 -6 1 9 -49 -109 -131 -154 -176 -198 -287 -375 -315 -254 -204 -155 -125 -95
7719i5O6O6J9j42j65lL5m5M9M9MMJ5J5k5k5rrN8N8O0N9K0J9m9m8qrJ6J5n2n3K4K5p1p0k1k0
7706b43K0K0N3N4M4M3M4j17o7o7k7k6J3J4L7L6L7L6N4N3J3J4k4k3k4k4RRl1l2J8J7J8J7m9
7693h1m9qqj9k0J03J01QQn8o0j0j0L0L0m2m1%jNNNOK1K2O2O1k7k7o6o7m2m2J07J06J03J04
7679B09K4j38j02k1rrK6K5m5m7O2j9j05N7KKk9k8l1l0l0l1R1R0J00J9j16l7Q0jo0n9LLJ4J4
7666a26J9J9j19l9J1J1N3N3KQ4Q2Lj5j4j5j4j5j5l5l6M6q9q5mR1R1L1L0n8n8lP9J2p0KKqq
7653a05J12L2r8r8jjL9M0opj1P0ooL4L3N5k6m8m7j16j17J4R5L0L0L6L5q4q3l8l8NQ6N1l0o2
7639b31J9L6L6k7k6O3O3Q9Ql5l5l0N1N1l0n0n1j5j6N8N7J3o8q2jjq3o8J2N7N6pqn3K8R4R5
7626c1p6p6K3K2K3K3l5l5l5l4ppL3L4J9J9J9J8J8J9n0n0M6M6k2k2q7q7Q9Q9J%JJJ1J1l0l0
$$ plain form
7719 -95 -29 37 56 -86 -251 -254 -219 -264 -215 -166 -162 -158 -143 -128 -153 -178 -187 -196 -138 -80 -20 39 59 78 29 -19 -27 -36 -20 -5 -57 -110 -86 -61 -132 -202 -223 -243
7706 -243 -223 -203 -150 -96 -52 -9 35 -82 -149 -216 -243 -269 -256 -242 -205 -169 -132 -96 -42 11 24 38 14 -9 -33 -57 -48 -39 -70 -102 -84 -67 -49 -32 -81
7693 -81 -130 -138 -146 -165 -185 -82 19 27 35 -23 -83 -93 -103 -73 -43 -85 -126 -126 -127 -122 -117 -112 -106 -85 -63 -1 60 33 6 -60 -127 -169 -211 -104 2 105 209
7679 209 233 95 -7 -28 -37 -46 -20 5 -40 -87 -25 -44 -149 -92 -90 -88 -117 -145 -176 -206 -236 -267 -176 -86 14 33 -83 -120 -40 -41 -101 -160 -157 -154 -140 -126
7666 -126 -107 -88 -207 -246 -235 -224 -171 -118 -116 -32 50 53 38 24 9 -5 -20 -35 -70 -106 -60 -149 -234 -238 -147 -56 -25 5 -53 -111 -114 -35 -23 -93 -91 -89 -97 -105
7653 -105 7 39 -59 -157 -158 -159 -120 -80 -86 -93 -104 -34 -40 -46 -12 21 76 50 2 -45 -161 -278 -264 -169 -139 -109 -73 -38 -122 -205 -243 -281 -276 -190 -139 -169 -231
7639 -231 -212 -176 -140 -167 -193 -130 -67 22 30 -5 -40 -70 -19 32 2 -48 -99 -114 -130 -72 -15 -2 -70 -152 -153 -154 -237 -305 -293 -236 -180 -187 -195 -248 -220 -126 -31
7626 -31 -107 -183 -160 -138 -115 -92 -127 -162 -197 -231 -238 -245 -212 -178 -159 -140 -121 -103 -85 -66 -116 -166 -120 -74 -96 -118 -205 -292 -203 -114 -113 -113 -112 -111 -100 -89 -119 -149
7612a49k3k4k3k3R2R2LLQQ8L0j05n0L2J8J8J9K0m6m7m8m7M7M7kkL8L7j4j6j6j6k2k3k3k2k
7598a51jL9L9m2m1m2m2j0j0N7N7J1J0N1N2j6j5n6n6K0K1K0K1L8L8kkm2m3Q0P8O0O0o2o2J8
7585G5J8J9J8p8p7p3p3L7J19Q6m9l8M1N5N6l5l5j21m0L9L9M3M5J6J5k9N1K2K2K7K7j29j27
7573c4l3l4K0K1k0k0M4M4M3M4N4N3m1m1k1k0K0K0l7l7q1q2O6j4k0O1Q5Nl9l8J5J4m4m5o0P6
7560g6Q8Q8O3j8j4j3o9o8P4P4L4m8r6r5r3r3k6k5J15J16K1K1j7j7j7j7K0K0O1N9L3L3r2j73
7548a47j07k5J8J8K8K8j3j2J8J9N4N3M2l9j06k6K2K2O2O2P5n%jj14j15j3O9L9L9M5M3k8k7
7536b2j5O6J11k3j18j18jjm2m1M5M6M5M5m9m9J8J9PQO9P0R2J1m2m3O2j9j19l7l4j16j6O5j
7523a27jMMj3j2n9K3jkL9L9K7n4rqj6j6J9J9J06K4l0k9O6j4r1r1NMM5M4O3O1J4o7J2J1JJL4
$$ plain form
7612 -149 -172 -196 -219 -242 -150 -58 -55 -52 -44 44 74 -31 -81 -49 -31 -13 6 26 -20 -67 -115 -162 -115 -68 -70 -72 -34 3 -11 -27 -43 -59 -81 -104 -127 -149 -151
7598 -151 -152 -113 -74 -116 -157 -199 -241 -251 -261 -204 -147 -136 -126 -75 -23 -39 -54 -110 -166 -146 -125 -105 -84 -46 -8 -10 -12 -54 -97 -17 61 121 181 119 57 75
7585 75 93 112 130 52 -25 -98 -171 -134 -15 71 22 -16 25 80 136 101 66 -55 -95 -56 -17 26 71 87 102 73 124 146 168 195 222 93 -34
7573 -34 -67 -101 -81 -60 -80 -100 -56 -12 31 75 129 182 141 100 79 59 79 99 62 25 -56 -138 -72 -86 -106 -45 40 45 6 -32 -17 -3 -47 -92 -152 -76
7560 -76 12 100 163 145 131 118 49 -19 55 129 163 115 19 -76 -169 -262 -288 -313 -198 -82 -61 -40 -57 -74 -91 -108 -88 -68 -7 52 85 118 26 -147
7548 -147 -254 -279 -261 -243 -215 -187 -200 -212 -194 -175 -121 -68 -26 -65 -171 -197 -175 -153 -91 -29 46 41 41 40 -74 -189 -202 -133 -94 -55 -10 33 5 -22
7536 -22 -37 29 140 117 -1 -119 -120 -121 -163 -204 -159 -113 -68 -23 -72 -121 -103 -84 -77 -69 0 70 162 173 131 88 150 131 12 -25 -59 -175 -191 -126 -127
7523 -127 -128 -124 -120 -133 -145 -204 -181 -182 -184 -145 -106 -79 -133 -142 -150 -166 -182 -163 -144 -38 -14 -44 -73 -7 -21 -112 -203 -198 -194 -149 -105 -42 19 33 -34 -22 -11 -10 -9 25
7508B5m6l7l7j3O9o4o4k7J08P7lr0r1L0J11P4pMLk0k0q0q0j04L2R5J5M1M1nnl3l4QPm5m5m
7495b14nL3L3L3L3k2k3k2k3J6J7O2j9l5l6q0%P9J60J00l5k8k7l7l7l0k9l0l0J4J4n3n3JJJ
7481b71JqpQ7Q7J8J7J8J8J5J5Jj34q6oL5L5%jj%J0J0M6M6M5l6k2k2j34JJ5J5J13L2L2L1Jp9
7467f3l0k9j8O4P9Q1j2r2m7m7j8j7j8j8K6K6j4j4J9K0k2k1L1L0L1L0J4J3p6p6m4L6P7mp9q0
7454b62qP3Q4Q3J6J6J2o7k3k3k2k3J9J8J00R9L3L2k1k1k0k1n1n0k9N2K2K3L9m3m5L4L4m6r2
7441g8j2O0N8J7J6n0n0n7n6O4O5lmJJm4L8N2j09q7P5Q7Ol4l4q0q0O7O7O6O6KKl7l8rqrqr1
7427a68r0N8N8K6K6o9o9P8P8P7P8l6l6l6l6J4J5J4J4J1J1J2J1l9l8m0l9M7M6M6M7K8K8j3j2
7414A02J1J0n6n7L2L1L2L2J3J2n5n5K8K8K7K8O0O1l5l4m5m6m5m5r4r4r5r4J1J1J1J1P5P4k0
$$ plain form
7508 25 -21 -58 -95 -108 -39 -103 -167 -194 -86 -9 -12 -102 -193 -163 -52 22 15 19 22 2 -18 -98 -178 -282 -250 -155 -140 -99 -58 -63 -68 -101 -135 -127 -120 -165 -210 -214
7495 -214 -219 -186 -153 -120 -87 -109 -132 -154 -177 -161 -144 -82 -101 -136 -172 -252 -252 -173 -13 87 52 24 -3 -40 -77 -107 -136 -166 -196 -182 -168 -221 -274 -273 -272 -271
7481 -271 -270 -278 -285 -198 -111 -93 -76 -58 -40 -25 -10 -9 -143 -229 -235 -200 -165 -165 -166 -167 -167 -157 -147 -101 -55 -10 -46 -68 -90 -224 -223 -208 -193 -80 -48 -16 15 16 -63
7467 -63 -93 -122 -140 -76 3 84 72 -20 -67 -114 -132 -149 -167 -185 -159 -133 -147 -161 -142 -122 -144 -165 -134 -104 -73 -43 -29 -16 -92 -168 -212 -176 -99 -103 -182 -262
7454 -262 -270 -197 -113 -30 -14 2 14 -53 -76 -99 -121 -144 -125 -107 -7 92 125 157 136 115 95 74 23 -27 -56 -4 18 41 80 37 -8 26 60 14 -78
7441 -78 -90 -30 28 45 61 11 -39 -96 -152 -88 -23 -26 -30 -29 -28 -72 -34 18 -91 -178 -103 -16 -10 -44 -78 -158 -238 -171 -104 -38 28 30 32 -5 -43 -52 -60 -69 -77 -168
7427 -168 -258 -200 -142 -116 -90 -159 -228 -150 -72 5 83 47 11 -25 -61 -47 -32 -18 -4 7 18 30 41 2 -36 -76 -115 -68 -22 24 71 99 127 114 102
7414 102 113 123 67 10 42 73 105 137 150 162 107 52 80 108 135 163 223 284 249 215 170 124 79 34 -60 -154 -249 -343 -332 -321 -310 -299 -224 -150 -170
7402a70k0K6K5R3R2K5K4K5K4k5k6J6J5q7q5RQj2j2K9K8J8J8m8m9k9k9O5O5N1N1j24j25m2m3
7389b19kkK1K1K1K2k9k9L9L9k3k3J8J7k8k8J2J3J00R9L3L3K4K4l4l5r8L5P4qm4m3m9m9M4M4
7376a0o9J2L0K9P9%j6j6L0n1o4J6l0l0l8M4J14k1q0q2m5L5M8l3k8N3O2O1k7k8j5j5p0J2Q5
7363e8n1j14l4P0j1M0M0j5j5N2N3P0P1K2n9p2p3J6J6J0J1m1M0L1n1m5L5L1L1K0o1r4j3J11
7351c7J11N9N8l9j20m8L2K2K3PQQQN6N5J07n6j14j14p8p8MQ5R0p1q6q5N4N3j3j2K8K8n7n7
7338a69L8L8M2M3KLPPM9M8q3q3L9L7R3R3k9k9q6q6QRl6l6L2L2O3O4q4q4P0P0L0L0J9K0m8m8
7324H5m4m3llJ1J3J3J2rqQ5Q6n7n7J1J0L5L6p6p6j16M5J02J03L1L1j0j0n8n8n8n7P3P4L3L4
7311A80M2M1M2M2O7O6J08J07J8J9J30K92L18L18L96N58J029J624R15j735k097j178o92m21
$$ plain form
7402 -170 -190 -164 -139 -46 46 71 95 120 144 119 93 109 124 37 -48 -39 -31 -43 -55 -26 2 20 38 -10 -59 -88 -117 -52 13 64 115 -9 -134 -176 -219
7389 -219 -221 -223 -202 -181 -160 -138 -167 -196 -157 -118 -141 -164 -146 -129 -157 -185 -173 -160 -60 39 72 105 129 153 119 84 -14 21 95 87 43 0 -49 -98 -54 -10
7376 -10 -79 -67 -37 -8 71 71 55 39 69 18 -46 -30 -60 -90 -128 -84 30 9 -71 -153 -198 -163 -115 -148 -176 -123 -61 0 -27 -55 -70 -85 -155 -143 -58
7363 -58 -109 -223 -257 -187 -198 -158 -118 -133 -148 -96 -43 27 98 120 61 -11 -84 -68 -52 -42 -31 -72 -32 -1 -52 -97 -62 -31 0 20 -41 -135 -148 -37
7351 -37 74 133 191 152 32 -16 16 38 61 68 76 84 92 148 203 310 254 140 26 -52 -130 -126 -41 49 -22 -108 -193 -139 -86 -99 -111 -83 -55 -112 -169
7338 -169 -131 -93 -51 -8 -6 -3 4 11 60 108 25 -58 -19 18 111 204 175 146 60 -26 -18 -9 -45 -81 -49 -17 46 110 26 -58 12 82 112 142 161 181 133 85
7324 85 41 -2 -5 -8 3 16 29 41 32 24 109 195 138 81 92 102 137 173 97 21 -95 -50 52 155 186 217 207 197 139 81 23 -34 39 113 146 180
7311 180 222 263 305 347 414 480 588 695 713 732 862 1154 1472 1790 2186 2744 3773 5397 6312 4577 2480 1302 610 189
7302A89k94j33n9n9K1K0K6K5l7M4M9l2j3O7n1n1l3l3J3J2q9qO8O8M6M6O3p2j41oN8N8P1P2
7290i5N0l2o4o5P0P1j7j53j52j8J1J1k6N5M5M5Q5Q5N1l0p4p3n4K7P2P1K7n4m9m9j5j5K5K5
7278b09M7M8k1k0k9k9OPj7r8l1N0kjR2R3Q4Kj9k0klO5O4o5o6K4K4M0m0l0l0MQ4jjM0M0q9j71
7263a80J5J4J0RnonoL8L8l0l0j7j6J8J9N1k9k5k4J0J1J0J0l4l4L3L3k6k7l2N0O2O1NMp0J1
7249h4L2L3k6k6m6m6NNk7k8k2J13J21M2n0n1j01k1J3J3klm0m0ONo5J7L8L8lkP0P0K2J01J6
7236G7J6k9k9m8m9qpK8K8l0j11k4k4J5J5L5L5m3m3JQ2K1o1p2p2p1J0J09J08O0k2o5o5q4lJ9
7223c01J9l9l9P8P8P0j0nnn6n6L9L8N7N7j4r4j06k5R5R5M8l4k8k8k2k3K3K3l7M4K3n7k2k2
7210b36M6M5m2L8O1O0L0L1rrK1K1L1n0p8Kqqp8p9l5M6L3m8q4kO1O2K5K6L8L8l3M8L4m8k2N9
$$ plain form
7302 189 -105 -238 -297 -356 -335 -315 -289 -264 -301 -257 -208 -240 -253 -186 -237 -288 -321 -354 -341 -329 -418 -426 -358 -290 -244 -198 -135 -207 -348 -354 -296 -238 -167 -95
7290 -95 -45 -77 -141 -206 -136 -65 -82 -235 -387 -405 -394 -383 -409 -354 -309 -264 -179 -94 -43 -73 -147 -220 -274 -247 -175 -104 -77 -131 -180 -229 -244 -259 -234 -209
7278 -209 -162 -114 -135 -155 -184 -213 -207 -200 -217 -315 -346 -296 -298 -299 -207 -114 -30 -28 -47 -67 -69 -72 -7 57 -8 -74 -50 -26 14 -26 -56 -86 -82 2 1 0 40 80 -9 -180
7263 -180 -165 -151 -141 -132 -137 -143 -148 -154 -116 -78 -108 -138 -155 -171 -153 -134 -83 -112 -137 -161 -151 -140 -130 -120 -154 -188 -155 -122 -148 -175 -207 -157 -95 -34 -29 -25 -95 -84
7249 -84 -52 -19 -45 -71 -117 -163 -158 -153 -180 -208 -230 -117 4 46 -4 -55 -156 -177 -164 -151 -153 -156 -196 -236 -230 -225 -290 -273 -235 -197 -200 -202 -132 -62 -40 61 77
7236 77 93 64 35 -13 -62 -70 -77 -49 -21 -51 -162 -186 -210 -195 -180 -145 -110 -153 -196 -195 -113 -92 -153 -225 -297 -368 -358 -249 -141 -81 -103 -168 -233 -317 -320 -301
7223 -301 -282 -321 -360 -282 -204 -134 -144 -149 -154 -210 -266 -227 -189 -132 -75 -89 -183 -289 -314 -219 -124 -76 -110 -138 -166 -188 -211 -188 -165 -202 -158 -135 -192 -214 -236
7210 -236 -190 -145 -187 -149 -88 -28 2 33 24 15 36 57 88 38 -40 -38 -46 -54 -132 -211 -246 -200 -167 -215 -299 -301 -240 -178 -153 -127 -89 -51 -84 -36 -2 -50 -72 -13
7196a3%j%jJ2o9k4k3L2L3k9l0l7M4m6j27l9M1P7mLLl7l7MQ5Q5Ln1n1L0n1n1n2o1K0K9K9l4
7182c38l4K8K7K8K7R2R1l0k9PPPPo0o1p1J0M8l4j3O8Q7Nn6K4J7J7K2K2OOl9M1K7K7L1L1MM
7168E3MMj02j02%Q1K4K4QPl1l2QRJJo6o7ppL3L3m6m6r2j0j0rnmJ21J21N3N2J4J3n2n4rrL7
7153e9m5m1m0kP9N4k7n7P7L9m1n1n0RR1NMk6k6O8O8m0m1k7j08l2J04K2K3J3J3k8k7o7o6j8
7140b50O3Q2Q2J5J3m2j24n6K5LLQQKKKLk1k1J5J5L6m6m6L5J4J3K3K4m4L6P8mn7n7K9n2l0N2
7126a69O3O3L0n1nom3m3m8L4J2J3N9N8k0k0k0k0K1K1k4j04l2M9opN7k4o5J6O0O1q3q3J26J27
7113cMNj9k0q8q7m7m7K1K0j3j3N5N4M1M1n4n3K1K1k0j9J7J7J7J6N1N1R1R2J6J6k4k4p8p7l7
7099e6l7qqpqK3K2j8j7j6j5J06J06j4j3n3n4j9k0j9j9m0l9K8K8K2K2O3O2k9l0L7L7j47j49
$$ plain form
7196 -13 -13 -14 -14 -15 -3 -72 -96 -119 -87 -54 -83 -113 -150 -106 -152 -279 -318 -277 -200 -204 -201 -198 -235 -272 -268 -183 -98 -95 -146 -197 -167 -218 -269 -321 -382 -362 -333 -304 -338
7182 -338 -372 -344 -317 -289 -262 -170 -79 -109 -138 -131 -124 -117 -110 -170 -231 -302 -292 -244 -278 -291 -223 -136 -131 -187 -163 -146 -129 -107 -85 -79 -73 -112 -71 -44 -17 14 45 49 53
7168 53 57 61 -41 -143 -143 -62 -38 -14 -6 1 -30 -62 -54 -45 -44 -43 -109 -176 -183 -190 -157 -124 -170 -216 -308 -318 -328 -337 -342 -346 -225 -104 -51 1 15 28 -24 -78 -87 -96 -59
7153 -59 -104 -145 -185 -187 -108 -54 -81 -138 -61 -22 -63 -114 -164 -155 -64 -59 -55 -81 -107 -39 29 -11 -52 -79 -187 -219 -115 -93 -70 -57 -44 -72 -99 -166 -232 -250
7140 -250 -187 -105 -23 -8 5 -37 -161 -217 -192 -189 -186 -178 -170 -168 -166 -164 -161 -182 -203 -188 -173 -137 -183 -229 -194 -180 -167 -144 -120 -164 -128 -50 -54 -111 -168 -139 -191 -221 -169
7126 -169 -106 -43 -13 -64 -69 -75 -118 -161 -209 -175 -163 -150 -91 -33 -53 -73 -93 -113 -92 -71 -95 -199 -231 -182 -188 -195 -138 -162 -227 -211 -151 -90 -173 -256 -130 -3
7113 -3 1 6 -13 -33 -121 -208 -255 -302 -281 -261 -274 -287 -232 -178 -137 -96 -150 -203 -182 -161 -181 -200 -183 -166 -149 -133 -82 -31 60 152 168 184 160 136 58 -19 -56
7099 -56 -93 -101 -109 -116 -124 -101 -79 -97 -114 -130 -145 -39 67 53 40 -13 -67 -86 -106 -125 -144 -184 -223 -195 -167 -145 -123 -60 2 -27 -57 -20 17 -130 -279
7087b79k6k7Q2Q2J5J4K9K9K9K8n7n7L8L7l8l9KKM0M0M0L9n6n8R1R1MLr2r0J1J0k9l0J6J5J6
7073g5J5L6L5nn%j%%j4j3j4j3ooooP2P2m9m9l4l4l5l4J3J3J3J3o8o7N4N4K2K2K2K2K4K5O4
7059E7O5K7K7r4r4r5r6k8k8k4k5J6J6K7K7j3j4L6L7L6L6k0j9M7M8l7l8l8l7J9J9J9J9K6K6
7046g0j5j5m7m6K0K1NMNNRJ0P7P7L0L0l8l8n0n1n1n1rqqqK7K8K7K7L2L2L1L1m1m2K5K6j0j0
7031b9j0j0q3q3m3m3L6L6L5L6LLLKl0l1l1l1K3K3K4K3qqqqk1k0J9K0j%jjR2R1l1l0j1j1L0
7016h4K9j11j10J1J1L4L5P5P5qqm9m8M5M5p7p6lmllKLR7R7J6J5j05j06k7k6M1M1L0L1l7l7
7003a89k0j9j9k0Q7Q6J8J9N0M9j8j7n1n1j1j1l1l1J0RN4N4j4j4K1K1K1J9L0K9o5o5k1k1M7
6990f4M7M5M7k2k1o5o6K8K9JJKJk3k3J7J7m3m3llP3P2p5p5l7l7MMm8m7M6M7K1K0K1K0MLM5
$$ plain form
7087 -279 -305 -332 -250 -168 -153 -139 -110 -81 -52 -24 -81 -138 -100 -63 -101 -140 -138 -136 -96 -56 -16 23 -33 -91 0 91 95 98 6 -84 -73 -63 -92 -122 -106 -91 -75
7073 -75 -60 -24 11 6 1 1 0 0 0 -14 -27 -41 -54 -60 -66 -72 -78 -6 66 17 -32 -66 -100 -135 -169 -156 -143 -130 -117 -185 -252 -198 -144 -122 -100 -78 -56 -32 -7 57
7059 57 122 149 176 82 -12 -107 -203 -231 -259 -283 -308 -292 -276 -249 -222 -235 -249 -213 -176 -140 -104 -124 -143 -96 -48 -85 -123 -161 -198 -179 -160 -141 -122 -96 -70
7046 -70 -85 -100 -147 -193 -173 -152 -147 -143 -138 -133 -124 -114 -37 40 70 100 62 24 -26 -77 -128 -179 -188 -196 -204 -212 -185 -157 -130 -103 -71 -39 -8 23 -18 -60 -35 -9 -19 -29
7031 -29 -39 -49 -132 -215 -258 -301 -265 -229 -194 -158 -155 -152 -149 -147 -177 -208 -239 -270 -247 -224 -200 -177 -185 -193 -201 -209 -230 -250 -231 -211 -212 -212 -213 -214 -122 -31 -62 -92 -103 -114 -84
7016 -84 -55 -166 -276 -265 -254 -220 -185 -110 -35 -43 -51 -100 -148 -103 -58 -135 -211 -214 -218 -221 -224 -222 -219 -122 -25 -9 6 -99 -205 -232 -258 -217 -176 -146 -115 -152 -189
7003 -189 -209 -228 -247 -267 -180 -94 -76 -57 -7 42 24 7 -44 -95 -106 -117 -148 -179 -169 -160 -106 -52 -66 -80 -59 -38 -17 2 32 61 -4 -69 -90 -111 -64
6990 -64 -17 28 75 53 32 -33 -99 -71 -42 -41 -40 -38 -37 -60 -83 -66 -49 -92 -135 -138 -141 -68 4 -71 -146 -183 -220 -216 -212 -260 -307 -261 -214 -193 -173 -152 -132 -128 -125 -80
6976h0M4l5l6l0l0k1N9K8n4k6J08J08k6p7MJ1J2Qp4o8o8M9M9M9M9r1r1L0L1N3N3J8J8QQ9K5
6963I6j09j8j9o7o8K4K3j7j6NOl4l5qpqqQ0P9J2J2M2M1j00j02l6M5Q3n1j11K5L0L0K9n2m2
6950b46m1o7J5J13J13j1r2k4N7O4O5pq8m0m1k8N2O5j6k8k7o9J1O1O1J6J5O1k0q0p9j3O7K3
6937a58n9qrl6l6NNJ5J6NQ6L3m9KKK6K5P1j0n8n8m2M0K1K2K6K6J0J1J0J0k0k0k1k0M1M1M0
6923a5M0k6k7k7k7P2P1NMk8k9k7k9NOM4M6oopoL0L0L1L0l2l2l2l2q7q8PPN7N7J7J6KKLKl8
6908a7l8K9K8k5k6o7o6rqJ14J12J9J8j8j7j23m3mj39k2J13J14L3n4n4n9n9j4j4N3N4J20J19
6896E0kjrqj02j03M5M4k3k4k1k2L8L7J56K2j05j05J3J3j9j9l8R7J15J16j5j4q2q1K5K4o8p0
6884a36q9q9L3L3ononL5L5onL0L0L0L0K2K3O7j4k9l1l6l6R8R6p2p3j2P0j7j6jjO1O2l1j12
$$ plain form
6976 -80 -36 -71 -107 -137 -167 -188 -129 -101 -155 -181 -73 35 9 -68 -64 -53 -41 -33 -107 -175 -243 -194 -145 -96 -47 -138 -229 -199 -168 -115 -62 -44 -26 -18 71 96
6963 96 -13 -31 -50 -117 -185 -161 -138 -155 -171 -166 -160 -194 -229 -237 -244 -252 -260 -180 -101 -89 -77 -35 6 -94 -196 -232 -187 -104 -155 -266 -241 -211 -181 -152 -204 -246
6950 -246 -287 -354 -339 -226 -113 -124 -216 -240 -183 -119 -54 -61 -149 -189 -230 -258 -206 -141 -157 -185 -212 -281 -270 -209 -148 -132 -117 -56 -76 -156 -235 -248 -181 -158
6937 -158 -217 -225 -234 -270 -306 -301 -296 -281 -265 -260 -174 -141 -190 -188 -186 -160 -135 -64 -74 -132 -190 -232 -192 -171 -149 -123 -97 -87 -76 -66 -56 -76 -96 -117 -137 -96 -55 -15
6923 -15 25 -1 -28 -55 -82 -10 61 66 70 42 13 -14 -43 -38 -32 12 58 52 46 39 33 63 93 124 154 122 90 58 26 -61 -149 -142 -135 -78 -21 -4 12 14 16 19 21 -17
6908 -17 -55 -26 2 -23 -49 -116 -182 -191 -199 -85 27 46 64 46 29 -94 -137 -141 -280 -302 -189 -75 -42 -96 -150 -209 -268 -282 -296 -243 -189 -69 50
6896 50 48 47 38 30 -72 -175 -130 -86 -109 -133 -154 -176 -138 -101 55 77 -28 -133 -120 -107 -126 -145 -183 -86 29 145 130 116 34 -47 -22 2 -66 -136
6884 -136 -225 -314 -281 -248 -254 -259 -265 -270 -235 -200 -206 -211 -181 -151 -121 -91 -69 -46 21 7 -22 -53 -89 -125 -27 69 -3 -76 -88 -18 -35 -51 -52 -53 8 70 39 -73
6870g3j13l1P2P1RJ0lkM3l8m1m1m6m6M1M1p5p5l2N0M5M5K1K2K2K2JJ%JKJN3k9q8pNNK9n2m7
6855b27Q8R4J2nq6m8L2P7P5j1j1m6m7n0L2P7lm3L8K9K7L6L7n3n2J6R6N6k4j9k0j9j00J7J6
6842iN0N2RJ0n9n7%jjjl9m0m0l9O0O0J1p0l4l4Q3Q3J5J5J6J6K1K1j9k0mnmml8l7KLM0M2k6
6828B8k7L6L6L6L6PQq8q6l3l2l2l3M6M6M7M5m7m8m8m8K9L0L0L0LLMLL3L4l4l3n9n9j9j8qr
6813a91L2L2J7J7N8N7K4K3j6j7M7M7m7m8o9p1k9l0J5J4J5J5K5K5O5O5m4m3m5m4j4j5Q0P9K1
6801E0K2m6m5M0M1n3n3K2K2K1K2m7m8pqj6j7K4K5o4o4L1L1N3N3j5j4L1L1L2L2o7o7k7k7j0
6788a12j0j0j0M1M2Q1Q1p0o9lkQQQRmmr9r9L7L6N7N7J2J1J1J1JJM1M1p4p3p4p4qrQ6Q6l3l3
6773a04l3l3M2M1K1K1p6p6P3P3K7K6OPllo9p1ppL3L3P9Q1J2J3jkk1k2o6o6%JMNo4o3J9J8k2
$$ plain form
6870 -73 -186 -217 -145 -74 -65 -55 -58 -60 -17 -55 -96 -137 -183 -229 -188 -147 -222 -297 -329 -279 -234 -189 -168 -146 -124 -102 -101 -100 -100 -99 -97 -96 -43 -72 -160 -167 -162 -157 -128 -180 -227
6855 -227 -139 -45 -33 -38 -124 -172 -140 -63 12 1 -10 -56 -103 -153 -121 -44 -47 -90 -52 -23 4 40 77 24 -28 -12 84 140 116 97 77 58 -42 -25 -9
6842 -9 41 93 102 112 53 -4 -4 -5 -6 -7 -46 -86 -126 -165 -105 -45 -34 -104 -138 -172 -89 -6 9 24 40 56 77 98 79 59 55 50 46 42 4 -33 -31 -28 12 54 28
6828 28 1 37 73 109 145 152 160 72 -14 -47 -79 -111 -144 -98 -52 -5 40 -7 -55 -103 -151 -122 -92 -62 -32 -29 -26 -22 -19 14 48 14 -19 -78 -137 -156 -174 -182 -191
6813 -191 -159 -127 -110 -93 -35 22 46 69 53 36 83 130 83 35 -34 -105 -134 -164 -149 -135 -120 -105 -80 -55 10 75 31 -12 -57 -101 -115 -130 -50 29 50
6801 50 72 26 -19 21 62 9 -44 -22 0 21 43 -4 -52 -59 -67 -83 -100 -76 -51 -115 -179 -148 -117 -64 -11 -26 -40 -9 22 54 86 19 -48 -75 -102 -112
6788 -112 -122 -132 -142 -101 -59 22 103 33 -36 -39 -41 -33 -25 -17 -8 -12 -16 -115 -214 -177 -141 -84 -27 -15 -4 7 18 19 20 61 102 28 -45 -119 -193 -201 -210 -124 -38 -71 -104
6773 -104 -137 -170 -128 -87 -66 -45 -121 -197 -124 -51 -24 2 8 15 12 9 -60 -131 -138 -145 -112 -79 0 81 93 106 105 103 82 60 -6 -72 -72 -71 -67 -62 -126 -189 -170 -152 -174
6758a74k2J6J6J6J6N6N5j2j2o0o0PQM6M6k1k1j01j00ooL9L9k9k8N3N4N4N3opO1N9pqk7k8p0
6744a11p0K5K4O1O1opo4o5k4k4M4M3K3K4KLo4o5mmk5k4K0K0O0O1k7k7J4J3l3l4j4j3M9N0O9
6730c9O9J7J8llj03j05l6l7j4j4Q1Q1N2N0J1J1m0m2k2k1O5O4k9k9k4k3m4m4L1L0j0j0k7k7
6717a66J3J4L0L0M1M1K9j05n0n0LMMMo9o8J07J07l5l6L1L2k3k4k3k3mmL7L7j7j6qqj2J23R2
6704C8J2q5q6m2m3l9R5J41Pj09k8j4j5j8j9K2K3K8K9j2j1N1N2p0p0POPPL3L3o2o1m7m6P5P5
6691a36k9k9k9k9rrN9N9j%%jQ0P9L9M0p7p5l6l5mmlmm4m5m5m5MLM4M4KKKKP3P3m8m9LLLKO6
6674a04O6k8k9K9K8o7o6ooO2O2L7L5n8n8L2L2L2L1r2r3M5M6P9q1q5q6K3K4R0R1PPo0o1M7M7
6661b8M6M7o0n9n9o0j0rJ29J28R5o8p1p0J2J3n6n5n4n3j3j4JKM1M2K1K1K2K1j9k0k0j9J8J7
$$ plain form
6758 -174 -196 -180 -164 -148 -132 -76 -21 -33 -45 -105 -165 -158 -150 -104 -58 -79 -100 -201 -301 -307 -313 -274 -235 -264 -292 -239 -185 -131 -78 -84 -91 -30 29 22 14 -13 -41 -111
6744 -111 -181 -156 -132 -71 -10 -16 -23 -87 -152 -176 -200 -156 -113 -90 -66 -64 -61 -125 -190 -194 -198 -223 -247 -227 -207 -147 -86 -113 -140 -126 -113 -146 -180 -194 -207 -158 -108 -39
6730 -39 30 47 65 62 59 -44 -149 -185 -222 -236 -250 -169 -88 -36 14 25 36 -4 -46 -68 -89 -24 40 11 -18 -42 -65 -109 -153 -122 -92 -102 -112 -139 -166
6717 -166 -153 -139 -109 -79 -38 3 32 -73 -123 -173 -170 -166 -162 -158 -227 -295 -188 -81 -116 -152 -121 -89 -112 -136 -159 -182 -186 -190 -153 -116 -133 -149 -157 -165 -177 -54 38
6704 38 50 -35 -121 -163 -206 -245 -150 -9 -2 -111 -139 -153 -168 -186 -205 -183 -160 -132 -103 -115 -126 -75 -23 -93 -163 -156 -150 -143 -136 -103 -70 -132 -193 -240 -286 -211 -136
6691 -136 -165 -194 -223 -252 -261 -270 -211 -152 -153 -153 -153 -154 -74 5 44 84 7 -68 -104 -139 -143 -147 -150 -154 -198 -243 -288 -333 -329 -326 -282 -238 -236 -234 -232 -230 -157 -84 -132 -181 -178 -175 -172 -170 -104
6674 -104 -38 -66 -95 -66 -38 -105 -171 -177 -183 -121 -59 -22 13 -45 -103 -71 -39 -7 24 -68 -161 -116 -70 9 -72 -157 -243 -220 -196 -106 -15 -8 -1 -61 -122 -75 -28
6661 -28 18 65 5 -54 -113 -173 -183 -192 -63 65 160 92 21 -49 -37 -24 -80 -135 -189 -242 -255 -269 -268 -266 -225 -183 -162 -141 -119 -98 -117 -137 -157 -176 -158 -141
6648a41J8J7QQQ4n2k5k5l4l4k9k9R2R2p4p4o1K0J13k3j09k7O2O1k7k8m5m5P7P6L1L0K5K5k2
6635f5j03o7O9N2N1qqp0p0K5K4L4L4L4L4ONo1o2M7M7p5p4K9L0P0O9m7m8m7m8P6P5L5L4mnL6
6621E4L6m0m0q0q1k3k3J7J7N0N0r9r9k9l0L8L8O6O6K6K5J1J2J1J1n5n6j5j5LLl8l8n6n7O6
6608b74O5R4R4N3q1n6K5J1J1l6l7N7N8n9n9n9n9PQK4J06P9lj9k0k2k2r8L7P5P5J1J1pq7q7
6595a84oO5O4n1n2N9N8o2o3K0K1k1k0j5j5j6j5k1k1k6k6J01K0jkL3L2L3L3J3J3qr0m3m2j2
6582b47j2O2j9j9O3K2K3K3K3J5o5o5J6k4k4j9j9L3L3O9O9K5n6n1n0M9M9R4J3k2k4J8o4m4m3
6569a68q9q9K5K6O7O6onL5L5K7K7K7K6J5J4k6k5p7p6J8J8j3j3qrn0L1N6J37L2m8KKp8p8l7
6556b09l8M9M8M9M9OOl4l4o1o0PPj4j4Q0Q0K2K3K2K1O1O2q7q6p1p1K3K4j1j1L0L0L7L7q4q4
$$ plain form
6648 -141 -123 -106 -98 -90 -6 -58 -83 -108 -142 -176 -205 -234 -142 -50 -124 -198 -259 -239 -126 -149 -258 -285 -223 -162 -189 -217 -262 -307 -230 -154 -123 -93 -68 -43 -65
6635 -65 -168 -235 -166 -114 -63 -71 -79 -149 -219 -194 -170 -136 -102 -68 -34 -28 -23 -84 -146 -99 -52 -127 -201 -172 -142 -72 -3 -50 -98 -145 -193 -117 -42 -7 27 23 18 54
6621 54 90 50 10 -70 -151 -174 -197 -180 -163 -113 -63 -162 -261 -290 -320 -282 -244 -178 -112 -86 -61 -50 -38 -27 -16 -71 -127 -142 -157 -154 -151 -189 -227 -283 -340 -274
6608 -274 -209 -115 -21 32 -49 -105 -80 -69 -58 -94 -131 -74 -16 -75 -134 -193 -252 -245 -237 -213 -107 -28 -31 -50 -70 -92 -114 -212 -175 -100 -25 -14 -3 -10 -97 -184
6595 -184 -190 -125 -61 -112 -164 -105 -47 -109 -172 -152 -131 -152 -172 -187 -202 -218 -233 -254 -275 -301 -327 -226 -206 -207 -209 -176 -144 -111 -78 -65 -52 -60 -150 -193 -235 -247
6582 -247 -259 -197 -216 -235 -172 -150 -127 -104 -81 -66 -131 -196 -180 -204 -228 -247 -266 -233 -200 -131 -62 -37 -93 -144 -194 -145 -96 -2 11 -11 -35 -17 -81 -125 -168
6569 -168 -257 -346 -321 -295 -228 -162 -168 -173 -138 -103 -76 -49 -22 4 19 33 7 -18 -95 -171 -153 -135 -148 -161 -169 -178 -228 -197 -141 -4 28 -20 -18 -16 -94 -172 -209
6556 -209 -247 -198 -150 -101 -52 -46 -40 -74 -108 -169 -229 -222 -215 -229 -243 -163 -83 -61 -38 -16 5 66 128 41 -45 -116 -187 -164 -140 -151 -162 -132 -102 -65 -28 -112 -196
6542a96mmmmM2M2n3n3L8L8L9L8j6j6N2N1J2J3J3J3j0j1j0j0OPn9o0LMMMj9j9K1K2K1K2p4p3
6528a90J8J8J8J7m0m1%%O4O3l1l1o1o2OOqqL2L2L6L7mmM0M0M1L9l0l1RRj22j22k2J13P6P5
6514a8j0j0j0j0n0n0L2L2L2L2%jr4r5O3O3K3K3j6j5N2N1L0L0j1j0l8l6j05j06K5K5O6O5n1
6501i2n1M4M3ppppk6k5k6k5K6K6K6K6J0J0q4q5pqQ7Q7K8K9r4r3l8l8N7N7M9N0RRlmlmK8K8
6486em0m0j3j4Q1Q0j7j7n6n8n7n6J1J1j5j5j4j5O0O1K0K0J2J3k8k9K5K6j6j5JKKKJ4J3J4J4
6473c8q9q8k1k1M4M4k3k4m7m7P4P4N3N2J2J1jkm2m2M2M2k5k6j2j1K8K9j28j29K9J10Q0Q0O2
6460E0j8N3N2QPrrp7p5k0k0j01L4N7k4q3kN8N9P2qn7K3L9L9q9r0L1L1n1n1J6J6l9m0J10J08
6446@K7K6o7o8nonnRRJ0RPPN2k9m8m9j4j3m5m4mml7l7L1L1m5m4R9J00M8l3J2J3p2p2nmQ9Q8
$$ plain form
6542 -196 -200 -204 -208 -212 -170 -128 -181 -234 -196 -158 -119 -81 -97 -113 -61 -10 2 15 28 41 31 20 10 0 6 13 -46 -106 -103 -99 -95 -91 -110 -129 -108 -86 -65 -43 -117 -190
6528 -190 -172 -154 -136 -119 -159 -200 -200 -200 -136 -73 -104 -135 -196 -258 -252 -246 -254 -262 -230 -198 -162 -125 -129 -133 -93 -53 -12 27 -3 -34 -25 -16 -138 -260 -282 -169 -93 -18
6514 -18 -28 -38 -48 -58 -108 -158 -126 -94 -62 -30 -30 -31 -125 -220 -157 -94 -71 -48 -64 -79 -27 24 54 84 73 63 25 -11 -116 -222 -197 -172 -106 -41 -92
6501 -92 -143 -99 -56 -63 -70 -77 -84 -110 -135 -161 -186 -160 -134 -108 -82 -72 -62 -146 -231 -238 -246 -159 -72 -44 -15 -109 -202 -240 -278 -221 -164 -115 -65 -56 -47 -50 -54 -57 -61 -33 -5
6486 -5 -45 -85 -98 -112 -31 49 32 15 -41 -99 -156 -212 -201 -190 -205 -220 -234 -249 -189 -128 -108 -88 -76 -63 -91 -120 -95 -69 -85 -100 -99 -97 -95 -93 -79 -66 -52 -38
6473 -38 -127 -215 -236 -257 -213 -169 -192 -216 -263 -310 -236 -162 -109 -57 -45 -34 -35 -37 -79 -121 -79 -37 -62 -88 -100 -111 -83 -54 -182 -311 -282 -172 -92 -12 50
6460 50 32 85 137 145 152 143 134 57 -18 -38 -58 -159 -125 -68 -92 -175 -177 -119 -60 12 4 -53 -30 9 48 -41 -131 -100 -69 -120 -171 -155 -139 -178 -218 -108 0
6446 0 27 53 -14 -82 -87 -93 -98 -103 -94 -85 -75 -66 -59 -52 0 -29 -77 -126 -140 -153 -198 -242 -246 -250 -287 -324 -293 -262 -307 -351 -252 -152 -104 -137 -125 -112 -184 -256 -261 -265 -176 -88
6431h8Q4Q2M2l9PPo2o1n6n6l4M7J15L3o1o2j08k7J5R7O6j5rP2O7j4l7l5jjm8m8pqj9k0k0k0
6417b22j1j0J11J12j7j6n7n7m7m8ppO6O5kkk0k0K1K0M4M4n0n1NNl5l6M8M7O8O7l1l2l3l2L
6404a17LM3M3p0p0K5K4l7l8j7j7L0L0L0L0ooooL0L0K9L0j5j6j5j5%%k0k1RQl3l2m1m0K7K7
6390a90K0J9Q7Q6j9j8j9j8l5l5L2L3L2L2o1o2k6k5k6k6P7P6RQPOj4j4l7l6n7n6N8N9L8L8J2
6376d5J2n5n6l5l5O0N9LLKLP6P5p1p3n4n5O7O7q5q5J0RLKM3M3K9K9N0M8n4n4J3J3j2j2K9K9
6362dK3K5j6j6l6l8l7l7nnO3O3o2o3k1k2N2N2N1N1K8K9K8K8j3j3n4n3n3n3J4J4l7l8n7n8J04
6349a66J04j8j7qrqqn6n7J2J1Q4Q4M3M3m7m7M7M5N3N2o9o8o6o5k6k5NNM5M5m0m0m1m0mlk4
6335b74k3M8M9j9j9l0k9O5O6NNNOL1L1j0j0LLP1O9K7K6j4j4l4l4n3n4k3k2P2P2n2n1j2j1L8
$$ plain form
6431 -88 -4 78 120 81 88 95 33 -28 -84 -140 -174 -127 -12 21 -40 -102 -210 -237 -222 -125 -59 -74 -83 -11 56 42 5 -30 -31 -32 -80 -128 -135 -143 -162 -182 -202 -222
6417 -222 -233 -243 -132 -20 -37 -53 -110 -167 -214 -262 -269 -276 -210 -145 -147 -149 -169 -189 -168 -148 -104 -60 -110 -161 -156 -151 -186 -222 -174 -127 -59 8 -23 -55 -88 -120 -117
6404 -117 -114 -71 -28 -98 -168 -143 -119 -156 -194 -211 -228 -198 -168 -138 -108 -114 -120 -126 -132 -102 -72 -43 -13 -28 -44 -59 -74 -74 -74 -94 -115 -106 -98 -131 -163 -204 -244 -217 -190
6390 -190 -170 -151 -64 22 3 -15 -34 -52 -87 -122 -90 -57 -25 7 -54 -116 -142 -167 -193 -219 -142 -66 -57 -49 -42 -36 -50 -64 -101 -137 -194 -250 -192 -133 -95 -57 -45
6376 -45 -33 -88 -144 -179 -214 -154 -95 -92 -89 -87 -84 -8 67 -4 -77 -131 -186 -119 -52 -137 -222 -212 -203 -200 -198 -155 -112 -83 -54 -4 44 -10 -64 -51 -38 -50 -62 -33 -4
6362 -4 19 44 28 12 -24 -62 -99 -136 -141 -146 -83 -20 -82 -145 -166 -188 -136 -84 -33 18 46 75 103 131 118 105 51 -2 -55 -108 -94 -80 -117 -155 -212 -270 -166
6349 -166 -62 -80 -97 -105 -114 -122 -130 -186 -243 -231 -220 -136 -52 -9 34 -13 -60 -13 32 85 137 68 0 -66 -131 -157 -182 -177 -172 -127 -82 -122 -162 -203 -243 -247 -250 -274
6335 -274 -297 -249 -200 -219 -238 -268 -297 -232 -166 -161 -156 -151 -145 -114 -83 -93 -103 -100 -97 -26 43 70 96 82 68 34 0 -53 -107 -130 -152 -80 -8 -60 -111 -123 -134 -96
6321i6L8lkm0m0JJK8K8j2j3rj0j0j0J07J05J2J1n8n7RRM7M8p3p3l1l1L6L7J7J8j22j23p6N9
6308b78R6J6j2j2j7j6J5J5N6N6LLMLj8j8j7j8K3K2K3K3klL8L7J9J9k2k1p3p5j14j15k6k7M1
6294c72M1K1K2O2O2k6k7k6k6lkllo3o3J13J13M1M2M2M1j6j7n8n7N0N0j8j8K1K0m8m8K1K0m0
6281a52l9l1J05J1p0j1P0O4j6k9l0L4L3k4k3o4o4M8M8j9k0KKmlj5r6rj0j6j7K4K5N3N3M8M9
6268i3O9j2o0o1m1m1K6K7o5o5k4k4J04J04O3p2pP3O0N9j34j35o3P3K7K7k6k7K4J06M4l8o8
6256a70J3J3o8j8O4O3j8l3M9L8L8k2k3J9J8j5j6P0ro9o8r1M5Q3n3q1%L5L5M0M0M5M5m9n0J9
6243h1J9J3J4k6j07j08k6PPJ2J3L7L8M7l3r9j7M8M9J04K3K9K8K0K2m6m6j%M0L8n8n9j9j9J0
6229a27J0mP8O1p3j35jm0m0l2l1mmJ40Nm5m5J4J5O0O0l5l5N3N4N3N2%%%%o0o0L3L4k7k8J8
$$ plain form
6321 -96 -58 -61 -63 -103 -143 -142 -141 -113 -85 -97 -110 -119 -129 -139 -149 -42 63 75 86 28 -29 -20 -11 36 84 11 -62 -93 -124 -88 -51 -34 -16 -138 -261 -337 -278
6308 -278 -182 -166 -178 -190 -207 -223 -208 -193 -137 -81 -78 -75 -71 -68 -86 -104 -121 -139 -116 -94 -71 -48 -50 -53 -15 22 41 60 38 17 -56 -131 -245 -360 -386 -413 -372
6294 -372 -331 -310 -288 -226 -164 -190 -217 -243 -269 -272 -274 -277 -280 -343 -406 -293 -180 -139 -97 -55 -14 -30 -47 -105 -162 -112 -62 -80 -98 -77 -57 -105 -153 -132 -112 -152
6281 -152 -191 -222 -117 -106 -176 -187 -117 -53 -69 -98 -128 -94 -61 -85 -108 -172 -236 -188 -140 -159 -179 -177 -175 -179 -182 -197 -293 -302 -312 -328 -345 -321 -296 -243 -190 -142 -93
6268 -93 -24 -36 -96 -157 -198 -239 -213 -186 -251 -316 -340 -364 -260 -156 -93 -165 -172 -99 -39 20 -114 -249 -312 -239 -212 -185 -211 -238 -214 -108 -64 -102 -170
6256 -170 -157 -144 -212 -230 -166 -103 -121 -154 -105 -67 -29 -51 -74 -55 -37 -52 -68 2 -7 -76 -144 -235 -190 -107 -160 -241 -241 -206 -171 -131 -91 -46 -1 -50 -100 -81
6243 -81 -62 -49 -35 -61 -168 -276 -302 -295 -288 -276 -263 -226 -188 -141 -174 -273 -290 -242 -193 -89 -66 -37 -9 11 33 -13 -59 -60 -60 -20 18 -40 -99 -118 -137 -127
6229 -127 -117 -121 -43 18 -55 -190 -191 -231 -271 -303 -334 -338 -342 -202 -197 -242 -287 -273 -258 -198 -138 -173 -208 -155 -101 -48 4 4 4 4 4 -56 -116 -83 -49 -76 -104 -86
6216h6J8m9L3O2p2p1p1j2j2Q5Q4M4M4m9n0m9m9J3J4J3J3k0k0J01J00L7L6l1l1k3k1J8J8RQ
6203C4RRK3K2p2p1JJ%Jp6p6l5l5J8J8k3k2R2R2K5K5p3p3K1K2nom6m6M2M2n2n3llQ3Q4O0p5
6188a21m9L2R0Ro2o2J6J6J6J5l2l2L6L5Q1P9L1m9p1p1rrpoL9m2N8N9m1m2Q1P9m1m0l3l3l3
6175a13l3j9k0q2q2J3R4J00J8l2N0jkk3k3k3k4OOnP6j3r5llL2L2M3l9o8J3N8N7N4N2L2m8o
6161b1on2n2LLLMN4N4o7o8k4k4P0P0J8J7K2n7j28j28o0P5J3J3O2O2m1m1K6K7O7O6n5n4m0m0
6148b29L1J13P2rk1k1o2K0M2M1j7j6J8J9K3n7p4p4n2K9R7J6K1K1l0N1Q9R1m0l9r6r7o7J4J14
6135g9L3oq7j37j37N6J37P3P3Q3Kr7r9k2k2j1j1j7j6J8o4J8R8K9K9L5L4KKllL0n0n0L1LMR
6121a12RK9K8K9K8llp8p9q1%Rp3o0P4J16L4R4J2p3Qm1m1l6l6P0P0j0j1R6R4Op4n0n0n5n5M1
$$ plain form
6216 -86 -68 -117 -84 -22 -94 -165 -236 -248 -260 -175 -91 -47 -3 -52 -102 -151 -200 -187 -173 -160 -147 -167 -187 -86 14 51 87 56 25 2 -19 -1 17 26 34
6203 34 43 52 75 97 25 -46 -45 -44 -44 -43 -119 -195 -230 -265 -247 -229 -252 -274 -182 -90 -65 -40 -113 -186 -165 -143 -148 -154 -200 -246 -204 -162 -214 -267 -270 -273 -190 -106 -46 -121
6188 -121 -170 -138 -48 -39 -101 -163 -147 -131 -115 -100 -132 -164 -128 -93 -12 67 98 49 -22 -93 -102 -111 -118 -124 -85 -127 -69 -10 -51 -93 -12 67 26 -14 -47 -80 -113
6175 -113 -146 -165 -185 -267 -349 -336 -242 -142 -124 -156 -106 -107 -109 -132 -155 -178 -202 -196 -190 -195 -119 -132 -227 -230 -233 -201 -169 -126 -165 -233 -220 -162 -105 -51 1 33 -15 -21
6161 -21 -27 -79 -131 -128 -125 -122 -118 -64 -10 -77 -145 -169 -193 -123 -53 -35 -18 4 -53 -181 -309 -369 -294 -281 -268 -206 -144 -185 -226 -200 -173 -106 -40 -95 -149 -189 -229
6148 -229 -198 -85 -13 -22 -43 -64 -126 -106 -64 -23 -40 -56 -38 -19 4 -53 -127 -201 -253 -224 -127 -111 -90 -69 -99 -48 41 132 92 53 -43 -140 -207 -193 -79
6135 -79 -46 -52 -139 -276 -413 -357 -220 -147 -74 9 11 -86 -185 -207 -229 -240 -251 -268 -284 -266 -330 -312 -214 -185 -156 -121 -87 -85 -83 -86 -89 -59 -109 -159 -128 -125 -121 -112
6121 -112 -103 -74 -46 -17 11 8 5 -73 -152 -233 -233 -224 -297 -357 -283 -167 -133 -39 -27 -100 -92 -133 -174 -210 -246 -176 -106 -116 -127 -31 63 69 -5 -55 -105 -160 -215 -174
6107a74M2M1M1qqrqK1K0j0r1r2j1J9J9PPmP8N4k8K4K3O8P0L3m7MMMp7o5o6O5O3l3l4l4l4J3
6093a13J3k8k8L0L1j04j05K6K6J06J07ppm7m8j9k0j00j01jkQ0Q0L0L0P0P1%J%%r9r9L6L6N8
6080i7N8J8J8p4p4l4l4K5K6j6j5QPQPM4M4MMm1m0M1M1o6o6k5k5P2P3L2L2K4K4n6n7LLLLn3
6065a51n3n3n3K4K3K3K3N7N7p8p8l9l9l4J01opKKJ2J2J2J2j4j4O7O7J10J08k6k5J9K0o1o1
6053d1j9j9j9j9L3L4m8m7N9O0p5p6m5m5mnQ2Q1n3n4K7K6j5j4J7J7J7J6n5n5n5n5L4L5pok7
6039c20k8P1J51Q9PJ2J2L5m4NNo9J2K9K9l1j12j12l1K2K3O8O8o2o2m0M2K0K0k0O1J39J38P2
6027A99o3r0q9n7n7lkL9L8L3L4qpj0j1L1K9k5k5M2M1OPl3l3m1m1m1m2l8l9r8r8k3J11J80M4
6013a40l4l4l7l7m1M0L5L4J7J6n1n1K0K1K0K1J15J14O5j5l5l4l9m0j1j1j1j1J8J8k3k3J8J8
$$ plain form
6107 -174 -132 -91 -50 -58 -66 -75 -83 -62 -42 -52 -143 -235 -246 -227 -208 -201 -194 -198 -120 -66 -94 -70 -47 21 91 124 77 81 85 89 12 -53 -119 -54 9 -24 -58 -92 -126 -113
6093 -113 -100 -128 -156 -126 -95 -199 -304 -278 -252 -146 -39 -46 -53 -100 -148 -167 -187 -287 -388 -389 -391 -311 -231 -201 -171 -101 -30 -30 -29 -29 -29 -128 -227 -191 -155 -97
6080 -97 -39 -21 -3 -77 -151 -185 -219 -194 -168 -184 -199 -191 -184 -176 -169 -125 -81 -77 -73 -114 -154 -113 -72 -138 -204 -229 -254 -182 -109 -77 -45 -21 3 -53 -110 -107 -104 -101 -98 -151
6065 -151 -204 -257 -310 -286 -263 -240 -217 -160 -103 -181 -259 -298 -337 -371 -270 -276 -283 -281 -279 -267 -255 -243 -231 -245 -259 -192 -125 -15 93 67 42 61 81 20 -41
6053 -41 -60 -79 -98 -117 -84 -50 -98 -145 -86 -26 -101 -177 -222 -267 -271 -276 -194 -113 -166 -220 -193 -167 -182 -196 -179 -162 -145 -129 -184 -239 -294 -349 -315 -280 -287 -293 -320
6039 -320 -348 -277 -126 -37 -30 -18 -6 29 -15 -10 -5 -74 -62 -33 -4 -35 -147 -259 -290 -268 -245 -177 -109 -171 -233 -273 -231 -211 -191 -211 -150 -11 127 199
6027 199 136 46 -43 -100 -157 -160 -162 -123 -85 -52 -18 -26 -33 -43 -54 -23 6 -19 -44 -2 39 45 52 19 -14 -55 -96 -137 -179 -217 -256 -354 -452 -475 -364 -184 -140
6013 -140 -174 -208 -245 -282 -323 -283 -248 -214 -197 -181 -232 -283 -263 -242 -222 -201 -86 28 93 78 43 9 -30 -70 -81 -92 -103 -114 -96 -78 -101 -124 -106 -88
6001h8n0n0N3N2N3N1k7k9r6r6M3M2KKl0l0k2k2r9L7J00K0p0p1P4P3J6J6k4k5N0N1RJ0J9J8
5988c8k2k3q2q3l7l7j4O7J43Pm6L4j9k0l2l2RQONM7M6K2K2p3p3j9j9j9k0M4M3p8p9L9L9L9
5974b45L9M9N0RJ0p2p1K3K3l3l2k4k5m8Q6J1J1j7j6J05J05N9N7rrm5m6oom8m8K0K0l7l7l7
5961b34l7P5P5PPl5l6NNN7N8o3o4L7L8L8L7K6K6K1K1Kp9o9O6OOQJ0O6j5j41o1R1Ro1o1l3l2
5947b24L0L0J40N9r2r2n9K2J7J8N5N6J5o6m0R4O3j7m7L3j8j8NNNNK4K5o9p0l1l1l1l0j6j5
5934b65L0L0J3R3M3M3j3r3r4j2O3O4k1k1n5K6K1K2K3K4J9J8Mp8o7O7M9M8j1j1NMo3o3mnnm
5920a76N6N7l8l8k0j9o0o0KLQPqP2J14L2L0L0m3m3r9r9%JQR0R0QK3K2J7J7M3M4m6m4p8Ljk
5906i7jjjjKJKJL1L0L1K9m6m7m7m8K5K5K4K5q0q0J4J5M1M1k6j08r5L9N3N3M7M7OPo0o1QPJ1
$$ plain form
6001 -88 -138 -188 -135 -83 -30 21 -6 -35 -131 -227 -184 -142 -140 -138 -168 -198 -220 -242 -341 -304 -204 -184 -254 -325 -251 -178 -162 -146 -170 -195 -145 -94 -85 -75 -56 -38
5988 -38 -60 -83 -165 -248 -285 -322 -336 -269 -126 -119 -165 -131 -150 -170 -202 -234 -225 -217 -211 -206 -159 -113 -91 -69 -142 -215 -234 -253 -272 -292 -248 -205 -283 -362 -323 -284 -245
5974 -245 -206 -157 -107 -98 -88 -160 -231 -208 -185 -218 -250 -274 -299 -347 -261 -250 -239 -256 -272 -167 -62 -3 54 45 36 -9 -55 -61 -67 -115 -163 -143 -123 -160 -197 -234
5961 -234 -271 -196 -121 -114 -107 -142 -178 -173 -168 -111 -53 -116 -180 -143 -105 -67 -30 -4 22 43 64 66 -13 -82 -16 -10 -4 4 14 80 65 -76 -137 -46 -37 -98 -159 -192 -224
5947 -224 -194 -164 -24 35 -57 -149 -208 -186 -169 -151 -96 -40 -25 -91 -131 -37 26 9 -38 -5 -23 -41 -36 -31 -26 -21 3 28 -41 -111 -142 -173 -204 -234 -250 -265
5934 -265 -235 -205 -192 -99 -56 -13 -26 -119 -213 -225 -162 -98 -119 -140 -195 -169 -148 -126 -103 -79 -60 -42 -38 -116 -183 -116 -67 -19 -30 -41 -36 -32 -95 -158 -162 -167 -172 -176
5920 -176 -120 -63 -101 -139 -159 -178 -238 -298 -296 -293 -285 -278 -286 -214 -100 -68 -38 -8 -51 -94 -193 -292 -292 -291 -283 -193 -103 -95 -72 -50 -33 -16 27 71 25 -19 -97 -94 -95 -97
5906 -97 -98 -99 -100 -101 -99 -98 -96 -95 -64 -34 -3 26 -20 -67 -114 -162 -137 -112 -88 -63 -143 -223 -209 -194 -153 -112 -138 -246 -341 -302 -249 -196 -149 -102 -96 -89 -149 -210 -202 -195 -184
5891a84J1J1J1K1K0m7m7rrm9n0L0K9K9K9J2J1N1N2j9j8K2K2nnL6J16K8j06k6k7j2j2K9K8l8
5878f5l8KKqqL3L2LKo6o5o9p0Q0P9M9M9j9j8M1M1k7k7o6o6N5N5LLKLj18j18N7N8P1P0k3k4
5864a05kkr6r7K7K6O8O7L6L7P6P7k4k5o4o5p2p2mnK9K9l9l9N6N7J6J6RQRRRJ0n8n8k0k0K0
5849a76K1l4l5POJ7J7J2J2M1m0q5mL6m6j12K4P2P2J7J8jQ0Q0jn7n7OOJ5J6K1K1l5M5Np6k2
5836a14k2j0P1P3pk5k4mlKKo5J5K1o1o0K1M2M3l7M3L9L8%%O1O3k1j02n1n2l3M8l8l8qqM3l8
5821a96o6J5Q6Q6PPM8M7k6k5o2o2o7J5L6L6K5K5l8l8LQ4j0r2o4o5K6K5ooooO8O7K7K7J7J7
5808d1N6N8j3j3j3j2J7J8n0m9K1K0K0K0K9K9j1j2l0k9k9l0q3q3j5j6Q9Q9l3l2k4k5k4k4L2
5795a93L2L2L2O6O6j08j09L3L4L4L3k9l0o5o5PQ9N7p9l3M8O2O2j7j6K4K4MMl7l7q0q0J5J4
$$ plain form
5891 -184 -173 -162 -151 -130 -110 -157 -204 -213 -222 -271 -321 -291 -262 -233 -204 -192 -181 -130 -78 -97 -115 -93 -71 -76 -81 -45 71 99 -7 -33 -60 -72 -84 -55 -27 -65
5878 -65 -103 -101 -99 -107 -115 -82 -50 -47 -45 -111 -176 -245 -315 -235 -156 -107 -58 -77 -95 -54 -13 -40 -67 -133 -199 -144 -89 -86 -83 -81 -78 -196 -314 -257 -199 -128 -58 -81 -105
5864 -105 -107 -109 -205 -302 -275 -249 -181 -114 -78 -41 35 112 88 63 -1 -66 -138 -210 -214 -219 -190 -161 -200 -239 -183 -126 -110 -94 -85 -77 -68 -59 -50 -40 -98 -156 -176 -196 -176
5849 -176 -155 -189 -224 -217 -211 -194 -177 -165 -153 -112 -152 -237 -241 -205 -251 -363 -339 -267 -195 -178 -160 -161 -81 -1 -2 -59 -116 -110 -104 -89 -73 -52 -31 -66 -21 -16 -92 -114
5836 -114 -136 -146 -75 -2 -9 -34 -58 -62 -65 -63 -61 -126 -111 -90 -151 -211 -190 -148 -105 -142 -99 -60 -22 -22 -22 39 102 81 -21 -72 -124 -157 -109 -147 -185 -193 -201 -158 -196
5821 -196 -262 -247 -161 -75 -68 -61 -13 34 8 -17 -79 -141 -208 -193 -157 -121 -96 -71 -109 -147 -144 -60 -70 -162 -226 -291 -265 -240 -246 -252 -258 -264 -196 -129 -102 -75 -58 -41
5808 -41 15 73 60 47 34 22 39 57 7 -42 -21 -1 19 39 68 97 86 74 44 15 -14 -44 -127 -210 -225 -241 -152 -63 -96 -128 -152 -177 -201 -225 -193
5795 -193 -161 -129 -97 -31 35 -73 -182 -149 -115 -81 -48 -77 -107 -172 -237 -230 -141 -84 -163 -196 -148 -86 -24 -41 -57 -33 -9 -5 -1 -38 -75 -155 -235 -220 -206
5782b06J7J6J6J7m0m0m0m0KLM3M3O5O6k8k9k4k3k4k4M7M6L9L8P5n9p7p8k3k3j8j8O3J43Q3
5770Hn0j22m1m6m6m2R3J03K2m6m7n1n2NMMMN4N3j4j5K0K0M0M0M2M2JKr5r5j03L2P8P8qrl7
5756a74l7N7N8L8L8lkk7k7k7k7q4q5j7j7N9N8rrqqm9m8K2K2K2K2l0k9j0rp3p3K2J57J27M6
5742a34N2l0j2j1l7l7kllkO5O5kkM7M6m7m8M8M7O7O7j8j8j8j8m1m0k0k1N4N2J3J3j15j17m9
5729b09m9K4K5O5O5P8P8m2m2n4n5l4l4k1k0m1m1l0l0JQ2O4K00J20j20r1rm9L3Q1Q0j3j3k6
5717b7j07p7p6r2j1J46J46N3N2L3L2j6j6p7p9p1J0Q1Q2L9l9n8n7n8K3R9R9K4K5m2m2n0n0o
5704a07P5Q3Mo1o3j2O9QQk1N8J27M6q5q5m5L4P0j2n5n5J0RRRq1q3o0K0K2K2qrj7O5N9N8j7
5690a1j7K3K2j6j5MMJJj12j12j2J23P3qQQo5o4l1l1RRP0O9Q2n1j44o2k2k2Q5Q5J70R0m9m9
$$ plain form
5782 -206 -189 -173 -157 -140 -180 -220 -260 -300 -298 -295 -252 -209 -144 -78 -106 -135 -159 -182 -206 -230 -183 -137 -98 -60 15 -44 -121 -199 -222 -245 -263 -281 -218 -75 8
5770 8 -42 -164 -205 -251 -297 -339 -246 -143 -121 -167 -214 -265 -317 -312 -308 -304 -300 -246 -193 -207 -222 -202 -182 -142 -102 -60 -18 -17 -15 -110 -205 -308 -276 -198 -120 -128 -137 -174
5756 -174 -211 -154 -96 -58 -20 -23 -25 -52 -79 -106 -133 -217 -302 -319 -336 -277 -219 -228 -237 -245 -253 -302 -350 -328 -306 -284 -262 -292 -321 -331 -340 -413 -486 -464 -307 -180 -134
5742 -134 -82 -112 -124 -135 -172 -209 -211 -214 -217 -219 -154 -89 -91 -93 -46 0 -47 -95 -47 0 67 134 116 98 80 62 21 -19 -39 -60 -6 46 59 72 -43 -160 -209
5729 -209 -258 -234 -209 -144 -79 -1 77 35 -7 -61 -116 -150 -184 -205 -225 -266 -307 -337 -367 -366 -284 -220 -20 100 -20 -111 -120 -169 -136 -55 25 12 -1 -27
5717 -27 -134 -211 -287 -379 -390 -244 -98 -45 7 40 72 56 40 -37 -116 -187 -177 -96 -14 25 -14 -72 -129 -187 -164 -65 34 58 83 41 -1 -51 -101 -107
5704 -107 -32 51 55 -6 -69 -81 -12 -4 4 -17 41 168 214 129 44 -1 33 103 91 36 -19 -9 0 9 18 -63 -146 -206 -186 -164 -142 -150 -159 -176 -111 -52 6 -11
5690 -11 -28 -5 17 1 -14 -10 -6 -5 -4 -116 -228 -240 -117 -44 -52 -44 -36 -101 -165 -196 -227 -218 -209 -139 -70 12 -39 -183 -245 -267 -289 -204 -119 51 141 92 43
5677D3r3r4l2l2RRK3K3k3N9J06J05l8l8K6K6q7q7p3O2P3rj7j7k7N4N7N8mmj0j1o8o9n1Q5N4
5663a2k6l7l7l7l7m5L6N8N8J1J1l0l0k9k9p9JR1J0k6N6N6N6O0O1J2J2n6n5m1m2m2m2M2M2M3
5650a6M1OOO9O9m4j25J1J0M8l3k8k7j08j07j3j3O5O5k9k9n5n5j4j4llL8L8L7L7L7L7K9L0l3
5637g6l3m9L2%q1n1Q3O6O5J2o8p4QK6n6nnl0l0j3O8R9J9j02j02n4K7K2K2J02J03QQj8j8n8
5624a53n9pqpqo0o1O4J46J27M5k4k5j9j9L1m9j37n5J5J6pqO1O0r4r4K8K8P3P3%%L3m8lko4
5610b11o3j3r4m5L5N3N2M2M2M2M3R0Q9J5o7m0m0q7M9P8lJ1J0k7k6l2l2j0r2r1j0Q7Q8LMr8
5597b48j7J05J05J17j7o1o3n1n2l8R7Q1jMp7l7l8kkL1L1L0L1L3L3L7m2q6q6n1n1J24J24n2
5585h9n2m0l9m0l9N0N0j7j8%j%jj5j6K5K5J2J2J3J2P2P2P0P2k0k0j14j15K5K4K5K5j4j4K7
$$ plain form
5677 43 -50 -144 -176 -208 -199 -190 -167 -144 -167 -108 -2 103 65 27 53 79 -8 -95 -168 -106 -33 -42 -59 -76 -103 -49 8 66 62 58 48 37 -31 -100 -151 -66 -12
5663 -12 -38 -75 -112 -149 -186 -231 -195 -137 -79 -68 -57 -87 -117 -146 -175 -254 -253 -162 -152 -178 -122 -66 -10 50 111 123 135 79 24 -17 -59 -101 -143 -101 -59 -16
5650 -16 25 31 37 106 175 131 6 17 27 75 42 14 -13 -121 -228 -241 -254 -189 -124 -153 -182 -237 -292 -306 -320 -323 -326 -288 -250 -213 -176 -139 -102 -73 -43 -76
5637 -76 -109 -158 -126 -126 -207 -258 -175 -109 -44 -32 -100 -174 -166 -140 -196 -201 -206 -236 -266 -279 -211 -112 -93 -195 -297 -351 -324 -302 -280 -178 -75 -67 -59 -77 -95 -153
5624 -153 -212 -219 -227 -234 -242 -302 -363 -299 -153 -26 19 -5 -30 -49 -68 -37 -86 -223 -278 -263 -247 -254 -262 -201 -141 -235 -329 -301 -273 -200 -127 -127 -127 -94 -142 -145 -147 -211
5610 -211 -274 -287 -381 -426 -391 -338 -286 -244 -202 -160 -117 -27 62 77 10 -30 -70 -157 -108 -30 -33 -22 -12 -39 -65 -97 -129 -139 -231 -322 -332 -245 -157 -154 -150 -248
5597 -248 -265 -160 -55 62 45 -16 -79 -130 -182 -220 -123 -42 -43 -39 -116 -153 -191 -193 -195 -164 -133 -103 -72 -39 -6 31 -11 -97 -183 -234 -285 -161 -37 -89
5585 -89 -141 -181 -220 -260 -299 -249 -199 -216 -234 -234 -235 -235 -236 -251 -267 -242 -217 -205 -193 -180 -168 -96 -24 46 118 98 78 -36 -151 -126 -102 -77 -52 -66 -80 -53
5572e3K6POPPP8P9j5j5j0j0j0j1o5o5o6o6M5M4n0n0j8j8j8j8m8m8J01J01K1K1m7m7L4L3l3
5559a71l4m8m7poP0P1n0n1k1k2k1k1N5N5O8o6m9L2P3P3j6j6K5K5M5M5j04j03rj0m9n0J6J6
5546c02N7N7j7j7M2M3P7n8k07p2N9N9O8O8N5N5l6j72n8P8J05K5n1n1j6j6pqQ7Q7n1n1n1n0
5534b69j4j4M9M9R2J1K1K1kP9J2o8k3k2k8k7l1l1L2L2J8o3j7j7pqL3L3P2P2N8p6p6Om4m3k8
5520b18N2M8M8l1l2l1l1o6o6L4L4mP8nj40r7L9P6P6n8n7j8j7K4K4J46J46k2k1k1k2jjj1P0
5508g5O8j4j3O7L0n0l9m1q9q9q5q4pP3K9K8J7J7O3j8M8M7LKK5K5j6j5L7L8llp9q0p4p5m1M0
5494c33Q8Q9O7O8%%n7n7j6j6L8L8L2L3K3n9q1q1J4J5K9L0O6j5n5K5K0K0l7l7l3M8KLKLq4l
5480b11K7K7J18L7k3k3r6r5J0J0k5k5mP8N8k4k3k3O1O2O8j3o3o2o5o6PPmP6J39N8k5j06p1
$$ plain form
5572 -53 -27 -20 -14 -7 0 78 157 142 127 117 107 97 86 21 -44 -110 -176 -131 -87 -137 -187 -205 -223 -241 -259 -307 -355 -254 -153 -132 -111 -158 -205 -171 -138 -171
5559 -171 -205 -253 -300 -307 -313 -243 -172 -222 -273 -294 -316 -337 -358 -303 -248 -180 -246 -295 -263 -190 -117 -133 -149 -124 -99 -54 -9 -113 -216 -225 -235 -284 -334 -318 -302
5546 -302 -245 -188 -205 -222 -180 -137 -60 -118 -325 -397 -338 -279 -211 -143 -88 -33 -69 -241 -299 -221 -116 -91 -142 -193 -209 -225 -232 -240 -153 -66 -117 -168 -219 -269
5534 -269 -283 -297 -248 -199 -107 -96 -75 -54 -56 23 35 -33 -56 -78 -106 -133 -164 -195 -163 -131 -113 -176 -193 -210 -217 -225 -192 -159 -87 -15 43 -33 -109 -103 -147 -190 -218
5520 -218 -166 -118 -70 -101 -133 -164 -195 -261 -327 -293 -259 -263 -185 -190 -330 -427 -388 -312 -236 -294 -351 -369 -386 -362 -338 -192 -46 -68 -89 -110 -132 -133 -134 -145 -75
5508 -75 -7 -21 -34 33 63 13 -26 -67 -156 -245 -330 -414 -421 -348 -319 -291 -274 -257 -194 -212 -164 -117 -114 -112 -87 -62 -78 -93 -56 -18 -21 -24 -103 -183 -257 -332 -373 -333
5494 -333 -245 -156 -89 -21 -21 -21 -78 -135 -151 -167 -129 -91 -59 -26 -3 -62 -143 -224 -210 -195 -166 -136 -70 -85 -140 -115 -95 -75 -112 -149 -182 -134 -132 -129 -127 -124 -208 -211
5480 -211 -184 -157 -39 -2 -25 -48 -144 -239 -229 -219 -244 -269 -273 -195 -137 -161 -184 -207 -146 -84 -16 -29 -92 -154 -219 -285 -278 -271 -275 -199 -60 -2 -27 -133 -204
5467b04J0j2j2RR1P7mK6K5j5j6j6j6l8l8K9K9j7j8j8j8L5L5N6N4L0K9l8l7K8K8j2j2j0j0J04
5454A34K2m1m1m7m5K5K7l6l6l3M8KLN6N7M3r1j34n4o7J4J13k2j09k7N1N0j2j2j7j7k7N4N7
5442a12k4n9n9q9M5R2R2L0L1l7l7m8m9J9J9O7O7k8k7L7L6L2L1M4l7j03k3R0R1M2l8l2j11j18
5429a66l6J8J8o6o7P5J57L5m7mnL5m5j1j0j1r2o2o2JJ36O3j8%Jk1N9K0o2k8k8J2J3o4J7J2
5416b33J2L7L7llM6M6m9m9J9K0jjN8N8j0rJ7J6k2k4l1l1L7L7qpm3m3l7M3m3m3poQ8Q8L3L1
5402B0P9lm8m7j6j7N7k3j6j8ONk5N5j1r4n8n8n1K9P9P9J1J2N6k4m0m0nmR0Q9J5o7j05j06o1
5389b55J9L6L5J%M1M0J%o2o3L3L2%%J14L1n6n8o8J4N7N7l2l2M7M7OOJ0J1J0J1j5j5N2N2J2
5375A19J2R3m2j26m5mmo1o1o2o1m5m5K5J07P7mk2k1MLMMJ9J9J9J9j8j8k8N3L9m2j05k4OON1
$$ plain form
5467 -204 -194 -206 -218 -209 -118 -41 -45 -19 6 -9 -25 -41 -57 -95 -133 -104 -75 -92 -110 -128 -146 -111 -76 -20 34 64 93 55 18 46 74 62 50 40 30 134
5454 134 156 115 74 27 -18 7 34 -2 -38 -71 -23 -21 -18 38 95 138 47 -87 -141 -208 -194 -81 -103 -212 -239 -188 -138 -150 -162 -179 -196 -223 -169 -112
5442 -112 -136 -195 -254 -343 -298 -206 -114 -84 -53 -90 -127 -175 -224 -205 -186 -119 -52 -80 -107 -70 -34 -2 29 73 36 -67 -90 0 91 133 95 63 -48 -166
5429 -166 -202 -184 -166 -232 -299 -224 -67 -32 -79 -83 -88 -53 -98 -109 -119 -130 -222 -284 -346 -345 -209 -146 -164 -164 -163 -184 -125 -105 -167 -195 -223 -211 -198 -262 -245 -233
5416 -233 -221 -184 -147 -150 -153 -107 -61 -110 -159 -140 -120 -121 -122 -64 -6 -16 -25 -8 8 -14 -38 -69 -100 -63 -26 -34 -41 -84 -127 -164 -121 -164 -207 -214 -220 -132 -44 -11 20
5402 20 99 96 48 1 -15 -32 25 2 -14 -32 -26 -21 -46 9 -2 -96 -154 -212 -263 -234 -155 -76 -65 -53 3 -21 -61 -101 -106 -110 -20 69 84 17 -88 -194 -255
5389 -255 -236 -200 -165 -164 -164 -123 -83 -82 -82 -144 -207 -174 -142 -142 -142 -28 3 -53 -111 -179 -165 -108 -51 -83 -115 -68 -21 -15 -9 1 12 22 33 18 3 55 107 119
5375 119 131 224 182 56 11 7 3 -58 -119 -181 -242 -287 -332 -307 -200 -123 -127 -149 -170 -166 -163 -159 -155 -136 -117 -98 -79 -97 -115 -143 -90 -51 -93 -198 -222 -216 -210 -159
5361a59N2m0m0JJo7o6p2J0J2J2J7J7J7J7Q0Q0K0o2k5N5k2j04J9R9N2k9o4J6N0M9j3j3mmJJ
5348a06o9J2Q0kn5n6k0k0J7J8J7J8K4K4K9K9J6R6Kp8q9q9m9m8k2N9R5m1p3PP6P5J5J5k6k5
5335a44M9M9j9j9p3p4K1K1J0J0J0J0L1L1Rp2k6k7k6k7j1P1J65Q3o3o5K6K6M7M8p2p3n5n5r
5322a93rl5M6O8O9j3j3qq9k8k9PPK4K4m4m4O6O6k8k9J3J3J3J3l6l6MNK9L0L0L0j5j6kQ0N9
5308B9p3q8q8k1k2k1k1P4P4K6n6j6j7K0J9k9k9Q5Ljjoon2n3J5J5N2N1J1J1l7l7l8l7O4O5l
5294a38lr4r3JJQRM9N0Q3Q3P7P8l1j11j43pJ%RRK3K3Q2Q2P8n7m9m7q0q0j3j2l8l8L0L0L8L8
5280a52lk%JJ%K2K1K2K1nnmnk8k8o9o8M7M7Q8Q7K7K8j3j2k9k9r7r7N2N2J1J2k8k7k8k7l0l0
5266b77l0l0lkkkJ6J7Q4Q4O1O1K1J9rqL2L1LMo5o3r2r2N8N7L6L6%Jn2L0L0n2n1n0O6O5j5j6
$$ plain form
5361 -159 -107 -147 -187 -186 -185 -252 -318 -390 -380 -368 -356 -339 -322 -305 -288 -208 -128 -108 -170 -195 -140 -162 -266 -247 -148 -96 -125 -189 -173 -123 -74 -87 -100 -104 -108 -107 -106
5348 -106 -175 -163 -83 -85 -140 -196 -216 -236 -219 -201 -184 -166 -142 -118 -89 -60 -44 52 54 -24 -113 -202 -251 -299 -321 -262 -167 -208 -281 -274 -198 -123 -108 -93 -119 -144
5335 -144 -95 -46 -65 -84 -157 -231 -210 -189 -179 -169 -159 -149 -118 -87 -78 -150 -176 -203 -229 -256 -267 -196 -31 52 -11 -76 -50 -24 23 71 -1 -74 -129 -184 -193
5322 -193 -202 -237 -191 -123 -54 -67 -80 -88 -177 -205 -234 -227 -220 -196 -172 -216 -260 -194 -128 -156 -185 -172 -159 -146 -133 -169 -205 -201 -196 -167 -137 -107 -77 -92 -108 -110 -30 29
5308 29 -44 -132 -220 -241 -263 -284 -305 -231 -157 -131 -187 -203 -220 -200 -181 -210 -239 -154 -151 -152 -153 -159 -165 -217 -270 -255 -240 -188 -137 -126 -115 -152 -189 -227 -264 -200 -135 -138
5294 -138 -141 -235 -328 -327 -326 -318 -309 -260 -210 -127 -44 33 111 80 -31 -174 -181 -180 -180 -171 -162 -139 -116 -34 48 126 69 20 -27 -107 -187 -200 -212 -250 -288 -258 -228 -190 -152
5280 -152 -155 -157 -157 -156 -155 -155 -133 -112 -90 -69 -74 -79 -83 -88 -116 -144 -213 -281 -234 -187 -99 -12 15 43 30 18 -11 -40 -137 -234 -182 -130 -119 -107 -135 -162 -190 -217 -247 -277
5266 -277 -307 -337 -340 -342 -344 -346 -330 -313 -229 -145 -84 -23 -2 17 8 0 32 63 66 70 5 -58 -150 -242 -184 -127 -91 -55 -55 -54 -106 -76 -46 -98 -149 -199 -133 -68 -83 -99
5251i9R8J5l5l7K6K5J0J0J0J1m9n0q5q5l5M5O2O3J24M5J4o7MMM4l6l3l4JKK7K6L2m9j21j22
5238b39j06k4M5M5N0N0KLm8L3P9km5m6onLLq6N0J67Q6m3m4m8m9n1n2J20J19M0l9l5l6J10J11
5225A12k0j00q5q6o8J2L4L4m8L4J09J08j7r6K3K2J8J6RRRRm7m7ppk4k4M3M4kklkj9j9M4M2
5211HL1m9n0L1nnk2j04l1l2L5J16M5l6J5J5l6l7MMj9j9j9j9J2J1J2J1KLM8l4L6L5l8l7K1K1
5197g6L4m7q0N5O0k1j1j1K5K5m1m0j9O3oom1m2jjM9l2j55p4J9J9O5j5L0L1o8o8%%M0M0M0L9
5184b21J07J07m6j26j61q0N0N0N1J33R2J2J8J7k6k8j1j1j01j01k6N6N5k6M1M0k8k7oP5K9L0
5172f2o1o1o1o1J9K0J9J9L0K9l8l8J5J5N1N1O0k1o2K0J9J9K9K9j00k0KKLLLLj9j9j9j9j2j3
5158b26N5N5m2m3N3N2m1m1K6K6o6o7N5N6L2L2qqkjkjJ9K0K0K0n4n4n4n3lmm3m4j3j3j3j4R2
$$ plain form
5251 -99 -1 14 -21 -58 -32 -7 3 13 23 34 -15 -65 -150 -235 -270 -225 -163 -100 24 69 83 16 20 24 68 32 -1 -35 -34 -32 -5 21 53 4 -117 -239
5238 -239 -345 -369 -324 -279 -229 -179 -177 -174 -222 -189 -110 -112 -157 -203 -209 -214 -211 -208 -294 -244 -77 9 -34 -78 -126 -175 -226 -278 -158 -39 1 -38 -73 -109 1 112
5225 112 92 -8 -93 -179 -247 -235 -201 -167 -215 -181 -72 36 19 -77 -54 -32 -14 2 11 20 29 38 -9 -56 -63 -70 -94 -118 -75 -31 -33 -35 -38 -40 -59 -78 -34 8
5211 8 39 -10 -60 -29 -34 -39 -61 -165 -196 -228 -193 -77 -32 -68 -53 -38 -74 -111 -107 -103 -122 -141 -160 -179 -167 -156 -144 -133 -131 -128 -80 -114 -78 -43 -81 -118 -97 -76
5197 -76 -42 -89 -169 -114 -54 -75 -86 -97 -72 -47 -88 -128 -147 -84 -90 -96 -137 -179 -180 -181 -132 -164 -319 -393 -374 -355 -290 -305 -275 -244 -312 -380 -380 -380 -340 -300 -260 -221
5184 -221 -114 -7 -53 -179 -340 -420 -370 -320 -269 -136 -44 -32 -14 3 -23 -51 -62 -73 -174 -275 -301 -245 -190 -216 -175 -135 -163 -190 -196 -121 -92 -62
5172 -62 -123 -184 -245 -306 -287 -267 -248 -229 -199 -170 -208 -246 -231 -216 -165 -114 -54 -75 -137 -117 -98 -79 -50 -21 -121 -141 -139 -137 -134 -131 -128 -125 -144 -163 -182 -201 -213 -226
5158 -226 -171 -116 -158 -201 -148 -96 -137 -178 -152 -126 -192 -259 -204 -148 -116 -84 -92 -100 -102 -103 -105 -106 -87 -67 -47 -27 -81 -135 -189 -242 -245 -249 -292 -336 -349 -362 -375 -389 -297
5144b97R2N2N1jjjjl8l9KLQ4Q4r2r1q2q2J3J3M2M3M2M3J3J3n5n4j8j8P6P6J2J1q4q3L2L1r
5130b18rP7P7RJ0q2q1J2J3J4J4k7k7j4j4j4j4m2m2P9Q0k3k4k3k4PPM8M7QPQQJ2J1J2J2k6k7
5116a59M2M1j9j9j9j9Q6Q6M9j38j70q8N7N8K5K5m3m2J7J8Q0P9L0n2r3j1m4m4p4O0L9L8M6M7
5104a11J1J2p8p8n1L1P2j0j6j6nP7K9n2J6R7N4k7j7j7n2n2n3n2M9M9R5J4nnn1n1O2O3K1K1
5091b6k7k8o8o8n6n6j2O8J00J9K9L0l2l1l1l1m4m4lmJ5J5N5N6M2M2lq3l6M5L4L5qpn3K8LL
5077a32RQq1q1l7M4M8l2m4m5J10J91M9q4j08k7J4J3K8K8K8K8qrL3L2n1n1n1n0j0rN8N9j6j5
5064a61q3q2M6M6J13J14PNq7q8n1n0n0n0L8L9P9P9R1R0l0l0n4n5M1M0J2J2n5n6O2O2K0K2o9
5051c3p1p0p0R0R1K2K3m2m3m2m2N4N4J3J4j3j2j2j2m5m5P6P7L5L4n9n9k6k6M2M2j8j9j12j13
$$ plain form
5144 -297 -205 -153 -102 -103 -104 -105 -106 -144 -183 -181 -178 -94 -10 -102 -193 -275 -357 -344 -331 -289 -246 -204 -161 -148 -135 -190 -244 -262 -280 -204 -128 -116 -105 -189 -272 -240 -209 -218
5130 -218 -227 -150 -73 -64 -54 -136 -217 -205 -192 -178 -164 -191 -218 -232 -246 -260 -274 -316 -358 -279 -199 -222 -246 -269 -293 -286 -279 -231 -184 -176 -169 -161 -153 -141 -130 -118 -106 -132 -159
5116 -159 -117 -76 -95 -114 -133 -152 -66 20 69 -69 -239 -327 -270 -212 -187 -162 -205 -247 -230 -212 -132 -53 -23 -75 -168 -179 -223 -267 -341 -281 -242 -204 -158 -111
5104 -111 -100 -88 -166 -244 -295 -264 -192 -202 -218 -234 -239 -162 -133 -185 -169 -72 -18 -45 -62 -79 -131 -183 -236 -288 -239 -190 -95 -81 -86 -91 -142 -193 -131 -68 -47 -26
5091 -26 -53 -81 -149 -217 -273 -329 -341 -273 -173 -154 -125 -95 -127 -158 -189 -220 -264 -308 -311 -315 -300 -285 -230 -174 -132 -90 -93 -176 -212 -167 -133 -98 -106 -113 -166 -138 -135 -132
5077 -132 -123 -115 -196 -277 -314 -270 -222 -254 -298 -343 -233 -42 7 -77 -185 -212 -198 -185 -157 -129 -101 -73 -81 -90 -57 -25 -76 -127 -178 -228 -238 -247 -189 -130 -146 -161
5064 -161 -244 -326 -280 -234 -121 -7 0 5 -82 -170 -221 -271 -321 -371 -333 -294 -215 -136 -45 45 15 -15 -69 -124 -83 -43 -31 -19 -74 -130 -68 -6 14 36 -33
5051 -33 -104 -174 -244 -154 -63 -41 -18 -60 -103 -145 -187 -133 -79 -66 -52 -65 -77 -89 -101 -146 -191 -115 -38 -3 31 -28 -87 -113 -139 -97 -55 -73 -92 -204 -317
5038c17N1N2N2N2J7J8N7N7l3l2l4l3J0J1n8n7k6k5k5k5P2P3k3k2m0l9%JkkL9L9rj0N9N8l1
5025a25l0l1l1PQo0o1N5N4j3j3J7J7J6J7p9q0J6J5M7M7L7L6L5j27q1%O9O9L3L4n3n4J4J4J4
5012a67J3k7k8L8L8L9L8k9k9J2J2N2N1j5j5j5j5j5j4L1L2rrRRl2l1k6k7J5J4O0N9K0J9LKl8
4998B5l7j4j4K6K5l3l3OP%%o7o8m9m8M6M6N7N8j0rq6q5L6L6p2p1J20J21J05n4n9o0K1K0K0
4985i4K0k4k4k4k4ppqpK0K0K0K0J7J7k4k4L7L8llN9N9qql3l1L4L5l5l4l6l5o8o9k8k7O3O3
4971a63O3O4L2L2l4l6n0n0M4M4rj0rj0J1J1J0J1N0N0J1J0k5k4k4k4J1J2J0J1M9M8M9M9k3k2
4958A69k2k2kkj22j24o3o3Q5Q6R1R2K5K5l5l4J14J14J05J05J05J05K06K06M06P03J042J501
4947D796J532p66k114j385q55m51k23k24j58j57l4l5POm9m9q9r0M1M1M1M1k3k2o3o3l7l7Q5
$$ plain form
5038 -317 -266 -214 -162 -110 -93 -75 -18 39 6 -26 -60 -93 -83 -72 -130 -187 -213 -238 -263 -288 -216 -143 -166 -188 -228 -267 -267 -266 -268 -270 -231 -192 -201 -211 -152 -94 -125
5025 -125 -155 -186 -217 -210 -202 -262 -323 -268 -214 -227 -240 -223 -206 -190 -173 -252 -332 -316 -301 -254 -207 -170 -134 -99 -226 -307 -307 -238 -169 -136 -102 -155 -209 -195 -181 -167
5012 -167 -154 -181 -209 -171 -133 -94 -56 -85 -114 -102 -90 -38 13 -2 -17 -32 -47 -62 -76 -45 -13 -22 -31 -22 -13 -45 -76 -102 -129 -114 -100 -40 19 39 58 61 63 25
4998 25 -12 -26 -40 -14 11 -22 -55 -49 -42 -42 -42 -109 -177 -226 -274 -228 -182 -125 -67 -77 -86 -172 -257 -221 -185 -257 -328 -208 -87 18 -36 -95 -155 -134 -114 -94
4985 -94 -74 -98 -122 -146 -170 -177 -184 -192 -199 -179 -159 -139 -119 -102 -85 -109 -133 -96 -58 -61 -64 -5 54 46 38 5 -26 8 43 8 -26 -62 -97 -165 -234 -262 -289 -226 -163
4971 -163 -100 -36 -4 28 -6 -42 -92 -142 -98 -54 -63 -73 -82 -92 -81 -70 -60 -49 1 51 62 72 47 23 -1 -25 -14 -2 8 19 68 116 165 214 191 169
4958 169 147 125 123 121 -1 -125 -188 -251 -166 -80 11 103 128 153 118 84 198 312 417 522 627 732 938 1144 1550 2253 3295 4796
4947 4796 6328 5562 3448 2063 1208 757 534 310 152 -5 -39 -74 -67 -61 -110 -159 -248 -338 -297 -256 -215 -174 -197 -219 -282 -345 -382 -419 -334
4937c34Q4q2q3O7O6m5m5K3K3J1J1J1J1J5J5J5J5K1K1K1K1L1L1l6l6JJm5L7K6K6j3r4k2N8P9
4924i4kr4j2MMl2l3L5L5M2M2k1k0m3L9N5N5nq6%%o1o1k1k0j6j6K5K4N0N0m4m5O9O9kq3k7N4
4910a86J3o8p0J0M6M6P4o2m6L4K2J02noL8L9k9l0j2j2QPK6K6O5O6j6j6l7l6p3p3M8M9P3P5
4897I0O7o7j59K9N3k6p3p4J6J7J09J08o2o0m3L9N1N2K7j07l8M4k6k6o2o1j9k0j9j9nnnnN7
4884b22N7J02K2p6p5O8O8P9Q1M0M0q9r0m9m9K2K3p2p3J9J9J8J9l8l8L0K9J%m0m0Q5Q6rj0k0
4871h2k0J%O5O5kkq4q6L5L6J2J2P9P9j7j8q4q5p8p8J7J7J0J0L0L0JJl9m0POl4l4J0J0P7P7
4857i6M1M1J%k3k3k3k3JJJJrrrrppppj3j3j3j3N9N9l5l5n0n0p0p0O0O1M0M0lkJ7J8m0m0JJ
4841b56L7L7mmM2M2JJm5m5nnK9K8K8K8JKJKm7m7k7k6j4j4n0m9l7M5J4J4Q5MQRM8M8m6m7K4
$$ plain form
4937 -334 -250 -332 -415 -348 -282 -327 -372 -349 -326 -315 -304 -293 -282 -267 -252 -237 -222 -201 -180 -159 -138 -107 -76 -112 -148 -147 -146 -191 -154 -128 -102 -115 -209 -231 -173 -94
4924 -94 -96 -190 -202 -198 -194 -226 -259 -224 -189 -147 -105 -126 -146 -189 -150 -95 -40 -45 -131 -131 -131 -192 -253 -274 -294 -310 -326 -301 -277 -227 -177 -221 -266 -197 -128 -130 -213 -240 -186
4910 -186 -173 -241 -311 -301 -255 -209 -135 -197 -243 -209 -187 -85 -90 -96 -58 -19 -48 -78 -90 -102 -94 -87 -61 -35 30 96 80 64 27 -9 -82 -155 -107 -58 15 90
4897 90 157 90 -69 -40 13 -13 -86 -160 -144 -127 -18 90 28 -32 -75 -36 15 67 94 -13 -51 -7 -33 -59 -121 -182 -201 -221 -240 -259 -264 -269 -274 -279 -222
4884 -222 -165 -63 -41 -117 -192 -124 -56 23 104 144 184 95 5 -44 -93 -71 -48 -120 -193 -174 -155 -137 -118 -156 -194 -164 -135 -134 -134 -174 -214 -129 -43 -52 -62 -82
4871 -82 -102 -101 -101 -36 29 27 25 -59 -145 -110 -74 -62 -50 29 108 91 73 -11 -96 -174 -252 -235 -218 -208 -198 -168 -138 -137 -136 -175 -215 -208 -202 -236 -270 -260 -250 -173 -96
4857 -96 -55 -14 -13 -13 -36 -59 -82 -105 -104 -103 -102 -101 -110 -119 -128 -137 -144 -151 -158 -165 -178 -191 -204 -217 -158 -99 -134 -169 -219 -269 -339 -409 -349 -288 -248 -208 -211 -213 -196 -178 -218 -258 -257 -256
4841 -256 -219 -182 -186 -190 -148 -106 -105 -104 -149 -194 -199 -204 -175 -147 -119 -91 -90 -88 -87 -85 -132 -179 -206 -232 -246 -260 -310 -359 -396 -351 -337 -323 -238 -234 -226 -217 -169 -121 -167 -214 -190
4826a90K3QQk9N2J6o5n6K4L7L6Q3Kk1k0q7q7M3J24o6o6n5n6j4O6Q9Q9k0k0K1K0j1j1l1l1m6
4813b41m6N3N4j8O4K3n8rrPOk0j9K4J06J73R2q6q6o0o1o6J5Q3Q2rr1p3RK6K5P3P1k2k1j5j4
4799c8rrn2K9MLL6L5l2l2j3j3j2j3L6L6L6L5n4n5j5j5J2J1N2N1p5p6M6M6P6P7j8j7l6l6l5
4786c4l6J0J1l0j11r7L8P1j1J1J2M6M7J3J4k8k7k4k3m4m4RQl2l3noL5L5M6M7OOK3K3LLn2n2
4772a72J6J5k4k3k4k4M6M6M2M1j0r1j26RO6j5L9L9J4J4J5J4J%m0l9LLl7l8L2L2qrO9O9KKl3
4757h4l3QQm6m6onllp0p1mmR1R1J9K0L9M0J0J1l0l0m7m7J2J2P6o0lmk2k3k3k2k7k8M1M0on
4742b34J1R2L7m5l5l4r5r6%jM6M6k2k2R8R7R7R7J0J0l0k9m4m4M6M5j4r6n1n0%JOOl3M9M4M4
4729i3l8l8l7l8RQMMqq9q9qR5R5k1k2N9O0J5o6k4N8M2M3m3j25q3lP9P9J6J6j2j3K9K8mnL6
$$ plain form
4826 -190 -167 -159 -151 -180 -128 -112 -177 -233 -209 -172 -136 -53 -51 -72 -92 -179 -266 -223 -99 -165 -231 -286 -342 -356 -290 -201 -112 -132 -152 -131 -111 -122 -133 -164 -195 -241
4813 -241 -287 -234 -180 -198 -134 -111 -169 -178 -187 -180 -174 -194 -213 -189 -83 90 182 96 10 -50 -111 -177 -162 -79 3 -6 -97 -170 -161 -135 -110 -37 34 12 -9 -24 -38
4799 -38 -47 -56 -108 -79 -75 -72 -36 -1 -33 -65 -78 -91 -103 -116 -80 -44 -8 27 -27 -82 -97 -112 -100 -89 -37 14 -61 -137 -91 -45 31 108 90 73 37 1 -34
4786 -34 -70 -60 -49 -79 -190 -287 -249 -178 -189 -178 -166 -120 -73 -60 -46 -74 -101 -125 -148 -192 -236 -227 -219 -251 -284 -289 -295 -260 -225 -179 -132 -126 -120 -97 -74 -71 -68 -120 -172
4772 -172 -156 -141 -165 -188 -212 -236 -190 -144 -102 -61 -71 -162 -288 -279 -213 -228 -189 -150 -136 -122 -107 -93 -92 -92 -132 -171 -168 -165 -202 -240 -208 -176 -184 -193 -124 -55 -53 -51 -84
4757 -84 -117 -109 -101 -147 -193 -199 -204 -207 -210 -280 -351 -355 -359 -268 -177 -158 -138 -99 -59 -49 -38 -68 -98 -145 -192 -180 -168 -92 -152 -155 -159 -181 -204 -227 -249 -276 -304 -263 -223 -229 -234
4742 -234 -223 -131 -94 -139 -174 -208 -303 -399 -399 -400 -354 -308 -330 -352 -254 -157 -60 37 47 57 27 -2 -46 -90 -44 1 -13 -109 -160 -210 -210 -209 -203 -197 -230 -181 -137 -93
4729 -93 -131 -169 -206 -244 -235 -227 -223 -219 -227 -316 -405 -413 -318 -223 -244 -266 -207 -147 -132 -198 -222 -164 -122 -79 -122 -247 -330 -333 -254 -175 -159 -143 -155 -168 -139 -111 -115 -120 -84
4714h4L6rj0rrJ7J7J7J7K9L0L0L1q0p8l9l9J7J8k3k3k7k8L9M0l6l7Q5Q5O6O6k8k8j1j0K9L0
4701I1j14j16l9M1L8L8N3k8n1L0k0k1q1q2rqkP9J6o4k5N6OOK3K3O4O4M7M7K6n5k4k3L7L9k4
4688C8k4k3k4k0j9k0j9l8l8l2l3m2L8Q2Q3Q3LLKj4r5r5j4R0R0Q9R1l4j14j15l4j7j7N5N6K9
4675d9K8j2r3n5P9P4o0o3o4k2N8NNl0l0K9K8K9K9o4o4n9n9l9M2L8L7K7K7j3j4K2K2N8N8Q4
4661a1Mj3j3j1P0J06k9j40o0Qp3j14K0L1n0k7N5R9R8oom6m7k1k1J9K0j0j0j0j0K4K4m3m3N5
4648a81N5J4J4qrqrLMo5o4L5L5L5L5O9O8JJn9o1o0o0L1L1L1L1o3o2NNL8L7L8L7L5L4q6q7n4
4634b14n4j3j4P2P2L1L1M5M4m8m9k2k3k2k2K3K2m5m5l8l7LKM5M4M4M4j6j6N1N1L5L3K6K7P7
4621A44n8j75r5J5J5K0K0k5k5J6J6J8J9k2k2k3k3J7J8J9K0m9m8l0l0O5O5L6L7n8n7k1k0k1
$$ plain form
4714 -84 -48 -57 -67 -76 -85 -68 -51 -34 -17 12 42 72 103 23 -55 -94 -133 -116 -98 -121 -144 -171 -199 -160 -120 -156 -193 -108 -23 43 109 81 53 42 32 61 91
4701 91 -23 -139 -178 -137 -99 -61 -8 -36 -87 -57 -77 -98 -179 -261 -270 -278 -280 -201 -185 -249 -274 -218 -212 -206 -183 -160 -96 -32 15 62 88 33 9 -14 23 62 38
4688 38 14 -9 -33 -53 -72 -92 -111 -149 -187 -219 -252 -294 -256 -174 -91 -8 -5 -2 0 -14 -109 -204 -218 -128 -38 51 142 108 -6 -121 -155 -172 -189 -134 -78 -49
4675 -49 -21 -33 -126 -181 -102 -28 -88 -151 -215 -237 -179 -174 -169 -199 -229 -200 -172 -143 -114 -178 -242 -301 -360 -399 -357 -319 -282 -255 -228 -241 -255 -233 -211 -153 -95 -11
4661 -11 -7 -20 -33 -44 26 132 103 -37 -97 -89 -162 -276 -256 -225 -275 -302 -247 -148 -50 -56 -62 -108 -155 -176 -197 -178 -158 -168 -178 -188 -198 -174 -150 -193 -236 -181
4648 -181 -126 -112 -98 -106 -115 -123 -132 -129 -125 -190 -254 -219 -184 -149 -114 -45 23 24 25 -34 -95 -155 -215 -184 -153 -122 -91 -154 -216 -211 -206 -168 -131 -93 -56 -21 13 -73 -160 -214
4634 -214 -268 -281 -295 -223 -151 -120 -89 -44 0 -48 -97 -119 -142 -164 -186 -163 -141 -186 -231 -269 -306 -303 -301 -256 -212 -168 -124 -140 -156 -105 -54 -19 14 40 67 144
4621 144 86 -89 -184 -169 -154 -134 -114 -139 -164 -148 -132 -114 -95 -117 -139 -162 -185 -168 -150 -131 -111 -160 -208 -238 -268 -203 -138 -102 -65 -123 -180 -201 -221 -242
4608b42k1Q0Q0j4j5l4l3PPJ2J3J3J3LLl7l8J7J7J6J7m8m8K3J04O9j1q3q2m9m9qr%%mP6k7k6
4594c08P3P3k9k9k4k4p5NN4N5Q1Q2J4J4k3k2j8j7n5K5J21L8o5o6J9J8j8r9r9j7K0K1R3R4K2
4582f6K2n0n0M0m0m0M1J8J8N8N8M5l7l0l1l8l9l3l4J6R7K9n2l4l4k2N9J1p0P1P0O1j9o8o8
4569a41J8J8K4n8J7J8k4k3m0M1M6l5q3kO1k1j0j1K6K5M9M9m3L9Lp7o8o8RJ0RRJ3J4k8k7KJ
4555b58l9l9J8J9J8J8K2K1K2K1l6l6N9N8J3J3J3J3N3N2J3J3m4m3q5q4l8l7LLM5M5k2k2P2P3
4542h3n0m9j4j5j4j5L1L1o3o3j1j0j0j0N2N3N2N2k1k1K0K0n8n7n7n7j9j9M9M8J2J1N2N2J4
4529a67J4n4n4j9k0k0k0O4O3l0l1M9M9QQL8L8kllkllJ0J1lq4oJ28J22j1q0q1k2k2K7K7K7K7
4515c0m3m3K4K5O9P0k4k4k3k2P1P2L4L3pqn6n6n6n6ONNNM4M5MNm2m1l7l6k7N5M4r1j4j4k3
$$ plain form
4608 -242 -263 -183 -103 -117 -132 -166 -199 -192 -185 -173 -160 -147 -134 -131 -128 -165 -203 -186 -169 -153 -136 -184 -232 -209 -105 -36 -47 -130 -212 -261 -310 -318 -327 -327 -327 -331 -255 -282 -308
4594 -308 -235 -162 -191 -220 -244 -268 -343 -338 -284 -229 -148 -66 -52 -38 -61 -83 -101 -118 -173 -148 -27 11 -54 -120 -101 -83 -101 -200 -299 -316 -296 -275 -182 -88 -66
4582 -66 -44 -94 -144 -104 -144 -184 -143 -125 -107 -49 9 54 17 -13 -44 -82 -121 -154 -188 -172 -75 -46 -98 -132 -166 -188 -129 -118 -188 -117 -47 14 -5 -73 -141
4569 -141 -123 -105 -81 -139 -122 -104 -128 -151 -191 -150 -104 -139 -222 -224 -163 -184 -194 -205 -179 -154 -105 -56 -99 -60 -57 -134 -202 -270 -261 -251 -242 -233 -220 -206 -234 -261 -259 -258
4555 -258 -297 -336 -318 -299 -281 -263 -241 -220 -198 -177 -213 -249 -190 -132 -119 -106 -93 -80 -27 25 38 51 7 -36 -121 -205 -243 -280 -277 -274 -229 -184 -206 -228 -156 -83
4542 -83 -133 -182 -196 -211 -225 -240 -209 -178 -241 -304 -315 -325 -335 -345 -293 -240 -188 -136 -157 -178 -158 -138 -196 -253 -310 -367 -386 -405 -356 -308 -296 -285 -233 -181 -167
4529 -167 -153 -207 -261 -280 -300 -320 -340 -276 -213 -243 -274 -225 -176 -168 -160 -122 -84 -86 -89 -92 -94 -97 -100 -90 -79 -82 -166 -172 -44 78 67 -13 -94 -116 -138 -111 -84 -57 -30
4515 -30 -73 -116 -92 -67 2 72 48 24 1 -21 50 122 156 189 182 174 118 62 6 -50 -44 -39 -34 -29 15 60 64 69 27 -14 -51 -87 -114 -59 -15 -106 -120 -134 -157
4501a57k3j5j5j6j5kklkl7l7l7l7k2k1J9J8M7M7OPL1L1rrm2m3N3N2K3K3R8l6n1n1j9j8n0n0
4487c64J8J8K0K0J9K0k0k0j9k0O2O2nommnmqrqqL0L0J12k4n5K5N7k3n0n0j5j4k4k4k4k4n8
4473c96n9J17J17L0L0o5o4Q8Q8K0K1o1o0k0k1o3o4N8N8L5L4j1j1M1m0n7n7l1N0M6M5j3j2j3
4460b40j2k6k5J5J6K1K1j9j9RJ0M2M1N1q5p6p6RRl7M5Q0Q1L9M0O6j5l7l7q7q8j9k0L2L1K7
4447b33K7K5n6j6O6PQl4l3Qp3l2M8J1J1J5J6j2j3J09J09KLKLN3N5o8o6m3m3K5K4n3n4J4J4
4434a74K3K3r0rM7M7R7J7o0o1o5o5j1j1ooqP3K8K8mllmL5L4P5o0JQ2P2pq1q1J4J3m1M0L5L5
4419c1m1m1m1m1J7J6J7J7J3J4n4n5m2m2jjOOOOP0P0L0K9k9l0l0l0k5k6J4J5k3k2M5M5ONOO
4405a46l8l9L0K9k9k8k9k8M0M0jjj8j9M9M9j9j9M8M8pqpqkjO6O5j3j2K7K8n3n4n4n4n2n3O9
$$ plain form
4501 -157 -180 -195 -210 -226 -241 -243 -245 -248 -250 -287 -324 -361 -398 -420 -441 -422 -404 -357 -310 -304 -297 -266 -235 -244 -253 -295 -338 -285 -233 -210 -187 -89 -125 -176 -227 -246 -264 -314 -364
4487 -364 -346 -328 -308 -288 -269 -249 -269 -289 -308 -328 -266 -204 -209 -215 -219 -223 -228 -232 -240 -249 -257 -265 -235 -205 -93 -117 -172 -147 -90 -113 -163 -213 -228 -242 -266 -290 -314 -338 -396
4473 -396 -455 -338 -221 -191 -161 -226 -290 -202 -114 -94 -73 -134 -194 -214 -235 -298 -362 -304 -246 -211 -177 -188 -199 -158 -198 -255 -312 -343 -293 -247 -202 -215 -227 -240
4460 -240 -252 -278 -303 -288 -272 -251 -230 -249 -268 -259 -249 -207 -166 -115 -200 -276 -352 -343 -334 -371 -326 -246 -165 -126 -86 -20 -35 -72 -109 -196 -284 -303 -323 -291 -260 -233
4447 -233 -206 -181 -237 -253 -187 -180 -172 -206 -239 -231 -304 -336 -288 -277 -266 -251 -235 -247 -260 -151 -42 -40 -37 -35 -32 21 76 8 -58 -101 -144 -119 -95 -148 -202 -188 -174
4434 -174 -151 -128 -218 -227 -180 -133 -36 -19 -79 -140 -205 -270 -281 -292 -298 -304 -312 -239 -211 -183 -187 -190 -193 -197 -162 -128 -53 -113 -112 -30 42 35 -46 -127 -113 -100 -141 -101 -66 -31
4419 -31 -72 -113 -154 -195 -178 -162 -145 -128 -115 -101 -155 -210 -252 -294 -295 -296 -290 -284 -278 -272 -202 -132 -102 -73 -102 -132 -162 -192 -217 -243 -229 -214 -237 -259 -214 -169 -163 -158 -152 -146
4405 -146 -184 -223 -193 -164 -193 -221 -250 -278 -238 -198 -199 -200 -218 -237 -188 -139 -158 -177 -129 -81 -88 -96 -103 -111 -113 -114 -48 17 4 -8 19 47 -6 -60 -114 -168 -220 -273 -204
4390b04P0P1P0k3k4l9l8l9l9J6J6k4k5k2k1j16j16N5N5J23J23ppopL7L7mlk7k7K7n4j15K2
4378b65L4L5l8l8LLJ31J31O3O3k0k0q7q7L4L4n2n2l0J06L4m6l1l2NMo7o7m4L6ppJ6R6L9m1
4365a64RRl3l3l3l3j4j4k4N7P6nONJ1J2n7n6k1k1KQ2L9M0N3q2%JrqPOK6K7n3n4K0J9K6J07
4350g4J01K0l4j14pqL2L2J8j16p0J2M8l2j5O6k0k0l3M9KLk9k9l9M2K4n8poj2j1N7N6M9M9j9
4337i3j8nmL7L6K5K4m7m7j0r1p0J0M1M1J0J0n2L0K4K4L7L7rqNp6p0J0j7O3L8L8O8j4n4K7j3
4323f3j4J2J2m1m1p7p6LQ4J47O5P6nq6q6qrp6p6N9N9J5J49R3m1p8p9j6j5j6j5%Jl9m0j6j7
4309b55NMl4l4l3l4J7J6J1J1O7j5OQ7n1n2M8M8k2k3M8l3l6M6%q2K4K3M1J21J4J5M4l6r0r0
4296b24%jK9K8l9l9j4j3Q0Q1k9l0L2L3k0j00PPO8j4l5l6m1m0%%Q9Q9M4M4k7j07p4p4r5M1N5
$$ plain form
4390 -204 -134 -63 7 -16 -40 -79 -117 -156 -195 -179 -163 -187 -212 -234 -255 -371 -487 -432 -377 -254 -131 -138 -145 -151 -158 -121 -84 -88 -91 -118 -145 -118 -172 -287 -265
4378 -265 -231 -196 -234 -272 -269 -266 -135 -4 59 122 102 82 -5 -92 -58 -24 -76 -128 -158 -52 -18 -64 -95 -127 -122 -118 -185 -252 -296 -260 -267 -274 -258 -162 -123 -164
4365 -164 -155 -146 -179 -212 -245 -278 -292 -306 -330 -273 -197 -202 -196 -191 -180 -168 -225 -281 -302 -323 -321 -239 -200 -160 -107 -189 -189 -188 -197 -205 -198 -192 -166 -139 -192 -246 -226 -207 -181 -74
4350 -74 27 47 13 -101 -108 -116 -84 -52 -34 -150 -220 -208 -160 -192 -207 -141 -161 -181 -214 -165 -163 -160 -189 -218 -257 -215 -191 -249 -256 -262 -274 -285 -228 -172 -123 -74 -93
4337 -93 -111 -116 -120 -83 -47 -22 2 -45 -92 -102 -193 -263 -253 -212 -171 -161 -151 -203 -173 -149 -125 -88 -51 -60 -68 -63 -139 -209 -199 -216 -153 -115 -77 -9 -23 -77 -50 -63
4323 -63 -77 -65 -53 -94 -135 -212 -288 -285 -201 -54 11 87 82 -4 -90 -98 -107 -183 -259 -200 -141 -126 23 116 75 -3 -82 -98 -113 -129 -144 -144 -143 -182 -222 -238 -255
4309 -255 -250 -246 -280 -314 -347 -381 -364 -348 -337 -326 -259 -274 -268 -181 -232 -284 -236 -188 -210 -233 -185 -218 -254 -208 -208 -290 -266 -243 -202 -81 -67 -52 -8 -44 -134 -224
4296 -224 -224 -225 -196 -168 -207 -246 -260 -273 -193 -112 -141 -171 -139 -106 -126 -226 -219 -212 -144 -158 -193 -229 -270 -310 -310 -310 -221 -132 -88 -44 -71 -178 -252 -326 -421 -380 -325
4283c25N4J06K5n2n1j7j7j7j7N9N9J05K4m0l9K2K3J4J3L3L4j00j00n9n9J03J04QRk1k1m0m1
4271b21ppL4L4L6L6n8n8L6L7l1l1K4K4M5M4QQQQK3K2m3m5n9o0o0n9K6K6R4R4j3j3l3l3j26
4257b90j25N0N0L1L0j0j0QPPPM9M9M9M8l8l8l8l7%JK0K1q6q6RQQ7Q7J9J9L7L8n8n7o2o2L2
4244b34L2L7L7n8n8M4M3k4k4k8k8L9L9PPK7K7L8L9kkK2K1m5m5n9n9L6L6J3J3k8k8KKK2K2J7
4230a00J7k4k4J8J9m9n0K2K1JJj7j7j7j7L9L9k9k8kkL9L8N9N9J8J8q5q7L5L6l3l2QQK6K6m1
4216a07m2L7L8N7N7n3n4M1M0J2J3J2J2j2j2j2j2m1m3q3q3N4N4J3J4K4K4LML2L2l4l6M1L9n3
4203b4n4m9n0qrL4L3ppL2L2rqq0q0l9l9QRM9M9l0l0R2R2lmlmn1n0n1n1L3L4P3P4K9K9J7o3
4188h4p8Q5P0j2n5j35p3QN7N7O2O3K6K5o8o8n9n8RRk0k1k0k1N6N5J5J4OPOOK8K8J21J23j1
$$ plain form
4283 -325 -271 -165 -140 -192 -243 -260 -277 -294 -311 -252 -193 -88 -64 -104 -143 -121 -98 -84 -71 -38 -4 -104 -204 -263 -322 -219 -115 -107 -98 -119 -140 -180 -221
4271 -221 -228 -235 -201 -167 -131 -95 -153 -211 -175 -138 -169 -200 -176 -152 -107 -63 -55 -47 -39 -31 -8 14 -29 -74 -133 -193 -253 -312 -286 -260 -166 -72 -85 -98 -131 -164 -290
4257 -290 -415 -365 -315 -284 -254 -264 -274 -266 -259 -252 -245 -196 -147 -98 -50 -88 -126 -164 -201 -201 -200 -180 -159 -245 -331 -322 -314 -227 -140 -121 -102 -65 -27 -85 -142 -204 -266 -234
4244 -234 -202 -165 -128 -186 -244 -200 -157 -181 -205 -233 -261 -222 -183 -176 -169 -142 -115 -77 -38 -40 -42 -20 1 -44 -89 -148 -207 -171 -135 -122 -109 -137 -165 -163 -161 -139 -117 -100
4230 -100 -83 -107 -131 -113 -94 -143 -193 -171 -150 -149 -148 -165 -182 -199 -216 -177 -138 -167 -195 -197 -199 -160 -122 -63 -4 14 32 -53 -140 -105 -69 -102 -134 -126 -118 -92 -66 -107
4216 -107 -149 -112 -74 -17 40 -13 -67 -26 14 26 39 51 63 51 39 27 15 -26 -69 -152 -235 -181 -127 -114 -100 -76 -52 -49 -45 -13 19 -15 -51 -10 29 -24
4203 -24 -78 -127 -177 -185 -194 -160 -127 -134 -141 -109 -77 -86 -94 -174 -254 -293 -332 -324 -315 -266 -217 -247 -277 -185 -93 -96 -100 -103 -107 -158 -208 -259 -310 -277 -243 -170 -96 -67 -38 -21 -84
4188 -84 -162 -77 -7 -19 -74 -209 -282 -274 -217 -160 -98 -35 -9 16 -52 -120 -179 -237 -228 -219 -239 -260 -280 -301 -245 -190 -175 -161 -155 -148 -142 -136 -108 -80 41 164 153
4175A53j0n1n0lko9o9m5m4K3K3p3p3nol2l3q8P4Q9QmmN1N2J1J1N9N9J9J8q2q3j14j13p9Q3
4161c99J13J13P5P4m7m7j%m1m1l8l8LLm0m0J36J35POPOP3P4p4p3p3p3nnj0j0rj0M4M5M4M5
4147g1o3o2L2L2j5j5n6n6N3N3M8M8Rp3j17M4P6P5l6l5q4q4n9J03J40N7pqP2P3P8lj16j15q1
4135a63q0mmKJl8M3O5O5J6J6l0N1mmj0P2O0k1l6l7j10j09m1m2l6l7NMJ3J4J08J08l3l4N6N6
4121a18j2r4KQ2K0K0Lp8ooK5K5l2j13nnN1l1l0N0K6K5L0L0j3j3MQ4M2l9l5M7N0M9RR1J0J1
4107A56p8p8k6k6M1M1r2r2k4k5l6l7N8N7N5N4N9k1l5l5j8O3L9M1ONp1p2nmO4O4k9l0n3n2M2
4094i4M1m4m5J1p0p4Q8J2J3L9L9n5n6K8K8PQj9j9o0o0L3L3P3P4K0K0k0k0k7k7k7k6J2J3L3
4081a18L3K2K2m5m5m8m8qqN3N3J2J3lkkko5o5LKK9K9j2j1k5k4M3M3l3l3QQl4l4L4L4RJ0%j
$$ plain form
4175 153 143 92 42 39 37 -32 -101 -146 -190 -167 -144 -217 -290 -295 -301 -333 -366 -454 -380 -291 -283 -287 -291 -240 -188 -177 -166 -107 -48 -29 -11 -93 -176 -290 -403 -482 -399
4161 -399 -286 -173 -98 -24 -71 -118 -119 -119 -160 -201 -239 -277 -274 -271 -311 -351 -215 -80 -73 -67 -60 -54 19 93 19 -54 -127 -200 -205 -210 -220 -230 -239 -249 -205 -160 -116 -71
4147 -71 -134 -196 -164 -132 -147 -162 -218 -274 -221 -168 -120 -72 -63 -136 -253 -209 -133 -58 -94 -129 -213 -297 -356 -253 -113 -56 -63 -71 1 74 152 149 33 -82 -163
4135 -163 -243 -247 -251 -249 -248 -286 -243 -178 -113 -97 -81 -111 -60 -64 -68 -78 -6 54 33 -3 -40 -150 -259 -300 -342 -378 -415 -410 -406 -393 -379 -271 -163 -196 -230 -174 -118
4121 -118 -130 -224 -222 -140 -120 -100 -97 -175 -181 -187 -162 -137 -169 -282 -287 -292 -241 -272 -302 -252 -226 -201 -171 -141 -154 -167 -163 -79 -37 -76 -111 -64 -14 35 44 135 145 156
4107 156 78 0 -26 -52 -11 30 -62 -154 -178 -203 -239 -276 -218 -161 -106 -52 7 -14 -49 -84 -102 -39 0 41 47 52 -19 -91 -96 -100 -36 28 -1 -31 -84 -136 -94
4094 -94 -53 -97 -142 -131 -201 -275 -187 -175 -162 -123 -84 -139 -195 -167 -139 -132 -124 -143 -162 -222 -282 -249 -216 -143 -69 -49 -29 -49 -69 -96 -123 -150 -176 -164 -151 -118
4081 -118 -85 -63 -41 -86 -131 -179 -227 -235 -243 -190 -137 -125 -112 -115 -117 -119 -121 -186 -251 -248 -246 -217 -188 -200 -211 -236 -260 -217 -174 -207 -240 -232 -224 -258 -292 -258 -224 -215 -205 -205 -206
4066b06M1j21j0rM4M5MNnnL5L6K9K9N3j09l6l6k7k6j8j8N0M9P2P1L1L0m7m7m7m7j2j2j2j2
4053b38K2K3KKm3m2N2N3Q0Q1j4j4m5m5M9M9k0j9o1o0RQl1l2L7L7M1l9j8j8k3k4N0M9N0M9m8
4039i1m8q8q8mmL6L7%jNMm4L6M1l9l1N1k1k0O2O2rr1p7MP5P5M3M3n2n2j3j4k4N8L7m4l4l4
4025b54p3p2P6P6L3L3L2L3J25J27N0l1q3q2POl0l2O2O2L6L6l2l2o6o5K9K9OPPQm5m6j11l0
4012b04J01J01J1J2J2J2L2L3k1k1j%o7o9k4N7N6k3m0m1J%m0l9nmN8N8j6r8J6J6n8n9j8j8m0
3999c30m0n3Q2J41O1ppJ9J9K0J9l9l9m0l9M1M1j0P1N6k4r2j1M8l4J8J7j3j3N0M9M5l4l6M6
3986a8J3J2p1p1j0P0L0n0L5L5l7l8o6o5JKJJ%Jrj0PQ8O8j4k6k6k2N8R9J7m2m2q9q8J5J6p1
3972b96J0J8J8Q6Q5M6l5l6M6n8n9J5J4P0O9l4j15J9K0J4J4L8L8l5l5j2r2opj0j0onJ7R8N2
$$ plain form
4066 -206 -165 -286 -296 -305 -261 -216 -212 -207 -212 -217 -182 -146 -117 -88 -35 -144 -180 -216 -243 -269 -287 -305 -255 -206 -134 -63 -32 -2 -49 -96 -143 -190 -202 -214 -226 -238
4053 -238 -216 -193 -191 -189 -232 -274 -222 -169 -89 -8 -22 -36 -81 -126 -77 -28 -48 -67 -128 -188 -179 -171 -202 -234 -197 -160 -119 -158 -176 -194 -217 -241 -191 -142 -92 -43 -91
4039 -91 -139 -227 -315 -319 -323 -287 -250 -250 -251 -246 -242 -286 -250 -209 -248 -279 -228 -249 -269 -207 -145 -154 -245 -322 -318 -243 -168 -125 -82 -134 -186 -199 -213 -237 -179 -142 -186 -220 -254
4025 -254 -327 -399 -323 -247 -214 -181 -149 -116 9 136 186 155 72 -10 -3 3 -27 -59 3 65 101 137 105 73 7 -58 -29 0 6 13 20 28 -17 -63 -174 -204
4012 -204 -103 -2 9 21 33 45 77 110 89 68 67 67 0 -69 -93 -36 20 -3 -43 -84 -83 -83 -123 -162 -167 -171 -113 -55 -71 -169 -153 -137 -195 -254 -272 -290 -330
3999 -330 -370 -423 -341 -200 -139 -146 -153 -134 -115 -95 -76 -115 -154 -194 -233 -192 -151 -161 -90 -34 -58 -150 -161 -113 -147 -129 -112 -125 -138 -88 -39 6 -28 -64 -18
3986 -18 -5 7 -64 -135 -145 -75 -45 -95 -60 -25 -62 -100 -166 -231 -230 -228 -227 -226 -226 -225 -234 -244 -237 -149 -81 -95 -121 -147 -169 -111 -12 5 -37 -79 -168 -256 -241 -225 -296
3972 -296 -286 -268 -250 -164 -79 -33 -68 -104 -58 -116 -175 -160 -146 -76 -7 -41 -156 -137 -117 -103 -89 -51 -13 -48 -83 -95 -187 -193 -200 -210 -220 -226 -231 -214 -116 -64
3959f4N2q9q8j8O3K7n4o5o6n8K3R6J5KQ2L7m4k1k0r2r3O1O1J02J01m7m7poMLl7l7O5O5K4K4
3945d6m2m3kkJ1J0J0J0M5M5k2k3k9k8m2R3J5o5o3J9J0p1o5J5R7R8k0j9QRQQj09j09L9M0k7
3932b37k7M1M1j9j8j9j8LLLLK0K0K0K0M6M6M6M5m4m6m5m5j0rj0j0l1l1l1l1L2L1l5l6J0J0
3918c12P9P8q9q9m8m8O0O1O1O1O5O6kjm3m2P9P9l9m0m0m0k3k4M4M3K6K6m1m2k8k8J3J2n7n7
3905b80J0J1P6P6j8j8L5L6nnl8l9p9p9N2N2J1J1n7n7J1J0POOO%%O8O8k9k9L8L9O2O1l1l3l7
3891h2l8L1L0l1l0L7L7N1N2r6r7j07j08J4J4kjjjL4L4L4L4K0J9k2k1Q9Q8M7M8p2p1p2p2L7
3878a74L7L7L7JJJKj16j15L3L3M5M5MMl2l2L5L6K0K0K0K0m6m7m6m7POPOm2m2kkK3K3j7j8K
3864b73KKKrrN8N9j7j6K3K4Q1P9J3J2o6o8o7o8M2M2JJp4p3P4P5J4J4n4n3k8k9M0L9m3m2N2
$$ plain form
3959 -64 -12 -101 -189 -207 -144 -117 -171 -236 -302 -360 -337 -241 -226 -224 -142 -105 -149 -170 -190 -282 -375 -314 -253 -151 -50 -97 -144 -151 -157 -153 -150 -187 -224 -159 -94 -70 -46
3945 -46 -88 -131 -133 -135 -124 -114 -104 -94 -49 -4 -26 -49 -78 -106 -148 -55 -40 -105 -168 -149 -139 -210 -275 -260 -163 -65 -85 -104 -96 -87 -79 -71 -180 -289 -250 -210 -237
3932 -237 -264 -223 -182 -201 -219 -238 -256 -253 -250 -247 -244 -224 -204 -184 -164 -118 -72 -26 19 -25 -71 -116 -161 -171 -180 -190 -200 -231 -262 -293 -324 -292 -261 -296 -332 -322 -312
3918 -312 -233 -155 -244 -333 -381 -429 -369 -308 -247 -186 -121 -55 -57 -58 -101 -143 -64 15 -24 -64 -104 -144 -167 -191 -147 -104 -78 -52 -93 -135 -163 -191 -178 -166 -223 -280
3905 -280 -270 -259 -183 -107 -125 -143 -108 -72 -77 -82 -120 -159 -238 -317 -265 -213 -202 -191 -248 -305 -294 -284 -277 -271 -265 -259 -259 -259 -191 -123 -152 -181 -143 -104 -42 19 -12 -45 -82
3891 -82 -120 -89 -59 -90 -120 -83 -46 5 57 -39 -136 -243 -351 -337 -323 -325 -326 -327 -328 -294 -260 -226 -192 -172 -153 -175 -196 -107 -19 28 76 4 -67 -139 -211 -174
3878 -174 -137 -100 -63 -62 -61 -60 -58 -174 -289 -256 -223 -178 -133 -129 -125 -157 -189 -154 -118 -98 -78 -58 -38 -84 -131 -177 -224 -217 -211 -204 -198 -240 -282 -284 -286 -263 -240 -257 -275 -273
3864 -273 -271 -269 -267 -276 -285 -227 -168 -185 -201 -178 -154 -73 6 19 31 -35 -103 -170 -238 -196 -154 -153 -152 -226 -299 -225 -150 -136 -122 -176 -229 -257 -286 -246 -207 -250 -292 -240
3850b40N2L5L6L6L6K1K1m7m7l4l5L4L3L6L6l2l1l6l6l6l6K0K1k0k1k0k0P5P4j3j2j3j2K8K8
3837a19K8K8PQl3l3K0K1K0K0j3j2j3j3l2l2l2l2Q9Q9n9o0p5p4M7M6M6M5M5M5n4n5j4j4M1M1
3824h3M2M1j0j0rj0k3k3o4o3j1j0j1j0mmmlP3P4POp8p9l8l8P3P4L3L3J5J6k0k0rP2P2rm5m5
3809a02J7J7K4K3J8J7j7r9m9m8K1J02J00K1m0l9m5m6k5k5j11l0J06J07j1j0mnrrK4n7r8j6
3797b98L6L6L6L6N1l0n3n2L8L9P3P4Q7Pj22j23r1r2j5O7J20J21nq5K8K9k2N9N9N9J6o5rqn4
3784e3n4N5N4o1o1p8MN2N3j9j8j8j8k3k3p4PJ42O0J7J6J%o7o7PQn6n5r2j2L8L8OOO9O9J1p1
3770b07k4k5p5p6K0J9MLRQN2J34J33N1n2n3n9n8%%o3o3J9R9M9M9N7k5j4j5o1J9Q7Oj4j4j9
3757i9j9o2o2N9O0m9m9k6N4J6J5K1K0l7l7l7l7J6J5k9j09n8K4M0M1L4L5K9L0K7n5m4R1N5N4
$$ plain form
3850 -240 -188 -153 -117 -81 -45 -24 -3 -50 -97 -131 -166 -132 -99 -63 -27 -59 -90 -126 -162 -198 -234 -214 -193 -213 -234 -254 -274 -199 -125 -138 -150 -163 -175 -147 -119
3837 -119 -91 -63 -56 -48 -81 -114 -94 -73 -53 -33 -46 -58 -71 -84 -116 -148 -180 -212 -123 -34 -93 -153 -228 -302 -255 -209 -163 -118 -73 -28 -82 -137 -151 -165 -124 -83
3824 -83 -41 0 -10 -20 -29 -39 -62 -85 -149 -212 -223 -233 -244 -254 -258 -262 -266 -269 -196 -122 -115 -109 -187 -266 -304 -342 -269 -195 -162 -129 -114 -98 -118 -138 -147 -75 -3 -12 -57 -102
3809 -102 -85 -68 -44 -21 -3 14 -3 -102 -151 -199 -178 -76 24 45 5 -34 -79 -125 -150 -175 -286 -316 -210 -103 -114 -124 -128 -133 -142 -151 -127 -184 -282 -298
3797 -298 -262 -226 -190 -154 -103 -133 -186 -238 -200 -161 -88 -14 73 80 -42 -165 -256 -348 -363 -296 -176 -55 -60 -145 -117 -88 -110 -51 8 67 83 18 9 1 -53
3784 -53 -107 -52 2 -59 -120 -198 -194 -142 -89 -108 -126 -144 -162 -185 -208 -282 -275 -133 -73 -56 -40 -39 -39 -106 -173 -166 -158 -214 -269 -361 -373 -335 -297 -291 -285 -216 -147 -136 -207
3770 -207 -231 -256 -331 -407 -387 -368 -364 -361 -352 -344 -292 -158 -25 26 -26 -79 -138 -196 -196 -196 -259 -322 -303 -204 -155 -106 -49 -74 -88 -103 -164 -145 -58 -52 -66 -80 -99
3757 -99 -118 -180 -242 -183 -123 -172 -221 -247 -193 -177 -162 -141 -121 -158 -195 -232 -269 -253 -238 -267 -376 -434 -410 -370 -329 -295 -260 -231 -201 -174 -229 -273 -182 -127 -73
3744g3l1l2j3j3m5m5KJ36J36Jk4k5PPo3o4j5O6K6K5L1L0m0m0l5l5j20l8L8L7O8O8K8K7j1j1
3731d0j6j6Op4j15l4L4L5P5P5M0m1NNN3N2k0k0Pp3p4PJ0J0N1N1N7k3p1p2n6n5j6j5k7k7k8
3718c40k7M0M0M0M0l5l5L2L3RJ0RRjkO7O6P2P3m9m8l5l6l6l6qqm9m9m6m6onn5n4j4j4J13J13
3703b68M5M6l4l4L4L4M0L9k9k8K9L0r2r2m1m1N3N4N6N6j2j1j5j5Q0Q0ooj7r9l9J23P7q5r3
3691a81r3l5l5O6O6k9k8N7N7J6J7L6L5L6L5n1n2j2j1q2q2m1m1M4M5p8p7M5M4M4M5J6J6J6J6
3678a76J9J9O0O0p1p1l0l1qrL2L2OOq9q8L6L6J04J04J0J0n8n8Q4Q3j0j0l5l4NOL2L2L1L2p6
3665a5p7rrJ3J4k8k7L7L6mq5l6J00O9j2m3L7kq5n2K8J8J8O6O5jko5o6o6o6mlmmN5N5m0l9n0
3650b83n1M5M4L4L4opN3N2j6j5p5p5M8M7O0O1K1K0J6J7L0j03j11k9L8L8m0m0k9J05Q8m7lm
$$ plain form
3744 -73 -104 -136 -149 -162 -207 -252 -250 -114 22 23 -1 -26 -19 -12 -75 -139 -154 -88 -62 -37 -6 24 -16 -56 -91 -126 -246 -284 -246 -209 -141 -73 -45 -18 -29 -40
3731 -40 -56 -72 -66 -140 -255 -289 -255 -220 -145 -70 -30 -71 -66 -61 -8 44 24 4 11 -62 -136 -129 -119 -109 -58 -7 50 27 -44 -116 -172 -227 -243 -258 -285 -312 -340
3718 -340 -367 -327 -287 -247 -207 -242 -277 -245 -212 -203 -193 -184 -175 -176 -178 -111 -45 27 100 51 3 -32 -68 -104 -140 -148 -156 -205 -254 -300 -346 -352 -357 -412 -466 -480 -494 -381 -268
3703 -268 -223 -177 -211 -245 -211 -177 -137 -98 -127 -155 -126 -96 -188 -280 -321 -362 -309 -255 -199 -143 -155 -166 -181 -196 -116 -36 -42 -48 -65 -164 -203 -80 -3 -88 -181
3691 -181 -274 -309 -344 -278 -212 -241 -269 -212 -155 -139 -122 -86 -51 -15 20 -31 -83 -95 -106 -188 -270 -311 -352 -308 -263 -341 -418 -373 -329 -285 -240 -224 -208 -192 -176
3678 -176 -157 -138 -78 -18 -89 -160 -190 -221 -229 -238 -206 -174 -168 -162 -251 -339 -303 -267 -163 -59 -49 -39 -97 -155 -71 12 2 -8 -43 -77 -72 -66 -34 -2 29 61 -15
3665 -15 -92 -101 -110 -97 -83 -111 -138 -101 -65 -69 -154 -190 -90 -21 -33 -76 -39 -41 -126 -178 -150 -132 -114 -48 17 16 14 -51 -117 -183 -249 -253 -256 -260 -264 -209 -154 -194 -233 -283
3650 -283 -334 -289 -245 -211 -177 -183 -190 -137 -85 -101 -116 -191 -266 -218 -171 -111 -50 -29 -9 7 24 54 -49 -160 -189 -151 -113 -153 -193 -222 -117 -29 -76 -79 -83
3637h3j3j4K7K8j5j4K6K6l1l1l1l2ONONq4q4L8L8N7N7j1j0mmL7L7l7l8Q5Q3n3n5n5n5M0M0
3623a13jjk2k2k2k2K6K5K5K5p5p5l5l5N8N7N8N8j8j7j7j8J8J7J8J7k0j9k0k0lmmlL2L3o2o2
3610b43M1M1M1M0J5J5q0q1j4j5N3N3KJKJj8j9K2K2m4m5K3K3l3l3L4L5JJJJOOPOn3n3M2M2L9
3595a15L8n6n6j8j7K3K4k8k7J3J3nmnmj8j7K4K3kjkkK2K1j10N3R1R2QP%%m0m1PPPOl4l3l4
3580a90l4j7j7J31J31K1K1m6m6j23j22jjQ7Q6J9J9l3l4l3l3l6l6l6l6j7j8P8P7Q2Q2j12j12
3568b99p4O1R8J7j0j0j6j5m2m1K6K6K7K8j3j3O5O6n6n7j6j7j7j7M0M1M1M0K0K0p5p4mmmll8
3554b99l7Q4Q4j1j0j1j0l5l5L3L3jjR4R4j9j8j9j8K8K8l9m0MLM4M5j4j3j3j4J5J5J5J5q3q4
3541a90j5j6N3N2J2J2RRRQoonor2r2N6N7K6K5j5j4m3m3m3m2N3N3J2J2L6L5L5L5k0k0k1k0k
$$ plain form
3637 -83 -96 -110 -83 -55 -70 -84 -58 -32 -63 -94 -125 -157 -151 -146 -140 -135 -219 -303 -265 -227 -170 -113 -124 -134 -138 -142 -105 -68 -105 -143 -58 25 -28 -83 -138 -193 -153 -113
3623 -113 -114 -115 -137 -159 -181 -203 -177 -152 -127 -102 -177 -252 -287 -322 -264 -207 -149 -91 -109 -126 -143 -161 -143 -126 -108 -91 -111 -130 -150 -170 -173 -177 -181 -184 -152 -119 -181 -243
3610 -243 -202 -161 -120 -80 -65 -50 -130 -211 -225 -240 -187 -134 -132 -131 -129 -128 -146 -165 -143 -121 -165 -210 -187 -164 -197 -230 -196 -161 -160 -159 -158 -157 -151 -145 -138 -132 -185 -238 -196 -154 -115
3595 -115 -77 -133 -189 -207 -224 -201 -177 -205 -232 -219 -206 -211 -215 -220 -224 -242 -259 -235 -212 -214 -215 -217 -219 -197 -176 -286 -233 -142 -50 -42 -35 -35 -35 -75 -116 -109 -102 -95 -89 -123 -156 -190
3580 -190 -224 -241 -258 -127 4 25 46 0 -46 -169 -291 -292 -293 -206 -120 -101 -82 -115 -149 -182 -215 -251 -287 -323 -359 -376 -394 -316 -239 -157 -75 -187 -299
3568 -299 -373 -312 -214 -197 -207 -217 -233 -248 -290 -331 -305 -279 -252 -224 -237 -250 -185 -119 -175 -232 -248 -265 -282 -299 -259 -218 -177 -137 -117 -97 -172 -246 -250 -254 -258 -261 -299
3554 -299 -336 -252 -168 -179 -189 -200 -210 -245 -280 -247 -214 -215 -216 -122 -28 -47 -65 -84 -102 -74 -46 -85 -125 -121 -118 -74 -29 -43 -56 -69 -83 -68 -53 -38 -23 -106 -190
3541 -190 -205 -221 -168 -116 -104 -92 -83 -74 -65 -57 -63 -69 -74 -80 -172 -264 -208 -151 -125 -100 -115 -129 -172 -215 -258 -300 -247 -194 -182 -170 -134 -99 -64 -29 -49 -69 -90 -110 -112
3526a12jm3m2L7L7l0l1n8n8L6L6k1k1k1k1M0M0k8k8L3L3L2L3l6l6NNk9k9J1J2J9J9m8m9P2
3513b42P2P2P1o6o7o7o7L1L0j0j0N4N3j4j4j6j5K5K5n6n5j5j5pppoPPM8M8NNl6l5J4J4J4J4
3499b18m1m1Q1Q0PPo0o1%jJ10J11J22l9j22j24J2J2J2J2m1m2j%J4J4k6k6O0O1O1O0%%m0m1
3486h8j2j2j2j2m4m3N0N1k3k4o4o4L5L6L5L5J9J8k2k2M9M8R4J3jjool5l6q2%k5k4k9N2N0l0
3472a32m7m8K7K6m1m2N6N6KQ3Q9m4j04k4RQJ4J4o6o6k5k5kjM4l6k9k9N5N5P7nk6k7J1J0K1
3459a62o1q0JJ8J8M2M3L7L7Pp4J2J2PPPPj7j6P3P4N8k2r2r3n8K4J9J9k3k2rP2N1q4m9L3L9
3445a45L9K8n4j2O9O9j1p7ML9m1o5o5K4K5R2R1J6o4p3p4j1j1M5M5n0n0k2k3M0M0pq9k6N5P6
3432a73nn0m9PPPQJ4J4Q1Q2QQn9o0l8l8j6O5J8J7r4r4o0K0R1m3j7j7j7j7j0J26M9M9PPJ1J2
$$ plain form
3526 -112 -113 -156 -198 -161 -124 -154 -185 -243 -301 -265 -229 -250 -271 -292 -313 -273 -233 -261 -289 -256 -223 -191 -158 -194 -230 -225 -220 -249 -278 -267 -255 -236 -217 -265 -314 -242
3513 -242 -170 -98 -27 -93 -160 -227 -294 -263 -233 -243 -253 -199 -146 -160 -174 -190 -205 -180 -155 -211 -266 -281 -296 -303 -310 -317 -323 -316 -309 -261 -213 -208 -203 -239 -274 -260 -246 -232 -218
3499 -218 -259 -300 -219 -139 -132 -125 -185 -246 -246 -247 -137 -26 96 57 -65 -189 -177 -165 -153 -141 -182 -224 -225 -225 -211 -197 -223 -249 -189 -128 -67 -7 -7 -7 -47 -88
3486 -88 -100 -112 -124 -136 -180 -223 -173 -122 -145 -169 -233 -297 -262 -226 -191 -156 -137 -119 -141 -163 -114 -66 28 41 40 39 33 27 -8 -44 -126 -126 -151 -175 -204 -152 -102 -132
3472 -132 -179 -227 -200 -174 -215 -257 -201 -145 -143 -60 29 -15 -119 -143 -134 -126 -112 -98 -164 -230 -255 -280 -282 -283 -239 -275 -304 -333 -278 -223 -146 -151 -177 -204 -193 -183 -162
3459 -162 -223 -303 -302 -284 -266 -224 -181 -144 -107 -100 -174 -162 -150 -143 -136 -129 -122 -139 -155 -82 -8 50 28 -64 -157 -215 -191 -172 -153 -176 -198 -207 -135 -84 -168 -217 -184 -145
3445 -145 -106 -78 -132 -144 -75 -6 -17 -94 -90 -51 -92 -157 -222 -198 -173 -81 10 26 -38 -111 -185 -196 -207 -162 -117 -167 -217 -239 -262 -222 -182 -189 -278 -304 -249 -173
3432 -173 -178 -228 -277 -270 -263 -256 -248 -234 -220 -139 -57 -49 -41 -100 -160 -198 -236 -252 -187 -169 -152 -246 -340 -400 -380 -289 -332 -349 -366 -383 -400 -410 -284 -235 -186 -179 -172 -161 -149
3418a49qP3K2K2m3j24q3lM6M5N0N1l7l6MMo4o3m2M0L1L1l1l1J1J1k5k4J4R5R6J4NM%jqqqq
3403a27l9l9KKNNJ0J0m1M1k2j03J5R6M6M5ONl5l5K5K5j6j5J1J2K2o0o6J5N0l0q5q5Q0Q1J31
3390e8N1p5p5n4K8J8J7k1j03o2J9K0K0J14J14K0o0n6n5J4J5J5J5L5L6onl0k9l0l0oojjl5M6
3376b01M1M1k2k2o3o3P3P2N1l0n8n7k2k2k3k2O6O7N2k9r7j6P3P3L8L8n2n2J6J6L5L6qr0r2
3364b53j2N9N9J2J2k9k9rrqrN5N6J00J9q3q4Q7Q6l1l1l1l1m6m6K2K2M3M3K5n5j09k7j1j1O5
3351a89O4N9N9J9o0o1K0N3N2J7J8j4j4rq9J8J8j04j04m5L7L6m5L4L4K8K9L5L4ooj0j1j1j0
3338a24nnrP1N2N2L5m5ooj0j0P5P6o7o8n4K5K4n4l1l1MMk4k4K1K1j0P1P0j0rj0j5j5k7k6n
3324i9P6k0k0rj0n3K8N0N0P9Q0m5j26j20m0MNj8j8m9n0N2J87J46J1j05j07k1k0k8k8J3J3O
$$ plain form
3418 -149 -157 -84 -62 -40 -83 -207 -290 -293 -247 -202 -152 -101 -138 -174 -170 -166 -230 -293 -335 -295 -264 -233 -264 -295 -284 -273 -298 -322 -308 -213 -117 -103 -98 -94 -94 -95 -103 -111 -119 -127
3403 -127 -166 -205 -203 -201 -196 -191 -181 -171 -212 -171 -193 -296 -281 -185 -139 -94 -88 -83 -118 -153 -128 -103 -119 -134 -123 -111 -89 -149 -215 -200 -150 -180 -265 -350 -270 -189 -58
3390 -58 -7 -82 -157 -211 -183 -165 -148 -169 -272 -334 -315 -295 -275 -161 -47 -27 -87 -143 -198 -184 -169 -154 -139 -104 -68 -74 -79 -109 -138 -168 -198 -204 -210 -211 -212 -247 -201
3376 -201 -160 -119 -141 -163 -226 -289 -216 -144 -93 -123 -181 -238 -260 -282 -305 -327 -261 -194 -142 -171 -268 -284 -211 -138 -100 -62 -114 -166 -150 -134 -99 -63 -71 -161 -253
3364 -253 -265 -206 -147 -135 -123 -152 -181 -190 -199 -207 -216 -161 -105 -5 14 -69 -153 -66 20 -11 -42 -73 -104 -150 -196 -174 -152 -109 -66 -41 -96 -205 -232 -243 -254 -189
3351 -189 -125 -66 -7 12 -48 -109 -89 -36 16 33 51 37 23 14 -75 -57 -39 -143 -247 -292 -255 -219 -264 -230 -196 -168 -139 -104 -70 -76 -82 -92 -103 -114 -124
3338 -124 -129 -134 -143 -72 -20 32 67 22 16 10 0 -10 65 141 74 6 -48 -23 1 -53 -84 -115 -111 -107 -131 -155 -134 -113 -123 -52 18 8 -1 -11 -26 -41 -68 -94 -99
3324 -99 -23 -43 -63 -72 -82 -135 -107 -57 -7 72 152 107 -19 -139 -179 -175 -170 -188 -206 -255 -305 -253 -66 80 91 -14 -121 -142 -162 -190 -218 -205 -192 -186
3311a86OOOM4M3L9L9Ro9J6J5j3j3j3j3l1l1p1p1M4M4n1n1N4N3N3N3j5j6q3q4J9J9J9J9lkl
3298b19kJ4J4n3n3n6n6Q5Q4M7q7n8K4O2O3O8O7J3J3k8k8l0l0l0l0J1J1J2J1MLMMo6o5k5k5
3284c27K4K4j6j6j2j2n3n2L3L4L4L3m7m8P4P4k8k8k8k8ppQ8Q8K5K6m2m2K1K0p4p4J7J6N8N7
3271a95N3N4m1m0p0o9k9k9O4O5O5O5l2l2L5L5OOl4l5L3L3k7k6k5J10L3L3K8K8j3j3j00j02
3259a66j01j02Q4Q4Q4Q5L5L7n7n7j3j3n4n3l3l2l3l2K2K2Q9R0K9L0l9l8o9o9jkj7j8N0N0J6
3246a92J5J6J6m6m6n3J09J72Rr2r2J4J3J4J4j4j4q1q1n0n0P2P1%%O8O7lmm3m4n1n0P1P2J4
3233a79J5N6N5j4j3j3j4J3J3n5n5j5j6K5K5l5l5ONL9L8K9K8Q0q3n8n9QQP6P5q2q3j4j5m7m6
3219c37m6m7Q5Q4j0j0O9O8KJmmm4m4M3M3KLO0O0N9O0k1k0k1k1o7o9o4o4p1J0ONj0rL1L2on
$$ plain form
3311 -186 -180 -174 -168 -124 -81 -42 -3 6 -63 -47 -32 -45 -58 -71 -84 -115 -146 -217 -288 -244 -200 -251 -302 -248 -195 -142 -89 -104 -120 -203 -287 -268 -249 -230 -211 -214 -216 -219
3298 -219 -221 -207 -193 -246 -299 -355 -411 -326 -242 -195 -282 -340 -316 -254 -191 -123 -56 -43 -30 -58 -86 -116 -146 -176 -206 -195 -184 -172 -161 -157 -154 -150 -146 -212 -277 -302 -327
3284 -327 -303 -279 -295 -311 -323 -335 -388 -440 -407 -373 -339 -306 -353 -401 -327 -253 -281 -309 -337 -365 -372 -379 -291 -203 -178 -152 -194 -236 -215 -195 -269 -343 -326 -310 -252 -195
3271 -195 -142 -88 -129 -169 -239 -308 -337 -366 -302 -237 -172 -107 -139 -171 -136 -101 -95 -89 -123 -158 -125 -92 -119 -145 -170 -60 -27 6 34 62 49 36 -64 -166
3259 -166 -267 -369 -285 -201 -117 -32 3 40 -17 -74 -87 -100 -154 -207 -240 -272 -305 -337 -315 -293 -204 -114 -85 -55 -94 -132 -201 -270 -271 -273 -290 -308 -258 -208 -192
3246 -192 -177 -161 -145 -191 -237 -290 -181 -9 0 -92 -184 -170 -157 -143 -129 -143 -157 -238 -319 -369 -419 -347 -276 -276 -276 -208 -141 -144 -148 -191 -235 -286 -336 -265 -193 -179
3233 -179 -164 -108 -53 -67 -80 -93 -107 -94 -81 -136 -191 -206 -222 -197 -172 -207 -242 -236 -231 -192 -154 -125 -97 -17 -100 -158 -217 -209 -201 -125 -50 -132 -215 -229 -244 -291 -337
3219 -337 -383 -430 -345 -261 -271 -281 -212 -144 -142 -141 -145 -149 -193 -237 -194 -151 -149 -146 -86 -26 33 93 72 52 31 10 -57 -126 -190 -254 -325 -315 -309 -304 -314 -323 -292 -260 -266 -271
3205b71L5L5j5j5L1n0q9q9J03J04R8J7l1l2mmlmJ4J4J4J4j4j3qqJ2R4LLkq4l8l7k6k5lP8O1
3191a35O0jkl2l3RQK8K7o7o8K4K4p0p1MMR3R3N3k8o9J2nno7o8llQ6Q6J39N9m4m3k3k3o8J2
3177a07K4K3Op4P6P5m9n0m7m8l0N1J37N6m4j26m9L1j9j9k4k5O2j9m2m1m7m7L9L9Q5MM0L9M0
3164h0m1q0p9l6M6j8j8Q1Q2O9O9j07j07k1k1k0k1nmmmQRP6P5o7o6k7k6Q5Q6J8J8q0q0j3j2
3150c15O9O9K9K8j1j1K9L0LMMLj4j4n5n4P9Q0j5j5ooonk5k4J6J6m7m7poM7M7p5p5L4L3L3L4
3136a46M1M0M1L9m3m3m4m4k5k6k5k5m0m0K8K8J8J8J8J7K8K8K8K8K8K9m0l9NMNNK2K2m5m5L7
3122a13L6L7L7o4o4o4o4L4L4L4L4j9j9j9j9j7j6j7j6j2j1K9K9P2P2MNj4j5n4n5l1l0l0l1P7
3109b60P6QRk0k0K0K1j6j6j6j6l7l6MMM6M7M6M6p6p7l5l6O7O7%jqqqqL4L4l4l3K4K4R1R2j3
$$ plain form
3205 -271 -236 -201 -216 -231 -200 -250 -339 -428 -325 -221 -123 -106 -137 -169 -173 -177 -180 -184 -170 -156 -142 -128 -142 -155 -163 -171 -159 -65 -62 -59 -61 -145 -183 -220 -246 -271 -274 -196 -135
3191 -135 -75 -76 -78 -110 -143 -134 -126 -98 -71 -138 -206 -182 -158 -228 -299 -295 -291 -198 -105 -52 -80 -149 -137 -142 -147 -214 -282 -285 -288 -202 -116 23 82 38 -5 -28 -51 -119 -107
3177 -107 -83 -60 -54 -128 -52 23 -26 -76 -123 -171 -201 -150 -13 43 -1 -127 -176 -145 -164 -183 -207 -232 -170 -189 -231 -272 -319 -366 -327 -288 -203 -199 -159 -120 -80
3164 -80 -121 -201 -280 -316 -270 -288 -306 -225 -143 -74 -5 -112 -219 -240 -261 -281 -302 -307 -311 -315 -319 -311 -302 -226 -151 -218 -284 -311 -337 -252 -166 -148 -130 -210 -290 -303 -315
3150 -315 -246 -177 -148 -120 -131 -142 -113 -83 -80 -76 -72 -69 -83 -97 -152 -206 -127 -47 -62 -77 -83 -89 -95 -100 -125 -149 -133 -117 -164 -211 -218 -224 -177 -130 -205 -280 -246 -213 -180 -146
3136 -146 -105 -65 -24 15 -28 -71 -115 -159 -184 -210 -235 -260 -300 -340 -312 -284 -266 -248 -230 -213 -185 -157 -129 -101 -73 -44 -84 -123 -118 -114 -109 -104 -82 -60 -105 -150 -113
3122 -113 -77 -40 -3 -67 -131 -195 -259 -225 -191 -157 -123 -142 -161 -180 -199 -216 -232 -249 -265 -277 -288 -259 -230 -158 -86 -82 -77 -91 -106 -160 -215 -246 -276 -306 -337 -260
3109 -260 -184 -176 -167 -187 -207 -187 -166 -182 -198 -214 -230 -267 -303 -299 -295 -249 -202 -156 -110 -186 -263 -298 -334 -267 -200 -200 -201 -209 -217 -225 -233 -199 -165 -199 -232 -208 -184 -93 -1 -14
3095a4j4O2p1j56j55J2J3J1J1J2J1L3L2L3L3jjjjK1K0m7m7k1k1k0k1j0j1kko2P3O5O4n2n1
3081b75n2n2m1m1K7K6O9O9K8K9K4K5K4K5r6r7k8k9P9Q0L8L9OOo2o2L3L3L3L4p1p1llK6K6m2
3068b46m2K8K8KLk8j09j4O6N7N6l0N1N0l1m8m8Q5Q5O4j8j20j20k5k5j7O5j7j7j9O1P9P8J1
3056a05p1k6k5m6m6LQ4R9J00m5m4k7k7k2k2o5J6N6N7O0p4r3r3j5j4rj0k4N6P8P9jjjjK1K2
3042a76j9j8J6J7J7J6M3M3K1o1n4n5n4n5J1R2M7M6qrn0m9K4K4L9M0N9k1K4K4KJk3k4m1j22
3029b33n8P7LLq4q3M6M6O7O7J5J5k6k6m5m5n1L1N5N5q9q8k8k7M0M0N0N0j8j7k4k3M4M4ppp
3016b38pl4l3L4L5L5L6onj7j7P8P7lkJ0p0j13K2N5k7k4k5J1J1%Jm0m0O1O1P5o1m0M0N5N4n8
3002a09n8j8j7K8K8J7j17j29OP0P0k6k6m6m6J32J32j7j7L2L1N2N1j32j33j13j13m9m9qrLL
$$ plain form
3095 -14 -28 34 -37 -193 -348 -336 -323 -312 -301 -289 -278 -245 -213 -180 -147 -148 -149 -150 -151 -130 -110 -157 -204 -225 -246 -266 -287 -297 -308 -310 -312 -374 -301 -236 -172 -224 -275
3081 -275 -327 -379 -420 -461 -434 -408 -339 -270 -242 -213 -189 -164 -140 -115 -211 -308 -336 -365 -286 -206 -168 -129 -123 -117 -179 -241 -208 -175 -142 -108 -179 -250 -253 -256 -230 -204 -246
3068 -246 -288 -260 -232 -230 -227 -255 -364 -378 -312 -255 -199 -229 -178 -128 -159 -207 -255 -170 -85 -21 -39 -159 -279 -304 -329 -346 -281 -298 -315 -334 -273 -194 -116 -105
3056 -105 -176 -202 -227 -273 -319 -316 -232 -133 -33 -78 -122 -149 -176 -198 -220 -285 -269 -213 -156 -96 -170 -263 -356 -371 -385 -394 -404 -428 -372 -294 -215 -216 -217 -218 -219 -198 -176
3042 -176 -195 -213 -197 -180 -163 -147 -104 -61 -40 -101 -155 -210 -264 -319 -308 -216 -169 -123 -131 -140 -190 -239 -215 -191 -152 -112 -53 -74 -50 -26 -24 -23 -46 -70 -111 -233
3029 -233 -291 -214 -211 -208 -292 -375 -329 -283 -216 -149 -134 -119 -145 -171 -216 -261 -312 -281 -226 -171 -260 -348 -376 -403 -363 -323 -273 -223 -241 -258 -282 -305 -261 -217 -224 -231 -238
3016 -238 -245 -279 -312 -278 -243 -208 -172 -178 -183 -200 -217 -139 -62 -65 -67 -57 -127 -240 -218 -163 -190 -214 -239 -228 -217 -217 -216 -256 -296 -235 -174 -99 -160 -200 -160 -105 -51 -109
3002 -109 -167 -185 -202 -174 -146 -129 -246 -375 -369 -299 -229 -255 -281 -327 -373 -241 -109 -126 -143 -111 -80 -28 23 -109 -242 -355 -468 -517 -566 -574 -583 -580 -577
2990e77R7R7P0O9P0O9R5R3k7k7k1k1k2k1MNK5K4qrn0m9RQj1j2qrL2L2KKKKm4m4m3m4M9M9j9
2975a61j9K5K4j6j6M6M6p6p6J1J2J6J6n4K7M9M8k5k6k0k1JQ3l1l1k1k0o5J5K3K2K8K7k0k0
2962a99K1K1q3q3o4P1P6P6J7J7n8n8j8j7k8k8L5L5O5j5j1j1m4m5N1N0RRk7k6J1R3N2k9k8k8
2949a91k7k8j05k3P9Q0k6k5rP2M9l2k7N3L2L1Q2Jk7k7l2l3L4L4j1j2L3m8kkLMkjN4k7p1p0
2935b17jQ1K1j13j14l3L5L5J6J5N6N5j9k0j9k0MMl6l7J2J2N2N2L1L2rrq2q2m1m1J06J06L9
2923a29L9j08j07J4J4K0K1K0K1J5J6J5J6k4k3M4M4j%r6r5M3M4KLM9M9m5m6J2J1J1J2lkO5O6
2909a3NNNNm2m4m4m3J1J1P9P8J8J7k3k4k7k8o9o9k0k0K1K1O9O9k6k6j00j01ooQ6Q7Q7Q6j%
2895B8m0m0q1q0m0m0J01J00L3L3l5l5OOj4j4j3j4n4n4r5r5K1K1O2O1J9J9k2k1J9K0K0K0Q1
$$ plain form
2990 -577 -480 -383 -313 -244 -174 -105 -10 83 56 29 8 -13 -35 -56 -52 -47 -22 2 -6 -15 -65 -114 -105 -97 -108 -120 -128 -137 -105 -73 -71 -69 -67 -65 -109 -153 -196 -240 -191 -142 -161
2975 -161 -180 -155 -131 -147 -163 -117 -71 -147 -223 -212 -200 -184 -168 -222 -195 -146 -98 -123 -149 -169 -190 -189 -106 -137 -168 -189 -209 -274 -259 -236 -214 -186 -159 -179 -199
2962 -199 -178 -157 -240 -323 -387 -316 -240 -164 -147 -130 -188 -246 -264 -281 -309 -337 -302 -267 -202 -217 -228 -239 -283 -328 -277 -227 -218 -209 -236 -262 -251 -158 -106 -135 -163 -191
2949 -191 -218 -246 -351 -374 -295 -215 -241 -266 -275 -203 -154 -186 -213 -160 -128 -97 -15 -14 -41 -68 -100 -133 -99 -65 -76 -88 -55 -103 -105 -107 -104 -100 -102 -103 -49 -76 -147 -217
2935 -217 -218 -137 -116 -229 -343 -376 -341 -306 -290 -275 -219 -164 -183 -203 -222 -242 -238 -234 -270 -307 -295 -283 -231 -179 -148 -116 -125 -134 -216 -298 -339 -380 -274 -168 -129
2923 -129 -90 -198 -305 -291 -277 -257 -236 -216 -195 -180 -164 -149 -133 -157 -180 -136 -92 -93 -93 -189 -284 -241 -197 -195 -192 -143 -94 -139 -185 -173 -162 -151 -139 -142 -144 -79 -13
2909 -13 -8 -3 2 7 -35 -79 -123 -166 -155 -144 -65 13 31 48 25 1 -26 -54 -123 -192 -212 -232 -211 -190 -121 -52 -78 -104 -204 -305 -311 -317 -231 -144 -57 29 28 28
2895 28 -12 -52 -133 -213 -253 -293 -192 -92 -59 -26 -61 -96 -90 -84 -98 -112 -125 -139 -193 -247 -342 -437 -416 -395 -333 -272 -253 -234 -256 -277 -258 -238 -218 -198 -117
2883a17Q1m0m0poj03O0J09K7l8l8p5p5l5l5K4K3K4K3k0k1k0k0l2l3L6L5n7n8J0J0M2M1M2M1
2870b42q6q6L5L6Q7Q7pqj51j51k9l0J05J04L2L2N4k7l7J25P2qm7m8M1M2M1M1N1N2m2m2j0j1
2858b5N6N7k5k5k4k4j2j3n2n3rrL1L2PPM7M7l0l2l1l1L9L8k8k9L1L2r1r0k1k1k1k1j1j2j1
2844c27j2M2M2j4O7M4j18%Q1P2P2J0Rn4n5j4j3j6j6K5K6k5k5M2M3j4j4j4j4N0N1j2j2n0L0
2831a13l7j19K6K6K1K0J1J0M6M7Op4p4OJ30J30J3o8p7N7K5n4m3L8L8m3n0L1K1K2k2k2n8n7
2819a87k6N5N0N0K4K4m3m4p1p1p1p1JKJKM8M7p4p4R4R4K1K2J00J8q4q4k9l0k9k9N0N1N6k5
2806b32p3p3qP4J44O2l1l0K1J03J02K2o4o3p0o9j4j4K6K6k9l0k9l0L7L8L2L2J4o7p2J0R5J4
2794a46J6J6Q6n0r1M5j9k0L0K9o6o6K9K9R1R0k9l1J9J8k5j06r5j4L1L0k1k2J9J9L4L3L4L3
$$ plain form
2883 -117 -36 -76 -116 -123 -129 -232 -172 -63 -36 -74 -112 -187 -262 -297 -332 -308 -285 -261 -238 -258 -279 -299 -319 -351 -384 -348 -313 -370 -428 -418 -408 -366 -325 -283 -242
2870 -242 -328 -414 -379 -343 -256 -169 -176 -184 -335 -486 -515 -545 -440 -336 -304 -272 -218 -245 -282 -157 -85 -93 -140 -188 -147 -105 -64 -23 28 80 38 -4 -14 -25
2858 -25 31 88 63 38 14 -10 -22 -35 -87 -140 -149 -158 -127 -95 -88 -81 -34 13 -17 -49 -80 -111 -72 -34 -62 -91 -60 -28 -119 -209 -230 -251 -272 -293 -304 -316 -327
2844 -327 -339 -297 -255 -269 -202 -158 -276 -276 -195 -123 -51 -41 -32 -86 -141 -155 -168 -184 -200 -175 -149 -174 -199 -157 -114 -128 -142 -156 -170 -120 -69 -81 -93 -143 -113
2831 -113 -150 -269 -243 -217 -196 -176 -165 -155 -109 -62 -56 -130 -204 -198 -68 62 75 7 -70 -13 12 -42 -85 -47 -9 -52 -102 -71 -50 -28 -50 -72 -130 -187
2819 -187 -213 -158 -108 -58 -34 -10 -53 -97 -168 -239 -310 -381 -380 -378 -377 -375 -327 -280 -354 -428 -334 -240 -219 -197 -97 -79 -163 -247 -276 -306 -335 -364 -314 -263 -207 -232
2806 -232 -305 -378 -386 -312 -168 -106 -137 -167 -146 -43 59 81 17 -46 -116 -185 -199 -213 -187 -161 -190 -220 -249 -279 -242 -204 -172 -140 -126 -193 -265 -255 -160 -146
2794 -146 -130 -114 -28 -78 -169 -124 -143 -163 -133 -104 -170 -236 -207 -178 -87 3 -26 -57 -38 -20 -45 -151 -246 -260 -229 -199 -220 -242 -223 -204 -170 -137 -103 -70
2781g0M4M3%q0p7NM0m2n2n2o7J4N2k9o4J6K1K1K1K1M0m1l6l6R2R1M6M6Lp8k8k7n1L1K6K5k
2768a34kLLl2M9MMj2j3j2j2m8m8n4K8M1M0K4n7N2N3KKP5pq2q3j1j1N7N6m2m3m2m2L8L8klK
2753b21Km9L2O5j7j2P0j6j6o2K0M1m0l1l0O1O0k9k9m7L3P5po1o2K8K8J3J2J3J2J8J9J8J8%
2740i1%M5l6m6m6j1j1k5k5qP2Op5o0P6QRJ7J7m8m7poM3M3M3M4LMQp2n1n0J2J2K2K2K2K2jk
2725a68jkl5l6N5N4J8o4k3N8Q1P9O3j8p8q0J1J0p0o9p4ON9N9M2m0L1L1j8j00j7O3O3j7o2J9
2712a70Q2Jm1m1r6j6L8m3l8l9J23M1q9q9NMP1P2N7N6n6K4P0O9K5n5o3o3k2j03r2r3p9N7J41
2700c52J41P3pJ9K0M9q5p6p6j6j7K4K5K5K4m9m9J8J8J6J6k5k5N9N8R9R8k0k0k0k0N0M9J0J0
2687D4p3p4l3l4O0O0l5l5llklJ%J%j2j2j2j2J0J0P7P7l5l6p7p6L1L0L0L1j2j2p9p9j0j1j0
$$ plain form
2781 -70 -26 17 17 -63 -140 -135 -95 -137 -189 -241 -308 -294 -242 -271 -335 -319 -298 -277 -256 -235 -195 -236 -272 -308 -216 -125 -79 -33 -30 -108 -136 -163 -214 -183 -157 -132 -134
2768 -134 -136 -133 -130 -162 -113 -109 -105 -117 -130 -142 -154 -202 -250 -304 -276 -235 -195 -171 -228 -176 -123 -121 -119 -44 -51 -133 -216 -227 -238 -181 -125 -167 -210 -252 -294 -256 -218 -220 -223 -221
2753 -221 -219 -268 -236 -171 -188 -200 -130 -146 -162 -224 -204 -163 -203 -234 -264 -203 -143 -172 -201 -248 -215 -140 -147 -208 -270 -242 -214 -201 -189 -176 -164 -146 -127 -109 -91 -91
2740 -91 -91 -46 -82 -128 -174 -185 -196 -221 -246 -254 -182 -176 -251 -311 -235 -227 -218 -201 -184 -232 -279 -286 -292 -249 -206 -163 -119 -116 -112 -104 -176 -227 -277 -265 -253 -231 -209 -187 -165 -166 -168
2725 -168 -169 -171 -206 -242 -187 -133 -115 -179 -202 -144 -63 16 79 61 -17 -97 -86 -76 -146 -215 -289 -283 -224 -165 -123 -163 -132 -101 -119 -219 -236 -173 -110 -127 -189 -170
2712 -170 -88 -87 -128 -169 -265 -281 -243 -286 -324 -363 -240 -199 -288 -377 -372 -368 -297 -225 -168 -112 -168 -144 -74 -5 20 -35 -98 -161 -183 -286 -378 -471 -550 -493 -352
2700 -352 -211 -138 -145 -126 -106 -57 -142 -218 -294 -310 -327 -303 -278 -253 -229 -278 -327 -309 -291 -275 -259 -284 -309 -250 -192 -93 5 -15 -35 -55 -75 -25 24 34 44
2687 44 -29 -103 -136 -170 -110 -50 -85 -120 -123 -126 -128 -131 -130 -130 -129 -129 -141 -153 -165 -177 -167 -157 -80 -3 -38 -74 -151 -227 -196 -166 -136 -105 -117 -129 -208 -287 -297 -308 -318
2673c18j0j%%%j7j7N1N1P7P6j8j9k1k0k1k1l9m0KJP0P0P0P0J7J6n0n1J2J2N2q3o3J7N9N8j0
2659c8rrj0n9n9j9j8j3j3N5N5q0q1j2j3L1L1l6l6J5J5J0J0J55P4lkj7j6K4K4o3o2k1k2JJq8
2645b98q9k1N9J4J4j5j5N3N3K6K7P2rn5n6j5j4l3M8P0P1N0N0j3j2p9Jlln1n2n1n1J9K0Q7Q7
2632a14o7o6J%M0L9Q5Mj3j3j8j8j9j8n4n4J6R7j6j6J7J6k4k4m1m2N3N3k1k1k7k6N2l0k9N2
2619b46N5N6K1K0m4m4q9rl4l4J5R5J22M1q4q4m1m1k4N7N2k8k8N2O1k0l2l2k2O0N9k2n7n8N
2606c02NJ8J7k3k2N3N3J3J3J5J6J5J5qqj8O3O9j1L3L4N6k5m7m5j00j01LQ5M7M7J2j23q5lJ0
2593b29J0J6J6N6N6k1k0k1k1l8l9QPk3N8J7o4j1j0j6j6K8K8k3N9Q9Ql6l6mmNNj9J17N8j31
2579a41j25m4rr1k4N7OPQ7Q6l5l5n0n0J8J7N6N5J5J5KJN2k9j10k9M2M2ooooonL5L5o3o3j5
$$ plain form
2673 -318 -328 -329 -329 -329 -329 -346 -363 -312 -261 -184 -108 -126 -145 -166 -186 -207 -228 -267 -307 -305 -304 -234 -164 -94 -24 -7 9 -41 -92 -80 -68 -16 -99 -162 -145 -86 -28 -38
2659 -38 -47 -56 -66 -125 -184 -203 -221 -234 -247 -192 -137 -217 -298 -310 -323 -292 -261 -297 -333 -318 -303 -293 -283 -128 -54 -57 -59 -76 -92 -68 -44 -107 -169 -190 -212 -211 -210 -298
2645 -298 -387 -408 -349 -335 -321 -336 -351 -298 -245 -219 -192 -120 -129 -184 -240 -255 -269 -302 -254 -184 -113 -63 -13 -26 -38 -117 -116 -119 -122 -173 -225 -276 -327 -308 -288 -201 -114
2632 -114 -181 -247 -246 -246 -206 -167 -82 -78 -91 -104 -122 -140 -159 -177 -231 -285 -269 -172 -188 -204 -187 -171 -195 -219 -260 -302 -249 -196 -217 -238 -265 -291 -239 -269 -298 -246
2619 -246 -191 -135 -114 -94 -138 -182 -271 -280 -314 -348 -333 -238 -116 -75 -159 -243 -284 -325 -349 -292 -240 -268 -296 -244 -183 -203 -235 -267 -289 -229 -170 -192 -249 -307 -302
2606 -302 -297 -279 -262 -285 -307 -254 -201 -188 -175 -160 -144 -129 -114 -122 -130 -148 -85 -16 -27 6 40 96 71 24 -21 -121 -222 -219 -134 -87 -40 -28 -151 -236 -239 -229
2593 -229 -219 -203 -187 -131 -75 -96 -116 -137 -158 -196 -235 -227 -220 -243 -185 -168 -232 -243 -253 -269 -285 -257 -229 -252 -193 -104 -96 -132 -168 -172 -176 -171 -166 -185 -68 -10 -141
2579 -141 -266 -310 -319 -410 -434 -377 -371 -364 -277 -191 -226 -261 -311 -361 -343 -326 -270 -215 -200 -185 -183 -182 -130 -159 -269 -298 -256 -214 -220 -226 -232 -238 -244 -249 -214 -179 -242 -305 -320
2565c20O7J08J07J8J8mlp7p6l7j17p8MJ3J2J7J7R8R7n1n1l4l4P9kl2l1M9l1j8j8j7j8n6K5
2552c76M7M8J2J1n0n1L9J20L3L4K8K8l9l9%J%%n2n2J6J5K2K1O2O2n6n7L9L8n1n0J7J7rrj0
2539a91rJ2J3n5n5J2J2J2J2LLq7q7k2O0R9J9K5K6r7r6k6N6P7P8L2L2rrm5m5M9M9OOk9k9k1
2525b19O2K0K0j02k0P7P7M1l9q8q9N2N2O2j9o7J5L1L1K3K4l6l5j5J20J20j5m0m1r3j3O8O8
2513C2k9j10n2n2N9N9N5k7o7J4O3O1m8n0l7M4kjm7m6K1K1M8M8L1n0j8O4J2J2qpqqJJm0j75
2499b36j01k0P0P0R1Rr4r4M0M1%jm4m4P5pm1M1Q4Q5l6l7J5o7n8K3J3J2j3j3m9m9RR0Q0Q0M3
2486c3l9o1o1K2K1K2K2k9l0l0l0mnnnqpL3L3m7m6m6m7N8N7J17J17L1j03j13l3lmj2r4o9O5
2473c66P6nO0J42P7n7p2J0R5J5q1q0LMK8n4qqqqn8K2Q1%m4m5J8J7K8n3o8J3N7N7k6k6R6R6
$$ plain form
2565 -320 -253 -145 -38 -20 -2 -6 -9 -86 -162 -199 -316 -394 -390 -377 -365 -348 -331 -233 -136 -187 -238 -272 -306 -227 -229 -261 -292 -243 -274 -292 -310 -327 -345 -401 -376
2552 -376 -329 -281 -269 -258 -308 -359 -320 -200 -167 -133 -105 -77 -116 -155 -155 -154 -154 -154 -206 -258 -242 -227 -205 -184 -122 -60 -116 -173 -134 -96 -147 -197 -180 -163 -172 -181 -191
2539 -191 -200 -188 -175 -230 -285 -273 -261 -249 -237 -234 -231 -318 -405 -427 -367 -268 -249 -224 -198 -295 -391 -417 -361 -284 -206 -174 -142 -151 -160 -205 -250 -201 -152 -146 -140 -169 -198 -219
2525 -219 -157 -137 -117 -219 -239 -162 -85 -44 -83 -171 -260 -208 -156 -94 -113 -180 -165 -134 -103 -80 -56 -92 -127 -142 -22 98 83 43 2 -91 -104 -36 32
2513 32 3 -107 -159 -211 -152 -93 -38 -65 -132 -118 -55 6 -42 -92 -129 -85 -87 -88 -135 -181 -160 -139 -91 -43 -12 -62 -80 -16 -4 8 0 -7 -15 -23 -22 -21 -61 -236
2499 -236 -337 -357 -287 -217 -126 -117 -211 -305 -265 -224 -224 -225 -269 -313 -238 -245 -286 -245 -161 -76 -112 -149 -134 -201 -259 -236 -223 -211 -224 -237 -286 -335 -326 -236 -156 -76 -33
2486 -33 -72 -133 -194 -172 -151 -129 -107 -136 -166 -196 -226 -230 -235 -240 -245 -253 -260 -227 -194 -241 -287 -333 -380 -322 -265 -148 -31 0 -103 -216 -249 -252 -256 -268 -362 -431 -366
2473 -366 -290 -295 -235 -93 -16 -73 -145 -135 -40 -25 -106 -186 -183 -179 -151 -205 -213 -221 -229 -237 -295 -273 -192 -192 -236 -281 -263 -246 -218 -271 -339 -326 -269 -212 -238 -264 -168 -72
2459g2p4p3p9KJ7J7K2K1J20J18q3q3l9l9N6N6K7K7o8o7j5j6K6K5M5M4K8n4l3M8l8l8q1jK2
2446b32K2mnO4O3NNNNL6L6l4j16j49o8N7N7M5M5%%N2k8j00r9l1N0N0l1J3J3J7o3m5L7j5j4
2433c57l9m0N0N0Q7Nl5M6O6O7LMj7j7K3K3j6j6j7j6l9l8l8l9O4O3mmn1n1M4M4k7k7O4j7m1
2419b43M1N7N7n5n6r6r6J0J0N1N1n1n2J6J7N3N3j4j4m2m3K5K5j7j7j7j7M4M5M5M4K7K7K7K7
2406g8L0L0r1r2J3J2Q0Q0p0p0l0k9POM8M7m3m3m3m4M0L9M0M0J8J9n0m9j7j7k2k2M7l5k2J39
2393a32J12n0p1p1k8k9L8L9J3J4n4n5j1j1Q3Q3K5K5j5j6k1k1k1k1R0R1n9n8l4l4l3l4p0p0
2381d06N1N2RJ0P8P7l5l6NNllm3m3K3K3m5m5l4l4POooL4L5L3L4L4L3m5m6m6m5J7J8N8N8m4
2367b65m4N1N0k6k7o7o8M6M6M6M6M1M2M1M1k5k6k5k6ppm8m7Q8Q8l3l4p0p0N1N1K6K6o8o9J0
$$ plain form
2459 -72 -146 -219 -298 -296 -279 -262 -240 -219 -99 19 -64 -147 -186 -225 -169 -113 -86 -59 -127 -194 -209 -225 -199 -174 -129 -85 -57 -111 -144 -96 -134 -172 -253 -254 -232
2446 -232 -210 -214 -219 -155 -92 -87 -82 -77 -72 -36 0 -34 -150 -299 -367 -310 -253 -208 -163 -163 -163 -111 -139 -239 -338 -369 -319 -269 -300 -287 -274 -257 -320 -365 -328 -343 -357
2433 -357 -396 -436 -386 -336 -249 -244 -279 -233 -167 -100 -97 -93 -110 -127 -104 -81 -97 -113 -130 -146 -185 -223 -261 -300 -236 -173 -177 -181 -232 -283 -239 -195 -222 -249 -185 -202 -243
2419 -243 -202 -145 -88 -143 -199 -295 -391 -381 -371 -320 -269 -320 -372 -356 -339 -286 -233 -247 -261 -303 -346 -321 -296 -313 -330 -347 -364 -320 -275 -230 -186 -159 -132 -105 -78
2406 -78 -48 -18 -109 -201 -188 -176 -96 -16 -86 -156 -186 -215 -208 -202 -154 -107 -150 -193 -236 -280 -240 -201 -161 -121 -103 -84 -134 -183 -200 -217 -239 -261 -214 -249 -271 -132
2393 -132 -20 -70 -141 -212 -240 -269 -231 -192 -179 -165 -219 -274 -285 -296 -213 -130 -105 -80 -95 -111 -132 -153 -174 -195 -105 -14 -73 -131 -165 -199 -232 -266 -336 -406
2381 -406 -355 -303 -294 -284 -206 -129 -164 -200 -195 -190 -193 -196 -239 -282 -259 -236 -281 -326 -360 -394 -387 -381 -387 -393 -359 -324 -291 -257 -223 -190 -235 -281 -327 -372 -355 -337 -279 -221 -265
2367 -265 -309 -258 -208 -234 -261 -328 -396 -350 -304 -258 -212 -171 -129 -88 -47 -72 -98 -123 -149 -156 -163 -211 -258 -170 -82 -115 -149 -219 -289 -238 -187 -161 -135 -203 -272 -262
2354b62J1l0l1M2M2Q2Q2ppppJ7J6n1n0J2J2J2J2O1O1l3l3p3p2p3p2j7j7K4K4L5L6L5L6O2O2
2340f6q7q7m2m1K5K6m9m9J8J8P8P8P8P8J9J8j02j03kjkjL5L4nol6l6L2L1L5L5o0n9m7m7P5
2327b15P5MMl2l1p4QL0K9oojjk0O0O6j5m4L8j3j3N5N5N9k0j01j02q4lk1k2K0J9J17L5j3j4
2313a77l4l4l4l4J03J03L0L0kq3l8l8k4k5K0J01J5o6j5j5ON%%Qp3J2J3P6P5N3k7l1l1l5l6
2300b02K2K3l7l6j21J4O0O0qrqrM6M5k2k3l2l2M0M0l7M4LMj03k1J09k6j03k3l5l6L6L7L1L1
2287b78j7r8rP3M7l4J7J6P5P5J2J2p6Om1m0N4N4QRK8n2ppk6k6J4J4j6j7K3K4j5j4m7m7j4J21
2273a99R1J0L4L4j2j2K5K4p0p0l4l3p5p4PPM7M7k1k2J9J9M7M7M6M7j1j0n1n2k8k8L9L9L0L0
2260a13j0r1j28QJ29J29l2l2l3l2RQn9o0k4k4k4k5R4R3k9k8j4j3K7K7P5P4P4P4k4k4k3k4k9
$$ plain form
2354 -262 -251 -281 -312 -270 -228 -146 -64 -71 -78 -85 -92 -75 -59 -110 -160 -148 -136 -124 -112 -51 10 -23 -56 -129 -201 -274 -346 -363 -380 -356 -332 -297 -261 -226 -190 -128 -66
2340 -66 -153 -240 -282 -323 -298 -272 -321 -370 -352 -334 -256 -178 -100 -22 -3 15 -87 -190 -192 -193 -195 -196 -161 -127 -132 -138 -174 -210 -178 -147 -112 -77 -137 -196 -243 -290 -215
2327 -215 -140 -136 -132 -164 -195 -269 -261 -231 -202 -208 -214 -215 -216 -236 -176 -110 -125 -169 -131 -144 -157 -102 -47 12 -8 -109 -211 -295 -298 -319 -341 -321 -302 -185 -150 -163 -177
2313 -177 -211 -245 -279 -313 -210 -107 -77 -47 -49 -132 -170 -208 -232 -257 -237 -136 -121 -187 -202 -217 -211 -206 -206 -206 -198 -271 -259 -246 -170 -95 -42 -69 -100 -131 -166 -202
2300 -202 -180 -157 -194 -230 -351 -337 -277 -217 -225 -234 -242 -251 -205 -160 -182 -205 -237 -269 -229 -189 -226 -182 -179 -175 -278 -299 -190 -216 -319 -342 -377 -413 -377 -340 -309 -278
2287 -278 -295 -393 -402 -329 -282 -316 -299 -283 -208 -133 -121 -109 -185 -179 -220 -260 -206 -152 -144 -135 -107 -159 -166 -173 -199 -225 -211 -197 -213 -230 -207 -183 -198 -212 -259 -306 -320 -199
2273 -199 -108 -98 -64 -30 -42 -54 -29 -5 -75 -145 -179 -212 -287 -361 -354 -347 -300 -253 -274 -296 -277 -258 -211 -164 -118 -71 -82 -92 -143 -195 -223 -251 -212 -173 -143 -113
2260 -113 -123 -214 -342 -334 -205 -76 -108 -140 -173 -205 -196 -188 -247 -307 -331 -355 -379 -404 -310 -217 -246 -274 -288 -301 -274 -247 -172 -98 -24 50 26 2 -21 -45 -74
2248g4l0l0k9P2P2k2k3m6m7opR4R2K6K6OOl5l5m5m6P5P5n3n2q9q8LQ3P4o2k2k3RJ0O8O7q0
2234h6q1k2k1J8J9J01J00L4L4kkQ4Lm2m3j09j10j2O8K3K3nom5m6poppm7m7N3N3j4O8Q6m9j10
2220a59K6Q1%j11j11k2k1k6k6k7k6O6O6M9l2n4K6J6J7J6J6Q4Q4m8m9pqn7n7J1J1J5J6p6NQ1
2207b31%NNM1m0nP6M4l8J3J3jjm1m2m9m9M6M6OON0J31P4oj03j04l4l4N5N5J8o3n8P8N3k7o8
2193a79o8L7L7q5q4L7L7l1l0R1R1J5o6k4k5L8L8P0P0LKJ1J1n7n6P8P8j7j6n1n2q4q4k7J09
2180a83J00R9m2m2j05j05k7N5N5k7K2K2n1n1Q2Q1Op5o4o5N3N2M2M3JKP3P2m7m9m2m2JQ3J6
2168e7o4q0JlkK8K8m1M0O1O2JKM0M2j3j4j02j03l4M6O9O9j3j4l3l4j5j4n5n6nnNp7qP4N8N8
2154a58Qp2p3RK3K3j3j2j6j5K5K6L7L7L7L7k1k2k1k1L8L9J8J8m1m1K2K2K5n5r6j5J0J1J5J6
$$ plain form
2248 -74 -104 -134 -163 -91 -19 -41 -64 -110 -157 -163 -170 -76 16 42 68 74 80 45 10 -35 -81 -6 69 16 -36 -125 -213 -210 -127 -53 -115 -137 -160 -151 -141 -73 -6 -86
2234 -86 -167 -189 -210 -192 -173 -72 28 62 96 94 92 176 179 137 94 -15 -125 -137 -69 -46 -23 -28 -34 -79 -125 -132 -138 -145 -152 -199 -246 -193 -140 -154 -86 0 -49 -159
2220 -159 -133 -52 -52 -163 -274 -296 -317 -343 -369 -396 -422 -356 -290 -241 -273 -327 -301 -285 -268 -252 -236 -152 -68 -116 -165 -172 -180 -237 -294 -283 -272 -257 -241 -317 -312 -231
2207 -231 -231 -226 -221 -180 -220 -225 -149 -105 -143 -130 -117 -118 -119 -160 -202 -251 -300 -254 -208 -202 -196 -146 -15 59 53 -50 -154 -188 -222 -167 -112 -94 -157 -215 -137 -84 -111 -179
2193 -179 -247 -210 -173 -258 -342 -305 -268 -299 -329 -238 -147 -132 -198 -222 -247 -209 -171 -101 -31 -28 -26 -15 -4 -61 -117 -39 39 22 6 -45 -97 -181 -265 -292 -183
2180 -183 -83 16 -26 -68 -173 -278 -305 -250 -195 -222 -200 -178 -229 -280 -198 -117 -111 -186 -250 -315 -262 -210 -168 -125 -124 -122 -49 23 -24 -73 -115 -157 -156 -73 -57
2168 -57 -121 -201 -200 -203 -205 -177 -149 -190 -150 -89 -27 -26 -24 16 58 45 31 -71 -174 -208 -162 -93 -24 -37 -51 -84 -118 -133 -147 -202 -258 -263 -268 -263 -340 -348 -274 -216 -158
2154 -158 -150 -222 -295 -286 -263 -240 -253 -265 -281 -296 -271 -245 -208 -171 -134 -97 -118 -140 -161 -182 -144 -105 -87 -69 -110 -151 -129 -107 -82 -137 -233 -248 -238 -227 -212 -196
2140a96k6k6M1M1Q8Q6O2O2qr0j51p1n4K8J00J9nmn0n0n4n3qqO6J47J45O6n5n4KKj9j01j01
2128b29j9M9N0j3j3k7k7m7m7m8m8K4J04O5j6n1K9N5N5j1r2k1N9K9L0O5O5n7n7J9J8k3k2j14
2115b66j15k0j9n6n5J66J66P0o6l0l0JJJJm2m3ppK7n3L2L3L2L2rrL9L9OPj10K5R3R3L7m4J
2102g9Kj5j4j5j4O2O3o4o4J9o2q3kJ%l5l5M4M3J30M9j9j8k3k3M1M2JJo5o6m5m5O6O7O6O7o1
2088h3o1O1O1m3m3q4q4L0K9j1j1N9N9rqn0n0n0n0R1R1mlm8m8M7M7j3j4j3j3J6J6J6J6l8l8
2074b30l9l8L3L3P3P3K1K2m7m6j1j1N7N7j7j6q4q4L8L7llm3m3N2N2o9o9K6K6L8L8J7J8l5l5
2061b12j5j5ook6k7lmlmK7K6K7K6K3K3M3M3r7r7K5K5M2M2L7L7N1k9o0P5k9k9m1m0k3k2J8J8
2047a80NNj4j5kjkjPQPQK1K1K2K1L9L9kjLLM8l3JJn0n0J2o9o4o4K2K2m1m0m6L6L1L1J05J05
$$ plain form
2140 -196 -222 -248 -207 -166 -78 8 70 132 124 34 -117 -188 -242 -214 -114 -95 -100 -104 -154 -204 -258 -311 -319 -327 -261 -114 31 97 42 -12 -10 -8 -27 -128 -229
2128 -229 -248 -199 -149 -162 -175 -202 -229 -276 -323 -371 -419 -395 -291 -226 -242 -293 -264 -209 -154 -165 -257 -278 -219 -190 -160 -95 -30 -87 -144 -125 -107 -130 -152 -266
2115 -266 -381 -401 -420 -476 -531 -365 -199 -129 -195 -225 -255 -254 -253 -252 -251 -293 -336 -343 -350 -323 -376 -344 -311 -279 -247 -256 -265 -226 -187 -181 -174 -284 -259 -166 -73 -36 -80 -79
2102 -79 -77 -92 -106 -121 -135 -73 -10 -74 -138 -119 -181 -264 -266 -265 -265 -300 -335 -291 -248 -118 -69 -88 -106 -129 -152 -111 -69 -68 -67 -132 -198 -243 -288 -222 -155 -89 -22 -83
2088 -83 -144 -83 -22 -65 -108 -192 -276 -246 -217 -228 -239 -180 -121 -130 -138 -188 -238 -288 -338 -247 -156 -160 -163 -211 -259 -212 -165 -178 -192 -205 -218 -202 -186 -170 -154 -192 -230
2074 -230 -269 -307 -274 -241 -168 -95 -74 -52 -99 -145 -156 -167 -110 -53 -70 -86 -170 -254 -216 -179 -182 -185 -228 -271 -219 -167 -236 -305 -279 -253 -215 -177 -160 -142 -177 -212
2061 -212 -227 -242 -248 -254 -280 -307 -310 -314 -317 -321 -294 -268 -241 -215 -192 -169 -126 -83 -180 -277 -252 -227 -185 -143 -106 -69 -18 -47 -107 -32 -61 -90 -131 -171 -194 -216 -198 -180
2047 -180 -175 -170 -184 -199 -201 -202 -204 -205 -198 -190 -183 -175 -154 -133 -111 -90 -51 -12 -14 -15 -12 -9 39 6 7 8 -42 -92 -80 -149 -213 -277 -255 -233 -274 -314 -360 -324 -293 -262 -157 -52
2032e2L4m7j03k1P2P1N7k2j8j8n8n8l7M5K5K5j1j1o5o6L0K9J3J3J3J3n1n1j1j0m7m7q8M8J48
2019b56O6p3PJ27J27Np3q6nnq6l1N1M6l6k8k7PQLMQ9Rk6k6J0J0k9k9p0p0K4K4O5O5j3j2pp
2005b48o2K0J14L3o9o9p9KP5P6J3J2kkL8L8J1J0l0l0Q0P9L9M0j38j39p2p1N0N0J0J0N7N6l8
1993a36l8Q7Q6o2o3J2J2J2J2J7J7n1n0l5l5l4l5n3n3n3n4J8J8N8N8Q6Q6J9J8j7j7M9J28R7
1980A04o5l6l6k1k2k1k1j8j8j8j8j2j2K8K9k7k6M1M1M8M7k0k0j5j5j5j5j4j5j5j5m5m5mnJ4
1967b77J5N5N5l6l7NMk7k8J4J3N9N9l6l6%jM0M0n1n0J7J7K9L0K9K9k8k8k8k9j8j9K1K2m8m7
1954b71ppK5K5k1O1M5M5k6j08j7j7LLj1P1K4K5NMNMqqqqo8o8%%M1M1%%QQj2j3o0o1O1O1K2
1938b12K1M2M2j7j6j02j03r6L8L0L0O6O7J5R7N4k7m4m5k3k3n4K7P2qn3n2O7O8%Jk8k7J4J3
$$ plain form
2032 -52 -18 -65 -168 -189 -117 -46 11 -11 -29 -47 -105 -163 -200 -155 -130 -105 -116 -127 -192 -258 -228 -199 -186 -173 -160 -147 -198 -249 -260 -270 -317 -364 -452 -404 -256
2019 -256 -190 -263 -256 -129 -2 3 -70 -156 -161 -166 -252 -283 -232 -186 -222 -250 -277 -270 -262 -259 -255 -166 -157 -183 -209 -199 -189 -218 -247 -317 -387 -363 -339 -274 -209 -222 -234 -241 -248
2005 -248 -310 -290 -176 -143 -212 -281 -360 -358 -283 -207 -194 -182 -184 -186 -148 -110 -99 -89 -119 -149 -69 10 49 89 -49 -188 -260 -331 -281 -231 -221 -211 -154 -98 -136
1993 -136 -174 -87 -1 -63 -126 -114 -102 -90 -78 -61 -44 -95 -145 -180 -215 -249 -284 -337 -390 -443 -497 -479 -461 -403 -345 -259 -173 -154 -136 -153 -170 -121 7 104
1980 104 39 3 -33 -54 -76 -97 -118 -136 -154 -172 -190 -202 -214 -186 -157 -184 -210 -169 -128 -80 -33 -53 -73 -88 -103 -118 -133 -147 -162 -177 -192 -237 -282 -286 -291 -277
1967 -277 -262 -207 -152 -188 -225 -220 -216 -243 -271 -257 -244 -185 -126 -162 -198 -198 -199 -159 -119 -170 -220 -203 -186 -157 -127 -98 -69 -97 -125 -153 -182 -200 -219 -198 -176 -224 -271
1954 -271 -278 -285 -260 -235 -256 -195 -150 -105 -131 -239 -256 -273 -270 -267 -278 -207 -183 -158 -153 -149 -144 -140 -148 -156 -164 -172 -240 -308 -308 -308 -267 -226 -226 -226 -218 -210 -222 -235 -295 -356 -295 -234 -212
1938 -212 -191 -149 -107 -124 -140 -242 -345 -441 -403 -373 -343 -277 -210 -195 -98 -44 -71 -115 -160 -183 -206 -260 -233 -161 -169 -222 -274 -207 -139 -139 -138 -166 -193 -179 -166
1925a66J6J6n1L1NNM6M6kq4j05j05k2k3o3o3QQP9J60J01J9k1N9L0n2j15l3N8N8qq9kQ0QQp
1912a70qJ3J3m0m0N4N4n6n6j0j0k7N4M8M9mnm5m5K6K6O7O6lmm4m4L2L2l6l6jkL9L9m1m0K7
1898a28K7l2l2RRj25j24l0l0K3K3O3O4J6J7mmj3j3K7K7j1j2n2n1M7M7M8M7NNj6j5m1m0N4N4
1885a61l9l8JKkkJ8J9L4L5l3l2L1L2rqLLj8j7j4j5l5l5k2k2jkklO5O6j1j0n1n1MLM5M4j02
1870c30j03J9K0N0N1J0J1M1M1K1K0p5p5J9J9l2l2L6L6m7m8K1K0K8K9K8K8j0j0n1n0j9j9M8
1857c05M8qqL2L2l3l4Q3Q3L3m8m4m3m6m6N3N3j5O6M1M1n0m9m5m4m8L4N8k2m8L2R9l7k3k4j1
1844b43j2l6l5L1J13J63K7l9m0n8n8j7j7K4K4K4K3N2N2j6j6l4l3L4L4j4j4K6K6o7o7o7o6m5
1832c41m4P8P7M7M8OPnnL0L0L4m7m3m2L7L8J7J7J2J1j32j32m9L3K8K8O4O5n8n7n9o0q5lM8
$$ plain form
1925 -166 -150 -134 -185 -154 -149 -144 -98 -52 -54 -138 -243 -348 -370 -393 -456 -519 -511 -503 -424 -264 -163 -144 -165 -106 -76 -128 -243 -276 -218 -160 -168 -257 -259 -179 -171 -163 -170
1912 -170 -178 -165 -152 -192 -232 -178 -124 -180 -236 -246 -256 -283 -229 -181 -132 -136 -141 -186 -231 -205 -179 -112 -46 -49 -53 -97 -141 -109 -77 -113 -149 -150 -152 -113 -74 -115 -155 -128
1898 -128 -101 -133 -165 -156 -147 -272 -396 -426 -456 -433 -410 -347 -283 -267 -250 -254 -258 -271 -284 -257 -230 -241 -253 -305 -356 -309 -262 -214 -167 -162 -157 -173 -188 -229 -269 -215 -161
1885 -161 -200 -238 -237 -235 -237 -239 -221 -202 -168 -133 -166 -198 -167 -135 -144 -152 -149 -146 -164 -181 -195 -210 -245 -280 -302 -324 -325 -327 -329 -332 -267 -201 -212 -222 -273 -324 -320 -317 -272 -228 -330
1870 -330 -433 -414 -394 -344 -293 -283 -272 -231 -190 -169 -149 -224 -299 -280 -261 -293 -325 -289 -253 -300 -348 -327 -307 -279 -250 -222 -194 -204 -214 -265 -315 -334 -353 -305
1857 -305 -257 -265 -273 -241 -209 -242 -276 -193 -110 -77 -125 -169 -212 -258 -304 -251 -198 -213 -147 -106 -65 -115 -164 -209 -253 -301 -267 -209 -231 -279 -247 -148 -185 -208 -232 -243
1844 -243 -255 -291 -326 -295 -182 -19 8 -31 -71 -129 -187 -204 -221 -197 -173 -149 -126 -74 -22 -38 -54 -88 -121 -87 -53 -67 -81 -55 -29 -96 -163 -230 -296 -341
1832 -341 -385 -307 -230 -183 -135 -129 -122 -127 -132 -102 -72 -38 -85 -128 -170 -133 -95 -78 -61 -49 -38 -170 -302 -351 -318 -290 -262 -198 -133 -191 -248 -307 -367 -452 -455 -407
1819d07M8J3J2j5j6K8J10J04K3k5j05m5L6K6K6PQj3j2o9o9K6K6PQPPk3k4J1J2N0l2n3n3PQ
1805c51l4l3J32J31N5k6j3j4j8j8n1n1M4M4KKj1O9K5j10j26J0M0L9M9M8r1r1N7N8Q8Q7l3l4
1793a25k2k2jkp1p1KJn0L1R8J8k6k5l1l1j5j6N2N2rrm0M2R7J7O2O2L6m3JKm4m4o1P4M3r1j09
1779b68K6P7nQRM3M4K1n9m6m5j0j0P4P5L0n1n4K6m4m4K2K2p3p2J5J5NQ6O5j5j05j05n5Q1M5
1766b72M5O2O3O3O1k5k7M1M1N8N8l7j18r4M0m1m1j8j7j8j7j00j00K2K2O5O5n7n7p7p7J8J7
1754d52N6N7J6J6kjR4R4N4N5j3j3o6o6k5k6N9N9qrj5j6q4q3K2K3K2K2R4R4jjN5N6j19j20o0
1740b32o0j9j9P4P3L3L3n5n5M0L9p9q0M2M2J5J4J5J4j4j4Q0Q1J6J6J6J6l7l8KKo7o6K8K9L1
1727h4L0rj0l7l7l7l7PPPPl5l5NNK0K0K4K5PQ8M2M1J9J9j23j24n8K3k3k3k9l0k4k4K8J10K3
$$ plain form
1819 -407 -359 -346 -334 -349 -365 -337 -227 -123 -100 -125 -230 -275 -239 -213 -187 -180 -172 -185 -197 -266 -335 -309 -283 -276 -268 -261 -254 -277 -301 -290 -278 -228 -260 -313 -366 -359 -351
1805 -351 -385 -418 -286 -155 -100 -126 -139 -153 -171 -189 -240 -291 -247 -203 -201 -199 -210 -141 -116 -226 -352 -342 -302 -263 -214 -166 -257 -348 -291 -233 -145 -58 -91 -125
1793 -125 -147 -169 -170 -172 -243 -314 -312 -311 -361 -330 -232 -214 -240 -265 -296 -327 -342 -358 -306 -254 -263 -272 -312 -270 -173 -156 -94 -32 4 -39 -38 -36 -80 -124 -185 -111 -68 -159 -268
1779 -268 -242 -165 -170 -162 -153 -110 -66 -45 -104 -150 -195 -205 -215 -141 -66 -36 -87 -141 -115 -159 -203 -181 -159 -232 -304 -289 -274 -269 -183 -118 -133 -238 -343 -398 -317 -272
1766 -272 -227 -165 -102 -39 22 -3 -30 11 52 110 168 131 13 -81 -41 -82 -123 -141 -158 -176 -193 -293 -393 -371 -349 -284 -219 -276 -333 -410 -487 -469 -452
1754 -452 -396 -339 -323 -307 -309 -310 -216 -122 -68 -13 -26 -39 -105 -171 -196 -222 -163 -104 -112 -121 -136 -152 -236 -319 -297 -274 -252 -230 -136 -42 -43 -44 11 67 -52 -172 -232
1740 -232 -292 -311 -330 -256 -183 -150 -117 -172 -227 -187 -148 -227 -307 -265 -223 -208 -194 -179 -165 -179 -193 -113 -32 -16 0 16 32 -5 -43 -41 -39 -106 -172 -144 -115 -84
1727 -84 -54 -63 -73 -110 -147 -184 -221 -214 -207 -200 -193 -228 -263 -258 -253 -233 -213 -189 -164 -157 -69 -27 14 33 52 -71 -195 -253 -230 -253 -276 -305 -335 -359 -383 -355 -245 -222
1714b22K4j1j1K9L0KLl3l3o7J3J9o2p9LO9O8Q2%M6M6on%%p1J0N1l1n2n3J4R4L9m2QRk6k7l1
1699b03l1N7k4p3p2N5N6J01K0k9k9L4L4nmmnjjm6m7qq9l9l8L0J12O2O1L1n0r0rP0O9PPKLl8
1684a24l8q8q8L4L4L1L1K6K6K6n5j44o4k8N3J3J2N2N1J27po2o2lkjjm2m1M1M2M1M2k7k7M1
1671a81M0J7J7N7N6j05j06j1j1N2N2N2N3q1q0j3j3R5R6n4n3l9l9KJK2K3K2K2o7o7N4N5J6J6
1659a00J6J6j05j05J7J7l3l3L5L5L7L7lmJ6J5J5J5L7L6L6L6m7m9m8m8p7p7J7J8R2R3kjj7j6
1646a29j6j6PQl3l2M2M2k5k5N2N2J2J1l9l9KJj00j00P6P5M0L9jjnonoL0K9o6o5p1p2N1N0K7
1631b06K6j4j4PQl4l3opL4L5N6N7o6o5j5j5j6j5M2M2k5k6K8K8j3r4j65l0O4O4j2j1N6N5R6
1618a84R5%Jp2p1lmj7j6j7j6N1N1m3m4L8L9L8L8l4l5OORRRRj2j2L0K9j3j3j2j3k6k6O9O8l9
$$ plain form
1714 -222 -198 -209 -220 -191 -161 -159 -156 -189 -222 -289 -276 -257 -319 -398 -395 -326 -258 -176 -176 -130 -84 -90 -95 -95 -95 -166 -156 -105 -136 -188 -241 -227 -133 -94 -136 -128 -119 -145 -172 -203
1699 -203 -234 -177 -201 -274 -346 -291 -235 -134 -114 -143 -172 -138 -104 -109 -113 -117 -122 -123 -124 -170 -217 -225 -314 -353 -391 -361 -249 -187 -126 -95 -145 -235 -244 -174 -105 -98 -91 -89 -86 -124
1684 -124 -162 -250 -338 -304 -270 -239 -208 -182 -156 -130 -185 -329 -393 -421 -368 -355 -343 -291 -240 -113 -120 -182 -244 -247 -249 -250 -251 -293 -334 -293 -251 -210 -168 -195 -222 -181
1671 -181 -141 -124 -107 -50 6 -99 -205 -216 -227 -175 -123 -71 -18 -99 -179 -192 -205 -110 -14 -68 -121 -160 -199 -197 -196 -174 -151 -129 -107 -174 -241 -187 -132 -116 -100
1659 -100 -84 -68 -173 -278 -261 -244 -277 -310 -275 -240 -203 -166 -169 -173 -157 -142 -127 -112 -75 -39 -3 33 -14 -63 -111 -159 -236 -313 -296 -278 -186 -93 -95 -96 -113 -129
1646 -129 -145 -161 -154 -146 -179 -211 -169 -127 -152 -177 -125 -73 -61 -50 -89 -128 -126 -125 -225 -325 -249 -174 -134 -95 -96 -97 -102 -108 -113 -119 -89 -60 -126 -191 -262 -334 -283 -233 -206
1631 -206 -180 -194 -208 -201 -193 -227 -260 -266 -273 -239 -204 -148 -91 -157 -222 -237 -252 -268 -283 -241 -199 -224 -250 -222 -194 -207 -301 -466 -496 -432 -368 -380 -391 -335 -280 -184
1618 -184 -89 -89 -88 -160 -231 -234 -238 -255 -271 -288 -304 -253 -202 -245 -289 -251 -212 -174 -136 -170 -205 -199 -193 -184 -175 -166 -157 -169 -181 -151 -122 -135 -148 -160 -173 -199 -225 -156 -88 -127
1604a27m0l9m0J5J6k5k6J6J6N7N6JJM1M2N6N8o4o4k3k4o4o4q1q2j3j4P8P7L7L7J8J7k3k3k0
1591b17k0k0k0lmmmL1L1L1L1QRl2l3M9M8M8M8l1l1l1l1J1J0J1J0p6p7rrj3j3P1P1N1j11j33
1577c53n2L5L5M0M0p4p5M8M7N2N2p0p0J22J22K7K8nmnmm2m1m2m1J3J3N4N4mmmnJ6J5J5J6p
1563e8opoo6o5K9K9ONq9q9L1L1rj0n1n1P0P0M8M7M8M7o8o8%%O0O1o1o1k2k1k2k1J9J9m9m8
1549c28ooool5l5Q6Q6L8L9k8j09p7Q5K9K9l0l0l0l0J2J2J2J2j2j2K9K8KLM1J22J44j7j16M6
1536e8P9q1k7k6Qp3k8k7nnrj0Q0jM5M5n1n1J6J6J4J4k6k6NOm0M2MNJ0J0m0l9JKQ8Q8M6M8o3
1521a4o3o3o3j5j6k0O1J5J5k5k6qq9q8qP1P2J52J8n4n4o7J4R8R7L0L0k1j02r6L8N0l1p1p2
1508c05k7k8M0M0M6M6K9n2k1O0N5k6o6o7p1p2j5j4J04K2KQ2P3P2l2l3QQJ5J5N5N6p9p8J6J6
$$ plain form
1604 -127 -167 -206 -246 -231 -215 -240 -266 -250 -234 -177 -121 -120 -119 -78 -36 20 78 14 -50 -73 -97 -161 -225 -306 -388 -401 -415 -337 -260 -223 -186 -168 -151 -174 -197 -217
1591 -217 -237 -257 -277 -280 -284 -288 -292 -261 -230 -199 -168 -160 -151 -183 -216 -167 -119 -71 -23 -54 -85 -116 -147 -136 -126 -115 -105 -181 -258 -267 -276 -289 -302 -231 -160 -109 -220 -353
1577 -353 -405 -370 -335 -295 -255 -329 -404 -356 -309 -257 -205 -275 -345 -223 -101 -74 -46 -51 -55 -60 -64 -106 -147 -189 -230 -217 -204 -150 -96 -100 -104 -108 -113 -97 -82 -67 -51 -58
1563 -58 -64 -71 -77 -143 -208 -179 -150 -144 -139 -228 -317 -286 -255 -264 -274 -325 -376 -306 -236 -188 -141 -93 -46 -114 -182 -182 -182 -122 -61 -122 -183 -205 -226 -248 -269 -250 -231 -280 -328
1549 -328 -334 -340 -346 -352 -387 -422 -336 -250 -212 -173 -201 -310 -387 -302 -273 -244 -274 -304 -334 -364 -352 -340 -328 -316 -328 -340 -311 -283 -281 -278 -237 -115 29 12 -104 -58
1536 -58 21 -60 -87 -113 -105 -178 -206 -233 -238 -243 -252 -262 -182 -183 -138 -93 -144 -195 -179 -163 -149 -135 -161 -187 -182 -176 -216 -174 -170 -165 -155 -145 -185 -224 -223 -221 -133 -45 1 49 -14
1521 -14 -77 -140 -203 -218 -234 -254 -193 -178 -163 -188 -214 -222 -311 -399 -407 -336 -264 -112 -94 -148 -202 -269 -255 -157 -60 -30 0 -21 -123 -219 -181 -131 -162 -233 -305
1508 -305 -332 -360 -320 -280 -234 -188 -159 -211 -232 -172 -117 -143 -209 -276 -347 -419 -434 -448 -344 -322 -320 -238 -165 -93 -125 -158 -150 -142 -127 -112 -57 -1 -80 -158 -142 -126
1495a26k0k1K1K0k1k1k1k1K6K5j5j5L6L5%%lP8J48J4p1o9l8l8m3m2m8m7k8j09L6L6O5J46J17
1482a4p2o4J6J0p2l6M4L4L5J3J4Lj32q2N2R0m6j10k8j5O6J04l1r0rK6K7L2L2M6M6k1k1p3p3
1470b99k3N7ooj1P0R4J3N8N7n6j39r8j7O1O1L0L1o6J5L2L2P6mj57k2J4J4j8j8j4j3n0m9m5
1457c96L5N2N2J01K0kkPOq8q8j3j3K7K8O8O8lq4p0J0N5N4O8O7n4n5J0J0J0J1j04j03K4K4j2
1444b80O9K4K4P2P2J12J12kjr7r6m6m7m6m7kkK0J00L4L2n6n6m1m1m1m2j6j5Q3Q4NQ5Q5Ml0
1431A3k9NNn7n6j6j7K8K8K8K8p0o9p0o9M9M9N4k7K7K8m0l9K7J09N8N8L4m7n0K8k8j09n5n4
1418b46NQ6j%KKl0l0jJ33R2R3J1p0p4OM4l6n3n3j1j1j0j1O4O4J8j17j0j1K7n4o9o8J02J03
1405a14J1J1n6n7J0RMNN8k2r1rOOJ6J6LQ4n2n1k2O0J4J4k3k4K8n4n7K3J13L2n0n1j6j5QPL
$$ plain form
1495 -126 -146 -167 -146 -126 -147 -168 -189 -210 -184 -159 -174 -189 -153 -118 -118 -118 -121 -43 105 119 48 -21 -59 -97 -140 -182 -230 -277 -305 -414 -378 -342 -277 -131 -14
1482 -14 -86 -150 -134 -124 -196 -232 -188 -154 -119 -106 -92 -89 -221 -303 -251 -161 -207 -317 -345 -360 -294 -190 -221 -311 -320 -294 -267 -235 -203 -157 -111 -132 -153 -226 -299
1470 -299 -322 -265 -271 -277 -288 -218 -124 -111 -53 4 -52 -191 -289 -306 -245 -184 -154 -123 -189 -174 -142 -110 -34 -38 -195 -217 -203 -189 -207 -225 -239 -252 -302 -351 -396
1457 -396 -361 -309 -257 -156 -136 -138 -140 -133 -127 -215 -303 -316 -329 -302 -274 -206 -138 -141 -225 -295 -285 -230 -176 -108 -41 -95 -150 -140 -130 -120 -109 -213 -316 -292 -268 -280
1444 -280 -211 -187 -163 -91 -19 93 205 203 202 105 9 -37 -84 -130 -177 -179 -181 -161 -61 -27 5 -51 -107 -148 -189 -230 -272 -288 -303 -220 -136 -131 -46 39 43 13
1431 13 -16 -11 -6 -63 -119 -135 -152 -124 -96 -68 -40 -110 -179 -249 -318 -269 -220 -166 -193 -166 -138 -178 -217 -190 -81 -23 35 69 22 -28 0 -28 -137 -192 -246
1418 -246 -241 -155 -156 -156 -154 -152 -182 -212 -213 -80 12 105 116 46 -28 -22 22 -14 -67 -120 -131 -142 -152 -163 -99 -35 -17 -134 -144 -155 -128 -182 -251 -319 -217 -114
1405 -114 -103 -92 -148 -205 -195 -186 -182 -177 -119 -141 -232 -241 -235 -229 -213 -197 -194 -110 -162 -213 -235 -175 -161 -147 -170 -194 -166 -220 -277 -254 -141 -109 -159 -210 -226 -241 -233 -226 -223
1391b23KNp6L2L2P7nq0q1n6n6J1J2M6M6N1N1o2J9O0k2l0l0l4l5j8j8R5J4k8k8k8k8k1O1N6
1378b89q0l8M3N6N6l1l1j5O7J7o3m9m8mP8P2P3J6J6k9N2N6N7onj8j7j8j7M6M6m4m4k2N8k3
1365h2k3o4J7J1J2m4m5m4m5P0O9N3k9j62q1j0j0m9n0K1J02M4l7J4J4o3o2N9N9ppqpl0l0l0
1352d74l0N7N7N8N7j5j6Q0P9L3L2qqMMl7l7m3m3K5K4j7j8n8n8K6K7r0r0qP3K8K7K6K5L9J20
1338a49J14k1l0k9n9K2J17L5m1m2q7q8OOJ00J00j5j5j6j5m3m3K4K4L5L4l3l3j%%%JKJKL0L1
1324g6l7l7n5n5n6n5N9O0l6l5%jL5L5O6j5n8n9n1L0P0j0rj0rrK7J09P2o3l1l1l9m0N3N3KQ3
1311a23M2l8l4M8klo4o5j4j4o0K1L2L1L2L1K2n9j9O2M1M1k1k1nnN8N7K2o0o5J7Q5Mn9n8l9
1297a82R6O6j6m5m5n0n1M9M9jq1l7l6m1m2M5M5M5M5n6n6O6O5M2M1k6k7J%o7o8M3M3P4P5m3
$$ plain form
1391 -223 -221 -216 -292 -260 -228 -151 -156 -236 -317 -373 -429 -418 -406 -360 -314 -263 -212 -274 -255 -195 -217 -247 -277 -311 -346 -364 -382 -287 -273 -301 -329 -357 -385 -406 -345 -289
1378 -289 -369 -407 -364 -308 -252 -283 -314 -329 -262 -245 -308 -357 -405 -409 -331 -259 -186 -170 -154 -183 -131 -75 -18 -24 -29 -47 -64 -82 -99 -53 -7 -51 -95 -117 -59 -82
1365 -82 -105 -169 -152 -141 -129 -173 -218 -262 -307 -237 -168 -115 -144 -306 -387 -397 -407 -456 -506 -485 -383 -339 -376 -362 -348 -411 -473 -414 -355 -362 -369 -377 -384 -414 -444 -474
1352 -474 -504 -447 -390 -332 -275 -290 -306 -226 -147 -114 -82 -90 -98 -94 -90 -127 -164 -207 -250 -225 -201 -218 -236 -294 -352 -326 -299 -389 -479 -487 -414 -386 -359 -333 -308 -269 -149
1338 -149 -35 -56 -86 -115 -174 -152 -35 0 -41 -83 -170 -258 -252 -246 -146 -46 -61 -76 -92 -107 -150 -193 -169 -145 -110 -76 -109 -142 -143 -143 -143 -143 -142 -140 -139 -137 -107 -76
1324 -76 -113 -150 -205 -260 -316 -371 -312 -252 -288 -323 -323 -324 -289 -254 -188 -203 -261 -320 -371 -341 -271 -281 -290 -300 -309 -318 -291 -182 -110 -173 -204 -235 -274 -314 -261 -208 -206 -123
1311 -123 -81 -119 -153 -105 -107 -110 -174 -239 -253 -267 -327 -306 -274 -243 -211 -180 -158 -217 -236 -174 -133 -92 -113 -134 -139 -144 -86 -29 -7 -67 -132 -115 -30 -26 -85 -143 -182
1297 -182 -86 -20 -36 -81 -126 -176 -227 -178 -129 -130 -211 -248 -284 -325 -367 -322 -277 -232 -187 -243 -299 -233 -168 -126 -85 -111 -138 -137 -137 -204 -272 -229 -186 -112 -37 -80
1284h0j77o2P4P5qPOnoN6N7M3l8m3L9K8n2MMl5M7JJp7p6l1l1j7O5J08J08k0j01J7J7k7N4N4
1270b1k7k3k3k8k8K3K3j8j7L2L2qqL5L6L5L5l5l4l6l5m1m0p6p6M0J21N3k8p0p0n9K3L9m2N0
1257b66M9O6O5K5K5j0j1j0j0o3o4o3o3L2L3L2L3k5k5M2M3nnO3O3n9n9QRM5M5n0n0j8j8j9j8
1244b33J05J05m4m4l8l8l8l7JKKKm7m6m6m6jjM0M0P6P6j8j9O4O4mlK3K3j7j7k9k9J1J1n6n6
1230b62j6j6L7L6nmk9l0J1J1J2J2n5n5L6L5L6L6J5J5J5J5j0j0n1n1noL6L5N0N0j7j7p6p7l6
1217c35l6o7o7N4N4J9J8J8J9n0m9J8J9M7M8M7M7j9j9k0j9l5l6l6l5k7k6R0R1P3pm3R3R1J0
1204g0llj5j5P9P9mmp1p2m6m6m6m6N8N8o4o3Q0Q1J3J3p1p2N0N1j5j5N3N3l2l3l2l2l3l3QQ
1190b52NNl5l6O3O3K2K2o1o0L4L4N1N1m4m4K0K0K0J9l8l8L0L0j0j0n1n0m8m7M8M7N5N4J4J3
$$ plain form
1284 -80 -257 -319 -245 -170 -178 -171 -165 -170 -176 -120 -63 -20 -58 -101 -62 -34 -86 -82 -78 -113 -66 -65 -64 -141 -217 -248 -279 -296 -231 -123 -15 -35 -136 -119 -102 -129 -75 -21
1270 -21 -48 -71 -94 -122 -150 -127 -104 -122 -139 -107 -75 -83 -91 -56 -20 15 50 15 -19 -55 -90 -131 -171 -247 -323 -283 -162 -109 -137 -207 -277 -336 -313 -274 -316 -266
1257 -266 -217 -151 -86 -61 -36 -46 -57 -67 -77 -140 -204 -267 -330 -298 -265 -233 -200 -225 -250 -208 -165 -170 -175 -112 -49 -108 -167 -159 -150 -105 -60 -110 -160 -178 -196 -215 -233
1244 -233 -128 -23 -67 -111 -149 -187 -225 -262 -261 -259 -257 -255 -302 -348 -394 -440 -441 -442 -402 -362 -286 -210 -228 -247 -183 -119 -123 -126 -103 -80 -97 -114 -143 -172 -161 -150 -206 -262
1230 -262 -278 -294 -257 -221 -226 -230 -259 -289 -278 -267 -255 -243 -298 -353 -317 -282 -246 -210 -195 -180 -165 -150 -160 -170 -221 -272 -277 -283 -247 -212 -162 -112 -129 -146 -222 -299 -335
1217 -335 -371 -438 -505 -451 -397 -378 -360 -342 -323 -373 -422 -404 -385 -338 -290 -243 -196 -215 -234 -254 -273 -308 -344 -380 -415 -442 -468 -378 -287 -214 -221 -264 -171 -80 -70
1204 -70 -73 -76 -91 -106 -27 52 48 44 -27 -99 -145 -191 -237 -283 -225 -167 -231 -294 -214 -133 -120 -107 -178 -250 -200 -149 -164 -179 -126 -73 -105 -138 -170 -202 -235 -268 -260 -252
1190 -252 -247 -242 -277 -313 -250 -187 -165 -143 -204 -264 -230 -196 -145 -94 -138 -182 -162 -142 -122 -103 -141 -179 -149 -119 -129 -139 -190 -240 -288 -335 -287 -240 -185 -131 -117 -104
1177a04J5J5N6N4k9k8o9p0m6m6onM0M0M0M0rqqqo6o5N6N6K9L0o5o5L3L3L4L3k0k0k0k0k7k8
1163b28k7k8k3k3J8J8j3j3j2j3L9L9q2q3OOP4P3N0M9m6m5L3L3l5l5k1k1k2k1nnmnP0P0K9K9
1149a74k1k2k1k2k0k0M7M8M1M1k6k6j6j6N1N2l1l0l1l0K1K2j9j9k5k4J5J6N6N6l8l9m0m0J
1137b83%POo1o1j3j3K8K8O4O5O5O5k4k4k4k4k8k9k9k8N9N9qqM7M8p4p5k4k4M3M3j1j2j1j2
1123b73jkjjo4o3L1L1O0O0O0N9p1p1mmn7n8L7L6l2l3k7k7lP8M3l9j7O4R9J8l1l1L1L2M7M7
1109g7m3m2l4M8M8l4j7j7J8J8j0j1j0j1J8J8l2j12LMLLk5N6N6k5l5l5K7K7k7k7R0Q9Q7Ol8
1096d3l8p6Nm1m0K5K6J6J7K3j13r9r9QQ8Q3LO1k0m7m8J2J2l8M2K9n3O6O5J3J2QPJq1q0JK2
1082b71K2K7K7o6o6J0R1MMl1l2k4k4L9L8Q3JPOk3k2P1P2l0l0l1l0ONl5l5K3K2K8n4k4k3k9
$$ plain form
1177 -104 -89 -74 -18 36 7 -21 -90 -160 -206 -252 -258 -263 -223 -183 -143 -103 -112 -120 -128 -136 -202 -267 -211 -155 -126 -96 -161 -226 -193 -160 -126 -93 -113 -133 -153 -173 -200 -228
1163 -228 -255 -283 -306 -329 -311 -293 -306 -319 -331 -344 -305 -266 -348 -431 -425 -419 -345 -272 -222 -173 -219 -264 -231 -198 -233 -268 -289 -310 -332 -353 -358 -363 -367 -372 -302 -232 -203 -174
1149 -174 -195 -217 -238 -260 -280 -300 -253 -205 -164 -123 -149 -175 -191 -207 -156 -104 -135 -165 -196 -226 -205 -183 -202 -221 -246 -270 -255 -239 -183 -127 -165 -204 -244 -284 -283
1137 -283 -283 -276 -270 -331 -392 -405 -418 -390 -362 -298 -233 -168 -103 -127 -151 -175 -199 -227 -256 -285 -313 -254 -195 -203 -211 -164 -116 -190 -265 -289 -313 -270 -227 -238 -250 -261 -273
1123 -273 -274 -276 -277 -278 -342 -405 -374 -343 -283 -223 -163 -104 -175 -246 -250 -254 -311 -369 -332 -296 -328 -361 -388 -415 -418 -340 -297 -336 -353 -289 -190 -172 -203 -234 -203 -171 -124 -77
1109 -77 -120 -162 -196 -148 -100 -134 -151 -168 -150 -132 -142 -153 -163 -174 -156 -138 -170 -282 -279 -275 -272 -269 -294 -238 -182 -207 -242 -277 -250 -223 -250 -277 -187 -98 -11 -5 -43
1096 -43 -81 -157 -152 -193 -233 -208 -182 -166 -149 -126 -239 -338 -437 -429 -341 -258 -255 -194 -214 -261 -309 -297 -285 -323 -281 -252 -305 -239 -174 -161 -149 -141 -134 -133 -214 -294 -293 -271
1082 -271 -249 -222 -195 -261 -327 -317 -226 -222 -218 -249 -281 -305 -329 -290 -252 -169 -168 -161 -155 -178 -200 -129 -57 -87 -117 -148 -178 -172 -167 -202 -237 -214 -192 -164 -218 -242 -265 -294
1068b94k9m3m3N2N1j7j8k6J09J54J54O3O3m7j29j26RL6r9q2q3M7M8M7M7m1m1N4N4J9K0J9K0
1056e2l4l4L4L4m5m5q5N0O5j6l0k9OPM7M8mllmpoppL0K9L0K9q7q8PPp6p6J8J9M2M2M3M2o0
1041a69n9j9j8K4K5K4K4J8J8J7J8J07J07m1m1l1l0l1l1n9n9RRl0k9k9l0%%j%M3M4M3M4l0l0
1028a93k9l0k2k2J8J8N1N0N0N0o2o1k1k1k1k2k1k2J00J01k2k1n1n2m6m6k2N9N9k3m9n0J3J3
1016c47M1M1k7k7M6M7ONo3o4L1L1J2J2n6n5noL1L0J34N3k3k4J3J2k8k9qqKp9m1L9J29M7k1
1002a49k1p2p1j4r4k8N5L1L1L7L7M4M4o4J7LQ4M9l2p4p4n6K4J0J1J5J5M8M7N3k8k6k5l1l0
989b34n1n0o1K0Op5p0J1ONP8P8R2R3K5K5popoj%O7O6l0l2l1l1mmm9n0L6m6j0P1L6m6q1%M9
975b18M9J8J9j07k6N0N1mmo3o3rJ26J22o8j17l6N0N1Op6j15l5MLJ22J21M8q8j2j1ppm7m7O8
$$ plain form
1068 -294 -323 -366 -409 -357 -306 -323 -341 -367 -258 -104 50 113 176 129 0 -126 -117 -81 -180 -262 -345 -298 -250 -203 -156 -197 -238 -184 -130 -111 -91 -72 -52
1056 -52 -86 -120 -86 -52 -97 -142 -227 -177 -112 -128 -158 -187 -181 -174 -127 -79 -83 -86 -89 -93 -100 -106 -113 -120 -90 -61 -31 -2 -89 -177 -170 -163 -239 -315 -297 -278 -236 -194 -151 -109 -169
1041 -169 -228 -247 -265 -241 -216 -192 -168 -150 -132 -115 -97 10 117 76 35 4 -26 -57 -88 -147 -206 -197 -188 -218 -247 -276 -306 -306 -306 -307 -307 -264 -220 -177 -133 -163 -193
1028 -193 -222 -252 -274 -296 -278 -260 -209 -159 -109 -59 -121 -182 -203 -224 -245 -267 -288 -310 -210 -109 -131 -152 -203 -255 -301 -347 -369 -310 -251 -274 -323 -373 -360 -347
1016 -347 -306 -265 -292 -319 -273 -226 -220 -215 -278 -342 -311 -280 -268 -256 -312 -367 -372 -378 -347 -317 -183 -130 -153 -177 -164 -152 -180 -209 -217 -225 -223 -302 -343 -304 -175 -128 -149
1002 -149 -170 -242 -313 -327 -421 -449 -394 -363 -332 -295 -258 -214 -170 -234 -217 -214 -130 -81 -113 -187 -261 -317 -293 -283 -272 -257 -242 -194 -147 -94 -122 -148 -173 -204 -234
989 -234 -285 -335 -396 -376 -370 -445 -515 -504 -498 -493 -415 -337 -245 -152 -127 -102 -109 -115 -122 -128 -129 -129 -62 4 -26 -58 -89 -120 -124 -128 -177 -227 -191 -237 -247 -176 -140 -186 -267 -267 -218
975 -218 -169 -151 -132 -239 -265 -215 -164 -168 -172 -235 -298 -307 -181 -59 -127 -244 -280 -230 -179 -173 -249 -364 -399 -395 -392 -270 -149 -101 -189 -201 -212 -219 -226 -273 -320 -252
962b52O8O8O8n9o0n4n4nP7K5K6K2o0n9K1J7J7j4j3p4PL3J14R3J1o3j44m0M1j0rm9m9qqj2j1
948c99poJQ3P3P2Lp7l3l2N0M9m0m1j1O9O5O4l3l4l3l4k0j9L0n0q5lM0M1M4M5N0l2J3J3J21
935f3M1j5j5k0k0m6m6K2K1nonoM9M9m1m1m6L4oq7n9n9L1L1K0K1o6J6Q6Q6mlL5L5o0o0NML5
920a58m6k7N4J3o7p2RN3N3O7O7P4n9o4o4nml8l8KLnmJ6J5l1l2MMN4k7qP4L6L5k7k7opopL0
905a66L0l3l3n9K2J2J2O1k0q8pP7P7l9m0O3O3K3K2j4j4l4l5m7m8p3Q%%K0K0O6j6l7l7K0K0
891b24m3m2mP8R4R5%q0p0p0l3M9O9j2KLM3l8n9n9L1L1Q3Q3J5J5r7r8p7p7M2M2M2M2L5L6nn
878a63l3l4l3l3JKM2M2LMM4M4rqN9N9K1K1m5m6q7q7k0j9L4L5m0M2Q2n2l9l9llJ8J7N1N1J0
$$ plain form
962 -252 -184 -116 -48 -107 -167 -221 -275 -280 -203 -178 -152 -130 -190 -249 -228 -211 -194 -208 -221 -295 -288 -255 -141 -48 -37 -100 -244 -284 -243 -253 -262 -311 -360 -368 -376 -388 -399
948 -399 -406 -412 -411 -328 -255 -183 -180 -257 -290 -322 -272 -223 -263 -304 -315 -246 -181 -117 -150 -184 -217 -251 -271 -290 -260 -310 -395 -398 -358 -317 -273 -228 -178 -210 -197 -184 -63
935 -63 -22 -37 -52 -72 -92 -138 -184 -162 -141 -146 -152 -157 -163 -114 -65 -106 -147 -193 -159 -165 -252 -311 -370 -339 -308 -288 -267 -333 -317 -231 -145 -149 -152 -117 -82 -142 -202 -197 -193 -158
920 -158 -204 -231 -177 -164 -231 -303 -294 -241 -188 -121 -54 20 -39 -103 -167 -172 -176 -214 -252 -250 -247 -252 -256 -240 -225 -256 -288 -284 -280 -226 -253 -261 -187 -151 -116 -143 -170 -176 -183 -189 -196 -166
905 -166 -136 -169 -202 -261 -239 -227 -215 -154 -174 -262 -269 -192 -115 -154 -194 -131 -68 -45 -23 -37 -51 -85 -120 -167 -215 -288 -280 -280 -280 -260 -240 -174 -190 -227 -264 -244 -224
891 -224 -267 -309 -313 -235 -141 -46 -46 -126 -196 -266 -299 -250 -181 -193 -191 -188 -145 -183 -242 -301 -270 -239 -156 -73 -58 -43 -140 -238 -315 -392 -350 -308 -266 -224 -189 -153 -158 -163
878 -163 -196 -230 -263 -296 -295 -293 -251 -209 -206 -202 -158 -114 -123 -131 -72 -13 8 29 -16 -62 -149 -236 -256 -275 -241 -206 -246 -204 -122 -174 -213 -252 -255 -258 -240 -223 -172 -121 -111
$$ [...]
-11905E9
##END=	
##END=	
