##TITLE=	Cem58.17.fid
diradical 65 mg

##JCAMP-DX=	6.0	$$ MestReNova 14.1.0-24037
##DATA TYPE=	LINK
##BLOCK_ID=	1
##BLOCKS=	1    
##ORIGIN=	Mestrelab Research S.L.
##OWNER=	hrzepa
##$MNOVA/LINK_BLOCK_TYPE=	ITEM	$$ NMR Spectrum
##$MNOVA/ITEM/POLYGON=	(XY..XY)
5321,5835
8722,5835
8722,8208
5321,8208
5321,5835
##$MNOVA/ITEM/Z=	0
##$MNOVA/ITEM/ANGLE=	0
##TITLE=	Cem58.17.fid
##JCAMP-DX=	6.0	$$ MestReNova 14.1.0-24037
##BLOCK_ID=	2
##DATA TYPE=	NMR SPECTRUM
##DATA CLASS=	XYDATA
##NUMDIM=	1
##ORIGIN=	Bruker BioSpin GmbH
##OWNER=	nmrsu
##.OBSERVE FREQUENCY=	59.627388000000003387
##.OBSERVE NUCLEUS=	^29Si
##.SOLVENT NAME=	C6D6
##.PULSE SEQUENCE=	zgig
##LONGDATE=	2015/05/02 15:27:00.000
##.ACQUISITIONMODE=	SIMULTANEOUS (DQD)
##$ORIGINAL FORMAT=	Bruker XWIN-NMR
##$MNOVA/SCALES_VERSION=	8
##$PARAMETER FILE=	(acqus, ASCII, /Users/hrzepa/Library/Mobile%20Documents/com~apple~CloudDocs/Saarbr%C3%BCcken/Prof.Rzepa%20updated/nmr/3/17/acqus, 0)
$$ ##TITLE= Parameter file, TOPSPIN		Version 3.0
$$ ##JCAMPDX= 5.0
$$ ##DATATYPE= Parameter Values
$$ ##NPOINTS= 11	$$ modification sequence number
$$ ##ORIGIN= Bruker BioSpin GmbH
$$ ##OWNER= nmrsu
$$ $$ 2015-05-02 15:27:36.848 +0200  nmrsu@CZC049C5SM
$$ $$ C:/Bruker/TopSpin3.0/data/CemY/nmr/Cem58/17/acqus
$$ $$ process C:\Bruker\TopSpin3.0\prog\mod\shimcntl.exe
$$ ##$ACQT0= -6.36618283677107
$$ ##$AMP= (0..31)
$$ 100 100 100 100 100 100 100 100 100 100 100 100 100 100 100 100 100 100
$$ 100 100 100 100 100 100 100 100 100 100 100 100 100 100
$$ ##$ANAVPT= -1
$$ ##$AQSEQ= 0
$$ ##$AQ_mod= 3
$$ ##$AUNM= <au_zg>
$$ ##$AUTOPOS= <14 >
$$ ##$BF1= 59.627388
$$ ##$BF2= 300.13
$$ ##$BF3= 300.13
$$ ##$BF4= 300.13
$$ ##$BF5= 300.13
$$ ##$BF6= 300.13
$$ ##$BF7= 300.13
$$ ##$BF8= 300.13
$$ ##$BYTORDA= 0
$$ ##$CAGPARS= (0..11)
$$ 0 0 0 0 0 0 0 0 0 0 0 0
$$ ##$CFDGTYP= 0
$$ ##$CFRGTYP= 9
$$ ##$CHEMSTR= <none>
$$ ##$CNST= (0..63)
$$ 1 1 145 1 1 1 1 1 1 1 1 1 1 1 1 1 1 1 1 1 1 1 1 1 1 1 1 1 1 1 1 1 1 1 1
$$ 1 1 1 1 1 1 1 1 1 1 1 1 1 1 1 1 1 1 1 1 1 1 1 1 1 1 1 1 1
$$ ##$CPDPRG= <>
$$ ##$CPDPRG1= <>
$$ ##$CPDPRG2= <waltz16>
$$ ##$CPDPRG3= <>
$$ ##$CPDPRG4= <>
$$ ##$CPDPRG5= <>
$$ ##$CPDPRG6= <>
$$ ##$CPDPRG7= <>
$$ ##$CPDPRG8= <>
$$ ##$D= (0..63)
$$ 0 20 0.00345 0 0 0 0 0 0 0 0 0.03 2e-005 3e-006 0 0 0.0002 0 0 0 0 0 0
$$ 0 0 0 0 0 0 0 0 0 0 0 0 0 0 0 0 0 0 0 0 0 0 0 0 0 0 0 0 0 0 0 0 0 0 0 0
$$ 0 0 0 0 0
$$ ##$DATE= 1430573256
$$ ##$DBL= (0..7)
$$ 120 120 120 120 120 120 120 19
$$ ##$DBP= (0..7)
$$ 150 150 150 150 150 150 150 150
$$ ##$DBPNAM0= <>
$$ ##$DBPNAM1= <>
$$ ##$DBPNAM2= <>
$$ ##$DBPNAM3= <>
$$ ##$DBPNAM4= <>
$$ ##$DBPNAM5= <>
$$ ##$DBPNAM6= <>
$$ ##$DBPNAM7= <>
$$ ##$DBPOAL= (0..7)
$$ 0.5 0.5 0.5 0.5 0.5 0.5 0.5 0.5
$$ ##$DBPOFFS= (0..7)
$$ 0 0 0 0 0 0 0 0
$$ ##$DE= 6.5
$$ ##$DECBNUC= <off>
$$ ##$DECIM= 840
$$ ##$DECNUC= <off>
$$ ##$DECSTAT= 4
$$ ##$DIGMOD= 1
$$ ##$DIGTYP= 12
$$ ##$DL= (0..7)
$$ 0 0 120 120 120 21 21 120
$$ ##$DP= (0..7)
$$ 150 150 150 150 150 150 150 150
$$ ##$DP07= 0
$$ ##$DPNAME0= <>
$$ ##$DPNAME1= <>
$$ [...]
$$ ##$RX22TY= <no>
$$ ##$RXFMAX= (0..7)
$$ 432.5 -1 -1 -1 -1 -1 -1 -1
$$ ##$RXFMIN= (0..7)
$$ 5 -1 -1 -1 -1 -1 -1 -1
$$ ##$RXINTLV= (0..7)
$$ 1 0 0 0 0 0 0 0
$$ ##$RXMSTY= <no>
$$ ##$SCMTY= <no>
$$ ##$SGUC1= (0..15)
$$ 18 19 0 0 0 0 0 0 0 0 0 0 0 0 0 0
$$ ##$SGUC2= (0..15)
$$ 33 256 0 0 0 0 0 0 0 0 0 0 0 0 0 0
$$ ##$SPECTR= 10
$$ ##$SY2FLAG= 0
$$ ##$SYNCTRIG= 11
$$ ##$ShimPowMaxUA= (0..63)
$$ 130000 130000 130000 130000 130000 130000 130000 130000 130000 130000 130000
$$ 130000 130000 130000 130000 130000 130000 130000 130000 130000 0 0 0 0
$$ 0 0 0 0 0 0 0 0 0 0 0 0 0 0 0 0 0 0 0 0 0 0 0 0 0 0 0 0 0 0 0 0 0 0 0 0
$$ 0 0 0 0
$$ ##$ShimPowMaxUC= (0..63)
$$ 130000 130000 130000 130000 130000 130000 130000 130000 130000 130000 130000
$$ 130000 130000 130000 130000 130000 130000 130000 130000 130000 0 0 0 0
$$ 0 0 0 0 0 0 0 0 0 0 0 0 0 0 0 0 0 0 0 0 0 0 0 0 0 0 0 0 0 0 0 0 0 0 0 0
$$ 0 0 0 0
$$ ##$ShimPowMaxUG= (0..63)
$$ 524287 524287 524287 524287 524287 524287 524287 524287 524287 524287 524287
$$ 524287 524287 524287 524287 524287 524287 524287 524287 524287 0 0 0 0
$$ 0 0 0 0 0 0 0 0 0 0 0 0 0 0 0 0 0 0 0 0 0 0 0 0 0 0 0 0 0 0 0 0 0 0 0 0
$$ 0 0 0 0
$$ ##$ShimPowRcbType= 3
$$ ##$ShimPowRes= (0..63)
$$ 1e-020 1e-020 1e-020 1e-020 1e-020 1e-020 1e-020 1e-020 1e-020 1e-020 1e-020
$$ 1e-020 1e-020 1e-020 1e-020 1e-020 1e-020 1e-020 1e-020 1e-020 0 0 0 0
$$ 0 0 0 0 0 0 0 0 0 0 0 0 0 0 0 0 0 0 0 0 0 0 0 0 0 0 0 0 0 0 0 0 0 0 0 0
$$ 0 0 0 0
$$ ##$ShimPowRng0= (0..63)
$$ 1 1 1 1 1 1 1 1 1 1 1 1 1 1 1 1 1 1 1 1 0 0 0 0 0 0 0 0 0 0 0 0 0 0 0 0
$$ 0 0 0 0 0 0 0 0 0 0 0 0 0 0 0 0 0 0 0 0 0 0 0 0 0 0 0 0
$$ ##$ShimPowRng1= (0..63)
$$ 1 1 1 1 1 1 1 1 1 1 1 1 1 1 1 1 1 1 1 1 0 0 0 0 0 0 0 0 0 0 0 0 0 0 0 0
$$ 0 0 0 0 0 0 0 0 0 0 0 0 0 0 0 0 0 0 0 0 0 0 0 0 0 0 0 0
$$ ##$ShimPowRng2= (0..63)
$$ 1 1 1 1 1 1 1 1 1 1 1 1 1 1 1 1 1 1 1 1 0 0 0 0 0 0 0 0 0 0 0 0 0 0 0 0
$$ 0 0 0 0 0 0 0 0 0 0 0 0 0 0 0 0 0 0 0 0 0 0 0 0 0 0 0 0
$$ ##$ShimPowRng3= (0..63)
$$ 1 1 1 1 1 1 1 1 1 1 1 1 1 1 1 1 1 1 1 1 0 0 0 0 0 0 0 0 0 0 0 0 0 0 0 0
$$ 0 0 0 0 0 0 0 0 0 0 0 0 0 0 0 0 0 0 0 0 0 0 0 0 0 0 0 0
$$ ##$ShimSysFunc= (0..63)
$$ 1 2 3 4 5 7 9 11 15 16 8 10 12 14 6 17 13 18 19 20 0 0 0 0 0 0 0 0 0 0
$$ 0 0 0 0 0 0 0 0 0 0 0 0 0 0 0 0 0 0 0 0 0 0 0 0 0 0 0 0 0 0 0 0 0 0
$$ ##$ShimSysMatrix= 0
$$ ##$ShimSysType= 1
$$ ##$TFXNUM= 0
$$ ##$TRIPLO2= 0
$$ ##$VTU= 2
$$ ##$VTUETH= <149.236.99.20>
$$ ##$VTUTY= <no>
$$ ##$WBREFAM= (0..15)
$$ 20.9 49.1 100 100 100 100 100 100 100 100 100 100 100 100 100 100
$$ ##$WBREFLM= (0..15)
$$ 0 0 0 0 0 0 0 0 0 0 0 0 0 0 0 0
$$ ##$WBREFPH= (0..15)
$$ 72.55 -68.79 0 0 0 0 0 0 0 0 0 0 0 0 0 0
$$ ##$XFAC= 2
$$ ##END=
$$ 
##$DECIM=	840
##$DSPFVS=	20
##XUNITS=	HZ
##YUNITS=	ARBITRARY UNITS
##FIRSTX=	11904.763045408797552
##LASTX=	-11904.760764115000711
##DELTAX=	-0.3633100451594384328
##XFACTOR=	1
##YFACTOR=	0.42964064381809713433
##FIRSTY=	-16.8258056640625
##MINY=	-244.769805908203125
##MAXY=	5157.8076171875
##NPOINTS=	65536
##XYDATA=	(X++(Y..Y))
$$ [...]
-2233b05j38R3J67J04o6l9Q3O0j2rO4Po6J7J7k7k7J0J0m0l8p7p6K4K5K5K5k0k1O1O1o8j41
-2245b17q8L5O4j0m6m6L3L4lmP2P2j4j4j7j7K0J9L1L1L1L2l5l5K6K7r2r1J9J8j7j7j8j7R0
-2257a44R0MMJ4J5J4J3m3m5J7J6j0j0K7K7L1L2p7p8J5J5Q3l7o7o8O0O0l2l2l2l1L7L7J%K6
-2271f8K5K6K4K4K4O0O1n5n6n5n5r6r6J4J5K2K2j4j4K5K5O3O2M9N0o1n9q8q8k7k7M4M3m2m3
-2283b66L8L8L8L8n6n6N4N5qqP8P7l5l6%%k5k4k5k5N8N8k7k8n8n8k2k1nonnm2m1M4M4K4K5
-2297b13K4K5OOPOOOO8O6J2J1J2J1k8k8k9k9l7l7M9M8l9m0m0m0p9p9N6N6R4R3m2m1O0N9jk
-2311b3l4l4K6K7k5k5J2J1m9n0O0O1RQk8k9L4L3k8k8j%L6L6J1J1p3p4j8j7n5n4p2p1L9L8O5
-2324b71O4J33J0n6n6P2P1J5J5J3J5m9m9J1J2l8l7l8l7l2l1P9P8j2j2P3P2o0o1%JrrN2N2K9
$$ plain form
-2233 -205 -343 -250 -83 21 -45 -84 -1 59 47 38 102 109 43 60 77 50 23 33 43 3 -35 -112 -188 -164 -139 -114 -89 -109 -130 -69 -8 -76 -217
-2245 -217 -305 -270 -206 -216 -262 -308 -275 -241 -244 -248 -176 -104 -118 -132 -149 -166 -146 -127 -96 -65 -34 -2 -37 -72 -46 -19 -111 -202 -183 -165 -182 -199 -217 -234 -144
-2257 -144 -54 -50 -46 -32 -17 -3 10 -33 -78 -61 -45 -55 -65 -38 -11 20 52 -25 -103 -88 -73 10 -27 -94 -162 -102 -42 -74 -106 -138 -169 -132 -95 -94 -94 -68
-2271 -68 -43 -17 7 31 55 115 176 121 65 10 -45 -141 -237 -223 -208 -186 -164 -178 -192 -167 -142 -79 -17 32 82 21 -38 -126 -214 -241 -268 -224 -181 -223 -266
-2283 -266 -228 -190 -152 -114 -170 -226 -172 -117 -125 -133 -55 22 -13 -49 -49 -49 -74 -98 -123 -148 -90 -32 -59 -87 -145 -203 -225 -246 -251 -257 -262 -267 -309 -350 -306 -262 -238 -213
-2297 -213 -189 -164 -158 -152 -145 -139 -133 -127 -59 7 19 30 42 53 25 -3 -32 -61 -98 -135 -86 -38 -77 -117 -157 -197 -276 -355 -299 -243 -149 -56 -98 -139 -79 -20 -21 -23
-2311 -23 -57 -91 -65 -38 -63 -88 -76 -65 -114 -164 -104 -43 -34 -26 -54 -83 -49 -16 -44 -72 -73 -73 -37 -1 10 21 -52 -126 -144 -161 -216 -270 -342 -413 -374 -336 -271
-2324 -271 -207 -74 -64 -120 -176 -104 -33 -18 -3 10 25 -24 -73 -62 -50 -88 -125 -163 -200 -232 -263 -184 -106 -118 -130 -57 15 -45 -106 -106 -105 -114 -123 -71 -19 10
-2337A0L0l1l1j0rm7m7K5K6l6l6j2j1K5K6j0rN1N2MLML%jQ5Q5LLJ0J1j23%J7J7PPp8p8l4l3
-2352a32K7K8m5m5M0M1M3M2M2M3p9p7L2L1L8L9L9L9p6p4N8O0J4J4k3r6j54l3P8P7ooopN9N9
-2365H4K3K3j6j7k3k4M3p9p8M3K0K0rrqrj19j20nnonRRM6M6O8O8PON4N5J8J8o3o3o3o3P1O9
-2380A6RRn8n9n9n9j0j1j1j0k2k1k1k2PQM0J64N7o5J2J1m7m6O3O4J7J6J6J6OPl0l0m8m9j2
-2393a52j2M8M8j3j4N5N3pom9m9n0m9L6L6r1r2l5Q7Q0P9J15J15j9r3MJ26L3m1j0j0p7p5RR
-2406a1RQk5k6J1J1J1J1p5p5K8K7K8K8q7q6jjL5L4llj6j7j6j6L7L7L7L7m4m5M1M1O3O3J05
-2419A55L1n2n1n6n6L9M0K0n4j1j0O5O5K0n5n4J9l2l1o4o4O0O0jjl0l0j16j16j7j6M5M4k2
-2432b76k3k3k2N2N3N2N2N3N2rqJ7J7r3r3Q5Q5L9l2j5j5K5R8k0k0j1q4r2r1j66m2J03J04R2
$$ plain form
-2337 10 40 9 -22 -32 -41 -88 -135 -110 -84 -120 -156 -168 -179 -154 -128 -138 -147 -96 -44 -40 -37 -33 -30 -30 -31 54 139 142 145 155 166 43 43 60 77 84 91 13 -65 -99 -132
-2352 -132 -105 -77 -122 -167 -127 -86 -43 -1 41 84 5 -72 -40 -9 29 68 107 146 70 -4 54 114 128 142 119 23 -131 -164 -86 -9 -15 -21 -27 -34 25 84
-2365 84 107 130 114 97 74 50 93 14 -64 -21 -1 19 10 1 -7 -16 -135 -255 -260 -265 -271 -276 -267 -258 -212 -166 -98 -30 -23 -17 37 92 110 128 65 2 -61 -124 -53 16
-2380 16 25 34 -24 -83 -142 -201 -211 -222 -233 -243 -265 -286 -307 -329 -322 -314 -274 -110 -53 -118 -106 -95 -142 -188 -125 -61 -44 -28 -12 4 10 17 -13 -43 -91 -140 -152
-2393 -152 -164 -116 -68 -81 -95 -40 13 6 0 -49 -98 -148 -197 -161 -125 -216 -308 -343 -256 -176 -97 18 133 114 21 25 151 184 143 133 123 46 -29 -20 -11
-2406 -11 -2 6 -19 -45 -34 -23 -12 -1 -76 -151 -123 -96 -68 -40 -127 -213 -214 -215 -180 -146 -149 -152 -168 -185 -201 -217 -180 -143 -106 -69 -113 -158 -117 -76 -13 50 155
-2419 155 186 134 83 27 -29 10 50 70 16 5 -5 60 125 145 90 36 55 23 -8 -72 -136 -76 -16 -17 -18 -48 -78 -194 -310 -327 -343 -298 -254 -276
-2432 -276 -299 -322 -344 -292 -239 -187 -135 -82 -30 -39 -47 -30 -13 -106 -199 -114 -29 10 -22 -37 -52 -27 71 51 31 20 -64 -156 -247 -413 -455 -352 -248 -156
-2444a56J8Q1Q0L2m2L7L7l7j10m4m4L8L7J6J5K5m8J2Q5K0n3p1p1p1p1l2M3M1J14L7l6NP8M7
-2457A2M8J6J6k7k8k8k7k3k3o0o0llJ3Q6J09L7p1p3j9N4K0j02m2m2m4m5j9N5R0l3m8P4J33
-2469e7J31m0m0m1m0j7j7K0K0p1p0J5J5M6M5M6M6KLL8M0o2o1o2o2J4J3J3J3M5M4j7j6J3J3
-2482c8k4k4l0l1OOMMl3l3K6K7K6K6j5j5L4m0j05J7K9L0j0j0N2N1L5L5k6k6L3L2mmRJ0RJ0
-2495D3m7m8L7L7ooj15j17K9L0llJ5Q9J1j12r5k3O4O4K3K4K3K4k6k7k6k6ononononJ08J06
-2509CJ08J08j8j8j8j8k5k5k1k0j1O2K8r4m2m2Q3Q5k0k0j09j10j1q5n1P2O2O1j7j7nmL2L2
-2522f5J01J02j3j35p9q0q7q7QRP0P0M6M7J0J0K1K2j6j5QPQQJ2J3J1J2KJl5l5k0j9M2M2NP
-2535Hn4n4mmL2J06Q0m2nnn9o0n9o0l0l1Q0Pn2P1Q3Q2k2k1k2k2j7j7n5n4N5N4N4N3P1P0j5
$$ plain form
-2444 -156 -138 -57 23 55 13 50 87 50 -60 -104 -148 -110 -73 -57 -42 -17 -65 -53 32 52 -1 -72 -143 -214 -285 -317 -274 -233 -119 -82 -118 -113 -35 12
-2457 12 60 76 92 65 37 9 -18 -41 -64 -124 -184 -187 -190 -177 -91 18 55 -16 -89 -108 -54 -34 -136 -178 -220 -264 -309 -328 -273 -183 -216 -264 -190 -57
-2469 -57 74 34 -6 -47 -87 -104 -121 -101 -81 -152 -222 -207 -192 -146 -101 -55 -9 -7 -4 34 74 12 -49 -111 -173 -159 -146 -133 -120 -75 -31 -48 -64 -51 -38
-2482 -38 -62 -86 -116 -147 -141 -135 -131 -127 -160 -193 -167 -140 -114 -88 -103 -118 -84 -124 -229 -212 -183 -153 -163 -173 -121 -70 -35 0 -26 -52 -19 13 9 5 14 24 33 43
-2495 43 -4 -52 -15 22 16 10 -105 -222 -193 -163 -166 -169 -154 -65 -54 -166 -261 -284 -220 -156 -133 -109 -86 -62 -88 -115 -141 -167 -173 -178 -184 -189 -195 -200 -206 -211 -103 3
-2509 3 111 219 201 183 165 147 122 97 76 56 45 107 135 41 -1 -43 40 125 105 85 -24 -134 -145 -230 -281 -209 -147 -86 -103 -120 -125 -129 -97 -65
-2522 -65 36 138 125 -10 -89 -169 -256 -343 -335 -326 -256 -186 -140 -93 -83 -73 -52 -30 -46 -61 -53 -46 -38 -30 -18 -5 6 18 20 21 -14 -49 -69 -88 -46 -4 1 8
-2535 8 -46 -100 -104 -108 -76 30 110 68 63 58 -1 -61 -120 -180 -210 -241 -161 -154 -206 -135 -52 30 8 -13 -35 -57 -74 -91 -146 -200 -145 -91 -37 16 87 157 142
-2549A42j6n8n9r4r5j0rrj0RQQRj3j3j3j4N7N7N7N8L6L7k5k4o0o2q8N9Q0Pn7j30m6K7j9j9
-2562b92J7J7N3N4QRk9k8L9L9k2k3n9o0J00J00POPOL0K9L1L0m1l9l1l1l8J09J07l8m4m3j7
-2575c7j7N0M8o0o1oor3r2j4j3j4j4J3J2M9M9M0M0M0M0l8l8l8l8N9N9kkj00r9j4j4j6j7j3
-2588c57J33L8L7m0l9k0k0J8J7MMMNK8K9pqk6k7O0O0RJ0J0J0m0m0j7J30J18M6m6j19n1n2n6
-2601a95n6L1L1Q3Q3K7j18j19K8Q3Q4OPm4m4m4m4J06J05mnk1k2k1k2K8K9K8K9o6o6M4M4J0
-2613eJ0k6k6m3m4opo5o6M4M5L6L5k6k6J8J8j9j9K9K8K9K8J8J7J8J7l3l4l3l4l3l3K8K9K9
-2627a02K9qpj6j5p7p7q6q6K5K4J63J62Q5o0J3J4NMl9l8l9l8N5N5poj0rN2N1n5n5r3r2n2n2
-2640c82j6j5Q0Q0Q1Q0LLM0L9kkj13j13k5k5J09J10O5O4k0k1n3n3P2P1J27k0j21j20p1p0J4
$$ plain form
-2549 142 126 68 9 -85 -180 -190 -199 -208 -218 -209 -201 -193 -184 -197 -210 -223 -237 -180 -123 -66 -8 28 65 40 16 -44 -106 -194 -135 -55 -48 -105 -235 -281 -254 -273 -292
-2562 -292 -275 -258 -205 -151 -143 -134 -163 -191 -152 -113 -135 -158 -217 -277 -177 -77 -70 -64 -57 -51 -21 8 39 69 28 -11 -42 -73 -111 -2 105 67 23 -20 -37
-2575 -37 -54 -4 44 -16 -77 -83 -89 -182 -274 -288 -301 -315 -329 -316 -304 -255 -206 -166 -126 -86 -46 -84 -122 -160 -198 -139 -80 -82 -84 -184 -283 -297 -311 -327 -344 -357
-2588 -357 -224 -186 -149 -189 -228 -248 -268 -250 -233 -229 -225 -221 -216 -188 -159 -166 -174 -200 -227 -167 -107 -98 -88 -78 -68 -108 -148 -165 -35 83 129 83 -36 -87 -139 -195
-2601 -195 -251 -220 -189 -106 -23 4 -114 -233 -205 -122 -38 -32 -25 -69 -113 -157 -201 -95 10 6 1 -20 -42 -63 -85 -57 -28 0 29 -37 -103 -59 -15 -5
-2613 -5 5 -21 -47 -90 -134 -140 -147 -212 -278 -234 -189 -153 -118 -144 -170 -152 -134 -153 -172 -143 -115 -86 -58 -40 -23 -5 12 -21 -55 -88 -122 -155 -188 -160 -131 -102
-2627 -102 -73 -81 -88 -104 -119 -196 -273 -359 -445 -420 -396 -233 -71 14 -46 -33 -19 -14 -10 -49 -87 -126 -164 -109 -54 -61 -67 -77 -86 -34 17 -38 -93 -186 -278 -330 -382
-2640 -382 -398 -413 -333 -253 -172 -92 -89 -86 -46 -7 -9 -11 -124 -237 -262 -287 -178 -68 -3 61 41 20 -33 -86 -14 57 184 164 43 -77 -148 -218 -204
-2652b04J5M1M1NMN9N8K3K3NNNMj06j07LLk5k4J2J2mnM4k9mJ19N4k0k9M3J0Q3N5o9j04j05
-2665a09l5l6KP5O3n9l9l9l4R0R3k9j10l8K7J01J40O7jp4j01k8j2j3n0n1J1J1M0L9P6P5k3
-2677B9k3k2k4M4M4j7j7m6m6m6m6LMrq2j42j9J40J40K5K5j1j2R9R8L8q5q5j2%%k1k1k1k1L6
-2690a03L5k5k6j0j0j1j0j0rm7m6OPM3M3P3P2J01J01R8k4o6o6m8m8q8j5PPN4k1l0l0JKLKK
-2704h6KK5K6ppqO4K4K4l0k9o8o7J2J2R5K1j8N4J4n9rqn0n0N6N7J9K0jjm1L0m6m7m2m2M6M7
-2718f8o1J2K3n1j0O4N3N1o9p0l7Q5N8j6L5L4j0j1j4q8k7M7K8K8n3n3M4M3M8k5K7K9j4j3j3
-2731Fj2K2K4l7l6j%K9K9n6n6O0O0O0O1q6q5k4k5K8K8j4j3N2j9k8M4L1r1j49k6P7P8K3K4K0
-2744bJ8o6o6L5L4P1P1LKl4l4j02j04QQ0R6k5o3o2K4K5j2j2n1n0j3j3Q8Q8k3k2n8n7N3N3l4
$$ plain form
-2652 -204 -189 -148 -107 -102 -98 -39 19 42 65 70 75 80 84 -22 -129 -126 -123 -148 -172 -160 -148 -152 -157 -113 -142 -146 -27 27 7 -22 21 31 114 169 100 -4 -109
-2665 -109 -144 -180 -178 -103 -40 -99 -138 -177 -211 -121 -28 -57 -167 -205 -178 -77 63 130 129 55 -46 -74 -86 -99 -149 -200 -189 -178 -138 -99 -23 52 29
-2677 29 6 -16 -40 4 48 31 14 -32 -78 -124 -170 -167 -163 -172 -254 -396 -415 -275 -135 -110 -85 -96 -108 -9 89 127 42 -43 -55 -55 -55 -76 -97 -118 -139 -103
-2690 -103 -68 -93 -119 -129 -139 -150 -160 -170 -179 -226 -272 -266 -259 -216 -173 -100 -28 73 174 272 248 182 116 68 20 -68 -83 -76 -69 -15 -36 -66 -96 -95 -93 -90 -88 -86
-2704 -86 -84 -59 -33 -40 -47 -55 9 33 57 27 -2 -70 -137 -125 -113 -18 3 -15 39 53 -6 -15 -23 -73 -123 -67 -10 9 29 28 27 -14 16 -30 -77 -119 -161 -115 -68
-2718 -68 -129 -117 -94 -145 -155 -91 -38 13 -56 -126 -163 -78 -20 -36 -1 33 23 12 -2 -90 -117 -70 -42 -14 -67 -120 -76 -33 15 -10 17 46 32 19 6
-2731 6 -6 16 40 3 -33 -34 -34 -5 24 -32 -88 -28 32 92 153 67 -18 -42 -67 -39 -11 -25 -38 14 -5 -33 11 42 -49 -198 -224 -147 -69 -46 -22 -2
-2744 -2 16 -50 -116 -81 -47 24 95 98 100 66 32 -70 -174 -166 -86 10 -15 -78 -140 -116 -91 -103 -115 -166 -216 -229 -242 -154 -66 -89 -111 -169 -226 -173 -120 -154
-2757a54l4K7K7j51j50J07J07J3J3M2M2J2j11j11J2J4J3K1K2N8N8ll%JJ%J%J%RRm0L3L9q4
-2771a59r6r7j7j7J9J9J2J1P2P3JKl4l5O9P0RQj21j21l5Q7L9l4J5J4N1N1j1j1K6K5m1m1m4
-2783b41j18l9Q3P5KJ4J3j4j5K2K3KKKKP5P5o0o0O0O0K0n3p8mj3j3P3P3N2k0o2o3k5j00j7
-2797b67j8k9R2J26J24k7k6K1J9O2j2n6n6o2o1k0k0k0j9P8P9J7J7L0K8l3j09o8NM8J22J13
-2808G8M1nmK8m5q2rN4N4llKJKKLMMLK6K5K5K5k7k8k2k3kP1L5l9j8j8k2k3POJ1o2k1k0k5k4
-2824a8LKLLm5m5m9K4L2L1R1R3lp7j37o5J6J6o1o1j1O3K1K1J8J9M8M8L4q6r7k3M1M0Q7J3j01
-2837a12j01k0j9P6P6j0j0O0O0k6k5K8K8K8K9J1J0r9k6O8n2j32n9J2J2J7J6M8M8j3j4p4p5
-2849b40O1O0PQp8p9N4N5N8N9j4N9Qj12r2L2J6J6K4K4K5K4L6L8m9m7nnm1m2K6K5O3O1K2K3
$$ plain form
-2757 -154 -188 -161 -134 -285 -435 -328 -221 -208 -195 -153 -111 -99 -210 -321 -309 -295 -282 -261 -239 -181 -123 -126 -129 -129 -128 -127 -127 -126 -126 -125 -125 -116 -107 -147 -114 -75 -159
-2771 -159 -255 -352 -369 -386 -367 -348 -336 -325 -253 -180 -179 -177 -211 -246 -177 -107 -98 -90 -211 -332 -367 -280 -241 -275 -260 -246 -195 -144 -155 -166 -140 -115 -156 -197 -241
-2783 -241 -359 -398 -315 -240 -238 -224 -211 -225 -240 -218 -195 -193 -191 -189 -187 -112 -37 -97 -157 -97 -37 -17 -70 -148 -152 -165 -178 -105 -32 20 0 -62 -125 -150 -250 -267
-2797 -267 -285 -314 -222 -96 28 1 -25 -4 15 77 65 9 -47 -109 -170 -190 -210 -230 -249 -171 -92 -75 -58 -28 0 -33 -142 -210 -205 -157 -35 78
-2808 78 119 114 110 138 93 11 2 56 110 107 104 106 107 109 111 114 118 122 125 151 176 201 226 199 171 149 126 124 195 230 191 173 155 133 110 117 123 134 72 51 31 6 -18
-2824 -18 -15 -13 -10 -7 -52 -97 -146 -122 -90 -59 32 125 122 45 -92 -157 -141 -125 -186 -247 -258 -195 -174 -153 -135 -116 -68 -20 14 -72 -169 -192 -151 -111 -24 -11 -112
-2837 -112 -213 -233 -252 -176 -100 -110 -120 -60 0 -26 -51 -23 5 33 62 73 83 -16 -42 26 -26 -158 -217 -205 -193 -176 -160 -112 -64 -77 -91 -165 -240
-2849 -240 -179 -119 -112 -104 -182 -261 -207 -152 -94 -35 -49 10 18 -94 -186 -154 -138 -122 -98 -74 -49 -25 11 49 0 -47 -52 -57 -98 -140 -114 -89 -26 35 57 80
-2862H0l9l9L7L6m9m8K4K5j9j8rj31j04l0j5j6K6K6k5k4L7L7O1O1jjK8K8K8K8rj0o3o3n1P1
-2875a31L9L9n4n4j8j8P8P7J6J6l2l2l3l2q2q2k1k0OPPPK6K6L5l9j1O2O3j1q2rN6N6j0j1K1
-2889a45K2kp5l8L5N3N3L7l6m4m3m9m8OOJ1J1qO5K9K9l9L4lkj4O1R2J8j2q4j18NjjM3M3K5
-2903h4K6l6l6M3M3L1m3j17MN9j5m5m5j3j3O7O7N0p2j1j1J9J8j3j2lJ19J08j4r6r7L1L0oo
-2915g3O5O5P0lj07j07j9N5L5L3P6P5p0p0j05l4L6J09P2P3m0m0m0m0l7l8r5r5j5N9J7J8J6
-2927a54J7o1J2k7k8L4L3J3o2r3K9M7k7J3Q7R6K2L2L0nmmml1l2L0L0K6K7K7K7n4n4PNQPL7
-2941E6L6j5j37j47p3k9k9L7L7P0P1o5o5j3j2K4K4P5P6L9L9K3K4j2j3o2o2o3o3N0N0rj31r6
-2954c65K5J01K7j3j3M3M3l1l1l1l1O9O9O8O9K0K1o4o4j5j5P1P0M2M3OOq4q3m7m7J3J3J3J3
$$ plain form
-2862 80 41 2 39 75 26 -22 2 27 8 -10 -19 -150 -254 -284 -299 -315 -289 -263 -288 -312 -275 -238 -177 -116 -117 -118 -90 -62 -34 -6 -15 -25 -88 -151 -202 -131
-2875 -131 -92 -53 -107 -161 -179 -197 -119 -42 -26 -10 -42 -74 -107 -139 -221 -303 -324 -344 -338 -331 -324 -317 -291 -265 -230 -269 -280 -218 -155 -166 -248 -257 -201 -145 -155 -166 -145
-2889 -145 -123 -125 -200 -238 -203 -150 -97 -60 -96 -140 -183 -232 -280 -274 -268 -257 -246 -254 -189 -160 -131 -170 -136 -139 -141 -155 -94 -2 16 4 -80 -198 -193 -194 -195 -152 -109 -84
-2903 -84 -58 -94 -130 -87 -44 -13 -56 -173 -169 -110 -125 -170 -215 -228 -241 -174 -107 -57 -129 -140 -151 -132 -114 -127 -139 -142 -23 85 71 -25 -122 -91 -61 -67 -73
-2915 -73 -8 57 127 124 17 -90 -109 -54 -19 14 90 165 95 25 -80 -114 -78 31 103 176 136 96 56 16 -21 -59 -154 -249 -264 -205 -188 -170 -154
-2927 -154 -137 -198 -186 -213 -241 -207 -174 -161 -223 -316 -287 -240 -267 -254 -167 -71 -49 -17 13 8 4 0 -4 -35 -67 -37 -7 19 46 73 100 46 -8 -1 4 12 19 56
-2941 56 92 77 -60 -207 -280 -309 -338 -301 -264 -194 -123 -188 -253 -266 -278 -254 -230 -155 -79 -40 -1 22 46 34 21 -41 -103 -166 -229 -179 -129 -138 -269 -365
-2954 -365 -340 -239 -212 -225 -238 -195 -152 -183 -214 -245 -276 -207 -138 -70 -1 19 40 -24 -88 -103 -118 -47 23 65 108 114 120 36 -47 -94 -141 -128 -115 -102 -89
-2966h9lmmlj3j2K4K4k1k2k2k1L8L8k3k3l2l1N4N4K1K0L2r0j43o9rqM8M7Q9J6l2l1l6l6L8
-2980b34L7L8L8k9k9LLL7l7l7L7j2j1j6N7O8nk0k1NN%%L8l6j05j05M7M6RJ0L1L1l0l1l1l2
-2993b81k7k8jP2P2kL0L0q5q5L9M0Q5J2nO9R0l0q4q4J8J8N7N7k9k9RRJ3J3o9MRo4j5N8M5M5
-3007b4oq0j16m3J2J1J6J6NOM6k7k1k2J1Q4P0n3M0J13J3J2m4m3k5k5l0l0N7j6l2l2NQ0M2l1
-3020f1k5k5J6Q8R9R9J1o3r9r7m2m2L1L1L1L1ppL0K9N3N4J7J6o9o8j30j30J7J7N3N4N4N3n
-3033A4j26n3O9L4m0LKlkN3N3pql4l5l4l5N9N8lll2l2o8o9K1K0N7N8n3n2RRPQl0k9Q3Q3kl
-3048e3L6L4jjj01j01j6j5M3M3M3M4mmL2L2J9J9m3m1l7l6l7l7J16J15m4m2j1j0k3r6k5R8O1
-3060d3j3J2o2l0M3r8r8J7J7L3L3O9P0J3J3k4r7o7N7O0j3M1M1nnl6j09J8J41L9l3%p4k5M8
$$ plain form
-2966 -89 -92 -96 -100 -103 -116 -128 -104 -80 -101 -123 -145 -166 -128 -90 -113 -136 -168 -199 -145 -91 -70 -50 -18 -108 -251 -320 -329 -337 -289 -242 -153 -137 -169 -200 -236 -272 -234
-2980 -234 -197 -159 -121 -150 -179 -176 -173 -136 -173 -210 -173 -185 -196 -212 -155 -87 -92 -112 -133 -128 -123 -123 -123 -85 -121 -226 -331 -284 -238 -229 -219 -188 -157 -187 -218 -249 -281
-2993 -281 -308 -336 -337 -265 -193 -195 -165 -135 -220 -305 -266 -226 -141 -129 -134 -65 25 -5 -89 -173 -155 -137 -80 -23 -52 -81 -72 -63 -50 -37 -106 -102 -93 -157 -172 -114 -69 -24
-3007 -24 -30 -110 -226 -269 -257 -246 -230 -214 -209 -203 -157 -184 -205 -227 -216 -132 -62 -115 -75 38 51 63 19 -24 -49 -74 -104 -134 -77 -93 -125 -157 -152 -72 -30 -61
-3020 -61 -86 -111 -95 -7 92 191 202 139 40 -57 -99 -141 -110 -79 -48 -17 -24 -31 -1 28 81 135 152 168 99 31 -99 -229 -212 -195 -142 -88 -34 19 14
-3033 14 -112 -165 -96 -62 -102 -99 -97 -100 -102 -49 4 -3 -11 -45 -80 -114 -149 -90 -32 -35 -38 -70 -102 -170 -239 -218 -198 -141 -83 -136 -188 -179 -170 -163 -155 -185 -214 -131 -48 -50 -53
-3048 -53 -17 17 16 15 -86 -187 -203 -218 -175 -132 -89 -45 -49 -53 -21 11 30 49 6 -35 -72 -108 -145 -182 -66 49 5 -37 -48 -58 -81 -177 -202 -104 -43
-3060 -43 -56 -44 -106 -136 -93 -191 -289 -272 -255 -222 -189 -120 -50 -37 -24 -48 -145 -212 -155 -95 -108 -67 -26 -31 -36 -72 -181 -163 -22 17 -16 -16 -90 -115 -67
-3073f7Q0Pk8k8j43j44m4m4J64J64K6K6o0o0J8J7N4N4j3j4n0n0L0L1J8R1Q6l7o6Pm7m8opk4
-3086a07k3O2O3J8J9j07j08p7M5Q7Q6J2J2k5k5L3L3M5p6o8PJ8J9ooooJ4J3J4J3q8q8K2K2J7
-3099a42J8J8J7l9m0O3O3N3o7j10J3P3%j2j3nooom6m5nmL8J11J38J7j2j1r1L0P0lj4j5j17
-3112h7j17qpM6M5M5M5L8L8KKq5q6%%M0M0N2J25M6p6j29n7M8M6J6J5k0j9n6n7l9m0J21J19
-3125D6k0j9j9j9RJ0m5m4p0N2K9m4q4j1P1lj6j6k1k0O8O8m2m2K2K2K2K1opo7o8J7J8m4m3M5
-3138b50M5M5M5kklkl2l1N4N4k6k7L5L5k8k9o4o5J7J7P8P8K2K3K1K2j0j0K7K7J2J1J2J2M8
-3151A59M9k7j51j48P2J46k4p3p1q4q3K7K7j0rk3k3k3k3Q1Q1J9J9O6O5k0j9j8j8j8j8j2j3
-3163i7M8M9o0o0N1N1J7J6j9k0j3j3K3K4KJKJKKKKj25j27nJ42R3J7j5j7J6J5m4m5K9L0np9
$$ plain form
-3073 -67 13 20 -8 -36 -179 -323 -367 -411 -247 -83 -57 -31 -91 -151 -133 -116 -62 -8 -21 -35 -85 -135 -105 -74 -56 35 121 84 18 25 -22 -70 -76 -83 -107
-3086 -107 -130 -68 -5 13 32 -75 -183 -260 -215 -128 -42 -30 -18 -43 -68 -35 -2 43 -33 -101 -94 -76 -57 -63 -69 -75 -81 -67 -54 -40 -27 -115 -203 -181 -159 -142
-3099 -142 -124 -106 -89 -128 -168 -105 -42 11 -56 -166 -153 -80 -80 -92 -105 -110 -116 -122 -128 -174 -219 -224 -228 -190 -79 59 76 64 53 -38 -8 62 59 45 30 -87
-3112 -87 -204 -212 -219 -173 -128 -83 -38 0 38 40 42 -43 -129 -129 -129 -89 -49 3 128 174 98 -31 -88 -40 6 22 37 17 -2 -58 -115 -154 -194 -73 46
-3125 46 26 7 -12 -31 -22 -12 -57 -101 -171 -119 -90 -134 -218 -229 -158 -161 -177 -193 -214 -234 -166 -98 -140 -182 -160 -138 -116 -95 -101 -108 -175 -243 -226 -208 -252 -295 -250
-3138 -250 -205 -160 -115 -117 -119 -122 -124 -156 -187 -133 -79 -105 -132 -97 -62 -90 -119 -183 -248 -231 -214 -136 -58 -36 -13 8 30 20 10 37 64 76 87 99 111 159
-3151 159 208 181 30 -118 -46 100 76 3 -68 -152 -235 -208 -181 -191 -200 -223 -246 -269 -292 -211 -130 -111 -92 -26 39 19 0 -18 -36 -54 -72 -84 -97
-3163 -97 -49 0 -60 -120 -69 -18 -1 15 -4 -24 -37 -50 -27 -3 -1 0 2 3 5 7 9 11 -114 -241 -246 -104 -11 6 -9 -26 -10 5 -39 -84 -55 -25 -30 -109
-3177a09j24K4J5n9m2m2j0j0N6N7J9K0J3J2N0M9L0L0K9L0N6N6p9p7l5l5l5l4LLl4l4N0N0J3
-3190i4J3m8m8J3J3O3O2j4j4j16L2Q4Q3j1j1p1p2qqK9K9L9M0k2k3MMj31j30Q8Q8K7K7K9L0
-3202b4K8K9q9r1O9O9k9k8QQq2q3k1k1N4N3J8J7J6J6k0k1rrr7N1J14M0k0j9k4k5k4k4lmL4
-3216a43L3J3J3J2J3L9L7L9L9j14j15R4R3jkl8l7l3l3l2l3k7k7N9O0j2j1j1j2m6m6m3J04L4
-3228a34L4M3M2l7l7%jL6L5jjq0q1N5N4J0J0J1J0K6K6K6K7o2o2jjk1k2M0M0m2m3ooR7R6o2
-3242A8o2j9k0RQk2j68q8O0J26N2j1q4q8j5N0N0P4P4J5n9j18K9N2N2m0m1m0m1m2m3O8O8O2
-3254a34O1J%o7o7o8o7N7N7N7N7q8q8M8M7P6P7J5J5l9l9l9l9RJ0RJ0M6M7M6M7MMj05j07k7
-3267a74k8RRM2M2M2M2o2o3k5k6J12J11P0n2l9l9j0j0o8o7O7O7ppppm1m2nmP3P4l2l2k1N3
$$ plain form
-3177 -109 -233 -209 -194 -253 -295 -337 -347 -357 -301 -244 -225 -205 -192 -180 -130 -81 -51 -21 8 38 94 150 71 -6 -41 -76 -111 -145 -142 -139 -173 -207 -157 -107 -94
-3190 -94 -81 -129 -177 -164 -151 -88 -26 -40 -54 -170 -138 -54 29 18 7 -64 -136 -144 -152 -123 -94 -55 -15 -37 -60 -56 -52 -183 -313 -225 -137 -110 -83 -54 -24
-3202 -24 4 33 -56 -147 -78 -9 -38 -66 -58 -50 -132 -215 -236 -257 -203 -150 -132 -115 -99 -83 -103 -124 -133 -142 -239 -188 -74 -34 -54 -73 -97 -122 -146 -170 -173 -177 -143
-3216 -143 -110 -97 -84 -72 -59 -20 17 56 95 -19 -134 -40 53 52 50 12 -25 -58 -91 -123 -156 -183 -210 -151 -91 -103 -114 -125 -137 -183 -229 -272 -168 -134
-3228 -134 -100 -57 -15 -52 -89 -89 -90 -54 -19 -20 -21 -101 -182 -127 -73 -63 -53 -42 -32 -6 20 46 73 11 -51 -52 -53 -74 -96 -56 -16 -58 -101 -107 -113 -16 80 18
-3242 18 -44 -63 -83 -74 -66 -88 -256 -344 -284 -158 -106 -117 -201 -289 -304 -254 -204 -130 -56 -41 -100 -218 -189 -137 -85 -125 -166 -206 -247 -289 -332 -264 -196 -134
-3254 -134 -73 -72 -72 -139 -206 -274 -341 -284 -227 -170 -113 -201 -289 -241 -194 -118 -41 -26 -11 -50 -89 -128 -167 -158 -148 -139 -129 -83 -36 10 57 61 65 -40 -147 -174
-3267 -174 -202 -193 -184 -142 -100 -58 -16 -78 -141 -166 -192 -80 31 101 49 10 -29 -39 -49 -117 -184 -117 -50 -57 -64 -71 -78 -119 -161 -166 -170 -97 -23 -55 -87 -108 -55
-3281e5Q4l6q0oL0L0KKKLK4K4K4K5n2n0n1n2k3k4Q7Q7K9L0pok2k2k2k2JKl5l6q7q7jjJ1J0
-3295b70J0J1M2M2ONn7n6P8P8J11J10JJrqr0q9nO8j0j0l0l0j08l5j5j6kJ21J49K5qqJ5J6p0
-3309c7p0k2k2k2k2k0j9J37O4q2rN6N6KJKJj5j6o1J2O4j0p0p0m2L2L1m2j08j09klN5N5N5N5
-3322a95J7J6J7J7PQPQJ8J9J9J9J0J0%j22k3J01Qo6j13l9l8l8p2J00J55Q1J2J1PPM1M2k0j9
-3335A2L9M0jp4p4jL1m3p3p3o3J1P1ll9l8QQ1np8M0M0k7k6J1J2J1J1P0O9No9r4k1J9J8L2L3
-3349a38L2L2k5k6q6q7nnN6N7M5M6RQj2j2m9m9K6K7j1j1L9L9k3k3L1L0poJ3J3ONrj31j27m
-3363c32K3R6N6N5K1j01m4P8Po7K0J9k5k5L6L6J8J8N5N5L1L3k9k8l3l4l4l4P3P2j4j2k3k3
-3375e6L9L7k3k5J3J2PRk7k9k6k6O0N9j1j1rj1k7k7k7k7k5k6k5k6P0P0QQo8o8O7O7M4M3m1
$$ plain form
-3281 -55 29 -7 -87 -93 -63 -33 -31 -29 -27 -24 0 24 48 73 21 -29 -80 -132 -155 -179 -92 -5 24 54 47 41 19 -3 -25 -47 -46 -44 -79 -115 -202 -289 -290 -291 -280 -270
-3295 -270 -260 -249 -207 -165 -159 -154 -211 -267 -189 -111 0 110 111 112 103 95 5 -84 -89 -21 -31 -41 -71 -101 -209 -244 -259 -275 -277 -156 -7 18 10 2 17 33 -37
-3309 -37 -107 -129 -151 -173 -195 -215 -234 -97 -33 -115 -124 -68 -12 -10 -9 -7 -6 -21 -37 -98 -86 -22 -32 -102 -172 -214 -182 -151 -193 -301 -410 -412 -415 -360 -305 -250 -195
-3322 -195 -178 -162 -145 -128 -121 -113 -106 -98 -80 -61 -42 -23 -13 -3 -3 -125 -148 -47 -39 -105 -218 -257 -295 -333 -405 -305 -150 -69 -57 -46 -39 -32 9 51 31 12
-3335 12 51 91 90 16 -58 -59 -28 -71 -144 -217 -280 -269 -198 -201 -240 -278 -270 -189 -194 -272 -232 -192 -219 -245 -234 -222 -211 -200 -130 -61 -56 -125 -219 -240 -221 -203 -171 -138
-3349 -138 -106 -74 -99 -125 -211 -298 -303 -308 -252 -195 -150 -104 -95 -87 -99 -111 -160 -209 -183 -156 -167 -178 -139 -100 -123 -146 -115 -85 -92 -98 -85 -72 -66 -61 -70 -201 -328 -332
-3363 -332 -309 -213 -157 -102 -81 -182 -226 -148 -141 -208 -188 -169 -194 -219 -183 -147 -129 -111 -56 -1 30 63 34 6 -27 -61 -95 -129 -56 16 2 -10 -33 -56
-3375 -56 -17 20 -3 -28 -15 -3 4 13 -14 -43 -69 -95 -35 24 13 2 -7 -18 -45 -72 -99 -126 -151 -177 -202 -228 -158 -88 -80 -72 -140 -208 -141 -74 -30 13 -28
-3389b8m2O5O3m6m5k7k6o3o3l6l7O6O7Q8l4j00j00L9M0L9M0rqN2N3o9o8qpO9O9m1m2qqP8P7
-3402a0KKJKn9n9N2N1k2k2k2k2M0M1LMM0M1k0k1jkl7l9j4j5K2K2oooojkjjpoL0L0opopj4j4
-3419g8P2P0p2p4p4p4PPl0k9J2J2P4P4K7K8rrOOPOp5p6p5p6O4O5KLKJO3O2L8L7k4k4J7J6J7
-3434dJ6LMMLj9j8j5j5kP1M6p6m4P8M3l0m3m2m8m7K7K8K7K8L7L8k3k3J8J7j9k0k3k4k4k4J1
-3448h4J1J2J1k7k7L4L4M2M3J6n8J3j09j14RjjO7O8N2N1J5J5k7k6o2o3o7o7M4M4RRRRn6n5
-3461b27P9P8L5L5n1n1noooO4O2K6K7q2q2q3q2mlL4L3N6N5nop0p0O5O5J08J06M7p6r7k4l7
-3475i8l6N4N4qpL2L0noq4q5k3k4ONM7M7J9R2Q3l9p2p4m5m4K3K2o3o2kkL5L5n3n4PQk4k4O1
-3489b74O2M1M1M1M1r3r4L2L3P2p4QRm7m6m7m7J4J3R9R9P3P2j2j3l3l3KLj1j0N0N0K6K6l5
$$ plain form
-3389 -28 -70 -5 58 12 -33 -60 -86 -149 -212 -248 -285 -219 -152 -64 -98 -198 -298 -259 -219 -180 -140 -149 -157 -105 -52 -121 -189 -197 -204 -135 -66 -107 -149 -157 -165 -87 -10
-3402 -10 -8 -6 -5 -3 -62 -121 -69 -18 -40 -62 -84 -106 -66 -25 -22 -18 22 63 43 22 21 19 -18 -57 -71 -86 -64 -42 -48 -54 -60 -66 -67 -69 -70 -71 -78 -84 -54 -24 -30 -37 -43 -50 -64 -78
-3419 -78 -6 64 -8 -82 -156 -230 -223 -216 -246 -275 -263 -251 -177 -103 -76 -48 -57 -66 -60 -54 -47 -41 -116 -192 -267 -343 -279 -214 -212 -209 -207 -206 -143 -81 -43 -6 -30 -54 -37 -21 -4
-3434 -4 12 15 19 23 26 7 -11 -26 -41 -43 28 74 -2 -46 32 75 45 2 -40 -88 -135 -108 -80 -53 -25 12 50 27 4 22 39 20 0 -23 -47 -71 -95 -84
-3448 -84 -73 -61 -50 -77 -104 -70 -36 6 49 65 7 20 -89 -203 -194 -195 -196 -129 -61 -9 42 57 72 45 19 -43 -106 -173 -240 -196 -152 -143 -134 -125 -116 -172 -227
-3461 -227 -148 -70 -35 0 -51 -102 -107 -113 -119 -125 -61 1 27 54 -28 -110 -193 -275 -279 -282 -248 -215 -159 -104 -109 -115 -185 -255 -190 -125 -17 89 136 60 -37 -61 -98
-3475 -98 -134 -80 -26 -34 -41 -9 21 16 10 -74 -159 -182 -206 -200 -195 -148 -101 -82 10 93 54 -18 -92 -137 -181 -158 -136 -199 -261 -263 -265 -230 -195 -248 -302 -295 -287 -311 -335 -274
-3489 -274 -212 -171 -130 -89 -48 -141 -235 -203 -170 -98 -172 -164 -155 -202 -248 -295 -342 -328 -315 -216 -117 -44 28 16 3 -30 -63 -61 -58 -69 -79 -29 21 47 73 38
-3502C8l5mmr0r0lmN8N8K9K8K7K9J5J6j3j58p6p6K5K5LMM0M0j9j9n7n6P4P4P4P3j4j3j4j4
-3516b9rj0m6m6o9o8J7J7J12J12r7r7J3J3J3J3rrrrK5K6K6K6k3k2k3k2L4L4R5R4n1m9o0n9
-3529a46M9r7p6p6Q1Q1J18J17noL2L1%J%%l7l7j%k3k3k3k3K8K9qqn4n3j6j7j5j5n2n1P7P7
-3542a41rrJ8J8N5N5j5j4j4j4l0l0l0l0K2K1K2K1O3O2JKq4q5k4k4n8n8K7K8J1J2J1J2O4O5
-3556g9K7K8j9j9k0j9K5K4K4K4jjjjo4o5K1K1OOOOk2k2J5J5L3L3L2L4K8K9l3l2KJj07j09j4
-3570a88j5P1P1mmm1m1%jL6L6nnnnQRRRLMLMM2M2m2m3j9j9M2M2K4K5j09j10K4K5K5K5k3k3
-3585a23k3k2ooL1L1L4L5n1n1j%j3J10K2n2j8r2j29n5J08J07l8l8K3K4K0K0K0K0qqqrP8P7
-3598IJ6J6o4o5O9O9l4l3k9l0qO5J1j11p4%m9n0M5M6M5M5M5M5QQM1M2NOn9n7n9n8j03j02N6
$$ plain form
-3502 38 3 -1 -5 -95 -185 -188 -192 -134 -76 -47 -19 8 37 52 68 55 -103 -179 -255 -230 -205 -202 -198 -158 -118 -137 -156 -213 -269 -195 -121 -47 26 12 -1 -15 -29
-3516 -29 -38 -48 -94 -140 -209 -277 -260 -243 -131 -19 -116 -213 -200 -187 -174 -161 -170 -179 -188 -197 -172 -146 -120 -94 -117 -139 -162 -184 -150 -116 -21 73 22 -27 -87 -146
-3529 -146 -97 -194 -270 -346 -265 -184 -66 51 46 40 72 103 103 104 104 104 67 30 29 29 6 -17 -40 -63 -35 -6 -14 -22 -76 -129 -145 -162 -177 -192 -244 -295 -218 -141
-3542 -141 -150 -159 -141 -123 -68 -13 -28 -42 -56 -70 -100 -130 -160 -190 -168 -147 -125 -104 -41 21 22 24 -60 -145 -169 -193 -251 -309 -282 -254 -243 -231 -220 -208 -144 -79
-3556 -79 -52 -24 -43 -62 -82 -101 -76 -52 -28 -4 -5 -6 -7 -8 -72 -137 -116 -95 -89 -83 -77 -71 -93 -115 -100 -85 -52 -19 13 47 75 104 71 39 41 42 -65 -174 -188
-3570 -188 -203 -132 -61 -65 -69 -110 -151 -151 -152 -116 -80 -85 -90 -95 -100 -92 -83 -74 -65 -62 -58 -55 -51 -9 33 -9 -52 -71 -90 -48 -6 18 43 -66 -176 -152 -127 -102 -77 -100 -123
-3585 -123 -146 -168 -174 -180 -149 -118 -84 -49 -100 -151 -152 -152 -165 -55 -33 -85 -103 -195 -324 -379 -271 -164 -202 -240 -217 -193 -173 -153 -133 -113 -121 -129 -137 -146 -68 9
-3598 9 25 41 -23 -88 -19 50 16 -17 -46 -76 -84 -19 -8 -119 -193 -193 -242 -292 -247 -201 -156 -111 -66 -21 -13 -5 36 78 83 89 30 -27 -86 -144 -247 -349 -293
-3611b93N7mnnmJ6J5k1k1MLMLjjO0O0K7K8rrj2j2j3j2M3M4PPK5K5n9o0j4j4M7M7J%N3N4Qj13
-3627d4j15QJ2J1K0J9M0M0L8M0o1o0k5k4j8j7O8O8o5o5j26j26nmN7N7L1L2L2L1J6J5k1k1n1
-3639b13n1j4j4L5L6L6L5n5n6L0L1k0j9M1M2Q9Q9jj23l2l3m0m0P2P3J1J1m6m6m6m7K2K2K2
-3652a99K2o4o3k7k7L7L7K5R9J37J4p1p2n3n4N7N7j7j7O9O9m4m4J8J7K2K2o4o4k0j9M1M2J9
-3664a15J9j8j9M3M2k0j9o3o3k6k6K8K8K8K8N1N2l5l4p0p0qrN4N3N4N3RRk8k8L3L4K4r9l7
-3677a45Q5N4j9p4%J1J1N9j3j11J3Q7l5o9o9K9K8qrK3K2N4N5oq0qJ14O5j05o3o4o0o1P5P4
-3690a40N7N7n4n3K7K7K7K7m2m1m2m2ppP9P9L3L1lmllkkn4n4Q1Q0MMn7n6mmL2L2mnnmm0l9
-3705i4r6r6N9J32R8k3POl3l3m2L2K7r6o5RJ3J3J16po8N5M8M8J9K0N0N1o0o0n4n5OOK6K5j2
$$ plain form
-3611 -293 -236 -240 -245 -250 -254 -238 -223 -244 -265 -261 -258 -254 -251 -252 -253 -193 -133 -106 -78 -87 -96 -108 -120 -133 -145 -102 -58 -51 -44 -19 6 -53 -113 -127 -141 -94 -47 -46 -46 7 61 69 -44
-3627 -44 -159 -151 -139 -128 -108 -89 -49 -9 29 69 8 -52 -77 -101 -119 -136 -68 0 -65 -130 -256 -382 -387 -391 -334 -277 -246 -214 -182 -151 -135 -120 -141 -162 -213
-3639 -213 -264 -278 -292 -257 -221 -185 -150 -205 -261 -231 -200 -220 -239 -198 -156 -67 22 21 -102 -134 -167 -207 -247 -175 -102 -91 -80 -126 -172 -218 -265 -243 -221 -199
-3652 -199 -177 -241 -304 -331 -358 -321 -284 -259 -160 -23 -9 -80 -152 -205 -259 -202 -145 -162 -179 -110 -41 -85 -129 -111 -94 -72 -50 -114 -178 -198 -217 -176 -134 -115
-3664 -115 -96 -114 -133 -90 -48 -68 -87 -150 -213 -239 -265 -237 -209 -181 -153 -102 -50 -85 -119 -189 -259 -267 -276 -222 -169 -115 -62 -53 -44 -72 -100 -67 -33 -9 -108 -145
-3677 -145 -60 -6 -25 -99 -99 -88 -77 -18 -31 -142 -129 -42 -77 -146 -215 -186 -158 -166 -175 -152 -130 -76 -21 -27 -107 -115 -1 64 -41 -104 -168 -228 -289 -214 -140
-3690 -140 -83 -26 -80 -133 -106 -79 -52 -25 -67 -108 -150 -192 -199 -206 -127 -48 -15 16 13 9 6 3 1 -1 -55 -109 -28 52 56 60 3 -53 -57 -61 -29 3 -1 -6 -11 -15 -55 -94
-3705 -94 -190 -286 -227 -95 3 -20 -13 -7 -40 -73 -115 -83 -56 -152 -217 -208 -195 -182 -66 -73 -141 -86 -38 10 29 49 99 150 90 30 -24 -79 -73 -67 -41 -16 -28
-3719b8j1O7O8o6o6rrm6m6k1k2k2J24K6m7n8n9J7J6J6J6M5M4j2j2N1J23Q0o7J1J2KLk3k3o0
-3732A4n8m2m1nnL4L3llj1j0m8m8L6L6k5k6jkkjQ5Q5k6k5j17j16M3M2kkl9m0j9j9k0j9R3R3
-3746a81m1m2P4P5J2J3j5j4K2K2L8L7JJM6M6o5o4l2l3NML2L2L1L1k7k7k8k8N4N2l1l3mmL3
-3759hL1n1n2n3n2OPn5n5j5j6P0P0QQl0k9%jjjl1l2NOLLLLk8k9k8k8N4N4N9N8o3J1P5m7j0
-3775a81rj7j7k4k4L7L7J7J8J2J3O0j3j06J6J24N1l8j12q0oN8N9L9M0m6m6KJL8L9r9r8O1O1
-3787a33J7J7k0k0NNNON5N6l0l1l7l7%jK0K0m1m1J9J9J9K0m7m6M0M0J0J1j00j00L3L2L3L2
-3800a70NNM1M2ONOOq3q2m6m5%%l6l7K5K4K4K4O3O4k3k2K9L0L0K9m3m4J8J8o5o4k7k8J66J65
-3814A0L1L1qpj2j2K3n1q3M0P3JN1N0m9m8m8m8kjkjj4j3M9M7J18J18r1r0o9p0J6J5o3o4lk
$$ plain form
-3719 -28 -39 28 96 30 -36 -45 -54 -100 -146 -167 -189 -211 -87 -61 -108 -166 -225 -208 -192 -176 -160 -115 -71 -83 -95 -44 79 159 92 103 115 117 120 97 74 14
-3732 14 -44 -86 -127 -132 -137 -103 -70 -73 -76 -87 -97 -145 -193 -157 -121 -146 -172 -173 -175 -177 -178 -93 -8 -34 -59 -176 -292 -249 -207 -209 -211 -250 -290 -309 -328 -348 -367 -274 -181
-3746 -181 -222 -264 -190 -115 -103 -90 -105 -119 -97 -75 -37 0 1 2 48 94 29 -35 -67 -100 -95 -91 -59 -27 4 35 8 -19 -47 -75 -21 31 0 -33 -37 -41 -8
-3759 -8 23 -28 -80 -133 -185 -179 -172 -227 -282 -297 -313 -243 -173 -165 -157 -187 -216 -216 -217 -218 -219 -250 -282 -277 -271 -268 -265 -262 -259 -287 -316 -344 -372 -318 -264 -205 -147 -210 -199 -124 -171 -181
-3775 -181 -190 -207 -224 -248 -272 -235 -198 -181 -163 -151 -138 -78 -91 -197 -181 -57 -6 -44 -156 -236 -242 -184 -125 -86 -46 -92 -138 -136 -135 -97 -58 -157 -255 -194 -133
-3787 -133 -116 -99 -119 -139 -134 -129 -124 -118 -63 -7 -37 -68 -105 -142 -142 -143 -123 -103 -144 -185 -166 -147 -128 -108 -155 -201 -161 -121 -111 -100 -200 -300 -267 -235 -202 -170
-3800 -170 -165 -160 -119 -77 -71 -66 -60 -54 -137 -219 -265 -310 -310 -310 -346 -383 -358 -334 -310 -286 -223 -159 -182 -204 -175 -145 -115 -86 -129 -173 -155 -137 -202 -266 -293 -321 -155 10
-3814 10 41 72 64 57 45 33 56 5 -78 -38 35 36 87 137 88 40 -8 -56 -58 -59 -61 -62 -76 -89 -40 7 125 243 152 62 -7 -77 -61 -46 -109 -173 -176 -178
-3828a78K4K5j3j2n2n1L4J57N2k2K7K7k2k2k2k3PPPQm2m1M5M4KKKKn4n5n5n4Q0Q1l0l0m6m7
-3842b38L9L9M9M8M9M8l2l1o9o9L1L1onQ0P9Q9K12M06K84o3k34j64m1q4q4j04j04L1L1n2n3
-3853A13q9q9L1L2L0L1K3K2l8l9l8l8kkp8p9N7N6qqP9P7J1J1J2J1o6o4nmnnj8r1n1P2N9N9
-3867c1q2q1m5m5jjL6L6M2M3oO7P3m9O0O1k2k3L9L9l8l8k5r9qJ13K5m8l3M0k5r9J1J0OOpp
-3881a06K3K2N6o6r9k7j2j1K9K9O2O2K4K4n8o0m2Q0P0P0R1l2j64r0j16m2J06J77O3j09q3M0
-3893h9L7L8lj25j25lj7j7K8K8J30J28k8l0n4n3j7j7m5m6kjm7P5J09L5l2l2K5K5P5P4l4l5
-3905d5m5m5qrj3j3j3j3N6N7nmQRM6M4N2N1j07j07o4o3P1P2M9M9n9o1j7j7K0J9P7P5l4l3l6
-3918e6l5K5K6J7J7P7P9KKJKk6k7o3o3j4j3K2K3j7j7n3n4m5m4M1M1L0L0ppJ1J2J2J1l3l3j06
$$ plain form
-3828 -178 -154 -129 -142 -154 -206 -257 -223 -66 -14 -36 -9 18 -4 -26 -48 -71 -64 -57 -50 -42 -84 -125 -80 -36 -34 -32 -30 -28 -82 -137 -192 -246 -166 -85 -115 -145 -191 -238
-3842 -238 -199 -160 -111 -63 -14 34 2 -29 -98 -167 -136 -105 -111 -116 -36 43 132 344 750 1034 971 737 573 532 448 364 260 156 187 218 166 113
-3853 113 24 -65 -34 -2 28 59 82 104 66 27 -11 -49 -51 -53 -131 -210 -153 -97 -105 -113 -34 43 54 65 77 88 22 -42 -47 -51 -56 -61 -79 -170 -221 -149 -90 -31
-3867 -31 -113 -194 -239 -284 -285 -286 -250 -214 -172 -129 -135 -68 5 -44 16 77 55 32 71 110 72 34 9 -90 -98 15 40 -8 -41 -1 -26 -125 -114 -104 -98 -92 -99 -106
-3881 -106 -83 -61 -5 -71 -170 -197 -209 -220 -191 -162 -100 -38 -14 10 -48 -108 -150 -70 0 70 161 129 -35 -125 -241 -283 -177 0 63 -46 -129 -89
-3893 -89 -52 -14 -17 -142 -267 -270 -287 -304 -276 -248 -118 10 -18 -48 -102 -155 -172 -189 -234 -280 -282 -283 -330 -255 -146 -111 -143 -175 -150 -125 -50 24 -10 -45
-3905 -45 -90 -135 -143 -152 -165 -178 -191 -204 -148 -91 -96 -100 -92 -83 -37 7 59 110 3 -104 -168 -231 -160 -88 -39 10 -49 -110 -127 -144 -124 -105 -28 47 13 -20 -56
-3918 -56 -91 -66 -40 -23 -6 71 150 152 154 155 157 131 104 41 -22 -36 -49 -27 -4 -21 -38 -91 -145 -190 -234 -193 -152 -122 -92 -99 -106 -95 -83 -71 -60 -93 -126 -232
-3932b32J6J23M9j7j7No8l4Q8L9L9J2j09k5R7m1m0J0J1M7M7M3M2j8j9n3n4QPRJ0RJ0k9k9n8
-3945a22n7j13J0J01J01J3J2P3P5m6m5qrppP9P9k6k6k6k6K6K6l6l5jjjjopqpM3M4M4M4j22
-3959B7j21J2J3m9n0O1O1L1K9l0l1m0m0K1K1n1n1j5j5L2L3nnM5M4M4M3j7j9j9j8l6l5P5P3
-3972A8L8L9k4k3mmmlq3q4l9l9j4J09J14rn8J6O9mQQn7n9q3q4m6m7P8P8P7P8k4k4k4k4l1l0
-3986a95l1l1L9L8KJO1O0n0n0L9L9KKn5n6P9P9k9l0l0k9L7L7L7L7P2P3Oj16j13j13L8L8K8
-3998h4K8J12J14l8l8j02j04q9L4Q8Q7j8k0J8J6n6n7r3r4M0M0LLllP1P0j10j11J3J2K3K3K2
-4011b03K3R1R0J7J7k9k8k9k9p8p9nnN1N2Q8Q8k8k7QRj1j1J0Q3P7r5j15j16p6p7p1N1J20J21
-4023a16OOR6R4k7k7k9k7PQJ6J6n6n8rrq3q3L9L8L8L9qrO6O6n0m9j3j3J0J0M7M7n6n6n6n6
$$ plain form
-3932 -232 -216 -93 -44 -61 -78 -73 -141 -175 -87 -48 -9 3 -106 -131 -34 -75 -115 -105 -94 -47 0 43 85 67 48 -5 -59 -51 -44 -35 -25 -16 -6 -35 -64 -122
-3945 -122 -179 -292 -282 -181 -80 -67 -55 18 93 47 2 -6 -15 -22 -29 50 129 103 77 51 25 51 77 41 6 5 4 3 2 -4 -11 -19 -26 17 61 105 149 27
-3959 27 -94 -82 -69 -118 -168 -107 -46 -15 14 -16 -47 -87 -127 -106 -85 -136 -187 -202 -217 -185 -152 -157 -162 -117 -73 -29 14 -3 -22 -41 -59 -95 -130 -55 18
-3972 18 56 95 71 48 44 40 36 33 -50 -134 -173 -212 -226 -117 -3 -12 -70 -54 15 11 19 27 -30 -89 -172 -256 -302 -349 -271 -193 -116 -38 -62 -86 -110 -134 -165 -195
-3986 -195 -226 -257 -218 -180 -178 -177 -116 -56 -106 -156 -117 -78 -76 -74 -129 -185 -106 -27 -56 -86 -116 -145 -108 -71 -34 3 75 148 154 38 -75 -188 -150 -112 -84
-3998 -84 -56 56 170 132 94 -8 -112 -201 -167 -79 8 -10 -30 -12 4 -52 -109 -202 -296 -256 -216 -213 -210 -213 -216 -145 -75 -185 -296 -283 -271 -248 -225 -203
-4011 -203 -180 -89 1 18 35 6 -22 -51 -80 -158 -237 -242 -247 -196 -144 -56 32 4 -23 -15 -6 -17 -28 -18 65 142 47 -68 -184 -260 -337 -408 -357 -237 -116
-4023 -116 -110 -104 -8 86 59 32 3 -24 -17 -9 7 23 -33 -91 -100 -109 -192 -275 -236 -198 -160 -121 -129 -138 -72 -6 -56 -105 -118 -131 -121 -111 -64 -17 -73 -129 -185 -241
-4037b41o3o2O0O1P3P3%%kkl8l9l6l6l7l6K4K5n0m9L0L1L0L1N6N7j8j7n8n9O4O4P1P0lll8
-4051f7l7jjj8j8N1N0K3n1p9M4P6P5l9l9K6K4K5K5MMPj15m6P6O7n4l9l9K6K7j5j5n1n2J5J5
-4064a16k2k1k4k4M9N0nnL2L2k1k1J5J6J4J3N0N0L0K9ppj02j01K0K1N4N3J7J8L4L5q9q7l5
-4077e5l5n7j30p0J02J15M2ONJJl2l2l1l2K8K8Mp0q7L5L5L5M9N0k4k4J0J0M7M7j0j1O2O3m9
-4090B6m9m9m9k6k6M8M8n5n5L1L1N6N5nom2m2m7m6k3r7o2N9J39J39J2J1J5J4J5J4J5J5J4J5
-4103I3mnm1m1l7l8l8l8j6j7M5M5opopK5K5K0K1J7n6q4L9O2O2L3L4j%%jr0r2J9J9O8O9j7j7
-4117C7m7m9m8m8m3m4R2R1RRk8k8N8N7N9N8q9q8K1K1opopOPM2M3m4m4M1M1n8n8LLjko3o3q4
-4132b57q4N0N1J00J00J4J4l8l9kkJ3J3QQn6j29j00K3J73J00Q1Q3l7j09n4K0P1kl8L4Ro4j9
$$ plain form
-4037 -241 -304 -366 -306 -245 -172 -99 -99 -99 -101 -103 -141 -180 -216 -252 -289 -325 -301 -276 -326 -375 -345 -314 -284 -253 -197 -140 -158 -175 -233 -292 -228 -164 -93 -23 -26 -29 -67
-4051 -67 -104 -105 -106 -124 -142 -91 -41 -18 -69 -148 -104 -28 47 8 -31 -5 19 44 69 73 77 84 -31 -77 -1 66 12 -27 -66 -40 -13 -28 -43 -94 -146 -131 -116
-4064 -116 -138 -159 -183 -207 -158 -108 -113 -118 -86 -54 -75 -96 -81 -65 -51 -38 12 62 92 121 114 107 5 -96 -76 -55 -1 52 69 87 121 156 67 -20 -55
-4077 -55 -90 -147 -277 -347 -245 -130 -88 -82 -77 -76 -75 -107 -139 -170 -202 -174 -146 -142 -212 -299 -264 -229 -194 -145 -95 -119 -143 -133 -123 -76 -29 -39 -50 12 75 26
-4090 26 -23 -72 -121 -147 -173 -125 -77 -132 -187 -156 -125 -69 -14 -19 -25 -67 -109 -156 -202 -225 -322 -384 -325 -186 -47 -35 -24 -9 5 20 34 49 64 78 93
-4103 93 89 84 43 2 -35 -73 -111 -149 -165 -182 -137 -92 -98 -105 -111 -118 -93 -68 -48 -27 -10 -66 -150 -111 -49 13 46 80 79 79 79 78 -12 -104 -85 -66 2 71 54 37
-4117 37 -10 -59 -107 -155 -198 -242 -150 -59 -50 -41 -69 -97 -39 18 77 135 46 -42 -21 0 -6 -13 -19 -26 -20 -13 29 72 28 -16 25 66 8 -50 -47 -44 -45 -47 -110 -173 -257
-4132 -257 -341 -291 -240 -140 -40 -26 -12 -50 -89 -91 -93 -80 -67 -59 -51 -107 -236 -336 -313 -140 -40 41 124 87 -22 -76 -56 15 13 -25 9 18 -46 -65
-4144f5j9qqqqj9j9M2M3k6k6J1J1K0J9K0J9O5O5K4K5k9j02q9r0m1Q2Q6J3J3n8o0n9pqK9L0
-4158a32P8P7J20M6opj1j1q0p8j25n2L8l4k6k6noooP0O9Q5J58L7l6k7k7n3n1n7n7N9j4n1K2
-4171a25l0l0o8PM4M5M5M4P9Oo1o3o6o7kP2N4k0p6lR6R6l4l4j9k0j9k0OOK1R5J57Q4k9j02
-4184F9n2P0L9l5o6o6o3o3o1O1J19M6n8n8kjM5M5m1m0K7K8K7K8N5N7nmq6q5q6q5Q5Q5M8M8
-4197B5onl6l8K6R8M5p7j27n3Q1Q1onmnn9n9k2k2p5p6J0J1O1O2O1O2m0m1K1K1L8L7JJO2O4
-4211A12m7m6K4K5j1j2m2m1m2m1M8M9j3j2qpo9o8R8R9J1J3m1m3onL8L7KJO3O3m7m8J8J7Q5
-4224A54q7r1L0J03L0j00r9j9j9P9P8J8J8p7p6j6j6j9j9J8J8j0j0q8j5N2N1nnj7j7M0M0O2
-4237a4j1O6O6j9j9j9j9m5m6q7j4NNJ4J4M3J15N6j9p5p7K5K5J9n4n4J9R2R1j4j4oon2K1J00
$$ plain form
-4144 -65 -84 -92 -100 -108 -116 -135 -154 -112 -69 -95 -121 -110 -99 -79 -60 -40 -21 44 109 133 158 129 27 -62 -152 -193 -111 -25 -12 1 -57 -117 -176 -183 -191 -162 -132
-4158 -132 -54 23 143 189 183 176 165 154 74 -4 -129 -181 -143 -177 -203 -229 -234 -240 -246 -252 -182 -113 -28 130 167 131 104 77 24 -27 -84 -141 -82 -96 -147 -125
-4171 -125 -155 -185 -253 -246 -202 -157 -112 -68 11 17 -44 -107 -173 -240 -242 -170 -116 -136 -212 -215 -119 -23 -57 -91 -110 -130 -149 -169 -163 -157 -136 -41 116 200 171 69
-4184 69 17 87 126 91 25 -41 -104 -167 -228 -167 -48 -2 -60 -118 -120 -121 -76 -31 -72 -112 -85 -57 -30 -2 53 110 105 101 15 -70 -156 -241 -156 -71 -23 25
-4197 25 19 14 -22 -60 -34 64 109 32 -95 -148 -67 14 8 3 -1 -6 -65 -124 -146 -168 -243 -319 -309 -298 -237 -175 -114 -52 -92 -133 -112 -91 -53 -16 -15 -14 48 112
-4211 112 65 19 43 68 57 45 3 -38 -80 -121 -73 -24 -37 -49 -57 -64 -133 -201 -103 -4 7 20 -21 -64 -70 -75 -37 0 2 3 66 129 82 34 52 69 154
-4224 154 67 -24 6 109 139 39 -60 -79 -98 -19 59 77 95 18 -58 -74 -90 -109 -128 -110 -92 -102 -112 -200 -215 -163 -112 -117 -122 -139 -156 -116 -76 -14
-4237 -14 -25 41 107 88 69 50 31 -14 -60 -147 -161 -156 -151 -137 -123 -80 35 91 72 -3 -80 -55 -30 -11 -65 -119 -100 -8 83 69 55 49 43 -9 12 112
-4250A12K7p9nM3M3n5n6q7L4R4k7n7n7k8M6N5o5o9N3J03j9o8NK1K1K0K1L5l8l2l3nnm1m2K6
-4263a09K5K5K5L4L4M2p9n4n4o1o1K9K9m7P5O5n7o2o2RQ2L6L6Q3Rn9o0RRM1M1J9n6r5r5oO8
-4276a92Q3Q4qq2m0m0Q1Q1M4M4j3j3m9n0m0m0r6N2J10l7n6n6K2K2j6j5K6K7k9J18J07l8n7
-4288f6n8M0M0MLL1K9L1L1l9l9kkO1O2m9m9K0K0m1m0j1j0m7m7%%l7l7L2L3L3L3l4l4K7K7O3
-4302b2O2K6K5j5j6n2n1m9m8j2j2N9N9J44J44KJl5l5o3o3r8j00J6J7N3N3J9K0j8j6K7K7l3
-4314A6l3K7K7l3l3o9o9qpJ00R8J4J4P0P1q9q9k2k2k3k2l3l4K8K8j8j9j8j8kkl9l9j7j7M4
-4328b38M5n5n5P9Q0K5K4O2O0ppm3m4L7L7P3P4p9p7m2m2ONNNl4l3P7P6o5o6nnn2n2L5L4J09
-4341e3J08P3n0r5k2L5L4K8m5p1N0L9M1M9M8l1l1L0L0p2p2L9L8N7N7mnJ4J4m7m8o9o9M0M1
$$ plain form
-4250 112 139 60 55 98 141 86 30 -57 -23 71 44 -13 -70 -98 -52 3 -62 -131 -78 25 6 -62 -57 -36 -15 5 26 61 23 -9 -42 -47 -52 -93 -135 -109
-4263 -109 -84 -59 -34 0 34 76 -3 -57 -111 -172 -233 -204 -175 -222 -147 -82 -139 -201 -263 -254 -172 -136 -100 -17 -8 -67 -127 -118 -109 -68 -27 -8 -64 -159 -254 -260 -192
-4276 -192 -109 -25 -33 -115 -155 -195 -114 -33 11 55 42 29 -20 -70 -110 -150 -246 -194 -84 -121 -177 -233 -211 -189 -205 -220 -194 -167 -196 -78 29 -9 -66
-4288 -66 -124 -84 -44 -40 -37 -6 23 54 85 46 7 5 3 64 126 77 28 48 68 27 -13 -24 -34 -81 -128 -128 -128 -165 -202 -170 -137 -104 -71 -105 -139 -112 -85 -22
-4302 -22 40 66 91 76 60 8 -43 -92 -140 -152 -164 -105 -46 98 242 244 245 210 175 112 49 -49 -149 -133 -116 -63 -10 9 29 11 -5 22 49 16
-4314 16 -17 10 37 4 -29 -98 -167 -175 -182 -82 16 30 44 114 185 96 7 -15 -37 -60 -82 -115 -149 -121 -93 -111 -130 -148 -166 -168 -170 -209 -248 -265 -282 -238
-4328 -238 -193 -248 -303 -224 -144 -119 -95 -33 27 20 13 -30 -74 -37 0 73 147 68 -9 -51 -93 -87 -82 -77 -72 -106 -139 -62 14 -51 -117 -122 -127 -179 -231 -196 -162 -53
-4341 -53 55 128 78 -17 -39 -4 30 58 13 -58 -8 31 72 121 169 138 107 137 167 95 23 62 100 157 214 210 205 219 233 186 138 69 0 40 81
-4354H1j9k0j9j9K8K7n8n7p0p0M0M0M0L9p1p1N4N3N4N2m1m2m2m2L2L1L2L2%jL6L6k4k5L7L6
-4367H9qrqrn3n3j6j7k2k2k2k2L0L1L0L0N2N4qqm7m8l6L8J03j9p1JK9K9K2R5Pj16p9p9n6n7
-4381b45L3J06J17M5k0k0m5m6O4O4n1n0L5L5l6l7m7K8L5l8RQO5O7l6L7MNJ4o0p7p7o3J2L0
-4394a35L1L5L5l0l0J03J05J5J4J4J4M7M7Kp2n2n1n6n6N3N3l3l2M5M6M1M1M0l3r5k1K4K4q2
-4406E1q0l5l5K7K7MNM0M1j6j5j5j6j8j9J8J8J7J6J7J7J3J2J3J2POr7r6r2L1Q9J5L0K9K6K6
-4419G3n4n2Q0Q2NMn7n6j7j6n4n3m0m0M3J64P4m8l3l2J3J3J2J3K2K2K2K2m6m5J5J6m8m6O2
-4432B0O3kln1K2M7p5p9ol2l2N9N9P4P6L9L9J4J5p1p1o4o3llL0L1L0L1J7J7J7J7nnm2m2k4
-4446D4k4J3J2n5n7P7P8q3q2N2N1J8J9j9j8J0J0k7k5%%%JK0K1j6j6kjL5L6k2k1k1k1j0j0j0
$$ plain form
-4354 81 62 42 23 4 32 59 1 -56 -126 -196 -156 -116 -76 -37 -108 -179 -125 -72 -18 34 -7 -49 -91 -133 -101 -70 -38 -6 -6 -7 29 65 41 16 53 89
-4367 89 81 72 64 55 2 -51 -67 -84 -106 -128 -150 -172 -142 -111 -81 -51 1 55 47 39 -8 -56 -92 -54 49 30 -41 -40 -11 18 40 135 142 26 -53 -132 -188 -245
-4381 -245 -212 -106 11 56 36 16 -29 -75 -11 53 2 -48 -13 22 -14 -51 -98 -70 -35 -73 -64 -56 9 76 40 77 81 86 100 40 -37 -114 -177 -165 -135
-4394 -135 -104 -69 -34 -64 -94 9 114 129 143 157 171 218 265 267 195 143 92 36 -20 33 86 53 21 66 112 153 194 234 201 106 85 109 133 51
-4406 51 -29 -64 -99 -72 -45 -41 -36 4 45 29 14 -1 -17 -35 -54 -36 -18 -1 15 32 49 62 74 87 99 106 112 15 -81 -173 -142 -53 -38 -8 21 47 73
-4419 73 19 -33 47 129 134 138 81 25 8 -8 -62 -115 -155 -195 -152 12 86 38 5 -27 -14 -1 11 24 46 68 90 112 66 21 36 52 4 -42 20
-4432 20 83 81 78 27 49 96 21 -58 -64 -96 -128 -69 -10 64 140 179 218 232 247 176 105 41 -22 -25 -28 2 33 63 94 111 128 145 162 157 152 110 68 44
-4446 44 20 33 45 -10 -67 10 88 5 -77 -25 26 44 63 44 26 36 46 19 -6 -6 -6 -6 -5 15 36 20 4 2 1 36 72 50 29 8 -13 -23 -33 -43
-4460d3j0K9K9opO0O1K5K4oom4m3p6p7J30J31M7M7l9l9m3m3pok8k8RRj6j6M5M5L5L6p6p5J4
-4474D2J4J4J4KJn9n9QQQPL9L9k3k2kkLLk9M5J10j3j00r9K7K6L5L5kkp9q0N5N4L9L9p1p1J5
-4488c1J6J5J4L1L1l0l0J6J7K9J03M6p7m0m0l9l8K1K3m0m0M4M5J9J9n9n9q4L8l1l1m9m8L7
-4501b02L8opOJ29J18M7j6j5m3m3J9J8rj0K7K8N8N9k7k7o8o8o7o8j4j3n1n0J5J6J01J02J03
-4513H0J05O7O8r4r4qql7l6k5N0K4r6r3K9R8R9O6O5k5r9r4K8N8j7n3n2LLL9M0P6P6O3n9p8
-4526A69nj2q6j4j4j8j9l5l7K5K4K9L0L0L0JJKJK1K2j5j5l6l6l2l0M6J21O8n6j03k9PQl4l3
-4539b4K6K7Q4Q4p6p6N9N8n2n2l5l5l6l6rrrrK6K5K6K6%JO0O2ppppJ0Rk8k7k4k3Q6Q7o1o1
-4554D6M9M9MLLLk9l0PPO7O7NNp3p4l6l7jj%jM4M3j7r1l3Q9O1j1q3j0OOL4L5k2k2m4K9O5n8
$$ plain form
-4460 -43 -53 -24 5 -1 -8 52 113 138 162 156 150 106 63 -13 -90 40 171 218 265 226 187 144 101 94 88 60 32 41 50 34 18 63 108 143 179 103 28 42
-4474 42 56 70 84 86 87 28 -31 -23 -15 -7 0 39 78 55 33 31 29 32 35 6 51 161 148 48 -51 -24 2 37 72 70 68 -11 -91 -36 18 57 96 25 -46 -31
-4488 -31 -15 0 14 45 76 46 16 32 49 78 181 227 150 110 70 31 -7 14 37 -3 -43 1 46 65 84 25 -34 -118 -80 -111 -142 -191 -239 -202
-4501 -202 -164 -170 -177 -171 -42 76 123 107 92 49 6 25 43 34 24 51 79 137 196 169 142 74 6 -61 -129 -143 -156 -207 -257 -242 -226 -125 -23 80
-4513 80 185 252 320 226 132 124 116 79 43 18 68 92 -4 -97 -68 30 129 195 260 235 136 42 70 128 111 58 6 9 12 51 91 167 243 306 247 169
-4526 169 164 152 66 52 38 20 1 -34 -71 -46 -22 7 37 67 97 98 99 101 102 123 145 130 115 79 43 11 -19 27 148 216 160 57 28 35 43 9 -24
-4539 -24 2 29 113 197 121 45 104 162 110 58 23 -12 -48 -84 -93 -102 -111 -120 -94 -69 -43 -17 -17 -16 44 106 99 92 85 78 88 97 69 42 18 -5 81 168 107 46
-4554 46 95 144 148 151 154 157 128 98 105 112 179 246 251 256 183 109 73 36 35 34 34 33 77 120 103 12 -21 68 129 118 35 25 31 37 71 106 84 62 18 47 112 54
-4569E4p5M5P3jJ1J1POj2j1m1m1k6R6R6k6mlj2j1pqppk7k7L5L4K5K5q6q6lmL1L2L8L8m8m8
-4584C6K3K3K3K3p7p6Q1Q2QRp8p7J4J5J4J5k0k0k0k0jjjjO5O6K9K9l3l3l4l3L8L7L7L8j5j5
-4598A50j4j5k3k3k3k3J5J5J4J5K1K1j6j6K4K5l7l6jkq1q3n9J4J0RO3O1k2k4L7L6L8L7J2J2
-4611A31k8j01M8J22L9L9k7k7n9n9nO8J29N6k4k5QQookp5m5m5j8j7J9n5r0j8O7O7Qo6j27n4
-4624a70J34J32M3M3jp5n6n4KKkjR1J66JKrq3j1O2lp8n6n5m0L2l0l2J49P6j5j5n6n6J3J2r0
-4637b8j7O8O9o1o0K2K2n0K3M6J21J17pn3n3j6N7K2K2j0j0n4n4j8j7K4K4K4K3j5j6n6J6J01
-4649B06J01J7n7r6k1k5J22J20k6j19j18m8m8j0j1kkL4L5N8N9J3J2J5j33n5J9m3m4K1R3O0
-4661A27q7m9R7J06L2K2K2o0o0o0o0l2l2N3N3O5O5MLr6r7l4l6K2K2K1K3M9N0l6l6m2m1M4M4
$$ plain form
-4569 54 -21 24 97 96 107 118 125 131 119 108 67 26 0 96 192 166 162 159 147 136 129 121 114 107 80 53 88 122 147 172 86 0 -3 -7 24 56 94 132 84 36
-4584 36 59 82 105 128 51 -25 56 138 146 155 77 0 14 29 43 58 38 18 -2 -22 -23 -24 -25 -26 39 105 134 163 130 97 63 30 68 105 142 180 165 150
-4598 150 136 121 98 75 52 29 44 59 73 88 109 130 114 98 122 147 110 74 73 71 -10 -93 -152 -138 -128 -119 -56 5 -17 -41 -4 32 70 107 119 131
-4611 131 103 2 50 172 211 250 223 196 137 78 73 141 270 326 302 277 285 293 287 281 279 204 159 114 96 79 98 43 -47 -65 2 69 77 11 -116 -170
-4624 -170 -36 96 139 182 181 106 50 -4 -2 0 -2 -3 88 254 255 257 248 165 154 216 213 135 79 24 -16 16 -14 -46 103 179 164 149 93 37 50 62 -28
-4637 -28 -45 23 92 31 -29 -7 15 -35 -12 34 155 272 265 212 159 143 200 222 244 234 224 170 116 98 81 105 129 153 176 161 145 89 105 206
-4649 206 307 324 267 171 150 125 247 367 341 222 104 56 8 -2 -13 -15 -17 17 52 110 169 182 194 209 76 21 40 -3 -47 -26 67 127
-4661 127 40 -9 88 194 226 248 270 210 150 90 30 -2 -34 19 72 137 202 206 209 113 16 -18 -54 -32 -10 11 34 83 133 97 61 19 -22 22 66
-4674F6r2r4N7N7K2j23m3J04J67R6J0J1q7q6jjJ7J7J6J7rj0rrLMM1M0q1q0%JPo5j08L9P5P4
-4688D3Q4Q3l0l0L1L1M4M4j8j7j9j8n5n6M9M9j3j2O3O3k3k2rqK9K8K9K9k1N3l4j57q3q3k6
-4700A8k5J0J1J19J19K9K8n8j32r9K5L1L2k1k2qpm5m3J4J4O6O8Q9l4p4p5k5k4O0O0MMMMn7
-4713F0n6M6M6J5j08j36o4j2O1O6pk1k2L6L5P1P2P1P2%J%JK5K6m0m0K0n3q5L7O3j1j14m0j9
-4726dk1M5M6K7K8l4l4o2o2jjK9K9O4O6K0K1K0K0n2n2J4J5j4O1R2l0r9k6N9O0m6m6J5J5L6
-4740A98L7k5k5MLl3l3m0m0m0l9j37j37K2K3J38J37J1J1q5L6J9K1O6n6K9J02P1lj7j8n0n1
-4752I9j4j4qrrrj2j2K5K5J1J1J2J1j5j4n1n0MMl3l3L7L8L6L8l4l4l4l5J00J00j0rn4n4j2
-4765hj3P6J50M7p6n6J6P8P8n1n1q7q8j5j3P0P1LLLLpqm4m4J%l5l5L1L1R3R3L5L5k7k6L4L5
$$ plain form
-4674 66 -26 -120 -63 -6 16 -107 -150 -46 121 217 227 238 151 65 64 63 80 97 113 130 121 111 102 93 96 100 141 181 100 20 20 21 28 -37 -145 -106 -31 43
-4688 43 127 210 180 150 181 212 256 300 282 265 246 228 173 117 166 215 202 190 253 316 293 271 262 254 283 311 340 369 348 401 367 210 127 44 18
-4700 18 -7 3 14 133 252 281 309 251 119 20 45 76 108 87 65 57 50 5 -38 -24 -10 56 124 213 179 105 30 5 -19 41 101 105 109 113 117 60
-4713 60 4 50 96 111 3 -133 -197 -209 -148 -82 -89 -110 -132 -96 -61 10 82 153 225 225 226 226 227 252 278 238 198 218 165 80 117 180 169 55 15 -4
-4726 -4 -25 20 66 93 121 87 53 -9 -71 -72 -73 -44 -15 49 115 135 156 176 196 144 92 106 121 107 168 260 230 131 105 164 224 178 132 147 162 198
-4740 198 235 210 185 189 192 159 126 86 46 6 -33 -170 -307 -285 -262 -124 13 24 35 -50 -14 5 26 92 36 65 167 238 235 218 200 150 99
-4752 99 85 71 63 54 45 36 24 12 37 62 73 84 96 107 92 78 27 -23 -19 -15 -48 -81 -44 -6 30 68 34 0 -34 -69 31 131 121 112 58 4 -8
-4765 -8 -21 55 205 252 176 120 136 214 292 241 190 103 15 0 -13 57 128 131 134 137 140 133 125 81 37 38 38 3 -32 -1 30 123 216 251 286 259 233 267 302
-4779C02k7k7n3n2RRmllmK1K1j5j6j5j5j5j5lko3o2j1j0K2K2K5m6m2P9J40O8K7m7q3j0OOO3
-4793A77O4k2k3K7K7j0j0pqlp6m6m6r1j8J3J3k9M5R3J9K9K9j9j9o1J3l7l6P7P8K0J9j7j7j2
-4806A36j2m5m5l2M1L6L7M6M5RRK4K3K8m5ppK8r5p6M7R8K4p9p9L2L1M9J21L6l8m1m2q3q3n
-4819H6om6K7M1M2M6M6lklkrj0M0l4o0O3n2n3J2o1o2J2n7n8l7Q6J01J02J46P3k7j01o4o3K0
-4833A33K1K0K1n3n3r3k0J25J27mmM6M6o4o4q2q1N4N4m7m7L9L9O5O6K9K9j2j2j2j2L1L0po
-4845C02k2k1J5J5j02j02j6j6QPQQnnmnN0N0J4J3m5m6rrk0k0O5O6mlr0q8klQ3Q4RJ0p6p5k
-4860A7jL6L5K8K7K7K7L4L3k7k8L3L3mmRRn2n2qpL0L0j5j6j5j5m9n0L6L6M1M0j20j18P6P7
-4874A33M0M0j7j7M4M4J12J12m7m7k2k2k2k2j2j1r7r7L6L7L6L7%jl7l7L1L0L0L1m7m6m6m7
$$ plain form
-4779 302 275 248 195 143 152 161 157 154 151 147 168 189 174 158 143 128 113 98 95 93 30 -32 -43 -53 -31 -9 16 -30 -72 7 147 215 242 195 112 102 108 114 177
-4793 177 241 219 196 223 250 240 230 223 215 212 136 90 44 -47 -65 -52 -39 -68 -23 70 89 118 147 128 109 48 61 24 -12 65 143 163 182 165 148 136
-4806 136 124 79 34 2 43 79 116 162 207 216 225 249 272 300 255 248 241 269 174 98 145 243 267 188 109 141 172 221 342 378 340 299 257 174 91 86
-4819 86 80 34 61 102 144 190 236 233 231 228 226 217 207 247 213 153 216 164 111 123 62 0 12 -45 -103 -140 -54 47 149 295 368 341 240 176 113 133
-4833 133 154 174 195 142 89 -4 -24 101 228 224 220 266 312 248 184 102 21 75 129 82 35 74 113 178 244 273 302 290 278 266 254 285 315 308 302
-4845 302 280 259 274 289 187 85 69 53 61 68 76 84 79 74 70 65 115 165 179 192 147 101 92 83 63 43 108 174 170 167 77 -11 -13 -16 67 151 160 170 94 19 17
-4860 17 16 52 87 115 142 169 196 230 263 236 208 241 274 270 266 275 284 232 180 172 165 195 225 210 194 179 164 115 65 101 137 178 218 98 -20 56 133
-4874 133 173 213 196 179 223 267 379 491 444 397 375 353 331 309 297 286 189 92 128 165 201 238 238 237 200 163 194 224 254 285 238 192 146 99
-4886I9LLL1L0P1p6kP1Q6J3J4n9p5p6m3m3M5M5M5M5rqm6m5rrqrO8O8O7O8l5l6KJp3p3J3J3
-4901A67M6M5m0m0m7m7j0j0L4L4n8Q9R7n0MNnonnr4r4J7J7J30J30j1j58j05M2N3k1p9p9q4
-4913a38q4%J%%O4O4K7K7l9l9K2K3K5K5K4K5J9K0Q1Q1L0L1pok8k7L3L4OOl1l1m7m8J4J4N1
-4927B22N2L4j14q3O5J49P6n8n8o3o2j5j4j5j4JJJJj0j0m6m6L4L4P2P1rj0j45j44MLO4O4J10
-4940A42J10K4K3j5j5j5j5k3k4L8L8kjl9l8jjjjL8L8JJllQ3Q3l2l3r9r8l1j05kJ20J14M0K7
-4954C23K8K4K4l8l7m1m1m1m1nnN6N6QQk9k9PQR4R3m9n0j2j3mmmnl3l4LLMLMMj2j3j2j2n0
-4969A36m9L7L7kkn6n5m4P8N6j8l2M1Q2Q1k1k1k0k1p9q0p8p9L0L0R1R2J3J3J3J3J7J6J7J7
-4982B53nmnn%%n0K5N5o7o7N5O6pm5m4m7m7O4O3M5M4M5M4j2j2K5K5K5K4o1o1l5l5l5l5J8J7
$$ plain form
-4886 99 102 105 136 166 237 161 159 230 316 329 343 284 209 133 90 47 92 137 182 227 218 210 164 119 110 101 93 84 152 220 287 355 320 284 286 287 214 141 154 167
-4901 167 213 258 218 178 131 84 74 64 98 132 74 163 260 210 214 219 214 208 203 198 104 10 27 44 174 304 293 135 30 72 125 104 25 -54 -138
-4913 -138 -222 -222 -221 -221 -221 -157 -93 -66 -39 -78 -117 -95 -72 -47 -22 2 27 46 66 147 228 258 289 282 276 248 221 254 288 294 300 269 238 191 143 157 171 222
-4927 222 274 308 194 111 176 325 401 343 285 222 160 145 131 116 102 103 104 105 106 96 86 40 -6 28 62 134 205 196 186 41 -103 -99 -96 -32 32 142
-4940 142 252 276 299 284 269 254 239 216 192 230 268 266 265 226 188 187 186 185 184 222 260 261 262 259 256 339 422 390 357 258 160 129 24 22 142 256 296 323
-4954 323 351 375 399 361 324 283 242 201 160 155 150 206 262 270 278 249 220 227 235 329 422 373 323 311 298 294 290 286 281 248 214 217 220 224 227 231 235 223 210 198 186 136
-4969 136 87 124 161 159 157 101 46 2 80 136 118 86 127 209 290 269 248 228 207 128 48 -30 -109 -79 -49 42 134 147 160 173 186 203 219 236 253
-4982 253 248 244 239 234 234 234 184 209 264 197 130 185 251 244 199 155 108 61 125 188 233 277 322 366 354 342 367 392 417 441 380 319 284 249 214 179 197 214
-4996B14N5N4k0k1q2q1m7m7j0rP2P3L6L6N4N4qqo2o2n7n8lO9J02k0p1MoO8Ro4j8j8Q2Q1mm
-5009B83q3q2K7K8K5K4K4K4j9j9J7J7jkJ0o3l8Q4J05L2kj25m1L3l9l8l4l4L5L5p6p6L9L8L8
-5022A46L9KJKKL0L0L0L0J3J4k4k3O5O5m1m1o2J1mj51m5K9k2k2k4k5J2J3RJ0P2P1L6L6jjJ5
-5036B97J5m6m6k1k1k1k2q6q5M7M9M0M0k1k1P0P1j6j6%%%%P4P5P4P4p2p3p3p3m1m2M5M4PP
-5049B33OPK1K1K2K1L1L2j9N4O7q0j18L0K0n4o5o5M1M1j9r3p0P6K6K5O1O0O0O0j9k0n6n6m2
-5062B39m1j03j02M8N0Q7Q7K5K5j1j1K4K5j2j2l3l3l3l3l3l3K8K8R4R3L2L2j23j23L2L2Qo6
-5074A87m0Q2J61L8m7j21r2j9k7k8QRO9P0LLLLJ7J6No9p2N2J4J5O3O3K9r3j38j5onN2N2l4
-5088B08l4L5L5jkL4L4n2n2k9l0JJ24J14n6NQ0k9k8L7L7j7j7j77j77j2j1P5P4jkO0O0K9K8
$$ plain form
-4996 214 269 323 303 282 200 119 72 25 15 6 78 151 187 223 277 331 323 315 253 191 134 76 73 142 244 224 153 157 151 219 228 164 146 128 210 291 287 283
-5009 283 200 118 145 173 198 222 246 270 251 232 249 266 265 263 273 210 172 256 361 393 391 266 225 258 219 181 147 113 148 183 107 31 70 108 146
-5022 146 185 187 188 190 192 222 252 282 312 325 339 315 292 357 422 381 340 278 289 285 134 89 118 96 74 50 25 37 50 59 69 141 212 248 284 283 282 297
-5036 297 312 266 220 199 178 157 135 49 -36 11 60 100 140 119 98 168 239 223 207 207 207 207 207 281 356 430 504 432 359 286 213 172 130 175 219 226 233
-5049 233 239 246 267 288 310 331 362 394 375 429 496 416 298 328 348 294 229 164 205 246 227 134 64 140 166 191 252 312 372 432 413 393 337 281 239
-5062 239 198 95 -7 41 91 178 265 290 315 304 293 317 342 330 318 285 252 219 186 153 120 148 176 270 363 395 427 304 181 213 245 253 187
-5074 187 147 229 390 428 381 260 168 149 122 94 102 111 180 250 253 256 259 262 279 295 300 231 159 211 225 240 303 366 395 302 164 149 143 138 190 242 208
-5088 208 174 209 244 243 241 275 309 257 205 176 146 147 271 385 329 334 414 385 357 394 431 414 397 220 43 31 20 95 169 168 166 226 286 315 343
-5100C43K9K8J5J4k2k3M9M9q6q6p7p7RRk9k9k9l0rrrrj9j9J7J6l1l3J26J26RRQRk1k1k1k0
-5114A56LKLLm2m2M4M3N1N0J4J4j2j3%P4M1q1j38j5K2K3J8R1O7n7q5j2M8M8N2N3MMl3l2q8
-5128B78q9n1n1K1K1K2K1P6P5n9n9M6M7RJ0nonoK3K3Q4Q5j3j3n0n0k2k3o0o0klklJ6J6P7P8
-5142C96l5l5l4l5l6l5r7r5ONO8O8NOONk1k1R0Q9l4l4LLnnL2L2m5m4O5O6K5K6n3n3n9O3oo
-5156B71N2N3J6J6r3r3J7J8QQRQK5K4o1o2m0m0K1K2J2J2J2J2k7k6k7k6J04J03J8J8n2n2j5
-5169B45j6j2j2o6o6l9Q3J18M4N8N8pqJ9J8J9J8m4m4J10J11m5j19j46k4L5L6OOK1K0j6j7j45
-5181A99j45l5l3P2P3j2j3M5M5QQm3m3m3m3rqJ26J26K2K1m0m0r9r8L7L6P2P2l9l9n3n2j6j6
-5194D3LMO4O5R2R3L1L1j06j06MM%%J27J27lj26j19j18J6J6J6J6R1R1P4m9m5m6n3n3opL1L0
$$ plain form
-5100 343 372 400 415 429 407 384 433 482 396 310 233 156 165 174 145 116 87 57 48 39 30 21 2 -17 0 16 -15 -48 78 204 213 222 230 239 218 197 176 156
-5114 156 159 161 164 167 125 83 127 170 221 271 285 299 287 274 274 348 389 308 170 155 177 200 218 309 376 319 234 222 270 318 370 423 427 431 398 366 278
-5128 278 189 138 87 108 129 151 172 248 323 264 205 251 298 307 317 312 306 301 295 318 341 425 510 497 484 434 384 362 339 279 219 217 214 212 209 225 241 318 396
-5142 396 361 326 292 257 221 186 89 -6 0 5 73 141 146 152 158 163 142 121 211 300 266 232 235 238 233 228 260 292 247 203 268 334 359 385 332 279 220 283 277 271
-5156 271 323 376 392 408 315 222 239 257 265 273 282 290 315 339 278 216 176 136 157 179 191 203 215 227 200 174 147 121 225 328 346 364 312 260 245
-5169 245 229 217 205 139 73 34 117 235 279 337 395 388 380 399 417 436 454 410 366 476 587 542 423 277 253 288 324 330 336 357 377 361 344 199
-5181 199 54 19 -14 58 131 119 106 151 196 204 212 169 126 83 40 31 23 149 275 297 318 278 238 139 41 78 114 186 258 219 180 127 75 59 43
-5194 43 46 50 114 179 271 364 395 426 320 214 218 222 222 222 349 476 473 347 228 110 126 142 158 174 265 356 430 381 336 290 237 184 178 171 202 232
-5207B32L1L0R2R2j9j8j8j8m7m7m7m8NMl3l2Q0Q0J8J9OOM3M3n2n2k0k0l0j04o4Q3R5K2J1J1
-5220C34O6O7r3r2KKLKJ3J3J3J3J6J5N3N3o2o2K3K4K6K7j0j0lkl9l9J3J4J4J3l4l4K7K8L8
-5234D32L9KKp2p2L8L8PQn4n4qqJ26J27o0o0j21j21K7K6K7K7q6q6k0k0Q7J61R2n5o7o6J0J0
-5246B56LLLL%jj9j67j26K0J4J3J16J16J16J16p1p0M0M0QQR0n6r5r5L1L1P4P4o2o1l8l8l8
-5259B38l8J2J2l5J13J08J07m2m3K2K3K2K3l7l7K4K5M5M5m1m1j00j00J0J0j1j1K6K6l2l3l2
-5271B58l3n7n8N2N3Q9R0m6m5m7m7J5J4Q1Q0l0k9jjO1O0r5r4J5J6M1M2NMM7M7nnr4N3L2L1
-5284D99q3q3KLMLp9O8J29J28K8K8l7l8r8r9n7n7MNP3P3j2j3m3m4J7J7l0l0L1L1j23j24J1
-5297A04J1L9L9J00J00O7O7m3m3j07j07LMooooO6O6%%J8n6q8L4J06L3kP2m1j14l2l2O4O3k2
$$ plain form
-5207 232 263 293 385 477 458 440 422 404 357 310 263 215 220 224 191 159 239 319 337 356 362 368 411 454 402 350 330 310 280 176 112 195 290 312 323 334
-5220 334 400 467 374 282 284 286 289 291 304 317 330 343 359 374 427 480 418 356 379 403 429 456 446 436 433 431 392 353 366 380 394 407 373 339 366 394 432
-5234 432 471 473 475 403 331 369 407 414 422 368 314 306 298 424 551 491 431 310 189 216 242 269 296 210 124 104 84 171 332 424 369 302 236 246 256
-5246 256 259 262 265 268 268 267 248 81 -45 -25 -11 2 118 234 350 466 395 325 365 405 413 421 511 455 360 265 296 327 401 475 413 352 314 276 238
-5259 238 200 212 224 189 302 410 517 475 432 454 477 499 522 485 448 472 497 542 587 546 505 405 305 315 325 314 303 329 355 323 290 258
-5271 258 225 168 110 162 215 304 394 348 303 256 209 224 238 319 399 369 340 339 338 399 459 364 270 285 301 342 384 389 393 440 487 482 477 383 436 468 499
-5284 499 416 333 335 338 342 345 266 334 463 591 619 647 610 572 474 375 318 261 265 270 343 416 404 391 348 304 321 338 308 278 309 340 217 93 104
-5297 104 115 154 193 293 393 460 527 484 441 334 227 230 234 228 222 216 210 276 342 342 342 360 304 216 250 356 389 387 459 418 304 272 240 304 367 345
-5310C45k3N5N6l1l0j1j1K6K7K3K3k0k1J10j1n4n3j0rp2p1nnL1L2l4l4K8K8RRM6M7k7k7L4
-5323C70L4%%%%MNl2l3L6L6k6k5m5m6J6J7N1N1j7j8N9o4r7k4P1P0P5P6LMn7n8Q9Q9K8K7o9
-5337F00p0j06j06O8O9m7m6j1q5n5O7P1kj5j5LKLKn5n5L0L1O6O7k0j9j8j8n5n5J14J13K7K8
-5350E08q3q3LLpoo7o8R0R1K9K9n7n7NNO9O9p5p5O7q1n9o0l2l2MMO2O1O1O2OPQ4Q3Q8n9j12
-5364D77j11KKL8L9p1p0M0M0k8k7RRP9P9Q5o2j80l3j5j4L3L3llL5L5k7k6K9K9n6n7j5j5P0
-5377C50P1mmL3L3J6J5J6J5RRk7k8k0k1J6J6n8n8N2N3J05J05j28j28NMMNM3M4OPo0o1k3k4
-5390C88k5k6L5L6J3J3J3J3l6l5K5K5rrrrl5l5KJl5l6l6l5M5M6QRN2N2R4K0j4j3J3J4l1j04
-5404C85j05l1N4N4m7m7qO5O1O1n6n5L0L0L7L7lp6q1pj7j6QQM5M6j9j8K7m6m2L1P1P1L4L4
$$ plain form
-5310 345 322 377 433 402 372 361 350 376 403 426 449 429 408 518 507 453 400 390 381 309 238 233 228 259 291 257 223 251 279 288 297 343 390 363 336 370
-5323 370 404 404 404 404 404 408 413 381 348 384 420 394 369 324 278 294 311 362 413 396 378 437 373 276 252 323 393 468 544 547 551 494 436 525 614 642 669 600
-5337 600 530 424 318 386 455 408 362 351 266 211 278 349 347 332 317 320 322 325 327 272 217 247 278 344 411 391 372 354 336 281 226 340 453 480 508
-5350 508 425 342 345 348 341 335 268 200 290 381 410 439 382 325 330 335 404 473 398 323 390 309 250 190 158 126 130 134 196 257 318 380 386 393 477 560 648 589 477
-5364 477 366 368 370 408 447 376 306 346 386 358 331 340 349 428 507 592 530 350 317 302 288 321 354 351 348 383 418 391 365 394 423 367 310 295 280 350
-5377 350 421 417 413 446 479 495 510 526 541 550 559 532 504 484 463 479 495 437 379 431 484 589 694 566 438 443 447 451 456 499 543 549 556 496 435 412 388
-5390 388 363 337 372 408 421 434 447 460 424 389 414 439 430 421 412 403 368 333 335 336 301 265 229 194 239 285 293 302 354 406 500 520 506 493 506 520 489 385
-5404 385 280 249 303 357 310 263 255 320 381 442 386 331 361 391 428 465 462 386 305 298 281 265 273 281 326 372 353 335 362 316 274 305 376 447 481 515
-5417E15l1j04r7k4M1M1P8P7O9O9n7j81k5k6lkllK6K6Oo8j5j5n6n7KKqO6J28N4l4l4j7j6j6
-5431C08j7K5K4l2l3m5K7O8O8N3k1q5q5M5J17P2P2j6r0n8J6j7r1qrn1n1J8R1M3M2J0J0n7n8
-5443B85J4J3j18L0J06J06j4j4j4j4N3N4M2l1p4P3j5j4MLl3l4o3o4o4o4kkJ08J09L9L9M0L9
-5456E23L5L5p5p5k1k1J6J5k5k6o2o2J05J04non1n1L4L5M6M6M6M6n7n8k1k1k6k7k7k7l0k9
-5468B83N7N6J9J9j55j56l4J14N9N8N4r3j0j1N2N3N2N2N5N5o5o4L6j12r0J56J52Npqr7r8L8
-5480D25L7qpqql7l7K5K5J7J8j9j9q3q3K7K8J12J11k3k3m2m2nnK4K4K5K4J3J4N5j9j7j7j7
-5493D85j7k2N1J1J0ooL1L1ONNOK5K4m0j13j20m6Q7Q8M2l2n1n2j3j3qrj3O0j9r2j0J12N1p2
-5507C76p1KoomP0J06L3l6l5m0m0l1l1J4Q7K9K8j2q5p4p5J5Q8j0j0N6N5J22J22j5r0j02k9
$$ plain form
-5417 515 484 380 283 259 300 341 419 496 565 634 577 396 371 345 342 340 337 334 360 386 392 324 309 294 238 181 183 185 177 243 371 425 391 357 340 324 308
-5431 308 291 316 340 308 275 230 257 325 393 446 425 340 255 300 417 489 561 545 455 397 413 396 305 297 288 237 186 204 295 338 380 390 400 343 285
-5443 285 299 312 194 224 330 436 422 408 394 380 433 487 529 498 424 497 482 468 472 475 442 408 345 281 217 153 151 149 257 366 405 444 484 523
-5456 523 558 593 518 443 422 401 417 432 407 381 319 257 362 466 461 455 404 353 387 422 468 514 560 606 549 491 470 449 423 396 369 342 312 283
-5468 283 340 396 415 434 279 123 89 203 262 320 374 281 271 260 312 365 417 469 524 579 514 450 486 374 284 440 592 597 590 582 485 387 425
-5480 425 462 454 447 439 431 394 357 382 407 424 442 423 404 321 238 265 293 405 516 493 470 428 386 381 376 400 424 449 473 486 500 555 536 519 502 485
-5493 485 468 446 497 508 518 512 506 537 568 574 579 584 590 615 639 599 486 366 320 407 495 537 505 454 402 389 376 368 359 346 406 387 295 285 397 448 376
-5507 376 305 307 301 295 291 361 467 500 464 429 389 349 318 287 301 388 417 445 433 348 274 199 214 302 292 282 338 393 515 637 622 532 430 401
-5519D01L0L1j5q9m7m7n6n6R9R9J3o1k8M4N6j8j8N6L5l9PQL2L3L3L2j0j0l1j03j7j6k1k1M4
-5532C50M5j3j2n0K4O8O9M0M0P8P7m7m7j0j1j2j3r9r9j6j7K0K0M3M3M4M3j0j1m7m7l9l8l8
-5544C28l9M0M0k2k1mmmlQ6Q7J%J0Rp3P4L4L3ONn0n1L5L5j2j2m9n0l0l1L0L1M9M9j50j51l4
-5558A92J12O7O6j3j3p5p4jjQ4Q5Q1Q0r5r4j49jN1N0q1q1K9L0J27J28J7J8l6l5l6l6N3N2J5
-5570E16J6JKq5q4L2L1L2L1k0k0J7J7m7m7j0j0J25J25o0n9j6j6M6M5K4K3j3j3l1l1j9N5pj30
-5583D20n6n7n6n6K9L0J13J13K8K7p7p6L3L4L6L6n0n0ONJ0J0M3J16M1q1j03J9MMn6n7n6n7
-5595B69k5k5Q5Q6K6K6j1j0J3J3k4k4n0n0O0O0j1j2K5K5n1n0J0J1K9L0K9L0k6k7o3o3J5J6
-5608C36N2N2jjL7L6J9K0K0K0p0p1rrQRRRr9r8l8l7P3P2P3P3j3j2K4K5OOnO7J19nq7j4L3m1
$$ plain form
-5519 401 431 462 447 358 311 264 208 152 251 350 363 302 274 318 374 356 338 394 429 390 397 405 437 470 503 535 525 515 484 381 364 348 327 306 350
-5532 350 395 382 370 320 344 412 481 521 561 639 716 669 622 612 601 589 576 477 378 362 345 365 385 428 471 515 558 548 537 490 443 404 366 328
-5544 328 289 329 369 347 326 322 318 314 311 397 484 485 485 495 504 431 505 539 572 578 583 533 482 517 552 540 528 479 429 399 368 398 429 478 527 377 226 192
-5558 192 304 371 437 424 411 336 262 261 260 344 429 510 590 495 401 252 251 302 352 271 190 219 249 376 504 521 539 503 468 432 396 449 501 516
-5570 516 532 533 535 450 366 398 429 461 492 472 452 469 486 439 392 382 372 497 622 562 503 487 471 517 562 586 609 596 583 552 521 502 557 550 420
-5583 420 364 307 251 195 224 254 367 480 508 535 458 382 415 449 485 521 471 421 427 432 442 452 495 611 652 571 468 487 491 495 439 382 326 269
-5595 269 244 219 304 390 416 442 431 421 434 447 423 399 349 299 359 419 408 396 421 446 395 345 355 366 395 425 454 484 458 431 368 305 320 336
-5608 336 388 440 439 438 475 511 530 550 570 590 520 449 440 431 439 448 457 466 367 269 231 194 267 339 412 485 472 460 484 509 515 521 516 583 702 697 610 596 629 588
-5622E88M2M2J1J2P2P3p8p8m0m1l8l8jjM0M1m6m5j18j17M1M2Q2Q2mnk3k3L2j16m3J05J2J2
-5634D74k4k4J3J3k9k9M8M8L1j17n9Q7O5qo9o8q5q5N0N0L9M0LLL7L7m9m9K0K1N7N7l1l1Q0
-5647E16P9JJKJQ8Q8m7m7r1r1j16L0O2j1KKJ4J4J5J4P1P2j4j4J9K0m2m2ppm5m4o0o1K7j20
-5661B79K9J04N3N3O2O2K6K5k6k7k6k7nnM6j02j04l0q1q1K7K8K8K7L9L9L9L9k1k2J5J5J6J5
-5673E09k2k2NMNMjjL6L6M8M9j3j2K7K7O4n8j04l1POpqm4m4Q9Q9K8K7L3L4p8p7l0k9l0l0l8
-5687D48l9l9l9K1K0j6j7M2M2P9P8nnnnJ2J3P3P4NMl2l3p2p2l6l5N8N7j01j02j2j3M8M9j9
-5700D26j9M3M2L2L2np9j59l7R0J7J8J8m7m8J6J6j6j6P8J51M8p4o0J4K7K6n2n1RJ0J7J8o8
-5713D17o8k0j9R0R1oopoONr7r7p2N0J34N9J0J1NNN8N8K0K1K2K1l9m0j3j3m9n0k8k9RRL6L6
$$ plain form
-5622 588 630 672 683 695 767 840 762 684 644 603 565 527 526 525 565 606 560 515 397 280 321 363 445 527 523 518 495 472 504 388 345 450 462 474
-5634 474 450 426 439 452 423 394 442 490 521 404 345 432 497 489 420 352 267 182 232 282 321 361 364 367 404 441 392 343 363 384 441 498 467 436 516
-5647 516 595 596 597 599 600 688 776 729 682 591 500 384 414 476 465 467 469 483 497 512 526 597 669 655 641 660 680 638 596 589 582 537 493 433 372 399 279
-5661 279 308 412 465 518 580 642 668 693 667 640 614 587 582 577 623 521 417 387 306 225 252 280 308 335 374 413 452 491 470 448 463 478 494 509
-5673 509 487 465 470 474 479 483 482 481 517 553 601 650 637 625 652 679 743 685 581 550 557 563 556 548 504 460 549 638 666 693 726 760 682 605 575 546 516 486 448
-5687 448 409 370 331 352 372 356 339 381 423 502 580 575 570 565 560 572 585 658 732 737 741 709 676 604 532 496 461 519 576 475 373 361 348 396 445 426
-5700 426 407 450 492 524 556 551 472 313 276 366 383 401 419 372 324 340 356 340 324 402 553 601 527 467 481 508 534 482 431 440 450 467 485 417
-5713 417 349 329 310 400 491 485 479 472 466 472 477 380 283 211 261 395 454 464 475 480 485 543 601 621 642 664 685 646 606 593 580 531 481 453 424 433 442 478 514
-5727E14jjJJmmM7k7o9P9K5K5L4L4m0m1m0m1n9n8K7K7POM4M4K8K8K9K8m5m6l6l7o3Q4JJl4
-5741D68l3K7K8q7q6M8M8N2N1rj0o2o2M9M8L3L3n4n3Q9Q8K8K7l0l0l1l0m1m0K0K1J3J3J3J3
-5754E52lmQ2Q2l9l9l9l9J6J6N3N3j1j0j02M5M4j03P4P5p5p5J0J1j2j1j2j1k5k4O1O1n7n8
-5766D86n7n8O4O3O4O3L6L6k5k5j8j7p9p8l4l3l3l4K0K1J06J05klllL5L5kjq4q4KKk4k5L6
-5779D52L7j6j7p7p8K8K8m5P7R9K6L8L8p1p2J5J4J6J6J6J5j3j2j3j3l2l2l2l2mnL3L3oono
-5793C94RJ0k8k7J1J2P3P3M4M5m1m2k9k9k9k9%j%jN8N8N8N7k7k7k7k7o4o4lkO7O7L1L0ppq
-5807E78pnmL2L2q1q0P8P9RQk3k4j5N7N8o5j21K7O3j1j8j8N4N4N8r0q3q3K1J68O6qp2p2RR
-5820E80N4N3qpj0j1N2N1q2q2m6m5jjL5L6j1j0j1j0K1K1K2K1M0M1k1k1k3k3k4k3o1o0P4P4
$$ plain form
-5727 514 513 512 513 514 510 506 553 526 457 536 561 586 620 654 614 573 533 492 433 375 402 429 436 442 486 530 558 586 615 643 598 552 516 479 416 500 501 502 468
-5741 468 435 462 490 403 317 365 413 465 516 507 497 435 373 422 470 503 536 482 429 518 606 634 661 631 601 570 540 499 459 479 500 513 526 539 552
-5754 552 549 545 627 709 670 631 592 553 569 585 638 691 680 670 568 613 657 554 628 703 628 553 563 574 562 551 539 528 503 479 540 601 544 486
-5766 486 429 371 435 498 562 625 661 697 672 647 629 612 533 455 421 388 355 321 341 362 468 573 571 568 565 562 597 632 630 629 545 461 463 465 441 416 452
-5779 452 489 473 456 379 301 329 357 312 389 488 514 552 590 519 447 462 476 492 508 524 539 526 514 501 488 456 424 392 360 356 351 384 417 411 405 400 394
-5793 394 403 413 385 358 369 381 454 527 571 616 575 533 504 475 446 417 417 416 416 415 473 531 589 646 619 592 565 538 474 410 407 405 472 539 570 600 593 586 578
-5807 578 571 566 562 594 626 545 465 543 622 631 639 616 592 577 634 692 627 506 533 596 585 567 549 603 657 715 625 542 459 480 648 714 706 634 562 571 580
-5820 580 634 687 679 672 662 651 703 754 672 590 544 499 498 497 532 568 557 547 536 526 547 568 590 611 651 692 671 650 627 604 580 557 496 436 510 584
-5833E84j8j8J8J9LKLLJ3J4m8m8j6j6K0K1J5J5N2N2K9K9pqn0n0j4j3j7j7j8j7%%O2O1J5J6
-5847F71N2N2J0RJ0Rppm4m4QRRRj3j2n0m9k2k2k2k2q2q2P9Oj4J34Q3RM5k9j03j02j5j5j4j5
-5861D19K5K4K5K4M9M9M9M9l4l5l4l5k9k9N7N8L0L0O7O7mmo5o5j6j6l0M3Q8o0j41Oj0j0j%
-5874E41N9N9K3K3M1M2NNj01j02j5j6m1m0mmJ2J2J2J2K3K4Q5Q5LMl3l3K1K2j6j5l2l1l1l2
-5887E67O0O0K3K3m5m5qqL5L5p6p6m5m6J5J6k6k6n2R5J32N8P2P1o2o2jjJ0J1J0J1nnnnn0n0
-5901F05j12j12J7J6M8M9J0o4mJ43J14l3j00j01noN6N6L0K9K9K9J1J0n1n1m2m1J9K0J5J6J5
-5913F15J5N9N9k6k7o5o5L8L8L8q4n2K2O3J37J4J4L2L2j0rl9j12j08J4N7j6L2L2m5m6qrM0
-5925F30L9O9O9nj28j8J05N7N6k2k3OOj04j05j28j29j9J04J67R3j7r0o7N7M4M4M6M6j5j5m7
$$ plain form
-5833 584 566 548 566 585 588 590 593 596 609 623 575 527 511 495 515 536 551 566 618 670 699 728 721 713 663 613 599 586 569 552 534 517 517 517 579 640 655 671
-5847 671 723 775 785 794 804 813 806 799 755 711 719 728 737 746 733 721 671 622 600 578 556 534 452 370 449 455 441 575 658 667 712 683 580 478 463 448 434 419
-5861 419 444 468 493 517 566 615 664 713 679 644 610 575 546 517 574 632 662 692 759 826 822 818 753 688 672 656 626 669 757 697 556 562 552 542 541 541
-5874 541 600 659 682 705 746 788 793 798 697 595 580 564 523 483 479 475 487 499 511 523 546 570 655 740 743 747 714 681 702 724 708 693 661 630 599 567
-5887 567 627 687 710 733 688 643 635 627 662 697 621 545 500 454 469 485 459 433 381 476 608 666 738 809 747 685 684 683 693 704 714 725 720 715 710 705 655 605
-5901 605 493 381 398 414 462 511 521 457 453 596 710 677 577 476 471 465 521 577 607 636 665 694 705 715 664 613 571 530 549 569 584 600 615
-5913 615 630 689 748 722 695 630 565 603 641 679 595 543 565 628 765 779 793 825 857 847 838 799 687 579 593 650 634 666 698 653 607 599 590 630
-5925 630 669 738 807 802 674 656 761 818 874 852 829 835 841 737 632 504 375 356 460 627 720 703 613 546 603 647 691 737 783 768 753 706
-5937G06m7m7m7M5M5m2m1m1m1M4M5K3K3K3K4JJl6l6P4P3o1o2j02j03Q1Q2L7L8JJM0M1MMo0
-5950F90o0k3k4p9p9jjQ9l3nO8%JNNK0J9L2m1j4J08P7Km3m3L1L1O3n9k7k7q3q4K7K7k4k4L8
-5964E59L7L0K9l1l2l7l7K5K4M0M0M0L9l3l4l4l4m0m1M5M5k8k7RRM1M0k0k1m4m3M2M2k7k8
-5977E45L4L4O3O3JKr7r7o0o0P0P1J07J07M4M4m1m2k6k6o3o3JJL8L7N1N0l6l6o6o7O9O9N1
-5989G72N2q3q3K0K1j6j6k1k2N5o7j24%J06J07k7k6k7k7j9j9J8J7N8N8J26Mo9o9j6j5j5j5
-6001F38K2K2N8N8K1K1n1n2q7q8J1J0P3P2R1R2Q8J5mj27o3o3l2l3K8K9M9M8J2J2O7O7k3k3
-6014I58m1j15q0M1L4L5k0j9l5l5K6J00Pj17n7J13J08L5m9m8j1j2r7r8K8K7n8n9J5J4J5J4
-6025F19J0J0n2n1O4O5m7m6k0k1M1M1j3j4j3j4j3j2K4K4L7L7P4P3P1P1RJ0p4p4p5p4q2q3J02
$$ plain form
-5937 706 659 612 565 610 655 613 572 531 490 534 579 602 625 648 672 673 674 638 602 676 749 688 626 524 421 502 584 621 659 660 661 701 742 746 750 690
-5950 690 630 607 583 504 425 424 423 512 479 474 542 542 543 548 553 573 592 624 583 569 677 754 756 713 670 701 732 795 736 709 682 599 515 542 569 545 521 559
-5964 559 596 626 655 624 592 555 518 543 567 607 647 687 726 693 659 625 591 551 510 555 600 572 545 554 563 604 644 624 603 559 516 558 600 573 545
-5977 545 579 613 676 739 740 742 645 548 488 428 498 569 676 783 827 871 830 788 762 736 673 610 611 612 650 687 738 788 752 716 650 583 652 721 772
-5989 772 824 741 658 678 699 683 667 646 624 679 612 488 488 594 701 674 648 621 594 575 556 574 591 649 707 833 837 768 699 683 668 653 638
-6001 638 660 682 740 798 819 840 789 737 650 562 573 583 656 728 819 911 999 1014 1010 883 820 757 725 692 720 749 798 846 858 870 937 1004 981 958
-6014 958 917 802 722 763 797 832 812 793 758 723 749 849 856 739 682 795 903 938 889 841 830 818 721 623 651 678 620 561 576 590 605 619
-6025 619 629 639 587 536 600 665 618 572 552 531 572 613 600 586 573 559 546 534 558 582 619 656 730 803 874 945 954 964 890 816 741 667 585 502 604
-6038F04J01J18J17o6o7j09j09KJQ3Q3llk0j9O6O7j0rj0rk9k9N6N7N9N9k2k3n6J8Q6l6j19
-6050H29m4qql9m0l9l9N5N5J8J9M8M9J1J2l0l1l0l1P2P2L5L6o2o1r1r0rJ15Q7J3k0k1o2o1
-6063G10m3m2m2m3L9L8L8L8K7K7K6K7N0M9J3J3n9o0k3k3J0Rp7p6k1k1R0Q9L3L2j19j19n5O7
-6075F02N9N9K3K2q8q8M1M2P8P8kkjkk2k3k2k2N0N1N0N1m7m6rj0MNn7n7J8J7J8J8j1j1p2p1
-6089F23m5m5M2M1Q9Q9N2N2q1q1m4m3O1O1K4K4rrrrj6j5j5j6O7O8NOj3j2r0q9o6Q1kjO2O3
-6103H00K6K6N9N9N9N9kjkjo8o8o8o8J5J5J5J5l4l4l4l4J6J7P7P8K5K5l7l7k3k4m5J02J3J4
-6116I35K2K2LLj07j07l3l3p0p0p5p4J09J10N1N1j0j0L7L6k4k5KKKLK2K2K2K2K3K4l8l7J9
-6129H29J9J9J9M3M2m3m3L8L9m8m8J6J7J6J6r4r3qpO5O6NMj6j6K0K1k0j9j9k0n3n3n3n3R5
$$ plain form
-6038 604 705 823 940 874 807 698 589 591 592 675 758 755 752 732 713 779 846 836 827 817 808 779 750 806 863 922 981 959 936 880 898 984 948 829
-6050 829 785 777 769 730 690 651 612 667 722 740 759 807 856 867 879 849 818 788 757 829 901 936 972 910 849 758 668 659 774 861 874 854 833 771 710
-6063 710 667 625 583 540 579 617 655 693 720 747 773 800 850 899 912 925 866 806 783 760 770 779 702 626 605 584 674 763 796 828 709 590 535 602
-6075 602 661 720 743 765 677 589 630 672 750 828 826 824 823 821 799 776 754 732 782 833 883 934 887 841 832 822 826 831 774 717 735 752 770 788 777 766 694 623
-6089 623 578 533 575 616 705 794 846 898 817 736 692 649 710 771 795 819 810 801 792 783 767 752 737 721 788 856 861 867 854 842 752 663 597 678 676 675 737 800
-6103 800 826 852 911 970 1029 1088 1086 1085 1083 1082 1014 946 878 810 825 840 855 870 836 802 768 734 750 767 844 922 947 972 935 898 875 851 806 908 921 935
-6116 935 957 979 982 985 878 771 738 705 635 565 490 416 525 635 686 737 727 717 754 790 766 741 743 745 747 750 772 794 816 838 861 885 847 810 829
-6129 829 848 867 886 929 971 928 885 923 962 914 866 882 899 915 931 837 744 736 729 794 860 865 869 853 837 857 878 858 839 820 800 747 694 641 588 683
-6142F83R6J0J0NONNrrK8K7L2L1n4n5j1j1r8r7m7m6lkMJ27O3j1Q7Q7k8k7n6n5N5N5L3L4j02
-6156G62j01K3K3O0O0L6L6m9n0nmmnO4O4k2k3o7o7M3M3j7j6M6M5QRRQN2N2l5l4o9o9k0r3o1
-6170F32O2L3J07N8N8m8m7j5j5n1n2M0M1M0M0lkllonL1L1qqm5m5J7J7P3P4o3j36n8O4Kp1j0
-6183G26J13J02K9J6J6qqj18MN2k2l4l4M4M4j7r1j26lQ2Q3L2L3p7p8rqP7P7n2n3j5j6k6k6
-6196G09j0J14Q4Q3o7o8m2m2K0K0J6J7m5m5N3N3l2l3J6J6r5r5J19J18Q1Q2PPp8p9j6j7j7j6
-6208H18Q9R0N3N3l4l4LLp6p6J0J0pqqpK6K6j1j1jkL5L5j8j8j8j7ooL1L2j6j6j6j5j8j8J8
-6223H75J9J7J7k1k0mmmmQQM5M5K2K2K1K2l2l3o9o9m7m7O3O4O5O5LMj3j3j24j24o4o5l4J38
-6236G32J41J8j2j3K8K7l4l4M5M5QRo7o7o6o7R8R8L7L7p3p3j2j2o2o1k5k5N1N0N0N0J4J3N1
$$ plain form
-6142 683 779 789 799 804 810 815 820 811 802 830 857 889 920 866 811 800 789 691 594 547 501 498 496 500 627 690 679 766 853 825 798 742 687 742 797 830 864 762
-6156 762 661 684 707 767 827 863 899 850 800 795 791 787 782 846 910 888 865 798 731 774 817 800 784 830 875 883 892 901 909 961 1013 978 944 875 806 786 693 632
-6170 632 694 727 834 892 950 902 855 840 825 774 722 762 803 843 883 880 878 875 872 866 861 892 923 915 907 862 817 834 851 924 998 935 799 741 805 807 736 726
-6183 726 839 941 970 986 1002 994 986 868 872 924 902 868 834 878 922 905 814 688 685 767 850 882 915 838 760 751 743 820 897 845 792 777 761 735 709
-6196 709 699 813 897 980 913 845 803 761 781 801 817 834 789 744 797 850 818 785 801 817 722 627 746 864 945 1027 1034 1041 963 884 868 851 834 818
-6208 818 907 997 1050 1103 1069 1035 1038 1041 965 889 899 909 902 894 886 879 905 931 920 909 908 906 941 976 958 940 922 905 899 893 924 956 940 924 908 893 875 857 875
-6223 875 894 911 928 907 887 883 879 875 871 879 887 932 977 999 1021 1042 1064 1032 999 930 861 814 767 830 894 959 1024 1027 1031 1018 1005 881 757 693 628 594 732
-6236 732 873 891 879 866 894 921 887 853 898 943 951 960 893 826 760 693 791 889 926 963 890 817 805 793 731 670 645 620 671 721 771 821 835 848 899
-6249H99N0j4j4j4j4L7L7k4k4mmP7P7rq3j11J2PQm6m7Q5Q5p5p4qpL3r0n4P0P0kN4N5j2j1j08
-6263H07j08J00J01j0j0K7K7j8j8j8j8l0k9N6N7L6L6jjM0M0LMRJ0p6p7n9n9JP6J51K9J6J7
-6275A111J3J4J3J3l9m0ppJp2k1N2R2q0j30n7M5M4N9j6n1K2J8n6o3o2M6J20Q5J1J1Q4J6n8
-6288A111r8r7l4l3K8K8m4m4m3m4jkO0O0LMQ4Q4k5j00k7J44J44K2m1j14p2p1L0K9N6j8J4Q8
-6300A081J5n8j17N5J11j1r1r1l8l8P3P2k6k7J1J0O5O6m5m5Q8Q8j9j42r3L0L2m3O1O0KKpJ15
-6312A146N2k3L1L0j1j1m4m3m0l9K2R6m0j12OOq5q4jjO0O0M8M8j3j3J6J7R5K2p5p4p9p9o3
-6325H25o3kkJ3J3N0M9L6L5P3P2M0M0r5r4rqK9K8K9K9l3l3N8N8K3n1nJ42Q1o6j48p5J9J9k6
-6338A051J20Q3J0l4L9L5l9j13j12m7m7j36J1Q0OL1L2K7K7jjL6L5J3J3J3J2QRk9k9O3O2K6
$$ plain form
-6249 899 949 935 921 907 893 930 967 943 919 915 911 988 1065 1056 973 862 874 881 889 843 796 881 966 891 817 809 802 835 745 691 761 831 829 883 938 926 915 807
-6263 807 699 799 900 890 880 907 934 916 898 880 862 832 803 859 916 952 988 987 986 1026 1066 1069 1073 1082 1092 1016 939 880 821 822 898 1049 1078 1094 1111
-6275 1111 1124 1138 1151 1164 1125 1085 1078 1071 1072 1000 979 1031 1123 1043 913 856 901 945 1004 988 937 959 977 921 858 796 842 962 1047 1058 1069 1153 1169 1111
-6288 1111 1013 916 882 849 877 905 861 817 774 730 729 727 787 847 850 854 938 1022 997 897 870 1014 1158 1180 1139 1025 953 882 912 941 997 979 993 1081
-6300 1081 1096 1038 921 976 1087 1076 985 894 856 818 891 963 937 910 921 931 996 1062 1017 972 1060 1148 1129 987 894 924 956 913 974 1034 1036 1038 1031 1146
-6312 1146 1198 1175 1206 1236 1225 1214 1170 1127 1087 1048 1070 1166 1126 1014 1020 1026 941 857 856 855 915 975 1023 1071 1058 1045 1061 1078 1173 1195 1120 1046 967 888 825
-6325 825 762 760 758 771 784 834 883 919 954 1027 1099 1139 1179 1084 990 981 973 1002 1030 1059 1088 1055 1022 1080 1138 1161 1110 1105 1247 1328 1262 1114 1039 1058 1077 1051
-6338 1051 1171 1254 1264 1230 1269 1304 1265 1152 1040 993 946 810 821 901 907 938 970 997 1024 1023 1022 1058 1093 1106 1119 1132 1144 1152 1161 1132 1103 1166 1228 1254
-6350A254K5ONq0q1q3q4N1N2R0R0K9K9n8n9k1k2O8O9j8j7N1N2J5J4m9m8q6q6k2k2k2k2NNM2
-6364A072M1ppppn9n8k1k2N0N0N0N0j2j1j1j2m6m5o8Q0N1N1O0N9o8o8l1l1%JP8P7R4n4l2l2
-6377A155JJ%JN5N4l1l2j8j9j8j9l2l3l3l3K3K4K4K3L8L7M4j04p5P3J08L4p1p1j4j4ppqpN0
-6390A099N1J3J4m6m5qqlkL5L4M8M8l8l8k9k8o0Q8J74K7r3j67q0oN8N8m7m7m6m7OOR2R2J6
-6404A121J6N3N3k6k7K9j19r9M9N9j4RJ0M1M2m3m4m3m4O0O1k6k6n1n1J09J09J7J8m4m4J6J6
-6416A187J6J6J1J1k6k6K4K5l7l7K5K5j2j1j7j6j6j7Q8Q8Q7Q8p8p9m1m2k3k4o0o0L4L3L4L4
-6428A204j0j0K7K7J7J6k0k0K1K1j5j6j1j2m8m8k0k0J7J7LKLKL5L5n1n2RRQRK9L0O6O6p4p3
-6442A173j3j2O3O3k3k3o1o1JJP0O9j6j6RQj02j01K4K5Q6Q6L8L9L8L9k2k2n9n9N8N7k8k8k5
$$ plain form
-6350 1254 1279 1285 1290 1210 1129 1046 962 1013 1065 1155 1245 1274 1303 1245 1186 1165 1143 1211 1280 1262 1245 1296 1348 1363 1377 1328 1280 1194 1108 1086 1064 1042 1020 1025 1030 1072
-6364 1072 1113 1106 1099 1092 1085 1026 968 947 925 975 1025 1075 1125 1113 1102 1091 1079 1033 988 920 1000 1051 1102 1162 1221 1153 1085 1054 1023 1023 1024 1102 1179 1273 1219 1187 1155
-6377 1155 1156 1157 1157 1158 1213 1267 1236 1204 1186 1167 1149 1130 1098 1065 1032 999 1022 1046 1070 1093 1131 1168 1212 1108 1033 1106 1214 1248 1177 1106 1092 1078 1071 1064 1056 1049 1099
-6390 1099 1150 1163 1177 1131 1086 1078 1070 1067 1065 1100 1134 1182 1230 1192 1154 1125 1097 1037 1125 1299 1326 1233 1066 986 980 1038 1096 1049 1002 956 909 915 921 1013 1105 1121
-6404 1121 1137 1190 1243 1217 1190 1219 1100 1001 1050 1109 1095 1104 1114 1155 1197 1154 1110 1067 1023 1083 1144 1118 1092 1041 990 1099 1208 1225 1243 1199 1155 1171 1187
-6416 1187 1203 1219 1230 1241 1215 1189 1213 1238 1201 1164 1189 1214 1202 1191 1174 1158 1142 1125 1213 1301 1388 1476 1398 1319 1278 1236 1213 1189 1129 1069 1103 1136 1170 1204
-6428 1204 1194 1184 1211 1238 1255 1271 1251 1231 1252 1273 1258 1242 1231 1219 1171 1123 1103 1083 1100 1117 1120 1122 1125 1127 1162 1197 1146 1094 1103 1112 1120 1129 1158 1188 1254 1320 1246 1173
-6442 1173 1160 1148 1211 1274 1251 1228 1167 1106 1107 1108 1178 1247 1231 1215 1224 1232 1130 1029 1053 1078 1164 1250 1288 1327 1365 1404 1382 1360 1301 1242 1300 1357 1329 1301 1276
-6454A276k5k5k5k1k1k2k1J7J6J6J7N2N3l3l3l1l1Q0Q0RJ0k7k7J3J4J3J4q7q6k1k1pO6J48
-6467A330Kl7L6K3K3k1k1J6J5m5m5m5m5k8k9Q1Q2J8J9m3m2q4q4l7J11R3J9m1m0n0m9J34J34
-6479A350J8J7j9j9j05j05k0j9J7J8k0j9N6N6N7N6j7j7j04j03M7M6Q3Q4k0j9J5R0K9j17l0
-6490A286l0llllm7m7L9L8Q0Q0nok7k6k6k7k3k3O2O3KKMj44j22n0J58J58j08j07m6m6J05J04
-6503A259K0J9k0j9n6n6n3n3L2L3P5P4J3J2M1M0o9j42r1N5J37j0J3J3n8n7j5j5M7M7K3K4j3
-6515A250j3OOOON8N7k8k8k9l0k9l0n5n5j9j8M4M4M3M4N7N7N7N7M7M6o4o4KKl5l5J14J13M
-6528A588Lono8o7p5p4J1J1R2R3m2m3k9k9o6o6qqqqJ5J5N2N2J8J9J8J9QRk8k9n3n4N6N7k7
-6542A343k8k7k7j0rK7K7L2L2k9k9j0j1J00J00K0K0M9M9P0n3k0k1l5l5l5l5m3m3q0q0JJKJ
$$ plain form
-6454 1276 1251 1226 1201 1180 1159 1137 1116 1133 1149 1165 1182 1234 1287 1254 1221 1190 1159 1239 1319 1328 1338 1311 1284 1297 1311 1324 1338 1251 1165 1144 1123 1116 1182 1330
-6467 1330 1332 1295 1331 1354 1377 1356 1335 1351 1366 1321 1276 1231 1186 1158 1129 1210 1292 1310 1329 1286 1244 1160 1076 1039 1150 1243 1262 1221 1181 1131 1082 1216 1350
-6479 1350 1368 1385 1366 1347 1242 1137 1117 1098 1115 1133 1113 1094 1150 1206 1263 1319 1302 1285 1181 1078 1125 1171 1254 1338 1318 1299 1314 1404 1433 1316 1286
-6490 1286 1256 1253 1250 1247 1244 1197 1150 1189 1227 1307 1387 1382 1376 1349 1323 1297 1270 1247 1224 1286 1349 1351 1353 1357 1213 1091 1041 1199 1357 1249 1142 1096 1050 1155 1259
-6503 1259 1279 1298 1278 1259 1203 1147 1094 1041 1073 1106 1181 1255 1268 1280 1321 1361 1292 1150 1059 1114 1251 1241 1254 1267 1209 1152 1137 1122 1169 1216 1239 1263 1250
-6515 1250 1237 1243 1249 1255 1261 1319 1376 1348 1320 1291 1261 1232 1202 1147 1092 1073 1055 1099 1143 1186 1230 1287 1344 1401 1458 1505 1551 1487 1423 1425 1427 1392 1357 1471 1584 1588
-6528 1588 1591 1585 1580 1512 1445 1370 1296 1307 1318 1410 1503 1461 1418 1389 1360 1294 1228 1220 1212 1204 1196 1211 1226 1278 1330 1348 1367 1385 1404 1412 1421 1393 1364 1311 1257 1313 1370 1343
-6542 1343 1315 1288 1261 1251 1242 1269 1296 1328 1360 1331 1302 1292 1281 1381 1481 1501 1521 1570 1619 1689 1636 1616 1595 1560 1525 1490 1455 1412 1369 1289 1209 1210 1211 1213 1214
-6554A214j7j7J9K0L9L9KKk7k7o3o4L8L7L8L7j6j6j6j6M8M9J1J2k3k2L9L9k0k0R0R0m8m9m8
-6567A354m9L2L2n3n4j%J3o0K3J69J24N0K2K2J8J7q5q5k4k4MMn8n7ONl1l1l4l4K8K8K5K6l6
-6580A286l6PPQPq7q8j08L8R2R1rj0L5L6P2P2rrrrL2L2Q3o4l4M0L1m2l4l3l8l8K0K0r0r1N7
-6594A228N6nnM9N0MLO8p9j40PR1R1l5l5%%l7l7k6k7k6k7RQRRM2M2ONo4o4K1K2M5M5QQk8k9
-6609A262QRP7P8M1M1j2j3j2j3l4l4l4l4J16J16j9j8j8j7M4M5o9o8o9o8p6p6L4L4jkl8l9o
-6622A135pP9Q0k5k4k4k4J27J28J7J8k1k1k1k1o7o8M3M4jjL7L6n6n6L0L0M6M7j4j5l8l8P2
-6634A427P2l2l2K9K9LLn8n9M2M1Mo9o9N3J7J6JJl5l6MLO6O5nnmnj22j21j1j2nnL2L1RQRQ
-6649A288j0j0K7K7K3K3K4K3onJ05J05r1r2l0l1m8m9j2j2Q5Q4J9J9m4j18n9O3N4N4k4k4j07
$$ plain form
-6554 1214 1197 1180 1199 1219 1258 1297 1299 1301 1274 1247 1184 1120 1158 1195 1233 1270 1254 1238 1222 1206 1254 1303 1314 1326 1303 1281 1320 1359 1339 1319 1409 1499 1451 1402 1354
-6567 1354 1305 1337 1369 1316 1262 1261 1261 1274 1214 1237 1406 1530 1580 1602 1624 1642 1659 1574 1489 1465 1441 1445 1449 1391 1334 1340 1345 1314 1283 1249 1215 1243 1271 1296 1322 1286
-6580 1286 1250 1257 1264 1272 1279 1192 1104 996 1034 1126 1217 1208 1198 1233 1269 1341 1413 1404 1395 1386 1377 1409 1441 1524 1460 1426 1466 1497 1455 1421 1388 1350 1312 1332 1352 1262 1171 1228
-6594 1228 1284 1279 1274 1323 1373 1377 1380 1448 1369 1229 1236 1327 1418 1383 1348 1348 1348 1311 1274 1248 1221 1195 1168 1177 1185 1194 1203 1245 1287 1293 1298 1234 1170 1191 1213 1258 1303 1311 1319 1291 1262
-6609 1262 1270 1279 1356 1434 1475 1516 1504 1491 1479 1466 1432 1398 1364 1330 1446 1562 1543 1525 1507 1490 1534 1579 1510 1442 1373 1305 1229 1153 1187 1221 1220 1218 1180 1141 1135
-6622 1135 1128 1207 1287 1262 1238 1214 1190 1317 1445 1462 1480 1459 1438 1417 1396 1329 1261 1304 1348 1347 1346 1383 1419 1363 1307 1337 1367 1413 1460 1446 1431 1393 1355 1427
-6634 1427 1499 1467 1435 1464 1493 1496 1499 1441 1382 1424 1465 1469 1400 1331 1384 1401 1417 1418 1419 1384 1348 1352 1355 1421 1486 1481 1476 1472 1467 1345 1224 1213 1201 1196 1191 1223 1254 1263 1271 1280 1288
-6649 1288 1278 1268 1295 1322 1345 1368 1392 1415 1409 1404 1509 1614 1523 1431 1401 1370 1322 1273 1261 1249 1334 1418 1437 1456 1412 1294 1235 1298 1352 1406 1382 1358 1251
-6661A251j08LP6Q4l8m2Q1L8q5K8K8K1K0m2m1p8p8N7N7K2K3N9N9k5k5j11j11OPR2R2QQp8m
-6673A254N6o7r5k3j0j0N6N6R9R9j1j2k0k0j9k0qqK9K9J05J05j04j03r0r0K1K0M2M2P9P9j05
-6685A356j06m4m4o7o7L7J60J52k0j19Mppj2O2P1n1n6J8K8K8L2L3j2j3p3p4L0K9K9K9O2O3
-6697A451O7pLMkjk8k7J3n9l2l2l6l6K6K5l1l1M5J19J10j3l9m0Kp2j23JJ2J3M7M7KP4N8j7
-6711A493q0q1n4n4QPj7j7N2J25J0J0J18M3q2q2r9K4j0q4L4J07L4L3J8n6j4j5K2n2p8p8K7
-6723A212K7J0RM9p3p1N1L6L7onjjm3L1P0P1P2kr0r1j9N5M6k6k7j49m4Q0O2O2P0P0nno2o2
-6736A338kP2L0L0k5k6m5j20K2K1N3N3J8J8m4m3n3n3j6j6j4j3K3K3K4K4l8l7rrqrN2N2N1N2
-6749A376j6j7j6j7K2K2j5j5N8N9llK0K1m1m1J7J7N4N4M6M6o4o4j27j27j6j7R3R2j16j16k3
$$ plain form
-6661 1251 1143 1146 1222 1306 1268 1226 1307 1345 1260 1288 1316 1337 1357 1315 1274 1196 1118 1175 1232 1254 1277 1336 1395 1370 1345 1234 1123 1129 1136 1228 1320 1328 1336 1258 1254
-6673 1254 1310 1243 1148 1125 1115 1105 1161 1217 1316 1415 1404 1392 1372 1352 1333 1313 1305 1297 1326 1355 1460 1565 1461 1358 1268 1178 1199 1219 1261 1303 1382 1461 1356
-6685 1356 1250 1206 1162 1095 1028 1065 1225 1377 1357 1238 1242 1235 1228 1216 1278 1349 1298 1242 1260 1288 1316 1348 1381 1369 1356 1283 1209 1239 1268 1297 1326 1388 1451
-6697 1451 1518 1511 1514 1518 1516 1515 1487 1460 1473 1414 1382 1350 1314 1278 1304 1329 1298 1267 1312 1431 1541 1528 1489 1449 1451 1379 1256 1257 1269 1282 1329 1376 1378 1452 1510 1493
-6711 1493 1413 1332 1278 1224 1232 1239 1222 1205 1257 1382 1392 1402 1520 1563 1481 1399 1300 1324 1314 1230 1264 1371 1405 1438 1456 1400 1386 1371 1393 1341 1263 1185 1212
-6723 1212 1239 1249 1258 1307 1234 1163 1214 1250 1287 1281 1276 1275 1274 1231 1262 1332 1403 1475 1473 1383 1292 1273 1328 1374 1348 1321 1172 1128 1208 1270 1332 1402 1472 1467 1462 1400 1338
-6736 1338 1336 1408 1438 1468 1443 1417 1372 1252 1274 1295 1348 1401 1419 1437 1393 1350 1297 1244 1228 1212 1198 1185 1208 1231 1255 1279 1241 1204 1195 1186 1178 1169 1221 1273 1324 1376
-6749 1376 1360 1343 1327 1310 1332 1354 1339 1324 1382 1441 1438 1435 1455 1476 1435 1394 1411 1428 1482 1536 1582 1628 1564 1500 1373 1246 1230 1213 1306 1398 1282 1166 1143
-6761A143k3J4J4k7k7L5L4N6N7N6N6K2K2j4j5k9l0l0l0J1J1J2J1P5P5L9L8j04j03m2m3K6K6
-6773A316j1j1J4J3P5P5JJq5q5N3N3J6J6r7r7J3J3M0M0M0M0J7J8m4m3j9j8j8j8QQRQQ6Q5k4
-6786A488k5m2m2m3m2K1K2K1K2k2k1k1k2L5L4k6k7J4J4J4J4qqK9K9k1k0J7J7J9J9J9J9j00
-6799A377j00j4j5N2N2N2N1K5K5o2o1ooo7o8ONNNOOJ16J16l5l4KKj02j02o5o5P3P3j3j3P4
-6812A295P3l8l7p2p3L8L8P1P1m0l9qppqj4j4M7M7K1K0o5o5O6O7k0j9j2j1M9N0O0O1n0n0j47
-6825A278j47J2J2R2R1j9j9M4M4M4M4K0J9K0J9l5l6p3p3J%%%nnnnP0P0j6j6r8r8Q5Q6M1M1
-6838A483p0o9k3k3J3J4J1J1m9n0j8j8j7j8J09J09K3K3q9q9llK8K7l3l4J3J4P4P5m8m8J4J3
-6851A352OOM2M3m3m4J8J9m6m6M0M0M2M3o8o8M7M8M7M8N9N9n1n2n1n2j5j5o1o1k4k4QQM5M5
$$ plain form
-6761 1143 1120 1134 1148 1121 1094 1129 1163 1219 1276 1332 1388 1410 1432 1418 1403 1374 1344 1314 1284 1295 1306 1318 1329 1404 1479 1518 1556 1452 1349 1307 1264 1290 1316
-6773 1316 1305 1294 1308 1321 1396 1471 1472 1473 1388 1303 1356 1409 1425 1441 1344 1247 1260 1273 1313 1353 1393 1433 1450 1468 1424 1381 1362 1344 1326 1308 1316 1324 1333 1341 1427 1512 1488
-6786 1488 1463 1421 1379 1336 1294 1315 1337 1358 1380 1358 1337 1316 1294 1329 1363 1337 1310 1324 1338 1352 1366 1358 1350 1379 1408 1387 1367 1384 1401 1420 1439 1458 1477 1377
-6799 1377 1277 1263 1248 1300 1352 1404 1455 1480 1505 1443 1382 1376 1370 1303 1235 1241 1246 1251 1256 1262 1268 1384 1500 1465 1431 1433 1435 1333 1231 1166 1101 1174 1247 1234 1221 1295
-6812 1295 1368 1330 1293 1221 1148 1186 1224 1295 1366 1326 1287 1279 1272 1265 1257 1243 1229 1276 1323 1344 1364 1299 1234 1300 1367 1347 1328 1316 1305 1354 1404 1464 1525 1475 1425 1278
-6825 1278 1131 1143 1155 1247 1338 1319 1300 1344 1388 1432 1476 1496 1515 1535 1554 1519 1483 1410 1337 1338 1338 1338 1338 1333 1328 1323 1318 1388 1458 1442 1426 1328 1230 1315 1401 1442 1483
-6838 1483 1413 1344 1321 1298 1311 1325 1336 1347 1298 1248 1230 1212 1195 1177 1286 1395 1418 1441 1352 1263 1260 1257 1285 1312 1279 1245 1258 1272 1346 1421 1373 1325 1339 1352
-6851 1352 1358 1364 1406 1449 1406 1362 1380 1399 1353 1307 1347 1387 1429 1472 1404 1336 1383 1431 1478 1526 1585 1644 1593 1541 1490 1438 1423 1408 1347 1286 1262 1238 1246 1254 1299 1344
-6864A344L6L7p4p4nnonn5n5N5N5M0L9LLjjl8l8j5j5j5j5L5L5L5L5OPPPK2K3m0l9MMM1M1O
-6879A424Op9q0J3J3J3J3k3k4o0o1NONNPOPPP5P5j0j1o2o2k5k5J6J5P7P6n8n8K7K8M7M8J1
-6893A387J0k6k6o3o2J2J2R1R1M9p4q2rPQk4k5J4J3o1O3P4%j1j2J3J2m8m9o6o6o7o6Q2Q3M5
-6906A229M6J5J5J5J6onL1L1J2J2M8M8o2o3o3o3K9K9l2l2n4n4QPO2O2N5N4N6o7q3q4k8k9k8
-6919A127k9L7L7L7L6rrrrN8N8k8k7n8n7J1J2J3J37J09L5N8N8rqp0p1p1p1L0L1kkl7L7nnk5
-6932A310k4Q1Q1n2j25q4j0m9K4O9O9rq3k1N2P0O9M4j28k03q1M9M8K9K9J15J14j5j6k0k0J
-6944A314p2k6k6J8R2L0m3k1k0q7q7L0K9qqj8j8j9j8opM0l3m9K4M0M0JKQ2Q3Kp2j31M0J22
-6957A220M9J5J4N6N5J9j04j38o4m5L0O1O1P0lj03j03K7K7K5K5K0R3J26J26%%j9N4l1j05q3
$$ plain form
-6864 1344 1380 1417 1343 1269 1264 1259 1253 1248 1193 1138 1193 1248 1288 1327 1330 1333 1332 1331 1293 1255 1240 1225 1210 1195 1230 1265 1300 1335 1341 1348 1355 1362 1384 1407 1367 1328 1332 1336 1377 1418 1424
-6879 1424 1430 1351 1271 1284 1297 1310 1323 1300 1276 1216 1155 1160 1166 1171 1176 1183 1189 1196 1203 1278 1353 1343 1332 1270 1208 1183 1158 1174 1189 1266 1342 1284 1226 1253 1281 1328 1376 1387
-6893 1387 1397 1371 1345 1282 1220 1232 1244 1335 1426 1475 1401 1319 1310 1317 1325 1301 1276 1290 1303 1242 1305 1379 1379 1368 1356 1369 1381 1333 1284 1218 1152 1085 1019 1101 1184 1229
-6906 1229 1275 1290 1305 1320 1336 1330 1325 1356 1387 1399 1411 1459 1507 1445 1382 1319 1256 1285 1314 1282 1250 1196 1142 1150 1157 1219 1281 1336 1390 1446 1379 1296 1212 1184 1155 1127
-6919 1127 1098 1135 1172 1209 1245 1236 1227 1218 1209 1267 1325 1297 1270 1212 1155 1166 1178 1191 1328 1437 1472 1530 1588 1579 1571 1501 1430 1359 1288 1318 1349 1347 1345 1308 1345 1340 1335 1310
-6932 1310 1286 1367 1448 1396 1271 1187 1177 1128 1152 1221 1290 1281 1198 1177 1229 1299 1368 1412 1284 1081 1000 1049 1097 1126 1155 1270 1384 1369 1353 1333 1313 1314
-6944 1314 1242 1216 1190 1208 1300 1330 1287 1266 1246 1159 1072 1102 1131 1123 1115 1097 1079 1060 1042 1036 1029 1069 1036 987 1011 1051 1091 1092 1094 1176 1259 1261 1189 1058 1098 1220
-6957 1220 1269 1284 1298 1354 1409 1428 1324 1186 1122 1077 1107 1168 1229 1299 1296 1193 1090 1117 1144 1169 1194 1214 1307 1433 1559 1559 1559 1540 1594 1563 1458 1375
-6969A375q2kjMMl7L7j7j6K5K5K4K3k0r4r1r0rrL0L0j6N7Q6J2k3k3L7J11M9k5l7l8j20m6J3
-6982A146J4J4J3O9nmO9K9K9k7k7m5m5m1m0oO7K1K1K3n1q3L9R7K3P2P2m5m6k6M7M4M4k1r4
-6995A347n4n4n6J15J27m6m8m9n8n8K9K8m7m7j0j0N2N3O2j2J6Q8M8k7l2l2M1l2r8r8l9L6L5
-7007A170l8m9m9LP7R7R7J%j9r3k2k2J1J1%%m2L2rj0nnO4O4K2K3l9j12p5kP2P1J6J5J22J22
-7020A499k0r4o1o2LP6J9J9o3o3l1l1j00K2J16J16l5l6o4o5k7k7J22J23j3j2r5r5n9n8q4q4
-7032H36P5P5O5O5J01J01q9q9m5m5oJ18J50k2k4N0m9K6L6l8p7p8M1M0LLJ5J5J5J4j4j4p5p6
-7044A103O2O2%%J1J1k6k6j28j29m2m2O9P0O9O9POO8O8n4n4n4n4O3O3KKk4k4J3J3l8l8jjN5
-7057A151N5l1l1k0k1O6O6N4N4n7n6j2j1m9m9n4n5Q1Q0K5K5j1j2J%L7L8m7m7j1j0M8M9o2o2
$$ plain form
-6969 1375 1293 1291 1290 1294 1298 1261 1298 1281 1265 1290 1315 1339 1362 1342 1248 1157 1067 1058 1049 1079 1109 1093 1150 1236 1248 1225 1202 1239 1350 1399 1374 1337 1299 1179 1133 1146
-6982 1146 1160 1174 1187 1256 1251 1247 1316 1345 1374 1347 1320 1275 1230 1189 1149 1143 1210 1231 1252 1275 1224 1141 1180 1277 1300 1372 1444 1399 1353 1327 1374 1418 1462 1441 1347
-6995 1347 1293 1239 1183 1298 1425 1379 1331 1282 1224 1166 1195 1223 1176 1129 1119 1109 1161 1214 1276 1264 1280 1368 1416 1389 1357 1325 1366 1334 1236 1138 1099 1135 1170
-7007 1170 1132 1083 1034 1037 1114 1211 1308 1309 1309 1290 1197 1175 1153 1164 1175 1175 1175 1133 1165 1156 1146 1141 1136 1200 1264 1286 1309 1270 1158 1083 1081 1153 1224 1240 1255 1377 1499
-7020 1499 1479 1385 1324 1262 1265 1341 1360 1379 1316 1253 1222 1191 1091 1113 1229 1345 1310 1274 1210 1145 1118 1091 1213 1336 1323 1311 1216 1121 1062 1004 920 836
-7032 836 911 986 1051 1116 1217 1318 1229 1140 1095 1050 1044 1162 1312 1290 1266 1316 1267 1293 1329 1291 1214 1136 1177 1217 1220 1223 1238 1253 1268 1282 1268 1254 1179 1103
-7044 1103 1165 1227 1227 1227 1238 1249 1223 1197 1069 940 898 856 925 995 1064 1133 1140 1146 1214 1282 1228 1174 1120 1066 1129 1192 1194 1196 1172 1148 1161 1174 1136 1098 1097 1096 1151
-7057 1151 1206 1175 1144 1124 1103 1169 1235 1289 1343 1286 1230 1218 1207 1158 1109 1055 1000 1081 1161 1186 1211 1200 1188 1189 1189 1226 1264 1217 1170 1159 1149 1197 1246 1184 1122
-7070A122o4o3k4N0J61Q8l3j07%Jj4O0L2m1l2l3m3m3J8J9M4M5j2j2NP8P4m9q6j3M5M4Ro4k7
-7083A135M7L5L5L5L5N1k3j3j4rO3k2k2L3q9j51k8J10J09j7j8k8k8l3l2K4n0n0K4nnJ9R3K7
-7095A238K6n9o0L7l7l7L6N5N5J5J5M8p5m2m2OOr9r9N5J29R6k8K4K3m1m1o3J0k6k6L0J03O7
-7108A299prqn0n0J3J2QPK0n3j2j3j5j5M9J23Q9J4M1l3p6p7j18j19J1J0k6k6q9q9M5M6K2K2
-7120I46K1K2P1P1J0Rk2k1r9r8o8Q0Q2Q3J00J00j0j0o9o9o9o9kkL5L5l1l1l2l1J9J9K0J9J1
-7133A020J0M8M7N5N4n6n5O9O9m1m0j13j13l7J11Q3Q4j8j8p4p5J2J1J09J08n0n1o4o4M7M7
-7144A115j0j0j0j0L2L2mnj02j02j7j6N3N3N4N3J4J3o3o3m3J05J04m2k2k1l1l0N0M9j1j2m4
-7156A059m5m4m5N6N6l1l0j0j1N0N0L0L0O6O7opooj05j05p8lo0O4J22M8J1o2j28n4M9N0J7
$$ plain form
-7070 1122 1058 995 971 1021 1182 1270 1237 1130 1130 1131 1117 1177 1209 1168 1136 1103 1060 1017 1035 1054 1098 1143 1131 1119 1124 1202 1276 1227 1141 1128 1173 1217 1226 1162 1135
-7083 1135 1182 1217 1252 1287 1322 1373 1350 1337 1323 1314 1377 1355 1333 1366 1277 1126 1098 1208 1317 1300 1282 1254 1226 1193 1161 1185 1135 1085 1109 1104 1099 1118 1211 1238
-7095 1238 1264 1205 1145 1182 1145 1108 1144 1199 1254 1269 1284 1332 1257 1215 1173 1179 1185 1086 987 1042 1171 1267 1239 1263 1286 1245 1204 1141 1151 1125 1099 1129 1232 1299
-7108 1299 1292 1283 1275 1225 1175 1188 1200 1208 1215 1235 1182 1170 1157 1142 1127 1176 1299 1388 1402 1443 1410 1334 1257 1139 1020 1031 1041 1015 989 900 811 856 902 924 946
-7120 946 967 989 1060 1131 1141 1150 1128 1107 1008 910 842 922 1004 1087 1187 1287 1277 1267 1198 1129 1060 991 989 987 1022 1057 1026 995 963 932 951 970 990 1009 1020
-7133 1020 1030 1078 1125 1180 1234 1178 1123 1192 1261 1220 1180 1067 954 917 1028 1111 1195 1177 1159 1085 1010 1022 1033 1142 1250 1200 1149 1085 1021 1068 1115
-7144 1115 1105 1095 1085 1075 1107 1139 1135 1130 1028 926 909 893 946 999 1053 1106 1120 1133 1070 1007 964 1069 1173 1131 1109 1088 1057 1027 1077 1126 1115 1103 1059
-7156 1059 1014 970 925 981 1037 1006 976 966 955 1005 1055 1085 1115 1181 1248 1242 1235 1229 1223 1118 1013 935 932 872 936 1058 1106 1117 1055 927 873 922 972 989
-7169I89J8J3J4J3J4j7j7R4R3J7J6k1k0l6l6p2p3K2K2n7n6l9Q4O0j2j8N7J0J0k4k4J3J3J1
-7181A061J0p5p5J0J0P1P1ppj9N4J65M3r3r2n5n5n4n5Q0P9J9J8k5k5J1J2K4K4o1o2q5q5P4
-7193I06P4O1O2O1O1n1n1n0n1J0J0P2P1k3k4q4q5P0O9P0P0m4m4m4m4l7l8K4K4M3M4PPl7l8
-7206A071l7l7O6O6j18j18jjL6L5J5J5J5J5M6M5j5j6j2j2M9M9J3J2p3p4QQO9O9r4r4qqm9m8
-7219H87m5J02J04J03k3k2M0M1LMM8M9l8l7n3n3RRo5o5M6M6O4O4LLj30j29ONO2O2m8m8j7j7
-7232I70M4M4o0n9o0n9J0J0l6J11N1N1QQj13L5Q7Q7N2N1l4l4m6m6j0rL9M0m6m7m5m5M1M0K1
-7245A051K1K0K1jkjjJ4J4p2p2L8L8m8m7nnnmKKKKl4l4l8l9N5j9j5j4K3K4O1O0J1J0J1J0o4
-7259I70o4K2K2l9m0klonq4j0O1O2M6k7kkP4P5l2j06j05l2M8M8J2Q5J7J6K2K1l1l1j1O3O8
$$ plain form
-7169 989 1007 1020 1034 1047 1061 1044 1027 1121 1214 1231 1247 1226 1206 1170 1134 1062 989 1011 1033 976 920 881 965 1025 1013 995 1052 1062 1072 1048 1024 1037 1050 1061
-7181 1061 1071 996 921 931 941 1012 1083 1076 1069 1050 1104 1269 1312 1219 1127 1072 1017 963 908 988 1067 1086 1104 1079 1054 1065 1077 1101 1125 1064 1002 917 832 906
-7193 906 980 1041 1103 1164 1225 1174 1123 1073 1022 1032 1042 1114 1185 1162 1138 1054 969 1039 1108 1178 1248 1204 1160 1116 1072 1035 997 1021 1045 1088 1132 1139 1146 1109 1071
-7206 1071 1034 997 1063 1129 1011 893 892 891 927 962 977 992 1007 1022 1068 1113 1098 1082 1070 1058 1107 1156 1169 1181 1108 1034 1042 1050 1119 1188 1094 1000 992 984 935 887
-7219 887 842 944 1048 1151 1128 1106 1146 1187 1190 1194 1242 1291 1253 1216 1163 1110 1119 1128 1063 998 1044 1090 1154 1218 1221 1224 1094 965 971 976 1038 1100 1052 1004 987 970
-7232 970 1014 1058 998 939 879 820 830 840 804 915 966 1017 1025 1033 920 955 1042 1129 1181 1232 1198 1164 1118 1072 1062 1053 1092 1132 1086 1039 994 949 990 1030 1051
-7245 1051 1072 1092 1113 1112 1110 1109 1108 1122 1136 1064 992 1030 1068 1020 973 968 963 958 954 956 958 960 962 928 894 856 817 872 853 838 824 847 871 932 992 1003 1013 1024 1034 970
-7259 970 906 928 950 911 871 869 866 860 855 771 761 822 884 930 903 901 899 973 1048 1016 910 805 773 821 869 881 966 983 999 1021 1042 1011 980 969 1032 1100
-7273A100O9Q1m2k0j9k8k7K1K1o5o4l9l9l1l1k0J02K02J28J19nj19j19j7N6k2k2n7n7k0k1
-7284A015l3l3QQn5J9Q0Op1p2J0J0R4R4K9m4n8J6K6K6mp8RQ2k2k3j3j3r2k0JJOPl5L8L9M0
-7298I98l5M0P9P9L9l5j7j7K0n3m8m7j5j5K5K5K5K4jjQ4Q5N2N1r8r9j21K6J12l6j02j03kj
-7310I18n0n0J1J2N5N6J9J9L9L9k3k3o3o2q4O3L5L6j7j6l2l2MNK2K1j5j5J1J2n0n0K4K4K4
-7323H67K4l3l2P9P8R1R2m4m3l8l8K3K4K8K8K3K3j2q7r5N2J2o1q9j5J7J7j5j6m2m2K0J9O1
-7335H76O0Jp2l7J10J43nq0q0n2n2J2J2k4k5P2P2J1J0q8q8M6M7J2J2J2J2K4K4O1O1j6j7j03
-7347I51j02K3K4ONN8N8mlM6M6m0l9k3k3n6n5QQ1M6j01j54qL5L5%jL7L6ppL0K9N3N3L5L4n1
-7361A055n2n2n1k0j9O6O7llq9q9m8m8J12J12l0k9Q1Q1n7n6r4r4j2j2j2j2J6J6lkO7O7L1L1
$$ plain form
-7273 1100 1169 1250 1208 1188 1169 1141 1114 1135 1156 1091 1027 988 949 918 887 867 969 1171 1299 1418 1413 1294 1175 1158 1214 1192 1170 1113 1056 1036 1015
-7284 1015 982 949 957 965 910 929 1009 1015 944 872 882 892 986 1080 1109 1065 1007 1023 1049 1075 1071 993 1002 1084 1062 1039 1026 1013 921 901 902 903 909 916 881 919 958 998
-7298 998 963 1003 1082 1161 1200 1165 1148 1131 1151 1098 1050 1003 988 973 998 1023 1048 1072 1071 1070 1154 1239 1291 1342 1244 1145 1024 1050 1162 1126 1024 921 919 918
-7310 918 868 818 829 841 896 952 971 990 1029 1068 1045 1022 959 897 813 876 911 947 930 914 882 850 854 859 881 902 887 872 883 895 845 795 819 843 867
-7323 867 891 858 826 905 983 1074 1166 1122 1079 1041 1003 1026 1050 1078 1106 1129 1152 1140 1053 958 1010 1022 961 872 857 874 891 876 860 818 776 796 815 876
-7335 876 936 937 865 828 938 1081 1076 996 916 864 812 824 836 812 787 859 931 942 952 864 776 822 869 881 893 905 917 941 965 1026 1087 1071 1054 951
-7347 951 849 872 896 902 907 965 1023 1019 1016 1062 1108 1068 1029 1006 983 927 872 880 961 1007 906 752 744 779 814 814 813 850 886 879 872 902 931 984 1037 1072 1106 1055
-7361 1055 1003 951 900 880 861 927 994 991 988 899 810 762 714 826 938 908 879 960 1041 984 928 834 740 728 716 704 692 708 724 721 719 786 853 884 915
-7374I15J3J2l9m0n4R2P1P1mmj8N6L2j15j11L7K0J9qqj7j6l5l4k9k9L3L2j1j1m7m8LLM0L9
-7387H10P6P6q4q3J8J8J8J8k9k8QQnoL2L1nnk3k3MMM1M0L5L5k6k6r0r0r0r0Q9Q9K7K7L9L8
-7401H78m7m7j3j4kP1J9j28n9J5QQ1J31J30opk5k4nnJ3J4k6k5q7q6K2K3m8m8J13l5j3j3k8
-7414G27k9L3L3J8J8j8j9K0J9j7j7LML0L1K0j27o5Q1N5N5K3K3p3j48j47%L6J10J14J15j5j4
-7426H79K2K2QQk9k9KKl5l5j2j2p3p3jjL5L6O3O3m8m7kjL5L5Q6Q6k5k5m6m6rj0l2l3MMO3O3
-7440H92KK%Jm8K5J6j07l3l3o3o3M7M7RRRQj1j2P5J48M5p6j06l2nmL6L7O4O5p1p0p0o9qqj7
-7454F31j7K0J9N8N7qql9j11j03K0K7K6L5L4kkL6L5lkl9l8KLn2n1l1R1J49P6M9M8j7j7k2k2
-7468H32k2k2o5o4llL2L1k9l0K7K6K7K6m6m6rj0O8O7o8o7m3m3m2m3O0O0O0O0K1K1qrj00K1
$$ plain form
-7374 915 928 940 901 861 807 899 970 1041 1037 1033 1015 1071 1103 988 877 914 934 953 945 937 920 904 869 835 806 777 810 842 831 820 773 725 728 731 771 810
-7387 810 886 962 878 795 813 831 849 867 838 810 818 826 821 815 847 878 873 868 845 822 826 830 871 911 946 981 955 929 839 749 659 569 658 747 774 801 840 878
-7401 878 831 784 771 757 755 826 845 717 658 673 681 762 893 1023 1017 1010 985 961 956 951 964 978 952 927 840 754 776 799 751 703 816 781 768 755 727
-7414 727 698 731 764 782 800 782 763 783 802 785 768 771 775 805 836 856 729 664 745 800 855 878 901 828 680 533 533 569 679 793 908 893 879
-7426 879 901 923 931 939 910 881 883 885 850 815 803 791 718 645 644 643 678 714 777 840 792 745 743 742 777 812 898 984 959 934 888 842 833 823 791 758 762 766 829 892
-7440 892 894 896 896 897 849 874 890 783 750 717 654 591 638 685 694 703 712 720 709 697 772 920 965 889 783 751 746 742 778 815 879 944 873 803 733 664 656 648 631
-7454 631 614 634 653 711 768 760 752 713 602 499 519 546 572 607 641 639 637 673 708 705 703 664 626 628 631 579 528 497 588 737 813 862 910 893 876 854 832
-7468 832 810 788 723 659 656 653 685 716 687 657 684 710 737 763 717 671 662 652 720 787 719 652 609 566 524 481 541 601 661 721 742 763 755 746 646 667
-7481F67Q8Q7QQk9k9m0m0K2K1RQmJ19R1J8kp6p0p0L6L5J5J4k3k2N5N4n5n5K3K3K4K3p6p6j4
-7494G67j5O0O1O0O1j7j6K1K0J3J2p4p4j5j5M6M6o9o9j39o6n0P3J56Q2K5m9j3j2k5k5O0O0
-7506H80K8K7K8K7qrqrK7K7q4q4j17j17ppJ2J2MNN3p0J7J39R5R5J7J7n1n1L5L5q1q1o9N4N3
-7520H34k1K8K8nmo6o6l4l4LLKJL9L8L8L9JJmnN6N7q2q2MMk1k1k1k1QRP0P1P1P2o3o3k4k4
-7535H16k3k4Q2Q2k8k8j5j6j5j6n6n7MNK4K4K4K4j2j1K4K5o0o1k3k4%J%%l1l2OOMMMMQ1Q1
-7549G93L3j13n9J4N0M9l8l8P2P2k7k7RRLKj09j08J5J4J4J5k3k2k3k3O0O1O0O0k8k8k8k8r
-7562F74rK8K8L9L9L8L9r6r6rj0N9O0K4n0o5Q2K1j26j15m1j0j1N6j8lJ44R7K3J2J2qrp0p0
-7574F59l7l8l8l7J6J7N3N4M4M4Q1Q0KKo0n9m4m5m4m4J2J2M8M9p1p0j0rk0k0k0k0K0K0K1K0
$$ plain form
-7481 667 755 842 850 858 829 800 760 720 742 763 772 780 776 895 986 1004 1002 926 856 786 822 857 872 886 863 841 896 950 895 840 863 886 910 933 857 781 767
-7494 767 752 812 873 933 994 977 961 982 1002 1015 1027 953 879 864 849 895 941 872 803 664 598 548 621 777 859 884 835 822 810 785 760 820 880
-7506 880 908 935 963 990 982 973 965 956 983 1010 926 842 725 608 601 594 606 618 622 627 680 610 627 766 861 956 973 990 939 888 923 958 877 796 727 781 834
-7520 834 813 841 869 864 860 794 728 694 660 663 666 668 669 708 746 784 823 824 825 821 816 872 929 847 765 769 773 752 731 710 689 697 706 776 847 918 990 927 864 840 816
-7535 816 793 769 851 933 905 877 862 846 831 815 759 702 706 711 735 759 783 807 795 784 808 833 773 712 689 665 665 666 666 666 635 603 609 615 619 623 627 631 712 793
-7549 793 826 713 654 668 718 767 729 691 763 835 808 781 790 799 802 804 695 587 602 616 630 645 622 600 577 554 614 675 735 795 767 739 711 683 674
-7562 674 665 693 721 760 799 837 876 780 684 675 665 724 784 808 758 693 775 796 670 555 514 504 493 549 531 528 672 769 792 804 816 808 799 729 659
-7574 659 622 584 546 509 525 542 595 649 693 737 818 898 900 902 842 783 739 694 650 606 618 630 678 727 656 586 576 567 547 527 507 487 507 527 548 568
-7588E68K0K0N7N7N9N9n1n2m8m7Q7Q7j8j9j9j8NNNNn1n1m3m3K3J45J13rl2M2o8o8m4m3J7J8
-7601F68L7L6m9n0n7n7MNM0M1P8P7nnm2m2L4L4k7k7j6j6j2j2j8N6Q4l9l8l9n3O9K0K1K8K9
-7614G57J6J7J7J7j6j6j6j6J8J8J7J8n3n3n4n3k8k9QQN9N8n2n2M4M4L6L6K2j00j05l1%P3J10
-7626G19L6J0o4o9NK1K1l6j09k9R4R9K5l2l1j15m1J07J07k7j00L5J09R5R6j6r0m3m4l9L5k2
-7638G07r6l6L8qqp4p3Q6Q6j8j7O8O8M8M8PPK7m7m1m2j3j4j3j3nno1o1k5M8O5J39O8j04o0
-7651F76n9l5L8Q0Po6QM8M8p5p5j3j4q8q8M6M7J6J6O0J34M8M8n3n4l2M2M2l2K9L0K0K1l6j09
-7664F75m8K6K6K6K6K6J8n6m4m3q5L8R7K3k8k8o9o9M6M6J0RmmN7N7mmL3L3l1l0l1l0o5o5O3
-7677E97O2R9k3l2M1j0rnnm0m1M5M5OOn6n5n7n7K8K9J3J3k4k4O1O1O2O1ooN5N5m4m3q1q0N4
$$ plain form
-7588 568 588 608 665 722 781 840 789 737 689 642 729 816 798 779 760 742 747 752 757 762 711 660 617 574 597 742 855 846 814 856 788 720 676 633 650 668
-7601 668 705 741 692 642 585 528 532 537 577 618 696 773 768 763 721 679 713 747 720 693 677 661 649 637 619 675 759 720 682 643 590 659 679 700 728 757
-7614 757 773 790 807 824 808 792 776 760 778 796 813 831 778 725 671 618 590 561 569 577 636 694 642 590 634 678 714 750 772 672 567 536 536 609 719
-7626 719 755 765 701 632 637 658 679 643 534 505 599 698 723 691 660 545 504 611 718 691 591 626 735 830 926 910 820 777 733 694 729 707
-7638 707 611 575 613 605 597 523 450 536 622 604 587 655 723 771 819 826 833 860 813 772 730 717 703 690 677 672 667 606 545 520 568 633 772 840 736 676
-7651 676 617 582 620 700 707 641 649 697 745 670 595 582 568 480 392 438 485 501 517 577 711 759 807 754 700 668 710 752 720 749 779 799 820 784 675
-7664 675 627 653 679 705 731 757 775 719 675 632 547 585 682 705 677 649 580 511 557 603 613 622 618 614 671 728 724 720 753 786 755 725 694 664 599 534 597
-7677 597 659 758 735 703 744 734 725 720 715 675 634 679 724 730 736 680 625 568 511 539 568 581 594 570 546 607 668 730 791 785 779 834 889 845 802 721 641 695
-7691F95N5l2l1jkook2r5r1L2R9K6P9Oj4j4j5j4%P4mj27m9K5L7L7NMM2M1J7J7o9o9j5j4j5
-7705E86j4K7K7n8n9Q8Q8k2k3o2o2K4K3k0k1M0M1P3P4q6q7K2K2K2K2m0m0M5M6k8k8k8k8ML
-7718E71r8r9j5J08Q0Pj5j6M1M1Q1Q0l0l0n7n8k0k0N1N2j0rK9K9pqp9q0L1L1n8n7p0N3P4%
-7731E23N0M9N6N7nmj0rrj0n7n8MMN9O0K3K3J7J6N4N4k6k5j11j12J7J6J6J6j9j9J8J7j0j1
-7744F54j0j1n6n6P2P1O9n5r5K7J00K7n9n9j16j17R1R2L3L3L4L3j1j0j1j1j6j7K8K8j3J10
-7755G79K5m8m2L1K6m7j19j19J1J1n3n2Q2Q2J12J11N0N0J8J8j1j2j49k6L9L9J8J8j9j9l4l5
-7767G35p1p1j9j9O7O6o4o4k8k7QPn3n4O8O7L0L1J1J1J2J1o0o0N0N1J1J1O8O8m7j20j12J2
-7779E26PPJ5J5K3K2o3o4j3j3nnjJ22J23N0k4j47r1L3M8M8ool4l4N2N2n4n4n4n4M3M3m4m3
$$ plain form
-7691 695 750 718 687 686 684 678 672 650 555 464 496 595 621 700 706 692 678 663 649 649 723 719 592 543 568 605 642 647 651 693 734 751 768 699 630 615 601 586
-7705 586 572 599 626 568 509 597 685 663 640 578 516 540 563 543 522 562 603 676 750 664 577 599 621 643 665 625 585 630 676 648 620 592 564 568 571
-7718 571 473 374 359 467 547 554 539 523 564 605 686 766 736 706 649 591 571 551 602 654 644 635 664 693 686 678 599 519 550 581 523 466 396 449 523 523
-7731 523 573 622 678 735 730 726 716 707 698 688 631 573 577 581 640 700 723 746 763 779 833 887 861 836 725 613 630 646 662 678 659 640 658 675 665 654
-7744 654 644 633 577 521 593 664 733 678 583 610 710 737 678 619 503 386 477 569 602 635 669 702 691 681 670 659 643 626 654 682 669 779
-7755 779 804 756 714 745 771 724 605 486 497 508 455 403 485 567 679 790 840 890 908 926 915 903 754 728 767 806 824 842 823 804 770 735
-7767 735 664 593 574 555 622 688 624 560 532 505 513 520 467 413 481 548 578 609 620 631 643 654 594 534 584 635 646 657 725 793 746 626 514 526
-7779 526 533 540 555 570 593 615 552 488 475 462 457 452 451 573 696 746 722 575 484 517 565 613 607 601 567 533 585 637 583 529 475 421 464 507 463 420
-7792D20L5L5L5L5K0J9j7j7KLKLj3j3j3j3o6o6K0K0poNo8p0N3O5O5rrN3N3p6p6j5j5R7R6j4
-7807E53j4j2j1j2j2LKO3O4kjjkM0L9p1p1M0M0Mj20j19m6K3R7m6m5nmL2L1O4O4L7l6RJ0l9
-7820E46L5L5l9J9K0J0J0L6l6MNo0n9m4K9L2m2l2l3OPl0l1M7M7M3M2l7j10n0K4M7M6j0j0O3
-7834E30O3m7j70j26n4M1J13M4M3j3j3k0k0M1M1K3K4K3K3JJL3L3P8Ml6l6r1j8J16J17L0r3
-7845F85r3K9k4k4j6j6m0l9lkJ2J2O5O6N1p2qO6J5J5%p3q4q4o9NP7P8M4M5k1k1J5J6KKj9r1
-7859E01kkl6l6k0J02k5j47j14QO7O7K8K9k8k9oO6Q7Q6k7k6k7k7QQQQJ0J0k6k7K5K4K4K4R
-7873E94RRRn3n3L4L3k7k6J0J0k1k0k5k5M2l2MP9K1K1l5l6j8j8R2R3MMMMP1P0r0q9pqn3K0
-7887F01L8l6m6m6r8k4P3J46P8Oq0p9o8OM7k7q6j2LLQ4Q3Q3Q3M1M1K4r9n3n4j67j67K3R8R7
$$ plain form
-7792 420 455 490 525 560 580 599 582 565 567 570 572 575 562 549 536 523 457 391 411 431 424 418 423 355 285 338 403 468 459 450 503 556 480 404 389 374 471 567 553
-7807 553 539 527 516 504 492 495 497 560 624 622 621 620 618 658 697 626 555 595 635 639 519 400 354 377 474 428 383 378 374 406 437 501 565 602 566 575 585 546
-7820 546 581 616 577 596 616 626 636 672 636 640 645 585 526 482 511 543 501 469 436 442 449 419 388 435 482 525 567 530 420 370 394 441 487 477 467 530
-7834 530 593 546 376 250 196 237 350 394 437 424 411 391 371 412 453 476 500 523 546 547 548 581 614 692 696 660 624 533 515 631 748 778 685
-7845 685 592 621 597 573 557 541 501 462 459 457 469 481 546 612 663 591 583 649 664 679 679 606 522 438 369 374 451 529 573 618 597 576 591 607 609 611 592 501
-7859 501 499 497 461 425 405 507 482 335 221 229 296 363 391 420 392 363 357 423 510 596 569 543 516 489 497 505 513 521 531 541 515 488 513 537 561 585 594
-7873 594 603 612 621 568 515 549 582 555 529 539 549 528 508 483 458 500 468 472 551 572 593 558 522 504 486 578 671 675 679 683 687 758 828 738 649 642 634 581 601
-7887 601 639 603 557 511 413 389 462 608 686 692 612 533 465 471 518 491 405 393 396 399 483 566 649 732 773 814 838 739 686 632 465 298 321 419 516
-7900E16K4mmK9K8J2J2n0n0kkkkj7j7j6j7j4j3J09J09J0Ro4o4J9K0n4n5l1l1l1l1l1l0M3M3
-7913C51n3n4K0K1MMP7P8J0J0J0J0k8k8k8k8J0J1M8M8R7R8k6k5rrrrm7m8m7m8k6k6k6R7J14
-7927E44M1R1R0p6p5p6p5K1K1K1K1k3k3N1N1lmm0m0QQo5o5OPOPqppqL6L6L6L6l9m0l9l9J19
-7941E05J19mmm3m3ookkl3J39J11j3n5n5j1j1j2j1MMo9p0K0K1K0K0k0k0j9k0M0M1l3l3J0J1
-7954D70k7k6K6K6K6K6m9m8K5K5J4J4J4J5%%J%ppppP0P0n3n3p6p7M7M6nmmnL0L0K6r7q3q4
-7969B82Q1Q1R8R9R1R1Lj20j93p1lml3l2m5m4K9L0L1L1m2m3J7J8J7J7Q6Q5J1J2k5k5J1J2J3
-7982E66J3k4k3n3n3K1K1Q8Q7q3q4n0n0K3K3Q6Q6l7l7m4m5n7J7K2j00J0RJ0J0J0J0J01J01
-7994E74K8K7m5m4K9K9j0j0q3q4L9L8L4L4n6j29l0R4R5k7n8J5J6n9m9n0PPOPN4N4J7J7j8j7
$$ plain form
-7900 516 540 536 532 561 589 601 613 563 513 511 509 507 505 488 471 455 438 424 411 520 629 639 648 584 520 539 559 505 450 419 388 357 326 295 265 308 351
-7913 351 298 244 264 285 289 293 370 448 458 468 478 488 460 432 404 376 386 397 445 493 590 688 662 637 628 619 610 601 554 506 459 411 385 359 333 430 544
-7927 544 585 676 766 690 615 539 464 485 506 527 548 525 502 553 604 601 597 557 517 525 533 468 403 409 416 422 429 421 414 407 399 435 471 507 543 504 464 425 386 505
-7941 505 624 620 616 573 530 524 518 516 514 481 620 731 718 663 608 597 586 574 563 567 571 502 432 452 473 493 513 493 473 454 434 474 515 482 449 459 470
-7954 470 443 417 443 469 495 521 472 424 449 474 488 502 516 531 531 531 532 532 525 518 511 504 574 644 591 538 462 385 432 478 473 469 465 460 490 520 546 449 366 282
-7969 282 363 444 542 641 732 823 826 706 513 442 439 435 402 370 325 281 310 340 371 402 360 317 334 352 369 386 472 557 568 580 555 530 541 553 566
-7982 566 579 555 532 479 426 447 468 556 643 560 476 426 376 399 422 508 594 557 520 476 431 374 391 413 313 323 332 342 352 362 372 473 574
-7994 574 602 629 584 540 569 598 588 578 495 411 450 488 522 556 500 371 341 435 530 503 445 460 476 417 368 318 325 332 338 345 399 453 470 487 469 452
-8007D52n5n4l6l7P4P3POl1l0m8m7J3J4O8O8o7o7OOOOjko3o3M6M7M6M7j5j4M8M7K0K0J07J06
-8021G03j03j03o7o6L8L8L0L0Q8l4p2Jkp5k8k9mlL3L3J18J18m1m2J0Rk8k7o5o5k9k8n1n2L5
-8033B70L4j7j8K0J9N9N9n1n2rrK8K8MMMMm9m9J2J2R1R1j9r3pJ16K5r7p4p3N4N3N1N1N1N1
-8047E74N4N3j31j30o0o0JJj5j5j5j5N2N2Q9Q9k3k3k4k3P3P2j4q7j34j1K6K5O7O8j9j8o3o3
-8059C53M8M7M4M3j8j8M1M0MLk1k1q2q2J5J5J01J01o9o9o9o9PPl0l0j0rm6m6P7P6jkr3L0J20
-8073C87J21JKJKn1n2j4j4J7J7J03J03n3n3L3L3J6J7k1k1m6m6L9M0J4J4J4J5j4j3n0n0j8j9
-8085D54q0q0O3O3K6K6K4K4K3K4K4K5l7l7l4l5l4l5M9N0k5k4p3p4n0K3P3p5j47p3jP3P3P2
-8098B75J9J8j9j8J24J23Q9n8j26n2J9K0j7j7K0J9%jl7l7M7M7J11J11R8n0m0m0k4k3k4k3M1
$$ plain form
-8007 452 397 343 307 270 344 417 424 430 399 369 321 274 287 301 369 437 370 303 309 315 321 327 326 324 261 198 244 291 337 384 369 355 403 450 470 490 597 703
-8021 703 600 497 430 364 402 440 470 500 588 554 482 483 481 406 378 349 345 342 375 408 526 644 603 561 571 580 552 525 460 395 366 338 287 235 270
-8033 270 304 287 269 289 308 367 426 375 323 314 305 333 361 365 369 373 377 328 279 291 303 394 485 466 373 366 482 507 410 336 263 317 370 421 472 523 574
-8047 574 628 681 550 420 360 300 301 302 287 272 257 242 294 346 435 524 501 478 454 431 504 576 562 475 341 330 356 381 448 516 497 479 416 353
-8059 353 401 448 492 535 517 499 540 580 584 587 566 545 463 381 396 411 512 613 544 475 406 337 344 351 321 291 281 272 226 180 257 333 332 330 237 267 387
-8073 387 508 509 511 512 514 463 411 397 383 400 417 520 623 570 517 550 583 599 616 595 574 528 482 521 561 575 589 603 618 604 591 541 491 473 454
-8085 454 374 294 357 420 446 472 496 520 543 567 591 616 579 542 508 473 439 404 453 503 478 454 381 307 257 280 353 278 131 58 57 130 203 275
-8098 275 294 312 293 275 399 522 611 553 427 375 394 414 397 380 400 419 419 418 381 344 391 438 549 660 758 708 668 628 604 581 557 534 575
-8110E75M2l2l2m8m9j2j2j8j8J9J9kjkkN2N2J5J5o1o2J3J2k3k3J4J4k4k4R9R9K6K6m8m8o3
-8123D88o3J1J1R0R1l2l2m4m4K9K9N7N7j16j15m6m6J26J25n1n2n1n2qrqrOOP9Q0ononl3l3
-8136D19LMR7R7K4K3n1n1j4j4onO7O8N7N7o6o6n4n3J9K0K4K5n0m9N7N8j6j5m2m2L2L2O0N9
-8149G08o3o3m3m3L0L0LLKLK4K4K4K4J3J3o0o1jjjkJ4J4n9o0M3M2M3M2KKKJn5n6q3q3n1R5
-8164D16J69K2ooj5j5m2m1Ro4q8O0R4R5o4o4k7k7p8p8mmK5K6K6K5J12J12j0j1rrj32j31j9
-8176B47j9N3J26L5j13k5k5K6K7m3m3p0LJ68K0o5o5%jQ9Q9R9m9l4l4R1R2k9k9k8k9J1J1J1
-8189D97J1nnnnr0r0mmO2O2m9m8L5L6L6L6k4k4k5k4N3N3n8n8ppppJ2J3k5k4k7k7O0N9MNl2
-8203C53l2L1L2L1L2J0J0P2P2j7j8p8p9K1K1K1K1n9n9K7K7J5J6J5J5JKl6l5J5J5O6qo4Q2Q3
$$ plain form
-8110 575 617 585 553 505 456 444 432 414 396 415 434 432 431 429 427 479 531 546 561 500 438 451 463 440 417 431 445 421 397 496 595 621 647 599 551 488
-8123 488 425 436 447 537 628 596 564 520 476 505 534 591 648 532 417 371 325 451 576 525 473 422 370 362 353 345 336 342 348 427 507 501 496 490 485 452 419
-8136 419 422 426 523 620 644 667 616 565 551 537 531 526 593 661 718 775 709 643 589 536 555 575 599 624 574 525 582 640 624 609 567 525 557 589 649 708
-8149 708 645 582 539 496 526 556 559 562 564 567 591 615 639 663 676 689 629 568 567 566 565 563 577 591 532 472 515 557 600 642 644 646 648 649 594 538 455 372 321 416
-8164 416 585 607 601 595 580 565 523 482 491 427 339 399 493 588 524 460 433 406 328 250 246 242 267 293 319 344 456 568 558 547 538 529 397 266 247
-8176 247 228 281 407 442 329 304 279 305 332 289 246 176 179 347 367 302 237 237 236 325 414 513 464 430 396 487 579 550 521 493 464 475 486 497
-8189 497 508 503 498 493 488 398 308 304 300 362 424 375 327 362 398 434 470 446 422 397 373 426 479 421 363 356 349 342 335 347 360 335 311 284 257 317 376 380 385 353
-8203 353 321 352 384 415 447 457 467 539 611 594 576 498 419 440 461 482 503 444 385 412 439 454 470 485 500 501 503 467 432 447 462 528 520 456 538 621
-8216F21o4p8nL1L1J1J1J1J1m0m1mml9m0M7M7l1l1l0l1J6J6m5m5q4q4K6K7J2J3J2J3J7J7J7
-8230C11J7mlL3L3j6j6j6j7N2N1P3p5LMq9N8K1K1ppm2m1j19j18n1R7J23J24O7O6o8o8l0l0
-8242C37N6N6K4K5Q6Q7r6r5L0L0K3j24j24K3M2M1N1N1J0J0J6j31j83l7OPM0M1k0k1PPPPNO
-8255C00NNM1M1NMppqpP2P2j3j4ppppnnm2m1j0rK7K8N3N3J7J7K3K3o3o3J4J4p2p2N6N6J9K0
-8271D99j0j0r6r5L4L5k6k7j5j6O1O1O9p8j40QK4K5llj6j5K1K1llL4L3m2m2J9J9l5l5LKQ5
-8284C43Q6p3p4J06J05P9o9o5o5L6L7J14J15r4r4K8K9l3l3kll9l9K7K7Q8Q8n6n5NNQ5Q5n1
-8296F43n0p0p0M0M0N8N8j02j01j05j05L1L0l8l9K3K3L5L4P2P1QPQQrrj0rj0rK7K7k4k4J4
-8309D73J3ooool9l9ppk3r8l2J14J14M1Po7j40OL0L0J4J4J4J5LLLLj7j7p8p8K1K2L2J06J06
$$ plain form
-8216 621 557 479 474 505 536 547 558 569 580 540 499 495 491 452 412 459 506 475 444 414 383 399 415 370 325 241 157 183 210 222 235 247 260 277 294 311
-8230 311 328 324 321 354 387 371 355 339 322 374 425 498 423 426 430 341 399 420 441 434 427 385 344 225 107 56 153 276 400 467 533 465 397 367 337
-8242 337 393 449 473 498 584 671 575 480 510 540 563 439 315 338 380 421 472 523 533 543 559 428 245 208 214 221 261 302 282 261 268 275 282 289 294 300
-8255 300 305 310 351 392 397 401 394 387 379 372 444 516 503 489 482 475 468 461 456 451 409 368 358 349 376 404 457 510 527 544 567 590 527 464 478 492 420 348 404 460 479 499
-8271 499 489 479 383 288 322 357 331 304 289 273 334 395 464 386 246 254 278 303 300 297 281 266 287 308 305 302 336 369 327 285 304 323 288 253 256 258 343
-8284 343 429 356 282 388 493 572 503 438 373 409 446 560 675 581 487 515 544 511 478 476 473 434 395 422 449 537 625 569 514 519 524 609 694 643
-8296 643 593 523 453 493 533 591 649 547 446 341 236 267 297 259 220 243 266 301 335 407 478 486 493 501 509 500 491 481 472 462 453 480 507 483 459 473
-8309 473 486 480 474 468 462 423 384 377 370 347 249 217 331 445 486 493 426 286 292 322 352 366 380 394 409 412 415 418 421 404 387 309 231 252 274 306 412 518
-8323E18m2j5j6j14j14k1N3JJQ6Q7O1j3n0K4POqq3j5j6k0k0l0l0j0O4J13J14Mo9lP1l7l7l3
-8336D14l3NMj09j09k3k2N5N6R7K4l6l5Oo8k3N1N1k3l3M1nnM6M6Po8p9oQ3Q3L1L2L1L1M3M3
-8350F03KJj3q6q2q1j8j8J8J9mm%%rO4L1m2p7lJ2J2o1o0k3k4k5k5O4J38P2jl7l6o5J0l2l2
-8364A88K6K7O0N9J03K9o4o4PPLKN1k4j8j9o2o1j7N6L0L0L4L4n8n7k1k1M0M0M0L9O3O3K6K6
-8377E97o3o4o3o3j1j1m7m7P0O9j6j6j6j6j6j6K2K3K3K3p7p7L3L4P1P1RJ0l9m0q1q0kp5o6
-8389E3N7L7L6QQO6O6L0K9j4j4n1n1Q3Q3P5P5j8j41j13l9N0N1J9J9O2O3K6K5r8r8o2o1rrq
-8402B35rN1N0o0n9j3j4j3j3M6M6M6M6poopl1l0l1l1RRk8k8M2M2J0J0L4J07R8k5o3o4p1p2
-8416B00PPPOM0M0KLopjkm0L5Kp2KP6pqm2m2m2m2M7M7J03J04N2k2k2N2j6j7o8o8j4N9Q0Q0
$$ plain form
-8323 518 476 461 445 331 217 196 249 250 251 337 424 485 472 422 446 453 459 451 368 353 337 317 297 267 237 227 291 404 518 522 453 450 521 484 447 414
-8336 414 381 386 390 281 172 149 127 182 238 335 359 323 288 294 226 203 254 305 282 249 290 285 280 326 372 379 311 232 226 309 392 423 455 486 517 560 603
-8350 603 605 606 593 507 425 344 326 308 326 345 341 337 337 337 328 392 423 381 304 301 313 325 264 204 181 157 132 107 171 309 381 380 343 307 242 252 220 188
-8364 188 214 241 301 360 463 492 428 364 371 378 381 383 434 410 392 373 311 250 233 289 319 349 383 417 359 302 281 260 300 340 380 419 482 545 571 597
-8377 597 534 470 407 344 333 322 275 228 298 367 351 335 319 303 287 271 293 316 339 362 285 208 241 275 346 417 426 436 397 357 276 196 194 119 53
-8389 53 110 147 183 191 199 265 331 361 390 376 362 311 260 343 426 501 576 558 417 304 265 315 366 385 404 466 529 555 580 482 384 322 261 252 243 235
-8402 235 226 277 327 267 208 195 181 168 155 201 247 293 339 332 326 320 313 282 252 221 190 199 208 180 152 194 236 246 256 290 397 495 470 407 343 272 200
-8416 200 207 214 221 227 267 307 309 312 306 299 298 296 256 291 293 221 223 299 292 284 242 200 158 116 163 210 313 417 469 447 425 477 461 444 376 308 294 353 433 513
-8430E13M7M8J3j58j31n7QRp0N3Q6J3M9M8m2m2l8l9m4L0N1N1l0l1KKJ1o3q1pP3JJ8J9R5R5
-8444E02M4k9k8j01kP1N7N7k0r3m7m8o5QLLj4j5j4j4K1K2P5P6L8q5r4k0jjMMK3K4n5J9K6K6
-8457C57opM1M1jjJp3l6L8M0M0QQj9j8M2M3j5j5j5j5l9l8kkm0m0llJ00J00o0o0l8l7K3K4k8
-8471B95k8k8k8J4J4N1N1mmj63j63J3J4N0N0j1j0K6K7K6K6K7K6L0K9l2l2L0L0K9L0j2j1j2
-8484C50j2j9k0J8J7K1K0K1K0P6P7J4J5p6p7l9m0P7P6J5J6j22j21J4J3K0K0j6j7M2M1m4m5
-8496C35l0l1ONKJo0o0K9L0O6O6L2L2n4n4k6k6k7k6N8N7mmN6N5oom7m7j66j9K1K0L0L0Q1Q1
-8510D00nno8o9J8J7n1n1L5L5M8M8M8M8M5M5o5o6j1j0j1j1l5l4KKnmN6N7N0N1o0o0jkL1r2
-8523C20n2n2K6K6POR3R2rrp0p0llL4L4l4l4l4l4j9j9J7J8J0J0n2n1M4M3M4M4J2J2J2J3j8
$$ plain form
-8430 513 560 608 621 463 332 275 283 292 222 275 361 374 423 471 429 387 349 310 266 296 347 398 368 337 339 341 352 289 208 201 274 275 293 312 407 502
-8444 502 546 517 489 388 386 457 514 571 551 458 411 363 298 306 309 312 298 283 269 255 276 298 373 449 487 402 308 288 287 286 290 294 317 341 286 305 331 357
-8457 357 351 344 385 426 425 424 425 352 316 354 394 434 442 450 431 413 455 498 483 468 453 438 399 361 359 357 317 277 274 271 371 471 411 351 313 276 299 323 295
-8471 295 267 239 211 225 239 290 341 337 333 170 7 20 34 84 134 123 113 139 166 192 218 245 271 301 330 298 266 296 326 355 385 373 362 350
-8484 350 338 319 299 317 334 355 375 396 416 492 569 583 598 522 445 406 366 443 519 534 550 428 307 321 334 354 374 358 341 383 424 380 335
-8496 335 305 274 280 285 287 288 228 168 197 227 293 359 391 423 369 315 289 263 236 210 268 325 321 317 373 428 422 416 369 322 156 137 158 178 208 238 319 400
-8510 400 395 390 322 253 271 288 237 186 221 256 304 352 400 448 493 538 473 407 396 386 375 364 329 295 297 299 294 290 346 403 453 504 444 384 383 381 412 320
-8523 320 268 216 242 268 275 281 374 466 457 448 378 308 305 302 336 370 336 302 268 234 215 196 213 231 241 251 199 148 192 235 279 323 335 347 359 372 354
-8537C54j8j8j7l7l7K5K4J3J2J3J3m6m5J6J5K2K1K2K1l9l9M7M7R4R4j6j6n0n0J2J1k0k1l5
-8549C72Q7R1l1q9r0K0J9J06J05m4m5p3p3j18Mk3r6L1L2j0j0Q7Q6K6K5k6k6o3o2O0O1J1Q5
-8561D29Q7l5p2p2q8q9K3K2L0L1l1l0L7L6L7L7ooopn8n8LLM8M8J1J1PPO8O8p7p6j14j14kk
-8575A00lkO2O3JKl4l4LLJ02J02J01J02KJq4q4lllll7l8n0K3O6n7q9L3L8L8QRn8n8P6P7J2
-8589C84J1J1J1m5m6m5m6J4J3M9N0l6l6l6l6kkL5L4O5O5K9K8q4q4q4q4QRJ19J19m5m6J7J6
-8602C30O4O5K3K3k8j03j29pL7L7Q7J2K2K2m4m4o0o0KJM8M8J26N3rrn0n0J8J8j8j9mmmmp1
-8615C19p1J0RK8m6rO4MNk8k8N7N8J2o0j0j0n6J7K2K1O7op8p8j29n5N7j6K5K6J4o0L8J60J12
-8628C85n9m1m1k3k2j8j8l2M1L2L1J6n8n4n3K5K5L3L4o5N9J16M3JJmml4l5J1o2k7M7M8k7j20
$$ plain form
-8537 354 336 318 301 264 227 252 276 289 301 314 327 281 236 252 267 289 310 332 353 314 275 322 369 463 557 541 525 475 425 437 448 428 407 372
-8549 372 459 550 519 430 340 360 379 485 590 546 501 428 355 237 241 218 122 153 185 175 165 252 338 364 389 363 337 274 212 272 333 344 429
-8561 429 516 481 409 337 249 160 183 205 235 266 235 205 242 278 315 352 346 340 334 327 269 211 214 217 265 313 324 335 342 349 417 485 408 332 218 104 102 100
-8575 100 97 95 157 220 221 223 189 155 158 161 263 365 466 568 570 571 487 403 400 397 394 391 354 316 266 289 355 298 209 242 280 318 326 335 277 219 295 372 384
-8589 384 395 406 417 372 326 281 235 249 262 311 361 325 289 253 217 215 213 248 282 347 412 441 469 385 301 217 133 141 150 269 388 343 297 314 330
-8602 330 394 459 482 505 477 374 245 238 275 312 399 411 433 455 411 367 307 247 249 250 298 346 472 525 516 507 457 407 425 443 425 406 402 398 394 390 319
-8615 319 248 258 267 295 249 240 304 308 313 285 257 314 372 384 324 314 304 248 265 287 308 375 369 291 213 84 29 86 70 95 121 135 75 113 273 385
-8628 385 326 285 244 221 199 181 163 131 172 204 235 251 193 139 86 111 136 169 203 138 197 313 356 357 358 354 350 316 281 292 230 203 250 298 271 151
-8642A51m6O8O7M2M2l9m0m8K4K0K0N1N1l1l0m0L4M9M9Ro5o5Ql5l5L1L0M9M8l8l7N1N2l4l5
-8654C28N7N7k9k9m0m0m1m0%jO1O1l4l5l4l5M4M4M3M4KKq4q4K1K1j5j6M1M1J27J27L0L0m6
-8667E78j94klK5K5J5J4m7m7o4o3lkJ8J8J8J8m0m0K2K1P1P1p3P5L9M0J2J2k6k6k6k7J1J1J1
-8680D42J1k2k2k2k2POl0l1m2m2nnj0j1R1R1L7j11j37j38OPM3M3J2J2P3P3j0j0rj0n0n0J09
-8693B74J09n9o0k3k2NNM1M2m5m6J6J6m8m7m7m7N2N2N2N1K1K2j6j6jkO0O0l9l9l0l0r4N3N6
-8706B76N6kjkjJ9J9K0J9m5m4m4m5JJO2O2p7p6rJ38J33j4qpq5q6k3k4K8K8K9K8P4P3l7l7M
-8720D03Ll4l3j7j7K0K0O7O7m4m4j8j8j8j9n9o0KK%%O1O2OPOON4N4n7n6m5m5l6l5rJ38J32
-8734D46j13j03j02l2l2Q6Q6N0M9m3m3j05j04L7L6%%Q1Q1J02m5p2p1K9L0k8k8o9NJ39J38L9
$$ plain form
-8642 151 105 173 240 282 324 285 245 197 221 241 261 312 363 332 302 262 296 345 394 403 338 273 281 246 211 242 272 321 369 331 294 345 397 363 328
-8654 328 385 442 413 384 344 304 263 223 223 222 283 344 310 275 241 206 250 294 337 381 383 385 301 217 238 259 244 228 269 310 437 564 594 624 578
-8667 578 384 382 379 404 429 444 458 411 364 300 237 234 232 250 268 286 304 264 224 246 267 338 409 336 411 450 490 502 514 488 462 436 409 420 431 442
-8680 442 453 431 409 387 365 372 378 348 317 275 233 228 223 213 202 293 384 421 310 173 35 41 48 91 134 146 158 231 304 294 284 275 265 215 165 274
-8693 274 383 324 264 241 219 224 229 270 312 267 221 237 253 205 158 111 64 116 168 220 271 292 314 298 282 281 279 339 399 360 321 291 261 167 220 276
-8706 276 332 330 329 327 326 345 364 384 403 358 314 270 225 226 227 289 351 274 198 189 327 460 446 438 431 346 260 237 213 241 269 298 326 400 473 436 399 403
-8720 403 406 372 339 322 305 325 345 412 479 435 391 373 355 337 318 259 199 201 203 203 203 264 326 332 339 345 351 405 459 402 346 301 256 220 185 176 314 446
-8734 446 333 230 128 96 64 150 236 286 335 292 249 144 40 77 113 113 113 194 275 377 332 260 189 218 248 220 192 123 128 267 405 444
-8745D44j32j7J06j1j0q0p9N2k1k4N0M1M0l8l9%P5O3j1o8OP0P0q4q5J3J4lp5l6L8rqK5K5K5
-8758C27K5m6m6m2m2l6L7Q1Q1K0K0m1m2k0k0j6j5j9N5J8J8j7N6N2N2k8k9L3L3l5l5k6r9m2
-8771B12L1O4rk1k1k1k1NP9Jp3p2N2J9n5N1N0RRM2M3m4m3RJ0n2n2K9K9K9K9M6M6RJ0k1k2o7
-8785C19PN0k3j4j5l7l8K3K4N4N4J0o4j9k0J3J3p7p7RRN0N1M6M6m7j20r4K8J87O3j41j42j4
-8797A14j3P2P2M4M4L7L7K5r6k8k8q2q1k0k0P9Q0P9Q0n1n0q6L5L6l8l0M4J00J00l0l0OOn5
-8809C52n6K1K1m1m1l9l9R5R6r5r4J6J6K0K0q9r0K1K1J07J07L6L6m6m5j0O5J19n2m3m3n4n4
-8821B38J2J1M8M8m3m3m3m3L1L2L1L1QPm6m6m0Q3J4J3j4j3j4j4K1K1N8N8popoj5j5K3K2o8
-8835C27o9J8J8j4j3j3j4j9k0J8J7oonoL4L4L5L4n9n9KKm1m1m2m1K9K9K8K9M6M6m1m0n8n7
$$ plain form
-8745 444 312 295 401 390 380 300 221 273 252 228 278 319 359 321 282 282 357 420 409 341 347 417 487 403 318 331 345 342 267 231 269 260 252 277 302 327
-8758 327 352 306 260 218 176 140 177 258 339 359 379 338 296 276 256 240 225 206 261 279 297 280 336 388 440 412 383 416 449 414 379 353 254 212
-8771 212 243 307 298 277 256 235 214 219 298 299 226 154 206 225 170 221 271 280 289 331 374 330 287 296 306 254 202 231 260 289 318 364 410 419 429 408 386 319
-8785 319 326 376 353 339 324 287 249 272 296 350 404 414 350 331 311 324 337 260 183 192 201 251 302 348 394 347 227 133 161 348 411 270 128 114
-8797 114 101 173 245 289 333 370 407 432 336 308 280 198 117 97 77 156 236 315 395 344 294 208 243 279 241 211 255 355 455 425 395 401 407 352
-8809 352 296 317 338 297 256 217 178 273 369 274 180 196 212 232 252 163 73 94 115 222 329 365 401 355 310 300 365 484 432 389 346 292 238
-8821 238 250 261 309 357 314 271 228 185 216 248 279 310 318 325 279 233 193 276 290 303 289 276 262 248 269 290 348 406 399 393 386 380 365 350 373 395 327
-8835 327 258 276 294 280 267 254 240 221 201 219 236 230 224 219 213 247 281 316 350 291 232 234 236 195 154 112 71 100 129 157 186 232 278 237 197 139 82
-8848H2P7P7mlL3L4J1J1J1J1j4j4j4j4K9K9K9K9l6l7%%J5J6p1p0j1j0j1j1O9O9O9O8KLKKJ1
-8862D69J2k5k5r7r7l6l6llklL3L3lmj8j8J9J8N1N0N0N0l3l2r4r4j0j1J00J00o0o1R9R9j5
-8875D03j4j01j00j3j3J47J46p4p4l8l7N0M9j1j1MNNMN9N8k7k8l5l5p2p2L1L2L1L2j4j3p5
-8888A99p5Q1Q1k9k9J0J0J0J0k5k6J1J2O7O7OOM6M6N9o4r5k1rrk8k9L3L4k3k3L8L9J0J1J1
-8901D12J0l6l6N0N0l8l8p5p5rrmnL1J05J37J4r6k2O3O3J5J5k3k2l4l5p1p1J4J3N0N1l5l5
-8914C24l5l4m2m1nnK1K0K1K1MNMNK9K9qqonN5N6L1L1n5n4m6m6J6J6N2N3q3j56m3P9J26N2
-8927C78nj27j05l1%%RRrO5Q4Q4POL9L9j1q4m8m8np9PQ0j4j4K8K8poK6K5jp4l3l3m9m8L8L8
-8942A59j1j2opm0L3J22J23O1j1l2l2o3o4o8OO3O2K6K5L3m1l2l2p0LM8M8O9O9K5m9k6k7l1
$$ plain form
-8848 82 159 236 232 229 262 296 307 318 329 340 326 312 298 284 313 342 371 400 364 327 327 327 342 358 287 217 206 196 185 174 243 312 381 449 451 454 456 458 469
-8862 469 481 456 431 334 237 201 165 162 159 157 154 187 220 217 213 195 177 196 214 265 315 365 415 382 350 256 162 152 141 241 341 281 220 319 418 403
-8875 403 389 288 188 175 162 309 455 381 307 269 232 282 331 320 309 313 318 323 327 386 444 417 389 354 319 247 175 206 238 269 301 287 274 199
-8888 199 124 205 286 257 228 238 248 258 268 243 217 228 240 307 374 380 386 432 478 537 473 378 357 348 339 311 282 315 349 326 303 341 380 390 401 412
-8901 412 422 386 350 400 450 412 374 299 224 215 206 202 197 228 333 470 484 388 366 429 492 507 522 499 477 443 408 337 266 280 293 343 394 359 324
-8914 324 289 255 213 172 167 162 183 203 224 245 249 254 258 263 292 321 313 305 299 294 349 405 436 467 412 358 312 266 282 298 350 403 320 164 121 200 326 378
-8927 378 373 246 141 110 110 110 119 128 119 184 268 352 359 365 404 443 432 348 300 252 247 168 175 255 241 227 255 283 276 270 296 321 320 246 213 180 131 83 121 159
-8942 159 148 136 130 123 83 116 238 361 422 411 379 347 284 220 152 158 221 283 309 334 367 326 294 262 192 195 243 291 360 429 454 405 379 352 321
-8955C21l1q5q5K1K1Q5J1J1Q4J1J0J5J5P8P8q2q1n2n2N6j8l9L4M9N0j3j3O5qj02j02m5m5j48
-8967A4j48j10O1J10J09J20J20k0k0l0M4P6Jp0j44o3o3J6J40J06L1k9k9L1L1L1L1n2n2N7J31
-8978D30K5j23l5l5KJKK%%Q6Q6k0k0q1q1L1L2L1L2M1M2oj54m6K7O4rj14L3J06J05P7P6J5J5
-8991F37l6l7p3p3k4k3k3k4k9l0L2L2j7j6j6j6r1r1onL4L4L4L5L7L7L7L8K1K2j5j5NNl1l1
-9004C18J6J5k1k1J6J6J5J6k3k4k3k3N2N1l4l4j8j9J2j35j60j4N3N3O9O8o7o7O4O3K7K7O6
-9016C34O6L9j08q4q3J8J8K1K1K0K1K5K4o1o2qqN4N3J3J4J3J4j4j3j3j3N2N1l4l5L4L3llk3
-9030C73k3q5q4KKl4l5j0j0l1J15Q4Q4o7o6NNMNL5L4k7k7l7l7M9M9n2n2%%J30j8j03M3j1j1
-9043A99kkJ2J1J1J1K0K0K0K0p6p6RRL3L3n2n3L9M0p2p1o1o1M8M8O6O5K9K9kjl8l8O5O5k1
$$ plain form
-8955 321 290 205 120 141 162 247 258 269 353 364 374 389 404 482 560 478 397 345 293 349 331 292 326 375 425 412 399 464 456 354 252 207 162 14
-8967 14 -134 -244 -183 -73 36 156 276 256 236 206 250 326 327 257 113 50 -13 3 143 249 280 251 222 253 284 315 346 294 242 299 430
-8978 430 455 332 297 262 264 265 267 269 269 269 355 441 421 401 320 239 270 302 333 365 406 448 442 288 242 269 333 324 210 243 349 454 531 607 622 637
-8991 637 601 564 491 418 394 371 348 324 295 265 297 329 312 296 280 264 173 82 76 71 105 139 173 208 245 282 319 357 378 400 385 370 375 380 349 318
-9004 318 334 349 328 307 323 339 354 370 347 323 300 277 329 380 346 312 294 275 287 152 -8 -22 31 84 153 221 154 87 151 214 241 268 334
-9016 334 400 439 331 247 164 182 200 221 242 262 283 308 332 271 209 201 193 247 300 313 327 340 354 340 327 314 301 353 404 370 335 369 402 399 396 373
-9030 373 350 265 181 183 185 151 116 106 96 65 180 264 348 281 215 220 225 229 234 269 303 276 249 212 175 224 273 221 169 169 169 299 281 178 221 210 199
-9043 199 197 195 207 218 229 240 260 280 300 320 244 168 177 186 219 252 200 147 186 226 154 83 22 -39 9 57 123 188 217 246 244 243 205 167 232 297 276
-9056B76k1j5j5P2P1K2K2j5j4OOL8L8k2r6j09L7O0q8p8O9O4O3j3j3m0m0M6M6K4K3q6q7K3K3
-9069B77J9J8L8l6j05j04J15J16kp6q1q1K5K5M5M5M1M1j6q8m3m3K1R6R5K1n3n4k1k2MNJ9R3
-9081C34J6n8n3K0M4M3j3q7j09J3P0P0R4K0j23j22N6N6N2N1J8n6l0R3L6q6q8j5nnj%J5J6J6
-9094B82J5K0J9K0K0l6l6l5l6J0J0J0J0J9K0J4J5K5m8lkn7J7P8Mj4j5j9j9l0l1j5N8Q6J2k
-9107C66lO5O5o6Pk0r4m7m7j6j6n3n3j1j0k0N3M3l1OQ0P2jPQk0j9k0k0J1J1J1J0nnj5O0M6
-9121C29k8k2N1l1l0k1k2j1O2R9K5l8l8m8m7K0n3q5L7J05L1kP1R7K4o5o5L2L2p4p5o5PN3N2
-9134C07mnm1m1p9p8j4O0L1m1M9J22M9M9p7p6QQ2L6L6Mp0j31j31l2R1N9N9J5J4J5J5o9o8J
-9147A45P4K0K0K4K5l6l7K6K5m2m1K3R6Q7J4J5n8j16j16k9l0M6J19J0o5j2j3j7j7j7j7j7j7
$$ plain form
-9056 276 255 240 225 297 368 390 412 397 383 389 395 433 471 449 353 244 281 341 253 175 244 308 371 358 345 305 265 311 357 381 404 318 231 254 277
-9069 277 296 314 352 316 211 107 222 338 336 260 179 98 123 148 193 238 279 320 304 216 173 130 151 247 342 363 310 256 235 213 217 222 241 334
-9081 334 350 292 239 259 303 346 333 246 137 150 220 290 384 404 281 159 215 271 323 374 392 336 306 399 435 349 261 246 241 236 235 235 250 266 282
-9094 282 297 317 336 356 376 340 304 269 233 243 253 263 273 292 312 326 341 366 318 315 313 256 273 351 355 341 326 307 288 258 227 212 270 356 368 366
-9107 366 363 428 493 427 434 414 320 273 226 210 194 141 88 77 67 47 100 143 112 118 198 270 269 276 284 264 245 225 205 216 227 238 248 243 238 223 283 329
-9121 329 301 279 330 299 269 248 226 215 277 376 401 363 325 277 230 250 197 112 149 254 285 283 354 451 475 410 345 377 409 335 260 195 202 255 307
-9134 307 303 298 257 216 137 59 45 105 136 95 144 266 315 364 287 211 219 301 337 373 377 307 176 45 13 104 163 222 237 251 266 281 212 144 145
-9147 145 219 239 259 283 308 272 235 261 286 244 203 226 322 409 423 438 380 264 148 119 89 135 254 264 199 187 174 157 140 123 106 89 72
-9159G2P7P6J09j3K3K3p0p1K1K0K1K0%%l7l7ppN5N4n7n8MMl0l1N5N5J9K0K0J9l9m0m4m4L5
-9172B17l8j17L1P5P4k6k7m9m8M1M2oO8J14l3r7k3J2J2M8M8R4n4o7o7L4L4m8m9J3J3nonon
-9185A94oonQ5Q6n0m9j1j1j1j1q6q7K4K3L3L4n3n3k0k0Q0Q1J43mo9Nn2K2P1P1n7n6K9K9K6
-9198C19K6N4N4Mj44j06M1O0O1P1p6p7lJ22M8k5k6K0n3j35J2J0J1l4l4K7K8L2L3m1m0N0N1
-9210C40k4k3o6o7QPL0L0m3m4RRRRRRRRm9m9K4K5L7L8L2L3l7j11j01K1rrJ21J22K3K4n0n0
-9224B55l1l0n8J14R9K5Jp3r6k2J03J03q0p9ooNNONj3j3K4K4J0Ro4o4n9n8J4J5M0M0MLk5k5
-9238A02%P3M6p6m0l9L5L4P2P2m1m0L3L4n3n2K1K2N2N2p1p1r3r3K8K9opO8O7J7J7J7J7m4m5
-9251A37m4m4P7P6m5m6Q3Q3m0m0PPM9k5K7K7k4N0j6r0K5K5rq3j4N9M4l0j7j6j24n1Q0P9L5
$$ plain form
-9159 72 149 225 334 321 344 367 297 226 247 267 288 308 308 308 271 234 227 220 275 329 272 214 218 222 192 161 216 271 290 310 330 349 310 270 226 182 217
-9172 217 179 62 93 168 242 216 189 140 92 133 175 169 237 351 318 221 198 210 222 270 318 412 358 291 224 258 292 244 195 208 221 216 210 205 199 194
-9185 194 188 182 177 262 348 298 249 238 227 216 205 119 32 56 79 112 146 93 40 20 0 80 161 304 300 231 236 184 206 277 348 291 235 264 293 319
-9198 319 345 399 453 457 313 207 248 308 369 440 364 287 284 406 454 429 403 423 370 235 247 257 268 234 200 227 255 287 320 279 239 289 340
-9210 340 316 293 227 160 168 175 205 235 192 148 157 166 175 184 193 202 211 220 171 122 146 171 208 246 278 311 274 163 62 83 74 65 186 308 331 355 305 255
-9224 255 224 194 136 250 349 374 375 302 206 184 287 390 310 231 225 219 224 229 235 240 227 214 238 262 272 281 217 153 94 36 50 65 105 145 149 152 127 102
-9238 102 102 175 221 145 105 66 101 135 207 279 238 198 231 265 212 160 181 203 255 307 236 165 72 -21 7 36 30 23 91 158 175 192 209 226 182 137
-9251 137 93 49 126 202 157 111 194 277 237 197 204 211 260 235 262 289 265 315 299 209 234 259 250 167 153 212 256 226 209 193 69 18 98 177 212
-9263B12L4K7K7%j22k1N3M9M9k0k0n0n0n5J9N8N8o0o0K2K2R1R1N2k2J9J9nnp8p9j7j7J0Q5
-9276C16mp6o3o3m5L0O6ql5l6j2O2R9K5klj2j2m4m5P9J52L4m0k9M5M5k9q2rj8j8o8o8N5N5
-9289B42N8N9j5j5N1N1p2p1J1J2PPJ6n8J5J6L7l6o8o8n8n8k6M7R2R2k1k2o5QM1M0l5l6N1N0
-9302B79p6p6l9m0J4J3N0N0l0k9N6N6M7M7j4j5o2o3K4K3l2l1l2l1O7O7OOK9K8n7n8N0N0J3
-9315B90o1j00K2N1k2j8j7L9L9M6M7j5j5k2k3J4J5p4p4l8l7J20J20RJ0kkkkL8L7m9m8J4J4
-9328C04k2k2k8k8N8N8J3J3J3J2L9L8p3p2n7n8MMR4R4QPJ%nmn3j26m9P5J37O4k2k2n6n5n5
-9341B29n5RQM6M5L1L0l0l1n9n9K7K7j3j4L8L9L4j13o7PL0J03NNl9l9l8l9j3j3j3j3O0O1j
-9354A85kNMQ1Q1P2p5p5jMp0j01j01m7R9J61J3Q1Q1P8o9j07M0O0j4j30J7M0M0RRM5M6j7j7
$$ plain form
-9263 212 246 273 300 300 178 157 210 259 308 288 268 218 168 113 132 190 248 188 128 150 172 263 354 406 384 403 422 417 412 334 255 238 221 231 316
-9276 316 312 236 173 110 65 95 161 153 118 82 70 132 231 256 254 251 239 227 183 138 217 369 403 363 334 379 424 395 313 304 286 268 200 132 187 242
-9289 242 300 359 344 329 380 431 359 288 299 311 318 325 341 283 298 314 351 315 247 179 121 63 37 84 176 268 247 225 160 168 209 249 214 178 229 279
-9302 279 203 127 88 48 62 75 125 175 145 116 172 228 275 322 308 293 231 168 192 215 183 152 120 89 156 223 229 235 264 292 235 177 227 277 290
-9315 290 229 129 151 202 180 162 145 184 223 269 316 301 286 264 241 255 270 196 122 84 47 167 287 296 306 304 302 300 298 336 373 324 276 290 304
-9328 304 282 260 232 204 262 320 333 346 359 371 410 448 375 303 246 188 192 196 290 384 392 399 400 400 395 391 338 212 163 238 375 439 417 395 339 284 229
-9341 229 174 183 191 237 282 313 343 313 282 223 164 191 218 205 191 229 268 302 189 122 129 159 262 267 272 233 194 156 117 104 91 78 65 125 186 185
-9354 185 183 188 192 273 354 426 351 276 275 279 209 108 7 -40 59 220 233 314 395 473 404 297 337 397 383 253 270 310 350 359 368 413 459 442 425
-9367D25j03j03k3k3L8L9j0j0j0j0n3n2N7N8J09J09k6k6j33j34J24J24K8K9n8n8o1o1o1o2
-9378F3J7J6KP6Q0o7n9J6ooN5N5l6j09m6J02J01K6J6J6o5o6mmQ2Q2Q2Q3p9q0POKKKKk1k2n8
-9392B63n8J0J0k7k7lmQ3Q2M8M7J0J1j9j9M2M2k4k3j10j09n8n7K8K9J0J1J1J0L6L6k5k5J8
-9404B49J7J8J7M7M7o4o3j5j4j5j5M5M4j7j6q1q0NJ28J64Q9K9K9j22j21j22j21M7M7M2M2j1
-9416B29q5kJ21R2R2j1j0k1k1J7J6n0m9m9n0j5j6K1K1PPQPj0j0m6m7L0K9L4L4pO7M1q2j29
-9429A63qK0n5K9K9j3j2RRRRj7j8M3M4N5N6l0l0K0K0o5o6M4M3Q0Q0j17j16n5n5J5J5N1N2L5
-9442B73L4L5L5n6n7n6n6K9K8qqRRRJ0nnL2L2kklkMMMMrqN3N3j8j9n5n5m5m4O6O5Q4Q3kln9
-9458C78o0n9o0opL0L0K6K6R6K2m4j67r6P5L6q7m4L0qO5R1R0ONl0l1j13j12jkP4P4QRo4j38
$$ plain form
-9367 425 322 219 196 173 211 250 240 230 220 210 157 105 162 220 329 438 412 386 253 119 243 367 395 424 366 308 247 186 125 63
-9378 63 80 96 98 174 254 187 128 144 138 132 187 242 206 97 51 153 254 280 296 312 247 181 177 173 255 337 419 502 423 343 350 356 358 360 362 364 343 321 263
-9392 263 205 215 225 198 171 168 164 247 329 377 424 434 445 426 407 449 491 467 444 334 225 167 110 138 167 177 188 199 209 245 281 256 231 249
-9404 249 266 284 301 348 395 331 268 253 239 224 209 254 298 281 265 184 104 109 237 401 490 519 548 426 305 183 62 109 156 198 240 229
-9416 229 144 142 263 355 447 436 426 405 384 401 417 367 318 269 219 204 188 209 230 237 244 252 259 249 239 193 146 176 205 239 273 266 333 374 292 163
-9429 163 155 175 120 149 178 165 153 162 171 180 189 172 154 197 241 296 352 322 292 312 332 267 201 245 288 368 448 331 215 160 105 120 135 186 238 273
-9442 273 307 342 377 321 264 208 152 181 209 201 193 202 211 220 230 225 220 252 284 282 280 277 275 279 283 287 291 282 274 327 380 362 343 288 233 188 144 210 275 359 442 440 437 378
-9458 378 318 259 199 193 186 216 246 272 298 394 416 372 205 109 184 220 133 89 119 111 176 267 357 363 368 338 307 194 82 81 79 153 227 235 244 180 42
-9472D2n3O7O1O2j7j6O3O3m7m8l0l1r1r1L8L8k2k2K0J9Q1Q2L0L0L0L0l1l2NNl3l4l3l3M1M1
-9485A84NML6L6k6k5q3q3o9j45PJ28O3rnO7P6P6K9r3j51p7M3M2o1o3M7M7J33J34J9J9j7j8
-9497B70K0J9j16j15J1J1M8M8K0K0o5o6n9n9P5P5m5m6O5O5J9J9j07j07PJ32N3p0q1M2J13L9
-9509B35J3o0k3k3L1L0n5n6jkkjo0o0K6K4M1M1MML8L8L0L1J03k0p8mL3L2k4k4j1j1j2j1L8
-9522B54L7P4P5m4m4m4m4J8J8o8o8n0n1J1J1J5J5P6P6L9L9k2k2q6q6m9n0n3n5L1L1P6P6P7
-9535B13P6J3J3r8r8J0J0k7k7L8L8L8L8n3n4P4P4N3p0m2L2MNRRM8M9L7l7j59l7M9N0%%O2O1
-9548D01o9o9qqm6m6q3q2L7L7P4P5O6O6O5O6MMn8n7k8k9k8k9K8K8n9n8J8J8j9k0l6l7P4P3
-9561B65K9L0n7n7k3k3OOJ14j0p2KP3%o5o5j3j2j3j3J5J4J5J4O1O2O1O1o8o9pqJKJJMMNMM4
$$ plain form
-9472 42 -11 56 117 179 162 146 209 272 225 177 147 116 25 -66 -28 10 -12 -34 -14 5 86 168 198 228 258 288 257 225 230 235 202 168 135 102 143 184
-9485 184 189 193 229 265 239 214 131 48 -21 -166 -159 -31 32 23 18 85 161 237 266 173 22 -55 -12 30 -31 -94 -47 0 133 267 286 305 288 270
-9497 270 290 309 193 78 89 100 148 196 216 236 171 105 46 -13 62 137 92 46 111 176 195 214 107 0 7 139 192 122 41 83 196 235
-9509 235 248 188 165 142 173 203 148 92 91 89 87 86 26 -34 -8 16 57 98 102 106 144 182 212 243 346 326 248 244 277 309 285 261 250 239 227 216 254
-9522 254 291 365 440 396 352 308 264 282 300 232 164 114 63 74 85 100 115 191 267 306 345 323 301 215 129 80 30 -23 -78 -47 -16 60 136 213
-9535 213 289 302 315 217 119 129 139 112 85 123 161 199 237 184 130 204 278 331 261 219 251 255 260 269 278 326 375 412 375 216 179 228 278 278 278 340 401
-9548 401 332 263 255 247 201 155 72 -10 27 64 138 213 279 345 410 476 480 484 426 369 341 312 284 255 283 311 252 194 212 230 211 191 155 118 192 265
-9561 265 294 324 267 210 187 164 170 176 290 280 208 210 283 283 218 153 140 128 115 102 117 131 146 160 221 283 344 405 337 268 261 253 254 256 257 258 262 266 271 275 319
-9576C19M3POl7l8J1o2n0P2P7Mj2j2j6j6J3J4p3p2P9P8M2M2n7n7MNonnor9j00J1J0R3R2OO
-9590C11M8M8l8l8q2q1MMN1N0j7j64j36J1P7P8M2M1NMj1j2P5Lo2Q6M4k9o3J1Q7J4N9j4k2r6
-9603B88m1m0M0M0n4n5j8j8J9J9j8j8k0k1k0k0MNR0R0%Jo1o1mmN7N7n5n6n5n5R4R4j6j5m5
-9617A28m4qpP4P3L7L7j9k0k0k0K2K2K2K2O0O0r9r9l0l1K1K2R4n2l2l1J2J2N3k0rqk8j01j1
-9630H2O3J7J7JKJKj3j2O5qnoj5j5L4m0llO1j2l3l2k0k0J7J6QRJ6J5M8J71J06L3l4l5m7K5
-9644D56Po6j23n0mlNOJ1Q4Q0OO3j0j09j08l8l7k8j02j2O2m2m1j6N5O1j3l3M1O9n5n8J6N2
-9657A26N3O7O7M7k7J8J7k4k4l2l3k8k8o6OM7M6N6j8k3N1J05L1L5L6Lp0k9k8k7k7J1J0r3r4
-9669A61k9M5R4K0m4m4oom7K6qrlmL0L0ppNNq1q1K2K2Q4Q4J9J8J9J9l1l1o8o8p1p0J4J5J19
$$ plain form
-9576 319 362 369 375 338 300 311 249 199 271 348 352 340 328 312 296 309 323 250 178 257 335 377 419 362 305 309 314 308 303 298 292 193 93 104 114 207 299 305 311
-9590 311 359 407 369 331 249 168 172 176 227 277 260 96 -40 -29 48 126 168 209 214 218 207 195 270 273 211 297 341 312 249 260 347 361 420 406 384 288
-9603 288 247 207 247 287 233 178 160 142 161 180 162 144 124 103 83 63 67 72 162 252 252 253 192 131 127 123 180 237 182 126 71 16 110 204 188 173 128
-9617 128 84 76 69 143 216 253 290 271 251 231 211 233 255 277 299 359 419 320 221 191 160 181 203 297 245 213 182 194 206 259 239 230 222 194 93 82
-9630 82 145 162 179 180 182 183 185 172 160 225 217 212 206 191 176 210 170 167 164 225 213 180 148 128 108 125 141 149 158 174 189 237 408 514 547 513 478 431 456
-9644 456 463 397 274 224 220 217 222 228 239 323 403 409 472 462 353 245 207 170 142 40 28 90 48 7 -9 46 107 94 61 102 171 116 58 74 126
-9657 126 179 246 313 360 333 351 368 344 320 288 255 227 199 133 139 186 232 288 270 247 298 403 434 469 505 508 438 409 381 354 327 338 348 255 161
-9669 161 132 177 271 291 247 203 197 191 144 170 162 153 150 146 176 206 199 192 197 202 121 40 62 84 168 252 271 289 308 327 296 265 197 129 58 -12 2 17 136
-9683A36J19m0j14p9M3J54J53J6J6k1k1l1l0M8M8oj29j28onoKKm2m1O9O8M1M2M1M1o9o8o8
-9696A35o9M2M1M1M2oom3m3r1r0R1R3L8L7j21j21jjN9O0P4P4L7L7NMq2q1K4K4Q6Q5m4m4qp
-9709B71%JJJn4n4N6N6O1O0k5k5m7m6m6m7O5O5LLk6k7J1J0kkq8q7l6l6P4P5j9k0O7O7J0J0
-9723B80P1P2k2k2n9n9O6O7k0j9OPl0l0m1m1mnL9L9KKj3j3K4K4lmo5o5l4l4K7K7J%l6l7m4
-9737E4m5m3m5L3L3O9P0J9J8m2m3j5j5j4j5J8J9J8J9o0n8P4P5K3K3j5j4N4N4N4N4pqo9o9j6
-9750A88j6j6j6K7K7K7K8J8J8o8o8L5L5jkJ7J8J8J7k1k1M0M0q6q5%%oppoj2j1m8m8N1N0N1
-9764A60N1K4K4l8l7OOn5n6O0N9K3K3M2M2k0k0l1l1L1L0j0j1j0j1mmnmj1j1K6K5l0l0K1j27
-9778I7j03l0J2Q6N9O0N4N5R1n6q1pQ1Pr8k5K1K2l5l5j1j1j2j1J1J1n0n1N2N2M7M7Oo8j13
$$ plain form
-9683 136 255 215 101 22 65 219 372 388 404 383 362 331 301 349 397 391 262 134 128 123 117 119 121 79 38 107 175 216 258 299 340 271 203 135
-9696 135 66 108 149 190 232 226 220 177 134 43 -47 44 137 175 212 91 -30 -31 -32 27 87 161 235 272 309 314 318 236 155 179 203 289 374 330 286 278 271
-9709 271 271 272 273 274 220 166 222 278 339 399 374 349 302 256 210 163 228 293 296 299 273 246 257 267 265 263 175 88 52 16 90 165 146 126 193 260 270 280
-9723 280 351 423 401 379 320 261 327 394 374 355 361 368 338 308 267 226 222 217 256 295 297 299 286 273 297 321 318 314 249 184 150 116 143 170 171 171 135 98 54
-9737 54 9 -34 -79 -46 -13 56 126 145 163 121 78 63 48 34 19 37 56 74 93 33 -25 49 124 147 170 155 141 195 249 303 357 350 342 273 204 188
-9750 188 172 156 140 167 194 221 249 267 285 217 149 184 219 218 216 233 251 269 286 265 244 284 324 238 153 153 153 147 140 133 127 115 104 56 8 59 109 160
-9764 160 211 235 259 221 184 190 196 141 85 145 204 227 250 292 334 314 294 263 232 263 293 283 272 262 251 247 243 238 234 223 212 238 263 233 203 224 97
-9778 97 -6 -36 -24 62 121 181 235 290 381 325 244 237 318 325 227 202 223 245 210 175 164 153 141 130 141 152 102 51 103 155 202 249 255 187 74
-9790G4L3M3l0K0K0l6l6l6l6O8O8J05J05j2j2p4p3QQM4M5M2M3NOl4l3l8l8j2q5m1J07L3L3
-9803B84M2M2k5k6j11j11K4K4K4K3P9P8ppp1p1J5J5ppM9N0l4j08l9J09K3K4L2L3n0m9q6q6
-9815G5O3O3k3k2j5j5R5R6m2m2M5M4o8o7J8J8QQn3n3p5p3j3j4J0J0P1P1M3M2j9j9l5l5p2p0
-9828d5K4K4q4q6j0j1J25J23J26J26rrj43j42qpP0P1J0J0NNJ%qq1n5O7J34J1p1p1k7k7Q3Q4
-9842B05o8o8l1l1Q4Q4M7M8n4n4PPm0m0M6M5K4K4n8n8RQ3J10j2q9q9o3O0R2l1MP8J9J9j3j3
-9855B83p0p0rrk0k0k0k0K8K9rrk9l0N6N6k7k6L4L5P1P0l9m0j5j6j6j6KKl5l4RJ0J0RO6O5
-9868B56MMnonnp6p6l9l9J3J3J3J3M3M3j8j8rrrqR6R7L5L6k5k6J2J2onL1L1o6o5r4r5m4P8
-9883H2Q7J4l8l8J8J9P1P2J0J0k7k7q3q4qO6N6o6N3N2o5o6N5N5N5N5mmo6o5Q5Q6J9K0rq1p7
$$ plain form
-9790 74 107 150 120 140 160 124 88 52 16 84 152 257 362 350 338 264 191 199 207 251 296 338 381 386 392 358 325 287 249 237 152 111 218 251 284
-9803 284 326 368 343 317 206 95 119 143 167 190 269 347 340 333 262 191 206 221 214 207 256 306 272 164 125 234 257 281 313 346 296 247 161 75
-9815 75 138 201 178 156 141 126 221 317 275 233 278 322 254 187 205 223 231 239 186 133 58 -15 -28 -42 -32 -22 49 120 163 205 186 167 132 97 25 -45
-9828 -45 -21 3 -81 -167 -177 -188 -63 60 186 312 303 294 151 9 1 -6 64 135 145 155 160 165 166 166 158 77 22 89 223 234 163 92 65 38 121 205
-9842 205 137 69 38 7 91 175 222 270 216 162 169 176 136 96 142 187 211 235 177 119 128 211 321 309 220 131 68 128 220 189 193 271 290 309 296 283
-9855 283 213 143 134 125 105 85 65 45 73 102 93 84 55 25 81 137 110 84 118 153 224 294 255 215 200 184 168 152 154 156 121 87 96 106 116 125 191 256
-9868 256 260 264 259 253 248 243 167 91 52 13 26 39 52 65 108 151 133 115 106 97 88 80 176 273 308 344 319 293 305 317 311 306 337 368 302 237 143 48 4 82
-9883 82 169 183 145 107 125 144 215 287 297 307 280 253 170 86 78 144 200 134 187 239 174 108 163 218 273 328 324 320 254 189 274 360 379 399 390 309 232
-9896B32M5j1q4r2r2lO9J35J2m9n0N4N3K8K8l3l3n5n5n6n4N8N9R6R6R0R0r3r4ppm3m4llkl
-9910A79J9J8J9J9j8j8J8J9%jo1o2P5P5j1j1l6l6N0N0%J%Jq3q2LMM7M8M8M7j7j8j8j7J5J6
-9924B82O6pq9N8N4j9l4M0n0j24j6j6M1M1KJKKk4k3O2O2m1m1p7p8Q2Q1P9o8j10j09O5O5rr
-9937A41rrO9O9j7j7llllK8K8q3q2m5m4J6J7q8q8P1P0L6L6jjK8K8O4O4n9o0j2J35J13M0k0
-9950D06k0J0Rn2n2o3o3K2K3Q9Q9LLr5r4rqL7L8R8R9k4k4q6q5nnm2m1J5J5J5J5k1k0O6O5L9
-9964C47L9L9L8o6o7o0n9q3M0P6m6n2n2N0N1K8K8L3L3m9K4N2p0m0l9m7m7O6O7NNj2j2K4K5
-9977B69o9o9M2M1mnJ30J30l4l4l4l4rj0rrkjl9l8J4J4m7m7L3L4mln1n1n0n1K8K7K8K7k4k3
-9990F6n3n2K3J46J14M1m1j14j5j6j6j6j5j6n3n4L2L2MMk7k8L5J08J09L6n0n0J2J1k7M6J52
$$ plain form
-9896 232 277 266 182 90 -2 -5 64 199 211 162 112 166 219 247 275 242 209 154 99 43 -11 47 106 202 298 388 478 385 291 284 277 234 190 187 184 182 179
-9910 179 198 216 235 254 236 218 236 255 255 254 193 131 206 281 270 259 223 187 237 287 287 288 288 289 206 124 127 131 178 226 274 321 304 286 268 251 266 282
-9924 282 348 341 252 310 364 345 311 351 301 177 161 145 186 227 229 230 232 234 210 187 249 311 270 229 152 74 156 237 316 248 138 29 94 159 150 141
-9937 141 132 123 192 261 244 227 224 221 218 215 243 271 188 106 61 17 33 50 -38 -126 -55 15 51 87 86 85 113 141 205 269 210 150 138 273 386 426 406
-9950 406 386 396 405 353 301 238 175 197 220 309 398 401 404 309 215 206 198 235 273 371 470 446 422 336 251 246 241 199 158 173 188 203 218 197 177 243 308 347
-9964 347 386 425 463 397 330 270 211 128 168 244 198 146 94 144 195 223 251 284 317 268 292 344 274 234 195 148 101 167 234 239 244 232 220 244 269
-9977 269 200 131 173 214 210 205 335 465 431 397 363 329 320 310 301 292 290 289 250 212 226 240 193 146 179 213 209 206 155 104 54 3 31 58 86 113 89 66
-9990 66 13 -39 -16 130 244 285 244 130 115 99 83 67 52 36 -17 -71 -39 -7 -3 1 -26 -54 -19 89 198 234 184 134 146 157 130 176 328
-10002C28P9lp6j47p4Lp1j05j06k2N3J14L9L0L1O7oj34j34K4R7J10L7N1N0k8M4K2j01j17N5
-10014A10N7N6o3j36j0J13R8K4n7n7m6K7M7M7NMpq2PJ30J25Kq3q3kP1j1q5p1p1n2K2K2n1p6
-10026g6p5L0L0K9K9Q8R0K5K5K0K0Qo7J2J2O5O4k6k5qq2j43o9N9N9k2k2P7P6N6j7L2L1K3K2
-10039C50j3q7q2rm0L3O5n7m7m8j1O3poq8q6N8N7N8N8j3j2j3j2m5m6qrj8j9J8J6L3L4L3L3
-10052A33j5j5n2n1n8n9P6P5M9M8j2j3L9M0kkj2q6q3L8L3q8q2M1J15J15J3J2n1n2N9N9J15
-10064C27J16o9Npj30q9L4L1L2j45j44J7J7J6J7K8K7O5O4J0J1J0J1j%%jm1m1M5M5l1l0l0l0
-10077A39k0j9M2M2K2K3K2K2pqo9o9k9k9k9k9o3o5K1K2K6K7J04J04N8o5j07J6N6j7m7K7J06
-10089B07J06%%p2p1O4O4l5l4l4l5p5p4L5L5O0O0k5k6R0R1NMnor1r2kjL5L4j1j1j1j1K6K6
$$ plain form
-10002 328 407 404 328 181 107 110 39 -66 -172 -194 -141 -27 12 42 73 140 134 0 -134 -110 -13 97 134 185 235 207 251 273 172 55 110
-10014 110 167 223 160 24 14 127 225 249 192 135 89 116 163 210 215 219 212 130 137 267 392 394 311 228 226 297 286 201 130 59 7 29 51 0 -76
-10026 -76 -151 -121 -91 -62 -33 55 145 170 195 215 235 243 176 188 200 265 329 303 278 270 188 45 -24 35 94 72 50 127 203 259 242 274 305 328 350
-10039 350 337 250 168 159 119 152 217 160 113 65 54 117 110 104 16 -70 -12 45 103 161 148 136 123 111 66 20 12 3 -15 -34 -16 0 33 67 100 133
-10052 133 118 103 51 0 -58 -117 -41 34 83 131 119 106 145 185 183 181 169 83 0 38 71 -17 -99 -58 57 172 185 197 146 94 153 212 327
-10064 327 443 374 379 372 242 153 187 218 250 105 -39 -22 -5 11 28 56 83 148 212 222 233 243 254 253 253 253 252 211 170 215 260 229 199 169 139
-10077 139 119 100 142 184 206 229 251 273 266 258 189 120 91 62 33 4 -59 -124 -103 -81 -55 -28 76 180 238 173 66 82 138 121 74 101 207
-10089 207 313 313 313 241 170 234 298 263 229 195 160 85 11 46 81 141 201 176 150 240 331 336 340 335 329 238 146 144 143 178 212 201 190 179 168 194 220
-10102B20j0j1q4q4JKK6K7j0j0l5l4l5l5QPP3P4J7R0J13ro5j39o1J3K1K0j1j2m6m6L8L9N5
-10115A07N5ooL7L6K5r8q9j5K2K2N9N9k7k8o2o2M8M8K0K0j7j7k5k6k5k5N6N7k9l0kkQ4Q3L0
-10128B77L0l1l1m9m9L7J10R5k7q9q9m7m6J4J5O2O2m8m8K7K7j0j0j4j5p5p6m2m3ooN7N5R4
-10141A11R3n5n6NNJ8J8N4N5M5M5QRk7k7j6N7J31j6q8q8%%o2o1J1J1J2J1nnQ1Q1LLj08j08
-10154A45J3J3J3J2N3N2J5J6l3l3MMm9m9O2O1p1p2m0l9K9m4n3R4R3K1m0m0O5O4m6m5j17j15
-10166e7j14L4J33J33L2L2m8m8L8L8m7m7L8L9qrqqQ8Q8K6K7j0j0j0j1l8l8r9j00Q5Q4M8M8
-10179C01LLLLo3o3k7k6%%RRm9R8M8M7Jp2p3Jm1m1K5K5o3o1K2K4K1K2K2K2OOPOk2k2k7k7P3
-10194A30%K8J02Pj15q4j0n5n5rj0P9J54M8k5n8J5M8k5m1m1oO8J32N8J0o3n1n2n1n2j04l3
$$ plain form
-10102 220 210 199 115 31 32 34 60 87 77 67 32 -2 -37 -72 -64 -57 16 90 107 197 310 301 236 97 36 49 70 90 79 67 21 -25 13 52 107
-10115 107 162 156 150 187 223 248 150 61 46 68 90 149 208 181 153 91 29 77 125 145 165 148 131 106 80 55 30 86 143 114 84 82 80 164 247 277
-10128 277 307 276 245 196 147 184 294 389 362 273 184 137 91 105 120 182 244 196 148 175 202 192 182 168 153 78 2 -40 -83 -89 -95 -38 17 111
-10141 111 204 149 93 98 103 121 139 193 248 293 338 346 355 328 301 285 342 473 457 369 281 281 281 219 158 169 180 192 203 198 193 274 355 358 361 253 145
-10154 145 158 171 184 196 249 301 316 332 299 266 270 274 225 176 238 299 228 156 116 77 106 62 9 103 196 217 177 137 202 266 220 175 58 -57
-10166 -57 -171 -137 -4 129 161 193 145 97 135 173 126 79 117 156 148 139 131 123 211 299 325 352 342 332 322 311 273 235 136 36 121 205 253 301
-10179 301 304 307 310 313 250 187 160 134 134 134 143 152 103 201 249 296 297 225 152 153 112 71 96 121 58 -3 19 43 64 86 108 130 136 142 149 155 133 111 84 57 130
-10194 130 130 158 260 267 152 68 58 3 -52 -61 -71 8 162 210 185 127 142 190 165 124 83 77 145 277 335 345 282 231 179 128 76 -28 -61
-10206f1Q5Q6N9O0R6R7PPPPn8n9n8n8J2J1PPO7pk7k6m1m0mmL1L2jjlP1L8q6p6p6j8j8o4J0
-10220A1N4N5L7L8J%k7k7J0Rk5k5j2O1M9p4m2L2L3L3n6j29n6n7J9K0O4j0rO3K0K1K5K5L8L8
-10233B07k4k3jkjkLLq2q2M2M2M3M3K5K5N8N7o3j36m8J00O8nm1m0k6k5k6k6J9J9N6N5L2L1
-10246B75L1L1rj0q6q6RJ56L7L6l8l9kjK7K7k4j72K3K4J4J5O8O8O5q2j8j8k7k7N1N2J5J4l9
-10259C60m0lln0n1J1J1m4m5pqo7o6M2M3J1J2J1J2Q6Q6%%L2L2n3n4m1m2m1m1k2k1k2k1O2O2
-10272A31K5K4j4j4P2P2opm2m3j8j7n5n4J1J0J1J1K4K3o2o2o6o6M3M4N9O0n1m9L6L7L7L7j1
-10285A30j0j1j0j7j8O8O9l2l1l1l2p3p2N9J80J23%l4l4J0J0n1n1J4J3N0N0N3N3n8n8q2q2
-10297I5N3N3J1J1n0n0p7p5L3L5O4O4m6m7noJ05J05k1k2k1k1k2k2j07j07M3M2j7j8K9L1R2
$$ plain form
-10206 -61 24 110 169 229 325 422 429 436 443 450 392 333 275 217 229 240 247 254 321 314 287 261 220 180 176 172 203 235 234 233 230 301 339 253 177 101 83 65 1 11
-10220 11 65 120 157 195 196 196 169 142 152 161 136 111 99 160 209 135 93 125 158 191 135 6 -50 -107 -88 -68 -4 -14 -23 40 60 81 106 131 169 207
-10233 207 183 160 159 157 156 154 157 160 78 -4 38 80 123 166 191 216 274 331 268 132 84 184 252 247 206 166 140 115 89 63 82 101 157 212 244 275
-10246 275 306 337 328 318 232 146 155 311 348 384 346 307 305 304 331 358 334 162 185 209 223 238 306 374 439 357 339 321 294 267 318 370 385 399 360
-10259 360 320 317 314 264 213 224 235 191 146 139 131 64 -2 40 83 94 106 117 129 215 301 301 301 333 365 312 258 217 175 134 93 71 50 28 7 69 131
-10272 131 156 180 166 152 224 296 290 283 241 198 180 163 108 54 65 75 86 97 121 144 82 20 -46 -112 -69 -25 34 94 43 -6 30 67 104 141 130
-10285 130 120 109 99 82 64 132 201 169 138 107 75 2 -70 -11 169 292 292 258 224 234 244 193 142 156 169 219 269 322 375 317 259 177 95
-10297 95 148 201 212 223 173 123 46 -29 4 39 103 167 121 74 69 63 168 273 252 230 209 188 166 144 37 -70 -27 15 -2 -20 9 40 132
-10309A32R2NMM2M1llo5o4k5k4J2J2m6m7J4J5K7K7K8K7n4n4j7j7L6L5L6L6N4N5n6n5L3L3n2
-10322B14n3r4r3M0M1j1j1K6K6L9L8k2k3m2m2m1m2N1N1J5J4RQRQk9k9Q1Q1Q9Q8K8m7p5M7k7
-10335C22k6j1j2j1j1r1r2nnj0j0K7K7L3L4O9P0j4j3K3K3m0m0lmL5L4kkk1k1M1M0o8o8l1l1
-10349A36%%l6l7k5k4k4k5M0M0MLL9L9m7m6m6m7Q7Q8K4K5l7l7O9O9m2m1P8P9n6n7o4o4k7k7
-10362A1M4M5Q6Q6m2L1K9r3j59l6R6R5n9n9K3J47R2l0o4o4L5L5k2k2JP5P5Jm5m6J1J2q6q6
-10374A17k1k0l6L7mmN2N1J5J5J0RM2M1K8m6q5q6k9M4J02K7m3j18l9l9RQ2J18M6k4k4o0o1
-10386A06l1M3KJR2R2p2p2Qo6r8K4M2l1K7J49J8j05k4k4q1j0J03J04J11L8l2j05j06J6P0m
-10398A85L4L3K8K9l0l0k9l0m4m4K1R4P9Oq4q3j09j08K6K7N3N4J00K6n5J8Q0Nj4N8l1j06m
$$ plain form
-10309 132 224 229 233 275 316 313 310 245 181 156 132 144 156 110 63 77 92 119 146 174 201 147 93 76 59 95 130 166 202 256 311 255 200 233 266 214
-10322 214 161 67 -26 14 55 44 33 59 85 124 162 140 117 75 33 -8 -50 1 52 67 81 90 98 107 115 86 57 138 219 308 396 424 377 302 349 322
-10335 322 296 285 273 262 251 160 68 63 58 48 38 65 92 125 159 228 298 284 271 294 317 277 237 234 230 265 299 297 295 274 253 294 334 266 198 167 136
-10349 136 136 136 100 63 38 14 -10 -35 5 45 49 52 91 130 83 37 -9 -56 31 119 143 168 131 94 163 232 190 149 227 306 250 193 129 65 38 11
-10362 11 55 100 186 272 230 261 290 197 38 2 98 193 134 75 98 245 337 307 243 179 214 249 227 205 206 281 356 357 312 266 277 289 203 117
-10374 117 96 76 40 77 73 69 121 172 187 202 212 221 263 304 332 286 201 115 86 130 232 259 216 98 59 20 29 111 229 275 251 227 167 106
-10386 106 75 118 120 121 213 305 233 161 169 103 5 29 71 40 67 216 234 129 105 81 0 -10 93 197 308 346 314 209 103 119 189 185
-10398 185 219 252 280 309 279 249 220 190 146 102 123 217 296 302 218 135 26 -82 -56 -29 24 78 178 204 149 167 247 252 238 296 265 159 155
-10410A55mK8K8l3l3MMp8p6J0Q6P9Oj01k6J3J2J20J20k2j44j16m2k9k8L7L7N5N5R2R2J0J0
-10422C21p6p6m8m7m7m7J9J9N6N6NNl1l2m8m7L8L8P0P1P1P1M0M0k1k1k5k5k5k6k7k7N8N9k3
-10435C18k3o0n9PPPOo8o9M1M2%JJJm6m7m6m5L5L7m1m2K7J49O9n4rO5k9j02j8j7k2k2O2O3
-10448A19KJm3m3n5O7O5qM1M1j4j5j4j5N0N0L7q5j35o1j3O0mP0P3Jj4j4M3M3rrrj0m2m3J9
-10462A27J9M8M9PQ%p4o9o9J1J1J5n8j1j1M7M6M9M9j6q9q1qJ01J00K8m5mmj4j4L1J04L9L9
-10474C61PPJ8J9k6j00q4q3K7K6n1K3j9j9L5L4llk4k4K0R4K2K2k3N1O9n3K5K5j63q9k1k0L
-10487H3Lm3L0M5k8P4P4N7j6j06J7L1L1k3k2k3k2N9N8K0n4j2j3l5l6k3J00Q8J4r6r6J8J9R
-10499A82Q3L4m1r7k3llKKJ1J0J5n9K4K4m2m2QPQQM2M2j9j9n2n3l2M1M3M2j4j5n5n6ONN1N2
$$ plain form
-10410 155 151 179 207 174 141 145 149 71 -5 5 91 170 176 75 49 62 74 194 314 292 148 32 -10 -39 -67 -30 7 62 117 209 301 311 321
-10422 321 245 169 121 74 27 -20 -1 18 74 130 135 140 109 77 29 -18 20 58 128 199 270 341 381 421 400 379 354 329 304 278 251 224 282 341 318
-10435 318 295 235 176 183 190 197 203 135 66 107 149 149 150 151 152 106 59 13 -32 3 40 -1 -43 -16 133 202 148 139 204 175 73 55 38 16 -6 56 119
-10448 119 121 122 79 36 -19 48 113 105 146 187 173 158 144 129 179 229 266 181 46 -15 -28 32 28 98 171 172 158 144 187 230 221 212 203 193 151 108 127
-10462 127 146 194 243 250 258 258 184 115 46 57 68 83 25 14 3 50 96 145 194 178 89 8 0 101 201 229 184 180 176 162 148 179 283 322 361
-10474 361 368 375 393 412 386 286 202 119 146 172 121 144 125 106 141 175 172 169 145 121 141 235 257 279 256 307 376 323 348 373 210 121 100 80 83
-10487 83 86 43 73 118 90 164 238 295 279 173 190 221 252 229 207 184 162 221 279 299 245 233 220 185 149 126 226 314 328 232 136 154 173 182
-10499 182 265 299 258 161 138 135 132 134 136 147 157 172 113 137 161 119 77 85 92 100 108 150 192 173 154 102 49 17 58 101 143 129 114 59 3 9 14 65 117
-10514A17l5l5KJJKR6R6j5j4l1l1NOL8L7L8L8l3l3l7l7l0j04o9N2J46J47rj32q5q4M2M3P6
-10526A69P5J5J4k2k2k2k2R2R3OOp3p3J2J3N1N2j0j0k3k3k3k3mlllj0j0K7K7l4l4l4l3J1J1
-10540A60J2J1m2m3M9M8K8J03M4p9q7q7k8k9J2Q6J13rj05j06M7M7m5m4M1M2k0k0J7J7j1j1
-10551A11m7m8m3m3J7J8K5K4K5K5L8L8J00R9l7l6p3p4k3k3J3J3K9K8K8K8k1k2J6J5M5M4Q2
-10563C71Q1j3j4j3j3m2m2m6m6K6m8n3R5L1L1l1j79q9j4K0K0klQ4Q3j8j7p9p9O2O3JKN8N8
-10576B45K1K2K1K1m1m0j%q8j4J25k1o9o9KKKKP0P0L3L3o7o8o8o8J1J2k6k5pqN4N3klN9N8
-10590B31O8O8O8O8r4r5r4r5n4n5m8K3oJ41O7nl8l7m2m2P7P8J5J6J6J6J6J5n3n4L3L2l8l7
-10602A61p4p5N3N3J6J6Q3Q4o7o7j28K0K2K3O6O7j9j8q2q1NMQ3Q3M6M6m0m1p7p8M6M5j6j6
$$ plain form
-10514 117 82 47 49 50 51 53 149 245 230 216 185 154 159 165 203 240 278 316 283 250 213 176 146 42 -27 25 171 318 309 177 92 8 50 93 169
-10526 169 244 259 273 251 229 207 185 277 370 376 382 309 236 248 261 312 364 354 344 321 298 275 252 248 245 242 239 229 219 246 273 239 205 171 138 149 160
-10540 160 172 183 141 98 147 195 223 326 370 291 204 117 89 60 72 158 271 262 157 51 98 145 100 56 97 139 119 99 116 133 122 111
-10551 111 64 16 -27 -70 -53 -35 -10 14 39 64 102 140 240 339 302 266 193 119 96 73 86 99 128 156 184 212 191 169 185 200 245 289 371
-10563 371 452 439 425 412 399 357 315 269 223 249 201 148 243 274 305 274 95 6 -8 12 32 30 27 111 194 176 159 80 1 63 126 127 129 187 245
-10576 245 266 288 309 330 289 249 248 248 160 146 271 250 181 112 114 116 118 120 190 260 293 326 259 191 123 55 66 78 52 27 20 12 66 119 117 114 173 231
-10590 231 299 367 435 503 409 314 220 125 71 16 -32 -9 -15 126 193 188 150 113 71 29 106 184 199 215 231 247 263 278 225 171 204 236 198 161
-10602 161 87 12 65 118 134 150 233 317 250 183 55 75 97 120 186 253 234 216 134 53 58 62 145 228 274 320 280 239 162 84 130 175 159 143
-10615A43o1o1K6K5mmL3L3J13J14O2q6m9n0K7K7oopoj9j9j8j9n5n5OOk0k1O5O6k0j9M2M2L0
-10628B55L0K6j20q9q9Q6Q6P0P0m0m0K7K7j0j0r9r9O1O1j7j7K0K0J23J22L7k08j15L2O2q5
-10639A77j32J5RRK9L0J15J15N3N2qrr9r9j21K7mml1l1R8R9j1j2m0m0m0m0M9M8l7l8o8o7l1
-10652c7l2MMMMJ10J10N8q8o3o3j1rJ4J4J5J4N9N8K2K1JJl6l6n0n0j3j3RJ0J9J9p7O8j4j4
-10666C2K0J9m1m1N3N4l1l2n9n9O6O6R7n0n3n2R6R8l8l8p3p2p0P7J30J30P9P9q5q6N0N0m1
-10677B75m1q6O0LLm9m9L3L3L3L3O4O4m6m6q5q5N0N0m1m1mnQ5Q4n0n0poN4N5NNl2l2k7k8k7
-10691A52k7J3J2J3J2L7L8k5k4K7K8l5l4k7k7o0n9qO5P1mk8M6l7l8KKpO6N4k0l6l5M0M1L5
-10704B23L6M8k5k1k1o7o7noM1M2L3L4N6o7j48k6R4J67J17oJ7J7n1n2o3o2m3L1klklL8l5O
$$ plain form
-10615 143 82 21 47 72 68 64 97 130 243 357 419 333 284 234 261 288 282 276 269 263 244 225 207 188 133 78 84 90 70 49 114 180 160 141 183 225 255
-10628 255 285 311 191 102 13 99 185 255 325 285 245 272 299 289 279 180 81 142 203 186 169 189 209 332 454 491 283 168 200 262 177
-10639 177 45 60 69 78 107 137 252 367 420 472 464 455 356 257 136 163 159 155 124 93 191 290 279 267 227 187 147 107 156 204 167 129 61 -6 -37
-10652 -37 -69 -65 -61 -57 -53 57 167 225 137 74 11 0 -9 5 19 34 48 107 165 187 208 209 210 174 138 88 38 25 12 21 31 50 69 -8 60 46 32
-10666 32 52 71 30 -11 42 96 65 33 -26 -85 -19 47 144 94 41 -11 85 183 145 107 34 -38 -108 -31 99 229 308 387 302 216 266 316 275
-10677 275 234 148 208 211 214 165 116 149 182 215 248 312 376 330 284 199 114 164 214 173 132 128 123 208 292 242 192 185 179 233 288 293 298 266 234 207 179 152
-10691 152 125 138 150 163 175 212 250 225 201 228 256 221 187 160 133 73 14 6 71 142 138 110 156 119 81 83 85 78 144 198 178 142 107 147 188 223
-10704 223 259 307 282 261 240 173 106 101 95 136 178 211 245 301 234 86 60 154 321 438 432 449 466 415 363 300 238 195 226 224 221 219 216 254 219 225
-10717B25On5n5j8j9RRo9MNNJ0Rl9l8O8op8nL8L9j0O3K2K1j4j4m7m6m8K5M3M5llN9J32O9n3
-10732B86l7l6m5K8j2j3k2k1O4J38Q8l5j13l9mmmP0m3m2O8O8j4q9r3P9J18n4j02K1qrjjo8
-10744A19o9M2M2k3k4k3k3KLKLnom1m3O9P0O9P0NMM2M2l5l5l6l5K8K8J5Q9O8n4r1r2r8r7j3
-10758c1j3M4M2M3M4J8J9j9j8p1p0J3J5J8J8N4N5K1K2K1K2o8o8ppPOl1l0k0j9O6O7k9l0k9
-10771E5l0R6R6J0J0j1j1p2p2%jl7l6N6N7N7N7m1m2p4j48r9P3P5JO7O9k2k1J5J5J0J1Qo5r6
-10784d0K5Q1RN9N8L4L5n2n1o0o0r9K3J29Qj9N5l1l1oO7M5M5L0m4k5k4%jN1p1KKp7mK1K2N9
$$ plain form
-10717 225 231 176 121 103 84 93 102 33 37 42 47 57 66 27 -11 57 51 -27 -32 6 45 35 98 120 141 127 113 66 20 -28 -3 40 85 82 79 138 270 339 286
-10732 286 249 213 168 196 184 171 149 128 192 330 418 383 270 231 227 223 219 289 246 204 272 340 326 237 144 223 341 287 185 206 198 189 188 187 119
-10744 119 50 92 134 111 87 64 41 43 46 48 51 46 40 -1 -44 25 95 164 234 239 243 285 327 292 257 221 186 214 242 257 346 414 360 269 177 79 -18 -31
-10758 -31 -44 0 42 85 129 147 166 147 129 58 -12 1 16 34 52 106 161 182 204 225 247 179 111 104 97 104 110 79 49 29 10 76 143 114 84 55
-10771 55 25 121 217 227 237 226 215 143 71 71 70 33 -3 53 110 167 224 183 141 67 -81 -180 -107 -32 -31 36 105 83 62 77 92 102 113 121 56 -40
-10784 -40 -15 66 75 134 192 226 261 209 158 98 38 -61 -38 91 99 80 135 104 73 67 134 179 224 254 210 185 161 161 160 211 140 142 144 67 63 84 106 165
$$ [...]
-11905B2
##END=	
##END=	
