##TITLE=	Cem62-VT.2.fid
29Si NMR 193 K
62.4 mg diradical dissolved in told8 at -80 C

##JCAMP-DX=	6.0	$$ MestReNova 14.1.0-24037
##DATA TYPE=	LINK
##BLOCK_ID=	1
##BLOCKS=	1    
##ORIGIN=	Mestrelab Research S.L.
##OWNER=	hrzepa
##$MNOVA/LINK_BLOCK_TYPE=	ITEM	$$ NMR Spectrum
##$MNOVA/ITEM/POLYGON=	(XY..XY)
5321,5835
8722,5835
8722,8208
5321,8208
5321,5835
##$MNOVA/ITEM/Z=	0
##$MNOVA/ITEM/ANGLE=	0
##TITLE=	Cem62-VT.2.fid
##JCAMP-DX=	6.0	$$ MestReNova 14.1.0-24037
##BLOCK_ID=	2
##DATA TYPE=	NMR SPECTRUM
##DATA CLASS=	XYDATA
##NUMDIM=	1
##ORIGIN=	Bruker BioSpin GmbH
##OWNER=	nmrsu
##.OBSERVE FREQUENCY=	59.627388000000003387
##.OBSERVE NUCLEUS=	^29Si
##.SOLVENT NAME=	Tol
##.PULSE SEQUENCE=	zgig
##LONGDATE=	2015/07/06 11:47:00.000
##.ACQUISITIONMODE=	SIMULTANEOUS (DQD)
##$ORIGINAL FORMAT=	Bruker XWIN-NMR
##$MNOVA/SCALES_VERSION=	8
##$PARAMETER FILE=	(acqus, ASCII, /Users/hrzepa/Library/Mobile%20Documents/com~apple~CloudDocs/Saarbr%C3%BCcken/Prof.Rzepa%20updated/nmr/3/2/acqus, 0)
$$ ##TITLE= Parameter file, TOPSPIN		Version 3.0
$$ ##JCAMPDX= 5.0
$$ ##DATATYPE= Parameter Values
$$ ##NPOINTS= 28	$$ modification sequence number
$$ ##ORIGIN= Bruker BioSpin GmbH
$$ ##OWNER= nmrsu
$$ $$ 2015-07-06 12:34:40.466 +0200  nmrsu@CZC049C5SM
$$ $$ C:\Bruker\TopSpin3.0\data\CemY\nmr/Cem61-VT/2/acqus
$$ $$ process C:\Bruker\TopSpin3.0\prog\mod\shimcntl.exe
$$ ##$ACQT0= -6.36618283677107
$$ ##$AMP= (0..31)
$$ 100 100 100 100 100 100 100 100 100 100 100 100 100 100 100 100 100 100
$$ 100 100 100 100 100 100 100 100 100 100 100 100 100 100
$$ ##$ANAVPT= -1
$$ ##$AQSEQ= 0
$$ ##$AQ_mod= 3
$$ ##$AUNM= <au_zg>
$$ ##$AUTOPOS= <4 >
$$ ##$BF1= 59.627388
$$ ##$BF2= 300.13
$$ ##$BF3= 300.13
$$ ##$BF4= 300.13
$$ ##$BF5= 300.13
$$ ##$BF6= 300.13
$$ ##$BF7= 300.13
$$ ##$BF8= 300.13
$$ ##$BYTORDA= 0
$$ ##$CAGPARS= (0..11)
$$ 0 0 0 0 0 0 0 0 0 0 0 0
$$ ##$CFDGTYP= 0
$$ ##$CFRGTYP= 9
$$ ##$CHEMSTR= <none>
$$ ##$CNST= (0..63)
$$ 1 1 145 1 1 1 1 1 1 1 1 1 1 1 1 1 1 1 1 1 1 1 1 1 1 1 1 1 1 1 1 1 1 1 1
$$ 1 1 1 1 1 1 1 1 1 1 1 1 1 1 1 1 1 1 1 1 1 1 1 1 1 1 1 1 1
$$ ##$CPDPRG= <>
$$ ##$CPDPRG1= <>
$$ ##$CPDPRG2= <waltz16>
$$ ##$CPDPRG3= <>
$$ ##$CPDPRG4= <>
$$ ##$CPDPRG5= <>
$$ ##$CPDPRG6= <>
$$ ##$CPDPRG7= <>
$$ ##$CPDPRG8= <>
$$ ##$D= (0..63)
$$ 0 5 0.00345 0 0 0 0 0 0 0 0 0.03 2e-005 3e-006 0 0 0.0002 0 0 0 0 0 0 0
$$ 0 0 0 0 0 0 0 0 0 0 0 0 0 0 0 0 0 0 0 0 0 0 0 0 0 0 0 0 0 0 0 0 0 0 0 0
$$ 0 0 0 0
$$ ##$DATE= 1436176076
$$ ##$DBL= (0..7)
$$ 120 120 120 120 120 120 120 19
$$ ##$DBP= (0..7)
$$ 150 150 150 150 150 150 150 150
$$ ##$DBPNAM0= <>
$$ ##$DBPNAM1= <>
$$ ##$DBPNAM2= <>
$$ ##$DBPNAM3= <>
$$ ##$DBPNAM4= <>
$$ ##$DBPNAM5= <>
$$ ##$DBPNAM6= <>
$$ ##$DBPNAM7= <>
$$ ##$DBPOAL= (0..7)
$$ 0.5 0.5 0.5 0.5 0.5 0.5 0.5 0.5
$$ ##$DBPOFFS= (0..7)
$$ 0 0 0 0 0 0 0 0
$$ ##$DE= 6.5
$$ ##$DECBNUC= <off>
$$ ##$DECIM= 560
$$ ##$DECNUC= <off>
$$ ##$DECSTAT= 4
$$ ##$DIGMOD= 1
$$ ##$DIGTYP= 12
$$ ##$DL= (0..7)
$$ 0 0 120 120 120 21 21 120
$$ ##$DP= (0..7)
$$ 150 150 150 150 150 150 150 150
$$ [...]
$$ ##$RX22TY= <no>
$$ ##$RXFMAX= (0..7)
$$ 432.5 -1 -1 -1 -1 -1 -1 -1
$$ ##$RXFMIN= (0..7)
$$ 5 -1 -1 -1 -1 -1 -1 -1
$$ ##$RXINTLV= (0..7)
$$ 1 0 0 0 0 0 0 0
$$ ##$RXMSTY= <no>
$$ ##$SCMTY= <no>
$$ ##$SGUC1= (0..15)
$$ 18 19 0 0 0 0 0 0 0 0 0 0 0 0 0 0
$$ ##$SGUC2= (0..15)
$$ 33 256 0 0 0 0 0 0 0 0 0 0 0 0 0 0
$$ ##$SPECTR= 10
$$ ##$SY2FLAG= 0
$$ ##$SYNCTRIG= 11
$$ ##$ShimPowMaxUA= (0..63)
$$ 130000 130000 130000 130000 130000 130000 130000 130000 130000 130000 130000
$$ 130000 130000 130000 130000 130000 130000 130000 130000 130000 0 0 0 0
$$ 0 0 0 0 0 0 0 0 0 0 0 0 0 0 0 0 0 0 0 0 0 0 0 0 0 0 0 0 0 0 0 0 0 0 0 0
$$ 0 0 0 0
$$ ##$ShimPowMaxUC= (0..63)
$$ 130000 130000 130000 130000 130000 130000 130000 130000 130000 130000 130000
$$ 130000 130000 130000 130000 130000 130000 130000 130000 130000 0 0 0 0
$$ 0 0 0 0 0 0 0 0 0 0 0 0 0 0 0 0 0 0 0 0 0 0 0 0 0 0 0 0 0 0 0 0 0 0 0 0
$$ 0 0 0 0
$$ ##$ShimPowMaxUG= (0..63)
$$ 524287 524287 524287 524287 524287 524287 524287 524287 524287 524287 524287
$$ 524287 524287 524287 524287 524287 524287 524287 524287 524287 0 0 0 0
$$ 0 0 0 0 0 0 0 0 0 0 0 0 0 0 0 0 0 0 0 0 0 0 0 0 0 0 0 0 0 0 0 0 0 0 0 0
$$ 0 0 0 0
$$ ##$ShimPowRcbType= 3
$$ ##$ShimPowRes= (0..63)
$$ 1e-020 1e-020 1e-020 1e-020 1e-020 1e-020 1e-020 1e-020 1e-020 1e-020 1e-020
$$ 1e-020 1e-020 1e-020 1e-020 1e-020 1e-020 1e-020 1e-020 1e-020 0 0 0 0
$$ 0 0 0 0 0 0 0 0 0 0 0 0 0 0 0 0 0 0 0 0 0 0 0 0 0 0 0 0 0 0 0 0 0 0 0 0
$$ 0 0 0 0
$$ ##$ShimPowRng0= (0..63)
$$ 1 1 1 1 1 1 1 1 1 1 1 1 1 1 1 1 1 1 1 1 0 0 0 0 0 0 0 0 0 0 0 0 0 0 0 0
$$ 0 0 0 0 0 0 0 0 0 0 0 0 0 0 0 0 0 0 0 0 0 0 0 0 0 0 0 0
$$ ##$ShimPowRng1= (0..63)
$$ 1 1 1 1 1 1 1 1 1 1 1 1 1 1 1 1 1 1 1 1 0 0 0 0 0 0 0 0 0 0 0 0 0 0 0 0
$$ 0 0 0 0 0 0 0 0 0 0 0 0 0 0 0 0 0 0 0 0 0 0 0 0 0 0 0 0
$$ ##$ShimPowRng2= (0..63)
$$ 1 1 1 1 1 1 1 1 1 1 1 1 1 1 1 1 1 1 1 1 0 0 0 0 0 0 0 0 0 0 0 0 0 0 0 0
$$ 0 0 0 0 0 0 0 0 0 0 0 0 0 0 0 0 0 0 0 0 0 0 0 0 0 0 0 0
$$ ##$ShimPowRng3= (0..63)
$$ 1 1 1 1 1 1 1 1 1 1 1 1 1 1 1 1 1 1 1 1 0 0 0 0 0 0 0 0 0 0 0 0 0 0 0 0
$$ 0 0 0 0 0 0 0 0 0 0 0 0 0 0 0 0 0 0 0 0 0 0 0 0 0 0 0 0
$$ ##$ShimSysFunc= (0..63)
$$ 1 2 3 4 5 7 9 11 15 16 8 10 12 14 6 17 13 18 19 20 0 0 0 0 0 0 0 0 0 0
$$ 0 0 0 0 0 0 0 0 0 0 0 0 0 0 0 0 0 0 0 0 0 0 0 0 0 0 0 0 0 0 0 0 0 0
$$ ##$ShimSysMatrix= 0
$$ ##$ShimSysType= 1
$$ ##$TFXNUM= 0
$$ ##$TRIPLO2= 0
$$ ##$VTU= 2
$$ ##$VTUETH= <149.236.99.20>
$$ ##$VTUTY= <no>
$$ ##$WBREFAM= (0..15)
$$ 20.9 49.1 100 100 100 100 100 100 100 100 100 100 100 100 100 100
$$ ##$WBREFLM= (0..15)
$$ 0 0 0 0 0 0 0 0 0 0 0 0 0 0 0 0
$$ ##$WBREFPH= (0..15)
$$ 72.55 -68.79 0 0 0 0 0 0 0 0 0 0 0 0 0 0
$$ ##$XFAC= 2
$$ ##END=
$$ 
##$DECIM=	560
##$DSPFVS=	20
##XUNITS=	HZ
##YUNITS=	ARBITRARY UNITS
##FIRSTX=	17857.144568113202695
##LASTX=	-17857.141146172500157
##DELTAX=	-0.54496506773915776023
##XFACTOR=	1
##YFACTOR=	0.076406358722756473334
##FIRSTY=	-34.6797027587890625
##MINY=	-120.2208404541015625
##MAXY=	955.5037841796875
##NPOINTS=	65536
##XYDATA=	(X++(Y..Y))
$$ [...]
-201d77kJmKQJ1RRNJOJj2j5j2j5j9j9j9j9j9k0j9j9j5j2j6j1JNJOK1K6K1K5L8M3M0M0L7L2
-224c55L7L3K0J6J8J8J6J6J7J6K6K7K7K6L0K9K9L0K5K3J6J1QJqj7k4l0k7k7k7k7k8k8k7k8
-243a38k7k8l0l1l1l1k0k0k1k0j9j8j8j8j8j9j9j7rmj0nJ5J9J5J8J8J9J8J8J8J9J8J8K4K3
-263c11K4K4L4L3L5L3K3J8K5J7qj2pj3k1k1k2k1j2j1j1j1llllj0j6j1j4j7j7j9j4MRNRK3K8
-285b67K5K5K1J9K3J7JmKmj1j2j1j2pnqlQJ4QJ4K5L0K5K9L2K9K5J6Npk0k8l9m5m1m2m4l9k9
-307b85k1j4ojKJKM%j3j6j4j4lKlKK1K5K3K3K2K1K1K1J1J1J1J1KJKJrrrrqrrrlmmlKKLKLK
-335b21LKrrrrrrj1oJ0J6J0J5K2K1K5J9Pjj0j8k6l1l7m1m2m1l4k9k5j6jPK3K7K5K5K0J4J9
-357c34J5NONNJ0J0J0J0J8J9J6K1L4L6L5L5L2L1L5K9K1J2Mnj2k0k9l7m6n2n8o2o1o1o2o0n7
$$ plain form
-201 -477 -479 -478 -482 -480 -472 -461 -452 -443 -438 -437 -431 -430 -442 -457 -469 -484 -503 -522 -541 -560 -579 -599 -618 -637 -652 -664 -680 -691 -690 -685 -684 -678 -657 -631 -610 -585 -547 -504 -464 -424 -387 -355
-224 -355 -318 -285 -265 -249 -231 -213 -197 -181 -164 -148 -122 -95 -68 -42 -12 17 46 76 101 124 140 151 159 160 152 135 111 81 54 27 0 -27 -55 -83 -110 -138
-243 -138 -165 -193 -223 -254 -285 -316 -336 -356 -377 -397 -416 -434 -452 -470 -488 -507 -526 -543 -552 -556 -566 -571 -556 -537 -522 -504 -486 -467 -449 -431 -413 -394 -376 -358 -334 -311
-263 -311 -287 -263 -229 -196 -161 -128 -105 -87 -62 -45 -53 -65 -72 -85 -106 -127 -149 -170 -182 -193 -204 -215 -218 -221 -224 -227 -237 -253 -264 -278 -295 -312 -331 -345 -341 -332 -327 -318 -295 -267
-285 -267 -242 -217 -196 -177 -154 -137 -136 -140 -138 -142 -153 -165 -176 -188 -195 -200 -208 -211 -203 -189 -181 -167 -142 -112 -87 -58 -26 3 28 44 49 42 22 -6 -45 -90 -131 -173 -217 -256 -285
-307 -285 -306 -320 -326 -327 -325 -324 -322 -318 -318 -331 -347 -361 -375 -378 -376 -379 -377 -356 -331 -308 -285 -263 -242 -221 -200 -189 -178 -167 -156 -154 -153 -151 -150 -159 -168 -177 -186 -194 -203 -212 -221 -224 -228 -232 -235 -233 -231 -228 -226 -223 -221
-335 -221 -218 -216 -225 -234 -243 -252 -261 -270 -281 -287 -277 -261 -251 -236 -214 -193 -168 -149 -142 -143 -153 -171 -197 -228 -265 -306 -348 -389 -423 -452 -477 -493 -494 -487 -464 -437 -412 -387 -367 -353 -334
-357 -334 -319 -314 -308 -303 -298 -288 -278 -268 -258 -240 -221 -205 -184 -150 -114 -79 -44 -12 19 54 83 104 116 120 115 103 83 54 17 -29 -81 -139 -201 -262 -323 -385 -445 -502
-378e02n2m0l4k6k0k4k2j7j6j6j7roj0oJ4J8J4J8K8L1K9K9K1J7K2J7N%NJLLKMJ9K3J8K4L5
-400d17M0L8L7M5M5M4M5M4M2L7K8J6Nqj9l4m3m7n1n3n2n6n0l6k9j9j2%NLKopooporlLJ2K2
-423d63K7K8K8L1K5J2Mnj3k6l1l8l9l1k6k3j4pJORRPJnqj3rj2j7j6j7j7j2j2j3j1mJmjPPP
-447f77QPPPQJ1J2J2J1J7J7J6J7J6J3J7J2pj2oj2k0k0k0k0k1k0k0k0j5j3j7j2PJ2QJ1J4J4
-468f58J5J4MMMMrj0j0rj0rj2pMJ0MRK2K5K4K4K3K4K3K3J9J8J8J9K0K1K0K1J5J5J6J5OOOO
-491b33OPOOllklllklkklkppqprrqrj9j9j9j9j9j9k2j6KPKOJ2J2J2J2KKKKrrrrrrrrj1j1j1
-521d87j1j1j1j1j1j5j6j6j6j5j6j8j3KQKPK0K3K2K2J1J2J2J1PPNQJ9K4K1K2J3RJ4QlqooK
-544c79PJPJ5J5J6J4J0Moj4k6l4l8m3m4m8m5m6l9l5m1l3j0jqlRJ8K7L4L5M0L8L8L4L2L4L2
$$ plain form
-378 -502 -554 -594 -628 -654 -674 -698 -720 -737 -753 -769 -786 -795 -801 -811 -817 -803 -785 -771 -753 -725 -694 -665 -636 -615 -598 -576 -559 -554 -554 -549 -548 -545 -542 -540 -536 -517 -494 -476 -452 -417
-400 -417 -377 -339 -302 -257 -212 -168 -123 -79 -37 0 28 44 49 41 22 -12 -55 -102 -153 -206 -258 -314 -364 -400 -429 -448 -460 -460 -455 -452 -450 -456 -463 -469 -475 -482 -488 -497 -500 -497 -485 -463
-423 -463 -436 -408 -380 -349 -324 -312 -308 -313 -326 -352 -383 -421 -460 -491 -517 -540 -554 -561 -560 -554 -545 -536 -529 -528 -533 -541 -554 -563 -575 -592 -608 -625 -642 -654 -666 -679 -690 -694 -693 -697 -698 -691 -684 -677
-447 -677 -669 -662 -655 -648 -640 -629 -617 -605 -594 -577 -560 -544 -527 -511 -498 -481 -469 -476 -488 -494 -506 -526 -546 -566 -586 -607 -627 -647 -667 -682 -695 -712 -724 -717 -705 -697 -686 -672 -658
-468 -658 -643 -629 -625 -621 -617 -613 -622 -632 -642 -651 -661 -670 -682 -689 -685 -675 -671 -662 -640 -615 -591 -567 -544 -520 -497 -474 -455 -437 -419 -400 -380 -359 -339 -318 -303 -288 -272 -257 -251 -245 -239 -233
-491 -233 -227 -220 -214 -208 -211 -214 -216 -219 -222 -225 -227 -230 -232 -234 -237 -239 -246 -253 -261 -268 -277 -286 -294 -303 -322 -341 -360 -379 -398 -417 -439 -455 -453 -446 -444 -438 -426 -414 -402 -390 -388 -386 -384 -382 -391 -400 -409 -418 -427 -436 -445 -454 -465 -476 -487
-521 -487 -498 -509 -520 -531 -542 -557 -573 -589 -605 -620 -636 -654 -667 -665 -657 -655 -648 -628 -605 -583 -561 -550 -538 -526 -515 -508 -501 -496 -488 -469 -445 -424 -402 -389 -380 -366 -358 -361 -369 -375 -381 -379
-544 -379 -372 -371 -364 -349 -334 -318 -304 -294 -290 -296 -310 -336 -370 -408 -451 -495 -543 -588 -634 -673 -708 -749 -782 -792 -793 -801 -804 -795 -777 -750 -716 -681 -641 -603 -565 -531 -499 -465 -433
-565d33K4K2K5K0NjM%j3j6j5j5j7j7j8j6lMlKJ5J7J6J6J6J6J6J7K2K2K2K2K2K1K2K1K0J8J1
-586a09PLmj4k0k7l3l9m1l5l6l5l6l5l3l5l3k4k4k3k4k1k1k0k1k1k0k2j9j0pj0p%LJLJ0J3
-607h19J2J2J2J2J3J1lpkpj4j4j4j4j3j0mKMJ0K1K7L2L6L4L4L6L4L8L3J0NJ0Oqj0rrLQLRJ9
-631d71K5K3K2J6J4J7J3Jn%loooopoooKLLKLKLLnmnmnmolOJ1PRJ9J8J9J9J8J9J9J9RPJ1Oo
-659b02j0orj9j8j8j8k6k5k6k5k6k5k6k6k3k4k5k3rmrnJ6K1J5K0L4L6L6L5L6L7L6L7L6L7L7
-680a58L6L2L2L2L1L3L2L2L2L0L1L2K9K3J7K4J8RPQQjm%nj9k5j9k4l2l2l2l2k7k1k7k2lKm
-702D3MJ8K3K1K1K2K0K4J8mqmqj7j6j6j7j1j1j0j1j1j1j0j2k2k6k3k6k3k4k4k4k9k7k1j5o
-722b53KJ1J9L1L9M2M8N0N0N3M8L4K8L3K9J5J2J4J4J0J0J0J0KlMmk1k6k3k3k7k1k6k2j0j1
$$ plain form
-565 -433 -409 -387 -362 -342 -337 -338 -334 -334 -347 -363 -378 -393 -410 -427 -445 -461 -464 -460 -463 -461 -446 -429 -413 -397 -381 -365 -349 -332 -310 -288 -266 -244 -222 -201 -179 -158 -138 -120 -109
-586 -109 -102 -99 -103 -117 -137 -164 -197 -236 -277 -312 -348 -383 -419 -454 -487 -522 -555 -579 -603 -626 -650 -671 -692 -712 -733 -754 -774 -796 -815 -825 -832 -842 -849 -849 -846 -845 -842 -832 -819
-607 -819 -807 -795 -783 -771 -758 -747 -750 -757 -759 -766 -780 -794 -808 -822 -835 -845 -849 -847 -843 -833 -812 -785 -753 -717 -683 -649 -613 -579 -541 -508 -498 -493 -483 -477 -485 -495 -504 -513 -510 -502 -499 -490 -471
-631 -471 -446 -423 -401 -385 -371 -354 -341 -340 -345 -345 -348 -354 -360 -366 -372 -379 -385 -391 -397 -395 -392 -389 -387 -384 -382 -379 -376 -381 -385 -390 -394 -399 -403 -409 -412 -406 -395 -388 -379 -360 -342 -323 -304 -286 -267 -248 -229 -220 -213 -202 -196 -202
-659 -202 -212 -218 -227 -246 -264 -282 -300 -326 -351 -377 -402 -428 -453 -479 -505 -528 -552 -577 -600 -609 -613 -622 -627 -611 -590 -575 -555 -521 -485 -449 -414 -378 -341 -305 -268 -232 -195 -158
-680 -158 -122 -90 -58 -26 5 38 70 102 134 164 195 227 256 279 296 320 338 347 354 362 370 369 365 365 360 341 316 297 273 241 209 177 145 118 97 70 48 45 47 43
-702 43 47 65 88 109 130 152 172 196 214 210 202 198 190 173 157 141 124 113 102 92 81 70 59 49 37 15 -11 -34 -60 -83 -107 -131 -155 -184 -211 -232 -247 -253
-722 -253 -251 -240 -221 -190 -151 -109 -61 -11 39 92 140 174 202 235 264 279 291 305 319 329 339 349 359 361 358 362 358 337 311 288 265 238 217 191 169 159 148
-743A48rj1j8k3j7k3l3l6l5l5l5l5l6l4k0j6k1j6mJjkjj%jjj%jMNNMK2K2K2K1K3K3K5K0Jm
-766a24Kmrrj2pNJ0OQJ4J4J4J5J4J4J4J4J6J5J3J8L0L5L0L5N1N3N0N3N1N0N3M8M0L2K4J5J
-788F92pj1j5j8j8k1j6LPKPK4K9K6K6K7K6K7K6K1K1K1K0K1K1K0K1K1K1K2K1K1K1K1K1J5J5
-808A181J5J5J5J4J5J5J9J8J8J9QQQQ%j%j%j%jnmnmLRLQK3K9K5K8L5L8L6L7M4M4M4M4M0L5
-832A879L3K3J8Rjoj2j1j5rNJ0NJ0K3K3K6K1Q%pj9l0l9m2m8n3n2n5n2l9l4m0l4k2j9k0k0k0
-853A394k0k0k0j7j8k0j5lKlJJKKJqrqrj7j7j5j9k1k9l8m6n6o4p0p0o6o2n2m3l0k2j7j5k0
-875D44k0k0k0j7j6j6j7j6j7j5j8k8l2k7l2l8m1m0l9m0l9m0m0k9k9l1k7j4rj6qJ0J4J2J1J0
-895b90NJ0OlkllNMMMmrlrk5k8k7k6j9j4j9j5%NJLJ3J3J2J3J2J1J2J2J0J3RJ5K8L4K9L2L0
$$ plain form
-743 148 139 128 110 87 70 47 14 -22 -57 -92 -127 -162 -198 -232 -252 -268 -289 -305 -309 -308 -309 -311 -312 -313 -313 -314 -315 -316 -316 -317 -313 -308 -303 -299 -277 -255 -233 -212 -189 -166 -141 -121 -120 -124
-766 -124 -122 -126 -135 -144 -156 -163 -158 -148 -142 -134 -120 -106 -92 -77 -63 -49 -35 -21 -5 10 23 41 71 106 136 171 222 275 325 378 429 479 532 580 620 652 676 691 692
-788 692 685 674 659 641 623 602 586 589 596 598 605 629 658 684 710 737 763 790 816 837 858 879 899 920 941 961 982 1003 1024 1046 1067 1088 1109 1130 1151 1166 1181
-808 1181 1196 1211 1226 1240 1255 1270 1289 1307 1325 1344 1352 1360 1368 1376 1376 1375 1375 1374 1374 1373 1373 1372 1367 1363 1358 1354 1357 1366 1369 1377 1400 1429 1454 1482 1517 1555 1591 1628 1672 1716 1760 1804 1844 1879
-832 1879 1912 1935 1953 1962 1961 1955 1943 1932 1917 1908 1913 1923 1928 1938 1961 1984 2010 2031 2039 2039 2032 2013 1983 1944 1902 1854 1801 1749 1694 1642 1603 1569 1529 1495 1473 1454 1434 1414 1394
-853 1394 1374 1354 1334 1317 1299 1279 1264 1261 1263 1260 1261 1262 1264 1266 1267 1259 1250 1242 1233 1216 1199 1184 1165 1144 1115 1077 1031 975 911 841 771 705 643 591 548 518 496 479 464 444
-875 444 424 404 384 367 351 335 318 302 285 270 252 224 192 165 133 95 54 14 -25 -65 -104 -144 -184 -213 -242 -273 -300 -314 -323 -339 -347 -337 -323 -311 -300 -290
-895 -290 -285 -275 -269 -272 -274 -277 -280 -275 -271 -267 -263 -267 -276 -279 -288 -313 -341 -368 -394 -413 -427 -446 -461 -461 -456 -455 -452 -439 -426 -414 -401 -389 -378 -366 -354 -344 -331 -322 -307 -279 -245 -216 -184 -154
-919a54L0L2K7J6Qjrj8k3k9l2k8k9k9k9j9j9j9j9poopopnrj7k2j7k2k9l0k9l0k1j6k2j7j0
-940f79qj0qKLKKLKLKJ3J3J3J3J2J3J3J3J7J7J8J7K8K8K7K8J6J6J6J6J6J7J6J6K2K2K4K1J2
-962a73PMnj1j9k7l6m4m9m7m6m1m1m1m2l0l1l2k9k0j5k1j5mKk%NNONnnnnklklQQQQPOPPml
-989g65mlnnonnnnnLLLLpqpprrqrqqrqpqnJLQJ4J8K0K0K0K0J0J1J0J1mnmmmmnmJJ%JJJ%JQ
-1021g72QQQPQQQMNNMJ5J9K3L1M4N1N5O0N8N5N2M2L3K4J6Qlqj3j8k4k8l6l8m0m2m1m1m0l4
-1043e19l0k5j8j2om%J%JJ1J1J2J1J2J2J1J2JKJJKKJKMMkjrj1j7k3k0k3k6k8k9k8k9k9l3l0
-1067h38k8k4j2pkLJ2J6K2K6K7L2L4L4L8L6L0K4J6J0O%jpj1j7k1k7k8l0k6k6k7k5k5k0j5j0
-1088h61j0pqq%%j%j%j%kkkkkkjkoooonoomlJQJ0J4J3J4J4LKLKLKLKJ5J5J4J5J4J5J5J4K3
$$ plain form
-919 -154 -124 -92 -65 -49 -41 -42 -51 -69 -92 -121 -153 -181 -210 -239 -268 -287 -306 -325 -344 -351 -357 -363 -370 -376 -383 -388 -397 -414 -436 -453 -475 -504 -534 -563 -593 -614 -630 -652 -669 -679
-940 -679 -687 -697 -705 -703 -700 -698 -696 -693 -691 -688 -686 -673 -660 -647 -634 -622 -609 -596 -583 -566 -549 -531 -514 -486 -458 -431 -403 -387 -371 -355 -339 -323 -306 -290 -274 -252 -230 -206 -185 -173
-962 -173 -166 -162 -167 -178 -197 -224 -260 -304 -353 -400 -446 -487 -528 -569 -611 -641 -672 -704 -733 -753 -768 -789 -804 -808 -806 -808 -808 -803 -798 -792 -787 -792 -797 -802 -807 -809 -812 -814 -817 -809 -801 -793 -785 -778 -772 -765 -758 -762 -765
-989 -765 -769 -772 -777 -782 -788 -793 -798 -803 -808 -813 -810 -807 -804 -801 -808 -816 -823 -830 -839 -848 -856 -865 -873 -881 -890 -898 -905 -913 -918 -917 -914 -906 -892 -874 -854 -834 -814 -794 -784 -773 -763 -752 -756 -761 -765 -769 -773 -777 -782 -786 -785 -784 -784 -783 -782 -781 -781 -780 -772
-1021 -772 -764 -756 -748 -741 -733 -725 -717 -713 -708 -703 -699 -684 -665 -642 -611 -567 -516 -461 -401 -343 -288 -236 -194 -161 -137 -121 -113 -116 -124 -137 -155 -179 -207 -243 -281 -321 -363 -404 -445 -485 -519
-1043 -519 -549 -574 -592 -604 -610 -614 -614 -613 -613 -612 -601 -590 -578 -567 -555 -543 -532 -520 -519 -517 -516 -515 -513 -511 -510 -508 -504 -500 -502 -503 -512 -523 -540 -563 -583 -606 -632 -660 -689 -717 -746 -775 -808 -838
-1067 -838 -866 -890 -902 -909 -911 -908 -896 -880 -858 -832 -805 -773 -739 -705 -667 -631 -601 -577 -561 -551 -545 -545 -546 -553 -564 -581 -602 -629 -657 -687 -713 -739 -766 -791 -816 -836 -851 -861
-1088 -861 -871 -878 -886 -894 -894 -894 -895 -895 -896 -896 -897 -897 -899 -901 -903 -905 -907 -909 -910 -912 -918 -924 -930 -936 -941 -947 -953 -957 -960 -959 -951 -941 -927 -914 -900 -886 -883 -881 -878 -876 -873 -871 -868 -866 -851 -836 -822 -807 -793 -778 -763 -749 -726
-1117g26K3K6K0RLRMnqmj0k1k6k3k3k3k0k3j9pkolJJJLJ6K2J6K1L1L4L3L2L2L2L4L0K1J5J2
-1140d68Mlj1k2k7l1l4l3l3l0k7l2k6rlqlLNMNJ%J%JJ%JJ%JJONPOJ1J4J0J6K6L1K9K8L2K9
-1165e21K4J6Qmj7k6l5l9l8l7l6l0k8j9j1kPJ3J7K0J8J8J7J4J8J3Jl%ljjnJK0K5J9K4L7L6
-1187d90L6L7K8K3L1K2Jl%kj1j2j1j2k0k3j9k4k9l0l3k7j4oLJ1J9K5L2L1L0K6K1J5QMkoj1
-1208c82j3j2j2j3j2j4j1OJ1NJ1K3K7K5K5J4J0J5Rrj4rj4k3k2k3k2j5j0j5j0jK%JOOOOLLL
-1231d39LMLLLpoopopopj1j2j1j2j1j2j1j2klkkqqpqj3j3j4j1o%mk%JLkj4j8j6j6j4j2j7j0
-1258g85PJ3QJ3K5K9K7K7K7K8K7K7K3K3K3K2J3J2J3J2MMMNkjJmj9k5j9k4l8m0l9l9l8l7l9
-1279g32l6l2k7j6q%RJ2J7K1K0K1K0J7J6J7J6J2J1J1J2LLLLKLLLornj0k8l3k9l2l4l3k6k1
$$ plain form
-1117 -726 -703 -677 -657 -648 -645 -636 -632 -637 -645 -649 -659 -680 -706 -729 -752 -775 -795 -818 -837 -844 -846 -852 -855 -854 -853 -852 -849 -833 -811 -795 -774 -743 -709 -676 -644 -612 -580 -546 -516 -495 -480 -468
-1140 -468 -464 -467 -478 -500 -527 -558 -592 -625 -658 -688 -715 -747 -773 -782 -785 -793 -796 -793 -788 -784 -779 -778 -778 -777 -777 -776 -775 -775 -774 -773 -773 -772 -771 -765 -760 -753 -747 -736 -722 -712 -696 -670 -639 -610 -582 -550 -521
-1165 -521 -497 -481 -473 -477 -494 -520 -555 -594 -632 -669 -705 -735 -763 -782 -793 -795 -788 -775 -758 -738 -720 -702 -685 -671 -653 -640 -639 -642 -642 -645 -646 -647 -652 -651 -631 -606 -587 -563 -526 -490
-1187 -490 -454 -417 -389 -366 -335 -313 -312 -315 -315 -317 -328 -340 -351 -363 -383 -406 -425 -449 -478 -508 -541 -568 -582 -588 -585 -574 -555 -530 -498 -467 -437 -411 -390 -375 -367 -363 -365 -371 -382
-1208 -382 -395 -407 -419 -432 -444 -458 -469 -463 -452 -447 -436 -413 -386 -361 -336 -322 -312 -297 -288 -297 -311 -320 -334 -357 -379 -402 -424 -439 -449 -464 -474 -475 -473 -473 -472 -466 -460 -454 -448 -445 -442 -439
-1231 -439 -436 -432 -429 -426 -423 -430 -436 -442 -449 -455 -462 -468 -475 -486 -498 -509 -521 -532 -544 -555 -567 -569 -572 -574 -576 -584 -592 -599 -607 -620 -633 -647 -658 -664 -664 -668 -670 -670 -669 -666 -668 -682 -700 -716 -732 -746 -758 -775 -785
-1258 -785 -778 -765 -757 -744 -719 -690 -663 -636 -609 -581 -554 -527 -504 -481 -458 -436 -423 -411 -398 -386 -382 -378 -374 -369 -371 -372 -371 -375 -394 -419 -438 -462 -500 -540 -579 -618 -656 -693 -732
-1279 -732 -768 -800 -827 -843 -851 -851 -842 -830 -813 -792 -772 -751 -731 -714 -698 -681 -665 -653 -642 -631 -619 -616 -613 -610 -607 -605 -602 -599 -596 -602 -611 -616 -626 -654 -687 -716 -748 -782 -815 -841 -862
-1302h62j2mOJ1J5J7J7J6J8J8J7J8J1J0J1J0J1J0J1J0PPQPJ2J2J2J2J5J5J5J4NMNMmnmmnm
-1325e13nmLMLMLLNJmj0oqppqplklllklkKN%OJ2J5J3J4J4J4J5J3OJPJj6k0j5k1k5k8k8k6k1
-1352f36j6nKMJ0J5J9J4J5J7J3JmJlj1j4j1j2nJn%J1J1J2J0LkL%qqrpOJ2PJ0J6J8J7J7J7J7
-1377d57K0J4M%LJqrqrqrqqjNjNK0K6K3K3K3K4K3K3J7J6J7J6J7J6J7J6%nJnj6k2j7k0k5k5
-1401b91k5k5j4j5j5j4k3k2k2k2l2l1l2l1k8k5j9j3j2lNJ4K3K8K6K6J9J4K2J2rj7j0j6k9l1
-1420f37l0l0k5k2k6k1LJ2MRJ5J4J8J2Jm%lrqrrj9j9k0j9k0k0k1k0j0j0j0j0KJKJJJLjj0j6
-1444i59j0j6k8l0k9k9k9k3k1j1JJ0K0K6K9L0L1K9J6J2J6J2Kj%JJ0J1J0J1J6J6J6J6NONOJ4
-1466h09J4J4J4J3J4J6J1Jnjmklklklkklkklrj2pj3j9k1k0k0j9j9j9j9rpj1oOJ0OJ1K2K8K3
$$ plain form
-1302 -862 -874 -878 -872 -861 -846 -829 -812 -796 -778 -760 -743 -725 -714 -704 -693 -683 -672 -662 -651 -641 -634 -627 -619 -612 -600 -588 -576 -564 -549 -534 -519 -505 -500 -496 -491 -487 -491 -496 -500 -504 -509 -513
-1325 -513 -518 -522 -519 -515 -512 -508 -505 -502 -497 -496 -500 -510 -516 -524 -531 -538 -546 -553 -556 -558 -561 -564 -567 -569 -572 -574 -572 -567 -567 -561 -549 -534 -521 -507 -493 -479 -464 -451 -445 -444 -437 -436 -452 -472 -487 -508 -533 -561 -589 -615 -636
-1352 -636 -652 -657 -655 -651 -641 -626 -607 -593 -578 -561 -548 -547 -551 -550 -553 -564 -578 -589 -601 -606 -605 -610 -610 -599 -588 -576 -566 -563 -565 -562 -562 -570 -578 -587 -594 -588 -576 -569 -559 -543 -525 -508 -491 -474 -457
-1377 -457 -437 -423 -419 -419 -416 -415 -423 -432 -440 -449 -457 -466 -474 -482 -483 -478 -479 -474 -454 -428 -405 -382 -359 -335 -312 -289 -272 -256 -239 -223 -206 -190 -173 -157 -157 -162 -161 -166 -182 -204 -221 -241 -266 -291
-1401 -291 -316 -341 -355 -370 -385 -399 -422 -444 -466 -488 -520 -551 -583 -614 -642 -667 -686 -699 -711 -714 -709 -695 -672 -644 -618 -592 -573 -559 -537 -525 -534 -551 -561 -577 -606 -637
-1420 -637 -667 -697 -722 -744 -770 -791 -788 -776 -772 -763 -748 -734 -716 -704 -703 -707 -707 -710 -719 -727 -736 -745 -764 -783 -803 -822 -842 -862 -883 -903 -913 -923 -933 -943 -941 -940 -938 -937 -936 -935 -932 -933 -943 -959
-1444 -959 -969 -985 -1013 -1043 -1072 -1101 -1130 -1153 -1174 -1185 -1184 -1174 -1154 -1128 -1099 -1069 -1038 -1009 -993 -981 -965 -953 -951 -952 -952 -951 -941 -930 -920 -909 -893 -877 -861 -845 -840 -834 -829 -823 -809
-1466 -809 -795 -781 -767 -754 -740 -724 -713 -712 -717 -718 -722 -724 -727 -729 -732 -734 -737 -739 -741 -744 -746 -748 -751 -760 -772 -779 -792 -811 -832 -852 -872 -891 -910 -929 -948 -957 -964 -975 -981 -975 -965 -959 -948 -926 -898 -875
-1491h75K8M5N1M8M8M4M2M5M1K4J9K5J9Njnj1j8k7l7m2m7m9m7m8m3m1m5m0k8k3k8k3%NjNJ1
-1511i74J4J2J3J4J5J4J4MNMMklkkQQQQOOOPOOMRJ7K2J9K0L0L0L0L0K0K0K1K0J5J5J6J5J1
-1535d37J1J2J1OOPNoj2qj0j4j4j5j3njnjJ1J7J2J6K0K1K1K1K0K0K0J9J7J2kj0k1l1l3l8m1
-1557d12m1m3m0l4k9l5k9j3qj3qNQOPNONOJjKkj9k4j8k4l1l1l3l0k4j9k4j9%N%OK0K6K0K6
-1581h50L3L3L4L3L5L5L4L5L5L4L5L4L6L6L5L7M4M8M5M7N9O1N9O2O8P1P0P0P1O8O1N7M6L8
-1599G49K9J4ql1n6p5q8r2r3q8p7o5n6m5m0l2j8j3j0ppj0k1k7k1k6m1m4m3m3l7l7l7l7l2k9
-1619e94k2j8j0kRK0L0L8M3M5M7M4L7L3L1K7K2J6RNPPONONJ6J5J6J6J7J7J8J7QNRMmj0oj0
-1642b6k2k7k5k4k3k1k5k0qlqlPJ1RQJ0RRRkjkjkkjkmmloj9k4j8k4l2l4l4l1k6k0k5k2j7j8
$$ plain form
-1491 -875 -847 -802 -751 -703 -655 -611 -569 -524 -483 -459 -440 -415 -396 -391 -392 -397 -408 -426 -453 -490 -532 -579 -628 -675 -723 -766 -807 -852 -892 -920 -943 -971 -994 -994 -989 -990 -985 -974
-1511 -974 -960 -948 -935 -921 -906 -892 -878 -874 -869 -865 -861 -863 -866 -868 -870 -862 -854 -846 -838 -832 -826 -820 -813 -807 -801 -797 -788 -771 -749 -730 -710 -680 -650 -620 -590 -570 -550 -529 -509 -494 -479 -463 -448 -437
-1535 -437 -426 -414 -403 -397 -391 -384 -379 -385 -397 -405 -415 -429 -443 -458 -471 -476 -477 -482 -483 -472 -455 -443 -427 -407 -386 -365 -344 -324 -304 -284 -265 -248 -236 -238 -248 -269 -300 -333 -371 -412
-1557 -412 -453 -496 -536 -570 -599 -634 -663 -676 -684 -697 -705 -700 -692 -686 -679 -674 -668 -663 -657 -656 -657 -655 -657 -676 -700 -718 -742 -773 -804 -837 -867 -891 -910 -934 -953 -953 -948 -948 -942 -922 -896 -876 -850
-1581 -850 -817 -784 -750 -717 -682 -647 -613 -578 -543 -509 -474 -440 -404 -368 -333 -296 -252 -204 -159 -112 -53 8 67 129 197 268 338 408 479 547 608 665 711 749
-1599 749 778 792 784 753 697 622 534 442 349 261 184 119 63 18 -22 -54 -72 -85 -95 -102 -109 -119 -140 -167 -188 -214 -255 -299 -342 -385 -422 -459 -496 -533 -565 -594
-1619 -594 -616 -634 -644 -646 -637 -617 -587 -549 -506 -461 -414 -370 -333 -300 -269 -242 -220 -204 -195 -190 -183 -176 -170 -165 -159 -154 -138 -123 -107 -91 -74 -57 -39 -22 -14 -9 0 4 0 -10 -16 -26
-1642 -26 -48 -75 -100 -124 -147 -168 -193 -213 -221 -224 -232 -235 -228 -217 -208 -200 -190 -181 -172 -163 -165 -166 -168 -169 -171 -173 -174 -176 -180 -184 -187 -193 -212 -236 -254 -278 -310 -344 -378 -409 -435 -455 -480 -502 -519 -537
-1667e37j7j7j7j7j8j6plnnnnnnj4j3j4j3j4j4j3j4k0k0k0k0k0k0k0k0k4k3k3k4k2k2k3k0
-1687a129nKJ2J9K1K6L4L4L4L1L4L2J7J5J7J5POPOPOOPnpnpj4j7j6j6qmrmRJ1J1J0OPOOOO
-1713g73QMmqmpj6j6j7j6plqmRJ4RJ4K9L3K9L3M2M1M2M0K6K0K7J9LmJkk0k3j9k3k1k1k2j9
-1735f14qkqkRJ5J0J3K1K1K1K2J9K0K2J8QLpj6k5l4m3n0o1o3o3o0m9m0k6j6pKJ1J7K2K5K3
-1757h72K3K0J7K0J7LjMjrj3j0j1j2j0j3rQJ2RJ1K0K1K0K1J9J9K0J7J1PJ1Plolnj3j6j4j5
-1779f99j7j7j7j7j8j7j7j7j2j0j3j0jjjjNPMPJ5J7J5J7K2K2K2K2J3J0J3J1MKLLMLJNNOPM
-1803f16kpkoj1j2j2j2j2j2j2j2j9k1j8k1j9j9k1j8j1oj2pPRQQRQRQRQRQ%%j%j%j%QQQQQQ
-1830g75QQJ1J1J1J1MkMkj9k5k0k3k2k1k2k2j4j5j4j4j4j4j5j3NJ1NJ0K9L5K8L4M4M3M5M2
$$ plain form
-1667 -537 -554 -571 -588 -605 -623 -639 -646 -649 -654 -659 -664 -669 -674 -679 -693 -706 -720 -733 -747 -761 -774 -788 -808 -828 -848 -868 -888 -908 -928 -948 -972 -995 -1018 -1042 -1064 -1086 -1109 -1129
-1687 -1129 -1134 -1132 -1120 -1101 -1080 -1054 -1020 -986 -952 -921 -887 -855 -838 -823 -806 -791 -784 -778 -771 -765 -758 -752 -746 -739 -744 -751 -756 -763 -777 -794 -810 -826 -834 -838 -847 -851 -842 -831 -820 -810 -804 -797 -791 -785 -779 -773
-1713 -773 -765 -761 -765 -773 -777 -784 -800 -816 -833 -849 -856 -859 -867 -871 -862 -848 -839 -825 -796 -763 -734 -701 -659 -618 -576 -536 -510 -490 -463 -444 -441 -445 -444 -446 -466 -489 -508 -531 -552 -573 -595 -614
-1735 -614 -622 -624 -632 -634 -625 -610 -600 -587 -566 -545 -524 -502 -483 -463 -441 -423 -415 -412 -419 -435 -460 -494 -537 -587 -648 -711 -774 -834 -883 -923 -949 -965 -972 -970 -959 -942 -920 -895 -872
-1757 -872 -849 -829 -812 -792 -775 -772 -773 -769 -770 -779 -792 -802 -813 -825 -835 -848 -857 -849 -837 -828 -817 -797 -776 -756 -735 -716 -697 -677 -660 -649 -642 -631 -624 -627 -633 -636 -641 -654 -670 -684 -699
-1779 -699 -716 -733 -750 -767 -785 -802 -819 -836 -848 -858 -871 -881 -882 -883 -884 -885 -880 -873 -869 -862 -847 -830 -815 -798 -776 -754 -732 -710 -697 -687 -674 -663 -659 -657 -654 -651 -647 -644 -643 -638 -633 -627 -620 -616
-1803 -616 -618 -625 -627 -633 -644 -656 -668 -680 -692 -704 -716 -728 -747 -768 -786 -807 -826 -845 -866 -884 -895 -901 -913 -920 -913 -904 -896 -888 -879 -871 -862 -854 -845 -837 -828 -820 -820 -820 -821 -821 -822 -822 -823 -823 -815 -807 -799 -791 -783 -775
-1830 -775 -767 -759 -748 -737 -726 -715 -711 -713 -709 -711 -730 -755 -775 -798 -820 -841 -863 -885 -899 -914 -928 -942 -956 -970 -985 -998 -993 -982 -977 -967 -938 -903 -875 -841 -797 -754 -709 -667
-1851f67L0K4K9K4J2PJ1Roj0nj0j6j5j8j4j1nNJ4K5L4L7M3L3L4L7L1K4J6Pjj5k3k7l2l4l8
-1872d61l5l6l6l5l7l4k6k1j1lQJ6K4L3L7L9M0L8K5K0K6K1NJMKKN%OK7L2K8L1L0K9L0L0J8
-1893a28J9J8J9J8J8K0J6KkKkk1k6k4k3j4rj4j0LPNNKjMkj3j9j5j6j8j5j9j4lL%%QPQQORN
-1918a96J0K7L2K8K9K1J7K1J6LkK%j5j8j4j9k3k6k4k5k5k4k5k5k4k4k4k3l5l4l4l4l1l0l0
-1938e78l0l1l0l0l0k3k3k6k0j1oNJ3J5J9K6K9L3L3L3L4K2K1K2K2J2J1J2J1jm%nj7k2j8k1
-1958e53k4k4k6k2k2j6j1o%NJ5K4L1L9M3M8N3N4N6N1M4L5K7J8J5RL%KJjLJ5J9J5J9L2L3L2
-1979C6L3K7K1J2Kqk0l3m2m4m9m9m6l4l0l4l0j6j1j5j2qqj0oMRMRK7L3K9L1L0L1L1K9K3J7
-2000f7K3J8NKLLkkkkonooj1j1j0j3k2k7k2k7l4l5l7l2k0j4k0j5pqopj3j2j2j3kkkkj2j2j2
$$ plain form
-1851 -667 -637 -613 -584 -560 -548 -541 -530 -521 -527 -537 -542 -552 -568 -583 -601 -615 -626 -631 -626 -612 -587 -553 -516 -473 -440 -406 -369 -338 -314 -298 -291 -292 -307 -330 -357 -389 -423 -461
-1872 -461 -496 -532 -568 -603 -640 -674 -700 -721 -732 -735 -727 -711 -687 -654 -617 -578 -538 -500 -475 -455 -429 -408 -403 -402 -398 -396 -394 -389 -389 -383 -356 -324 -296 -265 -235 -206 -176 -146 -128
-1893 -128 -109 -91 -72 -54 -36 -16 0 2 0 2 0 -21 -47 -71 -94 -108 -117 -131 -141 -138 -131 -126 -121 -119 -120 -116 -118 -131 -150 -165 -181 -199 -214 -233 -247 -250 -247 -247 -247 -239 -232 -224 -216 -210 -201 -196
-1918 -196 -186 -159 -127 -99 -70 -49 -32 -11 5 8 6 8 8 -7 -25 -39 -58 -81 -107 -131 -156 -181 -205 -230 -255 -279 -303 -327 -350 -385 -419 -453 -487 -518 -548 -578
-1938 -578 -608 -639 -669 -699 -729 -752 -775 -801 -821 -832 -838 -833 -820 -805 -786 -760 -731 -698 -665 -632 -598 -576 -555 -533 -511 -499 -488 -476 -465 -466 -470 -470 -475 -492 -514 -532 -553
-1958 -553 -577 -601 -627 -649 -671 -687 -698 -704 -704 -699 -684 -660 -629 -590 -547 -499 -446 -392 -336 -285 -241 -206 -179 -161 -146 -137 -134 -134 -132 -131 -132 -129 -114 -95 -80 -61 -29 4 36
-1979 36 69 96 117 129 131 123 103 70 28 -16 -65 -114 -160 -194 -224 -258 -288 -304 -315 -330 -342 -350 -358 -368 -374 -370 -361 -357 -348 -321 -288 -259 -228 -198 -167 -136 -107 -84 -67
-2000 -67 -44 -26 -21 -19 -16 -13 -15 -17 -19 -21 -27 -32 -38 -44 -55 -66 -76 -89 -111 -138 -160 -187 -221 -256 -293 -325 -345 -359 -379 -394 -401 -409 -415 -422 -435 -447 -459 -472 -474 -476 -478 -480 -492 -504 -516
-2025e16j2j3j0nLJ1K0L0L5L9M2M1M0L5L0L5L0J1OJ1Oj0j6j1j4j8j8j8j8j8j7j8j7k8k8k8
-2044d08k8k1j9k4j8j2rj1rLQJRL2M0L2L8L9L7M1L6J8J2J6J4J1J2J1J2J6J7J7J6J5J4J4J4
-2065a4J4J4J4J4RPJ2Ooj1prj3j4j3j2qqrqrrj0rj0rrj0%%j%%j%%j%jjnplrk1k6k1k6l9m2
-2092c21m0m2m5m6m5m6n1m9m2l8k8j9j1l%MJ2J3J3J3J2J3QQQRJ3J3J3J4J3J3J3J4PPQQJ5K0
-2114e42J7J8K4K5K5K3J0NJ0Mnj0pqroj1nJMKLlkklLNJOJ3J4J4J3RMJ0Mj4k0j5j8j8j6k0j5
-2139d82MRMRJ8K1J9K0J1PJ2Pj1j7j2j5j8j9j9j9j5j5j5j4j4j4j6j2kKOJ5K1L0L9M5M7M7M9
-2160b87M5K8J7Noj7k8l6m1m9m8m9m9m1m1m1m1l2k9l4k8j9j7j9j6j0mj1nKLMJnj0oqppj0m
-2182i50JMLLj%%%JJjMRJ9K6L5M9N5N1N2M9M6N0M5K6K1K7K1J1J0J0J0J5J6J5J5J9J8K1J6R
$$ plain form
-2025 -516 -528 -541 -551 -556 -553 -542 -522 -492 -457 -418 -376 -335 -295 -260 -230 -195 -165 -154 -148 -137 -131 -141 -157 -168 -182 -200 -218 -236 -254 -272 -289 -307 -324 -352 -380 -408
-2044 -408 -436 -457 -476 -500 -518 -530 -539 -550 -559 -556 -548 -547 -538 -506 -466 -434 -396 -357 -320 -279 -243 -225 -213 -197 -183 -172 -160 -149 -137 -121 -104 -87 -71 -56 -42 -28 -14
-2065 -14 0 14 28 42 51 58 70 76 70 59 52 43 30 16 3 -9 -17 -25 -34 -42 -51 -60 -70 -79 -89 -98 -107 -117 -117 -117 -118 -118 -118 -119 -119 -119 -120 -120 -121 -122 -127 -134 -137 -146 -167 -193 -214 -240 -279 -321
-2092 -321 -361 -403 -448 -494 -539 -585 -636 -685 -727 -765 -793 -812 -823 -826 -826 -822 -810 -797 -784 -771 -759 -746 -738 -730 -722 -713 -700 -687 -674 -660 -647 -634 -621 -607 -600 -593 -585 -577 -562 -542
-2114 -542 -525 -507 -483 -458 -433 -410 -400 -395 -385 -381 -386 -396 -403 -411 -420 -426 -437 -442 -441 -437 -435 -432 -435 -437 -439 -442 -439 -434 -433 -427 -414 -400 -386 -373 -364 -360 -350 -346 -360 -380 -395 -413 -431 -447 -467 -482
-2139 -482 -478 -469 -465 -456 -438 -417 -398 -378 -367 -360 -348 -341 -352 -369 -381 -396 -414 -433 -452 -471 -486 -501 -516 -530 -544 -558 -574 -586 -588 -586 -580 -565 -544 -514 -475 -430 -383 -336 -287
-2160 -287 -242 -214 -197 -192 -198 -215 -243 -279 -320 -369 -417 -466 -515 -556 -597 -638 -679 -711 -740 -774 -802 -821 -838 -857 -873 -883 -887 -898 -903 -901 -898 -894 -893 -898 -908 -914 -922 -929 -936 -946 -950
-2182 -950 -949 -945 -942 -939 -940 -940 -940 -940 -939 -938 -939 -935 -926 -907 -881 -846 -797 -742 -691 -639 -590 -544 -494 -449 -423 -402 -375 -354 -343 -333 -323 -313 -298 -282 -267 -252 -233 -215 -194 -178 -169
-2205a69%qj7k7l1k9k9k8k3k8k3j1rrj0j5j4j5j4l0l0l0l0l0l0l0k9k1j6k1j6j0qqrqqqqK
-2226h87KKKQQQPQQQQK1K6K4K3K4K3K4K4K1K2K1K2K1K2K1K2K7K8K8K7L3L2K5K0J2PJjk%PJ1
-2250b02J4J4J6J2Jpj0j6j6j6j7j5j5j0n%LNNMJ0J0J1J0RRJ0QJnj0j5k1k7k3k5k9k9k9k9k9
-2272d48k3j9j4olnnj2j1j2j2j2j1j2j2%jj%RJ0J0J0J1J1J1J1J1J1J2J1OPQNN%pqj0rj1qr
-2296e22lKOMNNMmqj5j7j4j3j4j4mmmmLLMLMLMLNNMNJkqj4j2j8k4k6k9l2l1l0l4l3l5l2k4
-2322i51j9j4rkMQJ3K1K4K3K3K1K1K1K0J8J4RLJk%jMMMLJ0RRRjkjjqrqrKKJKJ0J0J0J1MNN
-2350f79Nooooqj4j8k3k5k8k9k4k0j1KJ4K7L9M7N2N3N1M6L8L0K5K0J4J3PLloj0j7k0j8j7k1
-2371e29j5plJPJ1J5J7J9K0K0K0J9J0J0J0J0QQPQPQPQMMMMopoopopokjkjqrqrj4j3j4j3j0
$$ plain form
-2205 -169 -169 -177 -194 -221 -252 -281 -310 -338 -361 -389 -412 -423 -432 -441 -451 -466 -480 -495 -509 -539 -569 -599 -629 -659 -689 -719 -748 -769 -785 -806 -822 -832 -840 -848 -857 -865 -873 -881 -889 -887
-2226 -887 -885 -883 -881 -873 -865 -857 -850 -842 -834 -826 -818 -797 -771 -747 -724 -700 -677 -653 -629 -608 -586 -565 -543 -522 -500 -479 -457 -430 -402 -374 -347 -314 -282 -257 -237 -225 -218 -217 -218 -220 -220 -213 -202
-2250 -202 -188 -174 -158 -146 -145 -152 -162 -178 -194 -210 -227 -242 -257 -267 -272 -272 -269 -264 -259 -255 -245 -235 -224 -214 -205 -196 -186 -178 -177 -182 -192 -207 -228 -255 -278 -303 -332 -361 -390 -419 -448
-2272 -448 -471 -490 -504 -510 -513 -518 -523 -535 -546 -558 -570 -582 -593 -605 -617 -617 -618 -619 -619 -610 -600 -590 -580 -569 -558 -547 -536 -525 -514 -502 -491 -485 -478 -470 -465 -460 -460 -467 -475 -485 -494 -505 -513 -522
-2296 -522 -525 -523 -517 -513 -508 -503 -499 -503 -511 -526 -543 -557 -570 -584 -598 -602 -606 -610 -614 -611 -608 -604 -601 -597 -594 -590 -587 -582 -577 -573 -568 -567 -569 -577 -591 -603 -621 -645 -671 -700 -732 -763 -793 -827 -860 -895 -927 -951
-2322 -951 -970 -984 -993 -995 -991 -983 -970 -949 -925 -902 -879 -858 -837 -816 -796 -778 -764 -755 -752 -751 -753 -753 -754 -750 -746 -742 -739 -729 -720 -711 -702 -703 -705 -706 -707 -715 -724 -732 -741 -739 -737 -736 -734 -724 -714 -704 -693 -689 -684 -679
-2350 -679 -674 -680 -686 -692 -698 -706 -720 -738 -761 -786 -814 -843 -867 -887 -898 -896 -882 -855 -816 -769 -717 -664 -613 -567 -529 -499 -474 -454 -440 -427 -420 -417 -420 -426 -436 -453 -473 -491 -508 -529
-2371 -529 -544 -551 -554 -553 -546 -535 -520 -503 -484 -464 -444 -424 -405 -395 -385 -375 -365 -357 -349 -342 -334 -327 -319 -312 -304 -300 -296 -292 -288 -294 -301 -307 -313 -320 -326 -333 -339 -341 -342 -344 -345 -353 -362 -370 -379 -393 -406 -420 -433 -443
-2399d43rrrrrrrmnmnOOOO%JJJ%JJ%%jjjj%jjj%jj%jj%ononnonojj%jjjjjJ2J2J2J2J6J7J6
-2432d60J6J5J2PK%orj4j8k3k5k6k8k6k1j7pKOJ1J5J9K2K2K3K3K3K3K3K3K3K3K4K1J7J2Mj
-2454b70pj3j6j9j8j8j9j8j9j9k1k1k0k3k8l4l1l0l5l1l6l1j7j5j6j6j4j4j4j4j2p%OJ1J9
-2473h80K5L0L6L8L9L6L1K5J8J3N%lkkKNJ1J3J8K1K7L5L7L7L6L7L7L6L7L4L1K7K2K0J4J1P
-2494c6K%JJ%%%%JJjprj3k1k6k6l0k8k8k7k2j5j1jMJ0J5J7J7J8J7RRRRkjkjOPOOJ6J5J7J5
-2520g9NJoj1j7k1j9j9j3j3j4j3j4j4j1j6k9l3l0l2l3l4k9k7k4j9j6j0rmLQJ4J9K4K7L1L1
-2541d46L1L1K4K2J8J2N%pj3j6j8k3k2k0k0k1j8j4rn%PJ0RRJ0OLlqj0j4j3j3j0njNJ3J8K4
-2564d72K6K7K9K5J8J3J0MK%loqj1j3j6j4j4j3j4j5j4j4j4j7j6j7j5qlMRJ8K2K8L0K4K5K5
$$ plain form
-2399 -443 -452 -461 -470 -479 -488 -497 -506 -510 -515 -519 -524 -518 -512 -506 -500 -500 -499 -498 -497 -497 -496 -495 -495 -495 -496 -497 -498 -499 -499 -500 -501 -502 -502 -503 -504 -504 -505 -506 -506 -512 -517 -523 -528 -533 -539 -544 -550 -551 -552 -552 -553 -554 -555 -556 -557 -545 -533 -521 -509 -493 -476 -460
-2432 -460 -444 -429 -417 -410 -408 -408 -414 -423 -437 -455 -478 -503 -529 -557 -583 -604 -621 -628 -626 -620 -609 -594 -575 -553 -531 -508 -485 -462 -439 -416 -393 -370 -347 -323 -302 -285 -273 -269 -270
-2454 -270 -277 -290 -306 -325 -343 -361 -380 -398 -417 -436 -457 -478 -498 -521 -549 -583 -614 -644 -679 -710 -746 -777 -794 -809 -825 -841 -855 -869 -883 -897 -909 -916 -916 -910 -899 -880
-2473 -880 -855 -825 -789 -751 -712 -676 -645 -620 -602 -589 -584 -584 -587 -589 -591 -589 -584 -573 -560 -542 -521 -494 -459 -422 -385 -349 -312 -275 -239 -202 -168 -137 -110 -88 -68 -54 -43 -36
-2494 -36 -34 -34 -33 -32 -32 -32 -32 -32 -31 -30 -31 -38 -47 -60 -81 -107 -133 -163 -191 -219 -246 -268 -283 -294 -295 -291 -281 -266 -249 -232 -214 -197 -188 -179 -170 -161 -163 -164 -166 -167 -161 -154 -148 -142 -126 -111 -94 -79
-2520 -79 -74 -73 -79 -90 -107 -128 -147 -166 -179 -192 -206 -219 -233 -247 -258 -274 -303 -336 -366 -398 -431 -465 -494 -521 -545 -564 -580 -590 -599 -603 -600 -592 -578 -559 -535 -508 -477 -446
-2541 -446 -415 -384 -360 -338 -320 -308 -303 -303 -310 -323 -339 -357 -380 -402 -422 -442 -463 -481 -495 -504 -509 -509 -502 -492 -483 -474 -464 -458 -455 -458 -466 -476 -490 -503 -516 -526 -531 -532 -527 -514 -496 -472
-2564 -472 -446 -419 -390 -365 -347 -334 -324 -320 -318 -318 -321 -327 -335 -346 -359 -375 -389 -403 -416 -430 -445 -459 -473 -487 -504 -520 -537 -552 -560 -563 -559 -550 -532 -510 -482 -452 -428 -403 -378
-2585c78K4K5K5K1J8J3QL%nqoppqppj9j9j8j9qrqrj3j2j2j4k1k5k1k4k6k7k4k0j4j0ojMRJ3
-2609f49J8K1K7K9K8K7K1J5RRL%%J%NPJ1J7K2K3K1K0J8J2J1Ojppj1j4j4j7j5j1nMRJ4J6J4
-2632c13J3J1OOLj%jjMMJ5J5J5J5J5J5J6J5J6J6J6J6K2J8J5R%nqj3j6j6j7j7k5k7k4k8m8n2
-2654c16m7n2n8n9o1n6m8l9l2k2k0j4rlLRMQRJ0J1RKlLlj1j3j2j2j4j0j5j0PJ3PJ2K0K0K0
-2677g72K1J7J8J7J8J7J8J7J8J5J5J5J4OLPKjmkllkllLLLLLLLLLKLLMMJPJ5K4L4L8M3M5M4
-2703b61M3L3K9L4K9K2K1K1K1K1K3K3K2K8K6J8J4Okj6k7l6m4m8n0m7m3l9l1k5j5qKPJ2J8K1
-2723a98J6J5J5J6NNNMj0j5j0j4k3k8k5k5k7k3k9k1LJ3NJ0J8J8J9J8J3J1J5J0kpmmmlllPP
-2746b30PPJ9J9J9J9J9J9J9J9J8J9K0J5MjMjk1k6k2k5k4k4k5k2j5j0j4j1m%mjRJ1J0RJ0J0
$$ plain form
-2585 -378 -354 -329 -304 -283 -265 -252 -244 -241 -241 -246 -254 -260 -267 -274 -282 -289 -296 -315 -334 -352 -371 -379 -388 -396 -405 -418 -430 -442 -456 -477 -502 -523 -547 -573 -600 -624 -644 -658 -668 -674 -675 -671 -662 -649
-2609 -649 -631 -610 -583 -554 -526 -499 -478 -463 -454 -445 -442 -442 -442 -441 -441 -436 -429 -418 -401 -379 -356 -335 -315 -297 -285 -274 -268 -269 -276 -283 -294 -308 -322 -339 -354 -365 -370 -366 -357 -343 -327 -313
-2632 -313 -300 -289 -283 -277 -274 -275 -275 -276 -277 -273 -269 -254 -239 -224 -209 -194 -179 -163 -148 -132 -116 -100 -84 -62 -44 -29 -20 -20 -25 -33 -46 -62 -78 -95 -112 -137 -164 -188 -216 -264 -316
-2654 -316 -363 -415 -473 -532 -593 -649 -697 -736 -768 -790 -810 -824 -833 -836 -833 -824 -820 -812 -803 -793 -782 -773 -771 -774 -771 -774 -785 -798 -810 -822 -836 -846 -861 -871 -864 -851 -844 -832 -812 -792 -772
-2677 -772 -751 -734 -716 -699 -681 -664 -646 -629 -611 -596 -581 -566 -552 -546 -543 -536 -534 -535 -539 -541 -544 -547 -549 -552 -555 -552 -549 -546 -543 -540 -537 -534 -531 -528 -526 -523 -520 -516 -512 -511 -504 -489 -465 -431 -393 -350 -305 -261
-2703 -261 -218 -185 -156 -122 -93 -71 -50 -29 -8 13 36 59 81 109 135 153 167 173 171 155 128 92 48 0 -50 -97 -140 -179 -210 -235 -250 -258 -256 -249 -237 -219 -198
-2723 -198 -182 -167 -152 -136 -131 -126 -121 -117 -127 -142 -152 -166 -189 -217 -242 -267 -294 -317 -346 -367 -364 -351 -346 -336 -318 -300 -281 -263 -250 -239 -224 -214 -216 -223 -227 -231 -235 -238 -241 -244 -237 -230
-2746 -230 -223 -216 -197 -178 -159 -140 -121 -102 -83 -64 -46 -27 -7 8 12 11 15 14 -7 -33 -55 -80 -104 -128 -153 -175 -190 -200 -214 -225 -229 -229 -233 -234 -225 -214 -204 -195 -185 -175
-2768a75J0J0K0J9K0J9K0J9K0J8J5J4J4J4J5J4J5J3%n%nj7k1j8k1k7k7k8k8k6k6k9k4j8j0
-2787b16kPJ4K0K6K9K8K6K2J3Pjj0j8k5l0k7k8k9k8k9k9j7j6j6j6pmrlMJ0NQJ8J7J7J8K4K7
-2809b20K3K7M1M4M2M2L9M0M2L8K6K0K6K0MjNjqrrqJNJNJ8K1K0J9J4QJ4Rlqnoj6j6j7j6j6
-2832B55j6j6j6j7j6j6j7j6j6j7j6j2j2j2j3j2j2j1j2j1j1j2j1oooorrpj1k4k8k4k8m0m3m2
-2853c54m0k7k2k7k1qkpmJ%%JNQMRK1K6K2K4K4K4K7K2RNJ0NprqqKL%NJ7K2J8K0K9K9L0K7K0
-2878g5J6Nlj1j7k3k5k6k5k6k6j7j4j9j3lLjJNONOJ0J0J0J0J5J6J5J5K5K5K5K5K5K5K5K4J9
-2900D2J9K0J9J8J9J9J7J1Omj2k0k8l2l7m5m9n6o0o9p1o9p0o0n5o2n3l0k4l0k5j6j4j6j5j5
-2920h47j5j5j5k4k3k3k3j6j0j5j1J0J6J0J6K7L2L0K9L0K7L1K5J4RJ3J0OPNQJ4J9J4J9L4L9
$$ plain form
-2768 -175 -165 -155 -135 -116 -96 -77 -57 -38 -18 0 15 29 43 57 72 86 101 114 114 109 109 104 87 66 48 27 0 -27 -55 -83 -109 -135 -164 -188 -206 -216
-2787 -216 -218 -211 -197 -177 -151 -122 -94 -68 -46 -33 -26 -27 -37 -55 -80 -110 -137 -165 -194 -222 -251 -280 -297 -313 -329 -345 -352 -356 -365 -368 -364 -354 -349 -341 -323 -306 -289 -271 -247 -220
-2809 -220 -197 -170 -129 -85 -43 -1 38 78 120 158 184 204 230 250 254 253 258 257 249 240 231 223 224 229 230 235 253 274 294 313 327 335 349 358 355 347 342 336 320 304 287 271 255
-2832 255 239 223 207 190 174 158 141 125 109 92 76 64 52 40 27 15 3 -8 -20 -31 -42 -54 -65 -71 -77 -83 -89 -98 -107 -114 -125 -149 -177 -201 -229 -269 -312 -354
-2853 -354 -394 -421 -443 -470 -491 -499 -501 -508 -512 -511 -511 -511 -510 -505 -497 -493 -484 -463 -437 -415 -391 -367 -343 -316 -294 -285 -280 -270 -265 -272 -281 -289 -297 -295 -292 -292 -287 -270 -248 -230 -210 -181 -152 -122 -95 -75
-2878 -75 -59 -54 -57 -68 -85 -108 -133 -159 -184 -210 -236 -253 -267 -286 -299 -302 -299 -300 -299 -294 -288 -283 -277 -267 -257 -247 -237 -222 -206 -191 -176 -151 -126 -101 -76 -51 -26 -1 23 42
-2900 42 61 81 100 118 137 156 173 184 190 186 174 154 126 94 57 12 -37 -93 -153 -222 -293 -362 -432 -492 -547 -609 -662 -692 -716 -746 -771 -787 -801 -817 -832 -847
-2920 -847 -862 -877 -892 -916 -939 -962 -985 -1001 -1011 -1026 -1037 -1027 -1011 -1001 -985 -958 -926 -896 -867 -837 -810 -779 -754 -740 -731 -718 -708 -702 -695 -690 -682 -668 -649 -635 -616 -582 -543
-2940e43L5L8M6M6M7M6M1L7L3K5J4Kj8l4l7m6o2o3n9n7n2m3l8k9j6j0qkqlPJ2K6L4L8M3M0
-2960e18M1M1L3K3J1Loj1j3rmjPJ8K6K9L4L6L7M0L4K3J8K4J8MjLJrrqrlmllj4j3j4j3j6j5
-2983a92j8j3OJ1NJ1J7J6J8J6KkKkrj2j0j1j0j1j1j0j6j5j5j6j0j0j0j0klkkQQQQJ6J6J7J6
-3006b21J2J0J3RL%%LNJ0K4L2M3N1N4N9O2O1O5N9N3M5L4K4J9J3PMRJ2QJ1J4J2Qkj0k2l2m1
-3028E20n3n7n5n5n6n1l7k9k3j7j2pnknlPQORJ7J9J8J8K4K3K4K3L3L2L3L2L3L3L2L3L0L0L3
-3049F03K8K1J3Kpj0j4k1k4k3k3k3k3j5j4j4j4k0j9j9k0j9j9k1j8j1oj2pOJ1PJ0J3J3J3J3
-3070C37RNjnj2j7j3j5k7k9k7k9k8k8k8k8l4l4l4l4k6k2k6k2j5j3j5j3mknlklkljmjlqqj0
-3093b83oo%MJ0J8K4K8L3L5L6L6L4L0K5J9J7K4K5K2K7K9L4M0M3M3M0L4L0K3K0K1K2K0K1K1
$$ plain form
-2940 -543 -508 -470 -424 -378 -331 -285 -244 -207 -174 -149 -135 -133 -151 -185 -222 -268 -330 -393 -452 -509 -561 -604 -642 -671 -687 -697 -705 -707 -715 -718 -711 -699 -673 -639 -601 -558 -518
-2960 -518 -477 -436 -403 -380 -369 -366 -372 -383 -396 -405 -409 -410 -403 -385 -359 -330 -296 -260 -223 -183 -149 -126 -108 -84 -66 -62 -63 -60 -59 -68 -77 -85 -94 -97 -101 -104 -107 -121 -134 -148 -161 -177 -192
-2983 -192 -210 -223 -217 -206 -201 -190 -173 -157 -139 -123 -121 -123 -121 -123 -132 -144 -154 -165 -175 -186 -197 -207 -223 -238 -253 -269 -279 -289 -299 -309 -311 -314 -316 -318 -310 -302 -294 -286 -270 -254 -237 -221
-3006 -221 -209 -199 -186 -177 -174 -174 -174 -171 -166 -156 -132 -100 -57 -6 48 107 169 230 295 354 407 452 486 510 529 542 549 553 562 574 582 593 607 619 627 625 615 593 561 520
-3028 520 467 410 355 300 244 193 156 127 104 87 75 68 63 61 56 53 60 68 74 83 100 119 137 155 179 202 226 249 282 314 347 379 412 445 477 510 540 570 603
-3049 603 631 652 665 667 660 650 636 615 591 568 545 522 499 484 470 456 442 422 403 384 364 345 326 305 287 276 270 258 251 257 268 275 285 298 311 324 337
-3070 337 346 351 350 345 333 316 303 288 261 232 205 176 148 120 92 64 30 -4 -38 -72 -98 -120 -146 -168 -183 -196 -211 -224 -228 -230 -235 -238 -240 -243 -245 -248 -249 -253 -254 -257 -265 -273 -283
-3093 -283 -289 -295 -295 -291 -281 -263 -239 -211 -178 -143 -107 -71 -37 -7 18 37 54 78 103 125 152 181 215 255 298 341 381 415 445 468 488 509 531 551 572 593
-3113E93K0K0K0K0J9J0OJmmomoj5j7j6j6j8j8j8j8j8j8j7j9l2l5l2l5l4l3l4l3l7l7l7l7l5
-3133B6l5l8l4k6k2j8j0kNJ5K1L0L0L1K9L1L2L1L2K7K7K7K7J6J7J6J7J3J3J4J1O%MKnnnnN
-3155C50NNNMMMMMMMMj3j2j2j2j2j3j2j2qqpqqqqpj8j8j7j8j8j7j8j8j5j5j6j5j5j4j5j3k
-3179b5MRJ2MONN%jkJQJ4J8K3J8J8K1J5Mkoj2j4j4j6j2JOJ2J6K5L0L6L9L2L1L5K9K4J9J5Q
-3202D39Jmrj5j4k0k5l0l1l4l2l4m1m2m1m2m3m3m1l6k6k0j5j0l%jjLKLLLKN%rj2j1j1qnKN
-3226b41QJ1RRJ0J1J0J0J4J5J5J4J3J3J6J9K3K6L2L7L8L9M0L7L3K8K3J8J3J0PNJknollllp
-3249C34pmJPJ3K3L2L6M2M9N1N1M9M3L7K8K3J8J3J1J0J0J0MKN%j1j6j2j5j5j6j2qm%OJ0J6
-3271H14J6J8J5QMkonnnnMNMNMMMLOOLkj0j8k1k6l5l7l5l6m2m2m2m2m1m2m1m2m3m4m0l7l2
$$ plain form
-3113 593 613 633 653 673 692 702 708 709 705 701 695 691 685 670 653 637 621 603 585 567 549 531 513 496 477 445 410 378 343 309 276 242 209 172 135 98 61 26
-3133 26 -9 -47 -81 -107 -129 -147 -157 -159 -154 -139 -118 -88 -58 -27 2 33 65 96 128 155 182 209 236 252 269 285 302 315 328 342 353 359 359 363 365 360 355 350 345 350
-3155 350 355 360 365 369 373 377 381 385 389 393 397 384 372 360 348 336 323 311 299 291 283 276 268 260 252 244 237 219 201 184 166 148 131 113 95 80 65 49 34 19 5 -10 -23 -25
-3179 -25 -21 -12 0 4 10 15 20 20 19 17 18 26 40 58 81 99 117 138 153 157 155 149 137 123 109 93 81 82 88 100 116 141 171 207 246 278 309 344 373 397 416 431 439
-3202 439 440 436 427 412 398 378 353 323 292 258 226 192 151 109 68 26 -17 -60 -101 -137 -163 -183 -198 -208 -211 -211 -212 -213 -210 -208 -205 -202 -199 -197 -192 -192 -201 -213 -224 -235 -243 -248 -246 -241
-3226 -241 -233 -222 -213 -204 -194 -183 -173 -163 -149 -134 -119 -105 -92 -79 -63 -44 -21 5 37 74 112 151 191 228 261 289 312 330 343 353 360 365 366 364 359 353 350 347 344 341 334
-3249 334 327 323 324 331 344 367 399 435 477 526 577 628 677 720 757 785 808 826 839 850 860 870 880 884 886 891 891 880 864 852 837 822 806 794 786 782 782 788 798 814
-3271 814 830 848 863 871 875 873 867 862 857 852 847 851 856 860 865 869 873 877 880 886 892 895 893 883 865 844 818 783 746 711 675 633 591 549 507 466 424 383 341 298 254 214 177 145
-3295A45k8k2j8j4j1j3j3j2j2j1j2j8j9j8j9k4k2j5j1mJJ3J8K2K8L3L6L4L6L5L5K6K6K5K6
-3314B23J9J9J9J9QRQRLLLLLLLLjjj%jjjjrqrrrrqrj2j1j2j1k2k2k2k1j5j4j5j5mmmmlkkl
-3342F2kklkmlmmPPOPK2K1K2K2K1K2K1K2J9J9J9J9J4J3J4J4J2J3J2J2KKKK%%%%NNONMLMMo
-3369D56onoKOJ2J6K4K9L4L9M0M1M2L9L9L4K8K4K1J7J2ONJpqqqqrqrrrqrrqrqrrqqqrpqqo
-3396G36lLNJ4K4K9K6K6K3J4Olj6k5k8l3l9l8m0l9k9l0k9l0l2l2l2l2k8k5j8j4p%J1J6K0K3
-3417C74K2K1K5K4K4K5J9J9J9J9J3J3J3J3J3J3J3J3RRRRMMMMklklj3j3j3j2qqqrLKKLLLMJ
-3442F74Jmrj4j5j8j7j7j7j8j8j7j9j8j8j8k9k8k9k8k9k6l0k5j2olOJ2J6K2K7L5L8L6L7L4
-3462D56L2L6L1J9J4J8J6J3J3J3J3LLLLkjjkMLLL%krj4j3j8k5k7k9k6k0j5qmKPPQJ0Npj2j7
$$ plain form
-3295 145 117 95 77 63 52 39 26 14 2 -9 -21 -39 -58 -76 -95 -119 -141 -156 -167 -171 -170 -157 -139 -117 -89 -56 -20 14 50 85 120 146 172 197 223
-3314 223 242 261 280 299 307 316 324 333 336 339 342 345 348 351 354 357 356 355 354 354 353 352 351 350 341 333 324 315 306 297 289 280 268 257 245 234 212 190 168 147 132 118 103 88 84 80 76 72 69 67 65 62
-3342 62 60 58 55 53 49 46 42 38 45 52 58 65 87 108 130 152 173 195 216 238 257 276 295 314 328 341 355 369 381 394 406 418 420 422 424 426 426 426 426 426 431 436 442 447 451 454 458 462 456
-3369 456 450 445 439 441 447 459 475 499 528 562 601 641 682 724 763 802 836 864 888 909 926 938 944 949 950 943 935 927 919 911 902 894 885 876 867 859 850 841 833 824 816 807 798 790 782 774 765 758 750 742 736
-3396 736 733 736 741 755 779 808 834 860 883 897 903 900 884 859 831 798 759 721 681 642 613 583 554 524 492 460 428 396 368 343 325 311 304 304 315 331 351 374
-3417 374 396 417 442 466 490 515 534 553 572 591 604 617 630 643 656 669 682 695 704 713 722 731 735 739 743 747 745 742 740 737 724 711 698 686 678 670 662 653 656 658 660 663 666 669 673 674
-3442 674 675 671 662 648 633 615 598 581 564 546 528 511 492 474 456 438 409 381 352 324 295 269 239 214 202 196 193 199 211 227 249 276 311 349 385 422 456
-3462 456 488 524 555 574 588 606 622 635 648 661 674 677 680 683 686 684 683 682 680 684 687 690 693 693 691 682 668 655 637 612 585 556 530 510 495 487 483 485 492 499 507 517 522 515 503 486
-3488D86k2k1k1k4j8lOkMJ9K0K0K0K0K0K0J9J9J9K0J7J1OJ2Oj5k1j5k0k7k8k8k8k3k2k4k1
-3508C81plrjJ7K5J8K3L1L1L1L1L2L2L1L2L1L1L3L0J6J1J6J1qj3qj3l1l5l3l2l3l3l4l1k3
-3528E47j8k3j8ojlmkkkkMJ0J9K7M1M9N3N6N7N4M8M3L8L4K8K3K1J6J1Njj1j8k8l7m5n6o0o1
-3550G86o0n5m6m1l2k3j5j0nKMPJ0QRJ0J1J0J1J0J1J1J0J3J6J2J7L6M0L6M0M3M2M4M0L0J8
-3570A050Poj3k2l2l8m3m5m4m4l3k8l4k8j0mj0mRJ3J1J1J6J6J7J6K3K2K3K2K3K3K2K3K0K0
-3589I49K3J7J1Kqj3j6j5j8j3lLjJLMOKj8k2j7k3k7k7l0k5pjokPPQO%ojmj1j0j3qMQNPJ6J5
-3616G59J5J5J6J5J6J5K1K2K1K2K1K2K1K1K2K1K1K1K1K1K4J8KmMnk2k7k4k5k7k8k9k5j3qj3
-3636I47qJ4J9J3J8K6K6K7K6K3K3K3K3K2K4K0K5L6L6L8L4K2J4%j1k3l1l6l9l3l3l6l1j9j5
$$ plain form
-3488 486 464 443 422 398 380 377 383 381 385 404 424 444 464 484 504 524 543 562 581 601 618 629 635 647 653 638 617 602 582 555 527 499 471 448 426 402 381
-3508 381 374 371 362 361 378 403 421 444 475 506 537 568 600 632 663 695 726 757 790 820 836 847 863 874 866 853 845 832 801 766 733 701 668 635 601 570 547
-3528 547 529 506 488 482 481 478 474 472 470 468 466 470 480 499 526 567 616 669 725 782 836 884 927 965 999 1027 1050 1071 1087 1098 1103 1102 1091 1073 1045 1008 963 907 847 786
-3550 786 726 671 625 584 552 529 514 504 499 501 505 512 522 530 539 549 560 570 581 591 602 613 623 636 652 664 681 717 757 793 833 876 918 962 1002 1032 1050
-3570 1050 1057 1051 1038 1016 984 946 903 858 814 770 737 709 675 647 637 633 623 619 628 641 652 663 679 695 712 728 751 773 796 818 841 864 886 909 929 949
-3589 949 972 989 1000 1002 994 981 965 950 932 919 916 919 918 919 922 926 932 934 916 894 877 854 827 800 770 745 738 737 731 729 736 743 751 757 757 751 750 746 735 725 712 704 708 716 721 728 744 759
-3616 759 774 789 805 820 836 851 872 894 915 937 958 980 1001 1022 1044 1065 1086 1107 1128 1149 1173 1191 1193 1189 1193 1188 1166 1139 1115 1090 1063 1035 1006 981 968 960 947
-3636 947 939 953 972 985 1003 1029 1055 1082 1108 1131 1154 1177 1200 1222 1246 1266 1291 1327 1363 1401 1435 1457 1471 1471 1460 1437 1406 1370 1331 1298 1265 1229 1198 1179 1164
-3655A164k1j3RJ8J0J6K4K7K5K6K5K6K6K4J4RJ3Rlqnpj5j7j6j6pmqmJ5K0J5J9K1K2J4QJ0J
-3677A466j0j4k5k9k6k8k9l0l1k8k3j9q%J0J8K7L5N0N6N3N3N0M5N0M6K6K1K7K1JmKmjkjjP
-3698A751J1RQRRJ0RJ8K3J8K3M0M6M2M5N0N0M4L5K8J6Koj6k1j9j9k1k0k1k0j8j6k0j4lLlK
-3719B064J3J6J3J5K4K6K4K5K5K5K8K2MjM%rqqq%M%MJ4J7J8J4QMQMmononnooj0j5j0j5k6l2
-3744B238k9k9k0j4k2j3LRLRJ9K2J8K2L0L1L0L1K9K9K9K9K0J7K1J6LJKJJKJKrrrj0rrrrj2
-3768B456j2j3j2j2j2j3j1LOLOMMNNOPPPPPPPJ%Ljqj0rrm%n%PQJ0Npj2qj1k6k8k6k7j7j4j8
-3795B256j5j6j6j5j7k4k6k4k6k5k5k6k4j8j5j6j6j6j6j6j7j4j4j4j5j3j5j4j4k0k0k1j9j2
-3813A642qj1qJ2J7J1J8L4M1L6L8M3M0L5K8J8Poj7j8k4l2l1l6l1k6k2k0k0j8k1k8l1k9k9l2
$$ plain form
-3655 1164 1143 1130 1139 1157 1167 1183 1207 1234 1259 1285 1310 1336 1362 1386 1400 1409 1422 1431 1428 1420 1415 1408 1393 1376 1360 1344 1337 1333 1325 1321 1336 1356 1371 1390 1411 1433 1447 1455 1465 1466
-3677 1466 1456 1442 1417 1388 1362 1334 1305 1275 1244 1216 1193 1174 1166 1166 1176 1194 1221 1256 1306 1362 1415 1468 1518 1563 1613 1659 1685 1706 1733 1754 1755 1751 1753 1749 1748 1746 1745 1744 1751
-3698 1751 1762 1771 1779 1788 1797 1807 1816 1834 1857 1875 1898 1938 1984 2026 2071 2121 2171 2215 2250 2278 2294 2296 2290 2274 2253 2234 2215 2194 2174 2153 2133 2115 2099 2079 2065 2062 2065 2062 2064
-3719 2064 2077 2093 2106 2121 2145 2171 2195 2220 2245 2270 2298 2320 2324 2323 2327 2327 2318 2310 2302 2294 2294 2298 2298 2302 2316 2333 2351 2365 2373 2377 2385 2389 2385 2379 2374 2368 2363 2358 2352 2346 2336 2321 2311 2296 2270 2238
-3744 2238 2209 2180 2160 2146 2124 2111 2114 2123 2126 2135 2154 2176 2194 2216 2246 2277 2307 2338 2367 2396 2425 2454 2474 2491 2512 2528 2531 2532 2534 2535 2536 2538 2539 2541 2532 2523 2514 2504 2495 2486 2477 2468 2456
-3768 2456 2444 2431 2419 2407 2395 2382 2371 2374 2380 2383 2389 2393 2397 2402 2407 2413 2420 2427 2434 2441 2448 2455 2462 2463 2463 2466 2465 2457 2447 2438 2429 2425 2425 2420 2420 2427 2435 2445 2450 2443 2431 2423 2412 2386 2358 2332 2305 2288 2274 2256
-3795 2256 2241 2225 2209 2194 2177 2153 2127 2103 2077 2052 2027 2001 1977 1959 1944 1928 1912 1896 1880 1864 1847 1833 1819 1805 1790 1777 1762 1748 1734 1714 1694 1673 1654 1642
-3813 1642 1634 1623 1615 1627 1644 1655 1673 1707 1748 1784 1822 1865 1905 1940 1968 1986 1993 1987 1970 1952 1928 1896 1865 1829 1798 1772 1750 1730 1710 1692 1671 1643 1612 1583 1554 1522
-3833A522l1l2l2l3l0l4k9j6rj4j2kkklj2j1j2j2j2j2j2j2kLlLK2K6K1K7L9M1M0M0M0L8M2
-3854A523L6K7K1J1Lpj6k5l1l7l9l8l8l9l9m0l9m1m2m1m1l7l4k8k2j7p%J0J6K5L0L2L1L1L2
-3873A130L1K2K2K1K2K3K2K3K2J3J1J5Roj1oj1k3k6k4k4j9j4nOJ3K2L2L7L6L2K7K2J7J2J5
-3893A488J4PPPOjojok4k8k6k7k7k5k9k4qmpnNMNMmnnmj5j5j6j5mnnnnnnn%%J%J0J1J0J1N
-3920A229LOKj0j4j1j3j7j4j0jJ2K1L0L8N1N5O3O4N9N9O1N6M3L7M4L6J9J4J9J4ONNOMPKQJ7
-3942B005K0J9J8K0J8K1J6jojok0k2k1k0j4j4j4j4lmlmKJKJJ2J2J2J2RNJ0Mj3k0j5j7j7j6
-3964A954k0j4kKkKJ8K2J7K2K9L0L2K7J5J0J5J0lolopoppj6j9j5j9l5m2l5m0m7m7m8m6l9l4
-3986A640k4j5j0JJ4K4L6M2M8N0M4M5M5M3M1L6L1K5K2J5Okj2j8k3k6k0k0k2j9mKnJJ3J5J5
$$ plain form
-3833 1522 1491 1459 1427 1394 1364 1330 1301 1285 1276 1262 1250 1248 1246 1244 1241 1229 1218 1206 1194 1182 1170 1158 1146 1144 1147 1144 1147 1169 1195 1216 1243 1282 1323 1363 1403 1443 1481 1523
-3854 1523 1559 1586 1607 1618 1621 1614 1598 1573 1542 1505 1466 1428 1390 1351 1312 1272 1233 1192 1150 1109 1068 1031 997 969 947 930 923 923 933 949 974 1004 1036 1067 1098 1130
-3873 1130 1161 1183 1205 1226 1248 1271 1293 1316 1338 1351 1362 1377 1386 1380 1369 1363 1352 1329 1303 1279 1255 1236 1222 1217 1223 1236 1258 1290 1327 1363 1395 1422 1444 1461 1473 1488
-3893 1488 1502 1509 1516 1523 1529 1528 1522 1521 1515 1491 1463 1437 1410 1383 1358 1329 1305 1297 1293 1286 1281 1286 1290 1295 1299 1295 1290 1285 1281 1266 1251 1235 1220 1216 1211 1206 1201 1196 1191 1186 1181 1181 1181 1182 1182 1192 1203 1213 1224 1229
-3920 1229 1232 1238 1240 1230 1216 1205 1192 1175 1161 1151 1150 1162 1183 1213 1251 1302 1357 1420 1484 1543 1602 1663 1719 1762 1799 1843 1879 1898 1912 1931 1945 1951 1956 1961 1967 1971 1978 1980 1988 2005
-3942 2005 2025 2044 2062 2082 2100 2121 2137 2136 2130 2129 2123 2103 2081 2060 2040 2026 2012 1998 1984 1981 1977 1974 1970 1972 1973 1975 1976 1988 2000 2012 2024 2033 2038 2048 2052 2039 2019 2004 1987 1970 1954
-3964 1954 1934 1920 1918 1920 1918 1920 1938 1960 1977 1999 2028 2058 2090 2117 2132 2142 2157 2167 2164 2158 2155 2149 2142 2136 2129 2122 2106 2087 2072 2053 2018 1976 1941 1901 1854 1807 1759 1713 1674 1640
-3986 1640 1616 1601 1591 1592 1606 1630 1666 1708 1756 1806 1850 1895 1940 1983 2024 2060 2091 2116 2138 2153 2159 2157 2145 2127 2104 2078 2058 2038 2016 1997 1993 1995 1990 1991 2004 2019 2034
-4006B034J3Pjj0j7k6l0k7k8k1j5k1j5MQMPJ3J3J3J3J3J3J3J3J2J2J4J1LJLJpqorj6j9j8j8
-4029A926k3k3k3k3k4k3k3k3k2j9k2k0j2rj2rMRLQJ5J8J6J5QKRKj7k0j9j8k0k0k0k0rrrrj
-4051A534KLQJ3J8K2K6L1L7M1M3M3M1L6L1K4J8J2OKjloorj1j3j9j9k1j7pkOJ5J9K5K7K8K6
-4073B003K4K0J4J2PMkj2j7k1k4j9j9j9j8j0j1j0j0j0j0j0j0j0j0j0j0j0j1j0j0k1k0k1k0
-4092A689j9j4qkKPJ0J6K1K4K8K8K6K7K1K1J8J5J3RPKlnj0rj0j0ppkk%LPJ3J9K4L1L5M0L9
-4115B087L7L1K3J7J1OMklmomMJ0J9K7L3L7L9L9L6L1K8K2K0J3J1NJlj2j7k3k9k8l0l4l4l8
-4136B324l5l0k6j6j2pm%JJ%LLMLMLLNJ0J5J8K3K6K6K6K6J9J9J9J8J9J9J9J9J9K0K0J9J6J0
-4158B649QKmj2j7k2l0l1l1l1k1k2k2k2j4j2j1omKQJ4K2K8L0L0K6K5K0J5J3J1J2J2NNKkjn
$$ plain form
-4006 2034 2047 2054 2053 2043 2026 2000 1970 1943 1915 1894 1879 1858 1843 1847 1855 1859 1866 1879 1892 1905 1918 1931 1944 1957 1970 1982 1994 2008 2019 2022 2023 2026 2027 2020 2012 2006 1997 1981 1962 1944 1926
-4029 1926 1903 1880 1857 1834 1810 1787 1764 1741 1719 1700 1678 1658 1646 1637 1625 1616 1620 1629 1632 1640 1655 1673 1689 1704 1712 1714 1723 1725 1708 1688 1669 1651 1631 1611 1591 1571 1562 1553 1544 1535 1534
-4051 1534 1536 1539 1547 1560 1578 1600 1626 1657 1694 1735 1778 1821 1862 1898 1929 1953 1971 1983 1989 1991 1990 1987 1981 1975 1966 1955 1942 1923 1904 1883 1866 1859 1857 1863 1878 1897 1922 1949 1977 2003
-4073 2003 2027 2047 2061 2073 2080 2084 2082 2070 2053 2032 2008 1989 1970 1951 1933 1923 1912 1902 1892 1882 1872 1862 1852 1842 1832 1822 1812 1802 1791 1781 1771 1750 1730 1709 1689
-4092 1689 1670 1656 1648 1646 1648 1655 1665 1681 1702 1726 1754 1782 1808 1835 1856 1877 1895 1910 1923 1932 1939 1941 1938 1933 1923 1914 1904 1894 1887 1880 1878 1876 1876 1879 1886 1899 1918 1942 1973 2008 2048 2087
-4115 2087 2124 2155 2178 2195 2206 2212 2216 2214 2211 2207 2201 2197 2201 2211 2230 2257 2290 2327 2366 2405 2441 2472 2500 2522 2542 2555 2566 2571 2572 2569 2557 2540 2517 2488 2460 2430 2396 2362 2324
-4136 2324 2289 2259 2233 2217 2205 2198 2194 2194 2195 2196 2196 2199 2202 2206 2209 2213 2216 2219 2224 2234 2249 2267 2290 2316 2342 2368 2394 2413 2432 2451 2469 2488 2507 2526 2545 2564 2584 2604 2623 2639 2649
-4158 2649 2657 2659 2655 2643 2626 2604 2574 2543 2512 2481 2460 2438 2416 2394 2380 2368 2357 2351 2347 2349 2357 2371 2393 2421 2451 2481 2507 2532 2552 2567 2580 2591 2603 2615 2620 2625 2627 2625 2624 2619
-4180B619rj4k2k7l1l5m1m5m7m9m5m3m7m2k5j7k4j9JLKLKKLKJ4J3J3J4K3K4K4K3K6K6K7K4
-4201B306J2OJ1PRQOJ0J6J8J8J5J2Plj2k0k5l0l6l9l9l8l9l4k9j8j0jQJ1J7J9K0K0K0K4K4
-4222B251K4K4J3J4J4J4JKJJKK%LJ1J5J0J5K1K4K3K3L0L2K9L3M6M8M8M7M5M3L7L1K4J4Njp
-4243C012j2rrj1j1j1j0onooj4j9j1k0m3m9m4m7m5m6m8m3l4l0l3l1k3k0k3k0j2j0j0j1j0j0
-4263B210j2rNRNQK2K6K2K5L2L1L4L0K8K5J8J3RJqj6j9k4k9l4l5l4l7l3l0k5j5oMJ1J7J8K1
-4284B258J7J1PL%JK%JJ%ORNJ0K8L4K8L3M0L9M1L8K6K0K5K0Jl%lj0j3j1j3j6j6j6j6j8j4j8
-4307B537j5%L%LJ1J3J0J3J7J8J7J7RMJ0Mj5k2j7k0k0j7k2j7nlmmlmmmKKJKJKL%oqnqj7j7
-4333B442j7j8k0k1k0k1j1rj2qPJ1PJ2K4K8K4K8L0L1L2K9J6J2J4J4J5J7J5J7K4K8K6K5K1J8
$$ plain form
-4180 2619 2610 2596 2574 2547 2516 2481 2440 2395 2348 2299 2254 2211 2164 2122 2097 2080 2056 2037 2038 2041 2043 2046 2048 2050 2053 2055 2069 2082 2095 2109 2132 2156 2180 2203 2229 2255 2282 2306
-4201 2306 2318 2324 2335 2342 2351 2359 2365 2375 2391 2409 2427 2442 2454 2461 2458 2446 2426 2401 2371 2335 2296 2257 2219 2180 2146 2117 2099 2089 2088 2096 2107 2124 2143 2163 2183 2203 2227 2251
-4222 2251 2275 2299 2312 2326 2340 2354 2355 2357 2358 2359 2361 2363 2363 2366 2377 2392 2402 2417 2438 2462 2485 2508 2538 2570 2599 2632 2678 2726 2774 2821 2866 2909 2946 2977 3001 3015 3020 3019 3012
-4243 3012 3000 2991 2982 2971 2960 2949 2939 2933 2928 2922 2916 2902 2883 2872 2852 2809 2760 2716 2669 2624 2578 2530 2487 2453 2423 2390 2359 2336 2316 2293 2273 2261 2251 2241 2230 2220 2210
-4263 2210 2198 2189 2194 2203 2208 2216 2238 2264 2286 2311 2343 2374 2408 2438 2466 2491 2509 2522 2531 2532 2524 2508 2489 2465 2436 2402 2367 2333 2296 2263 2233 2208 2193 2187 2191 2202 2219 2237 2258
-4284 2258 2275 2286 2293 2296 2296 2297 2299 2299 2300 2301 2301 2307 2316 2321 2331 2359 2393 2421 2454 2494 2533 2574 2612 2638 2658 2683 2703 2704 2701 2701 2698 2688 2675 2664 2651 2635 2619 2603 2587 2569 2555 2537
-4307 2537 2522 2522 2525 2525 2528 2539 2552 2562 2575 2592 2610 2627 2644 2653 2657 2667 2671 2656 2634 2617 2597 2577 2560 2538 2521 2516 2513 2509 2505 2502 2498 2494 2490 2492 2494 2495 2497 2498 2500 2503 2503 2497 2489 2484 2476 2459 2442
-4333 2442 2425 2407 2387 2366 2346 2325 2314 2305 2293 2285 2292 2303 2310 2322 2346 2374 2398 2426 2456 2487 2519 2548 2564 2576 2590 2604 2619 2636 2651 2668 2692 2720 2746 2771 2792 2810
-4352B810K1J8J1QRRJ1J0J0J0J0J1J1RMJMJorpqj2j2j2j2j2j2j2j2olplMPMPK0K5K0K5L1L4
-4376C010L4L1K4K0K4K1K2K3K1K3K1K1K3J8J0Koj6k9l8m1m6m8m8m9m7m6m0l1k2j4qlJkj%l
-4397B811j5k0j5k0k7l3k9l0l1k9l3k7qlqlRJ4RJ4K4K8K6K6K8K5K9K3PJMLMLMLQRNJ1K3K8
-4420B848K2K8L9M2M1M0M1M1M3L8K6K2K6K1QOQNlnlnmlnlNJ0NRPPPQLLLMLLLLKJJJJJJJJ1
-4448C417J1J1J1J3QJ5Pj9k4k1k2k1k0k3j7r%QJ7K4L2L5M1M2M1M2M2L3L0L4K9K0J6J0NM%p
-4468C815j0rj0j0j0j1j0j2r%%j%lpj2j7k1k4k3k2k5k2k5k2j1rj1rjJjJPOPPJ6J9J7J7J3J3
-4492C582J5J2M%pronqmKNLLJ%%JJJ%KOQJ6J9K0K3K2K1K7K7K7K7J8J5J8J5J2J0J2RJ%%Jor
-4518C932mrj6j8j7j7j6j7j7j6pnpnMROPOPQNj%j%QJ2QJ1J1J2J1J2J2J2J2J1J5J5J6J3OJm
$$ plain form
-4352 2810 2831 2849 2860 2868 2877 2886 2897 2907 2917 2927 2937 2948 2959 2968 2972 2973 2977 2978 2972 2963 2956 2948 2936 2924 2912 2900 2888 2876 2864 2852 2846 2843 2836 2833 2837 2844 2848 2855 2875 2900 2920 2945 2976 3010
-4376 3010 3044 3075 3099 3119 3143 3164 3186 3209 3230 3253 3274 3295 3318 3336 3346 3348 3342 3326 3297 3259 3218 3172 3124 3076 3027 2980 2934 2894 2863 2841 2827 2819 2816 2817 2815 2814 2814 2811
-4397 2811 2796 2776 2761 2741 2714 2681 2652 2622 2591 2562 2529 2502 2494 2491 2483 2480 2489 2503 2512 2526 2550 2578 2604 2630 2658 2683 2712 2735 2742 2743 2747 2750 2754 2757 2761 2764 2772 2781 2786 2797 2820 2848
-4420 2848 2870 2898 2937 2979 3020 3060 3101 3142 3185 3223 3249 3271 3297 3318 3326 3332 3340 3345 3342 3337 3334 3329 3325 3322 3317 3314 3319 3329 3334 3343 3350 3357 3364 3372 3375 3378 3381 3385 3388 3391 3394 3397 3399 3400 3401 3402 3403 3404 3405 3406 3417
-4448 3417 3428 3439 3450 3463 3471 3486 3493 3474 3450 3429 3407 3386 3366 3343 3326 3317 3317 3325 3342 3366 3398 3433 3474 3516 3557 3599 3641 3674 3704 3738 3767 3787 3803 3813 3818 3822 3822 3815
-4468 3815 3805 3796 3786 3776 3766 3755 3745 3733 3724 3724 3724 3723 3723 3720 3713 3701 3684 3663 3639 3616 3594 3569 3547 3522 3500 3489 3480 3469 3460 3459 3460 3459 3460 3467 3473 3480 3487 3503 3522 3539 3556 3569 3582
-4492 3582 3597 3609 3613 3613 3606 3597 3591 3586 3578 3574 3576 3581 3584 3587 3588 3588 3588 3589 3590 3591 3591 3593 3599 3607 3623 3642 3662 3685 3707 3728 3755 3782 3809 3836 3854 3869 3887 3902 3914 3924 3936 3945 3946 3946 3946 3947 3941 3932
-4518 3932 3928 3919 3903 3885 3868 3851 3835 3818 3801 3785 3778 3773 3766 3761 3765 3774 3780 3787 3793 3800 3808 3813 3812 3812 3811 3811 3819 3831 3839 3850 3861 3873 3884 3896 3908 3920 3932 3943 3958 3973 3989 4002 4008 4009 4005
-4543D005rj5j8j6j7k3k1j5j0mJOJ1J2J5J3J4J3J1J5J0KLKKJ1J3J2J1J2J1J3J1K%K%qj1rr
-4565D048nkokOQOQJ7K1K6L1L3L3L4L3K8K8K7K8K8K8K7K8K6K6K6K7K6K6K6K6K8K9K8K8L4L1
-4586D898K6J9Olj0k0k7l4m0m3m9n2n0n1n0n1n1m9l9l3l0k1j2l%NROJoj6k5k8l2l2l1l0k4
-4606D028k0j6j1rj0j0j0j0rrqqpkKJ2J7K3K5K5K1J5RMkmmk%MRJ2J5J5J7J3RM%nqj2j6k1k5
-4631D041k8k6k6k3j8j5j0jNJ1J6J6J9J8J8K0K0J9K0J0RJ0RRRRRRRRQJ1PJ2P%k%jmjn%QJ4
-4655D231J6J5J5J3QL%nqpqkJOQRQRQQQPQPPPOM%oj2j3j7j9k1k2k2k2k4k5k0j8j1qkJJMPR
-4683D142J6K1K4K9L1L3L3L0K8K4J9J6QPLJJknonnlKNJ0J4J7K2K2K1K4K8L2L7M0M3M4M4M2
-4704D887L3K7K3J4J1Okoj4j6j6j5j6j7j6j7k1k2k6k7l0k7k2j8j0pqrj2j4k0k3k8k9k9k9k9
$$ plain form
-4543 4005 3996 3981 3963 3947 3930 3907 3886 3871 3861 3857 3858 3864 3875 3887 3902 3915 3929 3942 3953 3968 3978 3980 3983 3985 3987 3998 4011 4023 4034 4046 4057 4070 4081 4083 4083 4085 4085 4077 4066 4057 4048
-4565 4048 4043 4041 4035 4033 4039 4047 4053 4061 4078 4099 4125 4156 4189 4222 4256 4289 4317 4345 4372 4400 4428 4456 4483 4511 4537 4563 4589 4616 4642 4668 4694 4720 4748 4777 4805 4833 4867 4898
-4586 4898 4924 4943 4949 4946 4936 4916 4889 4855 4815 4772 4723 4671 4621 4570 4520 4469 4418 4369 4330 4297 4267 4246 4234 4231 4231 4236 4245 4251 4252 4246 4230 4205 4177 4145 4113 4082 4052 4028
-4606 4028 4008 3992 3981 3972 3962 3952 3942 3932 3923 3914 3906 3898 3891 3889 3891 3903 3920 3943 3968 3993 4014 4029 4038 4042 4040 4036 4032 4030 4030 4034 4043 4055 4070 4085 4102 4115 4124 4128 4128 4123 4115 4103 4087 4066 4041
-4631 4041 4013 3987 3961 3938 3920 3905 3895 3894 3899 3910 3926 3942 3961 3979 3997 4017 4037 4056 4076 4086 4095 4105 4114 4123 4132 4141 4150 4159 4168 4177 4185 4196 4203 4215 4222 4222 4220 4220 4219 4215 4214 4209 4209 4217 4231
-4655 4231 4247 4262 4277 4290 4298 4301 4301 4296 4288 4281 4273 4271 4272 4278 4286 4295 4303 4312 4320 4328 4336 4343 4351 4358 4365 4372 4378 4382 4382 4376 4364 4351 4334 4315 4294 4272 4250 4228 4204 4179 4159 4141 4130 4122 4120 4121 4122 4126 4133 4142
-4683 4142 4158 4179 4203 4232 4263 4296 4329 4359 4387 4411 4430 4446 4454 4461 4464 4465 4466 4464 4459 4453 4448 4443 4440 4442 4447 4457 4471 4488 4510 4532 4553 4577 4605 4637 4674 4714 4757 4801 4845 4887
-4704 4887 4920 4947 4970 4984 4995 5001 4999 4993 4979 4963 4947 4932 4916 4899 4883 4866 4845 4823 4797 4770 4740 4713 4691 4673 4663 4656 4648 4639 4627 4613 4593 4570 4542 4513 4484 4455 4426
-4725D426k9k9k9k0k1j6j4j5j1pkMPNNOOOPJ8J7J8J8J8J8J8J8J6J5J6J6J5J5J4J5J2PKlqj0
-4747D544j4j4j1j2j1j2j1j1j2rn%NJ0J8K3K7L3L4L5L5L5L5L5L6L5L1L2L0L1K8K3J8J4OKm
-4767E029rj0j2j1j2j5j5j6j5j5j4j5j4j2okLPJ1J5J4J6J7J6J7J6J7J6J6J7J7J5RPJmprrj
-4789E053MLQJ4J8K1K4K3K2K4K3K4K3J5J2J7J1kmkmlmmkjMRJ5J9K4K5K8L0K8K1J6RJpj6k5
-4812E494l0l6l9l6l6l2k9k9k6k2k2j8j8j9j8j3j4llJJJJllmlkjjkMMLMLKLLLKLLJ0J0J1J0
-4837E114J0J1J0J0QPQPQPQPJ8J7J7J8J7J7J8J7K3K4K3K4K5K5K2J9J6J1NLKjlnj0j3j9k4k5
-4860E476k5k7k3j6j0JPRJ2J2RPJmrj9k4k6k8k6k6k6k6k3k0j3j0rpnjMNNNQPQPJ3J2J3J2J1
-4884E241J1J1J1PNjprj2rj2j6j6j7j6rrqrmlmlj3j2j2j3j2j3j2j2jjjjjjjjLLLMJ2J8K2K7
$$ plain form
-4725 4426 4397 4368 4339 4319 4298 4282 4268 4253 4242 4235 4233 4237 4244 4249 4254 4260 4266 4272 4279 4297 4314 4332 4350 4368 4386 4404 4422 4438 4453 4469 4485 4500 4515 4529 4544 4556 4563 4565 4562 4554 4544
-4747 4544 4530 4516 4505 4493 4482 4470 4459 4448 4436 4427 4422 4422 4427 4437 4455 4478 4505 4538 4572 4607 4642 4677 4712 4747 4783 4818 4849 4881 4911 4942 4970 4993 5011 5025 5031 5033 5029
-4767 5029 5020 5010 4998 4987 4975 4960 4945 4929 4914 4899 4885 4870 4856 4844 4838 4836 4839 4846 4857 4872 4886 4902 4919 4935 4952 4968 4985 5001 5017 5034 5051 5066 5075 5082 5083 5079 5072 5063 5054 5053
-4789 5053 5057 5060 5068 5082 5100 5121 5145 5168 5190 5214 5237 5261 5284 5299 5311 5328 5339 5337 5333 5331 5327 5324 5320 5316 5314 5313 5317 5326 5341 5360 5384 5409 5437 5467 5495 5516 5532 5541 5542 5535 5519 5494
-4812 5494 5464 5428 5389 5353 5317 5285 5256 5227 5201 5179 5157 5139 5121 5102 5084 5071 5057 5054 5051 5052 5053 5054 5055 5052 5049 5045 5042 5040 5039 5038 5036 5040 5044 5047 5051 5054 5056 5059 5062 5065 5067 5070 5073 5083 5093 5104 5114
-4837 5114 5124 5135 5145 5155 5163 5170 5178 5185 5193 5200 5208 5215 5233 5250 5267 5285 5302 5319 5337 5354 5377 5401 5424 5448 5473 5498 5520 5539 5555 5566 5571 5574 5576 5575 5572 5567 5557 5544 5525 5501 5476
-4860 5476 5451 5424 5401 5385 5375 5376 5383 5392 5404 5416 5425 5432 5433 5429 5420 5401 5377 5351 5323 5297 5271 5245 5219 5196 5176 5163 5153 5144 5137 5132 5131 5135 5140 5145 5150 5158 5165 5173 5180 5193 5205 5218 5230 5241
-4884 5241 5252 5263 5274 5281 5286 5285 5278 5269 5257 5248 5236 5220 5204 5187 5171 5162 5153 5145 5136 5132 5129 5125 5122 5109 5097 5085 5072 5060 5047 5035 5023 5022 5021 5020 5019 5018 5017 5016 5015 5018 5021 5024 5028 5040 5058 5080 5107
-4909E107L1L7L3L5M4M6M4M6N4N3N4N4N4N4N4N4N3N3N6N1M0L6K5J6J1Joj6k4l0l7l9l9m0m0
-4928E925l9l5l4l5l4l1k8k2j7j7j4j5j5j1j0j2j0jLRJ4K2K6L2L7L8L9M1L6K9K4J9J3J3J0
-4947E950J2J0NKmrrj2j2rmKkjNKmrj4k0k6k8k7k7k8k7j9j9k1j7j8j2pjPJ4J0J0POOP%J%J
-4973E671J1J1J1J0J8J7J7J7K8K7K8K7L0L0L1K8K1J6J1ONLLMLKLLmllmlmlmj6j7j6j7j5j6
-4995E967j8j3rmKOJ4J6J6J5J6J6J6J6PMRLkmllllllNMNMJ2RKkj2j5j3j3j5j4j4j4rqrojN
-5022E956%LJ1J0J1J0%J%%llllmjnjJ5K1J5K0L3L6L5L4K4J9K4J9PKOLmmmmmmmnj2j2j2j2k1
-5047F190k2k2k0j7j2kPJ6K5L5M0L9L9M1L8K6K2K5K2J3J1J2J1J2J2J1J1JmJmj7k0j8j8j3j0
-5067F461j4qLQLQK6L0K7K8K0J5K0J5KkKkrj2rj1k0k2k0k1k2j9k4j8jMjLJ6K1J7J9K5K5K6
$$ plain form
-4909 5107 5138 5175 5208 5243 5287 5333 5377 5423 5477 5530 5584 5638 5692 5746 5800 5854 5907 5960 6016 6067 6107 6143 6168 6184 6195 6196 6190 6174 6150 6120 6083 6044 6005 5965 5925
-4928 5925 5886 5851 5817 5782 5748 5717 5689 5667 5650 5633 5619 5604 5589 5578 5568 5556 5546 5545 5548 5557 5571 5593 5619 5651 5688 5726 5765 5806 5842 5871 5895 5914 5927 5940 5950
-4947 5950 5962 5972 5977 5979 5975 5966 5957 5945 5933 5924 5920 5922 5920 5919 5924 5926 5922 5913 5899 5879 5853 5825 5798 5771 5743 5716 5697 5678 5657 5640 5622 5610 5603 5602 5609 5623 5633 5643 5650 5656 5662 5669 5669 5670 5670 5671
-4973 5671 5682 5693 5704 5714 5732 5749 5766 5783 5811 5838 5866 5893 5923 5953 5984 6012 6033 6049 6060 6066 6071 6074 6077 6081 6084 6086 6089 6092 6088 6085 6082 6078 6075 6071 6068 6064 6048 6031 6015 5998 5983 5967
-4995 5967 5949 5936 5927 5923 5925 5931 5945 5961 5977 5992 6008 6024 6040 6056 6063 6067 6076 6079 6077 6073 6070 6067 6064 6061 6058 6055 6060 6064 6069 6073 6085 6094 6096 6094 6082 6067 6054 6041 6026 6012 5998 5984 5975 5967 5958 5952 5951 5956
-5022 5956 5956 5959 5970 5980 5991 6001 6001 6002 6002 6002 5999 5996 5993 5990 5986 5985 5980 5979 5994 6015 6030 6050 6083 6119 6154 6188 6212 6231 6255 6274 6281 6283 6289 6292 6288 6284 6280 6276 6272 6268 6264 6259 6247 6235 6223 6211 6190
-5047 6190 6168 6146 6126 6109 6097 6095 6102 6118 6143 6178 6218 6257 6296 6337 6375 6401 6423 6448 6470 6483 6494 6506 6517 6529 6541 6552 6563 6564 6560 6561 6557 6540 6520 6502 6484 6471 6461
-5067 6461 6447 6439 6442 6450 6453 6461 6487 6517 6544 6572 6592 6607 6627 6642 6644 6642 6644 6642 6633 6621 6612 6601 6581 6559 6539 6518 6496 6477 6453 6435 6434 6438 6437 6440 6456 6477 6494 6513 6538 6563 6589
-5090F589K3J0NJ1NJJJJ%JJ%kjkkj2j3j2j2pppoppppj7j7j7j7j6j6j8j3qJJ0J7K6L2L7M1L8
-5115F601L7L9L7K7J9J1Kqj6k0k5k8k8k9k8j3j3j4j3j3j3j3j3j0rrrrj0rrl%nJJ2J8J3J6K1
-5137F485K1K1K1K2K1K1K1K5K5K5K5K5K5K5K5K6K6K8K5K0J6Nlj0j5k2k4k5k3j7j1qloolol
-5157F794pk2k8k3k6l5l5l6l5k9l0l0k9l0k9l1k8rmj2lJ4J9J5J9L8M3L9M1M0M0L9M0L8L3L0
-5177F771K1J4Jj1k1l4l8l7l6l0k5l1k5j2pj1qOJ0OJ0K9L3L0L2L1L1L3K8J8J2J6J4OLMNKJ
-5198F841JLQJ2K3L2L5M4M9N1N2M7M5L5K5J6Pjj1j5k2k5k5k5k5k6k5k6k6k6j6j4j8j2onnm
-5219F968j7j6j7j6j7j6j7j5pkpjJ7K2J8K0K1K0K3J8jo%oj2j3j5j1KOKOK0K4K0K3K2K1K3K0
-5241G104J2QJ2QJjJjpoqnKNLLJ%%%%%J%KK%LJ1J3J1J2N%NJppqoPJ3QJ3L1L7L2L5M1M0M1M0
$$ plain form
-5090 6589 6612 6622 6627 6638 6643 6644 6645 6646 6647 6647 6648 6649 6649 6647 6646 6644 6642 6630 6617 6605 6593 6586 6579 6572 6566 6559 6552 6545 6538 6521 6504 6487 6470 6454 6438 6420 6407 6399 6400 6410 6427 6453 6485 6522 6563 6601
-5115 6601 6638 6677 6714 6741 6760 6771 6773 6765 6749 6729 6704 6676 6648 6619 6591 6578 6565 6551 6538 6525 6512 6499 6486 6476 6467 6458 6449 6440 6430 6421 6412 6409 6409 6404 6405 6417 6435 6448 6464 6485
-5137 6485 6506 6527 6548 6570 6591 6612 6633 6658 6683 6708 6733 6758 6783 6808 6833 6859 6885 6913 6938 6958 6974 6979 6976 6966 6951 6929 6905 6880 6857 6840 6829 6821 6818 6812 6806 6803 6797 6794
-5157 6794 6787 6765 6737 6714 6688 6653 6618 6582 6547 6518 6488 6458 6429 6399 6370 6339 6311 6302 6298 6286 6283 6297 6316 6331 6350 6388 6431 6470 6511 6551 6591 6630 6670 6708 6741 6771
-5177 6771 6792 6806 6807 6796 6775 6741 6703 6666 6630 6600 6575 6544 6519 6507 6500 6489 6481 6487 6497 6503 6513 6542 6575 6605 6637 6668 6699 6732 6760 6778 6790 6806 6820 6826 6829 6833 6838 6840 6841
-5198 6841 6842 6845 6853 6865 6888 6920 6955 6999 7048 7099 7151 7198 7243 7278 7303 7319 7326 7325 7314 7299 7277 7252 7227 7202 7177 7151 7126 7100 7074 7048 7032 7018 7000 6988 6982 6977 6972 6968
-5219 6968 6951 6935 6918 6902 6885 6869 6852 6837 6830 6828 6821 6820 6837 6859 6877 6897 6918 6938 6961 6979 6978 6972 6972 6966 6954 6941 6926 6915 6917 6923 6925 6931 6951 6975 6995 7018 7040 7061 7084 7104
-5241 7104 7116 7124 7136 7144 7145 7144 7145 7144 7137 7131 7123 7118 7120 7125 7128 7131 7132 7132 7132 7132 7132 7132 7133 7133 7135 7137 7137 7140 7151 7164 7175 7187 7192 7192 7197 7198 7191 7184 7176 7170 7177 7190 7198 7211 7242 7279 7311 7346 7387 7427 7468 7508
-5269G508L6L4K7K2J8J0Kqj7k7l5m2m1m1m4l7k6j7rJJ5K1J9J8J2PJ2Qqj2qj1rj0j1q%K%KJ
-5291G354JK%kmmlllmlnpmpj6j6j6j6k2k2k1k2k1k2k0k1k1j5j2mLJ2K0K9M1M7M4M4L8L2L8
-5314G369L3K4J9K2K0J1J1J1J1J5J6J6J6J5J6J6J6QRRQRQRRJKJKJKJKoonoj6j6j7j6j7j8k0
-5338G595j5mKl%NNMNJ4J7J3J8L0L5K9L5M1M2M2M1L8L3K3J5Nmj3j9j7j7j9j6mKljJ0J3J1J1
-5361G999J1J1J1J2K5K6K5K5J8J2J8J3JmjkjkkjkjjkjkJmj9k5j9k5m3m9m4m7n2n3n4n0m1l4
-5383G627k5j7j2ojLOJ0J7K0K5K8K7K7K8K6L0K5J1NJ1Nqj0j0qmjlljmlkllmkOROQK1K3K2K2
-5409G918K1K2K2K2K2K1K3K1J2J1J1J2RRQJ0J8K0J9J9J7J5J9J3mj1nj0k6k9k8k7k9k7k9k7
-5428H062k1k0k1k1j9k2k0k1j9j6k1j4LQMQK2K6K2K5L3L6L4L4L8L8L9L7K3J8K4J9M%KJKKK
$$ plain form
-5269 7508 7544 7578 7605 7627 7645 7655 7657 7649 7632 7605 7570 7528 7487 7446 7402 7365 7339 7322 7313 7314 7329 7350 7369 7387 7399 7406 7418 7426 7418 7406 7398 7387 7378 7368 7357 7349 7349 7351 7351 7353 7354
-5291 7354 7355 7357 7357 7355 7351 7347 7344 7341 7338 7334 7331 7326 7319 7315 7308 7292 7276 7260 7244 7222 7200 7179 7157 7136 7114 7094 7073 7052 7037 7025 7021 7024 7036 7056 7085 7126 7173 7217 7261 7299 7331 7369
-5314 7369 7402 7426 7445 7467 7487 7498 7509 7520 7531 7546 7562 7578 7594 7609 7625 7641 7657 7665 7674 7683 7691 7700 7708 7717 7726 7727 7729 7730 7732 7733 7735 7736 7738 7732 7726 7721 7715 7699 7683 7666 7650 7633 7615 7595
-5338 7595 7580 7576 7578 7575 7575 7580 7585 7589 7594 7608 7625 7638 7656 7686 7721 7750 7785 7826 7868 7910 7951 7989 8022 8045 8060 8065 8061 8048 8029 8012 7995 7976 7960 7956 7958 7955 7954 7964 7977 7988 7999
-5361 7999 8010 8021 8032 8044 8069 8095 8120 8145 8163 8175 8193 8206 8207 8203 8202 8200 8199 8197 8195 8194 8192 8191 8190 8188 8187 8185 8186 8182 8163 8138 8119 8094 8051 8002 7958 7911 7859 7806 7752 7702 7661 7627
-5383 7627 7602 7585 7573 7567 7566 7569 7575 7585 7602 7622 7647 7675 7702 7729 7757 7783 7813 7838 7849 7854 7865 7870 7862 7852 7842 7834 7830 7829 7826 7823 7822 7818 7815 7813 7810 7807 7803 7801 7807 7816 7822 7830 7851 7874 7896 7918
-5409 7918 7939 7961 7983 8005 8027 8048 8071 8092 8104 8115 8126 8138 8147 8156 8164 8174 8192 8212 8231 8250 8267 8282 8301 8314 8310 8299 8294 8284 8258 8229 8201 8174 8145 8118 8089 8062
-5428 8062 8041 8021 8000 7979 7960 7938 7918 7897 7878 7862 7841 7827 7830 7838 7842 7850 7872 7898 7920 7945 7978 8014 8048 8082 8120 8158 8197 8234 8257 8275 8299 8318 8322 8322 8324 8325 8327 8329 8331
-5449H331Jj2j2j2j2j1j2j3j1jLkLJ5K0J6J9K5K6K6K6K1J9J2QMlj2j9k9l3l0l1k9k4k9k5j1
-5470H202qj0j0j5j6j5j6j5j5j7j4l%l%QRRQJ6J6J5J6J5J6J7J4ROJ0Okkn%J6K2J8K0J9J9K1
-5493H361J7J2OJ1Q%l%krj2j0j0j1j0j1j0MMMMMMMMRQRQ%l%mj2j8j2j7l0l3l2l2l1l1l1l2
-5517H075k0k1k1k1k3k3k3k3j4j1j6j0k%%jj%Kmj3j9j5j7j5j6j5j6j1qkLPJ3K3L2L4M2N3N8
-5539G961O2O5O3O3O4N9N6M7L8K6J5Kqj7k7l3l1l1l3k8k2j2nMJ1J7J3J4RLQNmmmmKJJKJ1J2
-5562H371J2J1J4J3J3J4J3J3J5J2lplpk0k2k1k1j7j4rjPJ5K3L2L9M7N2N4N9N4M6L3J7Krk0
-5583H807l0l5l3l3l0l0l1k8k1j8k1j9j2rj2j0kJj%LLLLMLKNJ0J2J0J3K0K3K0K2K8K8K8K8
-5605H701K8K8K8K7K3J9K4J9OKOLlklllkllllknj1j5j1j6k4k7k6k6k7k5k8k4j0qj0q%LjMK3
$$ plain form
-5449 8331 8332 8320 8308 8296 8284 8273 8261 8248 8237 8236 8239 8237 8240 8255 8275 8291 8310 8335 8361 8387 8413 8434 8453 8465 8473 8477 8474 8462 8443 8414 8381 8351 8320 8291 8267 8238 8213 8202
-5470 8202 8194 8184 8174 8159 8143 8128 8112 8097 8082 8065 8051 8048 8048 8045 8045 8053 8062 8071 8079 8095 8111 8126 8142 8157 8173 8190 8204 8213 8219 8229 8235 8233 8231 8226 8226 8242 8264 8282 8302 8321 8340 8361
-5493 8361 8378 8390 8396 8407 8415 8415 8412 8412 8410 8401 8389 8379 8369 8358 8348 8337 8327 8331 8335 8339 8343 8347 8351 8355 8359 8368 8376 8385 8393 8393 8390 8390 8386 8374 8356 8344 8327 8297 8264 8232 8200 8169 8138 8107 8075
-5517 8075 8055 8034 8013 7992 7969 7946 7923 7900 7886 7875 7859 7849 7847 7847 7847 7846 7845 7845 7847 7843 7830 7811 7796 7779 7764 7748 7733 7717 7706 7698 7696 7699 7706 7719 7742 7774 7808 7850 7903 7961
-5539 7961 8023 8088 8151 8214 8278 8337 8393 8440 8478 8504 8519 8521 8513 8496 8469 8436 8405 8374 8341 8313 8291 8279 8274 8278 8289 8306 8319 8333 8342 8345 8353 8358 8354 8350 8346 8342 8344 8345 8346 8348 8359 8371
-5562 8371 8383 8394 8408 8421 8434 8448 8461 8474 8489 8501 8498 8491 8488 8481 8461 8439 8418 8397 8380 8366 8357 8356 8363 8378 8401 8433 8472 8519 8571 8625 8684 8738 8784 8817 8834 8836 8827 8807
-5583 8807 8777 8742 8709 8676 8646 8616 8585 8557 8536 8518 8497 8478 8466 8457 8445 8435 8433 8434 8433 8433 8436 8439 8442 8445 8449 8452 8454 8459 8469 8481 8491 8504 8524 8547 8567 8589 8617 8645 8673 8701
-5605 8701 8729 8757 8785 8812 8835 8854 8878 8897 8903 8905 8911 8914 8911 8909 8906 8903 8900 8898 8895 8892 8889 8886 8884 8879 8868 8853 8842 8826 8802 8775 8749 8723 8696 8671 8643 8619 8609 8601 8591 8583 8583 8586 8585 8589 8612
-5629H612K8K4K7L0K9K3J6J1Kpj4k4k6k7k4j6j2j6j2KMLLMNMMMMOKoj0pj0j8j9j8j9j2j0j3
-5652H527j0lJl%J1J4J2J2J3J2J2J3J3J0J5Rj5k3j6k1k4k4k6k2roqppooppopoJ1J4J0J4J2
-5675H466J2J2J2J6J7J6J7J6J7J6J7J1J2J2J1J2J2J2J1J4J4J3J4J4J4J3J4OLONMNONJ0J5J0
-5696H912J5K7L2K8L1L8M1L9M0M5M3L7L1K2J6Njnj0j6j9k8l1k8l0l0k9l1k9j9j3k0j3MJ0N
-5715I069J0L0L4L0L3L1L0L1L0L2K6J6Pqj9k6l3l7l7l8l6k3j9k3j9pmpnMOLOJ3J5J4J4J6J1
-5737I170J8J0j6k4j9k2k0k0k3j8plplonlpk1k5k1k4k2k3k4k1rnj0nQJ2J0RJ2J2J1J2J2J2
-5758H895J0J4K9L4K9L4M1M2M3M0K9K4K8K6J6J6J6J6J0PJ0Qjl%koopmKPKOK0K4K1K2K3K1K3
-5781I559K1RPJ0Npj2pj1k2k4k4k2j4j2j5j2nonoNNMNPOPOmmlmooqlQJ3J0J2J8K1J9J9K0J8
$$ plain form
-5629 8612 8640 8664 8691 8721 8750 8773 8789 8800 8802 8795 8781 8757 8731 8704 8680 8664 8652 8636 8624 8626 8630 8633 8636 8640 8645 8649 8653 8657 8661 8667 8669 8663 8653 8646 8636 8618 8599 8581 8562 8550 8540 8527
-5652 8527 8517 8514 8515 8512 8512 8523 8537 8549 8561 8574 8586 8598 8611 8624 8634 8649 8658 8643 8620 8604 8583 8559 8535 8509 8487 8478 8472 8464 8457 8450 8444 8438 8431 8424 8418 8411 8405 8416 8430 8440 8454 8466
-5675 8466 8478 8490 8502 8518 8535 8551 8568 8584 8601 8617 8634 8645 8657 8669 8680 8692 8704 8716 8727 8741 8755 8768 8782 8796 8810 8823 8837 8843 8846 8852 8857 8861 8866 8872 8877 8887 8902 8912
-5696 8912 8927 8954 8986 9014 9045 9083 9124 9163 9203 9248 9291 9328 9359 9381 9397 9402 9401 9396 9386 9370 9351 9323 9292 9264 9234 9204 9175 9144 9115 9096 9083 9063 9050 9054 9064 9069
-5715 9069 9079 9109 9143 9173 9206 9237 9267 9298 9328 9360 9386 9402 9409 9401 9382 9356 9323 9286 9249 9211 9175 9152 9133 9110 9091 9084 9080 9073 9068 9072 9078 9081 9087 9100 9115 9129 9143 9159 9170
-5737 9170 9188 9198 9182 9158 9139 9117 9097 9077 9054 9036 9029 9026 9019 9016 9010 9005 9002 8995 8974 8949 8928 8904 8882 8859 8835 8814 8805 8800 8790 8785 8793 8805 8815 8824 8836 8848 8859 8871 8883 8895
-5758 8895 8905 8919 8948 8982 9011 9045 9086 9128 9171 9211 9240 9264 9292 9318 9334 9350 9366 9382 9392 9399 9409 9417 9416 9413 9413 9411 9405 9399 9392 9388 9390 9397 9399 9405 9425 9449 9470 9492 9515 9536 9559
-5781 9559 9580 9589 9596 9606 9611 9604 9592 9585 9574 9552 9528 9504 9482 9468 9456 9441 9429 9424 9418 9413 9407 9412 9417 9421 9426 9433 9439 9446 9452 9448 9444 9441 9437 9431 9425 9417 9414 9422 9435 9445 9457 9475 9496 9515 9534 9554 9572
-5806I572K2J7LjK%rj0rj0oppoj2j0mKRJ7K7L2L6L8L7L7L6K9K7J8Nmj2k1l0l5l3l3l4l4l5
-5829I604l2k2j8k2j8mkmjjj%jJkKlk2k7k2k7l9m2m1l9l1k3j7mPJ6J9K4K8K7K9K6K1J6K1J5
-5851I391Jmjlkkkkllmllmlmrj3qj3j9j9k2j7oKJ1J9K6L1K9K9K5K5K5K5J5J5J4J5J1J1J2J1
-5875I574J1J1J2J1NONNNONNRQRQJ9J9J8J9J7J6J7J7J5J5J8J3Llj2k1k2k8l3l8l6l9l7l8m4
-5897I550m2l5l0k0j1mOJ5K5L4L9L4L4L7L1K5J6Qjj2k2k4k9k9k6k0j4j2okMJ2J4J4J3OLQL
-5919I592j0j3j2j1n%n%J1J7J4J4RQQRQRQRQRQRQRQRNMOLNNMOJ7K2J7K1J8J9K1J8J2RJ2J0
-5945I962KjKjj3j7j3j6j5j4j7j2lLmLK2K5K4K4K4K4K6K2J6J3J5J2OKOKj1j5j3j3j7j8j7j8
-5967I987j7j7j9j6njnkOROQJ5J7J6J5QLQMqj0rrrrrrppppLNJNJ1J4J2J2J4J1J5J0lonnmn
$$ plain form
-5806 9572 9594 9611 9614 9613 9615 9615 9606 9596 9587 9577 9571 9564 9557 9551 9539 9529 9525 9527 9536 9553 9580 9612 9648 9686 9723 9760 9796 9825 9852 9870 9875 9871 9859 9838 9808 9773 9740 9707 9673 9639 9604
-5829 9604 9572 9550 9532 9510 9492 9488 9486 9482 9481 9480 9479 9479 9478 9479 9477 9479 9476 9454 9427 9405 9378 9339 9297 9256 9217 9186 9163 9146 9142 9149 9165 9184 9208 9236 9263 9292 9318 9339 9355 9376 9391
-5851 9391 9392 9388 9387 9384 9382 9380 9378 9376 9373 9370 9366 9363 9360 9356 9353 9349 9340 9327 9319 9306 9287 9268 9246 9229 9223 9225 9236 9255 9281 9312 9341 9370 9395 9420 9445 9470 9485 9500 9514 9529 9540 9551 9563 9574
-5875 9574 9585 9596 9608 9619 9624 9630 9635 9640 9645 9651 9656 9661 9670 9678 9687 9695 9714 9733 9751 9770 9787 9803 9820 9837 9852 9867 9885 9898 9901 9898 9886 9865 9843 9815 9782 9744 9708 9669 9632 9594 9550
-5897 9550 9508 9473 9443 9423 9412 9408 9414 9429 9454 9488 9527 9561 9595 9632 9663 9688 9704 9712 9711 9699 9677 9653 9624 9595 9569 9549 9535 9523 9517 9515 9519 9531 9545 9559 9572 9578 9581 9589 9592
-5919 9592 9582 9569 9557 9546 9541 9541 9536 9536 9547 9564 9578 9592 9601 9609 9617 9626 9634 9643 9651 9660 9668 9677 9685 9694 9702 9711 9719 9728 9733 9737 9743 9746 9751 9756 9760 9766 9783 9805 9822 9843 9861 9880 9901 9919 9931 9940 9952 9962
-5945 9962 9964 9963 9965 9964 9951 9934 9921 9905 9890 9876 9859 9847 9844 9847 9843 9846 9868 9893 9917 9941 9965 9989 10015 10037 10053 10066 10081 10093 10099 10101 10107 10109 10098 10083 10070 10057 10040 10022 10005 9987
-5967 9987 9970 9953 9934 9918 9913 9912 9907 9905 9911 9920 9926 9934 9949 9966 9982 9997 10005 10008 10016 10020 10012 10002 9993 9984 9975 9966 9957 9948 9941 9934 9927 9920 9923 9928 9929 9934 9945 9959 9971 9983 9997 10008 10023 10033 10030 10024 10019 10014 10010 10005
-5994A0005nnj0j0j0j0%LjLQJ3J9K1K5K4K6K3J8J4QLmrj5j8j5j6j5j5j6j6j6j6j9j8j8j8j4
-6015I904j1n%OJ1J7K1K9L5M1M3M3M3M5M2L8L4K3J4Olnj1ppjkKKLKKKL%nrj5k0k3k8l0l2l5
-6039A0162l5l5l5l8l7l4k9k1j3nMJ3J8K3K8K9K8K8K9K9K9K9K8J8J7J2J2J0RKmj0j6j9k8l4
-6059A0164l8m5m8m2m3m2m2m5m5m2l7l1k6k1j6qnopppqnLQJ1J9K9L3M0M2M1L7L6L3L2L1L1
-6079I974L1L1L1L1L1L4L4L4L5L3L4L3L3K9K3J9J4OJmrj2j4j3j4j4j4j4j4onooNNMNPPPPP
-6102A0400PPPJ5J4J4J4J4J4J5J4J7J7K1K4K7L3L9M1M3M2M0L5K6K1J5J1J0RPJ2J7K2K8L1L1
-6122A1154L2K9K5J4RNjnj1j3j3j2j2j1j2j5j8k3k8l0k9l1k9k4j9j4rnnoj2k6l0k6k9l4l0
-6142A0706k7j8pJJ2J7K1K6L3L5L7M1L9L8M1L8M3L7K8K4K7K5J6J4J8J3kpkpk1k2k2k2j7j7
$$ plain form
-5994 10005 10000 9995 9985 9975 9965 9955 9955 9958 9957 9960 9968 9981 10000 10021 10046 10070 10096 10119 10137 10151 10159 10162 10158 10149 10134 10116 10101 10085 10070 10055 10039 10023 10007 9991 9972 9954 9936 9918 9904
-6015 9904 9893 9888 9888 9894 9905 9922 9943 9972 10007 10048 10091 10134 10177 10222 10264 10302 10336 10359 10373 10379 10376 10371 10360 10353 10346 10345 10343 10345 10347 10350 10352 10354 10356 10359 10359 10354 10345 10330 10310 10287 10259 10229 10197 10162
-6039 10162 10127 10092 10057 10019 9982 9948 9919 9898 9885 9880 9884 9897 9915 9938 9966 9995 10023 10051 10080 10109 10138 10167 10195 10213 10230 10242 10254 10264 10273 10275 10271 10261 10245 10226 10198 10164
-6059 10164 10126 10081 10033 9991 9948 9906 9864 9819 9774 9732 9695 9664 9638 9617 9601 9593 9588 9582 9575 9568 9561 9553 9548 9551 9559 9570 9589 9618 9651 9691 9733 9774 9811 9847 9880 9912 9943 9974
-6079 9974 10005 10036 10067 10098 10129 10163 10197 10231 10266 10299 10333 10366 10399 10428 10451 10470 10484 10490 10491 10487 10478 10466 10452 10439 10425 10411 10397 10383 10369 10363 10358 10352 10346 10351 10356 10360 10365 10372 10379 10386 10393 10400
-6102 10400 10407 10414 10421 10436 10450 10464 10478 10492 10506 10521 10535 10552 10569 10590 10614 10641 10674 10713 10754 10797 10839 10879 10914 10940 10961 10976 10987 10997 11006 11013 11025 11042 11064 11092 11123 11154
-6122 11154 11186 11215 11240 11254 11263 11268 11267 11262 11251 11238 11225 11213 11201 11190 11178 11163 11145 11122 11094 11064 11035 11004 10975 10951 10932 10918 10909 10904 10899 10893 10881 10855 10825 10799 10770 10736 10706
-6142 10706 10679 10661 10654 10655 10667 10684 10705 10731 10764 10799 10836 10877 10916 10954 10995 11033 11076 11113 11141 11165 11192 11217 11233 11247 11265 11278 11276 11269 11267 11260 11239 11217 11195 11173 11156 11139
-6162A1139j8j7j8j8j5k0l2l8l2l7m3m4m5m2l8l3k3j5ojNRNOOPNRMRK5L0K5L0M9N4N1N1N0
-6183A1034M7N1M6L2K7K3J5J2Lqj2k3k7k5k5k2k3k2k2k2k3k2k2j4j4j3j4lmllJJJJJJJJQJ3
-6205A0953PJ2L2L6L1L6M1M1M3L9K7K1K7K2J1OJ1Onj1prj1j1j3qMQMQK0K1K1K1K0K0K0J9J4
-6226A1527J0jrj9k7l7m3m1m1m2l9l6l1k1j2nMJ4K0K9L5L2L2L0L0L2K7J6J0J6J0K%%J%J%%
-6248A1474JjLlk0k6k0k6l1l2k5j7rLJ5K7L2M0M6M7M9M5M1L3K2J3Mkorpqpppppporj7k2j6
-6271A1541k1k9k9l2k6j3qj2qJ1J7J2J5K0K1K0K1K0K1K0K1K2K3K2K3J2J2J2J2MMMNpoooom
-6292A1702qlJ7K1J6K1K9K9K9K9K0J8K1J6KmKmk2k8k4k6k9k8l0k8k1j6k2j6NJ1NJ0J7J8J8
-6313A1747J8J9J9J8J9K8K8K8K8K9K7K2J4Pkj1j7k0k2k2k1k3k2k3k2j2j2j2j2j2j3j2j2LL
$$ plain form
-6162 11139 11121 11104 11086 11068 11053 11033 11001 10963 10931 10894 10851 10807 10762 10720 10682 10649 10626 10611 10605 10604 10609 10618 10623 10629 10635 10642 10647 10656 10660 10669 10694 10724 10749 10779 10828 10882 10933 10984 11034
-6183 11034 11081 11132 11178 11210 11237 11260 11275 11287 11290 11282 11270 11247 11220 11195 11170 11148 11125 11103 11081 11059 11036 11014 10992 10978 10964 10951 10937 10934 10930 10927 10924 10925 10926 10927 10928 10929 10930 10931 10932 10940 10953
-6205 10953 10960 10972 11004 11040 11071 11107 11148 11189 11232 11271 11298 11319 11346 11368 11379 11385 11396 11402 11397 11386 11379 11370 11359 11348 11335 11327 11331 11339 11343 11351 11371 11392 11413 11434 11454 11474 11494 11513 11527
-6226 11527 11537 11536 11527 11508 11481 11444 11401 11360 11319 11277 11238 11202 11171 11150 11138 11133 11137 11151 11171 11200 11235 11267 11299 11329 11359 11391 11418 11434 11444 11460 11470 11472 11472 11472 11473 11473 11474 11474 11474
-6248 11474 11475 11474 11477 11474 11454 11428 11408 11382 11351 11319 11294 11277 11268 11271 11286 11313 11345 11385 11431 11478 11527 11572 11613 11646 11668 11681 11685 11683 11677 11668 11661 11653 11646 11639 11632 11625 11618 11611 11605 11596 11579 11557 11541
-6271 11541 11520 11491 11462 11430 11404 11391 11383 11371 11363 11374 11391 11403 11418 11438 11459 11479 11500 11520 11541 11561 11582 11604 11627 11649 11672 11684 11696 11708 11720 11724 11728 11732 11737 11730 11724 11718 11712 11706 11702
-6292 11702 11694 11691 11708 11729 11745 11766 11795 11824 11853 11882 11902 11920 11941 11957 11959 11955 11957 11953 11931 11903 11879 11853 11824 11796 11766 11738 11717 11701 11679 11663 11668 11679 11684 11694 11711 11729 11747
-6313 11747 11765 11784 11803 11821 11840 11868 11896 11924 11952 11981 12008 12030 12044 12051 12049 12038 12021 12001 11979 11957 11936 11913 11891 11868 11846 11834 11822 11810 11798 11786 11773 11761 11749 11752 11755
-6332A1755LLLKLLkkkkj2j2j2j2l%mKJ3J8J3J7K9K9K8K9K1J5K2J6%mJmj1j3j2j2j2j2j3j1
-6355A1858LQKPJ5J7J4J7K5K6K6K6K4K3K4K3K4K4K3K3J2QJ3Pj1j7j2j5j9k0k0j9mjmjNONN
-6376A2150lolpj2j4j4j2rkPJ5K2K5K3K4J7J2J7J3oj0orpqqqpooqj5j9j7j6j8j7j9j5nJJ1
-6400A2025J8K6L2L7M1M4M4M4M4L9L5L1K3J6Ojj1k0k6l2l5l8m1l9l9m0m0m0m0l0k9l0k9k9
-6418A1916l0k9k9l0k9l0l0l2l3m3m2l6l6l8l3l0k1j4mNJ3K4K9L1L3L3L2L4L3L4L4K0K1K1
-6437A1744K1K1K0K1K1K9K9K9K8K7K2J7J1J1RRJ0QQQQJ1RKkj0j5k0k4k7k7k8k6j9j4rml%k
-6459A1903jj%jjj5j5j5j5j5j6j5j5j3j4j4j3mlllMMMMMLNKkpj2j7j9j9j9j9j7j6j7j6j7j6
-6482A1528j6j7j9k0j9j9j5j3pj%NRJ5J6J7J8J5J1NJnnppomnmmmmmmkkjmlrj4j9k7k9k9k8
$$ plain form
-6332 11755 11758 11761 11764 11766 11769 11772 11770 11768 11766 11764 11752 11740 11728 11716 11713 11713 11709 11711 11724 11742 11755 11772 11801 11830 11858 11887 11908 11923 11945 11961 11961 11957 11958 11954 11943 11930 11918 11906 11894 11882 11869 11858
-6355 11858 11861 11869 11871 11878 11893 11910 11924 11941 11966 11992 12018 12044 12068 12091 12115 12138 12162 12186 12209 12232 12244 12252 12265 12272 12261 12244 12232 12217 12198 12178 12158 12139 12135 12134 12130 12129 12134 12140 12145 12150
-6376 12150 12147 12141 12138 12131 12119 12105 12091 12079 12070 12068 12075 12090 12112 12137 12160 12184 12201 12213 12230 12243 12237 12227 12221 12212 12205 12197 12189 12181 12174 12168 12162 12154 12139 12120 12103 12087 12069 12052 12033 12018 12013 12014 12025
-6400 12025 12043 12069 12101 12138 12179 12223 12267 12311 12355 12394 12429 12460 12483 12499 12505 12504 12493 12473 12447 12415 12380 12342 12301 12262 12223 12183 12143 12103 12063 12033 12004 11974 11945 11916
-6418 11916 11886 11857 11828 11798 11769 11739 11709 11677 11644 11601 11559 11523 11487 11449 11416 11386 11365 11351 11347 11352 11365 11389 11418 11449 11482 11515 11547 11581 11614 11648 11682 11702 11723 11744
-6437 11744 11765 11786 11806 11827 11848 11877 11906 11935 11963 11990 12012 12029 12040 12051 12060 12069 12079 12087 12095 12103 12111 12122 12131 12133 12131 12121 12106 12086 12062 12035 12008 11980 11954 11935 11921 11912 11908 11905 11905 11903
-6459 11903 11902 11901 11901 11900 11899 11884 11869 11854 11839 11824 11808 11793 11778 11765 11751 11737 11724 11720 11717 11714 11711 11715 11719 11723 11727 11731 11734 11739 11741 11739 11732 11720 11703 11684 11665 11646 11627 11610 11594 11577 11561 11544 11528
-6482 11528 11512 11495 11476 11456 11437 11418 11403 11390 11383 11382 11382 11387 11396 11411 11427 11444 11462 11477 11488 11493 11494 11489 11484 11477 11470 11464 11460 11455 11451 11447 11443 11439 11435 11431 11429 11427 11426 11422 11419 11410 11396 11377 11350 11321 11292 11264
-6507A1264k8k8k9k8k6k3j6j2j2o%LOJ0PRJ6K2J7K0K7K7K7K6K7K7K7K7K9K9K9K9J9J9J9J9
-6527A1573J3J4J4J4J4J4J3J4%%J%%%jKJ1J5J3J3J3J3J4J3QQJ0Pjpj1j6k5k9l4l9m2m2m2m3
-6549A1492l0l0l0l1l0l0l0l1j8j8k0j6j1oj0pmmlmNQMRK4K8K4K7K5K5K7K3K3J8J3QMjj1k0
-6570A1392k4k9k6k6k9k7l0k6j6j4j5j5j5j5j5j5j5j6j7j4qlpmJJLjoj2oj1k4k8k6k6k6k6
-6591A0784k6k7j9j8j9j9rrqrmnmmmmpjJ1J6J1J6K8L3L1L0L1L2L1L2K1K1K1K1K4K3K3K4L3
-6612A1101L4L4L4L6L6L6L6L6L6L6L6K2J9K3J8PJOJj3j9j6j6j7j6j7j6k4k7k2k8l9m5m0m3
-6631A1190n0n0n0m9m2l7m3l7k2j6k2j7KPKPJ4J4J5J3Lnj4k2k7l6m0m4m7m8m8m7m6m3m6m2
-6651A0277l3k5j6qjPJ1J6J9J9J9K0J0J0J0J0j%%jQPPPPPPPKlLlk1k6k4k3k1j6k3j4PJ6RJ4
$$ plain form
-6507 11264 11236 11208 11179 11151 11125 11102 11086 11074 11062 11056 11056 11059 11065 11075 11082 11091 11107 11129 11146 11166 11193 11220 11247 11273 11300 11327 11354 11381 11410 11439 11468 11497 11516 11535 11554 11573
-6527 11573 11586 11600 11614 11628 11642 11656 11669 11683 11683 11683 11684 11684 11684 11684 11683 11685 11696 11711 11724 11737 11750 11763 11777 11790 11798 11806 11816 11823 11822 11815 11804 11788 11763 11734 11700 11661 11619 11577 11535 11492
-6549 11492 11462 11432 11402 11371 11341 11311 11281 11250 11232 11214 11194 11178 11167 11161 11151 11144 11140 11136 11133 11129 11134 11142 11146 11155 11179 11207 11231 11258 11283 11308 11335 11358 11381 11399 11412 11420 11424 11423 11412 11392
-6570 11392 11368 11339 11313 11287 11258 11231 11201 11175 11159 11145 11130 11115 11100 11085 11070 11055 11040 11024 11007 10993 10985 10982 10975 10971 10972 10973 10976 10975 10969 10957 10951 10940 10916 10888 10862 10836 10810 10784
-6591 10784 10758 10731 10712 10694 10675 10656 10647 10638 10630 10621 10617 10612 10608 10604 10600 10596 10589 10588 10599 10615 10626 10642 10670 10703 10734 10764 10795 10827 10858 10890 10911 10932 10953 10974 10998 11021 11044 11068 11101
-6612 11101 11135 11169 11203 11239 11275 11311 11347 11383 11419 11455 11491 11513 11532 11555 11573 11580 11581 11587 11588 11575 11556 11540 11524 11507 11491 11474 11458 11434 11407 11385 11357 11318 11273 11233 11190
-6631 11190 11140 11090 11040 10991 10949 10912 10869 10832 10810 10794 10772 10755 10757 10764 10766 10773 10787 10801 10816 10829 10832 10827 10813 10791 10764 10728 10688 10644 10597 10549 10501 10454 10408 10365 10319 10277
-6651 10277 10244 10219 10203 10195 10194 10201 10212 10228 10247 10266 10285 10305 10315 10325 10335 10345 10344 10344 10344 10343 10351 10358 10365 10372 10379 10386 10393 10400 10402 10399 10402 10399 10378 10352 10328 10305 10284 10268 10245 10231 10238 10254 10263 10277
-6675A0277K1K1K1K2J1J1J1J1JkKkj5k0j5j9k0k1k0k1k1k1k0k1j4j5j4j5j5j3j7j1OJ2PJ0
-6695A0092RRJ1Oj1j6j3j5j3j4j6j1n%klkkkkqpqomMJ3K1K3K6K5K5K6K6K6K7K0K0J9K0J1Q
-6718A0307J2Pkmlmj3j5j3j4rj0j2pjJ%%lnkoj4j4j5j4j2j1j2j1j2j1j2j1k5k6k5k6k5k6k5
-6740I877k6l3l4l4l4l4l3l4l4k8k7k8k8j8j6k0j4jNjNJ8K0J9J9POPPOPPPJ5J7J4J9L0L6L2
-6762I703L3K6K2K9K0MkJJQJ1PJ0QQROJoj5k2l1l5l3l3k9k6k9k7j8j6j9j6okpkONPNqj3rj1
-6786I515j1qj3qJ1J8J2J6K4K4K6K3J2J0J2J0KjKjj5j8j5j8k7k6k7k7k5k6k6k4j1nj1oJ3J9
-6807I400J4J7J6J5J8J3Jm%lj8k0j7k1k8l2l0l0l2k8l3k8j4j1j2j3j0j3j1j2j5j1o%J2K1L4
-6827I109M6N3O2O7O9P0O7O2N6M7M0L6L0K3J6J2Ojpj1j7j9k0j9k0j4j3j4j4k3k6k2k6l5l7
$$ plain form
-6675 10277 10298 10319 10340 10362 10373 10384 10395 10406 10407 10405 10407 10405 10390 10370 10355 10336 10316 10295 10275 10254 10233 10212 10192 10171 10157 10142 10128 10113 10098 10085 10068 10057 10063 10075 10082 10092
-6695 10092 10101 10110 10121 10127 10116 10100 10087 10072 10059 10045 10029 10018 10013 10013 10011 10008 10006 10004 10002 10000 9992 9985 9977 9971 9967 9971 9984 10005 10028 10054 10079 10104 10130 10156 10182 10209 10229 10249 10268 10288 10299 10307
-6718 10307 10319 10326 10324 10320 10317 10313 10300 10285 10272 10258 10249 10239 10227 10220 10219 10220 10220 10220 10217 10212 10210 10204 10190 10176 10161 10147 10135 10124 10112 10101 10089 10078 10066 10055 10030 10004 9979 9953 9928 9902 9877
-6740 9877 9851 9818 9784 9750 9716 9682 9649 9615 9581 9553 9526 9498 9470 9452 9436 9416 9402 9401 9406 9405 9410 9428 9448 9467 9486 9493 9499 9506 9513 9519 9526 9533 9540 9555 9572 9586 9605 9635 9671 9703
-6762 9703 9736 9762 9784 9813 9833 9837 9835 9836 9837 9845 9856 9863 9873 9881 9889 9898 9904 9905 9899 9884 9862 9831 9796 9763 9730 9701 9675 9646 9619 9601 9585 9566 9550 9544 9542 9535 9533 9539 9544 9551 9556 9548 9535 9526 9515
-6786 9515 9504 9496 9483 9475 9486 9504 9516 9532 9556 9580 9606 9629 9641 9651 9663 9673 9675 9674 9676 9675 9660 9642 9627 9609 9582 9556 9529 9502 9477 9451 9425 9401 9390 9385 9374 9368 9381 9400
-6807 9400 9414 9431 9447 9462 9480 9493 9494 9490 9490 9487 9469 9449 9432 9411 9383 9351 9321 9291 9259 9231 9198 9170 9156 9145 9133 9120 9110 9097 9086 9074 9059 9048 9042 9042 9054 9075 9109
-6827 9109 9155 9208 9270 9337 9406 9476 9543 9605 9661 9708 9748 9784 9814 9837 9853 9865 9871 9870 9863 9852 9835 9816 9796 9777 9757 9743 9730 9716 9702 9679 9653 9631 9605 9570 9533
-6846I533l5l7m6m7m5m8n0n1n3m7l4k5j7rJOMLnnnoopopopopqqrqqqqrj5j6j6j6j5j6j6j6
-6871H738k4k4k4k4k1j7j1oJOJ1J6J8J8J8J7J3PKlrj4j2j1nnmnnnmpj0j4k0k4k5l1l5m0m1
-6894H385m0m4l8l3k8k3j7qlpmnmnmNONOJ5J5J5J5J4J0M%rrj0rjjjjjjjjlljoj2j7k2k7l5
-6920H061l9l7l7l8l7l8l8l6l6l6l6l5l5l7l3k8k4j9j3nJLJ3K2L1L9M8N5O1N7N8O1N6N3M5
-6939H027L0K2J3N%mrj5j7j8j8j7j5j4j5j4j4j5j4j5k0k1k0k1j8j4qmKJLKKLLKqrrrj9j9j9
-6962G683j9j3j3j4j3llllNONNJ1J7K6L5M2N1N7N6N4M9M1K8J0KPNLOJPJ5K1J7J8J9J7K1J5
-6985H271mj0mrk2k7k1k6l9m2m0m1m0m1m1m0l0l0l0l0l1k9l2k8j0mj0nQJ1RJ0MJN%j7k6j8
-7006G542k3k7k4k9k4n%mj%%J%rj2pj3k1k6k3k3k5k2k7k1rmpoMMMMLLMLJ3J4J3J4K3K3K4K3
$$ plain form
-6846 9533 9498 9461 9415 9368 9323 9275 9225 9174 9121 9074 9040 9015 8998 8989 8990 8996 9000 9003 8998 8993 8988 8982 8976 8969 8963 8956 8950 8943 8937 8930 8922 8914 8905 8897 8889 8881 8873 8864 8849 8833 8817 8801 8786 8770 8754 8738
-6871 8738 8714 8690 8666 8642 8621 8604 8593 8587 8588 8594 8605 8621 8639 8657 8675 8692 8705 8712 8714 8711 8702 8688 8676 8665 8660 8655 8651 8646 8641 8636 8632 8625 8615 8601 8581 8557 8532 8501 8466 8426 8385
-6894 8385 8345 8301 8263 8230 8202 8179 8162 8154 8151 8144 8140 8135 8131 8126 8122 8127 8133 8138 8144 8159 8174 8189 8204 8218 8228 8232 8232 8223 8214 8204 8195 8194 8193 8192 8191 8190 8189 8188 8187 8184 8181 8180 8174 8162 8145 8123 8096 8061
-6920 8061 8022 7985 7948 7910 7873 7835 7797 7761 7725 7689 7653 7618 7583 7546 7513 7485 7461 7442 7429 7424 7425 7428 7441 7463 7494 7533 7581 7636 7697 7754 7812 7873 7929 7982 8027
-6939 8027 8057 8079 8092 8097 8097 8093 8084 8069 8052 8034 8016 7999 7984 7970 7955 7941 7927 7912 7898 7883 7863 7842 7822 7801 7783 7769 7761 7757 7759 7760 7763 7765 7767 7770 7773 7775 7767 7758 7749 7740 7721 7702 7683
-6962 7683 7664 7651 7638 7624 7611 7608 7605 7602 7599 7604 7610 7615 7620 7631 7648 7674 7709 7751 7802 7859 7915 7969 8018 8059 8087 8097 8099 8106 8111 8114 8120 8121 8128 8143 8164 8181 8199 8218 8235 8256 8271
-6985 8271 8267 8257 8253 8244 8222 8195 8174 8148 8109 8067 8027 7986 7946 7905 7864 7824 7794 7764 7734 7704 7673 7644 7612 7584 7574 7570 7560 7555 7563 7574 7583 7593 7597 7598 7603 7603 7586 7560 7542
-7006 7542 7519 7492 7468 7439 7415 7410 7410 7406 7405 7405 7405 7406 7406 7397 7385 7378 7365 7344 7318 7295 7272 7247 7225 7198 7177 7168 7164 7157 7151 7155 7159 7163 7167 7170 7173 7177 7180 7193 7207 7220 7234 7257 7280 7304 7327
-7030G327K3K3K4K2QLPMOONNJ1J0J0J0J1RJ2Qrj4qj4k1k1k2k1j3j3j3j3llkl%JJ%J%J%j0r
-7055G336j0rjKkMJ7K2K0J9K6K3J7J2Mnj3k1l1l5m3m4m3m3m5m1m1l5l2k4j6qLQJ2J2J5RMm
-7077G019j4k0k8l4l0l3l2l1l2l2l1l0l2l0k2j8pJPJ7J9K4K5K4K4K5K5K5K5K5J8J6J9J5Ll
-7097F897J%MMNMJ4J5J4J5K1K1K1K1L1L1L2L1L6L6L8L5K1J7K2J6kpkpk6l1k6l1m0l9m0m0m1
-7118G071l8m2l8k4k0k4k1j3j0j2j2poooMMMMKKLKqqqqnnnoNONNJ1J1J1J1JJJJll%nj3k1k9
-7145F759l7m8m9n0m7l6l0l5l1k1j7k0j8rrrqj0j1j0j0j0j0j0j0j4j3j5j2JOJOK2K7K2K6L3
-7166F294L5L3L4L5L2K7J9J3Moj2j6j6j6j7ppqpj5j9j4j9k7k6k8k7k0k1k1k1j0j1j0j1mmm
-7187F102mmmmmj2j1j2j2j2j1j2j2j4j3j4j3lmllLMNKmrnpj3j2j3j3lkklLMLLnj0nrj9k4k2
$$ plain form
-7030 7327 7350 7373 7397 7419 7427 7430 7437 7441 7447 7453 7458 7463 7474 7484 7494 7504 7515 7524 7536 7544 7535 7521 7513 7499 7478 7457 7435 7414 7401 7388 7375 7362 7359 7356 7354 7351 7351 7352 7353 7353 7354 7354 7355 7355 7345 7336
-7055 7336 7326 7317 7316 7318 7316 7320 7337 7359 7379 7398 7424 7447 7464 7476 7480 7475 7462 7441 7410 7375 7332 7288 7245 7202 7157 7116 7075 7040 7008 6984 6968 6960 6963 6971 6983 6995 7010 7019 7023 7019
-7077 7019 7005 6985 6957 6923 6893 6860 6828 6797 6765 6733 6702 6672 6640 6610 6588 6570 6563 6564 6571 6588 6607 6631 6656 6680 6704 6729 6754 6779 6804 6829 6847 6863 6882 6897 6900 6897
-7097 6897 6898 6898 6902 6906 6911 6915 6929 6944 6958 6973 6994 7015 7036 7057 7088 7119 7151 7182 7218 7254 7292 7327 7348 7365 7387 7403 7401 7394 7392 7385 7359 7328 7302 7271 7231 7192 7152 7112 7071
-7118 7071 7033 6991 6953 6929 6909 6885 6864 6851 6841 6829 6817 6810 6804 6798 6792 6796 6800 6804 6808 6810 6812 6815 6817 6809 6801 6793 6785 6780 6775 6770 6764 6769 6775 6780 6785 6796 6807 6818 6829 6830 6831 6832 6833 6830 6827 6827 6822 6809 6788 6759
-7145 6759 6722 6674 6625 6575 6528 6492 6462 6427 6396 6375 6358 6338 6320 6311 6302 6293 6285 6275 6264 6254 6244 6234 6224 6214 6204 6190 6177 6162 6150 6151 6157 6158 6164 6186 6213 6235 6261 6294
-7166 6294 6329 6362 6396 6431 6463 6490 6509 6522 6526 6520 6508 6492 6476 6460 6443 6436 6429 6421 6414 6399 6380 6366 6347 6320 6294 6266 6239 6219 6198 6177 6156 6146 6135 6125 6114 6110 6106 6102
-7187 6102 6098 6094 6090 6086 6082 6070 6059 6047 6035 6023 6012 6000 5988 5974 5961 5947 5934 5931 5927 5924 5921 5924 5928 5933 5935 5931 5922 5917 5910 5897 5885 5872 5859 5856 5854 5852 5849 5852 5856 5859 5862 5857 5847 5842 5833 5814 5790 5768
-7213E768k1k3k0k4k0nknkJ2J6J2J5K3K3K4K4K3K4K3K4K3K3K3K3K3K3K3K3J7J7J8J4Pkj1j8
-7233F115k2k4k3k4k4k5k4k5j6j3j7j2%MJLLLMLornrk4k7k4k6k5k5k6k5j9k0j9j9rrrrKKK
-7256E549KJKLJrj3qj4k5l0k6k9k8k6l0k4ojojJ8K2K0K1K1J9K3J8PNPMlnmnj2j4j2j3j3j3
-7280E373j3j3j7j8j7j8j7j8j7j8j7j8j8j6j0nqplmmlj4j4j4j4j1qj2qORORJ0J3J2J1J8J5
-7302E108RLlj3k0k9l1l6m2m4m6m2l8k9k2j0KJ5K4L3L8M1M1L9L3K8K1J6J1Okqj3j6j8j8j8
-7322D970j8j9j9j8j9j4j1j5j0JPLNJ4J6J3J6J5J4J5J5LMMLMLLMrj2pj3j9k1k0k0l0l0l0k9
-7344D749l0l0l0k9k8k3k8k3mKnJPRQQRQQRJJJJ%JK%j1j7j0j6k4k3k4k4j8j8j8j8j8j8j8j8
-7368D302k2k2k3k2k1k2k4j9jMjMJ2J1J4J0qj3pj2j5j4okkPJ7K2L3L6L4L4K9K4K9K4J2PJ2
$$ plain form
-7213 5768 5747 5724 5704 5680 5660 5655 5653 5648 5646 5658 5674 5686 5701 5724 5747 5771 5795 5818 5842 5865 5889 5912 5935 5958 5981 6004 6027 6050 6073 6090 6107 6125 6139 6146 6144 6133 6115
-7233 6115 6093 6069 6046 6022 5998 5973 5949 5924 5908 5895 5878 5866 5866 5870 5871 5874 5877 5880 5884 5887 5881 5872 5867 5858 5834 5807 5783 5757 5732 5707 5681 5656 5637 5617 5598 5579 5570 5561 5552 5543 5545 5547 5549
-7256 5549 5551 5552 5554 5557 5558 5549 5536 5528 5514 5489 5459 5433 5404 5376 5350 5320 5296 5290 5289 5283 5282 5300 5322 5342 5363 5384 5403 5426 5444 5451 5456 5463 5467 5464 5459 5455 5450 5438 5424 5412 5399 5386 5373
-7280 5373 5360 5347 5330 5312 5295 5277 5260 5242 5225 5207 5190 5172 5154 5138 5128 5123 5115 5108 5105 5101 5097 5094 5080 5066 5052 5038 5027 5019 5007 4999 5005 5014 5020 5029 5039 5052 5064 5075 5093 5108
-7302 5108 5117 5120 5117 5104 5084 5055 5024 4988 4946 4902 4856 4814 4776 4747 4725 4715 4717 4732 4756 4789 4827 4868 4909 4948 4981 5009 5030 5046 5057 5063 5061 5053 5040 5024 5006 4988 4970
-7322 4970 4952 4933 4914 4896 4877 4863 4852 4837 4827 4828 4835 4838 4843 4857 4873 4886 4902 4917 4931 4946 4961 4964 4968 4972 4975 4979 4982 4985 4989 4980 4968 4961 4948 4929 4908 4888 4868 4838 4808 4778 4749
-7344 4749 4719 4689 4659 4630 4602 4579 4551 4528 4524 4526 4521 4522 4529 4538 4546 4554 4563 4571 4579 4588 4589 4590 4591 4592 4592 4593 4595 4595 4584 4567 4557 4541 4517 4494 4470 4446 4428 4410 4392 4374 4356 4338 4320 4302
-7368 4302 4280 4258 4235 4213 4192 4170 4146 4127 4126 4130 4129 4133 4145 4156 4170 4180 4172 4159 4152 4140 4125 4111 4105 4103 4101 4108 4125 4147 4180 4216 4250 4284 4313 4337 4366 4390 4402 4409 4421
-7389D421Poj1pj0qrrqrqrqj9j9j8j9j5j5j4j5mnmnjjkkj0j4rj4k1k4k2k2j4rj5j0MQLQK2
-7415D029K4K3K2K1J9K2J8NJMKlnmmj4j4j5j4j3j4j6j1%OJOJ6J9J6J9K7K9K8K7K7K6K8K5J9
-7436D382J4J9J3Jn%nj7k2j7k2l2l5l4l3k6k1k6k1pjmmlmlmppj0nOJ1PQJ4Qkj1j8k9l8m3m6
-7460C921m7m0l2k6j3%QJ5K0J7J7K1J8K1J7LjLkj4j8j5j7j7j7j7j6j8j6j8j6ompmNNNNknj
-7483C712nj2j4j3j4j4j2j6j1JOJOJ6J9J8J8J8J8J8J9J8J9J8J8RPJ0Oj0j4j0j3j2j2j3j0l
-7504C767%kjjkk%J1J5J1J4K2K4K3K3K3K3K5K1J5J1J5J1OLPKj1j4j1j4j5j5j5j5j6j3j7j3
-7525C895JNJNJ7K0J9J8K0J6Nlj2k2l1l7l9l8m1l7k6k0k6k1j4j4j3j5k1k7k3k3k0j4k2j3M
-7545C454QMRK4K7K4K7K6K5K6K5J8J3K0J2oj0nj1j7j8j8j7qpqqj2j4j1j5k2k4k3k4j6j6j6
$$ plain form
-7389 4421 4428 4422 4411 4404 4394 4386 4377 4368 4360 4351 4343 4334 4326 4307 4288 4270 4251 4236 4221 4207 4192 4188 4183 4179 4174 4173 4172 4170 4168 4158 4144 4135 4121 4100 4076 4054 4032 4018 4009 3994 3984 3988 3996 3999 4007 4029
-7415 4029 4053 4076 4098 4119 4138 4160 4178 4183 4184 4188 4190 4187 4182 4178 4174 4160 4146 4131 4117 4104 4090 4074 4063 4063 4069 4070 4076 4092 4111 4127 4146 4173 4202 4230 4257 4284 4310 4338 4363 4382
-7436 4382 4396 4415 4428 4429 4424 4424 4419 4402 4380 4363 4341 4309 4274 4240 4207 4181 4160 4134 4113 4106 4105 4101 4097 4094 4090 4087 4083 4076 4069 4059 4054 4060 4071 4078 4086 4100 4108 4106 4095 4077 4048 4010 3967 3921
-7460 3921 3874 3834 3802 3776 3763 3763 3771 3786 3806 3823 3840 3861 3879 3900 3917 3920 3919 3922 3920 3906 3888 3873 3856 3839 3822 3805 3789 3771 3755 3737 3721 3715 3711 3704 3700 3705 3710 3715 3720 3718 3713 3712
-7483 3712 3707 3695 3681 3668 3654 3640 3628 3612 3601 3602 3608 3609 3615 3631 3650 3668 3686 3704 3722 3740 3759 3777 3796 3814 3832 3841 3848 3858 3864 3854 3840 3830 3817 3805 3793 3780 3770 3767
-7504 3767 3767 3765 3764 3763 3761 3759 3759 3770 3785 3796 3810 3832 3856 3879 3902 3925 3948 3973 3994 4009 4020 4035 4046 4052 4055 4062 4064 4053 4039 4028 4014 3999 3984 3969 3954 3938 3925 3908 3895
-7525 3895 3896 3901 3902 3907 3924 3944 3963 3981 4001 4017 4022 4019 4007 3985 3954 3917 3878 3840 3799 3762 3736 3716 3690 3669 3655 3641 3628 3613 3592 3565 3542 3519 3499 3485 3463 3450 3454
-7545 3454 3462 3466 3475 3499 3526 3550 3577 3603 3628 3654 3679 3697 3710 3730 3742 3736 3726 3721 3710 3693 3675 3657 3640 3632 3625 3617 3609 3597 3583 3572 3557 3535 3511 3488 3464 3448 3432 3416
-7566C416j6j7j6j6j6rrqrKJKKLLMLMLJPK0K6K0K6L8M1M0M0L3K9L4K9J0MJ2Lj8k6k0k5l6m2
-7589C573l9l9m0m1m0m0m1m0m0m0k6k6k5k6k6k5k6k6k7k8k7k8k7k7k6k7j8j3j1jNJ4K2L0L6
-7609B814L8L9L6K4J9K4J9J0PQQRQQQJ6J7J6J6QMQMpj0rrJKJJRQQQQRQQPOPPOPPNrj5rj4k7
-7637C182l1k6l2l8l9m1l7k7j9j3%J4K5L3M0M3M5M7M1L7K9K1J2LJKKPPPOknjoj9k4j9k4l1
-7659C170l2l2l2k2k2k3k2k1k4j9k5m2m6m2m5m4m4m4m4l8l8l8l8l0k4l1k5pkpkJ0J5J2J3K1
-7678B336K3K0K3L2L2L2L2L8L8L9L8L5K9K5K0J0Knj7k8l7m2m4m4m2l7k9k3j5mJQJ3J1J0J2
-7698B492J2J2J2J0J0RJ1K5L0K4L0L8L9L8L9L1K6L1K6J0NJ1Noj1qqj1rmNJ7K7L6M2M2M2M5
-7719C175M0L3K4J6Qmrj6j8j2j3j2j3j5j5j5j5k5k5k5k6k9k9k9k9k9k9k9k9k1j6k4j5QJ5R
$$ plain form
-7566 3416 3400 3383 3367 3351 3335 3326 3317 3309 3300 3302 3303 3305 3307 3310 3313 3317 3320 3324 3327 3328 3335 3355 3381 3401 3427 3465 3506 3546 3586 3619 3648 3682 3711 3721 3725 3737 3740 3722 3696 3676 3651 3615 3573
-7589 3573 3534 3495 3455 3414 3374 3334 3293 3253 3213 3173 3147 3121 3096 3070 3044 3019 2993 2967 2940 2912 2885 2857 2830 2803 2777 2750 2732 2719 2708 2707 2712 2726 2748 2778 2814
-7609 2814 2852 2891 2927 2951 2970 2994 3013 3023 3030 3038 3046 3055 3063 3071 3079 3095 3112 3128 3144 3152 3156 3164 3168 3161 3151 3142 3133 3134 3136 3137 3138 3147 3155 3163 3171 3179 3188 3196 3204 3211 3217 3224 3231 3237 3244 3251 3256 3247 3232 3223 3209 3182
-7637 3182 3151 3125 3093 3055 3016 2975 2938 2911 2892 2879 2879 2893 2918 2951 2991 3034 3079 3126 3167 3204 3233 3254 3266 3269 3270 3272 3274 3281 3288 3295 3301 3299 3294 3293 3287 3268 3244 3225 3201 3170
-7659 3170 3138 3106 3074 3052 3030 3007 2985 2964 2940 2921 2896 2854 2808 2766 2721 2677 2633 2589 2545 2507 2469 2431 2393 2363 2339 2308 2283 2276 2274 2267 2265 2275 2290 2302 2315 2336
-7678 2336 2359 2379 2402 2434 2466 2498 2530 2568 2606 2645 2683 2718 2747 2772 2792 2802 2804 2799 2782 2754 2717 2675 2631 2587 2545 2508 2479 2456 2441 2437 2438 2446 2459 2470 2480 2492
-7698 2492 2504 2516 2528 2538 2548 2557 2568 2593 2623 2647 2677 2715 2754 2792 2831 2862 2888 2919 2945 2955 2960 2971 2976 2970 2959 2951 2943 2932 2923 2919 2924 2941 2968 3004 3046 3088 3130 3175
-7719 3175 3215 3248 3272 3288 3296 3292 3283 3267 3249 3237 3224 3212 3199 3184 3169 3154 3139 3114 3089 3064 3038 3009 2980 2951 2922 2893 2864 2835 2806 2785 2769 2745 2730 2738 2753 2762
-7738B762J3J5J5J8J2Jm%kj4j3j3j4j3j4j4j2m%mjPJ0PQJ0OJ1Oqj0qrroqpLLLKjjjjj%lJO
-7765B724RPQROJ0Nrj4j1j2j3j0j5rJ1J6J1J5L0L1L0L1K6K3K6K4J6J3J6J3LJMJKKLJj5j6j4
-7788B989j7j5j5j6j5j7j7j6j7j7j6j8j5%MJLKJM%mqonpoooooopoopnLOMNMNNMlkklkklkL
-7818B716LLMpoponkMJ0RJ5K1K3J9K0K2J7J1OJnj4k0k6k8k2k1k3k0k1j6j1o%NLKOOOOOOOO
-7843B696j1j1j1j1j1j2j2j1j8k3k7l3l8m3m1m0m0l5l2k4j8j3pmlllllkkkmmmmmlmmKLKLK
-7868B130LKL%%J%J1J0J1J1J1J2J3J0Llqj1mlpjMRJ4J9K2K1K2K2K1K2K2K1J5J3OJnj0orj0
-7892B408j0j1qjMRJ4K1K6K4K3K1J6J3Mmj4k1l1l7m3m0m0l9l3k9k4j6j1o%OJ1J8K0J4J3J4
-7913B261J4RQRRkkkjqqqqqqqqk0k1k1k0l0l1l0l0k4j8j4rkMRJ3K0K0K0K0J0J0J1J0LLML%
$$ plain form
-7738 2762 2775 2790 2805 2823 2835 2836 2832 2832 2830 2816 2803 2790 2776 2763 2749 2735 2723 2719 2719 2715 2714 2721 2731 2738 2746 2756 2762 2773 2779 2771 2761 2753 2744 2735 2729 2721 2714 2717 2720 2723 2725 2724 2723 2722 2721 2720 2720 2717 2718 2724
-7765 2724 2733 2740 2748 2757 2763 2773 2778 2769 2755 2744 2732 2719 2709 2694 2685 2696 2712 2723 2738 2768 2799 2829 2860 2886 2909 2935 2959 2975 2988 3004 3017 3020 3021 3025 3026 3028 3030 3033 3034 3019 3003 2989
-7788 2989 2972 2957 2942 2926 2911 2894 2877 2861 2844 2827 2811 2793 2778 2778 2782 2783 2786 2788 2789 2793 2793 2789 2781 2775 2770 2763 2757 2751 2745 2739 2733 2727 2720 2714 2708 2701 2696 2699 2705 2709 2714 2718 2723 2728 2732 2729 2727 2725 2722 2720 2718 2715 2713 2716
-7818 2716 2719 2722 2726 2719 2713 2706 2700 2695 2693 2697 2707 2716 2731 2752 2775 2794 2814 2836 2853 2864 2870 2871 2866 2852 2832 2806 2778 2756 2735 2712 2692 2671 2655 2644 2638 2638 2643 2646 2648 2654 2660 2666 2672 2678 2684 2690 2696
-7843 2696 2685 2674 2663 2652 2641 2629 2617 2606 2588 2565 2538 2505 2467 2424 2383 2343 2303 2268 2236 2212 2194 2181 2174 2170 2167 2164 2161 2158 2155 2153 2151 2149 2145 2141 2137 2133 2129 2126 2122 2118 2120 2123 2125 2128 2130
-7868 2130 2133 2135 2138 2138 2138 2139 2139 2150 2160 2171 2182 2193 2205 2218 2228 2231 2228 2220 2209 2205 2202 2195 2194 2198 2207 2221 2240 2262 2283 2305 2327 2348 2370 2392 2413 2428 2441 2447 2448 2443 2433 2427 2418 2408
-7892 2408 2398 2387 2379 2378 2382 2391 2405 2426 2452 2476 2499 2520 2536 2549 2553 2549 2535 2514 2483 2446 2403 2363 2323 2284 2251 2222 2198 2182 2171 2165 2165 2171 2182 2200 2220 2234 2247 2261
-7913 2261 2275 2284 2292 2301 2310 2308 2306 2304 2303 2295 2287 2279 2271 2263 2255 2247 2239 2219 2198 2177 2157 2127 2096 2066 2036 2012 1994 1980 1971 1969 1973 1982 1995 2015 2035 2055 2075 2085 2095 2106 2116 2119 2122 2126 2129 2129
-7938B129lrj4j8k1k0k0j9k0k1j8j2o%Kmmnmnnnoj5j6j5j5j4j4j4j3j4j4j4j2MRMRK3K4K4
-7961A819K4K7K7K7K7J6J7J7J6J0RRJ0RRJ0RMMMMMMNMoooonoooPOPOPOOPK5K6K6K5K6K5K7
-7987B310K4J5J0J6J0lnloj7k2j7k2k8k7l1k5j7rOJ5K6L2L8M0L4L1L5L0K4J9J3Q%rj9k3k9
-8007B424l0k9l0k4j9k5j9pmmnqppppppqk1k5k0k6l8m1l9m0k9k4l0k5j8j6j6j7j6j6j6j5k7
-8029A655k6k6k6k2k3k5k0q%J3K5L1L7M5M5M8M4L9L3L0K6K0J5PKlrj0j4j1j2qkQJ6K2K8K5
-8050A969K6K7K2J2Ljj0k0k5k9l1l1k9k8k3j4mKQNM%o%oj1j4j4j3j1j1j2j1jjjjJ%JJ%JJJ
-8074A726mllmllmlnonnNNNNLMLMLMLMmlmlmlmlj5j5j5j5k0k0k1j9j0orpKKKLLLLMLLLMkk
-8106A557jkpoppooooNMNMNMNNj%j%klkkqpqpj7j7j6j7j6j7j9j3kNkMJ1J2J2J1LKLKKLKLJ2
$$ plain form
-7938 2129 2126 2117 2103 2085 2064 2044 2024 2005 1985 1964 1946 1934 1928 1928 1930 1926 1922 1917 1913 1908 1903 1898 1892 1877 1861 1846 1831 1817 1803 1789 1776 1762 1748 1734 1722 1726 1735 1739 1748 1771 1795 1819
-7961 1819 1843 1870 1897 1924 1951 1967 1984 2001 2017 2027 2036 2045 2055 2064 2073 2083 2092 2096 2100 2104 2108 2112 2116 2121 2125 2119 2113 2107 2101 2096 2090 2084 2078 2085 2091 2098 2104 2111 2117 2123 2130 2155 2181 2207 2232 2258 2283 2310
-7987 2310 2334 2349 2359 2375 2385 2382 2377 2374 2368 2351 2329 2312 2290 2262 2235 2204 2179 2162 2153 2159 2174 2200 2232 2270 2310 2344 2375 2410 2440 2464 2483 2496 2504 2504 2495 2476 2453 2424
-8007 2424 2394 2365 2335 2311 2292 2267 2248 2241 2237 2233 2228 2220 2213 2206 2199 2192 2185 2178 2170 2149 2124 2104 2078 2040 1999 1960 1920 1891 1867 1837 1812 1794 1778 1762 1745 1729 1713 1697 1682 1655
-8029 1655 1629 1603 1577 1555 1532 1507 1487 1479 1479 1492 1517 1548 1585 1630 1675 1723 1767 1806 1839 1869 1895 1915 1930 1937 1939 1936 1927 1917 1903 1892 1880 1872 1870 1878 1894 1916 1944 1969
-8050 1969 1995 2022 2044 2056 2059 2058 2048 2028 2003 1974 1943 1912 1883 1855 1832 1818 1814 1816 1824 1829 1833 1833 1827 1827 1821 1810 1796 1782 1769 1758 1747 1735 1724 1723 1722 1721 1720 1721 1721 1722 1723 1723 1724 1725 1726
-8074 1726 1722 1719 1716 1712 1709 1706 1702 1699 1694 1688 1683 1678 1683 1688 1693 1698 1701 1705 1708 1712 1715 1719 1722 1726 1722 1719 1715 1712 1708 1705 1701 1698 1683 1668 1653 1638 1618 1598 1577 1558 1548 1542 1533 1526 1528 1530 1532 1535 1538 1541 1544 1548 1551 1554 1557 1561 1559 1557
-8106 1557 1556 1554 1547 1541 1534 1527 1521 1515 1509 1503 1508 1512 1517 1521 1526 1530 1535 1540 1539 1539 1538 1538 1536 1533 1531 1529 1521 1514 1506 1499 1482 1465 1449 1432 1416 1399 1380 1367 1365 1370 1368 1372 1383 1395 1407 1418 1421 1423 1426 1428 1430 1433 1435 1438 1450
-8136A450J4J1J6K6L2K9K9K9K3K1J2kj0j8k7l3l5l5l3k0j6k1j6rrrqlmnjJ5K0J5K0L2L7L2
-8157A549L7M9N4N0N3O0O2O0O1O5O0M9M1K5Rjj3k2l1l4l9m3m3m3m3m0m1m3l8k6k1k6k1j1j0
-8176A695rj1k5k9k6k8k7k6l0k4j3pj3qKJKKLLJOJ2K1L1L6M0M5N1N3N5N5N5N5M7M3M8M2K1
-8197B149J4K0J5LkKjj2j8j3j6k0j9k0k0j3j3j3j3j3j3j2j3qpqqpqpqj0j0j0j0j0j0j0j0j4
-8219A804j4j4j4j8j8j9j7j3qKJ0J9K4L0L4L7L8L9L6K4J8K4J9QLONmplpj1j1j1j1poookkk
-8242A949kj2j2j2j3j0j0j0j0nnnnj2j4rj5k8l1k9k9k9k8k8k9j8j8j8j8j9j8j9j9j9j9j8j9
-8262A335k2k1k2k0j1lOJ4K5L0K8K8K9L0K9K9J6J5J7J4J0Noj4k2l0l5l7l8l6k9k4k3j8j2q
-8282A229ommnJ%JJmmnmj1j2j1j1kJmKJ4K0J7J7J7J7J8J7J0J0J1J0%%%%J0J6J0J5K3K2K3K3
$$ plain form
-8136 1450 1464 1475 1491 1517 1549 1578 1607 1636 1659 1680 1692 1690 1680 1662 1635 1602 1567 1532 1499 1479 1463 1442 1426 1417 1408 1399 1391 1388 1384 1379 1378 1393 1413 1428 1448 1480 1517 1549
-8157 1549 1586 1635 1689 1739 1792 1852 1914 1974 2035 2100 2160 2209 2250 2275 2284 2283 2270 2248 2217 2183 2144 2101 2058 2015 1972 1932 1891 1848 1810 1784 1763 1737 1716 1705 1695
-8176 1695 1686 1675 1650 1621 1595 1567 1540 1514 1484 1460 1447 1440 1427 1419 1421 1422 1424 1426 1429 1432 1433 1439 1451 1472 1503 1539 1579 1624 1675 1728 1783 1838 1893 1948 1995 2038 2086 2128 2149
-8197 2149 2163 2183 2198 2201 2199 2201 2200 2188 2170 2157 2141 2121 2102 2082 2062 2049 2036 2023 2010 1997 1984 1972 1959 1951 1944 1936 1928 1921 1913 1906 1898 1888 1878 1868 1858 1848 1838 1828 1818 1804
-8219 1804 1790 1776 1762 1744 1726 1707 1690 1677 1669 1671 1681 1700 1724 1754 1788 1825 1863 1902 1938 1962 1980 2004 2023 2031 2034 2040 2045 2041 2034 2031 2024 2013 2002 1991 1980 1973 1967 1961 1955 1953 1951 1949
-8242 1949 1947 1935 1923 1911 1898 1888 1878 1868 1858 1853 1848 1843 1838 1826 1812 1803 1788 1760 1729 1700 1671 1642 1614 1586 1557 1539 1521 1503 1485 1466 1448 1429 1410 1391 1372 1354 1335
-8262 1335 1313 1292 1270 1250 1239 1236 1242 1256 1281 1311 1339 1367 1396 1426 1455 1484 1500 1515 1532 1546 1556 1561 1555 1541 1519 1489 1454 1417 1379 1343 1314 1290 1267 1249 1237 1229
-8282 1229 1223 1219 1215 1210 1211 1211 1212 1213 1209 1205 1200 1196 1185 1173 1162 1151 1149 1150 1146 1148 1162 1182 1199 1216 1233 1250 1268 1285 1295 1305 1316 1326 1326 1326 1326 1326 1336 1352 1362 1377 1400 1422 1445 1468
-8306A468J9J9J9J9J3J4J4J4K1K4K1K5L1L4L3L3L5L5L8L2J8QLj0k0k9l3l8l5l6l8l3j8rj7
-8325A674j2LLLLrj1qj2j9k1j9k2k7k6k7k7j7j7j7j6popojjkjKLKLJ1J4J1J5K6K9K8K8K8K8
-8348A576K8K8J6J7J6J7K4K9K4K9L8M0L9L9M0L8L1K6J9J0Koqj4k0k3k7k7k7k7k3k2k3k3k0
-8367A836k1k1k1k6k6k6k6k6k5k7k5k0k1k1k0k0j9k1j8j1pj2oJ2J9J3J8L1L4L2L3L0K8L1K7
-8386A678J4J0J5Rjnknqrqrkklkj2j4j1j4k1k3k1k2k2k2k3k0j5j3j4j3mlllonlpj9k5j9k5
-8410A268l7l9l9l7l3k5j8oNJ6L0L9M9N6N3N3M9M7N1M7L8L8L8L8L9L8L1K5J6R%j0j6k2k8l1
-8430A732k5k5k6k4j4j1j4j2pqppkKkJQJ1J0ROLRJk2l0k3k8l4l5l7l2q%qkONOONOOONOONO
-8456A423NONJ1J1J0J1J0J1J1RJm%lppporrrrJLjMJ2J4J3J3J0OJ1Omqnpj6j6j6j7j5j5j5j5
$$ plain form
-8306 1468 1487 1506 1525 1544 1557 1571 1585 1599 1620 1644 1665 1690 1721 1755 1788 1821 1856 1891 1929 1961 1979 1987 1990 1980 1960 1931 1898 1860 1825 1789 1751 1718 1700 1691 1674
-8325 1674 1662 1665 1668 1671 1674 1665 1654 1646 1634 1615 1594 1575 1553 1526 1500 1473 1446 1429 1412 1395 1379 1372 1366 1359 1353 1352 1351 1349 1348 1350 1353 1355 1358 1369 1383 1394 1409 1435 1464 1492 1520 1548 1576
-8348 1576 1604 1632 1648 1665 1681 1698 1722 1751 1775 1804 1842 1882 1921 1960 2000 2038 2069 2095 2114 2124 2126 2120 2112 2098 2078 2055 2028 2001 1974 1947 1924 1902 1879 1856 1836
-8367 1836 1815 1794 1773 1747 1721 1695 1669 1643 1618 1591 1566 1546 1525 1504 1484 1464 1445 1424 1406 1395 1388 1376 1370 1382 1401 1414 1432 1463 1497 1529 1562 1592 1620 1651 1678
-8386 1678 1692 1702 1717 1726 1725 1720 1718 1713 1705 1696 1688 1679 1677 1675 1672 1670 1658 1644 1633 1619 1598 1575 1554 1532 1510 1488 1465 1445 1430 1417 1403 1390 1386 1383 1380 1377 1371 1366 1363 1356 1337 1312 1293 1268
-8410 1268 1231 1192 1153 1116 1083 1058 1040 1034 1039 1055 1085 1124 1173 1229 1282 1335 1384 1431 1482 1529 1567 1605 1643 1681 1720 1758 1789 1814 1830 1839 1839 1829 1813 1791 1763 1732
-8430 1732 1707 1682 1656 1632 1618 1607 1593 1581 1574 1566 1559 1552 1550 1552 1550 1551 1559 1570 1580 1589 1595 1598 1607 1608 1586 1556 1533 1505 1471 1436 1399 1367 1359 1359 1351 1349 1355 1360 1366 1372 1377 1383 1389 1395 1400 1406 1412 1417 1423
-8456 1423 1428 1434 1439 1450 1461 1471 1482 1492 1503 1514 1523 1524 1520 1520 1517 1510 1503 1496 1490 1481 1472 1463 1454 1455 1458 1457 1461 1473 1487 1500 1513 1523 1529 1540 1546 1542 1534 1529 1522 1506 1490 1474 1457 1442 1427 1412 1397
-8482A397k0k1j8k3l8m3l7m2n0n0m9n0m5m0l4l0k8j8rmJOJ2J5J8K0J8K0K1K1K3J9OKPJmmo
-8503I44lLQLQJ7K0J8J9J5J2J6J1nj0ork4k6k3k6k8k7k8k7j9j4k1j4OJ2OJ1K5K7K6K6K4K4
-8525I71K6K2J0MRNrj3j0j3j6j7j6j7j7j7j6j7pnrmLPNNNNONmmmmmmmmmlmmlmmlonnn%%jJ
-8554H03RJ1RJ2J9K2J9K2L0L2L1L0L7L4K8K2J8RJqj5k2k8k9k5k1j7rjOJ5K3K6K9L7L9L8L8
-8575A274L9L8L3L0L3L0K3K0K2K0J0MJ0Mj4j9j5j8k0k0k0k0k0k0k0k0j2j2j3j2j3j2j3j2m
-8594A261lllmlknj4k0j4j9k5k8k7k6k5k3k6k2rnj0mMNMNnonoj2j2j1j4k7l1k7l1l4l5l7l1
-8617F35k4j6pJJ3J7K4K6K6K6K6K6L0L0L0L0K4K5K6K3J5RJ5Rrj4j0j3j1j0j4qMQMQJ7J7J9
-8639A027J6J2Olj2k1k9l4l6l7l4k8k3j8j3qlOJ0J6K0K6K5K6K6K6K6K7K5J0MJ0NjmlkNJ1N
$$ plain form
-8482 1397 1377 1356 1338 1315 1277 1234 1197 1155 1105 1055 1006 956 911 871 837 807 779 761 752 748 749 755 767 782 800 820 838 858 879 900 923 942 948 950 957 958 954 950 944
-8503 944 941 944 952 955 963 980 1000 1018 1037 1052 1064 1080 1091 1086 1076 1070 1061 1037 1011 988 962 934 907 879 852 833 819 798 784 790 802 808 819 844 871 897 923 947 971
-8525 971 997 1019 1029 1033 1042 1047 1038 1025 1015 1002 986 969 953 936 919 902 886 869 862 857 848 844 847 854 859 864 869 874 880 885 881 877 873 869 865 861 857 853 849 846 842 838 835 831 827 824 818 813 808 803 803 803 802 803
-8554 803 812 823 832 844 863 885 904 926 956 988 1019 1049 1086 1120 1148 1170 1188 1197 1198 1190 1175 1153 1125 1096 1071 1050 1033 1024 1023 1029 1044 1067 1093 1122 1159 1198 1236 1274
-8575 1274 1313 1351 1384 1414 1447 1477 1500 1520 1542 1562 1572 1576 1586 1590 1576 1557 1542 1524 1504 1484 1464 1444 1424 1404 1384 1364 1352 1340 1327 1315 1302 1290 1277 1265 1261
-8594 1261 1258 1255 1252 1248 1245 1243 1238 1224 1204 1190 1171 1146 1118 1091 1065 1040 1017 991 969 960 955 945 941 945 950 954 959 954 948 943 937 925 913 902 888 861 830 803 772 738 703 666 635
-8617 635 611 595 588 589 602 619 643 669 695 721 747 773 803 833 863 893 917 942 968 991 1006 1015 1030 1039 1030 1016 1006 993 982 972 958 950 954 962 966 974 991 1008 1027
-8639 1027 1043 1055 1061 1058 1046 1025 996 962 926 889 855 827 804 786 773 765 762 768 778 794 814 840 865 891 917 943 969 996 1021 1031 1035 1045 1050 1049 1045 1042 1040 1045 1056 1061
-8660A061J0J8J8K0J5%ojoj8k2k0k0k1k0k0k0j0j0j0j0j5j4j5j5k5k5k6k5j7j7j8j7j6j6j8
-8680F49j4JJ0J7K7L3L9L5L7M1M1M0M1M2L9M3L8J9J4J9J4lj1nj0k7l2l0l0l1l0l0l0l3l3l4
-8700H56l3k2k3k3k2j3qj4rJ1J5J1J5K9L1L1L0K4J9J0Joj4j8k1k2j8j5oMJ0J7J7J4J1J5RK
-8720H95mKmj5k1j7j9k1k1k3j8pkpjNOOOOONQK4L0K4K9L6L7L9L4K1J6K1J6RPRPkpkok6l0k7
-8745A024k9l1l1l5k8j8j2j7j2QJ3RJ2K0K0K0K1J3QNmj1j8k8l6m7n3m9n2n0n0n2m8m1l4k5
-8765C62j6qlLOjm%ljjmJJ5K0J5J9K8K7K9K6J7J2J8J3OMOLnqnqk1k7k2k4k7k7k8k5k0j4j9
-8789C09j4MJ0MRJ6J8J6J9L2L4L1L5L2L3L4L1K2J7K3J7N%LLJ%J%JJ%Jj5j4j5j4j5j4j4j5r
-8812F23rrqrrrrj0j0rj0j0j0j0j0rrrrrj0rrj3j4j3j5k1k6k2k5l1l1l1l2k0k0k0k1j6j3p
$$ plain form
-8660 1061 1071 1089 1107 1127 1142 1142 1136 1135 1129 1111 1089 1069 1049 1028 1008 988 968 958 948 938 928 913 899 884 869 844 819 793 768 751 734 716 699 683 667 649
-8680 649 635 636 646 663 690 723 762 797 834 875 916 956 997 1039 1078 1121 1159 1178 1192 1211 1225 1222 1211 1206 1196 1169 1137 1107 1077 1046 1016 986 956 923 890 856
-8700 856 823 801 778 755 733 720 712 698 689 700 715 726 741 770 801 832 862 886 905 915 916 910 896 878 857 835 817 802 796 800 810 827 844 858 869 884 893 895
-8720 895 891 893 889 874 853 836 817 796 775 752 734 727 725 718 717 722 728 734 740 746 752 757 765 789 819 843 872 908 945 984 1018 1039 1055 1076 1092 1101 1108 1117 1124 1122 1115 1113 1107 1081 1051 1024
-8745 1024 995 964 933 898 870 852 840 823 811 819 832 841 853 873 893 913 934 947 955 960 956 945 927 899 863 816 763 714 662 612 562 510 462 421 387 362
-8765 362 346 338 335 338 344 343 339 339 336 335 334 330 331 346 366 381 400 428 455 484 510 527 539 557 570 576 580 586 589 584 576 571 563 542 515 493 469 442 415 387 362 342 328 309
-8789 309 295 299 309 313 322 338 356 372 391 423 457 488 523 555 588 622 653 675 692 715 732 737 737 740 743 744 744 745 745 746 747 747 748 733 719 704 690 675 661 647 632 623
-8812 623 614 605 597 588 579 570 561 551 541 532 522 512 502 492 482 473 464 455 446 437 427 418 409 396 382 369 354 333 307 285 260 229 198 167 135 115 95 75 54 38 25 18
-8835A8kKQJ8K7L3M2N2N7N5N5N7N3M3L5K7J8Nnpj2j3j3j3j4lmmmppqpJN%OJ4J4J7J2lj1j9
-8859E18k7l2l4l5l0k4j5pJJ8K3K9L2K6K6K6K6K0J7K2J7J0QRRQRQQRQQQN%O%j8k3k0k1k1j8
-8882E89k2j7j1qj0rj8k3j8k3k9l1l0l1k7k5k8k4m%oKK1K7K1K6L3L3L4L2K4J9J0%oj2rrro
-8904D26j1nQJ0RRJ2J1J2J2J1J2J2J1J3J3J2J5K8L3K7L2M0M0M1L9K5K0K6K0J1NJ0Ojljmjj
-8926I84jkJ0RRRPMQLj5k1j6k0k3k4k4k4j4j3j4j4onooonoopppppornJ1J7J1J6K7L0L1K6K2
-8951I08J3%j2k6l7m9o1o9p4q2q2p8p3o3n4m7l5k4j1lOJ0J4J9J9K1J7koknrqrpOJ1OJ1L3L7
-8974B03L3L6L5L5L5L5L0L1L0L0L0L1L0L0K1J9K3J8OJMLJJkLJ5K0J6J9J6J7J7J6POPO%j%%
-8997I13j1j1j1j0k0j9k0k0rrrj0j6j8j5k0l1l6l4l3l0k4l0k5o%ojJ0J1J1J1J1J1J1J0K2K2
$$ plain form
-8835 18 16 18 26 44 71 104 146 198 255 310 365 422 475 518 553 580 598 603 598 591 579 566 553 540 526 523 519 515 511 504 497 489 482 483 488 488 494 508 522 539 551 548 537 518
-8859 518 491 459 425 390 360 336 321 314 315 333 356 385 417 443 469 495 521 541 558 580 597 607 615 624 633 641 650 658 666 675 683 691 699 704 704 710 710 692 669 649 628 607 589
-8882 589 567 550 539 531 521 512 494 471 453 430 401 370 340 309 282 257 229 205 201 201 195 197 218 245 266 292 325 358 392 424 448 467 477 477 471 459 450 441 432 426
-8904 426 415 410 418 428 437 446 458 469 481 493 504 516 528 539 552 565 577 592 620 653 680 712 752 792 833 872 897 917 943 963 974 979 989 995 994 991 990 986 985 984
-8926 984 983 981 991 1000 1009 1018 1025 1029 1037 1040 1025 1004 988 968 945 921 897 873 859 846 832 818 812 807 801 795 789 784 778 772 765 758 751 744 737 731 722 717 728 745 756 772 799 829 860 886 908
-8951 908 921 921 909 883 846 797 736 667 593 511 429 351 278 215 161 114 79 55 44 41 47 57 71 90 109 130 147 145 139 137 132 123 115 106 99 105 116 122 133 166 203
-8974 203 236 272 307 342 377 412 442 473 503 533 563 594 624 654 675 694 717 735 741 742 746 749 750 751 749 752 767 787 803 822 838 855 872 888 895 901 908 914 914 913 913 913
-8997 913 902 891 880 870 850 831 811 791 782 773 764 754 738 720 705 685 654 618 584 551 521 497 467 442 436 436 430 429 439 450 461 472 483 494 505 515 537 559
-9017E59K1K2K1K2K1K2J5J6J6J6NONNlmmlmmlmOONOONPMpj2pj2j9k1j9k0k3k3k3k3j4j1j5
-9042E39j0jJ%%%J%%mlmmmmmlj1j1j1j1j1j0j2rKPKPJ9K4K2K1K0J7K1J6NjKKNMMNNLPKj7k2
-9070E96j7k2k9k9l0l0k3k4k3k3k2k2k4k0q%QJ7K4L2L6M0M0M0M1L9K6K2K5K3J3J0J4J0MjM
-9090G17jj7k4j9k1k1k0k1k1k1k2k2k1k2j9k3j8lNJ3K2K3K6K6K3J6J0J5J0jplnj2j4j2j3j3
-9110D90j3j3j3%J%%JJkLJ4J9J5J8K6K7K7K7K8K8L0K5J7RJqj4j8k5k7k9k6j9j5qmnompkpj9
-9134E23k2k0k0j3pj3qJ0J4J0J5K2K2K4K1J3QJ3Qmrnpj2j2j3j1kLQJ3J3K2L0L8M7N3N9O2N6
-9156I29N6N6N5N2N0M3L8L4K8J9RLoj0j4k2k5k3k4k4k4k5k4j9j9j9j9j9j9j9j8l1l0l0l1l0
-9176H48l0l0l1k3k3k3k2k3k3k3k3k8k8k7k8k9k6l0k5j1pj1oJ2J8J3J7J9J9K1J8J2PJ1QJ%
$$ plain form
-9017 559 580 602 623 645 666 688 703 719 735 751 756 762 767 772 769 765 761 758 754 750 747 743 749 755 760 766 772 777 784 788 781 769 762 750 731 710 691 671 648 625 602 579 565 554 539
-9042 539 529 528 529 529 529 529 530 530 530 526 523 519 515 511 507 503 500 489 478 467 456 445 435 423 414 416 423 425 432 451 475 497 518 538 555 576 592 597 596 598 600 605 609 613 618 623 626 633 635 618 596
-9070 596 579 557 528 499 469 439 416 392 369 346 324 302 278 258 250 250 258 275 299 331 367 407 447 487 528 567 593 615 640 663 676 686 700 710 714 713 717
-9090 717 716 699 675 656 635 614 594 573 552 531 509 487 466 444 425 402 384 381 386 399 421 444 470 496 519 535 545 560 570 569 562 559 554 542 528 516 503 490
-9110 490 477 464 451 451 452 452 452 453 454 452 455 469 488 503 521 547 574 601 628 656 684 714 739 756 765 766 758 744 726 701 674 645 619 600 585 577 573 568 562 558 551 549 542 523
-9134 523 501 481 461 448 441 428 420 430 444 454 469 491 513 537 558 571 579 592 600 596 587 582 575 563 551 538 527 525 528 536 549 562 584 614 652 699 752 811 873 929
-9156 929 985 1041 1096 1148 1198 1241 1279 1313 1341 1360 1369 1372 1366 1356 1342 1320 1295 1272 1248 1224 1200 1175 1151 1132 1113 1094 1075 1056 1037 1018 1000 969 939 909 878 848
-9176 848 818 788 757 734 711 688 666 643 620 597 574 546 518 491 463 434 408 378 353 342 335 324 318 330 348 361 378 397 416 437 455 467 474 485 493 494 494
-9196D94%%j%%%j1j1j1j1j1j1j1j1j8k0j6k1l5l7l5l6l3l0l5k9j8j2j7j3mlnkNPOOJ3J4J3
-9218E0J3K3K5K1K6L7M1L8M0M4M4L5L1K9K1J1N%%jJJ2J7J2J7K4K5K5K4J9J5K0J5LkJ%jKkL
-9241G63J4K0J7J7J4J2J7Rj3k2j4j9k1j7k2j7KOLNQOQOllmkJ7K1J7K0J8J9K1J6jo%oj8k3j8
-9264H47k3l6m2l7m1m0l7m2l6j6pj5rLPONOPPOmlmmoopnQJ4RJ2J6J5J7J4JmJmk1k7k2k5k3
-9289D55k3k5k0j6pJRK2K8K5K5K3J9Q%oj2j0j0j3j2j3j3ljn%J2J7J1J7L0L2L1L1K3K1K4K0
-9310F95PKQLqj0rrrrrropnqk1k6k1k6l3l3l5l0j5kRK1K3K9L7L6L9L6K9K5J5Okj0j9k3k0k3
-9334E83k2k2k3k2k3k2k3k2j2rj3qJ1J5J1J5K2K1K2K1J3RJ3J1LMMKnqppnononoonlkllmmj
-9360D68pj5k2l2l9m7n0m9m8m6m0l2k0j1KJ3K6L9M6N2N5N5N2M7M0L1K3J4OMkpj1j3j3j4j3
$$ plain form
-9196 494 494 494 493 493 493 493 482 471 460 449 438 427 416 405 387 367 351 330 295 258 223 187 154 124 89 60 42 30 13 0 -4 -7 -12 -14 -9 -2 4 10 23 37 50
-9218 50 63 86 111 132 158 195 236 274 314 358 402 437 468 497 518 529 534 534 534 533 534 546 563 575 592 616 641 666 690 709 724 744 759 762 760 761 761 760 762 760 763
-9241 763 777 797 814 831 845 857 874 883 870 848 834 815 794 777 755 738 740 746 749 754 762 768 776 782 779 776 772 770 787 808 825 845 863 882 903 919 918 912 912 906 888 865 847
-9264 847 824 788 746 709 668 628 591 549 513 497 490 475 466 469 476 482 487 493 500 507 513 509 506 502 498 492 486 479 474 482 496 505 517 533 548 565 579 580 576 577 573 552 525 503 478 455
-9289 455 432 407 387 371 364 365 374 396 424 449 474 497 516 524 524 518 506 496 486 473 461 448 435 432 431 426 426 438 455 466 483 513 545 576 607 630 651 675 695
-9310 695 702 704 712 715 707 697 688 679 670 661 652 643 637 630 625 617 596 570 549 523 490 457 422 392 377 375 384 405 428 457 494 530 569 605 634 659 674 680 678 668 649 626 606 583
-9334 583 561 539 516 494 471 449 426 404 392 383 370 362 373 388 399 414 436 457 479 500 513 522 535 546 549 553 557 559 554 546 539 532 527 521 516 510 505 499 493 488 485 483 480 477 473 469 468
-9360 468 461 446 424 392 353 306 256 207 159 113 73 41 21 10 12 25 51 90 136 188 243 298 350 397 437 468 491 505 511 515 513 506 495 482 469 455 442
-9380D42j4j4j5j3l%ljRQRQNMOMnonoj2j1j2j1j3j0j3j1kkkkPJ0OJ0K2K7K3K6K4K4K6K3J4
-9405E51J1J4J1LJMJopppoormPJ1RRJ0QJ1Qj0j5j1j3j3j2j3j2KLKKLKLJpj2pj2k5k8k6k7k4
-9431C68k5k5k4j5j4j5j4j3j3j3j3k3k3k3k3j9j7k0j6MQMQK1K6K3K4L3L5L3L5M4M7M5M5M1
-9451D96L6L3K5J6Lrj9k9l4l2l2k8k7k8k7j7j7j7j8j3j3j6j1qkPJ6K3K9L3L8M2M1M2M1L5K9
-9471E88L5K9J1NJ1Oorqqqqqqrqqj0j7k1j6k2k9l2l0l1l2k9l3k8j5j0j3j1kjkjkkkkjkkkQ
-9496B05QQQROJ0Oqj2j0j0j0j0j2qkMjMJ6K1J5K1K9L2L0L0K2J7K3J8Kk%J%%%jj0j0j0j1j1
-9520D07rj2qQJ3QJ3K6K9K7K8K2J9K5J6nj4oj2k0k0k1k0j1j0rj2k1k6k1k5l2l3l4l0k3j5p
-9541A85KJ0J5K2K5K1K2K4K0QLQLj5k0j5k0k7k8k8k8k0j8k2j7n%n%J9K4K0K2K2K1K2K1K1K2
$$ plain form
-9380 442 428 414 399 386 383 383 380 379 388 396 405 413 418 422 428 432 427 421 416 410 398 387 375 364 351 341 328 317 315 313 311 309 316 326 332 342 364 391 414 440 464 488 514 537 551
-9405 551 562 576 587 590 591 595 596 590 583 576 569 563 557 548 544 551 562 571 580 590 598 609 617 607 592 581 568 555 543 530 518 520 523 525 527 530 532 535 536 529 517 510 498 473 445 419 392 368
-9431 368 343 318 294 279 265 250 236 223 210 197 184 161 138 115 92 73 56 36 20 24 32 36 44 65 91 114 138 171 206 239 274 318 365 410 455 496
-9451 496 532 565 590 606 609 600 581 552 518 486 454 426 399 371 344 327 310 293 275 262 249 233 222 214 212 219 235 258 287 320 358 400 441 483 524 559 588
-9471 588 623 652 663 668 679 685 679 670 662 654 646 638 630 622 613 605 597 587 570 549 533 511 482 450 420 389 357 328 295 267 252 242 229 218 216 215 213 212 210 208 206 204 203 201 199 197 205
-9496 205 213 221 229 238 244 254 260 252 240 230 220 210 200 188 180 178 182 181 185 201 222 237 258 287 319 349 379 401 418 441 459 461 459 459 460 460 460 460 459 449 439 429 418 407
-9520 407 398 386 378 386 399 407 420 446 475 502 530 552 571 596 612 607 593 587 575 555 535 514 494 483 473 464 452 431 405 384 359 327 294 260 230 207 192 185
-9541 185 187 197 212 234 259 280 302 326 346 354 357 365 368 353 333 318 298 271 243 215 187 167 149 127 110 105 105 100 100 119 143 163 185 207 228 250 271 292 314
-9562C14K1K1K2K1K1K2J9K0K0K0J9K0K1J8OJOKj8k3j8k2l4l3l3l4l3l4l3l4m0m1m1l9l5l0
-9582C9j9j1%RJ2J7J4J5PKjj0j3j7j6j3r%J3K2L0L8M1M4M2M3L3L3L3L3L3L3L3L3K4K2K6K1
-9603F36QNOPNNNNJ6J5J5J6N%O%j1j7j1j6k2k2k3k1j6j1kQJ4J9K5K9K7K5K0J2Jj0k3l3l6m2
-9625F19n0n0n0m6m1l6l5l1k5k0j9j5j3j1j0qjLJ0J4J5J8J5J5J4J5K0J9K0K0J9K0K0J9J9K0
-9645D73J9J9J9J9J9J7J0MJqj9k3l2l2k4k0j6rlJQJ0J3J2J1MLlpj3j6k0j8j8rqrr%%j%%j%
-9670C44%jjJllqj4j9k6l1l6m2m3m3m4m1l5l0k5k0k1j9j6j3j4qlKJ1J5K1K5K9L4M0M1L9L8
-9691H1L6L0K8K3J7J3J4J1QOKlqj3j4j8k5k8k9k9k9k9l6l2k6k2j3nMJ2K0K7L0L6L7L8L5L0
-9712A79K7K3J5J4OLJkKKKKMPLPJ5J5J6J5J4J4J6J3N%mj0j6j9j8j7rpj0poompj5j5j6j4rn
$$ plain form
-9562 314 335 356 378 399 420 442 461 481 501 521 540 560 581 599 605 606 612 614 596 573 555 533 499 466 433 399 366 332 299 265 225 184 143 104 69 39
-9582 39 20 9 9 18 30 47 61 76 83 85 84 74 61 44 28 15 6 6 19 41 71 109 150 194 236 279 312 345 378 411 444 477 510 543 567 589 615 636
-9603 636 644 649 655 662 667 672 677 682 698 713 728 744 749 749 755 755 744 727 716 700 678 656 633 612 596 585 583 591 605 624 649 678 705 730 750 762 763 753 730 697 661 619
-9625 619 569 519 469 423 382 346 311 280 255 235 216 201 188 177 167 159 158 161 171 185 200 218 233 248 262 277 297 316 336 356 375 395 415 434 453 473
-9645 473 492 511 530 549 568 585 595 599 600 592 573 550 518 486 462 442 426 417 414 415 423 433 446 458 469 473 476 473 466 453 437 417 399 381 372 364 355 346 346 346 345 345 345 344 344
-9670 344 344 343 342 343 340 337 329 315 296 270 239 203 161 118 75 31 -10 -45 -75 -100 -120 -141 -160 -176 -189 -203 -211 -214 -212 -201 -186 -165 -140 -111 -77 -37 4 43 81
-9691 81 117 147 175 198 215 228 242 253 261 267 269 266 258 245 231 213 188 160 131 102 73 44 8 -24 -50 -72 -85 -90 -86 -74 -54 -27 3 39 76 114 149 179
-9712 179 206 229 244 258 264 267 268 266 268 270 272 274 278 285 288 295 310 325 341 356 370 384 400 413 418 418 414 404 388 369 351 334 325 318 308 301 295 289 285 278 263 248 232 218 209 204
-9737B04JOJ2J5J4J4J4J1N%mrj0j2j5j7j9k2k8k8k9k6k4j9j3rn%JMPPPQkmjmj0j3j1j2j1j2
-9761c9j1j2rrnkKPJ2J8L1L5L2L4L5L4L4L4L2L2L1L2L2L2L1L2L6L7L8L4K5J7Qjqj6k7l2l6
-9782E50m1l8l8m3m4m3m4l4l2l5l1j5j1j4j2mjllNNNMNNNMnj0mj0j7j7j8j7oopopoppj3j4
-9806g5j4j4j4j3j4j4k6k5k5k5j7j2j9j1J0J8J2J6K4K5K4K5K1K1J9K3L5M0L6L8L8L8M0L5K8
-9825B48J8J1Klrj5j7j2j2j1j2qqro%N%MJ6J6J6J6ONQLmonnomqkJ6K1J8K0J9J8K0J9K4K4K5
-9851D36K4K5K3K7K1JmJmj7k0j9j8rqrrqrqj0k0k6k2k4k3k2k4k2j6j2j6j2nllmOOPOOOOPJ0
-9876B12J0J0J1JkKkj7k2j7k2l4l9l6l7m2m3m5m1k5j7r%OJ2J7K1K5K5K5K5L2L0L2L2L1L0L3
-9896A72K8J9J1Loj5j7j6j6pppoppppppppppppppppLMLLRQJ1Okj0j9k6k5l2k9l0l1k9l4k8
$$ plain form
-9737 204 205 211 223 238 252 266 280 291 296 296 292 283 273 261 246 229 210 188 160 132 103 77 53 34 21 12 7 7 8 12 19 26 33 41 39 35 34 30 20 7 -4 -16 -27 -39
-9761 -39 -50 -62 -71 -80 -85 -87 -85 -78 -66 -48 -17 18 50 84 119 153 187 221 253 285 316 348 380 412 443 475 511 548 586 620 645 662 670 669 661 645 618 586 550
-9782 550 509 471 433 390 346 303 259 225 193 158 127 112 101 87 75 71 70 67 64 69 74 79 83 88 93 98 102 97 87 83 73 56 39 21 4 -2 -8 -15 -21 -28 -34 -41 -48 -61 -75
-9806 -75 -89 -103 -117 -130 -144 -158 -184 -209 -234 -259 -276 -288 -307 -318 -308 -290 -278 -262 -238 -213 -189 -164 -143 -122 -103 -80 -45 -5 31 69 107 145 185 220 248
-9825 248 266 277 279 276 267 252 235 223 211 200 188 180 172 163 157 157 162 162 166 182 198 214 230 236 241 249 252 248 242 237 232 226 222 214 212 228 249 267 287 306 324 344 363 387 411 436
-9851 436 460 485 508 535 556 557 553 554 550 533 513 494 476 467 459 450 441 433 424 416 406 386 360 338 314 291 269 245 223 207 195 179 167 162 159 156 152 158 164 171 177 183 189 195 202 212
-9876 212 222 232 243 244 242 244 242 225 203 186 164 130 91 55 18 -24 -67 -112 -153 -178 -195 -204 -204 -198 -186 -169 -148 -123 -98 -73 -48 -16 14 46 78 109 139 172
-9896 172 200 219 230 233 227 212 195 179 163 156 149 142 136 129 122 115 108 101 94 87 80 73 66 59 52 45 38 31 24 27 31 34 37 46 54 65 71 69 59 40 14 -11 -43 -72 -102 -133 -162 -196 -224
-9923b24j5j1j5j2lklkLOLPJ9K4K0K4M0M6M2M4M3M1M6M0K7K1K4K4K3K4K3K3J4J2J6J1MKML
-9945D16J3J4J3J4J4J3J4J3J3J4J3J3J4J2J6J0oj2qj1rrj0r%J%J%%Lkj2j6j3j5k4k4k5k4k4
-9967C81k3k4k2j5j0j6j1KNLLMLMLRRQQJm%lj3j5j6j1pKJ5K6L7M6N0N2N4N0M6L8L1K3J4Pl
-9991G41rj4j9k2k6k3k4k5k3k9k0LJ1NRJ8J7J9J7ONONPNONj0j2qj3j9k2k1k1k3k3k3k3k2k4
-10013C87k2k4l0l0l2k7j6j0j6j1lllkkkoJK1K8K1K6L5L4L5L4K7K5K8K5J7J5J7J5JmKmj6k0
-10035E11j8j8k4k4k4k4j5j2j5j2JOJMMKO%j8k4j8k3l1l1l1l1j9j9k0j9j9j9j9j8qpppLLL
-10058c0LMMLMLMMKJ1J1J1J1K1K2K1K1K8K8K8K8J9J6K0J5%n%mk4k9k4k8m3m8m4m7n4n5n5n5
-10080b03n4n1m4m0k9k2j2nJ0J8K6L5M4M7M6M6L6L2L8L1OJPJmmolJ0J5J0J5K7L0L0L0K8K9
$$ plain form
-9923 -224 -239 -250 -265 -277 -280 -282 -285 -287 -284 -278 -275 -268 -249 -225 -205 -181 -141 -95 -53 -9 34 75 121 161 188 209 233 257 280 304 327 350 364 376 392 403 407 409 413 416
-9945 416 429 443 456 470 484 497 511 524 537 551 564 577 591 603 619 629 623 611 603 592 583 574 564 555 555 556 556 557 557 557 560 558 546 530 517 502 478 454 429 405 381
-9967 381 358 334 312 297 287 271 260 262 267 270 273 277 280 284 287 296 305 313 321 322 318 318 315 302 287 271 260 253 255 270 296 333 379 429 481 535 585 631 669 700 723 737 744 741
-9991 741 732 718 699 677 651 628 604 579 556 527 507 510 521 526 535 553 570 589 606 612 617 623 628 635 640 646 651 641 629 621 608 589 567 546 525 502 479 456 433 411 387
-10013 387 365 341 311 281 249 222 206 196 180 169 166 163 160 158 156 154 148 149 170 198 219 245 280 314 349 383 410 435 463 488 505 520 537 552 553 549 551 547 531 511
-10035 511 493 475 451 427 403 379 364 352 337 325 326 332 333 337 341 343 349 349 331 307 289 266 235 204 173 142 123 104 84 65 46 27 8 -10 -18 -25 -32 -39 -36 -33 -30
-10058 -30 -27 -23 -19 -16 -12 -9 -5 -1 1 12 23 34 45 66 88 109 130 158 186 214 242 261 277 297 312 312 307 307 303 279 250 226 198 155 107 63 16 -38 -93 -148 -203
-10080 -203 -257 -308 -352 -392 -421 -443 -455 -460 -450 -432 -406 -371 -327 -280 -234 -188 -152 -120 -82 -51 -45 -44 -37 -36 -40 -44 -50 -53 -43 -28 -18 -3 24 54 84 114 142 171
-10101A71L0K6J7Qjqj6k4k7l3l3l4l5l2k6k1k7k2lLlKJ4J9J7J6J4J0J6J0kplnj1j2j5rPJ6
-10122a3RJ2J9J9K1J7jrjpj2j2j4j0KPKPJ8K1J9K0J9K0J9K0K3K4K3K4J3J3J3J3MLMLMMLMj
-10146C66jjjjjjj%%%%%%%jRQQPJ0OJ1Nj1j5j2j4j4j3j3j3j9j9k0j9j9j9j9j9k3k4k2k3j6
-10170E6j0j5j0J0J5J1J4J3J2J3J3J0J0RJ1K5L0K5K8L5L5L4L5K6K2K6K2J1OJmooopoopopo
-10192D56poj4j4j4j3j4j4j4j3k2k1k1k1k2k1k1k2j8j8j8j9pqqqNNONLLQRJ8K2K7L3L9M2M2
-10215C25L9L5L0K5J9J9J3RLnrj4k0k5k7l1l1k8k7k9k6k6k1j5j2j1j1j0j2j2j7k3k6k4k4k4
-10234b3k3j9j4nNPJ3J5J5K1J7J1PkmllkMQJ4K0K5K7K8K6K2J1Lnj3j8k1j7j7j5rj0nmjNNO
-10258H2Njjjkjjjj%JJJJJJJmnmmllmlolLRJ4K1K6K9K8K8K6K0J8J2QKnj1j3j4j1j1j1j1po
$$ plain form
-10101 171 201 227 244 252 251 243 227 203 176 143 110 76 41 9 -17 -38 -65 -87 -90 -87 -90 -88 -74 -55 -38 -22 -8 2 18 28 26 19 16 11 0 -12 -27 -36 -29 -13
-10122 -13 -4 8 27 46 67 84 83 74 73 66 54 42 28 18 20 27 29 36 54 75 94 114 133 153 172 192 215 239 262 286 299 312 325 338 342 345 349 352 356 360 363 367 366
-10146 366 365 364 363 362 361 360 359 359 359 359 359 359 359 359 358 367 375 383 390 400 406 417 422 411 396 384 370 356 343 330 317 298 279 259 240 221 202 183 164 141 117 95 72 56
-10170 56 46 31 21 31 46 57 71 84 96 109 122 132 142 151 162 187 217 242 270 305 340 374 409 435 457 483 505 516 522 523 519 513 507 501 494 488 482 475 469 462 456
-10192 456 449 443 429 415 401 388 374 360 346 333 311 290 269 248 226 205 184 162 144 126 108 89 82 74 66 58 63 68 74 79 82 85 93 102 120 142 169 202 241 283 325
-10215 325 364 399 429 454 473 492 505 514 517 512 503 489 469 444 417 386 355 327 300 271 245 219 198 183 171 160 149 139 127 115 98 75 49 25 1 -23
-10234 -23 -46 -65 -79 -84 -79 -72 -59 -44 -29 -8 9 20 27 25 21 18 15 13 17 25 39 59 84 111 139 165 187 198 201 196 183 165 144 127 110 95 86 76 71 67 66 71 76 82
-10258 82 87 86 85 84 82 81 80 79 78 78 79 80 81 82 83 84 85 81 76 72 68 65 62 58 55 49 46 49 58 72 93 119 148 176 204 230 250 268 280 288 290 285 274 261 247 236 225 214 203 196 190
-10286A90l%MRJ5J8K0K0K1J8J2OKmorqqrrrqonnnnnnnonlKNJ1J5K0K5K8K6K6K5J9J5RKlmp
-10313D21j2j5j3j4j7j7j8j7j1j4k0k5l1l5m2m5m4m1l6l0k5j9j4rqlLQJ7K3J9K1K1K1K1K1
-10333B1K1K2K3K0J2PKlqj3k0k2j5j5j6j4rojNONPPkjjjj1j1j1j2j1j1j3rmJk%RJ2J1J1J1
-10357b9J1J1J0J4J3J4J4J4J4J4J3K7K6K7K6K7K6K7K6K7K6K6K6K2J9J3QMkpj2j4j6j3j7k4
-10377C91k7k3k8m0m5m1m4m8m7n0m5l7k9k0j2mJPJ0MMNMj%j%RJ0J0J0RJ0J0J0RJ0J0RJ1J2
-10399B3J2J2J1J2J2J2J7J7J7J7J7J7J7J7K2K3K2K3K2K2K3K2J3J3J4J2Mjoj1j7k2j9j9k6k4
-10419C20j8j2qlMPJ0J2RJ4K3K9L3L9M6M6M8M4L4K6J7Rnj0qqj0rj0rloj2j7k3k8l2l8m6m8
-10441D07m8m7m5m5m5m5m5m4m4m3l6l0k6k0j3qlKQQRQRRRQJ1J0J1J0J1J0J1J0K0J9K0J9K0
$$ plain form
-10286 190 187 187 191 200 215 233 253 273 294 312 324 330 332 328 322 313 305 297 288 279 270 262 256 251 246 241 236 231 226 221 215 210 207 209 214 225 240 260 285 313 339 365 390 409 424 433 435 432 428 421
-10313 421 409 394 381 367 350 333 315 298 287 273 253 228 197 162 120 75 31 -10 -46 -76 -101 -120 -134 -143 -151 -154 -151 -143 -126 -103 -84 -63 -42 -21 0 21
-10333 21 42 64 87 107 119 126 128 125 117 104 84 62 47 32 16 2 -7 -13 -14 -9 -3 2 9 16 14 13 12 11 0 -11 -22 -34 -45 -56 -69 -78 -82 -81 -83 -83 -74 -62 -51 -40 -29
-10357 -29 -18 -7 3 17 30 44 58 72 86 100 113 140 166 193 219 246 272 299 325 352 378 404 430 452 471 484 492 496 494 487 475 461 445 432 415 391
-10377 391 364 341 313 273 228 187 143 95 48 -2 -47 -84 -113 -133 -145 -149 -148 -141 -131 -127 -123 -118 -114 -115 -115 -116 -116 -107 -97 -87 -77 -68 -58 -48 -38 -29 -19 -9 0 11 23
-10399 23 35 47 58 70 82 94 111 128 145 162 179 196 213 230 252 275 297 320 342 364 387 409 422 435 449 461 465 464 458 447 430 408 389 370 344 320
-10419 320 302 290 282 279 283 290 300 312 321 335 358 387 420 459 505 551 599 643 677 703 720 729 724 714 706 698 688 679 669 660 657 651 639 622 599 571 539 501 455 407
-10441 407 359 312 267 222 177 132 87 43 -1 -44 -80 -110 -136 -156 -169 -177 -180 -178 -170 -162 -153 -145 -136 -127 -118 -110 -99 -89 -78 -68 -57 -47 -36 -26 -6 13 33 52 72
-10462G2K0J9K0J0ORPjlkkmlmlmlmljjjjj2j1j2j1j3j3j3j3j3j2j2j3JJJKJJJKj%j%J0QJ0
-10489A1J0J2J1J2J1KJJJQQQQQQROjojnj9k1k0k0j7j5j7j3MJ1OQJ3J3J3J3J3J3J2J3J8J7J7
-10513A64J7J7J8J7J7J6J4J8J3JmJmj3j3j4j2KPJOJ6J8J7J7J7J7J8J6LkMlk7l4k7l2l9m0m2
-10535A66l7j8j4j8j4k%kjjjjjJ0RJ0RK0K0K0K0J0QJ2Onj0nj0j8j8j9j7j0nj1nQJ1OJ2J8K1
-10558A53J9K0K0J7K1J7lplpj6j9j8j7j2oLJ2K3L1L5L9L2L3L3L3L7L7L8L7L7L8L7L7L2K9L4
-10579H26K8K1J6J1Nlj2j8l1l8m7n7o2o1o0n3m8m1l6l2k5j9j3rlk%j%%j%%%%%%ornrk3k6k2
-10603A35k6l0l0l0k9k5j9rjJOJ4J4J7J2PLoj0qrk0j9k0k0k0j9k0j9k0j9k0j9j2j1j2j1j2
-10623c16j1j2j1j1j1j1j1%j%jQPQPQPPQPOPP%LRJ5K4L0L5L9L1L0L4K8K1J1Mmpj5k7l1l8m4
$$ plain form
-10462 72 92 111 131 141 147 156 163 162 159 157 155 151 148 144 141 137 134 130 127 126 125 124 123 111 100 88 77 64 51 38 25 12 0 -12 -25 -24 -23 -22 -20 -19 -18 -17 -15 -16 -16 -17 -17 -7 1 11
-10489 11 21 33 44 56 67 69 70 71 72 80 88 96 104 112 120 129 135 134 128 127 122 103 82 62 42 25 10 -7 -20 -16 -5 1 9 22 35 48 61 74 87 99 112 130 147 164
-10513 164 181 198 216 233 250 266 280 298 311 312 308 309 305 292 279 265 253 255 262 263 269 285 303 320 337 354 371 389 405 408 406 410 407 380 346 319 287 248 208 166
-10535 166 129 111 97 79 65 63 63 61 60 59 58 57 56 66 75 85 94 114 134 154 174 184 192 204 210 205 195 190 180 162 144 125 108 98 93 82 77 85 96 102 114 132 153
-10558 153 172 192 212 229 250 267 264 257 254 247 231 212 194 177 165 159 162 174 197 228 263 302 334 367 400 433 470 507 545 582 619 657 694 731 763 792 826
-10579 826 854 875 891 902 907 904 892 874 843 805 758 701 639 578 518 465 417 376 340 308 283 264 251 242 239 237 237 236 236 236 235 235 235 235 235 235 235 229 220 215 206 183 157 135
-10603 135 109 79 49 19 -10 -35 -54 -63 -64 -63 -57 -43 -29 -12 0 7 10 4 -6 -14 -23 -43 -62 -82 -102 -122 -141 -161 -180 -200 -219 -239 -258 -270 -281 -293 -304 -316
-10623 -316 -327 -339 -350 -361 -372 -383 -394 -394 -395 -395 -396 -388 -381 -373 -366 -358 -351 -344 -336 -329 -323 -316 -309 -309 -306 -297 -282 -258 -228 -193 -154 -123 -93 -59 -31 -10 1 5 1 -6 -21 -48 -79 -117 -161
-10648a61m1m1m8m6m0l5k7k2j7j1lOJ7K1K5K7K7K6K8K8K7K8J7J6J6J7J6J6J7J6K7K6K7K5K7
-10667C1K7K6K7K2K2K4J9J3RLkoormPJ3J9K1J8J6RNkpj4j6j3j4j5j4j4j5j5j5rrj0pNJ0QQ
-10690A46MNMMNMMNJKJKJ2J1J2J2J3J3J4J1Mjpj0rrrr%J%JJJKJJJKJLLMLMMLNJ1J6K1K6K6
-10719C76K9K7K7K4K0J4RKmqj3k4k6k5k4k0j4nMPJ2J9K1K1J9J3PKlqj3j6j8j5j8k2k5l2l6
-10740B84l6m0l8l8l2k9l4k9j5j2j6j2OJ1OJ1J7K0J9J8J3J0J4Rkqlqj8j8j9j9qpj0oKQLOJ5
-10763A5J6J6J4KlKkj6j9j7j6j6j6j5j6nnonkjkkjkkkj2j5j1j6k8l3k9l1l3l2l5k9k2j3nM
-10786d46J5K3K7L2L5L5L5L5L1L1L2K9K4J8K2K0J0J1J1J1J2RJ3Qpj2qj1j0j0j0rnlmmmmmm
-10808b6pqpqj6k0j5k0k7k7k8k7l4l1k4j9rjQJ6L0L6L4L4K6K7K6K6J7J6J6J6K3K3K1K6L8M3
$$ plain form
-10648 -161 -202 -243 -291 -337 -377 -412 -439 -461 -478 -489 -492 -486 -469 -448 -423 -396 -369 -343 -315 -287 -260 -232 -215 -199 -183 -166 -150 -134 -117 -101 -74 -48 -21 4 31
-10667 31 58 84 111 133 155 179 198 211 220 223 221 215 209 200 196 203 216 235 256 274 290 299 304 302 295 281 265 252 238 223 209 195 180 165 150 141 132 122 115 120 130 138 146
-10690 146 150 155 159 163 168 172 176 181 182 184 185 187 199 210 222 234 247 260 274 285 289 288 281 271 262 253 244 235 235 236 236 237 238 239 241 242 243 244 246 247 250 253 257 260 264 268 271 276 287 303 324 350 376
-10719 376 405 432 459 483 503 517 526 528 524 516 503 479 453 428 404 384 370 365 369 376 388 407 428 449 468 481 488 490 487 479 466 450 432 417 399 377 352 320 284
-10740 284 248 208 170 132 100 71 37 8 -7 -19 -35 -47 -41 -30 -24 -13 4 24 43 61 74 84 98 107 105 97 94 86 68 50 31 12 4 -3 -13 -19 -17 -9 -6 0 15
-10763 15 31 47 61 63 60 62 60 44 25 8 -8 -24 -40 -55 -71 -76 -81 -87 -92 -94 -95 -97 -99 -100 -102 -104 -106 -118 -133 -144 -160 -188 -221 -250 -281 -314 -346 -381 -410 -432 -445 -450 -446
-10786 -446 -431 -408 -381 -349 -314 -279 -244 -209 -178 -147 -115 -86 -62 -44 -22 -2 8 19 30 41 53 62 75 83 76 64 56 45 35 25 15 6 1 -2 -6 -10 -14 -18 -22 -26
-10808 -26 -33 -41 -48 -56 -72 -92 -107 -127 -154 -181 -209 -236 -270 -301 -325 -344 -353 -354 -346 -330 -300 -264 -230 -196 -170 -143 -117 -91 -74 -58 -42 -26 -3 20 41 67 105 148
-10829A48L8M2N3N6N5N4N3N3N6N1M4L9K9K1J3OJlj4k0j5j8j7j8j7j8roj0oJLKKlq%rl3l8l4
-10851E24l7m3m3m4m4l3l3l4l3k2k2k2k1k2k2k2k2j2j3j3j4j3j3j3j4ppppLLLMJ6K1J5K0K6
-10872a7K7K8K5K5K0RJj0j8k6l5m5n2n7o1n3n3n6n0m6m2l0k2j0JJ3K6M3N1N5O0N3N3N5N2M5
-10891d1M0M4M0K8K2K8K3MjNjqqrqopoooooollnjJ2J6J1J7K4K4K6K3J0NJ1Nrj3j1j1j1j1j2
-10916B03j1JJJJ%JJJJ4J4J4J4J6J2J7J1JmkkkkkkOPOPmmlnj5k0j4k0l1l5l3l2l3k7j7rkP
-10942B5RJ5K0K1K0K1J1J1J1J1J9J9J9J8J9J9J9J9RNJ0Oqj0rj0j1j1j1j1kJlJJ0J4J1J2J2
-10963C31J1J4Rj0j5j0j5k8l1k9l0l1l2l1l1l2l1l1l0j8j6j6j7j6j7j6j7mknlmmknrj1j0r
-10985b53j0j0j1rMOMONMOMoqnqnoplNJ2K2K9L0L6M2M5M5M3L7L2L2K8K1J8J6J5J4J5J5J4J4
$$ plain form
-10829 148 186 228 281 337 392 446 499 552 608 659 703 742 771 792 805 811 812 809 795 775 760 742 725 707 690 672 663 657 647 641 642 645 647 649 646 638 638 629 596 558 524
-10851 524 487 444 401 357 313 280 247 213 180 158 136 114 93 71 49 27 5 -7 -20 -33 -47 -60 -73 -86 -100 -107 -114 -121 -128 -125 -122 -119 -115 -99 -78 -63 -43 -17
-10872 -17 10 38 63 88 108 117 118 108 90 64 29 -16 -68 -125 -186 -239 -292 -348 -398 -444 -486 -516 -538 -548 -547 -534 -508 -465 -414 -359 -299 -246 -193 -138 -86 -41
-10891 -41 -1 43 83 111 133 161 184 188 187 192 191 183 175 166 158 152 145 139 133 127 121 115 109 106 103 98 97 109 125 136 153 177 201 227 250 260 265 276 281 272 259 248 237 226 215 203
-10916 203 192 193 194 195 196 196 197 198 199 213 227 241 255 271 283 300 311 312 308 306 304 302 300 298 296 302 309 315 322 318 314 311 306 291 271 257 237 206 171 138 106 73 46 29 20 18 25
-10942 25 34 49 69 90 110 131 142 153 164 175 194 213 232 250 269 288 307 326 335 340 350 356 348 338 329 319 308 297 286 275 273 274 271 272 282 296 307 319 331
-10963 331 342 356 365 355 340 330 315 287 256 227 197 166 134 103 72 40 9 -22 -52 -70 -86 -102 -119 -135 -152 -168 -185 -189 -191 -196 -199 -203 -207 -209 -214 -223 -234 -244 -253
-10985 -253 -263 -273 -284 -293 -289 -283 -279 -273 -268 -264 -258 -254 -260 -268 -273 -281 -286 -292 -299 -302 -297 -285 -263 -234 -204 -168 -126 -81 -36 7 44 76 108 136 157 175 191 206 220 235 250 264 278
-11008B78J4OMOMmpnnnlokJ1J4J3J3QPQPQQPPKjLkk0k6k1k6l6l9l7l8l4k8k6j7j2jJ1K3L1
-11033I2M0M5M8M0M1M3L9L3L0L2L1K4K4K5K2J6J1J5J3JjLkj4k0j2k1m3m8m5m7m5m6m7m4l8
-11053A95l3l8l3k1j6k1j6nkllkkllRJ0J0RJ0J0J0J0LKLLLLLKNMNMMNMMMMMLnqmrj8j9j9j8
-11081D4j1oj1oRJ4J1J1J2J2J1J2KKKJKKKKMNOMmplpj0j0j1qoJJ0J9K6L0K9K8L1K8L2K8J4
-11105C46RJ4J0lqmoj8k1j8k0j9j9k0j9j8j7j8j7j8j8j7j8j4j4j6j3o%pkJ2J7J2J7L0L3L1
-11126A43L2K4K3K5K3J3J4J2J5K1K1K3K0J3Oqj9k9l8m3m4m7m3l9l1j8j3pmjJjJRJ1J0RJ2Q
-11147A04J2Qj4j7j5j6j6j5j7j4pnqnMMMMPPPPknkmj1j7j3j5k4k4k5k4j7j7j3j0o%MRJ3J5
-11171a69J3J4J5J4J5J4QPQPQPQPQPQOPPPOJ2QLlprj4j4rj0j2rrlKNJ0J1J0RJJJJj0j0j0j0
$$ plain form
-11008 278 292 298 302 308 312 308 301 296 291 286 283 277 275 286 300 313 326 334 341 349 356 364 372 379 386 388 387 390 388 368 342 321 295 259 220 183 145 111 83 57 40 28 27 38 61 92
-11033 92 132 177 225 265 306 349 388 421 451 483 514 538 562 587 609 625 636 651 664 665 664 667 665 651 631 619 598 555 507 462 415 370 324 277 233 195
-11053 195 162 124 91 70 54 33 17 12 10 7 4 2 0 -3 -6 3 13 23 32 42 52 62 72 75 77 80 83 86 89 92 94 99 103 108 112 116 121 125 129 133 137 141 144 139 131 127 118 100 81 62 44
-11081 44 33 27 16 10 19 33 44 55 67 79 90 102 104 106 108 109 111 113 115 117 121 126 132 136 132 125 122 115 105 95 84 76 70 71 81 100 126 156 185 213 244 272 304 332 346
-11105 346 355 369 379 376 368 364 358 340 319 301 281 262 243 223 204 186 169 151 134 116 98 81 63 49 35 19 6 0 0 -7 -9 3 20 32 49 79 112 143
-11126 143 175 199 222 247 270 283 297 309 324 345 366 389 409 422 428 420 401 372 334 291 247 200 157 118 87 69 56 49 45 44 45 44 45 54 65 75 84 96 104
-11147 104 116 124 110 93 78 62 46 31 14 0 -7 -12 -20 -25 -21 -17 -13 -9 -2 5 12 19 17 12 10 6 -5 -22 -35 -50 -74 -98 -123 -147 -164 -181 -194 -204 -210 -210 -206 -197 -184 -169
-11171 -169 -156 -142 -127 -113 -98 -84 -76 -69 -61 -54 -46 -39 -31 -24 -16 -9 -1 5 12 19 26 32 44 52 55 52 45 36 22 8 -1 -11 -23 -32 -41 -44 -42 -37 -27 -16 -6 3 4 5 6 7 -3 -13 -23 -33
-11198c3j0j0j0j1mnmooj2j7k2l1l4l3l2k8k3j3m%MPQJ4RMjnqpoqppqj4j3j4j4j5j5j3p%Q
-11223d56J7K5K9L5L6L7L6L1K7K1J8J4J1J1J1J1J7J6K1K0K5K6K6K6K6K6K6K6K6K6K4K5K2J7
-11242C35J4RLkpj1j4j5j4j4j2okMRJ4J8K3K4K7L1L2L7L7L4L3L5L2K8K3J8J3J2OKmoj1j7k1
-11264F97k9l4m1m3m3m3l8l8l1l0l1l1l0l0k6k4j8j3qm%NJ0J5J9K3K6K6K6K6K3J8RLkpj0j4
-11284C08j3j1lJOJ2J8K4K6K6K1J7J1PJnj0j3j7j7j7j7j1j0j0j0%%J%llklj3j3j3j3rqrqr
-11308B09qj0oRJ3RJ4K5K9K8K5J7J0Jprj4k1k3k4k4k6k2j7j2j8j2mkmjOQQPJ1J1J2Rmrmqk4
-11332A48k9k4k9l5l7l6l6k7k2k7k2j0nrpmnmmnmmnj3j3j3j3j3j3j3j3qqj0ojQK1L3M2N0N5
-11355a70N8N8N5M9M4M0L1K2J4N%nj1j1j1j1j1kjkjPQQPQQPQPPQPllllKKKKqj0nj1k0k3k2
$$ plain form
-11198 -33 -43 -53 -63 -74 -78 -83 -87 -93 -99 -111 -128 -150 -181 -215 -248 -280 -308 -331 -344 -348 -348 -344 -337 -329 -315 -306 -302 -303 -308 -316 -323 -329 -337 -344 -351 -359 -373 -386 -400 -414 -429 -444 -457 -464 -464 -456
-11223 -456 -439 -414 -385 -350 -314 -277 -241 -210 -183 -162 -144 -130 -119 -108 -97 -86 -69 -53 -32 -12 13 39 65 91 117 143 169 195 221 247 271 296 318 335
-11242 335 349 358 361 359 352 341 327 312 298 284 272 266 264 268 277 291 309 332 356 383 414 446 483 520 554 587 622 654 682 705 723 736 748 754 756 752 746 735 718 697
-11264 697 668 634 593 550 507 464 426 388 357 327 296 265 235 205 179 155 137 124 116 112 112 117 127 142 161 184 210 236 262 288 311 329 338 341 339 332 322 308
-11284 308 295 284 281 282 288 300 318 342 368 394 415 432 443 450 451 446 436 423 406 389 372 355 344 334 324 314 314 314 315 315 312 309 307 304 291 278 265 252 243 235 226 218 209
-11308 209 201 191 185 194 207 216 230 255 284 312 337 354 364 365 358 349 335 314 291 267 243 217 195 178 166 148 136 132 130 126 125 131 139 147 154 165 176 188 197 193 184 180 172 148
-11332 148 119 95 66 31 -6 -42 -78 -105 -127 -154 -176 -186 -191 -200 -207 -211 -216 -220 -224 -229 -233 -237 -242 -255 -268 -281 -294 -307 -320 -333 -346 -354 -362 -372 -378 -379 -371 -350 -317 -275 -225 -170
-11355 -170 -112 -54 1 50 94 134 165 187 201 206 206 201 190 179 168 157 146 144 143 141 140 147 155 163 170 178 186 193 201 208 215 223 230 227 224 221 218 220 222 224 226 218 208 203 192 172 149 127
-11381A27k2k2k2k2k2j2qj4qLQMPOQPPPQPPJ2J2J1J2K2K2K2K2K7K6K7K6J7J5J8J4jnjnj3j3
-11404C21j4j2LQKQJ4J6J7J4OJPJj2j4j3j3qppppqppj5j4j5j4j3j3j6j0pKJ1J8L3L7L5L4L8
-11428C73L2K7K2J2Lnj3j9k7l8m3n1n7n4n3n1m2k8j7oRK0L0M1M6N4N5N0M5L7K4J5Krk1l2l8
-11448B93m4m6l9l8m1l6k9j9j1kJRJ9K5L5M0L8L7L0K5L1K4Jp%nj0j0j0j0j1j0j0j0j4j4j4
-11468A68j4k4k4k4k4j6j0j5j1KOKOJ9K2J9K2K0K0K1K1K4K4K5K4J5J2J7J1Ll%Jj%%%J2J1J2
-11490C73J2J2J2J1J3K7L2K8K9K1J6K3J5lrnpj7j7j7j7k1k2k2k2l2l3l2l2l7l7l8l6l1k6j6
-11509I5pLJ2J5K0K3K3K6K0RMRMqj4j0j1j2j2j2j3jkkkllknj1j6j0j6k6k9k8k7k9k6l1k5j2
-11532a42pj2pNJ0OQJ4J3J4J4J4J4J2J7K7L3K8L3M1M0M2M0K9K5L0K5J3QJ1RJk%jjjJlj4j9
$$ plain form
-11381 127 105 83 61 39 17 5 -3 -17 -25 -22 -14 -10 -3 3 11 18 25 32 40 47 54 66 78 89 101 123 145 167 189 216 242 269 295 312 327 345 359 358 353 352 347 334 321
-11404 321 307 295 298 306 308 316 330 346 363 377 383 384 391 392 380 366 353 340 332 325 318 311 304 296 289 282 267 253 238 224 211 198 182 172 165 167 178 196 229 266 301 335 373
-11428 373 405 432 454 466 469 464 451 432 405 367 324 273 216 162 109 58 16 -12 -29 -35 -26 -6 24 65 111 165 220 270 315 352 376 391 393 384 363 331 293
-11448 293 249 203 164 126 85 49 20 1 -10 -12 -11 -2 17 42 77 117 155 192 222 247 278 302 303 296 296 291 281 271 261 251 240 230 220 210 196 182 168
-11468 168 154 130 106 82 58 42 32 17 6 8 14 16 22 41 63 82 104 124 144 165 186 210 234 259 283 298 310 327 338 341 338 338 339 338 338 338 338 350 361 373
-11490 373 385 397 409 420 433 460 492 520 549 570 586 609 624 621 612 607 600 583 566 549 532 511 489 467 445 413 380 348 316 279 242 204 168 137 111 95
-11509 95 88 91 103 118 138 161 184 210 230 239 243 252 256 248 234 224 213 201 189 177 164 163 161 159 157 154 151 149 144 133 117 107 91 65 36 8 -19 -48 -74 -105 -130 -142
-11532 -142 -149 -161 -168 -163 -153 -147 -139 -125 -112 -98 -84 -70 -56 -44 -27 0 33 61 94 135 175 217 257 286 311 341 366 379 387 398 407 408 406 406 405 404 403 404 401 387 368
-11555C68j4j9l1l6l2l5m2m1m2m2l3k9l4k9j4rj5rMPMPRJ0J1Rnj0mj0j3j4j4j5j4j4j4j4o
-11576b24nonj5j7j3j8k5k5k7k3j1nj1oORPQQPQQJ1J1J1J1J1J1J1J1RRRQRRRROPOOPOOPRR
-11603a47RRJ9J9J9K0K9K8K8K9K0J7K1J7J1J0J1J1K0K1K1K0J0NJ1NjllkNONNNNONJ4J5J4J5
-11625C84J4J4J5J4J3J1J4J0KKKKJ0J1J0J1J1J0J1J0MMLMMLML%kKmj3j9k9l8m5n5n7o3o1n8
-11648A68n4m5l4k2j0KRJ8K4K3K3J7J3PJkjjjjjjj%jjmllmllmlNNNONNNNJ%J%J%J%JJ%JJ%
-11679A51JJppopoppok1k1k2k1k0k1k1k1k5k4k5k5j4j4j4j5j6j7j7j6k6k6k7k4k3j7pKJ0J6
-11701d12K1K6K7L3L8M2M3M7M5M5L9L5M0L6J6J1J7J1qj4rj2j1j1j1j1j1j1j0j1k1k0k1k1k7
-11720h0k8k7k8l3l2k4k0j2pkMNOOPKLJMOJ1J5K3L0L9N0N4N8N9O2N7M8M3L7L2K5J9J4RKlr
$$ plain form
-11555 368 354 335 304 268 236 201 159 118 76 34 1 -28 -62 -91 -105 -114 -129 -138 -134 -127 -123 -116 -107 -97 -86 -77 -82 -92 -96 -106 -119 -133 -147 -162 -176 -190 -204 -218 -224
-11576 -224 -229 -235 -240 -255 -272 -285 -303 -328 -353 -380 -403 -414 -419 -430 -436 -430 -421 -414 -406 -398 -391 -383 -375 -364 -353 -342 -331 -320 -309 -298 -287 -278 -269 -260 -252 -243 -234 -225 -216 -210 -203 -197 -191 -184 -178 -172 -165 -156 -147
-11603 -147 -138 -129 -110 -91 -72 -52 -23 5 33 62 82 99 120 137 148 158 169 180 200 221 242 262 272 277 288 293 292 289 286 284 289 295 300 305 310 315 321 326 340 355 369 384
-11625 384 398 412 427 441 454 465 479 489 491 493 495 497 507 518 528 539 550 560 571 581 585 589 592 596 600 603 607 610 610 608 610 606 593 574 545 507 462 407 350 287 226 168
-11648 168 114 69 35 13 3 5 14 32 56 79 102 119 132 139 140 138 137 136 135 134 133 132 131 131 130 129 125 122 119 115 112 109 105 102 107 112 117 123 128 133 138 143 144 144 145 145 146 146 147 147 148 149 149 150 151 151
-11679 151 152 153 146 139 133 126 120 113 106 100 79 58 36 15 -5 -26 -47 -68 -93 -117 -142 -167 -181 -195 -209 -224 -240 -257 -274 -290 -316 -342 -369 -393 -416 -433 -440 -438 -428 -412
-11701 -412 -391 -365 -338 -305 -267 -225 -182 -135 -90 -45 -6 29 69 105 121 132 149 160 152 138 129 117 106 95 84 73 62 51 41 30 9 -11 -32 -53 -80
-11720 -80 -108 -135 -163 -196 -228 -252 -272 -284 -291 -293 -289 -284 -278 -272 -265 -263 -260 -259 -255 -249 -238 -223 -200 -170 -131 -81 -27 31 90 152 209 257 300 337 369 394 413 427 436 438 435 426
-11743D26j3j4j7j6j6k1k0k0k0k1k0k0k1l2l2l2l2l0k4j9j4pkLRRJ5J9K4K6K6K6K6K6K7K7
-11762B26K6J3J3J3J3NNJkmj0j5j9k1k3k2k2k4k4k4k5k4k4k4k3j5j5j5j4nmnmlllllmllKK
-11786a13L%oj2j7k1j7j8j4j2plMPOJ0J2J5J3J9K4K8L4M0M0M2M3M2L7L7L1L0K6K3J9J4RLM
-11807C75LLLKKLKNNMNmplqj7j9j8j8k0k1j6j4rnJNPJ1J8K0K1K0K1K1J1J1J1J1J0J1J1J0J3
-11831D77J2J0NKlrj2j6j5j6j5j4j5j4j4mmlmlkkkmllnj0j6k6l4m0m6m4m2l4k8k4j7j1ojN
-11854e0RJ2J1J1J1J2J2J2LMLNJ1J6J3J5K2K2K4K1J4J1J4J1JjLkj4k0j5j9l1l3l2l3l3l0l4
-11876d4l2j9j7k0j7rprpKNLNJ8K3J9K3L5L9L5L8L6L6L8L4L0K4J4Ojrj2j8k8l0k9k9k4j8q
-11897G6%NJ2K3K8K6K6K8K4J5Pkj0j8k2k0k0k1j8k1j8j0rrj0j4j5j4j5j3j5j4j5j2j3j2j3
$$ plain form
-11743 426 413 399 382 366 350 329 309 289 269 248 228 208 187 155 123 91 59 29 5 -14 -28 -35 -37 -34 -25 -16 -1 18 42 68 94 120 146 172 199 226
-11762 226 252 265 278 291 304 309 314 315 313 309 299 284 265 244 221 199 177 153 129 105 80 56 32 8 -15 -30 -45 -60 -74 -79 -83 -88 -92 -95 -98 -101 -104 -107 -111 -114 -117 -115 -113
-11786 -113 -110 -110 -116 -128 -145 -166 -183 -201 -215 -227 -234 -237 -233 -226 -220 -210 -198 -183 -170 -151 -127 -99 -65 -25 15 57 100 142 179 216 247 277 303 326 345 359 368 371 375
-11807 375 378 381 384 386 388 391 393 398 403 407 412 408 401 398 390 373 354 336 318 298 277 261 247 238 233 234 239 246 257 275 295 316 336 357 378 389 400 411 422 432 443 454 464 477
-11831 477 489 499 504 506 503 494 482 466 451 435 420 406 391 377 363 359 355 352 348 345 343 341 339 335 332 329 324 314 298 272 238 198 152 108 66 32 4 -20 -37 -48 -54 -55 -50
-11854 -50 -41 -29 -18 -7 4 16 28 40 43 47 50 55 66 82 95 110 132 154 178 199 213 224 238 249 250 249 252 250 236 216 201 182 151 118 86 53 20 -10 -44
-11876 -44 -76 -95 -112 -132 -149 -158 -165 -174 -181 -179 -174 -171 -166 -148 -125 -106 -83 -48 -9 26 64 100 136 174 208 238 262 276 282 281 272 260 242 214 184 155 126 102 84 76
-11897 76 76 81 93 116 144 170 196 224 248 263 270 268 258 240 218 198 178 157 139 118 100 90 81 72 62 48 33 19 4 -9 -24 -38 -53 -65 -78 -90 -103
-11918a03ljljORPQJ8J8J8J9J6J8J8J8J8J8J8J8J3J3J3J4LLLLJJKJJJK%j0j5rj5k8l0l1k7
-11942D3j6j1j6j1KNLLQRQQRQRQJKJJKJJKJ0J0J0J0J0J0J0J0J9J9J8J9J9J4Mnj4k2l3l8m1
-11966A19m2l4k8k1j3mMJ3J7K6K6J9J7K1J7J0QRRONNNnnonj3j3j4j2JPJPJ3J9J6J6J7J5J8
-11989B51J4mqnppoopmmmnmmmnj4j4j4j4j5j4j4j4j6j5j6j5olplNQMPJ6J8J5J8K1K0K2J9J3
-12014A73QJ1J1PQORJ2J2J3J2J1J0J0J0J3J6K3K6K6K7K4J9J6J0P%pj3j9k1k6k5k5k5k4k4j9
-12035C02j7j3qjJonnoqj1j8k2k5k8l0l3l4l3l5l4m0l9l9l9l6l2k6k1j4plKMONNQPQQOOJ0
-12059b90J2J3J7K4K6L0L0L1L0L0L0L0K9K1J8K2J8J2J1J1J2JJ%JKKKJKKJKOOOOJ0J0J1J0J1
-12082B60RKlj1j5k1k6l0l6l7l8l3k7k4j8rm%OJ4J6J4J4J4J1N%%lkkllkmj2j6k2k7l3l8l5
$$ plain form
-11918 -103 -106 -107 -110 -111 -105 -96 -89 -81 -63 -45 -27 -8 8 26 44 62 80 98 116 134 147 160 173 187 190 193 196 199 200 201 203 204 205 206 208 208 198 183 174 159 131 101 70 43
-11942 43 27 16 0 -11 -9 -4 -1 2 10 19 27 35 44 52 61 69 70 72 73 74 76 77 78 80 90 100 110 120 130 140 150 160 179 198 216 235 254 268 272 267 253 231 198 160 119
-11966 119 77 43 15 -6 -19 -23 -19 -6 11 37 63 82 99 120 137 147 155 164 173 179 184 189 194 189 184 178 173 160 147 133 121 122 129 130 137 150 169 185 201 218 233 251
-11989 251 265 261 253 248 241 234 228 222 215 211 207 203 198 194 190 186 181 167 153 139 125 110 96 82 68 52 37 21 6 0 -3 -10 -13 -8 0 4 11 27 45 60 78 99 119 141 160 173
-12014 173 181 192 203 210 218 224 233 245 257 270 282 293 303 313 323 336 352 375 401 427 454 478 497 513 523 530 530 523 510 491 470 444 419 394 369 345 321 302
-12035 302 285 272 264 263 264 258 253 248 242 234 223 205 183 158 130 100 67 33 0 -35 -69 -109 -148 -187 -226 -262 -294 -320 -341 -355 -362 -365 -363 -359 -353 -348 -343 -335 -328 -320 -312 -306 -300 -290
-12059 -290 -278 -265 -248 -224 -198 -168 -138 -107 -77 -47 -17 13 42 63 81 103 121 133 144 155 167 168 169 169 170 172 174 176 177 179 181 182 184 190 196 202 208 218 228 239 249 260
-12082 260 269 271 268 257 242 221 195 165 129 92 54 21 -6 -30 -48 -57 -61 -61 -55 -41 -25 -11 3 17 28 33 33 33 30 28 26 23 20 18 14 2 -14 -36 -63 -96 -134 -169
-12104a69l5l3k9k4j8j7j2j0qjMQJ6K3L2M0M9M9N3N3M9M4L9K7K3J8J6J8J7J8J8J8J8J8J8J8
-12124C48J9RRJ0RMNMMKJKJpoj1j3j8k2k7l3l3l8m5m7m7m8m7m6l9l4k9k4k3k1j7j5j0mJNN
-12147b66QJ2J1J0J0RJ0QQQQQQQQJ5J5J6J5J6J5J5J6K5K6K5K6K7K5J8J3NJnj0k0k5k8k8k5
-12169D1k4k0j7k1j5j0nl%MMOLLlj0j1j1j0o%RJ8J8K1K1J8J7R%oj0j1j3j0lKOJ2J5K1K4K3
-12192G6K3K1J5RPNOO%J%%rqrpJOJ0J6J6J7K0J5QMkok0k4k9l5l5l9l7l6l7l7l7l6l3l0k4j9
-12216b67k0j4rnl%kk%%%%j0j0j0rqmJPQQRQJ0RRRJ9K0J9K0L0L0L1L0K5K5K6K4J5J6J6J5J6
-12241H2J5J6J6J9J8J9J9RRQRJ3J2J3J3J7J7J7J7J5J2OJ%mj0j4j8k0j9j9k1j9j2pn%OQQPQ
-12264B61QMNNNJ1J2J6J7J5J2PJJmrj5j7k0k3k6k9l2l2k9k5k0ql%LL%j3j8j2j8k4k5k6k5k4
$$ plain form
-12104 -169 -204 -237 -266 -290 -308 -325 -337 -347 -355 -356 -352 -344 -328 -305 -273 -233 -184 -135 -82 -29 20 64 103 130 153 171 187 205 222 240 258 276 294 312 330 348
-12124 348 367 376 385 395 404 408 413 417 421 423 424 426 427 420 414 403 390 372 350 323 290 257 219 174 127 80 32 -15 -61 -100 -134 -163 -187 -210 -231 -248 -263 -273 -277 -276 -271 -266
-12147 -266 -258 -246 -235 -225 -215 -206 -196 -188 -180 -172 -164 -156 -148 -140 -132 -117 -102 -86 -71 -55 -40 -25 -9 16 42 67 93 120 145 163 176 181 182 177 167 147 122 94 66 41
-12169 41 17 -3 -20 -41 -56 -66 -71 -74 -74 -70 -66 -60 -57 -54 -57 -67 -78 -89 -99 -105 -105 -96 -78 -60 -39 -18 0 17 26 26 20 10 -1 -14 -24 -27 -25 -19 -7 8 29 53 76
-12192 76 99 120 135 144 151 156 162 168 168 169 169 169 160 152 143 136 137 143 153 169 185 202 222 237 245 249 247 241 221 197 168 133 98 59 22 -14 -51 -88 -125 -161 -194 -224 -248 -267
-12216 -267 -287 -301 -310 -315 -318 -318 -320 -322 -322 -322 -322 -322 -332 -342 -352 -361 -369 -373 -372 -365 -357 -349 -340 -332 -322 -313 -304 -295 -276 -256 -237 -217 -187 -157 -126 -96 -71 -46 -20 4 19 35 51 66 82
-12241 82 97 113 129 148 166 185 204 213 222 230 239 252 264 277 290 307 324 341 358 373 385 391 392 392 388 378 364 346 326 307 288 267 248 236 229 224 224 230 238 246 253 261
-12264 261 269 273 278 283 288 299 311 327 344 359 371 378 379 380 376 367 352 335 315 292 266 237 205 173 144 119 99 91 88 88 91 94 94 81 63 51 33 9 -16 -42 -67 -91
-12287i1k3k4k2qmqmJ4K2J5K0L3L6L5L3K9K9K9K8K4K3K4K3J4J3J4J3LLMJoj2pj1l0l6l0l5
-12308A31m1m1m1m0l0l0l1k9k3j9j3qoKJ3J7K8L2L0L0K4J8K5J6lj1nrj8j8j8j8rpj0oOJ2P
-12329i3J0J4J4J7J1pj2pj2j7j7j9j6lKlJNOONmnmmPJ2PJ2J4J4J7J2jjkjJ4J8J3J8L2L6L4
-12353A23L4K7K1K7K2Jn%loprmJ3J9J4J8L2L4L4L2K0J4K0J5mrnpqrqqKKJKJJ%Jrj0j0rj6j5
-12379C69j4j6k3k8k4k6l2l1l2l2l2l2l1l1m0m0m0m0m1l8l1k7k0j1mOJ4K0K5L0K7K8L1K5J9
-12398a22J0Koj6k0j9j8j7j1j7j3%NKKkm%nj8k3j9k2l0l0l1k9k4k0j4j0pJRJ8K7L3K9L0K8
-12419c51K4K9K4J7J5J5J6J6J6J5J6K1K1K2K1K1K1K1K1KLLLLKLLMNMNMNNMJ6J8J4J9K5K8K7
-12442B26K7L2L3L2L2K5J9K5K0lrlqk1k5k1k5l8m1m0m0m0l9m0m0l2k9l4k8j7j1j7j2nllml
$$ plain form
-12287 -91 -114 -138 -160 -168 -172 -180 -184 -170 -148 -133 -113 -80 -44 -9 24 53 82 111 139 163 186 210 233 247 260 274 287 290 293 297 298 292 280 273 262 232 196 166 131
-12308 131 90 49 8 -32 -62 -92 -123 -152 -175 -194 -207 -215 -221 -219 -206 -189 -161 -129 -99 -69 -45 -27 -2 14 11 0 -5 -14 -32 -50 -68 -86 -95 -102 -112 -118 -112 -100 -93
-12329 -93 -83 -69 -55 -38 -27 -34 -46 -53 -65 -82 -99 -118 -134 -137 -135 -138 -137 -132 -126 -120 -115 -119 -124 -128 -132 -125 -113 -106 -94 -80 -66 -49 -37 -38 -39 -41 -42 -28 -10 3 21 53 89 123
-12353 123 157 184 205 232 254 255 250 250 247 241 234 225 221 234 253 267 285 317 351 385 417 437 451 471 486 482 473 468 461 453 444 436 428 430 432 433 435 436 437 437 438 429 419 409 400 384 369
-12379 369 355 339 316 288 264 238 206 175 143 111 79 47 16 -15 -55 -95 -135 -175 -216 -254 -285 -312 -332 -343 -347 -341 -327 -307 -282 -252 -225 -197 -166 -141 -122
-12398 -122 -112 -110 -116 -132 -152 -171 -189 -206 -217 -234 -247 -247 -242 -240 -238 -240 -244 -244 -249 -267 -290 -309 -331 -361 -391 -422 -451 -475 -495 -509 -519 -526 -525 -516 -498 -471 -438 -409 -379 -351
-12419 -351 -327 -298 -274 -257 -242 -227 -211 -195 -179 -164 -148 -127 -106 -84 -63 -42 -21 0 21 23 26 29 32 35 37 40 43 47 52 56 61 65 70 75 79 95 113 127 146 171 199 226
-12442 226 253 285 318 350 382 407 426 451 471 468 459 456 448 427 402 381 356 318 277 237 197 157 118 78 38 6 -23 -57 -85 -102 -113 -130 -142 -147 -150 -153 -157 -160
-12463a60mkoj3j9j4j7k2j8j5oMJ3K1K9L8M2M0M0L4L2L5L1J9J4J8J5RRQRLLMLkklkklkkJ1
-12487A70J5J1J4K1K5K1K4K7K6K7K7K5K6K8K2J2Lnj4k8l3l0l0k9k7l1k5j4rj3j0jkl%PJ2O
-12508B45J2K6L1L9L9L9L5K4J6Pkmj0j9k1j9k0rlrlJ5K0J6J9K5K5K8K2MjMjj7k2j7k3l4l9
-12529D18l6l8m3m4m4m4m4m4m4m2l7l4l7l3k5j6p%RJ3K1K2J6J6J7J4J2Olj2j9k7l0l6l9m0
-12549b54m1l8l3k7l3k8rmrmQJ3RJ1J5J4J6J3J2QKklkmkOJ1J5K2L4L8M4M9N0N1N2M8M3L8L5
-12571A64K6J5PMkoj0j3j4k0k2k1k2j9j9j6j2qlKPJ1J7J8J8J8J2Kprj8k8l3l7m0l9l9l7l4
$$ plain form
-12463 -160 -164 -166 -172 -185 -204 -218 -235 -257 -275 -290 -296 -292 -279 -258 -229 -191 -149 -109 -69 -35 -3 32 63 82 96 114 129 138 147 155 164 167 170 174 177 175 173 170 168 166 163 161 159 170
-12487 170 185 196 210 231 256 277 301 328 354 381 408 433 459 487 509 521 524 519 505 477 444 414 384 355 328 297 272 258 249 236 226 225 223 220 220 227 239 245
-12508 245 257 283 314 353 392 431 466 490 506 513 511 507 497 478 457 438 418 409 406 397 394 409 429 445 464 489 514 542 564 568 567 571 570 553 531 514 491 457 418
-12529 418 382 344 301 257 213 169 125 81 37 -5 -42 -76 -113 -146 -171 -187 -194 -194 -185 -172 -151 -129 -113 -97 -80 -66 -54 -48 -51 -63 -82 -109 -139 -175 -214 -254
-12549 -254 -295 -333 -366 -393 -426 -454 -463 -467 -476 -480 -472 -459 -450 -439 -424 -410 -394 -381 -369 -361 -359 -361 -364 -366 -370 -372 -366 -355 -340 -318 -284 -246 -202 -153 -103 -52 0 48 91 129 164
-12571 164 190 205 212 216 214 208 198 185 171 151 129 108 86 67 48 32 20 12 9 11 18 29 46 64 82 100 112 114 107 98 80 52 19 -18 -58 -97 -136 -173 -207
$$ [...]
-17857E6
##END=	
##END=	
