##TITLE=	LS00027756.11.ser
##JCAMPDX=	6.0	$$ NMR Plug-in 1.13 of MestReNova 11.0.4-18998
##DATATYPE=	NDNMRSPECTRUM
##DATACLASS=	NTUPLES
##NUMDIM=	2
##ORIGIN=	Bruker BioSpin GmbH
##OWNER=	best
##.OBSERVEFREQUENCY=	700.03337856742598433
##.OBSERVENUCLEUS=	^1H
##.SOLVENTNAME=	DMSO
##.PULSESEQUENCE=	hsqcetgpsp.2
##LONGDATE=	2007/10/29 13:33:00.000
##.ACQUISITIONMODE=	SIMULTANEOUS (DQD)
##$ORIGINALFORMAT=	Bruker XWIN-NMR
##$PARAMETERFILE=	(acqu2s, ASCII, /var/folders/bp/m_4195y96sx1d256lqvkcvym0000gq/T/rEuhRoZGTVCAi2E0oLJE9g/HSQC/acqu2s, 0)
$$ ##TITLE= Parameter file, TOPSPIN		Version 2.0
$$ ##JCAMPDX= 5.0
$$ ##DATATYPE= Parameter Values
$$ ##NPOINTS= 1	$$ modification sequence number
$$ ##ORIGIN= Bruker BioSpin GmbH
$$ ##OWNER= best
$$ $$ 2007-11-05 15:19:52.234 +0000  best@ukapdwlx069
$$ $$ /opt/topspin/data/routine2007/nmr/LS00027756/21/acqu2s
$$ $$ process /opt/topspin/prog/mod/dirdata
$$ ##$ACQT0= 0
$$ ##$AMP= (0..31)
$$ 100 100 100 100 100 100 100 100 100 100 100 100 100 100 100 100 100 100 
$$ 100 100 100 100 100 100 100 100 100 100 100 100 100 100 
$$ ##$ANAVPT= 1
$$ ##$AQSEQ= 0
$$ ##$AQ_mod= 2
$$ ##$AUNM= <>
$$ ##$AUTOPOS= <>
$$ ##$BF1= 176.022684
$$ ##$BF2= 90.5625
$$ ##$BF3= 100.13
$$ ##$BF4= 500.13
$$ ##$BF5= 500.13
$$ ##$BF6= 500.13
$$ ##$BF7= 500.13
$$ ##$BF8= 500.13
$$ ##$BYTORDA= 0
$$ ##$CFDGTYP= 0
$$ ##$CFRGTYP= 0
$$ ##$CHEMSTR= <none>
$$ ##$CNST= (0..63)
$$ 1 1 1 1 1 1 1 1 1 1 1 1 1 1 1 1 1 1 1 1 1 1 1 1 1 1 1 1 1 1 1 1 1 1 1 
$$ 1 1 1 1 1 1 1 1 1 1 1 1 1 1 1 1 1 1 1 1 1 1 1 1 1 1 1 1 1 
$$ ##$CPDPRG= <>
$$ ##$CPDPRG1= <mlev>
$$ ##$CPDPRG2= <mlev>
$$ ##$CPDPRG3= <mlev>
$$ ##$CPDPRG4= <mlev>
$$ ##$CPDPRG5= <mlev>
$$ ##$CPDPRG6= <mlev>
$$ ##$CPDPRG7= <mlev>
$$ ##$CPDPRG8= <mlev>
$$ ##$CPDPRGB= <>
$$ ##$CPDPRGT= <>
$$ ##$D= (0..63)
$$ 0 0 0 0 0 0 0 0 0 0 0 0 0 0 0 0 0 0 0 0 0 0 0 0 0 0 0 0 0 0 0 0 0 0 0 
$$ 0 0 0 0 0 0 0 0 0 0 0 0 0 0 0 0 0 0 0 0 0 0 0 0 0 0 0 0 0 
$$ ##$DATE= 1193664789
$$ ##$DBL= (0..7)
$$ 120 120 120 120 120 120 120 120 
$$ ##$DBP= (0..7)
$$ 150 150 150 150 150 150 150 150 
$$ ##$DBP07= 0
$$ ##$DBPNAM0= <>
$$ ##$DBPNAM1= <>
$$ ##$DBPNAM2= <>
$$ ##$DBPNAM3= <>
$$ ##$DBPNAM4= <>
$$ ##$DBPNAM5= <>
$$ ##$DBPNAM6= <>
$$ ##$DBPNAM7= <>
$$ ##$DBPOAL= (0..7)
$$ 0.5 0.5 0.5 0.5 0.5 0.5 0.5 0.5 
$$ ##$DBPOFFS= (0..7)
$$ 0 0 0 0 0 0 0 0 
$$ ##$DE= 22.5
$$ ##$DECBNUC= <off>
$$ ##$DECIM= 1
$$ ##$DECNUC= <1H>
$$ ##$DECSTAT= 7
$$ ##$DIGMOD= 1
$$ ##$DIGTYP= 2
$$ ##$DL= (0..7)
$$ 120 120 60 120 120 120 120 12 
$$ ##$DP= (0..7)
$$ 150 150 150 150 150 150 150 150 
$$ ##$DP07= 0
$$ ##$DPNAME0= <>
$$ ##$DPNAME1= <>
$$ ##$DPNAME2= <>
$$ ##$DPNAME3= <>
$$ ##$DPNAME4= <>
$$ ##$DPNAME5= <>
$$ ##$DPNAME6= <>
$$ ##$DPNAME7= <>
$$ ##$DPOAL= (0..7)
$$ 0.5 0.5 0.5 0.5 0.5 0.5 0.5 0.5 
$$ ##$DPOFFS= (0..7)
$$ 0 0 0 0 0 0 0 0 
$$ ##$DQDMODE= 0
$$ ##$DR= 2
$$ ##$DS= 0
$$ ##$DSLIST= <SSSSSSSSSSSSSSS>
$$ ##$DSPFIRM= 0
$$ ##$DSPFVS= 0
$$ ##$DTYPA= 0
$$ ##$EXP= <>
$$ ##$F1LIST= <111111111111111>
$$ ##$F2LIST= <222222222222222>
$$ [...]
$$ -1 -1 -1 -1 -1 -1 -1 -1 -1 -1 -1 -1 -1 -1 -1 -1 -1 -1 -1 -1 -1 -1 -1 -1 
$$ -1 -1 -1 -1 -1 -1 -1 -1 -1 -1 -1 -1 -1 -1 -1 -1 -1 -1 -1 -1 -1 -1 -1 -1 
$$ -1 -1 -1 -1 -1 -1 -1 -1 -1 -1 -1 -1 -1 -1 -1 -1 -1 -1 -1 -1 -1 -1 -1 -1 
$$ -1 -1 -1 -1 -1 -1 -1 -1 -1 -1 -1 -1 -1 -1 -1 -1 -1 -1 -1 -1 -1 -1 -1 -1 
$$ -1 -1 -1 -1 -1 -1 -1 -1 -1 -1 -1 -1 -1 -1 -1 -1 -1 -1 -1 -1 -1 -1 -1 -1 
$$ -1 -1 -1 -1 -1 -1 -1 -1 -1 -1 -1 -1 -1 -1 -1 -1 -1 -1 -1 -1 -1 -1 -1 -1 
$$ -1 -1 -1 -1 -1 -1 -1 -1 -1 -1 -1 -1 -1 -1 -1 -1 
$$ ##$RG_tabA= (0..255)
$$ 0.25 0.28 0.32 0.35 0.4 0.44 0.5 0.56 0.64 0.7 0.8 0.89 1 1.12 1.28 1.4 
$$ 1.6 1.78 2 2.25 2.56 2.8 3.2 3.56 4 4.5 5 5.6 6.35 7.12 8 9 10 11.3 12.7 
$$ 14.2 16 18 20.2 22.6 25.4 28.5 32 36 40.3 45.2 50.8 57 64 71.8 80.6 90.5 
$$ 101 114 128 144 161 181 203 228 256 287 322 362 406 456 512 575 645 724 
$$ 812 912 1030 1150 1290 1440 1620 1820 2050 -1 -1 -1 -1 -1 -1 -1 -1 -1 
$$ -1 -1 -1 -1 -1 -1 -1 -1 -1 -1 -1 -1 -1 -1 -1 -1 -1 -1 -1 -1 -1 -1 -1 -1 
$$ -1 -1 -1 -1 -1 -1 -1 -1 -1 -1 -1 -1 -1 -1 -1 -1 -1 -1 -1 -1 -1 -1 -1 -1 
$$ -1 -1 -1 -1 -1 -1 -1 -1 -1 -1 -1 -1 -1 -1 -1 -1 -1 -1 -1 -1 -1 -1 -1 -1 
$$ -1 -1 -1 -1 -1 -1 -1 -1 -1 -1 -1 -1 -1 -1 -1 -1 -1 -1 -1 -1 -1 -1 -1 -1 
$$ -1 -1 -1 -1 -1 -1 -1 -1 -1 -1 -1 -1 -1 -1 -1 -1 -1 -1 -1 -1 -1 -1 -1 -1 
$$ -1 -1 -1 -1 -1 -1 -1 -1 -1 -1 -1 -1 -1 -1 -1 -1 -1 -1 -1 -1 -1 -1 -1 -1 
$$ -1 -1 -1 -1 -1 -1 -1 -1 -1 -1 -1 -1 -1 -1 -1 -1 -1 -1 -1 -1 -1 -1 -1 -1 
$$ ##$ROUT14= (0..7)
$$ 0 0 0 0 0 0 0 0 
$$ ##$ROUTER= 2
$$ ##$RX22TY= <no>
$$ ##$RXFMAX= (0..7)
$$ 1072 -1 -1 -1 -1 -1 -1 -1 
$$ ##$RXFMIN= (0..7)
$$ 5 -1 -1 -1 -1 -1 -1 -1 
$$ ##$RXINTLV= (0..7)
$$ 1 0 0 0 0 0 0 0 
$$ ##$RXMSTY= <no>
$$ ##$SCMTY= <no>
$$ ##$SGUC1= (0..15)
$$ 0 0 0 0 0 0 0 0 0 0 0 0 0 0 0 0 
$$ ##$SGUC2= (0..15)
$$ 0 0 0 0 0 0 0 0 0 0 0 0 0 0 0 0 
$$ ##$SPECTR= 5
$$ ##$SY2FLAG= 0
$$ ##$TFXNUM= 0
$$ ##$TRIPLO2= 0
$$ ##$VTUTY= <tty05>
$$ ##$WBREFAM= (0..15)
$$ 100 100 100 100 100 100 100 100 100 100 100 100 100 100 100 100 
$$ ##$WBREFPH= (0..15)
$$ 0 0 0 0 0 0 0 0 0 0 0 0 0 0 0 0 
$$ ##$XFAC= 2
$$ ##END=
$$ 
##$DECIM=	3400
##$DSPFVS=	20
##.ACQUISITIONSCHEME=	ECHO-ANTIECHO
##NTUPLES=	NDNMRSPECTRUM
##VARNAME=	FREQUENCY1,	FREQUENCY2,	SPECTRUM
##SYMBOL=	F1,	F2,	Y
##.NUCLEUS=	13C,	1H
##VARTYPE=	INDEPENDENT,	INDEPENDENT,	DEPENDENT
##VARFORM=	AFFN,	AFFN,	ASDF
##VARDIM=	1024,	2048,	2097152
##UNITS=	HZ,	HZ,	ARBITRARY UNITS
##FIRST=	31355.342622953838145,	6319.7438965998480853,	0.074160762131214141846
##LAST=	-1399.524180324909139,	440.26319807043682886,	0.091008037328720092773
##MIN=	-1399.524180324909139,	440.26319807043682886,	-14.912421226501464844
##MAX=	31355.342622953838145,	6319.7438965998480853,	207.1283416748046875
##FACTOR=	-32.018442622950878729,	-2.8722426470588229286,	0.0025891042709350587346
##PAGE=	F1=31355.342622953838145
##FIRST=	31355.342622953838145,	6319.7438965998480853,	0.074160762131214141846
##DATATABLE=	(F2++(Y..Y)), PROFILE
$$ [...]
##PAGE=	F1=14577.678688527576014
##FIRST=	31355.342622953838145,	6319.7438965998480853,	0.091603673994541168213
##DATATABLE=	(F2++(Y..Y)), PROFILE
-1370 54 -3 178 40 52 -23 -16 -9 18 -5 -38 -40 4 62 -29 6 -59 90 164 -16 78 87 -26 33 -36 -33 101 -11 9 94 147 -21 -65 -12
-1337 -12 -63 7 59 21 -26 -141 98 32 -65 -46 -79 -56 1 100 96 41 -112 -8 -115 53 151 112 -59 18 64 -5 44 71 19 6 82 -31
-1305 -31 -10 -27 22 36 20 90 -15 37 139 102 -49 -50 19 95 66 -24 4 56 16 35 -32 -9 69 -41 -135 -7 -15 -65 -61 -39 10 -104 -6
-1272 -6 87 66 63 -20 -53 2 52 16 62 67 35 5 62 -9 -12 30 -16 -32 82 169 24 76 163 -34 -59 -48 6 -92 -78 -63 -31 -89 -53 -61 -42 72
-1236 72 54 46 -161 -59 -3 -10 -41 -79 8 74 54 87 -64 -25 -142 7 72 -58 -92 -15 19 -6 113 66 -34 -8 34 87 8 -34 -46 -10
-1204 -10 90 -64 -54 -32 -2 -87 68 90 28 5 49 63 22 -47 -67 0 88 52 53 -30 -2 -22 -13 -15 79 -94 -83 23 1 66 82 19 117 -25
-1170 -25 -82 -28 0 -99 20 -14 94 83 -19 -51 84 35 21 -99 -129 -63 38 -19 -143 -132 147 -36 -122 63 21 99 41 51 74 19
-1140 19 68 7 -82 -63 -107 -64 -7 20 -131 -4 28 60 7 33 -22 -87 -11 1 -10 7 -7 -17 14 31 101 55 59 -1 0 -50 -16 24 -21 109
-1106 109 -105 90 -38 -109 -246 -46 21 44 -12 102 24 29 7 -51 -24 -10 -24 -2 -7 50 -23 -89 -47 28 14 -107 -13 93 46 65 10
-1075 10 72 166 217 -8 18 31 114 8 2 -113 -171 24 -10 -25 11 69 -2 73 132 57 -63 -104 6 -75 98 44 -26 -21 79 -47 39
-1044 39 -24 0 62 -29 -50 58 -73 -41 -8 -22 -6 -76 111 62 -34 33 92 102 137 77 -7 -53 -58 93 65 -19 110 198 5 15 2 -59
-1012 -59 -83 45 22 17 21 10 16 101 29 -101 73 -16 -65 -42 73 5 25 17 5 -18 52 -62 80 -88 -45 102 -23 -62 -72 -111 -110 63
-980 63 89 140 -39 -31 -25 -41 -128 19 -92 77 -24 118 2 -21 39 73 77 35 -140 -103 349 -31 -61 -148 -33 -90 37 79 42 16 -152
-949 -152 -8 104 80 71 0 4 45 35 14 -101 -146 -57 -74 -74 -55 -41 72 66 129 59 16 88 109 -16 1 -11 229 51 73 76 98 18 34 57
-915 57 -82 -84 -78 3 0 33 -31 89 79 39 35 -140 -18 -10 -4 -110 -106 -60 -48 -94 23 31 -6 -78 11 39 52 -50 -57 -133 51 31 36 12 36 -111
-879 -111 -14 -45 81 -19 -114 28 88 72 16 -134 11 -25 -5 -54 0 -9 99 26 -11 -129 -108 12 -65 -70 9 65 119 28 65 113 -27
-848 -27 39 -69 2 50 -14 -52 1 7 61 76 -43 17 -21 33 -35 -85 -7 -3 74 42 -70 51 -70 -67 30 -21 -52 -38 35 -35 -117 -127 93 -78
-814 -78 54 -13 83 24 -43 58 40 58 -49 -119 4 -79 58 182 37 -15 32 19 -95 -135 -78 -20 -49 28 7 -50 -26 -45 7 3 3 -66
-782 -66 -17 -24 172 71 36 112 145 61 -77 46 69 6 78 27 -17 -17 -67 60 7 -37 24 86 144 6 73 63 -36 49 -51 -95 50 -40
-750 -40 102 14 -4 48 -15 6 -40 -60 1 -2 -63 0 50 -100 -17 8 34 117 49 80 120 -22 -129 -19 54 -51 -55 -31 -120 -120 -13 -7 29 -35
-716 -35 -14 -62 -84 80 -19 7 -62 -112 -56 31 121 -135 53 -50 -68 -71 -1 79 -19 -51 30 -47 21 -27 -56 5 -42 -19 11 88 -8 50 65 -11
-682 -11 74 -105 -107 -3 116 88 53 -103 -19 30 -44 -28 0 47 17 45 -104 4 114 -81 -40 -6 73 -65 -152 -128 62 -16 68 26 -86
-651 -86 -90 28 -34 -67 79 32 -111 57 -29 -33 -109 -11 -2 -84 -34 -98 -143 -39 39 45 107 -50 46 26 -40 -103 -161 -28 40 -95 -79 -91 -50
-618 -50 142 44 20 -175 -20 162 211 315 87 -30 66 51 67 -23 -68 -58 -64 0 -3 68 30 -41 65 56 68 10 -111 67 -25 14 -34 -61
-586 -61 21 1 63 3 -35 18 11 -36 -85 89 -15 -56 -35 -40 -83 6 -95 45 -31 -44 -135 -41 96 -9 -43 9 -29 5 21 30 -40 94 -90
-553 -90 -80 -12 107 92 200 115 14 -45 -49 33 20 -21 -68 7 -36 -1 -80 -54 7 22 -11 93 -74 -98 92 55 -136 -59 24 155 5
-522 5 30 106 46 -24 2 76 5 -42 33 79 85 20 60 -53 -22 -73 18 72 35 26 -113 -35 46 21 -39 32 69 -33 100 -21 -153 -66 -46 -68
-488 -68 -40 51 109 -47 -28 -46 45 -34 14 -24 52 1 -26 -71 54 -37 71 45 34 -63 27 -13 -61 -64 5 43 -31 66 42 37 107 37 3 -12 -90
-453 -90 42 -58 -7 20 64 178 -19 6 -40 6 148 -38 34 115 -15 6 19 124 107 34 -74 -110 0 -38 49 97 26 -2 61 53 -93
-422 -93 141 5 -17 24 43 -100 -25 27 -106 20 101 -38 1 17 -61 -62 -4 41 17 -20 20 71 90 45 71 22 10 16 54 35 33 30 42 131
-388 131 35 -44 89 24 36 17 28 25 140 32 -57 -64 83 66 51 79 61 57 10 -117 17 222 37 94 63 100 -101 -37 82 38 61
-357 61 -10 6 41 1 -60 -2 -27 46 58 18 -67 -19 -28 -49 -63 68 -61 -6 -37 3 16 -84 -25 79 13 -115 12 1 -18 -68 63 -5
-325 -5 81 34 94 -45 -29 69 -95 0 63 -41 112 216 89 -35 -59 -44 -1 87 14 5 -80 -20 -49 -4 -23 -26 -24 105 143 105 25 82 152
-292 152 35 35 -59 -29 78 112 -73 8 -26 111 117 18 -13 50 -44 -23 55 -48 9 201 40 -41 7 -20 -140 -31 6 26 -49 -94 43
-261 43 -36 13 -121 -71 -140 16 -43 136 0 76 -46 -98 -72 8 51 44 72 140 99 -76 -65 -24 48 27 -24 -26 -10 -10 -14 -133 6 -96 63
-228 63 82 -56 -109 -52 -18 -71 -85 -31 -38 -13 16 84 73 50 74 56 100 -22 -60 -16 -8 107 110 51 97 -73 51 59 65 -20 79 62 -21 -124 -20
-193 -20 -30 -21 -47 -54 -47 11 38 40 -21 -61 -18 62 68 -89 5 54 -13 -38 6 -77 37 -36 32 32 17 -17 -23 -47 -124 -76 40 57 27 -9 -29 -30 7 -14
-155 -14 11 67
-153F7
##PAGE=	F1=14513.641803281676403
##FIRST=	31355.342622953838145,	6319.7438965998480853,	0.10817689448595046997
##DATATABLE=	(F2++(Y..Y)), PROFILE
-2200 56 37 10 42 68 2 7 50 5 -70 -40 0 -14 -83 -8 6 -7 62 71 120 -67 30 39 -106 5 98 65 -18 -80 54 82 21 14 115 -1
-2166 -1 -20 -38 0 0 -34 -69 82 -12 29 -47 -67 -64 47 94 0 -76 -11 -70 -99 -90 -153 -65 36 117 -15 22 41 -45 -33 21 -62 -12 -32 68
-2132 68 4 -116 -41 23 56 120 41 82 7 16 -61 48 -85 -101 51 -81 -119 -77 16 50 26 -15 72 6 98 17 -31 20 21 87 48 12 11 33
-2098 33 0 -97 -80 -20 -71 -4 42 140 -10 -57 -30 -68 -98 13 47 -33 -106 -30 -6 -8 -1493 -3403 -1453 -257 -184 -127 -179 -132 -36 32
-2068 32 -198 86 -78 -168 -17 12 0 50 -97 -62 75 -24 -52 -176 -49 31 -51 -26 65 -94 41 -45 71 111 0 32 -148 61
-2040 61 -72 5 92 -41 -67 -23 34 73 181 182 367 382 456 619 457 236 237 81 9 -112 71 -72 59 163 44 15 55 104 115
-2011 115 -43 73 136 -16 -81 -28 -34 -49 -107 48 9 5 -30 -24 10 -27 -115 2 118 76 -67 -37 43 144 68 -43 33 66 -16 -40 11
-1980 11 -26 -32 49 148 -11 -96 -21 13 60 -12 95 -13 26 30 117 97 34 7 48 -1 -98 -15 -46 95 3 236 175 78 717 339 -169 401
-1948 401 -41 30 -35 76 98 33 2 90 85 31 36 -103 -138 -11 -3 -132 -50 -38 -13 47 -8 -140 -62 -78 52 -15 67 -28 -108 -130 51 -125
-1916 -125 43 26 23 -34 27 38 34 66 10 -13 -44 111 -12 -12 -47 -23 -21 34 29 51 146 33 -42 87 -14 -48 -23 79 -29 -3 149 50
-1884 50 -40 63 -34 -56 44 -48 93 -12 -3 -72 -1 -45 31 -25 -17 39 50 98 67 7 -20 3 33 59 48 11 90 68 -11 -92 -110 -39 85
-1851 85 40 -50 -89 67 -103 42 -14 33 -50 -118 78 -15 2 0 85 19 39 -35 -34 76 11 -6 46 96 39 -103 -53 7 -53 6 -21 -14 29
-1818 29 21 0 120 123 -42 43 -4 12 10 -76 -80 4 -30 -63 70 56 67 -35 -64 -211 -126 -103 -4 18 23 68 47 -81 -109 44 82 -97 -1
-1785 -1 -49 -67 106 -103 -84 -56 22 -57 -135 15 -70 -26 -40 6 -10 -117 -110 -183 -103 8 92 38 69 -120 -40 -126 -138 -93 -63 -102 -109 -15 38
-1752 38 7 27 -37 -85 26 91 52 13 42 35 115 136 -3 -5 -33 -17 -21 81 24 31 14 103 169 -13 117 -3 6 -121 9 65 128 -39 -52
-1719 -52 61 -156 159 123 35 91 -20 -95 1 -12 -75 11 80 -33 81 9 17 155 -82 -36 83 83 39 -16 -61 -151 9 -56 -61 139 -26
-1688 -26 -66 70 30 73 -15 -41 -16 -114 -90 44 76 38 20 -18 16 -60 60 -22 19 70 91 124 9 -20 -54 115 135 40 -2 -11 -130 23
-1656 23 69 -73 16 27 50 52 68 70 -75 63 3 61 42 -30 -7 11 78 14 -163 -129 91 -23 -1 39 80 47 113 10 7 79 112 51 -6
-1623 -6 -131 -120 -24 18 96 50 30 -63 -158 -106 -69 -30 -17 -22 104 123 185 108 48 74 -10 -23 -43 -31 -50 -121 2 -61 -58 -19 -13 -7 -36 58 -19 -9
-1587 -9 -61 32 129 70 145 -85 -66 65 -4 -17 -35 -64 28 51 40 95 71 21 -20 2 83 32 -38 -61 4 -36 68 -32 84 44 32 60 -2
-1554 -2 156 70 0 87 42 -12 -14 14 73 133 5 -37 -80 -139 42 35 -1 40 87 -101 -42 78 -151 -88 -55 -16 10 -39 -7 -37 12 11 73 43
-1520 43 23 25 -13 -6 -20 -50 -2 57 84 -3 -33 -92 16 5 5 -36 -48 -27 -124 10 -103 -152 -81 -46 36 -4 -65 16 22 -11 -13 102 -98 113
-1486 113 13 153 2 -65 -138 -146 -67 -54 -42 20 -88 -63 20 34 -45 9 31 -30 41 -58 43 -98 21 0 5 20 35 40 70 34 17 36
-1454 36 59 194 -34 -153 -77 17 167 82 159 52 7 65 -35 -20 -41 -73 -81 89 -76 -29 -29 110 -35 -6 -39 126 54 122 75 37
-1424 37 153 41 67 -3 75 -41 -16 3 98 -117 -71 8 10 53 -65 98 31 28 46 -14 -44 -57 37 46 -21 123 -81 -66 -166 -36 -69
-1393 -69 -27 67 138 70 -108 105 85 -26 -44 -45 22 32 -21 -44 98 31 52 -63 -74 8 15 -27 54 -2 169 22 52 -53 -15 -23 4 -14
-1361 -14 -40 -63 -11 71 -29 15 -38 74 179 -4 61 87 -4 21 -17 -62 91 -26 7 117 150 -21 -82 -10 -43 18 68 16 -13 -139
-1331 -139 98 18 -76 -45 -97 -88 -1 101 77 39 -114 -3 -103 51 149 145 -47 40 74 -4 66 89 45 16 72 -24 -2 -23 19 28 9 89
-1299 89 -28 17 131 59 -11 -45 27 94 64 -29 7 86 51 54 -24 -20 60 -46 -144 -12 -14 -81 -33 -20 -6 -128 -47 91 56 76 -26 -51 -1
-1266 -1 46 13 54 59 48 12 32 10 0 35 -22 -37 79 182 27 80 141 -48 -61 -46 -31 -107 -95 -81 -36 -79 -39 -48 -50 55 53 40 -176 -57
-1232 -57 19 -11 -36 -61 22 67 51 59 -60 -19 -125 6 45 -71 -96 -38 6 -25 105 70 -43 -40 39 92 27 -29 -39 5 114 -71 -58 -21
-1200 -21 -12 -97 76 90 11 19 44 67 32 -38 -58 0 108 39 70 -32 -4 -51 -9 -11 91 -98 -87 3 -10 53 98 23 125 -33 -78 -28 -14
-1167 -14 -113 44 -23 95 120 -27 -61 74 26 32 -116 -125 -74 45 0 -125 -131 146 -47 -126 62 40 97 65 53 62 25 63 -7 -91 -21 -106
-1135 -106 -74 -11 24 -134 -15 24 63 11 23 -22 -88 -34 -38 -5 39 6 -12 11 16 94 60 75 -7 -17 -76 -12 16 -27 118 -114 97 -8
-1103 -8 -82 -250 -42 16 64 -20 94 39 25 31 -37 1 -26 -16 -8 -21 44 -15 -106 -72 22 4 -111 -39 92 39 67 19 87 191 213 0 19
-1070 19 50 116 40 7 -96 -168 33 -7 -28 25 59 14 54 118 61 -62 -116 6 -68 107 51 -8 -5 60 -18 38 -36 -14 47 -6 -52 60
-1038 60 -73 -25 -3 -13 -15 -102 115 70 -27 33 105 76 136 79 -16 -64 -50 103 53 -19 121 176 25 32 13 -68 -66 29 8 13 27 -11 31 109
-1004 109 12 -94 74 -29 -78 -27 61 -5 50 43 0 -55 54 -76 78 -82 -23 97 -24 -50 -47 -116 -104 58 74 163 -10 -25 4 -34
-974 -34 -138 -9 -87 100 -10 128 11 -51 29 73 102 41 -123 -46 327 -48 -53 -143 -55 -96 29 69 36 0 -167 -21 84 77 66 -24
-944 -24 -18 54 23 17 -95 -158 -47 -67 -54 -22 -28 51 43 111 36 34 76 102 25 -10 -64 204 51 77 99 87 7 30 61 -71 -90 -79 22 -1 53
-909 53 -37 71 79 41 40 -141 -25 -16 -2 -101 -105 -49 -27 -60 25 25 -2 -73 -4 18 46 -56 -71 -149 51 31 30 18 46 -129 -46 -51 84 -2 -90
-874 -90 56 73 56 -5 -133 -8 -33 -7 -55 0 -4 91 6 -18 -124 -108 6 -90 -69 8 67 145 28 64 123 -42 39 -45 -3 49 -4 -59
-842 -59 11 1 64 84 -33 29 -16 36 -36 -73 -12 -11 74 31 -100 53 -65 -53 30 -23 -70 -42 46 -36 -117 -140 84 -97 68 -4 75 31
-810 31 -44 41 58 30 -53 -131 4 -91 75 183 41 -23 -2 6 -110 -116 -92 -29 -34 29 7 -58 -19 -47 18 11 1 -80 -38 -36 193 78 18 128
-776 128 159 60 -83 62 74 -21 85 19 -52 -32 -59 69 23 -51 -12 63 156 22 46 67 0 62 -47 -101 54 -27 93 -1 -6 40 -29
-745 -29 -2 -56 -51 0 -3 -63 -11 50 -132 -22 -19 34 124 14 77 117 -36 -127 -50 39 -65 -56 -43 -114 -105 -7 -5 54 -42 -8 -46 -69 88 -13 14
-710 14 -65 -106 -54 31 98 -123 69 -52 -66 -81 4 95 -54 -60 17 -57 32 2 -46 -5 -41 -24 16 101 -7 43 71 -27 52 -103 -105 18 96
-677 96 87 52 -118 -3 23 -41 -16 4 31 -7 24 -86 13 102 -90 -40 15 79 -60 -172 -141 69 -33 44 27 -78 -75 19 -15 -90 62
-646 62 26 -95 69 -28 -56 -124 17 -8 -98 -32 -78 -131 -14 55 52 96 -69 55 37 -47 -98 -150 -11 47 -95 -86 -94 -39 119 26 31 -154
-614 -154 -43 170 247 359 122 -5 86 58 85 -12 -70 -68 -50 4 31 43 26 -53 60 60 64 7 -119 61 -30 33 -55 -71 13 1 67 -16
-582 -16 -49 14 8 -28 -115 68 -18 -39 -10 -28 -82 -15 -107 57 -31 -53 -137 -62 75 15 -43 7 -36 -27 7 6 -32 103 -77 -61 -24 105 98 174
-548 174 78 6 -36 -46 29 -20 -28 -68 9 -31 13 -60 -47 18 42 3 105 -53 -47 106 67 -165 -64 17 152 -2 48 134 56 -31 4 47
-516 47 -15 -26 18 102 80 24 74 -42 -45 -98 8 53 16 7 -111 -44 43 13 -32 48 66 -46 79 -36 -145 -83 -45 -74 -46 51 105 -17
-484 -17 -6 -67 42 -48 -9 -27 66 1 -13 -71 37 -33 80 57 35 -78 14 -29 -41 -72 20 61 -35 69 29 44 127 29 -13 -29 -103 34
-452 34 -63 -8 21 51 199 -9 48 -20 21 156 -18 41 126 -14 11 0 94 90 27 -87 -117 16 -33 31 73 13 -13 50 59 -95 113 2
-420 2 -16 43 64 -56 -29 0 -141 21 90 -12 20 41 -61 -50 11 39 4 -27 12 72 73 70 56 23 28 2 60 35 27 45 36 141 37 -32 109
-385 109 1 12 4 11 30 138 49 -51 -75 62 101 65 65 46 45 9 -125 26 225 18 89 68 89 -109 -22 76 32 42 20 0 34 0
-353 0 -33 -2 -28 59 67 -1 -54 -24 -51 -46 -68 79 -70 -28 -31 13 9 -80 -10 84 28 -154 24 1 -13 -70 80 -17 83 53 107 -26 -12 58
-319 58 -64 -27 61 -25 112 215 96 -17 -38 -37 17 93 -3 8 -80 -32 -48 20 8 -29 4 124 163 124 46 100 154 31 36 -74 -45 50
-287 50 84 -69 19 -12 122 134 -8 -19 37 -61 -44 44 -66 1 203 63 -29 0 -36 -139 -10 13 5 -51 -83 50 -28 20 -86 -74 -122
-256 -122 15 -18 135 3 64 -61 -81 -84 43 65 40 68 172 110 -73 -62 -33 74 11 -17 -23 4 -15 15 -117 6 -112 77 99 -57
-226 -57 -114 -40 20 -58 -93 -24 -21 -14 26 102 107 43 71 55 127 -12 -62 -32 -3 124 112 43 92 -67 46 63 73 -14 77 61 3 -108 -19 -24 -23
-191 -23 -52 -67 -49 24 43 17 -8 -51 -1 49 41 -104 -33 40 -8 -44 4 -94 45 -28 23 23 19 -5 -4 -49 -125 -78 22 53 22 0 -39 -25 4 -14
-155 -14 16 81
-153H1
##PAGE=	F1=14449.604918035773153
##FIRST=	31355.342622953838145,	6319.7438965998480853,	0.072258159518241882324
##DATATABLE=	(F2++(Y..Y)), PROFILE
-2200 58 43 9 45 61 -6 25 63 10 -51 -46 -10 11 -81 -19 2 -6 51 67 125 -94 25 49 -128 -11 79 62 -24 -90 71 89 8 -20 81
-2167 81 14 -31 -34 4 1 -36 -66 72 -25 18 -47 -65 -74 48 97 -32 -58 -26 -56 -97 -104 -156 -44 26 87 -4 53 41 -62 -36 -3 -86 -5 -43
-2133 -43 73 -11 -102 -44 23 67 130 32 45 7 12 -66 55 -92 -112 45 -74 -111 -73 15 49 10 -25 95 16 93 17 -20 34 15 101 61
-2101 61 29 12 34 15 -75 -70 -13 -74 8 63 147 -28 -65 -48 -94 -105 43 40 -29 -81 -18 -11 -21 -1048 -2287 -997 -290 -212 -159 -178 -119 -23
-2069 -23 24 -197 75 -97 -165 -39 -4 4 26 -109 -72 60 -45 -62 -188 -73 -9 -71 -45 36 -104 59 -21 72 98 16 45 -131 37
-2040 37 -80 6 70 -78 -56 -29 37 69 169 199 348 411 487 619 448 213 202 93 14 -95 90 -75 34 150 20 -3 41 99
-2012 99 115 -56 61 124 -7 -90 -17 -40 -31 -127 20 4 0 -35 -15 9 -23 -136 -10 121 82 -86 -54 22 155 85 -38 20 50 -17 -51
-1981 -51 -10 -45 -14 29 130 11 -75 -6 27 58 -23 90 -10 50 47 114 150 41 10 62 -11 -118 -29 -71 91 30 270 144 -5 695
-1951 695 301 -207 434 0 51 -8 37 90 24 4 102 90 17 22 -71 -137 -9 -2 -117 -47 -36 3 43 6 -146 -66 -59 39 -39 50 -42 -133
-1919 -133 -105 66 -105 54 14 18 -36 17 38 40 63 16 -4 -28 92 -17 -27 -56 15 -20 36 36 48 144 10 -28 82 -19 -33 1 97 -43
-1887 -43 3 131 79 -41 58 -37 -62 34 -58 113 11 -2 -41 9 -42 56 -43 -21 58 47 92 72 9 -23 11 29 58 47 2 79 50 -42 -96
-1854 -96 -131 -17 66 30 -46 -88 80 -91 39 -13 46 -17 -97 70 -31 -4 -12 80 28 72 -58 -47 102 16 -15 14 86 28 -112 -40 19
-1823 19 -46 9 -9 -11 11 20 20 102 127 -35 23 -29 28 28 -61 -88 4 0 -38 63 32 62 -24 -93 -195 -120 -70 30 36 29 55 40 -99 -131 38
-1788 38 85 -84 -7 -56 -56 96 -91 -103 -68 12 -94 -159 15 -54 0 -35 30 -25 -133 -109 -181 -112 -37 99 24 68 -142 -42 -104 -144 -93
-1757 -93 -60 -91 -111 -30 71 1 31 -52 -71 18 95 58 11 53 36 88 124 7 -36 -46 -10 -20 56 26 20 -9 99 158 -9 114 8 -39
-1725 -39 -122 3 57 99 -46 -60 26 -153 160 116 37 73 -1 -67 -9 -11 -60 8 83 -1 96 19 3 145 -84 -29 77 80 22 -9 -62 -147
-1693 -147 3 -49 -63 121 -29 -54 113 64 108 15 -45 -32 -97 -106 47 59 34 22 20 21 -62 85 -21 9 51 71 92 40 0 -45 98 115
-1661 115 58 10 -43 -149 51 96 -47 48 14 60 45 68 69 -57 56 9 27 46 -1 5 13 82 6 -156 -121 107 -38 -18 28 99 67 107
-1629 107 22 28 84 106 54 19 -88 -130 -55 4 118 67 44 -71 -157 -76 -58 -47 -40 -17 102 98 162 89 18 67 15 -25 -61 -31 -33 -96 -19 -52
-1595 -52 -28 -19 -28 2 -57 48 -23 -14 -50 39 119 69 153 -79 -70 82 -23 -20 -50 -47 55 73 46 93 66 -6 -35 -13 54 0 -42 -64 0 -18 95
-1560 95 -6 92 41 34 66 -13 141 53 -11 80 38 0 -5 -5 63 138 -7 -39 -75 -145 46 38 9 35 60 -100 -45 84 -166 -72 -78 -11 11 -37
-1526 -37 -14 -41 7 17 88 63 4 25 -19 -7 -20 -30 -37 52 106 3 -25 -104 0 3 -7 -36 -64 -23 -103 41 -89 -126 -81 -43 47 -33 -34 36
-1492 36 33 -13 -40 87 -95 110 18 139 3 -60 -119 -139 -70 -22 -34 21 -59 -58 8 20 -18 38 61 22 31 -60 39 -84 36 -4 8 26 23
-1459 23 57 43 29 34 45 52 197 -18 -136 -73 19 171 72 160 43 36 104 -26 -32 -47 -63 -48 101 -91 -21 16 76 -43 -40 -50 143 69
-1427 69 102 57 21 141 50 72 7 41 -67 -30 19 107 -98 -72 21 16 40 -71 78 36 17 57 25 -23 -58 30 49 -15 117 -104 -82 -156
-1395 -156 -34 -84 -39 48 136 75 -115 99 61 -22 -52 -46 -3 35 -21 -41 88 20 59 -74 -69 30 12 -45 52 0 155 14 52 -75 -15
-1364 -15 -32 -7 -26 -45 -90 -26 78 -29 28 -11 57 181 8 46 76 16 9 0 -84 76 -43 7 136 144 -26 -87 -7 -24 37 72 2 -8
-1332 -8 -128 92 5 -89 -43 -115 -116 1 103 58 35 -109 0 -85 47 134 167 -39 57 74 -1 88 102 65 34 63 -20 6 -20 11 26 -4
-1300 -4 82 -30 -6 124 23 32 -39 31 82 56 -27 10 111 91 66 -19 -27 49 -52 -151 -27 -8 -83 -3 0 -30 -148 -85 84 45 87 -28
-1268 -28 -52 -4 28 9 40 48 55 20 0 27 18 40 -32 -45 75 185 30 82 111 -56 -56 -39 -61 -117 -107 -94 -35 -68 -28 -32 -54 34 50 38 -176
-1233 -176 -50 42 -12 -34 -46 34 63 54 28 -53 -16 -108 3 13 -90 -101 -64 -7 -45 85 73 -43 -59 51 98 47 -19 -28 21 135 -72
-1202 -72 -58 -5 -18 -100 78 88 1 33 44 70 38 -31 -43 6 126 17 83 -30 -9 -76 -7 -10 92 -101 -81 -16 -19 43 104 28 123 -49
-1170 -49 -67 -25 -16 -118 66 -28 101 152 -34 -67 60 18 44 -127 -114 -83 51 16 -107 -126 137 -58 -123 55 59 91 80 49 54 38 56
-1139 56 -19 -94 17 -95 -84 -14 31 -130 -24 18 65 13 17 -23 -90 -58 -83 -4 65 24 -1 11 5 89 59 94 -10 -33 -99 -8 9 -36 123
-1106 123 -109 110 25 -46 -244 -30 15 82 -19 76 50 24 51 -23 24 -40 -4 -16 -34 41 -8 -123 -99 13 1 -108 -57 81 36 71
-1076 71 31 94 204 190 16 19 60 113 61 18 -80 -154 35 -1 -32 24 41 31 35 93 64 -57 -130 2 -58 111 53 11 6 37 11 32 -48
-1043 -48 -32 27 9 -59 59 -69 -8 0 -11 -29 -118 119 76 -21 38 119 46 124 73 -27 -75 -47 106 43 -23 122 146 48 45 20 -76 -54 11
-1010 11 -11 16 39 -26 43 118 -4 -85 71 -35 -85 -17 44 -13 72 63 -7 -94 46 -79 68 -74 -8 93 -16 -33 -18 -109 -98 45
-980 45 57 170 22 -22 28 -22 -139 -36 -82 118 -1 128 26 -68 16 67 121 49 -96 7 303 -61 -43 -138 -80 -100 18 53 29
-951 29 -12 -169 -34 57 73 64 -46 -36 68 9 26 -76 -164 -34 -59 -34 2 -17 30 18 92 8 52 58 98 67 -17 -100 176 52 86 116
-919 116 69 -7 23 65 -60 -94 -77 33 -3 64 -44 47 73 44 42 -129 -24 -18 -1 -86 -102 -31 0 -22 19 13 0 -53 -17 -4 34 -59 -78 -157
-885 -157 52 33 26 21 57 -135 -70 -55 76 8 -57 87 53 42 -30 -125 -30 -35 -12 -52 1 -3 76 -18 -23 -107 -106 4 -107 -64 6 63 162 24
-851 24 60 132 -51 37 -18 -18 41 2 -68 25 0 77 99 -25 38 -5 41 -32 -54 -13 -16 68 23 -118 60 -59 -36 30 -19 -86 -36 50 -42 -103
-817 -103 -150 66 -114 77 5 64 38 -50 18 77 0 -56 -144 2 -97 85 175 46 -23 -38 -16 -117 -90 -105 -41 -21 29 4 -66 -6 -48
-786 -48 26 13 0 -87 -55 -38 199 75 -4 128 168 62 -93 73 76 -49 81 11 -82 -43 -51 69 38 -62 -50 33 160 32 17 66
-756 66 32 75 -33 -96 54 -11 78 -16 -7 30 -45 -8 -75 -37 -6 -1 -65 -24 55 -152 -17 -41 32 121 -21 69 105 -45 -115 -74 27 -71 -55
-723 -55 -56 -98 -86 1 -8 73 -49 -1 -33 -54 88 -1 25 -61 -89 -52 28 74 -102 84 -49 -55 -90 16 106 -87 -65 0 -64 39 32 -35 -15
-690 -15 -39 -33 24 107 -6 37 65 -46 27 -93 -101 43 74 81 50 -130 5 10 -38 -3 10 16 -35 -4 -62 17 87 -93 -35 34 82 -53 -182
-657 -182 -152 74 -48 18 29 -71 -54 6 0 -103 43 25 -74 76 -27 -75 -132 45 -8 -104 -26 -58 -114 9 66 63 75 -85 66 50
-627 50 -48 -91 -131 4 50 -83 -83 -95 -27 89 1 39 -130 -69 171 270 386 142 12 93 63 102 2 -69 -72 -36 10 71 20 21 -59 47
-595 47 64 58 5 -116 53 -39 52 -81 -77 6 -1 68 -40 -60 7 0 -25 -135 41 -28 -30 6 -13 -73 -33 -117 63 -29 -55 -133 -80 52 38 -36
-561 -36 7 -41 -63 -5 -18 -24 106 -62 -48 -27 98 99 146 43 -4 -24 -40 24 -65 -33 -73 11 -32 26 -39 -41 27 53 19 118 -31 4 116 73
-527 73 -189 -63 3 140 -4 64 156 70 -34 4 22 -32 -7 4 115 73 27 79 -20 -58 -120 3 34 0 -3 -102 -54 32 6 -24 66 63 -55
-494 -55 57 -50 -136 -91 -46 -82 -46 51 93 2 14 -84 33 -60 -32 -30 77 -3 -3 -64 19 -26 83 70 35 -85 2 -47 -19 -68 32 70 -36
-461 -36 66 10 47 138 17 -28 -38 -115 21 -63 -5 26 37 207 -1 81 0 36 158 6 47 139 -9 14 -16 67 77 20 -100 -116 28
-430 28 -30 6 49 5 -24 27 65 -94 81 7 -15 65 81 -12 -37 -24 -167 16 80 18 44 70 -56 -33 30 31 -6 -32 3 69 53 92 40
-397 40 30 43 -13 58 29 23 56 32 146 33 -19 118 -25 -20 -12 -2 31 130 66 -41 -77 38 131 77 50 30 36 11 -127 33 222 -3
-365 -3 81 73 78 -106 -4 69 22 20 50 -8 21 0 -1 -1 -30 64 72 -19 -38 -24 -69 -42 -74 83 -80 -51 -26 13 -5 -80 13 84 41 -187 30 -4
-329 -4 -10 -75 93 -27 86 75 119 -5 5 45 -27 -47 58 -9 108 208 101 1 -15 -35 32 91 -20 7 -79 -46 -47 38 42 -26 30 127
-297 127 185 146 62 104 145 25 32 -86 -58 18 53 -62 30 0 126 150 -30 -26 24 -84 -57 33 -81 -6 195 78 -18 -14 -48 -128 7
-266 7 16 -13 -56 -74 60 -17 39 -45 -73 -101 16 5 132 6 49 -76 -62 -96 78 77 36 59 190 117 -64 -56 -38 97 -10 -8 -20 19 -18
-233 -18 42 -103 6 -117 88 113 -60 -110 -27 49 -39 -93 -16 -8 -18 29 116 128 29 65 58 150 -8 -66 -54 1 132 108 29 86 -66 37
-201 37 62 80 -2 81 60 25 -91 -13 -19 -17 -50 -75 -51 32 43 -6 9 -34 13 34 11 -120 -82 22 0 -39 8 -105 53 -13 15 15 20 0 9
-166 9 -51 -118 -75 3 49 19 7 -43 -16 -2 -16 22 89
-153H9
##PAGE=	F1=14385.568032789873541
##FIRST=	31355.342622953838145,	6319.7438965998480853,	0.0085078952834010124207
##DATATABLE=	(F2++(Y..Y)), PROFILE
-2200 61 49 4 45 54 -14 46 76 16 -27 -51 -20 31 -83 -27 0 -4 37 59 126 -126 27 61 -136 -31 49 57 -25 -96 78 94 -9 -59 46
-2167 46 26 -40 -30 4 7 -37 -61 54 -29 3 -47 -62 -88 45 100 -58 -43 -38 -42 -78 -109 -158 -13 26 60 5 84 44 -77 -38 -21 -99 -1 -57
-2133 -57 75 -27 -82 -49 17 83 139 28 5 5 10 -70 65 -98 -125 30 -62 -96 -61 20 49 -1 -37 114 23 92 24 -16 39 0 115 71
-2101 71 34 13 30 28 -47 -58 1 -69 22 85 144 -39 -64 -57 -112 -110 68 36 -22 -55 2 -4 47 121 142 260 -124 -209 -190 -172 -108 -7 10 -187
-2067 -187 68 -108 -153 -54 -18 7 -3 -119 -79 45 -60 -71 -188 -89 -39 -82 -62 10 -105 76 3 65 88 29 53 -108 15 -79 14
-2038 14 48 -104 -33 -31 33 62 156 209 329 419 478 584 421 173 157 103 12 -77 99 -73 8 127 0 -24 27 88 106 -70 47 98
-2008 98 9 -89 0 -40 -17 -140 -15 -3 -8 -36 -7 7 -17 -152 -21 115 75 -102 -66 0 156 94 -31 7 32 -23 -65 -30 -62 3 4 107
-1976 107 34 -47 8 43 55 -31 84 -1 75 65 110 196 43 14 81 -15 -123 -33 -89 92 67 321 218 30 678 332 -137 478 37
-1947 37 69 26 -8 73 20 9 107 90 1 9 -31 -131 -10 -2 -102 -45 -32 17 32 27 -145 -72 -42 26 -60 30 -52 -151 -73 78 -74 58 0
-1914 0 15 -37 10 31 42 62 23 0 -14 65 -26 -37 -60 56 -21 40 36 46 136 -9 -19 73 -23 -20 23 110 -48 13 108 106 -42 47 -41 -63 31
-1879 31 -63 134 38 6 -1 17 -38 77 -51 -27 73 38 77 74 6 -20 26 26 57 44 4 67 28 -73 -108 -144 2 50 17 -41 -91 85 -77
-1846 -77 31 -20 57 7 -78 55 -47 -17 -24 69 29 109 -76 -60 125 21 -28 -16 75 21 -113 -25 32 -43 17 4 -10 -7 25 35 78 129
-1814 129 -17 8 -50 46 41 -46 -94 -6 25 -18 49 2 58 -13 -115 -169 -112 -34 69 52 34 42 28 -110 -147 31 79 -67 -11 -60 -39 88
-1782 88 -75 -123 -88 0 -131 -176 21 -34 33 -26 49 -40 -141 -104 -173 -120 -91 104 12 59 -161 -49 -76 -147 -93 -47 -68 -103 -40 102 -11
-1751 -11 29 -65 -59 8 95 66 12 57 33 56 108 15 -62 -57 0 -22 25 24 2 -40 86 134 0 103 12 -87 -111 -4 51 64 -47 -60 4 -136
-1717 -136 154 113 39 58 11 -34 -9 -13 -45 8 87 25 106 31 -10 128 -85 -19 66 75 8 -3 -59 -131 -1 -37 -61 91 -26 -39 149 87
-1685 87 135 42 -43 -42 -76 -119 41 37 24 22 60 22 -57 106 -29 -5 30 44 56 70 18 -35 76 95 75 20 -77 -156 80 112 -24 82 15
-1652 15 73 39 67 63 -30 57 19 -3 44 28 14 15 84 7 -145 -106 112 -52 -28 16 112 82 97 25 41 88 99 54 48 -46 -134 -88 -12 135
-1618 135 73 54 -69 -154 -50 -39 -59 -56 -10 96 63 129 66 -5 62 45 -21 -78 -34 -11 -72 -46 -46 -2 -18 -36 17 -76 31 -27 -19 -39 36 104
-1584 104 65 153 -71 -73 98 -39 -25 -57 -26 88 90 53 92 63 -30 -49 -32 29 -33 -48 -72 -7 5 113 8 94 33 24 72 -26 123 35
-1552 35 -28 73 36 16 1 -29 43 133 -23 -39 -69 -144 47 39 30 28 29 -92 -50 95 -171 -55 -93 -9 7 -34 -14 -42 4 22 99 82 -10
-1519 -10 27 -23 -12 -28 -15 -66 37 118 14 -17 -111 -16 4 -16 -34 -80 -16 -79 68 -80 -104 -84 -35 60 -67 -2 61 41 -14 -65 66 -85
-1487 -85 103 21 117 0 -61 -97 -127 -70 10 -23 32 -23 -44 0 6 13 68 92 75 19 -61 36 -68 50 -6 13 32 11 75 15 21 47 51 43 194
-1452 194 -4 -122 -57 15 170 62 154 28 60 132 -20 -44 -40 -46 -16 101 -89 -12 55 46 -45 -67 -57 160 82 78 33 9 121 52 75
-1421 75 25 6 -91 -44 24 109 -86 -71 36 19 23 -85 52 39 6 64 65 -5 -57 19 51 0 107 -123 -92 -137 -29 -93 -44 26 126 78
-1389 78 -119 86 38 -16 -57 -41 -23 42 -23 -42 71 12 65 -79 -65 54 3 -58 48 3 139 16 52 -87 -16 -34 -15 -38 -50 -116
-1359 -116 -37 82 -28 43 18 40 168 21 34 51 34 1 16 -96 60 -61 8 147 129 -38 -77 -3 -7 62 72 -17 -8 -109 82 -5
-1329 -5 -100 -39 -127 -136 12 105 42 29 -98 -1 -62 45 106 173 -36 68 66 0 107 108 77 58 56 -19 14 -19 0 30 -20 67 -20 -30 120 -2
-1295 -2 79 -33 29 58 47 -20 13 132 131 71 -20 -27 40 -58 -154 -49 1 -71 23 19 -58 -160 -113 70 33 92 -26 -56 -9 -1 6 21 36 58 30
-1260 30 -34 37 38 48 -43 -57 68 179 30 85 77 -55 -44 -27 -83 -119 -113 -98 -27 -59 -22 -15 -55 10 45 40 -162 -40 62 -11 -35 -36 47 60
-1226 60 63 -1 -42 -17 -90 0 -20 -111 -108 -89 -22 -62 59 75 -33 -66 66 101 63 -4 -15 35 154 -68 -55 15 -21 -96 73 86 -1 45 52
-1193 52 73 38 -26 -26 23 140 -10 89 -25 -15 -93 -7 -12 81 -105 -68 -31 -23 38 102 31 110 -66 -52 -20 -5 -113 82 -28 107 172 -38
-1161 -38 -66 43 12 57 -131 -97 -90 55 28 -91 -115 123 -70 -111 43 72 79 89 39 52 54 49 -28 -92 50 -77 -94 -15 40 -119 -35 10
-1129 10 66 16 15 -27 -92 -77 -129 -9 81 44 12 10 -1 86 56 112 -10 -44 -116 -4 5 -44 126 -92 124 59 -6 -228 -12 20 94 -12
-1097 -12 50 56 25 62 -11 41 -53 10 -24 -43 41 -6 -136 -125 3 1 -101 -63 61 37 79 46 92 204 154 37 17 58 104 71 36 -67
-1065 -67 -134 31 6 -37 6 17 47 20 62 69 -47 -143 -1 -45 109 52 28 13 13 39 22 -62 -51 5 15 -71 51 -64 6 1 -16 -45 -120
-1032 -120 121 78 -17 46 130 15 102 61 -35 -84 -47 102 34 -29 113 115 70 52 24 -81 -50 -7 -34 26 55 -35 51 125 -16 -71 63
-1001 63 -37 -86 -13 25 -19 87 72 -15 -130 34 -70 54 -66 -1 91 -1 -12 12 -91 -90 26 42 160 51 -23 42 -8 -129 -57
-972 -57 -74 128 1 120 46 -72 0 57 130 57 -62 51 275 -71 -33 -135 -107 -99 5 34 22 -19 -158 -46 27 70 64 -60 -46 85
-942 85 -6 35 -48 -165 -20 -54 -17 17 -8 10 -5 74 -19 69 36 96 103 -16 -117 149 56 99 126 47 -24 16 67 -55 -97 -71 35 -5
-910 -5 69 -51 22 63 47 40 -109 -16 -17 -1 -68 -97 -6 33 19 7 -3 4 -21 -27 -25 17 -60 -77 -155 52 38 22 22 66 -130 -83 -56 57 14 -19
-874 -19 114 29 30 -52 -113 -51 -29 -16 -49 5 -4 59 -44 -24 -79 -102 7 -115 -57 5 51 169 19 55 139 -54 32 7 -42 24 4 -78 41
-841 41 4 96 119 -18 46 8 46 -28 -30 -9 -18 56 17 -123 70 -53 -20 32 -7 -95 -21 47 -52 -78 -152 39 -129 81 13 52 44 -59 -7
-808 -7 92 -25 -60 -157 0 -95 86 158 50 -16 -71 -45 -117 -62 -117 -54 -8 29 1 -74 9 -48 29 8 0 -88 -66 -28 191 61 -31 112 172
-775 172 66 -106 78 73 -72 66 0 -104 -49 -43 62 51 -71 -86 0 158 35 -9 60 57 84 -13 -83 51 6 60 -28 -9 20 -60 -10
-744 -10 -94 -21 -15 2 -69 -35 66 -156 -5 -53 28 108 -52 56 86 -49 -94 -89 19 -69 -51 -69 -74 -68 10 -15 85 -57 8 -26 -40 80
-712 80 17 40 -49 -68 -49 23 54 -77 96 -42 -36 -96 32 112 -114 -67 -19 -66 40 58 -26 -26 -37 -41 36 106 -6 31 49 -66 0 -76 -93
-679 -93 67 51 71 46 -138 7 -5 -33 6 17 2 -62 -37 -34 18 74 -91 -24 51 81 -44 -178 -160 73 -57 -6 29 -66 -33 -9 11 -105
-647 -105 25 29 -49 78 -27 -88 -131 69 -4 -100 -16 -44 -92 30 72 77 47 -95 75 60 -43 -84 -105 18 52 -62 -74 -96 -13 55 -22
-616 -22 46 -106 -96 163 271 388 142 20 85 64 113 20 -66 -72 -20 18 107 1 17 -60 29 68 53 4 -102 48 -49 68 -106 -78
-586 -78 2 -6 62 -64 -68 -2 -12 -29 -143 12 -42 -29 13 1 -58 -42 -122 61 -28 -50 -123 -92 30 54 -21 12 -45 -96 -13 -38 -16 101 -48
-553 -48 -44 -21 88 96 122 13 -19 -13 -33 17 -105 -36 -84 11 -38 36 -20 -36 32 53 33 130 -11 52 123 69 -206 -54 -15 120 -2 75 168
-520 168 89 -31 4 6 -46 10 -7 118 62 29 76 6 -63 -133 1 18 -15 -5 -83 -66 17 2 -12 84 56 -59 35 -63 -128 -91 -48 -89 -40
-487 -40 53 75 10 29 -94 19 -68 -51 -30 83 -12 1 -51 3 -18 79 82 38 -83 -5 -64 2 -57 39 71 -31 53 -11 42 138 8 -40 -39
-454 -39 -123 3 -59 0 32 21 204 5 104 17 50 154 33 51 153 -2 17 -28 44 69 12 -112 -109 33 -30 -25 29 4 -34 -2 69 -91
-422 -91 50 22 -16 89 94 24 -46 -41 -181 8 71 51 70 97 -46 -14 48 20 -16 -33 -4 65 35 108 25 42 53 -28 46 18 24 62 30 146
-388 146 23 -7 119 -53 -58 -34 -10 27 117 81 -31 -69 12 156 84 36 17 27 14 -122 35 211 -28 71 76 66 -93 11 62 11
-358 11 2 74 -15 5 7 34 -2 -31 58 75 -33 -22 -19 -82 -37 -83 80 -92 -74 -23 2 -27 -83 42 79 52 -212 33 -16 -10 -81 99 -30
-325 -30 92 94 131 14 19 31 9 -59 54 4 100 196 104 20 6 -38 40 81 -32 3 -76 -59 -44 45 72 -20 48 116 206 165 72 96 131 16
-291 16 24 -94 -69 -17 23 -54 40 10 122 163 -45 -34 11 -106 -62 22 -91 -14 179 81 -10 -34 -58 -110 19 14 -27 -62 -69 68 -5 69 -4
-258 -4 -67 -77 18 22 127 8 33 -88 -46 -105 108 89 33 50 195 117 -55 -50 -36 113 -32 3 -18 30 -20 65 -93 5 -113 93 123
-227 123 -64 -97 -13 64 -18 -87 -5 0 -26 25 126 136 10 56 60 166 -10 -70 -76 6 130 99 8 78 -69 25 57 85 14 91 57 41 -77
-194 -77 -5 -17 -8 -42 -77 -54 34 41 -28 29 -14 24 20 -16 -133 -134 2 10 -24 18 -110 59 5 9 11 20 1 17 -55 -104 -65 -10 46 14 11 -40 -4 -12
-156 -12 -20 30 89
-153H9
##PAGE=	F1=14321.531147543970292
##FIRST=	31355.342622953838145,	6319.7438965998480853,	-0.047265078872442245483
##DATATABLE=	(F2++(Y..Y)), PROFILE
-2200 62 56 -1 40 48 -19 68 87 23 0 -56 -27 42 -87 -32 -2 0 23 45 124 -157 38 76 -125 -47 13 46 -21 -95 73 94 -30 -100 14
-2167 14 30 -46 -25 3 15 -36 -53 32 -22 -16 -44 -57 -104 38 101 -78 -31 -49 -30 -45 -105 -160 23 33 36 12 112 52 -86 -38 -32 -101 0
-2134 0 -75 72 -42 -59 -53 5 99 147 28 -35 1 10 -72 77 -101 -139 9 -46 -73 -39 32 49 -6 -52 125 30 92 35 -20 35 -22 126
-2102 126 75 26 13 18 39 -16 -43 21 -55 36 106 133 -41 -53 -55 -122 -116 85 38 -14 -33 28 9 222 2109 4004 2431 291 -161 -211
-2072 -211 -158 -97 6 -7 -166 66 -106 -131 -58 -26 11 -37 -125 -83 33 -67 -79 -176 -96 -59 -84 -72 -10 -98 87 23 53 83 36 58 -82
-2041 -82 -3 -70 31 28 -120 -3 -26 26 55 144 210 315 411 439 523 382 122 106 109 3 -61 97 -65 -14 99 -19 -44 11 73 90
-2011 90 -83 35 61 32 -77 21 -33 -6 -143 -52 -15 -19 -33 1 5 -8 -162 -29 100 59 -111 -69 -23 147 93 -24 -6 13 -31 -82 -46
-1980 -46 -73 19 -22 80 54 -15 24 56 49 -37 77 12 99 78 102 229 40 19 102 -12 -113 -29 -101 92 101 366 297 79 652 362
-1950 362 -68 498 66 83 63 -52 49 24 16 102 85 -16 -3 11 -123 -12 -4 -87 -44 -26 25 18 50 -133 -76 -26 14 -77 9 -57 -157
-1919 -157 -41 87 -38 58 -15 15 -35 5 18 39 63 30 0 -2 31 -36 -41 -59 93 -23 45 30 45 122 -22 -17 61 -20 -9 43 117 -42
-1887 -42 24 85 128 -41 28 -46 -59 35 -63 150 63 22 41 27 -37 92 -47 -34 82 23 54 71 -1 -15 41 26 55 40 13 52 5 -98
-1855 -98 -124 -146 17 42 5 -34 -96 83 -63 19 -33 63 20 -64 34 -61 -33 -35 52 19 147 -84 -68 141 24 -45 -43 67 23 -103 -9
-1824 -9 44 -43 27 19 -11 -23 35 40 50 127 6 0 -65 65 48 -33 -96 -26 42 -2 32 -31 55 -4 -127 -136 -101 0 107 63 39 35 14 -112 -152
-1789 -152 22 65 -50 -13 -60 -16 81 -57 -142 -115 -14 -162 -185 31 -14 64 -18 62 -50 -140 -99 -160 -126 -147 109 1 42 -173 -58
-1760 -58 -47 -145 -94 -27 -39 -89 -39 127 -29 24 -77 -51 0 90 76 17 53 23 22 90 15 -80 -64 13 -25 -7 21 -20 -73 65 103 11 82
-1727 82 4 -126 -90 -14 47 28 -41 -55 -2 -106 142 112 45 46 17 0 0 -19 -31 10 93 45 109 41 -22 104 -83 -7 52 70 0 1 -52 -106
-1693 -106 -6 -20 -56 54 -18 -25 174 99 153 63 -34 -44 -55 -127 28 11 6 22 95 20 -46 119 -47 -26 9 12 22 99 30 -26 52 81 91
-1660 91 26 -106 -147 105 117 -7 115 27 86 31 65 54 3 65 31 -27 38 55 17 19 86 18 -129 -85 107 -64 -30 3 119 89 84 19
-1628 19 48 89 93 49 77 -9 -134 -118 -28 143 67 59 -58 -147 -29 -16 -61 -66 0 86 24 90 43 -19 60 76 -10 -90 -37 15 -50 -74 -42 18
-1594 18 -14 -40 31 -88 12 -29 -20 -32 23 82 59 143 -61 -72 111 -51 -31 -58 -4 123 102 61 92 63 -47 -60 -50 10 -62 -59 -82 -17
-1562 -17 30 119 12 88 18 4 73 -39 104 19 -49 66 34 31 4 -53 16 118 -41 -39 -64 -139 45 37 54 21 -4 -79 -59 108 -166 -40
-1530 -40 -100 -10 -1 -30 -10 -38 5 26 106 97 -17 32 -27 -21 -41 -3 -86 15 121 29 -9 -113 -28 9 -18 -30 -94 -5 -54 86 -76 -89 -90 -22
-1496 -22 73 -98 27 86 45 -14 -82 40 -71 90 20 90 -7 -65 -72 -112 -68 39 -9 48 13 -22 -6 -2 44 95 120 121 8 -56 34 -52 61
-1463 61 -6 19 36 0 92 -11 13 57 56 38 187 5 -111 -34 3 165 52 142 9 77 145 -17 -53 -23 -24 10 91 -70 -1 82 25
-1432 25 -39 -81 -61 175 92 52 8 2 100 51 76 46 -25 -113 -57 15 101 -85 -70 50 19 6 -105 23 41 -1 69 101 9 -56 2 50 18
-1399 18 92 -135 -94 -112 -21 -95 -37 9 107 80 -120 70 19 -10 -61 -32 -35 52 -25 -49 50 7 69 -82 -62 78 -9 -64 42 5 122 25
-1367 25 51 -88 -17 -28 -19 -47 -53 -140 -46 84 -26 59 50 25 143 35 26 16 46 0 29 -96 47 -81 10 150 105 -55 -56 0 7 91 72
-1334 72 -37 -10 -82 70 -11 -104 -34 -132 -143 32 105 26 20 -84 -5 -36 43 69 166 -38 73 50 1 119 106 80 87 54 -23 22 -19 -9
-1302 -9 39 -35 46 0 -50 120 -14 124 -30 22 22 39 -10 13 145 165 68 -26 -21 35 -66 -154 -73 14 -47 43 37 -87 -164 -126 51 23 89
-1269 89 -21 -63 -15 -41 1 0 22 56 40 -65 39 58 61 -53 -72 61 168 26 88 43 -44 -27 -11 -99 -108 -112 -91 -16 -55 -20 -2 -52 -15
-1236 -15 41 44 -135 -30 75 -6 -38 -29 61 59 79 -27 -30 -21 -73 -5 -52 -133 -116 -114 -40 -74 34 76 -16 -60 80 100 73 12 0 45 169 -59
-1202 -59 -48 39 -20 -85 61 82 2 52 65 77 34 -25 -11 50 151 -40 86 -19 -18 -98 -9 -20 61 -108 -48 -41 -20 40 93 28 87 -80
-1170 -80 -35 -15 18 -100 92 -26 111 175 -40 -57 22 7 72 -125 -76 -95 58 33 -79 -101 105 -82 -92 30 76 63 91 23 55
-1141 55 70 44 -32 -85 73 -53 -103 -19 48 -103 -48 0 63 18 17 -35 -94 -89 -169 -20 82 62 26 6 -5 83 54 126 -6 -48 -125 2
-1109 2 2 -51 127 -65 137 87 33 -206 8 28 101 -3 17 55 29 65 -2 50 -62 25 -32 -47 47 -11 -142 -147 -9 2 -92 -54 37 43
-1077 43 91 61 82 194 109 62 13 48 90 69 57 -54 -109 21 13 -44 -24 -8 60 10 30 77 -34 -154 -5 -28 102 47 41 14 -4 63
-1045 63 8 -77 -68 -14 13 -87 36 -61 16 3 -28 -62 -111 122 73 -15 53 137 -13 77 43 -37 -89 -50 92 28 -38 97 89 90 53 26 -80
-1012 -80 -52 -24 -58 41 73 -37 52 127 -20 -53 49 -36 -81 -18 7 -23 96 71 -24 -158 21 -49 39 -58 0 89 18 8 43 -66 -82
-981 -82 4 32 135 72 -27 48 5 -107 -69 -64 131 -5 106 70 -63 -17 45 127 62 -26 82 241 -79 -27 -134 -130 -93 -8 16 14 -20 -137
-949 -137 -59 -1 68 65 -65 -47 100 -24 42 -16 -161 -4 -51 -1 22 -1 -3 -28 58 -45 85 11 96 131 -11 -113 128 64 114 131 25
-918 25 -36 8 68 -59 -100 -62 26 -8 68 -58 -1 49 51 30 -81 -2 -11 0 -49 -90 21 69 60 -7 -22 14 19 -34 -40 1 -61 -70 -145 48 42 21
-882 21 19 69 -115 -85 -55 30 13 16 131 5 21 -70 -99 -69 -16 -17 -48 11 -3 42 -68 -23 -47 -99 12 -114 -47 1 35 167 15 51 142
-849 142 -49 25 26 -73 1 1 -86 57 12 115 142 -13 51 21 51 -24 -5 1 -15 39 13 -116 81 -45 -7 33 9 -95 0 35 -64 -44
-817 -44 -142 8 -141 82 22 40 50 -69 -30 101 -45 -64 -165 -6 -85 80 132 54 -1 -95 -79 -111 -32 -127 -68 5 29 -2 -82 23
-787 23 -48 25 0 -2 -83 -70 -10 171 36 -62 80 169 72 -119 78 65 -84 44 -12 -116 -50 -38 51 57 -75 -114 -33 148 31 -28 51
-756 51 71 88 10 -65 47 27 40 -38 -11 9 -70 -4 -110 -6 -25 8 -75 -45 80 -144 7 -57 23 88 -74 42 64 -50 -69 -91 16
-725 16 -58 -47 -82 -43 -54 15 -25 90 -63 20 -26 -29 65 38 60 -32 -45 -46 17 43 -50 101 -34 -13 -101 50 112 -130 -63 -40 -61 35 77
-692 77 -20 -37 -35 -49 50 98 -10 24 24 -81 -24 -55 -81 86 28 60 41 -138 1 -22 -26 12 25 -8 -83 -71 -5 17 64 -84 -8 64 77 -35
-658 -35 -162 -160 68 -58 -26 29 -68 -14 -23 20 -95 13 40 -22 77 -23 -91 -121 83 0 -89 -4 -38 -68 46 74 88 14 -99 80 65
-627 65 -30 -77 -76 32 52 -37 -62 -97 0 23 -42 51 -85 -120 148 247 364 123 18 61 60 115 40 -66 -72 -5 28 135 -11 15 -57 10
-595 10 73 49 6 -78 45 -58 82 -126 -77 1 -12 48 -86 -70 -16 -31 -41 -139 -14 -55 -34 8 14 -41 -45 -121 56 -28 -41 -107 -98 10 62
-562 62 0 21 -47 -121 -16 -50 -11 87 -37 -46 -8 76 88 104 -6 -33 -4 -26 9 -134 -39 -101 10 -48 43 -6 -32 32 45 44 141 3 89
-529 89 126 58 -213 -40 -35 94 5 80 169 110 -22 7 4 -55 22 -14 111 47 29 64 35 -59 -134 5 9 -23 2 -55 -76 3 1 2 101 43 -61
-494 -61 16 -74 -122 -81 -48 -97 -31 60 53 3 36 -95 5 -73 -62 -28 81 -22 1 -37 -7 -11 68 90 46 -73 -9 -78 22 -44 40 65 -21
-461 -21 30 -33 29 125 4 -48 -30 -128 -18 -53 6 36 0 191 12 116 28 62 147 57 52 165 6 19 -34 26 64 4 -121 -96 33
-430 33 -33 -58 17 7 -44 -36 71 -84 23 47 -19 111 100 50 -57 -48 -182 -2 60 83 96 118 -33 5 61 9 -23 -29 -9 59 20 116 12
-397 12 60 58 -41 27 6 31 60 32 141 10 1 113 -78 -94 -55 -10 22 103 90 -24 -56 -11 175 86 23 9 16 15 -112 32 193 -51
-365 -51 58 74 55 -73 26 59 0 -9 90 -21 -10 18 68 -7 -32 43 77 -40 -9 -11 -85 -33 -94 72 -103 -95 -22 -15 -55 -88 71 71 60 -230
-331 -230 31 -30 -12 -84 98 -26 99 109 142 32 29 17 42 -61 51 14 91 183 107 38 24 -45 42 66 -40 0 -72 -71 -36 41 96 -14
-299 -14 57 94 223 180 73 79 116 6 14 -97 -81 -55 -5 -43 50 19 111 172 -48 -42 -1 -122 -61 14 -94 -20 159 74 -6 -56 -63 -88 25
-266 25 8 -36 -67 -66 72 4 103 32 -58 -53 19 27 119 10 18 -97 -31 -112 124 103 32 42 187 109 -48 -47 -26 121 -53 13 -16 33 -21 82
-232 82 -87 1 -100 91 129 -66 -74 -1 66 2 -77 6 0 -36 12 129 129 -12 45 56 171 -17 -69 -98 11 119 86 -17 67 -77 9
-201 9 52 86 32 106 51 47 -67 2 -17 1 -31 -76 -60 26 39 -45 49 4 28 8 -40 -140 -182 -16 21 -1 31 -108 60 26 9 12 19 -1 18
-166 18 -59 -85 -47 -18 44 7 12 -31 8 -22 -23 40 84
-153H4
##PAGE=	F1=14257.49426229807068
##FIRST=	31355.342622953838145,	6319.7438965998480853,	-0.074358329176902770996
##DATATABLE=	(F2++(Y..Y)), PROFILE
-2200 61 64 -5 30 42 -21 89 95 27 24 -60 -33 44 -92 -35 -2 9 9 26 119 -183 55 94 -94 -55 -20 28 -15 -88 57 86 -53 -138 -8
-2167 -8 27 -51 -20 2 23 -35 -40 9 -4 -41 -37 -51 -120 27 95 -90 -22 -57 -24 -3 -95 -159 58 46 17 14 131 65 -87 -33 -34 -92 0 -95 63
-2132 63 -54 -35 -55 -10 111 152 31 -74 -4 10 -73 90 -104 -150 -14 -28 -44 -11 46 48 -3 -69 125 36 93 45 -33 24 -50 134 72
-2101 72 8 9 0 46 17 -28 43 -36 49 123 114 -32 -30 -46 -122 -126 92 44 -7 -20 52 25 501 4829 9098 5425 957 -65 -214 -134
-2071 -134 -85 18 -24 -136 71 -88 -96 -51 -26 16 -70 -127 -81 26 -66 -85 -152 -97 -71 -77 -72 -22 -86 88 35 35 80 36 59 -56 -16 -50 54
-2038 54 11 -125 32 -15 14 50 134 204 308 391 382 448 338 70 54 110 -8 -52 88 -51 -33 71 -32 -59 -5 56 71 -92 25
-2009 25 22 59 -56 41 -22 1 -133 -82 -29 -29 -26 10 6 1 -162 -34 82 39 -110 -66 -46 130 83 -19 -18 -4 -42 -96 -56 -76 33 -47 52
-1976 52 68 14 36 65 42 -42 70 30 117 81 91 244 33 23 122 -4 -89 -19 -107 89 121 391 325 87 613 359 -51 482 85
-1947 85 93 98 -90 18 36 25 89 73 -35 -15 52 -113 -13 -5 -73 -43 -16 23 2 73 -112 -74 -11 5 -87 -10 -55 -148 -11 90 -2 56
-1915 56 -29 19 -32 3 0 30 67 35 -3 8 -5 -45 -38 -50 122 -24 52 21 45 104 -27 -23 47 -9 -1 59 118 -26 37 65 142 -36 4 -49
-1881 -49 -51 43 -58 158 83 41 81 37 -38 97 -29 -40 82 4 28 63 -12 -10 52 28 54 37 28 33 -17 -113 -138 -136 26 44 -2 -25 -102 75
-1847 75 -50 2 -53 60 20 -55 10 -69 -49 -46 31 -1 182 -79 -73 148 23 -62 -62 64 33 -81 5 53 -47 38 31 -18 -35 51 36 18
-1815 18 124 33 -1 -70 82 49 -24 -93 -51 51 10 17 -64 53 1 -130 -102 -87 27 135 66 45 35 1 -106 -147 14 43 -37 -12 -57
-1784 -57 10 75 -41 -157 -144 -30 -183 -186 46 3 87 -11 66 -55 -127 -91 -142 -129 -198 113 -5 22 -172 -68 -20 -138 -97 -4 -11 -74
-1754 -74 -27 143 -49 18 -85 -48 -8 77 87 26 40 6 -10 68 8 -87 -65 27 -29 -36 18 -47 -103 41 68 23 55 -12 -150 -62 -24 45 -2
-1721 -2 -31 -47 6 -66 128 112 57 40 15 29 15 -27 -17 12 99 57 105 48 -33 76 -75 5 39 65 -4 5 -42 -74 -9 -2 -49 19 -6 -14 187
-1686 187 100 159 75 -21 -38 -33 -126 12 -17 -20 20 119 15 -29 123 -71 -52 -7 -21 -4 123 39 -18 33 72 105 26 -127 -125 121 112 2
-1654 2 142 47 94 22 60 46 40 76 43 -41 30 73 15 23 88 34 -112 -64 94 -72 -25 -5 118 90 69 8 48 87 89 38 101 18 -132 -140
-1620 -140 -40 141 51 62 -38 -136 -15 9 -56 -69 12 74 -14 51 24 -24 60 102 4 -96 -36 44 -30 -98 -40 32 -8 -41 42 -90 -8
-1589 -8 -28 -14 -30 2 54 52 122 -50 -67 119 -57 -36 -56 12 156 114 70 92 66 -56 -69 -62 0 -82 -76 -93 -30 49 111 5 75 0 -20 70
-1555 70 -49 88 7 -71 59 31 42 1 -72 -12 96 -58 -38 -60 -128 42 30 78 14 -39 -61 -71 122 -149 -29 -100 -15 -17 -27 -3 -31
-1524 -31 9 30 107 107 -19 41 -32 -29 -55 5 -92 -10 115 48 0 -107 -32 20 -14 -25 -106 8 -31 94 -74 -79 -102 -6 83 -120 53 107
-1492 107 43 -14 -88 14 -57 72 15 64 -15 -70 -44 -97 -67 63 3 61 49 8 -9 -6 69 118 141 154 1 -46 32 -35 69 -3 26 38
-1460 38 -10 109 -37 4 64 61 41 178 10 -105 -9 -16 157 42 126 -10 83 141 -16 -61 0 0 32 72 -35 6 96 17 -25 -80 -64
-1429 -64 185 97 25 -10 2 83 51 76 68 -52 -130 -66 -3 87 -91 -67 61 19 -7 -130 -4 41 -6 72 128 18 -53 -19 47 37 74 -139
-1397 -139 -89 -81 -10 -88 -19 0 83 78 -120 53 3 -4 -61 -20 -41 63 -26 -61 26 9 69 -83 -61 101 -23 -62 36 4 106 36 48 -78
-1365 -78 -17 -18 -19 -53 -54 -157 -51 84 -22 74 79 13 109 48 22 -27 50 1 37 -84 38 -99 8 142 76 -75 -28 2 19 118 70 -53
-1333 -53 -11 -52 61 -11 -100 -27 -128 -136 60 102 12 7 -70 -11 -8 44 29 146 -42 73 29 0 123 96 74 116 57 -31 29 -20 -18 49 -47
-1300 -47 22 27 -65 123 -14 163 -31 12 -22 36 2 12 150 188 60 -36 -9 32 -73 -151 -95 28 -19 54 50 -113 -160 -121 32 15 78
-1269 78 -15 -70 -23 -86 -5 -24 6 53 50 -92 32 75 78 -60 -87 52 153 18 93 14 -24 -9 6 -109 -85 -104 -74 -3 -55 -23 5 -51
-1237 -51 -38 38 50 -100 -22 80 2 -41 -25 78 59 98 -45 -16 -26 -56 -9 -77 -151 -126 -135 -60 -78 13 77 5 -45 87 94 74 27 12 49
-1204 49 180 -49 -38 63 -19 -68 42 76 12 53 80 82 25 -28 0 83 157 -65 75 -16 -18 -91 -15 -32 34 -111 -27 -45 -9 47 79 19
-1172 19 58 -87 -20 -12 51 -81 94 -21 112 159 -39 -38 0 4 89 -109 -53 -98 59 28 -70 -83 84 -91 -66 17 71 44 88 2 64
-1141 64 83 44 -34 -76 86 -26 -111 -27 52 -84 -62 -10 55 19 22 -46 -95 -91 -195 -36 69 75 37 -2 -8 82 54 130 -1 -41 -125 12 2
-1108 2 -56 124 -33 145 108 70 -178 30 37 99 2 -18 50 35 60 3 51 -68 38 -39 -45 56 -23 -140 -160 -21 2 -81 -32 13 51
-1077 51 104 75 67 177 59 87 7 32 72 57 79 -40 -84 8 17 -52 -62 -31 72 7 1 88 -19 -159 -7 -8 93 37 49 13 -12 81 -5
-1044 -5 -94 -82 -28 3 -105 14 -59 20 7 -44 -77 -92 122 61 -15 56 137 -34 54 23 -31 -90 -52 81 26 -45 77 74 105 49 25 -73 -59
-1011 -59 -39 -80 59 89 -35 47 121 -12 -29 32 -35 -73 -30 -5 -27 99 61 -33 -175 11 -19 27 -51 -3 87 38 25 71 -38 -74 -18
-980 -18 26 99 80 -34 46 15 -77 -71 -50 124 -19 89 95 -46 -35 33 113 61 8 97 201 -85 -25 -135 -146 -82 -20 1 6 -16 -110 -74 -27
-947 -27 66 64 -60 -39 111 -41 44 13 -151 9 -51 13 19 4 -12 -48 43 -66 99 -14 98 149 -2 -91 116 77 128 133 7 -42 1
-916 1 63 -73 -103 -54 9 -13 64 -64 -21 33 55 13 -50 15 -2 3 -32 -80 50 104 100 -22 -41 27 61 -36 -48 -10 -62 -59 -128 41 43 21 12 64
-880 64 -90 -77 -52 0 8 47 135 -14 14 -82 -83 -80 4 -13 -49 16 0 27 -87 -19 -15 -99 18 -103 -37 -5 18 155 13 47 141 -38 15
-847 15 34 -107 -23 -6 -91 72 20 129 166 -9 55 31 56 -25 16 18 -6 18 13 -99 91 -35 2 32 28 -83 21 18 -75 -7 -121 -22
-815 -22 -147 81 29 28 56 -77 -47 101 -58 -69 -171 -10 -69 68 102 56 20 -109 -115 -101 -4 -136 -82 20 30 -6 -93 34 -47 16
-785 16 -12 -7 -73 -69 14 146 4 -94 35 161 79 -131 74 51 -83 17 -28 -119 -46 -35 37 56 -74 -133 -63 131 23 -37 38 73 87
-754 87 32 -43 44 49 19 -43 -15 0 -74 7 -120 4 -34 17 -81 -52 95 -120 15 -54 18 62 -83 27 43 -47 -45 -83 18 -40 -41 -94 -7
-721 -7 -46 16 -35 90 -66 33 -31 -20 45 59 84 -11 -26 -43 13 43 -27 100 -25 10 -105 66 105 -134 -55 -61 -51 25 84 -19 -46 -33
-689 -33 -56 64 87 -17 17 -4 -91 -43 -32 -66 97 6 51 35 -128 -8 -35 -17 10 31 -15 -95 -100 19 15 59 -73 8 74 72 -26 -134 -154
-656 -154 57 -48 -41 27 -76 -1 -34 28 -75 8 54 6 74 -14 -86 -103 86 2 -73 5 -41 -44 55 68 93 -20 -97 77 64 -12 -68 -46
-624 -46 45 50 -14 -50 -99 15 -4 -55 53 -67 -139 125 201 316 89 8 22 50 109 57 -69 -73 10 38 151 -18 15 -49 -4 75 47 9
-592 9 -47 46 -64 92 -138 -74 4 -17 26 -102 -67 -32 -55 -58 -127 -36 -66 -45 -6 24 -24 -41 -113 48 -30 -29 -87 -97 -6 62 24 32 -47 -136 -15
-557 -15 -51 -4 66 -31 -52 10 63 77 94 -13 -43 0 -21 0 -147 -42 -119 9 -61 49 2 -29 27 30 51 149 13 114 126 40 -208 -22
-525 -22 -50 66 15 81 160 132 -7 13 14 -62 26 -15 96 25 26 46 58 -50 -121 12 7 -26 19 -19 -81 -7 3 20 112 22 -59 2 -84 -118
-491 -118 -66 -48 -104 -18 71 31 -16 34 -86 -5 -73 -65 -22 72 -30 -4 -22 -13 -7 51 92 56 -58 -9 -86 40 -31 34 53 -7 0 -52 9 102 8
-456 8 -51 -17 -129 -39 -45 12 37 -27 170 19 117 30 68 136 77 52 173 15 22 -33 12 59 -3 -125 -80 28 -38 -87 13 12 -54 -69 73
-423 73 -74 6 78 -23 128 101 62 -69 -42 -171 -16 47 109 118 129 -17 26 68 3 -27 -22 -11 53 11 115 2 81 58 -47 2 -5 46
-391 46 53 37 130 -5 8 103 -98 -124 -74 -1 18 90 91 -24 -38 -33 189 82 12 9 1 12 -98 23 170 -70 46 67 42 -50 39 58 -13
-358 -13 -14 97 -24 -23 33 99 -15 -31 20 77 -41 0 -5 -81 -29 -106 63 -111 -111 -20 -38 -85 -93 96 58 65 -238 27 -43 -17 -84 91 -14
-325 -14 106 117 153 48 33 5 68 -56 46 18 81 172 111 53 35 -55 37 49 -42 -2 -67 -78 -24 28 108 -12 56 68 234 187 69 58
-293 58 104 -2 5 -97 -96 -91 -30 -27 60 25 92 175 -42 -47 -13 -130 -56 11 -91 -24 137 57 -6 -76 -66 -64 25 0 -40 -71 -64 70 12 136 59
-258 59 -47 -31 20 21 106 11 6 -100 -20 -116 123 119 34 38 169 93 -45 -46 -8 120 -69 21 -15 27 -23 91 -84 -4 -82 83 131 -63
-226 -63 -46 8 56 19 -65 20 -6 -46 -6 125 109 -35 35 42 164 -29 -61 -115 15 99 67 -45 54 -86 -6 48 83 51 125 42 44 -64
-194 -64 8 -20 5 -21 -70 -71 12 40 -56 68 21 28 0 -57 -139 -217 -30 32 24 46 -98 57 45 14 20 18 -4 11 -64 -63 -23 -17 43 0 8 -18 20
-157 20 -32 -24 50 75
-153G5
##PAGE=	F1=14193.457377052167431
##FIRST=	31355.342622953838145,	6319.7438965998480853,	-0.072264619171619415283
##DATATABLE=	(F2++(Y..Y)), PROFILE
-2200 58 74 -6 18 34 -19 105 98 29 47 -61 -36 38 -94 -34 0 22 -1 3 111 -201 77 115 -43 -47 -47 5 -7 -78 31 70 -75 -170
-2168 -170 -22 19 -55 -13 3 29 -36 -22 -9 23 -68 -27 -44 -133 13 81 -97 -14 -62 -25 38 -79 -153 83 60 3 10 140 81 -80 -22
-2137 -22 -28 -76 0 -115 49 -66 -14 -55 -29 116 155 35 -110 -12 11 -73 102 -107 -156 -40 -8 -9 20 58 45 3 -88 112 42 95 50
-2106 50 -54 7 -77 137 65 -16 1 -23 51 50 -15 62 -14 62 132 90 -14 1 -32 -114 -140 87 51 -3 -18 68 34 857 7999 14892 8933
-2075 8933 1808 72 -193 -99 -66 27 -39 -97 84 -53 -52 -35 -18 21 -97 -123 -75 24 -56 -87 -119 -92 -78 -62 -58 -21 -74 80 37 14
-2045 14 75 29 56 -33 -21 -22 82 -2 -123 68 1 1 49 129 197 310 365 318 373 295 25 7 107 -19 -50 72 -32 -46 50 -41 -68
-2014 -68 -19 37 53 -97 19 -12 88 -30 57 -10 7 -112 -100 -44 -36 -18 20 15 11 -154 -35 61 19 -98 -55 -67 107 68 -16 -28 -20 -53
-1982 -53 -106 -59 -69 49 -64 24 73 38 42 66 31 -47 65 48 125 72 76 242 26 26 136 8 -57 -7 -107 82 124 396 296 49
-1952 49 567 320 -86 439 95 103 124 -117 -14 54 35 69 54 -55 -24 84 -104 -12 -6 -60 -41 -3 13 -10 93 -82 -65 2 0 -90
-1922 -90 -26 -45 -126 13 88 27 52 -39 27 -29 0 -18 18 72 36 -8 19 -39 -51 -28 -35 138 -21 58 11 45 82 -23 -35 32 10 3 70 114
-1888 114 -6 48 52 145 -28 -24 -50 -43 54 -50 155 92 58 112 48 -41 96 0 -46 73 -17 0 50 -23 -6 55 35 53 37 43 12 -37 -116
-1855 -116 -147 -116 30 56 -3 -15 -105 64 -39 -19 -75 48 11 -52 -13 -72 -59 -57 9 -28 210 -61 -72 145 18 -78 -73 69 52 -49
-1825 -49 18 56 -53 48 39 -29 -43 72 24 -14 120 58 0 -65 97 46 -18 -85 -76 51 19 5 -95 52 2 -123 -73 -71 48 151 60
-1794 60 53 44 -6 -92 -133 9 16 -28 -9 -52 41 67 -29 -167 -170 -46 -190 -180 61 17 98 -9 63 -53 -103 -84 -122 -131 -238 115 -10 2
-1762 2 -158 -75 0 -126 -101 15 8 -64 -7 149 -68 11 -89 -49 -14 55 98 37 21 -17 -39 43 -7 -83 -59 43 -31 -59 15 -76 -125 17
-1730 17 35 34 22 -38 -154 -29 -34 42 -26 -20 -38 27 -21 113 113 73 37 7 50 35 -35 0 16 103 59 93 51 -43 46 -62 15 29 59 -3 7
-1695 7 -33 -39 -9 14 -41 -9 8 -6 188 92 155 80 -9 -25 -11 -115 -3 -44 -52 19 128 8 -9 117 -97 -81 -20 -51 -23 141 44 -12
-1663 -12 21 71 117 19 -138 -91 126 99 8 159 68 95 11 51 40 75 86 53 -42 23 83 11 27 89 53 -94 -44 76 -73 -17 -11 110
-1631 110 85 55 -6 45 80 89 23 120 37 -127 -150 -47 130 30 63 -14 -117 -7 33 -43 -67 28 60 -47 17 10 -18 62 119 23 -95
-1600 -95 -29 70 -11 -113 -39 39 1 -41 46 -80 -27 -25 -1 -33 -19 23 44 92 -39 -57 120 -57 -40 -53 23 183 125 77 92 72 -59 -77
-1568 -77 -64 -5 -91 -96 -101 -43 59 91 -9 56 -17 -45 61 -56 77 1 -91 53 25 46 -9 -82 -36 71 -71 -36 -56 -113 40 19 98
-1537 98 9 -71 -40 -87 136 -123 -25 -96 -22 -36 -27 0 -22 17 31 101 110 -14 54 -35 -32 -64 12 -84 -34 102 70 7 -93 -28 35 -6 -20 -117
-1503 -117 24 -13 91 -72 -73 -118 8 88 -127 71 119 36 -14 -81 -10 -45 54 6 42 -21 -73 -15 -85 -68 78 14 67 77 44 -10 -4 84
-1471 84 132 151 172 1 -30 31 -19 73 3 32 38 -19 122 -60 -2 69 67 54 167 11 -104 13 -40 146 31 109 -30 78 122 -15
-1441 -15 -66 24 22 51 49 8 11 96 22 -2 -62 -65 187 96 0 -22 9 74 54 76 86 -69 -139 -74 -31 67 -100 -66 64 19 -15 -155 -26 41
-1407 41 -7 73 143 20 -50 -48 41 50 52 -134 -80 -46 3 -73 7 0 57 73 -120 41 -7 1 -59 -7 -41 72 -26 -78 2 19 67 -86 -61 120
-1373 120 -36 -55 30 0 92 44 43 -60 -16 -5 -17 -54 -54 -164 -54 80 -16 86 102 5 73 60 19 -72 46 7 41 -63 33 -115 1
-1342 1 123 44 -94 0 3 30 141 67 -60 -10 -22 56 -5 -87 -19 -115 -118 94 96 -1 -6 -59 -17 19 47 -8 118 -48 69 9 0 118 79
-1309 79 60 139 65 -41 36 -21 -25 57 -55 -2 55 -73 128 -5 193 -37 0 -70 36 15 9 148 198 49 -49 6 31 -80 -147 -113
-1279 -113 39 8 55 58 -133 -151 -99 17 12 60 -9 -75 -33 -130 -14 -50 -10 49 57 -113 20 86 98 -63 -99 40 138 7 97 -6 5
-1248 5 5 23 -113 -51 -88 -49 7 -60 -28 8 -52 -55 37 57 -60 -19 76 15 -44 -21 98 60 119 -53 -2 -29 -40 -11 -92 -161 -137 -153 -79 -74 1
-1213 1 77 27 -27 83 81 69 40 23 48 187 -40 -26 81 -21 -48 18 69 25 46 95 86 14 -33 6 119 157 -81 55 -17 -13 -74 -23 -49
-1180 -49 5 -110 -7 -44 5 53 64 3 28 -84 -10 -12 85 -57 89 -16 108 126 -38 -11 -19 2 105 -85 -30 -101 60 13 -62 -64 61
-1149 61 -98 -39 8 59 23 81 -18 76 90 50 -35 -68 87 0 -118 -39 50 -61 -76 -24 41 21 29 -59 -94 -81 -206 -54 43 81 43 -16
-1117 -16 -10 81 58 122 5 -26 -115 27 4 -58 117 -4 146 120 102 -145 52 45 91 2 -54 42 43 50 4 45 -71 47 -43 -40 66 -39
-1085 -39 -129 -163 -34 0 -69 0 -5 59 113 83 52 158 10 109 0 13 51 40 99 -23 -58 -1 16 -60 -100 -47 82 12 -21 100 -4
-1054 -4 -157 -7 15 84 24 52 10 -8 92 -17 -110 -91 -36 -12 -123 -14 -59 16 14 -60 -88 -70 122 44 -19 54 130 -47 38 6 -17 -86
-1022 -86 -51 71 26 -51 56 71 113 40 22 -59 -66 -50 -97 75 100 -30 39 107 5 -1 12 -37 -66 -47 -11 -29 97 48 -40 -177 6 14
-990 14 21 -43 -10 83 56 37 93 -13 -69 -37 25 59 77 -41 40 19 -42 -64 -33 108 -40 72 118 -26 -53 22 91 51 39 98 155 -87
-958 -87 -28 -135 -153 -67 -28 -6 0 -9 -84 -92 -47 64 58 -45 -22 113 -58 38 37 -136 21 -52 28 13 9 -16 -63 28 -80 108 -40 100 158
-925 158 3 -59 113 94 138 133 -5 -41 -2 54 -95 -104 -47 -12 -20 57 -67 -37 16 58 -9 -18 32 7 8 -18 -67 76 137 132 -34 -60 40 98
-891 98 -34 -48 -15 -64 -47 -107 33 42 22 3 54 -61 -63 -47 -30 -1 67 125 -27 6 -86 -67 -84 31 -3 -53 20 7 16 -99 -12 11 -100
-858 -100 24 -85 -28 -16 4 139 13 43 134 -22 5 29 -139 -46 -18 -89 82 25 130 185 -5 54 36 61 -31 34 39 7 -2 19 -75
-827 -75 97 -25 8 27 45 -63 41 -1 -83 27 -92 -48 -147 79 35 18 63 -83 -59 91 -65 -74 -173 -11 -50 54 69 57 49 -111
-797 -111 -148 -87 20 -142 -95 39 35 -10 -106 40 -46 3 -24 -15 -58 -64 39 120 -29 -122 -15 149 84 -136 69 31 -71 -7 -47 -113 -38
-766 -38 -37 24 49 -68 -141 -86 108 14 -35 21 66 79 51 -21 44 71 0 -43 -21 -5 -70 21 -123 11 -39 26 -88 -53 109 -87 16 -48
-734 -48 11 35 -80 13 24 -43 -26 -64 24 -17 -34 -103 31 -43 12 -43 86 -64 46 -41 -15 21 77 110 8 -12 -42 12 54 -9 92 -18
-702 -18 31 -108 78 93 -127 -44 -78 -35 13 81 -22 -51 -32 -60 75 72 -28 7 -32 -93 -53 -11 -49 99 -15 44 27 -106 -18 -40 -6
-671 -6 2 35 -17 -95 -121 38 10 58 -58 23 81 67 -17 -99 -141 42 -29 -48 23 -90 4 -39 38 -49 9 67 34 69 0 -72 -80 75 1 -57
-637 -57 10 -52 -22 57 56 91 -53 -90 67 56 7 -58 -16 60 48 0 -41 -103 29 -25 -60 51 -57 -155 99 140 250 46 -6 -24 35 96
-605 96 69 -78 -77 27 47 152 -18 16 -37 -12 71 45 17 -15 48 -66 99 -139 -69 9 -22 -1 -110 -60 -50 -82 -78 -111 -52 -73 -57 -26
-573 -26 31 -10 -35 -99 40 -35 -17 -64 -91 -21 55 47 44 -46 -140 -10 -39 3 43 -30 -60 33 50 65 93 -8 -46 0 -19 -10 -143 -46 -135 7
-539 7 -75 55 6 -25 17 13 55 151 16 124 121 17 -191 -2 -57 39 25 80 144 149 11 23 36 -65 19 -10 75 0 19 24 73 -38 -94
-506 -94 21 12 -23 40 20 -80 -11 8 41 114 -5 -57 -6 -91 -116 -46 -45 -109 -5 86 9 -45 21 -68 -10 -67 -61 -15 55 -35 -13 -11 -14 -9 31 86
-470 86 69 -43 -7 -88 54 -23 24 39 9 -33 -65 -14 70 18 -51 0 -124 -58 -39 18 36 -56 145 27 112 23 69 123 91 52 176 24
-438 24 28 -27 2 56 -12 -123 -62 23 -46 -108 19 17 -62 -95 75 -60 0 110 -28 137 95 62 -79 -26 -153 -33 31 127 132 129 0 45
-406 45 66 2 -29 -14 -12 48 7 105 -6 100 52 -47 -25 -14 68 42 44 116 -20 12 92 -110 -144 -88 16 18 79 85 -32 -19 -50 199 76
-373 76 4 16 -19 3 -84 8 142 -82 36 57 25 -28 48 59 -27 -12 95 -26 -29 52 125 -28 -32 -7 75 -37 2 -4 -69 -24 -117 53 -114
-340 -114 -120 -16 -61 -112 -97 113 44 67 -239 24 -53 -24 -78 80 3 110 116 164 60 35 0 84 -45 40 15 69 164 116 63 35 -64 28
-308 28 34 -38 -4 -65 -81 -8 6 108 -13 46 44 236 185 60 39 99 -9 -1 -94 -114 -125 -50 -8 68 29 68 173 -27 -50 -24 -127 -52 14
-275 14 -80 -27 117 36 -10 -89 -68 -41 19 -9 -41 -72 -62 61 17 162 73 -35 -12 19 6 89 11 -3 -98 -13 -117 101 136 41 38 146
-243 146 69 -46 -49 14 111 -78 25 -13 12 -27 91 -81 -12 -61 70 129 -52 -20 13 38 33 -53 32 -19 -55 -28 115 80 -57 27 18 145
-211 145 -43 -45 -125 17 73 45 -72 38 -92 -21 49 77 71 143 29 34 -66 12 -25 0 -14 -62 -85 -7 45 -61 82 34 27 -3 -66 -129
-179 -129 -234 -39 41 50 60 -81 49 58 24 34 17 -5 0 -69 -39 5 -5 43 -7 0 -4 32 -40 -22 60 67
-153F7
##PAGE=	F1=14129.420491806264181
##FIRST=	31355.342622953838145,	6319.7438965998480853,	-0.050674840807914733887
##DATATABLE=	(F2++(Y..Y)), PROFILE
-2200 50 85 -3 4 24 -13 114 96 27 63 -59 -37 25 -91 -32 2 37 -9 -20 102 -206 100 138 20 -22 -63 -21 -3 -67 3 49 -94
-2169 -94 -191 -26 9 -57 -5 5 31 -38 0 -19 57 -92 -13 -37 -141 0 56 -98 -4 -64 -31 74 -60 -139 95 72 -5 0 138 100 -63
-2138 -63 -4 -17 -55 0 -132 30 -76 1 -53 -49 112 154 37 -139 -20 9 -73 110 -110 -153 -63 10 27 49 65 37 11 -106 88 46
-2108 46 96 49 -79 -13 -99 135 55 -42 -11 -51 50 77 -5 76 3 73 131 63 8 39 -19 -101 -158 70 57 -2 -27 73 34 1235 11181
-2077 11181 20601 12467 2722 236 -151 -55 -41 35 -46 -53 104 -7 -2 -11 -3 26 -115 -114 -62 30 -38 -87 -80 -85 -82 -41 -31 -10 -63 66 29
-2046 29 -9 66 16 51 -14 -15 12 110 -12 -115 101 21 -11 54 132 189 321 338 256 311 258 -7 -32 101 -24 -58 52 -12 -53 37 -46
-2015 -46 -70 -28 19 39 -97 17 -36 116 -4 65 -1 15 -81 -102 -56 -36 -9 30 32 22 -139 -35 43 3 -76 -39 -83 81 50 -16 -32 -34
-1983 -34 -64 -108 -54 -50 68 -72 0 70 51 41 58 17 -50 62 63 120 52 58 224 20 30 143 23 -21 4 -101 71 110 382 231 -7
-1952 -7 521 262 -143 386 102 111 137 -130 -47 74 44 46 32 -73 -30 104 -95 -9 -6 -49 -35 11 -6 -17 107 -49 -50 16 -3 -86 -36
-1921 -36 -31 -93 31 79 47 48 -45 36 -25 -3 -34 2 77 32 -13 29 -68 -51 -12 -15 143 -14 61 5 46 58 -13 -47 19 36 8 76 102 14 56
-1886 56 47 135 -19 -54 -46 -37 64 -41 138 88 68 128 59 -46 89 40 -49 53 -38 -23 32 -32 -3 48 45 53 42 56 -10 -51 -108 -145 -92 29
-1852 29 77 2 -4 -105 51 -31 -41 -97 28 -3 -53 -35 -68 -63 -65 -11 -59 229 -33 -66 133 10 -93 -73 81 75 -11 30 52 -58 53
-1821 53 42 -45 -46 94 6 -47 115 78 4 -50 106 40 -15 -71 -96 43 27 0 -118 51 1 -109 -52 -53 61 152 44 62 58 -7 -74 -113
-1789 -113 9 -10 -22 -3 -46 71 55 -22 -171 -187 -61 -184 -170 74 26 94 -14 53 -42 -70 -77 -102 -133 -264 113 -12 -15 -131 -76 9
-1759 9 -110 -105 30 18 -60 18 144 -83 7 -88 -54 -18 26 104 49 -2 -44 -62 17 -27 -67 -45 60 -29 -73 11 -104 -136 -4 8 42 -11
-1727 -11 -69 -139 3 -44 40 -40 -9 -32 53 24 102 112 93 38 -5 63 55 -42 16 19 104 52 75 48 -52 16 -44 22 21 51 1 9 -27 -7 -6 29
-1691 29 -31 -26 22 -1 179 81 143 78 0 -9 9 -96 -16 -69 -87 19 124 0 10 103 -118 -111 -30 -74 -31 150 45 -9 21 73 128 7
-1659 7 -140 -53 121 82 10 164 84 88 -1 41 39 103 90 57 -33 17 81 7 32 90 72 -76 -29 59 -70 -9 -10 97 76 43 -22 41 70 92
-1625 92 3 133 46 -121 -146 -47 109 7 64 10 -92 -3 53 -27 -61 43 47 -69 -7 5 -7 64 124 41 -88 -16 92 7 -116 -38
-1595 -38 41 12 -39 43 -61 -43 -21 18 -39 -39 -9 37 55 -27 -43 112 -54 -42 -52 23 203 136 84 90 80 -55 -86 -55 -6 -91 -118 -105 -54
-1562 -54 58 64 -27 34 -33 -65 48 -58 69 0 -104 48 16 43 -27 -82 -52 48 -75 -32 -53 -92 39 4 111 4 -99 -18 -104
-1533 -104 149 -89 -28 -90 -29 -57 -30 0 -12 26 30 90 107 -6 69 -39 -30 -65 20 -63 -53 87 95 14 -73 -16 54 2 -18 -125 41 0
-1501 0 81 -66 -66 -137 22 85 -117 81 120 28 -15 -63 -28 -37 39 -4 28 -25 -71 12 -77 -71 86 20 63 93 80 -12 3 88 135 148 174 5
-1467 5 -10 30 -3 72 14 35 37 -27 130 -78 -6 71 77 76 155 7 -105 29 -65 132 20 92 -47 61 89 -14 -66 47 42 68 29 54
-1435 54 11 86 39 29 -29 -66 180 88 -19 -23 20 72 65 75 99 -78 -141 -78 -63 45 -108 -67 60 19 -15 -176 -41 41 -5 72 145 16
-1403 16 -48 -79 32 52 28 -121 -66 -10 19 -51 41 12 36 65 -119 34 -15 5 -54 5 -36 78 -26 -96 -18 38 62 -87 -62 134 -49
-1372 -49 -45 24 -7 79 46 36 -38 -12 6 -14 -50 -52 -162 -55 72 -7 97 113 3 41 71 15 -114 35 17 41 -38 30 -126 -11 95
-1341 95 15 -109 24 1 40 155 62 -53 -6 3 57 4 -67 -10 -98 -92 131 88 -16 -21 -53 -22 44 52 -36 87 -52 63 -6 1 104 57
-1309 57 40 151 74 -51 43 -21 -30 62 -58 -25 79 -73 132 7 212 -50 -14 -115 39 27 8 139 195 39 -61 26 29 -84
-1281 -84 -143 -122 46 30 49 59 -148 -138 -63 8 15 38 -5 -77 -45 -166 -24 -74 -28 47 58 -127 5 90 119 -62 -107 24 127 -5
-1251 -5 101 -17 39 14 37 -112 -7 -67 -18 13 -69 -34 5 -57 -66 40 61 -22 -20 64 29 -45 -14 119 62 137 -50 12 -30 -24 -11 -94 -160
-1218 -160 -149 -166 -98 -63 0 76 45 -9 67 62 60 48 33 40 189 -36 -15 91 -26 -28 -7 60 40 35 105 90 4 -43 7 152 151 -84 29 -26
-1184 -26 -3 -50 -34 -68 -23 -104 9 -41 24 54 48 -16 0 -72 -8 -16 116 -33 80 -13 99 84 -37 22 -34 1 120 -55 -11 -105 60
-1153 60 -9 -54 -45 38 -99 -16 6 47 3 72 -38 90 88 61 -37 -62 77 21 -122 -54 39 -38 -86 -38 23 23 38 -72 -92 -60 -200 -71
-1121 -71 11 79 42 -35 -11 80 67 103 12 -4 -98 45 5 -58 104 16 141 125 125 -110 71 50 78 -3 -86 34 55 38 1 34 -71 49
-1089 49 -44 -35 74 -58 -112 -155 -45 -4 -55 40 -18 64 115 87 43 139 -35 125 -5 -2 30 20 114 0 -33 -6 10 -69 -129 -56 89 24
-1057 24 -37 112 9 -147 -3 40 78 8 51 8 7 95 -24 -121 -94 -35 -30 -139 -44 -60 6 22 -73 -92 -47 120 22 -26 44 117 -49 32
-1025 32 -6 2 -78 -47 63 30 -53 39 80 114 28 16 -40 -68 -56 -108 87 104 -24 29 88 30 29 -7 -44 -61 -64 -8 -30 92 34 -43 -166 7
-991 7 44 23 -33 -18 77 67 41 106 5 -67 -51 26 22 63 -46 33 18 -6 -51 -15 84 -64 56 137 -6 -66 11 64 33 64 86 106 -84
-958 -84 -34 -132 -150 -51 -29 -9 -7 -1 -63 -113 -62 61 44 -26 0 106 -72 27 52 -116 29 -53 44 8 14 -15 -73 12 -85 112 -64 100 159
-925 159 4 -23 118 113 142 131 -13 -35 -4 39 -119 -104 -42 -36 -29 50 -68 -47 0 61 -33 10 47 18 16 -10 -49 99 163 153 -41 -75 49
-892 49 123 -28 -39 -9 -65 -34 -83 26 37 26 -7 40 -30 -45 -39 -53 -13 76 102 -34 -2 -85 -51 -80 61 12 -60 19 18 12 -103 -4 30 -103
-858 -103 29 -62 -23 -30 -3 121 17 37 122 -3 -4 13 -165 -62 -31 -79 87 24 118 197 -2 47 35 65 -43 47 60 28 -20 31 -46
-827 -46 98 -14 14 19 55 -36 56 -20 -86 53 -58 -66 -137 76 39 11 72 -83 -64 73 -68 -80 -177 -5 -29 41 38 55 82 -104 -176 -71
-795 -71 43 -143 -106 60 44 -12 -122 40 -45 -11 -32 -26 -40 -56 61 99 -62 -143 -64 132 87 -133 65 9 -52 -27 -66 -99 -25 -44 12
-764 12 37 -59 -139 -101 80 5 -25 0 51 64 66 -1 46 92 -14 -37 -29 -8 -60 34 -117 14 -39 35 -92 -49 117 -50 10 -45 3 9 -67
-731 -67 2 10 -38 -16 -38 35 8 -25 -107 70 -43 6 -46 81 -57 58 -51 -13 -2 89 136 25 -4 -42 14 74 1 80 -14 44 -112 84
-699 84 75 -110 -29 -87 -14 2 69 -28 -53 -33 -62 83 57 -38 -5 -57 -88 -53 5 -31 93 -36 41 17 -75 -27 -37 6 -10 36 -15 -83 -128 46
-665 46 2 60 -41 31 84 62 -9 -61 -124 25 -1 -48 18 -110 1 -36 50 -19 14 76 61 65 20 -56 -55 52 -3 -44 9 -67 -5 52 37 82
-631 82 -81 -81 50 45 25 -46 11 77 44 3 -38 -107 42 -38 -59 47 -54 -168 71 75 175 2 -25 -72 15 77 71 -93 -83 43 54 139
-599 139 -12 18 -21 -10 62 45 28 13 49 -64 103 -128 -64 14 -27 -31 -109 -52 -66 -109 -95 -96 -63 -76 -70 -45 36 0 -29 -82 32 -41 -7 -40
-565 -40 -81 -34 43 65 53 -42 -134 -5 -19 15 21 -31 -64 56 37 51 98 4 -40 -4 -19 -24 -124 -49 -147 5 -86 62 6 -21 4 -1 54 146
-531 146 13 121 113 -5 -165 14 -54 14 32 76 125 158 31 37 64 -66 3 -1 51 -28 8 2 78 -26 -55 30 22 -17 59 58 -71 -10 14
-498 14 63 105 -35 -53 -10 -94 -113 -27 -42 -114 5 103 -10 -76 1 -43 -5 -55 -50 -6 32 -32 -22 -3 -11 -17 10 74 79 -32 -6 -83 64 -19 11
-463 11 23 26 -65 -69 -38 32 33 -50 15 -115 -70 -34 24 32 -85 117 34 102 8 66 107 101 52 173 29 35 -14 -3 53 -20 -113 -45 18 -55 -118 31
-427 31 20 -70 -113 78 -45 1 137 -32 135 86 52 -88 -2 -133 -50 13 136 136 117 18 64 56 8 -27 -5 -14 43 9 88 -12 113 39
-395 39 -38 -51 -17 95 31 54 99 -33 15 83 -114 -150 -96 41 21 71 71 -48 -1 -62 204 72 0 29 -46 -10 -73 -12 111 -87 31
-364 31 45 4 -11 56 58 -43 -6 86 -26 -25 70 145 -42 -33 -35 70 -30 2 -11 -52 -16 -124 47 -110 -117 -10 -81 -132 -99 117 28 67 -233
-331 -233 22 -59 -35 -68 68 23 108 106 173 72 35 0 90 -31 32 7 55 159 123 67 25 -71 20 25 -29 -7 -66 -79 8 -18 98 -17
-299 -17 29 29 226 175 50 27 99 -12 -6 -87 -133 -153 -66 12 74 29 41 164 -9 -51 -33 -114 -50 24 -63 -29 100 13 -18 -94 -70 -19 8
-266 8 -21 -41 -67 -58 44 20 179 71 -24 2 17 -12 67 10 -10 -90 -10 -114 61 152 51 40 120 41 -49 -54 39 95 -80 24 -10 -9 -33
-233 -33 82 -76 -19 -41 53 124 -33 0 13 18 43 -46 41 -38 -61 -52 102 46 -75 24 -15 117 -54 -23 -128 18 42 19 -93 20 -93
-202 -93 -30 54 68 89 156 13 21 -72 12 -31 -16 -12 -51 -100 -28 52 -62 89 45 28 -3 -63 -110 -230 -43 48 71 70 -59 37 66 40 52 19
-168 19 -1 -14 -71 -15 34 14 44 -14 -7 8 41 -46 -19 69 60
-153F0
##PAGE=	F1=14065.383606560364569
##FIRST=	31355.342622953838145,	6319.7438965998480853,	-0.022836901247501373291
##DATATABLE=	(F2++(Y..Y)), PROFILE
-2200 38 93 2 -11 15 -5 112 89 21 71 -55 -37 7 -80 -28 8 51 -16 -44 94 -198 122 158 92 18 -67 -47 -2 -56 -23 26 -106 -196
-2168 -196 -20 0 -56 3 10 28 -41 22 -18 92 -109 1 -31 -141 -12 21 -97 10 -64 -41 98 -41 -117 93 81 -11 -16 123 117 -37
-2138 -37 18 -5 -36 0 -143 10 -83 9 -50 -69 99 151 38 -160 -27 5 -73 112 -115 -138 -82 28 62 71 61 25 13 -123 54 47
-2108 47 97 43 -105 -36 -113 126 43 -62 -27 -82 43 94 2 81 15 82 121 35 31 79 -9 -85 -179 43 58 -4 -46 65 23 1570 13875
-2077 13875 25343 15467 3549 400 -93 -7 -9 40 -45 -6 130 41 46 14 15 29 -121 -99 -45 42 -14 -81 -40 -77 -85 -18 7 10 -57
-2048 -57 50 14 -30 52 0 45 0 -1 53 134 -20 -104 129 40 -25 64 141 180 337 310 200 267 230 -25 -59 92 -21 -74 31 7 -56
-2017 -56 31 -48 -65 -30 5 33 -92 20 -45 142 18 66 1 25 -46 -88 -64 -26 0 42 58 31 -119 -34 30 -4 -47 -21 -95 56 35 -18
-1985 -18 -31 -48 -74 -102 -41 -22 90 -69 -23 60 50 33 42 0 -53 60 74 99 23 36 197 15 32 141 37 10 13 -92 57 83 357
-1954 357 158 -54 481 204 -188 341 107 119 137 -130 -76 92 55 22 8 -88 -31 110 -86 -4 -7 -40 -25 28 -30 -19 114 -18
-1926 -18 -31 31 -4 -77 -38 -14 -54 41 64 55 44 -46 44 -23 -9 -42 -13 82 21 -14 41 -87 -45 8 9 138 -2 58 4 47 32 -1 -56 9
-1892 9 64 15 78 84 31 59 48 112 -10 -81 -38 -33 72 -33 108 70 70 126 68 -52 80 83 -50 26 -55 -41 11 -35 -1 34 58 55 50 63 -33
-1857 -33 -60 -93 -130 -69 26 101 14 6 -100 38 -25 -62 -114 2 -18 -55 -53 -59 -59 -71 -28 -89 238 -1 -57 115 0 -102 -64 100 96 25 40
-1824 40 41 -60 53 42 -65 -47 116 -12 -77 110 90 7 -27 111 36 -14 -52 -106 31 34 0 -132 49 -2 -91 -43 -34 66 141 19
-1794 19 69 75 0 -56 -90 13 -33 -17 2 -38 98 39 -21 -170 -191 -73 -165 -157 80 29 78 -26 38 -26 -32 -71 -85 -134 -276 106 -14 -28
-1762 -28 -96 -69 8 -91 -107 37 15 -63 43 132 -93 7 -82 -60 -21 -8 102 59 -26 -70 -78 -9 -48 -39 -22 75 -23 -79 7 -129 -133 -22 -10
-1729 -10 45 -45 -101 -106 33 -52 39 -44 0 -31 79 66 95 109 110 40 -17 64 70 -47 34 22 103 37 51 39 -58 -12 -22 23 16 40 9 9 -26 18
-1693 18 1 40 -21 -29 35 0 163 68 125 71 0 8 31 -68 -21 -88 -121 19 107 -7 27 85 -130 -138 -35 -86 -31 150 43 -6 32 76 136
-1660 136 -6 -133 -17 106 64 10 157 92 75 -14 31 43 122 85 55 -14 13 71 5 34 90 86 -60 -17 45 -61 -4 -3 81 65 35 -37
-1628 -37 37 60 96 -17 139 49 -113 -127 -42 81 -14 67 31 -60 0 68 -11 -52 58 35 -79 -22 7 5 62 118 56 -78 1 105 28
-1597 28 -104 -38 39 24 -35 32 -34 -54 -15 40 -46 -52 -41 30 16 -15 -26 95 -49 -44 -57 13 214 145 87 87 88 -44 -95 -35 -6 -85 -138 -102
-1563 -102 -62 47 34 -43 13 -44 -76 33 -56 63 3 -110 43 2 31 -49 -71 -58 31 -68 -23 -48 -66 38 -10 117 2 -120 2
-1534 2 -121 161 -49 -36 -85 -33 -77 -37 -4 -4 35 26 77 98 2 85 -40 -19 -55 28 -30 -65 73 119 18 -49 0 73 8 -18 -131 56
-1502 56 10 66 -54 -55 -157 33 72 -92 81 108 19 -18 -38 -39 -33 32 -16 23 -26 -64 38 -75 -76 88 23 48 96 111 -17 16 83 126
-1470 126 131 162 13 12 30 11 68 28 36 36 -33 131 -90 -5 72 89 103 143 1 -108 38 -87 115 9 79 -61 36 47 -11 -62 64
-1439 64 53 83 15 94 5 68 62 65 13 -68 165 74 -31 -15 35 77 83 74 105 -78 -134 -81 -95 22 -111 -73 51 21 -7 -189 -45 42 -3
-1406 -3 67 132 7 -46 -110 20 41 4 -105 -51 25 36 -28 75 31 24 53 -115 36 -22 7 -46 19 -30 79 -26 -110 -34 63 56 -87 -64
-1374 -64 138 -60 -36 18 -20 65 39 26 -15 -4 15 -8 -42 -50 -151 -55 60 4 104 111 8 19 79 10 -148 18 27 37 -12 25 -131 -31
-1342 -31 61 -6 -116 40 -1 50 158 53 -35 -3 22 62 16 -42 -1 -78 -64 166 79 -29 -33 -54 -24 64 58 -54 56 -52 57 -11 6
-1311 6 82 35 16 149 83 -59 51 -20 -37 61 -54 -43 94 -68 133 21 217 -68 -27 -150 43 37 8 123 181 31 -72 45
-1283 45 24 -83 -140 -124 48 42 36 54 -157 -127 -21 7 22 18 -2 -73 -57 -192 -36 -94 -46 44 51 -135 -8 87 135 -57 -108 4 120
-1252 120 -18 102 -20 75 15 45 -106 41 -41 12 13 -79 -39 2 -67 -70 47 65 10 -24 46 42 -44 -5 137 64 148 -35 25 -26 -10 -8
-1220 -8 -84 -149 -159 -172 -114 -48 4 73 57 4 40 37 47 52 41 28 186 -39 -7 90 -35 -10 -33 51 54 23 107 89 -3 -55 5 178 140 -73
-1186 -73 0 -42 9 -24 -47 -90 -49 -89 20 -36 41 47 34 -37 -22 -52 -14 -23 135 -9 66 -12 87 41 -36 59 -43 0 131 -22 2 -111
-1154 -111 59 -37 -45 -28 16 -94 0 9 39 -12 62 -51 105 76 76 -41 -60 60 38 -124 -68 22 -16 -89 -52 2 25 49 -82 -90 -32 -180
-1122 -180 -85 -20 69 36 -54 -13 80 79 75 17 21 -76 66 5 -57 85 25 131 125 141 -75 87 51 61 -14 -109 27 70 24 -5 23 -66 45
-1089 45 -42 -32 78 -72 -91 -137 -55 -9 -37 81 -24 63 105 84 42 124 -76 133 -12 -14 11 2 123 28 -8 -2 0 -75 -144 -55 95 42
-1057 42 -46 120 21 -128 1 63 74 -10 46 9 29 90 -26 -122 -90 -27 -48 -149 -72 -59 -8 30 -80 -89 -28 119 0 -37 28 98 -42
-1026 -42 35 -13 25 -69 -39 59 37 -51 27 97 108 17 6 -18 -63 -58 -113 93 102 -17 21 64 57 60 -25 -54 -61 -78 2 -29 86 24 -41 -142 14
-991 14 64 31 -20 -25 71 72 36 109 15 -69 -56 29 -6 45 -48 28 12 23 -35 1 53 -87 43 148 9 -73 0 38 7 81 66 56 -77 -42
-957 -42 -126 -138 -35 -24 -5 -12 6 -50 -135 -70 55 22 -6 26 91 -82 13 58 -93 34 -52 58 6 20 -10 -76 -6 -81 110 -84 96
-926 96 154 -4 6 129 135 138 128 -15 -28 -5 22 -140 -99 -39 -59 -39 42 -68 -53 -14 64 -55 33 57 26 24 -9 -27 115 180 158 -44 -85
-893 -85 49 131 -19 -23 4 -66 -23 -58 22 28 32 -18 27 -1 -25 -30 -68 -26 72 72 -35 -15 -80 -36 -70 92 31 -66 13 32 13 -98 7 40 -104
-858 -104 32 -36 -22 -48 -4 106 21 29 106 13 -12 -11 -179 -70 -43 -61 87 16 91 197 0 33 31 68 -56 54 78 53 -34 50 -13 94
-826 94 -2 20 5 55 -9 64 -34 -82 67 -27 -73 -117 71 40 6 81 -76 -64 51 -69 -86 -183 8 -10 32 12 50 115 -90 -195 -54
-795 -54 62 -140 -113 84 58 -15 -137 37 -44 -25 -33 -37 -19 -45 75 85 -86 -151 -104 113 87 -122 61 -13 -31 -39 -85 -80 -8 -55 3 24
-763 24 -50 -131 -110 48 -1 -11 -25 31 43 77 14 51 110 -25 -26 -38 -7 -46 40 -105 15 -32 41 -91 -37 117 -15 1 -47 -4 -12 -46 -3
-730 -3 1 -36 -16 -10 47 36 -12 -106 108 -42 1 -44 76 -45 68 -59 -15 -24 94 158 36 -3 -43 21 98 7 66 -15 47 -117 85 53
-698 53 -87 -14 -87 8 -4 52 -34 -48 -37 -66 86 43 -47 -20 -76 -76 -43 17 -15 80 -57 40 6 -38 -31 -26 20 -24 34 -7 -59 -121 43 -10 64
-663 64 -24 28 82 56 -3 -23 -107 10 30 -40 13 -133 -7 -27 63 8 19 74 84 60 44 -41 -32 22 -10 -38 1 -81 6 43 10 70 -99 -70
-629 -70 28 33 39 -32 37 94 40 -5 -40 -108 53 -43 -54 41 -59 -182 45 17 101 -35 -43 -115 -8 55 63 -111 -92 58 56 114 -2 18 -1
-596 -1 2 44 44 43 33 46 -59 105 -107 -58 19 -33 -61 -103 -43 -80 -132 -105 -84 -70 -74 -80 -59 40 4 -25 -63 24 -45 0 -19 -69 -48 27 74 59 -34
-559 -34 -119 -2 7 30 4 -32 -61 76 23 38 106 24 -24 -8 -20 -39 -95 -51 -151 4 -93 68 6 -17 -10 -13 48 132 8 106 102 -24 -131
-526 -131 26 -41 -7 33 72 105 155 50 52 92 -63 -19 9 29 -57 -6 -16 74 -15 -10 37 36 -9 73 88 -55 -5 20 83 87 -64 -50 -10 -94
-492 -94 -108 -12 -40 -118 12 119 -25 -103 -23 -15 9 -40 -36 0 6 -22 -29 0 -7 -30 -7 56 84 -27 -6 -71 68 -19 -2 9 39 -88 -63 -56 -6
-457 -6 47 -47 29 -102 -74 -31 32 26 -109 88 38 91 -10 61 91 106 53 164 29 43 3 -4 52 -27 -95 -30 16 -65 -116 46 20 -76 -122
-424 -122 80 -29 11 154 -35 123 73 36 -94 26 -114 -67 -4 134 130 96 36 79 38 19 -21 0 -19 40 15 66 -16 116 21 -24
-394 -24 -71 -15 124 23 65 80 -45 18 76 -112 -144 -96 70 29 66 55 -69 11 -69 206 73 -1 45 -76 -29 -69 -36 80 -85 31
-364 31 33 -22 -2 60 54 -59 0 71 -26 -11 86 160 -53 -38 -61 64 -23 0 -25 -31 -5 -126 43 -97 -103 -2 -94 -140 -98 109 11 63 -222
-331 -222 25 -61 -49 -53 54 40 99 89 179 82 38 7 87 -18 21 -2 39 155 132 63 8 -74 13 23 -17 -13 -74 -74 22 -43 80 -22 11
-298 11 25 203 157 44 25 101 -9 -8 -78 -150 -172 -79 33 76 28 14 149 7 -47 -39 -93 -52 41 -42 -32 89 -5 -27 -89 -71 0 -7 -34
-265 -34 -42 -56 -50 21 21 184 54 -14 11 13 -30 42 8 -14 -77 -9 -109 10 163 64 43 95 11 -50 -59 58 75 -74 20 -7 -35 -39 66 -68
-231 -68 -24 -23 36 116 -9 8 8 1 49 -44 44 -60 -64 -74 89 15 -91 29 -53 83 -62 1 -121 17 10 -6 -103 3 -85 -32 63 60 105
-198 105 162 -3 9 -79 8 -37 -43 -15 -38 -114 -46 60 -59 88 56 32 1 -49 -84 -205 -43 51 83 77 -34 25 66 59 72 24 5 -31 -69
-165 -69 8 61 38 46 -17 -14 19 49 -49 -15 74 55
-153E5
##PAGE=	F1=14001.34672131446132
##FIRST=	31355.342622953838145,	6319.7438965998480853,	-0.0065307104960083961487
##DATATABLE=	(F2++(Y..Y)), PROFILE
-2200 21 95 8 -26 6 4 99 79 12 73 -49 -36 -11 -63 -23 16 62 -21 -64 88 -178 139 173 160 69 -61 -66 -6 -49 -42 4 -109 -184 -9
-2167 -9 -5 -52 10 15 20 -43 44 -6 122 -117 17 -24 -133 -20 -19 -93 30 -62 -51 107 -23 -88 79 84 -13 -34 101 131 -6 44 3 -21
-2135 -21 -1 -146 -8 -88 8 -47 -87 80 143 35 -171 -31 -2 -73 106 -118 -112 -95 46 91 81 44 8 7 -136 15 45 99 33 -126
-2105 -126 -59 -115 111 31 -71 -43 -112 28 100 6 75 19 88 100 8 50 115 -3 -69 -198 8 51 -8 -68 46 4 1800 15631
-2077 15631 28343 17427 4142 540 -30 40 26 42 -36 36 157 85 87 39 34 29 -114 -77 -25 56 12 -72 -4 -71 -88 3 54 35
-2049 35 -56 35 -3 -47 34 -18 40 9 20 97 152 -24 -91 150 55 -38 76 154 166 352 281 148 245 212 -29 -72 82 -11 -96 10 23
-2018 23 -56 33 -48 -55 -23 -4 36 -81 27 -36 163 33 57 -2 38 -12 -62 -64 -7 7 54 90 38 -98 -34 24 -2 -16 -3 -101 32 23 -22
-1985 -22 -25 -62 -82 -90 -23 13 114 -57 -42 46 36 19 19 -20 -54 56 78 62 -10 12 167 12 35 130 45 31 16 -79 43 51 325 99 -73
-1952 -73 450 162 -199 312 113 125 124 -121 -98 101 66 0 -11 -99 -28 102 -77 1 -9 -31 -8 42 -56 -16 112 6 -11 45 -3 -66
-1922 -66 -34 2 -15 44 44 52 41 -43 52 -24 -18 -39 -26 85 5 -13 52 -94 -33 29 35 125 12 48 11 52 4 9 -57 2 87 24 76 58 41 57
-1886 57 53 79 -5 -100 -24 -33 76 -26 67 39 65 110 72 -56 73 125 -48 -4 -65 -50 -11 -32 3 16 72 58 61 62 -54 -62 -75 -103 -50 22
-1852 22 124 27 15 -89 25 -21 -78 -124 -22 -29 -57 -66 -47 -48 -73 -38 -111 238 27 -45 92 -12 -107 -47 124 113 55 48 26 -58 50 41
-1820 41 -86 -48 133 -28 -101 106 92 9 1 113 34 -13 -29 -104 16 41 4 -138 44 -7 -71 -44 -12 68 122 -9 72 87 10 -42 -67
-1789 -67 23 -49 -11 5 -31 119 19 -24 -165 -180 -80 -136 -143 77 28 52 -44 21 -8 3 -67 -74 -136 -273 94 -18 -35 -58 -56 -3 -72 -108
-1757 -108 36 2 -72 63 115 -99 11 -73 -65 -21 -47 88 65 -47 -88 -85 -32 -63 -5 5 88 -11 -75 1 -149 -116 -35 -22 46 -75 -129
-1726 -129 -62 56 -57 39 -43 8 -35 97 97 94 104 123 42 -27 57 78 -51 50 24 99 17 25 26 -60 -37 -1 19 13 27 17 8 -30 34 12 44
-1691 44 -12 -21 45 -2 141 58 105 59 -8 24 54 -34 -18 -101 -147 21 83 -10 37 65 -129 -160 -39 -83 -25 140 38 -6 52 77 139 -22
-1659 -22 -120 9 85 49 10 139 90 60 -28 25 52 129 70 46 10 12 52 6 34 89 95 -46 -9 38 -48 -2 7 66 54 30 -49 36 53 98 -39
-1624 -39 140 50 -101 -97 -34 47 -32 71 44 -24 4 76 -1 -44 70 27 -75 -26 16 14 53 102 65 -65 21 109 49 -80 -41 36 35 -29 16
-1591 16 -6 -60 -10 60 -52 -56 -70 25 -19 -2 -9 70 -44 -46 -68 -5 218 149 87 84 96 -29 -104 -7 -6 -74 -151 -94 -65 27 7 -53 -3 -50 -77
-1556 -77 17 -51 56 9 -107 39 -14 12 -73 -51 -55 21 -50 -11 -42 -39 38 -24 117 1 -132 19 -135 170 -7 -49 -80 -32 -92 -47 -13
-1525 -13 0 40 17 63 84 10 99 -39 -2 -36 38 8 -69 61 143 18 -25 17 88 10 -20 -134 68 15 50 -36 -40 -175 39 50 -55
-1494 -55 74 83 12 -22 -12 -42 -31 37 -26 24 -25 -52 57 -78 -81 84 22 26 86 132 -26 31 71 105 101 141 19 33 31 25 63 42 33 37 -39 124
-1458 124 -96 0 69 102 129 130 -5 -111 39 -101 96 0 70 -72 7 2 -8 -52 73 56 95 9 119 -6 46 87 104 60 -69 143
-1428 143 57 -34 0 50 84 107 72 105 -69 -120 -82 -125 0 -108 -82 39 24 5 -191 -40 43 -2 59 108 -4 -46 -137 7 17 -17
-1398 -17 -86 -36 57 52 -6 106 53 21 40 -106 44 -28 5 -37 32 -25 77 -28 -116 -43 90 50 -82 -65 134 -70 -30 12 -36 47 21
-1367 21 16 4 5 19 -1 -32 -48 -134 -56 45 18 108 94 19 10 82 1 -172 0 37 29 11 16 -129 -55 25 -18 -115 46 -4 60 149 38 -6
-1333 -6 -3 35 68 25 -17 7 -59 -39 195 70 -41 -40 -60 -21 79 64 -59 29 -46 51 -6 17 56 16 -8 132 89 -62 59 -16 -48 55
-1301 55 -43 -54 98 -58 128 31 211 -89 -39 -167 45 42 10 102 161 25 -80 62 15 -78 -138 -118 44 43 20 43 -158 -119 19
-1272 19 12 33 4 -1 -62 -69 -203 -47 -109 -59 41 35 -138 -17 79 143 -48 -100 -21 117 -29 99 -15 109 8 50 -96 91 -11
-1243 -11 38 6 -88 -42 1 -79 -68 54 67 37 -28 26 51 -41 8 150 64 151 -11 36 -19 2 -4 -63 -128 -164 -171 -126 -31 16 71 63 12 6 10 35
-1207 35 53 49 13 179 -50 -2 76 -48 5 -55 40 67 14 100 83 -6 -70 3 194 125 -50 -32 -65 24 1 -59 -111 -70 -67 27 -32 54 31
-1174 31 20 -55 -38 -28 -28 -33 141 10 51 -15 73 5 -35 94 -43 -2 137 8 10 -120 57 -64 -34 -12 -1 -83 7 16 39 -23 52 -54
-1142 -54 119 56 92 -47 -62 38 50 -122 -79 0 4 -84 -65 -17 26 60 -86 -86 0 -154 -94 -46 55 28 -68 -14 80 92 41 21 47 -50
-1110 -50 86 2 -54 62 21 119 123 149 -41 99 50 45 -27 -121 22 87 9 -16 17 -57 35 -37 -32 78 -76 -69 -115 -62 -10 -17 115 -24 54
-1077 54 84 75 49 114 -110 131 -18 -20 -3 -11 125 63 18 10 -11 -79 -143 -45 98 61 -48 120 31 -103 7 83 73 -30 39 14 52 79
-1045 79 -20 -110 -79 -15 -61 -153 -93 -53 -25 37 -80 -79 -14 116 -17 -49 5 75 -30 45 -13 46 -60 -28 58 44 -47 19 116 94 8 -7 2
-1012 2 -47 -55 -112 92 95 -11 16 41 79 88 -38 -67 -65 -84 20 -24 80 20 -35 -111 25 72 45 -3 -32 66 68 24 103 18 -76 -53 31 -22 26
-977 26 -48 27 3 45 -20 15 17 -107 32 149 19 -74 -11 15 -23 91 41 7 -67 -52 -119 -120 -23 -11 0 -15 14 -46 -154 -74 46 -6 9
-944 9 49 71 -86 -1 56 -68 36 -47 71 9 26 -4 -73 -27 -71 102 -102 88 147 -22 24 143 155 125 123 -14 -24 -6 5 -153 -88
-913 -88 -37 -76 -49 35 -66 -54 -25 68 -71 47 61 30 32 -13 -1 124 187 147 -42 -90 38 121 -8 -3 23 -64 -14 -33 23 15 42 -25 18
-880 18 23 -5 -21 -71 -38 58 41 -33 -32 -73 -21 -55 120 53 -70 2 45 18 -83 23 41 -102 32 -10 -25 -66 3 96 25 21 89 26 -18 -38
-846 -38 -180 -70 -54 -38 84 2 53 186 -1 11 25 68 -69 56 89 79 -41 76 21 84 9 29 -11 47 15 64 -42 -69 68 -3
-816 -3 -73 -89 65 37 3 91 -63 -62 28 -72 -93 -196 31 3 28 -8 42 144 -76 -201 -36 78 -130 -117 109 75 -20 -149 30
-787 30 -42 -35 -28 -45 2 -34 78 80 -99 -145 -131 92 82 -104 58 -33 -15 -43 -102 -58 12 -69 -3 13 -44 -119 -112 16 -3 3 -55 9 18 85 27
-752 27 58 124 -31 -11 -47 -4 -30 38 -90 17 -21 44 -83 -18 109 13 -6 -56 -12 -29 -22 -4 -2 -35 -24 15 60 65 4 -97 141 -40 -1
-719 -1 -35 72 -30 75 -62 -20 -44 92 174 40 -8 -44 30 122 10 51 -20 39 -123 79 30 -62 1 -77 32 -4 33 -37 -38 -45 -70 83
-687 83 30 -49 -36 -90 -59 -26 22 0 63 -75 41 -6 0 -30 -10 35 -35 30 3 -27 -100 30 -27 67 -6 12 76 51 0 9 -92 0 61 -26
-653 -26 9 -155 -20 -12 77 32 21 59 101 56 68 -31 -14 -10 -15 -38 -12 -89 13 30 -21 57 -105 -60 4 25 46 -19 61 109 36 -23 -47 -105 62
-618 62 -43 -47 33 -69 -199 23 -24 35 -62 -58 -146 -33 32 44 -131 -101 69 53 83 9 16 19 24 20 43 59 43 38 -53 103 -78 -51 20 -41
-584 -41 -86 -92 -36 -89 -148 -106 -75 -76 -70 -87 -65 44 6 -24 -45 15 -46 7 -4 -59 -62 10 72 60 -19 -98 -2 34 50 -5 -30 -51 92 6 23 112
-548 112 44 -1 -9 -20 -55 -61 -54 -147 2 -95 72 9 -13 -24 -18 40 109 2 83 89 -35 -93 32 -21 -24 27 66 90 141 66 66 112 -57 -46 20
-513 20 10 -82 -24 -30 65 -7 36 39 51 -3 78 105 -33 -1 24 100 62 -86 -48 -9 -89 -99 -1 -41 -124 13 134 -35 -121 -48 10 34 -21 -20
-479 -20 4 -20 -4 -33 2 -2 -46 -22 33 83 -30 -10 -52 68 -20 -15 0 46 -100 -48 -64 -43 58 -42 39 -85 -70 -29 43 19 -125 60
-447 60 37 82 -27 56 73 108 54 150 25 50 26 0 53 -33 -70 -16 17 -74 -103 61 17 -82 -125 80 -15 24 158 -35 100 60 20 -94
-415 -94 55 -101 -83 -21 122 115 71 51 91 14 31 -12 5 -29 40 25 41 -16 108 -3 -5 -83 -7 150 21 74 62 -54 19 71 -104 -126
-383 -126 -90 99 38 61 40 -90 19 -71 202 84 -1 59 -104 -50 -73 -61 51 -79 38 21 -52 -2 62 44 -77 4 53 -28 11 97
-353 97 169 -59 -45 -82 55 -16 -1 -45 -10 11 -121 43 -77 -78 5 -97 -137 -95 90 -6 56 -206 31 -61 -67 -38 41 52 80 65 180
-322 180 93 44 22 78 -7 9 -12 19 152 141 52 -13 -72 12 26 -4 -23 -87 -68 32 -66 59 -23 -5 30 170 135 42 34 103 -1 -10 -67
-289 -67 -162 -182 -92 52 75 25 -8 127 19 -42 -40 -69 -58 63 -20 -34 84 -18 -38 -76 -72 17 -26 -49 -43 -37 -41 -4 21 177 24 -6 14 9
-255 9 -41 16 5 -17 -60 -12 -101 -43 168 80 43 72 -15 -48 -63 67 54 -64 13 -3 -62 -45 44 -56 -25 -11 20 106 17 5 -2 -8 52 -47 39
-220 39 -83 -64 -95 80 -9 -104 41 -89 47 -65 25 -107 15 -21 -31 -99 -11 -68 -26 74 53 117 159 -19 2 -85 1 -44 -77 -20
-190 -20 -22 -125 -57 67 -57 79 66 40 10 -25 -52 -163 -43 49 87 80 -7 14 61 77 92 33 15 -46 -63 31 82 63 49 -18 -16 28 55 -49
-156 -49 -10 75 51
-153E1
##PAGE=	F1=13937.309836068561708
##FIRST=	31355.342622953838145,	6319.7438965998480853,	-0.020890036597847938538
##DATATABLE=	(F2++(Y..Y)), PROFILE
-2200 1 90 11 -40 1 15 76 69 0 68 -41 -34 -31 -40 -18 25 67 -25 -79 83 -150 150 178 215 124 -47 -75 -15 -44 -49 -13 -104 -156 4 -7 -43
-2165 -43 16 20 8 -44 63 13 143 -112 33 -19 -117 -23 -64 -88 53 -59 -59 101 -8 -53 59 82 -14 -50 73 137 25 69 7 -12
-2135 -12 -3 -139 -23 -88 -1 -45 -102 60 133 29 -171 -34 -12 -73 93 -121 -78 -100 62 113 79 15 -14 -10 -144 -25 38 103 22 -139
-2105 -139 -79 -104 91 18 -66 -56 -138 7 93 6 59 14 91 73 -16 60 143 -3 -56 -212 -30 36 -12 -87 17 -18 1884 16163 29115
-2076 29115 18023 4400 635 25 79 62 41 -21 73 180 117 114 59 49 23 -97 -50 -3 71 40 -59 24 -67 -92 20 104 58 -60
-2048 -60 24 -20 -57 15 -33 37 16 47 141 162 -24 -78 163 63 -52 87 165 145 363 253 98 242 202 -22 -71 73 5 -119 -10
-2019 -10 34 -53 38 -44 -42 -9 -10 47 -65 40 -12 178 38 41 -11 53 14 -28 -57 21 16 65 124 42 -79 -37 24 6 10 11 -101 13 18 -28 -14
-1984 -14 -77 -89 -77 -1 51 137 -41 -58 30 11 2 -8 -43 -53 49 74 12 -42 -12 139 11 36 112 44 40 13 -67 31 18 289 63 -62
-1952 -62 425 139 -173 301 119 127 100 -108 -109 101 80 -16 -25 -106 -21 82 -65 6 -14 -22 13 54 -80 -11 102 21 3 59 -1 -54 -24
-1921 -24 15 18 40 22 42 38 -37 55 -29 -29 -24 -35 85 -14 -9 63 -88 -18 48 60 109 26 30 24 61 -22 14 -49 -3 99 35 70 28 43 51 60 38 -5
-1883 -5 -109 -5 -36 77 -23 21 0 54 82 69 -59 69 159 -42 -34 -65 -49 -33 -23 11 -1 85 65 71 55 -70 -59 -59 -69 -37 18 142
-1851 142 40 21 -73 11 -18 -85 -125 -42 -32 -57 -74 -36 -33 -70 -41 -123 229 49 -33 67 -23 -106 -25 150 120 72 57 8 -51 45 39 -104
-1819 -104 -52 143 -35 -118 102 86 8 32 112 35 -12 -4 -91 3 48 12 -136 38 -10 -54 -53 9 70 99 -39 68 93 22 -35 -48 35 -56
-1787 -56 -1 6 -22 130 -2 -29 -160 -155 -82 -102 -131 63 24 25 -64 6 8 34 -65 -70 -138 -258 76 -25 -38 -25 -38 -22 -54 -106 27 -15 -83
-1754 -83 73 95 -102 18 -61 -69 -21 -86 62 66 -60 -94 -85 -51 -70 31 39 97 3 -66 -6 -159 -88 -44 -28 43 -101 -149 -14 69 -59 43
-1722 43 -37 16 -43 105 115 98 98 128 41 -31 43 76 -52 61 25 94 -5 0 9 -58 -57 19 9 10 14 24 5 -40 38 25 42 -2 -6 50 -5 118
-1686 118 51 84 45 -25 38 80 3 -8 -108 -163 23 56 -8 39 45 -117 -176 -43 -66 -16 120 31 -5 78 74 136 -37 -104 23 61 37 10
-1654 10 116 81 47 -41 23 65 123 44 33 38 13 29 10 28 85 98 -37 -4 37 -34 -3 22 52 43 29 -57 39 50 97 -57 136 52 -84
-1621 -84 -58 -24 9 -46 75 49 12 11 76 0 -37 77 22 -63 -21 28 13 38 81 68 -51 40 105 69 -47 -48 32 44 -21 -1 19 -60 -5 73
-1587 73 -55 -52 -95 23 -47 12 1 43 -42 -46 -84 -29 217 146 83 82 103 -10 -111 24 -7 -62 -156 -82 -63 3 -10 -57 -15 -52 -69 2 -45
-1554 -45 49 18 -97 36 -32 -12 -94 -23 -46 19 -22 3 -34 -13 35 -35 113 1 -133 32 -144 177 32 -65 -76 -25 -99 -58 -23 1
-1524 1 41 4 51 67 14 108 -33 19 -9 50 48 -68 55 162 16 -3 31 97 8 -22 -131 72 19 36 -16 -22 -187 43 20 -16 63 49
-1492 49 10 -25 9 -36 -27 55 -32 29 -23 -38 68 -84 -84 78 19 2 65 140 -38 46 55 76 63 117 21 50 32 37 55 52 29 41 -45 109 -95
-1457 -95 6 63 115 147 116 -11 -111 36 -106 76 -9 65 -80 -20 -41 -3 -36 72 47 104 10 124 -22 21 108 142 104 -70 118
-1428 118 40 -27 17 61 89 134 70 100 -54 -98 -79 -148 -19 -100 -95 31 26 22 -179 -25 46 -4 45 76 -18 -48 -156 -5 -13 -35 -70 -22 83
-1395 83 65 10 128 72 27 26 -92 57 -36 -1 -30 44 -21 70 -33 -109 -42 116 45 -69 -64 119 -81 -27 7 -54 25 -6 5 17 15 19 6
-1362 6 -19 -49 -117 -58 29 32 110 65 33 14 81 -10 -183 -17 43 17 30 1 -119 -81 -8 -20 -106 43 -5 68 129 17 25 -9 41 70 30 6
-1328 6 15 -40 -23 215 63 -49 -40 -71 -16 87 69 -55 8 -32 47 8 32 28 3 -33 103 90 -59 66 -10 -63 44 -27 -59 90 -48
-1297 -48 114 38 196 -110 -48 -166 44 42 13 76 141 20 -85 75 2 -66 -139 -108 33 36 4 30 -152 -116 55 20 46 0 0 -44 -78
-1266 -78 -200 -57 -115 -65 36 10 -136 -21 66 139 -37 -84 -50 116 -37 92 -5 136 -3 50 -84 138 20 57 -6 -94 -43 6
-1238 6 -90 -61 61 69 54 -31 7 53 -36 26 154 63 145 17 44 -9 11 0 -36 -102 -163 -163 -135 -15 30 67 64 15 -28 -15 24 51 58 -1 169
-1203 169 -67 -2 52 -61 18 -69 28 80 14 84 69 -7 -87 0 199 107 -19 -63 -92 39 22 -69 -131 -86 -36 30 -27 61 8 7 -68 -48
-1171 -48 -4 -48 -45 131 26 35 -22 59 -16 -32 125 -34 -7 136 34 12 -131 55 -87 -23 2 -16 -66 4 26 49 -26 42 -45 131 30
-1140 30 106 -54 -66 14 58 -119 -82 -23 22 -71 -74 -30 27 72 -84 -84 29 -126 -97 -61 37 20 -73 -14 79 104 8 22 68 -23 100 -5
-1108 -5 -50 37 5 107 120 152 -12 107 50 30 -39 -119 19 104 -4 -30 21 -44 21 -31 -36 75 -68 -46 -93 -66 -7 4 139 -21 38
-1077 38 53 63 63 109 -136 120 -23 -19 -12 -18 122 100 45 31 -23 -78 -126 -30 99 80 -45 113 39 -74 12 96 71 -49 31 24 70 62 -9
-1044 -9 -83 -61 -1 -68 -147 -105 -43 -41 41 -74 -63 -6 111 -30 -62 -18 53 -17 57 -8 62 -52 -15 60 50 -42 15 131 75 3 -25 19 -23
-1011 -23 -48 -107 86 85 -6 18 20 93 108 -45 -80 -73 -80 42 -17 73 23 -25 -78 40 65 57 15 -39 63 57 6 91 14 -87 -41 31 -24 12 -44
-976 -44 29 -6 56 -10 23 -19 -121 22 141 22 -68 -24 0 -53 93 14 -39 -58 -63 -112 -97 -15 6 8 -15 26 -48 -167 -74 35 -39 19 63
-943 63 49 -84 -13 49 -44 36 -37 81 17 32 1 -65 -49 -55 90 -115 75 136 -47 29 158 173 104 115 -9 -27 -9 -8 -156 -72 -35 -85
-911 -85 -57 29 -64 -49 -31 75 -78 50 57 27 37 -21 27 126 186 121 -39 -88 18 97 4 18 45 -58 -7 -8 29 0 55 -30 16 41 14
-878 14 -12 -66 -48 38 13 -34 -51 -67 -8 -38 144 75 -71 -12 55 25 -59 43 37 -95 29 12 -30 -83 17 92 28 13 72 32 -21 -61 -168
-845 -168 -63 -60 -12 80 -13 8 164 -3 -18 19 66 -77 55 91 102 -42 107 60 72 21 41 -32 30 31 57 -43 -47 60 8 -69 -54 57
-813 57 29 3 99 -46 -58 9 -76 -98 -214 62 10 30 -22 32 163 -65 -193 -20 93 -115 -117 133 94 -27 -154 22 -40 -42 -15 -46
-783 -46 24 -23 71 81 -97 -125 -139 69 74 -83 54 -50 -6 -40 -113 -35 35 -82 -7 6 -42 -109 -111 -13 -2 16 -85 -9 -10 90 35 64 130
-750 130 -33 5 -55 -1 -16 25 -74 21 -4 43 -67 6 93 35 -6 -70 -19 -39 -2 -2 -3 -38 -37 36 70 95 25 -81 168 -35 0 -19 69 -13
-716 -13 79 -60 -28 -59 85 182 37 -19 -45 40 141 11 38 -31 23 -132 67 7 -37 16 -56 57 1 16 -36 -22 -57 -78 74 18 -43
-685 -43 -50 -100 -39 -6 21 11 46 -89 42 -21 35 -27 3 48 -40 26 16 8 -70 11 -48 69 10 -14 67 43 0 35 -81 -5 86 -6 9 -174
-651 -174 -33 7 89 48 19 30 110 52 90 -30 -4 -37 -14 -44 -29 -88 15 17 -56 47 -101 -53 -16 22 48 -8 83 118 30 -43 -56 -93 67
-618 67 -39 -40 26 -82 -219 5 -47 -16 -76 -71 -164 -59 8 15 -149 -108 75 45 48 20 11 40 53 -7 40 74 40 25 -50 97 -44 -45 18 -51
-584 -51 -102 -82 -33 -92 -154 -99 -70 -81 -62 -90 -61 47 6 -25 -29 4 -41 12 2 -52 -77 -6 59 58 0 -73 -7 57 70 -8 -23 -33 100 -12 8
-549 8 115 63 23 -6 -18 -71 -29 -58 -136 -1 -91 71 15 -10 -33 -18 29 78 0 56 74 -38 -56 30 0 -38 15 59 79 117 80 77 120 -48
-515 -48 -71 27 0 -101 -44 -37 55 -4 78 37 65 -1 71 105 -7 1 24 110 36 -97 -48 -8 -79 -86 2 -45 -132 8 146 -37 -126 -71 30
-482 30 67 -2 -5 5 -43 17 -33 2 0 -61 -30 9 77 -39 -16 -29 63 -17 -27 -7 46 -98 -26 -60 -74 62 -36 46 -65 -59 -29 58 12 -128
-448 -128 34 30 76 -39 55 56 110 56 131 15 54 52 11 56 -37 -38 -4 19 -81 -85 69 15 -85 -123 76 -6 36 150 -34 69 47 9
-416 9 -86 81 -93 -94 -35 101 95 45 61 99 -11 41 0 9 -42 43 36 15 -11 88 -32 13 -84 3 168 25 81 47 -62 20 66 -93 -98 -79
-382 -79 125 47 54 29 -107 21 -69 193 103 0 69 -127 -70 -84 -84 25 -70 50 9 -83 -12 59 29 -94 3 34 -31 41 100 173 -55
-351 -55 -55 -96 45 -9 -1 -68 10 32 -109 45 -52 -45 9 -89 -123 -92 64 -27 46 -187 39 -61 -88 -26 28 56 52 37 175 105 54 42 66
-318 66 0 -5 -20 -3 148 149 36 -35 -66 17 32 4 -38 -105 -62 36 -83 40 -21 -15 42 129 110 46 51 99 12 -12 -54 -166 -180 -105 66 69 20
-283 20 -25 103 24 -34 -36 -46 -65 89 0 -37 84 -24 -50 -58 -70 33 -46 -65 -46 -12 -31 -31 20 161 -12 0 13 3 -41 -8 2 -19 -41
-250 -41 -16 -92 -90 163 95 38 53 -35 -39 -63 64 35 -52 5 0 -85 -48 22 -41 -23 -5 6 93 39 -8 -18 -10 51 -56 27 -103 -60 -112 75 -25
-215 -25 -116 59 -117 14 -61 42 -88 12 -49 -52 -81 -21 -45 -13 85 49 122 145 -32 1 -89 -8 -48 -112 -25 -6 -132 -58 70 -58 63
-184 63 76 50 23 8 -18 -112 -46 43 81 79 19 8 52 91 109 45 26 -59 -52 52 94 82 50 -17 -12 33 60 -48 -7 73 49
-153D9
##PAGE=	F1=13873.272950822658458
##FIRST=	31355.342622953838145,	6319.7438965998480853,	-0.073007851839065551758
##DATATABLE=	(F2++(Y..Y)), PROFILE
-2200 -19 74 9 -55 0 24 46 61 -11 59 -34 -33 -50 -15 -15 32 65 -28 -86 78 -118 155 172 250 172 -30 -68 -28 -44 -44 -24 -91 -113 17 -5
-2166 -5 -31 19 21 -6 -41 78 38 150 -95 47 -14 -95 -19 -107 -82 77 -56 -63 81 0 -18 40 77 -14 -60 46 135 53 89 4 -9 -7 -121
-2133 -121 -31 -83 -19 -44 -112 41 119 19 -161 -33 -24 -74 73 -120 -41 -97 75 124 65 -21 -40 -38 -147 -63 26 111 15 -142 -94 -83 67
-2102 67 6 -47 -64 -159 -18 78 3 33 3 91 41 -36 60 161 -7 -48 -219 -69 15 -16 -99 -14 -37 1811 15416 27587 17189
-2075 17189 4289 672 64 107 92 35 -3 98 194 132 124 74 58 13 -72 -19 15 81 65 -44 45 -66 -94 30 152 74 -69 18
-2047 18 -30 -57 0 -41 37 22 76 182 165 -17 -66 169 60 -68 94 171 116 366 226 49 255 199 -10 -57 64 22 -140 -29
-2019 -29 39 -48 45 -37 -26 10 -10 63 -45 57 24 184 34 17 -24 69 32 6 -44 57 26 76 154 44 -64 -40 30 23 29 22 -96 -1
-1987 -1 16 -35 -4 -93 -94 -65 23 88 154 -24 -71 16 -19 -14 -37 -67 -50 37 63 -45 -68 -37 118 10 37 88 33 35 6 -55 23 -7 251 46
-1953 46 -34 401 131 -124 303 124 126 71 -97 -109 90 95 -28 -30 -107 -10 54 -50 11 -20 -13 42 61 -96 -7 84 26 12 71 0 -45 -13
-1921 -13 23 42 30 0 30 33 -31 55 -37 -42 0 -37 81 -36 -6 70 -73 -2 63 80 92 34 8 41 75 -46 12 -33 -8 95 48 61 -3
-1888 -3 39 46 66 -4 -13 -105 18 -43 76 -22 -24 -41 39 51 59 -62 70 181 -34 -58 -55 -40 -55 -9 23 -15 93 73 78 43 -81 -54 -47 -32 -30
-1853 -30 16 150 48 23 -54 -4 -15 -82 -116 -52 -24 -56 -77 -26 -17 -61 -36 -122 215 60 -20 42 -32 -99 0 175 116 72 66 -8 -40 40 39 -118
-1819 -118 -59 144 -33 -124 99 72 6 60 112 40 -10 20 -68 -5 54 21 -130 29 -12 -39 -65 32 75 78 -63 57 91 30 -36 -33 49 -55
-1787 -55 12 1 -14 130 -23 -34 -155 -120 -79 -68 -121 40 19 2 -83 -7 19 55 -65 -72 -139 -234 54 -34 -37 -2 -18 -45 -39 -102 16 -32 -91
-1754 -91 72 74 -103 28 -49 -71 -19 -121 27 62 -64 -86 -78 -64 -66 67 73 102 18 -53 -17 -159 -52 -51 -30 39 -121 -158 30 70 -59
-1723 -59 51 -31 25 -54 102 118 104 93 125 38 -30 27 65 -53 64 25 88 -28 -22 -9 -53 -71 37 -4 6 3 29 1 -53 31 37 31 4 9
-1689 9 52 -8 93 46 64 30 -49 49 107 41 7 -109 -166 26 33 -1 34 28 -94 -183 -50 -37 -7 92 21 -4 106 65 124 -52 -88 23
-1657 23 37 29 7 91 67 39 -53 29 79 106 11 17 66 17 3 15 17 78 94 -34 0 41 -19 -5 39 42 32 29 -61 46 54 91 -70 130 55 -63
-1621 -63 -17 -16 -30 -58 77 44 43 21 68 -7 -33 80 22 -44 -10 38 1 15 57 65 -37 56 94 88 -12 -59 30 48 -11 -19 39 -55 -3 74 -53
-1586 -53 -42 -113 22 -65 30 5 15 -44 -45 -101 -53 210 134 75 82 109 11 -116 54 -12 -52 -150 -67 -57 -22 -19 -53 -20 -51 -55 -11 -39 39 29 -81
-1551 -81 35 -48 -39 -107 9 -35 24 11 18 -25 6 29 -41 109 2 -124 40 -149 180 65 -82 -71 -13 -98 -69 -31 -1 35 -11 44 49
-1520 49 11 112 -24 41 21 63 84 -64 55 175 12 11 38 98 4 -20 -121 68 22 26 4 -2 -192 45 -12 19 51 11 12 -27 23 -24
-1488 -24 -19 82 -34 35 -23 -25 69 -92 -82 70 17 -19 36 132 -53 58 40 41 22 94 15 58 33 46 47 56 24 50 -52 87 -87 13
-1456 13 54 126 155 103 -16 -108 30 -101 55 -17 62 -85 -44 -80 1 -17 63 28 107 15 107 -38 -4 121 173 138 -70 94 26 -10
-1426 -10 35 68 89 159 69 94 -35 -71 -70 -163 -34 -89 -107 30 28 38 -154 -3 49 -10 26 40 -31 -51 -162 -17 -47 -47 -59 -10 104 75
-1394 75 21 139 83 38 14 -72 70 -45 -14 -24 54 -19 61 -43 -88 -33 133 40 -48 -60 95 -93 -28 2 -72 0 -38 -4 22 23 16 16 -6
-1361 -6 -49 -101 -59 15 45 109 29 50 28 76 -25 -184 -32 46 4 44 -16 -101 -105 -36 -13 -89 34 -1 72 100 -9 54 -21 42 65 26 25 22
-1327 22 -22 -17 224 58 -52 -32 -83 -9 91 72 -46 -7 -11 43 30 50 2 -2 -55 66 87 -49 71 -2 -83 30 -8 -59 70 -40 89
-1296 89 40 176 -126 -55 -144 41 35 17 49 125 15 -87 82 -12 -48 -142 -96 17 22 -11 17 -138 -116 82 27 56 4 3 -19 -82 -183
-1265 -183 -62 -111 -62 26 -21 -129 -20 52 122 -24 -62 -79 115 -41 81 6 154 -18 49 -71 179 53 64 -21 -94 -42 17 -98
-1237 -98 -53 64 72 62 -29 -8 44 -30 45 147 58 132 48 48 0 16 2 -7 -75 -153 -148 -141 0 44 63 61 13 -57 -35 14 49 66 -12 157 -88
-1202 -88 -4 19 -71 28 -72 16 91 24 61 47 -4 -106 0 194 90 12 -90 -118 52 41 -76 -146 -96 0 30 -24 63 -14 -3 -74 -54
-1171 -54 16 -70 -56 109 36 20 -33 45 -21 -28 147 -18 -17 130 55 11 -142 52 -103 -13 14 -27 -45 -7 35 67 -22 35 -24 141 2
-1140 2 114 -61 -72 -6 63 -114 -75 -44 36 -52 -78 -36 28 85 -77 -82 55 -103 -97 -63 20 15 -67 -13 76 113 -19 20 81 1 107 -16
-1108 -16 -45 13 -15 96 118 151 11 109 51 18 -45 -104 16 118 -19 -44 36 -28 2 -26 -43 72 -46 -24 -75 -65 2 25 148 -19
-1078 -19 19 17 48 78 107 -151 102 -26 -13 -15 -18 115 137 72 55 -31 -72 -95 -12 96 94 -39 98 46 -46 16 99 65 -66 23 36 77 42
-1045 42 6 -41 -38 11 -67 -131 -107 -26 -54 43 -60 -44 -3 104 -34 -73 -39 31 -8 69 0 71 -46 -1 62 53 -37 13 136 52 1 -47 28
-1012 28 7 -36 -99 78 75 -2 24 4 94 120 -44 -89 -80 -65 63 -6 64 29 -15 -48 57 44 65 34 -46 63 42 -12 76 6 -98 -22 29
-979 29 -12 3 -41 32 -14 57 -3 26 -55 -128 11 122 18 -58 -39 -7 -78 88 -11 -84 -56 -75 -110 -74 -12 27 14 -14 41 -52 -169 -71 23
-946 23 -72 20 64 28 -75 -20 41 -22 37 -22 86 28 36 6 -52 -69 -35 75 -125 57 123 -74 18 171 185 78 105 -1 -37 -16 -16 -148
-914 -148 -50 -30 -84 -61 21 -63 -39 -32 84 -76 42 46 17 36 -31 57 121 176 84 -35 -80 -7 64 15 40 63 -47 -2 16 39 -16 72 -31
-881 -31 21 54 34 -6 -56 -55 17 -6 -38 -72 -63 3 -21 161 94 -67 -27 59 30 -27 66 29 -81 23 32 -34 -97 35 93 30 6 56 31 -23
-847 -23 -73 -145 -56 -63 11 77 -29 -35 132 -6 -52 15 62 -78 50 84 117 -37 137 100 58 33 55 -52 8 38 46 -40 -18 44 8 -67 -16
-814 -16 46 18 5 106 -29 -53 -3 -83 -101 -234 99 9 36 -32 19 170 -59 -172 -8 106 -96 -111 154 113 -37 -147 16 -39
-786 -39 -45 1 -40 45 -12 56 85 -81 -91 -131 45 61 -63 46 -61 -6 -33 -117 -15 58 -91 -9 5 -45 -102 -107 -36 3 26 -112 -24 -38
-754 -38 91 37 66 129 -32 20 -63 1 -6 2 -62 30 14 39 -44 34 72 49 3 -87 -25 -43 11 2 0 -41 -49 49 76 124 50 -60 185 -27 6
-719 6 1 66 2 81 -52 -38 -69 76 180 27 -35 -47 46 152 12 25 -45 1 -143 51 -11 -15 29 -29 79 13 5 -30 -2 -72 -88 59
-687 59 8 -28 -60 -109 -17 12 16 21 30 -96 42 -36 62 -21 12 61 -35 22 28 43 -36 -8 -68 68 23 -47 54 32 -4 53 -74 -3 101 15
-653 15 13 -185 -44 30 99 56 10 -7 110 47 107 -37 -3 -54 -5 -51 -46 -76 14 6 -92 43 -86 -51 -32 26 45 0 100 118 25 -59 -62 -72
-619 -72 68 -33 -35 21 -95 -243 -8 -49 -50 -77 -80 -167 -84 -16 -17 -163 -109 73 34 14 29 3 56 81 -37 35 85 26 8 -49 87 -9 -40
-586 -40 11 -63 -109 -76 -35 -91 -150 -86 -64 -87 -51 -90 -49 50 4 -27 -18 -8 -29 19 1 -49 -91 -22 40 53 24 -48 -16 72 89 -6 -10 -9 100 -36
-550 -36 -7 111 78 47 2 -12 -84 -4 -63 -120 -5 -81 65 24 -8 -36 -14 17 40 1 31 58 -32 -24 21 18 -48 0 47 72 86 90 80 113 -37
-515 -37 -93 31 -3 -111 -63 -38 49 -6 110 28 77 -5 56 91 17 0 20 114 13 -97 -50 -9 -66 -68 1 -53 -143 0 153 -33 -116 -88
-483 -88 41 102 15 8 3 -60 40 -30 2 2 -75 -33 -14 66 -50 -23 -2 56 -8 -35 -9 38 -85 -1 -41 -99 60 -27 51 -45 -45 -30 75 5
-449 5 -120 12 18 74 -41 60 39 111 56 107 3 55 79 30 62 -37 -5 6 22 -84 -67 69 15 -86 -118 66 -5 42 133 -32 32
-418 32 36 3 -71 101 -91 -100 -44 74 72 21 64 101 -37 47 12 12 -57 50 47 -10 -3 60 -64 31 -76 13 174 33 85 36 -68 20 59
-385 59 -80 -65 -65 144 54 45 25 -118 18 -65 179 131 -1 71 -139 -85 -101 -101 6 -61 65 -3 -112 -28 50 10 -108 -3 17 -36 73
-354 73 97 172 -40 -64 -103 34 -2 0 -89 29 57 -92 46 -27 -10 5 -72 -101 -88 37 -50 33 -164 47 -64 -110 -18 16 53 17 9 165
-322 165 116 68 65 52 3 -22 -24 -30 139 154 18 -51 -57 27 37 5 -56 -124 -60 34 -92 26 -12 -19 55 84 84 53 73 89 30 -15 -39 -161 -166 -122
-286 -122 74 61 16 -34 77 19 -26 -28 -26 -70 115 16 -40 89 -23 -61 -41 -64 47 -66 -79 -49 16 -22 -56 17 137 -52 2 8 -4 -30
-254 -30 -29 -2 -19 -22 -21 -82 -121 150 107 28 37 -46 -23 -59 47 18 -40 -1 1 -103 -48 2 -24 -21 -4 -4 78 54 -27 -37 -3 46 -69 9 -118 -52
-218 -52 -125 76 -31 -128 80 -131 -12 -54 52 -66 9 -72 -65 -51 -26 -19 4 94 49 121 122 -40 7 -90 -18 -51 -142 -25 8 -136 -50 68
-186 68 -62 43 84 58 39 45 13 -59 -55 31 70 77 45 7 40 98 121 56 36 -68 -36 69 98 94 52 -16 -5 38 64 -45 -5 68 46
-153D6
##PAGE=	F1=13809.236065576755209
##FIRST=	31355.342622953838145,	6319.7438965998480853,	-0.14632721245288848877
##DATATABLE=	(F2++(Y..Y)), PROFILE
-2200 -39 47 0 -70 3 32 15 57 -23 46 -26 -32 -65 8 -13 37 56 -30 -85 71 -86 152 154 261 206 -13 -47 -42 -47 -26 -28 -74 -62 26 -1 -14
-2165 -14 17 18 -20 -35 87 61 143 -68 59 -11 -72 -10 -143 -75 96 -54 -64 52 1 13 27 69 -14 -61 24 126 73 101 -6 -9 -14 -94
-2133 -94 -31 -73 -43 -44 -115 29 100 7 -144 -28 -37 -73 51 -117 -6 -86 83 126 43 -61 -69 -73 -145 -95 11 120 13 -134 -101 -54 41
-2102 41 -6 -14 -66 -173 -48 58 -3 0 -7 88 8 -51 50 168 -15 -46 -216 -104 -7 -19 -98 -43 -50 1604 13578 24105 15133 3853
-2074 3853 652 81 120 113 23 13 111 195 129 115 82 60 -2 -45 16 30 84 83 -29 59 -67 -96 32 193 79 -81 16 -32 -47 -7
-2044 -7 -42 41 26 104 217 164 -2 -55 168 46 -86 95 171 82 367 206 5 279 200 4 -33 54 37 -156 -46 40 -40 51 -27
-2015 -27 -8 33 -7 80 -21 80 67 182 20 -9 -37 82 38 36 -27 96 40 85 176 43 -54 -42 39 43 36 27 -88 -11 17 -46 3 -109
-1983 -109 -95 -59 50 119 160 -9 -80 7 -51 -27 -64 -88 -46 21 48 -104 -86 -58 103 9 36 63 13 19 -2 -45 21 -26 209 39 -6 375
-1951 375 128 -71 309 127 118 40 -90 -99 71 113 -36 -25 -102 1 22 -31 15 -26 -4 75 66 -103 -9 60 24 14 80 0 -40 -4 25
-1920 25 53 16 -17 20 26 -26 51 -49 -55 28 -32 69 -57 -5 73 -52 10 71 92 76 32 -16 59 92 -65 4 -11 -16 74 60 49 -34 31 44
-1886 44 71 -45 -27 -88 45 -51 77 -23 -63 -79 24 23 43 -66 75 189 -24 -72 -38 -24 -73 6 38 -22 95 83 80 29 -87 -47
-1856 -47 -41 1 -27 17 147 48 21 -31 -21 -14 -69 -97 -50 -7 -53 -78 -21 -2 -48 -24 -108 195 57 -9 20 -39 -87 23 194 103 55 75 -21
-1823 -21 -28 38 40 -125 -68 135 -20 -118 97 54 4 84 112 47 -7 41 -39 -9 60 30 -122 20 -12 -25 -75 55 84 61 -79 39 82
-1792 82 29 -45 -23 62 -46 28 -8 -4 120 -39 -37 -155 -80 -73 -38 -112 10 15 -9 -97 -18 21 64 -65 -80 -137 -204 30 -46 -33 5 -1 -66 -29
-1758 -29 -97 5 -45 -91 62 55 -103 39 -37 -71 -16 -150 -11 54 -58 -66 -64 -69 -51 95 106 101 30 -39 -31 -149 -14 -56 -32 35 -132 -156
-1726 -156 68 59 -57 63 -25 35 -63 88 107 109 91 114 29 -22 13 44 -53 60 20 82 -48 -36 -30 -45 -77 52 -19 0 -2 33 0 -66 15
-1693 15 46 14 9 23 48 -9 68 40 43 15 -74 57 135 76 23 -107 -156 29 16 13 23 12 -66 -184 -60 0 -1 55 10 -1 132 52 103 -67
-1659 -67 -71 12 16 24 1 70 55 39 -64 42 92 80 -24 4 91 22 -19 19 0 68 86 -36 4 45 -5 -4 55 36 20 29 -63 55 62 80 -75
-1624 -75 122 60 -37 21 -9 -71 -67 74 31 65 32 54 -23 -31 78 24 -26 4 45 -23 -12 35 57 -24 67 78 103 18 -72 28 46 -1 -36 50
-1590 50 -47 -3 63 -49 -32 -123 23 -73 51 0 -7 -48 -42 -115 -71 199 114 63 84 115 33 -115 78 -20 -44 -135 -52 -50 -45 -18 -43 -20 -50 -39
-1556 -39 -24 -35 30 42 -63 36 -59 -67 -109 42 -27 32 45 31 -15 19 16 -42 108 2 -104 43 -148 177 87 -99 -64 1 -89 -79 -37
-1525 -37 -9 26 -28 42 31 1 108 -10 60 51 77 112 -61 60 180 9 21 38 92 1 -14 -104 55 26 18 20 15 -188 46 -44 45 41 -25
-1492 -25 19 -25 27 -8 -5 114 -33 37 -25 -15 59 -97 -74 60 17 -33 6 111 -68 67 28 6 -15 77 3 58 36 53 37 51 18 62
-1460 62 -59 61 -72 16 43 132 150 91 -17 -103 25 -88 35 -25 61 -87 -59 -111 9 3 46 1 103 20 70 -53 -30 122 192
-1431 192 160 -68 73 16 14 50 68 81 178 68 90 -12 -40 -55 -168 -47 -79 -115 40 29 49 -119 23 52 -19 3 5 -42 -55 -153 -25
-1400 -25 -77 -54 -54 -2 117 81 24 138 83 50 4 -49 82 -53 -32 -23 63 -18 51 -56 -54 -13 140 36 -19 -53 65 -104 -28 -1 -87 -31
-1368 -31 -72 -10 19 26 13 27 8 -49 -89 -60 6 55 104 -9 63 46 67 -41 -177 -42 45 -11 54 -36 -77 -123 -54 1 -67 23 8 72 67 -41
-1334 -41 76 -39 42 50 14 37 28 -3 -21 221 55 -48 -18 -94 -1 92 72 -34 -17 15 41 56 67 -20 -3 -73 27 81 -33 72 6
-1303 6 -106 15 12 -57 44 -36 55 39 154 -133 -59 -105 37 20 18 22 115 7 -87 82 -25 -27 -148 -84 -2 6 -24 6 -117 -119 97 31
-1271 31 60 18 10 8 -79 -153 -64 -97 -50 11 -57 -118 -14 37 94 -10 -36 -103 112 -40 69 19 160 -33 50 -59 209 84 60 -35 -89
-1240 -89 -40 34 -98 -46 62 76 63 -22 -20 26 -23 64 131 50 114 76 47 8 15 2 15 -52 -133 -126 -147 11 57 59 56 9 -76 -47 6 46 74 -17
-1204 -17 146 -109 -8 -16 -77 36 -61 4 102 44 34 17 -1 -123 -2 180 76 41 -113 -140 61 55 -79 -155 -100 35 27 -21 60 -32
-1174 -32 -13 -73 -58 33 -90 -66 79 43 6 -48 32 -10 -21 159 2 -31 120 68 9 -151 51 -110 -7 26 -34 -21 -25 40 89 -11
-1144 -11 31 5 149 -22 114 -66 -78 -23 68 -109 -58 -59 46 -28 -75 -32 29 98 -64 -80 72 -88 -96 -56 5 15 -48 -10 68 115 -39
-1113 -39 16 85 24 104 -32 -40 -5 -36 87 117 147 26 104 55 10 -46 -78 13 127 -34 -58 63 -11 -17 -23 -49 71 -12 -4 -64 -62 17 44 142
-1079 142 -19 0 -17 34 87 104 -155 79 -27 -6 -13 -12 107 169 97 79 -35 -63 -55 5 91 99 -30 76 52 -19 18 91 55 -79 14 49
-1047 49 72 21 26 8 -11 21 -58 -105 -98 -4 -62 40 -42 -24 -5 94 -30 -82 -53 13 -6 75 7 72 -41 12 65 50 -35 11 127 28 1 -71
-1013 -71 28 40 -19 -89 70 68 0 35 -7 82 122 -35 -92 -83 -43 80 6 53 35 -7 -27 73 15 62 52 -52 67 23 -30 61 -3 -107
-981 -107 0 28 9 1 -38 33 -18 51 -2 24 -87 -127 -1 95 11 -46 -55 -6 -93 78 -32 -125 -62 -89 -113 -52 -14 48 17 -11 62 -54 -158
-948 -158 -65 11 -99 17 48 11 -60 -20 34 -4 40 -2 85 40 37 9 -36 -86 -15 61 -130 37 108 -97 -4 179 192 51 92 8 -54 -27
-916 -27 -17 -132 -26 -21 -74 -61 14 -63 -24 -28 98 -65 24 30 1 29 -39 86 110 161 45 -31 -67 -32 31 25 59 74 -34 0 40 47 -33 91
-882 91 -29 32 60 53 -2 -45 -58 1 -17 -48 -91 -63 11 -8 170 108 -60 -38 56 32 9 91 20 -60 14 47 -36 -106 52 99 29 1 43 25
-848 25 -24 -73 -116 -51 -61 30 78 -41 -75 95 -11 -86 14 54 -72 42 70 120 -29 162 140 44 43 69 -70 -13 35 32 -33 14 27 0
-816 0 -70 20 34 5 9 111 -15 -46 -10 -91 -100 -254 138 0 46 -40 4 163 -60 -140 -1 117 -75 -99 169 128 -49 -129 14 -38
-786 -38 -45 19 -23 65 -1 36 86 -54 -48 -110 20 45 -47 33 -68 -13 -26 -113 0 77 -93 -9 10 -52 -101 -103 -50 11 34 -131 -33 -65 87
-753 87 30 63 120 -30 31 -70 1 -2 -26 -56 41 34 30 -16 64 49 55 24 -102 -30 -42 16 8 4 -45 -56 54 77 151 78 -35 191 -19 13 24
-718 24 62 15 81 -39 -49 -74 67 170 14 -53 -49 47 152 14 14 -62 -21 -156 30 -23 4 42 0 98 28 1 -18 18 -87 -101 41
-687 41 0 -5 -63 -119 3 26 9 30 18 -95 43 -51 77 -15 14 74 -21 22 38 70 -4 -22 -84 63 33 -82 39 18 -13 63 -69 4
-655 4 106 39 24 -186 -50 52 105 56 -3 -51 100 41 118 -52 -11 -55 11 -56 -60 -56 10 -2 -125 44 -66 -53 -41 34 41 1 112 108 19
-622 19 -65 -64 -43 64 -28 -30 18 -106 -265 -19 -37 -68 -69 -87 -161 -105 -42 -50 -171 -105 62 21 -15 31 -7 66 105 -64 29 90 4 -10 -51 72
-588 72 22 -36 1 -74 -105 -77 -42 -85 -136 -72 -54 -92 -36 -86 -32 51 1 -28 -11 -26 -11 28 -7 -49 -100 -34 18 48 51 -25 -30 77 104 -2 5 16
-552 16 91 -61 -25 100 88 64 17 -2 -93 9 -70 -102 -11 -68 51 37 -7 -31 -6 5 0 9 11 44 -19 0 8 30 -53 -12 31 67 54 98 75
-517 75 93 -25 -110 28 2 -110 -79 -35 49 -12 128 15 85 -14 35 65 39 -7 12 112 1 -86 -54 -15 -52 -45 -3 -62 -156 -11 153
-486 153 -24 -95 -97 42 136 29 20 0 -67 59 -27 2 2 -84 -31 -35 54 -60 -30 26 48 7 -41 -7 24 -63 25 -10 -114 51 -15 54 -28
-453 -28 -32 -31 92 0 -102 -3 2 77 -33 70 23 111 53 81 -8 50 104 55 69 -34 26 17 25 -85 -54 57 18 -83 -110 49 -12 41 112
-420 112 -31 -7 27 6 -46 113 -93 -102 -49 43 49 1 60 98 -60 46 24 17 -68 62 56 -35 6 30 -94 44 -62 22 167 43 86
-389 86 31 -74 19 49 -64 -30 -49 154 58 32 27 -121 9 -59 159 161 -4 66 -138 -94 -120 -111 -5 -54 79 -16 -134 -49 36 -11 -118
-358 -118 -14 4 -42 104 86 164 -16 -71 -103 24 5 5 -105 47 82 -73 46 -5 21 -7 -46 -75 -85 14 -76 20 -137 52 -71 -132
-328 -132 -16 6 44 -22 -18 149 127 83 87 40 4 -40 -26 -60 126 154 0 -59 -47 41 39 -1 -76 -140 -59 28 -95 20 0 -15 65 41 60
-295 60 62 95 70 49 -20 -23 -147 -143 -142 75 51 11 -35 52 6 -20 -15 -12 -69 139 27 -42 97 -16 -72 -28 -51 58 -85 -90 -51 45 -17 -78 13
-260 13 109 -89 3 0 -12 -11 -46 -8 -17 -4 -23 -71 -132 128 112 12 25 -46 -2 -51 20 4 -32 -8 0 -114 -43 -11 -6 -20 -7 -11 63 58 -45 -57
-224 -57 6 38 -83 -12 -124 -42 -133 82 -31 -139 100 -129 -29 -43 51 -42 8 -89 -71 -15 -25 4 22 99 52 112 94 -42 17 -89
-194 -89 -29 -49 -162 -19 21 -138 -35 62 -70 22 88 62 57 82 41 -12 -69 14 56 74 67 12 27 97 126 64 43 -71 -18 81 92 97 53 -16
-160 -16 4 43 67 -41 -5 63 41
-153D1
##PAGE=	F1=13745.199180330855597
##FIRST=	31355.342622953838145,	6319.7438965998480853,	-0.20647442340850830078
##DATATABLE=	(F2++(Y..Y)), PROFILE
-2200 -55 11 -17 -86 10 38 -11 55 -34 33 -21 -31 -76 24 -14 39 41 -28 -77 62 -56 143 127 248 221 0 -13 -58 -52 0 -24 -55 -8 31
-2167 31 3 6 10 8 -33 -26 90 78 123 -36 67 -10 -50 0 -168 -67 108 -54 -61 19 -4 37 23 59 -16 -51 9 110 82 103 -22 -11 -22
-2134 -22 -59 -23 -57 -68 -46 -113 24 77 -8 -124 -21 -49 -69 28 -110 19 -69 86 117 17 -98 -98 -109 -139 -119 -4 130 17 -118
-2105 -118 -100 -23 16 -20 25 -62 -180 -77 39 -16 -36 -14 81 -23 -61 34 164 -26 -49 -201 -132 -29 -21 -84 -65 -53 1310 11025 19340
-2076 19340 12276 3196 586 78 118 123 6 28 110 181 112 91 86 55 -19 -18 54 37 77 90 -17 67 -68 -95 28 224 72 -95
-2048 -95 15 -26 -27 -7 -35 50 31 129 242 159 18 -46 159 22 -106 90 168 52 371 199 -27 313 205 20 -4 43 44 -165
-2020 -165 -60 39 -28 56 -13 10 54 -2 93 6 105 109 172 1 -38 -47 92 36 59 -9 132 57 92 188 40 -49 -40 48 64 31 27 -76 -17
-1987 -17 17 -60 4 -124 -91 -58 78 143 153 -1 -86 2 -81 -35 -85 -107 -42 1 31 -160 -95 -74 94 8 35 38 -14 -1 -10 -38 25 -36 163
-1954 163 34 8 345 124 -30 313 126 106 14 -92 -82 48 132 -41 -12 -93 13 -8 -10 19 -30 4 111 69 -101 -18 31 20 9
-1925 9 84 2 -41 0 21 50 -2 -30 16 17 -23 44 -61 -68 56 -20 51 -75 -9 69 -29 18 74 96 63 20 -40 74 111 -77 -8 10 -25 38
-1891 38 68 34 -60 23 46 73 -79 -44 -61 73 -58 81 -25 -92 -106 8 3 22 -72 81 183 -12 -73 -17 -6 -87 21 54 -21 89
-1861 89 93 73 16 -91 -40 -39 27 -23 20 133 40 15 -8 -41 -14 -48 -72 -38 17 -47 -75 -19 11 -31 -9 -85 174 45 1 0 -45 -73 44 206
-1827 206 83 24 82 -30 -17 39 41 -125 -78 117 1 -100 98 36 5 100 113 53 -4 56 -7 -5 64 40 -113 10 -9 -11 -80 75 97
-1796 97 48 -82 18 69 18 -59 -19 72 -32 43 -22 4 102 -47 -37 -158 -41 -63 -15 -104 -21 13 -8 -102 -27 13 62 -64 -91 -132 -170
-1765 -170 5 -56 -29 -1 9 -81 -22 -92 -2 -49 -83 46 37 -101 52 -25 -69 -12 -170 -48 44 -43 -39 -47 -68 -27 113 134 95 36 -28 -45
-1733 -45 -129 21 -61 -35 29 -137 -144 95 38 -55 78 -21 46 -69 67 82 109 92 100 16 -9 2 16 -54 47 12 76 -62 -43 -50 -36 -74
-1701 -74 62 -32 -9 -2 35 -1 -78 -4 50 -9 12 32 41 -9 44 32 21 1 -95 65 161 105 38 -102 -135 34 8 31 8 -1 -38 -177 -75
-1668 -75 41 0 14 0 4 150 38 73 -81 -53 -3 -2 21 -9 55 48 45 -75 60 101 48 -59 -4 112 29 -39 18 -20 55 75 -44 9
-1636 9 46 5 0 68 34 7 26 -63 66 73 64 -73 115 66 -8 53 -5 -111 -76 67 12 74 42 33 -44 -32 72 27 -13 21 46 -56 -42 15
-1602 15 46 -9 73 63 111 41 -84 26 39 7 -49 52 -37 -6 40 -42 -26 -125 26 -72 73 -14 -24 -54 -36 -121 -80 184 88 47 89 120
-1570 120 55 -110 92 -32 -39 -112 -36 -44 -63 -10 -29 -17 -51 -26 -38 -33 23 57 -45 38 -62 -93 -98 74 -23 40 74 40 -6 22 -3 -40 111
-1537 111 0 -76 40 -143 167 97 -114 -54 17 -73 -88 -39 -17 14 -43 48 14 -16 99 4 72 75 93 129 -60 69 174 6 24 32
-1507 32 80 2 -3 -80 34 30 12 30 29 -175 48 -71 59 36 -53 31 -21 23 6 12 146 -28 36 -30 -12 41 -98 -57 49 18 -40 -21
-1475 -21 81 -81 72 20 -24 -45 65 -14 50 40 58 25 36 12 79 -67 33 -54 13 32 133 133 79 -16 -94 23 -72 18 -32 59 -87
-1444 -87 -64 -130 19 24 24 -30 93 22 18 -64 -54 113 197 168 -64 57 13 43 60 62 65 187 69 92 11 -10 -33 -163 -56 -73 -118 60
-1412 60 27 53 -77 51 55 -30 -19 -25 -51 -58 -131 -27 -98 -56 -55 0 124 81 21 125 72 58 -1 -25 90 -59 -52 -26 68 -18 41 -70 -10
-1379 -10 12 133 33 15 -42 33 -114 -25 -4 -97 -62 -100 -13 11 23 12 36 23 -47 -79 -57 3 60 94 -43 72 64 58 -54 -165 -45 38
-1347 38 -26 62 -53 -50 -134 -62 19 -44 12 21 67 34 -75 84 -60 40 23 -4 40 32 16 -32 208 54 -38 0 -100 3 90 68 -24 -24
-1315 -24 45 39 80 77 -37 -1 -85 -8 72 -14 68 14 -129 -1 31 -52 14 -36 13 37 134 -128 -58 -55 35 -1 17 -3 110 -3 -86 76 -33
-1282 -33 -4 -157 -75 -24 -11 -33 0 -91 -122 103 31 56 38 21 38 -67 -114 -61 -75 -30 -7 -90 -101 -8 23 58 3 -10 -119 105 -36 56
-1250 56 31 155 -43 53 -50 228 110 45 -44 -79 -39 54 -90 -41 54 82 54 -9 -29 0 -17 79 108 37 96 97 42 13 8 -1 29 -37 -104
-1217 -104 -100 -152 23 68 55 52 5 -82 -48 -1 42 80 -14 138 -127 -13 -51 -77 41 -39 -7 111 71 4 -17 1 -137 -4 160 67 62
-1186 62 -131 -152 66 68 -79 -157 -99 66 23 -19 54 -40 -20 -66 -62 44 -105 -71 48 48 -5 -63 19 10 -11 159 24 -50 108 76 8 -154
-1154 -154 51 -108 -6 36 -41 3 -43 40 109 3 29 40 155 -40 105 -67 -82 -31 73 -107 -35 -66 53 -4 -63 -19 30 110 -50
-1125 -50 -78 82 -82 -97 -42 -5 19 -19 -7 55 109 -49 8 80 41 91 -50 -34 -16 -53 78 115 141 33 94 62 5 -42 -45 7 128 -49
-1093 -49 -68 98 3 -37 -23 -54 73 28 11 -62 -54 35 56 120 -24 -15 -46 23 84 98 -146 54 -27 0 -6 -1 101 194 117 97 -34 -50 -13
-1060 -13 20 81 95 -20 51 58 3 17 74 38 -88 4 62 55 2 47 62 15 27 -42 -69 -80 20 -64 34 -22 -6 -9 79 -20 -87 -57 0 -12 76
-1025 76 14 68 -35 26 67 41 -35 8 105 3 2 -97 18 70 0 -78 65 62 0 47 -16 60 115 -20 -84 -82 -15 91 20 38 37 -4 -16 88
-991 88 -17 48 64 -56 75 3 -43 47 -12 -111 23 27 35 5 -38 30 -19 41 -4 17 -110 -119 -15 62 2 -33 -70 0 -97 64 -46 -161
-959 -161 -78 -106 -123 -33 -19 65 16 -8 87 -51 -135 -56 3 -118 12 17 0 -42 -15 29 8 45 19 79 51 34 8 -20 -98 3 49 -131 15
-926 15 90 -111 -34 181 191 26 76 21 -73 -41 -13 -110 -1 -6 -56 -54 7 -64 -3 -19 114 -46 -1 10 -18 15 -43 111 95 145 9 -29
-894 -29 -50 -51 5 33 73 75 -20 2 61 52 -50 110 -26 46 64 72 -1 -35 -56 -7 -19 -63 -108 -65 13 0 168 118 -55 -41 44 28 49 115 10
-859 10 -35 2 56 -32 -109 66 105 27 -2 32 15 -25 -59 -86 -53 -56 43 83 -45 -104 56 -16 -116 15 45 -60 31 50 109 -19 178 177
-827 177 30 52 79 -83 -33 24 19 -25 47 13 -15 -81 51 24 -7 13 113 -6 -37 -11 -101 -94 -267 175 -18 55 -49 -11 144 -64
-797 -64 -100 0 126 -54 -82 175 138 -62 -98 17 -36 -42 35 3 81 9 15 81 -20 -1 -80 -3 26 -37 14 -72 -24 -21 -102 8 88 -85
-765 -85 -9 21 -63 -104 -97 -53 19 40 -139 -36 -87 77 13 52 105 -29 34 -74 -1 -5 -58 -57 54 54 18 12 93 29 56 50 -111 -33 -37 12 15 12
-729 12 -47 -54 52 72 171 106 -9 186 -12 19 47 56 22 79 -23 -58 -74 61 154 1 -73 -52 40 139 18 3 -78 -38 -169 6 -26
-698 -26 22 53 25 112 42 2 -4 39 -100 -114 21 -5 21 -57 -128 24 33 3 38 10 -85 43 -65 78 -10 8 87 0 23 43 86 21 -26
-665 -26 -91 56 38 -109 26 0 -25 65 -64 16 101 62 40 -176 -50 73 106 49 -19 -93 82 34 123 -71 -28 -41 35 -55 -69 -30 7
-634 7 -9 -152 48 -44 -59 -42 45 38 -4 117 88 14 -56 -58 -8 57 -24 -27 16 -114 -283 -27 -18 -71 -55 -93 -149 -120 -69 -77 -170 -94 44 8 -40
-599 -40 27 -17 66 119 -84 23 88 -25 -26 -56 55 49 -35 -10 -82 -92 -84 -54 -75 -114 -60 -37 -97 -17 -81 -14 49 0 -26 -9 -45 12 40 -22 -51
-564 -51 -103 -40 -1 45 78 -5 -45 72 112 0 23 41 77 -85 -46 81 95 72 35 10 -96 13 -77 -85 -16 -53 30 50 -8 -18 3 -5 -38
-531 -38 24 0 31 -4 13 -5 31 -52 -20 11 62 26 104 61 61 -15 -121 22 14 -100 -89 -29 55 -24 130 0 89 -30 15 35 57 -16 0
-498 0 107 0 -69 -61 -24 -37 -18 -8 -71 -168 -22 145 -12 -67 -99 35 164 38 30 -1 -63 70 -28 3 2 -88 -25 -54 43 -65 -32 52
-466 52 41 30 -45 -1 6 -36 50 29 -119 39 -2 55 -14 -23 -34 106 -3 -78 -12 -12 84 -17 83 9 111 47 51 -18 41 124 84 75 -26 53
-432 53 27 24 -84 -49 34 27 -76 -101 27 -28 30 93 -32 -45 19 17 -15 119 -97 -99 -50 14 30 -13 51 91 -79 38 33 21 -73 78 60
-399 60 -61 15 4 -118 51 -43 25 145 51 84 33 -78 17 36 -45 6 -32 153 57 17 35 -116 -1 -51 134 187 -11 55 -125 -97
-369 -97 -136 -111 -11 -49 88 -30 -146 -68 16 -31 -121 -29 -3 -49 129 70 148 14 -74 -97 15 13 13 -113 62 105 -53 42 9 45 -29
-338 -29 -17 -52 -83 0 -104 10 -108 53 -83 -149 -19 -1 33 -61 -42 132 137 95 103 31 5 -59 -29 -88 106 148 -14 -55 -37 55 34 -19
-306 -19 -93 -149 -58 19 -93 22 17 -6 71 4 39 67 112 44 67 -26 -7 -129 -114 -165 69 43 5 -28 31 -14 -17 -1 -5 -61 158 31 -42 107
-272 107 -5 -81 -24 -31 65 -99 -94 -52 67 -16 -93 8 81 -118 2 -12 -22 11 -58 -15 -15 12 -21 -61 -123 99 108 -5 19 -36 22 -38 -13
-239 -13 -6 -28 -15 -3 -118 -33 -16 12 -23 -13 -13 47 52 -57 -77 17 24 -97 -34 -121 -27 -135 88 -27 -148 115 -113 -38 -31 42 -20 11 -98
-206 -98 -70 20 -19 21 39 99 56 97 65 -39 27 -88 -38 -42 -169 -6 31 -140 -14 54 -81 1 85 57 75 113 62 21 -88 -5 41 70
-174 70 85 22 14 87 123 66 47 -70 0 86 79 92 55 -20 13 48 68 -37 -6 60 34
-153C4
##PAGE=	F1=13681.162295084952348
##FIRST=	31355.342622953838145,	6319.7438965998480853,	-0.22293016314506530762
##DATATABLE=	(F2++(Y..Y)), PROFILE
-2200 -67 -29 -39 -101 19 42 -29 56 -44 20 -19 -29 -83 32 -18 35 24 -23 -64 49 -32 129 94 217 215 10 27 -75 -57 28 -15 -38
-2169 -38 41 30 7 28 -1 -9 -42 -18 88 85 93 -4 70 -12 -33 11 -181 -61 111 -56 -55 -11 -16 52 27 47 -20 -32 1 91 78 94 -41 -10
-2135 -10 -30 -21 -10 -38 -92 -50 -105 28 49 -25 -105 -11 -59 -62 9 -99 31 -46 82 97 -7 -126 -122 -141 -131 -133 -17 137 25 -96 -89 5
-2103 5 -5 -33 68 -52 -180 -103 26 -34 -74 -13 72 -52 -65 16 151 -39 -56 -176 -150 -44 -23 -59 -76 -47 993 8222 14121 9142
-2075 9142 2457 494 59 104 120 -15 38 98 154 86 58 87 46 -34 3 91 37 62 87 -10 73 -68 -91 20 245 54 -109 13
-2047 13 -13 -1 2 -20 64 37 150 255 152 45 -39 143 -9 -126 83 162 33 385 211 -44 356 216 33 22 28 42 -166 -70
-2019 -70 37 -14 60 1 31 71 4 100 35 131 145 154 -20 -65 -52 96 29 73 7 162 76 97 190 35 -49 -35 56 82 19 23 -62 -18 16
-1986 16 -76 -2 -136 -78 -60 106 156 133 1 -90 2 -104 -37 -99 -123 -38 -16 16 -204 -95 -84 88 5 34 16 -42 -21 -16 -31 36 -40 116
-1954 116 28 4 311 115 -11 310 122 89 -4 -102 -61 27 150 -47 5 -80 25 -35 10 26 -33 10 147 72 -89 -36 0 18 1
-1925 1 84 2 -47 -3 12 32 -24 -36 19 6 -25 32 -72 -79 76 -4 24 -88 -18 57 -9 19 73 92 52 -2 -60 83 129 -79 -20 28 -37
-1892 -37 -6 68 16 -79 19 52 73 -102 -60 -27 100 -63 88 -25 -109 -120 -7 -4 0 -81 87 165 0 -60 2 10 -94 33 70 -14 76
-1861 76 99 61 6 -95 -34 -39 40 -17 27 108 23 7 15 -62 -16 -24 -42 -19 44 -38 -70 -19 22 -11 6 -56 150 26 12 -15 -50 -59 58 208
-1827 208 59 -16 86 -32 -11 42 41 -119 -85 93 29 -73 99 19 8 109 113 57 -1 61 22 6 67 48 -104 2 -3 5 -77 90 112
-1796 112 37 -72 -1 58 0 -73 -18 77 -18 54 -38 14 79 -46 -33 -165 -8 -53 0 -94 -52 13 5 -98 -36 -4 51 -61 -102 -122 -134 -14
-1764 -14 -63 -23 -19 13 -89 -19 -89 -6 -44 -67 28 21 -97 64 -14 -67 -8 -178 -76 35 -21 -10 -27 -62 0 118 155 86 35 -22 -58 -102
-1732 -102 52 -66 -40 23 -136 -128 111 12 -57 94 -20 58 -68 42 49 100 96 84 0 6 -2 -14 -57 28 -1 67 -68 -40 -69 -28 -64 68
-1700 68 -43 -22 4 38 0 -87 -26 48 -37 12 35 30 -7 21 19 0 -9 -110 72 182 125 48 -95 -107 41 8 52 -7 -15 -13 -166 -93 80
-1667 80 0 -29 -8 13 161 27 38 -95 -35 -19 -18 19 -25 49 46 55 -83 82 105 13 -88 -7 128 36 -54 12 -43 38 62 -55 14 40
-1635 40 12 7 78 34 -8 17 -63 78 84 44 -62 109 70 21 76 -1 -147 -83 55 -9 72 49 9 -66 -32 63 31 -7 38 39 -92 -70 -1
-1602 -1 31 7 73 48 113 53 -91 24 25 14 -60 46 -26 -12 9 -35 -26 -119 31 -66 95 -35 -33 -59 -29 -118 -77 164 59 31 96 123 74
-1569 74 -100 94 -49 -35 -86 -22 -42 -75 0 -12 -14 -55 -18 -54 -33 22 74 -28 41 -55 -113 -75 100 -24 44 93 44 2 15 -29 -36 121
-1537 121 -3 -45 31 -136 152 93 -125 -42 30 -53 -95 -40 -26 4 -55 59 -1 -41 84 20 77 92 108 132 -62 79 158 7 22 23
-1507 23 62 10 11 -53 6 35 5 33 35 -152 52 -89 61 37 -69 47 -14 13 18 33 168 -21 32 -36 -17 16 -93 -35 35 21 -40 -42
-1475 -42 47 -89 74 16 -47 -65 58 -32 37 44 64 10 14 7 98 -73 8 -36 1 23 128 109 68 -11 -83 25 -55 4 -39 56 -84 -61 -138
-1442 -138 32 43 1 -64 77 22 -42 -68 -76 93 183 164 -58 48 16 75 66 52 41 186 72 99 32 15 -6 -149 -60 -72 -113 85 24
-1411 24 48 -33 77 56 -38 -38 -51 -58 -58 -97 -22 -108 -54 -62 -1 127 77 14 102 53 57 -4 -2 92 -62 -72 -34 68 -17 32 -82 37 45 115 31
-1376 31 50 -28 1 -121 -17 -4 -100 -91 -120 -11 1 13 12 43 39 -41 -70 -47 7 60 78 -69 73 76 51 -63 -150 -43 27 -41 69 -63
-1344 -63 -24 -137 -61 37 -24 4 37 58 5 -105 80 -82 39 -13 -28 36 33 39 -46 189 55 -23 21 -99 5 87 62 -18 -28 73 39
-1313 39 101 77 -47 1 -92 -37 63 5 60 20 -150 -18 46 -47 -13 -39 -31 34 117 -109 -52 0 39 -27 12 -24 107 -17 -83 65 -33
-1282 -33 17 -167 -71 -44 -27 -38 -1 -60 -122 103 26 42 58 35 66 -45 -69 -55 -48 -8 -29 -115 -81 -6 10 20 17 10 -123 94 -28 45 43 140
-1248 140 -47 59 -44 233 131 22 -44 -64 -38 74 -73 -38 41 87 38 7 -35 -30 -13 88 83 21 81 107 34 13 -3 -9 30 -32 -69
-1217 -69 -71 -158 34 76 51 49 1 -77 -39 -9 36 81 -3 131 -140 -15 -81 -73 42 -7 -18 117 99 -24 -53 2 -145 -8 137 64 72 -144
-1185 -144 -153 66 78 -77 -153 -95 86 16 -21 47 -33 -21 -53 -68 52 -114 -74 22 52 -15 -77 7 36 0 148 44 -71 97 79 11
-1155 11 -150 54 -99 -12 46 -47 26 -57 36 124 19 29 74 160 -47 88 -65 -82 -30 79 -107 -8 -64 58 16 -43 -2 29 116 -37
-1125 -37 -74 84 -81 -100 -27 -9 25 14 -4 36 97 -50 -3 66 51 72 -66 -26 -18 -61 69 110 134 31 78 69 2 -35 -10 0 123 -62
-1093 -62 -75 136 13 -55 -28 -56 78 70 23 -69 -43 51 61 88 -35 -23 -64 16 66 85 -124 30 -25 3 4 11 96 208 130 108 -30 -35 27
-1060 27 32 68 81 -9 27 64 23 16 48 18 -90 -7 75 31 -13 67 109 38 28 -20 -27 -56 45 -60 23 -2 6 -16 60 -4 -87 -47 -8 -27 72
-1025 72 19 60 -27 40 70 27 -37 3 73 -20 0 -122 0 92 23 -65 62 57 -2 58 -26 30 102 -1 -66 -75 13 93 33 22 33 -5 -14 101
-991 101 -47 22 71 -58 85 -14 -49 37 -20 -109 45 27 60 12 -40 20 -17 31 -6 8 -123 -103 -29 27 -8 -21 -81 11 -88 50 -53
-960 -53 -192 -101 -126 -138 -18 -25 77 11 -4 115 -40 -102 -43 0 -124 9 -26 -6 -23 -7 28 15 52 43 70 60 28 5 -5 -106 17 41
-928 41 -127 -6 71 -111 -65 177 183 7 60 35 -89 -55 -4 -86 19 12 -32 -41 0 -64 21 -9 133 -22 -30 -8 -38 -5 -41 130 76 131
-896 131 -14 -28 -34 -59 -8 39 82 67 -8 2 78 50 -64 126 -24 61 65 88 -1 -28 -52 -8 -16 -78 -120 -70 10 2 156 121 -54 -33 25 15
-862 15 87 132 1 -10 -10 61 -22 -106 75 111 26 -4 23 6 -25 -35 -58 -61 -48 47 90 -41 -120 19 -20 -139 17 37 -46 18 30 84 -11
-829 -11 181 207 17 58 86 -91 -49 8 8 -17 75 3 -30 -98 72 16 -19 20 113 -6 -26 -10 -113 -84 -271 208 -43 61 -62 -29
-799 -29 117 -70 -59 -6 132 -36 -60 170 141 -73 -59 27 -35 -37 45 36 94 19 -2 66 15 44 -49 -26 4 -36 -8 -75 -35 -19 -83 11 88
-766 88 -68 -10 36 -73 -109 -90 -45 27 47 -133 -34 -102 60 -15 35 84 -30 29 -78 -7 -13 -88 -64 65 71 4 37 117 16 53 78 -111
-734 -111 -34 -27 1 22 22 -45 -42 47 63 183 131 14 169 -7 20 65 48 21 77 -5 -65 -69 61 134 -7 -92 -57 25 113 22 -9 -90 -46 -180
-700 -180 -16 -20 40 63 43 118 52 6 11 57 -108 -125 2 -8 48 -42 -136 41 33 -2 45 6 -67 44 -78 66 -4 -1 102 26 26 43 90
-667 90 37 -18 -87 46 37 -125 14 -16 -37 62 -56 31 90 81 59 -154 -45 90 102 38 -35 -126 58 27 123 -90 -51 -14 63 -48 -70
-636 -70 -2 4 -15 -171 49 -24 -68 -37 55 36 -18 115 58 10 -32 -44 28 47 -21 -26 13 -117 -292 -32 0 -65 -38 -98 -138 -129 -96 -93 -161 -79
-602 -79 20 -1 -58 14 -26 59 120 -96 19 79 -57 -36 -61 36 70 -37 -24 -85 -74 -95 -70 -61 -88 -56 -13 -98 3 -75 0 43 -3 -21 -10
-569 -10 -65 38 54 -41 -53 -100 -41 -15 42 102 10 -60 61 112 -1 40 60 58 -106 -68 58 97 74 55 24 -94 8 -84 -71 -21 -37 4
-537 4 61 -12 0 13 -14 -71 44 -1 21 9 16 -17 22 -47 -19 -9 54 6 107 39 23 -8 -127 12 29 -82 -92 -23 65 -41 117 -16
-505 -16 89 -49 0 8 70 -26 -13 101 14 -50 -71 -37 -23 10 -12 -77 -176 -30 127 -3 -39 -93 23 183 44 39 0 -49 70 -34 5
-474 5 3 -88 -18 -70 35 -63 -30 75 37 57 -47 7 -11 -8 73 73 -114 26 11 53 -5 -19 -37 114 -4 -53 -14 -23 94 5 94 -2 109
-441 109 39 19 -22 29 137 115 77 -15 71 37 22 -81 -53 4 39 -62 -87 1 -49 11 82 -34 -81 12 32 19 119 -103 -95 -48 -11 14
-409 14 -22 39 80 -94 26 39 26 -69 96 60 -87 21 -14 -131 53 -23 24 112 52 82 41 -79 15 21 -25 41 -17 141 53 1 45
-378 45 -104 -14 -43 107 203 -20 41 -101 -95 -145 -103 -11 -45 89 -45 -147 -80 -6 -47 -119 -43 -6 -56 146 52 125 47 -70 -85 8 21
-347 21 22 -112 75 122 -35 35 17 57 -58 10 -36 -81 -6 -133 4 -75 48 -97 -161 -25 -7 24 -96 -60 117 144 102 113 27 7
-317 7 -79 -35 -114 80 138 -20 -42 -28 67 23 -43 -106 -147 -54 11 -88 30 34 4 71 -21 22 64 119 17 80 -30 9 -108 -83 -187 59
-285 59 39 -1 -16 15 -40 -18 12 -3 -44 171 31 -39 118 5 -87 -28 -4 69 -107 -90 -51 78 -21 -103 4 54 -136 1 -26 -32 33
-254 33 -65 -23 -12 26 -14 -53 -97 67 92 -24 18 -17 48 -22 -49 -14 -30 -24 -10 -118 -20 -12 30 -30 -18 -12 33 38 -60 -95 24 6 -108 -51 -109
-219 -109 -9 -130 91 -24 -153 123 -89 -37 -17 28 0 18 -100 -63 51 -10 30 49 95 61 79 39 -33 34 -86 -44 -31 -162 13
-190 13 36 -143 8 44 -93 -15 74 43 89 133 72 40 -107 -27 28 65 97 35 0 71 115 60 47 -65 15 81 61 82 57 -28 17 52 65
-157 65 -34 -6 61 24
-153B4
##PAGE=	F1=13617.125409839052736
##FIRST=	31355.342622953838145,	6319.7438965998480853,	-0.18825066089630126953
##DATATABLE=	(F2++(Y..Y)), PROFILE
-2200 -74 -71 -62 -115 28 44 -34 56 -54 9 -19 -25 -85 29 -26 27 8 -15 -46 33 -13 110 61 174 191 17 70 -90 -62 56 -2 -24 83
-2168 83 26 8 51 -17 -34 -47 -12 79 81 56 23 67 -17 -22 17 -182 -57 105 -57 -49 -37 -32 56 36 33 -26 -7 0 71 63 76 -59 -7 -38 16 6
-2132 6 -16 -111 -57 -91 39 16 -43 -91 -1 -64 -51 -4 -87 28 -22 70 70 -27 -140 -141 -162 -122 -137 -25 141 35 -70 -72 26 -19 -44 107 -41
-2099 -41 -175 -124 22 -55 -108 -2 60 -76 -64 1 130 -53 -66 -141 -158 -51 -28 -28 -75 -34 710 5612 9231 6226 1771 396
-2073 396 35 81 107 -37 47 78 115 58 21 89 37 -44 20 125 29 42 74 -9 78 -64 -84 9 255 31 -120 10 3 29 17 -1 81
-2042 81 43 164 254 146 74 -33 120 -46 -143 77 157 28 413 243 -44 402 231 47 43 10 31 -161 -78 39 2 62 18 52
-2014 52 81 10 98 64 152 169 129 -41 -88 -52 94 21 79 21 182 96 99 184 28 -51 -25 59 97 3 17 -47 -15 11 -92 -17 -144 -55
-1982 -55 -62 133 159 103 0 -91 3 -119 -34 -105 -134 -34 -30 6 -235 -90 -88 80 1 34 -2 -67 -36 -17 -24 52 -42 68 17 -19 275 97
-1950 97 -14 298 114 70 -14 -118 -43 12 167 -54 25 -63 34 -55 28 34 -32 12 180 77 -71 -60 -27 24 -8 78 2 -57 -12 0 4
-1919 4 -49 -37 29 -5 -31 19 -79 -87 83 10 -10 -96 -32 35 4 11 70 80 44 -30 -74 83 141 -71 -30 39 -50 -52 60 -3 -88 20 62 70 -114
-1884 -114 -73 7 123 -63 98 -24 -114 -118 -28 -4 -23 -93 90 140 10 -35 17 24 -94 39 84 -2 58 100 44 0 -100 -28 -38 39 -5
-1853 -5 34 76 0 -2 37 -82 -23 -1 -10 3 70 -26 -60 -19 33 7 19 -25 127 8 25 -27 -56 -46 65 199 35 -61 86 -29 -11 45
-1821 45 38 -108 -88 65 57 -38 99 8 15 110 109 56 0 54 46 24 66 56 -95 -4 7 26 -67 97 126 26 -51 -15 51 -26 -84 -21 78 -4
-1787 -4 57 -54 23 55 -37 -27 -175 15 -41 9 -81 -75 15 30 -84 -47 -28 34 -55 -112 -107 -98 -28 -62 -17 -44 9 -90 -19 -87 -4 -33 -46 12 8
-1752 8 -88 78 -3 -64 -5 -174 -92 29 3 10 -8 -54 26 111 166 74 29 -22 -69 -72 76 -71 -48 14 -130 -111 114 -16 -65 108 -20
-1721 -20 68 -60 16 13 81 103 71 -18 24 -1 -45 -63 6 -19 53 -67 -31 -84 -24 -49 69 -48 -38 17 41 2 -91 -46 41 -63 11 36 18
-1688 18 -4 0 2 -18 -19 -115 81 195 132 50 -87 -75 48 14 72 -21 -29 3 -151 -112 110 -4 -72 -14 26 161 20 1 -107 -16 -30 -31
-1656 -31 14 -44 50 50 67 -90 103 103 -18 -107 -4 138 44 -61 1 -65 19 50 -67 19 26 17 16 83 35 -26 2 -63 90 92 22 -45 106
-1623 106 70 48 88 2 -176 -86 39 -30 58 51 -15 -85 -31 52 33 -9 51 27 -121 -93 -16 16 24 69 37 107 53 -90 20 8 18 -68 34
-1590 34 -16 -19 -24 -29 -32 -107 37 -59 114 -58 -37 -60 -22 -105 -64 140 32 14 103 125 88 -89 82 -71 -35 -60 -8 -44 -77 11 6 -13 -62
-1557 -62 -17 -73 -36 27 92 -15 43 -39 -126 -41 119 -30 41 97 43 12 2 -58 -33 135 -9 -14 18 -128 131 77 -132 -27 39 -31 -102
-1526 -102 -41 -31 -1 -64 75 -16 -70 66 34 75 101 122 122 -67 88 132 11 19 14 42 22 28 -25 -23 40 -4 31 35 -124 58 -95 54 42
-1493 42 -70 64 -8 1 27 52 177 -11 28 -41 -30 -12 -83 -9 19 24 -34 -54 17 -92 71 15 -60 -72 53 -49 21 50 71 -8 -10 2
-1461 2 119 -78 -10 -19 -20 18 120 83 58 -4 -70 28 -41 -6 -46 52 -78 -50 -134 48 57 -19 -96 60 21 -103 -66 -95 66 152 150 -49 42
-1428 42 23 106 68 40 11 172 77 110 48 34 22 -127 -62 -73 -100 111 20 36 7 101 56 -41 -51 -71 -64 -55 -54 -13 -105 -50 -72 -9 124 69
-1394 69 4 72 29 48 -4 14 91 -59 -88 -44 63 -15 25 -89 83 79 90 31 80 -14 -25 -124 -4 -2 -95 -113 -128 -5 -6 -1 15 44 54 -31
-1360 -31 -57 -30 19 57 57 -83 65 81 48 -65 -136 -36 14 -55 75 -64 -1 -134 -53 52 -6 0 52 48 -16 -130 63 -102 38 -54
-1330 -54 -52 25 32 62 -59 167 58 -6 41 -89 4 84 55 -16 -32 98 40 116 65 -50 0 -94 -56 57 23 48 20 -165 -35 55 -42
-1299 -42 -33 -44 -74 30 105 -77 -39 50 50 -54 4 -42 102 -33 -79 50 -25 35 -177 -71 -62 -43 -37 -2 -29 -119 99 20 19 73 52 91 -15
-1266 -15 -22 -46 -20 12 -50 -128 -58 -9 0 -12 30 24 -114 78 -18 37 54 118 -45 65 -42 225 143 -6 -35 -46 -40 89 -51 -36 25 89
-1234 89 14 26 -42 -61 -13 87 57 1 71 106 24 9 -18 -20 16 -38 -32 -42 -166 45 83 47 47 -1 -62 -22 -17 27 76 13 127 -145 -15 -105
-1200 -105 -68 40 28 -28 120 125 -52 -85 1 -145 -13 115 68 71 -154 -143 63 87 -75 -142 -88 90 7 -26 40 -14 -16 -36 -77 57
-1170 57 -116 -72 7 57 -23 -89 -4 59 12 128 58 -93 87 77 17 -139 59 -88 -22 56 -55 46 -63 30 129 31 32 99 164 -41
-1140 -41 66 -60 -77 -19 86 -110 17 -53 63 33 -17 15 26 116 -28 -66 82 -81 -106 -15 -6 30 47 -4 15 79 -45 -18 47 54 48
-1109 48 -76 -16 -13 -60 58 101 125 22 57 75 -1 -29 20 -9 112 -72 -78 168 16 -71 -37 -56 82 105 28 -81 -30 62 58 49 -48 -23
-1077 -23 -69 15 35 64 -89 8 -23 0 17 23 95 209 135 108 -23 -20 60 39 50 57 1 5 70 39 15 19 -3 -87 -20 86 5 -24 84 143 56
-1042 56 26 3 19 -28 66 -53 10 14 12 -25 37 11 -83 -25 -12 -45 65 23 52 -14 54 73 10 -40 -1 37 -42 -5 -145 -24 105 46 -52
-1009 -52 63 50 -7 65 -39 -1 85 18 -39 -61 38 88 44 4 22 -11 -20 110 -68 -13 72 -55 95 -30 -47 30 -26 -100 62 27 77
-978 77 20 -44 5 -14 22 -8 2 -124 -78 -40 -6 -17 -13 -86 24 -69 36 -51 -213 -124 -148 -154 -7 -31 82 3 -2 141 -23 -63 -27 2 -116
-945 -116 12 -75 -7 -7 2 29 19 60 64 58 67 20 1 5 -112 26 37 -117 -27 54 -95 -93 166 169 -4 43 48 -97 -68 6 -64 34 35 -5 -22 -6
-909 -6 -62 47 0 150 4 -56 -25 -56 -32 -32 142 55 120 -23 -27 -20 -55 -7 44 87 49 -3 0 88 41 -75 136 -23 72 66 100 0 -24 -45
-875 -45 -1 -9 -91 -126 -75 2 -1 134 118 -60 -15 0 -3 117 141 -8 11 -22 60 -6 -97 78 112 25 -6 14 0 -24 -5 -38 -76 -38 43 98
-841 98 -28 -121 -13 -23 -151 19 32 -34 4 11 47 -7 169 228 5 63 88 -94 -60 -8 0 -11 93 0 -40 -119 81 14 -26 30 111 -12
-809 -12 -15 -11 -128 -72 -263 232 -71 61 -78 -46 87 -71 -20 -16 134 -23 -38 152 137 -80 -15 42 -34 -30 48 71 103 26 -16 42 47 86
-777 86 -21 -45 -19 -40 -34 -78 -43 -18 -60 10 75 -45 -13 52 -80 -113 -80 -27 30 53 -115 -27 -111 35 -53 12 62 -34 17 -79 -15 -27 -113
-744 -113 -77 74 83 -10 55 136 10 48 99 -100 -32 -14 -13 29 34 -39 -20 42 51 185 150 33 143 -6 15 77 38 12 72 12 -68 -61 66
-711 66 116 -9 -106 -63 5 76 27 -24 -95 -42 -185 -38 -3 59 71 52 115 56 11 27 72 -109 -134 -12 -7 72 -21 -138 55 26 -6 51
-679 51 5 -41 46 -88 44 3 -12 118 52 27 36 82 42 2 -72 34 31 -127 5 -32 -46 54 -44 45 75 95 80 -121 -36 101 92 25
-647 25 -48 -147 32 20 119 -104 -79 21 90 -33 -65 21 3 -22 -182 44 -11 -77 -27 62 38 -38 106 24 7 2 -23 63 34 -21 -26 8 -116
-614 -116 -287 -34 11 -54 -22 -102 -130 -129 -121 -96 -145 -62 -6 -7 -70 -5 -32 44 108 -98 18 65 -89 -38 -65 18 84 -42 -36 -82 -51 -108 -89 -44
-580 -44 -62 -60 17 -96 26 -69 11 35 -6 -13 -16 -83 63 69 -60 -54 -90 -37 -20 39 119 20 -71 45 105 -7 54 73 40 -122 -90 31 97 72
-546 72 75 37 -87 -2 -88 -59 -22 -23 -21 68 -17 21 25 -20 -93 67 7 15 19 9 -24 6 -37 -8 -30 41 -3 108 11 -15 -5 -129 1 44 -58
-511 -58 -86 -20 76 -61 90 -30 84 -71 -5 -9 79 -32 -29 97 37 -32 -83 -52 -12 39 -12 -78 -177 -33 99 0 -15 -82 13 189 49
-480 49 46 6 -26 58 -46 8 6 -85 -12 -83 29 -55 -21 90 37 82 -46 14 -26 16 93 115 -100 15 23 47 -1 -23 -42 112 -3 -32 -10
-447 -10 -25 108 29 100 -13 105 30 -14 -20 15 140 142 76 -2 81 45 17 -79 -64 -27 53 -44 -69 -24 -71 -11 81 -37 -112 6 50 54 115 -109
-413 -109 -91 -44 -29 2 -26 26 68 -104 13 40 30 -53 114 53 -113 21 -22 -131 52 -4 18 72 45 79 53 -76 14 8 -2 73 -3
-382 -3 120 46 -12 55 -89 -25 -35 80 202 -32 28 -72 -89 -142 -90 -8 -42 80 -61 -138 -82 -30 -57 -111 -55 -3 -60 152 33 95 75
-351 75 -60 -69 1 26 32 -104 85 129 -22 25 17 57 -88 33 -29 -78 0 -158 6 -40 39 -111 -164 -30 -8 20 -124 -71 106 148 101
-320 101 115 28 12 -99 -45 -135 48 122 -18 -21 -19 74 7 -69 -112 -134 -41 4 -83 41 50 16 67 -34 10 53 115 -9 85 -32 26 -90
-288 -90 -54 -206 46 40 -8 0 5 -68 -21 24 -5 -21 177 28 -32 126 14 -89 -39 30 69 -107 -79 -48 74 -30 -105 4 31 -143 -1
-257 -1 -43 -41 49 -68 -33 -9 37 -1 -47 -63 34 66 -40 22 5 72 -3 -80 -21 -36 -36 -19 -114 -5 -3 48 -41 -21 -7 20 20 -53 -110 24 -16 -116
-221 -116 -63 -91 12 -118 90 -26 -151 122 -61 -29 -2 10 16 29 -98 -54 70 0 30 51 89 64 62 20 -24 35 -84 -47 -15 -145
-191 -145 35 37 -149 28 36 -105 -29 55 21 98 137 71 43 -123 -47 18 58 102 51 -12 53 102 46 44 -59 26 67 43 72 61 -39 15 57
-158 57 58 -34 -7 66 14
-153A4
##PAGE=	F1=13553.088524593149486
##FIRST=	31355.342622953838145,	6319.7438965998480853,	-0.12039979547262191772
##DATATABLE=	(F2++(Y..Y)), PROFILE
-2200 -75 -109 -83 -124 35 43 -26 54 -63 1 -24 -20 -83 16 -36 17 -4 -4 -28 15 1 89 32 128 154 21 108 -105 -65 78 10 -16 113 20
-2167 20 8 72 -35 -63 -46 -10 66 66 19 44 58 -24 -17 17 -173 -59 93 -57 -43 -54 -46 52 45 17 -31 20 1 52 39 52 -70 -1 -44 51
-2133 51 23 4 -122 -66 -73 56 -18 -61 -83 9 -65 -38 -12 -74 10 0 52 36 -43 -137 -150 -171 -114 -133 -28 139 43 -45 -49 37 -26 -51 139
-2100 139 -29 -167 -139 28 -77 -137 17 45 -96 -61 -7 105 -67 -75 -101 -156 -49 -34 5 -63 -17 501 3515 5248 3890 1235
-2074 1235 311 14 53 87 -57 54 56 71 32 -11 93 31 -44 32 154 15 20 51 -14 84 -57 -74 0 254 7 -126 7 20 59
-2045 59 34 20 100 50 170 240 139 101 -27 93 -82 -153 77 151 33 454 292 -34 447 250 59 52 -11 13 -149 -82 44 19
-2017 19 65 33 74 83 14 86 91 165 178 100 -59 -103 -47 86 15 78 34 190 113 99 174 21 -55 -10 60 107 -10 12 -32 -9 3 -106 -37
-1984 -37 -144 -20 -58 156 152 66 -2 -92 5 -126 -29 -102 -143 -30 -36 2 -251 -83 -86 67 -4 35 -16 -82 -41 -12 -15 71 -44 21 0 -61
-1952 -61 233 65 -40 274 103 51 -13 -136 -29 5 179 -63 42 -45 40 -69 41 43 -28 9 204 82 -49 -88 -50 39 -17 68
-1924 68 0 -69 -26 -13 -31 -74 -34 41 -16 -41 3 -81 -93 76 21 -49 -99 -48 6 8 -4 67 64 39 -59 -82 75 145 -54 -32 41 -61 -90 44
-1890 44 -23 -87 25 70 66 -116 -78 38 139 -57 108 -21 -111 -103 -54 2 -44 -107 88 111 18 -4 24 32 -85 40 93 9 37 94 27
-1859 27 -1 -107 -22 -34 26 11 41 40 -28 -12 57 -97 -33 13 18 24 91 -11 -45 -16 43 24 25 1 105 -5 39 -34 -65 -37 63 180 12
-1826 12 -104 78 -23 -19 46 32 -97 -84 38 83 -2 95 2 24 105 99 51 3 35 61 45 63 63 -84 -9 23 51 -53 95 135 12 -23
-1794 -23 -17 53 -52 -88 -25 74 6 50 -67 30 33 -23 -19 -185 30 -29 14 -62 -90 17 59 -62 -60 -56 15 -46 -117 -88 -63 -35 -54 -10 -68 0
-1760 0 -84 -20 -87 1 -18 -22 1 -1 -74 91 7 -61 -3 -159 -95 25 26 18 7 -48 47 93 168 62 22 -27 -76 -42 92 -78 -58 2 -122 -97
-1726 -97 108 -40 -79 118 -22 76 -44 -6 -20 52 111 62 -36 41 2 -71 -70 -15 -39 31 -58 -19 -95 -25 -32 66 -49 -58 32 48 4 -90 -63
-1693 -63 31 -84 10 37 6 -2 -17 -17 -34 -25 -110 91 198 125 46 -76 -43 57 23 86 -33 -43 12 -136 -131 128 -10 -111 -16 41 153
-1662 153 18 -29 -115 2 -32 -42 8 -63 57 55 78 -94 121 94 -44 -114 2 143 51 -61 -13 -85 0 38 -78 24 5 17 24 82
-1632 82 36 -46 -18 -64 101 94 0 -24 106 67 69 90 8 -195 -83 20 -47 38 46 -39 -96 -26 40 32 -18 60 10 -138 -107 -33 0 41 62 28
-1598 28 95 46 -78 16 -9 19 -76 20 -7 -27 -52 -23 -44 -88 42 -54 125 -78 -37 -55 -16 -84 -42 112 10 0 110 122 98 -78 58
-1567 58 -97 -38 -37 5 -51 -70 19 26 -14 -69 -23 -95 -39 41 109 -5 44 -15 -129 0 128 -37 31 87 39 23 -11 -87 -32 151 -17 11
-1535 11 0 -120 109 54 -134 -11 43 -9 -110 -45 -33 -1 -71 92 -31 -100 47 44 69 101 133 99 -73 94 99 17 17 9 20 37 44 -1
-1503 -1 -53 45 -16 27 31 -91 65 -90 42 50 -58 82 -6 -11 30 64 169 1 26 -45 -48 -39 -68 16 2 26 -27 -57 -3 -89 66 16 -62
-1470 -62 -68 48 -59 7 54 80 -29 -35 -2 138 -79 -22 -8 -47 18 109 60 46 3 -56 33 -33 -13 -51 47 -70 -35 -119 66 67 -34 -122
-1438 -122 43 21 -156 -57 -109 37 105 132 -38 38 32 133 70 29 -20 148 83 123 56 45 50 -101 -59 -75 -79 132 17 19 43 121 54 -38
-1406 -38 -54 -87 -70 -47 -9 0 -92 -47 -82 -20 117 57 -6 39 6 32 -2 25 88 -52 -99 -57 54 -12 21 -89 122 110 63 33 99 0 -49
-1373 -49 -123 10 0 -83 -126 -124 4 -8 -19 18 38 66 -17 -40 -4 36 53 32 -85 51 79 51 -59 -123 -25 -1 -68 80 -55 15 -126
-1342 -126 -43 61 6 -3 63 39 -30 -147 39 -115 36 -94 -72 10 25 82 -68 146 63 9 58 -73 1 81 47 -16 -35 117 44 125
-1312 125 43 -46 -5 -90 -63 55 38 33 14 -173 -51 58 -36 -44 -49 -110 22 96 -37 -19 94 69 -79 -3 -55 91 -48 -73 34 -8
-1282 -8 48 -183 -76 -76 -57 -31 -2 0 -111 95 13 -11 79 68 108 19 21 -36 3 26 -67 -125 -35 -20 -11 -37 43 29 -92 57 -10 29 64 93
-1248 93 -38 71 -42 205 148 -36 -16 -27 -42 95 -27 -34 9 86 -16 44 -48 -88 -15 77 35 -18 68 95 15 2 -32 -32 -9 -51 0 -15
-1216 -15 -173 57 87 42 45 -3 -45 -1 -24 17 66 34 122 -143 -11 -121 -64 33 61 -36 118 143 -76 -106 0 -135 -18 95 76 61
-1186 61 -161 -124 59 93 -73 -126 -81 77 -2 -37 32 12 -6 -16 -86 60 -114 -67 7 65 -29 -98 -15 75 25 102 66 -113 78 73 26
-1155 26 -120 68 -75 -35 67 -64 60 -58 23 125 38 35 111 169 -23 43 -52 -67 1 92 -115 37 -36 70 45 12 27 19 105 -24
-1125 -24 -55 75 -77 -114 -7 3 32 73 -9 -6 59 -36 -35 25 49 26 -78 -4 -4 -51 45 87 112 7 33 77 -6 -25 43 -18 99 -80 -76
-1092 -76 190 12 -82 -50 -56 84 129 25 -95 -15 66 49 9 -63 -16 -63 17 -5 37 -44 -8 -21 -6 29 33 96 199 133 100 -15 -6 83 41
-1059 41 28 29 12 -11 77 55 14 -9 -21 -79 -32 96 -15 -29 97 158 64 23 28 66 0 82 -43 -4 26 12 -34 12 26 -76 5 -13 -63
-1026 -63 58 28 45 1 68 79 -8 -45 -7 1 -61 -16 -162 -49 108 68 -38 66 39 -16 66 -57 -31 67 35 -5 -45 58 76 51 -9
-995 -9 4 -18 -29 114 -80 -53 69 -48 103 -43 -39 26 -31 -88 72 28 84 26 -49 -15 -9 16 -7 1 -112 -47 -48 -37 -25 -8 -83 36 -42
-962 -42 25 -44 -220 -140 -169 -168 -2 -37 79 -7 -1 160 -3 -24 -8 11 -96 23 -119 -4 3 12 29 19 68 82 46 73 12 -3 12 -118
-930 -118 28 37 -100 -46 41 -65 -113 149 152 -10 26 57 -92 -77 16 -46 44 61 19 0 -12 -56 73 7 163 31 -76 -38 -69 -61 -17
-899 -17 145 37 114 -17 -26 -13 -42 5 48 89 26 -4 -4 91 25 -79 138 -23 80 67 107 3 -19 -39 10 -2 -96 -127 -78 -8 -10 105
-867 105 110 -76 10 -25 -28 135 137 -20 26 -32 54 11 -82 76 110 28 -8 7 0 -22 22 -26 -92 -27 33 101 -8 -110 -39 -25 -154 18 32
-834 32 -29 -11 -2 3 -8 144 236 -6 65 88 -94 -65 -25 -3 -7 98 0 -42 -138 76 18 -28 42 108 -23 -5 -17 -145 -60 -244 244 -100
-802 -100 53 -97 -61 61 -67 10 -28 134 -17 -19 125 127 -81 25 63 -33 -21 43 103 106 32 -25 9 72 121 -1 -58 -43 -49 -59 -80 -47
-770 -47 -17 -36 6 49 -20 -16 67 -82 -114 -65 -5 27 58 -85 -18 -112 6 -97 -11 40 -42 2 -80 -24 -43 -131 -93 76 88 -25 62 148 14
-737 14 45 109 -80 -27 2 -28 38 46 -29 5 38 38 176 162 46 112 -6 4 80 24 -4 65 28 -68 -51 75 102 -3 -113 -69 -16 31 31
-704 31 -40 -91 -26 -181 -57 19 79 77 51 104 53 14 41 83 -99 -139 -23 -3 88 3 -132 63 17 -9 53 7 -12 47 -97 15 16 -18
-672 -18 134 74 25 26 65 40 30 -47 21 22 -114 0 -41 -48 42 -27 56 61 103 98 -82 -24 106 77 9 -56 -153 6 14 114 -112 -108 60 111
-638 111 -13 -52 38 5 -31 -184 28 -4 -83 -16 62 42 -62 92 -9 6 45 1 94 22 -22 -29 0 -112 -267 -33 13 -42 -8 -106 -127
-607 -127 -123 -142 -85 -122 -45 -34 -7 -77 -29 -34 27 86 -90 22 49 -118 -31 -66 3 93 -49 -46 -71 -27 -117 -106 -23 -41 -71 51 -89 49 -65
-574 -65 16 27 -9 -4 -23 -96 85 82 -75 -52 -77 -29 -16 35 129 25 -78 31 94 -17 61 78 24 -129 -112 4 94 71 92 47 -76 -15
-542 -15 -85 -48 -21 -12 -43 68 -24 43 40 -21 -103 88 23 14 24 -4 -26 -13 -26 11 -47 25 -3 105 -19 -50 -7 -128 -7 54 -33 -71 -21 82
-508 82 -83 53 -40 75 -92 0 -15 86 -33 -46 96 68 -18 -94 -65 -3 68 -9 -74 -170 -32 62 -3 -2 -66 7 184 55 52 15 3
-477 3 35 -62 14 10 -81 -9 -94 23 -42 -5 97 41 102 -44 20 -37 37 109 150 -79 6 31 38 -1 -32 -49 101 0 -20 -2 -17 124 49
-444 49 96 -24 96 22 -49 -10 3 134 161 69 11 81 53 11 -79 -77 -55 65 -21 -45 -46 -90 -35 89 -38 -138 -2 67 86 109 -116 -91
-412 -91 -38 -39 -6 -27 16 55 -110 2 38 31 -29 128 41 -138 14 -21 -117 50 12 10 29 28 79 67 -67 15 2 19 100 6 92 37 -22 62
-378 62 -72 -34 -29 54 181 -43 19 -41 -81 -128 -74 -5 -36 61 -75 -122 -72 -51 -62 -102 -62 3 -63 147 16 62 94 -43 -50 -5 26 44 -90
-345 -90 94 126 -14 14 11 47 -115 46 -32 -74 13 -177 18 -1 27 -125 -160 -33 -6 22 -142 -74 102 150 92 110 33 22 -116 -60
-315 -60 -148 13 104 -5 1 -11 76 -12 -92 -109 -110 -18 -2 -79 51 60 24 61 -34 1 31 97 -29 81 -29 43 -79 -34 -217 33 45 -16
-283 -16 17 0 -95 -27 33 -8 3 175 24 -20 132 19 -86 -53 68 68 -98 -62 -44 53 -40 -102 9 13 -140 -3 -62 -48 59 -67
-253 -67 -41 -7 47 14 -42 -28 3 31 -50 30 27 92 15 -104 -27 -45 -50 -29 -109 8 8 64 -51 -20 0 10 5 -39 -121 15 -40 -121 -67 -69 35
-218 35 -100 81 -35 -142 112 -36 -17 13 -7 32 42 -92 -45 75 9 22 44 83 65 49 11 -15 29 -81 -46 3 -122 58 35 -157
-188 -157 45 31 -115 -38 31 -5 99 125 59 35 -131 -64 9 49 99 65 -24 36 86 24 39 -51 31 46 26 64 65 -52 7 59 46 -37 -6
-155 -6 74 3
-153C
##PAGE=	F1=13489.051639347246237
##FIRST=	31355.342622953838145,	6319.7438965998480853,	-0.051336150616407394409
##DATATABLE=	(F2++(Y..Y)), PROFILE
-2200 -73 -137 -97 -128 38 41 -7 49 -72 -5 -31 -13 -79 -2 -46 7 -13 8 -12 -1 15 67 10 85 111 25 137 -116 -64 93 22 -13 131
-2168 131 15 5 89 -53 -95 -39 -13 48 46 -13 55 43 -31 -16 12 -157 -66 78 -51 -37 -61 -56 44 49 0 -35 45 0 35 10 26 -73 5
-2135 5 -48 79 37 23 -124 -75 -53 75 -52 -77 -82 17 -62 -25 -16 -61 -17 19 30 0 -53 -119 -148 -166 -109 -121 -25 131 45 -22 -27 39 -24 -54
-2101 -54 160 -21 -159 -150 42 -96 -160 42 28 -111 -56 -9 78 -77 -81 -60 -145 -41 -42 36 -44 -1 384 2081 2449 2304 897 247
-2073 247 2 25 64 -68 63 36 29 14 -35 101 29 -35 42 175 -1 3 24 -22 90 -45 -60 -9 246 -12 -127 5 34 86 49
-2044 49 41 118 57 166 213 131 121 -20 61 -115 -151 84 141 38 501 347 -27 480 273 72 49 -36 -7 -135 -86 54 35 67 45
-2015 45 96 79 16 67 112 165 170 69 -70 -110 -41 73 12 74 48 185 125 96 165 14 -58 4 58 112 -17 9 -18 1 -6 -114 -60 -138
-1983 -138 22 -47 173 135 30 -4 -93 5 -125 -23 -92 -150 -26 -32 5 -254 -77 -79 49 -12 38 -26 -86 -37 -3 -2 90 -50 -24 -27 -120
-1952 -120 181 14 -89 236 87 33 -3 -150 -23 8 185 -73 53 -28 43 -77 47 53 -23 0 217 88 -27 -116 -65 64 -23
-1925 -23 55 -5 -78 -40 -25 -67 -99 -31 54 -24 -54 -12 -76 -98 54 27 -92 -99 -62 -29 3 -23 68 46 35 -83 -81 59 140 -33 -27 36 -68
-1892 -68 -116 25 -40 -77 31 72 60 -109 -73 62 147 -44 115 -16 -103 -77 -87 9 -64 -120 82 82 23 28 19 35 -69 35 99 18 18 82
-1860 82 13 -1 -116 -14 -25 4 31 45 2 -58 -21 74 -107 -47 16 41 40 103 7 -25 -7 53 37 24 22 86 -10 54 -37 -76 -33 52 153 -6
-1826 -6 -142 63 -14 -34 43 22 -89 -73 14 101 32 85 3 34 94 82 42 4 5 65 67 56 69 -70 -15 44 77 -40 81 136 -6 8 -6
-1793 -6 61 -72 -85 -29 68 13 32 -76 33 16 -5 -12 -192 36 -16 16 -39 -94 19 85 -35 -72 -82 -2 -35 -116 -64 -28 -35 -37 -2 -86 -14
-1760 -14 -74 -19 -88 8 -4 -1 -1 -7 -54 103 18 -57 -2 -133 -87 24 43 10 16 -46 60 69 159 50 16 -35 -76 -15 101 -85 -68 -12 -114
-1727 -114 -88 94 -57 -101 121 -25 80 -24 -25 -46 17 116 57 -51 58 8 -88 -79 -34 -60 1 -44 -7 -101 -32 -14 58 -45 -80 46
-1697 46 56 6 -85 -75 21 -97 10 41 -4 0 -30 -38 -43 -28 -97 101 192 105 37 -64 -15 66 32 92 -43 -54 13 -122 -147 133 -18 -142
-1665 -142 -14 58 138 21 -50 -119 19 -27 -51 0 -79 66 58 84 -95 132 78 -61 -107 12 142 58 -53 -30 -101 -18 27 -84 27
-1636 27 -19 14 29 75 36 -66 -44 -63 112 91 -18 -1 109 59 83 85 16 -203 -73 1 -59 15 34 -57 -98 -17 26 28 -30 61 -6 -136
-1604 -136 -111 -51 -19 56 53 22 78 32 -53 11 -24 16 -83 4 0 -35 -72 -19 -56 -66 48 -53 126 -91 -36 -44 -15 -60 -17 84 -1 -12 115
-1571 115 116 103 -71 24 -125 -45 -18 16 -62 -54 22 47 -16 -75 -35 -118 -44 63 122 2 43 12 -123 43 127 -44 13 65 33 35 -23 -113
-1539 -113 -34 167 -26 27 -24 -112 87 29 -132 3 43 7 -119 -52 -29 5 -77 107 -45 -129 26 48 62 94 140 66 -75 93 63
-1510 63 24 18 11 -2 50 56 14 -79 48 -29 26 23 -58 72 -75 30 56 -36 98 -10 -22 30 65 145 17 27 -44 -70 -63 -50 38 -13 28 -19
-1476 -19 -52 -11 -79 56 19 -55 -56 41 -62 -2 57 90 -54 -55 -5 153 -76 -25 -2 -78 25 97 43 34 12 -42 36 -32 -17 -55 43 -63 -17
-1443 -17 -96 81 70 -42 -140 31 29 -195 -42 -114 9 47 114 -26 32 38 154 73 21 -52 116 90 131 54 48 75 -72 -52 -73 -54 143
-1412 143 17 2 70 137 52 -27 -47 -100 -76 -35 35 13 -73 -45 -89 -34 107 42 -17 3 -12 13 0 30 86 -39 -102 -69 42 -10 19 -82
-1380 -82 149 136 37 38 104 10 -67 -118 24 5 -67 -127 -110 17 -2 -36 20 26 73 -1 -16 27 55 50 5 -78 32 73 58 -45 -112 -13 -16 -80
-1346 -80 85 -39 25 -115 -33 62 17 -6 70 35 -35 -155 12 -121 32 -124 -84 -7 13 95 -72 128 73 22 70 -50 -1 78 39
-1317 39 -15 -38 130 50 129 16 -36 -17 -81 -59 57 46 18 3 -172 -64 55 -29 -41 -53 -136 11 90 7 7 125 94 -97 -11 -64 72
-1286 72 -57 -64 21 13 55 -184 -83 -85 -70 -19 -3 24 -100 91 9 -46 74 80 118 54 58 -26 21 31 -79 -107 -14 -38 -24 -53 55 25 -62
-1253 -62 33 -5 22 74 69 -28 73 -41 178 144 -64 11 -9 -44 92 -6 -30 -4 77 -51 59 -56 -107 -20 57 18 -37 72 75 7 -5
-1222 -5 -42 -42 -44 -70 22 7 -179 67 90 37 42 -3 -28 18 -29 5 52 53 114 -134 -4 -132 -64 21 86 -43 111 152 -96 -113 -1 -116
-1190 -116 -21 80 89 47 -166 -100 55 95 -71 -106 -74 50 -11 -53 23 41 8 4 -94 62 -107 -61 20 76 -34 -102 -25 81 39 75 68
-1159 68 -126 71 67 34 -95 77 -63 -46 79 -74 68 -43 19 111 37 39 106 173 5 23 -45 -52 28 95 -121 49 -14 78 51 42 29
-1128 29 7 84 -26 -41 66 -65 -120 -5 18 28 87 -19 -26 41 -25 -53 6 39 8 -68 8 3 -38 33 68 95 -12 9 73 -13 -24 56 -26
-1095 -26 85 -84 -72 197 1 -89 -64 -57 80 138 12 -108 0 63 36 -26 -74 -6 -48 22 -50 6 3 -19 -20 -19 39 39 97 178 125 84 -6
-1062 -6 6 95 40 2 0 21 -23 83 72 14 -34 -31 -67 -42 105 -26 -29 104 153 62 20 52 109 28 90 -31 -19 33 5 -42 -10 36 -68 41
-1028 41 -12 -76 52 35 41 21 81 85 -23 -50 -13 -27 -79 -29 -172 -71 105 88 -26 67 23 -28 60 -80 -58 51 48 31 -27 68 60 56 -18
-995 -18 -16 -24 -34 113 -81 -93 66 -37 105 -53 -28 23 -33 -73 75 26 77 30 -53 -38 -5 11 -3 8 -91 -9 -50 -62 -32 -9 -71 47
-963 47 -11 16 -32 -209 -144 -187 -175 -2 -44 71 -19 0 168 17 9 9 25 -65 41 -151 2 6 20 25 17 75 93 33 77 7 -6 15 -126
-930 -126 24 41 -78 -62 34 -27 -122 125 133 -11 11 61 -75 -78 23 -32 49 87 42 25 -16 -46 94 11 168 56 -85 -47 -76 -92 0
-899 0 143 22 113 0 -23 -13 -22 24 53 90 0 -14 -12 86 5 -78 130 -24 83 68 106 10 -10 -34 23 2 -93 -123 -77 -19 -21 70 96 -100
-865 -100 41 -51 -55 138 121 -32 33 -38 44 29 -61 72 104 33 -10 0 5 -17 45 -21 -107 -14 18 97 14 -88 -57 -26 -149 15 39 -32
-833 -32 -27 -11 -41 -13 109 232 -17 67 88 -90 -66 -37 -3 -5 90 3 -37 -150 60 29 -25 58 105 -35 1 -30 -167 -52 -217 244 -126
-802 -126 38 -117 -73 43 -54 30 -38 131 -17 -6 91 113 -75 58 87 -34 -10 31 124 104 35 -32 -30 88 148 10 -65 -66 -58 -80 -80 -47
-770 -47 -15 -15 3 14 0 -20 80 -78 -110 -46 17 17 60 -49 -8 -107 -24 -141 -33 21 -53 -14 -78 -31 -58 -140 -110 72 85 -37 58 153 26
-737 26 43 104 -53 -19 22 -40 49 58 -16 33 37 26 158 164 53 79 -8 -9 77 8 -29 55 40 -66 -39 85 95 11 -111 -73 -37 -16 35 -58
-703 -58 -78 0 -165 -69 48 101 77 43 84 47 14 52 89 -79 -138 -27 4 94 26 -116 65 6 -12 51 10 16 48 -104 -17 33 -17 149
-671 149 88 18 13 45 32 60 -18 9 13 -89 -3 -42 -40 28 -8 63 51 103 112 -39 -11 103 57 -5 -59 -146 -15 11 109 -110 -132 94 124 8
-637 8 -34 45 9 -43 -177 1 -3 -84 -6 57 49 -87 78 -38 6 86 28 116 9 -25 -35 -12 -105 -233 -27 6 -34 0 -108 -128 -113 -154
-605 -154 -63 -96 -33 -60 -3 -78 -53 -31 10 58 -75 32 32 -140 -18 -62 -5 99 -55 -53 -55 -1 -120 -120 0 -27 -87 84 -78 69 -63
-574 -63 15 19 -14 2 -33 -102 100 91 -85 -49 -64 -21 -6 29 132 26 -79 20 80 -29 63 79 12 -128 -129 -20 88 76 106 54 -64 -26
-542 -26 -75 -36 -18 -2 -59 62 -31 62 57 -16 -99 106 43 16 24 -21 -21 -32 -16 35 -58 6 4 98 -48 -78 -11 -123 -13 57 -9 -49 -28 80
-508 80 -104 14 -44 66 -108 13 -8 91 -27 -62 100 98 -9 -102 -74 2 94 -5 -63 -155 -29 20 -16 0 -48 10 169 64 56 26 36
-477 36 6 -79 23 14 -78 -9 -102 17 -28 15 96 48 113 -40 21 -44 53 121 174 -54 2 33 25 -3 -42 -57 81 3 -18 5 1 142 63 82
-443 82 -34 83 20 -81 3 -5 117 166 59 25 74 58 5 -83 -87 -72 72 3 -20 -60 -102 -55 102 -36 -158 -11 82 111 104 -124 -95
-412 -95 -29 -39 -14 -23 12 42 -113 -4 33 30 0 135 25 -161 0 -14 -89 49 26 2 -10 3 82 78 -53 18 5 40 120 12 60 29
-380 29 -24 65 -55 -40 -25 31 143 -54 14 -13 -73 -101 -59 -5 -28 35 -88 -100 -51 -65 -64 -91 -64 12 -61 134 2 27 99 -24 -30 -12 21
-347 21 57 -74 101 112 -12 4 2 33 -134 47 -43 -68 33 -187 39 39 14 -134 -150 -31 0 29 -152 -70 105 149 77 101 40 34 -130
-316 -130 -77 -152 -21 85 16 23 -2 71 -33 -107 -98 -77 15 -9 -77 56 66 29 56 -23 -3 2 68 -41 70 -23 59 -76 -25 -218 20 54
-284 54 -24 34 0 -118 -32 39 -11 26 167 23 -3 133 17 -77 -67 108 66 -81 -44 -39 18 -50 -91 20 1 -130 -3 -81 -51 62
-254 62 -64 -48 -7 53 33 -39 0 -23 -7 -54 40 45 108 35 -119 -32 -54 -65 -39 -104 20 19 77 -58 -13 9 4 -4 -23 -127 -1 -63 -123 -63
-220 -63 -48 58 -78 66 -51 -126 96 -18 -3 31 -23 47 56 -85 -39 65 17 10 29 76 63 41 12 -5 18 -77 -41 23 -99 78 31
-189 31 -163 57 28 -123 -45 5 -32 91 96 39 19 -128 -75 1 39 89 77 -32 25 71 -1 32 -45 31 20 15 62 68 -63 -3 58 32 -44
-156 -44 -5 83 -4
-153d
##PAGE=	F1=13425.014754101346625
##FIRST=	31355.342622953838145,	6319.7438965998480853,	-0.013776499778032302856
##DATATABLE=	(F2++(Y..Y)), PROFILE
-2200 -67 -154 -101 -124 37 37 17 41 -80 -9 -40 -4 -72 -23 -54 0 -18 20 0 -15 30 46 -3 50 68 29 156 -124 -61 100 31 -15 137
-2168 137 14 1 99 -69 -123 -26 -21 29 23 -37 57 26 -38 -19 1 -137 -78 65 -39 -31 -57 -56 36 46 -18 -34 64 -7 19 -19 2 -65 11 -50
-2134 -50 99 47 38 -119 -84 -34 94 -81 -87 -85 23 -55 -12 -16 -49 -51 31 5 -34 -59 -89 -135 -151 -105 -102 -18 118 40 -2 -8 33 -14 -49 168 -17
-2099 -17 -151 -159 62 -106 -174 67 10 -123 -51 -5 51 -82 -83 -21 -127 -28 -51 61 -21 13 349 1285 817 1440 744 206 2 -1 41
-2070 41 -70 75 23 -4 5 -47 111 34 -15 50 186 -19 -6 -2 -33 96 -29 -44 -16 231 -25 -121 7 44 107 57 60 133 65 153 178
-2039 178 121 134 -9 30 -141 -137 100 122 32 547 400 -36 496 296 85 35 -61 -29 -118 -90 68 48 68 54 116 71 15 43 123 150
-2009 150 147 37 -75 -107 -35 57 11 68 62 169 130 90 159 8 -59 19 56 115 -13 8 -6 15 -16 -116 -81 -124 71 -25 183 110 0
-1978 0 -2 -94 1 -119 -18 -78 -157 -20 -17 12 -245 -73 -69 23 -22 41 -35 -79 -26 9 15 105 -61 -67 -73 -200 113 -62 -163 178 65 18
-1946 18 14 -156 -25 18 185 -83 57 -12 44 -80 47 61 -18 -13 217 93 -8 -141 -70 95 -26 40 -14 -83 -49 -33 -100 -120 -30
-1917 -30 64 -29 -66 -28 -66 -100 21 24 -133 -97 -73 -68 -8 -43 72 27 34 -97 -73 39 125 -10 -15 28 -69 -126 6 -52 -58 37 66 53 -97
-1884 -97 -60 75 146 -25 118 -10 -96 -46 -125 10 -83 -130 73 58 24 56 4 33 -47 28 101 23 3 66 6 0 -123 -3 -14 -21 52 45
-1852 45 -31 -88 -25 87 -110 -64 5 56 50 106 27 0 6 62 45 16 34 70 -6 70 -35 -89 -33 35 120 -22 -170 41 -4 -55 36 9 -84
-1819 -84 -59 -3 110 59 66 11 42 79 57 31 6 -32 61 87 47 73 -51 -21 67 102 -32 58 128 -29 39 19 75 -85 -74 -33 62 18 5
-1786 5 -79 33 6 13 -6 -193 36 -2 16 -11 -91 18 104 -7 -82 -104 -17 -26 -110 -39 3 -27 -14 6 -93 -29 -66 -16 -88 14 7 14 1 -6 -30
-1751 -30 114 29 -51 -4 -101 -72 24 49 -13 18 -51 64 41 142 40 17 -41 -70 7 106 -93 -78 -27 -105 -84 78 -63 -127 115 -28
-1721 -28 80 -1 -39 -61 -17 117 56 -59 73 13 -94 -88 -47 -78 -35 -27 2 -101 -42 0 49 -39 -105 54 68 4 -77 -83 13 -99 11 48
-1689 48 -10 -2 -39 -55 -44 -29 -78 110 175 75 26 -50 8 74 37 87 -51 -60 10 -109 -158 125 -28 -164 -10 74 116 24 -57 -117 32
-1658 32 -19 -59 -11 -88 74 56 86 -95 133 56 -66 -86 21 138 65 -38 -46 -110 -34 16 -85 29 -44 8 29 62 37 -84 -71 -61
-1628 -61 121 83 -33 19 114 47 88 74 26 -200 -54 -17 -65 -5 18 -69 -91 -4 9 21 -41 54 -23 -116 -104 -71 -37 66 44 16 59 17
-1596 17 -16 9 -32 9 -91 -9 3 -42 -78 -14 -62 -43 52 -55 116 -94 -37 -28 -18 -36 7 58 -2 -21 118 103 102 -69 -14 -151 -57 -6
-1564 -6 24 -76 -30 21 67 -15 -77 -50 -139 -50 91 128 8 39 38 -107 83 115 -48 -10 34 28 47 -27 -132 -40 179 -33 34 -51 -104 70
-1532 70 6 -127 15 41 20 -130 -63 -21 18 -84 118 -57 -154 5 46 56 84 141 27 -70 86 27 32 24 20 -24 56 62 20 -98 50
-1501 50 -42 29 15 -27 77 -50 20 57 -11 110 -23 -31 28 56 108 35 32 -39 -91 -80 -33 54 -24 29 -12 -40 -5 -65 41 24 -43 -41 33 -59
-1467 -59 -7 57 101 -79 -67 -6 164 -69 -21 -2 -105 38 84 32 20 19 -29 37 -36 -18 -56 40 -57 0 -69 91 67 -41 -148 23 44
-1436 44 -215 -24 -109 -14 -14 98 -17 21 38 168 79 18 -81 80 96 132 42 43 94 -44 -41 -65 -28 144 20 -11 88 148 50 -9 -31 -111
-1404 -111 -82 -20 73 23 -52 -45 -90 -45 92 25 -28 -30 -23 -3 0 31 86 -22 -97 -78 28 -8 19 -69 160 152 18 44 94 17 -83 -109 33
-1371 33 10 -50 -116 -90 29 10 -50 18 6 73 16 10 61 71 53 -18 -64 14 66 68 -25 -101 -1 -28 -91 87 -19 29 -103 -25 57 25 -10
-1338 -10 70 37 -34 -154 -12 -119 26 -140 -86 -25 -6 98 -71 115 85 29 74 -26 -2 75 33 -12 -42 137 59 129 -11 -21 -33
-1309 -33 -66 -44 65 49 2 -11 -163 -74 46 -21 -27 -56 -149 -3 85 50 39 143 122 -107 -15 -69 48 -58 -53 11 37 58 -175 -91 -89 -82
-1277 -82 -3 -7 41 -85 85 8 -83 59 86 120 86 84 -16 30 27 -83 -76 0 -61 -40 -59 64 14 -29 6 -7 13 83 48 -20 70 -38 147
-1244 147 133 -87 43 8 -43 80 10 -24 -11 63 -88 67 -63 -116 -28 30 5 -51 79 49 1 -13 -43 -49 -83 -90 33 26 -182 76 92
-1213 92 33 38 -2 -16 33 -32 -5 34 66 100 -120 4 -139 -69 5 97 -49 100 152 -109 -104 -2 -88 -20 71 103 32 -168 -74 52 90
-1182 90 -69 -85 -68 13 -19 -74 12 65 25 27 -97 66 -99 -53 44 88 -39 -103 -34 76 53 49 65 -130 63 58 40 -68 85 -52 -54
-1151 -54 93 -83 69 -19 18 91 27 43 84 177 39 9 -39 -33 57 95 -124 55 10 88 52 68 20 -8 53 -34 -26 56 -43 -121 -6 38
-1119 38 17 87 -35 -40 28 -15 -70 -6 26 -1 -49 23 8 -22 25 45 74 -34 -13 62 -23 -27 60 -30 75 -84 -66 188 -12 -91 -78 -61 71
-1086 71 132 -9 -118 14 54 23 -54 -78 3 -29 28 -91 -24 49 -24 -20 -34 43 40 98 149 115 63 1 19 95 36 -24 -22 29 -31 88 90 15
-1052 15 -49 -32 -52 -47 113 -26 -25 105 129 51 18 72 146 54 90 -20 -30 35 -5 -48 -30 40 -61 76 -9 -81 48 44 41 42 92 92 -34 -55
-1018 -55 -19 -46 -95 -43 -174 -86 100 102 -16 65 0 -41 47 -108 -79 39 54 65 -12 68 41 58 -19 -35 -26 -33 108 -73 -126 65 -23 100
-986 100 -61 -17 21 -34 -60 69 21 59 33 -55 -61 -2 6 2 21 -62 30 -48 -82 -38 -17 -53 57 18 8 -21 -179 -132 -196 -175 -9 -53 58
-953 58 -33 1 162 33 36 24 44 -27 64 -163 11 0 24 16 15 80 98 19 81 8 -5 14 -138 14 48 -51 -74 36 12 -119 98 116
-921 116 -11 -1 57 -47 -71 26 -23 49 111 58 49 -19 -30 109 11 163 77 -81 -53 -77 -121 16 135 16 115 21 -17 -20 -1 44 57 92
-889 92 -23 -29 -23 74 -13 -70 113 -25 81 68 97 21 4 -32 34 5 -80 -115 -69 -26 -31 33 77 -128 70 -74 -81 123 92 -46 32 -39 31
-856 31 42 -35 66 95 43 -11 -8 14 -8 58 -21 -116 -2 2 82 35 -57 -66 -26 -139 9 53 -45 -43 -16 -82 -22 69 216 -26 69 90 -86 -63
-822 -63 -44 -2 -6 72 5 -25 -154 36 44 -17 75 101 -43 3 -48 -191 -49 -186 231 -148 17 -135 -79 38 -34 40 -42 127 -23 -3
-792 -3 55 97 -62 78 111 -38 1 17 132 95 35 -39 -72 92 166 14 -65 -85 -66 -94 -77 -45 -10 0 5 -24 12 -22 89 -69 -102 -23
-760 -23 37 2 57 -9 1 -99 -53 -178 -48 5 -64 -29 -73 -35 -70 -141 -127 60 73 -47 44 151 44 45 87 -21 -9 43 -46 63 66 -2
-728 -2 58 38 18 134 158 54 50 -8 -23 69 -9 -58 41 47 -63 -28 93 96 33 -100 -73 -52 -62 40 -74 -58 30 -136 -75 77 121 72 32
-695 32 59 38 11 62 93 -49 -132 -24 15 90 43 -90 60 -2 -16 44 15 41 45 -108 -50 54 -8 159 93 7 2 25 23 86 9 -1 5 -59
-661 -59 -5 -33 -21 12 10 67 46 96 120 1 2 93 31 -22 -57 -131 -29 8 105 -100 -148 118 126 28 -12 41 13 -57 -164 -32 -7 -77 1 48
-627 48 55 -107 64 -58 6 121 51 130 -3 -29 -43 -28 -96 -189 -18 -6 -29 4 -106 -130 -99 -157 -36 -69 -25 -83 4 -75 -74 -25 -2 29
-595 29 -53 45 18 -153 0 -55 -9 104 -59 -54 -36 26 -114 -125 25 -19 -102 110 -64 84 -62 11 15 -21 8 -43 -101 109 95 -88
-565 -88 -47 -58 -14 6 20 129 22 -73 16 66 -39 60 77 6 -119 -141 -41 79 90 115 56 -53 -32 -56 -20 -15 5 -64 50 -39 76
-534 76 77 -6 -84 115 65 21 22 -37 -11 -46 -10 59 -60 -12 16 87 -72 -97 -17 -113 -14 51 11 -22 -39 69 -122 -23 -43 58 -117 33
-502 33 7 97 -16 -76 106 122 -2 -104 -74 6 114 -1 -48 -132 -25 -23 -34 -7 -29 23 149 80 56 34 68 -22 -93 37 17 -76 -14
-471 -14 -108 8 -15 41 88 55 113 -34 17 -46 64 129 184 -29 1 30 13 -4 -52 -65 55 8 -26 9 26 159 69 57 -45 65 23
-440 23 -109 21 -8 94 155 46 36 61 61 -1 -92 -90 -74 74 26 5 -64 -103 -67 113 -28 -171 -23 93 128 100 -131 -102 -16 -31 -25
-409 -25 -17 15 30 -114 -5 29 28 28 133 7 -177 -18 -6 -53 50 37 -4 -45 -26 86 84 -36 25 20 57 133 16 30 22 -20 62 -38 -41
-376 -41 -25 15 91 -64 14 7 -64 -65 -47 -8 -15 6 -97 -79 -22 -72 -64 -82 -59 20 -56 113 -9 -3 89 -4 -12 -22 10 71 -58 108 89 -13 -2
-341 -2 -7 17 -142 35 -60 -62 55 -185 69 82 3 -140 -136 -26 12 40 -155 -60 116 147 58 91 49 48 -137 -93 -149 -53 67 43 38 6 61
-308 61 -53 -110 -83 -39 56 -18 -77 54 65 29 52 -5 -7 -30 32 -42 51 -13 74 -82 -29 -209 8 65 -30 48 2 -134 -37 42 -13 42 155
-275 155 24 19 130 8 -61 -76 146 66 -58 -28 -33 -25 -56 -75 35 -6 -118 -2 -97 -50 61 -59 -51 -10 56 50 -35 14 -46 -45 -52 49 53
-242 53 119 53 -127 -35 -62 -79 -47 -100 29 24 85 -56 -1 19 0 -6 -9 -127 -20 -83 -123 -53 -31 80 -55 45 -70 -104 77 -9 9 49
-210 49 -35 61 67 -80 -37 45 22 -2 9 71 61 37 21 2 5 -71 -33 41 -83 92 27 -166 63 27 -129 -50 -16 -54 73 56 14 0 -114
-177 -114 -78 -9 27 73 84 -35 20 58 -29 25 -41 27 -6 11 64 66 -70 -14 53 19 -52 -3 92 -11
-153a1
##PAGE=	F1=13360.977868855443376
##FIRST=	31355.342622953838145,	6319.7438965998480853,	-0.030248716473579406738
##DATATABLE=	(F2++(Y..Y)), PROFILE
-2200 -60 -159 -96 -113 33 32 44 32 -86 -13 -50 2 -64 -43 -57 -3 -20 30 6 -26 47 29 -9 23 29 32 163 -127 -55 100 34 -22 135 17
-2167 17 -3 101 -82 -145 -9 -30 8 5 -49 51 8 -41 -22 -11 -117 -91 58 -22 -25 -46 -46 30 33 -34 -28 74 -21 5 -46 -14 -49 12 -51 109
-2133 109 50 49 -108 -91 -17 108 -100 -91 -88 26 -45 -3 -14 -39 -84 36 -18 -63 -62 -51 -112 -130 -102 -78 -8 101 29 13 3 25 1 -37 164
-2100 164 -18 -144 -166 81 -105 -181 88 -7 -130 -44 1 28 -80 -79 11 -104 -13 -58 79 1 24 372 980 108 1130 729 184
-2073 184 14 -24 21 -61 88 18 -25 5 -48 122 42 11 58 186 -34 -4 -26 -43 100 -11 -25 -23 211 -29 -108 16 50 120 58 76
-2043 76 140 71 131 139 109 136 3 0 -158 -109 125 97 10 587 443 -67 493 319 99 14 -84 -47 -101 -95 84 57 68 60 133 62 10 19
-2011 19 122 120 112 7 -73 -96 -33 39 9 60 79 147 128 81 156 4 -56 29 55 115 1 8 2 31 -24 -109 -97 -104 120 5 182 79 -18
-1978 -18 4 -96 -4 -108 -12 -60 -164 -11 4 21 -231 -72 -59 -7 -33 44 -44 -63 -11 25 38 113 -75 -108 -146 -305 23 -173 -264 97
-1948 97 38 6 36 -150 -33 32 178 -89 52 -1 41 -80 40 66 -15 -29 203 96 6 -159 -67 127 -26 25 -28 -80 -49 -34 -123
-1919 -123 -135 -33 68 -29 -74 -42 -52 -99 -17 14 -168 -93 -77 -105 -24 -58 79 10 35 -99 -58 18 103 9 1 21 -63 -121 -8 -57 -33 39
-1887 39 48 45 -86 -40 81 139 -2 113 -2 -91 -14 -166 3 -101 -134 63 39 21 75 -18 29 -23 18 103 22 -3 48 6 3 -127 7
-1856 7 -1 -47 72 39 -60 -112 -25 95 -106 -81 -20 62 52 100 48 28 25 67 47 4 36 58 4 85 -31 -104 -35 14 86 -34 -188 14 5
-1823 5 -78 22 -6 -83 -44 -13 109 77 37 22 46 61 27 18 7 -71 50 100 35 75 -29 -27 90 119 -31 29 110 -53 67 55 88 -86
-1791 -86 -60 -37 57 20 -26 -75 30 1 31 -3 -188 31 12 16 17 -82 14 111 21 -85 -119 -30 -21 -98 -14 31 -15 10 17 -89 -41 -63 -8 -88
-1757 -88 17 14 22 11 2 -6 121 38 -42 -6 -65 -56 23 45 -46 12 -61 61 15 118 32 26 -43 -57 27 108 -102 -87 -39 -97 -85 61 -57 -155
-1723 -155 101 -32 79 19 -48 -64 -46 109 56 -59 86 15 -88 -95 -52 -91 -78 -12 6 -94 -54 12 37 -33 -129 55 80 -2 -68 -89
-1693 -89 9 -90 13 57 -13 -7 -44 -67 -37 -29 -58 117 150 38 15 -35 24 80 38 71 -58 -59 4 -98 -163 107 -40 -174 -5 87 91 25
-1661 25 -50 -107 39 -13 -64 -23 -87 79 48 83 -94 125 30 -61 -55 28 131 73 -18 -56 -114 -44 7 -78 31 -65 0 25 45 37 -98 -97 -56
-1628 -56 128 72 -41 36 119 33 84 61 39 -186 -28 -36 -65 -19 -1 -74 -76 12 -11 12 -47 38 -35 -79 -88 -91 -56 69 35 10 40 5 26 11
-1594 11 -32 0 -99 -21 6 -47 -73 -7 -59 -20 54 -58 95 -87 -39 -9 -28 -18 27 37 7 -27 117 85 96 -73 -53 -171 -74 0 26 -89
-1562 -89 -1 18 85 -9 -73 -65 -153 -57 121 125 12 31 59 -84 115 93 -47 -37 0 25 61 -21 -141 -48 185 -36 31 -79 -96 62 -8
-1531 -8 -121 23 40 27 -140 -73 -10 32 -95 120 -66 -172 -17 39 52 73 135 -11 -58 73 -4 39 34 34 -44 54 61 16 -109 49 -51
-1500 -51 37 7 -1 79 -21 14 51 11 114 -44 -38 26 36 66 56 39 -31 -109 -88 -18 62 -28 30 -3 -26 11 -47 22 32 -29 -26 24 -51 -7 52
-1465 52 107 -102 -70 -2 168 -58 -11 -6 -125 54 72 27 5 25 -19 34 -42 -17 -54 37 -53 16 -41 93 59 -33 -145 20 68 -214 -5
-1434 -5 -94 -30 -71 87 -12 2 29 175 87 19 -104 43 100 121 21 35 107 -19 -27 -50 -3 134 27 -16 98 155 49 14 -8 -121
-1404 -121 -87 -4 101 27 -32 -48 -84 -51 74 9 -40 -62 -27 -14 0 30 90 -3 -86 -84 16 -8 20 -52 156 157 6 49 70 18 -97 -100 34
-1371 34 15 -36 -94 -68 41 29 -60 9 -16 66 32 38 93 82 63 -37 -49 1 61 78 -1 -90 11 -36 -100 86 1 30 -92 -22 47 32 -18
-1338 -18 64 43 -29 -146 -31 -111 18 -138 -79 -41 -32 87 -67 105 101 31 72 -4 2 72 29 -5 -47 138 70 125 -31 -1 -52 -47 -20 76
-1306 76 47 -13 -26 -148 -79 32 -12 -5 -59 -149 -21 79 85 72 150 146 -108 -17 -73 21 -48 -41 6 59 60 -156 -97 -88 -91 16 -11 51 -69 76
-1272 76 9 -118 37 84 114 109 96 -9 30 17 -80 -37 4 -87 -58 -58 68 0 1 -23 -17 0 88 31 -15 60 -30 117 117 -101 76 24 -39 61
-1238 61 20 -15 -13 43 -120 68 -69 -115 -36 -1 -4 -59 88 24 -2 -18 -35 -51 -120 -109 30 39 -179 83 93 30 33 1 -11 40 -33 -13 17
-1205 17 69 79 -102 13 -146 -80 -11 93 -53 85 145 -116 -78 0 -56 -14 67 115 19 -163 -50 52 79 -66 -63 -62 -25 -22 -97 0 81
-1174 81 40 48 -95 70 -89 -46 74 99 -44 -100 -40 64 65 29 61 -123 52 47 42 -41 90 -43 -55 107 -90 61 8 21 68 8
-1144 8 47 51 179 75 3 -36 -13 85 90 -124 57 36 99 49 86 1 -26 16 -46 -12 42 -11 -115 -10 59 0 75 -54 -48 22 -5 -82 -13
-1111 -13 14 -3 -21 36 5 -7 21 21 49 -55 -32 47 -34 -29 57 -30 70 -83 -60 166 -25 -88 -91 -70 57 114 -35 -125 26 42 15 -71
-1079 -71 -73 9 -10 31 -123 -50 87 -23 -22 -49 41 35 98 116 104 38 7 30 85 30 -50 -34 36 -35 89 109 17 -54 -24 -36 -47 118 -14
-1046 -14 -17 99 90 32 20 87 173 75 84 -9 -36 34 -18 -50 -43 36 -54 103 -6 -76 44 57 43 63 98 98 -39 -60 -26 -57 -109 -55 -167 -89
-1012 -89 96 112 -10 57 -29 -55 30 -136 -95 30 55 92 -1 58 20 58 -11 -50 -22 -23 100 -60 -150 69 -7 86 -67 -11 19 -31 -50
-981 -50 57 14 31 34 -53 -80 0 -2 9 41 -31 69 -42 -97 -43 -31 -31 66 45 0 -15 -130 -105 -196 -167 -23 -66 44 -46 3 145 42 56
-948 56 34 63 12 88 -153 22 -13 26 0 12 82 95 2 82 16 0 10 -151 0 57 -20 -83 44 46 -105 72 103 -11 -14 48 -11 -57
-916 -57 26 -17 49 128 66 70 -20 -11 114 6 148 92 -66 -56 -73 -147 29 123 19 119 42 -6 -33 15 56 58 97 -43 -45 -33 58 -29 -58
-883 -58 89 -25 77 64 82 34 26 -33 39 6 -62 -104 -55 -25 -38 -1 54 -156 92 -90 -103 92 55 -57 25 -35 17 49 -6 60 85 54
-851 54 -10 -15 25 3 62 -23 -119 8 -12 57 51 -20 -64 -26 -128 0 72 -64 -59 -18 -114 -32 30 191 -32 71 97 -82 -57 -48 0 -9 47 4
-817 4 -12 -147 7 62 -5 92 98 -44 0 -71 -217 -53 -153 206 -164 -5 -146 -78 44 -9 39 -38 123 -34 -10 23 80 -45 84
-788 84 134 -45 12 4 122 79 34 -49 -114 88 174 12 -59 -99 -71 -101 -71 -43 -3 5 14 -60 14 -21 94 -56 -93 2 49 -16 46 29 9 -91
-754 -91 -75 -201 -53 -4 -73 -39 -65 -35 -76 -134 -141 43 52 -52 22 144 64 49 61 11 1 63 -46 79 69 11 77 38 13 109 144 51 27
-721 27 -6 -31 58 -28 -89 23 49 -60 -21 95 106 59 -81 -67 -60 -101 44 -87 -35 62 -97 -73 101 138 61 23 33 32 9 71 96 -15
-689 -15 -121 -14 25 79 52 -56 48 -9 -23 33 20 60 37 -111 -79 78 4 162 89 -7 -5 12 17 100 30 -9 1 -29 -7 -16 5 -4 26 66
-655 66 46 81 123 39 15 78 2 -38 -52 -111 -36 6 100 -83 -152 129 119 44 11 29 17 -71 -144 -69 -10 -62 6 38 62 -119 54 -68 6
-622 6 143 68 135 -14 -34 -52 -44 -85 -140 -8 -20 -28 5 -99 -129 -85 -149 -8 -44 -21 -103 14 -66 -86 -16 -8 4 -28 62 7 -156 20 -46
$$ [...]
-153C5
##ENDNTUPLES=	NDNMRSPECTRUM
##END=	
