##TITLE=	9kH9TqS7RySWguLyeDhB9w/9322s
##JCAMPDX=	6.0	$$ NMR Plug-in 1.13 of MestReNova 11.0.4-18998
##DATATYPE=	NMRSPECTRUM
##DATACLASS=	XYDATA
##NUMDIM=	1
##ORIGIN=	Bruker BioSpin GmbH
##OWNER=	andrew
##.OBSERVEFREQUENCY=	600.30184456100005264
##.OBSERVENUCLEUS=	^1H
##.SOLVENTNAME=	CD2Cl2
##.PULSESEQUENCE=	zg
##LONGDATE=	2015/06/05 12:20:22.000
##.ACQUISITIONMODE=	SIMULTANEOUS (DQD)
##$ORIGINALFORMAT=	Bruker XWIN-NMR
##$PARAMETERFILE=	(acqus, ASCII, /var/folders/f6/rjf_tdyn2v98c5c0wvkgn4s80000gn/T/9kH9TqS7RySWguLyeDhB9w/9322s/acqus, 0)
$$ ##TITLE= Parameter file, TOPSPIN		Version 2.1
$$ ##JCAMPDX= 5.0
$$ ##DATATYPE= Parameter Values
$$ ##NPOINTS= 10	$$ modification sequence number
$$ ##ORIGIN= Bruker BioSpin GmbH
$$ ##OWNER= andrew
$$ $$ 2015-06-05 17:20:22.466 +0600  andrew@av-600
$$ $$ /opt/data/andrew/nmr/limog-1782/621/acqus
$$ $$ process /opt/ts21pl6/prog/mod/shimcntl
$$ ##$ACQT0= -9.54927425515661
$$ ##$AMP= (0..31)
$$ 100 100 100 100 100 100 100 100 100 100 100 100 100 100 100 100 100 100
$$ 100 100 100 100 100 100 100 100 100 100 100 100 100 100
$$ ##$ANAVPT= -1
$$ ##$AQSEQ= 0
$$ ##$AQ_mod= 3
$$ ##$AUNM= <au_zg>
$$ ##$AUTOPOS= <>
$$ ##$BF1= 600.3
$$ ##$BF2= 600.3
$$ ##$BF3= 600.3
$$ ##$BF4= 600.3
$$ ##$BF5= 600.3
$$ ##$BF6= 600.3
$$ ##$BF7= 600.3
$$ ##$BF8= 600.3
$$ ##$BYTORDA= 0
$$ ##$CFDGTYP= 0
$$ ##$CFRGTYP= 9
$$ ##$CHEMSTR= <none>
$$ ##$CNST= (0..63)
$$ 1 1 145 1 1 1 1 1 1 1 1 1 1 1 1 1 1 1 1 1 1 1 1 1 1 1 1 1 1 1 1 1 1 1 1
$$ 1 1 1 1 1 1 1 1 1 1 1 1 1 1 1 1 1 1 1 1 1 1 1 1 1 1 1 1 1
$$ ##$CPDPRG= <>
$$ ##$CPDPRG1= <>
$$ ##$CPDPRG2= <waltz16>
$$ ##$CPDPRG3= <>
$$ ##$CPDPRG4= <mlev>
$$ ##$CPDPRG5= <mlev>
$$ ##$CPDPRG6= <mlev>
$$ ##$CPDPRG7= <mlev>
$$ ##$CPDPRG8= <mlev>
$$ ##$CPDPRGB= <>
$$ ##$CPDPRGT= <>
$$ ##$D= (0..63)
$$ 0 1 0 0 0 0 0 0 0 0.06 0 0.03 0 0 0 0 1e-04 0 0 0 0 0 0 0 0 0 0 0 0 0 0
$$ 0 0 0 0 0 0 0 0 0 0 0 0 0 0 0 0 0 0 0 0 0 0 0 0 0 0 0 0 0 0 0 0 0
$$ ##$DATE= 1433503222
$$ ##$DBL= (0..7)
$$ 120 120 120 120 120 120 120 120
$$ ##$DBP= (0..7)
$$ 150 150 150 150 150 150 150 150
$$ ##$DBP07= 0
$$ ##$DBPNAM0= <>
$$ ##$DBPNAM1= <>
$$ ##$DBPNAM2= <>
$$ ##$DBPNAM3= <>
$$ ##$DBPNAM4= <>
$$ ##$DBPNAM5= <>
$$ ##$DBPNAM6= <>
$$ ##$DBPNAM7= <>
$$ ##$DBPOAL= (0..7)
$$ 0.5 0.5 0.5 0.5 0.5 0.5 0.5 0.5
$$ ##$DBPOFFS= (0..7)
$$ 0 0 0 0 0 0 0 0
$$ ##$DE= 6.5
$$ ##$DECBNUC= <off>
$$ ##$DECIM= 2218.66666666667
$$ ##$DECNUC= <off>
$$ ##$DECSTAT= 4
$$ ##$DIGMOD= 1
$$ ##$DIGTYP= 12
$$ ##$DL= (0..7)
$$ 0 120 120 120 120 120 120 120
$$ ##$DP= (0..7)
$$ 150 150 150 150 150 150 150 150
$$ ##$DP07= 0
$$ ##$DPNAME0= <>
$$ ##$DPNAME1= <>
$$ ##$DPNAME2= <>
$$ ##$DPNAME3= <>
$$ ##$DPNAME4= <>
$$ ##$DPNAME5= <>
$$ ##$DPNAME6= <>
$$ ##$DPNAME7= <>
$$ ##$DPOAL= (0..7)
$$ 0.5 0.5 0.5 0.5 0.5 0.5 0.5 0.5
$$ ##$DPOFFS= (0..7)
$$ 0 0 0 0 0 0 0 0
$$ ##$DQDMODE= 0
$$ ##$DR= 22
$$ ##$DS= 0
$$ ##$DSLIST= <SSSSSSSSSSSSSSS>
$$ ##$DSPFIRM= 0
$$ ##$DSPFVS= 20
$$ ##$DTYPA= 0
$$ ##$EXP= <>
$$ ##$F1LIST= <111111111111111>
$$ ##$F2LIST= <222222222222222>
$$ [...]
$$ -1 -1 -1 -1 -1 -1 -1 -1 -1 -1 -1 -1 -1 -1 -1 -1 -1 -1 -1 -1 -1 -1 -1 -1
$$ -1 -1 -1 -1 -1 -1 -1 -1 -1 -1 -1 -1 -1 -1 -1 -1 -1 -1 -1 -1 -1 -1 -1 -1
$$ -1 -1 -1 -1 -1 -1 -1 -1 -1 -1 -1 -1 -1 -1 -1 -1 -1 -1 -1 -1 -1 -1 -1 -1
$$ -1 -1 -1 -1 -1 -1 -1 -1 -1 -1 -1 -1 -1 -1 -1 -1 -1 -1 -1 -1 -1 -1 -1 -1
$$ -1 -1 -1 -1 -1 -1 -1 -1 -1 -1 -1 -1 -1 -1 -1 -1
$$ ##$RG_tab8= (0..255)
$$ -1 -1 -1 -1 -1 -1 -1 -1 -1 -1 -1 -1 -1 -1 -1 -1 -1 -1 -1 -1 -1 -1 -1 -1
$$ -1 -1 -1 -1 -1 -1 -1 -1 -1 -1 -1 -1 -1 -1 -1 -1 -1 -1 -1 -1 -1 -1 -1 -1
$$ -1 -1 -1 -1 -1 -1 -1 -1 -1 -1 -1 -1 -1 -1 -1 -1 -1 -1 -1 -1 -1 -1 -1 -1
$$ -1 -1 -1 -1 -1 -1 -1 -1 -1 -1 -1 -1 -1 -1 -1 -1 -1 -1 -1 -1 -1 -1 -1 -1
$$ -1 -1 -1 -1 -1 -1 -1 -1 -1 -1 -1 -1 -1 -1 -1 -1 -1 -1 -1 -1 -1 -1 -1 -1
$$ -1 -1 -1 -1 -1 -1 -1 -1 -1 -1 -1 -1 -1 -1 -1 -1 -1 -1 -1 -1 -1 -1 -1 -1
$$ -1 -1 -1 -1 -1 -1 -1 -1 -1 -1 -1 -1 -1 -1 -1 -1 -1 -1 -1 -1 -1 -1 -1 -1
$$ -1 -1 -1 -1 -1 -1 -1 -1 -1 -1 -1 -1 -1 -1 -1 -1 -1 -1 -1 -1 -1 -1 -1 -1
$$ -1 -1 -1 -1 -1 -1 -1 -1 -1 -1 -1 -1 -1 -1 -1 -1 -1 -1 -1 -1 -1 -1 -1 -1
$$ -1 -1 -1 -1 -1 -1 -1 -1 -1 -1 -1 -1 -1 -1 -1 -1 -1 -1 -1 -1 -1 -1 -1 -1
$$ -1 -1 -1 -1 -1 -1 -1 -1 -1 -1 -1 -1 -1 -1 -1 -1
$$ ##$RG_tabA= (0..255)
$$ 0.25 0.28 0.32 0.35 0.4 0.44 0.5 0.56 0.64 0.7 0.8 0.89 1 1.12 1.28 1.4
$$ 1.6 1.78 2 2.25 2.56 2.8 3.2 3.56 4 4.5 5 5.6 6.35 7.12 8 9 10 11.3 12.7
$$ 14.2 16 18 20.2 22.6 25.4 28.5 32 36 40.3 45.2 50.8 57 64 71.8 80.6 90.5
$$ 101 114 128 144 161 181 203 -1 -1 -1 -1 -1 -1 -1 -1 -1 -1 -1 -1 -1 -1 -1
$$ -1 -1 -1 -1 -1 -1 -1 -1 -1 -1 -1 -1 -1 -1 -1 -1 -1 -1 -1 -1 -1 -1 -1 -1
$$ -1 -1 -1 -1 -1 -1 -1 -1 -1 -1 -1 -1 -1 -1 -1 -1 -1 -1 -1 -1 -1 -1 -1 -1
$$ -1 -1 -1 -1 -1 -1 -1 -1 -1 -1 -1 -1 -1 -1 -1 -1 -1 -1 -1 -1 -1 -1 -1 -1
$$ -1 -1 -1 -1 -1 -1 -1 -1 -1 -1 -1 -1 -1 -1 -1 -1 -1 -1 -1 -1 -1 -1 -1 -1
$$ -1 -1 -1 -1 -1 -1 -1 -1 -1 -1 -1 -1 -1 -1 -1 -1 -1 -1 -1 -1 -1 -1 -1 -1
$$ -1 -1 -1 -1 -1 -1 -1 -1 -1 -1 -1 -1 -1 -1 -1 -1 -1 -1 -1 -1 -1 -1 -1 -1
$$ -1 -1 -1 -1 -1 -1 -1 -1 -1 -1 -1 -1 -1 -1 -1 -1 -1 -1 -1 -1 -1 -1 -1 -1
$$ -1 -1 -1 -1 -1 -1 -1 -1 -1 -1 -1 -1 -1 -1
$$ ##$ROUT14= (0..7)
$$ 0 0 0 0 0 0 0 0
$$ ##$ROUTER= -1
$$ ##$RX22TY= <no>
$$ ##$RXFMAX= (0..7)
$$ 647.5 -1 -1 -1 -1 -1 -1 -1
$$ ##$RXFMIN= (0..7)
$$ 5 -1 -1 -1 -1 -1 -1 -1
$$ ##$RXINTLV= (0..7)
$$ 1 0 0 0 0 0 0 0
$$ ##$RXMSTY= <no>
$$ ##$SCMTY= <no>
$$ ##$SGUC1= (0..15)
$$ 17 18 34 0 0 0 0 0 0 0 0 0 0 0 0 0
$$ ##$SGUC2= (0..15)
$$ 33 256 20 0 0 0 0 0 0 0 0 0 0 0 0 0
$$ ##$SPECTR= 10
$$ ##$SY2FLAG= 0
$$ ##$TFXNUM= 0
$$ ##$TRIPLO2= 0
$$ ##$VTUTY= <tty05>
$$ ##$WBREFAM= (0..15)
$$ 100 100 100 100 100 100 100 100 100 100 100 100 100 100 100 100
$$ ##$WBREFPH= (0..15)
$$ 0 0 0 0 0 0 0 0 0 0 0 0 0 0 0 0
$$ ##$XFAC= 2
$$ ##END=
$$ 
##$DECIM=	2218.66666666667
##$DSPFVS=	20
##XUNITS=	HZ
##YUNITS=	ARBITRARY UNITS
##FIRSTX=	6322.8525384689401108
##LASTX=	-2691.4329892738592207
##XFACTOR=	-0.1375491802509010153
##YFACTOR=	6.2995927734375007146e-06
##NPOINTS=	65536
##XYDATA=	(X++(Y..Y))
$$ [...]
-15183 -89358 -92582 -95801 -96163 -96521 -98075 -99625 -101179 -102729 -101317 -99901 -98488 -97072 -95242 -93409 -94441 -95470 -92626
-15166 -92626 -89779 -86936 -84089 -85657 -87223 -85930 -84633 -83831 -83026 -82225 -81420 -80023 -78622 -80086 -81547 -82028 -82505 -82986
-15148 -82986 -83463 -84122 -84778 -85438 -86094 -85516 -84935 -84357 -83776 -84390 -85002 -85617 -86228 -86015 -85799 -85587 -85371 -85695 -86015 -89202 -92384
-15127 -92384 -93245 -94102 -94963 -95820 -93044 -90264 -90349 -90431 -90100 -89768 -92298 -100553 -106065 -102036 -97054 -92071 -89235 -86399 -90241
-15108 -90241 -94083 -90055 -86026 -86768 -87510 -87543 -87577 -90472 -93368 -89585 -85803 -86790 -87778 -86082 -84387 -89369 -94352 -94862 -95373
-15089 -95373 -93021 -90670 -93439 -96208 -98977 -101745 -99625 -97505 -95384 -93264 -95168 -97072 -96114 -95157 -93662 -92168 -90674
-15072 -90674 -89179 -89876 -90573 -91270 -91967 -89265 -86563 -88989 -91415 -89250 -92809 -98514 -94680 -92515 -90349 -87588 -84826 -87346
-15054 -87346 -89865 -95246 -100627 -98854 -97080 -95306 -93532 -88270 -83008 -84424 -85840 -85169 -84499 -88598 -92697 -94680 -96662
-15037 -96662 -95783 -94903 -97423 -99942 -97691 -95440 -94560 -93681 -92801 -91922 -89850 -87778 -85706 -83634 -86369 -89101 -88974 -88844 -88180
-15018 -88180 -87513 -89712 -91907 -89008 -86105 -86067 -86026 -84976 -83921 -87640 -91356 -93122 -94885 -96651 -98414 -97378 -96338 -95302
-15000 -95302 -94262 -91438 -88609 -85784 -82956 -83530 -84100 -87536 -90968 -92041 -93111 -94184 -95254 -95313 -95369 -95429 -95485 -94292 -93096
-14981 -93096 -91903 -90707 -93092 -95474 -97859 -100240 -96975 -93707 -90443 -87174 -87010 -86843 -86679 -86511 -86571 -86626 -86686 -86742 -86802 -86857 -86917
-14960 -86917 -86973 -86157 -85341 -84525 -83708 -86947 -90185 -93424 -96662 -94400 -92138 -89876 -87614 -90062 -92511 -92097 -91684 -90554 -89425
-14941 -89425 -88296 -87167 -86276 -85385 -89265 -93144 -92790 -92436 -92082 -91728 -90003 -88277 -86552 -84826 -85214 -85602 -85989 -86377 -86347 -86317
-14921 -86317 -86287 -86258 -85199 -84141 -87852 -91564 -89910 -88255 -91370 -94486 -94814 -95142 -95470 -95798 -97914 -100031 -97378 -94724 -95112
-14902 -95112 -95500 -95887 -96275 -96662 -97050 -97437 -97825 -94225 -90625 -91795 -92965 -93659 -94352 -95045 -95738 -92600 -89462 -94911 -100359
-14883 -100359 -96148 -91937 -92496 -93055 -93301 -93547 -93793 -94039 -92257 -90476 -91557 -92638 -93167 -93696 -94225 -94754 -97609 -100463 -96640
-14864 -96640 -92816 -96353 -99886 -100322 -95030 -90696 -92082 -94665 -97244 -94877 -92507 -94553 -96595 -99834 -97344 -94859 -98093
-14847 -98093 -97352 -96606 -96223 -95835 -96465 -97091 -92951 -88807 -88467 -88125 -87785 -87443 -87700 -87953 -88210 -88464 -86872 -85281 -86552 -87823
-14827 -87823 -88557 -89291 -86805 -90044 -90867 -91691 -92515 -93338 -96666 -94270 -91874 -89477 -95086 -94970 -95213 -95455 -95339 -95224 -89026
-14808 -89026 -88553 -87260 -85967 -87893 -89820 -90137 -90454 -90770 -91087 -90152 -89213 -85415 -91154 -96360 -95839 -94367 -92891 -95608 -98321
-14789 -98321 -98175 -98026 -97702 -97374 -97050 -96722 -95339 -93953 -95432 -96908 -95406 -93901 -92399 -90893 -96159 -101421 -96193 -90961
-14771 -90961 -92351 -93737 -95127 -96513 -94575 -92638 -90700 -88762 -90342 -91922 -93502 -95082 -99137 -103191 -101880 -94844 -92459
-14754 -92459 -90074 -91743 -93413 -95567 -91997 -91646 -91296 -92079 -92861 -93286 -93711 -95298 -91162 -87025 -88613 -92764 -96916 -98563
-14736 -98563 -100210 -99342 -98470 -97601 -96729 -97650 -98567 -99487 -100404 -98939 -97471 -93144 -88814 -91762 -94706 -94792 -94874 -97083 -99290 -101499
-14716 -101499 -103706 -99536 -95362 -94054 -92742 -88393 -84040 -86369 -88695 -89235 -89772 -85542 -81308 -84875 -88438 -89142 -89843
-14699 -89843 -87566 -85285 -91594 -97900 -98842 -99781 -97862 -95939 -94497 -93051 -91609 -90163 -91859 -93551 -95246 -96938 -97441
-14682 -97441 -97941 -93674 -89403 -88057 -86708 -88225 -89738 -90957 -92172 -93390 -94605 -91281 -87957 -91311 -94665 -93249 -91833
-14665 -91833 -90416 -89000 -88121 -87241 -89224 -91206 -88777 -86347 -86779 -87212 -90156 -93100 -96044 -98988 -97877 -96767 -95656 -94546
-14647 -94546 -92064 -89582 -91870 -94158 -94478 -94799 -95119 -95440 -96096 -96748 -97404 -98056 -98473 -98887 -96442 -93994 -93278 -92559 -88982 -85400
-14627 -85400 -86354 -87305 -88259 -89209 -89239 -89265 -89295 -89321 -92749 -96174 -94833 -93487 -92280 -91069 -89861 -88650 -88575 -88497 -85561 -82620 -85117
-14606 -85117 -87610 -87245 -86876 -86451 -86023 -85598 -85169 -89142 -93111 -92313 -91512 -90774 -90033 -89295 -88553 -89738 -90920 -92105 -93286 -92324
-14586 -92324 -91359 -95168 -98973 -98041 -97106 -93312 -89515 -90849 -92179 -90651 -89120 -94352 -99584 -96230 -92872 -92500 -92127 -91754
-14568 -91754 -91378 -90081 -88784 -87487 -86187 -87990 -89794 -91598 -93398 -92064 -90729 -89395 -88057 -88393 -88728 -89064 -89395 -90536
-14550 -90536 -91676 -92816 -93953 -94199 -94445 -94691 -94933 -93644 -92354 -88203 -84051 -88426 -92801 -92406 -92011 -89753 -87495 -88098
-14532 -88098 -88702 -91452 -94203 -96953 -99703 -99454 -99204 -98954 -98704 -97024 -95343 -96524 -97706 -95056 -92406 -92619 -92831 -92507 -92183
-14513 -92183 -96629 -101075 -101194 -101313 -101432 -101548 -99342 -97136 -94929 -92719 -93688 -94657 -95626 -96591 -94758 -92924 -91091 -89254 -91479
-14494 -91479 -93703 -93066 -92425 -93219 -94013 -94806 -95596 -94855 -94113 -90510 -86902 -87830 -88758 -89686 -90610 -90934 -91255 -88717 -86176 -89302
-14474 -89302 -92425 -90782 -89134 -87491 -85844 -87062 -88277 -88423 -88564 -91929 -89567 -90018 -90465 -90558 -90647 -87342 -84033 -85139 -86243
-14455 -86243 -89496 -87021 -87771 -88516 -89921 -91322 -92727 -94128 -90890 -87651 -84771 -81890 -74120 -72074 -76945 -81815 -88028
-14438 -88028 -88516 -90674 -87107 -84495 -81882 -85590 -89298 -89175 -89052 -84517 -79982 -76520 -78782 -80686 -82590 -86850 -91110
-14421 -91110 -93819 -90804 -87491 -84178 -87185 -90193 -86746 -83299 -79851 -76404 -77787 -79169 -77690 -81935 -81797 -87383 -90107
-14404 -90107 -92831 -92336 -91840 -91344 -90849 -87625 -84402 -81178 -77955 -81171 -84387 -87245 -90103 -92440 -89052 -89243 -89433 -85687
-14386 -85687 -87666 -89645 -85900 -87439 -88974 -93733 -92764 -88341 -89638 -90938 -86511 -82579 -84368 -82583 -80794 -86701 -92604
-14369 -92604 -96960 -95589 -94229 -92869 -91151 -89433 -89563 -89693 -89824 -89954 -89697 -89440 -89183 -88926 -90517 -92108 -93700 -95291 -95690
-14350 -95690 -96088 -91717 -87346 -89235 -91124 -93014 -94903 -93633 -92362 -91091 -89820 -92902 -95984 -94296 -92608 -91784 -90957
-14333 -90957 -90133 -89306 -90808 -92306 -93808 -95306 -94542 -93774 -93010 -92242 -92850 -93454 -94061 -94665 -93565 -92462 -94225 -95984 -92738
-14314 -92738 -89488 -91009 -92529 -92533 -92533 -92537 -92537 -94329 -96118 -93137 -90156 -91143 -92127 -93115 -94098 -92582 -91061 -89541 -88020 -84372 -80720
-14293 -80720 -83749 -86775 -87420 -88061 -93472 -98883 -97922 -96960 -95999 -95037 -94374 -93711 -93047 -92384 -93137 -93890 -94642 -95395 -94955 -94516 -94076
-14272 -94076 -93636 -93487 -93338 -93189 -93040 -94322 -95604 -94024 -92444 -88002 -83559 -87703 -91847 -91520 -91192 -93726 -96260 -95321 -94378
-14253 -94378 -93435 -92492 -90536 -88579 -86623 -84666 -86589 -88508 -90428 -92347 -91165 -89984 -88803 -87621 -87256 -86887 -86518 -86149
-14235 -86149 -85065 -83981 -82896 -81812 -83399 -84983 -86567 -88151 -89734 -91318 -92902 -94486 -95015 -95544 -96073 -96603 -95641 -94680
-14217 -94680 -93718 -92757 -89455 -86153 -85713 -85274 -86980 -88687 -90394 -92101 -93129 -94158 -90416 -86675 -86809 -86943 -87077 -87212 -87122
-14198 -87122 -87033 -86943 -86854 -86764 -86675 -86585 -86496 -90167 -93837 -97508 -101179 -95727 -90275 -89593 -88911 -90390 -91870 -93349 -94829 -91598 -88367
-14177 -88367 -87998 -87629 -85889 -84148 -85270 -86392 -86500 -86608 -86716 -86824 -90331 -93837 -92574 -91311 -91717 -92123 -92529 -92936 -91963
-14158 -91963 -90987 -92876 -94762 -94028 -93290 -89693 -86094 -86135 -86172 -86213 -86250 -89332 -92410 -90722 -89030 -92701 -96368 -97177 -97982 -94914
-14138 -94914 -91844 -91639 -91430 -93968 -96502 -99040 -101574 -100117 -98656 -94337 -90014 -87480 -84946 -85274 -85602 -89149 -92697 -96245
-14120 -96245 -99793 -98108 -96424 -94739 -93055 -91669 -90282 -88896 -87510 -87644 -87778 -92682 -97587 -99092 -100598 -99241 -97885
-14103 -97885 -96841 -95798 -91892 -87987 -84499 -81010 -82292 -83574 -84744 -85915 -90662 -89686 -88710 -93457 -100352 -101522 -102931
-14086 -102931 -98615 -93942 -94993 -92824 -90655 -88844 -87033 -86816 -86600 -89246 -91892 -94359 -96826 -96431 -96036 -94210 -92384
-14069 -92384 -84476 -82292 -83209 -84126 -82538 -80951 -83776 -86597 -87867 -83414 -82542 -81666 -81983 -88024 -93055 -98082 -94881 -91680
-14051 -91680 -94206 -96729 -92574 -88419 -84312 -80202 -82769 -85337 -86835 -88330 -89824 -91318 -91028 -90733 -90439 -90144 -88780 -87413
-14033 -87413 -89265 -85393 -86843 -88289 -86161 -89753 -90070 -90383 -88195 -86004 -85576 -85143 -81137 -82851 -88922 -89265 -90327 -91385
-14015 -91385 -93297 -95205 -94255 -93301 -95749 -98194 -101000 -98078 -99319 -100557 -104660 -103035 -99446 -95854 -94769 -93681 -95563
-13998 -95563 -97441 -94549 -91657 -96461 -101261 -97475 -93688 -92216 -90741 -89265 -87789 -89895 -91997 -94098 -96200 -100490 -104775
-13981 -104775 -102383 -99990 -96528 -93062 -94367 -95671 -95697 -95719 -92164 -94333 -95790 -91520 -87607 -89418 -91985 -94553 -94616 -94680
-13963 -94680 -95816 -96953 -98090 -99226 -95146 -91065 -89846 -88628 -89079 -89529 -89980 -90431 -90174 -89917 -92522 -95127 -93677 -92228
-13945 -92228 -90778 -89328 -86030 -82732 -82296 -81860 -85479 -89097 -92716 -96334 -94370 -92406 -93305 -94203 -97844 -101485 -100355 -99226
-13927 -99226 -97769 -96312 -94855 -93398 -94266 -95134 -93141 -91147 -90569 -89992 -94184 -98377 -101019 -103661 -99625 -95589 -95101 -94613
-13909 -94613 -96987 -99360 -100244 -101127 -97240 -93353 -91859 -90364 -88870 -87375 -90115 -92854 -95593 -98332 -96987 -95641 -94296
-13892 -94296 -92951 -89638 -86325 -87782 -89239 -88937 -88635 -88333 -88031 -89339 -90647 -94818 -98988 -98060 -97132 -93342 -89552 -90174
-13874 -90174 -90797 -94281 -97765 -97337 -96908 -91710 -86511 -91210 -95910 -93931 -91952 -92179 -92406 -87864 -83321 -87305 -91288 -95272
-13856 -95272 -99256 -99565 -99875 -97322 -94769 -92336 -89902 -87469 -85035 -88296 -91557 -90048 -88538 -88102 -87666 -93908 -100150 -100113
-13838 -100113 -100076 -100039 -100001 -100918 -101835 -97982 -94128 -96595 -99062 -101529 -103996 -105211 -106426 -105137 -103847 -94859 -91594 -93696
-13820 -93696 -95798 -94441 -93085 -91728 -90372 -91400 -92429 -93457 -94486 -95872 -97259 -94233 -91206 -83831 -82177 -82434 -82687
-13803 -82687 -83362 -89757 -96155 -96826 -96755 -96681 -95895 -100829 -100579 -100326 -97572 -94814 -95399 -95980 -91795 -87607 -93796 -99983 -101403
-13784 -101403 -102819 -98604 -94385 -96610 -93107 -90323 -93260 -92623 -91982 -89570 -87159 -81528 -81622 -84935 -88248 -89056 -89865 -92075
-13766 -92075 -94285 -93275 -92265 -96800 -95611 -89652 -89418 -89369 -89321 -89630 -89939 -93230 -96521 -96591 -96662 -97031 -91676 -86679 -87405 -85330
-13746 -85330 -88978 -92626 -96275 -96606 -96934 -91184 -91154 -90592 -90025 -89105 -93905 -95518 -91404 -90871 -90334 -91590 -92842 -94456 -96066
-13727 -96066 -90137 -89928 -90916 -91900 -93245 -88862 -84484 -85825 -88929 -92030 -92630 -93226 -91024 -88818 -94605 -94665 -95105 -95544 -92764
-13708 -92764 -89984 -91497 -93010 -97385 -101760 -99368 -96975 -100665 -104354 -107268 -100642 -93301 -91684 -91997 -92310 -89761 -92936
-13691 -92936 -94203 -95470 -100314 -99435 -95455 -91475 -89999 -88523 -91281 -94039 -94292 -94546 -90938 -93055 -95172 -97288 -96424 -101283
-13673 -101283 -102923 -104563 -103817 -103072 -102327 -101581 -98988 -96394 -93800 -91206 -90245 -89284 -93092 -96901 -94628 -92354 -94851 -97348
-13655 -97348 -97549 -97750 -97952 -98153 -99666 -101179 -97922 -94665 -92798 -90931 -89064 -87197 -91233 -95269 -94534 -93800 -90025 -86250
-13637 -86250 -89153 -92056 -94184 -96312 -98440 -100568 -99416 -98265 -95563 -87137 -90577 -94016 -94236 -94456 -95541 -96625 -94847
-13620 -94847 -93070 -93141 -93211 -90420 -87629 -87383 -87137 -83313 -85214 -90036 -89134 -91810 -94486 -93435 -92384 -90975 -89567 -96625
-13602 -96625 -97959 -95835 -93711 -94106 -94501 -92034 -89567 -91870 -94173 -96118 -98064 -99532 -95276 -94598 -93919 -88054 -87912 -91229
-13584 -91229 -94546 -93871 -93193 -89298 -91124 -97247 -103367 -99353 -95336 -96808 -98276 -99748 -101216 -99886 -98552 -97221 -95887
-13567 -95887 -95913 -95936 -95962 -95984 -92910 -89831 -86757 -83679 -84614 -85546 -86481 -87413 -88766 -90115 -85505 -90431 -94601 -89228 -86958 -84685
-13547 -84685 -80090 -75491 -79482 -83470 -84122 -84771 -89835 -94896 -99841 -99059 -96729 -94397 -92671 -90942 -86354 -91303 -95660
-13530 -95660 -94288 -90059 -85825 -87767 -89705 -86876 -84044 -84793 -85538 -83425 -81308 -85013 -88713 -87648 -86578 -86049 -85516 -89757
-13512 -89757 -93994 -93659 -93319 -92984 -92645 -90759 -88870 -86984 -85095 -88210 -91322 -91218 -91110 -92257 -87677 -85963 -89969 -88523
-13494 -88523 -87074 -90756 -94434 -97221 -100005 -96114 -92220 -92410 -92597 -92787 -92973 -92507 -92038 -88710 -85378 -86343 -87305 -85408 -83507
-13475 -83507 -86142 -88773 -91408 -94039 -95406 -96770 -98138 -99502 -99558 -99610 -96804 -93994 -92634 -91270 -92772 -94270 -93387 -92500
-13457 -92500 -88754 -85005 -88937 -92869 -88214 -83559 -83735 -83910 -84085 -84260 -84748 -85236 -88587 -91937 -90934 -89932 -86067 -82203
-13439 -82203 -82348 -82494 -85501 -88508 -89906 -91303 -86023 -80742 -81350 -81957 -82564 -83172 -83302 -83433 -80701 -77969 -78007 -78044 -78081 -78118 -77560
-13418 -77560 -77000 -76441 -75882 -81897 -87912 -87249 -86585 -91110 -95634 -91572 -87510 -85184 -82859 -83395 -83932 -80653 -77373 -78864
-13400 -78864 -80354 -82203 -84051 -83038 -82024 -83634 -85244 -83992 -82740 -82926 -83112 -88069 -93025 -90230 -87435 -87502 -87569 -89887
-13382 -89887 -92205 -91661 -91117 -88784 -86451 -88889 -91326 -92690 -94054 -92556 -91057 -91885 -92712 -93539 -94367 -90349 -86332 -88993
-13364 -88993 -91654 -93182 -94710 -96237 -97765 -95798 -93826 -91859 -89887 -86250 -82609 -83742 -84871 -85289 -85702 -83258 -80809
-13347 -80809 -81763 -82713 -78897 -75078 -78610 -82140 -85672 -89202 -92794 -96383 -95205 -94024 -91833 -89638 -92216 -94792 -93197
-13330 -93197 -91598 -90003 -88404 -88277 -88151 -88024 -87897 -87771 -87644 -90379 -93115 -89306 -85497 -88367 -91236 -92973 -94710 -96446
-13312 -96446 -98183 -95537 -92891 -95015 -97139 -96401 -95664 -94926 -94188 -93450 -92712 -89112 -85512 -87100 -88687 -87413 -86138 -89123
-13294 -89123 -92108 -92231 -92354 -94087 -95820 -97553 -99286 -97396 -95507 -96480 -97452 -96815 -96178 -95541 -94903 -93960 -93018 -92075 -91132 -90189
-13274 -90189 -89246 -88303 -87361 -88773 -90185 -91598 -93010 -90845 -88680 -86515 -84349 -84141 -83932 -83723 -83515 -85453 -87390 -86466 -85542
-13255 -85542 -87614 -89686 -88896 -88106 -91132 -94158 -92414 -90670 -87539 -84409 -87957 -91505 -92608 -93711 -91952 -90193 -92578
-13238 -92578 -94963 -97348 -99733 -99018 -98302 -97587 -96871 -94955 -93040 -93987 -94929 -90510 -86090 -88348 -90603 -90267 -89932 -89597 -89257
-13219 -89257 -89041 -88825 -88609 -88389 -90819 -93249 -90908 -88564 -89802 -91039 -92276 -93510 -91184 -88859 -89395 -89928 -89392 -88855 -90823
-13200 -90823 -92787 -95626 -92738 -93070 -93401 -92902 -92399 -95116 -92108 -90059 -88005 -92272 -96539 -98842 -101142 -100579 -100016 -99040
-13182 -99040 -98060 -99942 -101824 -101622 -101417 -101213 -101008 -100493 -99975 -97907 -90115 -88587 -87055 -81946 -82561 -84718 -86876 -89392 -91907
-13163 -91907 -95675 -99442 -99752 -94337 -93722 -93107 -92134 -91162 -90487 -89813 -92000 -94188 -95693 -97199 -97154 -91385 -88300 -85214 -84871
-13144 -84871 -90252 -91937 -87897 -87077 -86258 -91221 -90461 -87793 -85125 -88833 -86816 -85158 -83500 -85896 -88292 -90688 -93085
-13127 -93085 -95764 -98444 -100765 -103087 -107257 -105703 -102599 -99495 -97229 -94963 -92697 -90431 -91624 -92816 -90789 -94486 -95619
-13110 -95619 -96752 -95380 -94009 -92638 -91266 -89895 -88523 -93156 -97788 -101108 -94888 -88013 -81137 -80940 -86466 -89369 -92272
-13093 -92272 -95891 -93785 -89474 -85162 -85262 -85363 -84234 -83105 -78756 -80131 -82460 -84789 -88192 -85870 -83667 -87189 -90353
-13076 -90353 -87793 -92567 -97341 -93170 -89000 -85870 -82740 -84379 -86019 -87838 -89656 -87897 -91862 -98898 -100210 -96513 -92816
-13059 -92816 -94903 -96990 -97885 -93055 -90763 -94195 -89280 -84364 -83682 -83000 -92455 -101909 -102003 -96372 -93960 -91549 -89973 -88397
-13041 -88397 -86820 -85244 -87566 -89887 -88989 -88091 -91188 -88561 -86291 -84022 -84167 -84312 -87320 -90327 -87789 -85251 -85576 -85900
-13023 -85900 -86757 -87614 -85251 -88613 -90961 -93308 -93152 -92995 -96073 -99152 -100680 -96483 -93659 -90834 -87651 -84469 -88315 -92161
-13005 -92161 -91236 -90312 -87241 -84171 -89686 -95201 -94218 -93234 -95828 -92697 -85930 -84886 -86943 -89000 -91341 -93681 -92921 -86436
-12987 -86436 -84543 -88374 -93398 -98421 -99226 -100031 -97259 -100210 -101790 -97646 -97080 -96513 -98839 -101164 -106709 -106530 -103907 -101283
-12969 -101283 -101164 -101045 -99420 -97795 -96528 -95261 -88270 -87003 -87286 -87569 -88717 -89865 -91013 -92161 -91460 -90759 -92921 -95082
-12951 -95082 -91564 -88046 -84171 -86019 -88106 -90193 -87867 -85542 -82438 -79333 -81238 -88866 -93036 -91482 -93506 -95529 -94482
-12934 -94482 -93435 -89168 -90625 -92261 -93897 -91121 -88344 -88445 -88546 -88646 -88747 -86701 -84655 -86187 -81994 -79904 -83537 -86455
-12916 -86455 -89373 -90025 -90677 -91329 -91982 -93819 -95656 -92723 -89790 -89362 -88933 -88505 -88076 -88020 -87964 -85404 -82844 -79986 -82851 -86075
-12896 -86075 -83574 -83809 -89768 -97516 -95723 -95898 -96073 -95295 -94516 -93498 -86757 -88005 -89254 -94259 -99263 -95682 -92101 -92742
-12878 -92742 -93383 -91162 -88941 -88985 -89030 -89075 -89120 -91609 -94098 -93010 -97646 -100911 -98451 -94799 -91147 -91005 -90864 -90722 -90580 -89008
-12858 -89008 -87435 -82643 -83574 -88054 -92533 -92242 -91952 -95895 -94113 -95552 -96990 -97862 -98734 -99606 -100478 -104809 -109139 -104883
-12840 -104883 -100627 -98667 -96707 -92481 -88255 -81882 -85050 -87621 -90193 -91311 -92429 -90685 -88941 -84454 -79967 -78938
-12824 -78938 -83634 -81443 -79251 -84096 -88941 -89075 -89209 -84573 -79937 -83485 -87033 -93800 -94844 -92250 -89656 -91713 -99495
-12807 -99495 -104205 -103191 -99077 -94963 -93293 -91624 -89954 -88285 -86347 -84409 -82113 -85542 -88195 -90849 -93860 -96871 -96543
-12790 -96543 -96215 -95887 -95559 -93264 -90968 -85810 -86377 -82918 -85184 -89358 -93532 -94367 -95201 -93174 -91147 -91982 -92816 -93651 -94486
-12771 -94486 -96632 -98779 -96513 -94247 -91997 -95470 -98943 -96692 -96051 -95410 -91907 -88404 -88061 -93442 -92742 -92041 -89313 -86585
-12753 -86585 -85408 -89954 -90018 -90081 -93006 -95932 -101660 -101663 -102025 -102386 -100631 -98876 -97121 -95365 -92835 -90305 -89325 -94069 -98559
-12734 -98559 -103050 -101220 -99390 -99767 -100143 -100519 -100896 -98544 -96193 -98611 -101030 -100706 -100381 -103635 -101164 -95690 -95939 -97382
-12716 -97382 -98824 -97225 -95626 -96890 -98153 -97195 -96237 -98142 -100046 -98373 -96700 -94669 -92638 -93815 -89269 -84722 -85900
-12699 -85900 -90357 -94814 -92951 -91087 -91967 -92846 -93726 -94605 -94590 -94575 -91698 -88821 -91877 -94933 -91311 -87689 -91221 -94754 -95425
-12680 -95425 -96096 -90864 -85631 -85169 -84707 -88180 -91654 -92265 -92876 -91836 -90797 -92619 -94441 -95190 -95939 -96688 -97437 -97888 -98339
-12661 -98339 -98790 -99241 -98500 -97758 -97016 -96275 -96152 -96029 -95906 -95783 -94944 -94106 -93267 -92429 -94274 -96118 -97963 -99808 -98075 -96342
-12641 -96342 -94609 -92876 -96025 -99174 -102323 -105472 -104567 -103661 -97985 -92310 -90301 -88292 -89146 -89999 -91628 -93256 -90115 -86973
-12623 -86973 -88605 -90238 -91870 -93502 -95254 -97005 -98757 -100508 -96133 -91758 -94061 -96364 -93003 -89641 -89142 -88643 -90439
-12606 -90439 -92235 -89261 -86287 -85639 -84990 -89112 -93234 -95105 -96975 -98846 -100717 -96923 -93129 -94106 -95082 -96394 -97706 -96155
-12588 -96155 -94605 -90074 -85542 -91505 -97467 -98868 -100270 -98809 -97348 -91654 -85959 -88851 -91743 -91549 -91356 -91162 -90968 -90595
-12570 -90595 -90223 -89850 -89477 -90029 -90580 -91132 -91684 -93905 -96126 -98347 -100568 -101451 -102334 -103217 -104101 -102360 -100620 -98880 -97139
-12551 -97139 -99185 -101231 -103277 -105323 -100631 -95939 -96018 -96096 -94780 -93465 -92149 -90834 -90532 -90230 -89928 -89626 -90711 -91795 -92880
-12532 -92880 -93964 -93856 -93748 -93640 -93532 -91549 -89567 -87584 -85602 -83619 -81636 -79654 -77671 -79400 -81130 -82859 -84588 -82263
-12514 -82263 -79937 -82382 -84826 -86563 -88300 -87174 -86049 -88978 -91907 -94836 -97765 -96878 -95991 -95105 -94218 -94046 -93875 -93703
-12496 -93703 -93532 -91695 -89857 -88020 -86183 -88698 -91214 -93729 -96245 -91516 -86787 -86828 -86869 -91739 -96610 -96711 -96811 -98686
-12478 -98686 -100560 -99573 -98585 -97419 -96252 -95086 -93919 -90666 -87413 -87021 -86630 -86954 -87279 -92373 -97467 -96882 -96297 -95712 -95127
-12459 -95127 -96987 -98846 -95936 -93025 -91292 -89559 -90688 -91818 -91039 -90260 -89481 -88702 -90413 -92123 -93834 -95544 -94154 -92764
-12441 -92764 -91374 -89984 -90040 -90096 -90152 -90208 -90264 -90320 -90375 -90431 -91218 -92004 -96606 -95485 -94542 -103139 -104462 -100061 -96793 -93524 -86321
-12420 -86321 -84841 -86999 -83433 -80224 -82740 -81722 -80705 -80045 -79386 -83258 -87130 -88139 -89149 -86984 -84819 -87424 -90029
-12403 -90029 -89831 -89634 -86216 -88523 -89060 -89597 -82501 -81130 -84707 -88285 -87450 -86615 -86481 -86347 -88717 -91087 -90655 -84499 -69756
-12384 -69756 -60737 -68452 -76166 -83880 -91594 -96029 -94739 -96670 -98600 -97967 -97333 -96700 -96066 -96625 -97184 -97743 -98302 -98276 -98250 -98224
-12364 -98224 -98198 -97516 -96834 -92932 -94754 -93029 -91303 -96375 -95723 -91553 -93107 -97404 -101701 -104328 -101231 -96584 -91937 -89794
-12346 -89794 -87651 -88370 -89090 -89213 -89336 -92321 -95306 -95846 -96387 -96927 -97467 -91326 -85184 -82263 -79341 -78804 -83992 -85959 -87927
-12327 -87927 -91028 -94128 -94367 -94605 -90789 -86973 -86377 -85780 -86034 -92011 -94769 -97527 -95157 -92787 -92921 -93055 -93040 -87301 -84782
-12308 -84782 -82263 -81294 -80325 -79356 -78387 -82658 -86928 -85117 -83306 -82508 -91251 -99636 -94665 -89589 -90238 -89693 -89149 -89202 -89254 -86444
-12288 -86444 -83634 -82285 -80936 -82687 -90163 -97937 -99986 -102394 -104801 -102975 -95425 -91095 -86764 -86548 -86332 -89693 -87331
-12271 -87331 -84655 -87703 -90394 -87361 -88441 -89522 -86667 -89537 -92004 -88747 -88710 -94397 -95075 -95753 -96789 -97825 -94859 -91892
-12253 -91892 -91788 -91684 -89671 -87659 -85646 -83634 -86466 -89298 -87361 -85423 -88672 -91922 -90402 -88881 -90688 -92496 -87864
-12236 -87864 -88956 -96487 -98295 -97001 -95708 -92343 -88978 -88475 -87972 -87290 -86608 -90696 -94784 -94437 -94091 -90167 -91967 -93826
-12218 -93826 -89962 -90390 -85095 -79277 -79184 -78376 -77567 -81588 -85609 -89988 -88643 -88948 -89254 -88844 -88434 -88739 -83321 -82672 -87748
-12199 -87748 -87905 -88061 -88575 -89090 -89902 -90715 -91885 -93055 -91281 -95231 -95962 -96692 -95991 -95291 -91728 -88166 -85840 -83515 -84051
-12180 -84051 -84588 -86913 -89239 -86794 -84349 -85889 -87428 -91829 -96230 -91568 -86906 -87014 -87122 -92194 -97266 -95660 -94054
-12163 -94054 -91613 -89172 -89593 -90014 -90696 -91378 -89198 -87018 -86328 -85639 -85307 -84976 -82542 -85833 -85903 -76434 -58438 -30902 3789
-12144 3789 48020 67492 43079 7933 -21488 -42503 -53977 -61874 -69771 -72063 -74355 -79866 -79654 -80932 -82210
-12129 -82210 -83489 -84767 -84301 -89559 -94818 -94352 -91501 -88650 -85441 -82233 -82020 -81808 -81595 -81383 -82781 -84178 -83071 -81964
-12111 -81964 -81357 -86474 -91590 -90983 -90852 -90722 -87014 -83306 -88721 -88412 -91322 -94233 -94281 -94329 -94378 -94426 -95831 -97236 -95421 -93606
-12091 -93606 -98231 -97132 -96390 -95649 -95876 -96103 -96331 -96558 -95712 -94866 -94378 -93890 -91635 -95105 -92850 -90595 -89652 -94434 -99215
-12072 -99215 -98272 -95213 -92153 -90286 -94143 -95854 -97564 -99632 -101701 -97844 -93987 -92992 -91997 -91419 -90841 -87402 -83962 -86813
-12054 -86813 -89664 -84525 -85110 -86351 -87592 -89548 -91505 -88460 -91139 -93103 -95067 -98403 -96014 -97560 -93383 -87253 -86846
-12037 -86846 -87633 -88419 -91471 -94523 -91255 -87987 -84569 -86876 -83459 -80041 -79009 -83701 -82072 -74720 -65832 -62668 -66421
-12020 -66421 -70173 -77205 -84238 -84592 -84946 -85561 -86176 -86790 -87405 -94758 -102111 -104335 -97020 -95220 -93420 -93886 -94352 -93088 -91825
-12001 -91825 -90920 -90014 -93200 -102111 -108159 -108483 -107019 -105554 -103732 -101909 -96748 -91587 -93461 -95336 -92023 -94434 -96845
-11984 -96845 -93532 -92969 -92403 -91482 -90558 -94408 -98254 -95425 -92593 -90510 -88423 -91110 -93793 -94214 -94631 -98272 -96185 -98175
-11966 -98175 -100165 -101798 -103430 -99755 -96081 -97177 -98272 -97937 -97601 -96908 -96215 -98503 -95067 -94136 -98928 -100933 -97210 -93491
-11948 -93491 -95492 -96305 -91389 -87193 -82993 -83925 -84853 -85784 -86712 -86213 -85710 -88311 -96632 -99562 -96767 -94329 -97616 -93867
-11930 -93867 -90118 -87085 -84051 -82270 -86213 -86578 -92667 -95298 -97929 -91020 -89835 -91393 -92951 -94866 -96782 -95179 -93577
-11913 -93577 -94836 -96096 -93182 -90267 -90215 -90163 -93211 -96260 -94538 -92816 -93577 -94337 -90327 -86317 -84931 -83544 -85020 -86496
-11895 -86496 -84290 -82084 -82740 -83395 -82620 -81845 -81070 -80295 -81320 -82341 -83366 -84387 -90420 -96450 -99621 -102789 -100400 -98008
-11877 -98008 -92757 -87502 -87081 -86656 -86235 -85810 -85195 -84577 -88732 -92883 -93163 -93439 -93718 -93994 -94557 -95116 -95678 -96237 -94654 -93066
-11857 -93066 -91482 -89895 -89720 -89544 -89369 -89194 -89019 -88844 -88669 -88493 -89481 -90469 -91456 -92444 -92418 -92392 -92365 -92339 -95175 -98011 -96077 -94143
-11835 -94143 -96681 -99219 -95078 -96662 -102077 -97952 -96688 -95425 -98932 -102439 -99267 -96096 -93912 -91724 -92403 -93077 -88628
-11818 -88628 -84174 -84495 -84812 -89127 -93439 -91076 -88710 -87718 -86723 -90502 -94277 -95216 -96152 -97091 -98026 -97654 -97277 -99767 -102252
-11799 -102252 -100493 -98731 -96972 -95209 -94821 -94430 -94042 -93651 -94929 -96208 -97486 -98764 -98432 -98101 -100631 -103162 -101593 -100024
-11781 -100024 -98455 -96886 -93111 -89336 -92239 -95142 -97933 -100724 -98745 -96767 -96696 -96625 -96554 -96483 -98395 -100307 -102219 -104130
-11763 -104130 -103478 -102826 -102174 -101522 -103691 -105860 -101350 -96841 -93405 -89969 -91303 -92638 -95000 -97363 -99726 -102088 -101947 -101805
-11745 -101805 -101663 -101522 -100195 -98868 -94680 -90491 -88807 -87122 -90208 -93293 -92205 -91117 -90029 -88941 -91132 -93323 -92652
-11728 -92652 -91982 -92742 -93502 -89492 -85482 -86302 -87122 -87942 -88762 -87450 -86138 -87689 -89239 -91326 -93413 -95500 -97587 -97214 -96841
-11709 -96841 -96469 -96096 -98704 -101313 -99152 -96990 -94605 -92220 -94605 -96990 -98898 -100806 -99852 -98898 -97732 -96565 -90629 -84692
-11691 -84692 -90204 -95716 -94549 -93383 -93528 -93674 -96681 -99688 -101622 -103557 -100721 -97885 -94698 -91512 -95004 -98496 -96741
-11674 -96741 -94985 -93230 -91475 -92433 -93390 -94348 -95306 -98947 -102588 -101458 -100329 -99047 -97765 -92906 -93770 -98451 -97408 -95529
-11656 -95529 -93651 -90789 -93651 -96513 -93651 -92101 -90551 -93413 -96275 -94918 -93562 -92205 -90849 -87823 -84797 -86541 -88285
-11639 -88285 -89284 -90282 -91281 -92280 -92146 -92011 -91520 -96752 -98991 -101231 -100967 -100702 -100795 -100888 -100981 -101075 -101049 -101022 -100996 -100970 -99155 -97341 -98388
-11616 -98388 -99435 -100542 -101649 -99893 -98138 -92746 -87353 -90308 -87539 -86291 -90767 -91665 -92563 -94117 -95671 -99729 -103788
-11599 -103788 -101198 -92883 -87431 -87703 -89168 -90633 -92455 -94277 -95265 -96252 -97240 -98227 -97784 -97341 -96897 -96454 -93088 -89723 -86358
-11580 -86358 -82993 -84517 -86041 -91143 -90521 -87528 -90260 -92992 -89999 -85099 -85922 -87580 -89239 -94233 -93502 -91221 -88941
-11563 -88941 -89462 -89984 -90506 -91028 -91982 -92936 -96752 -100568 -102237 -103907 -98898 -93890 -93100 -92310 -91877 -91445 -84990 -84260 -85080 -85900
-11543 -85900 -83008 -80116 -81994 -83872 -80146 -76419 -74243 -77791 -81901 -86012 -87618 -89224 -88624 -88024 -84204 -86108 -89548
-11526 -89548 -92988 -93923 -94859 -90905 -86951 -82639 -84051 -85203 -86354 -87864 -89373 -89630 -89887 -90144 -90402 -88572 -86742 -84912
-11508 -84912 -83082 -82207 -81331 -79740 -83872 -92503 -95406 -95451 -101216 -102573 -98201 -94192 -95902 -92906 -89906 -87267 -84625 -84074
-11490 -84074 -83518 -82967 -82412 -85930 -89444 -88192 -86936 -88486 -90033 -91941 -88121 -85482 -82840 -84614 -86384 -93584 -100780
-11473 -100780 -97486 -94188 -94069 -93949 -97408 -95142 -89895 -90372 -90133 -89895 -90953 -92011 -93070 -94128 -97035 -99942 -103206 -100747
-11455 -100747 -94367 -87987 -84707 -87152 -88106 -89060 -90372 -91684 -89358 -87033 -91385 -95738 -96155 -96573 -96990 -97408 -97430 -97449 -94609
-11436 -94609 -91765 -89939 -88110 -89146 -90178 -94255 -98328 -99304 -94553 -89567 -90301 -93782 -97259 -99353 -95719 -88989 -82255
-11419 -82255 -79758 -82982 -82989 -82993 -81271 -79546 -82594 -85639 -86004 -86366 -86731 -87092 -86131 -85169 -84208 -83246 -83835 -84424 -87517 -90610 -94031
-11398 -94031 -91728 -89783 -87838 -87204 -86571 -81167 -75763 -71791 -67818 -69212 -76330 -81659 -86988 -87905 -88821 -86459 -84096 -90320
-11380 -90320 -96543 -96208 -95872 -95537 -95201 -91792 -88382 -81752 -80846 -83101 -85356 -87968 -90580 -89675 -88769 -90726 -92682 -93387 -94091
-11361 -94091 -91575 -89060 -89187 -83589 -80854 -83843 -88680 -93517 -90126 -86735 -85788 -84841 -87472 -84379 -80153 -81651 -84342
-11344 -84342 -87033 -89712 -92392 -90301 -88210 -89041 -89872 -89511 -83425 -86045 -94389 -98798 -103206 -101593 -94255 -92641 -91028
-11327 -91028 -90346 -83940 -87431 -90923 -91613 -92302 -92992 -93681 -94192 -94702 -96167 -88091 -86157 -89947 -92425 -94903 -99163 -97698
-11309 -97698 -89556 -87137 -90502 -93867 -97590 -101313 -99714 -98116 -99379 -100642 -101190 -101738 -102286 -102834 -99666 -96498 -96193 -95887
-11291 -95887 -93852 -91818 -97773 -98004 -94240 -90476 -91363 -97974 -100769 -97840 -98488 -99137 -98172 -97206 -96241 -95276 -97352 -99427 -100907
-11272 -100907 -102386 -107920 -103914 -97285 -96379 -96666 -96953 -94736 -92518 -94959 -97400 -99841 -102282 -101205 -100128 -99051 -97974
-11255 -97974 -96509 -95045 -93580 -92116 -94944 -97773 -93923 -90074 -90834 -91594 -89492 -87390 -88091 -88792 -86630 -84469 -89120 -93770
-11237 -93770 -98421 -103072 -101760 -100449 -99137 -97825 -93599 -89373 -91825 -94277 -92973 -91669 -90364 -89060 -88471 -87882 -87293
-11220 -87293 -86705 -89455 -92205 -94955 -97706 -96174 -94642 -93111 -91579 -90048 -88516 -86984 -85453 -85173 -84894 -84614 -84335 -89123
-11202 -89123 -93912 -93931 -93949 -94624 -95298 -95973 -96647 -95593 -94538 -96346 -98153 -98738 -99323 -102770 -106217 -102986 -99755 -96524 -93293
-11183 -93293 -93267 -93241 -93215 -93185 -91430 -89675 -87920 -86161 -89787 -93413 -92269 -91121 -88486 -85851 -89895 -93934 -92537 -91139 -94512
-11164 -94512 -97881 -99345 -100810 -99413 -98011 -94914 -91818 -91583 -91344 -94210 -97076 -95172 -93264 -95153 -97039 -96062 -95086 -93756
-11146 -93756 -92421 -91087 -89753 -88974 -88192 -87409 -86626 -86742 -86854 -86966 -87077 -91337 -95593 -95078 -94564 -95544 -96521 -92727 -88933 -93074
-11126 -93074 -97210 -96577 -95943 -98414 -100881 -103348 -105815 -103251 -100687 -98123 -95559 -93830 -92101 -93234 -94367 -96096 -97825
-11109 -97825 -96692 -95559 -94546 -93532 -92518 -91505 -94128 -96752 -99375 -101999 -100627 -99256 -97885 -96513 -92265 -88016 -92354
-11092 -92354 -96692 -97095 -97497 -97900 -98302 -99755 -101205 -97888 -94568 -95842 -97113 -95526 -93934 -90826 -87715 -89377 -91035 -92876
-11074 -92876 -94713 -96554 -98391 -93987 -89578 -91851 -94121 -92459 -90793 -89131 -87465 -91885 -96301 -97859 -99413 -98526 -97635
-11057 -97635 -96748 -95857 -96047 -96237 -96428 -96618 -98596 -100575 -99692 -98809 -96390 -93972 -94415 -94859 -95660 -96461 -97262 -98064 -97180 -96297 -95414
-11036 -95414 -94531 -95496 -96461 -97426 -98391 -93066 -87741 -85277 -82814 -87983 -93152 -91642 -90133 -89604 -89071 -88542 -88009 -85751 -83489
-11017 -83489 -84092 -84692 -88218 -91739 -88587 -85430 -90029 -94624 -94452 -94277 -90185 -86090 -88676 -91259 -90804 -90346 -92753 -95157
-10999 -95157 -93808 -92455 -91106 -89753 -92220 -94683 -97150 -99614 -103616 -107615 -104939 -102260 -101671 -101078 -100490 -99897 -99234 -98567
-10981 -98567 -97903 -97236 -96036 -94833 -93633 -92429 -90830 -89228 -90491 -91751 -89794 -87834 -88739 -89641 -90711 -91777 -92846 -93912
-10963 -93912 -89854 -85792 -86503 -87212 -89980 -92746 -95514 -98280 -99618 -100952 -102290 -103624 -98895 -94162 -96111 -98056 -97620
-10946 -97620 -97180 -96744 -96305 -94926 -93543 -95026 -96506 -97989 -99468 -98090 -96707 -96998 -97285 -97575 -97862 -99584 -101302 -100162
-10928 -100162 -99018 -96230 -93442 -90655 -87867 -89015 -90163 -91311 -92459 -95723 -98988 -95574 -92161 -92503 -92846 -93189 -93532
-10911 -93532 -92280 -91028 -89775 -88523 -91028 -93532 -93174 -92816 -93472 -94128 -94784 -95440 -97825 -100210 -100091 -99972 -95052 -95854 -97851
-10892 -97851 -99845 -97370 -89168 -87051 -84931 -84349 -83764 -83183 -82598 -87443 -92283 -90092 -87897 -96334 -99044 -91859 -90394 -89172
-10874 -89172 -97486 -104015 -104816 -103132 -101444 -99759 -98071 -94836 -97322 -101362 -105398 -105714 -106027 -103482 -100933 -100296 -99655 -99018
-10856 -99018 -98377 -96621 -94862 -93107 -91348 -92455 -93558 -93115 -86943 -88259 -89570 -87666 -85758 -89220 -92679 -93636 -94590 -91553
-10838 -91553 -94236 -98473 -102707 -103903 -105096 -106292 -107484 -104403 -101321 -100743 -100165 -101019 -96148 -88415 -86407 -88870 -91333
-10821 -91333 -97374 -97691 -93834 -89977 -90532 -91087 -89291 -87495 -85699 -83902 -88784 -93666 -92466 -91266 -87920 -94113 -98160
-10804 -98160 -96483 -96714 -96946 -96819 -96692 -94482 -92272 -92924 -93577 -95600 -97624 -96785 -95947 -98283 -100620 -98186 -95753 -96241 -96729
-10785 -96729 -97575 -98421 -94210 -95723 -103914 -106381 -101932 -97482 -97445 -97408 -96073 -94739 -93763 -92787 -87696 -88330 -88605 -88881 -91594
-10766 -91594 -94303 -92242 -90182 -91881 -93577 -95272 -96968 -96461 -95951 -98302 -100654 -104142 -107626 -104432 -101239 -96782 -92321
-10749 -92321 -90722 -89123 -91165 -93204 -95242 -97281 -95298 -93312 -94188 -95064 -96957 -98846 -97873 -96901 -97471 -98037 -95746 -93450
-10731 -93450 -91397 -89339 -90148 -90953 -94922 -98887 -98086 -97281 -96420 -95555 -94695 -93830 -94780 -95727 -91907 -88084 -88616 -89146 -89679 -90208
-10711 -90208 -92887 -95563 -98242 -100918 -96800 -92679 -93331 -93979 -90614 -87249 -90562 -93871 -94441 -95011 -95582 -96148 -96688 -97229 -97769
-10692 -97769 -98306 -99085 -99863 -97780 -95693 -96375 -97057 -94877 -92693 -92958 -93223 -93487 -93748 -93238 -92727 -96987 -101242 -101626 -102010 -102394
-10672 -102394 -102774 -101041 -99308 -97575 -95842 -93156 -90469 -94460 -98451 -96972 -95492 -96875 -98257 -98447 -98637 -95965 -93293
-10655 -93293 -89108 -84923 -89325 -93726 -96875 -100024 -96495 -92965 -92045 -91124 -90204 -89284 -88482 -87681 -90100 -92518 -90782 -94765
-10637 -94765 -95533 -96297 -97721 -99141 -97702 -96260 -94225 -92187 -89794 -93122 -92339 -91553 -90413 -94993 -96454 -92187 -87923 -89380
-10619 -89380 -95194 -95280 -94177 -93070 -97154 -101235 -100907 -100575 -97385 -99916 -102092 -104265 -101108 -97948 -99562 -101172 -102427 -103680
-10601 -103680 -104935 -106188 -103553 -100914 -98280 -95641 -93901 -92157 -87912 -83664 -82415 -86887 -88143 -89395 -93334 -97270
-10585 -97270 -96439 -95604 -97203 -98798 -96938 -95075 -100668 -96718 -92056 -93115 -94389 -95660 -97292 -98921 -100314 -101704 -100236
-10568 -100236 -98764 -98116 -97464 -97173 -96878 -92891 -94624 -99222 -98093 -97482 -96867 -95898 -94926 -94136 -93342 -92552 -91758 -93278 -94795
-10549 -94795 -96316 -97832 -97326 -96815 -99528 -96513 -95555 -94598 -93640 -92682 -90651 -94344 -94818 -95291 -96122 -96953 -97784 -98615 -97657 -96700
-10529 -96700 -98246 -99793 -103195 -100873 -98909 -96946 -96413 -95880 -95347 -94814 -93804 -92794 -91784 -90774 -90480 -90185 -89891 -89597 -91095
-10510 -91095 -92593 -94091 -95589 -96312 -97035 -97758 -98481 -95045 -91609 -94851 -98093 -99845 -101596 -96670 -91743 -94665 -97587 -95738
-10492 -95738 -93890 -94307 -94724 -95142 -95559 -93741 -91922 -90103 -88285 -88613 -88941 -89269 -89597 -89604 -89611 -89619 -89626 -89813 -89999 -90185 -90372 -90096 -89820
-10469 -89820 -92406 -94993 -95552 -96111 -96670 -97229 -95678 -94128 -97348 -100568 -92578 -84588 -87092 -89597 -89343 -89090 -88836 -88583 -88985
-10450 -88985 -89388 -89790 -90193 -91471 -92749 -94028 -95306 -97001 -98697 -97531 -96364 -94169 -91974 -89779 -87584 -92783 -97982
-10433 -97982 -100318 -102655 -103389 -104123 -104857 -105591 -105729 -105867 -101235 -96603 -96651 -96700 -96748 -96796 -91657 -86518 -88057 -89597 -93286 -96972
-10413 -96972 -93983 -90990 -88777 -86559 -89116 -91669 -89649 -87625 -85605 -83582 -86094 -88602 -88251 -87897 -89298 -90696 -92097
-10396 -92097 -93495 -91616 -89734 -92626 -95514 -97572 -99625 -95004 -90379 -90826 -91270 -94579 -97885 -97266 -96647 -96029 -95410 -97654
-10378 -97654 -99897 -97370 -94844 -93226 -91609 -89992 -88374 -92302 -96230 -97296 -98362 -94680 -90998 -90178 -89358 -90327 -91296 -92265
-10360 -92265 -93234 -96081 -98928 -101775 -104622 -103773 -102923 -99211 -95500 -97941 -100378 -98049 -95716 -94877 -94035 -93197 -92354 -91903 -91449
-10341 -91449 -93860 -96267 -98261 -100251 -102245 -104235 -105088 -105938 -110011 -108357 -103963 -99565 -99584 -99599 -99588 -99573 -97057 -94538 -92500
-10322 -92500 -96182 -99509 -102834 -100553 -98268 -93483 -88695 -82598 -82222 -88527 -89105 -93383 -97657 -96808 -95954 -93018 -90077 -95727
-10304 -95727 -95649 -92403 -98693 -102483 -100545 -96644 -92738 -95157 -97572 -100303 -103031 -102901 -102767 -103590 -104410 -102729 -101045 -94363
-10286 -94363 -93405 -95906 -98406 -97329 -96252 -95175 -94098 -92455 -90811 -89168 -87525 -84271 -81018 -84443 -87867 -89015 -90163
-10269 -90163 -91311 -92459 -95276 -98093 -101268 -98719 -97020 -95321 -93264 -91206 -92548 -93890 -95231 -96573 -97072 -97568 -98067
-10252 -98067 -98563 -94650 -90733 -91590 -92444 -87785 -83123 -85143 -87159 -89239 -91315 -93394 -95470 -97124 -98775 -91844 -84908
-10235 -84908 -88292 -91672 -90286 -88896 -87361 -85821 -87148 -88471 -88605 -88736 -88870 -89000 -88460 -87916 -87375 -86831 -87961 -89086 -94985
-10216 -94985 -100881 -101145 -101406 -98809 -96208 -92239 -88266 -94792 -101313 -97620 -93923 -90230 -86533 -89399 -92261 -88449 -84633
-10199 -84633 -84636 -84636 -84640 -84640 -85121 -85598 -86079 -86556 -83332 -80105 -79743 -79378 -81461 -83541 -85624 -87703 -89280 -90852 -92429 -94001 -93431
-10178 -93431 -92857 -92287 -91713 -92172 -92626 -93085 -93539 -87856 -82169 -76725 -82725 -87357 -91985 -97333 -102677 -101585 -100490 -99398
-10160 -99398 -98302 -94423 -90543 -95250 -99957 -96554 -93152 -92611 -92071 -91158 -90245 -89332 -88419 -90785 -93152 -95518 -97885 -96539
-10142 -96539 -95194 -93849 -92503 -91158 -89813 -88467 -87122 -87566 -88009 -88452 -88896 -89339 -89783 -90226 -90670 -90048 -89425 -88803 -88180 -89585
-10122 -89585 -90990 -89175 -93085 -94311 -95537 -97121 -98704 -102793 -106881 -108465 -104324 -104239 -104153 -101563 -93249 -89108 -90692 -88698
-10104 -88698 -86705 -89302 -91900 -89131 -86362 -83593 -86548 -86284 -86019 -85583 -85143 -84707 -84267 -86753 -89235 -88501 -87763 -93156 -92820
-10085 -92820 -89984 -87144 -88661 -90174 -91691 -93204 -92910 -92615 -92321 -92026 -90659 -89291 -93290 -97288 -100572 -98131 -98909 -99688
-10067 -99688 -99752 -99815 -99878 -99942 -99107 -98272 -97437 -96603 -94635 -92667 -96782 -95172 -97706 -100240 -93472 -92429 -92280 -92131 -95201 -98272
-10047 -98272 -96208 -94139 -94937 -95731 -94322 -92910 -96867 -100821 -103512 -100475 -97441 -94404 -95962 -91792 -87625 -89179 -92570
-10030 -92570 -95962 -93748 -85810 -81927 -83768 -91572 -99375 -98846 -98317 -97788 -97259 -98518 -99778 -101037 -102297 -102521 -102744 -102968
-10012 -102968 -103191 -100314 -97437 -94918 -92399 -90044 -93413 -93919 -94426 -90819 -92936 -94695 -96454 -91847 -87241 -88359 -89477
-9995 -89477 -89701 -89925 -90148 -90372 -91087 -91803 -92518 -93234 -90849 -88464 -86079 -83694 -84059 -84424 -84789 -85154 -87666 -90178 -92690 -95201
-9975 -95201 -95984 -96767 -97549 -98332 -97922 -97512 -97102 -96692 -95049 -93401 -91758 -90111 -90614 -91113 -91616 -92116 -89101 -86082 -83067 -80049
-9955 -80049 -82639 -85225 -87815 -90402 -91911 -93416 -89202 -84983 -80410 -75834 -74124 -72409 -74187 -75961 -80600 -85236 -82781
-9938 -82781 -80321 -80727 -81130 -85445 -89757 -94072 -98384 -100136 -101883 -97911 -93934 -93882 -93826 -93774 -93718 -89910 -86097 -88013 -89925
-9919 -89925 -92093 -94259 -93565 -92869 -87405 -81938 -86015 -90088 -91229 -92365 -90644 -88918 -87733 -86544 -85359 -84171 -85248
-9902 -85248 -86325 -87402 -88479 -91344 -94210 -97076 -90402 -82624 -80571 -76848 -78849 -84070 -83567 -83779 -83992 -86582 -89172 -88900
-9884 -88900 -88628 -89071 -89515 -89958 -90402 -91590 -92779 -93968 -95157 -93722 -92287 -90852 -89418 -90115 -90808 -91505 -92198 -95816 -99431
-9865 -99431 -103050 -106665 -111356 -116045 -110242 -104436 -103821 -103203 -99726 -96245 -95794 -95339 -92026 -88710 -86172 -83630 -87771 -91907
-9847 -91907 -92887 -93864 -94844 -95820 -96800 -97777 -93987 -90193 -93074 -95951 -98831 -101708 -100057 -98403 -99614 -100821 -100810 -100795 -100784 -100769
-9827 -100769 -99267 -97762 -101030 -104294 -99073 -93849 -93398 -92943 -93387 -93826 -94270 -94710 -94110 -93506 -88136 -82762 -87230 -91695 -89485
-9808 -89485 -87271 -88564 -89854 -88285 -86712 -88482 -90249 -87249 -84245 -82691 -81133 -82441 -83746 -85173 -86597 -85162 -83723
-9791 -83723 -82125 -80522 -85602 -90677 -88721 -86761 -84804 -82844 -83794 -84741 -85691 -86638 -89257 -91874 -94493 -97110 -96774 -96439
-9773 -96439 -96103 -95768 -94419 -93070 -88859 -84648 -83522 -82397 -81271 -80146 -82300 -84454 -83746 -83038 -81651 -80265 -81741 -83217
-9755 -83217 -83082 -82948 -82814 -82680 -83515 -84349 -88046 -91743 -91385 -91028 -90670 -90312 -87648 -84983 -85180 -85378 -84681 -83984 -83287 -82590 -82549
-9734 -82549 -82508 -82467 -82426 -83995 -85564 -87133 -88702 -82512 -76322 -76810 -77299 -80470 -83641 -82639 -81636 -77384 -82672 -85456 -88240
-9715 -88240 -84823 -81405 -80850 -80295 -77150 -74001 -75625 -77246 -82151 -87051 -87185 -87316 -87703 -88087 -88475 -88859 -82986 -77109 -76005
-9696 -76005 -74899 -76561 -78219 -77019 -75815 -76106 -76393 -76684 -76971 -81271 -85568 -83190 -80809 -78312 -75812 -73315 -70814 -71955
-9678 -71955 -73091 -77094 -81092 -80682 -80269 -79859 -79445 -80034 -80619 -78346 -76069 -73378 -70684 -71213 -71738 -75681 -85344 -90480 -86071
-9659 -86071 -83634 -81193 -78159 -75122 -81167 -87208 -88482 -89753 -86138 -82520 -78905 -75286 -77474 -79658 -78983 -78305 -78882 -79456
-9641 -79456 -77172 -74884 -72271 -69655 -69905 -70151 -68612 -67069 -65530 -63987 -67091 -70192 -73296 -76397 -78070 -79740 -84275
-9624 -84275 -88807 -88825 -88840 -91721 -94598 -99267 -103933 -102103 -100270 -103762 -110115 -111640 -103624 -104253 -104883 -101518 -103877 -102733
-9606 -102733 -98727 -96688 -94650 -94579 -94508 -94437 -94367 -96208 -98045 -96845 -101365 -96528 -94549 -94005 -93457 -92809 -89295 -87036 -90498
-9587 -90498 -93010 -95518 -98030 -100538 -104704 -103147 -99085 -100747 -98175 -101328 -102334 -97616 -96431 -100970 -97162 -93353 -92943
-9570 -92943 -92533 -94985 -97437 -98067 -98693 -102543 -100665 -98552 -96435 -93964 -91490 -88221 -84949 -86392 -90692 -94758 -93096 -88754
-9552 -88754 -90133 -85788 -81439 -82222 -83000 -83425 -83846 -89041 -94233 -97989 -101742 -100728 -99711 -99532 -99349 -96308 -93264 -93878 -94490
-9533 -94490 -99875 -105256 -104619 -103978 -106739 -103773 -99200 -97486 -96968 -99308 -99386 -99461 -99718 -99972 -96819 -93662 -93372 -93077 -92846 -92611
-9513 -92611 -95600 -98585 -91400 -89936 -97538 -102275 -101649 -103881 -107369 -105129 -107380 -106765 -105617 -107328 -109102 -108010 -110320
-9496 -110320 -109765 -111204 -112638 -112706 -107045 -102222 -103121 -102055 -98123 -97363 -96599 -95660 -94717 -93599 -92477 -91359 -90238 -92354 -94467
-9477 -94467 -93722 -92973 -93480 -93983 -87812 -81636 -77873 -74105 -77019 -79930 -82904 -85874 -78353 -70829 -62683 -54533 -46386 -38236
-9459 -38236 -39332 -40423 -50105 -59783 -69454 -79121 -84022 -88918 -92507 -96092 -94911 -93726 -92067 -90405 -91609 -92809 -92820
-9442 -92820 -92828 -92839 -92846 -92880 -92910 -92943 -92973 -95749 -98522 -94620 -90715 -94206 -97695 -96416 -95134 -91411 -87685 -86824 -85959 -89854 -93748
-9421 -93748 -97642 -101537 -106087 -110637 -106601 -102565 -102003 -101440 -103739 -106039 -105357 -104675 -101131 -97587 -94557 -91527 -91359 -91192
-9403 -91192 -89235 -87279 -85322 -83366 -86075 -88784 -91493 -94203 -94169 -94136 -96964 -99793 -103039 -106281 -102849 -99413 -93357 -87297
-9385 -87297 -87920 -88538 -90197 -91851 -90647 -89440 -89011 -88579 -91013 -93442 -96114 -98783 -101455 -104123 -98328 -92529 -91505 -90476
-9367 -90476 -86954 -83429 -79907 -76382 -75722 -75059 -74399 -73736 -77235 -80731 -75644 -70553 -70654 -70751 -64173 -57592 -53489 -49382 -46949
-9348 -46949 -33063 -20136 -7204 9777 38212 80326 141525 227525 332609 443295 504374 518703 521588
-9335 521588 503927 436661 330038 223419 140407 76480 32107 6818 -7580 -21980 -32325 -42671 -42760 -42849
-9321 -42849 -42939 -43028 -51346 -59664 -67982 -76300 -85631 -94963 -98809 -102655 -105055 -96006 -93398 -90789 -90088 -89388 -91549 -93711
-9303 -93711 -97184 -100657 -104130 -107604 -107201 -106799 -106396 -105994 -104261 -102524 -100791 -99055 -96785 -94512 -97013 -99509 -100251 -100989
-9285 -100989 -101731 -102468 -105834 -109195 -109698 -110197 -110112 -110022 -109937 -109847 -105886 -101921 -102729 -103534 -103150 -102763 -105241 -107716 -108942 -110164 -106620
-9264 -106620 -103072 -103780 -104485 -105193 -105897 -102372 -98842 -98179 -97512 -94970 -92425 -94654 -96878 -99226 -101570 -101056 -100538 -102491 -104440
-9245 -104440 -103531 -102617 -98488 -94355 -94996 -95634 -96096 -96554 -99878 -103199 -103422 -103642 -101004 -98362 -96726 -95086 -96312 -97534 -97806
-9226 -97806 -98075 -95485 -92891 -93059 -93223 -100068 -106911 -105468 -104022 -107350 -110674 -108390 -106102 -103817 -101529 -99543 -97553 -95567
-9208 -95567 -93577 -93543 -93506 -93472 -93435 -90480 -87521 -84566 -81607 -79885 -78159 -79300 -80436 -88136 -95831 -103531 -111226 -104794 -98358
-9189 -98358 -96696 -95030 -95216 -95399 -95585 -95768 -98026 -100281 -102539 -104794 -103475 -102152 -100832 -99509 -98429 -97344 -96264 -95179
-9171 -95179 -90163 -85143 -82989 -80831 -83846 -86857 -87010 -87159 -88385 -89608 -90834 -92056 -89466 -86872 -84282 -81689 -82378 -83064
-9153 -83064 -83753 -84439 -82505 -80567 -81495 -82419 -80843 -79263 -80548 -81830 -82997 -84159 -85326 -86489 -89503 -92515 -95529 -98541
-9135 -98541 -96998 -95451 -93908 -92362 -93144 -93923 -94706 -95485 -92004 -88520 -87901 -87279 -88210 -89138 -90070 -90998 -93629 -96256 -92209
-9116 -92209 -88158 -89000 -89839 -90681 -91520 -89977 -88430 -93565 -98697 -99837 -100974 -97344 -93711 -91847 -89984 -90983 -91982 -87495
-9098 -87495 -83008 -81383 -79758 -78193 -76628 -77925 -79222 -81711 -84200 -86690 -89179 -90074 -90968 -91862 -92757 -90551 -88344 -86138
-9080 -86138 -83932 -83626 -83321 -83015 -82710 -78469 -74228 -72849 -71470 -71053 -70632 -67352 -64069 -66633 -69193 -69968 -59291 -52710
-9062 -52710 -51849 -51827 -51801 -51361 -50918 -53340 -55759 -57309 -58855 -60406 -61952 -62429 -62903 -56701 -50497 -48380 -46259 -44143 -42022
-9043 -42022 -41635 -41243 -49442 -57637 -60477 -63316 -59478 -55639 -54723 -53806 -48119 -42432 -35135 -27839 -20542 -13245 -11732 -10219
-9025 -10219 -2028 6162 21680 37198 49854 62509 82678 102847 125877 148908 182969 217031 261587 306143
-9011 306143 353083 400024 451616 508932 579604 669360 780698 918752 1096751 1339628 1699369 2253734
-8999 2253734 3086341 4296746 5888278 7674434 9333583 10676000 11595782 11550097 10512993 8945456
-8989 8945456 7063089 5260863 3841197 2829855 2129998 1640029 1293727 1050462 871114 741378
-8979 741378 641929 576828 531638 497901 477591 451557 419440 370152 314185 263942 216800 179198 148990
-8966 148990 124506 101214 83647 69538 61153 54676 48199 45225 42251 42139 42028 43287 44547 37220 29894 22806
-8950 22806 15718 8629 1541 -4711 -10964 -12447 -13931 -12451 -10972 -9492 -8013 -5400 -2788 3878 16269 34712
-8934 34712 62696 106182 174473 264587 371873 498121 624369 743051 821665 849358 825533 757704 653623
-8921 653623 529030 410161 301510 206216 135727 86226 50618 28366 11003 -6358 -15984 -16066 -21518 -26967
-8907 -26967 -30093 -33216 -39205 -45190 -50545 -55896 -64114 -72327 -68858 -65385 -66685 -67982 -71668 -75350 -76173 -76993 -78174
-8890 -78174 -79352 -72543 -65731 -55479 -54764 -57272 -59776 -62344 -64908 -62705 -60499 -60886 -61274 -61662 -62049 -65001 -67952 -66134
-8872 -66134 -64315 -64695 -65075 -68317 -71560 -72536 -73512 -74489 -75465 -80079 -84692 -89306 -93919 -97102 -100285 -96789 -93293 -84454
-8854 -84454 -75614 -65821 -65567 -67341 -63391 -57175 -56683 -56862 -57041 -55073 -53105 -53880 -60380 -63659 -66939 -67088 -67237 -67386 -67535
-8835 -67535 -68638 -69741 -73945 -83872 -93577 -97557 -102252 -106948 -107827 -108707 -109586 -110466 -104578 -98690 -93159 -87629 -84185 -86466
-8817 -86466 -88389 -90312 -86030 -81748 -77824 -73900 -60972 -53769 -52528 -51287 -42115 -42484 -46431 -50377 -53549 -62444 -60130
-8800 -60130 -63540 -67785 -72029 -76632 -81234 -82915 -84595 -86634 -88672 -84510 -86071 -84413 -82754 -80023 -77291 -81238 -85184
-8783 -85184 -85236 -85289 -81167 -77045 -73102 -78700 -79289 -79877 -77902 -81651 -79318 -76986 -76203 -75420 -77858 -80295 -76687 -78804 -77701
-8764 -77701 -76598 -76151 -75704 -72394 -69085 -63510 -57935 -55818 -53701 -56236 -68310 -79788 -91266 -96319 -101373 -97840 -94307
-8747 -94307 -87733 -81159 -74824 -74213 -70919 -77164 -78402 -79639 -86600 -93562 -93845 -94128 -87852 -81577 -72081 -68310 -65493 -62675
-8729 -62675 -62362 -67773 -65045 -71858 -73661 -75465 -74765 -74064 -73006 -77671 -80224 -82777 -85687 -88598 -86321 -84044 -75446 -66849
-8711 -66849 -59996 -58867 -57737 -56608 -52617 -54350 -50597 -46844 -43941 -50579 -58885 -67192 -71623 -81778 -91218 -91117 -81372
-8694 -81372 -71627 -58662 -51421 -47817 -53754 -61360 -68966 -72126 -75286 -74273 -73259 -64673 -65627 -65985 -66342 -67773 -69204
-8677 -69204 -67416 -71351 -65925 -60499 -51018 -41538 -33913 -32012 -32020 -41568 -48969 -56370 -58047 -59724 -62862 -71724 -74861 -77999
-8659 -77999 -79110 -85944 -96595 -116786 -127541 -138293 -139746 -146920 -150520 -154116 -155212 -156304 -146577 -136847 -114122 -85669
-8643 -85669 -43505 -1338 39274 62718 77222 74558 69981 65409 61846 58287 63311 68338 89639 110945 134631
-8628 134631 152597 168473 170996 165406 154095 141973 124126 105921 78176 59733 41290 34295 27300 36136
-8614 36136 39248 43194 41416 39758 24743 6390 -11963 -21291 -30619 -17408 1526 29346 57165 89636 112566
-8599 112566 129324 128911 124204 113773 101375 83252 67633 52015 46705 35674 27024 18378 4124 -23482 -50258
-8584 -50258 -82754 -102972 -113645 -101783 -84193 -59571 -34945 -9966 9293 27729 40444 56375 66586 80371
-8570 80371 94160 112834 125788 137516 135891 130685 119758 109782 105533 115234 124938 129693 124908 118096 101743
-8555 101743 89446 71423 64611 52075 53223 63911 104650 170195 256847 330142 389843 428556 453271 460813
-8541 460813 462036 453718 449335 444953 454165 480550 524017 567485 607733 630808 643509 631405 619300 593840
-8527 593840 561452 523339 497152 476689 468390 465815 470275 474736 498516 543284 619416 705088 781219 824914
-8513 824914 845951 838368 803207 747057 691027 634997 606872 588287 597488 627678 703005 810768 944767
-8500 944767 1065410 1168642 1247069 1314525 1372441 1452709 1565418 1715330 1905315 2140254 2396185 2664276
-8488 2664276 2922831 3200195 3506182 3893496 4420102 5145974 6022587 7012962 8012881 8971006 9892882
-8477 9892882 10867464 12019497 13655097 16036746 19558686 24742536 32454451 44110294 62053857
-8468 62053857 89135041 127113425 169943962 206473074 225282167 215672461 185276519 144733466
-8460 144733466 105751212 75949510 55127057 41018533 31332860 24680644 20016613 16761669 14411141
-8451 14411141 12730691 11534888 10741202 10172667 9695381 9122695 8347277 7392506 6391223 5447185
-8441 5447185 4686315 4097173 3683835 3388800 3187732 3028646 2889470 2731218 2572128 2407317 2253410
-8430 2253410 2110951 2005580 1926922 1896561 1877648 1858735 1805478 1732275 1624728 1507163 1370518 1226122
-8418 1226122 1070277 925404 791978 691072 616878 588477 579157 600365 610125 612611 588384 556763 519419
-8405 519419 486009 441152 390093 319954 253153 186353 141619 96888 71591 52023 54512 68453 99325 124476
-8391 124476 147387 135958 111645 68256 29991 -2546 -18272 -33995 -26326 427 69154 137884 200172 235750
-8377 235750 261069 259679 249609 220463 187378 148573 118946 89323 73291 57262 57076 51169 42516 22418
-8363 22418 9352 -3709 2544 8801 17529 26260 32126 37995 42072 46153 56908 67667 84258 100853 127938
-8348 127938 143579 162436 169848 165331 141738 111671 70160 48203 26249 16277 6308 -4499 -15302 -31450
-8334 -31450 -60954 -85807 -110660 -126390 -142120 -142586 -137327 -116686 -90320 -57514 -34248 -7763 5365 8954
-8320 8954 -4629 -19167 -39428 -52774 -66119 -66346 -66573 -59646 -58442 -58371 -71656 -86731 -111345 -132859 -154373 -164677
-8304 -164677 -180706 -189907 -199104 -197930 -191028 -167793 -150278 -131574 -122406 -114614 -123990 -132893 -141792 -147117 -152439 -154068
-8288 -154068 -155692 -137115 -105178 -63704 -22226 15073 35204 54259 56144 58876 55887 49675 43466 39579 26156
-8273 26156 21315 10754 2261 -6231 -7450 -14393 -18175 -27682 -28960 -39779 -49271 -58762 -63126 -77030 -83183 -83612
-8257 -83612 -71996 -60380 -47825 -40994 -30704 -29955 -29385 -34539 -31703 -38407 -40103 -41799 -34192 -26586 -20471 -23896
-8241 -23896 -17661 -24783 -31360 -43658 -46897 -50131 -44247 -38359 -25558 -26109 -21596 -26620 -28666 -36432 -37703 -38970 -32728
-8224 -32728 -36022 -34424 -38545 -39689 -46554 -43166 -39775 -33525 -32996 -27432 -21865 -11650 -10972 -7435 -9619 -10733 -17568
-8207 -17568 -18410 -19252 -15682 -12112 -4428 3256 10940 18624 19899 21173 25310 29446 46701 63955 92896 121838
-8191 121838 150563 167839 191556 215272 243818 272364 318560 376204 473976 606093 803561 1096431 1574858
-8178 1574858 2316595 3513401 5271171 7292088 7935401 6542826 4665613 3190874 2208414 1564628
-8168 1564628 1138363 845776 648596 508175 409736 343610 296569 262642 240166 226050 211937 202113 180845
-8155 180845 147589 114336 81079 47826 25929 15483 12904 10329 13355 16385 19411 22440 16977 11518 3192
-8140 3192 -5128 -11903 -18675 -10424 -13618 -16569 -19517 -23184 -26847 -30634 -34416 -38202 -41985 -48022 -54056 -64863 -75666
-8123 -75666 -79378 -83086 -82028 -80966 -74369 -67770 -65944 -64114 -64732 -65347 -59526 -65150 -68575 -71999 -71370 -70740 -73509 -76278
-8105 -76278 -72368 -68459 -62940 -57421 -60488 -63555 -61613 -59672 -62500 -65329 -67501 -69674 -68984 -68295 -70706 -73117 -71474
-8088 -71474 -69830 -65683 -72983 -76706 -80429 -82542 -84655 -81998 -79341 -79870 -80395 -80925 -81450 -80787 -80120 -82318 -84513 -81882
-8070 -81882 -79248 -76974 -74697 -73259 -77541 -78607 -79669 -79378 -79084 -72353 -71343 -79102 -81133 -80068 -78998 -72327 -65653
-8053 -65653 -60532 -61132 -59172 -57208 -60376 -63540 -65172 -66804 -65217 -69353 -69376 -69398 -69778 -70158 -66953 -63749 -57324 -56623 -55684
-8034 -55684 -54745 -50944 -52867 -54193 -55520 -57205 -58889 -59918 -60946 -61975 -63003 -63443 -63883 -60149 -56414 -53754 -60633 -62146
-8016 -62146 -63659 -61468 -59277 -59947 -60618 -61349 -62079 -62809 -63540 -59470 -55401 -54909 -48693 -36037 -29106 -23367 -17628 -5143
-7998 -5143 7340 25787 53774 91778 143139 212149 298332 404280 523585 647899 755040 828969 855197
-7985 855197 831339 755964 647317 525318 403792 291810 202303 137605 87929 51613 28709 15349 7947
-7972 7947 550 -4107 -8762 -16998 -19506 -21280 -28774 -32694 -36611 -40889 -45164 -48488 -57532 -67117 -67158 -58975 -50787 -40338
-7954 -40338 -35609 -41974 -48335 -59694 -71049 -77638 -84223 -89977 -95727 -96711 -97691 -95276 -92857 -87580 -82300 -79825 -77347
-7937 -77347 -74873 -72394 -72141 -71884 -68768 -65649 -63965 -62277 -67270 -72260 -72961 -73658 -74358 -75055 -71463 -67866 -67136 -66402 -67460
-7918 -67460 -68519 -69577 -70635 -74198 -77761 -81323 -84886 -88866 -92846 -92056 -91266 -86064 -80861 -78521 -76181 -77138 -78096 -79054
-7900 -79054 -80012 -79658 -79304 -78950 -78595 -77735 -76874 -78875 -80876 -81387 -81897 -79546 -77194 -78260 -79322 -75618 -71910 -77388 -82863
-7881 -82863 -81663 -80459 -81882 -83302 -81864 -80422 -82501 -84577 -83794 -83008 -83660 -84308 -84961 -85609 -82684 -79754 -81599 -83440
-7863 -83440 -79978 -76512 -73050 -69584 -73337 -77086 -80839 -84588 -82885 -81182 -79479 -77776 -78398 -79020 -76781 -74541 -73464
-7846 -73464 -72387 -71310 -70233 -70050 -69868 -76363 -82859 -87156 -91452 -92887 -94322 -97009 -99696 -95705 -91713 -88766 -85818
-7829 -85818 -82870 -79922 -79121 -78320 -77518 -76717 -76423 -76128 -82154 -88180 -92179 -90454 -89086 -87718 -88020 -88322 -88624 -88926 -84875
-7810 -84875 -80824 -81543 -82263 -80388 -78514 -79501 -80489 -82490 -84491 -83630 -82769 -84472 -86176 -87879 -89582 -90867 -92153 -90219
-7792 -90219 -88285 -86462 -78916 -79359 -79803 -85971 -92138 -96755 -95649 -95287 -94926 -89436 -83947 -78398 -72849 -67300 -61751 -60819
-7774 -60819 -59888 -61818 -63749 -65560 -67371 -72044 -76717 -79542 -82367 -90916 -89925 -84879 -85557 -88739 -91922 -91393 -85136 -81745
-7756 -81745 -78350 -81756 -79434 -79978 -80518 -75607 -64967 -64229 -63488 -65433 -67375 -66458 -65537 -68440 -71340 -72692 -68317 -67226
-7738 -67226 -66130 -64680 -63227 -62761 -62291 -64688 -67080 -73054 -79024 -82136 -85244 -84107 -82967 -85408 -82121 -82415 -88430 -91467
-7720 -91467 -84961 -84025 -83086 -81554 -80019 -78547 -77071 -75599 -74124 -77451 -80776 -87323 -88143 -89742 -91337 -87212 -77358 -73389
-7702 -73389 -69417 -65090 -60760 -59534 -58304 -63756 -69204 -70993 -72778 -74567 -76352 -77366 -78376 -74619 -70859 -70919 -70975 -73538
-7684 -73538 -76099 -84327 -86828 -91240 -86108 -88665 -91218 -92820 -94419 -96200 -92254 -91531 -90804 -92168 -93528 -94892 -96252
-7667 -96252 -98332 -100408 -97717 -95023 -93264 -91501 -95824 -94419 -91408 -88393 -85024 -81651 -84990 -88326 -94527 -100724 -102394
-7650 -102394 -104060 -102867 -101671 -101991 -102308 -102629 -102945 -104160 -105371 -103009 -106366 -111606 -111118 -114211 -117300 -119082 -120859 -121090
-7632 -121090 -115594 -109366 -103135 -100963 -98786 -100251 -95988 -94948 -93905 -92537 -91165 -94568 -97967 -98984 -99998 -101969 -109661
-7615 -109661 -114845 -110484 -108632 -112501 -111602 -110701 -110160 -109616 -104335 -99051 -96871 -100411 -105863 -105588 -105673 -105755 -107458 -103437 -99416
-7596 -99416 -101119 -100736 -100352 -103188 -106024 -104499 -102975 -104313 -105651 -98999 -92347 -90465 -88583 -88997 -89410 -92686 -95962 -95958 -95954
-7577 -95954 -98813 -101671 -98455 -95239 -92023 -88807 -91255 -93703 -96152 -98600 -98503 -98406 -98309 -98213 -93286 -88359 -88203 -88046 -87293 -86541
-7557 -86541 -85788 -85035 -89768 -94501 -99234 -103967 -101052 -98138 -98086 -98034 -91900 -85766 -86310 -86854 -90200 -93547 -96893 -100240 -95835
-7538 -95835 -91430 -87025 -82620 -87092 -91564 -91266 -90968 -93890 -96811 -94963 -93115 -92190 -91266 -90342 -89418 -90998 -92578 -94158
-7520 -94158 -95738 -96849 -97959 -94300 -90640 -88829 -87018 -89977 -92936 -89902 -86869 -86697 -86526 -82896 -79266 -78499 -77731 -78871
-7502 -78871 -80008 -84010 -88009 -85870 -83727 -76818 -69905 -63503 -57096 -50694 -44288 -36991 -29691 -19532 -9369 2182
-7486 2182 13739 18613 23491 28843 34198 36687 39180 34694 30210 17137 4068 -8706 -21477 -34252 -47023
-7471 -47023 -53120 -59217 -62452 -65686 -71247 -76807 -73781 -70755 -70501 -70248 -76673 -83097 -86123 -89149 -89313 -89477 -88870 -88262
-7453 -88262 -87655 -87048 -88885 -90722 -89697 -88672 -91434 -94195 -94095 -93994 -96159 -98324 -93811 -89298 -88754 -88207 -90525 -92839
-7435 -92839 -88479 -84115 -86433 -88747 -90245 -91739 -90375 -89008 -91460 -93908 -93498 -93085 -89466 -85844 -85087 -84327 -85240 -86149
-7417 -86149 -84200 -82248 -80940 -79628 -81182 -82732 -83451 -84167 -87748 -91326 -89392 -87454 -92198 -96938 -99714 -102487 -99301
-7400 -99301 -96111 -90137 -95608 -94642 -93674 -90681 -87685 -87554 -87420 -84942 -82460 -79982 -77500 -77109 -76714 -73460 -70203 -63566
-7382 -63566 -56925 -55774 -54618 -53288 -63402 -69942 -76479 -79754 -83030 -86306 -89582 -92440 -95298 -91479 -87659 -87685 -87711 -90599
-7364 -90599 -93487 -99118 -104749 -107518 -110287 -110686 -111084 -111960 -101388 -88132 -86325 -82132 -77940 -73837 -69734 -65630 -61527
-7347 -61527 -61956 -62385 -62813 -63242 -62373 -61505 -63499 -65493 -66353 -67214 -59489 -51764 -44515 -37267 -32881 -28494 -23154 -17814 -3887
-7328 -3887 10038 28981 47923 76167 104412 147801 202639 268448 345705 440939 536174 624969 702315 764397
-7314 764397 807399 823808 805871 766250 701823 625591 539818 443432 356587 281428 215809 164769 130901
-7301 130901 106454 82007 61317 46351 32935 19519 11894 4269 -3354 -10979 -12045 -13111 -24075 -29314 -32706
-7286 -32706 -36097 -39130 -42164 -42216 -42268 -47090 -51913 -54652 -57391 -56552 -61438 -62746 -58330 -57134 -61662 -60450 -59239 -58386
-7268 -58386 -57532 -53400 -49267 -46446 -53165 -56828 -60491 -59981 -59470 -62836 -66201 -63484 -66491 -67874 -69257 -70639 -72022 -69409
-7250 -69409 -61073 -55598 -55848 -53109 -50366 -43572 -36775 -28789 -26523 -25811 -25096 -28096 -31092 -36954 -42812 -54160 -65504
-7233 -65504 -73751 -76270 -74030 -77511 -82188 -86861 -91300 -95734 -98623 -95783 -94959 -94132 -92235 -96059 -98216 -94646 -90245
-7216 -90245 -85840 -80354 -80593 -85840 -81547 -74511 -67475 -53761 -40047 -29493 -28480 -28778 -29076 -31342 -33607 -35873 -38139
-7199 -38139 -41091 -44042 -40673 -37304 -33279 -34979 -33458 -31938 -35799 -39659 -43520 -47381 -53508 -59634 -59441 -59247 -54134
-7182 -54134 -54745 -54998 -55252 -54193 -53135 -49215 -51018 -48454 -51615 -55133 -52926 -48037 -43148 -35038 -32653 -31379 -35828 -42186
-7164 -42186 -48544 -53590 -58636 -63324 -68012 -64322 -54909 -46449 -37990 -34599 -40748 -49878 -68548 -84182 -90275 -89928 -89582
-7147 -89582 -83213 -76844 -70475 -64106 -62448 -60790 -56269 -51749 -48719 -45689 -45522 -45354 -46990 -48626 -39768 -30909 -22409
-7130 -22409 -13908 -8628 -3347 -660 -3697 -9835 -15973 -24973 -28248 -24846 -27168 -30831 -34494 -29571 -24649 -15134 103
-7113 103 12121 24140 33207 42274 47882 47767 50454 53140 58332 63523 76235 88946 97842 101013 107166 107594 102299
-7096 102299 97003 92572 88141 90031 91920 104900 112156 117503 113311 110915 108518 114112 129246 141995 149020 154136
-7080 154136 153529 154412 149571 139602 129634 123421 126749 141645 166080 201077 241798 285262 319186 346730 374273
-7065 374273 392634 410996 432159 453323 478541 513300 562011 624078 690438 756799 826845 908339 996750
-7052 996750 1096610 1215430 1360963 1529870 1725489 1946658 2202172 2502525 2852487 3264103 3794017
-7041 3794017 4509966 5481592 6819288 8664523 11246263 14877427 19841122 26121366 32742197 37122983
-7031 37122983 36664463 31851787 25496936 19695416 15139373 11747236 9267621 7471086 6179061 5257196
-7021 5257196 4620584 4193857 3923828 3764465 3699550 3661349 3526045 3226650 2845924 2465199 2128716
-7010 2128716 1841842 1600046 1400227 1240477 1115071 1024488 960617 912726 876283 857847 850859 847449 838316
-6997 838316 825723 813131 799584 774590 734808 683578 634289 585004 541678 498356 460158 421963 383527
-6984 383527 333645 279527 225412 189659 180622 192420 215671 241780 262168 277306 286723 297568 308416 312731
-6970 312731 317051 315046 313044 323114 338911 353154 355953 348850 341751 332263 334227 341799 349376 355159 349499 338080
-6954 338080 320941 308092 295246 288449 287379 297873 327452 378760 456785 559730 656954 723833 764002 785803
-6940 785803 796160 796137 790395 778328 766264 769522 799495 852958 912148 966326 1001427 1017325 1033227 1034758 1024845
-6925 1024845 1005150 974010 945013 935100 938778 953909 971927 989949 1024424 1085616 1176140 1285748 1383904
-6912 1383904 1447719 1469405 1464381 1442301 1401144 1356405 1317395 1306882 1330718 1372944 1441887 1548033 1703792
-6899 1703792 1901405 2110470 2286141 2427470 2562099 2715808 2889075 3096687 3356054 3695559 4108047
-6888 4108047 4570144 5054839 5566247 6121540 6734074 7425554 8258229 9265490 10444474 11777839 13275296
-6877 13275296 14950201 16812094 18846308 21105669 23819148 27368346 32268890 39157613 48878828
-6868 48878828 62732869 82619301 110935476 149758302 198193847 246729428 274799315 266171815
-6860 266171815 227652887 179774280 137058846 103890798 79450137 61725428 48927292 39710552
-6852 39710552 33077304 28327416 24909340 22386139 20423901 18781851 17288627 15838813 14415710
-6843 14415710 13066306 11797039 10593122 9461712 8445292 7577698 6857978 6279453 5829244 5474437
-6833 5474437 5146105 4817772 4503407 4215754 3947898 3706754 3494946 3332747 3226359 3161948 3094048
-6822 3094048 2991804 2853784 2696683 2530400 2352669 2156334 1948551 1745270 1561069 1403581 1280438
-6811 1280438 1204280 1177731 1170501 1163272 1138422 1086861 1023254 965372 915360 865349 803173 721917 629206 546038
-6797 546038 480397 431932 382748 339291 308233 301984 317017 345410 365214 356400 320393 274850 232046 202601
-6783 202601 183618 164638 156984 185586 256161 347728 424505 472664 497357 501065 490578 470555 442657 414763
-6769 414763 387939 374475 376002 387071 406009 424948 432975 441003 448076 460873 489859 555098 646572 774299
-6755 774299 945732 1191579 1544038 2051049 2754521 3662153 4583142 5067189 4807457 4023012 3150559
-6744 3150559 2428842 1879951 1466532 1143506 898710 719145 598729 517309 456878 408573 360272 310417
-6732 310417 260566 216614 172665 126567 86196 63530 58041 63996 79495 101132 128497 146079 146493 136014
-6718 136014 115998 86557 62845 42348 21855 3625 -8877 -8535 -2464 -332 -11553 -36432 -61308 -87021
-6704 -87021 -112732 -127921 -143108 -154958 -149633 -134115 -109053 -78748 -57980 -54089 -59735 -76475 -93211 -113887
-6690 -113887 -128834 -132218 -122242 -109370 -90770 -68120 -20661 44323 115036 175252 210666 211851 199684 182981
-6676 182981 166282 147194 128109 116296 110210 104680 99153 85395 71640 63307 54978 50461 40224 25630 20581
-6661 20581 14573 8570 1787 -4990 -3425 11499 24766 32312 33415 34522 31332 28146 26864 31310 40820 56058
-6645 56058 83099 119684 152687 185694 201405 192316 160285 122531 79052 45113 22623 13489 10437 13109
-6631 13109 10623 8138 8872 9606 7895 6185 4474 2764 4392 6021 4787 3554 -6146 -15846 -25189 -34532 -35229 -30201
-6613 -30201 -21119 -6313 3423 13161 8588 4016 -4290 -18321 -29489 -34934 -39484 -44035 -48227 -52420 -57328 -62236
-6597 -62236 -61419 -54879 -48995 -37386 -22319 -7253 7694 16917 14454 6267 -4305 -14877 -26165 -31729 -42719
-6582 -42719 -53709 -55397 -47545 -32478 -17411 -1748 13914 22425 30937 30266 23871 19683 15494 17626 29297 46693
-6566 46693 58365 66579 74792 80979 77625 65684 53744 41580 35141 20711 6282 -3317 -12917 -20967 -23292
-6551 -23292 -29702 -36112 -42164 -48216 -53493 -58770 -60588 -56683 -59344 -62004 -59537 -57070 -56631 -56191 -63741 -65567 -62072
-6534 -62072 -58576 -50310 -42045 -40218 -44117 -50877 -51913 -54924 -57935 -57726 -57518 -59098 -60678 -62258 -63838 -55356 -46874
-6517 -46874 -42209 -31819 -27511 -32743 -37021 -41299 -45972 -50642 -57819 -64993 -69786 -68850 -67680 -60782 -58956 -57126 -50530
-6500 -50530 -43930 -38407 -38605 -40356 -42104 -50579 -59049 -62754 -66454 -63838 -61218 -62537 -63853 -58166 -39119 -9820 19481
-6483 19481 37809 50416 49664 39374 24613 9852 -2643 -15138 -31807 -48477 -54056 -59634 -55822 -42469 -24824
-6468 -24824 -7178 2238 -1700 -11125 -26273 -38754 -51234 -71824 -92414 -103463 -101157 -91456 -81756 -72741 -54186
-6453 -54186 -33007 -11829 2074 6438 16168 25899 28138 30382 29402 34150 36687 39229 42125 45024 48635 52250
-6437 52250 57411 68301 76622 84947 95177 111135 130263 149396 176157 208646 240058 271474 307059 359821
-6423 359821 430616 518588 634937 787544 977711 1215583 1502345 1829179 2177960 2521020 2833548 3073574
-6411 3073574 3220102 3248335 3163990 2984246 2735243 2451898 2176659 1935769 1745915 1613306 1544135 1539842
-6399 1539842 1574973 1629189 1688170 1728075 1742695 1722973 1655070 1552826 1433375 1302481 1184461 1093159
-6387 1093159 1033692 1000943 1000268 1026310 1072025 1123464 1167628 1192712 1189056 1151056 1080380 982992 868848 754704
-6373 754704 646046 548837 471423 413090 375507 349372 328536 307700 284003 260305 232553 193352 156536
-6360 156536 119721 84187 60102 49611 39121 32446 25772 25776 25779 31097 36419 34224 20585 5212 -4431 -11098
-6344 -11098 -12038 -12444 -18570 -24343 -24388 -19189 -13987 -8430 -2870 -1145 584 1951 -2400 -17251 -43546 -63763 -83977
-6327 -83977 -100616 -117252 -125663 -122622 -110939 -93528 -74690 -67296 -55885 -38746 -27693 -28085 -43625 -59161 -71839
-6312 -71839 -84513 -82389 -68813 -45820 -22822 3748 24598 38528 41014 24512 2290 -14568 -31424 -42440
-6298 -42440 -53452 -72338 -91221 -108483 -114293 -101384 -94195 -88739 -83280 -68284 -53284 -43699 -43651 -38240 -32825 -34271
-6282 -34271 -35713 -40021 -44325 -35098 -25867 -9246 1653 2294 -6600 -10849 -15093 -16577 -23780 -28364 -32944 -34308 -45208
-6265 -45208 -55516 -65821 -70643 -75461 -70028 -55051 -40315 -35117 -18593 -2065 15971 13019 -8892 -47977 -86466
-6250 -86466 -115415 -126237 -127519 -114103 -94963 -68906 -48574 -36171 -29493 -15183 -10413 -5441 -10010 -19111 -37751
-6235 -37751 -38564 -14572 42810 113549 178386 229866 263696 268906 261117 236156 210480 184803 158646 132492
-6221 132492 106812 67779 28027 -17445 -53739 -76673 -81990 -87305 -84990 -69316 -26635 16049 49667 58485
-6207 58485 47852 37224 31243 15725 2052 1739 15971 24483 29025 24032 10210 -13148 -28401 -30294 -5240
-6192 -5240 25541 59576 80259 87463 69866 37477 5093 -7141 -6015 6882 14059 16701 13623 21095 38111
-6177 38111 58701 62122 63579 59316 62084 78213 113240 148271 185802 206164 212600 198051 175747 153447 129533
-6162 129533 99899 73838 47782 36046 30039 35595 22075 -12019 -57559 -98213 -133139 -158827 -184511 -201970
-6148 -201970 -207977 -192284 -176588 -162684 -143052 -92403 15490 179787 355536 507907 603041 653332 661650
-6135 661650 650287 619848 593102 572084 578728 612089 683727 782080 899883 990978 1059172 1093025 1100161 1065324
-6121 1065324 1012358 940314 861618 756214 653191 569251 542312 549720 583122 616528 646255 664538 674947
-6108 674947 673911 675256 665157 654815 644478 677127 751757 857388 963024 1074261 1158789 1221609 1250088
-6095 1250088 1251046 1225291 1190234 1128465 1052982 977498 931828 905239 899071 881455 840943 735557 582947
-6082 582947 441785 379807 382703 431436 499250 584236 657774 713663 758103 797296 825041 867544 921494
-6069 921494 1007047 1092600 1189362 1280400 1354624 1371606 1353681 1309043 1274423 1258883 1290805 1334176 1363236
-6056 1363236 1350320 1318263 1267126 1230657 1199912 1164994 1088098 1038988 1070016 1220886 1497686 1905665 2279299
-6043 2279299 2503509 2624685 2725826 2784990 2804890 2775181 2719952 2664724 2701796 2857167 3102217 3347267
-6031 3347267 3546769 3666137 3741378 3782278 3805048 3785845 3711304 3571894 3452634 3398251 3412315 3426383
-6019 3426383 3433054 3458809 3577816 3830389 4227873 4667339 5080564 5375495 5526007 5520063 5405834 5173309
-6007 5173309 4919047 4744927 4720108 4752534 4845536 5064473 5510940 6182560 7031666 7831166 8416484 8769026
-5995 8769026 9091630 9463848 9900935 10364739 11006912 11973455 13265316 14660216 16099592 17603846
-5985 17603846 19279344 21118938 23301490 26045011 29464930 33338966 37539992 42042493 47162239
-5976 47162239 52949807 59240642 65863491 73614459 83971812 99159987 121220923 153067261 199708605
-5967 199708605 269328176 372449166 520516501 713785442 910102308 999999999 917880279 737828415
-5959 737828415 555766369 412578829 310155255 238844203 189918921 157269251 136785284 126242223
-5951 126242223 124829894 132732646 150994160 179784279 213018210 230709221 215887629 180989617
-5943 180989617 145958143 118593200 98864258 85191431 76532007 72440430 72697763 77637435 88419120
-5934 88419120 107210783 137088174 182165056 243900352 310134792 342976116 315687316 253464734
-5926 253464734 191551223 143830688 110195363 86890062 70884941 60178930 53636269 50663936
-5918 50663936 50862778 53227724 55085129 52916919 46890649 39976179 33882170 28937073 25033765 21969045
-5908 21969045 19419495 17203496 15296601 13726474 12488348 11552187 10803016 10073401 9240752 8368273
-5898 8368273 7575932 6912383 6336605 5816488 5384141 5137351 5077549 5110765 5109636 4984484 4710504 4340564
-5886 4340564 3951543 3563595 3169923 2800101 2479889 2245420 2190306 2367229 2639554 2879442 3046824
-5875 3046824 3113438 3069385 2935893 2729895 2494583 2259272 2039463 1831102 1646711 1504297 1409585 1341584
-5863 1341584 1277639 1194613 1115403 1062906 1072420 1139175 1215948 1250744 1228089 1155826 1079269 1021793 991745
-5850 991745 1011307 1058057 1116256 1232919 1414455 1595992 1712654 1737015 1643078 1447060 1231961 1086141
-5838 1086141 989931 918286 846641 785013 711937 645301 590113 538443 452428 360213 287077 252103 259105
-5825 259105 315478 398564 508407 618249 701618 727746 709750 657409 589923 516713 467384 437134 435387
-5812 435387 445087 468263 479991 454273 363682 237885 112089 16344 -60320 -130485 -200651 -273917 -335734
-5799 -335734 -363416 -356753 -300003 -224173 -155916 -114371 -86660 -70397 -65589 -79863 -97832 -121526 -149275 -157943
-5785 -157943 -107462 30788 235374 445683 612943 715329 766078 774851 774918 755904 706683 628844 536334
-5772 536334 443827 365747 287670 222230 189230 194567 220896 252945 271641 284968 288758 288013 270099 231610
-5758 231610 183584 140564 107087 96265 106435 138663 188068 256966 325868 385107 415729 425239 417581 411707
-5744 411707 411562 419973 428384 444427 460471 468762 456066 422738 379871 351820 344758 359877 380720 394289 386869
-5729 386869 361562 322898 283138 237654 200280 176262 170847 178788 189592 194671 201897 203399 192618 181837
-5715 181837 188228 211791 249785 282054 299882 300541 293923 277768 263637 249509 235139 220773 209622 204200
-5701 204200 195554 186912 185660 184412 179701 169270 159879 150492 156484 175837 220825 256276 267635 250377 227958
-5686 227958 211266 200414 189566 176329 168819 180268 197444 224138 245108 261307 271783 277250 265545 234520
-5672 234520 186323 139975 106983 101658 113505 134475 142088 145528 148968 154628 154565 157721 160878 163736 166595 172315
-5656 172315 172311 165421 152806 143053 133301 126410 119520 119307 119095 133901 148710 171506 194306 205415 206988 206291 199874
-5639 199874 185850 166106 146717 136871 137039 137210 129388 121569 127782 133998 138540 133547 126999 114731 97808 75165
-5623 75165 53562 31962 11313 207 3170 6136 22098 38062 69094 100130 128061 135008 125016 105489
-5609 105489 91920 84079 85566 92781 100350 107922 122765 143337 163069 169449 175423 175676 163047 144697 124077
-5594 124077 97737 73898 55786 50431 45080 31496 17916 13694 9475 15747 22023 24274 26525 28179 29834
-5579 29834 39300 39225 32592 20234 8503 13944 27494 46768 61749 67190 73227 79264 83379 81769 74435 57560
-5563 57560 36989 16418 -1886 -20191 -30596 -41001 -33279 -25558 -15153 -4748 5059 14868 24594 24781 23655
-5548 23655 22530 21703 20875 15278 9680 3606 -2468 401 12811 21285 29760 41692 53625 64783 75940 82328
-5532 82328 88715 88544 88372 83431 78489 76141 73794 80032 86270 97040 107810 127167 146523 167418 188313 200623
-5516 200623 212932 236331 259731 292909 335628 390242 458212 550510 675245 841479 1051599 1312759 1625436
-5503 1625436 1969104 2322311 2651431 2921400 3105508 3184673 3140531 2991446 2762790 2471169 2153073
-5492 2153073 1844518 1561602 1318755 1129572 991906 900960 850084 826517 820122 821359 822596 823237 806706
-5479 806706 771989 723915 670475 617035 566934 526373 508351 518949 557349 612920 689719 783690 889825
-5466 889825 990236 1069181 1119506 1125051 1086712 1013908 912483 796748 681014 572792 485558 417383 366380
-5453 366380 328972 291564 257256 222949 191504 160058 121308 82559 44047 11260 -14847 -31416 -36656 -28539
-5439 -28539 -4234 20070 31854 37913 36043 28448 23715 18982 17231 15479 7049 -1379 -11419 -21459 -22554 -23650
-5423 -23650 -23434 -17493 -12507 -7521 -5874 -13767 -26788 -39809 -46658 -53508 -65127 -76747 -86399 -96051 -98429 -95082
-5407 -95082 -87785 -80489 -72834 -65180 -62057 -58934 -55811 -52688 -49058 -45428 -41441 -43177 -49028 -54879 -63592 -62765 -58814
-5390 -58814 -54860 -43994 -33123 -30723 -34043 -40230 -40688 -37692 -34692 -36108 -37520 -43051 -48577 -54108 -59634 -59411 -59183
-5373 -59183 -54190 -49192 -47657 -46118 -41363 -42328 -47858 -53385 -54503 -55617 -62221 -68821 -76020 -73676 -69782 -65888 -61397
-5356 -61397 -56906 -55934 -54961 -55181 -61125 -66413 -65977 -64349 -62720 -58587 -54454 -51872 -55013 -56336 -57659 -56478 -55297 -57216
-5338 -57216 -59135 -62604 -71798 -82035 -92272 -93923 -95574 -91143 -80988 -69283 -57577 -51600 -45622 -41195 -42492 -44385
-5322 -44385 -46278 -51391 -56504 -64837 -73169 -78044 -77194 -76464 -75733 -67967 -60201 -58531 -56862 -58650 -66163 -71411 -76658 -77492
-5304 -77492 -78327 -79788 -81249 -83067 -79162 -71619 -64076 -56176 -48275 -46297 -44314 -45197 -46077 -46841 -47601 -51585 -49841 -51648
-5286 -51648 -53452 -50489 -47523 -48078 -54354 -57055 -59754 -59176 -52870 -46569 -45987 -46543 -47094 -52777 -58457 -62977 -67494 -72014
-5268 -72014 -76531 -79680 -82825 -83112 -83395 -79099 -74798 -75271 -75741 -75499 -75253 -79781 -84305 -83943 -83578 -83574 -77843 -71459 -65072 -70375
-5248 -70375 -75674 -77504 -73606 -72931 -72253 -70565 -68873 -73266 -77656 -77817 -68433 -55595 -37028 -18824 -6340 -3280 -5941
-5231 -5941 -16517 -27089 -38620 -40606 -45518 -50426 -54383 -58337 -60954 -57842 -55092 -52338 -49707 -47072 -51119 -55162
-5215 -55162 -53664 -52166 -50668 -49170 -51130 -53090 -51831 -56295 -64397 -72499 -77500 -76777 -72417 -68057 -68109 -68161 -61341 -54521
-5197 -54521 -50802 -52807 -54931 -51331 -51309 -51287 -53620 -55952 -58285 -60618 -61401 -62183 -59746 -47769 -32050 -16327 -12
-5180 -12 10582 2331 -11639 -30742 -44117 -55349 -66577 -72324 -78066 -81487 -79181 -75685 -72186 -66808 -67155 -67501 -62124
-5163 -62124 -63901 -65679 -67099 -68519 -64751 -60983 -61986 -62988 -65481 -67975 -70825 -67952 -64960 -61967 -63029 -64091 -67658
-5146 -67658 -65500 -66562 -67624 -72681 -77738 -82795 -87852 -87424 -86995 -86567 -86138 -86533 -86925 -86962 -86995 -85363 -78003 -71004 -64002
-5127 -64002 -62221 -60436 -65332 -70225 -71425 -72622 -70960 -69294 -64971 -60644 -61091 -61535 -60432 -59325 -59772 -65940 -76046
-5110 -76046 -86149 -89578 -93003 -98936 -99141 -95891 -92638 -89682 -86723 -81264 -75801 -67956 -65832 -68481 -65403 -60927 -56448
-5093 -56448 -54834 -62757 -66868 -70975 -69003 -67028 -69275 -71519 -76628 -81733 -85710 -89682 -94255 -89284 -89891 -90495 -90864 -91229
-5075 -91229 -91180 -96852 -99666 -96752 -96964 -97173 -99532 -101887 -107704 -107794 -100970 -94143 -90361 -92298 -93524 -94747 -95019 -89563 -84826
-5056 -84826 -80086 -78137 -81909 -85326 -88739 -92336 -95928 -92846 -89761 -85665 -81566 -77470 -73371 -73688 -74001 -74317 -74630 -75219
-5038 -75219 -75808 -73535 -71261 -69883 -68504 -67125 -65746 -67050 -68355 -69301 -70248 -70837 -65701 -64144 -62586 -65914 -74966 -80440
-5020 -80440 -85915 -86440 -81241 -79263 -77284 -75782 -74280 -69916 -65552 -67032 -68511 -66771 -70755 -75692 -80627 -83060 -85490
-5003 -85490 -81364 -77235 -73110 -68981 -69223 -69461 -72566 -75666 -75014 -74358 -73706 -73050 -75622 -78189 -80761 -83328 -83992 -84651 -88177
-4984 -88177 -91698 -93718 -95734 -92984 -90230 -85989 -81745 -82274 -82799 -84577 -86351 -88128 -89902 -91203 -92500 -87122 -81741
-4967 -81741 -85576 -89407 -93241 -97072 -94825 -92574 -90327 -88076 -86067 -84055 -86816 -89574 -93349 -97121 -96126 -95127 -97709
-4950 -97709 -100288 -100009 -99726 -96524 -93319 -92980 -92638 -92302 -91963 -91628 -91288 -87375 -83459 -82408 -81353 -81853 -82348 -82848 -83343 -87599
-4930 -87599 -91851 -93245 -94635 -92652 -90666 -85821 -80973 -83045 -85113 -87185 -89254 -90998 -92738 -94482 -96223 -96595 -96964
-4913 -96964 -97337 -97706 -100068 -102431 -101932 -101432 -101589 -101745 -95224 -88702 -82628 -76553 -75249 -73945 -72163 -70382 -68601 -66819
-4895 -66819 -69652 -72484 -75316 -78148 -74064 -69979 -68757 -67535 -67848 -68161 -71336 -74511 -78044 -81577 -82248 -82918 -84577 -86235
-4877 -86235 -90756 -95276 -97292 -99308 -101324 -103340 -101496 -99651 -97806 -95962 -93998 -92034 -92932 -93830 -96204 -98578 -98090 -97601
-4859 -97601 -97888 -98175 -98462 -98749 -95876 -93003 -85359 -77716 -76930 -76143 -72495 -68847 -64427 -60003 -62262 -64516 -63555 -62590 -61628
-4840 -61628 -60663 -62653 -64639 -66629 -68616 -72931 -77243 -78696 -80146 -83604 -87059 -90517 -93972 -91587 -89198 -89675 -90148 -88151
-4822 -88151 -86149 -84152 -82151 -83731 -85307 -86887 -88464 -87204 -85944 -89455 -92965 -91288 -89611 -90797 -91982 -88874 -85766
-4805 -85766 -87428 -89090 -92302 -95514 -98727 -101939 -102685 -103430 -104175 -104921 -105129 -105338 -102685 -100031 -96185 -92339 -88493 -84648
-4787 -84648 -81636 -78625 -75614 -72603 -72987 -73371 -78525 -83679 -89608 -95537 -98604 -101671 -102204 -102737 -98500 -94262 -95749 -97236
-4769 -97236 -93953 -90670 -92604 -94538 -93610 -92682 -97717 -102752 -101108 -99465 -103024 -106583 -113004 -119425 -118094 -116764 -108755
-4752 -108755 -100747 -98332 -95917 -98272 -100627 -101492 -102357 -100359 -98362 -95306 -92250 -89194 -86138 -88687 -91236 -96647 -102058
-4735 -102058 -102237 -102416 -102595 -102774 -101641 -100508 -99375 -98242 -94575 -90908 -90103 -89298 -86645 -83992 -84200 -84409 -85553 -86697 -90703
-4716 -90703 -94710 -94780 -94851 -83474 -77820 -80977 -89857 -94326 -93070 -94557 -96044 -100035 -104026 -100795 -97564 -99103 -100642 -103076
-4698 -103076 -105509 -104485 -97736 -93029 -88322 -80395 -78193 -79210 -85952 -93051 -94426 -97322 -100218 -105617 -111017 -113078 -115139
-4681 -115139 -115650 -110436 -108055 -105673 -102934 -100195 -100437 -100680 -97344 -99733 -107555 -109653 -108889 -113850 -116961 -114349 -115314 -116279
-4663 -116279 -111774 -107268 -102405 -97542 -98105 -92943 -87782 -88344 -91847 -95347 -94437 -93524 -97982 -102435 -102122 -101805 -103519 -105230
-4645 -105230 -106586 -107939 -109594 -105521 -104671 -103817 -104250 -104678 -105111 -105539 -109728 -113913 -111781 -109646 -106575 -109225 -108658 -108088 -109132
-4626 -109132 -110171 -111215 -112255 -108688 -105118 -101552 -97982 -99364 -100743 -102126 -103504 -99714 -95921 -98809 -101693 -105834 -109970
-4609 -109970 -109340 -108707 -110596 -112482 -109601 -106717 -106042 -105364 -104689 -104011 -105439 -106862 -105427 -103989 -105357 -106721 -108088 -109452
-4591 -109452 -108345 -107239 -106132 -105025 -101772 -98518 -100035 -101552 -104619 -107686 -107891 -108096 -108360 -108625 -108889 -109154 -108040 -106925
-4573 -106925 -102949 -98973 -95414 -91855 -88296 -84737 -87424 -90111 -92798 -95485 -96562 -97639 -101578 -105517 -104309 -103098 -101891
-4556 -101891 -100680 -99591 -98500 -94549 -90595 -91520 -92440 -93722 -95000 -93480 -97680 -101526 -95828 -92883 -95660 -95816 -101693
-4539 -101693 -100419 -93416 -94765 -96111 -100352 -104589 -104060 -103527 -101626 -99722 -97821 -95917 -96536 -97150 -100631 -104108 -103176 -102241
-4521 -102241 -104172 -106098 -105494 -104887 -104283 -103676 -104145 -104611 -105081 -105547 -107656 -109761 -107101 -104436 -103922 -103404 -102890 -102372 -100158 -97941
-4501 -97941 -98589 -99234 -102506 -105774 -106184 -106590 -105222 -103855 -102487 -101119 -103449 -105778 -108107 -110436 -111111 -111785 -109598 -107410
-4483 -107410 -108263 -109117 -107108 -105099 -106370 -107641 -106050 -104458 -105968 -107477 -104216 -100955 -99200 -97445 -98552 -99659 -98559
-4466 -98559 -97460 -96360 -95261 -89515 -83764 -84696 -85624 -87092 -88557 -85255 -81949 -81704 -81454 -87886 -94315 -96692 -99066 -101444
-4448 -101444 -103817 -101410 -99003 -96595 -94188 -95179 -96170 -100024 -103877 -104019 -104160 -104302 -104444 -102916 -101388 -99860 -98332 -97232
-4430 -97232 -96133 -99804 -103475 -99811 -96148 -89623 -83097 -83489 -83880 -87133 -90387 -87320 -84253 -81186 -78118 -74850 -71578
-4413 -71578 -68310 -65038 -66599 -68157 -69719 -71276 -70512 -69745 -73751 -77753 -84562 -91367 -93405 -95440 -97113 -98786 -95690
-4396 -95690 -92593 -90987 -89380 -87774 -86168 -85128 -84089 -87819 -91549 -92775 -94001 -95228 -96454 -94042 -91631 -92082 -92533
-4379 -92533 -89466 -86399 -86194 -85989 -87335 -88680 -85255 -81830 -84547 -87264 -87118 -86973 -89220 -91467 -93715 -95962 -97613 -99263
-4361 -99263 -96144 -93025 -93618 -94210 -94803 -95395 -97300 -99204 -98246 -97288 -100169 -103046 -105927 -108804 -106020 -103232 -100449 -97661
-4343 -97661 -99111 -100557 -102006 -103452 -104902 -106348 -107798 -109243 -110112 -110976 -111845 -112709 -113697 -114681 -112806 -110928 -106743 -102554
-4325 -102554 -101231 -99904 -104485 -109061 -108871 -108677 -107138 -105599 -104060 -102521 -102353 -102185 -97247 -92310 -94885 -97460 -95265 -93070
-4307 -93070 -96957 -100844 -99960 -99077 -100344 -101608 -100013 -98414 -94434 -90450 -91240 -92026 -92846 -93662 -89712 -85758 -87592 -89421
-4289 -89421 -88393 -87361 -88464 -89563 -90666 -91765 -93405 -95041 -96681 -98317 -94829 -91337 -87849 -84357 -84566 -84771 -87841
-4272 -87841 -90908 -92168 -93428 -91825 -90223 -89515 -88807 -88098 -87390 -89291 -91192 -90230 -89269 -89380 -89492 -89604 -89716 -97952 -106188
-4253 -106188 -105837 -105487 -98399 -91311 -88993 -86675 -84551 -82426 -86980 -91534 -94598 -97661 -95954 -94247 -97736 -101224 -107932
-4236 -107932 -108916 -110436 -111956 -107037 -107842 -108766 -109691 -109780 -104145 -100061 -101701 -106203 -104980 -97542 -95828 -95306 -94784 -95097 -95410
-4217 -95410 -98585 -101760 -104906 -108051 -107738 -101701 -100374 -99047 -97363 -95678 -98857 -102032 -103661 -99562 -95526 -91486 -90551
-4200 -90551 -95336 -98664 -101988 -104481 -101246 -98492 -101458 -100851 -100240 -100236 -100229 -94501 -98309 -102599 -101160 -103542 -105919 -104812 -103702
-4181 -103702 -102595 -101485 -99126 -96763 -91184 -91326 -97244 -103158 -102398 -101634 -100873 -94385 -87901 -87137 -92965 -98790 -98298 -97803
-4163 -97803 -94985 -92164 -94117 -96066 -97221 -98373 -99170 -105688 -106486 -107280 -108435 -109586 -108565 -107540 -106519 -105494 -100419 -95339
-4145 -95339 -95034 -94724 -92902 -91076 -97244 -97683 -97948 -98209 -98116 -98019 -99863 -101704 -98779 -95850 -98112 -100370 -99174 -92250 -88997
-4126 -88997 -85739 -83679 -87338 -90405 -93469 -99755 -106039 -109165 -112288 -110048 -102081 -97814 -93543 -91780 -90014 -92716 -95418
-4109 -95418 -93349 -91281 -90465 -89649 -88475 -87301 -93700 -94374 -91590 -88807 -89839 -90871 -91903 -92936 -93498 -94061 -93670 -87554
-4091 -87554 -85732 -93450 -92582 -91713 -93707 -95701 -97695 -99688 -96793 -93897 -91002 -88106 -85710 -83313 -85687 -88061 -90733
-4074 -90733 -93405 -93215 -93025 -93103 -93182 -96122 -99062 -98365 -97668 -96972 -96275 -99409 -102543 -102815 -103087 -102226 -101365 -97642 -93919 -92850
-4054 -92850 -91780 -93215 -94650 -93938 -87502 -89056 -90610 -94065 -97519 -98112 -98704 -98999 -99293 -103165 -101313 -96972 -98354 -104149
-4036 -104149 -104220 -103754 -103288 -105327 -107365 -106721 -106076 -107935 -109795 -113563 -111606 -109650 -107693 -110537 -107656 -103225 -98794 -96987
-4018 -96987 -95179 -96234 -97288 -93830 -90368 -93588 -96804 -97877 -98947 -97158 -95365 -99435 -103501 -104708 -105912 -103422 -100929
-4001 -100929 -97724 -100240 -103363 -100758 -96964 -93167 -97303 -101436 -101757 -107798 -115571 -113801 -111081 -108357 -106352 -104343 -102338
-3984 -102338 -100329 -98868 -97408 -98809 -100210 -100240 -100270 -105070 -109870 -109601 -109333 -113835 -118336 -115922 -113507 -111092 -108677 -107432
-3966 -107432 -106188 -104943 -103698 -106031 -108364 -110697 -113030 -112620 -112210 -111800 -111390 -106925 -102461 -97996 -93532 -95924 -98313 -100706
-3948 -100706 -103094 -99882 -96666 -98224 -99778 -105658 -111535 -112646 -113753 -111047 -108338 -110402 -112463 -108677 -104887 -107779 -110667
-3931 -110667 -111055 -111438 -105148 -98854 -101820 -104783 -104887 -104988 -104645 -104298 -102524 -100747 -99863 -98980 -100959 -102938 -107153 -111368 -108904
-3912 -108904 -106441 -104738 -103035 -104194 -105353 -103948 -102543 -101138 -99733 -98887 -98041 -100057 -102073 -100184 -98295 -97836 -97378 -99573
-3894 -99573 -101768 -99193 -96618 -93178 -89738 -94885 -100031 -101645 -103258 -104872 -106486 -103627 -100769 -97911 -95052 -91956 -88859
-3877 -88859 -85762 -82665 -86008 -89351 -92693 -96036 -96994 -97952 -98909 -99867 -102972 -106076 -104410 -102744 -95712 -88680 -84510 -80340
-3859 -80340 -82371 -84402 -87864 -91326 -93592 -95854 -99193 -102528 -105927 -103598 -100914 -103952 -105800 -101921 -98760 -95596 -96580
-3842 -96580 -97560 -97113 -96662 -93517 -90368 -90681 -96714 -99174 -101630 -104447 -107261 -105189 -103113 -99610 -96103 -93047 -89988 -88482
-3824 -88482 -92697 -94300 -95902 -95000 -94098 -94270 -94441 -91751 -89060 -93420 -97780 -97370 -96960 -95775 -94590 -93405 -92220 -90707
-3806 -90707 -89194 -92451 -95708 -96461 -97214 -94747 -98004 -102170 -106337 -111219 -110376 -106016 -101656 -101708 -101760 -101395 -101026 -97799 -94568
-3787 -94568 -96349 -98127 -102770 -107410 -110354 -113294 -111468 -109638 -107663 -105685 -103352 -101015 -100367 -93990 -89049 -89828 -93741
-3770 -93741 -97650 -97150 -96647 -99308 -101965 -102122 -102275 -95336 -94117 -92544 -90968 -89921 -88874 -87469 -86064 -90264 -88739 -87215
-3752 -87215 -91415 -94214 -97013 -98977 -95216 -92887 -96282 -102181 -102357 -99420 -96480 -93543 -90603 -83910 -82937 -84115 -91013
-3735 -91013 -95857 -100698 -101131 -101559 -104347 -107130 -108487 -109840 -109903 -109966 -110030 -110093 -109709 -109325 -106437 -103549 -98380 -98936 -99133 -99331 -98276
-3714 -98276 -97221 -96167 -95112 -97635 -100154 -105181 -110205 -112788 -109642 -109720 -109795 -107235 -104671 -102111 -99547 -98000 -96450 -95261
-3696 -95261 -94069 -96662 -104980 -110436 -110168 -106262 -102357 -98451 -94546 -93949 -99077 -100985 -102893 -106292 -109691 -106411 -103132
-3679 -103132 -106359 -109586 -112814 -116041 -115750 -115460 -112307 -109154 -109981 -110809 -108774 -106739 -110071 -113402 -115541 -111956 -105528 -104820
-3661 -104820 -107216 -109609 -104552 -99491 -101112 -102729 -105111 -107488 -109870 -112247 -112422 -112594 -112769 -112940 -112351 -111759 -110812 -109862 -109989
-3642 -109989 -104388 -102010 -99629 -100262 -100892 -101526 -102155 -98138 -94117 -94870 -95619 -94393 -93167 -95160 -97154 -95272 -99114 -103553
-3624 -103553 -102267 -96778 -100829 -103926 -107022 -106184 -105345 -104507 -103668 -107343 -111017 -111830 -112642 -111666 -110689 -106851 -103013 -100903 -98794
-3605 -98794 -96685 -94575 -93360 -92146 -95701 -99256 -98533 -97806 -96010 -99934 -107440 -103493 -101578 -99659 -102454 -105245 -103270
-3588 -103270 -101291 -107425 -113555 -114919 -116279 -110004 -103724 -104127 -104526 -103318 -102107 -100899 -99688 -100896 -102099 -108077 -114051
-3571 -114051 -118120 -122186 -117669 -113149 -112750 -112351 -111953 -111554 -109665 -107775 -101116 -94456 -91881 -89306 -86254 -94650 -106803
-3554 -106803 -107507 -108688 -109870 -109120 -108371 -107622 -106873 -101891 -96908 -102420 -107932 -112221 -116510 -112214 -107917 -104097 -100277 -99319
-3536 -99319 -98362 -99208 -100054 -103762 -107470 -104559 -101649 -101600 -101552 -99506 -97460 -95414 -93368 -94601 -95835 -97068 -98302 -100639 -102975
-3517 -102975 -105312 -107648 -105155 -102662 -100169 -97676 -96882 -96088 -98157 -100225 -102651 -105077 -107503 -109929 -110555 -111178 -108942 -106702
-3499 -106702 -104406 -102107 -99811 -97512 -97795 -98075 -98358 -98637 -96059 -93476 -95667 -97855 -99450 -101041 -99774 -98503 -98011 -97516
-3481 -97516 -97024 -96528 -90923 -85315 -88296 -91274 -94434 -97590 -97888 -98183 -99707 -101227 -99890 -98548 -102517 -106482 -110451 -114416
-3463 -114416 -114062 -113704 -110488 -107268 -107332 -107391 -107455 -107514 -106661 -105804 -104950 -104093 -100676 -97255 -93837 -90416 -85628 -80835 -84633 -88426
-3443 -88426 -94490 -100549 -103750 -106948 -106467 -105986 -105506 -105025 -102398 -99770 -101555 -103340 -107779 -106493 -101272 -107499 -113667 -108386
-3425 -108386 -107399 -106411 -100914 -95418 -98507 -101596 -102360 -103124 -103888 -104652 -98380 -92108 -94423 -96737 -96785 -96834 -96882 -96931 -103113 -109292
-3405 -109292 -106888 -104481 -105714 -106944 -108178 -109407 -108345 -107280 -106217 -105152 -101943 -98731 -98384 -98034 -96987 -95936 -97750
-3388 -97750 -99562 -98753 -97941 -94270 -90595 -91933 -93267 -91743 -90215 -89943 -89667 -89395 -89120 -90733 -92347 -91098 -89850 -89675 -89500
-3369 -89500 -89325 -89149 -99200 -109251 -110715 -112180 -107861 -103542 -102085 -100627 -101112 -101596 -99219 -96841 -98399 -99957 -101514
-3352 -101514 -103072 -103765 -104458 -105152 -105845 -102304 -98764 -98086 -97408 -95611 -93815 -92019 -90223 -89380 -88538 -87696 -86854 -92421 -97989
-3333 -97989 -96878 -95768 -92272 -88777 -85281 -81786 -84286 -86787 -86425 -86064 -91247 -96431 -98753 -101075 -97434 -93793 -93014 -92235
-3315 -92235 -91933 -91631 -94192 -96752 -96047 -95343 -91777 -88210 -82795 -77381 -71966 -66551 -68500 -70449 -79076 -87703 -92932 -98160
-3297 -98160 -98619 -99077 -97687 -96297 -95861 -101149 -107511 -104332 -100199 -96066 -98895 -101723 -107056 -102849 -103292 -103735 -106445 -109154
-3279 -109154 -109363 -109568 -105006 -100441 -98026 -95608 -96055 -96498 -94724 -92947 -94035 -95119 -97698 -100273 -102852 -105427 -104503 -103575
-3261 -103575 -99789 -95999 -94240 -92477 -90718 -88956 -86779 -84599 -77653 -70702 -60834 -50962 -55405 -59843 -72711 -85576
-3245 -85576 -87949 -90320 -91441 -92559 -93681 -94799 -96755 -98708 -97803 -96893 -96107 -95317 -99301 -103281 -104186 -105088 -105994 -106896 -105774
-3226 -105774 -104649 -103527 -102401 -107451 -112497 -114684 -116868 -114226 -111580 -106076 -100568 -102017 -103467 -102055 -100642 -97859 -95075
-3209 -95075 -95153 -95231 -95086 -94941 -94795 -94650 -98023 -101395 -98090 -94784 -97054 -99323 -94914 -90506 -91464 -92421 -96241 -100061 -98932
-3190 -98932 -97803 -105260 -112717 -115105 -117494 -119883 -122272 -122141 -122011 -119018 -110302 -105461 -110160 -115217 -114550 -113600 -112650 -114204
-3172 -114204 -115758 -113257 -110756 -108256 -105755 -105468 -105181 -104894 -104608 -102949 -101291 -99632 -97974 -100803 -103631 -103598 -103564 -104127 -104689
-3153 -104689 -105252 -105815 -107514 -109210 -106139 -103065 -104466 -105863 -104403 -102938 -100836 -98731 -99491 -100247 -104943 -109635 -105744 -101850
-3135 -101850 -99495 -97136 -97642 -98145 -101813 -105476 -109143 -112806 -111494 -110179 -106005 -101827 -104272 -106713 -106296 -105875 -105058 -104242
-3117 -104242 -100564 -96886 -97739 -98593 -99446 -100300 -100184 -100068 -99953 -99837 -99304 -98772 -98239 -97706 -103098 -108491 -112929 -107827 -102606 -103109
-3097 -103109 -99796 -96483 -94527 -92570 -97292 -102014 -105126 -108237 -111349 -114461 -114301 -114140 -113980 -113820 -116700 -119581 -115784 -111986
-3079 -111986 -109948 -107909 -105871 -103832 -105908 -107984 -107198 -106411 -107160 -107909 -105796 -103683 -100736 -97788 -99610 -101432 -107578 -113723
-3061 -113723 -115098 -116473 -116954 -117435 -115053 -112672 -112038 -111401 -110768 -110130 -109079 -108025 -109836 -111643 -112501 -113354 -117073 -120789 -113835
-3042 -113835 -106877 -106601 -106322 -104697 -103068 -101444 -99815 -99502 -99185 -98872 -98555 -100627 -102696 -99998 -97296 -94657 -92015 -89377
-3024 -89377 -86735 -90193 -93647 -97106 -100560 -102349 -104134 -105923 -107708 -106694 -105677 -104663 -103646 -102215 -100780 -102211 -103639
-3007 -103639 -103765 -103888 -104015 -104138 -103728 -103314 -102904 -102491 -105211 -107928 -110648 -113365 -110123 -106877 -103635 -100389 -99476 -98563 -97650
-2988 -97650 -96733 -97013 -97292 -100434 -103571 -104760 -105949 -102368 -98783 -96454 -94124 -94657 -95187 -96599 -98011 -99424 -100832 -101231
-2970 -101231 -101630 -102029 -102424 -100944 -99465 -97985 -96502 -95201 -93901 -92600 -91296 -91937 -92578 -96081 -99584 -97303 -95023 -97512
-2952 -97512 -100001 -98600 -97199 -98660 -100121 -100985 -101850 -102357 -102863 -103825 -99062 -94300 -95261 -100456 -105651 -110011 -108647 -105658
-2934 -105658 -108394 -111129 -108140 -103780 -105144 -105793 -106441 -107697 -108949 -112706 -116462 -118791 -115392 -108774 -107880 -111506 -109404
-2917 -109404 -108017 -106631 -106739 -106843 -106948 -107052 -107742 -108427 -104343 -100259 -100232 -100203 -100173 -100143 -99267 -98388 -100370 -102353 -100940 -99524 -104548
-2896 -104548 -103847 -100579 -103031 -104771 -106508 -105863 -105215 -101350 -103206 -102606 -102003 -98541 -100799 -101928 -103053 -104540 -106024 -111111
-2878 -111111 -116194 -115914 -109907 -105990 -102070 -97795 -93517 -94490 -95459 -93211 -96685 -97001 -97314 -100851 -104384 -102979 -101574 -100169
-2860 -100169 -98764 -99208 -99651 -100095 -100538 -100430 -100322 -100214 -100106 -101608 -103109 -101749 -100389 -103292 -106195 -109098 -112001 -113115 -114230
-2841 -114230 -111886 -103817 -101965 -100113 -97903 -95693 -95451 -95209 -101287 -107365 -111002 -108912 -105275 -101634 -103363 -105088 -106817
-2824 -106817 -108543 -109020 -109493 -109970 -110443 -109251 -108055 -107220 -106381 -104056 -107451 -110850 -108520 -103333 -98142 -92954 -87763 -87495
-2806 -87495 -92947 -95183 -97415 -95954 -94490 -93029 -91564 -92988 -94408 -95474 -96536 -103326 -104388 -102353 -100314 -96968 -99342
-2789 -99342 -104820 -110294 -116727 -117431 -113130 -108826 -106762 -110417 -115627 -120833 -115489 -110142 -109568 -108990 -106925 -104857 -106012 -101440
-2771 -101440 -100747 -100050 -98641 -102953 -97974 -92995 -91833 -96394 -98690 -100985 -103639 -106292 -105502 -104712 -104280 -103847 -102640 -107157
-2753 -107157 -108811 -104742 -105293 -105845 -106039 -106232 -107857 -109482 -108245 -107007 -107872 -108737 -109601 -110466 -107693 -104921 -105010 -105099 -105256 -105409
-2733 -105409 -102703 -99994 -98242 -96487 -101414 -106337 -109534 -112728 -113421 -114110 -108781 -109173 -110760 -112344 -111506 -104939 -102193 -99442
-2715 -99442 -97054 -104201 -106344 -102759 -100847 -98932 -96662 -94389 -98082 -101772 -102603 -103430 -104294 -105155 -106020 -106881 -106195 -105506 -108398
-2696 -108398 -105562 -101745 -103650 -104842 -106031 -105077 -104119 -105670 -107216 -110134 -107324 -107738 -108148 -106892 -105632 -104376 -103117 -102383
-2678 -102383 -101645 -103773 -105897 -107995 -110089 -107417 -104742 -104466 -104190 -104988 -105785 -107358 -103206 -101917 -106352 -105047 -103743 -101365
-2660 -101365 -98988 -99562 -100136 -103571 -107007 -107678 -108349 -109020 -109691 -109139 -108588 -105174 -101760 -100523 -99286 -99480 -99673 -100314 -100955 -98734
-2640 -98734 -96513 -96852 -97191 -97888 -92861 -90100 -87338 -88989 -90640 -91277 -91915 -97322 -102729 -101220 -99711 -93789 -87867 -90756
-2622 -90756 -99368 -103568 -102044 -96823 -97326 -97113 -96901 -95511 -94121 -95593 -97065 -98895 -100724 -100050 -99375 -96577 -99502 -102070
-2604 -102070 -104637 -104253 -103870 -105275 -106680 -103896 -106836 -111923 -107470 -103135 -98801 -98641 -98481 -97963 -97445 -95138 -98555 -97709
-2586 -97709 -96864 -101503 -106143 -104268 -108118 -108748 -109378 -106460 -103542 -102055 -100568 -104291 -108010 -107321 -106627 -105312 -109717 -114125
-2568 -114125 -112806 -108554 -104298 -98973 -99368 -102211 -99327 -100024 -100717 -100862 -101004 -101507 -102006 -100393 -104499 -105390 -106277 -108957 -111632
-2549 -111632 -112881 -114125 -112422 -110715 -111517 -112314 -112784 -107529 -105494 -103460 -100709 -97959 -95209 -92459 -94270 -96081 -100396
-2532 -100396 -104712 -110279 -110123 -108416 -106709 -103400 -100091 -102148 -109929 -111509 -113089 -113835 -108856 -101194 -99256 -102327 -105398
-2515 -105398 -109601 -113805 -111688 -109571 -104190 -104533 -105472 -100687 -95813 -100478 -100851 -101224 -104444 -107663 -108021 -108379 -111271 -114163
-2497 -114163 -110734 -107306 -104019 -106456 -108535 -110615 -112456 -114297 -113276 -112255 -112679 -113104 -114245 -109661 -102931 -101924 -100203
-2480 -100203 -98481 -101280 -104078 -105923 -102044 -100132 -107760 -111453 -109422 -107660 -105897 -105207 -104518 -106750 -108983 -111573 -108439
-2463 -108439 -103940 -99442 -97687 -101656 -107265 -107149 -107391 -107634 -110320 -107283 -106035 -104786 -104701 -104615 -104529 -104444 -102927 -101406 -105971
-2444 -105971 -104809 -104365 -103918 -103117 -102312 -104104 -105893 -104824 -103750 -99819 -95883 -98630 -101373 -102427 -103478 -104533 -105584 -101332
-2426 -101332 -97076 -97594 -98108 -102621 -107130 -108543 -104227 -102957 -107406 -108282 -109154 -112404 -115653 -114133 -112612 -111152 -109691 -108230
-2408 -108230 -106769 -106873 -106978 -107082 -107186 -102580 -97974 -96230 -94486 -94478 -94471 -91244 -93741 -97668 -101596 -100516 -93711 -96133 -98555
-2389 -98555 -100620 -102685 -105226 -107768 -105897 -104026 -102871 -107436 -108785 -110130 -110824 -111513 -112206 -112896 -112322 -111744 -111170 -110593 -107335
-2370 -107335 -104075 -105230 -106381 -109933 -107757 -105226 -108416 -109583 -105021 -100463 -101626 -107354 -107354 -108073 -108789 -108793 -108793 -108796 -108796 -107570 -106340
-2349 -106340 -107976 -109609 -109217 -108822 -108431 -108036 -112161 -116283 -113730 -111174 -110887 -110596 -110309 -110019 -110812 -111602 -110846 -104362 -104917 -105468
-2329 -105468 -105666 -105860 -101824 -97784 -96849 -101634 -107615 -107868 -105025 -102178 -103918 -105658 -104179 -108424 -110462 -112501 -106311 -100121
-2311 -100121 -97136 -94151 -90808 -93189 -95869 -98548 -98723 -98898 -98723 -98548 -98731 -98913 -95518 -97847 -100177 -96782 -97039 -97296 -100057
-2292 -100057 -102819 -103076 -103333 -98820 -94307 -96987 -99662 -102342 -105017 -102688 -100355 -98026 -95693 -99297 -102897 -103639 -104376 -102196
-2274 -102196 -100013 -97832 -95649 -97173 -98693 -99860 -101022 -104932 -103113 -92712 -88031 -88989 -89943 -95432 -100918 -104559 -98656
-2257 -98656 -99673 -106411 -104857 -103303 -102107 -100911 -103590 -106270 -104179 -102088 -104887 -107686 -106072 -104458 -100758 -102781 -104805
-2240 -104805 -101104 -103847 -106590 -106113 -105636 -105278 -104921 -104563 -104205 -101283 -98362 -98302 -98242 -98362 -98481 -102178 -100150 -101205 -107984 -111185
-2220 -111185 -114386 -109598 -104809 -99662 -100240 -97523 -94806 -96860 -98913 -101980 -99323 -99886 -100449 -98332 -96215 -98868 -101522
-2203 -101522 -103162 -104801 -102029 -99256 -97214 -100896 -104220 -107544 -103475 -99405 -103326 -101522 -101127 -100728 -104388 -108043 -110093
-2186 -110093 -106415 -105960 -105502 -108088 -110671 -108487 -106299 -108588 -110872 -110298 -109720 -107391 -105058 -105591 -106121 -108442 -110760 -109624
-2168 -109624 -102759 -101414 -100065 -101224 -102379 -100616 -98850 -97087 -95321 -97907 -100493 -100218 -99942 -99129 -98317 -97505 -96692 -97147
-2150 -97147 -97601 -101276 -99226 -98369 -97512 -99517 -101522 -102249 -108699 -108472 -102521 -101637 -100754 -98798 -102565 -103903 -99517 -98708 -97900
-2131 -97900 -97747 -97594 -100303 -103013 -100627 -98242 -96811 -101104 -105755 -100866 -98839 -96811 -97944 -99077 -97348 -95619 -98600
-2114 -98600 -101581 -110287 -109452 -106244 -108759 -112229 -115698 -114994 -114289 -113585 -112881 -110432 -107984 -107086 -111912 -110417 -108923 -110291
-2096 -110291 -111658 -112150 -106914 -104544 -102170 -105703 -103508 -99767 -96021 -98481 -100937 -102681 -110145 -112307 -108740 -108755 -108766 -107179
-2078 -107179 -105588 -106862 -108133 -107798 -107458 -107123 -106784 -106329 -105871 -105416 -104958 -107127 -109292 -103471 -103370 -107347 -111319 -108975 -106627
-2059 -106627 -104939 -103247 -104421 -105591 -105752 -105908 -106068 -106225 -108651 -111073 -106821 -102565 -101198 -99826 -104183 -98995 -93752 -94229
-2041 -94229 -93756 -93278 -94490 -95697 -94046 -92392 -90621 -88848 -91847 -94844 -100642 -106437 -105558 -104675 -105524 -106370 -110082 -113790
-2023 -113790 -112463 -111133 -113622 -110384 -103094 -105342 -108547 -111748 -111427 -111103 -110783 -110458 -109840 -109217 -108599 -107976 -107641 -107302 -106966
-2004 -106966 -106627 -106709 -106788 -106870 -106948 -107872 -108796 -104950 -101104 -99644 -98183 -96722 -95261 -99047 -102834 -101850 -100866 -102148 -103430 -104712
-1984 -104712 -105994 -111058 -116123 -114509 -112896 -111640 -110384 -109128 -107872 -104902 -101932 -101824 -101716 -103754 -105793 -104969 -104145 -106594
-1966 -106594 -109042 -111491 -113939 -108934 -103929 -103694 -103460 -101779 -100098 -105096 -110093 -107876 -105658 -106303 -106948 -106188 -105427 -110391
-1948 -110391 -105815 -104876 -109661 -107768 -105875 -112031 -118187 -119574 -120960 -116324 -111688 -109914 -108140 -106307 -104470 -102636 -100799
-1931 -100799 -99144 -97486 -96189 -94888 -94859 -100549 -103024 -105494 -104451 -103404 -102003 -106322 -106091 -105856 -105983 -106106 -104265 -102420
-1913 -102420 -100579 -98734 -98414 -98090 -97769 -97445 -97124 -96800 -96122 -101164 -107607 -114051 -117394 -115012 -112214 -109415 -109120 -108826 -107220
-1894 -107220 -105614 -104008 -102401 -102822 -103244 -100445 -103370 -107376 -111383 -112884 -114386 -108554 -102722 -103568 -104414 -104902 -105390 -106236
-1876 -106236 -101358 -101309 -101261 -103717 -106173 -105983 -105789 -105599 -105405 -106944 -108479 -106799 -110838 -109814 -108785 -108118 -107447 -107675 -107898 -104906
-1856 -104906 -107634 -111125 -114614 -115601 -116585 -118228 -119868 -114833 -109795 -106639 -103478 -104734 -105986 -107004 -102293 -97587 -98600
-1839 -98600 -100613 -102621 -104991 -107358 -108357 -109352 -110350 -111345 -111688 -112027 -109508 -106985 -109475 -111960 -114092 -116220 -117505 -113063
-1821 -113063 -109340 -105614 -103799 -107704 -108394 -109079 -108815 -108547 -105420 -102290 -106258 -110224 -111330 -112433 -110727 -109020 -111725 -114431
-1803 -114431 -114334 -108513 -105912 -103311 -99815 -96319 -99144 -101969 -105807 -103922 -95358 -92518 -97210 -101902 -103493 -99360 -97613
-1786 -97613 -95865 -98529 -101194 -98716 -96237 -96621 -97005 -96435 -95865 -95295 -94724 -96905 -99081 -101261 -103437 -106691 -109940 -115698
-1768 -115698 -111912 -107280 -102644 -104093 -105539 -106452 -107362 -108275 -109184 -110089 -110991 -109035 -107075 -106907 -106735 -110145 -107827 -105334 -108561
-1749 -108561 -105711 -102856 -96487 -95839 -98652 -101462 -102588 -103709 -109605 -115497 -114774 -114047 -113324 -112597 -110265 -107928 -108457 -108983
-1731 -108983 -109691 -110395 -114681 -113238 -109169 -110820 -109255 -107686 -104451 -106937 -110976 -115012 -113119 -111222 -109687 -102424 -99577
-1714 -99577 -96726 -100199 -103668 -102122 -100575 -105349 -110123 -111856 -107865 -104589 -101313 -98097 -100605 -99893 -99182 -103180 -107179
-1697 -107179 -111178 -115176 -115009 -114841 -115031 -115221 -106467 -103437 -106132 -108826 -106870 -110637 -108323 -106009 -108703 -111397 -108010 -110347
-1679 -110347 -110753 -111155 -109057 -106955 -107600 -108241 -106024 -103803 -101078 -98350 -102304 -106255 -107227 -108196 -106307 -104414 -100199 -95980
-1661 -95980 -100352 -104719 -108614 -112504 -111629 -110749 -109516 -108278 -109907 -111532 -107973 -104410 -103713 -103013 -104108 -105200 -106296 -107388
-1643 -107388 -101507 -95623 -96420 -97214 -96878 -96539 -99066 -101589 -102565 -103538 -101652 -99763 -96357 -92947 -92999 -93047 -88389 -93267 -96003
-1624 -96003 -93010 -94911 -96808 -101213 -105614 -106560 -107503 -108450 -109393 -105856 -102319 -103553 -104786 -101011 -97236 -93461 -89686 -91993
-1606 -91993 -94300 -93744 -93189 -96748 -100307 -101004 -101701 -103836 -105971 -103337 -100702 -102957 -105211 -104604 -103996 -107451 -110906 -107682
-1588 -107682 -104458 -103143 -101827 -100512 -99196 -99301 -99405 -99509 -99614 -100076 -100538 -101000 -101462 -100396 -99331 -98265 -97199 -98995 -100791
-1569 -100791 -99726 -98660 -105569 -112478 -112709 -112940 -110309 -107678 -105047 -102416 -103691 -104965 -106240 -107514 -108848 -110183 -106747
-1552 -106747 -103311 -100885 -98455 -96029 -93599 -94274 -94944 -98481 -102014 -101675 -101332 -100993 -100650 -100847 -101041 -103743 -106441 -109381 -106594
-1533 -106594 -104168 -101738 -102890 -104037 -105189 -106337 -107607 -108875 -110145 -111412 -112922 -114427 -113074 -111718 -110540 -109359 -105319
-1516 -105319 -101276 -101470 -101660 -106624 -111584 -111152 -110715 -110283 -109847 -109475 -109098 -111588 -114073 -109646 -105215 -103650 -102081 -103914 -105744
-1497 -105744 -107935 -104399 -105547 -106691 -107481 -108267 -110071 -111871 -113674 -115474 -112154 -108830 -105509 -102185 -100117 -98045 -92757
-1480 -92757 -93189 -96584 -99975 -98958 -97937 -97635 -97329 -99890 -102446 -103598 -104745 -102319 -105614 -106586 -101831 -103519 -105204 -106557
-1462 -106557 -107906 -106396 -104883 -103195 -101503 -99100 -102416 -104324 -100508 -100270 -100031 -107127 -114222 -114043 -108140 -102863 -97587
-1445 -97587 -103996 -110406 -114789 -113447 -106739 -100031 -98734 -97437 -99003 -100568 -98973 -97378 -100553 -103728 -102878 -102029 -97601
-1428 -97601 -98898 -103594 -102565 -102252 -101939 -102733 -103523 -101455 -99383 -97553 -95719 -93890 -92056 -94221 -96383 -98548 -100709 -100967
-1410 -100967 -101220 -106247 -111271 -114263 -117252 -113566 -109877 -110186 -110492 -107939 -105383 -104649 -103911 -106396 -103154 -105580 -108002 -107209
-1392 -107209 -106411 -106732 -107052 -104511 -101969 -104913 -107857 -107939 -108021 -107358 -106694 -103169 -99644 -102498 -105353 -107015 -102953 -101104 -104980
-1373 -104980 -108498 -106292 -105815 -105338 -107723 -104384 -103340 -102297 -100896 -99495 -101969 -104444 -109422 -114401 -115225 -110324 -109001
-1356 -109001 -107678 -104507 -107060 -110805 -114550 -113868 -107462 -103560 -105383 -110067 -109027 -106795 -104563 -103709 -102856 -104865 -106873
-1339 -106873 -108763 -110652 -109322 -107991 -107272 -100829 -100467 -100106 -99923 -99741 -96696 -93651 -93092 -92529 -92328 -92123 -90074 -93744 -98969
-1320 -98969 -104190 -103929 -103665 -106266 -108863 -106039 -103210 -106467 -103996 -102837 -101678 -100519 -99360 -99513 -105390 -108405 -105696 -104850
-1302 -104850 -104004 -102800 -101596 -99379 -97162 -99357 -101552 -106989 -106698 -104861 -103020 -103806 -104589 -105375 -106158 -108390 -110619 -112493
-1284 -112493 -114364 -120293 -120494 -120818 -115415 -104976 -100262 -97337 -100136 -104544 -108953 -107041 -105129 -104872 -104615 -104358 -104101 -106109
-1266 -106109 -108118 -105357 -102595 -102170 -101742 -101317 -100888 -103862 -106832 -105036 -103236 -106791 -110343 -114614 -113156 -105860 -104283 -105811
-1248 -105811 -107335 -110663 -113987 -115765 -111815 -112996 -114174 -110585 -106993 -101436 -101600 -101410 -101216 -102398 -103575 -104757 -105934
-1231 -105934 -106340 -106743 -104287 -101827 -103128 -104425 -105726 -107022 -105998 -104969 -103944 -102916 -100221 -97523 -99599 -101671 -105345
-1214 -105345 -109016 -109829 -110637 -108468 -106296 -106989 -107678 -103899 -100117 -101108 -102096 -100344 -98589 -99700 -100806 -100501 -100191 -105968 -106016
-1195 -106016 -100702 -95384 -96032 -96677 -99726 -97046 -100452 -103855 -102312 -100765 -99222 -97676 -100381 -103083 -100661 -98235 -98317 -92671
-1177 -92671 -93349 -99748 -103840 -102204 -104149 -106091 -107559 -109024 -110134 -111241 -111233 -105502 -105852 -106203 -105718 -105234 -104749 -104265 -101499
-1158 -101499 -98734 -102647 -106560 -107253 -107947 -108640 -109333 -103944 -98555 -101753 -104950 -105465 -105979 -106493 -107007 -106940 -106873 -102990 -104831 -108103
-1138 -108103 -101835 -101291 -100747 -102379 -104011 -105644 -107276 -105450 -103624 -104660 -105696 -103840 -101984 -104540 -107097 -108878 -104935
-1121 -104935 -101350 -97765 -99077 -100389 -101701 -103013 -104563 -106113 -104801 -103490 -104116 -104742 -105368 -105994 -108766 -111539 -114312 -117084
-1103 -117084 -112009 -106929 -104716 -102498 -98555 -94609 -96032 -103176 -104839 -106497 -105655 -104809 -100508 -96204 -91188 -91892 -99748
-1086 -99748 -101876 -99595 -103035 -107909 -112780 -112646 -106784 -106799 -106810 -111237 -115661 -117524 -119384 -114569 -109750 -107779 -105804 -103475
-1068 -103475 -101142 -101496 -96122 -96476 -96826 -101339 -100124 -99271 -98414 -94937 -91456 -90841 -90223 -90912 -91598 -95149 -98697 -102606 -106512
-1049 -106512 -107559 -108602 -107324 -106042 -110846 -109922 -109120 -108316 -111927 -115534 -113030 -110525 -110525 -110525 -109929 -103609 -99554 -105040 -110838
-1030 -110838 -110913 -108125 -105338 -106665 -107991 -108960 -109929 -113440 -111226 -107462 -103698 -103273 -102849 -102781 -102714 -99219 -101447 -105226 -109005
-1011 -109005 -106762 -104518 -103825 -108856 -110771 -112687 -112098 -111509 -105971 -100434 -96446 -98183 -99711 -101239 -106344 -105726 -104093 -102461
-993 -102461 -102975 -103490 -108789 -108364 -103169 -103698 -100411 -97124 -97057 -96990 -96625 -96260 -98399 -100538 -106135 -106009 -108744 -111479 -111971 -106735
-973 -106735 -104723 -102707 -100396 -98082 -98634 -99182 -99137 -99088 -95824 -98280 -100978 -103672 -106728 -109780 -109288 -108793 -110805 -112814 -111904
-954 -111904 -105267 -102211 -99152 -96543 -99655 -99908 -100158 -99994 -105550 -111111 -110943 -106836 -102729 -97907 -98809 -100724 -102640 -102051
-936 -102051 -101462 -99502 -97542 -98086 -98630 -103885 -103415 -102945 -108200 -104302 -100404 -101634 -102863 -107373 -111882 -111621 -111360 -107402 -103445
-917 -103445 -102349 -101254 -102245 -103236 -101008 -104503 -108945 -113384 -111506 -109624 -105718 -101809 -102673 -103534 -102133 -100728 -99327 -97922
-899 -97922 -102304 -106683 -111066 -115445 -112836 -110224 -107615 -105003 -107820 -110633 -113451 -116264 -113209 -110149 -113771 -117390 -114334
-882 -114334 -111274 -108219 -105159 -108099 -111036 -109206 -107373 -106378 -105379 -104384 -103385 -103881 -104373 -102006 -99636 -98522 -97404 -96290
-864 -96290 -95172 -95160 -95146 -95134 -95119 -94929 -94736 -94546 -94352 -93208 -92060 -93778 -95492 -98224 -100952 -103683 -106411 -105435 -104458 -103482 -102506
-843 -102506 -99263 -96021 -99457 -102893 -104026 -105159 -103430 -101701 -102178 -102655 -103132 -103609 -102800 -101988 -98317 -94642 -95205 -95764 -96327
-824 -96327 -96886 -96323 -95757 -95194 -94628 -95436 -96241 -97050 -97855 -98902 -99949 -103858 -107768 -104641 -101514 -98388 -95261 -98991 -102722
-805 -102722 -99774 -96826 -93103 -89380 -94244 -99107 -104827 -110544 -109586 -108625 -107429 -106229 -107894 -109556 -108241 -106922 -108468
-788 -108468 -110011 -111737 -113458 -108506 -103549 -105133 -106713 -108297 -109877 -108301 -106721 -101924 -102849 -102345 -101839 -101693 -101544 -105513
-770 -105513 -109478 -109870 -115981 -113622 -105535 -100672 -101529 -103642 -105752 -103452 -101149 -98909 -96666 -94069 -97191 -97993 -98790 -99949
-752 -99949 -101104 -103806 -106504 -104436 -102364 -101309 -100251 -99196 -98138 -98664 -99185 -99711 -100232 -102129 -104022 -105919 -107812 -107026
-734 -107026 -106236 -100680 -95119 -95049 -94974 -92041 -89105 -91329 -93551 -95775 -97996 -98671 -99342 -100016 -100687 -99271 -97851 -101205 -104555
-715 -104555 -103914 -103270 -100124 -96975 -98660 -106065 -108703 -105614 -100441 -95265 -94505 -93741 -93875 -94005 -97359 -94985 -95418 -95846 -96278
-696 -96278 -96707 -94754 -98522 -102293 -100337 -98563 -96785 -99424 -102058 -101932 -101801 -104894 -102260 -101179 -100095 -98656 -97214 -101321
-678 -101321 -105424 -104760 -104093 -103490 -102882 -102278 -101671 -101835 -101995 -102159 -102319 -104630 -106937 -104477 -102014 -101104 -100191 -105364 -104809 -102468
-658 -102468 -100124 -100288 -100449 -103333 -106214 -104686 -103154 -101626 -105819 -112877 -114207 -113484 -112758 -107265 -101768 -103191 -110335 -115098
-640 -115098 -106501 -103266 -100027 -100728 -101425 -99562 -97695 -95831 -93964 -97974 -101980 -99550 -102841 -103094 -97620 -102405 -107186 -104119
-622 -104119 -101049 -102752 -104451 -103590 -102726 -107947 -107440 -107861 -108278 -108342 -108401 -105901 -103396 -98391 -93383 -87953 -88244 -91758 -89544
-603 -89544 -84890 -85956 -88218 -90476 -90562 -90644 -90729 -90811 -85352 -79889 -78841 -77791 -71589 -59664 -54059 -54178 -47143 -34383 -17568
-584 -17568 12602 55921 112595 184535 246934 268310 234353 171655 108958 54385 13168 -11352 -35873 -51987
-570 -51987 -62377 -69309 -76240 -80012 -83783 -87554 -91326 -89194 -87062 -89701 -92339 -94706 -97072 -96577 -96077 -92541 -89004
-553 -89004 -92146 -95283 -96070 -96856 -97642 -98425 -98436 -98447 -98459 -98466 -97329 -96193 -95056 -93916 -94449 -94982 -95514 -96044 -97531 -99018 -100504
-532 -100504 -101988 -100374 -98760 -97147 -95529 -97449 -99364 -101283 -103199 -103926 -104649 -105375 -106098 -104052 -102003 -99957 -97907 -97352
-514 -97352 -96793 -99100 -101403 -100348 -99290 -98235 -97177 -100355 -103531 -100031 -96528 -99908 -103285 -99986 -96685 -99230 -101772
-497 -101772 -101455 -101134 -101030 -100926 -103683 -106437 -104544 -102651 -105528 -108401 -104995 -101589 -101045 -100497 -101086 -101675 -102263 -102849 -105737
-478 -105737 -108621 -108643 -108666 -107499 -106329 -105159 -103989 -106937 -109881 -109963 -110045 -107209 -104369 -106299 -108230 -109497 -110760 -109165 -107566
-459 -107566 -106508 -105446 -104388 -103326 -97199 -91069 -89712 -88352 -91706 -95056 -98410 -101760 -101414 -101067 -100721 -100374 -100087 -99800
-441 -99800 -102375 -104950 -104291 -103631 -102972 -102312 -101831 -101350 -100870 -100389 -99077 -97765 -96454 -95138 -97642 -100147 -99789 -99427 -97832 -96237
-421 -96237 -103229 -110216 -106713 -103210 -104477 -105740 -102185 -98630 -99845 -101056 -103344 -105632 -105058 -104481 -105114 -105748 -109243 -112735
-403 -112735 -113250 -113764 -114278 -114789 -114498 -114207 -114274 -114338 -111185 -113756 -112750 -111740 -114833 -112202 -112791 -113376 -108837 -104298 -106437 -108573
-383 -108573 -107306 -106039 -107634 -109225 -109985 -110745 -114725 -112978 -111233 -109489 -107388 -105282 -101272 -97262 -99931 -102595 -102465 -102334
-365 -102334 -105066 -107794 -104622 -101451 -101142 -100829 -100818 -100806 -100795 -100780 -101962 -103143 -99912 -96677 -95794 -100635 -105476 -104589 -105673 -106758
-345 -106758 -103907 -106776 -107593 -102685 -101354 -100020 -98391 -96763 -97996 -99226 -99267 -99308 -99349 -99386 -102945 -106504 -106963 -101693 -93536
-326 -93536 -91102 -92008 -98634 -106039 -107719 -108207 -108692 -107130 -105569 -104008 -102442 -103683 -104924 -106165 -107402 -103665 -99927 -96189
-308 -96189 -92447 -95447 -98447 -101447 -104444 -102595 -100747 -103311 -105875 -112195 -112791 -109929 -107067 -106173 -105278 -106888 -108498 -110406
-290 -110406 -106590 -105994 -105398 -106053 -106709 -104503 -102297 -104026 -105755 -104265 -102774 -105308 -102118 -101790 -101462 -103817 -100449 -100300 -100150
-271 -100150 -100482 -100810 -101142 -101470 -102219 -102964 -103713 -104458 -102405 -100348 -104973 -109594 -112072 -114546 -114163 -113775 -113861 -113943 -114028 -114110 -114017 -113920
-249 -113920 -113827 -113730 -110238 -106743 -103609 -100471 -96860 -98969 -100724 -102476 -102580 -102685 -99927 -97169 -97452 -97736 -98019 -98302 -103564
-230 -103564 -108826 -107410 -105994 -105532 -105070 -104608 -104145 -104943 -105740 -106896 -102327 -103601 -104876 -105793 -106709 -103482 -100255 -101798 -103340
-211 -103340 -101246 -99152 -103735 -108319 -106534 -104745 -105822 -106896 -103203 -99506 -104399 -109288 -104462 -99632 -99815 -105718 -109001
-194 -109001 -106557 -107693 -108826 -106832 -104835 -102841 -100844 -101831 -102815 -100225 -103355 -104880 -100676 -96476 -97996 -100773 -97821
-177 -97821 -95589 -93353 -94355 -95358 -96360 -97363 -99856 -102349 -105558 -103042 -97128 -96938 -103068 -103475 -102450 -101425 -102904 -104384
-159 -104384 -104805 -105226 -102427 -99629 -103508 -101663 -103039 -104414 -104179 -103944 -103709 -103475 -104253 -105032 -101399 -97765 -95172 -98302 -101432
-140 -101432 -98839 -100300 -101760 -102863 -103967 -106888 -109810 -106053 -102297 -101641 -100985 -97110 -98958 -101254 -103549 -104652 -100031
-123 -100031 -96364 -92697 -95351 -98004 -99107 -100210 -101671 -103132 -98570 -99733 -103758 -102058 -96580 -91098 -91941 -92779 -93621 -94460
-105 -94460 -95302 -96141 -97609 -99073 -100542 -102006 -99718 -97426 -98000 -98570 -99986 -101399 -102457 -103512 -106180 -103121 -100422 -97721
-87 -97721 -99763 -101801 -99073 -96342 -94747 -93148 -91553 -89954 -91594 -93230 -92008 -90782 -93435 -96085 -101242 -106396 -108632
-70 -108632 -105140 -102368 -99591 -98309 -102748 -103970 -105189 -104950 -104708 -99700 -94687 -95760 -96830 -98619 -94680 -93308 -97657 -98075
-52 -98075 -98488 -103020 -101824 -99081 -96334 -102193 -108051 -102103 -96155 -92354 -98093 -102878 -107663 -113715 -114043 -109005 -103967 -102386
-34 -102386 -100806 -102088 -103370 -99867 -96364 -94411 -98183 -102491 -106799 -106694 -106590 -105994 -105398 -108379 -105636 -102655 -105398 -107425
-16 -107425 -109452 -108845 -108234 -107626 -107015 -105871 -104723 -106441 -113879 -120815 -118206 -114647 -111084 -111103 -111118 -111137 -111152 -110965 -110779 -110593 -110406
4 -110406 -107537 -104667 -106568 -108468 -108878 -109288 -109698 -110108 -108968 -107827 -106687 -105547 -103862 -102174 -105260 -108342 -104391 -100437 -101257
23 -101257 -102073 -102222 -102368 -102517 -102662 -101917 -101168 -103285 -105398 -106106 -106814 -102752 -98690 -100471 -102252 -99263 -96275 -95954 -95634 -100083
43 -100083 -104533 -103676 -102819 -101962 -101104 -105133 -109161 -110328 -111494 -108606 -105718 -102830 -99942 -98619 -97296 -100743 -104190 -103523 -102856
62 -102856 -105051 -107246 -105744 -104242 -105603 -106963 -105222 -103482 -101742 -100001 -101317 -102632 -103948 -105263 -102703 -100143 -102353
79 -102353 -104563 -105506 -106448 -107391 -108334 -102360 -96387 -95183 -93979 -95727 -97475 -99222 -100970 -99319 -97668 -96972 -101999 -103195 -94851
98 -94851 -91635 -97959 -100825 -103691 -104291 -104891 -104492 -104093 -106557 -109020 -111125 -113231 -112474 -111718 -112161 -112601 -110183 -107760 -104209 -100654
118 -100654 -103780 -106903 -107078 -107250 -107425 -107596 -108189 -108778 -109370 -109959 -111274 -112586 -113902 -115214 -113607 -111997 -110391 -108781 -107369
137 -107369 -105953 -107402 -108848 -107198 -105543 -103892 -102237 -105282 -108327 -106601 -104876 -105058 -105241 -105424 -105606 -99170 -92734 -92977
155 -92977 -93219 -94236 -95254 -96271 -97288 -97020 -96752 -96483 -96215 -98570 -100926 -100419 -99912 -100061 -100210 -105129 -110048 -106441 -102834 -102088
175 -102088 -101343 -102435 -103527 -104619 -105711 -102032 -98354 -101354 -104354 -105446 -106538 -107630 -108722 -107607 -106493 -105379 -104265
192 -104265 -105338 -106411 -107484 -108558 -108916 -109273 -109631 -109989 -109288 -108588 -107887 -107186 -107917 -108647 -106516 -104384 -104630 -104872 -102256 -99636
212 -99636 -102506 -105371 -105379 -105383 -103109 -100832 -103329 -105822 -106650 -107473 -108301 -109124 -109072 -109016 -108964 -108908 -106530 -104149 -104634 -105114 -105122 -105126 -105133 -105137 -103653
237 -103653 -102167 -100683 -99196 -101309 -103419 -105532 -107641 -109516 -111386 -110399 -109407 -109106 -108800 -105636 -102468 -102047 -101622 -98339 -95052
256 -95052 -95593 -96129 -103348 -110563 -109255 -107943 -106635 -105323 -100706 -96085 -98145 -100203 -104231 -108256 -109422 -110585 -111040 -111491
274 -111491 -111230 -101425 -96394 -100899 -102308 -103713 -102200 -100683 -102032 -103378 -103713 -104045 -104380 -104712 -107745 -110775 -109038 -107298
292 -107298 -105919 -104537 -103158 -101775 -102364 -102949 -100676 -98399 -96603 -94803 -93006 -91206 -98254 -105301 -105670 -106039 -102830 -99621
310 -99621 -103449 -107276 -103352 -105152 -109098 -103504 -101727 -99949 -100437 -100926 -102800 -104675 -106549 -108424 -106601 -104779 -102957 -101134
328 -101134 -103501 -105867 -103463 -101060 -101339 -101619 -101898 -102178 -103963 -105744 -107529 -109311 -108472 -107630 -106791 -105949 -107481 -109009 -110540
347 -110540 -112068 -111453 -110835 -110220 -109601 -107913 -106221 -104533 -102841 -97993 -93141 -96878 -100613 -102144 -103672 -105204 -106732 -107607
365 -107607 -108479 -106493 -104503 -102211 -99916 -102394 -104868 -103411 -101950 -103355 -104757 -107697 -110633 -110712 -110786 -110149 -109508 -111733 -113954
384 -113954 -112169 -110380 -105733 -101082 -98760 -96435 -94113 -91788 -88139 -84487 -89425 -94359 -96137 -97911 -99688 -101462 -103314
401 -103314 -105163 -107015 -108863 -108092 -107317 -106545 -105770 -106236 -106698 -107164 -107626 -106899 -106169 -105442 -104712 -104231 -103747 -103266 -102781 -102480 -102174 -101872
423 -101872 -101567 -99580 -97590 -98466 -99338 -100572 -101801 -103035 -104265 -102644 -101022 -104172 -107321 -108502 -109683 -110865 -112046 -110276
441 -110276 -108506 -106735 -104965 -105342 -105718 -106094 -106471 -104037 -101604 -99170 -96737 -96092 -95447 -97665 -99882 -102040 -104198 -103493 -102789
460 -102789 -100475 -98160 -100616 -103072 -101734 -100396 -99059 -97721 -94594 -91467 -95019 -98570 -98708 -98846 -98984 -99122 -98306 -97490 -96673
479 -96673 -95857 -97791 -99726 -98798 -97870 -97657 -97445 -103672 -98451 -100639 -102826 -101436 -100046 -102413 -104779 -104283 -103788 -105666 -107540
498 -107540 -106557 -105569 -104049 -102524 -101004 -99480 -103743 -108002 -107496 -106985 -105584 -104179 -103135 -102088 -100426 -104485 -104969 -105450 -105815
517 -105815 -100452 -95093 -95455 -99144 -102830 -106281 -109728 -115325 -111379 -109940 -108498 -106765 -105032 -105804 -106575 -108479 -104660 -104060
535 -104060 -103460 -105498 -107537 -104805 -102073 -101309 -100545 -102286 -104026 -108793 -107835 -105327 -102819 -101742 -100665 -102450 -104235 -107570
553 -107570 -110906 -114599 -112568 -111014 -109460 -105044 -100627 -98097 -101287 -105673 -110056 -111342 -106899 -99599 -98019 -99319 -100616
570 -100616 -104779 -108938 -110477 -106288 -102461 -98630 -101049 -103463 -103616 -103765 -96047 -97866 -101000 -104130 -105640 -107145 -105793 -104436
588 -104436 -106184 -107928 -106814 -105696 -105539 -105383 -108088 -110794 -112128 -113462 -111934 -110406 -111308 -112210 -113112 -114014 -113902 -113790 -110816
607 -110816 -107842 -109445 -111047 -107880 -104712 -104227 -103743 -103258 -102774 -101529 -100285 -101902 -103519 -102155 -100791 -103005 -99495 -95272
625 -95272 -96770 -97557 -98339 -104194 -110045 -112441 -109109 -109240 -109366 -106277 -103184 -101824 -100460 -101962 -103460 -103754 -104045 -104697 -105345
644 -105345 -102837 -106050 -112128 -112478 -109881 -107280 -107186 -107089 -106281 -105468 -102155 -98839 -93200 -93282 -94918 -96550 -99558 -102562 -105927
663 -105927 -103564 -101772 -99975 -97825 -95671 -97098 -98522 -99949 -101373 -103650 -105923 -103430 -100933 -101958 -102979 -106866 -110749
680 -110749 -112310 -113868 -112568 -111263 -109307 -107347 -105390 -103430 -102114 -100795 -102342 -103885 -104716 -105543 -106374 -107201 -105617 -104030
698 -104030 -104950 -105867 -108338 -105081 -102543 -100001 -98399 -102517 -106639 -105032 -101581 -98127 -95869 -99331 -106225 -113115 -118817 -118791
716 -118791 -112747 -106698 -103754 -106530 -105174 -103814 -99595 -101097 -101947 -102793 -106504 -110212 -113060 -110179 -105752 -101321 -103035 -104745
734 -104745 -102882 -106739 -111509 -110552 -108405 -106255 -104108 -101958 -99811 -97661 -98854 -100042 -98373 -96700 -95865 -95026 -94192 -93353
752 -93353 -93793 -94229 -97769 -107030 -112538 -112318 -112817 -113313 -115646 -117975 -113987 -109996 -102610 -100944 -102740 -104533 -105513 -106489 -103892
771 -103892 -107015 -110201 -107660 -106195 -104727 -99983 -100959 -101581 -102200 -101391 -100579 -100128 -99673 -97762 -101570 -102163 -102752 -99945 -97136
790 -97136 -97191 -97244 -97314 -97382 -94233 -96804 -97531 -98254 -99338 -100419 -99032 -97642 -96256 -94866 -96878 -98887 -101257 -103624 -100329 -102755
810 -102755 -106735 -110712 -106523 -102331 -102316 -102297 -109810 -107783 -102536 -97288 -98719 -100150 -101581 -103013 -102446 -101880 -101313 -100747 -105368
829 -105368 -109989 -114252 -118515 -116514 -108789 -107145 -105502 -104514 -103527 -102539 -101552 -101622 -101693 -101764 -101835 -100475 -99114 -100616 -102118 -100154
849 -100154 -98186 -99085 -99979 -97777 -95570 -93368 -91162 -93297 -95429 -97564 -99696 -98731 -97762 -96796 -95828 -97184 -98537 -99893 -101246
868 -101246 -100635 -100020 -99767 -99509 -96483 -99178 -101518 -103855 -104108 -104358 -101749 -99137 -103050 -106963 -106106 -105248 -104272 -103296 -102319 -101343
888 -101343 -102513 -103683 -104853 -106024 -101768 -97512 -99934 -102357 -104745 -107134 -109523 -111912 -111081 -110250 -109419 -108588 -106355 -104123
906 -104123 -108569 -113015 -115314 -117614 -113235 -108856 -106993 -105129 -103266 -101403 -101924 -102446 -102968 -103490 -104578 -105666 -109616 -113566
924 -113566 -109646 -105726 -106575 -107425 -107559 -107693 -107827 -107961 -105055 -102148 -102103 -102058 -100672 -99286 -104578 -109870 -108662 -107455 -106247 -105040
944 -105040 -102923 -100803 -101548 -102290 -103870 -105446 -107026 -108602 -109512 -110417 -108465 -106508 -104138 -101764 -102256 -102744 -107157 -111565 -109299
963 -109299 -107030 -104049 -101063 -106668 -112269 -115296 -118318 -112758 -107194 -108193 -109188 -110186 -111181 -110365 -109545 -108729 -107909 -105722 -103531
982 -103531 -101343 -99152 -102181 -105207 -105375 -105539 -111133 -116723 -113730 -110734 -109076 -107414 -108617 -109817 -110067 -110313 -105793 -101268
1000 -101268 -103903 -106534 -104399 -102260 -103225 -104186 -104794 -105398 -107414 -103702 -97490 -100814 -106288 -106035 -102923 -99808 -97441 -95071
1018 -95071 -95924 -96774 -97150 -103247 -108632 -104473 -98030 -91583 -95037 -98488 -96934 -95377 -98950 -102521 -100340 -103881 -110287 -110965
1036 -110965 -110812 -110656 -110503 -110347 -105681 -106735 -108152 -103840 -96849 -95578 -97411 -99241 -100434 -101622 -102815 -104004 -107641 -111274
1054 -111274 -113361 -109720 -109214 -108703 -103426 -98145 -96088 -99752 -100199 -100642 -101552 -102457 -103367 -104272 -101127 -97978 -94833 -91684 -93696
1073 -93696 -95705 -97717 -99726 -102454 -105178 -103135 -101090 -99495 -97896 -99163 -100426 -100799 -101168 -104403 -107634 -106393 -105148 -104265
1091 -104265 -103378 -99454 -101250 -105912 -104846 -105573 -106296 -103803 -101306 -101794 -102278 -102409 -102536 -106937 -105610 -104283 -108681 -109922 -111159
1110 -111159 -109892 -108625 -109001 -109374 -109747 -110119 -108588 -107052 -109094 -105412 -99808 -99923 -101231 -102539 -104328 -106113 -105036 -103959
1128 -103959 -104928 -105893 -106858 -107824 -108316 -108804 -108934 -109065 -113477 -112165 -109303 -106437 -108047 -109657 -111267 -112873 -111308 -109743 -108178
1147 -108178 -106609 -103553 -100497 -102211 -103922 -104436 -104950 -105465 -105975 -109530 -113086 -109963 -106836 -108722 -110607 -108081 -105550 -103680
1165 -103680 -107533 -105304 -103072 -103553 -104034 -104514 -104995 -105297 -105599 -105901 -106203 -105207 -104212 -103217 -102222 -103612 -105003 -101980 -98958 -97083
1185 -97083 -100933 -96793 -92652 -93342 -94031 -101160 -102565 -100005 -103169 -105975 -103057 -100616 -98175 -98239 -98302 -98816 -99331 -99845 -100359 -100873
1205 -100873 -101388 -102260 -103132 -102111 -106814 -109012 -105487 -104466 -109169 -110294 -111420 -112471 -113522 -111710 -109899 -110115 -110332 -107686
1223 -107686 -105040 -104555 -104071 -100367 -102386 -99755 -97124 -94493 -97587 -100340 -103094 -106564 -110034 -104738 -105167 -108457 -106024 -108405
1241 -108405 -110786 -109948 -109109 -111252 -113395 -110768 -108140 -107369 -106598 -108688 -110779 -107145 -103512 -102740 -101969 -99588 -97206 -98283
1259 -98283 -105085 -107712 -110339 -113324 -116309 -111148 -105986 -100825 -95664 -95213 -94762 -94311 -93860 -94572 -95283 -98857 -102431 -102129 -101827
1278 -101827 -98664 -95500 -97650 -99800 -97180 -94560 -95280 -95999 -99580 -103162 -104090 -105017 -103083 -101149 -100467 -99785 -96241 -92697
1296 -92697 -93025 -93353 -93681 -94009 -92190 -90372 -93323 -96275 -97527 -98779 -100031 -101283 -98421 -95559 -95559 -95559 -93200 -90841 -93252 -95664
1316 -95664 -94616 -93569 -97292 -101015 -104783 -108550 -105640 -102729 -102085 -101440 -103657 -105875 -107585 -109296 -108144 -106993 -104350 -101708
1334 -101708 -101928 -102148 -101578 -101008 -100437 -99867 -100668 -101470 -102271 -103072 -103642 -104212 -104783 -105353 -105685 -106016 -101578 -97139 -99483 -101827 -99401
1355 -99401 -96975 -98544 -100113 -98820 -97527 -98440 -99353 -100266 -101179 -102450 -103721 -104991 -106262 -107593 -108923 -107391 -105860 -105521
1373 -105521 -105181 -107704 -110227 -109065 -107902 -106739 -105576 -103162 -100747 -101194 -101641 -101537 -101432 -104190 -106948 -107440 -107932 -105562 -103191
1392 -103191 -100396 -97601 -100888 -98451 -100009 -101567 -105986 -104682 -102990 -101298 -104019 -106739 -111189 -115638 -112098 -114282 -110756
1409 -110756 -107231 -110503 -108051 -105837 -109348 -109281 -109214 -108431 -107648 -103646 -105368 -108282 -111196 -111606 -112016 -114401 -116786 -117621 -112732
1428 -112732 -105934 -99137 -96752 -94367 -98913 -103460 -101328 -99196 -103743 -108289 -109974 -105934 -98384 -100374 -106538 -106978 -102230
1445 -102230 -97482 -100963 -104444 -105644 -106843 -107686 -108528 -110205 -106158 -102468 -98779 -99193 -99606 -103240 -101149 -100191 -99234 -104596
1463 -104596 -109959 -112042 -114125 -111438 -108752 -110954 -113156 -114643 -106590 -103672 -110294 -113816 -107798 -104343 -106612 -108286 -104235
1480 -104235 -102897 -101559 -99148 -102461 -104045 -99904 -101846 -103788 -108625 -107738 -103989 -105964 -107045 -108125 -106702 -105278 -106344
1497 -106344 -107410 -108476 -109542 -108282 -107022 -105763 -104503 -104406 -104309 -104212 -104116 -105450 -106784 -105614 -104444 -103139 -107559 -105897 -104235
1516 -104235 -105554 -106873 -105330 -103788 -101186 -98585 -100754 -102923 -101514 -100106 -98697 -97288 -100560 -103832 -107104 -110376 -109415
1533 -109415 -108453 -102722 -96990 -100218 -103445 -106672 -109899 -113663 -117427 -116421 -115415 -112635 -109855 -104212 -98570 -101991 -105412
1550 -105412 -105971 -106530 -104824 -103117 -104272 -105427 -104973 -104518 -104063 -103609 -101186 -98764 -99204 -99644 -99547 -99450 -96491 -93532 -93346 -93159
1570 -93159 -95835 -98511 -102260 -106009 -104988 -103967 -104183 -104399 -107477 -110555 -109758 -108960 -105301 -101641 -103046 -104451 -105856 -107261
1588 -107261 -107593 -107924 -111118 -114312 -114315 -114319 -114323 -114327 -112840 -111353 -109866 -108379 -108912 -109445 -109978 -110511 -111759 -113007 -111394 -109780 -111356
1609 -111356 -112933 -111647 -110361 -111997 -113633 -110499 -107365 -105703 -104041 -102379 -100717 -100367 -100016 -99666 -99316 -98280 -97244 -102886
1627 -102886 -108528 -106180 -103832 -101485 -99137 -101827 -104518 -104347 -104175 -103467 -102759 -106821 -110883 -109460 -108036 -103750 -99465 -98578
1645 -98578 -97691 -99308 -100926 -102681 -98712 -94743 -96498 -98134 -99770 -101764 -103758 -103262 -102767 -105133 -107499 -106765 -106031 -102793
1663 -102793 -99554 -97076 -100322 -100348 -100374 -99148 -97922 -99558 -101194 -99491 -97788 -98947 -100106 -99118 -98131 -96785 -101164 -102044 -102923
1682 -102923 -101298 -99673 -99659 -99644 -103206 -101045 -97050 -98779 -99435 -100091 -102655 -99495 -96334 -98898 -98604 -98309 -99565 -106545 -112750
1701 -112750 -113231 -108703 -104175 -103612 -103050 -101772 -106217 -107801 -103661 -103098 -102536 -102051 -101567 -101082 -100598 -103870 -107142 -105047 -97229
1720 -97229 -96834 -96439 -95686 -94933 -94896 -94859 -91602 -94069 -99133 -104198 -104850 -105502 -105617 -105733 -102986 -100240 -98805 -97370 -95578 -99509
1740 -99509 -101414 -103318 -102718 -102118 -104786 -107455 -105353 -103251 -101984 -100717 -99450 -98183 -98496 -98809 -99122 -99435 -100642 -101850 -100195
1759 -100195 -98541 -99890 -101239 -102588 -103937 -104988 -106039 -102677 -99316 -99711 -105830 -105867 -105904 -102603 -99301 -95641 -91982 -93968
1777 -93968 -90230 -89712 -89194 -91419 -93644 -91098 -88553 -94236 -99919 -101190 -102461 -98067 -99398 -105737 -102536 -101347 -100158 -98373
1795 -98373 -96588 -95876 -95164 -94452 -93741 -97799 -101857 -101145 -100434 -98470 -96506 -100981 -99733 -94784 -95559 -95619 -95678 -97288 -98898 -100508
1815 -100508 -102118 -101850 -101581 -101671 -101760 -97616 -99196 -102327 -105457 -104958 -104458 -104317 -104175 -99860 -101268 -99457 -97646 -94449 -91251
1834 -91251 -97952 -98928 -97758 -96588 -97922 -99256 -100531 -101805 -103080 -104354 -99964 -95574 -90588 -95142 -97057 -98973 -98265 -97557
1852 -97557 -99949 -96618 -99368 -102118 -99644 -97169 -99107 -101045 -103281 -99793 -101790 -103788 -106471 -99614 -94903 -95917 -94486
1869 -94486 -93055 -96752 -100449 -101924 -103400 -102372 -101343 -100493 -105368 -107022 -108677 -108662 -108647 -105770 -102893 -104906 -106918 -108930
1887 -108930 -110943 -106680 -102416 -101015 -99614 -99882 -100150 -97914 -95678 -93219 -96483 -99748 -97288 -99539 -101790 -100821 -99852 -95887
1905 -95887 -91922 -94635 -97344 -96539 -95734 -94929 -94121 -92526 -90931 -96014 -101093 -101049 -101004 -100959 -100911 -102312 -103713 -102252 -100788 -97538
1925 -97538 -94288 -95809 -97326 -99681 -102036 -104391 -106743 -102599 -98455 -99081 -99703 -99167 -98630 -104771 -110913 -109840 -108766 -107693
1943 -107693 -106620 -101075 -95529 -94754 -93979 -98511 -103042 -102804 -102565 -103393 -104220 -102185 -100150 -95850 -91549 -92019 -92488 -96625 -100762
1962 -100762 -102036 -103311 -101663 -100016 -98369 -96722 -98205 -99685 -104026 -108368 -107347 -106322 -108159 -109996 -108722 -107443 -106165
1979 -106165 -104887 -104686 -104481 -101414 -98347 -98764 -99178 -99591 -100005 -100244 -100478 -100713 -100948 -100068 -99185 -98302 -97419 -94929 -92436 -96621
1999 -96621 -100806 -100754 -100702 -100650 -100598 -104719 -108841 -110101 -111360 -109251 -107142 -105032 -102923 -102901 -102878 -105718 -108558 -109527 -110496 -108602 -106709
2020 -106709 -107440 -108170 -106039 -103907 -99823 -95738 -98332 -100926 -101909 -102893 -103877 -104861 -102483 -100106 -100232 -100359 -103706 -101328 -99308
2039 -99308 -97288 -95984 -94680 -93733 -92787 -91542 -96021 -97281 -98541 -98153 -97765 -97378 -96990 -93919 -90849 -92548 -94247 -96290 -98332
2058 -98332 -100374 -102416 -101358 -100300 -99241 -98183 -100475 -102767 -100288 -97810 -97478 -97147 -96815 -96483 -94303 -92123 -92805 -93487 -92917
2077 -92917 -92347 -94281 -96215 -99170 -96398 -90767 -90856 -90770 -90681 -94531 -92652 -89526 -92120 -95552 -98980 -104321 -103933 -106769 -109601
2096 -109601 -109944 -110287 -107768 -105248 -103147 -101045 -101805 -102565 -105949 -109333 -107947 -106560 -104458 -102357 -100255 -98153 -98552 -98947
2114 -98947 -99345 -99741 -99603 -99461 -103497 -107529 -109776 -102480 -94829 -96714 -99260 -96077 -96714 -97348 -100184 -103020 -105498 -107976 -110872
2133 -110872 -108043 -108435 -108826 -111245 -113663 -113578 -113492 -110961 -114155 -111267 -108379 -105558 -102737 -102778 -102819 -101429 -100039 -101153 -102267
2152 -102267 -104514 -101037 -97918 -94799 -98000 -101201 -101540 -101880 -104347 -106814 -104868 -102923 -100978 -104757 -105316 -105875 -107149 -108424
2170 -108424 -109698 -110973 -108670 -106366 -104063 -101760 -102744 -103728 -101492 -104980 -104235 -103490 -103102 -102714 -103400 -104086 -100359 -96632 -92310
2189 -92310 -93711 -96662 -99614 -100758 -101902 -102688 -103475 -105036 -100873 -96711 -98272 -100132 -101991 -104209 -106426 -105722 -105017 -104313
2207 -104313 -103609 -106735 -109862 -108219 -106575 -103083 -99591 -98962 -98332 -101458 -104585 -106519 -102729 -96375 -95746 -98216 -100687 -102416
2225 -102416 -104145 -105517 -106888 -106709 -100806 -100985 -101164 -102446 -103728 -101790 -105576 -103221 -100866 -98511 -96155 -101820 -101760 -104921
2243 -104921 -108081 -106530 -104980 -103430 -101880 -102536 -103191 -106709 -110227 -108737 -107246 -106113 -104980 -101209 -103162 -104757 -106352
2260 -106352 -102938 -99524 -99331 -99137 -98436 -103460 -108483 -107783 -107082 -106381 -105323 -104265 -103750 -103236 -99860 -96483 -95075 -93666 -94762
2279 -94762 -95857 -99517 -97452 -92526 -93323 -94001 -94680 -96073 -97467 -94996 -98250 -98283 -98317 -95488 -92660 -96509 -100359 -104179 -107999
2298 -107999 -108957 -109914 -104075 -98235 -95257 -92280 -91944 -91609 -94136 -96662 -99427 -102193 -100188 -98183 -97400 -96618 -99055 -101492
2316 -101492 -103452 -111137 -110831 -110525 -108752 -106978 -109974 -112970 -112269 -111569 -108006 -104444 -106665 -108886 -108245 -107604 -107380 -107157 -104429
2335 -104429 -101701 -101906 -107835 -113764 -113969 -111789 -109609 -107071 -104533 -107749 -110965 -109411 -107857 -107317 -106776 -103374 -99972 -95798
2353 -95798 -91624 -92220 -92816 -94963 -97110 -96394 -95678 -94546 -93413 -95500 -97587 -95500 -99137 -102774 -100687 -100016 -99345 -98317 -97288
2372 -97288 -98347 -99405 -100463 -101522 -103206 -104891 -98347 -91803 -90565 -95052 -99539 -98302 -97534 -96767 -95641 -94516 -95537 -96558
2390 -96558 -97579 -98600 -95358 -92116 -89231 -86347 -86980 -93338 -98980 -104622 -105487 -100627 -95768 -96632 -98630 -100627 -100121 -99614
2408 -99614 -101954 -104294 -103773 -103251 -100225 -97199 -97035 -96871 -98652 -100434 -99353 -98272 -98682 -99092 -99502 -99912 -103124 -106337 -104779
2427 -104779 -103221 -101544 -99867 -101052 -102237 -103490 -104742 -105994 -107246 -109094 -110943 -112791 -114640 -108811 -102983 -103832 -104682
2444 -104682 -104757 -104831 -102044 -99256 -101429 -103601 -108636 -113667 -108386 -103106 -100687 -98265 -100616 -102968 -105319 -107667 -106918 -106169
2462 -106169 -105420 -104667 -106788 -108908 -108166 -107421 -107395 -107369 -107343 -107313 -108465 -109616 -107906 -106191 -106091 -105990 -105889 -105785 -105480 -105174 -104868 -104563
2484 -104563 -103721 -102878 -102036 -101194 -100486 -99778 -101932 -104086 -105167 -106247 -107328 -108409 -108595 -108781 -106106 -103430 -102722 -102014 -104168
2503 -104168 -106322 -108297 -110272 -109385 -108498 -109161 -109825 -107626 -105427 -105957 -106482 -104145 -101809 -106333 -110853 -108696 -106538 -104950
2521 -104950 -103359 -101768 -100177 -102703 -105226 -107749 -110272 -109687 -109098 -108509 -107920 -107753 -107581 -104548 -101514 -102480 -103441 -104403 -105364
2540 -105364 -103825 -102282 -100739 -99196 -98712 -98227 -94881 -91534 -94449 -97363 -97415 -97467 -102096 -106724 -102767 -98809 -95149 -91490
2558 -91490 -92600 -93711 -94393 -95075 -95757 -96439 -97419 -98399 -99379 -100359 -101205 -102051 -102897 -103743 -103694 -103646 -106460 -109273 -107570 -105867 -104164
2579 -104164 -102461 -99267 -96073 -92880 -89686 -89876 -90066 -90256 -90446 -89205 -87964 -89585 -91206 -92693 -94180 -98529 -102878 -100311
2597 -100311 -97743 -98037 -98332 -100191 -102051 -99141 -96230 -98328 -100426 -102524 -104622 -102603 -100583 -98563 -96543 -97624 -98704
2614 -98704 -106463 -114222 -109102 -103981 -105539 -107097 -103169 -99241 -95313 -91385 -95910 -100434 -104958 -109482 -105957 -102431 -98906
2631 -98906 -95380 -94374 -93368 -97132 -100896 -98220 -95544 -99547 -103549 -104921 -106292 -107663 -109035 -107902 -106769 -106232 -105696 -99569
2649 -99569 -102983 -103892 -104801 -102729 -100657 -98585 -96513 -95052 -93592 -94993 -96394 -100240 -104086 -105070 -106053 -108289 -110525 -109899
2667 -109899 -109273 -107932 -106590 -105248 -103907 -101682 -99457 -97232 -95008 -96360 -97713 -99066 -100419 -101861 -103303 -104745 -106188
2684 -106188 -107511 -108834 -103478 -98123 -97255 -96387 -98380 -100374 -99923 -99472 -99021 -98570 -97464 -96357 -100020 -103683 -106094 -108506
2702 -108506 -106147 -103788 -101581 -99375 -103847 -108319 -107544 -106769 -105994 -105219 -105815 -106411 -107007 -107604 -105457 -103311 -98302 -93293 -98168
2721 -98168 -103042 -103147 -103251 -105263 -107276 -104518 -101760 -101119 -100478 -104608 -108737 -106963 -105189 -103415 -101641 -100065 -98488 -99774
2739 -99774 -101060 -98231 -95403 -95436 -95470 -94937 -94404 -98641 -102878 -99006 -95134 -97941 -100747 -102167 -103586 -102144 -100702 -101824 -102945
2758 -102945 -99297 -95649 -95876 -96103 -96331 -96558 -94221 -91885 -96226 -100568 -102919 -105271 -104760 -104250 -103918 -103586 -103255 -102923 -105707
2777 -105707 -108491 -108412 -108334 -108614 -108893 -109173 -109452 -105848 -102245 -105319 -108394 -104373 -100352 -103009 -105666 -101063 -96461 -98537 -100613
2796 -100613 -103702 -106791 -105111 -103430 -103217 -103005 -102793 -102580 -100877 -99174 -97829 -96483 -95779 -100799 -102599 -104399 -104112 -103825 -103896
2815 -103896 -103967 -99386 -100531 -100721 -100911 -107898 -105345 -103389 -101432 -101190 -100948 -100706 -100463 -100758 -101052 -104209 -107365 -102711 -98056
2834 -98056 -98172 -98287 -102815 -107343 -112229 -111390 -107153 -102916 -97963 -98734 -97777 -96819 -96219 -95619 -95682 -95746 -98671 -101596 -100408 -99219
2854 -99219 -101250 -97557 -97516 -97475 -97434 -97393 -92164 -92660 -96018 -93651 -95201 -96752 -97944 -99137 -100926 -102714 -104503 -106292 -107022 -107753
2874 -107753 -104071 -100389 -99927 -105189 -107231 -109273 -106605 -103937 -104488 -105040 -101775 -104235 -103475 -102714 -97989 -93264 -93308 -93353 -94769
2893 -94769 -96185 -100463 -104742 -101898 -99055 -99073 -99092 -102152 -105211 -107078 -103221 -102733 -107969 -109627 -111286 -111632 -111979 -112325 -112672
2912 -112672 -112206 -111740 -107816 -103892 -107660 -101887 -101481 -101075 -100013 -98950 -97888 -96826 -99103 -101380 -102107 -97110 -94952 -92794
2930 -92794 -95049 -97303 -97471 -97639 -97806 -97974 -97292 -96610 -98790 -100970 -102554 -104138 -100952 -97765 -97270 -96774 -96278 -95783 -95168 -94553
2950 -94553 -94296 -94039 -92038 -95760 -99126 -102491 -102159 -101827 -101138 -100449 -103001 -99830 -95466 -91102 -90912 -96446 -101265 -96543 -95906
2969 -95906 -95269 -94035 -92801 -93715 -94628 -95541 -96454 -97724 -98995 -102770 -106545 -109128 -105986 -101295 -96603 -98321 -100039 -98537
2987 -98537 -102759 -105133 -107507 -110238 -112970 -108807 -104645 -97262 -95604 -96390 -97177 -95459 -93741 -94020 -94300 -94579 -94859 -96152 -97445
3006 -97445 -98738 -100031 -100885 -101738 -105811 -104160 -103165 -102170 -107138 -112106 -114867 -111904 -108942 -111703 -112795 -113887 -110924 -107961
3024 -107961 -103918 -105599 -107280 -103236 -104798 -106359 -107563 -108766 -109791 -110816 -110291 -104041 -105066 -106091 -106400 -106709 -110842 -109251
3042 -109251 -106109 -102968 -103165 -103363 -106065 -108766 -109858 -105226 -103814 -102401 -102778 -103154 -97449 -97467 -96916 -96364 -96170 -95977 -95425 -94874
3062 -94874 -94322 -93770 -97303 -100836 -101507 -102178 -103266 -104354 -105442 -106530 -105889 -105248 -104608 -103967 -103206 -102446 -98824 -104742 -108960 -107455
3082 -107455 -104995 -102536 -101567 -100598 -96767 -92936 -94236 -95537 -97195 -98854 -96696 -100262 -103113 -105964 -107414 -103139 -102085
3099 -102085 -101030 -98664 -96297 -100609 -104921 -102576 -100232 -97888 -95544 -96241 -96938 -100497 -104056 -103158 -102260 -100646 -104757 -111133
3117 -111133 -111785 -112556 -107604 -104175 -100747 -102088 -103430 -100598 -103490 -100300 -97110 -98421 -99733 -98183 -96632 -98183 -99733
3134 -99733 -101641 -103549 -99509 -101194 -99659 -98123 -96946 -95768 -94590 -93413 -95813 -98213 -103475 -103013 -103981 -99226 -97333 -95440
3152 -95440 -96036 -96632 -97229 -97821 -96987 -96152 -92455 -98295 -104898 -105778 -107373 -103240 -97382 -97247 -103434 -103892 -102588 -101283 -99621
3171 -99621 -97955 -103270 -108584 -110797 -107283 -98526 -95492 -94247 -98723 -98492 -98261 -100892 -103519 -104686 -100128 -98790 -97449 -98496
3189 -98496 -99543 -103810 -102349 -103784 -105219 -103434 -101645 -102781 -103918 -107917 -111912 -107712 -103512 -100862 -103933 -103370 -102808 -99025
3207 -99025 -100963 -105819 -104950 -106944 -99394 -95783 -101712 -101678 -101641 -102483 -103322 -107026 -110727 -109124 -107518 -110686 -113850 -109542 -105230
3226 -105230 -100564 -101619 -103631 -105640 -108010 -110376 -109691 -109001 -108316 -107626 -107775 -107920 -105565 -103206 -97795 -98105 -101518 -104928 -110071
3245 -110071 -109486 -105446 -101403 -101917 -102427 -102942 -103452 -106232 -109009 -107376 -105740 -102096 -104172 -103031 -101887 -102774 -103657 -107764 -106143
3264 -106143 -105070 -103993 -102204 -106135 -105778 -105416 -107920 -110421 -110689 -105230 -103352 -101470 -97862 -99975 -98872 -97765 -96878 -95991
3282 -95991 -89380 -92310 -99413 -100791 -103124 -105457 -107402 -109348 -109743 -104414 -102662 -100911 -98801 -96692 -97929 -99167 -100404
3299 -100404 -101641 -102044 -102446 -99986 -97527 -102073 -106620 -106396 -106173 -105353 -104533 -106575 -108617 -109489 -110358 -106460 -102558 -102058 -101555
3318 -101555 -103918 -106277 -106434 -106586 -106743 -106896 -105085 -103270 -104321 -105368 -104205 -103039 -104738 -106434 -106106 -105774 -108308 -101298
3336 -101298 -95246 -94914 -99357 -103795 -104660 -105521 -103165 -106530 -106471 -106411 -109929 -107723 -102595 -97467 -94844 -92220 -93532 -94844 -96155
3355 -96155 -97467 -94784 -92101 -96096 -100091 -98690 -97288 -96841 -102118 -109899 -108140 -101611 -95082 -97169 -99256 -101701 -98421
3372 -98421 -97288 -96155 -97527 -98898 -95354 -91806 -89813 -93539 -93871 -94199 -94888 -95574 -95496 -95414 -94620 -99547 -107518 -109761 -107239
3391 -107239 -110436 -115635 -115105 -113149 -105465 -102137 -104529 -102990 -101447 -103419 -99662 -96625 -93584 -92455 -97046 -101283 -105517
3408 -105517 -105606 -105692 -109001 -106583 -105420 -104253 -103091 -101924 -99517 -102830 -102927 -103020 -102938 -102852 -105990 -103400 -101708 -100013 -100825 -101634
3428 -101634 -101909 -102181 -99237 -102014 -104786 -107555 -110089 -112620 -114260 -106355 -100601 -100568 -97434 -94296 -96290 -98280 -99081 -99878
3446 -99878 -100680 -101477 -103113 -104745 -103519 -102290 -101660 -101026 -100396 -99763 -97933 -96100 -97132 -98160 -96390 -94616 -92846 -91072 -93297
3465 -93297 -95518 -97743 -99964 -102606 -105245 -105025 -104801 -104947 -105092 -105237 -105383 -104335 -103288 -102241 -101194 -100862 -100531 -103061 -105591
3484 -105591 -103411 -101231 -101913 -102595 -105036 -107477 -105148 -102819 -106631 -110443 -111394 -112344 -113130 -113917 -114703 -115489 -114904 -114319 -113734 -113149
3504 -113149 -112098 -111043 -109993 -108938 -108185 -107429 -106676 -105919 -103765 -101608 -104224 -106836 -106352 -105863 -108241 -110615 -108394 -106169
3522 -106169 -103948 -101723 -98786 -95846 -89332 -94262 -93040 -91814 -91307 -90797 -94225 -97650 -101078 -104503 -102454 -100400 -101213 -102021
3540 -102021 -104324 -106624 -106065 -105502 -103005 -100504 -102778 -105047 -104041 -103031 -104887 -106739 -109229 -111714 -114204 -116689 -112143
3557 -112143 -107593 -107816 -108036 -107604 -107168 -106735 -106299 -106702 -107101 -102733 -98362 -99845 -101324 -102808 -104287 -100642 -96994 -98119 -99241
3576 -99241 -97832 -96420 -95011 -93599 -95291 -96979 -98671 -100359 -96632 -92906 -92041 -91177 -90729 -90282 -96513 -102744 -102953 -103162 -100508
3595 -100508 -97855 -97765 -97676 -97587 -97497 -100054 -102610 -102304 -101999 -100799 -99599 -101261 -102923 -104496 -106068 -104779 -103490 -104704 -105919
3614 -105919 -107134 -108349 -108602 -108852 -109106 -109355 -104063 -98768 -102062 -105353 -103400 -101444 -99491 -97534 -99219 -100899 -102584 -104265
3632 -104265 -104432 -104600 -104768 -104935 -106892 -108848 -104127 -99405 -97724 -96044 -97225 -98406 -100363 -102319 -104276 -106232 -103963 -101693
3650 -101693 -102286 -102878 -104663 -106448 -105371 -104294 -104380 -104466 -104552 -104637 -105140 -105644 -103285 -100926 -97411 -93897 -93245 -92593 -96591 -100590
3670 -100590 -104589 -108588 -105729 -102871 -100013 -97154 -98231 -99308 -97523 -95738 -93901 -92064 -93088 -94113 -99014 -103914 -105953
3687 -105953 -107991 -105319 -102647 -99975 -97303 -96599 -95895 -95190 -94486 -94158 -93830 -93502 -93174 -94814 -96454 -98093 -99733 -102849 -105964
3706 -105964 -106217 -106471 -103683 -100896 -102878 -104861 -106858 -108852 -106437 -104019 -101306 -104313 -107324 -104608 -104190 -103769 -107406 -111040
3724 -111040 -114319 -111871 -108234 -104593 -100009 -101145 -99066 -96983 -94963 -92939 -90920 -88896 -90677 -92455 -93878 -95298 -98749
3741 -98749 -96472 -97419 -98362 -99237 -100113 -100989 -101865 -100117 -98369 -96979 -95589 -93931 -97996 -98842 -99688 -99521 -99353 -99185 -99018 -96867
3761 -96867 -94717 -93759 -98526 -100251 -96252 -95474 -100419 -104350 -108282 -108159 -108036 -104276 -106240 -104984 -103728 -101686 -99644 -94739
3779 -94739 -89835 -92503 -95172 -93070 -90968 -93964 -96960 -98406 -94128 -93845 -93562 -92921 -92280 -95615 -98947 -95604 -92257 -92254 -92246 -95105
$$ [...]
##END=	
