##TITLE=	y+qUsL35QRGYyAjlGK2Quw/8418s
##JCAMPDX=	6.0	$$ NMR Plug-in 1.13 of MestReNova 11.0.4-18998
##DATATYPE=	NMRSPECTRUM
##DATACLASS=	XYDATA
##NUMDIM=	1
##ORIGIN=	Bruker BioSpin GmbH
##OWNER=	andrew
##.OBSERVEFREQUENCY=	600.30184456100005264
##.OBSERVENUCLEUS=	^1H
##.SOLVENTNAME=	CD2Cl2
##.PULSESEQUENCE=	zg
##LONGDATE=	2015/06/05 12:05:18.000
##.ACQUISITIONMODE=	SIMULTANEOUS (DQD)
##$ORIGINALFORMAT=	Bruker XWIN-NMR
##$PARAMETERFILE=	(acqus, ASCII, /var/folders/f6/rjf_tdyn2v98c5c0wvkgn4s80000gn/T/y+qUsL35QRGYyAjlGK2Quw/8418s/acqus, 0)
$$ ##TITLE= Parameter file, TOPSPIN		Version 2.1
$$ ##JCAMPDX= 5.0
$$ ##DATATYPE= Parameter Values
$$ ##NPOINTS= 10	$$ modification sequence number
$$ ##ORIGIN= Bruker BioSpin GmbH
$$ ##OWNER= andrew
$$ $$ 2015-06-05 17:05:19.015 +0600  andrew@av-600
$$ $$ /opt/data/andrew/nmr/limog-1782/620/acqus
$$ $$ process /opt/ts21pl6/prog/mod/shimcntl
$$ ##$ACQT0= -9.54927425515661
$$ ##$AMP= (0..31)
$$ 100 100 100 100 100 100 100 100 100 100 100 100 100 100 100 100 100 100
$$ 100 100 100 100 100 100 100 100 100 100 100 100 100 100
$$ ##$ANAVPT= -1
$$ ##$AQSEQ= 0
$$ ##$AQ_mod= 3
$$ ##$AUNM= <au_zg>
$$ ##$AUTOPOS= <>
$$ ##$BF1= 600.3
$$ ##$BF2= 600.3
$$ ##$BF3= 600.3
$$ ##$BF4= 600.3
$$ ##$BF5= 600.3
$$ ##$BF6= 600.3
$$ ##$BF7= 600.3
$$ ##$BF8= 600.3
$$ ##$BYTORDA= 0
$$ ##$CFDGTYP= 0
$$ ##$CFRGTYP= 9
$$ ##$CHEMSTR= <none>
$$ ##$CNST= (0..63)
$$ 1 1 145 1 1 1 1 1 1 1 1 1 1 1 1 1 1 1 1 1 1 1 1 1 1 1 1 1 1 1 1 1 1 1 1
$$ 1 1 1 1 1 1 1 1 1 1 1 1 1 1 1 1 1 1 1 1 1 1 1 1 1 1 1 1 1
$$ ##$CPDPRG= <>
$$ ##$CPDPRG1= <>
$$ ##$CPDPRG2= <waltz16>
$$ ##$CPDPRG3= <>
$$ ##$CPDPRG4= <mlev>
$$ ##$CPDPRG5= <mlev>
$$ ##$CPDPRG6= <mlev>
$$ ##$CPDPRG7= <mlev>
$$ ##$CPDPRG8= <mlev>
$$ ##$CPDPRGB= <>
$$ ##$CPDPRGT= <>
$$ ##$D= (0..63)
$$ 0 1 0 0 0 0 0 0 0 0.06 0 0.03 0 0 0 0 1e-04 0 0 0 0 0 0 0 0 0 0 0 0 0 0
$$ 0 0 0 0 0 0 0 0 0 0 0 0 0 0 0 0 0 0 0 0 0 0 0 0 0 0 0 0 0 0 0 0 0
$$ ##$DATE= 1433502318
$$ ##$DBL= (0..7)
$$ 120 120 120 120 120 120 120 120
$$ ##$DBP= (0..7)
$$ 150 150 150 150 150 150 150 150
$$ ##$DBP07= 0
$$ ##$DBPNAM0= <>
$$ ##$DBPNAM1= <>
$$ ##$DBPNAM2= <>
$$ ##$DBPNAM3= <>
$$ ##$DBPNAM4= <>
$$ ##$DBPNAM5= <>
$$ ##$DBPNAM6= <>
$$ ##$DBPNAM7= <>
$$ ##$DBPOAL= (0..7)
$$ 0.5 0.5 0.5 0.5 0.5 0.5 0.5 0.5
$$ ##$DBPOFFS= (0..7)
$$ 0 0 0 0 0 0 0 0
$$ ##$DE= 6.5
$$ ##$DECBNUC= <off>
$$ ##$DECIM= 2218.66666666667
$$ ##$DECNUC= <off>
$$ ##$DECSTAT= 4
$$ ##$DIGMOD= 1
$$ ##$DIGTYP= 12
$$ ##$DL= (0..7)
$$ 0 120 120 120 120 120 120 120
$$ ##$DP= (0..7)
$$ 150 150 150 150 150 150 150 150
$$ ##$DP07= 0
$$ ##$DPNAME0= <>
$$ ##$DPNAME1= <>
$$ ##$DPNAME2= <>
$$ ##$DPNAME3= <>
$$ ##$DPNAME4= <>
$$ ##$DPNAME5= <>
$$ ##$DPNAME6= <>
$$ ##$DPNAME7= <>
$$ ##$DPOAL= (0..7)
$$ 0.5 0.5 0.5 0.5 0.5 0.5 0.5 0.5
$$ ##$DPOFFS= (0..7)
$$ 0 0 0 0 0 0 0 0
$$ ##$DQDMODE= 0
$$ ##$DR= 22
$$ ##$DS= 0
$$ ##$DSLIST= <SSSSSSSSSSSSSSS>
$$ ##$DSPFIRM= 0
$$ ##$DSPFVS= 20
$$ ##$DTYPA= 0
$$ ##$EXP= <>
$$ ##$F1LIST= <111111111111111>
$$ ##$F2LIST= <222222222222222>
$$ [...]
$$ -1 -1 -1 -1 -1 -1 -1 -1 -1 -1 -1 -1 -1 -1 -1 -1 -1 -1 -1 -1 -1 -1 -1 -1
$$ -1 -1 -1 -1 -1 -1 -1 -1 -1 -1 -1 -1 -1 -1 -1 -1 -1 -1 -1 -1 -1 -1 -1 -1
$$ -1 -1 -1 -1 -1 -1 -1 -1 -1 -1 -1 -1 -1 -1 -1 -1 -1 -1 -1 -1 -1 -1 -1 -1
$$ -1 -1 -1 -1 -1 -1 -1 -1 -1 -1 -1 -1 -1 -1 -1 -1 -1 -1 -1 -1 -1 -1 -1 -1
$$ -1 -1 -1 -1 -1 -1 -1 -1 -1 -1 -1 -1 -1 -1 -1 -1
$$ ##$RG_tab8= (0..255)
$$ -1 -1 -1 -1 -1 -1 -1 -1 -1 -1 -1 -1 -1 -1 -1 -1 -1 -1 -1 -1 -1 -1 -1 -1
$$ -1 -1 -1 -1 -1 -1 -1 -1 -1 -1 -1 -1 -1 -1 -1 -1 -1 -1 -1 -1 -1 -1 -1 -1
$$ -1 -1 -1 -1 -1 -1 -1 -1 -1 -1 -1 -1 -1 -1 -1 -1 -1 -1 -1 -1 -1 -1 -1 -1
$$ -1 -1 -1 -1 -1 -1 -1 -1 -1 -1 -1 -1 -1 -1 -1 -1 -1 -1 -1 -1 -1 -1 -1 -1
$$ -1 -1 -1 -1 -1 -1 -1 -1 -1 -1 -1 -1 -1 -1 -1 -1 -1 -1 -1 -1 -1 -1 -1 -1
$$ -1 -1 -1 -1 -1 -1 -1 -1 -1 -1 -1 -1 -1 -1 -1 -1 -1 -1 -1 -1 -1 -1 -1 -1
$$ -1 -1 -1 -1 -1 -1 -1 -1 -1 -1 -1 -1 -1 -1 -1 -1 -1 -1 -1 -1 -1 -1 -1 -1
$$ -1 -1 -1 -1 -1 -1 -1 -1 -1 -1 -1 -1 -1 -1 -1 -1 -1 -1 -1 -1 -1 -1 -1 -1
$$ -1 -1 -1 -1 -1 -1 -1 -1 -1 -1 -1 -1 -1 -1 -1 -1 -1 -1 -1 -1 -1 -1 -1 -1
$$ -1 -1 -1 -1 -1 -1 -1 -1 -1 -1 -1 -1 -1 -1 -1 -1 -1 -1 -1 -1 -1 -1 -1 -1
$$ -1 -1 -1 -1 -1 -1 -1 -1 -1 -1 -1 -1 -1 -1 -1 -1
$$ ##$RG_tabA= (0..255)
$$ 0.25 0.28 0.32 0.35 0.4 0.44 0.5 0.56 0.64 0.7 0.8 0.89 1 1.12 1.28 1.4
$$ 1.6 1.78 2 2.25 2.56 2.8 3.2 3.56 4 4.5 5 5.6 6.35 7.12 8 9 10 11.3 12.7
$$ 14.2 16 18 20.2 22.6 25.4 28.5 32 36 40.3 45.2 50.8 57 64 71.8 80.6 90.5
$$ 101 114 128 144 161 181 203 -1 -1 -1 -1 -1 -1 -1 -1 -1 -1 -1 -1 -1 -1 -1
$$ -1 -1 -1 -1 -1 -1 -1 -1 -1 -1 -1 -1 -1 -1 -1 -1 -1 -1 -1 -1 -1 -1 -1 -1
$$ -1 -1 -1 -1 -1 -1 -1 -1 -1 -1 -1 -1 -1 -1 -1 -1 -1 -1 -1 -1 -1 -1 -1 -1
$$ -1 -1 -1 -1 -1 -1 -1 -1 -1 -1 -1 -1 -1 -1 -1 -1 -1 -1 -1 -1 -1 -1 -1 -1
$$ -1 -1 -1 -1 -1 -1 -1 -1 -1 -1 -1 -1 -1 -1 -1 -1 -1 -1 -1 -1 -1 -1 -1 -1
$$ -1 -1 -1 -1 -1 -1 -1 -1 -1 -1 -1 -1 -1 -1 -1 -1 -1 -1 -1 -1 -1 -1 -1 -1
$$ -1 -1 -1 -1 -1 -1 -1 -1 -1 -1 -1 -1 -1 -1 -1 -1 -1 -1 -1 -1 -1 -1 -1 -1
$$ -1 -1 -1 -1 -1 -1 -1 -1 -1 -1 -1 -1 -1 -1 -1 -1 -1 -1 -1 -1 -1 -1 -1 -1
$$ -1 -1 -1 -1 -1 -1 -1 -1 -1 -1 -1 -1 -1 -1
$$ ##$ROUT14= (0..7)
$$ 0 0 0 0 0 0 0 0
$$ ##$ROUTER= -1
$$ ##$RX22TY= <no>
$$ ##$RXFMAX= (0..7)
$$ 647.5 -1 -1 -1 -1 -1 -1 -1
$$ ##$RXFMIN= (0..7)
$$ 5 -1 -1 -1 -1 -1 -1 -1
$$ ##$RXINTLV= (0..7)
$$ 1 0 0 0 0 0 0 0
$$ ##$RXMSTY= <no>
$$ ##$SCMTY= <no>
$$ ##$SGUC1= (0..15)
$$ 17 18 34 0 0 0 0 0 0 0 0 0 0 0 0 0
$$ ##$SGUC2= (0..15)
$$ 33 256 20 0 0 0 0 0 0 0 0 0 0 0 0 0
$$ ##$SPECTR= 10
$$ ##$SY2FLAG= 0
$$ ##$TFXNUM= 0
$$ ##$TRIPLO2= 0
$$ ##$VTUTY= <tty05>
$$ ##$WBREFAM= (0..15)
$$ 100 100 100 100 100 100 100 100 100 100 100 100 100 100 100 100
$$ ##$WBREFPH= (0..15)
$$ 0 0 0 0 0 0 0 0 0 0 0 0 0 0 0 0
$$ ##$XFAC= 2
$$ ##END=
$$ 
##$DECIM=	2218.66666666667
##$DSPFVS=	20
##XUNITS=	HZ
##YUNITS=	ARBITRARY UNITS
##FIRSTX=	6322.8525384689401108
##LASTX=	-2691.4329892738592207
##XFACTOR=	-0.1375491802509010153
##YFACTOR=	6.5088974609375004616e-06
##NPOINTS=	65536
##XYDATA=	(X++(Y..Y))
$$ [...]
-15272 -90210 -91972 -92799 -87900 -83004 -83827 -84237 -84643 -82549 -80452 -84453 -88451 -90903 -87628 -88291 -88950 -86395 -83835 -82173
-15254 -82173 -80508 -81707 -82903 -84759 -86611 -88466 -90318 -91022 -91722 -89565 -87404 -87393 -87378 -90228 -93075 -91275 -89472 -87672
-15236 -87672 -85869 -87229 -88585 -87084 -85579 -82855 -80131 -80269 -80407 -79651 -78894 -78138 -77382 -76417 -75452 -77348 -79245 -81380 -83514
-15217 -83514 -85649 -87784 -88947 -90109 -86503 -82896 -86026 -89155 -87516 -85877 -83194 -80511 -80690 -80869 -81942 -83015 -84088
-15200 -84088 -85161 -83373 -81581 -82654 -83723 -85154 -86581 -88012 -89439 -87740 -86037 -89107 -92173 -95065 -97952 -97982 -98008 -95143
-15182 -95143 -92278 -92274 -92270 -94353 -96436 -93749 -91063 -88384 -85705 -83026 -80347 -78265 -76182 -78868 -81555 -80985 -80415 -79845 -79274
-15163 -79274 -80970 -82665 -81499 -80333 -80351 -80370 -80388 -80407 -81558 -82710 -86722 -90735 -91257 -91775 -89435 -87091 -87076 -87058 -82274 -77486
-15143 -77486 -78663 -79837 -81014 -82188 -82531 -82870 -83213 -83552 -83142 -82728 -85180 -87628 -86860 -86089 -85321 -84550 -88522 -92490 -89785
-15124 -89785 -87076 -87114 -87147 -87184 -87218 -85392 -83567 -88179 -87069 -83276 -85206 -86421 -87635 -86316 -84997 -80817 -76637 -79669 -82702
-15105 -82702 -88954 -89483 -87374 -85266 -83991 -88440 -89908 -85653 -84975 -84297 -83351 -82404 -87777 -93149 -96734 -94595 -94483 -88649
-15087 -88649 -84681 -86436 -84614 -82792 -85202 -87613 -85254 -82896 -79882 -76868 -78622 -80377 -85530 -90683 -89159 -87635 -87058
-15070 -87058 -86480 -85903 -85325 -84688 -84051 -86633 -83492 -83630 -83768 -83548 -83328 -81916 -80504 -79450 -78395 -76469 -80266 -80843 -81421
-15051 -81421 -82892 -84364 -85478 -86592 -90247 -88179 -86469 -84759 -83943 -83127 -82311 -81495 -81406 -81316 -77650 -79707 -83134 -80839 -78902
-15032 -78902 -82687 -85392 -88097 -88298 -88500 -85899 -83298 -83559 -83820 -85169 -86514 -81782 -82769 -86264 -89755 -85620 -81480 -76212
-15014 -76212 -80478 -87371 -88537 -88634 -88727 -88466 -88202 -87706 -87210 -86715 -86219 -88347 -90474 -92602 -94729 -94114 -93500 -92885 -92270 -89688
-14994 -89688 -87106 -84524 -81942 -82121 -82300 -85340 -88380 -87367 -86354 -85340 -84327 -81793 -79260 -79587 -79915 -82687 -85459 -85370
-14976 -85370 -85280 -83768 -82251 -85508 -88760 -87009 -85254 -83503 -81748 -83969 -86186 -88406 -90623 -89267 -87907 -86551 -85191
-14959 -85191 -84818 -84446 -84073 -83701 -83984 -84267 -84550 -84833 -83067 -81301 -84304 -87307 -87628 -87948 -88269 -88589 -88947 -89304 -89662 -90020 -88708
-14938 -88708 -87397 -83224 -79051 -80556 -82061 -80705 -79349 -82106 -84863 -82851 -80839 -80366 -79893 -79420 -78947 -79785 -80623 -78600
-14920 -78600 -76577 -78429 -80280 -82132 -83984 -84166 -84349 -89301 -94252 -93436 -92620 -91804 -90988 -91186 -91383 -88719 -86055 -85627 -85199
-14901 -85199 -81909 -78619 -83377 -88134 -82400 -76666 -80094 -83518 -86946 -90370 -92248 -94122 -91231 -88336 -88544 -88749 -88958
-14884 -88958 -89163 -86272 -83377 -83347 -83313 -83418 -83518 -83622 -83723 -82337 -80947 -84330 -87710 -89126 -90538 -89092 -87643 -85362 -83079
-14865 -83079 -87475 -91868 -92430 -92989 -90690 -88388 -88712 -89032 -86495 -83954 -84114 -84271 -83477 -88403 -94047 -90150 -85303 -80452
-14847 -80452 -80493 -80530 -79856 -84900 -89532 -88436 -88060 -87680 -87393 -87102 -86816 -86525 -85880 -85232 -84587 -83939 -84397 -84852 -82449 -80042 -82646
-14826 -82646 -85247 -88567 -86160 -86514 -92587 -98306 -98299 -95910 -93518 -90772 -88023 -86514 -85001 -86354 -87702 -88637 -89569 -90504
-14808 -90504 -91436 -89241 -87043 -84848 -82650 -82482 -82311 -84647 -86979 -91994 -91283 -87117 -82948 -86652 -90351 -92863 -89647 -86614
-14790 -86614 -89301 -88772 -82516 -83775 -85031 -85933 -86830 -86517 -86201 -85888 -85571 -89431 -93287 -92378 -91465 -91808 -92147 -89629 -87106
-14771 -87106 -88224 -89338 -90098 -90854 -92211 -87844 -89558 -91272 -90780 -90288 -89439 -94312 -92568 -90825 -86577 -82330 -79632 -76935
-14753 -76935 -77099 -77263 -80482 -83701 -82151 -80601 -85966 -91331 -93835 -96339 -97352 -98366 -96518 -94670 -93597 -92524 -91450
-14736 -91450 -90377 -86994 -83611 -88455 -93298 -94863 -90705 -86905 -83105 -86160 -89215 -89409 -89602 -91644 -93686 -92866 -92047 -92315
-14718 -92315 -92583 -92851 -93120 -92017 -90914 -89811 -88708 -87829 -86950 -86070 -85191 -85504 -85817 -86130 -86443 -86003 -85564 -84766 -83969 -86570
-14698 -86570 -83447 -83544 -83641 -83649 -83656 -83306 -88678 -91547 -94416 -96451 -92762 -89968 -92896 -92248 -91600 -89520 -87441 -82143 -82568 -84990
-14678 -84990 -87412 -83753 -85817 -89073 -86607 -90579 -94550 -93526 -92497 -91473 -90444 -87989 -85530 -85579 -85623 -86998 -82646 -81517
-14660 -81517 -80385 -82117 -83846 -91659 -93746 -91901 -90053 -87851 -85646 -86603 -87557 -85653 -83745 -82140 -80530 -81786 -83038
-14643 -83038 -85962 -88883 -87039 -85191 -89424 -93656 -94431 -89483 -86383 -83283 -79468 -81376 -81242 -81108 -78112 -80839 -83924
-14626 -83924 -87009 -87352 -81972 -80012 -83775 -83604 -83432 -85586 -82017 -78447 -80601 -82680 -84759 -87196 -89632 -91354 -93075
-14609 -93075 -95154 -91510 -89595 -87676 -84688 -87419 -89558 -85970 -85962 -85951 -85437 -84919 -81186 -83172 -84267 -85359 -86812 -88261
-14591 -88261 -89133 -90001 -85746 -81488 -82181 -77147 -74382 -81152 -87851 -88824 -85031 -81234 -83999 -86760 -86663 -86562 -85392 -84219
-14573 -84219 -82691 -86883 -84997 -83108 -84442 -85772 -87240 -88705 -87311 -85914 -87620 -89323 -88168 -87009 -89737 -92460 -90418
-14556 -90418 -88373 -92591 -96804 -94345 -91883 -89901 -87915 -86290 -84662 -81726 -84509 -84077 -83641 -83622 -83600 -86085 -88567 -91767
-14538 -91767 -89241 -89938 -90631 -93354 -96074 -95936 -95795 -94226 -92654 -91085 -89513 -89457 -89398 -82665 -75929 -79688 -83444 -87203 -90959
-14519 -90959 -91931 -92900 -91368 -89833 -84308 -84502 -87561 -84893 -87020 -89144 -87814 -80757 -80441 -85843 -85169 -84491 -81521 -84271
-14501 -84271 -83805 -83336 -81618 -79897 -81040 -82181 -79204 -76223 -76108 -75988 -75217 -74442 -80347 -86249 -87520 -88786 -90057 -91324
-14483 -91324 -90866 -90404 -87084 -83760 -85586 -87408 -86372 -85333 -85310 -85284 -85262 -85236 -82292 -79345 -81171 -82993 -85415 -87833 -87393
-14464 -87393 -86950 -85698 -84442 -83190 -81935 -83962 -85985 -85150 -84312 -84818 -85321 -88690 -92054 -89938 -87818 -90471 -93120 -90661
-14446 -90661 -88202 -88604 -89006 -89468 -89930 -90392 -90854 -89081 -87307 -88395 -89483 -85862 -82240 -81480 -80720 -81279 -81838 -85258 -88678
-14427 -88678 -86614 -84550 -85348 -86145 -86048 -85951 -88716 -91480 -91443 -91406 -91368 -91331 -92576 -93820 -92203 -90586 -89386 -88187 -86987 -85787
-14407 -85787 -85318 -84848 -84379 -83909 -85526 -87143 -88760 -90377 -87292 -84207 -87799 -91391 -91048 -90705 -90363 -90020 -91137 -92255 -90512
-14388 -90512 -88768 -91316 -93865 -91644 -89424 -89062 -88701 -88339 -87978 -89822 -91667 -90649 -89632 -88541 -87449 -89219 -90988 -90076
-14370 -90076 -89163 -88250 -87337 -86253 -85165 -81219 -77270 -80120 -82967 -85817 -88664 -91454 -94241 -92263 -90281 -93667 -97050
-14353 -97050 -91853 -86652 -87982 -89312 -90642 -91972 -92348 -92725 -88332 -83939 -83660 -83380 -82505 -81629 -89040 -86912 -80254 -79319
-14335 -79319 -80489 -81655 -80321 -78984 -79200 -79412 -82490 -85564 -86316 -87065 -84956 -82844 -83239 -83630 -84025 -84416 -84036 -83652 -83272
-14316 -83272 -82889 -83045 -83198 -83354 -83507 -84453 -85396 -83481 -81562 -77322 -73078 -75515 -77948 -82889 -87825 -89904 -91980 -88395
-14298 -88395 -84807 -81223 -77635 -81160 -84681 -83436 -82188 -83567 -84941 -83459 -81972 -81808 -81644 -81480 -81316 -84133 -86950 -89766
-14280 -89766 -92583 -94476 -96369 -91585 -86801 -81659 -76517 -79960 -83403 -83105 -82807 -82508 -82210 -80184 -78157 -82807 -87456 -88529
-14262 -88529 -89602 -87814 -86026 -86443 -86860 -87278 -87695 -86003 -84308 -85478 -86644 -86026 -85403 -84785 -84163 -86465 -88764 -88205 -87643
-14243 -87643 -86070 -84494 -82922 -81346 -82516 -83682 -84852 -86018 -88500 -90977 -86782 -82583 -80355 -78123 -78757 -79386 -80139
-14226 -80139 -80888 -81640 -82389 -83634 -84874 -86119 -87360 -84073 -80783 -82266 -83745 -84170 -84591 -82155 -79714 -79245 -78771 -81163
-14208 -81163 -83552 -84543 -85530 -86521 -87509 -88678 -89845 -91015 -92181 -92740 -93295 -93854 -94409 -93954 -93496 -93041 -92583 -89532 -86480 -86290
-14188 -86290 -86100 -85016 -83932 -87617 -91301 -92006 -92710 -90553 -88395 -87430 -86465 -85500 -84535 -86037 -87538 -89040 -90541 -88943
-14170 -88943 -87345 -88608 -89871 -86424 -82978 -82393 -81808 -81938 -82069 -82199 -82330 -81130 -79930 -78730 -77531 -79431 -81331 -83231
-14152 -83231 -85131 -86286 -87441 -88596 -89751 -90489 -91227 -91965 -92702 -90243 -87784 -90094 -92404 -87978 -83552 -83894 -84237 -84848
-14134 -84848 -85459 -83209 -80959 -83418 -85877 -88336 -90795 -90146 -89498 -91711 -93924 -93336 -92747 -89297 -85847 -84394 -82941 -86257
-14116 -86257 -89573 -89133 -88693 -88254 -87814 -82315 -76815 -76085 -75355 -80109 -84863 -89617 -94372 -90795 -87218 -88410 -89602 -89483
-14098 -89483 -89364 -89245 -89126 -87315 -85504 -86555 -87605 -87047 -86488 -85929 -85370 -86018 -86667 -87315 -87963 -86942 -85921 -84900 -83880
-14079 -83880 -81920 -79960 -78000 -76040 -77479 -78917 -83216 -87516 -86093 -84669 -83246 -81823 -82725 -83626 -84528 -85430 -86059 -86689
-14061 -86689 -87319 -87948 -85657 -83365 -81074 -78783 -82050 -85318 -83816 -82315 -85105 -87896 -87825 -87754 -87482 -87210 -86938 -86667 -87706
-14042 -87706 -88746 -89785 -90825 -87497 -84170 -85612 -87054 -89390 -91726 -91201 -90675 -89323 -87971 -91387 -94804 -93869 -92933 -91998
-14024 -91998 -91063 -94897 -98731 -97796 -96860 -97117 -97375 -94770 -92166 -88861 -85556 -82251 -78947 -82378 -85810 -86380 -86950 -88831
-14006 -88831 -90713 -89733 -88753 -85925 -83097 -83131 -83164 -84576 -85985 -87397 -88805 -91708 -94606 -94647 -94684 -92117 -89547 -93656 -97762
-13987 -97762 -94062 -90359 -91428 -92494 -91328 -90158 -88991 -87822 -90709 -93593 -89804 -86011 -87482 -88950 -90422 -91890 -88235
-13970 -88235 -84576 -83783 -82985 -83183 -83377 -83574 -83768 -82475 -81178 -84655 -88127 -90754 -93377 -93142 -92904 -93384 -93861 -94342 -94819 -94535
-13950 -94535 -94249 -90746 -92963 -93574 -94182 -92289 -90392 -89170 -87944 -86722 -85497 -82784 -80068 -87251 -88708 -86730 -84751
-13933 -84751 -85277 -85802 -87937 -90072 -92207 -94342 -95493 -96644 -96246 -90124 -91871 -93619 -94651 -95683 -98589 -95772 -93313
-13916 -93313 -90854 -92389 -93924 -98679 -97710 -94416 -91123 -87829 -84535 -78917 -79021 -80675 -82330 -81607 -80880 -80157 -79431 -79543
-13898 -79543 -79651 -79763 -79871 -81860 -83846 -82974 -82099 -81525 -80947 -78108 -75265 -73104 -80478 -85351 -90221 -90623 -91022 -91424 -91823
-13879 -91823 -89409 -86991 -88988 -90981 -92322 -87937 -86775 -85608 -85992 -86372 -86756 -87136 -87102 -87065 -86674 -86279 -92341 -92676 -89558
-13860 -89558 -86436 -83913 -81387 -81726 -82061 -84580 -87095 -89614 -92129 -91726 -91320 -88056 -84789 -87203 -89614 -89167 -88716 -92561
-13842 -92561 -96402 -96790 -91450 -89699 -87948 -88343 -88738 -90623 -86786 -86167 -85549 -82382 -79215 -80817 -82419 -83008 -83596 -83827 -89781
-13823 -89781 -93481 -97181 -98019 -98857 -98444 -92307 -89748 -87188 -84122 -86778 -89077 -91376 -85269 -79163 -80090 -81018 -82233 -89170
-13805 -89170 -91339 -87784 -87151 -86517 -85526 -84535 -86152 -87769 -86525 -85280 -85467 -85653 -89416 -87456 -85243 -88753 -91547 -94342
-13787 -94342 -92307 -90273 -88239 -86205 -87583 -88962 -90340 -91719 -91905 -92091 -92278 -92464 -91585 -90705 -89826 -88947 -84491 -80035 -80347
-13768 -80347 -90199 -96652 -97382 -95251 -93120 -91167 -89215 -87263 -85310 -83984 -82658 -80973 -85012 -85057 -85102 -88723 -86622 -88842
-13750 -88842 -91063 -92926 -94789 -93731 -92673 -89111 -85549 -82922 -86018 -85895 -85772 -86126 -86480 -93153 -99826 -99137 -92725 -89532
-13732 -89532 -86339 -83742 -81145 -81409 -81674 -83660 -85646 -87274 -88902 -91007 -87389 -86991 -86592 -86819 -87047 -90135 -93224 -92378
-13714 -92378 -91532 -94263 -91272 -83995 -82438 -80526 -78611 -78488 -84085 -86108 -88127 -92356 -90858 -89722 -88582 -88339 -88093 -84632
-13696 -84632 -86890 -87792 -88690 -89949 -91205 -90616 -90023 -89435 -88842 -89297 -89748 -90918 -86361 -85206 -89770 -93980 -92464 -90430 -88392
-13677 -88392 -86000 -83604 -85564 -87520 -89480 -91436 -91339 -91238 -88280 -85318 -84804 -84286 -89852 -89692 -88194 -86693 -87699 -88701
-13659 -88701 -86130 -83555 -85754 -87948 -89357 -90761 -89308 -87851 -84133 -80411 -82058 -89424 -89383 -89338 -94424 -99506 -96842 -94174
-13641 -94174 -95921 -97665 -97870 -92348 -92911 -93470 -94986 -96499 -91577 -92374 -91734 -85366 -87348 -89327 -91428 -93526 -94077 -88902
-13623 -88902 -87911 -86916 -83302 -79684 -78276 -86402 -92386 -92643 -92043 -91439 -93343 -95243 -91603 -87959 -87538 -87114 -86514 -91633 -93895
-13604 -93895 -90430 -91797 -93161 -94528 -95892 -89532 -88891 -87896 -86897 -87453 -88004 -85698 -83388 -82214 -81037 -79863 -78686 -80374
-13586 -80374 -82058 -89826 -91868 -91905 -91939 -88399 -90579 -91868 -93153 -94442 -95728 -94960 -88466 -85195 -81920 -82643 -83362 -86946
-13568 -86946 -90526 -90064 -89599 -89137 -88671 -89282 -89889 -90500 -91108 -90117 -89122 -90992 -92859 -93656 -94450 -95247 -96041 -96160 -96279 -97114 -92225
-13547 -92225 -87397 -88291 -88112 -87933 -94245 -94834 -93872 -92911 -87419 -81927 -83112 -84297 -81883 -79468 -81823 -84178 -83075 -81972
-13529 -81972 -81227 -80482 -78455 -82151 -82628 -83105 -82449 -81793 -81137 -80482 -85269 -90057 -90076 -90094 -91901 -93708 -95873 -92315 -91588 -90862
-13509 -90862 -93354 -90124 -85642 -86883 -88123 -83641 -79554 -81190 -79248 -77307 -78526 -79744 -80962 -82181 -79733 -77285 -77698
-13492 -77698 -78112 -75783 -73455 -72676 -77620 -80463 -83306 -82930 -88276 -88436 -82874 -80888 -78902 -78615 -78328 -78041 -77754 -80090 -82427
-13473 -82427 -84763 -87099 -85582 -84066 -79330 -80318 -83451 -86585 -83995 -87129 -83868 -80608 -82475 -84342 -84360 -84379 -87259 -90139
-13455 -90139 -89520 -88902 -91860 -89096 -86152 -88932 -91354 -88053 -85899 -83745 -81234 -78723 -77285 -75847 -78820 -81793 -88090
-13438 -88090 -88664 -84468 -85996 -85795 -85593 -82531 -85191 -86480 -87769 -84647 -81525 -79774 -78023 -80683 -83343 -87140 -85213
-13421 -85213 -89368 -93522 -91000 -88477 -88816 -89155 -91253 -93351 -90679 -88008 -86529 -85049 -83928 -82807 -78309 -79535 -77900
-13404 -77900 -76264 -74569 -78596 -79405 -80213 -86238 -92263 -96737 -95489 -91797 -88105 -83101 -87635 -90046 -86730 -90094 -93455
-13387 -93455 -90143 -86827 -83514 -80198 -80254 -80307 -80362 -80415 -81186 -81953 -82725 -83492 -84330 -85165 -86003 -86838 -83801 -80761 -82494 -84222 -83034
-13366 -83034 -81842 -77434 -78745 -79763 -80776 -82151 -83522 -85038 -86555 -87713 -88872 -91104 -87613 -87699 -87784 -85009 -87956 -87684
-13348 -87684 -87412 -89942 -92471 -95001 -97531 -91462 -85392 -80873 -82076 -81730 -81383 -84256 -87129 -83950 -80772 -77594 -74416
-13331 -74416 -74695 -74975 -75254 -75534 -76171 -76808 -80307 -83805 -85277 -86748 -83451 -80154 -81372 -82590 -83809 -85027 -88272 -91518
-13313 -91518 -91901 -92285 -91827 -91368 -90910 -90452 -89815 -89178 -88541 -87903 -86924 -85944 -84964 -83984 -86104 -88224 -87482 -86741 -88134 -89524 -88056
-13292 -88056 -86585 -86011 -85433 -84859 -84282 -83194 -82102 -83876 -85646 -84379 -83108 -84703 -86294 -90072 -93846 -94763 -95676 -96234
-13274 -96234 -96790 -94487 -92181 -94267 -96350 -95575 -94796 -93485 -92170 -87997 -83820 -85623 -87427 -89230 -91033 -89737 -88440
-13257 -88440 -87143 -85847 -84014 -82181 -83209 -84237 -86756 -89275 -88932 -88589 -85228 -81868 -83276 -84684 -84900 -85117 -85333 -85549
-13239 -85549 -86808 -88067 -89327 -90586 -94349 -98112 -95199 -92285 -90240 -88194 -92825 -97457 -96603 -95750 -99666 -103582 -97870
-13222 -97870 -92158 -89308 -86458 -84442 -82427 -83272 -84118 -84070 -84021 -86834 -89647 -87631 -85616 -83600 -81584 -80210 -78835 -80321
-13204 -80321 -81808 -86216 -90623 -92170 -93716 -90273 -86830 -88157 -89483 -87948 -86413 -84878 -83343 -85593 -87844 -90094 -92345
-13187 -92345 -89766 -87188 -83894 -86324 -88775 -85504 -85810 -86115 -86063 -86011 -85959 -85906 -88701 -91495 -91428 -91361 -90102 -88842 -88298 -82032
-13167 -82032 -80239 -84166 -84520 -84871 -87550 -90225 -92546 -94863 -95053 -89517 -87203 -84886 -85076 -85262 -80683 -76100 -77169 -78235
-13149 -78235 -81808 -85377 -84658 -78213 -79759 -81301 -81700 -82095 -85713 -89327 -87699 -91790 -89446 -87099 -91681 -90538 -89755 -88969
-13131 -88969 -88544 -88116 -95679 -97516 -93649 -89778 -85195 -86331 -88425 -90515 -90105 -89692 -90273 -90851 -92147 -87717 -82397 -82795
-13113 -82795 -80813 -84550 -87903 -85530 -86737 -87941 -87479 -87013 -89412 -91808 -93205 -94603 -95642 -96682 -94979 -87553 -86208
-13096 -86208 -84863 -83056 -81249 -79800 -78350 -74874 -77121 -79010 -80899 -82922 -84945 -86968 -88991 -90359 -91726 -90232 -88738
-13079 -88738 -84472 -80206 -78801 -77397 -80165 -82933 -82840 -82747 -85526 -88306 -88224 -88142 -86212 -84282 -82352 -80422 -84036 -87650 -88403
-13060 -88403 -89155 -86868 -84580 -85154 -85728 -88231 -90735 -86562 -82389 -82508 -82628 -85608 -88589 -90795 -93000 -92345 -91689 -87814
-13042 -87814 -83939 -82926 -81912 -80631 -79349 -80929 -82508 -83671 -84833 -85996 -87158 -89602 -92047 -91629 -91212 -92047 -92881 -90854
-13024 -90854 -88827 -91413 -93999 -91816 -89632 -88939 -88246 -87553 -86860 -86555 -86249 -88805 -91361 -93738 -96115 -91816 -87516 -84044
-13006 -84044 -80567 -81864 -83157 -85884 -88608 -86566 -84520 -86652 -88779 -86141 -83500 -81637 -79770 -80769 -81763 -81104 -80441 -79781
-12988 -79781 -79118 -80247 -81372 -79640 -77903 -79330 -80754 -82181 -83604 -82229 -80850 -82337 -83820 -85314 -86804 -83529 -80251
-12971 -80251 -77810 -75366 -77695 -80020 -85001 -89979 -86376 -82769 -81611 -80448 -79289 -78127 -78291 -78451 -85292 -92129 -91637
-12954 -91637 -91141 -90649 -90154 -89036 -87915 -86797 -85675 -87956 -90232 -92512 -94789 -95717 -96641 -94707 -92769 -91253 -89733 -88216
-12936 -88216 -86696 -88190 -89681 -91175 -92665 -92669 -92669 -89811 -86950 -87326 -87699 -88075 -88447 -88228 -88004 -90646 -93284 -94107 -94927 -95750
-12916 -95750 -96570 -93995 -91417 -88842 -86264 -90068 -93872 -97676 -101480 -98071 -94662 -91253 -87844 -84047 -80251 -79315 -78380
-12899 -78380 -78280 -78179 -80940 -83701 -84554 -85407 -86260 -87114 -86655 -86197 -82877 -79558 -81543 -83529 -85515 -87501 -84479 -81458 -78436
-12880 -78436 -75414 -76115 -76812 -80374 -83932 -87434 -90933 -85851 -80765 -77367 -73965 -75336 -76704 -77181 -77654 -78131 -78604 -77553
-12862 -77553 -76499 -78309 -80116 -80139 -80157 -80180 -80198 -81547 -82892 -81380 -79863 -79245 -78622 -80865 -83105 -83030 -82952 -85739 -88522 -88686
-12842 -88686 -88846 -89010 -89170 -88559 -87944 -87333 -86719 -84915 -83108 -81305 -79498 -81666 -83831 -86000 -88164 -84491 -80813 -80001 -79185
-12823 -79185 -82069 -84949 -84971 -84990 -87814 -90635 -88690 -86741 -86544 -86346 -86149 -85951 -89330 -92710 -91320 -89930 -89420 -88909 -88399
-12804 -88399 -87889 -89047 -90206 -86596 -82985 -84733 -86480 -88228 -89975 -91424 -92874 -94323 -95772 -94733 -93693 -92654 -91614
-12787 -91614 -88906 -86197 -83488 -80780 -82967 -85154 -87341 -89528 -89927 -90325 -87862 -85400 -87974 -90549 -95985 -101421 -100240
-12770 -100240 -99059 -95016 -90974 -90307 -89640 -88973 -88306 -92110 -95914 -94949 -93984 -89353 -84722 -84859 -84997 -86149 -87300 -88451
-12752 -88451 -89602 -85377 -81152 -83604 -86055 -88030 -90005 -89118 -88231 -88358 -88485 -88611 -88738 -90832 -92926 -95020 -97114 -95601
-12734 -95601 -94088 -92576 -91063 -91875 -92687 -93500 -94312 -93067 -91823 -93440 -95057 -88149 -81242 -84826 -88410 -86216 -84021 -84688
-12716 -84688 -85355 -88645 -91935 -90456 -88977 -89077 -89178 -84509 -79841 -81432 -83023 -84614 -86205 -88865 -91525 -91324 -91123 -89908
-12698 -89908 -88693 -87479 -86264 -85824 -85385 -84945 -84506 -86689 -88872 -88194 -87516 -90854 -94193 -94670 -95146 -93477 -91808 -90139 -88470
-12679 -88470 -87158 -85847 -84535 -83224 -84714 -86205 -85728 -88112 -91819 -89804 -87609 -91137 -95977 -95094 -89442 -89513 -94591 -93947
-12661 -93947 -94018 -94088 -92699 -91309 -92781 -94252 -95333 -96413 -96063 -95713 -92531 -89349 -90936 -92524 -95676 -98828 -95303 -91778
-12643 -91778 -94215 -96652 -96227 -95802 -92270 -88738 -86398 -89781 -91674 -87844 -87412 -86979 -91272 -92702 -87397 -87814 -94491 -95445
-12625 -95445 -93656 -91868 -89312 -92475 -90456 -91294 -96369 -95717 -93697 -91674 -92620 -93563 -94509 -95452 -94342 -93228 -87348 -81465
-12607 -81465 -82196 -82922 -81685 -86167 -89640 -90247 -89964 -89677 -90571 -91462 -93787 -96108 -89699 -83287 -82244 -86920 -89140 -91361
-12589 -91361 -91078 -90795 -92717 -94640 -91793 -88947 -89155 -89364 -89573 -89781 -89871 -89960 -90050 -90139 -89085 -88030 -89837 -91644 -87937 -84230
-12569 -84230 -81953 -79677 -80068 -80459 -81208 -81957 -78026 -79818 -81611 -77680 -77512 -77341 -80035 -77002 -78861 -80716 -82218 -83716
-12551 -83716 -84248 -84778 -85310 -85839 -86372 -86901 -87434 -87963 -87605 -87244 -86886 -86525 -86883 -87237 -87594 -87948 -86771 -85590 -84412 -83231 -85631
-12530 -85631 -88026 -90426 -92822 -90295 -87766 -82020 -81994 -86503 -91007 -85381 -79751 -78954 -78153 -80217 -82277 -80288 -78295 -81074
-12512 -81074 -83850 -88097 -92341 -91819 -91294 -89819 -88339 -87579 -81093 -75057 -74740 -75619 -76495 -77315 -78131 -81812 -85489 -87281 -89070
-12493 -89070 -90862 -92650 -88064 -83473 -80437 -83120 -83749 -84375 -82501 -80623 -79673 -78719 -80273 -81823 -87624 -87699 -89565 -91428
-12475 -91428 -88436 -85441 -88529 -85892 -80456 -75016 -77806 -80593 -82520 -84442 -89230 -94014 -93373 -92732 -90661 -88589 -86279
-12458 -86279 -83969 -82851 -87456 -89677 -86175 -84818 -83462 -87978 -92494 -91644 -90795 -96041 -91749 -86741 -87456 -86860 -86264 -86026
-12440 -86026 -85787 -84729 -83671 -82613 -81555 -80616 -79677 -81599 -83522 -87553 -91585 -88939 -86294 -87404 -88515 -89625 -90735
-12423 -90735 -90728 -90720 -87851 -84982 -83604 -82225 -83708 -85191 -85049 -84908 -81905 -78902 -80310 -81719 -83127 -84535 -84841 -85146 -85452
-12404 -85452 -85757 -86778 -87799 -84051 -80303 -80016 -79729 -82304 -84878 -80657 -76435 -78891 -81346 -82251 -83157 -77385 -71614 -65902
-12386 -65902 -60191 -63063 -65936 -69941 -73947 -77952 -81957 -82445 -82933 -86283 -89632 -86275 -82918 -82423 -81927 -85009 -88090 -88310
-12368 -88310 -88529 -85251 -81968 -83459 -84945 -85064 -85180 -88161 -91137 -91644 -92147 -91939 -91726 -101473 -99770 -94018 -88261 -91361
-12350 -91361 -94457 -90880 -87300 -88969 -90635 -92304 -93969 -92419 -90866 -89316 -87762 -86033 -84301 -89249 -94193 -93623 -93049
-12333 -93049 -92479 -91905 -89427 -86946 -87330 -87710 -88734 -89755 -90780 -91801 -87400 -82997 -83365 -83731 -82147 -80560 -81838 -83112
-12315 -83112 -82780 -82445 -82114 -81778 -84189 -86596 -84237 -81875 -82497 -83116 -83738 -84356 -84751 -85143 -90307 -95467 -92762 -90053 -81983
-12296 -81983 -83447 -85288 -87125 -84792 -82456 -83343 -84226 -85113 -85996 -89126 -92252 -92520 -92784 -88403 -84017 -84405 -84789 -84446 -84099
-12277 -84099 -83757 -83410 -85869 -88324 -87922 -87516 -87132 -86748 -88868 -90988 -93287 -89863 -88943 -93746 -96864 -94260 -95232 -96205 -94077
-12258 -94077 -91950 -89822 -87695 -86670 -85646 -87125 -88604 -88593 -82859 -80701 -78544 -78861 -84900 -90940 -91257 -91097 -90936 -90418
-12240 -90418 -89901 -88503 -87102 -85705 -84304 -87259 -90210 -93522 -91108 -91871 -92632 -93038 -93440 -93310 -93176 -90184 -87188 -90351
-12222 -90351 -93511 -91905 -90295 -91193 -92088 -92986 -93880 -91246 -88608 -86331 -84051 -81476 -84621 -87412 -90199 -90348 -90497 -90288
-12204 -90288 -90079 -91600 -87397 -86413 -85430 -84356 -83283 -78991 -80422 -86920 -93418 -98723 -98306 -97203 -96100 -91421 -92464 -96607
-12186 -96607 -100750 -99886 -93298 -90586 -87874 -84804 -81734 -80750 -79766 -81644 -83522 -87382 -91238 -90329 -89416 -91428 -93436 -95806
-12168 -95806 -92449 -89275 -86096 -82564 -79029 -76093 -73153 -76536 -79915 -83336 -81029 -81946 -82859 -82643 -82423 -78988 -75549 -72352
-12150 -72352 -63428 -54390 -31994 8401 54523 76557 54720 21370 -6256 -32452 -49110 -55694 -56554 -60038 -63522
-12135 -63522 -68123 -72724 -72557 -72389 -74725 -77061 -79397 -81734 -84532 -87330 -87266 -87203 -85649 -84096 -82542 -80988 -82058 -83127
-12117 -83127 -84196 -85266 -87348 -89431 -86745 -84058 -83321 -82583 -81845 -81108 -81681 -82255 -79967 -77680 -76599 -75519 -78015 -74789
-12099 -74789 -73648 -78231 -82456 -80959 -83235 -85508 -87069 -88626 -88876 -83399 -84006 -84610 -83995 -83377 -85623 -87866 -90173 -92475
-12081 -92475 -90012 -87546 -86916 -86286 -82438 -84312 -86901 -89491 -89576 -89662 -89092 -88522 -87952 -87382 -85798 -84215 -82274 -86055 -87840
-12062 -87840 -89625 -86998 -84371 -83473 -82576 -88354 -94133 -93176 -92218 -91260 -90303 -93339 -96376 -96551 -96726 -95012 -93295 -88719 -84140
-12043 -84140 -84573 -85001 -85791 -86577 -84401 -87944 -88272 -88596 -87672 -86745 -88682 -90616 -92594 -94573 -96551 -98530 -90433 -82337 -77460
-12024 -77460 -72583 -72639 -78418 -87058 -89975 -90806 -91637 -92468 -87576 -85482 -83388 -84513 -79915 -78835 -83477 -87047 -90616 -93380
-12006 -93380 -90422 -87822 -85221 -83634 -82046 -83321 -84595 -83611 -82628 -81644 -80660 -82658 -84655 -86652 -88649 -92628 -96607 -95817
-11988 -95817 -95027 -96443 -97859 -95817 -88053 -87553 -87050 -89055 -91056 -92643 -94226 -92952 -91674 -92695 -93712 -94733 -95750
-11971 -95750 -96592 -97430 -97915 -98395 -98775 -93429 -88086 -88462 -88842 -89219 -89956 -90690 -89550 -88406 -87266 -86123 -87903 -89681 -91819
-11952 -91819 -88231 -89606 -90977 -91991 -93004 -87643 -82277 -87047 -91816 -96141 -94740 -91790 -88839 -87263 -85683 -86965 -88246
-11935 -88246 -88392 -88533 -88675 -88816 -84550 -80280 -79468 -84379 -84778 -85172 -82706 -85962 -89401 -92836 -93768 -94699 -93477 -92255 -93895
-11916 -93895 -95534 -96816 -98097 -92702 -87307 -85847 -84386 -87695 -91003 -91033 -91063 -90735 -90407 -93418 -90705 -88708 -86711 -80243
-11898 -80243 -79498 -80303 -81108 -80198 -79289 -81242 -83194 -83894 -84595 -88872 -87427 -82296 -82885 -86573 -90262 -91808 -93351 -88813 -89997
-11879 -89997 -90590 -91178 -91767 -92356 -94021 -89960 -85899 -87561 -88593 -89621 -88146 -86670 -85377 -84081 -85646 -87210 -87095 -86976
-11861 -86976 -89360 -91745 -93954 -90437 -86920 -89126 -89614 -90102 -84509 -84640 -92877 -95392 -92900 -90407 -91685 -92963 -94241
-11844 -94241 -95519 -94413 -93306 -92199 -91093 -87952 -84811 -82862 -86637 -87907 -83455 -82579 -81704 -80873 -80042 -82073 -84103 -83511
-11826 -83511 -82918 -79464 -76011 -76856 -77698 -78544 -79386 -78205 -77020 -75839 -74654 -77944 -81231 -81659 -82084 -83824 -85560 -87300
-11808 -87300 -89036 -85165 -81290 -83738 -86182 -84874 -77840 -78798 -79751 -79561 -79368 -82039 -84707 -84278 -83846 -86279 -88708 -90545
-11790 -90545 -92382 -91357 -90333 -88950 -87568 -85828 -84088 -86327 -82844 -82579 -82315 -82885 -83455 -84025 -84595 -83772 -82948 -82125 -81301
-11771 -81301 -81968 -82635 -83302 -83969 -84368 -84766 -82661 -80556 -80895 -86957 -89800 -92643 -93142 -93638 -93779 -93917 -91912 -84181 -82535
-11752 -82535 -80884 -81368 -81849 -79830 -77806 -79900 -87713 -88854 -84267 -84941 -85612 -85571 -85526 -88108 -84964 -85042 -85117 -88429 -91737 -92188
-11732 -92188 -92635 -87363 -82087 -83492 -84893 -85310 -85728 -86145 -86562 -86681 -86801 -86920 -87039 -85579 -84118 -82658 -81197 -85817 -90437
-11713 -90437 -88380 -86324 -87207 -88086 -88254 -94141 -96216 -92564 -89275 -91704 -92930 -94152 -92516 -96600 -96454 -96305 -92941 -95296
-11695 -95296 -98746 -96473 -94915 -93358 -94126 -94893 -92799 -90705 -96525 -102345 -102799 -97531 -97211 -96890 -93708 -90526 -88801 -92795
-11677 -92795 -93574 -94349 -94889 -95426 -91197 -86965 -87430 -87892 -88358 -88820 -87378 -85933 -87352 -88768 -87699 -86629 -85560 -84491 -88310
-11658 -88310 -92129 -93086 -94044 -91603 -89163 -86722 -84282 -85240 -86197 -87155 -88112 -88667 -89222 -89778 -90333 -90888 -91443 -91998 -92553 -93451
-11638 -93451 -94349 -95247 -96145 -93943 -91741 -89539 -87337 -85094 -82851 -80608 -78365 -83216 -88067 -90057 -92047 -90340 -88634
-11621 -88634 -87643 -86652 -80236 -85266 -86719 -88172 -85661 -83149 -83500 -83850 -85094 -86339 -84722 -83105 -84349 -85593 -86838 -88082
-11603 -88082 -90281 -92479 -88000 -83522 -84733 -85944 -87155 -88365 -90053 -91741 -90567 -89394 -90947 -92501 -94055 -95608 -93585
-11586 -93585 -91562 -89539 -87516 -85359 -83201 -83906 -84610 -82095 -79580 -79926 -80273 -78250 -76227 -74204 -72180 -76298 -80415 -84532
-11568 -84532 -88649 -89759 -90869 -91980 -93090 -93187 -93284 -90519 -87754 -87315 -86875 -86436 -85996 -86748 -87501 -88254 -89006 -89707 -90407 -86339
-11548 -86339 -82270 -85236 -88202 -87114 -86026 -82076 -89573 -97069 -93120 -89230 -85340 -83954 -82568 -80783 -84718 -86152 -81860
-11531 -81860 -80552 -84964 -88664 -92360 -93556 -94748 -96659 -92844 -91715 -96305 -96965 -97620 -101931 -100515 -97553 -94588 -91626
-11514 -91626 -88660 -88559 -88455 -86700 -84941 -83187 -81428 -78660 -75888 -78246 -80601 -80053 -85228 -84323 -83418 -84956 -86495 -84219
-11496 -84219 -87665 -94122 -91041 -87602 -89886 -90381 -90877 -91730 -92583 -90113 -87643 -91849 -96056 -95970 -95884 -92937 -89990 -87088 -84185
-11477 -84185 -81640 -79096 -77982 -82590 -87199 -86085 -85702 -85318 -87438 -89554 -88872 -88190 -87509 -86823 -88332 -89841 -91350 -92855
-11459 -92855 -92039 -91223 -90407 -89588 -90933 -92278 -90761 -89241 -87725 -86208 -87553 -88895 -87482 -86070 -85016 -83958 -81175 -84114
-11441 -84114 -87412 -84982 -84327 -89394 -90884 -92374 -93984 -95594 -92792 -89990 -85593 -86920 -87889 -88857 -89170 -89483 -81808 -79856
-11423 -79856 -80154 -80452 -81108 -81763 -82121 -82479 -82836 -83194 -83239 -83283 -83686 -84088 -78589 -78812 -81897 -79260 -79118 -78976 -78477 -77974 -79800
-11402 -79800 -81625 -83451 -85273 -82866 -80459 -78052 -75642 -71446 -67251 -69733 -72210 -77799 -83388 -86115 -88839 -89718 -90597
-11385 -90597 -91477 -92352 -95020 -97688 -95586 -93481 -92870 -92259 -88786 -85310 -88369 -91428 -91626 -91819 -88142 -84465 -85556 -86644
-11367 -86644 -87617 -88589 -89561 -90530 -90966 -91402 -88977 -86547 -89375 -92203 -90262 -88317 -87032 -85746 -84461 -83172 -79830 -76488
-11349 -76488 -77915 -79338 -82613 -85888 -86301 -86711 -89260 -91804 -91491 -91175 -91518 -91857 -92199 -92538 -86562 -80582 -81283 -81979 -82501
-11330 -82501 -83019 -83541 -84058 -86249 -88436 -90627 -92814 -92501 -92184 -87102 -82017 -78425 -74830 -76007 -77181 -80742 -84301 -85001
-11312 -85001 -85698 -85288 -84874 -87322 -89770 -89420 -89066 -88712 -88358 -90675 -92989 -90534 -88079 -89919 -91756 -90731 -89707 -86130
-11294 -86130 -82549 -78969 -75388 -77296 -79200 -78242 -77285 -78611 -79934 -81257 -82579 -83011 -83440 -83868 -84297 -85064 -85832 -86599 -87367
-11275 -87367 -85988 -84610 -83231 -81853 -83246 -84640 -86033 -87427 -88522 -89617 -96793 -98246 -93746 -89245 -84386 -79528 -82896
-11258 -82896 -86264 -86413 -86562 -90213 -88142 -83567 -88529 -92896 -91540 -90780 -95743 -97792 -99841 -95571 -91301 -89476 -87650
-11241 -87650 -88686 -89722 -87047 -84371 -86465 -88559 -88924 -89289 -83574 -83582 -84461 -85340 -89796 -88529 -86070 -83611 -84014 -84416 -84073
-11222 -84073 -89453 -91614 -93775 -95579 -97382 -99543 -95981 -95705 -95426 -94793 -94155 -90780 -87400 -80806 -79930 -81860 -83786 -88936
-11204 -88936 -94081 -96428 -98772 -101477 -98455 -100661 -102863 -99942 -97017 -98924 -100828 -99517 -98202 -99275 -94621 -89971 -91041
-11187 -91041 -88179 -85314 -84360 -89126 -92013 -94897 -97784 -100668 -101410 -96424 -91085 -91465 -91849 -86506 -87844 -94901 -96655 -92684
-11169 -92684 -92293 -91898 -92937 -93977 -95016 -96056 -96737 -97419 -95240 -93060 -92415 -91771 -93988 -96205 -97050 -97896 -95880 -93865 -93149
-11150 -93149 -92434 -91719 -91003 -90109 -89215 -88321 -87427 -87501 -87576 -87650 -87725 -84222 -80720 -81987 -83254 -85534 -87810 -90448 -87360 -86301
-11130 -86301 -85240 -83824 -82404 -83611 -84815 -86022 -87225 -86823 -86417 -89591 -87039 -82438 -83555 -87419 -91279 -95322 -93638
-11113 -93638 -90407 -87173 -89517 -91857 -91339 -90817 -88988 -87155 -85325 -83492 -85716 -87937 -90161 -92382 -89122 -85858 -82956
-11096 -82956 -80049 -78831 -83332 -87836 -86614 -85277 -83935 -86652 -89364 -91581 -88075 -87073 -91793 -95202 -92889 -90933 -94699
-11079 -94699 -93861 -93023 -92542 -92062 -91581 -91100 -90620 -90139 -90858 -91577 -92296 -93015 -93734 -94453 -95173 -95892 -94345 -92799 -91253 -89707 -91439
-11058 -91439 -93172 -94904 -96637 -96823 -97009 -92427 -87844 -85884 -83924 -86376 -88827 -92591 -90631 -91890 -93149 -93634 -94118 -94603
-11040 -94603 -95087 -94841 -94595 -91130 -93388 -88731 -84073 -84543 -85012 -87687 -90363 -91488 -86890 -85869 -84848 -83470 -82091 -82140
-11022 -82140 -82184 -82233 -82277 -85426 -88570 -91719 -94863 -94301 -93734 -93172 -92605 -92043 -91477 -90914 -90348 -90828 -91305 -88567 -91547 -92028 -92505
-11001 -92505 -93343 -94178 -95120 -96059 -97002 -97941 -97691 -97438 -97188 -96935 -93250 -89561 -83015 -82188 -82736 -89003 -95631 -96533 -95739 -94942
-10981 -94942 -98559 -102173 -99532 -96886 -94245 -91600 -90158 -88712 -87270 -85824 -85575 -85321 -85072 -84818 -86596 -88369 -86927 -91205
-10963 -91205 -92982 -94755 -96890 -99021 -95012 -91000 -86991 -82978 -83500 -84017 -84539 -85057 -87009 -88958 -90910 -92859 -93619 -94375
-10945 -94375 -90366 -86354 -86711 -87065 -89927 -92784 -92486 -86462 -85210 -89677 -90601 -91521 -92803 -94081 -94945 -95806 -96074 -96339 -99223
-10926 -99223 -92564 -88056 -89267 -89289 -89308 -89688 -90064 -90594 -91119 -91648 -92173 -89841 -87505 -89942 -92374 -92248 -92117 -92706 -87568 -84640
-10906 -84640 -87430 -90225 -87292 -81234 -80895 -87475 -94051 -95325 -96596 -95009 -93418 -92460 -91499 -88038 -84573 -81111 -83369
-10889 -83369 -85631 -82166 -83414 -84658 -85549 -86436 -82318 -78198 -77300 -76398 -76119 -81558 -89863 -92442 -94189 -95933 -97680 -93701
-10871 -93701 -91901 -90098 -85079 -80057 -80821 -81581 -85206 -88827 -88246 -87661 -83861 -85780 -85973 -86164 -84211 -82255 -76219 -75903
-10853 -75903 -78690 -81473 -81517 -75836 -70515 -74729 -81614 -82773 -81074 -85094 -88462 -82289 -84703 -87114 -87993 -88868 -90105 -91339
-10835 -91339 -90430 -95240 -93615 -91987 -95676 -93641 -91607 -95296 -92904 -90512 -90027 -95266 -94215 -93164 -92114 -91063 -96212
-10818 -96212 -95638 -89699 -83760 -85087 -86413 -87740 -89066 -89856 -90646 -91078 -91510 -94103 -90974 -91063 -91152 -89275 -87397 -85519 -83641
-10799 -83641 -80918 -78190 -84051 -89908 -90225 -90538 -90854 -91167 -90113 -89055 -88000 -86942 -87855 -88764 -89677 -90586 -89636 -88682 -88447
-10780 -88447 -82486 -82669 -88570 -90899 -93224 -92691 -92155 -91622 -91085 -89778 -88466 -87158 -85847 -81514 -77177 -76301 -81145 -81163 -81178
-10761 -81178 -84416 -87650 -84256 -80858 -87598 -94334 -98213 -96365 -95236 -94103 -89852 -91320 -92434 -93544 -93287 -93026 -89550
-10744 -89550 -91793 -93041 -94286 -91123 -87956 -85329 -82698 -84483 -86264 -92844 -93701 -91100 -94222 -103127 -102494 -100907 -99319
-10727 -99319 -97732 -96145 -94558 -92971 -91026 -89081 -89997 -90914 -90974 -91033 -94670 -92583 -86205 -85549 -88351 -91152 -87754 -90079
-10709 -90079 -89185 -88291 -84774 -81257 -82508 -83760 -84148 -84535 -84923 -85310 -87486 -89662 -91838 -94014 -94073 -94133 -91689 -89245 -86920
-10690 -86920 -90318 -87039 -78037 -80377 -82717 -84342 -85966 -88127 -84565 -79811 -75057 -68380 -67426 -71838 -76249 -75891 -75534
-10673 -75534 -75176 -74818 -75653 -76488 -77322 -78157 -76547 -74938 -72970 -76726 -77874 -79021 -84103 -83462 -78768 -79796 -77248 -74699
-10655 -74699 -76078 -77456 -75973 -74490 -78015 -81540 -80295 -79051 -80325 -81599 -82874 -84148 -87807 -91465 -90355 -89245 -89763
-10638 -89763 -90277 -90795 -91309 -91767 -92222 -87911 -83596 -81864 -80128 -81257 -82382 -85478 -88570 -86897 -85221 -87024 -88827 -93850
-10620 -93850 -93149 -93522 -93895 -93910 -93924 -91600 -89275 -88142 -92732 -96547 -94640 -89990 -85340 -81052 -82486 -85471 -88455 -91380
-10602 -91380 -94304 -92460 -90616 -90545 -90474 -90404 -90333 -93660 -96987 -97453 -97919 -93902 -89882 -92542 -95199 -96130 -97058 -101566 -100348 -92486
-10582 -92486 -90344 -91305 -92263 -90184 -88101 -88526 -88947 -92330 -89990 -91585 -87456 -83984 -86234 -91346 -90735 -91436 -97859 -103925
-10564 -103925 -104267 -99364 -94461 -92062 -89662 -90459 -91257 -92054 -92851 -91443 -90035 -87911 -91510 -97986 -98738 -96391 -94044 -95452
-10546 -95452 -96860 -94692 -98246 -102658 -101346 -101108 -100869 -95206 -95266 -94610 -93954 -98485 -97293 -96100 -94908 -97352 -94073 -90795
-10528 -90795 -93239 -94059 -94878 -93552 -92225 -87680 -88857 -89677 -90497 -93239 -95981 -98723 -101466 -95385 -89304 -88231 -92881 -95009
-10510 -95009 -91409 -91391 -91368 -90336 -89301 -88269 -87233 -88734 -90232 -91734 -93231 -92229 -91223 -93798 -90646 -86842 -88757 -87099
-10492 -87099 -85437 -86640 -87840 -86540 -85236 -84949 -90381 -98679 -101249 -98995 -96737 -96987 -97233 -95228 -93224 -91219 -89215
-10475 -89215 -90310 -91406 -92501 -93597 -90892 -88187 -89893 -91600 -90981 -84640 -86286 -87933 -88038 -88142 -85385 -82628 -79990
-10458 -79990 -77352 -79483 -81614 -85370 -89126 -91689 -88529 -83462 -84118 -89185 -88529 -83116 -77702 -73481 -74982 -76722 -78462
-10441 -78462 -85329 -92196 -93638 -95079 -91752 -88425 -88615 -88805 -88995 -89185 -89658 -90132 -87743 -85355 -85769 -86182 -86953 -87725 -85933
-10422 -85933 -89863 -93794 -92002 -88362 -84722 -87400 -90079 -91741 -93403 -95065 -96726 -95705 -94684 -93664 -92643 -94632 -96622
-10405 -96622 -98612 -100601 -97583 -94565 -91547 -88529 -89744 -90959 -88596 -91957 -94126 -90571 -90594 -90616 -89118 -87620 -86480 -85340
-10387 -85340 -83604 -87591 -88358 -89126 -90038 -90951 -91864 -92777 -92021 -91264 -87646 -84029 -82646 -81264 -84651 -88038 -87550 -87061 -86573
-10368 -86573 -86085 -88280 -90474 -87900 -85325 -86506 -87687 -86007 -84327 -81305 -78283 -78123 -77963 -77207 -76450 -75694 -74938 -76596
-10350 -76596 -78250 -79908 -81562 -84055 -86544 -86175 -85802 -81320 -76834 -79029 -81219 -83712 -86201 -85832 -85459 -85191 -84923 -84655
-10332 -84655 -84386 -85966 -87546 -91629 -95713 -90735 -80035 -75772 -81048 -83999 -86950 -87635 -88321 -85564 -82807 -80049 -77292
-10315 -77292 -79364 -81435 -83507 -85579 -85012 -84446 -83880 -83313 -84655 -85996 -84476 -82956 -81886 -80813 -84513 -88209 -89584 -90955
-10297 -90955 -92330 -93701 -93883 -94062 -91383 -88701 -89062 -89420 -86920 -84416 -86231 -88045 -86998 -85951 -83831 -81711 -82453 -83194
-10279 -83194 -82132 -81070 -84778 -88485 -85396 -82307 -85895 -89483 -85865 -82248 -81491 -80735 -85225 -89714 -94204 -98693 -97505
-10262 -97505 -96316 -95128 -93939 -92751 -91562 -90374 -89185 -90780 -92371 -93962 -95553 -94997 -94442 -91026 -87609 -88965 -90318
-10245 -90318 -88809 -87300 -85612 -83924 -85098 -86272 -86979 -87684 -88388 -89092 -88485 -87877 -87270 -86663 -85389 -84111 -85694 -87278 -88265
-10226 -88265 -89252 -90240 -91227 -93906 -96585 -96402 -96220 -95977 -95735 -95493 -95251 -95992 -96734 -97475 -98217 -98243 -98269 -93526 -88783 -88801 -88820 -84070
-10204 -84070 -79319 -81961 -84602 -84383 -84163 -81707 -79252 -81566 -83880 -85299 -86719 -88138 -89558 -90851 -92140 -90571 -88999
-10187 -88999 -90232 -91462 -92691 -93921 -92069 -90213 -88362 -86506 -85370 -84230 -83090 -81950 -83354 -84755 -86160 -87561 -86283
-10170 -86283 -85001 -88488 -91976 -92799 -93619 -94442 -95262 -95191 -95117 -95042 -94968 -96193 -97419 -98645 -99871 -98474 -97076 -92818 -88559 -85433
-10150 -85433 -82307 -83950 -85593 -85627 -85661 -85694 -85728 -89830 -93932 -91357 -88783 -85910 -83038 -84934 -86830 -83630 -80429 -81998 -83567
-10131 -83567 -82512 -81458 -82907 -84356 -85102 -80124 -81227 -82330 -82956 -83582 -81346 -79111 -78723 -78336 -84029 -89722 -94222 -89185
-10113 -89185 -83432 -83403 -88216 -93030 -92836 -86920 -83745 -80571 -81808 -83045 -87173 -91301 -90661 -90020 -88127 -86234 -87203 -88172
-10095 -88172 -86368 -84561 -82758 -80951 -84811 -88667 -88116 -87561 -84237 -86633 -88675 -90713 -90310 -89904 -92363 -94819 -94319 -93816
-10077 -93816 -96536 -93529 -93209 -92885 -89345 -85802 -87210 -88615 -87162 -85705 -87829 -89949 -92430 -89185 -87326 -85467 -86111
-10060 -86111 -86756 -83466 -80176 -81655 -83134 -85031 -86927 -85962 -84997 -87251 -89506 -86991 -84476 -86842 -89208 -88712 -88216 -88019
-10042 -88019 -87822 -87624 -87427 -83339 -79252 -74807 -76085 -78078 -80072 -82423 -84774 -88842 -92911 -93522 -88410 -87591 -86771 -90363
-10024 -90363 -93954 -94118 -94282 -94446 -94610 -92211 -89811 -91823 -93835 -96510 -93462 -90772 -88082 -90877 -93671 -93604 -93537 -90042 -86547
-10005 -86547 -82695 -84565 -84647 -84729 -77181 -75355 -75094 -74830 -77788 -80742 -85191 -89636 -94085 -98530 -96391 -94249 -89249 -84245
-9987 -84245 -88246 -92244 -96246 -100243 -98999 -97751 -96506 -95258 -94312 -93362 -92415 -91465 -88000 -84532 -85836 -87136 -86294 -85448
-9969 -85448 -87468 -89483 -90847 -92207 -93570 -94930 -92062 -89189 -89181 -89170 -90981 -92788 -91737 -90683 -90288 -89889 -89494 -89096 -89424
-9950 -89424 -89748 -83995 -78239 -74274 -79845 -83630 -81689 -78812 -81655 -83786 -85914 -90907 -95895 -92304 -88708 -88541 -88373 -88205
-9932 -88205 -88038 -88764 -89491 -87356 -85221 -86350 -87479 -85746 -84014 -86812 -89610 -92408 -95206 -93515 -91823 -90132 -88440 -90206
-9914 -90206 -91972 -90877 -89781 -87121 -84461 -84662 -84863 -82203 -79543 -79744 -79945 -76443 -72937 -78019 -83097 -85079 -87058 -84271
-9896 -84271 -81480 -78291 -75098 -80493 -85884 -85437 -84986 -84539 -84088 -85851 -87609 -89371 -91130 -89137 -87140 -88008 -88872 -88220 -87564
-9877 -87564 -86912 -86257 -82207 -78153 -78872 -79587 -81938 -84286 -83775 -83261 -83943 -84621 -85303 -85981 -87438 -88891 -90348 -91801 -91290 -90776
-9857 -90776 -90266 -89751 -85139 -80523 -78771 -77017 -81704 -86387 -88213 -90035 -89833 -89629 -89427 -89222 -85802 -82378 -85634 -88887
-9839 -88887 -89815 -90743 -91670 -92598 -92751 -92904 -93056 -93209 -91573 -89938 -88302 -86667 -88906 -91145 -93384 -95623 -95098 -94573 -91186
-9820 -91186 -87799 -90195 -92591 -90217 -87844 -84070 -80295 -81290 -82285 -80061 -77836 -78473 -79111 -81324 -83537 -80981 -78425 -78015
-9802 -78015 -77605 -77195 -76786 -78507 -80228 -81950 -83671 -83485 -83298 -85973 -88649 -91178 -93708 -91469 -89230 -86573 -83917 -81260
-9784 -81260 -78604 -73995 -69386 -69546 -69707 -74576 -79446 -81454 -83462 -85232 -87002 -85910 -84818 -83190 -81562 -79934 -78306
-9767 -78306 -74412 -70519 -69487 -68455 -70642 -72829 -75016 -77203 -79055 -80906 -79897 -78887 -77341 -75795 -74248 -72702 -72348
-9750 -72348 -71994 -71640 -71286 -75642 -79997 -84353 -88708 -86819 -84930 -85903 -86875 -85523 -84170 -82818 -81465 -79442 -77419 -75396
-9732 -75396 -73373 -77430 -81488 -80776 -80064 -80593 -81122 -78790 -76458 -73827 -71197 -71428 -71659 -74140 -76622 -78745 -80869 -81741 -76890
-9713 -76890 -72397 -67903 -65161 -62415 -62534 -62650 -65511 -68369 -74092 -79811 -80854 -81894 -85441 -88984 -89729 -84748 -82989 -81227
-9695 -81227 -79494 -77758 -82702 -87643 -86208 -84770 -80832 -76890 -71521 -71871 -76994 -76391 -72572 -68749 -67434 -66115 -68630
-9678 -68630 -71145 -74375 -71882 -66946 -67732 -68160 -68589 -65530 -68194 -70858 -67799 -69211 -70623 -71677 -72732 -73801 -74871 -76298
-9660 -76298 -77725 -76648 -81294 -82721 -84148 -83727 -83306 -82885 -82464 -77274 -72084 -73570 -75057 -75869 -76678 -80351 -84021 -80541
-9642 -80541 -77058 -70716 -64371 -63812 -63250 -67460 -71666 -71465 -71260 -74278 -71569 -73619 -75664 -77356 -79043 -81450 -83854 -86260
-9624 -86260 -88664 -89044 -89420 -89800 -90176 -87158 -84137 -85888 -87635 -87654 -87669 -87687 -87702 -88615 -89524 -87576 -85623 -90322 -95016 -94945 -94871
-9603 -94871 -94502 -94129 -93760 -93388 -92479 -91566 -95426 -99282 -99446 -99606 -96909 -94208 -93269 -92326 -91387 -90444 -91473 -92497 -93526 -94550
-9583 -94550 -95418 -96287 -97155 -98023 -99070 -100117 -94487 -88857 -89099 -89342 -89584 -89826 -89412 -88999 -91447 -93895 -91942 -89990 -90899 -91808
-9563 -91808 -93611 -95415 -94357 -93298 -93313 -93328 -93343 -93358 -94029 -94699 -90601 -86503 -86443 -86380 -83459 -80534 -82501 -84465 -86432 -88395
-9543 -88395 -90601 -92803 -95009 -97211 -97270 -97326 -97386 -97442 -96704 -95962 -95225 -94483 -93626 -92766 -87140 -81510 -85064 -88615 -89308 -89997 -89200
-9522 -89200 -88399 -87602 -86801 -87862 -88924 -87125 -85325 -83585 -81845 -84874 -87903 -90664 -93425 -87602 -81778 -81797 -81815 -81834 -81853 -83436
-9502 -83436 -85020 -86603 -88187 -88399 -88611 -88824 -89036 -89308 -89580 -86991 -84401 -82706 -81011 -82177 -83343 -84047 -84751 -88317 -91883
-9483 -91883 -89308 -86734 -87020 -87307 -86074 -84841 -83608 -82374 -78518 -74662 -69852 -74580 -77736 -75169 -76417 -77665 -73846
-9466 -73846 -70027 -61439 -52851 -45992 -39132 -35135 -31137 -36439 -41740 -49904 -58067 -65392 -72713 -75269 -77821 -78887 -79949
-9449 -79949 -81014 -82076 -81681 -81283 -83749 -86212 -86175 -86134 -86096 -86055 -86715 -87371 -92799 -98224 -95962 -93697 -91436 -89170 -89815 -90456
-9429 -90456 -91100 -91741 -88749 -85754 -91346 -96935 -96205 -95471 -94740 -94006 -95601 -97192 -95925 -94655 -91644 -88630 -88481 -88328 -88954
-9410 -88954 -89576 -83526 -77471 -80701 -83928 -87158 -90385 -88786 -87184 -88447 -89707 -82788 -75865 -81346 -86823 -87296 -87766 -85377
-9392 -85377 -82985 -80675 -78365 -78917 -79468 -82285 -85102 -87918 -90735 -90690 -90646 -90601 -90556 -92121 -93686 -92389 -91093 -89923 -88753
-9373 -88753 -87583 -86413 -89237 -92062 -90117 -88172 -84006 -79841 -80444 -81048 -81473 -81897 -79461 -77024 -72937 -68846 -64759 -60668
-9355 -60668 -61767 -62862 -59192 -55519 -50209 -44896 -32553 -20205 5491 36915 85145 154364 250159 351680 426491
-9340 426491 461246 473940 477099 446395 368003 271158 180039 109185 55503 18032 -6081 -25786 -35950 -39680
-9326 -39680 -43406 -49401 -55392 -53577 -51759 -52806 -53849 -57072 -60291 -63514 -66733 -67035 -67333 -70496 -73656 -76625 -79591
-9309 -79591 -85422 -91249 -94934 -98615 -93716 -88813 -81558 -74300 -73723 -73142 -73757 -74368 -77844 -81316 -81994 -82669 -86208 -89744
-9291 -89744 -90184 -90620 -91059 -91495 -88686 -85873 -83064 -80251 -81853 -83451 -82192 -80929 -79304 -77676 -78913 -80146 -78105 -76059
-9273 -76059 -74017 -71972 -72881 -73786 -77557 -81324 -83425 -85523 -84763 -83999 -86536 -89070 -91607 -94141 -94055 -93965 -93880 -93790 -91797 -89800
-9253 -89800 -90668 -91532 -88108 -84681 -86026 -87367 -87326 -87281 -87240 -87196 -87155 -87110 -87069 -87024 -88876 -90724 -87807 -84886 -84651 -84412 -84178 -83939
-9231 -83939 -85217 -86495 -87773 -89051 -87885 -86719 -85552 -84386 -87095 -89804 -88101 -86398 -82549 -84424 -85940 -87456 -86514
-9214 -86514 -85571 -84628 -83686 -84055 -84424 -88369 -86592 -84472 -88075 -90605 -83596 -80463 -77330 -74315 -65578 -66152 -72445 -76357
-9196 -76357 -85988 -91093 -90471 -90567 -90661 -85571 -80478 -82065 -83649 -80765 -77877 -74993 -72106 -72777 -73444 -76618 -79789 -83082 -80649
-9177 -80649 -73451 -71972 -72911 -73846 -75143 -76435 -77195 -77952 -76208 -83999 -89576 -95150 -97866 -94856 -87795 -80731 -76532 -72330
-9159 -72330 -74300 -81991 -89327 -96659 -98571 -100478 -99528 -98574 -96477 -94375 -92278 -90176 -90523 -90866 -91212 -91555 -92229 -92900 -93574
-9140 -93574 -94245 -92952 -91655 -90363 -89066 -88570 -88071 -83164 -78254 -76566 -80597 -81413 -82225 -80910 -79591 -81495 -83395 -78563
-9122 -78563 -79450 -79982 -80511 -84688 -88861 -88269 -87672 -87617 -87557 -87501 -87441 -86953 -86462 -83470 -80474 -81178 -87602 -91167 -89006 -85914 -82818
-9101 -82818 -79368 -75914 -74908 -73898 -72892 -71882 -68224 -64561 -60902 -57240 -57456 -57668 -57884 -58097 -59990 -61879 -60910 -59937
-9083 -59937 -59863 -59785 -59710 -59632 -63209 -66782 -70359 -73932 -77926 -81916 -85910 -89901 -85053 -80202 -82032 -83857 -82527 -81193 -80817
-9064 -80817 -89975 -93787 -91871 -89006 -86137 -84822 -83503 -82188 -80869 -80448 -80023 -79602 -79178 -72616 -66051 -62352 -58648 -57721
-9046 -57721 -56789 -55861 -54930 -51558 -48182 -44811 -41435 -42646 -43853 -45064 -46271 -43607 -40939 -35414 -29885 -23555 -17221 -10891
-9028 -10891 -4557 -2817 -1073 7343 15763 33025 50290 70771 91256 112631 139733 171003 211816 254503 302917
-9013 302917 352519 396401 441294 495728 558505 634638 727032 844228 1008872 1247917 1622997 2217457
-9001 2217457 3117849 4390231 5949111 7563316 9005592 10159821 10661877 10234921 9111205 7531568
-8991 7531568 5812440 4316508 3173244 2360003 1795704 1397372 1110155 904970 756115 639694 552838
-8980 552838 494599 452274 419490 387538 355589 319955 278602 240822 203046 166100 134882 109978 90801
-8967 90801 78357 71639 62414 53193 45458 43450 35357 27268 27172 27078 24120 21165 14690 8218 1743 -4728 -11084 -17437
-8949 -17437 -15209 -12977 -10809 -8636 -6468 1426 923 6147 13870 27321 44702 62086 80302 108059 157035 223184
-8933 223184 305662 409129 527852 646580 744915 803195 808929 763161 673275 562409 448678 344489
-8921 344489 250788 174260 117102 77116 48930 30286 18017 5752 -2463 -4952 -8018 -11084 -13793 -16502 -19091
-8906 -19091 -21681 -25820 -35682 -41610 -47538 -53466 -59393 -64665 -64215 -63764 -63313 -67229 -65422 -62065 -58708 -57855 -57001 -59010
-8888 -59010 -61018 -65962 -70906 -76208 -75787 -71849 -67911 -63615 -59319 -56957 -54595 -56644 -58693 -62888 -61361 -60191 -59021
-8871 -59021 -55660 -52299 -45720 -44863 -48775 -52687 -59222 -65757 -69878 -64461 -64408 -64356 -64125 -63894 -60802 -57709 -56912 -56115 -57821
-8852 -57821 -49989 -44542 -39095 -35913 -32731 -32184 -31632 -32635 -39356 -44173 -48987 -52612 -50511 -49621 -48726 -44617 -40503 -37348
-8834 -37348 -34188 -34609 -29304 -32504 -41424 -47128 -52829 -52869 -58630 -61174 -63715 -65947 -68175 -70765 -67628 -62527 -57422 -60548
-8816 -60548 -63671 -61141 -58607 -58935 -59263 -56972 -54677 -62516 -70355 -74949 -73816 -73041 -72266 -75370 -78470 -81927 -79662 -81253
-8798 -81253 -82840 -84070 -85299 -82419 -79535 -79871 -74483 -69502 -64516 -59174 -53831 -54453 -55071 -58551 -62031 -62732 -63428 -66633
-8780 -66633 -69833 -74647 -73734 -75686 -77635 -81927 -80493 -79420 -78343 -74528 -70709 -70113 -63790 -59129 -54468 -56126 -57784
-8763 -57784 -63436 -69088 -71879 -74669 -71230 -67791 -63995 -65921 -68980 -72039 -80821 -80064 -76406 -72743 -65623 -58503 -57884
-8746 -57884 -57262 -56282 -61025 -65191 -69353 -69103 -68853 -69979 -71100 -71864 -72628 -72277 -66204 -65854 -65500 -64613 -58004 -57117 -56226 -61465
-8726 -61465 -60981 -60496 -60008 -62028 -58324 -53428 -48529 -44643 -46476 -47955 -49431 -42802 -36170 -34907 -39363 -45343 -51320 -54200
-8708 -54200 -51353 -50895 -50433 -51167 -57620 -68183 -78742 -89424 -94379 -90158 -76394 -64781 -53164 -46200 -39233 -38946
-8692 -38946 -38655 -44032 -49404 -55139 -55146 -54986 -54822 -57523 -54498 -51714 -48928 -46502 -38350 -35597 -38562 -40816 -37344 -36439 -29807
-8673 -29807 -23178 -16546 -13085 -9620 -10928 -12232 -16222 -20209 -23842 -27471 -28003 -22809 -14162 -5510 3673 12861 19183
-8656 19183 25510 28703 31896 37593 43289 47794 46576 35581 24586 4768 -24587 -52869 -67799 -71044 -68566
-8641 -68566 -68473 -62657 -53331 -38283 -23830 -9378 -1721 -3603 -12757 -27634 -40813 -48268 -48212 -42433 -39874 -37314 -44889
-8624 -44889 -52463 -62147 -71830 -74241 -70929 -66186 -61443 -59203 -56964 -60001 -63037 -68935 -74833 -80612 -86391 -86685 -77441
-8607 -77441 -66290 -49416 -28845 -8275 14202 30957 36028 41099 35201 19765 -7593 -34952 -51700 -55094
-8593 -55094 -53242 -51390 -44289 -31465 -22694 -570 21434 43438 60913 72664 80153 87642 88096 88551 85667 82783
-8577 82783 85265 87746 95645 113082 127419 141756 149654 148015 142203 145929 158477 180564 206108 222114 233352
-8562 233352 244589 244142 243694 240483 227737 215106 208202 202964 211082 227185 243292 237428 214398 167878 111822
-8547 111822 59102 15923 -11639 -18216 -7664 2890 13084 13744 4504 -10455 -25298 -40138 -50153 -54442
-8533 -54442 -51103 -38223 -24751 -11274 -1379 8520 21825 44672 82657 141629 217766 307261 391982 459539
-8519 459539 507420 530505 540233 555688 592361 642392 697665 739588 756425 744651 721666 708224 708637 722408
-8505 722408 760497 823389 907977 998291 1094324 1180823 1268719 1366157 1490417 1639480 1797783 1956090 2119043
-8492 2119043 2287722 2487755 2743112 3072863 3484646 4005815 4643353 5384614 6192646 7033461 7849482
-8481 7849482 8621385 9364677 10143762 11119337 12563947 14819300 18350850 23814829 32241110 45400209
-8471 45400209 65981843 96580424 135068465 173104412 200205124 204645147 186366551 153481267
-8463 153481267 116409548 84707816 61364558 45375205 34553016 27074896 21702550 17785724 14881219
-8454 14881219 12760751 11236652 10210447 9507820 8971158 8417325 7739499 6910632 6037894 5207358
-8444 5207358 4519897 3967636 3535559 3177398 2893639 2657835 2481171 2338721 2228705 2120950 2013199
-8433 2013199 1904371 1808901 1731296 1678489 1624491 1557139 1476672 1390483 1294755 1193304 1082286 988436 908178
-8420 908178 856534 819674 792353 753347 704803 644516 597581 567816 574295 605454 649966 686848 718008 731059
-8406 731059 730757 718533 712031 703384 700459 698846 697232 689047 671323 643107 614891 581430 553691 524879 501790
-8391 501790 486853 481455 472956 454919 416852 369247 301374 227778 158101 109408 79672 70920 64255 57589
-8377 57589 41743 25897 7369 -11159 -29091 -47024 -60485 -64408 -62847 -51748 -38100 -24449 -17239 -19564
-8363 -19564 -29047 -38525 -41808 -31733 -24672 -17608 -19847 -22083 -29926 -32042 -32612 -33178 -33883 -34583 -33380 -22634 -14277
-8346 -14277 3621 26881 50145 64970 74076 75548 77023 73010 63279 44959 26642 -2582 -22269 -31822 -31837
-8331 -31837 -31792 -18394 -1062 16270 27194 43841 59892 70220 66837 53916 37775 31173 25733 20294 10085
-8316 10085 9414 12499 15584 22127 28669 22753 16836 6747 -3342 -14862 -16844 -15011 -7455 -6133 -4810 -20656
-8300 -20656 -36502 -49665 -53291 -53339 -43849 -36416 -28983 -20954 -12925 -9247 -5570 -5231 -18245 -47556 -82590 -110590
-8284 -110590 -121421 -126350 -131280 -138355 -139707 -138228 -136749 -131455 -126160 -120389 -105080 -95135 -85191 -78224 -71253 -67743
-8268 -67743 -69952 -76696 -83436 -90180 -96920 -99580 -96514 -97028 -91816 -89409 -86998 -84234 -81465 -82307 -83146 -87207 -85541 -83820
-8250 -83820 -82095 -80374 -72926 -75109 -77289 -79114 -80936 -85325 -89711 -93861 -92285 -89573 -77318 -67214 -57106 -45273
-8234 -45273 -33436 -28279 -23119 -28693 -34263 -39240 -44214 -51875 -49993 -46804 -43611 -46487 -49360 -60224 -71085 -79327
-8218 -79327 -78026 -73511 -68991 -64624 -60254 -60656 -61055 -57404 -53749 -46878 -40004 -35190 -24650 -16975 -15019 -7701 -380
-8201 -380 5983 21888 33528 45171 60864 82284 103283 124285 145999 167717 192181 222372 248504 274641
-8187 274641 310849 379490 484730 652925 903383 1300731 1925799 2961010 4603557 6766890 8160492
-8176 8160492 7621674 5930650 4188123 2866701 2005021 1459645 1095497 843658 654773 516258 417806
-8165 417806 341289 293390 268795 249928 234395 218866 188705 158548 128745 98946 76475 59732 46442
-8152 46442 33155 22011 10871 3185 1225 692 163 -8834 -23551 -34840 -40403 -39054 -37702 -37843 -37981 -34904 -37545
-8135 -37545 -43052 -48555 -51558 -54557 -56606 -58652 -54621 -56308 -59915 -63518 -66886 -70250 -78149 -76506 -66521 -62255 -58887
-8118 -58887 -55515 -52504 -49490 -51428 -53361 -58160 -62955 -67482 -72005 -73671 -75333 -85225 -95113 -105005 -109171 -109942 -104986
-8101 -104986 -105400 -105810 -106939 -102341 -94647 -86950 -76283 -71335 -69848 -68358 -70686 -73011 -76890 -86488 -90784 -95076 -98179
-8084 -98179 -95556 -91268 -86976 -82330 -77680 -76577 -75474 -74371 -73268 -75921 -78574 -81227 -83880 -86294 -88708 -86354 -83999
-8067 -83999 -85221 -86443 -84804 -83164 -79893 -76622 -73350 -70079 -76644 -83209 -83097 -82985 -80906 -78827 -73887 -68946 -63291
-8050 -63291 -57635 -58656 -59677 -63104 -66528 -72818 -79103 -79491 -79874 -75493 -71107 -68186 -65262 -62341 -59416 -61383 -63347
-8033 -63347 -65314 -67277 -72031 -76782 -83205 -78179 -78403 -78622 -78131 -77635 -71063 -64487 -60776 -57061 -54662 -52258 -49859 -47456
-8015 -47456 -45962 -44468 -40112 -35757 -30924 -26092 -21260 -16427 -20567 -24706 -22169 -19631 -17750 -15868 -3137 9593
-7999 9593 20893 37917 67936 117031 189256 280558 387120 512759 631155 722844 779718 794626 754211
-7986 754211 664199 558568 447214 341956 248143 172811 116554 78659 52209 29694 12902 4157 -4586
-7973 -4586 -6297 -8007 -13115 -18223 -28100 -37977 -42310 -46644 -50977 -55310 -57259 -59207 -54479 -49751 -47109 -44468 -41826
-7956 -41826 -39185 -38808 -38432 -44732 -51033 -53425 -55817 -58209 -60601 -62218 -63835 -65452 -67069 -66122 -65176 -64230 -63283 -63410 -63537
-7937 -63537 -60444 -63075 -64654 -66234 -68171 -70109 -70377 -70645 -75683 -80720 -77918 -75116 -73507 -77620 -81734 -80124 -75414
-7920 -75414 -70705 -67754 -64800 -66975 -69148 -67628 -71827 -75314 -78798 -82449 -80374 -76752 -73127 -72009 -70888 -69770 -68648
-7903 -68648 -67866 -67080 -66655 -66227 -63537 -66566 -71148 -75727 -71145 -66558 -67341 -73842 -75817 -77788 -80836 -78157 -77140 -81842
-7885 -81842 -80467 -79088 -76342 -79315 -81935 -84550 -85336 -86119 -86905 -87687 -85910 -84129 -85213 -86294 -88906 -91514 -87807 -84096
-7867 -84096 -79494 -80612 -81376 -82136 -81618 -81096 -80579 -80057 -75187 -70314 -72359 -80124 -79654 -73458 -72035 -76331 -77948 -73838 -73309
-7848 -73309 -72777 -77240 -81700 -81394 -81085 -82985 -84882 -80701 -76517 -71793 -76603 -84040 -85750 -82993 -80232 -79621 -79006 -80973
-7830 -80973 -77214 -73101 -74707 -80191 -79949 -76610 -73268 -73328 -73384 -78213 -83038 -81190 -79338 -77490 -75638 -78216 -80791 -78004
-7812 -78004 -84751 -81011 -77266 -75672 -79796 -79401 -79002 -76104 -73201 -74833 -76461 -78093 -79722 -79878 -80031 -80187 -80340 -77575
-7794 -77575 -74807 -71685 -74282 -75206 -76130 -77412 -78693 -78544 -78395 -81108 -83820 -84416 -85012 -85608 -86205 -82210 -78216 -75176 -81674
-7775 -81674 -87456 -87516 -84714 -81912 -81137 -80362 -82449 -84535 -90243 -95951 -98798 -101644 -103477 -105311 -102017 -98723 -97330 -90210
-7757 -90210 -83090 -81693 -81312 -80929 -78399 -75869 -70750 -71350 -71592 -71834 -74226 -76614 -78645 -80675 -83194 -79986 -79997 -80008 -76447
-7738 -76447 -72881 -66096 -65034 -65407 -65776 -66502 -67229 -69032 -70832 -69055 -73000 -78075 -77426 -74632 -81376 -84125 -81152 -78775
-7720 -78775 -82121 -82367 -82613 -83574 -78812 -76376 -73939 -74006 -74073 -71353 -68633 -66629 -58902 -54930 -56681 -55213 -53745 -50533 -53045
-7701 -53045 -57106 -61167 -66957 -72747 -72218 -71689 -69431 -72896 -81130 -83637 -84539 -85441 -85985 -86525 -82941 -79356 -84356 -89353
-7683 -89353 -91790 -94226 -97617 -91465 -86860 -87978 -88142 -88302 -86737 -85172 -83608 -82039 -83813 -85586 -88075 -84837 -80828
-7666 -80828 -82542 -87713 -92881 -90351 -93544 -96380 -99215 -97222 -95228 -90016 -90526 -89338 -88149 -86961 -91495 -93824 -96152
-7649 -96152 -98839 -101525 -101678 -101831 -101983 -102136 -101395 -100653 -99912 -99170 -99651 -100132 -97751 -95370 -96208 -97047 -95024 -93000 -93328 -93656
-7629 -93656 -90407 -92881 -97859 -97114 -95176 -93239 -94312 -95385 -96816 -98246 -94133 -95743 -97352 -93239 -93634 -94029 -94066 -94103 -94677
-7610 -94677 -95251 -95825 -96398 -101294 -106190 -108224 -110258 -112710 -115162 -114752 -114342 -113038 -111734 -115557 -119379 -117479 -121302 -125125
-7592 -125125 -123224 -116883 -110542 -103843 -97144 -92412 -87680 -83306 -78932 -81555 -89901 -92166 -94431 -98306 -102181 -103194 -104208
-7575 -104208 -102047 -99886 -100586 -101287 -97099 -92911 -93492 -94073 -96916 -99755 -99498 -93515 -89085 -90374 -90951 -91525 -91491 -91454 -88559
-7556 -88559 -85661 -86044 -86424 -89670 -92911 -93831 -94748 -95668 -96585 -94196 -91804 -94185 -96562 -93727 -90888 -86622 -82352 -84494
-7538 -84494 -86633 -88775 -90914 -83388 -75862 -73462 -71063 -69021 -72702 -76026 -79349 -81063 -82777 -81271 -85489 -88664 -91838
-7521 -91838 -96443 -101048 -105869 -104968 -102516 -100065 -100504 -100944 -101741 -96816 -91041 -85266 -85452 -85638 -86093 -80824 -77702 -74580 -71394
-7502 -71394 -73932 -76111 -78291 -74718 -71145 -66379 -55891 -44881 -39594 -33592 -27590 -16729 -5868 6422 18714
-7487 18714 32861 47008 57340 61948 65663 63655 55328 41278 25528 9779 -4896 -19572 -31237 -42903
-7473 -42903 -57788 -66949 -66409 -65869 -66521 -72896 -74472 -76048 -80843 -85638 -87617 -89595 -89427 -94983 -104562 -108418 -106909 -105400
-7455 -105400 -105620 -100117 -94971 -89826 -89211 -88596 -94301 -100005 -100031 -94334 -94718 -95102 -93339 -91577 -92676 -93775 -94923 -96070
-7437 -96070 -94357 -92643 -90720 -88798 -85802 -82807 -79155 -81227 -84848 -88470 -90690 -92911 -95132 -97352 -97218 -97084 -97307 -91808
-7419 -91808 -97457 -103105 -99811 -96518 -94655 -92792 -98917 -99319 -93641 -87963 -86696 -85430 -86819 -88209 -84830 -81450 -83228
-7402 -83228 -85005 -84994 -84982 -90485 -90266 -88496 -86726 -87400 -88075 -90180 -92285 -93906 -95527 -101916 -108306 -105188 -102069 -98235 -100124
-7383 -100124 -104562 -103276 -103064 -102852 -101387 -105646 -108474 -105579 -101439 -97296 -94230 -91160 -88362 -85560 -84193 -82821 -80605
-7366 -80605 -78384 -80936 -83485 -83265 -83041 -84252 -85459 -83555 -81648 -78313 -74975 -69613 -64248 -58887 -53522 -55880 -58235
-7349 -58235 -63455 -68671 -74248 -79822 -84088 -78812 -72736 -66655 -59982 -53305 -44397 -35485 -24788 -19810 -17489 -15164 -10339
-7332 -10339 -5510 3814 13144 24139 44675 68629 98309 136808 184849 245643 315979 395850 475724 550677
-7318 550677 625633 681032 715452 725485 706908 669728 611568 539578 461868 387135 312406 248940 202647
-7305 202647 161596 126271 107158 88048 68696 58886 51933 44985 33859 22738 13706 4679 -5544 -21487
-7291 -21487 -36420 -45626 -53048 -54744 -56383 -58019 -59300 -60578 -64781 -68980 -78548 -78574 -76886 -75195 -72911 -70623 -68220
-7274 -68220 -65813 -58641 -51465 -47571 -43674 -44907 -46137 -47609 -54799 -58775 -62747 -61469 -60187 -62486 -59058 -54084 -54829
-7257 -54829 -57009 -64908 -67505 -64375 -65541 -60981 -54159 -53056 -45876 -38693 -31897 -30820 -34516 -32485 -37910 -43331 -48399
-7240 -48399 -53462 -50839 -48212 -45947 -37955 -28834 -19710 -15000 -10287 -6289 -2288 159 -3111 -5790 -8465 -19490 -30511
-7223 -30511 -39151 -38249 -36040 -33827 -37042 -40254 -40250 -45966 -50284 -54598 -58082 -55839 -55746 -61372 -63425 -65474 -64516 -63555 -65459
-7204 -65459 -67359 -62050 -56737 -54289 -61376 -66838 -66573 -67266 -67955 -64297 -60634 -56022 -60943 -64498 -62326 -63972 -65616 -61718
-7186 -61718 -57817 -53920 -50019 -52627 -55232 -57840 -60444 -63827 -67206 -70232 -73254 -75862 -72743 -66171 -59595 -58686 -57773
-7169 -57773 -57221 -50943 -43983 -37020 -34471 -31919 -37478 -43033 -54315 -59870 -62210 -58823 -55440 -52054 -47597 -43138 -41543
-7152 -41543 -39945 -36260 -32575 -26029 -19482 -14188 -8894 -3599 1694 2980 4265 2689 1113 -1237 -3588 -1170 1247
-7135 1247 6020 10793 20335 29876 36616 43357 45327 47298 46125 44951 43778 42604 41848 41091 48562 56032 61829 61907
-7117 61907 50894 39884 34236 28591 23897 28744 30935 27406 21013 14623 5428 -3763 -9739 -15712 -20473 -19508 -21766
-7100 -21766 -24020 -26517 -29009 -20060 -5384 10122 31356 49724 68096 88134 108175 127616 147061 158917
-7086 158917 161238 160933 166354 175705 185061 201090 217122 224745 226649 232126 237606 247197 262514 281880 306974 339560
-7070 339560 372150 400325 428503 454413 480326 517323 554324 593706 642630 697869 762650 843046 936799
-7057 936799 1050817 1174377 1308995 1460782 1627114 1802984 1983266 2184532 2421327 2698182 3001506
-7046 3001506 3329629 3707111 4185698 4879011 5913790 7425713 9599583 12723873 17166334 23215733
-7036 23215733 30548959 37318604 40377914 38138801 32296180 25561387 19629705 15047905 11700339
-7027 11700339 9294664 7558565 6282442 5340154 4657209 4189830 3901286 3752004 3685579 3586729 3354819
-7016 3354819 2998916 2606527 2246570 1943362 1695479 1485268 1311305 1164045 1037773 938815 857030
-7005 857030 803497 774767 758075 741387 725888 716115 713432 710753 695790 659847 605063 540744 478329 429271
-6991 429271 392839 365946 348115 339821 342317 358167 381885 399881 407564 401893 398369 404382 414747 430835 441081
-6976 441081 441789 440083 438377 439532 446409 458295 470180 471931 473683 466849 460016 466536 494040 524048 544518 554853
-6960 554853 559466 563125 566787 562577 558371 550405 529089 507770 499808 499443 499082 491682 467118 419241 350384 279615
-6944 279615 222204 184416 171432 171082 176458 183500 181007 164204 147404 138738 130075 119501 118469 136689 164450
-6929 164450 199480 234514 265658 291080 314474 349314 396018 461797 546653 658215 770493 871325 945928
-6916 945928 986193 1005236 1035724 1095304 1181590 1268749 1329200 1364972 1381667 1397528 1419112 1459176 1510685
-6903 1510685 1578976 1673974 1797109 1946950 2112053 2265710 2423182 2607361 2833821 3094622 3371633
-6892 3371633 3667725 3979432 4317849 4711584 5185442 5772533 6462639 7248599 8129944 9102852 10155882
-6881 10155882 11316690 12626298 14110404 15728048 17449177 19349626 21680005 24868816 29515527
-6872 29515527 36333118 46244306 60615527 81499861 111399626 151766414 198668709 237661064 249851277
-6863 249851277 230111133 191191733 149176257 113398730 86317335 66763432 52721130 42513165
-6855 42513165 34972563 29343404 25153543 22058663 19751511 17959418 16444883 15010471 13582644
-6846 13582644 12204418 10949708 9836165 8860326 8002763 7244869 6559469 5928522 5370068 4907946
-6836 4907946 4533578 4232889 3989432 3772917 3556405 3342885 3148445 2994777 2875450 2765538 2644184
-6825 2644184 2513646 2371665 2230188 2082992 1931142 1790741 1670605 1584811 1530369 1481654 1421176 1341626
-6813 1341626 1245023 1159869 1108810 1092092 1111139 1149265 1187626 1214545 1224173 1214728 1194191 1167935 1149306 1142126
-6799 1142126 1140476 1133106 1113810 1073534 1023656 973782 923189 872600 831515 799972 780944 771458 758451 735910
-6785 735910 706689 652671 576199 486376 406327 347265 313833 301389 298121 294858 282916 265256 250453 241377
-6771 241377 237126 232878 230058 227241 239525 268982 310119 351259 388402 416010 438250 466216 528307 638092
-6757 638092 812495 1065113 1424198 1945434 2667444 3528715 4230926 4385652 3934227 3171862 2412832
-6746 2412832 1808323 1374305 1083363 898468 768899 674140 600368 542927 502658 469301 430224 392035
-6734 392035 348126 295748 243374 202919 179636 171134 168358 167635 166916 171559 181928 194081 200516 201581 193113
-6719 193113 178090 163071 150672 147814 139587 131364 128503 125645 123320 120999 111998 103000 91017 79039 71110
-6704 71110 68908 77604 95839 119557 133738 128723 98909 61106 23304 3773 -6218 -6554 2648 17097 37269
-6689 37269 62209 81427 96353 101740 95205 79132 61866 38878 17559 -9482 -31874 -44729 -54721 -55176 -44423
-6674 -44423 -39393 -35913 -38156 -39531 -40906 -42996 -39363 -38354 -37344 -42653 -47963 -50202 -52441 -47407 -36651 -11349
-6658 -11349 13952 22682 21873 12287 -3022 -17854 -23149 -20693 -12515 4723 27686 59441 100734 144889 183321
-6643 183321 196954 178157 142311 106465 73811 46881 31993 26642 18908 20711 31456 42202 50950 50160 42336
-6628 42336 34511 23587 12663 8416 4168 -2448 -9065 -22955 -42568 -55027 -67486 -78991 -80959 -72076 -63194
-6613 -63194 -56815 -56159 -61227 -60571 -56815 -53060 -52147 -51230 -47814 -53931 -64107 -74278 -81830 -79841 -73980 -68116 -55578
-6596 -55578 -48760 -50351 -51938 -49118 -46293 -47616 -48935 -50258 -51577 -53793 -56007 -49639 -43268 -28525 -13778 -704
-6580 -704 2834 2376 -3800 -7001 -10198 -8603 -1282 11400 24087 36888 49694 61900 74110 76271 68897 52578
-6564 52578 36263 15711 -4836 -24076 -33775 -33879 -33980 -36349 -38715 -36733 -34747 -33123 -31494 -34371 -42966 -53115
-6548 -53115 -63261 -68581 -73898 -85299 -90974 -90582 -90187 -92300 -94409 -95806 -97199 -86555 -75906 -71819 -73451 -74729
-6532 -74729 -76003 -83123 -90240 -97717 -99468 -100843 -102214 -105735 -109252 -104517 -94055 -86816 -79573 -77445 -75314 -74259 -73201
-6515 -73201 -76529 -74129 -68514 -68619 -70001 -65660 -64896 -64133 -59494 -54855 -59397 -69662 -79852 -90042 -103451 -116861
-6499 -116861 -127289 -137718 -137058 -130676 -117706 -104737 -102855 -106697 -114711 -128448 -131455 -113478 -93235 -78716 -73973
-6484 -73973 -78768 -81476 -78462 -85940 -93418 -103436 -113451 -123113 -132770 -141894 -145292 -138918 -126816 -108936 -91052 -83306
-6468 -83306 -75556 -74606 -73652 -75564 -83194 -91477 -90217 -89558 -88895 -87877 -81134 -72844 -64550 -51133 -37713 -27515 -26852
-6451 -26852 -32273 -37690 -37031 -36368 -35876 -35380 -29762 -24140 -15540 -1215 22525 51993 79251 100790 110999 115489
-6435 115489 116398 117311 123227 129148 137277 154949 181320 213418 260893 325540 397813 487259 603617 763854
-6421 763854 977739 1246949 1563726 1920568 2292547 2647362 2946587 3165696 3279047 3281759 3181814 3001752
-6409 3001752 2753965 2479476 2216607 1988080 1809624 1688400 1626071 1613343 1634472 1667051 1694209 1702294
-6397 1702294 1685099 1633571 1549967 1439660 1320050 1200443 1091325 1008917 961081 947586 965682 1002858
-6385 1002858 1038839 1074823 1095915 1097934 1074793 1024949 956383 882097 796958 711823 624657 537495 464159
-6372 464159 409904 368730 339005 315119 296959 274392 251828 228188 204551 185829 167110 151249 135392
-6359 135392 117504 99620 94132 88648 88167 87690 80533 73379 61356 49333 41363 44839 51177 57515 52168 46822
-6343 46822 38166 29511 25625 21739 25603 29467 40007 50547 63860 77172 103599 130027 151804 154505 145284
-6328 145284 136063 118197 88886 58740 34318 15618 8364 11244 14124 6739 -645 -3260 -5876 2477 10830
-6313 10830 22045 33260 30838 28416 21225 14034 8036 2037 -5630 -1852 -1837 -1822 3676 9176 14019 18863 15122
-6296 15122 11381 8818 6255 4407 2559 9951 28789 45361 61934 69303 67139 60439 59467 60041 60618 54873 49132
-6279 49132 29735 10342 -3927 -8655 -12075 -15492 -20581 -25667 -32351 -29494 -24136 -13052 3155 28904 50715
-6264 50715 55361 38662 21967 5863 -697 -5235 -4046 3695 17164 23766 30372 30059 24027 13162 2302 -5820
-6248 -5820 3229 20443 43383 67034 84967 89959 89233 80395 77284 81300 98674 123555 157978 185959 213944
-6233 213944 246574 288747 323017 340123 337552 325447 307138 288833 261940 235051 209190 192867 181790 184066
-6219 184066 187416 190765 181596 166704 162840 183776 210911 228508 222617 199558 168511 137464 114077 107858 113443
-6204 113443 128566 133078 124237 92504 39787 -5089 -17537 5543 57239 106908 150854 182639 204886 217986
-6190 217986 221548 212114 202680 188239 179521 171875 173768 182159 207718 241504 275289 295007 301370 297481 293591
-6175 293591 282883 277898 289246 317764 352124 380760 395686 393443 373882 354322 334880 332608 337488 348092
-6161 348092 370499 413890 463731 513571 542786 572000 589649 607298 622921 649989 675924 696137 707527
-6148 707527 713194 710515 681129 583904 444710 312805 238128 220442 244723 281284 317846 341531 384292
-6135 384292 445474 506656 538508 536023 486205 417311 347939 312905 322880 359564 386707 394777 369043 331866
-6121 331866 290871 268956 271240 300234 340670 369665 367478 346218 306594 266973 216984 155552 104848 73223
-6107 73223 65201 99151 165288 258136 351844 445556 533065 620577 683883 697594 649661 559764 441063 328088
-6093 328088 254693 238530 249190 265576 281839 309552 365667 471384 623357 763887 841940 878028 903025
-6080 903025 933748 956383 959944 938107 916274 909102 913379 937206 1018265 1145401 1272542 1345549 1353701 1342893
-6066 1342893 1366425 1449090 1596618 1735945 1810414 1815730 1801971 1798822 1807120 1813271 1819423 1795410 1752320 1747622
-6052 1747622 1815414 1920046 2005602 2035837 1955430 1731571 1442853 1186564 1002765 902544 874813 912418
-6040 912418 991990 1053142 1057066 1026294 989799 942694 876512 807349 795415 867443 981442 1082561 1156977
-6027 1156977 1206471 1267415 1365553 1513293 1706426 1956790 2282979 2689292 3129701 3512883 3748699 3805201
-6015 3805201 3751981 3725472 3842508 4100712 4374411 4560363 4642347 4674735 4699877 4782252 4946173 5190219
-6003 5190219 5473128 5828532 6325573 6910368 7456701 7922914 8401527 9044196 9877865 10799285 11724998
-5992 11724998 12677416 13693711 14805388 16119748 17849972 20059369 22654105 25589828 28880368 32420549
-5982 32420549 36048480 39926308 44464174 49825778 55748222 61709301 67681820 74729588 84978357
-5973 84978357 100999583 125616578 162284281 216948524 299499832 423633567 600802897 815045090
-5965 815045090 982295718 999999999 875246863 693009313 520268454 386500389 292850655 228986565
-5957 228986565 185556005 156474607 138030718 128777787 128807335 139370803 161727295 193351055 219949168
-5948 219949168 221133901 196132648 161482644 129860515 105857426 89131195 77986670 71148618
-5940 71148618 68129623 69023283 74567742 86299594 106985821 140691383 191111558 253678052 302139585
-5931 302139585 304234243 263136446 206842973 155970995 117859064 91601109 73817764 61814541
-5923 61814541 53938341 49392857 48003532 49593927 52647763 53607031 50264597 44179009 37566431 31575742
-5913 31575742 26618984 22741943 19768995 17562915 15941519 14697837 13657671 12743412 11950283 11275431
-5903 11275431 10682457 10169605 9734726 9357076 8987414 8617752 8232113 7865552 7523401 7207957 6886076
-5892 6886076 6564194 6249584 5976943 5742216 5534195 5311562 5077483 4819558 4534927 4173276 3746765
-5881 3746765 3313578 2945249 2705686 2614918 2598785 2582652 2511675 2421621 2326918 2243661 2153227 2057071 1936116
-5868 1936116 1820883 1737246 1718468 1754891 1791315 1783923 1726933 1619867 1512802 1436497 1409790 1416467 1423143
-5855 1423143 1407726 1380863 1320020 1224840 1120360 1021603 937511 872495 811593 769767 776585 855893 948674
-5842 948674 1022378 1049823 1050560 1038787 1038463 1025258 962459 846601 711670 589612 509525 470866 481809 515997
-5828 515997 555912 598684 660537 753027 864597 939575 972590 967448 927973 865364 814205 770076 731674
-5815 731674 695712 671200 668026 699192 752650 806112 829287 825759 796835 756469 706562 675734 664814 672973
-5801 672973 670637 626337 531332 424885 353249 346475 388283 456801 516850 557827 587995 623889 657753 680175
-5787 680175 681789 618547 483288 336587 227051 167117 121964 88260 66595 64009 68811 73618 69720 54381
-5773 54381 42615 42298 65227 99605 127303 143559 132717 110433 75030 39631 10070 -410 -3502 4854
-5759 4854 18230 43055 73838 104624 129326 142587 127944 86599 27604 -12310 -27906 -24423 -13670 8531
-5745 8531 35380 56509 68770 81036 81971 71464 52727 45439 47805 76882 112541 153928 192449 225252 235993
-5730 235993 220032 174498 123246 81535 58904 52842 65861 80186 83070 68901 43289 11504 -14553 -19989
-5716 -19989 -6345 11944 30238 29213 16747 10700 16098 26743 37388 33666 29944 26579 23215 17466 17440 26594
-5700 26594 54825 83592 100913 108816 105272 95865 92180 88614 96494 97459 98424 90686 71501 44389 22999 14962
-5684 14962 26002 53018 85756 106334 115466 105533 89881 75060 71688 71472 71259 71759 72262 72820 73383 74061 63297
-5667 63297 46747 35923 30104 43364 66963 84844 98547 112255 118924 125597 121774 117955 109095 100239 94240
-5652 94240 88245 77716 67191 58808 61874 73402 84933 90142 85816 78983 72153 66036 69460 83551 97646
-5637 97646 103391 109140 105466 96073 80239 64407 50711 50372 47287 44206 45473 46743 48010 49281 50011 50745 42891
-5620 42891 35040 29034 23032 27518 37731 51006 54746 51449 48155 35558 17242 6910 6121 13077 14314 10420
-5604 10420 -3007 -26811 -50612 -67978 -85340 -89942 -88816 -79826 -65109 -50515 -35917 -16554 2812 17436
-5590 17436 26341 25465 18870 6668 -5529 -22023 -38514 -42590 -33313 -21055 -8797 -2917 2961 3475 -1732 -3841
-5574 -3841 -5950 -8417 -10883 -18655 -26427 -40280 -54133 -61733 -59796 -58097 -56398 -58514 -54908 -45936 -36964 -36159 -35354
-5557 -35354 -34192 -38752 -42359 -45966 -41346 -36725 -21427 -6129 7261 14928 18423 16195 5025 -421 -6226 -12031
-5541 -12031 -5078 1873 6441 11009 12715 14422 21844 29265 31680 28371 19698 16747 14988 13229 14303 15376 21814
-5524 21814 33975 50011 66047 87567 118626 160172 201719 243862 286005 329877 373748 429066 503459 611594
-5510 611594 754066 943275 1182082 1469653 1791561 2138626 2491413 2817181 3078090 3245644 3294926
-5499 3294926 3216277 3026987 2743269 2409952 2064713 1738550 1443386 1205451 1030944 913666 845509
-5488 845509 819320 816619 832994 851277 858114 851120 825051 776328 716160 648808 581456 526265 490151 475497
-5474 475497 487550 527383 593923 672116 756033 849965 938174 1000869 1029226 1016450 976968 905622 807569
-5461 807569 701409 606695 522770 457922 412627 386409 362306 326762 298844 270930 239257 207587 178776
-5448 178776 149967 126849 103734 83476 74668 70507 77794 94020 98804 90820 77116 63051 48990 45119 41251
-5433 41251 44057 46866 36736 26609 16478 6352 3852 1355 -1144 -3640 -3148 -2656 -5026 -7392 -6602 -5812 -7884
-5416 -7884 -9952 -17090 -24229 -20876 -17519 -21200 -24881 -21051 -5771 3237 6523 8378 4515 -3167 -10850 -12094 -19058
-5399 -19058 -26889 -23275 -18469 -19382 -21491 -23599 -26066 -28529 -29717 -30906 -32094 -33283 -33935 -34587 -32377 -30168 -30760 -31353
-5381 -31353 -31945 -32538 -37005 -41472 -42720 -43968 -42825 -35958 -29807 -23655 -17385 -16837 -10209 -9303 -15760 -27940 -37258 -46577
-5363 -46577 -50530 -54483 -51759 -49036 -46379 -43719 -45828 -47936 -47545 -47150 -48305 -55183 -64926 -74666 -81901 -89137 -91011
-5346 -91011 -92881 -88075 -83269 -76193 -69114 -65254 -61394 -50146 -44617 -40876 -42858 -49554 -50522 -46722 -48644 -50511 -46651
-5329 -46651 -43149 -45369 -51990 -58611 -58317 -52299 -46223 -40146 -44203 -48261 -53272 -58283 -60433 -62583 -59665 -56748 -53831
-5312 -53831 -50913 -48823 -46733 -50008 -59006 -64546 -70087 -75985 -81883 -89152 -96421 -100232 -98321 -95396 -92471 -90739 -94729
-5295 -94729 -97859 -100989 -101615 -102240 -101972 -101704 -101436 -101167 -97263 -93358 -94222 -95087 -92553 -90020 -84386 -73030 -62814 -58320
-5277 -58320 -57285 -56249 -63142 -75757 -88373 -95266 -101205 -107144 -102591 -98038 -93306 -94297 -94930 -95564 -94889 -94215 -100217 -106220
-5259 -106220 -113533 -120847 -125300 -129752 -130061 -130370 -126268 -122166 -120568 -124692 -128817 -127218 -123414 -119610 -115449 -111287 -111298 -111309
-5241 -111309 -100232 -83432 -60627 -37821 -18234 -8186 -9106 -15749 -26446 -37143 -43812 -50478 -52735 -54989 -56770
-5226 -56770 -64271 -71774 -73552 -72099 -70642 -68831 -67016 -68663 -70306 -76365 -82419 -87143 -86141 -83593 -81040 -83619 -86193
-5209 -86193 -85910 -85623 -78246 -70865 -63727 -62307 -57553 -62333 -75821 -83582 -85713 -87844 -84848 -81853 -76592 -71331 -63566
-5192 -63566 -55802 -55131 -60183 -64878 -69572 -62940 -56308 -40019 -23730 -7202 -4028 -15876 -33447 -49825 -66204
-5177 -66204 -77814 -79885 -82255 -84625 -83537 -82449 -73134 -63820 -58320 -58544 -64587 -76353 -84066 -86055 -85064 -89796 -95720
-5160 -95720 -101644 -105631 -109618 -113962 -112583 -107568 -102553 -93962 -91093 -89513 -87933 -89573 -91212 -92136 -93060 -98753 -104446
-5143 -104446 -103582 -102717 -101853 -100989 -95296 -89602 -81763 -83462 -85795 -93850 -96063 -88738 -82188 -75638 -78984 -82330 -87971 -93611
-5125 -93611 -98895 -104178 -107494 -105087 -103038 -100989 -97792 -94595 -98075 -101555 -106108 -110661 -112352 -114044 -112740 -111436 -107270
-5108 -107270 -103105 -96972 -90839 -89476 -88112 -89770 -91424 -93082 -94737 -100448 -106156 -105549 -104938 -100322 -101425 -99312 -97196
-5091 -97196 -99137 -101074 -103015 -104953 -100776 -96596 -97427 -103977 -110471 -111238 -108910 -106577 -107975 -109368 -107904 -106436 -106581 -106723
-5073 -106723 -104007 -101287 -101372 -101454 -101540 -101622 -101410 -101194 -103843 -106488 -106454 -106417 -103522 -100623 -92483 -84338 -80966 -77590 -74323 -71052
-5053 -71052 -70645 -70236 -70128 -70016 -69908 -69796 -70359 -70917 -78157 -85392 -91260 -97125 -98224 -99319 -100784 -102244 -98939 -95631 -93995
-5034 -93995 -92356 -90720 -89081 -89830 -90575 -90966 -91354 -94964 -92848 -93954 -95057 -92304 -89547 -86793 -84036 -86290 -88541 -87337
-5016 -87337 -80407 -77132 -73853 -73321 -78507 -85009 -85783 -85370 -84953 -86395 -87836 -92140 -96443 -97885 -99327 -101126 -97203 -89614
-4998 -89614 -82024 -80754 -79483 -79584 -79684 -80143 -80601 -84263 -93649 -96954 -100258 -104040 -107822 -108742 -109662 -106797 -103932 -100709
-4980 -100709 -97486 -100404 -97598 -95150 -92702 -95873 -99044 -99353 -99662 -100687 -101711 -99875 -98038 -93041 -88045 -87818 -87591 -89569
-4962 -89569 -91547 -90426 -83582 -82751 -87643 -88958 -90273 -92661 -95050 -90761 -86473 -89725 -92978 -99450 -100199 -100053 -99908 -96544
-4944 -96544 -93179 -90467 -87754 -87903 -88053 -86294 -84535 -85638 -86741 -86622 -86503 -91152 -95802 -100810 -105817 -100094 -88649 -84617
-4926 -84617 -86309 -87285 -88261 -93291 -98321 -97032 -95743 -91264 -92509 -95303 -98097 -98388 -98679 -96108 -93537 -89535 -85530 -78667
-4908 -78667 -71800 -70362 -68920 -70582 -77963 -82397 -81104 -83391 -85675 -81167 -76655 -73339 -75742 -77494 -73518 -73481 -73440 -72210
-4890 -72210 -76700 -81193 -79960 -85631 -91298 -93749 -96197 -96980 -97758 -101760 -100035 -96536 -93038 -92043 -91048 -88026 -85005 -81983
-4872 -81983 -78961 -82602 -86242 -83205 -80169 -80888 -81607 -82326 -83045 -83213 -83380 -83548 -83716 -83585 -83455 -83324 -83194 -83496 -83798 -79688
-4852 -79688 -75578 -67177 -64498 -65277 -66055 -64803 -63551 -62300 -61048 -56457 -51867 -47277 -42687 -48186 -53685 -56323 -58961
-4835 -58961 -62493 -66025 -71823 -77620 -84379 -81599 -79416 -77233 -79282 -81331 -83380 -85430 -85824 -86219 -91026 -95832 -95452 -89349
-4817 -89349 -89327 -89304 -86629 -83954 -87956 -91957 -92203 -92449 -92695 -92941 -94334 -95728 -94260 -92792 -94603 -96413 -98224 -100035 -98872
-4798 -98872 -97710 -96547 -95385 -96130 -96875 -89394 -81912 -75534 -74878 -73865 -72851 -71778 -70705 -71182 -77382 -80146 -82911 -86033
-4780 -86033 -89155 -87210 -85266 -86182 -87099 -83529 -79960 -77583 -80929 -85467 -84282 -85959 -93358 -99647 -100214 -95772 -91331 -91540
-4762 -91540 -91749 -91957 -92166 -90213 -88261 -86309 -84356 -81510 -78663 -76175 -73686 -77352 -86737 -92907 -93351 -92307 -85538 -75552
-4744 -75552 -71286 -69796 -68302 -71938 -75571 -80400 -85225 -87192 -89155 -88649 -88138 -84770 -81398 -82859 -84316 -86134 -82225
-4727 -82225 -82508 -82788 -82713 -82635 -82561 -82482 -82408 -82330 -80564 -78794 -79889 -80981 -80109 -79233 -83131 -87024 -94603 -102177 -110352 -108984 -102732
-4706 -102732 -96477 -94398 -92315 -92889 -93459 -96894 -100325 -99945 -99562 -94413 -89260 -83038 -76812 -75359 -73902 -76383 -78861 -81700
-4688 -81700 -84535 -85169 -91521 -94658 -97792 -96398 -95001 -96469 -97933 -96927 -95918 -92050 -88179 -89975 -91767 -93563 -95355
-4671 -95355 -95139 -94919 -91842 -88760 -90392 -92021 -93652 -95281 -98641 -101998 -105001 -108001 -111123 -108519 -104368 -100214 -95456
-4654 -95456 -90698 -88801 -86905 -83578 -80251 -78473 -82419 -78615 -74811 -74226 -73641 -72460 -71279 -80232 -89185 -93518 -92129
-4637 -92129 -89547 -86965 -90582 -99923 -106402 -107159 -105411 -103664 -104420 -105176 -103250 -101324 -102617 -98187 -92021 -85854 -86603 -93075
-4619 -93075 -93287 -93500 -99554 -99886 -101350 -93276 -91760 -95966 -95344 -94722 -94457 -94193 -93012 -91831 -87788 -83745 -85843 -87941 -89681
-4600 -89681 -91421 -96812 -96480 -96149 -101540 -102043 -102546 -100545 -98544 -95717 -92889 -92922 -92956 -91201 -89446 -88049 -86652 -90068 -99208
-4581 -99208 -105128 -111048 -109279 -107509 -108958 -104685 -101574 -98462 -97855 -97248 -95448 -93649 -91849 -95772 -96030 -102009 -108347 -108962
-4563 -108962 -110113 -111264 -108481 -111421 -113574 -110005 -110013 -110020 -106033 -102047 -98060 -94073 -90653 -87233 -90489 -93746 -96346 -98947
-4545 -98947 -101547 -104148 -104469 -104789 -105109 -105430 -103843 -102255 -101384 -94789 -88433 -87799 -90266 -92732 -94603 -96473 -95482 -94491 -96309
-4526 -96309 -98127 -95534 -92941 -94938 -102658 -102390 -102121 -99230 -96339 -93448 -90556 -89811 -89066 -88321 -87576 -87479 -87382 -92054 -96726
-4507 -96726 -100027 -103328 -102218 -101108 -99267 -103150 -111801 -114729 -114677 -114625 -113858 -113090 -114584 -110352 -109342 -108328 -106782 -105232
-4489 -105232 -100467 -101421 -104867 -108310 -103530 -98746 -94383 -90016 -88872 -87725 -86812 -91618 -93567 -89789 -89055 -88317 -87225 -86130
-4471 -86130 -84740 -83347 -79096 -74841 -75657 -76469 -74423 -72374 -73261 -74144 -77892 -81637 -80139 -78637 -78690 -84461 -90057 -95649
-4453 -95649 -94927 -94200 -94521 -94837 -95158 -95474 -97188 -98898 -102043 -105184 -100489 -95791 -96223 -96652 -96428 -101924 -106708 -111488 -108999
-4434 -108999 -100784 -98653 -96518 -94588 -92654 -93585 -100236 -104506 -99234 -93012 -86786 -87210 -87631 -85195 -82754 -78559 -74360
-4417 -74360 -63369 -61912 -63417 -64919 -62251 -59580 -60221 -60858 -64360 -67859 -76488 -85113 -88973 -92829 -92009 -91186 -88936 -86681
-4399 -86681 -87717 -88753 -89789 -90825 -93440 -96056 -99029 -102002 -99461 -102643 -102248 -101853 -98835 -90094 -88030 -91689 -94126
-4382 -94126 -96562 -96495 -96428 -94662 -92896 -90057 -87218 -86823 -92151 -94260 -96369 -93738 -91108 -91339 -91570 -94513 -97457 -95631 -93805
-4363 -93805 -89237 -84669 -84871 -85072 -85154 -85236 -84125 -77292 -72963 -74356 -78850 -83343 -84327 -85310 -89155 -93000 -95772 -98544 -98455
-4344 -98455 -98366 -98917 -99468 -95251 -91033 -86339 -81644 -81719 -81793 -85526 -89256 -88220 -87181 -84714 -82244 -82639 -83030 -86689 -90344
-4325 -90344 -94360 -92650 -91540 -90426 -91819 -93209 -91778 -90344 -86409 -82471 -86048 -95344 -101782 -102494 -105206 -107915 -107408
-4308 -107408 -106898 -103172 -99442 -100486 -101525 -99565 -97602 -98503 -99401 -98664 -97922 -100046 -102166 -98626 -95083 -93332 -91577 -90035
-4290 -90035 -94211 -99584 -104953 -106108 -101536 -94465 -93112 -92926 -98459 -105784 -107382 -104334 -101283 -102647 -104007 -99588 -95165
-4273 -95165 -93608 -92047 -91637 -91227 -91890 -92553 -97300 -96324 -98567 -100810 -100981 -101153 -98105 -95057 -100504 -100229 -96853 -93477 -92829
-4254 -92829 -97904 -98328 -98753 -94617 -90482 -86346 -82210 -83157 -84103 -87911 -91719 -91950 -92181 -92412 -92643 -93433 -94222 -97874 -101525
-4235 -101525 -98559 -95594 -92628 -89662 -90571 -91480 -92389 -93298 -93671 -94044 -94416 -94789 -95486 -96182 -99740 -103299 -102505 -101711 -98056 -94401
-4215 -94401 -93831 -93261 -95553 -97844 -97453 -97062 -96670 -96279 -97989 -99699 -98548 -97397 -102624 -107852 -110217 -103045 -95843 -94364
-4197 -94364 -97654 -100944 -103638 -106331 -106164 -105996 -102956 -99916 -99737 -99558 -97591 -95623 -93656 -91689 -92986 -94282 -95579 -96875
-4179 -96875 -96860 -96845 -93969 -91093 -93902 -96708 -94748 -92784 -91361 -89934 -88511 -87084 -88492 -89897 -86536 -83172 -82732 -82289
-4161 -82289 -86618 -90944 -90988 -91029 -88213 -85392 -86152 -86909 -87669 -88425 -88962 -89494 -90031 -90564 -95035 -99502 -101112 -102717 -100556 -98392
-4141 -98392 -99092 -99789 -100310 -100828 -98489 -96145 -95608 -95068 -94532 -93991 -96436 -98876 -101320 -103761 -109334 -114905 -113802 -112695 -110340
-4122 -110340 -107982 -105627 -103269 -101138 -99003 -96872 -94737 -92725 -90709 -95374 -100035 -100523 -101011 -98638 -96264 -92699 -89133
-4105 -89133 -90336 -91540 -94785 -98030 -92691 -87352 -92624 -97896 -98399 -98902 -101335 -103768 -101432 -99096 -95866 -92635 -92266 -91898
-4087 -91898 -89740 -87583 -85426 -83269 -86119 -88969 -87050 -85131 -84614 -84092 -83574 -83052 -85217 -87378 -86681 -85981 -85552 -85120 -87553
-4068 -87553 -89982 -90389 -90791 -94059 -97322 -95672 -94018 -95228 -96436 -92043 -87646 -88023 -88395 -92050 -95702 -94588 -93470 -91283
-4050 -91283 -89092 -89766 -90437 -92788 -95139 -92721 -90303 -92117 -93932 -95746 -97561 -95441 -93321 -94062 -94804 -92743 -90683 -88623
-4032 -88623 -86562 -89271 -91980 -94688 -97397 -96290 -95184 -96939 -98693 -94696 -90698 -93377 -96056 -93548 -91041 -91395 -91749
-4015 -91749 -92866 -93980 -95098 -96212 -95720 -95225 -97594 -99960 -98768 -97572 -93518 -89461 -89163 -88861 -91424 -93984 -96160 -98332
-3997 -98332 -100508 -102680 -105035 -107386 -109741 -112092 -108947 -105799 -102654 -99506 -100117 -100724 -101335 -101942 -102270 -102594 -105784 -108969
-3979 -108969 -108940 -108906 -108876 -108843 -110937 -113027 -108444 -103857 -101063 -98265 -98332 -98395 -99118 -99837 -100560 -101279 -103373 -105463 -107557 -109647 -110780
-3958 -110780 -111909 -113042 -114171 -109819 -105463 -101112 -96756 -98500 -100243 -101987 -103731 -103090 -102449 -106577 -110706 -114096 -117487
-3941 -117487 -114200 -110914 -111145 -111376 -111607 -111838 -110855 -109871 -106026 -102181 -103403 -104625 -102986 -101346 -100862 -100378 -102755 -105132 -107986
-3922 -107986 -110840 -107017 -103194 -103779 -104360 -107807 -111250 -107840 -104428 -101018 -97606 -97117 -96626 -98999 -101369 -100761 -100150 -94774
-3904 -94774 -89394 -89673 -89949 -90228 -90504 -91678 -92848 -94021 -95191 -95448 -95702 -95959 -96212 -93012 -89807 -89468 -89126 -91473 -93816
-3885 -93816 -93302 -92784 -95728 -98667 -98749 -98828 -102181 -105530 -104115 -102695 -97881 -93064 -94927 -96786 -96443 -96097 -95754 -95407 -94290
-3866 -94290 -93168 -92050 -90929 -89126 -87319 -85515 -83708 -85005 -86298 -90456 -94610 -94893 -95176 -98321 -101466 -101510 -101555 -101600 -101644
-3847 -101644 -100825 -100005 -95966 -97650 -100288 -102926 -106637 -104625 -103187 -107472 -111279 -105549 -95944 -95877 -97837 -94073 -93917 -93760
-3829 -93760 -93246 -92732 -93410 -94088 -91905 -89722 -89029 -88332 -87639 -86942 -89170 -91395 -90761 -90124 -91026 -91924 -93541 -89431 -85325 -86938
-3809 -86938 -84263 -87307 -92792 -92550 -89211 -91592 -96659 -92184 -88667 -85146 -85638 -86126 -86618 -87106 -86763 -86417 -83213 -80005 -81007
-3790 -81007 -82005 -83008 -84006 -85664 -87319 -95296 -103269 -112378 -115762 -115691 -115616 -111313 -107006 -105564 -104118 -105709 -107296 -108887
-3772 -108887 -110475 -109681 -108884 -107732 -106577 -109748 -107192 -101182 -95169 -96611 -98049 -99491 -100929 -101130 -101331 -101533 -101730 -101395
-3754 -101395 -101059 -100724 -100385 -100556 -100728 -103761 -106790 -104755 -102721 -103548 -104372 -104655 -104938 -102360 -99778 -99524 -99271 -99018 -98761 -102710
-3734 -102710 -106659 -107747 -108831 -104495 -100158 -100590 -101018 -102963 -104908 -102084 -99260 -98135 -97009 -95884 -94759 -96764 -98768
-3717 -98768 -99342 -99916 -103261 -106607 -105184 -103761 -105497 -107233 -108969 -110706 -109878 -109051 -105363 -101674 -104483 -107293 -105333 -103373
-3699 -103373 -103023 -102673 -105184 -107695 -108709 -109722 -110139 -110553 -113712 -107334 -106320 -105303 -100772 -96242 -96480 -96715 -94152 -91588
-3681 -91588 -97609 -103626 -101011 -98395 -98641 -98884 -97907 -96931 -100724 -104513 -105594 -106674 -106324 -105970 -107438 -108906 -105605 -102300
-3663 -102300 -100433 -98567 -99562 -100556 -101968 -103381 -104793 -106205 -107587 -108969 -105583 -102196 -101909 -101622 -106104 -110586 -111544 -112501
-3645 -112501 -113459 -114416 -106849 -99282 -96484 -93686 -96052 -98418 -97922 -97427 -98660 -99893 -101126 -102360 -101104 -99848 -101454 -103060
-3627 -103060 -105501 -107941 -110381 -112822 -112535 -112248 -109100 -105951 -104144 -102337 -101961 -101585 -98235 -94886 -94398 -93910 -94256 -94603 -97810
-3608 -97810 -101018 -102147 -103276 -102974 -102673 -107527 -112382 -112468 -112554 -111540 -110523 -106648 -102770 -102501 -102229 -103392 -104550 -105907 -107259
-3589 -107259 -108615 -109968 -111950 -113928 -115911 -117889 -116108 -114323 -115404 -116481 -112732 -108981 -110001 -111019 -109729 -108437 -104644
-3572 -104644 -100847 -94908 -94688 -96022 -97352 -100705 -104055 -102639 -101220 -99744 -98265 -100366 -96741 -92702 -94383 -98809 -103232
-3555 -103232 -110221 -111484 -107744 -103999 -104796 -111313 -111156 -105273 -107054 -108831 -111685 -114536 -114558 -114577 -114599 -114618 -113716 -112811 -111909 -111004
-3535 -111004 -109431 -107855 -109502 -111145 -106294 -107162 -105173 -103179 -99342 -101223 -99889 -98552 -98112 -97669 -97229 -96786 -100981 -105173
-3517 -105173 -106507 -107837 -106726 -105612 -107363 -109111 -109849 -110583 -113824 -117062 -115952 -109115 -105501 -101883 -103418 -104953 -103626
-3500 -103626 -102296 -101089 -99882 -103086 -106287 -106838 -101667 -100072 -98474 -98250 -103749 -109249 -109021 -106182 -103343 -100147 -96946
-3483 -96946 -97058 -97170 -99785 -102397 -105728 -103336 -99513 -101410 -102147 -102885 -110061 -111510 -112162 -112814 -110247 -107680 -107319 -106957 -111365
-3464 -111365 -115773 -114145 -112516 -110888 -109260 -105247 -101235 -101991 -102747 -105903 -109059 -112215 -115370 -112922 -110475 -108027 -105579
-3447 -105579 -107855 -110132 -105732 -101331 -102177 -103023 -103869 -104714 -106670 -108623 -107714 -106805 -103455 -100102 -99610 -99118 -98779 -98436 -100955
-3428 -100955 -103474 -104148 -104819 -105489 -106160 -105031 -103898 -107535 -111171 -112010 -112844 -116540 -120236 -117975 -115709 -118213 -120717 -117919
-3410 -117919 -115117 -115177 -115236 -112725 -110214 -107703 -105191 -106138 -107084 -105169 -103254 -101547 -99841 -98135 -96428 -98418 -100407 -97628
-3392 -97628 -94848 -96518 -98187 -99856 -101525 -96816 -92106 -92166 -92225 -98902 -105579 -107486 -109394 -108321 -107248 -103314 -99379 -97307
-3374 -97307 -95236 -90303 -85370 -88306 -91242 -94178 -97114 -98261 -99409 -100556 -101704 -99871 -98038 -99066 -100094 -103261 -106428
-3357 -106428 -106734 -107039 -107464 -107889 -105452 -103015 -101324 -99632 -102710 -105787 -107494 -109200 -110907 -112613 -112304 -111995 -108824 -105653
-3339 -105653 -105761 -105869 -105977 -106086 -105448 -104811 -100597 -102106 -105642 -103455 -101626 -105519 -108250 -110981 -110851 -116443 -118876 -121309
-3321 -121309 -119331 -117352 -114033 -110713 -107393 -104074 -106000 -107926 -103414 -104625 -104469 -98589 -93067 -93269 -89893 -86517 -86599 -92404
-3303 -92404 -96361 -94595 -96048 -97501 -103306 -103388 -103470 -109275 -106920 -104565 -102568 -100571 -98574 -96577 -101257 -105936 -102062 -98187
-3285 -98187 -97173 -96160 -96756 -97352 -95087 -92822 -93615 -94405 -95199 -95989 -95530 -95068 -97114 -99155 -102825 -100769 -95497 -95944 -99256
-3266 -99256 -96842 -95146 -93448 -93876 -94301 -92225 -90146 -87475 -90523 -92859 -95191 -85023 -69129 -59915 -50697 -48458 -55753
-3249 -55753 -69490 -77501 -81201 -84897 -88239 -91577 -90150 -88719 -87292 -85862 -86327 -86789 -90117 -93440 -89852 -86260 -87441
-3232 -87441 -88619 -90240 -91857 -90258 -94379 -95165 -95948 -97091 -98231 -103936 -109636 -108664 -107688 -105463 -103235 -101369 -99498 -96622
-3214 -96622 -99468 -99096 -98720 -97155 -95590 -93310 -96749 -99804 -97136 -90057 -88697 -89129 -89561 -88801 -82315 -79267 -76219 -76033
-3196 -76033 -75843 -76789 -83459 -86909 -90355 -94446 -98537 -99767 -100992 -99122 -97252 -95739 -94222 -91838 -95173 -99703 -104230
-3179 -104230 -105124 -100292 -98682 -97069 -98679 -100284 -101894 -103500 -103440 -103377 -100456 -97531 -100810 -104085 -104502 -104916 -103187 -101454
-3161 -101454 -100083 -98708 -96965 -100940 -104919 -103172 -103813 -104450 -104733 -105012 -105173 -105333 -102274 -104934 -105691 -106447 -105057 -103664 -103273
-3142 -103273 -108604 -105948 -103287 -101764 -100240 -98716 -97188 -96786 -96383 -102658 -108928 -106439 -103951 -101462 -98969 -101518 -104066
-3125 -104066 -106615 -109159 -108131 -107103 -106074 -105042 -106264 -107483 -111924 -110638 -109774 -108906 -110545 -112181 -108664 -105143 -102222
-3108 -102222 -99297 -93813 -97863 -96551 -95236 -97110 -98980 -100854 -102725 -100903 -99077 -98805 -104252 -104845 -105434 -103880 -102322
-3091 -102322 -100292 -103980 -108269 -106831 -102147 -107002 -106492 -105981 -103265 -106272 -106059 -105847 -109122 -112397 -110903 -109409 -103802 -98194
-3073 -98194 -96044 -99617 -103720 -107822 -107513 -107203 -105642 -104081 -102520 -100959 -105359 -109759 -109748 -109737 -105434 -106853 -108630 -104685
-3055 -104685 -99755 -100549 -100627 -100705 -104659 -108612 -108153 -107695 -102140 -102308 -104025 -105743 -105553 -105363 -105173 -104983 -104286 -103589 -102892 -102196 -101737
-3034 -101737 -101279 -105590 -109901 -109636 -109372 -106603 -103835 -99219 -100325 -102982 -105638 -104498 -103355 -102214 -101071 -100229 -99383 -98541
-3016 -98541 -97695 -98984 -100270 -101559 -102844 -100378 -97907 -98302 -98693 -99237 -99778 -100322 -100862 -105281 -109696 -109346 -108992 -110042 -111089
-2997 -111089 -109279 -107464 -105773 -104077 -102386 -100691 -101976 -103258 -104543 -105825 -104308 -102788 -103776 -104759 -106730 -102974 -98865
-2980 -98865 -100474 -103876 -101551 -102807 -104059 -105717 -107371 -106168 -104960 -102267 -99569 -99737 -99901 -103541 -107177 -106048 -104916
-2963 -104916 -103191 -101462 -102598 -103731 -105456 -107181 -106045 -104908 -105262 -105616 -105612 -105609 -108720 -106108 -101946 -97784 -96842 -95899 -92095
-2944 -92095 -88291 -92415 -96540 -100307 -104074 -107781 -105765 -98384 -91003 -88302 -85601 -89576 -93552 -96991 -100430 -103869 -107308
-2927 -107308 -104040 -100769 -100363 -99953 -101872 -103787 -104513 -99513 -94085 -94375 -97769 -101160 -104137 -107110 -105080 -97322 -94696 -97788
-2909 -97788 -100884 -98254 -92825 -93116 -97822 -96801 -93563 -90322 -93403 -96480 -96998 -97512 -98030 -98544 -96238 -93928 -90907 -93604
-2891 -93604 -99465 -99599 -100452 -101302 -104837 -108369 -108805 -103515 -98049 -98302 -102971 -101913 -101894 -101872 -101495 -101115 -102885 -104651 -105825 -106995
-2871 -106995 -110717 -104897 -99677 -94453 -94658 -94860 -101741 -108619 -106398 -104174 -101596 -104737 -103887 -103034 -102542 -102047 -100616 -99182
-2853 -99182 -104428 -109670 -105735 -101797 -99413 -102747 -103157 -103563 -104331 -105094 -107948 -110799 -106976 -103150 -102308 -101462 -103481 -105497
-2835 -105497 -102568 -99636 -96708 -93775 -95541 -97307 -101935 -106562 -104394 -102226 -100057 -97889 -100296 -102702 -102248 -101793 -105631
-2818 -105631 -109469 -108537 -107606 -107173 -106741 -106309 -105877 -102762 -99647 -105117 -110586 -111302 -112017 -109871 -107725 -107308 -106890 -106473 -106056 -100713
-2798 -100713 -95366 -94793 -94215 -95370 -96521 -92907 -89289 -85765 -82236 -87296 -92352 -94610 -96864 -96261 -95653 -95687 -95717 -95750 -95780 -96827
-2778 -96827 -97870 -98917 -99960 -101961 -103958 -105959 -107956 -107334 -106708 -106086 -105460 -104815 -104170 -103526 -102881 -102296 -101711 -103988 -106264
-2759 -106264 -106589 -106913 -107237 -107561 -106395 -105229 -104062 -102896 -101987 -101078 -100169 -99260 -100378 -101495 -99752 -98008 -95281 -92553 -96503
-2740 -96503 -100452 -103865 -107278 -105922 -104565 -104860 -105150 -105445 -105735 -101976 -98213 -101130 -104044 -105068 -106089 -107114 -108135 -109815
-2722 -109815 -111492 -108403 -105311 -108787 -112259 -110966 -109670 -104681 -99688 -99468 -99245 -97922 -96596 -98135 -99670 -101506 -103340
-2705 -103340 -105176 -107010 -102326 -97643 -99636 -101629 -102967 -104305 -105642 -106980 -106887 -106793 -106700 -106607 -105322 -104036 -102751 -101466 -104860
-2686 -104860 -108254 -111648 -115042 -113429 -111816 -110203 -108589 -108138 -107688 -107237 -106786 -104726 -102665 -100605 -98544 -103839 -109133 -107751
-2668 -107751 -106369 -108027 -109685 -111343 -113001 -111425 -109849 -108273 -106697 -106790 -106883 -106976 -107069 -106782 -106495 -106208 -105922 -108496 -111071 -108876
-2648 -108876 -106682 -103280 -99878 -99338 -98798 -102609 -106421 -105463 -104506 -103787 -103064 -102345 -101622 -106089 -110553 -115020 -119484 -118466 -117446
-2629 -117446 -116428 -115408 -109025 -102639 -101026 -99409 -98593 -97773 -103634 -109491 -110702 -111909 -113120 -114327 -114584 -114838 -115095 -115348
-2611 -115348 -111134 -106916 -109379 -111838 -113150 -114457 -115769 -117077 -115050 -113019 -110992 -108962 -109305 -109644 -107125 -104603 -103694
-2594 -103694 -102781 -101872 -100959 -99789 -98615 -97445 -96272 -94208 -92140 -92937 -93731 -93559 -93384 -93213 -93038 -95370 -97699 -100031 -102360
-2575 -102360 -102557 -102751 -105810 -108865 -110732 -112595 -111600 -110601 -106387 -102170 -97956 -93738 -91790 -89837 -90750 -91659 -94435 -97207
-2557 -97207 -99983 -102755 -101000 -99241 -100348 -101451 -100515 -99577 -98641 -97702 -101179 -104651 -105266 -105877 -105232 -104588 -103943 -103299 -102177
-2538 -102177 -101056 -99934 -98813 -100329 -101846 -98593 -95340 -98049 -100758 -100605 -100452 -101983 -103515 -105046 -106577 -105068 -103559
-2521 -103559 -104912 -106264 -100225 -94185 -94822 -95459 -95918 -96376 -96834 -97293 -97259 -97222 -101957 -106689 -109457 -112222 -112129 -112032 -107781 -103526
-2501 -103526 -104044 -104558 -104539 -104517 -104498 -104476 -102855 -101231 -102471 -103708 -103638 -103563 -103492 -103418 -100888 -98354 -100594 -102829 -104711 -106589 -105609
-2480 -105609 -104625 -105012 -105396 -105784 -106168 -107986 -109800 -111618 -113433 -109871 -106305 -109420 -112531 -109565 -106596 -103630 -100661 -103507
-2462 -103507 -106350 -106335 -106317 -106302 -106283 -109130 -111972 -109007 -106037 -103071 -100102 -102799 -105493 -103422 -101346 -103571 -105791 -103246 -100698
-2443 -100698 -103220 -105739 -103492 -101242 -101842 -102438 -103038 -103634 -101074 -98511 -98813 -99111 -104442 -109770 -111883 -104454 -103645 -102833 -104290
-2424 -104290 -105743 -105977 -106208 -106443 -106674 -105538 -104398 -103619 -97114 -95482 -93850 -93053 -97978 -102367 -101033 -102919 -104804 -108120
-2406 -108120 -105713 -102114 -98515 -98254 -103716 -103097 -102479 -103343 -104208 -105072 -105936 -103522 -101108 -98693 -96279 -95296 -94312 -93686 -93060
-2387 -93060 -95474 -103612 -108887 -108440 -107520 -106600 -105322 -104044 -103779 -103515 -103608 -103701 -100396 -102814 -105232 -101928 -103869 -105810 -102982
-2368 -102982 -100154 -96328 -98224 -99405 -100586 -101827 -97345 -92863 -94103 -94271 -94439 -94606 -100497 -98578 -96659 -97959 -99260
-2351 -99260 -98951 -98638 -92248 -91577 -91864 -92147 -89930 -97248 -102811 -102647 -100221 -103515 -102878 -102237 -104461 -106682 -106812 -101216 -96339
-2332 -96339 -100996 -102080 -103161 -101980 -100795 -98347 -95895 -98217 -100534 -99696 -98854 -98015 -97173 -99029 -100881 -97963 -95046 -94576
-2314 -94576 -94103 -96492 -98880 -98246 -97609 -99834 -102058 -99398 -96734 -96931 -97129 -99573 -102013 -101592 -101171 -100396 -99617 -98839 -98060 -98954
-2294 -98954 -99845 -100735 -101626 -98764 -95899 -95895 -95892 -95817 -95739 -95664 -95586 -100519 -105448 -105612 -105773 -105266 -104755 -104249 -103738 -103112 -102483 -101857 -101227 -99603
-2270 -99603 -97974 -99211 -100445 -101860 -103273 -107550 -111823 -107770 -103712 -104428 -105139 -105199 -105255 -105314 -105370 -104748 -104126 -106365 -108600 -106428
-2250 -106428 -104256 -102084 -99908 -101402 -102896 -101529 -100158 -100519 -100881 -98381 -95877 -97311 -98746 -95411 -92073 -93209 -94345
-2233 -94345 -98343 -102337 -102281 -102226 -102170 -102110 -106406 -110702 -110229 -109752 -110042 -110329 -115389 -120445 -115788 -111127 -106469 -101808 -97837 -93861
-2213 -93861 -94420 -104513 -111033 -108012 -108094 -108172 -108027 -107878 -107732 -107583 -106365 -105143 -103925 -102702 -102527 -102349 -99312 -96272 -94904
-2194 -94904 -93533 -95027 -96518 -97591 -98664 -99737 -100810 -100869 -100929 -100989 -101048 -102017 -102986 -104312 -105638 -103925 -107934 -108723 -109513 -105925
-2174 -105925 -102337 -101611 -100884 -97952 -95020 -93638 -97978 -104360 -110743 -114025 -111585 -111350 -111115 -104204 -97293 -93436 -95299 -94304
-2156 -94304 -93306 -92728 -97870 -105877 -108157 -110679 -113198 -110594 -107986 -107527 -107065 -106607 -106145 -103764 -101380 -98999 -96614 -96082 -95545
-2137 -95545 -95012 -94476 -94569 -94658 -97017 -99372 -105068 -101223 -98336 -95445 -94539 -99357 -100955 -102553 -100039 -97524 -99778 -102032 -103213
-2118 -103213 -104394 -100448 -96503 -97326 -92427 -90389 -94073 -97058 -100042 -100523 -101004 -100769 -100534 -101492 -108172 -109070 -104245 -100493
-2100 -100493 -96741 -91022 -91026 -96037 -101048 -105046 -103321 -104815 -106309 -104703 -103097 -101849 -100601 -99577 -104275 -106469 -102941
-2083 -102941 -101380 -105542 -106127 -106711 -107520 -108328 -109137 -109945 -106998 -104051 -103966 -103880 -105061 -106242 -107423 -108604 -107162 -105720 -104279
-2064 -104279 -102837 -105594 -108347 -111462 -108850 -105586 -102319 -98697 -95072 -98172 -101268 -104368 -107464 -110206 -112945 -118906 -119141
-2047 -119141 -116086 -113027 -106395 -105482 -108150 -110814 -105255 -99692 -98008 -96320 -95828 -101056 -104677 -102572 -101186 -99796 -103004
-2030 -103004 -106208 -109059 -111905 -111000 -104368 -103820 -103269 -106134 -108995 -108999 -108999 -110553 -112103 -108887 -105668 -104621 -103571 -97755 -91935
-2011 -91935 -93332 -94725 -96123 -97516 -97423 -97326 -94729 -92129 -90664 -94919 -98820 -102717 -99390 -96063 -97505 -98947 -98600 -98254
-1993 -98254 -95046 -91838 -93518 -95199 -94018 -92836 -95888 -98939 -99129 -99319 -99502 -99685 -99867 -100050 -98563 -97076 -100359 -103641
-1975 -103641 -106477 -109312 -108332 -113075 -116686 -110758 -110553 -110348 -108843 -107337 -105832 -104327 -102762 -101197 -104759 -108321 -104133
-1958 -104133 -105668 -109707 -104208 -98470 -98455 -100944 -103433 -106749 -104342 -104796 -105251 -107673 -104372 -101071 -103492 -103634 -103776 -104275
-1940 -104275 -104774 -105571 -106369 -107166 -107963 -106220 -104476 -107501 -110527 -109200 -107874 -106548 -105221 -105400 -105579 -105758 -105936 -106235 -106533
-1921 -106533 -103969 -101406 -101235 -101063 -103753 -106443 -104722 -103001 -104141 -105281 -103887 -102494 -103962 -105430 -103321 -101212 -99103
-1904 -99103 -96995 -95944 -94893 -93842 -92792 -92814 -92836 -97628 -102419 -101041 -99662 -101145 -102628 -103992 -105355 -106719 -108083 -108068
-1886 -108068 -108053 -108038 -108023 -108723 -109424 -110124 -110825 -110750 -110676 -110601 -110527 -108127 -105728 -103328 -100929 -100400 -99871 -96480 -93090 -94111 -95132 -96152
-1864 -96152 -97173 -102173 -107173 -107404 -107635 -107449 -107263 -107077 -106890 -106842 -106790 -106741 -106689 -108250 -109808 -108507 -107203 -108094 -108981 -109871 -110758
-1843 -110758 -110754 -110747 -110743 -110735 -106372 -102009 -97647 -93284 -97922 -102561 -104338 -106115 -106104 -106093 -106082 -106071 -106894 -107717 -108541 -109364 -113645 -117922 -119342
-1820 -119342 -120758 -116455 -112147 -107844 -103537 -99025 -94509 -92620 -100266 -107855 -105903 -100020 -99856 -103246 -106637 -101801 -96965
-1803 -96965 -98686 -100407 -102129 -103850 -103962 -104074 -104185 -104297 -101428 -98559 -98552 -98544 -99789 -101033 -99416 -97799 -96957 -96115 -100042 -103969
-1783 -103969 -103097 -102226 -101354 -100482 -99610 -98738 -97866 -96995 -94793 -92591 -97065 -101540 -98384 -95228 -96842 -98455 -100039 -101622 -103205
-1764 -103205 -104789 -104882 -104975 -102207 -99439 -98146 -96853 -98421 -99990 -99234 -98477 -97721 -96965 -94301 -91637 -91834 -92032 -94196 -96361
-1745 -96361 -97930 -99498 -103548 -98056 -97933 -97807 -98757 -99703 -100653 -101600 -102505 -103407 -104312 -105214 -104510 -103802 -105959 -108112 -107021 -105925
-1725 -105925 -104834 -103738 -104018 -104293 -104573 -104849 -104741 -104629 -104521 -104409 -102691 -100970 -102114 -103254 -103172 -103090 -103008 -102926 -98612 -94297 -92844
-1704 -92844 -91391 -92844 -94297 -100519 -106741 -104796 -102852 -103768 -104685 -104312 -103939 -103567 -103194 -100258 -97322 -97248 -97173 -101391 -105609
-1685 -105609 -103150 -100691 -101153 -101615 -99215 -96816 -96193 -95571 -94949 -94327 -94241 -94155 -94070 -93984 -97535 -101085 -104279 -107472 -109234 -105273
-1665 -105273 -101313 -103075 -104428 -105780 -107490 -109200 -107274 -105348 -100202 -100780 -105083 -109387 -107729 -106071 -102326 -104305 -105925
-1648 -105925 -107546 -105173 -102799 -100068 -103060 -104323 -105586 -107565 -103820 -102565 -101309 -99696 -98082 -95873 -93664 -94316 -94968
-1631 -94968 -97229 -99491 -98533 -103299 -104845 -106391 -108295 -110199 -112177 -114156 -113273 -112390 -108109 -103828 -102408 -100989 -99427 -97866
-1613 -97866 -99524 -101179 -102479 -109502 -110445 -111384 -114308 -117233 -113481 -109726 -110802 -111879 -113314 -109021 -108928 -108835 -108384 -107930 -106585
-1594 -106585 -105240 -103895 -102546 -105448 -108351 -111253 -114152 -112345 -110538 -108373 -106205 -109413 -106898 -105098 -103299 -102334 -107092
-1577 -107092 -108630 -110169 -108027 -105884 -109823 -108038 -107207 -106376 -101968 -103284 -106186 -109089 -107937 -106786 -105098 -109133 -109949
-1560 -109949 -110765 -111864 -112963 -114063 -115162 -112684 -110206 -107729 -105251 -102840 -100430 -98019 -95605 -99752 -103898 -103276 -102650
-1543 -102650 -104204 -105758 -112080 -118399 -119893 -121388 -118113 -114834 -112244 -109655 -103846 -103757 -105936 -108116 -105884 -103649 -102430
-1526 -102430 -101212 -99994 -98772 -98448 -98123 -100303 -102479 -103790 -99375 -101044 -102710 -105333 -107952 -103898 -99841 -100050 -100255 -103325
-1508 -103325 -106391 -99685 -92974 -94852 -96726 -99178 -101626 -106581 -111533 -113865 -110471 -103861 -102971 -107971 -107244 -105687 -104126
-1491 -104126 -100065 -101723 -103027 -104327 -102688 -101044 -102267 -103485 -100176 -96864 -96417 -95966 -95102 -94234 -93012 -97509 -97360 -97207
-1473 -97207 -97416 -97620 -101734 -105843 -109599 -113351 -118835 -118593 -113586 -114297 -114431 -114562 -118273 -116257 -113232 -110203 -109681 -109156 -106868
-1454 -106868 -104580 -103485 -108112 -110594 -107352 -102919 -98485 -97837 -97188 -90459 -89453 -92442 -95430 -104856 -108559 -109171 -109782 -110035
-1436 -110035 -110288 -111913 -113537 -115162 -116786 -115460 -114133 -112807 -111481 -107770 -104059 -107024 -109990 -111678 -113362 -110281 -107196
-1419 -107196 -103817 -100433 -101823 -103209 -102393 -101574 -100758 -99938 -99778 -99614 -101957 -104297 -109249 -108474 -108060 -107643 -107527 -107408 -101212
-1400 -101212 -100735 -99219 -97699 -92963 -93947 -100240 -100806 -100184 -99558 -99968 -100374 -103645 -106913 -105951 -104986 -104025 -103060 -101920 -100776
-1381 -100776 -96775 -92769 -95027 -97281 -92863 -88440 -88164 -87885 -86894 -91622 -95221 -93094 -94547 -95996 -95527 -95053 -97445 -99834
-1363 -99834 -99901 -99964 -100031 -100094 -99379 -98664 -97948 -97233 -96518 -95802 -95087 -94372 -93433 -92494 -91555 -90616 -92121 -93626 -97993 -102360 -100910 -99461
-1341 -99461 -98012 -96562 -97915 -99267 -97758 -96249 -97945 -99640 -98474 -97307 -97274 -97240 -97207 -97173 -95120 -93067 -97691 -102315 -103183
-1322 -103183 -104051 -104919 -105787 -103451 -101115 -98779 -96443 -97982 -99521 -101417 -97591 -98224 -98857 -99133 -99409 -100817 -102226 -99223
-1304 -99223 -96220 -97762 -105027 -111935 -109305 -100772 -97963 -98015 -98068 -98768 -99468 -100169 -100869 -100199 -99528 -101719 -103910 -105847 -107785
-1285 -107785 -106861 -105936 -102926 -99916 -101674 -103433 -105378 -107323 -109267 -111212 -111965 -112718 -110609 -108500 -106540 -104580 -102621 -100661
-1267 -100661 -105258 -109856 -109685 -109513 -108567 -107621 -106674 -105728 -103887 -102047 -106883 -111719 -114737 -117755 -114096 -110437 -110176 -109916 -109655
-1248 -109655 -109394 -106473 -103552 -107308 -111063 -111779 -112494 -113209 -113925 -111943 -109960 -107978 -105996 -105027 -104059 -103090 -102121 -104461 -106797
-1229 -106797 -106276 -105750 -108150 -110545 -110083 -109618 -111764 -113906 -111283 -108656 -110326 -111991 -108891 -105787 -105378 -104964 -101693 -98418
-1211 -98418 -101585 -104748 -103146 -101540 -102904 -104264 -102766 -101264 -101078 -100888 -100702 -100512 -99562 -98612 -97661 -96711 -100709 -104707 -102028
-1192 -102028 -99349 -98951 -98552 -98153 -97755 -99740 -101726 -100851 -99975 -101439 -102904 -104368 -105832 -100381 -94930 -94249 -93567 -97684 -101801
-1173 -101801 -105918 -110035 -109264 -108492 -107721 -106950 -105534 -104115 -107468 -110817 -110713 -110605 -113720 -111108 -105325 -99539 -98168 -96793
-1155 -96793 -97747 -98697 -99651 -100601 -100035 -99465 -102475 -99759 -92039 -90038 -93049 -96056 -99409 -102758 -103250 -103738 -103753 -103764 -103779 -103790 -101741
-1134 -101741 -99688 -97639 -95586 -99737 -103884 -104577 -99543 -98820 -98094 -103094 -102367 -99856 -97341 -97334 -97322 -95474 -93623 -96544 -99461
-1115 -99461 -100176 -100888 -101603 -102315 -98902 -95486 -96842 -98194 -98000 -97803 -94032 -95981 -100713 -99718 -95623 -91529 -88868 -86205 -87952
-1096 -87952 -89699 -93567 -91708 -93067 -94427 -95195 -95959 -96723 -97486 -97345 -97199 -99916 -102632 -103325 -104014 -104703 -105393 -103761 -102125
-1077 -102125 -102039 -107676 -108548 -109416 -113861 -112583 -108984 -105381 -106194 -107002 -104476 -101946 -96201 -96175 -97926 -99673 -100232 -95065 -98604
-1058 -98604 -102140 -105322 -108500 -110951 -113399 -111440 -109476 -104476 -105195 -103653 -107829 -114335 -111298 -107550 -109521 -107680 -100113
-1041 -100113 -100895 -101674 -100594 -99509 -101287 -103064 -103176 -103284 -106969 -104931 -101004 -102796 -101011 -99226 -98161 -97091 -98884 -100676
-1023 -100676 -99487 -98295 -101872 -105448 -102948 -100445 -100802 -101160 -98749 -96335 -97140 -97945 -95117 -98008 -100541 -103075 -101059 -99044
-1005 -99044 -97386 -95724 -91860 -93719 -95221 -96719 -96402 -96085 -100180 -104271 -105683 -101372 -100281 -99185 -97419 -95653 -96749
-988 -96749 -97840 -93928 -90016 -93019 -101741 -103925 -100385 -100422 -100456 -101328 -102199 -108794 -105847 -100229 -100333 -103299 -106264 -102077 -97889
-969 -97889 -100378 -102866 -101167 -99468 -98127 -96786 -92941 -94819 -100154 -105489 -105273 -105057 -104841 -104625 -104170 -103716 -106480 -103522 -99267
-950 -99267 -95012 -93857 -98425 -98641 -98857 -99431 -100005 -100568 -101130 -101693 -102252 -102993 -103735 -104476 -105214 -102617 -100020 -100284 -100545 -100989 -101432
-929 -101432 -99014 -96592 -96562 -96529 -99714 -102900 -96790 -96398 -100776 -99431 -97688 -95940 -100512 -105083 -102624 -100161 -100202 -100243 -104036
-910 -104036 -102103 -98623 -95139 -99349 -103556 -104547 -105534 -108522 -105784 -106268 -106749 -107233 -107714 -108198 -108679 -109025 -109372 -106857 -104342
-891 -104342 -104629 -104916 -105560 -106205 -101171 -101860 -99331 -96801 -97550 -98299 -99047 -99796 -98243 -96685 -99901 -103112 -103645 -104174 -104707 -105236
-871 -105236 -103071 -100903 -98738 -96570 -100366 -104159 -102829 -101495 -103645 -100068 -102218 -104364 -105858 -101626 -97039 -98172 -100813
-854 -100813 -97729 -93813 -89893 -87468 -90761 -95251 -99737 -106574 -107684 -102121 -102278 -102617 -102952 -103649 -104342 -104845 -105344 -97859 -96093
-835 -96093 -97848 -99599 -101711 -103820 -103220 -102617 -102017 -101413 -101767 -102118 -100922 -93999 -94040 -94077 -98530 -102978 -101827 -100672 -97017 -93358
-815 -93358 -88056 -88474 -95810 -93604 -90866 -88123 -88246 -94088 -94688 -95284 -96242 -97196 -100180 -103161 -103284 -103403 -103969 -104532 -105098 -105661
-795 -105661 -102948 -100232 -97520 -94804 -94819 -94830 -94845 -94856 -96123 -97386 -98653 -99916 -101793 -103667 -102684 -95974 -89565 -92691 -99994
-776 -99994 -101570 -103761 -105948 -103012 -100072 -100653 -101231 -101812 -102390 -100977 -99562 -104826 -110087 -108794 -107498 -109066 -110631 -109845
-758 -109845 -109055 -108269 -107479 -104249 -101015 -100646 -100273 -98340 -96402 -97330 -98254 -100255 -102252 -99483 -96711 -98638 -100560 -99625 -98686
-739 -98686 -95784 -92877 -89975 -87069 -88764 -90456 -89289 -88120 -87848 -87572 -90161 -92747 -93846 -94942 -98902 -102859 -99726 -96588
-721 -96588 -93455 -90318 -89684 -89051 -93187 -97322 -92993 -88664 -89103 -89543 -93380 -97218 -101056 -104893 -103723 -102553 -101384 -100214
-703 -100214 -101816 -103418 -107881 -112345 -106913 -101480 -102725 -103969 -104141 -104312 -104483 -104655 -105482 -106309 -109998 -113686 -110225 -106764
-685 -106764 -106164 -105564 -105679 -105795 -103049 -100303 -102371 -104439 -103645 -102852 -102058 -101264 -103332 -105400 -104129 -102859 -104450 -106041 -104830
-666 -104830 -103619 -102408 -101197 -100329 -99461 -95731 -92002 -93638 -95273 -97266 -99260 -97226 -100914 -104245 -107576 -103694 -99811
-649 -99811 -98790 -97769 -96659 -95549 -93723 -97620 -100623 -97904 -98761 -99617 -103015 -106413 -106950 -107486 -108261 -109036 -109811 -110586 -109960
-630 -109960 -109334 -105847 -102360 -101316 -100273 -102091 -103910 -106048 -108183 -107460 -106734 -109707 -112677 -107065 -101451 -100445 -99435 -93660
-612 -93660 -87881 -88664 -89442 -86648 -89573 -93574 -91849 -90128 -94126 -97769 -95687 -97185 -98679 -96793 -94904 -93019 -91130 -86324
-594 -86324 -81514 -72892 -69990 -68466 -57404 -48369 -39334 -27020 -1352 36713 91949 162684 233419 266716 244693
-579 244693 185590 126487 75134 33319 141 -27314 -42489 -51942 -60798 -69654 -73742 -77829 -77654 -83201 -88392
-564 -88392 -93582 -91559 -89535 -87512 -85489 -88909 -92330 -96465 -94878 -88164 -87173 -87374 -87576 -89044 -90512 -88760 -92732 -92114
-546 -92114 -91495 -91234 -90974 -92434 -93895 -95355 -96816 -96369 -95921 -98336 -100750 -102673 -104595 -104968 -99617 -101242 -102866 -101629 -100392
-527 -100392 -96682 -98690 -97483 -96272 -97688 -99100 -100515 -101928 -102702 -103474 -101387 -99297 -98641 -97982 -97326 -96667 -99252 -101834
-509 -101834 -101559 -101279 -104580 -107878 -111536 -109469 -106138 -102803 -99472 -96138 -93582 -96745 -99554 -102360 -105169 -107978 -107926 -107874
-491 -107874 -109610 -111346 -106406 -101466 -100668 -99871 -103843 -107814 -107792 -107770 -102978 -98187 -98209 -98231 -98254 -98276 -97941 -97606 -94409 -91212 -92322
-470 -92322 -93433 -94185 -94938 -100400 -100139 -102740 -105340 -107084 -103105 -102345 -101585 -100646 -99707 -98768 -97829 -96041 -94252 -92106 -95683
-451 -95683 -96577 -97471 -98723 -99975 -99938 -99901 -99863 -99826 -95437 -91048 -91428 -91808 -94215 -96622 -102606 -102866 -104618 -112092 -111220 -110348 -106998
-430 -106998 -103645 -99938 -101950 -104621 -107289 -105549 -103805 -104226 -104644 -105422 -106197 -101313 -102147 -102628 -103105 -104726 -106343 -99737 -93127
-411 -93127 -91409 -95411 -96197 -96980 -98481 -99979 -101480 -102978 -104480 -105977 -107479 -108977 -105262 -101547 -97833 -94118 -93623 -93127
-393 -93127 -95493 -97859 -98064 -98269 -95612 -92956 -92624 -92293 -94822 -97352 -97665 -97978 -98291 -98604 -94625 -90646 -93343 -96041 -96473
-374 -96473 -96905 -97337 -97769 -96831 -95892 -97814 -99737 -101339 -102937 -101678 -100415 -100765 -101112 -101462 -101808 -104200 -106589 -106119 -105646 -103030
-354 -103030 -100411 -104472 -108530 -106305 -104077 -101853 -99625 -99129 -98630 -100996 -103358 -104726 -106089 -104595 -103097 -102498 -101894 -104156
-336 -104156 -106413 -103943 -101473 -99003 -96533 -99427 -102322 -101402 -106205 -112200 -108656 -107975 -107293 -103869 -100445 -99882 -99319 -102729
-318 -102729 -106138 -109547 -112956 -111715 -110475 -106372 -102270 -100791 -99312 -97833 -96354 -95292 -94230 -97937 -101644 -101112 -100575
-301 -100575 -102904 -105229 -106782 -108332 -105117 -101898 -99547 -97192 -94841 -92486 -93116 -93742 -94372 -94997 -100653 -106305 -107192 -108075
-283 -108075 -105385 -102691 -100001 -97307 -101920 -106529 -106372 -106212 -102300 -98384 -95426 -102002 -104741 -101752 -96145 -96257 -100545 -99107
-265 -99107 -98388 -97665 -99837 -102006 -99409 -96808 -96715 -96618 -96525 -96428 -97218 -98004 -95575 -98865 -98939 -99010 -99442 -99871 -96935 -93995 -91059 -88120
-243 -88120 -88522 -88921 -90515 -97829 -100836 -98116 -94208 -90295 -90679 -91059 -91443 -91823 -94800 -97773 -100750 -103723 -100262 -96797 -98105
-224 -98105 -99409 -97721 -96030 -98753 -101473 -102587 -97974 -96585 -95191 -97348 -99502 -97248 -94990 -90709 -92147 -95139 -98127
-207 -98127 -98362 -98597 -98831 -99066 -98407 -97747 -97088 -96428 -97006 -97583 -98161 -98738 -99137 -99536 -99934 -100333 -100806 -101279 -98891 -96503 -100493 -104483
-185 -104483 -101797 -99111 -101968 -104826 -104822 -104819 -104040 -103261 -102483 -101704 -100746 -99785 -101689 -103589 -105135 -106678 -108582 -104759 -103310 -101857
-165 -101857 -100050 -98239 -99174 -100106 -101041 -101972 -103317 -104659 -103142 -101622 -103921 -106216 -104938 -109379 -112185 -109264 -105154 -101041
-147 -101041 -103131 -105217 -110169 -109394 -108079 -101037 -99722 -98403 -99651 -100895 -102144 -103388 -103921 -104450 -104983 -105512 -101275 -97035
-129 -97035 -99476 -101913 -101290 -100664 -102904 -105139 -104696 -104249 -104163 -104074 -100158 -101961 -103410 -104856 -106663 -108466 -107412 -106354 -106130
-110 -106130 -105903 -105679 -105452 -104334 -103213 -102095 -100974 -102106 -103235 -104368 -105497 -104007 -102512 -101022 -99528 -99848 -100165 -100486
-92 -100486 -100802 -97725 -94644 -96335 -98023 -99357 -100687 -102021 -103351 -101406 -99457 -100732 -102002 -99174 -102069 -104606 -107144
-75 -107144 -105806 -104469 -103131 -101793 -102736 -103679 -109033 -114387 -114316 -108522 -105948 -103373 -102684 -101995 -101305 -100616 -101596 -102576 -104510 -100720
-55 -100720 -93176 -95169 -98116 -101063 -100314 -99565 -102393 -99498 -96290 -98802 -101316 -98105 -93824 -95262 -99804 -104342 -102460 -100575
-37 -100575 -101555 -102531 -105121 -107706 -107434 -107159 -105001 -102840 -100683 -98522 -97855 -97185 -96518 -95847 -95553 -95255 -94960 -94662 -96633 -98600
-17 -98600 -96160 -93716 -87781 -87564 -88902 -90236 -92706 -95173 -90966 -86756 -89480 -92199 -94923 -97643 -95776 -93906 -94901 -95892
0 -95892 -99372 -102852 -99655 -96458 -96302 -96145 -98850 -101555 -98567 -95579 -92948 -90318 -91264 -97933 -101026 -104118 -102941 -96037 -91998
19 -91998 -93679 -96614 -99547 -102840 -106130 -105132 -104129 -103131 -102129 -98865 -95597 -97460 -99319 -100169 -106741 -105325 -103910 -103865 -103820
38 -103820 -100556 -103015 -104223 -105430 -104133 -102837 -101898 -100959 -100378 -99796 -94960 -95843 -100188 -104528 -105951 -107371 -105933 -104491 -107583
57 -107583 -110672 -107088 -103500 -104923 -106343 -110627 -105370 -99953 -100255 -103422 -106585 -107785 -108981 -107319 -105653 -103068 -100478 -98250
75 -98250 -96018 -96473 -102647 -108824 -109275 -108131 -106987 -99763 -102077 -102781 -97762 -99420 -101078 -101097 -101115 -104711 -102583 -98310 -99759
94 -99759 -97632 -95504 -100541 -105579 -107397 -109215 -108291 -101644 -101078 -100512 -100691 -100869 -101048 -101227 -99319 -97412 -95146 -98604 -97635 -96663
114 -96663 -98913 -101160 -102218 -103273 -99562 -95847 -96309 -96767 -99733 -102695 -102442 -96462 -96566 -96667 -100165 -103660 -102390 -101115 -100501
133 -100501 -99882 -102486 -99364 -95709 -92050 -92807 -93559 -100098 -106633 -107807 -103254 -98999 -94740 -96804 -98865 -98008 -97147 -96290 -95430
152 -95430 -96182 -96931 -100545 -104156 -103537 -102915 -102296 -101674 -102308 -102937 -103571 -104200 -103641 -103079 -102520 -101957 -103843 -105724 -107609 -109491 -108574
173 -108574 -107654 -106738 -105817 -105333 -104845 -101499 -98150 -95519 -92885 -93116 -93343 -94856 -96365 -97520 -98671 -103582 -102766 -100404 -98038
192 -98038 -99610 -101179 -99889 -98597 -101361 -104122 -100210 -96294 -97553 -98809 -102930 -107047 -107352 -107654 -114040 -114700 -110989 -107278
210 -107278 -106428 -105579 -100020 -100184 -101898 -103612 -102539 -101466 -103612 -100035 -100691 -101346 -101644 -101942 -103626 -105311 -110571 -110109 -105296
229 -105296 -106205 -103537 -100869 -104252 -107635 -109469 -105579 -103895 -102211 -96950 -97412 -99834 -102255 -104677 -107099 -107613 -102404 -100057
247 -100057 -103433 -103738 -104044 -103515 -97263 -93515 -95489 -98656 -101823 -100087 -98351 -99476 -100601 -99699 -98798 -97896 -96995 -97076 -97158 -97240
267 -97240 -97322 -99252 -101182 -103112 -105042 -101883 -98723 -98425 -98127 -99737 -101346 -102956 -104565 -101883 -99200 -102837 -106473 -108619
285 -108619 -105042 -98604 -97889 -100713 -103537 -101950 -100363 -101696 -103030 -104364 -105698 -105571 -105445 -97688 -95653 -92486 -95042 -99148
303 -99148 -103254 -104465 -99949 -96152 -92352 -89509 -92386 -92047 -91704 -93123 -94539 -95959 -97375 -95694 -94010 -95191 -96369 -100247
321 -100247 -104122 -103589 -103053 -98585 -99837 -100735 -101629 -103183 -104733 -101518 -98299 -100746 -103191 -102777 -102360 -100221 -98082 -96302 -94521
340 -94521 -93872 -98947 -97941 -96935 -94886 -92836 -95556 -98276 -101831 -105385 -109655 -108202 -106950 -111421 -109454 -107486 -106294 -105102
358 -105102 -103552 -102002 -101376 -95027 -94401 -93775 -95474 -91450 -87427 -89126 -93351 -97572 -102155 -106734 -106488 -106238 -103131 -100020
376 -100020 -101160 -102296 -103436 -104573 -105534 -106492 -107453 -108410 -109584 -110754 -111928 -113098 -111827 -110553 -106421 -102285 -103295 -104301
394 -104301 -105311 -106317 -105776 -105232 -104692 -104148 -106074 -107997 -107062 -106123 -106141 -106156 -106175 -106190 -100754 -95314 -98462 -101607 -103682 -105754 -104968
415 -104968 -104178 -101123 -98064 -95009 -91950 -96883 -101812 -101976 -102136 -100571 -99003 -97438 -95869 -98060 -100247 -99577 -98902 -99237 -99569
434 -99569 -97043 -94513 -96339 -98161 -99986 -101808 -101220 -100627 -97177 -93723 -96771 -99815 -100001 -100184 -103761 -107334 -106141 -104945
452 -104945 -105065 -105180 -105299 -105415 -106771 -108124 -109480 -110832 -110340 -109845 -109353 -108858 -108317 -107773 -104372 -100966 -97565 -94159 -93619 -93075
472 -93075 -92430 -91782 -91137 -90489 -93600 -96708 -99819 -102926 -102263 -101600 -100936 -100273 -98299 -96324 -101026 -105728 -107524 -109320 -108254
491 -108254 -107188 -107732 -108276 -108820 -109364 -106488 -103608 -105501 -107390 -106779 -106164 -105553 -104938 -104521 -104100 -106544 -108984 -107494 -106000 -104510
511 -104510 -103015 -101976 -100933 -97032 -93127 -91849 -90567 -92151 -93731 -92632 -91529 -90430 -89327 -92460 -95590 -98723 -101853
528 -101853 -103586 -105318 -107051 -108783 -106164 -103545 -100925 -98306 -95985 -93664 -94204 -94744 -96477 -98209 -96723 -95236 -99785 -98608
546 -98608 -100653 -102695 -100150 -97602 -97919 -98231 -100709 -103183 -104469 -100027 -96603 -98898 -100840 -97054 -95799 -94543 -95791 -97039
564 -97039 -97035 -97032 -93809 -96309 -97945 -99580 -101216 -102852 -104606 -100638 -99889 -99141 -99454 -99763 -100433 -101100 -93723 -92065 -95418 -98768
584 -98768 -103492 -102490 -104711 -106928 -105989 -105046 -98027 -96726 -94331 -91935 -92758 -93582 -92617 -91652 -90687 -89722 -92646 -95571 -98138
603 -98138 -100705 -105478 -104528 -103936 -103343 -103910 -104472 -105039 -105601 -100504 -95404 -95076 -94744 -97240 -99733 -99368 -98999 -100303 -101603 -100046
623 -100046 -98485 -100243 -102002 -100541 -99081 -105847 -106890 -104476 -102062 -100638 -99215 -100653 -102091 -101026 -99960 -99848 -105460
640 -105460 -109495 -103992 -99800 -95608 -92490 -95094 -97341 -99588 -98556 -97524 -103168 -108813 -108735 -108656 -108578 -108500 -107744 -106983 -106227 -105467
660 -105467 -102982 -100493 -100869 -106965 -111589 -106670 -104260 -107568 -107304 -107036 -107129 -107218 -108437 -109651 -107650 -105646 -107937 -104502 -101071
679 -101071 -103358 -105217 -107073 -106428 -105780 -105553 -105322 -105094 -104863 -103004 -101141 -99282 -97419 -97229 -97035 -96845 -96652 -98638 -100620 -102606
699 -102606 -104588 -101566 -98541 -98381 -98217 -95992 -93764 -94044 -94319 -100202 -100359 -97300 -99960 -99912 -94137 -91585 -94752 -98697 -102639
718 -102639 -104081 -105519 -102650 -99778 -96909 -94036 -94684 -95329 -98481 -101629 -105020 -102684 -100709 -98731 -101764 -104793 -107468 -110139
736 -110139 -110355 -104845 -102557 -100266 -98336 -96402 -99241 -102077 -102755 -103429 -101246 -99059 -98246 -97430 -96618 -95802 -94696 -93585 -95340
755 -95340 -97091 -94554 -92013 -94245 -96473 -99047 -101618 -104193 -106764 -107311 -107855 -103634 -99409 -99785 -100158 -100534 -100907 -102177 -103444
774 -103444 -104714 -105981 -103943 -101901 -96644 -97106 -98287 -99465 -97784 -101823 -100210 -98597 -97341 -96085 -96141 -96197 -99830 -97740
792 -97740 -94494 -96972 -95873 -94774 -98086 -101398 -99942 -98485 -99964 -101443 -101730 -96294 -91991 -93410 -94114 -94819 -95724 -96629 -97535
811 -97535 -98440 -99286 -100132 -98116 -96100 -100340 -104577 -105955 -107330 -105609 -103884 -102520 -101153 -98902 -102371 -105843 -103589 -100862
829 -100862 -98131 -97550 -96965 -98373 -94055 -90456 -96391 -97322 -98250 -96916 -95579 -95489 -95396 -94949 -100221 -99118 -98012 -97624 -97233 -93690
849 -93690 -95869 -99599 -103328 -104018 -104707 -105396 -106086 -106447 -106808 -107527 -108247 -103064 -103604 -107363 -105400 -100180 -100683 -97609 -94535 -93608
869 -93608 -92680 -97833 -97263 -97378 -97494 -97609 -97725 -96111 -100221 -104331 -102717 -102065 -101413 -100404 -99394 -101484 -103574 -102803 -102032 -104778
889 -104778 -107524 -107408 -107293 -105210 -103127 -101044 -98962 -100940 -102919 -100128 -97337 -99852 -102367 -104882 -107397 -106581 -105765 -104949
907 -104949 -104133 -103079 -102024 -103831 -105638 -103355 -101067 -101644 -102218 -98265 -94308 -97032 -99752 -96596 -93436 -95050 -96659 -102445
925 -102445 -108228 -111153 -114074 -108302 -102527 -101525 -100519 -103451 -106380 -106451 -106518 -104621 -102721 -103686 -104647 -102811 -100970 -103902 -106831
944 -106831 -104640 -102445 -100255 -98060 -100221 -102378 -104539 -106697 -106592 -106484 -106380 -106272 -105631 -104986 -104346 -103701 -102114 -100523 -101797
963 -101797 -103068 -103150 -103228 -103310 -103388 -104156 -104919 -100918 -96913 -99945 -102974 -101238 -99498 -96052 -92605 -89159 -85713 -88705 -91696 -97550
983 -97550 -103403 -104785 -106168 -107550 -108932 -106738 -104543 -102349 -100154 -101469 -102784 -101238 -99692 -99398 -99103 -103578 -108053 -106119
1001 -106119 -104185 -105113 -106041 -103511 -100981 -101313 -101644 -99264 -96883 -94144 -97129 -95761 -94394 -94934 -101197 -101678 -102159 -102997 -103835
1020 -103835 -105687 -107539 -106529 -105519 -102766 -100012 -102028 -104044 -106179 -108314 -107587 -106861 -104197 -101533 -101730 -101928 -101529 -101130
1038 -101130 -100732 -100333 -102933 -105534 -108135 -110735 -108627 -106518 -104409 -102300 -101771 -101242 -97851 -94461 -98284 -102106 -104379 -100929
1056 -100929 -99401 -97874 -98850 -99826 -99550 -99275 -105080 -105162 -103515 -101868 -99863 -97859 -96451 -95042 -92918 -96518 -99547 -96853
1074 -96853 -94517 -97904 -99979 -102054 -107706 -107635 -102199 -96764 -92520 -93999 -97863 -101726 -105352 -108977 -114815 -111115 -104554 -97993
1092 -97993 -96201 -100132 -100486 -100840 -101670 -96778 -92244 -97248 -102788 -102606 -100158 -103433 -105556 -107676 -103839 -99998 -98187 -102095
1110 -102095 -102788 -103477 -101398 -99316 -97237 -95154 -93790 -92423 -93921 -95415 -97360 -99305 -103753 -108202 -113127 -112330 -106168 -100005
1128 -100005 -97300 -94595 -93440 -98008 -102874 -107740 -108194 -108649 -107427 -106205 -104625 -103045 -106533 -104297 -102419 -100541 -99975 -99409
1146 -99409 -95981 -92553 -95564 -98574 -101585 -104595 -105370 -106141 -106559 -106972 -109595 -106492 -103392 -106011 -104849 -103682 -100016 -96346
1164 -96346 -95482 -94614 -93749 -92881 -94424 -95966 -97509 -99051 -98269 -97486 -96704 -95921 -94036 -92151 -95035 -97919 -101995 -106071 -105020
1183 -105020 -103969 -104759 -99826 -94893 -95683 -96473 -97263 -101987 -100989 -93000 -90735 -95027 -99319 -105221 -105400 -98902 -98127 -101160 -104189
1202 -104189 -104718 -105243 -105117 -104986 -104860 -104729 -103932 -103131 -99472 -95810 -93522 -91231 -91804 -92374 -96190 -100001 -102624 -99521 -96778
1221 -96778 -99755 -102021 -104282 -103209 -102132 -105471 -108805 -107136 -99740 -95210 -96398 -103172 -109942 -113973 -112278 -107248 -107937
1238 -107937 -107557 -107173 -106406 -99912 -97833 -101473 -104580 -101961 -100061 -98157 -100296 -102430 -104569 -106704 -107650 -108593 -109182 -109767 -110832
1257 -110832 -106171 -100560 -94945 -93448 -101484 -107259 -103492 -96320 -98682 -101167 -97926 -98444 -98958 -95899 -98559 -103280 -107997
1274 -107997 -108306 -108612 -106954 -105292 -100772 -96249 -95061 -93869 -91965 -95780 -102818 -104129 -106160 -108187 -101529 -94867 -92978
1291 -92978 -91085 -91521 -91953 -92389 -92822 -95512 -98198 -95758 -93317 -99465 -99886 -98757 -97628 -97620 -97609 -97598 -97587 -96685 -95780 -102863 -104223
1312 -104223 -103232 -102237 -102434 -108355 -110463 -112568 -113481 -108671 -106816 -104957 -102382 -105530 -107252 -108969 -108183 -107397 -101715 -96030
1330 -96030 -93448 -96585 -104554 -106797 -105944 -105087 -103131 -101171 -99215 -97255 -100068 -102878 -102829 -102777 -103250 -103720 -104193 -104662 -102036 -99405
1350 -99405 -96778 -94148 -94800 -95448 -98604 -101756 -103898 -100314 -99953 -99588 -98764 -97941 -100694 -97721 -98030 -104062 -107114 -100623 -98578
1369 -98578 -96533 -93891 -91246 -95400 -99554 -100847 -102136 -102155 -102173 -102192 -102207 -105385 -108563 -105065 -101562 -99629 -97695 -100530 -103362
1388 -103362 -102382 -101402 -100422 -99439 -99957 -100471 -100989 -101503 -100411 -99316 -101085 -102852 -103042 -103228 -103418 -103604 -105284 -106961 -105780 -104595
1408 -104595 -106656 -108712 -106004 -103291 -103056 -102818 -97814 -92807 -96283 -99755 -101801 -103843 -102073 -100299 -101391 -102479 -101492 -100501
1426 -100501 -98082 -95661 -95418 -95173 -97792 -100407 -104189 -107967 -106980 -105989 -103123 -100255 -102159 -104059 -103638 -103213 -104223 -105229
1444 -105229 -104420 -103608 -99938 -96264 -96067 -95866 -98530 -101190 -102363 -103533 -104707 -105877 -104286 -102695 -105873 -109051 -105255 -101458
1462 -101458 -106246 -111033 -111380 -111726 -109212 -106697 -105523 -104349 -106037 -107725 -105583 -103440 -102729 -102017 -101484 -100951 -98988 -97024
1480 -97024 -99278 -101533 -103787 -106041 -107013 -107986 -104189 -100392 -99435 -98474 -100378 -102278 -102870 -103459 -101190 -98917 -98079 -97237 -99260
1499 -99260 -101279 -101901 -102520 -104573 -106622 -104487 -102349 -100214 -98075 -96745 -95411 -94081 -92747 -93176 -93600 -94029 -94453 -94405 -94353 -97166
1519 -97166 -99975 -104573 -109171 -105542 -101913 -97211 -98231 -102114 -100273 -98850 -97427 -100415 -103403 -105378 -107352 -108969 -110586
1536 -110586 -109461 -102613 -103753 -104893 -102397 -99901 -97047 -99916 -104349 -108783 -104990 -101197 -102233 -103269 -104305 -105340 -107308
1553 -107308 -109271 -108377 -107479 -106525 -105568 -104614 -103656 -104446 -105232 -106022 -106808 -106972 -107132 -107296 -107457 -105646 -103831 -103451 -103068 -104983 -106894
1574 -106894 -104040 -101182 -104290 -107393 -105732 -104066 -106398 -108727 -104741 -100750 -100132 -105232 -106760 -108284 -110706 -107401 -104457
1591 -104457 -101510 -100117 -98720 -100545 -102367 -99424 -102199 -102475 -97024 -92687 -94070 -91521 -94692 -99536 -104375 -106119 -102136
1608 -102136 -100631 -99122 -102028 -104931 -104945 -104957 -106402 -107844 -107635 -107427 -104357 -101287 -99051 -96816 -92792 -94491 -93611 -92732 -93760
1627 -93760 -100512 -102166 -103820 -101063 -98306 -97598 -96890 -99044 -101197 -100579 -99960 -103992 -102300 -99327 -96354 -97792 -99230 -98254
1645 -98254 -97278 -96302 -95325 -96782 -98239 -102557 -106875 -106961 -107047 -107132 -107218 -105456 -103694 -101931 -100169 -103891 -107613 -106566 -105519 -104241
1665 -104241 -102963 -104547 -106130 -105985 -105840 -105694 -105549 -102647 -99744 -99703 -99662 -103913 -108165 -105739 -103314 -101261 -99208 -97155 -95102
1684 -95102 -96328 -97553 -101641 -105728 -100292 -94856 -94189 -93522 -94882 -96242 -94740 -93239 -90519 -87799 -89848 -91898 -93470 -95042
1702 -95042 -91845 -88649 -93038 -97427 -97047 -96667 -96704 -96741 -93917 -91093 -93295 -95493 -97695 -99893 -100307 -100717 -101130 -101540 -103295 -105046
1722 -105046 -100124 -95199 -95225 -95247 -95273 -95296 -96011 -96723 -97438 -98150 -99342 -100530 -98861 -97188 -96145 -95098 -102639 -110176 -109789 -109398
1742 -109398 -109010 -108619 -106205 -103787 -104234 -104677 -107390 -110098 -108042 -105981 -105817 -105650 -105486 -105318 -103843 -102363 -100888 -99409 -98604
1761 -98604 -97796 -99852 -101905 -96272 -90635 -95493 -100348 -99349 -98347 -94487 -90623 -93380 -96134 -98891 -101644 -97792 -93939 -94856
1779 -94856 -95772 -96808 -97844 -98880 -99916 -101875 -103835 -101026 -98217 -100355 -102494 -104990 -101764 -98433 -95102 -96182 -97263
1796 -97263 -98761 -100258 -101756 -103254 -102635 -102017 -104260 -106503 -103083 -99662 -95884 -97829 -102069 -106305 -111261 -110489 -107337 -104182
1814 -104182 -101030 -97874 -95437 -98720 -98787 -98850 -101242 -103630 -106022 -108410 -105385 -102356 -104100 -105840 -105616 -105389 -105165 -104938 -102270
1833 -102270 -99599 -96931 -94260 -96600 -98936 -101275 -103612 -103019 -102423 -101831 -101235 -101834 -102430 -103030 -103626 -101693 -99755 -97822 -95884
1852 -95884 -97885 -99882 -102240 -98872 -101931 -104986 -101011 -97032 -99256 -101477 -103701 -105922 -107147 -108369 -109238 -110102 -110314 -104800
1870 -104800 -99647 -94491 -95422 -96354 -97285 -98217 -100638 -103060 -106197 -103612 -96987 -96085 -98284 -100482 -100117 -99752 -99386 -99021 -99632
1889 -99632 -100243 -97993 -95743 -97069 -98395 -99364 -100333 -103060 -100065 -97427 -94789 -95847 -96905 -100825 -104744 -104744 -104744 -104744 -104744 -100512 -96279
1910 -96279 -100631 -104983 -106488 -107993 -104729 -101466 -104163 -106861 -102881 -98902 -100959 -103015 -100303 -97591 -96965 -96339 -95713 -95087
1928 -95087 -96980 -98872 -97904 -96935 -98112 -99290 -100467 -101644 -103373 -105098 -103966 -102829 -99789 -96745 -93705 -90661 -95489 -100314
1946 -100314 -98466 -96614 -94945 -93272 -91603 -89930 -93000 -96067 -99137 -102203 -103604 -105001 -101633 -98261 -97382 -96499 -98481
1963 -98481 -100460 -97673 -94882 -98772 -102658 -104286 -105910 -102770 -99625 -97974 -96320 -97531 -98738 -98131 -97520 -96913 -96302 -98973
1981 -98973 -101641 -99543 -97442 -94748 -92050 -96033 -100012 -98272 -96529 -94789 -93045 -93258 -93466 -93679 -93887 -95292 -96693 -98097
1999 -98097 -99498 -100467 -101432 -102401 -103366 -104275 -105180 -103228 -101272 -100631 -99986 -99346 -98701 -94901 -91097 -90158 -89215 -93008 -96797 -97729
2019 -97729 -98656 -98574 -98489 -101268 -104044 -102084 -100120 -98161 -96197 -92986 -89770 -93235 -96696 -98563 -100426 -97166 -93902 -97617
2037 -97617 -95605 -97173 -98738 -99413 -105806 -103977 -96421 -90418 -90135 -94863 -99588 -101015 -102438 -103865 -105288 -103973 -102654 -101339
2055 -101339 -100020 -100031 -100039 -93969 -93619 -92259 -90895 -94662 -98425 -96600 -94770 -95806 -96838 -96562 -96283 -95649 -95012 -99252 -97766
2074 -97766 -99502 -101235 -101719 -102199 -105903 -103880 -100743 -97602 -96968 -96331 -94148 -91961 -92639 -93313 -93544 -93772 -90426 -92799 -95355
2093 -95355 -92184 -92237 -98008 -101700 -105393 -103123 -100854 -100314 -105497 -110322 -115147 -111864 -108582 -105299 -102017 -103146 -104275 -101827
2111 -101827 -105102 -107516 -104208 -101615 -99021 -98515 -98008 -100363 -102717 -100780 -98843 -101316 -103790 -107039 -104565 -100541 -96518
2128 -96518 -97233 -97948 -98664 -99379 -99081 -98783 -98485 -98187 -99677 -101167 -102658 -104148 -100631 -97114 -96458 -95802 -98213 -100623 -98265 -95907
2148 -95907 -95277 -94647 -100694 -106741 -105873 -105005 -103779 -102553 -104249 -100221 -99413 -98604 -97423 -96238 -95057 -93872 -99845 -105814 -103202
2167 -103202 -100586 -98660 -96730 -97665 -98597 -101201 -103802 -99968 -101853 -108034 -108489 -104536 -106302 -102706 -99107 -98731 -98351 -93548
2185 -93548 -88742 -90616 -92486 -92453 -92415 -92740 -93060 -90333 -93328 -93105 -92881 -94625 -96369 -95251 -94133 -96011 -97889 -99767 -101644
2204 -101644 -102151 -102658 -98753 -94848 -95974 -102822 -105258 -101972 -99103 -101957 -101235 -100512 -101533 -102553 -103932 -99588 -99774 -99960
2222 -99960 -99789 -99617 -104074 -108526 -107855 -107181 -109491 -106074 -97892 -95430 -98142 -100851 -103921 -106987 -105050 -103109 -101171 -99230
2240 -99230 -97538 -95843 -95344 -100564 -101495 -96700 -92266 -93552 -95199 -96842 -94077 -91309 -95519 -99726 -101074 -102419 -105977 -109536
2258 -109536 -106775 -104014 -102624 -106957 -108071 -109185 -103444 -97702 -97088 -96473 -93056 -95363 -97311 -99260 -96730 -94200 -94532 -94863
2276 -94863 -98474 -102084 -102833 -103582 -101082 -98582 -96082 -93582 -94956 -96331 -97706 -99081 -99934 -100784 -101637 -102486 -99942 -97393 -99617
2295 -99617 -101838 -103526 -105210 -106898 -108582 -105918 -103250 -104998 -106741 -106991 -101514 -98544 -101294 -108697 -110374 -112770 -115162
2312 -115162 -112147 -109130 -108977 -108820 -105270 -101715 -101026 -100333 -100515 -100694 -100877 -101056 -99033 -97006 -99692 -105236 -106775 -102587 -98582
2331 -98582 -100296 -102729 -105158 -103179 -101197 -101432 -101663 -99930 -101056 -104927 -103071 -98179 -99006 -99599 -94465 -95772 -97076 -99636
2349 -99636 -102192 -99983 -97769 -98060 -98347 -98638 -98924 -99632 -100337 -101044 -101749 -101279 -100806 -100337 -99863 -101004 -102140 -100419 -98693 -98015
2369 -98015 -97334 -96655 -95974 -101555 -107132 -107945 -108753 -108627 -108496 -103600 -98701 -94699 -90694 -91462 -92225 -95087 -97948 -100631 -103314
2388 -103314 -107069 -107963 -107367 -101048 -99781 -104238 -104044 -100989 -102583 -107039 -104938 -102837 -98805 -94774 -97419 -100065 -99848 -99632
2406 -99632 -102278 -104923 -106331 -107740 -107598 -101734 -101711 -101689 -98448 -95206 -96302 -97393 -95623 -93854 -92505 -91152 -94569 -97986
2424 -97986 -98723 -99457 -100191 -100925 -102647 -104364 -107513 -110661 -105922 -101179 -100847 -100515 -102632 -99021 -97199 -95377 -97792 -100202 -99752
2443 -99752 -99301 -102073 -104841 -105821 -106801 -107818 -103109 -96853 -90594 -93846 -97095 -96771 -102166 -105121 -102349 -99580 -102531 -108586
2461 -108586 -108913 -107814 -100989 -95985 -96700 -93485 -95989 -94025 -92058 -90452 -88842 -91335 -93824 -97032 -94513 -91342 -93891
2478 -93891 -98947 -98276 -95418 -92561 -96380 -100195 -99722 -104972 -102233 -99491 -98302 -97114 -93421 -89725 -84841 -85679 -86160 -86637
2496 -86637 -85970 -85303 -87140 -88973 -94386 -94077 -94126 -94170 -93414 -92658 -94763 -96864 -95750 -94636 -96026 -97412 -99174 -95214 -97334
2515 -97334 -99454 -99755 -100057 -95590 -91123 -93854 -96585 -101104 -99901 -100426 -100951 -99688 -98425 -101104 -103783 -103600 -103418 -101417 -99416
2534 -99416 -97058 -100422 -102207 -103992 -99457 -94923 -93608 -92293 -93839 -95385 -93876 -92367 -94077 -95787 -94100 -98135 -100024
2551 -100024 -101913 -105024 -102412 -98369 -100050 -100866 -101682 -101425 -101167 -98720 -96268 -98231 -100191 -103705 -101492 -97732 -93969 -95635
2569 -95635 -97296 -100392 -103485 -97848 -92207 -93246 -94282 -96268 -98250 -95467 -92680 -96693 -100702 -101853 -103001 -99994 -96983
2586 -96983 -95288 -103127 -105724 -108317 -105191 -102062 -97050 -97762 -100024 -102285 -99658 -97032 -98816 -100601 -104383 -102442 -97639
2603 -97639 -98559 -103414 -108269 -108712 -109156 -104219 -99282 -99115 -98947 -98571 -98194 -93407 -88619 -87512 -92129 -94956 -97784 -98198 -98612
2622 -98612 -99025 -99439 -99584 -99729 -99875 -100020 -99927 -99834 -96879 -93924 -93265 -92605 -96715 -100825 -98496 -96167 -98608 -101048 -99126 -97199
2642 -97199 -100046 -102889 -106004 -109115 -105553 -101987 -102792 -103593 -105828 -108060 -107285 -106507 -108593 -110676 -110378 -110076 -110136 -104469 -98567
2661 -98567 -92661 -93079 -93492 -97322 -101149 -100210 -99267 -98626 -97982 -97341 -96696 -99711 -102721 -102874 -103023 -102460 -101894 -101331 -100765 -98220 -95672
2682 -95672 -97896 -100117 -101626 -103131 -104640 -106145 -105985 -105821 -102799 -99774 -97647 -95515 -94819 -94118 -92274 -90426 -90012 -89595 -91029
2701 -91029 -92460 -93895 -95325 -101022 -106719 -103831 -100944 -99904 -98865 -100687 -102509 -104018 -105527 -104174 -102822 -102483 -102144 -100374
2719 -100374 -98604 -97527 -96451 -96804 -97158 -100672 -104185 -101022 -97859 -96708 -95556 -99174 -102792 -99852 -96913 -96834 -96756 -96823 -96890
2738 -96890 -94096 -91301 -91547 -91793 -93470 -95146 -97062 -98977 -99461 -99945 -98224 -96503 -97643 -98783 -98179 -97572 -99830 -102084 -97516
2757 -97516 -92945 -93146 -93343 -95243 -97140 -97609 -98075 -96398 -94718 -94472 -94222 -95173 -96123 -99934 -103746 -103712 -103679 -98876 -94073 -92848
2777 -92848 -91622 -90396 -89170 -92535 -95899 -96402 -96905 -96085 -95262 -97304 -99342 -100966 -102587 -104211 -105832 -103418 -101000 -101447
2795 -101447 -101890 -103232 -104569 -101141 -97710 -100333 -102952 -102710 -102468 -101156 -99841 -99957 -100072 -99372 -98667 -99394 -100120 -98794 -97464
2814 -97464 -97565 -97665 -99327 -100985 -105504 -110024 -110106 -110184 -107401 -104618 -105117 -105612 -106108 -106603 -104241 -101875 -99509 -97144 -94923 -92702
2834 -92702 -97158 -101615 -104103 -106592 -104312 -102032 -97576 -93120 -93433 -93746 -96562 -99379 -99334 -99290 -99804 -100318 -97971 -95623 -95422
2853 -95422 -95221 -97881 -100541 -101846 -103150 -99685 -96220 -96927 -97635 -95482 -93328 -96372 -99413 -97684 -95955 -97330 -98701 -97211
2871 -97211 -95720 -92818 -89912 -89867 -89822 -92404 -94983 -94699 -94416 -92199 -89979 -90620 -91260 -93425 -95586 -92978 -90370 -91491 -92609
2890 -92609 -92296 -91983 -91763 -91540 -94178 -96816 -99517 -102218 -104919 -107621 -105612 -103604 -104457 -105311 -102170 -99029 -100657 -102285 -104271
2909 -104271 -106257 -103474 -100691 -98809 -96927 -97907 -98887 -96529 -94170 -94673 -95176 -94636 -94096 -96417 -98738 -99211 -99685 -100158 -100631
2928 -100631 -100217 -99804 -104159 -108515 -108042 -107568 -107095 -106622 -105091 -103559 -102028 -100497 -99383 -98269 -97155 -96041 -95031 -94021
2946 -94021 -99688 -105355 -109174 -112993 -108228 -103463 -103213 -102963 -105575 -108187 -106030 -103872 -101715 -99558 -98183 -96808 -95433 -94059
2964 -94059 -94353 -94647 -94942 -95236 -95202 -95169 -95135 -95102 -97572 -100042 -99651 -99260 -100568 -101875 -98414 -94953 -96439 -97926 -102274 -106622 -103787
2985 -103787 -100951 -98116 -95281 -97155 -99029 -98041 -97054 -99152 -101249 -100486 -99722 -99852 -99983 -97252 -94521 -93548 -92576 -91603 -90631
3004 -90631 -90970 -91309 -94509 -97710 -99442 -101175 -102907 -104640 -106194 -107747 -106439 -105132 -100486 -95840 -101685 -107531 -104316 -101100
3022 -101100 -100746 -100392 -101521 -102650 -100918 -99185 -99957 -100728 -101499 -102270 -100135 -98000 -95866 -93731 -94219 -94707 -95195 -95683 -96130 -96573
3042 -96573 -97021 -97464 -100772 -104077 -102617 -101153 -100407 -99658 -101775 -103887 -102308 -100724 -102006 -103284 -103604 -103925 -101384 -98839 -101603
3061 -101603 -104368 -105583 -101071 -99841 -98612 -97024 -95433 -94025 -92617 -97885 -103150 -101242 -99331 -100281 -101231 -99383 -97531
3078 -97531 -98541 -99550 -100802 -102050 -106518 -105262 -103176 -101085 -98638 -96190 -94696 -93202 -96477 -99752 -100344 -100936 -101529 -102121
3096 -102121 -102907 -103694 -104480 -105266 -103131 -100996 -95642 -96011 -98988 -101965 -99219 -102196 -102371 -102546 -103079 -103612 -104085 -104558 -101454 -104074
3116 -104074 -107408 -105020 -101439 -97859 -98436 -99014 -98876 -104457 -108731 -107282 -101421 -101279 -103049 -104819 -102177 -99532 -99811 -100091
3134 -100091 -100370 -100646 -102304 -103962 -103116 -102267 -100527 -104510 -104916 -105318 -107363 -103686 -100009 -102050 -103142 -104234 -105683 -107129
3152 -107129 -106965 -106801 -106637 -106469 -108392 -110314 -105560 -100802 -101995 -103187 -104379 -105568 -105150 -104733 -104316 -103895 -104185 -104476 -101190
3171 -101190 -103623 -107669 -105992 -105031 -104066 -102047 -100027 -102062 -98369 -92237 -99457 -104174 -99349 -98783 -98213 -97050 -95884 -95258
3189 -95258 -94629 -96864 -99096 -97680 -96261 -94845 -93425 -98567 -103705 -102170 -100631 -99983 -99331 -98682 -98030 -94461 -90888 -92088
3207 -92088 -93284 -91681 -90076 -91335 -92591 -97069 -101544 -101253 -100959 -98693 -96428 -97024 -97617 -98988 -100359 -96961 -93559 -94945
3225 -94945 -96331 -97717 -99100 -98936 -98772 -98608 -98440 -94182 -89923 -92341 -94755 -95385 -96015 -96644 -97270 -95903 -94535 -97937 -101335
3244 -101335 -99074 -96812 -97412 -98008 -95743 -93477 -95981 -98485 -101406 -104327 -107248 -110169 -108694 -107218 -102881 -98544 -99096 -99647
3262 -99647 -100199 -100750 -102840 -104931 -102252 -99573 -99398 -99223 -99047 -98872 -98727 -98582 -95575 -92568 -93138 -93708 -94278 -94848 -97382 -99916
3282 -99916 -99588 -99260 -100541 -101823 -103105 -104387 -103999 -103612 -103224 -102837 -102449 -102062 -101674 -101287 -102770 -104252 -105735 -107218 -104945 -102673
3302 -102673 -103261 -103850 -102546 -101242 -99938 -98634 -96316 -93999 -96451 -98902 -97661 -96421 -99949 -103477 -105098 -106719 -103571
3319 -103571 -100422 -103966 -107509 -102468 -97427 -99539 -101652 -103764 -105877 -105404 -104931 -104457 -103984 -103511 -103038 -102565 -102091 -100202 -98313
3338 -98313 -96424 -94535 -98727 -102919 -102341 -101764 -102550 -103332 -101257 -99178 -98295 -97408 -99386 -101361 -100016 -98667 -102091 -105512 -104763
3357 -104763 -104010 -103261 -102509 -102393 -102274 -102159 -102039 -97095 -92147 -95787 -99424 -98876 -98325 -97777 -97226 -100433 -103638 -103984 -104327 -100858
3377 -100858 -97389 -100597 -103805 -101350 -98895 -96439 -93984 -92393 -90802 -95888 -100974 -96104 -91234 -93041 -94848 -92766 -90683
3394 -90683 -91462 -92240 -94152 -96063 -97974 -99886 -98876 -97866 -99718 -101570 -97639 -93708 -94547 -95385 -96413 -97442 -101331 -105221
3412 -105221 -104223 -103224 -102226 -101227 -100795 -100363 -99215 -98068 -105683 -101853 -101600 -101346 -100817 -100288 -99759 -99230 -102397 -105564 -103962 -102360
3432 -102360 -100817 -99275 -97732 -96190 -96793 -97397 -100862 -104327 -104305 -104279 -104256 -104230 -101585 -98936 -99152 -99364 -99655 -99942 -100232 -100519 -103373
3453 -103373 -106223 -104308 -102390 -102762 -103131 -98734 -94334 -90892 -87445 -90679 -93910 -96070 -98228 -95620 -93008 -93321 -93630 -93943
3471 -93943 -94252 -95802 -97348 -96037 -94722 -97762 -100799 -99070 -97337 -104893 -112446 -109510 -106570 -106138 -105702 -105270 -104834 -104692 -104547
3490 -104547 -104405 -104260 -104357 -104450 -99778 -95102 -94617 -94129 -96506 -98880 -99767 -100650 -101536 -102419 -99740 -97058 -101056 -105050 -105828 -106603
3510 -106603 -102613 -98619 -99681 -100739 -101801 -102859 -101000 -99137 -97278 -95415 -95568 -95717 -95869 -96018 -94800 -93578 -92360 -91137
3528 -91137 -94450 -97758 -98209 -98656 -100776 -102892 -100243 -97591 -96536 -95478 -94424 -93366 -93384 -93399 -93418 -93433 -95523 -97609 -94930 -92248
3548 -92248 -92430 -92609 -92792 -92971 -91149 -89323 -90363 -91398 -93451 -95500 -94692 -93880 -96275 -98667 -98202 -97732 -96074 -94413 -93112
3567 -93112 -91808 -90988 -95892 -100795 -99975 -100765 -101555 -99126 -96696 -97337 -97978 -98619 -99260 -97099 -94938 -92062 -94908 -99789 -98947
3586 -98947 -98820 -98693 -96719 -94744 -95631 -96518 -98865 -101212 -103917 -106622 -100504 -100109 -101264 -102419 -100992 -99565 -101357 -97427
3604 -97427 -99517 -101607 -100120 -98634 -100396 -96436 -94979 -99245 -102557 -100147 -101313 -102479 -100478 -98477 -96477 -94476 -95098
3621 -95098 -95720 -96342 -96965 -94875 -92784 -90694 -88604 -95158 -101711 -103138 -104565 -107740 -105191 -102643 -105817 -105355 -104893 -107293
3639 -107293 -109692 -111987 -108559 -103582 -98604 -99409 -100214 -98157 -96100 -96465 -96831 -97196 -97561 -98045 -98530 -99014 -99498 -98105 -96711
3658 -96711 -100087 -103463 -104156 -104849 -105184 -105519 -105624 -100005 -97606 -95206 -93403 -91600 -93254 -100631 -102419 -104208 -103135 -102062
3676 -102062 -105698 -103612 -101883 -100154 -100750 -101346 -102300 -103254 -99439 -101346 -100035 -98723 -100094 -101466 -99975 -98485 -98306 -98127
3694 -98127 -97948 -97769 -100087 -102404 -100310 -98217 -92904 -93313 -95273 -97233 -97278 -97322 -97367 -97412 -98291 -99170 -100050 -100929 -97509 -94088 -93529
3715 -93529 -92971 -94856 -96741 -98984 -101227 -98358 -101212 -100847 -100482 -97136 -93790 -95214 -96637 -98313 -99990 -96898 -93805 -94051
3733 -94051 -94297 -91681 -98604 -103284 -102240 -100601 -98962 -96190 -99141 -101376 -103612 -105951 -102568 -99185 -101525 -101063 -100601 -97635
3751 -97635 -94670 -95758 -96845 -100795 -104744 -105057 -105370 -105683 -105996 -103254 -100512 -99319 -103850 -104267 -104685 -109036 -107665 -105012 -108083
3770 -108083 -110795 -107785 -106562 -105340 -108530 -111719 -108090 -104461 -103694 -102926 -101562 -100199 -98835 -97471 -97516 -97561 -97606 -97650 -97516 -97382
3790 -97382 -97248 -97114 -95709 -94301 -95400 -96495 -102363 -102505 -97285 -92062 -94167 -96268 -98373 -100474 -100970 -101462 -97188 -92911
3808 -92911 -91152 -89390 -92401 -95407 -97166 -98921 -100679 -102434 -96533 -90627 -93310 -95989 -97598 -99204 -100813 -102419 -101916
3825 -101916 -101413 -103772 -106130 -105210 -104290 -100508 -96726 -96819 -96913 -94144 -91376 -94092 -96808 -94755 -92702 -94312 -95921 -93120 -90318
3844 -90318 -88947 -93298 -97650 -96279 -96383 -96488 -96234 -95981 -94118 -92255 -93254 -94252 -95951 -97650 -99349 -101048 -99945 -98843 -100601
3863 -100601 -102360 -104968 -107576 -107323 -107069 -105325 -103582 -101838 -100094 -103090 -106086 -106220 -106354 -104998 -103641 -105147 -106652 -106697
3881 -106697 -106741 -105594 -98723 -96682 -100363 -100467 -100571 -97796 -95020 -96655 -98291 -101656 -99297 -100158 -101018 -101402 -101786 -102170 -102553
3900 -102553 -102520 -102486 -97684 -92881 -94293 -95705 -97117 -98530 -98809 -99088 -102229 -105370 -108749 -112129 -108831 -105534 -103548 -101562
3918 -101562 -102438 -103314 -100445 -97576 -97568 -97561 -99044 -100527 -102009 -103492 -103299 -103105 -100050 -96995 -97635 -98276 -95340 -98127 -104521 -105191
3938 -105191 -99543 -99617 -103984 -108351 -108068 -102062 -99282 -102226 -104811 -101674 -99252 -96831 -96913 -96995 -98910 -100821 -102736 -104647 -102688
$$ [...]
##END=	
