##TITLE=	xnl$VMmISK+qyrgLxKsX5w/7512s
##JCAMPDX=	6.0	$$ NMR Plug-in 1.13 of MestReNova 11.0.4-18998
##DATATYPE=	NMRSPECTRUM
##DATACLASS=	XYDATA
##NUMDIM=	1
##ORIGIN=	Bruker BioSpin GmbH
##OWNER=	andrew
##.OBSERVEFREQUENCY=	600.30184456100005264
##.OBSERVENUCLEUS=	^1H
##.SOLVENTNAME=	CD2Cl2
##.PULSESEQUENCE=	zg
##LONGDATE=	2015/06/05 11:50:12.000
##.ACQUISITIONMODE=	SIMULTANEOUS (DQD)
##$ORIGINALFORMAT=	Bruker XWIN-NMR
##$PARAMETERFILE=	(acqus, ASCII, /var/folders/f6/rjf_tdyn2v98c5c0wvkgn4s80000gn/T/xnl$VMmISK+qyrgLxKsX5w/7512s/acqus, 0)
$$ ##TITLE= Parameter file, TOPSPIN		Version 2.1
$$ ##JCAMPDX= 5.0
$$ ##DATATYPE= Parameter Values
$$ ##NPOINTS= 10	$$ modification sequence number
$$ ##ORIGIN= Bruker BioSpin GmbH
$$ ##OWNER= andrew
$$ $$ 2015-06-05 16:50:13.105 +0600  andrew@av-600
$$ $$ /opt/data/andrew/nmr/limog-1782/619/acqus
$$ $$ process /opt/ts21pl6/prog/mod/shimcntl
$$ ##$ACQT0= -9.54927425515661
$$ ##$AMP= (0..31)
$$ 100 100 100 100 100 100 100 100 100 100 100 100 100 100 100 100 100 100
$$ 100 100 100 100 100 100 100 100 100 100 100 100 100 100
$$ ##$ANAVPT= -1
$$ ##$AQSEQ= 0
$$ ##$AQ_mod= 3
$$ ##$AUNM= <au_zg>
$$ ##$AUTOPOS= <>
$$ ##$BF1= 600.3
$$ ##$BF2= 600.3
$$ ##$BF3= 600.3
$$ ##$BF4= 600.3
$$ ##$BF5= 600.3
$$ ##$BF6= 600.3
$$ ##$BF7= 600.3
$$ ##$BF8= 600.3
$$ ##$BYTORDA= 0
$$ ##$CFDGTYP= 0
$$ ##$CFRGTYP= 9
$$ ##$CHEMSTR= <none>
$$ ##$CNST= (0..63)
$$ 1 1 145 1 1 1 1 1 1 1 1 1 1 1 1 1 1 1 1 1 1 1 1 1 1 1 1 1 1 1 1 1 1 1 1
$$ 1 1 1 1 1 1 1 1 1 1 1 1 1 1 1 1 1 1 1 1 1 1 1 1 1 1 1 1 1
$$ ##$CPDPRG= <>
$$ ##$CPDPRG1= <>
$$ ##$CPDPRG2= <waltz16>
$$ ##$CPDPRG3= <>
$$ ##$CPDPRG4= <mlev>
$$ ##$CPDPRG5= <mlev>
$$ ##$CPDPRG6= <mlev>
$$ ##$CPDPRG7= <mlev>
$$ ##$CPDPRG8= <mlev>
$$ ##$CPDPRGB= <>
$$ ##$CPDPRGT= <>
$$ ##$D= (0..63)
$$ 0 1 0 0 0 0 0 0 0 0.06 0 0.03 0 0 0 0 1e-04 0 0 0 0 0 0 0 0 0 0 0 0 0 0
$$ 0 0 0 0 0 0 0 0 0 0 0 0 0 0 0 0 0 0 0 0 0 0 0 0 0 0 0 0 0 0 0 0 0
$$ ##$DATE= 1433501412
$$ ##$DBL= (0..7)
$$ 120 120 120 120 120 120 120 120
$$ ##$DBP= (0..7)
$$ 150 150 150 150 150 150 150 150
$$ ##$DBP07= 0
$$ ##$DBPNAM0= <>
$$ ##$DBPNAM1= <>
$$ ##$DBPNAM2= <>
$$ ##$DBPNAM3= <>
$$ ##$DBPNAM4= <>
$$ ##$DBPNAM5= <>
$$ ##$DBPNAM6= <>
$$ ##$DBPNAM7= <>
$$ ##$DBPOAL= (0..7)
$$ 0.5 0.5 0.5 0.5 0.5 0.5 0.5 0.5
$$ ##$DBPOFFS= (0..7)
$$ 0 0 0 0 0 0 0 0
$$ ##$DE= 6.5
$$ ##$DECBNUC= <off>
$$ ##$DECIM= 2218.66666666667
$$ ##$DECNUC= <off>
$$ ##$DECSTAT= 4
$$ ##$DIGMOD= 1
$$ ##$DIGTYP= 12
$$ ##$DL= (0..7)
$$ 0 120 120 120 120 120 120 120
$$ ##$DP= (0..7)
$$ 150 150 150 150 150 150 150 150
$$ ##$DP07= 0
$$ ##$DPNAME0= <>
$$ ##$DPNAME1= <>
$$ ##$DPNAME2= <>
$$ ##$DPNAME3= <>
$$ ##$DPNAME4= <>
$$ ##$DPNAME5= <>
$$ ##$DPNAME6= <>
$$ ##$DPNAME7= <>
$$ ##$DPOAL= (0..7)
$$ 0.5 0.5 0.5 0.5 0.5 0.5 0.5 0.5
$$ ##$DPOFFS= (0..7)
$$ 0 0 0 0 0 0 0 0
$$ ##$DQDMODE= 0
$$ ##$DR= 22
$$ ##$DS= 0
$$ ##$DSLIST= <SSSSSSSSSSSSSSS>
$$ ##$DSPFIRM= 0
$$ ##$DSPFVS= 20
$$ ##$DTYPA= 0
$$ ##$EXP= <>
$$ ##$F1LIST= <111111111111111>
$$ ##$F2LIST= <222222222222222>
$$ [...]
$$ -1 -1 -1 -1 -1 -1 -1 -1 -1 -1 -1 -1 -1 -1 -1 -1 -1 -1 -1 -1 -1 -1 -1 -1
$$ -1 -1 -1 -1 -1 -1 -1 -1 -1 -1 -1 -1 -1 -1 -1 -1 -1 -1 -1 -1 -1 -1 -1 -1
$$ -1 -1 -1 -1 -1 -1 -1 -1 -1 -1 -1 -1 -1 -1 -1 -1 -1 -1 -1 -1 -1 -1 -1 -1
$$ -1 -1 -1 -1 -1 -1 -1 -1 -1 -1 -1 -1 -1 -1 -1 -1 -1 -1 -1 -1 -1 -1 -1 -1
$$ -1 -1 -1 -1 -1 -1 -1 -1 -1 -1 -1 -1 -1 -1 -1 -1
$$ ##$RG_tab8= (0..255)
$$ -1 -1 -1 -1 -1 -1 -1 -1 -1 -1 -1 -1 -1 -1 -1 -1 -1 -1 -1 -1 -1 -1 -1 -1
$$ -1 -1 -1 -1 -1 -1 -1 -1 -1 -1 -1 -1 -1 -1 -1 -1 -1 -1 -1 -1 -1 -1 -1 -1
$$ -1 -1 -1 -1 -1 -1 -1 -1 -1 -1 -1 -1 -1 -1 -1 -1 -1 -1 -1 -1 -1 -1 -1 -1
$$ -1 -1 -1 -1 -1 -1 -1 -1 -1 -1 -1 -1 -1 -1 -1 -1 -1 -1 -1 -1 -1 -1 -1 -1
$$ -1 -1 -1 -1 -1 -1 -1 -1 -1 -1 -1 -1 -1 -1 -1 -1 -1 -1 -1 -1 -1 -1 -1 -1
$$ -1 -1 -1 -1 -1 -1 -1 -1 -1 -1 -1 -1 -1 -1 -1 -1 -1 -1 -1 -1 -1 -1 -1 -1
$$ -1 -1 -1 -1 -1 -1 -1 -1 -1 -1 -1 -1 -1 -1 -1 -1 -1 -1 -1 -1 -1 -1 -1 -1
$$ -1 -1 -1 -1 -1 -1 -1 -1 -1 -1 -1 -1 -1 -1 -1 -1 -1 -1 -1 -1 -1 -1 -1 -1
$$ -1 -1 -1 -1 -1 -1 -1 -1 -1 -1 -1 -1 -1 -1 -1 -1 -1 -1 -1 -1 -1 -1 -1 -1
$$ -1 -1 -1 -1 -1 -1 -1 -1 -1 -1 -1 -1 -1 -1 -1 -1 -1 -1 -1 -1 -1 -1 -1 -1
$$ -1 -1 -1 -1 -1 -1 -1 -1 -1 -1 -1 -1 -1 -1 -1 -1
$$ ##$RG_tabA= (0..255)
$$ 0.25 0.28 0.32 0.35 0.4 0.44 0.5 0.56 0.64 0.7 0.8 0.89 1 1.12 1.28 1.4
$$ 1.6 1.78 2 2.25 2.56 2.8 3.2 3.56 4 4.5 5 5.6 6.35 7.12 8 9 10 11.3 12.7
$$ 14.2 16 18 20.2 22.6 25.4 28.5 32 36 40.3 45.2 50.8 57 64 71.8 80.6 90.5
$$ 101 114 128 144 161 181 203 -1 -1 -1 -1 -1 -1 -1 -1 -1 -1 -1 -1 -1 -1 -1
$$ -1 -1 -1 -1 -1 -1 -1 -1 -1 -1 -1 -1 -1 -1 -1 -1 -1 -1 -1 -1 -1 -1 -1 -1
$$ -1 -1 -1 -1 -1 -1 -1 -1 -1 -1 -1 -1 -1 -1 -1 -1 -1 -1 -1 -1 -1 -1 -1 -1
$$ -1 -1 -1 -1 -1 -1 -1 -1 -1 -1 -1 -1 -1 -1 -1 -1 -1 -1 -1 -1 -1 -1 -1 -1
$$ -1 -1 -1 -1 -1 -1 -1 -1 -1 -1 -1 -1 -1 -1 -1 -1 -1 -1 -1 -1 -1 -1 -1 -1
$$ -1 -1 -1 -1 -1 -1 -1 -1 -1 -1 -1 -1 -1 -1 -1 -1 -1 -1 -1 -1 -1 -1 -1 -1
$$ -1 -1 -1 -1 -1 -1 -1 -1 -1 -1 -1 -1 -1 -1 -1 -1 -1 -1 -1 -1 -1 -1 -1 -1
$$ -1 -1 -1 -1 -1 -1 -1 -1 -1 -1 -1 -1 -1 -1 -1 -1 -1 -1 -1 -1 -1 -1 -1 -1
$$ -1 -1 -1 -1 -1 -1 -1 -1 -1 -1 -1 -1 -1 -1
$$ ##$ROUT14= (0..7)
$$ 0 0 0 0 0 0 0 0
$$ ##$ROUTER= -1
$$ ##$RX22TY= <no>
$$ ##$RXFMAX= (0..7)
$$ 647.5 -1 -1 -1 -1 -1 -1 -1
$$ ##$RXFMIN= (0..7)
$$ 5 -1 -1 -1 -1 -1 -1 -1
$$ ##$RXINTLV= (0..7)
$$ 1 0 0 0 0 0 0 0
$$ ##$RXMSTY= <no>
$$ ##$SCMTY= <no>
$$ ##$SGUC1= (0..15)
$$ 17 18 34 0 0 0 0 0 0 0 0 0 0 0 0 0
$$ ##$SGUC2= (0..15)
$$ 33 256 20 0 0 0 0 0 0 0 0 0 0 0 0 0
$$ ##$SPECTR= 10
$$ ##$SY2FLAG= 0
$$ ##$TFXNUM= 0
$$ ##$TRIPLO2= 0
$$ ##$VTUTY= <tty05>
$$ ##$WBREFAM= (0..15)
$$ 100 100 100 100 100 100 100 100 100 100 100 100 100 100 100 100
$$ ##$WBREFPH= (0..15)
$$ 0 0 0 0 0 0 0 0 0 0 0 0 0 0 0 0
$$ ##$XFAC= 2
$$ ##END=
$$ 
##$DECIM=	2218.66666666667
##$DSPFVS=	20
##XUNITS=	HZ
##YUNITS=	ARBITRARY UNITS
##FIRSTX=	6322.8525384689401108
##LASTX=	-2691.4329892738592207
##XFACTOR=	-0.1375491802509010153
##YFACTOR=	6.9629775390625000438e-06
##NPOINTS=	65536
##XYDATA=	(X++(Y..Y))
$$ [...]
-11961h0598l962l963J227J226J226J227n215n215L374L373J845J849J845J849J905J908j375
$$ -80598 -84560 -88523 -87296 -86070 -84844 -83617 -88832 -94047 -90673 -87300 -85455 -83606 -81761 -79912 -78007 -76099 -77474
-11944g7474p098m476j611p19p16J76J78K144p16l627K103J502M368L113k609k077k072J651
$$ -77474 -84572 -89048 -90659 -91378 -92094 -91918 -91740 -89596 -90312 -93939 -91836 -90334 -85966 -82853 -85462 -87539 -89611 -87960
-11926h7960J655J651J655j8j5j9j5k027k024Q35Q38J551J554j312j308Q05Q09Q05Q09m48
$$ -87960 -86305 -84654 -82999 -83017 -83032 -83051 -83066 -85093 -87117 -86282 -85444 -83893 -82339 -83651 -84959 -84154 -83345 -82540 -81731 -82179
-11906h2179m43K68n453l403K322L515L515j435j435j435j435k479k479L84L84R21R20R21
$$ -82179 -82622 -82354 -87807 -91210 -88888 -85373 -81858 -83293 -84728 -86163 -87598 -90077 -92556 -92172 -91788 -90867 -89947 -89026
-11888h9026R21j741j741n319M06O132M07M700j025p198j472J629J629J151J152J152J152
$$ -89026 -88105 -89846 -91587 -96906 -96500 -90368 -89961 -85261 -86286 -93484 -94956 -93327 -91698 -90547 -89395 -88243 -87091
-11871h7091k84k79K937k784j536j532K878K881k237k232k237k233K09K13K08K13L09L10k912
$$ -87091 -87375 -87654 -84717 -87501 -89037 -90569 -87691 -84810 -87047 -89279 -91516 -93749 -93540 -93327 -93119 -92906 -92597 -92287 -95199
-11852i5199K815L351L351k971k971K35K35N92N93k151L575L575k151n330n331K900K900L36
$$ -95199 -92384 -89033 -85682 -88653 -91624 -91389 -91154 -90562 -89969 -92120 -88545 -84970 -87121 -92451 -97782 -94882 -91982 -91646
-11834i1646L35L198L199J408J409j453j454k945k944q2q2N48N48L768j957M29M28P1P1k046
$$ -91646 -91311 -88113 -84914 -83506 -82097 -83550 -85004 -87949 -90893 -90975 -91057 -90509 -89961 -86193 -88150 -87721 -87293 -87222 -87151 -89197
-11814h9197k047Q17Q16K486K486l76l77L06L06L05L06Q42Q43Q42Q43k841k840k840k841K468
$$ -89197 -91244 -90427 -89611 -87125 -84639 -85015 -85392 -85086 -84780 -84475 -84169 -83327 -82484 -81642 -80799 -83640 -86480 -89320 -92161 -89693
-11794h9693K467k303k304J946J950J945J950J647J652J647J651k005k002k005k002L21L24
$$ -89693 -87226 -89529 -91833 -89887 -87937 -85992 -84042 -82395 -80743 -79096 -77445 -79450 -81452 -83457 -85459 -85138 -84814
-11777h4814L21L24q20q16K042K047J446J450J088J093J729l992o859j129L638L642p76p71
$$ -84814 -84493 -84169 -84989 -85805 -83763 -81716 -80270 -78820 -77732 -76639 -74910 -78902 -85761 -86890 -83252 -79610 -80386 -81157
-11759h1157J051J055J051J055N74N78K16K20K900k822k468k463j216j211j215j212R32R36
$$ -81157 -80106 -79051 -78000 -76945 -76371 -75793 -75577 -75357 -72457 -75279 -77747 -80210 -81426 -82637 -83852 -85064 -84132 -83196
-11741h3196R32R35R7J01l124K606k46k43J12J16Q27Q32Q27Q31L13L17L13L17m398m395j536
$$ -83196 -82264 -81329 -81232 -81131 -84255 -81649 -81895 -82138 -82026 -81910 -81083 -80251 -79424 -78593 -78280 -77963 -77650 -77333 -81731 -86126 -87662
-11720h7662j532J864J868N084o38j655j651Q50Q54j454j450L317L322n60n55n59n55o19o15
$$ -87662 -89194 -87330 -85462 -80378 -81016 -82671 -84322 -83472 -82618 -84072 -85522 -82205 -78883 -79443 -79998 -80557 -81112 -81731 -82346
-11701h2346l482l477R31R36R32R35k974k975l332K393L705L705J201J200q28q27q28q27J796
$$ -82346 -85828 -89305 -88374 -87438 -86506 -85571 -88545 -91520 -94852 -92459 -88754 -85049 -83848 -82648 -83476 -84303 -85131 -85958 -84162
-11682h4162J797j424M302K050K050m55m55k900k900k899k900l51l50l571K154N45N44j961
$$ -84162 -82365 -83789 -79487 -77437 -75387 -75842 -76297 -79197 -82097 -84996 -87896 -88247 -88597 -92168 -90014 -89469 -88925 -90886
-11664i0886j961K248K248K247K248r13r13J949J950J040J040j823j823r28r28r28r29j651
$$ -90886 -92847 -90599 -88351 -86104 -83856 -84769 -85682 -83733 -81783 -80743 -79703 -81526 -83349 -84277 -85205 -86133 -87062 -88713
-11646h8713j651L120L120r95r96N56O280J137J137l276l277l873l872K806K807l090l090
$$ -88713 -90364 -87244 -84124 -85119 -86115 -85559 -79279 -78142 -77005 -80281 -83558 -87431 -91303 -88497 -85690 -88780 -91870
-11629i1870k27k28M007M007K815k912k240L485r3r3j226j227q68q69m06N319K099K098k553
$$ -91870 -92097 -92325 -88318 -84311 -81496 -84408 -86648 -83163 -83256 -83349 -84575 -85802 -86670 -87539 -87945 -82626 -80527 -78429 -80982
-11610h0982k553L09L09q23q24K039K039l329l329l686K039l303l302L735L735K959K960K960
$$ -80982 -83535 -83226 -82917 -83740 -84564 -82525 -80486 -83815 -87144 -90830 -88791 -92094 -95396 -91661 -87926 -84967 -82007 -79047
-11592g9047K959K602K602k170k169k289k288k289k289k05k01l068l064J167J170J167J171
$$ -79047 -76088 -73486 -70884 -73054 -75223 -77512 -79800 -82089 -84378 -84583 -84784 -87852 -90916 -89749 -88579 -87412 -86241
-11575h6241M21M25M21M25j16j12k978k974J263J264J263J264P1P1P1P0K800K799j972j972
$$ -86241 -85820 -85395 -84974 -84549 -84665 -84777 -87755 -90729 -89466 -88202 -86939 -85675 -85604 -85533 -85462 -85392 -82592 -79793 -81765 -83737
-11555h3737J965J964K322l403p12p08p12p08m827R02K091K095M387j334r81r76O30O33k948
$$ -83737 -81772 -79808 -77486 -80889 -81601 -82309 -83021 -83729 -88556 -87654 -85563 -83468 -79081 -80415 -81396 -82372 -81742 -81109 -84057
-11536h4057K781M301j420n834j08K218K218N796P1l95l91m328J398J278m447J995J994R39
$$ -84057 -81276 -76975 -78395 -84229 -84337 -82119 -79901 -74105 -74034 -74429 -74820 -79148 -77750 -76472 -80919 -78924 -76930 -75991
-11518g5991R43j920j919M06M06M9M8J327m394m037m037j234j234J629J629M544M547k135
$$ -75991 -75048 -76968 -78887 -78481 -78075 -78026 -77978 -76651 -81045 -85082 -89119 -90353 -91587 -89958 -88329 -83785 -79238 -81373
-11500h1373k133j778j774j778j774J1J5L69L73l269K460K098K103J189J193M409j312p19
$$ -81373 -83506 -85284 -87058 -88836 -90610 -90599 -90584 -90215 -89842 -93111 -90651 -88553 -86450 -85261 -84068 -79659 -80971 -81690
-11482h1690p16j077j074m119m115k568L161K084K087K442K445l429l426J342J345r24r21
$$ -81690 -82406 -83483 -84557 -88676 -92791 -95359 -92198 -90114 -88027 -85585 -83140 -86569 -89995 -88653 -87308 -88232 -89153
-11465h9153L851L850p45p42p45p42j163j159j160j159j118j115j118j114P30P34J093J092
$$ -89153 -85302 -81452 -82197 -82939 -83684 -84426 -85589 -86748 -87908 -89067 -90185 -91300 -92418 -93532 -92802 -92068 -90975 -89883
-11447h9883k192L537L176L180M786M790l799l798l377l377n15n14R17R17j946j945K870K870
$$ -89883 -92075 -88538 -85362 -82182 -77396 -72606 -76405 -80203 -83580 -86957 -87472 -87986 -87069 -86152 -88098 -90043 -87173 -84303
-11429h4303L65L65J87N912j72j71%%%%n428n427J253J252j178j178J685J685J387J386j476
$$ -84303 -83938 -83573 -83386 -77474 -77646 -77817 -77817 -77817 -77817 -77817 -83245 -88672 -87419 -86167 -87345 -88523 -86838 -85153 -83766 -82380 -83856
-11408h3856j476K378K382K378K382r02q98r02q99J663J666J662J667qmpmk885k881k885k882
$$ -83856 -85332 -82954 -80572 -78194 -75812 -76714 -77612 -78514 -79413 -77750 -76084 -74422 -72755 -72763 -72767 -72774 -72778 -75663 -78544 -81429 -84311
-11387h4311R32R36n152N78p23p19K497K501j86j83j86j83K483K486l80l77Q72Q76M093j629
$$ -84311 -83379 -82443 -87595 -87017 -87740 -88459 -85962 -83461 -83647 -83830 -84016 -84199 -81716 -79230 -79610 -79987 -79115 -78239 -74146 -75775
-11367g5775k840k837l198l194Q2Q5Q2Q6M633M637L083k639J234J237J234m488k911k907J502
$$ -75775 -78615 -81452 -84650 -87844 -87762 -87677 -87595 -87509 -82876 -78239 -75156 -77795 -76561 -75324 -74090 -78578 -81489 -84396 -82894
-11348h2894J506j122j119J741J745l239l236l76l73L381L384N18N22k195k192j838j834p04
$$ -82894 -81388 -82510 -83629 -81888 -80143 -83382 -86618 -86994 -87367 -83986 -80602 -80084 -79562 -81757 -83949 -85787 -87621 -88325
-11330h8325N024J801J804J34J38k24k19L891j830j118j115m667J063J058m663k53k50K609
$$ -88325 -83301 -81500 -79696 -79562 -79424 -79648 -79867 -75976 -77806 -78924 -80039 -84706 -83643 -82585 -87248 -87501 -87751 -85142
-11312h5142l112k863k863%%k98N427N070N069n591n591k729k728M965M965J93J94L95L95
$$ -85142 -88254 -91117 -93980 -93980 -93980 -94278 -88851 -83781 -78712 -84303 -89894 -92623 -95351 -90386 -85421 -85228 -85034 -84639 -84244
-11293h4244k825K900R92R91j513j514J245J245J245J245o04o03o04o04j797j796j797j797
$$ -84244 -87069 -84169 -83177 -82186 -83699 -85213 -83968 -82723 -81478 -80233 -80837 -81440 -82044 -82648 -84445 -86241 -88038 -89835
-11275h9835j26j27j27j27J991J990J991J990l35l36l35l36l28l28l190l191Q9R0Q9R0L28
$$ -89835 -89961 -90088 -90215 -90342 -88351 -86361 -84370 -82380 -82715 -83051 -83386 -83722 -84050 -84378 -87568 -90759 -90670 -90580 -90491 -90401 -90073
-11254i0073L28L28L28L012L011l071K654j387j386j029j029l295l295L384L385K072K073
$$ -90073 -89745 -89417 -89089 -86077 -83066 -86137 -83483 -84870 -86256 -87285 -88314 -91609 -94904 -91520 -88135 -86063 -83990
-11237h3990K072K073k520k520k519k520J327J327J327J327l504l504J267J268m77m77m78
$$ -83990 -81918 -79845 -82365 -84885 -87404 -89924 -88597 -87270 -85943 -84616 -88120 -91624 -90357 -89089 -89566 -90043 -90521
-11220i0521m77l58l57l58l58L094L094K31K31j916j916N89N89Q12m912j693j692M570M570
$$ -90521 -90998 -91356 -91713 -92071 -92429 -89335 -86241 -86010 -85779 -87695 -89611 -89022 -88433 -87621 -92533 -94226 -95918 -91348 -86778
-11201h6778k02k01k076k076P86P87P1P0P1P1J1J1J2J1J860J860o132m06M21M21P79P79k322
$$ -86778 -86980 -87181 -89257 -91333 -90547 -89760 -89689 -89619 -89548 -89477 -89466 -89455 -89443 -89432 -87572 -85712 -91844 -92250 -91829 -91408 -90629 -89850 -92172
-11178i2172k322Q98m827j920j919N85N85J599J599J600J599Q05Q05Q05Q05q05q05K057K058
$$ -92172 -94494 -93596 -98423 -100343 -102262 -101677 -101092 -99493 -97894 -96294 -94695 -93890 -93085 -92280 -91475 -92280 -93085 -91028 -88970
-11159h8970J029J029J028J029J446J447j417j416J424J424j439j439N2N2K915K915j737j737
$$ -88970 -87941 -86912 -85884 -84855 -83409 -81962 -83379 -84795 -83371 -81947 -83386 -84825 -84773 -84721 -81806 -78891 -80628 -82365
-11141h2365j737j737j021j022j021j021L35L36k528k527k01k01k02k01J886J886J886J887
$$ -82365 -84102 -85839 -86860 -87882 -88903 -89924 -89589 -89253 -91781 -94308 -94509 -94710 -94912 -95113 -93227 -91341 -89455 -87568
-11123h7568j991j990K780K781J159J159J160J159L127L128j644j644j182j181J681J681k017
$$ -87568 -89559 -91549 -88769 -85988 -84829 -83670 -82510 -81351 -78224 -75096 -76740 -78384 -79566 -80747 -79066 -77385 -79402
-11106g9402k016Q46Q46k79k80l142l142L16L17L17L17q6q6q5q6j756j755j756j756j1pj1
$$ -79402 -81418 -80572 -79726 -80005 -80285 -83427 -86569 -86253 -85936 -85619 -85302 -85388 -85474 -85559 -85645 -87401 -89156 -90912 -92668 -92679 -92686 -92697
-11084i2697qM06M10N178N181j696j692j696j692P49P53P49P53k80k76k79k76J510J513j353
$$ -92697 -92705 -92299 -91889 -86711 -81530 -83226 -84918 -86614 -88306 -87557 -86804 -86055 -85302 -85582 -85858 -86137 -86413 -84903 -83390 -84743
-11064h4743j349n93n89K270K274N40N45m231m227R43R47R43R47J08J11k754k751MPMPL881
$$ -84743 -86092 -86685 -87274 -85004 -82730 -82190 -81645 -85876 -90103 -89160 -88213 -87270 -86323 -86215 -86104 -88858 -91609 -91605 -91598 -91594 -91587 -87706
-11042h7706L884J017J022k338k333K434K438p27p23p27p23J152J155l619l616J092J096j770
$$ -87706 -83822 -82805 -81783 -84121 -86454 -84020 -81582 -82309 -83032 -83759 -84482 -83330 -82175 -85794 -89410 -88318 -87222 -88992
-11024h8992j767l750l746K930K933L65L69L66L69K76K79k587O960M808r13L7M1j916j912
$$ -88992 -90759 -94509 -98255 -95325 -92392 -92027 -91658 -91292 -90923 -90647 -90368 -92955 -85995 -81187 -82100 -82063 -82022 -83938 -85850
-11005h5850j916j912m600m596K080K084K333K337j125o848O04O08L108L113R73R76R73R77
$$ -85850 -87766 -89678 -94278 -98874 -96794 -94710 -92377 -90040 -91165 -98013 -97409 -96801 -93693 -90580 -89607 -88631 -87658 -86681
-10987h6681l500l497J271J275r50r47J912J916M656M659j16j12l015l012j53j49k598k594
$$ -86681 -90181 -93678 -92407 -91132 -92082 -93029 -91117 -89201 -84545 -79886 -80002 -80114 -83129 -86141 -86294 -86443 -89041 -91635
-10969i1635k598k595O468O471J457m264l195K535j047j044J752J752j111j111L243L243J692
$$ -91635 -94233 -96828 -90360 -83889 -82432 -86696 -89891 -87356 -88403 -89447 -87695 -85943 -87054 -88165 -84922 -81679 -79987
-10952g9987m033l466l467K259K259N539m004m719J007K013K013K728K729m309J416M279j446
$$ -79987 -84020 -87486 -90953 -88694 -86435 -80896 -84900 -89619 -88612 -86599 -84586 -81858 -79129 -83438 -82022 -77743 -79189
-10935g9189j879j878o054l28M205n338k833K893L153L157j617j614J841l880o64o60K91K95
$$ -79189 -81068 -82946 -89000 -89328 -85123 -90461 -93294 -90401 -87248 -84091 -85708 -87322 -85481 -89361 -90025 -90685 -90394 -90099
-10917i0099O374O52q43q38j200j197J230J234J230J234j573j570J648J651j364M365M361
$$ -90099 -83725 -83073 -83916 -84754 -85954 -87151 -85921 -84687 -83457 -82223 -83796 -85366 -83718 -82067 -83431 -79066 -74705
-10900g4705j360j484j480j841j838m40m36K423K427n748n744R32R35K334K337n29n26j305
$$ -74705 -76065 -77549 -79029 -80870 -82708 -83148 -83584 -81161 -78734 -84482 -90226 -89294 -88359 -86025 -83688 -84217 -84743 -86048
-10882h6048j301J559J561m25m21m25m21K080K084p83p79Q72Q76Q72Q76l20l17k826k821j868
$$ -86048 -87349 -85790 -84229 -84654 -85075 -85500 -85921 -83841 -81757 -82540 -83319 -82447 -81571 -80699 -79823 -80143 -80460 -83286 -86107 -87975
-10862h7975L862O41O41Q16Q21Q20Q20J75J79J79J79J75J79o143o143m999P31K281K281J204
$$ -87975 -84113 -83472 -82831 -82015 -81194 -80374 -79554 -79379 -79200 -79021 -78842 -78667 -78488 -84631 -90774 -95773 -95042 -92761 -90480 -89276
-10842h9276J208J208J207O08O11O12O11k87k83k84k83j893j890K877K882l683l679J088J092
$$ -89276 -88068 -86860 -85653 -85045 -84434 -83822 -83211 -83498 -83781 -84065 -84348 -86241 -88131 -85254 -82372 -86055 -89734 -88646 -87554
-10823h7554L73L77J5J8J864l858o41o37K12K16K13K16j040j036K180l541K300K304r21r17
$$ -87554 -87181 -86804 -86789 -86771 -84907 -88765 -89406 -90043 -89831 -89615 -89402 -89186 -90226 -91262 -89082 -92623 -90323 -88019 -88940 -89857
-10803h9857o82o79o82o78o7o4k568k568l646K084j137j137M287M290J428J427r61r58r58
$$ -89857 -90539 -91218 -91900 -92578 -92645 -92709 -95277 -97845 -101491 -99407 -100544 -101681 -97394 -93104 -91676 -90249 -91210 -92168 -93126
-10784i3126r58M484M488k192k192n25n22n22n22L053L057l266l265j420M309M309j417J01
$$ -93126 -94084 -89600 -85112 -87304 -89496 -90021 -90543 -91065 -91587 -88534 -85477 -88743 -92008 -93428 -89119 -84810 -86227 -86126
-10766h6126J04k53k54q53q50K013K013k703k698K072K073J532J535l235l236J025J029J029
$$ -86126 -86022 -86275 -86529 -87382 -88232 -86219 -84206 -86909 -89607 -87535 -85462 -83930 -82395 -85630 -88866 -87841 -86812 -85783
-10748h5783J029L589L594l087l086J800J804j058j059q83q80q80q79l519l515o56o52J312
$$ -85783 -84754 -81165 -77571 -80658 -83744 -81944 -80140 -81198 -82257 -83140 -84020 -84900 -85779 -89298 -92813 -93469 -94121 -92809
-10730i2809J316J312J315P61P64P60P64j923j920K848K852J379J383J379J383M84M89k378
$$ -92809 -91493 -90181 -88866 -88105 -87341 -86581 -85817 -87740 -89660 -86812 -83960 -82581 -81198 -79819 -78436 -77952 -77463 -79841
-10712g9841k375k840k837J931J935K288K293k483k479K934K937P5P4k672k669k669k669J010
$$ -79841 -82216 -85056 -87893 -85962 -84027 -81739 -79446 -81929 -84408 -81474 -78537 -78462 -78388 -81060 -83729 -86398 -89067 -88057
-10694h8057J014J014J014J010J014J014J014j637j632j633j633k531k527L36L35P34P38P39
$$ -88057 -87043 -86029 -85015 -84005 -82991 -81977 -80963 -82600 -84232 -85865 -87498 -90029 -92556 -92220 -91885 -91151 -90413 -89674
-10676h9674P38J628J633J633J632j461j461j461j461Q64Q65Q65Q65l012l012j49j49M682
$$ -89674 -88936 -87308 -85675 -84042 -82410 -83871 -85332 -86793 -88254 -87390 -86525 -85660 -84795 -87807 -90819 -90968 -91117 -86435
-10658h6435M681q9r0k161k162P00P01j5j5j5j4k09k09k09k08L548L549l131l131j245j245
$$ -86435 -81754 -81843 -81933 -84094 -86256 -85556 -84855 -84870 -84885 -84900 -84914 -85123 -85332 -85541 -85749 -82201 -78652 -81783 -84914 -86159 -87404
-10637h7404j245j245q28q27K393l333j394j394j752j752M630M629L079k646O11O11L832j893
$$ -87404 -88649 -89894 -90722 -91549 -89156 -92489 -93883 -95277 -97029 -98781 -94151 -89522 -86443 -89089 -88478 -87867 -84035 -85928
-10619h5928j894L832j04j05m77o202j432M294J79J79N37N37J066J069J067J069j379j375
$$ -85928 -87822 -83990 -84094 -84199 -84676 -90878 -92310 -88016 -87837 -87658 -87121 -86584 -85518 -84449 -83382 -82313 -83692 -85067
-10601h5067l884l881q72M857J633J636L124L127l198l195l667K061J700J703k09k05l071
$$ -85067 -88951 -92832 -93704 -88847 -87214 -85578 -82454 -79327 -82525 -85720 -89387 -87326 -85626 -83923 -84132 -84337 -87408
-10584h7408l068P46P49k117k114Q35Q39n97n92J368J371J368J372j047j044J815J819L99
$$ -87408 -90476 -89730 -88981 -91098 -93212 -92377 -91538 -92135 -92727 -91359 -89988 -88620 -87248 -88295 -89339 -87524 -85705 -85306
-10566h5306M03L99M02l17l13l17l13L54L58k508k505J845J849O52n069m671J059M156M160
$$ -85306 -84903 -84504 -84102 -84419 -84732 -85049 -85362 -85008 -84650 -87158 -89663 -87818 -85969 -85317 -90386 -95057 -93998 -89842 -85682
-10547h5682J532J535j330j327m078m078j215j215K542K542j036M689N412l13j506j506L951
$$ -85682 -84150 -82615 -83945 -85272 -89350 -93428 -94643 -95858 -93316 -90774 -91810 -87121 -81709 -82022 -83528 -85034 -81083
-10530h1083L952m63m62l884J841N3N2o94o93o93o93m48m47m47m48K69K68K68K69j174j171
$$ -81083 -77131 -77594 -78056 -81940 -80099 -80046 -79994 -80688 -81381 -82074 -82767 -83215 -83662 -84109 -84557 -84288 -84020 -83752 -83483 -84657 -85828
-10509h5828j174j170j174j171j174j170J136J141M357j364O90O93j100j095K12K16L075L079
$$ -85828 -87002 -88172 -89346 -90517 -91691 -92861 -91725 -90584 -86227 -87591 -86901 -86208 -87308 -88403 -88191 -87975 -84900 -81821
-10491h1821l157l153J614J617l54l50k859k855m171J558M417j305N785N785j849p574J014
$$ -81821 -84978 -88131 -86517 -84900 -85254 -85604 -88463 -91318 -95489 -93931 -89514 -90819 -85034 -79249 -81098 -88672 -87658
-10474h7658J014O56O56J551J550M771r54N97N96K39K38j140j141j141j140O48O49o031o031
$$ -87658 -86644 -85988 -85332 -83781 -82231 -77460 -78414 -77817 -77221 -76982 -76744 -77884 -79025 -80166 -81306 -80658 -80009 -86040 -92071
-10455i2071r62r62K259K259k632L094K736K736k281k277N710j1l653l649P60P64J834J838
$$ -92071 -93033 -93995 -91736 -89477 -92109 -89015 -86279 -83543 -85824 -88101 -82391 -82402 -86055 -89704 -88944 -88180 -86346 -84508
-10437h4508J834J837J894J897k877k874k624k621N97O00n249M81k385k382R24O654O650R28
$$ -84508 -82674 -80837 -78943 -77046 -79923 -82797 -85421 -88042 -87445 -86845 -92094 -91613 -93998 -96380 -95456 -88802 -82152 -81224
-10419h1224r0q5m48m43n405n401R17R20M347j376M10M14p194p190J394J397J365J368j857
$$ -81224 -81314 -81399 -81847 -82290 -87695 -93096 -92179 -91259 -86912 -88288 -87878 -87464 -94658 -101848 -100454 -99057 -97692 -96324 -98181
-10400i8181L873K699K702L057L060k937k934j506j502M92M96Q50m872J059J062P01P04M33
$$ -98181 -94308 -91609 -88907 -85850 -82790 -85727 -88661 -90167 -91669 -91177 -90681 -89831 -94703 -93644 -92582 -91881 -91177 -90744
-10382i0744M32k430k431M429M428J566J565K423K423m257m257l20l21l20l21k266k267k266
$$ -90744 -90312 -92742 -95173 -90744 -86316 -84750 -83185 -80762 -78339 -82596 -86853 -87173 -87494 -87814 -88135 -90401 -92668 -94934
-10364i4934k266K266K266K267K266J558J558J558J558Q43Q42Q43Q42j38j34m96m92p8n800
$$ -94934 -97200 -94934 -92668 -90401 -88135 -86577 -85019 -83461 -81903 -81060 -80218 -79375 -78533 -78671 -78805 -79301 -79793 -79871 -85671
-10345h5671p8p5L619k102J115J118j38j34L082k639l082l079l441l436K404K408m59m54M551
$$ -85671 -85749 -85824 -82205 -84307 -83192 -82074 -82212 -82346 -79264 -81903 -84985 -88064 -91505 -94941 -92537 -90129 -90588 -91042 -86491
-10326h6491M555k20k16j294j290j293j290M36M37M36M36l739l738J628P355K195K196n48
$$ -86491 -81936 -82156 -82372 -83666 -84956 -86249 -87539 -87103 -86666 -86230 -85794 -89533 -93271 -91643 -84288 -82093 -79897 -80445
-10308h0445o274n021P05L806L805O90O90L910j815k830k829l545K181L284L284K091l634
$$ -80445 -86719 -91740 -91035 -87229 -83424 -82734 -82044 -78134 -79949 -82779 -85608 -89153 -86972 -83688 -80404 -78313 -81947
-10291h1947j846j845O60O60l728l723K952K956k058k054q64M864L757j964l161l157J312
$$ -81947 -83793 -85638 -84978 -84318 -88046 -91769 -88817 -85861 -87919 -89973 -90837 -85973 -82216 -84180 -87341 -90498 -89186
-10274h9186J316J312J315K520K524j894j890n710J9l206l202j029j025L743L746o12o07o12
$$ -89186 -87870 -86558 -85243 -82723 -80199 -82093 -83983 -89693 -89674 -92880 -96082 -97111 -98136 -94393 -90647 -91259 -91866 -92478
-10256i2478o07j301j297j297j298K576K580K579K579j047j044J49N875M082j641J939J938
$$ -92478 -93085 -94386 -95683 -96980 -98278 -95702 -93122 -90543 -87964 -89011 -90055 -89906 -84031 -79949 -81590 -79651 -77713
-10239g7713L39L43m428m428j38j34k997k997K87K90O49O49N25O255J71J72o11o12o11o11
$$ -77713 -77374 -77031 -81459 -85887 -86025 -86159 -89156 -92153 -91866 -91576 -90927 -90278 -89753 -83498 -83327 -83155 -83766 -84378 -84989 -85600
-10219h5600k759k758k54k53K825k899L20L21Q57Q57Q58Q57J640J640J640J640o053o054m741
$$ -85600 -88359 -91117 -91371 -91624 -88799 -91698 -91378 -91057 -90200 -89343 -88485 -87628 -85988 -84348 -82708 -81068 -87121 -93175 -97916
-10200i7916M801N37N37J133J133K98K98K98K99K322K322o266o262J666J666K024l697M73
$$ -97916 -93115 -92578 -92041 -90908 -89775 -89477 -89179 -88881 -88582 -86260 -83938 -90204 -96466 -94800 -93134 -91110 -94807 -94334
-10182i4334M74m298m294P71O497K919K922K703l023k665k662j830j830J032J036J063J062
$$ -94334 -93860 -98158 -102452 -101681 -95184 -92265 -89343 -86640 -89663 -92328 -94990 -96820 -98650 -97618 -96582 -95519 -94457
-10165i4457M641j081j622M104N26N29j707j703j708j703l7l4l7l4J111J115J110J115J290
$$ -94457 -89816 -90897 -92519 -88415 -87889 -87360 -89067 -90770 -92478 -94181 -94218 -94252 -94289 -94323 -93212 -92097 -90987 -89872 -88582
-10146h8582J293J290J293j066j062K154K159o017k87L169L172L213L217J662m059L571L575
$$ -88582 -87289 -85999 -84706 -85772 -86834 -84680 -82521 -88538 -88825 -85656 -82484 -79271 -76054 -74392 -78451 -74880 -71305
-10129g1305j916j913J603m119L869L873J365J368m958m954m570J160P97Q02k244k240k244
$$ -71305 -73221 -75134 -73531 -77650 -73781 -69908 -68543 -67175 -72133 -77087 -81657 -80497 -79700 -78898 -81142 -83382 -85626
-10112h5626k241K893K896L0L3k236k233k236k233j402j397J461J465M562M566J700J704j190
$$ -85626 -87867 -84974 -82078 -82048 -82015 -84251 -86484 -88720 -90953 -92355 -93752 -92291 -90826 -86264 -81698 -79998 -78294 -79484
-10094g9484j189j189j189P79P79P79P79l425l426J53n572j518M209K72K72K285l441k19k20
$$ -79484 -80673 -81862 -83051 -82272 -81493 -80714 -79935 -83360 -86786 -86633 -92205 -93723 -89514 -89242 -88970 -86685 -90126 -90345 -90565
-10075i0565L776L776r96r95k367k367k367k367J391J390J390J391J79J82N37N40l757J972
$$ -90565 -86789 -83013 -84009 -85004 -87371 -89738 -92105 -94472 -93081 -91691 -90301 -88910 -88731 -88549 -88012 -87472 -91229 -89257
-10057h9257J610J614Q05Q09j699j696l88N341N338l84m711m708n070n065J849J852J849J853
$$ -89257 -87647 -86033 -85228 -84419 -86118 -87814 -88202 -82861 -77523 -77907 -82618 -87326 -92396 -97461 -95612 -93760 -91911 -90058
-10039i0058J371J376J371J376O56O60O56O59j740j737j741j737M06M10M9N2J689m034q16
$$ -90058 -88687 -87311 -85940 -84564 -83908 -83248 -82592 -81933 -83673 -85410 -87151 -88888 -88482 -88072 -88023 -87971 -86282 -90316 -91132
-10020i1132q13L17L21L179L184J629J632J629J633o38o33l500l497L448L452L448L451R43
$$ -91132 -91945 -91628 -91307 -88128 -84944 -83315 -81683 -80054 -78421 -79059 -79692 -83192 -86689 -83241 -79789 -76341 -72890 -71947
-10002g1947R47l828l824r88r84K590l131o057l28j047j044p49p46K114K117Q61Q65Q61Q65
$$ -71947 -71000 -74828 -78652 -79640 -80624 -78034 -81165 -87222 -87550 -88597 -89641 -90390 -91136 -89022 -86905 -86044 -85179 -84318 -83453
-9983h3453p57p53K106K110O75O78O75O78l709l705q46q43J122J126P64P68N901J75mN722
$$ -83453 -84210 -84963 -82857 -80747 -80072 -79394 -78719 -78041 -81750 -85455 -86301 -87144 -86022 -84896 -84132 -83364 -77463 -77288 -77292 -71570
-9963g1570J487j375K203o60n610n610K800K799n41n40n41n40J569J569j293j293o840o840
$$ -71570 -70083 -71458 -69255 -69915 -75525 -81135 -78335 -75536 -76077 -76617 -77158 -77698 -76129 -74560 -75853 -77146 -83986 -90826
-9945i0826j61j60j1j1p27M998n47o274o094l69N214K356j53K714M439M444k062k057J383
$$ -90826 -90987 -91147 -91158 -91169 -91896 -86898 -87445 -93719 -99813 -100182 -94968 -92612 -92765 -90051 -85612 -81168 -83230 -85287 -83904
-9926h3904J386j301j297j778J089K874k848l702q35J965J968m417m414L55L57K785K788K427
$$ -83904 -82518 -83819 -85116 -86894 -85805 -82931 -85779 -89481 -90316 -88351 -86383 -90800 -95214 -94859 -94502 -91717 -88929 -86502
-9908h6502K430K665l056J949r10j841J021k378M85O985O986j424j424l124l124j155m018
$$ -86502 -84072 -81407 -84463 -82514 -83424 -85265 -84244 -86622 -86137 -79152 -72166 -73590 -75014 -78138 -81262 -82417 -86435
-9891h6435m973P53K125K125j72j71l035l034Q43Q42Q42Q43J677J678j007j006n181k319K512
$$ -86435 -91408 -90655 -88530 -86405 -86577 -86748 -89783 -92817 -91974 -91132 -90290 -89447 -87770 -86092 -87099 -88105 -93286 -95605 -93093
-9872i3093l213m916Q12L910L914J704J707J525J528J256j603o079l51M000M003P79O508L120
$$ -93093 -96306 -101222 -100410 -96500 -92586 -90882 -89175 -87650 -86122 -84866 -86469 -92548 -92899 -88899 -84896 -84117 -77609 -74489
-9854g4489k602n110O19k546k542K583K587K434K438m29m25k50k46j144m003p798k073J208
$$ -74489 -77091 -82201 -81582 -84128 -86670 -84087 -81500 -79066 -76628 -77057 -77482 -77732 -77978 -79122 -83125 -90923 -92996 -91788
-9836i1788J208k24k24K640K639J93J94k609n472l206K520K699l027k266L463O143M21j789
$$ -91788 -90580 -90804 -91028 -88388 -85749 -85556 -85362 -87971 -93443 -96649 -94129 -91430 -94457 -96723 -93260 -87117 -86696 -88485
-9818h8485J077N785N789Q05Q09Q05Q09j402j398j401j398j830j827j830j826L597L600l082
$$ -88485 -87408 -81623 -75834 -75029 -74220 -73415 -72606 -74008 -75406 -76807 -78205 -80035 -81862 -83692 -85518 -81921 -78321 -81403
-9800h1403l079j16j11j16j12n33n29n33n30M81M81M81M81K330K329K986N848N029m514n349
$$ -81403 -84482 -84598 -84709 -84825 -84937 -85470 -85999 -86532 -87062 -86581 -86100 -85619 -85138 -82808 -80479 -77493 -71645 -66616 -71130 -76479
-9780g6479k486k546k546M96M95L426L425O23k240j525M201Q01Q02l060l061j97j98M1M1l17
$$ -76479 -78965 -81511 -84057 -83561 -83066 -79640 -76215 -75592 -77832 -79357 -75156 -74355 -73553 -76613 -79674 -79871 -80069 -80028 -79987 -80304
-9760h0304l16J621m104j241M484P27P27j778j778j435j435p698j972L993J129K35K35M078
$$ -80304 -80620 -78999 -83103 -84344 -79860 -79133 -78406 -80184 -81962 -83397 -84832 -92530 -94502 -90509 -89380 -89145 -88910 -84832
-9742h4832M077M078M078M376M376m212m212J245J245l526l526qpqpm47m48K416K415R25R24
$$ -84832 -80755 -76677 -72599 -68223 -63847 -68059 -72271 -71026 -69781 -73307 -76833 -76841 -76848 -76856 -76863 -77310 -77758 -75342 -72927 -72002 -71078
-9721g1078j938j939K729K728k042k043k937k937J833J834O08O11O08O11K814K818m8m5k508
$$ -71078 -73016 -74955 -72226 -69498 -71540 -73583 -76520 -79457 -77624 -75790 -75182 -74571 -73963 -73352 -70538 -67720 -67768 -67813 -70321
-9702g0321k505K262K267k092k087k091k087j286j283J577J581N03N07N03N07J204J208j659
$$ -70321 -72826 -70564 -68297 -70389 -72476 -74567 -76654 -77940 -79223 -77646 -76065 -75562 -75055 -74552 -74045 -72841 -71633 -73292
-9684g3292j655L69L73L69L72l638l634L042L045j431j428J431J435M190M194n82n78j953
$$ -73292 -74947 -74578 -74205 -73836 -73464 -77102 -80736 -77694 -74649 -76080 -77508 -76077 -74642 -70452 -66258 -66840 -67418 -69371
-9666f9371j949R09R13N19N21N18N22j450j446j450j446m81m77m81m77l02k98l02k98K9L4
$$ -69371 -71320 -70411 -69498 -68979 -68458 -67940 -67418 -68868 -70314 -71764 -73210 -73691 -74168 -74649 -75126 -75428 -75726 -76028 -76326 -76297 -76263
-9645g6263K893K896J700J703j163j159n07n03n07n04o85o83o85o83j513j513j514j513o19
$$ -76263 -73370 -70474 -68774 -67071 -68234 -69393 -69900 -70403 -70910 -71414 -72099 -72782 -73467 -74150 -75663 -77176 -78690 -80203 -80822
-9626h0822o18o19o19m376m376j513j514J290J290j573j573m03l99K460K464L355L358j416
$$ -80822 -81440 -82059 -82678 -87054 -91430 -92943 -94457 -93167 -91877 -93450 -95023 -95426 -95825 -93365 -90901 -87546 -84188 -85604
-9608h5604j413k385k382k386k382j968j964j610j607j305M421M779r47j782L944L65L66j998
$$ -85604 -87017 -89402 -91784 -94170 -96552 -98520 -100484 -102094 -103701 -105006 -100585 -95806 -96753 -98535 -94591 -94226 -93860 -95858
-9590i5858j998J222m502j641j640j998j998J368J372J368J372K620K624L337k386l597K132
$$ -95858 -97856 -96634 -101136 -102777 -104417 -106415 -108413 -107045 -105673 -104305 -102933 -100313 -97689 -94352 -96738 -100335 -98203
-9573i8203j450j446L500L504M1n681J1J5K516K520Q46Q50Q46Q50j100j096p41p38m022J707
$$ -98203 -99653 -101099 -97599 -94095 -94054 -99735 -99724 -99709 -97193 -94673 -93827 -92977 -92131 -91281 -92381 -93477 -94218 -94956 -98978 -97271
-9553i7271L612L616j726L999P79P79J495J495l277l276K061K061K062K061m916m917L672
$$ -97271 -93659 -90043 -91769 -87770 -86991 -86212 -84717 -83222 -86499 -89775 -87714 -85653 -83591 -81530 -86446 -91363 -87691
-9536h7691L671q54q53l716l717j748j748m969P57J353J353M574M573K665K666l657l657q68
$$ -87691 -84020 -84874 -85727 -89443 -93160 -94908 -96656 -101625 -100868 -99515 -98162 -93588 -89015 -86350 -83684 -87341 -90998 -91866
-9518i1866M860J637J640l135l131k72k69p49p45l92l87O22O352L485k236j42j42K363K364
$$ -91866 -87006 -85369 -83729 -86864 -89995 -90267 -90536 -91285 -92030 -92422 -92809 -92187 -85835 -82350 -84586 -84728 -84870 -82507 -80143
-9499h0143l482l481J289J290k2k3k885k885M033M034N74n152j562j558M760M764m29m25m28
$$ -80143 -83625 -87106 -85817 -84527 -84549 -84572 -87457 -90342 -86309 -82275 -81701 -86853 -88415 -89973 -85213 -80449 -80878 -81303 -81731
-9480h1731m25j547j543J316J319K688K691k084k080J61J60M931M932J0895J0896O124O124
$$ -81731 -82156 -83703 -85246 -83930 -82611 -79923 -77232 -79316 -81396 -81235 -81075 -76144 -71212 -60317 -49421 -43297 -37173
-9463c7173l403l403o266o266o147o146l284l284N52N51m040m041k430M32K401l325j745L981
$$ -37173 -40576 -43979 -50245 -56511 -62658 -68804 -72088 -75372 -74820 -74269 -78309 -82350 -84780 -84348 -81947 -85272 -87017 -83036
-9445h3036L623k102k222k221K192K191q252q253K244K244p38p38p38p38O7O7l511K214R669
$$ -83036 -79413 -81515 -83737 -85958 -83766 -81575 -89827 -98080 -95836 -93592 -94330 -95068 -95806 -96544 -96477 -96410 -99921 -97707 -88038
-9426h8038L944j067j066K509K509K150K151m73o199l336K389J711J711K069K068j032j033
$$ -88038 -84094 -85161 -86227 -83718 -81209 -79059 -76908 -77381 -83580 -86916 -84527 -82816 -81105 -79036 -76968 -78000 -79033
-9409g9033j032j033J31J30k732k732k673k672J90J90K628K628k144k143J435J435J435J435
$$ -79033 -80065 -81098 -80967 -80837 -83569 -86301 -88974 -91646 -91456 -91266 -88638 -86010 -88154 -90297 -88862 -87427 -85992 -84557
-9391h4557j86j86j87j86o449o448j678j677O04O04O04O03M779M779PQk31k32k31k31l50l51
$$ -84557 -84743 -84929 -85116 -85302 -91751 -98199 -99877 -101554 -100950 -100346 -99742 -99139 -94360 -89581 -89574 -89566 -89797 -90029 -90260 -90491 -90841 -91192
-9369i1192l50l50p53p53J41L005L362k363L899L899N468N468K606K605L560L560J0239J0239
$$ -91192 -91542 -91892 -92645 -93398 -93257 -90252 -86890 -89253 -85354 -81455 -75987 -70519 -67913 -65308 -61748 -58188 -47949 -37710
-9351c7710J0091J0090J7247K8697M7425O6509Q9173Q9172N9591J7605P824l627m7163q9151
$$ -37710 -27619 -17529 -282 28415 75840 142349 231522 320694 380285 397890 405714 402087 354924 265773
-9337B65773r0581p1497n1011l9559k5723j9998j7135j1410n684n684P26P27L590L589k493
$$ 265773 175192 103695 52684 13125 -12598 -32596 -49731 -61141 -66825 -72509 -71783 -71056 -67466 -63877 -66370
-9322f6370k494k494k493l538l537l537l538O97O97O97O97q53q54K009K009K248K248K247
$$ -66370 -68864 -71358 -73851 -77389 -80926 -84463 -88001 -87304 -86607 -85910 -85213 -86066 -86920 -84911 -82902 -80654 -78406 -76159
-9304g6159K248l388l389n25n26J145J144J144J145l210l205l47l43J025J029j838j834o74
$$ -76159 -73911 -77299 -80688 -81213 -81739 -80594 -79450 -78306 -77161 -80371 -83576 -83923 -84266 -83241 -82212 -84050 -85884 -86558
-9286h6558o71K188K192J293J297j569j566J90J94J90J94n25n22l389l384q09q05q09q05O22
$$ -86558 -87229 -85041 -82849 -81556 -80259 -81828 -83394 -83204 -83010 -82820 -82626 -83151 -83673 -87062 -90446 -91255 -92060 -92869 -93674 -93052
-9266i3052O27k241k236M108M111M108M111j081j077j081j077j186j181j186j181J916J919
$$ -93052 -92425 -94666 -96902 -92794 -88683 -84575 -80464 -81545 -82622 -83703 -84780 -85966 -87147 -88333 -89514 -87598 -85679
-9249h5679J916J920k296k293k296k292L906L910m681m678K98L02L161L164j610j606l877
$$ -85679 -83763 -81843 -84139 -86432 -88728 -91020 -87114 -83204 -87885 -92563 -92265 -91963 -88802 -85638 -87248 -88854 -92731
-9232i2731l873l809N736M779M782m69o192j12j08k050k046M629M634j454j450J409J413k565
$$ -92731 -96604 -100413 -94677 -89898 -85116 -85585 -91777 -91889 -91997 -94047 -96093 -91464 -86830 -88284 -89734 -88325 -86912 -89477
-9214h9477k561J849J853J19n602k744K986K415K419K774K777L548L552R0n632m253m253J60
$$ -89477 -92038 -90189 -88336 -88217 -93819 -96563 -93577 -91162 -88743 -85969 -83192 -79644 -76092 -76002 -81634 -85887 -90140 -89980
-9196h9980J60L381L381n208n207k613k613K158K159j599j599L172L172K016K017K016K017
$$ -89980 -89820 -86439 -83058 -88266 -93473 -96086 -98699 -96541 -94382 -95981 -97580 -94408 -91236 -89220 -87203 -85187 -83170
-9179h3170J301J301J301J301J539J539l231l232m246m245N25N26M36M40K941K945K046l675
$$ -83170 -81869 -80568 -79267 -77966 -76427 -74888 -78119 -81351 -85597 -89842 -89317 -88791 -88355 -87915 -84974 -82029 -79983 -83658
-9161h3658K046K050K971k751k755K975N85N89R43R47k538k535J875J878K054l668m029J700
$$ -83658 -81612 -79562 -76591 -79342 -82097 -79122 -78537 -77948 -77005 -76058 -78596 -81131 -79256 -77378 -75324 -78992 -83021 -81321
-9143h1321J278m443q68q65J696J700J696J699j573j573k2N703J946J946K303K304n30n29
$$ -81321 -80043 -84486 -85354 -86219 -84523 -82823 -81127 -79428 -81001 -82574 -82596 -76893 -74947 -73001 -70698 -68394 -68924 -69453
-9125f9453n29n30j722j722k080k080P68m957j737j737K139K140p23p23J11J12J12J12O48
$$ -69453 -69982 -70512 -72234 -73956 -76036 -78116 -77348 -82305 -84042 -85779 -83640 -81500 -82223 -82946 -82835 -82723 -82611 -82499 -81851
-9106h1851O49O49O48M51M55M51M55r21r17r21r17L940L944J077J081j15j12K747K751j629
$$ -81851 -81202 -80553 -79905 -79454 -78999 -78548 -78093 -79014 -79931 -80852 -81769 -77829 -73885 -72808 -71727 -71842 -71954 -69207 -66456 -68085
-9086f8085j625j629j625p8p5p8p5K80K83L142L146j38j34K20n502J040J040k72N453K651
$$ -68085 -69710 -71339 -72964 -73042 -73117 -73195 -73270 -72990 -72707 -69565 -66419 -66557 -66691 -66471 -71973 -70933 -69893 -70165 -64712 -62061
-9066f2061o892o535L008Q91Q91j375j376L635L634j137j137L239L239L240L239j60j61j60
$$ -62061 -68953 -75488 -72480 -71589 -70698 -72073 -73449 -69814 -66180 -67317 -68454 -65215 -61976 -58736 -55497 -55657 -55818 -55978
-9048e5978j60K076K076K076K076K971K971K613K613L060k665m216m215J927J927N386J1112
$$ -55978 -56138 -54062 -51986 -49910 -47834 -44863 -41892 -39279 -36666 -33606 -36271 -40487 -44702 -42775 -40848 -35462 -24350
-9031b4350P637P638N133N131M417M417P877J3601J5130J5130K6342K6342L1471L7197M1013
$$ -24350 -16713 -9075 -3942 1189 5606 10023 17900 31501 46631 61761 88103 114445 145916 183113 224126
-9016B24126M1014M3145M8871N9487O9029P9526R6702J21274J53717K01262K83330M18350
$$ 224126 265140 308285 357156 416643 485672 565198 661900 783174 936891 1138153 1421483 1839833
-9004A839833O30194R14313J213948J384036J332511J090788P79711N7112p88336j214764
$$ 1839833 2470027 3384340 4598288 5982324 7314835 8405623 9185334 9242446 8454110 7239346
-8994G239346j499122j493639j194005q59841n98376m04909k73220j87821j28654q9772o1142
$$ 7239346 5740224 4246585 3052580 2192739 1594363 1189454 916234 728413 599759 509987 448845
-8983D48845m2806k9444j5491j5488j7758k3479l4576l4573l6097l6093k3692k3688j8443
$$ 448845 406039 376595 361104 345616 327858 304379 269803 235230 199133 163040 139348 115660 97217
-8970I7217j8440j5581j5577j1376j1373q514q509J088J092l683l679p133p131p134p131m093
$$ 97217 78777 63196 47619 36243 24870 16356 7847 8935 10027 6344 2665 -4468 -11599 -18733 -25864 -29957
-8954b9957m089j230j226k482k479M197M201P954P958P955P958P230P235J1406J7136K5063
$$ -29957 -34046 -35276 -36502 -38984 -41463 -37266 -33065 -25111 -17153 -9198 -1240 5990 13225 24631 41767 66830
-8938F6830L6518N1902P0990Q4226R5681R7704R1983O5440K3457j7221n9203q8961j00407
$$ 66830 103348 155250 226240 310466 406147 503851 595834 661274 684731 667510 608307 519346 418939
-8925D18939j02319r0865o7788n6333m8584k9496k1448j5717L80L84m690m685p552p548l366
$$ 418939 316620 225755 157967 101634 53050 23554 2106 -13611 -13231 -12847 -17537 -22222 -29774 -37322 -40688
-8910d0688l362l366l362m738m734L4L7J689J692j174j171K524K527l39l36m894m890k032
$$ -40688 -44050 -47416 -50778 -55516 -60250 -60216 -60179 -58490 -56798 -57972 -59143 -56619 -54092 -54431 -54767 -59661 -64551 -66583
-8892f6583k027k43k38K620K624J16J19m656m651L037L042n550n547o67o63o68o63J599J603
$$ -66583 -68610 -68853 -69091 -66471 -63847 -63731 -63612 -68268 -72919 -69882 -66840 -72390 -77937 -78604 -79267 -79935 -80598 -78999 -77396
-8873g7396J599J603j055j051J808J811J98K01J98K01Q46Q50Q46Q50M901M906M901M906l448
$$ -77396 -75797 -74194 -75249 -76300 -74492 -72681 -72483 -72282 -72084 -71883 -71037 -70187 -69341 -68491 -63590 -58684 -53783 -48877 -52325
-8854e2325l444l448l444j361j357j360j357L302L303n286n285j886j886R76R77o49o48K572
$$ -52325 -55769 -59217 -62661 -64022 -65379 -66739 -68096 -64794 -61491 -66777 -72062 -73948 -75834 -74858 -73881 -74530 -75178 -72606
-8836g2606K572o255n29o613o612r25r24j283M444L369L370Q65Q64N97N96m175m174l877l877
$$ -72606 -70034 -76289 -76818 -83431 -90043 -90968 -91892 -93175 -88731 -85362 -81992 -81127 -80263 -79666 -79070 -83245 -87419 -91296 -95173
-8817i5173p75M950N536j91J68N893m424m425K613K613N118N118L47L46j741j740j383j383
$$ -95173 -95948 -90998 -85462 -85653 -85485 -79592 -84016 -88441 -85828 -83215 -78097 -72979 -72632 -72286 -74027 -75767 -77150 -78533
-8799g8533n416L09j360M365N259N260N617N617L351L351L351L351j837j838j480j480m100
$$ -78533 -83949 -83640 -85000 -80635 -75376 -70116 -64499 -58882 -55531 -52180 -48829 -45478 -47315 -49153 -50633 -52113 -56213
-8782e6213J629m100m097p798k068m936m931k907K821K460K464n22n18n22n18O0O3L519R248
$$ -56213 -54584 -58684 -62781 -70579 -72647 -77583 -82514 -85421 -82600 -80140 -77676 -78198 -78716 -79238 -79756 -79696 -79633 -76114 -66866
-8763f6866N487N490q35q31j849j845J014J018n37n33K326K330M648M652j23n845j1156j611
$$ -66866 -61379 -55889 -56724 -57555 -59404 -61249 -60235 -59217 -59754 -60287 -57961 -55631 -50983 -46331 -46454 -52299 -63455 -65066
-8745f5066k568k564m626m622p847k117j465j461j107j103L209L213L210L213J360J364J361
$$ -65066 -67634 -70198 -74824 -79446 -87293 -89410 -90875 -92336 -93443 -94546 -91337 -88124 -84914 -81701 -80341 -78977 -77616
-8728g7616J364P8Q2J629P358J510J513k903k900j089j084p31p27p90M939O486O489L534L537
$$ -77616 -76252 -76174 -76092 -74463 -67105 -65595 -64082 -66985 -69885 -70974 -72058 -72789 -73516 -74306 -69367 -62881 -56392 -52858 -49321
-8709d9321j237j234o844o840l384K344o038o035n52n48m368J360M816M820R498R501R09R14
$$ -49321 -50558 -51792 -58636 -65476 -68860 -66516 -72554 -78589 -79141 -79689 -84057 -82697 -77881 -73061 -63563 -54062 -53153 -52239
-8691e2239m03l99o486p56J256J260q91q87p094j364M000M003J375J380l038l034p332j603
$$ -52239 -52642 -53041 -59527 -60283 -59027 -57767 -58658 -59545 -66639 -68003 -64003 -60000 -58625 -57245 -60283 -63317 -70649 -72252
-8673g2252k919K811K218P947J5577J5581O034O039o45o41k762k759n624n621j0396j0393
$$ -72252 -75171 -72360 -70142 -62195 -46618 -31037 -25003 -18964 -19609 -20250 -23012 -25771 -31395 -37016 -47412 -57805
-8657e7805o579q49j954L776K580J5942K8702L8246L5978L5981J9040R502r349j8887k2827
$$ -57805 -64384 -65233 -67187 -63411 -60831 -44889 -16187 22059 58037 94018 113058 122560 113211 94324 71497
-8642G1497k2823j6386o840o695o691j5639o095l831N714R526R531L773L776J267J271l862
$$ 71497 48674 32288 25448 18753 12062 -3577 -9672 -13503 -7789 1737 11268 15041 18817 20084 21355 17493
-8626A7493J868r99r95m283J446j420j417L709R438R077R080O512O515L650L652m8m5L10L13
$$ 17493 19361 18362 17367 13084 14530 13110 11693 15402 24840 33917 42997 49509 56024 59674 63326 63278 63233 63543 63856
-8607F3856k449L280M14M17j23N606m81m77M947M950J726P455P510P515j435j431j5749k7196
$$ 63856 61407 64687 65101 65518 65395 71001 70520 70043 74990 79940 81666 89121 96631 104146 102711 101280 85531 58335
-8589E8335k9346j7892j4913l459N960J7414J2103O382k091k088k389k386k031k028o884j156
$$ 58335 28989 11097 -3816 -7275 -1315 16099 28202 34584 32493 30405 28016 25630 23599 21571 14687 13531
-8573A3531k233R222R993R998J0709J0712O386O388O743O747j726M004P935J9391J5271L821
$$ 13531 11298 20520 30513 40511 51220 61932 68318 74706 81449 88196 86470 90474 98409 117800 133071 136892
-8557A36892j6934k2659k7431k1705j0493R58N431K4516L0002L0003J7955O504k918k919j092
$$ 136892 119958 97299 69868 48163 37670 38628 44059 68575 98577 128580 146535 153039 150121 147202 146110
-8542A46110M633M59J1909P794J9245J3520J3519N051N051p235j2961j3616k166O423K5507
$$ 146110 150743 151202 163111 170905 190150 203670 217189 222240 227291 220056 207095 193479 191313 197736 223243
-8527B23243L1586L7316L2422L2425K6577K6581L8624N0079N3295N9025M3634L2187K1030
$$ 223243 254829 292145 324567 356992 383569 410150 448774 498853 552148 611173 654807 686994 708024
-8514G08024J950n808j7254l3235l8956l9794k8340J3225O2849J04355J23443J15507Q8792
$$ 708024 709974 704166 686912 653677 614721 574927 546587 559812 622661 727016 850459 965966 1054758
-8501A054758O0639M1557L7499N6587R3321J42945J82024K01113K32598K66955L24205M19633
$$ 1054758 1115397 1156954 1194453 1251040 1344361 1487306 1669330 1870443 2103041 2369996 2694201 3113834
-8489C113834N36045O62008P53670Q03295Q10209Q10213Q77005J018236J269435J693119K305480
$$ 3113834 3649879 4311887 5065557 5868852 6679061 7489274 8366279 9384515 10653950 12347069 14652549
-8478A4652549L179565M394300O276057R321969J4310717K1693155L0338524L4135724K8566833
$$ 14652549 17832114 22226414 28502471 37824440 52135157 73828312 104166836 138302560 166869393
-8469A66869393J4355378q504277k4915572l2614346l1627051k4241282j7158293j1625640
$$ 166869393 181224771 172720494 147804922 115190576 83563525 59322243 42163950 30538310
-8461C0538310p820747n173699l482557k285944j560011j016096p04569m54558l65577l36949
$$ 30538310 22717563 17543864 14061307 11775363 10215352 9199256 8494687 8040129 7674552 7337603
-8451G337603m27364n66681o82144o91686o50132n22265m22786l02553k38140j75163j66335
$$ 7337603 6910239 6343558 5661414 4969728 4319596 3797331 3374545 3071992 2833852 2658689 2492354
-8440B492354j60609j83840j70480j63562j23484r3187m1658l0208k0665n6449q1259j17878
$$ 2492354 2331745 2147905 1977425 1813863 1690379 1597192 1555534 1525326 1504661 1448212 1366953 1249075
-8428A249075j17877j26466j05473r6050p8874p9589n8596n0962k2335j6192R84o530o531
$$ 1249075 1131198 1004732 899259 803209 724335 644746 586150 535188 512853 496661 497645 491115 484584
-8415D84584j2301o575q364M994l72N352n621n621k3155k3155k7688j8145k0710p351o873
$$ 484584 472283 465708 457344 462338 461966 467318 461697 456076 432921 409766 382078 363933 343223 335872 328999
-8400C28999K669o113l88n874n875j5298j5297k8180j8637j7803o26M622J4165J49n577j8339
$$ 328999 331668 325555 325167 319293 313418 298120 282823 254643 236006 218203 217577 222199 236364 236513 230936 212597
-8384B12597j8339l1289l7013m1905k4728j7273P537Q968Q969n197n196r013M347Q27J4187
$$ 212597 194258 162969 125956 84051 59323 42050 49587 58555 67524 62327 57131 48118 52465 53292 67479
-8369F7479M286J0012L150L154j264j260q062q059j3430l884j0627j0624j1939k393P325J6870
$$ 67479 71765 81777 84927 88081 86817 85557 77495 69436 56006 52122 41495 30871 18932 16539 23864 40734
-8353D0734Q875Q879q845j4567l4491m0211l7114j6118j1588N591j063Q484J920J923m760
$$ 40734 49609 58488 49643 35076 585 -39626 -76740 -92858 -104446 -98855 -99918 -91434 -89514 -87591 -92351
-8338i2351M786l090l086l661K065j155M570m674J051m675J052l750J975L169Q893r46Q595
$$ -92351 -87565 -90655 -93741 -97402 -95337 -96492 -91922 -96596 -95545 -100220 -99168 -102918 -100943 -97774 -88881 -89827 -81232
-8321h1232L586L586l057l056n919j94o456p31J536J1078l414l415n442K83j34R408R766J5492
$$ -81232 -77646 -74060 -77117 -80173 -86092 -86286 -92742 -93473 -91937 -80859 -84273 -87688 -93130 -92847 -92981 -83573 -73807 -58315
-8303e8315Q014Q018o180j1902j6975j1246j4828j4824k1508k1504k0314j4586j1190J3624
$$ -58315 -50301 -42283 -48463 -60365 -77340 -88586 -103414 -118238 -139746 -161250 -181564 -196150 -207340 -193716
-8289a93716K8053L7599K8791K8795J5074J5078M458M461p589p585j1883o154n920n915m786
$$ -193716 -165663 -128064 -99273 -70478 -55404 -40326 -35868 -31407 -38996 -46581 -58464 -64618 -70538 -76453 -81239
-8274h1239M760j5j1l784N759Q026J3750j278M447k591k591p123K419k352k352m737M804k05
$$ -81239 -76479 -76494 -76505 -80289 -74530 -66504 -52754 -54032 -49585 -52176 -54767 -61890 -59471 -61823 -64175 -68912 -64108 -64313
-8256f4313k05o049l25J823P548Q09Q09j338j338q242k516j1N714Q84O608O609O609n48n48
$$ -64313 -64518 -70567 -70892 -69069 -61521 -60712 -59903 -61241 -62579 -70821 -73337 -73348 -67634 -66750 -60142 -53533 -46924 -47472 -48020
-8237d8020j90j90k874K852l232K494j488M238J376J375j726j725m231N312J136J137n900
$$ -48020 -48210 -48400 -51274 -48422 -51654 -49160 -50648 -46410 -45034 -43659 -45385 -47110 -51341 -46029 -44893 -43756 -49656
-8220d9656j75o199m74j666P876Q890J4616J1991J1991l157l157k561k560k323P220N074J4614
$$ -49656 -49831 -56030 -56504 -58170 -50294 -41404 -26788 -14797 -2806 -5963 -9120 -11681 -14241 -16564 -9344 -4270 10344
-8203A0344J2946J2945J0918J6643J6017K5559K4248K4247K0728L4088L6593M6135L7413N4589
$$ 10344 23290 36235 47153 63796 79813 105372 129620 153867 174595 208683 245276 291411 328824 383413
-8189C83413P7967J18046J52637K23250L14856N19063Q39567J364396J944571K076255M40100
$$ 383413 461380 579426 732063 955313 1270169 1789232 2628799 3993195 5937766 8014021 8454121
-8178H454121j657309j948589j503915j060372p11118m57772l03182k05615j38815r3016o8201
$$ 8454121 6796812 4848223 3344308 2283936 1572818 1115046 811864 606249 467434 374418 306217
-8167C06217l4599k1235r669r666j0146j9685k8634k8631l0961l0956k3923j4377j8436j8433
$$ 306217 271618 250383 240714 231048 220902 201217 172583 143952 112991 82035 58112 43735 25299 6866
-8153F866j6526o982m570m566j111j107k781k777K587Q316M518M522m93o213m071m066m786
$$ 6866 -9660 -16642 -21212 -25778 -26889 -27996 -30777 -33554 -30967 -22651 -18133 -13611 -14104 -20317 -24388 -28454 -33240
-8136c3240R43m473m470O56O60J551J554J551J554k870k866J901J904l645l642J126J129J171
$$ -33240 -32297 -36770 -41240 -40584 -39924 -38373 -36819 -35268 -33714 -36584 -39450 -37549 -35645 -39290 -42932 -41806 -40677 -39506
-8118c9506J174J886l836r564l836J170J175J066J066j797j797ppo091l65L481L482R76R77
$$ -39506 -38332 -36446 -40282 -49846 -53682 -52512 -51337 -50271 -49205 -51002 -52799 -52806 -52813 -58904 -59269 -55788 -52306 -51330 -50353
-8099e0353J215J215l556l556n010n009k148k147j669j670L101L101J268J267n055n054o009
$$ -50353 -49138 -47923 -51479 -55035 -60045 -65054 -67202 -69349 -71018 -72688 -69587 -66486 -65218 -63951 -69006 -74060 -80069
-8082h0069k83o41o41M603M607M962p61M88M93J30J34l32l28o415o85j286j283r28r24K836
$$ -80069 -80352 -80993 -81634 -77031 -72424 -67462 -68223 -67735 -67242 -67112 -66978 -67310 -67638 -74053 -74738 -76024 -77307 -78235 -79159 -76323
-8062g6323K841L31L36p899k169k531k527J107J111M685j036m440J290N70N74N424N423O53
$$ -76323 -73482 -73151 -72815 -80714 -82883 -85414 -87941 -86834 -85723 -81038 -82074 -86514 -85224 -84654 -84080 -78656 -73233 -72580
-8044g2580O52M171M171k508k509k926k926k926k926M13M14M14M14L470L470j301j301k911
$$ -72580 -71928 -67757 -63586 -66094 -68603 -71529 -74455 -77381 -80307 -79894 -79480 -79066 -78652 -75182 -71712 -73013 -74314 -77225
-8026g7225k911L10L09k039L686P146P146l69l69O310O311K192K195o71o67o11o08M160M163
$$ -77225 -80136 -79826 -79517 -81556 -77870 -70724 -63578 -63947 -64316 -58006 -51695 -49503 -47308 -47979 -48646 -49257 -49865 -45705 -41542
-8007d1542N614N617O210O214K095J1641K2252K7982L9183N6364P1388Q4752J00493J06222
$$ -41542 -35928 -30311 -24101 -17887 -15792 -4151 18101 46083 85266 141630 213018 297770 398263 504485
-7993E04485Q9519O0896K2425k1467o3815q8620j03296j03293q3614p0252n5484l8303k4591
$$ 504485 594004 654900 677325 655858 592043 503423 400127 296834 213220 142968 87484 49181 24590
-7980B4590j8861r261r259n446K83n207n204j629p350o997o993m491m488j070j066j070j066
$$ 24590 5729 -3532 -12791 -18237 -17954 -23161 -28365 -29994 -37344 -44341 -51334 -55825 -60313 -61383 -62449 -63519 -64585
-7963f4585K42K46K43K46N580N584K717o821o408o78K180K185k69k64l132l127K952K956K952
$$ -64585 -64343 -64097 -63854 -63608 -58028 -52444 -49727 -56548 -62956 -63634 -61454 -59269 -59538 -59802 -62934 -66061 -63109 -60153 -57201
-7944e7201K956J12J16J11J16j141j137J723J725N37N41L757j964m175m171k982K747j185
$$ -57201 -54245 -54133 -54017 -53906 -53790 -54931 -56068 -54345 -52620 -52083 -51542 -47785 -49749 -53924 -58095 -61077 -58330 -59515
-7926e9515j182m70o191J379J383L526L530p19o445k867k866o325o01N93N93M141j584J636
$$ -59515 -60697 -61167 -67358 -65979 -64596 -61070 -57540 -58259 -64704 -67571 -70437 -76762 -77363 -76770 -76177 -72036 -73620 -71984
-7908g1984J637Q61Q61J218m506k270k270K35K35k628k628l62l61L873n670o385o60J607J606
$$ -71984 -70347 -69486 -68625 -67407 -71913 -74183 -76453 -76218 -75983 -78611 -81239 -81601 -81962 -78089 -83759 -90144 -90804 -89197 -87591
-7889h7591M827M827M074M078j293p015j473j468J390m331K374K378q46q42L388L392N26N29
$$ -87591 -82764 -77937 -73863 -69785 -71078 -78093 -79566 -81034 -79644 -83975 -81601 -79223 -80069 -80911 -77523 -74131 -73605 -73076
-7871g3076K046K051q17q12l560l556J211J215K13K16m559m555p41p38K478l243Q65Q69N07
$$ -73076 -71030 -68979 -69796 -70608 -74168 -77724 -76513 -75298 -75085 -74869 -79428 -83983 -84724 -85462 -82984 -86227 -85362 -84493 -83986
-7852h3986N10K833K837J282m439l43l39p01o97L533L538O71O74m119m115K95K98L933j790
$$ -83986 -83476 -80643 -77806 -76524 -80963 -81306 -81645 -82346 -83043 -79510 -75972 -75301 -74627 -78746 -82861 -82566 -82268 -78335 -80125
-7833h0125J428J431K35K39L097L101J279J282n401n397j704j699k73k68M111M116K560l161
$$ -80125 -78697 -77266 -77031 -76792 -73695 -70594 -69315 -68033 -73434 -78831 -80535 -82234 -82507 -82775 -78664 -74548 -71988 -75149
-7815g5149k657k654j53j49k13k08k13k08K735K740J186m537J424J428L928L933L21L24L20
$$ -75149 -77806 -80460 -80613 -80762 -80975 -81183 -81396 -81604 -78869 -76129 -74943 -79480 -78056 -76628 -72700 -68767 -68446 -68122 -67802
-7796f7802L25L720L723J812l910j927p653j927j927R95R96j868j867j122j122j122j122k136
$$ -67802 -67477 -63757 -60034 -58222 -62132 -64059 -71712 -73639 -75566 -74571 -73575 -75443 -77310 -78432 -79554 -80676 -81798 -83934
-7778h3934k136K635K636r28r29J935J935K739K740P034J308j823p548j823j822J75J75L396
$$ -83934 -86070 -83435 -80799 -81727 -82656 -80721 -78786 -76047 -73307 -66273 -64965 -66788 -74336 -76159 -77981 -77806 -77631 -74235
-7760g4235k330j182j177J323J327J681J685M186M189k87o008o013k83k57k54J532J536J935
$$ -74235 -76565 -77747 -78924 -77601 -76274 -74593 -72908 -68722 -64533 -64820 -70828 -76841 -77124 -77381 -77635 -76103 -74567 -72632
-7742g2632J938Q018K296J487J491l642l638n520n517K472l251n162n159p49p46M868M872
$$ -72632 -70694 -62676 -60380 -58893 -57402 -61044 -64682 -70202 -75719 -73247 -76498 -81660 -86819 -87568 -88314 -83446 -78574
-7725g8574K005K009M928M932k02j97J588m134r17r13j215j212m078m074l362l359L318L321
$$ -78574 -76569 -74560 -69632 -64700 -64902 -65099 -63511 -67645 -68562 -69475 -70690 -71902 -75980 -80054 -83416 -86775 -83457 -80136
-7707h0136P254P257J886l835L20L25k900k897j110j107j111j107j942j942j942j942j764
$$ -80136 -72882 -65625 -63739 -67574 -67254 -66929 -69829 -72726 -73836 -74943 -76054 -77161 -79103 -81045 -82987 -84929 -86693
-7690h6693j763j763j763j867j868O38O37K009l716l359l358j133j133L638L638j312j312
$$ -86693 -88456 -90219 -91982 -93849 -95717 -95079 -94442 -92433 -96149 -99508 -102866 -103999 -105132 -101494 -97856 -99168 -100480
-7673a00480j670j670Q975L251k177O86K415l310m681m682K042K043N263m62j64j64j416m279
$$ -100480 -102150 -103820 -94845 -91594 -93771 -93085 -90670 -93980 -98661 -103343 -101301 -99258 -93995 -94457 -94621 -94785 -96201 -100480
-7655a00480o42N085L116K53J417j446L42n382P72P71J666J667L544O82j286M440M260j464
$$ -100480 -101122 -96037 -92921 -92668 -91251 -92697 -92355 -97737 -96965 -96194 -94528 -92861 -89317 -88635 -89921 -85481 -81221 -82685
-7637h2685k658k658L24L25L723k001j760J108N516K658k356k352Q65m857j759J107J998p541
$$ -82685 -85343 -88001 -87677 -87352 -83629 -85630 -87390 -86282 -80766 -78108 -80464 -82816 -81951 -86808 -88567 -87460 -85462 -93003
-7619i3003j640M089O26n095R3R7k65k61o82o78K180K184k05k01K658K661K270K274m410m405
$$ -93003 -94643 -90554 -89928 -95023 -94930 -94833 -95098 -95359 -96041 -96719 -94539 -92355 -92560 -92761 -90103 -87442 -85172 -82898 -87308 -91713
-7599i1713j573j573k647k646k707L020O478O478P83P83K214K214m316m317j453j454J353
$$ -91713 -93286 -94859 -97506 -100152 -102859 -99839 -93361 -86883 -86100 -85317 -83103 -80889 -85205 -89522 -90975 -92429 -91076
-7582i1076J353J353J353k046k047K725K725J800J801j420j421J443m283m641J085J409m316
$$ -91076 -89723 -88370 -87017 -89063 -91110 -88385 -85660 -83860 -82059 -83479 -84900 -83457 -87740 -92381 -91296 -89887 -94203
-7565i4203p38p38q2q2K422K423N972K46K870K870J439q104k378k378m682J044N815Q9p15
$$ -94203 -94941 -95679 -95761 -95843 -93421 -90998 -85026 -84780 -81910 -79040 -77601 -85705 -88083 -90461 -95143 -94099 -88284 -88195 -88910
-7546h8910p16P16n010o0n9m18m17l310l310m48m47j647j644j648j644K587K591K587K590
$$ -88910 -89626 -88910 -93920 -93980 -94039 -94457 -94874 -98184 -101494 -101942 -102389 -104036 -105680 -107328 -108972 -106385 -103794 -101207 -98617
-7527i8617J275J279J274J279l109l105m540m536j573j569L198L202J766J771L198L202K900
$$ -98617 -97342 -96063 -94789 -93510 -96619 -99724 -104264 -108800 -110373 -111942 -108744 -105542 -103776 -102005 -98807 -95605 -92705
-7510i2705K904K900K903N316N319K453K456r47r46K631l094J499P224P104J2830Q588Q588
$$ -92705 -89801 -86901 -83998 -78682 -73363 -70910 -68454 -69401 -70347 -67716 -70810 -69311 -62087 -54983 -42153 -33565 -24977
-7493b4977J3718J3716J0466J0467J1540J1541P287J562m164m163j0098j5823j8686j2960
$$ -24977 -11259 2457 12923 23390 34930 46471 53758 55320 51156 46993 36895 21072 2386 -10574
-7479a0574p824p824l052l053m246r971j1402n677j010j010k084k084p71p72l276l277n930
$$ -10574 -18398 -26222 -29274 -32327 -36573 -46544 -57946 -63623 -64633 -65643 -67727 -69811 -70582 -71354 -74630 -77907 -83837
-7462h3837k05k05k05n215N11K061K061J409J409l004l004k826K900M451M450r76r77r77r76
$$ -83837 -84042 -84247 -84452 -89667 -89156 -87095 -85034 -83625 -82216 -85220 -88224 -91050 -88150 -83699 -79249 -80225 -81202 -82179 -83155
-7443h3155J469J468l302l303r95r92J868J871K464K467l98l96l440l437n77n75j979j975
$$ -83155 -81686 -80218 -83520 -86823 -87818 -88810 -86942 -85071 -82607 -80140 -80538 -80934 -84374 -87811 -88388 -88963 -90942 -92917
-7425i2917n48n45l470l466l471l466k576k572k933K795n18n14j592j588j949j946n18n15
$$ -92917 -93465 -94010 -97480 -100946 -104417 -107883 -110459 -113031 -115964 -113169 -113687 -114201 -115793 -117381 -119330 -121276 -121794 -122309
-7407a22309j617j614J245J248L810L813K020K024L333k390l943l940P97Q02j469j465J544
$$ -122309 -123926 -125540 -124295 -123047 -119237 -115424 -113404 -111380 -108047 -110437 -114380 -118320 -117523 -116721 -118190 -119655 -118111
-7390a18111J1089M167j554J096J099P38P42j647j644k721k718l705K024N837N841j006M723
$$ -118111 -107022 -102855 -104409 -103313 -102214 -101476 -100734 -102381 -104025 -106746 -109464 -113169 -111145 -105308 -99467 -100473 -95750
-7373i5750M361M365J558J562J558J562j156j152j513M216J856J860P83P86L116L120j04N625
$$ -95750 -91389 -87024 -85466 -83904 -82346 -80784 -81940 -83092 -84605 -80389 -78533 -76673 -75890 -75104 -71988 -68868 -68972 -63347
-7355f3347l176l172J953J957K043K046m62m59n054O74L14L16Q149Q148Q148Q149M241M242
$$ -63347 -66523 -69695 -67742 -65785 -63742 -61696 -62158 -62617 -67671 -66997 -66683 -66367 -58218 -50070 -41922 -33773 -29532 -25290
-7337b5290J022O746Q984Q982J1369J1368J4381K3923K7978K7979L1639M4998N4063O3606
$$ -25290 -24268 -17522 -8538 444 11813 23181 37562 61485 89463 117442 149081 194079 248142 311748
-7323C11748O9331O9331O3248N7523L7275J6281m234k5228m2881n6240o7810o7811o3456n7728
$$ 311748 381079 450410 513658 571181 608456 624737 620503 595275 552394 496154 428344 360533 297077 239349
-7309B39349n1171m1624l4949k1586j7653j7650j5208r479j3061p332m712m708p215p213r371
$$ 239349 188178 146554 111605 90019 72366 54716 39508 30029 16968 9636 4924 216 -6999 -14212 -23583
-7294b3583r367r967m21J006J010r02q98l288K442K080K083L691L694k393k390n643L903K109
$$ -23583 -32950 -42917 -43338 -42332 -41322 -42224 -43122 -46410 -43968 -41888 -39805 -36114 -32420 -34813 -37203 -42846 -38943 -36834
-7276c6834l612r400l672m391m387r7r3m511m506n703K6N390N394j760j755J699P429N517
$$ -36834 -40446 -49846 -53518 -57909 -62296 -62393 -62486 -66997 -71503 -77206 -77180 -71790 -66396 -68156 -69911 -68212 -60783 -55266
-7258e5266N520m622m618l996l992k445L284N606N610k267k262k490L235J5J5l742l743o247
$$ -55266 -49746 -54368 -58986 -62982 -66974 -69419 -66135 -60529 -54919 -57186 -59448 -61938 -58703 -58688 -58673 -62415 -66158 -72405
-7240g2405o247l743J983L534L534L175L176L13L13j4j5P00n024m727R99M101M100J058J059
$$ -72405 -78652 -82395 -80412 -76878 -73344 -70169 -66993 -66680 -66367 -66381 -66396 -65696 -70720 -75447 -74448 -70347 -66247 -65189 -64130
-7221f4130J059J058Q80Q80L742L742K807K811n6n2n424n420q286q282l128l123N460N465
$$ -64130 -63071 -62013 -61133 -60253 -56511 -52769 -49962 -47151 -47207 -47259 -52683 -58103 -66389 -74671 -77799 -80922 -75462 -69997
-7203f9997N341N346Q204Q208M402M406j920j916l351K378q46q42J822J827K180K185L075
$$ -69997 -64656 -59310 -51106 -42898 -38496 -34090 -36010 -37926 -41277 -38899 -39745 -40587 -38765 -36938 -34758 -32573 -29498
-7186b9498Q804N580N584j30j31o452o452n737j1l232l232m73m73K389K389L523L522l157
$$ -29498 -20694 -15114 -9530 -9660 -9791 -16243 -22695 -28432 -28443 -31675 -34907 -35380 -35853 -33464 -31075 -27552 -24030 -27187
-7168b7187l157j234j234j591M133P713P712M849M850J986l738p198j2923j4653n110L477
$$ -27187 -30344 -31578 -32812 -34403 -30270 -22557 -14845 -9996 -5146 -3160 -6898 -14096 -27019 -41672 -46782 -43305
-7152d3305L478N379N379N378N379J1J2k852k852n952n953n953n953j301j300J561J562K211
$$ -43305 -39827 -34448 -29069 -23691 -18312 -18301 -18289 -21141 -23993 -29945 -35898 -41851 -47804 -49105 -50405 -48844 -47282 -45071
-7134d5071K210K210K211O266O266N908N908L433k293j576j577k949K777L970L970J0503M782
$$ -45071 -42861 -40651 -38440 -32174 -25908 -20000 -14092 -10659 -12952 -14528 -16105 -19054 -16277 -12307 -8337 2166 6948
-7117F948L228L232M659M663M660M663K781K784K781K784l780l776r16r14J506J510j596p317
$$ 6948 10176 13408 18067 22730 27390 32053 34834 37618 40399 43183 39403 35627 34711 33797 35303 36813 35217 27900
-7099B7900n710J9P291P294J4269J9998J6774J6777R438R442O575O579J3471J3471J0609J0608
$$ 27900 22190 22209 29500 36794 51063 71061 87835 104612 114050 123492 130067 136646 150117 163588 174197 184805
-7083A84805N599N598N599N599M99N00J096J095P478J7019K8113L3838L4830K9104K9462L5187
$$ 184805 190404 196002 201601 207200 207699 208199 209295 210390 217868 234887 263000 296838 331668 360772 390234 425421
-7067D25421L4055L4054M3716N7075O4888P4430Q1349R4708J09737J23096J46475J67469J84033
$$ 425421 459476 493530 537246 594321 659209 733639 814988 909696 1019433 1142529 1289004 1456473 1640506
-7054A640506J97396K16000K48448L03551L66534M41677N23745O33299Q03156J035987J362338
$$ 1640506 1837902 2053902 2302350 2605901 2972435 3414112 3937857 4571156 5374312 6410299 7772637
-7043G772637J833369K537598L599181N043898O655856P554751O062080J212669m293994o960117
$$ 7772637 9606006 12143604 15742785 20786683 27442539 34997290 41059370 42272039 37978045 31017928
-7033C1017928o928395n781402m432892l236277k310196j625051j133624p72919n02875l02481
$$ 31017928 24089533 18308131 13875239 10638962 8328766 6703715 5570091 4797172 4294297 3991816
-7023C991816j60625p0927n7566j51083k94098l60895l45865l05788k61595k13882j72374
$$ 3991816 3831191 3760264 3702698 3551615 3257517 2896622 2550757 2244969 1983374 1769492 1597118
-7012A597118j36113j09752q8759p3491o7765p2731o7005n9371n3646l8856j7862Q65Q65o978
$$ 1597118 1461005 1351253 1262494 1189003 1121238 1048507 981502 922131 868485 829629 811767 812632 813497 806519
-6998H06519k7971m7652n3378n2661m3120l3577k7852k2473j6744k0922l0461l9411l9407
$$ 806519 778548 730896 677518 624857 581737 548160 520308 497835 481091 460169 429708 390297 350890
-6985C50890l0941j7579l627K102N558N561L530r825j8179j8176j3623p895q257q252J53J56
$$ 350890 319949 302370 298743 300845 306403 311964 315494 305669 287490 269314 255691 247796 239539 231287 231440 231596
-6969B31596J0888J6617J4824R103J2081J2084J2856L318o467o464M268K1444K8005J8462
$$ 231596 242484 259101 273925 283028 295109 307193 320049 323367 316900 310436 314704 336148 364153 382615
-6955C82615l127k7938l5571k9846j4996r270o169m44K0371K9913K7050J3692J621p921q756
$$ 382615 379488 351550 315979 286133 271137 261867 255698 255254 275625 305538 332588 346280 347901 339980 331224
-6940C31224P87J5159J5160J2536J8260K4375K4373K9504J9960O721k822k702J0657K8492
$$ 331224 332011 347170 362330 374866 393126 417501 441874 471378 491338 498059 495237 492535 503192 531684
-6926E31684K8497M3641M3645M2032M2034M2747M2751M8203N9659O4426O4429N7448L8367
$$ 531684 560181 603822 647467 689499 731533 774280 817031 865234 924893 989319 1053748 1111196 1149563
-6913A149563L1683K0237K0337K0341P216j1864j3777k322K8209P7834J41167J75523J79814
$$ 1149563 1181246 1201483 1221820 1242161 1249377 1237513 1223736 1221414 1249623 1327457 1468624 1644147 1823961
-6900A823961J60733J31982J20536J19578J31032J74222K54382L25469L67459M09918M82445
$$ 1823961 1984694 2116676 2237212 2356790 2487822 2662044 2916426 3241895 3609354 4019272 4501717
-6889D501717N56870O37030P49149Q75113R72440J044965J132990J297123J543788J799527
$$ 4501717 5058587 5695617 6444766 7319879 8292319 9337284 10470274 11767397 13311185 15110712
-6879A5110712K069871K440117L037465L980253N335023P232047J0014593J4217047K0425841
$$ 15110712 17180583 19620700 22658165 26638418 31973441 39205488 49220081 63437128 83862969
-6870H3862969K8620803L6800041L8948988K6038630j767755k7314544l7158442l4897592
$$ 83862969 112483772 149283813 188232801 214271431 212503676 185189132 148030690 113133098
-6862A13133098k8267547k1243910j5316200j0846087p628398n327743l690274k541021j750909
$$ 113133098 84865551 63621641 48305441 37459354 29830956 24503213 20812939 18271918 16521009
-6853A6521009j289063j094396j056350j083064j079729j007203r01256q28730p71004o90844
$$ 16521009 15231946 14137550 13081200 11998136 10918407 9911204 9009948 8181218 7410214 6719370
-6843F719370o13316n40790m65768l85607l20277l14547l25644l06556k74592k32602j79646
$$ 6719370 6106054 5565264 5099496 4713889 4393612 4079065 3753421 3446865 3172273 2939671 2760025
-6832B760025j30022q2970o3885q6788j21139j50005j69090j69089j57639j32561j21109j17770
$$ 2760025 2630003 2547033 2483148 2396360 2275221 2125216 1956126 1787037 1629398 1496837 1375728 1257958
-6820A257958j06319p9958o0874l6302k4851k3680k3681k7736k7736k0699k0699m834m835
$$ 1257958 1151639 1071681 1010807 974505 949654 925974 902293 874557 846821 826122 805423 800589 795754
-6807G95754m655j0382k0758l2209l2328l2329k4456k4456j9793j9793j3113j3113j5201j5201
$$ 795754 791099 780717 759959 727750 695422 663093 638637 614181 594388 574595 561482 548369 533168 517967
-6793E17967j1980j7705k1523k1522j2696o971Q238Q238K035j5141k1142k1142k3290l6648
$$ 517967 505987 488282 466759 445237 432541 425570 433808 442046 444081 428940 407798 386656 363366 326718
-6779C26718m2255m2255j9591J401J5596J5596J2136O412J0109J9651K2872K2871K3122K8851
$$ 326718 284463 242208 222617 224018 239614 255210 267346 273758 283867 303518 326390 349261 372383 401234
-6765D01234L8985M4715M4831N0559P1072J03520J55492K26109L26777M69916O38215P05016
$$ 401234 440219 484934 529765 580324 651396 754916 910408 1136517 1463294 1933210 2571425 3276441
-6753C276441M76473o7438n28568o67883n97988m85385l77560k84042k03889j40907q8576
$$ 3276441 3752914 3685476 3156908 2489025 1891037 1405652 1028092 744050 540161 399254 310678
-6742C10678n9945l3469j6289r136j4858j7843k3566k1734k1735j3505j3505j4995j4996j4996
$$ 310678 250733 217264 200975 191839 176981 159138 135572 113838 92103 78598 65093 50098 35102 20106
-6728B0106j4995j7589j7590j4131q406o198o199O206O206J2968P243J0701J159j822p548
$$ 20106 5111 -12478 -30068 -44199 -52605 -58803 -65002 -58796 -52590 -39622 -32379 -21678 -20519 -22341 -29889
-6713b9889l732J995L574k151j077j077j435M290J3714J9437K2623J6896O75k4136k8130l3857
$$ -29889 -33621 -31626 -28052 -30203 -31280 -32357 -33792 -29502 -15788 3649 26272 43168 43843 19707 -8423 -42280
-6697d2280l5049k9324j6800j1074j890j890o124j1850M36J7613L7688M7231M3414K6237J2998
$$ -42280 -77329 -106653 -123453 -134527 -136417 -138307 -144431 -156281 -155845 -138232 -100544 -53313 -9899 16338 29336
-6682B9336L455j435p161p667p668j0886j0888p191p190q69q68j036o762o046L496J1131J1130
$$ 29336 32791 31356 24195 16528 8860 -2026 -12914 -20105 -27295 -28164 -29032 -30068 -36830 -42876 -39380 -28249 -17119
-6665a7119J4231J4231J8108J2383J7631J7631K959j0399j4694q968o031o031m004N539J7587
$$ -17119 -2888 11343 29451 41834 59465 77096 80055 69656 54962 45994 39963 33932 29928 35467 53054
-6650E3054K3311K6532K6533K3639J0281j1429l2421m0056m0055k5027j1667k318k314p925
$$ 53054 76365 102897 129430 153069 163350 151921 119500 79444 39389 14362 2695 377 -1937 -9862
-6636i862k195N44n177m466m462n59n55N524j98k408k404M55n267k184k181k184p906m55m51
$$ -9862 -12057 -11513 -16690 -21156 -25618 -26177 -26732 -21208 -21406 -23814 -26218 -25763 -31030 -33214 -35395 -37579 -45485 -45940 -46391
-6617d6391q13q08J319J323J678J681j961L769N911l626p071p068q025k296K948K952j464
$$ -46391 -47204 -48012 -46693 -45370 -43692 -42011 -43972 -40203 -34292 -37918 -44989 -52057 -60082 -62378 -59430 -56478 -57942
-6600e7942j462M991M995M991M995L858L862Q629Q633J062J066J659p880j5875j5872q838
$$ -57942 -59404 -54413 -49418 -44427 -39432 -35574 -31712 -23083 -14450 -13388 -12322 -10663 -18543 -34418 -50290 -59128
-6584e9128l109m0N688R501R505Q368Q372J2185O464m10R131J5812J5812J0623J0624J081
$$ -59128 -62237 -62277 -56589 -47088 -37583 -29215 -20843 -8658 -2194 -2604 6527 22339 38151 48774 59398 60479
-6568F0479m645q044j3769j7586j7586j0131j0131j0131j0132r39r39l802l802k729k728n592
$$ 60479 55834 47790 34021 16435 -1151 -11282 -21413 -31544 -41676 -42615 -43554 -47356 -51158 -53887 -56615 -62207
-6552f2207n591n114n114n114n114O217O218O217O217M895M898K389K393l515K214J853J856
$$ -62207 -67798 -72912 -78026 -83140 -88254 -82037 -75819 -69602 -63385 -58490 -53592 -51203 -48810 -52325 -50111 -48258 -46402
-6535d6402J420J424l590r311j1700n972J182O910Q630K907j98j93L679L682L679L683l17
$$ -46402 -44982 -43558 -47148 -56459 -68159 -74131 -72949 -66039 -57409 -54502 -54700 -54893 -51214 -47532 -43853 -40170 -40487
-6518d0487l13l776r497n983n979L39L43k661k658l615N930M376j346o120o117l452l447q223
$$ -40487 -40800 -44576 -54073 -60056 -66035 -65696 -65353 -68014 -70672 -74287 -68357 -63981 -65327 -71447 -77564 -81016 -84463 -92686
-6500i2686q219j0609j0604n838n833q767q764q767P79J4135K3681J9502R963N338N342J878
$$ -92686 -100905 -111514 -122118 -127956 -133789 -142556 -151320 -160087 -159308 -145173 -121492 -101990 -92027 -86689 -81347 -79469
-6484g9469J883n040n036j819j815p846k117L843R572P302P306M797M801m566m563n759L788
$$ -79469 -77586 -82626 -87662 -89481 -91296 -99142 -101259 -97416 -87844 -80542 -73236 -68439 -63638 -68204 -72767 -78526 -74738
-6467g4738j53r692j3273p545o407o79N640J1369J2796J2800Q384Q386N11N14J53N882O236
$$ -74738 -74891 -84583 -97856 -105401 -111808 -112487 -106847 -95478 -82682 -69882 -61498 -53112 -52601 -52087 -51934 -46052 -39816
-6450c9816O240j398M332R087R088J6482K6025K1075K1075J4396Q670N867N867O106O105P120
$$ -39816 -33576 -34974 -30642 -21555 -12467 4015 30040 51115 72190 86586 95256 101123 106990 113096 119201 126321
-6434A26321J6662K4892L0617L2355M1897N4540P5534R0921J19547J43643J83720K27018K78547
$$ 126321 142983 167875 198492 230847 272744 327284 402818 493739 613286 756929 940649 1167667 1446214
-6421A446214L17194L45821L48564L19937K55765J73701N9207n3389j50366k32427k90162
$$ 1446214 1763408 2109229 2457793 2777730 3033495 3207196 3266403 3213014 3062648 2830221 2540059
-6410B540059k90159k69526k21812j55942r2960l9765L17J8086K3815J8801J629k7412n2218
$$ 2540059 2249900 1980374 1758562 1602620 1509660 1469895 1470212 1488298 1512113 1530914 1532543 1505131 1452913
-6397A452913q9199j10188j21165j15437r8979o6532l6954m507K1731L8912M2008L6287J2189
$$ 1452913 1363714 1253526 1132361 1016924 917945 851413 814459 809952 831683 870595 912603 948890 961079
-6384I61079m984k6580l9937o2364q3354r8983r3254q7056p7509n9293l0662j6830p283j0389
$$ 961079 956095 929515 889578 827214 743860 644877 551623 464567 387058 327765 297103 280273 272990 262601
-6370B62601j9927l0666k4937k2413r050p623j7161k6231k0501j8835r289p145j417k493L235
$$ 262601 242674 212008 187071 164658 155608 147985 130824 104593 84092 65257 55968 48823 47406 44913 48148
-6355D8148l507l504p563p560q864l138o001o002r280l556l318K408k750k751p165p164j3367
$$ 48148 44641 41137 33574 26014 17150 14012 8011 2009 -7271 -10827 -14145 -11737 -14487 -17238 -24403 -31567 -44934
-6338d4934j3366j5156j5156q775Q402J0549J0549m481j4023k8932j9391n375J5618K0271
$$ -44934 -58300 -73456 -88612 -97387 -88985 -78436 -67887 -72368 -86391 -115323 -134714 -140089 -124471 -104200
-6324a04200K0270J245m481q894l168p507j778q28o549j2934l388N196N199j71j68q521j4242
$$ -104200 -83930 -82685 -87166 -96060 -99228 -106735 -108513 -109341 -115890 -128824 -132212 -127016 -121817 -121988 -122156 -130677 -144919
-6307a44919j3412m8J6527K2257J3382J3385L243L247k483k479L005J2550R162J4892R400
$$ -144919 -158331 -158379 -141852 -119595 -106213 -92828 -89585 -86338 -88821 -91300 -88295 -75745 -66583 -51691 -42291
-6292d2291R405N106N111J0355K3717K6819L2548K4672J1317j3855k3394k6498k0770k3202
$$ -42291 -32886 -27780 -22669 -12314 11403 38222 70770 95442 106759 92904 69510 43012 22242 -960
-6278i60j7475j6643j6640k2487r125J0671L1669L4968L4970J2543m630k4553k4548j3698
$$ -960 -18435 -35078 -51718 -74205 -83330 -72659 -40990 -6022 28948 41491 36861 12308 -12240 -25938
-6264b5938l36J1678L2675L6965L1244J2632O911p168j439M764J4306J5976J5976O076O075
$$ -25938 -26274 -14596 18079 55044 86288 98920 105831 98663 97224 101988 116294 132270 148246 154322 160397
-6249A60397m420m421p015p015j5246j5245j2621o896k721J0638J8622K8165K0173J4448R438
$$ 160397 155977 151556 144541 137526 122280 107035 94414 87518 84797 95435 114057 142222 162395 176843 186281
-6234A86281R438J1943J1943K341K341q514q514k3960k9686l2667j9308q190J2808Q510Q513
$$ 186281 195719 207662 219605 221946 224287 215773 207259 183299 153613 120946 101638 93448 106256 114766 123279
-6219A23279L799L802m432m429j211M518L202Q931Q211J3941l239l236q241q238j0746j0743
$$ 123279 127078 130880 126448 122019 120808 125326 128528 137459 145670 159611 156372 153136 144895 136657 125911 115168
-6203A15168j4682q954k1600k1598j6859L21M730J0459J5943L3122L1926L7655K8869J1693
$$ 115168 100486 91532 69932 48334 31475 31796 36526 46985 62928 96050 127976 165631 194500 206193
-6189B06193k501j2043k6775k6774k1646q286MJ3363P041P041R904J5629J0859N132j3407
$$ 206193 203692 191649 164874 138100 116454 108168 108172 121535 128576 135617 145521 161150 172009 177141 163734
-6174A63734j3408j3169j3170k1578j2036J1104M3548N1451N1450L7018J9841L321k404o340
$$ 163734 150326 137157 123987 102409 90373 101477 145025 196476 247926 284944 304785 308106 305702 299362
-6160B99362L202K452q994l1542m2989m7347k8258o791J9931L1229N0317J01126J66019K11221
$$ 299362 302564 305016 296022 264480 221491 174144 145886 139095 159026 190255 240572 341698 507717 718938
-6146G18938K11225J39416N1629m1114j05999j23178j11724q3219o4132o8429n6974l9117
$$ 718938 930163 1069579 1121208 1080094 974095 850917 739193 655974 591842 523413 466439 427322
-6134D27322j2393K0762P0386J02587J02592O3702K9354r725k8806l6920j7833r605J849j018
$$ 427322 414929 435691 506077 608664 711256 774958 804312 794587 765781 728861 711028 701423 703272 702254
-6120G02254j2465j4913l460J8008N2364Q1046J00135J00609Q1527N4984K8270p996l4710
$$ 702254 689789 674876 671416 689424 741788 822834 922969 1023578 1105105 1160089 1188359 1180363 1145653
-6107A145653l7756k6301k6663l2384k9406k684K1884L3339L5482K9760K5104K5109L1337
$$ 1145653 1107897 1081596 1054933 1022549 993143 990459 1012343 1045682 1081164 1110924 1136028 1161137 1192474
-6094A192474L1340L3126L8856L1098M384m0112j04995j66429j66424j03211k3050L3603P5593
$$ 1192474 1223814 1256940 1295796 1326894 1331278 1291166 1186171 1019742 853318 750107 727057 760660 836253
-6081H36253R9684R9688M6843j8041n0846l1759l612r333k9496k9492k6155p067N1256Q5613
$$ 836253 935937 1035625 1082468 1064427 1013581 981822 978210 968877 939381 909889 883734 876667 927923 1013536
-6067A013536P5112O9391Q6086R1816O7422J0173k9790j0702O3486J28379J14061J1007j20741
$$ 1013536 1088648 1158039 1244125 1335941 1403363 1413536 1383746 1373044 1436530 1564909 1678970 1689977 1569236
-6054A569236k08526j91354j03561j8876P847L1221J11381J81111J62030P3401o750l5143
$$ 1569236 1360710 1169356 1065795 1046919 1054766 1085987 1197368 1378479 1540509 1613910 1607160 1572017
-6042A572017k9414P202K6290K3811J2364L7170R4429J39154J20073J02059R0611M7432p913
$$ 1572017 1542603 1549805 1576095 1599906 1612270 1649440 1743869 1883023 2003096 2105155 2195766 2243198 2235285
-6029B235285j5428N565O6875J52755K23728K23727J85319J33791J04209J04209J80906K66787
$$ 2235285 2219857 2225422 2292297 2445052 2668780 2892507 3077826 3211617 3315826 3420035 3600941 3867728
-6017C867728L26546L17003K74272J92208J33045P7699O6368M5374l1679j25195j33634o6838
$$ 3867728 4194274 4511277 4785549 4977757 5110802 5188501 5254869 5300243 5268564 5143369 5009735 4942897
-6005D942897J34268M10996P12295Q40163Q04857O54087N02245L55292L01616L37878O09595
$$ 4942897 5077165 5488161 6200456 7040619 7845476 8499563 9001808 9357100 9658716 9996594 10606189
-5994A0606189J027552J327897J375608J549488J852934K206241K574573L148907L761524
$$ 10606189 11633741 12961638 14337246 15886734 17739668 19945909 22520482 25669389 29430913
-5985B9430913M158961M214308M399064N057489O273182P450709Q324195R295597J1637293
$$ 29430913 33589874 37804182 42203246 47260735 53533917 60984626 69308821 78604418 90241711
-5976I0241711J5837846K1728095K9829563M2179733O1835062R3050259J37424091J85231734
$$ 90241711 106079557 127807652 157637215 199816948 261652010 354702269 492126360 677358094
-5968F77358094K00955626J21686280m7810904j66822532j82592251j54611184j17554423
$$ 677358094 878313720 1000000000 952189096 785366564 602774313 448163129 330608706
-5961C30608706q3404271n6363129l7117419k3069163j2404404l092966O027134J6197370
$$ 330608706 247204435 190841306 153723887 130654724 118250320 115157354 121184488 137381858
-5953A37381858K5858776K9906621J6921371j2283946l1178538l1371269k5219934j8568904
$$ 137381858 163240634 193147255 210068626 197784680 166606142 135234873 110014939 91446035
-5945I1446035j2912198q074224m070440m95856L111370P617279J3604870K2301755L4460869
$$ 91446035 78533837 70459613 66389173 65893317 69004687 76621966 90226836 112528591 146989460
-5936A46989460M7665578N1382055K6444077k0838274m8169490m7860307l8323689k8165611
$$ 146989460 194655038 246037093 272481170 251642896 203473406 155613099 117289410 89123799
-5928H9123799j9697724j3361163q694948m998960j703029J322612L629951L728477r8009
$$ 89123799 69426075 56064912 47369964 42371004 40667975 41990587 45620538 49349015 49251006
-5919D9251006m942382o577942o060027n031365m000077l105001k501688j992127j573425
$$ 49251006 44308624 37730682 31670655 26639290 22639213 19534212 17032524 15040397 13466972
-5910A3466972j208908r46016o69288m90488m73312o08097o71077o79189n78038m46355l10853
$$ 13466972 12258064 11312048 10642760 10152272 9678960 9070863 8399786 7720597 7142559 6696204 6385351
-5899F385351k25807j24659j27401j86565k64841k64841k76411k82137l20425k99433k60786
$$ 6385351 6159544 6034885 5907484 5720919 5456078 5191237 4914826 4632689 4312264 4012831 3752045
-5888C752045j59637p2555j3393n2277r2357j02613q9255j70364k67697l13858k35610j17047
$$ 3752045 3592408 3519853 3506460 3454183 3361826 3259213 3169958 2999594 2731897 2418039 2182429 2065382
-5876B065382J4638M6128O050p7923j02733p8527j5548q152J391j6860L17J7493M134o1440
$$ 2065382 2080020 2126148 2132198 2054275 1951542 1873015 1857467 1849315 1850706 1833846 1834163 1851656 1855790 1794350
-5862A794350q2433p5515m6888m9751n5476j05812j22988q2635K2332P3621P9347M1774K8414
$$ 1794350 1711917 1636402 1589514 1539763 1484287 1378475 1255487 1172852 1195184 1268805 1348152 1389926 1418340
-5849A418340k4068j29034k59824k92268k39308j30526m3212K3584K3583O408j2070N111Q685
$$ 1418340 1394272 1265238 1005414 713146 473838 343312 300100 323684 347267 353675 341605 346716 355401
-5836C55401Q688m912m909l005O542k9365n0355n7753l6757l6045k6498k6741n744r25K0073
$$ 355401 364089 359177 354268 351263 357805 328440 278085 220332 183575 147530 121032 94291 88547 87622 107695
-5821A07695L1877M1424L8586L8591K3438K449m4014p2637q0275l6377j5059j696q498q495
$$ 107695 139572 180996 219582 258173 281611 284060 240046 167409 87134 50757 35698 34002 25504 17009
-5807A7009j5320j960R131L3943M4081O1258L6447P820l1751n2743p1710o5983o1809o1809
$$ 17009 1689 -271 8860 42803 86884 148142 184589 192409 160658 107915 36205 -29778 -91587 -153396
-5793a53396r1987j12980j27069q6992j6617Q4531J86158K37687K11682J52522P0844J9316
$$ -153396 -245383 -358363 -485432 -572424 -589041 -504510 -318352 -80665 131017 283539 354383 373699
-5781C73699j0504k3864m3663n3206p0621o4896n9837l8844k3337o161J0895L1888M5486N8846
$$ 373699 363195 339331 295668 242462 171841 106945 47108 8264 -15073 -21234 -10339 21549 67035 125881
-5767A25881N4880O0605M3667J5041k0863l8039m1975l6250n2464n2464m6143j7514O458L8904
$$ 125881 180761 241366 285033 300074 279211 241172 199197 162947 110483 58019 11876 -5638 820 39724
-5753C9724N0355N6080M6000M0276K1668M491j6263k1988k6998j7456j0467O710K1023L0565
$$ 39724 90079 146159 192159 232435 254103 258594 242331 220343 193345 175889 165422 172132 193155 223720
-5739B23720K1381Q021l906J819m771j4314k0397j4671k0098k0099j9741j9741j6557j6558
$$ 223720 245101 253122 249216 251035 246264 231950 211553 196882 176784 156685 136944 117203 100646 84088
-5725H4088j7273r7J2189J7915J5767J5767K199K199r609r609j2651l109M69J0012Q171Q174
$$ 84088 66815 66718 78907 96822 112589 128356 130555 132754 123145 113536 100885 97776 98245 108257 116428 124602
-5709A24602L996M000L399L404J133J137R005J8552J1630N908k088k083n308n305l913l911
$$ 124602 128598 132598 135997 139401 140534 141671 150676 169228 180858 186766 184678 182595 177287 171982 168069 164158
-5693A64158j8227j8224k1090k1086k0136k5857k4013j4466k064k061K586K590P358J3087
$$ 164158 145931 127707 106617 85531 65395 39538 15525 1059 -1005 -3066 -480 2110 9468 22555
-5679B2555J3128L586q342j4067j0370O806K2313L1855L0603K1060P939j602j8183k7725j9853
$$ 22555 35683 39269 30927 16860 6490 13296 35609 67464 98067 119127 127066 125464 107281 79556 59703
-5664E9703J141J7519K7062K5391J2033o278j2002j6297j6296k5094k5093k4258k4258k1097
$$ 59703 60844 78363 105425 130816 142849 136571 124569 108272 91976 66882 41789 17531 -6727 -27824
-5650b7824p739O337K7330L9443L9448K4892L903j5305j5301j2801l254Q700J8246J0728o445
$$ -27824 -35563 -29226 -1896 37547 76995 101887 105790 90485 75184 62383 59129 67829 86075 96803 90358
-5635I0358j2293j2290p879N483J6661K6208L4435L4438K1910k896j7691j7687j2412R50Q820
$$ 90358 78065 65775 57896 63379 80040 106248 140683 175121 197031 194135 176444 158757 146345 147295 156115
-5620A56115Q823l706j7060j7780q234R031R032O765J040m327N215J4995K4538J8276J100
$$ 156115 164938 161232 144172 126392 118158 127189 136221 142986 144026 139699 144914 159909 184447 202723 203823
-5605B03823j3930k3472k3472j0112L723R449Q615r28m149m149m685j0411j0053j0053n118
$$ 203823 189893 166421 142949 132837 136560 146009 154624 153696 149547 145398 140713 130302 120249 110196 105078
-5590A05078n118n118n118n475n476n476n475m410m406p272p269q882q879k442J0922J6211
$$ 105078 99960 94842 89724 84249 78773 73297 67822 63412 59006 51734 44465 35583 26704 24262 35184 51395
-5574E1395J0489J539m182j0865j0862m89N241K956k766r330r326j0045m317J048J051J345
$$ 51395 61884 63423 59241 48376 37514 37025 42266 45222 42456 33126 23800 13755 9438 10486 11537 12882
-5558A2882J350l426l422k709k707M209R937Q950L228K031l690l575N972Q234Q238Q741p98
$$ 12882 14232 10806 7384 4675 1968 6177 16114 25064 28292 30323 26633 23058 29030 37264 45502 54243 53445
-5541E3445n931n926p780p775k650k647K509Q238Q234K512k203k199O385J5931J9715J9718
$$ 53445 47514 41588 33808 26033 23383 20736 23245 31483 39717 42229 40026 37827 44212 60143 79858 99576
-5525I9576J3632J3635J3393J3396K2697L2242M0239M5963N5506O1231P2325Q9500J24330
$$ 99576 113208 126843 140236 153632 176329 208571 248810 294773 350279 411510 483835 573335 697665
-5512F97665J64408K08482K52377K96033L28476L46727L33367K86133K11702J12469j5398
$$ 697665 862073 1070555 1322932 1618965 1947441 2294168 2627535 2913668 3125370 3237839 3222441
-5501C222441j38972k36303l06082l42343l33755l08945k61740k06394j51288r5941m9900
$$ 3222441 3083469 2847166 2541084 2198741 1864986 1556041 1294301 1087907 936619 840678 790778
-5490G90778j3639O400J2126J3560K05j6498l3670m3216n6572n5622m9892l8207k8660l139
$$ 790778 777139 783539 795665 809225 809430 792932 759262 716046 659474 603852 553960 515753 487093 483954
-5476D83954J7858L9683O0680P3081P8810P7703N2897K9037M13k9648n8272p5213q8568q7469
$$ 483954 501812 541495 602175 675256 754066 831769 884666 913703 914116 884468 826196 750983 662415 574946
-5462E74946q1740p2202o2655m4528l1166k0195j0650j0701k0244k2630l2172k5492j5950
$$ 574946 493206 421004 358349 313821 282655 262460 251810 241109 220865 198235 166063 140571 124621
-5449A24621j1417j1417q644q645M000R725J3542P817M118j606n021n021n021j0746j3013
$$ 124621 113204 101787 93143 84498 88498 98223 111765 119582 123700 122094 117073 112052 107031 96285 83272
-5434H3272j3012q600q599l351l351n48K315L925j801n438n438r77o702o344o344n927n927
$$ 83272 70260 61660 53061 49710 46359 45811 48126 52051 50250 44812 39374 38397 31695 25351 19007 13080 7153
-5417G153n926n926k617k617K155K155O089O091O687k855p31p30J714m011p946j0809j2778
$$ 7153 1227 -4699 -7316 -9933 -7778 -5623 466 6557 13244 10389 9658 8928 10642 6631 -1315 -12124 -24902
-5400b4902p052J237J238K847j5R40m786j745j744J882J886M745M749o169o165l127l124k054
$$ -24902 -31954 -30717 -29479 -26632 -26647 -25707 -30493 -32238 -33982 -32100 -30214 -25469 -20720 -26889 -33054 -36181 -39305 -41359
-5382d1359Q13N103o19J882r76L134L139O758O762O758J036m514j0236o124l258k307k304
$$ -41359 -40546 -35443 -36062 -34180 -35156 -32022 -28883 -22125 -15363 -8605 -7569 -12083 -22319 -28443 -31701 -34008 -36312
-5365c6312K285K289J032m689l440n74k229p951m555m551R91R95M212j509j290j286m689m686
$$ -36312 -34027 -31738 -30706 -35395 -38835 -39409 -41638 -49589 -54144 -58695 -57704 -56709 -52497 -54006 -55296 -56582 -61271 -65957
-5347f5957m868p727k482L246O688R553R550O691R550L828L407k315m481m476m839m834L50
$$ -65957 -70825 -78552 -81034 -77788 -71100 -61547 -51997 -45306 -35756 -31928 -28521 -30836 -35317 -39793 -44632 -49466 -49116
-5330d9116L54J305q234n822r4K766K770l95l92K408N275P417J696k244n103r31o654q446
$$ -49116 -48762 -47457 -55691 -61513 -61607 -58841 -56071 -56466 -56858 -54450 -49175 -41758 -40062 -42306 -47409 -48340 -54994 -63440
-5312f3440n581j796p518m123J606N361J1089J1085N364Q581K859K080l642m361p220j379
$$ -63440 -69021 -70817 -78335 -82458 -80852 -75491 -64402 -53317 -47953 -39372 -36513 -34433 -38075 -42436 -49656 -51035
-5296e1035j376L62k498k441q163k859k856l216l214o97o93o97o93J092J096j771j767l679
$$ -51035 -52411 -52049 -54547 -56988 -65151 -68010 -70866 -74082 -77296 -77993 -78686 -79383 -80076 -78984 -77888 -79659 -81426 -85105
-5278h5105l675q16q13J98K01J98K01M029M033O893O895K72K76m499m495l62l57K501K505
$$ -85105 -88780 -89596 -90409 -90211 -90010 -89812 -89611 -85582 -81549 -74656 -67761 -67489 -67213 -71712 -76207 -76569 -76926 -74425 -71920
-5259g1920k509k505k509k504J457J461J458J461K352K356K352K355k121k117P42P46Q793
$$ -71920 -74429 -76934 -79443 -81947 -80490 -79029 -77571 -76110 -73758 -71402 -69050 -66695 -68816 -70933 -70191 -69445 -60652
-5242f0652Q797K0840K0844J6665J0943O766k773r159j4879j2260j2256q923q924m152m153
$$ -60652 -51855 -31015 -10171 6494 17437 24203 21430 12271 -2608 -14868 -27124 -36047 -44971 -49123 -53276
-5227e3276N59N60N59N59J722J722J722J722k035k035k035k036M145M145J283J282k833k833
$$ -53276 -52717 -52157 -51598 -51039 -49317 -47595 -45873 -44151 -46186 -48221 -50256 -52292 -48147 -44002 -42719 -41437 -44270 -47103
-5209d7103J938J939K176K177m502m503n636n636n278n278l709K020L567L571M462M466j860
$$ -47103 -45165 -43226 -41050 -38873 -43375 -47878 -53514 -59150 -64428 -69706 -73415 -71395 -67828 -64257 -59795 -55329 -57189
-5192e7189j857q46M883M522M525J0724J0727R412j27r441r438p176p171j629j625j629j625
$$ -57189 -59046 -59892 -55009 -50487 -45962 -35238 -24511 -15099 -15226 -24667 -34105 -41281 -48452 -50081 -51706 -53335 -54960
-5175e4960N47N52L411L414M961M965l626l624l880l876l523l519j971L757L753j968j465
$$ -54960 -54413 -53861 -50450 -47036 -42075 -37110 -40736 -44360 -48240 -52116 -55639 -59158 -61129 -57372 -53619 -55587 -57052
-5158e7052j461J040J044l32l28l194l191l76l73M394M399k822k818k822k817n26n22j241
$$ -57052 -58513 -57473 -56429 -56761 -57089 -60283 -63474 -63850 -64223 -59829 -55430 -58252 -61070 -63892 -66709 -67235 -67757 -68998
-5140f8998M488M066j655J562P291N893N893L389L388J122J122o870o870q673Q68N401l24
$$ -68998 -64510 -60444 -62099 -60537 -53246 -47353 -41460 -38071 -34683 -33561 -32439 -39309 -46179 -54852 -53984 -48583 -48907
-5123d8907j100j099j458j457r73r73n386n386o102l77l239l239l880J845O855O854P094J368
$$ -48907 -50007 -51106 -52564 -54021 -54994 -55967 -61353 -66739 -72841 -73218 -76457 -79696 -83576 -81731 -74876 -68022 -60928 -59560
-5105e9560j83j82K184K184K184K185m078m078j215j215j871j872R92R91L377L378R460L735
$$ -59560 -59743 -59925 -57741 -55557 -53373 -51188 -55266 -59344 -60559 -61774 -63645 -65517 -64525 -63534 -60157 -56779 -47319 -43584
-5087d3584P42P45k479k475r28r24l791l787m059m056k509L221J666J670K024K028k237k232
$$ -43584 -42842 -42097 -44576 -47051 -47979 -48903 -52694 -56481 -60540 -64596 -67105 -63884 -62218 -60548 -58524 -56496 -58733 -60965
-5069f0965j879j875j879L851M208j517m741R88O26n096k773k769k7N700O146M22L641L642
$$ -60965 -62844 -64719 -66598 -62747 -58539 -60056 -64797 -63809 -63183 -68279 -71052 -73821 -73848 -68148 -62002 -61580 -57939 -54297
-5051e4297j75n901p451p447l694l694l694l694k800k799k441k438J263O989L769L768K159
$$ -54297 -54472 -60373 -67824 -75271 -78965 -82659 -86353 -90047 -92847 -95646 -98087 -100525 -99262 -92273 -88504 -84736 -82577
-5034h2577K158K158K158k971k970j08j09m044m044q24q24j748L977L978j749J175J174k405
$$ -82577 -80419 -78261 -76103 -79074 -82044 -82152 -82261 -86305 -90349 -91173 -91997 -93745 -89768 -85790 -87539 -86364 -85190 -87595
-5016h7595L322p65p64L172k553k851K873p04p04M383M387p42p41Q025K300P49P49m592m588
$$ -87595 -84273 -85038 -85802 -82630 -85183 -88034 -85161 -85865 -86569 -82186 -77799 -78541 -79282 -71257 -68957 -68208 -67459 -72051 -76639
-4997g6639j726j726m350m350P79P79L50O080mmj792j793j793j793P38P42P41P42R21R21R20
$$ -76639 -78365 -80091 -84441 -88791 -88012 -87233 -86883 -80803 -80807 -80811 -82603 -84396 -86189 -87982 -87244 -86502 -85761 -85019 -84098 -83177 -82257
-4976h2257R21J118J118L981L981K431K430p90M935K221K222k192k191l027l027j476M249
$$ -82257 -81336 -80218 -79100 -75119 -71138 -68707 -66277 -67067 -62132 -59911 -57689 -59881 -62072 -65099 -68126 -69602 -65353
-4959f5353J640J641J997J998L88L88j163o889r244r244m831m831m17m18K684Q409R077L351
$$ -65353 -63713 -62072 -60075 -58077 -57689 -57301 -58464 -65353 -74597 -83841 -88672 -93503 -93920 -94338 -91654 -83245 -74168 -70817
-4941g0817L470k255l448l448n85n85p533j808q54q54N827l717j569M156J305J304J663J662
$$ -70817 -67347 -69602 -73050 -76498 -77083 -77668 -85201 -87009 -87863 -88717 -82890 -86607 -88176 -84020 -82715 -81411 -79748 -78086
-4923g8086K915K915K915K915J290J289n390n390j573j573m793R32M980M980N66N67j283j282
$$ -78086 -75171 -72256 -69341 -66426 -65136 -63847 -69237 -74627 -76200 -77773 -82566 -81634 -76654 -71674 -71108 -70541 -71824 -73106
-4905g3106m145m145m219m220k669L057R69R69J327J327M164M163m424m425l053l052n558
$$ -73106 -77251 -81396 -85615 -89835 -92504 -89447 -88478 -87509 -86182 -84855 -80691 -76528 -80952 -85377 -88430 -91482 -97040
-4888i7040L985M163M164j1j1k50k50k50k49M208M212M208M212K718K721j46j41L46L51l232
$$ -97040 -93055 -88892 -84728 -84739 -84750 -85000 -85250 -85500 -85749 -81541 -77329 -73121 -68909 -66191 -63470 -63616 -63757 -63411 -63060 -66292
-4868f6292K497K315l407j90j86q84o605q398J148R971J5700J4027M488l731J998J397J402
$$ -66292 -63795 -61480 -64887 -65077 -65263 -66147 -72752 -81150 -80002 -70031 -54331 -40304 -35816 -39547 -37549 -36152 -34750
-4851c4750L306R036K352l370L191L190j938j938j044j043j044j044l504l504J268J267j416
$$ -34750 -31444 -22408 -20056 -23426 -20235 -17045 -18983 -20921 -21965 -23008 -24052 -25096 -28600 -32104 -30836 -29569 -30985
-4834c0985j417j774j774n517j1242j0884n159n67N159K296K296M33M32m339m338k550k550
$$ -30985 -32402 -34176 -35950 -41467 -52709 -63593 -68752 -69319 -64160 -61864 -59568 -59135 -58703 -63042 -67380 -69930 -72480
-4817g2480L14L13J151J156J152J155j293j290J569J573j00r7K762K766K225K229k80k75q17
$$ -72480 -72166 -71853 -70702 -69546 -68394 -67239 -68532 -69822 -68253 -66680 -66780 -66877 -64115 -61349 -59124 -56895 -57175 -57450 -58267
-4798e8267M913J689J692k963k960k606k601L448R177J181J186k218k214k218k214n97n92
$$ -58267 -53354 -51665 -49973 -52936 -55896 -58502 -61103 -57655 -48478 -47297 -46111 -48329 -50543 -52761 -54975 -55572 -56164
-4781e6164r55r50j79n901n904j75l459l456j550M178K207K210k98k94L034L038J841l880
$$ -56164 -57119 -58069 -58248 -64149 -70053 -70228 -73687 -77143 -78693 -74515 -72308 -70098 -70396 -70690 -67656 -64618 -62777 -66657
-4763f6657o270n40j260j256k647k643K125K128L676L679m317J413j581j576L548L553j044
$$ -66657 -72927 -73467 -74727 -75983 -78630 -81273 -79148 -77020 -73344 -69665 -73982 -72569 -74150 -75726 -72178 -68625 -69669
-4746f9669j040J819J823j685j681j685j681j089j084l951l948M70M73M70M73K170K173k602
$$ -69669 -70709 -68890 -67067 -68752 -70433 -72118 -73799 -74888 -75972 -79923 -83871 -83401 -82928 -82458 -81985 -79815 -77642 -80244
-4728h0244k598K855K859J424J428P38P42P38P41m693m692m336m335q062k337k695k695M700
$$ -80244 -82842 -79987 -77128 -75704 -74276 -73538 -72796 -72058 -71317 -76010 -80702 -85038 -89373 -97435 -99772 -102467 -105162 -100462
-4710a00462M701l10N416M015j711M36M36J305J304j26j27j618j618J842P566J931J931J931
$$ -100462 -95761 -96071 -90655 -86640 -88351 -87915 -87479 -86174 -84870 -84996 -85123 -86741 -88359 -86517 -78951 -77020 -75089 -73158
-4692g3158J931J692m033q13q12l500l500o38o37K464K463l98l99o124o125n766n767J38N864
$$ -73158 -71227 -69535 -73568 -74381 -75193 -78693 -82193 -82831 -83468 -81004 -78541 -78939 -79338 -85462 -91587 -97353 -103120 -102982 -97118
-4673i7118K643K642K520K520K520K519O71O71m100m100J536J535J178J178r09o635l415l414
$$ -97118 -94475 -91833 -89313 -86793 -84273 -81754 -81083 -80412 -84512 -88612 -87076 -85541 -84363 -83185 -84094 -90729 -94144 -97558
-4655i7558j241j242q83q83P0N797Q897Q898M752r73m432m432k404k404k762K963j23j23m81
$$ -97558 -98799 -100041 -100924 -101807 -101737 -95940 -87043 -78145 -73393 -74366 -78798 -83230 -85634 -88038 -90800 -87837 -87960 -88083 -88564
-4636h8564N245N066o60n41o266k016k017k374k375k255k255O08O07J275J275J275J275J453
$$ -88564 -83319 -78253 -78913 -79454 -85720 -87736 -89753 -92127 -94502 -96757 -99012 -98404 -97797 -96522 -95247 -93972 -92697 -91244
-4618i1244J454J454J453J260J260J260J260O63O64o016o016k364k363N00M99L959L958L959
$$ -91244 -89790 -88336 -86883 -85623 -84363 -83103 -81843 -81180 -80516 -86532 -92548 -94912 -97275 -96775 -96276 -92317 -88359 -84400
-4600h4400L958l80l80l80l80O04O03q27q28k896k892l4l0J487J491j017j014l865J863N319
$$ -84400 -80442 -80822 -81202 -81582 -81962 -81358 -80755 -81582 -82410 -85306 -88198 -88232 -88262 -86775 -85284 -86301 -87315 -91180 -89317 -83998
-4580h3998N323p94p90l657l652j972j968l404l399J905J908M74M77m%k867k862N841N844
$$ -83998 -78675 -79469 -80259 -83916 -87568 -89540 -91508 -94912 -98311 -96406 -94498 -94024 -93547 -93551 -93551 -96418 -99280 -93439 -87595
-4561h7595K979K982M25M28J857J860l482l478k885k881l854N692O403O83j439j435J066J070
$$ -87595 -84616 -81634 -81209 -80781 -78924 -77064 -80546 -84024 -86909 -89790 -93644 -87952 -81549 -80866 -82305 -83740 -82674 -81604
-4543h1604m03l99j834j830j267j264j267j264N383N386r40r35k669L060N919J98L955L958
$$ -81604 -82007 -82406 -84240 -86070 -87337 -88601 -89868 -91132 -85749 -80363 -81303 -82238 -84907 -81847 -75928 -75730 -71775 -67817
-4525f7817K405l318j651M078M96M99k203k199k203k199j189j186J674J677l097l094l098
$$ -67817 -65412 -68730 -70381 -66303 -65807 -65308 -67511 -69710 -71913 -74112 -75301 -76487 -74813 -73136 -76233 -79327 -82425
-4508h2425l093l635l630p72p68L374L377j398j394L612L616O116O121K218l508n416n416
$$ -82425 -85518 -89153 -92783 -93555 -94323 -90949 -87572 -88970 -90364 -86752 -83136 -77020 -70899 -68681 -72189 -77605 -83021
-4491h3021J204m521k017L709M037j689J890J890j331j331J890l835j711j711M611M611j61
$$ -83021 -81817 -86338 -88355 -84646 -80609 -82298 -80408 -78518 -79849 -81180 -79290 -83125 -84836 -86547 -81936 -77325 -77486
-4474g7486j60l023l023P05P04P05P04K315K315K672l053o48o49o48o374n2n3m10m10K990
$$ -77486 -77646 -80669 -83692 -82987 -82283 -81578 -80874 -78559 -76244 -73572 -76625 -77273 -77922 -78570 -84944 -84996 -85049 -85459 -85869 -82879
-4454h2879K989K990K989Q42Q43Q42Q43P08P08P08P09j260j260j260j260l944l943j081j081
$$ -82879 -79890 -76900 -73911 -73069 -72226 -71384 -70541 -69833 -69125 -68417 -67708 -68968 -70228 -71488 -72748 -76692 -80635 -81716 -82797
-4435h2797M10M10k453k453j241j241L530L530J860J860J860J860L515L515L515L515L515
$$ -82797 -82387 -81977 -84430 -86883 -88124 -89365 -85835 -82305 -80445 -78585 -76725 -74865 -71350 -67835 -64320 -60805 -57290
-4418e7290L515L515L515k449k449J129m596o444p20p19o445n833j09O453O452L590k136J084
$$ -57290 -53775 -50260 -46745 -49194 -51643 -50514 -55110 -61554 -62274 -62993 -69438 -75271 -75380 -68927 -62475 -58885 -61021 -59937
-4400e9937J085o150o147o866j137M525j196k393k390L206L209k53n975Q80Q83N22N25J335
$$ -59937 -58852 -65002 -71149 -78015 -79152 -74627 -75823 -78216 -80606 -77400 -74191 -74444 -80419 -79539 -78656 -78134 -77609 -76274
-4382g6274J338j528j525m152m149j290j286L161L165O381O60j908j905j909j904q43M887
$$ -76274 -74936 -76464 -77989 -82141 -86290 -87580 -88866 -85705 -82540 -76159 -75499 -77407 -79312 -81221 -83125 -83968 -79081
-4365g9081J662J667qmL214k509j141j137J723m000j498j495j856j853J036J040J036J040
$$ -79081 -77419 -75752 -75760 -75764 -72550 -75059 -76200 -77337 -75614 -79614 -81112 -82607 -84463 -86316 -85280 -84240 -83204 -82164
-4347h2164j110j107p53p50l257K471p53p49R17R20l854l850L872L877L873j849J16n606k748
$$ -82164 -83274 -84381 -85134 -85884 -89141 -86670 -87423 -88172 -87255 -86335 -90189 -94039 -90167 -86290 -82417 -84266 -84150 -89756 -92504
-4328i2504K982k836K892K6L0q09q05j167j162N654o7K87K91l172l169l09l06r35r32r36r32
$$ -92504 -89522 -92358 -89466 -89440 -89410 -90219 -91024 -92191 -93353 -87699 -87766 -87479 -87188 -90360 -93529 -93838 -94144 -95079 -96011 -96947 -97879
-4307i7879j472j469j472j469K550K553K550K553l116l112o12o07L444k278J298J300J64N894
$$ -97879 -99351 -100820 -102292 -103761 -101211 -98658 -96108 -93555 -96671 -99783 -100395 -101002 -97558 -99836 -98538 -97238 -97074 -91180
-4289i1180L026k695M183M186R61R66J200J204j663j658k945k941J826J831K244K247o18o16
$$ -91180 -88154 -90849 -86666 -82480 -81519 -80553 -79353 -78149 -79812 -81470 -84415 -87356 -85530 -83699 -81455 -79208 -79826 -80442
-4271h0442o85o86o86o86j49j49K713K714J178J178l593l594R40R39N81N82K959k765M54M55
$$ -80442 -81127 -81813 -82499 -83185 -83334 -83483 -80770 -78056 -76878 -75700 -79293 -82887 -81947 -81008 -80427 -79845 -76886 -79651 -79197 -78742
-4251g8742K76K76K76K76k930k930o7o7J603J602j259j260j68j68j68j67p64p65K099K099
$$ -78742 -78466 -78190 -77914 -77638 -80568 -83498 -83565 -83632 -82029 -80427 -81686 -82946 -83114 -83282 -83450 -83617 -84381 -85146 -83047 -80948
-4231h0948p9p8p8p9J354J353J353J353K20K20o102o102l120K605o15o15J637J636K352l373
$$ -80948 -81027 -81105 -81183 -81262 -79908 -78555 -77202 -75849 -75629 -75409 -81511 -87613 -90733 -88128 -88743 -89358 -87721 -86085 -83733 -87106
-4211h7106n700K7L127L127L545L549O82O86m149m145K531K535j242j237j241j238j539j536
$$ -87106 -92806 -92779 -89652 -86525 -82980 -79431 -78749 -78063 -82212 -86357 -83826 -81291 -82533 -83770 -85011 -86249 -87788 -89324
-4193h9324J323J327k061k058Q02Q05j227j222n998n993l62l58M052M055J726l996l999J729
$$ -89324 -88001 -86674 -88735 -90793 -89991 -89186 -90413 -91635 -97633 -103626 -103988 -104346 -100294 -96239 -94513 -98509 -102508 -100779
-4175a00779M589M592J75J79o3o0k926k922o00n97o00n96M230M235M231M234K427K430K427
$$ -100779 -96190 -91598 -91423 -91244 -91307 -91367 -94293 -97215 -97815 -98412 -99012 -99608 -95378 -91143 -86912 -82678 -80251 -77821 -75394
-4156g5394K430j689j685j688j685r233r229n774m5J204J208k017L713L235k486J089J092
$$ -75394 -72964 -74653 -76338 -78026 -79711 -88944 -98173 -103947 -103992 -102788 -101580 -103597 -99884 -96649 -99135 -98046 -96954
-4139i6954K400K404K401K404k221k218k222k218M399M402J536J539j30j27j31j26Q83Q87
$$ -96954 -94554 -92150 -89749 -87345 -89566 -91784 -94006 -96224 -91825 -87423 -85887 -84348 -84478 -84605 -84736 -84862 -83979 -83092
-4121h3092Q84Q87j055j051o97o94j293M436J211J215j901j897k259k255l50o072o076l47
$$ -83092 -82208 -81321 -82376 -83427 -84124 -84818 -86111 -81675 -80464 -79249 -81150 -83047 -85306 -87561 -87911 -93983 -100059 -100406
-4103a00406P53P57k468L262P313J592j514j509L254L258l426l422r21r16m142J588M417M421
$$ -100406 -99653 -98896 -101364 -98102 -90789 -89197 -90711 -92220 -88966 -85708 -89134 -92556 -93477 -94393 -98535 -96947 -92530 -88109
-4085h8109M775M779n33n30n33n29l180l175l17l13K903K908L261k460J070J073P12P16L54
$$ -88109 -83334 -78555 -79088 -79618 -80151 -80680 -83860 -87035 -87352 -87665 -84762 -81854 -78593 -81053 -79983 -78910 -78198 -77482 -77128
-4066g7128L58L54L58l396l392n900n897k203L526L02L06L776L779R13R17P35P38L597L601
$$ -77128 -76770 -76416 -76058 -79454 -82846 -88746 -94643 -96846 -93320 -93018 -92712 -88936 -85157 -84244 -83327 -82592 -81854 -78257 -74656
-4047g4656o673o672J916J916j12j12k974k975Q80Q80j626j625L43O069K847K848j439j438
$$ -74656 -81329 -88001 -86085 -84169 -84281 -84393 -87367 -90342 -89462 -88582 -90208 -91833 -91490 -85421 -82574 -79726 -81165 -82603
-4029h2603j797L929n45n44j86j87q79q80q80q79j655j655j655j655k587k587L735L735q2
$$ -82603 -84400 -80471 -81016 -81560 -81746 -81933 -82812 -83692 -84572 -85451 -87106 -88761 -90416 -92071 -94658 -97245 -93510 -89775 -89857
-4010h9857n808l541O002K631l094k497L228k557k557O63O64n89n89l452l451L049L049L049
$$ -89857 -95665 -99206 -93204 -90573 -93667 -96164 -92936 -95493 -98050 -97387 -96723 -97312 -97901 -101353 -104804 -101755 -98706 -95657
-3992i5657L049k61k61K602K602j156j155j156j155j346j342j346j341M379M384l4k9m626
$$ -95657 -92608 -92869 -93130 -90528 -87926 -89082 -90237 -91393 -92548 -93894 -95236 -96582 -97923 -93544 -89160 -89194 -89223 -93849
-3974i3849J103M559M562j823j819K949K952o82o78l903J826J584J588k829k825O3O7O4O7
$$ -93849 -92746 -88187 -83625 -85448 -87267 -84318 -81366 -82048 -82726 -86629 -84803 -83219 -81631 -84460 -87285 -87222 -87155 -87091 -87024
-3955h7024J673J678m648m645m544J186K732K736J360J365J360J364l142l138k80k76J391
$$ -87024 -85351 -83673 -88321 -92966 -97510 -96324 -93592 -90856 -89496 -88131 -86771 -85407 -88549 -91687 -91967 -92243 -90852
-3938i0852J394j473j468Q5R0Q6Q9L008L012L366k356l015l012n11n07l135l131J637J640
$$ -90852 -89458 -90931 -92399 -92314 -92224 -92138 -92049 -89041 -86029 -82663 -85019 -88034 -91046 -91557 -92064 -95199 -98330 -96693 -95053
-3919i5053K348K348J991P716j350j349J871J871j409j409J454J454l7l8k900k900q27q28
$$ -95053 -92705 -90357 -88366 -80650 -82000 -83349 -81478 -79607 -81016 -82425 -80971 -79517 -79554 -79592 -82492 -85392 -86219 -87047
-3901h7047m048J678M063M063l51l50j007j006K214l511k080k080K333K334J770J775M991
$$ -87047 -91095 -89417 -85354 -81291 -81642 -81992 -82999 -84005 -81791 -85302 -87382 -89462 -87129 -84795 -83025 -81250 -76259
-3884g6259p31o15o11r73r69k852k848l46l43K635l086J30J34K446K449k326k322l58l54l58
$$ -76259 -76990 -77605 -78216 -79189 -80158 -83010 -85858 -86204 -86547 -83912 -86998 -86868 -86734 -84288 -81839 -84165 -86487 -86845 -87199 -87557
-3864h7557l54j968j965n189N41J193J196J551J554J9J9M789M790J271J271j591j592m484
$$ -87557 -87911 -89879 -91844 -97033 -96492 -95299 -94103 -92552 -90998 -90979 -90960 -86171 -81381 -80110 -78839 -80430 -82022 -86506
-3846h6506m484j622j621K255K255k50k49p09N018J438J439J260m465j245j245J975J976J975
$$ -86506 -90990 -92612 -94233 -91978 -89723 -89973 -90222 -90931 -85913 -84475 -83036 -81776 -86241 -87486 -88731 -86756 -84780 -82805
-3828h2805J976J260J260J260J259K65K68K65K68j703j700m566m562J219J222J219J223L544
$$ -82805 -80829 -79569 -78309 -77049 -75790 -75525 -75257 -74992 -74724 -76427 -78127 -82693 -87255 -86036 -84814 -83595 -82372 -78828
-3810g8828L549O82O86o497o493o855j126K867K870L61L66j249j245j249j245J197J200J197
$$ -78828 -75279 -74597 -73911 -80408 -86901 -93756 -94882 -92015 -89145 -88784 -88418 -89667 -90912 -92161 -93406 -92209 -91009 -89812
-3792h9812J200J905J908j316M414J15J19m297m294j555j550K859K862J905l817l463l459
$$ -89812 -88612 -86707 -84799 -86115 -81701 -81586 -81467 -85764 -90058 -91613 -93163 -90304 -87442 -85537 -89354 -92817 -96276
-3775i6276K941K945P8Q2k069k065k068k065o08o04o07o04k099k095k098k095J845J849M708
$$ -96276 -93335 -90390 -90312 -90230 -92299 -94364 -96432 -98497 -99105 -99709 -100316 -100920 -103019 -105114 -107212 -109307 -107462 -105613 -100905
-3756a00905M711K501K505K859k863j971j969K442K445Q91Q95M111j610j674j670k031k028
$$ -100905 -96194 -93693 -91188 -88329 -91192 -93163 -95132 -92690 -90245 -89354 -88459 -84348 -85958 -87632 -89302 -91333 -93361
-3739i3361J16J19J15J20k28k23L351k371o311n81N736J5k545k546l262K464L657L656M373
$$ -93361 -93245 -93126 -93011 -92891 -93119 -93342 -89991 -92362 -98673 -99254 -93518 -93503 -96048 -98594 -101856 -99392 -95735 -92079 -87706
-3720h7706j353R3R3k770k769m678J047O90O90k763k762K009K010j093j092M991p34j38j38
$$ -87706 -89059 -88966 -88873 -91643 -94412 -99090 -98043 -97353 -96663 -99426 -102188 -100179 -98169 -99262 -100354 -95363 -96097 -96235 -96373
-3701i6373K367K367m36m36m36m36J975J976q87q87k91k91k91k90O93O93L556L556j632j633
$$ -96373 -94006 -91639 -92075 -92511 -92947 -93383 -91408 -89432 -90319 -91206 -91497 -91788 -92079 -92369 -91676 -90983 -87427 -83871 -85503 -87136
-3681h7136J230J230j424j424J439J439j484j483j484j483qpK855K855K856K855qpm372m373
$$ -87136 -85906 -84676 -86100 -87524 -86085 -84646 -86130 -87613 -89097 -90580 -90588 -90595 -87740 -84885 -82029 -79174 -79182 -79189 -83561 -87934
-3661h7934p593j867L739L738L739L739l77o102j8j9K069K068p94p93J949J949m133J591K665
$$ -87934 -95527 -97394 -93655 -89917 -86178 -82439 -82816 -88918 -88936 -88955 -86886 -84818 -85612 -86405 -84456 -82507 -86640 -85049 -82384
-3642h2384K666j749j748m804m805j942j942m507m506K173K173J249J248J249J249mml61l62
$$ -82384 -79718 -81467 -83215 -88019 -92824 -94766 -96708 -101215 -105721 -103548 -101375 -100126 -98878 -97629 -96380 -96384 -96388 -96749 -97111
-3623i7111M231j495J726J726p79p79p79p79n04n03j45j46p41M983J763J764j935j935j934
$$ -97111 -92880 -94375 -92649 -90923 -91702 -92481 -93260 -94039 -94543 -95046 -95191 -95337 -96078 -91095 -89332 -87568 -89503 -91438 -93372
-3604i3372j935N11N11L731j994j238j237o009o009m219J506L056L057j05j04j04j05P31P30
$$ -93372 -95307 -94796 -94285 -90554 -92548 -93786 -95023 -101032 -107041 -111260 -109754 -106698 -103641 -103746 -103850 -103954 -104059 -103328 -102598
-3585a02598P31P31L041L042L399k326m652m652l459K267k69k68K952K952l727l728K952K953
$$ -102598 -101867 -101136 -98095 -95053 -91654 -93980 -98632 -103284 -106743 -104476 -104745 -105013 -102061 -99109 -102836 -106564 -103612 -100659
-3567a00659J957J960m723m718r66r62J898J901K464K467K464K468L358L362j412j409o53
$$ -100659 -98702 -96742 -101465 -106183 -107149 -108111 -106213 -104312 -101848 -99381 -96917 -94449 -91091 -87729 -89141 -90550 -91203
-3550i1203o48K210K214J912J916m767m764R58R62O00O04L02n420n066n062L92L95k471k468
$$ -91203 -91851 -89641 -87427 -85515 -83599 -88366 -93130 -92172 -91210 -90610 -90006 -89704 -95124 -100190 -105252 -104860 -104465 -106936 -109404
-3531a09404K72K76L135L138J793J797j070j066K866K871K508K512P42m980n341L88L664k058
$$ -109404 -109132 -108856 -105721 -102583 -100790 -98993 -100063 -101129 -98263 -95392 -92884 -90372 -89630 -94610 -99951 -99563 -95899 -97957
-3513i7957m566J163K441K446K799K803J129J134j734j729m51m48m51m47k002j997k002j998
$$ -97957 -102523 -101360 -98919 -96473 -93674 -90871 -89742 -88608 -90342 -92071 -92522 -92970 -93421 -93868 -95870 -97867 -99869 -101867
-3495a01867K441K446o4n9j555M175L455L460P369J644j816j815j994j994j995j994j666j666
$$ -101867 -99426 -96980 -97044 -97103 -98658 -94483 -91028 -87568 -80199 -78555 -80371 -82186 -84180 -86174 -88169 -90163 -91829 -93495
-3477i3495O325O01l038l038n33n33K382K381m297m298l344l343m81m81j286j286L127L128
$$ -93495 -87170 -86569 -89607 -92645 -93178 -93711 -91329 -88948 -93245 -97543 -100887 -104230 -104711 -105192 -106478 -107764 -104637 -101509
-3459a01509N811Q6L306L306K956K960R3R7n811n808j040j036L880L884q90q88L404L406N41
$$ -101509 -95698 -95612 -92306 -89000 -86044 -83084 -82991 -82894 -88705 -94513 -95553 -96589 -92709 -88825 -89715 -90603 -87199 -83793 -83252
-3440h3252N44l638l634L041L046l042l038l041l038k267k262k266k263J014J018k207L522
$$ -83252 -82708 -86346 -89980 -86939 -83893 -86935 -89973 -93014 -96052 -98319 -100581 -102847 -105110 -104096 -103078 -105285 -101763
-3423a01763L981L985J476J480J893J898J893J898j20j15j20j15j909j904R54R58J517J521
$$ -101763 -97782 -93797 -92321 -90841 -88948 -87050 -85157 -83259 -83379 -83494 -83614 -83729 -85638 -87542 -86588 -85630 -84113 -82592
-3405h2592j346j342J159J163J160J163j167j163j167j163o30o26o30o26l724l720M865M868
$$ -82592 -83938 -85280 -84121 -82958 -81798 -80635 -81802 -82965 -84132 -85295 -85925 -86551 -87181 -87807 -91531 -95251 -90386 -85518
-3387h5518k412k408k412k408L776L780r95r92P94P98J152m570l99l99p57p56J986J987J629
$$ -85518 -87930 -90338 -92750 -95158 -91382 -87602 -88597 -89589 -88795 -87997 -86845 -91415 -91814 -92213 -92970 -93726 -91740 -89753 -88124
-3368h8124J629J689m037l679l679k665k666l023K703J427J428j077j077L276L277l404l403
$$ -88124 -86495 -84806 -88843 -92522 -96201 -98866 -101532 -104555 -101852 -100425 -98997 -100074 -101151 -97875 -94598 -98002 -101405
-3351a01405k538k539n759l3N572N573R151L425l254l254J160J159q09q09K054K054J427J428
$$ -101405 -103943 -106482 -112241 -112274 -106702 -101129 -91978 -88553 -91807 -95061 -93901 -92742 -93551 -94360 -92306 -90252 -88825 -87397
-3333h7397l344l343j077j078J786J785j539j540K874K874K218l507k88k87j285j286L485
$$ -87397 -90741 -94084 -95161 -96239 -94453 -92668 -94207 -95747 -92873 -89999 -87781 -91288 -91576 -91863 -93148 -94434 -90949
-3316i0949L485k539k538j226Q316O527O526M261M260m625m626m626m626J487J488j376j375
$$ -90949 -87464 -90003 -92541 -93767 -85451 -78924 -72398 -68137 -63877 -68502 -73128 -77754 -82380 -80893 -79405 -80781 -82156
-3299h2156K35K35j23j24K092l635p71p72K032l694l336l336o53o52o52o53K747K748K42K42
$$ -82156 -81921 -81686 -81809 -81933 -79841 -83476 -84247 -85019 -82987 -86681 -90017 -93353 -94006 -94658 -95310 -95963 -93216 -90468 -90226 -89984
-3279h9984m767R58K508K509MLMMm29m29m28m29l291l292L389L388O967O966j383M343Q636
$$ -89984 -94751 -93793 -91285 -88776 -88772 -88769 -88765 -88761 -89190 -89619 -90047 -90476 -93767 -97059 -93670 -90282 -83315 -76349 -77732 -73389 -64753
-3258f4753K912J718J718Q100Q100J062q480r732r733p466p466k2k3N74N74l302O240O955
$$ -64753 -61841 -60123 -58405 -50305 -42205 -41143 -49623 -59355 -69088 -76554 -84020 -84042 -84065 -83491 -82917 -86219 -79979 -73024
-3240g3024J230L66L65p984k259k140k139m287m287l936J789O799O799N904J79j371j372l88
$$ -73024 -71794 -71428 -71063 -79047 -81306 -83446 -85585 -89872 -94159 -98095 -96306 -89507 -82708 -76804 -76625 -77996 -79368 -79756
-3222g9756l87l88l88l190l191o86o86L851j872j517j513J286J290J286J289Q69Q72L731L735
$$ -79756 -80143 -80531 -80919 -84109 -87300 -87986 -88672 -84821 -86693 -88210 -89723 -88437 -87147 -85861 -84572 -83703 -82831 -79100 -75365
-3203g5365j338j334J524J529K12K16k650k647J525J528k889k885n542J86L642L645K926K930
$$ -75365 -76703 -78037 -76513 -74984 -74772 -74556 -77206 -79853 -78328 -76800 -79689 -82574 -88116 -87930 -84288 -80643 -77717 -74787
-3185g4787O3O8l005l004j42j41l124l124l123l124K572K572K572K572j603j603J260J260
$$ -74787 -74724 -74656 -77661 -80665 -80807 -80948 -84072 -87196 -90319 -93443 -90871 -88299 -85727 -83155 -84758 -86361 -85101 -83841
-3167h3841L653L653N52n174m578J149M32M32l757l757O143M17j19j19m78m77j416j417m279
$$ -83841 -80188 -76535 -75983 -81157 -85735 -84586 -84154 -83722 -87479 -91236 -85093 -84676 -84795 -84914 -85392 -85869 -87285 -88702 -92981
-3148i2981m279J089J088J088J089j402j401J461J461K177K177K177K176K550K550k222k222
$$ -92981 -97260 -96171 -95083 -93995 -92906 -94308 -95709 -94248 -92787 -90610 -88433 -86256 -84080 -81530 -78980 -81202 -83424
-3131h3424j684j685j685j685J64J64J64J64j029j028j387j387L247k475k479L251j107j104
$$ -83424 -85108 -86793 -88478 -90163 -89999 -89835 -89671 -89507 -90536 -91564 -92951 -94338 -91091 -93566 -96045 -92794 -93901 -95005
-3113i5005p49p46j256j252N423N428K34K39r58o680J637P365R21R24n938n934l075l071J502
$$ -95005 -95754 -96500 -97756 -99008 -93585 -88157 -87923 -87684 -88642 -95322 -93685 -86320 -85399 -84475 -90413 -96347 -99422 -102493 -100991
-3094a00991J506J502J506j182j178L232L236K944k777k423k419k542k538k900K829p08p05
$$ -100991 -99485 -97983 -96477 -97659 -98837 -95605 -92369 -89425 -92202 -94625 -97044 -99586 -102124 -105024 -102195 -102903 -103608
-3077a03608M421M424M004M007k676k673j245j241J975l746j304j301k021L709J797J800k616
$$ -103608 -99187 -94763 -90759 -86752 -89428 -92101 -93346 -94587 -92612 -96358 -97662 -98963 -100984 -97275 -95478 -93678 -96294
-3060i6294k613J438J443J439J442P5P8P5P8o41o38o41o37j029j025m249J479N651N655O366
$$ -96294 -98907 -97469 -96026 -94587 -93145 -93070 -92992 -92917 -92839 -93480 -94118 -94759 -95396 -96425 -97450 -101699 -100220 -94569 -88914 -82548
-3040h2548O45k154k151L50L55K31K34K32K34n2m8m10m07L825j897l452l448L54L58L54L58
$$ -82548 -81903 -84057 -86208 -85858 -85503 -85272 -85038 -84806 -84572 -84624 -84672 -85082 -85489 -81664 -83561 -87013 -90461 -90107 -89749 -89395 -89037
-3019h9037l62l57l62l58M633M637k046k043r13r09r14r09j301j297j301j297r43r40K636
$$ -89037 -89399 -89756 -90118 -90476 -85843 -81206 -83252 -85295 -86208 -87117 -88031 -88940 -90241 -91538 -92839 -94136 -95079 -96019 -93383
-3000i3383l087m95N233M872q50j808j804k166k162q87q87q87q87L05L06L06L05K304K304
$$ -93383 -96470 -96965 -91732 -86860 -87710 -89518 -91322 -93488 -95650 -96537 -97424 -98311 -99198 -98893 -98587 -98281 -97976 -95672 -93368
-2981i3368K303K304J289J290J290J290L682L683p31p30o098l73J178J178j5j5j5j5n084n084
$$ -93368 -91065 -88761 -87472 -86182 -84892 -83602 -79920 -76237 -76968 -77698 -83796 -84169 -82991 -81813 -81828 -81843 -81858 -81873 -86957 -92041
-2961i2041l534K192M324M323j998j997j998j998j998j998P75P75P76P75n66n67Q65Q64J350
$$ -92041 -95575 -93383 -89059 -84736 -86734 -88731 -90729 -92727 -94725 -96723 -95948 -95173 -94397 -93622 -94188 -94755 -93890 -93026 -91676
-2942i1676J349L854L855L168k557p328j603L586L586k736k736L65L65k497k498m54m55K408
$$ -91676 -90327 -86473 -82618 -79450 -82007 -89335 -90938 -87352 -83766 -86502 -89238 -88873 -88508 -91005 -93503 -93957 -94412 -92004
-2924i2004K408n74n74L839L839k706q431l661K065L020L019N14N15k364k363K408K408J692
$$ -92004 -89596 -90170 -90744 -86905 -83066 -85772 -94203 -97864 -95799 -92779 -89760 -89246 -88731 -91095 -93458 -91050 -88642 -86950
-2906h6950J693m391J334l124l123R7R7l81l80K841K840k322L403k680k680J82J83L045L046
$$ -86950 -85257 -89648 -88314 -91438 -94561 -94464 -94367 -94748 -95128 -92287 -89447 -91769 -88366 -91046 -93726 -93544 -93361 -90316 -87270
-2887h7270k35k35K270K270m171r896j309M417j882j882l32N394K292l433n938k12mml61N363
$$ -87270 -87505 -87740 -85470 -83200 -87371 -97267 -98576 -94159 -96041 -97923 -98255 -92861 -90569 -94002 -99940 -100152 -100156 -100160 -100521 -95158
-2867i5158N722mn013n014m126m126K553K553K315K315K315K315Q53Q54Q53Q54j771j770j771
$$ -95158 -89436 -89440 -94453 -99467 -103593 -107719 -105166 -102613 -100298 -97983 -95668 -93353 -92500 -91646 -90793 -89939 -91710 -93480 -95251
-2848i5251j770R28R28M149j577k05k05n63n63L135L135K72K72l247l246J524J525k524k519
$$ -95251 -97021 -96093 -95165 -91016 -92593 -92798 -93003 -93566 -94129 -90994 -87859 -87587 -87315 -90562 -93808 -92284 -90759 -93283 -95802
-2829i5802l240K490N051o71j867j864j659j655j659j655L650L653l031l027M932M935L381
$$ -95802 -99042 -96552 -91501 -92172 -94039 -95903 -97562 -99217 -100876 -102531 -98881 -95228 -98259 -101286 -96354 -91419 -88038
-2812h8038k341p34p31j092j088j003r99J502J506K546l176o042l13K080K080L869L869J006
$$ -88038 -90379 -91113 -91844 -92936 -94024 -95027 -96026 -94524 -93018 -90472 -93648 -99690 -100003 -97923 -95843 -91974 -88105 -87099
-2794h7099J007j857j856k16k16J215J215K020K021k751k751O19O18j647j648p760J781J186
$$ -87099 -86092 -87949 -89805 -90021 -90237 -89022 -87807 -85787 -83766 -86517 -89268 -88649 -88031 -89678 -91326 -99086 -97305 -96119
-2776i6119J185J484J483N2N2J275J275j588j588k068k069P94P94k725k725N506N505L239
$$ -96119 -94934 -93450 -91967 -91915 -91863 -90588 -89313 -90901 -92489 -94557 -96626 -95832 -95038 -97763 -100488 -94982 -89477 -86238
-2758h6238k486P34P35J629J628l142l142J927J927k844k844p1p1J361J360j114j115j114
$$ -86238 -88724 -87990 -87255 -85626 -83998 -87140 -90282 -88355 -86428 -89272 -92116 -92187 -92258 -90897 -89537 -90651 -91766 -92880
-2740i2880j115l172l172J599J599J212J211j651j651P64P64k099k098O45O45K076K076k963
$$ -92880 -93995 -97167 -100339 -98740 -97141 -95929 -94718 -96369 -98020 -97256 -96492 -98591 -100689 -100044 -99399 -97323 -95247 -98210
-2722i8210k964j00j01J890J890k524k523K20N945K725K724j107j107K114l612J45J46k13
$$ -98210 -101174 -101274 -101375 -99485 -97595 -100119 -102642 -102422 -96477 -93752 -91028 -92135 -93242 -91128 -94740 -94595 -94449 -94662
-2704i4662k12K057K058q05q05L310L310j462j461J745J744j118j118J684J685l086l086j834
$$ -94662 -94874 -92817 -90759 -91564 -92369 -89059 -85749 -87211 -88672 -86927 -85183 -86301 -87419 -85735 -84050 -87136 -90222 -92056
-2686i2056j834j834j834J088J089l683l683J991J990q72q72j886j886R76R77J82J83J83J82
$$ -92056 -93890 -95724 -97558 -96470 -95381 -99064 -102747 -100756 -98766 -99638 -100510 -102396 -104282 -103306 -102329 -102147 -101964 -101781 -101599
-2667a01599p12p12K151K151J15J16K978K979j257j256J607J606n25n26n25n26j718j719j718
$$ -101599 -102311 -103023 -100872 -98721 -98606 -98490 -95512 -92533 -93790 -95046 -93439 -91833 -92358 -92884 -93409 -93935 -95653 -97372 -99090
-2648i9090j718J621J621j241j241o45o45M127M126j510j509j510j510L679L679l000l001
$$ -99090 -100808 -99187 -97566 -98807 -100048 -100693 -101338 -97211 -93085 -94595 -96104 -97614 -99124 -95445 -91766 -94766 -97767
-2631i7767l925l925K755K754O751O750J980J979M06M06M07M06n200n200m28m29m14m14m13
$$ -97767 -101692 -105617 -102862 -100108 -93357 -86607 -84627 -82648 -82242 -81836 -81429 -81023 -86223 -91423 -91851 -92280 -92694 -93108 -93521
-2612i3521m14k799k800J972J972J38J42J37J42J450J454M313M316l694l690l694l690j547
$$ -93521 -93935 -96734 -99534 -97562 -95590 -95452 -95310 -95173 -95031 -93581 -92127 -87814 -83498 -87192 -90882 -94576 -98266 -99813
-2594i9813j543J315J320R43R47R43R47N85N89N85N89k188k184O74O79J867J871J868J871
$$ -99813 -101356 -100041 -98721 -97778 -96831 -95888 -94941 -94356 -93767 -93182 -92593 -94781 -96965 -96291 -95612 -93745 -91874 -90006 -88135
-2575h8135j79j75K684K687q94q91q95q91k147k143P16P19P75P79P76P79J64J67J64J68K311
$$ -88135 -88314 -88489 -85805 -83118 -84012 -84903 -85798 -86689 -88836 -90979 -90263 -89544 -88769 -87990 -87214 -86435 -86271 -86104 -85940 -85772 -83461
-2554h3461K315n52n48J476J480j386j383k878k874k877k874P23P23L586L589q27q24K035
$$ -83461 -81146 -81698 -82246 -80770 -79290 -80676 -82059 -84937 -87811 -90688 -93562 -92839 -92116 -88530 -84941 -85768 -86592 -84557
-2536h4557K039l489l489l488l486J49J53k713k710M294M294m77m74M652M656j19j16l019
$$ -84557 -82518 -86007 -89496 -92984 -96470 -96321 -96168 -98881 -101591 -97297 -93003 -93480 -93954 -89302 -84646 -84765 -84881 -87900
-2518h7900l019J751J756j230j226j230j227q2q2K76K76j454M272M272j454j946j946N60N59
$$ -87900 -90919 -89168 -87412 -88642 -89868 -91098 -92325 -92407 -92489 -92213 -91937 -93391 -89119 -84847 -86301 -88247 -90193 -89633 -89074
-2499h9074m511m510j051M674O397O396k073p797l325K400j178j178L325L325J775l952q49
$$ -89074 -93585 -98095 -99146 -94472 -88075 -81679 -83752 -91549 -94874 -92474 -93652 -94830 -91505 -88180 -86405 -90357 -91206
-2482i1206q50j208j208r35r32L478L481K57n464O18O19L99M03L98M03L441L444j685j685
$$ -91206 -92056 -93264 -94472 -95407 -96339 -92861 -89380 -89123 -94587 -93969 -93350 -92951 -92548 -92150 -91747 -88306 -84862 -86547 -88232
-2463h8232K374l347k993k989K434K437m241m242J75J79L395k325j316j312L101L101k024
$$ -88232 -85858 -89205 -92198 -95187 -92753 -90316 -94557 -98799 -98624 -98445 -95050 -97375 -98691 -100003 -96902 -93801 -95825
-2446i5825k024Q39Q39N40N40N41N40J600J599j264j264M07M06L269L269q16q17q16q16j950
$$ -95825 -97849 -97010 -96171 -95631 -95091 -94550 -94010 -92410 -90811 -92075 -93339 -92932 -92526 -89257 -85988 -86804 -87621 -88437 -89253 -91203
-2426i1203j949J271J271o020k94J256J256o52o53O4n662l508K222J502J506K396K401m66
$$ -91203 -93152 -91881 -90610 -96630 -96924 -95668 -94412 -95064 -95717 -95653 -101315 -104823 -102601 -101099 -99593 -97197 -94796 -95262
-2408i5262m62K218K221K218K222r43r40p622p619j532j529J331J335J271J274M134M138L46
$$ -95262 -95724 -93506 -91285 -89067 -86845 -87788 -88728 -96350 -103969 -105501 -107030 -105699 -104364 -103093 -101819 -97685 -93547 -93201
-2390i3201L51L46L51j145j140j145j140K486K490N707j5J770J775J770l951l895l892K427
$$ -93201 -92850 -92504 -92153 -93298 -94438 -95583 -96723 -94237 -91747 -86040 -86055 -84285 -82510 -80740 -84691 -88586 -92478 -90051
-2372i0051K430o15o11o15o11N92N97m179m175J547J551M767r54R51R54k270k266M230M235
$$ -90051 -87621 -88236 -88847 -89462 -90073 -89481 -88884 -93063 -97238 -95691 -94140 -89373 -90327 -89376 -88422 -90692 -92958 -88728 -84493
-2353h4493n41n37K133K132r69o695n382L42l72l73P31P30L593L594l325l325m041J685N196
$$ -84493 -85034 -85571 -83438 -81306 -82275 -88970 -94352 -94010 -94382 -94755 -94024 -93294 -89701 -86107 -89432 -92757 -96798 -95113 -89917
-2334h9917n29J86J87M003M003m584m585L108L109j662j663J022J021J021J022J684J685j178
$$ -89917 -90446 -90260 -90073 -86070 -82067 -86651 -91236 -88128 -85019 -86681 -88344 -87322 -86301 -85280 -84258 -82574 -80889 -82067
-2316h2067j178j774j774q454q454K371K370K371K371j625j626j625j625L027L026L027L027
$$ -82067 -83245 -85019 -86793 -95247 -103701 -101330 -98960 -96589 -94218 -95843 -97469 -99094 -100719 -97692 -94666 -91639 -88612
-2299h8612N81N82k281k282j34j34j34j34p31p31K133K132K273K278K274K277j722j718m585
$$ -88612 -88031 -87449 -89730 -92012 -92146 -92280 -92414 -92548 -93279 -94010 -91877 -89745 -87472 -85194 -82920 -80643 -82365 -84083 -88668
-2280h8668m581k170k165O93O97R7J01k766k762l668l664J103J107J998K002q65q61J789J793
$$ -88668 -93249 -95419 -97584 -96891 -96194 -96097 -95996 -98762 -101524 -105192 -108856 -107753 -106646 -104648 -102646 -103511 -104372 -102583 -100790
-2261a00790J789J793p15p12p16p12L776L780R13R17j055j051j055j051k188k185k188k184
$$ -100790 -99001 -97208 -97923 -98635 -99351 -100063 -96287 -92507 -91594 -90677 -91732 -92783 -93838 -94889 -97077 -99262 -101450 -103634
-2243a03634r95r92J868J871q91q87J972J975j785j782J077J081n48n44n48n44N118N122L46
$$ -103634 -104629 -105621 -103753 -101882 -102773 -103660 -101688 -99713 -101498 -103280 -102203 -101122 -101670 -102214 -102762 -103306 -98188 -93066 -92720
-2224i2720L51j711j711J152J151j055j054j055j055M268M268n03n04j45j45j46j45k069k069
$$ -92720 -92369 -94080 -95791 -94639 -93488 -94543 -95597 -96652 -97707 -93439 -89171 -89674 -90178 -90323 -90468 -90614 -90759 -92828 -94897
-2205i4897K703K702J510J509l261l262N11N11N10N11m618m619L970L970k20k20k20k20J033
$$ -94897 -92194 -89492 -87982 -86473 -89734 -92996 -92485 -91974 -91464 -90953 -95571 -100190 -96220 -92250 -92470 -92690 -92910 -93130 -92097
-2186i2097J032j830j830k829k830J942J942P50P49L612L612j711j711J152J152j294j293
$$ -92097 -91065 -92895 -94725 -97554 -100384 -98442 -96500 -95750 -95001 -91389 -87777 -89488 -91199 -90047 -88895 -90189 -91482
-2169i1482m335m335K27k635m425J301L865J003J540M402K624N487M413j312k266k267K39
$$ -91482 -95817 -100152 -99925 -102560 -106985 -105684 -101819 -100816 -99276 -94874 -92250 -86763 -82350 -83662 -85928 -88195 -87956
-2152h7956K38k117k117M324j402m920Q05K117M980J894r69l653p90m92m92K549K550r99r99
$$ -87956 -87718 -89835 -91952 -87628 -89030 -93950 -93145 -91028 -86048 -84154 -85123 -88776 -89566 -90058 -90550 -88001 -85451 -86450 -87449
-2133h7449r99r99J148J148J685m041j901R62j006j007j126j125o851K691M764r62n44N181
$$ -87449 -88448 -89447 -88299 -87151 -85466 -89507 -91408 -90446 -91452 -92459 -93585 -94710 -101561 -98870 -94106 -95068 -95612 -90431
-2115i0431L630P68j26j27p61p60J208j655l802J923K102l623j372M354L996j729n070n069
$$ -90431 -86801 -86033 -86159 -86286 -87047 -87807 -86599 -88254 -92056 -90133 -88031 -91654 -93026 -88672 -84676 -86405 -91475 -96544
-2097i6544m18N308L146k575l773l768l057l052J714J718K252K255o11o08p4p1p5p1R58R62
$$ -96544 -96962 -91654 -88508 -91083 -94856 -98624 -101681 -104733 -103019 -101301 -99049 -96794 -97405 -98013 -98087 -98158 -98233 -98304 -97346 -96384
-2077i6384j905j901K211K214o53o48j010j007J853J856q31q28K748k975l012K714N218n07
$$ -96384 -98289 -100190 -97979 -95765 -96418 -97066 -98076 -99083 -97230 -95374 -96205 -97033 -94285 -97260 -100272 -97558 -92340 -92847
-2059i2847k08k09k535L28L608k117l190l28K713K714j879j879O23O22O23O22K65K65N036
$$ -92847 -93055 -93264 -95799 -95471 -91863 -93980 -97170 -97498 -94785 -92071 -93950 -95829 -95206 -94584 -93961 -93339 -93074 -92809 -87773
-2040h7773N035k016k017k016k017k136k136P27P27j49j49j49j49J640J640j223j222j208
$$ -87773 -82738 -84754 -86771 -88787 -90804 -92940 -95076 -94349 -93622 -93771 -93920 -94069 -94218 -92578 -90938 -92161 -93383 -94591
-2022i4591j208K013l712k162k162K072K073J081j782l392K333j901j901QN733J945J946K304
$$ -94591 -95799 -93786 -97498 -99660 -101822 -99750 -97677 -96596 -98378 -101770 -99437 -101338 -103239 -103231 -97498 -95553 -93607 -91303
-2004i1303K303k61k61J708j156o165m36K840K844K542K546K184K188L06n416k199k196q87
$$ -91303 -89000 -89261 -89522 -87814 -88970 -95135 -95571 -92731 -89887 -87345 -84799 -82615 -80427 -80121 -85537 -87736 -89932 -90819
-1986i0819q83q87q84m69m66m70m66O7P1O7P1J513J517j349j346l496l493o33o30J099J104
$$ -90819 -91702 -92589 -93473 -93942 -94408 -94878 -95344 -95277 -95206 -95139 -95068 -93555 -92038 -93387 -94733 -98229 -101722 -102355 -102985 -101886 -100782
-1965a00782L067K09j107M622L008J49k613K54N021K162j68K699k077m935r3K773j882j879
$$ -100782 -97715 -97506 -98613 -93991 -90983 -90834 -93447 -93193 -88172 -86010 -86178 -83479 -85556 -90491 -90584 -87811 -89693 -91572
-1947i1572J100J103J100J103k598k594n461n457r28r25J935J938l50l47l50l47M063M067
$$ -91572 -90472 -89369 -88269 -87166 -89764 -92358 -97819 -103276 -104204 -105129 -103194 -101256 -101606 -101953 -102303 -102650 -98587 -94520
-1929i4520J200J204k125k121k124k121j111j107J752J756K49K54m66N263J323m398P27O456
$$ -94520 -93320 -92116 -94241 -96362 -98486 -100607 -101718 -102825 -101073 -99317 -99068 -98814 -99280 -94017 -92694 -97092 -96365 -89909
-1911h9909J15J20k390k385M13M18M14M17J42J45j051o773k900K829M019M021L348L351M84
$$ -89909 -89794 -89674 -92064 -94449 -94036 -93618 -93204 -92787 -92645 -92500 -93551 -100324 -103224 -100395 -96376 -92355 -89007 -85656 -85172
-1892h5172M89K094K099j0072m342K598l124M51M55j994j991k352L377L538L541n18n15k158
$$ -85172 -84683 -82589 -80490 -90562 -94904 -92306 -95430 -94979 -94524 -96518 -98509 -100861 -97484 -93946 -90405 -90923 -91438 -93596
-1874i3596L571L47L50m92m88j924j919j834j830K937K941K609K613k53k50m62m59j893j890
$$ -93596 -90025 -89678 -89328 -89820 -90308 -92232 -94151 -95985 -97815 -94878 -91937 -89328 -86715 -86968 -87218 -87680 -88139 -90032 -91922
-1855i1922R7J00q57o579m823M722J857J860J573J576j289j286M10M14j022j017J494J495
$$ -91922 -91825 -91725 -92582 -99161 -103984 -99262 -97405 -95545 -93972 -92396 -93685 -94971 -94561 -94147 -95169 -96186 -94692 -93197
-1837i3197j368j368j398j398k113L612O370O45r06r06J391m335k546k546K039K039q24q24
$$ -93197 -94565 -95933 -97331 -98729 -100842 -97230 -90860 -90215 -91121 -92027 -90636 -94971 -97517 -100063 -98024 -95985 -96809 -97633
-1819i7633l567l567J204J204j540j539j08j08K009K009K009K009j681j677j678j677j677
$$ -97633 -101200 -104767 -103563 -102359 -103899 -105438 -105546 -105654 -103645 -101636 -99627 -97618 -99299 -100976 -102654 -104331 -106008
-1802a06008j678N003N002o08o04K259K259j86j87j617j618l098l093j663j662M361M361J498
$$ -106008 -107686 -102683 -97681 -98289 -98893 -96634 -94375 -94561 -94748 -96365 -97983 -101081 -104174 -105837 -107499 -103138 -98777 -97279
-1784i7279J499k665k662K110K110Q57Q57k005k005J12J11J12J12P68P68N539N539L496L497
$$ -97279 -95780 -98445 -101107 -98997 -96887 -96030 -95173 -97178 -99183 -99071 -98960 -98848 -98736 -97968 -97200 -91661 -86122 -82626 -79129
-1765g9129n092n092J57J56k706k706J059J058l712l713L623L623O486O486m33m32m32m33
$$ -79129 -84221 -89313 -89156 -89000 -91706 -94412 -93353 -92295 -96007 -99720 -96097 -92474 -85988 -79502 -79935 -80367 -80799 -81232
-1747h1232l474l474J297J298j983j983Q79Q80l43l43j774j771M62M63M62M62m995m995k132
$$ -81232 -84706 -88180 -86883 -85585 -87568 -89551 -88672 -87792 -88135 -88478 -90252 -92023 -91561 -91098 -90636 -90174 -95169 -100164 -102296
-1728a02296k128M354M353J491J491n9o0O381n065m5m5p60p60M4M5M5M8p75p72O56O60L608
$$ -102296 -104424 -100070 -95717 -94226 -92735 -92794 -92854 -86473 -91538 -91583 -91628 -92388 -93148 -93104 -93059 -93014 -92966 -93741 -94513 -93857 -93197 -89589
-1706h9589L612l071l068l73l69l73l69k967k963j536j532K565K568k98k95n66n63l429l426
$$ -89589 -85977 -89048 -92116 -92489 -92858 -93231 -93600 -96567 -99530 -101066 -102598 -100033 -97465 -97763 -98058 -98624 -99187 -102616 -106042
-1687a06042K594K599K594K598K68K72O27O30j991L739L735j987j036j033j394j390J289J294
$$ -106042 -103448 -100849 -98255 -95657 -95389 -95117 -94490 -93860 -95851 -92112 -88377 -90364 -91400 -92433 -93827 -95217 -93928 -92634
-1669i2634R32R35j215o937k169L560M383M387J283m440L88L91k833k829r24r21j282j279
$$ -92634 -91702 -90767 -91982 -98919 -101088 -97528 -93145 -88758 -87475 -91915 -91527 -91136 -93969 -96798 -97722 -98643 -99925 -101204
-1651a01204K475l246l0k6K102K103J744J744L296k431P90P91k535k535k177k176n935k08
$$ -101204 -98729 -101975 -102005 -102031 -99929 -97826 -96082 -94338 -91042 -93473 -92683 -91892 -94427 -96962 -99139 -101315 -107250 -107458
-1633a07458J342J341j78j79n37n37N964K39j312j312j790j789K982K982j19j19O202O203
$$ -107458 -106116 -104775 -104953 -105132 -105669 -106206 -100242 -100003 -101315 -102627 -104417 -106206 -103224 -100242 -100361 -100480 -94278 -88075
-1615h8075M063j663n121n122n062n062J618J618J081J081J081J080L467L467j305j305j088
$$ -88075 -84012 -85675 -90796 -95918 -100980 -106042 -104424 -102806 -101725 -100644 -99563 -98483 -95016 -91549 -92854 -94159 -95247
-1598i5247j089j088j088J595J595l175l176j5j5M756M756j505j506J356J357k27k27k28k27
$$ -95247 -96336 -97424 -98512 -96917 -95322 -98497 -101673 -101688 -101703 -96947 -92191 -93696 -95202 -93846 -92489 -92716 -92943 -93171 -93398
-1579i3398j659j659Q46Q47J815l910l32l32k121L605O825J099m208J517J517m208n461K65
$$ -93398 -95057 -96716 -95870 -95023 -93208 -97118 -97450 -97782 -99903 -96298 -89473 -88374 -92582 -91065 -89548 -93756 -99217 -98952
-1561i8952J457J458r88r88j703M022N095o30l731l731K575K580k87k83K217K222k553k550
$$ -98952 -97495 -96037 -97025 -98013 -99716 -95694 -90599 -91229 -94960 -98691 -96116 -93536 -93823 -94106 -91889 -89667 -92220 -94770
-1543i4770J204J208j659j655Q46Q50Q46Q50J853J856J852J857J82J87J82J87l25l20l24l21
$$ -94770 -93566 -92358 -94017 -95672 -94826 -93976 -93130 -92280 -90427 -88571 -86719 -84862 -84680 -84493 -84311 -84124 -84449 -84769 -85093 -85414
-1523h5414j040j036j040j036o75o71o75o71M1M5M1M5O67O71O67O71K755K758l925l921N40
$$ -85414 -86454 -87490 -88530 -89566 -90241 -90912 -91587 -92258 -92217 -92172 -92131 -92086 -91419 -90748 -90081 -89410 -86655 -83897 -87822 -91743 -91203
-1502i1203N44J83J86J316m406j189j185n93n89n92n89M21M25M21M25l381l381k188L538M312
$$ -91203 -90659 -90476 -90290 -88974 -93380 -94569 -95754 -96347 -96936 -97528 -98117 -97696 -97271 -96850 -96425 -99806 -103187 -105375 -101837 -97525
-1482i7525j412o97o97M95M96L359L358j234j234j233j234k926k926J487J487K263l463K620
$$ -97525 -98937 -99634 -100331 -99836 -99340 -95981 -92623 -93857 -95091 -96324 -97558 -100484 -103410 -101923 -100436 -98173 -101636 -99016
-1464i9016K621j286j286J219J219M976p49K471K471l105l101J666J670j733j730j733j730
$$ -99016 -96395 -97681 -98967 -97748 -96529 -91553 -92302 -89831 -87360 -90465 -93566 -91900 -90230 -91963 -93693 -95426 -97156
-1447i7156M14M18M13M18O52O56k210k207l910l906J219J222j53N577K352K355k72k68K591
$$ -97156 -96742 -96324 -95911 -95493 -94841 -94185 -96395 -98602 -102512 -106418 -105199 -103977 -104130 -98553 -96201 -93846 -94118 -94386 -91795
-1428i1795K594l4k9l4l0j297j297j655M070m02m03k907k908m637m637K043K043j476j477
$$ -91795 -89201 -89235 -89264 -89298 -89328 -90625 -91922 -93577 -89507 -89909 -90312 -93219 -96127 -100764 -105401 -103358 -101315 -102791 -104268
-1409a04268L296L295L05L06L526k199k736k736J677J678M092M093J230J230l421l422J349
$$ -104268 -100972 -97677 -97372 -97066 -93540 -95739 -98475 -101211 -99534 -97856 -93764 -89671 -88441 -87211 -90632 -94054 -92705
-1392i2705J349Q32Q31l582l582m358J368K919K918J46J45J46J45k72k72k72k72k390k389
$$ -92705 -91356 -90524 -89693 -93275 -96857 -101215 -99847 -96928 -94010 -93864 -93719 -93573 -93428 -93700 -93972 -94244 -94516 -96906 -99295
-1373i9295k389k390o3o3l284K441R66R65O094O095L053L052O274N48j83j79n40n37o60o56
$$ -99295 -101684 -104074 -104137 -104200 -107484 -105043 -104077 -103112 -97018 -90923 -87870 -84818 -78544 -77996 -78179 -78358 -78898 -79435 -80095 -80751
-1353h0751l519l518l583l578j23N606j554j551j193j192K672K677K314K319j1n733p880J662
$$ -80751 -84270 -87788 -91371 -94949 -95072 -89466 -91020 -92571 -93764 -94956 -92284 -89607 -87293 -84974 -84985 -90718 -98598 -96936
-1335i6936K867K870L821j901j309j304j663j662M73M74k390k389k032k031O199O199J830
$$ -96936 -94069 -91199 -87378 -89279 -90588 -91892 -93555 -95217 -94744 -94270 -96660 -99049 -101081 -103112 -96913 -90714 -88884
-1318h8884l895o75o75m96m95m96m96J599J599J599J600k576k576K87K87L299L299l023l023
$$ -88884 -92779 -93454 -94129 -94625 -95120 -95616 -96112 -94513 -92914 -91315 -89715 -92291 -94867 -94580 -94293 -90994 -87695 -90718 -93741
-1299i3741m335J390O75O74M924p97n867l005L199L198L377L377j264j260J603J603M10M10
$$ -93741 -98076 -96686 -96011 -95337 -90413 -91210 -97077 -100082 -96883 -93685 -90308 -86931 -88195 -89455 -87852 -86249 -85839 -85429
-1281h5429k453k452k017k013k012k013P30P31R09R10m66K400J148m577k371k370J34J34J64
$$ -85429 -87882 -90334 -92351 -94364 -96376 -98389 -97659 -96928 -96019 -95109 -95575 -93175 -92027 -96604 -98975 -101345 -101211 -101077 -100913
-1262a00913J68J64J68N173N178M02M07N81N85M03M06l72l232p709j979J953J957K311K315
$$ -100913 -100745 -100581 -100413 -95240 -90062 -89660 -89253 -88672 -88087 -87684 -87278 -87650 -90882 -98591 -100570 -98617 -96660 -94349 -92034
-1243i2034l13l09l14l09l206l201l43l40L73L77j596J271L005k718J037J040l318K412N628
$$ -92034 -92347 -92656 -92970 -93279 -96485 -99686 -100029 -100369 -99996 -99619 -101215 -99944 -96939 -99657 -98620 -97580 -100898 -98486 -92858
-1224i2858r3l496K232M40k419j230J636N927K05j193j189j550j547J252J256J253J256P75
$$ -92858 -92951 -96447 -94215 -93775 -96194 -97424 -95788 -89861 -89656 -90849 -92038 -93588 -95135 -93883 -92627 -91374 -90118 -89343
-1206h9343P79K744j16p574j845k386k382j79j75l041l038J371J376J372J375L43L47l236
$$ -89343 -88564 -85820 -85936 -93510 -95355 -97741 -100123 -100302 -100477 -103518 -106556 -105185 -103809 -102437 -101062 -100719 -100372 -103608
-1188a03608K494O247N26k580k575j223j219j223j218R84R87R85R87J074J077J074J077j253
$$ -103608 -101114 -94867 -94341 -96921 -99496 -100719 -101938 -103161 -104379 -103395 -102408 -101423 -100436 -99362 -98285 -97211 -96134 -97387
-1170i7387j248o0N669L47n379j800j800K970K971j800j800K240K240J882J883K001l723n04
$$ -97387 -98635 -98695 -93026 -92679 -98058 -99858 -101658 -98688 -95717 -97517 -99317 -97077 -94837 -92955 -91072 -89071 -92794 -93298
-1152i3298n03k657k658j107M618J338J338J696J696O83O82O82O82l32l32l31l32k125k121
$$ -93298 -93801 -96458 -99116 -100223 -95605 -94267 -92929 -91233 -89537 -88854 -88172 -87490 -86808 -87140 -87472 -87803 -88135 -90260 -92381
-1133i2381P38P42R77R80R77R80J42J45k16N513j946j942j588j584L265L269L265L270l14
$$ -92381 -91643 -90901 -89924 -88944 -87967 -86987 -86845 -86700 -86916 -81403 -83349 -85291 -86879 -88463 -85198 -81929 -78664 -75394 -75708
-1114g5708l09n084n081k102k099P61P64m33m28p5p1k068L656M36M37K57K57k248k247l650
$$ -75708 -76017 -81101 -86182 -88284 -90383 -89622 -88858 -89291 -89719 -89794 -89865 -91933 -88277 -87841 -87404 -87147 -86890 -89138 -91385 -95035
-1094i5035K077j145j144L746L746Q84Q83O82O82O82O83n342n341k479k479J636J637j227
$$ -95035 -92958 -94103 -95247 -91501 -87755 -86871 -85988 -85306 -84624 -83942 -83259 -88601 -93942 -96421 -98900 -97264 -95627 -96854
-1076i6854j226J756J755J756J756k147k147n368L58K326K326K683K684n66n67m980m980l250
$$ -96854 -98080 -96324 -94569 -92813 -91057 -93204 -95351 -100719 -100361 -98035 -95709 -93026 -90342 -90908 -91475 -96455 -101435 -104685
-1058a04685K475K117K117K774K773r0q9j640j640m48N279M458j268k460k460m309m309M62
$$ -104685 -102210 -100093 -97976 -95202 -92429 -92519 -92608 -94248 -95888 -96336 -91057 -86599 -87867 -90327 -92787 -97096 -101405 -100943
-1040a00943O188M387n155N70N71M51M51k412k412k34k35k35k35P79P79P79P79k27k28k27
$$ -100943 -94755 -90368 -95523 -94953 -94382 -93931 -93480 -95892 -98304 -98538 -98773 -99008 -99243 -98464 -97685 -96906 -96127 -96354 -96582 -96809
-1020i6809k27J084J085j778j778L724L724j048j047P42P41P42P42K01K01K02K01k423k423
$$ -96809 -97036 -95952 -94867 -96645 -98423 -94699 -90975 -92023 -93070 -92328 -91587 -90845 -90103 -89902 -89701 -89499 -89298 -91721 -94144
-1001i4144k423k422J513J513J514J513j111j111j110j111J148J152J148J152k24k20k24k20
$$ -94144 -96567 -98989 -97476 -95963 -94449 -92936 -94047 -95158 -96268 -97379 -96231 -95079 -93931 -92779 -93003 -93223 -93447 -93667
-983i3667k221k218K550K553K24K27k997K732R25R24J282J283K892K893K9L0m32m33m32m32
$$ -93667 -95888 -98106 -95556 -93003 -92779 -92552 -95549 -92817 -91892 -90968 -89686 -88403 -85511 -82618 -82589 -82559 -82991 -83424 -83856 -84288
-963h4288l295l295J476J476j398j394j398j394K12K17L075L079j174j171m037m033J9K2K881
$$ -84288 -87583 -90878 -89402 -87926 -89324 -90718 -92116 -93510 -93298 -93081 -90006 -86927 -88101 -89272 -93309 -97342 -97323 -97301 -94420
-944i4420K886K970K971J08J08j502j502j502j502o08o08K256K255j801j800j800j801j856
$$ -94420 -91534 -88564 -85593 -85485 -85377 -86879 -88381 -89883 -91385 -91993 -92601 -90345 -88090 -89891 -91691 -93491 -95292 -97148
-926i7148j853J007J010K199K203o63o60k46k42J11J16k453L277L272k449j8j9l76l77N18
$$ -97148 -99001 -97994 -96984 -94785 -92582 -93245 -93905 -94151 -94393 -94282 -94166 -96619 -93342 -90070 -92519 -92537 -92556 -92932 -93309 -92791
-906i2791N18l060K665N081o45l150K576m06m07m8m8r81r76J524J528M447j275k829k825K449
$$ -92791 -92273 -95333 -92668 -87587 -88232 -91382 -88806 -89212 -89619 -89667 -89715 -90696 -91672 -90148 -88620 -84173 -85448 -88277 -91102 -88653
-886h8653K453m14m10Q38Q43k024k020j436j435j435j435J487J488K203l523l045K680J964
$$ -88653 -86200 -86614 -87024 -86186 -85343 -87367 -89387 -90823 -92258 -93693 -95128 -93641 -92153 -89950 -93473 -96518 -93838 -91874
-868i1874J965J904J905N125o00o474o475j465M261J159J159J517J517K874K874n714n714
$$ -91874 -89909 -88005 -86100 -80975 -81575 -88049 -94524 -95989 -91728 -90569 -89410 -87893 -86376 -83502 -80628 -86342 -92056
-851i2056k852k851J919J920P42P41P42P42J040J040J040J040j719j718j718j719j002j003
$$ -92056 -94908 -97759 -95840 -93920 -93178 -92437 -91695 -90953 -89913 -88873 -87833 -86793 -88512 -90230 -91948 -93667 -94669 -95672
-833i5672j003j002J286J286J286J286J703J703j159j159j010j010j010j011J137J137J137
$$ -95672 -96675 -97677 -96391 -95105 -93819 -92533 -90830 -89127 -90286 -91445 -92455 -93465 -94475 -95486 -94349 -93212 -92075
-816i2075J137J923J927k847k844l325l322l325l321M876M879l712l709Q79Q84L742L746M518
$$ -92075 -90938 -89015 -87088 -89935 -92779 -96104 -99426 -102751 -106072 -101196 -96317 -100029 -103738 -102859 -101975 -98233 -94487 -89969
-798h9969M521k53k50l354l351l355l351P45P50P45P49q65q61J998K002J096J096J096J096
$$ -89969 -85448 -85701 -85951 -89305 -92656 -96011 -99362 -98617 -97867 -97122 -96373 -97238 -98099 -96101 -94099 -93003 -91907 -90811 -89715
-779h9715K885K885l795l794j454j454j454j453J528J528J528J529J953J953r09r10M100M101
$$ -89715 -86830 -83945 -87740 -91534 -92988 -94442 -95896 -97349 -95821 -94293 -92765 -91236 -89283 -87330 -88239 -89149 -85049 -80948
-761h0948o71o71j596j595j238j237k311L414R10m816k307L418L060k665J152J151P94P94
$$ -80948 -81619 -82290 -83886 -85481 -86719 -87956 -90267 -86853 -85943 -90759 -93066 -89648 -86588 -89253 -88101 -86950 -86156 -85362
-743h5362j442j443n856n856J68N893N893J68k87k87o45o45n25n26j241M484M29n297k434
$$ -85362 -86804 -88247 -94103 -99959 -99791 -93898 -88005 -87837 -88124 -88411 -89056 -89701 -90226 -90752 -91993 -87509 -87080 -92377 -94811
-724i4811L291L351k374J204J204K207K210O56n066J20J23k39k35J611J614J610J614j193
$$ -94811 -91520 -88169 -90543 -89339 -88135 -85928 -83718 -83062 -88128 -88008 -87885 -88124 -88359 -86748 -85134 -83524 -81910 -83103
-706h3103j189j193j189P83P86k080k076j364j361j364j360K482K486l80l76k349k344J56
$$ -83103 -84292 -85485 -86674 -85891 -85105 -87185 -89261 -90625 -91986 -93350 -94710 -92228 -89742 -90122 -90498 -92847 -95191 -95035
-688i5035J61N311m13J256m469O3O3k94k95J23J23J23J23J793J793J793J793j949j950j949
$$ -95035 -94874 -89563 -89976 -88720 -93189 -93126 -93063 -93357 -93652 -93529 -93406 -93283 -93160 -91367 -89574 -87781 -85988 -87937 -89887 -91836
-668i1836j950j532j532K881K882L284k442P79P79k083k084P79P79q31q31q32q31m73m74m73
$$ -91836 -93786 -95318 -96850 -93969 -91087 -87803 -90245 -89466 -88687 -90770 -92854 -92075 -91296 -92127 -92958 -93790 -94621 -95094 -95568 -96041
-648i6041m73p57p57K106K106J08J08j323j323J517J517J517J517L098L097j673j674mlK859
$$ -96041 -96514 -97271 -98028 -95922 -93816 -93708 -93600 -94923 -96246 -94729 -93212 -91695 -90178 -87080 -83983 -85656 -87330 -87334 -87337 -84478
-628h4478K859m447m447L24L24M37M36r96r95J391J390J390J391K12K13J643J644j070j069
$$ -84478 -81619 -86066 -90513 -90189 -89865 -89428 -88992 -89988 -90983 -89592 -88202 -86812 -85421 -85209 -84996 -83353 -81709 -82779 -83848
-609h3848J792J793K457K456k315k314J1J1J1J1J547J547M410M409M231M231P093P094P734
$$ -83848 -82056 -80263 -77806 -75350 -77665 -79979 -79968 -79957 -79946 -79935 -78388 -76841 -72431 -68022 -63791 -59560 -52467 -45373 -37639
-590c7639P738J5134J5133K8847M0301O1056P2507N4462k788n3124n8849n2770m7041l4755
$$ -37639 -29901 -14767 366 29213 69514 130570 203077 257539 254751 201627 142778 90008 42967 8212
-576H212k3303j6509j0780r826m100k971k967m041m040l135l131j700j699L216L221l459l459
$$ 8212 -15091 -31600 -42380 -52206 -56306 -59277 -62244 -66285 -70325 -73460 -76591 -78291 -79990 -76774 -73553 -77012 -80471
-559h0471O33O38p98p94M85M88r47r43j126j122L06L10m11m06m10m06k908k903m5m1J327J331
$$ -80471 -79838 -79200 -79998 -80792 -80307 -79819 -80766 -81709 -82835 -83957 -83651 -83341 -83752 -84158 -84568 -84974 -87882 -90785 -90830 -90871 -89544 -88213
-537h8213j536j532m32m29K430K434j327j323j327j323M808M812l179K546J826J830K188K188
$$ -88213 -89749 -91281 -91713 -92142 -89712 -87278 -88605 -89928 -91255 -92578 -87770 -82958 -86137 -83591 -81765 -79935 -77747 -75559
-519g5559k721k717n580n580j916j912R50R51J12J15J547J547K01K05K05K05j692j688j689
$$ -75559 -78280 -80997 -86577 -92157 -94073 -95985 -95035 -94084 -93972 -93857 -92310 -90763 -90562 -90357 -90152 -89947 -91639 -93327 -95016
-500i5016j689j811j808O97O97N275m48r3q9n41n37N901J79l239K490L39L43O07O12m164m160
$$ -95016 -96705 -98516 -100324 -99627 -98930 -93655 -94103 -94196 -94285 -94826 -95363 -89462 -89283 -92522 -90032 -89693 -89350 -88743 -88131 -92295 -96455
-479i6455l69l65l69l65J658J663J659J662k561k557L02L06J53J56K300l422m924Q05j226
$$ -96455 -96824 -97189 -97558 -97923 -96265 -94602 -92943 -91281 -93842 -96399 -96097 -95791 -95638 -95482 -93182 -96604 -101528 -100723 -101949
-460a01949M503n11n07j584j581M887M891K024K027J011J013j852j849Q16Q20l835J893k225
$$ -101949 -97446 -97957 -98464 -100048 -101629 -96742 -91851 -89827 -87800 -86789 -85776 -87628 -89477 -88661 -87841 -91676 -89783 -92008
-442i2008k221R95R99l642l638k210k207J070J073K501K505m96m95K367K367L351L351M88
$$ -92008 -94229 -93234 -92235 -95877 -99515 -101725 -103932 -102862 -101789 -99288 -96783 -97279 -97774 -95407 -93040 -89689 -86338 -85850
-424h5850M88k792k792P1P1j032j033L99L99k740k740K032K031J53J53N11N10k710L016k05
$$ -85850 -85362 -88154 -90946 -90875 -90804 -91836 -92869 -92470 -92071 -94811 -97551 -95519 -93488 -93335 -93182 -92671 -92161 -94871 -91855 -92060
-404i2060k05k471k472k113k114j573M153R32R31J827J826J469J469L049k677k318k319k258
$$ -92060 -92265 -94736 -97208 -99321 -101435 -103008 -98855 -97923 -96992 -95165 -93339 -91870 -90401 -87352 -90029 -92347 -94666 -96924
-386i6924k259k259k259K505K505K505K504J611J610J610J611j641j640L131L132J520J521
$$ -96924 -99183 -101442 -103701 -101196 -98691 -96186 -93682 -92071 -90461 -88851 -87240 -88881 -90521 -87390 -84258 -82738 -81217
-369h1217j342j342m290m290j428j428L62L62L61L62O59O60O60O60k203k203k561L165L791
$$ -81217 -82559 -83901 -88191 -92481 -93909 -95337 -94975 -94613 -94252 -93890 -93231 -92571 -91911 -91251 -93454 -95657 -98218 -95053 -91262
-350i1262L790k531k530O89O90k173k174n5n6M715M715O60O60O59O60r99r95r99r95j894j890
$$ -91262 -87472 -90003 -92533 -91844 -91154 -93327 -95501 -95556 -95612 -90897 -86182 -85522 -84862 -84203 -83543 -84542 -85537 -86536 -87531 -89425 -91315
-329i1315R70R72p45p42p45p42K117K121k654k650p8p5K80K83m850Q80L977L981L307k416
$$ -91315 -90345 -89373 -90118 -90860 -91605 -92347 -90230 -88109 -90763 -93413 -93491 -93566 -93286 -93003 -97853 -96973 -92996 -89015 -85708 -88124
-309h8124Q02Q05J099J104l672l668M134M138K583l139l142l139J271J275k456k453M9N2K314
$$ -88124 -87322 -86517 -85418 -84314 -87986 -91654 -87520 -83382 -80799 -83938 -87080 -90219 -88948 -87673 -90129 -92582 -92533 -92481 -90167
-290i0167l406K672K677L50L54k512k509K617K620L333k390p760k032J066J070j320j315L451
$$ -90167 -93573 -90901 -88224 -87874 -87520 -90032 -92541 -89924 -87304 -83971 -86361 -94121 -96153 -95087 -94017 -95337 -96652 -93201
-272i3201L456K613K613K970k750k934k934l649K080J077J078J435J439j011j010j010j006
$$ -93201 -89745 -87132 -84519 -81549 -84299 -87233 -90167 -93816 -91736 -90659 -89581 -88146 -86707 -87718 -88728 -89738 -90744
-255i0744j08j08j09j04k613k613K158K162k016k017k374L354J503J502k554k549j622M104
$$ -90744 -90852 -90960 -91069 -91173 -93786 -96399 -94241 -92079 -94095 -96112 -98486 -95132 -93629 -92127 -94681 -97230 -98852 -94748
-237i4748Q84Q87K613K613j800j797n453K72L134k586k6k7l84l80K434K434n557J71M283M283
$$ -94748 -93864 -92977 -90364 -87751 -89551 -91348 -96801 -96529 -93395 -95981 -96007 -96034 -96418 -96798 -94364 -91930 -97487 -97316 -93033 -88750
-217h8750j31j26m097m096O74O79M96M95M96N00n67n63J942J942M47n274k054k054M92M96
$$ -88750 -88881 -89007 -93104 -97200 -96526 -95847 -95351 -94856 -94360 -93860 -94427 -94990 -93048 -91106 -90659 -95933 -97987 -100041 -99549 -99053
-197i9053M96M96M92M95M96M96Q2Q6Q5Q6j290j286j285j286L377L380J61J60L377k344n208
$$ -99053 -98557 -98061 -97569 -97074 -96578 -96082 -96000 -95914 -95829 -95743 -97033 -98319 -99604 -100890 -97513 -94133 -93972 -93812 -90435 -92779 -97987
-176i7987N18j759j756j397j398k117k114K658K657Q95Q98Q99Q98K087K092p72p72J208J211
$$ -97987 -97469 -99228 -100984 -102381 -103779 -105896 -108010 -105352 -102695 -101800 -100902 -100003 -99105 -97018 -94926 -95698 -96470 -95262 -94051
-157i4051Q54Q54Q50m872n230M96O590Q68l24l24O86O89k173k173L448L452j324j319J181
$$ -94051 -93197 -92343 -91493 -96365 -101595 -101099 -94509 -93641 -93965 -94289 -93603 -92914 -95087 -97260 -93812 -90360 -91684 -93003 -91822
-138i1822J186J181J186q31q28q31q28j726j722J137J141P71P76P71P76k151k147k151k147
$$ -91822 -90636 -89455 -88269 -89100 -89928 -90759 -91587 -93313 -95035 -93898 -92757 -91986 -91210 -90439 -89663 -91814 -93961 -96112 -98259
-119i8259M14M17M14M18l02k99l01k99J64J68J64J68L444L448L444L448k535k531L28L32Q65
$$ -98259 -97845 -97428 -97014 -96596 -96898 -97197 -97498 -97797 -97633 -97465 -97301 -97133 -93689 -90241 -86797 -83349 -85884 -88415 -88087 -87755 -86890
-98h6890Q68Q65Q69j409j406j409j405j707j703j708j703M540M544L347k374o494p64j483
$$ -86890 -86022 -85157 -84288 -85697 -87103 -88512 -89917 -91624 -93327 -95035 -96738 -92198 -87654 -84307 -86681 -93175 -93939 -95422
-80i5422j480L653L653M011j715k83k84k83k83j834L891L892j834p01p01j058j059K006K005
$$ -95422 -96902 -93249 -89596 -85585 -87300 -87583 -87867 -88150 -88433 -90267 -86376 -82484 -84318 -85019 -85720 -86778 -87837 -85831 -83826
-61h3826k766k766R92R91j871j871L06L05L169L168J081J081J081J081K691K691k080k080
$$ -83826 -86592 -89358 -88366 -87375 -89246 -91117 -90811 -90506 -87337 -84169 -83088 -82007 -80926 -79845 -77154 -74463 -76543 -78623
-43g8623O8O7O7O7L496L497n092n092M55M55k408k408j953j954K818K818j714j715j715j714
$$ -78623 -78555 -78488 -78421 -78354 -74858 -71361 -76453 -81545 -81090 -80635 -83043 -85451 -87404 -89358 -86540 -83722 -85436 -87151 -88866 -90580
-23i0580j148j148j506j506O068L43j208j207j119j114j118j115j178j174J685J688r54r50
$$ -90580 -91728 -92876 -94382 -95888 -89820 -89477 -90685 -91892 -93011 -94125 -95243 -96358 -97536 -98710 -97025 -95337 -96291 -97241
-5i7241J908J912O56O60O56O60k270k266N92N97m%K859K863j763j760j167j162k599O948J935
$$ -97241 -95333 -93421 -92765 -92105 -91449 -90789 -93059 -95325 -94733 -94136 -94140 -94140 -91281 -88418 -90181 -91941 -93108 -94270 -96869 -89921 -87986
15h7986J938n445K79L142k583o15o15r73r73l3l4l3l4l731l731J040J040L772L772r99r99
$$ -87986 -86048 -91493 -91214 -88072 -90655 -91270 -91885 -92858 -93831 -93864 -93898 -93931 -93965 -97696 -101427 -100387 -99347 -95575 -91803 -92802 -93801
36i3801o41o41o41o41N22N21N22N22j923j924j923j923O74O75O758J032K762K762k009k009
$$ -93801 -94442 -95083 -95724 -96365 -95843 -95322 -94800 -94278 -96201 -98125 -100048 -101971 -101297 -100622 -93864 -92832 -90070 -87308 -89317 -91326
56i1326m544J182O549O549j323j323j323j324j755j756j756j755l485l486l83N341L940j786
$$ -91326 -95870 -94688 -88139 -81590 -82913 -84236 -85559 -86883 -88638 -90394 -92150 -93905 -97390 -100876 -101259 -95918 -91978 -93764
74i3764j427M298L403L403k919k918k803k800O0O3K744K747K743K748l668l664q06q01k68
$$ -93764 -95191 -90893 -87490 -84087 -87006 -89924 -92727 -95527 -95467 -95404 -92660 -89913 -87170 -84422 -88090 -91754 -92560 -93361 -93629
93i3629k65k68k65N37N40N37N40j312j308j312j308R09R13j953j949m5m1m5m1k508k509N841
$$ -93629 -93894 -94162 -94427 -93890 -93350 -92813 -92273 -93585 -94893 -96205 -97513 -96604 -95691 -97644 -99593 -99638 -99679 -99724 -99765 -102273 -104782 -98941
115i8941J16j555M171N93N93J084J085j420j420k673L053L053k673O52O53K94K95p20p19l582
$$ -98941 -98825 -100380 -96209 -95616 -95023 -93939 -92854 -94274 -95694 -98367 -95314 -92261 -94934 -94282 -93629 -93335 -93040 -93760 -94479 -98061
135i8061l582P71P72L992j733K799K799K084K084K855k870n733qQ28Q27j677j677K318K319
$$ -98061 -101643 -100872 -100100 -96108 -97841 -95042 -92243 -90159 -88075 -85220 -88090 -93823 -93831 -93003 -92176 -93853 -95530 -93212 -90893
154i0893K318K319Q87Q87l06o031l131K594o26o26l549K177l28o053m443J282R24R25r25M801
$$ -90893 -88575 -86256 -85369 -84482 -84788 -90819 -93950 -91356 -91982 -92608 -96157 -93980 -94308 -100361 -104804 -103522 -102598 -101673 -102598 -97797
174i7797O948k594l515l515k561L165K926K926L284L284k054k054J167J167l605K121J763
$$ -97797 -90849 -93443 -96958 -100473 -103034 -99869 -96943 -94017 -90733 -87449 -89503 -91557 -90390 -89223 -92828 -90707 -88944
191h8944J763J08J08J09J08r06r06r06r06J16J16J15J16l165l165l02l01J483J484J483J484
$$ -88944 -87181 -87073 -86965 -86856 -86748 -87654 -88560 -89466 -90372 -90256 -90140 -90025 -89909 -93074 -96239 -96541 -96842 -95359 -93875 -92392 -90908
212i0908k751k751K259P984L951j774K53n472m338m339J983J983r54r55n96n96j849L876O024
$$ -90908 -93659 -96410 -94151 -86167 -82216 -83990 -83737 -89209 -93547 -97886 -95903 -93920 -94874 -95829 -96425 -97021 -98870 -94994 -88970
231h8970l519J461J462O232l310k654k654l88l87m10m07m10m06J141J144P83P86L348k375
$$ -88970 -92489 -91028 -89566 -83334 -86644 -89298 -91952 -92340 -92727 -93137 -93544 -93954 -94360 -93219 -92075 -91292 -90506 -87158 -89533
250h9533l929l925l272l269J498J502L944L947J081J085n89n85r47r43L65n356n360L69N375
$$ -89533 -93462 -97387 -100659 -103928 -102430 -100928 -96984 -93037 -91956 -90871 -91460 -92045 -92992 -93935 -93570 -98926 -104286 -103917 -98542
269i8542N379K631l090l929J797J081J081M123M122J260J260j364j365j364j364J975J976
$$ -98542 -93163 -90532 -93622 -97551 -95754 -94673 -93592 -89469 -85347 -84087 -82827 -84191 -85556 -86920 -88284 -86309 -84333
286h4333M25n301q9q9r0q9l609K118J759J759m607m607K072K073j34j34j35j34J100J103l314
$$ -84333 -83908 -89209 -89298 -89387 -89477 -89566 -93175 -91057 -89298 -87539 -92146 -96753 -94681 -92608 -92742 -92876 -93011 -93145 -92045 -90942 -94256
307i4256l310l850J879j346j342L455L460L097L101K501l220o445p16N349l72j570j565L99
$$ -94256 -97566 -101416 -99537 -100883 -102225 -98770 -95310 -92213 -89112 -86611 -89831 -96276 -96992 -91643 -92015 -93585 -95150 -94751
325i4751M02L99M03J725J730j137j133J070J073j793j789j882j883R81R80j703j704J159J160
$$ -94751 -94349 -93950 -93547 -91822 -90092 -91229 -92362 -91292 -90219 -92012 -93801 -95683 -97566 -96585 -95605 -97308 -99012 -97853 -96693
344i6693K411K412N632r3J815J816j406j405j379j376j737j733J186m537J543J547J782J785
$$ -96693 -94282 -91870 -86238 -86331 -84516 -82700 -84106 -85511 -86890 -88266 -90003 -91736 -90550 -95087 -93544 -91997 -90215 -88430
362h8430j080j078k214k210k214k211J931J935q73l731k005L724O403O82K230K232r7K770
$$ -88430 -89510 -90588 -92802 -95012 -97226 -99437 -97506 -95571 -96444 -100175 -102180 -98456 -92053 -91371 -89141 -86909 -87006 -84236
380h4236K110l612k185O83J330m394m574J152J986l738J092L955q91q91p12p12k859k859J912
$$ -84236 -82126 -85738 -87923 -87240 -85910 -90304 -94878 -93726 -91740 -95478 -94386 -90431 -91322 -92213 -92925 -93637 -96496 -99355 -97443
399i7443J913J30J34J31J34l806l802R06L772N811R0O82k177n043O86K64L131J182j677J181
$$ -97443 -95530 -95400 -95266 -95135 -95001 -98807 -102609 -101703 -97931 -92120 -92030 -91348 -93525 -98568 -97882 -97618 -94487 -93305 -94982 -93801
419i3801M048n48l407l052j87J092L959L239k482k069L660K047q13o184m55l500l496n945
$$ -93801 -89753 -90301 -93708 -96760 -96947 -95855 -91896 -88657 -91139 -93208 -89548 -87501 -88314 -94498 -94953 -98453 -101949 -107894
437a07894k17O818J096o97N032J450J454j711j707J151J156J398J401j465j461q68q65q69
$$ -107894 -108111 -101293 -100197 -100894 -95862 -94412 -92958 -94669 -96376 -95225 -94069 -92671 -91270 -92735 -94196 -95064 -95929 -96798
455i6798q64J159J163J159J163J696J700l254l251j878m742o172m48O411R274K893K893K53
$$ -96798 -97662 -96503 -95340 -94181 -93018 -91322 -89622 -92876 -96127 -98005 -102747 -108919 -109367 -102956 -93682 -90789 -87896 -87643
473h7643n472O11O12l266l265m02m03o34o33o34o34K61K61K61K61j841j842j841j842R03R02
$$ -87643 -93115 -92504 -91892 -95158 -98423 -98825 -99228 -99862 -100495 -101129 -101763 -101502 -101241 -100980 -100719 -102560 -104402 -106243 -108085 -107182 -106280
$$ [...]
##END=	
