##TITLE=	1Wfpri2JQLyVo+Dm8pto5g/6666s
##JCAMPDX=	6.0	$$ NMR Plug-in 1.13 of MestReNova 11.0.4-18998
##DATATYPE=	NMRSPECTRUM
##DATACLASS=	XYDATA
##NUMDIM=	1
##ORIGIN=	Bruker BioSpin GmbH
##OWNER=	andrew
##.OBSERVEFREQUENCY=	600.30184456100005264
##.OBSERVENUCLEUS=	^1H
##.SOLVENTNAME=	CD2Cl2
##.PULSESEQUENCE=	zg
##LONGDATE=	2015/06/05 11:36:06.000
##.ACQUISITIONMODE=	SIMULTANEOUS (DQD)
##$ORIGINALFORMAT=	Bruker XWIN-NMR
##$PARAMETERFILE=	(acqus, ASCII, /var/folders/f6/rjf_tdyn2v98c5c0wvkgn4s80000gn/T/1Wfpri2JQLyVo+Dm8pto5g/6666s/acqus, 0)
$$ ##TITLE= Parameter file, TOPSPIN		Version 2.1
$$ ##JCAMPDX= 5.0
$$ ##DATATYPE= Parameter Values
$$ ##NPOINTS= 10	$$ modification sequence number
$$ ##ORIGIN= Bruker BioSpin GmbH
$$ ##OWNER= andrew
$$ $$ 2015-06-05 16:36:07.171 +0600  andrew@av-600
$$ $$ /opt/data/andrew/nmr/limog-1782/618/acqus
$$ $$ process /opt/ts21pl6/prog/mod/shimcntl
$$ ##$ACQT0= -9.54927425515661
$$ ##$AMP= (0..31)
$$ 100 100 100 100 100 100 100 100 100 100 100 100 100 100 100 100 100 100
$$ 100 100 100 100 100 100 100 100 100 100 100 100 100 100
$$ ##$ANAVPT= -1
$$ ##$AQSEQ= 0
$$ ##$AQ_mod= 3
$$ ##$AUNM= <au_zg>
$$ ##$AUTOPOS= <>
$$ ##$BF1= 600.3
$$ ##$BF2= 600.3
$$ ##$BF3= 600.3
$$ ##$BF4= 600.3
$$ ##$BF5= 600.3
$$ ##$BF6= 600.3
$$ ##$BF7= 600.3
$$ ##$BF8= 600.3
$$ ##$BYTORDA= 0
$$ ##$CFDGTYP= 0
$$ ##$CFRGTYP= 9
$$ ##$CHEMSTR= <none>
$$ ##$CNST= (0..63)
$$ 1 1 145 1 1 1 1 1 1 1 1 1 1 1 1 1 1 1 1 1 1 1 1 1 1 1 1 1 1 1 1 1 1 1 1
$$ 1 1 1 1 1 1 1 1 1 1 1 1 1 1 1 1 1 1 1 1 1 1 1 1 1 1 1 1 1
$$ ##$CPDPRG= <>
$$ ##$CPDPRG1= <>
$$ ##$CPDPRG2= <waltz16>
$$ ##$CPDPRG3= <>
$$ ##$CPDPRG4= <mlev>
$$ ##$CPDPRG5= <mlev>
$$ ##$CPDPRG6= <mlev>
$$ ##$CPDPRG7= <mlev>
$$ ##$CPDPRG8= <mlev>
$$ ##$CPDPRGB= <>
$$ ##$CPDPRGT= <>
$$ ##$D= (0..63)
$$ 0 1 0 0 0 0 0 0 0 0.06 0 0.03 0 0 0 0 1e-04 0 0 0 0 0 0 0 0 0 0 0 0 0 0
$$ 0 0 0 0 0 0 0 0 0 0 0 0 0 0 0 0 0 0 0 0 0 0 0 0 0 0 0 0 0 0 0 0 0
$$ ##$DATE= 1433500566
$$ ##$DBL= (0..7)
$$ 120 120 120 120 120 120 120 120
$$ ##$DBP= (0..7)
$$ 150 150 150 150 150 150 150 150
$$ ##$DBP07= 0
$$ ##$DBPNAM0= <>
$$ ##$DBPNAM1= <>
$$ ##$DBPNAM2= <>
$$ ##$DBPNAM3= <>
$$ ##$DBPNAM4= <>
$$ ##$DBPNAM5= <>
$$ ##$DBPNAM6= <>
$$ ##$DBPNAM7= <>
$$ ##$DBPOAL= (0..7)
$$ 0.5 0.5 0.5 0.5 0.5 0.5 0.5 0.5
$$ ##$DBPOFFS= (0..7)
$$ 0 0 0 0 0 0 0 0
$$ ##$DE= 6.5
$$ ##$DECBNUC= <off>
$$ ##$DECIM= 2218.66666666667
$$ ##$DECNUC= <off>
$$ ##$DECSTAT= 4
$$ ##$DIGMOD= 1
$$ ##$DIGTYP= 12
$$ ##$DL= (0..7)
$$ 0 120 120 120 120 120 120 120
$$ ##$DP= (0..7)
$$ 150 150 150 150 150 150 150 150
$$ ##$DP07= 0
$$ ##$DPNAME0= <>
$$ ##$DPNAME1= <>
$$ ##$DPNAME2= <>
$$ ##$DPNAME3= <>
$$ ##$DPNAME4= <>
$$ ##$DPNAME5= <>
$$ ##$DPNAME6= <>
$$ ##$DPNAME7= <>
$$ ##$DPOAL= (0..7)
$$ 0.5 0.5 0.5 0.5 0.5 0.5 0.5 0.5
$$ ##$DPOFFS= (0..7)
$$ 0 0 0 0 0 0 0 0
$$ ##$DQDMODE= 0
$$ ##$DR= 22
$$ ##$DS= 0
$$ ##$DSLIST= <SSSSSSSSSSSSSSS>
$$ ##$DSPFIRM= 0
$$ ##$DSPFVS= 20
$$ ##$DTYPA= 0
$$ ##$EXP= <>
$$ ##$F1LIST= <111111111111111>
$$ ##$F2LIST= <222222222222222>
$$ [...]
$$ -1 -1 -1 -1 -1 -1 -1 -1 -1 -1 -1 -1 -1 -1 -1 -1 -1 -1 -1 -1 -1 -1 -1 -1
$$ -1 -1 -1 -1 -1 -1 -1 -1 -1 -1 -1 -1 -1 -1 -1 -1 -1 -1 -1 -1 -1 -1 -1 -1
$$ -1 -1 -1 -1 -1 -1 -1 -1 -1 -1 -1 -1 -1 -1 -1 -1 -1 -1 -1 -1 -1 -1 -1 -1
$$ -1 -1 -1 -1 -1 -1 -1 -1 -1 -1 -1 -1 -1 -1 -1 -1 -1 -1 -1 -1 -1 -1 -1 -1
$$ -1 -1 -1 -1 -1 -1 -1 -1 -1 -1 -1 -1 -1 -1 -1 -1
$$ ##$RG_tab8= (0..255)
$$ -1 -1 -1 -1 -1 -1 -1 -1 -1 -1 -1 -1 -1 -1 -1 -1 -1 -1 -1 -1 -1 -1 -1 -1
$$ -1 -1 -1 -1 -1 -1 -1 -1 -1 -1 -1 -1 -1 -1 -1 -1 -1 -1 -1 -1 -1 -1 -1 -1
$$ -1 -1 -1 -1 -1 -1 -1 -1 -1 -1 -1 -1 -1 -1 -1 -1 -1 -1 -1 -1 -1 -1 -1 -1
$$ -1 -1 -1 -1 -1 -1 -1 -1 -1 -1 -1 -1 -1 -1 -1 -1 -1 -1 -1 -1 -1 -1 -1 -1
$$ -1 -1 -1 -1 -1 -1 -1 -1 -1 -1 -1 -1 -1 -1 -1 -1 -1 -1 -1 -1 -1 -1 -1 -1
$$ -1 -1 -1 -1 -1 -1 -1 -1 -1 -1 -1 -1 -1 -1 -1 -1 -1 -1 -1 -1 -1 -1 -1 -1
$$ -1 -1 -1 -1 -1 -1 -1 -1 -1 -1 -1 -1 -1 -1 -1 -1 -1 -1 -1 -1 -1 -1 -1 -1
$$ -1 -1 -1 -1 -1 -1 -1 -1 -1 -1 -1 -1 -1 -1 -1 -1 -1 -1 -1 -1 -1 -1 -1 -1
$$ -1 -1 -1 -1 -1 -1 -1 -1 -1 -1 -1 -1 -1 -1 -1 -1 -1 -1 -1 -1 -1 -1 -1 -1
$$ -1 -1 -1 -1 -1 -1 -1 -1 -1 -1 -1 -1 -1 -1 -1 -1 -1 -1 -1 -1 -1 -1 -1 -1
$$ -1 -1 -1 -1 -1 -1 -1 -1 -1 -1 -1 -1 -1 -1 -1 -1
$$ ##$RG_tabA= (0..255)
$$ 0.25 0.28 0.32 0.35 0.4 0.44 0.5 0.56 0.64 0.7 0.8 0.89 1 1.12 1.28 1.4
$$ 1.6 1.78 2 2.25 2.56 2.8 3.2 3.56 4 4.5 5 5.6 6.35 7.12 8 9 10 11.3 12.7
$$ 14.2 16 18 20.2 22.6 25.4 28.5 32 36 40.3 45.2 50.8 57 64 71.8 80.6 90.5
$$ 101 114 128 144 161 181 203 -1 -1 -1 -1 -1 -1 -1 -1 -1 -1 -1 -1 -1 -1 -1
$$ -1 -1 -1 -1 -1 -1 -1 -1 -1 -1 -1 -1 -1 -1 -1 -1 -1 -1 -1 -1 -1 -1 -1 -1
$$ -1 -1 -1 -1 -1 -1 -1 -1 -1 -1 -1 -1 -1 -1 -1 -1 -1 -1 -1 -1 -1 -1 -1 -1
$$ -1 -1 -1 -1 -1 -1 -1 -1 -1 -1 -1 -1 -1 -1 -1 -1 -1 -1 -1 -1 -1 -1 -1 -1
$$ -1 -1 -1 -1 -1 -1 -1 -1 -1 -1 -1 -1 -1 -1 -1 -1 -1 -1 -1 -1 -1 -1 -1 -1
$$ -1 -1 -1 -1 -1 -1 -1 -1 -1 -1 -1 -1 -1 -1 -1 -1 -1 -1 -1 -1 -1 -1 -1 -1
$$ -1 -1 -1 -1 -1 -1 -1 -1 -1 -1 -1 -1 -1 -1 -1 -1 -1 -1 -1 -1 -1 -1 -1 -1
$$ -1 -1 -1 -1 -1 -1 -1 -1 -1 -1 -1 -1 -1 -1 -1 -1 -1 -1 -1 -1 -1 -1 -1 -1
$$ -1 -1 -1 -1 -1 -1 -1 -1 -1 -1 -1 -1 -1 -1
$$ ##$ROUT14= (0..7)
$$ 0 0 0 0 0 0 0 0
$$ ##$ROUTER= -1
$$ ##$RX22TY= <no>
$$ ##$RXFMAX= (0..7)
$$ 647.5 -1 -1 -1 -1 -1 -1 -1
$$ ##$RXFMIN= (0..7)
$$ 5 -1 -1 -1 -1 -1 -1 -1
$$ ##$RXINTLV= (0..7)
$$ 1 0 0 0 0 0 0 0
$$ ##$RXMSTY= <no>
$$ ##$SCMTY= <no>
$$ ##$SGUC1= (0..15)
$$ 17 18 34 0 0 0 0 0 0 0 0 0 0 0 0 0
$$ ##$SGUC2= (0..15)
$$ 33 256 20 0 0 0 0 0 0 0 0 0 0 0 0 0
$$ ##$SPECTR= 10
$$ ##$SY2FLAG= 0
$$ ##$TFXNUM= 0
$$ ##$TRIPLO2= 0
$$ ##$VTUTY= <tty05>
$$ ##$WBREFAM= (0..15)
$$ 100 100 100 100 100 100 100 100 100 100 100 100 100 100 100 100
$$ ##$WBREFPH= (0..15)
$$ 0 0 0 0 0 0 0 0 0 0 0 0 0 0 0 0
$$ ##$XFAC= 2
$$ ##END=
$$ 
##$DECIM=	2218.66666666667
##$DSPFVS=	20
##XUNITS=	HZ
##YUNITS=	ARBITRARY UNITS
##FIRSTX=	6322.8525384689401108
##LASTX=	-2691.4329892738592207
##XFACTOR=	-0.1375491802509010153
##YFACTOR=	7.2456738281250003238e-06
##NPOINTS=	65536
##XYDATA=	(X++(Y..Y))
$$ [...]
-11943h4872L498L503j450j445l477l472o15o11K001K004J107j751n63N164L372N14k64k61
-11925g7618m43m40J703J706K418l301k854K869L584P23P23k139o788j066q2q2k586k585K541
-11906h3717K541l21l20j282j281N395N395l369l368J580J580k415M47K236l487j819J044
-11889h1161n67n66l800J926O691R73j416j412J088J092j453j450j453j449j692j687J348
-11872h4988J353j245J621L048k672N44k313J795J800j565j561j565j561k399k396K370K373
-11855h7361J911J915K091K093k678J86J792l927q31q27j189j184P78P83P78P83N55N59k306
-11836h6079k303M013M016J151J155o14o11k582K83L677k042M59k400k787K940N619j01k429
-11818g8635k426P90m929l920J807K638K642O751J032n22n17k996k992j34j30J535J538J535
$$ y = [-84872, -81374, -77871, -79321, -80766, -84243, -87715, -88330, -88941, -86940, -84936, -83829, -85580, -86143, -80979, -77607, -77093, -77357, -77618, -78061, -78501, -76798, -75092, -72674, -75975, -78829, -75960, -72376, -71653, -70930, -73069, -79857, -80923, -81005, -81087, -83673, -86258, -83717, -81176, -81497, -81817, -83099, -84380, -78985, -73590, -76959, -80327, -78747, -77167, -79582, -79135, -76899, -80386, -82205, -81161, -81728, -82294, -86094, -84168, -77477, -76504, -77920, -79332, -78244, -77152, -78605, -80055, -81508, -82957, -84649, -86336, -84988, -83635, -84880, -83259, -80211, -82883, -82339, -84652, -82857, -81057, -82622, -84183, -85748, -87309, -89708, -92104, -89734, -87361, -85450, -83535, -81444, -79351, -82029, -81843, -80051, -83978, -84809, -85636, -86825, -88009, -87231, -86448, -85670, -84887, -84332, -83773, -86079, -88382, -84369, -80353, -79202, -78047, -78661, -79272, -81854, -81571, -77894, -79936, -79477, -81877, -84664, -81724, -76105, -76206, -78635, -81061, -80271, -85200, -89120, -87313, -84675, -82033, -75282, -74250, -74772, -75289, -78285, -81277, -81411, -81541, -80006, -78468, -76933]
-11800g6933J539j825j822j826j822L20L25L20L24J051J054J051J054j572j568j573j568p68
-11782h4239p64p67p64M657M661k019k016o70o71o71o70J058J058J058J058Q05Q05Q05Q04
-11763g6482J163J162j699j699l014l014L662L663k72k72k72k72J90J90J1J1J621j241j67
-11744g6731N555J229j628m374p232n030O97J766j091K853K858j915j911J304M169N775N6
-11727g3650j367j368k440L282J852l871j904R57O90O89O89O90j278m140k887K835K265K266
-11709g6690k39k38r54r54L815L816j595j595J267J267J088J088n231n231n474K54k970k965
-11691i1541L230L234j539j535K262K265K261K266j256j252l759l756l744J982J621J624N48
-11674h7089N51k850K876J830j029M334j386n205k340P56L622r32r28p52p49l018l014J751
$$ y = [-76933, -75394, -77219, -79041, -80867, -82689, -82369, -82044, -81724, -81400, -80349, -79295, -78244, -77190, -78762, -80330, -81903, -83471, -84239, -85003, -85770, -86534, -81877, -77216, -79235, -81251, -81921, -82592, -83263, -83933, -82875, -81817, -80759, -79701, -78896, -78091, -77286, -76482, -75319, -74157, -75856, -77555, -80569, -83583, -79921, -76258, -76530, -76802, -77074, -77346, -77156, -76966, -76955, -76944, -75323, -76564, -76731, -71176, -69947, -71575, -75949, -83181, -88211, -87514, -85748, -86839, -83986, -81128, -83043, -84954, -83650, -79481, -73706, -73650, -75017, -76385, -78825, -75543, -73691, -77562, -79466, -78509, -77819, -77130, -76441, -75751, -77029, -81169, -84056, -81221, -78956, -76690, -76929, -77167, -78121, -79075, -75260, -71444, -73039, -74634, -73367, -72100, -71012, -69924, -75155, -80386, -85860, -85606, -88576, -91541, -88311, -85077, -86616, -88151, -85889, -83624, -81363, -79097, -80353, -81605, -85364, -89120, -92864, -90882, -89261, -87637, -87089, -86538, -89388, -86512, -84682, -85711, -81377, -82763, -87968, -90308, -89552, -85930, -86862, -87790, -88542, -89291, -92309, -95323, -93572]
-11656i3572J755K094K097K094K098O7P1m345m340j79N548K325K328J103J107J460m258r54
-11638h3501r50J19J23K98L02J371J375j60n884K106K105j860j859K910K910l022l021k664
-11620h9302k664J002O725N295m29p04p04J799J800J1J1j419j420j9j8k880k880J412J412
-11601h2972L39L39n104O22K168K172m180m177j318j316J87J90M955M959K571K574k90k87
-11583g8568k116k113k474L253J49J53k355k351j34j31J058O785K608l111k399k396K802K802
-11565g8538J252m471k236k235K175K176J133J133k98k99l248l249l249l249J837J840J837
-11548h7689J841j31j26j31j27j799j796J062J065R43R46R43R46K169K168K884k839o356o34
-11529h6661M076J215P60P60K24K23K936k787j177J684j032j028N77N81k373k370M88M92K269
$$ y = [-93572, -91817, -89723, -87626, -85532, -83434, -83367, -83296, -87641, -91981, -92160, -86612, -84287, -81959, -80856, -79749, -78289, -82547, -83501, -84451, -84332, -84209, -83911, -83609, -82238, -80863, -81023, -86907, -84801, -82696, -84556, -86415, -83505, -80595, -83617, -86638, -89302, -91966, -90964, -84239, -78944, -79373, -80077, -80781, -78982, -77182, -77171, -77160, -78579, -79999, -80018, -80036, -82916, -85796, -84384, -82972, -82633, -82294, -87398, -86776, -84608, -82436, -86616, -90793, -92111, -93427, -93240, -93050, -88095, -83136, -80565, -77991, -78281, -78568, -80684, -82797, -85271, -82018, -81869, -81716, -84071, -86422, -86556, -86687, -85629, -78844, -76236, -79347, -81746, -84142, -81340, -78538, -77286, -81757, -83993, -86228, -84053, -81877, -80744, -79611, -79909, -80208, -83456, -86705, -89954, -93203, -91366, -89526, -87689, -85848, -85979, -86105, -86236, -86363, -88162, -89958, -88896, -87831, -86888, -85942, -84999, -84053, -81884, -79716, -76832, -79671, -86027, -86661, -82585, -81370, -80610, -79850, -79626, -79403, -76467, -79254, -80431, -78747, -79779, -80807, -80230, -79649, -82022, -84392, -83904, -83412, -81143]
-11510h1143K273n92n89j189j184K42K46q98q98P11P12m51K411J337m385j658J204k195k194
-11491h8240K127K127N18N18K80k582k761K962K50K49O07O08p94p93k225k224K455K456K813
-11472h1649k910l21l16o78o75j214j211L554L558L95L99L256L260K064K068j393p113J859
-11454g7067J863j360j356j688j684k57k53J60J64J60J64j449j446J412J416J53J56j099j095
-11435h3106k083P82K389l331J397J401J039J044J397J401J397J401q38q35q38q35J308J311
-11417g5599J308J312l156l152l156l152O00O03k261k258K228K228K228K228L301L301k75
-11400g3672N447M672j051k243k243k75k76l137l137p12p08J792J796J733l987l633l629O4
-11382h3199O7O3O7O00O04k262k258k176k172N812R4q65q61L547L551j699j695Q05Q08j937
$$ y = [-81143, -78870, -79462, -80051, -81240, -82424, -82182, -81936, -82834, -83732, -83021, -82309, -82760, -80349, -79012, -83397, -85055, -83851, -86046, -88240, -86113, -83986, -83468, -82950, -82670, -85252, -88013, -85051, -84801, -84552, -83945, -83337, -84131, -84924, -87149, -89373, -86918, -84462, -81649, -84559, -84880, -85196, -85874, -86549, -87763, -88974, -85420, -81862, -81467, -81068, -77812, -74552, -72488, -70420, -71813, -78926, -77067, -75204, -76564, -77920, -79608, -81292, -81549, -81802, -81642, -81478, -81318, -81154, -82603, -84049, -82637, -81221, -81068, -80912, -82011, -83106, -85189, -84407, -82018, -85349, -83952, -82551, -81512, -80468, -79071, -77670, -76273, -74872, -75710, -76545, -77383, -78218, -76910, -75599, -74291, -72979, -76135, -79287, -82443, -85595, -84995, -84392, -86653, -88911, -86683, -84455, -82227, -79999, -76698, -73397, -73672, -68225, -63553, -64604, -66847, -69090, -69365, -69641, -72778, -75915, -76627, -77335, -75543, -73747, -72014, -76001, -79634, -83263, -83199, -83132, -83069, -83002, -82402, -81798, -84060, -86318, -88494, -90666, -84854, -84760, -85625, -86486, -82939, -79388, -81087, -82782, -81977, -81169, -83106]
-11362h3106p657L28L32o22o23K240K239K12K12K13K12K657K656K299K299J822l901l543l544
-11343h5275j378j375J483J486J364J367J364J367j944j942j944j942k75k72k76k72P68P71
-11325h6925P67P72K615K619K616K619k094k090P68P71N2N6k809k806r24r24n66n67m202J520
-11305h8732J162J163k98k98K563K563n36n37n36n37m69m70l688K034K213K213k198k198J498
-11286h5088J497O863k675k079k079M002M001j222j218j222j219j400j398J461J464j103j099
-11269h2514L666L670j281j278j282j278k340k336N22N25M218M221n51n48n14n11n14n10K61
-11250g8374K64k601k596L532L532O70O71q20q19q20q20l301l301m39m40J051J050l718l718
-11231i0997M008M009p60p60J34J35J34J34q50q49K012K012j565j565j565j565J569J572l200
$$ y = [-83106, -90763, -90435, -90103, -90725, -91348, -89108, -86869, -86657, -86445, -86232, -86020, -83363, -80707, -78408, -76109, -74287, -78188, -81731, -85275, -86653, -88028, -86545, -85059, -83695, -82328, -80964, -79597, -81541, -83483, -85427, -87369, -87644, -87916, -88192, -88464, -87696, -86925, -86158, -85386, -82771, -80152, -77536, -74917, -77011, -79101, -78333, -77562, -77510, -77454, -80263, -83069, -83993, -84917, -85483, -86050, -90252, -88732, -87570, -86407, -86705, -87003, -84440, -81877, -82413, -82950, -83486, -84023, -84492, -84962, -88650, -86616, -84403, -82190, -84388, -86586, -85088, -83591, -76728, -79403, -81482, -83561, -79559, -75558, -76780, -77998, -79220, -80439, -81839, -83237, -81776, -80312, -81415, -82514, -78848, -75178, -76459, -77737, -79019, -80297, -82637, -84973, -84451, -83926, -79708, -75487, -76038, -76586, -77100, -77611, -78125, -78635, -78374, -78110, -80711, -83307, -79775, -76243, -75573, -74902, -75722, -76541, -77361, -78181, -81482, -84783, -85222, -85662, -84611, -83561, -87279, -90997, -86989, -82980, -83740, -84500, -84366, -84231, -84097, -83963, -84813, -85662, -83650, -81638, -83203, -84768, -86333, -87898, -86329, -84757, -87957]
-11212h7957l197J330J334J330J334L089L092j680j677k038k034k038k035K948K950l729l726
-11195i2704J278J282J278J281J159J163n518n515J159J163J158J163L286L286M25M25N670
-11178g8561N671k914k913o78o78o79o78L614L614j155j155q64q64q65q64k653k653K117K116
-11159h1042R02R01R02R01k019k019K749K750p08p08l569l569M84M84M85M84j848j848j669
-11140h7957j669N186Q048M888q35l532l532j028j028m725m724M5M4O41O41L502L503o11o12
-11121h3755o11o11O26O26N395N395j639j639j282j282n127N97L815j908k861K861N604N603
-11103g0193L100k623N96N97k743k742k384k385m948P75M18M17j252j252J610J609J513J516
-11085g8371J513J516k541k537L21L24r02q98r02q97l525l521o63o60O86O89Q65Q68K951N816
$$ y = [-87957, -91154, -89824, -88490, -87160, -85826, -82737, -79645, -81325, -83002, -85040, -87074, -89112, -91147, -88199, -85249, -88978, -92704, -91426, -90144, -88866, -87585, -86426, -85263, -90781, -96296, -95137, -93974, -92816, -91653, -88367, -85081, -84656, -84231, -78561, -72890, -75804, -78717, -79395, -80073, -80752, -81430, -77816, -74202, -75357, -76512, -77376, -78240, -79105, -79969, -82622, -85275, -83158, -81042, -80140, -79239, -78337, -77436, -79455, -81474, -78725, -75975, -76683, -77391, -80960, -84529, -84045, -83561, -83076, -82592, -84440, -86288, -87957, -89626, -84440, -76392, -71504, -72339, -75871, -79403, -80431, -81459, -86184, -90908, -90863, -90819, -90178, -89537, -86035, -82532, -83143, -83755, -84366, -84977, -84351, -83725, -78330, -72935, -74574, -76213, -77495, -78777, -83904, -83307, -79492, -81400, -84261, -81400, -75796, -70193, -67093, -69716, -69120, -68523, -71266, -74008, -76392, -78777, -83725, -82950, -82532, -82115, -83367, -84619, -83009, -81400, -79887, -78371, -76858, -75342, -77883, -80420, -80099, -79775, -80677, -81575, -82477, -83374, -86899, -90420, -91083, -91743, -91057, -90368, -89503, -88635, -85684, -79868]
-11065g9868K831k887k623K42J490m229n36n33L875L878k324k325N36N40J193J192l577l573
-11047h6698j192j192q35q31j550M173j907j904N29N29N29N33l66l65l65l61M99M99N00N03
-11027h9272K168K168K169K172J285J286J285J286j755j755j755j755L283L282l394l394L61
-11010h2335L61L62L61m95m96m95m96l178l178J591J591J889J889J889J889k046k045Q16Q16
-10991h1310o64o63o63o59r02r02r01q98J71J71M583M587M404j319k869k865k102k101P60
-10972h4142P64j5j5O066L46l413l413l770l767K549K548l13l09l73l69l72l69L43L46L43
-10952h7335L46j117j114J743J748m397m392L72L77O70O75N439N444j059j054j058j054M560
-10934h1206M564l666l663j102M623J759l961k939k940L379L380j986j986Q75Q76k686k687
$$ y = [-79868, -77037, -79924, -82547, -82305, -80815, -85044, -85580, -86113, -82238, -78360, -80684, -83009, -82473, -81933, -80740, -79548, -83125, -86698, -87890, -89082, -89917, -90748, -92298, -88125, -90032, -91936, -91407, -90878, -90349, -89816, -90182, -90547, -90912, -91273, -90774, -90275, -89775, -89272, -87104, -84936, -82767, -80595, -79310, -78024, -76739, -75453, -77208, -78963, -80718, -82473, -79190, -75908, -79302, -82696, -82335, -81974, -81612, -81251, -81746, -82242, -82737, -83233, -86411, -89589, -87998, -86407, -84518, -82629, -80740, -78851, -80897, -82942, -82126, -81310, -81974, -82637, -83300, -83959, -84861, -85763, -86664, -87562, -87391, -87220, -82637, -78050, -73646, -74965, -77834, -80699, -82801, -84902, -84142, -83378, -83393, -83408, -77342, -76996, -80409, -83822, -87592, -91359, -88810, -86262, -86575, -86884, -87257, -87626, -87998, -88367, -88024, -87678, -87335, -86989, -88106, -89220, -87477, -85729, -90126, -94518, -94146, -93769, -93099, -92424, -86985, -81541, -82600, -83654, -84712, -85766, -81206, -76642, -80308, -83971, -85073, -80450, -78691, -82652, -85591, -88531, -85152, -81772, -83758, -85744, -84869, -83993, -86679, -89366]
-10917h9366J76J75K977K976J16J15q68q68q68q68n10n11n10n11K828K828l3l4j822j822K947
-10896h3453K947K61K61K61K61O78O78j826j825l510K213N074o48l688l689M538M538Q20Q20
-10877g5289k400L324p31p30p30p30L219k504k146k146j729j729J133J132K921K925l755l752
-10859h3717J073J077j789j785m17m13m18m13j491j486J371J375j267j263j267j263M099M102
-10841h3892J237J240%ML219k500N37N40J79J82j363j360j006j003j959L767O624R05l435
-10822g8084l431r32r27L062L066l614l610j021j017j021j017J483J487J482J487J572J576
-10805g9459j289j285J930J933r31r28Q2Q6Q2Q6Q2Q5Q2Q6l316l312l674K053l7l4L540k180
-10783h6318j296j293J922l796j05N623N260m58%Ml58l54j967j964Q95Q98J006J009J006J010
$$ y = [-89366, -89190, -89015, -86038, -83062, -82946, -82831, -83699, -84567, -85435, -86303, -86813, -87324, -87834, -88345, -85517, -82689, -82722, -82756, -84578, -86400, -83453, -80506, -80245, -79984, -79723, -79462, -78784, -78106, -79932, -81757, -85267, -83054, -77980, -78628, -82316, -86005, -81467, -76929, -76109, -75289, -77689, -74365, -75096, -75826, -76556, -77286, -74067, -76571, -78717, -80863, -82592, -84321, -83188, -82056, -79135, -76210, -79965, -83717, -82644, -81567, -83356, -85141, -85558, -85971, -86389, -86802, -88293, -89779, -88408, -87033, -88300, -89563, -90830, -92093, -87994, -83892, -82655, -81415, -81415, -81411, -78192, -80692, -80155, -79615, -79436, -79254, -80617, -81977, -82983, -83986, -85945, -82178, -75554, -74649, -78084, -81515, -82447, -83374, -80312, -77246, -80860, -84470, -85491, -86508, -87529, -88546, -87063, -85576, -84094, -82607, -81035, -79459, -80748, -82033, -80103, -78170, -79101, -80029, -79947, -79861, -79779, -79693, -79611, -79526, -79444, -79358, -82674, -85986, -89660, -87607, -87644, -87678, -84138, -86318, -87614, -88907, -86985, -90781, -90886, -85263, -80003, -80461, -80461, -80457, -80815, -81169, -83136, -85100, -84205, -83307, -82301, -81292, -80286, -79276]
-10763g9276k988k985J781J785K854K858j915j912o03o00o04o00r09r05m486J241M277j442
-10745h4429n857j30J401J404J759J762j043j040J819J822l350l346J420J423j799j796j800
-10728i1780j796J614J617J613J617K925K928l752l748L24L28L186L189K768K772r3q9j390
-10710g7767j386j390j386K187K191o74o71m10m10K810k914k496k497k854k854P23P23P23
-10692h8352P23J438J438l331l331L309L308j460j461j580j579J281J282K087K086j133j132
-10675h6407K265l458l457K265j315j315J904J904O52O52L155L156J293m430m072m073L39
-10658i0942L39k880K843J047J047J405J404J107J107J106J107N85N85m185m184k216k217
-10641i2942K552K552L275L279M13M18R50R53l819l815K80K83O37O41k344L383J61J63K225
$$ y = [-79276, -82264, -85249, -83468, -81683, -78829, -75971, -77886, -79798, -80401, -81001, -81605, -82205, -83114, -84019, -88505, -87264, -82987, -84429, -90286, -90416, -89015, -87611, -85852, -84090, -85133, -86173, -84354, -82532, -85882, -89228, -87808, -86385, -88184, -89980, -91780, -93576, -91962, -90345, -88732, -87115, -84190, -81262, -85014, -88762, -88438, -88110, -84924, -81735, -78967, -76195, -76288, -76377, -77767, -79153, -80543, -81929, -79742, -77551, -78225, -78896, -79306, -79716, -76906, -79820, -82316, -84813, -87667, -90521, -89798, -89075, -88352, -87629, -86191, -84753, -88084, -91415, -88106, -84798, -86258, -87719, -89299, -90878, -89597, -88315, -86228, -84142, -85275, -86407, -84142, -87600, -91057, -88792, -90107, -91422, -89518, -87614, -86962, -86310, -83155, -79999, -78706, -83136, -87208, -91281, -90942, -90603, -93483, -90640, -89593, -88546, -87141, -85737, -84630, -83523, -82417, -81310, -80725, -80140, -84325, -88509, -90725, -92942, -90390, -87838, -84563, -81284, -80871, -80453, -79503, -78550, -82369, -86184, -85904, -85621, -84984, -84343, -86687, -83304, -83143, -82980, -80755]
-10622h0755K228o37o34j710j706L059L062j807j803j807j803K544K549o75o70M355j367j010
-10604g8587j010K031K031q31q31n85n85n85n85J31J30k731k731j271j270j271j270j449j450
-10585i2719j449j449J292J293J293J293l76l77l76l76J386J386J743J744l085K638J922J923
-10567h2294K608l115l472K250L502k220j505j506j311j312l815l815j729L994P75P75L264
-10550h8926L264M02M03j386j386L383L383k199k194k198k195p08p04K154K157J229J234l182
-10532h7469l178l122K604M150M155k407k403Q12m907N939N943j096j091j841j837j840j837
-10515h9425K869K872L227k493J040J043k180k175L24L28k240k235l670J103J278J281R80
-10498h8073R84R80R83r20r16j219j214M266n00k470L95M989K131J055J058n861n857j092
$$ y = [-80755, -78527, -79164, -79798, -81508, -83214, -80155, -77093, -78900, -80703, -82510, -84313, -81769, -79220, -79895, -80565, -76210, -77577, -78587, -79597, -77566, -75535, -76366, -77197, -77782, -78367, -78952, -79537, -79406, -79276, -82007, -84738, -86009, -87279, -88550, -89820, -91269, -92719, -94168, -95617, -94325, -93032, -91739, -90446, -90822, -91199, -91575, -91951, -90565, -89179, -87436, -85692, -88777, -86139, -84217, -82294, -79686, -82801, -86273, -84023, -80521, -82741, -84246, -85752, -87063, -88375, -92190, -96005, -97734, -93740, -92965, -92190, -88926, -85662, -85260, -84857, -86243, -87629, -84246, -80863, -83062, -85256, -87454, -89649, -90357, -91061, -88907, -86750, -85521, -84287, -87469, -90647, -93769, -91165, -87015, -82860, -85267, -87670, -86858, -91765, -85826, -79883, -80979, -82070, -83911, -85748, -87588, -89425, -86556, -83684, -80457, -82950, -81910, -80867, -83047, -85222, -84898, -84570, -86810, -89045, -92715, -91612, -90334, -89053, -88073, -87089, -86109, -85126, -86046, -86962, -88181, -89395, -85129, -85629, -88099, -87704, -82715, -80584, -79529, -78471, -84332, -90189, -91281]
-10480i1281j088J178J177L085K24k877J893L800L801J378J379j602L167K153k615m285j423
-10463h1936j930m792n685r17R7R7L95L95K302K303K302K303L137L137j632j632j881j878
-10445h5815R80L845q08n574L662L666K828j937k120k116j405j401j405j400M601M605j68
-10428g9962j64k194k191O67O71K515K518K515K519p04p01l565l562n59n59n59n59J766J766
-10409h0342j095j095R31R31l837l838Q13Q12L673L674k124k123P37P38J42J41L003L003m717
-10390h0573m717N3N2qpqpm143m139O25O30K474K478k09k05N89L454K556l164j557M169L808
-10368g7849j911j170j167K050l670m628J099K407N272L607P49q65M863M679J822k712k709
-10351g0133R3K958L92r143m557J170N70n149J524J527J166J170k351k347n570J56n40n36
$$ y = [-91281, -92369, -91191, -90014, -86929, -86705, -89582, -87689, -83889, -80088, -78710, -77331, -78933, -75766, -73613, -76228, -80513, -81936, -83866, -88658, -94343, -95260, -95163, -95066, -94671, -94276, -91974, -89671, -87369, -85066, -81929, -78792, -80424, -82056, -83937, -85815, -84835, -80990, -81798, -87372, -83710, -80044, -77216, -79153, -81273, -83389, -84794, -86195, -87600, -89000, -84399, -79794, -79962, -80126, -82320, -84511, -83844, -83173, -80658, -78140, -75625, -73106, -73810, -74511, -78076, -81638, -82197, -82756, -83315, -83874, -82108, -80342, -81437, -82532, -81601, -80670, -84507, -88345, -87532, -86720, -83047, -79373, -81497, -83620, -82883, -82145, -82003, -81862, -78859, -75856, -80573, -85290, -85237, -85185, -85193, -85200, -85208, -85215, -89358, -93497, -92872, -92242, -89768, -87290, -87499, -87704, -87115, -83661, -81105, -84269, -85826, -81657, -77849, -79760, -80930, -82097, -80047, -83717, -88345, -87246, -84839, -79567, -75960, -75211, -76076, -71213, -66534, -64712, -67424, -70133, -70040, -67082, -66690, -75833, -80390, -79220, -78650, -83799, -82275, -80748, -79582, -78412, -80763, -83110, -88680, -88524, -89064, -89600]
-10333h9600K679K682J129J133l640l637O00O04N99O04j606j602L104N968L421k303J096J095
-10315g7674r7r7K765K764j892j893j893j892p01p00p01p00K623K623k39k38j729j729j729
-10296h3129j728j580j580j580j579J520J520J520J520O48O49O48O48J841J840J841J841K60
-10278g4880K61K61K61j409j408j408j409j065j066j065j066l50l50K511K511p38p37n150
-10260h6296n149k406L316R6R7O0O3O0O3j609j606j252j248q35M892J669J673L339L342O199
-10240g5532M81J282m438j580j576l010l007j49j45L405L409N44N48p67p64p68p64q42q38
-10221h4511q42q38j86j83j86j83j632j628q2N645J885J889o19o14J30J34K992K996k87k83
-10201g6403l149l144r65r62r65r61N25N30N25N29r32r31n74n74l733J990J632J632J423J423
$$ y = [-89600, -86921, -84239, -83110, -81977, -85617, -89254, -88654, -88050, -87451, -86847, -88453, -90055, -86951, -80983, -77562, -79865, -78769, -77674, -77771, -77868, -75103, -72339, -74231, -76124, -78017, -79909, -80610, -81310, -82011, -82711, -80088, -77465, -77704, -77942, -79671, -81400, -83129, -84857, -86437, -88017, -89597, -91176, -89656, -88136, -86616, -85096, -84448, -83799, -83151, -82503, -80662, -78822, -76981, -75140, -74880, -74619, -74358, -74097, -75506, -76914, -78322, -79731, -80796, -81862, -82927, -83993, -84343, -84693, -82182, -79671, -80409, -81146, -86296, -91445, -93851, -90535, -90439, -90342, -90282, -90219, -90159, -90096, -91705, -93311, -94563, -95811, -96646, -91754, -90085, -88412, -85073, -81731, -75532, -75051, -73769, -78207, -79787, -81363, -84373, -87380, -87529, -87674, -84269, -80860, -80316, -79768, -80535, -81299, -82067, -82831, -83673, -84511, -85353, -86191, -86377, -86560, -86746, -86929, -88561, -90189, -90271, -84626, -82741, -80852, -81471, -82085, -81955, -81821, -78829, -75833, -76120, -76403, -79552, -82696, -83661, -84623, -85588, -86549, -86024, -85494, -84969, -84440, -85372, -86303, -86877, -87451, -91184, -89194, -87562, -85930, -84507, -83084]
-10181h3084J423J424k452k452M10M10k142k143k500L223q31q30M295M296K090K091k679k679
-10163h2130Q38Q39M057j665m479m478n194N29L271L271P68P68K712K712K713K712k474k474
-10145g7704l189K533K862k862k146k146J252J252j609j610n22n21n22n21j64j64j64j64k61
-10126h6370k57K601K604J706J710k705k701l383K344N380l39l43K522k310k306L24L28N03
-10108h0692N07L24L189K05n514j822J043r27r24n11n07L84L249M020j702k776Q5q08q09o29
-10088h4615o30j90j90j90j90j442j442J062J062K236l488l845J878M560j162m262m263j542
-10070i6653j543L406L405M478P340O088L65j311j312j669j669j908j907Q94L756K533l189
-10053g8896k653k653L88L87m024m023k012L711M91M92O155O155P90P90M247n290k787k787
$$ y = [-83084, -81661, -80237, -82689, -85141, -84731, -84321, -86463, -88606, -91106, -87883, -88714, -89544, -85249, -80953, -78863, -76772, -79451, -82130, -81292, -80453, -76396, -78061, -82540, -87018, -92212, -91683, -88412, -85141, -84373, -83605, -80893, -78181, -75468, -72756, -75230, -77704, -80893, -78360, -75498, -78360, -80506, -82652, -81400, -80148, -81757, -83367, -83889, -84410, -84932, -85453, -85617, -85781, -85945, -86109, -86370, -86627, -84026, -81422, -79716, -78006, -80711, -83412, -86795, -84451, -79071, -79410, -79753, -77231, -79541, -81847, -81523, -81195, -80692, -80185, -79861, -76672, -76467, -81981, -83803, -82760, -83687, -84611, -85122, -85629, -85245, -81996, -77976, -79678, -82454, -82369, -83177, -83986, -84615, -85245, -85435, -85625, -85815, -86005, -87447, -88889, -87827, -86765, -84529, -88017, -91862, -89984, -85424, -86586, -90848, -95111, -96653, -98196, -94790, -91385, -86907, -79567, -73479, -73114, -74425, -75737, -77406, -79075, -80983, -82890, -81996, -78240, -75707, -78896, -81549, -84202, -83814, -83427, -87451, -91474, -93486, -89775, -89284, -88792, -82637, -76482, -75692, -74902, -70655, -75945, -78732, -81519]
-10035h1519L73L72L73L72K489K493l73l69k041k038k042k038n52n47K250N116L740j978N21
-10016g5398k336p421j699J579J580K176K176k593k593r0q9N931L070L130k593k415k414K724
-9998g7275K727k046k041j211j207j211j207J60J64J60J64j509j505j509j505j059j058j058
-9980i2026j058K996K995j416j415k974K750K392K392n89n88K272K273K806K805m13m14k35
-9962g7447n957l096K626N18N18Q76Q75O897O896j688j687j629j628m489m490J770J770j092
-9944h0457j092N63N62k656L066J278J278j226j225j547j546j546j546j368j367J494J494
-9927h5841o37o37P8n645j889L834K57K57K255K254o08o07J241J240Q84O605K57K58k247k247
-9907h0938r95r94r95r95L111L111K157P880M781m758n712n712k194k195k194k195j121j121
$$ y = [-81519, -81146, -80774, -80401, -80029, -77540, -75047, -75420, -75789, -77830, -79868, -81910, -83948, -84500, -85047, -82797, -77681, -73941, -75919, -75398, -77734, -85155, -86854, -85275, -83695, -81519, -79343, -81936, -84529, -84619, -84708, -78777, -75707, -72577, -75170, -77585, -79999, -77275, -74548, -76594, -78635, -79846, -81053, -82264, -83471, -83311, -83147, -82987, -82823, -84332, -85837, -87346, -88851, -89910, -90968, -92026, -93084, -90088, -87093, -88509, -89924, -92898, -90148, -87756, -85364, -85953, -86541, -84269, -81996, -79190, -76385, -76798, -77212, -77447, -83404, -86500, -83874, -83356, -82838, -81962, -81087, -74190, -67294, -68982, -70669, -72298, -73926, -78415, -82905, -81135, -79365, -80457, -81549, -80986, -80424, -83080, -80014, -78736, -77458, -78684, -79909, -81456, -83002, -84548, -86094, -87462, -88829, -87335, -85841, -86478, -87115, -87037, -92682, -94571, -90737, -90480, -90223, -87968, -85714, -86322, -86929, -85688, -84448, -83564, -76959, -76702, -76444, -78691, -80938, -81933, -82927, -83922, -84917, -81806, -78695, -76538, -68658, -63877, -68635, -74347, -80059, -82253, -84448, -86642, -88837, -89958, -91079]
-9889i1079J740J739K031K031K030K031LMMMm706m706j248M475K984K985j427j427K410K411
-9869g7711k359k358k716k716j345M377k008m869K045K046J836M699L446k276l92l91O82O82
-9851g9328j464j465l3l4l39l39l39l39j829j830k008k008R05j956k314L410K723j38j032
-9832h9757j032j285j286r3N630K679l044n548J75K120K120L909L908J613J613j248j248J345
-9814g9429J345M207M206Q98Q98n33n33l670l670J100J099P71P71P71P72K440K440m21m21
-9795f6959l938l938Q31Q31J792J792k977k977MMM772M773O89O90n988n987r80r80L91O114
-9775g2041q38l700J129J129K441K440m21m21R50R50R50R50o89o89P41P42o651o650J576J576
-9755g6526Q30m892l01N421K738j23J844J845r88r87k418k418K697K702j64j60J743J748K816
$$ y = [-91079, -89339, -87600, -85569, -83538, -81508, -79477, -79474, -79470, -79466, -79462, -84168, -88874, -90122, -85647, -82663, -79678, -81105, -82532, -80122, -77711, -80070, -82428, -85144, -87860, -89205, -84828, -86836, -91705, -89660, -87614, -85778, -81079, -77633, -79909, -80301, -80692, -80010, -79328, -80792, -82257, -82290, -82324, -82663, -83002, -83341, -83680, -85509, -87339, -89347, -91355, -90450, -92406, -94720, -91310, -88587, -88725, -89757, -90789, -92074, -93360, -93453, -87823, -85144, -88188, -93736, -93561, -91441, -89321, -85412, -81504, -79891, -78278, -79526, -80774, -79429, -78084, -73877, -69671, -68773, -67875, -68408, -68941, -72611, -76281, -75181, -74082, -73311, -72540, -71769, -70997, -68557, -66117, -66538, -66959, -70897, -74835, -74004, -73173, -71381, -69589, -72566, -75543, -75539, -75535, -70763, -65990, -65301, -64611, -70599, -76586, -77566, -78546, -78155, -72041, -72879, -76579, -75450, -74321, -71880, -69440, -69861, -70282, -69332, -68382, -67432, -66482, -67171, -67860, -67119, -66377, -73028, -79678, -78102, -76526, -75696, -80588, -80889, -75468, -72730, -72853, -71009, -69164, -70152, -71139, -73557, -75975, -73278, -70576, -70740, -70900, -69157, -67409, -64593]
-9736f4593K821M4n674k459k455K906K910J475J479l454l453J315J315Q68Q68Q68Q69j219
-9718f5569j218J643J643j904j904m73m73M255M255k422k422j021j021l524l525k720L003
-9701g3397k16k16K61K61K60K61L104L107l54o073k500k496l216K512J136J140M713j006k34
-9682g2953k31n93n88o45o41o44o41L945L950L69O095j032o751M1M4j449M277J412m307l066
-9662g3408l063J345J349K895K899L3L8k202k199k559L167J762J766O89O93K735K739N238
-9644e6083N242K91n429q293k567r02q98j975j971k839k835k839k835K235K236k534k533o86
-9626h5215o86j043M680L353L353j058j058l323l324J446J445K340K344J147m571m367J360
-9609h3177K548K553k802k798m233m229l57l54J073J077M21M21M21M21M50M51k410k411K090
$$ y = [-64593, -61772, -61728, -67402, -69861, -72316, -69410, -66500, -65025, -63546, -67000, -70453, -69138, -67823, -66955, -66087, -65219, -64350, -65569, -66787, -65144, -63501, -65405, -67309, -67782, -68255, -64000, -59745, -62167, -64589, -65610, -66631, -70155, -73680, -76400, -73397, -73613, -73829, -73568, -73307, -73047, -72786, -69682, -66575, -66929, -73002, -75502, -77998, -81214, -78702, -77566, -76426, -71713, -72719, -72953, -73184, -73777, -74365, -75010, -75651, -76295, -76936, -72991, -69041, -68672, -62577, -63609, -70360, -70319, -70275, -71724, -67447, -66035, -70342, -73408, -76471, -75126, -73777, -70882, -67983, -67950, -67912, -70114, -72313, -74872, -71705, -69943, -68177, -67488, -66795, -64060, -61321, -56083, -50841, -50550, -55979, -64272, -66839, -67741, -68639, -70614, -72585, -75424, -78259, -81098, -83933, -81698, -79462, -81996, -84529, -85215, -85901, -86944, -82264, -78911, -75558, -76616, -77674, -80997, -84321, -82875, -81430, -79090, -76746, -75599, -80170, -84537, -83177, -80629, -78076, -80878, -83676, -87909, -92138, -92495, -92849, -91776, -90699, -90278, -89857, -89436, -89015, -88565, -88114, -90524, -92935, -90845]
-9590i0845K090J912J911k530n391m139J583J934J934Q60Q61J725J725K262l462m772j912
-9573i4254J248J248l520K202N421l02j271M453K664j98J979M839L409N48n473k612J1J1K963
-9554g6634k761k761K962L323L327M62M66k23n943p198m333r99r95O11O15K638K642J028J032
-9535h2741M463J606o684r57P97Q01J155J159M54M59k407k403l927l924k496k493n55n55M214
-9516i4034M214k314k314M363M363R21R20K6k835l104K619L335M73K604l118j509j509j598
-9498h8497j599L171L170j091j092l953l953P56P57L98L99N667n6j606j606q90q91N41N40
-9479h9835K656K657M445j278m73m73j368M356P522M661P701P702P731K008l596r318r139
-9462f4041l417R95m728n503n503n861n861J010J010j852j852j106j107k537k537K500K500
$$ y = [-90845, -88755, -86843, -84932, -87462, -92853, -96992, -95409, -93475, -91541, -90681, -89820, -88095, -86370, -84108, -87570, -92342, -94254, -93006, -91758, -95278, -93076, -87655, -87957, -89228, -84775, -82111, -82309, -80330, -75491, -72082, -71534, -77007, -79619, -79608, -79597, -76634, -79395, -82156, -79194, -75871, -72544, -72082, -71616, -71839, -77782, -84980, -89313, -90312, -91307, -90696, -90081, -87443, -84801, -83773, -82741, -78278, -76672, -83356, -84313, -83516, -82715, -81560, -80401, -79947, -79488, -81895, -84298, -88225, -92149, -94645, -97138, -97693, -98248, -94034, -89820, -92134, -94448, -90085, -85722, -84801, -83881, -83855, -86690, -89794, -87175, -83840, -83367, -80763, -83881, -85390, -86899, -88497, -90096, -86925, -83755, -84846, -85938, -89891, -93844, -93088, -92331, -91933, -91534, -85867, -85923, -87529, -89135, -90025, -90916, -90375, -89835, -87179, -84522, -80077, -81355, -81828, -82301, -83669, -79313, -71791, -67130, -59429, -51727, -43996, -41988, -45584, -54902, -64041, -67458, -66463, -71191, -76694, -82197, -88058, -93919, -92909, -91899, -93751, -95603, -96709, -97816, -100353, -102890, -100390, -97890]
-9445i7890K500K500K410K411K411K410l61l58l61l58p19p15J248j610q98M829J75k683j553
-9426h6612j550q38K026R43m780j31K731P64P64K373K374O74O74K106K105m095m095k902K820
-9407h4649P623J904l107l104j110j107k898k895J334m386k779Q6l95l92K646K649R65R69
-9389h8646K395K400M28M32j002r98J829J833J829J833q83q79q83q79j196j192m415J311J367
-9370h5316J371J726J728j702j699J516J520K65N991N630N633Q38Q42M058M061L342R068J5027
-9352b6101J5030K5233L4777N3492P4479Q2701O1722K9527M732r125k6289o0153p3503p2791
-9338A13731n5619l8156k4798j4445j1580j0987n261l416o275j330J535J576j281n757l0l014
-9322f5107n872k835L0k42l100j673j669J009m709m713J013M646M650K142K147J75J78J76
$$ y = [-97890, -95390, -92890, -90480, -88069, -85658, -83248, -83609, -83967, -84328, -84686, -85405, -86120, -84872, -86482, -87380, -82551, -82376, -85059, -86612, -88162, -89000, -86974, -86031, -90811, -90942, -88211, -87447, -86683, -84310, -81936, -81262, -80588, -78482, -76377, -80472, -84567, -87469, -84649, -77026, -75122, -78229, -81333, -82443, -83550, -86448, -89343, -88009, -92395, -95174, -95088, -95483, -95875, -93229, -90580, -89615, -88646, -86251, -83851, -83423, -82991, -83993, -84991, -83162, -81329, -79500, -77667, -78550, -79429, -80312, -81191, -82387, -83579, -87994, -86683, -85316, -83945, -82219, -80491, -82193, -83892, -82376, -80856, -80591, -74600, -68970, -63337, -62499, -61657, -57599, -53538, -50196, -41128, -26101, -11071, 14162, 48939, 102431, 176910, 259611, 321333, 350860, 355592, 346467, 320178, 260025, 186522, 113731, 58112, 19956, -4842, -19287, -30867, -41854, -47115, -50531, -56806, -58136, -56601, -55025, -56306, -62063, -62093, -65107, -70979, -73814, -73784, -74026, -77126, -78799, -80468, -79459, -84168, -88881, -87868, -83222, -78572, -76430, -74283, -74108, -73930, -73754]
-9304g3754J78j613j609j614j609J784J789k627k623k165L562L39L43J412J416J412J416l581
-9286g7544l576J188J192J904J908k865k862j166j162j345j342J755j103n756l0L320M62m36
-9268h7458m32J233J237J233J237N712N712P63P64q46l707n495K27j397m259j039J822m44
-9250h5137m43k65k64j532j531J569P291L536k187J390J389k067k068k068k068j531j532j531
-9232h9049j531J598J599j263j264L47L46L47L46J271J270J271J270L77L76L76L77K619K619
-9213g6698k42k42J188J189J546J546Q91O613N33N33L990L990q409q409j628j625j628j624
-9195g8486n384n380o15o11L692L696j076j073k43k38J15J20k918K810m14m10j248j244j248
-9176i0155j245L4L7l186K541L849L853k471q189m881M661J796J800k91k87k90k87k139k135
$$ y = [-73754, -73576, -75189, -76798, -78412, -80021, -78237, -76448, -79075, -81698, -83863, -80301, -79962, -79619, -78207, -76791, -75379, -73963, -77544, -81120, -79932, -78740, -76836, -74928, -77793, -80655, -81821, -82983, -84328, -85670, -83915, -85018, -90774, -90804, -87484, -87022, -87458, -87890, -86657, -85420, -84187, -82950, -77238, -71526, -70763, -69999, -70845, -74552, -80047, -79820, -81217, -85476, -86515, -84693, -85137, -85580, -85845, -86109, -87641, -89172, -87603, -80312, -76776, -78963, -77573, -76184, -78251, -80319, -82387, -84455, -85986, -87518, -89049, -90580, -88982, -87383, -88646, -89910, -89563, -89217, -88870, -88524, -87253, -85983, -84712, -83442, -83065, -82689, -82313, -81936, -79317, -76698, -76940, -77182, -75994, -74805, -73259, -71713, -70822, -64209, -63676, -63143, -59153, -55163, -63572, -71981, -73609, -75234, -76862, -78486, -83870, -89250, -89865, -90476, -86784, -83088, -84164, -85237, -85480, -85718, -85603, -85483, -88401, -85591, -86005, -86415, -87663, -88907, -90155, -91400, -91366, -91329, -94515, -91974, -88125, -84272, -86743, -94932, -99813, -95152, -93356, -91556, -91847, -92134, -92424, -92711, -94850, -96985]
-9157i6985K631K634J140J144J140J144j789j784j431j427m590J136P75P79Q9R3R0R3L189
-9138i1929L193L189L193n652n652q83q83K336K336P87m937k672k671k671k672m8N674K456
-9120i7506K455N384N383L834j889M36M36M36n287j904j904O00O00N607N608k977k977L32
-9102h3333L31k530k530j367j367j368j367J896J897L327L327j412j412J449J450J866J867
-9085g9276r95r95j918j919R42R43l141l141j710j710j233j233j234j233O274O278M844M847
-9067g5610M665M668j04j01m4m1j476j471K190K195K191K194L130L133l547l543J878J881
-9049e7812J878J882M351M356M352M355K623K627K623K626k19k17O457O461L893L898J032
-9032d834J035L059L062P828P831R974R978J3432J3435J9147K8689L3811L3816M0130M0135
$$ y = [-96985, -94354, -91720, -90580, -89436, -88296, -87152, -88941, -90725, -92156, -93583, -98173, -97037, -96262, -95483, -95394, -95301, -95211, -95118, -91929, -88736, -85547, -82354, -88006, -93658, -94541, -95424, -93088, -90752, -89965, -94902, -97574, -100245, -102916, -105588, -105636, -99962, -97506, -95051, -89667, -84284, -80450, -82339, -81903, -81467, -81031, -86318, -88222, -90126, -89526, -88926, -83319, -77711, -80688, -83665, -83333, -83002, -85532, -88062, -89429, -90796, -92164, -93531, -91635, -89738, -86411, -83084, -84496, -85908, -84459, -83009, -81143, -79276, -80271, -81266, -83184, -85103, -84161, -83218, -86359, -89500, -91210, -92920, -94153, -95386, -96620, -97853, -91579, -85301, -80457, -75610, -70945, -66277, -66381, -66482, -66526, -66567, -68043, -69514, -67324, -65129, -62938, -60744, -57614, -54481, -58028, -61571, -59693, -57812, -55934, -54052, -49701, -45345, -40993, -36638, -34015, -31388, -28765, -26139, -26358, -26575, -20118, -13657, -9764, -5866, -4834, -3799, -740, 2322, 10150, 17981, 27955, 37933, 51365, 64800, 83947, 112636, 146447, 180263, 220393, 260528]
-9017B60528M2515M8242N4706O8063P6882R7870J28387J60821K26391L31314M98580P33221
-9005B727520R99567J199871J225024J070510Q08925L03412m05421r79608j309867j395707
-8995D244226j221521r06762o12992l97428k55986j73954j17922q5489o0693m3521k5641j2284
-8983C30033r218j4937k2332k8052l4255l9974l7117l1389k4285j8562j4091j1230q070k347
-8969C4174o938j2660r769r768p265p266n596n596q27q27L025L025j5j4m62l324k071L651
-8951b8523L204L204K489K489K876Q599P287J3011J4281K0007L2404M5760N8156P1513Q4148
-8936C40905R3689Q8439P1275L2880j0991m5868p4479q8253r1111q1353o7996n5601l8428
-8923G3108k4422k1558j8461j2734q118n254j740j736p27p22l588l585l170l171n674n675
$$ y = [260528, 303043, 351285, 405991, 474054, 550936, 648806, 777193, 938014, 1164405, 1495719, 1994299, 2727520, 3727087, 4926958, 6151982, 7222492, 8031417, 8334829, 7929408, 6949800, 5639933, 4244226, 3022705, 2115943, 1502951, 1105523, 849537, 675583, 557661, 472172, 411479, 367958, 342317, 330033, 320815, 305878, 283546, 255494, 221239, 181265, 144148, 112759, 88474, 69912, 55821, 44591, 36521, 34174, 27236, 14576, 4807, -4961, -12226, -19492, -25088, -30684, -31511, -32338, -29313, -26288, -26303, -26317, -26779, -30103, -32174, -28523, -25319, -22115, -19626, -17137, -14261, -5662, 1625, 14636, 28917, 48924, 81328, 127088, 185244, 256757, 340905, 434594, 523033, 594308, 627188, 616197, 570329, 495850, 407597, 316486, 235133, 167137, 111536, 73108, 48686, 27128, 8667, -4067, -12185, -17439, -19179, -20915, -21642, -22364, -25952, -29537, -32707, -35878, -41552, -47227]
-8907d7227m840Q84K432K433J062J062j799j800N85N85k277k276O30O29o047o047k708k709
-8889f7428k6k6M21k441j188M534M236M237J732J733l06l02j199m058l703K023j379j374O63
-8870f3851O67k199k194n89n85n88n85J013J017J014J017M411M415l57l54j401j397j223j218
-8851f2987l487o22R83m735o52o52j010j010L521L521O60O59O45O44k217k217J480J479k933
-8832f8930k932l416K306L856L856K247K247k165k165j851L871O52O52J069J069k149L573
-8815e8210J740J740K097K098O67O67k195k194K410K411m266m266l313l312l312l312k538
-8798g3088k537k537k537J993J993J994J993k522k523k522k523j151j151j151j152J055J058
-8781h5308L916L919O97P00L559L561O494O498O494O498L573L577P12P15P94P97k426k421
$$ y = [-47227, -52067, -51183, -48751, -46318, -45256, -44194, -45993, -47793, -47208, -46623, -48900, -51176, -50546, -49917, -55964, -62011, -64719, -67428, -67454, -67480, -67059, -69500, -70688, -66154, -61918, -57681, -55949, -54216, -54522, -54824, -56023, -60081, -63784, -61761, -63140, -64514, -63851, -63184, -65383, -67577, -68166, -68751, -69339, -69924, -68911, -67894, -66880, -65863, -61452, -57037, -57394, -57748, -59149, -60546, -61769, -62987, -66474, -67096, -66113, -70848, -71500, -72152, -73162, -74172, -70651, -67130, -66470, -65811, -65166, -64522, -66739, -68956, -67476, -65997, -68930, -71862, -75278, -72972, -69116, -65260, -63013, -60766, -62931, -65096, -66947, -63076, -62424, -61772, -60703, -59634, -61783, -58210, -56470, -54730, -52633, -50535, -49868, -49201, -51396, -53590, -51180, -48769, -53035, -57301, -60614, -63926, -67238, -70550, -73088, -75625, -78162, -80699, -78706, -76713, -74719, -72726, -75248, -77771, -80293, -82816, -83967, -85118, -86269, -87421, -86366, -85308, -81392, -77473, -76776, -76076, -72517, -68956, -62462, -55964, -49470, -42972, -39399, -35822, -35110, -34395, -33601, -32804, -35230, -37651]
-8763c7651l857r575N55O282j233o953n18n14J629J631j233j229k746k742j0377m650K143
-8746g1038P869N003N008k42k39k42k38j912j907o323o319n153N74L789j930L134Q859M922
-8728e6385M926M713j006k560k556L02L06m467m464L666L666O886J162j758j759P45m978p868
-8710f1429j3592j3950q226k742k743J073O796M889M888K742K742O56O379L159L160N126N127
-8693e5945K265K266m77m77l339l338K869K873K868K873L644L647K094l625L35L39L36n384
-8675d6176n030n026q249q245l279l275n9n6k444L282J0194J0197P512J792j20j15k742q462
-8657f0301n603J23P157P161J1926J1930K627l092k500j5850j1323n596J435P161L759L763
-8641d7223o52o48n459n454n458n455N03N07L006L011P41m977j763j758n11n06M258M262L350
$$ y = [-37651, -41508, -51083, -50528, -44246, -45479, -52432, -52950, -53464, -51835, -50204, -51437, -52666, -55412, -58154, -68531, -73181, -71038, -63169, -58166, -53158, -53400, -53639, -53881, -54119, -56031, -57938, -64261, -70580, -75733, -75159, -71370, -73300, -70166, -61307, -56385, -51459, -46746, -47752, -50312, -52868, -52566, -52260, -56727, -61191, -57525, -53859, -46973, -45811, -47569, -49328, -48583, -53561, -61429, -75021, -88971, -97197, -99939, -102682, -101609, -94813, -89924, -85036, -82294, -79552, -78896, -72517, -69358, -66198, -61072, -55945, -53680, -51414, -51891, -52368, -55707, -59045, -56176, -53303, -50435, -47562, -43918, -40271, -38177, -41802, -41467, -41128, -40792, -46176, -51206, -56232, -64481, -72726, -76005, -79280, -79339, -79395, -81839, -78557, -68363, -58166, -50654, -48862, -48982, -49097, -51839, -60301, -65904, -65781, -58624, -51463, -39537, -27607, -24980, -28072, -30572, -46422, -57745, -63341, -61906, -54745, -50986, -47223, -47875, -48523, -53982, -59436, -64894, -70349, -69846, -69339, -66333, -63322, -62581, -67558, -69321, -71079, -71590, -72096, -67838, -63576, -60226]
-8622f0226L353j08n827n294n291n652n648N018N023J2291J8018K4631K4634K2843J7124J1710
-8606E6599K176l670l666l908r628r273r270j0943j0938p723p720k955K772J1353J1355P929
-8590A2490j610l159q882j0432m709L517k206n455n454j0581j0582l785l786O26O26m269r993
-8573f7644m628J096J1587K1125L1975L1974L2005K6282J5432r367k2898k8622j4076p23J1923
-8558C5441J7645J9076R538K98k4501l6662m6199l6125k6587j6811j1088R54J4307K5275K5276
-8543e0163L1826L1825K6461K0738K7772K7772K8011J8472J7221J7221J4359J4359K3778L3316
-8529B82968L7013K7474J4735k433J502q037m817m818R251J8790L2142L2143M5138M5138N2411
-8514E78600N2411O1830O1830N9281M2113L3648J2664P418J695J2306K5660N5466N5466P1323
$$ y = [-60226, -56873, -56981, -62808, -68102, -73393, -79045, -84693, -79675, -74652, -62361, -44343, -19712, 4922, 27765, 44889, 56599, 58775, 55105, 51439, 47531, 37903, 28630, 19360, 8417, -2521, -10244, -17964, -20919, -18147, -6794, 4561, 12490, 10880, 7721, -1161, -11593, -16302, -12785, -14991, -20446, -25900, -36481, -47063, -50848, -54634, -54008, -53382, -57651, -67644, -72272, -71176, -59589, -38464, -6489, 25485, 57490, 83772, 99204, 89837, 66939, 38317, 24241, 23518, 35441, 53086, 72162, 81700, 81998, 57497, 20835, -25364, -61489, -88076, -104887, -115975, -115021, -100714, -75439, -50163, -18337, 13488, 39949, 60687, 88459, 116231, 144242, 162714, 179935, 197156, 211515, 225874, 249652, 282968, 319981, 347455, 362190, 359757, 361259, 353222, 348405, 343587, 352838, 371628, 403770, 435913, 481051, 526189, 578600, 631011, 692841, 754671, 813952, 856065, 889713, 902377, 909795, 911490, 923796, 949456, 1004922, 1060388, 1131711]
-8500A131711Q0862J08879J45124J99014K27628K58467K75639L23326L90095N00019O01126
-8489D241890O97695P30128P59335P68876Q39216R67031J265447J748079K560481L718405
-8479A8296583N443151P913519J1747341J7433941K4712083K9551704K7954560J7609562n00434
-8470A60162010j8094360k8768910l0529608k5400166j7844102j1579737p251360m629439
-8462A6064328l059471k109720j463036j025838o84371m56177l01656k70363l25681m77816
-8452E890199o13253o88250o44372n41602m02343k84670j98824j64014j54472j54953j45410
-8441A898036j41719j24546j23060j23056j32240j26514j16383r1580p1554m2937k8871j1699
-8429G63877j2895j2891j6830j6825k4103k4098l2359m1893m7023m7020m8216m8212m6069
$$ y = [1131711, 1212573, 1321452, 1466576, 1665590, 1893218, 2151685, 2427324, 2750650, 3140745, 3640764, 4241890, 4939585, 5669713, 6429048, 7197924, 8037140, 9004171, 10269618, 12017697, 14578178, 18296583, 23739734, 31653253, 43400594, 60834535, 85546618, 115098322, 143052882, 160662444, 160162010, 142067650, 113298740, 82769132, 57368966, 39524864, 27945127, 20693767, 16064328, 13004857, 10895137, 9432101, 8406263, 7721892, 7265715, 6964059, 6693696, 6368015, 5890199, 5276946, 4588696, 3944324, 3402722, 3000379, 2715709, 2516885, 2352871, 2198399, 2043446, 1898036, 1756317, 1631771, 1508711, 1385655, 1253415, 1126901, 1010518, 918938, 847384, 804447, 775576, 763877, 750982, 738091, 721261, 704436, 680333, 656235, 623876, 581983, 534960, 487940, 439724, 391512, 345443]
-8416C45443l2713k0458l286Q513J4240M460M463Q83Q87Q83J4240J3402J3405J1018J1021
-8401C86401J3878J3883J6468J6471L115o419j8227k7761l7899m3618m7288m7284m7407l4051
-8387A40262j8793j620O840O845K90j3059k6416k6412k4747p574Q636K1994K4106K4109K5179
-8372A39640J5645O401O82j2914j2910j1587j1584j1587j1584p414p410j0276j0272n895n890
-8357D3045n894n891j3107j3104r887l47O467O472M203M206l606l603q376q371j4426j4423
-8341c6642j4426j4423p094p090j967j963O684J2407J4553K0275K4449K4448J3122P400l063
-8326C6670j2601j0097j0096p533j811k61k60L196L196L197L197j990j990j989j989L434L436
-8309E709L435L435k109k109l658r381n350n347n708n704J863J867R09q626j3547p820m367
$$ y = [345443, 312730, 292272, 288986, 297499, 311739, 316199, 320662, 321545, 322432, 323315, 337555, 350957, 364362, 375380, 386401, 400279, 414162, 430630, 447101, 450216, 443797, 425570, 397809, 359910, 316292, 269004, 221720, 174313, 140262, 121469, 119849, 126689, 133534, 133824, 120765, 94349, 67937, 43190, 35616, 44252, 66246, 90352, 114461, 139640, 155285, 161686, 162368, 149454, 136544, 124957, 113373, 101786, 90202, 82788, 75378, 65102, 54830, 48935, 43045, 37151, 31260, 18153, 5049, -4838, -5185, 1282, 7754, 11957, 16163, 12557, 8954, 578, -7793, -22219, -36642, -51068, -65491, -72585, -79675, -81642, -83605, -76921, -64514, -49961, -29686, -5237, 19211, 32333, 39733, 36670, 24069, 13972, 3876, -3657, -5468, -5729, -5989, -2793, 403, 3600, 6797, 4807, 2817, 828, -1161, 2273, 5709, 9144, 12579, 10470, 8361, 4703, -4678, -10028, -15375, -21083, -26787, -24924, -23057, -22148, -30774, -44321, -52141, -56508]
-8292e6508J360Q629Q633K310K314j908j904q226q223j0254m527O558O561O915O919J6453
-8276b4898J0734O319O00n127j4661j4501q774m009m005o096o091j327j322J386J389J386
-8260f8997J390n21n18n22n18m851m847J826J829M389M393P250P254O535O539j42j37K839
-8242c6809K842K124P850J0362M639J181J181l827r549j3007j3007q312q312j636j635Q08
-8226f5107Q09N220N219M296j427J435J434K985k739L342L342L625L626L267L268L625k098
-8209b5878K672Q394J0689J0689J1047J1047J4921J4922K1599K1598L1673L1674L8349L8350
-8195B41746M9080M9080N4803O6249J03655J60885K38142L41154M98293P69175J216510J853653
-8183E642425K190794J072933r62015k072247j951351j405774q88810n18733l09507j91235
$$ y = [-56508, -55148, -46519, -37886, -35576, -33262, -35170, -37074, -45300, -53523, -63777, -68304, -61746, -55185, -48270, -41351, -24898, -14164, -7845, -7245, -12372, -27033, -41534, -50308, -54317, -58322, -64418, -70509, -71836, -73158, -71772, -70383, -68997, -67607, -68128, -68646, -69168, -69686, -74537, -79384, -77558, -75729, -71340, -66947, -59697, -52443, -45908, -39369, -39511, -39648, -36809, -33967, -31843, -23993, -13631, -8992, -7811, -6630, -10457, -20006, -33013, -46020, -54332, -62644, -64280, -65915, -65107, -64298, -59078, -53859, -49563, -50990, -49555, -48121, -45136, -47875, -44533, -41191, -37566, -33940, -30673, -27405, -23780, -25878, -23206, -14812, -4123, 6566, 17613, 28660, 43581, 58503, 80102, 101700, 133373, 165047, 203396, 241746, 290826, 339906, 394709, 460958, 564613, 725498, 963640, 1304794, 1803087, 2572262, 3788772, 5642425, 7833219, 8906152, 7944137, 5871890, 3920539, 2514765, 1625955, 1107222, 797715, 606480]
-8173F06480j35437r3469o2113l5406k2769j1322r296r296j7165j7165l5287l5287l0518l0518
-8159F1432j3976j3975p299p299m318m318m319m318j367j367j367j367o673o673o673o673
-8143c0550j863j859o632o628N81N85N81N85J34J38J34J38k012k008k012k008l085l081l085
-8124f1947l082K877K880K876K880J789J792J788J792K504K507K504K508n6n2n6n3m73m69
-8105c7491m73m70J271J274J032j0410l975l972j829j826j412j409j412j408j770j766j769
-8088f7815j767k64k61K597K601Q08Q12Q09Q12J230J233j632j628k318k313l749l744M62M66
-8069g3661M62M65K340K344n22n18J796J800J796J799L763L767L763L767k720k716k720k716
-8051e7711j617j613l406l401N678m5l502l503J476J475j386j386L734L733j036j036J826
$$ y = [606480, 471043, 377574, 315461, 280055, 257286, 245964, 236668, 227372, 210207, 193042, 157755, 122468, 91950, 61432, 47456, 33481, 26182, 18883, 14565, 10247, 5928, 1610, 243, -1124, -2491, -3858, -10531, -17204, -23877, -30550, -32413, -34272, -40904, -47532, -46951, -46366, -45785, -45200, -45066, -44928, -44794, -44656, -46668, -48676, -50688, -52696, -55781, -58862, -61947, -65029, -62152, -59272, -56396, -53516, -51727, -49935, -48147, -46355, -43851, -41344, -38840, -36332, -36388, -36440, -36496, -36549, -37022, -37491, -37964, -38434, -37163, -35889, -34857, -45267, -49242, -53214, -55043, -56869, -58281, -59690, -61102, -62510, -64280, -66046, -67815, -69582, -69846, -70107, -67510, -64909, -64101, -63289, -62480, -61668, -60438, -59205, -60837, -62465, -64783, -67096, -70845, -74589, -74127, -73661, -73199, -72734, -70394, -68050, -68572, -69090, -67294, -65494, -63698, -61899, -58136, -54369, -50606, -46839, -49559, -52275, -54995, -57711, -59328, -60941, -64347, -67748, -62070, -62115, -65617, -69120, -67644, -66169, -67555, -68941, -65207, -61474, -62510, -63546, -61720]
-8034f1720J826m255m255m643M896N611j12J439J438L942L942M508M508k61k61k436k437L882
-8016d4388L883M717j006P82P82R91R92R91R91O207O207J5388J5386K1766L1305L9292N6461
-7999A60747P4822R1990R3421Q3883O8025L5597J736m2139p5790q9144r1290q5567o9471n2303
-7985A04517l8711k9173j9311r773r772r772j308j308m169m169q074q074l305l305l781l782
-7969e3270O30O29O055L31l126l125j875j874j874j874L62L61m408m407J941J941J941J941
-7951e9701J416J420K488K493L264k455n917n913k668k664j236j234J893J896J535J539L212
-7934f0632k511n373L50K735K735j677j676k46k46l465K258K675K675j86j87N18n205Q76Q75
-7915f5707j896j897j896j896k448k448j017j017l402l402J368J367K053K057O22O26J725
$$ y = [-61720, -59894, -64149, -68404, -73047, -68151, -62540, -62652, -61213, -59775, -55833, -51891, -47383, -42875, -43136, -43397, -45833, -48270, -44388, -40505, -35788, -36794, -36012, -35230, -34239, -33247, -32256, -31265, -25058, -18851, -3463, 11923, 33689, 64994, 104286, 160747, 235569, 327559, 420980, 504863, 572888, 608485, 610221, 568082, 492292, 403148, 311858, 226291, 156820, 104517, 65806, 36633, 17322, 7549, -2223, -11995, -13303, -14611, -18780, -22949, -31023, -39097, -42402, -45707, -49488, -53270, -52640, -52011, -45956, -45625, -48751, -51876, -53751, -55625, -57499, -59373, -59011, -58650, -63058, -67465, -65524, -63583, -61642, -59701, -58285, -56865, -54377, -51884, -48620, -51075, -56992, -62905, -65573, -68237, -69473, -70707, -68814, -66918, -65383, -63844, -60632, -63143, -68516, -68166, -65431, -62696, -64373, -66049, -66295, -66541, -70006, -67748, -65073, -62398, -62584, -62771, -62253, -67458, -66582, -65707, -67603, -69500, -71396, -73292, -75740, -78188, -79205, -80222, -83624, -87026, -85658, -84291, -82238, -80181, -79559, -78933, -77208]
-7898g7208J729J725J728k373k370k373k370J711J713K80K83k120k116P41P45j374j372j374
-7880h4395j371j107j103L663L666M735M740J516J520J002m717j501j498k634k630K27K31
-7863g9656l871l868Q98R02j45j42M624M627r61r61J11J12M434j289r32r31J259J260J259
-7844g3270J259R62R61k31n954n552J72n44n44N2N2l05N417k899k898K228K228K049K049J692
-7824g3076J691j095o815p37p34J825J830J825J830Q12Q16Q12Q16O714O718L7M1j766j763
-7805f0219j766j762M40M43Q2Q6l06o024k810k805k46k42k46k42K87K90k217k213k49N476
-7785g4243k49k46K656Q384K298K303j218j215m437J289N25N29j978j975j978j975Q83Q87
-7767f9760m14m10m13m10j725j722L044L048L54L58L54L57K143K146N004N007K6L0n70n66
$$ y = [-77208, -75479, -73754, -72026, -74399, -76769, -79142, -81512, -79801, -78088, -77808, -77525, -79645, -81761, -81020, -80275, -81649, -83021, -84395, -85766, -86873, -87976, -84313, -80647, -75912, -71172, -69656, -68136, -67134, -71851, -73352, -74850, -77484, -80114, -79887, -79656, -83527, -87395, -86497, -85595, -85740, -85882, -81258, -76631, -77592, -78553, -78442, -78330, -73896, -75185, -76117, -77048, -75789, -74529, -73270, -72011, -71049, -70088, -70319, -76273, -81825, -81653, -82197, -82741, -82689, -82637, -82942, -77525, -80424, -83322, -81094, -78866, -76817, -74768, -73076, -71385, -72480, -79295, -80032, -80766, -78941, -77111, -75286, -73456, -72644, -71828, -71016, -70200, -63486, -56768, -56731, -56690, -58456, -60219, -61985, -63747, -63307, -62864, -62782, -62696, -63002, -69026, -71836, -74641, -74887, -75129, -75375, -75617, -75330, -75040, -77257, -79470, -79719, -74243, -74492, -74738, -72082, -63698, -61400, -59097, -60315, -61530, -65967, -64678, -64153, -63624, -65602, -67577, -69555, -71530, -70647, -69760, -70174, -70584, -70997, -71407, -73132, -74854, -71810, -68762, -68408, -68050, -67696, -67339, -65196, -63050, -58046, -53039, -53013, -52983, -53553, -54119]
-7747e4119k72r807j0525m799l69l65K850K854L745L748m482m479l826J900j323j319J956
-7730g8632J960r05r02J722J725l048l044j27j23k988k984K198K202K198K202K735K738K377
-7712g0696K381L048k671N44N47o48o45l509l506k497k492L65L69j066j062J796J800R61R65
-7693g6016j900j897k257k255k257k255L868L871L510L513K496l222m777m773l13l09l13l09
-7675h5595L323L328l354l349j386j382J475J479L43L46L43L47k266k261k623L103R54R58
-7657h6217l100l096k966K761m62m58J743J748J743J748k459k456n678M9L442L447N81O308
-7639h3322l73l69k876k873K191K195o71o67q08q09K053K053k12k13O464O465k627k627K35
-7620g6791K35l104l103k43k42K355K358N216N220k474k470k474k470r24r20J937J941j460
$$ y = [-54119, -54391, -64198, -74723, -79522, -79891, -80256, -77406, -74552, -70807, -67059, -71541, -76020, -79846, -77946, -79269, -80588, -78632, -76672, -77577, -78479, -76757, -75032, -78080, -81124, -81251, -81374, -84362, -87346, -85148, -82946, -80748, -78546, -75811, -73073, -70696, -68315, -65267, -67938, -67394, -66847, -67495, -68140, -71649, -75155, -77652, -80144, -79779, -79410, -80476, -81538, -79742, -77942, -76981, -76016, -77916, -79813, -82070, -84325, -86582, -88837, -84969, -81098, -77588, -74075, -71579, -74801, -79578, -84351, -84664, -84973, -85286, -85595, -82272, -78944, -82298, -85647, -87033, -88415, -86940, -85461, -85118, -84772, -84429, -84082, -86348, -88609, -91232, -88129, -87175, -86217, -89317, -92413, -95379, -92618, -93080, -93538, -91795, -90047, -88304, -86556, -89015, -91471, -97149, -97100, -93658, -90211, -89630, -83322, -83695, -84064, -86940, -89813, -87622, -85427, -86098, -86765, -87573, -88382, -86329, -84276, -84488, -84701, -78237, -71772, -74399, -77026, -76791, -76556, -79660, -82763, -83006, -83248, -80893, -78535, -73319, -68099, -70573, -73043, -75517, -77987, -78911, -79831, -77894, -75953, -77413]
-7602g7413j457L309L312J326J330k23n943p377p373o185m59L175L178j237j233k83k80K817
-7584i1016Q543O464P42m51m51k239k239k239k240k298k299k299k299R80R80R80R80K004K005
-7565h6392m076j215j632L137P012M151j930j930k109k109n983n984k526L35j908K862L58
-7548i9939L57L577L577L577L576m47m47m47m47L28L28L0K9L808r61l048n909l703J065K198
-7528i2898O968n44n44K317K318J840k928m896k034K220o41j415j416K53N023N201N201M009
-7510g1966M009p60p60M665M664M665M665K913K918R590R594R709R713R709R713J7280J7284
-7493D7605J4419J4423O133O136J185J188p094r951j9673k4437k0567j5792j5619j2753m591
-7478c9388m586m411m408n782n779n783n778P60P60P60P60J952J953r10r09l666l666J103
$$ y = [-77413, -78870, -75561, -72249, -70923, -69593, -69816, -75759, -83136, -90509, -96694, -97153, -93978, -90800, -92037, -93270, -93553, -93833, -91016, -82473, -76009, -75267, -75718, -76169, -78408, -80647, -82886, -85126, -87424, -89723, -92022, -94321, -93341, -92361, -91381, -90401, -88397, -86392, -90468, -91683, -93315, -90178, -83166, -79015, -80945, -82875, -84984, -87093, -93076, -99060, -101586, -101251, -103159, -100297, -99939, -99582, -96005, -92428, -88851, -85275, -85722, -86169, -86616, -87063, -86735, -86407, -86377, -86348, -82540, -83501, -86549, -92458, -96161, -95096, -92898, -85930, -86474, -87018, -84701, -82383, -80543, -83471, -88367, -90401, -88181, -88822, -90237, -91653, -91400, -86377, -81176, -75975, -71966, -67957, -68717, -69477, -64812, -60148, -55483, -50818, -47905, -44987, -35397, -25803, -16094, -6381, 3328, 13041, 30321, 47605, 62024, 76447, 82580, 88716, 89901, 91089, 83995, 74044, 54371, 29934, 9367, -6425, -22044, -34797, -39388, -43974, -48385, -52793, -58575, -64354, -70137, -75915, -75155, -74395, -73635, -72875, -70923, -68970, -69880, -70789, -74455, -78121, -77018]
-7460g7018J103l369l368n06n07J475J476J475J476j744j744m605m605J312J311J311J312
-7443h5215K146K146K146K146K005K004q57q57l20l21L257k467o177m55q12o535n641n641
-7425i9448j229j230J558J557j662M062M120M121k91k90L673L674l003l003O33O34k586L137
-7407h5573J897J900j204j199K373p161n019P08j635j632m140m135q61q57q60q57M012M013
-7389a00230M013M012M371M370K821k903o37o37J867J866k366k366M96M95L965L968L606L611
-7371f9678j044o762l547l543m382m378L88L91L964L968m47m43r65M758M758r65J67J68K671
-7352g4921K672P34P34L595L596L178L178L178L178P578P579M716M717O029O028O028O029
-7335b174R872R874J3331J9053K7817K7817L9859M5581N2683O2221O0910O0909N6141L8972
$$ y = [-77018, -75915, -79284, -82652, -83158, -83665, -82190, -80714, -79239, -77763, -79507, -81251, -85856, -90461, -89149, -87838, -86527, -85215, -83069, -80923, -78777, -76631, -74626, -72622, -73479, -74336, -74656, -74977, -71720, -74187, -80364, -80819, -81631, -88166, -93807, -99448, -100677, -101907, -100349, -98792, -100454, -96392, -92272, -88151, -88442, -88732, -85059, -81385, -84388, -87391, -86758, -86124, -88710, -85573, -83676, -81776, -82980, -84179, -81806, -88967, -93986, -93278, -94913, -96545, -100685, -104820, -105681, -106538, -107398, -108255, -104243, -100230, -96217, -92205, -87834, -83464, -80643, -83546, -84183, -84820, -82953, -81087, -83453, -85819, -85323, -84828, -80863, -76895, -73289, -69678, -70722, -77484, -81031, -84574, -88956, -93334, -92946, -92555, -88591, -84623, -85070, -85513, -86478, -81720, -76962, -77927, -77760, -77592, -74921, -72249, -71515, -70781, -67186, -63590, -60412, -57234, -54056, -50878, -43300, -35721, -31005, -26288, -20259, -14231, -8203, -2174, 7698, 17572, 30903, 49956, 77773, 105590, 145449, 191030, 243713, 305934, 366844, 427753, 483894, 522866]
-7321E22866J8584k399k0611l3965m6483n2206n3100n3101n6081n0358m2314l2772l0510k4784
-7307D2766j2448j2445j2686l145k402k399m669m664n175n172k314k310j45j41j577j572l931
-7290c4429l927o434o431j2038o311L461R188N190N194J971P697M341j383o389o390n287n287
-7273e7264l856l856p42p41l842r564m050J673R58R57J882J881M743M743M743M743J882J881
-7255e3829K105K105p56p56J062J061K493K493k564k563k564k563l905l904j0581j0582k504
-7238h5752k503K265K265K862K861N365N365L704k019j662j662J081J080l688l689J56J57
-7221g3814M925M926N14N14m255m254j237j237N439N440J565J565J34J34l264l264j833j833
-7203f9835N52N51J94J93L130k593p362j640K623K623J550J550L547L547O86O85m173m173
$$ y = [522866, 541450, 539051, 518440, 484475, 437992, 385786, 332686, 279585, 223504, 173146, 130832, 98060, 67550, 42766, 30318, 17873, 5187, 2042, -360, -2759, -7428, -12092, -17267, -22439, -24753, -27063, -27208, -27349, -28926, -30498, -34429, -38356, -44790, -51221, -63259, -69570, -66109, -56921, -51731, -46537, -44566, -36869, -32528, -33911, -40300, -46690, -51977, -57264, -61120, -64976, -65718, -66459, -70301, -79865, -83915, -82242, -81284, -80327, -78445, -76564, -71821, -67078, -62335, -57592, -55710, -53829, -51724, -49619, -50375, -51131, -50069, -49008, -46515, -44022, -46586, -49149, -51713, -54276, -58181, -62085, -72666, -83248, -85752, -88255, -85990, -83725, -80863, -78002, -72637, -67272, -63568, -65587, -67249, -68911, -67830, -66750, -70438, -74127, -73971, -73814, -68889, -63963, -63449, -62935, -67190, -71444, -72681, -73918, -68479, -63039, -61474, -59909, -59775, -59641, -62905, -66169, -68002, -69835, -69283, -68732, -68538, -68345, -65215, -67808, -75170, -76810, -74187, -71564, -70014, -68464, -64917, -61370, -60684, -59999, -64172, -68345]
-7185f8345k742k742k601k600l674l673M851J0573J0217J0216N775N775J0544J0544O848O848
-7169d186M939p81J430m292q107q107k742k743J20J19K742K742j19j19l190l189j758j759
-7151b9000m877m877m877m877m788m788J889J889J710J711M571M572J0473J0473R877R877
-7135a042Q073j464q68q68o650o650n459K65N242m81O196J1918J2038O316q231j7768j3669
-7118a3102p943o75N052K426K429N645N648K901K907j509j506k938K786Q148Q152R318R322
-7101C7061J2180J2183J2299J2303J4803J4806J3282P564K433Q159J3223P504R646R650Q897
-7086A95993Q901J0328J0332K0521K0526K5291K5294L1461L1464K4069J4535R970M251K936
-7072D35872J2478K0030K0033K4680L4222M8912O2269P9673R6845J11059J20601J28227J41584
$$ y = [-68345, -71087, -73829, -76430, -79030, -82704, -86377, -81526, -70953, -60736, -50520, -44745, -38970, -28426, -17882, -11034, -4186, 753, -28, 1402, -2890, -10997, -19104, -21846, -24589, -24469, -24350, -21608, -18866, -18985, -19104, -22294, -25483, -27241, -29000, -33877, -38754, -43631, -48508, -53296, -58084, -56195, -54306, -52596, -50885, -46314, -41742, -31269, -20796, -10919, -1042, 7031, 5567, 4699, 3831, -2819, -9469, -14928, -14663, -9421, -9902, -3706, 8212, 20250, 26566, 18335, 567, -13102, -21045, -21720, -16668, -14242, -11813, -6168, -520, 2381, 5288, 3779, 2273, -665, 2121, 10269, 18421, 27739, 37061, 49241, 61424, 73723, 86026, 100829, 115635, 128917, 136481, 138914, 147073, 160296, 167800, 177446, 187096, 195993, 204894, 215222, 225554, 246075, 266601, 291892, 317186, 348647, 380111, 404180, 418715, 428685, 432936, 435872, 448350, 468380, 488413, 513093, 547315, 596227, 658496, 738169, 835014, 946073, 1066674, 1194901, 1336485]
-7059A336485J57915J78902K03936K24924K53004L00699L60547M23501M92768N78615P20966
-7048E232262R55607J312058J817580K506702L450974M745763O350071P744293P502031M064075
-7038D5681416j641592o363184q093383p422506n783857m109694k802975j907472j318016
-7029F238737r18136o30083m20487k65967j48891r3566j27486k40035l42093l74522l48054
-7018B329417l04179k55534k07844j72017j39588j05727q4743o9841n6487m2299l2761k1703
-7006H36694k1702k9691k9691l2076l2075l5295m4833m5160m5161l7172l7172k8469k8469
-6993C89728j9885j9885q621q622o33o33j7564k7101k4598j8875j2228o505r367r367j0678
-6978A95166j0678j0678j0679l934l934j20n842o080L457J1923K9091L8927L8928L7138L1416
$$ y = [1336485, 1494400, 1673302, 1877238, 2102162, 2355166, 2655865, 3016412, 3439913, 3932681, 4511296, 5232262, 6187869, 7499927, 9317507, 11824209, 15275183, 20020946, 26371017, 34115310, 41617341, 45681416, 44039824, 37676640, 29583257, 22160751, 16376894, 12267200, 9464225, 7556753, 6238737, 5320601, 4690518, 4270031, 4004064, 3855173, 3761607, 3634121, 3394086, 3051993, 2677471, 2329417, 2025238, 1769704, 1561860, 1389843, 1250255, 1144528, 1059785, 989944, 933457, 891158, 858397, 836694, 814992, 785301, 755610, 723534, 691459, 656164, 611331, 566171, 521010, 483838, 446666, 418197, 389728, 369843, 349958, 341337, 332715, 332082, 331449, 313885, 286784, 262186, 243311, 231083, 224578, 215211, 205844, 195166, 184488, 173810, 163131, 159197, 155263, 155143, 149301, 143221, 146678, 158601, 187692, 226619, 265547, 302685, 334101]
-6963C34101K1044N9j9016l6185l3994k0641l115l115M516J0238N827j5156l9240m8779m6632
-6948A09912l7094k8987j9449n857J5127L1789M1326M7765M7765L7571L7571L4710L4710L2295
-6934C79154L2295L1938L1937K3413J7691K7109M0462N0563M1028L1010J0030j062o781q23
-6920G07964M903P016J6557K9907M7080O2515O8242P5392Q4933R1480R7206R9111Q9575P5564
-6906A557445O2213N0287M0753M6174P0977J05071J33690J49543J62899J89841K48981L24943
-6894C142817L87894M30338M70399N16896N83663O67836P65125Q65393R77944J116959J290554
-6883A1215818J485010J685310J940453K350590L072577M249575N982167Q364777J1615111
-6874E1961388J6130432K2285115K9444387L4001625K8669838R689325j4558374l0844981
$$ y = [334101, 355145, 355204, 336188, 300003, 266009, 245368, 242253, 239138, 243654, 253892, 259719, 244563, 205323, 156544, 109912, 72818, 43831, 24382, 18525, 33652, 65441, 106767, 154532, 202297, 239868, 277439, 312149, 346859, 379154, 411449, 443387, 475324, 498737, 516428, 543537, 583999, 634562, 675590, 706600, 716630, 715568, 708787, 707964, 712867, 719883, 736440, 766347, 813427, 875942, 944184, 1019576, 1104509, 1195989, 1293195, 1392306, 1481881, 1557445, 1619658, 1669945, 1710698, 1756872, 1827849, 1932920, 2066610, 2216153, 2379052, 2568893, 2817874, 3142817, 3530711, 3961049, 4431448, 4948344, 5532007, 6199843, 6964968, 7830361, 8808305, 9925264, 11215818, 12700828, 14386138, 16326591, 18677181, 21749758, 25999333, 31981500, 40346277, 51961388, 68091820, 90376935, 119821322, 153822947, 182492785, 192182110, 177623736, 146778755]
-6866A46778755l4417948k9612658k2155799j5360379j0379602p083004m944569l504082k479693
-6857A6841021j744547j261920r96165q98877q96493r25108r30353q94108q27819p49607o73123
-6846F042901n83465m89039m07011l44775l12346k95416k82062k54461k18217k01883k01883
-6835B452343k05579j96041j78276j53477j23053r4434p0235m9248l7329l7325l9236l9233
-6823A228877m3648m9367n5094o4628o3200o3198o0577o0575n8849n3122l8223j7236K87O013
-6809F07460J241J244o37o33P589P594O516P97n883n879k161P381J3815J3819J2981L446j0030
-6792F58660k3379k7556l7091n1639o1174o5470m4483k5529q357K683K686L517o017j3532
-6778C03319k6882k4501l513J1535K1077L3592M3133L9553L9557L2877K7157K0064K0067L0675
$$ y = [146778755, 112360807, 82748149, 60592350, 45231971, 34852369, 27769365, 22824796, 19320714, 16841021, 15096474, 13834554, 12838389, 11939512, 11043019, 10117911, 9187558, 8293450, 7465631, 6716024, 6042901, 5459436, 4970397, 4563386, 4218611, 3906265, 3610849, 3328787, 3074326, 2856109, 2654226, 2452343, 2246764, 2050723, 1872447, 1718970, 1595917, 1501483, 1431248, 1382000, 1344671, 1307346, 1268110, 1228877, 1185229, 1135862, 1080768, 1016140, 952940, 889742, 829165, 768590, 709741, 656619, 618396, 601160, 601447, 607460, 608701, 609945, 609308, 608675, 616264, 623858, 630374, 631171, 625288, 619409, 617248, 624629, 638444, 652263, 665244, 668690, 658660, 635281, 607725, 570634, 518995, 457821, 392351, 347868, 322339, 313982, 316665, 319351, 322868, 316851, 303319, 276437, 251936, 248423, 259958, 281035, 314627, 357760, 397313, 436870, 469747, 496904, 516968, 537035, 567710]
-6764E67710M7846P9319J19383J68499K42901L47159M82604N89427N15033J63910k92007n78629
-6752B453155o11055n01796l58720k32822j50791j01197p2579n5414m2057l4631k8905k8074
-6740B35114k8070k9803k4076k6464k6461k2456r102j710j710N980J5518J6472J6471P672
-6726A27375J948p231j2955j3253l714k761k761J524J524J524J524O412O412O054O055J911
-6710A19588l812j427J1927K4147K4147K1166J1628o516j6055j9512r974q066q066j2836j8558
-6695A07781k4669k4668k4550j8826p500N853J1099J1099R416R415M73M73k686q409m833m832
-6679C4636j0645m922m921m922n041O82L24L24K224K224K225K224M728M728M371M370k306
-6662C0303q029r222r221q028k307n167n168k045L677P612K0964K6151L1875K4482P314j6055
$$ y = [567710, 615556, 694875, 814258, 982757, 1225658, 1572817, 2055421, 2644848, 3159881, 3323791, 3031784, 2453155, 1842100, 1340304, 981584, 748762, 597971, 496774, 424195, 368781, 326724, 292093, 263188, 235114, 207044, 177241, 153165, 126701, 100240, 77784, 68682, 66972, 65262, 71242, 86760, 103232, 119703, 127375, 129323, 122092, 109137, 95884, 92170, 89409, 86648, 88172, 89696, 91220, 92744, 99156, 105568, 111622, 117677, 119588, 115776, 114349, 126276, 150423, 174570, 195736, 207364, 200848, 184793, 165281, 155307, 147241, 139175, 126339, 107781, 83112, 58444, 33894, 15068, 7568, 13421, 24520, 35619, 45035, 54450, 54923, 55396, 52710, 44301, 39468, 34636, 23991, 19069, 14148, 9226, 4185, 4867, 5191, 5515, 7739, 9963, 12188, 14412, 19140, 23868, 28239, 32609, 30303, 22274, 13052, 3831, -4197, -6504, -11671, -16839, -18884, -15207, -7595, 13369, 39520, 71395, 95877, 103191, 87136]
-6646H7136k1777k4043k4042k0465j4743r021N18K858K858N957N958P448J724n547n548j2194
-6630b2923j2195j5413r691r632r631p962J576j106j107K351K351k835k836n696K6N227J0950
-6613g8546J0950J0950L976L975p93p94k891k888N67O293M47M51k057k053M02M07k460k455
-6595e6519M099M102O602O606j483p202j0067m341O04O07R61R65M091M095Q860Q863J1543
-6578a7614J1546O773O777M385M386J285m437j0280m556k768K955R27R27l482l484l603l603
-6561a3866j0279j0280n071n070p575p575l997J725J367J367J189J188j076j077j911P626
-6545e3315Q939Q938K966K965j1341j1341o990o990J595J595N857N857N857N856R10R09p675
-6528d5408p676j1587j1587m911m910J527J528J527J528N373N372N373N372L704L703J0380
$$ y = [87136, 65359, 41316, 17274, -3191, -17934, -26955, -26437, -23579, -20721, -14764, -8806, -1358, 366, -5181, -10729, -22923, -35118, -50531, -60222, -69854, -79485, -87447, -85871, -86977, -88084, -85733, -83382, -86217, -89053, -94749, -94723, -89496, -78546, -67596, -56646, -52670, -48695, -49488, -50282, -53173, -56061, -55494, -49201, -48754, -48303, -50360, -52413, -52011, -51604, -54064, -56519, -52420, -48318, -41716, -35110, -36593, -43795, -53862, -58203, -57599, -56992, -56031, -55066, -50975, -46880, -38020, -29157, -17614, -6068, 705, 7482, 11867, 16253, 17538, 13101, 2821, -1735, -4503, -1548, -621, 306, -3176, -6660, -10263, -13866, -24145, -34425, -39496, -44566, -52141, -59716, -63713, -61988, -60621, -59254, -58065, -56877, -57953, -59030, -60941, -53315, -44376, -35438, -32472, -29507, -40848, -52189, -59179, -66169, -64574, -62979, -57122, -51265, -45408, -39552, -38642, -37733, -45408, -53084, -64671, -76258, -81169, -86079, -84552, -83024, -81497, -79969, -74596, -69224, -63851, -58479, -54775, -51072, -40692]
-6512d0692J0380Q585Q588%Ln007n004k146k142n276n272k414k411j2787j2783r926r921k0872
-6494a09097k0869m657m654K0619K0622J5850J5853J0336J0339j57j52L301L305J1885J1889
-6479a5587M191M196j0116j0112j0056j0052j0056j0052j680j677L089L092m303m300j442
-6464g4865j438o509o505o509o505P500P503J9900J9903J3193J3197O517O520K641K646J1225
-6448H414J1229J3778J3778J3778J3778J1692J1691J1692J1692J7146J7146J7146J7146K5373
-6434B15479K5373L5149L5149N2504P1581R7094J31432J76737K26336K74026L15993L48959
-6422B005812L60405L43236K86008K05173J02162j1461j22102k14253k81019l05222k88053
-6411B080686k47755j92434j28768p3447l1122k507J9907J4184j732k6532n2284p7083r3783
$$ y = [-40692, -30312, -21727, -13139, -13139, -13136, -18143, -23147, -25293, -27435, -32711, -37983, -40397, -42808, -55595, -68378, -78304, -88225, -109097, -129966, -134623, -139277, -118658, -98036, -82186, -66333, -55997, -45658, -45815, -45967, -42666, -39361, -27476, -15587, -11396, -7200, -17316, -27428, -37484, -47536, -57592, -67644, -69324, -71001, -67912, -64820, -69123, -73423, -74865, -76303, -82812, -89317, -95826, -102331, -94831, -87328, -67428, -47525, -34332, -21135, -14618, -8098, -5457, -2811, 8414, 19643, 33421, 47199, 60977, 74755, 86447, 98138, 109830, 121522, 138668, 155814, 172960, 190106, 215479, 240852, 276001, 311150, 363654, 435235, 532329, 663761, 840498, 1066834, 1340860, 1656853, 2005812, 2366217, 2709453, 2995461, 3200634, 3302796, 3291335, 3169233, 2954980, 2673961, 2368739, 2080686, 1832931, 1640497, 1511729, 1438282, 1407160, 1404653, 1424560, 1438744, 1437012, 1410480, 1358196, 1281113, 1187330]
-6398A187330j07135j06898r3543p4885m6271j3246P739K4519K4520K1539J2001l797k0965
-6385H10908m1353n8521o4796o4795o8492o2768n1145m1606l1710l1710k5123j5585j4632
-6372B38672j4631j2843j8566j6896k2619k8961k8961k9676k3953j6204j6203j4295q573j599
-6358a5308j598J621J620P046P044N734l804q154q152q752q749r467r463r468r463q871q868
-6341h7052j837j833l685K042M900M903K969o565p880p876m423m418K850Q577J0570J0574
-6325g8184O158M40L774J3316J8797J3078n03j0041j2664o942K13N935P485P485R564L842
-6309a8247L83L84k120k120K411J1948J6926P388j315j0853j2641j2642j5741j5742o434p12
-6293e9127O561O561O323O323J315m408k373L353M184M188R65m754j1435n707O330O334J3126
$$ y = [1187330, 1080195, 973297, 879754, 804869, 758598, 745352, 753091, 777610, 802130, 823669, 835670, 831873, 810908, 769555, 711034, 646238, 581443, 512951, 450183, 399038, 357432, 325722, 294012, 268889, 253304, 238672, 224041, 211198, 192632, 175736, 153117, 124156, 95195, 65519, 41566, 25362, 9159, -5136, -13709, -15308, -16906, -15285, -13665, -6619, 425, 6159, 2355, -5799, -13951, -22703, -31452, -40919, -50382, -59850, -69313, -78184, -87052, -88889, -90722, -94407, -92365, -87465, -82562, -79593, -86158, -94038, -101914, -106337, -110755, -107905, -99328, -88758, -78184, -72026, -71586, -67812, -54496, -35699, -22621, -23124, -33165, -45829, -52771, -52558, -46623, -39138, -31653, -22089, -18247, -17864, -17480, -19600, -21720, -19309, -7361, 9565, 16953, 15638, 4785, -7856, -20498, -36239, -51981, -58415, -59127, -52566, -46005, -39682, -33359, -32044, -36452, -38825, -35472, -31288, -27100, -26135, -30889, -42324, -48031, -41701, -35367, -22241]
-6276b2241P407J1218J6944L0175L5902L8506L8510K9803J2638L931n604q588j4307k0034
-6262A54260k0030j5026r299n190n187o3o0R922R926Q848Q853l91j7556k5190k5187j3625
-6246E5005k68J6061K5604L6003L0283L2068L2072L6643K7109K8178J4829L946j7035l3729
-6232B86769l3726k1271k1267j9363j3636K783Q510R698L979L059o479q149q148J08J08Q335
-6216A91310Q334M371j353p433j6971k1263k6986l0920m8089n8208n8208k6375K239K1077
-6202f8475K6800L2761K7037K5190J5652J3983M445P724J3446K3342J7620J9486J9489K1752
-6188B00252J6032Q696q38q234q231j349j344R500J9043K9769K9773J9635q975l6931n4095
-6173B12703m5991k8819j7497k7030k5008k5004j3919q193J1713L2702N6781N1062M7482L4132
$$ y = [-22241, -14834, -3616, 13328, 43503, 79405, 117911, 156421, 186224, 198862, 202793, 197189, 188601, 174294, 154260, 134230, 119204, 109905, 104715, 99528, 99465, 99405, 109327, 119253, 128101, 136954, 136563, 119007, 93817, 68630, 55005, 54737, 70798, 96402, 132405, 162688, 194756, 226828, 263471, 290580, 318758, 333587, 337533, 320498, 286769, 253043, 231772, 210505, 191142, 177506, 180289, 188799, 198497, 202476, 205535, 199056, 190907, 182759, 182867, 182975, 191310, 199644, 204015, 202662, 195229, 178258, 156995, 130009, 99089, 51000, -7208, -65416, -91791, -89552, -68475, -41675, -8914, 18123, 43313, 58965, 72948, 77393, 85117, 98563, 121905, 139525, 159011, 178500, 200252, 216284, 224980, 224142, 215908, 207677, 206328, 204984, 214484, 233527, 263296, 293069, 312704, 303729, 266798, 212703, 166712, 137893, 120396, 93366, 68358, 43354, 29435, 21242, 32955, 65657, 122438, 173500, 220982, 255114]
-6159B55114J8208k775j8991l2344k7217j7679n10J2843L5019N6002O3872J2366l8901o3701
-6145B51306n1777l4609j1427n704k605q327j1189k4541l2173m5525l8342j3543K8900M6070
-6131D6514N3938M0585K1510N25l249q972l87l88R270R270J8808J3085L964j759J3503L964
-6115B20181k3219m8018l1089J2787P2065J12124J33466J33466J28816J00202N9785J9724
-6103H90290p489l6103m6714n6252n9352n9353m9098l9561k8387k8383j3484L689O4132J27087
-6089F61022J23269M1245l7478q8980q0519m8085m214m210j5540m0336l8886l3160j0630J0358
-6075D33856L2053L2057N943m1744m6249j3815N6405J19360J61920J61924J84215J70865J14278
-6062A371068k082j24889j87837j30254j7702Q9122J13924J06975P8365L3532j01904k37349
$$ y = [255114, 273322, 270547, 251556, 219212, 191995, 174316, 173806, 186649, 221668, 277670, 341542, 353908, 315007, 251306, 199529, 164920, 153493, 147789, 145184, 136857, 125668, 101127, 68954, 23429, -14913, -28456, 444, 46514, 100452, 141037, 162547, 163072, 159823, 150851, 150464, 150076, 159346, 168616, 187424, 200509, 204473, 202714, 216217, 220181, 196962, 148944, 117855, 130642, 202707, 314831, 448297, 581763, 710579, 810781, 870566, 890290, 882801, 846698, 799984, 743732, 684380, 625027, 575929, 536368, 507981, 479598, 466114, 469803, 533935, 661022, 784291, 825536, 788058, 699078, 618559, 570474, 566260, 562050, 546510, 506174, 467288, 434128, 423498, 433856, 465909, 497966, 503909, 462165, 415916, 402101, 458506, 577866, 739786, 901710, 1085925, 1256790, 1371068, 1368986, 1244097, 1056260, 926006, 908304, 997426, 1111350, 1218325, 1296690, 1330222, 1228318, 990969]
-6050I90969k73590k01581j30996r2459r8179o4800J7232J23936J90705K28616K07635J72669
-6038A070157J47874J73265J73269J61223J36428J53593J53596J33850J09054J52091K03601
-6027B768001K33642K01215J33731N1707K4877J5343L8707M4434K2612J632P9840J84763K73337
-6014D073841L05769L60372M15696M85916N03089N02131M39183L60461K59361J86868J20105
-6003H012792J48000K71999M82310N98677O38046O62847Q25945J152150J570630J866313K041571
-5992A8271280K112157K276208K571894L054037L529037L963256M365764N025081N927386
-5983E1096100O976284P809912Q578926J0000099J3396236J9437666K8469979M0554709N7263426
-5974B43583337Q1488230J17255987J63017701J97301663J62615489L4737593j08804621j85670598
$$ y = [990969, 717379, 515798, 384802, 292343, 194164, 129364, 146596, 270532, 461237, 689853, 897488, 1070157, 1218031, 1391296, 1564565, 1725788, 1862216, 2015809, 2169405, 2303255, 2412309, 2564400, 2768001, 3001643, 3202858, 3336589, 3388296, 3413173, 3428516, 3467223, 3511657, 3534269, 3535901, 3615741, 3800504, 4073841, 4379610, 4739982, 5155678, 5641594, 6144683, 6646814, 7085997, 7446458, 7705819, 7892687, 8012792, 8160792, 8432791, 8915101, 9513778, 10151824, 10814671, 11640616, 12792766, 14363396, 16229709, 18271280, 20383437, 22659645, 25231539, 28285576, 31814613, 35777869, 40143633, 45168714, 51096100, 58072384, 65882296, 74461222, 84461321, 97857557, 117295223, 145765202, 186319911, 243583337, 325071567, 442327554, 605345255, 802646918, 965262407, 1000000000, 891195379, 705524781]
-5966G05524781j86210589j48438758j03100533o5996985m1009132k5076504j4288951n802535
-5958A15600794K234243J0984945K0357059K6930553K1335552j60403k2836229l2166285k9276225
-5949A13004004k2061639j4890923r289205m983725j319673K295256O107173J0710248J7032793
-5940I6604309K6290447L7928681M5240576L2557564k319373l5143866m6881406m1552290
-5932A12724642l0531975j9987045j2224963p130918l760166j146225J312685L665733M720640
-5923D7642408K477523k323938o090047p118251o368007n095627l862833k930009k255072
-5914A4076147j745739j281950q52737n13748l66862l80214m43167m50677m14433l63405l34790
-5903F928425l10408k97055k84179k59379k00244j22031m0720J0786J1651o2746j57889k24655
$$ y = [705524781, 519314192, 370875434, 267774901, 201777916, 160768784, 135692280, 121403329, 115600794, 117835037, 128819982, 149177041, 176107594, 197443146, 197282743, 174446514, 142280229, 113004004, 90942365, 76051442, 66762237, 61778512, 60458839, 62754095, 68861268, 79571516, 96604309, 122894756, 160823437, 206064013, 238621577, 236302204, 201158338, 154276932, 112724642, 82192667, 62205622, 49980659, 42849741, 39089575, 37943350, 39256035, 42921768, 47642408, 50119931, 47795993, 41705946, 34587695, 28219688, 23124061, 19261228, 16331219, 14076147, 12330408, 11048458, 10195721, 9681973, 9315111, 8934897, 8491730, 8041053, 7626620, 7263215, 6928425, 6618017, 6320962, 6036783, 5777404, 5577160, 5455129, 5414409, 5425195, 5436846, 5374100, 5216211, 4991556]
-5891D991556k44565k65550l26832m05044m02562l01459j76987q7330l8446k1278k6763p4453
-5879B620287j32337j72397j63097j07776j7642N6755P9170O2001O7843P7385N5682L66n0548
-5866B375692p5344n9609m2437m1635o2616q9804j06968r7195q3838o7627n8086o1382q2363
-5853A446788r6197j05731q7254k8115L6502M6043P917n5030r1517j01051q2844o1855n2322
-5840G75334n2318n5145n5146n5504n5503m2478k5309J2723N2784Q6971R6510J04140R8417
-5827H85476P9461K7954k8081o8141o2083n2546n2306m6584l1442j8089J4102L8902L9497
-5814G26120K2329O233j4751k3811k3812p716J3268L0272K4549K731l3513n5809n5809m0667
-5800E69614k7314j770J5399K8156K8155R557k6688o0667p7836l6770K2366M7165L3812L6196
$$ y = [4991556, 4746991, 4481441, 4154609, 3749565, 3347003, 3045544, 2868557, 2781227, 2742781, 2721503, 2694740, 2620287, 2487950, 2315553, 2152456, 2044680, 2027038, 2083793, 2162963, 2224964, 2292807, 2370192, 2425874, 2426240, 2375692, 2300348, 2240739, 2198302, 2156667, 2094051, 2004247, 1897279, 1800084, 1716246, 1648619, 1590533, 1529151, 1446788, 1350591, 1244860, 1157606, 1129491, 1165993, 1212036, 1219953, 1164923, 1073406, 972355, 889511, 827656, 775334, 723016, 667871, 612725, 557221, 501718, 459240, 433931, 446654, 499438, 586409, 682919, 787059, 885476, 964937, 992891, 964810, 896669, 834586, 782040, 729734, 683150, 651708, 633619, 647721, 686623, 726120, 748449, 754682, 739931, 716120, 692308, 684592, 697860, 728132, 752681, 755412, 721899, 666090, 610281, 569614, 542300, 540530, 555929, 584085, 612240, 621797, 595109, 534442, 456606, 419836, 442202, 489367, 523179, 559375]
-5786E59375K2843l625l2240n1673o1211m1539k4371m06m06N317K2485M8886M8887L3983J553
-5771E27858k3543l6897l8685m4408n0369n0369m9654m9654l5943j8774m14R125J3707J3707
-5757A65687J6211J0489M705j6278j8543j2821K143K142J2992J2992K9206K9207L3260J9907
-5743B91299J5332N797P463P467J0562J0567Q416K698P999j535k5503n0298o6756o6751m7322
-5728A09435l7780k2321j2779j338j334Q558Q562J2254J2258N459j1707j0041m314j576j573
-5713E1763J3089J8815J8518Q983R575M1j930j926k526k523L078L081L078k642j3793j9512
-5697H5169l897N644J4136J4140J855j1494k1990k7709k1870j6144p385p381J200J204K749
-5682H227k969o788o784j0131j5853j7046j7045j5138r415r177r177J077J0615K2060K7784
$$ y = [559375, 582218, 578593, 546353, 494680, 433469, 391930, 367559, 367153, 366747, 372064, 394549, 443435, 492322, 526305, 527858, 504315, 467418, 428733, 384325, 333956, 283587, 233933, 184279, 148336, 129562, 129148, 138273, 151980, 165687, 181898, 192387, 197092, 180814, 162271, 149450, 151593, 153735, 166727, 179719, 208925, 238132, 271392, 291299, 306631, 312428, 319891, 327358, 337920, 348487, 356903, 359601, 367600, 366065, 340562, 290264, 223508, 156757, 109435, 71655, 49334, 36555, 35217, 33883, 42441, 51003, 63257, 75515, 80974, 69267, 59226, 54912, 53336, 51763, 64852, 83667, 102185, 111168, 120743, 120784, 118854, 116928, 114402, 111879, 114957, 118038, 121116, 118474, 104681, 85169, 81272, 86916, 101052, 115192, 117047, 105553, 83563, 55854, 33984, 17840, 10455, 3074, 4274, 5478, 8227, 5258, -1530, -8314, -18445, -34298, -51344, -68389, -83527, -92942, -102119, -111296, -110219, -99604, -77544, -49760]
-5667d9760L6427L6426L5354K2001J1740O018Q044Q044J307m415r422r423r28M796J5286R565
-5651A21060O345O345R922R921N373p981j0007j5731k5328l1050k7832k7832j8233j2511l331
-5636b0870O207J8129J2407Q591K869K109l614l972J751J3734J3733J4091Q368O699R76m389
-5620G6819m389k779K943R859R858O770J051J047O773J3804J3808O770k765p149j2869j3111
-5604A06440p385N011J0738J0734N015K917k801o621o617j316j311k865q584j6487j6483j2075
-5588E8310j2072m922m918L901R628J4955R232K318K317M702M702o147o148m717j0439j5805
-5572D4897j5805j3421j3420o147m24M999N000J900l823m298m300l107K615Q248Q249J1468
-5556B2631J1468P474P474J0336M612J405m318j100o821n630n630r80M743l84o106k530k530
$$ y = [-49760, -13333, 23093, 58447, 80448, 92188, 98206, 106250, 114294, 115601, 111186, 101764, 92341, 91413, 96209, 111495, 121060, 127405, 133750, 143672, 153593, 158966, 150985, 140978, 125247, 99919, 68869, 41037, 13205, -5028, -17539, -20870, -14663, 3466, 15873, 24464, 27333, 29442, 25828, 21856, 23607, 37341, 51074, 65165, 73533, 80232, 81208, 76819, 72430, 69651, 72594, 82453, 92311, 99081, 100132, 101179, 107952, 121756, 135564, 142334, 139569, 132420, 119551, 106440, 99055, 104066, 114804, 125538, 130553, 133470, 130669, 124048, 117431, 116115, 114804, 111939, 103355, 86868, 70385, 58310, 46238, 41316, 36398, 40299, 49927, 64882, 74114, 76432, 78749, 83451, 88153, 82006, 75858, 71141, 60702, 44897, 29092, 15671, 2251, -3896, -4320, 679, 5679, 7579, 3756, -542, -4842, -7949, -5334, 2914, 11163, 22631, 34099, 41573, 49047, 59383, 63995, 65400, 61082, 59982, 53161, 47531, 41901, 40921, 45664, 45280, 39174, 36644, 34114]
-5539C4114l84l83K477K478L811L812L811L812Q163Q163J6748J6748J7611J7612J7612K3335
-5523A79540L3946L9668M8134M8134N1006O4360Q0693J09308J51633J95508K41768K89458
-5511A533156L29518L54317L51694L07819K37833J44360K5134j02675k10039k95881l43811
-5500B331425l49532l23065k75375k21246j65925j13853o9978l3615q815K511K511k138j1677
-5487G61228k8756m5924n4389n4390m5447l5909j8622j453J1483K4836L8547N1901N7027N7027
-5473G17159M7132L3778J4650j7780l9717o0701p2087q1625q2340p2802o8779n9240m1834
-5460B15814k4664j0537m814p317p318j3662j9386j5570j5570o628K910R705J5429J2657o97
-5445A30352j5004k0727k2276j6554j3096j3097j3021p299p657p655l961l960j099j099m974
$$ y = [34114, 33730, 33347, 35824, 38302, 42113, 45925, 49736, 53548, 61711, 69874, 86622, 103370, 120981, 138593, 156205, 179540, 213486, 253154, 301288, 349422, 400428, 464788, 545481, 654789, 806422, 1001930, 1243698, 1533156, 1862674, 2216991, 2568685, 2876504, 3114337, 3258697, 3283831, 3181156, 2971117, 2675236, 2331425, 1981893, 1658828, 1383453, 1162207, 996282, 882429, 812451, 778836, 770021, 772532, 775043, 772905, 761228, 732472, 686548, 632159, 577769, 532322, 496413, 477791, 476338, 487821, 512657, 551204, 603105, 660132, 717159, 764291, 798069, 812719, 794939, 755222, 694521, 622434, 540809, 458469, 385667, 316888, 257648, 215814, 191150, 180613, 175799, 168482, 161164, 147502, 128116, 112546, 96976, 90348, 93258, 102963, 118392, 131049, 130352, 115348, 94621, 72345, 55791, 42695, 29598, 16577, 9278, 1621, -6034, -9995, -13955, -15054, -16153, -21127]
-5430b1127m974j755j755L3N757K537K537J282J285J282J286N752N757N394N398K176l543
-5413G322q911q909j6244j6241j2787p060M69M73L927R654Q457K739K854k865r218r214q264
-5396f3818J278R084R087K645K649M945p75K440K444L275L279O494P75j882j877m743m740
-5379b9440p425j699K05K08l811J915N369N372J0079J0082Q528K808q251q249q253q249p120
-5362c7931j393L968L971N816N816J047J047m854m855q6q6m139m139m140m139m437m438j576
-5344e4548j576N92N97k269k266N6O0K917K921R80R84R80R83j583j580J636J639m646J077
-5325e3046O799O800J553P277l54l54n510K12J762J763j755j755J464J464l606K120K474l245
-5307c5937n992k64r84r80M18M21k802K925L338L342J192J196k772K955K593K597K831K836
$$ y = [-21127, -26101, -27856, -29611, -29578, -23821, -21284, -18747, -17465, -16180, -14898, -13612, -7860, -2103, 3291, 8689, 10865, 7322, -1589, -10498, -26742, -42983, -55770, -62830, -62361, -61888, -57961, -48307, -39850, -37111, -34257, -37122, -46340, -55554, -63818, -62540, -53456, -44369, -41724, -39075, -34130, -34905, -32465, -30021, -26746, -23467, -16973, -16198, -18080, -19957, -24700, -29440, -36865, -38564, -38359, -38151, -41962, -40047, -34678, -29306, -19227, -9145, -617, 2191, -6060, -14309, -22562, -30811, -37931, -39324, -35356, -31385, -25569, -19753, -18706, -17659, -22513, -27368, -27454, -27540, -31679, -35818, -39958, -44097, -48534, -52972, -54548, -56124, -55532, -54935, -57204, -59470, -59414, -59354, -56437, -53516, -52536, -51552, -50572, -49589, -51172, -52752, -51116, -49477, -54123, -53046, -46247, -39447, -37894, -30617, -30971, -31325, -36835, -36623, -34861, -33098, -34853, -36608, -35144, -33680, -37286, -35166, -32692, -35937, -41929, -42193, -43177, -44157, -43739, -43318, -46120, -43195, -39857, -36515, -35323, -34127, -36899, -33944, -31351, -28754, -25923, -23087]
-5289b3087K831K836m322m318m322m319m262m258j401j398k01j97l420K306J885J889K243
-5272d1515K247r47r42m166J561K452K455n775n771o274o275n916n917o691r69K489K489L740
-5254g3725L741Q510Q510J713J714j147j148j386j386o155j5693k0701j4977o394L145P317
-5238a08062J595K548K549M396M397J892J893r668l942p165p161J062J066N830N835O785O788
-5221h9362O785O788M222M225J360J363P57P60n921n916q842q837J00J05q53M873J650J655
-5203h5088p9p4k940k936R35R39j926j922K067K072K068K071P821P824J4139J4144P880K161
-5185c0844p262j2981j1844o118m333J394k20k16J38J41K87K91L148L152j502j497j502j498
-5167g1266M483M485J025m694q514q510o44o41K008l711l714K011J770J774p34p31L894L897
$$ y = [-23087, -20256, -17420, -21742, -26060, -30382, -34701, -38963, -43221, -44622, -46020, -46221, -46418, -49838, -47532, -45647, -43758, -41515, -39268, -40215, -41157, -45323, -43762, -41310, -38855, -44630, -50401, -56675, -62950, -68866, -74783, -81474, -82443, -79954, -77465, -73725, -69984, -61474, -52964, -51251, -49537, -50684, -51832, -53218, -54604, -60759, -76452, -97153, -112130, -118524, -115379, -108062, -106467, -103919, -101370, -96974, -92577, -90685, -88792, -98460, -102402, -109567, -116728, -115666, -114600, -108770, -102935, -96150, -89362, -82577, -75789, -71567, -67342, -65982, -64619, -63862, -63102, -69023, -74939, -83781, -92618, -92518, -92413, -93266, -88393, -86743, -85088, -85167, -85241, -88181, -91117, -90182, -89243, -91169, -93091, -91024, -88952, -86884, -84813, -76992, -69168, -55029, -40885, -33005, -30844, -38106, -51087, -62931, -69049, -73382, -71988, -72208, -72424, -72286, -72145, -71858, -71567, -68419, -65267, -66769, -68266, -69768, -71266, -66783, -62298, -61273, -65967, -74481, -82991, -83635, -84276, -82268, -85979, -89693, -87682, -85912, -84138, -84872, -85603, -81709, -77812]
-5149g7812L894L897J866J871J866J871K492K497l69l65j144j140L625L629L320L323l357
-5132e0036l353m430m426L39L42j754j752J107J110k708k705J52J57Q23Q27k038k034o07o04
-5113g1590o07o04J16J19J16J19j554j550j553j550q35q35q34q35O498O498j79j79J610J609
-5093f6020J610J609j78j79j79j79o26o26R0n634m858Q64K057K056K772K772J580m143l308
-5074g0520K414j163j162j412j412j412j412L178L178K820K821L312k411n510n511j635M087
-5057g1750M445j278k433L290k87k87J680J681j181j181L155L156L156L156k985k984k627
-5040f3274k626n645Q2P8n641k425k422J986J989n77n74N503k16K224K228J867J870L171L174
-5021e9228N675l860n354n350P26P31K187K190o74o71K247K250q245q241J23J23J23J22R58
$$ y = [-77812, -73918, -70021, -68155, -66284, -64418, -62547, -60055, -57558, -57927, -58292, -59436, -60576, -56951, -53322, -50002, -46679, -50036, -53389, -57819, -62245, -61906, -61564, -63318, -65070, -63963, -62853, -65561, -68266, -68114, -67957, -67134, -66307, -68345, -70379, -70986, -71590, -72197, -72801, -72685, -72566, -72450, -72331, -73885, -75435, -76988, -78538, -79373, -80208, -81042, -81877, -75379, -68881, -69060, -69239, -67629, -66020, -64410, -62801, -62979, -63158, -63337, -63516, -64142, -64768, -64678, -70312, -75170, -74306, -72249, -70193, -67421, -64649, -63069, -67212, -70520, -68106, -69269, -70431, -71843, -73255, -74667, -76079, -72901, -69723, -66903, -64082, -60770, -63181, -68691, -74202, -75837, -71750, -67305, -68583, -71016, -67726, -68013, -68300, -66620, -64939, -66120, -67301, -64146, -60990, -57834, -54678, -57663, -60647, -63274, -65900, -71545, -71463, -71385, -77026, -79451, -81873, -79887, -77898, -78475, -79049, -73546, -73762, -71538, -69310, -67443, -65573, -62402, -59228, -53553, -57413, -62767, -68117, -67391, -66660, -64473, -62283, -62957, -63628, -61381, -59131, -67376, -75617, -75494, -75371, -75248, -75126, -74168]
-5002g4168R58l812l811J315J315J315J315M773M773J911J912J263J263J263J263J442J442
-4985e4268l328l327j717j718K694K694P86m937j718j717K694K697K336K340P26m992j777
-4968f2532j774l31l28K530K533J695J699j524M203J166J170l245l241k351k348N11N14O45
-4950f1008O48k217k213j382j379N294N299M0M5m728m724M1M5M1M4J114J118M333j386l118
-4930f4093l115j926L800J777J781K135K139o67o64o66o64P94P97P94P97l796l793l797l793
-4911g2160k250k251Q50O572O990J267P4P5M307M307J445J446m933m933m337m337p533K004
-4893g3397K720l003K303K302r16r17J736J737m345J379L465L465L465L465j122o840o129
-4876g0632o125j658M068Q46Q49J025J028J025J028m65m62l328l323k582k578R94m724m728
$$ y = [-74168, -73210, -77022, -80833, -79518, -78203, -76888, -75573, -70800, -66027, -64116, -62204, -60941, -59678, -58415, -57152, -55710, -54268, -57596, -60923, -62640, -64358, -61664, -58970, -58184, -63121, -64839, -66556, -63862, -61165, -58829, -56489, -55763, -60755, -62532, -64306, -64637, -64965, -62435, -59902, -58207, -56508, -58032, -53829, -52663, -51493, -54738, -57979, -60330, -62678, -62167, -61653, -61008, -60360, -62577, -64790, -66172, -67551, -62257, -56958, -56918, -56873, -61601, -66325, -66284, -66239, -66198, -66154, -65040, -63922, -59589, -60975, -64093, -67208, -69134, -65334, -63557, -61776, -59641, -57502, -58169, -58833, -59499, -60163, -59369, -58572, -57778, -56981, -60777, -64570, -68367, -72160, -74410, -76661, -75811, -69239, -62249, -60982, -60908, -60833, -56526, -52219, -50774, -49328, -54261, -59194, -63531, -67868, -75401, -73397, -70677, -73680, -71377, -69075, -69991, -70908, -69172, -67435, -71780, -70401, -66936, -63471, -60006, -56541, -57663, -64503, -70632, -76757, -78415, -74347, -73501, -72652, -71627, -70599, -69574, -68546, -69011, -69473, -72801, -76124, -78706, -81284, -80290, -85014, -89742]
-4858h9742R99O002O006J352J357J352J356Q029Q033P672P675N55n168N55N56l201q923n704
-4840f1239n705k768k768k768k769l424l424L253L252m28m28m29m28j2j1j1j1J08J08N831
-4820g4071l707l827J897K850K850p86p86N533N533K313l409o866o867l901l901j039j040
-4803h9224N518N518j159j159L670L670Q082Q081K537l185L3L4m81m81l342l342j136j137
-4785f7503l997l998j319j319J542J543m25m24m25m25j729j729J133J133k027k027K981Q703
-4767g0312O893J170J885J885o78o78j036j035M84n238Q42Q42o014o013M24n298l431K295
-4749h3013J576J580L126L129N988N991k195k190L09L13K693l025k671k668m66m62K038K042
-4731f7905L290k429P86P90J695J699j166j163m027m024k478L249k675k671R01m817Q42Q46
$$ y = [-89742, -88743, -82741, -76735, -75383, -74026, -72674, -71318, -63289, -55256, -47584, -39909, -39354, -44522, -43967, -43411, -46612, -55535, -61239, -66944, -69712, -72480, -75248, -78017, -81441, -84865, -81612, -78360, -78788, -79216, -79645, -80073, -80085, -80096, -80107, -80118, -80010, -79902, -74071, -77778, -81605, -79708, -76858, -74008, -74794, -75580, -70047, -64514, -62201, -65610, -72476, -79343, -83244, -87145, -88184, -89224, -83706, -78188, -79347, -80506, -76836, -73166, -65084, -57003, -54466, -57651, -57618, -57584, -58065, -58546, -61888, -65230, -66366, -67503, -71500, -75498, -76817, -78136, -76594, -75051, -75476, -75900, -76325, -76750, -78479, -80208, -79075, -77942, -79969, -81996, -79015, -70312, -63419, -62249, -60364, -58479, -59157, -59835, -60871, -61906, -61422, -66660, -65818, -64976, -70990, -77003, -76579, -81877, -85308, -83013, -81437, -79857, -76731, -73602, -67614, -61623, -63818, -66008, -65699, -65386, -62693, -65718, -68389, -71057, -71523, -71985, -69947, -67905, -64615, -67044, -66258, -65468, -63773, -62074, -63240, -64403, -68430, -72454, -74932, -71683, -74358, -77029, -76128, -80945, -80103, -79257]
-4713g9257M84M88j71j68J86J90k496L230K869K873k83k80K936k783o900o897n81n78o55o52
-4693h8445M113M117q35q30L934L938R54R58R53R58k027k023Q35Q38K191K194K191K194p4
-4674f3866p1k936k932m084m079m084m080k593k589k951k947%n719k504k500L100L103N604
-4656i6128N607R389L667n515n514n931n932n931n932L58L58L219L219O557O558j20j19K586
-4638h9604K586K585K586O19O18j885j885p817k094j856L868q42q42j27j27j434M292P388
-4620h3971P392M468j252l044q763l760J968L215L58l02N425K380l338K634K638n85n81j002
-4602g6120r99j002r99j658j654m519m516J90J94J90J94J60J60J60J60L022L022J60J60J233
-4582h2462J234n444n443J889J889J889J889K954K955j815j814l007l007k649k649m124J598
$$ y = [-79257, -78773, -78285, -78456, -78624, -78438, -78248, -80744, -77514, -74645, -71772, -72055, -72335, -69399, -72182, -79082, -85979, -86560, -87138, -87793, -88445, -84332, -80215, -81050, -81880, -77946, -74008, -73054, -72096, -71143, -70185, -72212, -74235, -73400, -72562, -70371, -68177, -65986, -63792, -63866, -63937, -66873, -69805, -73889, -77968, -82052, -86132, -88725, -91314, -94265, -97212, -97212, -102931, -105435, -107935, -104835, -101732, -96128, -90521, -81132, -77465, -82980, -88494, -94425, -100357, -106288, -112220, -111862, -111504, -108285, -105066, -98509, -91951, -92071, -92190, -89604, -87018, -84433, -81847, -81228, -80610, -82495, -84380, -92197, -94291, -96147, -92279, -93121, -93963, -94090, -94217, -95651, -91359, -83971, -76579, -72111, -73363, -76407, -85170, -88930, -86962, -83747, -83389, -83691, -78266, -75886, -79224, -76590, -73952, -74537, -75118, -76120, -77119, -78121, -79120, -80778, -82432, -86951, -91467, -91277, -91083, -90893, -90699, -90539, -90379, -90219, -90059, -87037, -84015, -83855, -83695, -82462, -81228, -86672, -92115, -90226, -88337, -86448, -84559, -81605, -78650, -80465, -82279, -85286, -88293, -90942, -93591, -97715, -96117]
-4565i6117J241J241J956J956J956J956K153K154p08p08j364j363L405L406l689l689K810
-4548h3404K809J140j721l510K213L331M69J364j498m776j915k452M10K332K333l50l51K46
-4530h3330K46k615k616L424L424N63N62j404j405L364L365K232K231K232K232L84L83L84
-4512f6344L84l327l327l327l328m161m162O07O08k28k27K634K634k135k135J442m281j520
-4494i0193M207M47M51O26k232l845J881K951K955L308L313k653k649K08K13j677j673J185
-4476h3177J189P67P71P68P71M583M586J722J725M09M14k452k447J307J308J308J308l402
-4458f8542l402l401l402l670l670n637k776L484k239l611l610J442J442j420j419L469L468
-4441i3494j300j300J60J60L022L021P57P56k642L082K693j67K157K157o44N078P940K216
$$ y = [-96117, -94876, -93635, -91679, -89723, -87767, -85811, -83658, -81504, -82212, -82920, -84284, -85647, -82242, -78836, -82525, -86214, -83404, -80595, -79455, -81176, -84686, -82473, -79142, -78673, -77309, -78807, -83583, -85498, -87950, -87540, -85208, -82875, -83225, -83576, -83330, -83084, -85699, -88315, -84891, -81467, -80904, -80342, -81746, -83151, -79787, -76422, -74190, -71959, -69727, -67495, -67111, -66728, -66344, -65960, -69287, -72614, -75941, -79269, -83430, -87592, -86985, -86377, -86605, -86832, -84198, -81564, -83699, -85834, -84392, -88673, -90193, -85986, -85539, -85088, -84462, -86694, -90539, -88658, -85707, -82752, -79444, -76131, -78784, -81433, -81225, -81012, -82689, -84362, -83177, -81988, -81221, -80450, -79682, -78911, -74328, -69742, -68020, -66295, -65886, -65472, -67924, -70371, -69064, -67756, -66448, -65140, -68542, -71944, -75345, -78747, -82417, -86087, -91724, -94500, -91016, -93255, -96866, -100476, -99034, -97592, -99012, -100431, -96962, -93494, -94794, -96094, -95934, -95774, -92752, -89731, -88974, -88218, -90860, -87778, -85085, -85252, -83095, -80938, -81582, -76504, -68564, -66348]
-4423f6348j449j449M869M870j032j032n443n444m564J159J516m206k001L722l3l4j68l029
-4405h0096m817R05J859j002J1n711l033O505P459P459j12j11j12j12K765K764n820n819j707
-4386g8725j706j707j706k757k757k400k399M62O185M575J714L562L562N21N22j565j565m784
-4368h0968R39J155J159J513J516K824K828l852l849l882l879j021j017O371O375l05l02J587
-4350g2808J591l182l178l957l953k407L320Q57Q60k004L722N59N62J275m445k068k064k780
-4332i0100K944m55m54k959k958N11N14N14N14J230J229j632j632l91l87l88l87R83R84k236
-4312i4556L488L334L339L338L338L816j908j550j550k399k400M62M62k220k221O41O41J237
-4294h4708J237J237J237M4M5M5M4p30p30l592l591o71o71K191K191K548K549l13l13j625
$$ y = [-66348, -67797, -69246, -64377, -59507, -60539, -61571, -67014, -72458, -77022, -75863, -74347, -78553, -80554, -76832, -76865, -76899, -77067, -80096, -84913, -84008, -82149, -83151, -83140, -88851, -91884, -85379, -77920, -70461, -70573, -70684, -70796, -70908, -68143, -65379, -71199, -77018, -78725, -80431, -82138, -83844, -86601, -89358, -91758, -94157, -93695, -87510, -82935, -81221, -77659, -74097, -73576, -73054, -74619, -76184, -80968, -80029, -78874, -77715, -76202, -74686, -71862, -69034, -72886, -76735, -80617, -84496, -85517, -86534, -80163, -73788, -74093, -74395, -72808, -71217, -74399, -77577, -81534, -85487, -87894, -84574, -83717, -82857, -84861, -81139, -80580, -80018, -78743, -83188, -85256, -87320, -90100, -87156, -87611, -88065, -91024, -93982, -93471, -92957, -92443, -91929, -90699, -89470, -91102, -92734, -93125, -93512, -93900, -94287, -93304, -92320, -94556, -91068, -87734, -84395, -81057, -77719, -73903, -75811, -77361, -78911, -81310, -83710, -83248, -82786, -85006, -87227, -86586, -85945, -84708, -83471, -82234, -80997, -80953, -80908, -80863, -80819, -81549, -82279, -85871, -89462, -90133, -90804, -88613, -86422, -83874, -81325, -81638, -81951, -83576]
-4274h3576j624j267j267l118K608K604l115L261L263M5M5j062j058j062j058m9m4m5m5J099
-4254h5465J103J457J461m565J163J162m560k433k429l149K579L09L13O71O70j986j982M691
-4236i0990M694K188K190K545l174R94R99O37O41j449j446J412J416M445M448l901J826J047
-4218g1478m672j099j096o747o744p1o7J360J364J360J363o22o22n391n391J166J166J166
-4200i5055J166j993j993K775K776m43m44l304l305O29O30M207j517k053L670M505M504L610
-4182h1635k112l663l662n510n511J166J166K214K216K214K216QJ1PJ2k854k851k496k492
-4163a01556PN734m165m162J811J814O580O583M017M020p53p49j065j062j066j061l272l267
-4145i1612m10m06K947K947j822j822J457J457j405j404k28k27k27k28M89M88k374k373K828
$$ y = [-83576, -85200, -86467, -87734, -90852, -88244, -85640, -88755, -85494, -82231, -82186, -82141, -83203, -84261, -85323, -86381, -86430, -86474, -86519, -86564, -85465, -84362, -82905, -81444, -86009, -84846, -83684, -88244, -90677, -93106, -96255, -93676, -93367, -93054, -92383, -91713, -93699, -95681, -90990, -86296, -84108, -81918, -79373, -82547, -81553, -80554, -79917, -79276, -80725, -82171, -80759, -79343, -74898, -70450, -74351, -72525, -71478, -76150, -77249, -78345, -85092, -91836, -91907, -91974, -90614, -89250, -87890, -86527, -87149, -87771, -93162, -98553, -97387, -96221, -95055, -93889, -95882, -97875, -95100, -92324, -92767, -93211, -96515, -99820, -99191, -98561, -94354, -95871, -97924, -94254, -89749, -85245, -81635, -83747, -87410, -91072, -96582, -102093, -100927, -99761, -97547, -95331, -93117, -90901, -90893, -90882, -90875, -90863, -93717, -96568, -99064, -101556, -101549, -95815, -99980, -104142, -102331, -100517, -93937, -87354, -83337, -79317, -80070, -80819, -81884, -82946, -84012, -85073, -88345, -91612, -92022, -92428, -89481, -86534, -88356, -90178, -88721, -87264, -88669, -90073, -90301, -90528, -90755, -90983, -90494, -90006, -92380, -94753, -91925]
-4126i1925K828K828K827K888K887j881j882K128K127k641k642k940k939J829J829J536J535
-4109h1608J535J535k54k53l830J892M099j625o035l13k102k101j744j743K406K407m54m55
-4091h8643K765K764r7r6K839K839K839K839K362K362Q12m910J662J665J304J308l644l640
-4073g2670p83p78l80l77o699o695m672J054O93O97K783K787p8p5J01J04K962K966l491l487
-4053h6038l492l487L84L87L246L248J971J975q90q87k381k377M81M84J643J647J643J647
-4035h0796J404J409l365l360j092j088m311J416j38j34L081L085J204J207J203J208K336
-4018g6731K339P87m933l577l573Q34Q39J79J82J79J82k9k6m799m795N06N11Q64Q68k030L696
-3997h8527M73M77j315j312j315j312K620K623K619K623J725J729l044l041n5n3n6n2k738
$$ y = [-91925, -89097, -86269, -83442, -80554, -77667, -79548, -81430, -79302, -77175, -79816, -82458, -85398, -88337, -86508, -84679, -83143, -81608, -80073, -78538, -78792, -79045, -82875, -80983, -76884, -78509, -84544, -84857, -86959, -89060, -90804, -92547, -90141, -87734, -88188, -88643, -85878, -83114, -83211, -83307, -80468, -77629, -74790, -71951, -69589, -67227, -66415, -71325, -69663, -67998, -66694, -65386, -69030, -72670, -73453, -74231, -74611, -74988, -81687, -88382, -93054, -92000, -91307, -90610, -87827, -85040, -85118, -85193, -85092, -84988, -82026, -79060, -82551, -86038, -89530, -93017, -92633, -92246, -89000, -85752, -83781, -81806, -82696, -83583, -85964, -88341, -87860, -87376, -85733, -84086, -82443, -80796, -79392, -77983, -81348, -84708, -85800, -86888, -91199, -89783, -89921, -90055, -86974, -83889, -82685, -81478, -80275, -79067, -76731, -74392, -73605, -78538, -82115, -85688, -84854, -84015, -83836, -83654, -83475, -83293, -83322, -83348, -88147, -92942, -92436, -91925, -91061, -90193, -92223, -88527, -88054, -87577, -88892, -90204, -91519, -92831, -90211, -87588, -84969, -82346, -80621, -78892, -81936, -84977, -85032, -85085, -85141, -85193, -87931]
-3978h7931k735n600n596k053k049O174O177L551k169j814j811K739K742k031k027J666J669
-3961i1098l104l100o89o85K172K176K053K056N03n216k552k549m8m5L052L055L051L055q68
-3942h8781q64q68q65q68q64q68q65O00O04O00O03K567K571K567K571j129j125p71o491J23
-3922i1553J27J23n596n224n223L003L003K2K2M792M791K571K571j841j840n59N164N14N14
-3903h4619p38p37p38p38J021J021J021J021J319J319l093l092m046J676J319J319J107J106
-3885h4552P49P49k65n987R3R3k947k947J822J822J941J941J941J942j2j1j1j1J717J718J360
-3864g8855J360L565k157n615n614J08J08J08J08J825J830k944k939q57q53K004K008n2m8
-3845h6910r47l804k079L648M657M661k09n927J49J53N36N40N37N40K38K43j193j188m084
$$ y = [-87931, -90666, -96266, -101862, -103915, -105964, -99790, -93613, -90062, -92231, -94045, -95856, -93117, -90375, -92406, -94433, -92767, -91098, -94202, -97302, -97991, -98676, -96504, -94328, -92275, -90219, -89716, -94932, -97484, -100033, -100081, -100126, -97074, -94019, -90968, -87913, -88781, -89645, -90513, -91378, -92246, -93110, -93978, -94843, -94243, -93639, -93039, -92436, -89869, -87298, -84731, -82160, -83289, -84414, -85185, -91676, -91553, -91426, -91303, -96899, -102123, -107346, -104343, -101340, -101318, -101296, -96504, -91713, -89142, -86571, -88412, -90252, -90811, -85647, -85133, -84619, -85357, -86094, -86832, -87570, -86549, -85528, -84507, -83486, -82167, -80848, -83941, -87033, -91079, -89403, -88084, -86765, -85658, -84552, -83803, -83054, -83319, -89306, -89213, -89120, -92067, -95014, -93192, -91370, -89429, -87488, -85547, -83605, -83617, -83628, -83639, -83650, -81933, -80215, -78855, -77495, -73930, -76087, -81702, -87316, -87208, -87100, -86992, -86884, -85059, -83229, -86173, -89112, -89969, -90822, -88818, -86810, -86862, -86910, -87857, -91661, -93740, -90092, -85435, -80774, -80983, -86910, -86761, -86608, -86072, -85532, -84995, -84455, -84217, -83974, -85167, -86355, -90439]
-3826i0439m079O85O89K210K213k560k556K091K094K090K094p12p08p12p07k858k854MPk142
-3806i6150k139P19P23P79P82P79P82J614J617j249j244k560k556l811r46o04N123M046J189
-3787i3106L420R147N924K05j707m564j885j882l35l31l36l31j304j301J27J30K064K068p97
-3768h4794p94l167l163L510L513J364J367j438m296o52N075J494J498M415J557L700k019
-3751g2830m214j349l320l316m88m84K373K377j404j401k836k831k776k772J993J997J75J79
-3733i0927J606J610K768K772K768K772M03M06M4M9r69o688r68r65J743l975p60p57k23k20
-3713h9511k23k20J818J822J818J822J103J106j758j755M02M06k459k455j028j025j028j025
-3695i2190O45O44O45O45j442j442j442j442L849L848k827k828J047J047j815j814m259m259
$$ y = [-90439, -94518, -93833, -93144, -90934, -88721, -91281, -93837, -91746, -89652, -87562, -85468, -86180, -86888, -87600, -88307, -91165, -94019, -94015, -94008, -96150, -98289, -97570, -96847, -96068, -95286, -94507, -93725, -92111, -90494, -91743, -92987, -95547, -98103, -101914, -102860, -103464, -98341, -94295, -93106, -89686, -80539, -74615, -74410, -76117, -80681, -82566, -84448, -84783, -85114, -85450, -85781, -87085, -88386, -88259, -88129, -86065, -83997, -84794, -85588, -88755, -91918, -88408, -84895, -83531, -82164, -83602, -87898, -88550, -83475, -81981, -80483, -76068, -74511, -70811, -72830, -77044, -78393, -81713, -85029, -85517, -86001, -83628, -81251, -82655, -84056, -86892, -89723, -92499, -95271, -93278, -91281, -91106, -90927, -89321, -87711, -84943, -82171, -79403, -76631, -76228, -75822, -75778, -75729, -76698, -83386, -84354, -85319, -83576, -87551, -88311, -89068, -89291, -89511, -89734, -89954, -88136, -86314, -84496, -82674, -81571, -80465, -82223, -83978, -83576, -83170, -85629, -88084, -89112, -90137, -91165, -92190, -91545, -90901, -90256, -89611, -91053, -92495, -93937, -95379, -91530, -87682, -90509, -93337, -92290, -91243, -93058, -94872, -99131, -103390]
-3677a03390j397j397O412O412O412O413j353j352m214m214k783k783k784k783M400M404J539
-3660i2458J542l09l05K910k810k023k019k381k377J852J855N071o48l700l696R50O677P746
-3642h4123K026j434j431J517m203o30o26k000L725L007L011k87o010P1P1J680J680J681J680
-3623h0595n55n55l417l416m36m36m36m36k381k381M81M81k35k35n92N130M9M8M06M06M06
-3602h8699M06L626k098m683m680k180k175K649K652K649K653K217K221K217K220l267l264
-3585h7536l268l264r27r24r28r24k120k116K649K653J993J997q68q65r27r24r28r24k888
-3566a01039k887l245K477L253L253Q08k053MN727N547j75O60O59k559k560M88M88M88M88
-3547i0178K813K813Q46L707M840q83l685q23m699j836J501J502n403n398J274J278J870J874
$$ y = [-103390, -104787, -106184, -99772, -93360, -86948, -80535, -81888, -83240, -87454, -91668, -94451, -97234, -100018, -102801, -98401, -93997, -92458, -90916, -91225, -91530, -88620, -91430, -93453, -95472, -97853, -100230, -98378, -96523, -91452, -92100, -95800, -99496, -98546, -91869, -84123, -82097, -83531, -84962, -83445, -87648, -88278, -88904, -90904, -87179, -84172, -81161, -81448, -87458, -87387, -87316, -85636, -83956, -82275, -80595, -81150, -81705, -85122, -88538, -88974, -89410, -89846, -90282, -92663, -95044, -94563, -94082, -94317, -94552, -95144, -90014, -89965, -89917, -89511, -89105, -88699, -88293, -84667, -86765, -91448, -96128, -98308, -100483, -97834, -95182, -92533, -89880, -87663, -85442, -83225, -81005, -84272, -87536, -90804, -94068, -94995, -95919, -96847, -97771, -99891, -102007, -99358, -96705, -94712, -92715, -93583, -94448, -95375, -96299, -97227, -98151, -101039, -103926, -107171, -104694, -101441, -98188, -97380, -99433, -99429, -93702, -88155, -88330, -87670, -87011, -89570, -92130, -91642, -91154, -90666, -90178, -87365, -84552, -83706, -79999, -75159, -76042, -79727, -80550, -85249, -87085, -85584, -84082, -89485, -94883, -93609, -92331, -90461, -88587]
-3529h8587J870J875N14N18N14N18J468J471R7n622l7K828k005k001n14n10n14n11j453j449
-3509i1530j453j450R91R95R91R95L916L919J055J058K604K608k57k53k850k847k671k668
-3491h6847J978M844L767j953m988k124q76q71k962K764K940k780k157P08P04k153n079O49
-3473i4436K015K020j137j132j137j132j554j550J308J311Q91Q94L752L755m653m650j196
-3456i6631M531J781J784K139K142l65l61qlm986P42L80L84o34o29L778L781L156k567k209
-3436h3795k210m475m474K94K94N004N004j673j673m057m058j196j196k131k131k489L234
-3419a01728L592L592J087J088J059J058j446j446l13N410K191K191k2j9k884k880K303K306
-3401h4861K302K307j014j009m591J137K206l514l159K567N73N78R31R36L94L99L95L99j178
$$ y = [-88587, -86717, -84842, -84328, -83810, -83296, -82778, -81310, -79839, -79742, -85364, -85401, -82573, -84578, -86579, -87093, -87603, -88117, -88628, -90081, -91530, -92983, -94433, -93442, -92447, -91456, -90461, -86545, -82626, -81571, -80513, -77909, -75301, -75558, -75811, -78661, -81508, -84179, -86847, -84869, -80025, -76258, -78211, -83199, -85323, -86199, -87070, -90032, -87268, -84328, -87108, -89265, -88557, -87853, -90006, -95085, -94436, -92421, -90401, -91538, -92670, -93807, -94939, -96493, -98043, -96735, -95424, -94533, -93639, -89887, -86132, -90785, -95435, -96631, -92100, -90319, -88535, -86396, -84254, -84619, -84980, -84988, -84991, -89977, -89235, -88855, -88471, -89105, -89734, -85956, -82175, -79019, -81586, -83795, -86005, -90480, -94954, -94660, -94366, -89362, -84358, -86031, -87704, -91761, -95819, -97015, -98211, -100342, -102473, -104962, -101728, -98136, -94544, -93457, -92369, -91310, -90252, -91698, -93144, -93457, -88047, -85856, -83665, -83687, -83706, -86590, -89470, -87167, -84861, -82559, -80252, -81266, -82275, -86866, -85729, -83523, -87037, -90196, -87629, -87056, -86478, -85547, -84611, -84217, -83818, -83423, -83024, -84202]
-3382h4202j173q20o539k310k306J94J97K597K601k65k61K359K362k411k406k441k437K329
-3364i4932K332J554J557J554J558K820K824l856l853O15O19k247k243k664k660J747J751
-3347i3524K404l316o182m54L349L350L707L707J561J562J561J561K552K552k217k217j680
-3330h1724j680j859j860L77k485m274J449L953J092l260l260k135L588O449P27J859J859
-3313h1184K396N257K940k783j889j889l141K582K582l141l193l193l909J815l91l91l4l4
-3295h7600o74o74o75o74J293J293j569j568N40N40Q98Q98J673P395K627l096l458l453r50
-3276h7234r50m18m13m14m13K68K72k590k589J818J822J285P009L643P87J143M006R605R609
-3257e3754N018N019n715n712n891n890l331o188l387K336Q31m892k925o3K321K321k269k269
$$ y = [-84202, -85375, -86195, -92734, -95044, -97350, -97156, -96959, -94362, -91761, -92026, -92287, -89928, -87566, -89977, -92383, -94824, -97261, -94932, -92600, -91046, -89489, -87935, -86377, -83557, -80733, -84589, -88442, -87827, -87208, -89455, -91698, -94362, -97022, -95275, -93524, -91120, -94436, -100618, -101072, -97723, -94373, -90666, -86959, -85398, -83836, -82275, -80714, -78162, -75610, -77827, -80044, -81724, -83404, -85263, -87123, -86746, -89231, -93505, -92056, -88103, -87011, -90271, -93531, -95666, -92078, -85629, -84902, -83043, -81184, -78788, -73531, -70591, -73374, -75263, -77152, -80293, -77711, -75129, -78270, -81463, -84656, -88565, -86750, -87141, -87532, -87566, -87600, -88274, -88948, -89623, -90297, -89004, -87711, -89280, -90848, -90308, -89768, -88870, -87972, -86299, -78904, -76277, -79373, -82831, -86284, -87234, -88184, -88602, -89015, -89429, -89842, -89574, -89302, -91892, -94481, -92663, -90841, -89556, -82547, -78904, -78117, -76974, -72968, -63363, -53754, -48736, -43717, -49432, -55144, -61035, -66925, -70256, -76444, -79831, -77495, -76664, -81556, -84481, -84544, -82223, -79902, -82171, -84440]
-3239h4440L84L83L246L245O22O22k239k239n85n85l446l447J263J263j240j241k217L506
-3221h7145L864j860n614J08L208L208l272l271m10m06K631K630K630K635K086K086M948M952
-3203f6992j312j311m173m169k616k615K46K49k436k437M25M28k317k318k317k314J796J796
-3185i2387j066j062J46J45L007L006j106j107p49p48l02N421K559l163j077j076p19o442
-3167i6720n488K34m80m81L752L752Q90Q91J15J16J15J16L811L812r58r57j122j121j122j121
-3147i1966J680J680J681J680K008K009J650J651k344q066p8p9q53q53q53q54j091j092m311
-3128i8401J412j434j434L692L692J75J75k686k686o34o29r91M735o33o30K943k775J214J219
-3109i3676Q57Q60Q57Q61M99N03M99n219n224N03O78O82J036J039l58l54K862K865j788L938
$$ y = [-84440, -84056, -83673, -80427, -77182, -76560, -75938, -78177, -80416, -81001, -81586, -85032, -88479, -87216, -85953, -87193, -88434, -90651, -87145, -83281, -85141, -90755, -90647, -87439, -84231, -87503, -90774, -91184, -91590, -88959, -86329, -83699, -81064, -78978, -76892, -71944, -66992, -68304, -69615, -73788, -77957, -80573, -83188, -82942, -82693, -85129, -87566, -87141, -86713, -89030, -91348, -93665, -95979, -94183, -92387, -93453, -94515, -94369, -94224, -91217, -88211, -89317, -90424, -91173, -91921, -92223, -86802, -84243, -87406, -88483, -89559, -90278, -96720, -102208, -101974, -102454, -102935, -99183, -95431, -94541, -93650, -93535, -93419, -93304, -93188, -89377, -85565, -86523, -87480, -88602, -89723, -90845, -91966, -90286, -88606, -86925, -85245, -83237, -81228, -79578, -77927, -80271, -88337, -88415, -88494, -89347, -90200, -91053, -91907, -92998, -94090, -98401, -96989, -98423, -99857, -96165, -92473, -92298, -92123, -94809, -97495, -98129, -98758, -99749, -95014, -95647, -96277, -93334, -96109, -94895, -93676, -92819, -91959, -91102, -90241, -89742, -89239, -88740, -93959, -99183, -98680, -98002, -97320, -96284, -95245, -95603, -95957, -93095, -90230, -92018, -88080]
-3089h8080O796J076k75k72k76k72p250j524J930J933l487l484o25o23K057K060K057K060
-3071h6199J319J323J677m043n656n652O63O67m702m698J975J978n29n25P459J740K187K187
-3053h8829j032j032N18N18k344k343k448k448M13M14j196j196j196j196m58m59K404K403
-3035i9507K463K462M96L357K895k828n511K13L849L848k470k470J330J334l439l435J449
-3018i5964J453j408j409K791K794p0o7N25N29k332k333j926j923R36R39O37O40O41O41L111
-2998i1795L115j718J148L528k191l263m03Q94Q95J073J073n96n97m17m17j550J311N962K38
-2979h3710k682J78j788j788n18n18K880k843l498o37N860K999o66K194K016q46j263j263
-2961h5893j442j442M9N2M8N2j918j916K497K496J986l733k485L80M787r31l614K109m62m59
$$ y = [-88080, -81284, -80208, -80483, -80755, -81031, -81303, -88553, -90077, -88147, -86214, -89701, -93185, -93810, -94433, -92376, -90316, -88259, -86199, -84880, -83557, -81880, -85923, -91579, -97231, -96568, -95901, -100603, -105301, -103326, -101348, -101877, -102402, -94943, -93203, -91016, -88829, -89861, -90893, -90375, -89857, -92201, -94544, -96992, -99440, -99027, -98613, -99809, -101005, -102201, -103397, -103855, -104314, -101910, -99507, -97044, -94582, -94086, -90729, -87834, -90662, -96173, -95960, -92111, -88263, -90733, -93203, -91873, -90539, -93978, -97413, -95964, -94511, -95919, -97328, -94537, -91743, -91813, -91880, -91355, -90826, -93158, -95491, -97417, -99340, -98404, -97465, -96828, -96188, -95547, -94906, -91795, -88680, -90398, -89250, -85722, -87913, -91176, -91579, -90685, -89790, -88717, -87644, -88240, -88837, -89254, -89671, -91221, -89910, -83948, -83710, -86392, -86214, -88002, -89790, -90308, -90826, -87946, -90789, -94287, -94924, -89064, -86065, -86731, -84537, -82521, -83367, -84630, -85893, -87335, -88777, -88728, -88676, -88628, -88576, -90494, -92410, -89913, -87417, -85431, -89164, -91649, -91269, -86482, -87413, -91027, -88918, -89380, -89839]
-2941h9839K757K761M903M907l677l678l859l857R09R13J446J449J450J449qlm777m773p22
-2922i2249p19k690J75N313m06k31N495l033l029L644L648J240m478j263j259o67o64o67o63
-2903i2503m184m180M400M404m29m24m29m24K116K116J759J762n07o229k653k649l219K503
-2885i8770p15p11J073J073j789j784J233J233j628j625M453M452l17l13j553j554M467J610
-2867i1165L096k627m236j371J114j747j927R36M810r13K485K485R95R95J173J174K187N048
-2849g7488L797j926m430m430j927j926o15o14J352j509m95N227O300L439j866j867M58M59
-2831g8061j5n734k161k158j386M341M337j382P00P04L43L46J953J956R98m720k199P344J617
-2812g3177J621k318k313N44N47l167l163k809k806k809K917N775N6j047j047J815l909n10
$$ y = [-89839, -87082, -84321, -79418, -74511, -78188, -81866, -85725, -89582, -88673, -87760, -86314, -84865, -83415, -81966, -81974, -81977, -86754, -91527, -92249, -92968, -95658, -95483, -90170, -90576, -90807, -85312, -88345, -91374, -87730, -84082, -82842, -87320, -88583, -89842, -90509, -91173, -91840, -92503, -96687, -100867, -96467, -92063, -92492, -92916, -93345, -93769, -91653, -89537, -87778, -86016, -86523, -92752, -95405, -98054, -101273, -98770, -99485, -100196, -99123, -98050, -99839, -101623, -100390, -99157, -100785, -102410, -97957, -93505, -93822, -94135, -95688, -97242, -92775, -91165, -88069, -90696, -94932, -96303, -95189, -96936, -98863, -97927, -93117, -94030, -91545, -89060, -88065, -87070, -85897, -84723, -82536, -77488, -73691, -75617, -80047, -84477, -86404, -88330, -88945, -89559, -88207, -89716, -90211, -84984, -78684, -75245, -77111, -78978, -78520, -78061, -78076, -83810, -85971, -88129, -89515, -85174, -80837, -82219, -81519, -80815, -80472, -80126, -78173, -76217, -75219, -79939, -82138, -74794, -73177, -71556, -73874, -76187, -75643, -75096, -78263, -81426, -84235, -87041, -89850, -86933, -81158, -81102, -82149, -83196, -81381, -85290, -85800]
-2794h5800n10j226j226J889l834o15o14N942N943J174J173r87r87J874J874Q60Q61k001k001
-2775g8211j151j151m728R95O37n086j509j509L145L148K83K87L860L864L860L863r24r20
-2757g1247l785l782r84r80r83r80k61k57k61k57j632j628j632j628j736j733j86N540K914
-2738h5498K917M10M14J60J60l059K664N18N18J233m490n10n10q69q68k537k537k537k538
-2719i6959J368J367l402l401K857K858K858K857L99L99M1M1M512j211m073J651j53j49L424
-2700h4716k295R20R24k656L070N03N07k001j997k001j997Q61Q64j226j222j226j222l014
-2682i7924l010J755J758R95R99R94R99J293J296R35R39K098l625l625K097L09L10k195k194
-2663i5796k254k255K50K50L826j896J322J323J725J725J725J725m832m833n190N33O82O82
$$ y = [-85800, -86310, -87536, -88762, -86873, -90707, -91322, -91936, -85994, -80051, -78877, -77704, -78691, -79678, -77804, -75930, -75070, -74209, -76210, -78211, -79362, -80513, -85241, -84246, -83609, -88695, -90204, -91713, -88568, -85420, -85137, -84850, -80990, -77126, -73266, -69403, -70327, -71247, -75032, -78814, -79798, -80778, -81761, -82741, -83002, -83259, -83520, -83777, -85409, -87037, -88669, -90297, -92033, -93766, -93952, -88412, -85498, -82581, -82171, -81757, -81597, -81437, -84496, -81832, -81314, -80796, -79563, -84053, -84563, -85073, -85942, -86810, -89347, -91884, -94421, -96959, -95591, -94224, -97626, -101027, -98170, -95312, -92454, -89597, -89198, -88799, -88758, -88717, -84205, -85416, -89489, -87838, -87991, -88140, -84716, -87011, -86091, -85167, -87823, -84753, -84250, -83743, -85744, -87741, -89742, -91739, -90878, -90014, -91240, -92462, -93688, -94910, -97924, -100934, -99179, -97421, -96426, -95427, -94433, -93434, -92141, -90845, -89910, -88971, -86873, -90498, -94123, -92026, -91717, -91407, -93602, -95796, -98050, -100305, -100055, -99805, -95979, -97875, -96553, -95230, -93505, -91780, -90055, -88330, -93162, -97995, -103185, -102652, -101970, -101288]
-2645a01288L901L901K231K232o29o30M1M5k821k817k57k53k57k53j018j013N659N664J009
-2626h6553J014l760l755J23J27J22J27K686K690k082k079l827l822r65r62j30j27K731K735
-2607i5707k630k631K139K138J72J71J72J71L897L897J036J036m55m54m55m54J289J289R31
-2588h4448R32J349m374j155j155m106m106O63O63K035K034K034K034n17n15n17n15k783k779
-2569i5226J986J989J628J632l141l137l319l316N264N268L92L95L91L95l424l421J345J349
-2551i2950K150K154J553J558N249m284o912j185P08P12J065J070j87j82m955m952l972l968
-2533a07328K705K709K049K053k720k716O19O22O18O22Q57Q61L718L722k958k954k959k954
-2515a03434N208N213j468j464j081j080J781J781j021j021j021j021k556k556M121M121M419
$$ y = [-101288, -97387, -93486, -91255, -89023, -89652, -90282, -90241, -90196, -93017, -95834, -96091, -96344, -96601, -96854, -97872, -98885, -93226, -87562, -86553, -85539, -89299, -93054, -92931, -92804, -92682, -92555, -89869, -87179, -89261, -91340, -95167, -98989, -99954, -100916, -101046, -101173, -98442, -95707, -98337, -100968, -98829, -96691, -96519, -96348, -96176, -96005, -92108, -88211, -87175, -86139, -86594, -87048, -87503, -87957, -86668, -85379, -84448, -83516, -82167, -86541, -87696, -88851, -92957, -97063, -96400, -95737, -93702, -91668, -89634, -87600, -88117, -88632, -89149, -89664, -92447, -95226, -93240, -91251, -89623, -87991, -91132, -94269, -97588, -100904, -95640, -90372, -89980, -89585, -89194, -88799, -92223, -95644, -94299, -92950, -90800, -88646, -87093, -85535, -80286, -84570, -91482, -92667, -91959, -91247, -90182, -89112, -89299, -89481, -94436, -99388, -103360, -107328, -104623, -101914, -99865, -97812, -100532, -103248, -102629, -102007, -101389, -100767, -99910, -99049, -95331, -91609, -94567, -97521, -100480, -103434, -98226, -93013, -94481, -95945, -97026, -98106, -96325, -94544, -95565, -96586, -97607, -98628, -101184, -103740, -99619, -95498, -91079]
-2498i1079M418k257k258k832k832J938J937J163J162j699j699j743j744j744j743r10r09
-2481a02831J953J952M1M5M1M4O38O40O37O41K530K534k240k235M020M024k657k652K000K005
-2461h8870q61q57O30O33O30O33L417L420l260l256j01r7K404K406L678k042j688j684k761
-2442h7626k757J01J04l327l323J442J445J084J088J084J088j166j162j166j163Q01Q05Q01
-2424i1847Q05O67O70k194k191K217K221o45o41M5M5L263k459M03M02M5M5O85O86k176k176
-2403i2130J49J49J49J49M02M03M02M03m844m844j743L979L219k504j788j788j550j550J311
-2384a02026J312m47m48N634r0p45p45j460M262R09R09J267J267P30P30P30P31J561J561J561
-2364h2797J561l625l625l268l267K276P999J562J561R05m817m103m102n872j49L309L308
$$ y = [-91079, -86661, -88918, -91176, -94008, -96840, -94902, -92965, -91802, -90640, -92339, -94038, -95781, -97525, -99269, -101012, -101922, -102831, -100878, -98926, -98885, -98840, -98799, -98755, -98117, -97477, -96840, -96199, -93669, -91135, -93375, -95610, -91590, -87566, -90223, -92875, -90875, -88870, -89731, -90588, -89958, -89325, -88695, -88062, -84645, -81225, -84485, -87741, -87842, -87939, -85535, -83129, -79451, -81493, -83181, -84865, -87626, -90383, -90282, -90178, -93505, -96828, -95386, -93941, -92857, -91769, -90685, -89597, -90763, -91925, -93091, -94254, -93453, -92648, -91847, -91042, -90375, -89705, -91899, -94090, -91873, -89652, -90297, -90938, -90893, -90848, -87585, -90044, -89641, -89239, -89194, -89149, -88464, -87778, -89954, -92130, -91981, -91832, -91683, -91534, -91132, -90729, -90327, -89924, -94768, -99612, -101355, -97376, -94157, -96661, -98449, -100237, -101787, -103337, -102026, -100714, -101161, -101609, -95975, -96065, -96810, -97555, -99015, -94753, -93844, -92935, -91668, -90401, -89671, -88941, -88211, -87480, -85919, -84358, -82797, -81236, -84861, -88486, -91754, -95021, -92745, -84746, -83184, -81623, -80718, -85535, -89638, -93740, -99612, -99761, -96452, -93144]
-2347i3144M561M560k08k09l58l57l58l58p15p15M053M054k023k023k023k024Q98Q98Q98Q98
-2327h3695j337j338K239l483n392L32L431L432Q05Q08l606l603n693L3J222J226L204k515
-2309i3930k518L208K786K791j982j978o71o390l532K195M575M579j744j740m530m527M054
-2292i9354M057j192j189%N727M944p79j971j971k567k567K94K95K202K202m475m475j851
-2274a02670j852O136M14o055o054K172K172P359P358O82O82l02l02l02l01j614j613J248
-2256i2842J248m4m1L13L16j237M490R09R13k817q536l770J956Q20Q23l592l588M207M210
-2237i6262J345J349j696j691j695j692K13K16p776k049L193L196L551L555K216K221m221
-2220i6027J505K455l264k909K816L275L279j136j133k508k503L54L57j076j073J784J789
$$ y = [-93144, -88583, -84023, -84231, -84440, -84798, -85155, -85513, -85871, -86586, -87301, -83248, -79194, -81217, -83240, -85263, -87287, -86389, -85491, -84593, -83695, -85032, -86370, -84131, -87614, -93006, -92674, -89243, -85811, -85006, -84198, -87804, -91407, -97100, -97067, -95845, -94619, -91415, -93930, -96448, -93240, -90454, -87663, -89645, -91623, -92294, -98684, -102216, -100021, -95446, -90867, -92611, -94351, -98881, -103408, -99354, -95297, -96489, -97678, -97678, -91951, -87007, -87786, -89757, -91728, -94295, -96862, -96568, -96273, -94071, -91869, -96344, -100819, -102670, -104522, -98386, -97972, -104027, -110081, -107909, -105737, -98378, -91020, -90338, -89656, -89958, -90260, -90562, -90863, -92477, -94090, -92842, -91594, -91638, -91679, -91366, -91050, -92287, -87797, -86888, -85975, -88792, -97328, -101098, -99142, -98322, -97499, -101091, -104679, -100472, -96262, -94917, -93568, -95264, -96955, -98650, -100342, -100129, -99913, -107689, -109738, -106545, -103349, -99798, -96243, -94027, -91806, -96027, -94522, -92067, -95331, -98240, -95424, -92149, -88870, -90006, -91139, -93647, -96150, -95796, -95439, -96515, -97588, -95804, -94015]
-2203i4015n846n842M646M650R94R99l774l771k224k221K903K906P45O472K056l662l130K597
-2185i5517J878J881K09K12L428k291q65q60j222j219j494j490J367J371K739K742L096k623
-2167h8658K277K280j181o900k612L115K395K400j990j986Q72Q76l80l77l80l76l048l044
-2149i6717j86j82K257K262K258K261L39L43L39L43j509j505j509j505M1M4P57m963m967P60
-2129a01039L499L502K076l644p86p83K612l107n973k46L238L241J092J095l39N388N384l36
-2111h5126k094k090k451k448l06l01K555K560O63O67l748l744l272K456K094K097k753k754
-2093i7995K016K016m88m88m88m89n5n6n6n6N071N071L01L02n33n32l395l394o52o52K210
-2072i2342K209l916l916K761K761j114j114j114j114L249L249j520j521k950k951k593k594
$$ y = [-94015, -99861, -105703, -101057, -96407, -95413, -94414, -98188, -101959, -104183, -106404, -103501, -100595, -99850, -93378, -91322, -94984, -98114, -95517, -93639, -91758, -91549, -91337, -87909, -90200, -91065, -91925, -93147, -94366, -95860, -97350, -95983, -94612, -91873, -89131, -86035, -88658, -86381, -84101, -85282, -92182, -94794, -91679, -89284, -86884, -88874, -90860, -89988, -89112, -89492, -89869, -90249, -90625, -93673, -96717, -96903, -97085, -94828, -92566, -90308, -88047, -87708, -87365, -87026, -86683, -88192, -89697, -91206, -92711, -92670, -92626, -91869, -96832, -101799, -101039, -97540, -94038, -91962, -95606, -96392, -97175, -94563, -97670, -103643, -103889, -100651, -97410, -96318, -95223, -95562, -90174, -84790, -85126, -87220, -89310, -91761, -94209, -94515, -94816, -92261, -89701, -89038, -88371, -92119, -95863, -99135, -96679, -94585, -92488, -95241, -97995, -95979, -93963, -94451, -94939, -95427, -95916, -95971, -96027, -96083, -96139, -91068, -85997, -85696, -85394, -85927, -86459, -89854, -93248, -93900, -94552, -92342, -90133, -94049, -97965, -95204, -92443, -93557, -94671, -95785, -96899, -93650, -90401, -91921, -93442, -96392, -99343, -101936, -104530]
-2055a04530k906K817O274O274o40o41l860J863K943K944K108l614k481L241K3n701K109K109
-2037i1668j110j111o93o93o93o93R24R28L428L431O26n093R84R87L28L31N097N101m799m795
-2017h9183l87l84K131l588l234l230L42L47L204L208l741l737M844M847P30P34P31P34r73
-1998h6605r68l834l830j38j34L081k638r72r69L439L442Q16Q20l953l949J974J979J974J979
-1979h8486k854k850PJ1j364j359J497J502J080J085M299j419k374k369J30J34j539j535L231
-1960i3173L234o60o56o59o56k150k146P12P15K929K932O7P1p68p63p68p64j229j226j230
-1940i6188j225k16k13k16k12P75P75k087k086K38K39K38K39J609J610J609J610k325k325
-1921i8151N36N37k720k720K050K049K61K60K61K61L20L21L20L21R16R17j945j945m92m88
$$ y = [-104530, -107436, -104619, -98345, -92071, -92711, -93352, -97212, -95349, -92406, -89462, -87354, -90968, -93449, -90208, -90185, -95886, -93777, -91668, -92778, -93889, -94582, -95275, -95968, -96661, -95737, -94809, -91381, -87950, -87324, -92417, -91433, -90446, -90118, -89787, -84690, -79589, -84388, -89183, -89570, -89954, -87823, -91411, -94645, -97875, -97533, -97186, -93982, -90774, -94515, -98252, -93408, -88561, -87831, -87097, -86366, -85632, -86605, -87573, -91407, -95237, -95375, -95509, -92428, -95066, -96038, -97007, -93568, -90126, -89310, -88490, -92443, -96392, -94418, -92439, -90465, -88486, -91340, -94190, -94183, -94172, -95536, -96895, -95398, -93896, -92816, -91731, -87432, -88851, -91225, -93594, -93464, -93330, -94869, -96404, -93173, -89939, -90599, -91255, -91914, -92570, -94720, -96866, -96154, -95439, -92510, -89578, -89511, -89440, -90208, -90971, -91739, -92503, -93732, -94958, -96188, -97413, -97629, -97842, -98058, -98270, -97495, -96720, -98807, -100893, -100655, -100416, -100178, -99939, -98330, -96720, -95111, -93501, -95826, -98151, -97615, -97078, -99798, -102518, -100468, -98419, -98158, -97898, -97637, -97376, -97056, -96735, -96415, -96094, -95178, -94261, -96206, -98151, -98643, -99131]
-1901i9131j207M519N172n48L025L029k667k664K101K105k548k545k548k545r20r17J941J945
-1883i4403r20r17m139J587M058M061k262k258j129j125j129j125L301L305L301L305l734
-1866i0223l729J036J039J274J278l494l491K01K05K01K05O59O63O60O63O00O04k262k258
-1847i6169j785j781j784j781L402L405N40N44m06m06K455K456j182j181j181j181K307K306
-1829i1422n55n56l16l17l17l16j129j129L282L283K150l574l53l54J822J821j754L968N100
-1810h0666o22l722l722q68q68q69q68k72k72K590K589o59o60o59o60l103l104k42k42K127
-1790i4772K128M989M988l058l059j98j97m21m21m21m21J367J367j494j494j002r98j003r98
-1771i5118R65R68R65R69J189J192p79K087L513k206n070O55L387N29N26L390L625k094m88
$$ y = [-99131, -100338, -95819, -90647, -91195, -88170, -85141, -87808, -90472, -88371, -86266, -88814, -91359, -93907, -96452, -97372, -98289, -96348, -94403, -95323, -96240, -100379, -98792, -94734, -90673, -92935, -95193, -96322, -97447, -98576, -99701, -96400, -93095, -89794, -86489, -90223, -93952, -92916, -91877, -90603, -89325, -92819, -96310, -96109, -95904, -95703, -95498, -94839, -94176, -93516, -92853, -92253, -91649, -93911, -96169, -97954, -99735, -101519, -103300, -99898, -96493, -95953, -95409, -95815, -96221, -93766, -91310, -92492, -93673, -94854, -96035, -93728, -91422, -91977, -92533, -92849, -93166, -93483, -93799, -94928, -96057, -92775, -89492, -87342, -90916, -91269, -91623, -89801, -87980, -89734, -85766, -80666, -81288, -85010, -88732, -89600, -90468, -91337, -92205, -92477, -92749, -90159, -87570, -88229, -88889, -89548, -90208, -93311, -96415, -96657, -96899, -94772, -92644, -87655, -82667, -85725, -88784, -88982, -89179, -89600, -90021, -90442, -90863, -89496, -88129, -89623, -91117, -92119, -93117, -94120, -95118, -94153, -93185, -92220, -91251, -90062, -88870, -89649, -87562, -84049, -86255, -91325, -90670, -87283, -86754, -86228, -82838, -79213, -81307, -81795]
-1752h1795K377p26l584j2k868m065j200L208L50k414n276m382J342N06k354K474K474j342
-1734i7287j341L070L070M501j222q64q65O34O33k228k228N74N73N74N74j796j796J066J065
-1715i3293n44n44n43n44K984K984K627K627N726MO3k798m303m303m125m124o08N116L685
-1696h9913Q23L461O323M892q31q31q30j189j189k559k560k559k560l394l394J374J375N78
-1678i2983N77L439L439j151j152j151j151J382J382j479j479k522k523j091j092K604K605
-1661i2346k57k57P26P27P26P27J90J90J90J90R05R06R05R05j021j020j021j021o04o03o04
-1640i1467o04R77R76l793l793Q2Q2k779k780o89o89M079M080Q31Q31o00o00k567k567k567
-1620a03557k567L722L722L722L722L111L111n473n473m06m06M362M363q53q53l715l714K515
$$ y = [-81795, -79418, -80144, -83728, -83740, -86608, -90673, -91873, -88665, -88315, -90729, -96005, -100387, -99045, -98539, -100893, -98419, -95945, -97287, -98628, -95558, -92488, -87987, -89209, -90073, -90938, -90304, -89671, -91899, -94127, -93553, -92980, -92406, -91832, -93628, -95424, -94358, -93293, -93837, -94381, -94924, -95468, -92484, -89500, -86873, -84246, -78520, -78516, -78453, -81251, -85554, -89857, -93982, -98106, -98714, -93598, -89913, -89090, -85629, -79306, -74414, -75245, -76076, -76906, -78095, -79284, -81843, -84403, -86962, -89522, -92916, -96310, -94936, -93561, -92983, -92406, -88967, -85528, -86679, -87831, -88982, -90133, -88751, -87369, -88848, -90327, -92849, -95372, -96463, -97555, -94951, -92346, -92603, -92860, -92134, -91407, -90681, -89954, -89764, -89574, -89384, -89194, -88289, -87383, -86478, -85573, -86594, -87614, -88635, -89656, -90260, -90863, -91467, -92071, -91094, -90118, -93911, -97704, -97622, -97540, -100319, -103099, -103788, -104477, -100398, -96318, -95487, -94656, -95256, -95856, -98423, -100990, -103557, -106124, -102402, -98680, -94958, -91236, -88125, -85014, -90487, -95960, -96366, -96772, -92410, -88047, -88900, -89753, -93468, -97182, -94667]
-1602i4667K515l47l46k191k191p60p60K310K310n52n51j386j386L383L383K429K430R98R99
-1583h4380l790l789n220n219o30o30K232K232J963J964J963J964j614j613j613j613j904
-1566i9697j904K865K865M81M80J912J911R13R13n18n18j621j620j90j91l87l87l88l87Q04
-1546i4664Q05o26o26k131k131r39M784M873q49l592l592o7N656m25m24j677j677J185J185
-1527i4932K362K362K005K004K46n477q27q27q83q83J978J979K247K246o15o14l342l342m81
-1508i4794m81Q31Q31k031k030j807j807K962K962N77N78k284k284M050M050R50m773j911
-1490i6411L811J666J665k64k65J166J167Q68Q68j993j994n03n03l722K001J464J464k589
-1472i2104k589l603K120M981p41L91L91L91L91l707K016J658J658j114j114L17L16j341j338
$$ y = [-94667, -92152, -92499, -92845, -95036, -97227, -97987, -98747, -96437, -94127, -94679, -95230, -96616, -98002, -94619, -91236, -88807, -86377, -85379, -84380, -88170, -91959, -97179, -102398, -103028, -103658, -101426, -99194, -97231, -95267, -93304, -91340, -92954, -94567, -96180, -97793, -99697, -101601, -98736, -95871, -95390, -94910, -92998, -91087, -90174, -89261, -89779, -90297, -91918, -93538, -93728, -93919, -94306, -94693, -95081, -95468, -94664, -93859, -94485, -95111, -97242, -99373, -100312, -95528, -90655, -91504, -95096, -98688, -98755, -93099, -93524, -93948, -95625, -97302, -96117, -94932, -92570, -90208, -88203, -86199, -85953, -91430, -92257, -93084, -93967, -94850, -92872, -90893, -88646, -86400, -87015, -87629, -90971, -94313, -94794, -95275, -94444, -93613, -95644, -97674, -99481, -101288, -98326, -95364, -94787, -94209, -96493, -98777, -94727, -90677, -89727, -94500, -96411, -92600, -90934, -89269, -89533, -89798, -88632, -87465, -86597, -85729, -87722, -89716, -90219, -90722, -94444, -92443, -90979, -89515, -92104, -94693, -98296, -96176, -91195, -91936, -91545, -91154, -90763, -90372, -94079, -92063, -90405, -88747, -89861, -90975, -90658, -90342, -91683, -93021]
-1453i3021r83r80o26N101M739M743r39r35M92M95k101k098K072K075L908n626k64k61J047
-1434h3162J051j815j811J211J215J211J214O15O19l797l793k466L260L256k463j989j986
-1417h9630N14N18M54M59M54M59K243K246o18o15q09q04q09q05j404j401j405j401L991L994
-1397h4369k687k682n40n37n40n37m236m236L990L991M348j375J486J487L096k627j911j911
-1379h9790l819J904J546J546j1j1j1j2p26p27p26p27J599J598j263j263M66M65N235N235
-1359g9492K310K310k459k459m92m92l711K012P90P90j714j714m635m635j535M188L495k228
-1341h9671n328n328O33O34O33O34L614L614L614L614k824k825J945J945r83r80l845l842
-1323i4746K117K120K116K120j684j681j684j680k936k932l294K433J111J114J468J471O34
$$ y = [-93021, -94004, -94984, -95610, -90509, -85770, -81027, -81966, -82901, -82409, -81914, -84015, -86113, -84041, -81966, -78058, -83684, -83948, -84209, -83162, -82111, -83926, -85737, -84526, -83311, -82100, -80886, -80271, -79652, -83449, -87242, -89708, -86448, -83192, -85655, -87644, -89630, -89116, -88598, -88144, -87685, -87231, -86772, -84529, -82283, -82901, -83516, -84325, -85129, -85938, -86743, -88147, -89548, -90953, -92354, -88363, -84369, -87056, -89738, -90278, -90815, -91355, -91892, -96128, -100364, -96374, -92383, -88035, -89410, -87924, -86437, -83341, -85968, -87879, -89790, -93609, -91705, -90159, -88613, -88624, -88635, -88646, -88658, -89384, -90111, -90837, -91564, -89965, -88367, -89630, -90893, -90427, -89962, -84727, -79492, -77182, -74872, -77331, -79790, -80282, -80774, -84485, -82473, -81683, -80893, -82607, -84321, -88956, -93591, -95126, -90938, -87443, -89671, -94999, -100327, -99694, -99060, -98427, -97793, -94179, -90565, -86951, -83337, -86161, -88986, -87041, -85096, -86079, -87059, -90904, -94746, -92629, -90509, -88393, -86273, -87957, -89638, -91322, -93002, -95938, -98870, -102164, -99731, -98620, -97506, -96038, -94567, -93933]
-1306i3933O37k228k225R32R35R31R36k825k820O33O360J960J964n44n41k749k746J12J15
-1287i5096J885J889N105o15k109k105P53m967k004k001k362k359K646K649K645K649O48O52
-1269i2097L868j852o04n99r62r57j155j155J706J707L316L316l361l361j021j020J482J483
-1251i1266K675l047J71J71j758j759j401j401l87N335p45p45K24K23k995K727L025L026j386
-1232h9313j386k810k809J960J960j915j916R47R46p23p22j081j080O430P08m299m300k504
-1214a01907L219%%p15p15p16p15o86o85J818J818L368k354j640j639J591P314P313J591k582
-1194h6322k582p8p8j658j658j658j658J025J024j837j836n03n03K358K358K538K537L253
-1176h5278k471m288J434J077m646m43m44q01q01J185J185K615K616K705K705j57j56j140
$$ y = [-93933, -93296, -95524, -97749, -96817, -95882, -94951, -94015, -96840, -99660, -99027, -92667, -90707, -88743, -89287, -89828, -92577, -95323, -95211, -95096, -93211, -91322, -86217, -86832, -88941, -91046, -90293, -95260, -97264, -99265, -101627, -103986, -101340, -98691, -96046, -93397, -92749, -92097, -88229, -90081, -90685, -91284, -92246, -93203, -94358, -95513, -93807, -92100, -88784, -85468, -88829, -92190, -93211, -94231, -92749, -91266, -88591, -91638, -91467, -91296, -93054, -94813, -96214, -97615, -98002, -92667, -93412, -94157, -93933, -93710, -96705, -93978, -90953, -87927, -89313, -90699, -93509, -96318, -94358, -92398, -94313, -96229, -95282, -94336, -95059, -95781, -96862, -97942, -91512, -90804, -95103, -99403, -101907, -98688, -98688, -98688, -99403, -100118, -100834, -101549, -102235, -102920, -101102, -99284, -95916, -98270, -99910, -101549, -99958, -92644, -85331, -83740, -86322, -88904, -88982, -89060, -90718, -92376, -94034, -95692, -94667, -93643, -95480, -97316, -97819, -98322, -95964, -93606, -91068, -88531, -85278, -87749, -92037, -90603, -89526, -94172, -94615, -95059, -95860, -96661, -95476, -94291, -91676, -89060, -86355, -83650, -83807, -83963, -85103]
-1158h5103j140j140j141L51L50L50L50k23k24k23k24j893j892j893j893J789J788J788J789
-1139h8434J401J401n276n276J055J054l76l77Q16Q16o14o15O97O96O97O97j301j300J561
-1120i2678J561K150K150k619k620q01q01k231k232K373K373m88m88j60j60j60j61j054j051
-1101i7097j054j051K523K526K522K526n47n44n48n44L46L51L46L50k582k578K80K83k403
-1082i6895k400M58M62N883N887J114q420k820K906r13r09%L%ML28L32k534k530J923J926
-1061i6195M92M95J506J509P4P8K076K079m602m597o97o93K165K168K478K481k291k288k649
-1042i6411k645J762J766Q31m888k210L517K947R0M43L309N03N06p48p46j732j729J129J133
-1023i3173K470K474l91l88r28r24J636M501L305o230N63L427J040J043n458n455j438j438
$$ y = [-85103, -86243, -87383, -88524, -88173, -87823, -87473, -87123, -87346, -87570, -87793, -88017, -89910, -91802, -93695, -95588, -93799, -92011, -90223, -88434, -87033, -85632, -90908, -96184, -95129, -94075, -94451, -94828, -94012, -93196, -93810, -94425, -93728, -93032, -92335, -91638, -92939, -94239, -92678, -91117, -88967, -86817, -89436, -92056, -92857, -93658, -95889, -98121, -95748, -93375, -93863, -94351, -94511, -94671, -94831, -94992, -96046, -97097, -98151, -99202, -96679, -94153, -91631, -89105, -89652, -90196, -90744, -91288, -90942, -90591, -90245, -89895, -92477, -95055, -94775, -94492, -96895, -99295, -98837, -98375, -92492, -86605, -85491, -93911, -96731, -93825, -94738, -95647, -95647, -95644, -95644, -95640, -95312, -94980, -97514, -100044, -98121, -96195, -95703, -95208, -93702, -92193, -92119, -92041, -89965, -87886, -92488, -97085, -97782, -98475, -96310, -94142, -91664, -89183, -91474, -93762, -96411, -99056, -97294, -95528, -94697, -99585, -101795, -98278, -95331, -95241, -94798, -91489, -90986, -90480, -91228, -91974, -93706, -95435, -94306, -93173, -90703, -88229, -88620, -89008, -89936, -90860, -89224, -84723, -81418, -87648, -87085, -83658, -82618, -81575, -87033, -92488, -93926, -95364]
-1005i5364j438j438L867L867k392L331M613J751j051j050n15n14J274m448J658J658j31j30
-987h6452k634k634K27K27M490M489k544k545L655k068m929P94J45J49L364L368j523j521
-969h5942j523j521M44M47M43M47k72k68k72k68k947k944k947k943m14m10K448K452J375J378
-949i3237K806K809m43m40l305l301J360J360j501j502R43R42R43R43P63P64k097k098j680
-930i5971j681j680j680K134K135K135K135O45O44O45O44l081l081k20k20j233j233L536L535
-911i1892K143K142k627k626L811L812R50R50j062j062J800J799m400m400j539j539j315j315
-893i6370L454L454O52O52O52O52J486J487K440p097q112k388K381K381p98p93K064K068O93
-874i1042O97O93O96M613M616j56j53N59N62k302k299K91K94K91K94k333k328k332k329m25
$$ y = [-95364, -96802, -98240, -94373, -90506, -92898, -89567, -84954, -83203, -84254, -85304, -85819, -86333, -85059, -89507, -87849, -86191, -86322, -86452, -89086, -91720, -91493, -91266, -86776, -82287, -84831, -87376, -83721, -85789, -90718, -89924, -89779, -89630, -86266, -82898, -84421, -85942, -87465, -88986, -88542, -88095, -87652, -87205, -87477, -87745, -88017, -88285, -91232, -94176, -97123, -100066, -100480, -100890, -98442, -95990, -94615, -93237, -90431, -87622, -88065, -88505, -91810, -95111, -93751, -92391, -93892, -95394, -94451, -93509, -92566, -91623, -90860, -90096, -92193, -94291, -95971, -97652, -99332, -101012, -98878, -96743, -94608, -92473, -91828, -91184, -90539, -89895, -92976, -96057, -96277, -96497, -97730, -98963, -95427, -91892, -89749, -87607, -90234, -92860, -89049, -85237, -84287, -83337, -84399, -85461, -83661, -81862, -86262, -90662, -92201, -93740, -95055, -96370, -92916, -89462, -88810, -88158, -87506, -86854, -85368, -83881, -81441, -88538, -96650, -99038, -96657, -94276, -95074, -95867, -93803, -91735, -91042, -90345, -89652, -88956, -84343, -79727, -79883, -80036, -79477, -78915, -81217, -83516, -83225, -82931, -82640, -82346, -84679, -87007, -89339, -91668, -92093]
-854i2093m21K437K440n44n40n44n40j431j427L338L342l397l395n36n33k563k560K98L02
-835i8367J013J017J014J017q20q16q19q16J93J98J94J97J565J569j297j293N52N55L413L416
-815h8315o48o45K213K217k317k314k317k314j572j569j572j569L95L99L256L260j121j118
-797i5651j121j118J203J207J204J207p64p60p64p60p64p60K098K101K795K798n790n786J840
-778i7585J845j021j017j155j152J647M512N045o75j751J114Q6Q9K65K68l193l189l32l28
-759i6527K128K131K127K132J292J297j569j564j126j121j125j122N44N48N44N48PJ1M121
-740h6724J263L346k373k735K992r0k947J520J524J818l901l904J822J758J762k652k649k117
-722i2287k112k116k113K336K336K336K336O67O67O67O67p79p78p79p79p78p79p79p78M06
$$ y = [-92093, -92514, -90077, -87637, -88181, -88721, -89265, -89805, -91236, -92663, -89325, -85983, -89380, -92775, -93311, -93844, -96407, -98967, -98669, -98367, -97354, -96337, -95323, -94306, -95126, -95942, -96761, -97577, -97384, -97186, -96992, -96795, -95230, -93661, -94958, -96251, -95699, -95144, -91731, -88315, -88963, -89608, -87395, -85178, -87495, -89809, -92126, -94440, -96012, -97581, -99153, -100722, -100327, -99928, -96672, -93412, -94533, -95651, -96772, -97890, -96687, -95480, -94276, -93069, -93833, -94593, -95357, -96117, -96881, -97641, -95543, -93442, -90647, -87849, -93639, -99425, -97585, -95740, -96761, -97778, -98933, -100085, -98438, -93926, -88881, -89556, -91307, -90193, -90107, -90018, -89753, -89485, -92678, -95867, -96199, -96527, -94399, -92268, -90141, -88009, -86717, -85420, -86989, -88553, -89679, -90800, -91925, -93047, -92503, -91955, -91411, -90863, -90856, -90845, -86724, -85461, -82115, -84488, -87223, -84231, -84321, -87268, -85748, -84224, -82406, -86307, -90211, -88389, -86631, -84869, -87521, -90170, -92287, -94399, -96515, -98628, -96292, -93956, -91620, -89284, -88617, -87950, -87283, -86616, -87395, -88173, -88952, -89731, -90509, -91288, -92067, -92845, -92439]
-702i2439M06M06M06m005m006j143j144O203O204L342L342l394l395n32n33p1o7J08J12j979
-682i2179Q87K850k868o241n14M191J334J032J036Q53Q57j256j251m117m114J248J252J427
-664i5573J431k329N37N004p16k030k027K381K384k410k407q61M866K776K779J584m136q31
-646h9578q27j546j543J315m403j547M181L54L57P12P15l01k99l01k98N62N67l015K713M497
-626h7685j222p545j818J751J751p53p52K287K288K288K287Q2Q2K944K943P97P98k064k064
-607h3605M76M77l100K623L458k265J311J312J341J341N753N753J0164M441K295J1833J7783
-590a8609J7784K9585M2940N9334O8871N2180Q305m0518o5317o5317n1964l5392j8222j2738
-576b9078j2739q245q245n384n384k463k462k463k463L171L170l506l506j896j896j897j896
$$ y = [-92439, -92033, -91627, -91221, -95226, -99232, -100375, -101519, -95316, -89112, -85770, -82428, -85822, -89217, -89749, -90282, -90353, -90420, -90312, -90200, -92179, -91292, -88442, -91310, -97551, -98065, -93874, -92540, -91508, -90472, -89619, -88762, -90018, -91269, -95386, -99500, -98252, -97000, -95573, -94142, -96471, -95934, -90930, -91646, -93676, -95703, -93322, -90938, -93348, -95755, -96616, -91750, -88974, -86195, -84611, -88747, -89578, -90405, -91951, -93494, -92179, -96582, -98129, -93948, -93594, -93237, -92525, -91810, -92111, -92410, -92711, -93009, -92447, -91880, -94895, -92182, -87685, -88907, -96452, -98270, -96519, -94768, -95521, -96273, -93986, -91698, -89410, -87123, -87041, -86959, -84015, -81072, -80275, -79477, -81541, -83605, -83129, -82652, -85752, -83129, -79671, -81936, -80625, -79313, -77972, -76631, -70878, -65125, -54961, -50520, -48225, -36392, -18609, -825, 28760, 71700, 131034, 199905, 252085, 260390, 219872, 154555, 89238, 37274, 1882, -16340, -29078, -41817, -50062, -58307, -63691, -69075, -71538, -74000, -76463, -78926, -75755, -72585, -76091, -79597, -81493, -83389, -85286, -87182]
-559h7182J211J211J210J211J9J9J8J9j144j144j144j143J002J002J002J002r42r43r42r43
-539h6601j837j837J025J025K216K217K217K217j837j837J025J024J889J889J889J889j330
-522g4757j330m191m192j300j300j301j300J144J144J143J144l61l62l61l61l164l163l02
-504i3170l01J963J964J963J964J367J367n309n309K034K034K035K034m464m463L05L06k586
-486i6266k585K75K76r76r76J885J885M5M5M4M5j446j445j446j445Q64Q64k354L368L904L905
-465i1534k414k415J103J103M322j401j997j997K414K415l43l43l562K161r98r99J863J863
-447i0759J71n551k690L033R46R46J304J304J319J319j542j543p67p68L644L644L80n343P38
-428i0215P38r32r31r32r31j662j662j661j662R61R62R61R61M77M77k742K980J908J908n97
$$ y = [-87182, -85971, -84760, -83550, -82339, -82320, -82301, -82283, -82264, -83408, -84552, -85696, -86839, -85837, -84835, -83833, -82831, -83773, -84716, -85658, -86601, -88438, -90275, -89250, -88225, -86009, -83792, -81575, -79358, -81195, -83032, -82007, -80983, -79094, -77205, -75316, -73427, -74757, -76087, -80278, -84470, -85770, -87070, -88371, -89671, -88527, -87383, -86240, -85096, -85457, -85819, -86180, -86541, -89705, -92868, -93170, -93471, -91508, -89544, -87581, -85617, -84250, -82883, -88192, -93501, -91467, -89433, -87398, -85364, -89828, -94291, -93986, -93680, -96266, -98851, -98576, -98300, -99276, -100252, -98367, -96482, -96437, -96392, -96348, -96303, -97749, -99194, -100640, -102085, -101221, -100357, -102711, -99343, -95439, -91534, -93948, -96363, -95260, -94157, -89835, -91236, -93233, -95230, -92816, -90401, -90744, -91087, -94649, -92488, -93486, -94485, -92622, -90759, -90588, -96139, -98829, -95796, -94850, -93904, -92600, -91296, -89977, -88658, -90200, -91743, -92510, -93278, -89634, -85990, -85610, -90953, -90215, -89477, -90409, -91340, -92272, -93203, -94865, -96527, -98188, -99850, -98889, -97927, -96966, -96005, -95528, -95051, -97793, -94813, -92905, -90997, -91594]
-408i1594n96K832K831k9l0j222j222j222j222M09M10M10M10R46R47l823l823J12J12J12J11
-387i5141J006J006J006J006q57q57q57q56p98p97K064K064pqpqN89N89R46R46p332j610J848
-364i6065J848J848J848J491J490M069j655r39r38l324K400K041K042p30p30p31p30l13l13
-345h7391K549K548p75p75n186n187P75O498M17M18k139k135L65L69L406k314j960j956k034
-326i4507k031k034k031O372O374M822q98J78J83l040l037P75P79k087k082j818j815J043
-308i4854J047J580J583J580J584k150k146P11P16j83j79J76J78l252K474j107j103L544k176
-289i1977k180L547M66M69Q24Q27l409l406l409l405M191M196J330J333J629J632j234j229
-271h9805N74N73m195m195k824k825L853L852J111J110J110J111j394j393j394j393l69l69
$$ y = [-91594, -92190, -89358, -86527, -86556, -86586, -87808, -89030, -90252, -91474, -91065, -90655, -90245, -89835, -88889, -87942, -91765, -95588, -95476, -95364, -95252, -95141, -94135, -93129, -92123, -91117, -91974, -92831, -93688, -94544, -95342, -96139, -94075, -92011, -92018, -92026, -92033, -92041, -91452, -90863, -89917, -88971, -96303, -97913, -96065, -94217, -92369, -90521, -89030, -87540, -83471, -85126, -86065, -87003, -90327, -87927, -85886, -83844, -84574, -85304, -86035, -86765, -87078, -87391, -84842, -82294, -83069, -83844, -89030, -94217, -93442, -86944, -86527, -86109, -88248, -90383, -90018, -89649, -86243, -88557, -90517, -92473, -94507, -96538, -98572, -100603, -94231, -87857, -83035, -83933, -83755, -83572, -86612, -89649, -88874, -88095, -90182, -92264, -94082, -95897, -94854, -93807, -92227, -90644, -89064, -87480, -89630, -91776, -91065, -90349, -90532, -90711, -90535, -90357, -93609, -91135, -92242, -93345, -89801, -91977, -94157, -90610, -90144, -89675, -88851, -88024, -91433, -94839, -98248, -101653, -97462, -93266, -91936, -90603, -88974, -87342, -88576, -89805, -89231, -88658, -92853, -97048, -99872, -102697, -98844, -94992, -93881, -92771, -91661, -90550, -91944, -93337, -94731, -96124, -96493, -96862]
-253i6862K493K492K850K851j919j919J032J032J032J032j650j651l021q745l405n40K257
-236a02641K262M69M74L152L155L21k537m151J576J274J278J632J636R46R50j915j911j021
-218i5051j017J840J845k661k656K01K05K168K172k600k597K157K161K161K161N52N51k310
-200i0718k310k224k221O41O41J654J654j207j207j49j45j46j45m914m915j456M266K339K344
-181i8218M95L357M311n227n585J38J035L901L361k358k363L365K645K649j259j256j259j256
-163i3524r01q98r02q98n62n59K299K302l24l20l25l20k202k198O59O64K328K333j76j71k112
-142i5807L614L91L95l484l480L197L197J941J945L91n328j159j155j512j513N48N51N48N51
-123i6169L230L234j535j535R65R69R65R69n85n81j297M426M73n249j673j673l61l62K500
$$ y = [-96862, -94369, -91877, -89027, -86176, -88095, -90014, -88982, -87950, -86918, -85886, -87536, -89187, -92208, -100953, -104358, -104898, -102641, -100379, -99910, -99436, -96284, -93129, -92808, -95345, -99496, -97920, -96646, -95368, -93736, -92100, -91154, -90204, -92119, -94030, -95051, -96068, -94228, -92383, -95044, -97700, -97499, -97294, -95126, -92954, -95554, -98151, -95994, -93833, -91672, -89511, -88959, -88408, -90718, -93028, -95252, -97473, -96832, -96191, -94537, -92883, -94090, -95297, -95446, -95591, -95737, -95882, -100796, -105711, -107167, -102901, -100562, -98218, -97723, -94366, -90055, -95282, -100867, -100729, -99694, -95793, -92432, -94790, -97153, -93788, -91143, -88494, -89753, -91009, -92268, -93524, -94425, -95323, -96225, -97123, -97685, -98244, -95945, -93643, -93967, -94287, -94612, -94932, -97134, -99332, -98673, -98009, -95681, -93348, -93524, -93695, -95807, -92193, -91802, -91407, -94891, -98371, -95174, -91977, -90036, -88091, -87700, -93028, -94187, -95342, -96854, -98367, -97819, -97268, -96720, -96169, -92939, -89705, -91240, -92775, -91810, -90841, -89876, -88907, -89492, -90073, -91370, -86944, -86471, -91720, -93393, -95066, -95427, -95789, -93289]
-104i3289K500K20K20K20K19j568j569j211j210k750K973K616K615q42q42K377l346k094k093
-85i6854K317K317J72J71J72J71Q64Q65j997j997N06N07N07N07p75p75J728J729N485k39M77
-64h4142M77m166J558m523m523K272K273K273K273o79o78o78o78j095j096J766J766l98l95
-45h8393l99l95k425k422k426k421j740j736M936M941L744L748k932k928k545k541k545k541
-27a01020J867J870J867J870K150K153p11p08k94k91k94k91m70m65m70m65l093l089j900L827
-7i7957O117L99p97p94r76r72p98p93O74L540K641l077k903K824J38L003N250m69O3O7J732
13h3088J737j129j125n37n33j430m289m113J613K862LJ94L059K876J9O70O75m277m274L014
33h8073L018l662l659k05k01k05k01N25N29N25N30l69l65K492K496k861k858k861k858j013
$$ y = [-93289, -90789, -90569, -90349, -90129, -89910, -91478, -93047, -94258, -95468, -98218, -95245, -92629, -90014, -90856, -91698, -89321, -92667, -94761, -96854, -94537, -92220, -92048, -91877, -91705, -91534, -90670, -89805, -91802, -93799, -93293, -92786, -92279, -91772, -92547, -93322, -91594, -89865, -84380, -84619, -84142, -83665, -87831, -86273, -90796, -95319, -93047, -90774, -88501, -86228, -86907, -87585, -88263, -88941, -90036, -91132, -89366, -87600, -87998, -88393, -88792, -89187, -91612, -94034, -96460, -98881, -100621, -102357, -97421, -92480, -88736, -84988, -87920, -90848, -93393, -95934, -98479, -101020, -99153, -97283, -95416, -93546, -91396, -89243, -89954, -90662, -90956, -91247, -91541, -91832, -92302, -92767, -93237, -93702, -96795, -99884, -101784, -97957, -91840, -91441, -92238, -93032, -94008, -94980, -95778, -96571, -95897, -92357, -89716, -92793, -95696, -92872, -92734, -89731, -84481, -84950, -84887, -84820, -83088, -81351, -82480, -83605, -84142, -84675, -86105, -90394, -94507, -92894, -90032, -90029, -89835, -86776, -83900, -83881, -83211, -82536, -86813, -91087, -88073, -85055, -88717, -92376, -92581, -92782, -92987, -93188, -92663, -92134, -91609, -91079, -91448, -91813, -89321, -86825, -89686, -92544, -95405, -98263, -99276]
53i9276j010j013j010J356J360o11K254L324k396R98J003j565j561M515j203j923j918p31
71i9407M997p75p72m17m13L636L640J669M535j088o807n202k336K83k574m188J539L592P34
90i9354K697K701m4m1m5m1M486M489k190k188l084l082J327J330O423P04k459M06J178J181
110h5606j505j502M02M03k459k459J117J118J118J118p90p90p90p90p30p30K131K131M5M4
130h8524l13l12P973K250n022n023J94J94L055L055J505J506m62K399J107m617l722l722j993
149i0472L729J047m676l841r80J822J822r80r80J882J881Q83Q83j978j978J002J002J002J003
168h7927N85N84N85N85k515k514k515k515l58l54l58l54j251j249K147l574q94J971K862K865
188i4194o0n6n9n6L50L54J244M110o04o322o7o4n74n70n73n70J095J099J096J099j338j334
$$ y = [-99276, -100286, -101299, -102309, -100953, -99593, -100204, -97950, -94626, -97022, -96024, -95021, -96586, -98147, -93632, -94835, -96758, -98676, -99407, -94410, -95185, -95957, -96374, -96787, -93151, -89511, -87842, -83307, -84395, -91202, -96404, -98740, -98457, -101031, -105219, -103680, -100088, -99354, -96657, -93956, -94000, -94041, -94086, -94127, -89641, -85152, -87342, -89530, -92614, -95696, -94369, -93039, -86616, -85912, -88371, -87965, -86787, -85606, -87111, -88613, -88211, -87808, -90267, -92726, -91609, -90491, -89373, -88255, -89045, -89835, -90625, -91415, -92145, -92875, -90744, -88613, -88568, -88524, -88837, -89149, -81176, -78926, -83948, -88971, -88777, -88583, -85528, -82473, -80968, -79462, -79924, -77525, -76418, -81035, -84757, -88479, -90472, -86743, -85696, -90372, -94213, -95193, -93371, -91549, -92529, -93509, -91627, -89746, -88863, -87980, -89958, -91936, -90934, -89932, -88930, -87927, -87342, -86758, -86173, -85588, -88103, -90617, -93132, -95647, -96005, -96359, -96717, -97071, -98322, -99571, -97424, -100998, -101892, -99921, -97059, -94194, -94254, -94310, -94369, -94425, -94075, -93721, -92477, -88367, -88971, -95293, -95360, -95424, -95998, -96568, -97141, -97711, -96616, -95517, -94421, -93322, -94660, -95994]
210i5994L074L078j46n864n690L8N726Q592K150l570k440M25j546j543j378j379j557j558
228i9582K735j27m597J125K794K795L152L152qpk869k869k373k370M303M307j956j952R05
247i3442R09N18N22l059K668K306l413j807J058L886j836J561J561J203J204l47o069J546
265i1031J546j673j673l61l61l62l61N10N14N11N14l722l718q61q57Q38Q42J196J200m14N313
286i2410O60k198K470l88k537L189J636m083n11n07K053K057M020J163m207J520j881j878
304i1832P38P41k124k120o93o89o93o89L673L678Q12Q16L316L320M54M59j454j449j453j449
324h6638j096j091J766J769o7o3o7o3N2N6L450k269l458n92L815R58j312j308j490j487l502
345i2637l498k132L596K697j60J803J807m32m28j327m184k936K791M62L327M233J375j550
$$ y = [-95994, -92920, -89842, -89988, -95852, -101542, -101504, -95778, -87186, -85036, -88606, -91046, -90621, -92167, -93710, -95088, -96467, -98024, -99582, -96847, -96974, -101571, -100446, -97652, -94857, -91705, -88553, -88561, -88568, -91437, -94306, -96679, -99049, -94746, -90439, -92395, -94347, -93442, -92533, -92015, -91493, -94552, -91884, -89578, -92991, -94798, -93740, -89854, -91690, -90129, -88568, -87365, -86161, -86508, -92577, -91031, -89485, -91158, -92831, -93192, -93553, -93915, -94276, -93766, -93252, -92741, -92227, -95949, -99667, -100528, -101385, -100547, -99705, -98509, -97309, -97723, -92410, -91750, -93948, -91478, -91866, -94403, -91214, -89578, -93661, -94172, -94679, -92626, -90569, -86549, -85386, -89593, -88073, -89954, -91832, -91094, -90353, -92477, -94597, -95290, -95979, -96672, -97361, -93688, -90010, -89198, -88382, -85066, -81746, -81292, -80833, -82287, -83736, -85189, -86638, -87734, -88825, -87059, -85290, -85357, -85420, -85487, -85550, -85498, -85442, -81992, -84261, -87719, -88311, -84496, -83538, -84850, -86158, -87648, -89135, -92637, -96135, -98267, -94671, -91974, -92134, -90331, -88524, -88956, -89384, -90711, -94895, -97831, -95040, -94578, -91251, -87018, -85643, -87193]
363h7193m408k265L461J669j188LQK686K690p71p68m13m10o122l95J152J155J8K3J8K3J553
385h9474J558M773r47k738k735k35k31R3R7K955K958k709k704k709k705J397J397j464j464
404i4887J337J338j524j524l76l76M035M035K604l118k404k403m050J673J315J316K42K42
422i2525l335K389J687m035m58m58J390J389J032J032N734J2J30n593j657M064L708k016m221
441i1731m222j717j718J382J383j480j479J099J099J100J099Q60Q61k001k000Q01Q01Q01Q01
460i4261r3r4r3r3O63O64O63O63n2n2L05L06m270J453j766j766K168K169K168K169K31K31
482h8687K31K31N29N29N29N29k422k422j229M493L003k720Q57Q57o41o41o40o41k251k250
502i2756O11O11q64q65q64q65k891k891N693N693n66n67n66n66M47M47L308L309m531m530
$$ y = [-87193, -91601, -93866, -90405, -88736, -89924, -89921, -89913, -87227, -84537, -85308, -86076, -86489, -86899, -93021, -93416, -92264, -91109, -91091, -91068, -91050, -91027, -89474, -87916, -83143, -84090, -86828, -89563, -89798, -90029, -89936, -89839, -86884, -83926, -86635, -89339, -92048, -94753, -93356, -91959, -93423, -94887, -93550, -92212, -93736, -95260, -95636, -96012, -91977, -87942, -85338, -88456, -90860, -93263, -97313, -95640, -94325, -93009, -92767, -92525, -95860, -93471, -91784, -95819, -96277, -96735, -95345, -93956, -92924, -91892, -86158, -86146, -86016, -91609, -93266, -89202, -85494, -87510, -91731, -95953, -97670, -99388, -98006, -96623, -98103, -99582, -98483, -97384, -96284, -95185, -94325, -93464, -95465, -97465, -96664, -95863, -95062, -94261, -94354, -94448, -94541, -94634, -93971, -93307, -92644, -91981, -92033, -92085, -91780, -91474, -95744, -94291, -96057, -97823, -95655, -93486, -91318, -89149, -88918, -88687, -88456, -88225, -87696, -87167, -86638, -86109, -88531, -90953, -92182, -87689, -84686, -87406, -86549, -85692, -86333, -86974, -87614, -88255, -90506, -92756, -92145, -91534, -92398, -93263, -94127, -94992, -97883, -100774, -95081, -89388, -89954, -90521, -91087, -91653, -91206, -90759, -87451, -84142, -88673, -93203]
522i3203K146K146m054m053j193j192J591J591M154M154K20m549m549K20O37O37R35R35L022
541i0405L022l655l655J352J352J353J352j032j032j032j032j017j017J844J844K35K35K35
$$ y = [-93203, -91057, -88911, -92965, -97018, -98211, -99403, -97812, -96221, -92067, -87913, -87693, -92242, -96791, -96571, -95934, -95297, -94362, -93427, -90405, -87383, -91038, -94693, -93341, -91989, -90636, -89284, -90316, -91348, -92380, -93412, -94429, -95446, -93602, -91758, -91523, -91288, -91053]
$$ [...]
##END=	
