##TITLE=	VWvMhu0VQQ6K5OE7vYJIfQ/5880s
##JCAMPDX=	6.0	$$ NMR Plug-in 1.13 of MestReNova 11.0.4-18998
##DATATYPE=	NMRSPECTRUM
##DATACLASS=	XYDATA
##NUMDIM=	1
##ORIGIN=	Bruker BioSpin GmbH
##OWNER=	andrew
##.OBSERVEFREQUENCY=	600.30184456100005264
##.OBSERVENUCLEUS=	^1H
##.SOLVENTNAME=	CD2Cl2
##.PULSESEQUENCE=	zg
##LONGDATE=	2015/06/05 11:23:00.000
##.ACQUISITIONMODE=	SIMULTANEOUS (DQD)
##$ORIGINALFORMAT=	Bruker XWIN-NMR
##$PARAMETERFILE=	(acqus, ASCII, /var/folders/f6/rjf_tdyn2v98c5c0wvkgn4s80000gn/T/VWvMhu0VQQ6K5OE7vYJIfQ/5880s/acqus, 0)
$$ ##TITLE= Parameter file, TOPSPIN		Version 2.1
$$ ##JCAMPDX= 5.0
$$ ##DATATYPE= Parameter Values
$$ ##NPOINTS= 10	$$ modification sequence number
$$ ##ORIGIN= Bruker BioSpin GmbH
$$ ##OWNER= andrew
$$ $$ 2015-06-05 16:23:01.177 +0600  andrew@av-600
$$ $$ /opt/data/andrew/nmr/limog-1782/617/acqus
$$ $$ process /opt/ts21pl6/prog/mod/shimcntl
$$ ##$ACQT0= -9.54927425515661
$$ ##$AMP= (0..31)
$$ 100 100 100 100 100 100 100 100 100 100 100 100 100 100 100 100 100 100
$$ 100 100 100 100 100 100 100 100 100 100 100 100 100 100
$$ ##$ANAVPT= -1
$$ ##$AQSEQ= 0
$$ ##$AQ_mod= 3
$$ ##$AUNM= <au_zg>
$$ ##$AUTOPOS= <>
$$ ##$BF1= 600.3
$$ ##$BF2= 600.3
$$ ##$BF3= 600.3
$$ ##$BF4= 600.3
$$ ##$BF5= 600.3
$$ ##$BF6= 600.3
$$ ##$BF7= 600.3
$$ ##$BF8= 600.3
$$ ##$BYTORDA= 0
$$ ##$CFDGTYP= 0
$$ ##$CFRGTYP= 9
$$ ##$CHEMSTR= <none>
$$ ##$CNST= (0..63)
$$ 1 1 145 1 1 1 1 1 1 1 1 1 1 1 1 1 1 1 1 1 1 1 1 1 1 1 1 1 1 1 1 1 1 1 1
$$ 1 1 1 1 1 1 1 1 1 1 1 1 1 1 1 1 1 1 1 1 1 1 1 1 1 1 1 1 1
$$ ##$CPDPRG= <>
$$ ##$CPDPRG1= <>
$$ ##$CPDPRG2= <waltz16>
$$ ##$CPDPRG3= <>
$$ ##$CPDPRG4= <mlev>
$$ ##$CPDPRG5= <mlev>
$$ ##$CPDPRG6= <mlev>
$$ ##$CPDPRG7= <mlev>
$$ ##$CPDPRG8= <mlev>
$$ ##$CPDPRGB= <>
$$ ##$CPDPRGT= <>
$$ ##$D= (0..63)
$$ 0 1 0 0 0 0 0 0 0 0.06 0 0.03 0 0 0 0 1e-04 0 0 0 0 0 0 0 0 0 0 0 0 0 0
$$ 0 0 0 0 0 0 0 0 0 0 0 0 0 0 0 0 0 0 0 0 0 0 0 0 0 0 0 0 0 0 0 0 0
$$ ##$DATE= 1433499780
$$ ##$DBL= (0..7)
$$ 120 120 120 120 120 120 120 120
$$ ##$DBP= (0..7)
$$ 150 150 150 150 150 150 150 150
$$ ##$DBP07= 0
$$ ##$DBPNAM0= <>
$$ ##$DBPNAM1= <>
$$ ##$DBPNAM2= <>
$$ ##$DBPNAM3= <>
$$ ##$DBPNAM4= <>
$$ ##$DBPNAM5= <>
$$ ##$DBPNAM6= <>
$$ ##$DBPNAM7= <>
$$ ##$DBPOAL= (0..7)
$$ 0.5 0.5 0.5 0.5 0.5 0.5 0.5 0.5
$$ ##$DBPOFFS= (0..7)
$$ 0 0 0 0 0 0 0 0
$$ ##$DE= 6.5
$$ ##$DECBNUC= <off>
$$ ##$DECIM= 2218.66666666667
$$ ##$DECNUC= <off>
$$ ##$DECSTAT= 4
$$ ##$DIGMOD= 1
$$ ##$DIGTYP= 12
$$ ##$DL= (0..7)
$$ 0 120 120 120 120 120 120 120
$$ ##$DP= (0..7)
$$ 150 150 150 150 150 150 150 150
$$ ##$DP07= 0
$$ ##$DPNAME0= <>
$$ ##$DPNAME1= <>
$$ ##$DPNAME2= <>
$$ ##$DPNAME3= <>
$$ ##$DPNAME4= <>
$$ ##$DPNAME5= <>
$$ ##$DPNAME6= <>
$$ ##$DPNAME7= <>
$$ ##$DPOAL= (0..7)
$$ 0.5 0.5 0.5 0.5 0.5 0.5 0.5 0.5
$$ ##$DPOFFS= (0..7)
$$ 0 0 0 0 0 0 0 0
$$ ##$DQDMODE= 0
$$ ##$DR= 22
$$ ##$DS= 0
$$ ##$DSLIST= <SSSSSSSSSSSSSSS>
$$ ##$DSPFIRM= 0
$$ ##$DSPFVS= 20
$$ ##$DTYPA= 0
$$ ##$EXP= <>
$$ ##$F1LIST= <111111111111111>
$$ ##$F2LIST= <222222222222222>
$$ [...]
$$ -1 -1 -1 -1 -1 -1 -1 -1 -1 -1 -1 -1 -1 -1 -1 -1 -1 -1 -1 -1 -1 -1 -1 -1
$$ -1 -1 -1 -1 -1 -1 -1 -1 -1 -1 -1 -1 -1 -1 -1 -1 -1 -1 -1 -1 -1 -1 -1 -1
$$ -1 -1 -1 -1 -1 -1 -1 -1 -1 -1 -1 -1 -1 -1 -1 -1 -1 -1 -1 -1 -1 -1 -1 -1
$$ -1 -1 -1 -1 -1 -1 -1 -1 -1 -1 -1 -1 -1 -1 -1 -1 -1 -1 -1 -1 -1 -1 -1 -1
$$ -1 -1 -1 -1 -1 -1 -1 -1 -1 -1 -1 -1 -1 -1 -1 -1
$$ ##$RG_tab8= (0..255)
$$ -1 -1 -1 -1 -1 -1 -1 -1 -1 -1 -1 -1 -1 -1 -1 -1 -1 -1 -1 -1 -1 -1 -1 -1
$$ -1 -1 -1 -1 -1 -1 -1 -1 -1 -1 -1 -1 -1 -1 -1 -1 -1 -1 -1 -1 -1 -1 -1 -1
$$ -1 -1 -1 -1 -1 -1 -1 -1 -1 -1 -1 -1 -1 -1 -1 -1 -1 -1 -1 -1 -1 -1 -1 -1
$$ -1 -1 -1 -1 -1 -1 -1 -1 -1 -1 -1 -1 -1 -1 -1 -1 -1 -1 -1 -1 -1 -1 -1 -1
$$ -1 -1 -1 -1 -1 -1 -1 -1 -1 -1 -1 -1 -1 -1 -1 -1 -1 -1 -1 -1 -1 -1 -1 -1
$$ -1 -1 -1 -1 -1 -1 -1 -1 -1 -1 -1 -1 -1 -1 -1 -1 -1 -1 -1 -1 -1 -1 -1 -1
$$ -1 -1 -1 -1 -1 -1 -1 -1 -1 -1 -1 -1 -1 -1 -1 -1 -1 -1 -1 -1 -1 -1 -1 -1
$$ -1 -1 -1 -1 -1 -1 -1 -1 -1 -1 -1 -1 -1 -1 -1 -1 -1 -1 -1 -1 -1 -1 -1 -1
$$ -1 -1 -1 -1 -1 -1 -1 -1 -1 -1 -1 -1 -1 -1 -1 -1 -1 -1 -1 -1 -1 -1 -1 -1
$$ -1 -1 -1 -1 -1 -1 -1 -1 -1 -1 -1 -1 -1 -1 -1 -1 -1 -1 -1 -1 -1 -1 -1 -1
$$ -1 -1 -1 -1 -1 -1 -1 -1 -1 -1 -1 -1 -1 -1 -1 -1
$$ ##$RG_tabA= (0..255)
$$ 0.25 0.28 0.32 0.35 0.4 0.44 0.5 0.56 0.64 0.7 0.8 0.89 1 1.12 1.28 1.4
$$ 1.6 1.78 2 2.25 2.56 2.8 3.2 3.56 4 4.5 5 5.6 6.35 7.12 8 9 10 11.3 12.7
$$ 14.2 16 18 20.2 22.6 25.4 28.5 32 36 40.3 45.2 50.8 57 64 71.8 80.6 90.5
$$ 101 114 128 144 161 181 203 -1 -1 -1 -1 -1 -1 -1 -1 -1 -1 -1 -1 -1 -1 -1
$$ -1 -1 -1 -1 -1 -1 -1 -1 -1 -1 -1 -1 -1 -1 -1 -1 -1 -1 -1 -1 -1 -1 -1 -1
$$ -1 -1 -1 -1 -1 -1 -1 -1 -1 -1 -1 -1 -1 -1 -1 -1 -1 -1 -1 -1 -1 -1 -1 -1
$$ -1 -1 -1 -1 -1 -1 -1 -1 -1 -1 -1 -1 -1 -1 -1 -1 -1 -1 -1 -1 -1 -1 -1 -1
$$ -1 -1 -1 -1 -1 -1 -1 -1 -1 -1 -1 -1 -1 -1 -1 -1 -1 -1 -1 -1 -1 -1 -1 -1
$$ -1 -1 -1 -1 -1 -1 -1 -1 -1 -1 -1 -1 -1 -1 -1 -1 -1 -1 -1 -1 -1 -1 -1 -1
$$ -1 -1 -1 -1 -1 -1 -1 -1 -1 -1 -1 -1 -1 -1 -1 -1 -1 -1 -1 -1 -1 -1 -1 -1
$$ -1 -1 -1 -1 -1 -1 -1 -1 -1 -1 -1 -1 -1 -1 -1 -1 -1 -1 -1 -1 -1 -1 -1 -1
$$ -1 -1 -1 -1 -1 -1 -1 -1 -1 -1 -1 -1 -1 -1
$$ ##$ROUT14= (0..7)
$$ 0 0 0 0 0 0 0 0
$$ ##$ROUTER= -1
$$ ##$RX22TY= <no>
$$ ##$RXFMAX= (0..7)
$$ 647.5 -1 -1 -1 -1 -1 -1 -1
$$ ##$RXFMIN= (0..7)
$$ 5 -1 -1 -1 -1 -1 -1 -1
$$ ##$RXINTLV= (0..7)
$$ 1 0 0 0 0 0 0 0
$$ ##$RXMSTY= <no>
$$ ##$SCMTY= <no>
$$ ##$SGUC1= (0..15)
$$ 17 18 34 0 0 0 0 0 0 0 0 0 0 0 0 0
$$ ##$SGUC2= (0..15)
$$ 33 256 20 0 0 0 0 0 0 0 0 0 0 0 0 0
$$ ##$SPECTR= 10
$$ ##$SY2FLAG= 0
$$ ##$TFXNUM= 0
$$ ##$TRIPLO2= 0
$$ ##$VTUTY= <tty05>
$$ ##$WBREFAM= (0..15)
$$ 100 100 100 100 100 100 100 100 100 100 100 100 100 100 100 100
$$ ##$WBREFPH= (0..15)
$$ 0 0 0 0 0 0 0 0 0 0 0 0 0 0 0 0
$$ ##$XFAC= 2
$$ ##END=
$$ 
##$DECIM=	2218.66666666667
##$DSPFVS=	20
##XUNITS=	HZ
##YUNITS=	ARBITRARY UNITS
##FIRSTX=	6322.8525384689401108
##LASTX=	-2691.4329892738592207
##XFACTOR=	-0.1375491802509010153
##YFACTOR=	7.6467636718750005249e-06
##NPOINTS=	65536
##XYDATA=	(X++(Y..Y))
$$ [...]
-11967g8799k091k088M291M294M230n37k627k624p9p4p9p4K128K132p34p31r20r17J942J946
$$ -78799 -80890 -82978 -78687 -74393 -70163 -70700 -73327 -75951 -76030 -76104 -76183 -76257 -74129 -71997 -72731 -73462 -74382 -75299 -73357 -71411
-11947g1411j458j454J406J409l54l51l54l50j76j71j75j72n40n37n40n37q98q95L455L459
$$ -71411 -72869 -74323 -72917 -71508 -71862 -72213 -72567 -72917 -73093 -73264 -73439 -73611 -74151 -74688 -75228 -75765 -76663 -77558 -74103 -70644
-11927g0644K576m100p802l026R06R09J204J208J438J439J141J140J201l571k319N44M25L288
$$ -70644 -68068 -72168 -79970 -82996 -82090 -81181 -79977 -78769 -77331 -75892 -74751 -73611 -72410 -75981 -78300 -77756 -77331 -74043
-11909g4043j305j304K452k318L65L66n00m99n00m99j037j036j036j036l36l35K527K527K229
$$ -74043 -75348 -76652 -74200 -76518 -76153 -75787 -76287 -76786 -77286 -77785 -78822 -79858 -80894 -81930 -82266 -82601 -80074 -77547 -75318
-11890g5318K229o33o34J603J606l168l165n076n073L511L515K929K934j841j838J86J90J87
$$ -75318 -73089 -73722 -74356 -72753 -71147 -74315 -77480 -82556 -87629 -84118 -80603 -77674 -74740 -76581 -78419 -78233 -78043 -77856
-11872g7856J90k207k203k206k203J551J554m77K389K773l902j760J107K356n03l28K538J618
$$ -77856 -77666 -79873 -82076 -84282 -86485 -84934 -83380 -83857 -81468 -78695 -82597 -84357 -83250 -80894 -81397 -81725 -79187 -77569
-11854g7569J618j066j067J737J737J439J439K61m510j827j826n15n14n14n15l138l139L541
$$ -77569 -75951 -77017 -78084 -76347 -74610 -73171 -71732 -71471 -75981 -77808 -79634 -80149 -80663 -81177 -81692 -84830 -87969 -84428
-11836h4428L541J216J215K61k602l124J648J468l302K781K780K483K482j562j558J301J305
$$ -84428 -80887 -79671 -78456 -78195 -80797 -83921 -82273 -80805 -84107 -81326 -78546 -76063 -73581 -75143 -76701 -75400 -74095
-11819g4095q46q43q46q42j741j737j562L213K196K199l69l65j16j12j15j12k442k437k442
$$ -74095 -74941 -75784 -76630 -77472 -79213 -80950 -82512 -79299 -77103 -74904 -75273 -75638 -75754 -75866 -75981 -76093 -78535 -80972 -83414
-11800h3414k437L015L019L016L019k889k885k889k885N308N312j372j368P16P19j785j786
$$ -83414 -85851 -82836 -79817 -76801 -73782 -76671 -79556 -82445 -85330 -80022 -74710 -76082 -77450 -76734 -76015 -77800 -79586
-11783g9586o41N088r99r95q80q76q76q76l35l32l35l32o34o30o29o30L526L530j245j242
$$ -79586 -80227 -75139 -76138 -77133 -78013 -78889 -79765 -80641 -80976 -81308 -81643 -81975 -82609 -83239 -83868 -84498 -80972 -77442 -78687 -79929
-11763g9929K334K337K337K337l023l023j60j60J628J629J987l739O90O90L31L32L32L32L31
$$ -79929 -77595 -75258 -72921 -70584 -73607 -76630 -76790 -76950 -75322 -73693 -71706 -75445 -74755 -74065 -73734 -73402 -73070 -72738 -72407
-11744g2407L32j957j957R06R06J30J31K993K993J055J055n029O97O97O97j807j808m9m8o132
$$ -72407 -72075 -74032 -75989 -75083 -74177 -74047 -73916 -70923 -67930 -66875 -65820 -70849 -70152 -69455 -68758 -70565 -72373 -72422 -72470 -78602
-11724g8602m02j182j178j181j178K978k747k389k386L038L042j376j371m194J532L083L086
$$ -78602 -79004 -80186 -81364 -82545 -83723 -80745 -83492 -85881 -88267 -85229 -82187 -83563 -84934 -89128 -87596 -84513 -81427
-11707h1427j211j208j212j207J830J830J830J834j271j267j271j268J260J264J260J263j543
$$ -81427 -82638 -83846 -85058 -86265 -84435 -82605 -80775 -78941 -80212 -81479 -82750 -84018 -82758 -81494 -80234 -78971 -80514
-11690h0514j539j543j540j245j241L526L530l511l508J260J264J714J719J714J719j268j263
$$ -80514 -82053 -83596 -85136 -86381 -87622 -84096 -80566 -84077 -87585 -86325 -85061 -83347 -81628 -79914 -78195 -79463 -80726
-11673h0726j268j263k490k486r40M790J804J808K162K166Q98Q98j964j965j248j249J614
$$ -80726 -81994 -83257 -85747 -88233 -89173 -84383 -82579 -80771 -78609 -76443 -75545 -74647 -76611 -78576 -79824 -81073 -79459
-11656g9459J614J346J345J346J345j874j875j875j875j361j360j897L828M186J323K039q24
$$ -79459 -77845 -76499 -75154 -73808 -72463 -74337 -76212 -78087 -79962 -81323 -82683 -84580 -80752 -76566 -75243 -73204 -74028
-11639g4028k792k792k970k971J740J741j122j122k05k05K658K658l128l127l24K538L075
$$ -74028 -76820 -79612 -82582 -85553 -83813 -82072 -83194 -84316 -84521 -84726 -82068 -79410 -82538 -85665 -85989 -83451 -80376
-11622h0376k650L970L969j815L910K300n63l895l895m074m074M58M59L321L321M88M88L351
$$ -80376 -83026 -79056 -75087 -76902 -72992 -70692 -71255 -75150 -79045 -83119 -87193 -86735 -86276 -82955 -79634 -79146 -78658 -75307
-11604g5307L351J204J204J204J204k676k673k318k315k318L410J976q84p67K098Q43m880
$$ -75307 -71956 -70752 -69548 -68344 -67140 -69816 -72489 -74807 -77122 -79440 -76030 -74054 -74938 -75705 -73607 -72764 -77644
-11587g7644O64L530J558J561k989k986o567q39L750j972m480J248m54m51r7r3J215J219J215
$$ -77644 -76980 -73450 -71892 -70331 -73320 -76306 -82873 -83712 -79962 -81934 -86414 -85166 -85620 -86071 -86168 -86261 -85046 -83827 -82612
-11568h2612J219L46L47k516k516K851K852K851K852j845j845J017J018Q38Q39n6k918j107
$$ -82612 -81393 -81047 -80700 -83216 -85732 -82881 -80029 -77178 -74326 -76171 -78016 -76999 -75981 -75143 -74304 -74360 -77278 -78385
-11550g8385M618K829l4k180k181N04N03k658k658K114K113n70n70n71n70J633J632j230j230
$$ -78385 -73767 -70938 -70972 -73152 -75333 -74829 -74326 -76984 -79642 -77528 -75415 -75985 -76555 -77126 -77696 -76063 -74431 -75661 -76891
-11531g6891J573J573J573J573l50l51l50l50J259J260j602j603p61p60J923k847J267J267
$$ -76891 -75318 -73745 -72172 -70599 -70949 -71300 -71650 -72000 -70741 -69481 -71083 -72686 -73447 -74207 -72284 -75131 -73864 -72597
-11513g2597j893j894R39R40R39R39j34j34j34j34N70N70k292k292k65k65l127l127K150K151
$$ -72597 -74490 -76384 -75445 -74505 -73566 -72627 -72761 -72895 -73029 -73163 -72593 -72023 -74315 -76607 -76872 -77137 -80264 -83391 -81241 -79090
-11493g9090K151K151K091K091p72p71l791l791o30o30j047L723J040J040N93N93K94K95K083
$$ -79090 -76939 -74788 -72697 -70606 -71378 -72149 -75940 -79731 -80361 -80991 -82038 -78315 -77275 -76235 -75642 -75049 -74755 -74460 -72377
-11474g2377k687mmk829k825J942J945l425l422N163N166j75j72j75j71j607j603j606j603
$$ -72377 -75064 -75068 -75072 -77901 -80726 -78784 -76839 -80264 -83686 -78523 -73357 -73532 -73704 -73879 -74050 -75657 -77260 -78866 -80469
-11455h0469j241j238j062L712J920J923o44o42p34p30K128K132j808j804j808j804K084K087
$$ -80469 -81710 -82948 -84010 -80298 -78378 -76455 -77099 -77741 -78475 -79205 -77077 -74945 -76753 -78557 -80365 -82169 -80085 -77998
-11437g7998K084K087J189J193J487J491m81M294J249l519j23k982m357M18O82O82N63N62
$$ -77998 -75914 -73827 -72638 -71445 -69958 -68467 -68948 -64654 -63405 -66924 -67047 -70029 -74386 -73968 -73286 -72604 -72041 -71479
-11419g1479L307l374k180k181L84N155M380J517l970Q02k419k419L350k370k375L355M365
$$ -71479 -68172 -71546 -73726 -75907 -75523 -70368 -65988 -64471 -68441 -67639 -70058 -72477 -69127 -71497 -73872 -70517 -66152
-11402f6152M368M723M726K173K177m506m503p488p485k717k714n2n2n2n2J856J856j006j007
$$ -66152 -61784 -57061 -52335 -50162 -47985 -52491 -56994 -64482 -71967 -74684 -77398 -77450 -77502 -77554 -77606 -75750 -73894 -74900 -75907
-11383g5907P38P38L81L80L064k662m092j230L20k542k363M99K766K766R76L840J155m570
$$ -75907 -75169 -74431 -74050 -73670 -70606 -73268 -77360 -78590 -78270 -80812 -83175 -82676 -79910 -77144 -76168 -72328 -71173 -75743
-11365g5743k780Q2J036J036L21k542m317J409K781K780K781K781Q12L676L645k080n062k199
$$ -75743 -78523 -78441 -77405 -76369 -76048 -78590 -82907 -81498 -78717 -75937 -73156 -70375 -69563 -65887 -62242 -64322 -69384 -71583
-11347g1583j12j12l332K393J841j017j912j912j376j375j376j375J841J845K382l343m775
$$ -71583 -71695 -71807 -75139 -72746 -70905 -71922 -73834 -75746 -77122 -78497 -79873 -81248 -79407 -77562 -75180 -78523 -83298
-11330h3298j912Q91Q90M443M447l24l24K836K837l843l843j014j010j010j010P19P19P20
$$ -83298 -85210 -84319 -83429 -78986 -74539 -74863 -75187 -72351 -69514 -73357 -77200 -78214 -79224 -80234 -81244 -80525 -79806 -79086
-11312g9086P19j439j438j260j260r02J961L570k154J275J274k75o001k125L601J632j230
$$ -79086 -78367 -79806 -81244 -82504 -83764 -84666 -82705 -79135 -81289 -80014 -78740 -79015 -85016 -87141 -83540 -81908 -83138
-11295h3138O79O78L362L362Q2Q2Q2Q2j588j588j587j588k602k602J871J872K404k363L16
$$ -83138 -82459 -81781 -78419 -75057 -74975 -74893 -74811 -74729 -76317 -77905 -79492 -81080 -83682 -86284 -84413 -82541 -80137 -82500 -82184
-11276h2184L21j830j827j826j827M96N00M95N00L120L123L124L123m21m17m21m18K95K98
$$ -82184 -81863 -83693 -85520 -87346 -89173 -88677 -88177 -87682 -87182 -84062 -80939 -77815 -74692 -75113 -75530 -75951 -76369 -76074 -75776
-11257g5776K98K98j345j342m328M47K591k177Q05Q05l46l47l47l46j241j242J443J442J860
$$ -75776 -75478 -75180 -76525 -77867 -82195 -81748 -79157 -81334 -80529 -79724 -80070 -80417 -80764 -81110 -82351 -83593 -82150 -80708 -78848
-11238g8848j002k076K694P27P27J025J025k941k941k941k941M097M096o74o75k240k240K531
$$ -78848 -79850 -81926 -79232 -78505 -77778 -76753 -75728 -78669 -81610 -84551 -87492 -83395 -79299 -79973 -80648 -82888 -85128 -82597
-11220h2597K530J219J219J219J219j338j335j338j334j219j215l903Q72J301J305j264j260
$$ -82597 -80067 -78848 -77629 -76410 -75191 -76529 -77864 -79202 -80536 -81755 -82970 -86873 -86001 -84700 -83395 -84659 -85919
-11203h5919N118N122j562j558P64P68k099k095j90j86j90j86R13R17R13R17P34P38P34P38
$$ -85919 -80801 -75679 -77241 -78799 -78035 -77267 -79366 -81461 -81651 -81837 -82027 -82213 -81300 -80383 -79470 -78553 -77819 -77081 -76347 -75609
-11183g5609P09P12k155k151p23p19J185j673k662K114Q57k002L959L962J871k896j476J390
$$ -75609 -74900 -74188 -76343 -78494 -79217 -79936 -78751 -80424 -83086 -80972 -80115 -82117 -78158 -74196 -72325 -75221 -76697 -75307
-11165g5307n21n19j177j175j177j175j237j234L534O74L14N087R70j890q72q69J513J517
$$ -75307 -75828 -76347 -77524 -78699 -79876 -81051 -82288 -83522 -79988 -79314 -79000 -73913 -72943 -74833 -75705 -76574 -75061 -73544
-11147g3544J872k897m689j822k021k016K930K933J200J204J022J025k856n714k90M484K154
$$ -73544 -71672 -74569 -79258 -81080 -83101 -85117 -82187 -79254 -78054 -76850 -75828 -74803 -77659 -83373 -83663 -79179 -77025
-11130g7025p04l392l389P09L574M645j23o64o60J901J905n18n18K643K642m096O75k010k009
$$ -77025 -77729 -81121 -84510 -83801 -80227 -75582 -75705 -76369 -77029 -75128 -73223 -73741 -74259 -71616 -68974 -73070 -72395 -74405 -76414
-11111g6414k575k576k576k575N25N26k337k337K068K069p94p94J01J01L98L99m88M283M461
$$ -76414 -78989 -81565 -84141 -86716 -86191 -85665 -88002 -90339 -88271 -86202 -86996 -87790 -87689 -87588 -87190 -86791 -87279 -82996 -78535
-11092g8535M462J003J003J002J003j588j588j588j588j409j409j409j408K877K878k669K102
$$ -78535 -74073 -73070 -72067 -71065 -70062 -71650 -73238 -74826 -76414 -77823 -79232 -80641 -82049 -79172 -76294 -78963 -76861
-11075g6861k072k073j774j774J133J133p75K087K266k505K267n97k616K154J081j782p67
$$ -76861 -78933 -81006 -82780 -84554 -83421 -82288 -83063 -80976 -78710 -81215 -78948 -79545 -82161 -80007 -78926 -80708 -81475
-11058h1475K094L06L06m51m48k359N07L902q64k300N66j129J737M596J737K807n3j487j483
$$ -81475 -79381 -79075 -78769 -79220 -79668 -82027 -81520 -77618 -78482 -80782 -80216 -81345 -79608 -75012 -73275 -70468 -70521 -72008 -73491
-11039g3491j078j073j077j074j256j252j256j253j241j238j241j237k136k132P27P30Q09
$$ -73491 -74569 -75642 -76719 -77793 -79049 -80301 -81557 -82810 -84051 -85289 -86530 -87767 -89903 -92035 -91308 -90578 -89769
-11022h9769Q09Q09Q09K72K72K72K72J853J852J853J852l276l277J495J495k319k318N44N44
$$ -89769 -88960 -88151 -87342 -87070 -86798 -86526 -86254 -84401 -82549 -80696 -78844 -82120 -85397 -83902 -82407 -84726 -87044 -86500 -85956
-11003h5956J558J558k020L705M033j692o19o19m018J707M809M808J972l754K330K330k322
$$ -85956 -84398 -82840 -84860 -81155 -77122 -78814 -79433 -80052 -84070 -82363 -77554 -72746 -70774 -74528 -72198 -69868 -72190
-10986g2190k323j964j964j338M387K598k65J823j040n811k949j230J633L064L064k900k900
$$ -72190 -74513 -76477 -78441 -79779 -75392 -72794 -73059 -71236 -72276 -78087 -81036 -82266 -80633 -77569 -74505 -77405 -80305
-10969h0305k900k900k363k363K408K408l96l95K468K467K080K080J186j678n733pK974J12
$$ -80305 -83205 -86105 -88468 -90831 -88423 -86015 -86411 -86806 -84338 -81871 -79791 -77711 -76525 -78203 -83936 -83943 -80969 -80857
-10951h0857R77R76k065k065j170j170j171j170J878J879r24l787q65M860J462J461J5J5K698
$$ -80857 -79880 -78904 -80969 -83034 -84204 -85374 -86545 -87715 -85837 -83958 -84882 -88669 -89534 -84674 -83212 -81751 -81736 -81721 -79023
-10932g9023K699j953m816j655M070N07N07j998j998k68k68k69k68R99R99j864j864o71o71
$$ -79023 -76324 -78277 -83093 -84748 -80678 -80171 -79664 -81662 -83660 -83928 -84196 -84465 -84733 -83734 -82735 -84599 -86463 -87134 -87805
-10913h7805K192K192J021J021J022J021J797J796j066j066m465m466j602j603K870K870K870
$$ -87805 -85613 -83421 -82400 -81379 -80357 -79336 -77539 -75743 -76809 -77875 -82340 -86806 -88408 -90011 -87141 -84271 -81401
-10896h1401K870n22n18l384l381j238j233J625J629K848K851K848K851N22N26q50o572l20
$$ -81401 -78531 -79053 -79571 -82955 -86336 -87574 -88807 -87182 -85553 -82705 -79854 -77006 -74155 -73633 -73107 -73957 -80529 -80849
-10878h0849K546L436L441l124l120l123l120j007j002J856J860o49o44J319j539j324M402
$$ -80849 -78303 -74867 -71426 -74550 -77670 -80793 -83913 -84920 -85922 -84066 -82206 -82855 -83499 -82180 -83719 -85043 -80641
-10861h0641K613k49k039k039O45O45l560l560l559l560M96M95L359L358K449K449K449K449
$$ -80641 -78028 -78277 -80316 -82355 -81710 -81065 -84625 -88185 -91744 -95304 -94808 -94313 -90954 -87596 -85147 -82698 -80249 -77800
-10843g7800n33n33L045k680n244M80J674J674q91q91L522L523K173l549k836k833m626J103
$$ -77800 -78333 -78866 -75821 -78501 -83745 -83265 -81591 -79917 -80808 -81699 -78177 -74654 -72481 -76030 -78866 -81699 -86325 -85222
-10825h5222P42P46o60o56l522l519K918K923L634k087r96M734J689m033j950R17k665K01
$$ -85222 -84480 -83734 -84394 -85050 -88572 -92091 -89173 -86250 -82616 -84703 -85699 -80965 -79276 -83309 -85259 -84342 -87007 -86806
-10807h6806R81R84M022M025j226j223j226j223k892k893L609L608M323J462J520m204k214
$$ -86806 -85825 -84841 -80819 -76794 -78020 -79243 -80469 -81692 -84584 -87477 -83868 -80260 -75937 -74475 -72955 -77159 -79373
-10790g9373k214K90K91r02r02r02r02j1j1L46L47l947J778L030J68q76q76j055j055J271
$$ -79373 -81587 -81297 -81006 -81908 -82810 -83712 -84614 -84625 -84636 -84290 -83943 -87890 -86112 -83082 -82914 -83790 -84666 -85721 -86776 -85505
-10770h5505J271J271J271o11o11o12o11K83K84N829J059j655j655R10R09O71O71M92M92m88
$$ -85505 -84234 -82963 -81692 -82303 -82914 -83526 -84137 -83854 -83570 -77741 -76682 -78337 -79992 -79082 -78173 -77502 -76831 -76339 -75847 -76335
-10750g6335l351m604J68K852j2k575K87N25N26P04P05R43R43j920j919K01K05K01K05r91
$$ -76335 -79686 -84290 -84122 -81270 -81282 -83857 -83570 -83045 -82519 -81815 -81110 -80167 -79224 -81144 -83063 -82862 -82657 -82456 -82251 -83242
-10730h3242r88o93o90l586J189J365J368J722J725J722J726j871j867j871j868K76K79K76
$$ -83242 -84230 -84923 -85613 -89199 -88010 -86645 -85277 -83555 -81830 -80108 -78382 -80253 -82120 -83991 -85859 -85583 -85304 -85028
-10712h5028K80M55M58M55M58J648J651J648J651l02k98l02k98N33N36m238m234j703j700
$$ -85028 -84748 -84293 -83835 -83380 -82922 -81274 -79623 -77975 -76324 -76626 -76924 -77226 -77524 -76991 -76455 -80693 -84927 -86630 -88330
-10693h8330K889K892Q01k057l314J461M935K077p91p86j34j31m905m901r70r65r69r66k698
$$ -88330 -85441 -82549 -81748 -83805 -87119 -85658 -80723 -78646 -79437 -80223 -80357 -80488 -85393 -90294 -91264 -92229 -93198 -94164 -96862
-10674i6862k695K072K076O087O087n92n93m052m051P19P19L4L3K897K896O89O90O89O90R92
$$ -96862 -99557 -97485 -95409 -89322 -83235 -83827 -84420 -88472 -92523 -91804 -91085 -91051 -91018 -88121 -85225 -84536 -83846 -83157 -82467 -81475
-10654h1475R91j692j692J051L913M988K16m406m406J976J975j066j066J439J439L082k642
$$ -81475 -80484 -82176 -83868 -82817 -78904 -73916 -73700 -78106 -82512 -80536 -78561 -79627 -80693 -79254 -77815 -74733 -77375
-10637g7375m194m193j152j152j151j152M096M097J055J054J831j033j38N588K076l649p1
$$ -77375 -81569 -85762 -86914 -88066 -89217 -90369 -86273 -82176 -81121 -80067 -78236 -79269 -79407 -73819 -71743 -75392 -75463
-10620g5463p1r06r06r05r06l083l082J927P652J331m395l679l679P61P64P60P64m32m29l295
$$ -75463 -75534 -76440 -77346 -78251 -79157 -82240 -85322 -83395 -75743 -74412 -78807 -82486 -86165 -85404 -84640 -83880 -83116 -83548 -83977 -87272
-10600h7272l291P31P34K699j61n21N207J983l739k24l082J029J032r39r36r39r36M92M96
$$ -87272 -90563 -89832 -89098 -86399 -86560 -87081 -81874 -79891 -83630 -83854 -86936 -85907 -84875 -85814 -86750 -87689 -88625 -88133 -87637
-10581h7637O71O75q80J987L772j950m014j152j8N706L739j987j271j271k643k642k643k643
$$ -87637 -86966 -86291 -87171 -85184 -81412 -83362 -87376 -88528 -88546 -82840 -79101 -81088 -82359 -83630 -86273 -88915 -91558 -94201
-10563i4201J771J770j629M097M156J293j509j510o15o15o15o15M395M394k285k285P57P57
$$ -94201 -92430 -90660 -92289 -88192 -84036 -82743 -84252 -85762 -86377 -86992 -87607 -88222 -83827 -79433 -81718 -84003 -83246 -82489
-10545h2489L619L619j811j808Q72Q76N15k345j096M633n89n85L168k553m048j181k91k87
$$ -82489 -78870 -75251 -77062 -78870 -77998 -77122 -76607 -78952 -80048 -75415 -76004 -76589 -73421 -75974 -80022 -81203 -81494 -81781
-10527h1781k61k57k61k57j096j092L675L679K16K20L95L99j991Q76K781k941m473K98q34
$$ -81781 -82042 -82299 -82560 -82817 -83913 -85005 -81330 -77651 -77435 -77215 -76820 -76421 -78412 -77536 -74755 -77696 -82169 -81871 -82705
-10508h2705l698k445K326M234M234l921l921p61p60k609K162K341K340L325L325j446j446
$$ -82705 -86403 -88848 -86522 -82288 -78054 -81975 -85896 -86657 -87417 -90026 -87864 -85523 -83183 -79858 -76533 -77979 -79425
-10491g9425J416J416J417J416%%%%m17m18m17m18l835l832R36R39K307K311k464k460k046
$$ -79425 -78009 -76593 -75176 -73760 -73760 -73760 -73760 -73760 -74177 -74595 -75012 -75430 -79265 -83097 -82161 -81222 -78915 -76604 -79068 -81528 -83574
-10470h3574k043Q17Q20J00J05J00J05N25N30N25N29j144j140j145j140J405J409J405J409
$$ -83574 -85617 -84800 -83980 -83880 -83775 -83675 -83570 -83045 -82515 -81990 -81461 -82605 -83745 -84890 -86030 -84625 -83216 -81811 -80402
-10451h0402K72K76K72K76L060L060l619l619l620l619L060L060J346J346J345J346j815j816
$$ -80402 -80130 -79854 -79582 -79306 -76246 -73186 -76805 -80424 -84044 -87663 -84603 -81543 -80197 -78851 -77506 -76160 -77975 -79791
-10433g9791J048J047k822k821M1M1j331j331J532J532p94p93p94p94k58k57K606K605K814
$$ -79791 -78743 -77696 -80518 -83339 -83298 -83257 -84588 -85919 -84387 -82855 -83649 -84442 -85236 -86030 -86288 -86545 -83939 -81334 -78520
-10414g8520K818m8m5P27P31M28M33P26m040n833n830l47M428J741l027m901k035M163J305
$$ -78520 -75702 -75750 -75795 -75068 -74337 -73909 -73476 -72750 -76790 -82623 -88453 -88800 -84372 -82631 -85658 -90559 -92594 -88431 -87126
-10395h7126J837j021k277K497K971K974l410l407K016K021K016K020M5M9M4M9j268j263L504
$$ -87126 -85289 -86310 -88587 -86090 -83119 -80145 -83555 -86962 -84946 -82925 -80909 -78889 -78844 -78795 -78751 -78702 -79970 -81233 -77729
-10376g7729L507O56O60m115m112m17m14m17m14Q65Q68Q65Q69Q64Q69Q65Q68j059j054j059
$$ -77729 -74222 -73566 -72906 -77021 -81133 -81550 -81964 -82381 -82795 -81930 -81062 -80197 -79328 -78464 -77595 -76730 -75862 -76921 -77975 -79034
-10356g9034j055j058j055j059j055L4L3L4L3L92L91j517J346K076k695J241M104K374m88
$$ -79034 -80089 -81147 -82202 -83261 -84316 -84282 -84249 -84215 -84182 -83790 -83399 -84916 -83570 -81494 -84189 -82948 -78844 -76470 -76958
-10337g6958J301J301l239l239l77l76R95R95j867j868k389k389M73M74O52O52O52O53K307
$$ -76958 -75657 -74356 -77595 -80834 -81211 -81587 -80592 -79597 -81464 -83332 -85721 -88110 -87637 -87163 -86511 -85859 -85207 -84554 -82247
-10318h2247K307n55n56m36m36l299l298j38j38j38j38K128K129K128K128j241j241J621M485
$$ -82247 -79940 -80495 -81051 -81487 -81923 -85222 -88520 -88658 -88796 -88934 -89072 -86944 -84815 -82687 -80559 -81800 -83041 -81420 -76935
-10299g6935N259M88l328l329Q46Q46k016k017J204J204j659j658P41P42m029m029K650K650
$$ -76935 -71676 -71188 -74516 -77845 -76999 -76153 -78169 -80186 -78982 -77778 -79437 -81095 -80354 -79612 -83641 -87670 -85020 -82370
-10281h2370k121k121j480j479L291L291J622J621j241j241K993K993J204l567m522K50J920
$$ -82370 -84491 -86612 -88092 -89571 -86280 -82989 -81367 -79746 -80987 -82228 -79235 -76242 -75038 -78605 -83127 -82877 -80957
-10264h0957r43j003J860j539J323J979J979p04p05j401j398L370L373J878J883J878J883
$$ -80957 -81900 -82903 -81043 -82582 -81259 -79280 -77301 -78005 -78710 -80111 -81509 -78139 -74766 -72888 -71005 -69127 -67244
-10247f7244l221l216p16p12K863k859n726Mq87q83n30n25R61R66R61R66L50L54pmK498l225
$$ -67244 -70465 -73681 -74397 -75109 -72246 -75105 -80831 -80827 -81714 -82597 -83127 -83652 -82691 -81725 -80764 -79798 -79448 -79094 -79101 -79105 -76607 -79832
-10225g9832pmj058j059j059j054O11O15O11O15K550K549K550K553p4p1p5p1k691k691k333
$$ -79832 -79839 -79843 -80901 -81960 -83019 -84073 -83462 -82847 -82236 -81621 -79071 -76522 -73972 -71419 -71493 -71564 -71639 -71710 -74401 -77092 -79425
-10204g9425k330r02M827M823q98j156j155j513j510r77r72J886J889l54l54MMj428M298j786
$$ -79425 -81755 -82657 -77830 -73007 -73905 -75061 -76216 -77729 -79239 -80216 -81188 -79302 -77413 -77767 -78121 -78117 -78113 -79541 -75243 -77029
-10184g7029j785N85N85K28K27L030k694k338k337J204J204j658j659O67O67O67O68l627l627
$$ -77029 -78814 -78229 -77644 -77416 -77189 -74159 -76853 -79191 -81528 -80324 -79120 -80778 -82437 -81770 -81103 -80436 -79768 -83395 -87022
-10165h7022m06m06J084O810M305j420o922j196L813L813J845J845J488J491M976p50m208
$$ -87022 -87428 -87834 -86750 -79940 -75635 -77055 -83977 -85173 -81360 -77547 -75702 -73857 -72369 -70878 -65902 -66652 -70860
-10148g0860m208j882j883R81R84K702K702j60j60k606k605k606k601K300K299L016k710m082
$$ -70860 -75068 -76950 -78833 -77852 -76868 -74166 -71464 -71624 -71784 -74390 -76995 -79601 -82202 -79902 -77603 -74587 -77297 -81379
-10130h1379J644K837K840J212J215l560l556j264j259M819r02p42p38L32L35j785j782K986
$$ -81379 -79735 -76898 -74058 -72846 -71631 -75191 -78747 -80011 -81270 -76451 -77353 -78095 -78833 -78501 -78166 -79951 -81733 -78747
-10112g8747K989o22o19o22o19j517j513j517j514Q98R03j070J796K091l630l455K273L068
$$ -78747 -75758 -76380 -76999 -77621 -78240 -79757 -81270 -82787 -84301 -83403 -82500 -83570 -81774 -79683 -83313 -86768 -84495 -81427
-10094h1427L068L067L068L485k240k181n043m148m149j465j465J935J934M797M798r58r58
$$ -81427 -78359 -75292 -72224 -68739 -70979 -73160 -78203 -82351 -86500 -87965 -89430 -87495 -85561 -80764 -75966 -76924 -77882
-10077g7882r58r58l195l194l32l31L559L560K128K129j68j68j68j67l284l284J845J845k270
$$ -77882 -78840 -79798 -82993 -86187 -86519 -86850 -83291 -79731 -77603 -75474 -75642 -75810 -75978 -76145 -79429 -82713 -80868 -79023 -81293
-10058h1293L455k627k628l090l090k28k27K039K039K039K039R13R13J092J092n050k188M372
$$ -81293 -77838 -80465 -83093 -86183 -89273 -89501 -89728 -87689 -85650 -83611 -81572 -80659 -79746 -78654 -77562 -82612 -84800 -80428
-10040h0428j353l500o38K58K57J062J062L47O072K710l016J995J994k240k241o30o29l180
$$ -80428 -81781 -85281 -85919 -85661 -85404 -84342 -83280 -82933 -76861 -74151 -77167 -75172 -73178 -75418 -77659 -78289 -78918 -82098
-10022h2098l17M514j211m790R36N348l76j092j092j9j9m66m65l866J860N185K322k091P72
$$ -82098 -82415 -77901 -79112 -83902 -82966 -77618 -77994 -79086 -80178 -80197 -80216 -80682 -81147 -85013 -83153 -77968 -75646 -77737 -76965
-10003g6965l582l582L276L276k359k356N03N07R51R54K382K385J905J909r58r55l969l966
$$ -76965 -80547 -84129 -80853 -77577 -79936 -82292 -81789 -81282 -80331 -79377 -76995 -74610 -72705 -70796 -71754 -72709 -76678 -80644
-9985h0644Q01k057k658K117K114K117N92N97n41n36l92M384L604P45m118O56m21M353L206
$$ -80644 -79843 -81900 -84558 -82441 -80327 -78210 -77618 -77021 -77562 -78098 -78490 -74106 -70502 -69757 -73875 -73219 -73640 -69287 -66081
-9966f6081j562l474o333j386J479K252K255J416l351N82L448K370K375m130m127k31k27n002
$$ -66081 -67643 -71117 -77450 -78836 -77357 -75105 -72850 -71434 -74785 -74203 -70755 -68385 -66010 -70140 -74267 -74498 -74725 -79727
-9948g9727m999j12j08j12j08n2m8K631k135m70m66p68p64K471K475k300k296k42k39k42k38
$$ -79727 -84726 -84838 -84946 -85058 -85166 -85218 -85266 -82635 -84770 -85240 -85706 -86474 -87238 -84767 -82292 -84592 -86888 -87130 -87369 -87611 -87849
-9927h7849J308J312M052J193L604j163l135l131l951Q24K907K911J029J033j834j830M47
$$ -87849 -86541 -85229 -81177 -79984 -76380 -77543 -80678 -83809 -87760 -86936 -84029 -81118 -80089 -79056 -80890 -82720 -82273
-9910h2273M51r84r80K236K240k534k531L925L925K493K494l142l143k79k80l39l39l39l39
$$ -82273 -81822 -82806 -83786 -81550 -79310 -81844 -84375 -80450 -76525 -74032 -71538 -74680 -77823 -78102 -78382 -78721 -79060 -79399 -79738
-9891g9738k397k397M66M66k31k31J498J499n271m99L496L496n390n390o18o19O93O94O93
$$ -79738 -82135 -84532 -84066 -83600 -83831 -84062 -82564 -81065 -86336 -86835 -83339 -79843 -85233 -90623 -91241 -91860 -91167 -90473 -89780
-9872h9780O93J812J811J812J811J812J811J812J811L020L019L019L019n688n688n807j036
$$ -89780 -89087 -87275 -85464 -83652 -81841 -80029 -78218 -76406 -74595 -71575 -68556 -65537 -62518 -68206 -73894 -79701 -80737
-9855h0737K132k639j268J596K490K489j93j94l847l847R25R24j938j938l0k893l216J558
$$ -80737 -78605 -81244 -82512 -80916 -78426 -75937 -76130 -76324 -80171 -84018 -83093 -82169 -84107 -86045 -86075 -88968 -92184 -90626
-9837i0626L164L06M357M361J316J320j681j678j681j677j90j87j90j86K76K79K76K80p98
$$ -90626 -87462 -87156 -82799 -78438 -77122 -75802 -77483 -79161 -80842 -82519 -82709 -82896 -83086 -83272 -82996 -82717 -82441 -82161 -82959
-9818h2959p94K065K069N285N289K423K427m436m432L36L39Q05Q05L489j282k475k475Q9R0
$$ -82959 -83753 -81688 -79619 -74334 -69045 -66622 -64195 -68631 -73063 -72727 -72388 -71583 -70778 -67289 -68571 -71046 -73521 -73432 -73342
-9799g3342Q35Q35n845n845m17m17m18m17M327M328J465J464K181K180K181K181j279j278
$$ -73342 -72507 -71672 -77517 -83362 -83779 -84196 -84614 -85031 -80704 -76376 -74911 -73447 -71266 -69086 -66905 -64724 -66003 -67281
-9781f7281m440m439L791r81k948q6M62k400o11o12Q20Q20L683L683M62M62k400k401N82N81
$$ -67281 -71721 -76160 -72369 -73350 -76298 -76384 -75922 -78322 -78933 -79545 -78725 -77905 -74222 -70539 -70077 -69615 -72015 -74416 -73834 -73253
-9761g3253N82N81q65q64q65q65K714K713K714K713j192j193j193j193p75p75p76p75J465
$$ -73253 -72671 -72090 -72955 -73819 -74684 -75549 -72835 -70122 -67408 -64695 -65887 -67080 -68273 -69466 -70241 -71016 -71792 -72567 -71102
-9742g1102J465l306l307j875j874n096O30L985L984k337k337J957J957J957J957J785J786
$$ -71102 -69637 -72943 -76250 -78125 -79999 -85095 -84465 -80480 -76496 -78833 -81170 -79213 -77256 -75299 -73342 -71557 -69771
-9725f9771p20p19J75N900J130m596k479k478K6K6K054K053q09q08l84l84p42M984k7k6L32
$$ -69771 -70491 -71210 -71035 -65135 -64005 -68601 -71080 -73558 -73532 -73506 -71452 -69399 -70208 -71016 -71400 -71784 -72526 -67542 -67569 -67595 -67263
-9704f7263L32l24l25l24l24j040j040j040j040J271J271J271J271J271J271J271J271j457
$$ -67263 -66931 -67255 -67580 -67904 -68228 -69268 -70308 -71348 -72388 -71117 -69846 -68575 -67304 -66033 -64762 -63491 -62220 -63677
-9686f3677j458j457j457K12K13K12K13q02q01q02q01K180K181o82o82K031K032k740k740
$$ -63677 -65135 -66592 -68049 -67837 -67624 -67412 -67199 -68001 -68802 -69604 -70405 -68225 -66044 -66726 -67408 -65377 -63345 -66085 -68825
-9667f8825k024k024Q39Q39l836l835J174O899M276j450k643k643k717k717N512N513N215
$$ -68825 -70849 -72873 -72034 -71195 -75031 -78866 -77692 -70793 -66517 -67967 -70610 -73253 -75970 -78687 -73175 -67662 -62447
-9650f2447n11j53j52j46j41L075k647l187l183J226J231K27K31k635k632R43R47N85N89m29
$$ -62447 -62958 -63111 -63263 -63409 -63550 -60475 -63122 -66309 -69492 -68266 -67035 -66808 -66577 -69212 -71844 -70901 -69954 -69369 -68780 -69209
-9630f9209o150k933k930J420J424J420J424J480J483l291l288Q24Q28k039k035n953n953
$$ -69209 -75359 -78292 -81222 -79802 -78378 -76958 -75534 -74054 -72571 -75862 -79150 -78326 -77498 -79537 -81572 -87525 -93478
-9613i3478K636K635M28M29M29M28j450j449J412J413J770J771j033l895l448K278J741J740
$$ -93478 -90842 -88207 -87779 -87350 -86921 -86493 -87943 -89392 -87980 -86567 -84797 -83026 -84059 -87954 -91402 -89124 -87383 -85643
-9595h5643P87P86k076k076K337K337k076k076l687K039j181j182K784K785k047Q17J412m312
$$ -85643 -84856 -84070 -86146 -88222 -85885 -83548 -85624 -87700 -91387 -89348 -90529 -91711 -88927 -86142 -88189 -87372 -85960 -90272
-9577i0272r13r14J786J785J786J785J786J785J785J786J97J98J9J8M36k426j01n826m275
$$ -90272 -91185 -92099 -90313 -88528 -86742 -84957 -83171 -81386 -79601 -77815 -77618 -77420 -77401 -77383 -76947 -79373 -79474 -85300 -89575
-9558h9575J450j055J808M670J808l083l082K218K221o45o41N48N52N48N51L068L071K710
$$ -89575 -88125 -89180 -87372 -82702 -80894 -83977 -87059 -84841 -82620 -83265 -83906 -83358 -82806 -82258 -81707 -78639 -75568 -72858
-9540g2858K714j53n874o057l28J054j804j628J237K367m92l478l474K814K818m8m5j360j357
$$ -72858 -70144 -70297 -76171 -82228 -82556 -81502 -83306 -84934 -83697 -81330 -81822 -85300 -88774 -85960 -83142 -83190 -83235 -84595 -85952
-9521h5952j361j356J826J827J826J826j274j275J588J588n45n44K319K318j737j737J126
$$ -85952 -87313 -88669 -86843 -85016 -83190 -81364 -82638 -83913 -82325 -80737 -81282 -81826 -79507 -77189 -78926 -80663 -79537
-9504g9537J125n96n96j133M592M652J789j014j014m875m876J804J804k132k132M547M548
$$ -79537 -78412 -79008 -79604 -80737 -76145 -71493 -69704 -70718 -71732 -76607 -81483 -79679 -77875 -80007 -82139 -77592 -73044
-9487g3044L65L69k497k494j364j360J498J502J648J651K005K009p97M931O120O124J0378
$$ -73044 -72679 -72310 -74807 -77301 -78665 -80025 -78527 -77025 -75377 -73726 -71721 -69712 -70509 -65578 -59458 -53334 -42956
-9470d2956M655k624k620n606n603n606n602n203n200n204n199N81N85N82N85L168L172L06
$$ -42956 -38301 -40925 -43545 -49151 -54754 -60360 -65962 -71165 -76365 -81569 -86768 -86187 -85602 -85020 -84435 -81267 -78095 -77789
-9452g7789L09p68p64M004M007m391m387m391m388L780L783L422L426L20n401k184k181k184
$$ -77789 -77480 -78248 -79012 -75008 -71001 -75392 -79779 -84170 -88558 -84778 -80995 -77573 -74147 -73827 -79228 -81412 -83593 -85777
-9434h5777k180O78O82R32R36j931j927q2p9K423K427K870k852L66L69J975J979q87q83J12
$$ -85777 -87957 -87279 -86597 -85665 -84729 -86660 -88587 -88669 -88748 -86325 -83898 -81028 -83880 -83514 -83145 -81170 -79191 -80078 -80961 -80849
-9414h0849J15K975K978j86j83N29n192l787J942J938l783j640M089N07N10L936L940J074
$$ -80849 -80734 -77759 -74781 -74967 -75150 -74621 -79813 -83600 -81658 -79720 -83503 -85143 -81054 -80547 -80037 -76101 -72161 -71087
-9396g1087J077N37N40N37N40j010j010j010j010J256J256j606p332p302K240N103N103J345
$$ -71087 -70010 -69473 -68933 -68396 -67856 -68866 -69876 -70886 -71896 -70640 -69384 -70990 -78322 -85624 -83384 -78281 -73178 -71833
-9378g1833J346j517j517l135l135l134l135q69q68J994J994L933L932L932L933J964J965
$$ -71833 -70487 -72004 -73521 -76656 -79791 -82925 -86060 -86929 -87797 -85803 -83809 -79876 -75944 -72012 -68079 -66115 -64150
-9361f4150J606J607Q386K662M868P730R937J9480K7887L7431N8722P2080O6833L0572Q386
$$ -64150 -62544 -60937 -52551 -49889 -45021 -37291 -27354 -7874 20013 57444 116166 188246 255079 285651 294037
-9346B94037j155j3859l8668o2270o5132n0045l6685k2551j3007q953q954r236r237o374o373
$$ 294037 292882 279023 240355 178085 112953 62908 26223 3672 -9335 -18288 -27242 -36478 -45715 -52089 -58462
-9331e8462n30n29l392l392k069k068q76M849J987l739j770J092L02L02k382k382n6n6n6n6
$$ -58462 -58992 -59521 -62913 -66305 -68374 -70442 -71318 -66469 -64482 -68221 -69991 -68899 -68597 -68295 -70677 -73059 -73115 -73171 -73227 -73283
-9311g3283J667J666J666J666k091k091k091k091N03N03k359k360j465j465J398J398j60j57
$$ -73283 -71616 -69950 -68284 -66618 -68709 -70800 -72891 -74982 -74479 -73976 -76335 -78695 -80160 -81625 -80227 -78829 -78989 -79146
-9293g9146K703K706j831j826j830j827j159j155j159j156l843l839R28R32L880L884L880
$$ -79146 -76443 -73737 -75568 -77394 -79224 -81051 -82210 -83365 -84524 -85680 -89523 -93362 -92434 -91502 -87622 -83738 -79858
-9276g9858L884K032K035K389l332m991m987k487k482l321l318L359L362L392L392j737j737
$$ -79858 -75974 -73942 -71907 -69518 -72850 -77841 -82828 -85315 -87797 -91118 -94436 -91077 -87715 -84323 -80931 -82668 -84405
-9259h4405K616l108l109K617O63O64k021k020J737j126k556L168j953R09M130J267K162K162
$$ -84405 -81789 -84897 -88006 -85389 -84726 -84062 -86083 -88103 -86366 -87492 -90048 -86880 -88833 -87924 -83794 -82527 -80365 -78203
-9241g8203J983J983o26o26o26o27L728L727j044j043p49p46p49p46M44M47Q6Q9K770k952
$$ -78203 -76220 -74237 -74863 -75489 -76115 -76742 -73014 -69287 -70331 -71374 -72123 -72869 -73618 -74364 -73920 -73473 -73387 -73298 -70528 -73480
-9221g3480m566j700L962j759j226j223J562J565j658M070M424M429M603M607k121m980m745
$$ -73480 -78046 -79746 -75784 -77543 -78769 -79992 -78430 -76865 -78523 -74453 -70029 -65600 -60997 -56390 -58511 -63491 -68236
-9204f8236j0466n938l071n401L28J047J051J405J409J584J588J584J588l321l317l321l318
$$ -68236 -78702 -84640 -87711 -93112 -92784 -91737 -90686 -89281 -87872 -86288 -84700 -83116 -81528 -84849 -88166 -91487 -94805
-9187i4805r95r91L775L780m21m18m21m17M73M77K442m18O08O336l46o069l507o41K456N323
$$ -94805 -95800 -96791 -93016 -89236 -89657 -90075 -90496 -90913 -90440 -89963 -87521 -87939 -87331 -80995 -81341 -87410 -90917 -91558 -89102 -83779
-9167h3779l474l470j5N714N054K196J297J301K624K628l877l873J074L940j253M477J5n707
$$ -83779 -87253 -90723 -90738 -85024 -79970 -77774 -76477 -75176 -72552 -69924 -73801 -77674 -76600 -72660 -73913 -69436 -69421 -75128
-9149g5128l742q76j357j353J685J689J804J807J804J808n770n766k550k545l802J927L474
$$ -75128 -78870 -79746 -81103 -82456 -80771 -79082 -77278 -75471 -73667 -71859 -77629 -83395 -85945 -88490 -92292 -90365 -86891
-9132h6891L477L474L478P90P94M62L329K251l470k222O45L146K87N00N03k721k717p53l612
$$ -86891 -83414 -79940 -76462 -75672 -74878 -74416 -71087 -68836 -72306 -74528 -73883 -70737 -70450 -69950 -69447 -72168 -74885 -75638 -79250
-9113g9250k721L008J647m074m972k106K244K247K423K427%M%L%M%MJ670J673J670J674J848
$$ -79250 -81971 -78963 -77316 -81390 -86362 -88468 -86224 -83977 -81554 -79127 -79127 -79123 -79123 -79120 -79120 -79116 -79116 -79112 -77442 -75769 -74099 -72425 -70577
-9090g0577J853J849J852j465j464J040J039R81m745j167j167l686K039K039l687J860J860
$$ -70577 -68724 -66875 -65023 -66488 -67952 -66912 -65873 -64892 -69637 -70804 -71971 -75657 -73618 -71579 -75266 -73406 -71546
-9073g1546l269l269m65m66m66m66K158K158N021N021L052L053L053L053o45o45o45o45M160
$$ -71546 -74815 -78084 -78549 -79015 -79481 -79947 -77789 -75631 -70610 -65589 -62537 -59484 -56431 -53378 -54023 -54668 -55313 -55958 -51798
-9054e1798M164o12o07o71o67l892J838J983J987K340K345M786M790M786M789M891M894K027
$$ -51798 -47634 -48246 -48853 -49524 -50191 -54083 -52245 -50262 -48275 -45935 -43590 -38804 -34014 -29228 -24439 -19548 -14654 -12627
-9036a2627K032j670j666k028L701O441O444P395P399L042J2587K0218K5946L5455L5459L2950
$$ -12627 -10595 -12265 -13931 -15959 -12258 -5817 627 8022 15421 18463 31050 51268 77214 112669 148128 181078
-9020A81078L2954L0923L0926L6887M6432N6209O9572R6525J44240K22362L54048N47511P89886
$$ 181078 214032 244955 275881 312768 359200 415409 484981 581506 725746 948108 1302156 1849667 2639553
-9007B639553J007394J116176J048903Q59969N58078o2162o47812r81787j179788j101541
$$ 2639553 3646947 4763123 5812026 6671995 7230073 7167911 6520099 5538312 4358524 3256983
-8997C256983q64658o14653m27508k95825k10900j51740j17163q4720o7783m6790l1284k5559
$$ 3256983 2392325 1777672 1350164 1054339 843439 691699 574536 489816 422033 375243 343959 318400
-8985C18400j6971j6971k6334k6334l0748l0747k7825k2100k0191k0192j5267r539j2762j2759
$$ 318400 301429 284458 258124 231790 201042 170295 142470 120370 100179 79987 64720 55181 42419 29660
-8971B9660j1749j1745o619o616q051k322J133J137J968J972q95q91p83p79K080K084k155
$$ 29660 17911 6166 -453 -7069 -15120 -17442 -16309 -15172 -13204 -11232 -12127 -13018 -13801 -14580 -12500 -10416 -12571
-8954a2571k150j797j793k244L485L482L485J036O765J1890K1436K8164M9157O4067P3609
$$ -12571 -14721 -16518 -18311 -20555 -17070 -13588 -10103 -9067 -2302 9588 31024 59188 108345 172412 246021
-8939B46021Q0050Q0049O8957M4148J0064j8563n1960p2952p9871p4146o5319n1960l8825
$$ 246021 326071 406120 475077 519225 529289 510726 458766 385814 305943 231797 166478 114518 75693
-8926G5693k5465k0695j4969j5147r423n248n249n039O86k535k534p068p067k296k296l522
$$ 75693 50228 29533 14564 -583 -10006 -15254 -20503 -25542 -24856 -27391 -29925 -36993 -44060 -46356 -48652 -52174
-8910e2174l523l164l165k210L515L157L157l254l254l254l254j226j227j226j226p05p04
$$ -52174 -55697 -58861 -62026 -64236 -60721 -57564 -54407 -57661 -60915 -64169 -67423 -68649 -69876 -71102 -72328 -73033 -73737
-8893g3737j421M306J502m223o45o45j003j002j003j003J681J681l090l090Q61Q65Q61Q65
$$ -73737 -75158 -70852 -69350 -73573 -74218 -74863 -75866 -76868 -77871 -78874 -77193 -75512 -78602 -81692 -80831 -79966 -79105 -78240
-8875g8240N63N66N63N67J860J863J860J864r43r39r43r40J242J245j622j618L47L51k874
$$ -78240 -77677 -77111 -76548 -75981 -74121 -72258 -70398 -68534 -69477 -70416 -71359 -72299 -71057 -69812 -71434 -73052 -72705 -72354 -75228
-8856g5228K855j75j72N41N44m350J379j845j841K191K192K192K192K132K132J237j625m011
$$ -75228 -72373 -72548 -72720 -72179 -71635 -75985 -74606 -76451 -78292 -76101 -73909 -71717 -69525 -67393 -65261 -64024 -65649 -69660
-8838f9660J715J178J178L951L951L414O277P604J879q05M920k744k743k386k385m682m681
$$ -69660 -67945 -66767 -65589 -61638 -57687 -54273 -47996 -40392 -38513 -39318 -34398 -37142 -39885 -42271 -44656 -49338 -54019
-8821e4019j819j819k893k892J819M681O926J204k080k076k61k57J349J353m003j137Q27m894
$$ -54019 -55838 -57657 -60550 -63442 -61623 -56942 -50016 -48812 -50892 -52968 -53229 -53486 -52137 -50784 -54787 -55924 -55097 -59991
-8803e9991m629J099k303k300j409J458L242k478l854r88J513j345o49o45o911j181n89n85
$$ -59991 -64620 -63521 -65824 -68124 -69533 -68075 -64833 -67311 -71165 -72153 -70640 -71985 -72634 -73279 -80190 -81371 -81960 -82545
-8785h2545J319P049L205L206P01P00K759K758k013k013r99r98M32M32L295L295j476j476
$$ -82545 -81226 -74177 -70972 -67766 -67065 -66365 -63606 -60848 -62861 -64874 -65873 -66871 -66439 -66007 -62712 -59417 -60893 -62369
-8767f2369k020k020n89n89J051J051L914L914m10m10M003M003N14n210j812m674l780l776
$$ -62369 -64389 -66409 -66998 -67587 -66536 -65485 -61571 -57657 -58067 -58477 -54474 -50471 -49957 -55167 -56979 -61653 -65433 -69209
-8749f9209j095j093m39m36K422K427R32R35m99m96j12j08O568O571N286N289j394j390o046
$$ -69209 -70304 -71397 -71836 -72272 -69850 -67423 -66491 -65556 -66055 -66551 -66663 -66771 -60203 -53632 -48346 -43057 -44451 -45841 -51887
-8730e1887o042o046o042k945k941k587k583m644J084K692l031J883M748Q860L139o52o49
$$ -51887 -57929 -63975 -70017 -72962 -75903 -78490 -81073 -85717 -84633 -81941 -84972 -83089 -78341 -69481 -66342 -66994 -67643
-8713f7643J852J857L17L20J569j289J38n584K344N211M537J677L463L466j606j603j607j602
$$ -67643 -65791 -63934 -63617 -63297 -61728 -63017 -62879 -68463 -66119 -60908 -56371 -54694 -51231 -47765 -49371 -50974 -52581 -54183
-8695e4183L984L989p87p83l112l109l112l109j222j223K177l549l011j49o86l549J163j700
$$ -54183 -50199 -46210 -46997 -47780 -50892 -54001 -57113 -60222 -61444 -62667 -60490 -64039 -67050 -67199 -67885 -71434 -70271 -71971
-8677g1971l131l131J730J729K99K98l0l0R84j878P037k505l58l58K39k624k565q289r304
$$ -71971 -75102 -78233 -76503 -74774 -74475 -74177 -74207 -74237 -73253 -75131 -68094 -70599 -70957 -71315 -71076 -73700 -76265 -84554 -93858
-8658i3858r304r303j5029j3583j3579j0541r95Q126J0992K2021K2026K1335J5614R468L746
$$ -93858 -103162 -112465 -127494 -141077 -154656 -165197 -166192 -158066 -147074 -125053 -103027 -81692 -66078 -56610 -52864
-8643e2864n382q242l13R233J3918Q197J0697J160l437l433M376M380R654O795J1263N543
$$ -52864 -58246 -66488 -66801 -57568 -43650 -35453 -24756 -23596 -27033 -30466 -26090 -21710 -12056 -5261 6002 11545
-8627A1545O135M14J722m000j681j681j681p406k80k79R73m752j204m066k815k814L865L866
$$ 11545 17680 18094 19816 15816 14135 12454 10773 3367 3087 2808 3781 -971 -2175 -6241 -9056 -11870 -8005 -4139
-8609d139R589L866j868p591l120l120R65L828J1521N796R881L39j450j4809j8058j8059m06
$$ -4139 5450 9316 7448 -143 -3263 -6383 -5418 -1590 9931 15727 25608 25947 24497 9688 -8370 -26429 -26835
-8592b6835m07J2312J8036K0064O706K442j0918r367r367q322j4049o057o057k300k300K472
$$ -26835 -27242 -14930 3106 23170 29876 32318 21400 12033 2666 -5656 -19705 -25762 -31819 -34119 -36419 -33947
-8576c3947K471J1268J1268J6634P094J3116J3117J7291J7292K4731K4732K1391l418j1797
$$ -33947 -31476 -20208 -8940 7694 14788 27904 41021 58312 75604 100335 125067 146458 143040 131243
-8562A31243k8973k2652j6926p813p808j2584k2122j9799j9797m174m171J0809J0814J9157
$$ 131243 102270 79618 62692 54879 47071 34487 12365 -7434 -27231 -31405 -35576 -24767 -13953 5204
-8548E204N804Q990n47J0063J0068J3605M067J1339J800N733l806J1100J1104K1120J5398
$$ 5204 11008 19998 19451 29514 39582 53187 57254 68593 70393 76126 72320 83420 94524 115644 131042
-8533A31042L0661L0666M3603L7881M6824L3469K5681k944j3561k6919j2069j2070J8585J8585
$$ 131042 161703 192369 235972 273853 320677 354146 379827 376883 363322 336403 324334 312264 330849 349434
-8519C49434L5314L5313N3444N3443P7866P7865Q8839O7846O2874K6614J9696j2748j2002
$$ 349434 384748 420061 473505 526948 604814 682679 771518 839364 902238 928852 948548 935800 923798
-8506I23798l2995j0452j0452L1504L7230P3131O7407J01996J11540J82627K26522L32645
$$ 923798 890803 880351 869899 901403 938633 1011764 1079171 1181167 1292707 1475334 1701856 2034501
-8494B034501M14712N40425N91957O37994N55935M94146M00637M29050N11117Q55585J372774
$$ 2034501 2449213 2989638 3581595 4219589 4775524 5269670 5670307 6099357 6610474 7466059 8838833
-8483H838833K324362L627825N745945Q812795J3664645K0033092K6230236K6640558K0349768
$$ 8838833 11163195 14791020 20536965 29349760 43014405 63047497 89277733 115918291 136268059
-8474A36268059O007906j1178032k1809876k6167642k2810701j6817282j1341980p546831
$$ 136268059 142275965 131097933 109288057 83120415 60309714 43492432 32150452 24603621
-8466B4603621n090677l643611k641680k029464j519914j168046q18803n82873l93939l62449
$$ 24603621 19512944 15869333 13227653 11198189 9678275 8510229 7691426 7108553 6714614 6352165
-8456F352165l98710n31136n75031n97216n11337m41560l36596k83160k20181j92793j56532
$$ 6352165 5953455 5422319 4847288 4250072 3738735 3297175 2960579 2677419 2457238 2264445 2107913
-8445B107913j67268j57725j83727j74186j76809j48184j31514r9070p4500l4423j6531Q279
$$ 2107913 1940645 1782920 1599193 1425007 1248198 1100014 968500 869430 794930 760507 743976 752255
-8433G52255K195P921j4004j4000k4500k4497l4639m0360o3504o3500p1107n0112l4251r438
$$ 752255 754450 762371 748367 734367 709867 685370 650731 610371 546867 483367 412260 362148 327897 318459
-8419C18459J860J1406R017R020K434K438l649K080j831j826p794p790r278l548n222N07n640
$$ 318459 320319 331725 340742 349762 352196 354634 350985 353065 351234 349408 341614 333824 324546 320998 315776 316283 310643
-8402C10643n636q502k773l467l463o329o325k0106k5827l0363l0360l0147j6785k1440k1436
$$ 310643 305007 296505 293732 290265 286802 280473 274148 254042 228215 197852 167492 137345 120560 99120 77684
-8387G7684l1937l1932k9789j6426n987J1194J4768J4770J1011J1015Q148Q152P596P600P239
$$ 77684 45747 13815 -15974 -32400 -38387 -27193 -12425 2345 13356 24371 32519 40671 48267 55867 63106
-8372F3106P242K378l343q715q711j2729j2729j3803j3801j7113j1387n662L880J2349J2349
$$ 63106 70348 72726 69383 60668 51957 39228 26499 12696 -1105 -18218 -29605 -35267 -31387 -19038 -6689
-8357f689J0798N073J733p809j4845j4847o825j099K956Q681P130P131K12n513n930n930j159
$$ -6689 4109 9182 10915 3106 -11739 -26586 -33411 -34510 -31554 -22873 -15743 -8612 -8400 -13913 -19843 -25773 -26932
-8340b6932j160j397M327m43o169q965q964l001l000K903k821m372m373l306l306l306l307
$$ -26932 -28092 -29489 -25162 -25605 -31774 -40739 -49703 -52704 -55704 -52801 -55622 -59994 -64367 -67673 -70979 -74285 -77592
-8323g7592l664l664k709O832N632r3L724L723P004P004O82O82Q979J4705J3631M089J226
$$ -77592 -81256 -84920 -87629 -80797 -75165 -75258 -71534 -67811 -60807 -53803 -53121 -52439 -43460 -28755 -15124 -11035 -9809
-8306i809m499p958p958N04J0049J5174J5177K4239K4243J6844L489o593j6133j6374j6371
$$ -9809 -14308 -22266 -30224 -29720 -19671 -4497 10680 34919 59162 76006 79495 72902 56769 40395 24024
-8291B4024j1723j1719o950o948n312n308k448k446k568k564O020O023N632N636J815l906
$$ 24024 12301 582 -6368 -13316 -18628 -23936 -26384 -28830 -31398 -33962 -27942 -21919 -16287 -10651 -8836 -12742
-8275a2742r28o650o295o292o255n26K572K576k497q219k140k136j423j421J797l925m70m66
$$ -12742 -13670 -20320 -26615 -32907 -39162 -39688 -37116 -34540 -37037 -45256 -47396 -49532 -50955 -52376 -50579 -54504 -54974 -55440
-8257e5440m69o191m85m81K378l343J901J904J186J189L094k628Q580Q585L749n788m25m22
$$ -55440 -55909 -62100 -62585 -63066 -60688 -64031 -62130 -60226 -59040 -57851 -54757 -57385 -48805 -40220 -36471 -42259 -42684 -43106
-8239d3106L102L101K743K744J19n606M77M77M801M801N159n67L549L548K833K833L436k288
$$ -43106 -40004 -36903 -34160 -31416 -31297 -36903 -36426 -35949 -31148 -26347 -21188 -21755 -18206 -14658 -11825 -8992 -5556 -7844
-8221g844k289k289j095o822l600l601n151n151O895O896R460L735N763L7K490Q218J9308
$$ -7844 -10133 -12422 -13517 -20339 -23939 -27540 -32691 -37842 -30947 -24051 -14591 -10856 -5093 -5056 -2566 5652 24960
-8204B4960J9311L1534L7263L8691K5335K5480K5485K9655K3933L3890O2520J12612J83228
$$ 24960 44271 75805 113068 151759 177094 202574 228059 257714 281647 315537 378057 490669 673897
-8191F73897L03083M61487P18166J151385J802276K353816J782356n05849k006210k006206
$$ 673897 976980 1438467 2156633 3308018 5110294 7464110 9246466 8740617 6734407 4728201
-8181D728201j525165r69808o05897l86424k64288j86039j43509j11065q7210n8584m5940
$$ 4728201 3203036 2233228 1627331 1240907 976619 790580 647071 536006 448796 390212 344272
-8170C44272l2582k0176j0634k1698k7422l1836l1836k9867k4143j6270j0545r292r293q934
$$ 344272 311690 291514 280880 259182 231760 199924 168088 138221 114078 97808 87263 77971 68678 59744
-8156E9744q935l030l031r948j5674j4272q546r263r262j391j390j390j390l806l806l806
$$ 59744 50809 47779 44748 34800 19126 4854 -3692 -12955 -22217 -23608 -24998 -26388 -27778 -31584 -35390 -39196
-8140c9196l801l448l448k28n948l031l030l388l385O67O67O68O71r81r80K240l481k889k889
$$ -39196 -42997 -46445 -49893 -50121 -56069 -59100 -62130 -65518 -68903 -68236 -67569 -66901 -66230 -67211 -68191 -65951 -69432 -72321 -75210
-8121g5210l84l80n92n93K270K274L164L165L02L05J230J230M451j275j811j812O93O94N74
$$ -75210 -75594 -75974 -76566 -77159 -74889 -72615 -69451 -66286 -65984 -65679 -64449 -63219 -58768 -60043 -61854 -63666 -62973 -62279 -61705
-8102f1705N74O299N74K483l243l243l243k617k616K154K155O388O389L168L169J334m391
$$ -61705 -61131 -54832 -54258 -51775 -55018 -58261 -61504 -64121 -66737 -64583 -62428 -56040 -49651 -46483 -43314 -41980 -46371
-8085d6371j170j171M40M40k065k065m171J555M416j304q61q61K12K16j30j30k994k989J987
$$ -46371 -47541 -48712 -48272 -47832 -49897 -51962 -56133 -54578 -50162 -51466 -52327 -53188 -52976 -52760 -52890 -53020 -56014 -59003 -57016
-8066e7016J987N207n15L262L261l418l414o549q24L947j774j062j062J1J5j808j808m670
$$ -57016 -55029 -49822 -50337 -47075 -43814 -47232 -50646 -57195 -58019 -54072 -55846 -56908 -57970 -57959 -57944 -59752 -61560 -66230
-8048f6230m667L28L32L190L195J222J227L011k709N96O00M890q31j938j935l727l724K095
$$ -66230 -70897 -70569 -70237 -67047 -63852 -62630 -61403 -58392 -61101 -60505 -59905 -55015 -55846 -57784 -59719 -63446 -67170 -65075
-8030f5075K099p68p64j812j808M511M513M749r73K244K248L108L113K751K754L016k706J942
$$ -65075 -62976 -63744 -64508 -66320 -68128 -63617 -59104 -54355 -55328 -53084 -50836 -47728 -44615 -41864 -39110 -36094 -38800 -36858
-8012c6858J945K926K930J0202J0206Q383J7927K4724L0453M5717O2896O9334P8879P9927
$$ -36858 -34913 -31987 -29057 -18855 -8649 -266 17661 42385 72838 118555 181451 250785 329664 409591
-7998D09591O6571L6749M309k3487n2109o9289p8827p5581o6034n3157l9794k5484j5938j1887
$$ 409591 476162 512911 517220 493733 441624 372335 293508 217927 151893 98736 58942 33458 17520 5633
-7984E633j1882j178j178m040m041m189m190n621n621j834j833j834j834j029j029j029j028
$$ 5633 -6249 -7427 -8605 -12645 -16686 -20875 -25065 -30686 -36307 -38141 -39974 -41808 -43642 -44671 -45700 -46729 -47757
-7967d7757j633j633J230J231K16K16k647k646l422l422n59n59l064l064n926n927j263j260
$$ -47757 -49390 -51023 -49793 -48562 -48346 -48130 -50777 -53423 -56845 -60267 -60826 -61385 -64449 -67513 -73439 -79366 -80629 -81889
-7949h1889L507L512J658J663J658J663N267N270K404K408j144j141j323m182J97n524l022
$$ -81889 -78382 -74870 -73212 -71549 -69891 -68228 -62961 -57691 -55287 -52879 -54023 -55164 -56487 -60669 -60472 -65996 -69018
-7932f9018K706K463l95J927r31j890R76K047K050m89m84l351l347j521j521m920Q05M384
$$ -69018 -66312 -63849 -64244 -62317 -63248 -65138 -64162 -62115 -60065 -60554 -61038 -64389 -67736 -69257 -70778 -75698 -74893 -70509
-7914g0509J520j163J700K102p60n82K282K23K24K24K23P23k139n181N44M033M033M928p98
$$ -70509 -68989 -70152 -68452 -66350 -67110 -67692 -65410 -65187 -64963 -64739 -64516 -63793 -65932 -71113 -70569 -66536 -62503 -57575 -58373
-7895e8373l7K825l95l258m003m003N89N89j536j536k967k967N82N81L444L444J372J372J371
$$ -58373 -58410 -55585 -55980 -59238 -63241 -67244 -66655 -66066 -67602 -69138 -72105 -75072 -74490 -73909 -70465 -67021 -65649 -64277 -62906
-7876f2906J372K058K057q05q05k512k513j081j080J036J036l735l735j394j394M928M927
$$ -62906 -61534 -59476 -57419 -58224 -59029 -61541 -64054 -65135 -66215 -65179 -64143 -67878 -71613 -73007 -74401 -69473 -64546
-7859f4546K632l094m704J022k35l094m171J558O90L556n63n59P79P82J137J141k859K870
$$ -64546 -61914 -65008 -69712 -68690 -68925 -72019 -76190 -74632 -73942 -70386 -70949 -71508 -70729 -69947 -68810 -67669 -70528 -67658
-7841f7658K509K512l99l95l262l257m59m55m58m55Q54Q57J569m152l619K109L001J42k241
$$ -67658 -65149 -62637 -63036 -63431 -66693 -69950 -70409 -70864 -71322 -71777 -70923 -70066 -68497 -72649 -76268 -74159 -71158 -71016 -73257
-7822g3257k236j823j819k478P067J696J699J480J484J480J483J301J304J301J305j443j438
$$ -73257 -75493 -77316 -79135 -81613 -74546 -72850 -71151 -69671 -68187 -66707 -65224 -63923 -62619 -61318 -60013 -61456 -62894
-7805f2894J420J424K493K498k278k274l61l58l61l58K35K38k986K744k140k139m287m286
$$ -62894 -61474 -60050 -57557 -55059 -57337 -59611 -59972 -60330 -60691 -61049 -60814 -60576 -63562 -60818 -62958 -65097 -69384 -73670
-7787g3670O7N792K572K572l034l034l034l034p09p08M063M063J461J461J461J462j402j401
$$ -73670 -73603 -67811 -65239 -62667 -65701 -68735 -71769 -74803 -75512 -76220 -72157 -68094 -66633 -65172 -63711 -62249 -63651 -65052
-7769f5052m265N278M801r24l28N397j103j103p46p45j070j066j070j066j785j782j786j781
$$ -65052 -69317 -64039 -59238 -60162 -60490 -55093 -56196 -57299 -58045 -58790 -59860 -60926 -61996 -63062 -64847 -66629 -68415 -70196
-7751g0196j994j991j994j991n03m99n274n271M059M063M059M063J018J021j845j842J406
$$ -70196 -72190 -74181 -76175 -78166 -78669 -79168 -84442 -89713 -85654 -81591 -77532 -73469 -72451 -71430 -73275 -75117 -73711
-7734g3711J409l366l362Q09Q12L672L675K490K493j923j920k698L030K669K673L414L418
$$ -73711 -72302 -75668 -79030 -78221 -77409 -73737 -70062 -67572 -65079 -67002 -68922 -71620 -68590 -65921 -63248 -59834 -56416
-7717e6416L414L418J804J808j058j055L749L754j021j018n554n550J126J129j56j53l019
$$ -56416 -53002 -49584 -47780 -45972 -47030 -48085 -44336 -40582 -41603 -42621 -48175 -53725 -52599 -51470 -51626 -51779 -54798
-7700e4798l016m629m626p134K411l72l73k997K729K83K83k221k222l347l347j27j27n136
$$ -54798 -57814 -62443 -67069 -74203 -71792 -72164 -72537 -75534 -72805 -72522 -72239 -74460 -76682 -80029 -83376 -83503 -83630 -88766
-7682h8766N89k632k631J282J282J640J640m204J520L072L071l623l623n22N204K639l087
$$ -88766 -88177 -90809 -93440 -92158 -90876 -89236 -87596 -91800 -90280 -87208 -84137 -87760 -91383 -91905 -86701 -84062 -87149
-7665h7149k012k013j670M055Q35Q35K267K266n97n96J94J94J93J94K341K341k430k431j252
$$ -87149 -89161 -91174 -92844 -88789 -87954 -87119 -84852 -82586 -83183 -83779 -83585 -83391 -83198 -83004 -80663 -78322 -80752 -83183 -84435
-7646h4435j252j253j252K206K207o56o56k483k482k482k483J692J693M555M554%%l220K505
$$ -84435 -85687 -86940 -88192 -85986 -83779 -84435 -85091 -87574 -90056 -92538 -95021 -93329 -91636 -87081 -82527 -82527 -82527 -85747 -83242
-7627h3242j432j431j073j074L549L548O86O86J49J49k09N517K035K035j12j12m465J260j603
$$ -83242 -84674 -86105 -87178 -88252 -84703 -81155 -80469 -79783 -79634 -79485 -79694 -74177 -72142 -70107 -70219 -70331 -74796 -73536 -75139
-7608g5139j603m555J171Q12Q13K781K780l899l898k446k441m950M596M055M059k027k024
$$ -75139 -76742 -81297 -80126 -79314 -78501 -75720 -72940 -76839 -80737 -83183 -85624 -90574 -85978 -81923 -77864 -79891 -81915
-7591h1915k565k560k565k561j133j129m354J376L727L731J223J226q65q61l369l366o024
$$ -81915 -84480 -87040 -89605 -92166 -93299 -94428 -98782 -97406 -93679 -89948 -88725 -87499 -88364 -89225 -92594 -95960 -101984
-7574a01984k94O978O981P16P19J074J077n606J19k38k39k386k385M77M77J819J819J819J819
$$ -101984 -102278 -95300 -88319 -87603 -86884 -85810 -84733 -90339 -90220 -90458 -90697 -93083 -95468 -94991 -94514 -92695 -90876 -89057 -87238
-7555h7238L28L28L28L28j498j499m719J007J066J066J424J423m62m62K401K400J685J685
$$ -87238 -86910 -86582 -86254 -85926 -87424 -88923 -93642 -92635 -91569 -90503 -89079 -87656 -88118 -88580 -86179 -83779 -82094 -80409
-7537h0409j894L832j420p142l925J804J264J267M484M488K061K065K777k945l008K721q61
$$ -80409 -82303 -78471 -79891 -87033 -90958 -89154 -87890 -86623 -82139 -77651 -75590 -73525 -70748 -73693 -76701 -73980 -74841
-7520g4841q57J264J267j241j238m462J268R06R09J905J908J905J908p79p75j137M592K337
$$ -74841 -75698 -74434 -73167 -74408 -75646 -80108 -78840 -77934 -77025 -75120 -73212 -71307 -69399 -70178 -70953 -72090 -67498 -65161
-7502f5161K341J1641J1644Q659J4388J5935J5937J6620J6625J4712Q990K308l415p593j7131
$$ -65161 -62820 -51179 -39535 -30876 -16488 -553 15384 32004 48629 63341 72331 74639 71224 63631 46500
-7487D6500j6702j6699j7656j1927j1216j1212o087o083n371n368k151k147l283K445K441
$$ 46500 29798 13099 -4557 -16484 -27700 -38912 -44999 -51082 -56453 -61821 -63972 -66119 -69402 -66957 -64516
-7472f4516l280m562m563k057k058j043j044j044j043J923J923J924J923m5m4k908k907K09
$$ -64516 -67796 -72358 -76921 -78978 -81036 -82079 -83123 -84167 -85210 -83287 -81364 -79440 -77517 -77562 -77606 -80514 -83421 -83212
-7454h3212K08K09K09j49j49j50j49J536J536j327j327m249m250j386j387j677j674k393L336
$$ -83212 -83004 -82795 -82586 -82735 -82884 -83034 -83183 -81647 -80111 -81438 -82765 -87014 -91264 -92650 -94037 -95714 -97388 -99781 -96445
-7435i6445P269J547K258K263m808m805j946j942m570m566K02K05J804J808M666M671P30P35
$$ -96445 -89176 -87629 -85371 -83108 -87916 -92721 -94667 -96609 -101179 -105745 -105543 -105338 -103534 -101726 -97060 -92389 -91659 -90924
-7417i0924P30P34Q13Q16M033j688j573j569j931j927K240K240K240K240J704J703J704J703
$$ -90924 -90194 -89460 -88647 -87831 -83798 -85486 -87059 -88628 -90559 -92486 -90246 -88006 -85766 -83526 -81822 -80119 -78415 -76712
-7399g6712M760M760J897J897j025j025j025j025j673j674j673j674j316j316j315j316L448
$$ -76712 -71952 -67192 -65295 -63398 -64423 -65448 -66473 -67498 -69171 -70845 -72518 -74192 -75508 -76824 -78139 -79455 -76007
-7382g6007L448O668R43j144j145j502j502K956K956j816j815N11N10j994j994k553L172K814
$$ -76007 -72559 -65891 -64948 -66092 -67237 -68739 -70241 -67285 -64329 -66145 -67960 -67449 -66939 -68933 -70927 -73480 -70308 -67494
-7364f7494K814K993K993l090K636J055J054J413J413N18N18J60J61N997K72L493L492q6q5
$$ -67494 -64680 -61687 -58694 -61784 -59148 -58093 -57039 -55626 -54213 -53695 -53177 -53017 -52856 -46859 -46587 -43094 -39602 -39688 -39773
-7345c9773k949k948o22o23r80M745O653O654R873R874J8074J8074K3799L3342L9663M9206
$$ -39773 -42722 -45670 -46292 -46915 -47895 -43150 -36497 -29843 -19970 -10096 7978 26052 49851 83193 122856 172062
-7329A72062N3022N8748N8785M9242M1848K4672J0835k523j6360l3535m5583n1307n1666n1666
$$ 172062 225084 283832 342617 391859 433707 458379 469214 466691 450331 416796 371213 319906 268240 216574
-7315B16574m2779l7054k9421j9878j2103j2103j1506j1507r300r299r300r300n631n632n632
$$ 216574 173795 136741 107320 87442 75339 63236 51730 40223 30923 21624 12324 3024 -2607 -8239 -13871
-7300a3871n633q01q01j160j159m573j0299r941r941o840o840k068k069M96M95L717k010m752
$$ -13871 -19504 -20305 -21106 -22266 -23425 -27998 -38297 -48238 -58179 -65019 -71859 -73927 -75996 -75500 -75005 -71288 -73298 -78050
-7282g8050m752n111n110J215J219M078M081N211N215j469j465M197M201O702O706N688l4
$$ -78050 -82802 -87913 -93023 -91808 -90589 -86511 -82430 -77219 -72004 -73473 -74938 -70741 -66540 -59838 -53132 -47444 -47478
-7265d7478l854l850j670p392m174m171n845n841M652M656Q081Q084P724P726L847j875q796
$$ -47478 -51332 -55182 -56852 -64244 -68418 -72589 -78434 -84275 -79623 -74967 -66886 -58802 -51078 -43352 -39505 -41380 -50176
-7248e0176q793m637J092M189M194K341l381l027l023N52N55N52N55M727M730m5m1K274K277
$$ -50176 -58969 -63606 -62514 -58325 -54131 -51790 -55171 -58198 -61221 -60669 -60114 -59562 -59007 -54280 -49550 -49595 -49636 -47362 -45085
-7229d5085J916J920R02m820q282q279n300n297k437k434O03O08P283P287M883M883M883M883
$$ -45085 -43169 -41249 -40347 -45167 -53449 -61728 -67028 -72325 -74762 -77196 -76593 -75985 -68702 -61415 -56532 -51649 -46766 -41883
-7211d1883q42q43q42q43m54m55P537J811n285n286K945K945M204M205M562j163R25R24L787
$$ -41883 -42725 -43568 -44410 -45253 -45707 -46162 -38625 -36814 -42099 -47385 -44440 -41495 -37291 -33086 -28524 -29687 -28762 -27838 -24051
-7192b4051j938k535k535k9l0k356k356N07N07j796j797J066J066L511L511L512L511R47R46
$$ -24051 -25989 -28524 -31059 -31088 -31118 -33474 -35830 -35323 -34816 -36612 -38409 -37343 -36277 -32766 -29255 -25743 -22232 -21285 -20339
-7173b0339J305m421M70M70K616K617M346j379L273M10k453n315k155L571M018O881P059M197
$$ -20339 -19034 -23455 -22985 -22515 -19899 -17282 -12936 -14315 -11042 -10632 -13085 -18400 -20555 -16984 -12966 -6085 974 5171
-7155E171O105L243k303n167l999l999r58o683k508k509mlM886M887M886M886J786J785M648
$$ 5171 11276 14519 12216 7049 3050 -949 -1907 -8590 -11098 -13607 -13611 -13614 -8728 -3841 1045 5931 7717 9502 14150
-7136A4150M648P347P347Q360N498J264q279p861p861r531r531r530r531p145p146o787o788
$$ 14150 18798 26145 33492 41852 47350 48614 40335 32474 24613 15082 5551 -3979 -13510 -20655 -27801 -34588 -41376
-7119d1376m756R69O337O336O873O874O873O873O843O844R885M159P142M279N532N531R035
$$ -41376 -46132 -45163 -38826 -32490 -25617 -18743 -11870 -4997 1846 8690 18575 22734 29876 34155 39687 45218 54253
-7102E4253R036J3806J3806J6371J6371J3508J3508J1808J1809M771M771m77o203K99O023
$$ 54253 63289 77095 90901 107272 123643 137151 150659 162467 174276 179047 183818 183341 177138 177437 183460
-7087A83460J0951Q089J0295J6020K2640L2183L8981L8981L7103K7560J9748J4023J3724J0862
$$ 183460 194411 202500 212795 228815 251455 283638 322619 361600 398703 426263 446011 460034 473758 484620
-7073D84620Q178Q178J6385K9745M5370N4912N7178P0538Q9860J14670J38019J55194J71654
$$ 484620 492798 500976 517361 547106 592476 647388 704566 775104 864964 979634 1117653 1272847 1444501
-7060A444501J92648K12447K29623K44891K69700L02225L38490L89059M86393O84151J006679
$$ 1444501 1637149 1849596 2079219 2324110 2593810 2896035 3234525 3623584 4109977 4794128 5800807
-7049E800807J495711K196110L142628M427009O114295P959754Q929827P133998J684469m527476
$$ 5800807 7296518 9492628 12635256 17062265 23176560 31136314 40066141 47200139 48884608 44357132
-7039D4357132p870538q105270o707110m987610l557720k544338j842995j356339j001017
$$ 44357132 36486594 28381324 21674214 16686604 13128884 10584546 8741551 7385212 6384195
-7030F384195p31925n20808l62405k57206k20942k63170l49045l83159l65983l20419k80342
$$ 6384195 5652270 5131462 4769057 4511851 4290909 4027739 3678694 3295535 2929552 2609133 2328791
-7019B328791k40503k08060j83966j59157j32931j11937r3927q8202q2118q2119p2218n8860
$$ 2328791 2088288 1880228 1696262 1537105 1404174 1292237 1198310 1110108 1027990 945871 873653 814793
-7007H14793m4725l1366k4090k4090l0054l5780k9100k3374j7247j7247j1044j1044j5935
$$ 814793 770068 738702 714612 690522 660468 624688 595588 572214 554967 537720 526676 515632 499697
-6994D99697k9294l6092m1818m2750l3207j6867l507J3847J3848J1700j659j4272j4272j5107
$$ 499697 470403 434311 392493 349743 316536 299669 296162 310009 323857 335557 333898 319626 305354 290247
-6980B90247j5108p533p533j0038j0038l671K054J6963J6964J0224J0224J0224J0225J3027
$$ 290247 275139 267606 260073 250035 239997 236326 238380 255343 272307 282531 292755 302979 313204 326231
-6966C26231J3027J7083K6625K3941O765j5420l6413m2131l2585j9468j3739k3882l7237l6763
$$ 326231 339258 356341 382966 406907 413672 398252 361839 319708 287123 267655 253916 230034 192797 156034
-6952A56034k7218q837M525Q457Q461J5972K1701J5018R296P705P708J0448J6177J6650J0929
$$ 156034 128816 119979 124504 132961 141422 157394 179095 194113 203409 211114 218822 229270 245447 262097 273026
-6937B73026Q182Q185J1179J6907K7997K8000L4557L4560M2191M7919N5911O1637M9947K1321
$$ 273026 281208 289393 300572 317479 345476 373476 408033 442593 484784 532703 588614 650251 700198 721519
-6923G21519n398k2573k3527j0169P515L2324M6399N5941O4528Q1705R8165J11524J16236
$$ 721519 716121 693548 670021 659852 667367 699691 746090 802031 866559 948264 1046429 1157953 1274189
-6910A274189J10510R4288P3296N1587M2045K3438J0079R811L0803O7302J03562J42208J70835
$$ 1274189 1384699 1478987 1552283 1603870 1645915 1669353 1679432 1689243 1720046 1787348 1890910 2033118 2203953
-6897B203953J94213K30473K93857L75924M59653N45535O31889P13955P87187Q46352Q93911
$$ 2203953 2398166 2628639 2922496 3298420 3758073 4303608 4935497 5649452 6436639 7282991 8176902
-6886H176902R45441J002930J100263J313050J757718K564029L848405N747918Q417816J2119457
$$ 8176902 9122343 10125273 11225536 12538586 14296304 16860333 20708738 26456656 34874472 46993929
-6876D6993929J7224518K3705432K9680725K9936957J8194355l304078k1665093k8630173
$$ 46993929 64218447 87923879 117604604 147541561 165735916 162431838 140766745 112136572
-6868A12136572k6567141k0796518j5004433j0590705p569653n535583m121434l103287k349456
$$ 112136572 85569431 64772913 49768480 39177775 31608122 26072539 21951105 18847818 16498362
-6859A6498362j795174j426848j187338j025124r40524q88999q30789p60179o87539o36011
$$ 16498362 14703188 13276340 12089002 11063878 10123354 9234355 8403566 7643387 6955848 6319837
-6849F319837n88062n32717m79810m24466l66497l14970k86105k68928k68690k62965k51574
$$ 6319837 5731775 5199058 4719248 4294782 3928285 3613315 3327210 3058282 2789592 2526627 2275053
-6838B275053k30581j98138j65694j31820r9376o9319m0692k3803j8074k6547l6085m1575
$$ 2275053 2044472 1846334 1680640 1548820 1449444 1380125 1339433 1315630 1297556 1271009 1234924 1193349
-6826A193349m1572m6227n5766p0142q3498r2566q3021o1972l3341j2830l284L370R098O471
$$ 1193349 1151777 1105550 1049784 979642 896144 803578 720557 658585 625244 612414 609130 612500 621598 628069
-6812F28069O474R0R3o26N103L280k442j3776j9498k3915k3912k4272j8544k0281j4552j554
$$ 628069 634543 634633 634726 634100 639203 642483 640041 626265 606767 582852 558940 534668 516124 495843 481291 479737
-6796D79737j551o922j2643k0877k6599l5608m1329m0618l1072k2010j6281l0837m0375l9604
$$ 479737 478186 471264 458621 437744 411145 375537 334208 293590 262518 240508 224227 193390 153015 113411
-6782A13411k6241m775J6222J6904K2633K3583K3587K3643K3646J8634K4362K5343J9621J6277
$$ 113411 87170 82395 98617 115521 138154 161737 185324 208967 232613 251247 275609 300952 320573 336850
-6768C36850K2007K6301M3476P1387J11465J66212K52092L59442M75855N10983L29681m7233
$$ 336850 358857 385158 428634 500021 611486 777698 1029790 1389232 1865087 2376070 2705751 2658518
-6756B658518l69759m84742m33214l33260k35930j71848j31771r9328p0702m7561l0386k5257
$$ 2658518 2288759 1804017 1370803 1037543 801613 629765 497994 398666 327964 280403 250017 224760
-6744B24760j9532j3269j3270j9233j9234k4601j8875p187j461l813l813j3594j3594j6009
$$ 224760 205228 191959 178689 159456 140222 115621 96746 89559 88098 84285 80472 66878 53284 37275
-6730C7275j0284j0642j0641l694l693m768m767k590L134m43N282J845J845N064N066J0552
$$ 37275 26991 16349 5708 2014 -1679 -6447 -11214 -13804 -10670 -11113 -5831 -3986 -2141 2923 7989 18541
-6714A8541J0552Q048Q047K114P838J8693K8236K1436J1894q144j3870j7590j1860j1984j1980
$$ 18541 29093 37141 45188 47302 55140 73833 102069 123505 135399 127255 113385 95795 83935 71951 59971
-6699E9971r002N45N788J9152K0042K0046M298n241j4757j4753j6427j6423j4480q752r114
$$ 59971 50969 51514 57302 76454 96496 116542 120840 115599 100842 86089 69662 53239 38759 30007 20893
-6684B0893r110p115p111m36m33k792k788o966o963o251L295M961M965M712J0436Q766J4492
$$ 20893 11783 4668 -2443 -2879 -3312 -6104 -8892 -15858 -22821 -29072 -25777 -20816 -15851 -11139 -703 8063 22555
-6667B2555R602R602P75m950j5714j5715j0108m383k475P067J1241J1242J0608K0150K4206
$$ 22555 32157 41759 42534 37584 21870 6155 -3953 -8336 -10811 -3744 7497 18739 29347 49497 73703
-6652G3703K4206J1920n256k3266l2809l2093k6366j7065p521o568q42K855K855K486l235
$$ 73703 97909 109829 104573 81307 48498 16405 -9961 -27026 -34547 -41115 -41957 -39102 -36247 -33761 -36996
-6637c6996k524P023r73r69m551m548j241Q305J0925N203J60J64j97j94l918l913n707K2p0
$$ -36996 -39520 -32497 -33470 -34439 -38990 -43538 -44779 -36474 -25549 -20346 -20186 -20022 -20219 -20413 -24331 -28244 -33951 -33929 -33999
-6618c3999o8n080j0802j3758j3754q987N59l858l854l261l258k050k050k050k050L407L406
$$ -33999 -34067 -39147 -49949 -63707 -77461 -86448 -85889 -89747 -93601 -96862 -100120 -102170 -104220 -106270 -108320 -104913 -101507
-6601a01507M839M838L35L36k527k528o552o553J27J26N398N397K892J2435J5059J5058J2554
$$ -101507 -96668 -91830 -91495 -91159 -93686 -96214 -102766 -109319 -109192 -109066 -103668 -98271 -95379 -82944 -67885 -52827 -40273
-6584d0273O829N159J0884Q856J4581J7205J7206J4104J4105J0124N85q364q361r199r196
$$ -40273 -33444 -28285 -17401 -8545 6036 23241 40447 54551 68656 78780 79365 71001 62640 53441 44245
-6569D4245j2300j8022j7011j1283m368m365o098o095o098o094j506j502R99J003l713r434
$$ 44245 31945 13923 -3088 -14371 -18739 -23104 -29202 -35297 -41395 -47489 -48995 -50497 -49498 -48495 -52208 -61642
-6553f1642o575q46k54k49Q20J0366P380k158o695o690o456o452l594l589k758k755k758k755
$$ -61642 -68217 -69063 -69317 -69566 -68746 -58380 -51000 -53158 -59853 -66543 -72999 -79451 -83045 -86634 -89392 -92147 -94905 -97660
-6535i7660N383N386N382N386K878K881l802l798q432q427n569n565r17r13n688n685L542
$$ -97660 -92277 -86891 -81509 -76123 -73245 -70364 -74166 -77964 -86396 -94823 -100392 -105957 -106874 -107787 -113475 -119160 -115618
-6518a15618L544J0221J0224N688N692o717o713n584n580J096J100l139l134k423k419K065
$$ -115618 -112074 -101853 -91629 -85941 -80249 -86966 -93679 -99263 -104843 -103747 -102647 -105786 -108920 -111343 -113762 -111697
-6502a11697J3519J1846J1849Q446Q450J8227J8231Q051l395k326q048l459l455o679o676
$$ -111697 -98178 -86332 -74483 -66037 -57587 -39360 -21129 -13078 -16473 -18799 -26847 -30306 -33761 -40440 -47116
-6487d7116m533m529m532m529O441O445J5029J5032M294M294M294M294m950m950r721r721
$$ -47116 -51649 -56178 -60710 -65239 -58798 -52353 -37324 -22292 -17998 -13704 -9410 -5116 -10066 -15016 -24737 -34458
-6471c4458r542r542R54R54P037P038J5625J5625J5975J5976J1204J1205K795K796n792n793
$$ -34458 -44000 -53542 -52588 -51634 -44597 -37559 -21934 -6309 9666 25642 36846 48051 50846 53642 47850 42057
-6455D2057Q87Q87Q88Q87O493O493L631L630m29m28m29m29Q696Q696J7284J7284L2164L2164
$$ 42057 42944 43831 44719 45606 52099 58592 62223 65853 65424 64996 64567 64138 72834 81530 98814 116098 148262 180426
-6437A80426K6200K6200K7989L9440N5423P4507J02276J28994J80045K37298K95028L37013
$$ 180426 206626 232826 260815 300255 355678 430185 532461 661455 841500 1078798 1373826 1710839
-6425A710839L67907L73631L36745K71859J78941O0619o0447j63503k43299k92918k98502
$$ 1710839 2078746 2452377 2789122 3060981 3239922 3300541 3240094 3076591 2833292 2540374 2241872
-6414B241872k81326k37313j78151j20660o9132k7624o631P831j711j6501l3677n0853p5663
$$ 2241872 1960546 1723233 1545082 1424422 1355290 1327666 1321035 1328866 1327155 1310654 1276977 1226124 1150461
-6401A150461q4250r3793r0401p7042n5333l0524n85J2774K6013K6014J6561L202j9342m4151
$$ 1150461 1066211 972418 882017 804975 749642 719118 718533 731307 757320 783334 799895 803097 783755 739604
-6387G39604o4070q1247q4586p5043o6408n6862m8515l5154j8696r151l787l783r662j9200
$$ 739604 675534 594287 509701 434658 368250 311388 262873 227719 209023 199872 196085 192302 182640 163440
-6373A63440k4332k4329k1947k1943j9085j9080j9092j9087j1816o087o806o803j1577j1573
$$ 163440 139108 114779 92832 70889 51804 32724 13632 -5455 -17271 -23358 -30164 -36967 -48544 -60117
-6359f0117j827p548j0653j0649k304L426N927K05l590r315o452p27J1082J6807K3605K3606
$$ -60117 -61944 -69492 -80145 -90794 -93098 -89672 -83745 -83540 -87130 -96445 -102897 -103624 -92542 -75735 -52130 -28524
-6343b8524J9133N774k934k933j980j979M700M701P047P049J8618J8619K1003P645J3967K3509
$$ -28524 -9391 -3617 -6551 -9484 -11464 -13443 -8743 -4042 3005 10054 28672 47291 68294 75939 89906 113415
-6327A13415K9144J9603L99k4411k5663k5664j1230n506m070j7429j4567n025R826J5551K5570
$$ 113415 142559 162162 162561 138150 112487 86823 75593 70087 66017 48588 34021 28996 38822 54373 79943
-6312G9943J9844Q752q424j5342j5342p887p887n025j0749r729j5454p820p819o04o04P626
$$ 79943 99787 108539 100115 84773 69431 61544 53657 48632 37883 28154 12700 4880 -2939 -3543 -4147 3479
-6296C479P626J2636O910N89q953j0444j9985j5216j5215r788r788n017n018K677K676N539
$$ 3479 11105 23741 30651 31240 22287 11843 -8142 -23358 -38573 -48361 -58149 -63166 -68184 -65507 -62831 -57292
-6280e7292J5081K6621K0895J7556M197J812l914o419j9776k1813k1813o903K639J2420r40
$$ -57292 -42211 -15590 5305 22861 27058 28870 24956 18537 -1239 -23052 -44865 -51768 -49129 -36709 -37649
-6265c7649j416j416J0928J0929J7012J7011J6654P112R259R259K0295J4571J3735Q010j00
$$ -37649 -39065 -40481 -29553 -18624 -1612 15399 32053 39165 48424 57683 77978 92549 106284 114294 114194
-6250A14194r643m633J092K0504K6230L0047L5772M5672L6129L7323K3963M201k0609k7169
$$ 114194 104551 99918 101010 121514 147744 177791 213563 259235 295364 332687 356650 360851 340242 313073
-6236C13073k7169o832j107K829j0530j6553k2279k5619l5160l6533m6074l2596j9237n204
$$ 313073 285904 279072 277965 280794 270264 253711 231432 205813 170653 134120 88046 55450 36213 31009
-6222C1009n203p589j7131k2021k2021n52J2807L3114L3114K6792R617M965m577K341Q066
$$ 31009 25806 18217 1086 -20935 -42956 -43508 -30701 2413 35527 62319 71936 76901 72324 74665 82731
-6207H2731J0176l184j4156k7516r266J1726L5343M1069M5989K1179p68k1761k7724j8183
$$ 82731 92907 89723 75567 48051 38785 50511 85854 126923 172912 194091 193323 171562 143838 125655
-6193A25655O389J2114J3963O08j2517j8238r177j4898p269p265Q805Q807J2860m96o463j6002
$$ 125655 132044 144158 158121 158729 146212 127974 118797 103899 96630 89365 98170 106977 119837 119341 112878 96876
-6177I6876o940j212J193j2162j8369k7907j7772q227P157P160J4761N222J4522J4525J3688
$$ 96876 89936 88724 89917 77755 59386 31479 13707 5480 12637 19797 34558 39780 54302 68827 82515
-6162H2515L31n755k2927l0326n1318n5852o5393n8834o8375p2908r3901q4478m0584L5515
$$ 82515 82846 77091 54164 23838 -27480 -83332 -148725 -207559 -275934 -348842 -442743 -527221 -567805 -532290
-6148e32290J02309J35946J26404J08513P6067M6131K236l3069n0245k7225N219N3882P4876
$$ -532290 -429981 -294035 -167631 -59118 16949 63080 65316 32247 -17998 -45223 -40004 13878 88754
-6135H8754P2759N1766L4114K0754L9719N3078P6338P6337O2978L4352J5744r065j4730j4731
$$ 88754 161513 213279 247393 268147 307866 360944 437282 513619 576597 610949 626693 617628 602898 588167
-6121E88167K922K923l549j6907j2614o888K1321K1320J4880J521L884L884J2472J2472J8078
$$ 588167 591089 594012 590463 573556 560942 554054 575375 596695 611575 613096 616980 620864 633336 645808 663886
-6106F63886R02r475j9018j2158o434J2651K9826N7857P5033Q4098O6922L1526l9082r3953
$$ 663886 664788 655313 636295 624137 617703 630354 660180 718037 793070 877168 944090 975616 936534 842581
-6092H42581j18759n8408Q390N9437R1885J13589R2600M1307k5484n2684o2221n5785l8604
$$ 842581 723822 665414 673804 733241 825126 938715 1031315 1072622 1047138 994454 932233 876448 837844
-6079H37844j8645l9633n9318n9315j4589K9309Q2145J18408J07879P1622O7086Q0448R0584
$$ 837844 819199 779566 720248 660933 646344 675653 757798 876206 984085 1055707 1122793 1203241 1293825
-6066A293825R6312J42350J90064K03729J10219n7249k23279k45528j32927k918O627q8619
$$ 1293825 1390137 1532487 1722551 1926280 2036499 1979250 1755971 1510443 1377516 1374598 1381225 1292606
-6054A292606j78312j58277r9111m4666q401K8332O8412J00659P9669K4799j5275n736L8161
$$ 1292606 1114294 956017 856906 812240 803839 832171 900583 1001242 1080911 1105710 1090435 1084699 1122860
-6041A122860R4217J22848R2309J7885J897M5795J00420J36684J76757K13021K43627K56990
$$ 1122860 1217077 1339925 1432234 1450119 1452016 1497811 1598231 1734915 1911672 2124693 2368320 2625310
-6029B625310K63904K58183K80245K85974K32296R6800p6214k19343k23641r5772O2386J90254
$$ 2625310 2889214 3147397 3427642 3713616 3945912 4042712 3966498 3747155 3523514 3427742 3490128 3680382
-6017C680382K73029L09293L63225M56741N76969O66669P00063O48539N24248L73486K31424
$$ 3680382 3953411 4262704 4625929 5082670 5659639 6326308 7026371 7674910 8199158 8572644 8804068
-6006H804068J03562j2140n6030j7269J10599L13605N48347P57629Q85493R91173J206827
$$ 8804068 8907630 8895490 8839460 8822191 8932790 9246395 9794742 10552371 11437864 12429037 13635864
-5995A3635864J557739J998589K465914K956379L409993L801220M100844M308862M487899
$$ 13635864 15193603 17192192 19658106 22614485 26024478 29825698 33926542 38235404 42723303
-5986D2723303M795156N117441N260572N757397P812773J2396586J9826120L0984372M6872043
$$ 42723303 47518459 52635900 57896472 63653869 71466642 83863228 103689348 134673720 181545763
-5977A81545763O9317152J01918835J47181789J92837273J98393392J08805796n0486918j59361101
$$ 181545763 250862915 352781750 499963539 692800812 891194204 1000000000 949513082 790151981
-5969G90151981j83556194j57744654j14694182p7741158n2061588l5261611k3211940j3915950
$$ 790151981 606595787 448851133 334156951 256415793 204354205 169092594 145880654 131964704
-5961A31964704n614498K967715J2651143K1160817K2455948P686565j5844377k8392337k8214607
$$ 131964704 126350206 129317921 141969064 163129881 185585829 193272394 177428017 149035680 120821073
-5952A20821073k2433958j6039676j1133079p489653m453333j440521K053825O294833J1857916
$$ 120821073 98387115 82347439 71214360 63724707 59271374 57830853 59884678 66179511 78037427
-5943G8037427J9599252K9887630L9015409L6246265J0063075k3542515l8624627l6897487
$$ 78037427 97636679 127524309 166539718 202785983 212849058 189306543 150681916 113784429
-5935A13784429k8087001j9039119j2282326p784143m618418k143176K42360K675613M643325
$$ 113784429 85697428 66658309 54375983 46591840 41973422 39830246 40072606 42748219 47391544
-5926D7391544M122323k83291n323461p284261p003711n759420m417790l217813k341841j697271
$$ 47391544 51513867 51230576 45907115 38622854 31619143 25859723 21441933 18224120 15882279 14185008
-5916A4185008j302222j000395q19090o47573n54057m80109m66745m43849m91555n21796n58053
$$ 14185008 12882786 11882391 11063301 10415728 9861671 9381562 8914817 8470968 7979413 7457617 6899564
-5905F899564m96270m10388l04506k41529j90478j77119j28096r9469n1998p2990j00781j56127
$$ 6899564 6403294 5992906 5688400 5446871 5256393 5079274 4951178 4851709 4799711 4726721 4625940 4469813
-5893D469813j84752k36280k74568l45181l54961k91982j80586j55775j91559k62171k38375
$$ 4469813 4285061 4048781 3774213 3429032 3074071 2782089 2601503 2445728 2254169 1991998 1753623
-5882A753623j41045j0079M1448N5941L4948N1409M1866K3080l9898m9440j730O2110M1121
$$ 1753623 1612578 1602499 1643947 1699888 1734836 1786245 1828111 1851191 1811293 1761853 1760123 1822233 1863354
-5869A863354K233o4559r3428j02966o6709n7163o1730j01803j06101j15639r1906n1826J5681
$$ 1863354 1865587 1801028 1707600 1604634 1537925 1480762 1419032 1317229 1211128 1095489 1003583 951757 967438
-5856I67438M0495N4684L3696l045r2738j50949j56670q4869k5705K9309K3587K2868R512
$$ 967438 1007933 1062617 1096313 1093268 1000530 849581 692911 608042 582337 611646 635233 658101 667613
-5843F67613Q912m443j3631l4620l5336l5336j3508p783k654k3646l1639m4997l8198l8199
$$ 667613 676525 672082 658451 623831 588495 553159 539651 531868 529214 505568 473929 428932 390734 352535
-5829C52535k8895l8437l8675l8676k1857j2316M175j3001j5745k1470j4432j4433L221K0396
$$ 352535 323640 285203 246528 207852 185995 173679 177854 164853 149108 127638 113206 98773 101994 122390
-5815A22390N5151N5151M1195J2569R110J4835M7040P5666Q5458L7748k569m6462n0756l7397
$$ 122390 177541 232692 273887 286456 295566 310401 357441 433107 518565 556313 553744 507282 456526 419129
-5801D19129J487L3931P6557J01367J41205J54565J40609O6180j5406q2200q4623o3631m9317
$$ 419129 420616 454547 531104 632471 773676 928241 1068850 1135030 1119624 1037424 952801 889170 839853
-5788H39853o2677p2099q9275p2815n5639k5082p905K0005K5730K5730M738l731r457K490
$$ 839853 777176 705077 615802 542987 487348 462266 454361 474366 500096 525826 530564 526833 517376 519866
-5774E19866K490k878k3870k8283l7826k6495k0769q744q745l7R505K7396J7855N926j8883
$$ 519866 522356 519478 495608 467325 429499 403004 382235 373491 364746 364709 374214 401610 419465 425391 406508
-5759D06508l2495l8221k7963k2238j8182k7725j1741J618J9539J3814L913j7079k1850k1850
$$ 406508 374013 335792 307829 285591 267409 239684 227943 229561 249100 262914 266827 249748 227898 206048
-5745B06048k2J7153L0785K1243R791j5017k5992l1716j3825m283J771l955m670j0396K009
$$ 206048 206026 223179 253964 275207 284998 269981 243989 212273 198448 194165 195936 191981 187311 176915 178924
-5730A78924J5368L9343L9343L1492O684j5383l6376l0412j7053n244n245j1834l2828m0461
$$ 178924 194292 233635 272978 304470 311154 295771 259395 228983 211930 206686 201441 189607 156779 116318
-5716A16318m0461k7102j7559l84N341J6225J6230P279r892k1944l5298k6356n360J6077J6079
$$ 116318 75857 48755 31196 30812 36153 52378 68608 75887 65995 44051 8753 -17603 -22963 -6886 9193
-5701I193J2259K721R158R162J4049Q327L970n569j2729k2268j2729l183R218J4947J3482
$$ 9193 21452 24173 33331 42493 56542 64869 68839 63270 50541 28273 15544 12361 21579 36526 50008
-5686E0008P760M656M659Q950Q953J1454J916m872m868M194M197L477r877j4772k0493j3460
$$ 50008 57768 62424 67083 76033 84986 96440 98356 93484 88616 92810 97007 100484 90607 75835 55342 41882
-5670D1882l914L359L362R322J8868K8765J9226J1782K244J882J886M894q27L463L466K978
$$ 41882 37968 41327 44689 54011 72879 101644 120870 132652 134896 136778 138664 143558 142731 146194 149660 152638
-5654A52638k743J15J20N214n07n10n07r870j5596j3090p366m383j0109j5118k4661k1522
$$ 152638 149895 150010 150130 155344 154837 154327 153820 143950 128354 115264 107898 103515 93406 78288 53627 32105
-5638C2105j5797p208p209j6035j6035j1980k438J2599K5958K2855R498R09j2449j2808j2806
$$ 32105 16308 9100 1891 -14144 -30179 -42159 -44597 -31998 -6040 16815 26313 27222 14773 1965 -10841
-5623a0841j1436j7161k3960l3501k8970j5610J3016K6375K6520J6979J6501J6501J4712J4711
$$ -10841 -22277 -39438 -63398 -96899 -125869 -141479 -128463 -102088 -75568 -58589 -42088 -25587 -10875 3836
-5609C836P675P675J502m223n774n774j1140j1141L530J3072K5722K5722K0594J1052N804
$$ 3836 11511 19186 20688 16465 10691 4917 -6223 -17364 -13834 -762 24960 50682 71276 82328 88132
-5594H8132l739r106r106K941Q666N804P8j2207j2208k545J0813R363j79k564k565n07n07
$$ 88132 84393 75287 66181 69122 77788 83592 83670 71463 59255 56710 67523 76886 76707 74143 71578 71071 70564
-5577G0564j938j938m562m563J760J759l996r721q648Q95Q402J4127J7824J7824L273k453
$$ 70564 68626 66688 62126 57563 59323 61082 57086 47365 38717 39612 48014 62141 79965 97789 101062 98609
-5561I8609p820k094j096j0638j1831j7556k0329j4604p090j364O806O806Q954L227L676L675
$$ 98609 90789 88695 87599 76961 65130 47574 27245 12641 5551 4187 10993 17799 26753 29980 33656 37331
-5545C7331L317L318J513J513R505R505Q730q13j528M197L675L675Q805Q804O776O777J2143
$$ 37331 40648 43966 45479 46992 56497 66002 74732 73919 72391 76588 80263 83938 92743 101547 108323 115100 127243
-5528A27243J7870J4976J4977J7482K3206L0841M0383N3026P4019R7896J26523J63261K10971
$$ 127243 145113 160089 175066 192548 215754 246595 286978 340004 414023 511919 638442 801703 1012674
-5515A012674K58801L06512L39194L60187L47543K96016K10852J09705j4582j30996k18426
$$ 1012674 1271475 1577987 1917181 2277368 2624911 2920927 3131779 3241484 3226902 3095906 2877480
-5504B877480k85221l27505l27504l00907k57012k12760j65050j17577p7500m6429k1619r572
$$ 2877480 2592259 2264754 1937250 1636343 1379331 1166571 1001521 883944 806444 760015 738396 728824
-5492G28824r572k0426k6151m0107m5832n3571n9295n0231l3054k3274J535J6565L3741N1632
$$ 728824 719252 698826 672675 632568 586736 533165 473870 423639 390585 367311 368846 385411 419152 470784
-5478D70784N7357O2367N2825L7318K0143q483k9477n1214o4574p3638o4097n6761m7219l7438
$$ 470784 528141 590508 643333 680651 700794 692311 662834 611620 547046 473408 409311 352550 305331 267893
-5464B67893k0262j1942o218q364q364j8086j8085k6316k6315k9931k4206j8838j8839j4663
$$ 267893 247631 235689 229471 221107 212743 194657 176572 150256 123941 94010 69804 50966 32127 17464
-5450A7464j4664j2993l451R475J5199P805P806L690L690L332L333q88o612r475l750l034
$$ 17464 2800 -10193 -13644 -4169 11030 18835 26641 30331 34021 37353 40686 39798 33186 23711 19961 16927
-5434A6927l034p090p088l765J961r02r02J12N836N837J12l046l041l044l042r665l936k032
$$ 16927 13893 6803 -285 -4050 -2089 -2991 -3893 -3781 2055 7892 8004 4958 1917 -1127 -4169 -13834 -17770 -19802
-5416a9802k027m805R24j703j700k240P306Q614Q618N579N583j100j095j935j930j2073j2069
$$ -19802 -21829 -26634 -25710 -27413 -29113 -31353 -24047 -15433 -6815 -1236 4347 3247 2152 217 -1713 -13786 -25855
-5399b5855j3221p492l679N867P891P894N625N628l507l508L172L172J025J025j837j838l999
$$ -25855 -39076 -46568 -50247 -44380 -36489 -28595 -22970 -17342 -20849 -24357 -21185 -18013 -16988 -15963 -17800 -19638 -23637
-5382b3637m000m357J368L276L277p79p79Q31O556j435j435j82j83j83j82j048j047J815J815
$$ -23637 -27637 -31994 -30626 -27350 -24073 -24852 -25631 -24800 -18244 -19679 -21114 -21296 -21479 -21662 -21844 -22892 -23939 -22124 -20309
-5363b0309l254l254l254K471l757J972N785N789Q468Q473K146K150k982K748j20j15j0853
$$ -20309 -23563 -26817 -30071 -27600 -31357 -29385 -23600 -17811 -9343 -870 1276 3426 444 3192 3072 2957 -7896
-5346g896n126K39K42m92m88j34j31R40O668N81N86k39k35k38k35o382o377q886q883n773
$$ -7896 -13022 -12783 -12541 -13033 -13521 -13655 -13786 -12846 -6178 -5597 -5011 -5250 -5485 -5723 -5958 -12340 -18717 -27603 -36486 -42259
-5326d2259m9J144J145M28n296k434L291K501K501l224K501N6N6M14M13j591j592j591M133
$$ -42259 -42308 -41164 -40019 -39591 -44887 -47321 -44030 -41529 -39028 -42252 -39751 -39695 -39639 -39225 -38812 -40403 -41995 -43586 -39453
-5307c9453k247L477O15O15J033J032k545L179l39o065q569k844j770j771j413j412l99l99
$$ -39453 -41700 -38223 -37608 -36993 -35960 -34928 -37473 -34294 -34633 -40698 -49267 -52111 -53881 -55652 -57065 -58477 -58876 -59275
-5289e9275l99l99L031L030L030L031J837J838J838J837j90j90j90j90j979j980N297J1022
$$ -59275 -59674 -60073 -57042 -54012 -50982 -47951 -46114 -44276 -42438 -40601 -40791 -40981 -41171 -41361 -43340 -45320 -40023 -29001
-5271b9001N535N535P64P65m067r792l709l708j998j995n397L32M085J226k08N520M443J584
$$ -29001 -23466 -17931 -17167 -16402 -20469 -30261 -33970 -37678 -39676 -41671 -47068 -46736 -42651 -41425 -41633 -36113 -31670 -30086
-5253c0086r24J942L429L433P45P50O86O89o232j1954r512l784m502m499j968j965j610j606
$$ -30086 -31010 -29068 -25639 -22206 -21461 -20711 -20025 -19336 -25568 -37522 -47034 -50818 -55320 -59819 -61787 -63752 -65362 -66968
-5235f6968r721l993r54o676l481o15m197j331J946J949K125K128K453K456K811K814J081
$$ -66968 -76689 -80682 -81636 -88312 -91793 -92408 -96605 -97936 -95990 -94041 -91916 -89788 -87335 -84879 -82068 -79254 -78173
-5218g8173O810L586L589j245j241k139m999r654l925L467O332K781K785K959K963J290J293
$$ -78173 -71363 -67777 -64188 -65433 -66674 -68813 -73812 -83466 -87391 -83924 -77592 -74811 -72026 -69067 -66104 -64814 -63521
-5201f3521J290J294J733J737k680k677n781n2L701O568O236O240J047m674n513n509o050
$$ -63521 -62231 -60937 -59204 -57467 -60147 -62824 -68605 -68657 -64956 -58388 -52152 -45912 -44865 -49539 -55052 -60561 -66611
-5184f6611l20l284m17J189J192r58r54r58r54k330k325K441K445J75J79M947M950qpl049
$$ -66611 -66931 -70215 -70632 -69443 -68251 -69209 -70163 -71121 -72075 -74405 -76730 -74289 -71844 -71669 -71490 -66543 -61593 -61601 -61608 -64657
-5164f4657K676J782M644j260J603k393n256m003J722J901r62o7k929k408M54J529J528L35
$$ -64657 -61981 -60199 -55555 -56815 -55212 -57605 -62861 -66864 -65142 -63241 -64203 -64270 -67199 -69607 -69153 -67624 -66096 -65761
-5146f5761L36k527k528m525m525m525m525L407L407J856l869k464k460J950J953J293J297
$$ -65761 -65425 -67952 -70480 -75005 -79530 -84055 -88580 -85173 -81766 -79910 -83779 -86243 -88703 -86753 -84800 -83507 -82210
-5129h2210k106L623P168M309o45o366j480M249O989O993K210l511m768j901O01O03P79P83
$$ -82210 -84316 -80693 -73525 -69216 -69861 -76227 -77707 -73458 -66469 -59476 -57266 -60777 -65545 -67446 -66845 -66242 -65463 -64680
-5111f4680j129j126l634l631j785L944N132N137O496P76m000J730p20p15l62l58q38q35l702
$$ -64680 -65809 -66935 -70569 -74200 -75985 -72041 -66909 -61772 -55276 -54500 -58500 -56770 -57490 -58205 -58567 -58925 -59763 -60598 -64300
-5092f4300l697k688k683J75J79Q83Q87k158k154o68l526p27N003K896k826m021m019k232
$$ -64300 -67997 -70685 -73368 -73193 -73014 -72131 -71244 -73402 -75556 -76224 -79750 -80477 -75474 -72578 -75404 -79425 -83444 -85676
-5074h5676k229K538K542j308j305J555J558N40N44N41N44k963k960J808J812j61j56j61j56
$$ -85676 -87905 -85367 -82825 -84133 -85438 -83883 -82325 -81785 -81241 -80700 -80156 -83119 -86079 -84271 -82459 -82620 -82776 -82937 -83093
-5055h3093K12K17K12K16L314L317L314L317R58R62R58R61k143k139k144k139j472j469j472
$$ -83093 -82881 -82664 -82452 -82236 -78922 -75605 -72291 -68974 -68016 -67054 -66096 -65135 -67278 -69417 -71561 -73700 -75172 -76641 -78113
-5036g8113j469k546k542L17L21K583K586j00r7m1K825P116J394j085l943l232K497M462J603
$$ -78113 -79582 -82128 -84670 -84353 -84032 -81449 -78863 -78963 -79060 -79101 -76276 -69160 -67766 -68851 -72794 -76026 -73529 -69067 -67464
-5017f7464P04P09J8K3J8K3N55N59R13m808l768l765j264j260k158k154n379L50J182J185
$$ -67464 -66760 -66051 -66033 -66010 -65992 -65969 -65414 -64855 -63942 -68750 -72518 -76283 -77547 -78807 -80965 -83119 -88498 -88148 -86966 -85781
-4997h5781J898l825J957J961M06R952J0172O34j994j991n03m99n03n00J599J603n081n076
$$ -85781 -83883 -87708 -85751 -83790 -83384 -73432 -63260 -62626 -64620 -66611 -67114 -67613 -68116 -68616 -67017 -65414 -70495 -75571
-4979g5571K27K31N85n136n367n364r54r51K147K151K505l217N22N25K669K673M696j025o396
$$ -75571 -75344 -75113 -74528 -79664 -85031 -90395 -91349 -92300 -90153 -88002 -85497 -88714 -88192 -87667 -84998 -82325 -77629 -78654 -85050
-4960h5050o393N22N26N293N296R99J003l772l769k311k307K460K464M011M014p60p57l075
$$ -85050 -91443 -90921 -90395 -85102 -79806 -78807 -77804 -81576 -85345 -87656 -89963 -87503 -85039 -81028 -77014 -77774 -78531 -81606
-4942h1606l071k13k09J458J461J457J462M439M443P660J938j584j580j942j939k911k907
$$ -81606 -84677 -84890 -85099 -83641 -82180 -80723 -79261 -74822 -70379 -62719 -60781 -62365 -63945 -65887 -67826 -70737 -73644
-4925g3644m9m4j719j714L052L057O97P01L39L43P56m964j749j744R39R43R43R43L087L090
$$ -73644 -73693 -73737 -75456 -77170 -74118 -71061 -70364 -69663 -69324 -68981 -68225 -73189 -74938 -76682 -75743 -74800 -73857 -72914 -69827 -66737
-4905f6737L090L090K83K87K87K87k699k694J67J68p08p05P287J562k617k612j09j08j259
$$ -66737 -63647 -60557 -60274 -59987 -59700 -59413 -62112 -64806 -64639 -64471 -65179 -65884 -58597 -57035 -59652 -62264 -62373 -62481 -63740
-4886f3740j257n40o266q058k330M14M13J585m142K300K300j935L791L433L433J361J360J361
$$ -63740 -64997 -65537 -71803 -79861 -82191 -81777 -81364 -79779 -83921 -81621 -79321 -81256 -77465 -74032 -70599 -69238 -67878 -66517
-4868f6517J360M9M8l09l10Q961L239J327J331J088m633j774L954M101M104M457M462P61P64
$$ -66517 -65157 -65108 -65060 -65369 -65679 -56718 -53479 -52152 -50821 -49733 -54366 -56140 -52186 -48085 -43981 -39524 -35062 -34301 -33537
-4849c3537k103k098m536m537m536m532l761l761m477J253O437P12k032k027r58M767J547
$$ -33537 -35640 -37738 -42274 -46811 -51347 -55879 -59640 -63401 -67878 -66625 -60188 -59476 -61508 -63535 -64493 -59726 -58179
-4832e8179J550p19p16p15p16l045l042j79j79J577J580J581J580p49p45K475l251K91K91
$$ -58179 -56629 -57348 -58064 -58779 -59495 -62540 -65582 -65761 -65940 -64363 -62783 -61202 -59622 -60371 -61116 -58641 -61892 -61601 -61310
-4813f1310o7o7j87j86K318K319L004k721n584J42L80L80k124k125L974L973K423l303p97
$$ -61310 -61377 -61444 -61631 -61817 -59499 -57180 -54176 -56897 -62481 -62339 -61959 -61579 -63703 -65828 -61854 -57881 -55458 -58761 -59558
-4794e9558p98m734R92J916l810n89n89q27o553l332l333Q17Q20M58M62J234m488m133m130
$$ -59558 -60356 -65090 -64098 -62182 -65992 -66581 -67170 -67997 -74550 -77882 -81215 -80398 -79578 -79120 -78658 -77424 -81912 -86045 -90175
-4775i0175K337K341K337K341r43r40r43r39K173K177J815J819J338m383m030m025j704j699
$$ -90175 -87838 -85497 -83160 -80819 -81762 -82702 -83645 -84584 -82411 -80234 -78419 -76600 -75262 -79645 -83675 -87700 -89404 -91103
-4757i1103J159J163L84L87L247L250j230j230j230j230L959L958L601L600m54o180k602k602
$$ -91103 -89944 -88781 -88397 -88010 -84763 -81513 -82743 -83973 -85203 -86433 -82474 -78516 -74915 -71315 -71769 -77949 -80551 -83153
-4739h3153o63N062N2N2M160j566l116l116l742l743M846M846L742L742Q80Q80J833J834j028
$$ -83153 -83816 -78754 -78702 -78650 -74490 -76056 -79172 -82288 -86030 -89773 -84927 -80081 -76339 -72597 -71717 -70837 -69004 -67170 -68198
-4720f8198j029J107J111j756j752k262k259m052J677L821L824n92n89n33n30K330K333m80
$$ -68198 -69227 -68120 -67009 -68765 -70517 -72779 -75038 -79090 -77413 -73592 -69768 -70360 -70949 -71482 -72012 -69682 -67349 -67829
-4702f7829m81R50R51j823j823j822j823l642l641o863j136N5N6K919K918N949K24l235l236
$$ -67829 -68310 -67360 -66409 -68232 -70055 -71877 -73700 -77342 -80983 -87846 -88982 -88927 -88871 -85952 -83034 -77085 -76861 -80096 -83332
-4683h3332j327j327J536J536o993o992L503L504K788K788K431K430M435j286j289M439L481
$$ -83332 -84659 -85986 -84450 -82914 -89907 -96899 -93396 -89892 -87104 -84316 -81885 -79455 -75020 -76306 -77595 -73156 -69675
-4666f9675L486L481L485l615r338r340l612O433O437N360N364J185J186l65o091p433p432
$$ -69675 -66189 -62708 -59223 -62838 -72176 -81516 -85128 -78695 -72258 -66898 -61534 -60349 -59163 -59528 -65619 -73052 -80484
-4649h0484o240n14j230j230J990J991K378K378m85m84k408k408r77r76k498k497m286J438
$$ -80484 -86724 -87238 -88468 -89698 -87708 -85717 -83339 -80961 -81446 -81930 -84338 -86746 -87723 -88699 -91197 -93694 -97980 -96542
-4631i6542K453K453J379J379O329O329J558J558l287l284m25m21m958m953k095k091K497
$$ -96542 -94089 -91636 -90257 -88878 -82549 -76220 -74662 -73104 -76391 -79675 -80100 -80521 -85479 -90432 -92527 -94618 -92121
-4614i2121K501N360N364J245J249qmq12K054N270m51n047k180m153m148n74n71n74n70R17
$$ -92121 -89620 -84260 -78896 -77651 -76402 -76410 -76414 -77226 -75172 -69902 -70353 -75400 -77580 -81733 -85881 -86455 -87026 -87600 -88170 -87253
-4594h7253R21R17R20j245j245L348L347J468j394m435J289j051j051K348K349J12K974j737
$$ -87253 -86332 -85415 -84495 -85740 -86985 -83637 -80290 -78822 -80216 -84651 -83362 -84413 -85464 -83116 -80767 -80655 -77681 -79418
-4576g9418p462m085J640K832K833L847L847l012l012l325o187p798k072L533L534M607j118
$$ -79418 -86880 -90965 -89325 -86493 -83660 -79813 -75966 -78978 -81990 -85315 -91502 -99300 -101372 -97839 -94305 -89698 -90816
-4559i0816k856K871M062M063L66L65N44N44l093k32J737l988m346J379K572K572j741j741
$$ -90816 -93672 -90801 -86739 -82676 -82310 -81945 -81401 -80857 -83950 -84182 -82445 -86433 -90779 -89400 -86828 -84256 -85997 -87738
-4541h7738j740j741K434K434K434K434k874k874J898J897k337k337o08N118N140Q003L291
$$ -87738 -89478 -91219 -88785 -86351 -83917 -81483 -84357 -87231 -85333 -83436 -85773 -88110 -88718 -83600 -78460 -70457 -67166
-4524f7166k434k374k375l448K278M052j674o00o00m358J368K621k42j633j633m674m674J886
$$ -67166 -69600 -71974 -74349 -77797 -75519 -71467 -73141 -73741 -74341 -78699 -77331 -74710 -74952 -76585 -78218 -82892 -87566 -85680
-4506h5680J886Q208Q208K616l108p701j976k721J42J931r32k412k411l307K419L225k501
$$ -85680 -83794 -75586 -67378 -64762 -67870 -75571 -77547 -80268 -80126 -78195 -79127 -81539 -83950 -87257 -84838 -81613 -84114
-4489h4114n33K329L92L91N70N70O356O355J584J584J38J38J38J38j055j055J450J450K464
$$ -84114 -84647 -82318 -81926 -81535 -80965 -80395 -74039 -67684 -66100 -64516 -64378 -64240 -64102 -63964 -65019 -66074 -64624 -63174 -60710
-4470f0710l262m1m1j591j592j234j233M66O195L328k393j442j439Q83Q87Q69j991l962J767
$$ -60710 -63972 -64013 -64054 -65645 -67237 -68471 -69704 -69238 -63043 -59715 -62108 -63550 -64989 -64106 -63219 -62350 -64341 -68303 -66536
-4451f6536L731j990m678J051K523l35j60K706k80l138j353j350r80r77r80r76j995j990j636
$$ -66536 -62805 -64795 -69473 -68422 -65899 -66234 -66394 -63688 -63968 -67106 -68459 -69809 -70789 -71766 -72746 -73722 -75717 -77707 -79343
-4432g9343j633J308P038Q286N427K382K385K203K207l284l280m21m18k449k445M14M17MP
$$ -79343 -80976 -79668 -72630 -64344 -58917 -56535 -54150 -51947 -49740 -53024 -56304 -56725 -57143 -59592 -62037 -61623 -61206 -61202 -61195
-4413f1195MQk740k736k740k736j159j155J703J707N11N14j994j990q05M923M921q02j640
$$ -61195 -61191 -61183 -63923 -66659 -69399 -72135 -73294 -74449 -72746 -71039 -70528 -70014 -72008 -73998 -74803 -69880 -64959 -65761 -67401
-4394f7401j636j998j994J953J957r10r05m92m89m92m88M62M66j506J361N651p1j447j442
$$ -67401 -69037 -71035 -73029 -71076 -69119 -70029 -70934 -71426 -71915 -72407 -72895 -72433 -71967 -73473 -72112 -66461 -66532 -67979 -69421
-4375f9421j103j100j103j100M085M089o85o83l075l071k13k08j107j104J756J759q38q35
$$ -69421 -70524 -71624 -72727 -73827 -69742 -65653 -66338 -67021 -70096 -73167 -73380 -73588 -74695 -75799 -74043 -72284 -73122 -73957
-4357g3957q39q35k508k505J070m652n394L36O892O895L672k050J166J171n33n29l396l392
$$ -73957 -74796 -75631 -78139 -80644 -79574 -84226 -89620 -89284 -82392 -75497 -71825 -73875 -72709 -71538 -72071 -72600 -75996 -79388
-4339g9388n93n89n92n89j253j252j253j248j849j849J014J018M860M861J640J644K296l430
$$ -79388 -79981 -80570 -81162 -81751 -83004 -84256 -85509 -86757 -88606 -90455 -89441 -88423 -83563 -78702 -77062 -75418 -73122 -76552
-4321g6552k713k710l317K411q09q08J513J517J517J517n2m9m8m8j365j360J502J502k486
$$ -76552 -79265 -81975 -85292 -82881 -83690 -84498 -82985 -81468 -79951 -78434 -78486 -78535 -78583 -78631 -79996 -81356 -79854 -78352 -80838
-4302h0838k483K285K289j413j409j412j409J196J200J197J200M81M85M80M85p1p1p1p0J599
$$ -80838 -83321 -81036 -78747 -80160 -81569 -82981 -84390 -83194 -81994 -80797 -79597 -79116 -78631 -78151 -77666 -77737 -77808 -77879 -77949 -76350
-4282g6350J599J241J241O45n080n081O45Q24Q24J181J182n56n51K311K311J412J417j446
$$ -76350 -74751 -73510 -72269 -71624 -76704 -81785 -81140 -80316 -79492 -78311 -77129 -77685 -78236 -75925 -73614 -72202 -70785 -72231
-4264g2231j447J264J267j595j595l925l922j058j059J491J491J491J495o56o56o56o53M18
$$ -72231 -73678 -72414 -71147 -72742 -74337 -78262 -82184 -83242 -84301 -82810 -81319 -79828 -78333 -78989 -79645 -80301 -80954 -80536
-4246h0536M17k445k441q35q35q35q31K01K05K01K05K01K06K01K05j87j82j87j82L50L54L51
$$ -80536 -80119 -82564 -85005 -85840 -86675 -87510 -88341 -88140 -87935 -87734 -87529 -87328 -87122 -86921 -86716 -86903 -87085 -87272 -87454 -87104 -86750 -86399
-4224h6399L54J357J356j506j505j268j267j267j268P61P60k102k102k401k400M279M279J658
$$ -86399 -86045 -84688 -83332 -84838 -86343 -87611 -88878 -90145 -91413 -90652 -89892 -91994 -94096 -96497 -98897 -94618 -90339 -88681
-4206h8681J659M522M521n48n48n48n48K57K58L119L120k725k724k725k725K390K389m74m73
$$ -88681 -87022 -82500 -77979 -78527 -79075 -79623 -80171 -79914 -79656 -76537 -73417 -76142 -78866 -81591 -84316 -81926 -79537 -80011 -80484
-4187h0484n33n33l54l54j487J375K986k740j487j488j845j845J734J737J737J737J196J200
$$ -80484 -81017 -81550 -81904 -82258 -83745 -82370 -79384 -82124 -83611 -85099 -86944 -88789 -87055 -85318 -83581 -81844 -80648 -79448
-4169g9448N972N971J077J081J081J081k501k498n717PR73R77j529j528j413j409j409j409
$$ -79448 -73476 -67505 -66428 -65347 -64266 -63185 -65686 -68184 -73901 -73894 -72921 -71944 -73473 -75001 -76414 -77823 -79232 -80641
-4151h0641l887l884o64o63k874K855K498K497k263k262O00O00J435J435l336l336k769k770
$$ -80641 -84528 -88412 -89076 -89739 -92613 -89758 -87260 -84763 -87026 -89288 -88688 -88088 -86653 -85218 -88554 -91890 -94659 -97429
-4133i7429j398M328M447J584r21J942L977L978M334j390J473j391j032l895m492J234K307
$$ -97429 -98827 -94499 -90052 -88468 -89389 -87447 -83470 -79492 -75158 -76548 -75075 -76466 -77498 -81393 -85885 -84651 -82344
-4116h2344n55r73r73J711J711J293J297j565j566o74o71K191K192N33N37N37N36N33N37N37
$$ -82344 -82899 -83872 -84845 -83134 -81423 -80130 -78833 -80398 -81964 -82638 -83309 -81118 -78926 -78393 -77856 -77319 -76783 -76250 -75713 -75176
-4096g5176N37R65R69j893j894K50K53K54K53J696J700j163j163K65K68K68K69K87K87k576
$$ -75176 -74639 -73674 -72705 -74598 -76492 -76242 -75989 -75735 -75482 -73786 -72086 -73249 -74412 -74147 -73879 -73611 -73342 -73055 -72768 -75344
-4076g5344k576o67o67o67o67k665k666K106K106R14R13L776L776k636k635k635k636j084
$$ -75344 -77920 -78587 -79254 -79921 -80588 -83253 -85919 -83813 -81707 -80793 -79880 -76104 -72328 -74964 -77599 -80234 -82870 -83954
-4058h3954j085j085j084K523K524k248k248l619l619J152J151K535K535l28l28j402j401
$$ -83954 -85039 -86124 -87208 -84685 -82161 -84409 -86657 -90276 -93895 -92743 -91592 -89057 -86522 -86850 -87178 -88580 -89981
-4041h9981J461J461K952K952R0Q9J342J342J342J341q83q80J980J983k613k609K49K54m164
$$ -89981 -88520 -87059 -84107 -81155 -81065 -80976 -79634 -78292 -76950 -75609 -76492 -77372 -75392 -73409 -76022 -78631 -78382 -78128 -82292
-4022h2292m160O08O11M29M32M29M32n92n89K270K273Q99R02j965j960J584J588j279j274
$$ -82292 -86452 -85844 -85233 -84804 -84372 -83943 -83511 -84103 -84692 -82422 -80149 -79250 -78348 -80313 -82273 -80689 -79101 -80380 -81654
-4003h1654Q68Q72Q69Q72K423K423K422K423l80l80K482K483k140k139k140k139j424j424
$$ -81654 -80786 -79914 -79045 -78173 -75750 -73327 -70905 -68482 -68862 -69242 -66760 -64277 -66417 -68556 -70696 -72835 -74259 -75683
-3985g5683j424j424J704J703j159j159j995j994j994j994n03n03K359K359J883J882L32n394
$$ -75683 -77107 -78531 -76827 -75124 -76283 -77442 -79437 -81431 -83425 -85419 -85922 -86425 -84066 -81707 -79824 -77942 -77610 -83004
-3967h3004k247k248o37l500j711M014K225o37Q54Q53k009k009R13L776K881k844q53M872
$$ -83004 -85251 -87499 -88136 -91636 -93347 -89333 -87108 -87745 -86891 -86038 -88047 -90056 -89143 -85367 -82486 -85330 -86183 -81311
-3949h1311M513j211J293J294l836l835l180l179l180l179K904K903O124L99m134m133l120
$$ -81311 -76798 -78009 -76716 -75422 -79258 -83093 -86273 -89452 -92632 -95811 -92907 -90004 -83880 -83481 -87615 -91748 -94868
-3932i4868K605L620P56L083k643P27P27L69L69j182j181j182j181K564K565k99k98j610j610
$$ -94868 -92263 -88643 -87887 -84804 -87447 -86720 -85993 -85624 -85255 -86437 -87618 -88800 -89981 -87417 -84852 -85151 -85449 -87059 -88669
-3913h8669j611j610r84r84J879J878J640J640J640J641N628N628Q58Q57k900k900l7l7n45
$$ -88669 -90280 -91890 -92874 -93858 -91979 -90101 -88461 -86821 -85181 -83540 -77912 -72284 -71426 -70569 -73469 -76369 -76406 -76443 -76988
-3894g6988n44n315n315n018n017J663J662J950J949J950J949L083L082K20K20j38j38l000
$$ -76988 -77532 -82847 -88162 -93180 -98197 -96534 -94872 -92922 -90973 -89023 -87074 -83991 -80909 -80689 -80469 -80607 -80745 -83745
-3876h3745l001j98j97j98j97L69L69K874K873J085m640l47K516K247o15l596l597R35R36
$$ -83745 -86746 -86944 -87141 -87339 -87536 -87167 -86798 -83924 -81051 -79966 -84606 -84953 -82437 -80190 -80805 -84401 -87998 -87063 -86127
-3857h6127R35R36N010N009K39K38j79j79j78j79j909j908j909j908q95q94J968J968k2k3
$$ -86127 -85192 -84256 -79246 -74237 -73998 -73760 -73939 -74118 -74296 -74475 -76384 -78292 -80201 -82109 -83004 -83898 -81930 -79962 -79984 -80007
-3837h0007k2k3j334j334L078L079K721l004K16K16k050k050J171m555P82P83k080k080n88
$$ -80007 -80029 -80052 -81386 -82720 -79642 -76563 -73842 -76846 -76630 -76414 -78464 -80514 -79343 -83898 -83116 -82333 -84413 -86493 -87081
-3818h7081N136M778M779j006j007J856J857r47r47r47r46l728l727J043J044J640J640j222
$$ -87081 -81945 -77167 -72388 -73394 -74401 -72545 -70688 -71635 -72582 -73529 -74475 -78203 -81930 -80887 -79843 -78203 -76563 -77785
-3800g7785j223q05q05q05q05k118k117J104m622n029n024j927L802R95R99M216M219J502
$$ -77785 -79008 -79813 -80618 -81423 -82228 -84346 -86463 -85359 -89981 -95010 -100034 -101961 -98159 -97164 -96165 -91949 -87730 -86228
-3782h6228J506j361j356j898j893R65R69o59o56o60o56J487J491J487J491R36R39j927j923
$$ -86228 -84722 -86083 -87439 -89337 -91230 -90265 -89296 -89955 -90611 -91271 -91927 -90440 -88949 -87462 -85971 -85035 -84096 -86023 -87946
-3763h7946l001k997J771J774M51M51M51M51k64k65k65k64k009k010Q54Q54q76q76J986J987
$$ -87946 -90947 -93944 -92173 -90399 -89948 -89497 -89046 -88595 -88859 -89124 -89389 -89653 -91662 -93672 -92818 -91964 -92840 -93716 -91730 -89743
-3743h9743K807K807n6n6j845j845j845j845N10N11N11N10J226J227J226J226n81n82n81n81
$$ -89743 -86936 -84129 -84185 -84241 -86086 -87931 -89776 -91621 -91111 -90600 -90089 -89579 -88353 -87126 -85900 -84674 -85255 -85837 -86418 -86999
-3723h6999J744J744j118j118N96N97k982K743K028l698j19j19o41o42K222K222O11O11O11
$$ -86999 -85255 -83511 -84629 -85747 -85151 -84554 -87536 -84793 -82765 -86463 -86582 -86701 -87342 -87984 -85762 -83540 -82929 -82318 -81707
-3704h1707O12o26o27o26o26N66N67N67N66K13K12K13K12P49P49J107m618j681j681j681j681
$$ -81707 -81095 -81721 -82348 -82974 -83600 -83034 -82467 -81900 -81334 -81121 -80909 -80696 -80484 -79735 -78986 -77879 -82497 -84178 -85859 -87540 -89221
-3683h9221m365J361j860j860J398J397J398J398J219J219J576J577k300L426k658k658m446
$$ -89221 -93586 -92225 -94085 -95945 -94547 -93150 -91752 -90354 -89135 -87916 -86340 -84763 -87063 -83637 -86295 -88953 -93399
-3666i3399m447K232K233K039K043K039K042m8m5k911k907k807k803L873L876J308J312J309
$$ -93399 -97846 -95614 -93381 -91342 -89299 -87260 -85218 -85266 -85311 -88222 -91129 -93936 -96739 -92866 -88990 -87682 -86370 -85061
-3648h5061J312L46L51L209L213Q84Q87Q83Q87k397k393k396k393P04P08k158k154l004l005
$$ -85061 -83749 -83403 -83052 -79843 -76630 -75746 -74859 -73976 -73089 -75486 -77879 -80275 -82668 -81964 -81256 -83414 -85568 -88572 -91577
-3629i1577J767J771J826J826J827J830K065K065p98p94m376m376m376m372l131l131J640
$$ -91577 -89810 -88039 -86213 -84387 -82560 -80730 -78665 -76600 -77398 -78192 -82568 -86944 -91320 -95692 -98823 -101954 -100314
-3612a00314J644L250L251j521j517m861m860J819J822J819J819J819J823M03M06M02M07J595
$$ -100314 -98670 -95420 -92169 -93690 -95207 -100068 -104928 -103109 -101287 -99468 -97649 -95830 -94007 -93604 -93198 -92796 -92389 -90794
-3594i0794J599j267j264m652m648J20J23J789J793J789J793Q57Q61Q57Q61j170j167J692
$$ -90794 -89195 -90462 -91726 -96378 -101026 -100906 -100783 -98994 -97201 -95412 -93619 -92762 -91901 -91044 -90183 -91353 -92520 -90828
-3576i0828J696J648J651m435m432m496N051l20l17L362L366j406j405K61K65K64K65L720
$$ -90828 -89132 -87484 -85833 -90268 -94700 -99196 -94145 -94465 -94782 -91420 -88054 -89460 -90865 -90604 -90339 -90075 -89810 -86090
-3558h6090L724j048j047m093m089K591K590K803K807j964j965j013j011j010j010L13L17
$$ -86090 -82366 -83414 -84461 -88554 -92643 -90052 -87462 -84659 -81852 -83816 -85781 -86794 -87805 -88815 -89825 -89512 -89195
-3541h9195L17L17M92M95M96M96j267j268J596J595k162k162k162k162k206k207k206k207
$$ -89195 -88878 -88561 -88069 -87574 -87078 -86582 -87849 -89117 -87521 -85926 -88088 -90250 -92412 -94574 -96780 -98987 -101193 -103400
-3523a03400J670J670J670J669M749M749J886J886P53P53k110k110k676k676J86J87K154K155
$$ -103400 -101730 -100060 -98390 -96721 -91972 -87223 -85337 -83451 -82698 -81945 -84055 -86165 -88841 -91517 -91331 -91144 -88990 -86835
-3505h6835p09p08n93n92n93n93Q99Q98l873l872j011j010J853J852L046L045J83J82J473
$$ -86835 -87544 -88252 -88845 -89437 -90030 -90623 -89724 -88826 -92699 -96571 -97582 -98592 -96739 -94887 -91841 -88796 -88613 -88431 -86958
-3486h6958J472j390j391o74o75M096M097J621J622j242j241l328l329k971k971q345k621
$$ -86958 -85486 -86876 -88267 -88941 -89616 -85520 -81423 -79802 -78180 -79422 -80663 -83991 -87320 -90291 -93262 -101607 -104228
-3469a04228K748K747P19P19L582L583j204j204j204j204J778J778j085j085J137J137J137
$$ -104228 -101480 -98733 -98014 -97295 -93713 -90130 -91334 -92538 -93742 -94946 -93168 -91390 -92475 -93560 -92423 -91286 -90149
-3452i0149J137P79P79P79P79K076K076p86p87K911K911K733K732o382r244m532J193J670
$$ -90149 -89012 -88233 -87454 -86675 -85896 -83820 -81744 -82530 -83317 -80406 -77495 -74762 -72030 -78412 -87656 -92188 -90995 -89325
-3434h9325m056l697K027M77M78J192J193M77O203J19J19J722J722l049l049J72J71J72J71
$$ -89325 -93381 -97078 -95051 -94574 -94096 -92904 -91711 -91234 -85031 -84912 -84793 -83071 -81349 -84398 -87447 -87275 -87104 -86932 -86761
-3415h6761K378K378K378K378J544J543m25K438k162p884l414n48K609k50o396l530K073P801
$$ -86761 -84383 -82005 -79627 -77249 -75705 -74162 -74587 -72149 -74311 -82195 -85609 -86157 -83548 -83798 -90194 -93724 -91651 -83850
-3397h3850O367L507j446j443j625j621l027l023M33O161N52N55R09R14l564l559l43l39l027
$$ -83850 -77483 -73976 -75422 -76865 -78490 -80111 -83138 -86161 -85728 -79567 -79015 -78460 -77551 -76637 -80201 -83760 -84103 -84442 -87469
-3378h7469K702M249M253J786J789j077j074l61l58l62l57N92N97N92N97J308J312j554j551
$$ -87469 -84767 -80518 -76265 -74479 -72690 -73767 -74841 -75202 -75560 -75922 -76279 -75687 -75090 -74498 -73901 -72593 -71281 -72835 -74386
-3359g4386m715m712l164K564J488J491J845J848K95K98K95K98j376j371j376j371Q42Q46
$$ -74386 -79101 -83813 -86977 -84413 -82925 -81434 -79589 -77741 -77446 -77148 -76853 -76555 -77931 -79302 -80678 -82049 -81207 -80361
-3341h0361Q42Q47J915J920k855k852K572K576m108m104R62R66R61R66m481m476K199K203
$$ -80361 -79519 -78672 -76757 -74837 -77692 -80544 -77972 -75396 -79504 -83608 -82646 -81680 -80719 -79753 -84234 -88710 -86511 -84308
-3323h4308K557K560o63N066J185J189M048M052N240m81k035k031n293n289n293n289j954
$$ -84308 -81751 -79191 -79854 -74788 -73603 -72414 -68366 -64314 -59074 -59555 -61590 -63621 -68914 -74203 -79496 -84785 -86739
-3306h6739j949j595j592J655P384P01n021l13l10o70o68J659J659J658J659o67o67l10l09
$$ -86739 -88688 -90283 -91875 -90220 -82836 -82135 -87156 -87469 -87779 -88449 -89117 -87458 -85799 -84141 -82482 -83149 -83816 -84126 -84435
-3287h4435n170N55K106K106J093J092j413j413n25N203k792k788j360j357J502J506L99M02
$$ -84435 -89605 -89050 -86944 -84838 -83745 -82653 -84066 -85479 -86004 -80801 -83593 -86381 -87741 -89098 -87596 -86090 -85691 -85289
-3269h5289L262L265J293J298j927L802P152P153J1686J1685N245m298r069r069q621k896
$$ -85289 -82027 -78762 -77469 -76171 -78098 -74296 -67144 -59991 -48305 -36620 -31375 -35673 -44742 -53811 -62432 -65328
-3253f5328l92r933m805R21J875J875n11n07n11n07k538k535L25L28J576J581J219J222L84
$$ -65328 -65720 -75653 -80458 -79537 -77662 -75787 -76298 -76805 -77316 -77823 -80361 -82896 -82571 -82243 -80667 -79086 -77867 -76645 -76261
-3234g6261n337k121k118j785j782K986K989l753l750q91q87j398j394J465J469L91L95L254
$$ -76261 -81598 -83719 -85837 -87622 -89404 -86418 -83429 -87182 -90932 -91823 -92710 -94108 -95502 -94037 -92568 -92177 -91782 -88528
-3216h8528L258l042l037J729J733N666N669Q95Q98M891M894L697k024j669M059L697k024
$$ -88528 -85270 -88312 -91349 -89620 -87887 -82221 -76552 -75657 -74759 -69868 -64974 -61277 -63301 -64970 -60911 -57214 -59238
-3199e9238k527k523k885k882l899l895Q73Q75J678J681J677J681m167m164j304j301j465
$$ -59238 -61765 -64288 -67173 -70055 -73954 -77849 -76976 -76101 -74423 -72742 -71065 -69384 -73551 -77715 -79019 -80320 -81785
-3182h1785j461j465j461J517J521j346j342l%L216k504M73M77k747k743J8K3J8K3m59m55
$$ -81785 -83246 -84711 -86172 -84655 -83134 -84480 -85822 -85825 -85825 -82609 -85113 -84640 -84163 -86910 -89653 -89635 -89612 -89594 -89571 -90030 -90485
-3161i0485N625r7j651j648k009k005m58m55m59m54M860M861Q9R0k09k09L370k356k639L086
$$ -90485 -84860 -84957 -86608 -88256 -90265 -92270 -92728 -93183 -93642 -94096 -89236 -84375 -84286 -84196 -84405 -84614 -81244 -83600 -86239 -83153
-3141h3153m92m92J64J64j94j93J200m525K46N971j483j484j126j125J11J12J12J12l407l407
$$ -83153 -83645 -84137 -83973 -83809 -84003 -84196 -82996 -87521 -87275 -81304 -82787 -84271 -85397 -86522 -86411 -86299 -86187 -86075 -89482 -92889
-3121i2889j856L869J990J995K348K352J632J637j230j227J782J786J781J786j976j972j975
$$ -92889 -94745 -90876 -88886 -86891 -84543 -82191 -80559 -78922 -80152 -81379 -79597 -77811 -76030 -74244 -76220 -78192 -80167
-3104h0167j972j413j409j412j409j651j648J211J216j085j081J778J782m902m898J778J782
$$ -80167 -82139 -83552 -84961 -86373 -87782 -89433 -91081 -89870 -88654 -89739 -90820 -89042 -87260 -92162 -97060 -95282 -93500
-3087i3500L880L880q90q91K449K449k024k024k651K121M984K12j45j45N10L373J909k863
$$ -93500 -89620 -85740 -86630 -87521 -85072 -82623 -84647 -86671 -89322 -87201 -82217 -82005 -82150 -82295 -81785 -78412 -76503 -79366
-3069g9366%%L757L758o0m831n635k774J998J998J759J760j104j103J271J271J569J570l620
$$ -79366 -79366 -79366 -75609 -71851 -71911 -76742 -82377 -85151 -83153 -81155 -79396 -77636 -78740 -79843 -78572 -77301 -75732 -74162 -77782
-3050g7782J152M551J689J852k918l277l276r50r51r50r51K13K12K12K13K002K001k769R3
$$ -77782 -76630 -72079 -70390 -68538 -71456 -74733 -78009 -78959 -79910 -80860 -81811 -81598 -81386 -81174 -80961 -78959 -76958 -79727 -79634
-3031g9634j040n811k770k769K240N103J405l366j219j218J345J346j875j875R88R88k755
$$ -79634 -80674 -86485 -89255 -92024 -89784 -84681 -83276 -86642 -87861 -89079 -87734 -86388 -88263 -90138 -89150 -88162 -90917
-3014i0917k755K017K017J300J301L866L865M924J53k6k7k590k591K72K73k561k561L02L02
$$ -90917 -93672 -91655 -89638 -88338 -87037 -83171 -79306 -74382 -74229 -74255 -74282 -76872 -79463 -79191 -78918 -81479 -84040 -83738 -83436
-2995h3436j308j309j308j308J737J737j126j126L169L168j603j603N2N3N2N2j558j558J304
$$ -83436 -84744 -86053 -87361 -88669 -86932 -85195 -86321 -87447 -84278 -81110 -82713 -84316 -84264 -84211 -84159 -84107 -85665 -87223 -85919
-2976h5919J305j081j081L690L690j140j141j140j141M85M84k378k378k438k437k438k438
$$ -85919 -84614 -85695 -86776 -83086 -79396 -80536 -81677 -82817 -83958 -83473 -82989 -85367 -87745 -90183 -92620 -95058 -97496
-2959i7496q39q34q39q35m81m77K382K385M291M294m81K385N304N37j375j372k583k579k584
$$ -97496 -98335 -99169 -100008 -100843 -101324 -101801 -99419 -97034 -92743 -88449 -88930 -86545 -81241 -80704 -82079 -83451 -86034 -88613 -91197
-2940i1197k579r13r10r13r09K367K370m96m92N78N82N349N352j707j704j707j703L20L25
$$ -91197 -93776 -94689 -95599 -96512 -97421 -95054 -92684 -93180 -93672 -93094 -92512 -87163 -81811 -83518 -85222 -86929 -88632 -88312 -87987
-2921h7987L20L25k841k836K885P660K765r3L601P42m384j517j700m558R84R88k058k054M48
$$ -87987 -87667 -87342 -90183 -93019 -90134 -82474 -79709 -79802 -76201 -75459 -79843 -81360 -83060 -87618 -86634 -85646 -87704 -89758 -89310
-2902h9310M51M47M51N07N10k355k352J144J144j718j718K49K50K50K50O37O37k225k225Q76
$$ -89310 -88859 -88412 -87961 -87454 -86944 -89299 -91651 -90507 -89363 -91081 -92799 -92550 -92300 -92050 -91800 -91163 -90526 -92751 -94976 -94100
-2882i4100Q76L738L739j182j181P27k136j540L232L69L69K904K903M1M1j450j450j450j449
$$ -94100 -93224 -89486 -85747 -86929 -88110 -87383 -89519 -91059 -87827 -87458 -87089 -84185 -81282 -81241 -81200 -82650 -84100 -85550 -86999
-2863h6999k32k27k31k27L65L69L049j718k036k031j379J487J841k926o7o3L168L172j603
$$ -86999 -87231 -87458 -87689 -87916 -87551 -87182 -84133 -85851 -87887 -89918 -91297 -89810 -87969 -90895 -90962 -91025 -87857 -84685 -86288
-2844h6288j599R02R06R02R06J051J055j812j807o79o74K005k762N03N07k658k653J457J461
$$ -86288 -87887 -86985 -86079 -85177 -84271 -83220 -82165 -83977 -85784 -86463 -87137 -85132 -87894 -87391 -86884 -89542 -92195 -90738 -89277
-2825h9277n11K356O38n085k046L683K844K847j569j565J643J644J644J644l24l25o82o82
$$ -89277 -89788 -87432 -86794 -91879 -93925 -90242 -87398 -84551 -86120 -87685 -86042 -84398 -82754 -81110 -81434 -81759 -82441 -83123
-2807h3123Q98m827j248j249j75N550L940J077K50K49k791k792k076k077P87P86J025J026
$$ -83123 -82225 -87052 -88300 -89549 -89724 -84174 -80234 -79157 -78907 -78658 -81449 -84241 -86317 -88394 -87607 -86821 -85796 -84770
-2789h4770J025J025m66m66m66m66k218k214k218k214M06M10M07M10J368J371J368J372k210
$$ -84770 -83745 -82720 -83186 -83652 -84118 -84584 -86802 -89016 -91234 -93448 -93042 -92632 -92225 -91815 -90447 -89076 -87708 -86336 -88546
-2770h8546k207O52O56j08j08K755K754j002j003L768L769J137J136J137J137k620k621k262
$$ -88546 -90753 -90101 -89445 -89553 -89661 -86906 -84152 -85154 -86157 -82389 -78620 -77483 -76347 -75210 -74073 -76693 -79314 -81576
-2752h1576k263m745R81k240k241K65K65L127L127K889K889j883j882N63N63N63N62k460k460
$$ -81576 -83839 -88584 -87603 -89843 -92084 -91819 -91554 -88427 -85300 -82411 -79522 -81405 -83287 -82724 -82161 -81598 -81036 -83496 -85956
-2733h5956K311K311l176l175l13l14m4m5L13L13p60M965l027l027o63o64o63o63K31K31K31
$$ -85956 -83645 -81334 -84510 -87685 -87998 -88312 -88356 -88401 -88088 -87775 -88535 -83570 -86597 -89624 -90287 -90951 -91614 -92277 -92046 -91815 -91584
-2712i1584K31K259K259K258K259Q87Q87l884l884r91r91r92r91M077M078J215J215j945j946
$$ -91584 -91353 -89094 -86835 -84577 -82318 -81431 -80544 -84428 -88312 -89303 -90294 -91286 -92277 -88200 -84122 -82907 -81692 -83637 -85583
-2693h5583R17R17k244k244k244k244K326K326n37n36j074j073L697L698L95L95J111m615
$$ -85583 -84666 -83749 -85993 -88237 -90481 -92725 -90399 -88073 -88610 -89146 -90220 -91293 -87596 -83898 -83503 -83108 -81997 -86612
-2675h6612l123K601K244l481n59n56L854L858j155j152J707J711q05q01q06q01j819j815
$$ -86612 -89735 -87134 -84890 -88371 -88930 -89486 -85632 -81774 -82929 -84081 -82374 -80663 -81468 -82269 -83075 -83876 -85695 -87510
-2657h7510j819j815K214K218K214K217n89n85n89n85Q65Q68j997j995j282j278j998L731
$$ -87510 -89329 -91144 -88930 -86712 -84498 -82281 -82870 -83455 -84044 -84629 -83764 -82896 -84893 -86888 -88170 -89448 -91446 -87715
-2639h7715J580m141n66n63J49J53J49J53J587J592l183l180j990j987K781K784L36L39L35
$$ -87715 -86135 -90276 -90842 -91405 -91256 -91103 -90954 -90801 -89214 -87622 -90805 -93985 -95975 -97962 -95181 -92397 -92061 -91722 -91387
-2620i1387L40L496L500k825k822j126M604J737l985k497k494k497k494K043P767J685J685
$$ -91387 -91047 -87551 -84051 -86876 -89698 -90824 -86220 -84483 -88468 -90965 -93459 -95956 -98450 -96407 -88640 -86955 -85270
-2603h5270j536j535J327J327M62M62M62M62k579k579n800p5J767J767J767J766K065l660
$$ -85270 -86806 -88341 -87014 -85687 -85225 -84763 -84301 -83839 -86418 -88997 -94797 -94872 -93105 -91338 -89571 -87805 -85740 -89400
-2585h9400p98M928O93O94J051J051j42j41j42j42L083L086K20K24l538l533o75o71k382k378
$$ -89400 -90198 -85270 -84577 -83883 -82832 -81781 -81923 -82064 -82206 -82348 -79265 -76179 -75959 -75735 -79273 -82806 -83481 -84152 -86534 -88912
-2565h8912K390K393o53o48m74m69l538o70L977j745l537o71K188o71m730R99L679k043K80
$$ -88912 -86522 -84129 -84782 -85430 -85904 -86373 -89911 -90581 -86604 -88349 -91886 -92557 -90369 -91040 -95770 -94771 -91092 -93135 -92855
-2546i2855K83p8p5K546K546J651j211k762K963J174j688K49K50q24l686k196L530L530k195
$$ -92855 -92572 -92650 -92725 -90179 -87633 -85982 -87193 -89955 -86992 -85818 -87506 -87257 -87007 -87831 -91517 -93713 -90183 -86653 -88848
-2527h8848k158P04J599J599K315K315m89l351k225L500J890r73p94K069J890r73l772l769
$$ -88848 -91006 -90302 -88703 -87104 -84789 -82474 -82963 -86314 -88539 -85039 -83149 -84122 -84916 -82847 -80957 -81930 -85702 -89471
-2509h9471Q20Q24q50q46m92m88l519K210L400L403M413j308k565L02j699j696j521j517j342
$$ -89471 -88651 -87827 -88677 -89523 -90015 -90503 -94022 -91812 -88412 -85009 -80596 -81904 -84469 -84167 -85866 -87562 -89083 -90600 -91942
-2490i1942j338J521J524J096J100j409j406k482L247K2K6J491J491J133J133%n725n725%
$$ -91942 -93280 -91759 -90235 -89139 -88039 -89448 -90854 -93336 -90089 -90067 -90041 -88550 -87059 -85926 -84793 -84793 -90518 -96243 -96243
-2471i6243M033M033M748r76j096j096n59K304N948K24o277n52m547m547N81N82L42L43L43
$$ -96243 -92210 -88177 -83429 -84405 -85501 -86597 -87156 -84852 -78904 -78680 -84957 -85509 -90056 -94603 -94022 -93440 -93098 -92755 -92412
-2452i2412L43K609K610K609K609O93O94k170k169j454j454j453j454k229k229K542K542k646
$$ -92412 -92069 -89460 -86850 -84241 -81632 -80939 -80245 -82415 -84584 -86038 -87492 -88945 -90399 -92628 -94857 -92315 -89773 -92419
-2434i2419k647K17K16J170J171j693j692K542K542K542K542J946J946r17r17j812j811o583
$$ -92419 -95066 -94849 -94633 -93463 -92292 -93985 -95677 -93135 -90593 -88051 -85509 -83563 -81617 -82534 -83451 -85263 -87074 -93657
-2416i3657o582L075L075K12K13K836K837j934j935k441k442K330K329J137J137l634l634
$$ -93657 -100239 -97164 -94089 -93877 -93664 -90828 -87991 -89925 -91860 -94301 -96743 -94413 -92084 -90947 -89810 -93444 -97078
-2399i7078K650K650k12k13K591K590N453N454j227j226j226j227j942j942R21R21j133j130
$$ -97078 -94428 -91778 -91990 -92203 -89612 -87022 -81569 -76115 -77342 -78568 -79794 -81021 -82963 -84905 -83984 -83063 -84196 -85326
-2381h5326j133j129k267k262M413M417J148J152j715j711L13L17L13L17j632j629j633j629
$$ -85326 -86459 -87588 -89855 -92117 -87704 -83287 -82139 -80987 -82702 -84413 -84100 -83783 -83470 -83153 -84785 -86414 -88047 -89676
-2363h9676O94O97O93O97J662J666M526M528j86j83j86j83p71p72p71p72j487j487j488j487
$$ -89676 -88982 -88285 -87592 -86895 -85233 -83567 -79041 -74513 -74699 -74882 -75068 -75251 -76022 -76794 -77565 -78337 -79824 -81311 -82799 -84286
-2343h4286K240K240K241K240Q68Q69Q68Q69l92l91l254l254k360k359N03N03j718j718J144
$$ -84286 -82046 -79806 -77565 -75325 -74457 -73588 -72720 -71851 -72243 -72634 -75888 -79142 -81502 -83861 -83358 -82855 -84573 -86291 -85147
-2324h5147J144k87k87k87k87j062j059j062j058J382J387J383J386k42k38j197m055j674
$$ -85147 -84003 -84290 -84577 -84864 -85151 -86213 -87272 -88334 -89392 -88010 -86623 -85240 -83854 -84096 -84334 -85531 -89586 -91260
-2306i1260L101K919j849N96N97K98K98q94q95q95q94J282J282J283J282N66N67N67N66k758
$$ -91260 -88159 -85240 -87089 -86493 -85896 -85598 -85300 -86194 -87089 -87984 -88878 -87596 -86314 -85031 -83749 -83183 -82616 -82049 -81483 -84241
-2286h4241k755k758k755K252K255K251K255j729j726j730j725K38K43K38K42J372J372j491
$$ -84241 -86996 -89754 -92509 -90257 -88002 -85751 -83496 -85225 -86951 -88681 -90406 -90168 -89925 -89687 -89445 -88073 -86701 -88192
-2268h8192j491o0n9o0o0K430K431m33m32K83K84K83K83J014J018j849j845j79j75K683K688
$$ -88192 -89683 -89743 -89802 -89862 -89922 -87492 -85061 -85494 -85926 -85643 -85359 -85076 -84793 -83779 -82761 -84610 -86455 -86634 -86809 -84126 -81438
-2247h1438Q05Q09K117p42l906q674j103J763J998K001K177K181l847l843R25R28j998j994
$$ -81438 -80633 -79824 -77707 -78449 -82355 -91029 -92132 -90369 -88371 -86370 -84193 -82012 -85859 -89702 -88777 -87849 -89847 -91841
-2229i1841Q64L731J402l366l071l068R7M868K184K185k110k110P53P53L466L467O04O04J856
$$ -91841 -90977 -87246 -85844 -89210 -92281 -95349 -95252 -90384 -88200 -86015 -88125 -90235 -89482 -88729 -85263 -81796 -81192 -80588 -78732
-2210g8732J856k915n2L064j707j707j707k900k900J871r92k512K259L869J006k631k632k214
$$ -78732 -76876 -79791 -79843 -76779 -78486 -80193 -81900 -84800 -87700 -85829 -86821 -89333 -87074 -83205 -82199 -84830 -87462 -89676
-2192h9676k214n188M353N666N666Q34Q35Q35Q35j043j044j044j043j939j938j938j938M077
$$ -89676 -91890 -97078 -92725 -87059 -81393 -80559 -79724 -78889 -78054 -79097 -80141 -81185 -82228 -84167 -86105 -88043 -89981 -85904
-2174h5904M078J215J215k184k184k184k185n14n14n15n14N59N59n524K01M533M536K032K031
$$ -85904 -81826 -80611 -79396 -81580 -83764 -85948 -88133 -88647 -89161 -89676 -90190 -89631 -89072 -94596 -94395 -89862 -85326 -83294 -81263
-2155h1263O56O60J017m707p01o97j055j055l026l023j61j60K27K31k631k632K554K557K557
$$ -81263 -80607 -79947 -78930 -83637 -84338 -85035 -86090 -87145 -90171 -93194 -93355 -93515 -93288 -93057 -95688 -98320 -95766 -93209 -90652
-2136i0652K557J599J603j260j260j562j558K855K855O561Q34k624k624p15p16K147K147J387
$$ -90652 -88095 -86496 -84893 -86153 -87413 -88975 -90533 -87678 -84823 -78262 -77428 -80052 -82676 -83391 -84107 -81960 -79813 -78426
-2118g8426J386j476j476k788k788l146K579L508L507J003J003j31j30m89m88L060k665m215
$$ -78426 -77040 -78516 -79992 -82780 -85568 -88714 -86135 -82627 -79120 -78117 -77114 -77245 -77375 -77864 -78352 -75292 -77957 -82172
-2100h2172m216P34P34P35P34J547J550J551J551J487J491j730j729J070m652j431j432J75
$$ -82172 -86388 -85654 -84920 -84185 -83451 -81904 -80354 -78803 -77252 -75765 -74274 -76004 -77733 -76663 -81315 -82746 -84178 -84003
-2082h4003J79J79J79l54l50l51l50J912J916N136n89r20r17j633j632K359l362l362K363
$$ -84003 -83824 -83645 -83466 -83820 -84170 -84521 -84871 -82959 -81043 -75907 -76496 -77416 -78333 -79966 -81598 -79239 -82601 -85963 -83600
-2063h3600L783L784o30o30q69q68k777Q6J025l746k315N48O07L471P86k076O67O67M89M88
$$ -83600 -79817 -76033 -76663 -77293 -78162 -79030 -81807 -81721 -80696 -84442 -86757 -86209 -85602 -82131 -81345 -83421 -82754 -82087 -81598 -81110
-2043h1110j480j480J383J383J338J338j524j525Q6Q6Q5Q6L32L35k531k527J763J767l008
$$ -81110 -82590 -84070 -82687 -81304 -79966 -78628 -80152 -81677 -81591 -81505 -81420 -81334 -81002 -80667 -83198 -85725 -83962 -82195 -85203
-2024h5203l004L254L258L254L257k053k050Q08Q13J614J618l158l153k35k31K628K632l10
$$ -85203 -88207 -84953 -81695 -78441 -75184 -77237 -79287 -78479 -77666 -76052 -74434 -77592 -80745 -80980 -81211 -78583 -75951 -76261
-2006g6261l05l10l05Q83Q87Q83Q88L80L80k483k482k661k662K02K01J319J320j543j543k080
$$ -76261 -76566 -76876 -77181 -76298 -75411 -74528 -73640 -73260 -72880 -75363 -77845 -80506 -83168 -82966 -82765 -81446 -80126 -81669 -83212 -85292
-1986h5292k080P83P82J49J49J50J49j521j521j521j520j283j282L489L489J521J520J521
$$ -85292 -87372 -86589 -85807 -85658 -85509 -85359 -85210 -86731 -88252 -89773 -91293 -92576 -93858 -90369 -86880 -85359 -83839 -82318
-1968h2318J521j357j353j357j353k072k069k072k069L13L17L295j472l862R13M607M611m17
$$ -82318 -80797 -82154 -83507 -84864 -86217 -88289 -90358 -92430 -94499 -94186 -93869 -90574 -92046 -95908 -94995 -90388 -85777 -86194
-1950h6194m14K624K628l400n33M473k203j610j606k028k024J252J256J253J256L50L51L50
$$ -86194 -86608 -83984 -81356 -84756 -85289 -80816 -83019 -84629 -86235 -88263 -90287 -89035 -87779 -86526 -85270 -84920 -84569 -84219
-1932h4219L51K020K020K020K021J41J42J41J42l138l139l138l139J137J141j726j722K329
$$ -84219 -83868 -81848 -79828 -77808 -75787 -75646 -75504 -75363 -75221 -78359 -81498 -84636 -87775 -86638 -85497 -87223 -88945 -86616
-1914h6616K334K329K334J53J56k710k706R3R7R4R6p30p31p30p31P61P60M02M03L206k520
$$ -86616 -84282 -81953 -79619 -79466 -79310 -82020 -84726 -84633 -84536 -84442 -84346 -85076 -85807 -86537 -87268 -86507 -85747 -85345 -84942 -81736 -84256
-1893h4256k162k162n52n51J953J953L556k166j811j808j096j092p38p34n29N199J976J979
$$ -84256 -86418 -88580 -89132 -89683 -87730 -85777 -82221 -84387 -86198 -88006 -89102 -90194 -90932 -91666 -92195 -86996 -85020 -83041
-1875h3041J618J621J260J264r02o624l407l403L332L336M70M73p97p94p98p94k766k762k61
$$ -83041 -81423 -79802 -78542 -77278 -78180 -84804 -88211 -91614 -88282 -84946 -84476 -84003 -84800 -85594 -86392 -87186 -89952 -92714 -92975
-1856i2975k57M824q99n44n40o04o00k46k43l973J756J394J397J42J45J42J45q12q09q13q08
$$ -92975 -93232 -88408 -89307 -89851 -90391 -90995 -91595 -91841 -92084 -96057 -94301 -92907 -91510 -91368 -91223 -91081 -90936 -91748 -92557 -93370 -94178
-1835i4178k76k72k76k72L421L426N59N63j57j53j56j53j878j875K892K896J640J644j222
$$ -94178 -94454 -94726 -95002 -95274 -91853 -88427 -87868 -87305 -87462 -87615 -87771 -87924 -89802 -91677 -88785 -85889 -84249 -82605 -83827
-1816h3827j219J878J883r84r81K09K13R24m797m272J458J990q69K885k836l198K531J528
$$ -83827 -85046 -83168 -81285 -82269 -83250 -83041 -82828 -81904 -86701 -90973 -89515 -87525 -88394 -85509 -88345 -91543 -89012 -87484
-1798h7484j331O34O37l600l597R91R95J066j792J006O735M525j196k393k389j022j017L392
$$ -87484 -88815 -88181 -87544 -91144 -94741 -93750 -92755 -91689 -93481 -92475 -85740 -81215 -82411 -84804 -87193 -88215 -89232 -85840
-1780h5840L395J842l880l884J845j90j87J68J71Q84Q87l888l884m1l7Q54L719J928l795k009
$$ -85840 -82445 -80603 -84483 -88367 -86522 -86712 -86899 -86731 -86560 -85676 -84789 -88677 -92561 -92602 -92639 -91785 -88066 -86138 -89933 -91942
-1760i1942Q57R73R73J152J152K046K046K047K046j338j338J524J525J882J882m558J166K214
$$ -91942 -91085 -90112 -89139 -87987 -86835 -84789 -82743 -80696 -78650 -79988 -81326 -79802 -78277 -76395 -74513 -79071 -77905 -75691
-1742g5691l507O7P1M25M28M25M29l690l686q28q24J141J144J141J144L4L3L4L3j576j577
$$ -75691 -79198 -79131 -79060 -78635 -78207 -77782 -77353 -81043 -84729 -85557 -86381 -85240 -84096 -82955 -81811 -81777 -81744 -81710 -81677 -83253 -84830
-1721h4830J286J286j473j472j472j473J629J629J629J629N22N22k341k341K83K84K83K83
$$ -84830 -83544 -82258 -83731 -85203 -86675 -88148 -86519 -84890 -83261 -81632 -81110 -80588 -82929 -85270 -84987 -84703 -84420 -84137
-1703h4137n81n82l086l086m279J446K997K996J35J34J34J34R69R69O12O11M741r84k68k68
$$ -84137 -84718 -85300 -88386 -91472 -95751 -94305 -91308 -88312 -88177 -88043 -87909 -87775 -86806 -85837 -85225 -84614 -79873 -80857 -81125 -81393
-1683h1393k416L310J700j163k363k360k542k538L80L84L80L84l50l47P641J920k91k87m048
$$ -81393 -83809 -80499 -78799 -79962 -82325 -84685 -87227 -89765 -89385 -89001 -88621 -88237 -88587 -88934 -81293 -79373 -79664 -79951 -83999
-1664h3999J681M40k419m55m51j051j047J811J815pmpmm719m715j856j853L086L087K23K24
$$ -83999 -82318 -81878 -84297 -84752 -85203 -86254 -87301 -85490 -83675 -83682 -83686 -83693 -83697 -88416 -93131 -94987 -96840 -93754 -90667 -90444 -90220
-1643i0220k818k818J953J954J162J163J163J163j222j223L191L190J022m704j484j483J856
$$ -90220 -93038 -95856 -93903 -91949 -90787 -89624 -88461 -87298 -88520 -89743 -86552 -83362 -82340 -87044 -88528 -90011 -88155
-1626h8155J856J857J856K199K199o63o64j200j200j201j200m54m52m54m51q72q69q72q69
$$ -88155 -86299 -84442 -82586 -80387 -78188 -78851 -79515 -80715 -81915 -83116 -84316 -84770 -85222 -85676 -86127 -86999 -87868 -88740 -89609
-1607h9609k169k166K602K606q2p9q2p8K341K344K341K345j715j711j714j711J431J435J431
$$ -89609 -91778 -93944 -91342 -88736 -88818 -88897 -88979 -89057 -86716 -84372 -82031 -79686 -81401 -83112 -84826 -86537 -85106 -83671 -82240
-1588h2240J435p15p12p16p12Q76Q80j092J774J055m667j271j267j957j953K814K818q84q79
$$ -82240 -80805 -81520 -82232 -82948 -83660 -82784 -81904 -82996 -81222 -80167 -84834 -86105 -87372 -89329 -91282 -88468 -85650 -86534 -87413
-1569h7413q84q79K12K16l24N405K896L7K002K005j442j439j621j618J062j796l411K318l09
$$ -87413 -88297 -89176 -88964 -88748 -89072 -83667 -80771 -80734 -78732 -76727 -78169 -79608 -81229 -82847 -81785 -83581 -86992 -84674 -84983
-1550h4983l06L47L50k516K259J480j379k546K229o37o34j949j946R13R17J293J298J114J118
$$ -84983 -85289 -84942 -84592 -87108 -84849 -83369 -84748 -87294 -85065 -85702 -86336 -88285 -90231 -89318 -88401 -87108 -85810 -84696 -83578
-1531h3578L321M63J889k877j510j506J01M875p34l593j689j684J170J174J171J174k61k57
$$ -83578 -80257 -79794 -77905 -80782 -82292 -83798 -83697 -78822 -79556 -83149 -84838 -86522 -85352 -84178 -83007 -81833 -82094 -82351
-1513h2351K303K307r02n669k810J964k155k150M823M827k844k844k546k546p56M014J331
$$ -82351 -80048 -77741 -78643 -84312 -87122 -85158 -87313 -89463 -84640 -79813 -82657 -85501 -88047 -90593 -91349 -87335 -86004
-1496h6004J330M66M66M66M66j204j204j204j204J219J219J219J219J099J100l672l671J189
$$ -86004 -84674 -84208 -83742 -83276 -82810 -84014 -85218 -86422 -87626 -86407 -85188 -83969 -82750 -81651 -80551 -84223 -87894 -86705
-1478h6705J189J189l582o60K203K95K94L086L090K132p26m727M9J953J957n97n92l459l456
$$ -86705 -85516 -84327 -87909 -88569 -86366 -86071 -85777 -82691 -79601 -77469 -78195 -82922 -82873 -80920 -78963 -79560 -80152 -83611 -87067
-1459h7067j729j726j729j726Q35Q35k028k028J79J79M950M950J387J386l563l563K996J34
$$ -87067 -88796 -90522 -92251 -93977 -93142 -92307 -94335 -96363 -96184 -96005 -91055 -86105 -84718 -83332 -86895 -90458 -87462 -87328
-1441h7328j237L534L414j357J625J625j118j118l981l981j64j64j64j64O71O71O71O71J547
$$ -87328 -88565 -85031 -81617 -82974 -81349 -79724 -80842 -81960 -85941 -89922 -90086 -90250 -90414 -90578 -89907 -89236 -88565 -87894 -86347
-1422h6347J547r58r58j23N602L098k628m566J159k419k419r3r4k955k956K486K490l77l72
$$ -86347 -84800 -85758 -86716 -86839 -81237 -78139 -80767 -85333 -84174 -86593 -89012 -89105 -89199 -92154 -95110 -92624 -90134 -90511 -90883
-1403i0883J174J178j689j685j420j416J084J089L112k609j003J864M991M991L99L99j570
$$ -90883 -89709 -88531 -90220 -91905 -93325 -94741 -93657 -92568 -89456 -92065 -93068 -91204 -86213 -81222 -80823 -80424 -81994
-1386h1994j569M753M752L321k404l657p94j449j450j271j272K02K05K01K05O19O22j886j882
$$ -81994 -83563 -78810 -74058 -70737 -73141 -76798 -77592 -79041 -80491 -81762 -83034 -82832 -82627 -82426 -82221 -81602 -80980 -82866 -84748
-1367h4748k840K888l35l32J036J040J037J039J436J438J435J439j964j961j964j961M387
$$ -84748 -87588 -84700 -85035 -85367 -84331 -83291 -82254 -81215 -79779 -78341 -76906 -75467 -77431 -79392 -81356 -83317 -78930
-1350g8930M391l84l80q01p98q01p98K50K53K50K53n25n22n26n21m96m92M216P082K20n502
$$ -78930 -74539 -74923 -75303 -76104 -76902 -77703 -78501 -78251 -77998 -77748 -77495 -78020 -78542 -79068 -79589 -80085 -80577 -76361 -69279 -69059 -74561
-1329g4561o519o516k710L019k05k01K72K76k233k229j129M600M774r46j189J677J495j365
$$ -74561 -81080 -87596 -90306 -87287 -87492 -87693 -87421 -87145 -89378 -91607 -92736 -88136 -83362 -84308 -85497 -83820 -82325 -83690
-1311h3690k881j5K964K967J412J417n267n263k822k818J950J953K20K23K20K24l84l80K478
$$ -83690 -86571 -86586 -83622 -80655 -79243 -77826 -83093 -88356 -91178 -93996 -92046 -90093 -89873 -89650 -89430 -89206 -89590 -89970 -87492
-1292h7492K483j935j930j935j931L612L616P49P53k292k289K479K482o52o49K211K214k95
$$ -87492 -85009 -86944 -88874 -90809 -92740 -89128 -85512 -84763 -84010 -86302 -88591 -86112 -83630 -84282 -84931 -82720 -80506 -80801
-1274h0801k91k94k91O60O63O60O64J733J737j487j484l067q790m320j453l84l81k05k01L105
$$ -80801 -81092 -81386 -81677 -81017 -80354 -79694 -79030 -77297 -75560 -77047 -78531 -81598 -90388 -94708 -96161 -96545 -96926 -97131 -97332 -94227
-1254i4227L109K42K46Q39Q42j666j662K6N755K531K534k12k09k12k09q98q95mK863K262l459
$$ -94227 -91118 -90876 -90630 -89791 -88949 -90615 -92277 -92251 -86496 -83965 -81431 -81643 -81852 -82064 -82273 -83171 -84066 -84070 -81207 -78945 -82404
-1233h2404j673J193k356k352M145M148N398l25n218k352j49K717J282J286l011l008J759
$$ -82404 -84077 -82884 -85240 -87592 -83447 -79299 -73901 -74226 -79444 -81796 -81945 -79228 -77946 -76660 -79671 -82679 -80920
-1216h0920J763m436m432L36L39K005K010K005K009j185j182j185j182m69m66j365m223j673
$$ -80920 -79157 -83593 -88025 -87689 -87350 -85345 -83335 -81330 -79321 -80506 -81688 -82873 -84055 -84524 -84990 -86355 -90578 -92251
-1198i2251M051O53O52k091k091j734j733k657L067M141J279Q01k061k419M44K217o44J144
$$ -92251 -88200 -87547 -86895 -88986 -91077 -92811 -94544 -97201 -94134 -89993 -88714 -87913 -89974 -92393 -91949 -89732 -90376 -89232
-1180h9232J144J085J084j778j777J054J055L918L917Q17Q16k046k047j092j088J770J774
$$ -89232 -88088 -87003 -85919 -87697 -89474 -88420 -87365 -83447 -79530 -78713 -77897 -79943 -81990 -83082 -84170 -82400 -80626
-1163h0626p34p30p35p30j152j148j152j148R95R99R95R99j368j364j368j364L02L06L01L06
$$ -80626 -81360 -82090 -82825 -83555 -84707 -85855 -87007 -88155 -87160 -86161 -85166 -84167 -85535 -86899 -88267 -89631 -89329 -89023 -88722 -88416
-1143h8416Q39Q42M417j304n364L65l217l213J420J424J063J066K016l705l709K021K285K288
$$ -88416 -87577 -86735 -82318 -83622 -88986 -88621 -91838 -95051 -93631 -92207 -91144 -90078 -88062 -91767 -95476 -93455 -91170 -88882
-1125h8882K643K646R73R77R73R76L77L80L76L81k248k244k248k243P8Q2P8Q2J092J096J092
$$ -88882 -86239 -83593 -82620 -81643 -80670 -79694 -79317 -78937 -78561 -78180 -80428 -82672 -84920 -87163 -87085 -87003 -86925 -86843 -85751 -84655 -83563
-1104h3563J096l314l313J457J458M43M44M43M44J15J16J15J16l02l02l02l02m372m372k822
$$ -83563 -82467 -85781 -89094 -87637 -86179 -85736 -85292 -84849 -84405 -84290 -84174 -84059 -83943 -84245 -84547 -84849 -85151 -89523 -93895 -96717
-1084i6717K904O124O124J711J711p94p94p94p94J01J00J01J01j972j972j972j972j912j912
$$ -96717 -93813 -87689 -81565 -79854 -78143 -78937 -79731 -80525 -81319 -81218 -81118 -81017 -80916 -82888 -84860 -86832 -88804 -90716 -92628
-1065i2628R51R50K710K710K710K709K173K174O22n103o635o634J595J595J476J476J119J118
$$ -92628 -91677 -90727 -88017 -85307 -82597 -79888 -77715 -75541 -74919 -80022 -86657 -93291 -91696 -90101 -88625 -87149 -86030 -84912
-1047h4912L511k214J006J007J12J11J12J12j718j719J145J144k87k87k87k87J942J942K658
$$ -84912 -81401 -83615 -82609 -81602 -81490 -81379 -81267 -81155 -82873 -84592 -83447 -82303 -82590 -82877 -83164 -83451 -81509 -79567 -76909
-1028g6909l068m618J107K180o82k803O0M652J789j730j729R54R54J79J79L58L58N36L400
$$ -76909 -79977 -84595 -83488 -81308 -81990 -84793 -84733 -80081 -78292 -80022 -81751 -80797 -79843 -79664 -79485 -79127 -78769 -78233 -74833
-1009g4833K38n486q39q39j196j197M74M73J010m715j23K740P71P72l761l761J010J010K046
$$ -74833 -74595 -80081 -80920 -81759 -82955 -84152 -83678 -83205 -82195 -86910 -87033 -84293 -83522 -82750 -86511 -90272 -89262 -88252 -86206
-990h6206K047q16q17J808J808J808J807k426k427k426k427K285K285K285K285j924j919R39
$$ -86206 -84159 -84975 -85792 -83984 -82176 -80368 -78561 -80987 -83414 -85840 -88267 -85982 -83697 -81412 -79127 -81051 -82970 -82031
-972h2031R43k520k516k519k516o41o38l325l321K162N028L773j950l176l172m070J659N173
$$ -82031 -81088 -83608 -86124 -88643 -91159 -91800 -92438 -95763 -99084 -96922 -91894 -88121 -90071 -93247 -96419 -100489 -98830 -93657
-954i3657K315M279M283N81N86N81N85r09r06n52n48l220K509L578P19K803n6j491j487k415
$$ -93657 -91342 -87063 -82780 -82199 -81613 -81032 -80447 -81356 -82262 -82814 -83362 -86582 -84073 -80495 -79776 -76973 -77029 -78520 -80007 -82422
-934h2422k412j521J346P604J882l310l306m175m171K505K509N37N40k326k322J729J734J729
$$ -82422 -84834 -86355 -85009 -77405 -75523 -78833 -82139 -86314 -90485 -87980 -85471 -84934 -84394 -86720 -89042 -87313 -85579 -83850
-916h3850J733L58L62L58L61o37o34o37o34K57K61k605k602k367k363k009k005j831L899K464
$$ -83850 -82117 -81759 -81397 -81039 -80678 -81315 -81949 -82586 -83220 -82963 -82702 -85307 -87909 -90276 -92639 -94648 -96653 -98484 -94585 -92121
-896i2121l95l157k91P79P83J793J796J793J797k278k273K493K498j90j87j1pj763J103K889
$$ -92121 -92516 -95673 -95964 -95185 -94402 -92609 -90813 -89020 -87223 -89501 -91774 -89281 -86783 -86973 -87160 -87171 -87178 -88941 -87838 -84949
-876h4949k833l552o86J815j044J711J715J532J535M1M5k822k817K299K304n63n59K240K244
$$ -84949 -87782 -91334 -92020 -90205 -91249 -89538 -87823 -86291 -84756 -84715 -84670 -87492 -90309 -88010 -85706 -86269 -86828 -84588 -82344
-857h2344K72L139J23n599n423L05M358M361j726M003J696m029K411K412j882j883Q6k777
$$ -82344 -82072 -78933 -78810 -84409 -89832 -89527 -85169 -80808 -82534 -78531 -76835 -80864 -78453 -76041 -77923 -79806 -79720 -82497
-839h2497l358K367J830J830j748j748j569j570n18K345J450m276o064l39K762K762j473j472
$$ -82497 -85855 -83488 -81658 -79828 -81576 -83324 -84893 -86463 -86981 -84636 -83186 -87462 -93526 -93865 -91103 -88341 -89814 -91286
-821i1286J390J391J807J808j055j054N47N48N48N48j599j599j599j595J875J874k538k538
$$ -91286 -89896 -88505 -86698 -84890 -85945 -86999 -86452 -85904 -85356 -84808 -86407 -88006 -89605 -91200 -89325 -87451 -89989 -92527
-803i2527j584M141R20R25K628K627k34k35k143k144n542J86O236L373N71N70o82o82K180
$$ -92527 -94111 -89970 -89050 -88125 -85497 -82870 -83104 -83339 -85482 -87626 -93168 -92982 -86746 -83373 -82802 -82232 -82914 -83596 -81416
-784h1416K184j297j297j297j297J446J446n233n233R24R25R24R24L191L191j581j580k76
$$ -81416 -79232 -80529 -81826 -83123 -84420 -82974 -81528 -86761 -91994 -91070 -90145 -89221 -88297 -85106 -81915 -83496 -85076 -85352
-766h5352k76k76k75j111j111j111j111k169k169O93O93J230J230J231J230Q23Q24J003J002
$$ -85352 -85628 -85904 -86179 -87290 -88401 -89512 -90623 -92792 -94961 -94268 -93575 -92345 -91115 -89884 -88654 -87831 -87007 -86004 -85002
-747h5002n080k218k635L090J718m007m28m29J480J480M342M342J9J9J8J9J211J212l560l560
$$ -85002 -90082 -92300 -94935 -91845 -90127 -94134 -94562 -94991 -93511 -92031 -87689 -83347 -83328 -83309 -83291 -83272 -82061 -80849 -84409 -87969
-727h7969j114j115j114j115K166K166K165K166j010j010j189j189p12l575m14N312N11N10
$$ -87969 -89083 -90198 -91312 -92427 -90261 -88095 -85930 -83764 -84774 -85784 -86973 -88162 -88874 -92449 -92863 -87551 -87040 -86530
-709h6530Q69Q68J286J286j934j935J457m267J815J815l910l910Q61Q61K710K710j53j53Q61
$$ -86530 -85661 -84793 -83507 -82221 -84155 -86090 -84633 -88900 -87085 -85270 -89180 -93090 -92229 -91368 -88658 -85948 -86101 -86254 -85393
-690h5393Q61Q61Q61k65k60l124l124j41j42j41j42r80r77J886J886j394j394L377L377M29
$$ -85393 -84532 -83671 -82810 -83075 -83335 -86459 -89583 -89724 -89866 -90007 -90149 -91129 -92106 -90220 -88334 -89728 -91122 -87745 -84368 -83939
-670h3939M32k430k430K281K281n82n81m66m62m62m63j237j238J626J625N44N48k319k314
$$ -83939 -83507 -85937 -88367 -86086 -83805 -84387 -84968 -85434 -85896 -86358 -86821 -88058 -89296 -87670 -86045 -85501 -84953 -87272 -89586
-651h9586k855k852PJ2K512K516K512K516K035K039m048J681q9q6O26O30j878L850k236k233
$$ -89586 -92441 -95293 -95286 -95274 -92762 -90246 -87734 -85218 -83183 -81144 -85192 -83511 -83600 -83686 -83060 -82430 -84308 -80458 -82694 -84927
-631h4927k98k95k98k94j193j189j193j189pmL50L54j081M648L929L933O373O53O48O53P67
$$ -84927 -85225 -85520 -85818 -86112 -87305 -88494 -89687 -90876 -90883 -90887 -90537 -90183 -91264 -86616 -82687 -78754 -72381 -71728 -71080 -70427 -69660
-610f9660m953j737j734p23p19p23p20K856K859K855K859J12J15k751K978M168R896J6453
$$ -69660 -74613 -76350 -78084 -78807 -79526 -80249 -80969 -78113 -75254 -72399 -69540 -69428 -69313 -72064 -69086 -64918 -55022 -38569
-592c8569J6456K4645L8004N5777O9136O7705K7627l2965n3958n7357m7815l7319k7777k4913
$$ -38569 -22113 2532 40536 96313 165449 233154 260781 227816 173858 116501 68686 31367 3590 -21323
-578b1323j5371p738p739q125q126j446j447l72l73l73l72N51N52N51N52m756m756J5J5K314
$$ -21323 -36694 -44432 -52171 -60296 -68422 -69868 -71315 -71687 -72060 -72433 -72805 -72254 -71702 -71151 -70599 -75355 -80111 -80096 -80081 -77767
-558g7767K315K315K314k873k874k874k874j949j950j949j950j114j115J749J748L082L083
$$ -77767 -75452 -73137 -70823 -73696 -76570 -79444 -82318 -84267 -86217 -88166 -90116 -91230 -92345 -90596 -88848 -85766 -82683
-541h2683L440k285k881k881J532J532J890J889k523k524k225L500L500k225m55m55K051K050
$$ -82683 -79243 -81528 -84409 -87290 -85758 -84226 -82336 -80447 -82970 -85494 -87719 -84219 -80719 -82944 -83399 -83854 -81803 -79753
-523g9753k76k76k76k76k825k825k826k825o79o78o78o79J864J864J863J864J864J863J864
$$ -79753 -80029 -80305 -80581 -80857 -83682 -86507 -89333 -92158 -92837 -93515 -94193 -94872 -93008 -91144 -89281 -87417 -85553 -83690 -81826
-504h1826J864q95q94q95q94j79j79j79j79j57j56k184O78O940K61m391m391O49O49O48O49
$$ -81826 -79962 -80857 -81751 -82646 -83540 -83719 -83898 -84077 -84256 -84413 -84569 -86753 -86075 -79135 -78874 -83265 -87656 -87007 -86358 -85710 -85061
-483h5061l06l06l05l06K680K680l999m000j23j23J786j078n013k42J666J666N93N92L456
$$ -85061 -85367 -85673 -85978 -86284 -83604 -80924 -84923 -88923 -89046 -89169 -87383 -88461 -93474 -93716 -92050 -90384 -89791 -89199 -85743
-464h5743L455R36R35j927j927n55n56n55n56j628j629L142L142k822k821M1M1r54r55r54
$$ -85743 -82288 -81352 -80417 -82344 -84271 -84826 -85382 -85937 -86493 -88121 -89750 -86608 -83466 -86288 -89109 -89068 -89027 -89981 -90936 -91890
-444i1890r54j193j193J670J670J089J088J088J089P4P5P4P5m1l7m1l8J38J42J38J42j219
$$ -91890 -92844 -94037 -95230 -93560 -91890 -90801 -89713 -88625 -87536 -87462 -87387 -87313 -87238 -87279 -87316 -87357 -87395 -87257 -87115 -86977 -86835 -88054
-422h8054j215J643J648k889k885k6K840K136k631K135O911K911N2k814k810l143l138k80
$$ -88054 -89269 -87626 -85978 -88867 -91752 -91778 -88938 -86802 -89433 -87298 -80387 -77476 -77424 -80238 -83048 -86191 -89329 -89609
-404h9609k75k20k17k19k17J812J811j051j047j886j883j886j882k16k16K288K293K706l016
$$ -89609 -89884 -90104 -90321 -90540 -90757 -88945 -87134 -88185 -89232 -91118 -93001 -94887 -96769 -96985 -97201 -94913 -92620 -89914 -92930
-385i2930K02K05J297J297J297J301j804j801j804j800L43L43j5j1K490l232l73N357J699
$$ -92930 -92728 -92523 -91226 -89929 -88632 -87331 -89135 -90936 -92740 -94540 -94197 -93854 -93869 -93880 -91390 -94622 -94995 -89638 -87939
-366h7939J704K773k949k534L194K833k889m47m44K058K061j878j875j879j875K028K031q35
$$ -87939 -86235 -83462 -86411 -88945 -85751 -82918 -85807 -86254 -86698 -84640 -82579 -84457 -86332 -88211 -90086 -88058 -86027 -86862
-348h6862q31k982k978j19j16J059J062J059J062J059J062J059J062J890J889K248l478n326
$$ -86862 -87693 -90675 -93653 -93772 -93888 -92829 -91767 -90708 -89646 -88587 -87525 -86466 -85404 -83514 -81625 -79377 -82855 -88181
-330h8181n327J354J356k687L038K680K680l02l02l02k98L46L47L47L46J063J062J062J066
$$ -88181 -93508 -92154 -90798 -93485 -90447 -87767 -85087 -85389 -85691 -85993 -86291 -85945 -85598 -85251 -84905 -83842 -82780 -81718 -80652
-311h0652j010j010j368j368J614m111l754l750j293j293L477L478O15O15O15O15J584J584
$$ -80652 -81662 -82672 -84040 -85408 -83794 -87905 -91659 -95409 -96702 -97995 -94518 -91040 -90425 -89810 -89195 -88580 -86996 -85412
-293h5412J227J226M51n274n275M52j2j1L209L210J658J659M164M163J107m618j398j398k769
$$ -85412 -84185 -82959 -82508 -87782 -93057 -92605 -92617 -92628 -89419 -86209 -84551 -82892 -78728 -74565 -73458 -78076 -79474 -80872 -83641
-274h3641k770R4R3J729J730l042l041k863k863J909J908N82N81N82N81J238J237l533l534
$$ -83641 -86411 -86317 -86224 -84495 -82765 -85807 -88848 -91711 -94574 -92665 -90757 -90175 -89594 -89012 -88431 -87193 -85956 -89489 -93023
-255i3023L519L518O56O56j312j312j312j312J133J133j729j730J790J789j074j073j808j808
$$ -93023 -89504 -85986 -85330 -84674 -85986 -87298 -88610 -89922 -88789 -87656 -89385 -91115 -89325 -87536 -88610 -89683 -91491 -93299
-237i3299K964K963K784K785j987j987Q61Q61Q61Q61O82O82k180k181n70n70L24L187L366
$$ -93299 -90335 -87372 -84588 -81803 -83790 -85777 -84916 -84055 -83194 -82333 -81651 -80969 -83149 -85330 -85900 -86470 -86146 -82959 -79593
-218g9593k360k180L545k330k330J428m298l999j137J666J666K382K382k389k390N93N93N92
$$ -79593 -81953 -84133 -80588 -82918 -85248 -83820 -88118 -92117 -93254 -91588 -89922 -87540 -85158 -87547 -89937 -89344 -88751 -88159
-200h8159N93q69q68q68q69j047j048j047j048K516K516l46l47q83q84q83q83L246L247L246
$$ -88159 -87566 -88435 -89303 -90171 -91040 -92087 -93135 -94182 -95230 -92714 -90198 -90544 -90891 -91774 -92658 -93541 -94424 -91178 -87931 -84685
-180h4685L247J755J756j107j107k229k225k229k226K721K725k050k046P08P12k155k150J781
$$ -84685 -81438 -79683 -77927 -79034 -80141 -82370 -84595 -86824 -89050 -86329 -83604 -85654 -87700 -86992 -86280 -88435 -90585 -88804
-162h8804J786J782J785j53j49j53j49j53j49j53j49j017j014j018j014m80m77K381K386P34
$$ -88804 -87018 -85236 -83451 -83604 -83753 -83906 -84055 -84208 -84357 -84510 -84659 -85676 -86690 -87708 -88722 -89202 -89679 -87298 -84912 -84178
-142h4178P34P35P34R13R13R14R13j666j666j667j666j129j130J734J733L65L66L65L65P83
$$ -84178 -83444 -82709 -81975 -81062 -80149 -79235 -78322 -79988 -81654 -83321 -84987 -86116 -87246 -85512 -83779 -83414 -83048 -82683 -82318 -81535
-122h1535P83k080k080L95L95k467k468j752j752K662K661K598l127k770k769N341N342N70
$$ -81535 -80752 -82832 -84912 -84517 -84122 -86589 -89057 -90809 -92561 -89899 -87238 -84640 -87767 -90537 -93306 -87965 -82623 -82053
-104h2053N70n93n92l456l455m73m74m73m73K091K091K091K091J196J197l575l574J226J226
$$ -82053 -81483 -82076 -82668 -86124 -89579 -90052 -90526 -90999 -91472 -89381 -87290 -85199 -83108 -81912 -80715 -84290 -87864 -86638 -85412
-85h5412J227J226R88R88l784l783m92m88m92m89M03M06M03M06o71o67o71o67N22N25N22N26
$$ -85412 -84185 -82959 -81971 -80983 -84767 -88550 -89042 -89530 -90022 -90511 -90108 -89702 -89299 -88893 -89564 -90231 -90902 -91569 -91047 -90522 -90000 -89474
-63h9474j745j741j744j741P01P04J059J062m234J495L041L046K325K330n37n33K6L0K6L0
$$ -89474 -91219 -92960 -94704 -96445 -95744 -95040 -93981 -92919 -97153 -95658 -92617 -89571 -87246 -84916 -85453 -85986 -85960 -85930 -85904 -85874
-43h5874l791l787M440M443K754k967K50K54L69L72k493k490j510j506m730R99L918L921m96
$$ -85874 -89665 -93452 -89012 -84569 -81815 -84782 -84532 -84278 -83909 -83537 -86030 -88520 -90030 -91536 -96266 -95267 -91349 -87428 -87924
-24h7924m92K770K773l910l907J160J163j704j700O60O60O60O59k322k322N41N40Q09Q09Q09
$$ -87924 -88416 -85646 -82873 -86783 -90690 -89530 -88367 -90071 -91771 -91111 -90451 -89791 -89132 -91454 -93776 -93235 -92695 -91886 -91077 -90268
-4i0268Q08K598K598k64k65r35r36r36r35p57p56l620l619j249j248N430N431L105L105K42
$$ -90268 -89460 -86862 -84264 -84528 -84793 -85728 -86664 -87600 -88535 -89292 -90048 -93668 -97287 -98536 -99784 -94354 -88923 -85818 -82713 -82471
15h2471K43j003j003k911m8K158k613k613k613K069K069l001l001M693p8j867R95J487J487
$$ -82471 -82228 -83231 -84234 -87145 -87193 -85035 -87648 -90261 -92874 -90805 -88736 -91737 -94738 -90045 -90123 -91990 -90995 -89508 -88021
34h8021J666J667l02l02l344l343J740j122M89N259L232L69l567J204L265j506j387j386p5
$$ -88021 -86355 -84688 -84990 -85292 -88636 -91979 -90239 -91361 -90872 -85613 -82381 -82012 -85579 -84375 -81110 -82616 -84003 -85389 -85464
53h5464p4p5p4k162k162P01P00K729K728j088n860j163J700K654K654j342j342j342j342J462
$$ -85464 -85538 -85613 -85687 -87849 -90011 -89310 -88610 -85881 -83153 -84241 -90101 -91264 -89564 -86910 -84256 -85598 -86940 -88282 -89624 -88162
73h8162J461m48K416K177k595j342J521k352k352O90O89J763J764j100l962k278K494K494
$$ -88162 -86701 -87149 -84733 -82556 -85151 -86493 -84972 -87324 -89676 -88986 -88297 -86534 -84770 -85870 -89832 -92110 -89616 -87122
91h7122K493M66M66M66M66k188k188L000L001m693J987O937K57j0329p466J003J003J539J539
$$ -87122 -84629 -84163 -83697 -83231 -82765 -84953 -87141 -84141 -81140 -85833 -83846 -76909 -76652 -86981 -94447 -93444 -92441 -90902 -89363
110h9363J540J539r06r05n48n48l69N356L746Q84m44m44o22o23o22o23o22o22q17q16q16q17
$$ -89363 -87823 -86284 -87190 -88095 -88643 -89191 -89560 -84204 -80458 -79574 -80018 -80462 -81084 -81707 -82329 -82952 -83574 -84196 -85013 -85829 -86645 -87462
132h7462l858l857k487L240K299n62L015J53L075L075j875j875j215j211J647J651M55M59
$$ -87462 -91320 -95177 -97664 -94424 -92125 -92687 -89672 -89519 -86444 -83369 -85244 -87119 -88334 -89545 -87898 -86247 -85792 -85333
150h5333M54M59n14n11m093J636L243k478l377n11K538K539l366K359j755j756J465J465o38
$$ -85333 -84879 -84420 -84934 -85445 -89538 -87902 -84659 -87137 -90514 -91025 -88487 -85948 -89314 -86955 -88710 -90466 -89001 -87536 -88174
169h8174o37J331j532l739J987K881J9L127K68m387J342L843L847J099m622l999J729k42l101
$$ -88174 -88811 -87480 -89012 -92751 -90764 -87883 -87864 -84737 -84469 -88856 -87514 -83671 -79824 -78725 -83347 -87346 -85617 -85859 -88960
188h8960j674j670J011J013K449K449K986k740k620K42j15k979M81M81L02L02n93n92m14m14
$$ -88960 -90634 -92304 -91293 -90280 -87831 -85382 -82396 -85136 -87756 -87514 -87629 -90608 -90127 -89646 -89344 -89042 -89635 -90227 -90641 -91055
208i1055J264M126L053k673l448n85K218K218j912j913R51R50l61l62l61l62r58r58r58r58
$$ -91055 -89791 -85665 -82612 -85285 -88733 -89318 -87100 -84882 -86794 -88707 -87756 -86806 -87167 -87529 -87890 -88252 -89210 -90168 -91126 -92084
228i2084J547J547m21K441N558j68j539j540l567l567J204J204j744j745j744j745M995M995
$$ -92084 -90537 -88990 -89411 -86970 -81412 -81580 -83119 -84659 -88226 -91793 -90589 -89385 -91129 -92874 -94618 -96363 -91368 -86373
246h6373K132K132J416J417j447j446p30p31n502n501K23K24L086L087J953J953J953J953
$$ -86373 -84241 -82109 -80693 -79276 -80723 -82169 -82899 -83630 -89132 -94633 -94410 -94186 -91100 -88013 -86060 -84107 -82154 -80201
264h0201K09K09o471o471k68k69K595K594R24R25R24R25k833k833L847L846J208J208j655
$$ -80201 -79992 -79783 -86254 -92725 -92993 -93262 -90667 -88073 -87149 -86224 -85300 -84375 -87208 -90041 -86194 -82348 -81140 -79932 -81587
283h1587j655j118j119L653L653J074J073J074J073j730j729j730j729M47M48M47M47j401
$$ -81587 -83242 -84360 -85479 -81826 -78173 -77099 -76026 -74952 -73879 -75609 -77338 -79068 -80797 -80350 -79902 -79455 -79008 -80409
301h0409j402j401j402K915K915N2N2o63o64K199K199p97p98p98p97k229k229O34O33p4p5
$$ -80409 -81811 -83212 -84614 -81699 -78784 -78732 -78680 -79343 -80007 -77808 -75609 -76406 -77204 -78002 -78799 -81028 -83257 -82623 -81990 -82064 -82139
322h2139p4p5r10r09r09r10q50q50K013K013j745j744J118J119k621k616K42K46j189j186
$$ -82139 -82213 -82288 -83198 -84107 -85016 -85926 -86776 -87626 -85613 -83600 -85345 -87089 -85971 -84852 -87473 -90089 -89847 -89601 -90790 -91976
342i1976j189j185J182J185J182J185l172l168J599J602j271j267j271j267r14r09J949J954
$$ -91976 -93165 -94350 -93168 -91983 -90801 -89616 -92788 -95956 -94357 -92755 -94026 -95293 -96564 -97831 -98745 -99654 -97705 -95751
360i5751J263J267J622J625l090K639L69r169J360P086M06M07J181J182J181J186J539J539
$$ -95751 -94488 -93221 -91599 -89974 -93064 -90425 -90056 -99225 -97865 -90779 -90373 -89966 -88785 -87603 -86422 -85236 -83697 -82158
378h2158j323j323k039k039Q24Q27O64O63O64O63k437k438M25M28K423K423J827J826J767
$$ -82158 -83481 -84804 -86843 -88882 -88058 -87231 -86567 -85904 -85240 -84577 -87014 -89452 -89027 -88599 -86176 -83753 -81926 -80100 -78333
397g8333p776n628J01J465J468J823J826j398j394m618J111J375J379J734J737P19P23p272
$$ -78333 -86109 -91737 -91636 -90171 -88703 -86880 -85054 -86452 -87846 -92464 -91353 -89978 -88599 -86865 -85128 -84409 -83686 -90958
415i0958j543J178J181J536J539m92m88m92m88k669k665M011M014j118j115j118j114L91L95
$$ -90958 -92501 -91323 -90142 -88606 -87067 -87559 -88047 -88539 -89027 -91696 -94361 -90350 -86336 -87454 -88569 -89687 -90801 -90410 -90015
434i0015J111m615R32O657K16K17j995j990Q72Q72K065K065p97p98k777k773Q9R0K236K237
$$ -90015 -88904 -93519 -92587 -85930 -85714 -85497 -87492 -89482 -88610 -87738 -85673 -83608 -84405 -85203 -87980 -90753 -90664 -90574 -88338 -86101
454h6101o26o27K472K475k296k296l29l28l28l28j323j319N117o03l471K259M760r62k024
$$ -86101 -86727 -87354 -84882 -82407 -84703 -86999 -87328 -87656 -87984 -88312 -89635 -90954 -85837 -86440 -89911 -87652 -82892 -83854 -85878
473h5878k020k382k378O00O04O00O04L351L355j420j417J264J267J264J267K65K68K65K68
$$ -85878 -87898 -90280 -92658 -92058 -91454 -90854 -90250 -86899 -83544 -84964 -86381 -85117 -83850 -82586 -81319 -81054 -80786 -80521 -80253
492h0253K05K09k658k654J361J364J361J364j145j140J718J722k367k363k009k005j651M077
$$ -80253 -80048 -79839 -82497 -85151 -83790 -82426 -81065 -79701 -80846 -81986 -80268 -78546 -80913 -83276 -85285 -87290 -88941 -84864
510h4864L717L719p79p75m178J550j852m712N6K923L992j730k449M18j23N606N781O0P86P90
$$ -84864 -81147 -77428 -78207 -78982 -83160 -81610 -83462 -88174 -88118 -85195 -81203 -82933 -85382 -84964 -85087 -79481 -73700 -73640 -72854 -72064
530g2064M29M32k851k848k851k848J860J864j361j357K039l683n237n233j338j334N341N345
$$ -72064 -71635 -71203 -74054 -76902 -79753 -82601 -80741 -78877 -80238 -81595 -79556 -83239 -88476 -93709 -95047 -96381 -91040 -85695
548h5695j517j513j517j514m73m70M298M301K032K035K210K214j751J110j692p417k110L615
$$ -85695 -87212 -88725 -90242 -91756 -92229 -92699 -88401 -84100 -82068 -80033 -77823 -75609 -77360 -76250 -77942 -85359 -87469 -83854
566h3854L258k467k170k169L35L36k61k61k61k61Q35Q35k028k027K683K684j79j79l399l399
$$ -83854 -80596 -83063 -85233 -87402 -87067 -86731 -86992 -87253 -87514 -87775 -86940 -86105 -88133 -90160 -87477 -84793 -84972 -85151 -88550 -91949
$$ [...]
##END=	
