##TITLE=	siZ6SYi1S1GVmSrDxO6iIw/5154s
##JCAMPDX=	6.0	$$ NMR Plug-in 1.13 of MestReNova 11.0.4-18998
##DATATYPE=	NMRSPECTRUM
##DATACLASS=	XYDATA
##NUMDIM=	1
##ORIGIN=	Bruker BioSpin GmbH
##OWNER=	andrew
##.OBSERVEFREQUENCY=	600.30184456100005264
##.OBSERVENUCLEUS=	^1H
##.SOLVENTNAME=	CD2Cl2
##.PULSESEQUENCE=	zg
##LONGDATE=	2015/06/05 11:10:54.000
##.ACQUISITIONMODE=	SIMULTANEOUS (DQD)
##$ORIGINALFORMAT=	Bruker XWIN-NMR
##$PARAMETERFILE=	(acqus, ASCII, /var/folders/f6/rjf_tdyn2v98c5c0wvkgn4s80000gn/T/siZ6SYi1S1GVmSrDxO6iIw/5154s/acqus, 0)
$$ ##TITLE= Parameter file, TOPSPIN		Version 2.1
$$ ##JCAMPDX= 5.0
$$ ##DATATYPE= Parameter Values
$$ ##NPOINTS= 10	$$ modification sequence number
$$ ##ORIGIN= Bruker BioSpin GmbH
$$ ##OWNER= andrew
$$ $$ 2015-06-05 16:10:55.280 +0600  andrew@av-600
$$ $$ /opt/data/andrew/nmr/limog-1782/616/acqus
$$ $$ process /opt/ts21pl6/prog/mod/shimcntl
$$ ##$ACQT0= -9.54927425515661
$$ ##$AMP= (0..31)
$$ 100 100 100 100 100 100 100 100 100 100 100 100 100 100 100 100 100 100
$$ 100 100 100 100 100 100 100 100 100 100 100 100 100 100
$$ ##$ANAVPT= -1
$$ ##$AQSEQ= 0
$$ ##$AQ_mod= 3
$$ ##$AUNM= <au_zg>
$$ ##$AUTOPOS= <>
$$ ##$BF1= 600.3
$$ ##$BF2= 600.3
$$ ##$BF3= 600.3
$$ ##$BF4= 600.3
$$ ##$BF5= 600.3
$$ ##$BF6= 600.3
$$ ##$BF7= 600.3
$$ ##$BF8= 600.3
$$ ##$BYTORDA= 0
$$ ##$CFDGTYP= 0
$$ ##$CFRGTYP= 9
$$ ##$CHEMSTR= <none>
$$ ##$CNST= (0..63)
$$ 1 1 145 1 1 1 1 1 1 1 1 1 1 1 1 1 1 1 1 1 1 1 1 1 1 1 1 1 1 1 1 1 1 1 1
$$ 1 1 1 1 1 1 1 1 1 1 1 1 1 1 1 1 1 1 1 1 1 1 1 1 1 1 1 1 1
$$ ##$CPDPRG= <>
$$ ##$CPDPRG1= <>
$$ ##$CPDPRG2= <waltz16>
$$ ##$CPDPRG3= <>
$$ ##$CPDPRG4= <mlev>
$$ ##$CPDPRG5= <mlev>
$$ ##$CPDPRG6= <mlev>
$$ ##$CPDPRG7= <mlev>
$$ ##$CPDPRG8= <mlev>
$$ ##$CPDPRGB= <>
$$ ##$CPDPRGT= <>
$$ ##$D= (0..63)
$$ 0 1 0 0 0 0 0 0 0 0.06 0 0.03 0 0 0 0 1e-04 0 0 0 0 0 0 0 0 0 0 0 0 0 0
$$ 0 0 0 0 0 0 0 0 0 0 0 0 0 0 0 0 0 0 0 0 0 0 0 0 0 0 0 0 0 0 0 0 0
$$ ##$DATE= 1433499054
$$ ##$DBL= (0..7)
$$ 120 120 120 120 120 120 120 120
$$ ##$DBP= (0..7)
$$ 150 150 150 150 150 150 150 150
$$ ##$DBP07= 0
$$ ##$DBPNAM0= <>
$$ ##$DBPNAM1= <>
$$ ##$DBPNAM2= <>
$$ ##$DBPNAM3= <>
$$ ##$DBPNAM4= <>
$$ ##$DBPNAM5= <>
$$ ##$DBPNAM6= <>
$$ ##$DBPNAM7= <>
$$ ##$DBPOAL= (0..7)
$$ 0.5 0.5 0.5 0.5 0.5 0.5 0.5 0.5
$$ ##$DBPOFFS= (0..7)
$$ 0 0 0 0 0 0 0 0
$$ ##$DE= 6.5
$$ ##$DECBNUC= <off>
$$ ##$DECIM= 2218.66666666667
$$ ##$DECNUC= <off>
$$ ##$DECSTAT= 4
$$ ##$DIGMOD= 1
$$ ##$DIGTYP= 12
$$ ##$DL= (0..7)
$$ 0 120 120 120 120 120 120 120
$$ ##$DP= (0..7)
$$ 150 150 150 150 150 150 150 150
$$ ##$DP07= 0
$$ ##$DPNAME0= <>
$$ ##$DPNAME1= <>
$$ ##$DPNAME2= <>
$$ ##$DPNAME3= <>
$$ ##$DPNAME4= <>
$$ ##$DPNAME5= <>
$$ ##$DPNAME6= <>
$$ ##$DPNAME7= <>
$$ ##$DPOAL= (0..7)
$$ 0.5 0.5 0.5 0.5 0.5 0.5 0.5 0.5
$$ ##$DPOFFS= (0..7)
$$ 0 0 0 0 0 0 0 0
$$ ##$DQDMODE= 0
$$ ##$DR= 22
$$ ##$DS= 0
$$ ##$DSLIST= <SSSSSSSSSSSSSSS>
$$ ##$DSPFIRM= 0
$$ ##$DSPFVS= 20
$$ ##$DTYPA= 0
$$ ##$EXP= <>
$$ ##$F1LIST= <111111111111111>
$$ ##$F2LIST= <222222222222222>
$$ [...]
$$ -1 -1 -1 -1 -1 -1 -1 -1 -1 -1 -1 -1 -1 -1 -1 -1 -1 -1 -1 -1 -1 -1 -1 -1
$$ -1 -1 -1 -1 -1 -1 -1 -1 -1 -1 -1 -1 -1 -1 -1 -1 -1 -1 -1 -1 -1 -1 -1 -1
$$ -1 -1 -1 -1 -1 -1 -1 -1 -1 -1 -1 -1 -1 -1 -1 -1 -1 -1 -1 -1 -1 -1 -1 -1
$$ -1 -1 -1 -1 -1 -1 -1 -1 -1 -1 -1 -1 -1 -1 -1 -1 -1 -1 -1 -1 -1 -1 -1 -1
$$ -1 -1 -1 -1 -1 -1 -1 -1 -1 -1 -1 -1 -1 -1 -1 -1
$$ ##$RG_tab8= (0..255)
$$ -1 -1 -1 -1 -1 -1 -1 -1 -1 -1 -1 -1 -1 -1 -1 -1 -1 -1 -1 -1 -1 -1 -1 -1
$$ -1 -1 -1 -1 -1 -1 -1 -1 -1 -1 -1 -1 -1 -1 -1 -1 -1 -1 -1 -1 -1 -1 -1 -1
$$ -1 -1 -1 -1 -1 -1 -1 -1 -1 -1 -1 -1 -1 -1 -1 -1 -1 -1 -1 -1 -1 -1 -1 -1
$$ -1 -1 -1 -1 -1 -1 -1 -1 -1 -1 -1 -1 -1 -1 -1 -1 -1 -1 -1 -1 -1 -1 -1 -1
$$ -1 -1 -1 -1 -1 -1 -1 -1 -1 -1 -1 -1 -1 -1 -1 -1 -1 -1 -1 -1 -1 -1 -1 -1
$$ -1 -1 -1 -1 -1 -1 -1 -1 -1 -1 -1 -1 -1 -1 -1 -1 -1 -1 -1 -1 -1 -1 -1 -1
$$ -1 -1 -1 -1 -1 -1 -1 -1 -1 -1 -1 -1 -1 -1 -1 -1 -1 -1 -1 -1 -1 -1 -1 -1
$$ -1 -1 -1 -1 -1 -1 -1 -1 -1 -1 -1 -1 -1 -1 -1 -1 -1 -1 -1 -1 -1 -1 -1 -1
$$ -1 -1 -1 -1 -1 -1 -1 -1 -1 -1 -1 -1 -1 -1 -1 -1 -1 -1 -1 -1 -1 -1 -1 -1
$$ -1 -1 -1 -1 -1 -1 -1 -1 -1 -1 -1 -1 -1 -1 -1 -1 -1 -1 -1 -1 -1 -1 -1 -1
$$ -1 -1 -1 -1 -1 -1 -1 -1 -1 -1 -1 -1 -1 -1 -1 -1
$$ ##$RG_tabA= (0..255)
$$ 0.25 0.28 0.32 0.35 0.4 0.44 0.5 0.56 0.64 0.7 0.8 0.89 1 1.12 1.28 1.4
$$ 1.6 1.78 2 2.25 2.56 2.8 3.2 3.56 4 4.5 5 5.6 6.35 7.12 8 9 10 11.3 12.7
$$ 14.2 16 18 20.2 22.6 25.4 28.5 32 36 40.3 45.2 50.8 57 64 71.8 80.6 90.5
$$ 101 114 128 144 161 181 203 -1 -1 -1 -1 -1 -1 -1 -1 -1 -1 -1 -1 -1 -1 -1
$$ -1 -1 -1 -1 -1 -1 -1 -1 -1 -1 -1 -1 -1 -1 -1 -1 -1 -1 -1 -1 -1 -1 -1 -1
$$ -1 -1 -1 -1 -1 -1 -1 -1 -1 -1 -1 -1 -1 -1 -1 -1 -1 -1 -1 -1 -1 -1 -1 -1
$$ -1 -1 -1 -1 -1 -1 -1 -1 -1 -1 -1 -1 -1 -1 -1 -1 -1 -1 -1 -1 -1 -1 -1 -1
$$ -1 -1 -1 -1 -1 -1 -1 -1 -1 -1 -1 -1 -1 -1 -1 -1 -1 -1 -1 -1 -1 -1 -1 -1
$$ -1 -1 -1 -1 -1 -1 -1 -1 -1 -1 -1 -1 -1 -1 -1 -1 -1 -1 -1 -1 -1 -1 -1 -1
$$ -1 -1 -1 -1 -1 -1 -1 -1 -1 -1 -1 -1 -1 -1 -1 -1 -1 -1 -1 -1 -1 -1 -1 -1
$$ -1 -1 -1 -1 -1 -1 -1 -1 -1 -1 -1 -1 -1 -1 -1 -1 -1 -1 -1 -1 -1 -1 -1 -1
$$ -1 -1 -1 -1 -1 -1 -1 -1 -1 -1 -1 -1 -1 -1
$$ ##$ROUT14= (0..7)
$$ 0 0 0 0 0 0 0 0
$$ ##$ROUTER= -1
$$ ##$RX22TY= <no>
$$ ##$RXFMAX= (0..7)
$$ 647.5 -1 -1 -1 -1 -1 -1 -1
$$ ##$RXFMIN= (0..7)
$$ 5 -1 -1 -1 -1 -1 -1 -1
$$ ##$RXINTLV= (0..7)
$$ 1 0 0 0 0 0 0 0
$$ ##$RXMSTY= <no>
$$ ##$SCMTY= <no>
$$ ##$SGUC1= (0..15)
$$ 17 18 34 0 0 0 0 0 0 0 0 0 0 0 0 0
$$ ##$SGUC2= (0..15)
$$ 33 256 20 0 0 0 0 0 0 0 0 0 0 0 0 0
$$ ##$SPECTR= 10
$$ ##$SY2FLAG= 0
$$ ##$TFXNUM= 0
$$ ##$TRIPLO2= 0
$$ ##$VTUTY= <tty05>
$$ ##$WBREFAM= (0..15)
$$ 100 100 100 100 100 100 100 100 100 100 100 100 100 100 100 100
$$ ##$WBREFPH= (0..15)
$$ 0 0 0 0 0 0 0 0 0 0 0 0 0 0 0 0
$$ ##$XFAC= 2
$$ ##END=
$$ 
##$DECIM=	2218.66666666667
##$DSPFVS=	20
##XUNITS=	HZ
##YUNITS=	ARBITRARY UNITS
##FIRSTX=	6322.8525384689401108
##LASTX=	-2691.4329892738592207
##XFACTOR=	-0.1375491802509010153
##YFACTOR=	7.9831992187499998035e-06
##NPOINTS=	65536
##XYDATA=	(X++(Y..Y))
$$ [...]
$$ plain form
-12014 -69324 -70311 -72372 -69663 -70323 -70982 -72774 -74566 -75494 -76422 -74488 -72554 -72856 -73158 -73460 -73762 -72908 -72055 -70248 -65580
-11995 -65580 -62640 -64469 -66299 -68128 -68139 -68150 -68340 -73300 -75338 -77376 -77804 -81094 -84026 -82186 -80349 -78508 -80487 -82462
-11977 -82462 -81579 -80692 -82611 -84526 -81675 -78821 -77938 -77052 -77122 -80051 -77793 -70762 -66776 -67554 -68069 -68579 -69391 -70200 -70550 -70896
-11957 -70896 -72677 -74455 -71079 -67700 -69093 -70483 -70699 -70915 -71131 -71347 -71563 -71779 -71996 -72212 -76347 -80483 -79850 -79216 -76854
-11938 -76854 -74492 -74991 -75490 -73464 -71437 -74179 -76921 -76951 -76981 -75580 -74179 -72510 -70841 -72033 -73225 -70572 -67919 -70036
-11920 -70036 -72152 -75304 -78456 -78747 -79038 -76884 -74730 -72577 -70423 -71101 -71779 -75021 -78263 -78523 -74015 -73441 -75729 -75751 -75770
-11901 -75770 -75971 -76169 -71899 -67625 -68124 -68620 -65349 -62074 -61962 -61846 -62569 -68057 -72476 -74030 -74373 -74715 -74879 -75043 -75088 -75133
-11881 -75133 -78039 -76176 -73195 -73076 -72301 -74388 -77189 -79991 -80111 -80230 -77715 -75196 -72681 -70162 -72476 -74786 -75192 -78456
$$ packed form
-12014f9324r87k061K709o60o59j792j792r28r28J934J934l02l02l02l02Q54Q53J807M668
-11995f5580K940j829j830j829j1j1j90m960k038k038m28l290k932J840J837J841j979j975
-11977h2462Q83Q87j919j915K851K854Q83Q86p0k929K258P031L986p78n15n10q12q09l50l46
-11957g0896j781j778L376L379j393j390k16k16k16k16k16k16k17k16m135m136O33O34K362
-11938g6854K362m99m99K026K027k742k742l0l0J401J401J669J669j192j192K653K653k117
-11920g0036k116l152l152k91k91K154K154K153K154o78o78l242l242k60M508N74k288k2j9
-11901g5770k01j98M270M274m99m96L271L275J12J16p23n488m419j554l43l42j64j64m5m5
-11881g5133k906J863K981J19P75k087k801k802j20j19K515K519K515K519k314k310m06l264
$$ plain form
-11863 -78456 -80353 -77476 -71921 -71131 -72551 -73967 -75684 -77398 -78453 -79503 -83415 -82558 -77473 -75245 -75878 -76511 -77208 -77901
-11845 -77901 -78594 -79287 -78613 -77935 -77257 -76578 -77096 -77611 -78125 -78639 -77189 -75736 -71422 -67107 -67610 -68109 -68609 -69108 -71578 -74045
-11825 -74045 -75558 -74209 -71601 -73758 -75740 -72949 -70461 -67968 -69950 -71929 -70200 -68467 -69898 -71325 -67629 -68698 -74540
-11808 -74540 -75610 -74041 -72469 -77517 -75885 -72350 -73579 -75885 -71511 -66232 -67625 -71526 -75423 -75092 -74756 -74425 -74090 -75002
-11790 -75002 -75915 -73967 -72014 -71854 -71694 -71534 -71370 -70092 -68814 -70397 -71977 -71832 -71686 -74403 -77115 -75684 -74253 -68709
-11772 -68709 -66023 -64354 -68408 -69421 -70431 -70162 -69894 -69626 -69354 -69622 -69890 -70159 -70423 -73672 -76921 -77309 -77696 -75461 -73225
-11753 -73225 -70990 -68754 -66995 -65237 -68247 -71258 -70572 -69887 -69201 -68516 -68404 -68292 -72294 -73434 -75468 -71779 -71310 -70841 -71861
-11734 -71861 -75744 -78374 -75282 -73024 -70766 -72920 -75073 -73911 -72745 -74444 -76139 -77420 -78698 -79980 -81258 -79351 -77439
$$ packed form
-11863g8456j897K877N555P90j420j416j717j714j055j050l912Q57N085K228o33o33o97o93
-11845g7901o93o93O74O78O78O79n18n15n14n14J450J453M314M315n03m99n00m99k470k467
-11825g4045j513J349K608k157j982K791K488K493j982j979J729J733j431j427L696j069n842
-11808g4540j070J569J572n048J632L535j229k306M374N279j393l901l897L31L36L31L35r12
-11790g5002r13J948J953J60J60J60J64J278J278j583j580J45J46k717k712J431J431N544
-11772f8709K686J669m054j013j010K69K68K68K72k68k68k69k64l249l249l88l87K235K236
-11753g3225K235K236J759J758l010l011O86O85O86O85J12J12m002j140k034L689M69M69j020
-11734g1861l883k630L092K258K258k154k153J162J166j699j695j281j278j282j278J907J912
$$ plain form
-11717 -77439 -74816 -77912 -83397 -83155 -83333 -80647 -81865 -83080 -81258 -79432 -77253 -75069 -72890 -70706 -71180 -71649 -72122 -72592
-11699 -72592 -73780 -74965 -76154 -77339 -77801 -78259 -78721 -79179 -78151 -77119 -76090 -75058 -72540 -70017 -70360 -70699 -73784 -76865
-11681 -76865 -75181 -73493 -71653 -69808 -67968 -66124 -68516 -70904 -70434 -69961 -66988 -64011 -65807 -67599 -68858 -70114 -71373
-11664 -71373 -72629 -71660 -70692 -72584 -74477 -79291 -84105 -85461 -81094 -78300 -75505 -79030 -82555 -83099 -83643 -84187 -84731 -84053
-11646 -84053 -83374 -79119 -80588 -80088 -73866 -74082 -74298 -73300 -72301 -71303 -70304 -71154 -72003 -72853 -73702 -74440 -75174 -75912 -76646 -75714 -74779
-11625 -74779 -73847 -72912 -74723 -76530 -78341 -80148 -79336 -78520 -77707 -76891 -75245 -73594 -71947 -70297 -68232 -66165 -66962 -67756 -70550
-11606 -70550 -73341 -76135 -78926 -78799 -78669 -78542 -78412 -77666 -76917 -76172 -75423 -72890 -70352 -69369 -74104 -77055 -80003 -80450 -80893
-11587 -80893 -78538 -76180 -76686 -77189 -74678 -72163 -69652 -67137 -65341 -63542 -64607 -65669 -67390 -69108 -70829 -72547 -74686
$$ packed form
-11717g7439K623l096n485K42j78K686j218j215J822J826K179K184K179K184m74m69m73m70
-11699g2592j188j185j189j185m62m58m62m58J028J032J029J032K518K523l43l39l085l081
-11681g6865J684J688J840J845J840J844k392k388M70M73K973K977j796j792j259j256j259
-11664g1373j256R69R68j892j893m814m814j356M367K794K795l525l525n44n44n44n44O78
-11646h4053O79M255j469N00O222k16k16R98R99R98R99q50q49q50q49p38p34p38p34R32R35
-11625g4779R32R35j811j807j811j807Q12Q16Q13Q16J646J651J647J650K065K067p97p94k794
-11606g0550k791k794k791J27J30J27J30P46P49P45P49K533K538R83m735k951k948m47m43
-11587h0893K355K358n06n03K511K515K511K515J796J799j065j062j721j718j721j718k139
$$ plain form
-11570 -74686 -76821 -76098 -75371 -77555 -79734 -79056 -78374 -74239 -70099 -72044 -68262 -67793 -67320 -69354 -71385 -74730 -78073 -74742
-11552 -74742 -71407 -69924 -68437 -69458 -70475 -76921 -77640 -78721 -79798 -79649 -79496 -79347 -79194 -79224 -79250 -79280 -79306 -77588 -75871 -74332
-11532 -74332 -72793 -73043 -76154 -78371 -74865 -71440 -73739 -72461 -71183 -74138 -77093 -75278 -73464 -73065 -72666 -75129 -77592
-11515 -77592 -76716 -75841 -75859 -78739 -81269 -78076 -76672 -78128 -78154 -78181 -78385 -78590 -75587 -72581 -66358 -65855 -64760 -63661 -62923 -62182
-11495 -62182 -63977 -65770 -67566 -69358 -72048 -74734 -77424 -80111 -83717 -87320 -86158 -84992 -86333 -87670 -88654 -89634 -87913
-11478 -87913 -80465 -77670 -77733 -76012 -77149 -78467 -76921 -78520 -80118 -81538 -82957 -81098 -79239 -77380 -75520 -74004 -72487
-11461 -72487 -75740 -78993 -78192 -77391 -76590 -75789 -73672 -71556 -74209 -76862 -80588 -84313 -81362 -78412 -78128 -77845 -77741 -77637 -73955
-11442 -73955 -73136 -78695 -78531 -77763 -76992 -80636 -84276 -83866 -83453 -83043 -82629 -80878 -79123 -73974 -74544 -79827 -82246 -83177 -78382
$$ packed form
-11570g4686k135P23P27k184k179O78O82M135M140j945L782M69M73k034k031l345l343L331
-11552g4742L335J483J487j021j017o446p19j081j077J49J53J49J53l0k6l0k6J718J717J539
-11532g4332J539k50l111k217L506L425k299J278J278k955k955J815J814L99L99k463k463
-11515g7592Q76Q75j8k880k530L193J404j456k6k7k04k05L003L006O223N03J095J099P38P41
-11495f2182j795j793j796j792k690k686k690k687l606l603J162J166j341j337r84r80J721
-11478h7913P448K795o3J721j137j318J546j599j598j420j419J859J859J859J860J516J517
-11461g2487l253l253Q01Q01Q01Q01K117K116k653k653l726l725K951K950K84K83J04J04L682
-11442g3955Q19n559J64P68P71l644l640M10M13M10M14J751J755N149n70n283k419r31M795
$$ plain form
-11423 -78382 -77342 -76299 -79671 -83039 -82417 -81791 -84030 -86266 -84809 -83348 -81892 -80431 -80643 -80852 -76295 -71735 -68624 -65509
-11405 -65509 -65617 -59998 -54085 -48169 -44938 -51242 -58027 -61947 -63247 -67405 -71090 -69048 -70408 -71765 -73680 -75591 -77506
-11388 -77506 -79418 -80140 -80859 -81582 -82301 -80610 -78915 -77223 -75528 -74075 -72618 -74026 -75431 -77178 -78922 -76079 -73233 -73609
-11370 -73609 -76843 -81690 -80811 -78915 -77014 -77443 -77868 -78833 -76932 -73069 -74924 -79980 -79310 -77391 -78330 -82849 -81642 -77637
-11352 -77637 -76489 -75382 -77134 -80677 -78494 -76314 -74131 -71593 -69052 -71131 -73207 -75286 -77361 -78367 -79369 -75606 -71839
-11335 -71839 -72905 -73967 -75748 -71802 -68993 -71902 -71239 -70572 -72402 -74227 -73195 -72160 -74645 -77126 -76750 -76370 -75360 -74347
-11317 -74347 -78106 -81862 -81508 -81150 -83658 -86161 -82994 -79827 -76660 -73493 -73069 -72644 -72040 -71437 -67770 -61243 -59782 -64045
-11299 -64045 -68307 -72569 -70870 -69171 -66325 -69201 -73270 -77339 -79440 -75818 -75416 -75014 -74045 -73076 -73002 -75789 -77264 -73016
$$ packed form
-11423g8382J040J043l372l368O22O26k239k236J457J461J456J461k12k09M557M560L111L115
-11405f5509j08N619N913N916L231o304o785l920j300m158l685K042j360j357j915j911j915
-11388g7506j912p22p19p23p19J691J695J692J695J453J457j408j405j747j744K843K846l76
-11370g3609l234m847Q79J896J901m29m25r65J901L863j855n056O70J919r39m519J207M005
-11352g7637J148J107j752l543K183K180K183K538K541k079k076k079k075j006j002L763L767
-11335g1839j066j062j781L946K809k909O63O67j830j825J032J035k485k481L76L80J010J013
-11317g4347l759l756L54L58k508k503L167L167L167L167M24M25O04O03L667O527J461m263
-11299f4045m262m262J699J699K846k876m069m069k101L622M02M02R69R69P4k787j475M248
$$ plain form
-11281 -73016 -68948 -70602 -70699 -70796 -71072 -71347 -72815 -71422 -68776 -70900 -74663 -75565 -78374 -81184 -79283 -77383 -75483 -73583
-11263 -73583 -74145 -74708 -75271 -75833 -72104 -68374 -69414 -73315 -76090 -74097 -74965 -75833 -76463 -77093 -77722 -78352 -77812 -77271 -76731 -76191
-11243 -76191 -77141 -78091 -79041 -79991 -75748 -71504 -72029 -72554 -72841 -73128 -76277 -79425 -78158 -76891 -75625 -74358 -74641 -74924 -75207
-11224 -75207 -75490 -74529 -73568 -75468 -77368 -76169 -74969 -73769 -72569 -74995 -77417 -76981 -73680 -69369 -69823 -72189 -74552 -78251
-11206 -78251 -81947 -80878 -79805 -79451 -79093 -76832 -77428 -81437 -80673 -76396 -74976 -76482 -77983 -79667 -81348 -80677 -80003 -79332
-11188 -79332 -78657 -73456 -68251 -73363 -78471 -78248 -75159 -73862 -77331 -80386 -83438 -82022 -80602 -79485 -78363 -77245 -76124
-11171 -76124 -76079 -76031 -75986 -75938 -78576 -81213 -79082 -76951 -76489 -76027 -75565 -75103 -72286 -69469 -69514 -69559 -71273 -72987 -74701 -76415 -77856
-11150 -77856 -79298 -79786 -74552 -67707 -70401 -73572 -73881 -75233 -73724 -73646 -73568 -73669 -73769 -76731 -79693 -78929 -78162 -77398 -76631 -76403
$$ packed form
-11281g3016M068j654r7r7k76k75j468J393K646k124l763r02k809k810J901J900J900J900
-11263g3583n62n63n63n62L729L730j040l901k775J993q68q68o30o30o29o30N40N41N40N40
-11243g6191r50r50r50r50M243M244n25n25k87k87l149l148J267J267J266J267k83k83k83
-11224g5207k83R61R61j900j900J199J200J200J200k426k422M36L301M311m54k366k363l699
-11206g8251l696J069J073L54L58K261n96m009P64M277J420j506j501j684j681O71O74O71
-11188g9332O75N201N205n112n108K23L089J297l469l055l052J416J420J117J122J118J121
-11171g6124M5M8M5M8k638k637K131K131M62M62M62M62K817K817m5m5j714j714j714j714j441
-11150g7856j442m88N234O845k694l171l09j352J509P8P8j01j00k962k962P64P67P64P67K28
$$ plain form
-11130 -76403 -76172 -78628 -81079 -82134 -80323 -73687 -72771 -75137 -71776 -70386 -71854 -74391 -76929 -76783 -76638 -75599 -74559 -70718
-11112 -70718 -64015 -64793 -71295 -77618 -78218 -77387 -76556 -77335 -75252 -72085 -74637 -73795 -72949 -74313 -75673 -75069 -77324 -80401 -77752
-11093 -77752 -76895 -78896 -78933 -78967 -79183 -79395 -79354 -79310 -79269 -79224 -80077 -80927 -78918 -76906 -78251 -79593 -80938 -82279 -84578 -86873 -82495
-11072 -82495 -78114 -76809 -75505 -74201 -72897 -74276 -75654 -77033 -78412 -76944 -75476 -74008 -72540 -74529 -76519 -75647 -74775
-11055 -74775 -73717 -72655 -74458 -76258 -77883 -79503 -78266 -77026 -75640 -74250 -72864 -71474 -71101 -70725 -70352 -69976 -70520 -71060
-11037 -71060 -71604 -72145 -71079 -70010 -71806 -73598 -74127 -74652 -75181 -75707 -75640 -75569 -72282 -74715 -78378 -82037 -79380 -76720 -77283
-11018 -77283 -77842 -75543 -73240 -75651 -78058 -80468 -82875 -80040 -77201 -74544 -76653 -74090 -71526 -74030 -76534 -77726 -78918
-11001 -78918 -75640 -72361 -70572 -73553 -76713 -79872 -79872 -79872 -77011 -74149 -70595 -67040 -70162 -73285 -75394 -77502 -79611 -81720
$$ packed form
-11130g6403K31k456k451j055J811O636R16k366L361J390j468k537k538J46J45J039J040L841
-11112g0718O703p78o502o323o00Q31Q31p79K083L167k552Q42Q46j364j360O04k255l077K649
-11093g7752Q57k001l7l4k16k12M1M4M1M5q53q50K009K012j345j342j345j341k299k295M378
-11072h2495M381J305J304J304J304j379j378j379j379J468J468J468J468j989j990Q72Q72
-11055g4775J058J062j803j800j625j620J237J240J386J390J386J390L73L76L73L76n44n40
-11037g1060n44n41J066J069j796j792n29n25n29n26O7P1L287k433l663l659K657K660n63
-11018g7283n59K299K303k411k407k410k407K835K839K657k109K563K564k504k504j192j192
-11001g8918L278L279J789k981l160l159%%K861K862L554L555l122l123k109k108k109k109
$$ plain form
-10983 -81720 -83680 -85640 -84738 -83836 -83650 -83464 -83278 -83091 -82484 -81873 -78404 -74932 -75695 -76455 -77219 -77979 -77342 -76701 -76064 -75423 -75681
-10962 -75681 -75934 -76191 -76444 -74678 -72908 -74004 -75096 -74403 -73706 -74920 -80900 -87272 -90778 -92022 -88494 -87175 -82991 -78512
-10944 -78512 -76891 -75453 -74011 -69890 -65766 -62718 -59667 -60613 -66325 -69626 -72923 -73661 -74395 -73881 -73363 -72849 -72331 -72789 -73244
-10925 -73244 -70841 -68434 -68534 -68631 -69686 -73598 -78080 -77789 -75595 -73397 -71798 -70196 -73367 -76534 -76955 -77372 -77793 -78210 -79824
-10906 -79824 -81433 -80185 -78933 -79384 -79831 -80282 -80729 -79153 -77573 -75997 -74417 -76880 -79343 -78944 -78546 -77432 -76318 -78244
-10888 -78244 -80170 -79265 -81221 -87112 -83464 -77312 -74022 -73713 -79127 -81146 -80301 -79459 -81474 -82063 -76925 -73579 -73091 -75781
-10870 -75781 -78467 -81158 -83844 -82540 -78371 -72595 -72540 -71999 -71455 -71273 -71086 -70904 -70718 -70535 -70349 -70554 -70755 -70960 -71161 -74049
-10850 -74049 -76932 -75051 -73166 -72554 -71943 -71332 -70721 -70528 -70334 -70140 -69946 -70513 -71079 -71645 -72212 -73493 -74775 -76057 -77339 -79149
$$ packed form
-10983h1720j960j960R02R02J86J86J86J87O07O11L469L472p63p60p64p60O37O41O37O41k58
-10962g5681k53k57k53J766J770j096j092O93O97j214n980o372l506j244L528J319M184M479
-10944g8512J621J438J442M121M124L048L051r46n712l301l297p38p34N14N18N14N18m58m55
-10925g3244K403K407j00r7j055l912m482K91K194K198J599J602l171l167m21m17m21m17j614
-10906g9824j609J248J252m51m47m51m47J576J580J576J580k463k463L99L98J114J114j926
-10888g8244j926R05j956n891L648O152L290L09n414k019Q45Q42k015n89N138L346M88k690
-10870g5781k686k691k686J304M169N776N5N41N44J82J87J82J86J83J86k05k01k05k01k888
-10850g4049k883J881J885O12O11O11O11J93J94J94J94n67n66n66n67j281j282j282j282j810
$$ plain form
-10830 -79149 -80956 -82767 -84574 -83047 -81515 -77126 -72733 -78419 -84101 -83110 -82115 -79514 -76910 -74309 -71705 -70915 -70121 -74101
-10812 -74101 -78076 -76273 -74466 -72663 -70855 -70811 -70762 -70718 -70669 -69432 -68191 -66954 -65714 -67104 -68493 -69883 -71273 -71768 -72264
-10793 -72264 -75621 -78978 -78698 -78419 -78140 -77860 -74481 -71101 -68080 -65058 -65665 -71996 -75464 -73210 -71314 -69417 -71932 -74447
-10775 -74447 -73669 -72890 -72111 -71332 -72461 -73590 -71858 -70125 -68780 -67431 -65788 -64141 -66850 -64786 -63799 -65669 -68214 -70755
-10757 -70755 -73657 -76556 -78385 -83073 -84067 -80289 -80465 -80636 -77651 -74663 -75912 -77156 -78404 -79649 -81597 -83542 -82629 -81713
-10739 -81713 -84019 -86322 -85766 -85208 -84824 -84436 -84053 -83665 -78333 -72998 -74343 -75684 -73274 -70859 -71310 -71757 -74950 -78140 -78471
-10720 -78471 -78799 -76448 -74093 -74604 -75110 -76515 -77916 -74552 -71183 -72782 -74376 -75975 -77570 -80658 -83743 -82361 -80975
-10703 -80975 -80248 -84291 -84220 -81288 -79786 -75423 -73743 -74924 -77685 -80446 -78617 -76787 -76806 -76824 -76843 -76862 -75688 -74514 -75904
$$ packed form
-10830g9149j807j811j807J527J532M389M393n686n682R91R95K601K604K601K604P90P94l980
-10812g4101l975J803J807J803J808M4M9M4M9J237J241J237J240j390j389j390j390m95m96
-10793g2264l357l357K80K79K79K80L379L380L021L022o07o331l468K254J896J897k515k515
-10775g4447P78P79P79P79j129j129J732J733J345J349J643J647k709K064R87j870k545k541
-10757g0755k902k899j829m688r94L778j76j71K985K988j249j244j248j245j948j945R13R16
-10739h1713k306k303N56N58L84L88L83L88N332N335j345j341K410K415m51m47l193l190l31
-10720g8471l28K351K355n11n06j405j401L364L369j599j594j599j595l088l085J382J386
-10703h0975P27m043P1K932J502M363J680j181k761k761J829J830j9j8j9j9J174J174j390
$$ plain form
-10684 -75904 -77294 -78087 -74112 -72819 -71526 -72886 -74246 -78289 -77562 -74689 -71817 -68646 -65475 -66086 -66694 -70464 -74231 -76273
-10666 -76273 -83080 -83393 -78933 -75297 -74518 -76605 -78687 -77853 -77014 -76180 -75341 -75170 -74995 -74824 -74648 -75371 -76090 -76813 -77532 -76698
-10646 -76698 -75859 -77886 -79909 -83725 -87536 -86582 -85625 -84239 -82853 -81467 -80081 -77145 -74209 -74134 -74060 -74872 -75684 -76496 -77309
-10627 -77309 -76631 -75952 -75274 -74596 -73672 -72748 -68605 -70185 -71943 -73702 -75818 -77935 -80289 -82644 -82137 -81631 -80111 -78590 -77070
-10608 -77070 -75550 -76377 -77201 -78028 -78851 -79678 -80502 -76917 -73329 -67361 -67111 -70323 -73531 -73762 -73989 -74220 -74447 -75435 -76418 -77406
-10588 -77406 -78389 -78661 -78929 -79201 -79470 -77238 -75002 -72771 -70535 -71522 -72506 -75997 -79485 -84261 -83311 -82719 -82126 -78374 -74622
-10569 -74622 -70870 -67118 -65680 -64238 -69473 -74708 -76187 -77666 -79146 -80625 -80360 -80092 -79824 -79555 -78572 -77588 -76605 -75621 -75572
-10550 -75572 -75520 -75468 -75416 -74470 -73523 -75438 -77353 -76560 -75762 -74969 -74172 -73199 -72223 -71250 -70274 -71120 -71962 -72808 -73650 -78251 -82849 -82443
$$ packed form
-10684g5904j390p93L975J293J293j360j360m043P27K873K872L171L171o11o08l770l767k042
-10666g6273o807l13M460L636P79k087k082Q34Q39Q34Q39J71J75J71J76p23p19p23p19Q34
-10646g6698Q39k027k023l816l811R54R57J386J386J386J386K936K936P5P4q12q12q12q13
-10627g7309O78O79O78O78R24R24M143j580j758j759k116k117k354k355N07N06J520J521J520
-10608g7070J520q27q24q27q23q27q24L585L588N968K50l212l208k31k27k31k27r88r83r88
-10588g7406r83k72k68k72k69K232K236K231K236r87r84l491l488m776R50N92N93L752L752
-10569g4622L752L752J438J442n235n235j479j479j480j479K65K68K68K69R83R84R83R84M9
-10550g5572N2N2N2R46R47j915j915P93P98P93P97R73R76R73R76q46q42q46q42m601m598M06
$$ plain form
-10528 -82443 -76310 -72856 -75122 -73814 -72502 -70837 -69168 -64283 -65118 -69779 -74436 -79813 -79462 -79235 -79004 -78419 -77830 -74410
-10510 -74410 -70986 -71977 -72964 -79321 -79950 -79030 -78110 -78654 -79194 -79738 -80278 -78378 -76474 -77432 -78389 -78121 -77849 -80442 -83032 -83300
-10490 -83300 -83564 -83829 -84094 -85778 -87458 -86281 -85100 -87678 -90252 -88058 -85863 -85454 -85040 -81769 -78494 -78799 -79101 -76903
-10472 -76903 -74701 -70349 -71716 -74637 -77555 -78687 -79816 -80949 -82078 -80543 -79004 -77469 -75930 -76362 -76791 -74362 -71929
-10455 -71929 -72025 -72119 -72215 -72309 -74075 -75837 -77603 -79365 -78397 -77428 -76102 -80498 -77264 -74030 -74015 -74000 -73329 -72659 -71988 -71317 -72018
-10434 -72018 -72718 -73419 -74119 -72785 -71452 -70118 -68784 -71802 -74820 -77838 -80856 -78061 -75267 -77242 -79216 -80833 -82450
-10417 -82450 -81206 -79962 -79257 -78549 -77845 -77137 -79235 -81329 -80565 -79798 -78110 -76418 -77592 -78762 -76955 -75144 -73337 -71526
-10399 -71526 -72037 -72543 -73054 -73560 -74786 -76008 -77234 -78456 -76493 -74525 -72562 -70595 -72506 -74414 -76325 -78233 -76608 -74984
$$ packed form
-10528h2443O133L454k266J308J312J665J669M885q35m661m657n377L51K27K31N85N89L420
-10510g4410L424r91r87o357o29R20R20n44n40n44n40J900J904r58r57K68K72k593k590k68
-10490h3300k64k65k65j684j680J177J181k578k574K194K195M09M14L271L275l05l02K198
-10472g6903K202M352j367k921k918j132j129j133j129J535J539J535J539m32m29K429K433
-10455g1929r6r4r6r4j766j762j766j762R68R69J326m396L234L234J5J5O71O70O71O71p01
-10434g2018p00p01p00J334J333J334J334l018l018l018l018K795K794j975j974j617j617
-10417h2450J244J244P05P08P04P08k098k094P64P67J688J692j174j170J807J811J807J811
-10399g1526n11n06n11n06j226j222j226j222J963J968J963J967j911j908j911j908J625J624
$$ plain form
-10381 -74984 -77771 -80558 -83166 -80051 -77294 -74537 -73479 -72420 -76131 -79842 -79678 -79514 -79351 -79187 -76891 -74596 -75163 -75729
-10363 -75729 -75401 -75073 -74745 -74417 -73583 -72748 -71914 -71079 -72212 -73344 -74477 -75610 -76444 -77279 -72033 -72510 -72927 -73344 -76981 -80617
-10343 -80617 -84969 -89321 -86996 -84671 -85088 -85506 -85923 -86340 -84910 -83475 -82044 -80610 -82756 -84898 -84183 -83464 -83822 -84176 -82029
-10324 -82029 -79880 -77137 -80114 -79876 -79634 -78620 -77607 -76593 -75580 -78918 -82257 -80826 -79395 -80207 -81020 -81832 -82644 -83755
-10306 -83755 -84865 -83471 -82078 -77014 -77670 -77972 -78270 -77499 -76724 -75952 -75178 -76292 -77402 -78516 -79626 -84496 -89362 -87555
-10288 -87555 -85744 -83591 -81433 -79280 -77122 -76221 -75315 -77275 -79231 -76914 -74593 -75137 -75677 -74552 -73423 -76709 -79991 -82980
-10270 -82980 -80241 -74645 -74768 -76981 -79190 -78900 -78605 -78620 -78631 -78289 -77942 -80163 -76657 -70293 -69648 -72771 -75889 -74600 -73307
-10251 -73307 -75178 -77044 -78617 -80185 -78814 -72670 -72372 -74932 -76183 -77432 -76001 -74566 -75133 -75695 -76262 -76824 -80073 -83319
$$ packed form
-10381g4984k787k787k608L115K757K757J058J059l711l711J64J64J63J64K296K295n67n66
-10363g5729L28L28L28L28Q34Q35Q34Q35j133j132j133j133q34q35N246m77m17m17l637l636
-10343h0617m352m352K325K325m17m18m17m17J430J435J431J434k146k142P15P19l58l54K147
-10324h2029K149K743k977K38K42J014J013J014J013l338l339J431J431q12q13q12q12j111
-10306h3755j110J394J393N064o56l02k98P71P75P72P74j114j110j114j110m870m866J807
-10288h7555J811K153K158K153K158R01R06j960j956K317K321n44n40J125J129l286l282k989
-10270h2980K739N596j23k213k209K90K95j5j1L42L47k221L506O364O45l123l118J289J293
-10251g3307j871j866j573j568J371O144K98k560j251j249J431J435n67n62n67n62l249l246
$$ plain form
-10233 -83319 -81798 -80275 -78456 -76634 -79585 -79671 -77495 -80085 -79816 -79544 -78941 -78333 -77730 -77122 -76519 -75912 -75308 -74701 -74596 -74488
-10213 -74488 -74384 -74276 -72025 -69771 -67521 -65267 -66317 -67364 -68415 -69462 -69261 -69056 -71716 -74373 -74172 -73967 -73765 -73560 -73180
-10194 -73180 -72797 -72417 -72033 -72513 -72990 -73471 -73948 -72759 -71567 -70379 -69186 -69734 -70278 -70826 -71370 -71917 -72461 -73009 -73553 -72029
-10174 -72029 -70502 -68978 -67450 -68549 -69645 -70744 -71839 -70509 -69175 -67845 -66511 -67148 -67782 -68419 -69052 -69890 -70725 -68702
-10156 -68702 -66675 -67156 -67633 -70975 -69544 -69041 -71396 -73754 -73247 -72387 -76292 -76087 -73016 -70926 -68832 -68650 -73233 -73288 -73341
-10137 -73341 -73695 -74045 -75561 -77074 -75729 -74380 -71843 -69302 -69626 -69946 -71604 -73262 -74920 -76578 -75613 -74648 -76545 -78441
-10119 -78441 -77208 -75975 -76649 -74462 -68281 -66869 -71180 -75490 -79235 -82980 -80047 -77115 -73646 -70177 -71478 -72778 -72931
-10102 -72931 -73084 -73236 -73389 -74555 -75721 -76888 -78054 -77104 -76150 -75200 -74246 -76157 -78065 -75207 -72346 -73780 -75211 -79507
$$ packed form
-10233h3319J521J523J819J822k951q6K176k590K69K72O03O08O03O08O03O07O04O07J05J08
-10213g4488J04J08K251K254K250K254j050j047j051j047K01K05k660k657K01K05K02K05L80
-10194g3180L83L80L84m80m77m81m77J189J192J188J193n48n44n48n44n47n44n48n44J524
-10174g2029J527J524J528j099j096j099j095J330J334J330J334o37o34o37o33q38q35K023
-10156f8702K027m81m77l342J431N03k355k358N07Q60l905K05L071K090K094J82m583n5n3
-10137g3341l54l50j516j513J345J349K537K541l24l20j658j658j658j658R65R65j897j896
-10119g8441J233J233o74K187O181J412m311m310l745l745K933K932L469L469j301j300j53
-10102g2931j53j52j53j166j166j167j166R50R54R50R54j911j908K858K861j434j431m296
$$ plain form
-10084 -79507 -83799 -82134 -80465 -81780 -78322 -73669 -73784 -77596 -78546 -74429 -75081 -75435 -75789 -75993 -71429 -67759 -66951 -73952
-10066 -73952 -78091 -75435 -72778 -73035 -73288 -73963 -74634 -71016 -74071 -73374 -72674 -73840 -75002 -73486 -76735 -77245 -77752 -75699 -73642
-10047 -73642 -72480 -71317 -70155 -68993 -73195 -77398 -77607 -73046 -69291 -65535 -65475 -70185 -74775 -79365 -79485 -79604 -80241 -80878
-10029 -80878 -81515 -82152 -81776 -81400 -81023 -80647 -77707 -74768 -71828 -68888 -71433 -73978 -76523 -79067 -78169 -77271 -76374 -75476 -73803
-10010 -73803 -72130 -70457 -73553 -76396 -76377 -75405 -74432 -74771 -75110 -75449 -75789 -79447 -83102 -81992 -80878 -80304 -79727 -79153 -78576 -76347
-9990 -76347 -74116 -72066 -70013 -70289 -73423 -77633 -77070 -74335 -71597 -68922 -71012 -67741 -67327 -68467 -69604 -68717 -67826 -66940
-9972 -66940 -66049 -65878 -65703 -68393 -71079 -70200 -69317 -68437 -67554 -67927 -68296 -71351 -69633 -65982 -62327 -61239 -60147 -61146 -62141 -65047
-9952 -65047 -65088 -61876 -63430 -67074 -70714 -69648 -71440 -77469 -78725 -74261 -74563 -71888 -69209 -66414 -63616 -67498 -71377 -76914
$$ packed form
-10084g9507m292J665J669j315L458M653j15l812r50M117o52l54l54k04M564L670Q08p001
-10066g3952m139K656K657k57k53o75o71L618l055O97P00j166j162J516l249n10n07K053K057
-10047g3642J162J163J162J162m202m203k09M561L755L756O0m710m590m590j20j19o37o37
-10029h0878o37o37L76L76L77L76K940K939K940K940k545k545k545k544Q98Q98Q97Q98J673
-10010g3803J673J673l096k843J9R72R73l39l39l39l40l658l655J110J114N74N77N74N77K229
-9990g6347K231K050K053k76l134m210N63K735K738K675k090L271M14j140j137Q87Q91Q86
-9972f6940Q91J71J75k690k686Q79Q83Q80Q83l73l69l055J718L651L655J088J092r99r95k906
-9952f5047m1L212j554l644l640J066j792o029j256M464l02K675K679K795K798l882l879n537
$$ plain form
-9934 -76914 -82447 -81307 -80163 -79798 -79429 -79064 -78695 -75945 -73192 -73303 -73411 -74358 -75300 -76247 -77189 -75036 -72879 -66552 -63083
-9915 -63083 -62897 -67476 -69555 -71630 -71161 -70688 -70218 -69745 -69633 -69518 -65054 -60587 -56731 -59551 -66068 -67815 -66701 -65587 -68944
-9896 -68944 -72301 -76224 -80148 -79004 -77860 -76716 -70803 -64890 -63746 -65404 -67063 -69019 -70975 -74540 -78106 -78810 -79514
-9879 -79514 -80740 -81966 -83192 -84418 -82365 -80312 -78259 -76206 -73572 -70937 -68303 -65669 -65002 -64335 -63668 -63001 -62230 -61459
-9861 -61459 -62237 -68739 -72081 -75423 -79481 -77815 -79369 -80923 -79257 -77592 -75926 -74261 -72238 -75938 -79265 -82592 -83415
-9844 -83415 -84239 -84407 -84574 -81880 -79187 -78609 -78028 -77450 -76869 -75040 -73207 -74239 -75267 -77104 -78937 -77912 -76884 -74965 -73043
-9825 -73043 -77204 -75640 -72521 -69399 -65922 -62442 -61112 -59778 -61310 -62837 -62714 -62588 -62465 -62338 -62454 -62565 -59462 -62077
-9807 -62077 -66120 -70162 -73013 -70140 -68519 -66899 -61701 -62226 -63452 -64678 -69481 -68560 -69667 -70774 -71522 -72271 -71366 -70461
$$ packed form
-9934g6914n533J140J144L65L69L65L69K750K753j11j08r47r42r47r42K153K157O327L469
-9915f3083J86m579k079k075M69M73M70M73J12J15M464M467L856k820o517j747J114J114l357
-9896f8944l357l923l924J144J144J144N913N913J144j658j659j956j956l565l566p04p04
-9879g9514j226j226j226j226K053K053K053K053K634K635K634K634O67O67O67O67P71P71
-9861f1459p78o502l342l342m058J666j554j554J666J665J666J665K023l700l327l327q23
-9844h3415q24j68j67K694K693N78N81N78N81J829J833j032j028j837j833J025J028J919J922
-9825g3043m161J564L119L122L477L480J330J334j532j527J23J26J23J27j16j11L103k615
-9807f2077m043m042k851K873J621J620N198n25j226j226m803R21j107j107p48p49R05R05
$$ plain form
-9789 -70461 -69555 -68650 -67208 -65766 -64324 -62882 -63944 -65006 -68929 -72853 -75822 -78792 -75084 -71377 -71086 -70792 -70502 -70207
-9771 -70207 -71467 -72722 -73981 -75237 -75841 -76441 -74183 -71921 -71034 -70144 -68899 -73374 -74641 -75904 -74667 -73426 -72726 -72022
-9753 -72022 -74540 -71332 -67413 -63489 -60762 -63754 -66094 -68430 -69577 -64998 -62383 -59763 -61559 -63352 -64313 -65270 -66232 -67189
-9735 -67189 -66630 -66068 -65509 -64946 -64387 -63825 -66127 -68426 -63188 -57945 -57416 -59745 -64939 -64406 -62863 -61317 -59223 -62849 -66478
-9716 -66478 -64380 -63955 -63527 -63638 -66608 -71053 -69775 -69034 -68292 -66835 -65378 -63922 -62465 -64898 -67331 -69764 -72197 -73855
-9698 -73855 -75513 -70494 -65475 -64987 -64499 -64369 -64238 -63393 -68270 -73147 -72301 -69965 -67629 -67797 -67964 -67715 -67465 -64354 -61243
-9679 -61243 -59376 -57506 -60050 -62591 -65255 -62193 -61995 -67517 -67215 -66910 -64462 -62010 -59324 -62357 -63784 -62346 -64264 -66179
-9661 -66179 -63150 -60117 -59592 -59063 -58538 -58009 -59972 -61932 -61034 -60132 -58877 -57617 -56362 -55102 -59901 -64697 -67946 -65468
$$ packed form
-9789g0461R06R05J442J442J442J442j062j062l923l924k969k970L708L707K91K94K90K95
-9771g0207j260j255j259j256o04o00K258K262Q87Q90J245m475j267j263J237J241P00P04
-9753g2022k518L208L919L924K727k992k340k336j147M579K615K620j796j793r61r57r62r57
-9735f7189N59N62N59N63N59N62k302k299N238N243N29k329n194N33J543J546K094l626l629
-9716f6478K098M25M28j11k970m445J278P41P42J457J457J456J457k433k433k433k433j658
-9698g3855j658N019N019M88M88J30J31Q45m877m877Q46K336K336j68j67K49K50L111L111
-9679f1243J867J870k544k541k664L062J98n522L02L05K448K452K686l033j427J438j918j915
-9661f6179L029L033N25N29N25N29j963j960Q98R02J255J260J255J260m799m796l249K478
$$ plain form
-9643 -65468 -62755 -60039 -59831 -59618 -61496 -63370 -65248 -67122 -66675 -66224 -68639 -71049 -73493 -75934 -75517 -75096 -75572 -76046 -76701
-9624 -76701 -77353 -77771 -81046 -83073 -79373 -80148 -80919 -78475 -76027 -75777 -75528 -75278 -75028 -76836 -78643 -81880 -85118 -82216 -79313
-9605 -79313 -82730 -86147 -86731 -81593 -78244 -74894 -74838 -74783 -73296 -71809 -74675 -77540 -83624 -83986 -81053 -78121 -81508 -84895
-9587 -84895 -85241 -85588 -84503 -83419 -83002 -82585 -80737 -78888 -75043 -71198 -70215 -69231 -69931 -70632 -72763 -74894 -74730 -74566 -74403 -74239
-9567 -74239 -76832 -79425 -82018 -84611 -86638 -88665 -89261 -89858 -82793 -75729 -73791 -71854 -69052 -71973 -74537 -77100 -76798 -76496
-9549 -76496 -80964 -85431 -86024 -86616 -82439 -78263 -78482 -78702 -75703 -78426 -78706 -78985 -76761 -74537 -72290 -70043 -70658 -71273 -74034
-9530 -74034 -76795 -72879 -68963 -69294 -69626 -72819 -76012 -77417 -78821 -72238 -71377 -75360 -79339 -80819 -82294 -79898 -77499 -77964
-9512 -77964 -78426 -77372 -76314 -75259 -74201 -73743 -73281 -77234 -81184 -83091 -79272 -78676 -78076 -77033 -75986 -76374 -76757 -79380 -82000
$$ packed form
-9643f5468K713K716K08K13j878j874j878j874M47M51k415k410k444k441M17M21m76m74o55
-9624g6701o52m18l275k027L700p75p71K444K448K50K49K50K50j808j807l237l238K902K903
-9605g9313l417l417n84N138L349L350N6N5J487J487k866k865o084l62K933K932l387l387
-9587h4895l46l47J085J084M17M17J848J849L845L845R83R84p00p01k131k131J64J64J63J64
-9567g4239k593k593k593k593k027k027n96n97P065P064J938J937K802k921k564k563L02L02
-9549g6496m468m467n93n92M177M176k19k20K999k723k80k79K224K224K247K247o15o15k761
-9530g4034k761L916L916l31l32l193l193j405j404O583Q61l983l979j480j475K396K399m65
-9512g7964m62J054J058J055J058M58M62l953l950j907L819N96O00J043J047l88l83k623k620
$$ plain form
-9493 -82000 -79854 -77704 -77137 -76567 -76001 -75431 -75263 -75092 -74924 -74753 -72737 -70718 -70669 -67756 -65293 -68549 -69663 -67912 -64734
-9474 -64734 -55829 -51399 -49827 -49886 -52804 -60673 -65676 -68449 -71217 -72379 -73538 -70833 -68124 -70189 -72249 -73568 -74883
-9457 -74883 -76917 -73225 -68575 -69648 -72033 -77279 -80558 -80975 -82108 -80379 -77003 -76489 -77048 -77607 -74410 -71213 -72785 -74358
-9439 -74358 -74008 -73657 -70267 -66876 -69000 -68262 -67346 -72152 -73650 -75148 -74142 -73136 -73113 -73091 -73069 -73046 -73315 -73583 -73851 -74119 -73851
-9418 -73851 -73583 -71347 -71973 -75043 -72391 -71526 -73523 -75222 -76921 -78799 -80677 -80945 -81213 -81482 -81750 -79872 -77994 -76116 -74239
-9399 -74239 -73985 -73732 -73479 -73225 -73151 -73076 -73002 -72927 -72558 -72189 -77901 -77890 -74749 -71608 -67752 -69618 -69905 -70192 -72268 -74343 -74809 -75274
-9377 -75274 -77171 -79067 -78393 -77719 -74183 -70647 -66098 -61548 -59860 -58173 -56291 -54409 -53959 -53508 -51298 -49089 -46879 -44670
-9359 -44670 -35329 -25985 -10265 8319 30477 73622 134828 196037 242159 259671 260129 251053 226712 181390 126169
$$ packed form
-9493h2000K146K150N67N70N66N70J68J71J68J71K016K019M9K913K463l256j114J751L178
-9474f4734Q905M430J572n9k918p869n003k773k768j162j159K705K709k065k060j319j315
-9457g4883k034L692M650j073k385n246l279m17j133J729L376N14n59n59L197L197j572j573
-9439g4358L50L51L390L391k124P38R16m806j498j498J006J006K3K2K2K3k69k68k68k68K68
-9418g3851K68K236o26l070K652Q65j997j699j699j878j878k68k68k69k68J878J878J878J877
-9399g4239K54K53K53K54P4P5P4P5L69L69n712J1L141L141L856j866k87k87k076k075m66m65
-9377g5274j897j896O74O74L536L536M549M550J688J687J882J882M50M51K210K209K210K209
-9359d4670R341R344J5720J8584K2158M3145O1206O1209M6122J7512M58r076k4341m5322n5221
$$ plain form
-9344 126169 70951 30171 2748 -15317 -30519 -42386 -48526 -51034 -53538 -53005 -52468 -52293 -52114 -50002 -53608 -58471
-9328 -58471 -60468 -62215 -63963 -64100 -64238 -68668 -73098 -72759 -72420 -73139 -73859 -73147 -72435 -72588 -72741 -75755 -78769 -80435 -82100
-9309 -82100 -80904 -79708 -78691 -77674 -79518 -81362 -81254 -81146 -81038 -80930 -80196 -79462 -81590 -83717 -84392 -85066 -87171 -89276 -86195
-9290 -86195 -83114 -81821 -80528 -76582 -78359 -81687 -85014 -82857 -80699 -79973 -79246 -76754 -74261 -74630 -74999 -73013 -71027 -74406
-9272 -74406 -83509 -88110 -92712 -94571 -90707 -86903 -88822 -87164 -85506 -84705 -83904 -82208 -77651 -71485 -71042 -68631 -66220 -69682
-9254 -69682 -73143 -75174 -77204 -74973 -72741 -71940 -71139 -70025 -68911 -70658 -72405 -71440 -70475 -74280 -78084 -81314 -84544 -84913
-9236 -84913 -85282 -81806 -78330 -77715 -77100 -77752 -78400 -77622 -76839 -76597 -76351 -76109 -75863 -76910 -77953 -80789 -77897 -76947 -75993 -68605
-9216 -68605 -66936 -63407 -59875 -56705 -53530 -56261 -58989 -64581 -70170 -72573 -74973 -74514 -74052 -72670 -71284 -69902 -68516
$$ packed form
-9344A26169n5218m0780k7423j8065j5202j1867o140k508k504N33N37J75J79K112l606m863
-9328e8471j997j747j748j37j38m430m430L39L39p19p20P12P12j53j53l014l014j666j665
-9309h2100J196J196J017J017j844j844J08J08J08J08P34P34k128k127o75o74k105k105L081
-9290h6195L081J293J293L946j777l328l327K157K158P26P27K492K493l69l69J986J986l379
-9272g4406r103m601m602j859L864L804j919J658J658Q01Q01J696M557O166M43K411K411l462
-9254f9682l461k031k030K231K232Q01Q01J114J114j747j747R65R65l805l804l230l230l69
-9236h4913l69L476L476O15O15o52o48P78P83K42K46K42K46j047j043k836K892R50R54P388
-9216f8605J669L529L532L170L175k731k728n592n589k403k400M59M62J382J386J382J386
$$ plain form
-9199 -68516 -66887 -65259 -62558 -59857 -59272 -64410 -63467 -62524 -67096 -71668 -70159 -74373 -77812 -81251 -80278 -79306 -76426 -73546
-9181 -73546 -67446 -67070 -66157 -65244 -69458 -73672 -75830 -77987 -75375 -72763 -71522 -70282 -70472 -70662 -72335 -74008 -74250 -74492 -75658
-9162 -75658 -76824 -75129 -73434 -72737 -72040 -72774 -73508 -72752 -71996 -72670 -73344 -70598 -67852 -69876 -71899 -73326 -74753 -74749 -74745 -72253
-9142 -72253 -69760 -67267 -64775 -61000 -57226 -58221 -59216 -60430 -61645 -67629 -73613 -73039 -72465 -69030 -65595 -67368 -69142 -69365
-9124 -69365 -63866 -63553 -63240 -64000 -64760 -67845 -70930 -72584 -74239 -76817 -79395 -79112 -78829 -75096 -71362 -69060 -66757 -65617
-9106 -65617 -64477 -66198 -67919 -71496 -75069 -81150 -87227 -89910 -86866 -82275 -77681 -76206 -74727 -73251 -71772 -70893 -70010
-9089 -70010 -65911 -67532 -68523 -69510 -67998 -66481 -66578 -66671 -66768 -66861 -65751 -64637 -63527 -62413 -58083 -53750 -54190 -54625 -53474 -52319
-9069 -52319 -54029 -55736 -57327 -58914 -60505 -62092 -60494 -58892 -57293 -55691 -57848 -60002 -59298 -58590 -56477 -54361 -52248
$$ packed form
-9199f8516J629J628K701K701N85n138R43R43m572m572J509m214l439l439R73R72K880K880
-9181g3546O100L76R13R13m214m214k158k157K612K612J241J240j90j90j673j673k42k42j166
-9162g5658j166J695J695O97O97p34p34P56P56o74o74K746K746k024k023j427j427MMK492
-9142g2253K493K493K492L775L774r95r95j214j215n984n984N74N74L435L435j773j774k23
-9124f9365N499L13L13p60p60l085l085j654j655k578k578K83K83L733L734K302K303J140
-9106f5617J140j721j721l577l573o081o077k683L044M591M594J475J479J476J479Q79Q83
-9089g0010M099j621r91r87J512J517r7r3r7r3J110J114J110J114M330M333m40m35J151J155
-9069e2319j710j707j591j587j591j587J598J602J599J602k157k154P04P08K113K116K113
$$ plain form
-9052 -52248 -50132 -49689 -49242 -48798 -48351 -43750 -39144 -37404 -35661 -34219 -32773 -28470 -24163 -22005 -19844 -22456 -25064 -23861
-9034 -23861 -22654 -19900 -11420 2853 17130 34623 52120 74382 96648 125587 154530 184781 215035 249101
-9020 249101 292708 338936 394705 461678 542008 652439 818197 1074564 1474009 2069582 2880723 3831120
-9008 3831120 4787242 5627576 6225641 6405449 6030132 5236916 4228139 3181205 2292610 1642438 1200205
-8997 1200205 903188 699650 556796 454006 381496 333790 298234 276035 260271 244510 226004 207501
-8985 207501 182318 157138 131925 106716 84960 68931 57489 46051 34966 23885 15390 6895 3170 -555
-8971 -555 -7560 -14565 -16800 -19036 -26309 -33582 -34178 -34774 -33999 -33224 -29588 -25951 -25996 -26040 -26085 -26130 -25280 -24431 -23581 -22732 -15057
-8950 -15057 -7381 -958 8326 28759 54915 89238 136914 196290 265204 334178 400290 445418 461931 449531
$$ packed form
-9052e2248K116M43M47M44M47M601M606J740J743J442J446M303M307K158K161k612k608J203
-9034b3861J207K754Q480J4273J4277J7493J7497K2262K2266K8939K8943L0251L0254L4066
-9020B49101M3607M6228N5769O6973Q0330J10431J65758K56367L99445N95573Q11141R50397
-9008C831120R56122Q40334N98065J79808l75317p93216j008777j046934q88595o50172m42233
-8997A200205k97017k03538j42854j02790p2510m7706l5556k2199j5764j5761j8506j8503
-8985B07501k5183k5180k5213k5209k1756j6029j1442j1438j1085j1081q495q495l725l725
-8971e55p005p005k235k236p273p273n96n96P75P75L636L637m5m4m5m5Q50Q49Q50Q49P675
-8950a5057P676O423R284K0433K6156L4323M7676N9376O8914O8974O6112M5128J6513j2400
$$ plain form
-8936 449531 412332 349349 276829 203354 139418 86391 42902 13065 -3417 -16226 -26175 -31950 -28187 -31398
-8922 -31398 -37471 -36570 -35668 -38075 -40482 -42889 -45296 -45557 -45817 -46078 -46339 -50281 -54219 -55300 -56377 -59484 -62588 -62834 -63076
-8903 -63076 -64574 -66068 -67208 -68344 -68292 -62513 -62819 -63121 -62591 -62059 -61530 -60997 -63270 -65539 -65844 -69007 -71817 -68899 -66701
-8884 -66701 -64499 -60334 -59026 -57662 -62018 -63035 -64052 -63460 -65729 -70919 -70386 -68482 -66578 -64622 -62666 -60710 -58754
-8867 -58754 -59659 -60565 -61470 -62375 -64670 -66966 -62584 -58202 -58113 -58024 -57934 -57845 -57897 -57949 -60863 -63776 -61861 -59946 -60892 -61839 -64726
-8846 -64726 -67614 -63825 -60035 -60419 -60803 -58325 -55848 -54324 -52800 -48414 -44029 -43996 -43962 -46790 -49618 -51660 -53701 -55743
-8828 -55743 -57785 -58813 -59842 -60870 -61898 -61347 -60796 -60244 -59693 -63195 -66697 -67338 -67979 -69712 -71440 -72994 -69775 -69004 -68229
-8809 -68229 -67159 -66086 -70054 -74019 -77987 -81951 -79183 -76411 -70781 -65147 -62498 -59845 -57375 -54901 -58452 -64861 -65669
$$ packed form
-8936D49531l7199o2983p2520p3475o3936n3027m3489k9837j6482j2809r949n775L763l211
-8922c1398o073R01R02k407k407k407k407k61k60k61k61l942l938j081j077l107l104k46k42
-8903f3076j498j494j140j136N2N779l06l02N30N32N29N33k273k269l05l163k810K918K198
-8884f6701K202M165J308J364m356j017j017N92k269n190N33J904J904J956J956J956J956
-8867e8754r05r06r05r05k295k296M382M382Q9Q9R0Q9n2n2k914k913J915J915r46r47k887
-8846f4726k888L789L790l84l84K478K477J524J524M386M385L3L4k828k828k042k041k042
-8828e5743k042j028j029j028j028N51N51N52N51l502l502o41o41j733j728j554L219P71P75
-8809f8229J070J073l968l965l968l964K768K772N630N634K649K653K470K474l551o409q08
$$ plain form
-8792 -65669 -61705 -58102 -54495 -55363 -56228 -57275 -58318 -56503 -54685 -54901 -55114 -55330 -55542 -56295 -57044 -57796 -58545 -58910 -59272 -59637
-8772 -59637 -59998 -59350 -58698 -55188 -51675 -56123 -60568 -65017 -69462 -71586 -73706 -75531 -77353 -78911 -75695 -72186 -73441 -72733
-8754 -72733 -67253 -64756 -62256 -63031 -63802 -64577 -65349 -65110 -64868 -64928 -64983 -66563 -72908 -71806 -70699 -67390 -64078 -60769 -57457
-8735 -57457 -57651 -57841 -55173 -52502 -51086 -49666 -53020 -56369 -56474 -56574 -59540 -62502 -66481 -70457 -74436 -78412 -81731 -85051
-8717 -85051 -83602 -82152 -79332 -76511 -73691 -70870 -68497 -66124 -64108 -62092 -60494 -64618 -72201 -79783 -79011 -78240 -77469 -76698
-8699 -76698 -74973 -73247 -71880 -64790 -60345 -55900 -51097 -46294 -46678 -47062 -51857 -56652 -61608 -60840 -58523 -56205 -54842 -53478
-8681 -53478 -54976 -56474 -53180 -49886 -51362 -52837 -50497 -48157 -42598 -42762 -39908 -37054 -34558 -32062 -35050 -38038 -43887
-8664 -43887 -49737 -49834 -49931 -45616 -41302 -37226 -38872 -48031 -62912 -77193 -85752 -87037 -78784 -62662 -46540 -29465 -18112
$$ packed form
-8792f5669L964L603L607q68q65j047j043J815J818k16k13k16k12p53p49p52p49l65l62l65
-8772e9637l61O48O52L510L513m448m445m449m445k124k120j825j822j558L216L509j255P08
-8754g2733N480K497K500p75p71p75p72K39K42o0n5j580o345J102J107L309L312L309L312
-8735e7457j94j90K668K671J416J420l354l349j05j00k966k962l979l976l979l976l319l320
-8717h5051J449J450K820K821K820K821K373K373K016K016J598m124p583p582P72P71P71P71
-8699g6698J725J726J367P090M445M445M803M803l84l84m795m795m956P68K317K318J363J364
-8681e3478j498j498L294L294j476j475K340K340N559j64K854K854K496K496k988k988n849
-8664d3887n850r7r7M315M314M076j646r159j4881j4281q559j285Q253J6122J6122J7075J1353
$$ plain form
-8647 -18112 -8048 2014 2778 3542 1087 -7091 -16461 -25832 -33027 -34498 -34420 -34342 -34979 -35616 -35299 -40706 -44554 -38865 -22683
-8628 -22683 -6502 9559 25622 40015 44870 47772 44955 39393 28111 17540 6974 2722 -1524 -3570 -5611
-8613 -5611 -3245 -876 6199 7555 9265 10979 10945 10916 14101 11568 13501 15439 22380 35048 51379 67713 80348
-8596 80348 83448 73906 51014 28953 12618 2588 -7437 -7929 -2694 6232 15163 25700 33379 41651 44203 52295
-8580 52295 60392 75698 85284 92364 89908 78015 56588 33547 7648 -8715 -15537 -13480 -8559 5420 16542
-8565 16542 23964 21851 12164 -3242 -13406 -17844 -1394 32228 82836 130588 172910 198067 206648 201879 196048
-8550 196048 187359 186535 191439 207665 221033 226589 226425 220721 205482 187914 167489 150875 128542 114969 107122
-8535 107122 112133 122871 135930 139455 148103 153893 173450 202549 246023 289497 333805 360944 379917 385535
$$ packed form
-8647a8112J0064J0062P64P64k455q178r370r371p195j471P8P8o37o37L17n407l848N689J6182
-8628b2683J6181J6061J6063J4393M855K902k817n562j1282j0571j0566m252m246k046k041
-8613e611K366K369P075J356J710J714l4k9L185k533J933J938O941J2668J6331J6334J2635
-8596H0348L100r542k2892k2061j6335j0030j0025m92N235Q926Q931J0537P679Q272K552Q092
-8580E2295Q097J5306R586P080k456j1893k1427k3041k5899j6363o822K057M921J3979J1122
-8565A6542P422k113r687j5406j0164m438J6450L3622N0608M7752M2322K5157Q581m769n831
-8550A96048q689q24M904J6226J3368N556j64n704j5239j7568k0425j6614k2333j3573p847
-8535A07122N011J0738J3059L525Q648N790J9557K9099M3474M3474M4308K7139J8973N618
$$ plain form
-8521 385535 395208 410603 448980 500710 565078 619909 662518 676512 680015 677794 691394 710716 745061 773684
-8507 773684 803379 819721 848462 890557 978377 1102441 1279682 1481722 1724061 1995015 2327253 2710997
-8495 2710997 3175877 3684636 4234406 4778457 5342653 5924023 6596956 7432043 8624008 10382549 13147376
-8484 13147376 17440238 24167743 34536966 50170124 71276350 95125997 115478913 125676415 121148741
-8475 121148741 104048047 81108033 58603668 41179399 29246876 21509294 16388296 12917425 10439962
-8466 10439962 8700764 7473770 6664555 6132080 5807544 5565272 5340172 5018493 4584267 4042135 3500007
-8455 3500007 3008100 2644010 2379710 2197443 2043549 1910643 1762114 1613589 1457355 1325924 1207962
-8444 1207962 1114804 1022715 936352 840209 753609 675678 630181 604234 599275 590973 588399 569605 541277 494797
$$ packed form
-8521C85535R673J5395L8377N1730O4368N4831M2609J3994L503k221J3600J9322L4345K8623
-8507G73684K9695J6342K8741M2095Q7820J24064J77241K02040K42339K70954L32238L83744
-8495B710997M64880N08759N49770N44051N64196N81370O72933Q35087J191965J758541K764827
-8484A3147376M292862O727505J0369223J5633158K1106226K3849647K0352916J0197502m527674
-8475A21148741j7100694k2940014k2504365j7424269j1932523p737582n120998l470871k477463
-8466A0439962j739198j226994q09215n32475l24536k42272k25100l21679m34226n42132n42128
-8455C500007m91907l64090k64300j82267j53894j32906j48529j48525j56234j31431j17962
-8444A207962r3158r2089q6363r6143q6600p7931m5497k5947m959q302k574j8794k8328m6480
$$ plain form
-8430 494797 454039 424013 414970 414631 423830 420391 411229 388088 374484 358377 351808 341067 330325 303964 277604
-8415 277604 242264 206924 169437 141489 113899 92032 80657 78820 83481 93865 98407 93411 69099 44788
-8401 44788 20357 9280 13382 38469 72020 105572 129466 143822 138028 122696 100568 87978 80277 82114
-8387 82114 87408 92703 92870 87315 73369 53700 26997 293 -29390 -49536 -62767 -58828 -52148 -45467 -40575
-8372 -40575 -35683 -29837 -23991 -21007 -18022 -11398 -4773 -6733 -8693 -17568 -26443 -45214 -63985 -83024 -92525 -95946
-8356 -95946 -93643 -84067 -68769 -55974 -48903 -50643 -52383 -56984 -61585 -62849 -58389 -61917 -65445 -67871 -70297 -67953
-8340 -67953 -65609 -63117 -60624 -64808 -68993 -79272 -89548 -97801 -106050 -115048 -114504 -110387 -96728 -81880 -67029 -56712
-8324 -56712 -46391 -41797 -42922 -47151 -51377 -56533 -55963 -48482 -40996 -43828 -52379 -57714 -63046 -65550 -68050 -69004 -64231
$$ packed form
-8430D94797m0758l0026r043l39R199l439r162k3141j3604j6107o569j0741j0742k6361k6360
-8415B77604l5340l5340l7487k7948k7590k1867j1375j837M661J0384M542m996k4312k4311
-8401D4788k4431j1077M102K5087L3551L3552K3894J4356n794j5332k2128j2590p701J837
-8387H2114N294N295J67n555j3946j9669k6703k6704k9683k0146j3231L939O680O681M892
-8372d0575M892N846N846K984K985O624O625j960j960q875q875j8771j8771j9039r501l421
-8356i5946K303R576J5298J2795P071j740j740m601m601j264M460l528l528k426k426K344
-8340f7953K344K492K493m184m185j0279j0276q253q249q998N44M117J3659J4848J4851J0317
-8324e6712J0321M594j125m229m226n156N70P481P486k832q551n335n332k504k500r54M773
$$ plain form
-8307 -64231 -59998 -55762 -49622 -37755 -25832 -13905 -9255 -10325 -18641 -32676 -48146 -57889 -61049 -58482 -55918 -53351
-8291 -53351 -56570 -59786 -65867 -71943 -71161 -70375 -71023 -71668 -71809 -71947 -69227 -66504 -64589 -62670 -63616 -64559 -64015 -63467 -62923 -62375
-8271 -62375 -62372 -62368 -59264 -50438 -47870 -51026 -55374 -59723 -62193 -64663 -65583 -60781 -52789 -44797 -39308 -33820 -32117 -30415 -30143
-8252 -30143 -29871 -32848 -35825 -38802 -41779 -43384 -44990 -49100 -43671 -38451 -33231 -28846 -24461 -24740 -25016 -25295 -25571 -25105
-8234 -25105 -24636 -28939 -33239 -33831 -34420 -30243 -26063 -19859 -13652 -16033 -18410 -21804 -25195 -25727 -26257 -23451 -20642 -20340
-8216 -20340 -20034 -19718 -13674 -5727 2223 11005 25514 39661 53812 72132 90456 121176 151900 187269 222643
-8201 222643 265047 316994 366999 417008 483347 585936 748970 1016928 1447749 2128477 3184852 4830698
-8189 4830698 7137541 9282238 9721129 8017726 5667387 3769165 2507411 1743559 1278490 971759
$$ packed form
-8307f4231M233M236O140J1867J1923J1927M650j070q316j4035j5470r743l160K567K564K567
-8291e3351l219l216o081o076P82P86o48o45j41j38K720K723J915J919r46r43N44N48N44N48
-8271f2375LML104Q826K568l156m348m349k470k470r20M802P992P992N489N488J703J702K72
-8252c0143K72k977k977k977k977j605j606m110N429N220N220M385M385k79k76k79k76M66
-8234b5105M69m303m300n92n89M177M180O204O207k381k377l394l391n32n30K806K809L02
-8216b0340L06L16O044P947P950Q782J4509J4147J4151J8320J8324L0720L0724L5369L5374
-8201B22643M2404N1947N0005N0009O6339J02589J63034K67958M30821O80728J056375J645846
-8189D830698K306843K144697M38891j703403k350339j898222j261754p63852m65069l06731
$$ plain form
-8179 971759 752658 588883 469219 393434 347092 321737 305082 288431 276903 259656 225594 181997 142928
-8166 142928 109585 85180 70318 63201 56088 52430 48774 40935 33100 28122 23148 18110 13077 8039 3006 -2538
-8150 -2538 -8078 -16484 -15347 -10071 -10515 -13823 -17128 -21420 -25713 -28574 -31436 -35519 -39603 -37009 -34416 -36264 -38112
-8133 -38112 -37099 -36085 -37039 -37993 -45624 -53254 -60199 -67144 -74090 -81035 -78143 -75252 -72361 -69469 -67875 -66280 -64685
-8116 -64685 -63091 -63284 -63478 -66533 -69589 -68531 -67469 -63549 -59626 -54514 -49398 -49055 -48709 -53955 -59197 -59674 -60147 -55557
-8098 -55557 -50963 -56865 -62763 -63977 -65188 -66403 -67614 -68292 -68966 -72506 -76042 -78032 -80017 -77238 -74455 -71228 -67998
-8081 -67998 -63340 -58679 -54499 -50315 -49592 -54588 -56936 -59279 -64846 -70408 -72681 -74950 -73765 -66854 -62062 -57267 -53549
-8064 -53549 -49827 -48306 -46782 -50031 -53277 -53128 -52975 -54257 -55535 -56324 -57111 -57901 -58687 -57420 -56149 -54883 -53612 -53694 -53776
$$ packed form
-8179I71759k19101j63775j19664p5785m6342k5355j6655j6651j1528j7247l4062m3597l9069
-8166A42928l3343k4405j4862p117p113l658l656p839p835m978m974n038n033n038n033n544
-8150b538n540q406J137N276m44l308l305m292m293k861k862m083m084K594K593j848j848
-8133c8112J013J014r54r54p631p630o945o945o946o945K892K891K891K892J594J595J595
-8116f4685J594j93j94l055l056J058J062L920L923N112N116L43L46n246n242m77m73M590
-8098e5557M594n902n898j214j211j215j211o78o74l540l536j990j985K779K783L227L230
-8081f7998M658M661M180M184P23m996k348k343n567n562k273k269J185O911M792M795L718
-8064e3549L722J521J524l249l246J49J53j282j278p89p87p90p86J267J271J266J271q2q2
$$ plain form
-8045 -53776 -54216 -54655 -53545 -58158 -59551 -60945 -60460 -59976 -62711 -59723 -57509 -55296 -49864 -44431 -45952 -47472 -48992 -50512
-8027 -50512 -49081 -47651 -47651 -47651 -51049 -54447 -53076 -51704 -49350 -46995 -44640 -42285 -40326 -38366 -33544 -28723 -20742 -12761
-8009 -12761 -846 11068 33148 72397 126191 189524 258818 328112 391325 437370 455783 441766 402354 341957
-7995 341957 269757 197557 135252 86302 51241 25719 9973 3766 -354 -10198 -16226 -22255 -27091 -31927 -33902
-7980 -33902 -35877 -36003 -36130 -39118 -42107 -43582 -45057 -43671 -42285 -40720 -39156 -40452 -41749 -41697 -41644 -41592 -41540 -47628 -53716
-7961 -53716 -56943 -60170 -62077 -63985 -63031 -62077 -59454 -56831 -54208 -51585 -51220 -50855 -50669 -50482 -49581 -51540 -55110 -52956 -47673
-7942 -47673 -42390 -45333 -48277 -52919 -57561 -59342 -61123 -60483 -59842 -57770 -55699 -54849 -54000 -56012 -58024 -62614 -67204 -65118
-7924 -65118 -63031 -63180 -63329 -66340 -69350 -69197 -69041 -71034 -67301 -64913 -68244 -72294 -73479 -73788 -71232 -71899 -69700 -68221
$$ packed form
-8045e3776m40m39J110m613j393j394M85M84k735K988K214K213N432N433j521j520j520j520
-8027e0512J431J430%%l398l398J371J372K354K355K355K355J959J960M822M821P981P981
-8009a2761J1915J1914K2080L9249N3794O3333O9294O9294O3213M6045J8413j4017l9412o0397
-7995C41957p2200p2200o2305m8950l5061k5522j5746o207m120r844o028o029m836m836j975
-7980c3902j975j26j27k988k989j475j475J386J386J565J564j296j297N2N3N2N2o088o088
-7961e3716l227l227j907j908R54R54K623K623K623K623L65L65J86J87R01j959l570K154N283
-7942d7673N283k943k944m642m642j781j781O40O41K072K071Q50Q49k012k012m590m590K086
-7924f5118K087j49j49l011l010J53J56j993L733K388l331m050j185l09K556o67K199J479
$$ plain form
-7906 -68221 -69600 -70624 -68784 -70412 -69175 -62815 -59313 -63474 -64771 -61779 -64507 -64823 -65136 -69209 -70416 -67573 -70449
-7889 -70449 -71541 -69768 -70084 -70397 -72502 -68881 -65054 -64086 -64015 -63940 -60024 -56105 -55050 -53992 -53981 -53966 -55028 -56086 -61217 -60620
-7869 -60620 -62532 -70162 -70792 -65695 -59886 -56936 -56813 -59547 -59067 -61444 -63080 -61850 -63843 -65833 -68430 -71027 -68855 -66682
-7851 -66682 -68177 -69671 -70807 -71943 -72610 -67554 -68579 -69604 -72834 -76064 -74525 -72987 -69428 -65870 -67081 -68292 -70427
-7834 -70427 -72562 -74518 -73613 -74555 -69775 -63266 -56757 -53020 -49283 -48407 -47531 -51071 -54611 -58150 -61690 -62189 -62688 -63009 -58560
-7815 -58560 -59208 -59857 -57345 -59603 -60192 -57919 -57554 -61958 -63717 -62614 -63419 -68993 -72718 -73583 -73374 -70304 -65803 -64164 -60736
-7796 -60736 -57308 -55430 -53552 -54536 -55520 -53888 -52252 -53482 -54707 -57487 -60263 -60181 -60095 -61921 -63743 -60799 -57852 -60989
-7778 -60989 -64123 -67260 -70393 -71526 -72655 -73788 -74917 -74380 -73840 -73303 -72763 -70207 -67647 -65092 -62532 -59618 -56701 -53787
$$ packed form
-7906f8221j379j024J840j628J237O360L502m161j297K992k728l16l13m073j207K843k876
-7889g0449j092J773l16l13k105L621L827R68P1P5L916L919J055J058J1J5j062j058n131N97
-7869f0620j912p630o30N097N809K950J23k734M80k377j636J230j993j990k597k597K172K173
-7851f6682j495j494j136j136o67N056j025j025l230l230J539J538L559L558j211j211k135
-7834g0427k135j956R05r42M780O509O509L737L737Q76Q76l540l540l539l540m99m99l21M449
-7815e8560o48o49K512k258n89K273L65m404j759J103q05n574l725q65K09L070M501J639L428
-7796f0736L428J878J878r84r84J632J636j230j225k780k776Q2Q6j826j822K944K947l137
-7778f0989l134l137l133j133j129j133j129N37N40N37N40K556K560K555K560K914K917K914
$$ plain form
-7760 -53787 -50870 -53418 -55967 -58515 -61064 -60155 -59246 -60900 -62554 -65244 -63165 -60907 -58649 -61161 -63672 -63322 -62971 -67115
-7742 -67115 -71258 -75401 -79544 -78203 -76862 -72659 -68456 -67681 -66906 -66131 -65356 -63210 -61064 -58918 -56772 -55229 -53683 -50233
-7724 -50233 -49640 -51377 -48340 -47930 -52286 -55244 -51522 -43273 -35020 -30705 -26387 -28749 -31108 -35541 -39972 -44405 -48835
-7707 -48835 -52375 -55911 -56768 -57621 -61615 -68467 -71925 -70610 -66019 -66194 -68937 -66906 -67558 -68206 -68560 -68911 -73557 -78199 -76169
-7688 -76169 -74134 -72752 -71366 -70341 -69313 -67275 -70956 -71422 -71884 -73177 -74466 -75759 -77048 -75718 -74384 -73054 -71720
-7671 -71720 -73505 -75286 -77070 -78851 -78967 -79079 -79194 -79306 -79876 -80442 -81012 -81579 -80539 -79496 -81318 -83136 -81895 -80651 -79410
-7652 -79410 -78166 -76567 -74965 -78136 -81303 -81605 -81903 -82205 -82503 -82745 -82983 -83225 -83464 -83497 -83527 -83561 -83591 -83803 -84012 -84224 -84433 -84339
-7630 -84339 -84243 -81288 -78330 -79667 -81001 -81981 -82957 -90204 -91724 -89790 -87853 -83356 -78855 -77219 -75580 -76828 -78073 -74552
$$ packed form
-7760e3787K917k548k549k548k549R09R09j654j654k690K079K258K258k512k511L50L51m144
-7742f7115m143m143m143J341J341M203M203P75P75P75P75K146K146K146K146J543J546L450
-7724e0233N93j737L037M10m356k958L722Q249Q253M315M318k362k359m433m431m433m430
-7707d8835l540l536q57q53l994o852l458J315M591j75k743K031o52o48l54l51m646m642K030
-7688g6169K035J382J386J025J028K038l681m66m62j293j289j293j289J330J334J330J334
-7671g1720j785j781j784j781j16j12j15j12n70n66n70n67J040J043j822j818J241J244J241
-7652g9410J244J599J602l171l167l02k98l02k98k42k38k42k39l3l0l4l0k12k09k12k09R4
-7630h4339R6K955K958j337j334r80r76p247j520J934J937M497M501J636J639j248j245L521
$$ plain form
-7612 -74552 -71027 -73646 -76262 -76020 -75774 -77104 -78430 -79760 -81087 -81523 -81955 -79529 -77100 -74637 -72171 -74477 -76780 -77476
-7594 -77476 -78169 -76005 -73836 -72119 -70397 -68680 -66958 -66731 -66500 -66273 -66042 -69130 -72215 -75304 -78389 -81120 -83848 -86579
-7576 -86579 -89306 -84921 -80532 -76146 -71757 -72737 -73713 -80774 -82108 -76433 -70755 -71399 -72040 -73639 -75233 -76832 -78426 -80085
-7558 -80085 -81739 -83397 -85051 -85517 -85979 -83583 -81184 -82428 -83669 -82052 -80431 -79351 -78266 -80047 -81824 -82324 -82819 -83319
-7540 -83319 -83814 -81213 -78609 -78870 -79127 -80006 -80886 -81765 -82644 -82689 -82734 -82778 -82823 -86087 -89351 -87488 -85625 -87697 -84045 -75625 -72927
-7519 -72927 -70479 -68031 -66299 -64566 -58899 -58955 -61992 -62167 -60129 -55229 -48899 -42569 -36477 -30385 -25187 -22851 -18112 -7649
-7501 -7649 8058 20905 33215 51248 67136 80161 90139 94394 93820 87524 78902 60742 39601 24184 9720
-7486 9720 -4743 -17121 -23775 -32516 -38396 -40758 -43120 -42844 -42569 -48970 -55371 -59328 -63284 -64380 -65475 -65457 -65434 -65416 -65393
$$ packed form
-7612g4552L525k619k616K42K46j330j326j330j327m36m32K426K429K463K466k306k303o96
-7594g7476o93K164K169J717J722J717J722K27K31K27K31l088l085l089l085k731k728k731
-7576h6579k727M385M389M386M389r80r76p061j334N675N678o44o41j599j594j599j594j659
-7558h0085j654j658j654m66m62K396K399j244j241J617J621J080J085j781j777n00m95n00
-7540h3319m95K601K604k61k57q79q80q79q79m5m5m4m5l264l264J863J863k072L652Q420K698
-7519g2927K448K448J732J733N667n6l037j75K038M900O330O330O092O092N198K336M739J0463
-7501g649J5707J2847J2310J8033J5888J3025R978M255n74o296q622j8160k1141j5417j4464
-7486I720j4463j2378o654q741n880k362k362K76K75o401o401l957l956j096j095J8K3J8K3
$$ plain form
-7467 -65393 -66865 -68333 -69805 -71273 -68616 -65956 -63299 -60639 -61559 -62476 -63396 -64313 -67782 -71247 -74715 -78181 -77715 -77245
-7449 -77245 -72010 -66772 -68750 -70725 -69842 -68955 -68847 -68735 -65766 -62793 -61872 -60948 -60028 -59104 -61463 -63817 -70945 -78069 -80099
-7430 -80099 -82126 -87018 -91907 -95189 -98468 -100201 -96206 -92641 -89071 -85506 -81936 -78907 -81597 -81072 -80543 -81426 -82305 -79969
-7412 -79969 -83352 -83162 -82968 -83136 -83300 -79921 -76541 -73162 -69782 -69920 -70058 -73415 -71049 -70375 -69700 -65807 -61913 -63683 -65453
-7393 -65453 -70084 -74715 -74537 -74358 -69768 -65177 -66191 -72927 -76087 -79246 -80379 -75789 -74417 -73046 -74239 -75431 -79485
-7376 -79485 -83538 -81489 -79440 -77391 -75341 -76869 -78397 -75155 -71914 -70818 -69723 -68627 -67532 -69417 -71303 -73188 -75073
-7359 -75073 -76448 -77823 -74429 -71034 -68177 -65319 -62103 -58888 -57960 -51309 -47878 -44446 -44592 -44737 -41782 -33105 -22344
-7342 -22344 -17303 -11550 -5794 3058 11914 26490 46792 70034 99003 136195 179114 227751 276393 321334 356742
$$ packed form
-7467f5393j472j468j472j468K657K660K657K660r20r17r20r17l469l465l468l466M66M70
-7449g7245N235N238j978j975Q83Q87J08J12K969K973R21R24R20R24k359k354p128p124k030
-7430h0099k027m892m889l282l279j733L995L565L570L565L570L029k690N25N29q83q79K336
-7412g9969l383J90J94j68j64L379L380L379L380j38j38l357K366O74O75L893L894j770j770
-7393f5453m631m631J78J79M590M591j014o736l160l159j133M590J372J371j193j192m054
-7376g9485m053K049K049K049K050j528j528L242L241J096J095J096J095j885j886j885j885
-7359g5073j375j375L394L395K857K858L216L215R28O651L431L432j46j45K955Q677J0761
-7342b2344N041N753N756Q852Q856J4576K0302K3242K8969L7192M2919M8637M8642M4941L5408
$$ plain form
-7327 356742 380632 391173 390025 371712 341711 302176 256437 210702 168852 127007 90285 63104 47128 31155
-7313 31155 18934 6717 -4166 -10276 -13529 -21547 -29330 -37110 -42330 -47546 -48839 -50128 -46652 -43172 -39338 -35501
-7297 -35501 -36436 -37367 -42528 -47684 -44558 -41428 -41104 -45546 -50169 -54789 -61150 -67506 -71005 -74499 -73706 -72908 -74976 -77040
-7279 -77040 -82190 -87335 -85807 -84276 -85252 -86225 -84220 -86981 -96184 -100614 -99444 -98271 -96147 -94019 -91896 -89768 -80319
-7262 -80319 -70867 -61597 -52323 -43947 -38429 -35299 -36935 -37173 -37408 -39852 -39431 -39849 -45031 -49145 -50393 -50844 -54156 -57468
-7244 -57468 -57919 -54018 -52979 -50151 -47323 -43690 -40057 -36425 -32792 -33213 -33634 -36916 -40199 -44167 -48135 -47334 -46533 -47699
-7226 -47699 -48865 -50031 -51198 -56298 -61399 -63638 -65878 -62156 -58433 -56619 -51943 -46075 -44975 -42922 -38008 -34465 -35691
-7209 -35691 -39778 -39096 -40262 -44290 -44979 -48530 -48087 -50505 -51671 -52837 -51790 -53605 -49994 -41615 -37229 -35705 -30485 -20496
$$ packed form
-7327C56742K3890J0541j148j8313l0001l9535m5739m5735m1850m1845l6722k7181j5976j5973
-7313C1155j2221j2217j0883o110l253q018p783p780n220n216j293j289L476L480L834L837
-7297c5501r35r31n161n156L126L130L24m442m623m620o361o356l499l494P93P98k068k064
-7279g7040n150n145J528J531r76r73K005k761r203m430J170J173K124K128K123K128R449
-7262h0319R452R270R274Q376N518L130j636k38k35k444M21m18n182m114j248m51l312l312
-7244e7468m51L901J039K828K828L633L633L632L633m21m21l282l283l968l968Q01Q01j166
-7226d7699j166j166j167n100n101k239k240L722L723J814M676N868J100K053M914L543j226
-7209c5691m087O82j166m028o89l551M43k418j166j166J047j815L611Q379M386J524N220R989
$$ plain form
-7191 -20496 -12206 -8685 -2362 -809 -3845 -6882 -10217 -13551 -18041 -22531 -20344 -18156 -16983 -15809 -11774 -7739 -4479
-7174 -4479 -1219 2577 651 -1453 -697 -1550 -2403 -231 7663 13591 16657 17876 13371 1415 -10541 -17788 -25034
-7157 -25034 -21789 -18544 -14464 -10384 -6304 -2225 1534 5293 5834 12097 21281 30465 42869 49549 47765 40257 30544
-7140 30544 17969 7361 -3245 -10634 -8484 -969 9407 21810 28491 31237 31121 23971 13960 7555 10688 26520
-7124 26520 45212 61998 75921 82691 79923 70127 60332 57154 63514 71782 82911 91596 97420 100382 100482 99152
-7108 99152 97822 93690 89558 82565 75571 70821 66070 70500 80653 89435 98217 111947 125677 145279 162019 176792
-7092 176792 197288 216294 229577 246615 263654 281549 302310 331711 370654 407149 434110 456238 475508
-7079 475508 486935 498366 521955 548409 584993 615859 646064 685812 737211 809597 910357 1032104 1168572
$$ packed form
-7191b0496Q290L521O323J553l036l037l335l334m490m490K187K188J173J174M035M035L260
-7174d479L260L796j926k104P56q53q53K172P894N928L066J219m505j1956j1956p247p246
-7157b5034L245L245M080M080M080M079L759L759N41O263R184R184J2404O680j784p508r713
-7140C0544j2575j0608j0606p389K150P515J0376J2403O681K746j16p150j0011o405L133J5832
-7124B6520J8692J6786J3923O770k768r796r795l178O360Q268J1129Q685N824K962J00j330
-7108I9152j330m132m132o993o994m750m751M430J0153Q782Q782J3730J3730J9602J6740J4773
-7092A76792K0496J9006J3283J7038J7039J7895K0761K9401L8943L6495K6961K2128J9270
-7079D75508J1427J1431K3589K6454L6584L0866L0205L9748N1399P2386J00760J21747J36468
$$ plain form
-7066 1168572 1318398 1479665 1650475 1834337 2035370 2270262 2549033 2878354 3266815 3723710 4235930
-7055 4235930 4806032 5488690 6403601 7713400 9633407 12440477 16477030 22133184 29721223 38993729
-7045 38993729 48086433 53369550 51975631 44799611 35441706 26841143 20154560 15358469 11991683
-7036 11991683 9599713 7876255 6635437 5756592 5161992 4777916 4529288 4339316 4124548 3825244
-7026 3825244 3451544 3065442 2715588 2420333 2172770 1962884 1785427 1639566 1514689 1402927 1296888
-7015 1296888 1191237 1091308 1005926 933897 877248 837769 805920 779794 758094 730672 696334 661996 626109
-7002 626109 590221 557791 531083 505867 480650 464494 461692 467475 473258 468906 451200 423703 390487 363467
-6988 363467 342173 328984 321521 317869 314222 309676 305134 295581 280309 263840 253099 253322 259272 272618 280245
$$ packed form
-7066A168572J49826J61267J70810J83862K01033K34892K78771L29321L88461M56895N12220
-7055D235930N70102O82658R14911J309799J920007K807070M036553N656154P588039R272506
-7045C8993729R092704N283117j393919p176020r357905q600563o686583m796091l366786
-7036A1991683k391970j723458j240818q78845n94600l84076k48628j89972k14768k99304
-7026C825244l73700l86102l49854k95255k47563k09886j77457j45861j24877j11762j06039
-7015A296888j05651r9929q5382p2029n6649l9479l1849k6126k1700k7422l4338l4338l5887
-7002F26109l5888l2430k6708k5216k5217j6156k802N783N783m352j7706k7497l3216k7020
-6988C63467k1294j3189p463l652l647m546m542r553j5272j6469j0741K23N950J3346P627
$$ plain form
-6973 280245 272846 252096 221089 184363 150495 126169 119216 129436 148714 173718 201938 220624 220825 211491
-6959 211491 191506 171524 169303 191886 237357 296185 352863 388561 405446 401352 384853 374082 366287 364219
-6945 364219 367632 380587 398755 407388 411128 405335 388985 372640 356052 339468 330958 328175 334927 351220 368165
-6930 368165 385114 398125 405417 415436 438808 472196 518937 574740 624819 659161 680149 704058 733690 776914
-6916 776914 848753 940145 1037261 1118638 1175215 1210853 1236953 1264722 1309660 1372244 1448182 1523880 1586226
-6903 1586226 1648631 1735835 1872639 2072395 2333554 2650035 3023268 3440378 3896807 4397116 4948689
-6892 4948689 5567034 6274320 7090346 8025357 9084371 10262847 11572956 13112934 15112660 17940424
-6882 17940424 22090197 28208907 37171936 50074380 68075987 91653915 118266926 139929455 146389860
$$ packed form
-6973B80245p399k0750l1007l6726l3868k4326o953J0220J9278K5004K8220J8686K01r334
-6959B11491j9985j9982k221K2583M5471N8828N6678L5698J6885m094j6499j0771p795k068
-6945C64219L413J2955J8168Q633L740n793j6350j6345j6588j6584q510k783O752J6293J6945
-6930C68165J6949J3011P292J0019K3372L3388M6741N5803N0079L4342K0988K3909K9632M3224
-6916G76914P1839R1392R7116Q1377N6577L5638K6100K7769M4938O2584P5938P5698O2346
-6903A586226O2405Q7204J36804J99756K61159L16481L73233M17110M56429N00309N51573
-6892D948689O18345P07286Q16026R35011J059014J178476J310109J539978J999726K827764
-6882A7940424M149773O118710Q963029J2902444J8001607K3577928K6613011K1662529O460405
$$ plain form
-6873 146389860 134163592 110130844 84323763 62745954 46850102 35748189 28005060 22472907
-6865 22472907 18435874 15488118 13384831 11932054 10905877 10106710 9389573 8678159 7942185 7192856
-6855 7192856 6471814 5809910 5227173 4726466 4302065 3940616 3630316 3360078 3100293 2840510 2583944
-6844 2583944 2352179 2152606 1989278 1847172 1710790 1568625 1432183 1310286 1213190 1145423 1106271 1079996
-6832 1079996 1059445 1031620 990445 937582 879000 825541 789254 766914 757931 744353 730780 711122 685745
-6819 685745 662034 644049 626418 608791 582449 542757 498888 464561 429039 399243 373497 347755 322754
-6806 322754 297757 278122 264213 250181 236153 216041 186394 158554 140256 134354 149441 179188 218478 255379
-6792 255379 278930 276844 257592 234044 216223 206387 206093 211875 223385 231589 239797 237509 225687 204681 183678
$$ packed form
-6873A46389860j2226268k4032748k5807081k1577809j5895852j1101913p743129n532153
-6865B2472907m037033k947756k103287j452777j026177p99167p17137p11414p35974p49329
-6855G192856p21042o61904n82737n00707m24401l61449l10300k70238k59785k59783k56566
-6844B583944k31765j99573j63328j42106j36382j42165j36442j21897r7096o7767l9152k6275
-6832A079996k0551k7825m1175n2863n8582n3459l6287k2340q983j3578j3573j9658k5377
-6819F85745k3711j7985j7631j7627k6342l9692m3869l4327l5522k9796k5746k5742k5001
-6806C22754k4997j9635j3909j4032j4028k0112k9647k7840j8298n902J5087K9747L9290L6901
-6792B55379K3551k086j9252k3548j7821r836k94N782J1510Q204Q208k288j1822k1006k1003
$$ plain form
-6777 183678 167679 151684 142063 145800 164318 192378 219837 247301 277265 328216 407570 538431 737252
-6764 737252 1021917 1394693 1826605 2196758 2317007 2098737 1668717 1216521 850169 594580 428651
-6753 428651 323291 254175 205634 174262 150402 132264 115736 99208 87807 76406 65869 55332 44795
-6740 44795 34258 27567 20875 15614 10353 2096 -6159 -14058 -27680 -45087 -62495 -78114 -88009 -90662 -83777 -73315
-6724 -73315 -62852 -48694 -34535 -27054 -19572 -17225 -14878 -15034 -15191 -14036 -7158 -2545 7790 12253 7179 -4572
-6708 -4572 -16323 -29744 -43165 -56347 -63806 -57647 -41950 -19457 3035 28032 43491 47742 42455 32995 23535
-6693 23535 20156 16776 8986 1195 -7787 -22493 -37103 -45989 -53087 -54462 -52617 -50773 -45709 -40646 -38086 -35527
-6677 -35527 -37736 -39945 -40247 -40549 -45024 -49499 -43012 -26983 -3085 20812 33498 29020 8803 -11413 -27579 -38019
$$ packed form
-6777A83678j5999j5995r621L737J8518K8060K7459K7464K9964N0951P9354J30861J98821
-6764G37252K84665L72776M31912L70153J20249k18270m30020m52196l66352k55589j65929
-6753D28651j05360o9116m8541l1372k3860j8138j6528j6528j1401j1401j0537j0537j0537
-6740D4795j0537o691o692n261n261q257q255p899j3622j7407j7408j5619r895k653O885J0462
-6724g3315J0463J4158J4159P481P482K347K347j56j57J155O878M613J0335M463n074j1751
-6708d572j1751j3421j3421j3182p459O159J5697K2493K2492K4997J5459M251n287r460r460
-6693B3535l379l380p790p791q982j4706j4610q886p098j375J845J844N064N063K560K559
-6677c5527k209k209l02l02m475m475O487J6029K3898K3897J2686m478k0217k0216j6166j0440
$$ plain form
-6661 -38019 -42140 -40538 -37270 -28276 -9982 17850 52795 78205 89905 80620 59766 38916 16754 315 -14725
-6646 -14725 -24040 -29539 -35038 -38872 -42703 -37352 -26279 -17352 -8424 -2001 4421 3602 2782 532 -1718 -11897 -22076
-6629 -22076 -27486 -32896 -36756 -40616 -47695 -49052 -45527 -42002 -39551 -37099 -35512 -33924 -37106 -40288 -43947 -47606 -48403
-6612 -48403 -49201 -52025 -54849 -54812 -54775 -54931 -55088 -50833 -46574 -45300 -49748 -57058 -58642 -60289 -61936 -58456 -54972 -52446 -49920
-6593 -49920 -40717 -31510 -27739 -23969 -14118 -9986 -7109 -4233 -1714 807 15338 29869 48812 67758 84644 95806
-6577 95806 101008 100490 92058 83630 76271 68917 58547 48182 31136 14094 2830 -8428 -14565 -20698 -28503 -30582
-6561 -30582 -27300 -24014 -20008 -15999 -13902 -17523 -25679 -39554 -49499 -46086 -36238 -26387 -22382 -18373 -17944 -17512 -21853
-6544 -21853 -26189 -27866 -29539 -28712 -27881 -25087 -28011 -27721 -27426 -28865 -30299 -40322 -50341 -57204 -64063 -64011 -58232 -50110
$$ packed form
-6661c8019m121J602L268Q994J8294K7832L4945K5410J1700r285k0854k0850k2162j6439j5040
-6646a4725r315n499n499l834l831N351J1073Q927Q928O423O422q19q20k250k250j0179j0179
-6629b2076n410n410l860l860p079j357L525L525K451K452J587J588l182l182l659l659p97
-6612d8403p98k824k824L7L7j56j57M255M259J274m448p310j584j647j647L480L484K526K526
-6593d9920R203R207L771L770R851M132K877K876K519K521J4531J4531J8943J8946J6886J1162
-6577I5806N202n18q432q428p359p354j0370j0365j7046j7042j1264j1258o137o133p805k079
-6561c0582L282L286M006M009K097l621q156j3875r945L413R848R851M005M009M29M32m341
-6544b1853m336j677j673Q27Q31K794k924K90K95j439j434j0023j0019o863o859N2N779Q122
$$ plain form
-6526 -50110 -47707 -52580 -57450 -65304 -78877 -86374 -93867 -98323 -102775 -100555 -98330 -98196 -98058 -95063 -92063 -85625 -79183
-6509 -79183 -75964 -67018 -60401 -53780 -46805 -39826 -41168 -42505 -43250 -43992 -33649 -13764 13986 41740 59043 59181
-6493 59181 51088 33461 15115 6310 -2377 -16785 -33090 -49391 -62595 -75796 -75230 -65121 -52394 -45385 -43112
-6478 -43112 -40840 -38925 -37009 -32293 -27576 -24409 -26964 -27598 -28231 -26361 -24490 -24587 -24684 -20370 -16055 -12441 -14550 -13440
-6460 -13440 -12329 -4781 2767 10316 17864 19332 20800 30495 40190 46487 47061 48350 49639 60496 77080 97714
-6444 97714 124075 156035 188000 213641 239287 270532 301781 344949 397659 465269 550052 665115 816427
-6431 816427 1015561 1270021 1570499 1911041 2275665 2626938 2930277 3151591 3265388 3255190 3128144
-6420 3128144 2911443 2636196 2328524 2025616 1755143 1539660 1383318 1285155 1234688 1218316 1215302 1208946
$$ packed form
-6526e0110K403m873m870p854j3573p497p493m456m452K220K225J34J38K995L000O438O442
-6509g9183L219Q946O617O621O975O979j342j337p45p42J0343J9885K7750K7754J7303J38
-6493E9181q093j7627j8346q805q687j4408j6305j6301j3204j3201N66J0109J2727P009K273
-6478d3112K272J915J916M716M717L167k555o34o33J870J871r7r7M314M315L614k109J110
-6460a3440J111P548P548P549P548J468J468R695R695O297N74J289J289J0857J6584K0634
-6444I7714K6361L1960L1965K5641K5646L1245L1249M3168N2710O7610Q4783J15063J51312
-6431H16427J99134K54460L00478L40542L64624L51273L03339K21314J13797j0198j27046
-6420C128144k16701k75247l07672l02908k70473k15483j56342r8163n0467j6372l014o356
$$ plain form
-6408 1208946 1193055 1165893 1117751 1053032 974964 890334 805708 731689 674843 637174 616678 616924 630527 654261
-6394 654261 672276 686233 686841 666132 624443 568204 498616 431766 370643 311901 262700 228161 214610 216674
-6380 216674 218742 223072 214051 197873 172161 145998 119838 95464 76815 64006 64554 68078 71607 74945 72564
-6365 72564 64814 57068 45265 33465 19157 4854 -8171 -15470 -19315 -23157 -26406 -29651 -28131 -26607 -21182 -15757
-6349 -15757 -16294 -22553 -27441 -41868 -54506 -61422 -57249 -53076 -41868 -30661 -15340 -19 19236 38491 59185
-6334 59185 66525 66472 60697 62970 65243 65489 52381 28096 -5727 -37643 -63836 -75781 -78188 -71891 -65595 -53612
-6318 -53612 -51164 -54204 -57241 -63143 -74764 -87581 -100394 -112138 -118156 -111777 -105394 -104262 -112664 -124527 -142109
-6303 -142109 -148712 -149587 -143194 -136796 -121341 -100160 -76597 -53031 -35400 -34934 -44249 -53560 -60490 -57878 -43109 -28336
$$ packed form
-6408A208946j5891k7162m8142o4719p8068q4630q4626p4019n6846l7669k0496K46J3603K3734
-6394F54261J8015J3957O08k0709m1689n6239o9588o6850o1123n8742m9201l4539j3551K064
-6380B16674K068M330r021j6178k5712k6163k6160k4374j8649j2809N48L524L529L338k381
-6365G2564p750p746j1803j1800j4308j4303j3025p299l845l842l249l245J520J524N425N425
-6349a5757n37o259m888j4427j2638o916M173M173J1208J1207J5321J5321J9255J9255K0694
-6334E9185P340n3n775K273K273K46j3108k4285l3823l1916k6193j1945k407O297O296J1983
-6318e3612K448l040l037n902j1621j2817j2813j1744o018O379O383J132q402j1863j7582
-6303a42109o603q75O393O398J5455K1181K3563K3566J7631M66r315r311o930K612J4769J4773
$$ plain form
-6287 -28336 -22546 -26294 -32904 -39513 -36257 -27277 -23067 -24580 -20250 -15921 -13738 -11554 -2664 502 2119 -5801 -12188
-6270 -12188 -12851 -5526 1798 9958 8580 3624 -10869 -26406 -41943 -52949 -63955 -72577 -75476 -69194 -62912 -58076
-6254 -58076 -53236 -43273 -23768 4794 33360 59658 85959 107696 129436 166077 202721 226842 229983 224774
-6240 224774 206216 191357 176502 166173 161572 164478 167388 171248 165574 160730 155890 153192 137145 110244 83347
-6225 83347 68011 62217 57620 47303 28517 -7433 -43031 -78624 -105041 -125730 -130477 -118051 -99072 -89627
-6211 -89627 -81616 -73601 -56172 -29200 5770 27392 35536 22701 -2895 -28488 -40374 -42718 -22978 2488
-6197 2488 27831 43640 56942 70247 86171 111638 142477 173320 193786 193272 173320 140018 114820 102979
-6183 102979 103266 116910 135677 154448 168595 173208 172452 165976 168729 177210 183898 190589 202613 220363 248840
$$ packed form
-6287b8336N790l748o610o609L256Q980M210j513M330M329K183K184Q890L166J617p920o387
-6270a2188o63P325P324Q160j378m956j4493j5537j5537j1006j1006q622k899O282O282M836
-6254e8076M840R963J9505K8562K8566K6298K6301K1737K1740L6641L6644K4121L141n209
-6240B24774j8558j4859j4855j0329m601K906K910L860n674m844m840k698j6047k6901k6897
-6225H3347j5336n794m597j0317j8786l5950l5598l5593k6417k0689m747J2426J8979R445
-6211h9627Q011Q015J7429K6972L4970K1622Q144j2835k5596k5593j1886k344J9740K5466
-6197B488K5343J5809J3302J3305J5924K5467L0839L0843K0466n14j9952l3302k5198j1841
-6183A02979K87J3644J8767J8771J4147M613p56o476K753Q481O688O691J2024J7750K8477
$$ plain form
-6168 248840 277321 307973 332907 340310 330549 307400 270901 234160 214591 231798 273807 324159 353530 325817
-6154 325817 219893 74859 -37740 -68374 -32237 42526 134462 227230 302832 368653 421125 467438 508031
-6141 508031 532168 527693 487297 422105 365017 336547 350013 388281 426069 439061 427757 403103 389175 396236
-6127 396236 437415 514839 632562 767454 902942 998370 1025718 993928 946669 899410 862762 826114 793997
-6114 793997 761880 730478 716245 735203 782775 850616 908919 942928 952139 957892 963644 960664 948145 936937
-6100 936937 939083 964211 1021768 1121533 1257543 1399398 1493563 1502360 1413866 1277323 1135058 1027368 959740
-6087 959740 921769 912413 941211 1010069 1101104 1174969 1209490 1219211 1246078 1309191 1419280 1546538 1643988
-6074 1643988 1670856 1610448 1471826 1279164 1065518 895748 827083 847959 920342 1033024 1162875 1272342
$$ packed form
-6168B48840K8481L0652K4934P403r761k3149l6499l6741j9569J7207M2009N0352K9371k7713
-6154C25817j05924j45034j12599l0634L6137P4763R1936R2768P5602O5821N2472M6313M0593
-6141E08031K4137m475m0396o5192n7088k8470J3466L8268L7788J2992j1304k4654j3928P061
-6127C96236M1179P7424J17723J34892J35488R5428K7348l1790m7259m7259l6648l6648l2117
-6114G93997l2117l1402j4233J8958M7572O7841N8303L4009R211N753N752k980j2519j1208
-6100I36937K146K5128N7557R9765J36010J41855R4165Q797q8494j36543j42265j07690o7628
-6087I59740l7971r356K8798O8858R1035P3865L4521R721K6867O3113J10089J27258R7450
-6074A643988K6868o0408j38622j92662k13646j69770o8665K0876P2383J12682J29851J09467
$$ plain form
-6062 1272342 1337936 1339620 1266909 1124327 968395 920003 1068103 1382345 1767174 2116469 2360846 2474187
-6050 2474187 2474981 2408168 2341360 2329459 2388145 2505608 2651689 2763786 2801488 2774446 2711161 2623283 2535407
-6037 2535407 2447648 2350353 2236722 2151708 2150151 2245887 2389241 2523060 2614907 2693404 2790855 2936000 3159118
-6024 3159118 3479530 3841906 4160410 4369936 4493620 4597628 4760778 5032659 5478142 6077939 6706355
-6013 6706355 7204570 7525377 7705848 7815739 7937550 8179546 8553673 8994573 9408524 9732817 9987359
-6002 9987359 10384979 11149102 12380607 14021936 16016185 18271778 20746758 23398668 26292854 29533036
-5992 29533036 33267305 37538635 42445222 48140379 54707339 61825487 69189731 77333963 88135555
-5983 88135555 104322412 129297828 167502146 225399172 311559242 436091738 606942362 807298738
$$ packed form
-6062A272342O5594J684p2711j42582j55932m8392J48100L14242L84829L49295K44377J13341
-6050B474187P94o6813o6808j1901N8686J17463J46081J12097L7702k7042o3285q7878q7876
-6037B535407q7759r7295j13631q5014j557R5736J43354J33819R1847P8497R7451J45145K23118
-6024C159118L20412L62376L18504K09526J23684J04008J63150K71881M45483N99797O28416
-6013F706355M98215L20807J80471J09891J21811K41996L74127M40900M13951L24293K54542
-6002I987359L97620P64123J231505J641329J994249K255593K474980K651910K894186L240182
-5992B9533036L734269M271330M906587N695157O566960P118148P364244Q144232J0801592
-5983H8135555J6186857K4975416L8204318N7897026Q6160070J24532496J70850624K00356376
$$ plain form
-5975 807298738 966856665 1000000000 889359930 704063807 521401084 378247818 279214582 213960155
-5967 213960155 170964449 142327680 124250264 115194151 115090540 124176110 142226958 164644414 179575429
-5958 179575429 174809897 151739703 123223143 98677607 80673427 68386966 60261098 55260732 53032191
-5949 53032191 53712349 57839642 66398652 80838974 103135020 134334086 168222806 188099785 179701043
-5940 179701043 148786205 113164956 83795095 63222869 49928340 41733889 36963682 34789316 34856450
-5931 34856450 37261770 41969632 47539278 50466821 48017065 41406717 33992530 27625645 22720500
-5922 22720500 19057241 16325869 14233566 12659709 11492186 10658738 10014152 9445630 8821789 8136422
-5912 8136422 7426261 6760567 6138753 5591096 5098764 4671766 4319170 4079838 3907277 3771177 3625543
$$ packed form
-5975H07298738J59557927L3143335j10640070j85296123j82662723j43153266r9033236o5254427
-5967B13960155m2995706k8636769j8077416r056113j03611R085570J8050848K2417456J4931015
-5958A79575429m765532k3070194k8516560k4545536j8004180j2286461q125868n000366k228541
-5949E3032191O80158M127293Q559010J4440322K2296046L1199066L3888720J9876979q398742
-5940A79701043l0914838l5621249k9369861k0572226j3294529q194451m770207k174366O7134
-5931C4856450K405320M707862N569646K927543k449756o610348p414187o366885m905145
-5922B2720500l663259k731372k092303j573857j167523q33448o44586n68522o23841o85367
-5912H136422p10161o65694o21814n47657m92332m26998l52596k39332j72561j36100j45634
$$ plain form
-5901 3625543 3451529 3203120 2919059 2655985 2497351 2470350 2586717 2785117 2979697 3061731 3003905 2829716
-5889 2829716 2637400 2473703 2372158 2325938 2322697 2316597 2297200 2233931 2131968 1982318 1810189 1617080
-5877 1617080 1412998 1184120 997207 896142 896180 943912 997744 1011515 986179 932228 898486 900990 947072
-5864 947072 996015 1028892 1025524 996939 913032 773326 578298 373493 208749 126251 125781 202095 307023
-5851 307023 408494 481350 522253 515465 479227 422004 372413 332359 287060 232222 199800 192176 219197 259570
-5837 259570 291121 290242 267782 228154 183279 121236 47955 -34863 -107667 -159487 -161708 -112422 -19736 78671
-5823 78671 174516 253192 313506 341391 346145 322285 289601 262641 262119 267320 258691 229078 188257 134082 100415
-5808 100415 91548 109499 136989 179203 227140 280026 330049 392175 454300 506142 521739 483563 378620
$$ packed form
-5901C625543j74014k48409k84061k63074j58634k7001J16367J98400J94580Q2034n7826j74189
-5889B829716j92316j63697j01545m6220l241o100j9397o3269j01963j49650j72129j93109
-5877A617080k04082k28878j86913j01065L8M7732N3832J3771k5336n3951l3742K504M6082
-5864I47072M8943L2877l368k8585q3907j39706j95028k04805j64744q2498m70P6314J04928
-5851C07023J01471P2856M0903o788l6238n7223m9591m0054m5299n4838l2422p624K7021M0373
-5837B59570L1551q79k2460l9628m4875o2043p3281q2818p2804n1820k221M9286R2686R8407
-5823G8671R5845P8676O0314K7885M754k3860l2684k6960n22N201q629k9613m0821n4175l3667
-5808A00415q867J7951K7490M2214M7937N2886N0023O2126O2125N1842J5597l8176j04943
$$ plain form
-5795 378620 271650 223817 245375 299363 359678 391377 389872 352121 290346 225709 175678 142816 126347
-5782 126347 127048 140804 151698 163487 175276 187243 193488 204889 216290 219226 204994 193384 187497 197586
-5768 197586 213399 225844 232565 232968 208570 168554 128538 111772 108359 119879 144753 180239 215724 242506
-5754 242506 255934 272104 288275 311152 334029 345936 340676 321256 292299 264056 241537 235851 247335 271456
-5740 271456 295577 309058 322538 329341 336145 350430 364715 368031 350363 318626 273535 230948 188361 156982
-5726 156982 142771 143703 138911 124522 104409 89066 79446 85802 97882 107099 116317 128337 140357 141527 142697
-5711 142697 136832 125248 114376 103508 94782 91782 97721 113202 134313 145890 152932 159977 168390 176807 188082
-5696 188082 193637 196543 193730 190556 187385 182631 172157 163111 154068 140580 121373 99540 77710 70034 75716
$$ packed form
-5795C78620j06970m7833K1558N3988O0315L1699j505l7751o1775o4637n0031l2862j6469
-5782A26347P01J3756J0894J1789J1789J1967O245J1401J1401K936j4232j1610n887J0089
-5768A97586J5813J2445O721M03k4398m0016m0016j6766l413J1520K4874L5486L5485K6782
-5754B42506J3428J6170J6171K2877K2877J1907n260j9420k8957k8243k2519n686J1484K4121
-5740B71456K4121J3481J3480O803O804J4285J4285L316j7668l1737m5091m2587m2587l1379
-5726A56982j4211R32m792j4389k0113j5343r620O356J2080R217R218J2020J2020J170J170
-5711A42697n865j1584j0872j0868q726l000N939J5481K1111J1577P042P045Q413Q417J1275
-5696A88082N555K906k813l174l171m754j0474r046r043j3488j9207k1833k1830p676N682
$$ plain form
-5681 75716 87594 99476 104581 100151 92498 84848 85899 86954 94323 101697 108836 110255 106306 102360 103120 103884 107863
-5664 107863 106123 104700 103280 104719 115699 136035 156374 168960 168197 165603 168737 183670 198607 211991 219655
-5649 219655 226719 228064 224227 214670 202963 185537 167451 155093 151672 151117 154731 155488 152961 147578 142548 137521
-5633 137521 130047 122577 113657 114279 125151 136027 147376 149191 138304 114067 81123 51043 28293 15085 16776
-5618 16776 31825 45499 49639 43212 39646 44605 55287 72169 83328 87572 91816 99726 107636 110062 102949 92617
-5602 92617 76562 62773 54706 45492 36278 34694 38834 45000 51166 51014 50861 45850 40838 32965 25093 15551 6009
-5585 6009 -492 -6994 -10477 -11100 -4568 11501 28763 43163 54285 55869 52772 43953 31140 15465 1757 -6226
-5569 -6226 -6521 -1092 11527 24146 30447 36747 35536 34325 30253 26181 18144 10107 7436 4764 602 5979 12369
$$ packed form
-5681G5716J1878J1882N105m430p653p650J051J055P369P374P139J419l949l946P60P64L979
-5664A07863j740j423j420J439J0980K0336K0339J2586p63k594L134J4933J4937J3384P664
-5649B19655P064J345l837r557j1707j7426j8086j2358l421n55L614P57k527n383n030n027
-5633A37521p474p470q920O22J0872J0876J1349J815j0887k4237l2944l0080k2750j3208J691
-5618A6776J5049J3674M140o427l566M959J0682J6882J1159M244M244P910P910K426p113j0332
-5602I2617j6055j3789q067r214r214j584M140O166O166j52j53n011n012p873p872r542r542
-5585F009o501o502l483o23O532J6069J7262J4400J1122J584l097q819j2813j5675j3708p983
-5569f226k95N429J2619J2619O301O300j211j211m072m072q037q037k671k672m162N377O390
$$ plain form
-5552 12369 15897 23554 31214 35831 40451 49210 57974 68164 78358 83809 89264 89707 84431 78585 78466 83351 97777
-5535 97777 118586 133676 148285 165760 181919 200944 227714 260211 288502 316796 351168 402712 469394 553249
-5521 553249 663330 809661 993001 1220220 1485589 1794838 2137944 2486777 2804607 3063303 3226433
-5510 3226433 3269385 3183806 2985678 2704324 2375284 2039085 1723875 1441128 1206077 1027059 895736
-5499 895736 803755 751839 726804 718943 713730 705660 686677 658159 624808 578108 527112 481842 438365 404429
-5485 404429 388136 389015 400383 425108 457937 496492 535610 569009 592866 599558 590746 568585 529489 473228
-5471 473228 415845 364190 321353 288059 264835 247338 226857 206380 185213 158327 130185 104909 78734
-5458 78734 52564 22693 -4311 -34345 -54838 -57211 -38597 -15157 5424 16404 14034 5431 -3167 -8968 -9043
$$ packed form
-5552A2369L528P657P660M617M620Q759Q764J0190J0194N451N455M43n276n846j19M885J4426
-5535I7777K0809J5090J4609J7475J6159J9025K6770L2497K8291K8294L4372N1544O6682Q3855
-5521E53249J10081J46331J83340K27219K65369L09249L43106L48833L17830K58696J63130
-5510C226433M2952q5579j98128k81354l29040l36199l15210k82747k35051j79018j31323
-5499H95736r1981n1916k5035p861n213q070j8983k8518l3351m6700n0996m5270m3477l3936
-5485D04429j6293Q79J1368K4725L2829L8555L9118L3399K3857O692q812k2161l9096n6261
-5471D73228n7383n1655m2837l3294k3224j7497k0481k0477k1167k6886k8142k5276k6175
-5458G8734k6170k9871k7004l0034k0493k373J8614K3440K0581J0980k370q603q598n801p5
$$ plain form
-5443 -9043 -6915 -1923 -868 189 -1327 21 -421 4861 9783 17570 21061 15018 7093 2033 -2374 -6778 -13868
-5426 -13868 -20955 -29297 -34774 -36302 -32102 -25999 -19893 -13432 -4106 -7482 -16577 -23529 -30478 -34927 -39372 -39886 -40396
-5409 -40396 -40910 -41421 -41548 -41671 -41797 -41920 -44491 -47058 -49629 -52196 -48761 -45322 -39025 -32725 -37218 -41708 -52282 -62852
-5391 -62852 -69566 -66742 -60579 -51555 -46168 -43642 -42487 -44193 -42129 -40065 -44499 -48932 -53426 -52196 -45601 -39007 -37822
-5374 -37822 -36637 -35452 -34267 -34871 -35474 -33217 -30959 -31473 -31987 -32680 -33373 -31741 -32971 -35810 -32926 -31231 -29532 -28015
-5356 -28015 -20772 -14963 -12012 -11748 -8618 -13704 -21648 -29595 -34677 -35173 -38526 -45460 -42852 -40210 -37565 -37188 -36808 -34822
-5338 -34822 -32833 -31205 -29573 -35143 -46432 -56116 -62934 -69339 -75740 -78151 -74835 -69797 -59033 -52565 -48955 -45706
-5322 -45706 -45314 -48265 -51213 -55445 -59674 -61045 -62413 -64141 -65867 -70457 -69320 -64447 -53847 -46112 -38373 -36719 -35061
$$ packed form
-5443i043K128M992J055J057j516J348m42N282M922P787L491o043p925n060m407m404p090
-5426a3868p087q342n477j528M200O103O106O461R326l376r095o952o949m449m445n14n10
-5409d0396n14n11j27j23j26j23k571k567k571k567L435L439O297O300m493m490j0574j0570
-5391f2852o714K824O163R024N387K526J155j706K064K064m434m433m494J230O595O594J185
-5374c7822J185J185J185o04o03K257K258n14n14o93o93J632j230k839K884J695J699J517
-5356b8015P243N809K951K64L130n086p944p947n082m96l353o934K608K642K645L77L80J986
-5338c4822J989J628J632n570j1289r684o818o405o401k411L316N038J0764O468L610L249
-5322d5706L92k951k948m232m229j371j368j728j726m590J137M873J0600P735P739J654J658
$$ plain form
-5305 -35061 -33407 -31749 -33790 -35828 -37870 -39908 -45348 -50784 -56224 -55937 -50344 -39029 -27356 -21405 -23563 -25720 -28235
-5288 -28235 -30750 -30582 -30415 -33108 -35802 -35933 -36063 -31424 -26786 -21759 -16733 -15165 -19319 -25798 -32278 -38757 -45236 -50285
-5270 -50285 -49610 -55136 -63523 -66604 -66824 -69190 -65833 -63456 -61075 -63527 -71698 -80289 -86016 -90375 -91869 -90774 -86813
-5253 -86813 -83691 -80565 -77324 -64540 -50031 -29796 -8134 10670 18680 17157 6627 -3898 -15023 -26145 -28954
-5238 -28954 -31760 -34569 -37375 -37203 -37028 -35486 -28216 -26432 -27508 -29479 -31450 -32229 -33008 -36648 -40288 -41276 -42263 -43250 -44238
-5219 -44238 -50292 -56347 -58944 -55818 -47632 -39446 -35672 -31898 -32117 -32337 -28980 -31346 -32356 -27643 -27698 -33477 -40150 -41101
-5201 -41101 -35553 -35728 -37591 -36592 -34699 -32807 -25429 -18052 -11033 -4013 -3506 -8723 -17396 -26070 -27471 -28872 -30631 -32389
-5183 -32389 -30921 -35176 -40683 -43329 -48895 -54462 -53172 -51883 -51846 -51809 -51771 -51734 -50624 -49514 -52874 -59097 -66649 -64659 -62137
$$ packed form
-5305c5061J654J658k041k038k042k038n440n436n440K87N593J1315J1673N951k158k157k515
-5288b8235k515J68J67k693k694j31j30M639M638N027N026J568m154o479o480o479o479n049
-5270e0285O75n526q387l081k20k366L357K377K381k452q171q591n727m359j494J095L961
-5253h6813L122L126L241J2784J4509K0235K1662J8804Q010j523j0530j0525j1125j1122k809
-5238b8954k806k809k806J72J75J542P270J784j076j971j971p79p79l640l640r88r87r87r88
-5219d4238o054o055k597L126Q186Q186L774L774k19k20L357k366j010M713n5n779o673r51
-5201d1101N548j75j863R99J893J892P378P377P019P020N07n217q673q674j401j401j759j758
-5183c2389J468m255n507k646n566n567J290J289L7L7L8L7J110J110l360o223p552J990K522
$$ plain form
-5164 -62137 -65334 -63646 -61954 -57763 -53567 -54771 -55971 -56280 -53724 -49741 -51477 -55900 -54596 -53780 -52960 -51786 -50609 -54443
-5146 -54443 -58273 -62107 -65937 -65956 -65971 -63128 -60281 -55710 -51134 -58962 -66787 -76124 -85461 -87942 -90424 -88077 -82868 -78076
-5128 -78076 -79962 -82592 -80453 -79805 -82018 -86795 -91571 -89850 -88129 -85666 -83203 -75196 -71958 -71940 -71921 -72201 -72480 -69093 -65706
-5109 -65706 -65181 -64656 -60196 -55736 -54137 -52539 -55814 -59085 -62360 -65632 -72305 -78974 -80878 -82778 -85144 -87506 -87011 -86512
-5091 -86512 -83453 -80390 -82100 -83807 -82495 -81180 -79868 -78553 -77540 -76523 -75509 -74492 -75878 -77260 -78646 -80029 -75990
-5074 -75990 -71947 -69697 -72212 -76370 -75759 -73240 -67860 -62539 -60080 -60602 -61123 -63568 -66012 -71317 -76623 -75789 -74954 -74119
-5056 -74119 -73285 -72323 -71362 -65632 -59901 -55542 -51183 -49685 -48187 -48016 -47844 -52442 -57040 -60147 -63255 -66362 -69469 -67700
-5038 -67700 -65926 -68925 -71921 -70092 -68259 -66727 -65192 -64078 -67729 -68702 -69671 -72253 -74831 -74552 -74268 -72990 -71709 -76809
$$ packed form
-5164f2137l197J688J692M191M196j204j200l09K556L983j736m423J304Q16Q20J174J177l834
-5146e4443l830l834l830j9j5K843K847M571M576p828p825r337r337k481k482K347N209M792
-5128g8076j886k630K139O48k213m777m776J721J721K463K463Q007L238J8J9k80k79L387L387
-5109f5706N25N25M460M460J599J598l275l271l275l272o673o669j904j900k366k362M95M99
-5091h6512L059L063j710j707J312J315J312J315J013J017J014J017j386j382j386j383M039
-5074g5990M043K250k515m158O11K519N380N321K459n22n21k445k444n305n306Q34Q35Q35
-5056g4119Q34R62R61N730N731M359M359J498J498J71J72m598m598l107l108l107l107J769
-5038f7700J774k999k996J829J833J532J535J114l651r73r69k582k578K79K84J278J281n100
$$ plain form
-5020 -76809 -81906 -81225 -75770 -71392 -69872 -71202 -72528 -71176 -69820 -72253 -74682 -76459 -71556 -70923 -76008 -76031 -76049 -76310 -76567
-5001 -76567 -73967 -71362 -72726 -74086 -74019 -73948 -71616 -69279 -69808 -70334 -68911 -67484 -64630 -61772 -59007 -56239 -54905 -53567
-4983 -53567 -55140 -56708 -56850 -56988 -59037 -61082 -65636 -70185 -73844 -71779 -69715 -73374 -73754 -74134 -72010 -69887 -68508 -67130
-4965 -67130 -68612 -70095 -72890 -75684 -78121 -80558 -80677 -75073 -69469 -69589 -68098 -66608 -65475 -64343 -66295 -68247 -67696 -67144
-4947 -67144 -64805 -68188 -71571 -69231 -63616 -57997 -51667 -51056 -52178 -53295 -57994 -62688 -64212 -71455 -75841 -74499 -68273
-4930 -68273 -62044 -60229 -58411 -61865 -65315 -65907 -66496 -65896 -65293 -61831 -58366 -55948 -53526 -55877 -58225 -54286 -50344 -44975
-4912 -44975 -39603 -34737 -29867 -30128 -30385 -29066 -33466 -41328 -49186 -52576 -55963 -56492 -57018 -57249 -57476 -57707 -57934 -59704 -61470
-4893 -61470 -60736 -59998 -57297 -60315 -64887 -69455 -68721 -67983 -70110 -72234 -79906 -87574 -88568 -89559 -86173 -82786 -79399 -76012
$$ packed form
-5020g6809n097O81N455M378J520j330j326J352J356k433k429j777M903O33n085k3j8k61k57
-5001g6567K600K605j364j360O7P1K332K337n29n26J423J427K854K858K765K768J334J338
-4983e3567j573j568j42j38k049k045m554m549l659K065K064l659l80l80K124K123J379J378
-4965f7130j482j483k795k794k437k437j19N604N604j20J491J490J133J132j952j952N51N52
-4947f7144K339l383l383K340N615N619O330O11j122j117m699m694j524p243m386J342O226
-4930f8273O229J815J818l454l450n92n89O00O03L462L465K418K422k351k348L939L942N369
-4912d4975N372M866M870k61k57J319m400p862p858l390l387n29n26k31k27k31k27j770j766
-4893f1470P34P38K701l018m572m568P34P38k127k124p672p668r94r91L386L387L387L387
$$ plain form
-4875 -76012 -75368 -74723 -75628 -82257 -82894 -83531 -84526 -85521 -81180 -76839 -70710 -70304 -66973 -63642 -57807 -51973 -44975 -37978 -33842
-4856 -33842 -29707 -26644 -23581 -27195 -30810 -38835 -46861 -53336 -54089 -54152 -54212 -53560 -58627 -61433 -64235 -65967 -67696 -71858
-4838 -71858 -76016 -78747 -81474 -78154 -74831 -70080 -65326 -66567 -67804 -66183 -64559 -64637 -64711 -64790 -64864 -63549 -62230 -63776 -65319
-4819 -65319 -65792 -66261 -66735 -67204 -64525 -61843 -58806 -61489 -62893 -64294 -67487 -70677 -75069 -79459 -80990 -82518 -86225 -89928
-4801 -89928 -86959 -83986 -78609 -73229 -72979 -72726 -71612 -76217 -79038 -81854 -79310 -76761 -75409 -79775 -82357 -79213 -76787
-4784 -76787 -74358 -74742 -75125 -74078 -73031 -73147 -73262 -73378 -73493 -75695 -77897 -77238 -76578 -73445 -70311 -68609 -66906 -64272 -61638
-4765 -61638 -63773 -65907 -66671 -67435 -66768 -66101 -66060 -66019 -61209 -56399 -53944 -51488 -55710 -59931 -68057 -76180 -79298 -76690 -76888
-4746 -76888 -82804 -82287 -81765 -80085 -78400 -76720 -75036 -75919 -76798 -80543 -84284 -85390 -86493 -84738 -82980 -85040 -87097 -86296
$$ packed form
-4875g6012O44O45r05o629o37o37r95r95M341M341O129M06L331L331N835N834O998O997M136
-4856c3842M135L063L063l614l615q025q026o475p53o3o0O52n067k806k802j732j729m162
-4838g1858m158k731k727L320L323M751M754j241j237J621J624p8p4p9p4J315J319j546j543
-4819f5319m73m69m74m69K679K682L037k683j404j401l193l190m392m390j531j528l707l703
-4801h9928K969K973N377N380K50K53J114m605k821k816K544K549J352m366k582L144K426
-4784g6787K429l84l83J047J047j16j15j16j15k202k202O59O60L133L134J702J703K634K634
-4765f1638k135k134p64p64O67O67M1M1M810M810K455K456m222m221q126q123l118K608j98
-4746g6888n916N17N22J680J685J680J684q83q79l745l741j106j103J755J758k060k057Q01
$$ plain form
-4728 -86296 -85491 -84958 -84421 -79477 -74529 -71493 -74175 -73642 -73106 -71910 -70710 -69872 -69030 -69682 -76053 -76347 -76638 -77290 -77938 -78590
-4708 -78590 -79239 -82216 -85189 -85304 -85416 -81880 -78341 -77666 -76988 -76850 -76709 -76571 -76429 -73952 -71470 -71854 -72234 -71008 -69779 -68553
-4688 -68553 -67323 -60382 -53441 -46857 -40273 -35359 -36167 -40434 -44700 -50240 -55781 -58459 -61138 -60837 -60535 -60233 -59931 -61619
-4670 -61619 -63307 -64995 -66682 -66343 -66004 -70792 -75580 -75233 -80610 -87536 -94463 -92924 -91385 -85077 -78769 -74432 -70092 -68616
-4652 -68616 -67137 -64469 -61798 -59130 -56459 -56026 -55590 -55158 -54722 -59119 -63512 -63139 -62763 -64656 -66545 -64861 -68896 -73590
-4634 -73590 -72558 -68430 -64298 -64074 -63847 -61120 -58389 -60550 -68430 -72737 -77040 -81087 -79406 -77372 -81057 -86117 -85450 -79779
-4616 -79779 -74104 -70073 -66038 -62006 -57971 -62226 -66478 -70733 -74984 -75826 -76664 -77506 -78345 -75431 -72513 -69958 -67398 -66690
-4598 -66690 -71701 -70278 -68851 -70051 -65524 -61000 -62197 -65684 -69168 -68244 -67316 -70267 -73214 -76165 -79112 -78039 -76962
$$ packed form
-4728h6296Q05N33N37M944M948L036k682N33N36J196J200Q38Q42o52o371k94k91o52o48o52
-4708g8590o49k977k973j15j12L536L539O75O78J38J41J38J42K477K482l84l80J226J229J226
-4688f8553J230O941O941O584O584M914q08m267m266n540n541k678k679L01L02L02L02j688
-4670f1619j688j688j687L39L39m788m788L47n377o926o927J539J539O308O308M337M340J476
-4652f8616J479K668K671K668K671M33M36M32M36m397m393L73L76j893j889J684m035m694
-4634g3590J032M128M132K24K27K727K731k161p880m307m303m047J681K034l685n060O67N671
-4616g9779N675M031M035M032M035m255m252m255m251q42q38q42q39K914K918K555K560P08
-4598f6690n011J423J427j200M527M524j197l487l484R24R28k951k947k951k947J073J077
$$ plain form
-4581 -76962 -76247 -75528 -73918 -78028 -78922 -79813 -77115 -74414 -74578 -74738 -75736 -76731 -77730 -78725 -79604 -80479 -78497 -76511 -77033 -77551
-4561 -77551 -75211 -72867 -71712 -70557 -69402 -68247 -68225 -68203 -71399 -68873 -68821 -68769 -68359 -67949 -68732 -69514 -70297 -71079 -70818 -70557 -70297
-4540 -70297 -70036 -74604 -79172 -78970 -78769 -80476 -82182 -83889 -85595 -85930 -86266 -81832 -77398 -70311 -63221 -60904 -58582 -58053
-4522 -58053 -57521 -58541 -65282 -70177 -75069 -75554 -76034 -80990 -85942 -86128 -86310 -85304 -84295 -83289 -82279 -81690 -81098 -80509 -79917
-4503 -79917 -78136 -76351 -74928 -73501 -70051 -72320 -74235 -76146 -80692 -85237 -85014 -84790 -83196 -81601 -77026 -77219 -79500 -77011
-4485 -77011 -77502 -77994 -78605 -79216 -76966 -74715 -73508 -72301 -71094 -69887 -69514 -69142 -71452 -73762 -74596 -72569 -69469 -71139 -70304
-4466 -70304 -69469 -68933 -68396 -66090 -63780 -64335 -64887 -63951 -63012 -66846 -70677 -72022 -73363 -69939 -66511 -65650 -64786 -66787 -68784
-4447 -68784 -71761 -74734 -77711 -80684 -79786 -78885 -77987 -77085 -76128 -75166 -74209 -73247 -73005 -72759 -69656 -66548 -58977 -51406 -48426
$$ packed form
-4581g6962P15P19J610m110q94q91K698K701j64j60r98r95r99r95q79q75J982J986n22n18
-4561g7551K340K344J155J155J155J155K2K2l196K526N2N2M10M10p83p82p83p82K61K61K60
-4540g0297K61m568m568K02K01j707j706j707j706l35l36M434M434P087P090K317K322N29
-4522e8053N32j020o741m895m892m85m80m956m952j86j82J006J009J006J010N89N92N89N92
-4503g9917J781J785J423J427L450k269j915j911m546m545K23K24J594J595M575j93k281K489
-4485g7011m91m92o11o11K250K251J207J207J207J207L73L72k310k310q34K027L100j670Q35
-4466g0304Q35N36N37K306K310n55n52R36R39l834l831j345j341L424L428Q61Q64k001j997
-4447f8784k977k973k977k973Q98R01Q98R02R57R62R57R62K42K46L103L108P571P571K980
$$ plain form
-4428 -48426 -45445 -43060 -37814 -36264 -39483 -41898 -44312 -49886 -55460 -56623 -57785 -58948 -60110 -60907 -61705 -65483 -64492 -60520
-4410 -60520 -61317 -63605 -63031 -63322 -63612 -63724 -63836 -66511 -69186 -63277 -57368 -60538 -63709 -62111 -60512 -60345 -60177 -60009 -59842
-4391 -59842 -59778 -59715 -59652 -59588 -59346 -59104 -59041 -58977 -61466 -66817 -70379 -69171 -69216 -69261 -68829 -63627 -62465 -61302 -59842 -58381 -62584 -66787
-4369 -66787 -68426 -70066 -68765 -72230 -75580 -78926 -84302 -84906 -81519 -78128 -78706 -79280 -75088 -70893 -74809 -78721 -79775 -80826
-4351 -80826 -84801 -88773 -87980 -87182 -86746 -86307 -83009 -79708 -82447 -85182 -85059 -84932 -85345 -85755 -86169 -86579 -87629 -88680 -86869
-4332 -86869 -85059 -85036 -85014 -84992 -84969 -81027 -77085 -76005 -74924 -77420 -79917 -79552 -79187 -78378 -77570 -76761 -75952 -76932 -77912 -78892 -79872
-4311 -79872 -77305 -74738 -76940 -79142 -79377 -79611 -79846 -80081 -78516 -76951 -75386 -73821 -76906 -79991 -79380 -74000 -73016 -76802
-4293 -76802 -77309 -77815 -80826 -79067 -73613 -71019 -70222 -69425 -71668 -73911 -75856 -77801 -76884 -75967 -77689 -79410 -80953 -82495
$$ packed form
-4428d8426K981K385N246J550l219k415k414n574n574j163j162j163j162p97p98l778R91L972
-4410f0520p97k288N74k91k90j12j12k675k675N909N909l170l171J598J599J67J68J68J67
-4391e9842O4O3O3O4K42K42O3O4k489n351l562J208m5m5M32N202J162J163J460J461m203m203
-4369f6787j639j640J301l465l350l346n376o04L387L391n78n74M192M195l916l912j054j051
-4351h0826l975l972P93P98M36M39L298L301k739k735J23J27m13m10m14m10j050j051J811
-4332h6869J810K3K2K2K3L942L942J080J081k496k497L65L65Q09Q08Q09Q09r80r80r80r80
-4311g9872K567K567k202k202k35k34k35k35J565J565J565J565l085l085O11N380R84l786
-4293g6802n07n06l011J759N454K594P97P97k243k243j945j945R17R17j722j721j543j542
$$ plain form
-4275 -82495 -81713 -78069 -75915 -78531 -79473 -75643 -77659 -79671 -81448 -83222 -80230 -77234 -76105 -74973 -73844 -72711 -73847
-4258 -73847 -74980 -76116 -77249 -73937 -70621 -73985 -77346 -77253 -77156 -77063 -76966 -76128 -75286 -79216 -83143 -80517 -77886 -80029 -82167
-4239 -82167 -82812 -83453 -84097 -84738 -85860 -86977 -88278 -89574 -88624 -90532 -96199 -97093 -96978 -93997 -90543 -89947 -89369 -85927 -82667
-4220 -82667 -82264 -80792 -79317 -77070 -71958 -70099 -73005 -73054 -73098 -72908 -72715 -77294 -81869 -79533 -77197 -77722 -78248 -78356 -78464 -75710
-4200 -75710 -72957 -74496 -76034 -77573 -79112 -78445 -77778 -74429 -75848 -78005 -80163 -79757 -79351 -76500 -73650 -71098 -68545 -67126
-4182 -67126 -70475 -72752 -72167 -70807 -69447 -72677 -75908 -76448 -76988 -77529 -78069 -78907 -79745 -80584 -81422 -79414 -77406 -75397 -73389
-4163 -73389 -74004 -74619 -75233 -75848 -76564 -77279 -77994 -78710 -76325 -73941 -76325 -78710 -79857 -81005 -78576 -71377 -66742 -68784 -69633
-4144 -69633 -70483 -71213 -71943 -75356 -74000 -72704 -71407 -72674 -73941 -75461 -76981 -76593 -79067 -81482 -79127 -78024 -79783 -79026
$$ packed form
-4275h2495P82L644K154k616r42L830k016k012j777j774K992K996J129J132J129J133j136
-4258g3847j133j136j133L312L316l364l361R3R7R3R7Q38Q42l930l927K626K631k143k138
-4239h2167o45o41o44o41j122j117j301j296R50j908n667q94J15K981L454N96N78L442L260
-4220h2667M03J472J475K247N112J859k906m9m4J90J93m579m575K336K336n25n26j08j08K754
-4200g5710K753j539j538j539j539O67O67L349j419k157k158M06M06K851K850K552K553J419
-4182f7126l349k277N85J360J360l230l231n40n40n41n40q38q38q39q38K008K008K009K008
-4163g3389o15o15o14o15p16p15p15p16K385K384k384k385j147j148K429P199M635k042q49
-4144f9633q50p30p30l413J356J296J297j267j267j520j520L88k474k415K355J103j759P57
$$ plain form
-4126 -79026 -78270 -80733 -83196 -85003 -89671 -90465 -86489 -83721 -78091 -74131 -74939 -74078 -76079 -73907 -71735 -72651 -73564 -77879
-4108 -77879 -76467 -73091 -72573 -68482 -67249 -69268 -71284 -73482 -75677 -77339 -78997 -77797 -76593 -74797 -72998 -71202 -69402
-4091 -69402 -70528 -71649 -72774 -73896 -74842 -75785 -76731 -77674 -76951 -76224 -75859 -75490 -73762 -77752 -78527 -79298 -80073 -80845 -78758 -76668
-4071 -76668 -72987 -69302 -65263 -66943 -67852 -68758 -70025 -71288 -71414 -71537 -74168 -76795 -81035 -79548 -81284 -83017 -83665 -84310
-4053 -84310 -84958 -85603 -84403 -83199 -82000 -80796 -83117 -85435 -84895 -84351 -81843 -79332 -79686 -80036 -78542 -77044 -78590 -80133
-4035 -80133 -77506 -77737 -80178 -76891 -67610 -67864 -70684 -70639 -70539 -70434 -73016 -75595 -77298 -78997 -80699 -82398 -82134 -81865 -78739
-4016 -78739 -75610 -77670 -79727 -78926 -78121 -78751 -79377 -80006 -80632 -81530 -82424 -83322 -84217 -83326 -82432 -84403 -86370 -88557 -90744 -90070
-3996 -90070 -89396 -87112 -84828 -87313 -89798 -89407 -89015 -88624 -88233 -86948 -85662 -84734 -83807 -82305 -86523 -87525 -88524 -87082 -85636
$$ packed form
-4126g9026P56k463k463j807m668p94L976K768N630L960q08Q61k001K172K172r16r13m315
-4108g7879J412L376N18M091J233k019k016k198k195j662j658J200J204J796J799J796J800
-4091f9402j126j121j125j122r46r43r46r43P23P27L65L69J728l990p75p71p75p72K087K090
-4071g6668L681L685M039j680r09r06j267j263j26j23k631k627m240J487j736j733o48o45
-4053h4310o48o45J200J204J199J204k321k318N40N44K508K511l54l50J494J498j546j543
-4035h0133K627k31k441L287R281k54k820M5J00J05k582k579j703j699j702j699K64K69L126
-4016g8739L129k060k057Q01Q05o30o26o29o26q98q94q98q95Q91Q94j971j967k187k187O74
-3996i0070O74K284K284k485k485L91L92L91L91J285J286R28R27J502m218j002r99J442J446
$$ plain form
-3977 -85636 -87056 -88471 -88893 -89310 -89731 -90148 -91165 -92179 -93196 -94209 -90483 -86758 -89708 -92659 -94716 -96773 -92153 -87533
-3959 -87533 -84000 -80468 -78486 -82227 -82450 -82674 -83255 -83836 -81362 -78885 -78915 -78941 -79924 -75181 -70442 -71422 -73598 -75770 -73534
-3940 -73534 -71295 -71325 -71351 -74242 -77130 -79567 -82000 -84436 -86869 -86147 -85420 -81836 -78248 -79790 -81329 -82156 -73441 -68665 -73423
-3921 -73423 -75084 -76742 -79839 -82931 -82808 -82681 -82380 -76351 -73903 -71452 -71478 -77223 -76891 -76556 -76701 -76843 -74484 -72122 -70554
-3902 -70554 -74704 -78859 -77286 -76672 -76053 -75438 -74820 -72566 -76031 -82719 -83680 -80114 -82268 -84067 -85863 -84235 -88330 -89205
-3884 -89205 -90081 -90420 -90759 -86329 -81899 -78989 -76079 -77938 -79798 -78736 -77674 -79473 -81273 -81180 -81087 -80994 -80900 -79615 -78330 -77044
-3864 -77044 -75759 -73862 -71966 -71619 -76996 -81120 -85245 -83050 -80856 -83751 -86642 -86676 -83844 -82208 -85338 -85610 -85878 -85152
-3846 -85152 -84421 -83695 -82965 -83132 -83296 -80602 -77905 -77730 -77551 -77376 -77197 -79347 -81493 -80781 -80066 -79481 -78892 -81169 -83442 -78743
$$ packed form
-3977h5636j420j415m22m17m21m17j017j014j017j013L726L725k950k951k057k057M620M620
-3959h7533L533L532J982l741k23k24n81n81K474K477l0k6r83M743M739r80k176k172K236
-3940g3534K239l0k6k891k888k437k433k436k433P22P27L584L588j542j539q27Q715M776m758
-3921g3423j661j658l097l092J23J27L01O029K448K451k6n745L32L35j45j42K359K362J568
-3902g0554m150m155J573O14O19O15O18K254l465o688r61L566k154j799j796J628m095q75
-3884h9205q76l39l39M430M430K910K910j859j860J062J062j799j800R3R3R3R4J285J285J286
-3864g7044J285J897J896L47n377m124m125K195K194k895k891l4K832J636l130k72k68P26
-3846h5152P31P26P30j67j64K694K697J75J79J75J79k150k146P12P15N85N89k277k273M699
$$ plain form
-3826 -78743 -74041 -66839 -64402 -63389 -65233 -67558 -67018 -67018 -69876 -70949 -72018 -71206 -70390 -69577 -68762 -68367 -67968 -72342 -76713
-3807 -76713 -74987 -73259 -71534 -69805 -71180 -72551 -71064 -69574 -70338 -71098 -69000 -71668 -77320 -80107 -81944 -83777 -83199 -82618
-3789 -82618 -84067 -82652 -74861 -73743 -75371 -76996 -79921 -82842 -80997 -79149 -79988 -80822 -81839 -82853 -78985 -77976 -83110
-3772 -83110 -83471 -78471 -78236 -79675 -83971 -87316 -83982 -84585 -85185 -86504 -87819 -86277 -84731 -83438 -82141 -77987 -73829 -71642
-3754 -71642 -69451 -70125 -70796 -71180 -71560 -71943 -72323 -72528 -72730 -74842 -74090 -73143 -76962 -82395 -84962 -82346 -79727 -74071 -73180 -76966
-3734 -76966 -77886 -77737 -74723 -73203 -74540 -74093 -73642 -77573 -81500 -80662 -79820 -79518 -79213 -78911 -78605 -77499 -76388 -75282 -74172
-3715 -74172 -74257 -74339 -74425 -74507 -74186 -73862 -76761 -73933 -72063 -70189 -72730 -75267 -78702 -82134 -80800 -79462 -76519 -73572 -73728 -79604
-3695 -79604 -84056 -82786 -84734 -86683 -84995 -77584 -73393 -69201 -71329 -73456 -75584 -77711 -79123 -80535 -81947 -83360 -83050
$$ packed form
-3826g8743M702P202K437J013j844k325N40%k858j073j069Q12Q16Q13Q15L95L99m374m371
-3807g6713J726J728J725J729j375j371J487J490p64p60K098k668n652k787j837j833N78N81
-3789h2618j449J415P791J118j628j625k925k921J845J848q39q34j017j014L868J009n134
-3772h3110l61N000K35j439m296l345L334o03o00j319j315J542J546J293J297M154M158K187
-3754g1642K191o74o71l84l80l83l80k05k02k112P52R47l819n433k567K616K619N656Q91l786
-3734g6966r20J49L014J520j337M47M51l931l927Q38Q42L02L05L02L06J106J111J106J110
-3715g4172q5q2q6q2L21L24k899K828J870J874k541k537l435l432J334J338K943K947j56n876
-3695g9604m452J270j948j949J688P411M191M192k128k127k128k127j412j412j412j413L10
$$ plain form
-3678 -83050 -82741 -82432 -82123 -79488 -76854 -74220 -71586 -73631 -75677 -74861 -74045 -74123 -74201 -74280 -74358 -75319 -76280 -77242 -78203 -76601 -74999
-3657 -74999 -73397 -71794 -77920 -84045 -86713 -83658 -86027 -88397 -82421 -82167 -85163 -88159 -82927 -77696 -77651 -77607 -77562 -77517 -74917
-3638 -74917 -72316 -74484 -76653 -76139 -75625 -75110 -74596 -75692 -76787 -77883 -78978 -76795 -74611 -75289 -75967 -76392 -76817 -77242 -77666
-3619 -77666 -75945 -74224 -75364 -76504 -77905 -79306 -80707 -82108 -82316 -82525 -82734 -82942 -85506 -88069 -87771 -87473 -89679 -91884
-3601 -91884 -91229 -90573 -87629 -84682 -81739 -78792 -78292 -77789 -77290 -76787 -76981 -77171 -77365 -77555 -79418 -81277 -80278 -79276 -73717 -68158
-3581 -68158 -69276 -70393 -72167 -73941 -79649 -78680 -77093 -78367 -77614 -76862 -78970 -81079 -78419 -75759 -77141 -78523 -79906 -81288
-3563 -81288 -83266 -85245 -84362 -83479 -84071 -84664 -85256 -85848 -88170 -90491 -88043 -85595 -80927 -76254 -78263 -80267 -80368 -80465 -80565
-3544 -80565 -80662 -80375 -80085 -79798 -79507 -79280 -79049 -81683 -84313 -83024 -81731 -80442 -79149 -79231 -79310 -79391 -79470 -81668 -83863 -86061 -88255
$$ packed form
-3678h3050L09L09L09K635K634K634K634k045k046Q16Q16p8p8p9p8r61r61r62r61J602J602
-3657g4999J602J603o126o125k668L055k369k370N976K54k996k996N232N231M5M4M5M5K600
-3638g4917K601k168k169N14N14N15N14j096j095j096j095K183K184o78o78m25m25m25m24
-3619g7666J721J721j140j140j401j401j401j401k08k09k09k08k564k563K98K98k206k205
-3601i1884O55O56K944K947K943K947N00N03M99N03j94j90j94j90j863j859R99J002N559N559
-3581f8158j118j117j774j774n708R69J587j274P53P52k108k109K660K660j382j382j383j382
-3563h1288j978j979Q83Q83n92n93n92n92k322k321K448K448M668M673k009k004j01r7j00
-3544h0565r7K87K90K87K91K27K31k634k630J289J293J289J293q2p9q1p9k198k195k198k194
$$ plain form
-3523 -88255 -87175 -86091 -85010 -83926 -79954 -75979 -76776 -77570 -80334 -83095 -81090 -79082 -76422 -73758 -73959 -77018 -78888 -75986
-3505 -75986 -74339 -75550 -75766 -75982 -73695 -71407 -69715 -70885 -73128 -70602 -69969 -69335 -71265 -73195 -73516 -73836 -76660 -74715
-3487 -74715 -72972 -68367 -67159 -70721 -72018 -73315 -74909 -76504 -77152 -77801 -81310 -84820 -84276 -83732 -80684 -77637 -73937 -75960
-3469 -75960 -74764 -73568 -73534 -73501 -76329 -79157 -78549 -77942 -78766 -79589 -75852 -72115 -76962 -81810 -83635 -85461 -87644 -84105 -81519
-3450 -81519 -78933 -80759 -82585 -81288 -79991 -75833 -71675 -73121 -74566 -74581 -74596 -74961 -75327 -74261 -73195 -72666 -72137 -71608 -71079
-3431 -71079 -75774 -80468 -82301 -84135 -86117 -88099 -88650 -89202 -87305 -85409 -83512 -81616 -85860 -90103 -89578 -89053 -87857 -86661
-3413 -86661 -86895 -87130 -86620 -86109 -85599 -85088 -84149 -83211 -82272 -81333 -81467 -81601 -81735 -81869 -81988 -82108 -82227 -82346 -79544 -76742 -76802 -76862
-3391 -76862 -76131 -75401 -74671 -73941 -76370 -78799 -78367 -77935 -79649 -81362 -80215 -79067 -83196 -87324 -90021 -92719 -91765 -90811 -86996
$$ packed form
-3523h8255J080J084J081J084L972L975p97p94k764k761K005K008K660K664k01l059j870K902
-3505g5986J647j211k16k16K287K288J692j170k243K526O33O34j930j930l21l20k824J945
-3487g4715J743M605J208l562j297j297j594j595o48o49l509l510N44N44L048L047L700k023
-3469g5960J196J196L4L3k828k828O08O07q24q23L737L737m847m848j825j826k183L539K586
-3450h1519K586j826j826J297J297M158M158j446j445j5j5l65l66J066J066N29N29N29N29
-3431g1079m695m694j833j834j982j982n51n52J897J896J897J896m244m243N25N25J196J196
-3413h6661k34k35N10N11N10N11R39R38R39R39j34j34j34j34j19j20j19j19K802K802o0o0
-3391g6862P31P30P30P30k429k429M32M32j714j713J147J148m129m128k697k698R54R54L815
$$ plain form
-3372 -86996 -83181 -82376 -81571 -85535 -89500 -90133 -90767 -91400 -92033 -89686 -87339 -84992 -82644 -80707 -78769 -79336 -79902 -79753 -73881
-3353 -73881 -72420 -76683 -78702 -74999 -74872 -74745 -73754 -72763 -70341 -67919 -66541 -65159 -66641 -68121 -71362 -74600 -74980 -75356
-3335 -75356 -76824 -78289 -76895 -75498 -75893 -76284 -79541 -82793 -81161 -79526 -80755 -81981 -80409 -78833 -75830 -72823 -70103
-3318 -70103 -67379 -66686 -65989 -62912 -69369 -70464 -71556 -67811 -64067 -66999 -69931 -70628 -71325 -73452 -75580 -78900 -82219 -82678
-3300 -82678 -83136 -83028 -82920 -83885 -84850 -84462 -78352 -73672 -74715 -74984 -75252 -71109 -66966 -67159 -67353 -67547 -67741 -69395 -71049 -74134
-3280 -74134 -77219 -79280 -81340 -80539 -79738 -78371 -77003 -75636 -74268 -73840 -73411 -72625 -71839 -72841 -68121 -59942 -51764 -43247
-3262 -43247 -34729 -33485 -37963 -48582 -59201 -66720 -68516 -69477 -70438 -71042 -71645 -71534 -71422 -74172 -76921 -77897 -78874 -79850 -80826
-3243 -80826 -80610 -80394 -80178 -79962 -85275 -90588 -94351 -92391 -93174 -93956 -89612 -85267 -82175 -79082 -75990 -72897 -76482 -80066
$$ packed form
-3372h6996L815Q05Q05l964l965o33o34o33o33K347K347K347K348J937J938n67n66J49N872
-3353g3881J461m263k019L703J27J27R91R91K422K422J378J382j482j480l241l238l80l76
-3335g5356j468j465J394J397l95l91l257l252J632J635j229j226J572J576L003L007K720
-3318g0103K724O93O97L077o457j095j092L745L744k932k932o97o97k127k128l320l319m59
-3300h2678m58J08J08r65r65L88O110M680j043k69k68M143M143j93j94j94j94j654j654l085
-3280g4134l085k061k060Q01Q01J367J368J367J368M28M29P86P86j002M720Q179Q178Q517
-3262d3247Q518J244m478j0619j0619p519j796r61r61o04o03J11J12k750k749r76r77r76r76
-3243h0826K16K16K16K16n313n313l763J960p83p82M344M345L092L093L092L093l585l584
$$ plain form
-3225 -80066 -80789 -81512 -79343 -77175 -75006 -72838 -75975 -79112 -75572 -72033 -69257 -66478 -66563 -66645 -63601 -60553 -59059 -63284
-3207 -63284 -64965 -66641 -67249 -67852 -69920 -71984 -74052 -76116 -78546 -80971 -83401 -85826 -84798 -83766 -82737 -81705 -79410
-3190 -79410 -77111 -71597 -71802 -73352 -74898 -75375 -75848 -78143 -80435 -79868 -79298 -79388 -79473 -82424 -85372 -86102 -86828 -86128 -85424 -88121
-3170 -88121 -90815 -92082 -93345 -94586 -95823 -94202 -92577 -91314 -90048 -89142 -88233 -85599 -88684 -87123 -85558 -84384 -83207
-3153 -83207 -84895 -86579 -82782 -78985 -75189 -71392 -73288 -75185 -77081 -78978 -81307 -83635 -87752 -86147 -84034 -81921 -82313
-3136 -82313 -82704 -85170 -87633 -87238 -86840 -87637 -88431 -89228 -90021 -90446 -90867 -91292 -91713 -89485 -87253 -85383 -83509 -80491 -83192 -84108
-3116 -84108 -85021 -86951 -88878 -86038 -83196 -82629 -82059 -82924 -83784 -85066 -86344 -84764 -83181 -83673 -84164 -83225 -82287 -81020 -79753
-3097 -79753 -75267 -76504 -76958 -77413 -78225 -79038 -78002 -76966 -75930 -74894 -72968 -71042 -75792 -80543 -82044 -83546 -84094 -81780
$$ packed form
-3225h0066p23p23K169K168K169K168l137l137L540L539K776K779q5q2L044L048J494m225
-3207f3284j681j676o08o03k068k064k068k064k430k425k430k425J028J032J029J032K295
-3190g9410K299N514k05j550j546m77m73k295k292N67N70r0q5k951k948p30p26P00P04k697
-3170h8121k694j267j263j241j237J621J625J263J266R06R09K634l085J561J565J174J177
-3153h3207j688j684L797L797L796L797j896j897j896j897k329k328m117J605K113K113l92
-3136h2313l91k466k463L95L98p97p94p97p93m25m21m25m21K228K232J870J874L018k701r16
-3116h4108r13j930j927K840K842N67N70q65q60j282j278J580J583m92m91R39R38J267J267
-3097g9753M486j237m54m55q12q13J036J036J036J036J926J926m750m751j501j502n48K314
$$ plain form
-3079 -81780 -80017 -83024 -84600 -81407 -76813 -75081 -76508 -80796 -83717 -86638 -83061 -79485 -79902 -80319 -80737 -81154 -77964 -74775
-3061 -74775 -78263 -81750 -83747 -85744 -86310 -86877 -86873 -86869 -87343 -84954 -83639 -87093 -89295 -88635 -90167 -91698 -92872 -89276 -86277
-3042 -86277 -83278 -79980 -76683 -77100 -77517 -77935 -78352 -76981 -75610 -79008 -82406 -83494 -84582 -80125 -80438 -81944 -83449 -83822
-3024 -83822 -84194 -82354 -80513 -80103 -79693 -78598 -77502 -77838 -78173 -81862 -85550 -84470 -83389 -80878 -78367 -78717 -79067 -79954 -80841
-3005 -80841 -80297 -79753 -80431 -81109 -84649 -88188 -91072 -93956 -90163 -86370 -84783 -83196 -83039 -82883 -81981 -81079 -78747 -76415 -75721
-2986 -75721 -75028 -75766 -76504 -77301 -78099 -78896 -79693 -77122 -74552 -74842 -75133 -72882 -70632 -71243 -71854 -73777 -75699 -77443 -79187 -79969
-2966 -79969 -77890 -74738 -76355 -76422 -76489 -76854 -77219 -78289 -79354 -80424 -81489 -81545 -81597 -78434 -80990 -83706 -86419 -86631 -86840 -85085
-2946 -85085 -83326 -81571 -79813 -78408 -76999 -75595 -74186 -76359 -78527 -80699 -82868 -84652 -86433 -88218 -89999 -88505 -87007
$$ packed form
-3079h1780J763l007j576L193M594J732j427m288k921k921L577L576m17m17m18m17L190L189
-3061g4775l488l487j997j997n66n67MMm74K389J315l454k202O60j532j531j174L596K999
-3042h6277K999L298L297m17m17m18m17J371J371l398l398j088j088M457l13j506j505l73
-3024h3822l72J840J841M10M10J095J096l36l35l689l688J080J081K511K511l50l50q87q87
-3005h0841N44N44o78o78l540l539k884k884L793L793J587J587J57J56R02R02K332K332O94
-2986g5721O93p38p38p97p98p97p97K571K570k90k91K251K250o11o11j923j922j744j744p82
-2966g9969K079L152j617o7o7l65l65j070j065j070j065n6n2L163k556k716k713k12k09J755
-2946h5085J759J755J758J405J409J404J409k173k168k172k169j784j781j785j781J494J498
$$ plain form
-2929 -87007 -85513 -84015 -85535 -87052 -85711 -84366 -83918 -83468 -83021 -82570 -80960 -79347 -77737 -76124 -75707 -75286 -74868 -74447 -75334
-2910 -75334 -76217 -77104 -77987 -76727 -75464 -74563 -73657 -71772 -75606 -76224 -76839 -79008 -81172 -83341 -85506 -83758 -82007 -80260 -78508
-2891 -78508 -79086 -79660 -80237 -80811 -83684 -86553 -84656 -82756 -82648 -82536 -82428 -82316 -86765 -91210 -92797 -94381 -90841 -87298 -82506
-2872 -82506 -80573 -78702 -82551 -84973 -84529 -85699 -86866 -84995 -83121 -87030 -90934 -90074 -89209 -88050 -86888 -85729 -84567 -83825
-2854 -83825 -83080 -79835 -76586 -72268 -73669 -73642 -70751 -73836 -79783 -83583 -87380 -90465 -87827 -80301 -75632 -72696 -72622 -75885
-2836 -75885 -79146 -76090 -73035 -74749 -76459 -77096 -77733 -78371 -79008 -78453 -77897 -77342 -76787 -75055 -73322 -74451 -75580 -75815 -76049
-2817 -76049 -76284 -76519 -78225 -79932 -81638 -83341 -83199 -83058 -82916 -82771 -83136 -83501 -84224 -79220 -76724 -74227 -74593 -74954 -74280 -79328
-2797 -79328 -81158 -82987 -82253 -81519 -80785 -80051 -82924 -85796 -88669 -91542 -90897 -90252 -89608 -88963 -93859 -98755 -96974 -95193 -91683
$$ packed form
-2929h7007J494J498j520j517J341J345M48M50M47M51J610J613J610J613M17M21M18M21q87
-2910g5334q83q87q83J260J263R01R06J885l834o18o15k169k164k169k165J748J751J747J752
-2891g8508n78n74n77n74k873k869J897J900J08J12J08J12m449m445j587j584L540L543M792
-2872h2506J933J871l849k422M44j170j167J871J874l909l904Q60Q65J159J162J159J162P42
-2854h3825P45L245L249M318j401K7K891l085n947l800l797l085K638P526M669K936P4l263
-2836g5885l261L056L055j714j710o37o37o38o37N55N56N55N55J732J733j129j129k35k34
-2817g6049k35k35j706j707j706j703J42J41J42J45l65l65p23N004K496K497l66l61O74n048
-2797g9328j830j829P34P34P34P34k873k872k873k873O45O45O44O45m896m896J781J781L510
$$ plain form
-2778 -91683 -88173 -84664 -81154 -83188 -85223 -90476 -90007 -89656 -89306 -88598 -87890 -88337 -88781 -89228 -89671 -88926 -88177 -87432 -86683 -86623 -86560
-2757 -86560 -86500 -86437 -88345 -90249 -92156 -94060 -91843 -89623 -88360 -92816 -95726 -89094 -84969 -86564 -89682 -92797 -93412 -94023
-2739 -94023 -92790 -91553 -93181 -94805 -93844 -92879 -89056 -85230 -84388 -83542 -82700 -81854 -80267 -78676 -77089 -75498 -75580 -75658 -80509
-2720 -80509 -85357 -86038 -86717 -84895 -83069 -77193 -77037 -80342 -83643 -80330 -77014 -78471 -79924 -82335 -84742 -90372 -90275 -91352
-2702 -91352 -92428 -93147 -93867 -91188 -88509 -85830 -83151 -80204 -77257 -77171 -77085 -79146 -81206 -80405 -79604 -78304 -77003 -75703 -74403
-2683 -74403 -73281 -72160 -71038 -74686 -78721 -79894 -84407 -86057 -87052 -85185 -83140 -83956 -83434 -82909 -82566 -82219 -83069 -83915 -84764
-2664 -84764 -85610 -85118 -84623 -84131 -83635 -81355 -79071 -79772 -75699 -72595 -74257 -75803 -77346 -78952 -80554 -82160 -83762 -85532
-2646 -85532 -87298 -84298 -81295 -81277 -81254 -81236 -81213 -79466 -77719 -80740 -83762 -83743 -83725 -80845 -77964 -76277 -74589 -75584 -76578 -77692
$$ packed form
-2778i1683L510L509L510k034k035n253M69L51L50P08P08m47m44m47m43P45P49P45P49O0O3
-2757h6560O0O3j908j904j907j904K217K220J263m456k910O632M125j595l118l115o15o11
-2739i4023J233J237j628j624R61R65L823L826Q42Q46Q42Q46J587J591J587J591q2p8m851
-2720h0509m848o81o79J822J826N876J56l305l301L313L316j457j453k411k407n630R7j077
-2702i1352j076p19p20K679K679K679K679K947K947Q6Q6k061k060Q01Q01J300J301J300J300
-2683g4403J122J121J122l648m035j173m513j650r95J867K045q16N22N25L43L47q50q46q49
-2664h4764q46M92M95M92M96K280K284p01M073L104j662j546j543j606j602j606j602j770
-2646h5532j766L000L003J8K3J8K3J747J747l021l022J9J8K880K881J687J688r95r94j114
$$ plain form
-2626 -77692 -75945 -73125 -75073 -76239 -77406 -78870 -80334 -80129 -79924 -79719 -79514 -79622 -79731 -82819 -81139 -77491 -78613 -81523
-2608 -81523 -84433 -83553 -82674 -81795 -80915 -81824 -82734 -78874 -75014 -75893 -76772 -77651 -78531 -80543 -82555 -81705 -80856 -83367 -85878 -85528
-2588 -85528 -85178 -86079 -86981 -87883 -88784 -89865 -90945 -89165 -87384 -85364 -83345 -81325 -79306 -76124 -72942 -74529 -76116 -79850
-2570 -79850 -83583 -86959 -90334 -92250 -88442 -84992 -81541 -80535 -79529 -78523 -77517 -79272 -81027 -82782 -84537 -83788 -83039
-2553 -83039 -85152 -87264 -84727 -82190 -84421 -86653 -88349 -90044 -86970 -83896 -82436 -80975 -79514 -78054 -75878 -73702 -74388
-2536 -74388 -75073 -78069 -81064 -86922 -87056 -87249 -81720 -78695 -81392 -83296 -85200 -82693 -80181 -80535 -80889 -81243 -81593 -82737 -83881
-2517 -83881 -85025 -86165 -85640 -85114 -84589 -84060 -82924 -81784 -80647 -79507 -82126 -84742 -84500 -84254 -85368 -86478 -87592 -88702
-2499 -88702 -87670 -86635 -85603 -84567 -84202 -83836 -85975 -88110 -91799 -89764 -88088 -86407 -83553 -80699 -74268 -73557 -75830 -72379
$$ packed form
-2626g7692J747K820j948j166j167j464j464K05K05K05K05j08j09l088J680L648j122k910
-2608h1523k910Q80Q79Q79Q80r09r10L860L860q79q79q79q80k012k012Q50Q49k511k511L50
-2588h5528L50r01r02r02r01j081j080J780J781K020K019K020K019L182L182j587j587l734
-2570g9850l733l376l375j916L808L450L451J006J006J006J006j755j755j755j755P49P49
-2553h3039k113k112K537K537k231k232j696j695L074L074J460J461J461J460K176K176o86
-2536g4388o85k996k995n858j34j93N529L025k697j904j904K507K512l54l54l54l50j144j144
-2517h3881j144j140N25N26N25N29J136J140J137J140k619k616K42K46j114j110j114j110
-2499h8702J032J035J032J036L65L66k139k135l689K035J676J681K854K854O431P11k273L451
$$ plain form
-2481 -72379 -69287 -71914 -71452 -70990 -73747 -76504 -79559 -82614 -82808 -83002 -81631 -80260 -83300 -86340 -87115 -82167 -80438 -78710
-2463 -78710 -79179 -79649 -80118 -80588 -78017 -75446 -79552 -83658 -82488 -81318 -80148 -78978 -80073 -81169 -81966 -82763 -86430 -85327
-2445 -85327 -80707 -78948 -78024 -79962 -80647 -81333 -81243 -84015 -85178 -86340 -86787 -87234 -87682 -88129 -90170 -92212 -91393 -90573 -89843 -89112
-2425 -89112 -89813 -90513 -90200 -89887 -91184 -89619 -85521 -81422 -78397 -78233 -77122 -76012 -79671 -83330 -86214 -86236 -85006 -83777 -84306
-2406 -84306 -84835 -83456 -77309 -73724 -73002 -76929 -77994 -74261 -73389 -73769 -74149 -73128 -74969 -75677 -73523 -71891 -75028 -77212
-2388 -77212 -76534 -75170 -78576 -83412 -85386 -87719 -87186 -82842 -83263 -80558 -82618 -80688 -78754 -81497 -81374 -81612 -78985 -75081
-2370 -75081 -71172 -71858 -75401 -80532 -80889 -79343 -77793 -77976 -78154 -75297 -75297 -74518 -73736 -72659 -74440 -80099 -80986 -79969 -78948
-2351 -78948 -80949 -82946 -82264 -81579 -79108 -79496 -81139 -78009 -75777 -76403 -75304 -74201 -71433 -71522 -74775 -78024 -80584 -83140
$$ packed form
-2481g2379L092k627M62M62k757k757l055l055j94j94J371J371l040l040p75M948J729J728
-2463g8710m69m70m69m70K571K571m106m106J170J170J170J170j095j096p97p97l667J103
-2445h5327M620J759R24j938o85o86R0k772j163j162m47m47m48m47k041k042Q19Q20P30P31
-2425h9112p01p00L13L13j297J565M098M099L025J64J111J110l659l659k884k2J230J229n29
-2406h4306n29J379O147L585P22l927j065L733Q72l80l80J021j841p08K154J632l137k184
-2388g7212O78J364l406m836j974k333N33M344m21K705k060J930J934k743J23k38K627L904
-2370g5081L909o86l543n131l57J546J550j83j78K857%P79P82J077j781n659q87J017J021
-2351g8948k001j997O82O85K471l88j643L130K232o26J099J103K768q9l253l249k560k556
$$ plain form
-2333 -83140 -84626 -83248 -80979 -81567 -83233 -84895 -83371 -81843 -77637 -78195 -82246 -86292 -83963 -81631 -79570 -77510 -76880 -76251
-2315 -76251 -74518 -72785 -75822 -78859 -81247 -83635 -81254 -78874 -81172 -83471 -82909 -79485 -77998 -81281 -83132 -80215 -79891
-2298 -79891 -82428 -84965 -84641 -77380 -74887 -77938 -80990 -79928 -76005 -75599 -79962 -82134 -81441 -80871 -83158 -85569 -85114 -86452
-2280 -86452 -87786 -87864 -87939 -88017 -88091 -90197 -92298 -89634 -86966 -88907 -90845 -88017 -85185 -83550 -81910 -80275 -78635 -79049 -79459
-2261 -79459 -79872 -80282 -83140 -85994 -88852 -91706 -90111 -88516 -84060 -79604 -77115 -74626 -74999 -75371 -73896 -72420 -75416 -78412
-2243 -78412 -79976 -76772 -74999 -77994 -79552 -81109 -84395 -87682 -86378 -85073 -88539 -92004 -91653 -91303 -90953 -90603 -93054 -95506
-2225 -95506 -95096 -94686 -90416 -86147 -84738 -83326 -85316 -87305 -86433 -85558 -83792 -82026 -80260 -78490 -77737 -76985 -81001 -85014
-2207 -85014 -84902 -84790 -81817 -78840 -80874 -82909 -82082 -81251 -83762 -86273 -85923 -85569 -84026 -82484 -78378 -74268 -75677 -81854
$$ packed form
-2333h3140j486J378K269n88j666j662J524J528M206n58m051m046K329K332K061K060O30O29
-2315g6251J733J733l037l037k388k388K381K380k298k299N62L424J487l283j851K917L24
-2298g9891k537k537L24P261K493l051l052J062L923M06m363k172O93N70k287k411M55j338
-2280h6452j334p8p5p8p4k106k101K664K668j941j938K828K832J635J640J635J640m14m10
-2261g9459m13m10k858k854k858k854J595J595M456M456K489K489l73l72J475J476k996k996
-2243g8412j564L204J773k995j558j557l286l287J304J305l466l465L51L50L50L50k451k452
-2225i5506M10M10M270M269J409J412j990j989Q72Q75J766J766J766J770P53P52m016m013
-2207h5014J12J12K973K977k034k035Q27Q31k511k511L50L54J543J542M106M110j409o177
$$ plain form
-2189 -81854 -82488 -83121 -82383 -81646 -80908 -80170 -80491 -80811 -81131 -81452 -84634 -87816 -86228 -84641 -80472 -76303 -74995 -73687 -74347 -75006
-2169 -75006 -75666 -76325 -79056 -81787 -81657 -81526 -84794 -88062 -84652 -81243 -83721 -86199 -83907 -81612 -82480 -83348 -84217 -85081 -82670
-2150 -82670 -80260 -80710 -81158 -83397 -85636 -85014 -81526 -77987 -79216 -81877 -81672 -82186 -79839 -81784 -83725 -85848 -87972 -90096
-2132 -90096 -92216 -90823 -89429 -91016 -87831 -81880 -80696 -79395 -78091 -80010 -81925 -83546 -85163 -86277 -82618 -78784 -79716
-2115 -79716 -82976 -83371 -82518 -78799 -77543 -76284 -74850 -73411 -75256 -77096 -78941 -80781 -82208 -83632 -84760 -85886 -88684
-2098 -88684 -86709 -82950 -82048 -82488 -82927 -80684 -78438 -79772 -81105 -82439 -83769 -85044 -86318 -87592 -88863 -87872 -86881 -83982
-2080 -83982 -83941 -86977 -85245 -80174 -77964 -78020 -80938 -84034 -84269 -82491 -80714 -81620 -82525 -82715 -82905 -80234 -77562 -78851 -80140
-2061 -80140 -83337 -83669 -79772 -80643 -80442 -77376 -77592 -80669 -84939 -92067 -94250 -93572 -91821 -90066 -87119 -84168 -81221 -78270
$$ packed form
-2189h1854o34o33P38P37P38P38l21l20l20l21l182l182J588J587M169M169J308J308o60o59
-2169g5006o60o59k731k731J30J31l268l268L410L409k478k478K292K295q68q68q69q64K411
-2150h2670K410m50m48k239k239O22L488L539j229k661K05n14K347j945j941k123k124k124
-2132i0096k120J393J394j587L185N951J184J301J304j919j915j621j617j114L659L834r32
-2115g9716l260l95Q53L719J256J259J434J439j845j840j845j840j427j424j128j126k798
-2098h8684J975L759R02m40m39K243K246j334j333j334j330j275j274j274j271R91R91K899
-2080h3982M1l036J732N071K210n6k918l096k35J778J777r06r05j90j90K671K672j289j289
-2061h0140l197l32L897q71K01L066k16l077m270p128k183O78J751J755K947K951K947K951
$$ plain form
-2043 -78270 -77111 -75949 -74790 -73628 -71127 -68624 -70893 -73158 -76917 -80673 -79962 -79246 -76023 -77566 -84060 -85781 -80710
-2026 -80710 -78497 -75632 -75625 -78095 -80561 -80349 -80133 -80517 -80897 -81281 -81661 -80532 -79399 -75409 -76183 -79466 -79883 -76489 -77860 -79280
-2006 -79280 -77834 -78300 -78762 -77081 -75397 -76578 -77756 -81787 -85815 -86687 -87555 -87413 -82499 -80271 -78039 -79045 -80047 -81053
-1988 -81053 -82056 -81869 -81679 -81493 -81303 -80971 -80636 -80304 -79969 -80353 -80733 -81117 -81497 -81478 -81456 -81437 -81415 -83542 -85666 -87793 -89917 -88483
-1966 -88483 -87044 -85610 -84172 -84168 -84161 -81295 -78426 -79928 -81426 -80066 -78702 -81575 -84444 -87316 -90185 -87849 -85513 -86038 -86564
-1947 -86564 -84585 -82607 -80628 -78650 -81232 -83814 -83535 -83255 -85301 -87346 -86530 -85714 -88103 -90491 -90018 -89545 -87044 -84544
-1929 -84544 -85263 -85983 -79511 -78762 -81172 -80722 -78989 -77257 -76716 -81899 -84224 -83684 -83684 -83680 -82458 -81232 -82871 -84507 -87108 -89705
-1909 -89705 -89444 -89179 -88144 -87104 -82849 -84313 -86601 -88885 -86758 -84630 -84503 -84373 -82812 -81251 -82652 -84049 -80677 -77305
$$ packed form
-2043g8270J159J162J159J162K501K503k269k265l759l756P11P16L223j543o494j721N071
-2026h0710K213K865Pk470k466K12K16l84l80l84l80J129J133L990p74l283m17L394j371j420
-2006g9280J446m66m62J681J684j181j178m031m028q72q68J42M914K228K232j006j002j006
-1988h1053j003J87J90J86J90L32L35L32L35l84l80l84l80J9K2J9K2k127k124k127k124J434
-1966h8483J439J434J438MPK866K869j502j498J360J364k873k869k872k869K336K336n25n26
-1947h6564J979J978J979J978k582k582K79K80k046k045Q16Q16k389k388M73M73K501K500
-1929h4544p19p20O472P49k410M50J733J732N41n183k325N40%MJ222J226j639j636k601k597
-1909h9705K61K65J035J040M255j464k288k284K127K128J27J30J561J561j401j397L372L372
$$ plain form
-1891 -77305 -77484 -77659 -74973 -72286 -77651 -83013 -83605 -84198 -83810 -83419 -81061 -81564 -83464 -79637 -78136 -76634 -71947 -72979 -78780
-1872 -78780 -78859 -78315 -77767 -76865 -75960 -75595 -75226 -79630 -84030 -84634 -85234 -82797 -80356 -80096 -76970 -75099 -78948 -79038 -79123 -78318 -77510
-1851 -77510 -79328 -84004 -88684 -87637 -86251 -82000 -80256 -81370 -80193 -79011 -78013 -77011 -78717 -80424 -78911 -83117 -87238
-1834 -87238 -91359 -89161 -86959 -85670 -84380 -84522 -84660 -80897 -77134 -78140 -79142 -78441 -77741 -77040 -76336 -79332 -82327 -85323
-1816 -85323 -88315 -89015 -89716 -87555 -85390 -83766 -82141 -83378 -84611 -83494 -82376 -84120 -85863 -84269 -82674 -80543 -84135
-1799 -84135 -89351 -91706 -91258 -90811 -90275 -89738 -90632 -91527 -92563 -93598 -89865 -86132 -85558 -84984 -85841 -86698 -86512 -86325 -86139 -85953
-1779 -85953 -88002 -90051 -92100 -94150 -92104 -90059 -88013 -85968 -85114 -84261 -83408 -82555 -85010 -87465 -89921 -92376 -89824 -87272
-1761 -87272 -84720 -82167 -81627 -81087 -80547 -80006 -81523 -83039 -84556 -86072 -86277 -86482 -85256 -84030 -87425 -90819 -89027 -81512
$$ packed form
-1891g7305j79j75K686K687n365n362n92n93L88L91K358n03j900L827J501J502M687j032n801
-1872g8780p9N44N48R02R05L65L69m404m400o04o00K437K441K60L126J871l849r0q5Q05Q08
-1851g7510j818m676m680J047J386M251J744j114J177J182R98J002j706j707J513m206m121
-1834h7238m121K198K202J289J290j42j38L763L763j006j002P01P00P01P04k996k995k996
-1816h5323k992p00p01K161K165J624J625j237j233J117J118j744j743J594J595K131l592
-1799h4135n216k355M48M47N36N37q94q95j036j035L733L733N74N74q57q57J86J87J86J86
-1779h5953k049k049k049k050K046K045K046K045Q54Q53Q53Q53k455k455k456k455K552K552
-1761h7272K552K553N40N40N40N41j517j516j517j516k05k05J226J226l395l394J792P515
$$ plain form
-1743 -81512 -76072 -73493 -77532 -81571 -84358 -87145 -87071 -86996 -89105 -91214 -88553 -85893 -85200 -84507 -83814 -83121 -85908 -88695 -91840
-1724 -91840 -89261 -85372 -81482 -79917 -78352 -79850 -78486 -75513 -78263 -79462 -80662 -82219 -83777 -82883 -81985 -81087 -80189 -80010
-1706 -80010 -79827 -79645 -79462 -80416 -81366 -82316 -83266 -83207 -83143 -83080 -83017 -85923 -88825 -88926 -86165 -82871 -85297 -87723 -84425 -79283 -76999
-1685 -76999 -79425 -81851 -80435 -79015 -79026 -79038 -80014 -80990 -82681 -78650 -74827 -76727 -79820 -82912 -82592 -82272 -81951 -81631 -81608 -81586
-1665 -81586 -81206 -80826 -81504 -76459 -74634 -72808 -73069 -73329 -76452 -79574 -78866 -78158 -77450 -76742 -76750 -76757 -79626 -82495 -80923 -79351 -77778
-1644 -77778 -76202 -77789 -79377 -78102 -76824 -77726 -78628 -82391 -86150 -82640 -79131 -78482 -77830 -79015 -80200 -76616 -73028 -72364
-1626 -72364 -71701 -73900 -76094 -75371 -74648 -73926 -73199 -73847 -74496 -75144 -75789 -76929 -78065 -79205 -80342 -75699 -71053 -71180 -71303 -73069
-1606 -73069 -74831 -73378 -77644 -80483 -83319 -81746 -80170 -80424 -80673 -80927 -81176 -78330 -75479 -75494 -75505 -77100 -78691 -80286 -81877
$$ packed form
-1743h1512N440K579m039m039k787k787P4P5k109k109K661K660O93O93O93O93k787k787l145
-1724i1840K579L889L890J565J565j498J364K973k750j199j200j557j558Q94Q98Q98Q98J79
-1706h0010J83J82J83r54r50r50r50N9O4O3O3k906k902j01K761L294k426k426L298N142K284
-1685g6999k426k426J416J420j1j2r76r76j691M031L823j900l093l092L20L20L21L20K3K2
-1665h1586L80L80o78N045J825J826k61k60l123l122P08P08P08P08qpk869k869J572J572J573
-1644g7778J576j587j588J275J278r02r02l763l759L510L509O49O52j185j185L584L588O64
-1626g2364O63k199k194P23P23P22P27o48o49o48o45j140j136j140j137M643M646j27j23j766
-1606g3069j762J453m266k839k836J573J576k54k49k54k49K846K851j5j1j595j591j595j591
$$ plain form
-1587 -81877 -79894 -77909 -78788 -79663 -79123 -78583 -78043 -77502 -80122 -82741 -82499 -82257 -80673 -79090 -80368 -81646 -79645 -77644 -73139
-1568 -73139 -68635 -69384 -75856 -79108 -82361 -83825 -85290 -86754 -88218 -85957 -83695 -84295 -84895 -82871 -80848 -79123 -77398 -74034
-1550 -74034 -75438 -77022 -78605 -80070 -81534 -80137 -78739 -75725 -72711 -74466 -76221 -77439 -78657 -79876 -81094 -80170 -79242
-1533 -79242 -81180 -83114 -82905 -82693 -82484 -82272 -82607 -82939 -80412 -77883 -81020 -84153 -84429 -84701 -85569 -86437 -84444 -82450 -83080 -83710
-1513 -83710 -87201 -90692 -86612 -82532 -81314 -80096 -78639 -77182 -75725 -74268 -77514 -80755 -83702 -86646 -85897 -80375 -80520
-1496 -80520 -83524 -84176 -81962 -76772 -71578 -74853 -78125 -78538 -78948 -78453 -77953 -77458 -76958 -75390 -73818 -75110 -76400 -78110 -79816
-1477 -79816 -81526 -83233 -85480 -87723 -85200 -82674 -77834 -72990 -72920 -72845 -73549 -74250 -74954 -75654 -74749 -73840 -73888 -76795 -78751 -75934
-1457 -75934 -75982 -80796 -85040 -86422 -82260 -82864 -79894 -76925 -77115 -77301 -77044 -76787 -79391 -81992 -83285 -84578 -83009 -81437 -79548
$$ packed form
-1587h1877J983J985q79q75N40N40N40N41k620k619K42K42J584J583j278j278K001K001M505
-1568g3139M504p49o472l252l253j464j465j464j464K261K262o00o00K024K023J725J725L364
-1550g4034j404j584j583j465j464J397J398L014L014j755j755j218j218j219j218R24R28
-1533g9242j938j934K09K12K09K12l35l32K527K529l137l133k76k72q68q68J993J994o30o30
-1513h3710l491l491M080M080J218J218J457J457J457J457l246l241k947k944P49N522j45
-1496h0520l004o52K214N190N194l275l272m13m10M95N00M95N00J568J572j292j290j710j706
-1477g9816j710j707k247k243K523K526M840M844P0P5p04p01p04p00R05R09m8k907j956K817
-1457g5934m8m814m244j382M162o04K970K969j90j86K57K57k604k601j293j293J569J572J889
$$ plain form
-1438 -79548 -77659 -78631 -79600 -79321 -79041 -81623 -84202 -82968 -81735 -80502 -79265 -80356 -81448 -82540 -83628 -84064 -84496 -83024
-1420 -83024 -84410 -85979 -82775 -82436 -82093 -84079 -86061 -85185 -84306 -81880 -79451 -77204 -79723 -82313 -84898 -87786 -85901 -80442
-1402 -80442 -77842 -78106 -78367 -78721 -79071 -76564 -74052 -75777 -77499 -79224 -80945 -82838 -84731 -81854 -78974 -79854 -80733 -78751
-1384 -78751 -76765 -76392 -76020 -78508 -80994 -82827 -84660 -83632 -79738 -76429 -77890 -83941 -85219 -85308 -85398 -84891 -84380 -84440 -79731
-1365 -79731 -74842 -74719 -75494 -73408 -70248 -71854 -78255 -79883 -81634 -83382 -82868 -82350 -81836 -81318 -81564 -81806 -82052 -82294 -82540 -82782
-1345 -82782 -83028 -83270 -81780 -80286 -78795 -77301 -76824 -76344 -78430 -80513 -80669 -76053 -72812 -72428 -72465 -77268 -81180 -82227 -83252
-1326 -83252 -84272 -85118 -85960 -86448 -86933 -87421 -87905 -86389 -84869 -83352 -81832 -81687 -81538 -81392 -81243 -79205 -77163 -77987 -78807 -79809
-1306 -79809 -80807 -79365 -77920 -73900 -76552 -82368 -81504 -77365 -77991 -79991 -79127 -79116 -79105 -79093 -79082 -76508 -76795 -75591 -69618 -68952
$$ packed form
-1438g9548J889r72r69K79K80k582k579J234J233J233J237j091j092j092j088m36m32J472
-1420h3024j386j569L204L39L43j986j982Q76Q79K426K429K247k519k590k585k888J885N459
-1402h0442K600k64k61l54l50K507K512j725j722j725j721j893j893K877K880q80q79J982
-1384g8751J986L73L72k488k486j833j833J028L894L309j461o051j278q9r0N07N11o0M709
-1365g9731M889J23p75K086L160j606o401j628j751j748N14N18N14N18k46k42k46k42k46k42
-1345h2782k46k42J490J494J491J494M77M80k086k083j56M616L241L84l7m803l912j047j025
-1326h3252j020q46q42m88m85m88m84J516J520J517J520J45J49J46J49K038K042q24q20j002
-1306g9809r98J442J445M020k652n816Q64M139o26k000Q64J1J1J2J1K574k87J204N973O66
$$ plain form
-1286 -68952 -73054 -77037 -81020 -82797 -84574 -86351 -88129 -87812 -87495 -87179 -86862 -88572 -90282 -88952 -87622 -90517 -90551 -84742
-1268 -84742 -83702 -82842 -81981 -81418 -80856 -78125 -75390 -75520 -75647 -78400 -81150 -81042 -80930 -82588 -84243 -82920 -86363 -86351 -81567
-1249 -81567 -79768 -77964 -78698 -79432 -77305 -75178 -77283 -79388 -81493 -83598 -83788 -83978 -84168 -84358 -83296 -82234 -84034 -85834
-1231 -85834 -85543 -85249 -84958 -84664 -83836 -83006 -82178 -81348 -81974 -82596 -83222 -83844 -81191 -78535 -78743 -78948 -78445 -77942 -77439 -76936 -75002
-1210 -75002 -73069 -73996 -74924 -75882 -76839 -77797 -78754 -81202 -83650 -85919 -83419 -82156 -80893 -79332 -77771 -74540 -71310 -72849
-1192 -72849 -74388 -76537 -78687 -80539 -82391 -88356 -89552 -86754 -83956 -83445 -82935 -82424 -81914 -82655 -83397 -86821 -85476 -80852
-1174 -80852 -76228 -73393 -75327 -77380 -79432 -84466 -84731 -82033 -79332 -81105 -82875 -83039 -83199 -80502 -77801 -76415 -75025 -76500
-1156 -76500 -77972 -79328 -80681 -82037 -83389 -84000 -84608 -85219 -85826 -85901 -85971 -86046 -86117 -84023 -81925 -82693 -83456 -84164 -84869 -82357 -85565
$$ packed form
-1286f8952m102l983l983j777j777j777j778L17L17L16L17j710j710J330J330k895l4N809
-1268h4742J040Q60Q61N63N62K731K735j30j27k753k750J08J12j658j655J323l443J2M784
-1249h1567J799J804p34p34K127K127k105k105k105k105j90j90j90j90J062J062j800j800
-1231h5834K91K94K91K94Q28Q30Q28Q30o26o22o26o22K653K656k08k05N03N03N03N03J934
-1210g5002J933r27r28r58r57r58r57k448k448k269K500J263J263J561J561L231L230j539
-1192g2849j539k149k150j852j852n965j196K798K798N11N10N11N10p41p42l424J345M624
-1174h0852M624K835j934k053k052n034k65K698K701j773j770j64j60K697K701J386J390j475
-1156g6500j472j356j353j356j352o11o08o11o07p5p0p5p1K094K098p68p63p08p05K512l208
$$ plain form
-1135 -85565 -85282 -84999 -85073 -85148 -85401 -85655 -85908 -86161 -88151 -90141 -89269 -88397 -86035 -83673 -81310 -78948 -79306 -79663 -80021 -80379 -76981
-1114 -76981 -73583 -76862 -80140 -84000 -87860 -91542 -95223 -93718 -89351 -86236 -88844 -87659 -86471 -85644 -84813 -86191 -87566
-1097 -87566 -85368 -88889 -92890 -91165 -93021 -94873 -92674 -90472 -89466 -94180 -95707 -91508 -88028 -84544 -83330 -82111 -80897
-1080 -80897 -79678 -81281 -82879 -84123 -85364 -87264 -83438 -79436 -81154 -80737 -77454 -79004 -80550 -80491 -80427 -80368 -80304 -79306 -78304
-1061 -78304 -80166 -82026 -81743 -81456 -81172 -80886 -80833 -80778 -83587 -86392 -85863 -85331 -84801 -84269 -79954 -75636 -74600 -79283 -84388 -86627
-1041 -86627 -86068 -85506 -84585 -83661 -82741 -81817 -84533 -87246 -86743 -86236 -87849 -83736 -82488 -86959 -86784 -86605 -86787 -86966 -84753 -82540
-1021 -82540 -77108 -77398 -81385 -85372 -84947 -84522 -82845 -81169 -82354 -83538 -81683 -79827 -79164 -84224 -84377 -78807 -73594 -74104
-1003 -74104 -77894 -81683 -79153 -76623 -78684 -80744 -78035 -75327 -76552 -77778 -79004 -80230 -80632 -81031 -81433 -81832 -79909 -77983
$$ packed form
-1135h5565K83K83p4p5k53k54k53k53j990j990Q72Q72K362K362K363K362l58l57l58l58L398
-1114g6981L398l279l278l860l860l682l681J505M367L115k608J185J188Q27Q31j378j375
-1097h7566K198l521m001J725j856j852K199K202J006m714j527M199L480L484J214J219J214
-1080h0897J219j603j598j244j241j900L826M002j718M17L283j550j546N9O4N9O4R98J002
-1061g8304j862j860K83K87K84K86N3N5k809k805N29N32N30N32M315M318J036m683n105k239
-1041h6627N59N62R21R24R20R24k716k713N03N07j613M113J248m471J75J79j82j79K213K213
-1021h2540N432k90l987l987M25M25J677J676j185j184J855J856O63n060j53N570N213n10
-1003g4104l790l789K530K530k061k060K709K708j225j226j226j226m02l99m02l99J923J926
$$ plain form
-985 -77983 -76061 -74134 -74805 -75472 -75248 -72160 -70863 -75286 -79533 -78054 -76895 -75733 -74216 -72696 -71895 -71090 -70289 -69484 -70315
-966 -70315 -71142 -71973 -72800 -73691 -74578 -75647 -76713 -78486 -83121 -84775 -80707 -79440 -81035 -80662 -80289 -80073 -79857 -79641 -79425 -80580
-946 -80580 -81735 -82890 -84045 -82901 -81757 -83475 -85193 -81724 -78255 -77648 -77040 -80755 -84470 -83415 -82361 -79459 -76556 -76515
-928 -76515 -76474 -77890 -79302 -80718 -82130 -80923 -79712 -78684 -77651 -79246 -83699 -87082 -84738 -80908 -79935 -81769 -80737 -78587
-910 -78587 -81202 -80662 -80118 -82022 -79153 -78970 -78784 -79913 -81038 -81988 -82935 -84123 -82447 -79403 -81124 -85331 -84764 -85275 -88643
-891 -88643 -91299 -89183 -87071 -84954 -85137 -85316 -85498 -85677 -84012 -82342 -80677 -79008 -79704 -80397 -81094 -81787 -80815 -79839 -78866 -77890
-871 -77890 -77052 -76210 -75371 -74529 -71902 -69272 -69507 -69738 -72864 -75986 -76251 -76511 -77074 -77633 -78195 -78754 -76858 -74958 -75923 -76884 -78207
-850 -78207 -79526 -80848 -82167 -83602 -85036 -83609 -82182 -82305 -82428 -79690 -76951 -77685 -78419 -79153 -79887 -82052 -84217 -83520 -82823
$$ packed form
-985g7983J922J927o71o67K24L088J297m423m247J479J159J162J517J520Q01Q05Q01Q05q31
-966g0315q27q31q27q91q87j069j066j773m635j654M068J267j595L73L73K16K16K16K16j155
-946h0580j155j155j155J144J144j718j718L469L469O07O08l715l715J055J054K902K903M1
-928g6515M1j416j412j416j412J207J211J028J033j595m453l383K344L830R73j834J032K150
-910g8587k615N40N44j904K869J83J86j129j125r50r47j188J676L044j721m207N67n11l368
-891h8643k656K116K112K117j83j79j82j79J665J670J665J669o96o93o97o93R72R76R73R76
-871g7890Q38Q42Q39Q42K627K630k35k31l126l122k65k60n63n59n62n59J896J900r65r61j323
-850g8207j319j322j319j435j434J427J427j23j23K738K739p34p34p34p34k165k165O97O97
$$ plain form
-831 -82823 -84168 -85513 -86858 -88203 -83110 -78017 -77692 -77368 -77491 -77614 -79645 -78814 -77387 -80729 -81210 -81690 -79570 -77447 -78188
-812 -78188 -78926 -78594 -78259 -77927 -77592 -79868 -82141 -81556 -80968 -79667 -78363 -79924 -81482 -79928 -78371 -76817 -75259 -73944 -72625
-793 -72625 -74172 -75714 -77767 -79816 -85804 -85111 -80189 -78125 -82324 -83658 -81240 -78818 -76221 -73620 -75494 -77365 -79239
-776 -79239 -81109 -80479 -79846 -79216 -78583 -75986 -73385 -75558 -77726 -78780 -79831 -80886 -81936 -79533 -77126 -77584 -78039 -77901 -77760
-757 -77760 -77622 -77480 -76090 -74697 -74261 -76683 -78795 -76139 -78251 -77502 -77171 -81608 -80323 -79038 -80301 -81564 -80919 -83136 -88155
-738 -88155 -88404 -88654 -88904 -85532 -82160 -83557 -84954 -81403 -77853 -80979 -84105 -81493 -78881 -76269 -73657 -75218 -76780 -78341
-720 -78341 -79902 -79194 -78486 -80640 -82793 -83278 -83762 -81385 -79008 -79507 -80006 -83188 -81601 -82518 -83434 -84053 -84671 -84805 -84939 -85073
-700 -85073 -85208 -84149 -83091 -82331 -81571 -78203 -79604 -82078 -77875 -78441 -79008 -79157 -79306 -79917 -80528 -81139 -81750 -79261 -76772 -74283
$$ packed form
-831h2823j345j345j345j345N093N093L25L24j23j23k031Q31J427l342m81m80K120K123p41
-812g8188p38L32L35L32L35k276k273N85N88J301J304j561j558J554J557J554J558J315J319
-793g2625j547j542k053k049n988O93M922K064m199j334K418K422K597K601j874j871j874
-776g9239j870O30O33O30O33K597K601k173k168j054j051j055j050K403K407m58m55J38J41
-757g7760J38J42J390J393M36k422k112K656k112P49L31m437J285J285j263j263O45k217n019
-738h8155k49k50k50L372L372j397j397L551L550l126l126K612K612K612K612j561j562j561
-720g8341j561P08P08k154k153m85m84K377K377m99m99l182J587r17r16o19o18j34j34j34
-700h5073j35J059J058P60P60L368j401k474M203n66n67j49j49o11o11o11o11K489K489K489
$$ plain form
-680 -74283 -71794 -74373 -76951 -79231 -81512 -86296 -86310 -84537 -85625 -82875 -80125 -78508 -79753 -83084 -81646 -77525 -78173 -77599
-662 -77599 -77026 -79313 -81601 -83889 -81407 -81608 -81810 -83453 -85096 -87097 -83374 -82335 -81295 -79898 -78501 -78549 -78598 -78646 -78695 -79935
-642 -79935 -81176 -82417 -83658 -83192 -82726 -82260 -81795 -81240 -80684 -80129 -79574 -82104 -84634 -83766 -85759 -89153 -86825 -86642 -83598 -82458
-622 -82458 -81314 -82857 -84395 -81526 -78654 -75785 -72912 -75349 -77782 -80219 -82652 -81064 -79473 -76455 -73434 -75863 -78289
-605 -78289 -75949 -73605 -68732 -63855 -63750 -63642 -61094 -58541 -50628 -42710 -34439 -16625 7503 41174 89204 150592
-589 150592 213407 251426 238530 181763 117838 63454 26117 2137 -14095 -30325 -43340 -50628 -56071 -58649
-575 -58649 -61679 -64704 -67554 -70401 -70688 -70971 -71258 -71541 -72156 -72767 -73382 -73993 -70882 -67767 -66086 -64402 -64741 -65080 -68281 -71481
-555 -71481 -72446 -73411 -74376 -75341 -76068 -76795 -77521 -78248 -79481 -80714 -79086 -77458 -77007 -76556 -77536 -78516 -76843 -75170 -73497 -71824
$$ packed form
-680g4283K489k579k578k280k281m784j4J773j088K750K750J617j245l331J438M121o48N74
-662g7599N73k287k288k288K482k01k02j643j643k001L723J039J040J397J397m8m9m8m9j240
-642g9935j241j241j241M66M66M66M65N55N56N55N55k530k530Q68j993l394K328J83L044J140
-622h2458J144j543j538K869K872K869K873k437k433k437k433J588J591L018L021k429k426
-605g8289K340K344M873M877J05J08K548K553P913P918Q271J7814K4128L3671M8030O1388
-589A50592O2815L8019j2896n6767o3925n4384l7337k3980j6232j6230j3015p288n443k578
-575e8649l030l025k850k847k87k83k87k83o15o11o15o11L111L115J681J684l39l39l201l200
-555g1481r65r65r65r65p27p27p26p27j233j233J628J628M51M51r80r80J673J673J673J673
$$ plain form
-535 -71824 -69197 -66571 -63944 -61317 -62267 -63217 -64167 -65118 -67409 -69700 -71992 -74283 -73654 -73024 -72394 -71765 -70762 -69760 -71619
-516 -71619 -73479 -73102 -72726 -72350 -71973 -71388 -70803 -71649 -72495 -74235 -75975 -74853 -73732 -74175 -74619 -76314 -78009 -79198 -77525 -77461
-496 -77461 -82167 -81713 -78397 -76869 -80111 -83471 -82063 -77793 -78292 -80506 -77950 -75513 -73076 -73918 -74760 -75602 -76444 -76884 -77324
-477 -77324 -77763 -78203 -78464 -78725 -78985 -79246 -80714 -82182 -80789 -79395 -79552 -79708 -77003 -74298 -73978 -73654 -73333 -73009 -74000 -74987 -78840
-456 -78840 -82689 -81430 -80166 -78907 -77644 -77189 -76731 -76277 -75818 -77208 -78598 -78557 -78516 -77670 -76824 -75859 -79663 -83602 -82771 -78542
-436 -78542 -77175 -77864 -78553 -79421 -80289 -82253 -84217 -84570 -84924 -88110 -88434 -84645 -85625 -85114 -81743 -83140 -84537 -86769 -89001
-417 -89001 -91232 -88695 -86869 -87901 -86076 -81385 -78665 -80710 -78467 -76221 -77361 -78497 -78207 -77912 -78337 -78758 -79183 -79604 -80915
-398 -80915 -82223 -83535 -84842 -87883 -90919 -89191 -84597 -80558 -81284 -85234 -86318 -90387 -89682 -86717 -83747 -83162 -82573 -81988
$$ packed form
-535g1824K627K626K627K627r50r50r50r51k291k291k292k291O29O30O30O29J003J002j859
-516g1619j860L77L76L76L77N85N85q46q46j740j740J122J121m43m44j695j695j189J673O4
-496g7461m706M54L316J528l242l360J408M270m99k214K556K437K437q42q42q42q42m40m40
-477g7324m39m40k61k61k60k61j468j468J393J394j57j56K705K705L20L24L21L24r91r87l853
-456g8840l849J259J264J259J263M55M58M54M59j390j390M1M1Q46Q46R65l804l939Q31M229
-436g8542J367o89o89q68q68j964j964l53l54l186l24L789r80N11L371j397j397k232k232
-417h9001k231K537J826j032J825M691K720k045K243K246j140j136K90K95m25m21m25m21j311
-398h0915j308j312j307l041l036J728M594M039p26l950j084m069P05K965K970N85N89N85
$$ plain form
-380 -81988 -81400 -79622 -77842 -78926 -80006 -81001 -81992 -82987 -83978 -84019 -84056 -84097 -84135 -85334 -86530 -81351 -76169 -75640 -79876 -84116 -83583
-359 -83583 -82070 -80554 -81485 -85275 -89187 -86419 -84727 -80170 -76932 -78460 -76176 -71027 -69697 -73132 -78479 -83822 -85711
-342 -85711 -87596 -89485 -91370 -89802 -88229 -89522 -90811 -89571 -88330 -87387 -86445 -79898 -78121 -79384 -75878 -76224 -79432 -82342
-324 -82342 -82391 -83035 -83680 -84146 -84611 -85483 -86355 -84366 -82376 -83963 -85550 -84276 -83002 -83374 -83747 -84120 -84492 -82003 -79514 -81795
-304 -81795 -84075 -82231 -80383 -78538 -76690 -78244 -79794 -81348 -82898 -82171 -81441 -82622 -80938 -80271 -84369 -85610 -86847 -81593
-286 -81593 -76336 -74898 -78225 -83762 -86433 -86247 -86057 -86772 -87484 -85338 -83188 -81996 -80800 -79608 -78412 -78285 -78158 -78032 -77905
-267 -77905 -79269 -80632 -81996 -83360 -85491 -87622 -87249 -86877 -82093 -83032 -83613 -84194 -83866 -83538 -83211 -82883 -85237 -87592 -87085 -86579
-247 -86579 -83330 -80081 -79693 -79306 -80409 -81512 -79932 -78352 -78874 -82257 -87249 -86519 -84179 -81839 -83911 -85983 -85416 -84850 -82316
$$ packed form
-380h1988N88J778J780j084j080r95r91r95r91m1l7m1l8j199j196N179N182N29m236m240N33
-359h3583J513J516r31l790l912K768J692M557L238j528K284N149J330l435n347n343j889
-342h5711j885j889j885J568J573j293j289J240J241R43R42O547J777j263L506l46l208k910
-324h2342m9o44o45m66m65q72q72J989J990j587j587J274J274l72l73l73l72K489K489k281
-304h1795k280J844J848J845J848j554j550j554j550P27P30j181J684O67m098j241j237N254
-286h1593N257J438l327n537k671J86J90p15p12K146K150J192J196J192J196J27J27J26J27
-267g7905j364j363j364j364k131k131L73L72M784r39n81n81L28L28L27L28k354k355N07N06
-247h6579L249L249L88L87j103j103J580J580n22l383m992P30K340K340k072k072N67N66K534
$$ plain form
-228 -82316 -82644 -87562 -86758 -82972 -82048 -82540 -83032 -80841 -78650 -81228 -83807 -83524 -83240 -81668 -80096 -77987 -81601 -84619 -84775
-209 -84775 -82428 -82942 -83676 -84407 -82458 -80506 -80345 -80181 -80021 -79857 -82193 -84526 -86862 -89194 -88907 -88617 -88330 -88039 -87700 -87357
-189 -87357 -87018 -86676 -84846 -83013 -85595 -88173 -90867 -87834 -84805 -87495 -88401 -89302 -87764 -83360 -79160 -80684 -81672 -82659 -81560
-170 -81560 -80461 -79362 -78263 -79675 -81087 -79637 -78188 -79362 -80535 -81709 -82883 -85122 -87361 -89958 -86832 -85077 -83322
-153 -83322 -84071 -84820 -86866 -88911 -88095 -87279 -88192 -89105 -87156 -85208 -86128 -87048 -87968 -88889 -88021 -87153 -89146 -91135 -90998 -90860 -90543
-132 -90543 -90226 -93188 -93289 -92317 -96110 -94582 -93051 -91821 -90588 -90551 -90510 -90469 -90428 -90681 -90931 -91184 -91434 -87275 -83114 -82111 -81109
-111 -81109 -76672 -76999 -79119 -81236 -83952 -81895 -79842 -82555 -80725 -78892 -80222 -81549 -79481 -77409 -80111 -82808 -84656
-94 -84656 -86504 -83583 -80662 -81079 -81497 -81914 -82331 -82219 -82108 -81996 -81884 -81772 -81661 -81549 -81437 -82499 -83561 -84444 -85323 -82391 -76593
$$ packed form
-228h2316l28m918Q04L786R24m92m92K191K191k578k579K83K84J572J572K109l614l018j56
-209h4775K347n14p34p31J949J952J61J64J60J64k336k333k336k332K87K90K87K91L39L43
-189h7357L39L42J830J833k582k578k694L033L029k690r06r01J538M404M200j524r88r87J099
-170h1560J099J099J099j412j412J450J449j174j173j174j174k239k239k597L126J755J755
-153h3322p49p49k046k045Q16Q16r13r13J949J948r20r20r20r21Q68Q68j993j989J37J38L17
-132i0543L17k962j01R72l793J528J531J230J233L7M1M1M1k53k50k53k50M159M161J003J002
-111h1109M437l27k120k117k716K057K053k713J830J833j330j327K068K072k702k697j848
-94h4656j848K921K921m17m18m17m17J12J11J12J12J12J11J12J12j062j062q83q79K932N798
$$ plain form
-73 -76593 -76403 -80979 -81996 -83013 -79559 -76102 -75330 -74555 -76646 -78732 -79302 -79872 -80442 -81009 -78956 -76899 -77707 -78512 -80483 -82454
-53 -82454 -84425 -86392 -80852 -75308 -74537 -73762 -74764 -75762 -76765 -77763 -77692 -77618 -77249 -76877 -81403 -81158 -80737 -80312 -78758 -77201 -75647
-32 -75647 -74090 -73169 -72245 -74186 -76124 -76813 -77499 -78188 -78874 -78661 -78445 -78233 -78017 -80129 -82238 -81489 -80737 -79410 -78080 -76754
-12 -76754 -75423 -76839 -78251 -82529 -86802 -85334 -83863 -82395 -80923 -82078 -83229 -84384 -85535 -87585 -89630 -88818 -88002 -87369
5 -87369 -86731 -88960 -91184 -90871 -90554 -87380 -84202 -84664 -85122 -85584 -86042 -83114 -80181 -76895 -79328 -80215 -81098 -79481 -77860 -77883 -77901
26 -77901 -77923 -77942 -75640 -73333 -71031 -68724 -70975 -73221 -75472 -77719 -82056 -86389 -84049 -81705 -81005 -80301 -79600 -78896 -80699 -82499
46 -82499 -84302 -86102 -83427 -80751 -79269 -83509 -87987 -86743 -79179 -77339 -76809 -76280 -76109 -75938 -79760 -83583 -84544 -85506 -84872
65 -84872 -84239 -86109 -87980 -88837 -83971 -81966 -85685 -85260 -84835 -84768 -84701 -83799 -82898 -81996 -81094 -79637 -78177 -79224 -80267 -82864 -79734
$$ packed form
-73g6593J90m576j017j017L454L457P72P75k091k086n70n70n70n67K053K057q08q05j971j971
-53h2454j971j967N540N544P71P75j002r98j003r98P1P4L69L72m526K45M21M25J554J557J554
-32g5647J557R21R24j941j938o89o86o89o86K13K16K12K16k112k109P49P52J327J330J326
-12g6754J331j416j412m278m273J468J471J468J472j155j151j155j151k050k045Q12Q16O33
5h7369O38k229k224L13L17L174L178m62m58m62m58K928K933L286k433q87q83J617J621k3j8
26g7901k2j9K302K307K302K307k251k246k251k247m337m333K340K344P00P04P01P04j803j800
46h2499j803j800K675K676J482m240m478J244P564J840N30N29J71J71l822l823r61r62O34
65h4872O33j870j871q57M866K005l719M25M25O7O7R02R01R02R02J457J460j047j043k597L130
$$ plain form
86 -79734 -76966 -74194 -75993 -77789 -79589 -81385 -84019 -86650 -84515 -82376 -81884 -81389 -80897 -80401 -79790 -79175 -78564 -77950 -79119 -80286
106 -80286 -78594 -76899 -73419 -69935 -71224 -72510 -74291 -76072 -77674 -79276 -76884 -71630 -69358 -72808 -74589 -73508 -74395 -75282
124 -75282 -76705 -78128 -76869 -75610 -76403 -80058 -85323 -84865 -84228 -83591 -79734 -75878 -75613 -75349 -75084 -74820 -71396 -67972 -69317
143 -69317 -70662 -74794 -78922 -78285 -77644 -78855 -80062 -81452 -82838 -84123 -88267 -87525 -81057 -77514 -76828 -74537 -72242 -71858 -77193
162 -77193 -80923 -81787 -82715 -83639 -81526 -79410 -82380 -85345 -81638 -77927 -77797 -77663 -77532 -77398 -78475 -79552 -80628 -81705 -82246
181 -82246 -82786 -80822 -78859 -76135 -79134 -80524 -79052 -80561 -82070 -80539 -79008 -78848 -78687 -83296 -87905 -85897 -83889 -81523
199 -81523 -79157 -83289 -81698 -78855 -78874 -76388 -73903 -74458 -75014 -72901 -70788 -71537 -72286 -76612 -80938 -80494 -80051 -78997 -77942
218 -77942 -79749 -81556 -81456 -81355 -81254 -81154 -81318 -81478 -81642 -81802 -82681 -83557 -84436 -85312 -85610 -85904 -86202 -86497 -84828 -83155 -81784
$$ packed form
86g9734K768K772j799j796j800j796k634k631K135K139M92M95M92M96O11O15O11O14j169j167
106h0286J692J695L480L484j289j286j781j781j602j602K392N254K272l450j781J081q87q87
124g5282j423j423J259J259p93l655n265M58O37O37L857L856K65K64K65K64L424L424j345
143f9317j345m132m128O37O41j211j207j390j386j285m144P42O468L543O86K291K295L84n335
162g7193l730q64r28r24K113K116k970k965L707L711J30J34J31J34j077j077j076j077n41
181h2246n40J964J963K724k999j390J472j509j509J531J531J60J61m609m609K008K008K366
199h1523K366m132J591K843j9K486K485n55n56K113K113p49p49m326m326M44M43J054J055
218g7942j807j807J00J01J01J00j64j60j64j60q79q76q79q76k98k94k98k95J669J673J371
$$ plain form
239 -81784 -80409 -78408 -81172 -84120 -87063 -83333 -79600 -78732 -77860 -77201 -76537 -80647 -84753 -82782 -80807 -78836 -76862 -76474 -76087
258 -76087 -75699 -75312 -75938 -76564 -77189 -77815 -81005 -84194 -84343 -84492 -84880 -82406 -81720 -85804 -86310 -86817 -87622 -88423 -84757 -81090 -83922
279 -83922 -86750 -89671 -89731 -85856 -86746 -85614 -84481 -83646 -82808 -81936 -81064 -77331 -78363 -77968 -74712 -76523 -81191 -82123 -83054 -83866
299 -83866 -84675 -87633 -85822 -84787 -86609 -89705 -88032 -84749 -81467 -78065 -79432 -78296 -77160 -75025 -75751 -80591 -80662 -80375 -82950
318 -82950 -85226 -84641 -83203 -81761 -83006 -84246 -84179 -84108 -84041 -83971 -81370 -78766 -80934 -83099 -81869 -80636 -79406 -78173 -78717 -79257
338 -79257 -79798 -80338 -81597 -82853 -79339 -75826 -75744 -75658 -78434 -81210 -83035 -84857 -81910 -78963 -74414 -69864 -71813 -73758 -76601
357 -76601 -76582 -74239 -78568 -81202 -80975 -79913 -78848 -76116 -73385 -71012 -68635 -68996 -75077 -79552 -81161 -79079 -76992 -77592 -78188
376 -78188 -77298 -76403 -75513 -74619 -76530 -78438 -80707 -77249 -76977 -76701 -78933 -81161 -82618 -84071 -80759 -77443 -77856 -78266 -80647
$$ packed form
239h1784J375K001k764k948k943L730L733Q68Q72O59O64m110m106J971J975J971J974L88L87
258g6087L88L87o26o26o25o26l190l189j49j49l88K474O86m084n06n07q05q01L666L667k832
279h3922k828k921o0L875q90J132J133Q35Q38Q72Q72L733j032L95L256j811m668r32r31q12
299h3866q09k958J811J035j822l096J673L283L282L402j367J136J136K135p26m840p1K87k575
318h2950k276N85J438J442j245j240O7P1O7P0K601K604k168k165J230J233J230J233n44n40
338g9257n41n40j259j256L514L513Q2Q6k776k776j825j822K947K947M549M550j949j945k843
357g6601J9K343m329k634K27J062J065K732K731K373K377l61o081m475j609K082K087o00n96
376g8188Q90Q95Q90Q94j911j908k269L458K72K76k232k228j457j453L312L316m13m10k381
$$ plain form
395 -80647 -80163 -74376 -74309 -76869 -76564 -77920 -73549 -73296 -75900 -78508 -78251 -79786 -81318 -80647 -79973 -79302 -78628 -81057 -83483 -85912
415 -85912 -88337 -89798 -91255 -92536 -93814 -94619 -92559 -86031 -85223 -83628 -82029 -80792 -79552 -82190 -84824 -84600 -84373 -85819
433 -85819 -87261 -85845 -84425 -84440 -84451 -82499 -83404 -85431 -81731 -76962 -75051 -75409 -75762 -76299 -76832 -78501 -80166 -81836 -83501 -83024
453 -83024 -82544 -82067 -81586 -84895 -88199 -94727 -95528 -91564 -87596 -84824 -87771 -89079 -90383 -89187 -87987 -85897 -83803 -81713
471 -81713 -79619 -76962 -74302 -72838 -77093 -82901 -82983 -83784 -84582 -84362 -84138 -83918 -83695 -86575 -89451 -89470 -89485 -87059 -84630 -82026
491 -82026 -79418 -80569 -78855 -75535 -77935 -80517 -83099 -83177 -83255 -83274 -83292 -83311 -83330 -82082 -80833 -79585 -78337 -76850 -75364 -78646
511 -78646 -81929 -79891 -77853 -80584 -83315 -83661 -84008 -84354 -84701 -84138 -83576 -83013 -82450 -82424 -82398 -82372 -82346 -83758 -85167 -83717 -82264
532 -82264 -79801 -77335 -74872 -72405 -74145 -75882 -77622 -79358 -80383 -81403 -80461 -82376 -86478 -84854 -83412 -81966 -85114 -82536
$$ packed form
395h0647M84N787O7k560L05j356M371K53k604k608K57j535j532O71O74O71O74k429k426k429
415h5912k425j461j457j281j278q05K060O528Q08J595J599J237J240k638k634K24K27j446
433h5819j442J416J420j5j1J952r05k027L700M769J911l58l53n37n33j669j665j670j665M77
453h3024M80M77M81l309l304o528q01L964L968K772k947j308j304J196J200K090K094K090
471h1713K094K657K660J464m255n808q2q01p98K20K24K20K23k880k876j9j5K426K429K604
491h2026K608j151J714L320k400k582k582p8p8j9j8j9j9J248J249J248J248J487J486l282
511g8646l283K038K038k731k731l46l47l46l47N63N62N63N63K6K6K6K6j412j409J450J453
532h2264K463K466K463K467j740j737j740j736j025j020R42j915m102J624J442J446l148K578
$$ plain form
550 -82536 -77100 -77383 -80353 -83319 -83784 -84246 -83520 -82790 -82063 -81333 -82518 -83699 -84883 -86065 -84746 -83423 -84965 -86504 -87987
$$ packed form
550h2536N436k83k970k966m65m62P26P30P27P30j185j181j184j182J319J323j542j539j483
$$ [...]
##END=	
