##TITLE=	+bpudXegQOmMA+i0Fl4Dlg/4489s
##JCAMPDX=	6.0	$$ NMR Plug-in 1.13 of MestReNova 11.0.4-18998
##DATATYPE=	NMRSPECTRUM
##DATACLASS=	XYDATA
##NUMDIM=	1
##ORIGIN=	Bruker BioSpin GmbH
##OWNER=	andrew
##.OBSERVEFREQUENCY=	600.30184456100005264
##.OBSERVENUCLEUS=	^1H
##.SOLVENTNAME=	CD2Cl2
##.PULSESEQUENCE=	zg
##LONGDATE=	2015/06/05 10:59:49.000
##.ACQUISITIONMODE=	SIMULTANEOUS (DQD)
##$ORIGINALFORMAT=	Bruker XWIN-NMR
##$PARAMETERFILE=	(acqus, ASCII, /var/folders/f6/rjf_tdyn2v98c5c0wvkgn4s80000gn/T/+bpudXegQOmMA+i0Fl4Dlg/4489s/acqus, 0)
$$ ##TITLE= Parameter file, TOPSPIN		Version 2.1
$$ ##JCAMPDX= 5.0
$$ ##DATATYPE= Parameter Values
$$ ##NPOINTS= 10	$$ modification sequence number
$$ ##ORIGIN= Bruker BioSpin GmbH
$$ ##OWNER= andrew
$$ $$ 2015-06-05 15:59:49.366 +0600  andrew@av-600
$$ $$ /opt/data/andrew/nmr/limog-1782/615/acqus
$$ $$ process /opt/ts21pl6/prog/mod/shimcntl
$$ ##$ACQT0= -9.54927425515661
$$ ##$AMP= (0..31)
$$ 100 100 100 100 100 100 100 100 100 100 100 100 100 100 100 100 100 100
$$ 100 100 100 100 100 100 100 100 100 100 100 100 100 100
$$ ##$ANAVPT= -1
$$ ##$AQSEQ= 0
$$ ##$AQ_mod= 3
$$ ##$AUNM= <au_zg>
$$ ##$AUTOPOS= <>
$$ ##$BF1= 600.3
$$ ##$BF2= 600.3
$$ ##$BF3= 600.3
$$ ##$BF4= 600.3
$$ ##$BF5= 600.3
$$ ##$BF6= 600.3
$$ ##$BF7= 600.3
$$ ##$BF8= 600.3
$$ ##$BYTORDA= 0
$$ ##$CFDGTYP= 0
$$ ##$CFRGTYP= 9
$$ ##$CHEMSTR= <none>
$$ ##$CNST= (0..63)
$$ 1 1 145 1 1 1 1 1 1 1 1 1 1 1 1 1 1 1 1 1 1 1 1 1 1 1 1 1 1 1 1 1 1 1 1
$$ 1 1 1 1 1 1 1 1 1 1 1 1 1 1 1 1 1 1 1 1 1 1 1 1 1 1 1 1 1
$$ ##$CPDPRG= <>
$$ ##$CPDPRG1= <>
$$ ##$CPDPRG2= <waltz16>
$$ ##$CPDPRG3= <>
$$ ##$CPDPRG4= <mlev>
$$ ##$CPDPRG5= <mlev>
$$ ##$CPDPRG6= <mlev>
$$ ##$CPDPRG7= <mlev>
$$ ##$CPDPRG8= <mlev>
$$ ##$CPDPRGB= <>
$$ ##$CPDPRGT= <>
$$ ##$D= (0..63)
$$ 0 1 0 0 0 0 0 0 0 0.06 0 0.03 0 0 0 0 1e-04 0 0 0 0 0 0 0 0 0 0 0 0 0 0
$$ 0 0 0 0 0 0 0 0 0 0 0 0 0 0 0 0 0 0 0 0 0 0 0 0 0 0 0 0 0 0 0 0 0
$$ ##$DATE= 1433498389
$$ ##$DBL= (0..7)
$$ 120 120 120 120 120 120 120 120
$$ ##$DBP= (0..7)
$$ 150 150 150 150 150 150 150 150
$$ ##$DBP07= 0
$$ ##$DBPNAM0= <>
$$ ##$DBPNAM1= <>
$$ ##$DBPNAM2= <>
$$ ##$DBPNAM3= <>
$$ ##$DBPNAM4= <>
$$ ##$DBPNAM5= <>
$$ ##$DBPNAM6= <>
$$ ##$DBPNAM7= <>
$$ ##$DBPOAL= (0..7)
$$ 0.5 0.5 0.5 0.5 0.5 0.5 0.5 0.5
$$ ##$DBPOFFS= (0..7)
$$ 0 0 0 0 0 0 0 0
$$ ##$DE= 6.5
$$ ##$DECBNUC= <off>
$$ ##$DECIM= 2218.66666666667
$$ ##$DECNUC= <off>
$$ ##$DECSTAT= 4
$$ ##$DIGMOD= 1
$$ ##$DIGTYP= 12
$$ ##$DL= (0..7)
$$ 0 120 120 120 120 120 120 120
$$ ##$DP= (0..7)
$$ 150 150 150 150 150 150 150 150
$$ ##$DP07= 0
$$ ##$DPNAME0= <>
$$ ##$DPNAME1= <>
$$ ##$DPNAME2= <>
$$ ##$DPNAME3= <>
$$ ##$DPNAME4= <>
$$ ##$DPNAME5= <>
$$ ##$DPNAME6= <>
$$ ##$DPNAME7= <>
$$ ##$DPOAL= (0..7)
$$ 0.5 0.5 0.5 0.5 0.5 0.5 0.5 0.5
$$ ##$DPOFFS= (0..7)
$$ 0 0 0 0 0 0 0 0
$$ ##$DQDMODE= 0
$$ ##$DR= 22
$$ ##$DS= 0
$$ ##$DSLIST= <SSSSSSSSSSSSSSS>
$$ ##$DSPFIRM= 0
$$ ##$DSPFVS= 20
$$ ##$DTYPA= 0
$$ ##$EXP= <>
$$ ##$F1LIST= <111111111111111>
$$ ##$F2LIST= <222222222222222>
$$ [...]
$$ -1 -1 -1 -1 -1 -1 -1 -1 -1 -1 -1 -1 -1 -1 -1 -1 -1 -1 -1 -1 -1 -1 -1 -1
$$ -1 -1 -1 -1 -1 -1 -1 -1 -1 -1 -1 -1 -1 -1 -1 -1 -1 -1 -1 -1 -1 -1 -1 -1
$$ -1 -1 -1 -1 -1 -1 -1 -1 -1 -1 -1 -1 -1 -1 -1 -1 -1 -1 -1 -1 -1 -1 -1 -1
$$ -1 -1 -1 -1 -1 -1 -1 -1 -1 -1 -1 -1 -1 -1 -1 -1 -1 -1 -1 -1 -1 -1 -1 -1
$$ -1 -1 -1 -1 -1 -1 -1 -1 -1 -1 -1 -1 -1 -1 -1 -1
$$ ##$RG_tab8= (0..255)
$$ -1 -1 -1 -1 -1 -1 -1 -1 -1 -1 -1 -1 -1 -1 -1 -1 -1 -1 -1 -1 -1 -1 -1 -1
$$ -1 -1 -1 -1 -1 -1 -1 -1 -1 -1 -1 -1 -1 -1 -1 -1 -1 -1 -1 -1 -1 -1 -1 -1
$$ -1 -1 -1 -1 -1 -1 -1 -1 -1 -1 -1 -1 -1 -1 -1 -1 -1 -1 -1 -1 -1 -1 -1 -1
$$ -1 -1 -1 -1 -1 -1 -1 -1 -1 -1 -1 -1 -1 -1 -1 -1 -1 -1 -1 -1 -1 -1 -1 -1
$$ -1 -1 -1 -1 -1 -1 -1 -1 -1 -1 -1 -1 -1 -1 -1 -1 -1 -1 -1 -1 -1 -1 -1 -1
$$ -1 -1 -1 -1 -1 -1 -1 -1 -1 -1 -1 -1 -1 -1 -1 -1 -1 -1 -1 -1 -1 -1 -1 -1
$$ -1 -1 -1 -1 -1 -1 -1 -1 -1 -1 -1 -1 -1 -1 -1 -1 -1 -1 -1 -1 -1 -1 -1 -1
$$ -1 -1 -1 -1 -1 -1 -1 -1 -1 -1 -1 -1 -1 -1 -1 -1 -1 -1 -1 -1 -1 -1 -1 -1
$$ -1 -1 -1 -1 -1 -1 -1 -1 -1 -1 -1 -1 -1 -1 -1 -1 -1 -1 -1 -1 -1 -1 -1 -1
$$ -1 -1 -1 -1 -1 -1 -1 -1 -1 -1 -1 -1 -1 -1 -1 -1 -1 -1 -1 -1 -1 -1 -1 -1
$$ -1 -1 -1 -1 -1 -1 -1 -1 -1 -1 -1 -1 -1 -1 -1 -1
$$ ##$RG_tabA= (0..255)
$$ 0.25 0.28 0.32 0.35 0.4 0.44 0.5 0.56 0.64 0.7 0.8 0.89 1 1.12 1.28 1.4
$$ 1.6 1.78 2 2.25 2.56 2.8 3.2 3.56 4 4.5 5 5.6 6.35 7.12 8 9 10 11.3 12.7
$$ 14.2 16 18 20.2 22.6 25.4 28.5 32 36 40.3 45.2 50.8 57 64 71.8 80.6 90.5
$$ 101 114 128 144 161 181 203 -1 -1 -1 -1 -1 -1 -1 -1 -1 -1 -1 -1 -1 -1 -1
$$ -1 -1 -1 -1 -1 -1 -1 -1 -1 -1 -1 -1 -1 -1 -1 -1 -1 -1 -1 -1 -1 -1 -1 -1
$$ -1 -1 -1 -1 -1 -1 -1 -1 -1 -1 -1 -1 -1 -1 -1 -1 -1 -1 -1 -1 -1 -1 -1 -1
$$ -1 -1 -1 -1 -1 -1 -1 -1 -1 -1 -1 -1 -1 -1 -1 -1 -1 -1 -1 -1 -1 -1 -1 -1
$$ -1 -1 -1 -1 -1 -1 -1 -1 -1 -1 -1 -1 -1 -1 -1 -1 -1 -1 -1 -1 -1 -1 -1 -1
$$ -1 -1 -1 -1 -1 -1 -1 -1 -1 -1 -1 -1 -1 -1 -1 -1 -1 -1 -1 -1 -1 -1 -1 -1
$$ -1 -1 -1 -1 -1 -1 -1 -1 -1 -1 -1 -1 -1 -1 -1 -1 -1 -1 -1 -1 -1 -1 -1 -1
$$ -1 -1 -1 -1 -1 -1 -1 -1 -1 -1 -1 -1 -1 -1 -1 -1 -1 -1 -1 -1 -1 -1 -1 -1
$$ -1 -1 -1 -1 -1 -1 -1 -1 -1 -1 -1 -1 -1 -1
$$ ##$ROUT14= (0..7)
$$ 0 0 0 0 0 0 0 0
$$ ##$ROUTER= -1
$$ ##$RX22TY= <no>
$$ ##$RXFMAX= (0..7)
$$ 647.5 -1 -1 -1 -1 -1 -1 -1
$$ ##$RXFMIN= (0..7)
$$ 5 -1 -1 -1 -1 -1 -1 -1
$$ ##$RXINTLV= (0..7)
$$ 1 0 0 0 0 0 0 0
$$ ##$RXMSTY= <no>
$$ ##$SCMTY= <no>
$$ ##$SGUC1= (0..15)
$$ 17 18 34 0 0 0 0 0 0 0 0 0 0 0 0 0
$$ ##$SGUC2= (0..15)
$$ 33 256 20 0 0 0 0 0 0 0 0 0 0 0 0 0
$$ ##$SPECTR= 10
$$ ##$SY2FLAG= 0
$$ ##$TFXNUM= 0
$$ ##$TRIPLO2= 0
$$ ##$VTUTY= <tty05>
$$ ##$WBREFAM= (0..15)
$$ 100 100 100 100 100 100 100 100 100 100 100 100 100 100 100 100
$$ ##$WBREFPH= (0..15)
$$ 0 0 0 0 0 0 0 0 0 0 0 0 0 0 0 0
$$ ##$XFAC= 2
$$ ##END=
$$ 
##$DECIM=	2218.66666666667
##$DSPFVS=	20
##XUNITS=	HZ
##YUNITS=	ARBITRARY UNITS
##FIRSTX=	6322.8525384689401108
##LASTX=	-2691.4329892738592207
##XFACTOR=	-0.1375491802509010153
##YFACTOR=	8.4511220703125010324e-06
##NPOINTS=	65536
##XYDATA=	(X++(Y..Y))
$$ [...]
-15660 -69589 -71236 -69186 -71907 -73196 -71623 -72816 -71146 -70908 -70669 -70431 -70192 -69954 -69715 -69782 -69850 -67055 -64260 -66533 -68806
-15641 -68806 -67919 -67032 -67494 -63186 -61562 -64707 -66004 -64439 -62098 -64528 -67323 -70118 -71959 -70938 -69380 -67822 -68948
-15624 -68948 -70073 -68158 -66242 -64506 -62769 -61092 -62277 -63462 -61785 -62564 -63343 -63943 -64543 -64248 -63954 -64733 -68374 -71359
-15606 -71359 -71482 -70531 -69581 -66484 -63388 -63153 -62918 -63171 -63421 -63675 -63924 -63820 -63712 -63607 -63499 -62523 -61543 -63429 -65311 -65944 -66574
-15585 -66574 -67207 -67837 -68042 -68243 -68269 -68292 -69391 -67625 -68724 -72682 -71195 -69704 -71258 -72808 -67983 -63153 -63395 -66496 -68892
-15566 -68892 -71284 -70997 -70707 -71731 -72753 -73956 -75156 -73364 -74429 -75499 -73703 -72089 -70472 -71541 -72607 -72074 -71538 -72794
-15548 -72794 -71184 -68743 -69160 -67792 -66421 -65039 -63652 -65132 -66607 -68802 -70994 -70327 -69656 -68922 -68187 -65843 -66361 -69324
-15530 -69324 -72287 -74176 -73203 -70293 -67383 -67334 -67286 -64852 -65281 -66961 -68642 -67684 -66727 -63980 -64096 -69518 -72078 -73267 -71594
-15511 -71594 -70487 -69380 -68094 -66809 -67371 -67934 -68497 -69059 -68754 -68445 -68139 -67830 -68717 -69600 -70487 -71370 -70707 -70040 -69376 -68709 -70192
-15490 -70192 -71672 -73155 -74634 -72682 -70725 -68773 -66816 -66831 -66842 -66857 -66868 -63395 -59918 -61215 -62508 -64789 -67066 -69346 -71623
-15471 -71623 -71008 -70390 -71206 -72018 -67886 -63749 -62478 -61204 -60641 -60075 -60943 -61808 -60977 -60142 -62173 -64200 -64696 -65188 -68545 -71899
-15451 -71899 -72753 -73602 -69686 -65765 -65568 -65366 -62307 -59244 -64234 -69220 -69440 -69656 -68840 -68024 -67207 -66391 -65277 -64163 -63048
-15432 -63048 -61934 -61789 -61644 -61498 -61353 -63056 -64759 -64494 -67092 -69734 -66652 -65180 -66570 -66976 -64521 -63853 -63186 -63026 -62866
-15413 -62866 -64137 -65407 -68497 -71586 -71813 -72041 -71638 -71236 -67971 -64707 -62128 -59549 -63648 -67748 -68210 -68672 -67703 -66734 -64901
-15394 -64901 -63067 -62665 -62262 -63980 -65698 -65985 -66272 -67722 -69171 -69190 -69209 -67289 -65370 -66313 -67256 -66797 -66339 -67312 -68284 -68978
-15374 -68978 -69671 -68933 -68195 -67636 -67077 -66816 -66555 -64886 -67986 -70013 -69179 -68702 -68225 -62799 -57373 -56695 -56016 -60108 -64200 -64774
-15354 -64774 -65348 -65922 -66496 -66786 -67077 -64506 -61934 -63954 -65974 -65132 -64289 -63742 -63190 -65504 -67815 -68698 -69577 -70461 -71340 -70763
-15334 -70763 -70181 -69604 -69022 -67908 -66790 -65676 -64558 -63477 -62393 -64174 -65952 -65050 -64144 -66104 -68061 -66645 -65225 -66671
-15316 -66671 -68113 -66250 -64383 -67289 -70192 -70177 -70159 -71575 -72987 -72227 -71463 -67841 -64215 -64588 -64957 -62467 -59974 -61778 -63578
-15297 -63578 -63950 -64319 -66115 -67912 -68277 -68642 -70558 -72473 -69917 -67360 -62568 -62545 -64610 -66674 -68143 -69611 -69648 -69686 -68773
-15278 -68773 -67860 -68378 -68896 -67505 -66115 -64725 -63332 -66995 -70658 -69551 -68445 -69007 -69570 -67271 -64968 -65896 -66820 -67748 -68672
-15259 -68672 -67901 -67125 -69212 -71299 -72421 -73539 -74184 -77687 -80627 -78793 -79464 -80135 -78424 -70986 -69630 -68273 -69004 -69734
-15241 -69734 -70464 -71195 -70259 -69320 -68381 -67442 -67874 -68307 -68739 -69171 -66857 -64539 -64725 -64912 -66470 -62303 -62430 -65419 -67606 -66928
-15221 -66928 -69827 -69864 -67755 -68508 -67472 -66436 -67461 -68486 -67543 -69462 -71799 -68411 -66812 -68076 -68139 -68202 -65583 -62963 -63384
-15202 -63384 -63805 -61543 -59281 -57093 -57768 -62735 -61979 -65933 -67025 -65076 -65989 -68251 -73375 -72298 -71221 -70681 -70140 -69421
-15184 -69421 -68702 -71251 -70938 -68836 -72454 -73572 -71828 -72052 -72272 -72466 -72659 -72853 -73043 -73475 -73908 -71478 -69045 -70006 -70967 -69067
-15164 -69067 -67163 -65024 -62885 -60745 -58603 -58461 -58319 -58178 -58033 -59560 -61088 -62616 -64140 -65221 -66298 -67379 -68456 -68046
-15146 -68046 -67632 -67222 -66809 -65139 -63466 -64658 -65847 -67576 -69302 -68169 -67032 -65784 -64532 -66145 -67755 -66865 -65970 -68299
-15128 -68299 -70625 -69846 -74787 -75141 -69768 -70479 -74049 -76013 -72249 -70852 -69455 -67699 -65940 -66153 -66365 -66578 -66786 -67133 -67479
-15109 -67479 -67826 -68169 -66190 -64211 -65094 -65974 -66115 -66257 -66399 -66537 -64532 -62527 -63384 -64237 -66510 -68784 -71057 -73326 -74526
-15090 -74526 -75726 -70546 -65363 -63626 -66660 -68799 -68076 -65266 -65318 -67874 -67569 -69097 -67763 -63388 -61875 -62806 -63738 -64848
-15072 -64848 -65959 -67774 -69589 -68541 -67494 -66388 -65281 -66082 -64021 -60977 -62702 -64427 -66153 -63943 -61733 -59523 -57313
-15055 -57313 -60391 -63466 -66544 -69618 -67688 -65754 -63824 -61890 -61904 -61916 -61931 -61942 -62672 -63399 -64129 -64856 -64513 -64166 -63824 -63477 -63671
-15034 -63671 -63861 -64055 -64245 -62106 -59963 -60686 -61405 -61234 -61059 -60887 -60712 -60470 -60224 -59982 -59736 -61163 -62586 -64014 -65437 -66656
-15014 -66656 -67871 -69089 -70304 -69197 -68087 -64118 -64916 -66909 -66037 -65467 -67755 -68378 -68996 -66935 -64871 -62244 -59613 -59847
-14996 -59847 -60078 -60194 -60306 -60421 -60533 -61692 -62851 -64010 -65165 -65668 -66171 -66794 -62642 -59344 -60816 -62169 -63518 -61591 -59665
-14977 -59665 -60600 -61532 -64066 -66600 -66272 -65940 -67520 -69100 -67819 -66533 -69186 -71840 -69723 -67602 -68169 -68735 -69302 -69864 -66458
-14958 -66458 -63052 -62508 -61960 -62907 -63853 -64800 -65743 -64856 -63969 -63082 -62191 -64107 -66022 -73483 -76170 -74851 -73528 -74772 -76013
-14939 -76013 -74813 -73610 -72410 -71206 -69551 -67893 -69100 -70304 -69723 -69138 -68556 -67971 -69458 -70941 -69566 -68187 -67886 -67580
-14921 -67580 -67278 -66973 -70300 -73625 -74090 -74552 -75138 -75719 -73442 -71161 -70915 -70669 -70423 -70174 -68855 -67535 -69078 -70617 -70163
-14902 -70163 -69708 -69253 -68795 -71322 -73848 -73513 -73174 -71989 -70804 -66935 -67833 -71240 -74646 -78350 -77280 -74008 -73598 -70982
-14884 -70982 -68363 -67833 -62534 -62780 -63022 -65072 -67122 -66309 -65493 -65277 -65061 -64845 -64625 -66317 -68009 -69700 -71389 -72067 -72745
-14865 -72745 -73423 -74098 -71620 -69138 -69518 -69898 -67599 -65296 -65855 -66414 -69749 -73080 -73550 -74020 -72406 -70789 -69171 -67554 -70062
-14846 -70062 -72566 -70300 -68035 -68814 -69589 -73226 -76863 -76047 -75227 -71843 -68460 -66451 -69209 -72145 -75082 -75257 -75432 -72745
-14828 -72745 -70058 -69279 -68501 -70405 -67539 -65106 -62672 -66619 -70565 -69563 -68560 -67558 -66555 -67435 -68314 -69194 -70073 -69581
-14810 -69581 -69089 -68597 -68105 -65825 -63544 -64125 -67569 -70297 -68255 -67464 -69536 -69999 -70461 -71102 -71739 -71366 -70994 -70621 -70245 -68590
-14790 -68590 -66935 -68143 -69346 -68050 -66753 -68318 -69879 -72257 -74634 -77012 -79386 -78067 -76747 -75428 -74105 -72861 -71616
-14773 -71616 -73233 -74847 -72171 -69495 -71590 -73680 -72779 -71877 -70975 -70069 -70956 -71843 -68258 -64670 -62531 -65161 -66719 -65411
-14755 -65411 -67565 -69719 -71694 -73666 -70643 -67621 -67461 -67297 -70177 -73058 -73077 -70230 -68064 -70669 -70114 -69555 -74485 -74646
-14737 -74646 -74627 -74605 -75171 -75738 -76304 -76867 -74213 -71560 -73677 -75790 -73859 -71929 -70177 -68422 -66373 -67185 -69071 -70953 -70103
-14718 -70103 -66391 -64289 -62184 -62706 -63227 -63749 -64267 -65050 -65832 -68642 -68586 -62571 -63235 -70397 -70878 -69902 -68925 -67532 -66138 -66175
-14698 -66175 -66212 -66250 -66287 -67554 -68821 -69015 -66347 -66481 -69477 -72473 -72607 -69674 -69604 -72216 -71966 -71180 -70394 -72290 -74187 -74474
-14678 -74474 -74761 -73379 -67226 -62147 -63745 -67669 -68732 -69209 -69682 -69976 -70271 -71404 -72533 -73662 -74791 -74731 -74668 -69954 -68102
-14659 -68102 -68579 -66190 -65769 -65348 -62911 -63332 -62322 -61312 -62333 -66212 -66693 -70036 -74784 -76665 -75566 -74467 -71940 -69410
-14641 -69410 -69741 -70073 -72011 -73945 -73021 -72093 -70811 -69525 -74623 -76856 -74590 -72320 -69876 -67427 -66354 -65277 -68795 -72309
-14623 -72309 -72298 -69421 -69231 -71899 -72067 -69369 -68284 -67196 -66559 -63056 -63850 -64640 -66686 -65866 -63976 -66853 -71799 -76744 -73401
-14604 -73401 -70054 -69872 -69689 -66525 -68128 -70271 -67643 -69071 -73356 -74366 -72514 -74061 -72741 -73010 -73278 -73367 -73453 -73125 -72797
-14585 -72797 -72469 -72138 -69932 -67725 -70289 -72849 -68258 -63667 -65754 -67837 -69127 -70412 -71702 -72987 -73680 -74370 -75063 -75752
-14567 -75752 -72987 -70218 -70315 -70409 -71042 -71672 -72305 -72935 -71679 -70423 -69168 -67912 -67968 -68024 -65396 -67539 -70912 -74284 -75093 -75902
-14547 -75902 -75875 -75849 -75823 -75797 -73926 -72052 -73043 -74031 -73770 -73505 -73244 -72980 -72913 -72842 -72775 -72704 -72041 -71374 -68027 -69447 -69287 -69127 -66402
-14524 -66402 -63678 -62206 -60734 -59262 -57790 -61603 -65415 -69048 -72682 -72559 -69574 -68378 -71951 -71728 -71504 -71579 -71653 -71191 -70729
-14505 -70729 -70267 -69805 -70148 -70490 -70833 -71176 -68240 -65303 -65229 -65154 -64908 -64662 -64416 -64170 -64640 -65109 -65579 -66048 -67919 -69790 -68799
-14484 -68799 -67807 -65147 -62486 -62687 -62888 -63563 -64237 -64912 -65586 -69421 -73256 -74228 -75201 -77053 -78905 -75987 -73069 -74087 -75104
-14465 -75104 -73259 -71415 -69682 -67949 -69078 -70207 -65970 -61733 -64174 -66615 -68355 -70095 -68974 -67852 -66432 -65012 -63593
-14448 -63593 -62173 -66115 -70054 -71135 -72212 -70550 -68884 -71992 -75097 -72510 -69920 -67334 -64744 -64304 -63861 -68191 -72518
-14431 -72518 -72022 -71523 -71027 -70528 -71225 -71918 -70051 -68180 -67237 -71061 -72205 -73345 -71687 -70025 -73911 -73025 -69995 -66961 -66492
-14412 -66492 -66022 -65616 -65206 -67658 -70110 -70584 -71053 -68661 -71038 -74075 -74247 -71735 -69223 -71303 -76241 -76945 -70971 -67028
-14394 -67028 -67852 -70345 -72838 -73218 -73595 -73971 -74348 -73356 -72361 -71366 -70371 -69987 -69600 -69216 -68828 -68743 -68653 -68568 -68478 -67602 -66723 -70617
-14372 -70617 -74508 -76434 -78357 -77422 -76483 -73256 -70025 -71567 -73107 -73457 -73803 -74154 -74500 -71884 -69264 -66648 -64029 -67733
-14354 -67733 -71433 -70368 -69298 -73353 -77407 -74784 -72156 -69235 -66313 -70069 -73822 -73539 -73256 -72972 -72685 -71806 -70926 -67185
-14336 -67185 -63440 -62691 -61942 -58331 -59486 -61897 -61446 -60041 -58632 -57861 -57090 -59180 -61267 -64968 -68668 -67599 -66525 -67785
-14318 -67785 -69045 -70304 -71560 -70196 -68832 -72238 -75641 -73718 -71795 -69872 -67945 -67513 -67081 -66648 -66212 -66168 -66123 -66376 -66626
-14299 -66626 -64196 -66537 -67804 -66205 -64781 -63358 -64617 -65873 -64986 -64099 -67983 -71862 -71411 -70956 -70505 -70051 -70256 -70457 -70662
-14280 -70662 -70863 -71299 -71731 -72167 -72600 -72618 -72633 -69969 -72071 -69749 -67424 -65400 -63373 -65106 -66835 -68389 -69939 -70584 -68363
-14261 -68363 -66682 -71676 -74348 -74154 -74739 -72458 -70714 -68966 -69905 -70841 -71661 -72477 -73297 -74113 -71847 -69577 -67312 -65042 -63015
-14242 -63015 -60984 -61819 -62650 -66507 -70364 -69451 -68538 -68340 -68143 -67945 -67748 -69622 -71497 -73073 -74649 -76285 -73151 -72700 -72249
-14223 -72249 -71418 -70587 -67073 -68329 -64398 -60466 -61603 -62739 -61163 -59586 -58964 -61204 -63086 -60198 -58562 -59788 -62176
-14206 -62176 -64562 -62359 -60153 -63615 -67073 -67673 -68269 -65396 -62519 -62508 -62493 -61528 -60559 -62456 -64349 -66291 -68232 -67312 -66391
-14187 -66391 -64457 -62523 -63451 -64379 -65516 -66652 -67789 -68925 -66186 -63447 -60708 -57969 -59896 -61822 -63749 -65676 -65933
-14170 -65933 -66190 -66268 -66347 -67886 -66563 -64166 -66540 -68676 -70811 -70382 -69954 -64908 -59859 -59579 -59300 -61468 -63634 -65799 -67964
-14151 -67964 -68553 -69138 -66861 -64584 -65113 -65638 -66164 -66689 -68202 -69712 -71221 -72730 -73051 -73367 -73684 -74001 -74143 -74280 -74418 -74556
-14131 -74556 -72372 -70185 -67997 -65810 -65814 -65817 -62959 -60101 -59270 -58439 -62080 -65720 -68914 -67338 -68445 -69551 -67856 -66160 -67327
-14112 -67327 -68489 -68523 -68556 -68590 -68623 -68299 -67975 -64968 -61960 -61114 -63130 -66399 -64897 -65005 -67975 -70647 -70453 -69115 -67778 -66261
-14092 -66261 -64744 -65911 -67077 -63473 -59870 -61319 -62769 -66127 -66622 -64256 -66660 -68884 -66339 -66697 -67055 -67412 -67770 -65147
-14074 -65147 -67293 -71407 -72659 -72242 -74687 -75164 -70871 -67472 -64073 -63239 -62404 -63876 -65348 -66820 -68288 -70356 -72421 -71627
-14056 -71627 -70830 -71079 -71325 -71575 -71821 -71176 -70528 -69883 -69235 -70110 -70986 -71862 -72734 -68601 -64465 -65102 -65735 -68691 -71642 -71735 -71825
-14035 -71825 -71202 -70576 -69954 -69328 -70204 -71076 -71948 -72820 -73338 -73852 -74366 -74880 -75242 -75600 -75957 -76315 -74769 -73218 -74530 -75842 -77455
-14014 -77455 -79065 -75905 -72745 -71556 -70364 -72033 -73703 -73274 -72842 -74318 -72931 -70953 -73740 -77720 -75022 -70718 -71184
-13997 -71184 -68549 -65914 -67632 -69350 -71068 -72786 -71463 -70140 -68817 -67494 -67662 -67830 -67699 -67569 -72693 -73047 -73222 -73397
-13979 -73397 -74049 -74702 -72492 -70282 -68668 -67055 -68303 -69551 -69727 -69902 -70435 -70967 -67137 -69030 -67703 -66373 -70054 -73736
-13961 -73736 -72648 -71556 -70871 -70185 -66637 -63086 -63473 -63861 -64248 -64632 -65154 -65676 -66197 -66715 -67058 -67401 -67744 -68083 -70349 -72615
-13941 -72615 -75238 -72134 -69630 -67125 -64263 -61398 -63898 -66399 -66037 -65676 -64480 -63283 -62087 -60891 -61394 -61897 -65262 -68627
-13923 -68627 -68236 -67845 -67453 -67062 -68072 -69082 -68124 -70028 -74318 -72883 -68407 -69656 -70815 -66250 -63831 -64275 -63585 -65758
-13905 -65758 -67036 -62590 -60582 -61431 -61386 -64204 -67263 -67457 -63060 -61524 -62139 -62750 -63004 -68981 -72100 -72354 -71772 -68329 -64234
-13886 -64234 -65858 -70464 -72208 -69604 -66995 -63492 -65713 -72201 -72961 -70621 -68281 -67852 -67420 -66987 -66555 -67129 -67703 -68277 -68851
-13867 -68851 -69663 -70476 -68426 -66376 -64036 -61696 -64125 -66555 -64155 -61755 -62217 -62680 -64837 -66995 -69153 -71310 -69592 -67874
-13849 -67874 -66156 -64439 -65963 -67487 -69011 -70535 -68780 -67025 -65091 -63157 -61744 -57470 -56892 -61085 -61699 -62314 -66089
-13832 -66089 -69864 -69823 -69782 -69741 -69700 -70554 -71407 -72261 -73114 -72059 -71005 -69950 -68896 -72671 -76446 -75451 -74456 -72074 -69693 -67312
-13812 -67312 -64930 -65829 -66727 -67625 -68523 -68515 -68504 -68493 -68482 -70084 -71683 -70420 -69156 -69507 -69853 -70200 -70546 -70300 -70051 -69801 -69551 -74355
-13790 -74355 -79155 -77277 -75398 -73703 -72003 -70304 -68605 -69488 -70368 -71247 -72126 -70505 -68881 -70118 -71355 -72630 -73900 -72313
-13772 -72313 -70722 -72890 -75056 -77224 -79390 -75991 -72589 -73960 -75328 -73479 -71627 -69779 -67927 -67927 -67927 -65243 -62560 -62501 -65303
-13753 -65303 -69179 -68284 -65862 -63440 -65489 -67539 -68098 -68657 -69395 -70133 -69741 -72208 -75931 -74880 -71150 -70278 -70364 -70446 -71396 -72343
-13733 -72343 -70431 -68515 -67379 -66238 -69872 -73502 -71966 -70431 -68896 -67360 -65229 -63097 -60965 -58834 -62262 -65691 -66257
-13716 -66257 -66824 -65720 -64617 -66376 -68135 -68571 -69007 -69443 -69876 -73174 -76472 -75000 -73524 -72603 -71683 -70763 -69838 -69514 -69190
-13697 -69190 -68866 -68538 -66455 -64371 -65150 -65925 -66764 -67602 -68441 -69276 -68966 -68657 -68348 -68035 -66294 -64554 -65676 -66794 -65817 -64841
-13677 -64841 -66727 -68609 -69779 -70949 -72119 -73285 -72443 -71601 -70759 -69913 -70263 -70613 -70964 -71310 -72488 -73666 -74843 -76017 -78506
-13658 -78506 -80996 -78715 -76431 -74157 -71884 -72413 -75801 -79252 -76978 -73632 -73144 -72883 -72618 -72536 -72451 -70997 -69540 -68087 -66630
-13639 -66630 -67673 -68713 -73334 -72227 -69753 -72998 -74459 -73054 -71161 -72126 -71307 -70483 -70379 -70271 -70166 -70058 -70341 -70621 -68042
-13620 -68042 -65460 -67591 -69719 -68989 -68255 -70584 -72913 -72380 -71847 -70420 -68992 -70427 -71862 -71858 -71854 -71851 -71847 -71963 -72078 -71299 -67658
-13599 -67658 -64684 -67435 -69648 -71862 -72287 -72712 -73136 -73561 -72615 -71668 -70722 -69775 -66503 -63231 -64729 -66227 -67006 -67781 -68739
-13580 -68739 -69693 -69577 -72320 -71549 -66004 -65165 -67185 -70282 -68605 -66633 -69428 -70856 -69417 -69395 -69369 -69168 -68963 -66317 -63667
-13561 -63667 -61021 -58372 -57738 -57101 -59329 -61554 -64498 -67438 -67520 -67599 -67424 -67248 -67073 -66898 -69168 -71437 -70845 -70252 -65456 -60660
-13541 -60660 -60634 -60608 -62072 -63537 -67863 -72190 -72551 -72913 -73274 -73636 -72208 -70781 -69354 -67927 -66805 -65683 -67424 -69164 -68937
-13522 -68937 -68709 -68482 -68255 -68869 -69481 -70092 -70703 -68694 -66682 -64670 -62657 -64159 -65657 -67155 -68653 -68664 -68672 -68679 -68687 -69209 -69730 -65482
-13500 -65482 -61230 -64673 -68117 -66790 -65460 -65847 -66235 -66384 -71299 -72462 -66947 -65486 -64021 -63388 -62750 -64975 -67200 -66209
-13482 -66209 -65214 -67081 -68948 -68597 -68243 -67889 -67535 -68258 -68978 -69697 -70416 -69686 -68955 -71087 -73215 -72365 -71515 -70666 -69812 -66339
-13462 -66339 -62866 -64163 -65456 -64964 -64472 -63801 -63127 -65091 -64193 -64189 -69909 -71396 -67159 -66857 -66555 -63347 -65862 -68020 -70177
-13443 -70177 -72693 -75208 -74862 -74515 -72581 -70647 -68713 -66779 -66693 -66607 -63302 -65720 -66455 -67189 -68281 -69373 -69749 -70125 -70859
-13424 -70859 -71594 -68698 -71526 -72924 -71456 -72018 -75443 -76721 -77996 -80824 -77929 -78253 -78573 -77646 -76718 -75790 -74858 -75950 -77042
-13405 -77042 -75272 -73498 -69581 -65665 -64610 -63552 -64412 -65273 -66134 -66991 -70893 -74795 -73926 -73054 -67636 -62217 -61808 -67122
-13387 -67122 -70468 -68091 -65713 -69059 -75022 -75261 -74307 -73353 -73830 -74307 -70013 -65720 -64878 -64032 -62832 -61629 -65020 -62683
-13369 -62683 -61960 -64096 -66749 -69399 -69369 -69335 -68948 -68556 -71031 -73502 -72544 -71586 -70628 -69671 -65672 -61673 -64353 -67032 -69466
-13350 -69466 -71899 -71471 -71042 -68586 -66130 -63675 -61219 -60324 -59426 -58532 -57634 -58886 -60134 -61386 -62635 -63022 -63406 -63794 -64178
-13331 -64178 -63492 -62803 -64979 -67151 -68348 -69544 -67878 -66209 -65437 -64666 -66756 -68843 -69741 -70640 -71538 -72432 -73926 -75421 -74053
-13312 -74053 -72682 -70427 -68173 -67886 -64733 -60451 -61893 -66019 -64416 -64263 -64111 -63600 -63086 -64543 -66000 -64953 -63902 -62258
-13294 -62258 -66335 -69876 -73416 -71355 -66429 -62754 -64804 -67438 -70069 -73058 -76047 -76118 -76185 -76252 -76319 -74362 -72402 -70442 -68482
-13275 -68482 -68195 -67904 -67614 -67323 -67185 -67043 -66902 -66760 -67517 -68269 -66160 -64051 -64998 -65944 -66891 -67837 -67412 -66987 -66563 -66138 -67055
-13254 -67055 -67971 -68888 -69805 -69231 -68657 -68083 -67509 -65855 -64200 -65407 -66615 -67107 -67599 -65229 -62858 -63455 -64051 -64647 -65243 -64170
-13234 -64170 -63097 -66794 -70490 -69596 -68702 -68165 -67625 -62378 -62851 -62970 -63086 -64293 -65501 -63846 -62188 -61666 -61140 -67297 -73449
-13215 -73449 -73598 -73748 -73897 -74042 -73118 -72190 -71623 -71053 -66790 -68251 -69354 -70453 -71497 -72536 -71076 -69611 -65657 -67427 -73967
-13196 -73967 -74784 -75600 -76416 -76874 -77329 -75902 -74474 -73047 -71620 -67867 -64114 -65132 -66145 -66492 -66838 -67185 -67532 -68206 -68881
-13177 -68881 -68124 -67364 -62590 -57816 -59721 -61625 -63738 -65851 -67964 -70073 -70740 -71407 -72074 -72741 -71262 -69782 -68303 -66824
-13159 -66824 -66626 -66429 -66231 -66033 -65568 -65102 -66067 -67032 -68407 -69782 -68296 -66809 -66186 -65564 -62080 -58595 -58047 -57500 -59814 -62128
-13139 -62128 -63548 -64968 -64957 -64945 -64271 -63596 -64353 -65109 -66045 -66980 -65053 -63127 -59396 -55666 -54798 -53930 -55893 -57857 -59821 -61785
-13119 -61785 -61513 -61241 -62400 -63559 -61677 -59795 -60775 -61755 -61871 -61986 -63533 -65079 -68623 -72167 -76069 -74247 -72902 -71553
-13101 -71553 -72712 -73867 -71478 -69086 -66697 -64304 -65299 -66291 -65855 -65415 -67811 -70204 -69738 -69268 -72007 -74743 -72712 -70677
-13083 -70677 -70971 -71262 -71556 -71847 -72395 -72939 -70625 -68307 -69600 -70889 -70751 -70610 -70979 -71344 -71713 -72078 -71642 -71202 -70766 -70327 -71500
-13062 -71500 -72671 -73844 -75015 -73565 -72112 -70662 -69209 -70129 -71046 -71668 -72287 -75234 -73408 -72480 -74411 -74988 -72700 -73159
-13044 -73159 -76475 -75861 -70472 -66637 -65661 -66004 -71117 -71817 -67748 -66004 -67122 -71877 -71862 -70610 -69358 -70669 -71981 -71146
-13026 -71146 -70312 -69477 -68642 -70028 -71415 -72801 -74187 -73010 -71832 -70654 -69477 -74232 -78987 -77064 -75141 -72503 -69864
-13009 -69864 -68657 -67450 -67703 -67953 -66775 -65594 -68530 -71463 -69630 -67792 -68314 -68832 -69354 -65102 -63149 -64055 -64487 -64916 -66615
-12990 -66615 -68310 -70010 -71705 -68963 -66216 -66335 -66451 -66451 -66447 -69309 -72167 -70409 -68646 -69749 -70848 -70487 -70122 -70774 -71422 -73535
-12970 -73535 -68966 -68158 -67345 -66335 -65322 -64312 -63298 -65389 -67476 -69566 -71653 -71560 -71463 -71370 -71273 -71806 -72335 -70960 -72443 -73177
-12950 -73177 -69138 -67606 -68933 -73036 -74273 -72533 -70789 -71445 -72097 -72753 -73405 -75730 -78052 -75607 -73159 -72890 -72618 -72350
-12932 -72350 -72078 -72227 -72372 -72521 -72667 -71787 -70904 -70025 -69141 -68024 -66902 -68646 -70386 -68419 -66447 -67342 -68232 -66503 -64770
-12913 -64770 -67811 -70848 -72525 -74202 -73017 -71832 -71243 -70654 -70066 -74247 -75387 -73666 -73852 -74038 -76550 -79062 -78711 -78361
-12895 -78361 -77713 -77064 -76416 -75767 -75238 -74709 -74180 -73651 -71102 -68553 -70774 -72995 -72890 -72786 -72682 -72577 -73748 -74914 -76084 -77251
-12875 -77251 -74008 -70763 -70382 -69999 -66883 -63764 -65419 -67069 -69320 -71567 -73818 -76065 -75499 -74929 -74362 -73792 -70423 -67051
-12857 -67051 -66544 -66033 -65706 -65374 -65046 -64714 -65281 -65843 -66410 -66973 -69335 -71698 -74061 -76423 -76162 -75902 -75641 -75380 -74970 -74560 -74150
-12836 -74150 -73740 -71363 -68985 -66607 -64230 -62627 -61025 -59601 -62948 -67666 -72384 -77221 -77288 -77951 -78614 -76118 -73621 -69991
-12818 -69991 -66361 -69410 -72458 -73054 -73651 -72279 -73766 -75615 -71735 -71258 -70777 -71254 -71731 -72208 -72682 -75484 -78283 -78223 -78160 -76617
-12798 -76617 -75074 -73531 -71985 -74616 -77243 -75104 -72961 -71590 -70218 -68847 -67472 -68307 -69138 -67110 -65079 -64957 -64830 -67569
-12780 -67569 -70304 -70897 -71486 -72078 -72667 -70554 -68437 -66324 -64207 -63883 -63555 -66093 -68627 -71381 -74131 -74023 -73911 -72969 -72022
-12761 -72022 -71079 -70133 -71545 -72954 -74366 -75775 -76174 -76569 -74105 -71638 -71847 -72056 -72264 -72469 -71784 -71094 -70409 -69719 -69242 -68765
-12741 -68765 -68646 -68523 -65542 -68281 -72454 -73762 -73505 -76110 -76569 -77023 -77303 -71854 -70703 -72410 -74478 -73684 -70207 -69589 -72015
-12722 -72015 -74437 -74239 -71176 -69846 -74239 -75950 -71936 -67565 -68918 -69913 -65184 -66030 -66876 -67364 -67852 -65597 -63343 -67766
-12704 -67766 -72190 -73382 -74575 -72905 -71236 -71057 -70878 -70699 -70520 -68940 -67360 -68642 -69924 -68582 -67241 -65899 -64558 -65728
-12686 -65728 -66894 -70923 -74951 -73617 -72279 -70941 -69604 -71936 -74266 -73733 -73200 -71657 -70110 -68564 -67017 -67159 -67297 -67435
-12668 -67435 -67573 -70517 -73457 -73535 -73613 -71012 -68407 -66160 -63913 -62326 -66458 -67371 -68284 -67744 -67200 -66660 -66115 -66470 -66820 -64312
-12648 -64312 -61800 -65374 -68944 -72518 -76088 -71970 -67848 -68501 -69149 -68631 -68109 -67233 -72078 -73110 -74139 -75529 -76915 -76464
-12630 -76464 -76010 -75559 -75104 -72030 -68951 -65877 -62799 -63790 -64781 -65773 -66760 -68109 -69458 -70807 -72153 -71974 -71795 -71616 -71433
-12611 -71433 -72149 -72864 -73580 -74292 -71944 -69596 -69753 -69905 -73639 -71649 -72879 -74105 -74321 -74538 -71892 -69242 -70174 -71105 -72037
-12592 -72037 -72965 -73110 -73252 -70535 -67815 -68378 -68937 -69499 -70058 -70576 -71090 -71608 -72123 -72641 -73155 -73673 -74187 -73580 -72969 -72361 -71750
-12571 -71750 -69771 -67789 -65810 -63827 -65709 -67587 -66965 -66339 -64643 -68668 -72339 -76006 -74530 -73054 -71579 -70099 -71426
-12554 -71426 -72753 -74079 -75402 -75029 -74657 -74284 -73908 -70912 -67915 -67781 -67643 -66809 -65974 -68001 -70025 -71038 -72052 -73066 -74075
-12535 -74075 -75648 -77221 -74023 -70822 -70845 -70867 -70889 -70908 -69160 -67409 -68523 -69633 -67945 -66253 -69335 -72413 -74280 -76144 -75149
-12516 -75149 -74150 -73572 -72991 -72771 -72548 -68653 -70479 -71951 -73420 -73103 -72782 -72466 -72145 -69533 -66917 -67166 -67412 -70524 -73632
-12497 -73632 -70423 -67211 -63607 -65724 -66414 -64237 -64748 -68117 -72920 -71996 -70986 -69972 -68605 -67233 -67833 -68430 -69030 -69626
-12479 -69626 -71821 -74012 -73345 -72674 -69205 -65732 -65124 -64513 -66373 -68228 -67226 -66220 -66112 -66000 -65892 -65780 -67632 -69481 -68471
-12460 -68471 -67457 -69011 -70561 -68896 -67226 -72693 -72432 -68836 -68098 -69928 -68892 -66965 -65035 -62579 -62981 -65355 -62001
-12443 -62001 -60261 -64241 -68046 -66123 -62326 -61386 -63253 -65117 -70561 -76002 -74769 -73531 -69939 -66347 -65914 -65482 -64036
-12426 -64036 -67360 -69611 -69000 -66727 -64453 -66771 -69089 -69171 -69253 -67904 -66555 -68493 -70431 -72369 -74307 -70371 -66436 -66973
-12408 -66973 -67509 -68396 -64513 -63313 -62113 -63209 -64304 -63969 -63634 -62359 -61081 -56944 -52804 -54094 -55379 -55238 -55092 -57209
-12390 -57209 -59322 -61439 -63552 -62001 -60447 -65575 -70699 -71989 -73274 -71702 -70125 -70520 -70912 -68445 -65974 -66943 -67908 -68877
-12372 -68877 -69842 -71467 -73088 -69943 -66794 -68981 -71165 -70490 -69812 -68214 -66611 -65012 -63410 -64286 -65158 -64602 -64044 -64651 -65255
-12353 -65255 -68426 -71594 -75160 -73952 -72570 -71184 -68579 -65970 -66227 -66481 -66648 -66812 -68411 -70006 -73543 -77075 -73934 -70789
-12335 -70789 -70356 -69920 -69488 -69052 -65579 -62102 -61491 -60876 -63142 -65404 -62899 -60391 -62538 -64681 -63965 -63246 -63883 -64517 -68016
-12316 -68016 -71512 -70599 -69682 -71333 -72980 -73155 -68556 -66645 -69499 -70271 -68176 -68173 -68165 -65262 -65217 -65176 -62270 -62676 -63078 -64558 -66033
-12295 -66033 -69630 -70360 -67934 -65504 -67938 -70368 -68329 -66287 -62121 -62721 -65411 -68098 -67271 -66440 -64002 -64424 -66429 -68430
-12277 -68430 -66022 -63611 -63142 -65530 -67744 -69954 -69544 -69130 -68720 -68307 -68702 -69093 -69667 -70237 -68687 -69995 -69697 -69395 -69544 -69689
-12257 -69689 -71627 -70699 -69745 -71649 -73021 -74388 -75492 -73729 -66961 -66868 -68277 -69682 -70077 -67606 -68448 -66425 -61543 -61427
-12239 -61427 -65210 -66130 -64189 -62247 -64897 -67547 -66976 -69268 -71292 -70453 -71582 -72712 -70382 -70915 -70017 -69119 -68288 -70319
-12221 -70319 -71992 -73666 -77157 -77787 -75257 -72726 -70584 -68441 -71068 -73695 -74325 -74955 -74333 -73710 -70472 -70092 -72577 -72197
-12203 -72197 -72387 -72574 -70796 -71877 -69950 -65158 -65139 -67979 -68556 -66268 -63209 -60146 -58346 -61312 -67442 -68799 -64643 -65255
-12185 -65255 -65929 -63738 -66887 -70032 -68232 -63566 -62273 -65747 -69045 -67569 -66488 -65407 -66891 -68374 -67383 -66391 -63969
-12168 -63969 -61547 -60794 -60041 -59288 -58536 -58528 -58521 -53147 -47773 -41870 -26427 -3233 25684 55318 56332 29560 2788 -20912
-12150 -20912 -35073 -42198 -49324 -54332 -59341 -64707 -64349 -64535 -64722 -65981 -67241 -68620 -69999 -71377 -72756 -72190 -71623 -69626
-12132 -69626 -67628 -65452 -63276 -63962 -64647 -65579 -66510 -66011 -65512 -65638 -65765 -65892 -66019 -66600 -67181 -70982 -69059 -67733 -66406 -64722
-12112 -64722 -63037 -63906 -64774 -65642 -66510 -66663 -66816 -67327 -67837 -66678 -71243 -72589 -73934 -72536 -71139 -69741 -68344 -68132 -67919
-12093 -67919 -68064 -68210 -66537 -70587 -74638 -72965 -73140 -73315 -74564 -75812 -71486 -67159 -65933 -70431 -74825 -73490 -72876 -72257
-12075 -72257 -71821 -71381 -70945 -70505 -70889 -71269 -74515 -77757 -77247 -76733 -76222 -75708 -75249 -74791 -74333 -73874 -75115 -76356 -74735 -73114
-12055 -73114 -72328 -71541 -66462 -70923 -76188 -75730 -72410 -69089 -67561 -66033 -67368 -68702 -67979 -67256 -67964 -68672 -70707 -72741
-12037 -72741 -68098 -63455 -58841 -54228 -54802 -61100 -68679 -73394 -71493 -69589 -69298 -69004 -68713 -68419 -68702 -68981 -69264 -69544 -67770
-12018 -67770 -65993 -67081 -68165 -69477 -70789 -70669 -70550 -71266 -71981 -69835 -67688 -66220 -64752 -61852 -58953 -60406 -61860 -64386
-12000 -64386 -66913 -69536 -66436 -64945 -66317 -67002 -67688 -68553 -69417 -68575 -67733 -66891 -66048 -67830 -69611 -71392 -73174 -72909 -72641
-11981 -72641 -72376 -72108 -71307 -70502 -69700 -68896 -68877 -68855 -65974 -63089 -66738 -70382 -69261 -68135 -66775 -65411 -65482 -65549 -66842 -68132
-11961 -68132 -69425 -70714 -68907 -67096 -68150 -69201 -71538 -73871 -73345 -72816 -72503 -72190 -73308 -74426 -74649 -74873 -72950 -76751
-11943 -76751 -79777 -77079 -74739 -72399 -74321 -70520 -68866 -67211 -64766 -68046 -71146 -71385 -69596 -67807 -65840 -63872 -65780
-11926 -65780 -67688 -69596 -71504 -72041 -72577 -73114 -73651 -71269 -68884 -71273 -73658 -72976 -72290 -70177 -68061 -68527 -68989 -69455 -69917
-11907 -69917 -71515 -73110 -74828 -71772 -70759 -74511 -75465 -73554 -71676 -69794 -70599 -71400 -72749 -74094 -72760 -71422 -68329
-11890 -68329 -68094 -68042 -72756 -72577 -67628 -67092 -66555 -65661 -64766 -66734 -68702 -69969 -71236 -71072 -70908 -69760 -68612 -70327 -72041
-11871 -72041 -71821 -71601 -71381 -71161 -68318 -65475 -65493 -65512 -64755 -63999 -63242 -62486 -64889 -67293 -66835 -66376 -66101 -65821 -65724 -70394 -71847
-11850 -71847 -73297 -73617 -73934 -71877 -69816 -69190 -68560 -65609 -62653 -62564 -62471 -61085 -59695 -61170 -62642 -63790 -64934 -66082 -67226
-11831 -67226 -67464 -67699 -66507 -65311 -64506 -63697 -65575 -67450 -67651 -64990 -61256 -62292 -63566 -64841 -66294 -72518 -76878 -76468
-11813 -76468 -74269 -72071 -71422 -70774 -74895 -79017 -78607 -78197 -77787 -77377 -77176 -76975 -76774 -76572 -75223 -73874 -71094 -68314 -67323
-11794 -67323 -66332 -70110 -73889 -72507 -71124 -71172 -71221 -69749 -68277 -66805 -65333 -69436 -73539 -73051 -72562 -70226 -70751 -72529 -69536
-11775 -69536 -70066 -73457 -74940 -76423 -76595 -76766 -74075 -71385 -71035 -70684 -70334 -69984 -69633 -69283 -68933 -68582 -68109 -67636 -70025 -72413
-11755 -72413 -71195 -69976 -70189 -70401 -70256 -70110 -69965 -69820 -70479 -71139 -71799 -72458 -72600 -72741 -72883 -73025 -73345 -73666 -73807 -73949 -72764
-11734 -72764 -68717 -66160 -68374 -73926 -74709 -71795 -68881 -68601 -68318 -70900 -73479 -76837 -80191 -80806 -74739 -71374 -70867 -68337
-11716 -68337 -70572 -71679 -69920 -67509 -65094 -62601 -64875 -68940 -70140 -69048 -67953 -69544 -71131 -70502 -69868 -69715 -66697
-11699 -66697 -61029 -60127 -63045 -65959 -67390 -68817 -70248 -71676 -72331 -72984 -73639 -74292 -71936 -69577 -67222 -64863 -66265 -67662
-11681 -67662 -69063 -70461 -73926 -77388 -76084 -74776 -75261 -75741 -71635 -67524 -65124 -65583 -68609 -64953 -61122 -63965 -67409
-11664 -67409 -70848 -71269 -71687 -72108 -72525 -72946 -73364 -73785 -74202 -71791 -69376 -68515 -73375 -73170 -72961 -73114 -73263 -73639 -74012 -74388 -74761
-11643 -74761 -74511 -74258 -75439 -76617 -73051 -69481 -68776 -68068 -68556 -69041 -70602 -72160 -75052 -72216 -70099 -67979 -63388 -64517
-11625 -64517 -68631 -69879 -70848 -68951 -68489 -68024 -68009 -67990 -69406 -70818 -73136 -75451 -74906 -74359 -73308 -72253 -74005 -78614 -82006
-11606 -82006 -79669 -72745 -71541 -72249 -72954 -74020 -75082 -74269 -73457 -72644 -71832 -71377 -70923 -70468 -70013 -70826 -71638 -72451 -73263 -74105
-11586 -74105 -74948 -74359 -73770 -75626 -77482 -76833 -76185 -72585 -74709 -73613 -72518 -73032 -73546 -71556 -69566 -69007 -74172 -76654 -73412
-11567 -73412 -72018 -73487 -72987 -72488 -72227 -71966 -68843 -65720 -64595 -63470 -65206 -66943 -69037 -71131 -70364 -69596 -68497 -67397
-11549 -67397 -69160 -70923 -71553 -72182 -72812 -73442 -69794 -66145 -67267 -68389 -68556 -68724 -68892 -69059 -72462 -75864 -74497 -73129 -71761
-11530 -71761 -70394 -69026 -67658 -69510 -71363 -70353 -69343 -68303 -67263 -67655 -68046 -68903 -69760 -70617 -71474 -71228 -70982 -67874 -64766
-11511 -64766 -62866 -60965 -61927 -62888 -62836 -62784 -62732 -62680 -66801 -70919 -70271 -69618 -68135 -66648 -65165 -63678 -60898 -58115 -58196 -58275 -61100
-11490 -61100 -63921 -66745 -69566 -68195 -66820 -68310 -69797 -72868 -75935 -74236 -72533 -74769 -77001 -77806 -78607 -75894 -73177
-11473 -73177 -71895 -70610 -69343 -68072 -66805 -65534 -65370 -65202 -65039 -64871 -64275 -63675 -62363 -66771 -71422 -70345 -68079 -65810
-11455 -65810 -65706 -65597 -65493 -65385 -67845 -70300 -69898 -69492 -70461 -71426 -75257 -79084 -79367 -79647 -77068 -74485 -72823 -71161 -70572
-11436 -70572 -69984 -73539 -71370 -67651 -63932 -67442 -70953 -71601 -72249 -67651 -63052 -63224 -63395 -65892 -68389 -71601 -69089 -65981
-11418 -65981 -68597 -70498 -72399 -70543 -68687 -69693 -70699 -65862 -61025 -59050 -57075 -49722 -42366 -41691 -41013 -42008 -42999 -46856
-11400 -46856 -50710 -56072 -61431 -63932 -66429 -68691 -70949 -73211 -75469 -72909 -70345 -67785 -65221 -64927 -64629 -67196 -69760
-11383 -69760 -68087 -66410 -67599 -68784 -71225 -73662 -71333 -69000 -70379 -71758 -73136 -74515 -73569 -72622 -71676 -70729 -68046 -65363
-11365 -65363 -62680 -59996 -57134 -54272 -56180 -58088 -60734 -63380 -66026 -68672 -71139 -73606 -77385 -78301 -77720 -72369 -72682
-11348 -72682 -75857 -75872 -75887 -73218 -70550 -72738 -74925 -74072 -73218 -77075 -78070 -73222 -73144 -71791 -70438 -69205 -67971 -68348 -65862
-11329 -65862 -64986 -68881 -71858 -71974 -69525 -69939 -73036 -76133 -76546 -76960 -77195 -77429 -77664 -77899 -77180 -76460 -78424 -80388 -81652
-11310 -81652 -80053 -77083 -78883 -81637 -79621 -76293 -75827 -74325 -75685 -77224 -75902 -74400 -72898 -74079 -75261 -75965 -76669
-11293 -76669 -74810 -72950 -72641 -77101 -76017 -74933 -74869 -74806 -74743 -74679 -77895 -81111 -81465 -81819 -81298 -80776 -77392 -74008 -75991 -77973
-11273 -77973 -75186 -72399 -69373 -66347 -66183 -66019 -67643 -69268 -70893 -72518 -72935 -73353 -73770 -74187 -70848 -67509 -68940 -70371
-11255 -70371 -71474 -72577 -73680 -74784 -73740 -72697 -71951 -71206 -69972 -73505 -71497 -69484 -68966 -68445 -67927 -72175 -73446 -71851
-11237 -71851 -69305 -66756 -65523 -64286 -65914 -67539 -68758 -69972 -71191 -72406 -73386 -74362 -72480 -70595 -70189 -69779 -71281 -69917
-11219 -69917 -65337 -65523 -64640 -60891 -61685 -65340 -68817 -69432 -68378 -67323 -66089 -64856 -64599 -64342 -64085 -63827 -63928 -64029 -64129
-11200 -64129 -64230 -65053 -65877 -66701 -67524 -68050 -68575 -69100 -69626 -72007 -74388 -72179 -69969 -67401 -67696 -73833 -75201 -76140 -77075 -77716
-11180 -77716 -78354 -80247 -82136 -78961 -75782 -78003 -75451 -71113 -69633 -71795 -73952 -71523 -69089 -70722 -72354 -73986 -75618
-11163 -75618 -75879 -76140 -76401 -76662 -77392 -78123 -78853 -79583 -79658 -79732 -79807 -79881 -79729 -79572 -74649 -69723 -72492 -75257 -75164 -75067 -76010 -76949 -75029
-11140 -75029 -73107 -74944 -76777 -78436 -80090 -79703 -76453 -74098 -77467 -83101 -83012 -79762 -79375 -79494 -73889 -71683 -69477 -69417
-11122 -69417 -69358 -69298 -69238 -68236 -67233 -69093 -70953 -70606 -70259 -72775 -75290 -73960 -72630 -76069 -79509 -79609 -79710 -76949 -74187
-11103 -74187 -73662 -73136 -75473 -77809 -75078 -72346 -72477 -72607 -72946 -73285 -73625 -73964 -75197 -76431 -77485 -78540 -78551 -75697 -71057
-11084 -71057 -72138 -74236 -73468 -71452 -75156 -76390 -77619 -76349 -75074 -69630 -64181 -63507 -62829 -65661 -68489 -71322 -74150
-11067 -74150 -73226 -72298 -71374 -70446 -71728 -73006 -74288 -75566 -72615 -69659 -69570 -69477 -69946 -70412 -70882 -71348 -72890 -74429 -74005 -76438
-11047 -76438 -78547 -74929 -71314 -73420 -72846 -69406 -67938 -66466 -66317 -66164 -66015 -65862 -67561 -69257 -71135 -73010 -70088 -70025
-11029 -70025 -74437 -73121 -70498 -67871 -67751 -67628 -67487 -67342 -67200 -71825 -75618 -76546 -74616 -72682 -72138 -71590 -73610 -75626 -75618
-11010 -75618 -70837 -69995 -72011 -73725 -75436 -74467 -73494 -74493 -75488 -76487 -77482 -75097 -72708 -73185 -73658 -73539 -73416 -76159 -78898
-10991 -78898 -79278 -79654 -80034 -80411 -81208 -82002 -79937 -77869 -75916 -73960 -69145 -64327 -66607 -68884 -71165 -73442 -75141 -76837
-10973 -76837 -73945 -71049 -69171 -70151 -66663 -67942 -70722 -70636 -72462 -74284 -75335 -76382 -72663 -68940 -70114 -71288 -69600
-10956 -69600 -67912 -68430 -68948 -69168 -69387 -69928 -65698 -64509 -68091 -66127 -67025 -71083 -72279 -74049 -75820 -74549 -73278 -71649
-10938 -71649 -70021 -71254 -72488 -73185 -73882 -72015 -70148 -67028 -68679 -69257 -66973 -65206 -63440 -64357 -65273 -64401 -63529 -62657 -61785
-10919 -61785 -64491 -67196 -68948 -67837 -67442 -71817 -73330 -74843 -76181 -77519 -75995 -74470 -74258 -74046 -73833 -73621 -69600 -65579
-10901 -65579 -65374 -69939 -73312 -73822 -74988 -73293 -68068 -62844 -66026 -69209 -72272 -75335 -75536 -75738 -74478 -73218 -74821 -76423
-10883 -76423 -76475 -76528 -79144 -81760 -85978 -85427 -81178 -79792 -76110 -72428 -70356 -68284 -71049 -73815 -71810 -69805 -72242 -74679
-10865 -74679 -72346 -70013 -69954 -69891 -72693 -75492 -76744 -77992 -79244 -80493 -80724 -80951 -81182 -81409 -80448 -79483 -78521 -77556 -75615 -73673
-10845 -73673 -71731 -69790 -70025 -70259 -69063 -67867 -70412 -72957 -70733 -68508 -68698 -68888 -69078 -69268 -70755 -72238 -71161 -70081
-10827 -70081 -66619 -67923 -69231 -65765 -63742 -61714 -62255 -62791 -62437 -62080 -61547 -61010 -63939 -64006 -61927 -66525 -67815 -69104 -69380
-10808 -69380 -69656 -68717 -67778 -69700 -71623 -72950 -74277 -70833 -67390 -65236 -63082 -62180 -61278 -62821 -61502 -60362 -63991 -66965
-10790 -66965 -67077 -64446 -64677 -68396 -69253 -69037 -68821 -69451 -70081 -70710 -71340 -69376 -67412 -70218 -73025 -74519 -76013 -76077 -76140 -75309
-10770 -75309 -74478 -72216 -69954 -72745 -75533 -75462 -75387 -72782 -70174 -72339 -74500 -75786 -77068 -75492 -73911 -73051 -72186 -71325 -70461
-10751 -70461 -71713 -72961 -74213 -75462 -77936 -80407 -81450 -82490 -78219 -73945 -74444 -77802 -78033 -73490 -70204 -69775 -70271 -70763
-10733 -70763 -68873 -66980 -64703 -67192 -68433 -69671 -71128 -72581 -71176 -69768 -68273 -66775 -68143 -69507 -69842 -70174 -67647
-10716 -67647 -65117 -66376 -67632 -70323 -73010 -71661 -70308 -71821 -73330 -76602 -79870 -81234 -77824 -73177 -71392 -70561 -69730
-10699 -69730 -69853 -69976 -71530 -73084 -72760 -72436 -70859 -69283 -69018 -71616 -75465 -74545 -71217 -70751 -71061 -71370 -74005 -73777 -72179
-10680 -72179 -75350 -79639 -79159 -76889 -74620 -74854 -75089 -72462 -74605 -77452 -77433 -76464 -75492 -73539 -71582 -72492 -73397 -72384 -71366
-10661 -71366 -69220 -67069 -64893 -67483 -67394 -67301 -68530 -69756 -70986 -72212 -73859 -75503 -74288 -73069 -73315 -73557 -74102 -74642 -70535
-10642 -70535 -71195 -73587 -75976 -79304 -76908 -72961 -69015 -66976 -64938 -67669 -70401 -72775 -75149 -74661 -74172 -75950 -77728
-10625 -77728 -76643 -75559 -70461 -65363 -66943 -68523 -71474 -74426 -72607 -70789 -70490 -70192 -70073 -69954 -67330 -67569 -72458 -71623
-10607 -71623 -67595 -66429 -64725 -65884 -67520 -72018 -73893 -70043 -69414 -74508 -74236 -76826 -78939 -78190 -76367 -74545 -73133
-10590 -73133 -71720 -70308 -68896 -68974 -69052 -69130 -69209 -71881 -74552 -78477 -79539 -81376 -77489 -77895 -81163 -79818 -78473 -77306 -76140
-10571 -76140 -75391 -74642 -76755 -78868 -81681 -84495 -82896 -81298 -77552 -79531 -81152 -82773 -82155 -81532 -78052 -74567 -75022 -75473
-10553 -75473 -75928 -76379 -74992 -73602 -72037 -70468 -71049 -68765 -64696 -66347 -68541 -67871 -66309 -64744 -65627 -66507 -67390 -68269 -70025
-10534 -70025 -71776 -70669 -69559 -67021 -64480 -68620 -72756 -71541 -70327 -69112 -67897 -65609 -63321 -65802 -68284 -70528 -72771
-10517 -72771 -75015 -77258 -78428 -79598 -80470 -81342 -84394 -82676 -79170 -78525 -79252 -79978 -76114 -72249 -70651 -69052 -70315 -71579
-10499 -71579 -71948 -72317 -72685 -73054 -73721 -74388 -74877 -70595 -70248 -69902 -66395 -62888 -63198 -63507 -66678 -69850 -68132 -66414 -64696
-10480 -64696 -62978 -63026 -63071 -63119 -63164 -62258 -61349 -65214 -71936 -73684 -70658 -68709 -69618 -71724 -70964 -70207 -72309 -73088 -71001 -65937
-10460 -65937 -60868 -61230 -61588 -61949 -62307 -65352 -68392 -68575 -68754 -68698 -68638 -68582 -68523 -69529 -70531 -71657 -68009 -66570 -69898 -72931
-10440 -72931 -71191 -70684 -70174 -72231 -74284 -75983 -77679 -76516 -75350 -73792 -72231 -70673 -69112 -68568 -68020 -67476 -66928 -67867
-10422 -67867 -68802 -69741 -70677 -68992 -67304 -65799 -64289 -64629 -67830 -66559 -70058 -74631 -76341 -75190 -74038 -75287 -76535 -77783
-10404 -77783 -79032 -77359 -75685 -74012 -72339 -72253 -72167 -72082 -71996 -71910 -71825 -71739 -71653 -71493 -71333 -71172 -71012 -72044 -73077 -74288 -75499 -75227
-10382 -75227 -77813 -80403 -80127 -81406 -82680 -82527 -79509 -76434 -73356 -71713 -67204 -65501 -63794 -66503 -69209 -70900 -69727
-10365 -69727 -70166 -70602 -69790 -68974 -68161 -67345 -68702 -70054 -69980 -67040 -68575 -67245 -67349 -67450 -67427 -67405 -68992 -67718 -68053 -68389 -68724
-10344 -68724 -69059 -67740 -69283 -69395 -69507 -70811 -74977 -76103 -74366 -74511 -71795 -72298 -69939 -67342 -67606 -64293 -63842 -69883
-10326 -69883 -73062 -71351 -69641 -67751 -65862 -66835 -67807 -67248 -66686 -68810 -66160 -66138 -66112 -66865 -70476 -72331 -71322 -72104 -72883
-10307 -72883 -72294 -71702 -71113 -70520 -69201 -67882 -63701 -59519 -61003 -62486 -63790 -65094 -67353 -66749 -69365 -69119 -63924 -58729
-10289 -58729 -58424 -60980 -62788 -64591 -63894 -63194 -65538 -70740 -74157 -77571 -77828 -75220 -74225 -73226 -74377 -75525 -73636 -71743
-10271 -71743 -71590 -68575 -65560 -65407 -62571 -59736 -58987 -63008 -66015 -66160 -66425 -69551 -73692 -74970 -75175 -75380 -71448 -67513
-10253 -67513 -65549 -60719 -59054 -63108 -66987 -65139 -66589 -68035 -66265 -64491 -65523 -66551 -68478 -73263 -75313 -71635 -71359
-10236 -71359 -71079 -70625 -70166 -69712 -69253 -69730 -70204 -70681 -71154 -71989 -72820 -73654 -74485 -73125 -71761 -70759 -69753 -67975 -71918 -72644
-10216 -72644 -73367 -75264 -77157 -76192 -75223 -72589 -69950 -67494 -65035 -66380 -70584 -73539 -70766 -72290 -73811 -74977 -76140
-10199 -76140 -76241 -76338 -76438 -76535 -74251 -71963 -72540 -73114 -76572 -80027 -80206 -74657 -70722 -69645 -72864 -70356 -69812 -72126 -76770
-10180 -76770 -78547 -76513 -71612 -68146 -64677 -63108 -61536 -63008 -64476 -60939 -60261 -67874 -69760 -68787 -67811 -68985 -70155
-10163 -70155 -74429 -72976 -71884 -70789 -71690 -72592 -70632 -68672 -67964 -67256 -66548 -65840 -64237 -62635 -63537 -64439 -68441 -66719 -63447
-10144 -63447 -60175 -62236 -64293 -66354 -68411 -71068 -73721 -73516 -73308 -72842 -72372 -71907 -71437 -70613 -69786 -68963 -68135 -68329 -68523 -71579
-10124 -71579 -74634 -73457 -72279 -73666 -75052 -76699 -73576 -68664 -63753 -62299 -65616 -67860 -67241 -67502 -67759 -67841 -72689 -75574
-10106 -75574 -75592 -75734 -78734 -80694 -79788 -77813 -75834 -73800 -71761 -66865 -61964 -63645 -65325 -67006 -68687 -71083 -73479 -73013
-10088 -73013 -72548 -71664 -70781 -69898 -69015 -69622 -70230 -70837 -71445 -70278 -69112 -67945 -66779 -66805 -66831 -66857 -66883 -68787 -70692 -72596 -74500
-10067 -74500 -74735 -74970 -75205 -75439 -74232 -73021 -71813 -70602 -74403 -78201 -77232 -76259 -71892 -67520 -66015 -64506 -65743 -66976
-10049 -66976 -63444 -59907 -62456 -65001 -64688 -64371 -64953 -65530 -68974 -72413 -71623 -70830 -70040 -69246 -72033 -74817 -72835 -70848 -72089
-10030 -72089 -73326 -74567 -75805 -75555 -75302 -75052 -74798 -74593 -74385 -74180 -73971 -71918 -69861 -68105 -66347 -65881 -70181 -71802 -68650
-10011 -68650 -68303 -70815 -71422 -72026 -73170 -74310 -72890 -71467 -68795 -70889 -70304 -69715 -69850 -69980 -70468 -65232 -65843 -66451 -69563
-9992 -69563 -72674 -71616 -70554 -69492 -68430 -67729 -67025 -66320 -65616 -65173 -64729 -67148 -69563 -70610 -71657 -67934 -64207 -67371
-9974 -67371 -70535 -68929 -67319 -68098 -68877 -69656 -70431 -68873 -67315 -65758 -64200 -63537 -62873 -62210 -61547 -60749 -59952 -62016 -64081
-9955 -64081 -66205 -68329 -70453 -72577 -71143 -69704 -68269 -66831 -68974 -71113 -70394 -69671 -72559 -75443 -75469 -75492 -73669 -71843
-9937 -71843 -70021 -68195 -64763 -61331 -62668 -64002 -64804 -65605 -66406 -67204 -67260 -67315 -67371 -67424 -64558 -61692 -58826 -55957 -55327 -54697
-9917 -54697 -53889 -58800 -62583 -69227 -74977 -75000 -73312 -71623 -69577 -67528 -66496 -65463 -64789 -64111 -61733 -65076 -68601 -66399
-9899 -66399 -66168 -68795 -71247 -70833 -66563 -65150 -64815 -64476 -62769 -61059 -62214 -63365 -64968 -66566 -68169 -69768 -69462 -69153
-9881 -69153 -65448 -67464 -71303 -72276 -70449 -68620 -71146 -73669 -76196 -78719 -74232 -69745 -68120 -66496 -65258 -64021 -64215
-9864 -64215 -64409 -68925 -73442 -73189 -72935 -71877 -70818 -69760 -68702 -67860 -67017 -66175 -65333 -66816 -68299 -66920 -65542 -65042 -64543
-9845 -64543 -64044 -63544 -63671 -63798 -63924 -64051 -65352 -66652 -69384 -72115 -72849 -73584 -77180 -80776 -77396 -74016 -77016 -80016 -78156
-9826 -78156 -71526 -68832 -69000 -68214 -67427 -68251 -69074 -67662 -66250 -67520 -68791 -70390 -69127 -66790 -69223 -68884 -68545 -68504 -68463 -69656
-9806 -69656 -70848 -70610 -70371 -69268 -68165 -64200 -60235 -62322 -64409 -63634 -62858 -63335 -63812 -64289 -64766 -67282 -69797 -69451 -69104
-9787 -69104 -67267 -65430 -63593 -61755 -62422 -63089 -63757 -64424 -64912 -65400 -65888 -66376 -67334 -68288 -66682 -65072 -64807 -69309 -68269 -67226
-9767 -67226 -66961 -66693 -67860 -69022 -67505 -65985 -67330 -68672 -69216 -69756 -69048 -68337 -66287 -67096 -72022 -72175 -70319 -71322 -70420
-9748 -70420 -69514 -69954 -70390 -67968 -65542 -63492 -61442 -61003 -60563 -60123 -62545 -65147 -62024 -61062 -60101 -58782 -57462 -55964 -54466
-9729 -54466 -53326 -52186 -53177 -59892 -63566 -64379 -62776 -61174 -62255 -63335 -65012 -66689 -68366 -70043 -65698 -61353 -63686
-9712 -63686 -66019 -63149 -60276 -60447 -60615 -56821 -55886 -52987 -55808 -56620 -57429 -60030 -62627 -62367 -62102 -61841 -61577 -61957 -62333 -61640
-9692 -61640 -60943 -57120 -59016 -64077 -66272 -65817 -65359 -64725 -64088 -68076 -72059 -73185 -74307 -73982 -73654 -72794 -74791 -76911 -73304
-9673 -73304 -70058 -69671 -69332 -68989 -69723 -73315 -76196 -73349 -71042 -68732 -69004 -69272 -67755 -66235 -68922 -65881 -62844 -65527
-9655 -65527 -65337 -65143 -65311 -65475 -66179 -66879 -67584 -68284 -68687 -69086 -66626 -64163 -64625 -65083 -68407 -71728 -70953 -70174 -66537 -62896
-9635 -62896 -63760 -64621 -62624 -60623 -62426 -64226 -64599 -64968 -66950 -68929 -69659 -70386 -68687 -69846 -68683 -73241 -76580 -74191
-9617 -74191 -70912 -70490 -72197 -73900 -71016 -68128 -68463 -68795 -71992 -75186 -75820 -76449 -75890 -69604 -68508 -73133 -73110 -70222 -67956
-9598 -67956 -68549 -66820 -70811 -73285 -72894 -71433 -72831 -71877 -70919 -70144 -69365 -69693 -70017 -70345 -70669 -71553 -72432 -73315 -74195 -73587 -72976
-9577 -72976 -72369 -71758 -70688 -69615 -71407 -73196 -75167 -77135 -72428 -67718 -66932 -66142 -68217 -70289 -68907 -67520 -69000 -70476
-9559 -70476 -70449 -70420 -73256 -76088 -78000 -79908 -78957 -78003 -78193 -78380 -79639 -80899 -83981 -81335 -77139 -72943 -71821 -70695 -69570
-9540 -69570 -68445 -65057 -61666 -62687 -63708 -66335 -63235 -60313 -63116 -66190 -72123 -73524 -69201 -66939 -67535 -69205 -68012
-9523 -68012 -66764 -65512 -64081 -62650 -63503 -64357 -66641 -68925 -69898 -70871 -74705 -78540 -78469 -78398 -80295 -76468 -72134 -70662 -70084
-9504 -70084 -69507 -66633 -63760 -63749 -63738 -65724 -67710 -68266 -68821 -70047 -71273 -72499 -73725 -70688 -67651 -69026 -70401 -75492 -74854
-9485 -74854 -74634 -71553 -67401 -68970 -71612 -71392 -68031 -64666 -59929 -49469 -43663 -43577 -43372 -48891 -54481 -60067 -70125 -77321
-9467 -77321 -79364 -75678 -71992 -71169 -71780 -72387 -73174 -73960 -73945 -73926 -71046 -68165 -70975 -73785 -73733 -73680 -74165 -74649 -75134 -75618 -73867
-9446 -73867 -72115 -75134 -78152 -78130 -78108 -79516 -80925 -78659 -76393 -75559 -74724 -75052 -75380 -72846 -70312 -74217 -78123 -80597 -83071
-9427 -83071 -83250 -83429 -80746 -78063 -79181 -80299 -81417 -82535 -79718 -76900 -73725 -70550 -74411 -72548 -69611 -69536 -67256 -67837
-9409 -67837 -71758 -75678 -78294 -80910 -80664 -80418 -82617 -84815 -82244 -79673 -80142 -80612 -81081 -81551 -81603 -81655 -76937 -72220 -70513
-9390 -70513 -68802 -71866 -74925 -73815 -72700 -71590 -70476 -72167 -73856 -73580 -76162 -77169 -72447 -72380 -75171 -73621 -72067 -69443
-9372 -69443 -66816 -65504 -67051 -68780 -64781 -60906 -57026 -57563 -58096 -53833 -49566 -43394 -31496 -18341 537 26929
-9356 26929 70493 122165 173838 202973 207303 209546 206066 173965 120876 73392 39264 11575 -10388 -24817
-9342 -24817 -33523 -38412 -43301 -44166 -45030 -47326 -49622 -52774 -55927 -59080 -62232 -64282 -66332 -68024 -69715 -72723 -70002
-9325 -70002 -70505 -71005 -71090 -71172 -71258 -71340 -69309 -67274 -73233 -73464 -74683 -75898 -76759 -77616 -75376 -73133 -72324 -71512 -76338 -81160 -81216
-9304 -81216 -81268 -77903 -74534 -74031 -73524 -74511 -75495 -79345 -83191 -82449 -81704 -80962 -80217 -77508 -74795 -72085 -69373 -68482 -67587 -66697
-9284 -66697 -65802 -67535 -69264 -70997 -72726 -72730 -72730 -72734 -72734 -71545 -70353 -69164 -67971 -70658 -73341 -76028 -78711 -77791 -76867 -77377 -77884
-9263 -77884 -80917 -83947 -84119 -84286 -81298 -78305 -76747 -75186 -73360 -71530 -69704 -67874 -69715 -71553 -73394 -75231 -75775 -76315
-9245 -76315 -76859 -77400 -75320 -73237 -71158 -69074 -70960 -72842 -74728 -76610 -76826 -77038 -77254 -77467 -76945 -76419 -78760 -76326 -76073
-9226 -76073 -78678 -80809 -80075 -79106 -75272 -74303 -73330 -72630 -71925 -68482 -62173 -56523 -57548 -62929 -65445 -68560 -71672 -79378
-9208 -79378 -87081 -89511 -91937 -91505 -91069 -87536 -83999 -83329 -82654 -78778 -74903 -73889 -72876 -70669 -68463 -71802 -70371 -73777
-9190 -73777 -77183 -79993 -82803 -81558 -75544 -75074 -74605 -72264 -69924 -70446 -70967 -70416 -69864 -69313 -68761 -68776 -68791 -68806 -68821 -67852 -66883
-9169 -66883 -67345 -67807 -66928 -66048 -68031 -70013 -73248 -76483 -78465 -80448 -74687 -71787 -74731 -72905 -71884 -70863 -66682 -62501
-9151 -62501 -63701 -64901 -63239 -61577 -63253 -64930 -63745 -62560 -61837 -61114 -65161 -69209 -72361 -75514 -73897 -72279 -71459 -70636
-9133 -70636 -71724 -69946 -67517 -69853 -69332 -68806 -68791 -68773 -68340 -67904 -70692 -66797 -66663 -66525 -64707 -62885 -63928 -64968 -67025
-9114 -67025 -69078 -68392 -61025 -58819 -59471 -56192 -55770 -54131 -47717 -45422 -45984 -48250 -50512 -54388 -58260 -59482 -60701 -57153
-9096 -57153 -53602 -52648 -51690 -55506 -59318 -59885 -60447 -62087 -63723 -65303 -61155 -55938 -53579 -51313 -51906 -53933 -55957 -53602
-9078 -53602 -51243 -49066 -46886 -47840 -51653 -52308 -47237 -45970 -44699 -44505 -44308 -42951 -41591 -45004 -48414 -49189 -49961 -48768
-9060 -48768 -50434 -54727 -53292 -54008 -51858 -50345 -48828 -47136 -45440 -41065 -36687 -37082 -37473 -38420 -39362 -43171 -46976 -45269
-9042 -45269 -43558 -40421 -37279 -32472 -27661 -22854 -18043 -10105 -2164 5773 13714 23977 34244 47965 67415 89424
-9026 89424 111437 135712 165714 199485 238983 283963 334670 397180 476866 593992 774087 1049399 1464001
-9013 1464001 2062483 2826966 3657152 4420561 5046113 5456064 5360573 4824333 4072726 3174201 2340192
-9002 2340192 1702707 1244337 925252 704638 550805 443718 365251 312780 277482 252797 237652 225787
-8990 225787 213921 201162 178862 156115 130506 107699 84892 62473 45778 36834 30752 21958 16025 14743
-8976 14743 7737 239 -7258 -12609 -17961 -19049 -25861 -28022 -30184 -34924 -39664 -41542 -43421 -42735 -42049 -43152 -44255
-8959 -44255 -40335 -42139 -37861 -33582 -32315 -31048 -26919 -22790 -12237 -1683 14594 40412 77081 123291 180710
-8944 180710 243853 300635 344061 367215 365564 336843 290950 235398 179846 127260 80398 44984 19111 1555
-8930 1555 -16000 -27594 -33463 -35233 -37003 -39847 -42690 -45802 -48914 -49163 -49413 -47963 -46514 -45064 -43614 -44580 -45545 -47941
-8912 -47941 -50337 -52726 -55115 -54641 -54168 -56110 -58051 -58562 -59072 -60209 -61345 -61051 -60757 -60283 -59810 -60768 -61726 -61096 -60466 -58405
-8892 -58405 -56344 -58129 -59914 -60268 -60623 -59546 -58469 -57392 -56315 -56043 -55770 -55498 -55226 -53348 -51466 -52808 -54146 -48958
-8874 -48958 -49491 -49670 -49845 -52305 -54761 -55789 -56814 -57664 -58510 -57928 -57343 -58387 -59426 -63332 -67233 -64133 -61029 -57928 -54824
-8855 -54824 -53423 -52018 -53836 -55651 -53296 -56661 -60030 -57671 -53479 -49283 -48250 -50076 -49938 -55521 -61107 -63827 -62735
-8838 -62735 -61640 -58580 -61241 -61163 -61081 -56948 -52812 -50169 -53248 -55972 -58692 -63771 -68847 -72495 -76140 -73259 -70375 -67852
-8820 -67852 -65325 -63220 -66835 -65802 -64766 -65281 -65795 -63805 -61815 -57410 -58729 -56113 -59221 -63611 -62277 -60049 -60682 -62240
-8802 -62240 -63798 -66429 -71922 -76576 -75506 -74795 -76945 -74236 -71526 -69354 -67181 -62117 -62776 -63078 -63380 -64576 -65773 -66969
-8784 -66969 -68165 -68903 -69641 -70379 -71117 -70185 -69253 -68143 -67032 -68098 -66302 -62896 -65214 -65802 -66391 -67338 -68284 -67222 -66160
-8765 -66160 -65098 -64036 -64793 -65549 -64875 -64200 -66805 -69410 -69153 -68896 -69443 -69991 -70539 -71087 -71031 -70975 -70919 -70863 -72179 -73494 -79580
-8744 -79580 -85665 -86176 -86686 -87197 -87707 -83895 -80083 -79132 -78182 -78760 -79337 -81346 -83355 -84827 -86299 -86340 -86381 -83202 -80023 -76844
-8724 -76844 -73666 -73587 -73509 -71642 -75499 -78805 -82106 -79091 -76073 -72492 -68907 -68187 -67464 -67222 -66976 -63872 -60764 -57839 -54910
-8705 -54910 -54846 -54779 -57630 -60477 -63328 -66175 -69026 -71873 -74724 -77571 -81585 -85594 -86746 -87894 -88270 -88643 -80433 -72220
-8687 -72220 -67289 -62359 -60291 -58223 -60447 -62672 -64897 -67122 -69823 -72525 -75227 -77929 -75920 -73911 -71903 -69894 -66648
-8670 -66648 -63403 -64748 -66093 -67140 -65325 -66671 -73740 -82658 -91576 -103236 -109172 -99547 -76565 -50840 -25116 -6553
-8654 -6553 2471 6187 9906 16066 19368 18909 12731 8322 3917 -5618 -15151 -23912 -32669 -30937 -29200 -27445 -25686
-8637 -25686 -24109 -22529 -18985 -18300 -19585 -15143 -9587 -9751 -16835 -23916 -28674 -33430 -40693 -47952 -49521 -45362 -45142 -39195
-8619 -39195 -34861 -36247 -43898 -48683 -52786 -51161 -51865 -58290 -67461 -70904 -70654 -64677 -58521 -52361 -50617 -48869 -53624
-8602 -53624 -58375 -59672 -55241 -55674 -56102 -57429 -55890 -55487 -49357 -45675 -41990 -38494 -25455 -14923 -4388 5874 16140
-8585 16140 29862 49311 63897 78486 91641 110524 124424 138328 140184 142043 132775 123511 111619 105455 98155
-8570 98155 100399 106812 118953 126499 134050 131817 129589 119695 115528 106946 104092 97514 100477 102247 113557 125136
-8554 125136 146254 166061 191592 209789 227986 241770 255555 265643 275731 273774 271818 262162 258231 251079
-8540 251079 253468 251087 258245 266358 280195 281988 289504 285930 282356 267096 257560 246712 249220 250021 264182 273569
-8524 273569 296316 317181 351406 372510 403157 427153 456876 464534 472196 454066 445480 436771 460502 493166
-8510 493166 550637 602858 660806 695854 751895 812225 916442 1031091 1197259 1378926 1619746 1884650
-8498 1884650 2235419 2619335 3066220 3500717 3960019 4413596 4960666 5631877 6617908 7991266 10034336
-8487 10034336 12984368 17512324 24452723 35344615 51459928 72095308 91789099 105688252 107018505
-8478 107018505 95734899 77872230 58118730 41900051 30170924 22114956 16571840 12849921 10255636
-8469 10255636 8519002 7291809 6480800 5893028 5521577 5247435 5038723 4759416 4397587 3911737 3426364
-8458 3426364 2961980 2605159 2307487 2092783 1895252 1741367 1593205 1479745 1372010 1300288 1222842
-8447 1222842 1157209 1066773 987426 887092 802140 717189 656923 602381 575177 542248 530070 508351 493371
-8434 493371 468850 449814 409791 377336 335341 302409 259937 225336 185011 164839 144667 139371 124536 120075
-8420 120075 106074 96426 81054 68961 43512 27864 9354 3545 -5126 -4973 -7683 876 6574 25002 37706
-8405 37706 53451 59656 67649 66103 64497 45718 27961 7342 -4154 -15650 -21959 -28268 -26349 -24430 -17860
-8390 -17860 -17014 -14856 -26055 -35345 -57992 -84454 -110916 -125357 -139798 -141597 -137673 -122838 -113726 -97818 -87633
-8375 -87633 -73394 -59154 -43126 -36638 -27407 -23901 -13656 -6274 895 2345 7010 5956 11218 13621 17452 15563
-8359 15563 14415 10409 9082 4897 947 -5860 -4921 -3978 2699 3656 -755 -5163 -11841 -18516 -22332 -26144 -30355 -34563
-8341 -34563 -32453 -30340 -24654 -24687 -21743 -24519 -22555 -30132 -36157 -47907 -57869 -67830 -71471 -75111 -69175 -63239 -59031
-8324 -59031 -60548 -57623 -57559 -54992 -52424 -45653 -41744 -41949 -47878 -56341 -70528 -78693 -83996 -88464 -92932 -94002 -100795
-8307 -100795 -104309 -107823 -107879 -102211 -87148 -66361 -39075 -14651 1782 4860 4182 -2219 -7429 -12639 -18207 -23774
-8291 -23774 -25704 -27635 -24795 -21955 -24683 -27411 -25369 -23327 -27575 -31823 -34641 -37458 -37920 -38382 -38844 -39306 -39858 -40409
-8273 -40409 -34283 -28156 -26535 -24914 -23293 -21672 -23539 -25406 -28704 -32002 -32982 -33962 -34585 -40931 -42388 -43845 -42798 -41751
-8255 -41751 -42701 -43652 -43171 -42690 -43014 -43339 -43663 -43987 -41345 -38703 -33199 -27694 -24158 -20621 -17085 -13548 -14894 -16235 -17580
-8236 -17580 -18922 -17316 -15706 -12669 -9628 -8983 -8335 -4828 -1318 -2790 -4258 -8592 -12922 -13433 -13940 -7772 -1601 541
-8218 541 2687 3399 4115 11326 18540 30521 42506 57677 72852 91242 109637 137035 170160 202924 235692
-8203 235692 285151 334614 385505 453571 561821 710142 930488 1259594 1791184 2645231 4051406 6215064
-8191 6215064 9001737 10527218 9072859 6601534 4626526 3210569 2251338 1622198 1203829 917117
-8181 917117 717692 585052 499512 442596 403802 378368 352852 333064 316373 278697 227900 182831 148490
-8168 148490 123693 102672 91194 81620 72050 62387 52728 44615 42230 34371 26515 20445 14378 4104 -6166
-8153 -6166 -9762 -13354 -20163 -26968 -30318 -27940 -30456 -32968 -35125 -37279 -40231 -43182 -46134 -49085 -49860 -50635 -52841 -55048
-8135 -55048 -53117 -51187 -54026 -56866 -57470 -58074 -57246 -56419 -57887 -59355 -62612 -60146 -58245 -56344 -56948 -57552 -59698 -61845
-8117 -61845 -62560 -63276 -61815 -60354 -57462 -54571 -56833 -59091 -62422 -65754 -67356 -63235 -65195 -67155 -69149 -71139 -68359
-8100 -68359 -65579 -63395 -61211 -63798 -66384 -69749 -73110 -71702 -70293 -69898 -69503 -69108 -68713 -64983 -61249 -63596 -60220 -57440
-8082 -57440 -54660 -51522 -48384 -49193 -50002 -53672 -57343 -59821 -62299 -61916 -61532 -60820 -60108 -59396 -58685 -56303 -53922 -48679 -43435
-8063 -43435 -45228 -47020 -48813 -50605 -50699 -50792 -49454 -48116 -44274 -40432 -41360 -42288 -43901 -45515 -44267 -43018 -45370 -47721
-8045 -47721 -52935 -58148 -60023 -61897 -62042 -56460 -54220 -49119 -48131 -47143 -49256 -51369 -50620 -49868 -47874 -45880 -43886 -41893
-8027 -41893 -39690 -37488 -38147 -38803 -38859 -38915 -37540 -36165 -37205 -38244 -36422 -34596 -31052 -27508 -18598 -3963 15321 34606
-8009 34606 61881 98695 146802 204448 266209 325108 371306 396517 392093 366682 319656 263090 201218 142207
-7995 142207 95778 62704 33327 13491 -561 -11752 -18888 -23163 -26245 -29327 -33482 -34775 -37633 -34767 -33690
-7980 -33690 -29751 -30523 -31294 -36657 -42019 -44073 -46126 -47822 -49517 -53836 -52431 -53889 -55346 -59493 -57917 -56698 -55480
-7963 -55480 -56348 -57216 -60947 -64677 -66082 -67487 -66030 -64573 -61446 -58319 -58055 -57790 -58841 -59888 -58077 -56262 -55644 -55021
-7945 -55021 -55118 -49487 -44427 -45086 -48552 -49152 -51694 -54231 -57310 -54660 -53199 -57459 -58323 -56322 -56292 -56259 -56944 -60488 -63380
-7926 -63380 -60544 -60753 -63820 -64058 -61431 -60596 -59758 -56501 -53240 -54753 -56262 -57716 -59165 -60619 -62068 -62150 -62229 -62311 -62389 -64051
-7906 -64051 -65709 -67550 -69387 -67942 -69354 -71307 -67532 -63552 -65292 -68228 -71161 -73539 -75913 -75249 -74582 -75529 -73610 -72589
-7888 -72589 -77288 -79990 -76967 -71143 -68180 -67453 -66727 -64748 -62769 -66991 -71213 -72574 -73934 -72760 -71586 -70412 -69238
-7871 -69238 -67476 -65713 -63950 -62188 -60962 -59736 -58510 -57283 -60075 -62866 -68519 -74172 -75533 -76893 -76822 -76751 -75506 -74258
-7853 -74258 -74444 -74627 -72905 -71180 -69458 -67733 -64819 -61901 -61849 -61793 -62247 -62698 -64584 -66466 -66026 -65583 -69913 -74239 -75082 -75920
-7833 -75920 -71992 -68061 -67770 -67476 -67185 -66891 -64930 -62967 -61364 -59758 -53494 -52953 -53963 -54973 -55327 -55681 -56035 -56389 -53344
-7814 -53344 -50300 -47255 -44211 -45698 -47184 -45809 -44434 -45809 -47184 -53330 -59475 -61863 -64252 -61871 -59490 -57436 -55383
-7797 -55383 -53330 -51276 -48746 -46216 -50363 -54511 -57444 -60373 -63306 -66235 -69346 -72454 -70796 -69134 -65210 -61282 -60220
-7780 -60220 -59154 -57854 -56549 -60019 -63485 -64472 -65456 -63581 -61703 -57980 -54254 -50531 -46804 -41501 -36195 -32442 -34410
-7763 -34410 -37097 -39780 -43003 -46223 -50002 -56639 -60298 -58230 -59326 -63280 -62408 -61532 -58782 -56028 -56139 -56247 -57492 -58733
-7745 -58733 -59978 -61219 -62158 -63093 -61170 -59244 -57500 -55752 -47926 -45821 -47550 -49275 -54224 -59169 -60958 -62743 -64532
-7728 -64532 -66317 -66250 -66183 -63432 -60682 -57753 -57686 -59408 -55405 -48138 -43734 -38971 -37070 -36601 -41855 -44248 -46640 -47960 -52141
-7709 -52141 -48451 -50486 -56098 -58849 -60227 -58744 -58439 -55271 -56397 -57522 -57276 -57030 -56784 -56538 -58681 -60820 -62963 -65102
-7691 -65102 -67245 -69384 -71526 -73666 -74631 -75592 -76557 -77519 -76815 -76106 -75402 -74694 -76621 -78544 -83690 -83109 -82650 -82188 -81372 -80552
-7671 -80552 -78573 -76591 -71392 -71914 -70412 -68907 -68120 -67330 -68128 -74649 -77951 -81253 -81991 -82729 -80604 -78480 -76207 -73934
-7653 -73934 -68441 -68672 -74985 -81298 -82602 -78182 -76304 -74426 -72190 -69954 -69149 -68344 -70401 -72458 -69179 -65899 -62978 -60056
-7635 -60056 -59877 -65422 -67748 -70073 -66484 -62896 -64435 -65974 -64412 -68575 -69518 -70461 -70010 -69559 -71970 -74381 -73394 -72406 -74280
-7616 -74280 -76155 -76263 -76371 -79341 -82311 -83791 -85270 -83888 -82505 -79863 -77221 -74936 -72652 -67684 -68441 -70748 -73054 -73323
-7598 -73323 -73591 -71355 -69119 -68374 -73353 -75111 -76870 -80031 -83191 -81581 -79971 -79196 -78421 -77646 -76870 -76259 -75648 -72175 -68702
-7579 -68702 -69164 -69626 -70088 -70550 -67867 -65184 -65363 -65542 -64528 -63514 -59996 -56479 -56247 -61737 -64010 -66279 -67301 -68318 -72201
-7560 -72201 -76080 -75849 -75615 -78246 -80873 -82073 -83269 -84827 -86381 -85654 -90648 -92425 -94199 -88822 -83440 -82833 -82222 -84297
-7542 -84297 -86369 -83675 -80977 -81622 -82263 -79688 -82833 -82483 -82132 -82140 -82147 -84659 -87171 -86463 -91479 -89846 -88214 -86940 -85665 -82960
-7522 -82960 -80254 -77191 -79852 -81689 -83526 -82859 -82192 -80213 -78234 -76256 -74277 -69719 -65161 -60604 -56046 -45466 -34887
-7505 -34887 -17629 -371 17024 34419 55035 69926 87501 105075 114422 118044 116330 105075 90244 75412
-7491 75412 56108 36804 20363 3921 -4664 -13250 -21836 -30422 -35252 -40082 -42049 -44017 -47729 -51440 -52290 -53140
-7475 -53140 -55778 -58416 -57477 -62262 -65661 -63335 -61368 -65124 -63455 -61785 -60473 -59162 -60906 -62650 -61532 -60414 -62396
-7458 -62396 -64379 -61949 -59519 -59765 -65735 -68486 -71236 -73032 -74828 -73762 -72697 -72540 -72384 -72227 -72071 -68158 -64245 -67189
-7440 -67189 -70133 -67625 -67979 -72805 -71907 -68385 -64863 -60984 -57105 -60574 -64044 -68407 -75633 -79341 -77325 -72626 -73651
-7423 -73651 -75570 -77489 -79408 -81327 -82114 -77176 -74921 -78391 -78521 -75790 -73833 -66153 -59844 -59259 -60283 -67032 -71933 -73967
-7405 -73967 -69686 -68262 -68869 -69473 -65549 -58759 -59009 -64979 -67554 -70125 -71687 -73244 -68128 -63008 -60172 -57332 -55688 -59765
-7387 -59765 -64323 -63153 -64133 -67971 -73394 -81674 -88885 -90368 -88516 -86660 -89220 -91777 -91784 -91792 -88937 -86083 -82691 -79300 -73047
-7368 -73047 -66794 -66622 -66451 -66279 -66108 -69514 -72920 -75969 -79017 -80649 -76557 -70915 -65273 -62970 -60667 -58364 -56061 -52595
-7350 -52595 -49130 -50434 -51738 -50121 -48504 -43667 -38829 -38852 -33150 -19816 -6483 6612 25431 48483 77260 110688
-7334 110688 146977 184817 225519 262047 292851 312028 317848 313473 299558 271452 237623 202302 166981 131899
-7320 131899 96817 63867 40456 22770 10808 4450 -1906 -7906 -13906 -18915 -23919 -31790 -39657 -44308 -48955
-7305 -48955 -56467 -63976 -65899 -67819 -69741 -71661 -69320 -66976 -61416 -55852 -55934 -50292 -46439 -42586 -43234 -43883 -48943 -54004
-7287 -54004 -59691 -59654 -62836 -66019 -65236 -64453 -62240 -60026 -55349 -50673 -50766 -50859 -53039 -55219 -58830 -62441 -59702 -56963 -57086
-7268 -57086 -57209 -57988 -58767 -58115 -57462 -54507 -51548 -51097 -50643 -49506 -42642 -39001 -35356 -33772 -32185 -37279 -42370 -46242 -50110
-7249 -50110 -52551 -54988 -58726 -62463 -59523 -56583 -55640 -54697 -58524 -62352 -67610 -72868 -75264 -77660 -79043 -80426 -78946
-7232 -78946 -77467 -77005 -76542 -76080 -75618 -74262 -72905 -70595 -58744 -43257 -33493 -30407 -27322 -28529 -29737 -30944 -32151
-7215 -32151 -33989 -35822 -37659 -39493 -42403 -45310 -43450 -41587 -34331 -27072 -28402 -29729 -31924 -34115 -34522 -34924 -33687
-7198 -33687 -26722 -22623 -24244 -26137 -28026 -30277 -32524 -34969 -37410 -33176 -28939 -28462 -27981 -33825 -39664 -42452 -39511
-7181 -39511 -42657 -45798 -47572 -49342 -47896 -52171 -51783 -51392 -48500 -45604 -46916 -48224 -50967 -53706 -52022 -50333 -49007
-7164 -49007 -41952 -40626 -39295 -34749 -30199 -27292 -24381 -20044 -15702 -10679 -5652 2233 10122 14743 19368 25539 37438
-7147 37438 49452 61471 70623 79779 86875 88250 80797 73347 59693 51767 47891 49743 54125 58512 58482 58456 51032
-7130 51032 43613 41556 45226 46151 47079 51223 55370 58590 61813 75527 89245 100372 111504 127282 137340 142446
-7114 142446 147555 153733 159916 162875 165837 171658 177483 181754 186028 191730 197435 205880 214328 216452 218580 214115 215379
-7097 215379 213061 216470 221755 227043 233043 239046 250174 267029 286027 310753 336221 361688 387155 412627 423098
-7082 423098 427850 434386 446650 463919 486912 525527 573686 624971 676260 730288 801492 890669 1000834 1132226
-7068 1132226 1284610 1456309 1641367 1839063 2057750 2313938 2617826 2978954 3403051 3900721 4472808
-7057 4472808 5158418 6055820 7283398 8978438 11342237 14688666 19474685 26231684 35294511 45939085
-7047 45939085 55100235 57917243 52831509 43569144 34112753 26157967 20017940 15486367 12202080
-7038 12202080 9843177 8162097 6979011 6163213 5612632 5233769 4956034 4711119 4410872 4023333
-7028 4023333 3599546 3194716 2833774 2521721 2253556 2024863 1832426 1665747 1523872 1400954 1295212
-7017 1295212 1209505 1140969 1078661 1025896 976172 929310 885486 847389 806788 760462 704243 650890 603022
-7004 603022 560878 526362 494712 465030 435348 403664 377709 351395 325082 299480 273882 251743 235327
-6991 235327 223249 211171 199272 193097 188174 186114 187929 189743 193615 203211 212807 222403 234056 251433 264815
-6976 264815 281060 298608 306617 303952 301287 296775 292262 284887 277512 277978 278444 279744 281045 281719 272854 259457 251784
-6959 251784 251620 251456 246879 242303 240708 239113 242646 246179 253617 266779 285546 310038 335423 355084 371944 391665
-6943 391665 409776 427887 438903 444195 448055 451916 460189 468462 483711 498960 517012 537926 552936 562223 558690
-6928 558690 545617 530640 521391 521920 528173 543247 567865 607747 653353 703129 747184 788140 834819 875174
-6914 875174 905993 921309 927085 938537 967165 1020179 1101814 1202048 1305147 1404312 1506338 1624519 1778956
-6901 1778956 1979961 2224850 2512308 2843653 3207673 3600314 4038888 4555691 5173618 5896490 6718217
-6890 6718217 7648700 8704396 9941358 11512606 13639084 16601510 20771712 26733651 35364898 47863687
-6880 47863687 65390082 87799439 110882319 124798401 121380193 103972461 82433869 63084249
-6872 63084249 47770084 36375113 28137898 22232752 18008568 14998114 12874885 11391555 10333716
-6863 10333716 9517981 8818639 8174626 7524892 6841407 6163649 5542174 4995115 4519424 4099069 3725456
-6852 3725456 3395732 3103687 2836450 2596159 2388309 2217848 2079826 1962431 1845040 1715899 1581038
-6841 1581038 1445338 1319182 1218422 1138655 1075877 1022643 972267 924756 888035 851317 807782 754712 701880
-6828 701880 649049 596094 537419 481963 432232 390040 353575 325100 306166 292772 279383 264979 247714
-6815 247714 228522 203610 179234 164399 161127 157859 146601 129619 114869 109663 116799 126798 137955 143392 150201
-6800 150201 157009 159402 152258 139625 117455 97637 77823 64683 51547 42908 43814 55508 70068 81553 87318
-6785 87318 89323 77976 59410 35124 12861 -9397 -17618 -8663 14776 41082 72989 104900 142949 186725
-6771 186725 245046 312911 395559 514463 691949 947664 1290431 1665639 1920161 1886573 1609714 1262262
-6759 1262262 959943 724404 558031 439361 357179 299801 257686 228932 209520 195833 188048 183129 177371
-6746 177371 162073 143735 125400 115916 106432 96948 87467 78162 68857 62413 55974 51189 46404 44123 41843 33570
-6730 33570 19573 8795 -1981 -6587 -11193 -14368 -17543 -25935 -34328 -37950 -41572 -41401 -41229 -30325 -13697 1737
-6714 1737 11449 17106 13222 3794 -15173 -36169 -60026 -81976 -101063 -118124 -129460 -127615 -120043 -102398 -75208
-6699 -75208 -39258 -442 37356 57986 64169 53183 38377 23575 13032 2494 -6438 -15367 -20953 -23673 -29200
-6684 -29200 -40447 -42306 -38438 -31771 -27963 -22295 -16623 -7556 -4209 3723 17385 35455 53529 82261 101457
-6669 101457 102284 85943 69002 52065 38820 25580 20355 15134 21000 26869 39174 61023 81318 88261 80159
-6654 80159 58705 39514 20325 2803 -8991 -13515 -18035 -24333 -30627 -31797 -32964 -29006 -19321 -10355 -1385 4260
-6638 4260 4182 49 -9807 -16563 -23319 -23517 -17990 -10690 -9114 -5510 -7630 -4385 -1139 2345 -3710 -9587 -15464 -19075
-6620 -19075 -22686 -23554 -24422 -20878 -17334 -13284 -14957 -21996 -29036 -34346 -39657 -43536 -47415 -47341 -47266 -48623 -49976 -45906
-6602 -45906 -41837 -33355 -24870 -14212 -9278 -11976 -14670 -14387 -19828 -18590 -11625 -9978 -8331 -2868 8322 24160
-6586 24160 39998 64780 89565 110114 130662 149541 158884 164645 164682 159949 145680 124368 97332 74469 57334
-6571 57334 47857 38384 27834 17288 7990 -1306 -5477 -9643 -13485 -11599 -7571 -13079 -14446 -15814 -17778 -19738
-6555 -19738 -20748 -21754 -24314 -32595 -39597 -46599 -49189 -51776 -50728 -49678 -51492 -53303 -56315 -59322 -62329 -65337 -60060
-6538 -60060 -54779 -52361 -49942 -43026 -36105 -37771 -39437 -44684 -49927 -52308 -54690 -49040 -43387 -40596 -37805 -34510 -31212
-6521 -31212 -27557 -29625 -34946 -40264 -44330 -48396 -49245 -47229 -43544 -34134 -30310 -29349 -26241 -25991 -29472 -32949 -36012 -39072
-6503 -39072 -35636 -22660 -3841 9257 11143 3492 -7440 -21232 -35356 -39940 -35938 -31932 -26439 -23804 -24572 -31060
-6487 -31060 -43126 -49469 -52711 -55949 -60861 -65769 -73781 -87514 -97378 -101514 -98738 -86418 -70464 -60231 -55189 -55867
-6471 -55867 -56162 -53590 -52990 -52387 -51668 -50945 -54995 -59042 -58905 -58763 -57015 -52402 -46063 -33996 -20204 -6408 4640 15693
-6453 15693 17978 20266 21805 20486 16480 18201 26452 40427 64299 97712 129723 161734 191957 227904 274195
-6438 274195 333843 412094 515149 649746 824411 1049399 1325905 1647397 2001326 2361456 2692965 2959006
-6426 2959006 3139186 3205840 3152289 2997554 2756958 2454113 2137913 1847947 1605682 1420418 1294303
-6415 1294303 1218776 1183318 1167655 1161536 1152313 1129733 1085689 1020660 938097 849811 759855 683259 620551 575016
-6401 575016 550708 543575 550525 567015 580226 590579 589837 579555 556037 519166 472841 423654 369756 321586
-6387 321586 283966 255887 230430 210702 194085 183196 178806 180140 182365 187455 186524 176052 153174 136025 118696
-6372 118696 107091 98613 93001 84706 76410 62902 49396 32850 22028 19222 19282 13200 4256 -7314 -16019 -23114
-6356 -23114 -20670 -14115 -4694 2639 7111 9209 14173 14545 12056 -2957 -12244 -12169 -2555 8725 20009 28431 31129
-6339 31129 17605 4085 -17543 -39172 -58495 -64457 -68452 -69585 -68992 -58856 -48720 -32859 -26125 -22250 -24396
-6324 -24396 -26543 -31436 -26785 -20524 -11402 1264 13934 10562 7193 -5182 -17554 -28261 -29424 -26774 -18397 -12646
-6308 -12646 -6893 -7940 -8983 -19630 -27411 -42001 -47047 -51917 -51060 -53993 -56922 -63790 -64930 -64435 -58211 -49428 -37779
-6291 -37779 -32543 -21579 -9129 12865 23799 25196 10852 -9214 -35010 -47445 -59881 -62776 -58401 -40667
-6277 -40667 -36288 -41449 -48403 -45813 -45131 -38725 -34611 -20953 -8666 9343 21686 36894 43576 44533 41164 37799
-6261 37799 23105 14136 11751 22725 28930 29411 26642 33417 39834 51975 62413 72855 70537 73943 78449 92498
-6245 92498 106309 120120 126175 132235 119214 92837 62775 49888 37360 34371 31736 29105 14072 -6684 -41278
-6230 -41278 -75868 -107000 -120960 -124966 -111796 -94333 -74008 -59639 -42407 -32271 -24996 -33463 -51470 -77169
-6216 -77169 -93327 -96666 -82833 -70192 -51828 -33582 -5797 25565 62652 81419 90646 102258 123410 128225
-6202 128225 119684 107565 104986 98621 97980 85831 70821 43944 17068 -2831 -9375 -25019 -34939 -45098 -41896
-6187 -41896 -37149 -15229 12593 46143 67675 86346 99411 109618 96508 73858 51863 39413 21943 17829
-6173 17829 24447 48241 68037 82108 87952 90937 79369 70664 56115 47295 28572 -3505 -62773 -146841 -254424
-6158 -254424 -337202 -348192 -216077 32303 294039 484226 596187 635789 650588 656323 656338 642635 638473
-6145 638473 620000 584359 513565 410335 301142 251102 259222 322674 404969 470094 492495 505355 518693
-6132 518693 537758 548502 572602 601352 630106 620559 570947 483052 400884 351745 342679 351019 376535 414926
-6118 414926 462861 503876 539170 546437 536536 517329 503850 468082 415146 341695 273972 237548 267908 338512
-6104 338512 411982 443501 442588 428912 428595 433820 441910 445167 469416 483387 484006 473415 476180 494265 540974
-6089 540974 591678 645244 708912 785941 853966 942979 1069732 1221292 1357409 1490664 1628052 1771168
-6077 1771168 1907069 2056326 2176721 2218891 2163753 2076178 1981385 1899952 1835452 1807204 1820452 1896668 2002936
-6064 2002936 2103479 2148414 2130388 2098768 2114849 2118404 2062814 1980513 1923015 1902929 1938179 2015166 2136038
-6051 2136038 2290475 2500248 2749315 3001243 3191962 3315901 3428690 3566286 3675498 3729377 3714090
-6040 3714090 3654923 3587673 3556676 3563838 3626337 3733550 3869385 4014639 4159898 4255861 4262151 4175781 4076057
-6027 4076057 4000776 3973200 3991650 4031092 4085019 4240075 4532504 4910797 5257843 5572456 5906622 6246517
-6015 6246517 6538040 6739887 6795055 6768179 6761695 6871599 7199852 7758974 8439373 9119773 9715624 10324832
-6003 10324832 11105043 12177182 13591093 15296930 17306192 19660809 22224353 24900469 27816038 31263945
-5993 31263945 35512024 40544297 46326502 52942513 60107793 67885539 77635460 91600175 111821254
-5984 111821254 140985202 183702969 247651187 344036549 485975708 676760170 881639122 999999999
-5976 999999999 946714268 780128528 601295200 451064941 336623228 254734890 198160169 159575616
-5968 159575616 134238397 119239284 113339485 116096571 127800311 146872095 166182383 170192301 152864952
-5959 152864952 127120404 103705530 85320665 71803122 62249716 55762494 51900449 50471123 51629810
-5950 51629810 55934814 64683807 79815100 103374208 134292506 161503075 164380749 141280558 111164632
-5941 111164632 85247266 65674042 51873864 42654822 36746175 33453419 32475834 34014919 38261470
-5932 38261470 44799547 50920243 51646988 45981182 38207029 31002829 24998766 20244930 16683604 14040504
-5922 14040504 12105278 10637037 9559942 8753457 8166393 7645036 7123684 6561663 6024446 5483055
-5912 5483055 4985553 4523672 4140020 3786419 3476707 3211709 3063101 2992482 2973383 2936110 2912192 2888395
-5900 2888395 2864600 2768179 2604976 2363427 2100893 1835463 1648262 1489442 1321086 1166440 1112919 1130471
-5888 1130471 1184279 1204187 1180210 1077528 923333 701757 447746 162252 -79352 -202754 -171608 -88706
-5876 -88706 11370 112756 238945 363943 513748 656938 767696 812623 844199 859433 865131 837673
-5864 837673 823576 816510 830436 841616 852800 858315 888638 910372 922569 917530 912496 880626 835404 774139
-5850 774139 737682 731034 753009 751191 728388 677915 636986 605354 594715 576500 555426 527756 532526 543199
-5836 543199 567228 592147 622795 621960 603953 549273 469793 365269 281734 227173 227948 255197 291986 311513
-5822 311513 325320 330005 337551 329412 338449 375212 440595 471421 454551 376863 270554 160307 86316 32597
-5808 32597 7498 -20357 -42489 -67722 -75779 -93618 -90469 -40335 103294 334599 605973 793394 856798
-5795 856798 831595 766324 672910 589039 520597 476959 436540 405665 369421 333176 313030 332956 367904
-5782 367904 416208 444120 443416 411464 379512 340525 307265 265110 236314 217294 215449 212170 222250 246160
-5768 246160 291062 336765 392011 425312 433812 414225 388918 353411 315046 268482 235275 210594 206904 202198
-5754 202198 203215 198687 197025 192736 201803 214030 220536 213564 216131 228060 245717 249164 255477 263813 277877 293369
-5738 293369 306002 300803 289884 270867 265210 259311 262956 266000 278589 297494 322127 330575 339027 331857 311331
-5723 311331 275060 244517 220890 214436 207888 210884 214298 220573 217812 209330 198165 200357 211153 221949 215870
-5708 215870 215520 216388 214395 196541 175828 156573 146858 136964 132797 123261 113725 106931 117313 126652 130267 118141
-5692 118141 100294 82444 74134 65585 66580 73534 86211 99128 121588 136889 146467 149008 151553 149873 142472
-5677 142472 130062 127193 136006 144823 146783 143019 127327 108776 84561 66069 56906 64918 80502 98949 110889
-5662 110889 128557 144614 160672 169542 178415 181921 179704 169165 158630 144875 131120 118674 106231 91522
-5648 91522 76813 65779 64288 68219 75017 80439 85865 84192 76798 61202 45610 33234 30402 36629 48584
-5633 48584 62324 76068 81259 80730 77692 80383 84441 94227 99895 102705 108880 115059 118193 121331 116713 112100 96989
-5616 96989 81881 64266 46650 36011 38731 43296 50723 52009 47574 37471 27369 24182 26724 25654 24585
-5601 24585 19938 24835 35370 45905 46542 47183 43974 40766 34158 33279 34453 32765 22312 6138 -6729 -13872
-5585 -13872 -21076 -25414 -23021 -14905 -5178 -1172 176 1525 1741 11501 22494 30626 32019 33417 30875 22610 11661
-5568 11661 6440 8311 13044 18492 21082 18660 21961 28244 31669 34807 37945 34285 27767 25867 29690 36495 40441
-5551 40441 42636 44835 48640 46724 40304 33886 30149 26415 27805 32060 42156 57979 77227 99340 120019 137839
-5535 137839 153793 164026 167995 177692 195821 223495 256173 294580 339899 398577 469655 565540 692307 851514
-5521 851514 1057941 1312071 1610075 1940515 2293374 2636697 2928977 3143028 3255955 3241049 3107365
-5510 3107365 2884005 2595533 2270814 1948118 1638777 1368552 1153662 992208 874637 795705 749212
-5499 749212 725015 714174 710489 701083 684906 651557 605328 553380 505124 462593 428409 399953 382821 379050
-5485 379050 399964 430417 468738 507062 543598 574409 596481 605202 596273 570172 530174 473009 414829 359512
-5471 359512 316950 283933 263854 243775 220204 196638 183565 170492 158816 147145 135056 120105 102377
-5458 102377 75114 46956 18797 -4049 -17353 -18139 -9382 1040 1927 -51 -7750 -16585 -19693 -18274 -19712 -18203
-5442 -18203 -19552 -20905 -22254 -21221 -20185 -19153 -18117 -18605 -19090 -26077 -33061 -32446 -28965 -26919 -30594 -28309 -28883 -28209
-5424 -28209 -33254 -38032 -48530 -56527 -58796 -50337 -41874 -34786 -33418 -28865 -27169 -27385 -30460 -27665 -24866 -27020 -29170
-5407 -29170 -30471 -31768 -31637 -31503 -31939 -32371 -35610 -41706 -48731 -50028 -50255 -53341 -52942 -52540 -50889 -49234 -50531 -51824 -57887
-5388 -57887 -63950 -69033 -74113 -72693 -71273 -64193 -59970 -53959 -53672 -56102 -61390 -65426 -69462 -64316 -59165 -55446 -51727
-5371 -51727 -52692 -53654 -51932 -50210 -46584 -45817 -44811 -49528 -55025 -57656 -56173 -60414 -62299 -64185 -66429 -68672 -66115 -63559
-5353 -63559 -56233 -48906 -44621 -40335 -34618 -34626 -32695 -36489 -40283 -44076 -48056 -52036 -53154 -54272 -53453 -52633 -53244 -53855 -51366
-5334 -51366 -48876 -46387 -49622 -50978 -58059 -61323 -58864 -50304 -51280 -56672 -62061 -62803 -57816 -48422 -44747 -41732 -44438
-5317 -44438 -45358 -49137 -52383 -52763 -47006 -44106 -41475 -44565 -44259 -49674 -52439 -55200 -58323 -61442 -59907 -58368 -58264 -58155
-5299 -58155 -60526 -62892 -62460 -59162 -52819 -52197 -53426 -57515 -57552 -60447 -61558 -68389 -77765 -87137 -90551 -93961 -90458 -92675
-5281 -92675 -92034 -85665 -74049 -62430 -57134 -51835 -46063 -40287 -34514 -34462 -35844 -42947 -48265 -56441 -59195 -59083 -60049 -66734
-5263 -66734 -70025 -67587 -68728 -69868 -68210 -66548 -62024 -57500 -48984 -40465 -29084 -17703 -7280 3146 8445 4204
-5247 4204 -4571 -13343 -19850 -26357 -33702 -41043 -41706 -42370 -41606 -40838 -37566 -34294 -26852 -25131 -29133 -33135 -44389 -61368
-5229 -61368 -71668 -76241 -75272 -74303 -72976 -71646 -71184 -70722 -65489 -60254 -59613 -58972 -61431 -69611 -75033 -74731 -75145 -75555 -74239
-5210 -74239 -72924 -71608 -70289 -69436 -68582 -62959 -57332 -54392 -51451 -48511 -45567 -38453 -31335 -24814 -18292 -6170 -3583
-5193 -3583 -8629 -19399 -30694 -41986 -48865 -55744 -59109 -62471 -65832 -69194 -70095 -70994 -67122 -63250 -61468 -59683 -61118
-5176 -61118 -62553 -66973 -77113 -81171 -85229 -89887 -94542 -91922 -83578 -77780 -71977 -63313 -54649 -50460 -51992 -53166 -54339
-5159 -54339 -56203 -58062 -59922 -61781 -62154 -62523 -58122 -53721 -49432 -45139 -40488 -41561 -35244 -28924 -22604 -22008 -18613 -15214
-5141 -15214 -17301 -28928 -38710 -48489 -52186 -55882 -55375 -54869 -54362 -53855 -50486 -47117 -44047 -40976 -40618 -45030 -49622 -54213
-5123 -54213 -58267 -62322 -66376 -70431 -75093 -79755 -80601 -76677 -71918 -70021 -70688 -68493 -63585 -58677 -56452 -54228 -54149 -54071
-5105 -54071 -54172 -54272 -53259 -55103 -58021 -56169 -55692 -55211 -54433 -53654 -54787 -55916 -59907 -63898 -62706 -61509 -63175 -64841
-5087 -64841 -63876 -62907 -57168 -51429 -49092 -46752 -47274 -47796 -45698 -43596 -41792 -39988 -37533 -39843 -44240 -48638 -51872 -55103
-5069 -55103 -58338 -61569 -59437 -57302 -55171 -53035 -53080 -53121 -50304 -47483 -46752 -46018 -53874 -61726 -62635 -63540 -61588 -59631 -61972
-5050 -61972 -64308 -66648 -68985 -69835 -70681 -71530 -72376 -68396 -64412 -60432 -56449 -54235 -52022 -52670 -53318 -55756 -58193 -55860
-5032 -55860 -53523 -52800 -52077 -51354 -50632 -57719 -64807 -65039 -65266 -65870 -63607 -63078 -57775 -55457 -57906 -59162 -57556 -57548 -60399 -63075
-5012 -63075 -62885 -62698 -62508 -64643 -66779 -70386 -68266 -66507 -64744 -65311 -65873 -66078 -66283 -64748 -57485 -56665 -55841 -52696 -55271
-4993 -55271 -60947 -66622 -72488 -72630 -71221 -69812 -69656 -69499 -66481 -63458 -60589 -57719 -54850 -51981 -52808 -53635 -54105 -54571 -58469
-4974 -58469 -56643 -55174 -53706 -52774 -51843 -50911 -49979 -48720 -47460 -46201 -44941 -51194 -57447 -57023 -56598 -57619 -58640 -62523
-4956 -62523 -66406 -68381 -70356 -69469 -68582 -66048 -63514 -67062 -64886 -64856 -64826 -64439 -64051 -63842 -63634 -63425 -63216 -61040 -58864 -59549
-4936 -59549 -60235 -61256 -62277 -63298 -64319 -64625 -64930 -68098 -71266 -73420 -75574 -77728 -79881 -78816 -77750 -81454 -85158 -85941
-4918 -85941 -86724 -87148 -87573 -83645 -73993 -70423 -66853 -63421 -59989 -59419 -58849 -60425 -62001 -63578 -65154 -65508 -65862 -66216 -66570
-4899 -66570 -63048 -59527 -60418 -61308 -60805 -54578 -51571 -48563 -49491 -50419 -50989 -51559 -49715 -42146 -44475 -46804 -49491 -52178 -58085
-4880 -58085 -58267 -59393 -60514 -58420 -56322 -59117 -61908 -67386 -68091 -68948 -69801 -73043 -71512 -69268 -67021 -64480 -61934 -61480
-4862 -61480 -61021 -55797 -50568 -42601 -34630 -31432 -25369 -22410 -24217 -28235 -35110 -42705 -50296 -53300 -56300 -60134 -63965
-4845 -63965 -64938 -65907 -64912 -63913 -65780 -67643 -69868 -72089 -74314 -76535 -71247 -65955 -65437 -64916 -65597 -66276 -69343 -67636 -69451
-4826 -69451 -66492 -63060 -59624 -58271 -56915 -60332 -63745 -64658 -65568 -66481 -67390 -69436 -71482 -73528 -75574 -75771 -75969 -71396
-4808 -71396 -66824 -60678 -54533 -48388 -42243 -45101 -47960 -50818 -53676 -57131 -60585 -64040 -67494 -63853 -60213 -57526 -57701
-4791 -57701 -59575 -56680 -52353 -50889 -49543 -51060 -55916 -60772 -61815 -62855 -63898 -64938 -66995 -69048 -68243 -67435 -65467
-4774 -65467 -63496 -66298 -69097 -69574 -70047 -70524 -70997 -73651 -76300 -76092 -75879 -77221 -78559 -77038 -75514 -73576 -71635 -69697
-4756 -69697 -67755 -67129 -66499 -68378 -70252 -74821 -73662 -75723 -77783 -73703 -69622 -65542 -61461 -60306 -59147 -54768 -56113
-4739 -56113 -57131 -58148 -59165 -60183 -64826 -63742 -62538 -61334 -61442 -61550 -64998 -68445 -66648 -64848 -63048 -61249 -59896
-4722 -59896 -58543 -58621 -58700 -57768 -56836 -53520 -50203 -51239 -52275 -54742 -57209 -59750 -62292 -62806 -57597 -55547 -53497 -56337 -59177
-4703 -59177 -62553 -65929 -66920 -67912 -70245 -72577 -72525 -72473 -71273 -70073 -68873 -67673 -67517 -67360 -67204 -67047 -64684 -62322 -59959
-4684 -59959 -57597 -54936 -52275 -51999 -51720 -57712 -63704 -67312 -70919 -69935 -68951 -69756 -64834 -63619 -62404 -63455 -70230 -73516
-4666 -73516 -71079 -72220 -73356 -77649 -81942 -85162 -82658 -74757 -66857 -62892 -58923 -54906 -50885 -50207 -49525 -50814 -52100
-4649 -52100 -53389 -54675 -56404 -58129 -59859 -61584 -63671 -65754 -67841 -69924 -70021 -70114 -70211 -70304 -69030 -67751 -73990 -74500 -69507
-4630 -69507 -64509 -62497 -60481 -58588 -56691 -59866 -63037 -64539 -63175 -62232 -67010 -72447 -72156 -68411 -67524 -70517 -70643 -71131
-4612 -71131 -71616 -70941 -70263 -71795 -70461 -63019 -65113 -69477 -70975 -70211 -69443 -68501 -67554 -65627 -63697 -65109 -66518 -66589 -66656 -71020
-4592 -71020 -75380 -74411 -73438 -77716 -81991 -80247 -78499 -73416 -68329 -62381 -56430 -54775 -53117 -54474 -55826 -57183 -58536
-4575 -58536 -59564 -60589 -64002 -67412 -67874 -68333 -66410 -64483 -69656 -74825 -74750 -74672 -74448 -74221 -75428 -76632 -74262 -71892 -69522
-4556 -69522 -67151 -68001 -68851 -73039 -77228 -75395 -73561 -71728 -69894 -72384 -74873 -74977 -75082 -71199 -67312 -65814 -64312 -65527
-4538 -65527 -66738 -68310 -69879 -64029 -63898 -64904 -63045 -61159 -64994 -68773 -72548 -72570 -72589 -71180 -69768 -73606 -77441 -77940
-4520 -77940 -78436 -75119 -71799 -68601 -71124 -73025 -74921 -78611 -82296 -81588 -80880 -80172 -79464 -75089 -70714 -70632 -70550 -71422 -72294 -67561
-4500 -67561 -68553 -69574 -70595 -70781 -76692 -77381 -72343 -69097 -68709 -70442 -69309 -68359 -70267 -68303 -66335 -64550 -62762 -64077
-4482 -64077 -65389 -66704 -68016 -67595 -67170 -66749 -66324 -68705 -71083 -73464 -75842 -75734 -75622 -78376 -81126 -83880 -86630 -86522 -86410
-4463 -86410 -83895 -81380 -75465 -75275 -74370 -70602 -66835 -65929 -65508 -59363 -57869 -59236 -59769 -60302 -58152 -56002 -52726 -49450
-4445 -49450 -49454 -55182 -57690 -57336 -54179 -51023 -51451 -51880 -52308 -52737 -51377 -50017 -48656 -47296 -41747 -36198 -33512 -30825 -32550
-4426 -32550 -34276 -32423 -36295 -45295 -48571 -49044 -52379 -52197 -52014 -55051 -58088 -58204 -61178 -58968 -62478 -64562 -60917 -57992
-4408 -57992 -55062 -51094 -47121 -46014 -44904 -46838 -48768 -45336 -51440 -55640 -59836 -59862 -59885 -61580 -63272 -64968 -66660 -65284
-4390 -65284 -63906 -65393 -66876 -65918 -64957 -68769 -72577 -73964 -75350 -71966 -68582 -64304 -60026 -60518 -61010 -62039 -63067 -64096
-4372 -64096 -65124 -66868 -68612 -67494 -66376 -66399 -66421 -66443 -66466 -68635 -70804 -72972 -75141 -73822 -72503 -74046 -75588 -76893 -78197
-4353 -78197 -79501 -80806 -77135 -73464 -72656 -71847 -70323 -68799 -67274 -65750 -68482 -71213 -69175 -67137 -70047 -72957 -73006 -73054
-4335 -73054 -70733 -68407 -70856 -73300 -74377 -75451 -72056 -68657 -67804 -71717 -75812 -75134 -74042 -75808 -74061 -75171 -75659 -76144
-4317 -76144 -76811 -77474 -79155 -80832 -77742 -74649 -72454 -70256 -68061 -65862 -65217 -64569 -63924 -63276 -63604 -63928 -67118 -70304 -70990
-4298 -70990 -71672 -72358 -73039 -70982 -68922 -71635 -74344 -75089 -75831 -76576 -77318 -76654 -75987 -75324 -74657 -70893 -67125 -63660 -60190 -60153
-4278 -60153 -64882 -69913 -70170 -67330 -69257 -68206 -67151 -70613 -74072 -72764 -71452 -72231 -73006 -71102 -69194 -64725 -63116 -63894
-4260 -63894 -69440 -73080 -76718 -75887 -75052 -73543 -72030 -73382 -74731 -76024 -77314 -78607 -79896 -82352 -84804 -82490 -80172
-4243 -80172 -81853 -83530 -80440 -77347 -77075 -76803 -73669 -70535 -66745 -62955 -63935 -64916 -67655 -70394 -73133 -75872 -73423 -70975
-4225 -70975 -68527 -66078 -68929 -71780 -74810 -77839 -79140 -83302 -86213 -83399 -83686 -83973 -81040 -78108 -77321 -76535 -75749 -74962
-4207 -74962 -76770 -78577 -80385 -82192 -81376 -80560 -79565 -78570 -80288 -79144 -76390 -79360 -80601 -81842 -84335 -89690 -91915 -88415
-4189 -88415 -88315 -88214 -84834 -81454 -80936 -80418 -77247 -74075 -73766 -73457 -73863 -74269 -77537 -80806 -83727 -86645 -84797 -82945 -80858
-4170 -80858 -78767 -76680 -74590 -75633 -76673 -77716 -78756 -79800 -80839 -84387 -87931 -92798 -91937 -85714 -79486 -77258 -75026
-4153 -75026 -75600 -79032 -83273 -81786 -75711 -75357 -77034 -78708 -80921 -83131 -83794 -87316 -92451 -91859 -87633 -83403 -83589 -83772
-4135 -83772 -82110 -80444 -78246 -81767 -83384 -82136 -84648 -84294 -79173 -76911 -73222 -69529 -66317 -68825 -71515 -68478 -65937
-4118 -65937 -66253 -69376 -72495 -75797 -79095 -77627 -76155 -75708 -75261 -74813 -74366 -80120 -85874 -83996 -77347 -70654 -66824 -63947
-4100 -63947 -61070 -60459 -59847 -59236 -58625 -57358 -56091 -59594 -63097 -64811 -66525 -68240 -69954 -70058 -70163 -65497 -60831 -60816 -60801
-4081 -60801 -57924 -59818 -61275 -59866 -60369 -60868 -63697 -66522 -71854 -72413 -69995 -64711 -63604 -62493 -64427 -66358 -63343 -60324
-4063 -60324 -64047 -64904 -64394 -68650 -71180 -68937 -69678 -70416 -65985 -61550 -63798 -66041 -66320 -66596 -64014 -61427 -61345 -61260 -64040
-4044 -64040 -66816 -69775 -72730 -70919 -69104 -69604 -70099 -70599 -71094 -69507 -67915 -73006 -78093 -76103 -74109 -69257 -64401 -62113
-4026 -62113 -59821 -60395 -60965 -62672 -64375 -66082 -67785 -68955 -70122 -71292 -72458 -73759 -75056 -76356 -77653 -78238 -78819 -79404
-4008 -79404 -79986 -81048 -82106 -83347 -84584 -80161 -78596 -81268 -79166 -76047 -77698 -76367 -75037 -75853 -76669 -77485 -78301 -78648
-3990 -78648 -78995 -79341 -79688 -79677 -79665 -79654 -79643 -81756 -83865 -85978 -88087 -89485 -90879 -89414 -87946 -90290 -92630 -92112 -91590 -87674
-3970 -87674 -83753 -77333 -70908 -66380 -67576 -67163 -63887 -65113 -66339 -67386 -68433 -68273 -68113 -69205 -70297 -69779 -66399 -66179
-3952 -66179 -71683 -73751 -75820 -76815 -77809 -80921 -84033 -84342 -81789 -77239 -78413 -80481 -79688 -78238 -73926 -73908 -73889 -73867 -73844 -73822
-3932 -73822 -73800 -74582 -75365 -74716 -74068 -77437 -80806 -81312 -81819 -79852 -77884 -77347 -76811 -77396 -77981 -77135 -76289 -75264 -74239 -74109 -76841
-3911 -76841 -79468 -76371 -76673 -76975 -75935 -74895 -76718 -78540 -79434 -80329 -82654 -84979 -84711 -84443 -84175 -83906 -83228 -82550 -77101
-3892 -77101 -71653 -68918 -66183 -66250 -69179 -75741 -76576 -77593 -81469 -79267 -74198 -70923 -67643 -71582 -75518 -80888 -86254 -89269
-3874 -89269 -92280 -90525 -88766 -82516 -76263 -74784 -73300 -73550 -73796 -74046 -74292 -74251 -74206 -77027 -79844 -79565 -79282 -79002 -78719 -77836
-3854 -77836 -76952 -78931 -80910 -79848 -78786 -80586 -82386 -84953 -87521 -87227 -86932 -86846 -86761 -86675 -86589 -84186 -81782 -80809 -79837 -76867
-3834 -76867 -73897 -75697 -77496 -78775 -80053 -78469 -76885 -77210 -77534 -77858 -78182 -77228 -76274 -75320 -74366 -73621 -72876 -73561 -74247 -70982
-3814 -70982 -67718 -66540 -70133 -69015 -67897 -68508 -69119 -68978 -68836 -69648 -73323 -76669 -75246 -73822 -72399 -70409 -68419 -69291
-3796 -69291 -70163 -72853 -75544 -76803 -78063 -79811 -81555 -78532 -75506 -74780 -74049 -71892 -69730 -71269 -72805 -75775 -78741 -78372
-3778 -78372 -78000 -77333 -76662 -77798 -74161 -74284 -77265 -75898 -71664 -67435 -66063 -66127 -63324 -62314 -61301 -62258 -63212 -64170 -65124
-3759 -65124 -67464 -69801 -72141 -74478 -73718 -72954 -72194 -71430 -73464 -75495 -77530 -79561 -76587 -73610 -70636 -67658 -69250 -70837
-3741 -70837 -69566 -73062 -78887 -81845 -80038 -78227 -79170 -80109 -81052 -81991 -82934 -83873 -81953 -80031 -80802 -81573 -82345 -83116 -84722
-3722 -84722 -86328 -87577 -88825 -91467 -88386 -86019 -83653 -77798 -77668 -80399 -77407 -76695 -75983 -76345 -76706 -75249 -73792 -72335
-3704 -72335 -70878 -73006 -75134 -80481 -80105 -76837 -73569 -71374 -69179 -72257 -75335 -73643 -71951 -75357 -78763 -79308 -79852 -81797
-3686 -81797 -83742 -85687 -87633 -86805 -85978 -83720 -81462 -80720 -79978 -74467 -68955 -66395 -63835 -64137 -64439 -69481 -74523 -76703
-3668 -76703 -78883 -78887 -78890 -76032 -73174 -76352 -79527 -81275 -83019 -82144 -81264 -78957 -76647 -75838 -75026 -74217 -73405 -70002 -66596 -64744
-3648 -64744 -68612 -68381 -68146 -71135 -74120 -73025 -71925 -72261 -72592 -72264 -71933 -74467 -76997 -79978 -82956 -86295 -83906 -81093
-3630 -81093 -78279 -75108 -71936 -69600 -67263 -67789 -68314 -67811 -67308 -66805 -66302 -67647 -68992 -70338 -71683 -71094 -70502 -69913 -69320
-3611 -69320 -68732 -68139 -67550 -66958 -71005 -75048 -79095 -83139 -82356 -81570 -77925 -74277 -74541 -74802 -75067 -75328 -74042 -72753 -71467
-3592 -71467 -70177 -72156 -74131 -73248 -72361 -69689 -67014 -65892 -67628 -64401 -65944 -69455 -70103 -68366 -66630 -69484 -72339 -75872
-3574 -75872 -79404 -80075 -80746 -80522 -80299 -80075 -79852 -82237 -84618 -84141 -83660 -85777 -87890 -88576 -89258 -89742 -90223 -87845 -85464 -81745
-3554 -81745 -78022 -79371 -80716 -79211 -82471 -82874 -78503 -78041 -77575 -79677 -81775 -80277 -78775 -76144 -73509 -73054 -77366 -78998
-3536 -78998 -80627 -81290 -81950 -79751 -77549 -74992 -72432 -72738 -73039 -73800 -74556 -75316 -76073 -78503 -80929 -78588 -76244 -76106 -75965
-3517 -75965 -73919 -74731 -81242 -82978 -82811 -82639 -81726 -80809 -81626 -82438 -80660 -83649 -83958 -84264 -83880 -83496 -83112 -82729 -77992 -73256
-3497 -73256 -72991 -72726 -74251 -71005 -68832 -69522 -75041 -80560 -81488 -82416 -83791 -85166 -81771 -78376 -78260 -78145 -78029 -77914 -78350
-3478 -78350 -78786 -82084 -85382 -88292 -91203 -92682 -94162 -88743 -83325 -81365 -85129 -86746 -88363 -88907 -89451 -83034 -76617 -75387
-3460 -75387 -79881 -82825 -82907 -80485 -80925 -79002 -77079 -76766 -76453 -76528 -76602 -76677 -76751 -74933 -73114 -74157 -75201 -74634 -74068 -73502 -72935
-3439 -72935 -75361 -77783 -80209 -82632 -79930 -77224 -71120 -70740 -72406 -71206 -70368 -72387 -72533 -72674 -72995 -73315 -74951 -76583
-3421 -76583 -76788 -76990 -79908 -82822 -82874 -82926 -80209 -77489 -79542 -81592 -84480 -87364 -85479 -83593 -83403 -83213 -80161 -77109 -80675
-3402 -80675 -84242 -83038 -81834 -82062 -82289 -82516 -82744 -82673 -82602 -82531 -82460 -82106 -81752 -81398 -81044 -80958 -80873 -77210 -79270 -82345 -79695 -77582
-3380 -77582 -78331 -81257 -84182 -79058 -73934 -73058 -77903 -85609 -87592 -84864 -82136 -81912 -81689 -80127 -78562 -76997 -75432 -72436
-3362 -72436 -69440 -67994 -72272 -71843 -71411 -71336 -71262 -72082 -72902 -70859 -68817 -67971 -67122 -67166 -70073 -71489 -67181 -64483 -64647 -64494
-3342 -64494 -61476 -60429 -64148 -65963 -67774 -68456 -69134 -68937 -68735 -69969 -71199 -73058 -74914 -73911 -72905 -72194 -71478 -69335
-3324 -69335 -67189 -64390 -61588 -55927 -55033 -58510 -59121 -63075 -67025 -65195 -63362 -64394 -65422 -65139 -64852 -63138 -61420 -60749
-3306 -60749 -60075 -62266 -64453 -64826 -65195 -65568 -65937 -66846 -67751 -68840 -74694 -75208 -75719 -76531 -77340 -79226 -81108 -81324 -76766 -73017
-3286 -73017 -75942 -77679 -79412 -80672 -81927 -78417 -74903 -72767 -70632 -68497 -66361 -66551 -66742 -66932 -67122 -65076 -63030 -60984
-3268 -60984 -58938 -51228 -43517 -33303 -27858 -31134 -37272 -42098 -46924 -52077 -57231 -57615 -57999 -59695 -61390 -64517 -67643
-3251 -67643 -68176 -68709 -66380 -64051 -64480 -64904 -65333 -65758 -69674 -73587 -74642 -75693 -76583 -77470 -77228 -76982 -74862 -77508 -75566
-3232 -75566 -76483 -76498 -71739 -69846 -67949 -69335 -70718 -72104 -73487 -73487 -73483 -73185 -72883 -72943 -68228 -67811 -64528 -59873 -55219 -50386
-3212 -50386 -45552 -44416 -43279 -43514 -49473 -57518 -62702 -64785 -64006 -62512 -61018 -60537 -65780 -69905 -68307 -63906 -62367 -66194
-3194 -66194 -70021 -69257 -68493 -66939 -65385 -63652 -61919 -66566 -68351 -65665 -68702 -68344 -67986 -69954 -69059 -66197 -69059 -72100
-3176 -72100 -69417 -67315 -70938 -73844 -76751 -75484 -74217 -72950 -71683 -69004 -66324 -66507 -66689 -68541 -70394 -69384 -68374
-3159 -68374 -68422 -68471 -68519 -68568 -71717 -74865 -75152 -75439 -75909 -76375 -76844 -77310 -77422 -77530 -77642 -77750 -77474 -77195 -74057 -70915 -71415 -71910
-3137 -71910 -69011 -71832 -73080 -71463 -73606 -72883 -67513 -65001 -67681 -73218 -74034 -74847 -78704 -82557 -82717 -82874 -83034 -83191 -83403
-3118 -83403 -83616 -83828 -84040 -83060 -82080 -81100 -80120 -77172 -74225 -71635 -69045 -66932 -70543 -75406 -77407 -75779 -74150 -72343 -70535
-3099 -70535 -71053 -71571 -74951 -78331 -76479 -74627 -75637 -76647 -77239 -77832 -78424 -79017 -80470 -81920 -80332 -78741 -81983 -82360 -81309
-3080 -81309 -80254 -81573 -80027 -80094 -80157 -82550 -84938 -82561 -80180 -79263 -78342 -75816 -76147 -77377 -78603 -77031 -72592 -69082 -68430
-3061 -68430 -70763 -73092 -74948 -76800 -75972 -75141 -75328 -78372 -81421 -81603 -80955 -80303 -79475 -78644 -81186 -83724 -83105 -79621 -80612
-3042 -80612 -81599 -82412 -83221 -80508 -77791 -77761 -77728 -80381 -80168 -76621 -73069 -72264 -68594 -66537 -64476 -67785 -71090 -71359 -71623 -71709
-3022 -71709 -68929 -68836 -71601 -71508 -68549 -70245 -71936 -71575 -71210 -72756 -71437 -69764 -72857 -75954 -79047 -77500 -75950 -76192 -73569
-3003 -73569 -69160 -67610 -69223 -70833 -71076 -74176 -75492 -76803 -75495 -71322 -71802 -72279 -70908 -72399 -72458 -72518 -70431 -71206 -74843
-2984 -74843 -75618 -73591 -71564 -70431 -72160 -74903 -74784 -76274 -77765 -80549 -80467 -77705 -77802 -77128 -79311 -81499 -80821 -80444 -77202
-2965 -77202 -75395 -73584 -75175 -76762 -78354 -79941 -79539 -79136 -78734 -78331 -78644 -78957 -79270 -79583 -79583 -79583 -79583 -79583 -79583 -79583 -79583 -79583 -79177 -78767 -78361 -77951
-2939 -77951 -78260 -78566 -78875 -79181 -77627 -76069 -74515 -72957 -75577 -78193 -77951 -74843 -72913 -75749 -75547 -75343 -78361 -78514 -76583
-2920 -76583 -69879 -65102 -65091 -65083 -67934 -70669 -70539 -69339 -65273 -65366 -70226 -76699 -80306 -82546 -84782 -82073 -79360 -79781 -80198
-2901 -80198 -78711 -80083 -83843 -82829 -81819 -80806 -82423 -84037 -85654 -87268 -88646 -90022 -89313 -83832 -80634 -77433 -76800
-2884 -76800 -76162 -75469 -74772 -74079 -73382 -72853 -72324 -74657 -76990 -76818 -76647 -76475 -76304 -77087 -77869 -75790 -73710 -76699 -79688 -79814
-2864 -79814 -79941 -80638 -81331 -80239 -74374 -70479 -71351 -74016 -76677 -78775 -80869 -81059 -84107 -86742 -84603 -82647 -80686 -81178
-2846 -81178 -84532 -84488 -79673 -75216 -75529 -75723 -75916 -76185 -76453 -76721 -76990 -76006 -75022 -76900 -78778 -76956 -75134 -76174 -77213 -74854
-2826 -74854 -72495 -74906 -77318 -76986 -76654 -76323 -75991 -77210 -78428 -78752 -76215 -76949 -83407 -86824 -84517 -84119 -83720 -82963 -82207
-2807 -82207 -83403 -84599 -87048 -86634 -87830 -83302 -78596 -79613 -78849 -78082 -77675 -77265 -76024 -74780 -70140 -71221 -75316 -76546
-2789 -76546 -79747 -82945 -82688 -82427 -82527 -82624 -76777 -76651 -78078 -79501 -79617 -79729 -79844 -79956 -79684 -79408 -76274 -73136 -76621 -80101
-2769 -80101 -83586 -87066 -84935 -82799 -80668 -78532 -75685 -72835 -72849 -72861 -72249 -71635 -73885 -76133 -74925 -73714 -69645 -65571
-2751 -65571 -62911 -60246 -64263 -68277 -70684 -73088 -72633 -72175 -74046 -75913 -77783 -79650 -80329 -81003 -81681 -82356 -79706 -77057
-2733 -77057 -77269 -77482 -79185 -80888 -79729 -78570 -77619 -76669 -72857 -69045 -68810 -68575 -68340 -68105 -70286 -72466 -74646 -76826 -73162
-2714 -73162 -69499 -67028 -70282 -76159 -76311 -75331 -71489 -70628 -75492 -76956 -78421 -81406 -84387 -82602 -80813 -79744 -78670 -77601
-2696 -77601 -76528 -74295 -72059 -72689 -73315 -75913 -78506 -81104 -83698 -83247 -82792 -82341 -81886 -80422 -78954 -82259 -85561 -86779
-2678 -86779 -87994 -89392 -90785 -86936 -85945 -86746 -81819 -80612 -82263 -80161 -80917 -81141 -78499 -77649 -76796 -75976 -75152 -74333 -73509
-2659 -73509 -73882 -74251 -74623 -74992 -74664 -74333 -75972 -74746 -72272 -75518 -78588 -75931 -75916 -75898 -75346 -74791 -75074 -72492 -68303 -69835
-2639 -69835 -74146 -78458 -80265 -76349 -72372 -77936 -84037 -84413 -79170 -76788 -77210 -77631 -76740 -75849 -74959 -74068 -79088 -84107 -86265
-2620 -86265 -88423 -86287 -84152 -83448 -82744 -81741 -80739 -78305 -75872 -76896 -77921 -77157 -82117 -84305 -86492 -87607 -88721 -87778
-2602 -87778 -86835 -84461 -82088 -81532 -80977 -77560 -74143 -76002 -77862 -77038 -76215 -76121 -78890 -83269 -81924 -80399 -78875 -76993 -75111
-2583 -75111 -78327 -81544 -80168 -78793 -76375 -76818 -73863 -76632 -77646 -78655 -79669 -80679 -84256 -82106 -79960 -83534 -84011
-2566 -84011 -84484 -86392 -88296 -91218 -88412 -84536 -83519 -82147 -83634 -83873 -81245 -78175 -75100 -74713 -80045 -85203 -80817 -77865
-2548 -77865 -77772 -77742 -80571 -81972 -83370 -85717 -88061 -85997 -83929 -79330 -80452 -80146 -79837 -77295 -80474 -80079 -79680 -81939 -78469
-2529 -78469 -73751 -71892 -70364 -68832 -72253 -75670 -73934 -72194 -71888 -71579 -71154 -70725 -73162 -75596 -75618 -75637 -75659 -75678 -76539 -77400
-2509 -77400 -75398 -73397 -71605 -69812 -72611 -75410 -77791 -77310 -76293 -80999 -85080 -83437 -78991 -77407 -77344 -77280 -74534 -71787
-2491 -71787 -72857 -73926 -72134 -70341 -69786 -69231 -71538 -73844 -72931 -72018 -70748 -75201 -78838 -82471 -83604 -84733 -83422 -82106
-2473 -82106 -80794 -79479 -75126 -70770 -71187 -71601 -75059 -78514 -80541 -82565 -82863 -83157 -82024 -80888 -79576 -78260 -78380 -78495
-2455 -78495 -81432 -84365 -85870 -87372 -87625 -87875 -85266 -82654 -81670 -80683 -76837 -72987 -73971 -74951 -75935 -76915 -81357 -85796 -87376
-2436 -87376 -88952 -88386 -87815 -90111 -92403 -91158 -89910 -88665 -87417 -85456 -83493 -81532 -79568 -82259 -84946 -84774 -84599 -84368
-2418 -84368 -84134 -84260 -84383 -82669 -86675 -88896 -88251 -88922 -86727 -81495 -79121 -77452 -75779 -74288 -72794 -77683 -82568 -82688
-2400 -82688 -82803 -80060 -77314 -79341 -81365 -80411 -79453 -78499 -77541 -78749 -79952 -77761 -81290 -86850 -89545 -85803 -82058 -80075
-2382 -80075 -80955 -83444 -80209 -79777 -79345 -75872 -72399 -71832 -74128 -71236 -74068 -78212 -76632 -76125 -75618 -76882 -83865 -86261
-2364 -86261 -82930 -80496 -80921 -79382 -77839 -75957 -74072 -72190 -70304 -70867 -71426 -74851 -78272 -78741 -79211 -79680 -80150 -80142 -80135 -76550
-2344 -76550 -78689 -81245 -78078 -73718 -69358 -71079 -72801 -70945 -74813 -80217 -79893 -81898 -81037 -78212 -75384 -77150 -78913
-2327 -78913 -79159 -79401 -79647 -79889 -80970 -82047 -83127 -84204 -84312 -84417 -81663 -78905 -76330 -73751 -77854 -81953 -80541 -79125
-2309 -79125 -80575 -82021 -83291 -84558 -81059 -77556 -79982 -82404 -84830 -87253 -83895 -80534 -77176 -73815 -74377 -74936 -75499 -76058
-2291 -76058 -73997 -71933 -71840 -68881 -64945 -66730 -67983 -69231 -72212 -75190 -73401 -71608 -68463 -65314 -66939 -68560 -70483
-2274 -70483 -72402 -72358 -75171 -77772 -74646 -74921 -75193 -76006 -76815 -77627 -78436 -81193 -83947 -81935 -79919 -80232 -80541 -80854 -81163 -80265
-2254 -80265 -79367 -78469 -77571 -78164 -78756 -82211 -85665 -85453 -85240 -85028 -84815 -82635 -80455 -81137 -81819 -81830 -81842 -78991 -76140 -76449 -76759
-2233 -76759 -77068 -77377 -79162 -80947 -77962 -74977 -76643 -78309 -79975 -81640 -79606 -77571 -80306 -83042 -82915 -82788 -82662 -82535
-2215 -82535 -81283 -80031 -81640 -83250 -85576 -87901 -87364 -86828 -85494 -84160 -79606 -80776 -83258 -85740 -86612 -90346 -90294 -84517
-2197 -84517 -78920 -79047 -79173 -79300 -79785 -80269 -82348 -84428 -86507 -88587 -87268 -85948 -84629 -83310 -81305 -79300 -80157 -81014 -81931
-2178 -81931 -82848 -83765 -84681 -84786 -84890 -84994 -85099 -85620 -86142 -83802 -81462 -78465 -75469 -72473 -69477 -71608 -73740 -75872 -78003
-2159 -78003 -75928 -73848 -76542 -79233 -82285 -85333 -81708 -78078 -78506 -78931 -79360 -79785 -82777 -85766 -85896 -86023 -84845 -83664
-2141 -83664 -85348 -87029 -86209 -85386 -84566 -83742 -83332 -82919 -82509 -82095 -80791 -79483 -81040 -82594 -82408 -82222 -82035 -81849 -83094 -84338
-2121 -84338 -82721 -81104 -80806 -80508 -80209 -79911 -82058 -84204 -83489 -82773 -83589 -84406 -82360 -80314 -81309 -82304 -83299 -84294 -87391 -90487
-2101 -90487 -84998 -79509 -79386 -79263 -79140 -79017 -80534 -82050 -80705 -79360 -77836 -76311 -77649 -78987 -80072 -81156 -79378 -77601
-2083 -77601 -75704 -73807 -74772 -75738 -78831 -81924 -80247 -78570 -77072 -75574 -78846 -82117 -83273 -84428 -85583 -86738 -87953
-2066 -87953 -89168 -87521 -85874 -81756 -77634 -78286 -78935 -80780 -82621 -84465 -86306 -86310 -86310 -86314 -86314 -85781 -85244 -87931 -84890 -82803 -80713
-2045 -80713 -81130 -81544 -81722 -81898 -82076 -82252 -82334 -82412 -84998 -87581 -89809 -86310 -86034 -85755 -83165 -80575 -80847 -81119 -82225 -83332
-2025 -83332 -84439 -85546 -87338 -89131 -91281 -87707 -86638 -85568 -87003 -88438 -86593 -84748 -82904 -81059 -82613 -84167 -86079
-2008 -86079 -82266 -78514 -74761 -75421 -76080 -75369 -74657 -76807 -78957 -77165 -75369 -73576 -71780 -72611 -73438 -74269 -75097 -75987 -76874
-1989 -76874 -74903 -72928 -74713 -76494 -78279 -80060 -80366 -80672 -80977 -81283 -81648 -82013 -82736 -77735 -77772 -77809 -77489 -77169 -78339 -79509
-1969 -79509 -80679 -81849 -79803 -77757 -75711 -73666 -76986 -80306 -80765 -81223 -85319 -89414 -88740 -88065 -86138 -84212 -82285 -80358
-1951 -80358 -81402 -82445 -80627 -78808 -77586 -76364 -75141 -73919 -74560 -75201 -78704 -82207 -81655 -81104 -80552 -80001 -79043 -78082 -79986
-1932 -79986 -81886 -82360 -82829 -83302 -83772 -83515 -83254 -85859 -88460 -85878 -83291 -80709 -78123 -78562 -79002 -79442 -79881 -81394 -82907
-1913 -82907 -81857 -80806 -78711 -81387 -83943 -86500 -91084 -90897 -90234 -86709 -84297 -81883 -79293 -76699 -75957 -75212 -74470 -73725
-1895 -73725 -75786 -77843 -79904 -81961 -79788 -77612 -78301 -78987 -79155 -79319 -79486 -79650 -79878 -80101 -83191 -86276 -86757 -87234 -84853
-1876 -84853 -82468 -82770 -83068 -83370 -83668 -81514 -79356 -80064 -80768 -77183 -73595 -74780 -75961 -77757 -79550 -85102 -83973 -81894
-1858 -81894 -79811 -77314 -74813 -74448 -74079 -73714 -73345 -74948 -76546 -78149 -79747 -78041 -76330 -79393 -82453 -84502 -86548 -88598
-1840 -88598 -90644 -87793 -84938 -82088 -79233 -75369 -71500 -72406 -73308 -74541 -75771 -77005 -78234 -80660 -83083 -82647 -82207 -80172
-1822 -80172 -78134 -76397 -74657 -70356 -70822 -75287 -79747 -82781 -85810 -88844 -91874 -90674 -89470 -85408 -81342 -81592 -81838 -77496
-1804 -77496 -73151 -74713 -79132 -81946 -84756 -83679 -82598 -81521 -80440 -77754 -75063 -75238 -75410 -77385 -79356 -81331 -83302
-1787 -83302 -83012 -82717 -82427 -82132 -84152 -86168 -87592 -82334 -78272 -80884 -82188 -78719 -77142 -78428 -77806 -77183 -79125 -81067
-1769 -81067 -76628 -72190 -71702 -75983 -78775 -74888 -70882 -71646 -73900 -76155 -77616 -76215 -76423 -76632 -77675 -78719 -81372 -81163
-1751 -81163 -79718 -78272 -77720 -80031 -82401 -81909 -83206 -84502 -83038 -81573 -78320 -77925 -77176 -73561 -74899 -79095 -80016 -80936
-1733 -80936 -82035 -83131 -83336 -83537 -80880 -78219 -80008 -81797 -80724 -79647 -82091 -84532 -83996 -80593 -75793 -73856 -76509 -76297
-1715 -76297 -76386 -76472 -76382 -76289 -78760 -81227 -82445 -80798 -79274 -77746 -76043 -74336 -74064 -73789 -73516 -73241 -75115 -76986 -78860 -80731
-1695 -80731 -80586 -80437 -80109 -79781 -80351 -78055 -78622 -82050 -81696 -81339 -81160 -80981 -80806 -80627 -80448 -80269 -82464 -84659 -82084 -82367 -81402
-1674 -81402 -75667 -72972 -75044 -75525 -76006 -76785 -77560 -79233 -80906 -82580 -84249 -84823 -85397 -85971 -86545 -85926 -85307 -84689 -84070 -85434
-1654 -85434 -86798 -88162 -89526 -87968 -86410 -84853 -83295 -84853 -86410 -83198 -79982 -81063 -82144 -80660 -79173 -78570 -82736
-1637 -82736 -84219 -85699 -85333 -84968 -84603 -84234 -80653 -77072 -76352 -75629 -75924 -76218 -76811 -77400 -76218 -79807 -82322 -81972 -79479 -76986
-1617 -76986 -77176 -77362 -76706 -76047 -77836 -79621 -82542 -78782 -77586 -83068 -84961 -82080 -82304 -82524 -82091 -81655 -78357 -75059 -74016
-1598 -74016 -72969 -71925 -70878 -73412 -75942 -78473 -81003 -80481 -79956 -85158 -85587 -82382 -82035 -82643 -83250 -84130 -85009 -80940 -76867
-1579 -76867 -77567 -75402 -72167 -73699 -73401 -73103 -73103 -73099 -73636 -74169 -74705 -75238 -75138 -75037 -72074 -69108 -75089 -81067 -80370 -79669 -79434
-1558 -79434 -79200 -78965 -78726 -78790 -78849 -79091 -79330 -76267 -76062 -77470 -73151 -72235 -71314 -70040 -68761 -69604 -70442 -71284 -72123 -71057 -69987
-1537 -69987 -71784 -73576 -77414 -81249 -80496 -79740 -79166 -81450 -85348 -83519 -82811 -82099 -81033 -79963 -79136 -78305 -74616 -70923 -71877
-1518 -71877 -72831 -70923 -69015 -69551 -70088 -70625 -71158 -75644 -80131 -81756 -83381 -83515 -83649 -83783 -83914 -83049 -82185 -81141 -80098 -79412
-1498 -79412 -75864 -73748 -77351 -77217 -79945 -85237 -84804 -82583 -89902 -86608 -80448 -78924 -80258 -79807 -79352 -79855 -80355 -78890
-1480 -78890 -80284 -84856 -83701 -81476 -82110 -81674 -81234 -80977 -80716 -81480 -82240 -83004 -83765 -86914 -90059 -88438 -86813 -86966 -87115 -82855
-1460 -82855 -78592 -72663 -72454 -75708 -78957 -81264 -83567 -83012 -82453 -80705 -78954 -73807 -74381 -74646 -72044 -71415 -70781 -69794 -68802
-1441 -68802 -67815 -66824 -70427 -74027 -74769 -75506 -75890 -76270 -73792 -71310 -71873 -72432 -72995 -73554 -72149 -70740 -72197 -73651 -75190
-1422 -75190 -76725 -75581 -74433 -73408 -75242 -81193 -82371 -79036 -78559 -79039 -79516 -79460 -79401 -79345 -79285 -80366 -81443 -82524 -83601 -82475
-1402 -82475 -81346 -80221 -79091 -74046 -68996 -70628 -72257 -72756 -73252 -73751 -74247 -73606 -72965 -72324 -71683 -71221 -70759 -70118 -69477 -70163
-1382 -70163 -67986 -66525 -71743 -74813 -77884 -76602 -75320 -74657 -73993 -73151 -72309 -74865 -74560 -71929 -75976 -79308 -79777 -82274
-1364 -82274 -84771 -81782 -78793 -75805 -72816 -72093 -71366 -73505 -75641 -76885 -78126 -79073 -80016 -81916 -79043 -77247 -78309 -78659
-1346 -78659 -79006 -79535 -80060 -80571 -81078 -81588 -82095 -81890 -81681 -81476 -81268 -81257 -81242 -81231 -81216 -81204 -81190 -81178 -81163 -80306 -79445 -78588 -77728 -77169 -76606
-1321 -76606 -76047 -75484 -79740 -83992 -84432 -80098 -74694 -72149 -74079 -76006 -80571 -80362 -79978 -84361 -84514 -81801 -80999 -80195 -81331
-1302 -81331 -82464 -80739 -79009 -77701 -76390 -75082 -73770 -73770 -73766 -73766 -73762 -77042 -80317 -80735 -81149 -79181 -77210 -75421 -73628 -72197
-1282 -72197 -73625 -78991 -79583 -79017 -78447 -77582 -76714 -74836 -72954 -71076 -69194 -70416 -71635 -72857 -74075 -73449 -72820 -72194 -71564
-1263 -71564 -74802 -78041 -78417 -78793 -77202 -75611 -74318 -73025 -71493 -74731 -77075 -76557 -75443 -77191 -78760 -77467 -76822 -76177
-1245 -76177 -75175 -74172 -76569 -76103 -73312 -77198 -82248 -84435 -83880 -83325 -85333 -87342 -86489 -82773 -78406 -78808 -79211 -79613 -81029
-1226 -81029 -82445 -83861 -85278 -83727 -82177 -80627 -79077 -77705 -76334 -74962 -73591 -72920 -72249 -74441 -76632 -73815 -70997
-1209 -70997 -72950 -74903 -77258 -79613 -81670 -83727 -83101 -77705 -75290 -72876 -73885 -79665 -81510 -80493 -80072 -79650 -79050 -78450
-1191 -78450 -77314 -76177 -77903 -79628 -77239 -74851 -75324 -75797 -73770 -71743 -71623 -76274 -79375 -79613 -79971 -83191 -81879 -77705
-1173 -77705 -76274 -77705 -80746 -79017 -78540 -80925 -80958 -80988 -81201 -81409 -80429 -79445 -78465 -77482 -79036 -80586 -80232 -82736 -84648 -81786
-1153 -81786 -81789 -81789 -80966 -80139 -79315 -78488 -78380 -78268 -78160 -78048 -79192 -80332 -81476 -82617 -81614 -80608 -79606 -78600 -79725 -80847
-1133 -80847 -81972 -83094 -81894 -80690 -79490 -78286 -79792 -81294 -79937 -78577 -79188 -79796 -80407 -81014 -81443 -81868 -82594 -83317 -82017
-1114 -82017 -85483 -91099 -88125 -85535 -82941 -79814 -76684 -74571 -72454 -72369 -69417 -67073 -71404 -73412 -72555 -73908 -75257 -76431
-1096 -76431 -77601 -75928 -74251 -75439 -76624 -76621 -76613 -76610 -76602 -79930 -83254 -81812 -80366 -78327 -76285 -77109 -77929 -76487 -75041 -73598
-1076 -73598 -72153 -71784 -71411 -71042 -70669 -71094 -71519 -74806 -78093 -76013 -73934 -74716 -75499 -74910 -74321 -73733 -73144 -74403 -75663 -76923
-1056 -76923 -78182 -77959 -77735 -77511 -77288 -76349 -75410 -74470 -73531 -71608 -69686 -67763 -65840 -69104 -72369 -75454 -73770 -75473 -77176
-1037 -77176 -75719 -74262 -76203 -78145 -80086 -82028 -81257 -80485 -82576 -87528 -89381 -86463 -83545 -80627 -79643 -78659 -77973 -77288
-1019 -77288 -75410 -78301 -80120 -79077 -79226 -79375 -74575 -69775 -71892 -74008 -76125 -78242 -75413 -72581 -72615 -72644 -72082 -71515 -70953
-1000 -70953 -70386 -73557 -76725 -77034 -77340 -76636 -75928 -75223 -74515 -75220 -75924 -76628 -77329 -78212 -79095 -79680 -80262 -82479 -79926 -77612 -75294
-979 -75294 -71131 -73647 -79859 -81298 -80586 -79870 -78860 -77847 -77850 -77850 -77854 -77854 -75160 -72462 -69768 -67069 -66224 -65374 -69298 -73218 -75987
-958 -75987 -78752 -81517 -84283 -82341 -80396 -78868 -77340 -74251 -77836 -80347 -78089 -77921 -77750 -77280 -76811 -75152 -73490 -74694
-940 -74694 -75894 -75488 -75078 -74672 -74262 -75659 -77053 -78450 -79844 -79393 -78939 -78488 -78033 -75223 -72410 -71389 -75134 -80612 -81316
-921 -81316 -80534 -82609 -81089 -79565 -78223 -76878 -76848 -76815 -79647 -82475 -81335 -80191 -79050 -77906 -77303 -76695 -76092 -75484 -76900
-902 -76900 -78313 -79729 -81141 -80411 -79677 -78946 -78212 -80731 -83247 -85766 -88281 -84659 -81033 -80273 -79509 -78361 -77210 -78029 -75983
-883 -75983 -73047 -75831 -78439 -75320 -73039 -70755 -70979 -71199 -73569 -75935 -75801 -75663 -74545 -79147 -82144 -82274 -79665 -77053
-865 -77053 -82255 -81730 -79576 -77418 -77769 -78115 -79121 -80124 -81130 -82132 -78518 -74899 -76054 -77206 -77526 -77843 -78164 -78480 -77135
-846 -77135 -75790 -77306 -78823 -78670 -78518 -77649 -82505 -85035 -81842 -82225 -82609 -82337 -82065 -82330 -76870 -71445 -68881 -71027 -73174
-827 -73174 -74187 -75201 -76215 -77228 -78898 -80567 -82237 -83906 -82952 -81998 -81044 -80090 -78387 -76684 -74981 -73278 -70561 -67845
-809 -67845 -69898 -71951 -72514 -73077 -73639 -74202 -73990 -73777 -76785 -74068 -72622 -71176 -69373 -67569 -69641 -71713 -73785 -75857 -77362
-790 -77362 -78868 -77511 -76155 -77780 -79404 -81029 -82654 -78678 -74702 -75197 -72831 -70763 -68694 -69428 -73025 -76561 -77236 -75108
-772 -75108 -72980 -71985 -73852 -73930 -69238 -68202 -67166 -67919 -73442 -74135 -74828 -75820 -76811 -77757 -78704 -79650 -80597 -82259 -83921 -85583
-752 -85583 -87245 -86910 -86571 -86235 -85896 -85561 -85222 -84886 -84547 -84763 -84976 -85013 -85047 -85024 -82136 -80862 -79583 -80347 -81108 -81871 -82632 -81547
-730 -81547 -80459 -81163 -79002 -77567 -78991 -78629 -78264 -78439 -78611 -78786 -78957 -79315 -79669 -80027 -80381 -79308 -78231 -80019 -81804 -78055
-710 -78055 -74303 -73595 -72883 -73666 -77306 -79162 -81014 -82900 -81920 -79572 -81991 -84532 -82300 -80370 -83206 -83347 -83485 -86608 -84957
-691 -84957 -82237 -79513 -79177 -78838 -79867 -78029 -74944 -76624 -78428 -77366 -78216 -79062 -76990 -74914 -72842 -70766 -71199 -71627 -70449
-672 -70449 -72130 -77362 -82591 -83411 -84227 -83616 -85863 -87935 -87141 -87722 -85438 -79937 -77295 -77459 -74757 -72238 -72577 -73550 -74523
-653 -74523 -75674 -76826 -75741 -74657 -73572 -72488 -73133 -73777 -72991 -72205 -70077 -67949 -70114 -72279 -70222 -68165 -68493 -71683
-635 -71683 -75290 -74128 -70759 -72160 -73248 -74336 -73636 -72935 -71758 -75350 -79300 -80388 -75518 -70643 -70841 -71035 -70874 -70710 -66257
-616 -66257 -61800 -63563 -65322 -68515 -71705 -70994 -70278 -69566 -68851 -70613 -72372 -70796 -69216 -65642 -62065 -56106 -50143 -44781
-598 -44781 -39415 -30057 -20696 -6688 17817 60148 118700 187086 239259 240388 189050 130971 79574 36879 6589
-583 6589 -13179 -28175 -35721 -40402 -45265 -50125 -53378 -51858 -54720 -60440 -61871 -63298 -65713 -68124 -67200 -66272 -65706 -65135
-565 -65135 -64867 -64595 -62627 -65426 -69361 -70431 -71676 -70058 -69693 -72190 -74627 -77064 -78249 -79434 -79941 -80448 -79524 -78600 -75767
-546 -75767 -72935 -73442 -73949 -76729 -79509 -76088 -72667 -73748 -74828 -75909 -76990 -74955 -72920 -72615 -72309 -70990 -74441 -73956
-528 -73956 -68702 -67386 -71791 -72682 -73569 -74757 -75942 -74150 -72354 -70949 -75264 -76364 -77459 -77843 -78223 -78607 -78987 -80299 -81607
-509 -81607 -80534 -79457 -76744 -74027 -75249 -76468 -81037 -79878 -78603 -77325 -76796 -76263 -72514 -74485 -76993 -79501 -79028 -78555
-491 -78555 -77605 -76654 -76062 -75469 -72432 -75119 -78879 -82639 -80109 -77578 -76479 -75380 -73703 -72026 -72734 -73442 -73375 -73308 -76580 -79852
-471 -79852 -82229 -84607 -82691 -80776 -80411 -80045 -78249 -76453 -76319 -76181 -80340 -84495 -82572 -80645 -81108 -81566 -81953 -82337 -81294
-452 -81294 -80247 -78786 -77321 -80750 -84175 -87122 -84342 -83355 -82363 -80958 -79550 -80172 -80791 -81428 -76338 -76856 -77370 -75324 -73274
-433 -73274 -74567 -75857 -77709 -79557 -76162 -72764 -72052 -71336 -74918 -78495 -78797 -79095 -76058 -73017 -72782 -72544 -73740 -74933 -74854
-414 -74854 -74772 -78987 -83198 -85088 -86973 -86478 -85978 -84678 -83373 -79688 -75998 -76606 -77210 -77817 -78421 -78767 -79110 -79457 -79800 -80057
-394 -80057 -80310 -79136 -77959 -77083 -76203 -72466 -68724 -70472 -72216 -74143 -76065 -75842 -78477 -80936 -78622 -76043 -76323 -77560
-376 -77560 -78793 -78749 -78700 -78655 -78607 -78652 -78693 -77306 -75916 -77206 -78491 -76919 -75343 -76483 -77619 -78760 -79896 -80977 -82054 -83135
-356 -83135 -84212 -84249 -84283 -82889 -81491 -81111 -80727 -77485 -74239 -74187 -74131 -76941 -79747 -79680 -79609 -79423 -84003 -85635 -82494 -80906 -79315
-335 -79315 -77161 -75003 -77619 -80232 -81685 -83135 -81726 -80314 -78175 -76032 -73893 -71750 -71489 -71225 -71918 -75469 -77202 -74161
-317 -74161 -72555 -70945 -71813 -72678 -76408 -80135 -81227 -82315 -80545 -78771 -80489 -82203 -82788 -83370 -79270 -79941 -78883 -80686
-299 -80686 -83593 -81730 -79867 -78003 -78450 -78898 -79345 -75022 -75052 -77944 -78927 -79911 -78872 -77832 -79654 -81476 -80019 -78562 -77403
-280 -77403 -76244 -73729 -75983 -77165 -75484 -75711 -75939 -75987 -76036 -77672 -79308 -80944 -82580 -81890 -81201 -80332 -79464 -77836 -73345 -72551
-260 -72551 -76528 -76330 -76133 -76233 -76334 -75343 -74351 -76222 -78093 -79546 -80999 -82453 -83906 -84584 -85263 -85941 -86619 -85926 -85233 -84540
-240 -84540 -83847 -80209 -76569 -77701 -78831 -80560 -82285 -81152 -80016 -78704 -77388 -76077 -74761 -73807 -72849 -74757 -76662 -77944
-222 -77944 -79222 -80504 -81782 -80947 -80109 -80705 -81298 -78853 -76405 -76822 -77236 -76699 -76159 -76755 -77347 -81223 -80329 -77347 -74366 -75857
-202 -75857 -77347 -77407 -77467 -77765 -78063 -78361 -78659 -77526 -76393 -75738 -72220 -71441 -75432 -82106 -84011 -83112 -82214 -82449 -82684 -82606 -82527 -79587
-180 -79587 -76647 -75108 -73569 -72030 -70490 -74344 -78193 -77277 -76356 -75320 -74280 -76106 -77929 -77578 -77224 -76874 -76520 -78048 -79572
-161 -79572 -78238 -76900 -77407 -77910 -79848 -81782 -80917 -80049 -80616 -81178 -79464 -77746 -78894 -80038 -77996 -75950 -73908 -71862 -72056
-142 -72056 -72246 -72082 -71914 -75983 -74325 -75890 -77452 -78838 -80221 -78745 -77265 -77042 -76815 -81361 -85904 -84260 -82613 -83474 -84331
-123 -84331 -84953 -79848 -78324 -76796 -75182 -79289 -80180 -81067 -81599 -82129 -82662 -83191 -83019 -82844 -82673 -82498 -83042 -83582 -84126 -84666 -82945
-102 -82945 -81219 -79498 -77772 -77243 -76710 -76181 -75648 -74549 -73446 -72346 -71243 -72469 -73692 -74918 -76140 -74355 -72566 -73643
-84 -73643 -74716 -77940 -81160 -81521 -81879 -80280 -78682 -77083 -75484 -76926 -78368 -76949 -75529 -73364 -71199 -75711 -80224 -78477
-66 -78477 -76729 -77843 -78957 -77605 -76252 -74899 -73546 -73565 -73584 -73602 -73621 -73386 -73151 -72917 -72682 -75130 -77578 -75257 -72935 -75048
-46 -75048 -77157 -79270 -81380 -78007 -74631 -74120 -73606 -73826 -74042 -74262 -74478 -72551 -70621 -68694 -66764 -66432 -66097 -70535 -74970
-27 -74970 -76665 -78357 -77191 -76021 -76166 -76308 -76453 -76595 -76978 -77359 -74880 -72399 -71858 -71318 -70777 -70237 -70710 -71184 -71657 -72130 -72350
-6 -72350 -72570 -72790 -73010 -70248 -67487 -67587 -67688 -67017 -66347 -70446 -74545 -77750 -80955 -81298 -81640 -81253 -80865 -80478 -80090 -76304 -72518
14 -72518 -73502 -74485 -75462 -76434 -80273 -84107 -82878 -81644 -80414 -79181 -81618 -84052 -83627 -83198 -80925 -78648 -79237 -79822 -81573 -83325
34 -83325 -82214 -81100 -82673 -84245 -82956 -81663 -80970 -80277 -79583 -78887 -79505 -80124 -80742 -81357 -83198 -85039 -84018 -82997 -81380 -79762
54 -79762 -78145 -81298 -83332 -82505 -80724 -78942 -81394 -83847 -83437 -83027 -78767 -74508 -75018 -75525 -76095 -76665 -77236 -77802 -75331 -72861
74 -72861 -75160 -77455 -75879 -74303 -72726 -71146 -72890 -74634 -76379 -78123 -80880 -83638 -81626 -79613 -81208 -82803 -84398 -85993
92 -85993 -85322 -84652 -83027 -78540 -75913 -78052 -80195 -82334 -81793 -81249 -80709 -80165 -80519 -80869 -81223 -81573 -79125 -76673 -76729 -76781 -78443
113 -78443 -74381 -71929 -72339 -72630 -72920 -73390 -73859 -74150 -74441 -74910 -75380 -75730 -78942 -83765 -82863 -81134 -79401 -80176 -80947 -83034 -85117
134 -85117 -87204 -89287 -85352 -81413 -82248 -83079 -77653 -72223 -73475 -74724 -74042 -73360 -75540 -77720 -81570 -85419 -84499 -83578 -81227
153 -81227 -78875 -79744 -80612 -78320 -81752 -81965 -82177 -81965 -81752 -75458 -74888 -74556 -74225 -74251 -74277 -76986 -79695 -77634 -75574 -75003 -74433
174 -74433 -73863 -73293 -73312 -73326 -73345 -73360 -73796 -74228 -71802 -69373 -70494 -71612 -72555 -73494 -75510 -74661 -72026 -75111 -77269 -76561 -77824
195 -77824 -79084 -80586 -82084 -80724 -79360 -78700 -78037 -77377 -76714 -80228 -83739 -82483 -81223 -81629 -82032 -82438 -82840 -82948 -83053 -83161
215 -83161 -83265 -82419 -81570 -80724 -79874 -76524 -73170 -74590 -76006 -75287 -74564 -76349 -78130 -80511 -77165 -73822 -76200 -76270 -76338 -76766
235 -76766 -77191 -78633 -80072 -81514 -82952 -84719 -86481 -85386 -84286 -83608 -82926 -82248 -81566 -80679 -79788 -79259 -78726 -76349 -79691 -79818
255 -79818 -79941 -83943 -87942 -87174 -86403 -83489 -80571 -82069 -83563 -86388 -83485 -80586 -83407 -81760 -80109 -78819 -77526 -77448 -77370
274 -77370 -77292 -77213 -77314 -77414 -77515 -77616 -75167 -72719 -73133 -73546 -77060 -80575 -81227 -81879 -82658 -83437 -84216 -84994 -82792 -80590 -78745
295 -78745 -76900 -71836 -72495 -74705 -76915 -77813 -78711 -79609 -80508 -82140 -83772 -82542 -81312 -80500 -79688 -78875 -78063 -77578 -77094 -76967
315 -76967 -76841 -72600 -74083 -75208 -76334 -75313 -74292 -73271 -72249 -74031 -75812 -77593 -79375 -79755 -80135 -80515 -80895 -82945 -84994
334 -84994 -87044 -89094 -86429 -83765 -77880 -77720 -79050 -80381 -79565 -78749 -77128 -81231 -82114 -82997 -83522 -84048 -81711 -79375 -77973
353 -77973 -76572 -75529 -74485 -74992 -81223 -82684 -78421 -78093 -77765 -77079 -76393 -80478 -84562 -85486 -80686 -77940 -79960 -78942 -77921
372 -77921 -78454 -78983 -79516 -80045 -79565 -79080 -78600 -78115 -79423 -80727 -79352 -77973 -75328 -75540 -78618 -78831 -78361 -77888 -80280 -79807 -76952
393 -76952 -74094 -74221 -77206 -77631 -78052 -77224 -81163 -81853 -79680 -77806 -78793 -80258 -81722 -81756 -81789 -79229 -73807 -70174 -71310 -72715
413 -72715 -74120 -75823 -77526 -78052 -78577 -78029 -74620 -72402 -73047 -74765 -76483 -76636 -76788 -75152 -76379 -79393 -79546 -75048 -77228
432 -77228 -81301 -88233 -90159 -87312 -85244 -86034 -86709 -84517 -80407 -79155 -78980 -78801 -78119 -77433 -78182 -78927 -82635 -86340 -84979
451 -84979 -80754 -81301 -81845 -80962 -80075 -76181 -75145 -75186 -75223 -79229 -80370 -82050 -80865 -77649 -77295 -77239 -81953 -78976 -75998 -76181
471 -76181 -76364 -75816 -75268 -74720 -74172 -76874 -79576 -82457 -82475 -83396 -84316 -82196 -80075 -79654 -79233 -78812 -78391 -78924 -79457 -82852 -86247
492 -86247 -82367 -78488 -76695 -79673 -80552 -81432 -79747 -78063 -76587 -75111 -76498 -77884 -77511 -77139 -75335 -73531 -74530 -75529 -75097
511 -75097 -74664 -76151 -77638 -76263 -74888 -74854 -74821 -74787 -74754 -76971 -79188 -78544 -77899 -78149 -78398 -80079 -81760 -80891 -80019 -80582 -81141 -80988
533 -80988 -80832 -80679 -80522 -79952 -79378 -78808 -78234 -78857 -79475 -79740 -80001 -80552 -75376 -73423 -71467 -71959 -72447 -72939 -73427 -72831 -72231 -74139
555 -74139 -76043 -79382 -76993 -77828 -78659 -80373 -82088 -80940 -79792 -80344 -80895 -80016 -79136 -78063 -76990 -75916 -74843 -73263 -71683
574 -71683 -70103 -68523 -67845 -67166 -71258 -75350 -76401 -77452 -75641 -73830 -72108 -70386 -71526 -72667 -77414 -82162 -82140 -82117 -79800
593 -79800 -77478 -76591 -75700 -76393 -77083 -79207 -81327 -79576 -77821 -74638 -71452 -73755 -76054 -80146 -78510 -78596 -78678 -79837 -80992
612 -80992 -80064 -79132 -75343 -71549 -75391 -79229 -80209 -81186 -77634 -74079 -74940 -75797 -80869 -80217 -79922 -79628 -75279 -70930 -73438 -75946
632 -75946 -74951 -76818 -77612 -72682 -69779 -69738 -70591 -71445 -74485 -77526 -81283 -79315 -74307 -75022 -76930 -78838 -78913 -78987 -79062 -79136 -79509
653 -79509 -79881 -80612 -81342 -77534 -79449 -79755 -77198 -76610 -76021 -75253 -74485 -75581 -76677 -77772 -78868 -77519 -76170 -74821 -73472
672 -73472 -76379 -79285 -77422 -75559 -76080 -76602 -77124 -77646 -80776 -83906 -82266 -80627 -77377 -74128 -74336 -80269 -78216 -76162 -79058
691 -79058 -81953 -81450 -78085 -73289 -74217 -73789 -76222 -79013 -78942 -80839 -82736 -84454 -86172 -82919 -79665 -79274 -78883 -77239 -75596
710 -75596 -76815 -78033 -79162 -80291 -80526 -77899 -78074 -83973 -85043 -83250 -83858 -81599 -80776 -79949 -79125 -78298 -74254 -75931 -76405
729 -76405 -76874 -77705 -78532 -80556 -82576 -84599 -86619 -83977 -81331 -78689 -76043 -76024 -76002 -75983 -75961 -76792 -77619 -78450 -79278 -79393 -79505 -79621
751 -79621 -79732 -78775 -77817 -76859 -75902 -73513 -71124 -71955 -72786 -70144 -73226 -75950 -78674 -79609 -80545 -81480 -82416 -81711 -81007 -80303 -79598
772 -79598 -79609 -79621 -79632 -79643 -78909 -78175 -77441 -76706 -77165 -77623 -78082 -78540 -78208 -77877 -77903 -77929 -72231 -72257 -71925 -71594 -73677 -75760 -74981 -74202
796 -74202 -74497 -74791 -75085 -75380 -75674 -75969 -76263 -76557 -74705 -72853 -75771 -78689 -79401 -80113 -78320 -76528 -69369 -67934 -71508 -75082
816 -75082 -82546 -84286 -82568 -80850 -79311 -77772 -76233 -74694 -72872 -71049 -70420 -75514 -81860 -82483 -80004 -77526 -77053 -76580
834 -76580 -78968 -81357 -79572 -77787 -76002 -74217 -73326 -72436 -71545 -70654 -71135 -71616 -72097 -72577 -71843 -71105 -72876 -74642 -77843 -75316
854 -75316 -76013 -76706 -77329 -77947 -75708 -73464 -76412 -79356 -82304 -85248 -83802 -82352 -77687 -78741 -78190 -77634 -77441 -77243 -80821
873 -80821 -84394 -79744 -75089 -73300 -77232 -78305 -73651 -73617 -73580 -73189 -72794 -75324 -77850 -77161 -76468 -80653 -79110 -77929 -76744
892 -76744 -77172 -77597 -78026 -78450 -79300 -80146 -78134 -76118 -76908 -77694 -78484 -79270 -79226 -79177 -79132 -79084 -80530 -81972 -78648 -75320 -75465 -75611
914 -75611 -78976 -76617 -75689 -74761 -73475 -72190 -72335 -72480 -75488 -78495 -78521 -78547 -78573 -78600 -74571 -70543 -71284 -72026 -71933 -71840 -71746 -71653 -71769
937 -71769 -71884 -74862 -77839 -79028 -80217 -81406 -82594 -83302 -84007 -81853 -79695 -81834 -83970 -81339 -78704 -76237 -73766 -71299
955 -71299 -68828 -68091 -67349 -71023 -74694 -78480 -76539 -73051 -69559 -70304 -71046 -68929 -66809 -69387 -71963 -74541 -77116 -76714 -76308
974 -76308 -75905 -75499 -78037 -80575 -83470 -80642 -79185 -77728 -78775 -79822 -77932 -76043 -78924 -81804 -82360 -82915 -83470 -84025 -80362
993 -80362 -76699 -75898 -75097 -73878 -72659 -71799 -70938 -68855 -72495 -72917 -73338 -74116 -74895 -75674 -76453 -77474 -78495 -79516 -80537 -77862
1013 -77862 -75186 -77280 -79375 -77951 -76528 -77966 -79404 -81141 -82878 -84614 -86351 -82289 -78227 -80843 -83459 -83929 -84398 -82006
1031 -82006 -79613 -79337 -79062 -78488 -77914 -82289 -81894 -84182 -86470 -86873 -87275 -84815 -82356 -83295 -84234 -82311 -80388 -79226 -78063
1050 -78063 -79762 -81462 -80478 -79494 -78510 -77526 -79181 -80835 -79628 -78421 -77929 -77437 -76945 -76453 -77556 -78659 -76900 -75141 -73382
1069 -73382 -71623 -72726 -73830 -75421 -77012 -78603 -80195 -80355 -80515 -80675 -80835 -85319 -89802 -87786 -85769 -82799 -82691 -83955
1087 -83955 -80448 -75890 -76103 -79714 -80463 -80616 -80768 -80742 -80716 -78320 -75924 -76390 -76856 -75294 -73733 -75033 -76334 -74694 -73051 -71407
1107 -71407 -69764 -71702 -73636 -70800 -67964 -69812 -71657 -73502 -75346 -73915 -72480 -73908 -75335 -72861 -70382 -72678 -74970
1124 -74970 -74046 -73118 -72194 -71266 -72160 -73051 -73945 -74836 -76833 -78827 -76054 -73278 -71765 -70248 -73744 -71512 -68836 -71881 -77433
1143 -77433 -77258 -76133 -75003 -76919 -73107 -71445 -72641 -74735 -76826 -79103 -81376 -80787 -80198 -79792 -79382 -81834 -84286 -84447 -84603
1162 -84603 -87979 -85632 -83884 -82132 -81991 -78987 -76624 -79982 -79941 -79900 -78790 -77675 -79423 -81171 -79390 -77605 -78682 -79759
1180 -79759 -79319 -78875 -78432 -77988 -79345 -80698 -80619 -80541 -79751 -78957 -81026 -83094 -79740 -76382 -74813 -73244 -70159 -72794 -72208 -71623
1200 -71623 -72987 -74348 -78573 -82796 -82341 -81883 -79997 -78108 -77400 -76688 -78842 -80992 -82878 -84760 -83783 -82803 -84972 -87137 -86444
1219 -86444 -85747 -84607 -83463 -79460 -75454 -75894 -76330 -78380 -80426 -80329 -83090 -86034 -83250 -81026 -78797 -76215 -73628 -74355 -75078
1238 -75078 -75805 -76528 -74154 -71776 -74172 -76565 -76278 -75987 -75700 -75410 -76878 -78342 -79811 -81275 -79822 -78365 -76911 -75454 -73539
1257 -73539 -71620 -72566 -73509 -74575 -75637 -78134 -80627 -82930 -85229 -86101 -86969 -82773 -78573 -77239 -75902 -76937 -77970 -74236
1275 -74236 -70498 -68791 -67081 -70144 -73203 -75011 -76815 -75879 -72078 -69235 -73066 -74754 -73576 -71448 -72179 -75894 -79606 -81443
1293 -81443 -83276 -80344 -77407 -76889 -76371 -77284 -78197 -79915 -81633 -80787 -79941 -77113 -79054 -84514 -87111 -89112 -88251 -85602 -85814
1312 -85814 -85647 -82617 -79945 -77273 -77284 -77295 -77306 -77318 -78760 -80202 -81346 -82490 -85512 -83765 -78320 -75738 -74266 -72794 -70069
1331 -70069 -67345 -69838 -72331 -72917 -76364 -79557 -77981 -79565 -81149 -76859 -77340 -78000 -78659 -79434 -80209 -79554 -78898 -79136 -79375 -79613
1351 -79613 -79852 -80105 -80358 -79181 -78003 -74053 -70103 -70923 -71743 -74813 -77880 -78089 -78294 -76118 -73938 -73192 -72443 -72145 -71843 -72976
1371 -72976 -74105 -73926 -73744 -76427 -79106 -79062 -79013 -76285 -73554 -72972 -75249 -81108 -80284 -80105 -79922 -80757 -81588 -81708 -81823 -81942 -82058
1392 -82058 -82106 -82151 -82199 -82244 -80802 -79356 -77914 -76468 -75398 -74325 -76118 -77906 -79460 -81011 -83757 -79822 -76427 -77798 -78756
1411 -78756 -79710 -81085 -79595 -76856 -78883 -80168 -78588 -77310 -78890 -82561 -86228 -85307 -84383 -83686 -82986 -82289 -81588 -80176 -78760
1430 -78760 -80209 -81655 -80094 -78529 -75059 -74448 -78849 -78477 -78108 -77735 -77742 -77746 -77754 -77757 -78778 -79796 -80817 -81834 -81409 -80981 -80556 -80127
1452 -80127 -80120 -80109 -77239 -74366 -74493 -74616 -74743 -74865 -74813 -74757 -74705 -74649 -75805 -76956 -77932 -78905 -76423 -71076 -66447 -68493 -68825 -69153
1474 -69153 -72764 -76371 -77359 -78342 -79330 -80314 -80645 -80973 -81305 -81633 -80295 -78954 -77616 -76274 -76036 -75793 -75555 -75313 -75790 -76263 -76740
1495 -76740 -77213 -76468 -75719 -74974 -74225 -75626 -77023 -78424 -79822 -79762 -79699 -79639 -79576 -78980 -78380 -74921 -71459 -71698 -71933 -72171 -72406 -73658
1517 -73658 -74906 -76159 -77407 -76550 -75693 -74836 -73979 -75089 -76200 -77310 -78421 -79352 -80284 -78354 -76423 -76818 -77213 -77608 -78003 -76330
1537 -76330 -74657 -72984 -71310 -71486 -71661 -71836 -72011 -74094 -76177 -73490 -70804 -72171 -73539 -74728 -75916 -77198 -75618 -75648 -80448
1556 -80448 -82326 -81342 -79404 -77467 -77959 -78450 -78942 -79434 -77601 -75767 -73934 -72100 -72779 -73457 -74135 -74813 -75313 -75812 -76311 -76811
1576 -76811 -78085 -79360 -77772 -76185 -77996 -79807 -78756 -77705 -76170 -74631 -75957 -77280 -79442 -81599 -80899 -80195 -77094 -73990
1594 -73990 -75659 -77325 -82512 -87696 -86206 -84711 -82766 -80817 -78872 -76923 -76706 -76487 -79132 -81775 -80962 -80146 -82196 -84242
1612 -84242 -82714 -81182 -79952 -78719 -76121 -78290 -77780 -77265 -77649 -78029 -78532 -74262 -72097 -74698 -75931 -74299 -73088 -71873
1630 -71873 -73345 -74813 -72320 -69823 -72100 -74374 -73610 -72842 -72376 -71907 -71992 -76844 -81879 -86910 -85147 -83381 -81618 -79852 -79688
1649 -79688 -79524 -79360 -79196 -78793 -78391 -75126 -71862 -72980 -74098 -72354 -70610 -71966 -73323 -74679 -76036 -75439 -74843 -74247 -73651
1668 -73651 -70908 -68165 -70192 -72220 -73643 -75067 -73628 -72190 -73017 -73844 -74672 -75499 -77362 -79222 -81085 -82945 -81052 -79155
1686 -79155 -77262 -75365 -73569 -71769 -74743 -77713 -79971 -82225 -79714 -77198 -76393 -75585 -74780 -73971 -74359 -74743 -70360 -65974 -67643
1705 -67643 -69309 -70979 -72644 -72823 -72998 -73177 -73353 -73800 -74243 -78089 -76207 -72302 -71254 -76829 -82401 -82252 -82099 -81950 -81797 -81171
1725 -81171 -80541 -79915 -79285 -78700 -78111 -80031 -81946 -84342 -81011 -74821 -74351 -74750 -75145 -79300 -77728 -74489 -74109 -72659 -74068
1744 -74068 -76733 -73669 -70431 -72913 -77366 -76092 -78398 -80701 -79997 -79289 -78585 -77877 -75205 -72529 -74627 -76721 -76267 -75808 -75354
1763 -75354 -74895 -74798 -74698 -77284 -79867 -79263 -75793 -77336 -73151 -71594 -72894 -72231 -71564 -74620 -77672 -78223 -78771 -76639 -80228
1782 -80228 -83820 -81685 -78532 -75376 -75443 -69782 -68180 -72298 -72842 -73382 -73807 -74228 -78231 -76505 -70669 -70554 -73543 -76528 -75022
1801 -75022 -73513 -72365 -71213 -68277 -71061 -73490 -75916 -76405 -76889 -77377 -77862 -76203 -74541 -75745 -76945 -75465 -73982 -72503
1819 -72503 -71020 -73118 -75212 -76952 -78689 -82222 -80027 -78193 -76356 -76311 -76263 -76218 -76170 -77049 -77925 -75942 -73956 -74478 -74996 -75160
1839 -75160 -81044 -80977 -80906 -81193 -81480 -81890 -82296 -79840 -77385 -76602 -75816 -75029 -74243 -73520 -72794 -74929 -77064 -80161 -83254 -81577 -79900
1860 -79900 -77988 -76073 -74157 -72242 -71612 -70979 -67125 -68996 -69976 -70953 -72287 -73621 -77478 -81331 -80418 -79501 -79602 -79699 -76937
1879 -76937 -74172 -71172 -68169 -69939 -71705 -73893 -76077 -78264 -80448 -79926 -79401 -74109 -68814 -68173 -67528 -69749 -71966 -72339
1897 -72339 -72708 -73080 -73449 -76326 -79200 -79214 -79226 -79464 -79699 -79934 -80168 -78887 -77601 -77746 -77891 -76431 -74966 -76364 -77761 -81517
1917 -81517 -85270 -84253 -83235 -82509 -81778 -81048 -80317 -78219 -76118 -76878 -77638 -79349 -81055 -81808 -79699 -80068 -85203 -87297 -84622
1936 -84622 -82430 -80239 -79181 -78123 -79270 -80418 -81566 -82714 -81186 -79658 -79561 -79464 -80709 -81953 -80634 -79315 -78555 -82561
1954 -82561 -84007 -80679 -77474 -79036 -80839 -79777 -76334 -75749 -74810 -73867 -75969 -78067 -77306 -76542 -77545 -78547 -76688 -74828
1972 -74828 -75115 -75402 -75689 -75976 -75547 -75119 -74690 -74262 -75026 -75790 -76554 -77318 -77970 -78618 -79270 -79919 -78275 -76628 -76416 -76200 -74348 -72492
1994 -72492 -73502 -74508 -74057 -73602 -76192 -78778 -77701 -79486 -82345 -80433 -79595 -78756 -77619 -76483 -79699 -82915 -81361 -79807
2012 -79807 -77359 -74910 -75324 -75738 -73714 -71690 -72529 -73367 -75220 -77072 -78924 -80776 -80377 -79978 -76718 -73457 -72521 -71586 -75421
2031 -75421 -79255 -77049 -74843 -75618 -79255 -82117 -82117 -80865 -79613 -78763 -75052 -70267 -70252 -72503 -74754 -77303 -79852 -80776 -81700
2050 -81700 -79762 -77824 -76393 -74962 -73531 -72100 -71743 -71385 -72279 -73174 -75111 -74187 -72011 -69835 -71363 -72890 -69946 -69864 -70021
2069 -70021 -70177 -67651 -65124 -66533 -67942 -69350 -70759 -71273 -71787 -72302 -72816 -74523 -76229 -77936 -79643 -78547 -77452 -77608 -80627
2088 -80627 -79740 -78853 -77072 -72428 -70766 -71966 -74239 -76513 -75637 -74757 -73762 -77534 -79639 -76971 -74426 -71877 -73535 -75190
2106 -75190 -74165 -73136 -72171 -74064 -78942 -83817 -84219 -81756 -78044 -74329 -75149 -75965 -75175 -77243 -77735 -78223 -78894 -79561 -80500 -81435
2126 -81435 -81122 -80806 -78536 -79129 -82583 -83176 -83142 -83109 -85758 -88408 -89731 -91054 -89395 -84875 -81428 -80843 -81331 -81819 -82136 -82449
2146 -82449 -80083 -77713 -73707 -72559 -71236 -69909 -70569 -71225 -67293 -63358 -66194 -71888 -72995 -71236 -69164 -69950 -71635 -68545
2164 -68545 -67308 -66067 -67394 -68717 -70640 -72559 -77046 -81529 -82617 -78931 -75070 -71206 -72082 -72957 -76695 -80433 -79460 -78488
2182 -78488 -77515 -76542 -74109 -71676 -72104 -72533 -70457 -68381 -66306 -64230 -65437 -66645 -64990 -63335 -63410 -63485 -68329 -73174 -78242
2201 -78242 -83310 -83608 -83906 -83608 -83310 -83012 -82714 -81637 -80560 -79483 -78406 -77329 -76252 -75175 -74098 -75540 -76982 -78424 -79867
2220 -79867 -79162 -78458 -80616 -82773 -81577 -80377 -82043 -83705 -83224 -82740 -82259 -81775 -81838 -81898 -81961 -82021 -81726 -81428 -81134 -80835 -81991 -83142
2242 -83142 -82270 -84256 -87081 -83224 -78834 -77303 -78361 -79416 -80653 -81886 -80619 -79349 -78082 -76811 -79796 -82777 -82900 -83019
2260 -83019 -83083 -83142 -83202 -83262 -82460 -81655 -80854 -80049 -79963 -79874 -79785 -79695 -79103 -78506 -77914 -77318 -74936 -72551 -74936 -77321 -77578 -77832 -80951 -84066
2284 -84066 -82773 -81476 -80180 -78883 -78734 -78581 -78432 -78279 -78130 -77977 -77828 -77675 -76759 -75838 -74921 -74001 -74933 -75861 -76792 -77720 -80567
2305 -80567 -83411 -81488 -79561 -80619 -81674 -79334 -82714 -82676 -79773 -81644 -86373 -87827 -83552 -79818 -76080 -73256 -70427 -74277
2323 -74277 -78126 -76669 -75212 -73755 -72298 -74318 -76334 -75488 -74642 -73796 -72950 -74966 -76982 -77571 -78156 -78383 -78611 -81223 -78111
2342 -78111 -75715 -73319 -71567 -75536 -76285 -77034 -75637 -74239 -75525 -76811 -79680 -79684 -78082 -82199 -79822 -77441 -78104 -78763 -80560
2361 -80560 -79490 -76636 -79501 -83623 -84879 -80116 -81074 -82095 -83112 -81629 -80142 -78182 -76218 -76941 -77660 -80291 -80057 -81793
2379 -81793 -77802 -81327 -84849 -83068 -81283 -82032 -79919 -76196 -78197 -76323 -74448 -74899 -72488 -69577 -72391 -73595 -71936 -71649
2397 -71649 -74225 -79483 -81879 -78801 -75719 -75324 -74925 -74888 -74847 -72305 -69760 -69954 -75868 -79282 -76967 -73047 -74847 -77664 -80478
2416 -80478 -81298 -79252 -76136 -77787 -77593 -77396 -77500 -77601 -75767 -73930 -69414 -69663 -70811 -71955 -73401 -74843 -74534 -74221 -73911
2435 -73911 -73598 -71381 -69160 -73621 -78078 -79229 -80377 -76759 -73136 -70591 -68042 -72175 -79166 -79699 -75462 -72656 -72712 -73066
2453 -73066 -76282 -75205 -74128 -74467 -74806 -75145 -75484 -75883 -76282 -74116 -71951 -71377 -75570 -74221 -72868 -73069 -73267 -73468 -73666 -75015
2473 -75015 -76360 -74847 -73330 -72712 -72089 -71471 -70848 -72529 -74206 -75708 -77206 -74832 -69592 -67755 -70684 -74392 -73326 -73457
2491 -73457 -76446 -77649 -75987 -73256 -70520 -69540 -68556 -70438 -72317 -73781 -75242 -79390 -78763 -78082 -77396 -73733 -74836 -74750 -74661
2510 -74661 -74873 -75082 -77359 -79632 -79047 -78458 -74116 -69771 -70200 -67763 -67983 -72969 -77959 -78175 -75711 -76106 -76386 -73800 -72313
2529 -72313 -73684 -73271 -72853 -73155 -73453 -73755 -74053 -76583 -79110 -78778 -78443 -76680 -74914 -77921 -80925 -79583 -78238 -76896 -75551
2548 -75551 -76416 -77277 -75279 -73278 -71422 -69563 -72477 -75387 -75141 -74892 -74646 -74396 -78115 -81830 -80780 -79725 -82073 -84417 -81994
2567 -81994 -79568 -78413 -77254 -78961 -80664 -77660 -74653 -74511 -74366 -75007 -75648 -76289 -76930 -76557 -76185 -75812 -75439 -75782 -76125 -76468
2587 -76468 -76811 -75961 -75111 -74262 -73412 -72659 -71907 -71333 -70759 -68515 -69134 -73688 -73472 -73405 -73338 -75834 -78331 -79755 -81178 -77534 -73889
2608 -73889 -77329 -75998 -71806 -72380 -70572 -68765 -67256 -65743 -67960 -70177 -72097 -74012 -77601 -76419 -77921 -79419 -77068
2625 -77068 -74716 -75227 -75734 -75469 -75205 -77802 -80396 -80638 -80880 -78260 -75637 -75820 -76002 -76185 -76364 -75022 -73677 -76807 -79934 -82348
2645 -82348 -79990 -80317 -80642 -78525 -76405 -74288 -72167 -73926 -75682 -77441 -79196 -79818 -80437 -78197 -75954 -74728 -73498 -75134
2663 -75134 -76766 -73975 -71180 -73159 -75134 -76099 -77060 -78026 -78987 -80448 -81905 -80500 -79095 -77694 -76289 -77746 -79203 -78354
2681 -78354 -77500 -76647 -75793 -74705 -73613 -75384 -77154 -77895 -78633 -79371 -80109 -77273 -74433 -74456 -74478 -75190 -75898 -76606 -77314 -77489 -77660
2702 -77660 -77832 -78003 -78164 -78324 -78484 -78644 -79878 -81111 -79483 -77854 -74705 -71556 -71269 -70982 -72007 -73032 -74057 -75082 -74832
2721 -74832 -74582 -74511 -74441 -73595 -75611 -81920 -82505 -81301 -77236 -77284 -77333 -76487 -75641 -74795 -73949 -73084 -72216 -71351 -70483 -70811 -71135 -69495
2743 -69495 -70714 -74739 -73036 -68474 -69633 -71452 -70405 -71329 -72249 -72466 -72678 -70032 -67383 -69924 -72462 -73036 -76468 -81096
2761 -81096 -79997 -79438 -78875 -78376 -77873 -77016 -76155 -79058 -76233 -75022 -76669 -78499 -80325 -77564 -74798 -72946 -71090 -71743 -72391
2780 -72391 -75547 -72976 -73628 -74277 -74601 -74921 -75246 -75566 -75711 -75853 -75998 -76140 -77679 -79214 -77891 -76565 -72738 -68907 -71758 -74605
2800 -74605 -75659 -76714 -75861 -77869 -82978 -83317 -79840 -76364 -75920 -75477 -75033 -74590 -73789 -72987 -75048 -77109 -76695 -76282 -75868 -75454
2820 -75454 -75935 -76416 -76896 -77377 -77411 -77444 -77478 -77511 -78260 -79009 -79759 -80508 -79334 -78160 -76986 -75812 -74221 -72630 -73721 -74813 -76323
2841 -76323 -74970 -72365 -74530 -76695 -75998 -74348 -72697 -70390 -68083 -68638 -69194 -71359 -73524 -75689 -77854 -78700 -79546 -79438 -76468
2860 -76468 -70457 -69216 -71791 -74366 -75331 -76293 -74575 -72853 -70360 -70725 -75208 -74918 -73237 -74415 -76550 -73911 -74079 -77105
2878 -77105 -78227 -79345 -77388 -75428 -76334 -77236 -75816 -74392 -72972 -71549 -70874 -70196 -69522 -68843 -72402 -75957 -76654 -77347 -76405
2897 -76405 -75458 -74511 -73565 -74765 -75965 -77165 -78365 -77273 -76177 -77944 -79710 -78674 -77638 -76602 -75566 -76002 -76434 -76867 -77299
2916 -77299 -79222 -81145 -84379 -84752 -84570 -79613 -75551 -74351 -73867 -73382 -73077 -72771 -73587 -74403 -75220 -76036 -77031 -78026 -79021 -80016 -81011
2937 -81011 -82006 -80139 -78272 -76345 -74418 -75354 -76289 -74470 -72652 -75603 -78555 -77511 -76468 -75425 -74381 -73442 -72503 -74426
2955 -74426 -76349 -75350 -74351 -79613 -79151 -76002 -75711 -78048 -80381 -80213 -77180 -72358 -73259 -74977 -73830 -74474 -75115 -76058 -74135
2974 -74135 -70602 -72794 -70733 -68672 -69831 -70990 -72984 -74977 -76971 -78961 -76334 -73707 -75849 -77992 -79121 -80250 -81380
2991 -81380 -82505 -81577 -80649 -79721 -78793 -78402 -78011 -77619 -77228 -79431 -81633 -80973 -80314 -78283 -76252 -77083 -77914 -79621 -81324 -80168
3011 -80168 -79009 -77795 -76576 -75361 -74143 -75752 -77359 -76106 -74851 -75566 -76278 -76993 -77705 -77157 -76606 -76058 -75506 -74064 -72618
3030 -72618 -71534 -70446 -69220 -73714 -75708 -71974 -71523 -76792 -81708 -80895 -81570 -82240 -82557 -82870 -83306 -83739 -81312 -78883 -77769
3049 -77769 -76651 -78398 -80142 -78730 -77314 -75902 -74485 -71597 -68709 -70591 -72473 -73520 -74567 -75615 -76662 -75689 -74716 -76606
3067 -76606 -78495 -80385 -82274 -81301 -80329 -80340 -80351 -80362 -80373 -79848 -79323 -78797 -78272 -79557 -80843 -82129 -83414 -82434 -81454 -80295 -74366
3088 -74366 -73271 -72175 -70781 -69387 -71094 -72801 -74508 -76215 -76371 -76528 -79546 -82565 -79919 -77273 -81305 -85337 -81972 -78607
3106 -78607 -81920 -85233 -87353 -89474 -86824 -84175 -80631 -77087 -76405 -75723 -78141 -80560 -82978 -85397 -84305 -83213 -82121 -81029
3124 -81029 -79341 -77653 -78827 -80001 -80809 -81618 -79565 -77511 -79036 -80560 -79222 -77884 -79673 -81462 -80388 -79315 -78957 -78600
3142 -78600 -78242 -77884 -77772 -77660 -77549 -77437 -76133 -74828 -73822 -72816 -72894 -77739 -79904 -82065 -80474 -78879 -82833 -82013 -81555 -81093
3162 -81093 -80336 -79576 -78104 -76628 -78018 -79404 -77985 -76565 -75145 -73725 -73856 -73986 -73818 -73651 -78350 -78279 -76121 -73964 -72223
3181 -72223 -70483 -71605 -72726 -73785 -74839 -75719 -76595 -76639 -73818 -72611 -71400 -74120 -76837 -77769 -81558 -80373 -76323 -73885
3199 -73885 -74307 -77098 -79885 -79695 -76639 -74690 -72738 -71862 -73844 -76457 -79065 -80604 -79278 -76643 -74005 -74053 -74098 -72290 -70483
3218 -70483 -66887 -66153 -67356 -65698 -65829 -65959 -65985 -66011 -67468 -68925 -71813 -74702 -74728 -74754 -75708 -76658 -76181 -75700 -77459 -79214 -78111
3239 -78111 -77005 -76870 -76733 -76598 -76460 -78771 -81078 -83388 -85695 -84950 -84201 -83455 -82706 -81424 -80139 -77247 -77213 -78346 -79475 -80608
3259 -80608 -81737 -84599 -84596 -83522 -82445 -82460 -85333 -82009 -78682 -77623 -79423 -79438 -79449 -79673 -77031 -76002 -74970 -76267 -77560 -74385
3279 -74385 -74068 -74239 -74407 -76367 -75462 -74232 -72998 -71590 -70177 -72108 -74034 -72924 -74672 -74605 -74534 -73572 -69745 -72391 -77895
3298 -77895 -80899 -77221 -76915 -81376 -82919 -81596 -82542 -83485 -79662 -75834 -75171 -77366 -77776 -81044 -79460 -77873 -79330 -80783
3316 -80783 -83463 -86138 -82498 -78853 -73960 -74787 -75261 -75730 -76323 -76911 -72734 -68553 -72138 -75719 -74474 -76088 -80269 -78723
3334 -78723 -75928 -75991 -78324 -77791 -77083 -79233 -79956 -74951 -69950 -70669 -75343 -77150 -74251 -71348 -71519 -71687 -74720 -77750 -78913
3353 -78913 -80072 -79803 -79531 -80664 -81793 -80064 -78331 -78246 -78156 -78249 -78339 -76554 -77627 -80493 -77631 -77739 -80705 -82065 -80560 -77836
3373 -77836 -77970 -82699 -84562 -80493 -76423 -73546 -76393 -78823 -78391 -75156 -71922 -72123 -72324 -75387 -78450 -78890 -79330 -76908 -74485
3392 -74485 -72488 -70490 -73263 -76036 -76542 -77049 -74694 -72339 -71504 -70669 -69477 -74008 -76751 -79494 -75559 -71623 -74102 -70856
3410 -70856 -70293 -75454 -79125 -79934 -79848 -79762 -76338 -72913 -72350 -71787 -71225 -70662 -72961 -75261 -76893 -78521 -77292 -76058 -77392 -78723
3430 -78723 -73975 -74948 -76744 -78536 -80690 -82840 -81059 -79274 -80355 -81432 -81085 -80735 -80388 -80038 -79691 -79341 -78995 -78644 -81085
3449 -81085 -83522 -83101 -82676 -79214 -75749 -75983 -80985 -81879 -78003 -75499 -75857 -78123 -80388 -82833 -85278 -84145 -83012 -79017
3467 -79017 -75022 -74485 -73949 -73412 -72876 -76908 -80940 -83064 -80418 -78726 -79896 -82021 -84145 -82393 -80642 -78890 -77139 -77713
3485 -77713 -78286 -78860 -79434 -78827 -78219 -74929 -76408 -78007 -79606 -78641 -77675 -78887 -80098 -81309 -82520 -80273 -78026 -78641 -79255
3504 -79255 -79099 -78939 -78782 -78622 -76975 -75324 -73677 -72026 -72630 -73230 -73833 -74433 -73427 -72417 -74273 -76125 -76971 -77813 -78659 -79501
3524 -79501 -79632 -79759 -75298 -70833 -70233 -72492 -76006 -74746 -73729 -75570 -76341 -79971 -81335 -76021 -71780 -72309 -71288 -67405
3542 -67405 -68292 -69179 -68970 -68761 -71415 -74068 -72965 -71862 -70759 -69656 -71758 -73859 -73099 -72339 -73725 -75111 -76498 -77884 -79263
3561 -79263 -80642 -84883 -89123 -86567 -84011 -81454 -78898 -76237 -73576 -78905 -78510 -76147 -73785 -73926 -74068 -75372 -76677 -75119
3579 -75119 -73561 -76118 -78674 -79680 -74962 -74385 -73807 -72872 -71936 -73505 -75074 -73841 -69745 -66604 -69186 -71351 -76379 -79140
3597 -79140 -79039 -77567 -73233 -72372 -71508 -70468 -69425 -68623 -67819 -69879 -71936 -73610 -75279 -76952 -78622 -75764 -72902 -72905 -72905 -73498
3617 -73498 -74087 -74679 -75268 -75324 -75376 -75432 -75484 -77299 -79110 -80925 -82736 -79840 -76941 -76013 -72220 -68664 -70830 -69600 -68366 -68985
3637 -68985 -69600 -70218 -70833 -72466 -74094 -72864 -71631 -72726 -73818 -74914 -76006 -73248 -70487 -69697 -66041 -65132 -69943 -72790
3655 -72790 -72771 -74895 -74154 -72879 -74463 -79628 -79065 -82084 -85099 -82736 -83232 -85520 -82080 -79896 -80571 -80891 -78346 -78495 -78641
3674 -78641 -78611 -78577 -76699 -74817 -72939 -71057 -74362 -77664 -78108 -78547 -77977 -77403 -76833 -76259 -75361 -74459 -73561 -72659 -73908 -75152 -76043
3695 -76043 -76930 -78872 -75085 -74523 -73956 -75480 -77001 -78883 -80761 -75697 -76352 -78562 -80768 -81368 -81965 -82565 -83161 -82121 -81078
3714 -81078 -80038 -78995 -82606 -86213 -83146 -80075 -78372 -76665 -77824 -78980 -78290 -77597 -76908 -76215 -78096 -79978 -78998 -78018 -78111
3733 -78111 -78205 -75436 -72667 -73550 -74433 -75316 -76200 -76546 -76893 -77239 -77586 -78525 -79464 -80403 -81342 -83414 -85486 -86366 -81521 -78905 -82013
3754 -82013 -81544 -81074 -79173 -77273 -75372 -73472 -77623 -81771 -81152 -80530 -80567 -80601 -77776 -74948 -72838 -70725 -75294 -79859 -79777 -79691
3774 -79691 -79609 -79524 -78298 -77068 -75842 -74612 -71299 -67983 -71348 -74709 -74817 -74921 -75029 -75134 -75838 -76539 -77243 -77944 -79751 -81558
3794 -81558 -80504 -79449 -78812 -78175 -77537 -76900 -76300 -75700 -75100 -74500 -74914 -75328 -75741 -76155 -77940 -79725 -78648 -77571 -77388 -77206 -74161
3815 -74161 -71117 -72305 -73494 -71821 -70148 -71098 -72048 -72998 -73949 -74936 -75924 -76911 -77899 -77098 -76297 -72633 -68970 -67781 -66592 -68266
3835 -68266 -69939 -71851 -73762 -72812 -71862 -75857 -79852 -79077 -78301 -78659 -79017 -79375 -79732 -82147 -84562 -84115 -83668 -83996 -84324 -81789
3855 -81789 -79255 -78462 -77664 -79732 -81797 -81361 -80921 -80485 -80045 -78626 -77202 -75782 -74359 -75085 -75808 -76535 -77258 -76140 -75018 -73900
3875 -73900 -72779 -73807 -74832 -75861 -76885 -77325 -77761 -78201 -78637 -78719 -78797 -78879 -78957 -80858 -82758 -84659 -86560 -84883 -83206 -81529
3895 -81529 -79852 -79524 -79196 -78868 -78540 -77675 -76811 -75946 -75082 -73964 -72846 -74590 -76334 -76826 -77318 -74590 -77586 -78190 -78793 -79755
3915 -79755 -80716 -79531 -78346 -71079 -69536 -74012 -78488 -75093 -71698 -69913 -73852 -74571 -75290 -78089 -80888 -80824 -80761 -74616 -68471
3934 -68471 -67096 -65720 -66559 -67397 -68236 -69074 -69495 -69917 -70338 -70759 -71813 -72868 -73923 -74977 -71918 -68858 -72179 -75499 -76628
3953 -76628 -72984 -70416 -70707 -70703 -70695 -70871 -71042 -72551 -74057 -75566 -77072 -75480 -73885 -72294 -70699 -71042 -71381 -71724 -72063 -74374
3973 -74374 -76680 -74221 -71758 -71772 -71784 -71799 -71810 -72719 -73625 -74534 -75439 -76993 -78547 -80101 -81655 -80198 -78741 -77284 -75827 -74526
3993 -74526 -73226 -73356 -73487 -73885 -74284 -71821 -69358 -73349 -77340 -78469 -79598 -80787 -81976 -83165 -84353 -85058 -85762 -83604 -81447
4012 -81447 -81793 -82140 -82486 -82833 -80601 -78368 -78998 -79628 -81361 -83094 -81965 -80835 -80780 -80724 -79237 -77750 -75220 -72689 -74929 -77169
4032 -77169 -74441 -71713 -73755 -75797 -74918 -74038 -73159 -72279 -71668 -71057 -73308 -75559 -73278 -70997 -66809 -65482 -69481 -68709 -68892
4051 -68892 -71936 -76591 -76475 -74452 -72428 -74936 -77444 -77090 -76736 -75547 -74359 -73170 -71981 -71463 -70945 -70427 -69909 -69898 -69887 -72559
4071 -72559 -70461 -70271 -70081 -71023 -71966 -69779 -67591 -68266 -68940 -70476 -72011 -73546 -75082 -75216 -75350 -75484 -75618 -75089 -74560 -77370
4091 -77370 -77318 -76937 -81327 -83750 -79494 -78089 -76684 -74862 -73039 -73841 -74642 -75443 -76244 -77381 -78518 -74884 -71251 -70449 -69648
4110 -69648 -71709 -73770 -74150 -74530 -76341 -78152 -77996 -77839 -76252 -74664 -74321 -73979 -73636 -73293 -74530 -75767 -74143 -72518 -76632
4129 -76632 -80746 -80090 -79434 -77318 -75201 -77854 -80508 -79188 -77869 -75119 -72369 -75760 -79151 -75864 -72577 -72935 -73293 -75082
4147 -75082 -76870 -77347 -77824 -78301 -78778 -80254 -81730 -81775 -81819 -84815 -87812 -86038 -84264 -81980 -79695 -80273 -80850 -80832 -80813 -82703 -81730
4168 -81730 -75868 -74776 -73803 -75693 -74869 -71184 -70539 -72756 -75089 -77418 -78499 -79576 -78778 -77977 -76703 -78286 -81685 -80310
4186 -80310 -80370 -80426 -79829 -79229 -81495 -83757 -82803 -81845 -80891 -79934 -78443 -76949 -75458 -73964 -75499 -77031 -78566 -80098 -79963 -79826
4206 -79826 -79691 -79554 -78290 -77023 -75760 -74493 -74571 -74646 -73293 -71936 -71612 -71284 -73822 -76356 -76002 -75644 -77258 -76006 -75775 -81264
4226 -81264 -81987 -76982 -71623 -69123 -71456 -76647 -77578 -75644 -73714 -74642 -74769 -72030 -73766 -75499 -76177 -73990 -71627 -74985
4244 -74985 -76229 -77470 -80504 -83534 -81245 -78954 -78096 -77236 -74679 -72119 -70994 -69864 -70338 -70807 -72175 -76401 -79021 -75913
4262 -75913 -77638 -79360 -80839 -82315 -80932 -79546 -78223 -76896 -74143 -71385 -72089 -72794 -72961 -78853 -79110 -76505 -80519 -81670
4280 -81670 -76829 -74851 -73945 -73039 -72790 -72540 -75152 -77765 -72995 -68225 -70133 -72041 -73174 -74307 -75439 -76572 -79032 -81491
$$ [...]
##END=	
