##TITLE=	77V2KAJrR4yso1k+npSF3Q/3337s
##JCAMPDX=	6.0	$$ NMR Plug-in 1.13 of MestReNova 11.0.4-18998
##DATATYPE=	NMRSPECTRUM
##DATACLASS=	XYDATA
##NUMDIM=	1
##ORIGIN=	Bruker BioSpin GmbH
##OWNER=	andrew
##.OBSERVEFREQUENCY=	600.30184456100005264
##.OBSERVENUCLEUS=	^1H
##.SOLVENTNAME=	CD2Cl2
##.PULSESEQUENCE=	zg
##LONGDATE=	2015/06/05 10:40:37.000
##.ACQUISITIONMODE=	SIMULTANEOUS (DQD)
##$ORIGINALFORMAT=	Bruker XWIN-NMR
##$PARAMETERFILE=	(acqus, ASCII, /var/folders/f6/rjf_tdyn2v98c5c0wvkgn4s80000gn/T/77V2KAJrR4yso1k+npSF3Q/3337s/acqus, 0)
$$ ##TITLE= Parameter file, TOPSPIN		Version 2.1
$$ ##JCAMPDX= 5.0
$$ ##DATATYPE= Parameter Values
$$ ##NPOINTS= 10	$$ modification sequence number
$$ ##ORIGIN= Bruker BioSpin GmbH
$$ ##OWNER= andrew
$$ $$ 2015-06-05 15:40:37.697 +0600  andrew@av-600
$$ $$ /opt/data/andrew/nmr/limog-1782/613/acqus
$$ $$ process /opt/ts21pl6/prog/mod/shimcntl
$$ ##$ACQT0= -9.54927425515661
$$ ##$AMP= (0..31)
$$ 100 100 100 100 100 100 100 100 100 100 100 100 100 100 100 100 100 100
$$ 100 100 100 100 100 100 100 100 100 100 100 100 100 100
$$ ##$ANAVPT= -1
$$ ##$AQSEQ= 0
$$ ##$AQ_mod= 3
$$ ##$AUNM= <au_zg>
$$ ##$AUTOPOS= <>
$$ ##$BF1= 600.3
$$ ##$BF2= 600.3
$$ ##$BF3= 600.3
$$ ##$BF4= 600.3
$$ ##$BF5= 600.3
$$ ##$BF6= 600.3
$$ ##$BF7= 600.3
$$ ##$BF8= 600.3
$$ ##$BYTORDA= 0
$$ ##$CFDGTYP= 0
$$ ##$CFRGTYP= 9
$$ ##$CHEMSTR= <none>
$$ ##$CNST= (0..63)
$$ 1 1 145 1 1 1 1 1 1 1 1 1 1 1 1 1 1 1 1 1 1 1 1 1 1 1 1 1 1 1 1 1 1 1 1
$$ 1 1 1 1 1 1 1 1 1 1 1 1 1 1 1 1 1 1 1 1 1 1 1 1 1 1 1 1 1
$$ ##$CPDPRG= <>
$$ ##$CPDPRG1= <>
$$ ##$CPDPRG2= <waltz16>
$$ ##$CPDPRG3= <>
$$ ##$CPDPRG4= <mlev>
$$ ##$CPDPRG5= <mlev>
$$ ##$CPDPRG6= <mlev>
$$ ##$CPDPRG7= <mlev>
$$ ##$CPDPRG8= <mlev>
$$ ##$CPDPRGB= <>
$$ ##$CPDPRGT= <>
$$ ##$D= (0..63)
$$ 0 1 0 0 0 0 0 0 0 0.06 0 0.03 0 0 0 0 1e-04 0 0 0 0 0 0 0 0 0 0 0 0 0 0
$$ 0 0 0 0 0 0 0 0 0 0 0 0 0 0 0 0 0 0 0 0 0 0 0 0 0 0 0 0 0 0 0 0 0
$$ ##$DATE= 1433497237
$$ ##$DBL= (0..7)
$$ 120 120 120 120 120 120 120 120
$$ ##$DBP= (0..7)
$$ 150 150 150 150 150 150 150 150
$$ ##$DBP07= 0
$$ ##$DBPNAM0= <>
$$ ##$DBPNAM1= <>
$$ ##$DBPNAM2= <>
$$ ##$DBPNAM3= <>
$$ ##$DBPNAM4= <>
$$ ##$DBPNAM5= <>
$$ ##$DBPNAM6= <>
$$ ##$DBPNAM7= <>
$$ ##$DBPOAL= (0..7)
$$ 0.5 0.5 0.5 0.5 0.5 0.5 0.5 0.5
$$ ##$DBPOFFS= (0..7)
$$ 0 0 0 0 0 0 0 0
$$ ##$DE= 6.5
$$ ##$DECBNUC= <off>
$$ ##$DECIM= 2218.66666666667
$$ ##$DECNUC= <off>
$$ ##$DECSTAT= 4
$$ ##$DIGMOD= 1
$$ ##$DIGTYP= 12
$$ ##$DL= (0..7)
$$ 0 120 120 120 120 120 120 120
$$ ##$DP= (0..7)
$$ 150 150 150 150 150 150 150 150
$$ ##$DP07= 0
$$ ##$DPNAME0= <>
$$ ##$DPNAME1= <>
$$ ##$DPNAME2= <>
$$ ##$DPNAME3= <>
$$ ##$DPNAME4= <>
$$ ##$DPNAME5= <>
$$ ##$DPNAME6= <>
$$ ##$DPNAME7= <>
$$ ##$DPOAL= (0..7)
$$ 0.5 0.5 0.5 0.5 0.5 0.5 0.5 0.5
$$ ##$DPOFFS= (0..7)
$$ 0 0 0 0 0 0 0 0
$$ ##$DQDMODE= 0
$$ ##$DR= 22
$$ ##$DS= 0
$$ ##$DSLIST= <SSSSSSSSSSSSSSS>
$$ ##$DSPFIRM= 0
$$ ##$DSPFVS= 20
$$ ##$DTYPA= 0
$$ ##$EXP= <>
$$ ##$F1LIST= <111111111111111>
$$ ##$F2LIST= <222222222222222>
$$ [...]
$$ -1 -1 -1 -1 -1 -1 -1 -1 -1 -1 -1 -1 -1 -1 -1 -1 -1 -1 -1 -1 -1 -1 -1 -1
$$ -1 -1 -1 -1 -1 -1 -1 -1 -1 -1 -1 -1 -1 -1 -1 -1 -1 -1 -1 -1 -1 -1 -1 -1
$$ -1 -1 -1 -1 -1 -1 -1 -1 -1 -1 -1 -1 -1 -1 -1 -1 -1 -1 -1 -1 -1 -1 -1 -1
$$ -1 -1 -1 -1 -1 -1 -1 -1 -1 -1 -1 -1 -1 -1 -1 -1 -1 -1 -1 -1 -1 -1 -1 -1
$$ -1 -1 -1 -1 -1 -1 -1 -1 -1 -1 -1 -1 -1 -1 -1 -1
$$ ##$RG_tab8= (0..255)
$$ -1 -1 -1 -1 -1 -1 -1 -1 -1 -1 -1 -1 -1 -1 -1 -1 -1 -1 -1 -1 -1 -1 -1 -1
$$ -1 -1 -1 -1 -1 -1 -1 -1 -1 -1 -1 -1 -1 -1 -1 -1 -1 -1 -1 -1 -1 -1 -1 -1
$$ -1 -1 -1 -1 -1 -1 -1 -1 -1 -1 -1 -1 -1 -1 -1 -1 -1 -1 -1 -1 -1 -1 -1 -1
$$ -1 -1 -1 -1 -1 -1 -1 -1 -1 -1 -1 -1 -1 -1 -1 -1 -1 -1 -1 -1 -1 -1 -1 -1
$$ -1 -1 -1 -1 -1 -1 -1 -1 -1 -1 -1 -1 -1 -1 -1 -1 -1 -1 -1 -1 -1 -1 -1 -1
$$ -1 -1 -1 -1 -1 -1 -1 -1 -1 -1 -1 -1 -1 -1 -1 -1 -1 -1 -1 -1 -1 -1 -1 -1
$$ -1 -1 -1 -1 -1 -1 -1 -1 -1 -1 -1 -1 -1 -1 -1 -1 -1 -1 -1 -1 -1 -1 -1 -1
$$ -1 -1 -1 -1 -1 -1 -1 -1 -1 -1 -1 -1 -1 -1 -1 -1 -1 -1 -1 -1 -1 -1 -1 -1
$$ -1 -1 -1 -1 -1 -1 -1 -1 -1 -1 -1 -1 -1 -1 -1 -1 -1 -1 -1 -1 -1 -1 -1 -1
$$ -1 -1 -1 -1 -1 -1 -1 -1 -1 -1 -1 -1 -1 -1 -1 -1 -1 -1 -1 -1 -1 -1 -1 -1
$$ -1 -1 -1 -1 -1 -1 -1 -1 -1 -1 -1 -1 -1 -1 -1 -1
$$ ##$RG_tabA= (0..255)
$$ 0.25 0.28 0.32 0.35 0.4 0.44 0.5 0.56 0.64 0.7 0.8 0.89 1 1.12 1.28 1.4
$$ 1.6 1.78 2 2.25 2.56 2.8 3.2 3.56 4 4.5 5 5.6 6.35 7.12 8 9 10 11.3 12.7
$$ 14.2 16 18 20.2 22.6 25.4 28.5 32 36 40.3 45.2 50.8 57 64 71.8 80.6 90.5
$$ 101 114 128 144 161 181 203 -1 -1 -1 -1 -1 -1 -1 -1 -1 -1 -1 -1 -1 -1 -1
$$ -1 -1 -1 -1 -1 -1 -1 -1 -1 -1 -1 -1 -1 -1 -1 -1 -1 -1 -1 -1 -1 -1 -1 -1
$$ -1 -1 -1 -1 -1 -1 -1 -1 -1 -1 -1 -1 -1 -1 -1 -1 -1 -1 -1 -1 -1 -1 -1 -1
$$ -1 -1 -1 -1 -1 -1 -1 -1 -1 -1 -1 -1 -1 -1 -1 -1 -1 -1 -1 -1 -1 -1 -1 -1
$$ -1 -1 -1 -1 -1 -1 -1 -1 -1 -1 -1 -1 -1 -1 -1 -1 -1 -1 -1 -1 -1 -1 -1 -1
$$ -1 -1 -1 -1 -1 -1 -1 -1 -1 -1 -1 -1 -1 -1 -1 -1 -1 -1 -1 -1 -1 -1 -1 -1
$$ -1 -1 -1 -1 -1 -1 -1 -1 -1 -1 -1 -1 -1 -1 -1 -1 -1 -1 -1 -1 -1 -1 -1 -1
$$ -1 -1 -1 -1 -1 -1 -1 -1 -1 -1 -1 -1 -1 -1 -1 -1 -1 -1 -1 -1 -1 -1 -1 -1
$$ -1 -1 -1 -1 -1 -1 -1 -1 -1 -1 -1 -1 -1 -1
$$ ##$ROUT14= (0..7)
$$ 0 0 0 0 0 0 0 0
$$ ##$ROUTER= -1
$$ ##$RX22TY= <no>
$$ ##$RXFMAX= (0..7)
$$ 647.5 -1 -1 -1 -1 -1 -1 -1
$$ ##$RXFMIN= (0..7)
$$ 5 -1 -1 -1 -1 -1 -1 -1
$$ ##$RXINTLV= (0..7)
$$ 1 0 0 0 0 0 0 0
$$ ##$RXMSTY= <no>
$$ ##$SCMTY= <no>
$$ ##$SGUC1= (0..15)
$$ 17 18 34 0 0 0 0 0 0 0 0 0 0 0 0 0
$$ ##$SGUC2= (0..15)
$$ 33 256 20 0 0 0 0 0 0 0 0 0 0 0 0 0
$$ ##$SPECTR= 10
$$ ##$SY2FLAG= 0
$$ ##$TFXNUM= 0
$$ ##$TRIPLO2= 0
$$ ##$VTUTY= <tty05>
$$ ##$WBREFAM= (0..15)
$$ 100 100 100 100 100 100 100 100 100 100 100 100 100 100 100 100
$$ ##$WBREFPH= (0..15)
$$ 0 0 0 0 0 0 0 0 0 0 0 0 0 0 0 0
$$ ##$XFAC= 2
$$ ##END=
$$ 
##$DECIM=	2218.66666666667
##$DSPFVS=	20
##XUNITS=	HZ
##YUNITS=	ARBITRARY UNITS
##FIRSTX=	6322.8525384689401108
##LASTX=	-2691.4329892738592207
##XFACTOR=	-0.1375491802509010153
##YFACTOR=	9.1085146484375000339e-06
##NPOINTS=	65536
##XYDATA=	(X++(Y..Y))
$$ [...]
-12061f5849r20J945J315j543K031q27k292N74K120p37l186J587L014L019L3L7L4L7J286J289
-12041e7033o22K243N041K76l067l063l245l242o82M092r73r69o74o71k27k24J204J207j151
-12022f1780j148K187K191J90J94J621l145l763r02k809k810r7r6r7r7J595J594J595J595
-12003f3982M92M91L13L13l42l205l145J625J982k787j356m218j706J155m55m55k45K615L868
-11984f9042r02j256J606l01l02p49p49p49p49P04P04q45L923N980J211k79n049P38P41j945
-11964f7310j941k720k716l197J576M740J881l368J405M322J464L0L3m135m136K720K720N701
-11946f2931R31j632j632K392K392R62R61j722j721k91k90J296J301k042k038o11o08k041
-11928f7324k039l308l305p45M027K385K388J252J256K578K579J386m337k012L711J744j118
$$ plain form
-12061 -65849 -66769 -64824 -63509 -65052 -63021 -63848 -66140 -65566 -63446 -64183 -67369 -65782 -62768 -59749 -59716 -59679 -59645 -59608 -58322 -57033
-12041 -57033 -57655 -55412 -50371 -50095 -53162 -56225 -59470 -62712 -63394 -59302 -60275 -61244 -61918 -62589 -62816 -63040 -61836 -60629 -61780
-12022 -61780 -62928 -60741 -58550 -58360 -58166 -56545 -59690 -63453 -64355 -67164 -69974 -70071 -70167 -70264 -70361 -68766 -67172 -65577 -63982
-12003 -63982 -63490 -62999 -62686 -62373 -62715 -65920 -69065 -67440 -65458 -68245 -69601 -73819 -75525 -74370 -74825 -75280 -75525 -72910 -69042
-11984 -69042 -69944 -71200 -69594 -69895 -70197 -70946 -71695 -72444 -73193 -72489 -71785 -72630 -68707 -62727 -61516 -61795 -66844 -66106 -65365 -67310
-11964 -67310 -69251 -71971 -74687 -77884 -76308 -71568 -69687 -73055 -71650 -67328 -65864 -65834 -65801 -69936 -74072 -71352 -68632 -62931
-11946 -62931 -62000 -63632 -65264 -62872 -60480 -59518 -58557 -60279 -62000 -62291 -62581 -61285 -59984 -62026 -64064 -64675 -65283 -67324
-11928 -67324 -69363 -72671 -75976 -76721 -72694 -70309 -67921 -66669 -65413 -62835 -60256 -58870 -63207 -65219 -61508 -59764 -60882
-11911f0882N81N81j028j028k191k191K578K579j193j192j192j193R0Q9j341j342j04j04K757
-11892f5726K757R69R69K220K221j82l041m654J073n70n66k12k09J45J49L25L27P42L607l015
-11872f2671q733m416J312R50R54k389L339J904r54K649N515R20j937l879J848R50R54K407
-11854f1277l316J334J334o64o63o63o63j573j572J289J289J200J200k31k31L05L06L05L06
-11835f1985K16K16K16K16o7o7o7o7j289j289J41J42l141l141J628J632j472j468J390J394
-11815f6862J956J956N25N29Q24Q27o07o04k388k389M73M77J577J579K471N335L276k448l820
-11796e7313l815j435j430J427J430o22o18l484l480k709k705K060K065J37J42J38J41O15
-11778f9456O19O15O18j852j848J010J013J010J014m21m18j449j446j9j4j718j714K50k609
$$ plain form
-11911 -60882 -60301 -59720 -60748 -61776 -63967 -66158 -63580 -61001 -62194 -63386 -64578 -65771 -65681 -65592 -66933 -68275 -68379 -68483 -65726
-11892 -65726 -62969 -62000 -61031 -58811 -56590 -56772 -59813 -64467 -63394 -63964 -64530 -64742 -64951 -64806 -64657 -64332 -64005 -63263 -59656 -62671
-11872 -62671 -71404 -75820 -74508 -73558 -72604 -74993 -71654 -69750 -70704 -68055 -62540 -61620 -63557 -67436 -65588 -64638 -63684 -61277
-11854 -61277 -64593 -63259 -61925 -62589 -63252 -63915 -64578 -66151 -67723 -66434 -65145 -63945 -62745 -62976 -63207 -62902 -62596 -62291 -61985
-11835 -61985 -61769 -61553 -61337 -61121 -61188 -61255 -61322 -61389 -62678 -63967 -63826 -63684 -66825 -69966 -68338 -66706 -68178 -69646 -68256 -66862
-11815 -66862 -64906 -62950 -62425 -61896 -61072 -60245 -60852 -61456 -63844 -66233 -65760 -65283 -63706 -62127 -59656 -54321 -51045 -53493 -57313
-11796 -57313 -61128 -62563 -63993 -62566 -61136 -61758 -62376 -65860 -69340 -72049 -74754 -72694 -70629 -70492 -70350 -70212 -70071 -69456
-11778 -69456 -68837 -68222 -67604 -69456 -71304 -70294 -69281 -68271 -67257 -67678 -68096 -69545 -70991 -71010 -71024 -72742 -74456 -74206 -76815
-11759g6815j669M054K087K086k235k236K534K537J125J126J125J125K854K854pmk504k504
-11741f4467J79J79L58k504m114J614J468J468J826J825J57J56J57J60l02k98l02k98j017
-11722f3755j013j018j013J695J699J696J699J337J342o30K236O3n656k798K928L044J87k620
-11704f0577k615j509j506L261L264j867j863R95R98J617J621j244j241J259J263J260J263
-11687e5621o86o81o86o82P75P79K921k798o551q23J975q83K153K158N44N47j922j919M754
-11668e6646M758k190k188k191k187k232k231k232k232Q08Q09L670L670m43m44m43m43n63
-11650f2950n63n62n63K321K322k448k448J963J964J606J606M512j211k761k761J174J173
-11633e7626j688j687J41J45J42J45j885j882j885j882l025l022j64j60J446J449J088O815
$$ plain form
-11759 -76815 -78484 -74430 -72343 -70257 -72492 -74728 -72194 -69657 -68532 -67406 -66281 -65156 -62302 -59448 -59455 -59459 -61963 -64467
-11741 -64467 -64288 -64109 -63751 -66255 -70369 -68755 -67287 -65819 -63993 -62168 -62011 -61855 -61698 -61538 -61840 -62138 -62440 -62738 -63755
-11722 -63755 -64768 -65786 -66799 -65104 -63405 -61709 -60010 -58673 -57331 -57961 -55725 -55662 -61318 -64116 -61188 -58144 -57957 -60577
-11704 -60577 -63192 -64701 -66207 -62946 -59682 -61549 -63412 -62417 -61419 -59802 -58181 -59425 -60666 -59407 -58144 -56884 -55621
-11687 -55621 -56307 -56988 -57674 -58356 -57581 -56802 -53881 -56679 -63230 -64053 -62078 -62961 -60808 -58650 -58106 -57559 -59481 -61400 -56646
-11668 -56646 -51888 -54078 -56266 -58457 -60644 -62876 -65107 -67339 -69571 -68763 -67954 -64284 -60614 -61057 -61501 -61944 -62387 -62950
-11650 -62950 -63513 -64075 -64638 -62317 -59995 -62443 -64891 -62928 -60964 -59358 -57752 -53240 -54451 -57212 -59973 -58799 -57626
-11633 -57626 -59314 -61001 -60860 -60715 -60573 -60428 -62313 -64195 -66080 -67962 -70987 -74009 -74173 -74333 -72887 -71438 -70350 -63535
-11615f3535m55m51k958k955J334J338J334J337O79O81O79O81l95l91K467K470j963j960Q98
-11596f1165R01n32n30l394l391j106j103J755J758l3l0l3l0r13r09r13r09J889J893N108
-11576f1687o11k478k474K6L0K172K176k239k236j628M099Q75Q80q54q49K008K012P42P45
-11557e9291k120k117l31l28l32l28Q6Q9Q6R0O81O86O82O85j397j393j398j393J762J766j099
-11536f4914j095N74N73N74N74J707J706J707J706j721j722j721j722L346L346M85M84k966
-11518e9079k966k966k966O71O71L532L532J237J237j624j625j93j94j94j94L92L91L91L91
-11499e9556q60q61q61q61m005m006j918K850Q83Q83j680j681J111J114J110J114k884k880
-11481g2988k2j9K884K888K01K05o93K172L242j524j759j755K414K419K712k053k235k232
$$ plain form
-11615 -63535 -63990 -64441 -67399 -70354 -69020 -67682 -66348 -65011 -64332 -63651 -62972 -62291 -62686 -63077 -60610 -58140 -60103 -62063 -61165
-11596 -61165 -60264 -60796 -61326 -64720 -68111 -69217 -70320 -68565 -66807 -66840 -66870 -66903 -66933 -67846 -68755 -69668 -70577 -68688 -66795 -61687
-11576 -61687 -62298 -64776 -67250 -67224 -67194 -65022 -62846 -65085 -67321 -68949 -64850 -63975 -63095 -63949 -64798 -62790 -60778 -60036 -59291
-11557 -59291 -61411 -63528 -63859 -64187 -64519 -64847 -64761 -64672 -64586 -64496 -63815 -63129 -62447 -61762 -63159 -64552 -65950 -67343 -65581 -63815 -64914
-11536 -64914 -66009 -65435 -64862 -64288 -63714 -62007 -60301 -58594 -56888 -58609 -60331 -62052 -63774 -60428 -57082 -56597 -56113 -59079
-11518 -59079 -62045 -65011 -67977 -67306 -66635 -63103 -59571 -58334 -57097 -58721 -60346 -60539 -60733 -60927 -61121 -60729 -60338 -59947 -59556
-11499 -59556 -60416 -61277 -62138 -62999 -67004 -71010 -72928 -70078 -69195 -68312 -69992 -71673 -70562 -69448 -68338 -67224 -70108 -72988
-11481 -72988 -73010 -73029 -70145 -67257 -67056 -66851 -67544 -65372 -62130 -63654 -65413 -67168 -64754 -62335 -59623 -61676 -63911 -66143
-11463f6143m62m59m62m58m5m1m4m1L24L24L24L24O23O22k240k239p94p93p94p93K485K485
-11441f8297K485K486j167j166j166j166O22O22O22O23K172K172K172K173l194l193J576J576
-11423f0048l036l037J733J732L104L104j368j367k411K359J464j397N041P903P724M862J5
-11406c3623J5l025l026m396m397m397m397j132j133j133j132Q94Q94Q94Q95q05q05q05q05
-11387f1419k712k713K057K057k713k712J49J49K235K236o26o26M84M88M85M88r46r43J915
-11368f2667J919O7P1O7P1k258k255O04O07k049k045Q12Q16j096j091J766J770J974J979q87
-11348f1825q83J27J30J27J30J211J215j651j647q16q12q16q12K709K712j53j49j82j79P71
-11328f0793m948n272M270J583j274j576j572J106J111j405j401K6L0r28r24L841L846O74
$$ plain form
-11463 -66143 -66605 -67064 -67526 -67984 -68029 -68070 -68114 -68155 -67831 -67507 -67183 -66859 -66236 -65614 -67854 -70093 -70887 -71680 -72474 -73267 -70782 -68297
-11441 -68297 -65812 -63326 -64493 -65659 -66825 -67991 -67369 -66747 -66125 -65502 -63330 -61158 -58986 -56813 -60007 -63200 -61624 -60048
-11423 -60048 -63084 -66121 -64388 -62656 -59552 -56448 -57816 -59183 -61594 -59235 -57771 -59168 -54127 -46224 -38500 -33638 -33623
-11406 -33623 -33608 -36633 -39659 -44055 -48452 -52849 -57246 -58378 -59511 -60644 -61776 -60882 -59988 -59094 -58199 -59004 -59809 -60614 -61419
-11387 -61419 -64131 -66844 -64787 -62730 -65443 -68155 -68006 -67857 -65622 -63386 -64012 -64638 -64154 -63666 -63181 -62693 -63639 -64582 -62667
-11368 -62667 -60748 -60681 -60610 -60543 -60472 -62730 -64985 -64381 -63774 -65823 -67868 -67056 -66240 -67336 -68427 -66661 -64891 -62917 -60938 -61825
-11348 -61825 -62708 -62581 -62451 -62324 -62194 -60983 -59768 -61419 -63066 -63882 -64694 -65510 -66322 -63613 -60901 -61054 -61203 -61385 -61564 -60793
-11328 -60793 -65741 -71013 -66743 -65160 -66434 -68010 -69582 -68476 -67365 -68770 -70171 -70145 -70115 -71043 -71967 -68126 -64280 -63606
-11310f3606O75K105K105l439l439k009k008o37o37K224K225K135K135k635k634m8m9k910
-11292g0447k910K098K098K097K098J01J00K80K79L39L201M810r13k172k168k530k527J226
-11274f4940J230J226J229k999k996J770J774o15o11o15o11j412j409L357L361j60j57l021
-11256f5599l018M13M17k447k445o89o86K173K176P34P37o96o93K343K348n18n14n41n36Q90
-11236f6151Q94J517J520j345j341j357j352j356j353J207J211j654j651j714j710L055L059
-11219f8521m32m28R98J003n26n21J978J982J830l890o75o70K314K317k455k452J569J572
-11201f5007k20k16L696k023o796j069L189L193j222j218Q34Q39k027k024n96n92K265K269
-11183f6725j423j423J438J438J856J855k913k914L80L80L80L80J871J870J870J871o63o60
$$ plain form
-11310 -63606 -62931 -60826 -58721 -62160 -65599 -67608 -69616 -70253 -70890 -68666 -66441 -64306 -62171 -64806 -67440 -67488 -67537 -70447
-11292 -70447 -73357 -71259 -69161 -67064 -64966 -64865 -64765 -64485 -64206 -63867 -60666 -55856 -56769 -58941 -61109 -63639 -66166 -64940
-11274 -64940 -63710 -62484 -61255 -64254 -67250 -65480 -63706 -64321 -64932 -65547 -66158 -67570 -68979 -65622 -62261 -62421 -62578 -65599
-11256 -65599 -68617 -68204 -67787 -70234 -72679 -73368 -74054 -71881 -69705 -68971 -68234 -68930 -69623 -67280 -64932 -65450 -65964 -66505 -67041 -66151
-11236 -66151 -65257 -63740 -62220 -63565 -64906 -66263 -67615 -68971 -70324 -69117 -67906 -69560 -71211 -72925 -74635 -71580 -68521
-11219 -68521 -68953 -69381 -68383 -67380 -67906 -68427 -66449 -64467 -62637 -66527 -67202 -67872 -65558 -63241 -65696 -68148 -66579 -65007
-11201 -65007 -65227 -65443 -61747 -63770 -70566 -71635 -68446 -65253 -66475 -67693 -66859 -66020 -68047 -70071 -70667 -71259 -68994 -66725
-11183 -66725 -68148 -69571 -68133 -66695 -64839 -62984 -65897 -68811 -68431 -68051 -67671 -67291 -65420 -63550 -61680 -59809 -60472 -61132
-11165f1132o63o60l95l91J751l968m531J196M77M81n36n33Q94Q98J006J006j856j855n105
-11146g3916n104J572J572J923J923J743J744J028j833J148O871N406K545J054m668o75o74
-11129e8341j032j032k478k478k478k477K231K232K65L126J777l946k157P04N85N85P64P64
-11111f3386k061k060Q01Q01m21m21J010J010Q5R0Q5R0K35K38K35K38L499L502j449j446L99
-11090e8926k459m073J655Q19Q24j327j322k489L238j416j413M40M44M39M44j319j316j498
-11072f9255j494J819j040k653L074K295K299K653K657j997j994j997j993j550j547J312J315
-11055f8096J081J080k317N44L405k317j960R02L65L65N44N44J349J348j512j513O48O49O48
-11036f4243O48J811J811L80L80K01K01k660k660J662J661j199j200j435j431m653J073J248
$$ plain form
-11165 -61132 -61795 -62455 -62850 -63241 -61490 -65458 -69989 -68793 -68316 -67835 -68371 -68904 -68010 -67112 -66106 -65100 -66956 -68811 -73916
-11146 -73916 -79020 -77448 -75876 -73953 -72030 -70287 -68543 -67515 -69348 -68200 -61329 -55923 -53378 -52324 -56992 -57667 -58341
-11129 -58341 -59373 -60405 -62883 -65361 -67839 -70316 -68085 -65853 -65588 -62462 -60685 -64631 -66788 -66084 -65499 -64914 -64150 -63386
-11111 -63386 -65447 -67507 -66706 -65905 -66326 -66747 -65737 -64727 -64642 -64552 -64467 -64377 -64142 -63904 -63669 -63431 -59932 -56430 -57879 -59325 -58926
-11090 -58926 -61385 -65458 -63803 -62984 -62160 -63487 -64809 -67298 -64060 -65476 -66889 -66449 -66005 -65566 -65122 -66441 -67757 -69255
-11072 -69255 -70749 -68930 -69970 -72623 -69549 -67254 -64955 -62302 -59645 -61642 -63636 -65633 -67626 -69176 -70723 -69411 -68096
-11055 -68096 -67015 -65935 -68252 -67708 -64303 -66620 -68580 -67678 -67313 -66948 -66404 -65860 -64511 -63163 -64675 -66188 -65540 -64891 -64243
-11036 -64243 -63595 -61784 -59973 -59593 -59213 -59012 -58811 -61471 -64131 -62469 -60808 -62007 -63207 -64642 -66073 -70726 -69653 -68405
-11018f8405J252J606J609q83q79q83q79O96P01O97P00n44n40j975j971l763l760J006J010
-10999g5205K362K366L793L797q57q53K005K008k888k884j457j453L92L94j039j036r95r91
-10981g2541r95r91J9K2j412j408r66r61L804L808K106K109p57p52j636j632J226J229K061
-10962f7667K064q01p98K188K191o75o71l118l115l477K251J144J147J502J505J144J148J144
-10944f2894J147j758j755J103J106j937j934n07n03p45p41O85O89O0O3j371j367M80M81M81
-10924f9217M80l066l067k05k05L432L432N70N70j189j188k620k619j79j79K683K683k117
-10906g2001k116P45P45r68r69J893J893J475J476M4M5j427j423J911J915J852J856M21M24
-10887f2209o07o04k038k034r06r01J121J126J561m159j121J744p9p4K664K668k016Q50K455
$$ plain form
-11018 -68405 -67153 -65547 -63938 -64821 -65700 -66583 -67462 -66766 -66065 -65368 -64668 -65212 -65752 -67727 -69698 -73461 -77221 -76215 -75205
-10999 -75205 -72843 -70477 -66684 -62887 -63744 -64597 -62592 -60584 -63472 -66356 -67813 -69266 -68874 -68480 -69519 -70555 -71550 -72541
-10981 -72541 -73536 -74527 -74508 -74486 -75898 -77306 -78272 -79233 -75429 -71621 -69515 -67406 -68163 -68915 -70551 -72183 -70957 -69728 -67667
-10962 -67667 -65603 -66404 -67202 -65014 -62823 -63498 -64169 -67287 -70402 -73879 -71628 -70484 -69337 -67835 -66330 -65186 -64038 -62894
-10944 -62894 -61747 -63505 -65260 -64157 -63051 -64988 -66922 -67429 -67932 -68677 -69418 -68733 -68044 -67984 -67921 -69292 -70659 -70179 -69698 -69217
-10924 -69217 -68737 -71803 -74870 -75075 -75280 -71848 -68416 -67846 -67276 -68465 -69653 -72273 -74892 -75071 -75250 -72567 -69884 -72001
-10906 -72001 -74117 -73372 -72627 -73595 -74564 -72671 -70778 -69303 -67827 -67783 -67738 -69165 -70588 -68677 -66762 -64910 -63054 -62633 -62209
-10887 -62209 -62816 -63420 -65458 -67492 -68398 -69299 -68178 -67052 -65491 -69650 -70771 -69027 -69106 -69180 -66516 -63848 -65864 -65014 -62559
-10868f2559l264l685l681j301j296j688M039Q16Q20j450j446j449j446L320L324J114J118
-10851f8714j658J207K813k906J1J5l47l43N18N22L39L43p94l651k880K846J919J923j08j05
-10831f9050J368J371j017j014n40n36n41n36o90o85o90o85J546J550J547J550K094K097L525
-10812e9336L529n865n861o19o14M62M65j922j919p90p86j983L745J945l778l80K481K005
-10794f9221K005j155j156k235k236K057K057J967J967m17m17K46K46K46K45J290J289n59
-10776f3781o282m084j222J103J103j79j79K206K206p34p31p34p30k284k280J00J05J419J424
-10757g3554J419J424j651j647m870Q57J390J393J390J394K343l375j949L778R88R91j040
-10740g0719j036j755j751K538K541K060K061O29O30K687K686L02L02j390j390j390j390J90
$$ plain form
-10868 -62559 -65823 -69508 -73189 -74490 -75786 -77474 -73435 -72619 -71799 -73249 -74695 -76144 -77590 -74270 -70946 -69832 -68714
-10851 -68714 -70372 -69165 -66352 -69258 -69247 -69232 -69579 -69922 -69404 -68882 -68543 -68200 -68994 -72645 -75525 -72679 -70760 -68837 -68945 -69050
-10831 -69050 -67682 -66311 -67328 -68342 -68882 -69418 -69959 -70495 -71185 -71870 -72560 -73245 -71699 -70149 -68602 -67052 -64958 -62861 -59336
-10812 -59336 -55807 -61672 -67533 -68152 -68766 -68304 -67839 -69761 -71680 -72470 -73256 -75239 -71494 -69549 -73327 -73707 -71226 -69221
-10794 -69221 -67216 -68371 -69527 -71762 -73998 -71941 -69884 -67917 -65950 -66367 -66784 -66538 -66292 -66046 -65801 -64511 -63222 -63781
-10776 -63781 -70063 -74147 -75369 -74266 -73163 -73342 -73521 -71315 -69109 -69843 -70574 -71308 -72038 -74322 -76602 -76502 -76397 -74978 -73554
-10757 -73554 -72135 -70711 -72362 -74009 -78879 -78022 -76632 -75239 -73849 -72455 -70112 -73487 -75436 -71658 -70670 -69679 -70719
-10740 -70719 -71755 -73510 -75261 -72723 -70182 -68122 -66061 -65432 -64802 -62115 -59429 -59127 -58825 -60215 -61605 -62995 -64385 -64195
-10722f4195J90j240j241j468j468J870J871j87j86j86j86j223j222n07N217J79n545j848
-10704g1375L875J767J766m077m076K035K034J677J676L808j915j677j676l227K496p22p23
-10687f8334M28M29K813K813j747j748J591J591j196j196l581l580J397J397l3l4m5m1L175
-10668f5901k545k280k277l473K255L472L477M92M95L73L76L73L76j017j014j017j013L006
-10650f5842L011l32l27K57K61K57K60o67o63o67o63j185j185j185j184J319J319J319J319
-10631f4578m48m47m47m47Q65Q64Q64Q65r39r39r39r39K519K519k251k250j968j967Q94Q94
-10611f8275J968J967J789J788M47k411l666J107L010J53J103j755l964Q08Q05Q08l428l424
-10593g1170l428l424J617J621J617J621k914k910n2m8J900J904r61r58k46k42M225M229L700
$$ plain form
-10722 -64195 -64005 -65245 -66486 -67954 -69422 -67552 -65681 -65868 -66054 -66240 -66426 -67649 -68871 -69378 -64161 -63982 -69527 -71375
-10704 -71375 -67500 -65733 -63967 -68044 -72120 -70085 -68051 -66374 -64698 -60890 -62805 -64482 -66158 -69385 -66889 -67611 -68334
-10687 -68334 -67906 -67477 -64664 -61851 -63598 -65346 -63755 -62164 -63360 -64556 -68137 -71717 -70320 -68923 -68956 -68990 -69035 -69076 -65901
-10668 -65901 -68446 -70726 -73003 -76476 -74221 -70749 -67272 -66780 -66285 -65912 -65536 -65163 -64787 -65804 -66818 -67835 -68848 -65842
-10650 -65842 -62831 -63163 -63490 -63233 -62972 -62715 -62455 -63122 -63785 -64452 -65115 -66300 -67485 -68670 -69854 -68535 -67216 -65897 -64578
-10631 -64578 -65026 -65473 -65920 -66367 -65502 -64638 -63774 -62909 -63848 -64787 -65726 -66665 -64146 -61627 -63878 -66128 -68096 -70063 -69169 -68275
-10611 -68275 -66307 -64340 -62551 -60763 -60316 -62727 -66393 -65286 -62276 -62123 -61020 -62775 -66739 -65931 -65126 -64318 -67746 -71170
-10593 -71170 -74598 -78022 -76405 -74784 -73167 -71546 -74460 -77370 -77422 -77470 -75570 -73666 -74627 -75585 -75831 -76073 -71848 -67619 -63919
-10574f3919j069j248j249k142k143K627N489N70m199j338j338k05k05R4R3j047L722L901
-10556f3606L901N03N03k358k359J75J75J75J76j077j077j077j077J901J904J900J904J12
-10538e9302J15J12J15j810j808j810j807P52P57L614L618m62m59m62m58l443l439j535m393
-10519g2105k236K538l28l24q05q01K057K060R24R28R24R28o86o82o85o82k83k80k83k79P4
-10498g0026P8p60l618k235M445K116p41J162J167R83R88K399K403k369k366q20q16q20q16
-10479f9646o74o71K187K191J591J595j271j266r73r69r72r69k224k221l17M456K307n52J353
-10460f7045J356R95R99j569j565k627K146K322K325o4n9k925k921j655j654j654j655L175
-10442g2075L174J35J34J5k847j058L711J565J565J863J863j077j077j077j077lmmlN47N48
$$ plain form
-10574 -63919 -64988 -66236 -67485 -69627 -71770 -69143 -63654 -63084 -67283 -68621 -69959 -70164 -70369 -70275 -70182 -71229 -67507 -63606
-10556 -63606 -59705 -59202 -58699 -61057 -63416 -63241 -63066 -62891 -62715 -63792 -64869 -65946 -67023 -65122 -63218 -61318 -59414 -59302
-10538 -59302 -59187 -59075 -58960 -60770 -62578 -64388 -66195 -65443 -64686 -61072 -57454 -57916 -58375 -58837 -59295 -62738 -66177 -67712 -72105
-10519 -72105 -74341 -71803 -72131 -72455 -73260 -74061 -72004 -69944 -69020 -68092 -67168 -66240 -66926 -67608 -68293 -68975 -69258 -69538 -69821 -70100 -70026
-10498 -70026 -69948 -70708 -74326 -76561 -72116 -70000 -70741 -69579 -68412 -67429 -66441 -64042 -61639 -64008 -66374 -67194 -68010 -68830 -69646
-10479 -69646 -70320 -70991 -68804 -66613 -65022 -63427 -64698 -65964 -66937 -67906 -68878 -69847 -72071 -74292 -74609 -70153 -67846 -68398 -67045
-10460 -67045 -65689 -64694 -63695 -65264 -66829 -69456 -67310 -64988 -62663 -62727 -62786 -65711 -68632 -70287 -71941 -73595 -75250 -72075
-10442 -72075 -68901 -68766 -68632 -68617 -71464 -72522 -68811 -67246 -65681 -63818 -61955 -63032 -64109 -65186 -66263 -66266 -66270 -66274 -66277 -65730 -65182
-10421f5182N48N47L231L230P1P1J118l652r69r68k042k042k042k042K24K23K24K24J356J356
-10401f6516J356J357M456M456k220k221k579k578k578k579l472l473J297J296K787K787p4
-10384f8498p5J450J453J453l316m244j379l05K556K969J12j319J543J568j289N00M99k865
-10366f9187k866mlJ188J189Q90Q91J442l327l208l209M1M811L558j211l048j82K559l01q72
-10346g0849J993M676J815m25m21o00o00R47R50R50R50m553m550K17K19o78o74l80l77j602
-10326g2992L171K094p64J915J919J737J740j297j297J565J565J34J35j64j64J766l003m792
-10308f6732j930J677J676k913k914K191K191P60P60l43l43K519K519O7O7O7O7j304j304j304
-10288f4526j304M8N2M9N2J867J870M36M40m319m315j456j454P20P22p11p08m14m10q90J975
$$ plain form
-10421 -65182 -64634 -64087 -60856 -57626 -57555 -57484 -56366 -60018 -60987 -61955 -63997 -66039 -68081 -70123 -69899 -69676 -69452 -69228 -67872 -66516
-10401 -66516 -65160 -63803 -59347 -54891 -57111 -59332 -61911 -64489 -67067 -69646 -73118 -76591 -75294 -73998 -71211 -68424 -68498
-10384 -68498 -68573 -67123 -65670 -64217 -67533 -71777 -73156 -73461 -70905 -67936 -67824 -69143 -67600 -66032 -67321 -66821 -66322 -69187
-10366 -69187 -72053 -72057 -72060 -70872 -69683 -68793 -67902 -66460 -69787 -72995 -76204 -76163 -71352 -67794 -69005 -72053 -72235 -69676 -69977 -70849
-10346 -70849 -68856 -64180 -62365 -62790 -63211 -63811 -64411 -63464 -62514 -61564 -60614 -65167 -69717 -69500 -69281 -69959 -70633 -71013 -71390 -72992
-10326 -72992 -69821 -67727 -68491 -66576 -64657 -62920 -61180 -62477 -63774 -62209 -60644 -60510 -60375 -60539 -60703 -58937 -61940 -66732
-10308 -66732 -68662 -66985 -65309 -68222 -71136 -68945 -66754 -65994 -65234 -65577 -65920 -63401 -60882 -60815 -60748 -60681 -60614 -61918 -63222 -64526
-10288 -64526 -65830 -65782 -65730 -65681 -65629 -63762 -61892 -61456 -61016 -65335 -69650 -71106 -72560 -71840 -71118 -71829 -72537 -72951 -73361 -74251 -72276
-10267g2276L044j722l334m70K724K727j866j863K336K340n26n21l257l256j826j826J662
-10250g7910J662J662J661j49j49l010l011K474K474l87l88J986J986J986J986J360J360p1
-10232f4478p1Q91Q90J428m297k060Q01K053q08k847J8K877k843J088J092P30P34j04j01K579
-10212f2428K582j655m512l622K106K865k858q90J971LML402k321k240k239k955K769J904
-10194f8114J904Q31Q30k492k493L69L69k57k57k58k57n6n5n6n6n6n6n6n6j30j27j30j27P04
-10170g0082P08P04P08O38O40O38O40K456K459J025J028k288k287N73N74K46K46K46K46k020
-10150f2902k019m881m881j096j095L35L35l54l54l53l54J196J196k35k35R13R13j949j949
-10131g7769K314K314K314K314Q64Q65Q64Q65j938j937j938j937k042k042Q20Q19p90p90K072
$$ plain form
-10267 -72276 -69232 -70954 -74288 -74758 -72034 -69307 -71173 -73036 -70700 -68360 -68886 -69407 -72664 -75920 -77746 -79572 -77910
-10250 -77910 -76248 -74586 -72925 -73074 -73223 -76233 -79244 -76770 -74296 -74683 -75071 -73085 -71099 -69113 -67127 -65767 -64407 -64478
-10232 -64478 -64549 -63658 -62768 -61340 -65637 -67697 -66896 -64843 -65651 -68498 -68480 -65603 -68446 -67358 -66266 -65536 -64802 -64906 -65007 -62428
-10212 -62428 -59846 -61501 -66013 -69635 -67529 -64664 -67522 -68412 -66441 -66438 -66434 -63032 -65353 -67593 -69832 -72787 -70018 -68114
-10194 -68114 -66210 -65379 -64549 -67041 -69534 -69165 -68796 -69053 -69310 -69568 -69825 -69881 -69936 -69992 -70048 -70104 -70160 -70216 -70272 -70402 -70529 -70659 -70786 -70082
-10170 -70082 -69374 -68670 -67962 -67324 -66684 -66046 -65406 -62950 -60491 -59466 -58438 -60726 -63013 -62440 -61866 -61620 -61374 -61128 -60882 -62902
-10150 -62902 -64921 -69802 -74683 -75779 -76874 -76539 -76204 -76558 -76912 -77265 -77619 -76423 -75227 -75462 -75697 -74784 -73871 -75820 -77769
-10131 -77769 -75455 -73141 -70827 -68513 -67649 -66784 -65920 -65055 -66993 -68930 -70868 -72805 -74847 -76889 -76069 -75250 -76040 -76830 -74758
-10112g4758K072M095M095J233J233K80K79r72l834J233J233Q76Q75J174j688J01J00k470
-10094f4843L95J643J647j159j155k232n089r65J900K969K974K791K794J539j319K6L0j53
-10076e8207j49l32l27J456j401k388M77J546J550J16J19J16J19r24r24r24r24r24r25p45
-10056f3595p45J028L890K281K280j475j476j297j296l32K530K351n10j286m147o29M139j226
-10038e9515j226p49p48l074k13Q61Q61N70k288o82o78k888k884J584j274k568k563J15J20
-10019g7239M467M471L216L58j118j114m5K821p61p56m02l99R17L781J096j762j290J576J394
-10000f0789j464N44N44L226L227k317k318k318k317K61K60K61K61l256l257J513J513J464
-9982f4962J464J643J643o22K240L491j278m065j204k49k50l69l69l69l69K773K776K772K776
$$ plain form
-10112 -74758 -72686 -68591 -64496 -63263 -62030 -61750 -61471 -62443 -66277 -65044 -63811 -62935 -62060 -60886 -62574 -62473 -62373 -64843
-10094 -64843 -64448 -62805 -61158 -62317 -63472 -65704 -70793 -71758 -69858 -66889 -63915 -61124 -58330 -56791 -58110 -58084 -58054 -58207
-10076 -58207 -58356 -58688 -59015 -57559 -58960 -61348 -60871 -59325 -57775 -57659 -57540 -57424 -57305 -58229 -59153 -60077 -61001 -61925 -62850 -63595
-10056 -63595 -64340 -63312 -59422 -57141 -54861 -56336 -57812 -59109 -60405 -60737 -58207 -55856 -56366 -57652 -61799 -62428 -58289 -59515
-10038 -59515 -60741 -61490 -62238 -65312 -65525 -64664 -63803 -63233 -65521 -66203 -66881 -69769 -72653 -71069 -72343 -74911 -77474 -77359 -77239
-10019 -77239 -72772 -68301 -65085 -64727 -65845 -66959 -67004 -64183 -64944 -65700 -66102 -66501 -65584 -61803 -60707 -62469 -63759 -62183 -60789
-10000 -60789 -62253 -61709 -61165 -57939 -54712 -57029 -59347 -61665 -63982 -63721 -63461 -63200 -62939 -66195 -69452 -67939 -66426 -64962
-9982 -64962 -63498 -61855 -60212 -60834 -58594 -55103 -56381 -60446 -61650 -61899 -62149 -62518 -62887 -63256 -63625 -60852 -58076 -55304 -52528
-9963e2528O85O89k176k172j013j010j014j009m948m945j79j75Q98R02Q98R02j16j12j15j12
-9943f6650q91q86q91q87K508K511l54l50p94p90p93p90J01J04J00J05J173J178J174J177
-9923f3945L141L145K79K83r39r35o41o37k131K642K817K820j043j040j043j040k951k947
-9905f4165k235M445M475k95n6n5j129j129j129j129j472j472L298L297l499l498o38o37J34
-9886f6889J35J34J34K817K817m5m5l577l577J193J192q65q64J699J699L905q64j401J460
-9867f0942J968q95j967j967j193j192j192j193k08k09k09k08p79p79O52O52j583j584m147
-9848g6975m147j896K872J442M304L797L796J115J114K83K83j148j147K131K131J178j684
-9831f2551l712J059l235l234K907K906M5M4J453J454K2K2J275J274K2M792J930J930m449
$$ plain form
-9963 -52528 -51843 -51154 -53330 -55502 -56515 -57525 -58539 -59548 -64496 -69441 -69620 -69795 -68897 -67995 -67097 -66195 -66311 -66423 -66538 -66650
-9943 -66650 -67541 -68427 -69318 -70205 -67697 -65186 -65540 -65890 -66684 -67474 -68267 -69057 -68956 -68852 -68752 -68647 -67474 -66296 -65122 -63945
-9923 -63945 -60804 -57659 -57380 -57097 -58036 -58971 -59612 -60249 -62380 -59738 -56921 -54101 -55144 -56184 -57227 -58267 -61218 -64165
-9905 -64165 -66400 -61955 -57480 -57775 -57831 -57886 -59015 -60144 -61273 -62402 -63874 -65346 -62048 -58751 -62250 -65748 -66386 -67023 -66889
-9886 -66889 -66754 -66620 -66486 -63669 -60852 -60897 -60942 -64519 -68096 -66903 -65711 -66576 -67440 -65741 -64042 -60137 -61001 -62402 -60942
-9867 -60942 -58974 -59869 -61836 -63803 -64996 -66188 -67380 -68573 -68781 -68990 -69199 -69407 -70186 -70965 -70313 -69661 -71244 -72828 -76975
-9848 -76975 -81122 -83018 -80146 -78704 -74400 -70603 -66807 -65692 -64578 -64295 -64012 -65160 -66307 -64176 -62045 -60867 -62551
-9831 -62551 -66263 -65204 -68439 -71673 -68766 -65860 -65815 -65771 -64318 -62864 -62842 -62820 -61545 -60271 -60249 -55457 -53527 -51597 -56046
-9812e6046m449J12J12K675K675M136o33k601K61N29k332l585p23J148J148j536j535j177
-9794f1821j178J685J684j588j587j56j57j080j081j080j081K698K697k071k072K340K340
-9777f1508K340K340j353j352l99K463L297j471l380l379l62l61l62l61j852j852l044L633
-9759f6963K817j953j535L234j535j535j237j237Q65Q64j997j997j222j223L548L547K824
-9742f4735K824l7l7R76R76K407K407k9l0j461j460j252j252J430J431M62k399k758K966K161
-9722e7410p00l562K161j073l935n36n37J789J788j073j073Q42Q46Q42Q46K690K694K332K336
-9703e0733r61o681l465l461J930J934M99N03K034K038q27q23L7M1j393j390j684j681k53
-9684f4336k50P90P94K220K225r32r27m330J397k16l074j110j107J148J151k83k80m91m88
$$ plain form
-9812 -56046 -60495 -60383 -60271 -57596 -54921 -50785 -51418 -54019 -53758 -53229 -55561 -59146 -59869 -58721 -57573 -59109 -60644 -61821
-9794 -61821 -62999 -61314 -59630 -61218 -62805 -62961 -63118 -64198 -65279 -66359 -67440 -64742 -62045 -64116 -66188 -63848 -61508
-9777 -61508 -59168 -56828 -58181 -59533 -59932 -57469 -54172 -55643 -59023 -62402 -62764 -63125 -63487 -63848 -65700 -67552 -70596 -66963
-9759 -66963 -64146 -66099 -67634 -64400 -65935 -67470 -68707 -69944 -69079 -68215 -70212 -72209 -73431 -74654 -71106 -67559 -64735
-9742 -64735 -61911 -61948 -61985 -61009 -60033 -57626 -55219 -55248 -55278 -56739 -58199 -59451 -60703 -59273 -57842 -57380 -59779 -62537 -59571 -57410
-9722 -57410 -58110 -61672 -59511 -60584 -64519 -65055 -65592 -63803 -62015 -63088 -64161 -63319 -62473 -61631 -60785 -58095 -55401 -53069 -50733
-9703 -50733 -51694 -58375 -61840 -65301 -63371 -61437 -60938 -60435 -58401 -56363 -57190 -58013 -57976 -57935 -59328 -60718 -62402 -64083 -64336
-9684 -64336 -64586 -63796 -63002 -60782 -58557 -59489 -60416 -64746 -63349 -63565 -66639 -67749 -68856 -67708 -66557 -66840 -67120 -67611 -68099
-9665f8099K369K374L20L24L21L24J42J45J41J46K38K42K39K42k534k530L28L32J051J054
-9645f2831l80l76L703L708j066j062m814m810J505J509K161l558l026O517K400m58J34K999
-9627e7745L13L17k370k366l093l088J676J681J676J681l093l089J778J781j085j080K016
-9610f4090K019q46q42k448k444M14M17R20R24j941j937J602J606L033L036r61r58M70M73
-9591f1553M40M43k422k418p53p48k184k180J781J781J781J785l077l078k16k13K154K154
-9573f6523p08p05j512j513J349J352k120k120o89o86j315j315J546J550K202K202o59o56
-9555g0320J278J278j53j49j107j106J457J457J75m595l521o59K142K143n40n41J755J755
-9537f9251j106j107M54M55r76r76j364j364j364j363L092L093o7o7K526k243k422k422K389
$$ plain form
-9665 -68099 -65730 -63356 -63036 -62712 -62391 -62067 -61925 -61780 -61639 -61493 -61255 -61013 -60774 -60532 -63066 -65596 -65268 -64936 -63885 -62831
-9645 -62831 -63211 -63587 -59884 -56176 -57242 -58304 -63118 -67928 -66423 -64914 -62753 -66311 -69337 -62820 -60420 -60878 -60744 -57745
-9627 -57745 -57432 -57115 -59485 -61851 -64944 -68032 -66356 -64675 -62999 -61318 -64411 -67500 -65722 -63941 -65026 -66106 -64090
-9610 -64090 -62071 -62917 -63759 -66207 -68651 -68237 -67820 -66900 -65976 -67917 -69854 -68252 -66646 -63613 -60577 -61538 -62496 -62026 -61553
-9591 -61553 -61113 -60670 -63092 -65510 -66263 -67011 -69195 -71375 -69594 -67813 -66032 -64247 -67324 -70402 -70618 -70831 -68677 -66523
-9573 -66523 -67231 -67936 -69448 -70961 -69612 -68260 -70380 -72500 -73189 -73875 -75190 -76505 -74959 -73409 -71207 -69005 -69664 -70320
-9555 -70320 -69042 -67764 -67917 -68066 -69173 -70279 -68822 -67365 -67190 -71785 -75306 -75965 -73823 -71680 -72220 -72761 -71006 -69251
-9537 -69251 -70357 -71464 -71010 -70555 -71531 -72507 -73871 -75235 -76599 -77962 -74870 -71777 -71844 -71911 -69385 -71628 -74050 -76472 -74083
-9518g4083K392R61R61j069j066k496k497j45j42j41j42K418K422K422K422O60O63p68p67
-9499f7995q31q27K034M896l39n105k600K61M519J662N89N88j90j90j90j90L387L387P501
-9480d9633M639M460j264k991k992n496n496k694J68J423m300r02r01n15n14n14n14M5M4J476
-9460f6471J475r98r99N082o40m039m036L73L76l472l469o11o08K303K306Q72Q76PJ1QJ1K925
-9438f8718K929j845j840j427j424j427j423J241J244J241J244J420J423J420J423J237J237
-9421f2045j624j625j982j982n52n51J371J371n9o0k39k38k38k39J60J61J60J60j08j08k970
-9400g1237k969K299K298Q69Q68p42p41J047m676j252j252L159L160j311j312J192J193L882
-9382f5525j840n3n2J975J975N44N44j174j174j173j174J449J450K880K880M386M385O115
$$ plain form
-9518 -74083 -71691 -70730 -69769 -70838 -71904 -74400 -76897 -77042 -77184 -77325 -77467 -75049 -72627 -70205 -67783 -67123 -66460 -67228 -67995
-9499 -67995 -68826 -69653 -67619 -62723 -63062 -68167 -70767 -70506 -65987 -64325 -63736 -63148 -63338 -63528 -63718 -63908 -60521 -57134 -49633
-9480 -49633 -44994 -40534 -41798 -44789 -47781 -53277 -58773 -61467 -61299 -59876 -64176 -65078 -65979 -66494 -67008 -67522 -68036 -67991 -67947 -66471
-9460 -66471 -64996 -65994 -66993 -61911 -62551 -66590 -70626 -70253 -69877 -73349 -76818 -77429 -78037 -75734 -73428 -72556 -71680 -71673 -71662 -71654 -71643 -68718
-9438 -68718 -65789 -67634 -69474 -70901 -72325 -73752 -75175 -73934 -72690 -71449 -70205 -68785 -67362 -65942 -64519 -63282 -62045
-9421 -62045 -63669 -65294 -67276 -69258 -69810 -70361 -68990 -67619 -67678 -67738 -67977 -68215 -68453 -68692 -68532 -68371 -68211 -68051 -68159 -68267 -71237
-9400 -71237 -74206 -71907 -69609 -68740 -67872 -68614 -69355 -68308 -72984 -74236 -75488 -72329 -69169 -70480 -71792 -70600 -69407 -65525
-9382 -65525 -67365 -67418 -67470 -65495 -63520 -62976 -62432 -63606 -64780 -65953 -67127 -65678 -64228 -61348 -58468 -54082 -49697 -43582
-9364d3582J1837J4938J7798L2286L8009L7000J9829O953J230p087k0441l6060l6061k9070
-9350G579j9531j0768p907n432n433k869k869j647j647j647j647Q28Q27k512k511K61K61k124
-9332e8788k124j885j886J453J454q09q09k239k239q68q69q68q68J591J591J591J591M29M28
-9313f4124M29M28k42k42j673j673j643j644P42P41k105k105M631j091j658J203L231L69k76
-9294f6702k76m55m54N2N2N2N3K08K09K09K08K09K09L87L88k452M10M344n194k362M99K586
-9272f7820K586K921K921K921K922k176k176k176k176k828k825k828k824L91L95L91L95N41
-9254g1445N44L759j960O60O63L02L05L88L91L88L91k09k05k08k05M77M80M77M81M77M80K98
-9232f3271L02J610j252k504K265J342j520j223J640L145L144N709N708o066o066J088J088
$$ plain form
-9364 -43582 -31745 -16807 991 33277 71286 108286 128115 135068 136298 129211 108770 72710 36649 7579
-9350 7579 -11952 -22720 -30627 -36059 -41492 -44361 -47230 -48877 -50524 -52171 -53818 -52990 -52163 -54675 -57186 -56925 -56664 -58788
-9332 -58788 -60912 -62797 -64683 -63230 -61776 -62585 -63394 -65633 -67872 -68740 -69609 -70477 -71345 -69754 -68163 -66572 -64981 -64552 -64124
-9313 -64124 -63695 -63267 -63509 -63751 -65424 -67097 -68740 -70384 -69642 -68901 -71006 -73111 -68480 -69571 -71229 -70026 -66795 -66426 -66702
-9294 -66702 -66978 -67433 -67887 -67835 -67783 -67731 -67678 -67470 -67261 -67052 -66844 -66635 -66426 -66039 -65651 -68103 -67693 -63349 -68543 -70905 -70406 -67820
-9272 -67820 -65234 -62313 -59392 -56471 -53549 -55725 -57901 -60077 -62253 -65081 -67906 -70734 -73558 -73167 -72772 -72381 -71986 -71445
-9254 -71445 -70901 -67142 -69102 -68442 -67779 -67477 -67172 -66784 -66393 -66005 -65614 -65823 -66028 -66236 -66441 -65964 -65484 -65007 -64526 -64049 -63569 -63271
-9232 -63271 -62969 -61359 -62611 -65115 -62850 -61508 -63028 -64251 -62611 -59466 -56322 -50613 -44905 -50971 -57037 -55949 -54861
-9215e4861q6q5j696j695j45l007o465j695J837J837j204j203p87p86O45O44K955K955N70
-9196f2272N70K001K001J524l246m944k083o52o52k6k6k6k6K541K541p97p98J081J080l50
-9176f2559l50k049k050K243K243j155j155K76K76J442J442J1J1j777j778J562M422j315o085
-9157f6345l401n41n70n70J994J993j762j763j762j763J368J367J368J367J159J159J159J158
-9139f4385q68q68q68q68n18n14n18n15J152J155l141l137J069J073K202K206L901q64J814
-9120f2492J818q34q31N96O00k265k262K027K031m25m21m25m21k333k328N2N6K57K61K57K61
-9099f6821k20k16J211J214K880K884J9K2l886l882l887l882K079K083K079K083n14n11n14
-9080f7779n11K266K269Q35Q38j937j934R24R28J132J137J490m229q35q30J669J673P67P72
$$ plain form
-9215 -54861 -54947 -55032 -56728 -58423 -58568 -61575 -68040 -69735 -67898 -66061 -67265 -68468 -69255 -70041 -69396 -68752 -65797 -62842 -62272
-9196 -62272 -61702 -59701 -57700 -56176 -59422 -64366 -66449 -67101 -67753 -67779 -67805 -67831 -67857 -65316 -62775 -63572 -64370 -63289 -62209 -62559
-9176 -62559 -62909 -64958 -67008 -64765 -62522 -63677 -64832 -64556 -64280 -62838 -61396 -61385 -61374 -63151 -64929 -63367 -58945 -60260 -66345
-9157 -66345 -69746 -70287 -70857 -71427 -69433 -67440 -69202 -70965 -72727 -74490 -73122 -71755 -70387 -69020 -67861 -66702 -65543 -64385
-9139 -64385 -65253 -66121 -66989 -67857 -68375 -68889 -69407 -69922 -68770 -67615 -70756 -73893 -72824 -71751 -69549 -67343 -63442 -64306 -62492
-9120 -62492 -60674 -61508 -62339 -61743 -61143 -63408 -65670 -63643 -61612 -62037 -62458 -62883 -63304 -65637 -67965 -67913 -67857 -67600 -67339 -67082 -66821
-9099 -66821 -67041 -67257 -66046 -64832 -61952 -59068 -59049 -59027 -62913 -66795 -70682 -74564 -72485 -70402 -68323 -66240 -66754 -67265 -67779
-9080 -67779 -68290 -66024 -63755 -62920 -62082 -64019 -65953 -65029 -64101 -62969 -61832 -60342 -64571 -65406 -66236 -64567 -62894 -62127 -61355
-9061f1355P67P71p22p20l942J785O428O431O785O789K135K138K135K139l09l06l09l06k455
-9042c2121k452O130O133L230L231O449O450P880J3603J5154J5154J5973J5974K0027K5750
-9027A26565K6228L5766L9343M8882O3558Q8359J26990J97576L06078M45341N67675O19182
-9015B691543N64232M59306L12412o7225m11926n66452o80439o28930m78674l31776k23278
-9004F38793j48873j02019p3399n0987l3813k6112j6570q465q462j0016j0012j6692j6689
-8991A16684k3295k3291j9838j4110j0180j0175j0180m452o326o323j2050o323l913l908k124
-8976c9804k120J818J818J819J818J908J907J908J908k705k705k705k705L94L95m970M568
-8959c7453M546M546N738N738O811J6349J6707K6246L5606M5144M9199M3475L2923J5754l324
$$ plain form
-9061 -61355 -60588 -59817 -60539 -61259 -65201 -63416 -56988 -50557 -43772 -36983 -34848 -32710 -30575 -28436 -28745 -29051 -29360 -29666 -32121
-9042 -32121 -34573 -28443 -22310 -19080 -15849 -9400 -2950 4930 18533 33687 48841 64814 80788 100815 126565
-9027 126565 152793 188559 227902 276784 340342 428701 555691 753267 1059345 1504686 2072361 2691543
-9015 2691543 3255775 3715081 4027493 3960268 3548342 2981890 2301451 1672521 1193847 862071 638793
-9004 638793 489920 387901 314502 263515 229702 203590 187020 178555 170093 160077 150065 133373 116684
-8991 116684 93389 70098 50260 36150 25970 15795 5615 1163 -5163 -11486 -23536 -29859 -33772 -37680 -39804
-8976 -39804 -41924 -40106 -38288 -36469 -34651 -32743 -30836 -28928 -27020 -29725 -32430 -35135 -37840 -37446 -37051 -42021 -37453
-8959 -37453 -32907 -28361 -22623 -16885 -10074 6275 22982 49228 84834 129978 179177 222652 255575 271329 268005
-8944B68005j6677l5073m4608m2939l7216l2628k6902k4279j4739j0437m709m472m471l431
-8930c4576l428j640j639n981k53o11o11N77N82N81N81l297l294j863j863j301j296J565J565
-8911e6202J121J122k098L625N26N25l528l529j338M386J166J166N41N40m229m229L13L13
-8893e9809J744J743K013K012K012K012m92m92o573q49J356J356j147j148j207j204j561M162
-8875e6072L204L209P04P04j699j695J166J166L88L91L91L91K012K016k753k754J178J181
-8857d6872J181J181q79q76N444N443M188j531o897o897j389j390l954l953n384o15m36m36
-8839f4072Q16Q16Q16Q16j38j37M631M632J97J97J98J97J38J38J38J38r95r95r95r95K642
-8818e1817K642K642K641K497K496j974j975p340k571J423J423J528J528j334m196l122J647
$$ plain form
-8944 268005 251328 216255 171647 128708 91492 58864 31962 7683 -7056 -17493 -22202 -26674 -31145 -34576
-8930 -34576 -38004 -39644 -41283 -47264 -47517 -48128 -48739 -48162 -47580 -46999 -46418 -49715 -53009 -54872 -56735 -58036 -59332 -57767 -56202
-8911 -56202 -55081 -53959 -56057 -52432 -51906 -51381 -54909 -58438 -59776 -55390 -54224 -53058 -52517 -51977 -56206 -60435 -60122 -59809
-8893 -59809 -58065 -56322 -54309 -52297 -50285 -48273 -48765 -49257 -55830 -56679 -55323 -53967 -55114 -56262 -57469 -58673 -60234 -56072
-8875 -56072 -52868 -49659 -48955 -48251 -49950 -51645 -50479 -49313 -48925 -48534 -48143 -47752 -45740 -43724 -46477 -49231 -48053 -46872
-8857 -46872 -45691 -44510 -45389 -46265 -40821 -35378 -31190 -32721 -39618 -46515 -47904 -49294 -53248 -57201 -62585 -63200 -63636 -64072
-8839 -64072 -63256 -62440 -61624 -60808 -60946 -61083 -56452 -51820 -51623 -51426 -51228 -51031 -50893 -50755 -50617 -50479 -51474 -52469 -53464 -54459 -51817
-8818 -51817 -49175 -46533 -43892 -41395 -38899 -40873 -42848 -50188 -52759 -51336 -49913 -48385 -46857 -48191 -52387 -55509 -53862
-8801e3862J647J646j661j662m524m523j841j840m524K46L629L630L927L927K31K31K31K31
-8783e4861K031K030K031K031j368j367M21N190j30m900m482m483p165k396k992J778p42p41
-8765g0115O233O234j785j785l53l54l246l245L431L432j367j368k798k798m315m311m195
-8748h2705j331L95N168l80K485J841J845L450L454J751J755L182L186l69l65l69l65K105
-8730e5267K109k664k661j278j274o047o044j874j871K538K541L614k105l361m95j394j390
-8713g6923J647J651R39R42L801L804K370K374K369K374j450j445j450j446K50K54L111L115
-8695e3713k813k810j382j379k753k750K016K019J524J524R3R3J345J345q5q6j874j874R87
-8676f0573R87P79P79P79P78K277K277M959M959O867M006M28n294j2643r781o501l641J189
$$ plain form
-8801 -53862 -52215 -50569 -52230 -53892 -58416 -62939 -64780 -66620 -71144 -70898 -67269 -63639 -59712 -55785 -55554 -55323 -55092 -54861
-8783 -54861 -52830 -50800 -48769 -46738 -48106 -49473 -49052 -43862 -43992 -48892 -53374 -57857 -65022 -67418 -70410 -68632 -69374 -70115
-8765 -70115 -63882 -57648 -59433 -61218 -61571 -61925 -65171 -68416 -64985 -61553 -62920 -64288 -67086 -69884 -74199 -78510 -82705
-8748 -82705 -84036 -83641 -78473 -78853 -76368 -74527 -72682 -69232 -65778 -64027 -62272 -59090 -55904 -56273 -56638 -57007 -57372 -55267
-8730 -55267 -53158 -55822 -58483 -59761 -61035 -67082 -73126 -75000 -76871 -74333 -71792 -68178 -70283 -73644 -74139 -75533 -76923
-8713 -76923 -75276 -73625 -72686 -71744 -67943 -64139 -61769 -59395 -57026 -54652 -56102 -57547 -58997 -60443 -60193 -59939 -56828 -53713
-8695 -53713 -56526 -59336 -60718 -62097 -64850 -67600 -65584 -63565 -62041 -60517 -60424 -60331 -58986 -57641 -57726 -57812 -59686 -61560 -60573
-8676 -60573 -59586 -58807 -58028 -57249 -56471 -54194 -51917 -46958 -41999 -35132 -31126 -30698 -35992 -48635 -58416 -64917 -68558 -67369
-8658f7369M050N481N481M728M729J866J867J151J152l857r579r416l692k501k500M147M147
-8641f0115Q917Q916M393M393K962K962J293J293J651m073m519m520o308o308l655l656p93
-8624e7167p94K910K910N414N414P739K016j264j263n32K328L760j964r50l812n838j1562
-8607e2655j1119q256N66L428P899P899J1119N395J960r02j021o744o207l346k452k452j293
-8590e8181j289L476L480N385N387J0154J0157J5452J5454J0564k788P1P5L826L831J0295
-8574C5349P437N943K23L559R285J6972J4114J4468J118m251p109o15o11K068l652n004j0723
-8557G8571p508p505J077O804J5027N492L924n612m661j0381o271j1990n317j1036K738J2281
-8541E5633K3485J7766K6049J6513J6272q94k016j1551k791n648O211O215K0162K0165L9067
$$ plain form
-8658 -67369 -63319 -57838 -52357 -47629 -42900 -41034 -39167 -38016 -36864 -40721 -50300 -59716 -63408 -65909 -68409 -64262 -60115
-8641 -60115 -51198 -42282 -37889 -33496 -30534 -27572 -26279 -24986 -23335 -27408 -31927 -36447 -42755 -49063 -52718 -56374 -57167
-8624 -57167 -57961 -55051 -52141 -46727 -41313 -33574 -31558 -32822 -34085 -34617 -32289 -28529 -30493 -31443 -35255 -41093 -52655
-8607 -52655 -63774 -72030 -71464 -68036 -60137 -52238 -41119 -35724 -33764 -34666 -35687 -42431 -48638 -51984 -54436 -56888 -58181
-8590 -58181 -59470 -55994 -52514 -47129 -41742 -31588 -21431 -5979 9475 20039 17251 17322 17397 21223 25054 35349
-8574 35349 42786 48729 48952 52511 61796 78768 92882 107350 108468 104217 97108 96493 95882 97950 94298 89294 78571
-8557 78571 71063 63558 64635 71439 86466 91958 95882 90270 85609 75228 68957 56967 51650 40614 43352 55633
-8541 55633 79118 96884 122933 139446 155718 154824 152808 141257 138466 132818 139029 145244 165406 185571 224638
-8526B24638L6210N0692M4973N2779L9429M2525K9175K7651J0485J1673r307j1637l2617j8612
-8512D98057j5746K0322K6048O5929O5932R2159R2163J40806J80873K57058K81862L31698
-8500B037161L14532L55544L72718M57607N47275P65183J041803J596711K354078L636067
-8490A3478679N507542Q487644J2358417J5515486J4384207R732702k16071r516698j4081880
-8481E5650028j5094878j1907073q352383n504153l670114k397664j666531j103751p61316
-8472E192165m61803l29276j90012j67119j46135k07181k70137l72915l78638l81906k99874
-8461A987169k50035j71818j49998j17567j37599j28059j39983j15182j07791p5358p2259
-8450E21520m3643m6504k1704k0266P19k143J1212j487Q052m587j725k2531j9670l3977k8255
$$ plain form
-8526 224638 260848 311540 356513 409292 448721 491246 520421 548072 558557 570230 560923 549286 516669 498057
-8512 498057 482311 502633 528681 594610 660542 752701 844864 985670 1166543 1423601 1705463 2037161
-8500 2037161 2351693 2707237 3079955 3537562 4084837 4850020 5891823 7488534 9842612 13478679
-8490 13478679 18986221 27473865 39832282 55347768 69731975 79464677 79248606 69731908 55650028
-8481 55650028 40555150 28648077 20295694 14791541 11121427 8723763 7057232 5953481 5192165
-8472 5192165 4730362 4401086 4211074 4043955 3897820 3690639 3420502 3047587 2668949 2287043 1987169
-8461 1987169 1737134 1565316 1415318 1297751 1160152 1032093 892110 776928 669137 593779 521520
-8450 521520 477877 431373 409669 389403 390122 387979 399191 397704 405756 401169 399444 376913 357243 323266 295011
-8435B95011m4768l1414l2606j5437j2400Q584J0672J6394L816R54j8362j5501k2982j7259
-8421A24702k4830j5291j7617m263l964N574p34K128q902o040j3194j0332j7128p590j2031
-8406i512j2031k2166j6443j8887j718P225K0579O871O874l741J986J446P172M308M311m814
-8390b8540m811o721K820M963J4506J2892J5756P888P892J390J393l499l495o718r91r192
-8374E533r187j0087p221p165j438r05Q637O129J1856O009O014l052q770j3186p460j0593
-8358c4886m866k366L361K57K61n109O19j606M121M415P281L640L644k857k855j904j900m587
-8340c5337m583r654o789q581k854J249M109K501Q223M318M319O464O465N064J0787M586J725
-8323g988J040L901k478k477q004n142k936K787k042L682Q19Q20m128m129m128m129q242q242
$$ plain form
-8435 295011 250243 218829 186223 170786 158386 166970 177642 194036 197852 198806 180444 164943 141961 124702
-8421 124702 99872 84581 66964 62701 58737 64311 63577 65705 56803 50763 37569 27237 10109 2519 -9512
-8406 -9512 -21543 -43709 -60152 -79039 -80757 -73532 -52953 -46082 -39208 -42949 -40963 -39517 -32345 -28037 -23726 -28540
-8390 -28540 -33351 -40072 -37252 -32289 -17783 -4891 10865 18753 26645 28035 29428 25929 22434 15716 14725 5533
-8374 5533 -3654 -13741 -20962 -28127 -29565 -30470 -21833 -15704 -3848 2161 8175 5123 -3647 -16833 -24293 -34886
-8358 -34886 -39752 -42118 -38757 -38500 -38239 -43348 -42729 -44335 -40214 -35799 -28518 -24878 -21234 -24091 -26946 -28850 -30750 -35337
-8340 -35337 -39920 -49574 -56363 -64944 -67798 -66549 -62440 -59939 -51716 -47398 -43079 -36615 -30150 -25086 -14299 -9713 -7988
-8323 -7988 -6948 -3047 -5525 -8002 -16006 -21148 -24084 -21297 -23339 -19657 -18838 -18018 -22146 -26275 -30403 -34532 -42774 -51016
-8305e1016j2355r494q175k448J662M527K794N660o7K798O968R833N537N541q13q08n284M44
-8287d4696k135P30P27L591R06R09K694K698J054L920p94o513m877Q49K158N022p60l618n052
-8268d3187O74k906k903L13L17L234L238L73L76j118j114p60p56n817q9K6K891j166J699J695
-8248d4980M561N302Q168j83n902n906j78J009J014L674L677L853L856N433Q298L465R191
-8231D352O178O181J886P612J021J024m940m937o055l28k239P303P836P839L126N992Q491
-8214E0342K5665K5482L5025L4544M0271M8136O9125O3291O9017P6644J24341J81569K90313
-8201A133765M39350O93081J050358J689448K582021L266897J411633k146267k948706k279091
-8191D892489j607022j032793o24783m01576k74715j96496j33306q5609l9678k6321j7203
$$ plain form
-8305 -51016 -63371 -72865 -81040 -83488 -81826 -77299 -74505 -68845 -68912 -66114 -59146 -49313 -43776 -38235 -39048 -39856 -45140 -44696
-8287 -44696 -46831 -46101 -45374 -41783 -40877 -39968 -37274 -34576 -33522 -29602 -30396 -36909 -41786 -40937 -38779 -33757 -34517 -38135 -43187
-8268 -43187 -42513 -45419 -48322 -48009 -47692 -44458 -41220 -40847 -40471 -41589 -42703 -43463 -44219 -50036 -50125 -50099 -47208 -48374 -46675 -44980
-8248 -44980 -40419 -35117 -26949 -27132 -33034 -38940 -39118 -38109 -37095 -33421 -29744 -25891 -22035 -16602 -8304 -4839 4352
-8231 4352 10530 16711 18597 26209 27230 28254 23314 18377 12322 11994 9755 17058 24894 32733 35859 41851 50342
-8214 50342 76007 101489 136514 171058 211329 259465 328590 391881 460898 537542 661883 843452 1133765
-8201 1133765 1573115 2266196 3316554 5006002 7588023 10854920 12266553 10120286 7171580 4892489
-8191 4892489 3285467 2252674 1627891 1226315 951600 755104 621798 536189 496511 470190 452987
-8180D52987k0061j5116k0836l7711n4877n0864n0864l8821k9283j5392r669o569j2292j2233
-8166G8399j7955j6704j3842r193r192r192r191%k861m829Q94M561j163q05q05O26n097k414
-8148a8763M47J252m471n843n842L50L54L50L54K377K381K378K380k332k329N29N33l65l61
-8129b6621K496K500J34J38m635m631m874m870m874m870l42l39l43l39j058j055j058j055
-8111e5696K225K224K225K224l290l290j859j860j561j561L208L208K880K881N741N742k105
-8094c8664k101m967m963l238l234J531J535J569J572J569J572L17L20m452m449j848j845
-8077e9776R54L819N783O4K086l633p37K127M628J770k31k28K452K456r32r31M99M99M047
-8058c5284M046J185J185j938j937m799m799n157n157k295k296N738N739K876K877N51N51
$$ plain form
-8180 452987 432926 417810 396974 359263 304386 253522 202658 163837 134554 119162 109493 102924 90632 78399
-8166 78399 60444 43740 29898 20705 11513 2321 -6870 -6870 -9731 -14560 -13666 -9105 -10268 -11073 -11878 -11252 -16349 -18763
-8148 -18763 -18316 -17064 -21535 -27378 -33220 -32870 -32516 -32166 -31812 -29435 -27054 -24676 -22296 -24628 -26957 -26428 -25895 -26260 -26621
-8129 -26621 -24125 -21625 -21491 -21353 -25988 -30619 -35493 -40363 -45237 -50107 -50449 -50788 -51131 -51470 -52528 -53583 -54641 -55696
-8111 -55696 -53471 -51247 -49022 -46798 -50088 -53378 -55237 -57097 -58658 -60219 -57011 -53803 -50923 -48042 -42301 -36559 -38664
-8094 -38664 -40765 -45732 -50695 -53933 -57167 -55636 -54101 -52532 -50960 -49391 -47819 -47502 -47182 -51634 -56083 -57931 -59776
-8077 -59776 -58822 -55003 -49220 -49156 -47070 -50703 -51440 -49313 -44685 -42915 -43146 -43374 -40922 -38466 -39398 -40329 -39830 -39331 -35284
-8058 -35284 -31238 -30053 -28868 -30806 -32743 -37542 -42341 -47498 -52655 -54950 -57246 -51508 -45769 -42893 -40016 -39465 -38914
-8041c8914J267m456k869K854K496l226l614l615j110j110J512J513K944K943J006J006J006
-8024d0367J006O64O63O63O63M002M002Q950Q950J5599J8467K6152L5696M2547M8275M5409
-8008B21341L2058J3723l443j8947l2297l7785m3505l9217l3489k5162j9435j1510q643n399
-7994a1710n395o651o647k404k399k403k400l447l442n85n82L21L24k541k538k451k448j021
-7976e8419j017O33O37J528M393M836q83l808l804l652K076k042m900m009J718J177J181K221
-7958f2134K224o41o37N52N55N51N56K395K396K396K396J203J204M423j301j866j867k225
-7940d9820k224k612k612j181j181j576j576m438m438j993j994Q68Q69K537K537L969L968
-7923f0897j159j159J703J703Q53Q53K284K285k217k217k217k217L610L611k828K895J702
$$ plain form
-8041 -38914 -37647 -42103 -44972 -42118 -39622 -42848 -46462 -50077 -51187 -52297 -50785 -49272 -46328 -43385 -42379 -41373 -40367
-8024 -40367 -39361 -38697 -38034 -37371 -36708 -32706 -28704 -19754 -10804 4795 23262 49414 85110 127657 175932 221341
-8008 221341 253399 267122 263679 244732 212435 174650 131145 91928 58439 33277 13842 2332 -6311 -11710
-7994 -11710 -17105 -23756 -30403 -32807 -35206 -37609 -40009 -43456 -46898 -47483 -48065 -47744 -47420 -49961 -52499 -54950 -57398 -58419
-7976 -58419 -59436 -58803 -58166 -56638 -52245 -47409 -48292 -52100 -55904 -59556 -57480 -59522 -64422 -68431 -66713 -65536 -64355 -62134
-7958 -62134 -59910 -60551 -61188 -60636 -60081 -59530 -58974 -56579 -54183 -51787 -49391 -48188 -46984 -42561 -43862 -45728 -47595 -49820
-7940 -49820 -52044 -54656 -57268 -58449 -59630 -61206 -62782 -67220 -71658 -73651 -75645 -74777 -73908 -71371 -68834 -64865 -60897
-7923 -60897 -62056 -63215 -61512 -59809 -58956 -58103 -55819 -53534 -55751 -57968 -60185 -62402 -58792 -55181 -58009 -55114 -53412
-7906e3412m020l663K061K943K948Q2Q5j050o770k005L722J260J263j245j241k2j9k2j8q09
-7886e9932q05k239k236j53j49K709K713J203J207k27k23M1M4K903K906M598M598J736J737
-7867c9569k527k526l957l957j885j886R77R76l108l107J304J304K690l033m225m225q280
-7850g5034k556j006j006M747M747J886J885J319J319j12j12M099M099o71o71l43l42l43l43
-7831e8438Q2Q2Q2Q2J960J960J960J960p53p49k959k954m568j703r32r27L055L059L055L059
-7811e3587r39r35n231n228j058j054j059j054R39R43l73l230l115L565M874K016j029L745
-7793f1810K310K314M70M73k571K94l7l4L480L484j26j23J304j554k511n370k988j23J163
-7774f1955M028K593K597j967j964j192J673J326J330k787k783J34J38J34J38j431j427l040
$$ plain form
-7906 -53412 -57432 -61095 -59034 -56091 -53143 -53061 -52976 -54026 -60796 -62801 -59079 -57819 -56556 -57801 -59042 -59064 -59083 -59105 -59123 -59932
-7886 -59932 -60737 -62976 -65212 -65365 -65514 -62805 -60092 -58889 -57682 -57909 -58132 -58091 -58047 -55144 -52238 -47640 -43042 -41306 -39569
-7867 -39569 -42096 -44622 -48579 -52536 -54421 -56307 -55330 -54354 -57462 -60569 -59265 -57961 -55271 -58304 -62529 -66754 -75034
-7850 -75034 -77590 -78596 -79602 -74855 -70108 -68222 -66337 -65018 -63699 -63811 -63923 -59824 -55725 -56396 -57067 -57410 -57752 -58095 -58438
-7831 -58438 -58356 -58274 -58192 -58110 -56150 -54190 -52230 -50270 -51023 -51772 -54731 -57685 -62253 -63956 -64888 -65815 -62760 -59701 -56646 -53587
-7811 -53587 -54526 -55461 -60692 -65920 -66978 -68032 -69091 -70145 -69206 -68263 -68636 -71866 -74981 -71416 -66542 -64526 -65555 -61810
-7793 -61810 -59500 -57186 -56716 -56243 -58814 -58520 -58557 -58591 -55111 -51627 -51753 -51876 -50572 -52126 -54637 -60007 -62995 -63118 -61955
-7774 -61955 -57927 -55334 -52737 -54704 -56668 -57860 -56187 -54861 -53531 -56318 -59101 -58967 -58829 -58695 -58557 -59988 -61415 -64455
-7756f4455j76N67N70P45P49j066j062L66L68j155j151R7J01J86k672J87J90K153p04j304
-7736f7466j300P60L625O126O129J744j114K876K880L104L108J196M061M088o79j337j334
-7719c3533k411n269o524l659k947q2r20J945R27j930l483l481l483l480l484o19j859J006
-7701g3286k634k631n18K348q76J990M896M899j71j68j334j330R7J01L271L275K31k627k332
-7682f6799P210R46m773p362j636r24r21Q35Q38Q35Q38N07N11r24r21J043J047l87l84J643
-7662f8778J647J643J647l126l122o107o103j934L793R28R31j15N611N250K392N138K281L69
-7644e7655L72p64p60n056n052l551l548P42P45q08q05O22O26K623K623J193J192J49J49j282
-7624f8245j282m54m55m54m55k958k959J334J334P5P4P5P4M486M486J148J148k631k631k630
$$ plain form
-7756 -64455 -64631 -64064 -63494 -62749 -62000 -63066 -64128 -63762 -63394 -64549 -65700 -65603 -65502 -65316 -67988 -67801 -67611 -65458 -66162 -67466
-7736 -67466 -68766 -68006 -64381 -58255 -52126 -50382 -51496 -48620 -45740 -42636 -39528 -38332 -34271 -30183 -30862 -32199 -33533
-7719 -33533 -35944 -41213 -47737 -51396 -54343 -54425 -55345 -53400 -52473 -54403 -57886 -61367 -64850 -68330 -71814 -72433 -74292 -73286
-7701 -73286 -75920 -78551 -79069 -76721 -77597 -75607 -70711 -65812 -65983 -66151 -67485 -68815 -68718 -68617 -65346 -62071 -61840 -64467 -66799
-7682 -66799 -59589 -58643 -63416 -70778 -72414 -73338 -74259 -73424 -72586 -71751 -70913 -70406 -69895 -70819 -71740 -70697 -69650 -70037 -70421 -68778
-7662 -68778 -67131 -65488 -63841 -66967 -70089 -76196 -82299 -84233 -80440 -79512 -78581 -78696 -73085 -67835 -65443 -60305 -58024 -57655
-7644 -57655 -57283 -58047 -58807 -63863 -68915 -72466 -76014 -75272 -74527 -75335 -76140 -75518 -74892 -72269 -69646 -68453 -67261 -67112 -66963 -68245
-7624 -68245 -69527 -69981 -70436 -70890 -71345 -74303 -77262 -75928 -74594 -74519 -74445 -74370 -74296 -69810 -65324 -64176 -63028 -65659 -68290 -70920
-7604g0920k631k243k243K050K049L398L402L458k262Q94L760J788J792r98r95r99r94M575
-7586e7119M579J237J241n075n071n075n071L80L84L719L722q57q53m196m192L66L68L704
-7568f7809L708K500K504m81l339l193l28n10n07l566p00j062j058K992J34J30K996J695J699
-7549f4195J994k772n966j192M14M17J054j803j628j625J889J893K79K84J091j769j61j60
-7531g1956J807J807k664J98P49P49n03M266M803J941R87R88L968L968K716K717M743P605
-7513c1111N995Q857J0168J3029J6845J9707K0959K3820K3225J8455K0668J3995Q75n797j0362
-7498A49328j5128j9662k2520k5237k2371j9990j5217j1523q660p113p109p627p623p449p444
-7483e5345k560L05l990l987o614l748m14m09n93K273M81M84p45l603Q64Q68K296K299K116
$$ plain form
-7604 -70920 -73551 -75794 -78037 -75987 -73938 -70540 -67138 -63680 -65942 -65048 -61288 -59500 -57708 -58706 -59701 -60700 -61694 -57119
-7586 -57119 -52540 -51303 -50062 -55137 -60208 -65283 -70354 -69974 -69590 -65871 -62149 -63006 -63859 -68055 -72247 -71881 -71513 -67809
-7568 -67809 -64101 -61601 -59097 -59578 -62917 -66110 -66438 -66948 -67455 -71021 -71721 -72783 -73841 -70849 -70715 -70585 -67589 -65894 -64195
-7549 -64195 -62201 -64973 -70939 -72131 -71717 -71300 -70246 -72049 -73677 -75302 -73413 -71520 -71241 -70957 -69866 -71635 -71796 -71956
-7531 -71956 -70149 -68342 -71006 -70808 -70059 -69310 -69813 -65547 -60744 -58803 -57816 -56828 -52860 -48892 -46176 -43459 -38716 -31111
-7513 -31111 -25116 -16259 -6091 6938 23783 43490 64449 88269 111494 129949 150617 164612 165487 159690 149328
-7498 149328 134200 114538 92018 66781 44410 24420 9203 -2320 -10980 -18093 -25202 -32829 -40452 -47901 -55345
-7483 -55345 -57905 -57600 -61590 -65577 -72191 -75939 -76353 -76762 -77355 -75082 -74601 -74117 -74862 -78465 -77601 -76733 -74437 -72138 -70022
-7464g0022K120K385m74R54R58M47k411l845r80j774j769m457m452j506j501J356J360L979
-7446g9632L984M098o67j237L536K161o96j167j166Q6Q5l699l700q39q38O032O033J263J263
-7427f5100n25n26n25n26m35m36m36m36R35R35R35R36m460m460L09L09j628j628j98j97J933
-7406g5224J934J934J934P11P12m058m057k27k28K635K634L886L886J025J025k769k768k769
-7388f9784k768j069j070j069j070L238L238P888K165J68J67m959m959j979j975k336L391
-7371g2783K135K139l69l65R57R62N99O04L193k526L551L555J069J073K500K504k42k39K620
-7352d9063K623N272N276O703O707N481N485P031J2757J9207J9212K2427K2430K2308K2311
-7337A36167K6481K6485K5512J5977O077l458q707j8243k3969k3966k6965k6962k7323k1596
$$ plain form
-7464 -70022 -67902 -65517 -65991 -65037 -64079 -63632 -66043 -69888 -70868 -72642 -74411 -78868 -83320 -84826 -86327 -84971 -83611 -79632
-7446 -79632 -75648 -71550 -72217 -73454 -69918 -67757 -68453 -69620 -70786 -70700 -70615 -74314 -78014 -78853 -79691 -73659 -67626 -66363 -65100
-7427 -65100 -65625 -66151 -66676 -67202 -67637 -68073 -68509 -68945 -68010 -67075 -66140 -65204 -69664 -74124 -73815 -73506 -75134 -76762 -76960 -77157 -75224
-7406 -75224 -73290 -71356 -69422 -68711 -67999 -72057 -76114 -76341 -76569 -73934 -71300 -67414 -63528 -62503 -61478 -64247 -67015 -69784
-7388 -69784 -72552 -73621 -74691 -75760 -76830 -73592 -70354 -62466 -60301 -60133 -59966 -64925 -69884 -71863 -73838 -76174 -72783
-7371 -72783 -70648 -68509 -68878 -69243 -68286 -67324 -66725 -66121 -62928 -65454 -61903 -58348 -57279 -56206 -53706 -51202 -51444 -51683 -49063
-7352 -49063 -46440 -41168 -35892 -29189 -22482 -17001 -11516 -4485 8272 27479 46691 69118 91548 113856 136167
-7337 136167 162648 189133 214645 230622 236699 233241 224534 206291 182322 158356 131391 104429 77106 55510
-7323E5510j4714j4710r587r584p737p736r169r166o696o692l834l830n41n36n41n36k388
-7306e2487k385O196O200L350L353K873j893n026r792q484l711R95L860K545K548J651J654
-7289d8553K20K24O81O86k180k176k328k325K440K444K012K012k757k757j446j445L323L324
-7271d8601Q391Q391L621L622m486m486j625j624N276N276j401m263j758L010L011L011K407
-7254b2228K407m270m270N58N59N59N59l771l767o632o629k995k992n858n853m84m81O193
-7236e9395O196L331L335J781j077k511p277m479m475l107J665J841J844L749L752Q86Q91
-7219e3050n433n428k571k568k477k475K292K295M736M740P597P601L931L935L931L934L603
-7202b5407L607N034N037J770J774l000k995o964o960o964o961o29o26L841L846P865L100
$$ plain form
-7323 55510 40796 26086 16499 6915 -822 -8558 -17727 -26893 -33589 -40281 -44115 -47945 -48486 -49022 -49563 -50099 -52487
-7306 -52487 -54872 -48676 -42476 -39126 -35773 -32900 -34793 -39819 -49611 -58095 -61806 -60811 -56951 -54406 -51858 -50207 -48553
-7289 -48553 -48333 -48109 -47428 -46742 -48922 -51098 -53426 -55751 -53311 -50867 -48855 -46843 -49600 -52357 -53803 -55248 -51925 -48601
-7271 -48601 -40210 -31819 -28198 -24576 -29062 -33548 -35173 -36797 -31521 -26245 -27646 -31909 -33667 -30657 -27646 -24635 -22228
-7254 -22228 -19821 -24091 -28361 -27803 -27244 -26685 -26126 -29897 -33664 -40296 -46925 -49920 -52912 -58770 -64623 -65107 -65588 -59395
-7236 -59395 -53199 -49868 -46533 -44752 -45829 -48340 -55617 -60096 -64571 -67678 -66013 -64172 -62328 -58579 -54827 -53941 -53050
-7219 -53050 -58483 -63911 -66482 -69050 -71527 -74002 -71710 -69415 -64679 -59939 -52342 -44741 -40810 -36875 -32944 -29010 -25407
-7202 -25407 -21800 -16766 -11729 -9959 -8185 -11185 -14180 -21144 -28104 -35068 -42029 -42658 -43284 -39443 -35597 -27732 -24632
-7185b4632K918K921J919J919J30J31M094j628o994o993o249o248l387l387P791P791R222
-7168b0682R222L267L268J718m006q75q76q75o599p508p508J315P039O382O383R602R601J2482
-7150B1350J2486J5344R624J543m177l108K620N887N891J475J479j237j233M128R856K1007
-7134A02935K1011J2661o89n403n399j468j464p01o97p00o97j118j114M32O160J1006J1007
-7117A45762R695J57j722p444o253o252o983o982L867J3407K1842K1842K6372K6373J9070
-7102B52751N716p23p23k392L331J1796J7520K5434L4972M1054M6776M9072M9072N1218M5494
-7087F30368L9921L9920L5748L0024K6179K0456J0321J0325K0232M1217O3037Q7837J11565
-7074A167150J24918J41373J58546J89923K29985K65754L05817L53868M24454N26993O43368
$$ plain form
-7185 -24632 -21714 -18793 -16874 -14955 -14825 -14694 -10600 -12228 -19222 -26215 -32464 -38712 -42099 -45486 -37695 -29904 -20682
-7168 -20682 -11460 -8193 -4925 -3207 -7213 -8088 -8964 -9839 -16438 -23946 -31454 -30139 -23100 -16718 -10335 -733 8868 21350
-7150 21350 33836 49180 58804 60347 56170 53062 55682 61569 67460 68935 70414 69177 67944 72072 81928 102935
-7134 102935 123946 136607 135918 130515 125116 123648 122184 121483 120786 120086 119389 118271 117157 117589 123749 134755 145762
-7117 145762 155457 155614 153892 146448 140195 133943 126960 119978 123845 137252 159094 180936 207308 233681 252751
-7102 252751 258467 257744 257021 254629 257960 269756 287276 312710 347682 388736 435512 484584 533656 584874 630368
-7087 630368 670289 710209 745957 775981 802160 822616 832937 843262 863494 904711 967748 1055585 1167150
-7074 1167150 1292068 1433441 1591987 1781910 2011895 2277649 2583466 2937334 3361788 3888781 4532149
-7063D532149P40204Q33682J001801J339466J892827K715054L887588N514880P697276J0392889
-7053D0547816J2748444J2246721N810060m360008j1104762j2281827j0582873q120003n846239
-7044A9057329m119745k922892k093029j486850j015642o62040m38832l33673l08868l59784
-7034E315974m41813m69475m48490m12068l75818l42198k94501k48123k11872j83973j70618
-7023A717025j65905j60178j45158j20354r2935o4315m1664k0676n864j38j1946l6742m7179
-7010H03971m7175m7179m1452m0487m0483l9951l9946m2455l9588l5480k5937j3450l909r7
-6996C46382r3r7r3r218j8753k5311k8169k9480j9942j8336j5470j0820p959k001P541J4398
-6980A82579J4397J0578M859n991j5530j1995k451N298N299m066j3600q473M882J7218K6760
$$ plain form
-7063 4532149 5272353 6106035 7107836 8447302 10340129 13055183 16942771 22457651 30154927 40547816
-7053 40547816 53296260 65542981 71353041 66993033 55888271 43606444 33023571 24903568 19057329
-7044 19057329 14937584 12014692 9921663 8434813 7419171 6757131 6318299 5984626 5675758 5315974
-7034 5315974 4874161 4404686 3956196 3544128 3168310 2826112 2531611 2283488 2071616 1887643 1717025
-7023 1717025 1551120 1390942 1245784 1125430 1032495 968180 926516 905840 899976 899838 887892 851150 803971
-7010 803971 756796 709617 668165 627678 587195 547244 507298 464843 425255 389775 363838 350388 346479 346382
-6996 346382 346289 346192 346099 336881 318128 292817 264648 235168 215226 196890 181420 170600 162641 160640 168181 182579
-6980 182579 196976 207554 212413 206422 190892 178897 176446 181744 187043 182977 169377 160904 165786 183004 209764
-6965B09764K4614J8891L864r487q055J483P187J464n451j1174j1115n391J643J4997J7322
-6950B50556J7323J2731R871Q68m855o763o763j0287j3149j3686l32J0638K0176K6437K9297
-6935C22062K4827K4826J7792Q253O82k180j941R20P419K0776L4190M3729N1057N6785O1077
-6920F70274O6800O2444N6725M9035M3311L4782L1925K2684J3145J822P549K3526M8327Q8266
-6906A220615J24516J45262J62432J84994K25059K72991L28314L73023M39797N18491O19600
-6895D615094P30255Q35181R48212J137081J494299K106677L036930M393325O311268Q980175
-6885C4588497J2477027J6179923J7421724J1677575j144707j2646368j6613658j5150431
-6877D6789582j1893236q617672o026392m227409l019104k166349j522020j020290o75050
$$ plain form
-6965 209764 234378 253269 257133 247646 239591 241074 248261 249725 244274 233100 221985 216594 218237 233234 250556
-6950 250556 267879 280610 290481 291349 286494 279731 272968 262681 249532 235846 235514 246152 266328 292765 322062
-6935 322062 346889 371715 389507 397760 398442 396262 394321 395241 402660 423436 457626 501355 552412 609197 670274
-6920 670274 737074 799518 856243 905278 948589 983371 1015296 1037980 1051125 1052947 1060496 1084022 1132349 1220615
-6906 1220615 1345131 1490393 1652825 1837819 2062878 2335869 2664183 3037206 3477003 3995494 4615094
-6895 4615094 5345349 6180530 7128742 8265823 9760122 11866799 14903729 19297054 25608322 34588497
-6885 34588497 47065524 63245447 80667171 92344746 91200039 78553671 61940013 46789582
-6877 46789582 34896346 26278674 20252282 16024873 13005769 10839420 9317400 8297110 7622060
-6868G622060m93814m36525m39387m70805m95602m88973m60357m27211l98591l61991l14297
-6857B834507k64696k28447k13754k04216j98492j92766j72142j47342j26834j05845q0191
-6846H99782o3022n2768l5595j9382r845p459p456j1245j1245j8638k8172l6999m2723m4273
-6832E10960m4268m2961l3419k4003j0645k899K828J691j166q622j4341j9711j9707j7684
-6818B76053j4818r159l431k988k985r844j9379k4093k6950k7192k4328k2244j6517j2885
-6804E9240l342p132j2851k3586j7857j845J5328J9200J6343O531Q13l305K421M893J0619
-6789F5470O681R61n243n238l454O088J7203K2930K0959J5239J1599Q742J1897K1439K7189
-6774B22462M4362O6774J03025J48567K07711K51585K03895K1588j63460k34762k09957j63759
$$ plain form
-6868 7622060 7128246 6691721 6252334 5781529 5285927 4796954 4336597 3909386 3510795 3148804 2834507
-6857 2834507 2569811 2341364 2127610 1923394 1724902 1532136 1359994 1212652 1085818 979973 899782
-6846 899782 836760 783992 748397 729015 719170 711711 704255 693010 681765 663127 634955 597956 555233 510960
-6832 510960 466692 423731 390312 366309 355664 352765 355593 357284 356118 347496 333155 313444 293737 276053
-6818 276053 261235 252076 248645 245657 242672 232828 213449 189356 162406 135214 110886 88642 72125 59240
-6804 59240 55898 48766 35915 12329 -5528 -7373 7955 27155 43498 50029 50842 47537 49958 54851 65470
-6789 65470 72151 73112 67869 62631 59177 65265 82468 105398 126357 141596 153195 161937 173834 195273 222462
-6774 222462 266824 333598 436623 585190 792901 1044486 1248381 1269969 1106509 871747 661790 498031
-6762D98031j12250q1011o0023n3677m7954l3645k0289j1021n299m344m341o841o841r703
-6748D0792l975l026K698J624j233l085k24o542j2263j5693r971q003n138m617m613m318J408
-6731c6179R096R098M207M211Q618Q621J0049J0053Q380Q383L491L495O912J2639Q939n97
-6715G9416j434M292L991L994N183Q048k567j5918k7486k4622k1466k1460k1861j6134n347
-6700e3371M196Q246N387N206N209J419J424r65r62j024j021k635k630l920o778o602q76Q153
-6682d1544J3879J1372J1376R314J5042J9807J9811J3817l350j8317k1175j4040j4036q967
-6668g011l246m47N280P306J3030J5440J5445N667p687j3652j3649j2694j2694j0563m836
-6653b4311N2N2N25N30k810k809j889j886m54m55o37o34l614l614p202j476k310k310L111
$$ plain form
-6762 498031 385781 304770 244747 191070 143116 109471 89182 78161 72862 68518 64177 57336 50495 40792
-6748 40792 36817 33791 36489 38113 36880 33795 33571 27029 14766 -927 -10898 -18901 -24039 -28656 -33269 -37587 -36179
-6731 -36179 -27083 -17985 -13778 -9567 -949 7672 17721 27774 36154 44537 48028 51523 58435 71074 80013 79416
-6715 79416 77982 82274 86265 90259 95442 103490 100923 85005 57519 32897 11431 -10029 -31890 -48024 -53371
-6700 -53371 -49175 -40929 -35542 -30336 -25127 -23708 -22284 -23249 -24211 -25235 -26256 -28891 -31521 -35441 -42219 -48821 -49697 -41544
-6682 -41544 -27665 -16293 -4917 4397 19439 39246 59057 72874 69524 51207 30032 15992 1956 -7011
-6668 -7011 -10257 -10704 -5424 1882 14912 30352 45797 51464 43777 30125 16476 3782 -8912 -19475 -24311
-6653 -24311 -24259 -24207 -23682 -23152 -25962 -28771 -30660 -32546 -33000 -33455 -34092 -34726 -38340 -41954 -49156 -50632 -52942 -55252 -52141
-6634e2141L115j774j773k761K966J177J178J680J684K042K042P41O469M322M322M170j550
-6617b4091r301r300j1629j1625j3652m114N33N37o56N067J331J330P888P892Q066Q067M729
-6600c8928M732L983L983J2091J2094J1852J1852J4237J4241J3977J3976R326J5053J5288
-6586A17757J5288O942J222Q31Q31o085j5620k0571k0571j9737j9733j6864j6864j4121m579
-6571a1874n447n448m851m848k496k496j12j08n805n806r16r13J095m627p609j881k333L391
-6553f3084K913K918k869k869o088l62M047M046O789O792N317N317N318N317m013m013m013
-6536c8537m013k761k761j390M333R282O420J710J710J345J346R87R87J53n570r028r029j367
-6518d6183j367j189j189N548Q410J2881P158O002O003N465N466J0951Q089K902j0451j6532
$$ plain form
-6634 -52141 -49026 -50800 -52573 -55334 -52368 -51191 -50013 -48333 -46649 -44607 -42565 -41824 -35355 -31033 -26711 -22541 -24091
-6617 -24091 -33392 -42692 -54321 -65946 -79598 -83712 -83179 -82642 -83298 -78231 -76900 -75570 -67682 -59790 -51724 -43657 -38928
-6600 -38928 -34196 -30213 -26230 -14139 -2045 9807 21659 35896 50137 64114 78090 87416 102469 117757
-6586 117757 133045 139987 141209 142040 142871 136786 121166 100595 80024 60287 40554 23690 6826 -7295 -11874
-6571 -11874 -17321 -22769 -27620 -32468 -34964 -37460 -37572 -37680 -43485 -49291 -50207 -51120 -50025 -54652 -62261 -64142 -66475 -63084
-6553 -63084 -60171 -57253 -60122 -62991 -69079 -69441 -65394 -61348 -54559 -47767 -42450 -37133 -31815 -26498 -30511 -34524 -38537
-6536 -38537 -42550 -45311 -48072 -49462 -45129 -35847 -29427 -27717 -26007 -24662 -23316 -22329 -21342 -21189 -26759 -35787 -44816 -46183
-6518 -46183 -47550 -48739 -49928 -44380 -35970 -23089 -15931 -9929 -3926 1539 7005 17956 26045 28947 18496 1964
-6502A964j6532m549J173L797R36j38N585J0987J3850R259m095j0712j6435j5482j2620m094
-6486c7106j234j054l916j889j889L953J092j107o830p008j286J993J994N213N212Q343Q342
-6469b7177J2755J2754R414L693L454k269J695J695O048Q909R445L722M259M259Q074Q075
-6453F8805J2843J2844K2680K2680K2681K2680K3679K3682L3699M7052O4158Q5147J06132
-6440E68762J27117J63390K07271K61880L09572L47366L60724L42123K71537J87013P4461
-6429C221216m5487j50412k36741l03506l21631l04460k70573k15244j53244j05551o3167
-6418A051200l8363k4711k7573l1667m5022n7421p4592q0493p7631o8392n8852l4797j7628
-6405D14058k664O874R677O815N205m334r408j8947k5027l4567l9097l9097k6995j3641k57
$$ plain form
-6502 1964 -14568 -19117 -17944 -14147 -13211 -13349 -7764 3223 17073 26332 22237 11525 -4910 -20392 -33012 -37106
-6486 -37106 -38340 -39394 -43310 -45199 -47088 -43135 -42043 -43150 -49980 -56988 -58274 -56281 -54287 -49074 -43862 -35519 -27177
-6469 -27177 -14422 -1668 7746 11439 14893 12624 14319 16014 22062 30971 40416 44138 48397 52656 60730 68805
-6453 68805 81648 94492 117172 139852 162533 185213 208892 232574 266273 313325 377483 462630 568762
-6440 568762 695879 859269 1066540 1328420 1637992 1985358 2346082 2688205 2959742 3146755 3221216
-6429 3221216 3175729 3025317 2788576 2485070 2163439 1858979 1588406 1373162 1219918 1114367 1051200
-6418 1051200 1012837 988126 960553 928886 883864 826443 751851 671358 593727 525335 466483 431686 414058
-6405 414058 411394 418268 427945 434760 439965 435631 426223 407276 382249 347682 308585 269488 242493 228852 228595
-6390B28595K605j390j0929r974r975j0570j0571j0806j0801j4264j9982j7542j7539j1640
-6376G5217j7359j3041j0176l562l559K579K582P169P172P117M259L957j762J930l790n999
-6360E2734q856o089o084l585l580K556l02N835J5377J5154N619L472o066j2329k9495l3489
-6344i128l6351k9379l5100k9912k4189j7338p794J1461J7184K0743J7885K2893J7169J7166
-6330f4690J4308J9673J6812J6956J1238Q555K831k418q137k415k414P34P38k128k124K701
-6314A0220K706J2657J5522J5579K228M252J393q16j0351j4349k0068j3142j3137j099j095
-6299i500O889O892J8336J2616N757L7m139j3675j3201j3197m855m851K493Q219J3823M285
-6283A5929R527J9070L3378K7654J9454K288j111l972L596L599n045k2214k9432k9428k3646
$$ plain form
-6390 228595 231200 229810 218881 208907 198932 188362 177791 166985 156184 141920 121938 104396 86857 75217
-6376 75217 57858 44817 34641 31079 27520 30099 32681 39850 47022 54139 58398 62355 60593 62523 58733 52734
-6360 52734 43878 37789 31705 28120 24540 27096 26794 32629 48006 63160 68779 72251 66185 53856 24361 -9128
-6344 -9128 -45479 -74858 -109958 -139870 -164059 -181397 -189191 -177730 -160546 -139803 -121918 -99025 -81856 -64690
-6330 -64690 -50382 -30709 -13897 3059 14297 22852 25683 23265 15128 12713 10299 11033 11771 9643 7519 10220
-6314 10220 12926 25583 41105 56684 58912 63164 64557 63741 53390 39041 18973 5831 -7306 -8405 -9500
-6299 -9500 -2611 4281 22617 35233 40990 41027 36888 23213 10012 -3185 -8040 -12891 -10398 -2179 11644 15929
-6283 15929 25456 44526 77904 105558 125012 127300 126189 122217 125813 129412 124367 102153 72721 43293 19647
-6268A9647k3644j2382r516N59O282J9512K9056L5494K5955K1421J1886J1886J1886J6201
-6254A64243J6204J3220j30l383l380n887j9237k5233l4767l1075l1072k2937j3395O71n048
-6239a206l756l752Q287J7828K7483K1763J6454O920P124M266J1595J1600J8928J3209R83
-6224A57726k3813l3232l0371j3380k6J9587J9588J3686l484j2784j5646j0518j0519l603
-6210E3211o464p478j3202k060J1293K3098K3098J9878J4155Q551q618j5146k0870j5385j2523
-6195E1538N362Q223L395o144m166p027q518q514K46N969J3004P284R904J5627K8862K8865
-6179A43910J8608k377j9189k8724j3146P840K1849K4715K7215L2938M0330M3196M1791L6068
-6165C75024L5472L2614K4681j9197j09157j72109j57562r8422m3278k2292j8060j5199r535
$$ plain form
-6268 19647 -3997 -16379 -25895 -25336 -19054 458 29514 65008 90963 112384 124270 136156 148042 164243
-6254 164243 180447 193667 193537 190154 186774 180887 161650 136417 101650 70575 39503 16566 3171 3842 -1206
-6239 -1206 -4962 -8714 -427 17401 44884 66647 83101 90021 97145 101411 113006 124606 143534 156743 157726
-6224 157726 133913 100681 70310 56930 56904 76491 96079 109765 106281 93497 77851 67333 56814 53211
-6210 53211 46747 39269 26067 24007 35300 58398 81496 101374 115529 124080 115462 100316 79446 64061 51538
-6195 51538 56900 65123 68518 62374 58208 51181 42663 34149 34395 40364 53368 60652 70556 86183 115045 143910
-6179 143910 162518 160141 140952 112228 99082 106922 128771 153486 180701 213639 253969 297165 338956 375024
-6165 375024 410496 443110 467791 448594 339437 167328 9766 -88656 -131934 -154226 -172286 -187485 -197020
-6152a97020L819K1615L8784M6654L3299j039k2025k2740k8463k5259m273L5311O7743Q6938
-6138C3344R2663Q7654P4301N7876M4522M8576N8115N7757K5326k2665n5097o3737o6599o1830
-6124C10206n8968m7164j4733J9189N1621O7299P6838P4453N3469J2303k3943l3005k3467
-6111D64098n894J1275J2228j2571n9162r9224j05662q4678l5762L4823R9448J31878J33191
-6098D83988J04574N4974K2542n149k2315l6031o0827q5274q5270n8923j8857J6461M5081
-6085C54974N6405N6408O7135J14833J75279K15345J91443J01784R733k6511j3280M2048Q8784
-6072A434380J09772R0543N0484K5441O5507J39905K21940K58661J72816j0895j23450j23510
-6060B311594n2925j1789j4651m7678n0540m4399l8676l4682K4458J01124J56448J46671R1347
$$ plain form
-6152 -197020 -193201 -171586 -132802 -86148 -52849 -53888 -75913 -98653 -127116 -152375 -156648 -121337 -53594 33344
-6138 33344 126007 213661 287962 345838 390360 438936 497051 554808 580134 557469 502372 438635 372036 310206
-6124 310206 251238 204074 189341 208530 260151 327450 404288 478741 532210 544513 520570 487565 464098
-6111 464098 458204 469479 481707 469136 409974 310750 205088 120410 84648 119471 218919 350797 483988
-6098 483988 588562 643536 666078 660929 638614 602583 541756 456482 371212 312289 293432 309893 354974
-6085 354974 411379 467787 534922 649755 825034 1040379 1231822 1333606 1343339 1316828 1303548 1345596 1434380
-6072 1434380 1544152 1634695 1685179 1710620 1776127 1916032 2137972 2396633 2569449 2558554 2435104 2311594
-6060 2311594 2258669 2246880 2232229 2184551 2134011 2089612 2050936 2016254 2040712 2141836 2298284 2444955 2536302
-6047B536302j270p9484j07387p1137p0784r1764p2929L9629J66289K63586K92675L09849
-6035C113575K72525K05758Q9622j9114j22605j13066l6996P1748J46623K62994L76980M78093
-6023D726137N31066O16914O82252P22319O66992N92590M65727L49359K28636J80946R0808
-6012I853746m4643j62804o9323J17396M58878Q69721J268438J449671J596565J717584K059071
-6001A9114300K543154L071594L443055L929523M626083N780255O983664P840236Q232989
-5992F5564853R402427J2815232J9192756K8620233M2678251O3122465R2682639J33791662
-5984D67870518J82505337K07593470J42030675k5889667j60324962j88089377j62970420
-5977D62725574j23972445q6457110n7501598l8426295k5386510j5693391p138793R55674
$$ plain form
-6047 2536302 2535032 2455548 2348161 2277024 2206240 2114476 2041547 2081176 2247465 2511051 2803726 3113575
-6035 3113575 3386100 3591858 3681480 3662366 3539761 3426695 3389699 3461447 3608070 3871064 4248044 4726137
-6023 4726137 5257203 5874117 6556369 7278688 7945680 8538270 9003997 9353356 9581992 9762938 9853746
-6012 9853746 9809103 9646299 9576976 9694372 10153250 11022971 12291409 13741080 15337645 17055229 19114300
-6001 19114300 21657454 24729048 28172103 32101626 36727709 42507964 49491628 57331864 65564853
-5992 65564853 74967280 87782512 106975268 135595501 178273752 241396217 334078856 467870518
-5984 467870518 650375855 857969325 1000000000 974110333 813785371 625695994 462725574
-5977 462725574 338753129 252296019 194794421 156368126 130981616 115288225 108149432 109105106
-5969A09105106R105699J5624385J6039425K908562j5541040k2712158k0554639j6226011
-5961G7749329j2103677q873888o265936m009095j798526M69763K998802O194236J0565545
-5952F4926553J6481402K2074019J9481424R12849j8601256k3155817j9552132j4351434r561145
-5943C8654463n743407l120289j094289P31409K859705N433223Q097359Q492262L066385n527903
-5933E1848918r472600r058618p296010n378742l711158k572244j770376j245750q32017n89732
-5923I921671m61323n16642n95102o65683o47165o68146o26181n55590m15377l10448j86928
-5912D273086j62123j76851k32172k27884k52680k59719k80699k23472j94852j94871k99792
-5901A767971l69666l37231j25478P4837J67597J23722O1256k4588k7692Q559N9944N0410
$$ plain form
-5969 109105106 118210805 133835190 149874615 152783177 137242137 114529979 93975340 77749329
-5961 77749329 65645652 56771764 50505828 46496733 44698207 45167970 48166772 54361008 64926553
-5952 64926553 81407955 103481974 122963398 123876247 105274991 82119174 62567042 48215608 38654463
-5943 38654463 32911056 29790767 28696478 29427887 32287592 37720815 45818174 54310436 57376821 51848918
-5933 51848918 42376318 33317700 26021690 20642948 16931790 14359546 12589170 11343420 10511403 9921671
-5923 9921671 9460348 8943706 8348604 7682921 7035756 6367610 5741429 5185839 4770462 4460014 4273086
-5912 4273086 4110963 3934112 3701940 3474056 3221376 2961657 2680958 2457486 2262634 2067763 1767971
-5901 1767971 1398305 1061074 935596 1010433 1178030 1301752 1363008 1338420 1310728 1319287 1379231 1429641
-5889A429641J7020o8823j35653j75712j04414K3406J55275J72448J33812N5600J7918j0693
-5877A509825q075k9055k9775o6018r2610j25038j14839j14840r0397p3227j0988L2889R3221
-5864H81073J21838J42211J09779N0879m2599r6374j40251j46690j37151q5646n3215j8399
-5852E85455j2676L838n701O18O19L5926M5465N7984M0815L3601k645l8058p8119q2554q2550
-5837E02018o9911o9912n5130m1772q76L5371O6294N2943M5073K7904L5532M1258N9262N9263
-5823F87317N8800L4004J3495j5120j5601j5597p966p966J4103K7460L3304J6133Q619q548
-5809H22437j1170k4525k0680l0218n2156j11293j53624j47900o5154R252L4809J7639J1915
-5796B79332J1920J7043J7042K2766J7047J8589J2866L47k8266m2518m2517k3798o625K0050
$$ plain form
-5889 1429641 1446661 1377838 1242185 1066473 962059 985465 1140740 1313188 1447000 1502600 1520518 1509825
-5877 1509825 1501750 1472695 1442920 1376902 1284292 1159254 1044415 929575 839178 765951 754963 787852 881073
-5864 881073 1002911 1145122 1254901 1305780 1263181 1166807 1026556 879866 742715 657069 603854 585455
-5852 585455 572779 576617 570916 571534 572153 608079 653544 711528 752343 785944 783299 745241 667122 584568 502018
-5837 502018 432107 362195 307065 265293 264417 299788 366082 419025 464098 492002 527534 568792 628054 687317
-5823 687317 746117 780121 793616 778496 762895 747298 739332 731366 745469 772929 806233 822366 830985 822437
-5809 822437 811267 786742 766062 735844 683688 572395 418771 270871 205717 214969 249778 267417 279332
-5796 279332 291252 308295 325337 348103 365150 383739 396605 396952 368686 326168 283651 259853 253228 273278
-5782B73278K9588L2211J8861J5698O159M967m568r751j9286j7736k7274k2748k2743l786
-5768B52870N753K292j1059j3086j3086o591q65Q257J1119K1041J5321J0075p094j8068k0925
-5753B35954j2102j4964j2747j2743j5306k4845j2926M33J7005J7006J3119m050j4901l5885
-5739A23048l6481j9312L342R065O443P19J673m050r51J2404K5997L5535L3389K0035J0257
-5724B21113l096J643P366J1659j695j6421k5959l3471l3471k2740j7016j1234n511r02l759
-5709F6506l223l223K31K34M14L275J4465K0191K4782J5243J0977J442p143j2866j7140k2859
-5693I1306k9775l9313l3533j6361J166M028j803m661p27M997J7631K7173K7174J7635O759
-5678G1696J036P97P98K407K407k780q503j3928j1066l018K705J2542K5896K1067J1528R714
$$ plain form
-5782 273278 302866 335077 353938 369636 375795 380762 376194 366443 347157 329421 302147 279399 256656 252870
-5768 252870 258623 260915 249856 236770 223684 217093 216228 224485 235604 256645 271966 282041 274947 256879 235954
-5753 235954 223852 208888 196141 183398 168092 143247 130321 130754 147759 164765 177884 173834 158933 123048
-5739 123048 86567 67255 70597 79662 86105 86824 88497 84447 83496 95900 121897 157432 190821 210856 221113
-5724 221113 218017 219660 227026 238685 236990 220569 194610 161139 127668 104928 87912 76678 71167 70265 66506
-5709 66506 63283 60060 60291 60525 60939 64214 78679 98870 123652 138895 149872 151314 144171 131305 114165 91306
-5693 91306 61531 22218 -11315 -27676 -26510 -22482 -24285 -28946 -29673 -24676 -7045 20128 47302 64937 71696
-5678 71696 72732 73529 74327 76734 79141 76361 67858 53930 42864 39846 42551 55093 80989 102056 113584 123298
-5662A23298O852l104j6458l0348l6072k8619j5266j0122p262p64M959J6584J6584R311L589
-5647C3162k396q119q119q119o598o599m572m571K701J2240J4147J9870K6429K6429K0109
-5632A05994K0109K0494K0493K0314J7453J1222N500r99o721j1879j7602k7736k7737l1552
-5618I7353m1090l5487k5947j8250m892K496J2039J3228P506M285M289p38o457r560r557q667
-5602a9449k940m732j866j144J721N652J1380R050R053R766M047L312L316k053p772n302M25
-5585A2464j904R61J185J188p78M944J572m147n339j1062j7810q268K999Q723Q898J1762P411
-5568A2799J688j070M658N850N850M504M509J826M687R550J5276J6469J9331J3276p5j1819
-5552A07309j1819p958J580r25r24M919M918K057K057N305N306Q168Q167O975O975Q883J8422
$$ plain form
-5662 123298 130150 127046 110588 80240 44168 15549 283 -9839 -17101 -17865 -12906 3678 20262 29573 33162
-5647 33162 30766 22647 14528 6409 -189 -6788 -11360 -15931 -13230 -990 13157 33027 59456 85885 105994
-5632 105994 126103 146597 167090 187404 204857 216079 221579 220580 213859 201980 184378 156642 128905 97353
-5618 97353 56263 20776 -5171 -23421 -28313 -25817 -13778 -550 6956 11241 15530 14792 8335 -1225 -10782 -19449
-5602 -19449 -22389 -27121 -28987 -30131 -28410 -22758 -11378 -2328 6725 16491 20538 23850 27166 25113 17341 12039 12464
-5585 12464 10560 11521 12706 13894 13116 18060 19632 15485 10146 -916 -18726 -26994 -23995 -15272 -6374 5388 12799
-5568 12799 14487 13417 18075 23925 29775 34279 38788 40614 45301 54851 70127 86596 105927 119203 119128 107309
-5552 107309 95490 87532 89112 88187 87263 92182 97100 99157 101214 106519 111825 119993 128160 135135 142110 150993 169415
-5535A69415L0087L9627M1295M7019N0357O7527Q9704J18319J52055J95933K35041K82735
-5523A519114L25032L57463L55794L11916K33659J32553k895j30712k29233k99814l36121
-5512B236756l33259l09707k65825k19981j68472j21021q0955n0611k5810j4505j1640k1477
-5500F13493l1015l9306m5025m8126m2402l5848k2490j6529o990R35J4293K0494K6216K0538
-5486D08238J4814J0284M561j0403j6126k5606l1328l7141l4279k8497k2773j8303j8302k2296
-5472A72843j9435j6264o726o546l685r647j2508j6741j6741j3045j0183k0378k6100k4729
-5458b9885p561J979J979m92m88J538J539j5R528P500P501m5m1l379l380m903m900o152l290
-5439c2967p511j785k143P19K355K359K656Q380K743K746l991o852j4606q879n123O00P0N798
$$ plain form
-5535 169415 199502 239129 280424 327443 377800 445327 535031 653350 805405 1001338 1236379 1519114
-5523 1519114 1844146 2201609 2557403 2869319 3102978 3235531 3232636 3101924 2872691 2572877 2236756
-5512 2236756 1903497 1593790 1327965 1107984 939512 818491 737536 686925 661115 646610 634970 613493
-5500 613493 582478 543172 498147 450021 407619 371771 349281 332752 325762 326697 340990 361484 387700 408238
-5486 408238 423052 433336 437897 427494 411368 385762 354434 317293 283014 254517 231744 213441 195139 172843
-5472 172843 153408 137144 130418 123872 120187 110540 98032 81291 64550 51505 41322 20944 -5156 -29885
-5458 -29885 -37446 -35467 -33488 -33980 -34468 -32930 -31391 -31406 -21878 -14378 -6877 -6922 -6963 -10342 -13722 -18625 -23525 -29677 -32967
-5439 -32967 -40478 -42263 -44406 -43687 -41332 -38973 -36317 -27937 -25194 -22448 -26439 -33291 -47897 -56776 -61899 -61299 -61229 -55431
-5421e5431N794Q659O808R672R312R315K694l026q395n529m549j685j211J655j766J099l36
-5404b6920l31K496K500M464J606m687J039l972j106l257l253k958K768J804J803P31P30K429
-5386b4114K430r10r09K281K280K280K281l801l801l800l801q715q715o927o926l916J807
-5369f2976j60N563M922P783M982K120L91L253J464J465K604K605K604K605K217K217K217
-5352a4124K217j286j285n519q379p933k210k865O673L048L048K213K214M24M25M25M25k825
-5334b5314k824k467k466l987J736J856J855k336k336k336k336j413j412j054j055m989P34
-5317e0144k306k307k664J98l39N384O125O126M099M098l890l890j505j505l413l413j983
-5300e1329j982M62M62K847K847M374M374m687m687K287K288L719L718l525l524m956m956
$$ plain form
-5421 -55431 -49637 -40978 -34170 -24498 -15186 -5871 -3177 -6203 -14598 -20127 -24676 -26361 -27572 -25917 -27683 -26584 -26920
-5404 -26920 -27251 -24755 -22255 -17791 -16185 -20872 -19833 -23805 -24911 -28168 -31421 -34379 -31611 -29807 -28004 -27273 -26543 -24114
-5386 -24114 -21684 -22594 -23503 -21222 -18942 -16662 -14381 -18182 -21983 -25783 -29584 -38299 -47014 -53941 -60867 -64783 -62976
-5369 -62976 -63136 -57573 -52651 -44868 -39886 -37766 -37375 -34122 -32658 -31193 -28589 -25984 -23380 -20775 -18558 -16341 -14124
-5352 -14124 -11907 -13193 -14478 -19997 -28376 -36309 -38519 -41384 -34711 -31663 -28615 -26402 -24188 -23764 -23339 -22914 -22489 -25314
-5334 -25314 -28138 -30605 -33071 -37058 -35322 -33466 -31611 -33947 -36283 -38619 -40955 -42368 -43780 -44834 -45889 -50878 -50144
-5317 -50144 -52450 -54757 -57421 -57223 -57562 -52178 -46053 -39927 -35828 -31730 -35620 -39510 -41015 -42520 -45933 -49346 -51329
-5300 -51329 -53311 -52849 -52387 -49540 -46693 -42319 -37945 -42632 -47319 -45032 -42744 -39025 -35307 -38832 -42356 -47312 -52268
-5283e2268k46k45L092L093J192J192k742k742k594L130j699J163K384K385J79J79K384K385
-5265c9778M769M770M139M144N03n217q171j1029k1346k1343k1019p660P180J2907P299M441
-5249h5411P657J0523M635M639M4M9p437p434m575m572K698K701M128M133N678N682M248M251
-5231d8363K206K210k564k560o85o82l547l544n514n511p45p42J878J882M739M744N808N813
-5213d5177J040J043j107j103j106j103N03N07N03N06L365L368J0042J0045J360J364l406
-5196a9356l405j204j200J662J662k306k303k303k302m662m657m479m479j210J654M516j207
-5179d5579j897m754o41o41O37O41j863j863n444K83J834J833L200L205L39L43K783K787K783
-5160d2014K787J204J207j658j654n831n828m222j356M73O200P449M590L812R54q39q34K6
$$ plain form
-5283 -52268 -52514 -52759 -49667 -46574 -45382 -44190 -46932 -49674 -52268 -49138 -50837 -49674 -47290 -44905 -44726 -44547 -42163 -39778
-5265 -39778 -35009 -30239 -26100 -21956 -21453 -26670 -34841 -45870 -67216 -88559 -109578 -117238 -110058 -97151 -89852 -85411
-5249 -85411 -77754 -67231 -62596 -57957 -57913 -57864 -65301 -72735 -77310 -81882 -79184 -76483 -72355 -68222 -62544 -56862 -52614 -48363
-5231 -48363 -46157 -43947 -46511 -49071 -49756 -50438 -53985 -57529 -63043 -68554 -69299 -70041 -68163 -66281 -61542 -56798 -50990 -45177
-5213 -45177 -44137 -43094 -44201 -45304 -46410 -47513 -47010 -46503 -46000 -45494 -42129 -38761 -28719 -18674 -17314 -15950 -19356
-5196 -19356 -22761 -23965 -25165 -23503 -21841 -24147 -26450 -28753 -31055 -35717 -40374 -44853 -49332 -50542 -48888 -44372 -45579
-5179 -45579 -47476 -52230 -52871 -53512 -52875 -52234 -54097 -55960 -61404 -61121 -59287 -57454 -54254 -51049 -50710 -50367 -47584 -44797 -42014
-5160 -42014 -39227 -38023 -36816 -38474 -40128 -45959 -51787 -56009 -57365 -56892 -50692 -43243 -38653 -34841 -33887 -34726 -35560 -35534
-5142c5534n693k478k474m386m382m385m382l104l104J666J666J874J874r87r88o59o60P71
-5124f5365P72M13M14j017j018K631K631k31k31L793L793K243l480j066j066J439J438J170
-5106e2737J170K958k764J866J867J509J513l290l290m29m25M36M36L656k065m631m631m990
-5088f3841m985J289J289J290J292R7R7k764k761L226L227PJ2P82m941m583m579J777J778
-5069g2291J777J781N772N771J003J006L059L059J97K01j591j591j591j587j610j609j610
-5052e9854j606L58L58L577k143l107l108o03o00j856j855j856j852q34q31q35q31M173M177
-5033f9128M177M177j133j129j133j129m76m74m73m73j643j640L126L130K65K68J699J699
-5015f0290K13K16j219j214j308j304J26J27l458l457n97n96J819J818J818J822j550j550
$$ plain form
-5142 -35534 -41227 -43705 -46179 -50565 -54947 -59332 -63714 -66818 -69922 -68256 -66590 -64716 -62842 -63829 -64817 -65476 -66136 -65365
-5124 -65365 -64593 -64180 -63766 -64783 -65801 -63170 -60539 -60770 -61001 -57208 -53415 -51172 -54652 -55718 -56784 -55345 -53907 -52737
-5106 -52737 -51567 -48609 -51373 -49507 -47640 -46131 -44618 -47908 -51198 -51627 -52052 -51616 -51180 -47524 -49589 -54220 -58851 -63841
-5088 -63841 -68826 -67537 -66248 -64958 -63666 -63569 -63472 -66236 -68997 -65771 -62544 -62537 -62525 -61743 -66684 -71267 -75846 -74069 -72291
-5069 -72291 -70514 -68733 -62961 -57190 -56187 -55181 -52122 -49063 -48866 -48665 -50256 -51847 -53438 -55025 -56635 -58244 -59854
-5052 -59854 -61460 -61102 -60744 -57167 -59310 -62417 -65525 -66128 -66728 -68584 -70439 -72295 -74147 -74981 -75812 -76647 -77478 -73305 -69128
-5033 -69128 -64951 -60774 -61907 -63036 -64169 -65298 -65774 -66248 -66721 -67194 -68837 -70477 -67351 -64221 -63956 -63688 -61989 -60290
-5015 -60290 -60077 -59861 -61080 -62294 -63602 -64906 -64780 -64653 -68111 -71568 -72165 -72761 -70942 -69124 -67306 -65484 -67034 -68584
-4997f8584j550j550P15P16P15P19J480J479J479J479J331J330K761K764J263J264j599j598
-4979e5386l626l625k076L652l17l16j390j390J233J234j629j628J792J792L62L61L92L91
-4961f0174k471k470J967J968O379O379J639m084k295k295J088J088L949L950K310K310n51
-4944d1313n52r35r31r36r31l350l346J420J423L62L65J434J439L074k646m199m196k604k601
-4925e9023K57K61J867J870J867J870N206N209J747l972j621j617J241m479J100J102o89o85
-4907d8489k091k086P71P75J010J013O52O56L931j788l343l338L566L569n019n015m900m896
-4889f5022m900m896P49P53P49P53K72K75L134L137K568K570k94k91j963j960o733o729J732
-4870g6096J737M594M598K865K869K866K869O561O565L402L406N607Q43j547m404o479o476
$$ plain form
-4997 -68584 -70134 -71684 -70969 -70253 -69538 -68819 -67339 -65860 -64381 -62902 -61571 -60241 -57480 -54716 -53453 -52189 -53788 -55386
-4979 -55386 -59012 -62637 -64713 -61061 -61378 -61694 -63084 -64474 -63241 -62007 -63636 -65264 -63472 -61680 -61318 -60957 -60565 -60174
-4961 -60174 -62645 -65115 -63148 -61180 -54801 -48422 -46783 -50867 -53162 -55457 -54369 -53281 -49332 -45382 -43072 -40762 -41313
-4944 -41313 -41865 -42800 -43731 -44667 -45598 -48948 -52294 -50874 -49451 -49089 -48724 -47290 -45851 -42777 -45423 -49622 -53818 -56422 -59023
-4925 -59023 -58766 -58505 -56638 -54768 -52901 -51031 -45825 -40616 -38869 -42841 -44462 -46079 -44838 -49317 -48217 -47115 -47804 -48489
-4907 -48489 -50580 -52666 -51895 -51120 -50110 -49097 -48445 -47789 -43858 -45646 -48989 -52327 -48761 -45192 -50211 -55226 -60126 -65022
-4889 -65022 -69922 -74818 -74069 -73316 -72567 -71814 -71542 -71267 -68133 -64996 -62428 -59858 -60152 -60443 -62406 -64366 -71099 -77828 -76096
-4870 -76096 -74359 -69765 -65167 -62302 -59433 -56567 -53698 -47137 -40572 -37170 -33764 -28157 -27314 -28861 -33265 -39744 -46220
-4853d6220l797l793o361o356l320l316K284N149O219J453j531j528J032J036J807J811J807
-4836e3624J811k664k661k664k660K869K873K690K694O148L290l50q932j1811n131r61l819
-4819g2902j617J248L927J069J517J516J338J338L364L365L364L365L298L297l379l380l707
-4802e2979l708l409l409k385K385K563k98Q05k057M47L309L286M25J140j721k854PJ081l689
-4783f1061m788j926R35R35K187K187K367K366k43K620O52m117j495m355j971Q90P42k120
-4765f6195k121P42M557J695O22O23M184M184n85n85k701k701K068K067m91m92R39R39k072
-4746e5323k072j714p437j907j908N96N96M650M650J789J788L581L581P19P19o52o52j010
-4728e0006j010M445j278k828k828r80r80l483l484m147J576J218J219n70n70l671r393q141
$$ plain form
-4853 -46220 -50017 -53810 -60171 -66527 -69847 -73163 -70879 -65730 -59511 -58058 -59589 -61117 -60085 -59049 -57242 -55431 -53624
-4836 -53624 -51813 -54477 -57138 -59802 -62462 -59593 -56720 -54030 -51336 -45188 -41898 -42248 -51180 -62991 -68122 -69083 -72902
-4819 -72902 -74519 -73271 -69344 -68275 -66758 -65242 -63904 -62566 -59202 -55837 -52473 -49108 -45810 -42513 -45892 -49272 -52979
-4802 -52979 -56687 -60096 -63505 -65890 -63505 -60942 -61240 -60435 -62492 -62045 -58736 -55450 -55025 -53885 -55606 -58460 -58453 -57372 -61061
-4783 -61061 -65849 -67775 -66840 -65905 -63718 -61531 -59164 -56798 -57041 -54421 -53769 -57886 -59381 -63736 -65707 -64817 -64075 -66195
-4765 -66195 -68316 -67574 -63017 -61322 -60700 -60077 -55893 -51709 -52294 -52879 -55580 -58281 -56213 -54146 -54637 -55129 -54190 -53251 -55323
-4746 -55323 -57395 -59109 -66546 -68453 -70361 -69765 -69169 -64519 -59869 -58080 -56292 -52711 -49130 -48411 -47692 -48344 -48996 -50006
-4728 -50006 -51016 -46571 -47849 -50677 -53505 -54485 -55465 -58948 -62432 -66579 -65003 -63785 -62566 -63136 -63706 -67377 -76770 -84911
-4710h4911k418P716J994J337J338K411K410J323J323j08j08k165k165l596l595L677L678
-4693g1859O181O182L946j778n235n235j367j368j367j367j16j15q31M892M683j039k232k232
-4675g0257p41p42K120K120M382M382M382M382m978m978p482p482o170m47L010L011P064P065
-4657f1359J699m024l160l159L159L160L130L130l548l547R39R39m92m92k429k429k430k429
-4639g3342k65k64K597K597p12p11k143k142k351k352k351k351j278j278M51M51J19M892N068
-4620g5365N071J759J762L28L31l57l54J252J255q9K776k68k65n44n40n44n40K01K05K01K05
-4599f3520L20L24N00N03o93K172K168o89j405j404j584j583k597k597n101l32L469O330O629
-4580e9090L767n25n26n25n25m896k035j736m598r02L868L867O730M016p52m568m569m54m55
$$ plain form
-4710 -84911 -87329 -79613 -77619 -76282 -74944 -72533 -70123 -68800 -67477 -67585 -67693 -69858 -72023 -75619 -79214 -75537 -71859
-4693 -71859 -65678 -59496 -55550 -57328 -62563 -67798 -69165 -70533 -71900 -73267 -73383 -73498 -74329 -69437 -64754 -65793 -68025 -70257
-4675 -70257 -70998 -71740 -69620 -67500 -63118 -58736 -54354 -49972 -54950 -59928 -67410 -74892 -81062 -81509 -78499 -75488 -68424 -61359
-4657 -61359 -59660 -63684 -66844 -70003 -66844 -63684 -60554 -57424 -60972 -64519 -63580 -62641 -63133 -63625 -66054 -68483 -70913 -73342
-4639 -73342 -73607 -73871 -71274 -68677 -69389 -70100 -72243 -74385 -76736 -79088 -81439 -83790 -85068 -86346 -85895 -85444 -85325 -80433 -75365
-4620 -75365 -70294 -68535 -66773 -66445 -66114 -66471 -66825 -65573 -64318 -64407 -61631 -61899 -62164 -62708 -63248 -63792 -64332 -64131 -63926 -63725 -63520
-4599 -63520 -63200 -62876 -62376 -61873 -62566 -60394 -58226 -58915 -60320 -61724 -63308 -64891 -67488 -70085 -75186 -75518 -72049 -65719 -59090
-4580 -59090 -55323 -55848 -56374 -56899 -57424 -62320 -64355 -66091 -70689 -71591 -67723 -63856 -57126 -53110 -53862 -58430 -62999 -63453 -63908
-4561f3908m54m55j237j237j237j237J267J267J267J266r39r39r39r38J952J952N22N22K157
-4542f1348K157q83q83J740j121p64p64p93K067M59M58M125M124m65m66k489L76k310n168
-4523f1948q49K015M03M06P90L655L652L655M02L268N81k276n768k903j04j01m128o986n202
-4504g1438m28L196L201K064K068K810K813k31K634J103J103K712K713j371j371J490J490
-4487d5442n73n74Q57Q57R46R47j916j915m501m501K68K69l309l309l308l309J401J401J401
-4468f4310J401k68k69k68k68J408J412J409J412j71j68j71j68o0n6J371J375l368l365n06
-4448f3628n03K682K687j79j75L935L938q35q30J535J538J536J538L741L745j028j025l886
-4430d5214l887j024j025r65r65r65r65l178l179j628M095L99L98k462L260K478K477J644
$$ plain form
-4561 -63908 -64362 -64817 -66054 -67291 -68528 -69765 -68498 -67231 -65964 -64698 -65637 -66576 -67515 -68453 -66501 -64549 -64027 -63505 -61348
-4542 -61348 -59191 -60074 -60957 -59217 -60338 -61102 -61866 -62659 -60592 -60133 -59675 -55550 -51426 -51891 -52357 -54846 -54470 -56780 -61948
-4523 -61948 -62797 -60782 -60379 -59973 -59183 -55528 -51876 -48221 -47819 -44551 -43970 -46246 -52014 -54917 -55021 -55122 -59250 -66236 -71438
-4504 -71438 -71866 -68670 -65469 -63405 -61337 -58527 -55714 -55945 -53311 -52208 -51105 -48393 -45680 -47051 -48422 -46932 -45442
-4487 -45442 -46015 -46589 -45732 -44875 -43929 -42982 -44898 -46813 -51314 -55815 -55547 -55278 -58587 -61896 -65204 -68513 -67112 -65711 -64310
-4468 -64310 -62909 -63177 -63446 -63714 -63982 -62574 -61162 -59753 -58341 -58512 -58680 -58851 -59019 -59079 -59135 -57764 -56389 -59757 -63122 -63628
-4448 -63628 -64131 -61449 -58762 -58941 -59116 -55181 -51243 -52078 -52908 -51373 -49835 -48299 -46761 -43020 -39275 -40303 -41328 -45214
-4430 -45214 -49101 -50125 -51150 -52115 -53080 -54045 -55010 -58188 -61367 -62995 -58900 -58501 -58103 -60565 -57305 -54827 -52350 -50706
-4412e0706m080n183N40n6K806J732j129Q39k023l574l573k321k322l72l69M397M400P90P94
-4393e9410P90P93J461J464K68n451n634R4K712j45l320o178m750m747p57p52K105K109k95
-4374g9643k90k95k90M21M24L283L286q04q01q05q01M978M981K09K12J543J546j319j315L569
-4354f1911L574L569L573r98r99r98r99j356j356j357j356l35l36l35l35Q57Q57l555l555
-4335f7351k857K869K507K512J315J319k083P82l83o104k887k3J942J945k649k646M1M1M1
-4316g1669M1L052L051N913N914O37O37K426l298n414n414j002j002j547j546N131N130k261
-4298f1221k262O00O00l484l484J286J285k64k65k232O30L905j819m739m740l755J967L517
-4280g4475L518J937J938N06N07j490j491j490j490L450L454L450L454L50L54L51L54j677
$$ plain form
-4412 -50706 -54786 -59969 -59429 -59485 -56679 -54947 -56076 -55237 -57260 -60834 -64407 -66728 -69050 -69422 -69791 -65394 -60994 -60204 -59410
-4393 -59410 -58620 -57827 -56366 -54902 -54634 -60085 -65719 -65625 -62913 -63058 -66378 -72556 -77306 -82053 -82810 -83562 -81457 -79348 -79643
-4374 -79643 -79933 -80228 -80518 -80097 -79673 -76390 -73104 -73908 -74709 -75514 -76315 -71337 -66356 -66147 -65935 -64392 -62846 -64165 -65480 -61911
-4354 -61911 -58337 -54768 -51195 -52193 -53192 -54190 -55189 -56545 -57901 -59258 -60614 -60949 -61285 -61620 -61955 -61098 -60241 -63796 -67351
-4335 -67351 -70208 -67339 -64832 -62320 -61005 -59686 -61769 -60987 -61370 -67474 -70361 -70384 -68442 -66497 -69146 -71792 -71751 -71710 -71669
-4316 -71669 -71628 -68576 -65525 -59612 -53698 -53061 -52424 -49998 -53296 -58710 -64124 -65126 -66128 -67675 -69221 -64090 -58960 -61221
-4298 -61221 -63483 -62883 -62283 -65767 -69251 -67965 -66680 -66944 -67209 -69441 -68811 -64906 -66725 -71464 -76204 -79959 -77992 -74475
-4280 -74475 -70957 -69020 -67082 -66576 -66069 -67559 -69050 -70540 -72030 -68580 -65126 -61676 -58222 -57872 -57518 -57167 -56813 -58490
-4262e8490j673j677j673o33o30P98Q01k039k034k396L331M073M076l39l35q76q72J986J990
-4243e6612J151J155j710j707m132m132j270j271J472J472J471J472R06R05R05R06p64p64
-4225f0547J144j718m721M9M8M9p27p26p27p26J061J062j799j800l69l69k276N85K056k708
-4205g3159j461J405P45P49j759j755R84L849M918J53k057k053m47l305j408L364N269N272
-4187f0696M40M43M40M43k764k761R6J01j692j687j692j688Q98Q98j964j960P20P19L580j184
-4167f9310j383J479K434K436J301J300J300J305J427J427n250n246l02l02l02k98J360J360
-4149f5264n48K318N85m184m006P68O59O60R57R58L02L01L02L02K627K627k143k142Q98Q98
-4129f3125Q98Q98j744j744j744j743J535J535J535J535N388N388O18O19l95l95l257l256
$$ plain form
-4262 -58490 -60163 -61840 -63513 -64146 -64776 -63978 -63177 -65216 -67250 -69646 -66315 -62242 -58166 -58505 -58840 -59716 -60588 -58602 -56612
-4243 -56612 -55461 -54306 -56016 -57723 -61855 -65987 -67257 -68528 -67056 -65584 -64113 -62641 -61735 -60830 -59925 -59019 -59783 -60547
-4225 -60547 -59403 -61121 -65842 -65793 -65745 -65696 -66423 -67149 -67876 -68602 -67541 -66479 -68278 -70078 -70447 -70816 -73092 -72507 -70451 -73159
-4205 -73159 -74620 -73215 -72470 -71721 -73480 -75235 -74251 -70402 -65484 -65331 -67388 -69441 -69888 -73193 -74601 -71237 -65968 -60696
-4187 -60696 -60256 -59813 -59373 -58930 -61694 -64455 -64359 -64258 -65950 -67637 -69329 -71017 -70119 -69221 -71185 -73145 -72425 -71706 -68126 -69310
-4167 -69310 -70693 -69214 -66780 -64344 -63043 -61743 -60443 -59138 -57711 -56284 -61534 -66780 -67082 -67384 -67686 -67984 -66624 -65264
-4149 -65264 -65812 -63494 -62909 -67093 -71099 -70331 -69672 -69012 -68055 -67097 -66795 -66494 -66192 -65890 -63263 -60636 -62779 -64921 -64023 -63125
-4129 -63125 -62227 -61329 -63073 -64817 -66561 -68304 -66769 -65234 -63699 -62164 -56776 -51388 -50770 -50151 -50546 -50941 -54198 -57454
-4111e7454l652l648p86p86l592l588J181J181J744J748M430l39o305o300j830j829k50k46
-4093h0321K616K616K135K138p23p22l171l167O48N418M638J781Q28Q27n78n77n78n77P34
-4074f6035P34P34P34J568J569j293j293j829j830j829j830j576j576j576j576J524J524J524
-4056g2332J524J039J040J039J040j762j763j762j763k187k183K582K586J151J155j710j707
-4039g4013J636J640J635J640P41P45L305L309L860r05l294l290j625o390k459M06q94q91
-4021g4844p15p12%M%MJ930J934r32r28O79O81O79O81j11j08j12j08L167L171L05L09j110
-3998f6136j110j111j110r7r7r7r6O7O7O7O7O93O93O93O93j461j456K831K836J341J345J342
-3976f0036J345J04J08k280k277j684j680l115l112p37p38p38p38L227L227p68p67Q72N641
$$ plain form
-4111 -57454 -61106 -64754 -65540 -66326 -69918 -73506 -72325 -71144 -69400 -67652 -63222 -63561 -69866 -76166 -77996 -79825 -80075 -80321
-4093 -80321 -77705 -75089 -72954 -70816 -71539 -72261 -75432 -78599 -77951 -72533 -67895 -66114 -65286 -64459 -65037 -65614 -66192 -66769 -66035
-4074 -66035 -65301 -64567 -63833 -62265 -60696 -61989 -63282 -65111 -66941 -68770 -70600 -72176 -73752 -75328 -76904 -75380 -73856 -72332
-4056 -72332 -70808 -69769 -68729 -67690 -66650 -68412 -70175 -71937 -73700 -75887 -78070 -75488 -72902 -71751 -70596 -72306 -74013
-4039 -74013 -72377 -70737 -69102 -67462 -66721 -65976 -62671 -59362 -55502 -56407 -59701 -62991 -64616 -71006 -73465 -73059 -73953 -74844
-4021 -74844 -75559 -76271 -76271 -76267 -76267 -76263 -74333 -72399 -73331 -74259 -73580 -72899 -72220 -71539 -71650 -71758 -71870 -71978 -68811 -65640 -65335 -65026 -66136
-3998 -66136 -67246 -68357 -69467 -69564 -69661 -69758 -69854 -69787 -69720 -69653 -69586 -68893 -68200 -67507 -66814 -68275 -69731 -66900 -64064 -62723 -61378 -60036
-3976 -60036 -58691 -58587 -58479 -60759 -63036 -64720 -66400 -69515 -72627 -73364 -74102 -74840 -75578 -72351 -69124 -69892 -70659 -69787 -64146
-3957f4146L435j334j125J736K512k258k914k910n597n592R31R35L019L021L480j285m509
-3940g2601j643J573J576j587j584J841J844L271L276N2N6k333k329j259j256k690k686J423
-3922g5056J427J423J428O96P01P00P01P56P60j624j625p79p75m113m114J16J19J19J20K366
-3902g6654K369K370K370J531J535J714J714k254O11J863k906j658J207P30P31J620J625k672
-3884f4154k667j659j654J681J684K217K220j121j118j062j058l447l442j23j20L54m411l134
-3866h1014k68K589k68K016q42j025J841O74O78k485k481O00O03k079k079K537k228r76r76
-3847h5183O07O11O11O11M59M62K846K847J53J56m136m136m73m69K869K869K522K527K526
-3828g1721K526j680j677j677j676j718j718j718j717K20K19K20K20L037L036J606J606l31
$$ plain form
-3957 -64146 -60711 -62045 -63170 -61434 -58922 -61180 -64094 -67004 -72601 -78193 -77262 -76327 -73308 -70287 -66807 -68092 -72601
-3940 -72601 -74244 -72671 -71095 -72682 -74266 -72425 -70581 -67310 -64034 -63982 -63926 -66259 -68588 -69847 -71103 -73793 -76479 -75056
-3922 -75056 -73629 -72206 -70778 -70082 -69381 -68681 -67980 -67224 -66464 -68088 -69713 -70492 -71267 -75380 -79494 -79378 -79259 -79140 -79020 -76654
-3902 -76654 -74285 -71915 -69545 -68014 -66479 -64765 -63051 -65305 -64694 -62831 -65737 -67395 -66188 -65458 -64727 -63107 -61482 -64154
-3884 -64154 -66821 -68480 -70134 -68453 -66769 -64552 -62332 -63453 -64571 -65633 -66691 -70138 -73580 -73703 -73823 -73469 -77880 -81014
-3866 -81014 -81282 -78693 -78961 -76945 -77787 -78812 -76971 -76297 -75619 -78104 -80585 -79985 -79382 -81461 -83540 -81003 -83231 -84207 -85183
-3847 -85183 -84576 -83965 -83354 -82743 -82284 -81822 -78976 -76129 -75976 -75820 -79956 -84092 -84565 -85034 -82165 -79296 -76774 -74247 -71721
-3828 -71721 -69195 -70875 -72552 -74229 -75905 -77623 -79341 -81059 -82776 -82556 -82337 -82117 -81897 -78860 -75824 -74218 -72612 -72943
-3810g2943l32k716k716j077j077l462l461J427J427J427J427J696J695M378l91J695J695
-3793g1308J100J099K325k441k444K329J282J285J580J583J670J673l577l574l189l186J103
-3776g2690J107M009M013m099m095m62m58m754m751j804j799L443L446j326j323j028j025
-3759h3596J025N794M542J680l029n891j777J084M691M691K485K486m282m281j896j897J278
-3742g6893J278J278J278N03N03N03N03Q01Q01o29o30p49p49J338J337K135k630k813k810
-3723g5645j710j706J151J155J867J870M430M434L358j409l201l35j15j12k798k795n6n2n6
-3704g1725n2J062J065J062J066j621j617J241J244P68P71P72P71q42q39q38q38J453J457
-3685f5640J278J278j57l014m982J696l81K486J293J293j454j449j449j450K675K679j82j83
$$ plain form
-3810 -72943 -73275 -75991 -78707 -79784 -80861 -84323 -87784 -86357 -84930 -83503 -82076 -80380 -78685 -74307 -74698 -73003 -71308
-3793 -71308 -70208 -69109 -66784 -69225 -71669 -69340 -68058 -66773 -65193 -63610 -61940 -60267 -63844 -67418 -70607 -73793 -72690
-3776 -72690 -71583 -67574 -63561 -67660 -71755 -72217 -72675 -77429 -82180 -83984 -85783 -82340 -78894 -80220 -81543 -82571 -83596
-3759 -83596 -82571 -76777 -72235 -70555 -73584 -79475 -81252 -80168 -75477 -70786 -68301 -65815 -70097 -74378 -76274 -78171 -76893
-3742 -76893 -75615 -74337 -73059 -72556 -72053 -71550 -71047 -70246 -69445 -70074 -70704 -71453 -72202 -70864 -69527 -67392 -70022 -72835 -75645
-3723 -75645 -77355 -79061 -77910 -76755 -74888 -73018 -68588 -64154 -60796 -62205 -65406 -65741 -65856 -65968 -68766 -71561 -71617 -71669 -71725
-3704 -71725 -71777 -70715 -69650 -68588 -67522 -69143 -70760 -69519 -68275 -67507 -66736 -65964 -65193 -66035 -66874 -67712 -68550 -67097 -65640
-3685 -65640 -64362 -63084 -63241 -66255 -71237 -69541 -69922 -67436 -66143 -64850 -66304 -67753 -69202 -70652 -67977 -65298 -65480 -65663
-3667f5663O49O52K559l01k273K500l65l62m84m81m84m81k377k373M84M88M061M066p08p05
-3647f1598L66L68L66L68l569l566p08p04k91k87k90k87K154K157K154K157q83q79q80q79
-3627f4731k87k83k83k84m06m02m03m02j956j953j952j952J620J625J624J625J263J267J267
-3608f5003J267j98j94j93j94k165k161k161k161j405j405L365L365k001k001k001k001K277
-3590g4970K276n85n85J31J30k731k731M88M88M88M88L827L827r43r43J681J680J680J681
-3571f4623P1P0P1P1k329k325k328k326j22j20j23j19l91l88K471K474M080M083J219J222
-3551e9362j90j86l052l048L47L50L46L51l685l682q23q20J800J803J800J803R06R09j956
-3532f6389j953l46l43l47l42k605k601k306k303l98M374J688l078l305m39m44M330L849R91
$$ plain form
-3667 -65663 -65014 -64362 -61803 -62104 -64377 -61877 -62242 -62604 -63088 -63569 -64053 -64534 -66911 -69284 -68800 -68312 -64251 -60185 -60893 -61598
-3647 -61598 -61232 -60864 -60498 -60130 -63699 -67265 -67973 -68677 -68968 -69255 -69545 -69832 -67678 -65521 -63367 -61210 -62093 -62972 -63852 -64731
-3627 -64731 -65018 -65301 -65584 -65868 -66274 -66676 -67079 -67481 -69437 -71390 -73342 -75294 -73674 -72049 -70425 -68800 -67537 -66270 -65003
-3608 -65003 -63736 -63934 -64128 -64321 -64515 -66680 -68841 -71002 -73163 -74568 -75973 -72608 -69243 -71244 -73245 -75246 -77247 -74970
-3590 -74970 -72694 -73279 -73864 -73733 -73603 -76334 -79065 -78577 -78089 -77601 -77113 -73286 -69459 -70402 -71345 -69664 -67984 -66304 -64623
-3571 -64623 -64552 -64482 -64411 -64340 -66669 -68994 -71322 -73648 -73770 -73890 -74013 -74132 -74523 -74911 -72440 -69966 -65886 -61803 -60584 -59362
-3551 -59362 -59552 -59738 -62790 -65838 -65491 -65141 -64795 -64444 -68129 -71811 -72634 -73454 -71654 -69851 -68051 -66248 -65342 -64433 -66389
-3532 -66389 -68342 -68688 -69031 -69378 -69720 -72325 -74926 -77232 -79535 -79933 -75559 -73871 -76949 -80254 -80693 -81137 -76807 -72958 -71967
-3513g1967j874j871Q83Q87Q83Q87k575k571K87K91K511K512K511K511j662j661J199J200
-3495f7619j125j125j126j125J915J915r46r46R76R76l793l793r32r31r32r31p83p82p82p83
-3475h2672L093L092K31K31j393j394j393j394K839K840k3k2j647j647K944K943K765r7j349
-3456g2053L421M888K027q34q35K683K682l994l994q20q20q19q20k787k787k787k787K597
-3438g7839K597K597K597J106J107L014J53k902J866O15k247n18n17o97o97J505J506j357
-3420f8111j356K53K54K53K54PPQPQPQPO48O49O48O48m24m25m25m25K09K09K08K09O86O85
-3393f5294k176k176k008k008Q53Q53R13R13R13R13p87p86l648l647M65M66M66M66R91R91
-3373g3327R91R91J945J945k824k825M256M255k422k422r32r31J930J930j788j789j788j789
$$ plain form
-3513 -71967 -73841 -75712 -74829 -73942 -73059 -72172 -74747 -77318 -77031 -76740 -74229 -71717 -69206 -66695 -68357 -70018 -68819 -67619
-3495 -67619 -68744 -69869 -70995 -72120 -70205 -68290 -69236 -70182 -69206 -68230 -72023 -75816 -76748 -77679 -78611 -79542 -80325 -81107 -81889 -82672
-3475 -82672 -79579 -76487 -76256 -76025 -77418 -78812 -80205 -81599 -78760 -75920 -75943 -75965 -77612 -79259 -76315 -73372 -70607 -70704 -72053
-3456 -72053 -68632 -63744 -61717 -62551 -63386 -60703 -58021 -62015 -66009 -66829 -67649 -68468 -69288 -72075 -74862 -77649 -80436 -77839
-3438 -77839 -75242 -72645 -70048 -68942 -67835 -64821 -64668 -67570 -65704 -65089 -67336 -67854 -68371 -69068 -69765 -68260 -66754 -68111
-3420 -68111 -69467 -69214 -68960 -68707 -68453 -68446 -68439 -68431 -68424 -68416 -68409 -68401 -68394 -67746 -67097 -66449 -65801 -66225 -66650 -67075 -67500 -67291 -67082 -66874 -66665 -65979 -65294
-3393 -65294 -67470 -69646 -71654 -73662 -72809 -71956 -71043 -70130 -69217 -68304 -69091 -69877 -73525 -77172 -76707 -76241 -75775 -75309 -74318 -73327
-3373 -73327 -72336 -71345 -69400 -67455 -70279 -73104 -68848 -64593 -67015 -69437 -70369 -71300 -69370 -67440 -69228 -71017 -72805 -74594
-3355g4594j252j252j252j252K847K847K548K549L502j267l055l055j532L242N55N59J569
-3338f8293J572J569J572r65r61J896J901j204j200P05k154l09M463L507O48j084L688O45
-3320e4004m121n295n291n175n172n354J326K039q20q35q31J848J852K027K031q35q31L212
-3302g4229L216L212L215J722J725J721J725k325k321k325k321j670j665j669j666J774J777
-3285g0104j088j084J594J599J595J598q27q27q27q28L883L882L883L882O923O923N373K512
-3267c1938l212p981p087m226j945j945j766j766k303k302k303k303M449M449J587J588N14
-3250e8490N14N14N15j2j1k873k872J062J061J062J062J360J360j501j502l052l051l052l051
-3231g0957k620k619K150K150J017J017J017J018J822J822J822J822K775K776N638N637Q98
$$ plain form
-3355 -74594 -75846 -77098 -78350 -79602 -76755 -73908 -71360 -68811 -65309 -66576 -69631 -72686 -74218 -70976 -70421 -69862 -68293
-3338 -68293 -66721 -65152 -63580 -64545 -65506 -63610 -61709 -62913 -64113 -63408 -65562 -65871 -61408 -57901 -57253 -58337 -54649 -54004
-3320 -54004 -58125 -63420 -68711 -73886 -79058 -84412 -83086 -81047 -81867 -82702 -83533 -81685 -79833 -77806 -75775 -76610 -77441 -74229
-3302 -74229 -71013 -67801 -64586 -62864 -61139 -59418 -57693 -60018 -62339 -64664 -66985 -68655 -70320 -71989 -73655 -71881 -70104
-3285 -70104 -71192 -72276 -70682 -69083 -67488 -65890 -66717 -67544 -68371 -69199 -65316 -61434 -57551 -53669 -46746 -39823 -34450 -31938
-3267 -31938 -35150 -43131 -50218 -54444 -56389 -58334 -60100 -61866 -64169 -66471 -68774 -71077 -66628 -62179 -60592 -59004 -58490
-3250 -58490 -57976 -57462 -56947 -56959 -56970 -59843 -62715 -61653 -60592 -59530 -58468 -57108 -55748 -57249 -58751 -61803 -64854 -67906 -70957
-3231 -70957 -73577 -76196 -74046 -71896 -70879 -69862 -68845 -67827 -66005 -64183 -62361 -60539 -57764 -54988 -49350 -43713 -42815
-3214d2815R02j964j960k380k378r50r46j621j617l052l048J122J125J122J125J196J200j666
-3196e6605j662j844j841k023k019J613j244k322K452M21M25P19P23p38p34p38p34J140J144
-3177f3867j721j718O93O97p38p34K422K426K243k523j479j475l209l204J859J863j002r99
-3159g0466j196j192k746K027L961q05R20j937o197o192L02L05K269K273K269K273K985K988
-3141f8159J23J27l54l51l215l212j196j192j196j193J070J073J069J073k224k221O37O41
-3123g8700l76l73l76l73m84m85J424j439j438L331L331L331k049k049Q12Q12P83P82o48o48
-3103g4832J561J561J561J561k969k970j08K754J769k999J293J293o75o74P56P57n96n93J371
-3084g0179j486l428K299M918K061p46o464k176O89J043J047J222J226L428L432j341j338
$$ plain form
-3214 -42815 -41913 -43877 -45837 -48217 -50595 -51545 -52491 -54112 -55729 -58781 -61829 -60707 -59582 -58460 -57335 -56139 -54939 -56605
-3196 -56605 -58267 -60111 -61952 -63975 -65994 -64381 -65625 -67947 -65495 -65074 -64649 -63930 -63207 -63945 -64679 -65417 -66151 -65011 -63867
-3177 -63867 -65588 -67306 -66613 -65916 -66654 -67388 -64966 -62540 -60297 -62820 -64299 -65774 -68983 -72187 -70328 -68465 -69467 -70466
-3159 -70466 -71662 -72854 -75600 -73573 -69612 -70417 -69497 -71434 -77631 -83823 -83521 -83216 -80947 -78674 -76405 -74132 -71147 -68159
-3141 -68159 -68036 -67909 -68263 -68614 -71829 -75041 -76237 -77429 -78625 -79818 -78748 -77675 -76606 -75533 -77757 -79978 -79341 -78700
-3123 -78700 -79076 -79449 -79825 -80198 -80682 -81167 -79743 -81182 -82620 -79289 -75958 -72627 -74676 -76725 -75913 -75101 -74318 -73536 -74184 -74832
-3103 -74832 -73271 -71710 -70149 -68588 -71557 -74527 -74635 -71881 -70112 -73111 -71818 -70525 -71200 -71874 -71118 -70361 -70957 -71550 -70179
-3084 -70179 -71665 -75093 -72794 -67876 -65815 -66561 -73025 -75201 -74512 -73469 -72422 -71200 -69974 -66546 -63114 -64455 -65793
-3067f5793j19j16k981k977L95L99K183l536J916J918j304j300n63n59n62n59J196J200k35
-3048g1397k31l432l428J338J341l3l0J397J401j784j782J077J081J703J706j159j155l424
-3030g6811l420n63n59l54l50J077J080K418K422m43m40p11p08K865k854l380K348N086N089
-3011f8208M729r91m155j289j748j743J293J296Q76Q79n55n51j733j729l02k98j643j639J218
-2992g6293J222K31K31J662J662J393J394J393J394p53p52p53p53j885j885j886j885K38K42
-2973g5783L101L103K743K746l935l931j386j382j386j383j416j412J446J449k247k246q76
-2956h2795J986N980K57l856J867L54L54P11P12l32l31J636j226k281L447M5M8M02M07M02
-2936g2213M06m92m88m92m88j624j621R39R43l074k13M915q05l61K500N33N36J300J301J181
$$ plain form
-3067 -65793 -65912 -66028 -69009 -71986 -71591 -71192 -69009 -72545 -70629 -68711 -70015 -71315 -71878 -72437 -72999 -73558 -72362 -71162 -71397
-3048 -71397 -71628 -75060 -78488 -77150 -75809 -75842 -75872 -74475 -73074 -74858 -76640 -75563 -74482 -72779 -71073 -72232 -73387 -76811
-3030 -76811 -80231 -80794 -81353 -81707 -82057 -80980 -79900 -77482 -75060 -75503 -75943 -76654 -77362 -74497 -77351 -80731 -78383 -73297 -68208
-3011 -68208 -63479 -64470 -68625 -69914 -71662 -73405 -72112 -70816 -69940 -69061 -69616 -70167 -71900 -73629 -73931 -74229 -75872 -77511 -76293
-2992 -76293 -75071 -74840 -74609 -72947 -71285 -69892 -68498 -67105 -65711 -66464 -67216 -67969 -68722 -70607 -72492 -74378 -76263 -76025 -75783
-2973 -75783 -72682 -69579 -66836 -64090 -68025 -71956 -73342 -74724 -76110 -77493 -78909 -80321 -78875 -77426 -79673 -81919 -82795
-2956 -82795 -80809 -74829 -74572 -78428 -76561 -76207 -75853 -75142 -74430 -74762 -75093 -73457 -74683 -76964 -73517 -73472 -73424 -73022 -72615 -72213
-2936 -72213 -71807 -72299 -72787 -73279 -73767 -75391 -77012 -76073 -75130 -78204 -78417 -73502 -74307 -74668 -72168 -71635 -71099 -69799 -68498 -67317
-2916f7317m538k426k426k783k780J53J57L31L36J52L019M802r16m21K444M73M77O52O56O52
-2896f9303O56J296J297J297J300M62M62M62M66k31k31k31k27O03O04O03O08l09l06l05l06
-2875f1333j382j379j379j378l39l36l35l35R72R76R77R76O44O49L864j856j412j409j769
-2856f5584j767K627K631j666j661k95k90k95k90M17M21k918k917K832K835k410k411J013
-2838f9728J017m765R57k38l096J255J256j49j45j580j576j461j457M740M743O26O30o26o23
-2819g0220J610M475K206k560l54l50o52o49j218j215K13K16R87R91j397j393m379m374j039
-2800g9102j036K083K082l01l164q98L872M825J963j613m475j315J546K798K799N92N92j028
-2782f9780j028K310K310k221k220k221k221m47m47m47m47K205K206j79j78j066j066j065
$$ plain form
-2916 -67317 -71855 -74281 -76707 -79490 -82270 -82117 -81960 -81629 -81293 -81141 -78122 -73320 -74236 -74657 -72213 -71740 -71263 -70611 -69955 -69303
-2896 -69303 -68647 -67351 -66054 -64757 -63457 -62995 -62533 -62071 -61605 -61836 -62067 -62298 -62525 -61922 -61318 -60715 -60107 -60416 -60722 -61027 -61333
-2875 -61333 -62715 -64094 -65473 -66851 -67190 -67526 -67861 -68196 -67224 -66248 -65271 -64295 -63651 -63002 -59138 -60994 -62406 -63815 -65584
-2856 -65584 -67351 -64724 -62093 -63759 -65420 -65715 -66005 -66300 -66590 -66173 -65752 -68670 -71587 -68755 -65920 -68330 -70741 -69728
-2838 -69728 -68711 -73476 -72519 -72757 -75853 -74598 -73342 -73491 -73636 -75216 -76792 -78253 -79710 -74970 -70227 -69601 -68971 -69597 -70220
-2819 -70220 -68610 -64135 -61929 -64489 -64843 -65193 -65845 -66494 -67712 -68927 -68714 -68498 -67511 -66520 -67917 -69310 -73689 -78063 -79102
-2800 -79102 -80138 -78055 -75973 -76274 -79438 -80336 -76464 -71639 -69676 -71289 -75764 -77079 -75533 -72735 -69936 -69344 -68752 -69780
-2782 -69780 -70808 -68498 -66188 -68409 -70629 -72850 -75071 -75518 -75965 -76412 -76859 -74654 -72448 -72627 -72805 -73871 -74937 -76002
-2764g6002j066R7R7n00M270K944j826j229j230J334J334Q57L718M039p30m844p4j148j147
-2745g1106q50q49J207J207J207J207q49q50q49q50k328k325J009J014J635J640n70n66j882
-2726g3748R84k061K713j644m501k239K534M255n11n73K291J662J665L272L275K16K20K16
-2708f1974K20n29n26n29n25l685l681j778m635k493K281n85n81M06M10M06M10J956J960J956
-2688g1516J960o52o49o52o48o52o48o53o48N18N22N18N21j300j297K992K996J79J79J78J79
-2667f8573j818j818j819j818p45p45p45p46J997J998l88l87m051m050J196J196J882J882
-2649g7552M50M51l39l39l39l39J68J67J68J68r32r28r31r28j110j107K228K232M32M36r98
-2628g8942r95J5J8j63j61J793j066k321K451J793j066Q38Q42m8m5m8m5L767L771M28M32L872
$$ plain form
-2764 -76002 -77068 -76971 -76874 -77374 -73104 -70160 -71986 -73215 -74445 -73111 -71777 -70920 -67202 -63163 -63893 -68737 -68811 -69959 -71106
-2745 -71106 -71956 -72805 -71598 -70391 -69184 -67977 -68826 -69676 -70525 -71375 -73703 -76028 -75019 -74005 -72370 -70730 -71300 -71866 -73748
-2726 -73748 -72764 -74825 -72112 -73756 -78257 -80496 -77962 -73707 -74218 -74791 -72500 -70838 -69173 -65901 -62626 -62410 -62190 -61974
-2708 -61974 -61754 -62283 -62809 -63338 -63863 -67548 -71229 -73007 -77642 -80135 -77854 -78439 -79020 -78614 -78204 -77798 -77388 -75432 -73472 -71516
-2688 -71516 -69556 -70208 -70857 -71509 -72157 -72809 -73457 -74110 -74758 -74240 -73718 -73200 -72679 -73979 -75276 -72284 -69288 -69109 -68930 -68752 -68573
-2667 -68573 -70391 -72209 -74028 -75846 -76591 -77336 -78081 -78827 -76830 -74832 -75220 -75607 -79658 -83708 -82512 -81316 -79434 -77552
-2649 -77552 -77102 -76651 -76990 -77329 -77668 -78007 -77839 -77672 -77504 -77336 -78268 -79196 -80127 -81055 -82165 -83272 -81044 -78812 -78380 -77944 -78942
-2628 -78942 -79937 -79922 -79904 -80067 -80228 -78435 -79501 -81822 -79371 -77578 -78644 -77806 -76964 -77012 -77057 -77105 -77150 -73383 -69612 -69184 -68752 -64880
-2606f4880L875j673j669mm769o204j431K522K527n18n14o08o03K731K735r06r01r06r02j054
-2586g3152j051j054j051P64P67P64P68L178L182r35r32o11K251M039j684l860r99k608k608
-2567g4832k169L555L35L35q86q87q87q87j803j804J536J535K638K638K638K638j245j244
-2549f8796j066j066j512J349L137k586m270j408J810M673K765k959j170J692q80q79J684
-2532f9482J684m32m32k817k817p34p34J651J650J979J978j956j956q08M914J695J696mml
-2512f4932mj550j546j550j547j878j874J461J464J967J971J968J971K68K72J699J703J010
-2494e9127J013J16n604m177j312J010J014k374k370r42r39P1P4P1P4o44o45o44o45O67O67
-2473g4646O67O67o60o59o60o59K798K798K799K798LMMMJ553J554J554J554l648l648m900
$$ plain form
-2606 -64880 -61005 -62678 -64347 -64351 -69120 -75324 -76755 -74233 -71706 -72224 -72738 -73346 -73949 -71218 -68483 -69389 -70290 -71196 -72098 -73152
-2586 -73152 -74203 -75257 -76308 -75544 -74777 -74013 -73245 -70067 -66885 -67820 -68752 -69363 -67112 -63073 -64757 -68617 -69616 -72224 -74832
-2567 -74832 -77001 -73446 -73111 -72776 -73662 -74549 -75436 -76323 -78126 -79930 -78394 -76859 -74221 -71583 -68945 -66307 -67552 -68796
-2549 -68796 -69862 -70928 -72440 -71091 -67954 -70540 -74810 -76218 -74408 -69735 -66970 -69929 -71099 -69407 -70287 -71166 -69482
-2532 -69482 -67798 -68230 -68662 -71479 -74296 -75030 -75764 -74113 -72463 -70484 -68506 -70462 -72418 -73226 -68312 -66617 -64921 -64925 -64929 -64932
-2512 -64932 -64936 -66486 -68032 -69582 -71129 -73007 -74881 -73420 -71956 -69989 -68018 -66050 -64079 -63811 -63539 -61840 -60137 -59127
-2494 -59127 -58114 -57998 -63602 -67779 -69091 -68081 -67067 -69441 -71811 -72753 -73692 -73621 -73547 -73476 -73402 -74046 -74691 -75335 -75980 -75313 -74646
-2473 -74646 -73979 -73312 -73972 -74631 -75291 -75950 -73152 -70354 -67555 -64757 -64754 -64750 -64746 -64742 -63189 -61635 -60081 -58527 -62175 -65823 -70723
-2452g0723k038k068L656P93P94k98K563L279l398j133j132J788J789j655j654j476j475o71
-2434g3059K191L264j505k20k20l499J271K582k187k247O15J986J986P34m035m095j234m58
-2416g8130K403J61J60j38K724L975p93j152J711O44k217o07K254j829j830k20k20K28K27
-2397g2649K27K28j025j025J360J360J144J144J144J144j211j211j211j211P12P15P12P15
-2379f8938J16J19J19J19p34p30p34p30J293J296J297J297j2pl09l06K791j975m240j379J450
-2358g0197J453J97K02k426k422o93o93j520L249k09l070j073j073J79L044K064k705J56J57
-2339g5380j066j065K272K277j371j368J014J017j550j546j070J793M598j68j602j599J57
-2322g4657J60j271j270R83R84R84R87q94q91k325k321k38k39K146K150K69K72J341J345K612
$$ plain form
-2452 -70723 -72761 -74829 -71173 -70380 -69586 -69884 -67321 -64042 -67440 -68573 -69705 -67917 -66128 -67783 -69437 -70913 -72388 -73059
-2434 -73059 -70868 -67604 -69109 -69329 -69549 -73048 -71777 -69195 -71382 -73629 -73014 -71028 -69042 -68308 -72343 -76438 -77672 -78130
-2416 -78130 -75727 -75566 -75406 -75544 -72820 -68845 -69638 -70790 -69079 -68435 -70652 -71259 -69005 -70834 -72664 -72884 -73104 -72876 -72649
-2397 -72649 -72422 -72194 -73219 -74244 -72884 -71524 -70380 -69236 -68092 -66948 -68159 -69370 -70581 -71792 -71080 -70365 -69653 -68938
-2379 -68938 -68822 -68703 -68584 -68465 -69199 -69929 -70663 -71393 -70100 -68804 -67507 -66210 -66222 -66229 -66538 -66844 -64053 -66028 -70268 -71647 -70197
-2358 -70197 -68744 -68547 -68345 -70771 -73193 -73886 -74579 -76099 -72850 -73059 -76129 -77202 -78275 -78096 -75052 -72988 -75693 -75537 -75380
-2339 -75380 -76446 -77511 -75239 -72962 -74333 -75701 -74687 -73670 -75220 -76766 -77836 -76043 -71445 -71613 -73215 -74814 -74657
-2322 -74657 -74497 -75768 -77038 -76055 -75071 -74087 -73100 -73994 -74885 -77210 -79531 -79769 -80008 -77862 -75712 -75443 -75171 -73830 -72485 -69873
-2302f9873l108l107K616L50L50P08P08M773M777m285m285J86J87J86J86k720k716O22O22
-2283g3823r57r58J427J427P83P86j598j599J442J442J442J442j371j368j367j368k6k6k6
-2264g4296k6K131K135j203j204k425k426k306L416K173K172j762j763K65K64K65K64J964
-2246g2362J964J963J964o90o89o89o89J97J97k187k187L268L268j025j025k902k903n18n18
-2227g5563r95r94M36M35J137J140k94k91J345J349j040j035J404J409J404J409M21M25M21
-2208f7477M25O11O14O11O15k012k008n231M95L28L32O85O90j103j100j102j100P72P71k448
-2188g6632L275L156L156j256j255J15J16k746k747K739K739j23j23j45j46l007l007J167
-2170g4724J166J166J166r20r20r21r20k351k351K418K418k798k798O3O3M595M594M952p72
$$ plain form
-2302 -69873 -72981 -76088 -73472 -73122 -72772 -72064 -71356 -66583 -61806 -66091 -70376 -70190 -70003 -69817 -69631 -72351 -75067 -74445 -73823
-2283 -73823 -74780 -75738 -74311 -72884 -72101 -71315 -72913 -74512 -73070 -71628 -70186 -68744 -70115 -71483 -72850 -74218 -74244 -74270 -74296
-2264 -74296 -74322 -72191 -70056 -71259 -72463 -74888 -77314 -79620 -76204 -74031 -71859 -73621 -75384 -75119 -74855 -74590 -74326 -72362
-2246 -72362 -70398 -68435 -66471 -67161 -67850 -68539 -69228 -69031 -68834 -71021 -73208 -69940 -66672 -67697 -68722 -71624 -74527 -75045 -75563
-2227 -75563 -76558 -77552 -77116 -76681 -75544 -74404 -74698 -74989 -73644 -72295 -73335 -74370 -72966 -71557 -70153 -68744 -68323 -67898 -67477
-2208 -67477 -67052 -66441 -65827 -65216 -64601 -66613 -68621 -73852 -73357 -73029 -72697 -72012 -71322 -72425 -73525 -74627 -75727 -74955 -74184 -76632
-2188 -76632 -73357 -70201 -67045 -68301 -69556 -69441 -69325 -72071 -74818 -72079 -69340 -69463 -69586 -69731 -69877 -72884 -75891 -74724
-2170 -74724 -73558 -72392 -71226 -72146 -73066 -73987 -74907 -77258 -79609 -77191 -74773 -77571 -80369 -80306 -80243 -75648 -71054 -66102 -66874
-2151f6874k112k113L91L92k173k172O89O90L39L39L39L39N77N78k284k284j53j53j52j53
-2131g5950q68q69J994J993p04p00p05p00J263J267J263J267P1P4P1P4J979J982k791k787
-2111g2776J986J990q76q71o97o93l39l36k574L152M221J364m28l287n257M69N574K713j997
-2092f8662j997Q05Q04Q05Q05j237j237l920l920j773J088N738J5m308j445n52n51Q79Q80
-2073g7783Q79Q79j445j446J416J416k54k53K608K608M9M8M9M8j30j31j30j31Q84Q83Q83Q83
-2051f8170m244m244m244m244J956J956K135K135K076M937J240l528o97o97r94r95j591j591
-2033g8804J270J271J054J058J055J058p94p89p90p90K440K445K440K444Q31Q35k027k027
-2015f7820o7o3o8o3j319j315j315j316QJ1PJ2p68p64p64p64K270K269n93n88k35k35K627
$$ plain form
-2151 -66874 -68986 -71099 -70708 -70316 -72489 -74661 -73972 -73282 -72943 -72604 -72265 -71926 -71349 -70771 -73055 -75339 -75492 -75645 -75797 -75950
-2131 -75950 -76818 -77687 -75693 -73700 -74404 -75104 -75809 -76509 -75246 -73979 -72716 -71449 -71378 -71304 -71233 -71159 -69180 -67198 -69989 -72776
-2111 -72776 -70790 -68800 -69676 -70547 -71244 -71937 -72276 -72612 -75186 -72034 -67813 -66449 -66877 -70164 -75421 -74952 -69378 -66665 -68662
-2092 -68662 -70659 -69854 -69050 -68245 -67440 -68677 -69914 -73834 -77754 -79527 -78439 -72701 -72686 -76994 -78439 -78991 -79542 -78663 -77783
-2073 -77783 -76904 -76025 -77470 -78916 -77500 -76084 -76338 -76591 -73983 -71375 -71326 -71278 -71229 -71181 -71311 -71442 -71572 -71703 -70819 -69936 -69053 -68170
-2051 -68170 -72414 -76658 -80902 -85146 -83190 -81234 -79099 -76964 -74888 -69951 -68711 -72239 -72936 -73633 -74627 -75622 -77213 -78804
-2033 -78804 -77534 -76263 -75209 -74151 -73096 -72038 -72832 -73621 -74411 -75201 -72761 -70316 -67876 -65432 -64601 -63766 -65793 -67820
-2015 -67820 -67887 -67950 -68018 -68081 -69400 -70715 -72030 -73346 -73338 -73327 -73320 -73308 -74076 -74840 -75604 -76368 -74098 -71829 -72422 -73010 -73245 -73480 -70853
-1992g0853K631j830j829j830j826P9P8P8Q2j878j874R84R87r24r20J937J941n06n03n07n03
-1971g6986j49j45j49j46K623K627k38k35o56o52o52o52N81N85N82N85J237J240J241J241
-1951f8118L39L43k519k519J595J595J594J595p86p83p82p82k154k154K616K616R42R47R42
-1932f5473R47L029L033l648l644l417l413n55n51j241j237J90J94M25M24M25M25N14N14N14
-1912g2545N15q43q42q42q42j26j27j27j26j513j513j513j513J021J021J021J021J707J706
-1893g4460K959j811k467k466R6R7J699J699L130L130k057k056o26o26K116K116p45p45l279
-1874g4296l279m17m17LMMMK984K985J23J23n6n6n6n6l633l633J137J136P19P19P19P20K895
-1850g1624K895L3k828k992J778L46L47k80k79k80k79l21l20K541K541M55M54r76r76J721
$$ plain form
-1992 -70853 -68222 -70052 -71881 -73711 -75537 -75458 -75380 -75302 -75220 -77098 -78972 -77988 -77001 -77925 -78845 -76908 -74967 -75473 -75976 -76483 -76986
-1971 -76986 -77135 -77280 -77429 -77575 -74952 -72325 -72563 -72798 -73454 -74106 -74758 -75410 -74829 -74244 -73662 -73077 -71840 -70600 -69359 -68118
-1951 -68118 -67779 -67436 -69955 -72474 -70879 -69284 -67690 -66095 -66881 -67664 -68446 -69228 -71382 -73536 -70920 -68304 -67362 -66415 -65473
-1932 -65473 -64526 -61497 -58464 -62112 -65756 -69173 -72586 -73141 -73692 -74933 -76170 -75980 -75786 -75361 -74937 -74512 -74087 -73573 -73059 -72545
-1912 -72545 -72030 -72873 -73715 -74557 -75399 -75525 -75652 -75779 -75905 -77418 -78931 -80444 -81957 -80936 -79915 -78894 -77873 -76166 -74460
-1893 -74460 -71501 -73312 -75779 -78245 -78149 -78052 -76353 -74654 -71524 -68394 -70451 -72507 -73133 -73759 -71643 -69527 -70272 -71017 -74296
-1874 -74296 -77575 -77992 -78409 -78406 -78402 -78398 -78394 -75410 -72425 -72302 -72179 -72235 -72291 -72347 -72403 -76036 -79669 -78532 -77396 -76677 -75958 -75239 -74519 -71624
-1850 -71624 -68729 -68696 -71524 -74516 -72738 -72392 -72045 -72325 -72604 -72884 -73163 -73484 -73804 -71263 -68722 -68267 -67813 -68789 -69765 -68044
-1830f8044J722K90K91o63o63o64o63M5M5M4M5n81n82n81n81M92M92J922J923J893J893J713
-1808f0212l055l275l275p12p12J077J077J077J077j234j233j233j233j91j90J241J241j710
-1790g1475j710J151J151l69l69j1j1k023L700M80M81l215l216l54l54j032j028J829J833
-1771g4542o15o11o14o12K7K9K888K891R21R24k120k117N18k340j270M456P86k071j08j05
-1751g3685K232K236Q01Q05J725J729j137j132l548l547o85o86m17m18m17m17Q05Q04q04q05
-1731g6561K325n37L58O081M277j445p31p30j267j267j267j266L681L681j088j088K24K23
-1713f6397K24K23K031K031q31q31n6n6l633K091K507l215j070J793k322N41q91q91j356j352
-1693g1460k072L655J446m274K340K344J177M043K787k932j94j90l73l69m620j755J103j755
$$ plain form
-1830 -68044 -66322 -66032 -65741 -66404 -67067 -67731 -68394 -68349 -68304 -68260 -68215 -68796 -69378 -69959 -70540 -70048 -69556 -67634 -65711 -63818 -61925 -60212
-1808 -60212 -63267 -66542 -69817 -70529 -71241 -70164 -69087 -68010 -66933 -68167 -69400 -70633 -71866 -72057 -72247 -71006 -69765 -71475
-1790 -71475 -73185 -72034 -70883 -71252 -71621 -71632 -71643 -73666 -69966 -69486 -69005 -72220 -75436 -75790 -76144 -77176 -78204 -76375 -74542
-1771 -74542 -75157 -75768 -76382 -76994 -76967 -76938 -74050 -71159 -70238 -69314 -71434 -73551 -73033 -75373 -76643 -72187 -71401 -73472 -73580 -73685
-1751 -73685 -71453 -69217 -68416 -67611 -65886 -64157 -65294 -66426 -69974 -73521 -74206 -74892 -75309 -75727 -76144 -76561 -75756 -74952 -75756 -76561
-1731 -76561 -74236 -74773 -74415 -68334 -64057 -65502 -66233 -66963 -68230 -69497 -70764 -72030 -68349 -64668 -65756 -66844 -66620 -66397
-1713 -66397 -66173 -65950 -63919 -61888 -62719 -63550 -63606 -63662 -67295 -65204 -62697 -65912 -66982 -65189 -67511 -66970 -67861 -68752 -70108 -71460
-1693 -71460 -73532 -69877 -68431 -72705 -70365 -68021 -66844 -62801 -60014 -62946 -63140 -63330 -63703 -64072 -68692 -70447 -69344 -71099
-1675g1099K68K72k08k05L681j084m784j919P60P64m92m88J531J531J01J01K246K247o15o14
-1655f8006j494j495m355m356Q90Q91J069j792j133j132K98K98J580M441M382l88k898J870
-1637g1330J751J752l168l167pK854k206k206Q35Q35q35q35P75k086p68p67J26K989L435N74
-1617g1449K362K362q5q6j516j517j040j039K12L074J681J680K038q23K932K933J680j181
-1599e7782l558o97N55k306l827l827k932p1K098p64l268m06j956R05K337K336L76L80L77
-1580g2030L80J270J274J98k660j532J334J330j527k426M40M36k422r13J952j449J416J621
-1562g3308J624L052L055J554j304k560k556j487j483m169m166q42K020L450N89K31K31J483
-1544g4586J482n06n07n07n06J401J400k9l0j148j147P60N529K280n81l145k83n29n29l50
$$ plain form
-1675 -71099 -70831 -70559 -70767 -70972 -67291 -68375 -73159 -75078 -74318 -73554 -74046 -74534 -73003 -71472 -71371 -71270 -69024 -66777 -67392 -68006
-1655 -68006 -69500 -70995 -75350 -79706 -78816 -77925 -76856 -78648 -79781 -80913 -80615 -80317 -78737 -74296 -69914 -70302 -73200 -71330
-1637 -71330 -69579 -67827 -70995 -74162 -74169 -71315 -73521 -75727 -74892 -74057 -74892 -75727 -74952 -77038 -77806 -78573 -78447 -75458 -72023 -71449
-1617 -71449 -69087 -66725 -66810 -66896 -68412 -69929 -70969 -72008 -71796 -68722 -67041 -65361 -63323 -64146 -61214 -58281 -56601 -57782
-1599 -57782 -61340 -62037 -61482 -63788 -67615 -71442 -74374 -74445 -72347 -73111 -76379 -76785 -78741 -77836 -75499 -73163 -72787 -72407 -72030
-1580 -72030 -71650 -70380 -69106 -68908 -71568 -73100 -71766 -70436 -71963 -74389 -73949 -73513 -75935 -76848 -74896 -76345 -74929 -73308
-1562 -73308 -71684 -68632 -65577 -64023 -65327 -67887 -70443 -71930 -73413 -77582 -81748 -82590 -80570 -77120 -76531 -76300 -76069 -74586
-1544 -74586 -73104 -73610 -74117 -74624 -75130 -73729 -72329 -72358 -72388 -73536 -74683 -73923 -68394 -66114 -66695 -69840 -70123 -70652 -71181 -71531
-1524g1531l50M54M55r76r77J774J773j088j088p30p30k161k161j155j155J706J707K243K243
-1505g1747K243K243k027k027k206O56J043J044j938m799j863j863R39L800J088j773l026
-1488h0213j64J498J498J498J498k169n030j513L257L584P23n2n2o19K243Q13N581q49q50
-1469f9318j803j804L73L234j237j237J356J357J356J356j5j5J774j088k120P41K05L067k299
-1450f6117k299P41P42o15o15o15o14n85n85l268l268q57K009P52k105j125J740J26J31l376
-1430g9803n10P37P42j57j52j57j53J819J818j043j044j401j401L369L368K68K69K68K68n96
-1410g3491n96j669j670l28N399N038N041j788j785j788j785k295k292l28l186L28O055J282
-1392f9858m438j509J353K246K247k284k284N78N77k6k6k6k6m73m74R58R58L137L137K76K76
$$ plain form
-1524 -71531 -71881 -71427 -70972 -71948 -72925 -71151 -69378 -70466 -71554 -72284 -73014 -75175 -77336 -78491 -79646 -77940 -76233 -73990 -71747
-1505 -71747 -69504 -67261 -69288 -71315 -73521 -72865 -71822 -70778 -72716 -77515 -79378 -81241 -80302 -76502 -75414 -77187 -80213
-1488 -80213 -80377 -78879 -77381 -75883 -74385 -76554 -81584 -83097 -79840 -76256 -75533 -75585 -75637 -76256 -74013 -73200 -67619 -68468 -69318
-1469 -69318 -71121 -72925 -72552 -69318 -70555 -71792 -70436 -69079 -67723 -66367 -66382 -66397 -64623 -65711 -67831 -67090 -66885 -63818 -66117
-1450 -66117 -68416 -67675 -66933 -67548 -68163 -68778 -69392 -69977 -70562 -73830 -77098 -77955 -75946 -75194 -77299 -78424 -76684 -76558 -76427 -79803
-1430 -79803 -80313 -79576 -78834 -78991 -79143 -79300 -79453 -77634 -75816 -76859 -77903 -79304 -80705 -77336 -73968 -73700 -73431 -73163 -72895 -73491
-1410 -73491 -74087 -75756 -77426 -77754 -72355 -67317 -62276 -64064 -65849 -67637 -69422 -71717 -74009 -74337 -77523 -77195 -71140 -69858
-1392 -69858 -74296 -75805 -74452 -72206 -69959 -72243 -74527 -73949 -73372 -73398 -73424 -73450 -73476 -73949 -74423 -73465 -72507 -69370 -66233 -65957 -65681
-1371f5681J557J558l212l212p30p31p30p30J624J625J94J93k276k273j382J483L625k094
-1353g1192J300J304j121j118L09L13J472J476j390j386j066j062j065j062K153K158k616
-1336g2593k612O56O59O56O60q35q31q35q30r4r3r3r3J427J427j434j435K373K374R43R42
-1315f9661n77n78K284K284O75O74k187k187j114j114J747J748J389J390l379l380K731K732
-1297f6523M162M162j506j501j506j501J624J629l145l141j751j748j751j748P53P56M55M58
-1279g1822M166o00m300j434K615K620o7o4R47R50R46R50N3N5N3N6R76R80R76R80l704l700
-1257f8368k273k269k958k955r7r3K526K530K526K530j997j993n66n63R54R57j907j904j819
-1238g7739j814J162l603j818K955K831K836q42q39q42q38J662J665J662J666M10M13L272
$$ plain form
-1371 -65681 -64124 -62566 -65778 -68990 -69720 -70451 -71181 -71911 -70287 -68662 -68468 -68275 -70551 -72824 -74206 -72723 -69098 -71192
-1353 -71192 -69892 -68588 -69709 -70827 -70518 -70205 -68733 -67257 -68647 -70033 -71099 -72161 -73226 -74288 -72135 -69977 -72593
-1336 -72593 -75205 -74549 -73890 -73234 -72574 -73409 -74240 -75075 -75905 -75999 -76092 -76185 -76278 -74851 -73424 -74858 -76293 -73920 -71546 -70603 -69661
-1315 -69661 -70238 -70816 -68532 -66248 -65573 -64899 -67086 -69273 -70387 -71501 -69754 -68006 -66617 -65227 -68606 -71986 -69255 -66523
-1297 -66523 -62361 -58199 -59705 -61206 -62712 -64213 -62589 -60960 -64105 -67246 -68997 -70745 -72496 -74244 -73491 -72735 -72280 -71822
-1279 -71822 -67656 -68256 -72556 -73990 -71375 -68755 -68822 -68886 -67939 -66989 -66043 -65093 -65040 -64985 -64932 -64876 -63900 -62920 -61944 -60964 -64668 -68368
-1257 -68368 -70641 -72910 -75868 -78823 -78920 -79013 -76487 -73957 -71431 -68901 -70898 -72891 -73457 -74020 -73066 -72109 -74016 -75920 -77739
-1238 -77739 -79553 -78391 -81994 -83812 -80857 -78026 -75190 -76032 -76871 -77713 -78551 -76889 -75224 -73562 -71896 -71486 -71073 -67801
-1220f7801L275qlk869k866l31l28k895k892k120K653M736M739K426K429k343k340j539j535
-1201f9612j08j05J603J605j259j256M40M43M40M44J41J45J42J45j468j464J394J397J971
-1182f4962J975J971J974k738k735k858J915N26m241l051j86K582k76j174j170n25K336N377
-1164f5260l47l118l119o15o15j151j151j152j151k57k57k57k57N85N85N84N85O75O74K106
-1144g2913K105K880K880j889j889j90j90K314K314K604l119m370j509m96m95K545K544k716
-1126f9590k716J45J45K888K888j882j881j413j412L357L357k306k306K463K462j15j16j15
-1108f6147j16K508K508l54l54k176k173k176k172J401J405j461j457j937j934j937j934J252
-1090g7254J255j78j76q94q90N425N429M858q60k415k411J49J53J49J53l249l246l87l84K389
$$ plain form
-1220 -67801 -64526 -64534 -64537 -67406 -70272 -70603 -70931 -73826 -76718 -78838 -76185 -71449 -66710 -64284 -61855 -64198 -66538 -68077 -69612
-1201 -69612 -69720 -69825 -68222 -66617 -67876 -69132 -68692 -68249 -67809 -67365 -67224 -67079 -66937 -66792 -68260 -69724 -68330 -66933 -64962
-1182 -64962 -62987 -61016 -59042 -61780 -64515 -67373 -65458 -64932 -69173 -72224 -72410 -69828 -70104 -71278 -72448 -72973 -70637 -65260
-1164 -65260 -65607 -68725 -71844 -72459 -73074 -74225 -75376 -76528 -77679 -77936 -78193 -78450 -78707 -78122 -77537 -76953 -76368 -75693 -75019 -72913
-1144 -72913 -70808 -67928 -65048 -66937 -68826 -69016 -69206 -66892 -64578 -61974 -65093 -69463 -70972 -71468 -71963 -69418 -66874 -69590
-1126 -69590 -72306 -72161 -72016 -69128 -66240 -68122 -70003 -71416 -72828 -69471 -66114 -68420 -70726 -68263 -65801 -65916 -66032 -66147
-1108 -66147 -66263 -63755 -61247 -61601 -61955 -64131 -66304 -68480 -70652 -69251 -67846 -69307 -70764 -72701 -74635 -76572 -78506 -77254
-1090 -77254 -75999 -76177 -76353 -77247 -78137 -72712 -67283 -62425 -63285 -65700 -68111 -67962 -67809 -67660 -67507 -70756 -74002 -74389 -74773 -72384
-1070g2384K388k381k377K627K627k35k31J859J859j002r99L052L052j718j714k075k076K694
-1052f7034K698J293J293l477l472j070j069N40N44j248J613L223k496o56o56M18M17N96N96
-1033f7947k265k266P01P00n51M218M92M92k072k072o11o11o11o11J893J893k877k876K176
-1014g2805K176K176K176J49J49q05l667n235m62L354L353N78N81K012K012J16J19J19J19
-995f3785K05K09K08K09p19p15n37n36N32L398J789k981l886j021o7o7k038k035k034k034
-975g5905j446j442j446j442K102K105L532L536R61R65j900j896J229J234k02j97q57q53k288
-956g4210k284J527J532j334j330K571K574k90k87n2m9n2m8K46K45M25M25j334J528N641Q72
-935f3684n030k169k645k646K243K243N15N14K101k668k667K101K131K132N21m247l95K466
$$ plain form
-1070 -72384 -69996 -72377 -74754 -72127 -69500 -69735 -69966 -68107 -66248 -67250 -68249 -65197 -62145 -63863 -65577 -67652 -69728 -67034
-1052 -67034 -64336 -63043 -61750 -65227 -68699 -69769 -70838 -70298 -69754 -71002 -69389 -66166 -68662 -69318 -69974 -69556 -69139 -68543 -67947
-1033 -67947 -70212 -72478 -71777 -71077 -71628 -67410 -66918 -66426 -68498 -70570 -71181 -71792 -72403 -73014 -71121 -69228 -72105 -74981 -72805
-1014 -72805 -70629 -68453 -66277 -66128 -65979 -66784 -70451 -75686 -76148 -72794 -69441 -68863 -68282 -66270 -64258 -64142 -64023 -63904 -63785
-995 -63785 -63580 -63371 -63163 -62954 -63673 -64388 -64925 -65461 -64929 -61531 -59742 -62723 -66609 -67630 -67697 -67764 -69802 -71837 -73871 -75905
-975 -75905 -77351 -78793 -80239 -81681 -79579 -77474 -73942 -70406 -69445 -68480 -70380 -72276 -71047 -69813 -70015 -70212 -71069 -71922 -74210
-956 -74210 -76494 -74967 -73435 -74769 -76099 -73528 -70954 -71244 -71531 -71583 -71632 -71684 -71732 -71486 -71241 -70816 -70391 -71725 -70197 -64556 -63684
-935 -63684 -68714 -70883 -73528 -76174 -73931 -71688 -71173 -70659 -68558 -71226 -73893 -71792 -69661 -67529 -67008 -71255 -71650 -69184
-917f9184N59N59o63o63o64o63K485K489j926m784j837J028L529L532k478k474j047j043q09
-898g4054q04J576J579p04p00P26P31P0P5P1P4J08J12J718j140m88m85L208L212O45o033n317
-876g5820k455J390J389J390J390R13j949j770j770L17L17L17L16M602M602K038k732k224
-858f9739k224j092j092P04P05K135K135r65r65K075p86j819j814L87L92q65q61q64q61n73
-838g5987n71J215j643j438J427l65l62o11o07K548K553K250o07o11K254L026L029j34j31
-819f4765k310k306j535J330p30p31j028l890j178L592L413j356j744j743o12o11j028j028
-801g8260K310K310L24L28J45J49R80j878j881R83o52o48j904j900M326M329Q09Q12K523l36
-781f7131j114j110J867J870j472j468k850k847k075P90L469L472J144j714k623K38K445m18
$$ plain form
-917 -69184 -68625 -68066 -68729 -69392 -70056 -70719 -68234 -65745 -67671 -72455 -74292 -73264 -69735 -66203 -68681 -71155 -72202 -73245 -74054
-898 -74054 -74858 -73282 -71703 -72407 -73107 -72381 -71650 -71580 -71505 -71434 -71360 -71252 -71140 -69422 -70562 -71050 -71535 -68327 -65115 -64470 -70503 -75820
-876 -75820 -78275 -76885 -75496 -74106 -72716 -71803 -73752 -75522 -77292 -76975 -76658 -76341 -76025 -71423 -66821 -64783 -67515 -69739
-858 -69739 -71963 -73055 -74147 -73443 -72738 -70603 -68468 -69433 -70398 -68323 -69109 -70928 -72742 -72355 -71963 -72828 -73689 -74553 -75414 -75987
-838 -75987 -76558 -75343 -76986 -78424 -76997 -77362 -77724 -78335 -78942 -76394 -73841 -71591 -72198 -72809 -70555 -67529 -64500 -64634 -64765
-819 -64765 -67075 -69381 -70916 -69586 -70316 -71047 -72075 -75965 -77143 -73551 -70138 -71494 -73238 -74981 -75593 -76204 -77232 -78260
-801 -78260 -75950 -73640 -73316 -72988 -72843 -72694 -71714 -73592 -75473 -74490 -75142 -75790 -77694 -79594 -75268 -70939 -70130 -69318 -66795 -67131
-781 -67131 -68245 -69355 -67488 -65618 -67090 -68558 -71408 -74255 -76330 -75540 -72071 -68599 -67455 -69169 -71792 -71554 -69109 -69527
-763f9527J610J610L040J79j021j021j200j199j200j200j021j021j639J226J401j457R83L849
-745f7608j49j45k049Q16M54M59K302n55p38K128m92l350l174l09M91M96p60p57R10R12R10
-724g0208R12K24K27M5M8j170m031m032j170K884K884O78k183p38M032k61k61K243K243Q13
-704f6821Q12P90P93k548k545l383l380K54L118Q05Q09n67l424j013J851j192j189j881R83
-685g7728m50m47k150P15K441K444J054J058j986Q80K79K83r72r69J893J897j446j442m03
-666g5049l98J684J688J475l290l294J480K668K671K83k574l06l05m85m84J155J155k422L301
-647g1047K877k847P30P31k400k399K369K370l58l54j788j785q9q6q9q6M69M74M69M73J960
-626g0406J964J960J963l048l048L630L629K31K31j200j200r7r7j527j528J155J155M375j349
$$ plain form
-763 -69527 -67917 -66307 -63267 -63088 -64109 -65130 -66330 -67529 -68729 -69929 -70950 -71971 -73610 -72384 -70983 -72440 -71457 -67608
-745 -67608 -67757 -67902 -69951 -69135 -68681 -68222 -65920 -66475 -67213 -65085 -65577 -68927 -72101 -72410 -71919 -71423 -72183 -72940 -72030 -71118 -70208
-724 -70208 -69296 -69072 -68845 -68800 -68752 -69922 -73953 -77985 -79155 -76271 -73387 -72709 -74892 -75630 -71598 -71859 -72120 -69877 -67634 -66821
-704 -66821 -66009 -65219 -64426 -66974 -69519 -72902 -76282 -76028 -72910 -72105 -71296 -71863 -75287 -76300 -74449 -75641 -76830 -78711 -77728
-685 -77728 -78178 -78625 -80775 -80060 -77619 -75175 -74121 -73063 -75049 -74169 -73890 -73607 -74579 -75548 -73655 -71758 -73204 -74646 -75049
-666 -75049 -75447 -73763 -72075 -70600 -73890 -77184 -75704 -73036 -70365 -70082 -72656 -72962 -73267 -73752 -74236 -73081 -71926 -74348 -71047
-647 -71047 -68170 -71017 -70287 -69556 -71956 -74355 -71986 -69616 -69974 -70328 -72116 -73901 -73990 -74076 -74165 -74251 -73782 -73308 -72839 -72366 -70406
-626 -70406 -68442 -66482 -64519 -67567 -70615 -66985 -63356 -63125 -62894 -64094 -65294 -65391 -65488 -67015 -68543 -67388 -66233 -61858 -63207
-607f3207l21l20Q72O595M508M509M866J0589J5404K1125K9473M2827N7373O6912M0919j8220
-591B23904n3088n8808m7604l8061k8496j5138p751p746o401o398m970m967m40m36j870j867
-575f0137j625j620J237J240p60p56p60p57J662J666l108l103j409j405K3K6M92M95k23N503
-555f3319L920j800k996k992K84K86p4p1J416m304m307J420O11O15R68R73O11O15O11O15J408
-534f5510J412J409J412l80l77l80l76o85o82o86o82o85o82o86o82j5j1j5j1j5j1j5j1O78
-510f7686O82O78O82j110j107j110j107L88L91L87L91k08k05Q9R3j933K835J53J53O89O89
-489f6166m080m080J293J293j568j569O37O37k224K545J673j189j189J673K746k023r50J912
-471g0629m21l283m177N92K650K649Q6Q5j274j274M54M55j692L078J826k944l793r32L659
$$ plain form
-607 -63207 -63528 -63848 -62976 -56381 -51873 -47364 -42498 -31909 -16505 4620 34093 76920 134293 201205 242124 223904
-591 223904 170816 112008 64404 26343 -2153 -17291 -25042 -32788 -39189 -45587 -50557 -55524 -55964 -56400 -58270 -60137
-575 -60137 -61762 -63382 -62145 -60905 -61665 -62421 -63181 -63938 -62276 -60610 -63718 -66821 -68230 -69635 -69612 -69586 -69094 -68599 -68822 -63319
-555 -63319 -59399 -61199 -64195 -67187 -66903 -66617 -66691 -66762 -65346 -69650 -73957 -72537 -71926 -71311 -70343 -69370 -68759 -68144 -67533 -66918 -65510
-534 -65510 -64098 -62689 -61277 -61657 -62034 -62414 -62790 -63475 -64157 -64843 -65525 -66210 -66892 -67578 -68260 -68275 -68286 -68301 -68312 -68327 -68338 -68353 -68364 -67686
-510 -67686 -67004 -66326 -65644 -66754 -67861 -68971 -70078 -69690 -69299 -68912 -68521 -68729 -68934 -68845 -68752 -70685 -67850 -67697 -67544 -66855 -66166
-489 -66166 -70246 -74326 -73033 -71740 -73308 -74877 -74240 -73603 -75827 -73282 -71609 -72798 -73987 -72314 -69568 -71591 -72541 -70629
-471 -70629 -71050 -74333 -78510 -77918 -75268 -72619 -72533 -72448 -73722 -74996 -74542 -74087 -75779 -72701 -70875 -73819 -77612 -78544 -74885
-452g4885L659K199o63m598J71p82p83m84m85j498j497J363J364j140j140j140L629L092K31
-433g3387p23p22L46L47L46L47o08o07o07o08K13K12k649k649K597K597J166J166j077j076
-413g5376L54L54J337J338r3r3n26n25n26n25k284k284P56P57k228O33L495L495M628j42l838
-392g1293r76j542j543J677J676k556L06J855M718K01K01K01K01l95l256j826j826K616k46
-373g1807J364J364J11J12r61l823k735J30n2k910J170J174k225O38J885r72k61O420L465
-354f7913O07k27k27R46R50j736j733l733q68N62k299K46K50J677j182J796J800P86n891k310
-334g8499N55m4m1k54k49J535j323k623K42L219L223N37N40k027k023m77M296J312J315L58
-314g0428m408n485J196J699J703L28L193J669j188o56o52l134k72R80R84j226j222J636J639
$$ plain form
-452 -74885 -71226 -69027 -69690 -74288 -74117 -74899 -75682 -76166 -76651 -78149 -79646 -78283 -76919 -78059 -79199 -80339 -76710 -73618 -73387
-433 -73387 -74110 -74832 -74486 -74139 -73793 -73446 -74054 -74661 -75268 -75876 -75663 -75451 -78100 -80749 -78152 -75555 -74389 -73223 -74300 -75376
-413 -75376 -75022 -74668 -73331 -71993 -72086 -72179 -72705 -73230 -73756 -74281 -76565 -78849 -78093 -77336 -79564 -78931 -75436 -71941 -67313 -67455 -71293
-392 -71293 -72269 -73811 -75354 -73677 -72001 -74557 -74251 -72396 -67678 -67477 -67276 -67075 -66874 -67269 -70525 -72351 -74177 -71561 -71807
-373 -71807 -70443 -69079 -68968 -68856 -69817 -73640 -76375 -76245 -76297 -79207 -78037 -76863 -79088 -78450 -76565 -77537 -77798 -71378 -67913
-354 -67913 -67306 -67533 -67760 -66814 -65864 -67600 -69333 -73066 -73934 -73372 -75671 -75425 -75175 -73498 -74680 -72884 -71084 -70298 -76189 -78499
-334 -78499 -77944 -77988 -78029 -78283 -78532 -76997 -78320 -80943 -80701 -77482 -74259 -73722 -73182 -75209 -77232 -77709 -73413 -72101 -70786 -70428
-314 -70428 -74836 -80321 -79125 -77426 -75723 -75395 -72202 -70533 -71721 -72377 -73029 -76163 -76435 -75455 -74471 -75697 -76919 -75283 -73644
-295g3644j658j658k27k24L380L383K127p30k187k187M95L361K225k541L16L21l201l201J569
-276g4281J572J152J155j710j707l838l834R32R35R7J00R7J01R61R65R62R65n29n26n29n25
-255g7485J974J979q87q83J558J561J557J561r46r43r46r43n88n85n89n85M73M77M73M77q38
-234g4128q35q38q35j062j058j062j058N48N51N48N51K456K459m06m03k999k996j38j34J710
-214g9129J714K80K83L439L443J710J714K363k404k586k582j185j181K46K50k61k57j513j509
-195g7165l480o15m39M333M672r3J632j226k034k031O49O52j126j121L05L10K034K038K035
-176g0670K038k929k925j498j494K288K291n73n70p53p49p53p49r7r3r7r3K83K87K84K86l72
-154g6658l69l73l69j147j144J714J718K548K553l13l10q38q38q39q38K64K65K65K64r57r58
$$ plain form
-295 -73644 -75302 -76960 -77187 -77411 -74031 -70648 -68521 -69251 -71438 -73625 -73130 -69769 -67544 -70085 -69769 -69448 -72649 -75850 -74281
-276 -74281 -72709 -71557 -70402 -72112 -73819 -77657 -81491 -80559 -79624 -79527 -79427 -79330 -79229 -78268 -77303 -76341 -75376 -75905 -76431 -76960 -77485
-255 -77485 -75511 -73532 -74419 -75302 -73744 -72183 -70626 -69065 -70011 -70954 -71900 -72843 -73431 -74016 -74605 -75190 -74717 -74240 -73767 -73290 -74128
-234 -74128 -74963 -75801 -76636 -77698 -78756 -79818 -80876 -80328 -79777 -79229 -78678 -76222 -73763 -74169 -74572 -77571 -80567 -80705 -80839 -79129
-214 -79129 -77415 -77135 -76852 -73413 -69970 -68260 -66546 -64183 -66587 -69173 -71755 -72940 -74121 -73875 -73625 -73886 -74143 -75656 -77165
-195 -77165 -80645 -81260 -81699 -77366 -72694 -72787 -71155 -72381 -74415 -76446 -75797 -75145 -76271 -77392 -77087 -76777 -74743 -72705 -70670
-176 -70670 -68632 -71561 -74486 -75984 -77478 -75190 -72899 -73472 -74042 -74795 -75544 -76297 -77046 -77143 -77236 -77333 -77426 -77143 -76856 -76572 -76286 -76658
-154 -76658 -77027 -77400 -77769 -78916 -80060 -78346 -76628 -74080 -71527 -71840 -72150 -72988 -73826 -74665 -75503 -75239 -74974 -74709 -74445 -75402 -76360
-133g6360K381K381P71P71J249j614j077L693L514j256k538k537k478K292J352l417j866j867
-115g6606O37O37K068K068K131K135k53k50j326j323J05J08J751J755o34o29L838L841j408
-96f1355j405j915j912m84m81P38P41P38P42m278m274R69R73o11o08Q20Q24J464J468j874
-76f9720m732l156J617L044L048J15J20J15J19L84L88L83L88P1P4P1P5j480j475k910k907
-55g6368k112k109K72K76L312L316R28R31K84K83j148j147r39r39M307M307o93o93o93o93
-35f9318l65l65l65l65LMMLL62L61L62L61l32l31n11n10N63k299l372J397N85N85Q83Q87P8
-10g1695Q2l141K586J315J315K42K46J167J170k173k168J662J661j676j673j677j673k46k42
8g4918r47r46K392K396J349J352J349J353m66m62J919J923m96m92m95m92n55n52n55n52M1
$$ plain form
-133 -76360 -73979 -71598 -70827 -70056 -68807 -70421 -71498 -67805 -64291 -65547 -68085 -70622 -73100 -70808 -69456 -72873 -74739 -76606
-115 -76606 -75969 -75332 -73264 -71196 -69065 -66930 -67183 -67433 -68759 -70082 -69977 -69869 -68118 -66363 -66997 -67626 -63788 -59947 -61355
-96 -61355 -62760 -64675 -66587 -67071 -67552 -66814 -66073 -65335 -64593 -68871 -73145 -72176 -71203 -71814 -72422 -71602 -70778 -69314 -67846 -69720
-76 -69720 -74452 -77608 -75991 -72947 -69899 -69784 -69664 -69549 -69430 -69046 -68658 -68275 -67887 -67816 -67742 -67671 -67596 -69076 -70551 -73461 -76368
-55 -76368 -78480 -80589 -80317 -80041 -76729 -73413 -72485 -71554 -71270 -70987 -72135 -73282 -74221 -75160 -70853 -66546 -67239 -67932 -68625 -69318
-35 -69318 -69683 -70048 -70413 -70778 -70775 -70771 -70767 -70764 -70402 -70041 -69679 -69318 -69650 -69981 -70492 -71002 -70439 -72738 -76110 -74713 -74128 -73543 -72660 -71773 -71695
-10 -71695 -71613 -74754 -72168 -70853 -69538 -69296 -69050 -67883 -66713 -68886 -71054 -69392 -67731 -69407 -71080 -72757 -74430 -74676 -74918
8 -74918 -75865 -76811 -74419 -72023 -70674 -69322 -67973 -66620 -67086 -67548 -65629 -63706 -64202 -64694 -65189 -65681 -66236 -66788 -67343 -67895 -67854
29f7854M5M1M5l58l58l57l58%%%%J222J222J222J223j282j282r24r24j759L965L87L88K176
53f3520l547l28l24j506j505j863j863N678m4M32M36J360m360j144j140J003J006J006J006
72f9217k456k451l291K437K284K288K646K645q90q91q91q90j308j308K031K031L76L76j054
91f7533j055R13R13k425k426k307k306P8P9L118L119k20k20l692l693l54l54R88R87K180l544
112g7754k742K981K265K266J401J401j461j461K996K996K996K995j416j415j416j416K466
129f4318K467k303k302o04o04k034k034K60K61K61K61N29N29k332k333k861k862J908J907
148g6204J640J639J640J643k116k117o85o86L786L785r83r80j908j908m77m77J491J490O0
167g1367O3N89N89N88N89r7r7r7r3n66n67n66n66n67n66k09k08k564L160o0n9K98K98K98K98
$$ plain form
29 -67854 -67809 -67768 -67723 -68081 -68439 -68796 -69154 -69154 -69154 -69154 -69154 -67932 -66710 -65488 -64265 -65547 -66829 -67753 -68677 -70436 -66471 -66084 -65696 -63520
53 -63520 -67067 -67395 -67719 -69225 -70730 -72593 -74456 -68778 -68822 -68390 -67954 -66594 -70954 -72098 -73238 -72235 -71229 -70223 -69217
72 -69217 -71673 -74124 -77415 -74978 -72694 -70406 -67760 -65115 -66005 -66896 -67787 -68677 -69985 -71293 -69262 -67231 -66855 -66479 -67533
91 -67533 -68588 -67675 -66762 -69187 -71613 -73920 -76226 -76148 -76069 -72951 -69832 -70052 -70272 -73964 -77657 -78011 -78365 -77377 -76390 -74210 -77754
112 -77754 -80496 -77515 -75250 -72984 -71583 -70182 -71643 -73104 -70108 -67112 -64116 -61121 -62537 -63952 -65368 -66784 -64318
129 -64318 -61851 -64154 -66456 -67060 -67664 -69698 -71732 -71472 -71211 -70950 -70689 -70160 -69631 -71963 -74296 -77157 -80019 -78111 -76204
148 -76204 -74564 -72925 -71285 -69642 -71758 -73875 -74560 -75246 -71460 -67675 -68658 -69638 -71546 -73454 -73931 -74408 -72917 -71427 -71367
167 -71367 -71304 -70715 -70126 -69538 -68949 -69046 -69143 -69240 -69333 -69899 -70466 -71032 -71598 -72165 -72731 -72940 -73148 -75712 -72552 -72612 -72671 -72373 -72075 -71777 -71479
192g1479j364j363j364j364O63O64O63O63M77M77M77M77N66N66R25m800j065j062k851k850
212h2944J472J472J471J472J334J338J337J338O82O82O82O81k690k686J75J75q98q98q98q98
232g7601j110j107J755J755O52O52O52O52N74N78q57q54j989j986k348L380L033L037J959
251f9173J964J274J278j587j583j886j881R76R80L361L364M99N03l547l543J222J226r54r50
270f8457M77M80j665j666J196J196J465J464j755j755J174m550j687M035J949J948k463k463
288g1077J077J077P19P19K180l543l25l24P1P1J144J144J829l894o755j032P27P30k493L234
308g4721N735J5j182j177j38j34j38j34m36m32m36m32J971J975J971J974n32n29n33n29o45
329f8487o41o44o41k225k220p94p90J326J331j536j531K131K135p30p26o0n6K98L02l667K061
$$ plain form
192 -71479 -72843 -74206 -75570 -76934 -76271 -75607 -74944 -74281 -73804 -73327 -72850 -72373 -71807 -71241 -70316 -75116 -76181 -77243 -80094 -82944
212 -82944 -81472 -80000 -78529 -77057 -75723 -74385 -73048 -71710 -71028 -70346 -69664 -68983 -71673 -74359 -74184 -74009 -74907 -75805 -76703 -77601
232 -77601 -78711 -79818 -78063 -76308 -75656 -75004 -74352 -73700 -73126 -72548 -73405 -74259 -76248 -78234 -80582 -77202 -74169 -71132 -69173
251 -69173 -67209 -65935 -64657 -66244 -67827 -69713 -71594 -70618 -69638 -66277 -62913 -62414 -61911 -65458 -69001 -67779 -66553 -67507 -68457
270 -68457 -67980 -67500 -69165 -70831 -69635 -68439 -66974 -65510 -67265 -69020 -67846 -72396 -74083 -70048 -68099 -66151 -68614 -71077
288 -71077 -70000 -68923 -68204 -67485 -65305 -68848 -69173 -69497 -69426 -69355 -68211 -67067 -65238 -69132 -75887 -76919 -76192 -75462 -77955 -74721
308 -74721 -68986 -68971 -70153 -71330 -71468 -71602 -71740 -71874 -72310 -72742 -73178 -73610 -71639 -69664 -67693 -65719 -66251 -66780 -67313 -67842 -68487
329 -68487 -69128 -69772 -70413 -72638 -74858 -75652 -76442 -75116 -73785 -75321 -76852 -74721 -72586 -73316 -74042 -74102 -74158 -73860 -73558 -77225 -75164
350g5164L607L610k46k42J185J189j588j583j57j52L42L47J773J778k907k902j297j293k854
369g6554J1m06N317K899k821J115J114j908L819L819j904j132j129m706J017K839K843L39
387f5428L39p38p34p34p34k645k642J770J770K064l655k225O38r39l797p60K105K876K881
406g0588J93J98k802k798J967J971J19J23J19J23l182l178l20l17J229J234j632j628J632
425g7537J635J632J636k839k836K3K6L103L104K42K46j129j129j129j125O15O15k247k243
444g9337j949j949j948j945O82O81O82O86j464j465k72N455N377l47L69L73k910k910m9m4
464h2284L61L65l037K691N011K154o52o49J360J364J360J364n675n671m125J603K090K094
482h0276K448K452K507K512l54l51k738k735L938L942k202k198O59O64J270J271J092J091
$$ plain form
350 -75164 -71557 -67947 -68193 -68435 -67250 -66061 -67649 -69232 -69389 -69541 -69199 -68852 -67079 -65301 -68208 -71110 -72407 -73700 -76554
369 -76554 -76543 -76949 -71632 -68733 -71554 -70439 -69325 -71233 -67414 -63595 -65499 -66631 -67760 -72466 -71449 -68610 -65767 -65428
387 -65428 -65089 -65827 -66561 -67295 -68029 -70674 -73316 -71546 -69776 -67712 -71367 -73592 -72954 -73893 -77690 -78450 -76345 -73469 -70588
406 -70588 -70395 -70197 -72999 -75797 -73830 -71859 -71740 -71617 -71498 -71375 -74557 -77735 -78055 -78372 -77143 -75909 -77541 -79169 -77537
425 -77537 -75902 -74270 -72634 -75473 -78309 -78286 -78260 -75157 -72053 -71811 -71565 -72694 -73823 -74952 -76077 -75462 -74847 -77094 -79337
444 -79337 -81286 -83235 -85183 -87128 -86446 -85765 -85083 -84397 -85861 -87326 -87598 -82143 -76766 -77113 -76744 -76371 -79281 -82191 -82240 -82284
464 -82284 -81923 -81558 -84595 -81904 -76893 -74739 -75391 -76040 -74680 -73316 -71956 -70592 -76267 -81938 -86063 -84460 -82370 -80276
482 -80276 -77828 -75376 -72869 -70357 -70711 -71062 -73800 -76535 -72597 -68655 -70857 -73055 -72396 -71732 -70462 -69191 -68099 -67008
500f7008j114l976l975j114k35k35n6n6J256J256J255J256Q39Q38Q38Q39j487j487l275m14
520g6055P94k068j889R73L893L894j472L298J38J37k246k247l678q16M36M36M9M8M8M9K87
541g5991K87M877M877O23k240k418M44J158j702r4r3M44k419q08q09R80R80j703j702j144
561g6453J721J897r62Q84L748k813k810M96M99M96M99M36M40L297L301O82O86j882j878k597
581g0313K176J099j758q39q34j017j014Q31Q35K440m17O33O34K064p97j215j215j393j394
$$ plain form
500 -67008 -68122 -72098 -76073 -77187 -77422 -77657 -77713 -77769 -76513 -75257 -74002 -72746 -71907 -71069 -70231 -69392 -70879 -72366 -75641 -76055
520 -76055 -75261 -77329 -79218 -78245 -74352 -70458 -71930 -68632 -68494 -68357 -70603 -72850 -76528 -77344 -76908 -76472 -76423 -76375 -76327 -76278 -75991
541 -75991 -75704 -70827 -65950 -65327 -67567 -69985 -69541 -68383 -70085 -70179 -70272 -69828 -72247 -73055 -73864 -72884 -71904 -73607 -75309 -76453
561 -76453 -74732 -72835 -73797 -72913 -69165 -71978 -74788 -74292 -73793 -73297 -72798 -72362 -71922 -68625 -65324 -64642 -63956 -65838 -67716 -70313
581 -70313 -68137 -67038 -68796 -69635 -70469 -71486 -72500 -71669 -70834 -68394 -68811 -68178 -67544 -65480 -66277 -67492 -68707 -70100 -71494
$$ [...]
##END=	
